##TITLE=Analysis number 330024
Compound Code cc 55546
Book Reference 540/34
Project Code adrs
Chemist Name mikem
##JCAMPDX= 6.0         $$ Bruker NMR JCAMP-DX V2.0
##DATA TYPE= NMR SPECTRUM
##DATA CLASS= NTUPLES
##ORIGIN= Bruker BioSpin GmbH
##OWNER= nmr
$$ XWIN-NMR		Version 3.5
$$ Mon Oct 22 08:47:38 2007 GMT Daylight Time (UT+1h)  MAYBRIDGE\nmr@NMR_250MHZ
##.OBSERVE FREQUENCY= 250.131544655141
##.OBSERVE NUCLEUS= ^1H
##.ACQUISITION MODE= SIMULTANEOUS (DQD)
##.ACQUISITION SCHEME= undefined
##.AVERAGES= 16
##.DIGITISER RES= 18
##SPECTROMETER/DATA SYSTEM= dpx250
##.PULSE SEQUENCE= zg30
##.SOLVENT NAME= CDCl3
##.SHIFT REFERENCE= (INTERNAL, CDCl3, 0, 16.522)
##AUDIT TRAIL= $$ (NUMBER, WHEN, WHO, WHERE, WHAT)
$$ ##TITLE= Audit trail, XWIN-NMR		Version 3.5
$$ ##JCAMPDX= 5.01
$$ ##ORIGIN= Bruker BioSpin GmbH
$$ ##OWNER= nmr
$$ C:\u/data/dgb/nmr/ADRS/990/pdata/1/auditp.txt
$$ ##AUDIT TRAIL=  $$ (NUMBER, WHEN, WHO, WHERE, WHAT)
(   1,<2007-10-22 08:46:43.15 +100>,<MAYBRIDGE\nmr>,<NMR_250MHZ>,
      <created by zg, POWCHK disabled, PULCHK disabled
       configuration hash MD5:
       76 6E 9A 78 1E 09 19 81 EC 84 63 8F B0 6A 59 2D
       data hash MD5: 64K
       46 21 5C 62 54 42 2B 7A C4 68 38 B4 F0 CD 69 3E>)
(   2,<2007-10-22 08:47:18.18 +100>,<MAYBRIDGE\nmr>,<NMR_250MHZ>,
      <Start of raw data processing
       ef LB = 0.3 FT_mod = 6 PKNL = 1 SI = 32K 
       data hash MD5: 32K
       A8 7B 90 B3 9A AD 71 64 05 98 88 2A 10 27 5E 71>)
(   3,<2007-10-22 08:47:24.49 +100>,<MAYBRIDGE\nmr>,<NMR_250MHZ>,
      <apk 
       data hash MD5: 32K
       8F 10 84 2E 9A 50 A6 39 72 20 57 CD 40 B4 F5 4F>)
(   4,<2007-10-22 08:47:26.03 +100>,<MAYBRIDGE\nmr>,<NMR_250MHZ>,
      <abs ABSG = 5 
       data hash MD5: 32K
       33 80 33 BC 66 1C 60 39 38 43 95 60 B7 60 BB 08>)
$$ ##END=
$$ 
$$ hash MD5
$$ 0B 9F 41 E5 9B 79 D5 DF BF B3 97 8C 40 B5 90 E9
##$RELAX= 
##$RELAX= 
##$RELAX= 
##$RELAX= 
##$RELAX= 
##$RELAX= 
##$RELAX= 
$$ Bruker specific parameters
$$ --------------------------
##$DU= <C:\u>
##$EXPNO= 990
##$NAME= <ADRS>
##$PROCNO= 1
##$TYPE= <nmr>
##$USER= <dgb>
##$AMP= (0..31)
100 100 100 100 100 100 100 100 100 100 100 100 100 100 100 100 100 100 
100 100 100 100 100 100 100 100 100 100 100 100 100 100 
##$AQSEQ= 0
##$AQ_mod= 3
##$AUNM= <au_zg>
##$AUTOPOS= <1 >
##$BF1= 250.13
##$BF2= 250.13
##$BF3= 250.13
##$BF4= 250.13
##$BF5= 500.13
##$BF6= 500.13
##$BF7= 500.13
##$BF8= 500.13
##$BYTORDA= 1
##$CFDGTYP= 0
##$CFRGTYP= 5
##$CHEMSTR= <none>
##$CNST= (0..31)
1 1 145 1 1 1 1 1 1 1 1 1 1 1 1 1 1 1 1 1 1 1 1 1 1 1 1 1 1 1 1 1 
##$CPDPRG= <>
##$CPDPRG1= <>
##$CPDPRG2= <>
##$CPDPRG3= <>
##$CPDPRG4= <mlev>
##$CPDPRG5= <mlev>
##$CPDPRG6= <mlev>
##$CPDPRG7= <mlev>
##$CPDPRG8= <mlev>
##$CPDPRGB= <>
##$CPDPRGT= <>
##$D= (0..31)
0 1 0 0 0 0 0 0 0 0.06 0 0 0 0 0 0 0.0002 0 0 0 0 0 0 0 0 0 0 0 0 0 0 
0 
##$DATE= 1193039199
##$DBL= (0..7)
120 120 120 120 120 120 120 120 
##$DBP= (0..7)
150 150 150 150 150 150 150 150 
##$DBP07= 0
##$DBPNAM0= <>
##$DBPNAM1= <>
$$ [...]
##$SUBNAM7= <"">
##$SUBNAM8= <"">
##$SUBNAM9= <"">
##$SW= 20.6930455092707
##$SWIBOX= (0..15)
0 0 3 0 0 0 0 0 0 0 0 0 0 0 0 0 
##$SW_h= 5175.983436853
##$TD= 65536
##$TD0= 1
##$TE= 295.16
##$TE2= 300
##$TE3= 300
##$TEG= 300
##$TL= (0..7)
0 120 120 120 120 120 120 120 
##$TP= (0..7)
150 150 150 150 150 150 150 150 
##$TP07= 0
##$TPNAME0= <>
##$TPNAME1= <>
##$TPNAME2= <>
##$TPNAME3= <>
##$TPNAME4= <>
##$TPNAME5= <>
##$TPNAME6= <>
##$TPNAME7= <>
##$TPOAL= (0..7)
0.5 0.5 0.5 0.5 0.5 0.5 0.5 0.5 
##$TPOFFS= (0..7)
0 0 0 0 0 0 0 0 
##$TUNHIN= 0
##$TUNHOUT= 0
##$TUNXOUT= 0
##$USERA1= <user>
##$USERA2= <user>
##$USERA3= <user>
##$USERA4= <user>
##$USERA5= <user>
##$V9= 5
##$VALIST= <valist>
##$VCLIST= <CCCCCCCCCCCCCCC>
##$VD= 0
##$VDLIST= <DDDDDDDDDDDDDDD>
##$VPLIST= <PPPPPPPPPPPPPPP>
##$VTLIST= <TTTTTTTTTTTTTTT>
##$WBST= 1024
##$WBSW= 4
##$XGAIN= (0..3)
0 0 0 0 
##$XL= 0
##$YL= 0
##$YMAX_a= 475880
##$YMIN_a= -603854
##$ZGOPTNS= <>
##$ZL1= 120
##$ZL2= 120
##$ZL3= 120
##$ZL4= 120
##$ABSF1= 16.522
##$ABSF2= -4.171173
##$ABSG= 5
##$ABSL= 3
##$ALPHA= 0
##$AQORDER= 0
##$ASSFAC= 0
##$ASSFACI= 0
##$ASSFACX= 0
##$ASSWID= 0
##$AUNMP= <proc_1d>
##$AZFE= 0.1
##$AZFW= 0.1
##$BCFW= 0
##$BC_mod= 0
##$BYTORDP= 0
##$COROFFS= 0
##$CY= 12.5
##$DATMOD= 1
##$DC= 0
##$DFILT= <>
##$DTYPP= 0
##$F1P= 14.0000005364418
##$F2P= -0.99999901652339
##$FCOR= 0.5
##$FTSIZE= 32768
##$FT_mod= 6
##$GAMMA= 0
##$GB= 0
##$INTBC= 1
##$INTSCL= 1
##$ISEN= 128
##$LB= 0.3
##$LEV0= 0
##$LPBIN= 0
##$MAXI= 10000
##$MC2= 0
##$MEAN= 0
##$ME_mod= 0
##$MI= 0
##$NCOEF= 0
##$NC_proc= -2
##$NLEV= 6
##$NOISF1= 0
##$NOISF2= 0
##$NSP= 0
##$NTH_PI= 0
##$NZP= 0
##$OFFSET= 16.522
##$PC= 1
##$PHC0= 158.2009
##$PHC1= 5.724758
##$PH_mod= 1
##$PKNL= yes
##$PPARMOD= 0
##$PSCAL= 4
##$PSIGN= 0
##$REVERSE= no
##$SF= 250.13
##$SI= 32768
##$SIGF1= 0
##$SIGF2= 0
##$SINO= 400
##$SIOLD= 32768
##$SREGLST= <1H.CDCl3>
##$SSB= 0
##$STSI= 32768
##$STSR= 0
##$SW_p= 5175.98343685301
##$SYMM= 0
##$S_DEV= 0
##$TDeff= 65536
##$TDoff= 0
##$TI= <Analysis number 999999
Compound Code 99
Book Reference 9
Project Code 9>
##$TILT= no
##$TM1= 0
##$TM2= 0
##$TOPLEV= 0
##$USERP1= <user>
##$USERP2= <user>
##$USERP3= <user>
##$USERP4= <user>
##$USERP5= <user>
##$WDW= 1
##$XDIM= 32768
##$YMAX_p= 332490803
##$YMIN_p= -31316
$$ End of Bruker specific parameters
$$ ---------------------------------
##NTUPLES= NMR SPECTRUM
##VAR_NAME=  FREQUENCY,     SPECTRUM/REAL,   SPECTRUM/IMAG
##SYMBOL=    X,             R,               I
##VAR_TYPE=  INDEPENDENT,   DEPENDENT,       DEPENDENT
##VAR_FORM=  AFFN,          ASDF,            ASDF
##VAR_DIM=   32768,         32768,           32768
##UNITS=     HZ,            ARBITRARY UNITS, ARBITRARY UNITS
##FACTOR=    0.157963299565203, 1,           1
##FIRST=     4132.6476996994, 0,             0
##LAST=      -1043.33573715361, 0,           0
##MIN=       -1043.33573715361, -31316,      0
##MAX=       4132.6476996994, 332490803,     0
$$ Real data points
##PAGE= N=1
##DATA TABLE= (X++(R..R)), XYDATA
$$ [...]
$$ plain form
16322 110114 101334 105540 104327 101317 94348 88643 85485 72524 62515 57955 59933 52620 48741 54981
16308 54981 56918 59151 55915 50897 46897 40251 37404 36601 37970 30440 28775 28609 33831 39090 40453
16293 40453 38055 33396 21585 23009 21389 15991 16929 16847 19985 17144 16438 12225 11756 17210 20159
16278 20159 22880 24710 22817 20509 18052 13975 7571 5289 350 5321 8399 11832 12612 11858 15114
16263 15114 11953 12736 22037 18584 19173 20331 21886 26632 32598 31860 29586 30733 32055 27654 18571
16248 18571 13281 8281 14437 18686 21146 17431 21418 23163 19972 16724 16719 15636 9514 1615 2675
16233 2675 3080 5484 8253 4984 1951 9914 809 -15370 -19683 -17096 -16155 -5895 -5402 -248 -7341
16218 -7341 -6306 -1075 1707 5765 8314 4934 2886 6806 4223 6061 10843 6388 8874 15952 10764
$$ packed form
16322A10114q780M206j213l010o969n705l158j2961j0009m560J978p313l879O240
16308E4981J937K233l236n018m000o646k847q03J369p530j665j66N222N259J363
16293D0453k398m659j1811J424j620n398R38q2L138k841p06m213m69N454K949
16278B0159K721J830j893k308k457m077o404k282m939M971L078L433P80p54L256
16263A5114l161P83R301l453N89J158J555M746N966p38k274J147J322m401r083
16248A8571n290n000O156M249K460l715L987J745l191l248nj083o122p899J060
16233B675M05K404K769l269l033P963r105j6179m313K587R41J0260M93N154p093
16218g341J035N231K782M058K549l380k048L920k583J838M782m455K486P078n188
$$ plain form
16203 10764 7049 9954 11407 7888 13152 5365 -9160 -14405 -9874 -3287 -1459 -2661 -13366 -19265
16189 -19265 -21181 -19279 -10170 -2774 -2562 -7497 -11527 -13093 -15383 -15380 -15340 -18863 -20875 -25554 -20795 -22593
16173 -22593 -24306 -24547 -23503 -20717 -10925 -808 -1231 1333 2898 -701 -8470 -10320 -14929 -11526 -7057
16158 -7057 -3798 -1733 -2949 1351 -371 -9456 -12145 -6370 -4039 -4575 -7825 -4887 -2187 -9611 -10911
16143 -10911 -9022 -9580 -9381 -4356 -6694 -8361 -11182 -15132 -19269 -15159 -4235 -5271 -8430 -13132 -15703
16128 -15703 -8104 -3678 -9964 -5365 256 -1660 -10407 -12664 -12988 -17955 -14013 -15356 -14977 -9271 -8051
16113 -8051 -8517 -8523 -12972 -7222 -9618 -15728 -24812 -25022 -17196 -17706 -18221 -12651 -11519 -16276 -17920 -13365
16097 -13365 -16632 -15077 -16319 -19284 -17183 -16992 -19709 -13518 -4549 -3572 -7515 -6548 -6422 -6115 -12523 -8361
$$ packed form
16203A0764l715K905J453l519N264p787j4525n245M531O587J828j202j0705n899
16189a9265j916J902R109P396K12m935m030j566k290LM0l523k012m679M759j798
16173b2593j713k41J044K786R792J0117m23K564J565l599p769j850m609L403M469
16158g057L259K065j216M300j722r085k689N775K331n36l250K938K700p424j300
16143a0911J889n58J99N025k338j667k821l950m137M110J0924j036l159m702k571
16128a5703P599M426o286M599N621j916q747k257l24m967L942j343L79N706J220
16113h051m66om449N750k396o110r084k10P826n10n15N570J132m757j644M555
16097a3365l267J555j242k965K101J91k717O191Q969R77l943R67J26L07o408M162
$$ plain form
16081 -8361 1141 2804 815 3253 3398 3760 -1538 -1415 -1054 -10404 -13002 -15131 -17596 -13758 -6396 576
16065 576 1425 -3052 1679 6627 6085 6466 13050 -619 -12939 -21853 -16530 -12559 -4384 2836 -4297
16050 -4297 -8880 -9958 -8173 -1876 -710 -6340 -6598 -6010 -8203 -11231 -12869 -12637 -13831 -15430 -11092
16035 -11092 -11602 -16171 -8967 -910 485 1024 -2602 -6404 -4697 -2310 -12141 -19086 -11646 -5433 -3028
16020 -3028 -3770 -1139 1553 -820 -4110 -8955 -10788 -13718 -18520 -16777 -13125 -12605 -12229 -6815 -4504
16005 -4504 -3048 -4565 -5725 -6130 -12348 -8316 -1230 -330 -3341 1112 2045 -5613 -7592 -10154 -7059
15990 -7059 -2892 3026 -5708 -9950 -11978 -17511 -12829 -6933 -8109 -10443 -8684 -5902 -3854 -4402 -10792
15975 -10792 -10735 -6604 -8700 -5613 -8015 -8181 -8166 -3863 -2710 -7607 -12846 -877 -5136 -11025 -10504 -3732
$$ packed form
16081h361R502J663j989K438J45L62n298J23L61r350k598k129k465L838P362O972
16065E76Q49m477M731M948n42L81O584j3669j2320q914N323L971Q175P220p133
16050d297m583j078J785O297J166n630k58N88k193l028j638K32j194j599M338
16035a1092n10m569P204Q057J395N39l626l802J707K387r831o945P440O213K405
16020c028p42K631K692k373l290m845j833k930m802J743L652N20L76N414K311
16005d504J456j517j160m05o218M032P086R00l011M453R33p658j979k562L095
15990g059M167N918q734m242k028n533M682N896j176k334J759K782K048n48o390
15975a0792N7M131k096L087k402j66J5M303J153m897n239J1969m259n889N21O772
$$ plain form
15959 -3732 -6910 -9987 -5315 -4955 -7344 -7405 -8410 -9904 -9680 4005 3777 -1824 -849 816 -7775 -8567
15943 -8567 -6053 -5521 -9752 -13638 -9009 -7201 -11810 -17042 -11230 305 7714 4164 1418 -779 -7612
15928 -7612 -9761 -3892 1126 -4809 -9756 -10782 -3123 -3064 -7611 -12559 -13148 -10083 -7073 -3373 3728
15913 3728 4643 -1081 -7516 -12537 -11338 -9066 -8868 -6572 -8812 -7242 -2349 -2238 -5227 -7361 -1010
15898 -1010 -2408 -1488 -1232 106 90 -1918 -407 -2018 -8372 -8717 -1330 2080 -2451 -9149 -13341 -16360
15882 -16360 -11084 -8605 -12093 -16886 -15042 -19519 -21017 -8701 -5633 -7769 -12676 -15402 -14073 -4159
15868 -4159 2936 7551 4115 2467 52 -2779 -4140 -3200 -5104 -7510 -10214 -6334 -4106 -1738 3470
15853 3470 -983 -1239 6365 13890 19286 22371 24478 26947 35724 49736 66162 82114 103174 129351
$$ packed form
15959c732l178l077M672L60k389o1j005j494K24J3685k28n601R75J665q591p92
15943h567K514N32m231l886M629J808m609n232N812J1535P409l550k746k197o833
15928g612k149N869N018n935m947j026P659N9m547m948n89L065L010L700P101
15913C728R15n724o435n021J199K272J98K296k240J570M893J11k989k134O351
15898a010j398R20K56J338j6k008J511j611o354l45P387L410m531o698m192l019
15882a6360N276K479l488m793J844m477j498J2316L068k136m907k726J329R914
15868d159P095M615l436j648k415k831j361R40j904k406k704L880K228K368N208
15853C470m453k56P604P525N396L085K107K469Q777J4012J6426J5952K1060K6177
$$ plain form
15839 129351 161670 192529 213833 229786 232414 217718 194243 173578 166303 162628 171265 191686
15827 191686 208868 226948 233150 225917 208335 183912 157946 128098 89514 68560 59257 44450
15815 44450 39730 38367 31369 14440 7060 -1095 -1336 -4124 -2441 650 3859 2525 3395 -3139 -6069
15800 -6069 -7755 -8345 -9047 -9419 -9837 -15429 -16556 -10188 -11694 -7201 -1696 -6207 -13119 -13306 -2263 2455
15784 2455 12207 10127 3236 386 -2280 -5484 -3864 -5824 -6747 -2627 -9099 -8336 -1910 -162 -1045
15769 -1045 -4574 -8931 -10556 -2822 -4387 -4656 -3958 -1548 -475 -6026 -6895 -6222 -9182 -12088 -14617 -13051
15753 -13051 -9451 -4969 -12245 -12629 -12563 -15168 -13214 -9022 -12879 -12107 -15341 -9559 -7845 -11517 -13509
15738 -13509 -8906 -3579 -4898 -5593 2622 6964 3359 -1989 -6766 -12834 -16023 -10997 -4833 -3726 -2243
$$ packed form
15839A29351L2319L0859K1304J5953K628j4696k3475k0665p275l675Q637K0421
15827A91686J7182J8080O202p233j7582k4423k5966k9848l8584k0954r303j4807
15815D4450m720j363o998j6929p380q155k41k788J683L091L209j334Q70o534k930
15800f069j686n90p02l72m18n592j127O368j506M493N505m511o912j87J1043M718
15784B455R752k080o891k850k666l204J620j960r23M120o472P63O426J748q83
15769a045l529m357j625P734j565k69O98K410J073n551q69O73k960k906k529J566
15753a3051L600M482p276l84O6k605J954M192l857P72l234N782J714l672j992
15738a3509M603N327j319o95Q215M342l605n348m777o068l189N026O164J107J483
$$ plain form
15723 -2243 -1500 -203 -1511 -970 -1977 -4903 -2968 -8791 -7080 -5480 -6969 -10468 -10429 -10981 -5980 4190
15707 4190 10741 11210 6702 71 -1900 416 4754 7993 3381 -3049 -10992 -5782 -134 -4230 -7683
15692 -7683 -4968 -5886 -855 -895 -2041 365 6545 8620 6446 3181 1000 1903 3675 86 -4675 -5894
15676 -5894 -4641 -2129 1861 7602 4626 -1151 -4990 -12738 -8393 -6288 -13971 -20602 -18171 -15797 -4230
15661 -4230 -4651 -5310 -5912 -8303 -11559 -11795 -9173 -7996 -2478 -1988 -9583 -12895 -2762 -3297 -3552 -4492
15645 -4492 -3709 -271 1353 -793 -9689 -13107 -11822 -10879 -11743 -12154 -12623 -11352 -8198 -4155 -5203 -9971
15629 -9971 -15680 -15594 -13350 -9569 -5268 -8515 -7834 -1330 4429 -1123 -7661 -11509 -9830 -9186 -10993 -11615
15613 -11615 -15301 -16994 -9917 -7460 -11673 -17540 -13009 -9045 -7592 -7593 -16033 -22897 -28593 -23531 -12448
$$ packed form
15723b243P43J297j308N41j007k926J935n823J711J600j489l499L9n52N001J0170
15707D190O551M69m508o631j971K316M338L239m612o430p943N210N648m096l453
15692g683K715r18N031m0j146K406O180K075k174l265k181R03J772l589m761j219
15676e894J253K512L990N741k976n777l839p748M345K105p683o631K431K374J1567
15661d230m21o59o02k391l256k36K622J177N518M90p595l312J0133n35k55r40
15645d492P83L438J624k146q896l418J285R43q64m11m69J271L154M043j048m768
15629i971n709Q6K244L781M301l247O81O504N759n552o538l848J679O44j807o22
15613a1615l686j693P077K457m213n867M531L964J453jq440o864n696N062J1083
$$ plain form
15598 -12448 -7382 -7227 -16774 -17423 -18863 -17408 -16010 -15836 -16104 -13212 -14322 -14617 -10386 -6191 -6754 -8461
15582 -8461 -7439 -5571 -5335 -4305 -7458 -5070 -1956 -2421 2127 -4836 -3831 -4541 -7571 -14726 -20120
15567 -20120 -16587 -11893 -14319 -11215 -16506 -17283 -14183 -12729 -16164 -23815 -21390 -11430 -8993 -1892 -3598
15552 -3598 -7525 -6599 -12075 -12925 -12948 -18025 -13080 -5745 -6695 -8935 -7606 -9893 -16368 -16106 -11954 -10460
15536 -10460 -4975 -6122 -9378 -10468 -5381 -7375 -8483 -5481 -693 -3409 -13420 -13272 -7135 -2544
15522 -2544 -2639 342 869 -2596 -5417 -11497 -14296 -10404 -12708 -14930 -15574 -10912 -10210 -7379 -4414 -9258
15506 -9258 -8479 -2177 -3677 -5041 -3806 -3462 -3394 -7373 -11682 -11350 -8206 -4655 -4709 -4220 -410 -4629 -3829
15489 -3829 -5822 -4477 -5654 -6306 1477 -4796 -4120 900 6056 8411 12330 10646 -1700 -6141 -10486
$$ packed form
15598a2448N066J55r547o49j440J455J398J74k68K892j110k95M231M195n63j707
15582h461J022J868K36J030l153K388L114m65M548o963J005p10l030p155n394
15567b0120L533M694k426L104n291p77L100J454l435p651K425R960K437P101j706
15552c598l927R26n476q50k3n077M945P335r50k240J329k287o475K62M152J494
15536a0460N485j147l256j090N087j994j108L002M788k716j0011J48O137M591
15522b544r5K981N27l465k821o080k799L892k304k222o44M662P02K831K965m844
15506i258P79O302j500j364J235L44O8l979m309L32L144L551n4M89L810m219Q00
15489c829j993J345j177o52P783o273O76N020N156K355L919j684j2346m441m345
$$ plain form
15474 -10486 -16193 -14541 -14253 -11726 -10610 -315 3665 -4124 -10088 -10019 -12284 -12214 -11049 -18633 -24363
15459 -24363 -20496 -17217 -7985 -10805 -9781 -2053 -713 -3753 -570 -4525 -10626 -12155 -3298 487
15445 487 -1295 -4249 -2291 -325 2123 -1544 -6581 -12279 -11637 -4392 -2808 -3926 -5281 -1494 -2734
15430 -2734 -2511 -70 -4911 -5138 -1141 4529 6551 3996 618 -6182 -12987 -19138 -19523 -16554 -9542
15415 -9542 -4744 -3982 -9487 -14160 -11689 -7567 370 3206 -2423 -3510 -3109 -3195 7510 7755 -108 341
15399 341 4323 5741 5101 7769 2030 -2210 -3162 -2143 4400 6688 -1110 -3221 -3317 -565 480 627
15383 627 326 -10275 -4727 -1453 -3532 -11044 -9946 -12553 -5583 1833 3428 -1711 -1187 3256 9082
15368 9082 1662 -8694 -10485 -11760 -6740 -4205 -242 1990 -1706 -4764 -3745 -1036 -1270 -2896 -5648
$$ packed form
15474a0486n707J652K88K527J116J0295L980p789n964O9k265P0J165p584n730
15459b4363L867L279R232k820J024P728J340l040L183l955o101j529Q857L785
15445D87j782k954J958J966K448l667n037n698O42P245J584j118j355L787j240
15430b734K23K441m841k27L997N670K022k555l378o800o805o151l85K969P012
15415i542M798P62n505m673K471M122P937K836n629j087M01q6J0705K45p863M49
15399C41L982J418o40K668n739m240r52J019O543K288p798k111r6K752J045J47
15383F27l01j0601N548L274k079p512J098k607O970P416J595n139N24M443N826
15368I082p420j0356j791j275N020K535L963K232l696l058J019K709k34j626k752
$$ plain form
15353 -5648 3381 4343 6485 5473 -1315 -4987 -4128 4195 8030 8731 5151 4168 8618 10717 932 -1274
15337 -1274 3073 2315 -3012 -4504 -9709 -14157 -11108 -5287 200 2123 3909 3826 -2684 -11950 -12367 -5346
15321 -5346 -1166 -5088 -6445 -8781 -10416 -15593 -9614 -2694 2376 6615 -468 -4297 -1657 -1967 -11331
15306 -11331 -17356 -11970 -7586 -9991 -3697 -625 2706 1425 1145 -3371 -6543 -4559 -892 4231 8766
15291 8766 12030 10902 8687 2159 -5582 -17259 -12604 -13282 -9225 -2197 -6424 -11410 -10581 -16696 -12960
15276 -12960 -4573 -7288 -7890 -5465 -4190 -2678 -3598 -8857 -8528 -325 -680 -672 -4933 -3799 -3535 -8622
15260 -8622 -6379 -5671 -6446 -6753 -4634 -3725 -4995 -6360 -2369 701 -3414 -8324 -1855 3960 2376 -543
15244 -543 -5791 27 3115 -3486 -4389 -4212 -1056 3531 -676 -12793 -15037 -9401 -2553 -1752 866
$$ packed form
15353e648R029R62K142j012o788l672Q59Q323L835P01l580r83M450K099r785k206
15337a274M347p58n327j492n205m448L049N821N487J923J786q3o510r266m17P021
15321e346M180l922j357k336j635n177N979O920N070M239p083l829K640l10r364
15306a1331o025N386M384k405O294L072L331j281k80m516l172J984L667N123M535
15291H766L264j128k215o528p741j1677M655o78M057P028m227m986Q29o115L736
15276a2960Q387k715o02K425J275J512r20n259L29Q203l55Qm261J134K64n087
15260h622K243P08p75l07K119R09j270j365L991L070m115m910O469N815j584k919
15244e43n248N818L088o601r03J77L156M587m207j2117k244N636O848Q01K618
$$ plain form
15229 866 8505 -1360 -9744 -11610 -6520 -3548 -1078 847 5979 -1963 -10394 -6291 -1562 1017 2877
15214 2877 4941 3549 -2103 -2959 9427 6608 -28 -2840 -3873 -5042 -2143 710 552 -3397 -4300
15199 -4300 -4053 -3742 -6091 -2073 129 3024 3583 -2620 -3049 2228 6443 5237 6472 9428 8979 5518
15183 5518 4134 3067 3942 6111 10846 6261 -604 -10484 -11063 -11407 -14381 -11381 -7841 -5467 -7134
15168 -7134 -8650 -12761 -12129 -9503 -9861 -13413 -18520 -14995 -12133 -6628 -3864 -1413 -4225 -3346 -6415
15153 -6415 -11907 -15042 -9465 3241 4137 -7477 -13891 -9685 -12667 -10976 -6757 -6541 -8300 -3397 -1873
15138 -1873 6455 13362 10928 6539 1367 -1072 -6578 -1635 687 -4563 -4270 -3377 -4176 -11163 -11219 -7287
15122 -7287 -5371 169 -765 -1064 4315 206 -4506 -8270 -4951 -5710 -10743 -11105 -10233 508 4806 5369
$$ packed form
15229H66P639r865q384j866N090K972K470J925N132p942q431M103M729K579J860
15214B877K064j392n652q56J2386k819o636k812j033j169K899K853j58l949r03
15199d300K47L11k349M018K202K895N59o203m29N277M215j206J235K956m49l461
15183E518j384j067Q75K169M735m585o865r880n79l44k974L000L540K374j667
15168g134j516m111O32K626l58l552n107L525K862N505K764K451k812Q79l069
15153f415n492l135N577J2706Q96j1614o414M206k982J691M219K16j759M903J524
15138a873Q328O907k434m389n172k439n506M943K322n250K93Q93p99o987n6L932
15122g287J916N540r34k99N379m109m712l764L319p59n033l62Q72J0741M298N63
$$ plain form
15106 5369 2670 -1337 -4391 -2296 -6173 -7924 -5256 -1102 -367 -4406 -7682 -5063 3193 6204 3456
15091 3456 -1407 -3280 -1532 -2257 -5869 -3934 2517 326 -173 -1345 -2071 -676 -1509 -1634 -10622 -10580
15075 -10580 -3842 -789 -2421 -12075 -13458 -13243 -11899 -7767 -8662 -6232 4279 3191 -5046 -93 -1748
15060 -1748 -3483 192 2984 3626 -1186 -2392 1610 501 -947 -1807 -5518 -7472 -6405 -7548 -7239
15045 -7239 -4731 -6712 -4314 -5811 -13018 -19598 -21604 -14336 -4798 35 300 -1672 -6119 -4391 -4069
15030 -4069 -5511 -10875 -15212 -9936 -13179 -12654 -6247 -4728 -3785 3649 4651 4875 -1085 -10042 -10957 -9244
15014 -9244 1036 4316 3837 2253 6585 10082 2678 -3674 -4929 -4573 -4752 1490 -225 -3625 -5439
14999 -5439 -7006 -4617 -4542 -4887 -176 642 1913 -2481 -8062 -11082 -9544 -8270 -4942 -2289 -7658 -10438
$$ packed form
15106E369k699m007l054K095l877j751K668M154P35m039l276K619Q256L011k748
15091C456m863j873J748p25l612J935O451k191m99j172p26J395q33j25q988M2
15075a0580O738L053j632r654j383K15J344M132q95K430J0511j088q237M953j655
15060a748j735L675K792O42m812j206M002j109j448q60l711j954J067j143L09
15045g239K508j981K398j497p207o580k006P268R538M833K65j972m447J728L22
15030d069j442n364m337N276l243N25O407J519R43P434J002K24n960q957r15J713
15014i244J0280L280m79j584M332L497p404o352j255L56j79O242j715l400j814
14999e439j567K389P5l45M711Q18J271m394n581l020J538J274L328K653n369k780
$$ plain form
14983 -10438 -6366 -1847 -2273 -1385 -4415 -7557 -615 2229 -1659 -3213 -3137 -4196 -7568 -5002 -4401 -3233
14967 -3233 1141 3670 6132 3328 -2646 -6273 1716 2809 -4811 -8120 -16322 -16682 -12473 -2703 -1603
14952 -1603 -6503 3245 10084 10883 14325 7478 -480 -1594 -2564 355 -753 -3864 -7147 -6169 -4487
14937 -4487 -4426 883 1840 -1166 2507 3654 1469 -1510 -2885 5514 3955 -6282 -12036 -13517 -8310
14922 -8310 -7859 -9796 -5239 -6911 -4713 -2489 -4541 -642 -536 -5198 -3641 158 613 4867 9386
14907 9386 5943 2601 4689 6189 6214 8247 5932 1873 1504 -2058 -9474 -3469 833 -437 -2644
14892 -2644 -2449 -3699 -6758 -1977 3853 831 2393 2243 3332 -2469 -5902 1560 6070 9082 9433
14877 9433 3878 3360 1823 -5502 -6295 -6017 -9500 -7909 -2989 -18 -1009 -5784 -1562 -4669 -13323 -14689
$$ packed form
14983a0438M072M519m26Q88l030l142O942K844l888j554P6j059l372K566O01J168
14967c233M374K529K462k804n974l627P989J093p620l309q202l60M209R770J100
14952a603m900R748O839P99L442o847p958j114r70K919j108l111l283R78J682
14937d487O1N309R57l006L673J147k185k979j375Q399j559j0237n754j481N207
14922h310M51j937M557j672K198K224k052L899J06m662J557L799M55M254M519
14907I386l443l342K088J500K5K033k315m059l69l562p416O005M302j270k207
14892b644J95j250l059M781N830l022J562j50J089n801l433P462M510L012L51
14877I433n555n18j537p325p93K78l483J591M920K971r91m775M222l107q654j366
$$ plain form
14861 -14689 -11808 1065 3348 -2431 -9407 -12441 -7801 -4757 -4177 -2706 -1223 -5251 -5323 -7378 -11199
14846 -11199 -13147 -8148 -3232 -4313 -12488 -15949 -14563 -9822 -7637 -13494 -11158 -4038 -5877 -11763
14832 -11763 -9274 -2500 -5373 -10380 -11471 -8931 -3932 664 -892 -4323 -1681 -259 3518 -4353
14818 -4353 -8493 -4158 -4979 -2412 1918 2699 2382 -2753 -9993 -11387 -2695 1401 4472 4530 251 -3077
14802 -3077 3288 11920 13772 5972 -296 2037 8466 9810 4089 -1286 3640 3978 -3788 -4192 -3011
14787 -3011 2643 2155 -3128 -948 3809 -719 -4460 18 447 -3937 -10491 -9025 -4255 -2114 -7748
14772 -7748 -11596 -14509 -6768 1965 -4739 -15463 -19906 -13000 -6504 -7599 -2788 3279 2925 -2956 -6110
14757 -6110 -8921 -8709 -9577 -10360 -8784 -8988 -5481 -1859 -8443 -7355 -4783 -10052 -3911 -4965 -5507 -6732
$$ packed form
14861a4689K881J2873K283n779o976l034M640L044N80J471J483m028p2k055l821
14846a1199j948M999M916j081q175l461J386M741K185n857K336P120j839n886
14832a1763K489O774k873n007j091K540M999M596j556l431K642J422L777p871
14818d353m140M335q21K567M330P81l17n135p240j394Q692M096L071N8m279l328
14802c077O365Q632J852p800o268K333O429J344n721n375M926L38p766m04J181
14787c011N654m88n283K180M757m528l741M478M29m384o554J466M770K141n634
14772g748l848k913P741Q733o704j0724m443O906O496j095M811O067l54n881l154
14757f110k811K12q68p83J576k04L507L622o584J088K572n269O141j054n42j225
$$ plain form
14741 -6732 -1318 5242 7553 6342 5023 9515 7361 4988 8004 5759 -1848 -4786 -6886 -6251 -9353
14726 -9353 -5254 -1421 -1573 -8940 -9937 -7083 -7313 -1676 6432 8104 4933 4796 10214 22384 19060
14711 19060 14438 10418 9737 6101 9100 7275 1999 1280 5146 11499 9047 12213 13276 15282 13418
14696 13418 6803 -2894 -6928 -3011 -442 -144 5575 7991 5809 -1082 -558 177 -2550 2498 -2368
14681 -2368 999 4889 7235 5070 5672 2622 2559 2287 2140 -2241 -7164 -9498 -5323 -592 -4653 -6838
14665 -6838 -6575 -1650 2447 3523 5130 11651 13909 14287 12179 6031 -300 3959 13604 14126 15371
14650 15371 14594 13520 -47 2421 836 -2991 4335 13174 11617 7979 9165 -2994 -11186 -6241
14636 -6241 -610 1820 3591 9694 1731 -5881 -7730 -5866 -4023 -11654 -6119 -3705 -736 2417 -243
$$ packed form
14741f732N414O560K311j211j319M492k154k373L016k245p607k938k100O35l102
14726i353M099L833j52p367r97K854k30N637Q108J672l171j37N418J2170l324
14711A9060m622m020o81l636K999j825n276p19L866O353k452L166J063K006j864
14696A3418o615r697m034L917K569K98N719K416k182o891N24P35k727N048m866
14681b368L367L890K346k165O02l050o3k72j47m381m923k334M175M731m061k185
14665f838K63M925M097J076J607O521K258L78k108o148o331M259R645N22J245
14650A5371p77j074j3567K468j585l827P326Q839j557l638J186j2159q192M945
14636f241N631K430J771O103p963p612j849J864J843p631N535K414K969L153k660
$$ plain form
14621 -243 -752 -309 1518 3150 196 2438 10083 6037 8744 11465 7411 3227 2132 3355 2752 -2896
14605 -2896 -2105 -1534 2384 6879 9668 5961 3842 6656 4359 3352 4550 8944 13542 15340 11418
14590 11418 6906 11895 16261 17184 17852 18408 17224 19896 16495 12193 5483 10635 14762 7193 4064
14575 4064 8062 11419 8353 13267 17810 8439 1548 -6514 -12192 -12862 -8675 -1245 -730 -2108 3407
14560 3407 4461 3582 1091 2387 10730 12218 8778 9238 11990 4775 -2319 -2255 -371 3337 7235 12244
14544 12244 8972 4168 3110 517 1364 3273 7319 15564 15459 10693 4813 1330 3426 9709 10481
14529 10481 10650 8850 8007 1502 -3290 -2718 5839 14530 17666 14969 10024 4318 3179 4042 2285
14514 2285 -228 -3122 -5996 -3467 -6756 -4610 -1468 -222 -2943 -1279 1295 4218 4710 4912 -2456
$$ packed form
14621b43n09M43J827J632k954K242P645m046K707K721m054m184j095J223o03n648
14605b896P91N71L918M495K789l707k119K814k297j007J198M394M598J798l922
14590A1418m512M989M366R23O68N56j184K672l401m302o710N152M127p569l129
14575D064L998L357l066M914M543r371o891q062n678o70M187P430N15j378N515
14560C407J054q79k491J296Q343J488l440M60K752p215p094O4J884L708L898N009
14544A2244l272m804j058k593Q47J909M046Q245j05m766n880l483K096O283P72
14529A0481J69j800q43o505m792N72Q557Q691L136k697m945n706j139Q63j757
14514B285k513k894k874K529l289K146L142J246k721J664K574K923M92K02p368
$$ plain form
14499 -2456 -709 819 986 996 5600 1904 -4064 -2439 -3139 -2878 -1044 -4130 -1774 -4256 -12095 -12311
14483 -12311 -2417 3794 6773 -428 -4673 -3365 1324 3165 4967 1737 1813 -2233 -6573 2601 6072
14468 6072 3803 -4641 -5922 -4974 -2775 1470 5508 6033 2093 1272 1752 -1222 -3653 -6601 -8319 -5684
14452 -5684 2756 6694 4505 3654 6140 2345 1418 3241 1035 -1731 -2091 -7289 -6099 1384 6874
14437 6874 17217 13876 4524 3609 -791 -1761 -3802 -2063 -1434 2958 7071 6852 4390 4892 8610 14600
14421 14600 13319 10498 8442 7097 9620 6542 5515 1129 2665 2055 1012 -828 -7917 -6029 -3886
14406 -3886 -5045 -3430 -535 1564 3139 364 -5083 1710 3260 3186 337 3407 1217 -5183 2366
14391 2366 6897 -467 -4031 -7317 -3583 2428 7787 2296 -544 860 -736 -2942 5392 4915 2493
$$ packed form
14499b456J747J528J67J0M604l696n968J625p00K61J834l086K356k482p839k16
14483a2311R894O211K979p201m245J308M689J841J802l230P6m046m340R174L471
14468F072k269q444j281R48K199M245M038N25l940q21M80k974k431k948j718K635
14452e684Q440L938k189q51K486l795r27J823k206k766l60n198J190P483N490
14437F874J0343l341r352r15m400r70k041J739O29M392M113k19k462N02L718N990
14421A4600j281k821k056j345K523l078j027m386J536o10j043j840p089J888K143
14406c886j159J615K895K099J575k775n447O793J550p4k849L070k190o400P549
14391B366M531p364l564l286L734O011N359n491k840J404j596k206Q334m77k422
$$ plain form
14376 2493 6122 3972 -430 -3478 -10894 -8314 -2846 -2998 -4586 -7482 -2784 3939 -2707 -8897 -13084
14361 -13084 -8727 -3702 2157 3779 3062 2406 4895 5752 5925 6379 3742 -1009 -498 -2292 -1283 -558
14345 -558 -5913 -8067 -7173 -1249 -4526 -3687 -768 -3841 -10647 -9371 -3464 -5249 -8838 -2548 19
14330 19 -7078 -8626 -4301 -1581 -976 -3117 -4064 -3475 -1624 -3704 -7598 -10994 -10658 -5969 -4989 -7236
14314 -7236 -9482 -6737 1839 2456 -1776 -5179 -4709 1711 6746 5576 4549 -189 -1486 2826 956
14299 956 -1589 -6046 -8622 -1095 3699 601 -459 -4079 664 12872 22050 16022 3199 3525 4820
14284 4820 4578 -4838 -5977 -1026 11573 12341 11232 6600 -40 -827 924 1246 -4115 -2988 -110
14269 -110 -80 2385 4916 6180 3543 -622 -3956 -4078 -4296 2606 5004 6211 16381 14086 12743 6161
$$ packed form
14376B493L629k150m402l048p416K580N468j52j588k896M698O723o646o190m187
14361a3084M357N025N859J622p17o56K489Q57J73M54k637m751N11j794J009P25
14345e58n355k154Q94N924l277Q39K919l073o806J276N907j785l589O290K567
14330A9p097j548M325K720O05k141r47N89J851k080l894l396L36M689R80k247
14314g236k246K745Q576O17m232l403M70O420N035j170j027m738j297M312j870
14299I56k545m457k576P527M794l098j060l620M743J2208R178o028j2823L26J295
14284D820k42r416j139M951J2599P68j109m632o640p87J751L22n361J127K878
14269a10L0K465K531J264k637m165l334j22k18O902K398J207J0170k295j343o582
$$ plain form
14253 6161 -1649 2937 2186 3622 2463 217 2653 4152 3668 3654 7878 12486 13220 14359 3665 -3414
14237 -3414 -3527 -6446 -9702 -16568 -18515 -7023 1380 3264 3113 3020 3274 9483 8254 4348 6154 11580
14221 11580 10678 6400 7667 14061 16663 15401 7254 3058 -2024 -3459 -6841 -5137 -3264 -2177 3019
14206 3019 9690 4931 3687 2328 2297 5006 3730 3849 4807 2865 -624 -2074 120 5627 5922 6417
14190 6417 4240 4055 9066 4839 -4844 -5425 -603 5841 5066 3365 -9 -1574 -10164 -11206 -12494
14175 -12494 -9675 -6757 -5422 -8638 -12942 -3961 5118 15501 20673 16569 14395 11667 7335 4180
14161 4180 9060 1828 -2760 -3029 -10787 -10525 -10904 -12643 -13722 -12692 -9651 -4429 -324 -2021 -9605
14146 -9605 -13650 -10891 -5477 -4702 -4003 2509 215 2734 4790 6361 4742 5859 3781 -1413 -2641
$$ packed form
14253F161p810M586p51J436j159k246K436J499m84j4M224M608P34J139j0694p079
14237c414j13k919l256o866j947J1492Q403J884j51r3K54O209j229l906J806N426
14221A1580r02m278J267O394K602j262q147m196n082j435l382J704J873J087N196
14206C019O671m759j244j359l1K709j276J19R58j942l489j450K194N507K95M95
14190F417k177j85N011m227r683n81M822O444p75j701l374j565q590j042j288
14175a2494K819K918J335l216m304Q981R079J0383N172m104k174k728m332l155
14161D180M880p232m588k69p758K62l79j739j079J030L041N222M105j697p584
14146i605m045K759N414P75O99O512k294K519K056J571j619J117k078n194j228
$$ plain form
14131 -2641 2364 -219 -2062 -12937 -9092 -4714 2119 5686 8242 7603 -1927 -16297 -12206 -279
14117 -279 721 -4284 -4689 -1920 -1061 -4810 -4140 2922 9772 9392 -112 1380 11416 10073 1886 1037
14101 1037 -1542 -9634 -3360 2394 -2192 -5602 -5215 -8026 -7316 -4744 1185 -249 -3007 -1471 62
14086 62 -120 1383 2511 1588 -3963 -3745 -3470 -2989 -3645 -9302 -18270 -13285 510 2642 3382 1641 227
14069 227 2250 -3327 -2373 8125 5554 5237 5672 6396 7309 6327 4438 4015 5087 4081 2762 -3760
14053 -3760 -4592 3105 2723 -955 -1666 273 -1574 2202 7835 7051 4416 3158 9540 13896 14794 16882
14037 16882 9118 1193 -2594 -5395 -11263 -12865 -8069 -3829 -952 3261 12675 13864 10675 4082
14023 4082 3563 -627 -4331 -6916 -6302 -3120 -1657 650 6942 6878 2068 -2486 -795 4340 7809 9368
$$ packed form
14131b641N005k583j843j0875L845M378O833L567K556o39r530j4370M091J1927
14117b79J000n005m05K769Q59l749O70P062O850l80r504J492J0036j343q187q49
14101A037k579q092O274N754m586l410L87k811P10K572N929j434k758J536J533
14086F2j82J503J128r23n551K18K75M81o56n657q968M985J3795K132P40j741j414
14069B27K023n577R54J0498k571l17M35P24R13r82j889m23J072j006j319o522
14053c760q32P697l82l678p11J939j847L776N633p84k635j258O382M356Q98K088
14037A6882p764p925l787k801n868j602M796M240K877M213R414J189l189o593
14023D082n19m190l704k585O14L182J463K307O292o4m810m554J691N135L469J559
$$ plain form
14007 9368 12971 9694 12031 14022 5044 -1958 -3732 -8573 -8258 -8652 -2737 -802 -7242 -10157 -16408
13992 -16408 -12526 -597 2784 5133 3303 5573 11008 8511 10615 10949 8608 1965 -7456 -14789
13978 -14789 -15035 -14225 -9908 -520 4741 6794 12228 13335 9780 3152 -5163 -4839 805 5923 4216
13963 4216 6429 3587 3329 -1695 -3207 -765 -4098 -2371 -2964 -5870 -7495 -2493 4041 5518 4054
13948 4054 -2251 -3882 576 4160 2895 2309 5482 5568 9361 10752 5003 -3192 -1831 833 4071
13933 4071 1605 -3633 -3354 -168 -898 -595 -117 -5573 -4227 2723 5169 -834 -3189 -2856 1129 10676
13917 10676 15527 15328 17531 5371 633 9154 8916 6265 3469 5735 10182 1040 -8072 -945 2040
13902 2040 7062 10063 7099 5586 -3016 -5149 2223 8283 12362 13351 6620 8247 5679 4964 4275
$$ packed form
14007I368L603l277K337J991q978p002j774m841L15l94N915J935o440k915o251
13992a6408L882J1929L381K349j830K270N435k497K104L34k341o643r421p333
13978a4789k46Q10M317R388N261K053N434J107l555o628q315L24N644N118j707
13963D216K213k842k58n024j512K442l333J727n93k906j625N002O534J477j464
13948D054o305j631M458L584j265n86L173Q6L793J391n749q195J361K664L238
13933D071k466n238K79L186p30L03M78n456J346O950K446o003k355L33L985R547
13917A0676M851j99K203j2160m738Q521k38k651k796K266M447r142r112P127K985
13902B040N022L001k964j513q602k133P372O060M079R89o731J627k568p15o89
$$ plain form
13887 4275 4663 10863 10534 9262 13860 9185 5268 5657 3733 35 -160 5838 7724 3123 -1332 1266
13871 1266 -2661 -300 3405 1179 -3393 -3703 -1574 5399 9081 4292 7761 2921 -1356 28 680
13856 680 1930 4881 4814 5240 -2103 -7232 -7780 -929 3702 3683 2877 2247 -2397 -241 5235 7623 987
13839 987 3005 11112 6160 4879 10193 11212 9262 7579 16475 15912 13391 13527 22036 17980 11712
13824 11712 4418 2748 2025 7318 11143 6832 2448 4076 10192 3853 6115 9296 2967 7862 5481
13809 5481 -2702 -10215 -2900 4443 3348 4525 1207 5204 5449 6146 8230 12820 2234 2866 3216
13794 3216 2148 7994 7930 4781 9344 7296 5264 1026 69 6994 8093 17330 20825 18538 25845
13779 25845 34748 36274 36525 36092 43371 51322 54997 56113 51582 41960 31729 22007 20107 15434 14956
$$ packed form
13887D275L88O200l29j272M598m675l917L89j924l698j95N998J886m601m455K598
13871A266l927K361L705k226m572l10K129O973L682m789L469m840m277J384O52
13856F80J250K951o7M26p343n129n48O851M631j9q06o30m644K156N476K388o636
13839I87K018Q107m952j281N314J019j950j683Q896n63k521J36Q509m056o268
13824A1712p294j670p23N293L825m311m384J628O116o339K262L181o329M895k381
13809E481q183p513P315P343j095J177l318L997K45O97K084M590j0586O32L50
13794C216j068N846o4l149M563k048k032m238r57O925J099R237L495k287P307
13779B5845Q903J526K51m33P279P951L675J116m531r622j0231r722j900m673m78
$$ plain form
13764 14956 17156 16731 12321 6687 6120 3544 -2752 4530 13715 16796 17852 18284 19028 15394 12042
13749 12042 15713 6115 3382 6914 7394 9538 8397 5473 2666 7472 7880 7008 11116 12600 11730
13734 11730 11722 4114 -3101 -5086 -7234 -947 2024 4488 4167 -3071 -8322 -8722 875 4939 -3421 244
13718 244 5596 11273 10495 4849 12348 12382 6545 10354 12762 9334 11154 13152 10335 10061 4471 4294
13702 4294 9112 12659 11079 6807 -1773 2777 185 5001 7300 3795 550 -5122 -5692 -1117 2507
13687 2507 3100 946 2239 -2383 -2593 -509 4722 14242 10597 3789 -3472 -10714 -11430 -3577 -6787
13672 -6787 -2618 6652 14364 16723 13910 13665 13892 16559 10508 12096 14776 15032 16871 16924 11191 10521
13656 10521 10446 15176 22214 19306 14210 11033 5498 3903 -3850 -9343 -4783 -4637 3454 13465 12795
$$ packed form
13764A4956K200m25m410n634n67k576o296P282R185L081J056M32P44l634l352
13749A2042L671r598k733L532M80K144j141k924k807M806M08q72M108J484q70
13734A1730qp608p215j985k148O287K971K464l21p238n251m00R597M064q360L665
13718B44N352N677p78n646P499L4n837L809K408l428J820J998k817k74n590j77
13702D294M818L547j580m272q580M550k592M816K299l505l245n672n70M575L624
13687B507N93k154J293m622k10K084N231R520l645o808p261p242p16P853l210
13672f787M169R270P712K359k813k45K27K667o051J588K680K56J839N3n733o70
13656A0521p5M730P038k908n096l177n535j595p753n493M560J46Q091J0011o70
$$ plain form
13641 12795 12899 14295 11579 15097 12465 5464 4107 10350 9270 5448 4904 6375 7790 5729 2218
13626 2218 -3975 -3511 2883 6425 1745 2125 9749 6072 8182 9773 1978 -3013 -642 -791 -3223
13611 -3223 1658 2856 6234 2995 3420 4634 4639 11715 8786 16396 15735 20675 19076 13588 4881 5977
13595 5977 10992 12588 8423 10619 7315 4651 2046 -7152 -5407 -2132 -40 137 1632 7845 16264
13580 16264 16073 13268 9986 10638 12987 12863 13326 12180 9139 10014 10503 9826 10769 4693 1470 2918
13564 2918 6073 5758 743 -1445 -888 1973 6233 1237 893 596 7752 11404 12738 6159 -2285 -849
13548 -849 468 1127 3310 1560 6438 7873 7594 5936 5287 2824 4764 7037 8491 2591 -5802 -1626
13532 -1626 131 -2193 3173 3298 -4164 -108 5021 6270 4667 5477 6773 9565 8504 12247 15094
$$ packed form
13641A2795J04J396k716L518k632p001j357O243j080l822n44J471J415k061l511
13626B218o193M64O394L542m680L80P624l677K110J591p795m991K371j49k432
13611c223M881J198L378l239M25J214NP076k929P610o61M940j599n488q707J096
13595E977N015J596m165K196l304k664k605r198J745L275K092J77J495O213Q419
13580A6264j91k805l282O52K349j24M63j146l041Q75M89o77R43o076l223J448
13564B918L155l15n015k188N57K861M260m996l44k97P156L652J334o579q444J436
13548h49J317O59K183j750M878J435k79j658o49k463J940K273J454n900q393M176
13532a626J757k324N366J25p462M056N129J249j603Q10J296K792j061L743K847
$$ plain form
13517 15094 10368 11275 14987 7786 -937 4142 6183 7090 5977 8733 6154 2321 1420 8787 11735
13502 11735 12476 3994 3575 4678 6452 3753 5188 -2678 -3736 -3686 3936 8797 11690 14092 8667
13487 8667 4358 10345 14595 4700 -5492 -9083 -10702 -8078 92 810 -819 1552 8329 6714 926
13472 926 -2731 -2669 3565 7079 5335 9908 9508 9338 13006 15554 18355 10269 5114 2440 1865 -934
13456 -934 -1005 2787 4974 5137 7087 10740 13979 12236 11611 7857 5764 7684 2735 6680 11113 16767
13440 16767 13333 8025 10690 15921 8758 242 1898 2537 5370 8867 15422 17644 14707 15973 18978
13425 18978 15437 11516 15771 18028 13960 17190 16403 10865 3357 -1076 -640 5500 8196 8029 6089
13410 6089 1679 9274 5764 13011 16073 9996 9454 9438 10514 12658 17395 15480 8476 3754 2690
$$ packed form
13517A5094m726R07L712p201q723N079K041R07j113K756k579l833r01P367K948
13502A1735P41q482m19J103J774k699J435p866j058N0P622M861K893K402n425
13487H667m309N987M250r895j0192l591j619K624Q170P18j629K371O777j615n788
13472I26l657O2O234L514j744M573m00j70L668K548K801q086n155k674n75k799
13456i34p1L792K187J63J950L653L239j743o25l754k093J920m949L945M433N654
13440A6767l434n308K665N231p163q516J656O39K833L497O555K222k937J266L005
13425A8978l541l921M255K257m068L230p87n538p508m433M36O140K696j67j940
13410F089m410P595l510P247L062o077n42j6J076K144M737j915p004m722j064
$$ plain form
13395 2690 5559 6198 10886 13837 21701 24479 19115 20212 18978 12110 2386 -1115 310 2104 5758
13380 5758 -1378 -1015 3286 4348 5869 7917 16730 13665 7166 7575 10001 10951 13599 16873 16405 14308
13364 14308 12547 8423 6545 6732 9081 9169 6976 11143 15210 17001 18481 18314 15451 18586 10547
13349 10547 3153 4846 7886 4852 6229 6800 6708 9321 8132 7436 12824 10625 7591 10197 7530
13334 7530 4799 2997 3092 3805 10525 12302 13369 18788 14529 11334 9265 16327 19255 15928 14114
13319 14114 10398 2770 3332 11836 9443 3589 5269 10142 10104 6206 -431 4154 9479 9008 10554
13304 10554 13786 13649 17876 15826 15114 17757 13176 8863 6815 8324 7435 6259 6419 7226 12966 24528
13288 24528 24996 18957 18019 18101 11951 11167 8693 8351 6759 10518 12888 15973 19951 21273 19115 12006
$$ packed form
13395B690K869O39M688K951P864K778n364J097j234o868r724l501J425J794L654
13380E758p136L63M301J062J521K048Q813l065o499M09K426R50K648L274m68k097
13364A4308j761m124j878J87K349Q8k193M167M067J791J480j67k863L135q039
13349A0547p394J693L040l034J377N71r2K613j189o96N388k199l034K606k667
13334G530k731j802R5P13O720J777J067N419m259l195k069P062K928l327j814
13319A4114l716p628N62Q504k393n854J680M873l8l898o637M585N325m71J546
13304A0554L232j37M227k050p12K643m581m313k048J509q89j176J60Q07N740J1562
13288B4528M68o039r38Q2o150p84k474l42j592L759K370L085L978J322k158p109
$$ plain form
13272 12006 16316 17634 21912 19227 17591 17173 17041 11987 10958 7221 7421 9311 22299 29776 26943
13257 26943 19202 11073 11598 17177 20558 12738 19510 21114 14938 14135 10786 15366 23992 22370 19763
13242 19763 22617 21389 8689 6232 10314 16390 11686 20333 20020 20092 18405 15096 19853 23025 24324
13227 24324 25832 22999 23586 20093 13352 14294 16406 16265 13603 6942 8234 8556 12655 20280 14863
13212 14863 15297 15158 15032 17298 13759 12224 13236 11827 13953 17855 14591 15510 15978 21331 19456 19042
13196 19042 12512 8934 15908 19687 18216 13647 10911 10669 13082 11054 8618 13951 18899 19358 18864
13181 18864 12293 5454 11283 13963 11981 8925 10732 11228 4573 6728 13431 17601 19924 10318 2496
13166 2496 10928 15309 17584 11584 2825 3360 8855 11278 14451 23169 27512 23522 20411 19833 14005
$$ packed form
13272A2006M310J318M278k685j636m18j32n054j029l737K00J890J2988P477k833
13257B6943p741q129N25N579L381p820O772J604o176q03l349M580Q626j622k607
13242A9763K854j228j2700k457M082O076m704Q647l13P2j687l309M757L172J299
13227B4324J508k833N87l493o741R42K112j41k662o661J292L22M099P625n417
13212A4863M34j39j26K266l539j535J012j409K126L902l264R19M68N353j875m14
13196A9042o530l578O974L779j471m569k736k42K413k028k436N333M948M59m94
13181A8864o571o839N829K680j982l056J807M96o655K155O703M170K323r606p822
13166B496Q432M381K275o000q759N35N495K423L173Q718M343l990l111n78n828
$$ plain form
13151 14005 18592 21926 21897 25848 28339 26662 26453 21171 21902 21630 17418 19639 24762 22943 16037 12463
13135 12463 12144 12699 16405 19649 18485 11473 5896 6802 11384 12088 18509 24404 20261 23311 19729
13120 19729 19004 17832 19066 15525 10105 7300 13037 14324 14581 9363 13478 15865 17466 22239 18669
13105 18669 13636 15947 16039 20164 18309 13108 8158 3835 9141 15324 21122 19868 19852 25865 22176
13090 22176 21424 17898 14114 10972 7735 9331 13719 9435 14959 19097 18448 15725 12455 11376 7631
13075 7631 13409 17632 23093 18347 14480 16314 13940 13557 21474 20903 16719 21271 25224 20825 21829
13060 21829 22363 13402 9076 9703 17553 15326 15460 16682 10505 11694 11501 18119 25771 21116 12984
13045 12984 14714 14536 16930 17960 16161 18871 18260 16791 18721 20947 24933 25830 26980 27348 31121
$$ packed form
13151A4005M587L334k9L951K491j677k09n282P31k72m212K221N123j819o906l574
13135A2463l19N55L706L244j164p012n577R06M582P04O421N895m143L050l582
13120A9729p25j172J234l541n420k805N737J287K57n218M115K387J601M773l570
13105A8669n033K311R2M125j855n201m950m323N306O183N798j254j6O013l689
13090B2176p52l526l784l142l237J596M388m284N524M138o49k723l270j079l745
13075G631N778M223N461m746l867J834k374l83P917n71m184M552L953m399J004
13060B1829N34q961m326O27P850k227J34J222o177J189j93O618P652m655q132
13045A2984J730j78K394J030j799K710o11j469J930K226L986Q97J150L68L773
$$ plain form
13030 31121 36507 34218 28307 33961 42003 42112 39152 46268 50963 52319 55416 53044 48644 45119 49456
13015 49456 44580 35901 25577 25380 24302 18637 18071 23031 28338 24798 22143 24566 20891 26840 33222
13000 33222 29353 28196 35707 34171 30259 30121 30418 24584 23727 22567 19614 18609 23116 24830 23076
12985 23076 24789 24631 26985 24773 27569 35940 39349 39346 45687 47201 37324 32413 28989 27025 26698 33349
12969 33349 42492 43729 40174 31707 31634 28702 26387 29192 25606 26194 30741 30383 32135 38136 41860
12954 41860 38804 38456 36747 35109 37668 33491 26452 20857 19595 26199 32601 36832 28703 28527 32617
12939 32617 35227 36909 47413 45568 44533 39425 35168 32749 25661 27931 31159 31033 36695 35151
12925 35151 28612 29513 30966 27459 21446 24098 29178 33853 37200 35317 35339 29208 24464 25232 21624
$$ packed form
13030C1121N386k289n911N654Q042J09k960P116M695J356L097k372m400l525M337
13015D9456m876q679j0324j97j078n665n66M960N307l540k655K423l675N949O382
13000C3222l869j157P511j536l912j38K97n834q57j160k953j005M507J714j754
12985B3076J713j58K354k212K796Q371L409lO341J514r877m911l424j964l27O651
12969C3349R143J237l555q467p3k932k315K805l586N88M547l58J752O001L724
12954D1860l056l48j709j638K559m177p039n595j262O604O402M231q129j76M090
12939C2617K610J682J0504j845j035n108m257k419p088K270L228j26N662j544
12925C5151o539R01J453l507o013K652N080M675L347j883K2o131m744P68l608
$$ plain form
12910 21624 19480 17615 21066 24649 19709 23247 24035 24609 26272 31014 29403 28982 26716 24519 30994
12895 30994 27671 20126 19490 24381 22312 17170 16431 16546 26187 28271 27491 26904 29654 26397 27267 32924
12879 32924 32019 29459 28686 26178 25297 20632 22375 21777 23820 14556 17021 20535 26254 29642 32916
12864 32916 38131 42860 45224 45455 47853 52840 56347 66787 69926 69143 84285 92473 101220 113374
12850 113374 138053 167711 198100 253765 327993 412926 511267 623643 721291 793492 825587
12839 825587 809005 749301 654205 545865 440423 339005 256589 203659 167831 138402 114166
12828 114166 97821 88837 85469 79035 73604 68720 68363 69884 67929 58694 54715 51156 42731 43202
12814 43202 44838 49768 50341 45455 43549 42890 46332 42448 35023 32023 38471 42738 39102 35181 40246
$$ packed form
12910B1624k144j865L451L583m940L538P88N74J663M742j611m21k266k197O475
12895C0994l323p545o36M891k069n142p39J15R641K084p80n87K750l257Q70N657
12879C2924r05k560p73k508q81m665J743n98K043r264K465L514N719L388L274
12864C2916N215M729K364K31K398M987L507J0440L139p83J5142Q188Q747J2154
12850A13374K4679K9658L0389N5665P4228Q4933R8341J12376R7648P2201L2095
12839H25587j6582n9704r5096j08340j05442j01418q2416n2930l5828k9429k4236
12828A14166j6345q984l368o434n431m884l57J521j955r235l979l559q425M71
12814D3202J636M930N73m886j906o59L442l884p425l000O448M267l636l921N065
$$ plain form
12799 40246 41641 39053 39115 33362 21405 26608 34010 44620 51412 53409 49332 43172 45564 44547
12785 44547 40356 37602 30765 34401 39190 40465 30795 24669 28500 32595 40786 41814 39418 32965
12771 32965 38353 36218 37346 32795 32203 35447 43849 41258 40763 38491 42508 42976 43463 39771 32659
12756 32659 34270 34367 39046 44181 36852 29908 35025 43121 38630 34455 33625 40265 36309 32067 24603
12741 24603 20156 24062 28746 32421 33005 25700 23725 32264 38146 42023 42009 37761 30667 23468 21540
12726 21540 22218 27576 31165 30089 31721 32542 31549 40519 48103 55137 61693 69653 70127 65781 61185
12711 61185 67090 68061 59745 57395 54616 60438 54017 49981 50761 51199 46290 45144 49823 53669 54647
12696 54647 58272 60584 64365 64916 64042 62532 66082 64203 62630 68177 71016 78996 77760 69308 70200
$$ packed form
12799D0246J395k588O2n753j1957N203P402J0610O792J997m077o160K392j017
12785D4547m191k754o837L636M789J275r670o126L831M095Q191J028k396o453
12771C2965N388k135J128m551n92L244Q402k591m95k272M017M68M87l692p112
12756C2659J611R7M679N135p329o944N117Q096m491m175q30O640l956m242p464
12741B4603m447L906M684L675N84p305j975Q539N882L877j4m248p094p199j928
12726B1540O78N358L589j076J632Q21r93Q970P584P034O556P960M74m346m596
12711F1185N905R71q316k350k779N822o421m036P80M38m909j146M679L846R78
12696E4647L625K312L781N51q74j510L550j879j573N547K839P980j236q452Q92
$$ plain form
12681 70200 72694 82358 82483 78429 87199 97439 118824 142138 152367 160892 170147 175723 175852 159705
12667 159705 142683 129408 113543 100015 92463 83785 77677 78017 77619 80156 88053 83327 73217
12654 73217 67601 67030 70302 63384 60174 61835 61455 64782 70210 75093 75060 77630 73142 68513 66560
12639 66560 67613 69665 68307 67512 74720 72346 72068 77383 77795 80122 81028 84947 88320 94706 101223
12624 101223 109542 104753 95361 96223 103677 109275 107619 113450 116842 114524 107646 106235 105085 97434
12610 97434 93848 86807 87701 94537 98302 105761 113303 112155 110914 108348 107373 107719 108288 106543 104766
12595 104766 104579 101762 105453 114918 127316 138358 146649 149249 147939 143545 136666 141714 152351 157329
12581 157329 156675 155387 162440 178387 195114 220014 250124 279046 298697 302741 303506 305415 323211
$$ packed form
12681G0200K494R664J25m054Q770J0240K1385K3314J0229Q525R255N576J29j6147
12667A59705j7022j3275j5865j3528p552q678o108L40l98K537P897m726j0110
12654G3217n616n71L272o918l210J661l80L327N428M883l3K570m488m629j953
12639F6560J053K052j358p95P208k374k78N315M12K327R06L919L373O386O517
12624A01223Q319m789r392Q62P454N598j656N831L392k318o878j411j150p651
12610I7434l586p041Q94O836L765P459P542j148j241k566r75L46N69j745j777
12595A04766j87k817L691R465J2398J1042Q291K600j310m394o879N048J0637M978
12581A57329o54j288P053J5947J6727K4900L0110K8922J9651M044P65J909J7796
$$ plain form
12568 323211 351110 398313 481484 610170 743696 772016 698319 598981 551605 558655 564985
12557 564985 537527 488977 440841 405386 384479 380138 395182 423498 473507 526895 543715 529902
12545 529902 519063 531770 560624 582487 591099 607008 659994 719124 748904 739152 699441 659616
12533 659616 643414 658851 707760 769871 822564 870589 933150 1004205 1084290 1217374 1462367
12522 1462367 1769447 1909517 1770337 1485784 1234119 1103054 1042783 993362 944788 889613
12512 889613 826143 768592 738352 738126 770092 814901 849132 834627 773903 705707 668165 651501
12500 651501 641501 623139 607548 619344 652277 671955 657081 620457 579758 557717 563762 590646
12488 590646 635311 691570 749750 793141 822271 829786 836891 894378 1013884 1087681 1034140 908799
$$ packed form
12568C23211K7899M7203Q3171J28686J33526K8320p3697r9338m7376P050O330
12557E64985k7458m8550m8136l5455k0907m341J5044K8316N0009N3388J6820j3813
12545E29902j0839J2707K8854K1863Q612J5909N2986N9130K9780r752l9711l9825
12533F59616j6202J5437M8909O2111N2693M8025O2561P1055Q0085J33084K44993
12522A462367L07080J40070j39180k84553k51665j31065o0271m9421m8574n5175
12512H89613o3470n7551l0240k26L1966M4809L4231j4505o0724o8196l7542j6664
12500F51501j0000j8362j5591J1796L2933J9678j4874l6624m0699k2041O045K6884
12488E90646M4665N6259N8180M3391K9130P515P105N7487J19506P3797n3541j25341
$$ plain form
12476 908799 773610 684343 634505 622546 632476 651970 673758 685990 691874 693001 699034 714484
12464 714484 733364 756125 790181 826118 865027 904242 936987 969838 1007114 1061460 1116710
12453 1116710 1167760 1224938 1280514 1343372 1418107 1501444 1596675 1705826 1825980 1969528 2140772
12442 2140772 2345592 2587239 2875945 3237471 3683529 4235548 4917552 5736360 6706669
12433 6706669 7853696 9209204 10802767 12705334 15022975 17933109 21716634 26865510
12425 26865510 34133735 44387265 58223361 75701944 95949063 116317815 133681338
12418 133681338 145430725 148745302 142886643 129350125 110351315 89096582 68702240
12411 68702240 51342992 37923492 28258084 21622236 17131801 14038908 11821565 10161500
$$ packed form
12476I08799j35189q9267m9838j1959R930J9494K1788J2232N884J127O033J5450
12464G14484J8880K2761L4056L5937L8909L9215L2745L2851L7276N4346N5250
12453A116710N1050N7178N5576O2858P4735Q3337R5231J09151J20154J43548J71244
12442B140772K04820K41647K88706L61526M46058N52019O82004Q18808R70309
12433F706669J147027J355508J593563J902567K317641K910134L783525N148876
12425B6865510P268225J0253530J3836096J7478583K0247119K0368752J7363523
12418A33681338J1749387L314577n858659j3536518j8998810k1254733k0394342
12411F8702240j7359248j3419500r665408o635848m490435l092893k217343j660065
$$ plain form
12403 10161500 8876375 7817006 6890020 6054610 5283769 4576331 3951157 3412549 2960745
12394 2960745 2595650 2302765 2064139 1856790 1674446 1522823 1386200 1270736 1174511 1082543
12384 1082543 1003548 932415 860926 801142 740434 688966 640386 592135 553203 524468 494595
12373 494595 464748 440133 424112 411655 395313 382315 367769 352828 349224 333412 321621 308873
12361 308873 291490 282347 284303 280119 271418 265473 257181 252758 247380 240653 236081 227035 210271 196732
12347 196732 189212 180455 174642 169885 167503 174120 180105 181617 167695 161513 156915 150672 144049 131566
12333 131566 119853 120003 122663 113057 110283 107699 105059 96946 95466 92889 89772 89390 87052 88918
12319 88918 97486 107048 117130 119272 105141 83597 75274 77558 80180 89471 88134 85873 79347 89200
$$ packed form
12403A0161500j285125j059369r26986q35410p70841p07438o25174n38608m51804
12394B960745l65095k92885k38626k07349j82344j51623j36623j15464r6225r1968
12384A082543p8995p1133p1489n9784o0708n1468m8580m8251l8932k8735k9873
12373D94595k9847k4615j6021j2457j6342j2998j4546j4941l604j5812j1791j2748
12361C08873j7383r143J956m184q701n945q292m423n378o727m572r046j6764j3539
12347A96732p520q757n813m757k382O617N985J512j3922o182m598o243o623j2483
12333A31566j1713J50K660r606k774k584k640q113j480k577l117l82k338J866
12319H8918Q568R562J0082K142j4131k1544q323K284K622R291j337k261o526R853
$$ plain form
12305 89200 91402 94924 90065 87947 91720 89816 80264 68019 64277 63470 58749 56637 63165 59830
12291 59830 58074 63247 64897 74222 86911 87711 77334 72879 72041 78042 77348 72785 59478 64337
12277 64337 70853 69247 69258 63432 55434 39406 24869 17753 8010 -5757 -19890 -23742 -23229 -22849
12263 -22849 -18978 -12139 -3474 3372 14589 20750 22680 29706 31522 33561 33063 36856 36702 40431 34838
12248 34838 29982 30210 32445 27461 26844 28149 31801 30122 28408 24555 27755 27276 30164 31257 27332
12233 27332 14982 5431 118 -4718 2342 4911 9259 8049 6307 7214 8305 871 -895 5778
12219 5778 5574 -710 3906 986 3386 1935 -1071 4091 4798 787 3464 11562 22792 23062 18376
12204 18376 20533 22938 20840 13529 8805 7307 10655 13156 8900 9297 6865 3477 7021 11258 15329
$$ packed form
12305H9200K202L522m859k118L773j904r552j2245l742q07m721k112O528l335
12291E9830j756N173J650R325J2689Q00j0377m455q38O001o94m563j3307M859
12277F4337O516j606J1n826p998j6028j4537p116r743j3767j4133l852N13L80
12263b2849L871O839Q665O846J1217O161J930P026J816K039m98L793j54L729n593
12248C4838m856K28K235m984o17J305L652j679j714l853L200m79K888J093l925
12233B7332j2350r551n313m836P060K569M348j210j742R07J091p434j766O673
12219E778k04o284M616k920K400j451l006N162P07m011K677Q098J1230K70m686
12204A8376K157K405k098p311m724j498L348K501m256L97k432l388L544M237M071
$$ plain form
12189 15329 17245 20950 21837 20551 15095 9055 11241 10079 3994 4569 7243 12217 8892 8776 11348
12174 11348 15644 8173 4161 2365 8542 15686 22539 17689 11202 8667 7829 9373 11337 13001 1858
12159 1858 5823 12509 6796 6695 9678 9953 10538 7546 501 -1502 2316 -4877 -11552 -9305 -7814
12144 -7814 -6865 -12455 -12348 -1374 4987 1758 5260 4439 4681 -2417 1573 2569 2483 -1684 325 -2244
12128 -2244 -1564 1081 2955 5870 7753 1523 -4239 -2999 -4298 -2347 -2037 -5131 3955 21507 33104
12113 33104 33354 30100 37243 35070 32944 31947 27230 22902 28767 25915 25733 23137 22595 23114 17100 17707
12097 17707 15087 17170 14799 13649 19407 18826 15326 12771 15126 12225 14591 15915 18039 16027 17076
12082 17076 20571 19257 21912 24378 22484 14134 11370 15209 17745 18934 19242 26782 29940 31054 26170
$$ packed form
12189A5329J916L705Q87j286n456o040K186j162o085N75K674M974l325j16K572
12174A1348M296p471m012j796O177P144O853m850o487k535q38J544J964J664j1143
12159A858L965O686n713j01K983K75N85k992p045k003L818p193o675K247J491
12144g814R49n590J07J0974O361l229L502q21K42p098L990R96q6m167K009k569
12128b244O80K645J874K915J883o230n762J240j299J951L10l094R086J7552J1597
12113C3104K50l254P143k173k126r97m717m328N865k852j82k596n42N19o014O07
12097A7707k620K083k371j150N758n81l500k555K355k901K366J324K124k012J049
12082A7076L495j314K655K466j894q350k764L839K536J189L08P540L158J114m884
$$ plain form
12067 26170 25380 27552 30708 35329 33981 32368 36165 31334 32104 36004 35457 31765 26116 22900 29870
12052 29870 27828 20599 14025 11910 10913 5563 8017 12236 15668 19586 19233 25782 27990 21671 20567
12037 20567 23968 24083 24512 21892 20858 18480 20379 19646 21277 25388 24222 23354 20013 25116 26609
12022 26609 31383 37317 36049 31147 32934 39402 46174 51732 58934 65344 63413 63555 60037 67636 77537
12007 77537 87225 100862 105000 108679 116788 130082 145367 158940 175954 199140 229134 275745
11995 275745 339731 416361 515647 624744 738553 853168 939705 983215 981698 943130 875732
11984 875732 807831 750986 729514 735992 770311 832077 924385 1054173 1226243 1454353 1751908
11973 1751908 2177339 2774017 3584104 4624785 5878540 7254461 8611668 9765081 10511366
$$ packed form
12067B6170p90K172L156M621j348j613L797m831P70L900n47l692n649l216O970
12052B9870k042p229o574k115r97n350K454M219L432L918l53O549K208o319j104
12037B0567L401J15M29k620j034k378J899p33J631M111j166q68l341N103J493
12022B6609M774N934j268m902J787O468O772N558P202O410j931J42l518P599R901
12007G7537R688J3637M138L679Q109J3294J5285J3573J7014K3186K9994M6611
11995B75745O3986P6630R9286J09097J13809J14615Q6537M3510j517l8568o7398
11984H75732o7901n6845k1472O478L4319O1766R2308J29788J72070K28110K97555
11973A751908M25431N96678Q10087J040681J253755J375921J357207J153413P46285
$$ plain form
11964 10511366 10706413 10318704 9411546 8146192 6716415 5305406 4055665 3042395
11956 3042395 2278319 1722343 1339723 1086896 914051 790017 696264 621019 547561 478915
11946 478915 411873 358017 308665 260256 222508 188723 160349 144403 125876 115019 107586 99210
11934 99210 81833 68158 64216 58886 58635 54662 54861 51930 47184 43828 42401 43854 35390 28135
11920 28135 28268 25574 23216 24850 28170 28293 29756 28436 23460 25068 26067 29015 22104 15656 17030
11905 17030 19692 18204 23438 23153 19177 18594 16958 14274 5058 521 7854 11608 12824 12342 9550
11890 9550 11149 19797 21697 17480 6975 3416 424 -2799 846 2674 5923 2643 4630 7555
11876 7555 1510 -4057 -4930 -5847 -3446 -5527 -7424 -5565 3357 4619 9902 12537 10660 9792 12193
$$ packed form
11964A0511366J95047l87709r07158j265354j429777j411009j249741j013270
11956C042395p64076n55976l82620k52827j72845j24034r3753p5245p3458o8646
11946D78915o7042n3856m9352m8409l7748l3785k8374j5946j8527j0857p433q376
11934I9210j7377j3675l942n330k51l973J99k931m746l356j427J453q464p255
11920B8135J33k694k358J634L320J23J463j320m976J608R99K948o911o448J374
11905A7030K662j488N234k85l976n83j636k684r216m537P333L754J216m82k792
11890I550J599Q648J900m217j0505l559k992l223L645J828L249l280J987K925
11876G555o045n567q73r17K401k081j897J859Q922J262N283K635j877q68K401
$$ plain form
11861 12193 15105 7084 1428 6364 12802 12697 16378 8431 484 33 1672 2741 12866 15701 12820
11846 12820 7421 6155 7678 7957 7902 5990 8833 9194 10999 16061 8944 -1390 -6107 -5478 -5872 -3349
11830 -3349 856 1027 -597 2477 4298 2219 -8933 -11849 -707 20 5535 13633 14371 24110 24521
11815 24521 17957 12632 7904 1333 -4243 -7263 -5729 -329 713 342 -5660 -11195 -8419 -4415 2797
11800 2797 7804 3786 -4088 -10881 -15762 -11464 -9700 -6823 1190 744 1490 5721 10582 7002 2558
11785 2558 10922 9016 6444 3649 2552 3239 6956 8844 3260 -2516 -2250 2113 12459 20542 14971
11770 14971 6057 -3834 -3528 172 4463 7949 6710 2430 4021 9706 16547 16007 7086 4216 5097
11755 5097 11195 7283 4614 7004 3653 1634 3575 4644 7093 4217 -58 429 6346 8420 6113
$$ packed form
11861A2193K912q021n656M936O438j05L681p947p947m51J639J069J0125K835k881
11846A2820n399j266J523K79n5j912K843L61J805N062p117j0334m717O29l94K523
11830c349M205J71j624L074J821k079j1152k916J1142P27N515Q098P38R739M11
11815B4521o564n325m728o571n576l020J534N400J042l71o002n535K776M004P212
11800B797N007m018p874o793m881M298J764K877Q013m46P46M231M861l580m444
11785B558Q364j906k572k795j097O87L717J888n584n776K66M363J0346Q083n571
11770A4971q914r891L06L700M291L486j239m280J591N685O841n40q921k870Q81
11755E097O098l912k669K390l351k019J941J069K449k876m275M87N917K074k307
$$ plain form
11740 6113 1500 6142 6004 7314 15226 15518 11188 10563 14615 16423 14399 9280 -563 -9701 -4357
11725 -4357 3051 1292 3213 4656 3365 -835 -8363 -5593 -1479 16 1608 468 -900 1187 3428
11710 3428 2073 613 310 1833 3513 3965 3856 -176 4144 16844 18659 13746 7074 5802 9297
11695 9297 12501 9530 10876 15737 11691 14062 15292 10440 1279 1435 717 -5630 -7316 -4986 -1835
11680 -1835 1487 1200 -5966 -12086 -11532 -9404 -2311 -726 -6441 -1967 -1904 -843 3864 10112 12922 10784
11664 10784 19104 22132 16464 13110 12320 15340 12358 9079 11716 14494 12537 14161 3314 578
11650 578 5202 6981 5499 8987 4063 3920 7801 11038 7323 5083 7677 8326 8352 6196 4218 6730
11634 6730 3399 5800 4649 6655 9595 12903 14055 13916 5799 8574 15753 15793 10442 4536 2462
$$ packed form
11740F113m613M642j38J310P912K92m330o25M052J808k024n119r843r138N344
11725d357P408j759J921J443j291m200p528K770M114J495J592j140j368K087K241
11710C428j355j460l03J523J680M52j09m032M320J2700J815m913o672j272L495
11695I297L204k971J346M861m046K371J230m852r161J56p18o347j686K330L151
11680a835L322k87p166o120N54K128P093J585n715M474O3J061M707O248K810k138
11664A0784Q320L028n668l354p90L020k982l279K637K778j957J624j0847k736
11650E78M624J779j482L488m924j43L881L237l715k240K594O49K6k156j978K512
11634F730l331K401j151K006K940L308J152j39q117K775P179M0n351n906k074
$$ plain form
11619 2462 4396 4406 6307 3339 -2890 885 11665 10867 4248 -4449 -6999 2778 12002 13869 8079
11604 8079 6983 6007 1855 2887 -2304 -2566 -1106 -1440 -1197 4564 8588 4194 4623 7843 5111 -374
11588 -374 -5023 -2802 2974 8506 9451 8643 6201 3553 4516 -2230 -3510 -4262 2993 13691 16213 7730
11572 7730 7443 12609 9348 11961 11781 13433 10673 5805 793 1795 3307 3146 402 3045 7291
11557 7291 9831 3551 6054 11674 11806 17416 19128 18175 18157 18669 17806 25388 31324 40077 50783 61045
11541 61045 71238 71747 72226 74775 69920 59993 46932 35779 32225 29295 22883 24847 27497 18983
11527 18983 16935 12521 6311 2634 -1534 30 1282 1589 -176 5357 7419 3818 2085 2640 2222
11512 2222 110 3892 6248 8932 9140 11621 13060 17865 20580 17696 16960 10667 13550 16440 19311
$$ packed form
11619B462J934J0J901k968o229L775J0780p98o619q697k550R777R224J867n790
11604H079j096r76m152J032n191k62J460l34K43N761M024m394M29L220k732n485
11588c74m649K221N776N532R45q08k442k648R63o746j280p52P255J0698K522q483
11572G730k87N166l261K613j80J652k760m868n012J002J512j61k744K643M246
11557G291K540o280K503N620J32N610J712r53j8N12q63P582N936Q753J0706J0262
11541F1045J0193N09M79K549m855r927j3061j1153l554k930o412J964K650q514
11527A8983k048m414o210l677m168J564J252L07j765N533K062l601j733N55m18
11512B222k112L782K356K684K08K481J439M805K715k884p36o293K883K890K871
$$ plain form
11497 19311 11361 4355 6845 13846 12395 6573 4128 -1502 -1418 -2812 -122 6614 11078 8360 11100
11482 11100 17267 13242 10549 7350 -4745 1348 10993 16217 16431 13494 10497 5481 1367 8370
11468 8370 13768 16286 14188 14940 17426 19941 20388 15222 14160 17383 20291 10883 14484 19786 13152
11453 13152 6291 11669 15984 22930 23889 20267 13272 9519 13551 15775 17745 15974 10641 7138 3468
11438 3468 5350 4529 5109 9211 15839 17375 15509 10344 13661 15484 13407 14824 14418 15039 16695 20313
11422 20313 19740 19410 21761 27548 28378 26863 25889 22940 24296 22869 15170 19772 18664 17472 11964
11407 11964 15250 22533 24969 15753 10148 12263 21739 17392 16095 11257 7513 -2723 -1708 4643
11393 4643 8292 12762 21576 24515 12079 1118 3906 4186 5566 9814 10023 20729 32315 31473
$$ packed form
11497A9311p950p006K490P001j451n822k445n630Q4j394K690O736M464k718K740
11482A1100O167m025k693l199j2095O093R645N224K14k937k997n016m114P003
11468H370N398K518k098P52K486K515M47n166j062L223K908r408L601N302o634
11453A3152o861N378M315O946R59l622o995l753M032K224J970j771n333l503l670
11438C468J882q21N80M102O628J536j866n165L317J823k077J417m06O21J656L618
11422B0313n73l30K351N787Q30j515r74k949J356j427p699M602j108j192n508
11407A1964L286P283K436r216n605K115R476m347j297m838l744j0236J015O351
11393D643L649M470Q814K939j2436j0961K788K80J380M248K09J0706J1586q42
$$ plain form
11379 31473 30212 34212 26899 15425 12153 16845 14269 16126 15438 13871 12858 19000 21317 25578
11365 25578 26456 28374 31025 29873 32859 34400 29424 29143 27759 27595 29343 30622 24484 9164 7094
11350 7094 15142 19970 19284 9022 11945 17654 14220 7036 2136 8369 11995 11061 12949 21413 31793
11335 31793 32252 29400 21313 16981 21678 32138 29458 25383 19196 18842 16224 23637 28380 22464 12790
11320 12790 8957 14008 9265 11425 16857 21455 23317 25517 26923 23560 17926 13167 15436 18690
11306 18690 18165 15106 13091 14010 14366 21040 17663 9797 12175 18168 18145 12344 19724 28820 35681 38211
11290 38211 34582 33708 40663 46892 48947 52460 54713 67087 83325 103829 123767 155053 209298
11277 209298 301072 418432 492514 472424 369885 256523 172868 123426 93571 76809 63708
$$ packed form
11379C1473j261M000p313j1474l272M692k576J857o88j567j013O142K317M261
11365B5578Q78J918K651j152K986J541m976k81j384j64J748J279o138j5320k070
11350G094Q048M828o86j0262K923N709l434p184m900O233L626r34J888Q464J0380
11335C1793M59k852q087m332M697J0460k680m075o187l54k618P413M743n916r674
11320A2790l833N051m743K160N432M598J862K200J406l363n634m759K269L254
11306A8690n25l059k015R19L56O674l377p866K378N993k3n801P380R096O861K530
11290C8211l629q74O955O229K055L513K253J2374J6238K0504J9938L1286N4245
11277B09298R1774J17360P4082k0090j02539j13362q3655m9442k9855j6762j3101
$$ plain form
11266 63708 55878 54191 55590 44404 39295 44298 49484 54098 51730 46618 48293 54771 63135 70246
11252 70246 77531 85501 90032 101926 132299 178570 256637 373847 469367 489798 407290 283816
11240 283816 189878 139308 110977 88782 73758 59295 46178 40652 40210 39355 38017 36828 29997
11227 29997 24791 26165 21854 18897 27112 39078 36417 24618 20121 21939 25183 25201 24639 23879 22775
11212 22775 11955 6491 18694 25389 27613 23793 21476 22121 20078 23494 26414 31478 36484 30488
11198 30488 24834 29902 29601 30817 30966 36082 35121 30681 19234 16731 19735 17221 16249 21143 21891
11183 21891 25652 30855 32424 35865 39596 38812 32497 25932 16204 16803 17689 12999 15239 19964 20682
11168 20682 26851 31447 32060 35821 31367 28531 28351 24183 29374 30557 29780 28771 37520 39150 38860
$$ packed form
11266F3708p830j687J399j1186n109N003N186M614k368n112J675O478Q364P111
11252G0246P285P970M531J1894L0373M6271P8067J17210R5520K0431q2508j23474
11240B83816r3938n0570k8331k2195j5024j4463j3117n526m42q55j338j189o831
11227B9997n206J374m311k957Q215J1966k661j1799m497J818L244J8n62p60j104
11212B2775j0820n464J2203O695K224l820k317O45k043L416K920N064N006n996
11198C0488n654N068l01J216J49N116r61m440j1447k503L004k514r72M894P48
11183B1891L761N203J569L441L731p84o315o565r728N99Q86m690K240M725P18
11168B0682O169M596O13L761m454k836j80m168N191J183p77j009Q749J630k90
$$ plain form
11153 38860 37898 35974 36483 37605 33864 34740 32634 33741 36001 30597 31062 27362 26858 28104 25844 28994
11137 28994 30552 31436 28241 21735 19810 25858 27561 26579 27709 25577 21872 16117 18933 23519 23524 26624
11121 26624 33659 30817 25858 24289 25893 22222 24490 23870 21007 26200 31190 35614 34078 33962 38651
11106 38651 40923 36739 33437 34000 36459 30730 31732 29786 24363 24110 23399 20048 22523 22584 24750 36681
11090 36681 46016 38589 40845 37963 30973 27549 29989 34200 35033 32733 35422 33632 38493 44885 41634
11075 41634 37069 37193 35471 35957 37273 30617 29881 36046 36937 34634 30709 36239 34500 33160 25845
11060 25845 24961 26952 34026 34470 31508 35075 34910 30570 29185 30123 28472 33413 38672 39173 40875 41138
11044 41138 36196 33105 32977 29630 29779 27165 26760 26446 22409 14075 15762 19852 16331 9076 15914
$$ packed form
11153C8860r62j924N09J122l741Q76k106J107K260n404M65l700n04J246k260L150
11137B8994J558Q84l195o506j925O048J703r82J130k132l705n755K816M586NL100
11121B6624P035k842m959j569J604l671K268o20k863N193M990M424j536j16M689
11106C8651K272m184l302N63K459n729J002j946n423k53p11l351K475O1K166J1931
11090C6681R335p427K256k882o990l424K440M211Q33k300K689j790M861O392l251
11075D1634m565J24j722M86J316o656p36O165Q91k303l925N530j739j340p315
11060B5845q84J991P074M44k962L567j65m340j385R38j651M941N259N01J702K63
11044D1138m942l091j28l347J49k614m05l14m037q334J687M090l521p255O838
$$ plain form
11029 15914 24885 26263 30492 33068 31367 32007 32294 34835 33429 34688 31464 36052 42640 42425 35799
11014 35799 36998 38783 32224 25609 31300 41781 48414 54868 57415 54544 52178 47957 44208 44912
11000 44912 43413 41328 39397 30290 25758 32032 33904 34674 45564 58596 66945 72113 71729 69310
10986 69310 57778 48130 36025 38801 43716 41353 40484 42448 38494 34149 33549 34354 34508 36336 32237
10971 32237 31562 33087 33950 35278 39992 46325 47844 44310 41793 35376 32401 29663 35577 42038 42779
10956 42779 40145 29865 33827 36082 36773 42916 46376 39959 42802 49387 50776 44529 38800 40682
10942 40682 41799 41002 48169 43692 45221 38931 34975 38941 39939 42589 49415 50906 47914 44885 37520
10927 37520 39022 46256 46822 45431 42867 48894 50284 42666 34914 33190 29314 28695 31807 35222 41866
$$ packed form
11029A5914Q971J378M229K576j701O40K87K541j406J259l224M588O588k15o626
11014C5799J199J785o559o615N691J0481O633O454K547k871k366m221l749P04
11000D4912j499k085j931r107m532O274J872P70J0890J3032Q349N168l84k419
10986F9310j1532r648j2105K776M915k363q69J964l954m345o00Q05J54J828m099
10971C2237o75J525Q63J328M714O333J519l534k517o417k975k738N914O461P41
10956D2779k634j0280L962K255O91O143L460o417K843O585J389o247n729J882
10942D0682J117p97P167m477J529o290l956L966R98K650O826J491k992l029p365
10927C7520J502P234N66j391k564O027J390p618p752j724l876o19L112L415O644
$$ plain form
10912 41866 45828 47170 50864 50337 44413 39771 37795 36519 32120 42217 49739 44821 35471 33157
10898 33157 34602 38118 41255 49974 57724 57823 48358 47091 53611 53480 58517 61591 56679 52920 53476
10883 53476 50003 51012 47506 54901 52190 45461 50541 49440 42396 41343 40789 45550 46626 52004 51965
10868 51965 53395 56910 60196 55987 49937 48865 51546 38993 42634 52384 52927 46470 44377 41808
10854 41808 38485 38065 39082 41971 50930 73234 85029 83440 75182 72507 79737 76719 60810 53507
10840 53507 39957 40341 50541 55960 55973 55888 55924 63757 68019 69280 73198 77771 78811 78073 81295 88373
10824 88373 94436 97722 95322 101788 107569 117754 136568 154470 167656 188247 216507 242208 276760
10811 276760 337337 427772 580436 826919 1182080 1586728 1824565 1721544 1369070 965774
$$ packed form
10912D1866L962J342L694n27n924m642j976j276m399J0097P522m918r350k314
10898C3157J445L516L137Q719P750R9r465j267O520j31N037L074m912l759N56
10883E3476l473J009l506P395k711o729N080j101p044j053n54M761J076N378l9
10868E1965J430L515L286m209o050j072K681j2553L641R750N43o457k093k569
10854D1808l323m20J017K889Q959K2304J1795j589q258k675P230l018j5909p303
10840E3507j3550L84J0200N419J3q5L6P833M262J261L918M573J040p38L222P078
10824H8373O063L286k400O466N781J0185J8814J7902J3186K0591K8260K5701L4552
10811B76760O0577R0435J52664K46483L55161M04648K37837j03021l52474m03296
$$ plain form
10801 965774 657892 463483 351723 279607 224958 197923 177445 160930 143809 130185 120653
10790 120653 110443 100664 99404 107178 111101 104020 101380 102252 99263 99071 98527 91163 79522 72152
10776 72152 71077 76642 79702 79676 73429 71795 75669 83212 89303 90633 95226 98614 96867 91340 90018
10761 90018 83327 76458 75620 72555 72224 70468 79106 85805 91038 89806 80489 68641 56998 50747
10747 50747 43552 42159 48591 58033 58096 63605 67748 69516 72448 75103 71816 66802 73689 73039 68890
10732 68890 70075 62888 64731 66499 65383 66307 65672 68440 75042 83503 87190 92192 91768 87203 81994
10717 81994 73464 71554 75464 74512 78056 84098 84906 77163 71464 79920 83416 80803 74832 76823 77495
10702 77495 65483 62370 60334 55951 52175 49137 46634 48206 39553 23527 22008 24547 31970 61919
$$ packed form
10801I65774l07882j94409j11760p2116n4649k7035k0478j6515j7121j3624r532
10790A20653j0210r779j260P774L923p081k640Q72k989j92n44p364j1641p370
10776G2152j075N565L060k6o247j634L874P543O091J330M593L388j747n527j322
10761I0018o691o869q38l065l31j756Q638O699N233j232r317j1848j1643o251
10747E0747p195j393O432R442O3N509M143J768K932K655l287n014O887o50m149
10732F8890J185p187J843J768j116R24o35K768O602Q461L687N002m24m565n209
10717H1994q530j910L910r52L544O042Q08p743n699Q456L496k613n971J991O72
10702G7495j2012l113k036m383l776l038k503J572q653j6026j519K539P423K9949
$$ plain form
10688 61919 87540 105578 113274 110680 117141 125079 122827 118246 109735 106402 102502 100063 101532 101301
10674 101301 100981 96702 95901 90606 89564 96083 98697 96132 94083 96815 100521 104100 105268 108296 110979
10659 110979 120915 127252 121266 112127 109301 103572 104137 103515 113016 115295 111748 116547 121481 128837 143293
10644 143293 162728 185341 225351 278475 339184 370524 345785 284864 225906 183771 157051
10633 157051 130285 110687 104088 105802 107010 107707 110737 116266 123173 134548 136797 135517 131315 116028
10619 116028 107625 104046 105828 105566 109297 119155 128190 128957 126953 116975 113791 98683 96009 102044
10605 102044 102872 100661 103752 111238 112377 111504 112804 121665 131006 130627 129616 127930 130066 125168 118826
10590 118826 129132 141203 163706 182061 198538 199630 183217 167447 149256 137336 138000 136040
$$ packed form
10688F1919K5621J8038P696k594O461P938k252m581q511l333l900k439J469k31
10674A01301l20m279q01n295j042O519K614k565k049K732L706L579J168L028K683
10659A10979R936O337n986r139k826n729N65o22R501K279l547M799M934P356J4456
10644A43293J9435K2613M0010N3124O0709L1340k4739o0921n8958m2135k6720
10633A57051k6766j9598o599J714J208O97L030N529O907J1375K249j280m202j5287
10619A16028q403l579J782k62L731R858R035P67k004r978l184j5108k674O035
10605A02044Q28k211L091P486J139q73J300Q861R341l79j011j686K136m898o342
10590A18826J0306J2071K2503J8355J6477J092j6413j5770j8191j1920O64j960
$$ plain form
10578 136040 135913 145383 159454 161971 161484 162956 162158 154689 151229 148130 139216 133166 135540 147362
10564 147362 160125 164613 178442 198902 228767 258954 291897 326730 350623 348226 321344 292114
10552 292114 266932 242746 223916 210603 209017 209962 217117 221217 212892 212403 223354 233763 254917
10539 254917 281738 297499 287921 254892 219685 200424 187117 179326 176653 174155 168447 163609 164878
10526 164878 169338 161354 156941 152339 156559 160976 163630 172787 181679 179924 182602 183931 202426 248433
10512 248433 298121 323903 316959 286697 260204 254071 245541 235170 228307 226877 222971 218973 220002
10499 220002 228844 238931 238789 240945 244878 257125 273682 287015 304215 317051 322093 325786 333309
10486 333309 348722 366631 369611 366922 373082 370206 367072 370262 381422 389308 393335 391539 394765
$$ packed form
10578A36040j27R470J4071K517m87J472p98p469l460l099q914o050K374J1822
10564A47362J2763M488J3829K0460K9865L0187L2943L4833K3893k397k6882k9230
10552B92114k5182k4186j8830j3313j586R45P155M100q325m89J0951J0409K1154
10539B54917K6821J5761r578l3029l5207j9261j3307p791k673k498n708m838J269
10526A64878M460p984m413m602M220M417K654R157Q892j755K678J329J8495M6007
10512B48433M9688K5782o944l0262k6493o133q530j0371o863j430l906l998J029
10499B20002Q842J0087j42K156L933J2247J6557J3333J7200J2836N042L693P523
10486C33309J5413J7909K980k689O160k876l134L190J1160P886M027j796L226
$$ plain form
10473 394765 396338 401747 405862 414812 412028 409586 399819 394723 397951 402044 426844 455060 482694
10460 482694 502195 514646 529160 533664 535806 537992 549345 559417 571307 588253 610352 653524
10448 653524 691612 728903 751276 753323 742137 738661 746289 777619 803471 818912 838382 869897
10436 869897 922018 988522 1068673 1138764 1205107 1264410 1303145 1333935 1375423 1423295 1470848
10425 1470848 1531131 1578945 1632765 1701283 1791925 1909318 2041035 2170399 2299506 2440099
10415 2440099 2596582 2772815 2975796 3205283 3474163 3823640 4281207 4854241 5553639
10406 5553639 6423922 7416098 8343628 9107133 9874949 10923266 12483970 14707338 17724775
10397 17724775 21658134 26555595 32395280 39212983 47691686 59622651 78056694 107872984
$$ packed form
10473C94765J573N409M115Q950k784k442r767n096L228M093K4800K8216K7634
10460D82694J9501J2451J4514M504K142K186J1353J0072J1890J6946K2099M3172
10448F53524L8088L7291K2373K047j1186l476P628L1330K5852J5441J9470L1515
10436H69897N2121O6504Q0151P0091O6343N9303L8735L0790M1488M7872M7553
10425A470848O0283M7814N3820O8518R0642J17393J31717J29364J29107J40593
10415B440099J56483J76233K02981K29487K68880L49477M57567N73034O99398
10406E553639Q70283R92176R27530P63505P67816J048317J560704K223368L017437
10397A7724775L933359M897461N839685O817703Q478703J1930965J8434043K9816290
$$ plain form
10389 107872984 156114685 226295910 299554861 332490803 303247498 233160378 159053275
10382 159053275 105049804 72154878 52504182 40034559 31479502 25245922 20551832
10375 20551832 16973524 14230128 12121822 10529202 9362541 8574273 8096287 7711821
10367 7711821 7133630 6293436 5359886 4546171 3954237 3520532 3157214 2830740 2546712
10358 2546712 2306637 2092815 1895490 1716155 1568525 1457161 1367480 1282267 1198080 1111629
10348 1111629 1030007 957551 899003 856919 825746 785878 730802 672269 633290 607140 604500
10337 604500 619762 627390 617330 591939 555028 528478 513655 510070 499808 473921 445374 423437
10325 423437 425958 441663 455594 470914 473713 467487 455228 439256 422077 404130 376147 352348
$$ packed form
10389A07872984M8241701P0181225P3258951L2935942k9243305p0087120p4107103
10382A59053275n4003471l2894926j9650696j2469623q555057o233580m694090
10375B0551832l578308k743396k108306j592620j166661p88268m77986l84466
10367G711821n78191q40194r33550q13715n91934m33705l63318l26474k84028
10358B546712k40075k13822j97325j79335j47630j11364q9681q5213q4187q6451
10348A111629q1622p2456n8548m2084l1173l9868n5076n8533l8979k6150k640
10337F04500J5262P628j0060k5391l6911k6550j4823l585j0262k5887k8547k1937
10325D23437K521J5705J3931J5320K799o226j2259j5972j7179j7947k7983k3799
$$ plain form
10313 352348 333739 323464 314675 307777 307769 305165 297054 280957 268060 245189 222237 210313 205207
10300 205207 205814 205884 200906 189695 173292 171021 176621 182248 183617 179331 170874 167033 157510 152675
10286 152675 147951 149616 152849 155636 156183 158313 157421 156697 159034 158731 158838 164759 165503 165506 161640 160130
10270 160130 155489 154796 151076 145193 140621 138822 143797 158585 165967 155450 147662 148886 163990 171839
10256 171839 169435 169557 164976 158762 159125 157114 160859 171138 178742 172785 167083 160761 154278 149327
10242 149327 140754 137047 131349 115865 96215 68016 42958 26911 35996 44340 57778 70901
10230 70901 86568 92921 95877 101371 107841 120266 130275 138186 157653 165805 165789 149216 129333
10217 129333 121200 122133 126386 132526 138059 146870 148628 154304 157590 163258 171966 178530 182243 181464 182409
$$ packed form
10313C52348j8609j0275q789o898qk604q111j6097j2897k2871k2952j1924n106
10300B05207O07P0m978j1211j6403k271N600N627J369m286q457l841r523m835
10286A52675m724J665L233K787N47K130q92p24K337l03J07N921P44Ll866j510
10270A60130m641o93l720n883m572j799M975J4788P382j0517p788J224J5104P849
10256A71839k404J22m581o214L63k011L745J0279P604n957n702o322o483m951
10242A49327q573l707n698j5484j9650k8199k5058j6047R085Q344J3438J3123
10230G0901J5667O353K956N494O470J2425J0009P911J9467Q152j6j6573j9883
10217A29333q133R33M253O140N533Q811J758N676L286N668Q708O564L713p79R45
$$ plain form
10202 182409 179876 174132 174225 188598 200450 225893 263429 301913 338125 372000 408319 457635
10190 457635 526043 623026 755089 927075 1134114 1335087 1497630 1586850 1571633 1471077
10180 1471077 1294035 1097201 922163 777216 663585 579217 524127 486206 467084 461596
10170 461596 454511 455628 466347 474051 480913 494862 523368 558112 587574 640927 707096 790634
10158 790634 883921 1008091 1166645 1339734 1516256 1685021 1851601 2042132 2317201 2712419
10148 2712419 3232189 3904008 4726079 5729133 7050429 8965112 12002178 16972726 24699155
10139 24699155 34638595 43819291 47634542 43810675 34615856 24345226 16254345 10995433
10131 10995433 7848374 5900728 4601135 3684417 3012950 2513248 2144851 1877585 1696406
$$ packed form
10202A82409k533n744R3J4373J1852K5443L7536L8484L6212L3875L6319M9316
10190D57635O8408R6983J32063J71986K07039K00973J62543Q9220j5217j00556
10180A471077j77042j96834j75038j44947j13631q4368n5090l7921j9122n488
10170D61596p085J117J0719P704O862J3949K8506L4744K9462N3353O6169Q3538
10158G90634R3287J24170J58554J73089J76522J68765J66580J90531K75069L95218
10148B712419N19770O71819Q22071J003054J321296J914683L037066M970548P726429
10139B4699155R939440R180696L815251l823867r194819j0270630q090881n258912
10131A0995433l147059j947646j299593r16718o71467m99702l68397k67266j81179
$$ plain form
10122 1696406 1580604 1498365 1414572 1292955 1144231 989472 843582 726989 642585 566206
10112 566206 503250 449913 410923 382800 353704 320612 291174 265195 247608 237284 226381
10101 226381 212299 196953 178111 157965 144184 131046 121659 115233 104063 89831 81787 81501
10089 81501 84849 91675 101816 117705 135086 152861 175019 193952 210942 206901 186224 169264
10077 169264 161108 161553 163763 159524 156663 155421 144968 136113 123777 117154 112313 109463 107788 104320
10063 104320 105749 104987 108165 116563 128755 131761 125790 121926 121718 122394 120821 115069 115427 115124 111321
10048 111321 116046 120692 129286 138320 146154 155140 176212 206127 234439 261736 279994 288904 288980
10035 288980 275600 252897 227009 200158 173428 153340 137478 131857 135744 142600 144130 139418
$$ packed form
10122A696406j15802q2239q3793j21617j48724j54759j45890j16593q4404p6379
10112E66206o2956n3337l8990k8123k9096l3092k9438k5979j7587j0324j0903
10101B26381j4082j5346j8842k0146j3781j3138r387o426j1170j4232q044k86
10089H1501L348O826J0141J5889J7381J7775K2158J8933J6990m041k0677j6960
10077A69264q156M45K210m239k861j242j0453q855j2336o623m841k850j675l468
10063A04320J429p62L178Q398J2192L006n971l864k08O76j573n752L58l03l803
10048A11321M725M646Q594R034P834Q986K1072K9915K8312K7297J8258Q910P6
10035B88980j3380k2703k5888k6851k6730k0088j5862n621L887O856J530m712
$$ plain form
10023 139418 136361 127247 109018 108057 107155 103369 93004 94063 93728 94019 97177 99062 92745 91914 98687
10008 98687 108059 104660 98723 101471 101409 105919 114824 114882 107568 101176 97171 99295 99305 99318 99939 107210 113563
9991 113563 113703 113066 114590 120923 126634 135089 139092 145666 153400 158494 165486 170273 167399 162890 164788
9976 164788 173951 181930 192098 205843 224644 248003 277894 311280 354031 406487 489791 627775
9964 627775 863554 1217184 1625776 1868457 1772823 1419554 1014262 704638 509906 395887
9954 395887 329207 279795 240029 209705 183431 165822 160764 159821 163903 164550 170574 184762 190038
9941 190038 191912 199074 204638 212863 222021 222499 219213 217394 222654 207775 183324 164176 143779 126034
9927 126034 117206 109152 98110 96820 95837 101188 116447 125836 129312 135939 138957 144906 150317 160658
$$ packed form
10023A39418l057r114j8229r61r02l786j0365J059l35K91L158J885o317q31O773
10008I8687R372l399n937K748o2M510Q905N8p314o392m005K124J0J3O21P271O353
9991A13563J40o37J524O333N711Q455M003O574P734N094O992M787k874m509J898
9976A64788R163P979J0168J3745J8801K3359K9891L3386M2751N2456Q3304J37984
9964F27775K35779L53630M08592K42681r5634l53269m05292l09624j94732j14019
9954C95887o6680m9412l9766l0324k6274j7609n058r43M082O47O024J4188N276
9941A90038J874P162N564Q225R158M78l286j819N260j4879k4451j9148k0397j7745
9927A26034q828q054j1042j290r83N351J5259R389L476O627L018N949N411J0341
$$ plain form
9913 160658 178207 191739 201518 218445 226791 221785 220555 221107 216095 213951 207197 202856 200849 203520
9899 203520 205980 206927 204941 201437 203236 205193 213513 222167 229223 236884 245074 252522 260994 265091 277512
9884 277512 284756 287400 285758 292974 299018 300791 301426 306215 304880 304654 312933 317623 321525 328010 325183
9869 325183 322620 318192 310871 307215 304892 308685 310404 317638 330062 344360 358234 376005 391091
9856 391091 405654 423192 429852 432226 440751 452394 467528 480000 496954 529146 553263 570749
9844 570749 582703 592199 603839 624892 645461 669242 706390 741953 780262 824991 876707 917545
9832 917545 960164 1001507 1028997 1052416 1084298 1128128 1180742 1227757 1276523 1329928 1393433 1462592
9820 1462592 1535224 1623066 1718931 1825350 1944259 2073027 2222541 2400306 2603093 2857183
$$ packed form
9913A60658J7549J3532R779J6927Q346n006j230N52n012k144o754m341k007K671
9899B03520K460R47j986l504J799J957Q320Q654P056P661Q190P448Q472M097J2421
9884B77512P244K644j642P216O044J773O35M789j335k26Q279M690L902O485k827
9869C25183k563m428p321l656k323L793J719P234J2424J4298J3874J7771J5086
9856C91091J4563J7538O660K374Q525J1643J5134J2472J6954L2192K4117J7486
9844E70749J1954R496J1640K1053K0569K3781L7148L5563L8309M4729N1716M0838
9832I17545M2619M1343K7490K3419L1882M3830N2614M7015M8766N3405O3505O9159
9820A462592P2632Q7842R5865J06419J18909J28768J49514J77765K02787K54090
$$ plain form
9810 2857183 3168477 3559621 4049602 4639134 5306337 6053994 6881069 7765501 8729275 9824071
9800 9824071 11088973 12548545 14343752 16547526 19281169 22760109 27244498 33294612
9792 33294612 41921163 54835309 73944569 99492829 131782634 168798092 201528877
9785 201528877 228013858 242866675 239352942 223603882 196268680 162582897 129145639
9778 129145639 99315410 75446911 57346270 44009537 34330593 27149284 21828397
9771 21828397 17991332 15220546 13196539 11676749 10445752 9403496 8504662 7685115
9763 7685115 6941413 6216608 5523592 4872722 4252249 3699502 3206054 2785818 2428585 2140758
9753 2140758 1903477 1706750 1533031 1394222 1277486 1171782 1086462 1008629 933267 860608
$$ packed form
9810B857183L11294L91144M89981N89532O67203P47657Q27075Q84432R63774J094796
9800I824071J264902J459572J795207K203774K733643L478940M484389O050114
9792C3294612Q626551J2914146J9109260K5548260L2289805L7015458L2730785
9785B01528877K6484981J4852817l513733j5749060k7335202l3685783l3437258
9778A29145639k9830229k3868499j8100641j3336733r678944p181309n320887
9771B1828397l837065k770786k024007j519790j230997j042256q98834q19547
9763G685115p43702p24805o93016o50870o20473n52747m93448m20236l57233k87827
9753B140758k37281j96727j73719j38809j16736j05704q5320p7833p5362p2659
$$ plain form
9743 860608 791618 737788 687915 639496 603930 572330 548724 531381 516235 501000 483071 468885
9731 468885 456255 445158 424947 405827 387633 365603 357729 350955 344317 342961 344821 344396 351491
9718 351491 363195 376206 395877 409826 415720 413034 404011 389534 360778 328384 300445 279606
9706 279606 263811 246973 233446 215665 194591 186710 177426 159879 141997 143975 145551 142845 136038
9693 136038 118394 106730 102176 102941 93867 85368 79784 80586 82693 90211 99421 106149 108322 109058 107499
9678 107499 108891 117073 124977 125689 121076 122237 122272 124785 123077 121929 116342 116009 109700 107687 92785
9663 92785 83360 77629 78378 74996 85399 88247 84570 98292 106843 112685 118174 122058 124797 127914
9649 127914 126755 121676 118243 115693 107560 103171 93064 89113 84825 86345 78217 65052 52392 41587
$$ packed form
9743H60608o8990n3830m9873m8419l5566l1600k3606j7343j5146j5235j7929j4186
9731D68885j2630j1097k0211j9120j8194k2030p874o774o638j356J860m25P095
9718C51491J1704J3011J9671J3949N894k686r023j4477k8756l2394k7939k0839
9706B79606j5795j6838j3527j7781k1074p881r284j7547j7882J978J576k706o807
9693A36038j7644j1664m554P65r074q499n584Q02K107P518R210O728K173P36j559
9678A07499J392Q182P904P12m613J161L5K513j708j148n587l33o309k013j4902
9663I2785r425n731P49l382J0403K848l677J3722Q551N842N489L884K739L117
9649A27914j159n079l433k550q133m389j0107l951m288J520q128j3165j2660j0805
$$ plain form
9635 41587 34476 19699 -5682 -24281 -25613 -22612 -8555 -3650 -2601 2462 6071 23672 41640
9622 41640 50902 58021 57235 57158 53594 54797 57137 55173 53927 49726 56570 70284 84767 92649 98257
9607 98257 103461 108406 105642 92056 73770 61309 59110 50417 48211 38925 27330 26916 31144 24806
9593 24806 28323 32282 39037 40229 33195 24430 15056 11604 3147 7088 15140 18358 27812 43520
9579 43520 65839 89955 118519 144211 157145 166170 170588 171736 184146 208767 236407 275724
9567 275724 342739 447293 599154 716934 711866 634359 545011 491279 455013 398786 337479
9556 337479 282993 250516 232471 229281 245003 280136 350066 424525 480720 526304 594410 669802
9544 669802 712869 706806 674613 648963 627514 605733 580049 554772 538525 531222 531617 531311 518805
$$ packed form
9635D1587p111j4777k5381j8599j332L001J4057M905J049N063L609J7601J7968
9622D1640R262P119p86p7l564J203K340j964j246m201O844J3714J4483P882N608
9607I8257N204M945k764j3586j8286j2461k199q693k206r286j1595m14M228o338
9593B4806L517L959O755J192p034q765r374l452q457L941Q052L218R454J5708
9579D3520K2319K4116K8564K5692J2934R025M418J148J2410K4621K7640L9317
9567B75724O7015J04554J51861J17780n068p7507q9348n3732l6266n6227o1307
9556C37479n4486l2477j8045l190J5722L5133O9930P4459N6195M5584O8106P5392
9544F69802M3067o063l2193k5650k1449k1781k5684k5277j6247p303L95l06j2506
$$ plain form
9531 518805 492898 488528 514533 571023 674987 813047 1016590 1317763 1711704 2019757 2001307
9520 2001307 1688808 1284416 962527 751157 614923 515154 449123 416400 417257 446073 478555
9509 478555 498234 489863 474787 493565 536841 582823 612710 634858 663635 686506 691907 654513
9497 654513 594354 532055 453169 363344 291914 242611 211677 197500 193225 208266 239300 285556
9485 285556 343496 399197 445531 506617 599689 695366 692873 582531 445887 338686 278126
9474 278126 242542 218582 188865 187063 188587 187873 176976 151629 130748 103622 86801 72578
9462 72578 57950 44253 42010 41980 48543 48375 45615 39591 35686 41887 43844 41247 43417 39360 39645
9447 39645 45100 50945 56980 56273 53549 54395 57903 61945 67089 68892 74265 79888 82667 80028 77766
$$ packed form
9531E18805k5907m370K6005N6490J03964J38060K03543L01173L93941L08053j8450
9520B001307l12499m04392l21889k11370j36234r9769o6031l2723Q57K8816L2482
9509D78555J9679q371j5076J8778M3276M5982K9887K2148K8777K2871N401l7394
9497F54513o0159o2299p8886q9825p1430m9303l0934j4177m275J5041L1034M6256
9485B85556N7940N5701M6334O1086R3072R5677k493j10342j36644j07201o0560
9474B78126l5584k3960k9717j802J524p14j0897k5347k0881k7126j6821j4223
9462G2578j4628j3697k243l0O563j68k760o024l905O201J957k597K170m057K85
9447C9645N455N845O035p07k724Q46L508M042N144J803N373N623K779k639k262
$$ plain form
9432 77766 68272 59416 48872 43690 39873 38304 39249 39890 37007 41882 50323 52412 50546 46093 46088 42065
9416 42065 37376 38296 49070 52498 55580 55652 57413 57989 58697 59382 58275 60758 54556 55572 59310 69149
9400 69149 64284 58941 68541 82436 91592 94961 102348 107170 110726 125655 154610 183000 211716
9387 211716 262278 342468 458391 598980 785749 992395 1178386 1323354 1388517 1348193
9377 1348193 1235431 1068369 881740 694683 537303 413866 323650 258229 208003 168666
9367 168666 146617 137690 127187 108600 104098 94425 89732 83246 84223 81855 74862 70197 65702 63003
9353 63003 57992 53760 50541 53284 49428 52909 53290 48368 42536 40907 33864 39003 47968 47143 50631
9338 50631 46944 42367 35913 36214 43263 47359 48867 50163 46359 41094 45200 47980 43292 33217 27454
$$ packed form
9432G7766r494q856j0544n182l817j569R45O41k883M875Q441K089j866m453nm023
9416D2065m689R20J0774L428L082P2J761N76P08O85j107K483o202J016L738R839
9400F9149m865n343R600J3895R156L369P387M822L556J4929K8955K8390K8716
9387B11716N0562Q0190J15923J40589J86769K06646J85991J44968O5163m0324
9377A348193j12762j67062j86629j87057j57380j23437r0216o5421n0226l9337
9367A68666k2049q927j0503j8587m502r673m693o486R77k368o993m665m495k699
9353F3003n011m232l219K743l856L481L81m922n832j629p043N139Q965q25L488
9338E0631l687m577o454L01P049M096J508J296l804n265M106K780m688j0075n763
$$ plain form
9323 27454 24286 28294 28855 30835 42624 43661 46408 54897 61692 65958 68080 65483 67104 65002 65203
9308 65203 63226 56779 55209 57461 48801 48521 47579 45006 47914 48370 50407 53960 48646 44949 48972
9293 48972 50725 43331 44488 50172 49689 46455 46538 51102 56172 54393 52396 48929 45870 45374 43731 44904
9277 44904 50726 59923 54328 53749 53802 58031 60814 58835 58589 59867 60385 61681 64129 65523 72391 81237
9261 81237 83161 79759 73659 74698 78078 81918 86798 85862 87492 83712 82729 83940 79417 77461 76430
9246 76430 77022 78931 75592 73058 66867 69149 66882 67956 66695 64707 65368 65376 61800 63712 70773 74510
9230 74510 74232 77749 91067 104214 108822 112719 112063 104638 101351 87381 79808 78483 81130 83014
9216 83014 79911 80057 77074 78805 76293 81802 93145 91530 94323 91444 88023 92913 95775 94560 87770
$$ packed form
9323B7454l168M008N61J980J1789J037K747Q489O795M266K122k597J621k102K01
9308F5203j977o447j570K252q660k80r42k573K908M56K037L553n314l697M023
9293D8972J753p394J157N684m83l234Q3M564N070j779j997l467l059m96j643J173
9277D4904N822R197n595n79N3M229K783j979k46J278N18J296K448J394O868Q846
9261H1237J924l402o100J039L380L840M880r36J630l780r83J211m523j956j031
9246G6430N92J909l339k534o191K282k267J074j261j988O61Ql576J912P061L737
9230G4510k78L517J3318J3147M608L897o56p425l287j3970p573j325K647J884
9216H3014l103J46k983J731k512N509J1343j615K793k879l421M890K862j215o790
$$ plain form
9201 87770 86189 92776 93849 92594 85944 79357 75404 83596 95607 93982 89555 91300 95428 100536
9187 100536 108875 111382 100283 96435 105016 104812 95349 89425 91306 86784 82282 84055 86180 85680 83341
9172 83341 86401 98000 101798 99537 100990 99864 98901 95181 95951 97629 98762 100616 102055 94735 91954
9157 91954 93250 90696 92034 99905 99338 102262 98131 99326 103223 106356 108052 109443 113057 113761 114377
9142 114377 125499 132525 137626 140069 142325 143207 141942 133873 134033 123015 119109 114200 112668 108539
9128 108539 111505 114855 124270 121835 116239 114645 117754 120356 119462 116720 110052 107861 115063 116291 116211
9113 116211 117966 119794 120050 122216 125691 122363 121015 121872 118716 118623 123397 125594 122638 126298 131687
9098 131687 131165 133210 137625 138886 144546 140018 132999 133140 125761 128168 138513 144723 140464 134844 135958
$$ packed form
9201H7770j581O587J073j255o650o587l953Q192J2011j625m427J745M128N108
9187A00536Q339K507j1099l848Q581k04r463n924J881m522m502J773K125n00k339
9172H3341L060J1599L798k261J453j126r63l720P70J678J133J854J439p320k781
9157I1954J296k554J338P871n67K924m131J195L897L133J696J391L614P04O16
9142A14377J1122P026N101K443K256Q82j265q069J60j1018l906m909j532m129
9128A08539K966L350R415k435n596j594L109K602q94k742o668k191P202J228q0
9113A16211J755J828K56K166L475l328j348Q57l156r3M774K197k956L660N389
9098A31687n22K045M415J261N660m528p019J41p379K407J0345O210m259n620J114
$$ plain form
9083 135958 142053 149514 151033 148417 144630 143312 152325 155656 153538 150275 154697 158099 157301 154848 157217
9068 157217 161981 151898 145708 145687 153261 160042 158070 157651 156624 158542 162951 168212 168690 180178 187077
9053 187077 173575 166985 163223 170610 183346 182783 180885 181130 178058 180000 180794 177959 174680 173577 178001
9038 178001 185424 183295 177493 181380 192905 196611 193451 188737 190150 189221 189873 187765 191081 196157 198031
9023 198031 192313 194780 199346 200142 202986 206041 201622 197876 198600 199568 201829 201880 203673 205453 200884 206743
9007 206743 211326 216022 215053 214781 223505 228275 225377 222224 224596 220188 216063 219251 218398 224865 238722
8992 238722 245356 258276 263161 262857 253823 244028 247108 254957 252643 249463 250947 248666 255146 257972
8978 257972 256003 257654 258944 264963 264387 262763 258926 256997 255264 255425 265530 273550 280783 292468
$$ packed form
9083A35958O095P461J519k616l787j318R013L331k118l263M422L402p98k453K369
9068A57217M764j0083o190k1P574O781j972m19j027J918M409N261M78J1488O899
9053A87077j3502o590l762P387J2736n63j898K45l072J942P94k835l279j103M424
9038A78001P423k129n802L887J1525L706l160m714J413r29O52k108L316N076J874
9023A98031n718K467M566P96K844L055m419l746P24R68K261N1J793J780m569N859
9007B06743M583M696r69k72Q724M770k898l153K372m408m125L188q53O467J3857
8992B38722O634J2920M885l04r034r795L080P849k314l180J484k281O480K826
8978B57972j969J651J290O019n76j624l837j929j733J61J0105Q020P233J1685
$$ plain form
8964 292468 298188 290376 287288 284812 284514 284672 285770 289868 296511 294383 296010 299387 305232 312960 313539
8949 313539 311960 313726 314070 315444 321892 329530 335424 342117 344141 337866 338286 347174 348568 349315 352822
8934 352822 356927 355526 357473 364603 367593 373653 379594 379033 381163 386814 388478 391619 392793 395090 403416
8919 403416 405275 407299 416873 417531 415079 419454 419966 418926 418959 423943 427208 430088 433519 438448 448089
8904 448089 455618 459742 469185 473684 475032 474783 481888 487236 492286 495749 495267 504652 511661 519089 532055
8889 532055 540742 539958 544233 549359 554155 554134 564825 580325 588356 602836 613205 621477 629162 635318
8875 635318 641006 647021 652716 664622 679350 697617 710759 732225 751119 771936 793554 827559
8863 827559 870602 934044 1022217 1170395 1379347 1564769 1591689 1456647 1259593 1102997
$$ packed form
8964B92468N720p812l088k476k98J58J098M098O643k128J627L377N845P728N79
8949C13539j579J766L44J374O448P638N894O693K024o275M20Q888J394P47L507
8934C52822M105j401J947P130K990O060N941n61K130N651J664L141J174K297Q326
8919D03416J859K024R574O58k452M375N12j040L3M984L265K880L431M929R641
8904D48089P529M124R443M499J348k49P105N348N050L463m82R385P009P428J2966
8889E32055Q687p84M275N126M796k1J0691J5500Q031J4480J0369Q272P685O156
8875F35318N688O015N695J1906J4728J8267J3142K1466J8894K0817K1618L4005
8863H27559M3043O3442Q8173J48178K08952J85422K6920j35042j97054j56596
$$ plain form
8853 1102997 1012417 955958 927863 912632 909558 910956 912461 919364 925696 931865 940914 945162 946928
8840 946928 945038 958503 976426 985624 997822 1010986 1026181 1037602 1048058 1065012 1083470 1100403
8828 1100403 1113203 1129003 1144269 1159004 1179813 1199217 1216190 1233152 1241889 1253667 1276605 1300031
8816 1300031 1324065 1346989 1370839 1396425 1418758 1430926 1456033 1474578 1501468 1527407 1550491
8805 1550491 1581189 1609062 1636548 1658598 1689699 1725003 1753535 1784072 1814443 1845204 1881011
8794 1881011 1914540 1950326 1988331 2025621 2060981 2097146 2134144 2173056 2213293 2249868 2287694
8783 2287694 2328607 2372383 2417755 2460127 2510705 2565549 2616577 2669087 2724910 2778983 2834304
8772 2834304 2888286 2942275 3000938 3066332 3126916 3193285 3252206 3315478 3379760 3446212 3508839
$$ packed form
8853A102997r0580n6459k8095j5231l074J398J505O903O332O169R049M248J766
8840I46928j890J3465J7923R198J2198J3164J5195J1421J0456J6954J8458J6933
8828A100403J2800J5800J5266J4735K0809J9404J6973J6962Q737J1778K2938K3426
8816A300031K4034K2924K3850K5586K2333J2168K5107J8545K6890K5939K3084
8805A550491L0698K7873K7486K2050L1101L5304K8532L0537L0371L0761L5807
8794A881011L3529L5786L8005L7290L5360L6165L6998L8912M0237L6575L7826
8783B287694M0913M3776M5372M2372N0578N4844N1028N2510N5823N4073N5321
8772B834304N3982N3989N8663O5394O0584O6369N8921O3272O4282O6452O2627
$$ plain form
8761 3508839 3580964 3657241 3729865 3809602 3879666 3958258 4035674 4111672 4190189 4274337 4357384
8750 4357384 4441620 4525981 4615733 4708231 4799239 4886380 4973709 5066834 5150159 5233003 5324837
8739 5324837 5416825 5502785 5591770 5673754 5761238 5841812 5922713 5999518 6075983 6153911 6232085
8728 6232085 6300338 6368753 6426732 6484852 6540870 6588806 6633493 6676951 6710212 6738491 6762063
8717 6762063 6787042 6801576 6814619 6827628 6828266 6821866 6813696 6802258 6777381 6752383 6723601 6699446
8705 6699446 6652663 6601798 6552389 6505125 6448147 6381001 6308414 6229006 6158982 6087860 6017458
8694 6017458 5932925 5841424 5760877 5680693 5587652 5498362 5413348 5322750 5234950 5134971 5044184
8683 5044184 4961853 4872831 4779534 4692582 4604901 4515223 4437670 4359622 4279387 4192162 4106420
$$ packed form
8761C508839P2125P6277P2624P9737P0064P8592P7416P5998P8517Q4148Q3047
8750D357384Q4236Q4361Q9752R2498R1008Q7141Q7329R3125Q3325Q2844R1834
8739E324837R1988Q5960Q8985Q1984Q7484Q0574Q0901P6805P6465P7928P8174
8728F232085O8253O8415N7979N8120N6018M7936M4687M3458L3261K8279K3572
8717F762063K4979J4534J3043J3009O38o400q170j1438k4877k4998k8782k4155
8705F699446m6783n0865m9409m7264n6978o7146p2587p9408p0024p1122p0402
8694F017458q4533r1501q0547q0184r3041q9290q5014r0598q7800r9979r0787
8683E044184q2331q9022r3297q6952q7681q9678p7553p8048q0235q7225q5742
$$ plain form
8672 4106420 4026400 3946245 3869659 3796774 3722087 3640309 3563964 3492141 3419355 3352628 3291863
8661 3291863 3228763 3165443 3105041 3042972 2979403 2915529 2858142 2803519 2746398 2693090 2643490
8650 2643490 2587632 2533476 2484805 2443567 2394670 2346271 2300951 2259245 2216618 2170758 2128655
8639 2128655 2089430 2058840 2021626 1981337 1945384 1906056 1864047 1831810 1803737 1776122 1748125
8628 1748125 1716376 1675943 1649010 1620822 1592135 1564907 1537911 1521643 1503719 1473453 1446634
8617 1446634 1411491 1388919 1375967 1359979 1331004 1311264 1287805 1264750 1246111 1227222 1207699
8606 1207699 1196713 1178549 1160788 1141249 1123216 1102966 1082033 1069201 1047410 1030445 1022161 1014757
8594 1014757 1002546 989960 984812 972109 953182 933251 921966 909410 905663 896838 881623 870548
$$ packed form
8672D106420q0020q0155p6586p2885p4687q1778p6345p1823p2786o6727o0765
8661C291863o3100o3320o0402o2069o3569o3874n7387n4623n7121n3308m9600
8650B643490n5858n4156m8671m1238m8897m8399m5320m1706m2627m5860m2103
8639B128655l9225l0590l7214m0289l5953l9328m2009l2237k8073k7615k7997
8628A748125l1749m0433k6933k8188k8687k7228k6996j6268j7924l0266k6819
8617A446634l5143k2572j2952j5988k8975j9740k3459k3055j8639j8889j9523
8606A207699j0986j8164j7761j9539j8033k0250k0933j2832k1791j6965q284p404
8594A014757j2211j2586n148j2703j8927j9931j1285j2556l747q825j5215j1075
$$ plain form
8582 870548 851492 830723 815274 809375 799366 796626 782950 763466 752043 745214 738804 729477 722526
8569 722526 706523 693058 681043 674347 672548 661574 655547 649004 640032 631884 627928 616752 603614
8556 603614 588699 580092 576297 571547 567376 562569 552146 542766 538581 539630 541399 529063 517077
8543 517077 509671 503838 495291 488435 483444 480623 481275 478522 478114 474308 469150 462357 445929 444607 444932
8528 444932 440196 441674 439952 435867 432214 425518 415871 402796 401638 405529 400022 393832 394632 392402
8514 392402 384532 378592 376237 372794 367803 365097 365288 361302 350688 346476 345347 341845 334814 328269
8500 328269 323693 325040 332046 327848 321845 315329 316789 316329 308902 304798 303591 302619 301564 300862 297716
8485 297716 295070 300681 299171 293969 292683 293346 290354 281245 274766 270080 258131 254995 251515 256409
$$ packed form
8582H70548j9056k0769j5449n899j0009k740j3676j9484j1423o829o410r327o951
8569G22526j6003j3465j2015o696j799j0974o027o543q972q148l956j1176j3138
8556F03614j4915q607l795m750m171m807j0423r380m185J049J769j2336j1986
8543E17077p406n833q547o856m991k821O52k753m08l806n158o793j6428j322L25
8528D44932m736J478j722m085l653o696r647j3075j158L891n507o190Q00k230
8514C92402p870n940k355l443m991k706J91l986j0614m212j129l502p031o545
8500C28269m576J347P006m198o003o516J460m60p427m104j207r72j055p02l146
8485B97716k646N611j510n202j286O63k992r109o479m686j1949l136l480M894
$$ plain form
8471 256409 259122 260456 258102 255044 250680 247564 242009 245704 244974 237242 228942 232067 234484 233597 234714
8456 234714 241315 237034 219772 212990 219956 221036 216849 216061 216393 219129 217329 214380 209949 206142 211320
8441 211320 219367 222525 225053 220580 210720 198042 194094 196559 195921 191811 182615 178931 184194 182232
8427 182232 183677 177494 179410 183474 183013 175840 172255 171102 166210 163933 164137 161054 152625 151118 156190
8412 156190 160714 160827 162197 168805 169733 163896 158345 153381 156740 156244 151324 147823 148850 153354 155793
8397 155793 151712 148932 149039 145622 146681 143580 146205 144770 141044 139249 139536 147876 150335 149898 147414
8382 147414 146321 143599 137910 133145 129433 129781 128338 127843 130498 123221 123172 125328 125978 127627 133217 133954
8366 133954 130232 125605 118459 111181 108053 112197 111455 108185 111338 118715 120897 121148 116029 110683 109375
$$ packed form
8471B56409K713J334k354l058m364l116n555L695p30p732q300L125K417q87J117
8456B34714O601m281j7262o782O966J080m187p88L32K736j800k949m431l807N178
8441B11320Q047L158K528m473r860j2678l948K465o38m110r196l684N263j962
8427A82232J445o183J916M064m61p173l585j153m892k277K04l083q429j507N072
8412A56190M524J13J370O608R28n837n551m964L359m96m920l501J027M504K439
8397A55793m081k780J07l417J059l101K625j435l726j795K87Q340K459m37k484
8382A47414j093k722n689m765l712L48j443m95K655p277m9K156O50J649N590P37
8366A33954l722m627p146p278l128M144p42l270L153P377K182K51n119n346j308
$$ plain form
8351 109375 107387 105204 102934 99122 102793 103835 109389 110183 104871 100389 95897 97368 97085 96119 96158 92360
8335 92360 93537 93735 103737 115478 124359 119418 117538 120531 115376 112156 108215 102277 100925 104866
8321 104866 108935 101850 89606 89805 93182 92433 87660 89020 89592 85772 85285 80851 81720 89550 86291
8306 86291 79117 72929 73076 77827 85917 82619 81629 85914 81748 75381 76731 76452 74640 84050 89265
8291 89265 92351 92551 95155 105959 110940 109794 106641 101662 97370 92980 86395 86154 85857 84691 89564
8276 89564 91400 87413 93627 90083 81344 77864 80546 81194 79748 77250 75595 70544 76432 75985 74263
8261 74263 71572 71514 74304 74736 73612 67406 71757 73989 68472 67517 67490 68979 67393 69268 66798 67715
8245 67715 63827 63686 59523 64948 65793 52821 47371 47546 53860 61395 69000 73903 79767 80789 89096
$$ packed form
8351A09375j988k183k270l812L671J042N554P94n312m482m492J471k83r66L9l798
8335I2360J177J98J0002J1741Q881m941j880K993n155l220l941n938j352L941
8321A04866M069p085j2244J99L377p49m773J360N72l820m87m434Q69P830l259
8306H6291p174o188J47M751Q090l298r90M285m166o367J350k79j812R410N215
8291H9265L086K00K604J0804M981j146l153m979m292m390o585k41k97j166M873
8276H9564J836l987O214l544q739l480K682O48j446k498j655n051N888m47j722
8261G4263k691n8K790M32j124o206M351K232n517r55k7J489j586J875k470R17
8245F7715l888j41m163N425Q45j2972n450J75O314P535P605M903N864J022Q307
$$ plain form
8230 89096 88874 84474 72762 63101 63796 63182 62149 66292 71065 70945 71874 63350 60126 60296 57129 56844
8214 56844 55877 45837 50392 52338 57219 58094 54184 56560 58812 57780 49815 51539 51469 46390 44861
8199 44861 46659 43541 43068 37295 35212 41686 45789 43565 41747 46434 50899 48580 51412 49461 48320
8184 48320 50266 46959 46033 48340 49976 48120 46580 40017 39881 41406 39534 37942 43994 42504 45566
8169 45566 51188 51550 52421 59895 60757 54720 47180 47007 44213 44332 43400 43251 44244 47314 44550 41965 43321
8152 43321 45557 40277 43096 41549 36493 34283 33468 29209 28169 30448 40854 37719 34418 33505 34126
8137 34126 35432 38084 41905 46505 46934 41526 38538 35171 37924 36182 30872 31403 28603 30208 32719
8122 32719 29593 33355 34741 39834 47114 59511 63093 60988 60458 62967 63553 64164 63077 65479 62320
$$ packed form
8230H9096k22m400j1712r661O95o14j033M143M773j20R29q524l224J70l167k85
8214E6844r67j0040M555J946M881Q75l910K376K252j032p965J724p0n079j529
8199D4861J798l118m73n773k083O474M103k224j818M687M465k319K832j951j141
8184D8320J946l307r26K307J636j856j540o563j36J525j872j592O052j490L062
8169D5566N622L62Q71P474Q62o037p540j73k794J19r32j49R93L070k764k585J356
8152D3321K236n280K819j547n056k210q15m259j040K279J0406l135l301r13O21
8137C4126J306K652L821M600M29n408k988l367K753j742n310N31k800J605K511
8122C2719l126L762J386N093P280J2397L582k105n30K509N86O11j087K402l159
$$ plain form
8107 62320 59017 52007 39982 34927 29360 30902 30093 29519 28951 31581 29127 31076 32270 32692 40432
8092 40432 45083 41705 43250 39799 38927 36514 37906 38843 40059 43361 42210 42150 38538 31351 27515 29026
8076 29026 30101 24731 26953 38590 45784 54409 57005 62154 73620 74605 70637 65141 60394 63367
8062 63367 58428 57316 53783 56429 58715 55396 45668 44821 45249 38339 43077 38624 37694 36266 34706
8047 34706 27710 22209 26668 25806 21632 18711 24804 27765 18912 16926 23242 30368 26622 28760 30925
8032 30925 29685 28549 27909 34715 41425 47631 51260 48988 51468 53784 52497 53063 49432 47287 50320
8017 50320 51465 57781 58350 43182 35484 28298 27564 30850 32483 35168 36097 29573 21818 20195 20442
8002 20442 19663 16257 16705 21026 20704 24127 29324 32438 31263 34791 40382 37519 36943 36287 36015 41108
$$ packed form
8107F2320l303p010j2025n055n567J542q09n74n68K630k454J949J194M22P740
8092D0432M651l378J545l451q72k413J392R37J216L302j151o0l612p187l836J511
8076B9026J075n370K222J1637P194Q625K596N149J1466R85l968n496m747K973
8062F3367m939j112l533K646K286l319r728q47M28o910M738m453r30j428j560
8047C4706o996n501M459q62m174k921O093K961q853j986O316P126l746K138K165
8032C0925j240j136o40O806O710O206L629k272K480K316j287N66l631k145L033
8017E0320J145O316N69j5168p698p186p34L286J633K685R29o524p755j623K47
8002B0442p79l406M48M321l22L423N197L114j175L528N591k863n76o56k72N093
$$ plain form
7986 41108 37452 36202 45843 51427 45750 39779 37806 37434 39450 33812 30237 29731 30856 30314 28727
7971 28727 27587 28639 31970 30527 32895 32613 32334 33139 35190 35032 32095 23542 22112 29970 37841 41989
7955 41989 36548 33317 25653 23673 23829 27177 28555 33713 26665 29853 33660 33831 37858 39673 38188
7940 38188 37061 32053 29407 32311 32064 28936 28892 30618 32421 30419 33626 36691 30665 31065 34490 30592
7924 30592 26316 23099 28019 20660 15473 16541 21384 25918 22613 24677 26795 25813 29961 33651 32948
7909 32948 31069 27066 26875 32077 33349 34601 38162 28224 21038 25458 30584 27996 30911 28897 19229
7894 19229 14631 17983 17412 20184 28345 22365 19961 24447 20288 25201 24039 18984 15474 13305 19945
7879 19945 13938 14839 17989 22652 21085 18924 13631 17544 16170 11207 11588 10842 12908 9148 8408 13314
$$ packed form
7986D1108l656j250R641N584n677n971j973l72K016n638l575n06J125n42j587
7971B8727j140J052L331j443K368k82k79Q05K051j58k937q553j430P858P871M148
7955D1989n441l231p664j980J56L348J378N158p048L188L807J71M027J815j485
7940C8188j127n008k646K904k47l128m4J726J803k002L207L065o026M00L425l898
7924C0592m276l217M920p359n187J068M843M534l305K064K118r82M148L690p03
7909C2948j879m003j91N202J272J252L561r938p186M420N126k588K915k014r668
7894A9229m598L352n71K772Q161n980k404M486m159M913j162n055l510k169O640
7879A9945o007R01L150M663j567k161n293L913j374m963L81p46K066l760p40M906
$$ plain form
7863 13314 23287 20403 13877 3610 5178 11207 22400 15945 5109 6417 7183 7681 15484 15324 14405
7848 14405 17091 11494 9736 10622 3854 3149 7205 12722 18127 12010 15355 16529 19396 20442 16455
7833 16455 13912 11922 9999 11992 9798 11145 11327 8942 8313 6964 3896 -4342 -3809 3287 3332 6959
7817 6959 6699 3573 2758 4374 3830 11039 8346 729 4415 5059 1298 7228 9404 5744 -1798 5208
7801 5208 5494 5554 -3371 -6066 -1906 6070 4414 -3104 -10181 -3270 7611 9600 12035 19245 28404
7786 28404 23347 12837 5926 3856 2250 2501 5420 9210 15725 8530 -2035 -3937 -8501 -5051
7772 -5051 -754 6917 8062 7266 8901 12343 12002 8203 4562 -885 -388 -2257 3679 9357 13950 16491
7756 16491 16924 15795 10867 15623 19398 20713 18380 16092 7788 903 -530 -3151 -174 -2191 -9710
$$ packed form
7863A3314R973k884o526j0267J568O029J1193o455j0836J308P66M98P803j60r19
7848A4405K686n597j758Q86o768p05M056N517N405o117L345J174K867J046l987
7833A6455k543j990j923J993k194J347J82k385o29j349l068q238N33P096M5L627
7817F959k60l126q15J616n44P209k693p617L686O44l761N930K176l660p542P006
7801E208K86O0q925k695M160P976j656p518p077O911J0881J989K435P210R159
7786B8404n057j0510o911k070j606K51K919L790O515p195j0565j902m564L450
7772e051M297P671J145p96J635L442l41l799l641n447M97j869N936N678M593K541
7756A6491M33j129m928M756L775J315k333k288q304o885j433k621K977k017p519
$$ plain form
7741 -9710 -8322 -4457 -2409 3405 2108 4004 2485 258 75 2811 6214 5285 6769 9200 8278 5626
7725 5626 4112 5267 3136 2022 3779 10933 9456 5614 6963 8556 6975 4395 6332 9439 6922
7710 6922 4799 3675 -1058 -782 -3253 -3955 4990 9312 11758 12270 8536 6708 -261 -5823 -4345 -3983
7694 -3983 -3709 -410 4364 3153 4354 7848 9115 13957 16063 15913 8225 6266 5448 9388 11796 16628
7678 16628 11829 5406 1769 4033 3483 -1181 -3353 -986 303 1704 -5631 -6866 4057 9828 8409
7663 8409 4693 6591 11540 17830 10291 1812 -293 4243 6841 9728 8101 7638 10860 7929 8681
7648 8681 3453 3566 6707 8203 6256 4172 922 5859 6466 2573 576 -5320 414 5821 9142
7633 9142 -31 3415 3432 3093 1128 2112 3735 6064 5510 5292 9120 12033 9499 12441 13591 6120
$$ packed form
7741i710J388L865K048N814j297J896j519k227j83K736L403r29J484K431r22k652
7725E626j514J155k131j114J757P154j477l842J349J593j581k580J937L107k517
7710F922k123j124m733K76k471p02Q945M322K446N12l734j828o969n562J478L62
7694c983K74L299M774j211J201L494J267M842K106j50p688j959q18L940K408M832
7678A6628m799o423l637K264n50m664k172K367J289J401p335j235J0923N771j419
7663H409l716J898M949O290p539q479k105M536K598K887j627m63L222k931P52
7648H681n228J13L141J496j947k084l250M937O07l893j997n896N734N407L321
7633I142r173L446J7l39j965R84J623K329n54k18L828K913k534K942J150p471
$$ plain form
7617 6120 6156 10268 13836 11682 9864 13396 10729 11607 4493 2451 5078 3842 388 -2282 -3615 -1677
7601 -1677 2179 3151 3124 248 -1509 -2399 3401 5034 9916 10329 5200 6892 6255 2462 -1768 -9597
7585 -9597 -9008 -10213 -11322 -11786 -12500 -11996 -7265 -2252 -6068 -11073 -6385 -4382 -2067 -289 -6302 -11101
7569 -11101 -9787 -1247 7736 10528 4141 2915 766 1371 -2829 1287 4398 -1013 -784 218 -7403
7554 -7403 -7867 -6288 -6085 -2117 -1331 -4871 -3079 -317 -3906 -3899 -3909 -7245 -9566 -7992 -1908 497 5050
7537 5050 7663 4714 8785 7740 566 -8708 -10483 -4684 -1428 -408 7085 1673 2012 5037 -4129
7522 -4129 -4385 -1345 -2979 -1540 -3223 4817 7733 7712 7627 3768 3140 725 -1353 -4015 -6817 -6143 -4540
7505 -4540 -5887 -10525 -5053 1315 -2156 -93 717 1401 -3608 -185 6399 3136 1058 2426 6456
$$ packed form
7617F120L6M112L568k154j818L532k667Q78p114k042K627j236l454k670j333J938
7601a677L856R72k7k876j757q90N800J633M882M13n129J692o37l793m230p829
7585i597N89j205j109m64p14N04M731N013l816n005M688K003K315J778o013m799
7569a1101J314Q540Q983K792o387j226k149O05m200M116L111n411K29J002p621
7554g403m64J579K03L968P86l540J792K762l589Pj0l336k321J574O084K405M553
7537E050K613k949M071j045p174r274j775N799L256J020P493n412L39L025r166
7522d129k56L040j634J439j683Q040K916k1q5l859o28k415k078k662k802O74J603
7505d540j347m638N472O368l471K063Q10O84n009L423O584l263k078J368M030
$$ plain form
7490 6456 5211 4602 4452 4206 10087 7604 2329 8398 12504 7117 7759 6321 2102 775 1597 1909
7474 1909 2753 4554 2265 -428 -2457 1244 3701 3067 3753 3910 -1784 -3066 -6497 -3353 -5830 3576
7458 3576 8094 4790 4174 3002 -2029 -6554 -9847 -2808 673 -935 -7313 -8932 -10046 -10381 -13170
7443 -13170 -5635 -10833 -9790 789 404 -1185 -2279 -3604 -2617 1605 7862 886 -724 6529 4989
7428 4989 -260 -5631 -6230 -8004 -1688 -2297 -7149 -12683 -10509 -5811 2533 6119 6872 -1682 -7586 -11310
7412 -11310 -5542 -830 890 10019 11912 8547 5110 5166 1775 6321 7263 9439 11857 2525 -2930
7397 -2930 -2997 -1807 4866 1264 1149 5010 6739 4958 5761 5432 5446 7507 3218 -4311 -12188 -17902 -17053
7380 -17053 -9008 4088 6666 12209 14326 11414 6217 -2232 -4970 -5640 -6308 -5628 -6456 -1421 6102
$$ packed form
7490F456j245o09j50k46N881k483n275O069M106n387O42j438m219j327Q22L12
7474A909Q44J801k289k693k029L701K457o34O86J57n694j282l431L144k477R406
7458C576M518l304o16j172n031m525l293P039L481j608o378j619j114l35k789
7443a3170P535n198J043J0579l85j589j094j325R87M222O257o976j610P253j540
7428D989n249n371n99j774O316o09m852n534K174M698Q344L586P53q554n904l724
7412a1310N768M712J720R129J893l365l437N6l391M546R42K176K418r332n455
7397b930o7J190O673l602j15L861J729j781Q03l29J4K061m289p529p877n714Q49
7380a7053Q045J3096K578N543K117k912n197q449k738o70o68O80q28N035P523
$$ plain form
7365 6102 4567 -2178 -3713 1295 -1461 -2659 -3322 -5379 -6512 -1450 -2003 -6139 -4951 -8580 -4864
7350 -4864 7624 3762 -10537 -13345 -8245 -7359 -4641 -2190 -5561 -9376 -10717 -10251 -1963 -5894 -8849
7335 -8849 -4170 5473 5175 1726 3231 1921 299 2064 -3243 -5087 -6162 -4204 -5152 -7374 -6471 -6979
7319 -6979 -8039 -13676 -10754 -3286 -3501 -4582 -3783 3162 9734 19961 23110 18068 9447 9159 845
7304 845 -9135 -10252 -2924 5289 -2987 1532 7355 6445 4573 -5765 -5104 1042 1107 1883 -349 -27
7288 -27 -1008 -184 -629 1296 3909 -316 -4617 -1622 -109 1481 8689 1504 -8957 -11151 -12094 -13031
7272 -13031 -5423 -8947 -11715 -7971 -6403 -6517 -9920 -14392 -12032 -8782 -6915 -2878 -3761 105 1409
7257 1409 6539 4203 104 -9591 -12927 -3331 4609 11633 7883 6523 3505 4826 1803 1411 5805
$$ packed form
7365F102j535o745j535N008k756j198o63k057j133N062n53m136J188l629L716
7350d864J2488l862j4299k808N100Q86K718K451l371l815j341M66Q288l931k955
7335h849M679R643k98l449J505j310j622J765n307j844j075J958r48k222R03n08
7319f979j060n637K922P468k15j081P99O945O572J0227L149n042q621k88q314
7304H45r980j117P328Q213q276M519N823r10j872j0338O61O146O5P76k232L22
7288b7r81Q24m45J925K613m225m301K995J513J590P208p185j0461k194r43r37
7272a3031P608l524k768L744J568j14l403m472K360L250J867M037q83L866J304
7257A409N130k336m099r695l336R596P940P024l750j360l018J321l023l92M394
$$ plain form
7242 5805 5994 203 56 -297 -7560 -9891 -7922 -8006 -1824 302 3846 11032 5396 774 -214 2897
7226 2897 -3997 -13947 -16157 -16402 -6011 -919 -2362 -5607 -2817 -4469 -5916 -8970 -6427 -2162 -105
7211 -105 -4950 -5381 -2349 -4371 -4338 2244 6227 2803 -1821 -923 -2215 -2351 401 -4146 -7676 -9454
7195 -9454 -7028 -6229 -8010 -2544 -3404 -5897 -7374 -8118 -9323 -10333 -5682 -1218 -2141 -2196 3731 5330
7179 5330 -2407 -10254 -17904 -14097 -3125 1978 4054 3650 2846 248 -8546 -15416 -15733 -13474 -3810
7164 -3810 1768 8887 13659 12781 8172 4430 8531 11266 5471 2291 -1010 -3397 -9418 -11113 -6500
7149 -6500 -5571 -2254 607 -4335 -2732 -320 6621 7624 6165 375 -348 -7406 -14632 -10488 -11982
7134 -11982 -13248 -15217 -15621 -12103 -7688 -6734 -6469 -6131 -2911 -3466 -4434 -4373 -4557 -7502 -8272 -2612 8763
$$ packed form
7242E805J89n791j47l53p263k331J969q4O182K126L544P186n636m622r88L111
7226B897o894r950k210k45J0391N092j443l245K790j652j447l054K543M265K057
7211a05m845m31L032k022L3O582L983l424m624Q98j292j36K752m547l530j778
7195i454K426P99j781N466q60k493j477p44j205j010M651M464r23n5N927J599
7179E330p737p847p650L807J0972N103K076m04q04k598q794o870l17K259R664
7164c810N578P119M772q78m609l742M101K735n795l180l301k387o021j695M613
7149f500R29L317K861m942J603K412O941J003j459n790p23p058p226M144j494
7134a1982j266j969m04L518M415R54K65L38L220n55r68O1j84k945p70N660J1375
$$ plain form
7117 8763 7946 5026 -1295 5981 3391 -2361 -7424 -14076 -12479 -2505 -2006 -8036 -3601 -694 -4135
7102 -4135 -2767 -293 -3217 -10398 -13261 -9140 -9385 -16907 -18497 -16791 -12059 -9276 -7921 -6257 -451
7087 -451 -2176 -6680 -5008 -1856 -2084 -4480 -9984 -16757 -15712 -11586 -9767 -15450 -16294 -8286 -6171 -9181
7071 -9181 -12979 -7457 -2436 2004 7460 5118 11282 15935 8585 5581 -865 -7216 -11101 -6225 -5191
7056 -5191 -859 6925 3530 -3051 -11491 -11354 -5820 -11066 -13859 -10744 -9468 -8190 -9531 -9793 -3080
7041 -3080 9822 11625 9808 9315 5024 -899 -5814 -12590 -9630 -2806 -6915 -2683 4727 3650 681
7026 681 10763 12587 -1988 -1519 -917 -9735 -19266 -22207 -16334 -10420 -5552 -8284 -6466 -8542 -11445
7011 -11445 -9578 -5765 -3028 -4060 3399 6600 7525 6524 5965 7568 5466 -1631 -1615 -1316 5132 2930
$$ packed form
7117H763q17k920o321P276k590n752n063o652J597R974M99o030M435K907l441
7102d135J368K474k924p181k863M121k45p522j590J706M732K783J355J664N806
7087d51j725m504J672L152k28k396n504o773J045M126J819n683q44Q008K115l010
7071i181l798N522N021M440N456k342O164M653p350l004o446o351l885M876J034
7056e191M332P784l395o581q440J37N534n246k793L115J276J278j341k62O713
7041c080J2902J803j817m93m291n923m915o776K960O824m109M232P410j077k969
7026F81J0082J824j4575M69O02q818r531k941N873N914M868k732J818k076k903
7011a1445J867L813K737j032P459L201R25j001n59J603k102p097J6K99O448k202
$$ plain form
6995 2930 1678 -1590 -2529 1196 578 -1905 -6307 -9876 -8921 -3571 631 7055 1544 684 5201 5990
6979 5990 2652 -3446 -10555 -13386 -15562 -12692 -8145 -8223 -13620 -15743 -5897 5055 8696 6436 3713
6964 3713 2326 4523 -1603 -3630 -2919 -3618 -5960 -11227 -6461 -1499 -9403 -11966 -13852 -14233 -14467 -14988
6948 -14988 -12925 -7044 2933 12258 9443 2033 -4127 -2696 -2480 -8541 -10204 -11961 -4925 427 -5382
6933 -5382 -4166 -3569 -3122 -5125 -1961 -465 1171 3066 6623 7972 -2741 -9359 -6389 -3881 -1643
6918 -1643 2067 -3117 -6319 -3816 263 1293 -4781 -4606 -4749 1893 2020 -2004 -1312 228 3364 3545
6902 3545 2577 760 -4571 2161 -1984 -10057 -11233 -2993 726 -886 -4823 -7531 -10252 -11693 -9796
6887 -9796 -11006 -10360 -11315 -11404 -11320 -11395 -3335 -3350 -7157 -7477 -5191 -3193 1919 -3352 -1997 -55 -3086 -7770
$$ packed form
6995B930j252l268r39L725o18k483m402l569R55N350M202O424n511q60M517P89
6979E990l338o098p109k831k176K870M547p8n397k123R846J0952L641k260k723
6964C713j387K197o126k027P11o99k342n267M766M962p904k563j886l81k34n21
6948a4988K063N881R977R325k815p410o160J431K16o061j663j757P036N352n809
6933e382J216N97M47k003L164J496J636J895L557J349j0713o618K970K508K238
6918a643L710n184l202K503M079J030o074J75j43O642J27m024O92J540L136J81
6902C545r68j817n331O732m145q073j176Q240L719j612l937k708k721j441J897
6887i796j210O46r55q9Q4p5Q060j5l807l20K286J998N112n271J355J942l031m684
$$ plain form
6869 -7770 -9740 -5005 3267 7237 15685 17813 17462 16553 15939 8494 7684 2908 -6636 -8018 -4124 -1571
6853 -1571 -4464 -6149 5228 5686 -2028 -8021 -13132 -6079 -4395 -10102 -12116 -7191 -6705 -12621 -12843
6838 -12843 -6538 -2965 1942 486 -6646 -4620 -5322 -3062 357 665 2015 3132 9933 10987 2603
6823 2603 -2677 -1360 605 826 -551 -3126 -2301 926 5304 7697 14545 4468 -3215 -3730 -1545
6808 -1545 -5831 -8213 -8037 -9331 -1608 9081 13000 11551 12049 21291 27796 25377 15327 6891 5727
6793 5727 5385 7130 6819 9285 4874 4362 5847 12170 7182 2868 6746 6782 7766 292 3362 -2923
6777 -2923 -8217 -8193 138 516 2645 5119 3865 2960 -1506 -1618 -5668 -5263 -1034 1668 7032 10705
6761 10705 12134 12950 10277 6504 653 -2443 -10518 -8519 -5120 -10021 -17004 -6986 -1854 -3304 -4687
$$ packed form
6869g770j970M735Q272L970Q448K128l51r09o14p445q10m776r544j382L894K553
6853a571k893j685J1377M58p714n993n111P053J684n707k014M925M86n916k22
6838a2843O305L573M907j456p132K026p02K260L419L08J350J117O801J054q384
6823B603n280J317J965K21j377k575Q25L227M378K393O848j0077p683n15K185
6808a545m286k382J76j294P723J0689L919j449M98R242O505k419j0050q436j164
6793E727l42J745l11K466m411n12J485O323m988m314L878L6R84p474L070o285
6777b923n294K4Q331L78K129K474j254r05m466j12m050M05M229K702N364L673
6761A0705J429Q16k673l773n851l096q075J999L399m901o983J0018N132j450j383
$$ plain form
6746 -4687 -7274 -12037 -7409 -477 404 4726 3412 1696 -813 -3190 -3583 -5702 -7589 -8314 -5809 -4037
6730 -4037 -8452 -3697 -2783 -8663 -11832 -12645 -16161 -11976 -8379 -9682 -10374 -557 4291 6679 11159 13759
6714 13759 11208 9658 14495 16432 15892 13398 9665 7623 11737 7668 3349 7995 9377 6428 1891
6699 1891 -8433 -8491 413 358 6509 4937 -185 -554 3416 7579 6571 -977 -106 3392 5427 -285
6683 -285 -104 2133 3248 -2432 -9897 -8511 -992 4900 2056 -2827 -2405 1327 -335 -2269 -2988 157
6667 157 -3271 -3457 -5364 -4974 -5572 -4083 -6191 -10465 -9010 -4611 284 1956 3258 -2588 262 1893
6651 1893 -3429 -9161 -7380 -3630 1051 2101 2183 -3032 -2916 -6689 -7268 -8986 -9000 -13722 -11899 -11101 -15024
6634 -15024 -14843 -14867 -14225 -12619 -12869 -12615 -8550 -9515 -17079 -13188 -13144 -12615 -9122 -8729 -5585 -2216 1507
$$ packed form
6746d687k587m763M628O932Q81M322j314j716k509k377l93k119j887p25K505J772
6730d037m415M755R14n880l169q13l516M185L597j303o92R817M848K388M480K600
6714A3759k551j550M837J937n40k494l733k042M114m069m319M646J382k949m537
6699A891j0324n8Q904n5O151j572n122l69L970M163j008p548Q71L498K035n712
6683b85J81K237J115n680p465J386P519N892k844m883M22L732j662j934p19L145
6667A57l428j86j907L90n98J489k108m274J455M399M895J672J302n846K850J631
6651A893n322n732J781L750M681J050Q2n215J16l773n79j718j4m722J823P98l923
6634a5024J81k4O42J606k50K54M065r65p564L891M4N29L493L93L144L369L723
$$ plain form
6617 1507 697 -1744 1667 1795 3785 -5156 -5060 -5976 1925 5651 6513 4698 82 -13172 -17588 -17114
6601 -17114 -9325 3280 1038 -2371 -4878 -7356 -12149 -13891 -15453 -14547 -9408 -2193 -3899 -7437 -5733
6586 -5733 -6286 -3956 -2448 -8586 -9019 -12354 -11606 -9152 -4045 -11234 -13639 -6971 -2058 -941 -3731 -7697
6570 -7697 -3166 5573 -1031 -8026 -12335 -16496 -13822 -11793 -12790 -9956 -10766 -9288 -9647 -9557 -9586 -16199 -14043
6553 -14043 -10423 -8816 -12614 -6153 -1583 -2566 -2192 5373 2211 -6433 -8163 -1722 -3322 -3456 716
6538 716 2030 3991 3031 5186 3367 7461 13590 8932 5207 5667 10320 7436 1603 3219 -1433 -3221
6522 -3221 -5213 -5068 -7610 -11069 -12747 -9514 -2529 4008 10746 11599 8165 -749 -7649 -8424 -6020 4733
6506 4733 8931 4911 -2409 -334 -593 -1131 -2815 480 3346 -261 -4047 -3804 2525 7214 8451 5576
$$ packed form
6617A507q10k441L411J28J990q941R6r16P901L726Q62j815m616j3254m416M74
6601a7114P789J2605k242l409k507k478m793j742j562R06N139P215j706l538J704
6586e733n53K330J508o138m33l335P48K454N107p189k405O668M913J117k790l966
6570g697M531Q739o604o995m309m161K674K029r97K834q10J478l59R0k9o613K156
6553a4043L620J607l798O461M570r83L74P565l162q644j730O441j600j34M172
6538G16J314J961r60K155j819M094O129m658l725M60M653k884n833J616m652j788
6522c221j992J45k542l459j678L233O985O537O738Q53l434q914o900p75K404J0753
6506D733M198m020p320K075k59n38j684L295K866l607l786K43O329M689J237k875
$$ plain form
6490 5576 6167 2863 -8410 -10292 -11215 -9691 -5862 95 2406 2866 7596 10035 12012 14015 4119
6475 4119 -2699 -1527 7874 1288 235 3213 -2523 -4701 -5879 -7392 -3854 -5153 -9235 -10632 -7398
6460 -7398 -15339 -18704 -7868 -2412 -649 1128 4818 4828 4878 6594 10643 3672 -6919 -6231 -9589 -8319
6444 -8319 -7063 -8938 -5864 -7480 -6048 -985 4493 2111 1993 264 -5086 -8397 -9935 -4640 2499
6429 2499 2075 -158 1827 -6120 -12396 -6259 -4398 -5097 -70 821 2698 -6485 -9679 -11065 -12511 -9949
6413 -9949 -6249 -4636 -7995 -3410 867 6076 4487 -350 -2289 2155 -2661 -9359 -7247 -4571 -4018
6398 -4018 -8416 -12864 -10219 -12196 -9058 -7895 -4833 -7334 -10357 -14870 -14631 -8682 -6787 -12102 -10084
6383 -10084 -3441 -5551 -15200 -9945 -3585 -6477 -13075 -9660 -6687 -5427 -3019 -1143 -2900 -2082 691
$$ packed form
6490E576N91l304j1273j882r23J524L829N957K311M60M730K439J977K003r896
6475D119o818J172R401o586j053K978n736k178j178j513L538j299m082j397L234
6460g398p941l365J0836N456J763J777L690J0N0J716M049o971j0591O88l358J270
6444h319J256j875L074j616J432N063N478k382j18j729n350l311j538N295P139
6429B499m24k233J985p947o276O137J861o99N027Q91J877r183l194j386j446K562
6413i949L700J613l359M585M277N209j589m837j939M444m816o698K112K676N53
6398d018m398m448K645j977L138J163L062k501l023m513K39N949J895n315K018
6383a0084O643k110r649N255O360k892o598L415K973J260K408J876j757Q18K773
$$ plain form
6368 691 4485 4720 5095 4304 4351 -100 -7994 -11629 -13322 -9662 -3235 4975 3922 2300 -2987 -4624
6352 -4624 1303 3173 9250 13069 3350 -1565 -3319 -7550 -14663 -14451 -1427 6944 2633 648 10183
6337 10183 8661 -1284 -11808 -14574 -12373 -11026 -8683 -3439 -656 -5973 -4588 3428 -2623 -3615 -4360
6322 -4360 -7345 -7236 548 1706 2125 418 -6432 -10010 -10021 -8763 -13311 -13773 -16779 -18488 -9822 -8395
6306 -8395 -9455 -6675 -8976 -6495 -7394 -6218 -5386 -5086 -1268 -3004 -12134 -12533 -6332 -4684 -1576 -3195
6290 -3195 -3309 568 2827 2646 -957 -4796 -5349 -11393 -6353 -5077 -4537 -1197 359 2751 -1921 -8326
6274 -8326 -9131 -14267 -12117 -14182 -12692 -10786 -7260 -2277 -1290 -234 -739 -482 -1921 250 4577 2987
6258 2987 -1760 -5365 -3436 -1187 -2491 -4057 -1119 518 -8112 -5571 -6141 -3166 286 -2645 -4219
$$ packed form
6368F91L794K35L75p91M7m451p894l635j693L660O427Q210j053j622n287j637
6352d624N927J870O077L819r719m915j754m231p113K12J3024Q371m311j985R535
6337A0183j522r945j0524k766K201J347K343N244K783n317J385Q016o051r92p45
6322d360k985J09P784J158M19j707o850l578j1J258m548m62l006j709Q666J427
6306h395j060K780k301K481q99J176Q32L00L818j736r130l99O201J648L108j619
6290c195j14L877K259j81l603l839n53o044N040J276N40L340J556K392m672o405
6274h326q05n136K150k065J490J906L526M983R87J056n05K57j439K171M327j590
6258B987m747l605J929K249j304j566K938J637q630K541n70K975L452k931j574
$$ plain form
6243 -4219 -4643 -1768 6470 11268 10357 7048 -5004 -8472 -6832 -4198 783 4345 1116 3040 9728
6228 9728 5700 852 -3106 -4157 -8763 -6968 -3105 -7055 -5270 -205 2216 417 1978 2821 -8353
6213 -8353 -10438 -8363 -9032 -7205 -7922 -10331 -5646 851 6429 2381 2281 3413 257 -3624 -3601 -3220
6197 -3220 -3140 4805 963 -452 -5276 -8617 -8494 -4055 -5444 -8618 -3702 -7540 -6921 -16188 -15377 -12985
6181 -12985 -12043 -6474 -8627 -5682 -588 -1016 -4080 -6285 -6238 -3497 -6599 -5503 -3549 -246 -1389 -2049
6165 -2049 -930 1555 7113 5569 10914 20036 25313 23538 13122 3219 -3663 1375 -1094 -6091 -5000
6150 -5000 -170 1464 4304 8606 3387 3060 -4032 -11827 -12892 -12207 -15141 -14383 -12411 -15672 -12138 -7474
6134 -7474 -2965 13 10969 14091 9187 409 -1209 -1141 -4364 -5970 -6496 -1863 2718 5605 -1088
$$ packed form
6243d219m24K875Q238M798r11l309j2052l468J640K634M981L562l229J924O688
6228I728m028m848l958j051m606J795L863l950J785N065K421j799J561Q43j1174
6213h353k085K075o69J827p17k409M685O497N578m048j00J132l156l881K3L81
6197c220Q0P945l842j415m824l341J23M439j389l174M916l838O19r267Q11K392
6181a2985R42N569k153K945N094m28l064k205M7K741l102J096J954L303j143o60
6165b049J119K485N558j544N345R122N277j775j0416r903o882N038k469m997J091
6150e000M830J634K840M302n219l27p092p795j065O85k934P58J972l261L534M664
6134g474M509K978J0956L122m904q778j618O8l223j606n26M633M581K887o693
$$ plain form
6119 -1088 -4594 -2758 -887 3677 2278 -1376 -1445 1368 7571 7272 5748 693 -1513 -2925 -660 57
6103 57 2534 6100 6105 9838 -638 -4106 -3124 -4644 -5475 -3283 -1257 700 -4167 55 1248 -2840
6087 -2840 -3460 -1875 3405 3599 -680 -6192 -2040 -4574 -7155 -5925 -10767 -6151 -2185 -3254 -9260
6072 -9260 -8724 -3212 1917 4781 6714 -517 -2845 -5861 -9569 -15928 -8382 -2640 3775 8196 65
6057 65 -522 -14 4424 -3117 -8211 -9157 -8917 -5806 -6011 -12242 -10611 -6391 2279 834 -4306 -12461 -15616
6040 -15616 -14285 -11205 -2254 3254 4145 702 -208 -3823 -9515 -11619 -15061 -8506 -5521 -5274 -3660
6025 -3660 -3403 -4961 -6874 -4158 -1114 2037 3883 -1646 -5969 -3356 -2899 -798 345 221 -5807 -1672
6009 -1672 -957 -5517 -7491 -11615 -14609 -12963 -6357 -2191 -4112 -463 2786 -1667 -1842 3819 1567
$$ packed form
6119a088l506J836J871M564j399l654o9K813O203k99j524n055k206j412K265P17
6103E7K477L566NL733j0476l468R82j520q31K192K026J957m867M222J193m088
6087b840o20J585N280J94m279n512M152k534k581J230m842M616L966j069o006
6072i260N36N512N129K864J933p231k328l016l708o359P546N742O415M421q131
6057F5n87N08M438p541n094r46K40L111k05o231J631M220Q670j445n140q155l155
6040a5616J331L080Q951N508Q91l443r10l615n692k104l442O555K985K47J614
6025c660K57j558j913K716L044L151J846n529m323K613M57K101J143j24o028M135
6009a672P15m560j974m124k994J646O606M166j921L649L249m453j75N661k252
$$ plain form
5994 1567 1507 3496 4046 -932 -353 -3766 -5273 -2017 -1846 -3611 4190 2929 1759 -408 -7080 -12394
5978 -12394 -13157 -3883 -2620 -2558 6181 5185 4430 2302 -7443 -10988 -10846 -4406 -3382 -7494 -5490 -2738
5962 -2738 -2630 -7033 -5788 -6107 -2901 3786 -1485 -7521 -7347 -5419 -7897 -8387 -3697 -1365 4335 942
5946 942 3024 -526 -6212 -6230 -3830 1819 1417 -4125 -4408 -4212 -7620 -8602 -8494 -691 3889 8998 10493
5929 10493 9757 401 -5318 -2725 -7724 -12334 -13437 -6048 2190 1186 1449 9063 9530 8660 2504 2577
5913 2577 6931 6657 -3002 -3514 -1803 -6558 -4464 -9794 -12499 -3881 5400 3746 4688 2414 -70 1017
5897 1017 911 5066 5889 7799 1369 -2108 -4206 -4372 -886 -1224 -2320 715 466 1007 -2275 -2998 -6521
5880 -6521 -10200 -8310 -5829 -2721 -1822 -2727 -3367 415 1656 799 7080 7337 5076 8176 10155 9151
$$ packed form
5994A567o0J989N50m978N79l413j507L256J71j765P801j261j170k167o672n314
5978a2394p63R274J263O2Q739r96p55k128r745l545J42O440J024m112K004K752
5962b738J08m403J245l19L206O687n271o036J74J928k478m90M690K332N700l393
5946I42K082l550n686j8K400N649m02n542k83J96l408r82J08P803M580N109J495
5929A0493p36r356n719K593m999m610j103P389Q238j004K63P614M67q70o156P3
5913B577M354k74r659n12J711m755K094n330k705Q618R281j654R42k274k484J087
5897A017j06M155Q23J910o430l477k098j66L486l38j096L035k49N41l282p23l523
5880f521l679J890K481L108Q99r05o40L782J241q57O281K57k261L100J979j004
$$ plain form
5864 9151 8808 8176 10886 2553 -8028 -9608 -9653 -11466 -12579 -8967 -4954 -7694 -3914 -601 2194 -1688
5848 -1688 -2683 -3267 3745 3325 -1813 -4287 -12265 -16471 -9861 -10667 -11310 -10045 -10797 -10092 -7557 -1858 2900
5831 2900 3268 5498 -2288 -11602 -9049 -626 -422 -2055 6542 7080 6187 4558 3114 6845 4882 174
5815 174 1252 2868 -1552 -271 -1278 -4730 -6104 -3251 -2850 -11508 -12022 -3537 -316 -4537 -5533 -737
5799 -737 -525 -1270 5388 -3359 -4689 3168 3916 -1458 -6578 -5177 -3794 -5043 -5448 -7179 -7630 -910
5783 -910 2013 3439 9610 10100 3331 -2471 -1040 -3917 -11501 -13055 -13289 -11363 -5440 -1589 2541 7450
5767 7450 -1328 -8460 -5523 -3030 -137 1467 -2366 -9356 -8889 -6325 -12281 -12373 -3186 5314 10365 1633
5751 1633 -3774 -4490 -5674 -7553 2719 5644 3087 7381 3315 4897 12850 9815 5296 -1933 -3153
$$ packed form
5864I151l43o32K710q333j0581j580m5j813j113L612M013k740L780L313K795l882
5848a688r95n84P012m20n138k474p978m206O610q06o43J265p52P05K535N699M758
5831B900L68K230p786r314K553Q423K04j633Q597N38q93j629j444L731j963m708
5815A74J078J616m420J281j007l452j374K853M01q658n14Q485L221m221r96M796
5799g37K12p45O658q747j330P857P48n374n120J401J383j249m05j731m51O720
5783i10K923J426O171M90o769n802J431k877p584j554k34J926N923L851M130M909
5767G450q778p132K937K493K893J604l833o990M67K564n956r2R187Q500N051q732
5751A633n407p16j184j879J0272K925k557M294m066J582P953l035m519p229j220
$$ plain form
5736 -3153 -4092 -3399 573 5855 3338 -2262 -3122 2282 -3289 -6564 -5424 -726 -5174 -14039 -12162 -6381
5720 -6381 -5754 -5470 -1010 -2042 -50 5879 5934 -1523 -11478 -16403 -16968 -12445 -4553 -195 -5441 -11056
5704 -11056 -1519 3384 2703 1347 1650 2137 2236 -681 -2712 -3082 5648 8858 11042 4698 318 -722
5688 -722 -460 -4169 -5536 -1158 2066 6747 1428 -2849 -9363 -8863 -5701 -6945 -3409 5214 5746 7683
5672 7683 10191 7221 2912 -2663 -10192 -4489 981 4694 5855 18114 19519 11525 7607 3703 -2523
5657 -2523 -1036 262 -4651 -5319 -5626 -5459 -3812 -5055 -4359 274 -657 -4434 -3435 -5 -3440 -2016
5641 -2016 -22 -4505 -9088 -14222 -18510 -21301 -16876 -7618 -1366 -8145 -9103 -6730 -3995 -5073 -9654
5626 -9654 -8284 -3135 -6133 -5468 2714 1938 -3906 -2634 -4432 -840 -1383 -6222 -6581 -6649 -7382 -9095 -7923
$$ packed form
5736c153r39O93L972N282k517n600q60N404n571l275J140M698m448q865J877N781
5720f381O27K84M460j032J992N929N5p457r955m925n65M523P892M358n246n615
5704a1056R537M903o81j356L03M87R9k917k031l70Q730L210K184o344m380j040
5688g22K62l709j367M378L224M681n319m277o514N00L162j244L536Q623N32J937
5672G683K508k970m309n575p529N703N470L713J161J2259J405p994l918l904o226
5657b523J487J298m913o68l07J67J647j243O96M633r31l777R99L430l435J424
5641b016J994m483m583n134m288k791M425R258O252o779r58K373K735j078m581
5626i654J370N149k998O65Q182p76n844J272j798L592n43m839l59o8p33j713J172
$$ plain form
5609 -7923 -299 4623 1706 -6839 -10495 -12425 -10392 -2170 -4172 -13097 -16557 -11001 -4222 -1569 -6806
5594 -6806 -11991 -11919 -7838 -9231 -8403 -11852 -18560 -16083 -6581 -2788 -4284 -5957 -7527 -7669 -11488 -15203
5578 -15203 -6658 -1383 -4329 -3432 -428 -1606 -202 5066 11430 15549 17916 11850 13279 16839 9790
5563 9790 6070 3892 2096 1732 5489 -2196 -5950 -1857 5476 7680 10396 5039 -1609 -161 -2781
5548 -2781 -5781 -452 980 -1763 -4431 936 3862 161 13 -1450 -2448 -6249 -4779 -271 1887
5533 1887 -56 568 -1056 387 -1638 -4859 -1927 4605 8456 6728 -2270 -6727 -9184 -6998 -1684
5518 -1684 -2771 -3348 -6541 -9193 -13304 -13986 -14158 -7896 2414 1754 -2324 -2346 -2609 -163 2286 -2367
5502 -2367 -4931 -6609 -3774 -3395 -2314 -3492 -6785 -646 1870 1917 3393 2485 -378 -4903 -5504 -413
$$ packed form
5609g923P624M922k917q545l656j930K033Q222k002q925l460N556O779K653n237
5594f806n185P2M081j393Q28l449o708K477R502L793j496j673j570j42l819l715
5578a5203Q545N275k946Q97L004j178J404N268O364M119K367o066J429L560p049
5563I790l720k178j796l64L757p685l754M093P333K204K716n357o648J448k620
5548b781l000N329J432k743k668N367K926l701j48j463r98l801J470M508K158
5533A887j943O24j624J443k025l221K932O532L851j728q998m457k457K186N314
5518a684j087n77l193k652m111o82j72O262J0310o60m078k2k63K446K449m653
5502b367k564j678K835L79J081j178l293O139K516M7J476r08k863m525o01N091
$$ plain form
5486 -413 3674 2824 -2234 -8229 -9266 728 1799 -802 -865 -3398 -7971 -8255 -1664 -254 -625 -2460
5470 -2460 -10383 -12863 -12175 -12312 -11725 -6503 -4538 -9475 -5189 -4440 -3171 4126 4918 7803 1374 1866
5454 1866 -3914 -5920 -10264 -6307 -915 -2128 -2098 -7259 -5881 -4676 -1956 5423 5755 -2124 -4859 2557
5438 2557 -1225 -329 -3857 -3566 -3836 -6110 -7656 -615 3363 -7421 -16066 -10413 -10485 -11402 -11791 -15362
5422 -15362 -7939 -2441 -3545 -4434 -360 -5565 -8225 -10846 -13965 -7312 2152 4469 4973 4672 3585
5407 3585 3817 1071 217 6457 14412 14652 10319 6845 7158 5975 7030 4318 1352 5072 2064 4763
5391 4763 7721 1915 -3730 -3349 -3044 -8816 -11000 -11104 -9614 -3400 -2293 -5512 -725 2682 948 4681
5375 4681 2065 4265 9875 13949 12953 8489 2500 -2760 -3734 -2906 -3854 -8845 -9736 -11208 -6786 -309
$$ packed form
5486d13M087q50n058n995j037R994J071k601o3k533m573k84O591J410l71j835
5470b460p923k480O88j37N87N222J965m937M286P49J269P297P92K885o429M92
5454A866n780k006m344L957N392j213L0n161J378J205K720P379L32p879k735P416
5438B557l782Q96l528K91k70k274j546P041L978j0784q645N653p2r17l89l571
5422a5362P423N498j104q89M074n205k660k621l119O653R464K317N04l01j087
5407C585K32k746q54O240P955K40m333l474L13j183J055k712k966L720l008K699
5391D763K958n806n645L81L05n772k184j04J490O214J107l219M787L407j734L733
5375D681k616K200N610M074r96m464n989n260r74Q28r48m991q91j472M422O477
$$ plain form
5359 -309 4416 7712 4686 -483 -8384 -10842 -6946 -5757 -6626 -5029 -8382 -7178 -701 10184 7474
5344 7474 -1917 -5493 -9746 -14761 -11813 -11469 -13369 -10468 -8922 18 7802 9544 2660 2724 6640 -465
5328 -465 -9030 -128 -372 1574 5734 5000 765 -5837 -4429 -1695 2798 -3722 -5657 -5612 -13195 -7726
5312 -7726 -3103 -1594 -2593 -707 -5174 -12200 -16822 -13279 -3492 3165 -1085 -4507 -5942 -8164 -2225
5297 -2225 72 -403 730 2204 3028 6559 10842 12532 5038 -5899 -5741 -4257 -7814 -6685 -1868
5282 -1868 -3591 -4413 827 -1501 -6389 -4391 -7216 -8040 -6457 -4464 -2674 -3752 -12521 -15296 -6958
5267 -6958 839 -2070 -9338 -14467 -20264 -18462 -15143 -11305 -11996 -13969 -6815 -292 1231 -4709 -2210
5252 -2210 -872 -2319 -3101 -4575 -5330 -9928 -3251 -1004 539 -3203 -3006 -6443 -26 3064 -199 1981
$$ packed form
5359c09M725L296l026n169p901k458L896J189q69J597l353J204O477J0885k710
5344G474r391l576m253n015K948L44j900K901J546Q940P784J742o884O4L916p105
5328d65q565Q902k44J946M160p34m235o602J408K734M493o520j935M5p583N469
5312g726M623J509r99J886m467p026m622L543R787O657m250l422j435k222N939
5297b225K297m75J133J474Q24L531M283J690p494j0937J58J484l557J129M817
5282a868j723q22N240k328m888J998k825q24J583J993J790j078q769k775Q338
5267f958P797k909p268n129n797J802L319L838o91j973P154O523J523n940K499
5252b210J338j447p82j474p55m598O677K247J543l742J97l437O417L090l263K180
$$ plain form
5236 1981 905 -6288 -6938 -3217 -4145 -2841 -8474 -2904 -6303 -17704 -16431 -12348 -12892 -6893 -5398
5221 -5398 -6254 -10832 -9357 -4616 -4234 -5009 172 -144 -6339 -5724 -5896 -6121 -7159 56 6489 5205 -79
5204 -79 -5831 -3320 41 -908 1462 996 2236 -512 -4252 -3693 -2781 1445 -454 -5690 -2340 -673
5188 -673 3229 1853 925 4442 1316 -2519 -2198 620 2517 -1555 -6627 1724 10967 7447 7496 8761
5172 8761 3395 -4441 -10212 -8320 446 3047 4125 4800 -3684 -1330 2889 -3569 -9259 -15849 -14423
5157 -14423 -6307 -2691 -5440 -7463 -9333 -9535 -4573 419 -2813 -900 -6652 -12028 -7554 265 1898
5142 1898 475 -6990 -4381 -1878 -1026 5237 5767 6876 6153 6709 2246 -3639 -1879 -5898 -3927 -6012
5126 -6012 -8676 -5825 65 -4943 -1803 2818 -8973 -13014 -5926 -599 1705 -880 -4429 -7311 -8899
$$ packed form
5236A981j076p193o50L721r28J304n633N570l399j1401J273M083n44N999J495
5221e398q56m578J475M741L82p75N181l16o195O15j72k25j038P215O433j284n284
5204g9n752K511L361r49K370m66J240k748l740N59R12M226j899n236L350J667
5188f73L902j376r28L517l126l835L21K818J897m072n072Q351R243l520M9J265
5172H761n366p836n771J892Q766K601J078O75q484K354M219o458n690o590J426
5157a4423Q116L616k749k023j870k02M962M992l232J913n752n376M474P819J633
5142A898j423p465K609K503Q52O263N30J109p23N56m463n885J760m019J971k085
5126f012k664K851N890n008L140M621j1791m041P088N327K304k585l549k882j588
$$ plain form
5111 -8899 -3763 -5119 -770 4365 2794 1429 -4613 -1222 3494 1065 3127 2948 1402 -2029 -5920
5096 -5920 -2495 -1616 -1775 -1986 -5705 -6959 -9040 -6588 -2595 -3346 -4382 -1227 -4454 1647 4150 2218
5080 2218 -234 1310 3251 3995 3092 -4749 -10335 -524 9447 2492 771 -1108 5159 11430 4800
5065 4800 2734 -4039 -6330 -3444 -4536 -5719 -7629 -11516 -16805 -14772 -13556 -11583 -3729 486 -3090
5050 -3090 -12800 -10721 -10102 -12473 -12260 -9810 -6332 -4396 4731 11594 10484 3240 -1803 2139 -2564
5035 -2564 -3665 524 6661 14446 12211 11184 11538 12281 2858 -4748 -12176 -11310 -6457 -1402 -4586 -8487
5019 -8487 -8690 -6395 3836 2289 -7596 -2475 -4659 -7915 -9084 -5243 -7756 -12580 -13669 -6379 -3769
5004 -3769 -2362 -6434 -5692 -4228 408 9186 11347 9349 4887 9506 13557 10745 4737 482 -631
$$ packed form
5111h899N136j356M349N135j571j365o042L391M716k429K062j79j546l431l891
5096e920L425Q79j59k11l719j254k081K452L993p51j036L155l227O101K503j932
5080B218k452J544J941P44r03p841n586R811R971o955j721j879O267O271o630
5065D800k066o773k291K886j092j183j910l887n289K033J216J973P854M215l576
5050c090r710K079O19k371K13K450L478J936R127O863j110p244n043L942m703
5035b564j101M189O137P785k235j027L54P43r423p606p428Q66M853N055l184l901
5019h487k03K295J0231j547r885N121k184l256j169L841k513m824j089P290K610
5004c769J407m072P42J464M636Q778K161j998m462M619M051k812o008m255j113
$$ plain form
4989 -631 4235 3751 3357 4766 -996 2750 7267 4409 6101 4831 3573 2040 -736 2437 -2918 -6621
4973 -6621 -9485 -9078 -9393 -6268 -7924 -6632 -4900 3805 3054 5207 -114 1367 7378 7090 4382 -3231
4957 -3231 -2739 825 1975 3326 -518 2469 5626 9086 7132 5080 3644 -5867 -11179 -9526 -4212
4942 -4212 -7534 -7249 1734 3373 -329 -8474 -10640 -5420 5080 12538 2978 -229 -2686 -3952 -1326
4927 -1326 -1862 -5047 -3392 -11186 -15051 -18413 -13879 -6123 -8088 -7974 -9104 -15727 -20003 -11797 -2893
4912 -2893 -2945 -5967 -4311 -2428 929 -6731 -4782 -2801 -2717 947 2317 1028 -483 4102 6336 6625
4896 6625 2005 -1975 -4235 -2740 -6905 -9254 -8562 -10634 -4532 -5728 -6590 -1561 11839 14870 7664
4881 7664 1282 169 1329 -2156 1176 319 -6380 -5806 -3169 -1669 -1100 2564 4679 6868 5806 1645
$$ packed form
4989f31M866m84l94J409n762L746M517k858J692j270j258j533k776L173n355l703
4973f621k864M07l15L125j656J292J732Q705p51K153n321J481O011k88k708p613
4957c231M92L564J150J351l844K987L157L460j954k052j436r511n312J653N314
4942d212l322K85Q983J639l702q145k166N220J0500P458r560l207k457j266K626
4927a326n36l185J655p794l865l362M534P756j965J14j130o623m276Q206Q904
4912b893n2l022J656J883L357p660J949J981Q4L664J370j289j511M585K234K89
4896F625m620l980k260J495m165k349O92k072O102j196q62N029J3400L031p206
4881G664o382j113J160l485L332q57o699N74K637J500N69L664K115K189j062m161
$$ plain form
4865 1645 3403 5072 4620 6163 393 1253 -2112 -3837 5334 5413 1255 -3155 -6392 -6755 1803 11279
4849 11279 4834 -1465 590 97 1740 4884 3203 -1224 486 -265 -3404 -4139 -737 7738 6777 209
4833 209 -5078 -8430 -12127 -9659 -6602 -4492 -2135 -2292 2519 9171 9494 908 -3761 -5355 -6366 -6092
4817 -6092 -13052 -15136 -9137 -4362 3552 -168 -4921 -4084 3740 7123 4647 2825 -2484 -9616 -7323
4802 -7323 -7429 359 1317 836 -4818 -1082 9131 8603 3194 5938 3634 -928 -770 -2607 -1058 -372
4786 -372 -2588 -5984 -14180 -15755 -11965 -9767 -5407 -4996 -2207 2980 3344 159 2651 1624 3816 289
4770 289 -1607 -3703 -8185 -4424 3463 2930 -3121 1311 -3235 -4548 -3727 -2337 -2967 -1951 -2110 -4842
4754 -4842 -2607 2159 3895 -1617 3047 5203 2923 9093 12823 11911 2959 -7066 -12293 -9640 -7113
$$ packed form
4865A645J758J669m52J543n770Q60l365j725R171P9m158m410l237l63Q558R476
4849A1279o445o299K055m93J643L144j681m427J710p51l139p35L402Q475r61o568
4833B09n287l352l697K468L057K110K357j57M811O652L23q586m669j594j011K74
4817f092o960k084N999M775P914l720m753Q37P824L383k476j822n309p132K293
4802g323j06P788R58m81n654L736J0213n28n409K744k304m562J58j837J549O86
4786c72k216l396q196j575L790K198M360M11K789N187L64l185K492j027K192l527
4770B89j896k096m482L761P887n33o051M432m546j313Q21J390o30J016j59k732
4754d842K235M766J736n512M664K156k280O170L730r12q952j0025n227K653K527
$$ plain form
4739 -7113 -9410 -5225 -9 6341 2501 -1262 2768 5674 3946 1380 -4828 -5337 -5035 -4075 -1733 -2342
4723 -2342 -5891 -5190 8077 13308 9613 3958 -1813 -6423 -8771 -6583 760 1493 6790 4452 -789
4708 -789 117 -4424 -11951 -11626 -12349 -7456 -3467 -748 -52 -3302 -3642 -6059 -3896 -3470 -210 3309 2801
4691 2801 427 -5753 -2725 1723 3344 4457 4889 3903 3448 -3171 -2111 -1275 -2609 -2431 2869 1163
4675 1163 2427 6508 1472 1050 8997 7971 5951 9823 7917 5716 221 -8655 -11373 -3844 -2341
4660 -2341 -4003 -4632 -4578 -1052 618 2269 1298 2233 2320 2461 -2163 -9501 -12170 -14903 -14807 -12033 -9458
4643 -9458 -5228 -5526 -64 2482 4259 550 532 -8556 -9275 -5661 -7099 -9263 -12651 -13027 -957 2800
4627 2800 -202 2531 7444 4116 -1486 2054 4536 -850 -3105 4597 2783 5914 8986 10196 11586
$$ packed form
4739g113k297M185N216O350l840l763M030K906j728k566o208n09L02R60K342o09
4723b342l549P01J3267N231l695n655n771m610k348K188P343P33N297k338n241
4708g89R06m541p527L25p23M893L989K719O96l250l40k417K163M26L260L519n08
4691B801k374o180L028M448J621J113M32r86m55o619J060Q36j334J78N300j706
4675A163J264M081n036m22P947j026k020L872j906k201n495q876k718P529J503
4660b341j662o29N4L526J670J651r71R35Q7J41m624p338k669k733R6K774K575
4643i458M230k98N462K546J777l709j8r088p19L614j438k164l388l76J2070L757
4627B800l002K733M913l328n602L540K482n386k255P702j814L131L072J210J390
$$ plain form
4612 11586 7569 2187 714 -3929 -2478 5460 1136 -7409 -8642 -9117 -5216 -3540 -13002 -16503 -12451
4597 -12451 -5171 2080 -1143 -1469 701 -233 757 -657 -4056 -307 4540 3395 -2849 -6351 -11473
4582 -11473 -11973 -8885 552 7596 621 -7339 -4219 2243 2100 -208 364 3117 4792 2564 -3186
4567 -3186 -7911 -5880 -4250 -6081 -2082 -1549 -5982 -8543 -7447 3736 13670 10311 6899 4757 8610
4552 8610 2301 7767 8021 1794 3486 1769 417 -4511 -9041 -6024 8878 6198 3892 852 939
4537 939 2119 -2703 -1454 -3542 -7520 -5338 -2843 2621 1519 -5404 -7646 -7003 -1470 -893 -312 -3170
4521 -3170 -3172 -6697 -9788 -1877 470 -4082 -6489 -3188 -5076 -5235 -5196 -320 -2847 -8766 -3836 2326
4505 2326 9443 5478 2548 -1530 -864 4333 4960 -115 -10961 -8709 -4007 -1199 -8732 -5118 -1342
$$ packed form
4612A1586m017n382j473m643J451P938m324q545j233m75L901J676r462l501M052
4597a2451P280P251l223l26K170r34R90j414l399L749M847j145o244l502n122
4582a1473n00L088R437P044o975p960L120O462j43k308N72K753J675k228n750
4567c186m725K031J630j831L999N33m433k561J096J1183R934l359l412k142L853
4552H610o309N466K54o227J692j717j352m928m530L017J4902k680k306l040Q7
4537I39J180m822J249k088l978K182K495N464j102o923k242O43N533N77N81k858
4521c170kl525l091P911K347m552k407L301j888j59L9M876k527n919M930O162
4505B326P117l965k930m078O66N197O27n075j0846K252M702K808p533L614L776
$$ plain form
4490 -1342 -1697 -1236 -922 -4437 -12588 -13017 -3691 -2630 2170 -1784 533 10968 10989 3169 -7350 -9714
4474 -9714 -2359 4664 2293 2823 4068 -863 -304 -531 291 -769 -6927 -7286 -2979 4207 12063 14961
4458 14961 10109 8364 7385 -535 124 809 -4957 -3603 2323 3722 6234 -891 -5503 -4336 -7040
4443 -7040 -2814 -295 4751 10004 11171 11777 10134 11264 5951 -917 3294 4648 5065 8436 4586
4428 4586 6140 3229 6923 7729 7765 2937 2105 781 -1904 160 -2783 -1155 1711 -977 -5097 -10214
4412 -10214 -6248 -916 -3178 -8485 -10407 -9364 -9308 -7943 -551 -5043 -1265 1526 2923 2400 4765
4397 4765 3920 -188 -5808 -3663 -3136 -4947 1275 7260 3665 6209 4335 -1078 -1115 -2336 -4862 -1254
4381 -1254 4075 4584 5884 15238 16864 6185 2575 -3000 3157 10176 8510 1084 -801 3266 5692
$$ packed form
4490a342l55M61L14l515q151m29R326J061M800l954K317J0435K1p820j0519k364
4474i714P355P023k371N30J245m931N59k27Q22j060o158l59M307P186P856K898
4458A4961m852j745r79p920O59O85n766J354N926J399K512p125m612J167k704
4443g040M226K519N046N253J167O06j643J130n313o868M211J354M17L371l850
4428D586J554k911L694Q06L6m828q32j324k685K064k943J628K866k688m120n117
4412a0214L966N332k262n307j922J043N6J365P392m492L778K791J397n23K365
4397D765q45m108n620K145N27j811O222N985l595K544j874n413l7j221k526L608
4381a254N329N09J300R354J626j0679l610n575O157P019j666p426j885M067K426
$$ plain form
4366 5692 2145 -1959 -4560 -6009 -6604 -7907 -9891 -7477 -6561 -3773 -1954 -404 -1170 -9867 -8378 -1491
4350 -1491 -1694 3982 1683 -7663 -3188 -2754 -6019 -2582 4132 4031 3586 4438 220 -1733 -7825 -12126
4334 -12126 -8796 -9289 -12505 -7411 3594 4301 140 -3044 -2953 276 4536 5720 -1307 -6411 -12176
4319 -12176 -5653 -8109 -4281 -1718 1482 5043 2013 808 8791 10093 8040 1701 -302 1245 6999
4304 6999 11211 7921 5245 440 -2300 -3899 -94 799 1954 3660 -69 892 3609 4657 4795 -4000
4288 -4000 -4189 532 3014 796 -2451 5768 10462 7817 4390 -946 -1867 2114 5535 1538 -8743
4273 -8743 -11474 -5417 -8792 -5942 -3600 536 -5320 -1119 -606 410 4131 4430 4806 2644 1690 -502
4257 -502 -3466 -3504 -2732 -2399 -1963 -3471 -631 3380 6079 4212 162 -5889 -3884 1192 322 6483 9526
$$ packed form
4366E692l547m104k601j449n95j303j984K414R16K788J819J550p66q697J489O887
4350a491k03N676k299r346M475M34l265L437O714j01m45Q52m218j953o092m301
4334a2126L330m93l216N094J1005P07m161l184R1L229M260J184p027n104n765
4319a2176O523k456L828K563L200L561l030j205P983J302k053o339k003J547N754
4304F999M212l290k676m805k740j599L805Q93J155J706l729R61K717J048J38q795
4288d000j89M721K482k218l247Q219M694k645l427n336r21L981L421l997j0281
4273h743k731O057l375K850K342M136n856M201N13J016L721K99L76k162r54k192
4257e02k964l8P72L33M36j508K840M011K699j867m050o051K005N076q70O161L043
$$ plain form
4240 9526 3755 -162 -1139 -3193 -362 -3752 3557 10612 9633 11895 8481 -519 -7066 1315 8542
4225 8542 2041 -1498 653 5481 1388 5114 3743 5106 306 -386 -919 6653 4302 -568 993
4210 993 5681 1960 2484 3284 6084 4885 979 -1142 -945 -1772 5754 4446 6378 9033 6651 5816
4194 5816 5530 13618 11243 -4153 -3036 4154 6675 3746 -1834 -403 1448 5857 4701 8048 367
4179 367 -3913 -2624 -525 -7740 -11123 -15580 -14663 -12718 -8822 -6991 -6156 -5418 -8718 -5854 2870 6600
4163 6600 2366 -7927 -10640 -1402 262 282 1893 -2924 -5514 -1904 -1998 -8319 -14457 -14681 -11066 -12390
4147 -12390 -7456 3301 5851 -1480 -2887 -2999 -3300 2639 -2445 -1207 -4522 -6506 -6827 -5081 -5886
4132 -5886 -5676 -4775 5966 14071 8930 6153 6600 5284 -1582 1877 3718 1151 -3302 -2751 -7431 -8361
$$ packed form
4240I526n771l917r77k054K831l390P309P055r79K262l414r000o547Q381P227
4225H542o501l539K151M828m093L726j371J363m800o92n33P572k351m870J561
4210I93M688l721N24Q00K800j199l906k121J97q27P526j308J932K655k382q35
4194E816k86Q088k375j5396J117P190K521k929n580J431J851M409j156L347p681
4179C67m280J289K099p215l383m457R17J945L896J831Q35P38l300K864Q724L730
4163F600m234j0293k713R238J664K0J611m817k590L610r4o321o138k24L615j324
4147a2390M934J0757K550p331j407j12l01N939n084J238l315j984l21J746q05
4132e886K10R01J0741Q105n141k777M47j316o866L459J841k567m453N51m680r30
$$ plain form
4116 -8361 -10349 -6455 -2049 3589 5940 -720 -9261 -14765 -16421 -11809 -4244 -1659 4448 9783 10421
4101 10421 7337 6676 5744 7577 5307 3645 3070 1034 -5527 -6887 -6151 -636 6303 6703 7276 4928
4085 4928 2282 -2562 1889 6607 4373 2697 7255 6534 8064 3607 -4527 -7410 -2254 1627 -4327
4070 -4327 -2958 -3972 -4105 -4814 -2042 -615 2714 5207 3692 1555 7778 6345 3090 3985 10253 9718
4054 9718 6900 5228 8093 4074 -1544 -6272 -6486 728 7580 8138 6120 -399 -630 3083 4595 7518
4038 7518 4692 4397 5767 1719 -1647 448 6477 10970 9170 5007 2617 -2257 -2000 1202 -1647
4023 -1647 -1708 1000 5793 4290 2308 -2468 -273 -223 -4344 -5072 -3494 -1170 -8937 -16283 -13013 -2955
4007 -2955 -5849 -8095 -6193 -5322 1614 3488 3622 5070 5929 6596 4857 3867 721 2121 2815 2104 3023
$$ packed form
4116h361j988L894M406N638K351o660q541n504j656M612P565K585O107N335O38
4101A0421l084o61r32J833k270j662n75k036o561j360P36N515O939M00N73k348
4085D928k646m844M451M718k234j676M558p21J530m457q134k883N156L881n954
4070d327J369j014j33p09K772J427L329K493j515k137O223j433l255Q95O268n35
4054I718k818j672K865m019n618m728k14P214O852N58k018o519k31L713J512K923
4038G518k826k95J370m048l366K095O029M493j800m163k390m874K57L202k849
4023a647o1K708M793j503j982m776K195N0m121p28J578K324p767p346L270J0058
4007b955k894k246J902Q71O936J874J34J448Q59O67j739r90l146J400O94p11R19
$$ plain form
3990 3023 4565 6660 5930 -3028 1817 35 -3184 -6263 -4193 3129 10613 18066 15790 12888 11324
3975 11324 10680 7569 559 726 5228 4101 2444 -31 4756 5728 627 -5476 -2991 3935 6882
3960 6882 6707 7195 5893 11309 9367 5311 6923 -2945 -3743 -6692 -9782 -8713 756 4904 8615 11537
3944 11537 6318 -6050 -5936 1576 6402 14286 8254 2293 4587 5183 5016 4696 2601 -2527 -226
3929 -226 132 -584 -3153 -10399 -13134 -7300 -5737 -5112 -12471 -12576 -11877 -8190 3023 7570 3323 3588
3913 3588 12923 9523 5914 -1360 -13451 -16303 -4340 8052 15197 9357 10627 8226 6880 4270
3899 4270 692 807 -2729 -2823 101 -2161 -1666 5073 13041 4862 -1492 1237 1432 -1470 -10094 -13532
3883 -13532 -9073 -6807 -10153 -14137 -13970 -14689 -14150 -12061 -7744 -4421 -6573 -9624 -7152 -5186 -9754
$$ packed form
3990C023J542K095p30q958M845j782l219l079K070P322P484P453k276k902j564
3975A1324o44l111p010J67M502j127j657k475M787R72n101o103K485O926K947
3960F882j75M88j302N416j942m056J612r868p98k949l090J069R469M148L711K922
3944A1537n219j2368J14P512M826P884o032n961K294N96j67l20k095n128K301
3929b26L58p16k569p246k735N834J563O25p359j05O99L687J1213M547m247K65
3913C588R335l400l609p274j2091k852J1963J2392P145n840J270k401j346k610
3899D270l578J15l536r4K924k262M95O739P968q179o354K729J95k902q624l438
3883a3532M459K266l346l984J67p19N39K089M317L323k152l051K472J966m568
$$ plain form
3868 -9754 -6443 4172 7137 2671 3479 1730 -3353 -4359 -5613 1802 10335 8381 7900 15009 14998 7414
3852 7414 -4550 -4101 -3938 -11009 -16292 -19940 -15706 -4284 -771 -902 500 5899 4581 2355 6764
3837 6764 12931 11395 6616 3041 -2613 -11703 -8337 -4775 1782 980 -5486 -4506 -4183 -2807 656 4090
3821 4090 1579 -3159 -1828 -56 2349 -574 4159 6878 13543 10824 7877 16716 19342 13097 4320
3806 4320 2116 3867 4773 5293 4109 3702 8303 6280 3214 5612 990 -2191 2760 7008 4749 -4578
3790 -4578 -7336 -294 2632 -3028 -6880 -2114 7616 14282 16185 4400 -7441 -16922 -21252 -21141 -17791
3775 -17791 -10566 -6269 -3796 865 -306 238 6196 7483 8388 7593 4538 2798 -1076 -1896 -2145 1610
3759 1610 5311 5902 8475 5715 4559 -2118 -2125 2909 5815 12046 1896 135 2962 3530 3410 -2337
$$ packed form
3868i754L311J0615K965m466Q08j749n083j006j254P415Q533j954m81P109j1p584
3852G414j1964M49J63p071n283l648M234J1422L513j31J402N399j318k226M409
3837F764O167j536m779l575n654r090L366L562O557q02o466R80L23J376L463L434
3821D090k511m738J331J772K405k923M733K719O665k719k947Q839K626o245q777
3806D320k204J751R06N20j184m07M601k023l066K398m622l181M951M248k259r327
3790d578k758P042K926n660l852M766R730O666J903j1785j1841r481m330J11L350
3775a7791P225M297K473M661j171N44N958J287R05p95l055j740l874q20k49L755
3759A610L701N91K573k760j156o677pN034K906O231j0150j761K827N68j20n747
$$ plain form
3743 -2337 -1763 -2537 -1571 -5484 -8571 -9114 31 -952 -5803 -6516 -2265 -6600 -2575 6667 6174 8251 2270
3726 2270 -2799 -3602 -1271 -1015 -1231 604 53 -1067 -11360 -11976 -12585 -8365 -7359 1644 7313 3619
3710 3619 3504 -341 -4500 -6531 -5409 -5519 -370 -2364 -2611 -2795 -6896 -8095 -5517 1277 -946 1034
3694 1034 6185 5132 9914 10930 8898 -341 -6762 -8887 -10465 -6326 593 -577 -430 7725 11758
3679 11758 4714 3415 7737 7966 3975 290 -8513 -9468 -11414 -13815 -12663 -6882 -5766 2081 5809
3664 5809 10920 14356 9923 5547 -4135 -8829 -11090 -9041 -3797 -3236 799 6983 3456 -7476 -8313
3649 -8313 -4953 -3653 -11665 -13055 -13789 -13583 -11652 -9714 -5890 -2416 672 -4168 -2746 -2756 -8114 -4980
3633 -4980 2669 -1827 -4151 -2262 1606 -2220 -926 1470 2713 -2854 -2104 -491 2543 4826 -1309
$$ packed form
3743b337N74p74R66l913l087n43R145r83m851p13M251m335M025R242m93K077n981
3726B270n069q03K331K56k16J835n51j120j0293o16o09M220J006R003N669l694
3710C619j15l845m159k031J122j10N149j994k47j84m101j199K578O794k223J980
3694A034N151j053M782J016k032r239o421k125j578M139O919j170J47Q155M033
3679A1758p044j299M322K29l991l685q803r55j946k401J152N781J116P847L728
3664E809N111L436m433m376r682m694k261K049N244N61M035O184l527j0932q37
3649h313L360J300q012j390p34K06J931J938L824L474L088m840J422j0n358L134
3633d980P649m496k324J889L868l826J294K396J243n567P50J613L034K283o135
$$ plain form
3618 -1309 -4489 -1416 2270 2339 -890 860 -2236 -1081 894 9412 2709 -7709 -2471 3065 -2040
3603 -2040 -2958 -4589 -7933 -3942 5755 5891 2191 -2634 -1740 -1710 -1649 1148 5039 -703 2468 2885 5622
3586 5622 2036 793 1274 865 4093 1534 -4184 -5893 -326 4243 -651 -2360 -4145 -6794 -8725
3571 -8725 -4252 3869 2998 -3138 -8015 -3295 2345 -2528 -2707 -1533 -376 379 -2181 -8676 -12357 -12228
3555 -12228 -9348 -9043 -6669 -591 1461 -293 1153 -654 2981 2067 -2616 -7840 -3084 230 -1691
3540 -1691 -3113 -4423 -1344 -3212 -552 1235 -3255 2884 4723 2203 -881 2630 4759 513 -4715
3525 -4715 -3270 -570 5128 6842 8477 4267 2043 8557 8390 8484 9891 5840 12681 6892 209 5227
3509 5227 11400 12084 9922 -1263 -5893 -6192 -3582 1407 2444 -870 -1064 -3552 -4414 -8064 -5042 -1864
$$ packed form
3618a309l180L073L686O9l229J750l096J155J975Q518o703j0418N238N536n105
3603b040r18j631l344L991R697J36l700m825Q94L0O1K797L891n742L171M17K737
3586E622l586j243M81m09L228k559n718j709N567M569m894j709j785k649j931
3571h725M473Q121q71o136m877M720N640m873j79J174J157P55k560o495l681J29
3555a2228K880L05K374O078K052j754J446j807L635r14m683n224M756L314j921
3540a691j422j310L079j868K660J787m490O139J839k520l084L511K129m246n228
3525d715J445K700N698J714J635m210k224O514j67R4J407m051O841n789o683N018
3509E227O173O84k162j1185m630k99K610M989J037l314j94k488q62l650L022L178
$$ plain form
3493 -1864 3224 6325 7412 8700 2963 -4800 -2102 1338 2886 6504 11735 1056 -4334 -1408 4476
3478 4476 1706 1286 1078 -1053 -3763 -1023 10 -361 -5764 709 9718 12790 10832 1849 -5426 -7959
3462 -7959 -8139 -2743 6405 12011 2664 -1521 -4196 -4442 -2589 1991 -979 -1647 -6802 -7893 -3116 -502
3446 -502 933 5292 2587 -1599 -5677 -6983 -6314 -1549 -5276 -5062 -3239 -8362 -5502 -3158 -2478 -6197
3430 -6197 -8269 -1921 -3501 -1303 -1558 811 -1167 -3694 -5770 -64 1586 -625 -4585 -1392 -4488
3415 -4488 -9825 -7828 -7433 -8229 -3113 -1036 -2774 -4888 3312 3838 -233 1456 3775 3544 324 -566
3399 -566 2377 3012 2589 -1141 5658 5362 2486 7924 7445 3672 2973 1072 3884 532 1909 2866 -2327
3382 -2327 -3474 -1860 -2604 3254 2531 547 4452 4257 -3944 -3732 -1732 -7256 -8129 837 3897 -1331
$$ packed form
3493a864N088L101J087J288n737p763K698L440J548L618N231j0679n390K926N884
3478D476k770m20k08k131k710K740J033l71n403O473R009L072j958q983p275k533
3462g959j80N396R148N606r347m185k675k46J853M580k970o68n155j091M777K614
3446e02J435M359k705m186m078j306O69M765l727K14J823n123K860K344O80l719
3430f197k072O348j580K198k55K369j978k527k076N706J650k211l960L193l096
3415d488n337J997L95p96N116K077j738k114Q200N26m071J689K319k31l220q90
3399e66K943O35m23l730O799k96k876N438m79l773o99j901K812l352J377R57n193
3382b327j147J614p44N858p23j984L905j95q201K12K000n524q73Q966L060n228
$$ plain form
3366 -1331 -1633 -7835 -15553 -19122 -12488 -3691 1136 597 2387 3574 1360 3969 -569 -8230 -11504
3351 -11504 -8224 -7624 -9402 -9211 -2184 -2415 -6180 -6933 -6315 -5786 -302 -2273 -6743 -5730 -2777 -4970
3335 -4970 -7442 -9741 -15039 -11345 -2451 4846 3220 -738 -5050 -3633 1093 -15 -3749 -1655 -6509
3320 -6509 -8207 -6987 -5973 1805 -1399 -6438 -12886 -8691 -2353 -1153 -5914 -8843 -8633 76 9876
3305 9876 9373 4106 880 -461 -484 -147 1739 2889 2459 3870 4454 8214 3236 -677 -1841 1671
3289 1671 11648 13487 13619 11532 7336 127 -8462 -11931 -9654 -8301 -7316 -1523 1884 -1072 -6519
3274 -6519 -4230 3269 2145 837 -1165 -7714 -9485 -5854 -1738 -609 4664 -1035 -5981 -11946 -5369
3259 -5369 -349 -4973 -14511 -15882 -14898 -14690 -8640 970 7722 15042 16771 7217 792 -2501 -1054
$$ packed form
3366a331l02o202p718l569O634Q797M827n39J790J187k214K609m538p661l274
3351a1504L280O00j778J91P027k31l765p53O18N29N484j971m470J013K953k193
3335d970k472k299n298L694Q894P297j626l958m312J417M726j108l734K094m854
3320f509j698J220J014P778l204n039o448M195O338J200m761k929K10Q709R800
3305I876n03n267l226j341k3L37J886J150m30J411N84L760m978l913j164L512
3289A671R977J839J32k087m196p209q589l469K277J353R85N793L407k956n447
3274f519K289P499j124j308k002o549j771L631M116J129N273n699m946n965O577
3259e369N020m624r538j371R84K08O050R610O752P320J729r554o425l293J447
$$ plain form
3244 -1054 6298 12264 15413 4021 -2601 2181 -3132 -4760 -1434 2090 6809 6612 8481 9603 3850
3229 3850 -4716 -7924 -8686 -12632 -12166 -15676 -16338 -12840 -9139 2043 7502 2170 -1559 -3127 -5072
3214 -5072 -6659 -1380 2470 8497 17482 20142 9184 6536 5303 -1827 -4889 -7149 -7959 -2726 4100
3199 4100 5030 -305 -1931 4195 3747 2489 -4736 -5815 -9102 -5885 -243 7377 3295 -3524 -3124 -10472
3183 -10472 -14873 -10508 -9456 -6654 -7195 -10535 -10127 -9146 -8584 -7303 -6148 -992 -160 6044 7814 1713
3167 1713 29 2960 6461 3238 4972 3469 4900 3896 5327 6617 7836 9695 2993 957 6914
3152 6914 5152 -5936 -3693 535 3134 1394 -114 3816 4079 5276 5621 -3815 -8146 -12336 -12347 -1125
3136 -1125 4417 3547 4439 -1843 -8589 -7628 -329 -1812 -3483 1574 4566 7455 6689 441 1067 -5652
$$ packed form
3244a054P352N966L149j1392o622M782n313j628L326L524M719j97J869J122n753
3229C850q566l208p62l946M66l510o62L498L701J1182N459n332l729j568j945
3214e072j587N279L850O027Q985K660j0958k648j233p130l062k260q10N233O826
3199D100R30n335j626O126m48j258p225j079l287L217N642P620m082o819M00p348
3183a0472m401M365J052K802n41l340M08R81N62J281J155N156Q32O204J770o101
3167A713j684K931L501l223J734j503J431j004J431J290J219J859o702k036N957
3152F914j762j1088K243M228K599j740j508L930K63J197L45r436m331m190j1J1222
3136a125N542q70Q92o282o746R61P299j483j671N057K992K889p66o248O26o719
$$ plain form
3120 -5652 -4581 1617 2776 -846 570 2283 -2189 -4936 -5667 -4416 -1485 4453 4338 4264 -2359 -10400
3104 -10400 -11843 -13144 -10682 -11419 -5055 1528 -4615 -9821 -4435 -897 -3450 674 9537 10834 10713
3089 10713 12765 5973 -5141 -7468 -6261 -8038 -4900 744 2488 4771 678 -4503 -3036 1733
3075 1733 3883 5272 6198 3617 2440 -35 1688 1631 -4860 -316 2531 3391 -224 -3080 -6068 -459
3059 -459 1902 1699 -1484 430 5658 9332 9728 6217 6827 2512 -6244 -5249 3142 3308 -660 -5685
3043 -5685 -10595 -15870 -16009 -7975 1009 8849 13441 10045 4198 2187 -83 1411 -1828 -1579 -4560
3028 -4560 -1265 6011 7891 -1146 -603 1555 -461 -3707 -374 -5099 -4761 3651 1696 -1945 -2210 -2385
3012 -2385 -4498 -6139 -2479 -529 -4047 -7428 -10072 -11556 -7432 -856 12930 10136 -850 -1350 2721
$$ packed form
3120e652J071O198J159l622J416J713m472k747p31J251K931N938j15p4o623q041
3104a0400j443j301K462p37O364O583o143n206N386L538k553M124Q863J297j21
3089A0713K052o792j1114k327J207j777L138N644J744K283m093n181J467M769
3075A733K150J389R26k581j177k475J723n7o491M544K847Q60l615k856k988N609
3059d59K361k03l183J914N228L674L96l511O10m315q756R95Q391J66l968n025
3043e685m910n275j39Q034Q984P840M592l396n847k011k270J494l239K49k981
3028d560L295P276J880r037N43K158k016l246L333m725L38Q412j955l641k65j75
3012b385k113j641L660J950l518l381k644j484M124O576J3786k794j0986n00M071
$$ plain form
2997 2721 4214 3436 9737 17249 12359 11625 12525 3241 -3700 -474 10440 11471 5001 -6134 -5296
2982 -5296 643 3304 1883 3802 3330 3173 132 -1798 646 -3517 -3949 -2940 -4475 3656 4564 5669
2966 5669 453 -4201 -9809 -12012 -7404 703 806 375 1645 1258 -347 -2159 -2946 -4566 -6073 -11992
2950 -11992 -11480 -4622 1312 2216 5734 8365 8084 7457 3393 3838 5807 2405 -9 -1050 -167 -2296
2934 -2296 -848 2579 7124 3525 4269 7427 2637 6410 12582 12863 16268 19440 5057 -2683 -5485
2919 -5485 -12218 -11101 -3347 1374 -1075 -5117 -7001 -5645 -2330 -3515 1225 405 2929 4544 3962
2904 3962 3149 5228 1691 661 2185 781 -1179 -11217 -12979 1028 3172 3452 8503 7906 1952
$$ packed form
2997B721J493p78O301P512m890p34R00r284o941L226J0914J031o470j1135Q38
2982e296N939K661j421J919m72j57l041j930K444m163m32J009j535Q131R08J105
2966E669n216m654n608k203M608Q107J03m31J270l87j605j812p87j620j507n919
2950a1992N12O858N934R04L518K631k81o27m064M45J969l402k414j041Q83k129
2934b296J448L427M545l599P44L158m790L773O172K81L405L172j4383p740k802
2919e485o733J117P754M721k449m042j884J356L315j185M740q20K524J615n82
2904C962q13K079l537j030J524j404j960j0038j762J4007K144K80N051n97n954
$$ [...]
##END NTUPLES=NMR SPECTRUM
##END=
