##TITLE=Analysis number 329948
Compound Code cc 58739
Book Reference 553/12
Project Code adrs
Chemist Name simons
##JCAMPDX= 6.0         $$ Bruker NMR JCAMP-DX V2.0
##DATA TYPE= NMR SPECTRUM
##DATA CLASS= NTUPLES
##ORIGIN= Bruker BioSpin GmbH
##OWNER= nmr
$$ XWIN-NMR		Version 3.5
$$ Mon Oct 15 12:11:35 2007 GMT Daylight Time (UT+1h)  MAYBRIDGE\nmr@NMR_250MHZ
##.OBSERVE FREQUENCY= 250.131544655141
##.OBSERVE NUCLEUS= ^1H
##.ACQUISITION MODE= SIMULTANEOUS (DQD)
##.ACQUISITION SCHEME= undefined
##.AVERAGES= 16
##.DIGITISER RES= 18
##SPECTROMETER/DATA SYSTEM= dpx250
##.PULSE SEQUENCE= zg30
##.SOLVENT NAME= CDCl3
##.SHIFT REFERENCE= (INTERNAL, CDCl3, 0, 16.4341)
##AUDIT TRAIL= $$ (NUMBER, WHEN, WHO, WHERE, WHAT)
$$ ##TITLE= Audit trail, XWIN-NMR		Version 3.5
$$ ##JCAMPDX= 5.01
$$ ##ORIGIN= Bruker BioSpin GmbH
$$ ##OWNER= nmr
$$ C:\u/data/dgb/nmr/ADRS/720/pdata/1/auditp.txt
$$ ##AUDIT TRAIL=  $$ (NUMBER, WHEN, WHO, WHERE, WHAT)
(   1,<2007-10-15 12:11:10.52 +100>,<MAYBRIDGE\nmr>,<NMR_250MHZ>,
      <created by zg, POWCHK disabled, PULCHK disabled
       configuration hash MD5:
       76 6E 9A 78 1E 09 19 81 EC 84 63 8F B0 6A 59 2D
       data hash MD5: 64K
       D2 FF E0 E9 C9 13 73 E7 A2 E8 3B E7 67 0A BF BC>)
(   2,<2007-10-15 12:11:25.23 +100>,<MAYBRIDGE\nmr>,<NMR_250MHZ>,
      <Start of raw data processing
       ef LB = 0.3 FT_mod = 6 PKNL = 1 SI = 32K 
       data hash MD5: 32K
       6F 7A 0F 39 37 55 3A 02 FA E7 44 8A 1C CD FE 2B>)
(   3,<2007-10-15 12:11:27.10 +100>,<MAYBRIDGE\nmr>,<NMR_250MHZ>,
      <apk 
       data hash MD5: 32K
       99 3A 16 86 5D BE 48 22 FD 14 0C 65 4D 43 1C A4>)
(   4,<2007-10-15 12:11:27.83 +100>,<MAYBRIDGE\nmr>,<NMR_250MHZ>,
      <abs ABSG = 5 
       data hash MD5: 32K
       8A 81 23 20 9C 51 27 82 0E 8B 1B 67 DD C8 17 D2>)
$$ ##END=
$$ 
$$ hash MD5
$$ CB 0C 37 E8 18 CF 96 26 50 05 79 C8 18 1E 17 60
##$RELAX= 
##$RELAX= 
##$RELAX= 
##$RELAX= 
##$RELAX= 
##$RELAX= 
##$RELAX= 
$$ Bruker specific parameters
$$ --------------------------
##$DU= <C:\u>
##$EXPNO= 720
##$NAME= <ADRS>
##$PROCNO= 1
##$TYPE= <nmr>
##$USER= <dgb>
##$AMP= (0..31)
100 100 100 100 100 100 100 100 100 100 100 100 100 100 100 100 100 100 
100 100 100 100 100 100 100 100 100 100 100 100 100 100 
##$AQSEQ= 0
##$AQ_mod= 3
##$AUNM= <au_zg>
##$AUTOPOS= <16 >
##$BF1= 250.13
##$BF2= 250.13
##$BF3= 250.13
##$BF4= 250.13
##$BF5= 500.13
##$BF6= 500.13
##$BF7= 500.13
##$BF8= 500.13
##$BYTORDA= 1
##$CFDGTYP= 0
##$CFRGTYP= 5
##$CHEMSTR= <none>
##$CNST= (0..31)
1 1 145 1 1 1 1 1 1 1 1 1 1 1 1 1 1 1 1 1 1 1 1 1 1 1 1 1 1 1 1 1 
##$CPDPRG= <>
##$CPDPRG1= <>
##$CPDPRG2= <>
##$CPDPRG3= <>
##$CPDPRG4= <mlev>
##$CPDPRG5= <mlev>
##$CPDPRG6= <mlev>
##$CPDPRG7= <mlev>
##$CPDPRG8= <mlev>
##$CPDPRGB= <>
##$CPDPRGT= <>
##$D= (0..31)
0 1 0 0 0 0 0 0 0 0.06 0 0 0 0 0 0 0.0002 0 0 0 0 0 0 0 0 0 0 0 0 0 0 
0 
##$DATE= 1192446669
##$DBL= (0..7)
120 120 120 120 120 120 120 120 
##$DBP= (0..7)
150 150 150 150 150 150 150 150 
##$DBP07= 0
##$DBPNAM0= <>
##$DBPNAM1= <>
$$ [...]
##$SUBNAM7= <"">
##$SUBNAM8= <"">
##$SUBNAM9= <"">
##$SW= 20.6930455092707
##$SWIBOX= (0..15)
0 0 3 0 0 0 0 0 0 0 0 0 0 0 0 0 
##$SW_h= 5175.983436853
##$TD= 65536
##$TD0= 1
##$TE= 296.16
##$TE2= 300
##$TE3= 300
##$TEG= 300
##$TL= (0..7)
0 120 120 120 120 120 120 120 
##$TP= (0..7)
150 150 150 150 150 150 150 150 
##$TP07= 0
##$TPNAME0= <>
##$TPNAME1= <>
##$TPNAME2= <>
##$TPNAME3= <>
##$TPNAME4= <>
##$TPNAME5= <>
##$TPNAME6= <>
##$TPNAME7= <>
##$TPOAL= (0..7)
0.5 0.5 0.5 0.5 0.5 0.5 0.5 0.5 
##$TPOFFS= (0..7)
0 0 0 0 0 0 0 0 
##$TUNHIN= 0
##$TUNHOUT= 0
##$TUNXOUT= 0
##$USERA1= <user>
##$USERA2= <user>
##$USERA3= <user>
##$USERA4= <user>
##$USERA5= <user>
##$V9= 5
##$VALIST= <valist>
##$VCLIST= <CCCCCCCCCCCCCCC>
##$VD= 0
##$VDLIST= <DDDDDDDDDDDDDDD>
##$VPLIST= <PPPPPPPPPPPPPPP>
##$VTLIST= <TTTTTTTTTTTTTTT>
##$WBST= 1024
##$WBSW= 4
##$XGAIN= (0..3)
0 0 0 0 
##$XL= 0
##$YL= 0
##$YMAX_a= 557797
##$YMIN_a= -618260
##$ZGOPTNS= <>
##$ZL1= 120
##$ZL2= 120
##$ZL3= 120
##$ZL4= 120
##$ABSF1= 16.43407
##$ABSF2= -4.2591
##$ABSG= 5
##$ABSL= 3
##$ALPHA= 0
##$AQORDER= 0
##$ASSFAC= 0
##$ASSFACI= 0
##$ASSFACX= 0
##$ASSWID= 0
##$AUNMP= <proc_1d>
##$AZFE= 0.1
##$AZFW= 0.1
##$BCFW= 0
##$BC_mod= 0
##$BYTORDP= 0
##$COROFFS= 0
##$CY= 12.5
##$DATMOD= 1
##$DC= 0
##$DFILT= <>
##$DTYPP= 0
##$F1P= 14.0000005364418
##$F2P= -0.99999901652339
##$FCOR= 0.5
##$FTSIZE= 32768
##$FT_mod= 6
##$GAMMA= 0
##$GB= 0
##$INTBC= 1
##$INTSCL= 1
##$ISEN= 128
##$LB= 0.3
##$LEV0= 0
##$LPBIN= 0
##$MAXI= 10000
##$MC2= 0
##$MEAN= 0
##$ME_mod= 0
##$MI= 0
##$NCOEF= 0
##$NC_proc= -2
##$NLEV= 6
##$NOISF1= 0
##$NOISF2= 0
##$NSP= 0
##$NTH_PI= 0
##$NZP= 0
##$OFFSET= 16.43407
##$PC= 1
##$PHC0= 155.4869
##$PHC1= 5.527539
##$PH_mod= 1
##$PKNL= yes
##$PPARMOD= 0
##$PSCAL= 4
##$PSIGN= 0
##$REVERSE= no
##$SF= 250.130021992057
##$SI= 32768
##$SIGF1= 0
##$SIGF2= 0
##$SINO= 400
##$SIOLD= 32768
##$SREGLST= <1H.CDCl3>
##$SSB= 0
##$STSI= 32768
##$STSR= 0
##$SW_p= 5175.98343685301
##$SYMM= 0
##$S_DEV= 0
##$TDeff= 65536
##$TDoff= 0
##$TI= <Analysis number 999999
Compound Code 99
Book Reference 9
Project Code 9>
##$TILT= no
##$TM1= 0
##$TM2= 0
##$TOPLEV= 0
##$USERP1= <user>
##$USERP2= <user>
##$USERP3= <user>
##$USERP4= <user>
##$USERP5= <user>
##$WDW= 1
##$XDIM= 32768
##$YMAX_p= 563181674
##$YMIN_p= -63523
$$ End of Bruker specific parameters
$$ ---------------------------------
##NTUPLES= NMR SPECTRUM
##VAR_NAME=  FREQUENCY,     SPECTRUM/REAL,   SPECTRUM/IMAG
##SYMBOL=    X,             R,               I
##VAR_TYPE=  INDEPENDENT,   DEPENDENT,       DEPENDENT
##VAR_FORM=  AFFN,          ASDF,            ASDF
##VAR_DIM=   32768,         32768,           32768
##UNITS=     HZ,            ARBITRARY UNITS, ARBITRARY UNITS
##FACTOR=    0.157963299565203, 1,           1
##FIRST=     4110.6544373849, 0,             0
##LAST=      -1065.32899946811, 0,           0
##MIN=       -1065.32899946811, -63523,      0
##MAX=       4110.6544373849, 563181674,     0
$$ Real data points
##PAGE= N=1
##DATA TABLE= (X++(R..R)), XYDATA
$$ [...]
$$ plain form
15199 -1229 7585 3488 2509 -2687 -7621 -10045 -14067 -10082 -6631 -5950 -8098 -1349 -765 -2684 -4421
15184 -4421 -6303 -8401 -6462 -1530 -2374 -6355 -7413 -6353 596 -3066 -10108 -12941 -11576 -4839 -5414
15169 -5414 -6502 -3467 2071 5087 3112 3610 6597 9007 13403 5973 4944 2051 -3338 -9840 -13649
15154 -13649 -5793 -1345 -1637 396 744 -345 -9606 -7606 -3536 -12309 -14127 -20858 -19988 -18203 -17346
15139 -17346 -15185 -9180 -6806 -9291 -6456 -6822 -12023 -13774 -6586 -2971 -1661 -591 170 3196 2672
15124 2672 -2137 -7431 -18307 -18744 -12298 -14003 -11253 -6557 -812 5934 327 1105 8679 5408 5343
15109 5343 15319 15704 11316 5924 2080 997 -2054 -7545 -7971 2768 7759 3009 5770 8179 3656
15094 3656 -3359 -3055 -1015 -333 -3297 -6249 -7618 -4375 218 -5020 -11258 -11297 -8294 -5008 -10762 -8277
$$ packed form
15199a229Q814m097r79n196m934k424m022L985L451O81k148O749N84j919j737
15184d421j882k098J939M932q44l981j058J060O949l662p042k833J365O737n75
15169e414j088L035N538L016j975M98K987K410M396p430j029k893n389o502l809
15154a3649P856M448k92K033L48j089r261K000M070q773j818o731Q70J785Q57
15139a7346K161O005K374k485K835l66n201j751P188L615J310J070P61L026n24
15124B672m809n294j0876m37O446j705K750M696N745O746n607P78P574l271o5
15109E343R976L85m388n392l844j083l051n491m26J0739M991m750K761K409m523
15094C656p015L04K040O82k964k952j369L243M593n238o238l9L003L286n754K485
$$ plain form
15078 -8277 -4103 -6201 -6006 -2812 2000 8296 10685 5846 -354 1752 4277 -2264 -6295 -3954 -7410
15063 -7410 -6627 -2667 275 -1524 4740 8045 11434 7141 -1921 -2334 834 462 3894 888 3307
15048 3307 2440 -1576 803 4784 248 527 -998 1478 3620 -1019 -9042 -19554 -19822 -14792 -9453
15033 -9453 -2665 -449 -2887 -1720 -4807 -7034 -4827 -9427 -8213 -4168 -1669 -3201 -12206 -6286 -4614
15018 -4614 -6142 -5742 -4380 -8914 -6480 -1898 4292 4256 354 2263 -209 -3629 -6042 -5837 -3301 -6355
15002 -6355 -10306 -7918 -5535 -9191 -8945 -8782 -660 10640 9105 432 211 1120 1948 -701 4101 7336
14986 7336 6772 7176 6882 6006 7010 2787 -997 2198 2246 33 -4169 -7778 -8143 -8052 -2679 -1033 1561
14969 1561 3372 3473 -838 2250 9259 2921 -5702 -10168 -14985 -9180 -7803 -13823 -15315 -12454 -8713
$$ packed form
15078h277M174k098J95L194M812O296K389m839o200K106K525o541m031K341l456
15063g410P83L960K942j799O264L305L389m293r062m13L168l72L432l006K419
15048C307q67m016K379L981m536K79j525K476K142m639q023j0512k68N030N339
15033i453O788K216k438J167l087k227K207m600J214M045K499j532r005N920J672
15018d614j528M00J362m534K434M582O190l6l902J909k472l420k413K05K536l054
15002f355l951K388K383l656K46J63Q122J1300j535q673k21R09Q28k649M802L235
14986G336n64M04k94q76J004m223l784L195M8k213m202l609l65R1N373J646K594
14969A561J811J01m311L088P009o338q623m466m817N805J377o020j492K861L741
$$ plain form
14954 -8713 -8099 -10213 -6915 1175 6098 3207 -701 -7689 -10651 -8335 -13450 -23417 -20684 -14675 -9947
14939 -9947 -8833 -7409 -6008 -7105 -10464 -7267 -3111 -2578 -2887 3135 -4571 -8641 -9042 -2634 2078
14924 2078 5036 1970 -3221 -1956 -2776 -4360 -716 -8446 -16601 -18058 -9855 -5662 -5096 -2342 -2584
14909 -2584 -5768 -3132 -6394 -8425 -11175 -13589 -18551 -18694 -16021 -10148 -2175 176 -245 -6384 -4358
14894 -4358 -7193 -11844 -9087 -10350 -5135 -4855 -4580 -4638 -2208 -5891 -2294 4069 797 -3634 -7651 -9928
14878 -9928 -8012 545 -984 -7856 -13979 -15288 -9650 -9865 -8546 -8086 -7859 -8357 -13453 -11558 -9293 -7670
14862 -7670 -7002 -5643 -2927 -7160 -10273 -8711 -1616 186 2102 9310 9065 5192 -571 -7557 -3820
14847 -3820 833 7186 67 -8645 -8742 -7466 -4333 1330 3824 520 -3559 -4429 -5161 -5903 -7095 -10860
$$ packed form
14954h713O14k114L298Q090M923k891l908o988k962K316n115r967K733O009M728
14939i947J114J424J401j097l359L197M156N33l09O022p706m070m01O408M712
14924B078K958l066n191J265q20j584L644p730q155j457Q203M193N66K754k42
14909b584l184K636l262k031k750k414m962j43K673N873P973K351m21o139K026
14894d358k835m651K757j263N215K80K75n8K430l683L597O363l272m431m017k277
14878i928J916Q557j529o872o123j309N638k15J319M60K27m98n096J895K265J623
14862g670O68J359K716m233l113J562P095J802J916P208k45l873n763o986L737
14847c820M653O353p119q712r7J276L133N663K494l304m079q70p32p42j192l765
$$ plain form
14831 -10860 -7477 -3409 3014 1811 -8964 -8424 -1898 -2183 -4535 -11941 -9483 -5275 -2246 -5466 -5219
14816 -5219 -10557 -11448 -10519 -3372 -3026 -4283 -6486 -8354 -3819 -3511 2899 6921 9567 8382 -533 -6940
14800 -6940 -2766 -2437 -6501 -9316 -4962 -5252 -12820 -13886 -8764 -5994 1923 242 1199 7601 1042
14785 1042 -3192 -5148 -646 5655 8633 3227 -3540 -5598 -6842 -4898 -5309 -8729 -12737 -11357 -7389
14770 -7389 -8154 -7683 -8018 -8995 -6253 2418 4862 2331 -1002 -562 4054 9929 7127 1558 1758 804
14754 804 -3426 -1364 -4861 -5759 -8285 -7286 -6013 -9223 -6388 -5772 -11344 -10079 23 28 2197 7223
14738 7223 11182 -149 -7680 -12480 -12902 -8960 -6181 -4311 -8359 -9971 -7655 -12442 -14083 -9554 -9486
14723 -9486 -7716 -12168 -17615 -13658 -12979 -7628 -2371 -3561 -5705 -4611 3549 1591 -2148 -8641 -3697
$$ packed form
14831a0860L383M068O423j203j0775N40O526k85k352p406K458M208L029l220K47
14816e219n338q91R29P147L46j257k203j868M535L08O410M022K646j185q915o407
14800f940M174L29m064k815M354k90p568j066N122K770P917j681R57O402o559
14785A042m234j956M502O301K978n406o767k058j244J944m11l420m008J380L968
14770g389p65M71l35r77K742Q671K444k531l333M40M616N875k802n569K00r54
14754H04m230K062l497q98k526R99J273l210K835O16n572J265J0102NK169N026
14738G223L959j1331p531m800m22L942K779J870m048j612K316m787j641M529O8
14723i486J770m452n447L957O79N351N257j190k144J094Q160j958l739o493M944
$$ plain form
14708 -3697 -736 -3802 -1961 -4599 -3589 -6571 -4788 865 4673 804 -6627 -9789 -4428 -2793 -6120
14693 -6120 -5124 -4506 -6866 -13188 -14852 -12975 -8000 -7481 -13052 -5778 5058 5953 4405 5033 4552 5370
14677 5370 -1180 -6618 -4737 -3930 -8635 -3891 -3971 -13150 -17182 -14215 -7766 -8236 -10635 -10891 -11269 -12268
14661 -12268 -10838 -14555 -18905 -21040 -24226 -22162 -22737 -17689 -8912 -4948 -6573 -13254 -13538 -6949 -5002
14646 -5002 -1552 -5335 -10270 -9341 -11708 -12771 -6881 -2639 -3265 -12392 -8844 -4280 -6878 -6283 -8178
14631 -8178 -8899 -7744 -11252 -14677 -17988 -10203 -3505 -5377 -9728 -9856 -9876 -9359 -5092 -10423 -13071 -8877
14615 -8877 -5812 -1436 -6433 -9129 -4173 -2228 -5897 -10043 -5177 -858 7669 2321 -690 -3048 -8638
14600 -8638 -10453 -11586 -10772 -9333 -5747 -14100 -15645 -12302 -9348 -5241 -2776 -10128 -8111 -6423 -8023
$$ packed form
14708c697K961l066J841k638J010k982J783N653L808l869p431l162N361J635l327
14693f120R96O18k360o322j664J877M975N19n571P274J0836Q95j548O28m81Q18
14677E370o550n438J881Q07m705M744q0r179m032K967O449m70k399k56l78r99
14661a2268J430l717m350k135l186K064n75N048Q777L964j625o681k84O589J947
14646e002L450l783m935R29k367j063N890M242o26r127L548M564k598N95j895
14631h178p21J155l508l425l311P785O698j872m351j28k0N17M267n331k648M194
14615h877L065M376m997k696M956J945l669m146M866M319Q527n348l011k358n590
14600h638j815j133Q14J439L586q353j545L343K954M107K465p352K017J688j600
$$ plain form
14585 -8023 -7410 -4109 -2894 -6051 179 4414 3568 7033 9325 10218 1837 -4630 -4953 -4895 -6248 -5734
14569 -5734 -3418 -9217 -8832 -6306 -7390 -6580 -9565 -7486 -13271 -13553 -8809 -6964 -9943 -11810 -13518
14554 -13518 -16768 -20585 -12046 -16366 -16187 -15615 -17326 -19290 -17733 -18945 -15403 -10646 -5311 1322 14
14539 14 -3967 -3749 -6860 -9998 -8105 -7285 -3239 1140 217 1584 17763 14443 8837 531 -6911 -4631
14523 -4631 2682 1760 -891 -10073 -9024 -10782 -10954 -4443 -2445 -2386 -4104 -7963 -8652 -9897 -12882 -10495
14507 -10495 970 4900 953 -5990 -132 -1481 985 -295 -5904 -5295 -1267 -7928 -16493 -16508 -18542
14492 -18542 -19398 -10534 -7089 -17565 -21659 -21338 -12319 -10566 -10904 -6714 -2843 -2037 71 502 -1921
14477 -1921 -6644 -11849 -15853 -11092 -11278 -10825 -15108 -10578 -6719 -3961 -1920 -4241 -2572 -3593 -3632 -7738
$$ packed form
14585h023O13L301J215l157O230M235q46L465K292Q93q381o467l23N8j353N14
14569e734K316n799L85K526j084Q10k985K079n785k82M744J845k979j867j708
14554a3518l250l817Q539m320J79N72j711j964J557j212L542M757N335O633j308
14539A4l981K18l111l138J893Q20M046M379r23J367J6179l320n606q306p442K280
14523d631P313r22k651r182J049j758j72O511J998N9j718l859o89j245k985K387
14507a0495J1465L930l947o943N858j349K466j280n609O09M028o661q565j5k034
14492a8542q56Q864L445j0476m094L21R019J753l38M190L871Q06K108M31k423
14477a921m723n205m004M761j86M53m283M530L859K758K041k321J669j021l9m106
$$ plain form
14461 -7738 -10742 -8346 -4429 24 2325 3321 5634 6745 1393 -10713 -16549 -13821 -5144 -4365 -4512
14446 -4512 -4632 -6269 -4866 -6946 -11048 -8236 -6472 -4930 -5632 -2705 -3555 -8212 -10395 -12232 -9634
14431 -9634 -6998 -1196 -2255 -4243 -5878 -9247 -9564 -12547 -13958 -3518 39 2113 2108 -959 -3730
14416 -3730 -7163 -4096 3161 600 -4219 -3520 -2539 1211 4271 -627 -10483 -11446 -10507 -13243 -13225 -19221
14400 -19221 -16759 -8318 -5021 -2599 -7012 -8821 -5445 -6012 -8513 -6123 -8665 -10393 -4515 -1451 -2749
14385 -2749 -4806 -678 3809 843 792 4803 3204 3733 6195 8059 2976 819 1487 -1475 -6829 -3520
14369 -3520 -3962 -8486 -6028 171 3273 4115 752 -1920 2223 2789 -1814 -507 -1888 -7129 -7676 -3069
14353 -3069 -1126 1393 7557 10569 7643 2310 4165 1696 -1238 -6509 -6918 -10646 -7296 -6746 -13626
$$ packed form
14461g738l004K396L917M453K301R96K313J111n352j2106n836K728Q677P79j47
14446d512j20j637J403k080m102K812J764J542p02K927q50m657k183j837K598
14431i634K636N802j059j988j635l369l17k983j411J0440L557K074nl067k771
14416c730l433L067P257k561m819O99R81L750L060m898r856r63R39k736J8n996
14400a9221K462Q441L297K422m413j809L376n67k501K390k542j728N878L064j298
14385b749k057M128M487k966n1M011j599N29K462J864n083k157O68k962n354L309
14369c520m42m524K458O199L102Q42l363k672M143N66m603J307j381n241n47M607
14353c069J943K519O164L012k926n333J855k469k934n271m09l728L350N50o880
$$ plain form
14338 -13626 -14632 -3883 673 -7212 -3695 -3672 -4613 -7260 -9770 -9601 -6840 -5200 -10003 -12304 -13760
14323 -13760 -15633 -22013 -18468 -14822 -16998 -15931 -12636 -10861 -5719 -6439 -2821 4625 2863 2032 -269
14308 -269 -3457 -1066 755 -1348 -1672 -5282 -15629 -15606 -7347 1654 1792 1881 6895 8481 4252 2478
14292 2478 3209 -868 -4016 -4766 475 8675 2850 -1135 2027 -154 -3519 -8900 -10150 -8799 -7729
14277 -7729 -8916 -9467 -11826 -11819 -13969 -11349 -17104 -24068 -20053 -9905 -401 -4697 -4439 -5128 -4385 -2403
14261 -2403 -2149 1876 441 -3026 -7022 -4736 -2256 -4146 -1094 5841 726 -6381 -4825 -7314 -10727
14246 -10727 -6354 -5325 -8723 -4585 -2806 -6479 -3692 -10795 -15471 -17842 -16563 -10699 -6880 -2754
14232 -2754 -3530 -12828 -13107 -12316 -11137 -8789 -14374 -14643 -8242 -8282 -8380 -7079 -2085 3451 3914 -560 -1655
$$ packed form
14338a3626j006J0749M556p885L517K3r41k647k510J69K761J640m803k301j456
14323a3760j873o380L545L646k176J067L295J775N142p20L618P446j762q31k301
14308b69l188K391J821k103l24l610j0347K3Q259R001J38Q9N014J586m229j774
14292B478P31m077l148p50N241Q200n825l985L162k181l365n381j250J351J070
14277g729j187n51k359Pk150K620n755o964M015J0148R504m296K58o89P43J982
14261b403K54M025j435l467l996K286K480j890L052O935n115p107J556k489l413
14246a0727M373J029l398M138J779l673K787p103m676k371J279N864L819M126
14232b754p76r298k79P91J179K348n585k69O401m0r8J301M994N536M63m474j095
$$ plain form
14215 -1655 -4998 -5721 1017 6069 565 -5637 -5533 -1077 622 23 -1051 1183 3468 -491 -3964
14200 -3964 -3338 -9694 -11823 -10677 -9381 -7368 -1582 713 -1743 -10842 -15806 -11993 -12813 -4432 -14376
14185 -14376 -18295 -13285 -10970 -7911 -9258 -7777 -6113 -4021 -6956 -6950 -6579 -2603 1515 774 -12963
14170 -12963 -14846 -12234 -10183 -4846 -7978 -8043 -3855 -1730 -510 -619 -2319 4945 8666 1071 -5142
14155 -5142 -10769 -7157 -5889 -4047 -5971 -7739 -11110 -9426 -13170 -17350 -12451 -3642 635 2781 7043
14140 7043 3328 -463 4314 5950 -770 -4209 -875 -1686 -2328 -13371 -20818 -15963 -8949 -879 -3521
14125 -3521 -4691 -3544 -4420 -3429 9103 11366 -223 -2895 403 1266 223 -6348 -6111 -495 -2
14110 -2 -4170 -3840 1075 -4533 -2394 2378 -4401 -9071 -6396 -8222 -8790 -1996 1503 2459 5394 1721
$$ packed form
14215a655l343p23O738N052n504o202J04M456J699n99j074K234K285l959l473
14200c964O26o356k129J146J296K013N786K295k456r099m964L813q20Q381r944
14185a4376l919N010K315L059j347J481J664K092k935OL71L976M118p41j3737
14170a2963j883K612K051N337l132o5M188K125J220j09j700P264L721p595o213
14155e142n627L612J268J842j924j768l371J684l744m180M899Q809M277K146M262
14140G043l715l791M777J636o720l439L334q11o42j1043p447M855P014Q070k642
14125c521j170J147q76R91J2532K263j1589k672L298Q63j043o571K37N616M93
14110bm168L30M915n608K139M772o779m670K675j826n68O794L499R56K935l673
$$ plain form
14094 1721 -816 -1167 827 753 63 3115 5929 6984 5188 830 -2879 -6201 -10008 -12741 -5542 -3422
14078 -3422 -3795 -8461 -8967 -8330 -9915 -10215 -7139 -2468 -1913 -1298 -7403 -12798 -10169 -7567 -4950 -1073
14062 -1073 1237 -3628 -1170 2478 -1431 -1222 -8801 -15914 -12336 -11100 -10925 -4895 -2835 -3757 1655
14047 1655 6925 6902 4452 3682 1551 -2268 -8226 -16755 -11436 -10828 -14713 -18551 -15679 -6630 -4410 -7905
14031 -7905 -7922 -12840 -9752 -9881 -11258 -1387 -2967 -9263 -11407 -14174 -12802 -159 4442 2826 793
14016 793 -4722 -5503 -1945 2475 6774 8548 2826 -6072 -7591 -5676 776 5750 5511 -2025 -3965
14001 -3965 -3381 -7308 -7236 -2798 2380 -4358 -9900 -7943 -2450 1358 3054 2307 7042 8038 6543 3337
13985 3337 -2550 -3841 -3037 -6495 -8256 -5497 -2006 -26 105 -885 -2018 -2604 -4726 -3346 6191 12635
$$ packed form
14094A721k537l51J994p4o90L052K814J055j796m358l709l322l807k733P199K120
14078c422l73m666n06O37j585l00L076M671N55O15o105n395K629K602K617L877
14062a073K310m865K458L648l909K09p579p113L578J236J75O030K060r22N412
14047A655N270k3k450p70k131l819n958q529N319O08l885l838K872R049K220l495
14031g905j7m918L088j29j377R871j580o296k144k767J372J2643M601j616k033
14016G93n515p81L558M420M299J774n722q898j519J915O452M974k39p536j940
14001c965N84l927P2M438N178o738n542J957N493L808J696p47M735R96j495l206
13985C337n887j291Q04l458j761K759L491J980J31r90j133n86k122J380R537O444
$$ plain form
13969 12635 7526 -10 1189 2318 3729 6572 9309 7519 2376 4354 2399 -501 -4967 -3429
13955 -3429 4334 601 -6686 -9968 -5840 -4270 1889 5594 3644 -2135 -1740 -7535 -6829 -2301 -6538
13940 -6538 -15438 -18688 -14935 -8236 -7422 -8648 -10840 -13271 -15189 -11672 -9062 -13783 -14768 -4754 -1792
13925 -1792 -3706 -3126 -1802 -5364 -8666 -9883 -6557 7862 6381 6573 5642 -2498 -1859 4423 1824
13910 1824 3727 136 3713 8584 8272 5317 3632 3382 7799 7950 2208 -2353 -6087 -9177 -7446
13895 -7446 -12338 -13015 -11532 -17544 -19987 -19526 -15732 -14727 -11428 -9821 -11872 -15864 -7531 -5293 -11919
13880 -11919 -10640 -9162 -2306 2120 -2374 -18056 -23439 -11007 -7690 -1277 -6717 -20492 -23323 -13675
13866 -13675 -5513 -2465 -754 -3865 -8615 -8538 -7906 -7489 -2804 2726 1499 -2090 -5292 -3493 -2574 -7223
$$ packed form
13969A2635n109p536J199J129J411K843K737j790n143J978j955k900m466J538
13955c429P763l733p287l282M128J570O159L705j950n779L95n795P06M528m237
13940f538q900l250L753O699Q14j226k192k431j918L517K610m721r85J0014K962
13925a792j914N80J324l562l302j217L326J4419j481J92r31q140O39O282k599
13910A824J903l591L577M871l12k955j685k50M417J51n742m561l734l090J731
13895g446m892o77J483o012k443M61L794J005L299J607k051l992Q333K238o626
13880a1919J279J478O856M426m494j5682n383J2432L317O413n440j3775k831R648
13866a3675Q162L048J711l111m750P7O32M17M685N530j227l589l202J799R19m649
$$ plain form
13850 -7223 -9772 -7964 -9689 -5941 -4723 -5548 -8958 -10961 -5695 -3182 1177 -4434 -9420 -5209 -500
13835 -500 -7406 -13015 -14129 -7455 -11096 -20284 -29042 -33584 -28331 -19992 -13061 -8086 -3088 -5538 -3196
13820 -3196 2548 4361 -5568 -12042 -10255 -12887 -7494 -3473 1246 -4521 -16604 -14437 -10581 -9604 -11438
13805 -11438 -16574 -19173 -16747 -17516 -21799 -17604 -12359 -7700 -5665 -3328 -5122 -10843 -13719 -12931 -6074
13790 -6074 -3765 -6588 -4897 -7575 -8429 -14578 -13403 -9965 -4733 -3257 -2515 -5632 -2427 3805 2551
13775 2551 2947 -6369 -9899 -13254 -18914 -11557 -12415 -11771 -1433 -6211 -6533 -7762 -10015 -10644 -14078 -8791
13759 -8791 -3024 -1319 976 -386 1079 -4343 -9046 -3973 -4936 -9222 -9456 -5884 -10471 -14148 -10673
13744 -10673 -4914 -6214 -4445 2167 -5386 -3570 29 -1426 -5600 -4214 -2660 -1706 5732 -3029 -2893
$$ packed form
13850g223k549J808j725L748J218q25l410k003N266K513M359n611m986M211M709
13835e00o906n609j114O674l641r188q758m542N253Q339O931M975M998k450K342
13820c196N744J813r929o474J787k632N393M021M719n767j2083K167L856R77j834
13805a1438n136k599K426p69m283M195N245M659K035K337j794n721k876P88O857
13790f074K309k823J691k678q54o149J175L438N232J476P42l117L205O232j254
13775B551L96r316l530l355n660P357q58O44J0338m778l22j229k253o29l434N287
13759h791N767J705K295j362J465n422m703N073r63m286k34L572m587l677L475
13744a0673N759j300J769O612p553J816L599j455m174J386J554R54P438q761J36
$$ plain form
13729 -2893 878 1466 2309 2462 -2423 1231 7088 3664 -5988 -13378 -13849 -10728 -14208 -10506 -4120 3076
13713 3076 1206 -1139 1110 -2632 -2039 5682 8420 1237 -4998 -1823 -4402 -13474 -16719 -13615 -7913
13698 -7913 -6013 -7289 -2736 5259 1923 349 221 1692 -841 -2186 -1984 -2081 -3818 -4018 -4087 -5083 -1030
13681 -1030 -3485 -9238 -8029 -6509 -4472 1119 3023 -2330 -717 3086 5921 1171 -3539 -8226 -10018
13666 -10018 -4998 -2839 -2179 2597 -1590 -3502 -3237 -5719 -10826 -9778 -9124 -10719 -3739 560 1269
13651 1269 -165 1774 4946 8808 10506 12532 10707 7912 7527 3585 2125 2676 -2204 -2453 -1545 -2918
13635 -2918 -5378 -5980 -9691 -8610 -6884 -2754 -1263 -571 3190 2797 3364 -1738 73 -2582 -696 2790
13619 2790 -1678 -332 2682 954 -2212 1247 878 -2669 -2883 -4998 -1366 5233 -465 -10458 -13268
$$ packed form
13729b893L771N88Q43J53m885L654N857l424r652p390m71L121l480L702O386P196
13713C076j870k345K249l742N93P721K738p183o235L175k579r072l245L104N702
13698g913J900j276M553P995l336j574j28J471k533j345K02r7j737k00o9r96M053
13681a030k455n753J209J520K037N591J904n353J613L803K835m750m710m687j792
13666a0018N020K159O60M776m187j912K65k482n107J048O54j595O980M299P09
13651A269j434J939L172L862J698K026j825k795l85l942j460N51m880k49R08j373
13635b918k460o02l711J081J726M130J491O92L761l93N67n102J811k655J886L486
13619B790m468J346L014j728l166L459l69l547k14k115L632O599n698r993k810
$$ plain form
13604 -13268 -11688 -10927 -10651 -10202 -6533 -2160 285 2201 -2586 -749 -3827 -7138 -11716 -9554 -3916
13589 -3916 2026 2984 1155 1053 -1398 381 -133 1696 1286 -1836 4693 4942 -1339 -2883 -4782 1289
13573 1289 890 4725 -1215 -7634 -3299 1788 -1373 -5705 -9734 -13360 -11502 -6046 -1038 -108 -2157
13558 -2157 504 1496 5296 9408 3127 -4958 4248 -873 -11733 -15864 -11825 -5839 -1985 1005 9569
13543 9569 15675 17446 13918 3658 -6718 -7064 -6578 -1523 -1452 -2461 -2489 -10164 -11051 -5416 -447 -1407
13527 -1407 -1417 2967 -1063 -5635 -4558 -1808 -3940 -11160 -17645 -13604 -8243 -6486 -3895 -4286 -7961
13512 -7961 -4650 -3321 -1575 -5553 -4122 -6992 -2771 -4550 -7764 -5111 117 7055 5474 6356 352
13497 352 -5641 -8876 -2436 -194 -4668 -7430 -9355 -9809 -12874 -18328 -22167 -16913 -9400 -4705 -4077
$$ packed form
13604a3268J580P61K76M49L669M373K445J916m787J837l078l311m578K162N638
13589c916N942R58j829j02k451J779n14J829m10l122O529K49o281j544j899O071
13573A289l99L835n940o419M335N087l161m332m029l626J858N456N008R30k049
13558b157K661R92L800M112o281q085R206n121j0860m131M039N986L854K990Q564
13543I569O106J771l528j0260j0376l46M86N055P1j009k8p675q87N635M969r60
13527a407j0M384m030m572J077K750k132p220o485M041N361J757K591l91l675
13512g961L311J329J746l978J431k870M221j779l214K653N228O938j581Q82o004
13497C52n993l235O440K242m474k762j925m54l065n454l839N254P513M695O28
$$ plain form
13482 -4077 -4969 -9040 -7111 -1583 -3717 -5028 212 4997 2272 -6143 -7041 -9259 -6642 -5489 -4076
13467 -4076 -5991 -9365 -6211 -2022 -5228 -2678 442 2467 233 -6019 -11980 -14002 -7195 1988 4154
13452 4154 4641 -370 -1019 231 1879 4743 8282 6695 5496 -1327 2426 -825 -1406 -5622 -2408
13437 -2408 3884 7182 5666 3683 -5949 -9589 -7709 -8625 -5309 1921 -5303 -12569 -8345 1209 1940
13422 1940 -1998 -8054 -6436 -4479 -882 -5256 -8459 -5068 58 -2829 -2126 -3782 -4503 -7267 -9093
13407 -9093 -4198 -2209 -546 -771 -387 -1781 -660 -6325 -12377 -8144 -5363 -749 -4500 -1932 -3612
13392 -3612 -7317 -7265 -1016 3851 1476 -1747 -5291 -12930 -15046 -14181 -9881 -9645 -8223 -5699 -448 -2011
13376 -2011 -3729 -8541 -2777 442 30 4214 3481 2064 -8901 -13056 -9189 -9081 -3712 -4355 -5203 143
$$ packed form
13482d077q92m071J929N528k134j311N240M785k725q415q98k218K617J153J413
13467d076j915l374L154M189l206K550L120K025k234o252n961k022O807R183K166
13452D154M87n011o49J250J648K864L539j587j199o823L753l251n81m216L214
13437b408O292L298j516j983r632l640J880r16L316P230p224p266M224R554P31
13422A940l938o056J618J957L597m374l203L391N126k887P03j656p21k764j826
13407i093M895J989J663k25L84j394J121n665o052M233K781M614l751K568j680
13392c612l705N2O249M867k375l223l544p639k116Q65M300K36J422K524N251j563
13376b011j718m812N764L219m12M184p33j417j0965m155L867J08N369o43q48N346
$$ plain form
13360 143 2369 -1207 -8300 -10942 -5518 -895 -10127 -11508 -9675 1107 3458 -5764 -12901 -13001 -10472
13345 -10472 -7950 -1032 -870 -825 -8200 -13999 -8835 -5836 -8003 -8454 -5614 -1647 -1922 -1375 -7984 -14717
13329 -14717 -12166 -7386 3074 4966 -2204 -6869 -6654 -921 881 -1347 675 2092 3698 4000 -711
13314 -711 -5648 -4234 -4546 -333 6921 10246 6491 6930 3784 1064 -4648 -7789 -3949 -6413 -1144
13299 -1144 2671 3402 -436 1083 -3597 1867 11878 10209 8132 6304 6169 1109 -907 -2543 -2169
13284 -2169 -5328 -7588 -5709 -8919 -9734 -11333 -6902 -896 -2344 3231 8835 4833 -3836 -1844 -5447
13269 -5447 -8032 -3104 1323 6420 2242 3106 5601 8372 4766 -3187 -1991 -4088 -3070 2261 1107
13254 1107 4163 3205 -1580 -7372 -10443 -6091 90 1446 3912 3763 -4181 -5818 -7703 726 6953
$$ packed form
13360A43K226l576p093k642N424M623r232j381J833J0782K351r222p137j00K529
13345a0472K522O918J62M5p375n799N164K999k167m51K840L967k75N47o609o733
13329a4717K551M780J0460J892p170m665K15N733J802k228K022J417J606L02m711
13314g11m937J414l12M213P254L325l755M39l146k720n712l141L840k464N269
13299a144L815P31l838J519m680N464J0011j669k077j828j35n060k016j636L74
13284b169l159k260J879l210q15j599M431O006j448N575N604m002q669J992l603
13269e447k585M928M427N097m178Q64K495K771l606p953J196k097J018N331j154
13254A107L056r58m785n792l071M352O181J356K466j49p944j637j885Q429O227
$$ plain form
13239 6953 9259 6254 4239 735 -3509 -3258 -299 -3965 -9066 -9406 -10121 -9404 -2374 -3030 -2682 -2197
13223 -2197 -5300 -6468 -5858 -6264 -8342 -8279 -5868 -6920 -8510 -8420 -666 7405 11545 8960 4949 1568
13207 1568 -1668 -2791 1512 4256 2731 -4328 -473 5796 5209 236 1917 -2015 -6499 -2360 -1230
13192 -1230 887 3183 2803 1372 1270 -5902 -8813 -5321 855 -6146 -2218 4358 283 -263 500 -3204
13176 -3204 -9194 -14065 -14837 -10387 -5894 -8266 -6042 5117 11108 14694 12007 4976 7257 11296 10237
13161 10237 6130 7474 8100 8331 2585 -1031 -2260 898 -2811 -417 4935 2035 -7688 -6459 -6785
13146 -6785 -10158 -8889 -5415 -770 4052 4643 -2188 -2500 -1109 4653 607 1240 1432 -6289 -8936 -10758
13130 -10758 -3770 -1066 3098 1748 4132 7685 -1317 -4940 -10232 -10749 -11776 -5858 -6023 -5594 313
$$ packed form
13239F953K306l005k015l504m244K51K959l666n101l40p15P17P030o56L48M85
13223b197l103j168O10m06k078O3K411j052j590R0P754Q071M140k585m011l381
13207A568l236j123M303K744j525p059L855O269n87m973J681l932m484M139J130
13192a230K117K296l80j431j02p172k911L492O176p001L928O576m075n46P63l704
13176c204n990m871p72M450M493k372K224J1159N991L586k687p031K281M039j059
13161A0237m107J344O26K31n746l616j229L158l709K394N352k900r723J229l26
13146f785l373J269L474M645M822N91o831l12J391N762m046O33J92p721k647j822
13130a0758O988K704M164j350K384L553r002l623n292n17j027N918j65M29N907
$$ plain form
13115 313 2499 4701 2592 3563 -3018 -1339 -3827 -522 -5560 -3697 -1242 167 -427 -1104 -3744 -4727
13099 -4727 -1827 3042 -4621 -7761 2017 2471 -588 4095 1543 -4380 3435 6852 1800 2233 5304
13084 5304 8858 7928 9117 11010 7964 3715 -1627 -7137 -1702 162 4630 3986 1979 3725 9767
13069 9767 13244 7567 -4811 -1061 5126 2714 -2086 968 6980 8416 9453 10570 4895 3096
13055 3096 9683 8373 6699 324 -2244 3519 4053 11517 8254 2601 5782 6460 14630 19988 11804
13040 11804 6406 5321 -2116 -5173 -8491 -11338 -9479 -10455 -5419 2476 -274 -2653 -1261 1403 -3398
13025 -3398 -6770 -15602 -16944 -16623 -14821 -12165 -12941 -11061 -7207 -3363 -4350 -11583 -9096 3589 6336
13010 6336 1434 -5509 -8785 -7872 -13652 -19443 -15753 -16321 -14654 -10721 -11809 -11914 -2587 4365 -457
$$ packed form
13115C13K186K202k109R71o581J679k488L305n038J863K455J409n94o77k640r83
13099d727K900M869p663l140R778M54l059M683k552n923P815L417n052M33L071
13084E304L554r30J189J893l046m249n342n510N435J864M468o44k007J746O042
13069I767L477n677j2378L750O187k412m800L054O012J436J037J117n675j799
13055C096O587j310j674o375k568N763N34P464l263n653L181O78Q170N358q184
13040A1804n398j085p437l057l318k847J859r76N036P895k750k379J392K664m801
13025c398l372q832j342L21J802K656p76J880L854L844r87p233K487J2685K747
13010F336m902o943l276R13n780n791L690n68J667L933j088j05R327O952m822
$$ plain form
12995 -457 1303 3826 1681 -539 2983 -5304 -8278 -2893 4546 2946 5637 2372 5886 11841 8501
12980 8501 -2473 -5042 -4651 -5570 2065 8772 9959 8963 10822 8719 7446 4237 -216 2169 1634
12965 1634 1242 8476 4832 -5071 -6788 -1950 -5217 -5402 -9569 -12278 -12654 -10425 -8506 -7926 -5891 -3614
12949 -3614 -3520 -5260 -10815 -14632 -10763 -3866 2763 3547 -1558 -2586 -4593 -3675 -1746 1118 8166 12010
12933 12010 11260 10894 12865 8001 138 3084 5961 6094 3849 -1215 -2898 6415 8350 4337 6111
12918 6111 6781 3169 7434 10727 9864 13173 7406 7796 18942 24129 27419 33206 25173 19018 20127
12903 20127 25383 20670 16046 18713 23046 19260 21555 35007 31958 21614 17851 19240 17450 21431
12889 21431 24207 21508 20144 19180 17140 11682 4062 2766 1254 1247 2250 12004 13369 9459 6806
$$ packed form
12995d57J760K523k145k220L522q287k974N385P439j600K691l265L514N955l340
12980H501j0974k569L91r19P635O707J187r96J859k103j273l209m453K385n35
12965A634l92P234l644r903j717M838l267j85m167k709l76K229J919N80K035K277
12949c614R4j740n555l817L869O897O629P84n105j028k007R18J929K864P048L844
12933A2010p50l66J971m864p863K946K877J33k245n064j683R313J935m013J774
12918F111O70l612M265L293q63L309n767L90J1146N187L290N787q033o155J109
12903B0127N256m713m624K667M333l786K295J3452l049j0344l763J389j790L981
12889B1431K776k699j364r64k040n458p620j296j512pJ003R754J365l910k653
$$ plain form
12874 6806 13076 15934 9778 4761 4360 1061 4667 2551 250 -748 1621 -1923 -1710 -5114 -7178
12859 -7178 -2280 -4523 -7464 -2104 2231 5482 5454 1378 3653 1214 4233 2944 1978 6218 9923
12844 9923 9535 12155 8174 1508 -3279 872 3326 2872 6752 8000 5807 6932 6540 1211 619 2471
12828 2471 3736 11160 25162 24297 23200 23695 19374 9402 1733 -4608 -2636 3158 843 -578 -6225
12813 -6225 -4691 -3572 1248 2715 -3416 -5504 -6933 -7635 -3541 -392 -324 -2490 -582 5192 8451
12798 8451 9881 1395 -2135 -2882 -1787 1754 4829 3024 4160 3369 2800 8219 12457 10782 8000
12783 8000 13424 23470 25069 21499 11922 14499 17469 12287 13940 12077 12158 9181 17097 20688 24624
12768 24624 17934 10177 -136 -6402 -7567 -6813 -3606 -1475 -2514 4205 8065 4023 -178 1010
$$ packed form
12874F806O270K858o156n017m01l299L606k116k301r98K369l544K13l404k064
12859g178M898k243k941N360M335L251k8m076K275k439L019j289r66M240L705
12844I923l88K620l981o666m787M151K454m54L880J248k193J125l92n329n92J852
12828B471J265P424J4002q65j097M95m321r972p669o341J972N794k315j421n647
12813f225J534J119M820J467o131k088j429p02M094L149O8k166J908N774L259
12798H451J430q486l530p47J095L541L075j805J136p91n69N419M238j675k782
12783H000N424J0046J599l570r577K577K970n182J653j863Q1k977P916L591L936
12768B4624o690p757j0313o266j165P54L207K131j039O719L860m042m201J188
$$ plain form
12754 1010 2637 6485 11215 12955 9597 788 523 5030 6528 2742 4182 6879 7485 17632 18254
12739 18254 14860 12712 13623 16916 12944 7898 12949 12576 9532 15346 20717 25535 30453 27349 21189
12724 21189 15914 14126 5646 -450 5308 7224 1681 1933 5371 6822 13150 18784 16650 9132 6469
12709 6469 12174 16445 19029 19649 14705 13103 15800 15550 9552 13352 18988 22312 19424 18369 20209
12694 20209 24837 23845 22991 22094 25644 27394 26678 28612 37576 46961 63714 91310 128645 162015
12680 162015 197880 202861 187894 163165 130602 100009 78228 73239 66809 59135 54698 50386 45268
12667 45268 45676 46541 41371 40596 43081 41600 43472 47642 43926 38368 36916 39593 44138 46995 47462
12652 47462 49970 53318 58502 71933 88441 97477 118998 143822 169692 206946 266560 359087
$$ packed form
12754A010J627L848M730J740l358q809k65M507J498l786J440K697O06J0147O22
12739A8254l394k148R11L293l972n046N051l73l044N814N371M818M918l104o160
12724B1189n275j788q480o096N758J916n543K52L438J451O328N634k134p518k663
12709F469N705M271K584O20m944j602K697k50n998L800N636L324k888j055J840
12694B0209M628r92q54q97L550J750p16J934Q964R385J6753K7596L7335L3370
12680A62015L5865M981j4967k4729l2563l0593k1781m989o430p674m437m312n118
12667D5268M08Q65n170p75K485j481J872M170l716n558j452K677M545K857M67
12652D7462K508L348N184J3431J6508R036K1521K4824K5870L7254N9614R2527
$$ plain form
12640 359087 503483 716281 976625 1157646 1163977 1021174 835362 687381 609839 615314
12630 615314 718620 924341 1242029 1627535 1926741 1981499 1766866 1401823 1035397 745254
12620 745254 540717 403046 321342 267596 229246 193838 161749 143141 130009 112290 96998
12609 96998 82442 67714 54878 54179 51775 51676 48142 41850 37402 33003 33402 34492 35121 35450 43336
12594 43336 46264 51261 55741 49800 47905 47437 50289 52680 54709 54228 44815 48777 53720 47853 47224
12579 47224 40982 30559 27559 33549 35097 32604 28926 27873 30349 33668 34234 33892 34172 38718 44672
12564 44672 56144 58228 66271 81386 96265 105946 107576 103729 89656 78650 70612 67595 61223
12551 61223 60263 64030 66878 69310 70465 73261 71872 73183 68831 67919 72878 66120 65042 59650 56314
$$ packed form
12640C59087J44396K12798K60344J81021O331j42803j85812j47981p7542N475
12630F15314J03306K05721L17688L85506K99206N4758k14633l65043l66426k90143
12620G45254k04537j37671q1704n3746l8350l5408l2089j8608j3132j7719j5292
12609I6998j4556j4728j2836o99k404r9l534o292m448m399L99J090O29L29P886
12594D3336K928M997M480n941j895m68K852K391K029m81r413L962M943n867o29
12579D7224o242j0423l000N990J548k493l678j053K476L319N66l42K80M546N954
12564D4672J1472K084Q043J5115J4879R681J630l847j4073j1006q038l017o372
12551F1223r60L767K848K432J155K796j389J311m352r12M959o758j078n392l336
$$ plain form
12536 56314 49742 46435 40511 42524 44909 44201 50850 53493 50049 48617 51203 48314 44013 48488 52178
12521 52178 51878 51030 63650 70516 74519 74824 74372 72029 71230 67103 66808 67561 68182 71721 71079 69577
12505 69577 71339 74884 79042 76948 74230 71044 76475 81023 80347 77574 70266 69049 67568 62159 58161
12490 58161 60815 64381 66587 62117 55098 51228 49628 51901 56300 50840 52254 58603 61400 61773 67628
12475 67628 69152 67565 70370 71713 75483 75126 60106 56330 61520 62728 63062 69055 68201 55908 44348
12460 44348 46090 49118 38995 29633 31532 28455 22421 32910 44375 40456 35044 34952 35712 37475
12446 37475 30405 24304 23153 17311 18053 19995 22260 22347 21521 20774 22791 26593 29519 26515 23601 22018
12430 22018 24739 29694 28367 29338 38728 36645 35524 30656 32370 36064 40537 44252 40537 33297 36361
$$ packed form
12536E6314o572l307n924K013K385p08O649K643l444j432K586k889m301M475L690
12521E2178l00q48J2620O866M003L05m52k343p99m127k95P53O21L539o42j502
12505F9577J762L545M158k094k718l186N431M548o76k773p308j217j481n409l998
12490E8161K654L566K206m470p019l870j600K273M399n460J414O349K797L73N855
12475F7628J524j587K805J343L770l57j5020l776N190J208L34N993q54j2293j1560
12460D4348J742L028j0123r362J899l077o034J0489J1465l919n412r2P60J763
12446C7475p070o101j151n842P42J942K265Q7q26p47K017L802K926l004k914j583
12430B2018K721M955j327R71R390k083j121m868J714L694M473L715l715p240L064
$$ plain form
12415 36361 42642 42976 46329 57774 65248 74850 88304 101759 106353 101436 92529 88073 86818 69634
12401 69634 53203 42264 40769 40666 44129 34792 21512 16411 14353 22474 24927 23753 17591 9772
12387 9772 13823 22563 21767 23880 19896 16007 6924 1358 5576 12292 15683 15816 11048 10309 13021
12372 13021 15351 15103 17130 18878 24803 27868 29837 31625 37139 46714 54693 61844 79597 97789
12358 97789 126537 158568 196537 226709 242816 235756 209885 171691 131939 105830 87434 73359
12346 73359 61252 47850 41006 35545 34542 31663 30355 33781 33743 35710 29566 24065 23535 22859 21765
12331 21765 19676 17563 17364 11620 21397 26531 28724 24752 31119 33032 27364 25541 22735 22588 15597
12316 15597 16036 19653 21351 20179 26158 31983 38626 43450 52375 62085 75398 96399 120195 139866
$$ packed form
12415C6361O281L34L353J1445P474R602J3454J3455M594m917q907m456j255j7184
12401F9634j6431j0939j495j03L463r337j3280n101k058Q121K453j174o162p819
12387I772M051Q740p96K113l984l889r083n566M218O716L391J33m768p39K712
12372A3021K330k48K027J748N925L065J969J788N514R575P979P151J7753J8192
12358I7789K8748L2031L7969L0172J6107p060k5871l8194l9752k6109j8396j4075
12346G3359j2107j3402o844n461j003k879j308L426l8J967o144n501n30o76j094
12331B1765k089k113j99n744R777N134K193l972O367J913n668j823k806j47o991
12316A5597M39L617J698j172N979N825O643M824Q925R710J3313K1001K3796J9671
$$ plain form
12302 139866 148712 145823 131684 107190 92357 79224 69864 57320 45366 43539 41034 34365 30849
12289 30849 28038 27199 24518 26828 27763 24074 19893 23301 25702 24138 16656 11620 7897 12649 13133
12274 13133 11949 17416 19996 13438 3976 8607 16656 15267 11226 12835 13204 12207 16802 18364 18285
12259 18285 19420 19601 18839 16915 17121 18787 16826 17459 21869 22097 17125 9153 7875 12316 13868 16220
12243 16220 15945 20541 21289 18722 17039 18044 16225 12316 13735 10987 13110 10729 10072 19295 25443
12228 25443 33605 33733 29426 28785 22430 20185 14886 5597 5512 11975 17632 18501 12751 14775 21088 25276
12212 25276 22283 17389 13681 14145 14000 19325 19472 22425 27007 21993 17886 16446 18977 15508 15069
12197 15069 21079 26228 29123 22000 17603 15740 14235 13628 9637 7818 16973 25399 27892 29509 33155
$$ packed form
12302A39866Q846k889j4139k4494j4833j3133r360j2544j1954j827k505o669l516
12289C0849k811q39k681K310R35l689m181L408K401j564p482n036l723M752M84
12274A3133j184N467K580o558r462M631Q049j389m041J609L69r97M595J562p9
12259A8285J135J81p62j924K06J666j961O33M410K28m972p972j278M441J552K352
12243A6220k75M596P48k567j683J005j819l909J419k748K123k381o57R223O148
12228B5443Q162J28m307o41o355k245n299r289q5O463N657Q69n750K024O313M188
12212B5276k993m894l708M64j45N325J47K953M582n014m107j440K531l469m39
12197A5069O010N149K895p123m397j863j505o07l991j819R155Q426K493J617L646
$$ plain form
12182 33155 33182 34992 27080 25644 28567 35513 40366 37606 35470 36585 40845 42743 41967 37118 30025
12167 30025 24615 20909 26645 28832 32154 32762 31230 30433 33586 36330 32855 34266 37823 37902 31661
12152 31661 29433 33602 30641 24931 20682 24917 25769 28590 31319 33632 28786 31641 34554 28479 27160
12137 27160 34685 31867 27020 20445 19319 18063 22838 27345 37513 34112 31878 37434 45267 53928
12123 53928 57388 56318 56398 56277 54906 59761 64154 60526 60835 61090 51422 49805 50253 52465 56184 65286
12107 65286 68092 65643 65583 63629 64064 56758 59348 65195 63564 55911 48515 44316 44313 43275 42894 45072
12091 45072 46140 47585 47614 48527 49833 51136 52156 60860 61846 64631 67833 72308 69339 66259 72911
12076 72911 80781 87983 97750 105382 105083 98010 85761 80877 76878 77184 80897 82379 82258 82617 85296
$$ packed form
12182C3155K7J810p912j436K923O946M853k760k136J115M260J898p76m849p093
12167C0025n410l706N736K187L322O08j532p97L153K744l475J411L557P9o241
12152C1661k228M169k961n710m249M235Q52K821K729K313m846K855K913o075j319
12137B7160P525k818m847o575j126j256M775M507J0168l401k234N556P833Q661
12123E3928L460j070Q0j21j371M855M393l628L09K55r668j617M48K212L719R102
12107F5286K806k449o0j954M35p306K590N847j631p653p396m199lj038l81K178
12091D5072J068J445K9R13J306J303J020Q704R86K785L202M475k969l080O652
12076G2911P870P202R767P632k99p073j2249m884l999L06L713J482j21L59K679
$$ plain form
12061 85296 87679 82379 78817 80267 83354 87538 92171 90261 95794 100127 92970 93626 99630 101103 111038
12046 111038 117972 122373 120693 124033 132684 132350 129782 125797 127825 121133 123921 122557 123330 128330 138765
12031 138765 147034 147982 138301 138456 140379 146733 156179 156985 163479 165354 156803 163455 178161 187419 190632
12016 190632 189897 190388 200142 211340 217447 223421 228750 235836 248120 250737 254084 256276 269296 281473
12002 281473 299715 321825 337155 361970 384151 409557 433448 460163 492633 529529 563032
11991 563032 598601 646259 701648 765696 844818 953220 1083873 1244964 1439493 1677528
11981 1677528 1973681 2368999 2911246 3656816 4701928 6178133 8231821 10842596 13442738
11972 13442738 15010006 15426739 15518864 15649343 15360709 14037648 11917618 9677763 7699313
$$ packed form
12061H5296K383n300l562J450L087M184M633j910N533M333p157O56O004J473R935
12046A11038O934M401j680L340Q651l34k568l985K028o692K788j364P73N000J0435
12031A38765Q269R48r681J55J923O354R446Q06O494J875q551O652J4706R258L213
12016A90632p35M91R754J1198O107N974N329P086J2284K617L347K192J3020J2177
12002B81473J8242K2110J5330K4815K2181K5406K3891K6715L2470L6896L3503
11991E63032L5569M7658N5389O4048P9122J08402J30653J61091J94529K38035
11981A677528K96153L95318N42247P45570J045112J476205K053688K610775K600142
11972A3442738J567268M16733R2125J30479k88634j323061k120030k239855j978450
$$ plain form
11963 7699313 6133378 5006507 4236140 3691900 3262481 2876983 2536189 2239378 1990988
11954 1990988 1791977 1630180 1499848 1402651 1331034 1276248 1243328 1232793 1220600 1216490 1226651
11943 1226651 1250931 1284909 1325439 1384260 1455122 1543033 1646001 1778500 1945327 2155738
11933 2155738 2418293 2743306 3153294 3670700 4323635 5188798 6341768 7901725 10054495
11924 10054495 13037321 17032366 21909657 26904196 31224816 34700587 37242432 38446941
11916 38446941 37590634 35026519 30503321 24497285 18890694 14395204 11061414 8754047
11908 8754047 7189783 6076570 5226958 4541746 3965129 3463827 3030748 2666656 2372285
11899 2372285 2137420 1946820 1791574 1673148 1578578 1503667 1440309 1390724 1360729 1345770
$$ packed form
11963G699313j565935j126871p70367n44240m29419l85498l40794k96811k48390
11954A990988j99011j61797j30332r7197p1617n4786l2920j0535j2193m110J0161
11943A226651K4280L3978M0530N8821P0862Q7911J02968J32499J66827K10411
11933B155738K62555L25013M09988N17406O52935Q65163J152970J559957K152770
11924A0054495K982826L995045M877291M994539M320620L475771K541845J204509
11916C8446941q56307k564115m523198o006036n606591m495490l333790k307367
11908H754047j564264j113213q49612o85212n76617n01302m33079l64092k94371
11899B372285k34865j90600j55246j18426r4570p4911o3358m9585k9995j4959
$$ plain form
11889 1345770 1342283 1353964 1378977 1418876 1465582 1519017 1592832 1692482 1830952 2011889 2236436
11878 2236436 2522131 2885053 3336487 3938567 4764175 5889555 7399426 9435241 12243956
11869 12243956 15924365 19918599 22876257 24179896 24467028 23722201 21372785 17863885
11861 17863885 14228643 11059159 8567676 6746302 5460615 4523140 3803282 3236311
11853 3236311 2773690 2381359 2059371 1793172 1570927 1388391 1229675 1097426 994750
11844 994750 905930 817515 739211 681230 633614 602007 570916 543589 520006 509332 497283
11833 497283 484758 471006 457396 444792 424036 408919 384712 361895 337477 323709 306329
11822 306329 287926 275670 260296 251462 238191 222343 207902 206218 211734 210795 196063 191527 191023
$$ packed form
11889A345770l487J1681K5013L9899M6706N3435P3815R9650J38470J80937K24547
11878B236436K85695L62922M51434O02080Q25608J125380J509871K035815K808715
11869A2243956L680409L994234K957658J303639K87132p44827k349416l508900
11861A7863885l635242l169484k491483j821374j285687r37475p19858n66971
11853C236311m62621l92331l21988k66199k22245j82536j58716j32249j02676
11844I94750q8820q8415p8304n7981m7616l1607l1091k7327k3583j0674j2049
11833D97283j2525j3752j3610j2604k0756j5117k4207k2817k4418j3768j7380
11822C06329j8403j2256j5374q834j3271j5848j4441j684N516r39j4732m536n04
$$ plain form
11809 191023 187872 183439 181096 178062 178405 179400 179963 170076 152519 142940 139603 129920 125116 121907 123990
11794 123990 121360 119260 118411 120470 121318 121775 116850 118075 127563 129488 132947 138115 142539 148936 149632
11779 149632 144848 142094 144626 135619 131351 131045 124302 114581 115003 121574 134603 140412 146919 145366
11765 145366 136066 121844 110548 102126 94079 90004 93885 101363 108596 118147 121848 126109 131516 141716
11751 141716 146699 147691 148333 151355 154890 154914 158142 157108 152985 144366 138578 129189 123326 115371 113372
11736 113372 106648 101084 88817 81110 77566 71660 66401 59593 56500 54290 59093 60115 59554 62950
11722 62950 69604 69167 62252 58912 58210 55222 51263 52723 53589 65424 72735 80489 91122 98143 108111
11707 108111 113142 118062 121068 124882 135340 143583 143331 140243 138725 134390 137849 129754 120853 116410
$$ packed form
11809A91023l151m433k343l034L43R95N63r887j7557r579l337r683m804l209K083
11794A23990k630k100q49K059Q48M57m925J225R488J925L459N168M424O397O96
11779A49632m784k754K532r007m268l06o743r721M22O571J3029N809O507j553
11765A45366r300j4222j1296q422q047m075L881P478P233R551L701M261N407J0200
11751A41716M983R92O42L022L535K4L228j034m123q619n788r389n863p955j999
11736A13372o724n564j2267p707l544n906n259o808l093k210M803J022n61L396
11722F2950O654m37o915l340p02k988l959J460Q66J1835P311P754J0633P021R968
11707A08111N031M920L006L814J0458Q243k52l088j518m335L459q095q901m443
$$ plain form
11693 116410 109159 97364 97393 89497 82107 85398 99059 100742 92955 88766 82202 78722 72624 76585
11679 76585 78854 69144 55005 55093 51634 52369 48802 46667 53669 60887 64620 62358 64539 66588 74609
11664 74609 70294 64031 65245 63970 58963 61524 57202 59183 60419 60346 58997 55782 53294 56732 61314
11649 61314 62559 61878 60128 64236 60559 57952 59470 52224 50401 57134 55311 48587 46859 48097 51691
11634 51691 52133 56309 54220 55823 60121 53202 53476 55680 50233 45964 55326 61093 60984 61845 64810
11619 64810 62215 65803 66248 66702 71856 68386 67052 62364 51782 41767 37992 37838 39449 46337 42119
11604 42119 36118 38419 46375 48161 49948 43341 34209 39334 43840 44376 38995 36534 37050 32374 38649
11589 38649 38533 40009 40546 39050 36989 32817 26831 29326 28830 21906 28058 28180 25464 21218 19277
$$ packed form
11693A16410p251j1795K9p896p390L291J3661J683p787m189o564l480o098L961
11679G6585K269r710j4139Q8l459P35l567k135P002P218L733k262K181K049Q021
11664G4609m315o263J214j275n007K561m322J981J236p3j349l215k488L438M582
11649F1314J245o81j750M108l677k607J518p246j823O733j823o724j728J238L594
11634E1691M42M176k089J603M298o919K74K204n447m269R362N767j09Q61K965
11619F4810k595L588M45M54N154l470j334m688j0582j0015l775j54J611O888m218
11604D2119o001K301P956J786J787o607r132N125M506N36n381k461N16m676O275
11589C8649j16J476N37j496k061m172n986K495m96o924O152J22k716m246j941
$$ plain form
11574 19277 26812 27674 23151 23208 27878 31892 37124 40342 45103 40785 35446 34014 31558 34762 33625
11559 33625 31415 34584 36499 33548 31973 29343 19997 25397 26374 28937 33628 39576 45930 48237 44114
11544 44114 44457 49144 47818 49437 60975 69814 83601 90196 82037 79420 74517 66535 59920 55992
11530 55992 54128 54985 59320 60746 61800 56652 56077 62622 67133 72519 71127 66838 63516 60279 57422
11515 57422 58724 62029 60599 56217 55934 57102 56637 58766 49226 46373 52162 56459 66053 74619 72677
11500 72677 64341 65539 68615 69335 74770 85357 99533 107597 109257 105542 95707 89111 84557 84281
11486 84281 82343 77759 83730 89168 100387 107680 117772 135160 146524 153626 159422 173670 191292
11473 191292 213438 234553 239722 243042 239342 228947 212262 195553 183272 181557 190944 208978
$$ packed form
11574A9277P535Q62m523N7M670M014N232L218M761m318n339j432k456L204j137
11559C3625k210L169J915k951j575k630r346N400R77K563M691N948O354K307m123
11544D4114L43M687j326J619J1538Q839J3787O595q159k617m903p982o615l928
11530E5992j864Q57M335J426J054n148n75O545M511N386j392m289l322l237k857
11515E7422J302L305j430m382k83J168m65K129r540k853N789M297R594Q566j942
11500G2677q336J198L076P20N435J0587J4176Q064J660l715r835o596m554k76
11486H4281j938m584N971N438J1219P293J0092J7388J1364P102N796J4248J7622
11473A91292K2146K1115N169L320l700j0395j6685j6709j2281j715R387J8034
$$ plain form
11461 208978 238263 286468 359475 462175 609589 800220 947622 973738 876861 709570
11451 709570 546476 414471 323157 269064 241715 219301 202322 188144 181778 182658 187702 190765
11439 190765 188270 190826 197541 210007 226342 244258 259571 267802 269085 257939 236837 221901
11427 221901 217259 213758 215622 224901 228580 233021 234978 217723 200774 195159 185264 174412 172121
11414 172121 172197 175376 182968 185268 177329 170680 171302 168540 165538 166074 173231 174630 181150 187142 186320
11399 186320 188594 196647 198165 199320 209162 213124 220426 226453 227343 233482 244839 245029 245295 250910 264791
11384 264791 271932 277027 282479 289973 296897 301877 302451 312704 323830 330678 332827 343081 357079
11371 357079 369725 389987 413608 437049 464163 494202 522107 548203 584944 623758 670627
$$ packed form
11461B08978K9285M8205P3007J02700J47414J90631J47402K6116r6877j67291
11451G09570j63094j32005r1314n4093k7349k2414j6979j4178o366Q80N044L063
11439A90765k495K556O715J2466J6335J7916J5313Q231J283j1146k1102j4936
11427B21901m642l501J864R279L679M441J957j7255j6949n615r895j0852k291
11414A72121P6L179P592K300p939o649O22k762l002N36P157J399O520N992q22
11399A86320K274Q053J518J155R842L962P302O027Q90O139J1357J90K66N615J3881
11384B64791P141N095N452P494O924M980N74J0253J1126O848K149J0254J3998
11371C57079J2646K0262K3621K3441K7114L0039K7905K6096L6741L8814M6869
$$ plain form
11360 670627 722714 781534 852569 926673 1005940 1102806 1213194 1362009 1551684 1783668 2073706
11349 2073706 2461550 2976575 3658365 4554659 5655678 6904415 8244775 9649055 11049423
11340 11049423 12338176 13480842 14458216 15206212 15651558 15870857 15898940 15659798 15113105
11331 15113105 14343250 13393117 12253987 10971824 9641936 8312957 7030704 5894046
11323 5894046 4940601 4174632 3576376 3114845 2751284 2461144 2228830 2048306 1915555
11314 1915555 1811757 1733387 1681598 1650238 1634441 1636024 1655266 1685028 1734379 1808376 1907022
11303 1907022 2025559 2181232 2381183 2646096 3000477 3469019 4099769 4970372 6134692
11294 6134692 7606160 9343794 11306074 13439950 15603041 17765451 19866771 21818360
$$ packed form
11360F70627N2087N8820P1035P4104P9267R6866J10388J48815J89675K31984K90038
11349B073706L87844N15025O81790Q96294J101019J248737J340360J404280J400368
11340A1049423J288753J142666R77374P47996M45346K19299K8083k39142n46693
11331A5113105p69855r50133j139130j282163j329888j328979j282253j136658
11323E894046r53445p65969n98256m61531l63561k90140k32314j80524j32751
11314A915555j03798p8370n1789l1360j5797J583J9242K9762M9351P3997R8646
11303A907022J18537J55673J99951K64913L54381M68542O30750Q70603J164320
11294F134692J471468J737634J962280K133876K163091K162410K101320J951589
$$ plain form
11286 21818360 23420268 24608390 25495140 25914055 25864843 25429588 24606841 23347622 21655601
11277 21655601 19739449 17662605 15502470 13382397 11381732 9557618 7962257 6628789
11269 6628789 5554135 4713387 4051515 3528999 3116848 2776118 2490491 2261156 2075173
11260 2075173 1920892 1800846 1699784 1617474 1551602 1502320 1467405 1451669 1457284 1492077 1540543
11249 1540543 1614403 1714684 1851947 2033474 2268021 2582955 3013878 3573520 4253520 5007864
11239 5007864 5799160 6644033 7533455 8434284 9289790 10043967 10638617 11005092 11184560
11230 11184560 11242741 11170390 10909588 10419263 9750692 8945666 8051869 7152719 6269429 5405876
11220 5405876 4565840 3790735 3132858 2608849 2192905 1867015 1621545 1434378 1286421
$$ packed form
11286B1818360J601908J188122Q86750M18915m9212m35255q22747j259219j692021
11277B1655601j916152k076844k160135k120073k000665j824114j595361j333468
11269F628789j074654q40748o61872n22516m12151l40730k85627k29335j85983
11260B075173j54281j20046j01062q2310o5872m9282l4915j5736N615L4793M8466
11249A540543P3860J00281J37263J81527K34547L14934M30923N59642O80000P54344
11239E007864P91296Q44873Q89422R00829Q55506P54177N94650L66475J79468
11230A1184560N8181p2351k60802m90325o68571q05026q93797q99150q83290q63553
11220E405876q40036p75105o57877n24009m15944l25890k45470j87167j47957
$$ plain form
11211 1286421 1157934 1049219 949387 867261 798580 731859 674010 625850 594289 571676 543473
11200 543473 514636 488646 468296 448322 427490 413356 401802 385762 368885 360929 344204 334685
11188 334685 328998 323799 308200 294592 283613 280742 273698 264294 253690 245826 243415 237762 238614
11175 238614 239395 244451 244253 238425 237052 229836 229701 230413 226851 229196 229253 228809 227929 228836 234431 244776
11159 244776 244649 249661 251654 246855 243430 245109 236620 226275 219182 213037 212141 209693 210172 217087 222114
11144 222114 221161 217158 218908 216689 218313 217943 217508 219037 225135 229104 231946 237180 243235 252765 257807
11129 257807 259828 271303 281772 284051 284366 283325 288956 280147 269379 263062 257818 259822 258159 260135
11115 260135 266091 265451 272621 284838 302881 313254 317334 328313 333988 335939 346919 352793 362296
$$ packed form
11211A286421j28487j08715r9832q2126o8681o6721n7849m8160l1561k2613k8203
11200E43473k8837k5990k0350j9974k0832j4134j1554j6040j6877p956j6725r519
11188C34685n687n199j5599j3608j0979k871p044r404j0604p864k411n653Q52
11175B38614P81N056j98n828j373p216j35P12l562K345N7m44q80R07N595J0345
11159B44776j27N012J993m799l425J679q489j0345p093o145q96k448M79O915N027
11144B22114r53m003J750k219J624l70m35J529O098L969K842N234O055R530N042
11129B57807K021J1475J0469K279L15j041N631q809j0768o317n244K004j663J976
11115B60135N956o40P170J2217J8043J0373M080J0979N675J951J0980N874R503
$$ plain form
11102 362296 371274 380737 391306 403663 412833 416039 415818 422582 430831 434574 447391 459081 466485
11089 466485 481508 504717 519899 543378 565402 593741 617630 637305 656117 668249 683979
11078 683979 703200 729466 750771 775320 797030 821332 849746 891094 924409 964156 999798
11067 999798 1023166 1050776 1086149 1132972 1198685 1273819 1355236 1442655 1547240 1669571 1804366
11056 1804366 1942485 2086142 2229715 2388267 2566612 2778643 3039655 3362774 3757255
11047 3757255 4251225 4867806 5641715 6592360 7663881 8851599 10180242 11800382 14016999
11038 14016999 17319118 22398501 30247832 42387493 60945069 88389794 124675342
11031 124675342 158787989 172903890 161020947 130838558 98058487 70302381 49837240
$$ packed form
11102C62296Q978R463J0569J2357R170L206k21O764Q249L743J2817J1690P404
11089D66485J5023K3209J5182K3479K2024K8339K3889J9675J8812J2132J5730
11078F83979J9221K6266K1305K4549K1710K4302K8414M1348L3315L9747L5642
11067I99798K3368K7610L5373M6823O5713P5134Q1417Q7419J04585J22331J34795
11056A804366J38119J43657J43573J58552J78345K12031K61012L23119L94481
11047C757255M93970O16581P73909R50645J071521J187718J328643J620140K216617
11038A4016999L302119N079383P849331J2139661J8557576K7444725L6285548
11031A24675342L4112647J4115901j1882943l0182389l2780071k7756106k0465141
$$ plain form
11024 49837240 36459039 28097542 22729842 19070388 16395296 14267816 12454729 10816061
11016 10816061 9331885 8007986 6860027 5914463 5142437 4520813 4016920 3588346 3205400
11007 3205400 2881432 2618034 2394520 2218309 2062808 1915727 1784274 1676577 1584737 1503029
10997 1503029 1435887 1378492 1329599 1277660 1240015 1237913 1261292 1266897 1212320 1099349 990483
10986 990483 895826 824350 763709 707880 660975 626520 594927 560877 539213 522101 506257
10975 506257 497786 496718 488007 478441 461972 441040 426736 414339 401964 381981 354597 334951
10963 334951 321807 315084 316176 314726 296513 288712 280962 275542 268466 260834 257512 259251 260057 264392
10949 264392 270322 271642 271282 273211 267959 262235 257570 249696 244067 245778 238685 215230 201613 189897
$$ packed form
11024D9837240j3378201q361497n367700l659454k675092k127480j813087j638668
11016A0816061j484176j323899j147959r45564p72026o21624n03893m28574l82946
11007C205400l23968k63398k23514j76211j55501j47081j31453j07697r1840q1708
10997A503029o7142n7395m8893n1939l7645k102K3379N605n4577j12971j08866
10986I90483r4657p1476o0641n5829m6905l4455l1593l4050k1664j7112j5844
10975E06257q471j068q711r566j6469k0932j4304j2397j2375j9983k7384j9646
10963C34951j3144o723J092j450j8213p801p750n420p076p632l322J739Q06M335
10949B64392N930J320l60J929n252n724m665p874n629J711p093k3455j3617j1716
$$ plain form
10935 189897 192387 187657 181070 180515 177347 181753 179956 169695 172627 179307 189836 196120 195793 198482
10921 198482 203335 206862 215846 229210 230518 230836 234640 233680 234532 228242 216367 216016 217111 206712
10907 206712 193118 186995 189723 183470 167709 152877 154536 147273 143799 140747 131586 130155 128242
10894 128242 119297 109762 113535 115370 111261 103405 99360 97010 96124 97112 98961 98502 97403 94742 92995
10879 92995 85855 78893 80977 86551 89863 97118 101785 106370 108950 115109 122597 132402 151089 159218
10865 159218 166120 169893 174134 180150 177239 184278 185490 177054 165167 159466 148818 134114 119597
10852 119597 113964 110477 98323 85830 78217 80740 79124 69856 58424 53381 53822 54542 48076 37464
10838 37464 40223 45611 44223 47946 54915 61129 66710 72412 69501 62152 63814 71533 68843 67212
$$ packed form
10935A89897K490m730o587n55l168M406j797j0261K932O680J0529O284l27K689
10921A98482M853L527Q984J3364J308L18L804r60Q52o290j1875l51J095j0399
10907B06712j3594o123K728o253j5761j4832J659p263l474l052r161j431j913
10894A28242q945r535L773J835m109p856m045k350q86R88J849m59j099k661j747
10879I2995p140o962K084N574L312P255M667M585K580O159P488R805J8687Q129
10865A59218O902L773M241O016k911P039J212q436j1887n701j0648j4704j4517
10852A19597n633l487j2154j2493p613K523j616r268j1432n043M41P20o466j0612
10838C7464K759N388j388L723O969O214N581N702k911p349J662P719k690j631
$$ plain form
10824 67212 53909 48671 57145 62353 65851 75465 87046 94076 101660 105398 110450 115556 126438 134007
10810 134007 129658 123451 119846 120857 117835 112788 102226 97802 96526 91955 88687 87658 83531 80278
10796 80278 72683 68095 70562 71698 68523 62018 58291 62568 60848 55563 57940 62088 54406 43877
10782 43877 43785 40524 41475 50527 55322 55250 52442 41825 31139 34169 35494 34399 36825 31432 32019
10767 32019 24877 22382 23874 36416 40637 42864 42133 37056 36400 37223 41281 43639 40197 27656 17610
10752 17610 27138 36346 36897 37393 40198 47231 42415 40611 36991 33924 29516 29799 35312 39134 39981
10737 39981 36893 49611 53316 55757 54805 52109 61841 75683 86621 92639 83786 61895 49386
10724 49386 41007 37547 34114 37203 33718 28174 24652 32410 29818 21406 23254 28815 31990 32185 23661
$$ packed form
10824F7212j3303n238Q474N208L498R614J1581P030P584L738N052N106J0882P569
10810A34007m349o207l605J011l022n047j0562m424j276m571l268j029m127l253
10796H0278p595m588K467J136l175o505l727M277j720n285K377M148p682j0529
10782D3877r2l261R51R052M795p2k808j0617j0686L030J325j095K426n393N87
10767C2019p142k495J492J2542M221K227p31n077o56Q23M058K358l442j2541j0046
10752A7610R528R208N51M96K805P033m816j804l620l067m408K83N513L822Q47
10737C9981l088J2718L705K441r52k696R732J3842J0938O018q853k1891j2509
10724D9386q379l460l433L089l485n544l522P758k592q412J848N561L175J95q524
$$ plain form
10709 23661 14665 10865 17887 20102 22322 17891 13829 17804 20348 19717 7269 7308 6464 3382 9582
10694 9582 12087 10356 2299 831 5484 13103 14692 10915 11426 11742 18861 14788 13187 19930 22708
10679 22708 17525 12735 5897 10998 15610 14552 10716 15098 18716 20197 20022 21520 27508 35438 34787
10664 34787 25098 27586 26567 23045 22948 26438 27596 27205 27238 31433 22838 17302 15297 17357 20438 16464
10648 16464 14080 16100 21202 27910 31112 29232 22488 19131 21474 24933 31853 33523 29741 23737
10634 23737 16970 21052 27644 25979 16152 14611 17635 14560 13065 12338 11260 15421 19176 26589 28313
10619 28313 28522 31396 33312 37176 39056 43520 54263 62265 64420 72215 80541 88832 101385 128782
10605 128782 170410 231768 327619 466615 650332 822171 892062 831026 689994 523052
$$ packed form
10709B3661q996l800P022K215K220m431m062L975K544o31j2448L9q44l082O200
10694I582K505j731q057j468M653P619J589l777N11L16P119m073j601O743K778
10679B2708n183m790o838N101M612j058l836M382L618J481j75J498N988P930o51
10664C4787r689K488j019l522r7L490J158l91L3M195q595n536k005K060L081l974
10648A6464k384K020N102O708L202j880o744l357K343L459O920J670l782o004
10634B3737o767M082O592j665r827j541L024l075j495p27j078M161L755P413J724
10619B8313K09K874J916L864J880M464J0743Q002K155P795Q326Q291J2553K7397
10605A28782M1628O1358R5851J38996J83717J71839O9891o1036j41032j66942
$$ plain form
10595 523052 373473 265330 194405 147688 118711 105220 89374 75576 71429 74256 67251 67264
10583 67264 63396 56555 47365 45930 51559 51599 39833 32875 34864 35720 29018 20372 19122 23482 25324
10568 25324 28752 31116 27239 30696 35776 34404 28289 19810 17631 18975 17806 8048 7867 5699 3419
10553 3419 1856 2047 3529 10548 7857 2396 -3343 -5398 1415 10126 17474 19442 13063 11451 12239
10538 12239 15068 6421 4611 10290 14992 13506 14220 11105 11854 10055 10354 10675 5224 3552 -462
10523 -462 1114 2474 13284 20367 18489 17254 10685 6475 5828 8420 11089 17973 16467 10979 15970
10508 15970 17909 9911 7001 5481 5892 15197 16259 9463 11479 19882 15528 15252 9601 9130 8377
10493 8377 5262 7491 10868 10151 8103 8646 13800 15370 22648 29563 43879 50170 56770 58140 53818
$$ packed form
10595E23052j49579j08143p0925m6717k8977j3491j5846j3798m147K827p005J3
10583F7264l868o841r190j435N629M0j1766o958J989Q56o702q646j250M360J842
10568B5324L428K364l877L457N080j372o115q479k179J344j169r758j81k168k280
10553C419j563J91J482P019k691n461n739k055O813Q711P348J968o379j612P88
10538A2239K829q647j810N679M702j486P14l115P49j799K99L21n451j672m014
10523d62J576J360J0810P083j878j235o569m210o47K592K669O884j506n488M991
10508A5970J939p998k910j520M11R305J062o796K016Q403m354k76n651m71p53
10493H377l115K229L377p17k048N43N154J570P278O915J4316O291O600J370m322
$$ plain form
10478 53818 44361 35262 37040 29801 21866 19749 21486 12894 11810 8889 9665 12414 10132 4079 9497
10463 9497 17423 21507 15708 6679 3398 7175 9903 8181 3695 -2457 -6419 394 4569 942 3898
10448 3898 12185 20490 21548 19540 17550 7240 3137 11933 19005 22046 15988 10185 4842 -741
10434 -741 -5071 -2083 2072 1047 827 -1685 -1530 69 3856 8773 9201 9964 2461 -3354 2150 5348
10418 5348 3984 4176 -7996 -9078 -7233 -6576 -440 8152 13461 17547 15146 10709 6037 6164 13631
10403 13631 15900 16899 19529 19383 14468 15263 15700 19525 20932 23031 18925 9206 12709 11463 8747
10388 8747 10500 17326 20446 15938 10443 9577 8724 12275 11340 12650 10827 9967 9461 11140 16652 22883
10372 22883 32589 28299 14064 -328 -3485 -461 391 1603 4967 -358 -1851 2732 9858 14297
$$ packed form
10478E3818r457r099J778p239p935k117J737q592j084k921P76K749k282o053N418
10463I497P926M084n799r029l281L777K728j722m486o152l962O813M175l627K956
10448C898Q287Q305J058k008j990j0310m103Q796P072L041o058n803n343n583
10434g41m330K988M155j025k20k512J55J599L787M917M28P63p503n815N504L198
10418E348j364J92j2172j082J845O57O136Q592N309M086k401m437m672J27P467
10403A3631K269R99K630j46m915P95M37L825J407K099m106r719L503j246k716
10388H747J753O826L120m508n495q66q53L551r35J310j823q60n06J679N512O231
10372B2883R706m290j4235j4392l157L024Q52J212L364n325j493M583P126M439
$$ plain form
10358 14297 13344 13373 12324 12621 14535 10826 6009 4153 5683 12907 15193 11409 941 -6281 -4473
10343 -4473 -3567 -2193 -2987 -4185 581 7827 12153 18486 25086 20810 19026 14676 14397 17593 15079
10328 15079 15964 12159 8355 12296 11985 8798 16848 14495 11115 11991 16848 14012 8815 8591 6416
10313 6416 3111 5099 3438 -949 2570 5827 5640 8976 8690 3476 5644 7887 10364 11131 13003
10298 13003 13185 8991 226 1520 9831 11963 10198 4212 -707 -3074 -1795 -5242 -6249 -4913 -6537
10283 -6537 -1986 872 4386 6398 2746 -1821 6443 3478 -3042 2530 5727 5731 15714 16587 13857 7628
10267 7628 -1247 -1224 6289 8526 5057 7625 5415 4039 12901 15630 10906 11747 8949 5533 8524
10252 8524 2467 -2387 -1805 7863 10078 14597 8836 6793 2064 -1195 -2697 -510 6914 8012 7417
$$ packed form
10358A4297r53K9j049K97J914l709m817j856J530P224K286l784j0468p222J808
10343d473R06J374p94j198M766P246M326O333O600m276j784m350k79L196k514
10328A5079Q85l805l804L941l11l187Q050k353l380Q76M857k836n197k24k175
10313F416l305J988j661m387L519L257j87L336k86n214K168K243K477P67J872
10298A3003J82m194q765J294Q311K132j765n986m919k367J279l447j007J336j624
10283f537M551K858L514K012l652m567Q264k965o520N572L197MR983Q73k730o229
10267G628q875K3P513K237l469K568k210j376Q862K729m724Q41k798l416K991
10252H524o057m854N82R668K215M519n761k043m729l259j502K187P424J098n95
$$ plain form
10237 7417 7783 11270 7150 8227 5762 6302 8456 3539 1631 2841 -272 -3442 1489 10203 8933
10222 8933 8111 2620 588 1400 5387 10713 14838 11185 12623 9217 3990 6375 4083 3877 4055 3503
10206 3503 5654 6355 4671 -161 -1027 -7 -681 -192 3599 5086 5746 1523 -720 4485 -115 -864
10190 -864 154 -5591 -2426 11354 12480 7885 3477 5459 8911 2995 5942 12625 10708 12106 10785
10175 10785 10142 13623 17553 14348 15780 11814 6898 2447 1344 2382 3770 7794 9263 7492 -626
10160 -626 -3756 -1706 5364 5327 3693 4405 11826 9517 6908 2015 2576 5671 5964 2847 8285 5906
10144 5906 9807 565 -3758 4457 5961 8734 7678 5934 5741 4075 2006 4107 9939 7602 7921
10129 7921 10144 11332 8494 3577 -2903 -7381 -5085 -974 -2863 -753 -187 -4020 -3898 -3423 3066
$$ packed form
10237G417L66L487m120J077k465N40K154m917j908J210l113l170M931Q714j270
10222H933q22n491k032Q12L987N326M125l653J438l406n227K385k292k06J78n52
10206C503K151P01j684m832q66J020o74M89L791J487O60m223k243N205m600p49
10190h64J018n745L165J3780J126m595m408J982L452n916K947O683j917J398j321
10175A0785o43L481L930l205J432l966m916m451j103J038J388M024J469j771q118
10160f26l130K050P070l7j634P12P421k309k609m893N61L095K93l117N438k379
10144E906L901r242m323Q215J504K773j056j744j93j666k069K101N832k337L19
10129G921K223J188k838m917o480m478K296M111j889K110N66l833J22M75O489
$$ plain form
10114 3066 2305 -4593 -4077 128 6256 11273 19706 20750 15307 18348 17153 13788 11208 11358 9476
10099 9476 4687 2362 5764 4667 -2065 -1416 -3540 -274 2171 -1099 3767 7553 4100 4657 464
10084 464 -53 1665 3318 9379 10589 6266 10615 7244 6528 6553 8160 7142 1998 -2998 -436 8225
10068 8225 9195 8241 4974 -248 6306 10925 7896 -554 928 8722 232 -1995 2375 8277 6975
10053 6975 11349 11330 14780 13303 12033 12345 12825 11949 10313 11806 11252 16646 14202 10447 14468 16382
10037 16382 14090 9867 8889 9933 14608 16321 16265 11265 4030 -994 8648 9548 10310 10837 7082 3716
10021 3716 8445 14270 12184 14876 12975 66 -3887 -4944 -1090 6526 8321 13216 7982 8899 6639
10006 6639 508 -639 466 3748 1955 1610 -2618 6452 12860 17323 19202 20211 21909 15225 15657
$$ packed form
10114C066p61o898N16M205O128N017Q433J044n443L041j195l365k580J50j882
10099I476m789k325L402j097o732O49k124L266K445l270M866L786l453N57m193
10084D64n17J718J653O061J210m323M349l371p16K5J607j018n144m996K562Q661
10068H225R70r54l267n222O554M619l029q450J482P794q490k227M370N902j302
10053F975M374j9L450j477j270L12M80q76j636J493n54N394k444l755M021J914
10037A6382k292m223r78J044M675J713n6n000p235n024R642R00P62N27l755l366
10021C716M729N825k086K692j901j2909l953j057L854P616J795M895n234R17k260
10006F639o131j147J105L282j793l45m228R070O408M463J879J009J698o684M32
$$ plain form
9991 15657 16291 13168 8990 6091 8415 10992 11043 15295 18604 19917 15735 8011 4584 8378 8424 12144
9975 12144 21627 25523 20212 12822 12071 10382 12637 10952 3124 -331 -666 5706 7899 5073 2318
9960 2318 5253 11650 7281 6053 9049 14327 15499 9813 4553 9718 9758 9902 5660 5873 5141 4675
9944 4675 6055 10599 10320 8499 9286 10167 12569 14572 12423 8087 7324 9780 15106 13537 11316 8494
9928 8494 4416 -367 9726 20788 25483 17781 12725 11619 10051 8278 10909 6936 7311 8050 13300
9913 13300 15116 12020 11489 9720 19695 21830 22780 21294 28589 29176 25491 24353 20243 20386 19574 16987
9897 16987 15778 11454 6666 6983 3996 9933 11343 9498 12127 12882 10565 6130 7413 14457 17655
9882 17655 16250 13767 11747 10755 9978 9534 13231 13932 15174 14139 12916 11232 12115 13646 9643 7399
$$ packed form
9991A5657O34l123m178k899K324K577N1M252L309J313m182p724l427L794M6L720
9975A2144R483L896n311p390p51j689K255j685p828l455l35O372K193k826k755
9960B318K935O397m369j228K996N278J172n686n260N165M0J44m242K13p32m66
9944D675J380M544k79j821P87Q81K402K003k149m336p63K456N326j569k221k822
9928H494m078m783J0093J1062M695p702n056j106j568j773K631l973L75P39N250
9913A3300J816l096n31j769R975K135R50j486P295N87l685j138m110J43q12k587
9897A6987j209m324m788L17k987N937J410j845K629P55k317m435J283P044L198
9882A7655j405k483k020r92p77m44L697P01J242j035j223j684Q83J531m003k244
$$ plain form
9866 7399 17183 17502 16292 14264 12274 14020 14801 14735 12366 6714 1020 8368 12154 13375 16449 16265
9850 16265 16400 11094 10907 17479 21533 17281 16009 8342 474 53 2554 4981 5169 3353 1956 1910
9834 1910 6140 9060 13951 19789 22347 18795 18623 18319 17369 18216 16305 18285 23344 25174 20799 13288
9818 13288 12063 20627 20791 16973 13869 11051 6079 1325 -2975 958 7614 12239 9496 5055 14006
9803 14006 15480 10325 11375 8843 10752 3781 -1278 1689 4616 8742 7563 8191 3751 2954 7774
9788 7774 13500 9683 122 -2897 -6369 -8665 -114 2183 5948 9398 13338 13791 15040 11569 7199
9773 7199 13126 13805 12951 13118 9907 5847 4134 9533 9889 7436 12776 9509 10973 20577 18640 19234
9757 19234 18068 17440 12077 12406 11141 12679 11710 13264 15275 17325 20196 17360 14790 10032 10105 15468
$$ packed form
9866G399R784L19j210k028j990J746P81o6k369n652n694P348L786J221L074j84
9850A6265J35n306j87O572M054m252j272p667p868m21K501K427J88j816j397m6
9834A910M230K920M891N838K558l552j72l04r50Q47j911J980N059J830m375p511
9818A3288j225Q564J64l818l104k818m972m754m300L933O656M625k743m441Q951
9803A4006J474n155J050k532J909o971n059K967K927M126j179O28m440p97M820
9788G774N726l817r561l019l472k296Q551K297L765L450L940M53J249l471m370
9773G199N927O79q54J67l211m060j713N399L56k453N340l267J464R604j937N94
9757A9234j166o28n363L29j265J538r69J554K011K050K871k836k570m758P3N363
$$ plain form
9741 15468 18039 19145 13341 5462 4026 7250 12618 8826 10151 9841 11672 11311 8101 6635 5283
9726 5283 10612 18345 23293 21103 21536 20434 13093 13591 23384 24580 19352 20511 26453 29846 27333
9711 27333 24409 24183 25379 25565 27002 28652 33987 32000 36536 46317 45679 47716 54903 59861 61793
9696 61793 65886 74201 79174 75927 73175 63628 57215 47537 38318 37124 31804 28220 24791 24976 25103
9681 25103 19729 16618 21763 26379 21209 15976 25301 30227 27291 24080 21302 19132 18200 16097 14331
9666 14331 13779 15578 15362 13588 15327 19902 24439 25267 21333 22686 17777 13238 19490 19287 18131 16841
9650 16841 13358 21261 22288 22733 23833 24105 27337 31230 24922 15999 15613 16195 23427 26144 18320 16104
9634 16104 16651 16606 16680 14353 11361 6555 5612 4939 7809 7939 11229 18105 16091 11573 19697 31022
$$ packed form
9741A5468K571J106n804p879j436L224N368l792J325l10J831l61l210j466j352
9726E283N329P733M948k190M33j102p341M98R793J196n228J159N942L393k513
9711B7333k924k26J196J86J437J650N335j987M536R781o38K037P187M958J932
9696F1793M093Q315M973l247k752r547o413r678r219j194n320l584l429J85J27
9681B5103n374l111N145M616n170n233R325M926k936l211k778k170r32k103j766
9666A4331n52J799k16j774J739M575M537Q28l934J353m909m539O252k03j156j290
9650A6841l483P903J027M45J100K72L232L893o308q923l86N82P232K717p824k216
9634A6104N47m5P4k327k992m806r43o73K870J30L290O876k014m518Q124J1325
$$ plain form
9618 31022 31434 32847 31401 30262 27567 25492 22680 20693 16405 18682 22336 17090 16675 17522 12684
9603 12684 9698 10540 8918 10943 9441 12971 24772 29854 26698 23286 28058 28778 27799 23082 26570
9588 26570 27805 22494 23460 34076 34432 30640 29095 25441 21863 18800 15836 18652 28637 31174 29059
9573 29059 29425 19331 13963 13242 16276 16955 24204 28405 18841 11963 13654 20983 24931 25445 25461 24130
9557 24130 28013 38751 39762 31140 24432 19935 20675 22513 23907 26215 24208 22457 19207 16483 19882
9542 19882 22589 24618 27235 28263 23951 17515 14721 18609 20164 20077 23567 26044 29137 27776 27600
9527 27600 28187 26822 30926 27962 23914 21926 12481 13146 21974 20837 24528 27960 23718 20523 15807
9512 15807 17749 18663 21030 21998 18273 18751 15624 17049 26466 30333 30586 31918 31169 37192 47838 47894
$$ packed form
9618C1022M12J413j446j139k695k075k812j987m288K277L654n246m15Q47m838
9603A2684k986Q42j622K025j502L530J1801N082l156l412M772P20r79m717L488
9588B6570J235n311R66J0616L56l792j545l654l578l063k964K816R985K537k115
9573B9059L66j0094n368p21L034O79P249M201r564o878J691P329L948N14J6j331
9557B4130L883J0738J011q622o708m497P40J838J394K308k007j751l250k724L399
9542A9882K707K029K617J028m312o436k794L888J555q7L490K477L093j361j76
9527B7600N87j365M104k964m048j988r445O65Q828j137L691L432m242l195m716
9512A5807J942R14K367R68l725M78l127J425R417L867K53J332p49O023J0646N6
$$ plain form
9496 47894 45843 42310 36422 30928 35212 34114 20834 23034 29538 28839 28675 28637 31919 33768 30451
9481 30451 28910 34548 34019 30836 27122 26410 32801 37709 35205 28824 29408 27989 27893 26715 17662 16480
9465 16480 18617 20373 22244 29639 31966 28319 31357 31499 32667 34733 38269 33355 28319 26852 28018
9450 28018 31114 29864 32113 36167 37746 37225 32707 30695 29254 30869 30093 30992 24983 35947 40028
9435 40028 43832 50318 44854 41362 41354 42294 41133 39525 39872 36894 33998 33076 31665 44457 46203 39770
9419 39770 43197 45094 48411 49143 42759 39969 34680 32674 32458 35842 36148 36002 35551 40609 39892 39058
9403 39058 39071 34434 37236 43238 45312 51339 51778 52068 54867 53155 57119 58182 55326 51260 47039 45076
9387 45076 45332 38975 44167 46968 48061 48589 47829 51723 51561 50462 53038 51351 49944 52194 55340 55104
$$ packed form
9496D7894k051l533n888n494M284j098j3280K200O504o99j64l8L282J849l317
9481C0451j541N638n29l183l714p12O391M908k504o381N84j419r6j178r053j182
9465A6480K137J756J871P395K327l647L038J42J168K066L536m914n036j467J166
9450B8018L096j250K249M054J579n21m518k012j441J615p76Q99o009J0964M081
9435D0028L804O486n464l492qR40j161j608L47k978k896r22j411J2792J746o433
9419C9770L427J897L317P32o384k790n289k006k16L384L06j46m51N058p17q34
9403C9058J3m637K802O002K074O027M39K90K799j712L964J063k856m066m221j963
9387D5076K56o357N192K801J093N28p60L894j62j099K576j687j407K250L146k36
$$ plain form
9371 55104 59226 56280 57721 53827 46693 48176 46485 53334 53162 58118 56250 58571 56608 56650 55231
9356 55231 57975 56964 60944 63474 62456 61086 61702 69871 74018 73758 70420 67083 69430 63342 59769
9341 59769 54752 61546 65498 68148 63768 61622 62719 60847 56962 69231 79040 83214 88083 82677
9327 82677 74779 71797 78511 78730 77039 81132 82748 88900 94385 95426 92300 89714 87752 90963 92751
9312 92751 98560 100466 100958 103207 107935 118978 115954 120042 127533 124134 121839 127483 130570 130381 132895
9297 132895 131479 136076 145618 153607 150926 147824 149446 150563 150999 159143 171424 177450 183119 185901
9283 185901 184897 184814 187224 184988 188472 200193 202337 210836 218251 226693 235112 249022 256441 266362
9269 266362 272637 277323 286337 289966 298766 314406 323361 334249 345873 356148 370745 381576 384410
$$ packed form
9371E5104M122k946J441l894p134J483j691O849j72M956j868K321j963M2j419
9356E5231K744j011L980K530j018j370O16Q169M147k60l338l337K347o088l573
9341E9769n017O794L952K650m380k146J097j872l885J2269R809M174M869n406
9327H2677p898k982O714K19j691M093J616O152N485J041l126k586j962L211J788
9312I2751N809J906M92K249M728J1043l024M088P491l399k295N644L087j89K514
9297A32895j416M597R542P989k681l102J622J117M36Q144J2281O026N669K782
9283A85901j004q3K410k236L484J1721K144Q499P415Q442Q419J3910P419R921
9269B66362O275M686R014L629Q800J5640Q955J0888J1624J0275J4597J0831K834
$$ plain form
9256 384410 390878 408536 420124 434741 444902 455274 470827 483205 491748 501555 510073 513520 521112
9243 521112 530375 536136 536389 535267 533259 526129 518174 508498 504533 491323 484065 478295 466834 457285
9229 457285 446317 433402 423817 410007 407003 405696 392850 381627 374598 371671 366370 357027 349615
9216 349615 334664 314708 305094 299036 284092 273202 260420 256796 262785 259217 256239 249954 245570
9203 245570 235010 221315 209841 205375 205483 205665 203679 200983 208831 210760 206384 208307 209623 205186
9189 205186 211513 212822 206541 195376 189626 188306 180380 169444 157388 146551 135050 118935 110796
9176 110796 115615 123443 129094 137596 136535 140712 144498 147734 151086 151701 145556 139762 134032 129840 127258
9161 127258 127117 125616 127546 121381 117865 118082 128930 139092 140662 143823 149889 155573 155509 149483 148757
$$ packed form
9256C84410O468J7658J1588J4617J0161J0372J5553J2378Q543R807Q518L447P592
9243E21112R263N761K53j122k008p130p955r676l965j3210p258n770j1461r549
9229D57285j0968j2915r585j3810l004j307j2846j1223p029k927n301r343p412
9216C49615j4951j9956r614o058j4944j0890j2782l624N989l568k978o285m384
9203B45570j0560j3695j1474m466J08J82j986k696P848J929m376J923J316m437
9189B05186O327J309o281j1165n750j320p926j0936j2056j0837j1501j6115q139
9176A10796M819P828N651Q502j061M177L786L236L352O15o145n794n730m192k582
9161A27258j41j501J930o165l516K17J0848J0162J570L161O066N684o4o026p26
$$ plain form
9146 148757 145088 142987 148494 146803 139940 141363 144750 146466 143485 140488 144202 149714 157238 159485
9132 159485 154390 152809 159828 173436 186631 200158 217383 235053 259182 279724 302851 332590
9120 332590 373628 427971 492399 572158 673829 811878 977980 1178895 1406666 1641978
9110 1641978 1875300 2071358 2196727 2222952 2161782 2018142 1813695 1587980 1361747 1150260
9100 1150260 957546 801973 689470 601139 529268 472803 428881 392316 367758 341561 316511
9089 316511 292509 271511 247810 239093 225952 208937 194471 189688 186237 177158 173376 169508 162354
9076 162354 154228 145416 148775 151242 147636 137587 137455 138259 140549 140651 136878 133926 135295 136063 137779
9061 137779 132985 127560 130704 127122 126253 123438 127255 134253 139851 147874 150699 148985 155827 160152 166869
$$ packed form
9146A48757l669k101N507j691o863J423L387J716k981k997L714N512P524K247
9132A59485n095j581P019J3608J3195J3527J7225J7670K4129K0542K3127K9739
9120C32590M1038N4343O4428P9759J01671J38049J66102K00915K27771K35312
9110A641978K33322J96058J25369K6225o1170j43640k04447k25715k26233k11487
9100A150260j92714j55573j12503q8331p1871n6465m3922l6565k4558k6197k5050
9089C16511k4002k0998k3701q717j3141j7015j4466m783l451r079l782l868p154
9076A62354q126q812L359K467l606j0049j32Q04K290J02l773k952J369P68J716
9061A37779m794n425L144l582q69k815L817O998N598Q023K825j714O842M325O717
$$ plain form
9046 166869 168105 170214 170557 171560 167709 167377 162781 162355 158443 152785 152020 151527 144528 135098 133852 131873
9030 131873 129520 133473 142581 143244 146994 148405 141964 137734 133112 129109 127944 129590 116734 100342
9016 100342 78421 39496 -5603 -44753 -63523 -54600 -34412 -8183 20214 38879 51993 59148
9004 59148 69028 88776 95801 100835 103748 103960 98400 97758 111258 109684 109533 110912 113756 122762 128017
8989 128017 128968 129815 136891 140758 140192 141749 141626 140664 147142 156321 161105 168158 175089 180319 193631
8974 193631 215431 225187 239549 254429 272850 302115 333306 369069 425673 489290 535822 540228
8962 540228 502057 446685 389172 328268 282267 252572 228571 209558 195180 191380 192562 195705
8950 195705 192206 181406 170116 163678 162570 159108 153553 150892 148841 146748 148315 154469 162708 163716
$$ packed form
9046A66869J236K109L43J003l851l32m596m26l912n658p65m93o999r430j246j979
9030A31873k353L953R108O63L750J411o441m230m622m003j165J646j2856j6392
9016A00342k1921l8925m5099l9150j8770Q923K0188K6229K8397J8665J3114P155
9004E9148R880J9748P025N034K913K12n560o42J3500j574j51J379K844R006N255
8989A28017R51Q47P076L867n66J557j23r62O478R179M784P053O931N230J3312
8974A93631K1800R756J4362J4880J8421K9265L1191L5763N6604O3617M6532M406
8962E40228l8171n5372n7513o0904m6001k9695k4001j9013j4378l800J182L143
8950A95705l499j0800j1290o438j108l462n555k661k051k093J567O154Q239J008
$$ plain form
8936 163716 162426 163965 153695 143291 137308 127466 119103 115642 119911 125056 141476 157821 169503
8923 169503 183807 199897 216654 235639 244042 249626 260402 262094 256395 252851 245818 240931 242771
8910 242771 243529 252562 257562 264670 283204 302390 312300 322989 332763 348310 355776 356135 359485 363825
8896 363825 363501 363806 366133 371262 378859 388537 395562 401683 406797 413834 417745 421860 421868 418567 426510 439230
8880 439230 450845 455746 463196 466420 463863 454377 453034 463033 466453 470412 473599 474490 476642 474132
8866 474132 482253 501452 510646 508341 508131 501444 498183 496125 496618 495022 501981 504715 519458 530156
8852 530156 534598 541023 546432 552481 560553 574860 585411 599305 616685 638240 654193 673230 704907
8839 704907 735570 752445 768416 772902 758623 745880 739278 730040 715095 701527 704656 717853
$$ packed form
8936A63716j290J539j0270j0404n983r842q363l461M269N145J6420J6345J1682
8923A69503J4304J6090J6757J8985Q403N584J0776J692n699l544p033m887J840
8910B42771P58R033N000P108J8534J9186R910J0689R774J5547P466L59L350M340
8896C63825l24L05K327N129P597R678P025O121N114P037L911M115Ql301P943J2720
8880D39230J1615M901P450L224k557r486j343R999L420L959L187Q91K152k510
8866D74132Q121J9199R194k305k10o687l261k058M93j596O959K734J4743J0698
8852E30156M442O425N409O049Q072J4307J0551J3894J7380K1555J5953J9037L1677
8839G04907L0663J6875J5971M486j4279j2743o602r238j4945j3568L129J3197
$$ plain form
8827 717853 728814 741373 754002 765661 775285 784763 795488 815093 835107 853078 879445 912131
8815 912131 945629 982903 1018897 1053872 1092303 1135128 1180441 1240672 1305591 1363034 1421348 1481632
8803 1481632 1546896 1623055 1695661 1791976 1926509 2118772 2404661 2823091 3430876 4299022
8793 4299022 5482255 6890338 8042629 8212694 7434943 6308603 5202189 4297332 3658509
8784 3658509 3241815 2965190 2787090 2678144 2614160 2572978 2555020 2532400 2515131 2505112 2502407
8773 2502407 2508841 2534792 2577542 2627118 2697043 2786427 2902807 3056819 3270796 3549066 3900931
8762 3900931 4350379 4878504 5310442 5385417 5212159 5006748 4817777 4675563 4621778 4654932
8752 4654932 4752582 4888099 5032001 5184718 5349609 5529612 5723241 5949057 6230931 6563263
$$ packed form
8827G17853J0961J2559J2629J1659R624R478J0725J9605K0014J7971K6367L2686
8815I12131L3498L7274L5994L4975L8431M2825M5313O0231O4919N7443N8314O0284
8803A481632O5264P6159P2606R6315J34533J92263K85889M18430O07785Q68146
8793D299022J183233J408083J152291J70065p77751j126340j106414r04857o38823
8784C658509m16694k76625j78100j08946o3984m1182j7958k2620j7269j0019k705
8773B502407O434K5951M2750M9576O9925Q9384J16380J54012K13977K78270L51865
8762C900931M49448N28125M31938P4975j73258k05411j88971j42214n3785L3154
8752D654932R7650J35517J43902J52717J64891J80003J93629K25816K81874L32332
$$ plain form
8742 6563263 6936713 7358944 7836442 8355646 8951977 9634420 10386873 11215419 12119972 13112202
8732 13112202 14232448 15543226 17123111 19021844 21278869 23983460 27237631 31164425
8724 31164425 35862344 41306612 47409910 54347027 62719501 73735768 89179100 111346777
8716 111346777 143265869 188844676 252409227 336603635 436735495 527904739 563181674
8709 563181674 524434591 445097360 355986573 273425902 207872268 160927612 128477860
8702 128477860 105845978 89554782 77278067 67471116 59291386 52358429 46314638 40827548
8694 40827548 35828634 31386116 27543733 24299836 21572031 19253057 17288387 15616801
8686 15616801 14190695 12972333 11925729 11032978 10246147 9537787 8898470 8324219 7813011
$$ packed form
8742F563263L73450M22231M77498N19204N96331O82443P52453Q28546R04553R92230
8732A3112202J120246J310778J579885J898733K257025K704591L254171L926794
8724C1164425M697919N444268O103298O937117Q372474J1016267J5443332K2167677
8716A11346777L1919092M5578807O3564551Q4194408J00131860R1169244L5276935
8709E63181674l8747083p9337231q9110787q2560671o5553634m6944656l2449752
8702A28477860k2631882j6291196j2276715r806951q179730o932957o043791n487090
8694D0827548m998914m442518l842383l243897k727805k318974j964670j671586
8686A5616801j426106j218362j046604q92751p86831p08360o39317n74251n11208
$$ plain form
8677 7813011 7348259 6925527 6529597 6137456 5756607 5404244 5091966 4815542 4571863 4350096
8667 4350096 4139982 3945762 3754990 3580611 3417654 3259783 3115266 2975839 2855151 2749057
8657 2749057 2665034 2589663 2528206 2473903 2413807 2358594 2293492 2225827 2158412 2089464 2019168
8646 2019168 1953813 1882942 1818431 1763570 1729780 1706284 1685247 1660581 1640815 1620807 1604690
8635 1604690 1602317 1615440 1649671 1712967 1814119 1937761 2080697 2264808 2513901 2780291
8625 2780291 2842955 2617855 2309322 2007106 1754396 1568435 1433006 1331618 1268881 1228370
8615 1228370 1206849 1207646 1244049 1322766 1392058 1373623 1292639 1205116 1128554 1063743 1021823 987239
8603 987239 962789 943762 925242 907125 888111 877829 874783 865868 869511 879005 888698 905731 930537
$$ packed form
8677G813011m64752m22732l95930l92141l80849l52363l12278k76424k43679k21767
8667D350096k10114j94220j90772j74379j62957j57871j44517j39427j20688j06094
8657B749057q4023p5371o1457n4303o0096n5213o5102o7665o7415o8948p0296
8646B019168o5355p0871o4511n4861l3790k3496k1037k4666j9766k0008j6117
8635A604690k373J3123L4231O3296J01152J23642J42936J84111K49093K66390
8625B780291O2664k25100l08533l02216k52710j85961j35429j01388o2737m0511
8615A228370k1521P97L6403P8717O9292j8435q0984q7523p6562o4811m1920l4584
8603I87239k4450j9027j8520j8117j9014j0282l046q915L643R494R693J7033K4806
$$ plain form
8590 930537 970561 1042707 1157180 1329057 1555306 1759000 1899106 1880048 1676929 1418937
8580 1418937 1188291 1014659 898368 814206 751698 713547 684679 653026 626421 604338 583497
8569 583497 553707 537626 528096 517730 513497 510240 516530 517554 506733 476175 444129 423903 399804
8556 399804 379597 369296 363466 364143 366714 366695 361737 354019 349547 350926 359632 369445 392476 430324
8542 430324 475483 497871 485911 445055 399574 361422 321863 294952 276673 257121 240812 232964
8530 232964 231982 228657 231308 239494 241548 246075 243139 236093 225172 212937 206585 200882 218390 243234
8516 243234 245746 243020 251997 260835 265754 266146 265408 268335 275256 270594 260198 247780 238597 230269
8502 230269 230121 236732 246263 248162 256450 270459 277855 283065 280363 283727 299901 312030 323069 314902
$$ packed form
8590I30537M0024P2146J14473J71877K26249K03694J40106j9058k03119k57992
8580A418937k30646j73632j16291q4162o2508l8151k8868l1653k6605k2083k0841
8569E83497k9790j6081r530j0366m233l257O290J024j0821l0558l2046k0226k4099
8556C99804k0207j0301n830O77K571j9m958p718m472J379Q706R813K3031L7848
8542D30324M5159K2388j1960m0856m5481l8152l9559k6911j8279j9552j6309p848
8530B32964r82l325K651Q186K054M527k936p046j0921j2235o352n703J7508K4844
8516B43234K512k726Q977Q838M919L92p38K927O921m662j0396j2418r183q328
8502B30269j48O611R531J899Q288J4009P396N210k702L364J6174J2129J1039q167
$$ plain form
8488 314902 298811 285930 277346 266507 249125 242853 245209 244241 248343 242854 236473 233337 232567 231010
8474 231010 228563 229010 228778 223420 214940 206303 204734 203152 203673 204775 206408 206894 204108 201686 203608
8459 203608 206067 212424 215267 205920 197361 185966 176357 159736 147264 145866 151257 158036 158355 152961
8445 152961 150263 154524 168000 179401 174183 165652 166530 173857 173007 167507 156409 152783 153315 153126 154156
8430 154156 163894 170591 174023 179886 181342 181136 175802 172282 171758 173431 172833 167380 169719 180343 189693
8415 189693 189568 199178 211790 233891 259700 284889 307191 317926 304737 260857 218977 189108
8403 189108 160750 148544 134619 121944 116066 113054 110129 109374 112706 120174 127380 124593 118921 120298
8389 120298 115952 116101 116615 115133 108453 104393 103004 96347 93323 93378 84353 78116 79658 73598 71682
$$ packed form
8488C14902j6091j2881q584j0839j7382o272K356r68M102n489o381l136p70j557
8474B31010k447M47k32n358q480q637j569j582N21J102J633M86k786k422J922
8459B03608K459O357K843r347q559j1395r609j6621j2472j398N391O779L19n394
8445A52961k698M261J3476J1401n218q531Q78P327q50n500j1098l626N32j89J030
8430A54156R738O697L432N863J456k06n334l520n24J673n98n453K339J0624R350
8415A89693j25R610J2612K2101K5809K5189K2302J0735j3189m3880m1880k9869
8403A89108k8358j2206j3925j2675n878l012k925p55L332P468P206k787n672J377
8389A20298m346J49N14j482o680m060j389o657l024N5r025o237J542o060j916
$$ plain form
8374 71682 71174 59418 54469 64026 74194 80119 85139 88705 97184 98321 101907 107382 117338 116932 108143
8359 108143 100543 98140 99819 103047 104724 96355 96812 101210 108054 108997 108953 107615 106449 98007 91240
8344 91240 87072 88312 97444 101255 103987 112388 119590 119355 115952 118325 124709 127919 128853 126554 121629
8329 121629 128174 142788 159272 175783 191527 215395 242235 266057 294548 334330 385423 448899
8317 448899 521866 611365 739665 897424 1085606 1306660 1555320 1800644 2006226 2145994
8307 2145994 2199057 2167684 2048361 1856090 1626706 1394021 1177310 978558 811185 681823
8297 681823 587483 515988 450459 389365 345218 310644 284538 265006 241445 216213 190581 175165
8285 175165 165570 151537 135751 129637 124543 123845 107751 103214 102107 102746 106245 101456 91271 80173
$$ packed form
8374G1682n08j1756m949R557J0168N925N020L566Q479J137L586N475R956m06q789
8359A08143p600k403J679L228J677q369M57M398O844R43m4j338j166q442o767
8344I1240m168J240R132L811K732Q401P202k35l403K373O384L210R34k299m925
8329A21629O545J4614J6484J6511J5744K3868K6840K3822K8491L9782N1093O3476
8317D48899P2967Q9499J28300J57759J88182K21054K48660K45324K05582J39768
8307B145994N3063l1373j19323j92271k29384k32685k16711j98752j67373j29362
8297F81823r4340p1495o5529o1094m4147l4574k6106j9532k3561k5232k5632j5416
8285A75165r595j4033j5786o114n094o98j6094m537j107O39L499m789j0185j1098
$$ plain form
8271 80173 72791 66067 69863 78139 82261 82226 83714 82735 82265 79047 80191 85178 91408 84971 71224
8256 71224 69241 68201 62534 57673 56070 52719 46987 56288 64214 75514 86756 101994 110392 105714
8242 105714 90178 78582 73947 65800 58486 56497 55168 55697 50847 44559 44321 52654 49844 41421
8228 41421 39932 41442 43413 49989 56612 57878 60717 56380 53970 52747 41840 36487 38616 35179
8214 35179 38819 46183 44315 47268 51714 52163 49000 46811 44690 46318 46867 48025 48717 38339 38161
8199 38161 43488 47926 47466 44607 36357 26847 31635 41637 46033 53756 53817 55586 54904 54212 52028 50951
8183 50951 50638 47547 41701 39615 39258 39734 34590 32454 32036 31641 31082 32072 30501 32961 34822 30971
8167 30971 32107 38487 44420 45007 41844 41902 40259 42666 41387 33256 28364 30041 33229 33917 33125 34639
$$ packed form
8271H0173p382o724L796Q276M122l5J488r79m70l218J144M987O230o437j3747
8256G1224j983j040n667m861j603l351n732R301P926J1300J1242J5238Q398m678
8242A05714j5536j1596m635q147p314j989j329N29m850o288k38Q333k810q423
8228D1421j489J510J971O576O623J266K839m337k410j223j0907n353K129l437
8214C5179L640P364j868K953M446M49l163k189k121J628N49J158O92j0378j78
8199C8161N327M438m60k859q250r510M788J0002M396P723O1J769o82o92k184j077
8183E0951l13l091n846k086l57M76n144k136m18l95n59R90j571K460J861l851
8167C0971J136O380N933N87l163N8j643K407j279q131m892J677L188O88p92J514
$$ plain form
8151 34639 37865 33064 25231 20192 18954 26638 32086 23046 22293 26967 28457 27887 31151 29610 23156
8136 23156 21137 21399 20276 19786 19711 18791 20835 13790 16136 19359 24628 29667 26657 27311 35901 32953
8120 32953 25136 24078 28540 26370 25352 28453 26638 20869 19235 26799 27702 29879 23877 23020 27397
8105 27397 28172 27867 25783 24595 23244 26018 31656 37981 34428 30560 31341 29433 30174 34950 42037 43693
8089 43693 39692 36819 34882 34497 33832 34460 32448 32589 33621 36554 42207 43628 32694 29985 36309
8074 36309 33508 33551 42222 44610 33027 28593 32339 35573 28995 24970 27485 28799 38884 40004 35659
8059 35659 31129 33132 31319 25818 29049 34636 37996 39199 38600 43568 45626 44020 38822 29159 24983
8044 24983 26136 30178 29108 22847 17040 24358 32639 37248 37076 38474 31287 26518 20411 24479 25764
$$ packed form
8151C4639L226m801p833n039j238P684N448r040p53M674J490n70L264j541o454
8136B3156k019K62j123m90p5r20K044p045K346L223N269N039l010O54Q590k948
8120C2953p817j058M462k170j018L101j815n769j634P564R03K177o002q57M377
8105B7397P75l05k084j188j351K774N638O325l553l868P81j908P41M776P087J656
8089D3693m001k873j937l85o65O28k012J41J032K933N653J421j0934k709O324
8074C6309k801M3Q671K388j1583m434L746L234o578m025K515J314J0085J120m345
8059C5659m530K003j813n501L231N587L360J203n99M968K058j606n198r663m176
8044B4983J153M042j070o261n807P318Q281M609j72J398p187m769o107M068J285
$$ plain form
8029 25764 24915 26641 19063 17975 24066 26743 36924 37137 24145 19886 22216 23383 23968 21089 18068
8014 18068 19496 20181 19854 24970 26872 26098 18141 9708 12304 17351 22315 26398 25550 25893 28036 21752
7998 21752 16802 15189 11634 18819 26551 24317 19706 22041 24423 20356 17864 22923 18599 10359 17218
7983 17218 21921 31782 33280 25969 20719 21954 24273 28103 30490 24536 21958 24652 22224 17957 23077
7968 23077 22861 28748 38291 41668 42418 42010 38802 32160 24227 20442 18024 19609 23643 23272 22274 28485
7952 28485 29992 25807 27589 27154 32708 27868 19271 18579 24958 22158 20836 20647 19816 19255 14923 15409
7936 15409 18578 21183 17286 15943 21683 22074 22679 20538 23843 23433 26030 28384 28275 26622 24684 20818
7920 20818 18604 14211 13321 18981 21574 20357 19322 17600 20678 23956 21144 20272 21976 23091 26775
$$ packed form
8029B5764q49J726p578j088O091K677J0181K13j2992m259K330J167N85k879l021
8014A8068J428O85l27N116J902p74p957q433K596N047M964M083q48L43K143o284
7998B1752m950j613l555P185P732k234m611K335K382m067k492N059m324q240O859
7983A7218M703R861J498p311n250J235K319L830K387n954k578K694k428m267N120
7968B3077k16N887R543L377P50m08l208o642p933l785k418J585M034l71r98O211
7952B8485J507m185J782m35N554m840q597o92O379k800j322j89q31n61m332M86
7936A5409L169K605l897j343N740L91O05k141L305m10K597K354j09j653j938l866
7920B0818k214m393q90N660K593j217j035j722L078L278k812q72J704J115L684
$$ plain form
7905 26775 24961 16973 18026 16369 17871 20916 17765 17311 10542 10267 11284 16982 16273 17974 16666
7890 16666 16426 12496 15360 14377 14021 15882 24795 25731 22749 25982 18604 18908 24748 13437 14799 10887
7874 10887 8153 8900 15196 25399 31087 25314 18313 20006 14706 16145 20444 20643 13125 10831 9676
7859 9676 11164 17128 18824 16821 18554 13280 11739 16162 14776 12733 17221 20517 17684 8510 2456
7844 2456 -1073 4421 13269 13134 9705 14404 15381 9192 2450 -2468 -3401 827 6064 7152 3136 1734
7828 1734 -2184 -1380 -2474 1922 8689 4336 -820 273 6085 5910 4213 9075 5557 1804 1874 -1800
7812 -1800 -3709 1677 8904 13798 14633 19028 18322 14521 21989 24324 26722 24875 24668 18637 14030 11964
7796 11964 11579 6789 4678 6996 12559 10954 4470 999 4537 7458 9453 14232 15295 12466 10253
$$ packed form
7905B6775j814p988J053j657J502L045l151m54o769k75J017N698p09J701j308
7890A6666k40l930K864r83l56J861Q913R36k982L233p378L04N840j1311J362l912
7874A0887k734P47O296J0203N688n773p001J693n300J439M299J99p518k294j155
7859I676J488N964J696k003J733n274j541M423j386k043M488L296k833r174o054
7844B456l529N494Q848j35l429M699R77o189o742m918r33M228N237J088m016j402
7828A734l918Q04j094M396O767m353n156J093N812j75j697M862l518l753P0l674
7812a800j909N386P227M894Q35M395p06l801P468K335K398j847k07o031m607k066
7796A1964l85m790k111K318N563j605o484l471L538K921J995M779J063k829k213
$$ plain form
7781 10253 7626 7411 6198 3138 4047 4801 3381 96 -1669 3475 12537 12242 10698 8612 9112 17402
7765 17402 17490 12510 7147 9906 8030 10492 13983 16471 21008 21336 20669 11907 11418 14303 15212 6715
7749 6715 5549 3176 2738 1527 -552 -5579 -2222 7109 13855 17466 12291 10059 14620 14205 13708 15889
7733 15889 19537 21048 10734 9014 9863 4670 6054 1222 -1024 6264 11787 4706 -4210 -5184 -6339
7718 -6339 -1477 3758 2438 4958 9045 5972 3816 4356 -353 5975 15586 16914 11780 11450 6745
7703 6745 2746 10800 16706 17550 19807 18025 17616 14765 13988 13315 11498 8931 7767 7753 9871 9265 2890
7686 2890 3444 6391 7895 10407 10388 8988 4255 9453 7297 6885 9443 9956 7067 459 29 3107
7670 3107 6493 3013 -3502 -6185 -2794 3330 -577 -2241 -2463 -758 2081 7725 8223 10418 6346
$$ packed form
7781A0253k627k15j213l060R09P54j420l285j765N144R062k95j544k086N00Q290
7765A7402Q8m980n363K759j876K462L491K488M537L28o67q762m89K885R09q497
7749F715j166k373m38j211k079n027L357R331O746L611n175k232M561m15m97K181
7733A5889L648J511j0314j720Q49n193J384m832k246P288N523p081q916r74j155
7718f339M862N235j320K520M087l073k156N40m709O328R611J328n134l30m705
7703F745l999Q054N906Q44K257j782m09k851p77o73j817k567j164j4K118o06o375
7686B890N54K947J504K512j9j400m733N198k156m12K558N13k889o608m30L078
7670C107L386l480o515k683L391O124l907j664k22J705K839N644M98K195m072
$$ plain form
7655 6346 8605 15251 17040 16207 12188 12468 6384 4295 5928 -3626 -8232 -5183 -1677 -642 3959
7640 3959 9384 7850 5807 841 -3611 1707 7028 6623 -5551 -8645 -13061 -10679 2849 4993 3456
7625 3456 3873 3329 6470 4913 -124 -460 3888 3559 -3437 -3456 3558 6797 -1135 -5110 -2196 -2731 -1852
7608 -1852 -3791 839 5142 5211 5026 10584 8774 7631 2568 -4414 -5600 3883 1634 1133 3806 4868
7592 4868 7246 2349 2383 6957 1743 1825 -47 -2347 -3370 -3398 -4886 -10592 -7912 -3507 2606 4047
7576 4047 -1054 -2139 1191 1692 2991 901 2924 4454 3833 1674 1713 1920 1042 358 4085 7463 4384
7559 4384 5637 12148 6925 7740 9905 7551 4255 1400 -1862 -1176 6349 12229 12819 12636 12304 2683
7543 2683 -624 -327 -5389 -6967 -6748 -15855 -5170 1268 5804 8172 11360 12204 5801 -1485 -7234
$$ packed form
7655F346K259O646J789q33m019K80o084k089J633r554m606L049L506J035M601
7640C959N425j534k043m966m452N318N321m05j2174l094m416K382J3528K144j537
7625C456M17n44L141j557n037l36M348l29o996j9P014L239p932l975K914n35Q79
7608a852j939M630M303O9j85N558j810j143n063o982j186R483k249n01K673J062
7592D868K378m897L4M574n214Q2j872k300j023k8j488n706K680M405O113J441
7576D047n101j085L330N01J299k090K023J530o21k159L9K07q78o84L727L378l079
7559D384J253O511n223Q15K165k354l296k855l262O86P525N880N90j83l32r621
7543B683l307K97n062j578K19r107J0685O438M536K368L188Q44o403p286n749
$$ plain form
7528 -7234 -14797 -11767 -4477 -5155 -6140 -1874 -79 1579 7333 6565 4584 3829 4265 11014 6509 -193
7512 -193 -2772 4182 16609 14275 7208 9806 14055 7680 1917 -3845 -4105 -2709 907 -155 1116
7497 1116 918 2896 1335 -151 1755 -2157 -5574 -2632 -956 -4542 -4395 -1645 -2366 -10415 -15288 -11606
7481 -11606 -5136 -1793 -4631 2396 9127 8252 -163 1381 -1165 -973 421 4067 2800 2519 329
7466 329 -93 3275 3654 282 -621 2334 754 -1669 -7240 -5701 -2430 -1325 -4102 -4655 -8185 -4935
7450 -4935 -181 3073 -1568 -3723 -5185 -4654 -2361 -306 1585 3866 6672 4764 2034 3792 2921
7435 2921 -969 4960 13593 10924 6572 7100 515 -3759 -4716 -7921 -1438 -253 -2374 -4857 -9265
7420 -9265 -10768 -5131 2569 7482 1229 2286 5446 7656 11491 13233 7490 3289 -1400 -1002 -4913
$$ packed form
7528g234p563L030P290o78r85M266J795J658N754p68j981p55M36O749m505o702
7512a93k579O954J2427k334p067K598M249o375n763n762k60J396L616j062J271
7497A116j98J978j561j486J906l912l417K942J676l586J47K750p21q049m873L682
7481a1606O470L343k838P027O731q75q415J544k546J92J394L646j267k81k190
7466C29m22L368L79l372r03K955j580k423n571J539L271J105k777n53l530L250
7450d935M754L254m641k155j462N31K293K055J891K281K806j908k730J758q71
7435B921l890N929Q633k669m352N28o585m274r57l205O483J185k121k483m408
7420i265j503N637P700M913o253J057L160K210L835J742n743m201m689L98l911
$$ plain form
7405 -4913 -4800 -3475 5345 6645 5387 13803 15407 11668 7871 -702 5074 7488 5614 1666 -204
7390 -204 -2100 -3005 -706 5143 5518 8773 9964 12214 13391 8220 5175 4678 6787 10981 11585 9028
7374 9028 9173 8362 12538 12667 15320 11368 1911 -7683 -13601 -5228 2341 10160 5009 -3915 -5777 -1159
7358 -1159 286 -623 1056 905 923 -1222 -3353 -3019 4939 6637 5428 -328 -3093 -5273 -2305 -138
7342 -138 5760 10664 3381 1712 -6253 -14220 -6832 -2202 3117 240 -2241 -3989 -4569 2555 7595
7327 7595 11105 9914 6251 2781 8936 7652 5284 -1801 -4281 1383 -4438 -9380 -11838 -9317 881
7312 881 5426 -4953 -14068 -6839 -855 -3867 -6679 -4229 6231 6404 1560 1971 3211 8756 12400
7297 12400 10254 6456 7766 6333 3577 1597 1774 5720 3409 3258 5374 92 -896 -5657 3618
$$ packed form
7405d913J13J325Q820J300j258Q416J604l739l797q573N776K414j874l948j870
7390b04j896r05K299N849L75L255J191K250J177n171l045m97K109M194O04k557
7374I028J45q11M176J29K653l952r457r594n918Q373P569P819n151q924j862M618
7358a159J445r09J679j51J8k145k131L34P958J698j209n756k765k180K968K167
7342a38N898M904p283j669p965p967P388M630N319k877k481j748n80P124N040
7327G595L510j191l663l470O155j284k368p085k480N664n821m942k458K521J0198
7312H81M545j0379r115P229N984l012k812K450J0460J73m844M11J240N545L644
7297A2400k146l798J310j433k756j980J77L946k311j51K116n282r88m761R275
$$ plain form
7282 3618 7551 9459 9726 10405 3603 1953 317 2612 8128 -497 134 1857 -2830 -4824 -2071 2150
7266 2150 7470 12951 13422 6511 -2142 -4761 -2124 4867 1225 4241 2444 559 2580 3545 -661
7251 -661 -9604 -12210 -3554 930 4825 6828 5744 -1806 30 -1414 224 1358 5799 10832 7490
7236 7490 78 -135 -950 -920 -1143 -574 -4141 -6704 -7207 -12166 -13131 -6646 -2112 2787 1436 -2934 -7598
7219 -7598 -10595 -10081 -7770 4037 10812 6715 5571 5954 6111 3262 9600 8202 -1513 -4456 -2304
7204 -2304 7141 15597 14196 7484 2310 3089 3790 4902 7568 10541 7646 -1758 -8878 -7678 -13545
7189 -13545 -5942 3001 4077 7971 4752 15414 14939 8068 3424 -1951 -8358 -7790 -8480 -8845 -6781
7174 -6781 3178 -136 -5141 -1964 3651 7277 6780 6067 1757 -3848 -7837 -7219 -7953 -10226 -9465 -10825
$$ packed form
7282C618L933J908K67O79o802j650j636K295N516q625O31J723m687j994K753M221
7266B150N320N481M71o911q653k619K637O991l642L016j797j885K021R65m206
7251f61q943k606Q656M484L895K003j084p550J836j444J638J134M441N033l342
7236G490p412k13q15L0k23N69l567k563n03m959r65O485M534M899j351m370m664
7219g598k997N14K311J1807O775m097j144L83J57k849O338j398r715k943K152
7204b304R445Q456j401o712n174P79P01J112K666K973k895r404p120J200n867
7189a3545P603Q943J076L894l219J0662m75o871m644n375o407N68o90l65K064
7174f781R959l314n005L177N615L626m97p13m310n605l989O18p34k273P61j360
$$ plain form
7158 -10825 -11244 -3873 281 6415 11623 6162 1686 3266 3686 -5008 953 6926 9934 8949 8471 9587
7142 9587 11337 7181 3701 4722 1314 -1927 -7069 -9286 -6114 3809 6716 2906 -850 -4424 -5383
7127 -5383 -8881 -7215 224 4253 -311 8372 9918 4065 4136 6484 8132 11302 8463 6813 -1321
7112 -1321 -10260 -9661 -6735 -3058 -403 4151 6871 2977 9098 8100 -1326 -8799 -8693 -7720 -8944 -10718
7096 -10718 -5147 171 -1019 -9642 -11753 -5783 -3303 -1905 -4870 -1473 -1049 3644 9474 10289 7285
7081 7285 12483 10549 2310 -6920 -10674 -4728 -4576 -8432 -2650 -62 1618 -1289 -2381 -1351 -6217
7066 -6217 -9964 -10988 -7961 -117 3495 2075 4904 10652 3064 -7708 -13497 -17193 -11712 -7166 -9768
7051 -9768 -7655 -8435 -6179 -3855 -4628 -8126 -11626 -15731 -11708 -8247 -9652 -11821 -5900 -3902 -6866
$$ packed form
7158a0825m19P371M154O134N208n461m476J580M20q694N961N973L008r85m78J116
7142I587J750m156l480J021l408l241n142k217L172R923K907l810l756l574r59
7127e383l498J666P439M029m564Q683J546n853P1K348J648L170k839j650q134
7112a321q939N99K926L677K655M554K720l894O121r98r426p473J06R73j224j774
7096a0718N571N318j190q623k111N970K480J398k965L397M24M693N830Q15l004
7081G285N198j934q239r230l754N946J52l856N782K588J680k907j092J030m866
7066f217l747j024L027P844L612j420K829N748p588j0772n789l696N481M546k602
7051i768K113p80K256K324p73l498l500m105M023L461j405k169N921J998k964
$$ plain form
7036 -6866 -8970 -3313 1321 671 -6958 -9768 -4250 -2357 -6800 -12102 -10350 -12794 -14217 -8725 -7621
7021 -7621 -1877 -653 -2606 -820 -4091 -2072 152 -234 2501 4890 1044 -277 -2651 -4926 -4163
7006 -4163 205 2788 -3807 -4725 -7590 -5326 -5106 -3439 1223 2315 -1044 -5661 -5334 -2941 4627 8462
6990 8462 8365 6174 -2137 -3281 -2726 -3496 -1576 -4222 -6867 -7072 -6473 -984 2965 2436 -1420 -3108 1988
6973 1988 253 -8378 -15713 -9662 -3254 -652 -324 5327 12059 4543 1408 1786 1230 93 -3499 465
6957 465 6860 7415 3786 -1875 -1486 -1561 167 2548 1864 5487 6574 6662 2135 6910 11517 5933 2852
6940 2852 -2368 -12485 -11716 -4741 -6389 -2789 4602 3193 2141 -805 1074 2181 2157 5544 396
6925 396 -5622 -13044 -12795 -9842 -14024 -8146 2475 6936 4222 2416 -2634 -3410 1816 3296 5985
$$ packed form
7036f866k104N657M634o50p629k810N518J893m443n302J752k444j423N492J104
7021g621N744J224j953J786l271K019K224l86K735K389l846j321k374k275P63
7006d163M368K583o595r18k865K264K20J667M662J092l359m617L27K393P568L835
6990H462r7k191q311j144N55p70J920k646k645k05N99N489L949n29l856j688N096
6973A988j735q631p335O051O408K602L28N651O732p516l135L78n56j137l592L964
6957D65O395N55l629n661L89p5J728K381o84L623J087Q8m527M775M607n584l081
6940B852n220j0117P69O975j648L600P391j409j052k946J879J107k4L387n148
6925C96o018p422K49K953m182N878J0621M461k714j806n050p76N226J480K689
$$ plain form
6910 5985 3618 -3210 1630 9673 1767 -6270 -5606 3400 -599 3401 8031 6943 8057 4704 5976
6895 5976 2666 -1296 -999 1804 4642 -558 -1180 4706 8444 10203 2829 -729 6316 3437 3146 1061
6879 1061 2783 5827 7345 10840 9166 2633 -780 423 6050 3539 1453 -2486 1763 6139 10645
6864 10645 9848 2580 -789 -1233 -6405 -6130 1394 3507 5521 5486 363 378 2329 -1401 -5144 -4114
6848 -4114 -775 -1100 -1485 3306 5619 1535 2925 2955 -112 -2008 847 2729 706 3269 4747 4463
6832 4463 -1793 -8427 -10148 -7077 3007 7254 7729 2272 -456 1834 -1615 -6449 -5723 -13301 -13596
6817 -13596 -11469 -13633 -12564 -3185 777 -806 -5912 -8854 -12203 -11956 -12717 -7910 -10213 -11565 -9856
6802 -9856 -6497 -5217 -7224 -6489 -11992 -19427 -15552 -9959 -9095 -6446 3663 5126 4770 6991 1031
$$ packed form
6910E985k367o828M840Q043p906q037O64R006l999M000M630j088J114l353J272
6895E976l310l962K97K803K838n200o22N886L738J759p374l558P045k879k91k085
6879A061J722L044J518L495j674o533l413J203N627k511k086l939M249M376M506
6864A0645p97p268l369m44n172K75P524K113K014l5n123J5J951l730l743J030
6848d114L339l25l85M791K313m084J390L0l067j896K855J882k023K563J478k84
6832D463o256o634j721L071J0084M247M75n457k728K290l449m834P26p578k95
6817a3596K127k164J069R379L962j583n106k942l349K47p61M807k303j352J709
6802i856L359J280k007P35n503p435L875N593Q64K649J0109J463l56K221n960
$$ plain form
6787 1031 -1300 -3322 -5717 -2195 757 6522 15924 18714 14740 12713 13575 9763 9062 9698 15022 20683
6771 20683 25585 27607 24644 29964 32257 30124 36929 38757 30554 28570 27110 27013 34685 46160 48474
6756 48474 48723 56079 64152 77874 99134 135407 184478 251338 344731 480027 648645 790849
6744 790849 810620 690515 537539 395802 281693 202953 151269 115044 92292 74879 59715
6733 59715 52253 42910 38152 34730 33629 36475 38410 36156 28587 28338 32683 33242 32654 32055 26400 19780
6717 19780 13967 10965 8101 9278 11197 10949 12784 9043 15459 18171 15045 11036 8518 6920 9689
6702 9689 6213 4632 6754 7124 9293 10752 8207 3584 5868 12958 13187 8575 10358 12548 6042
6687 6042 -2097 -2828 1524 10301 1853 -5305 -6731 -1706 -3091 -150 1428 -6729 -6993 -3235 1970
$$ packed form
6787A031k331k022k395L522K952N765R402K790l974k027Q62l812p01O36N324N661
6771B0683M902K022k963N320K293k133O805J828q203j984j460r7P672J1475K314
6756D8474K49P356Q073J3722K1260L6273M9071O6860R3393J35296J68618J42204
6744G90849J9771j20105j52976j41737j14109p8740n1684l6225k2752j7413j5164
6733E9715p462r343m758l422j101K846J935k254p569k49M345N59n88n99n655o620
6717A9780n813l002k864J177J919k48J835l741O416K712l126m009k518j598K769
6702I689l476j581K122L70K169J459k545m623K284P090K29m612J783K190o506
6687F042q139p31M352Q777q448p158j426N025j385K941J578q157k64L758N205
$$ plain form
6672 1970 2195 -4203 -9496 -7560 833 579 1490 2253 -3104 862 -252 387 281 -8717 -6918 -2715
6656 -2715 -2852 -1802 693 -2515 -801 5210 4116 -7735 -13611 -10619 -4968 -4832 -3825 -5206 -7951
6641 -7951 -6704 -744 -1478 4527 5274 58 5132 1761 4167 6795 2489 -2741 -6940 -2824 -617
6626 -617 716 2619 886 551 2084 -1413 -5616 2030 3636 -940 -6428 -3316 -757 198 -1016 -1833
6610 -1833 -4668 -1904 -9108 -9098 -9155 -2911 66 2468 3080 -1801 -4561 -9212 -7933 -6126 -8136 -12587
6594 -12587 -15746 -10751 -5289 3500 202 5291 6307 4605 1864 -12 -459 1089 -1262 -4949 -9819
6579 -9819 -11115 -9484 -3538 3456 542 -461 889 1023 -1576 -3654 -1757 3358 -688 -9320 -11001
6564 -11001 -8077 -3705 -3072 -6966 -6544 -8548 -5732 -5123 -4233 -368 1553 1135 3773 7243 11500 13143
$$ packed form
6672A970K25o398n293J936Q393k54R11P63n357L966j114O39j06q998J799M203
6656b715j37J050K495l208J714O011j094j1851n876K992N651J36J007j381k745
6641g951J247N960p34O005P47n216N074l371K406K628m306n230m199M116K207
6626f17J333J903j733l35J533l497m203P646J606m576n488L112K559R55j214q17
6610a833k835K764p204J0n7O244K977K402O12m881k760m651J279J807k010m451
6594a2587l159M995N462Q789l298N089J016j702k741j876m47J548k351l687m870
6579i819j296J631N946O994k914j003J350J34k599k078J897N115m046q632j681
6564a1001K924M372O33l894M22k004K816O09Q90L865J921m18K638L470M257J643
$$ plain form
6548 13143 4671 6539 5035 -988 -8155 -5532 312 -2988 -8023 -9981 -2070 -440 -3279 -4086 -6851
6533 -6851 -12420 -9171 -8028 -10909 -11018 -10909 -8101 -4091 4860 2051 -4613 -664 4264 -489 -2155
6518 -2155 -3226 -2303 -8037 -5226 -4296 -7121 -2024 -974 -4080 -2928 5001 -2748 -8732 -6818 -10657
6503 -10657 -12342 -8078 -4394 2004 5837 -1139 -5636 -1275 3409 3988 -1403 -2391 23 1619 -5137
6488 -5137 -6228 3958 8866 4139 -2479 -10690 -14874 -7282 -674 1463 1983 2206 290 -7038 -7523
6473 -7523 -7212 -5876 -2017 277 2463 -3698 -5322 -3215 -3014 -1971 -5540 -8977 -11277 -12579 -11993 -2889
6457 -2889 4422 5705 5323 -2713 -4044 -805 2589 531 97 3272 7404 2993 -1483 -182 5590
6442 5590 12413 7626 612 -1759 -6382 -11709 -13353 -13600 -9427 -1082 4998 1169 -150 -4800 -2387
$$ packed form
6548A3143q472J868j504o023p167K623N844l300n035j958P911J630k839q07k765
6533f851n569L249J143k881j09J09K808M010Q951k809o664L949M928m753j666
6518b155j071R23n734K811R30k825N097J050l106J152P929p749n984J914l839
6503a0657j685M264L684O398L833o976m497M361M684N79n391r88K414J596o756
6488e137j091J0186M908m727o618q211m184P592O608K137N20K23j916p328m85
6473g523L11J336L859K294K186o161j624K107K01J043l569l437k300j302N86R104
6457b889P311J283l82q036j331L239L394k058m34L175M132m411m476J301N772
6442E590O823m787p014k371m623n327j644k47M173Q345O080l829j319m650K413
$$ plain form
6427 -2387 -8268 -10378 -1295 4630 3523 7652 9114 5250 5670 2457 -1347 575 2295 2816 -2234
6412 -2234 -8500 -8343 -2582 -919 -699 -1121 -1861 -1780 878 1017 736 459 4369 -170 3158 7005 2517
6395 2517 -5892 -8634 2776 22868 29889 26230 22622 5565 -15207 -12320 -4174 -3631 -6753 -6790 -5348
6380 -5348 1463 129 180 3272 -1585 2002 -671 -896 5955 10912 13528 14773 10648 6581 186 -2511
6364 -2511 3223 4836 2975 -2557 -5540 -1798 -1363 -944 1003 -763 173 88 -5104 -3369 -2667 840
6348 840 5860 5006 324 -1638 -3099 -2578 -1144 -3392 -4759 383 -33 -9528 -13317 -8331 -1601 890
6332 890 4793 1838 -1663 -2835 -3504 -5686 -7134 -5429 -4935 -2721 1688 4577 10495 7441 3329 5588
6316 5588 6661 833 -1686 7304 2480 -5592 -7879 -6753 -9739 -9732 -4442 -1240 -5505 -14562 -11701 -7723
$$ packed form
6427b387n881k110R083N925j107M129J462l864M20l213l804J922J720N21n050
6412b234o266J57N761J663K20m22p40Q1K658J39k81k77L910m539L328L847m488
6395B517q409k742J1410K0092P021l659l608j7057k0772K887Q146N43l122l7J442
6380e348O811j334N1L092m857L587k673k25O851M957K616J245m125m067o395k697
6364b511N734J613j861n532k983L742M35M19J947j766R36q5n192J735P02L507
6348H40N020q54m682j962j461N21J434k248j367N142m16r495l789M986O730K491
6332H90L903k955l501j172o69k182j448J705M94K214M409K889N918l054m112K259
6316E588J073n828k519Q990m824q072k287J126k986PN290L202m265r057K861L978
$$ plain form
6300 -7723 -5717 -4890 -6168 -2826 -1683 -999 -6677 -9569 -7867 -13999 -14512 -17937 -20108 -14663 -5932 -1258
6284 -1258 6668 163 -6226 -3816 -8324 -7660 -10226 -7000 2081 2876 186 5518 8805 9221 6984 7789
6268 7789 6072 6203 6687 4162 -2375 -3204 195 -759 1511 -4003 -4378 -2474 1639 4859 3624 1687
6252 1687 1550 6229 9880 8922 6868 1117 2736 10902 10542 -1564 -11074 -15073 -9228 -3316 -2906 -5142
6236 -5142 -3920 1071 -1536 -6189 -4104 -1656 556 -1260 -1679 -3645 -7260 -8166 -5111 -3684 1800
6221 1800 1890 -3989 -2553 -6202 -10875 -10194 -4886 4577 2914 3101 1444 885 1581 -1784 -4609 -4654 -6633
6204 -6633 -9977 -11436 -13466 -5336 2402 6596 2575 -3910 -5421 1004 831 -1667 -2783 -2891 -8909
6189 -8909 -15335 -10950 -3037 1405 540 5381 3465 -1648 -7938 -5822 -4233 -1733 -3770 -1070 -1325
$$ packed form
6300g723K006Q27j278L342J143O84n678k892J702o132n13l425k171N445Q731M674
6284a258P926o505o389K410m508O64k566L226R081P95k690N332L287M16k237Q05
6268G789j717J31M84k525o537q29L399r54K270n514l75J904M113L220j235j937
6252A687j37M679L651r58k054n751J619Q166l60j2106r510l999N845N912M10k236
6236e142J222M991k607m653K085K448K212j816m19j966l615r06L055J427N484
6221A800R0n879J436l649m673O81N308R463j663J87j657n59O96l365k825m5j979
6204f633l344j459k030Q130P738M194m021o485j511O425j73k498j116j08o018
6189h909o426M385P913M442q65M841j916n113o290K116J589K500k037K700k55
$$ plain form
6174 -1325 -4842 465 -8 -1020 2773 382 8042 6016 1795 -3764 -1154 -1774 -4191 -7262 -5898
6159 -5898 2833 4673 -967 -56 201 343 194 -919 879 3452 2788 -959 -1128 1413 4595 -1668
6143 -1668 41 7507 5292 3068 4992 988 1392 4455 5303 2218 -3853 -4055 1606 443 -3709 -1908
6127 -1908 -6100 -6460 3023 -4766 -10183 -3637 -1019 -1604 851 3111 5552 7498 2653 -3446 -4678
6112 -4678 528 2857 3218 2180 569 -1694 -3140 -4041 -3346 -342 -5527 812 1270 -4925 -5504 -5416 -2331
6095 -2331 -1133 -2596 -6080 -4548 152 5682 5492 -5018 -10840 -3988 742 1053 -264 -1326 799
6080 799 -448 1002 412 1750 783 2782 -3980 -7788 -7501 -3407 -3348 -8280 -5396 -3788 -1577 509
6064 509 735 -5339 -8565 -2786 -2784 -568 5281 7265 3699 -4693 -2019 2257 3390 9101 9025 11636 13288
$$ packed form
6174a325l517N307m73j012L793k391P660k026m221n559K610o20k417l071J364
6159e898Q731J840n640R11K57J42j49j113J798K573o64l747j69K541L182o263
6143a668J709P466k215k224J924m004M04L063Q48l085o071k02N661j163m152J801
6127a908m192l60R483p789n417O546K618n85K455K260K441J946m845o099j232
6112d678N206K329L61j038j611k263j446r01O95L004n185O339M58o195n79Q8L085
6095b331J198j463l484J532M700N530j90j0510n822O852M730L11j317j062K125
6080G99j247J450n90J338r67J999o762l808K87M094N9m932K884J608K211K086
6064E09K26o074l226N779KK216N849J984l566q392K674M276J133N711p6K611J652
$$ plain form
6047 13288 7087 3185 2866 4664 2539 3610 -3722 -4654 -3047 -3653 -4553 -6253 -7468 -2316 -1799 -4129
6031 -4129 -9167 -8505 -2468 -1120 -4844 -11393 -15330 -14606 -9995 -6643 -2783 -5301 -346 202 -3501 -4851
6015 -4851 1435 -2391 1644 2588 -4220 -7385 -7130 -9819 313 3806 3607 315 -2802 -288 511 2500
5999 2500 2271 3672 3408 4926 3407 4680 9190 1886 -10705 -12520 -9262 -7613 -11802 -13918 -11517
5984 -11517 -10949 -5928 -7328 -8581 -5760 -3486 -2539 -2465 -1597 -3988 -580 721 -7037 -8109 -2166 2217
5968 2217 -169 -5725 795 -1073 -5754 -5923 -7800 -9508 -13372 -7226 -8249 -10201 -7202 -2887 378
5953 378 1142 5203 2302 -822 -9134 -10542 -7009 -6445 -10026 -10059 -8148 -8954 -6618 -15 -432 -4801 -3631
5936 -3631 -5043 -13836 -11693 -7456 -2074 4157 6085 4452 1436 4548 -680 -5083 -8006 -11436 -12245
$$ packed form
6047A3288o201l902l19J798k125J071p332r32J607o06r00j700j215N152N17k330
6031d129n038O62O037J348l724o549l937P24M611L352L860k518M955N48l703j350
6015d851O286l826M035R44o808l165K55k689J0132L493j99l292l117K514P99J989
5999B500k29J401k64J518j519J273M510p304j2591j815L258J649m189k116K401
5984a1517N68N021j400j253K821K274R47P4Q68k391L408J301p758j072N943M383
5968B217k386n556O520j868m681j69j877j708l864O146j023j952K999M315L265
5953C78P64M061k901l124q312j408L533N64l581l3J911q06K336O603m17m369J170
5936c631j412q793K143M237N382O231J928j633l016L112n228m403k923l430q09
$$ plain form
5921 -12245 -12657 -6778 -7319 -11071 -12426 -15223 -10400 -6759 -566 -5704 -17087 -16382 -7954 -5425 -2596
5906 -2596 -1184 -283 3083 -2844 -5163 -7503 -3643 -11 365 2943 -2232 -4810 -9924 -18745 -15288
5891 -15288 -10974 -8640 -8748 -3668 -929 -6469 -5428 -3852 -1653 356 884 3056 6170 5832 3827
5876 3827 5650 8070 -1506 -9015 -10426 -15361 -12072 -14463 -14998 -3734 7028 6521 8396 7520 3516
5861 3516 -5009 -8969 -10687 -1802 4382 3132 -1709 -4191 -5267 -3908 -4856 -5161 -4771 -7345 -5265 -3296
5845 -3296 -1379 285 -3437 -341 562 1216 -3704 -10357 -13704 -13455 -4726 1448 8159 7043 712 -2652
5829 -2652 1260 5707 2826 -5106 -7760 -5453 -6992 -3781 1260 7356 7426 -1420 1995 7139 3745
5814 3745 -3767 -9961 -13280 -8012 -5611 -4913 -7102 -2898 1087 821 -999 5742 8008 10721 -1406
$$ packed form
5921a2245m12N879n41l752j355k797M823L641O193n138j1383P05Q428K529K829
5906b596J412R01L366n927k319k340L860L632L76K578n175k578n114q821L457
5891a5288M314K334j08N080K739n540J041J576K199K009N28K172L114l38k005
5876C827J823K420r576p509j411m935L289k391n35J1264J0762n07J875q76m004
5861C516q525l960j718Q885O184j250m841k482j076J359r48l05L90k574K080J969
5845c296J917J664l722L096R03O54m920o653l347K49Q729O174O711j116o331l364
5829b652L912M447k881p932k654K307j539L211N041O096P0q846L415N144l394
5814C745p512o194l319N268K401O98k189M204L985k66j820O741K266K713j2127
$$ plain form
5799 -1406 -9534 -7757 -6932 -6245 -4440 -7020 -15366 -11618 -8557 -5824 -7437 -13689 -13191 -15768 -11622 -5807
5783 -5807 -839 5365 1142 -6153 -8308 -4004 -4070 -3502 692 2192 -2693 -225 -1234 671 4068 2829
5767 2829 -3870 -4459 -4832 -7042 -7102 -3407 -1636 3444 2124 384 -1016 -5590 -11588 -12525 -4753 920
5751 920 1140 2993 2345 -6929 -12663 -11100 -5174 -2213 -1851 465 -947 -1148 -145 4513 531 -3673
5735 -3673 -6369 -7720 -6797 -11432 -9137 -9835 -11871 -8785 -10433 -14770 -7729 -3655 -7649 -14579 -14864 -12926
5719 -12926 -14085 -14851 -15166 -14401 -3806 -2026 -6783 -11125 -11770 -13629 -13941 -9216 -4585 1793 4374 3715
5703 3715 2943 572 1340 10145 17844 23150 23485 19811 12566 5951 14655 18243 13367 1690 -210
5688 -210 470 4012 5549 6546 5051 -3871 -2309 4701 18342 22367 10894 5691 12530 17587 11852
$$ packed form
5799a406q128J777Q25O87J805k580q346L748L061K733j613o252M98k577M146N815
5783e807M968O204m223p295k155M304o6N68M194J500m885K468j009J905L397j239
5767B829o699n89l73k210o0L695J771N080j320j740j400m574n998r37P772N673
5751I20K20J853o48r274n734J563N926K961L62K316j412k01J003M658l982m204
5735c673k696j351R23m635K295o98k036L086j648m337P041M074l994o930k85J938
5719a2926j159p66l15P65J0595J780m757m342o45j859l12M725M631O378K581o59
5703C715p72k371P68Q805P699N306L35l674p245o615Q704L588m876j1677j900
5688b10O80L542J537R97j495q922J562P010J3641M025j1473n203O839N057n735
$$ plain form
5673 11852 8697 2631 -5321 -6517 -3607 5497 8703 12363 13473 9211 3635 4758 2826 597 -4158
5658 -4158 -3765 2583 -792 -4423 -6331 -3392 -3639 -4220 -8822 -11480 -11437 -12101 -10471 -7227 -6268 -7022 -631
5641 -631 1129 -2640 -5058 -9520 -11167 -5056 72 1201 7310 11769 9812 2382 612 780 3635
5626 3635 4415 -1386 -6136 -2582 2601 1854 778 186 -383 -5762 -6599 -2441 2893 9518 4289 -3293
5610 -3293 -6811 -3180 2195 432 2529 2852 -3562 -15640 -20821 -18974 -12459 -532 3295 -2217 703
5595 703 -7706 -8555 -4734 -7426 -7950 -5009 -8142 -2507 1570 6417 8695 1385 -1500 -397 3313 4953
5579 4953 4336 3615 4540 4011 1479 653 823 -2961 -2598 -1000 -7159 -7599 -1258 1253 -1838 -4612 -8175
5562 -8175 -16085 -16694 -10864 -8086 -11275 -6362 -956 -5210 -14705 -15941 -13788 -6470 -3474 -7729 -12870
$$ packed form
5673A1852l155o066p952j196K910R104L206L660J110m262n576J123j932k229m755
5658d158L93O348l375l631j908K939k47n81m602k658M3o64J630L244R59p54O391
5641f31J760l769k418m462j647O111N128J129O109M459j957p430j770J68K855
5626C635P80n801m750L554N183p47j076n92n69n379q37M158N334O625n229p582
5610c293l518L631N375j763K097L23o414j2078n181J847O515J1927L827n512K920
5595G03q409q49L821k692n24K941l133N635M077M847K278p310k885J103L710J640
5579D953o17p21R25n29k532q26J70l784L63J598o159m40O341K511l091k774l563
5562h175p910o09N830K778l189M913N406m254r495j236K153P318K996m255n141
$$ plain form
5547 -12870 -16129 -14986 -14964 -13689 -17865 -19342 -11705 634 3916 414 -2259 -1739 -2420 2234 -4193
5532 -4193 -3808 -7602 -6509 2390 3024 -3095 -6991 -11655 -8504 -4326 4648 4534 -1100 615 3830 3951
5516 3951 4280 160 5442 4615 -349 -7360 -5897 -5900 -3121 -3789 -5993 -3631 -6700 -4844 1973 -2035
5500 -2035 -5301 -2888 -3232 -3394 3303 3553 17 -5287 -12947 -11358 -11078 -10399 -14280 -9738 -10148 -7381
5484 -7381 -11010 -7964 -6254 -3648 -6007 -101 -1327 -17487 -18602 -10404 -8789 -2189 -16 -3922 -7140
5469 -7140 -5066 -6504 -8201 -5287 -6573 -5447 -10196 -7781 -5846 347 5851 2141 -2816 3197 5680
5454 5680 1995 2330 8507 11899 10972 6338 5569 4312 8013 9998 -820 -2715 3848 44 -5234
5439 -5234 -4781 -7691 -13193 -13959 -10397 -9040 -9417 -7282 -777 1234 223 1111 1020 -4036 -4986 -195 1547
$$ packed form
5547a2870l259J143K2J275m176j477P637J2339L282l502k673N20o81M654o427
5532d193L85l794J093Q899O34o119l896m664L151M178Q974j14n634J715L215J21
5516C951L29m120N282q27m964p011J463lK779o68k204K362l069J856O817m008
5500b035l266K413l44j62O697K50l536n304p660J589K80O79l881M542m10K767
5484g381l629L046J710K606k359N906j226j6160j115Q198J615O600K173l906l218
5469g140K074j438j697K914j286J126m749K415J935O193N504l710m957O013K483
5454E680l685L35O177L392r27m634p69j257L701J985j0818j895O563l804n278
5439e234M53k910n502p66L562J357l77K135O505K011j011Q88r1n056r50M791J742
$$ plain form
5422 1547 1094 732 -3239 -11237 -11996 -5733 -2766 1359 4668 5827 -365 -6293 -6078 -4657 -4422 1399
5406 1399 1114 -537 3066 8895 8163 7762 10772 5822 -2876 -8140 -3929 -1026 -1496 -7303 -9179 -6489
5390 -6489 840 -10 617 7161 4866 2549 4890 -1733 -11170 -11077 -5286 751 -1538 -6926 -6648 -6416
5374 -6416 -4035 2951 -3821 -9057 -6616 -10682 -8648 -6385 -5007 -1110 221 -5582 -2601 367 -4608
5359 -4608 -424 4638 7606 6617 4702 4434 1072 -4404 -7854 -7646 -8726 -8667 -1257 2469 -557 2046
5343 2046 8849 6350 5101 1720 1192 1192 2874 5865 2201 896 7338 1233 -4761 -5611 -4225 -3371
5327 -3371 -1204 -4793 -5425 -9714 -10385 -7469 -3595 -3812 -3243 -7328 -6944 1167 3373 2510 -524 -2094
5311 -2094 2399 -5060 -12287 -7678 -4253 -4971 -6801 -8041 -8143 -4319 -1156 -1932 1464 -288 104 -5178
$$ packed form
5422A547m53l62l971p998p59O263K967M125L309J159o192n928K15J421K35N821
5406A399k85j651L603N829p32m01L010m950q698n264M211K903m70n807j876K690
5390f489P329q50O27O544k295k317K341o623r437R3N791O037k289n388K78K32
5374f416K381O986o772n236K441m066K034K263J378L897J331n803K981K968m975
5359d608M184N062K968r89j915k68l362n476l450K08j080N9P410L726l026K603
5343B046O803k499j249l381n28%J682K991l664j305O442o105n994q50J386Q54
5327c371K167l589o32m289o71K916L874k17N69m085L84Q111K206q63l034j570
5311b094M493p459p227M609L425p18j830j240j02L824L163p76L396j752L92n282
$$ plain form
5295 -5178 -8327 -6556 -11058 -10188 -12143 -7674 865 3654 137 -3717 -8946 -12761 -3816 -1756 -5907
5280 -5907 1727 2610 242 5118 2786 -593 1058 1513 1550 -2143 -3060 -7438 -9458 -4384 -1913 1064
5264 1064 4777 4996 2430 3438 5002 8092 1567 -5937 -5056 -2476 -83 -688 -2950 -4175 -7403 -6163
5248 -6163 -2705 -622 -1546 -3123 1201 5645 6097 5957 -2049 -7209 -3790 -8848 -3736 -1452 -6782 -6416
5232 -6416 2721 1883 -3935 -3348 966 509 -1698 -216 -865 -4728 -7380 -7505 -3006 3172 -847 -1581
5216 -1581 -8410 -11625 -9053 -1313 1737 -1938 -7335 -7943 -16717 -12890 -7656 -8098 -6582 -6993 -4088 -995
5200 -995 4094 8493 2023 -3746 -2421 -7518 -10702 -12671 -14072 -8145 -9463 -9809 -11638 -9532 -7578
5185 -7578 -10119 -1671 1072 -1950 -12989 -12904 -13187 -21495 -23567 -23008 -24670 -26694 -25034 -14752 -3437
$$ packed form
5295e178l149J771m502Q70j955M469Q539K789l517l854n229l815Q945K060m151
5280e907P634Q83k368M876k332l379J651M55L7l693r17m378k020N074K471K977
5264A064L713K19k566J008J564L090o525p504Q81K580K393o05k262j225l228J240
5248f163L458K083r24j577M324M444M52j40q006n160L419n058N112K284n330L66
5232f416R137q38n818N87M314m57k207J482o49l863k652j25M499O178m019p34
5216a581o829l215K572P740L050l675n397o08q774L827N234m42J516m11K905L093
5200i95N089M399o470n769J325n097l184j969j401N927j318l46j829K106J954
5185g578k541Q448K743l022j1039Q5k83q308k072N59j662k024J660J0282J1315
$$ plain form
5170 -3437 -169 3137 2718 -3016 -3386 -2213 -713 -2600 -5985 -12645 -12042 -14305 -15765 -12513 -9134 -5972
5154 -5972 -2739 736 2693 2867 236 189 6379 -2060 -5230 -5857 -4449 -4752 -332 1413 1248 1971 2326
5137 2326 2639 3530 -474 487 -2018 -7919 -8350 -58 199 -1307 2493 4388 1435 7177 12971 12685
5121 12685 14192 6747 -366 -6960 -8596 -5142 -805 6421 7328 3714 2724 -166 -3128 -656 -4405
5106 -4405 -7221 -5560 -358 -10 -5700 -13616 -15946 -7405 27 -5078 -6349 -4001 7508 6170 3801
5091 3801 2453 3417 10065 4869 717 4297 2756 1516 1097 -1918 -9486 -15988 -16099 -10722 -7676 -7441
5075 -7441 -2886 -639 -5948 -15380 -8655 -1977 442 3382 5469 6334 6931 6478 13028 8234 -3184
5060 -3184 -7921 -7911 -11357 -12614 -11348 -14114 -13778 -11580 -8406 -7990 -5661 -2177 5336 -239 -985 -1755
$$ packed form
5170c437L268L306m19n734l70J173J500j887l385o660O03k263j460L252L379L162
5154e972L233L475J957J74k631m7O190q439l170o27J408l03M420J745j65P23L55
5137B326L13Q91m004R61k505n901m31Q292K57j506L800J895k953N742N794k86
5121A2685J507p445p113o594j636L454M337P226R07l614r90k890k962K472l749
5106d405k816J661N202L48n690p916k330Q541P432n105j271K348J1509j338k369
5091C801j348R64O648n196m152L580j541j240m19l015p568o502j11N377L046K35
5075g441M555K247n309r432O725O678K419K940K087Q65N97m53O550m794j1418
5060c184m737J0l446j257J266k766L36K198L174M16K329L484P513n575p46p70
$$ plain form
5044 -1755 -1825 -4836 -12254 -18114 -14060 -8419 -4261 -7533 -16100 -23610 -20590 -15429 -18264 -12242 -7518
5029 -7518 -10479 -12208 -11877 -11453 -12909 -8180 -10506 -14703 -11821 -5815 -644 4253 11365 4580 1539
5014 1539 3627 1576 552 1484 4457 6285 11347 12838 7673 1287 1038 7488 4731 -6739 -8738
4999 -8738 -7588 -5936 -9727 -8137 -6505 -5719 5376 4815 -2524 -7478 -4242 3470 5929 6551 3066
4984 3066 -3402 -7224 -8855 -9366 -4174 1518 -2854 -2237 965 1256 -4511 -5803 -1747 706 3276 3705
4968 3705 6748 1990 -6461 -8223 -8781 -11727 -15086 -8850 -6740 -4524 1630 8380 9402 2882 -2491
4953 -2491 423 -3398 -6205 -767 -730 -3674 -5119 -8938 -2690 -1906 -7660 -9166 -8402 1946 1977 1171
4937 1171 2969 2995 -741 -889 3452 1302 2208 4728 2598 2543 792 3110 3034 8129 5704 -38 -566
$$ packed form
5044a755p0l011p418n860M054N641M158l272q567p510L020N161k835O022M724
5029g518k961j729L31M24j456M729k326m197K882O006N171M897P112o785l041
5014A539K088k051j024R32K973J828N062J491n165o386k49O450k757j1470j999
4999h738J150J652l791J590J632P86J1095n61p339m954L236P712K459O22l485
4984C066o468l822j631n11N192N692m372O17L202K91n767j292M056K453K570M29
4968C705L043m758q451j762n58k946l359O236K110K216O154O750J022o520n373
4953b491K914l821k807N438L7k944j445l819O248P84n754j506P64J0348L1q06
4937A171J798K6l736j48M341k150R06K520k130n5j751K318p6N095k425n742n28
$$ plain form
4920 -566 -758 1346 5132 13883 6880 3779 5972 4317 2795 3220 3417 8209 6822 5372 2724 3963
4904 3963 3660 10002 8730 -820 -7190 -6563 -6778 -4582 -2418 -3096 -4885 -9018 -7898 -48 5009 8022
4888 8022 8814 11043 3729 -835 -3983 -4586 -7168 -9713 -10925 -9366 -4158 -701 635 695 -8844 -11875
4872 -11875 -9569 -12352 -10177 -1908 3589 2203 3089 249 -7974 -10597 -3730 -4716 -5566 -1169 -9476
4857 -9476 -11291 -8561 -5133 -8286 -11235 -9202 -7028 -8172 -10422 -10756 -8641 -8841 -10961 -7179 1994
4842 1994 -2645 -10711 -4110 7409 8261 -1349 -1929 -4247 -4454 -3215 -7540 -7309 -11847 -12522 -14636 -10092
4826 -10092 -13735 -14702 -8636 -1767 1248 1138 3939 -275 -7382 -8165 -1674 -2466 -7042 -8543 -11017 -13349
4810 -13349 -11069 -4999 -4640 -3243 -2916 -7982 -5649 -4188 996 1349 -4608 -4459 -934 -1778 -12166 -17790
$$ packed form
4920e66j92K104L786Q751p003l101K193j655j522M25J97M792j387j450k648J239
4904C963l03O342j272r550o370O27k15K196K164o78j789m133J120P850N057L013
4888H022P92K229p314m564l148o03k582k545j212J559N208L457J336O0r539l031
4872a1875K306k783K175Q269N497j386Q86k840q223k623O867r86q50M397q307
4857i476j815K730L428l153k949K033K174j144k250l34K115k00k120L782R173
4842A994m639q066O601J1519Q52r610n80k318k07J239m325K31m538o75k114M544
4826a0092l643r67O066O869L015j10K801m214p107p83O491p92m576j501k474k332
4810a3349K280O070L59J397L27n066K333J461N184L53n957J49L525q44j0388n624
$$ plain form
4794 -17790 -19524 -18271 -13105 -8288 -4249 -2868 3501 4354 -53 -6196 -3775 -3569 -677 346 -3671
4779 -3671 -6145 -6359 -6442 -7145 -9081 -3035 -142 -7484 -8792 -13163 -8664 -1441 130 699 -2826 -5860
4763 -5860 -2910 7573 7292 6617 2983 3870 9460 9515 3829 -1916 -4974 -8496 -13744 -15324 -10874 -11589
4747 -11589 -13199 -12505 -10666 -8597 -3624 -3748 -9595 -12269 -11270 -14278 -15454 -13970 -8844 -4096 -95
4732 -95 -279 -2394 380 -7428 -6705 -2503 -3084 -8682 -7415 -3510 -64 577 929 -4429 -4044 -1209 91
4715 91 -2170 1367 3319 2503 -268 -3756 -4584 -12212 -9318 -5218 649 7106 10834 1148 -2900 -3320
4699 -3320 4588 9522 6090 452 -5784 -1798 8402 11323 10507 524 -7056 -10256 -6318 -4341 -4382
4684 -4382 -4539 -11033 -11089 -13320 -18347 -20043 -12152 -2936 -13 -184 -10861 -17749 -11350 -4151 -4343 -4932
$$ packed form
4794a7790j734J253N166M817M039J381O369Q53m407o143K421K06K892J023m017
4779c671k474k14q3p03j936O046K893p342j308m371M499P223J571N69l525l034
4763e860K950J0483k81o75l634Q87N590N5n686n745l058l522n248j580M450p15
4747a1589j610O94J839K069M973j24n847k674R99l008j176J484N126M748M001
4732i5j84k115K774p808P23M202n81n598J267L905L446O41L52n358L85K835J300
4715I1k261L537J952q16k771l488q28p628K894M100N867O457L728r686m048m20
4699c320P908M934l432n638o236L986J0200K921q16r983p580l200L938J977m1
4684d382j57o494n6k231n027j696P891R216K923j71j0677o888O399P199j92n89
$$ plain form
4668 -4932 -7666 -10423 -10678 -7021 -665 2385 -14 -4281 -896 -6222 -10084 -4828 -5044 -7601 -12801
4653 -12801 -11585 -9654 -7703 -7698 -2921 -4977 -10517 -12104 -6987 -7589 -5790 -8459 -2596 2817 9999 1282
4637 1282 -4792 -4203 -6311 -3512 -1644 -11031 -14146 -5985 2567 2512 -961 -4988 -7461 -9599 -9696 -14308
4621 -14308 -12574 -6393 -3156 -7475 -10551 -14666 -14080 -9618 -10961 -12340 -4859 -3227 1420 2383 4273
4606 4273 848 137 3698 348 -3521 -5381 -6309 -9277 -10034 -7996 -4854 -2181 -1336 1931 912 986
4590 986 438 -194 -5721 -5192 -4124 -5800 -5977 -5743 -6284 -7836 -6821 287 7450 10799 7489 8966 6078
4573 6078 2468 9755 7296 2390 6206 8117 9343 8093 8160 6151 6346 5664 1429 -6344 -7685 -3922
4557 -3922 -2731 99 5526 -3456 -11758 -12798 -17300 -23573 -19934 -15091 -17134 -14003 -11173 -10416 -4457
$$ packed form
4668d932k734k757k55L657O356L050k399m267L385n326l862N256k16k557n200
4653a2801J216J931J951NM777k056n540j587N117o02J799k669N863N413P182q717
4637A282o074N89k108K799J868r387l115Q161Q552n5l473m027k473k138r7m612
4621a4308J734O181L237m319l076m115N86M462j343j379P481J632M647R63J890
4606D273l425p11L561l350l869j860r28k968p57K038L142K673Q45L267j019P4
4590I86n48o32n527N29J068j676j77K34n41j552J015P108P163L349l310J477k888
4573F078l610P287k459m906L816J911J226j250O7k009J95o82m235p773j341L763
4557c922J191K830N427q982q302j040m502o273L639M843k043L131K830P57N959
$$ plain form
4542 -4457 4895 5538 3217 -57 2042 4571 -2848 -5712 1746 4092 103 -1733 1105 3782 -803
4527 -803 -642 -3459 -10761 -14508 -14459 -10066 -12181 -15098 -11915 -8002 -2704 2676 5671 7632 5461 -72
4511 -72 -2934 1277 4558 7601 10230 10658 3824 2928 1024 -687 73 6525 9973 -867 -8060 -10512
4495 -10512 -8484 -5980 -8171 -8767 -3082 -3675 -2080 -10527 -9669 -3543 -1284 6102 10128 7120 6770 3457
4479 3457 -3401 -4984 -7718 -6577 -2370 -449 11713 15633 17175 12395 6711 6290 893 -4895 -882
4464 -882 -1726 46 -788 2646 3553 -3821 -3380 -1452 -2053 -4820 701 -3179 -8602 -6023 -5955 -4714 -3787
4447 -3787 -1981 -113 467 1028 7560 9157 8150 27 -4566 -7753 -4351 1831 11233 7900 5702
4432 5702 6292 6995 8107 5353 989 -4803 -222 1015 -1098 -626 -4173 -3397 -8371 -11588 -7956 1338
$$ packed form
4542d457R352O43k321l274K099K529p419k864P458K346l989j836K838K677m585
4527h03J61k817p302l747M9M393k115k917L183L913N298N380K995J961k171n533
4511g2k862M211L281L043K629M28o834q96j904j711P60O452L448j0840p193k452
4495a0512K028K504k191n96N685n93J595q447Q58O126K259P386M026l008l50l313
4479C457o858j583k734J141M207J921J2162L920J542m780n684m21n397n788M013
4464h82q44J772q34L434R07p374M41J928o01k767N521l880n423K579O8J241R27
4447c787J806J868N80N61O532J597j007q123m593l187L402O182R402l333k198
4432E702N90P03J112k754m364n792M581J237k113M72l547P76m974l217L632R294
$$ plain form
4416 1338 -3150 -10972 -12294 -3312 -503 1976 -2680 -4197 -465 -25 -7722 -7501 -8616 -2904 -173
4401 -173 -4182 -6791 -3559 3044 8205 9012 7140 5596 3686 602 2881 6988 -2407 -7047 -4809
4386 -4809 -3375 -424 -570 478 -8296 -6335 -7304 -7773 -7802 -8471 -8797 -9446 -3889 3436 7112 7923 7790
4369 7790 8100 11138 8980 9190 1386 -7514 -5010 -3595 1298 8078 8313 -32 -889 522 919 1477
4353 1477 6943 10592 8075 6483 10785 9627 8976 7267 3359 -795 -7794 -10079 -10332 -6205 -499
4338 -499 -1190 -7535 -8814 -9105 -8096 -7862 -7651 -161 2448 5745 5398 3203 3565 4741 7932 6793 1418
4321 1418 -3079 -1019 6435 2939 -3326 -10090 -15957 -16606 -13554 -6555 769 -2116 -7019 -5478 -12009
4306 -12009 -13537 -10993 -5826 -4599 -1777 -6525 -1455 5287 1364 -628 1159 -2966 -633 1198 -1231
$$ packed form
4416A338m488p822j322Q982K809K479m656j517L732M40p697K21j115N712K731
4401a73m009k609L232O603N161Q07j872j544j910l084K279M107r395m640K238
4386d809J434K951j46J048q774J961r69m69k9o69l26o49N557P325L676Q11j33
4369G790L10L038k158K10p804q900K504J415M893O780K35q345q57J411L97N58
4353A477N466L649k517j592M302j158o51j709l908m154o999k285k53M127N706
4338d99o91o345j279k91J009K34K11P490K609L297l47k195L62J176L191j139n375
4321A418m497K060P454l496o265o764n867o49L052O999P324k885m903J541o531
4306a2009j528K544N167J227K822m748N070O742l923j992J787m125K333J831k429
$$ plain form
4291 -1231 -7720 -7904 -8888 -9796 -7196 -7172 -6479 -6445 -7092 -695 -899 531 2360 65 1137 -929 3126
4274 3126 2297 -750 -1045 2649 7271 6084 3897 668 -2691 -2952 -257 -3431 -2043 2593 6290 8131
4258 8131 6343 4634 490 -3904 -6469 -9048 -7901 1704 8281 9626 8017 2833 -404 1607 -4948
4243 -4948 -10052 -7031 -1825 -477 -1136 -3069 -5250 -4720 -4027 -2973 1465 -1036 1969 10609 15415 12186
4227 12186 1891 -8318 -7707 -910 -4816 -7354 -1983 -762 -4202 -5788 -1011 5885 11409 4818
4213 4818 3813 3066 -83 -2845 -6473 -1512 -6773 -11379 -10163 -8914 -4411 -2914 -2481 1023 -1097
4198 -1097 -2422 -5867 -6732 -4988 -8714 -5749 2080 3690 1816 -2273 -2373 38 4855 8138 5333
4183 5333 12650 7887 371 -3655 -6655 5311 10951 2598 -9895 -6347 1087 -424 -1739 -6388
$$ packed form
4291a231o489j84r84r08K600K4O93L4o47O397k04J430J829k295J072k066M055
4274C126q29l047k95L694M622j187k187l229l359k61K695l174J388M636L697J841
4258H131j788j709m144m394k565k579J147R605O577J345j609n184l237K011o555
4243d948n104L021N206J348o59j933k181N30O93J054M438k501L005Q640M806l229
4227A2186j0295j0209O11O797l906k538N371J221l440j586M777O896N524o591
4213D818j005p47l149k762l628M961n261m606J216J249M503J497M33L504k120
4198a097j325l445q65J744l726K965P829J610j874m089j00K411M817L283k805
4183E333P317m763p516m026l000J1966N640q353j2493L548P434j511j315m649
$$ plain form
4169 -6388 -6826 -4656 -9710 -13435 -16778 -12155 -5846 -5205 -3967 -6534 -1058 8358 11756 11065 8456 -3487
4153 -3487 -944 3859 -5168 -6651 -12718 -13068 -13139 -13270 -7808 441 4843 -587 -1495 716 -907 -2026
4137 -2026 -8333 -5713 -2042 -287 3085 6335 -353 -5648 -2378 1984 -535 -2949 824 9494 14292
4122 14292 15887 9178 460 -5098 -1365 -5160 -6910 -1634 1226 4733 30 -7044 -4858 -186 9412
4107 9412 8072 3430 1468 -2602 -13424 -10821 -10364 -8403 -5484 -9548 -13885 -15990 -8955 -8085 -1894
4092 -1894 -5568 -13713 -12958 -10181 -10636 -9152 -11450 -4306 1436 4538 3001 -3706 -6680 -9216 -10452
4077 -10452 -5548 -8177 -3800 5699 3005 -4407 -9028 -8289 -5158 -47 -472 -2290 3281 7306 3852
4062 3852 -246 1777 6686 -1046 -3409 -7316 -5907 -6379 -5292 832 5598 3287 -274 -7309 -12418
$$ packed form
4169f388m38K170n054l725l343M623O309O41J238k567N476R416L398o91k609j1943
4153c487K543M803r027j483o067l50p1j31N462Q249M402n430r08K211j623j119
4137b026o307K620L671J755L372L250o688n295L270M362k519k414L773Q670M798
4122A4292J595o709q718n558L733l795j750N276K860L507m703p074K186M672R598
4107I412j340m642j962m070j0822K603M57J961K919m064m337k105P035Q70O191
4092a894l674q145P55K777m55J484k298P144N742L102j537o707k974k536j236
4077a0452M904k629M377R499k694p412m621P39L131N111m25j818N571M025l454
4062C852m098K023M909p732k363l907J409m72J087O124M766k311l561p035n109
$$ plain form
4047 -12418 -21623 -19648 -12576 -11173 -10332 -11540 -10531 -9562 -7567 -1436 5496 3086 2887 5426 2575
4032 2575 -554 1616 -519 -177 1436 -4321 -7332 -1090 1892 4771 2874 698 -1687 -3064 -1950
4017 -1950 -7839 -5925 -6141 -8734 -8368 -8515 -10348 -14046 -16099 -13970 -9141 -3159 -1131 -351 -286 1548
4001 1548 -433 -5065 -6913 -10790 -6228 -2807 -3474 -3075 2 -978 1900 -1195 -3884 -2974 -4941 -6924
3985 -6924 -3034 -4147 1365 9189 11736 5940 5723 5661 1053 1683 -1222 -803 2247 8110 4118 -4513
3969 -4513 -11204 -11360 -14148 -13594 -11929 -6080 -3720 -4220 -3570 -1104 -2290 621 -6274 -10056 1187 6998
3953 6998 6505 2191 965 4168 9992 1952 -3300 4123 10746 7719 7175 7430 10228 1370 -3707 -3238
3937 -3238 -5776 -4377 1337 -1656 -4881 -4037 -6542 -421 5867 7173 8659 3978 1552 6929 7361
$$ packed form
4047a2418r205J975P072J403Q41j208J009R69J995O131O932k410j99K539k851
4032B575l129K170k135L42J613n757l011O242K982K879j897k176k385j377J114
4017a950n889J914k16k593L66j47j833l698k053K129M829N982K028P80O5J834
4001A548j981m632j848l877M562L421o67L99L077r80K878l095k689R10j967j983
3985f924L890j113N512P824K547n796k17o2m608O30k905M19L050N863l992q631
3969d513o691j56k788N54J665N849K360n00O50K466j186K911o895l782J1243N811
3953F998m93m314j226L203N824q040n252P423O623l027n44K55K798q858n077M69
3937c238k538J399N714k993l225Q44k505O121O288J306J486m681k426N377M32
$$ plain form
3922 7361 3272 1796 2430 -2535 -7422 -8524 -10199 -3157 4008 5767 3609 2534 -2373 823 450
3907 450 1691 5222 5588 -4798 -9573 -5950 -3362 -1118 -1595 -5981 -5675 -2979 5174 4293 3546 -367
3891 -367 -2262 -1215 -6521 -5632 -8293 -7169 -7539 -13780 -8843 -1729 2968 3526 -2811 -1399 -2666 -5398
3875 -5398 -5488 -2462 -570 5140 10863 11306 7004 -3736 -5843 -8932 -7265 -2136 -1519 -2934 6395 9748
3859 9748 10333 242 -10202 -8897 -5449 -3025 330 -633 -6596 -7788 -4404 -1459 1322 2128 -254
3844 -254 -975 -1438 -3281 -5627 -7427 -9709 -7086 638 4917 8498 7828 6942 4798 2206 4010 4293
3828 4293 3359 -3817 -12087 -12501 -9412 -5864 -6955 -1098 -466 -7099 -5912 -7412 -5484 -4081 -7199 -10774
3812 -10774 -10894 -3046 3579 5057 3739 137 -3981 -8791 -8416 -9975 -12864 -11802 -12215 -11988 -4256 -3713
$$ packed form
3922G361m089j476O34m965m887j102j675P042P165J759k158j075m907L196l73
3907D50J241L531L66j0386m775L623K588K244m77m386L06K696Q153q81p47l913
3891c67j895J047n306Q89k661J124l70o241M937P114M697N58o337J412j267k732
3875e398r0L026J892N710N723M43m302j0740k107l089J667N129O17j415R329L353
3859I748N85j0091j0444J305L448K424L355r63n963j192L384K945K781Q06k382
3844b54p21m63j843k346j800k282K623P724M279L581o70q86k144k592J804K83
3828D293r34p176q270m14L089L548j091N857O32o633J187j500J928J403l118l575
3812a0774j20P848O625J478j318l602m118m810L75j559k889J062m13K27P732N43
$$ plain form
3796 -3713 -2778 419 2566 179 -3482 -2235 234 3633 -1151 -2022 -6522 -14376 -12705 -7522 -8249 -15065
3780 -15065 -4567 2919 9983 12023 3380 -4503 -10375 -7179 1444 -131 -3779 -5470 -7465 3309
3766 3309 8073 216 -4415 -3236 -590 3871 5428 4474 508 -2876 -5311 -3989 -4113 -9727 -11714
3751 -11714 -7753 -9967 -5836 -1053 4574 8822 2048 -5204 6055 10662 7354 -4538 -15300 -13593
3737 -13593 -5002 -4664 -3273 -1979 1165 2347 62 -8695 -10277 -9378 -305 4872 2086 -864 -5331
3722 -5331 -4477 2379 5379 -2980 -5443 -687 -1658 2482 292 -4432 -8857 -6432 1432 5250 2316
3707 2316 4796 5276 19 -5792 -6439 -12184 -13726 -6930 -5732 -8855 -9391 -10713 -10322 -6057 -4811 -1309
3691 -1309 -4887 -4484 -5703 -14090 -15899 -6232 3974 8760 3455 -3508 -3923 1963 2138 -3350 -5560
$$ packed form
3796c713R35L197K147k387l661J247K469L399m784q71m500p854J671N183p27o816
3780a5065J0498P486P064K040q643p883n872L196Q623j575l648j691j995J0774
3766C309M764p857m631J179K646M461J557r54l966l384k435J322j24n614j987
3751a1714L961k214M131M783N627M248o774p252J1259M607l308j1892j0762J707
3737a3593Q591L38J391J294L144J182k285q757j582Q99R073N177k786k950m467
3722e331Q54O856L000q359k463M756r71M140k190m724m425K425P864L818k934
3707B316K480M80n257n811o47n745j542O796J198l123n36j322L91M265J246L502
3691a309l578M03j219q387j809R667J0206M786n305o963m15N886J75n488k210
$$ plain form
3676 -5560 -9948 -11916 -14312 -5908 -5476 -4954 -4458 -323 -7482 -9841 -9125 -5463 -4111 1042 2758 -429
3660 -429 -300 5470 3878 9552 3897 3226 6486 5417 -169 3706 4804 8067 2783 -2677 -3004 -1225
3644 -1225 -5930 -11476 -12376 -5187 1730 -1636 -1841 6 -2302 -454 2450 1476 -1991 -8660 -8216 -1024
3628 -1024 10267 8720 3827 2866 845 465 1014 -867 603 4461 2479 1010 -497 1713 -795
3613 -795 -3172 -240 3923 7845 5322 831 -4095 -3962 -3642 -5942 -9738 -7075 4439 5279 8202 10986
3597 10986 2263 -4011 -9859 -6820 4011 2332 -6469 -7679 -7076 -4698 -1451 -3205 -2321 -3597 -3896
3582 -3896 -5189 -3892 -639 873 -1106 1829 3714 2960 -913 362 431 6494 4684 -1392 -2995 -9435
3566 -9435 -15255 -11520 -6373 -1879 -1825 -5059 743 6694 36 -9254 -11887 246 11276 6461 4174
$$ packed form
3676e560m388j968k396Q404M32N22M96M135p159k359P16L662J352N153J716l187
3660d29J29N770j592N674n655o71L260j069n586L875J098L263n284n460l27J779
3644a225m705n546r00P189O917l366k05J847k308J848K904r74l467o669M44P192
3628a024J1291j547m893r61k021l80N49j881J470L858j982j469j507K210k508
3613g95k377K932M163L922k523m491m926J33L20k300l796K663J1514Q40K923K784
3597A0986q723o274n848L039J0831j679q801j210O03K378L247j754Q84j276k99
3582c896j293J297L253J512j979K935J885p54l873J275O9O063j810o076j603o440
3566i435n820L735N147M494N4l234N802N951o658r290k633J2133J1030m815k287
$$ plain form
3551 4174 3004 2950 8469 4402 -1533 -9833 -13423 -11972 -8740 -4473 -5218 -6269 -8553 -3141 -7476 -13753
3535 -13753 -17022 -12155 -7485 -1350 -2907 -2698 4143 5787 6183 1371 -1366 1014 6456 9367 11951
3520 11951 10832 14642 14459 9916 -3372 -8722 -8403 -8019 -951 -438 -9081 -7186 -3485 -4378 -10 13
3504 13 3937 1768 -1533 -10018 -9850 -8586 -10534 -7597 -3732 -2786 2219 5591 1454 -1445 3575 8327
3488 8327 4368 7102 15500 11197 1762 -3240 -144 8118 13583 18050 14887 10259 13028 14596 13915
3473 13915 6373 -2165 -3216 -6400 3400 5637 -1874 2537 2737 3404 4492 3363 -4800 -8171 -5448
3458 -5448 -3034 -6811 -10283 -7155 -1072 -211 2232 5895 5018 6719 -2395 -5352 -6366 -6451 -7434 -6109
3442 -6109 -17641 -17212 -10807 -3324 -5044 -7839 -8548 -7774 -9839 -6268 -2551 -613 -6685 -10475 -6907
$$ packed form
3551D174j170n4N519m067n935q300l590J451L232M267p45j051k284N412m335o277
3535a3753l269M867M670O135j557K09O841J644L96m812k737K380N442K911K584
3520A1951j119L810j83m543j3288n350L19L84P068N13q643J895L701q93M368K3
3504A3L924k169l301q485J68J264j948K937L865R46N005L372m137k899N020M752
3488H327l959K734Q398m303r435n002L096Q262N465M467l163m628K769J568o81
3473A3915p542q538j051l184R800K237p511M411K00O67J088j129q163l371K723
3458e448K414l777l472L128O083Q61K443L663q77J701r114k957j014q5r83J325
3442f109j1532M29O405P483j720k795p09P74k065L571L717J938o072l790L568
$$ plain form
3427 -6907 -3492 1501 7834 6096 2171 -5718 -9534 -3941 -1203 -5184 -11495 -15916 -16469 -14459 -17033
3412 -17033 -18246 -17104 -15430 -10918 -12345 -12270 -6994 -9360 -8373 699 7947 8205 4180 1878 4109 -88
3396 -88 607 -7224 -10989 -5619 -3609 1135 5179 5865 10955 8843 6811 -900 -143 -4948 -6129 -404
3380 -404 -6399 -10134 -5583 1755 5000 501 -5936 1593 5446 -1983 -2311 2887 7549 13666 16554
3365 16554 12030 4738 -2475 -7908 -10773 -5570 -6824 -4789 -8659 -13298 -11730 -4186 -1226 -5467 -8559
3350 -8559 -6049 -4391 1950 5034 2200 -1764 1643 580 -902 -1583 -5917 -3779 3346 2678 3552 4520
3334 4520 -4907 -5586 -2038 2937 3586 2632 1016 4035 3157 -455 -6267 -11141 -5878 -545 283 -1351
3318 -1351 2675 4565 1815 1154 3204 2978 -560 -4107 -4223 -8601 -8626 -7847 -8312 -15045 -14299 -5285 -4487
$$ packed form
3427f907L415M993O333j738l925p889l816N593K738l981o311m421n53K010k574
3412a7033j213J142J674M512j427P5N276k366R87R072P248K58m025k302K231m197
3396h8O95p831l765N370K010M744M044O86N090k112k032p711P57m805j181N725
3380d04n995l735M551P338L245m499o437P529L853p429l28N198M662O117K888
3365A6554m524p292p213n433k865N203j254K035l870m639J568P544K960m241l092
3350h559K510J658O341L084k834l964L407j063j482o81m334K138P125o68Q74R68
3334D520r427o79L548M975O49r54j616L019q78l612n812m874N263N333Q28j634
3318a351M026J890k750o61K050k26l538l547j16m378k5P79m65o733P46R014P98
$$ plain form
3301 -4487 -5938 -5405 -4962 -5732 -7416 -5165 -3185 -450 4093 7353 9960 8404 3966 5105 1778 2407
3285 2407 -3026 -6607 8 3568 -879 -2337 -4459 3065 197 -5708 -1361 -411 1647 3634 9796
3270 9796 14608 15653 13524 11010 10800 8621 -73 -998 -2274 -2251 442 -3093 -4118 -2488 4226 8335
3254 8335 898 4468 3123 285 2621 5085 -4675 -7653 -6806 351 4317 3409 5255 7281 4015
3239 4015 -1607 579 5814 -2047 3487 8571 5254 -2318 -6506 -1946 5861 9129 8033 8395 5580
3224 5580 4154 2935 -1040 -1061 -5091 -9643 -5538 -2825 -2705 2502 -3174 -9622 -4303 -8048 -9314 -4656
3208 -4656 -2147 -243 2542 2936 4421 3752 -2820 -10198 -11998 -10782 -9463 -4853 176 3599 -3482
3193 -3482 -8275 -1632 3763 1040 -5072 -974 -3141 -7576 -2295 -2985 -6304 -1819 1233 -466 -1960
$$ packed form
3301d487j451N33M43p70j684K251J980K735M543L260K607j556m438J139l327O29
3285B407n433l581O615L560m447j458k122P524k868n905M347R50K058J987O162
3270I796M812J045k129k514k10k179q694r25j276K3K693l535j025J630O714M109
3254H335p437L570j345k838K336K464r760k978Q47P157L966r08J846K026l266
3239D015n622K186N235p861N534N084l317p572m188M560P807L268j096L62k815
3224E580j426j219l975k1m030m552M105K713J20N207n676o448N319l745j266M658
3208d656K509J904K785L94J485o69o572p378j800J216J319M610N029L423p081
3193c482m793O643N395k723o112M098k167m435N281o90l319M485L052j699j494
$$ plain form
3178 -1960 -35 -5544 -5355 -10688 -15552 -15360 -8253 -4686 -1697 1623 -4894 -3901 -3421 -2659 -1569 -694
3162 -694 -6566 -4071 -3810 -4789 -3495 -184 -5417 -4510 -6280 -9434 -11597 -8250 -10868 -10852 -8482 -5881
3146 -5881 1710 128 -163 4823 8558 2451 -4432 -1107 -1126 5557 3014 -86 -34 -219 -1791 1426
3130 1426 7708 16364 10856 1950 -6160 -9232 -7556 -3185 -4425 -7554 -5997 -4369 -9626 -10635 -10030
3115 -10030 -9120 -5195 -315 3655 1390 2763 2099 -5139 -3681 1324 4104 6018 755 1164 6740
3100 6740 5225 -2735 -6827 -8353 -8569 -4426 3636 -3773 177 389 2335 -3190 -2779 3 2272 11902
3084 11902 16052 9991 6009 2279 -806 -2877 -3271 -2806 625 1285 764 2357 2935 -301 -2397 -2653
3068 -2653 -4370 -3414 8593 11357 249 -739 3668 6196 1655 -2348 -4524 5894 9526 4967 1669
$$ packed form
3178a960J925n509J89n333m864J92P107L567K989L320o517R93M80P62J090Q75
3162f94n872K495K61r79J294L311n233R07j770l154k163L347k618J6K370K601
3146e881P591j582k91M986L735o107o883L325j9O683k543l100N2j85j572L217
3130A426O282Q656n508q906q110l072J676M371j240l129J557J628n257j009O05
3115a0030R10L925M880L970k265J373o64p238J458N005K780J914n263M09N576
3100F740j515p960m092j526k16M143Q062p409L950K12J946n525M11K782K269R630
3084A1902M150o061l982l730l085k071l94M65L431O60n21J593N78l236k096k56
3068b653j717R56J2007K764j1108r88M407K528m541m003k176J0418L632m559l298
$$ plain form
3053 1669 3403 2231 5587 6182 8697 8813 11905 9262 5050 5351 -539 -4225 -5826 -13273 -12634 -12825
3037 -12825 -8304 -8016 -11363 -5450 2544 5142 8460 9361 2436 -727 -3879 -4912 -3396 -2389 -1059
3022 -1059 -187 2761 -2464 -5887 -5525 5055 9290 2924 4414 -3169 -5354 5086 4264 3861 3543 -2783
3006 -2783 -3261 294 2498 2950 33 1106 -623 -4799 -10630 -6475 3521 7389 8114 7202 50 -4251
2990 -4251 -1493 -1816 -3738 -2111 -160 1138 2062 1659 490 -248 -2292 -5555 -1600 6818 5511 660
2974 660 3392 -4437 -9003 -3864 191 808 -6354 -8510 -12769 -10567 -8196 -4424 -1940 -2296 -9692 -9316
2958 -9316 55 3728 13156 15589 3172 -6180 -14494 -15723 -13151 -13564 -10140 -10145 -10043 -9264 -9511 -6565
2942 -6565 3600 7262 3850 -2280 -7185 -3017 1705 294 -6756 -3311 -1257 987 470 -3730 -11392
$$ packed form
3053A669J734j172L356N95K515J16L092k643m212L01n890l686j601p447O39j91
3037a2825M521K88l347N913P994K598L318R01o925l163l152j033J516J007J330
3022a059Q72K948n225l423L62J0580M235o366J490p583k185J0440q22m03l18o326
3006b783m78L555K204M52k917J073j729m176n831M155R996L868P25r12p152m301
2990d251K758l23j922J627J951J298R24m03j169p38k044l263L955Q418j307m851
2974F60K732p829m566N139M055O17p162k156m259K202K371L772K484l56p396L76
2958i316R371L673R428K433j2417r352q314j229K572m13L424nJ02P79k47K946
2942f565J0165L662l412o130m905M168M722j411p050L445K054K244n17m200p662
$$ plain form
2927 -11392 -8550 1027 -2322 1335 5186 6131 3851 2309 3819 7785 3528 2239 2360 2210 4080
2912 4080 3952 4205 10450 11779 8409 6930 9735 4508 478 -5278 -7396 -514 2822 120 -2737
2897 -2737 919 3551 1889 4343 8589 1309 -796 1844 4475 4503 -3238 -3988 -2520 -4514 -3937 -2309
2881 -2309 -3956 -8580 -11058 87 2191 2341 4657 7115 219 238 -380 357 4528 6220 6005 1146
2865 1146 -278 -2151 -2368 3629 6303 6825 2434 8282 11364 1810 -3128 -6593 -4838 714 -1779
2850 -1779 -6195 -13820 -15523 -12724 -5895 -1581 227 -5228 -10272 -9081 -7258 -2231 4190 5969 6014
2835 6014 1826 3704 1229 -4379 -2246 858 4429 -1206 644 -3612 -3055 -5307 -2269 7663 8848
2820 8848 2405 -1130 -4488 -6317 -7877 -6737 -2805 2555 1659 -673 -5224 -8911 -4969 893 -279
$$ packed form
2927a1392K842R577l349L657L851R45k280j542J510L966m257j289J21j50J870
2912D080j28K53O245J329l370j479K805n227m030n756k118O882L336k702k857
2897b737L656K632j662K454M246p280k105K640K631K8p741p50J468j994N77J628
2881b309j647m624k478J1145K104J50K316K458o896J9o18P37M171J692k15m859
2865A146j424j873k17N997K674N22m391N848L082r554m938l465J755N552k493
2850a779m416p625j703K799O829M314J808n455n044J191J823N027O421J779M5
2835F014m188J878k475n608K133L104L571n635J850m256N57k252L038R932J185
2820H848o443l535l358j829j560J140L932N360q96k332m551l687L942N862j172
$$ plain form
2805 -279 1103 7608 10097 9948 1716 -2423 -5640 -8168 -3065 4354 4561 764 -63 2111 5512 6316
2789 6316 8692 14389 20815 19227 21525 19222 22156 20888 12840 6898 6403 6841 3131 -174 581 8082
2773 8082 12558 6052 7344 7760 7839 9183 11088 10784 5398 8599 6683 2387 1989 4909 3957 2978 -2357
2756 -2357 -1938 894 -3303 -2715 -1811 -8103 -14807 -11079 -5850 -5417 -8919 -2765 -7216 -10329 -8239 -11786
2740 -11786 -8990 -10147 -5072 -6213 -6105 -1642 -4967 -2157 5105 8875 3359 -3160 -14416 -20407 -17726
2725 -17726 -11366 -7039 185 -2247 -10162 -6704 -2955 -690 2592 3114 1046 5824 1805 1598 -2644
2710 -2644 -979 -2744 -1162 -1664 -863 260 -4952 -6642 -5927 1212 11402 12506 14448 6459 2735
2695 2735 1826 4549 494 -6866 -5775 -10120 -15935 -15678 -17051 -12307 -5444 -1495 2770 857 -1511
$$ packed form
2805b79J382O505K489j49q232m139l217k528N103P419K07l797q27K174L401Q04
2789F316K376N697O426j588K298k303K934j268q048n942m95M38l710l305P55P501
2773H082M476o506J292M16P9J344J905l04n386L201j916m296l98K920r52r79n335
2756b357M19K832m197N88R04o292o704L728N229M33l502O154m451l113K090l547
2740a1786K796j157N075j141J08M463l325K810P262L770n516o519j1256n991K681
2725a7726O360M327P224k432p915L458L749K265L282N22k068M778m019k07m242
2710b644J665j765J582n02Q01J123n212j690P15P139J0190J104J942p989l724
2695B735r09K723m055p360J091m345n815K57j373M744O863L949M265j913k368
$$ plain form
2680 -1511 1328 6090 4670 7637 4790 4907 8495 5795 3215 -1193 -8643 -7631 -8734 -8223 -6522
2665 -6522 361 6131 6486 7569 1121 -1791 -2032 991 5462 1207 -5759 -5738 -7611 319 10430 6400
2649 6400 9010 10089 6992 386 5094 7970 7954 4635 -2234 -4331 259 1476 190 1888 -550
2634 -550 559 -3840 -748 3626 1888 1970 -640 1428 2949 8600 2314 -3972 -6517 -4723 -221 3612
2618 3612 -1479 -2282 -3200 -5933 682 4016 8053 3352 -87 1925 6858 6553 2496 -3924 -3455 -1287
2602 -1287 -1233 6064 8742 10465 14801 17788 14787 8937 5752 4702 4878 4298 244 -4644 -2399 -644
2586 -644 1006 -5387 -9113 -6710 5583 5900 -6155 -5787 -585 3777 9570 9161 7313 2475 -383
2571 -383 2073 6838 9720 7525 5714 5025 4889 619 83 1436 1395 749 5446 5049 5086 393 -2055
$$ packed form
2680a511K839M762j420K967k847J17L588k700k580m408p450J012j103N11J701
2665f522O883N770L55J083o448k912k41L023M471m255o966K1j873P930J0111m030
2649F400K610J079l097o606M708K876j6l319o869k097M590J217j286J698k438
2634e50J109m399L092M374j738Q2k610K068J521N651o286o286k545J794M502L833
2618C612n091q03r18k733O615L334M037m701l439K012M933l05m057o420M69K168
2602a287N4P297K678J723M336K987l001n850l185j050J76n80m054m888K245J755
2586f44J650o393l726K403J2293L17j2055L68N202M362N793m09j848m838k858
2571c83K456M765K882k195j811o89j36m270n36J353m1o46M697l97L7m693k448
$$ plain form
2554 -2055 -1431 -4701 -3735 -4144 -2258 6030 7314 6323 5409 2073 -4661 -4819 -6734 -8398 -6392 -10741
2538 -10741 -8766 -7080 -5143 3724 7340 9946 10585 7087 4164 -4624 -12659 -16912 -12643 -14308 -12876
2523 -12876 -7495 -5972 -2846 -956 -8795 -10555 -9726 -12386 -13412 -12158 -9895 -13457 -11390 -6828 -4471
2508 -4471 -5242 -12057 -12566 -8847 -4292 3996 3507 3967 5166 3571 3530 -5892 -7286 -3242 -279 -5346
2492 -5346 -1574 567 -2321 -6231 -7116 -5591 -2619 5318 -1396 -4869 -8513 -13277 -14662 -8894 -7406
2477 -7406 -2474 827 2031 -2254 -73 4374 3752 5145 5162 2183 4899 5980 5720 817 -7053 -8768
2461 -8768 -7054 -7429 3682 1135 -396 -4085 -3204 2516 779 -4578 -3868 873 -2093 -4585 -8395
2446 -8395 -3956 1884 6938 4707 852 5001 10205 11101 8556 9724 5084 -8755 -8995 -5831 -6737
$$ packed form
2554b055O24l270R66m09J886Q288J284r91r14l336o734j58j915j664K006m349
2538a0741J975J686J937Q867L616K606O39l498k923q788q035m253M269j665J432
2523a2876N381J523L126J890p839j760Q29k660j026J254K263l562K067M562K357
2508d471p71o815n09L719M555Q288m89M60J199j595m1r422j394M044K963n067
2492e346L772K141k888l910q85J525K972P937o714l473l644m764j385N768J488
2477g406M932L301J204m285K181M447o22J393J7k979K716J081k60m903p870j715
2461h768J714l75J1111k547j531l689Q81N720j737n357P10M741k966k492l810
2446h395M439N840N054k231l855M149N204Q96k545J168m640j3839k40L164r06
$$ plain form
2431 -6737 -6595 -2518 4501 7009 4152 2715 -3145 -1520 4862 1664 -6278 -3482 1542 540 -4404
2416 -4404 -4257 2714 1159 -746 -3076 -4381 -3014 -1787 -336 5093 392 -1410 -674 6209 12862
2401 12862 18511 16923 16494 15465 6649 -947 -2803 -7166 -8658 -11529 -4311 5431 9463 2253 918
2386 918 3751 3611 1479 -1640 -1447 -1178 -4791 -3919 -4119 -1765 -4750 -4988 -6593 -1862 1294 1920 3703
2369 3703 -1960 -8712 -8945 -12670 -4366 -205 320 1055 4868 12314 12702 8434 4631 2672 -1229 869
2353 869 7037 7382 891 1978 4134 2942 -2298 -3719 -3829 2712 2810 1355 2335 7589 5072 3368
2337 3368 8495 6254 3365 2184 -2381 -6256 -3993 -2311 -192 2475 5493 6029 4925 -1365 -899
2322 -899 -3229 -4669 -2467 5038 9174 6104 3625 5138 9259 8087 1476 5579 11873 14629 14846
$$ packed form
2431f737J42M077P019K508k857j437n860J625O382l198p942K796N024j002m944
2416d404J47O971j555j905k330j305J367J227J451N429m701j802P36O883O653
2401A2862N649j588m29j029q816p596j856m363j492k871P218R742M032p210j335
2386I18K833j40k132l119J93K69l613Q72k00K354k985k38j605M731L156O26J783
2369C703n663o752k33l725Q304M161N25P35L813P446L88m268l803j959l901K098
2353H69O168L45o491J087K156j192n240j421j10O541R8j455R80N254k517j704
2337C368N127k241k889j181m565l875K263J682K119K667L018N36j104o290M66
2322h99k330j440K202P505M136l070k479J513M121j172o611M103O294K756K17
$$ plain form
2307 14846 9935 6477 1389 -1316 -2086 2189 -1251 -7964 -12232 -1005 1390 -3766 -10084 -7185 -9172
2292 -9172 -11943 -16013 -17408 -13892 -6334 -1547 -2632 -3324 -3503 610 6046 8749 5661 4769 -3027 762
2276 762 8852 7004 4969 11405 13638 13693 12784 11538 8546 10221 11354 6730 9087 5472 1983 4851
2260 4851 5094 1536 3352 4972 2678 3892 3992 65 1983 996 -2490 -5568 -6049 -4454 -4014 -6717
2244 -6717 -6006 8243 9072 426 -4580 -4428 -12305 -7088 2357 2647 -3169 -4736 387 1136 8606 14695
2228 14695 10163 5652 -1980 -687 2048 2738 -635 -4344 -8097 -3072 -488 1772 3282 125 215
2213 215 -2113 -2456 1092 2559 6578 6555 6863 8496 -2529 -11388 -11294 -8843 886 5293 3027 3694 6576
2196 6576 8105 6001 6768 11728 12247 12394 10605 8098 7531 4408 1017 -548 -6090 -3017 -5571 -6099
$$ packed form
2307A4846m911l458n088k705p70M275l440o713m268J1227K395n156o318K899j987
2292i172k771m070j395L516P558M787j085o92j79M113N436K703l088q92p796L789
2276G62Q090j848k035O436K233N5r09j246k992J675J133m624K357l615l489K868
2260D851K43l558J816J620k294J214J00l927J918r87l486l078m81J595M40k703
2244f717P11J4249Q29q646n006J52p877N217R445K90n816j567N123P49P470O089
2228A4695m532m511p632J293K735O90l373l709l753N025K584K260J510l157R0
2213B15k328l43L548J467M019k3L08J633j1025q859R4K451R729M407k266O67K882
2196F576J529k104P67M960N19J47j789k507n67l123l391j565n542L073k554n28
$$ plain form
2180 -6099 -6407 -3284 3652 2881 1533 4243 11427 13019 9580 6732 3077 3296 5967 3721 2137 -931
2164 -931 -4572 -7655 -6091 -6352 -5576 2376 5409 5739 3469 -985 2376 4317 9281 14610 10591 8107
2148 8107 2356 -1262 -4378 370 5631 3438 4027 4744 841 614 6149 2165 -5538 -294 8363 10321
2132 10321 10249 5107 55 -4160 -6983 -8894 -5556 -3377 -2772 -5884 -4755 -5623 -10846 -12987 -10209 -10888
2116 -10888 -11785 -9285 -8144 -3606 3765 8555 7006 11652 16613 19951 12932 11098 13679 7628 13628
2101 13628 12113 4628 6511 6673 10234 13377 12844 12323 626 -5901 -2105 1307 4919 6564 7930
2086 7930 12221 1754 -3372 -668 4256 2694 3763 5702 8908 8807 7274 4135 1354 -1498 8029
2071 8029 12707 9568 2021 4626 3341 3878 -3597 -10793 -14294 -7572 -3571 -5308 -7671 -3169 5245
$$ packed form
2180f099l08L123O936p71j348K710P184J592l439k848l655K19K671k246j584l068
2164i31l641l083J564k61P76P952L033L30k270m454L361J941M964N329m019k484
2148H107n751l618l116M748N261k193N89P17l903k27N535l984p703N244Q657J958
2132A0321p2n142n052m215k823j911L338K179O05l112J129q68n223k141K778o79
2116a0888q97K500J141M538P371M790j549M646M961L338p019j834K581o051O000
2101A3628j515p485J883J62L561L143n33n21j1697o527L796L412L612J645J366
2086G930M291j0467n126K704M924j562J069J939L206j01j533l139k781k852R527
2071H029M678l139p547K605j285N37p475p196l501O722M001j737k363M502Q414
$$ plain form
2056 5245 4079 6538 8401 3658 -72 -2489 -3521 -9454 -8170 -6727 -9161 -10156 -5042 -4351 -15735
2041 -15735 -13075 -6621 -2518 -4167 586 2394 -605 -2706 2380 -629 -704 5720 6869 -594 -3548
2026 -3548 1120 3560 2073 1939 8571 5424 996 -940 6542 12084 8344 4161 4719 2581 2718 410
2010 410 -378 -1212 4338 8203 8438 12726 13811 9713 8636 8890 4842 1528 -4489 -10212 -9755 -3443
1994 -3443 -9740 -9870 -7824 -6333 -5016 -4738 -939 5403 12499 13321 8644 2906 831 -1655 -6269 -9638
1978 -9638 -3914 1280 -648 -1494 -147 1178 -1285 1712 3081 1501 -5386 -3007 -4845 -5868 -7232
1963 -7232 -8941 -9648 -6682 -5053 -6511 -11721 -12837 -13855 -8819 -8029 -7400 -4152 -5579 -6771 -6127 -1324
1947 -1324 5642 3736 3240 5931 14634 11895 6398 418 2232 2890 5187 7975 11053 1924 613
$$ packed form
2056E245j166K459J863m743l730k417j032n933J284J443k434r95N114O91j1384
2041a5735K660O454M103j649M753J808k999k101N086l009p5O424J149p463k954
2026c548M668K440j487j34O632l147m428j936P482N542l740m183N58k138J37k308
2010D10p88q34N550L865K35M288J085m098j077K54m048l314o017n723M57O312
1994c443o297j30K046J491J317K78L799O342P096Q22m677n738k075k486m614l369
1978i638N724N194j928q46J347J325k463K997J369j580o887K379j838j023j364
1963g232j709p07K966J629j458n210j116j018N036P90O29L248j427j192O44M803
1947a324O966j906m96K691Q703k739n497n980J814O58K297K788L078r129j311
$$ plain form
1932 613 7501 -2892 -11231 -8279 -5661 -4902 -4233 5161 7277 4750 1901 3123 5275 8977 14750
1917 14750 12585 8172 4001 1207 -4730 -8390 -9007 -5946 -1082 144 -3358 -697 6769 7027 -1903
1902 -1903 -6378 1916 4971 4407 7175 9586 12372 3915 -821 -6412 -6244 -8397 -3519 1581 3121
1887 3121 879 -6349 -8123 -5442 -4615 -2458 748 817 -665 -14 -2894 -6022 -940 -5926 -5242 2649
1871 2649 3522 1445 -4882 -7884 -5234 4758 787 -4216 -5529 -5014 -10436 -6712 -4114 -5050 4693 9198
1855 9198 473 4497 2755 957 -2177 -1177 -6082 -6382 -8203 -1915 1415 -2588 -4794 -8723 -5058
1840 -5058 2044 5700 5599 1823 321 4952 4296 9971 12353 3876 1682 2302 6858 2528 5229 7987
1824 7987 5254 6364 2071 900 -5204 -4323 360 7664 7944 9420 9439 3254 542 4720 7368 2066
$$ packed form
1932F13O888j0393q339K952K618P59O69R394K116k527k849J222K152L702N773
1917A4750k165m413m171k794n937l660o17L061M864J226l502K661P466K58q930
1902a903m475Q294L055n64K768K411K786q457m736n591J68k153M878N100J540
1887C121k242p228j774K681Q27K157L206O9j482O51k880l128N082m986O84P891
1871B649Q73k077o327l002K650R992l971n003j313N15n422L724K598r36R743M505
1855I198q725M024j742j798l134J000m905l00j821O288L330m003k206l929L665
1840e058P102L656j01l776j502M631o56N675K382q477k194O20M556m330K701K758
1824G987k733J110m293j171o104Q81M683P304K80J476J9o185k712M178K648n302
$$ plain form
1808 2066 4006 6808 2621 -1395 -3701 -3467 -6778 -2150 -4252 -3617 -7467 -10411 -7127 -7492 -14016 -13952
1792 -13952 -7367 -1888 -605 1692 696 -3828 -7287 -5289 -3986 -630 -4912 -265 -691 -3336 -4025
1777 -4025 1245 5714 7902 5918 8859 8746 6458 11147 9433 5541 3564 8069 9939 5625 831
1762 831 -5459 -8591 -9829 -3463 -2283 6904 11692 16121 20854 14401 10068 2859 1581 6228 2696
1747 2696 1361 1323 -9137 -12197 -8154 -7128 -9447 -7062 -5890 2506 332 -1554 -2661 3082 6078
1732 6078 10905 8588 1145 5183 10257 13437 10270 9882 12622 7623 -428 -9750 -10041 -5309 4510
1717 4510 5097 -5559 -7463 -7054 -3486 2248 10331 7075 5445 4548 2952 2542 3157 -5281 -10322 -9777
1701 -9777 -5779 1013 -2748 -890 5599 12304 8120 4471 2617 2764 2869 4928 -3204 -128 3070
$$ packed form
1808B066J940K802m187m016k306K34l311M628k102O35l850k944L284l65o524O4
1792a3952O585N479J283K297r96m524l459J998J303L356m282M647m26k645o89
1777d025N270M469K188j984K941j13k288M689j714l892j977M505J870m314m794
1762H31o290l132j238O366J180R187M788M429M733o453m333p209j278M647l532
1747B696j335l8j0460l060M043J026k319K385J172Q396k174j886j107N743K996
1732F078M827k317p443M038N074L180l167l88K740m999q051r322k91M732R819
1717D510N87j0656j904M09L568N734Q083l256j630q97j596m10O15q438n041N45
1701i777L998O792l761J858O489O705m184l649j854J47J05K059q132L076L198
$$ plain form
1686 3070 9147 5297 4331 3350 -1991 -5823 -6024 -2984 -1519 -2328 -6056 -2630 -915 -8039 -8732 -9332
$$ packed form
1686C070O077l850r66r81n341l832k01L040J465q09l728L426J715p124o93o00
$$ [...]
##END NTUPLES=NMR SPECTRUM
##END=
