##TITLE=Analysis number 330029
Compound Code cc 59013
Book Reference 546/50
Project Code adrs
Chemist Name craigr
##JCAMPDX= 6.0         $$ Bruker NMR JCAMP-DX V2.0
##DATA TYPE= NMR SPECTRUM
##DATA CLASS= NTUPLES
##ORIGIN= Bruker BioSpin GmbH
##OWNER= nmr
$$ XWIN-NMR		Version 3.5
$$ Mon Oct 22 12:16:41 2007 GMT Daylight Time (UT+1h)  MAYBRIDGE\nmr@NMR_250MHZ
##.OBSERVE FREQUENCY= 250.131544655141
##.OBSERVE NUCLEUS= ^1H
##.ACQUISITION MODE= SIMULTANEOUS (DQD)
##.ACQUISITION SCHEME= undefined
##.AVERAGES= 16
##.DIGITISER RES= 18
##SPECTROMETER/DATA SYSTEM= dpx250
##.PULSE SEQUENCE= zg30
##.SOLVENT NAME= CDCl3
##.SHIFT REFERENCE= (INTERNAL, CDCl3, 0, 16.4582)
##AUDIT TRAIL= $$ (NUMBER, WHEN, WHO, WHERE, WHAT)
$$ ##TITLE= Audit trail, XWIN-NMR		Version 3.5
$$ ##JCAMPDX= 5.01
$$ ##ORIGIN= Bruker BioSpin GmbH
$$ ##OWNER= nmr
$$ C:\u/data/dgb/nmr/ADRS/1000/pdata/1/auditp.txt
$$ ##AUDIT TRAIL=  $$ (NUMBER, WHEN, WHO, WHERE, WHAT)
(   1,<2007-10-22 12:16:17.42 +100>,<MAYBRIDGE\nmr>,<NMR_250MHZ>,
      <created by zg, POWCHK disabled, PULCHK disabled
       configuration hash MD5:
       76 6E 9A 78 1E 09 19 81 EC 84 63 8F B0 6A 59 2D
       data hash MD5: 64K
       F3 E6 61 D0 57 34 E1 3D 8F 6C 88 A4 72 92 14 03>)
(   2,<2007-10-22 12:16:30.71 +100>,<MAYBRIDGE\nmr>,<NMR_250MHZ>,
      <Start of raw data processing
       ef LB = 0.3 FT_mod = 6 PKNL = 1 SI = 32K 
       data hash MD5: 32K
       95 F0 0F 29 28 9E E3 28 C8 37 E6 FB 82 AE 68 EE>)
(   3,<2007-10-22 12:16:32.43 +100>,<MAYBRIDGE\nmr>,<NMR_250MHZ>,
      <apk 
       data hash MD5: 32K
       52 75 97 98 21 BC DD 9C CA 7C 71 C7 F0 69 16 F0>)
(   4,<2007-10-22 12:16:33.15 +100>,<MAYBRIDGE\nmr>,<NMR_250MHZ>,
      <abs ABSG = 5 
       data hash MD5: 32K
       AA AD C7 C4 41 4A 0B 45 F0 90 E7 42 D6 F8 75 C1>)
$$ ##END=
$$ 
$$ hash MD5
$$ C1 C3 50 65 64 42 D2 FE B1 CD C4 07 FD A9 D2 10
##$RELAX= 
##$RELAX= 
##$RELAX= 
##$RELAX= 
##$RELAX= 
##$RELAX= 
##$RELAX= 
$$ Bruker specific parameters
$$ --------------------------
##$DU= <C:\u>
##$EXPNO= 1000
##$NAME= <ADRS>
##$PROCNO= 1
##$TYPE= <nmr>
##$USER= <dgb>
##$AMP= (0..31)
100 100 100 100 100 100 100 100 100 100 100 100 100 100 100 100 100 100 
100 100 100 100 100 100 100 100 100 100 100 100 100 100 
##$AQSEQ= 0
##$AQ_mod= 3
##$AUNM= <au_zg>
##$AUTOPOS= <22 >
##$BF1= 250.13
##$BF2= 250.13
##$BF3= 250.13
##$BF4= 250.13
##$BF5= 500.13
##$BF6= 500.13
##$BF7= 500.13
##$BF8= 500.13
##$BYTORDA= 1
##$CFDGTYP= 0
##$CFRGTYP= 5
##$CHEMSTR= <none>
##$CNST= (0..31)
1 1 145 1 1 1 1 1 1 1 1 1 1 1 1 1 1 1 1 1 1 1 1 1 1 1 1 1 1 1 1 1 
##$CPDPRG= <>
##$CPDPRG1= <>
##$CPDPRG2= <>
##$CPDPRG3= <>
##$CPDPRG4= <mlev>
##$CPDPRG5= <mlev>
##$CPDPRG6= <mlev>
##$CPDPRG7= <mlev>
##$CPDPRG8= <mlev>
##$CPDPRGB= <>
##$CPDPRGT= <>
##$D= (0..31)
0 1 0 0 0 0 0 0 0 0.06 0 0 0 0 0 0 0.0002 0 0 0 0 0 0 0 0 0 0 0 0 0 0 
0 
##$DATE= 1193051775
##$DBL= (0..7)
120 120 120 120 120 120 120 120 
##$DBP= (0..7)
150 150 150 150 150 150 150 150 
##$DBP07= 0
##$DBPNAM0= <>
##$DBPNAM1= <>
$$ [...]
##$SUBNAM7= <"">
##$SUBNAM8= <"">
##$SUBNAM9= <"">
##$SW= 20.6930455092707
##$SWIBOX= (0..15)
0 0 3 0 0 0 0 0 0 0 0 0 0 0 0 0 
##$SW_h= 5175.983436853
##$TD= 65536
##$TD0= 1
##$TE= 296.16
##$TE2= 300
##$TE3= 300
##$TEG= 300
##$TL= (0..7)
0 120 120 120 120 120 120 120 
##$TP= (0..7)
150 150 150 150 150 150 150 150 
##$TP07= 0
##$TPNAME0= <>
##$TPNAME1= <>
##$TPNAME2= <>
##$TPNAME3= <>
##$TPNAME4= <>
##$TPNAME5= <>
##$TPNAME6= <>
##$TPNAME7= <>
##$TPOAL= (0..7)
0.5 0.5 0.5 0.5 0.5 0.5 0.5 0.5 
##$TPOFFS= (0..7)
0 0 0 0 0 0 0 0 
##$TUNHIN= 0
##$TUNHOUT= 0
##$TUNXOUT= 0
##$USERA1= <user>
##$USERA2= <user>
##$USERA3= <user>
##$USERA4= <user>
##$USERA5= <user>
##$V9= 5
##$VALIST= <valist>
##$VCLIST= <CCCCCCCCCCCCCCC>
##$VD= 0
##$VDLIST= <DDDDDDDDDDDDDDD>
##$VPLIST= <PPPPPPPPPPPPPPP>
##$VTLIST= <TTTTTTTTTTTTTTT>
##$WBST= 1024
##$WBSW= 4
##$XGAIN= (0..3)
0 0 0 0 
##$XL= 0
##$YL= 0
##$YMAX_a= 401797
##$YMIN_a= -504896
##$ZGOPTNS= <>
##$ZL1= 120
##$ZL2= 120
##$ZL3= 120
##$ZL4= 120
##$ABSF1= 16.45823
##$ABSF2= -4.234943
##$ABSG= 5
##$ABSL= 3
##$ALPHA= 0
##$AQORDER= 0
##$ASSFAC= 0
##$ASSFACI= 0
##$ASSFACX= 0
##$ASSWID= 0
##$AUNMP= <proc_1d>
##$AZFE= 0.1
##$AZFW= 0.1
##$BCFW= 0
##$BC_mod= 0
##$BYTORDP= 0
##$COROFFS= 0
##$CY= 12.5
##$DATMOD= 1
##$DC= 0
##$DFILT= <>
##$DTYPP= 0
##$F1P= 14.0000005364418
##$F2P= -0.99999901652339
##$FCOR= 0.5
##$FTSIZE= 32768
##$FT_mod= 6
##$GAMMA= 0
##$GB= 0
##$INTBC= 1
##$INTSCL= 1
##$ISEN= 128
##$LB= 0.3
##$LEV0= 0
##$LPBIN= 0
##$MAXI= 10000
##$MC2= 0
##$MEAN= 0
##$ME_mod= 0
##$MI= 0
##$NCOEF= 0
##$NC_proc= -4
##$NLEV= 6
##$NOISF1= 0
##$NOISF2= 0
##$NSP= 0
##$NTH_PI= 0
##$NZP= 0
##$OFFSET= 16.45823
##$PC= 1
##$PHC0= 157.2342
##$PHC1= 8.59881
##$PH_mod= 1
##$PKNL= yes
##$PPARMOD= 0
##$PSCAL= 4
##$PSIGN= 0
##$REVERSE= no
##$SF= 250.130015949219
##$SI= 32768
##$SIGF1= 0
##$SIGF2= 0
##$SINO= 400
##$SIOLD= 32768
##$SREGLST= <1H.CDCl3>
##$SSB= 0
##$STSI= 32768
##$STSR= 0
##$SW_p= 5175.98343685301
##$SYMM= 0
##$S_DEV= 0
##$TDeff= 65536
##$TDoff= 0
##$TI= <Analysis number 999999
Compound Code 99
Book Reference 9
Project Code 9>
##$TILT= no
##$TM1= 0
##$TM2= 0
##$TOPLEV= 0
##$USERP1= <user>
##$USERP2= <user>
##$USERP3= <user>
##$USERP4= <user>
##$USERP5= <user>
##$WDW= 1
##$XDIM= 32768
##$YMAX_p= 470615063
##$YMIN_p= -173139
$$ End of Bruker specific parameters
$$ ---------------------------------
##NTUPLES= NMR SPECTRUM
##VAR_NAME=  FREQUENCY,     SPECTRUM/REAL,   SPECTRUM/IMAG
##SYMBOL=    X,             R,               I
##VAR_TYPE=  INDEPENDENT,   DEPENDENT,       DEPENDENT
##VAR_FORM=  AFFN,          ASDF,            ASDF
##VAR_DIM=   32768,         32768,           32768
##UNITS=     HZ,            ARBITRARY UNITS, ARBITRARY UNITS
##FACTOR=    0.157963299565203, 1,           1
##FIRST=     4116.69709850969, 0,            0
##LAST=      -1059.28633834332, 0,           0
##MIN=       -1059.28633834332, -173139,     0
##MAX=       4116.69709850969, 470615063,    0
$$ Real data points
##PAGE= N=1
##DATA TABLE= (X++(R..R)), XYDATA
$$ [...]
15727B5799l5484l7793L1453q022p1346k1684M0829J4881M123j5754m5226J5882
15715a02342N248J4798N6420J5697j8085l260J8387j6642l3615l4903K6871M0620
15703c0806L0102L1083l4654o2664j0214K3013K1723o436M8094M4750R972L6116
15691A00079r347m8750m4187l1329n3118J8032N4109K1435L0417K0563j054L0123
15679H6973n7809o8883r326L9146P083j1503K5217R343j0141j5222l0543N95p819
15666d2889J8998J726l5916k4131p544k1013L5658K2754J9582o718m2927J4896
15654f7524J6398L562l4811k0606M2934L5943L7547j065q738J4007L6643o7908
15642a3618l7670k0856J7059O4598J652j7809L8k1392O819j50j2630k8333O466
$$ y = [25799, -9685, -47478, -16025, -24047, -95393, -117077, -76248, -61367, -57244, -72998, -118224, -102342, -97094, -82296, -25876, -10179, -28264, -31524, -13137, -29779, -63394, -98297, -71426, -30806, -704, 30379, -4275, -66939, -77153, -54140, -32417, -38853, 9241, 53991, 63963, 100079, 90732, 41982, -2205, -33534, -86652, -68620, -14511, 6924, 37341, 57904, 56850, 86973, 29164, -39719, -49045, -9899, -2816, -14319, 10898, 20241, 10100, -5122, -35665, -35070, -42889, -23891, -22165, -58081, -82212, -89756, -110769, -75111, -52357, -32775, -39493, -82420, -67524, -51126, -47564, -82375, -102981, -60047, -24104, 13443, 12378, 3640, 17647, 54290, -13618, -51288, -72144, -55085, 9513, 11165, -6644, -6606, -27998, -21179, -21329, -33959, -62292, -55826]
15629e5826M9889J2194j964O401l977n0696O311L1464K00q725M6566M753j8412
15616A8178j2755m6946m4681J8079P349j2281m2369M9490J0569M4616N4360Q768
15604E2377O718J2123l9656l9980j952K3294P705o865Q783m657q3975o91K5040
15591d1736Q969Q691l9311k6722L7946L4881L8891q502l6529r143J0641L2492
15579A0568J3842R753j0463J389k3329k949J7427O10k4480j0755K4150K6246j7684
15566A4325M749n003L0152J3869j6651j2544J4580K0577q647J2906m065j4631
15554D9617O493p609K5587m491Q148K2684K8328l8149J5974J578k5197J0633r209
15541H4387m6637j5118l8840k4273j6010J159P4071M2134J9033J1400j1725m2761
$$ y = [-55826, -5937, 6257, 4293, 10694, 6717, -43979, -37668, -6204, -6004, -14729, 31837, 36590, 18178, 5423, -41523, -86204, -68125, -60776, -73057, -115426, -65936, -55367, -10751, 43609, 52377, 59095, 71218, 31562, -8418, -10370, 12924, 20629, 13764, 22547, 17890, -66085, -66776, -41736, -32767, -24076, -63387, -90109, -52163, -17282, 21609, 13107, -23422, -32565, -21924, 10568, 24410, 34163, 23700, 25089, 1760, -1189, 16238, 16848, -7632, -18387, 5763, 32009, 14325, 19074, 14071, 44223, 58092, 41441, 28897, 43477, 64054, 55407, 68313, 64248, 49617, 56110, 48501, 74088, 69597, 77745, 100429, 128757, 90608, 106582, 108160, 82963, 93596, 84387, 37750, 22632, -16208, -40481, -56491, -55332, 18739, 60873, 79906, 91306, 79581, 36820]
15529C6820O061k2266m7616O1735P0897O776l4534j6713n8724k2036N514J2311
15517a775J3686L447j2184P6292M8955J6092m7461j2989j8400m2437j6218O456
15505A3464K2868j8805k5668Q840m5622J5497L6273q862j8416L6239P245o1976
15493c8923l230R555J0316O2933k4006n9624J5534L298K6645L0082l3108k8849
15481b9377n410K6145J9552K3949K779k515K2881l8550R929L2660k7292Q403J653
15468D4807n0701L6457n572j0204J0759m5502n113m2517j8137L0962P8073M7936
15456G1248k4270m1756O485j236J8977N681l1625j4185N398l259J5516j2005K2626
15443A7595L2292j9537m2147J9387K8715k0370L0062j2446m1149m5306J5610l7233
$$ y = [36820, 42881, 20615, -27001, 34734, 105631, 112407, 77873, 61160, 2436, -19600, -14086, -1775, 11911, 15358, 3174, 79466, 128421, 144513, 97052, 84063, 65663, 23226, 7008, 13464, 36332, 17527, -8141, 699, -44923, -29426, 6847, -2015, -20431, 15808, 23053, -38923, -42153, -32598, -22282, 40651, 16645, -42979, -27445, -24147, 2498, 32580, -528, -29377, -34787, -8642, 10910, 34859, 37638, 35123, 58004, 19454, 29383, 62043, 34751, 43154, 44807, -5894, 30563, 24991, 14787, 25546, -19956, -25069, -67586, -85723, -54761, 23312, 71248, 46978, 5222, 11707, 10471, 29448, 35129, 3504, -10681, -5283, -8542, 6974, -5031, 17595, 49887, 30350, -11797, 7590, 36305, 15935, 45997, 33551, -7598, -52904, -37294, -74527]
15431g4527J1080N3682N8111j1422m6939j8070M0282O6842L510m9782l5664n0020
15419e2917l4746j0544L7153R6045j3255m0240j8118l5075j6338J5868N3459Q24
15407a7884j3708k1951k1281l8895j7307J412J1917K0482N6195j6848Q296O9755
15395B0183j6079j2754p111M1378L392J2525J105j5040J9596J7858k0695l8442
15383E916O463l1293L5821J1814J5369n759k0321k7782P467J1061K882R151k0286
15370E03j3676j1088j3513J9269Q589O7217N3288n39o9960k8507n583K0468K5799
15357E2267o661n9156j5522K9606p962J6014K5113M943n2108n4301j1124O8828
15345a0063J3502k8183O2592l485n6385K0142o697J9928K1161j8199L643l229
$$ y = [-74527, -63447, -9765, 48346, 36924, -10015, -28085, 12197, 79039, 82549, 32767, -2897, -52917, -87663, -98207, -61054, 34991, 21736, -18504, -36622, -71697, -88035, -72167, -18708, -17884, -31592, -53543, -74824, -113719, -131026, -129614, -117697, -97215, -41020, -57868, -49572, 20183, 4104, -8650, -15761, 25617, 29009, 41534, 42639, 27599, 47195, 65053, 44358, 5916, 12379, -18914, 16907, 28721, 44090, 38331, 18010, -9772, -2305, 8756, 11638, 20789, 503, -13173, -24261, -37774, -18505, -9916, 57301, 110589, 110050, 40090, 11583, 6000, 26468, 52267, 45606, -13550, -29072, 534, -7428, 8586, 33699, 38642, -13466, -67767, -78891, -10063, 3439, -24744, 37848, 34363, -22022, -1880, -8577, 11351, 32512, 14313, 17956, 14727]
15333A4727j1502K5712J4719j2527J7093J988J6307M321k6517l6879r207Q908
15321G143K532p513m3382k6691K1912J2745M8165J7940m6570j009J7120j8417
15309a6025k4096j2066L7322J7206m7212O389j8043k6685L1611M9788M1727k4816
15297A5100k1737n527J1998m2672Q066L0304N0416n1461k5811J7796j1047j5415
15285c9990j3699K083J318L1558L43K8639J4597K753J8059k4700l3236k0330K5567
15272g038N7274M505l3468j2940K2665j8864J9378N3584j0033k1991r343J655
15260D5384J2480j8739j5046n2478j6157K0158R769J0402l5875j7807N1979M0014
15248C4084J0241n658j2802l6048m3828P3619L2784k3150n5959j3159j3758j2984
$$ y = [14727, 3225, 28937, 43656, 31129, 48222, 50210, 66517, 70838, 44321, 7442, -1765, 7143, 9675, 2162, -41220, -67911, -45999, -33254, 14911, 32851, -13719, -14728, 2392, -16025, -40121, -52187, -14865, 2341, -44871, -38482, -56525, -83210, -51599, -1811, 39916, 15100, -6637, -12164, -166, -42838, -34772, -4468, 45948, -5513, -31324, -13528, -24575, -39990, -53689, -51606, -50288, -18730, -18387, 10252, 24849, 27602, 45661, 20961, -12275, -32605, -7038, 50236, 54741, 21273, 8333, 30998, 12134, 31512, 85096, 75063, 53072, 43729, 45384, 57864, 39125, 24079, -28399, -44556, -24398, -14629, -4227, -40102, -57909, -5930, 34084, 44325, 38667, 25865, -10183, -54011, 19608, 52392, 29242, -26717, -39876, -53634, -66618]
15236f6618q433k840M1178L9136n218j2658P561j1509M4285P744k7264k1452j0333
15223b6421N876q036l433K704R283l9453p406K0641N2904N4100k681m4249k4313
15210a0484q743j3386q399L5760N8291M2093J4496n0800q881j0993M297K3206
15198F6457k3370l0360p431l4696M39J1160n881L7756k3136o3654J1812J4891
15186d6013K7312N021K0736K7175K1602o950k1041l51k1272K6538L8097j8592
15174E2262m2198l0544L2918J6490k7015k9701K3180L4679l101l1850o289K2742
15162A1573M0460j5693k7428L9734j6880m5171p55N1786j8618J045M7448n2332
15150A5169l6005M8548R208l822K4651k2043r796k1003j8287j0861O585k568L7032
$$ y = [-66618, -75051, -77891, -36713, 2423, -2795, -15453, -7892, -19401, 24884, 32628, 5364, -16088, -26421, -20545, -28581, -32014, -29310, -20027, -59480, -66886, -46245, 6659, 60759, 58078, 13829, -10484, -19227, -32613, -41012, -5252, 53039, 95132, 109628, 58828, 49947, 38954, 43251, 66457, 43087, 12727, 5296, -29400, -28961, -17801, -23682, 14074, -9062, -72716, -60904, -46013, -18701, -13680, 7056, 34231, 55833, 48883, 27842, 27491, 6219, 32757, 70854, 52262, 10064, -20480, 12438, 28928, 1913, -27788, -4608, 30071, 26970, -4880, -11169, 11573, 52033, 36340, 8912, 48646, 31766, -13405, -14160, 37626, 19008, 20053, 67501, 15169, -20836, 27712, 36920, 33098, 57749, 35706, 25910, 4907, -13380, -24241, -17656, -20224, 16808]
15137A6808N9063J98l5702k8534M6454j9819R340j2612n1989r251K3320K8415
15125B5691n933o541K7635m9619l4503K8204j138p750K574l875N06j2165k449
15112c9363N8806K84l5084K4392l5719l0840L6734K5620J0544O6981j7256n1253
15100A3846q840l0260l0166k0998m864L4421O2654j0009n0325r912M7258M9454
15088D2259j1622l5348k2063K2377m9080O52J3162J252J2652L8692M2884p9727
15076b3910j6580J8732M4239R00k814j0415m1021L8052M7536l7488j2582O061
15064A0710P224J211J34n370K4376j8906L344K7521n9972n5771p181L2266M5371
15051D957L2352Q774j4976r699K1274l3124O763k3966j822R181k1548l6135k0807
$$ y = [16808, 75871, 76069, 40367, 11833, 58287, 38468, 47808, 35196, -16793, -26044, -2724, 25691, 19758, 13217, 40852, -8767, -43270, -15066, -16204, -23954, -21380, -25255, -24749, -36914, -39363, 19443, 19727, -15357, 9035, -26684, -57524, -20790, 4830, 15374, 82355, 65099, 13846, 5006, -25254, -55420, -76418, -81282, -46861, 15793, 5784, -44541, -54453, -7195, 42259, 30637, -4711, -26774, -4397, -53477, -52825, -39663, -38411, -25759, 12933, 55817, -23910, -40490, -21758, 22481, 23381, 20567, 10152, -30869, 7183, 54719, 17231, 4649, 10710, 17934, 19145, 19279, 13909, 38285, 19379, 22723, 50244, -9728, -65499, -72680, -40414, 4957, 37309, 46083, 31107, 21408, 42682, 9558, 16321, -7645, -9467, -286, -21834, -57969, -78776]
15038g8776j9485N229m48K6760O544K4443K1300R901l0470l7702L1731m1180l3606
15025a15759J9120N1943j8246k5228j830j3564L3085M5847l531o710j5895q0282
15013a31050n352N4345L9604J3368j2129j2807L872J7602J4988O3033L6946n1616
15001C0804k5854J8253M537N135L3280K3315L0284N7177O6222Q8780J59930K89851
14989G81714N1828p6183k03420k54521j74090j06004j2502K6952R749J9997J27
14978F3647l7506n1204J2852R331k6670M4613J5559J2769l727l19q156k7972l4332
14965c1115L9158j0324j4844P841J7179L201k7018L451K3096N1648j8745j0489
14953C3039k6157j6471K9554n1267J208k2877k1349n1984K5981M1819m4142L0975
$$ y = [-78776, -98261, -93032, -93480, -66720, -60176, -35733, -14433, -4532, -35002, -72704, -40973, -82153, -115759, -96639, -44696, -62942, -88170, -90000, -103564, -70479, -24632, -28163, -34873, -50768, -131050, -136402, -82057, -42453, -29085, -41214, -54021, -50149, -32547, -17559, 45474, 82420, 30804, 4950, 23203, 27740, 32875, 66155, 89470, 119754, 176931, 243153, 331933, 491863, 781714, 833542, 757359, 553939, 299418, 125328, 19324, 6822, 33774, 43523, 63520, 63647, 26141, -25063, -12211, -2880, -29550, 15063, 30622, 43391, 39664, 39345, 31189, 3217, -31115, 8043, -2281, -17125, -9284, 7895, 11096, -15922, -12471, 10625, 62273, 43528, 33039, 6882, -9589, 19965, -31302, -30094, -52971, -74320, -126304, -100323, -58504, -102646, -71671]
14941g1671K1819Q547M7993k7794j8065j491L2581J9471j8258k4897o913m9009
14929h7687j1606K3955L0878M7456L0487l8314J772M8589k207j3488J3575j1405
14917C2005J2612j6271m4026k9249L2198l1253m6062j177M2089k969o253L5093
14905b3263K2086J5557M6885K0303M722J2767k8752l234l9565n3956j576k0314
14893d8340J072M9162L6112n068R52k0653m1898m8829L7932K0191j5148J0575
14881b3940K5598J2344m5681M46L1898m012L6843J5555J6750n502j6591J6276
14869E9984J5090K7560N071k8713l8479P3451J0050j6797m0744j9820j9684n3814
14857b6845q2615K3005K2587O181N3196J4961M346K3031n1173K257J2289L53N22
$$ y = [-71671, -49852, -41305, 6688, -21106, -39171, -40662, -8081, 11390, -6868, -31765, -38678, -87687, -99293, -75338, -44460, 2996, 33483, -4831, -3059, 45530, 43323, 29835, 43410, 32005, 44617, 28346, -15680, -44929, -12731, -43984, -90046, -91223, -49134, -52103, -58356, -23263, -1177, 14380, 61265, 81568, 86290, 99057, 70305, 67071, 27506, -26450, -28026, -48340, -47268, 1894, 38006, 32938, 33890, 13237, -28661, -77490, -39558, -19367, -34515, -23940, 1658, 14002, -31679, -31233, 665, -3347, 33496, 49051, 65801, 60299, 43708, 59984, 75074, 102634, 107705, 78992, 40513, 113964, 124014, 107217, 66473, 46653, 26969, -26845, -109460, -86455, -63868, -57687, -4491, 10470, 14816, 37847, -13326, -11069, 1220, 1573, 2095]
14844B095M7813L7785K113J9866k1601l6155l6696p592J0534j5162J182j675K2828
14831B5335m001N1951l514n3835k3463K9773K3026L9498Q63k3907j093k4130j7720
14818A8783j9568j0563o854P7585L6090j4654k5534l4646o3968J0514k1549m3504
14806i7868j9479L2983M0794L1190J4256k4651k0771l1493j0235N1472K0025n8115
14794g1892M2099L0337J0934K0865K4336O4485O580n962j01315o8393j517l7107
14782h6550j948L6238m4532j3675K8702O777R968K5651L5431P223k2226J4638
14770d303K4924j8429J9046M1311J4099k6547q298K0061j8943n532m5841m4199
14758e2651k6037P382K0505L6698J755l6057j8309M1893J8851r365k4647k1698
$$ y = [2095, 49908, 87693, 89806, 109672, 88071, 51916, 15220, 7628, 18162, 3000, 4182, 2507, 25335, 21334, 73285, 69771, 15936, -7527, 22246, 45272, 84770, 85633, 61726, 60633, 36503, 18783, -785, -11348, -18202, 59383, 95473, 80819, 55285, 20639, -43329, -32815, -54364, -97868, -117347, -84364, -43570, -12380, 1876, -22775, -43546, -75039, -85274, -33802, -13777, -71892, -29793, 544, 11478, 32343, 56679, 121164, 127744, 121782, 20467, -47926, -49443, -86550, -88498, -52260, -96792, -110467, -81765, -74988, -65020, -39369, -3938, 3285, -18941, -4303, 20621, 2192, 21238, 62549, 76648, 50101, 41803, 61864, 42921, 37389, -8452, -52651, -78688, -71306, -50801, -14103, -12348, -48405, -66714, -24821, -5970, -15335, -39982, -61680]
14746f1680j9531L0400J2871N3150K6479M5651j3765P646l0306o5230K1076M2662
14734D9423R462J271r003j5331j521m024L440m0187k9210J4752M552k1424K0456
14721a7344r965m5858k4935N2291K8576k7212L3517M5986o1071l4852K0505N4429
14709A4067L0806p239m5566l3937J1970J5517K0495o256J0574K2451O19J5309
14697D8810k2377m997o1419l8392K4871K8476m9643k9225P477L375O3682N5951
14685B6589R028k6818o7674q638L2135O169K2711l3067J762L2534L6846M191o2537
14672b6769M5962o847j8216o284m2816J5199m140J3599N3051k315k0563n9475
14660e9614K4798O0008k922j9611j0806L222k2415n7811m0611Q747K4347M5208
$$ y = [-61680, -81211, -50811, -37940, 15210, 41689, 87340, 73575, 81221, 50915, -14315, 6761, 49423, 58885, 60156, 51153, 35822, 34301, 30277, 33717, -6470, -35680, -20928, -16376, -37800, -17344, -27309, -73167, -98102, -45811, -17235, -44447, -10930, 35056, -26015, -60867, -40362, 14067, 44873, 37634, -7932, -41869, -29899, -14382, 6113, -143, 10431, 32882, 33501, 48810, 26433, 21436, -39983, -78375, -53504, -25028, -74671, -103896, -96419, -93044, -29362, 26589, 35617, 8799, -58875, -67513, -35378, -29209, -6498, -39565, -37803, -5269, 31577, 35768, -26769, 19193, 12346, -5870, -12154, -54970, -39771, -43911, -30312, 22739, 20424, -139, -59614, -34816, 25192, 22270, 2659, -8147, -4925, -27340, -85151, -125762, -117015, -92668, -47460]
14648d7460k124J1130n263m2297J9649O1287o722r410L2625J4109M1293P389n6563
14635A7643o0836n0518J5946L429J0290L7050O2636N7847L4481m2782m8716m6094
14623i624j3292O4760K9358k3506n3241j9418K198K3476Q550K1993l6035j6226
14611b1007M0139j3841O644p56L327l8250J0923M4067p227k5414j8659K950K4661
14598G557p852K8125L1796l7602m5083j0359n7127k32N7981M6986J5418J0964
14586D0572j7449p8589L80Q6115J9688J1143R513m106k7887q828l7735l5718L6112
14573f789M1367j0108J0029q603Q710m238l3923o780o015l4634j1900M3930N4007
14560C5053L1030J5895j4198l0250R666J3539p756m2140k7551J0723j9323k3683
$$ y = [-47460, -49584, -38454, -43717, -86014, -66365, -5078, -11800, -21210, 11415, 25524, 66817, 74206, 17643, -43193, -93711, -77765, -74336, -64046, -26996, 35640, 93487, 127968, 85186, 36470, -9624, -22916, 41844, 71202, 47696, -5545, -24963, -22765, 711, 9261, 31254, -4781, -21007, 19132, 5291, 11935, 11179, 14506, -23744, -12821, 31246, 24019, -1395, -20054, -17104, 7557, -295, 27830, 59626, 22024, -23059, -33418, -90545, -90777, -32796, 14190, 29608, 40572, 23123, -55466, -55086, 31029, 50717, 61860, 71373, 67267, 39380, 30552, -7183, -42901, -6789, 34578, 24470, 34499, 25896, 34606, 30368, -3555, -10335, -16350, -50984, -62884, -18954, 35053, 66083, 81978, 67780, 37530, 47196, 60735, 52979, 10839, -16712, -5989, -25312, -48995]
14548d8995R884j2086m59M1149O964l3656K22K7118l9291j2255k2755L2497N910
14535d5753l9849j2184N7653L2418J5638J3423R149j392j7408J0531j3427l1106
14523b2307J3470j2468k0609K1729J6312j3183O22j674J1084o052L8631J4907
14511D0462q077r271o616l3046r981K167K334K5329K8487J0625K0475q171n9986
14498e269l5678J2923n942K9247j8515k9120M0888O197j6552N5132J8525n6779
14486d943l4151j1911J5495J1826l5306R895r045J7284L1169l9896r853J0458
14474d8978J0949L9140J6952n254J5829l191n4349l7035K9193K135L558R543J4853
14461f655j2543J1429R455k873k2235J6208J7639n4110N3386O5371K435j144k8342
$$ y = [-48995, -39111, -51197, -51656, -10507, -3543, -37199, -36977, -9859, -49150, -61405, -84160, -51663, -45753, -85602, -97786, -40133, -7715, 7923, 21346, 30495, 29103, 11695, 22226, 8799, -22307, -8837, -21305, -41914, -20185, -3873, -17056, -16434, -18108, -7024, -13076, 25555, 40462, 32385, 23114, 16498, -16548, -26529, -24362, -22028, 3301, 31788, 42413, 62888, 54717, -5269, -40947, -28024, -33966, -4719, -23234, -52354, -11466, -5269, -21821, 33311, 51836, -4943, -39094, -51005, -35510, -23684, -58990, -49095, -58140, -40856, -9687, -49583, -59436, -48978, -38029, 1111, 18063, 12809, 28638, 25447, -28902, -65937, -36744, -34609, -31051, -21508, -6655, -19198, -7769, 1686, -1187, -23422, -7214, 10425, -43685, 9701, 75072, 77507, 76363, 48021]
14448D8021J6885k0212k5104J4136K7155m7106k0274K9557o3362J858j7052o0643
14436a16141M925M4313l3797k534M6684K9928r305l541L4715l985j1679J9700
14424g17j5322L3151L6851j7439o5586m0328n651K4739L472R926k5741K1913J6033
14411b4699l8987M7299J9823l493l2575r754M7464P745K5806j1331p3653k3676
14399g0031L7959P52J6184J1749j793M7193K3187n2518m7022j0854N20J4524K7688
14386b462J2996j5486j6240K1492K0350j9461K2001M0355J8395J5068j4468j7318
14374F5222n787m1298j2943k652Q444K3088k1888J8341k455r863o673j2692j5166
14361a6322J6342K0109k2965k0539Q362j6348P510m0859q601P5905m853K3544
$$ y = [48021, 64906, 44694, 19590, 33726, 60881, 13775, -6499, 23058, -40304, -38446, -55498, -116141, -111216, -66903, -100700, -103234, -56550, -26622, -35927, -39468, -4753, -8738, -20417, -717, -16039, 17112, 53963, 36524, -29062, -69390, -75041, -50302, -46830, -36904, -62645, -40732, -24699, -63686, -16387, 3436, -57, -32632, -42386, 5078, 12823, 38629, 27298, -46355, -70031, -32072, -31320, -15136, -3387, -5180, 42013, 65200, 12682, -34340, -45194, -44674, -30150, -2462, 10534, -4952, -21192, 300, 20650, 1189, 23190, 63545, 81940, 97008, 82540, 65222, 59435, 18137, 5194, 2542, 10986, 34074, 12186, 30527, 28072, 18209, 11536, -1156, -16322, 20, 20129, -2836, -23375, -15013, -31361, -23851, -64710, -73311, 2594, -2259, 21285]
14349B1285M4558J2028k1420j0328j9419J8123l9971J7565L2537j5930j9826j5694
14337C508j9979K6971k287K8167P058n7190k3975L4094N760K1521q778k4851L3312
14324B3331J4830k4670n7477J7869K0408k1368L3018L2700m2450k623o451P434
14312e449K8451L2011J0781l0700j8711k5797j2936J2169Q468j3192M574j9083
14300b9414r944L2005K5915j1233j1163L5449Q60M0207o789K204K1993k434m0359
14287D7297k0645J8183M869R433m4497n2083k4955J7043L1038j6365K5499J3930
14275H747J2154J9482j0897K5934K203l3228j6597m6265q547L7725P3051M5682
14263A09444m4722j6587n8792m4301l5020L8048N4955k0380n9753j1118J0290
$$ y = [21285, 65843, 77871, 56451, 46123, 26704, 44827, 4856, 22421, 54958, 39028, 19202, 3508, -16471, 10500, 8213, 36380, 43438, -13752, -37727, -3633, 2127, 23648, 14870, -9981, 23331, 38161, 13491, -43986, -26117, -5709, -27077, 5941, 38641, -3809, -6432, -12883, -5449, 23002, 55013, 65794, 35094, 16383, -9414, -22350, -10181, -1713, -14905, -10331, -29414, -39358, -7353, 18562, 7329, -3834, 31615, 32475, 72682, 65893, 68097, 90090, 87656, 47297, 26652, 44835, 49704, 59137, 14640, -37443, -62398, -45355, -14317, -30682, -5183, 8747, 20901, 40383, 29486, 55420, 57623, 24395, 7798, -38467, -47014, -9289, 63762, 109444, 64722, 48135, -10657, -54958, -89978, -51930, 3025, -17355, -77108, -88226, -77936]
14252g7936p466P886o123j3159K0933j342K3521L6099J7917L1009j1253j0288
14240I798j7314L9353l622k1643k0156l2413M9296K6072K6946k126J9825k7024
14228D6992q486K7775R534k7604j2183L4207m1270j282M686k416k9170J371K123
14215D277j1429J8664m387k0894o32K1142L3853J6612j88J9236L911k2985l8874
14202A8306J8122l725m0907j4855J2217k3374K0874J0469J715l2404J3490J9955
14190a17P730J7743J2918n3640j3886p837K6815o130m3505l5694K8600N0622k2521
14177c8902J772N6945R127P593j4981O9544n165l2420M0118L360p1381N365J8381
14164D9356J5659k595k043j0129o4599K0214L1490L5803K280k0341m3438J3676
$$ y = [-77936, -85402, -77516, -83639, -96798, -75865, -77207, -53686, -17587, 330, 31339, 20086, 9798, -7516, 31837, 28215, 6572, -13584, -45997, 3299, 29371, 56317, 54191, 74016, 46992, 38506, 66281, 75815, 48211, 36028, 70235, 28965, 27683, 32369, 29953, 783, 2154, 4277, -7152, 11512, 7125, -13769, -14401, 6741, 40594, 57206, 57018, 76254, 80165, 57180, 18306, 36428, 32703, -8204, -23059, -10842, -34216, -13342, -2873, -1158, -33562, -20072, -117, 7613, 25356, 38274, -15366, -29252, -37089, -10274, -16404, -59909, -95603, -67003, -16381, -38902, -37130, 19815, 28942, 36535, 21554, 91098, 85933, 53513, 93631, 96991, 25610, 30975, 49356, 65015, 62420, 60377, 50248, -14351, 5863, 37353, 73156, 75436, 55095, 11657, 25333]
14152B5333M7338m6762k2557J3359K3042m1235j2405m8687K5091K5723k5839j5760
14140e3359Q132j0507J6739M6348l1239m1913m827J310J2964K8405K9933K401
14128D387m5484O270J8487l3741K5376J8714J7204k4827o59j2817J4074N9249
14116D6233L3464M791m3593j04792K0034L7325k1598l1675M9303K5473l1630L1343
14104A4678k4009m4430l700j4034J5752L032J1493N484M5829j4310J9980N688
14092B1453M50J5109L7542r833o8989l6955J1362J382n8251P931P441J468N7792
14079a2098L6932j8229m9599K9144J4809J458K8073K945Q894J493o0229P159J0910
14066A662J5419L601M14j6621J9182M5330M0462P646k7564n0304j5444k8989n1793
$$ y = [25333, 72671, 25909, 3352, 16711, 39753, -1482, -13887, -62574, -37483, -11760, -37599, -53359, -45227, -55734, -38995, 7353, -23886, -65799, -70626, -69316, -56352, -27947, 1986, 4387, -41097, -34827, -16340, -50081, -24705, -5991, 11213, -13614, -14273, -27090, -13016, 46233, 79697, 84488, 40895, -63897, -43863, -6538, -28136, -59811, -10508, 14965, -16665, 14678, -9331, -53761, -57461, -71495, -55743, -52711, -41218, -35734, 10095, -4215, 15765, 21453, 21903, 37012, 74554, 64721, -4268, -41223, -29861, -28479, -86730, -78799, -71358, -69890, -12098, 24834, 6605, -42994, -13850, 959, 2417, 30490, 33435, 42329, 43822, -16407, -9248, 1662, 17081, 20682, 21096, 4475, 23657, 68987, 109449, 117095, 89531, 39227, 23783, -5206, -56999]
14053e6999K3342J451p058J1729J9836j3676J1009l12m9775J6608K4468N0657
14041C1280P98k9677k2529J6743J4609j3723l3049P392N259J4596Q440j6558l6933
14028e3352L5006N4515L3147r108l3582j2530L4598q487m117j5818L6770L2958
14016I0000k7864q957j167L1968j1922m254p0505l5966q306L9516O3525K0705
14004G6773n520l4285l3813k1637M5871m998k2838j8077M6327N1918L6282k4850
13992I1153l1032o6142j7826K041K9098N3576M5418l1334k7472l0994k0659q973
13980a3146L2296J8215k4228m0738l2247K4141N2516J1686J4696R807m7710q309
13968c021j6155J8690K5410m9555n9268j107M1575M4002J7465j8102k7779j081
$$ y = [-56999, -33657, -32206, -39264, -27535, -7699, -21375, -10366, -10678, -60453, -43845, -19377, 31280, 32078, 2401, -20128, -3385, 11224, -2499, -35548, -28156, -22897, -8301, 139, -16419, -53352, -18346, 36169, 69316, 60208, 26626, 14096, 48694, 40207, 36090, 20272, 57042, 90000, 62136, 53179, 52012, 83980, 72058, 67804, -2701, -38667, -46973, -7457, 56068, 76773, 71253, 36968, 3155, -18482, 27389, 22391, -447, -18524, 27803, 79721, 116003, 91153, 60121, -6021, -23847, -21806, 7292, 60868, 106286, 74952, 47480, 16486, -4173, -13146, 19150, 37365, 13137, -27601, -59848, -35707, 16809, 28495, 43191, 52998, 5288, -3021, -19176, -486, 24924, -24631, -83899, -85006, -43431, 571, 18036, -66, -27845, -28926]
13956b8926m3241J7459P2862N0144R401m2654j4703j8445m4705R726K0381l373
13944a6074J0725K6172j8915K5085k705k2494o3494N69N6767k7434k9332M8503
13932a2627j0948m1454j9116j0165K4872K1704K435k7826N5684N8160j6163l0895
13920f339J0824l7682l1007K1102p668K6580K3731m0236P510L6064n92l0968r112
13907c7793K4487L8935j6704k1329J5560Q891l1526l5835k7891J2056L825N2396
13895a4928J9032l4628n1903J1377L920Q814K131J3197K2779J1496J8095k356
13883G026l510M5043L3532j1949K1436L1577n2325j8130J0595Q469k292m6522
13871B2950l1956q355K9410j4168k7143O6524J1350n8046j3338L8881k53J2610
$$ y = [-28926, -72167, -54708, 18154, 68298, 77699, 35045, 20342, 1897, -42808, -33082, -12701, -16074, -5349, 20823, 1908, 26993, 24288, 1794, -61700, -61131, -4364, -31798, -61130, -12627, -23575, -65029, -84145, -94310, -69438, -47734, -45299, -73125, -17441, 40719, 24556, -6339, 4485, -33197, -64204, -43102, -50770, -24190, -459, -40695, -33185, 2879, 2287, -28681, -37793, -13306, 25629, 8925, -12404, 3156, 12047, -19479, -55314, -83205, -71149, -67324, -14928, 4104, -30524, -82427, -71050, -67130, -58316, -56185, -42988, -20209, -8713, 9382, 7026, 3516, 48559, 82091, 70142, 91578, 123155, 70830, 52700, 63295, 71764, 69472, 22950, -9006, -17361, 12049, -2119, -29262, 37262, 48612, -9434, -22772, 16109, 15856, 28466]
13859B8466q114l9170l8894L4226J1887m5672l272K2105J0234L237K8476L7096
13847D0605j1029p2952l6634L8379M6933k6680j8012M8152j8082M761J0453l8011
13835c2117M351j1608N598M2859L1719o1218J484J1305q280L6885J2404k0435
13823A2947k0022J0275K4449k561j460k2917p5534l012M0703J6242j033o196q940
13810c7059J5449j0984K038q228k1247k660N3349N3869K4690N222r466k468R871
13797G2376k1829J6995O175j2898J0576J3001r041M8052L3716o0684k8501L0276
13785I8214J9173j4320Q311k3731q754J1763J8189l926k7435J4657l3841N495
13773F3795l197K268q3M7854M9774q679r118P828k6921l7J3801K1827l2856m1508
$$ y = [28466, 20352, -18818, -57712, -23486, -11599, -57271, -60543, -38438, -28204, -24967, 3509, 40605, 29576, -43376, -80010, -41631, 5302, -21378, -39390, 8762, -9320, -4559, 5894, -32117, -27766, -39374, -33776, 9083, 40802, -20416, -18932, -7627, -15907, 20978, 33382, 12947, -7075, 3200, 27649, 25088, 23628, 711, -74823, -77835, -37132, -20890, -21923, -28119, -37059, -21610, -32594, -30556, -38784, -60031, -62691, -9342, 44527, 69217, 74439, 64973, 62505, 72376, 50547, 67542, 73717, 60819, 71395, 84396, 75355, 123407, 157123, 96439, 67938, 98214, 117387, 103067, 111378, 87647, 78893, 90656, 108845, 104919, 77484, 92141, 58300, 63795, 60598, 62866, 62783, 110637, 160411, 151732, 142614, 150442, 123521, 123484, 137285, 159112, 126256, 84748]
13759H4748p89M7784p84K3572j9966l8071K4553j0805m9592m756l1207J9375Q696
13746E2758K9508J0804k7863N774n0299j3834l597L3823J61J082k6419k990l4053
13733b5145L9428K8303K3314K5649m4480q659o030j9990L409L9057L9548m5552
13721D8852m8636M771R6o028K1083J8551N6706j11n748O280j2117L1732K4017
13708A39448L2678L4267q486j8150l0762l5144L0730l5203k1083O194K3494L3380
13696A51363J4773j554K9560j669m5381K9704J2869q6021o5012M3773M9756K0810
13684A52971K7857o873l0100m6007L987K7692m1639J0290k6340j8743N57L1849
13672H5501N2229L3591k5377l6534k8100m1625Q069j9510k053m8331L0571O0124
$$ y = [84748, 83959, 131743, 130959, 154531, 134565, 96494, 121047, 110242, 60650, 55894, 24687, 44062, 52758, 82266, 93070, 65207, 70981, 20682, 6848, 3251, 37074, 37235, 38317, 11898, 8908, -25145, 14283, 42586, 65900, 91549, 47069, 38410, 32380, 12390, 15799, 54856, 94404, 48852, 216, 4987, 5083, -945, 20138, 38689, 95395, 95284, 89536, 95816, 83699, 115431, 139448, 172126, 206393, 197907, 179757, 148995, 113851, 144581, 109378, 88295, 94489, 117983, 151363, 166136, 164582, 194142, 192473, 147092, 176796, 189665, 103644, 38632, 82405, 132161, 152971, 180828, 173955, 143855, 97848, 101835, 129527, 87888, 98178, 71838, 53095, 53652, 85501, 137730, 171321, 145944, 109410, 81310, 39685, 47754, 28244, 26191, -22140, 8431, 68555]
13660F8555N442l870o707j4105p812j430J6251k6073r078N18N2963m800m5871
13647B3983R459k4684l046J3851k6731o9520k8779M9447P924m5453K457K7715
13635f3377O6432J2678m883j4527J1478j8449j787N1655J5966L039m435k5343
13623B8447R294j5534j9627j3353K303K6173L4366l6323l1948J1995J487L306
13611E86J5473K5435M6690j1936M759j507J0719L3206k9624n747K7049j1533M0429
13598A43999k6277k7484j0609K519j6140J7959J7881j6495P2l4867j7283k5400
13586G875K1865M6943M336j2521O6794K0091k0586M5525j233M5577N170m8091
13574A81745J7459L3127J5528n6979m9917o4961O0216P1881m268l5152n3888p543
$$ y = [68555, 73997, 70127, 63420, 49315, 41503, 40073, 56324, 30251, 21173, 21691, 74654, 69854, 23983, 33442, 8758, 5712, 19563, -7168, -76688, -105467, -56020, -48096, -93549, -91092, -63377, 3055, 15733, 10850, -3677, 7801, -10648, -12435, 39220, 55186, 58225, 53790, 28447, 37741, 22207, 2580, -10773, -8470, 17703, 52069, 15746, -16202, -4207, -2720, 586, 16059, 41494, 88184, 76248, 81007, 79500, 90219, 123425, 93801, 88054, 115103, 103570, 143999, 117722, 90238, 79629, 82148, 66008, 83967, 101848, 85353, 85425, 50558, 33275, 7875, 29740, 76683, 81019, 68498, 135292, 155383, 134797, 180322, 179089, 224666, 229836, 181745, 199204, 232331, 247859, 190880, 140963, 76002, 136218, 208099, 203831, 168679, 114791, 107248]
13562A07248M2803J5594o8839j4286P1651O947j7118j3990J3518k8752l4293m1048
13550C9435Q761M6119J7215Q515Q014J7662j2416m4858o932L2028N329r708M5727
13537A54891O564K2012J4316m5015m2607J2554k682K8595N2206r032m6753M0291
13525A85340P5164N301m9643k669J7772K9426j1077J5271m5672k9555P506l9177
13513A57987J9378J6629K6688M2459M2267N8619k748l7038k4273n4295k6586K5417
13501B44504N6586K0338M7161j0984j6859R333K4671K0398o667l7941l2415m5411
13489B72714l1500j9005L368N538J2574l235j6782n7591j0096k2116n045J5159
13477A43983n055p516n68K2870L14j9908L7824K9333k135L777M308r183K5761
$$ y = [107248, 150051, 165645, 96806, 82520, 154171, 161118, 144000, 130010, 143528, 114776, 80483, 39435, 48196, 94315, 111530, 120045, 128059, 145721, 133305, 88447, 81515, 113543, 118872, 109164, 154891, 161455, 183467, 197783, 152768, 110161, 122715, 120033, 148628, 200834, 191802, 145049, 185340, 260504, 265805, 216162, 213493, 231265, 260691, 249614, 264885, 219213, 189658, 197164, 157987, 177365, 193994, 220682, 263141, 305408, 364027, 361279, 324241, 299968, 245673, 219087, 244504, 301090, 321428, 368589, 357605, 340746, 350079, 374750, 395148, 388481, 350540, 318125, 272714, 241214, 222209, 225577, 231115, 243689, 240454, 223672, 166081, 155985, 133869, 128824, 143983, 138928, 131412, 130844, 153714, 154028, 134120, 171944, 201277, 199142, 202919, 207227, 198044, 223805]
13464B23805k4894r356L680p054N9939J6630m1291o885p564j3733K124K4324k219
13451B17506m96q567j0850j1166J7957R377M7336L0178J4667k7657q644L5450
13439C05091j522j2520K8232r730J4059K5500L0621j3975l5661q520m836M5441
13427C62180K8309O9499m243j7022q845L474J9562O18k7109O292K6424j0949J3643
13414D61833O3l8320M617L4024k9971l0975m5091J8817J1711J2382j7535l1799
13402C49756k1146M628K2890M9268J9481j9017j2967j6341M5739K5808q164J9396
13390D59331M0764J9549K4754K6828O1903J8113M8093P2656R2978K9637K5713
13379I20319Q2636J39151J50708J65828J73400K26572K52469K99245M11873N18265
$$ y = [223805, 198911, 189555, 193235, 186181, 246120, 262750, 221459, 214574, 207010, 193277, 195401, 219725, 217506, 217010, 208443, 197593, 186427, 204384, 213761, 261097, 291275, 305942, 278285, 269641, 305091, 303569, 291049, 319281, 309551, 323610, 349110, 379731, 365756, 330095, 321575, 316739, 362180, 390489, 459988, 455745, 438723, 429878, 433352, 452914, 453532, 426423, 432715, 459139, 448190, 461833, 461896, 423576, 428193, 462217, 432246, 401271, 356180, 374997, 386708, 399090, 381555, 349756, 328610, 333238, 356128, 405396, 424877, 405860, 392893, 376552, 422291, 448099, 439935, 459331, 500095, 519644, 544398, 571226, 633129, 651242, 699335, 771991, 864969, 894606, 920319, 1002955, 1142106, 1292814, 1458642, 1632042, 1858614, 2111083, 2410328, 2822201, 3340466]
13369C340466O06322Q30723J205483J455362J580947J591511J409285J064258
13361A3084357N63206K74663L48899P27769J248021J777784K058683J849424J131984
13352B3064790J07042r13845j538631j609390j202610o05569j2266M70515N70784
13343A8330820L39548P8418k1187o3248L0395K485k01752m29032n30739k57549
13333A7278159L46481R97745J598134J824524J424341N70143n21714j549857k084359
13324A9883597j953902j427298p80172k86290j40203l59121q00014j365241j670549
13315A1100807j763385j630054j373787r79277p44413n95210m71093l47234k75381
13306B920973k24692k42839j77125j02983n7873l7872p2930o1527P56J6019L0798
$$ y = [3340466, 3946788, 4777511, 5982994, 7438356, 9019303, 10610814, 12020099, 13084357, 13647563, 13922226, 14271125, 14998894, 16246915, 18024699, 20083382, 21932806, 23064790, 23171832, 22257987, 20719356, 19109966, 17907356, 17301787, 17289521, 17760036, 18330820, 18670368, 18748786, 18727599, 18664351, 18694746, 18697231, 18495479, 18066447, 17535708, 17278159, 17624640, 18622385, 20220519, 22045043, 23469384, 24039527, 23517813, 21967956, 19883597, 17929695, 16502397, 15722225, 15435935, 15295732, 14936611, 14136597, 12771356, 11100807, 9337422, 7707368, 6333581, 5354304, 4609891, 4014681, 3543588, 3196354, 2920973, 2696281, 2453442, 2276317, 2173334, 2115461, 2077589, 2004659, 1943132, 1943888, 1959907, 1990705]
13295A990705J21449J15891J33916K20513L08630L29065M50317N89478P45153
13286E005117J002149J267486J588060J755647J701955J342088R27425M53786
13278A5043713K68660M46522R70094J619368K168005K279107J819854P83605m49529
13269B4949399j395321j754896j629888j049928l58610K62238N69190N41113K16922
13260B0350219j04482j92576j45670j03157j75374l18336m45111l85801M4173
13251A8523885O79853J407107J860773J905692J249867J48885j067789j896971
13243B2811302k220198j909561j343625o60949j92132j81616m80486j104983j552081
13234A3165671j828106j860544j652762j401739j070573p91745o01741m98792
$$ y = [1990705, 2112154, 2228045, 2361961, 2582474, 2891104, 3220169, 3670486, 4259964, 5005117, 6007266, 7274752, 8862812, 10618459, 12320414, 13662502, 14589927, 15043713, 15312373, 15758895, 16728989, 18348357, 20516362, 22795469, 24615323, 25398928, 24949399, 23554078, 21799182, 20169294, 19119366, 18760756, 19022994, 19592184, 20133297, 20350219, 20245737, 20053161, 19907491, 19804334, 19628960, 19310624, 18865513, 18479712, 18523885, 19203738, 20610845, 22471618, 24377310, 25627177, 25776062, 24708273, 22811302, 20591104, 18681543, 17337918, 16676969, 16484837, 16303221, 15822735, 14717752, 13165671, 11337565, 9477021, 7824259, 6422520, 5351947, 4560202, 3958461, 3459669]
13226C459669m04978l21764l01755k26201j80985j84740j23291j16951j11478
13217A487526r8552n5323n4929m6281o1879j00710q1648m4850k9003N785p600
13206I12536n588k6298j5376L6568J0740o352L4066J1081j089J6443J441O143
13194I74315K7545P0991K2798J5072N8997R3126J19646J62278J60180J46049J82408
13183B033405K57073L64725M83790O40270Q26491J017380R90554Q50956O40508
13174H105152M41172K52961L27376N79882P51910Q01420P02554L38743j45721
13165A2155449m96834o96585o30524l86263j74225J2626O3920l7632j39950j27382
13155I542600J41319M66368R66814J444395J660951J562831J103286O40379L86722
$$ y = [3459669, 3054691, 2732927, 2431172, 2204971, 2023986, 1839246, 1715955, 1599004, 1487526, 1388974, 1333651, 1278722, 1232441, 1170562, 1069852, 988204, 943354, 914351, 920136, 912536, 906948, 880650, 865274, 901842, 912582, 906230, 940296, 951377, 950288, 966731, 968172, 974315, 1001860, 1072851, 1095649, 1110721, 1169718, 1262844, 1382490, 1544768, 1704948, 1850997, 2033405, 2290478, 2655203, 3138993, 3779263, 4605754, 5623134, 6613688, 7464644, 8105152, 8546324, 8799285, 9126661, 9706543, 10458453, 11259873, 11962427, 12301170, 12155449, 11658615, 10962030, 10331506, 9945243, 9771018, 9783644, 9847564, 9809932, 9669982, 9542600, 9683919, 10150287, 11117101, 12561496, 14222447, 15785278, 16888564, 17528943, 17915665]
13146A7915665N15580Q63442J327482J496605J290840O07311l29299j214868j628562
13137B0844196j659464j306971p63733m33603m75404p34038j075487j372063j283897
13128A1739536r71397n63811j40625J87351L58517K23856P2631l1184J01665K65847
13118A1242386M11075N67548N13705K14410k32315n71060q10350q32588o90514
13109I812297m27413k95234k93076m19024o14123p25423p04381n75210l66913
13100E391500q7760P8355L29809O38049Q56658R06629Q76192O49534M30664K16078
13090A0285708K48221N35796P57284Q48562P38912L98800r4122n02462o80438
13081A2536261o74680m84921k89860k6732M6696r7381k21210j83483k3721M45271
$$ y = [17915665, 18431245, 19294687, 20622169, 22118774, 23409614, 24016925, 23687626, 22472758, 20844196, 19184732, 17877761, 17114028, 16680425, 16205021, 15470983, 14395496, 13023433, 11739536, 10768139, 10204328, 10063703, 10251054, 10609571, 10833427, 10906058, 10874874, 10976539, 11242386, 11653461, 12221009, 12734714, 12949124, 12716809, 12145749, 11335399, 10502811, 9812297, 9384884, 9089650, 8796574, 8377550, 7763427, 7038004, 6333623, 5758413, 5391500, 5303740, 5382095, 5711904, 6349953, 7206611, 8113240, 8989432, 9638966, 10069630, 10285708, 10533929, 11069725, 11827009, 12675571, 13414483, 13813283, 13719161, 13216699, 12536261, 11861581, 11376660, 11086800, 11060068, 11106764, 11009383, 10788173, 10604690, 10580969, 11026240]
13071A1026240R49543J439674J744129J675868J302979P87688M41555N24511Q76847
13062B0769034J354387J643036J471661Q64751r4119j068555j655455j757891
13054B1526849j472050r43588n48779n07285p95678j131274j439267j398330j191561
13045A2099037p79218k52598R1784K46377K67069N9697q6412j1802J80059M51821
13035A2265814N03453M58398K58564j64026n83666q49689r33861p88996n43170
13026I622821m09881m26862o26925q01716r79014r27665q61779p32712n86317
13017C269950m34611l05290l08216k17555k26830j82104j36296j22430j38089
13008A198529j03352n8472o5443l6906l7120q4902m9106L0454o62n9969q0659
$$ y = [11026240, 11975783, 13415457, 15159586, 16835454, 18138433, 18926121, 19367676, 19892187, 20769034, 22123421, 23766457, 25238118, 26102869, 26008750, 24940195, 23284740, 21526849, 20054799, 19111211, 18562432, 18055147, 17259469, 16128195, 14688928, 13290598, 12099037, 11319819, 11067221, 11159005, 11405382, 11672451, 11732148, 11645736, 11633934, 11813993, 12265814, 12769267, 13227665, 13486229, 13322203, 12738537, 11888848, 10954987, 10165991, 9622821, 9212940, 8786078, 8159153, 7357437, 6378423, 5450758, 4588979, 3856267, 3269950, 2835339, 2530049, 2221833, 2004278, 1777448, 1595344, 1459048, 1336618, 1198529, 1095177, 1036705, 971262, 934356, 897236, 812334, 763228, 793682, 793020, 733051, 652392]
12997F52392p045k4137O158j3278k8767n2419o226l7073k8592L5761k3411n1367
12985D21996m636M4457l038j8458J7657M3117K4540j2633p5348j7840J5564j6302
12973D19076k9627q794j5598j9267l0063l3063j0113J6528l3536k2079K1712j2959
12961B42217l7801P2419J0549m8767l2861J3470K0068L0098O8993J461k8770m9280
12949B61796J2416R821r133L5262o307n0192O398n218l761J7472m4227L2997N7886
12936C15210K4460J8510o736n191k9642m055M55j5399k1792K0110j3734l8036
12924B44160l481j4104j2899K4104M3589J9055m2278k3651M0109J3679P365l5905
12912B59743L857J2984O611K5065m8252n1741K2648j4218L4412j9559R663M3815
$$ y = [652392, 645347, 621210, 627368, 614090, 585323, 532904, 526678, 489605, 461013, 496774, 473363, 421996, 417360, 461817, 458779, 440321, 457978, 501095, 525635, 513002, 437654, 419814, 435378, 419076, 389449, 380655, 365057, 345790, 315727, 282664, 272551, 289079, 255543, 233464, 255176, 242217, 204416, 276835, 287384, 238617, 205756, 219226, 239294, 269392, 338385, 339846, 311076, 261796, 274212, 284033, 274900, 310162, 303855, 253663, 260061, 254843, 251082, 268554, 224327, 257324, 315210, 339670, 358180, 351444, 346253, 316611, 312556, 313011, 297612, 275820, 295930, 282196, 244160, 240679, 226575, 213676, 237780, 281369, 300424, 258146, 234495, 274604, 288283, 295648, 259743, 263600, 276584, 283195, 308260, 260008, 208267, 230915, 216697, 251109, 231550, 241213, 285028]
12900B85028p495o5506o6J5566K3757k0701L6857K80m7795J2638J6731J5790j3993
12887B51091m2777N815m1685o0035l23J2308K4745R894O5468K1195j3478m4441
12875A87777m6419l6749J7312M264L6243l167o965K2102j4043k0404K3095M829
12863A67875k1951N914N3218j9829k3056k1889Q554o126r342k768j6344l0199
12851H4057m6918L7565M4100K6694J5672j042L2563J785L6118J8083m9965J3779
12839B12491k2422K5894q232K0519j7778j8668M4666K7128K3590l1173J6660J694
12827B74369n061N851L1951N827K0012j8462k1533n1209r324m7111j0843M9511
12815B23978J2545J2440N8448J1462k6469n0409M2676O264k2880j4797M68j2070
$$ y = [285028, 277533, 212027, 211961, 227527, 251284, 230583, 267440, 267720, 219925, 232563, 249294, 265084, 251091, 208314, 214129, 172444, 112409, 112086, 124394, 149139, 159033, 224501, 245696, 232218, 187777, 141358, 104609, 121921, 126185, 162428, 159261, 152296, 174398, 160355, 139951, 163046, 167875, 145924, 151838, 205056, 185227, 162171, 140282, 148836, 142710, 133368, 130600, 114256, 84057, 37139, 74704, 118804, 145498, 161170, 160128, 192691, 194476, 230594, 248677, 198712, 212491, 190069, 215963, 207731, 228250, 210472, 191804, 236470, 263598, 287188, 256015, 272675, 274369, 269308, 275159, 307110, 312937, 332949, 314487, 292954, 241745, 232421, 185310, 174467, 223978, 236523, 248963, 307411, 318873, 292404, 241995, 284671, 290935, 268055, 253258, 253726, 241656]
12803B41656k737K3026n0651m1790J1706L1040O21P402K5436k7873j3059J2612
12791B17389j5888m5320K4558M6997j3492l4398j0687K3549l3314K31L2396n854
12779A86167m3289j3925k109m2425k5639M5224M8194J0224O188k9221k3210r256
12767A06923l5967j4037p639K2286L7204J4846K756k2465j1637K4312M3833j0955
12755A49460K0359l5768n2173r843j2657N02J3712L0006K1292O7231Q888m6891
12743A54118N6352K8806M4514k4618K5948j5130J0294k63J9837L205m1329j6439
12731B45295j2430Q519k7521o519J1652k1097J0174k823j6833l4609J0897m4909
12719A19796M050J0169p524L7824j0212Q626O20J0690N8513J8373K7940J2659
$$ y = [241656, 238919, 261945, 211294, 169504, 181210, 212250, 212871, 220273, 245709, 217836, 204777, 217389, 201501, 156181, 180739, 227736, 214244, 179846, 169159, 192708, 159394, 159625, 192021, 186167, 142878, 128953, 126844, 84419, 58780, 104004, 152198, 162422, 168610, 139389, 116179, 106923, 70956, 56919, 49280, 71566, 108770, 123616, 126372, 103907, 92270, 116582, 160415, 149460, 169819, 134051, 81878, 72035, 59378, 59880, 73592, 103598, 124890, 192121, 201009, 154118, 210470, 239276, 283790, 259172, 285120, 269990, 280284, 280021, 299858, 303063, 261734, 245295, 232865, 241384, 213863, 207344, 218996, 197899, 208073, 205250, 188417, 153808, 164705, 119796, 123846, 134015, 126491, 164315, 154103, 162729, 163349, 174039, 232552, 250925, 278865, 291524]
12707B91524j065l4339l3179K4763L6018N2660k7189j025j9287n5442o8574L3204
12695A98069M8812o8115J1808P3206L2284l7098j1254j5173j5184l68j0030J6406
12683B23363J5726j1061j7387K9634m1304m0325K3335l358J5715j758p452K874
12671A88002K4917Q836m2851j8725J4289J0131J0771q029J8758M7950q21q176
12659B45052k0844k3487O306k6211K9477L9137j8200k8645k0055k988L2702N7188
12647B69432L7994K1184K425M2953l5483m1804l9213l0325o6000L9250N3787j8576
12635B35624k5346p589k7030J589Q9113N8892k0431p146J691N2732O6639m0167
12623C78571l8692l6618N524J1029p2094L0079N7807k3025n7042l1887o716K4029
$$ y = [291524, 290459, 256120, 222941, 247704, 283722, 336382, 309193, 308168, 288881, 233439, 164865, 198069, 246881, 178766, 190574, 263780, 296064, 258966, 247712, 232539, 217355, 216987, 206957, 223363, 239089, 228028, 210641, 240275, 198971, 158646, 181981, 178623, 194338, 192580, 185128, 188002, 212919, 221755, 178904, 160179, 174468, 184599, 195370, 187341, 206099, 254049, 253228, 245052, 224208, 200721, 207027, 180816, 210293, 249430, 231230, 202585, 182530, 179542, 212244, 269432, 307426, 328610, 331035, 373988, 338505, 296701, 257488, 227163, 161163, 200413, 254200, 235624, 210278, 202689, 175659, 177248, 266361, 325253, 304822, 297676, 299367, 352099, 418738, 378571, 339879, 303261, 308785, 319814, 247720, 277799, 335606, 312581, 255539, 223652, 216936, 240965]
12611B40965k3164o950M5242j2375r563j2752n2845k3733j4162l702L7068J6778
12599A80807K7380j3017K7493K1681k5033m9765l0613K9729L0435J1268k4747
12588A85618M5592r774n2045j6950K0113N0985K1737l8404k4135q706l5501o221
12576A32309M3305N5073j9239o9625n5898j0575k4362l855j8083K4452L5177N5198
12564A43877L8425m2315j7860L5458k4699n5942k852O4079M9352J2480k9812k3086
12552A47105n854o896l0K2453L2530K6510J737l5683K7320l0974m5586K0020O8834
12539B21486L9535p5885p7566k7001L5049k5729L5987K7320J9265k7458l6358
12528A08645K2438K0868k8408j0074L0936j1588L665k4529l7641J7627L5043j0938
$$ y = [240965, 217801, 210851, 256093, 243718, 234155, 221403, 168558, 144825, 130663, 126961, 164029, 180807, 208187, 195170, 222663, 244344, 219311, 169546, 138933, 168662, 199097, 210365, 185618, 231210, 221436, 169391, 152441, 172554, 223539, 245276, 206872, 182737, 174031, 138530, 132309, 175614, 230687, 211448, 141823, 85925, 75350, 50988, 47133, 29050, 53502, 88679, 143877, 182302, 139987, 122127, 157585, 132886, 76944, 74092, 138171, 187523, 200003, 170191, 147105, 141251, 134355, 134325, 156778, 189308, 215818, 217555, 181872, 209192, 178218, 132632, 152652, 221486, 261021, 185136, 107570, 80569, 115618, 89889, 125876, 153196, 172461, 145003, 108645, 131083, 151951, 123543, 113469, 144405, 132817, 136482, 111953, 74312, 91939, 126982, 116044]
12516A16044k4415K4064N307J4346J7316m518l1461n7521J3344P0150L9597k486
12504A79767J2289K2850J3624K4952N2737M3932P4146J30200J68801k1457j11511
12493E90330j05446j28552l7422p0474m9949J9501L7236L0553M1628J6882n5241
12482B89046K3408q632n3394o9703n8975J8600J768l4994j7320j5190o157L7093
12470A05550L5475L614m5864l0292K8732j0643j3448j432K9588O1650J7037k0474
12458A59493l8712J413L651k769J15277J97527J74506P6097q0364j25511p0339
12447D10269r5127j31146q0350L295K2009J8435P876j9402n4771l586r66l710
12435G2826L3500R146l6369J2953K2415P996P62j8228j9131N8265P4740J2630
$$ y = [116044, 91629, 115693, 121000, 135346, 152662, 148144, 116683, 59162, 72506, 142656, 182253, 179767, 192056, 214906, 228530, 253482, 306219, 350151, 424297, 554497, 723298, 701841, 590330, 484884, 356332, 318910, 248436, 198487, 217988, 255224, 285777, 327405, 344287, 289046, 312454, 303822, 250428, 180725, 121750, 140350, 142118, 107124, 89804, 74614, 68457, 105550, 141025, 144639, 98775, 68483, 97215, 86572, 73124, 71692, 101280, 162930, 179967, 159493, 120781, 122194, 125845, 123076, 238353, 435880, 610386, 686483, 606119, 480608, 410269, 315142, 183996, 103646, 106941, 128950, 147385, 155261, 135859, 81088, 77502, 76536, 72826, 106326, 115472, 79103, 92056, 114471, 122467, 123229, 105001, 85870, 144135, 218875, 231505]
12423B31505j3649l5469j6725M6532J6710m9129j480k0990j4583j9465J4354k0904
12411A16707M9994N6312J8088J8853R3529k122m7688n8719p2876j2633L2558Q219
12399B00222m455j6076o2485O184M0769K5593J0261J9250j1227O672M064l4786
12387A83986L3515o458p5501J0670J1643L940Q744l4053m1056j2263J6284o999
12375I2452j1595k7130p478j2452J160K2238J5191m300k3138k5481L2011K4389
12363G5867J2292l12L142r91k2191k7819J9660L7181J5390M224K5361k5100J6738
12350A33442L2111j7503k6753O214R686l1526k4225K5190J2022K610l6922j9934
12338F4412R259n9405m5701n079K3061L1246K4278K7150J8062R170J6090q796
$$ y = [231505, 217856, 182387, 165662, 212194, 228904, 179775, 178295, 157305, 142722, 123257, 137611, 116707, 166701, 223013, 241101, 259954, 353483, 351361, 303673, 244954, 172078, 159445, 192003, 200222, 195767, 179691, 117206, 123390, 164159, 189752, 200013, 219263, 208036, 214708, 218772, 183986, 217501, 211043, 135542, 146212, 157855, 161795, 170539, 136486, 95430, 83167, 99451, 92452, 80857, 53727, 46249, 33797, 34957, 57195, 72386, 68086, 44948, 19467, 51478, 75867, 88159, 87847, 90989, 89998, 67807, 39988, 59648, 96829, 112219, 116443, 141804, 116704, 133442, 165553, 148050, 121297, 127511, 137197, 105671, 81446, 106636, 118658, 121268, 84346, 64412, 73671, 14266, -31435, -36514, -13453, 17793, 42071, 69221, 87283, 96453, 112543, 103747]
12326A03747o579P906l4953p669L0973j758j7415l3500m5484M604O6966M322n66
12313G0594k7837m4185k8603o877J1000j0174Q878K9187J3237k414N377K3990
12301D2173l4216j1478j0716Q083K1111m984K7878K5652m2621j5967L6858J6368
12289E8141k243L969J1450L6645k256k3249j3885l3640r143K4152K1231j8286
12277E2886j3939K9944K1696L9163k1362j8779n1006k0323j838p805J6747O3799
12265H9183k2498Q69j0075l1860J5673k4738m0182L2801J7555j7595L6988K4671
12253G0792J3473l8576m3111j4745J9589N1906j92k9232r900j982R898N0976l5464
12240D3432k8919j6674M8541j7907n657J5779J5727J1344q273K657L3844K1800
$$ y = [103747, 97168, 105074, 70121, 62452, 93425, 91667, 74252, 40752, -4732, -128, 66838, 71160, 70594, 42757, -1428, -30031, -36908, -25908, -36082, -27204, 1983, 15220, 12806, 18183, 42173, 7957, -3521, -14237, -6154, 14957, 9973, 37851, 63503, 20882, 4915, 41773, 58141, 55898, 59867, 71317, 107962, 105706, 82457, 68572, 34932, 25789, 49941, 71172, 52886, 38947, 68891, 90587, 129750, 108388, 89609, 38603, 18280, 16442, 8637, 25384, 89183, 66685, 67554, 57479, 25619, 41292, 16554, -23628, 9173, 26728, 9133, 46121, 70792, 84265, 45689, 2578, -12167, 7422, 59328, 59136, 29904, 20004, 18022, 27920, 78896, 43432, 14513, -2161, 46380, 28473, 22816, 38595, 54322, 65666, 57393, 60050, 93894, 115694]
12228A15694j1990n4359m0517J5625K4387j7530Q584J3853k9391k9739M732K549
12216A898l3186R364J275j8741J1875M7113J6830L3909J5379j6920L7024J4454
12204A20274Q889M0243M4334O592M5308J8643k4408j786L1007k834n0640m0675
12192A94947q914k0339n4151Q603p990m6698L3021J5071j128k1769o697K9405
12180A13361K9582O8591M9739o11m4314j9341M101Q407J0924R2900M5349Q0145
12168D38833J03527J50222R2172J03689J70275R7284o8284q9742m5715p4370n4887
12157H23004q2824j38004j36675p9603p8593j5079n0974l9459n048j9548r118
12146A68079m5084N2897M1505o501m1081o6387k3071J5942J1310K7320K463o430
$$ y = [115694, 103704, 49345, 8828, 24453, 48840, 31310, 39894, 53747, 24356, -5383, -651, 1898, -31288, -21924, -20649, -39390, -27515, 19598, 36428, 70337, 85716, 68796, 105820, 120274, 129163, 169406, 213740, 220332, 265640, 284283, 259875, 258089, 289096, 286262, 235622, 194947, 186033, 165694, 111543, 120146, 112156, 65458, 98479, 113550, 112422, 90653, 83956, 113361, 142943, 211534, 261273, 260662, 216348, 197007, 201108, 209515, 220439, 313339, 358688, 438833, 542360, 692582, 784754, 888443, 1058718, 1156002, 1087718, 997976, 952261, 877891, 823004, 740180, 602176, 465501, 385898, 307305, 292226, 241252, 201793, 196745, 177197, 168079, 122995, 175892, 217397, 210896, 169815, 103428, 80357, 96299, 107609, 134929, 137392, 130962]
12134A30962O5400J4814J0555J0502P1963L8847M3879Q4418Q8589Q7152q583j9363
12122F19135J3160M024J3649L3117j1894l2718M091m6323o9507k6311l1669p4321
12110C94433q7464j3523l128P599P008l3874n3210o2515p6017M3300L3950k4003
12098A32556J6609o449j8660j0958M6333l608j658L0713m587j9625l1051m0160
12086H9455J3536L133K1798m2010l5034j515R79J7082L8058j90j465J3874L798
12073A21499k3869n8881O342K0648K6476J8609J5624Q039M899r962K1782l1133
12061A20073M047L6193N1639n4673j21668K1611K8877L6495J2307L9770r236j3067
12049A52368K3628m8655l175K1328R822j9614K3337m321k5415K5085K8360n3992
$$ y = [130962, 196362, 211176, 221731, 232233, 304196, 343043, 386922, 471340, 559929, 647081, 638498, 619135, 632295, 636319, 649968, 683085, 671191, 638473, 642564, 596241, 526734, 500423, 468754, 394433, 306969, 293446, 290318, 297917, 304925, 271051, 217841, 155326, 79309, 122609, 156559, 132556, 149165, 142716, 124056, 113098, 159431, 155823, 154165, 184878, 180291, 160666, 129615, 89455, 102991, 106124, 127922, 85912, 50878, 49363, 50342, 67424, 105482, 105292, 103827, 117701, 121499, 97630, 38749, 45091, 65739, 92215, 110824, 126448, 134487, 139386, 129424, 151206, 120073, 124120, 160313, 211952, 157279, 35611, 57222, 86099, 122594, 134901, 174671, 165435, 152368, 175996, 127341, 124166, 145494, 155316, 135702, 159039, 154718, 129303, 154388, 182748, 128756]
12037A28756r942Q1466n521l7234j4881l3489j1572J5020l331K734L9793o573
12025A45226l2056o1975k7452J0021j6198j6739l913p37L3815J8853J7322l7504
12013B8663j1877p967J9138M8777l3806k1324R6879L9257J9273k7317o1721l4433
12001E3542M174J5713K2252M3215k3234J8738r781k1324k973j8380L7945K7897
11989A47784J2627J7831k997l6575j6153m9208M7670K9058o5404l8888N8817K8662
11977A33224j4212K4741O091j2811j8949K2590J8447o266k3137k4068j7851l5502
11965E2297K3767L0604Q232m6208K0400Q6125L7427l3098l5838M669p402k0318
11953A20657q044N2866K4813n9041m3178O50k8310l1151k5969L0850P3237J4616
$$ y = [128756, 118814, 200280, 194759, 157525, 142644, 109155, 97583, 112603, 109272, 112006, 151799, 145226, 113170, 51195, 23743, 33764, 17566, 827, -3086, -3823, 29992, 48845, 66167, 28663, 16786, 8819, 27957, 76734, 42928, 21604, 118483, 157740, 177013, 149696, 87975, 53542, 57716, 73429, 95681, 138896, 115662, 134400, 124619, 103295, 100322, 81942, 119887, 147784, 160411, 178242, 175245, 138670, 122517, 73309, 120979, 150037, 84633, 45745, 104562, 133224, 119012, 143753, 149844, 137033, 118084, 140674, 159121, 152855, 129718, 105650, 87799, 52297, 76064, 106668, 114900, 68692, 89092, 175217, 212644, 179546, 143708, 148377, 140975, 120657, 112613, 165479, 190292, 131251, 88073, 88723, 60413, 29262, 3293, 34143, 107380, 121996]
11941A21996m9588J0551j2059o2140n1897m8175M5929L5823J2359P8398L0474
11930A11671N648J0856K4898j1496K6344J5439J8158o4294n082k4049j1625l1163
11918F5305j3999K8193k4777k1544J6661M4203l788k992k2578j7091K0246O069
11906G3908L1355K8478n1922k9546L8273R648J7730l4420k9184k293j7163N1920
11894H6784O6468K4553j9979p0318p4426J9905M6808j737J3674q890O919l5226
11882E4535R084j4775L3502j8718n7825N100J5907K8335P6783N4281k4066K3396
11870A85539J6632p1148n6473L1157R585j7400J5941k2721n084R486Q14j9605
11858G6723R180Q131K4806R564k0741m6835k0810M6158K2964j8241J8237M0666
$$ y = [121996, 72408, 82959, 70900, 8760, -43137, -91312, -45383, -9560, 2799, 81197, 111671, 117319, 128175, 153073, 141577, 167921, 183360, 201518, 137224, 132142, 108093, 96468, 65305, 51306, 79499, 54722, 33178, 49839, 94042, 90254, 87262, 64684, 47593, 67839, 73908, 105263, 133741, 81819, 52273, 90546, 100194, 117924, 83504, 54320, 52027, 34864, 86784, 153252, 177805, 157826, 87508, 13082, 32987, 79795, 78058, 91732, 82842, 89761, 54535, 63619, 48844, 82346, 63628, 5803, 10903, 26810, 55145, 131928, 186209, 162143, 185539, 202171, 131023, 74550, 105707, 115292, 97892, 113833, 91112, 86028, 95514, 96328, 76723, 85903, 94034, 118840, 128404, 107663, 60828, 40018, 86176, 109140, 90899, 109136, 149802]
11846A49802N178o0364l6186J2076l9083J9570L5237m3521l5400l629L6503L0892
11834G1075K027L3652J9540L04l0678K2472K362K082k5520p0807m1638R321N5575
11821D9767K7926p9779j806O2071K7845K8276K0364o432J4271K4900J8340k7280
11809A58463l3624l839M898J3269J9808k7526r1755m2665M8547O304l1961j4839
11797E080Q0321Q7077n795k9025r985l6870j3462M4534l4100n2329l7514K7420
11785B5352J8369J4826k6107k426P0260J2866k4395m4062l1460o663R473j1745
11773D288N2938O598q127O1199K4255n141J9610k2056R713J397J0248k4175j8810
11760A11937K0540J2920m1702K5472M510J9309J657k0621q600J3456K3206k1877
$$ y = [149802, 154980, 94616, 58430, 70506, 31423, 50993, 86230, 42709, 7309, 3680, 40183, 71075, 73102, 106754, 126294, 126598, 95920, 118392, 120754, 122836, 97316, 26509, -15129, -5808, 49767, 77693, -2086, -3892, 58179, 86024, 114300, 134664, 128232, 142503, 167403, 185743, 158463, 124839, 121000, 125898, 139167, 158975, 131449, 39694, -2971, 45576, 51880, 19919, 5080, 85401, 172478, 166683, 137658, 127673, 90803, 77341, 121875, 87775, 35446, -2068, 25352, 43721, 58547, 32440, 30014, 100274, 113140, 88745, 44683, 13223, 6560, 16033, 4288, 57226, 63824, 55697, 116896, 141151, 136010, 155620, 133564, 143277, 144674, 154922, 130747, 111937, 132477, 145397, 103695, 129167, 133677, 152986, 154643, 134022, 125422, 138878, 162084, 140207]
11748A40207n8562r708Q3988N2986J005j5834K4611j8155j2186N470l5000p876
11736A50946J8512q51k6982K2896r668o191L4167n995j3256l8547n5304K0124
11724H9851P092k0345J0937m4641l0922L673L3581K3413M6998J5746l7689k3564
11712G4130r536J2200k5671m1601q383r371N6732k4461m7370M7751M5243m2737
11700B6926L1192K3462L0114K4421o5988m0784M9841j6530K1131O96J8191J1035
11688A13707N0734K4300l5562l8706o272M3710L8478N096k6749o276N058j8091
11676A49427q219n4769M3997J7982l5469K5868J557m9340n2918j3984K8188P252
11664E9572M1380K6588n921j1889J2291N0419M862n9306L5439J1340J8846k8854
$$ y = [140207, 81645, 71937, 155925, 208911, 209916, 194082, 218693, 200538, 188352, 193822, 158822, 150946, 169458, 168607, 141625, 164521, 154853, 148662, 182829, 176834, 163578, 125031, 69727, 89851, 96943, 76598, 87535, 42894, 11972, 15645, 49226, 72639, 119637, 135383, 97694, 74130, 64594, 76794, 51123, 9522, 1139, -8232, 48500, 24039, -23331, 24420, 69663, 26926, 58118, 81580, 111694, 136115, 70127, 29343, 79184, 62654, 83785, 84481, 102672, 113707, 164441, 188741, 153179, 114473, 108201, 151911, 190389, 195485, 168736, 162460, 167518, 149427, 141208, 86439, 130436, 148418, 112949, 138817, 140374, 91034, 38116, 24132, 52320, 59572, 100952, 127540, 121619, 109730, 122021, 172440, 177302, 117996, 153435, 164775, 183621, 154767]
11652A54767k8538k5589k4249l4739L0010P039L1703J3906j692L8219J0372L2921
11640B04130J5432j5770j7791J9031M9434K0288J8654q837q193r695N344L2953
11628C04980l6316l6189k9940o189Q365r44J9756j8226K17J7359K58J7127J4288
11615B54546K7354n776j5309o0851J43o799l8481l1204k968j4035K5865j3487
11603A18998k8863k7790L5753n342J2900m1430L0981P5147J1115J5879K7838j5698
11591B09488j2561l882L2059k3993Q360k5477r841o5780J5186N4527J8364J749
11579A98199O3176J8950j5337N851J5273L5276J3743p3202j1677P723Q105j1409
11567B54671O3080K3585r636M2394L7776M0640M7840m2380l2157n497k3966j3244
$$ y = [154767, 126229, 100640, 76391, 41652, 71662, 78701, 110404, 124310, 122618, 160837, 171209, 204130, 219562, 203792, 186001, 205032, 254466, 274754, 293408, 284571, 276378, 266683, 272027, 304980, 268664, 232475, 202535, 196346, 204711, 203767, 223523, 205297, 205514, 222873, 223131, 240258, 254546, 281900, 276124, 260815, 199964, 200107, 193308, 154827, 123623, 120655, 106620, 132485, 118998, 90135, 62345, 98098, 92756, 105656, 64226, 95207, 170354, 181469, 197348, 225186, 209488, 196927, 193045, 225104, 201111, 209471, 183994, 174153, 108373, 123559, 178086, 196450, 198199, 261375, 280325, 264988, 270839, 286112, 321388, 335131, 261929, 250252, 257975, 266080, 254671, 317751, 341336, 331700, 374094, 411870, 452510, 500350, 457970, 425813, 420316, 396350, 383106]
11555C83106p6579K2296L3644m9898o0426L6172m315k8684j044P251J8605j3796
11543B66332L894K8401J0930k9154p737K2271j4370o467k7980j6688L1472n788
11531B55116l5649l6065R171J7242K250L1766M3603L0678l0142R514K8554k4971
11519C01067r839p433Q827N4552L384Q199M2831N3283M7636K0336J1732M6786
11507E81361O8362l4027q8881k2308j3252n9308m241m4583k9696l4864m5366l4841
11495B38356l6563l9186L5877Q0982P175k256K2621k2133k1232J9464j1384l073
11483B68648k5532J8343P231q008Q271J6380M964L8121L2799J4578n30o180j8992
11470C50093k123O6346L0922m5280k9804k016l012M0291K9264k221k530K0067
$$ y = [383106, 306527, 328823, 362467, 312569, 252143, 288315, 284000, 255316, 254272, 261523, 280128, 266332, 270226, 298627, 309557, 280403, 272666, 294937, 280567, 274100, 246120, 229432, 260904, 255116, 219467, 183402, 192573, 209815, 212065, 243831, 287434, 318112, 287970, 297484, 326038, 301067, 291228, 283795, 292622, 347174, 350558, 358757, 401588, 454871, 502507, 522843, 534575, 581361, 649723, 615696, 526815, 504507, 491255, 431947, 427706, 383123, 353427, 318563, 273197, 238356, 201793, 162607, 198484, 279466, 286641, 284385, 307006, 284873, 263641, 283105, 271721, 268648, 243116, 261459, 268690, 260682, 268953, 285333, 290297, 328418, 361217, 375795, 375265, 369085, 350093, 347970, 414316, 445238, 399958, 370154, 368138, 365126, 405417, 434681, 432460, 429930, 449997]
11458D49997o3225m2339N078L9495o980m3940K6167L0916M5609K3872l21J9135
11446D83464L7023o170J2615N6689K5533k4419K2821K874j3059l5268J7831O6971
11434F46905k399j7414N9915P8215J6280O2938R5804J40423J97799Q1040P7715
11423A437221J14531J43460J92307L11945M12280M54023N79498P86158R70807
11414E402230J288886J704598K356223L025672L277414K814681J533139j73955
11406B1228888j819524k761920k913096k611043j996287j314614p94970m35753
11398F581681j87621O5567K61228M72262P88118J165456J757408K488998L077088
11389A6470185L124716K375538Q54334j045272k589566l327707l247713k675437
$$ y = [449997, 386772, 344433, 349511, 389006, 382026, 338086, 364253, 395169, 440778, 464650, 464329, 483464, 520487, 514317, 526932, 583621, 609154, 584735, 607556, 610430, 597371, 562103, 579934, 646905, 644506, 627092, 687007, 765222, 781502, 844440, 940244, 1080667, 1278466, 1359506, 1437221, 1551752, 1695212, 1887519, 2199464, 2611744, 3065767, 3645265, 4431423, 5402230, 6691116, 8395714, 10751937, 13777609, 17055023, 19869704, 21402843, 21228888, 19409364, 16647444, 13734348, 11123305, 9127018, 7812404, 7017434, 6581681, 6394060, 6459627, 6720855, 7193117, 7981235, 9146691, 10904099, 13393097, 16470185, 19594901, 21970439, 22824773, 21779501, 19189935, 15862228, 12614515, 9939078]
11381I939078k051509j494827j059906p83323o36223m74371l41165k48953k64963
11372B583838k04896j77946j48821o6429q4967m8078j0974J6748J7555k9029O118
11361A853119k580n244j0303M4517M8923J44780J63729J52322J96234K50063L78770
11350C214330N19597O44864P33455Q92713J156369J571076K211976L026392L652941
11341A7623713L684112K797201J172780p06791k272547k998912k712805j979318
11333A4607433j077557j25289Q33229J789750K687994L215106L106706K215344
11325B7252716R13237k37102o43498j91009O44845J146738Q45708l13831j868955
11316B7548849l033478l447755l128965k280487j317501m40540M90241J408653
$$ y = [9939078, 7887569, 6392742, 5332836, 4549513, 3913290, 3438919, 3097754, 2848801, 2583838, 2378942, 2200996, 2052175, 1985746, 1900779, 1852701, 1841727, 1858475, 1876030, 1847001, 1853119, 1850539, 1845295, 1834992, 1879509, 1928432, 2073212, 2236941, 2389263, 2585497, 2835560, 3214330, 3733927, 4378791, 5112246, 6004959, 7161328, 8732404, 10944380, 13970772, 17623713, 21307825, 24105026, 25277806, 24571015, 22298468, 19299556, 16586751, 14607433, 13529876, 13404587, 14237816, 16027566, 18715560, 21930666, 25037372, 27252716, 28165953, 27928851, 27285353, 27094344, 27739189, 28885927, 29731635, 29417804, 27548849, 24515371, 21067616, 17938651, 15658164, 14340663, 13900123, 14390364, 15799017]
11308A5799017K117713K378409J894606O03744j063528k466804l202731l176474
11300A2883952k619207j995974j440207j000805p81457o38982m98080l48430l19995
11291C240815k93753k67854j99013j39657j17871j26394j1803k7403l2197K3126
11281B047996O7152J38287J65871J39568J20140J13498M765j10911j18724n6240
11271B511402O8507J59514K22508L02567M54855O18548P75218R29983J235728
11262G278830J778174K530998L266502L450328K809211J389125n28099k280440
11254A9694629l207694l206726k610728j857288j213086o42011l57549j18432
11246F481115J48019L50932N45514P80882J139801J658890K227371K730199K839942
$$ y = [15799017, 17916730, 20295139, 22189745, 22793489, 21729961, 19263157, 16060426, 12883952, 10264745, 8268771, 6828564, 5827759, 5046302, 4407320, 3909240, 3560810, 3240815, 2947062, 2679208, 2480195, 2340538, 2222667, 2096273, 2084470, 2057067, 2024870, 2047996, 2115148, 2253435, 2419306, 2558874, 2679014, 2792512, 2797277, 2686366, 2567642, 2511402, 2579909, 2739423, 2961931, 3264498, 3719353, 4337901, 5113119, 6043102, 7278830, 9057004, 11588002, 14854504, 18304832, 21114043, 22503168, 21975069, 19694629, 16486935, 13280209, 10669481, 8812193, 7599107, 6957096, 6599547, 6481115, 6629134, 6980066, 7525580, 8306462, 9446263, 11105153, 13332524, 16062723, 18902665]
11237A8902665K089028O72249j048913k451641l046446l053166k592387j950890
11229G520499j403810j036082p62742n91212m92296m35969l40063k26014k57286
11220A975025k31357j71703r8817p5425j41573r9526q8947r4960n8079K4164j3488
11209I25314o0039p2918j8899K7813P5437M9505l9510K532j9379O9383P9654O1938
11197A080831K9234m6720M37j3160o7697m7196j4350p2911j00780q7170r8897
11186E61621p2648O86N810R110l6919o1715p4081j176K1453k1418k858N57J7916
11173C46338L335P5529N4601N6016r775K8363O9392J31935K10284K05527M1733
11162A213278l7069l1295O7727m2709j52682j82413j60880k7998K8711k5199R861
$$ y = [18902665, 20991693, 21663942, 20615029, 18163388, 15116942, 12063776, 9471389, 7520499, 6116689, 5080607, 4317865, 3726653, 3234357, 2798388, 2458325, 2232311, 1975025, 1743668, 1571965, 1473148, 1397723, 1256150, 1156624, 1067677, 972717, 914638, 938802, 925314, 865275, 792357, 773458, 801271, 876708, 926213, 886703, 889235, 869856, 939239, 1018893, 1080831, 1110065, 1063345, 1063782, 1050622, 982925, 935729, 921379, 848468, 747688, 660518, 561621, 488973, 489659, 495469, 504579, 467660, 405945, 331864, 330688, 352141, 330723, 327865, 328422, 346338, 349673, 425202, 479803, 535819, 526044, 554407, 623799, 755734, 966018, 1171545, 1213278, 1176209, 1144914, 1212641, 1169932, 1017250, 834837, 673957, 645959, 674670, 649471, 659332]
11151F59332L1459j2265q585r291J6996l2623l5805O40k2217o7956p0113k7141
11139D22431l8378j4563m3715k3654m192J2179J1505l938M8942N1336j3398j6762
11127C87793j9108R778R9096O1030J9928O52l875N8386M5062K5119R972j0775
11115F83058R451N3817O2057N5164L5443M8809P0341J11439J53565J44270R3506
11104A520920J43733K95987L37323L98986N40548O98462Q37369J110555J397644
11095G281527J727585K276239L059267M150001N499087O475130O399003M748762
11087D1616601J582959k113377n051438o433296o344024n248651l948072k824608
11079A1236094k044491j469699j155593q93651p21293n82057m70801m07866k85253
$$ y = [659332, 690791, 678526, 669941, 660650, 677646, 645023, 609218, 609858, 587641, 519685, 449572, 422431, 384053, 369490, 325775, 302121, 297929, 310108, 321613, 317675, 366617, 417953, 404555, 387793, 368685, 378463, 477559, 538589, 558517, 559169, 555294, 613680, 658742, 683861, 693833, 683058, 692509, 746326, 808383, 863547, 898990, 947799, 1018140, 1129579, 1283144, 1427414, 1520920, 1664653, 1960640, 2297963, 2696949, 3237497, 3935959, 4773328, 5883883, 7281527, 9009112, 11285351, 14344618, 18494619, 23993706, 30468836, 36867839, 41616601, 43199560, 41086183, 36034745, 29601449, 23257425, 18008774, 14060702, 11236094, 9191603, 7721904, 6566311, 5672660, 4951367, 4369310, 3898509, 3490643, 3205390]
11070C205390k17498k01785k00143j68955k01581j30459j03094j50770j16441
11061A714664m0081k4690l6072m9410l0661j3885m918M1891J0513M5843K6450
11050A639644K4998O4021K9170R0551O0760R8140J26665J55077K23993K93186
11040B806205L88252M46814N75030P40551R30395J167191J415794J756266K239052
11031A2465550K970672M109360N490346O643999O880633N480749K446233j268469
11023D5219073m591806o393893o561981n602505m080316k684666j567674q62696
11015A2873536j27928L96110R74427J704682K580646L743016N006141N758070
11007C2908700N267891L226061J14055l195789n532652o294289n773859m638385
$$ y = [3205390, 2987892, 2786107, 2585964, 2417009, 2215428, 2084969, 1981875, 1831105, 1714664, 1674583, 1649893, 1613821, 1564411, 1533750, 1519865, 1514947, 1556838, 1567351, 1613194, 1639644, 1664642, 1728663, 1757833, 1848384, 1909144, 2007284, 2133949, 2289026, 2513019, 2806205, 3194457, 3641271, 4216301, 4956852, 5887247, 7054438, 8470232, 10226498, 12465550, 15436222, 19545582, 25035928, 31679927, 38560560, 44041309, 46487542, 45219073, 40627267, 34233374, 27671393, 22068888, 17988572, 15303906, 13736232, 12873536, 12745608, 13141718, 14116145, 15820827, 18401473, 22144489, 27150630, 32908700, 38176591, 41402652, 41516707, 38320918, 32788266, 26493977, 20720118, 16081733]
10999A6081733l415626k454403j718566j276775r89889q43859o43524n26965m46591
10990C765535l19094l31518l04602k66153k01584j00161q1607q3164j01523m8773
10980A927356m9267o6109n5942n0930k3607n2402m021l7384m6659k1833k595J9092
10968A535699J8640L4776Q0605O5789R1145J23661J13861J71693K09434K31304
10958B676607L27070M27120O34086Q19352R38219J129677J411626J866278K404736
10949A2634771L109372M241683N513814O310860O025916M120147R26378k677405
10941D0205536n437226o584261o290691n143365l810019k662070j846450j315662
10933G115792r99109q53547p29263n89169m55465m15795l52208k28887k10242
$$ y = [16081733, 12666107, 10211704, 8493138, 7216363, 6226474, 5382615, 4739091, 4212126, 3765535, 3446441, 3114923, 2810321, 2544168, 2342584, 2242423, 2160816, 2077652, 1976129, 1927356, 1878089, 1811980, 1756038, 1705108, 1681501, 1629099, 1625078, 1587694, 1541035, 1519202, 1516607, 1535699, 1554339, 1589115, 1669720, 1735509, 1826654, 1950315, 2064176, 2235869, 2445303, 2676607, 3003677, 3430797, 4064883, 4884235, 5822454, 6952131, 8363757, 10230035, 12634771, 15744143, 19985826, 25499640, 31810500, 37836416, 41956563, 42882941, 40205536, 34768310, 28184049, 21893358, 16749993, 12939974, 10277904, 8431454, 7115792, 6116683, 5263136, 4533873, 3944704, 3489239, 3073444, 2721236, 2492349, 2282107]
10924B282107j50373j15434j34157p7130n1735j6900k811P2102J03254Q2759J34007
10913B125689K04501L32672N55769P14930Q14423P84516M97823j184m40789p51362
10903D836988q20819p53934n92760l95193k59544k12426j59578j21958q7092m7785
10893A385899m6973n0681k0836J5864j9881p0177j03527l7229k722m2769k3713
10882I83255j2622k2129O6367R0587M8275K3288P3684N0641L2773K7906P9882
10871A441907J24193J21463J72761K80588L32834N09000P11514P09994N94135
10862D998389K99930j51675m19378n62623o23802n02402l49696j78172q0957M759
10852B434373Q0552R9595O2307J13258J61842J83097K53390L03430L55137M65467
$$ y = [2282107, 2131734, 2016300, 1882143, 1805013, 1753278, 1736378, 1733567, 1805669, 1908923, 1991682, 2125689, 2330190, 2662862, 3218631, 3933561, 4747984, 5532500, 6030323, 6029139, 5588350, 4836988, 4016169, 3262235, 2669475, 2274282, 2014738, 1802312, 1642734, 1520776, 1433684, 1385899, 1338926, 1288245, 1267409, 1283273, 1263392, 1193215, 1089688, 1052459, 1049737, 1006968, 983255, 970633, 948504, 1014871, 1105458, 1153733, 1177021, 1250705, 1301346, 1334119, 1362025, 1441907, 1566100, 1687563, 1860324, 2140912, 2473746, 2982746, 3694260, 4404254, 4998389, 5298319, 5146644, 4727266, 4164643, 3540841, 3038439, 2688743, 2510571, 2429614, 2434373, 2514925, 2614520, 2676827, 2790085, 2951927, 3135024, 3388414, 3691844, 4046981, 4512448]
10842D512448N64158O66393Q59957J049769J187230J504216J897986K319578K940634
10833A7502369L959351N355357P362738R838316J2136146J2881444J0908076O073870
10825H6017667p8922n395352q068564p825575n197128j273734L005747O816289
10817F8000428Q851088P950111L760054k476938q317216j1811675j2506506j0925917
10809D2523429q549184o261465m450827l197938k341817j813204j398637j068408
10801A3441949p72549n07783k56853j02483R2588L53236N81116Q37197J140815
10792A4807233J619161K201504K876171L764369N063843O993132R551487J2340014
10784E9216914J4418748J4603117J1944927P119645J989399j193060j358693N22074
$$ y = [4512448, 5076606, 5742999, 6602956, 7652725, 8839955, 10344171, 12242157, 14561735, 17502369, 21461720, 26817077, 34179815, 44018131, 56154277, 69035721, 79943797, 86017667, 85938745, 80543393, 72474829, 64649254, 59452126, 58178392, 61184139, 68000428, 76851516, 84801627, 88561681, 86084743, 77767527, 65955852, 53449346, 42523429, 33974245, 27712780, 23261953, 20064015, 17722198, 15908994, 14510357, 13441949, 12669400, 12161617, 11904764, 11802281, 11894869, 12248105, 12829221, 13666418, 14807233, 16426394, 18627898, 21504069, 25268438, 30332281, 37325413, 46876900, 59216914, 73635662, 88238779, 100183706, 107303351, 109292750, 108099690, 106740997, 107263071]
10776A07263071J596173P4700m298389r754050j3829168j5166661j3923547j1214089
10768D0748040q360503o005948m399533l310409k643367k103786j730890j430223
10760A0763381j245474j028201q62314o84074o42956o38138n31078m72730l71773
10751D286643l43889k91783k11629j59928j66847j28077l4128L0382O7332O9479
10741C117555J28961K59194M27278O31629Q29460Q33812O44918K25877l08545
10732F790139o99184q16292p02478n14227j85045j4172K2435M8443J11717J72862
10722D214198j1648k68330k26093k97359l46703l72568l71643k63652k66039j68287
10712A621876j11616o9414m9049o3571J1921J6508N907j2212N3598J26163R4680
$$ y = [107263071, 108859244, 108933944, 104635555, 94881505, 81052337, 65885676, 51962129, 40748040, 32387537, 26381589, 21982056, 18671647, 16028280, 13924494, 12193604, 10763381, 9517907, 8489706, 7627392, 6943318, 6300362, 5662224, 5131146, 4658416, 4286643, 3942754, 3650971, 3439342, 3279414, 3112567, 2984490, 2950362, 2980744, 3048076, 3117555, 3246516, 3505710, 3932988, 4564617, 5394077, 6227889, 6872807, 7098684, 6790139, 6090955, 5274663, 4572185, 4057958, 3872913, 3858741, 3881176, 3929619, 4041336, 4214198, 4202550, 3934220, 3708127, 3410768, 3064065, 2691497, 2319854, 2056202, 1790163, 1621876, 1510260, 1440846, 1391797, 1328226, 1340147, 1356655, 1362562, 1350350, 1403948, 1530111, 1624791]
10701A624791Q5286K23391L37453M34174O23872O69901N39045L32769q1953n40117
10691D248612o92641p17969n96540m28606k43785k28080j60466p2538m8354m6541
10681A013092o0759k9253m5524n3583q5399o3713k889O0556L2908L7782P4433
10670H77651M9126O3681K8993K9738P1166M9854O4787l292l3629m7029r8693n3682
10658I98671p4404p6353r1884m4971n9581n7178l7096K8473J9165m2947o6685
10647D95210k5150q793m4619j7786J9358M114j4581k2407m6463M510P099P514
10635C58006l6512q7398m3656l3634m569J2847L9407N5347O0687L5360O4666Q6421
10623E06972J66658J58818R0392R106n3907j06170q2813j03534r5070o6030m7627
$$ y = [1624791, 1710077, 1933468, 2270921, 2705095, 3328967, 3998868, 4537913, 4870682, 4788729, 4248612, 3555971, 2838002, 2241462, 1812856, 1569071, 1340991, 1180525, 1107987, 1059633, 1013092, 952333, 923080, 877556, 823973, 738574, 674861, 671972, 732528, 765436, 803218, 877651, 926777, 990458, 1019451, 1049189, 1120355, 1170209, 1234996, 1231704, 1198075, 1151046, 1052353, 998671, 924267, 847914, 756030, 711059, 651478, 594300, 557204, 585677, 604842, 561895, 495210, 470060, 461267, 416648, 398862, 418220, 422334, 407753, 385346, 338883, 343393, 350492, 358006, 321494, 234096, 190440, 156806, 152237, 165084, 204491, 259838, 320525, 355885, 420551, 506972, 673630, 832448, 922840, 931946, 878039, 771869, 689056, 585522, 490452, 424422, 376795]
10612C76795k097j0953J3503P143k2793J6681O0851Q861j4432M4087O9381O6199
10600F13226J7890j0636j2374L0805K6808n0097l2235k9358M5328R92j1878P542
10588E96013l0878m8281j0347j0704M341J3303K1839J20143M2227L3133L4887
10577G65676k6683J6584K6913L356n9708q4429r3504o6767l5219k1427j3926j9018
10565C91848l0248n6809j0916m4159j2865K2085R161k8818l8140J8696N134J0253
10553B35222L2018K2966K548j8344K2965k0584m4593l2292J945L5725o0532k7276
10541A49768L3661O0996J9652k3994R053J5758L5891J1231k3066j6751M80Q641
10529B81320N3896N0759R045O7214Q4214K8380p389j4766J2768j1303J2994j4786
$$ y = [376795, 374698, 363745, 377248, 384391, 361598, 378279, 439130, 447991, 433559, 477646, 547027, 613226, 631116, 620480, 608106, 638911, 665719, 615622, 583387, 554029, 599357, 600349, 588471, 596013, 565135, 516854, 506507, 495803, 500144, 513447, 535286, 655429, 697656, 730789, 765676, 738993, 755577, 782490, 785846, 726138, 641709, 548205, 481438, 446219, 424792, 410866, 391848, 361600, 304791, 293875, 249716, 236851, 258936, 268097, 239279, 201139, 219835, 224969, 235222, 267240, 290206, 292754, 274410, 297375, 276791, 232198, 199906, 201851, 237576, 177044, 149768, 183429, 244425, 264077, 240083, 249136, 264894, 300785, 312016, 288950, 272199, 272679, 281320, 335216, 385975, 395020, 462234, 546448, 574828, 567439, 552673, 565441, 554138, 567132, 552346]
10517E52346o1708l9497n2760q4573m5729j1407l0688m2298o212O601j3461L4179
10505B04793M97j4995O6014L4149M6260N4680P572M0944M1963N988j7580J659
10493D71944J3753q507j5094l9510k4297l4126K0393N0490J8429J4393N6818J8167
10481E42853P984K4490O7507Q6945J919N4790J07747N8808L3414m8865j16557
10470H21035p6713j3225k2000p9098n9532k4079n7245r4192j7959P3230J1158
10459D61380k9485j5009k3157M0234O4794M0792K1723m5275j4077k9527n191J5291
10447D82493N2447M3968l2775J197l7040j5364r145n3148j5705M7926L0205L8995
10435E34054N7255N4320J02088M2169L821k7484K322r695n7034l5671n5810l3238
$$ y = [552346, 490638, 451141, 398381, 313808, 268079, 256672, 225984, 183686, 177474, 184075, 170614, 204793, 205290, 190295, 256309, 290458, 336718, 391398, 398970, 439914, 481877, 487865, 470285, 471944, 485697, 477190, 462096, 422586, 398289, 364163, 384556, 435046, 453475, 467868, 524686, 542853, 550837, 575327, 642834, 729779, 731698, 786488, 894235, 953043, 986457, 937592, 821035, 744322, 731097, 709097, 629999, 570467, 546388, 489143, 394951, 376992, 450222, 461380, 431895, 416886, 393729, 433963, 498757, 539549, 561272, 515997, 501920, 472393, 467202, 482493, 534940, 578908, 546133, 547330, 510290, 494926, 485781, 432633, 416928, 464854, 495059, 534054, 591309, 645629, 747717, 789886, 793707, 766223, 768545, 758850, 701816, 666145, 610335, 577097]
10423E77097m0319o6964J2958O3655n370K5413Q0459j6352K203m7183O961J2801
10411F05359M2652j0795M3601J7262L0935P8835J49179J28532Q3602P7122J51739
10400A398023K44798K43224K9833j07102j16746j72454j40029L846O240l7066
10390A352567k2955n8057J5933P41k0092j9894k0132k0114j2076L1610P4434R6593
10378A398558K931l9080L8337R9515J06333K3301M0009L9583O9697k730L6212
10367A812666J12701J23722J26298J46245J99355K28441K18479K52609K79440
10358C499956K80590L62733L13397K59301K93680L56698L70738L73766N32737
10349F643596O37762O76503Q26716R12865J028278J338189J703033J767818J817161
$$ y = [577097, 536778, 469814, 482772, 546427, 541057, 566470, 646929, 630577, 632780, 585597, 592558, 605359, 648011, 637216, 680817, 698079, 729014, 807849, 957028, 1085560, 1169162, 1246284, 1398023, 1642821, 1886045, 1915878, 1808776, 1692030, 1519576, 1379547, 1383393, 1389633, 1352567, 1329612, 1271555, 1287488, 1288229, 1268137, 1248243, 1228111, 1207997, 1195921, 1227531, 1301965, 1398558, 1401489, 1362409, 1400746, 1500261, 1606594, 1629895, 1669904, 1709487, 1779184, 1776454, 1812666, 1925367, 2049089, 2175387, 2321632, 2520987, 2749428, 2967907, 3220516, 3499956, 3780546, 4143279, 4456676, 4715977, 5009657, 5366355, 5737093, 6110859, 6643596, 7281358, 7957861, 8784577, 9697442, 10725720, 12063909, 13766942, 15534760, 17351921]
10340A7351921K123455K689255L246923L770793M584952N896106P578500R775653
10332E7017558J3097846J8335160K7243887M1848439O0694268O4820354M6338641
10325C29396153M2230281N4184577M4804052k315507l5728496m1078786m0760395
10318C50731879n4017854o0934826n8280260m6562725l1407220k0394148j3809315
10311F5325531r820563p447401o049584n072576m179484l438391k998391k627943
10303B3691198k173085j963880j978117j831433j546694j456873j394563j309533
10295A0037020j116252r46254p47259o06771m93858m52210l34486k68277k63438
10286D808215k11179j86494j43262j41250j57875j84152j47587j78980j55887
$$ y = [17351921, 19475376, 22164631, 25411554, 29182347, 33767299, 39663405, 47241905, 57017558, 70115404, 88450564, 115694451, 157542890, 218237158, 283057512, 329396153, 371626434, 425811011, 470615063, 468299556, 432571060, 391492274, 350731879, 296714025, 235779199, 177498939, 130936214, 99528994, 79134846, 65325531, 55504968, 48057567, 42007983, 36935407, 32755923, 29317532, 26319141, 23691198, 21518113, 19554233, 17576116, 15744683, 14197989, 12741116, 11346553, 10037020, 8920768, 7974514, 7227255, 6620484, 6126626, 5674416, 5339930, 5071653, 4808215, 4597036, 4410542, 4267280, 4126030, 3968155, 3784003, 3636416, 3457436, 3301549]
10277C301549j45653j23965j23362r2075j63488r5499r0348j33156j17178o7598
10267B149227r1378o5617l0915r7990l9735k9535j1886n9065k5712K1407J2348
10256A731149p7062m7826j3210m3041l5136l5681m9729j3397l1493j3826j5440
10245A355308m9260j6666l5696l3303l3141m1758L7669J219M7j5687q4046j3575
10233A071111m0359j0816J798k4889k5636k5028n4036k1248K381O242N194l0809
10221H53905k9744j188K6670J5024k4512J8906k0860l4909k1166j5027j6735J7790
10209G68154J4549j6435K7875L669k5249J8829l5794k0940k3396l9242j170l378
10197F67472l0053l7660K74n720M6586o0164n5651j1054J7126J9580M4438p02
$$ y = [3301549, 3155896, 3031931, 2908569, 2816494, 2653006, 2557507, 2467159, 2334003, 2216825, 2149227, 2057849, 1992232, 1961317, 1863327, 1823592, 1794057, 1782171, 1723106, 1697394, 1718801, 1731149, 1654087, 1606261, 1593051, 1550010, 1514874, 1479193, 1429464, 1416067, 1384574, 1370748, 1355308, 1306048, 1289382, 1253686, 1220383, 1187242, 1145484, 1183153, 1184372, 1184419, 1168732, 1084686, 1071111, 1030752, 1019936, 1021734, 996845, 971209, 946181, 892145, 870897, 873278, 879520, 884714, 853905, 824161, 822973, 849643, 864667, 840155, 859061, 838201, 803292, 782126, 767099, 750364, 768154, 782703, 766268, 794143, 797812, 772563, 791392, 755598, 734658, 711262, 672020, 670850, 667472, 637419, 599759, 600033, 594313, 640899, 580735, 525084, 514030, 531156, 550736, 595174, 594472]
10185E94472k1488j7491l7209k1861m4004p672k8856l1847j2589P556J2971j8810
10173C73172P175M8323l0230N6201L0244k0279k8599j2033j1997L8280N7420N5140
10161E62817j139m2222n7230k1782K2760j6380l0143o8784p8182k9884L6455L7695
10149C13981M4712K6577M8340k7091j3443J8135J0840K0789L6030P0929J333J391
10137E52523l4040J7571J6504K1172J2747K4256l6918j06022o0185q3783m2371
10126B81454n0512n5521M9996J373l0799o6315M5620J14674M7578j7198Q58j4492
10114C06716K1885M9688J588l7785m2631J4506K5209j2907k6680J0353M6490l253
10102C53179M051K9126L048m1933m018K7991J303M975K3967l2085K1025K2659
$$ y = [594472, 572984, 555493, 518284, 496423, 452419, 444747, 415891, 384044, 371455, 379011, 391982, 373172, 380347, 428670, 398440, 454641, 484885, 464606, 436007, 423974, 411977, 450257, 507677, 562817, 561678, 519456, 462226, 440444, 463204, 446824, 416681, 347897, 269715, 239831, 276286, 313981, 358693, 385270, 433610, 406519, 393076, 411211, 422051, 442840, 478870, 549799, 551132, 552523, 518483, 536054, 552558, 573730, 586477, 610733, 573815, 467793, 407608, 323825, 281454, 230942, 175421, 225417, 226790, 195991, 129676, 175296, 289970, 337548, 320350, 321208, 306716, 328601, 378289, 379877, 342092, 299461, 313967, 339176, 326269, 299589, 309942, 356432, 353179, 357230, 386356, 389404, 347471, 343453, 371444, 372747, 377722, 401689, 369604, 390629, 413288]
10090D13288K6265j1802n7714l7978p937k0173J3715N8079K7261o8486n1957K0557
10078C03118N2489O9565m5522k090J0325q007m1142k6616K3906N959k553M8778
10066C88210l4693l4628J5429O807O30J0824n936J0801j0957j3621m4404k1477
10054B66985J0244j6808o4099l6048M1489O9690J4543L3983N3288j7097J3678
10043C69848k1434J8986j7017L6962P2929R2862N4875J92257J26583j7097r0915
10032H18839j13024j26624r5549p7420n4197k5313n6336l2533O2504P5723N2614
10021D28684P5847L549j5336M5895P8157K0034k1548m9339o8859o7415k0476l1030
10009C78163k0304p035o220j8029k3822N90J4982N6335j1517p7498k959K0763
$$ y = [413288, 439553, 427751, 370037, 332059, 324122, 303949, 317664, 375743, 403004, 334518, 282561, 303118, 355607, 425172, 379650, 377560, 387885, 379878, 338736, 312120, 336026, 341985, 339432, 388210, 353517, 318889, 334318, 341125, 341755, 352579, 346643, 357444, 346487, 332866, 288462, 266985, 277229, 260421, 196322, 160274, 201763, 271453, 285996, 319979, 373267, 356170, 369848, 348414, 367400, 350383, 387345, 460274, 553136, 608011, 800268, 926851, 909754, 818839, 705815, 579191, 483642, 406222, 352025, 326712, 270376, 237843, 300347, 376070, 428684, 504531, 508080, 492744, 538639, 616796, 636830, 615282, 565943, 497084, 429669, 409193, 378163, 357859, 350824, 344604, 326575, 302753, 303343, 318325, 374660, 363143, 285645, 282686, 303449]
9997C03449P7261R020o2564J0281J7182j4215N086J784j3213J0039k0789k6664
9985B96657l0720n8292o5258j864L2067L6805l864j0642L5722M3160l572m2387
9973B27812n4449j7161Q7016K2588k8279j1387l989l3874L1718J728j734l5924
9961A84065k3480j2668K6460N561j5747L1042M1008K6591N54j4562L7400J754
9949B87978J7859M2882P568k5492r68j3239Q985j125N032K123J6632l4693k3491
9936B90051q668Q879K8557L387K4176j8007J8608J1850K6570P6991J13944J26520
9924G02858K59087L18183L49385K67076J86363K83604K89789R0969j30287k09578
9914B407449j99754k99692l81111l11143k67020j65057j38029j13409l6762j5244
$$ y = [303449, 380710, 389730, 327166, 337447, 354629, 340414, 345500, 347284, 334071, 344110, 323321, 296657, 265937, 207645, 142387, 140523, 172590, 209395, 205531, 194889, 230611, 273771, 270199, 227812, 173363, 156202, 243218, 265806, 237527, 226140, 222151, 188277, 219995, 221723, 219989, 184065, 160585, 147917, 174377, 179938, 164191, 195233, 236241, 262832, 263386, 248824, 286224, 287978, 305837, 348719, 356287, 330795, 329827, 316588, 325573, 324448, 329480, 331603, 348235, 313542, 290051, 281383, 290262, 318819, 322206, 346382, 328375, 346983, 358833, 385403, 462394, 576338, 702858, 961945, 1280128, 1629513, 1896589, 2082952, 2366556, 2656345, 2747314, 2617027, 2407449, 2207695, 1908003, 1526892, 1215749, 948729, 783672, 645643, 532234, 495472, 480228]
9904D80228j9817j9077n0099m5957K056j6578k7767M25K5545M939k5282Q491M1526
9891C58633j6560n4407m1548J5722J104k9347J5336k72l1307j0480N911Q435M8425
9878B69645n608o2695n3319k988O116m8798q07P6551N8348O8939M2870N23j8226
9865C30551m9855l0231J7704R799m6256n2340J3710M1640M532O228k614K2095
9853B64963k2094L647N0431L3645J3881l2583N043K4322J8214K7K2112j6088M801
9840C70321k4229O252j4799K9837K1780J4842l3750J7735L5598J2173Q689j788
9828D42661n8097j8226L921l106j5250n983k5048m268n0423J7381J817K1128K9714
9815C36221J0430K121J7519j795J7126K6403L2765L386J1943j2472l7114J5049
$$ y = [480228, 460411, 441334, 391235, 345278, 347334, 330756, 302989, 303414, 328959, 333898, 308616, 317107, 358633, 342073, 287666, 246118, 261840, 262944, 233597, 248933, 248661, 217354, 206874, 212785, 221220, 269645, 264037, 201342, 148023, 145035, 151151, 102353, 101546, 178097, 236445, 305384, 348254, 348777, 330551, 280696, 250465, 268169, 277968, 231712, 179372, 193082, 234722, 239254, 245482, 242868, 264963, 242869, 246516, 296947, 330592, 344473, 311890, 316933, 341255, 359469, 359496, 381608, 365520, 370321, 346092, 352344, 337545, 367382, 389162, 404004, 370254, 387989, 423587, 435760, 444449, 442661, 384564, 366338, 370259, 367153, 351903, 345920, 320872, 316604, 266181, 283562, 285379, 306507, 336221, 346651, 348772, 366291, 364496, 381622, 408025, 440790, 444176, 456119, 443647, 406533, 421582]
9803D21582M2058K1411j5916L3608l1787k7197Q674J6809L5049M530n0309j9289
9791D39223j7166r943l9495L629L0441M8857j0225L3850k3118j4108K5540p22
9779D66763K6644p194R439n619k3038N6964J9344J8108K2464n468j4835k0433
9767E43139R271k059q686j2450m176N3406N9191Q5470L1971n535J8995K46j9089
9754G49694k212p937l3451k219p710l455j7525J5769L3499O971P294R602K8291
9741G76611M9502Q7877Q7641R2411J04736J27289J29185J53874K13924K57615
9731B080665L26563L21293K94145K56871K28017K33808J93120J78873K43030K88207
9721D644592K94319K83848J80108N0615o9802n4553n6412n8782M5585J69216J81704
$$ y = [421582, 463640, 485051, 469135, 502743, 470956, 443759, 452433, 469242, 504291, 508821, 458512, 439223, 422057, 412114, 372619, 376248, 406689, 455546, 445321, 479171, 456053, 441945, 467485, 466763, 493407, 486213, 495652, 490033, 466995, 523959, 543303, 561411, 583875, 578407, 563572, 543139, 552410, 550351, 541665, 529215, 525039, 578445, 637636, 723106, 755077, 749542, 768537, 768783, 749694, 747482, 739545, 706094, 703875, 696165, 692710, 675185, 690954, 724453, 731424, 738718, 748320, 776611, 826113, 913990, 1001631, 1094042, 1198778, 1326067, 1455252, 1609126, 1823050, 2080665, 2407228, 2728521, 3022666, 3279537, 3507554, 3741362, 3934482, 4113355, 4356385, 4644592, 4938911, 5222759, 5402867, 5453482, 5383680, 5329127, 5272715, 5213933, 5259518, 5428734, 5610438]
9710E610438K33501L09690M97957O37557Q65437Q40405N72994L85875L82358M48430
9700A0784642N70663P05039P52288O94220N38870L35094J44542m0646p8372j60193
9690A4246147j72395k26247k73412l53662m01167m32950m25948l06238j69971
9681A1484157J7346J35155J88809K61174K95430N27553O55809O47916O20526M94442
9671A5328317M53005L29499K78700K87334K18437J36608j29304l86045o39672
9662A5876879p39493p37214o90775o62751n55690m93230n08036n85830n69998
9653A0333862m48293k15818Q122J42016K23326K56132K50266K61960L29189M09780
9643A1550542M08468L86445K45513J31027r4732k27324l81771m83959m55167l84628
$$ y = [5610438, 5843939, 6153629, 6651586, 7289143, 8154580, 8994985, 9567979, 9953854, 10336212, 10784642, 11355305, 12060344, 12812632, 13506852, 14045722, 14380816, 14525358, 14484712, 14406340, 14246147, 14073752, 13847505, 13574093, 13220431, 12819264, 12386314, 11960366, 11654128, 11484157, 11501503, 11636658, 11825467, 12086641, 12382071, 12909624, 13565433, 14213349, 14833875, 15328317, 15781322, 16110821, 16389521, 16676855, 16895292, 17031900, 16902596, 16516551, 15876879, 15137386, 14400172, 13709397, 13046646, 12490956, 11997726, 11489690, 10903860, 10333862, 9885569, 9669751, 9677873, 9819889, 10043215, 10299347, 10549613, 10811573, 11140762, 11550542, 11959010, 12345455, 12590968, 12721995, 12627263, 12399939, 12018168, 11534209, 11079042, 10694414]
9633A0694414k87806k45381k72678k87260k76001k06911j3688K35239L73628N13932
9623A0227488N84017N97777O49181O89668P66575Q56076Q03451O33355N08022
9614A6315610L79425J54746m1711j53263k01072j91244k68949m09279m38800n43466
9604A4601997n21453m22812k94081j35467j0314Q8025K50063L89089O25156P41718
9594A5311921Q26583P46563N83319N10181M66714M14018L99424L08583K05439
9585A9772745l945l37355o97963r01731r31206q65301q06311q21928p85217p56466
9575A2865322p53715p20685o47116m56243l25895k27282j58985j51434n2121l9079
9565I332767J04545J63736K00622J87520Q1178r6287l15770m47223n96995n75145
$$ y = [10694414, 10406608, 10161227, 9888549, 9601289, 9325288, 9118377, 9104689, 9339928, 9713556, 10227488, 10811505, 11409282, 12058463, 12748131, 13514706, 14370782, 15174233, 15807588, 16315610, 16695035, 16849781, 16808070, 16654807, 16453735, 16262491, 15993542, 15584263, 15145463, 14601997, 14080544, 13657732, 13363651, 13228184, 13217870, 13305895, 13555958, 13945047, 14570203, 15311921, 16138504, 16885067, 17468386, 17978567, 18445281, 18859299, 19258723, 19567306, 19772745, 19768800, 19431445, 18733482, 17831751, 16900545, 16035244, 15228933, 14407005, 13621788, 12865322, 12111607, 11390922, 10743806, 10287563, 9961668, 9734386, 9575401, 9423967, 9371846, 9332767, 9437312, 9601048, 9801670, 9989190, 10070368, 9974081, 9658311, 9211088, 8614093, 8038948]
9555H038948m35949l47338l60608m18662n45128n11116n64149n50311m81565m18393
9545C405729l74617k93125k64647j66800j15157r5496j31416j01321j48482m9588
9535A665080n8884j06107k2537M2783N3430j6263m4348r17k3343j9121K1882L4999
9523A526654o001J6863Q3296Q6195N0592R4458J90005K17033K85932L60773M80825
9512C386625O47571P03164O63527M21507P7624k61983m85047n20356n29628l87609
9502C715395k93880k26330j29981j189Q1679J38263K61837L37265M21468N64879
9492D869406Q05596J036692J154184J279099J255146J196075J038613P75345M74786
9483A3884942p2681n66252r19135j140756j230855j141730j016508q57249o22845
$$ y = [8038948, 7602999, 7255661, 6895053, 6476391, 5931263, 5420147, 4855998, 4305687, 3824122, 3405729, 3031112, 2737987, 2473340, 2306540, 2191383, 2095887, 1964471, 1863150, 1714668, 1665080, 1606196, 1500089, 1477552, 1520335, 1573765, 1557502, 1513154, 1512237, 1488894, 1469773, 1491655, 1526654, 1520653, 1537516, 1620812, 1707007, 1757599, 1852057, 2042062, 2259095, 2545027, 2905800, 3386625, 4034196, 4737360, 5400887, 5822394, 5900018, 5638035, 5152988, 4632632, 4103004, 3715395, 3421515, 3195185, 3065204, 3064015, 3145694, 3283957, 3545794, 3883059, 4304527, 4869406, 5675002, 6711694, 7865878, 9144977, 10400123, 11596198, 12634811, 13410156, 13884942, 13812261, 13246009, 12326874, 11186118, 9955263, 8813533, 7797025, 6939776, 6316931]
9474F316931m45230k02221j4302J27645K82136N00617P56826J054710J398755
9465I775867J637588J578710J395757J058403O57459L06611J02956j52434m50145
9456A5910772o55181r05244j075142j210536j308566j297005j222602r68421p36554
9447F531521m31287k42538j19614K9027K64501M74050O00597Q40138J023921J029495
9437I999811R39092Q02901O32422M58669K51535L4206j31765j47042n9992J08065
9427A2887902J83342R8487j39117n08909q77563j144085j247963j140671q23303
9418G288120n82915l86045k06300j0248J62422L49357N58946P74344J048563J257756
9408A0254000J376923J476025J522959J491184J410133J326725J306437J292341
$$ y = [6316931, 5871701, 5669480, 5655178, 5782823, 6064959, 6565576, 7322402, 8377112, 9775867, 11413455, 12992165, 14387922, 15446325, 16103784, 16410395, 16513351, 16360917, 15910772, 15255591, 14350347, 13275205, 12064669, 10756103, 9459098, 8236496, 7268075, 6531521, 6100234, 5857696, 5738082, 5767109, 6031610, 6505660, 7106257, 7946395, 8970316, 9999811, 10938903, 11741804, 12374226, 12832895, 13084430, 13118636, 12986871, 12839829, 12779837, 12887902, 13071244, 13169731, 13030614, 12521705, 11644142, 10500057, 9252094, 8111423, 7288120, 6705205, 6319160, 6112860, 6102612, 6265034, 6614391, 7173337, 7947681, 8996244, 10254000, 11630923, 13106948, 14629907, 16121091, 17531224, 18857949, 20164386, 21456727]
9400B1456727J181489O07148j64146q37133j508148j922270k041236k052140j808328
9391A2911963j434006j083505o83530l22302n2970K17386N32700R15818J398666
9382A2400220J863730K309136K569346K478825K084538J591771J087646O33430
9374B7018642K13844j62433n01596q92202j361465j763634k147436k413193k433185
9365A5557342k181398j726747j199777q25849m36851j31059J16645M38579P54909
9356A0365794J067302J349440J507277J506231J450013J120494O75742K10311
9348A9252604l21432p50758j110909j257104j339668j416448j481216j527934
9340A0047135j480876j257703r83162p05302n24882l91376l08386j51012j05284
$$ y = [21456727, 22638216, 23245364, 23081218, 22244085, 20735937, 18813667, 16772431, 14720291, 12911963, 11477957, 10394452, 9710922, 9388620, 9335650, 9553036, 10085736, 11001554, 12400220, 14263950, 16573086, 19142432, 21621257, 23705795, 25297566, 26385212, 27018642, 27232486, 27070053, 26568457, 25676255, 24314790, 22551156, 20403720, 17990527, 15557342, 13375944, 11649197, 10449420, 9623571, 9186720, 9055661, 9172306, 9610885, 10365794, 11433096, 12782536, 14289813, 15796044, 17246057, 18366551, 19042293, 19252604, 18931172, 18180414, 17069505, 15812401, 14472733, 13056285, 11575069, 10047135, 8566259, 7308556, 6325394, 5620092, 5095210, 4703834, 4395448, 4244436, 4139152]
9331D139152J8504J23035K42174L70965N48508O10944N87388L99533J44836k53012
9321F932027o28148q10535q16655p19821n95543m44684k83244j99877k18904j19748
9311B094868m301l4737l7716l6716J4200q116O5361J91989J91349K20764L01165
9300B958110M14960L78436J86798k7435l03040l89362l75305l46704k44173j19568
9290B132717o2463o2312n2895k3521k47K8845J20367J23999J45128J79345K03859
9279B732822L02919M54189N96032P10795P21588N08818R4774l46517n64962n61749
9269D648709n40440m06015k40799j08628j606M7494J34835K65572M06004O05550
9259D810676O57828N12186L21145J68506J13004L497n2259l1700j6632q2332j79285
$$ y = [4139152, 4157656, 4280691, 4522865, 4893830, 5442338, 6053282, 6640670, 7040203, 7185039, 6932027, 6303879, 5493344, 4676689, 3956868, 3361325, 2916641, 2633397, 2433520, 2214616, 2094868, 2090567, 2055830, 2018114, 1981398, 1995598, 1987482, 2052843, 2244832, 2436181, 2656945, 2958110, 3373070, 3751506, 3938304, 3910869, 3607829, 3218467, 2843162, 2496458, 2252285, 2132717, 2070254, 2007942, 1955047, 1931526, 1931279, 1960124, 2080491, 2204490, 2349618, 2528963, 2732822, 3035741, 3489930, 4085962, 4796757, 5518345, 6027163, 6121937, 5775420, 5210458, 4648709, 4108269, 3702254, 3461455, 3352827, 3351221, 3398715, 3533550, 3799122, 4205126, 4810676, 5468504, 5980690, 6301835, 6470341, 6583345, 6586842, 6534583, 6502883, 6486251, 6403919, 6224634]
9248F224634l26816l63449l43029k22989j06094R4320K94175L10862N95623R09001
9238G066238J115868J456006J680351J651775J285710P02130Q0367m05654o48339
9229A3984452p43443o41336m36103j32567K14522M09318K73570j60284n80569
9220A2187560p86876o87968l64576J31977N75959R66446J231343J393367J413578
9211A6060810J250726Q07949J93134m15507q49779j077964j028554o84833k65186
9202A3990796K49272R08350J548836K034039K058281J535247O10017j59958o01818
9193B2173062o58700m64434k64888k29303l35043o44806r43622j152357j343012
9184A6136897j354992j267419j088323q05337m61268j02393K96545O57276J173064
$$ y = [6224634, 5897818, 5534369, 5191340, 4968351, 4862257, 4956577, 5250752, 5561614, 6157237, 7066238, 8182106, 9638112, 11318463, 12970238, 14255948, 14958078, 15038445, 14632791, 13984452, 13241009, 12599673, 12163570, 12031003, 12245525, 12654843, 12928413, 12768129, 12187560, 11400684, 10712716, 10348140, 10480117, 11056076, 12022522, 13253865, 14647232, 16060810, 17311536, 18119485, 18312619, 17897112, 17047333, 15969369, 14940815, 14255982, 13990796, 14240068, 15148418, 16697254, 18731293, 20789574, 22324821, 22934838, 22774880, 22173062, 21514362, 21049928, 20785040, 20555737, 20220694, 19575888, 18632266, 17479909, 16136897, 14781905, 13514486, 12426163, 11620826, 11159558, 11057165, 11353710, 12010986, 13184050]
9175A3184050J771698K375976K841135K843363K166539J226390L55630l08025
9167B6456756p76114j158145j409387j553478j646366j649145j402423j015553
9159A5846145l94187L56241J199721J942431K413476K251731J301041J16787n36153
9150B4497233n66056k65424P0001J26322j56749n60139q34423r68461q74656n85853
9140A9881795l23356l41544m73013m99350k02574K76010J028667K074651L149629
9131B4570915M094896M542737M235582K982601R82138j134745k882065l787844
9123C3604215m014324l796869l316740k731088k100032j388999p07690p2000L56388
9114A5832861N24355M67764J87805j04542L2562N05149J126817J618641J926550
$$ y = [13184050, 14955748, 17331724, 20172859, 23016222, 25182761, 26409151, 26764781, 26456756, 25680642, 24522497, 23113110, 21559632, 19913266, 18264121, 16861698, 15846145, 15451958, 15808199, 17007920, 18950351, 21363827, 23615558, 24916599, 25033386, 24497233, 23931177, 23665753, 23735754, 23862076, 23705327, 23145188, 22310765, 21342304, 20467648, 19881795, 19558439, 19216895, 18743882, 18244532, 18041958, 18317968, 19346635, 21421286, 24570915, 28665811, 33208548, 37444130, 40426731, 41408869, 40274124, 37392059, 33604215, 29589891, 25793022, 22476282, 19745194, 17645162, 16256163, 15548473, 15476473, 15832861, 16357216, 16824980, 17012785, 16908243, 16940805, 17445954, 18572771, 20191412, 22117962]
9105B2117962K116925K103752J640918N40375j121284k499406l163645l254163
9097A8481434k803421k074482j436247r59510n37426j27979K91655O91691J109409
9088A2635124J450827J445059J267149J121483O05904l34565j083902j440597
9080A5666482j505574j222250r44706p36730n17931l27014q2670L42623Q13174
9071A1485404J226256J352777J022084L50780k62392m72831j93894L47247R46158
9062A5801589J425767J639114J560047R33428j27109j302762k124449k360230
9054A5445395k122469j568784r88954m68738J7709N09394J011053J541238J880535
9045A5256379J887002J601324Q23377r0651j046757j682068j671614j302633q35491
$$ y = [22117962, 24234887, 26338639, 27979557, 28519932, 27398648, 24899242, 21735597, 18481434, 15678013, 13603531, 12167284, 11207774, 10670348, 10542369, 10834024, 11525715, 12635124, 14085951, 15531010, 16798159, 17919642, 18525546, 18190981, 17107079, 15666482, 14160908, 12938658, 11993952, 11257222, 10739291, 10412277, 10329607, 10672230, 11485404, 12711660, 14064437, 15086521, 15437301, 15174909, 14702078, 14508184, 14855431, 15801589, 17227356, 18866470, 20426517, 21359945, 21232836, 19930074, 17805625, 15445395, 13322926, 11754142, 10765188, 10296450, 10314159, 10823553, 11834606, 13375844, 15256379, 17143381, 18744705, 19568082, 19477431, 18430674, 16748606, 15076992, 13774359, 12938868]
9036A2938868l55945M6273K53049M3932n57304j196744j466749j374654j040727
9027G289999o96995l98667j90875k549K06995M43831O90248R67401R43067N52620
9017I805075k6838p11591j198246j274533j045290p48906n39097l77990k69014
9008C613570j15092K1807L414J07825K38289M23048O54304R61119R52970M05352
8998G266606l29247q16720r86508q50930o48817l81520j92351j70103j36727j04825
8988B648858r745o254P1196J04126J86795J69456J61422L10694M72903O59187
8978D768638Q66589J208596J506258J403857Q84236N9972q24794j371232j409941
8969G092179j276413r70807p13351m83428l14760k66327k41458j48095n8506l4969
$$ y = [12938868, 12582923, 12629196, 12882245, 12926177, 12368873, 11172129, 9705380, 8330726, 7289999, 6593004, 6194337, 6003462, 6000913, 6207908, 6651739, 7341987, 8309388, 9252455, 9805075, 9778237, 9066646, 7868400, 6593867, 5548577, 4799671, 4260574, 3882584, 3613570, 3498478, 3520285, 3523699, 3631524, 3869813, 4292861, 4947165, 5908284, 6861254, 7266606, 6937359, 6120639, 5134131, 4283201, 3634384, 3252864, 3060513, 2890410, 2753683, 2648858, 2639113, 2632859, 2704055, 2808181, 2994976, 3164432, 3325854, 3636548, 4109451, 4768638, 5635227, 6843823, 8350081, 9753938, 10638174, 10698146, 9873352, 8502120, 7092179, 5815766, 4844959, 4131608, 3648180, 3333420, 3067093, 2825635, 2677540, 2619034, 2584065]
8959B584065k2442o422N0078J15302J41024J88215K99129M36718O25468P43439
8949E154574O36058K06815l57989p27761q58791p18510n54298m17429k65255j06631
8939A990783j33385j10084p6555q0227n6627r7090p9675j9702P683j9012j6901
8928A309208l4294l8233p9276q9968K5724J5997J3045N7681l3570n8999L0092
8917A117407M4343O5160P1216M0829K7827J2035j3608p042J1524p0444m7736l5673
8905A215838l6521j6473l8710n722m6940k6147q978K1392j9777k9746k224J2685
8893A018677k6850K7477K4638j6727J9826Q674j4619l928q338J4054l568J803
8881A041119l1059L271l3174m953k1072j8507K0307k8871M1065N5922M5370K4688
$$ y = [2584065, 2561623, 2555201, 2605279, 2720581, 2861605, 3049820, 3348949, 3785667, 4411135, 5154574, 5790632, 5997447, 5639458, 4911697, 4052906, 3334396, 2780098, 2362669, 2097414, 1990783, 1857398, 1747314, 1670759, 1590532, 1533905, 1436815, 1357140, 1337438, 1345121, 1326109, 1309208, 1274914, 1236681, 1157405, 1067437, 1093161, 1109158, 1122203, 1179884, 1146314, 1087315, 1117407, 1161750, 1226910, 1298126, 1338955, 1366782, 1378817, 1365209, 1358167, 1369691, 1299247, 1251511, 1215838, 1179317, 1162844, 1124134, 1118412, 1071472, 1045325, 1036347, 1057739, 1037962, 1008216, 1005992, 1018677, 991827, 1019304, 1043942, 1027215, 1047041, 1055715, 1041096, 1037168, 1028830, 1042884, 1039316, 1041119, 1010060, 1013331, 980157, 975204, 954132, 935625, 955932, 927061, 968126, 1024048, 1069418, 1094106]
8869A094106N917L4202j0876M9604N9906O0374K64J6768K8310o705k8660n8997
8857A244213n0004j8573O106O0990K0759k8660k9155j7307k6038j4012k660L604
8845A149263M5847j489M8370N5512L523m5927L874K4218r502n0639k8901n2369
8833A141780K4918K4848K8911Q3669K0700l5432k0927L5222P2891K2166N286n9071
8821A344961m1441K6332m4543J1031K6055k5493K8448J8362J1099J0420l5205
8810A330026J5157j5851O244J9645M4011m223l3749k8381O5864L2128J2386K97
8798A443554j0314l064M1310K964j8598O9154M0332j3646J1190q635P768q82L8507
8785A599640l6299K3060J6393Q114K0723K8338K3605o228j0067J0577K8308M479
$$ y = [1094106, 1100023, 1134225, 1123349, 1172953, 1232859, 1293233, 1293497, 1310265, 1338575, 1331870, 1303210, 1244213, 1194209, 1175636, 1181742, 1242732, 1263491, 1234831, 1205676, 1188369, 1162331, 1148319, 1145659, 1149263, 1195110, 1193621, 1241991, 1297503, 1301026, 1255099, 1258973, 1283191, 1273689, 1223050, 1194149, 1141780, 1166698, 1191546, 1220457, 1304126, 1324826, 1289394, 1268467, 1303689, 1376580, 1398746, 1404032, 1344961, 1303520, 1329852, 1285309, 1296340, 1322395, 1296902, 1325350, 1343712, 1354811, 1365231, 1330026, 1345183, 1329332, 1335576, 1355221, 1399232, 1395009, 1361260, 1332879, 1398743, 1430871, 1443257, 1443554, 1433240, 1430176, 1471486, 1474450, 1455852, 1525006, 1565338, 1551692, 1562882, 1554247, 1562015, 1561133, 1599640, 1563341, 1586401, 1602794, 1610908, 1631631, 1659969, 1683574, 1677346, 1667279, 1677856, 1706164, 1710643]
8773A710643j9675K1758K1942J8176L6786K6278J9517K1522J1684K640j9294l025
8761A848952P1262R181k7239M7496M9394J9899K9695K5942N30q863O378L7515
8749B110142M8484R667J5922J8404m397j9455J8551J7105N6576L9719J1465R564
8737B331747N0485K9227k913K1669L3160M5893J06244K0158M0153O7400R013O4365
8725B816601M3373j9608M4610K0906M1448P188J5457P8034K2878K9222R3820O0396
8713C254325N9508N398J6227L9021P6148M2126M5752O9700J04954Q7999N0328
8702C851486J01488J652o216J18793R3156Q9113J23533P7244J22762J51592J66663
8691D891266K14839K29089K95648M21247M65781N12658N63616O96802R20744J225260
$$ y = [1710643, 1690968, 1712726, 1734668, 1752844, 1789630, 1815908, 1835425, 1856947, 1868631, 1871271, 1851977, 1848952, 1920214, 1929395, 1902156, 1949652, 1999046, 2018945, 2048640, 2074582, 2075112, 2066249, 2072627, 2110142, 2158626, 2168293, 2184215, 2202619, 2198222, 2178767, 2197318, 2214423, 2270999, 2310718, 2322183, 2331747, 2382232, 2411459, 2408546, 2430215, 2463375, 2509268, 2615512, 2635670, 2675823, 2743223, 2752236, 2816601, 2859974, 2840366, 2884976, 2905882, 2947330, 2954518, 2969975, 3048009, 3070887, 3100109, 3193929, 3254325, 3313833, 3319231, 3335458, 3374479, 3450627, 3492753, 3538505, 3608205, 3713159, 3801158, 3851486, 3952974, 3954626, 3948410, 4067203, 4160359, 4249472, 4373005, 4450249, 4573011, 4724603, 4891266, 5106105, 5335194, 5630842, 6052089, 6517870, 7030528, 7594144, 8290946, 9211690, 10436950]
8681A0436950J534460J890730K117931J951825J236564L34448o30303j387210
8673A7485395j721173j689289j391371r77953o93692m50848k52181j06492J2992
8664A0215388J30391K29558K78521L16287M59832N47244P35574R77067J319496
8655A5209358J711424K057489K078000J689224Q21120j52214r60264j438407j589823
8646A9425907j378226j012726o45000l61248j20526L3020J8548J50183K76246
8637A6386178K81951L25186L60183M15349N03272N14379N26422O29199P31457
8628B0673576P56351P65282Q58432R01598R52539J092367J160950J220383J376076
8619B9757554J586489J839007K106402K475731K875130L070528L082811K862587
$$ y = [10436950, 11971410, 13862140, 15980071, 17931896, 19168460, 19502908, 18872605, 17485395, 15764222, 14074933, 12683562, 11705609, 11011917, 10561069, 10308888, 10202396, 10215388, 10345779, 10575337, 10853858, 11170145, 11629977, 12177221, 12912795, 13889862, 15209358, 16920782, 18978271, 21056271, 22745495, 23566615, 23414401, 22454137, 21015730, 19425907, 18047681, 17034955, 16389955, 16028707, 15908181, 15941201, 15959749, 16109932, 16386178, 16668129, 16993315, 17353498, 17768847, 18272119, 18786498, 19312920, 19942119, 20673576, 21429927, 22195209, 23053641, 23955239, 24907778, 26000145, 27161095, 28381478, 29757554, 31344043, 33183050, 35289452, 37765183, 40640313, 43710841, 46793652, 49656239]
8611D9656239K481642J997129J760236J665174J427578J038283N11314K00483
8603F0738078Q3562L96854R90931J547330J937945K047475J872003J290782N09317
8594G1414277k10439o17701o59419l34834J52554M97930P27193O79699L46905
8585G1996165q7658m81509r28382j235404j614861j894775k172112k348690k304063
8576E8928711j998527j470471r46655n63611n21556q63052j629644k329802k762499
8567D5842894k885337k745835k488782k109565j818617j481010j272450j192900
8559B9848398j104889q90458o56403n42755p48957r26592r93973q79855o84231
8550B2420285m93190l25223k20278j3518K39486M93893P06523Q76353Q45905M90004
$$ y = [49656239, 52137881, 54135010, 55895246, 57560420, 58987998, 60026281, 60537595, 60738078, 60821640, 61218494, 62209425, 63756755, 65694700, 67742175, 69614178, 70904960, 71414277, 71203838, 70586137, 69926718, 69591884, 69744438, 70242368, 70969561, 71649260, 71996165, 71908507, 71426998, 70498616, 69263212, 67648351, 65753576, 63581464, 61232774, 58928711, 56930184, 55459713, 54513058, 53949447, 53427891, 52564839, 50935195, 48605393, 45842894, 42957557, 40211722, 37722940, 35613375, 33794758, 32313748, 31041298, 29848398, 28743509, 27853051, 27196648, 26653893, 25904936, 24978344, 23984371, 23104516, 22420285, 21927095, 21601872, 21381594, 21368076, 21607562, 22101455, 22807978, 23684331, 24530236, 25020240]
8540B5020240q1077n95169q43341p71304l97095R0334N71744R25637R68611P57373
8530B5645953M35273J44412l9579k27691m37738o74525j047720j380999j412803
8521B1004583j122195n94174p2548L62980M21524J93813k23867o04692p46029
8512A8619395o22823l74772m4024L68388P08769P71221O70295L63961l7917k32670
8502B0189823m64489o68339q50603j234892j544832j646807j549642j377926j153114
8493I699179q69284o65569n07023m53355m30924l06350k61918k29802k15768j91617
8483E567569j59949j55657j33237j38666q1905p6194j15985n8900l773l0255L3507
8472D646555J38935J04148R3669J66080K55311K86512M59122P14710R25778J080909
$$ y = [25020240, 24939163, 24343994, 23500653, 22729349, 22332254, 22422588, 22994332, 23919969, 24888580, 25645953, 26081226, 26225638, 26186059, 25958368, 25520630, 24846105, 23798385, 22417386, 21004583, 19882388, 19288214, 19215666, 19578646, 20000170, 20193983, 19970116, 19365424, 18619395, 17996572, 17621800, 17577776, 17946164, 18654933, 19426154, 20096449, 20460410, 20422493, 20189823, 19725334, 19056995, 18206392, 16971500, 15426668, 13779861, 12230219, 10852293, 9699179, 8829895, 8164326, 7657303, 7203948, 6773024, 6466674, 6204756, 5974954, 5759186, 5567569, 5407620, 5251963, 5118726, 4980060, 4898155, 4821961, 4705976, 4647076, 4643303, 4613048, 4646555, 4785490, 4889638, 4983307, 5149387, 5404698, 5691210, 6150332, 6865042, 7790820, 8871729]
8462H871729J033215P80155L04662l23059q15302j111935j141849j001833p69343
8453E826440n42732l63008j94012j62624j24903n1640n138P2735L8612J24123
8443D617853K29246L11554M09463N38990P60306R70945Q92415N84493J59050m39404
8433I034911q76748j042664j003240q68350o86697n02907l49310k94619k38251
8424C172125j22044j73719j21873j19389j40450m9626r0666q6559k3467j2100
8414B232232l5664o3085n0563n7152l4689m9442k6910l5073j2480j9308l7447
8403A810419n0593k403m1524j2735l0411k9166J9744J4046j1086J043l1729m6876
8391A588729r4238m2434M8485K464J2573k3610l328K7005k7698k7929K2975j4521
$$ y = [8871729, 9904944, 10685099, 10989761, 10666702, 9851400, 8739465, 7597616, 6595783, 5826440, 5283708, 4920700, 4726688, 4564064, 4439161, 4387521, 4382383, 4455118, 4493730, 4617853, 4847099, 5158653, 5568116, 6107106, 6867412, 7838357, 8730772, 9315265, 9474315, 9034911, 8158163, 7115499, 6112259, 5243909, 4557212, 4054305, 3704995, 3410376, 3172125, 3050081, 2876362, 2754489, 2635100, 2494650, 2445024, 2354358, 2267799, 2244332, 2232232, 2196568, 2133483, 2082920, 2025768, 1991079, 1941637, 1914727, 1879654, 1867174, 1847866, 1810419, 1759826, 1757423, 1715899, 1703164, 1672753, 1643587, 1663331, 1677377, 1666291, 1667334, 1635605, 1588729, 1494491, 1452057, 1500542, 1503006, 1515579, 1491969, 1488641, 1515646, 1487948, 1460019, 1482994, 1468473]
8379A468473l8058K336j1177o0777m6426k2603k403Q487J949k0427P116m308j9161
8366A263021l8505J4410L0706R106n1690r4054J1727N730k6006j6956M5361k8662
8354A124188J048J4113K718j4425K3361m4456j2374O648Q246N565l1005n7341
8342A026286j6682M375M767j7512k7541l2137P514M7940p420m70J6097J2769N3921
8329A071907p129n6748k2056k5495j3158K8943L6824j5767m9223j568R963o8733
8317H87760k2120q301J6222N8751k1390k5554k1294j1056Q291k73j5555l1611
8305H13870K110j5741R258K0074Q713j061J089N064R455l4322l8574J7363M4187
8292H41485O9673J2658J5127M37n7855j867O1484j6028m0603j5603L4184k6792
$$ y = [1468473, 1430415, 1432751, 1421574, 1360797, 1314371, 1291768, 1289365, 1297852, 1299801, 1279374, 1286490, 1282182, 1263021, 1224516, 1238926, 1269632, 1278738, 1227048, 1132994, 1144721, 1150451, 1124445, 1107489, 1152850, 1124188, 1125236, 1139349, 1142067, 1127642, 1151003, 1106547, 1094173, 1100821, 1109067, 1114632, 1083627, 1026286, 1009604, 1013979, 1018746, 1001234, 973693, 941556, 949070, 997010, 989590, 989120, 1005217, 1017986, 1071907, 1064778, 1008030, 985974, 960479, 947321, 976264, 1013088, 997321, 948098, 946530, 956493, 887760, 865640, 857339, 873561, 932312, 910922, 885368, 864074, 853018, 861309, 861036, 845481, 813870, 815980, 800239, 809497, 829571, 838284, 837223, 838312, 843376, 852831, 818509, 779935, 797298, 841485, 911158, 923816, 938943, 939380, 881525, 879658, 941142, 925114, 884511, 868908, 903092, 876300]
8280H76300m9199j7029N019n3197m5749K4484m7314m0671L3160M2901j1817l1536
8268F85352l1292j2092N4401Q190j4354k6809l097j1336l5541K3725j7029K993
8256F23111K6722m855m2174K504O4634K132l0644K80P169l446R749J801J4407
8243F71390q340M58j7209k2580M2768J3214k6403l3187P78k6291k5454k7016k0977
8230E21151M0685K4147k724l0845R989L837L4668k8950J6973L939j3909L991j7456
8217E65496M0003O6524M55n1777p6833k6352k3624K3446L2726J657k3070l8178
8205D90473k1536n643N0732L9062l7281k0813P886O350l4509L697O4431Q992n3970
8192D97871J7663j8514K510L0656q517q023L1173n6319n1718J9765N37M963K1566
$$ y = [876300, 827101, 810072, 815091, 761894, 716145, 740629, 693315, 652644, 685804, 728705, 716888, 685352, 654060, 641968, 696369, 704559, 690205, 663396, 660299, 648963, 613422, 637147, 620118, 623111, 649833, 644978, 602804, 605308, 669942, 672074, 641430, 641710, 648879, 645433, 655182, 656983, 671390, 663050, 663508, 646299, 623719, 666487, 679701, 653298, 620111, 620889, 594598, 569144, 542128, 521151, 561836, 585983, 583259, 552414, 562403, 566240, 600908, 571958, 588931, 592870, 578961, 582952, 565496, 605499, 672023, 672478, 620701, 543868, 517516, 493892, 517338, 550064, 551721, 528651, 490473, 468937, 463294, 514026, 553088, 515807, 494994, 502880, 509230, 474721, 478418, 542849, 551841, 497871, 515534, 497020, 499530, 530186, 521669, 513646, 544819, 488500, 436782, 456547, 457084, 462047, 483613]
8179D83613j1317k2282j5565k255n763j507N699R89N2515j7021m3173k0522N9656
8166D63067o423k1105p449L3579O805l0942K1140L5703l1433k0178J912r717j5465
8153D19494k7238K3111J975K9189k628j6743j0060j697P509K4882L4314P022l9631
8140D49499O554M3058K3056M3204M0866M0944k6804M0551L8317q54p9735l5764
8128E82892l1372l6234k3358l8125j8871L4029N8629l7936k8074m7454l7608j3529
8116C62989l0201k1480K6491M0284O4595K7035m3350m3797p047L8282k3129K4206
8104D14878J6525k5354l637M4398p770N4715J5878k5846j6044K1577L5427K8182
8092E52929J8099M4740j7003o0462j9386j4239p1793m3103m506j0643q5950k3507
$$ y = [483613, 472296, 450014, 434449, 432194, 426431, 424924, 430623, 431612, 484127, 467106, 423933, 403411, 463067, 456644, 435539, 428090, 461669, 468474, 437532, 458672, 494375, 462942, 442764, 444676, 434959, 419494, 392256, 415367, 417342, 446531, 443903, 427160, 417100, 415403, 422912, 447794, 482108, 489130, 449499, 456053, 499111, 522167, 565371, 606237, 647181, 620377, 660928, 699245, 698391, 618656, 582892, 551520, 515286, 491928, 453803, 434932, 468961, 527590, 489654, 461580, 414126, 376518, 362989, 332788, 311308, 337799, 378083, 442678, 469713, 426363, 382566, 375519, 413801, 390672, 414878, 431403, 406049, 402412, 446810, 439040, 493755, 509633, 483787, 467743, 489320, 524747, 552929, 571028, 615768, 598765, 538303, 518917, 504678, 432885, 389782, 385276, 374633, 288683, 265176]
8080B65176K3171K7427Q4456p864n4886k8180m4884k3649K500M1903J0547j2545
8068B83172q946r244N29L4823k87l8587M8303O3085l5601N026Q084J1760O823
8055C68940N902m6949J3873L8792k1582l4926o104R303M2157J0255l0426K2730
8043C71965J3094l1190J9665O1090j1852j01444n6076j4702J4578J3739J758K6121
8031C06746k5423p397O87j9L3739n4329J1396M3270K4994J6502L784k8576Q078
8018C33452j6789p629l6634r645J5097L0850r075m1006n792P741K3872J04836
8006C89278L1895o6383n7739l3533j5690K0745K4137p990j7259k7155L449k0183
7994B23572J5764L7701J7223O656M8036L782n23o2415n2857J8744L1476N175l1369
$$ y = [265176, 288347, 315774, 400230, 392366, 337480, 309300, 264416, 240767, 243267, 285170, 295717, 283172, 274226, 264982, 265511, 300334, 300047, 261460, 309763, 372848, 337247, 342273, 350357, 362117, 368940, 374842, 327893, 341766, 380558, 358976, 324050, 317946, 327249, 369406, 379661, 349235, 371965, 385059, 353869, 373534, 434624, 422772, 321328, 265252, 250550, 265128, 278867, 280625, 306746, 281323, 273926, 274613, 274594, 308333, 254004, 265400, 308670, 333664, 350166, 353950, 325374, 333452, 316663, 309034, 272400, 262755, 277852, 308702, 299627, 258621, 252829, 260570, 284442, 389278, 421173, 354790, 297051, 263518, 247828, 268573, 292710, 284720, 267461, 240306, 243755, 223572, 239336, 277037, 294260, 300916, 348952, 352734, 352211, 289796, 236939, 255683, 287159, 292334, 260965]
7981B60965q273L0270J5158P0931m4437n3917K1693k0093j5229l123L5523R834
7969B99302p275j1038k2251j6916K99j2919R470K5010n669K719J6027J1051l8927
7956B48883j5769k2175o496J7578J220j7313K7554N8005j1223l2292K0521J8249
7944B86742m3980r16K4824j325J982j3732j2989m0173J2325K3724L0456l0806
7932B36132j8191j834j5800r03K7082p948J5300l4012k547L5020o472R723J4986
7919B50536K0804l9301q2761k4454J3378J9617M3698J0706J9358k0721L621K4258
7907B38739N206j4679k336K8044o294k3775K1419O3024J0425o2127o0356m435
7895A92855k4138K8971L798q456j9204k173J8466L2837q399K0030J6770R958m1140
$$ y = [260965, 252692, 282962, 298120, 369051, 324614, 270697, 292390, 272297, 257068, 253945, 289468, 299302, 292027, 280989, 258738, 241822, 242121, 229202, 238672, 263682, 258013, 260732, 276759, 287810, 248883, 233114, 210939, 204443, 222021, 223241, 205928, 233482, 291487, 280264, 247972, 268493, 286742, 242762, 241846, 266670, 265345, 267327, 253595, 240606, 200433, 212758, 236482, 266938, 236132, 217941, 216107, 200307, 199404, 226486, 218538, 233838, 199826, 197279, 232299, 225827, 235550, 250536, 271340, 232039, 149278, 124824, 138202, 157819, 201517, 212223, 231581, 210860, 214481, 238739, 243945, 229266, 226930, 254974, 248680, 224905, 246324, 309348, 319773, 257646, 197290, 192855, 168717, 197688, 201486, 193030, 173826, 171653, 190119, 222956, 214557, 234587, 251357, 261315, 220175]
7882B20175k2167J1219P39n3125J6599j40L3273m4919j7899K1379L8293K145l0690
7869A74882m532m2582p800J1977K3219O740J1850J5052P4711k2481q2372j8748
7857A39916P3174J3207l0762k4197O3563m9858m0020p882M1534p269l3923K5569
7845A63052l0457K2604L5272J2563K8879p3363n7300n6063J541J8459P1903M8762
7833A85852n374n24L7023J7993m8981j4669m010q842k9801j9544J8643O084l2894
7820A00956J3929K4702J9684J3489J9558l3858r675J5365j4725j7814K266M1481
7808A75358O251m834j9067m1325k7677k1355j776N4219J9483k637j0069L0790
7796A57361M0280L6902N679k7949l9846j1001j1309l3625l7721n964K2175Q661
$$ y = [220175, 198008, 209227, 209966, 156841, 173440, 173300, 206573, 161654, 143755, 165134, 203427, 205572, 174882, 170350, 127768, 119968, 131945, 155164, 161904, 173754, 188806, 263517, 241036, 158664, 139916, 213090, 226297, 195535, 171338, 234901, 185043, 145023, 137141, 178675, 171406, 137483, 163052, 132595, 155199, 190471, 203034, 231913, 158550, 101250, 45187, 46728, 65187, 137090, 185852, 180478, 179954, 216977, 234970, 185989, 171320, 167310, 158468, 128667, 109123, 127766, 133850, 100956, 114885, 139587, 159271, 172760, 192318, 158460, 148785, 164150, 149425, 131611, 133877, 175358, 181609, 176775, 157708, 116383, 88706, 67351, 65575, 119794, 139277, 136640, 126571, 157361, 197641, 234543, 240222, 212273, 172427, 161426, 150117, 116492, 78771, 72807, 94982, 103643]
7784A03643M2914M6117j8530l1105L3518L7632m47J1435m548l0875m0441l0197
7772A19116j1813j6161j222j4784J2809L7527j6513J4672R063o19r116j4606k13
7759A08140j0884M5600L5212j1333j8147l9528r107j549J2236j120J0897k8977
7747I1440N7917N9926L551o876o819j9421k3464J2656k211o1192l0932K8396K2461
7734A25432j2776J3782K7373J7708l1011Q776K71k6869j4629j5147K802N2467
7722A48179j0430J9155l6611j366J0223m099m035M2531l165k1366K6359k6556
7710A38819l6550J5130k555O063p702m2862j4518O7139L5637J9648o359n6356
7698A15534n818R218q908J3821L7002m1496k1550M62K756M444L9949n784J135
$$ y = [103643, 146557, 192674, 174144, 143039, 176557, 214189, 213742, 225177, 220629, 189754, 149313, 119116, 107303, 91142, 89920, 75136, 87945, 125472, 108959, 123631, 132694, 132075, 122959, 108353, 108140, 97256, 142856, 178068, 166735, 148588, 109060, 99953, 98404, 110640, 109520, 120417, 91440, 149357, 209283, 212834, 205958, 199139, 179718, 156254, 168910, 166699, 105507, 74575, 102971, 125432, 112656, 126438, 153811, 171519, 140508, 149284, 149555, 122686, 108057, 92910, 95712, 148179, 137749, 156904, 120293, 118927, 129150, 125051, 121016, 163547, 160382, 139016, 165375, 138819, 102269, 117399, 114844, 120907, 113205, 70343, 55825, 122964, 158601, 178249, 171890, 115534, 109716, 118934, 110026, 123847, 160849, 119353, 97803, 98265, 101021, 105465, 145414, 139630, 140765]
7685A40765n64j3625k7286k2219J5855j2764J7011K2039m366j9667j7994k5562
7673E1623K3924m745m0873o997K5225j2093L5104J4274K5775O1903J450j1407
7661A63163r789k7181k1242k3995K5361P01l7424j107J513M832O738L6348N3378
7648A71296j9067k5044l9884K5119o56k1770m2659K7275P7564N1232n7179l7184
7636A09043j09j4653k2542M910K3352J8213j5887q799K3247l9805k5279K9057
7624H0748j6117l3517j3553K9894O5651L0974K6010M6874J4169k8840l1416k6026
7612A44851L6403k0092o2795j4225J8843m566M329Q612l4991K3619J4158K6853
7600A40999k3868m1040J3458J0975p952j5447M6295r815l5991k0589n6941k9324
$$ y = [140765, 140201, 126576, 99290, 77071, 92926, 80162, 97173, 119212, 114846, 95179, 77185, 51623, 75547, 70802, 29929, 22932, 48157, 36064, 71168, 85442, 111217, 173120, 174570, 163163, 153374, 126193, 104951, 80956, 106317, 107018, 69594, 68487, 70000, 74832, 81570, 117918, 171296, 152229, 127185, 87301, 112420, 111764, 89994, 47335, 74610, 152174, 203406, 146227, 109043, 108934, 94281, 71739, 76649, 100001, 118214, 102327, 93528, 116775, 76970, 51691, 80748, 64631, 31114, 17561, 47455, 113106, 144080, 170090, 216964, 231133, 202293, 170877, 144851, 181254, 161162, 98367, 84142, 102985, 98419, 102748, 111360, 76369, 99988, 114146, 140999, 117131, 76091, 89549, 100524, 92572, 77125, 123420, 113605, 77614, 57025, 84, -29240]
7588b9240L792L9660O1538J7366m2099j4535J8304k3481K362M5922l8511j4058
7576B7020J2984l6675j2720L637Q40L4236J468J8955L1372K9353r429k7283m948
7563F8810q685K9304J4082p476l7073J071l8419n6621J8554M6861L3510j0326
7551E3592R245Q928J3360K0032L6958k9169p19l9106l0838Q197k7912J7995M9267
7538H9830L7291k3391l1828l3419L8261Q869p187j883m0100k9539L6710N2900
7526I6514K6822J0806l835l7016p9814k4913N5746l574o348j0153Q980N751M6911
7513H5877L1814N275n8089j710N3183M9488q352j4635J4299l1762l721n103K8098
7500A44662j5144j7348l6657j8559Q434O357q898n672M3474K3812m189j6217J0454
$$ y = [-29240, -25448, 14212, 75750, 93116, 51017, 36482, 54786, 31305, 33667, 79589, 41078, 27020, 40004, 3329, -9391, -5754, -4914, 29322, 30790, 49745, 81117, 110470, 101041, 73758, 68810, 60125, 89429, 103511, 96035, 58962, 60033, 21614, -35007, -16453, 30408, 63918, 53592, 62837, 71765, 85125, 105157, 142115, 112946, 112227, 73121, 42283, 50480, 22568, 40563, 89830, 127121, 103730, 71902, 38483, 76744, 85613, 78426, 76543, 36443, 6904, 43614, 96514, 123336, 134142, 130307, 93291, 13477, -11436, 44310, 40736, 34388, 24235, 33215, 38966, 85877, 117691, 122966, 64877, 63167, 116350, 165838, 157486, 142851, 157150, 125388, 121667, 116564, 144662, 129518, 112170, 75513, 56954, 65388, 71745, 62847, 57175, 100649, 124461, 120272, 104055, 114509]
7487A14509K1884q3734m5682K6783L3959P223J4093J5257n9723j2954K3679j0009
7475D5285j0942K8130O3898K7312p7919n0977j1163j1356L1566P240r597L3522
7463F4999R7583J4253p2809o640n350J1657m6402O2555O1403n5568k4530Q432
7451A09583k0993o1126o3483k0494K7944J0019j993J0168L9574K1474J1825k3619
7439C8879p515J2267P070Q571L1567P623j4087p285l295m5998k2311K1769K4306
7426E1561R34N2492j4910l2634k1777j9261O414K9011m104l6855J3136L2452K5844
7413H2303K0360k7826l1303L117P270n7793L5792l763j7778K0852N5181L4115
7401A20527J6629K964j4523k5309k3150j1678J4619J6176j6238r1944m8561k0311
$$ y = [114509, 136393, 52659, 6977, 33760, 67719, 74942, 89035, 104292, 44569, 31615, 55294, 45285, 34343, 62473, 126371, 153683, 75764, 24787, 13624, 2268, 33834, 41074, 31477, 64999, 162582, 176835, 104026, 97386, 92036, 103693, 57291, 119846, 181249, 125681, 101151, 109583, 88590, 27464, -36019, -56513, -28569, -18550, -20543, -10375, 29199, 50673, 62498, 38879, 31364, 43631, 50701, 59272, 90839, 98462, 84375, 77090, 73795, 27797, 5486, 27255, 51561, 52495, 104987, 90077, 57443, 35666, 16405, 22819, 51830, 47726, 10871, 24007, 56459, 82303, 102663, 74837, 43534, 46651, 53921, -3872, 31920, 28157, 10379, 31231, 86412, 120527, 137156, 140120, 125597, 100288, 77138, 65460, 80079, 96255, 80017, -11927, -60488, -80799]
7389h0799P2221N4680j2378N873J0725J1013J1869k642l5265j4915j5576L7903
7377D2709r270J2058N522j7522k7376k2046K3744L5482L7725k444J3922P451m5704
7364E4251m4314L3208j8806k5229J5248L9608l3304j9844J1697L0711J9224J5917
7352G8367n2677M794j0552n349K4794j6619j3051J3733R33M3748k5658L9305L3553
7339A15321j290l2925k6876J8971M3150L9772P762k9216l9412q3815M473J3401
7327B9316l6744m1523K3485l026m1902L1321R829j4403K8385J614o0407P5318
7315A263K9077N59J3710j083m2477m463R0398k2259m5315o075J1284P420M48k7797
7301D690j3719N396L2625J1301q392K3815l465K1430j2616l5690J9732M4614j8210
$$ y = [-80799, -8578, 46102, 33724, 39597, 50322, 61335, 73204, 70562, 35297, 20382, 4806, 42709, 33439, 45497, 51019, 33497, 6121, -15925, 7819, 43301, 81026, 78582, 92504, 99955, 54251, 9937, 43145, 24339, -890, 14358, 53966, 20662, 818, 12515, 43226, 62450, 78367, 25690, 30484, 19932, 14583, 39377, 22758, 9707, 23440, 24373, 68121, 42463, 81768, 115321, 114031, 81106, 54230, 73201, 116351, 156123, 163885, 134669, 95257, 11442, 15915, 29316, -7428, -48951, -25466, -28492, -70394, -39073, -29244, -43647, -15262, -13648, -74055, 1263, 30340, 30899, 44609, 43526, 1049, -3414, 86984, 64725, 19410, 13335, 24619, 32039, 32487, 4690, -9029, -3633, 28992, 40293, 31901, 55716, 52251, 73681, 61065, 25375, 45107, 89721, 71511]
7288G1511j6397l1342m549j0429J5181J7165J487j5525J472L0786L6226j8100
7276G7486j1620j8354l4618O187O2828J4093o7201l7878p256N330O2126M2266
7264I3389j3936L4402K212k8669p7036L0912j4456l9721o8627K8594N0572K6301
7252B3937J8504M7111K8533j5160o0079n3344j8598O0120K1801K95j7416o370
7240B9334k419p188K3119l930J1141k3655K6608L5367j6753J8207P1044q712l2761
7227A19402m5819J389l2361j7262k4003k0884K263N75j8121O5046J052J9086r416
7214D0947m775j3010L3832J9891l3317l0167M120K0089L1859K9191l2464m446
7202F1750q112l3366j7140j2541M8408K9649J7438Q109J0979n1628k3427k6426
$$ y = [71511, 55114, 23772, 19223, 8794, 23975, 41140, 42627, 27102, 28574, 59360, 95586, 77486, 65866, 47512, 12894, 19081, 81909, 96002, 28801, -9077, -16333, -11003, 51123, 93389, 79453, 113855, 116067, 87398, 10362, 41274, 26818, -12903, -81530, -52936, -2364, 23937, 42441, 89552, 118085, 102925, 42846, -10498, -29096, 31024, 52825, 53120, 35704, 29334, 26915, 19727, 42846, 38916, 50057, 26402, 53010, 88377, 71624, 89831, 160875, 152163, 119402, 73583, 74972, 42611, 25349, 1346, -19538, -17275, -16700, -34821, 30225, 31277, 50363, 40947, 36172, 23162, 56994, 76885, 43568, 13401, 17521, 37610, 69469, 98660, 66196, 61750, 53638, 20272, 3132, -9409, 38999, 68648, 86086, 94195, 105174, 53546, 30119, 3693]
7190C693l2178M0405L1385J6525N595O725k1225l5035K6943O97K2972K4318j5879
7177G4941K0842j4867l0895K5182L0330j6454k3278p950K6490j6827k0337q7743
7165d0566k5580N4182L4116J8005K6558m00j2021k6987M2111J5831M189K8663
7153A18101J308K631j1632R602j6418L798K370j3915q1168l848r150K1369J6944
7140C9992K096J5141n0572j9309k8595L6944J4014j0559J9082J4129l9085M923
7128a799m803K5873L2721N492k0731L7165j6561o5709j882n929j2334o300j7776
7115e2573L766K3088m41L1145K7775M0490l3759l1946K1437P5566M4129j5375
7103A33302p0371k4812J9442j1043l5722j0139J2848M15J6214R691M0138J6172
$$ y = [3693, -28485, 11920, 43305, 59830, 65425, 72150, 50925, 15890, 42833, 43530, 66502, 90820, 74941, 95783, 80916, 50021, 75203, 105533, 89079, 65801, 57851, 84341, 67514, 47177, -40566, -66146, -11964, 22152, 40157, 66715, 66315, 54294, 27307, 69418, 85249, 89438, 118101, 119409, 122040, 110408, 120010, 103592, 107390, 109760, 95845, 14677, 10829, 1679, 23048, 39992, 42088, 57229, 6657, -12652, -41247, -4303, 9711, -848, 18234, 32363, -6722, -1799, -6602, 19271, 51992, 57484, 36753, 73918, 57357, -8352, -10234, -16163, -28497, -34797, -52573, -48807, -25719, -26160, 4985, 32760, 73250, 39491, 7545, 28982, 104548, 148677, 133302, 62931, 38119, 57561, 46518, 10796, 657, 13505, 13920, 30134, 39825, 79963, 96135]
7091I6135o6538K0789R626K943j9107k2183J2370L1683L1262K644n0689j4909
7079C4026N3947N0441J1652k1923l6268j9385j6400r20J4349j7329l1265J3613
7067C4538J9387m6323m313O0896M052o1747m0300L4789N8885k810n0864m4505
7055c8315k0881N8428N7594k1200n1734K152L9683O414L3813N3704J50J9613K1434
7042A60855n3202r6012K1574O5371j9990k3740J8110O8880j6635J1877J5885m7641
7030A05332o6611j8705k9154n774R268j7082n3694J1000J4315J1877J0096L6592
7018G460K5836K3089J5980k00j0553m739r486k5219j247J3921k8081K149K5273
7005C4183N6409j2837q77L5319J1030n7319n1503J2002J4819l9160q58R230l5265
$$ y = [96135, 29597, 50386, 60012, 62955, 43848, 21665, 34035, 65718, 96980, 99624, 48935, 34026, 87973, 138414, 150066, 128143, 91875, 72490, 56090, 55170, 69519, 52190, 20925, 34538, 53925, 7602, 3289, 64185, 68237, 6490, -33810, 979, 59864, 57054, 6190, -38315, -59196, -768, 56826, 35626, -16108, -13956, 25727, 32141, 65954, 119658, 119808, 139421, 160855, 107653, 11641, 33215, 98586, 78596, 54856, 72966, 141846, 125211, 137088, 152973, 105332, 38721, 20016, -9138, -14912, -5644, -22726, -76420, -65420, -51105, -39228, -29132, 7460, 33296, 56385, 72365, 72165, 61612, 56873, 47387, 22168, 20921, 34842, 6761, 8910, 34183, 90592, 77755, 76878, 112197, 123227, 65908, 14405, 26407, 41226, 2066, 1208, 10438, -24827]
6992b4827R434p795Q658k161P951l187j0977p771N0324M1821J8418m861l2647
6979D2380J9389J9826k7850l6054O2535O4045m0471m9845j0394O831p505K4981
6967F7868J517l7060J1404J9505J9311k9133n386j7503q857J4068K7303m7842
6955A5195M9827L9658O346l0880j834K2101l8220N231j3018l18l2176k5869K4667
6942B0710J977k3347j3577K7685L3709j4660p5880r881M8369K7837k4812k0552
6930b2422M635k095j2804p92o573J1993L423J8360J4909j4711k6451j3955j2338
6917e8821M9037M5033L6702P4L582J106l5734k5964j737K9386J4299L338r784
6904E0517J4511k5142n1984j4607J2236m8887J7351N0818k2935L3693M9959K3711
$$ y = [-24827, -15393, -23188, -14530, -16691, -8740, -11927, -22904, -30675, 19649, 61470, 79888, 75027, 42380, 61769, 81595, 53745, 17691, 80226, 144271, 103800, 53955, 43561, 50392, 42887, 67868, 69385, 32325, 43729, 63234, 82545, 53412, 48026, 30523, 21666, 35734, 63037, 15195, 65022, 104680, 111026, 80146, 78312, 100413, 62193, 67424, 54406, 54088, 21912, -3957, 20710, 22687, -660, -14237, 13448, 47157, 32497, -43383, -53264, -4895, 22942, -1870, -22422, -17787, -19882, -32686, -33478, -40051, -28058, -24635, -6275, 8634, -6077, -32528, -46483, -58821, -9784, 35249, 71951, 72025, 75607, 76713, 40979, 15015, 13278, 42664, 56963, 60301, 50517, 65028, 39886, -12098, -26705, -14469, -63356, -46005, 4813, -18122, 15571, 65530, 89241]
6892H9241R657K6016m2446m5729k7783O555j132L2583l1553k533r000m2978j3480
6879e2582j9595r944N661n465K6980L9324L7324K3967O607n6369M7813R380j5785
6866C7316m4916J3374L7084J1642M1721j8282n8512k6150r926J1871j2041K0066
6854C247J2252M3086k4723l923O541J3023l008k9807K6747L5310j7847l0489j2642
6841A7767O207p684k6702K7740P3169Q004l8695o5870O342J0892o024J8438N840
6828B9424N1292K5279j732l2013p607k0471j6842M552n090k7984J3326l1013j2370
6815c1249J8700M9050L8769j7988l2944J3131M6473n4463n1568M0487J9480p826
6803C0052k5166l0177J9198M2275K8917j5328j9618l976m3112m6529m2387L8697
$$ y = [89241, 98898, 124914, 82468, 36739, 8956, 15511, 14379, 46962, 15409, 12876, 3876, -39102, -52582, -72177, -82121, -76460, -81925, -54945, -15621, 21703, 45670, 52277, -4092, 43721, 53101, 37316, -7600, 5774, 42858, 54500, 96221, 77939, 19427, -6723, -16649, -4778, -16819, 3247, 15499, 58585, 33862, 29939, 36480, 49503, 46495, 16688, 43435, 78745, 60898, 30409, 17767, 23974, 16290, -10412, 17328, 90497, 98501, 59806, -6064, 278, 11170, 5146, 23584, 29424, 80716, 105995, 104263, 72250, 64643, 44172, 27330, 31882, 26792, -1192, 12134, -18879, -31249, -12549, 36501, 75270, 57282, 24338, 37469, 83942, 29479, -22089, 18398, 37878, 30052, 4886, -25291, -6093, 36182, 65099, 49771, 30153, 26177, -16935, -63464, -105851, -67154]
6791f7154J706N601K3344J1227K418R979L6499R733p490J556L456J8681k4865
6778B4691j8810K7403J1567l4655J909m6986l4607K3043r128O474K7326k8108
6766d9881L6173q290R93K9782k018J1760K5585J532j1970q999J2998J4646K3094
6753G5405L9449p060j1894o5585m1665K2137n614O4271K2432m4517J0404k3915
6741C3848Q748k7996J0716N991k903J0779M2796J8352K4173N6309l819l297l5739
6728A37958j6186J3047J6243j2249j5411Q417K8905J1275k3137o773J3485K9493
6716A85067O6407M4030j7364L6250L2345R9213J19856J28863J40336J57278P9549
6705A071830j20845j98531k16694j52254q1774o1792j1754n6247j0754k7489k339
$$ y = [-67154, -65448, -59847, -36503, -25276, -22858, -12879, 23620, 33353, 25863, 27419, 30875, 49556, 24691, 5881, 33284, 44851, 10196, 12105, -34881, -69488, -46445, -55573, -49099, -21773, -49881, -13708, -21998, -21005, 8777, 6759, 18519, 44104, 45636, 33666, 24667, 37665, 52311, 75405, 114854, 107794, 95900, 30315, -11350, 10787, 5173, 69444, 91876, 47359, 57763, 33848, 42596, 14600, 25316, 31307, 28404, 39183, 81979, 100331, 124504, 180813, 176994, 173697, 137958, 121772, 134819, 151062, 138813, 123402, 131819, 160724, 171999, 148862, 142089, 155574, 185067, 251474, 295504, 278140, 314390, 346735, 445948, 565804, 694667, 835003, 992281, 1071830, 950985, 752454, 535760, 383506, 301732, 239940, 228186, 171939, 161185, 133696, 131357]
6694A31357r716N56n544m8730k6587J1187k6389P508J6706o535j7810j6644k6885
6681a7526K6208L8978j2888m1260k951Q688K5062J2707M541m833k10n209O723
6668C8030O330l2867m3424P713L7567J4306j530K577n365J5411k2476k6675k1962
6655c2365J8475O67K098K3260j188j9605k650K7258K6942M5460j240p2895l3970
6642a9753K660M1006m8435j8191L428K7240j0507k5957L1390K2369p177K7449
6630B5522J9600K8445K1712r15M8090j486n4715j2602k2934l7787j0197M6390
6618D9123k5273O853j3377L1870J0486j4503J8814L7455l3988r0464k66J3748
6606i522N2570j8189m1435N035J6364m2418J7595L0204k3007l5709l8971K009
$$ y = [131357, 121641, 122197, 116653, 67923, 41336, 52523, 26134, 33642, 50348, 43813, 26003, 9359, -17526, 8682, 47660, 34772, -6488, -9439, -751, 24311, 37018, 41559, 36726, 36516, 31307, 38030, 44360, 11493, -31931, -24218, 13349, 27655, 26125, 28702, 23337, 38748, 16272, -10403, -32365, -13890, -13223, -11125, 12135, 10947, -8658, -11308, 15950, 42892, 88352, 87112, 14217, -19753, -17093, 23913, -24522, -42713, -39285, -12045, -22552, -48509, -17119, 5250, -1927, 25522, 45122, 73567, 95279, 94364, 142454, 140968, 86253, 73651, 50717, 12930, 2733, 49123, 23850, 30703, 17326, 49196, 59682, 45179, 63993, 101448, 67460, -23004, -23270, -9522, 43048, 24859, -16576, -11541, 4823, -37595, -20000, 10204, -12803, -48512, -87483, -85474]
6594h5474L3701J1803p452k4395P928N4576K1907k0506K285k800J6102k1215j2634
6581b6174k5390k675J0765p465K5317K8468j2438N290M8552K4387m5615J0022
6569C3044M0404J7073j6192m6475l3220N2098k5729n840J1072J2302J7741j1467
6557D4811k8508j7053l684O8520M7656j1998n9722N435m7892j7149K0497R41j4205
6544a2351K5219K1756J8785l6545m2325j6242M6126K5145q847k0227M3977M634
6532D9105j6198r100k8700k580K590M6917L4944j5516k628k3152L575M6128l4222
6519E1163m9812j494j5244k3359K2730k1846l9333Q88M7043N1934K0175l9653
6507C192j3502nN323k8084R775J0991L2559J1087j5507o114k5553k0584j2693
$$ y = [-85474, -51773, -39970, -47422, -71817, -63889, -9313, 12594, -7912, -5627, -8427, 7675, -13540, -26174, -51564, -54239, -43474, -50939, -25622, 2846, -9592, -4302, 44250, 68637, 23022, 33044, 73448, 90521, 74329, 27854, -5366, 46732, 21003, 15163, 26235, 38537, 56278, 44811, 16303, -750, -4434, 64086, 111742, 99744, 40022, 45457, -2435, -19584, 913, 1854, -12351, 12868, 34624, 53409, 16864, -25461, -41703, 4423, 29568, 20721, 494, 44471, 49105, 32907, 23807, -4893, -7473, -4883, 42034, 76978, 61462, 58834, 35682, 39257, 85385, 51163, 1351, -143, -15387, -38746, -16016, -37862, -77195, -76307, -29264, 22670, 42845, 3192, -10310, -10315, -4992, -33076, -23301, -12310, 20249, 31336, 15829, 9715, -15838, -36422, -49115]
6494d9115J0714K6735K3669k4058j1748n0725l541K1367k1127j7622L6116L3835
6482b5500k9889j804N3453J2306J3532J2072j4834J2565k1550k8894k4911R512
6470c3942o061J9509L3261k8198m2915j0399N0401L9440k19k4359j5173q463Q635
6457a8483L4708j9293J5994L2129J9085O132j6811k3829k5906k8345K5344K101
6445B826k2406M5061J3323K3731M0999n8911p6412k8640j303Q506K6763N0268
6433B3805K4401r647O575j7087l6796N315k8330K476J3960N620L412L7879J9493
6420E1076j5802l3289k7305j5082j2305J6170M3273K583j8436L7314J3948j592
6408D0553n6800l6772K9866R908J359M0330K5505K5366k3581m1703m4895l0837
$$ y = [-49115, -38401, -11666, 12003, -12055, -23803, -74528, -78069, -56702, -77829, -95451, -59335, -25500, -55389, -57193, -3740, 8566, 22098, 34170, 19336, 31901, 10351, -18543, -43454, -33942, -40003, -20494, 12767, -15431, -58346, -68745, -18344, 21096, 20877, -3482, -18655, -27118, -18483, 16225, -3068, 12926, 45055, 64140, 70272, 53461, 29632, 3726, -24619, 725, 2826, -19580, 25481, 38804, 62535, 103534, 44623, -31789, -60429, -61732, -53226, -26463, 23805, 48206, 38559, 45134, 28047, -8749, -3434, -31764, -29288, -15328, -9708, -6296, 31583, 51076, 35274, 1985, -25320, -40402, -52707, -36537, 6736, 9319, -9117, 28197, 42145, 40553, -16247, -53019, -23153, -13245, -11886, 28444, 53949, 79315, 55734, 14031, -30864, -61701]
6396f1701J5781P725j2792j8650l23j8698J6258L4695O876N5063K4025k2863k0996
6383D400j3820J8390p151R654J208l3019L303k5445J1493L4071j1833M3483L8167
6370G2901J3235l2825m4589L5007O384J7012j135j9975Q955K9351m2587o3010
6358b1276j8803L6482K1937K4892l5583j752J3856k004L0728j7069j4688k9344
6346a2624j1296l5341L9592J8116k7240Q199J6941J6801L9494l0769j5154m3051
6334c6332k2540j1220j0077O5550L0996j5005L4191K5926L3133k2975l4960j1839
6322B4848L5596j2790j5579j152J1601j2093J1316j2288L425J9324j3897j5438
6310B2873j5262n6718l6672O2985Q847k1123n887P2660J0116o727L9308N466k6122
$$ y = [-61701, -45920, -38195, -50987, -69637, -69960, -88658, -72400, -37705, -30829, 24234, 48259, 25396, 4400, -9420, 8970, 1819, 11473, 12681, -20338, -17035, -42480, -30987, 3084, -8749, 34734, 72901, 86136, 53311, 8722, 43729, 50113, 67125, 65990, 46015, 54970, 84321, 41734, -21276, -40079, -3597, 18340, 43232, 7649, 5897, 19753, 17749, 48477, 31408, 16720, -12624, -23920, -59261, -19669, -1553, -28793, -20594, -3653, 13148, 52642, 21873, 6719, -36332, -58872, -70092, -80169, -14619, 16377, 1372, 35563, 61489, 94622, 71647, 36687, 24848, 60444, 47654, 32075, 30923, 42524, 30431, 41747, 29459, 32884, 52208, 38311, 22873, 7611, -49107, -85779, -22794, -13947, -35070, -40957, 31703, 41819, 35092, 74400, 79866, 53744]
6297E3744k0893k9345j3361J5124L2452j1401l314j547j1591J3520J2568J1797
6285D7753o616K41j859n2817K9279N0905J6549J7471P699l6212J1428J4907m7537
6272E1191l5881K881M776K8648K4546L7372l391k5952n931j841j0189o9163k9352
6259c2286J4694J5010N374J929j1928j6466K2057K662l4754J4851M7023L8889
6247F7055K3966m9039k9373r237j3752n7188K457K1942L3426J6405n0295p034
6235e0667J9562P588M9307Q7172n286l8993n3350j8308n423Q258J9646m71o1424
6222d2389K3450J5819Q831M8699P694k1237Q240p496O959k1777k2403m0054J797
6209c3867J2270r19J9725o664j0098m503k4901J8332k195j6993n316M6158N2568
$$ y = [53744, 32851, 3506, -9855, 5269, 37721, 26320, 23006, 21459, 9868, 23388, 35956, 47753, 41137, 41378, 39519, -13298, 15981, 66886, 83435, 100906, 108605, 72393, 83821, 98728, 51191, 15310, 18191, 22967, 51615, 76161, 113533, 110142, 84190, 78259, 76418, 66229, -2934, -32286, -17592, -2582, 2792, 4721, -7207, -23673, -1616, 1046, -33708, -18857, 28166, 67055, 91021, 41982, 12609, 3372, -10380, -67568, -65111, -43169, -9743, 6662, -43633, -50667, -31105, -23517, 25790, 112962, 107676, 68683, 15333, -2975, -8398, -140, 19506, 19035, -42389, -18939, -3120, 5711, 54410, 62104, 40867, 49107, 41611, 48570, 26793, 4390, -35664, -33867, -21597, -22516, -2791, -9455, -19553, -24056, -48957, -30625, -32820, -49813, -55129, -8971, 43597]
6196D3597k2988n3714J7381J4451l858L078l76p896m5966M312R294J6537J8197
6183g951L1867K3044j2672o0533k0002O36J9151J6080L6223j5389l4080K2348
6171a278M570o652m1343k3655M0584k5760N6251J5133l563j5692l0990j7419p074
6158e6888k6196J9684J4547j6123j7419J6792L7830J8340K1228K340n1500J2472
6146b4893K3039k3920L544j1649O3260n0880n8812J7803L7558Q470o582L6416
6134A3354r365l7845m0739J2929o934K5922K0751K1280l3803k0283K8394l0929
6122e7268L4423N8306J8321J0183Q660k1397l8590N905k5915j5257O4756m285
6110C7842j099q125l4154J0806j0330M1674K4888k4716k6258J8790K90r557K4097
$$ y = [43597, 20609, -33105, -15724, -1273, -5131, -2053, -2429, -10325, -56291, -51979, -42685, -26148, -7951, 23916, 46960, 34288, -26245, -46247, -45611, -26460, -10380, 25843, 10454, -23626, -1278, 3292, -3360, -44703, -68358, -27774, -53534, 2717, 17850, 14287, -1405, -32395, -49814, -56888, -83084, -63400, -48853, -64976, -82395, -65603, -27773, -9433, 11795, 14135, -37365, -24893, -1854, -25774, -22230, -33879, 29381, -21499, -80311, -62508, -24950, -16480, -23062, 13354, 3989, -33856, -74595, -61666, -68600, -42678, -21927, -647, -34450, -54733, -26339, -57268, -22845, 35461, 53782, 63965, 72625, 51228, 12638, 18543, -7372, -22629, 42127, 37842, 36743, 28618, -5536, 5270, -5060, 36614, 61502, 36786, 10528, 29318, 29608, 20051, 44148]
6097D4148p0150j6519o157j3415l539J8751L7723J2909Q436P50j4523k8639M344
6084b5881K8444J7363P199l5194k1617j7630k4840m779L0345M7215J9144r726
6072A0043m3968j9100N504K4101k898O712J8225K5163k3563j3997O1167M8814
6060I6203l0970q455j4874k9530l3897j8041l4252N980K7366k8616L1890J9626
6048a7570J3343j1906J0563j2704o527L6429L8176o805j68J4450l3076m8415k449
6035b6659j3878K8605k6881Q895l5569k7624M799K5675J7288J57R708j2755K0328
6022b7911M0664l437l2254M1295k893l540K5972N4710m1332n7330m8810j9126
6010g3992l469N566j8577P058K8109P4702L2043k9877J7300R261l8185k2623O568
$$ y = [44148, -26002, -42521, -48678, -62093, -65632, -46881, -9158, 3751, 12187, 12937, -1586, -30225, -25881, 2563, 19926, 27125, -8069, -29686, -47316, -72156, -76935, -46590, 625, 19769, 10043, -33925, -53025, -47521, -23420, -26318, -19606, -1381, 23782, 219, -13778, 47389, 96203, 65233, 56778, 41904, 12374, -21523, -39564, -73816, -67836, -40470, -69086, -37196, -17570, -4227, -16133, -5570, -18274, -24801, 11628, 49804, 42999, 42831, 57281, 24205, -24210, -26659, -40537, -11932, -38813, -29918, -65487, -93111, -88312, -62637, -45349, -45192, -35484, -48239, -27911, 12753, 9316, -22938, 18357, 15464, 11924, 37896, 92606, 51274, -6056, -54866, -73992, -77461, -71895, -90472, -83414, -55305, 19397, 51440, 21563, 38863, 48124, 9939, -12684, -6116]
5997f116k4530k5971L2922j1172m868l7250q972K89j6974J5571P9390N340j3678
5984a6019j7973J0710m919N323o367K9241J3936k0104N096K2958N583j1462l3410
5971a7407N2452O1846j3010R064K278m7485m0913k8939L8483m4126o36M4528m119
5958A2016N984L2843L880k2409k9969r780j0226J5974K3582L9624j4413p368r615
5945C0123k8263k632j6202p330q99k0710P32N0517M1935M118l9341r976J1374
5932A3446K3183p82n745l4159j3414k5907n754P956l9280j5366j675P987N0579
5919c8931L8336O2313K6063m3274l7084o466l180K2001J3109m2978k0095M0407
5907A0221O5984K6128l8150k9745j6682m8677k4921j1032R2515L8474j8709l7812
$$ y = [-6116, -30646, -56617, -23695, -34867, -39735, -76985, -85957, -85668, -102642, -87071, -7681, -2341, -16019, -33992, -23282, -28201, -22878, -29245, -4, 13932, -6172, -1076, 21882, 27465, 16003, -17407, 35045, 96891, 83881, 92945, 95223, 47738, 6825, -22114, 16369, -27757, -28393, 16135, 12016, 18000, 50843, 54723, 32314, 2345, -7435, -17661, -1687, 21895, 61519, 47106, 39738, 30123, 1860, -772, -16974, -24304, -25203, -45913, -45181, 5336, 47271, 51389, 12048, 2072, 13446, 36629, 35847, 30102, -4057, -17471, -43378, -49132, -41176, -80456, -95822, -97497, -89510, -38931, -595, 61718, 87781, 44507, 7423, 957, -2223, 19778, 32887, -10091, -30186, 10221, 76205, 102333, 64183, 34438, 17756, -30921, -55842, -66874, 25641, 64115, 45406, 7594]
5895G594k0629j4072m910l7269k5629K836K2668L2607L9264L0242l9925k8586
5883c5809j9199M119M5263Q519j505O40j2021o988M8432l1369k667J9587l6839
5870a9837K480N6905j5416j704L9278q329j2754J5721l5744J35q40j9158n057
5857d320J3942k0005J70J5152L5795K8234j5312K094O284o912J2745o5416J401
5844C852j7760p74K9571J5503R475n5784n7571L4007K0877K1245j0988l0759O1237
5831B2131R538k6003L1390k2710n6691j4741p277L2968k889l1742N1437M3534
5819B8945L3753J2530Q92j0378k8823N720K233l5707j6094l1060j6869j0564m8080
5806a13502K3166N4318l4620P079J8977J0068J5190J3698M2513M6720N234l1335
$$ y = [7594, -13035, -27107, -32017, -69286, -94915, -92079, -69411, -36804, 2460, 32702, -7223, -35809, -55008, -50889, -5626, 2893, 1388, 2028, -9993, -16981, 31451, 82, -2585, 17002, -19837, -17357, 39548, 24132, 22428, 61706, 53377, 40623, 56344, 20600, 20735, 19895, 737, -4320, 9622, -10383, -10213, 4939, 40734, 68968, 53656, 55750, 62034, 55122, 67867, 2451, 3852, -13908, -14682, 14889, 30392, 39867, -15917, -73488, -39481, -18604, 2641, -8347, -39106, 22131, 31669, 5666, 37056, 14346, -42345, -57086, -64363, -31395, -34284, -66026, -14589, 28945, 62698, 75228, 76120, 65742, 36919, 42639, 44872, 9165, -6929, -37989, -54858, -65422, -113502, -90336, -36018, -70638, -63559, -44582, -34514, -19324, -5626, 36887, 83607, 88841, 57506]
5794E7506K508J2697L3968K4070n084n6684r0300k888J174O809L7J2459M06j7827
5780b1149j8588R809J9425j3138L2766L3316j3419k9663k385l0078J2087J8669
5768b348R815j5624O0562N4132l328k166L90p4203l2745J5969K7681r173k7305
5755A657K442m5769l8237P885J2330K8381M593m33l853J8734O8014k5453J3695
5742D3986J6077J2270o1183n9444N5587J6081j3208n2564L9873L4036l2738j8608
5730a9835l7353J5833p328j4993J0503N0713L5042n8222j3051K9404N6694m8630
5718a223j9944l015N2570K4044j1453m8301p533J3509K862m7809Q137j6006K0637
5705c3525J1075k7308l0515M5791M8278k7944j2549q711K9767l05j0816k304M6602
$$ y = [57506, 60014, 72711, 106679, 130749, 125665, 68981, -21319, -24207, -23033, -16224, -16187, -3728, -3322, -21149, -39737, -29928, -10503, -23641, 9125, 42441, 29022, -641, -3026, -33104, -21017, -2348, 7467, -8157, 52405, 106537, 103209, 101043, 101433, 27230, -5515, 10454, 38135, 28962, 1657, 4099, -41670, -79907, -72022, -59692, -31311, -26718, -27151, -31004, -12270, 55744, 30291, 43986, 60063, 72333, 11150, -48294, 7293, 23374, 10166, -42398, -2525, 31511, -1227, -19835, -57188, -41355, -48683, -63676, -53173, -2460, 32582, -25640, -38691, -9287, 47407, -1223, -21167, -24182, 28388, 52432, 40979, -7322, -14855, -1346, 1516, -46293, -38156, -54162, -33525, -22450, -49758, -80273, -34482, 13796, -14148, -26697, -35408, -5641, -5946, -16762, -19066, 27536]
5692B7536j7900j8752L1193L866j2099N4846j1706l1005K192k320l0085k006r580
5679a5820K111J8128K612J6501j7832p461J5035K7974K7422l0892n0377m404N7300
5666D0297r363m6273j2553j7441m0012N5822M9081k1826j9457J3756J5243j8972
5654a1698M119j3762L722N0199P962l515K379o1362k8180J3309k0241K0691K9544
5641f833K038N5866K1646K1877J6212j1821l3732q5855n5055M939K9690m796j3759
5628e9583k1284m1842J0955K7694J7231O505J4652q792K1087j5068j3787K7130
5616c5102L7712K8675l0402n7352k5693K303K9742P7132L2388M166m5750K0913
5604C8732K7041j7310m7312j9415n731k1994q658k4472J9046K4821J3087M2322
$$ y = [27536, 9636, -9116, 22077, 25943, 13844, 68690, 56984, 25979, 28171, 25851, -4234, -6240, -15820, -13709, 4419, 7031, 23532, 5700, -1761, 13274, 41248, 68670, 37778, -12599, -17003, 40297, 30934, -15339, -27892, -45333, -85345, -29523, 19558, -2268, -21725, -7969, 7274, -11698, -7579, -21341, -17619, 32580, 40542, 37027, 39406, -21956, -50136, -36827, -57068, -36377, -6833, -4795, 51071, 72717, 94594, 110806, 98985, 65253, -20602, -75657, -70718, -41028, -45824, -59583, -80867, -122709, -111754, -84060, -66829, -60324, -45672, -54464, -33377, -48445, -62232, -35102, 2610, 31285, 883, -56469, -82162, -79859, -50117, 27015, 59403, 63569, 17819, 38732, 65773, 48463, 1151, -18264, -23995, -45989, -54647, -79119, -60073, -35252, -22165, 20157]
5592B0157K9619k6784j2899N2715j2657n2639l3550j5560m620L7710J5336K1624
5580A8452j4258l3259k4441M9489J9147j9427o553j6219l4307J6478J6008J7239
5568a1651j3582o048K7293K1583j2808k9132k1261j4219K8407L808Q30K0406K963
5555c411l1311J5495M9059Q513j0420m377l2427j6209J4653j3134N2653j1927
5543A7157k0742L0492M643k6337k2444k0836N3766J329k1473j5536k6705k6849
5531g3535K5546J7594K6829l076r68J2657L2298m5244n655P800l7765K6761l1391
5518d8149j525J7077j7454K2611M3851K7068M154N076j5884l7415K3588K825m2797
5505a6974l1484j6908N426M7251J9998k2414j4416l9861J3879O4801k8756n365
$$ y = [20157, 49776, 22992, 10093, 62808, 50151, -2488, -36038, -51598, -56218, -18508, -3172, 18452, 4194, -29065, -53506, -4017, 15130, -4297, -10850, -27069, -61376, -44898, -28890, -11651, -25233, -31281, -3988, 17595, 4787, -24345, -45606, -59825, -31418, -27610, -26780, -6374, -3411, -34722, -19227, 29832, 38345, 27925, 23548, -8879, -25088, -10435, -23569, 29084, 17157, -3585, 26907, 31550, 5213, -17231, -38067, 15699, 17028, -4445, -19981, -46686, -73535, -47989, -30395, -3566, -6642, -7610, 5047, 37345, -7899, -13554, -5754, -43519, -16758, -48149, -49674, -32597, -50051, -27440, 16411, 43479, 47633, 52709, 36825, -590, 22998, 25823, -16974, -48458, -65366, -59940, -12689, 7309, -15105, -29521, -69382, -55503, 9298, -19458, -24823]
5493b4823K0274l7045n3283l435L8998L5497N0587J8583l1177J8230l013l4001
5481d608n60l0190L0982R93m8088m555K6364L2352M7017k1486j8010l0366j2633
5468c2788L43j6729K224O4260M6663k5040k3010J6037J067j7919k0554K9423K2998
5455D6975J1823K6521J9635n3637r3683k257O5863K1955R115n1180l5309M5281
5443A1102j8813k887L0329j2561K0565N240K9914N800K6532K1854o3745l6966
5431A6364k9228l5319K401J4149o184J0240K4184j6516K1927K040J4735K1996
5419D0789o1300l0854J4903J9445k211o718j3815J2666j7120O855J9871N640N146
5406f703p230M1922j9473m372k7179K3757L4323J4697l4068n4194J0109J3447
$$ y = [-24823, -4549, -41594, -94877, -98312, -59314, -23817, 26770, 45353, 14176, 32406, 29393, -4608, -5168, -35358, -4376, -3383, -51471, -56026, -29662, 2690, 49707, 28221, 10211, -20155, -32788, -32445, -49174, -46950, 17310, 63973, 38933, 15923, 31960, 33027, 15108, -5446, 23977, 46975, 58798, 85319, 104954, 51317, -42366, -44623, 21240, 43195, 52310, 1130, -34179, 11102, -7711, -10598, 19731, 7170, 27735, 32975, 62889, 68689, 95221, 117075, 53330, 16364, -12864, -48183, -45782, -31633, -37817, -27577, -3393, -19909, 2018, 4058, 18793, 40789, -20511, -51365, -36462, -17017, -19228, -25946, -39761, -27095, -44215, -37360, -17489, -11849, -6703, -13933, 27989, 8516, 4144, -23035, 722, 35045, 49742, 15674, -38520, -28411, -14964]
5394a4964O560n762K0438m547L2480n369j9981L257N62m1790k6700m1810J083
5381i6543L8947M1287L2178K379l1627J7438k5109k4616K2860l050j8825R876
5369c4805M5402J9156l3669L313J0979o669j7179R500j1358j3977n1415O862Q062
5356f5798K6087Q056l0012k3204j7430k74K9431N9367K7439J3222k3715J3637
5344A6806J2048j2637o881j9120m151J5808J33L8790k5446n82n639R566p444M9648
5330F0899K4925j9140o4960K91M7283j0545m9704k2189k4643k1107K046J8598
5318e8246k7954n2048J9853L938P4711K9445j4967M400J1264J8792M4408J5737
5306F9333n650n8018j1576j7049J1547O1091l459J0692P183k0867M2995k5634
$$ y = [-14964, -8404, -14166, 6272, 1725, 34205, 28836, 8855, 12112, 12674, -29116, -55816, -97626, -96543, -57596, -16309, 15869, 18248, -13379, 4059, -21050, -45666, -22806, -25856, -44681, -34805, 10597, 29753, -3916, -603, 10376, 3707, -13472, -3972, -15330, -29307, -80722, -73860, -65798, -39711, -31655, -61667, -84871, -102301, -102575, -73144, -13777, 13662, 26884, 3169, 16806, 28854, 16217, 9336, -9784, -13935, 1873, 2006, 40796, 15350, 14768, 9129, 18695, 11251, 60899, 85824, 66684, 1724, 2015, 49298, 38753, -10951, -33140, -57783, -78890, -76844, -58246, -86200, -138248, -118395, -114457, -39746, -10301, -25268, -20868, -9604, 9188, 53596, 69333, 63683, 5665, -5911, -22960, -11413, 49678, 46219, 56911, 64094, 43227, 86222, 60588]
5294F0588n2468L6278j192l9634m8221N2068K5666K863M6471k0633l9081P948
5282C0653q834K680j8887m9515K7809L3228k4241j5026K4643p1320L512M3724
5270b1574k0137k9449P882M0005L2039K8890J4583J2470m7584k5704N568L7538
5258C4527l014l1618N948L2535n918j3318P52k3173R302j5757n8027K7772L8273
5245a716J2916j4205n874K3920J4251j3494J8508K2068m1350l7257j3972K9930
5233f275K8230K0990j5832n2328n1502M3764J7467P015K7421L3629L661j7111
5221C9129n7780r524M2794J7584m801m2013j9621J0835r963M0393K0373n5334
5209b7928l2920p635L0241K8019M943k2974k8734j9257j8639R6989R062m6119
$$ y = [60588, 8120, 44398, 43206, 3572, -44649, 7419, 33085, 35948, 82419, 61786, 22705, 30653, 21819, 24499, 5612, -43903, -16094, 17134, -7107, -22133, 2510, -68810, -65298, -21574, -41711, -71160, -63278, -23273, 8766, 37656, 52239, 64709, 17125, -8579, -3011, 34527, 31513, -105, 5843, 38378, 32460, 19142, 19894, -3279, 6023, -9734, -67761, -39989, -1716, 11200, -3005, -8879, 15041, 29292, 15798, 34306, 56374, 15024, -22233, -36205, -6275, 21955, 42945, 27113, -25215, -76717, -32953, -15486, -8471, 18950, 52579, 56240, 39129, -18651, -28175, 14619, 32203, 27402, -14611, -34232, -23397, -33360, 7033, 27406, -27928, -60848, -68483, -38242, -10223, -5280, -28254, -56988, -76245, -94884, 2105, 11167, -34952]
5197c4952j4478J8611K8195k3767K5996J4694o9491k8532L6803R188K4383J2891
5185d59p5558m8910L7029P9303J1393l0880O9294K5030l6424m3396o1407L4593
5173d0392K8969k4162Q912N0573L4323L029o5858j1666K6189j3304K0443j8866
5161a810m6311k6819M0399J3511l9921o580L045l9790j1808l0321N7739K5637
5149f3029j8212k3235O106L9464L4317O119n661M9344J2033j1733J0765j4037
5137B2241n3490l0258K4647O827N2454j7135n5646k7845j0776J7980O1797J9895
5125A0691K7964N96m0812J6816J5771O144k5347k4611M1L913j8409k5771Q468
5112d4546k7687j7560K8610J8965L4586j6690J428J4626L4349J5712k2863O644
$$ y = [-34952, -49430, -30819, -2624, -26391, -395, 14299, -55192, -83724, -46921, -37733, -13350, -459, -76017, -124927, -87898, -8595, 2798, -28082, 41212, 66242, 29818, -13578, -74985, -40392, -11423, -35585, -26673, 23900, 58223, 61252, -4606, -16272, 9917, -3387, 17056, -1810, -48121, -74940, -34541, -21030, -60951, -67531, -64486, -104276, -116084, -146405, -88666, -63029, -81241, -104476, -98370, -58906, -24589, -18470, -24131, 25213, 37246, 25513, 36278, 22241, -31249, -61507, -36860, -30033, 22421, 5286, -50360, -78205, -88981, -71001, -9204, 10691, 38655, 39251, -1561, 15255, 31026, 37170, 11823, -12788, -12747, -8834, -27243, -53014, -44546, -72233, -89793, -61183, -42218, -7632, -24322, -22894, -8268, 26081, 41793, 18930, 25574]
5100B5574J9996K1591L6768P600j2049k3674l7656J48n0383j7357L1973N5101
5088E7632k1617j0610k9885m4607k3547J8971j2725K205J9557K8563L5190N5543
5076G4670M0009j3049j3071k6239k6174L269L8023K6393k8994q6302o391K2284
5064D428o2846J3573R869k9222j9210L5283J2531J2056n5l3496M038N354j2798
5051f0495L1127J6691k9809K7707J2939n0318K3869r79Q422P808J1795l4042N953
5038b9332L4472q987K0810r220j8180j302M8160K1715j7348o143k8480N40N1247
5025E7952l7371l1534p327J8482J9268J0435K0650p830n9065L7846P380K792o9
5012C1609l361m1397J7904L2515J9973o783l8876j036K739k5704l7705j101J8162
$$ y = [25574, 45570, 67161, 103929, 111529, 99480, 75806, 38150, 38298, -12085, -29442, 2531, 57632, 36015, 25405, -4480, -49087, -72634, -53663, -66388, -64183, -44626, -16063, 19127, 74670, 114679, 101630, 88559, 62320, 36146, 39415, 77438, 103831, 74837, -11465, -17856, 4428, -58418, -44845, -34976, -64198, -83408, -48125, -35594, -23538, -23593, -57089, -53051, -47697, -60495, -29368, -12677, -42486, -14779, -1840, -52158, -28289, -29268, -20846, -13038, -1243, -35285, -29332, 5140, -3847, 16963, 7743, -10437, -11739, 36421, 58136, 40788, 34645, 6165, 6705, 57952, 20581, -10953, -18280, 202, 19470, 29905, 50555, 42725, -16340, 21506, 28886, 31678, 31609, 28248, -13149, 4755, 37270, 57243, 50460, 11584, 10548, 13287, -12417, -50122, -51223, -33061]
4999c3061N1152L0954m2254l1557l1913J8896J8015j376k2366K3786K0940M1713
4987D2929k4414K6032R060l6131l7736J8777L3934k1168k1562J358k771m5579
4975e7271N03j574K724j693J4102l7825K705K3942O7522N18P708N260l6201n7205
4961f6785l766K4569K8262P635m4570q559m119l944j3513L0141L3334L5076M2452
4948E6213r045j9384k235k0843r61m85j7963J2125K1126o6833m5156j3240N2359
4935e4322N9321L623N894J9968J2067J7643J189p892o4260m9117L2350J7518k4652
4922c0670J819r133L3931L0608O636J8798n582q230k8478j8556K4957o1898k0638
4909f6436l43q081K9224L0455l1362K1684L9932J2433j1269J0532o663N576n3050
$$ y = [-33061, 18091, 49045, 6791, -24766, -56679, -37783, -19768, -21144, -43510, -19724, 1216, 42929, 18515, 44547, 53607, 17476, -20260, -1483, 32451, 11283, -10279, -8921, -11692, -57271, -56768, -58342, -55618, -57311, -43209, -81034, -78329, -54387, 13135, 13653, 21361, 26621, -9580, -66785, -70551, -45982, -17720, -10085, -54655, -63214, -67333, -71277, -84790, -54649, -21315, 13761, 56213, 47168, 27784, 25549, 4706, 3745, 3260, -14703, -2578, 18548, -48285, -93441, -106681, -54322, 4999, 8622, 14516, 34484, 46551, 64194, 65383, 57491, -6769, -55886, -23536, -6018, -30670, -28851, -37984, -4053, 26555, 33191, 51989, 46407, 38177, 9699, -8857, 16100, -45798, -66436, -66779, -74860, -45636, -15181, -46543, -24859, 15073, 27506, 16237, 26769, 20106, 25682, -27368]
4896b7368N090O1347P467L2135K1255n1325m8260m5588j343k334K1230O33L320
4883b3741o9705m5530Q9674P9518J7428j9855m5540l6199J643M8418K3290J4635
4871C4036k5413M3779K365p7359l4637N4332J2724k6437L8616J9598j9306k8089
4859e791q122L0665l3678j0829K1779n514J0671J3049J3363j5844m0049j471K2067
4846i704M3300J5897n0356j8286J5562M3639M6597m0828j3443k665N279m7951
4834a2959M834L0946j7658J8432n3622q880N1607L1506J9621l8966l9156n20M2523
4821B7708m33m8151j2746M9478J3437q37K2176l698k6378m107l2468j0736K0660
$$ y = [-27368, -22278, 39069, 46536, 78671, 99926, 48601, 341, -45247, -46590, -48924, -27694, -27061, -23741, -93446, -138976, -49302, 30216, 47644, 27789, -17751, -53950, -52307, -3889, 19401, 34036, 8623, 52402, 54767, -22592, -57229, -2897, 9827, -16610, 22006, 41604, 22298, -5791, -13913, 16752, -16926, -27755, -5976, -11490, -819, 12230, 25593, 9749, -30300, -31771, -9704, 33596, 49493, -863, -19149, -3587, 40052, 86649, 45821, 32378, 29713, 34992, -12959, -8125, 22821, 5163, 23595, -30027, -38907, 12700, 44206, 63827, 24861, -14295, -14815, 27708, 27275, -20876, -33622, 15856, 29293, 28456, 50632, 46934, 20556, 16449, -16019, -26755, -6095]
$$ [...]
##END NTUPLES=NMR SPECTRUM
##END=
