##TITLE=Analysis number 329868
Compound Code cc 59026
Book Reference 546/44
Project Code adrs
Chemist Name craigr
##JCAMPDX= 6.0         $$ Bruker NMR JCAMP-DX V2.0
##DATA TYPE= NMR SPECTRUM
##DATA CLASS= NTUPLES
##ORIGIN= Bruker BioSpin GmbH
##OWNER= nmr
$$ XWIN-NMR		Version 3.5
$$ Fri Oct  5 11:27:17 2007 GMT Daylight Time (UT+1h)  MAYBRIDGE\nmr@NMR_250MHZ
##.OBSERVE FREQUENCY= 250.131544655141
##.OBSERVE NUCLEUS= ^1H
##.ACQUISITION MODE= SIMULTANEOUS (DQD)
##.ACQUISITION SCHEME= undefined
##.AVERAGES= 16
##.DIGITISER RES= 18
##SPECTROMETER/DATA SYSTEM= dpx250
##.PULSE SEQUENCE= zg30
##.SOLVENT NAME= CDCl3
##.SHIFT REFERENCE= (INTERNAL, CDCl3, 0, 16.522)
##AUDIT TRAIL= $$ (NUMBER, WHEN, WHO, WHERE, WHAT)
$$ ##TITLE= Audit trail, XWIN-NMR		Version 3.5
$$ ##JCAMPDX= 5.01
$$ ##ORIGIN= Bruker BioSpin GmbH
$$ ##OWNER= nmr
$$ C:\u/data/dgb/nmr/ADRS/330/pdata/1/auditp.txt
$$ ##AUDIT TRAIL=  $$ (NUMBER, WHEN, WHO, WHERE, WHAT)
(   1,<2007-10-05 11:26:51.40 +100>,<MAYBRIDGE\nmr>,<NMR_250MHZ>,
      <created by zg, POWCHK disabled, PULCHK disabled
       configuration hash MD5:
       76 6E 9A 78 1E 09 19 81 EC 84 63 8F B0 6A 59 2D
       data hash MD5: 64K
       69 A8 62 5D CF 06 51 31 34 C2 E4 53 F1 F7 AD A8>)
(   2,<2007-10-05 11:27:04.44 +100>,<MAYBRIDGE\nmr>,<NMR_250MHZ>,
      <Start of raw data processing
       ef LB = 0.3 FT_mod = 6 PKNL = 1 SI = 32K 
       data hash MD5: 32K
       87 2C AF 13 B6 20 CE 76 C9 8A FB 34 A0 AF 2A 16>)
(   3,<2007-10-05 11:27:06.10 +100>,<MAYBRIDGE\nmr>,<NMR_250MHZ>,
      <apk 
       data hash MD5: 32K
       1D BD 2D 22 E5 D4 F6 05 C0 51 88 4C 11 9E 11 9E>)
(   4,<2007-10-05 11:27:06.94 +100>,<MAYBRIDGE\nmr>,<NMR_250MHZ>,
      <abs ABSG = 5 
       data hash MD5: 32K
       53 DB B6 0E 48 6B 47 41 6A 31 C6 40 E5 92 05 85>)
$$ ##END=
$$ 
$$ hash MD5
$$ 85 97 3D 00 51 9E 65 4E 5F AA A5 2C 07 86 0C A9
##$RELAX= 
##$RELAX= 
##$RELAX= 
##$RELAX= 
##$RELAX= 
##$RELAX= 
##$RELAX= 
$$ Bruker specific parameters
$$ --------------------------
##$DU= <C:\u>
##$EXPNO= 330
##$NAME= <ADRS>
##$PROCNO= 1
##$TYPE= <nmr>
##$USER= <dgb>
##$AMP= (0..31)
100 100 100 100 100 100 100 100 100 100 100 100 100 100 100 100 100 100 
100 100 100 100 100 100 100 100 100 100 100 100 100 100 
##$AQSEQ= 0
##$AQ_mod= 3
##$AUNM= <au_zg>
##$AUTOPOS= <15 >
##$BF1= 250.13
##$BF2= 250.13
##$BF3= 250.13
##$BF4= 250.13
##$BF5= 500.13
##$BF6= 500.13
##$BF7= 500.13
##$BF8= 500.13
##$BYTORDA= 1
##$CFDGTYP= 0
##$CFRGTYP= 5
##$CHEMSTR= <none>
##$CNST= (0..31)
1 1 145 1 1 1 1 1 1 1 1 1 1 1 1 1 1 1 1 1 1 1 1 1 1 1 1 1 1 1 1 1 
##$CPDPRG= <>
##$CPDPRG1= <>
##$CPDPRG2= <>
##$CPDPRG3= <>
##$CPDPRG4= <mlev>
##$CPDPRG5= <mlev>
##$CPDPRG6= <mlev>
##$CPDPRG7= <mlev>
##$CPDPRG8= <mlev>
##$CPDPRGB= <>
##$CPDPRGT= <>
##$D= (0..31)
0 1 0 0 0 0 0 0 0 0.06 0 0 0 0 0 0 0.0002 0 0 0 0 0 0 0 0 0 0 0 0 0 0 
0 
##$DATE= 1191580010
##$DBL= (0..7)
120 120 120 120 120 120 120 120 
##$DBP= (0..7)
150 150 150 150 150 150 150 150 
##$DBP07= 0
##$DBPNAM0= <>
##$DBPNAM1= <>
$$ [...]
##$SUBNAM7= <"">
##$SUBNAM8= <"">
##$SUBNAM9= <"">
##$SW= 20.6930455092707
##$SWIBOX= (0..15)
0 0 3 0 0 0 0 0 0 0 0 0 0 0 0 0 
##$SW_h= 5175.983436853
##$TD= 65536
##$TD0= 1
##$TE= 296.16
##$TE2= 300
##$TE3= 300
##$TEG= 300
##$TL= (0..7)
0 120 120 120 120 120 120 120 
##$TP= (0..7)
150 150 150 150 150 150 150 150 
##$TP07= 0
##$TPNAME0= <>
##$TPNAME1= <>
##$TPNAME2= <>
##$TPNAME3= <>
##$TPNAME4= <>
##$TPNAME5= <>
##$TPNAME6= <>
##$TPNAME7= <>
##$TPOAL= (0..7)
0.5 0.5 0.5 0.5 0.5 0.5 0.5 0.5 
##$TPOFFS= (0..7)
0 0 0 0 0 0 0 0 
##$TUNHIN= 0
##$TUNHOUT= 0
##$TUNXOUT= 0
##$USERA1= <user>
##$USERA2= <user>
##$USERA3= <user>
##$USERA4= <user>
##$USERA5= <user>
##$V9= 5
##$VALIST= <valist>
##$VCLIST= <CCCCCCCCCCCCCCC>
##$VD= 0
##$VDLIST= <DDDDDDDDDDDDDDD>
##$VPLIST= <PPPPPPPPPPPPPPP>
##$VTLIST= <TTTTTTTTTTTTTTT>
##$WBST= 1024
##$WBSW= 4
##$XGAIN= (0..3)
0 0 0 0 
##$XL= 0
##$YL= 0
##$YMAX_a= 289821
##$YMIN_a= -453854
##$ZGOPTNS= <>
##$ZL1= 120
##$ZL2= 120
##$ZL3= 120
##$ZL4= 120
##$ABSF1= 16.522
##$ABSF2= -4.171173
##$ABSG= 5
##$ABSL= 3
##$ALPHA= 0
##$AQORDER= 0
##$ASSFAC= 0
##$ASSFACI= 0
##$ASSFACX= 0
##$ASSWID= 0
##$AUNMP= <proc_1d>
##$AZFE= 0.1
##$AZFW= 0.1
##$BCFW= 0
##$BC_mod= 0
##$BYTORDP= 0
##$COROFFS= 0
##$CY= 12.5
##$DATMOD= 1
##$DC= 0
##$DFILT= <>
##$DTYPP= 0
##$F1P= 14.0000005364418
##$F2P= -0.99999901652339
##$FCOR= 0.5
##$FTSIZE= 32768
##$FT_mod= 6
##$GAMMA= 0
##$GB= 0
##$INTBC= 1
##$INTSCL= 1
##$ISEN= 128
##$LB= 0.3
##$LEV0= 0
##$LPBIN= 0
##$MAXI= 10000
##$MC2= 0
##$MEAN= 0
##$ME_mod= 0
##$MI= 0
##$NCOEF= 0
##$NC_proc= -4
##$NLEV= 6
##$NOISF1= 0
##$NOISF2= 0
##$NSP= 0
##$NTH_PI= 0
##$NZP= 0
##$OFFSET= 16.522
##$PC= 1
##$PHC0= 159.2457
##$PHC1= 9.814974
##$PH_mod= 1
##$PKNL= yes
##$PPARMOD= 0
##$PSCAL= 4
##$PSIGN= 0
##$REVERSE= no
##$SF= 250.13
##$SI= 32768
##$SIGF1= 0
##$SIGF2= 0
##$SINO= 400
##$SIOLD= 32768
##$SREGLST= <1H.CDCl3>
##$SSB= 0
##$STSI= 32768
##$STSR= 0
##$SW_p= 5175.98343685301
##$SYMM= 0
##$S_DEV= 0
##$TDeff= 65536
##$TDoff= 0
##$TI= <Analysis number 999999
Compound Code 99
Book Reference 9
Project Code 9>
##$TILT= no
##$TM1= 0
##$TM2= 0
##$TOPLEV= 0
##$USERP1= <user>
##$USERP2= <user>
##$USERP3= <user>
##$USERP4= <user>
##$USERP5= <user>
##$WDW= 1
##$XDIM= 32768
##$YMAX_p= 474474695
##$YMIN_p= -457670
$$ End of Bruker specific parameters
$$ ---------------------------------
##NTUPLES= NMR SPECTRUM
##VAR_NAME=  FREQUENCY,     SPECTRUM/REAL,   SPECTRUM/IMAG
##SYMBOL=    X,             R,               I
##VAR_TYPE=  INDEPENDENT,   DEPENDENT,       DEPENDENT
##VAR_FORM=  AFFN,          ASDF,            ASDF
##VAR_DIM=   32768,         32768,           32768
##UNITS=     HZ,            ARBITRARY UNITS, ARBITRARY UNITS
##FACTOR=    0.157963299565203, 1,           1
##FIRST=     4132.6476996994, 0,             0
##LAST=      -1043.33573715361, 0,           0
##MIN=       -1043.33573715361, -457670,     0
##MAX=       4132.6476996994, 474474695,     0
$$ Real data points
##PAGE= N=1
##DATA TABLE= (X++(R..R)), XYDATA
$$ [...]
$$ plain form
15565 54458 -42722 -19665 -8329 88290 98654 97991 28478 42245 107174 79679 15938 15436
15553 15436 74528 24676 -17027 70751 177916 126421 87483 -7711 -14065 4215 -595 38813
15541 38813 159593 147071 67539 -80479 -95689 -72021 56589 120065 1059 -52808 -102423
15530 -102423 -42741 68352 193758 54129 -82078 -9123 7584 21238 -80235 -159151
15520 -159151 -104444 -10260 -110378 -249368 -321168 -310871 -166989 -123054 -174571 -131156 -71229
15509 -71229 -72409 51859 96073 11336 69167 151792 94927 92780 130436 176305 167447 160863
15497 160863 109622 37192 31182 47476 9828 25001 28605 -34026 -96441 -138618 -165552 -129153
15485 -129153 -59943 34628 159649 100883 -33543 49855 -60233 -71210 -31200 -48171 -48977
$$ packed form
15565E4458r7180K3057J1336R6619J0364o63o9513J3767O4929k7495o3741n02
15553A5436N9092m9852m1703Q7778J07165n1495l8938r5194o354J8280m810L9408
15541C8813J20780j2522p9532j48018j5210K3668J28610O3476j19006n3867m9615
15530a02423N9682J11093J25406j39629j36207P2955J6707J3654j01473p8916
15520a59151N4707R4184j00118j38990p1800J0297J43882M3935n1517M3415N9927
15509g1229j180J24268M4214q4737N7831Q2625n6865k147L7656M5869q858o584
15497A60863n1241p2430o010J6294l7648J5173L604o2631o2415m2177k6934L6399
15485a29153O9210R4571J25021n8766j34426Q3398j10088j0977M0010j6971q06
$$ plain form
15474 -48977 -83684 -169340 -247432 -232369 -207500 -174277 -176253 -42503 62924 90869 138554
15463 138554 142940 172897 129817 36203 -8052 -28692 -86120 -2397 104411 139835 57965
15452 57965 36338 -49980 -138688 -107703 -47822 2736 -21246 95152 166359 150687 14292
15441 14292 -116568 36056 86588 40879 107212 56893 120478 142914 111791 161534 152983
15430 152983 88770 -2996 82836 114857 125658 130292 77030 -69777 -105881 -132537 -59939
15419 -59939 -77975 -22058 20429 53729 38889 -4794 -111145 -187657 -179834 -123798 -44524 2448
15407 2448 -5187 -122019 -183664 -122812 -73534 -106433 -180985 -110210 123620 215528 225997 244058
15395 244058 91483 3802 89390 100745 127772 228427 82443 -74907 47273 169320
$$ packed form
15474d8977l4707q5656p8092J5063K4869L3223j976J33750J05427K7945M7685
15463A38554M386K9957m3080r3614m4255k0640n7428Q3723J06808L5424q1870
15452E7965k1627q6318q8708L0985N9881N0558k3982J16398P1207j5672j36395
15441A4292j30860J52624N0532m5709O6333n0319O3585K2436l1123M9743q551
15430A52983o4213r1766Q5832L2021J0801M634n3262j46807l6104k6656P2598
15419e9939j8036N5917M2487L3300j4840m3683j06351p6512P823N6036P9274M6972
15407B448p635j16832o1645O0852M9278l2899p4552P0775K33830R1908J0469J8061
15395B44058j52575q7681Q5588J1355K7027J00655j45984j57350J22180J22047
$$ plain form
15385 169320 185750 152255 133585 135068 143575 124779 22541 -169572 -217485 -135803 -78966
15374 -78966 -141440 -59439 -103448 -56857 36564 73289 54976 48392 170305 255875 125364
15363 125364 44267 95478 122305 11321 114640 202074 165816 111243 116571 84390 -3249
15352 -3249 46272 26813 72853 220899 141665 93086 121633 -4346 -45153 -32137 46595
15341 46595 191288 173916 33297 22282 -11758 -77839 -49308 64913 131770 141659 133041
15330 133041 67453 -89983 -149257 -49550 75076 109145 104164 38839 78822 261611 250806
15319 250806 116427 124784 153296 120820 63198 63214 139304 71272 49554 88097 186817 307604
15307 307604 189398 141547 135290 71217 7734 -118465 -154173 -97527 -14967 -7224 31505
$$ packed form
15385A69320J6430l3495j8670J483Q507j8796j02238j92113m7913Q1682N6837
15374g8966o2474Q2001m4009M6591R3421L6725j8313o584J21913Q5570j30511
15363A25364q1097N1211K6827j10984J03319Q7434l6258n4573N328l2181q7639
15352c249M9521j9459M6040J48046p9234m8579K8547j25979m0807J3016P8732
15341D6595J44693j7372j40619j1015l4040o6081K8531J14221O6857R889q618
15330A33041o5588j57436n9274R9707J24626L4069m981o5325L9983J82789j0805
15319B50806j34379Q357K8512l2476n7622J6P6090o8032k1718L8543R8720J20787
15307C07604j18206m7851o257o4073o3483j26199l5708N6646Q2560P743L8729
$$ plain form
15296 31505 21679 -20787 -65810 -4816 47602 6647 -80617 -110371 -221738 -267577 -239273 -89435
15284 -89435 -32384 232 -45285 -33204 -20938 69632 127856 74526 49298 197728 229472
15273 229472 63428 -14756 2575 -63773 -69682 -79562 79668 107621 153624 95913 -11402
15262 -11402 51211 -118 50177 6651 45052 207121 145404 46506 -15096 45498 42322 85279
15250 85279 74708 50647 180987 280122 274769 283650 71035 -113725 -113353 -78039 -47683 8204
15238 8204 -48336 -73029 -15827 11448 -40556 -82932 -32200 -76765 5854 -22367 2624 75470
15226 75470 119745 81464 24627 93947 86158 -14343 -124146 -127297 -186411 -182685 -120284 -9261
15214 -9261 41710 125126 38600 -18930 -38697 -183918 -266564 -300017 -278933 -168928 -155730
$$ packed form
15296C1505r826m2466m5023O0994N2418m0955q7264k9754j11367m5839K8304J49838
15284h9435N7051L2616m5517J2081J2266R0570N8224n3330k5228J48430L1744
15273B29472j66044p8184J7331o6348n909r880J59230K7953M6003n7711j07315
15262a1402O2613n1329N0295m3526L8401J62069o1717r8898o1602O0594l176M2957
15250H5279j0571k4061J30340R9135n353Q881k12615j84760L72L5314L0356N5887
15238H204n6540k4693N7202K7275n2004m2376N0732m4565Q2619k8221K4991P2846
15226G5470M4275l8281n6837O9320p789j00501j09803l151n9114L726O2401J11023
15214i261N0971Q3416q6526n7530j9767j45221q2646l3453K1084J10005J3198
$$ plain form
15203 -155730 -162123 -175089 -118504 -86483 -153643 -67674 80158 76883 -23147 3006 5980 22272
15191 22272 28082 83177 69113 76015 63051 66759 98466 1756 84270 -26662 -69731 32927
15179 32927 663 -103939 -83721 43228 15117 -47984 44596 123702 122499 39746 -18246
15168 -18246 -88435 -151302 -118403 36390 119311 185131 181193 165169 42851 -74701 -135604
15157 -135604 -205070 -232793 -78784 -46578 73330 90605 -46225 -27197 34215 42107 106017
15146 106017 57856 -16138 -73342 22895 37204 75639 109771 94578 29926 -46554 -93821
15135 -93821 7791 3683 -100302 -158720 -96882 12851 97068 -7669 -72703 -25508 -54745
15124 -54745 -19943 7683 5477 73012 -20767 -67875 -11309 -10214 -103042 -40421 -38107 16062
$$ packed form
15203a55730o393j2966N6585L2021o7160Q5969J47832l275j00030K6153K974J6292
15191B2272N810N5095j4064O902j2964L708L1707r6710Q2514j10932m3069J02658
15179C2927l2264j04602K0218J26949k8111o3101R2580P9106j203q2753n7992
15168a8246p0189o2867L2899J54793Q2921O5820l938j6024j22318j17552o0903
15157a35604o9466k7723J54009L2206J19908J7275j36830J9028O1412P892O3910
15146A06017m8161p3994n7204R6237J4309L8435L4132j5193o4652p6480m7267
15135i3821J01612m108j03985n8418O1838J09733Q4217j04737o5034M7195k9237
15124e4745L4802K7626k206O7535r3779m7108N6566J095r2828O2621K314N4169
$$ plain form
15112 16062 88316 23555 30762 -3285 -75079 -164668 -143816 -9856 -30845 -98890 -15768 82650
15100 82650 -3770 34828 142918 193774 189328 219225 216264 111048 -4947 -5432 44396 166360
15088 166360 54331 -71724 -146404 -213916 -163745 -69292 -9754 57453 42211 -33920 18203
15077 18203 133938 140189 182912 105089 84632 100404 123753 180421 276612 199126 143847 114897
15065 114897 63633 -60422 -55853 3317 -18998 -20505 37244 16193 44872 56004 83372 96842
15053 96842 150975 59056 -51640 -1483 -33079 -62362 -149137 -163935 -200090 -189337 -221546
15042 -221546 -259199 -59320 93279 51773 64217 67816 110906 152975 261972 241652 99236
15031 99236 -60817 -77315 -90152 -118378 -213078 -124426 -52340 -29172 11664 145756 174663
$$ packed form
15112A6062P2254o4761P207l4047p1794q9589K0852J33960k0989o8045Q3122R8418
15100H2650q6420L8598J08090N0856m446K9897k961j05216j15995m85M9828J21964
15088A66360j12029j26055p4680o7512N0171R4453N9538O7207j5242p6131N2123
15077A8203J15735O251M2723p7823k0457J5772K3349N6668R6191p7486n5279k8950
15065A14897n1264j24055M569N9170k2315j507N7749k1051K8679J1132K7368J3470
15053I6842N4133r1919j10696N0157l1596k9283q6775j4798l6155J0753l2209
15042b21546l7653J99879J52599m1506J2444L599M3090M2069J08997k0320j42416
15031I9236j60053j6498j2837k8226r4700Q8652P2086K3168M0836J34092K8907
$$ plain form
15020 174663 90172 40066 57217 188666 209908 64404 -10695 18156 119732 106489 106722
15009 106722 155491 168378 137924 162651 148569 268510 319260 259349 222134 58538 -92468
14998 -92468 -214731 -168235 11033 57074 21191 16395 31065 -39566 -57099 120 -12688
14987 -12688 -71156 -141402 -117542 38622 6869 -44143 -155143 -126056 -20689 17877 -73066
14976 -73066 -123016 -118271 -23455 -59932 -679 46024 -41271 -40307 11228 144138 95518 25354
14964 25354 72448 87366 54646 23851 -22096 -22753 87985 156456 181251 257879 233557 140398
14952 140398 118982 149680 186395 140948 173458 -739 -22695 49759 27508 -112631 -108943
14941 -108943 -76114 -34420 20585 8684 45366 113951 114472 160930 66978 12240 67852 67929
$$ packed form
15020A74663q4491n0106J7151J31449K1242j45504p5099K8851J01576j3243K33
15009A06722M8769J2887l0454K4727j4082J19941N0750n9911l7215j63596j51006
14998i2468j22263M6496J79268M6041l5883m796J4670p0631j7533N7219j2808
14987a2688n8468p0246K3860J56164l1753n1012j11000K9087J05367L8566r0943
14976g3066m9950M745R4816l6477N9253M6703q7295R64N1535J32910m8620p0164
14964B5354M7094J4918l2720l0795m5947o57J10738O8471K4795P6628k4322r3159
14952A40398k1416L0698L6715m5447L2510j74197k1956P2454k2251j40139L688
14941a08943L2829M1694N5005j1901L6682O8585N21M6458r3952n4738N5612P7
$$ plain form
14929 67929 57167 154090 101465 -6110 -100269 7282 22501 36120 -3013 -52763 -21733
14918 -21733 78814 149327 165770 71093 77803 20612 15291 -62101 -161246 -93617 -10139 -22612
14906 -22612 -33307 -91689 -43159 -1251 -53908 -132276 -32813 115637 245397 167363 94139
14895 94139 36234 18000 3105 -112620 -99211 -100940 -101493 -49597 -21228 11963 70613 -27252
14883 -27252 -105163 -46636 -12862 -143 -22875 -4260 27800 -34068 -64515 -59753 -29780 -35644
14871 -35644 7600 76147 91581 109107 223149 387392 326475 167900 136124 72776 195842
14860 195842 297757 255712 69463 -30856 -9448 103144 203296 163525 128540 27873
14850 27873 82393 103386 113450 42456 36808 -81557 -131689 -86943 -107278 -53939 -43003 -103716
$$ packed form
14929F7929j0762R6923n2625j07575r4159J07551J5219J3619l9133m9750L1030
14918b1733J00547P0513J6443r4677O710n7191n321p7392r9145O7629Q3478j2473
14906b2612j0695n8382M8530M1908n2657p8368R9463J48450J29760p8034p3224
14895I4139n7905j8234j4895j15725J3409j729n53N1896K8369L3191N8650r7865
14883b7252p7911N8527L3774J2719k2732J8615L2060o1868l0447M762K9973n864
14871c5644M3244O8547J5434J7526J14042J64243o0917j58575l1776o3348J23066
14860A95842J01915m2045j86249j00319K1408J12592J00152l9771l4985j00667
14850B7873N4520K0993J0064p0994n648j18365n0132M4746k0335N3339J0936o0713
$$ plain form
14838 -103716 -102627 -225705 -265535 -205537 -116441 -53811 -86063 -190722 -105631 -46227 94097
14827 94097 99330 27579 -26204 -69730 -112054 -223396 -222373 -202761 -86949 23541 48747
14816 48747 1141 -16478 74543 182215 218205 139108 205533 289899 233762 194270 149829
14805 149829 92929 181387 175374 41859 66670 90558 36161 56589 118259 137507 18794
14794 18794 -66885 -47217 4603 74667 29379 62199 127945 139295 107770 -24152 -145388
14783 -145388 -115914 -77947 -97192 -115303 -90584 -144354 -82963 28452 16737 -63389 9333
14772 9333 95173 95643 17608 -125748 -209259 -281444 -330938 -203511 -81475 828 42656 26015
14760 26015 56371 -9988 -20975 33798 29410 -100263 -156855 -200480 -212999 -50447 -23133
$$ packed form
14838a03716J089j23078l9830N9998Q9096O2630l2252j04659Q5091N9404J40324
14827I4097N233p1751n3783m3526m2324j11342J023J9612J15812J10490K5206
14816D8747m7606j7619R1021J07672L5990p9097O6425Q4366n6137l9492m4441
14805A49829n6900Q8458o013j33515K4811K3888n4397K0428O1670J9248j18713
14794A8794q5679J9668N1820P0064m5288L2820O5746J1350l1525j31922j21236
14783a45388K9474L7967j9245j8111K4719n3770O1391J11415j1715q0126P2722
14772I333Q5840M70p8035j43356q3511p2185m9494J27427J22036Q2303M1828j6641
14760B6015L0356o6359j0987N4773m388j29673n6592m3625j2519J62552K7314
$$ plain form
14749 -23133 -189531 -72893 -44180 -77000 -75438 -57214 -48061 -26051 4180 -25891 -78594 -137289
14737 -137289 -206218 -231207 -148966 11107 -37892 -109468 7435 52868 -1688 -9061 36207
14726 36207 144442 178176 59627 -71876 -149280 -41503 -68469 -163020 -110570 92829 170794
14715 170794 5291 -18882 100580 91946 59648 57442 39152 -82057 -115536 -43861 -8247
14704 -8247 -28734 -141013 -199743 -125451 -185406 -219501 -111219 -48454 26359 92816 6556
14693 6556 50634 121300 52604 79446 102472 77566 102522 106702 107087 -7358 -85787 -54742
14681 -54742 19243 91128 71408 1972 -34038 -9380 100355 137535 97970 27208 -81115
14670 -81115 -36358 -8108 5533 179507 239559 90750 64198 83956 25603 -111295 -98710
$$ packed form
14749b3133j66398J16638K8713l2820J562J8224R153K2010L0231l0071n2703n8695
14737a37289o8929k4989Q2241J60073m8999p1576J16903M5433n4556p373M5268
14726C6207J08235L3734j18549j31503p7404J07777k6966r4551N2450K03399P7965
14715A70794j65503k4173J19462q634l2298k206j8290j21209l3479P1675L5614
14704h247k0487j12279n8730P4292n9955l4095J08282O2765P4813O6457q6260
14693F556M4078P0666o8696K6842K3026k4906K4956M180L85j14445p8429L1045
14681e4742P3985P1885j9720o9436l6010K4658J09735L7180l9565p0762j08323
14670h1115M4757K8250J3641J73974O0052j48809k6552J9758n8353j36898J2585
$$ plain form
14659 -98710 -131027 -42149 -4558 23534 21770 -45384 -12283 49284 9358 31778 -86160 -96879
14647 -96879 -116538 -158302 -125304 -55625 -39453 127511 179667 121783 79847 45581 76909
14636 76909 163447 238579 204845 139851 87664 82178 125033 -5227 -116714 -68472 -13209
14625 -13209 -44179 -108424 -167552 -11245 32392 52194 96650 135694 211465 249035 120868
14614 120868 89430 57385 -42634 48625 196995 250984 213245 40094 20610 -54023 -48939
14603 -48939 -436 26146 -12169 -49801 -114365 -216174 -150615 -92088 93028 129872 104088
14592 104088 -46293 87189 156929 7752 -160619 -176013 -100918 -65159 -52943 -123008 -149527
14581 -149527 -38497 19690 -32679 -10148 59716 -13054 -129092 -65972 22947 104808 53785
$$ packed form
14659i8710l2317Q8878L7591K8092j764o7154L3101O1567l9926K2420j17938j0719
14647i6879j9659m1764L2998O9679J6172J66964N2156n7884m1936l4266L1328
14636G6909Q6538P5132l3734o4994n2187n486M2855j30260j11487M8242N5263
14625a3209l0970o4245n9128J56307M3637J9802M4456L9044P5771L7570j28167
14614A20868l1438l2045j00019R1259J48370N3989l7739j73151j9484p4633N084
14603d8939M8503K6582l8315l7632o4564j01809O5559N8527J85116L6844k5784
14592A04088j50381J33482O9740j49177j68371j5394P5095L5759J2216p0065k6519
14581a49527J11030N8187n2369K2531O9864p2770j16038O3120Q8919Q1861n1023
$$ plain form
14570 53785 -61802 1435 78371 106005 221749 108301 7491 25658 -2423 38129 110544
14559 110544 110585 -46771 -99175 -82100 -92702 -112745 -69381 -25284 -113178 -137416 -84592 25387
14547 25387 92985 98664 48059 54634 32251 20184 -51840 -66367 49910 -12049 -73278 -48791
14535 -48791 -77390 -100398 -41682 -26709 -161423 -158654 -137908 -84261 -131402 -166421 -205445 -238900
14523 -238900 -185779 -61195 -1548 12017 -33096 -124264 -133737 -106048 -50429 -65765 1006
14512 1006 -60253 -154799 -131327 -151092 -55327 15201 59961 50075 129524 126081 216206 171212
14500 171212 38571 73688 160267 133549 3479 -39116 -258 29417 67780 106720 154014
14489 154014 168466 114805 73935 2965 2411 83750 101686 -1213 -58104 46369 81934
$$ packed form
14570E3785j15587O3237P6936K7634J15744j13448j00810J8167k8081M0552P2415
14559A10544M1j57356n2404J7075j0602k0043M3364M4097q7894k4238N2824J09979
14547B5387O7598N679n0605O575k2383j2067p2024j4527J16277o1959o1229K4487
14535d8791k8599k3008N8716J4973j34714K769K0746N3647m7141l5019l9024l3455
14523b38900N3121J24584N9647J3565m5113r1168r473K7689N5619j5336O6771
14512A006o1259r4546K3472j9765R5765P0528M4760r886P9449l443R0125m4994
14500A71212j32641L5117Q6579k6718j30070m2595L8858K9675L8363L8940M7294
14489A54014J4452n3661m0870p0970n54Q1339J7936j02899n6891J04473L5565
$$ plain form
14478 81934 87007 22904 -107390 -84851 -86630 -186416 -252037 -220710 -99124 -12450 23373 -30721
14466 -30721 -8593 68977 118338 174964 159120 166174 200352 45430 -85321 -45428 21225
14455 21225 -7919 39064 48259 77568 147047 227832 221505 20092 -169931 -204492 -154491 -14604
14443 -14604 -10257 -7024 -41616 -97712 -83739 4737 109211 133691 238715 266587 158995
14432 158995 96829 -19045 208 -32905 -186944 -59830 -10343 -170258 -197312 -135377 -136352
14421 -136352 -193051 -80970 -11687 -55753 -78067 -90370 -115057 -86474 -86397 4209 29078 45734
14409 45734 35127 -38339 -95118 -39759 10282 3379 -39681 -74021 -54557 -33593 -44553 -167992
14397 -167992 -105149 43319 102618 116652 25067 -86722 -119730 -83555 -3703 -8031 9879
$$ packed form
14478H1934N073o4103j30294K2539j779r9786o5621L1327J21586Q6674L5823n4094
14466c0721K2128P7570M9361N6626j5844P054L4178j54922j30751L9893O6653
14455B1225k9144M6983R195K9309O9479Q0785o327k01413j90023l4561N0001J39887
14443a4604M347L233l4592n6096J3973Q8476J04474K4480J05024K7872j07592
14432A58995o2166j15874J9253l3113j54039J27114M9487j59915k7054O1935r75
14421a36352n6699J12081O9283m4066k2314j2303k4687K8583P7R0606K4869J6656
14409D5734j0607p3466n6779N5359N0041o903m3060l4340J9464K0964j0960j23439
14397a67992O2843J48468N9299J4034r1585j11789l3008L6175P9852m328J7910
$$ plain form
14386 9879 -34657 -114454 -186049 -150098 -108682 -88528 -45804 -77381 -11134 38608 -5311 43416
14374 43416 70723 91956 185806 53304 3612 66259 74796 116425 61281 -84586 -38190
14363 -38190 29913 117251 112438 -31149 -29254 56491 155088 123781 117417 77684 -22384 27876
14351 27876 20357 -19178 -68209 -116375 -75825 -31904 -85294 -105198 -158734 -162064 -54412 18022
14339 18022 67800 -48282 -136874 -143769 -109247 -8755 43489 -28053 -77832 46111 -17910
14328 -17910 -56609 -103441 -67144 55220 183891 141116 -51595 -108550 -51127 -96818 -177207
14317 -177207 -135873 19204 161255 178292 145747 -24917 -162402 -185129 -192346 -205688 -108989
14306 -108989 -125132 -120867 -94842 -83470 -82389 -107399 -11158 38057 115647 161837 174123 317176
$$ packed form
14386I879m4536p9797p1595L5951M1416K0154M2724l1577O6247M9742m3919M8727
14374D3416K7307K1233R3850j32502m9692O2647Q537M1629n5144j45867M6396
14363c8190O8103Q7338m813j43587J895Q5745R8597l1307o364l9733j00068N0260
14351B7876p519l9535m9031m8166M0550M3921n3390j9904n3536l330J07652P2434
14339A8022M9778j16082q8592o895L4522J00492N2244p1542m9779J23943o4021
14328a7910l8699m6832L6297J22364J28671m2775j92711n6955N7423m5691q0389
14317a77207M1334J55077J42051J7037l2545j70664j37485k2727p217j3342R6699
14306a08989j6143M265K6025J1372J081k5010R6241M9215P7590M6190J2286J43053
$$ plain form
14294 317176 255594 210610 253692 228859 51254 -97165 -94870 -6745 20394 20853 -11581 -44304
14282 -44304 9617 89167 106441 235947 163993 15264 89015 217446 231082 132699 29382
14271 29382 31465 -60101 -17193 144759 187966 142191 112432 6351 -136974 -75968 128008
14260 128008 106602 49800 46738 90775 60219 121772 198471 118946 12416 -21632 -15333 -120741
14248 -120741 -31397 6716 -72141 -177500 -136554 -103702 -73900 24483 22465 22656 92300 188167
14236 188167 95497 99242 95570 -37152 -80172 -108782 -187626 -173868 -83026 48165 138747
14225 138747 132462 8242 -177875 -146812 -22679 68090 21558 82653 181521 141832 203764
14214 203764 245762 217816 203341 156719 133883 213745 139244 162834 220603 150742 87630
$$ packed form
14294C17176o1582m4984M3082k4833j77605j48419K295Q8125K7139M59l2434l2723
14282d4304N3921P9550J7274J29506p1954j48729P3751J28431J3636r8383j03317
14271B9382K083r1566M2908J61952M3207m5775k9759j06081j43325O1006K03976
14260A28008k1406n6802l062M4037l0556O1553P6699p9525j06530l4048O299j05408
14248a20741Q9344L8113p8857j05359M0946L2852K9802R8383k018J91O9644R5867
14236A88167r2670L745l672j32722m3020k8610p8844J3758R0842J31191R0582
14225A38747o285j24220j86117L1063J24133R0769m6532O1095R8868l9689O1932
14214B03764M1998k7946j4475m6622k2836P9862p4501K3590N7769o9861o3112
$$ plain form
14203 87630 -7400 -12324 73491 -29118 -101740 -34197 55820 106480 102997 63451 71874 123639
14191 123639 137906 25105 28404 17701 -39026 -40821 18083 -49949 -61492 85915 107810
14180 107810 93520 41145 95722 153365 120031 126339 150347 135261 12979 -19757 -9433
14169 -9433 -54352 -69940 -143611 -130493 -167362 11899 172620 51545 90610 121351 36264
14158 36264 -16885 -39587 23587 105608 26633 118296 105935 39920 70792 115005 48689 93529
14146 93529 63825 -50147 4163 33517 -118260 -231635 -139317 -127963 -160700 -312620 -313064
14135 -313064 -305431 -239253 -3675 2709 -124179 -27047 33352 -45239 -7071 -46590 -79846
14124 -79846 -161045 16537 102028 157864 81641 99079 126250 -19905 -141877 -47769 -4983
$$ packed form
14203H7630r5030m924Q5815j02609p2622O7543R0017N0660l483l9546Q423N1765
14191A23639J4267j12801L299j0703n6727j795N8904o8032j1543J47407K1895
14180A07810j4290n2375N4577N7643l3334O308K4008j5086j22282l2736J0324
14169i433m4919j5588p3671J3118l6869J79261J60721j21075L9065L0741q5087
14158C6264n3149k2702O3174Q2021p8975R1663j2361o6015L0872M4213o6316M4840
14146I3529k9704j13972N4310K9354j51777j13375R2318J1354l2737j51920m44
14135c13064P633O6178K35578O384j26888R7132O0399p8591L8168l9519l3256
14124g9846q1199J77582Q5491N5836p6223J7438K7171j46155j21972R4108M2786
$$ plain form
14113 -4983 -88108 -113789 -79886 -218669 -208969 -10589 -111315 -62655 123001 108582 103379
14102 103379 84720 -15273 -25093 114259 79175 45834 55536 -21409 -116263 -106374 -93083 -201465
14090 -201465 -181675 -129847 -84950 -29398 -116925 -144047 -113765 -106489 -109101 -143267 -76925 62310
14078 62310 -27207 -52628 -93446 -163144 -203258 -184007 -159988 -15837 34827 -23221 -108175
14067 -108175 -38537 96619 237398 121651 10 -56313 -49710 73253 -18016 -89228 -149376
14056 -149376 -81712 -49779 -53122 -111942 -70165 36404 10715 -63000 -76331 -20432 -15772 21660
14044 21660 7936 41195 2926 -115389 -193907 -142204 -214199 -168811 -129664 -192446 -329103
14033 -329103 -272965 -126931 -157181 -97832 -45386 -30994 -163196 -153350 -49331 17823 -29904
$$ packed form
14113d983q3125k5681L3903j38783R700J98380j00726M8660J85656j4419n203
14102A03379j8659r9993r820J39352l5084l3341R702p6945r4854R889J3291j08382
14090b01465J9790N1828M4897N5552q7527k7122L0282P276k612l4166O6342J39235
14078F2310q9517k5421m0818o9698m0114J9251K4019J44151N0664n8048q4954
14067a08175O9638J35156J40779j15747j21641n6323O603J22963r1269p1212o0148
14056a49376O7664L1933l343n8820M1777J06569k5689p3715j3331N5899M660L7432
14044B1660j3724L3259l8269j18315p8518N1703p1995M5388L9147o2782j36657
14033c29103N6138J46034l0250N9349N2446J4392j32202R846J04019O7154m7727
$$ plain form
14022 -29904 -47863 -28943 2783 -19822 -106260 -95338 -51860 -99483 -62934 -52556 49551
14011 49551 66988 111879 -3187 -38586 -2749 -33488 -43443 46345 146494 84585 20488
14000 20488 18726 -86689 -30747 66985 91297 22919 123570 57474 51032 15348 -60406 -44522
13988 -44522 -92803 -144480 -77994 85604 183539 154490 304906 281318 220165 86649 73822
13977 73822 80217 86016 41411 85166 78787 114931 177269 111207 24669 84354 23966 5968
13965 5968 134562 180372 132869 125342 40235 108836 14022 52179 18986 -59873 -208884 -120334
13953 -120334 -22942 60522 104483 35867 30199 18388 73641 174217 146447 136097 226531
13942 226531 245521 148112 106742 49063 43633 40029 -48428 -53697 -50175 14656 56570 64226
$$ packed form
14022b9904j7959J8920L1726k2605q6438J0922M3478m7623L6549J0378J02107
14011D9551J7437M4891j15066l5399L5837l0739r955Q9788J00149o1909o4097
14000B0488j762j05415N5942R7732K4312o8378J00651o6096o442l5684p5754J5884
13988d4522m8281n1677O6486J63598R7935k9049J50416k3588o1153j33516j2827
13977G3822O395N799m4605M3755o379L6144O2338o6062q6538N9685o0388j7998
13965E968J28594M5810m7503p527q5107O8601r4814L8157l3193p8859j49011Q8550
13953a20334R7392Q3464M3961o8616n668j1811N5253J00576k7770j0350R0434
13942B26531J8990r7409m1370n7679n430l604q8457n269L522O4831M1914P656
$$ plain form
13930 64226 34052 23493 56261 -81779 -85932 15152 81205 137337 117951 45131 -99381
13919 -99381 -283963 -176584 -93699 -16662 67131 117908 220555 193125 201914 195595 148119
13908 148119 94121 28586 135136 161086 240846 224049 171519 256781 254932 187271 154337
13897 154337 74095 126245 166354 133009 108427 44070 115154 243695 300138 310480 213488
13886 213488 144533 188475 307634 462598 504880 519569 517432 577051 553882 582883 736372
13875 736372 788997 840239 937138 1000545 1146545 1243412 1302175 1433785 1577538 1854527 2223680
13864 2223680 2616096 3110157 3828317 4764297 5981247 7556884 9379362 11159186 12495830
13855 12495830 13247123 13610663 13763506 14085313 14958150 16661454 19080141 21457012 22979952
$$ packed form
13930F4226l0174j0559L2768j38040m153J01084O6053N6132j9386p2820j44512
13919i9381j84582J07379Q2885P7037Q3793N0777J02647k7430Q789o319m7476
13908A48119n3998o5535J06550K5950P9760j6797n2530Q5262j849o7661l2934
13897A54337q0242N2150M0109l3345k4582o4357P1084J28541N6443J0342r6992
13886B13488o8955M3942J19159J54964M2282J4689k137N9619k3169K9001J53489
13875G36372N2625N1242R6899O3407J46000R6867N8763J31610J43753K76989L69153
13864B223680L92416M94061P18160R35980J216950J575637J822478J779824J336644
13855A2495830P51293L63540J52843L21807Q72837J703304K418687K376871J522940
$$ plain form
13846 22979952 23342392 22465306 20771094 18905273 17456068 16572488 16484093 16888906 17322694
13837 17322694 17673366 17633333 17453625 17345512 17336287 17480328 17436949 17227429 16832611 16618743
13827 16618743 16899743 17776236 19311069 21232926 23039805 23960839 23493188 21895234 19712290
13818 19712290 17674997 16081557 15171426 14714097 14672766 14474757 13615717 12275924 10586444
13809 10586444 8673750 7057236 5780666 4797124 4151060 3624574 3087698 2652677 2493284
13800 2493284 2318657 2141571 2048334 1898260 1764262 1655423 1622323 1540152 1491848 1450553
13790 1450553 1484532 1568367 1692747 1810961 1899061 1950762 2003763 2186798 2516584 2992563
13780 2992563 3473757 3995776 4778676 5914074 7371085 9291942 11330722 13176428 14347646
$$ packed form
13846B2979952L62440q77086j694212j865821j449205q83580q8395M04813M33788
13837A7322694L50672m0033j79708j08113r225J44041m3379k09520l94818k13868
13827A6618743K81000Q76493J534833J921857J806879R21034m67651j597954k182944
13818A9712290k037293j593440r10131m57329m1331j98009q59040j339793j689480
13809A0586444j912694j616514j276570r83542o46064n26486n36876m35021j59393
13800B493284j74627j77086r3237j50074j33998j08839l3100q2171m8304m1295
13790A450553L3979Q3835J24380J18214Q8100N1701N3001J83035L29786M75979
13780B992563M81194N22019P82900J135398J457011J920857K038780J845706J171218
$$ plain form
13771 14347646 15025032 15281475 15592824 16360452 17686446 19599937 21969086 24285459 25514185
13762 25514185 25296717 23896409 21890608 19959716 18664135 18137535 18272199 18692670 19123970
13753 19123970 19251795 19177037 18971594 18907259 19091424 19391342 19288764 18845903 18504493 18374470
13743 18374470 18807809 20057625 22052317 24211628 25766021 26067107 24960458 22971661
13735 22971661 20557654 18388459 17026061 16189595 15743302 15572395 15149260 13977193 12212907
13726 12212907 10229540 8407412 6874387 5567363 4523758 3861992 3328783 2756302
13718 2756302 2270368 2018953 2006396 1896596 1600527 1296328 1164740 1229862 1272591 1153178
13708 1153178 914974 707098 584002 604661 645870 615531 512569 425569 362128 377532
$$ packed form
13771A4347646O77386K56443L11349P67628J325994J913491K369149K316373J228726
13762B5514185k17468j400308k005801j930892j295581n26600J34664M20471M31300
13753A9123970J27825p4758k05443o4335J84165K99918j02578m42861l41410j30023
13743A8374470M33339J249816J994692K159311J554393L01086j106649j988797
13735B2971661k414007k169195j362398q36466m46293j70907m23135j172067j764286
13726A2212907j983367j822128j533025j307024j043605o61766n33209n72481
13718B756302m85934k51415j2557j09800k96069l04199j31588O5122M2729j19413
13708A153178k38204k07876j23096K0659M1209l0339j02962q7000o3441J5404
$$ plain form
13698 377532 299883 430175 444790 505672 622823 761256 795271 801106 682072 567095 512646
13687 512646 389338 280518 183385 224079 373496 365255 394637 348640 278472 159638 111728
13676 111728 187319 285411 284396 243695 232813 291105 331206 316011 327861 364544 289633 278047
13664 278047 262181 244044 317567 404131 375729 289505 228944 311145 338386 321523 169078
13653 169078 84253 119269 116349 97256 75694 69210 92172 91215 43807 108704 290268 319956
13641 319956 254662 174648 153637 158367 159428 244960 266306 219257 175656 105362 110296 150803
13629 150803 173082 165438 180440 146457 251767 250481 197388 213567 220119 78912 22095 24056
13617 24056 13447 94082 138851 92938 11973 -13896 23212 72716 94175 167451 195124 178694
$$ packed form
13698C77532p7649J30292J4615O0882J17151J38433L4015N835j19034j14977n4449
13687E12646j23308j08820r7133M0694J49417q241K9382m5997p0168j18834m7910
13676A11728P5591R8092j015m0701j0882N8292M0101j5195J1850L6683p4911j1586
13664B78047j5866j8137P3523Q6564k8402q6224o0561Q2201K7241j6863j52445
13653A69078q4825L5016k920j9093k1562o484K2962r57m7408O4897J81564K9688
13641C19956o5294q0014k1011M730J061Q5532K1346m7049m3601p0294M934M0507
13629A50803K2279p644J5002l3983J05310j286n3093J6179O552j41207n6817J961
13617B4056j0609Q0635M4769m5913q0965k5869L7108M9504K1459P3276K7673j6430
$$ plain form
13605 178694 240992 127442 -46761 -82027 97098 172286 233207 290773 219235 106994 87296
13594 87296 199961 270810 285800 176690 117480 96438 116265 110352 73013 43161 44382 28463
13582 28463 23580 195 10495 134998 130578 32567 6635 78836 154369 210348 221202 233257
13570 233257 105801 -1904 18089 56566 12212 -107527 -183269 -269386 -96855 -7955 106487
13559 106487 192266 171156 85702 124566 85393 71481 17357 -8116 -80399 -66375 -39905
13548 -39905 -116929 -162222 -197721 -98820 -47830 -32889 43125 140539 135043 99609 21180 71373
13536 71373 140073 185864 38912 -135182 -159749 -89577 -54683 41235 133218 131584 86294
13525 86294 32363 -81961 -46929 63496 31813 -61231 -161799 -181570 -104943 -85640 42726
$$ packed form
13605A78694O2298j13550j74203l5266J79125P5188O0921N7566p1538j12241j9698
13594H7296J12665P0849J4990j09110n9210k1042J9827n913l7339k9852J221j5919
13582B8463m883k3385J0300J24503m420r8011k5932P2201P5533N5979J0854J2055
13570B33257j27456j07705J9993L8477m4354j19739p5742q6117J72531Q8900J14442
13559A06487Q5779k1110q5454L8864l9173j3912n4124k5473p2283J4024K6470
13548c9905p7024m5293l5499R8901N0990J4941P6014R7414n496l5434p8429N0193
13536G1373O8700M5791j46952j74094k4567P0172L4894R5918R1983j634m5290
13525H6294n3931j14324L5032J10425l1683r3044j00568j9771P6627J9303J28366
$$ plain form
13514 42726 -16585 -118039 -139436 -145645 -155770 -97589 -75481 38373 77538 92061 -41907
13503 -41907 -96687 -31635 6443 51960 52705 -42623 -237990 -147264 -68693 58411 51143 67808
13491 67808 32715 31497 -5058 -81461 -44503 22764 57612 62515 47388 -50240 -135006 -28528
13479 -28528 133352 203787 198389 138596 33500 107206 186856 220884 182057 143980 165153
13468 165153 197943 212433 148199 99040 37741 -31442 -73611 -39021 -36622 -131099 -176691 -51305
13456 -51305 48861 59077 6878 88488 81431 88175 86915 71518 68928 59253 72476 61556
13444 61556 80415 42039 53266 82464 162771 84341 56730 89585 124756 175361 85084 135311
13432 135311 164503 120787 150864 227889 225795 199906 229496 172827 45436 -59395 45060
$$ packed form
13514D2726n9311j01454k1397o209j0125N8181K2108J13854L9165J4523j33968
13503d1907n4780O5052L8078M5517P45r5328j95367R0726P8571J27104p268J6665
13491F7808l5093j218l6555p6403L6958O7267L4848M903j5127r7628q4766J06478
13479b8528J61880P0435n398n9793j05096P3706P9650L4028l8827l8077K1173
13468A65153L2790J4490o4234m9159o1299o9183m2169L4590K399r4477m5592J25386
13456e1305J00166J0216n2199Q1610p057O744j260j5397k590r675J3223j0920
13444F1556J8859l8376J1227K9198Q0307p8430k7611L2855L5171N0605r0277N0227
13432A35311K9192m3716L0077P7025k094k5889K9590n6669j27391j04831J04455
$$ plain form
13421 45060 49970 4813 57790 72480 166443 216500 213026 172460 233019 163660 127852 108803
13409 108803 189421 351323 295528 203465 178001 164147 155848 175077 259578 324431 364861
13398 364861 340419 451778 569895 438105 288269 131885 147819 224627 158901 70618
13388 70618 40349 103983 51346 121940 228906 205859 273417 264742 269818 158794 78541 182420
13376 182420 187510 242339 319040 234657 294037 386210 365551 412783 368897 373202 353895 342249
13364 342249 297234 252739 234244 175649 221198 247191 215798 249439 208895 202525 81535
13353 81535 26438 85964 144636 122077 113443 147362 136054 109673 124550 143415 228661 193969
13341 193969 87039 99192 120090 55797 -22031 -4706 -29017 -61481 -90937 -61517 -107759
$$ packed form
13421D5060M910m5157N2977J4690R3963N0057l474m0566O0559o9359l5808j9049
13409A08803Q0618J61902n5795r2063k5464j3854q299J9229Q4501O4853M0430
13398C64861k4442J11359J18117j31790j49836j56384J5934P6808o5726q8283
13388G0618l0269O3634n2637P0594J06966k3047O7558q675N076j11024q0253J03879
13376A82420N090N4829P6701q4383N9380R2173k0659M7232m3886M305j9307j1646
13364C42249m5015m4495j8495n8595M5549K5993l1393L3641m0544o370j20990
13353H1535n5097N9526N8672k2559q634L3919j1308k6381J4877J8865Q5246l4692
13341A93969j06930J2153K0898o4293p7828J7325k4311l2464k9456K9420m6242
$$ plain form
13330 -107759 -229472 -178922 -65988 -142798 -100363 -2675 53803 53137 78601 174176 196640
13319 196640 185662 123089 147700 123491 122979 173951 216211 178965 202076 180222 199960 159766
13307 159766 161216 95722 92364 61067 90556 157678 306332 520506 367236 317195 244584
13296 244584 266664 285281 216673 243255 178332 118585 266092 311582 135588 43167 106356
13285 106356 19422 5695 24544 -18722 9939 40373 73974 161725 252409 318049 250284
13274 250284 200239 133273 123917 173871 245435 134009 28473 112747 240066 299563 181451
13263 181451 129581 85540 124371 85048 89980 62536 165632 133131 3374 -128789 -94131
13252 -94131 -97522 -3 100184 110578 53707 9020 58993 -30653 40188 143347 111397
$$ packed form
13330a07759j21713N0550J12934p6810M2435R7688N6478o66K5464R5575K2464
13319A96640j0978o2573K4611k4209n12N0972M2260l7246K3111k1854J9738m0194
13307A59766J450o5494l358l1297K9489O7122J48654K14174j53270n0041p2611
13296B44584K2080J8617o8608K6582o4923n9747J47507M5490j75994r2421O3189
13285A06356q6934j3727J8849m3266K8661L0434L3601Q7751R0684O5640o7765
13274B50284n0045o6966r356M9954P1564j11426j05536Q4274J27319N9497j18112
13263A81451n1870m4041L8831l9323M932k7444J03096l2501j29757j32163L4658
13252i4131l391R7519J00187J0394n6871m4687M9973q9646P0841J03159l1950
$$ plain form
13241 111397 -38238 -61884 -62176 -97225 -78897 25586 144754 131479 114118 59879 -58166
13230 -58166 -29785 40722 166658 125550 123261 218005 250658 382958 434618 329452 310113
13219 310113 282482 174993 153869 127752 112576 53823 -30631 -83095 -12404 57927 52774
13208 52774 46821 -30908 -55764 -7376 45755 -39759 -107747 -133973 -79398 -9463 -10142 -65684
13196 -65684 -107728 -207952 -159725 -140894 -133572 -79523 -118698 25939 150731 80744 32468
13185 32468 145987 173862 107509 240313 465633 526880 625081 682813 485365 141577 98116
13174 98116 69264 -22688 -156423 -156608 -142631 -44339 140012 223075 132414 44216 -83999
13163 -83999 8317 156195 150382 96972 -6910 6893 78663 119222 40522 -31887 5037
$$ packed form
13241A11397j49635k3646k92l5049J8328J04483J19168j3275j7361n4239j18045
13230e8166K8381P0507J25936m1108k289R4744L2653J32300N1660j05166j9339
13219C10113k7631j07489k1124k6117j5176n8753q4454n2464P0691P0331n153
13208E2774n953p7729k4856M8388N3131q5514o7988k6226N4575O9935o79n5542
13196f5684m2044j00224M8227J8831P322N4049l9175J44637J24792o9987m8276
13185C2468J13519K7875o6353J32804K25320O1247R8201N7732j97448l43788m3461
13174I8116k8852r1952j33735j85J3977R8292J84351Q3063r0661q8198j28215
13163h3999R2316J47878n813n3410j03882J3803P1770M0559p8700p2409L6924
$$ plain form
13152 5037 83660 33108 98012 21530 -27011 -29439 54777 167071 177640 169133 191398 222997
13140 222997 159555 98253 87168 150481 320032 365654 242296 192596 172073 128949 60363
13129 60363 62868 126512 222703 96210 118709 108126 178498 196747 239959 261179 278965 357525
13117 357525 472415 505924 491932 407885 347741 332775 158532 189326 312476 332619 349021
13106 349021 256220 236023 249691 241202 255654 277600 325891 256608 281089 423941 485862
13095 485862 599496 647995 622018 693618 794263 876121 956044 1052654 1173913 1170622 1327286
13084 1327286 1495062 1598977 1698866 1914205 2442543 3091421 3862496 4704832 5519333 6390609
13074 6390609 7157250 7579801 7956653 8443784 9071559 9755565 10244680 10651776 10815801
$$ packed form
13152E037P8623n0552O4904p6482m8541k428Q4216J12294J0569q507K2265L1599
13140B22997o3442o1302j1085O3313J69551M5622j23358m9700k0523m3124o8586
13129F0363K505O3644R6191j26493K2499j0583P0372J8249M3212K1220J7786P8560
13117C57525J14890L3509j3992q4047o0144j4966j74243L0794J23150K0143J6402
13106C49021r2801k0197J3668q489J4452K1946M8291o9283K4481J42852O1921
13095D85862J13634M8499k5977P1600J00645Q1858P9923R6610J21259l291J56664
13084A327286J67776J03915R9889K15339N28338O48878P71075Q42336Q14501Q71276
13074F390609P66641M22551L76852M87131O27775O84006M89115M07096J64025
$$ plain form
13065 10815801 10761625 10593922 10328003 10101390 9701138 9492233 9311443 9108562 8860232
13056 8860232 8610656 8442721 8357063 8676165 9306186 10284171 11400009 12862849 14119165
13047 14119165 15212571 16201098 17086692 18084758 19034024 19964810 20856997 21401379 21494749
13038 21494749 21129070 20519265 19799438 18982644 18274034 17710743 16819028 15760613 14421494
13029 14421494 13030567 11579954 10435352 9528141 9122272 9059681 9071636 9248084 9438096
13020 9438096 9553637 9685675 10001520 10417337 10881641 11345067 11558656 11369537 11009397
13011 11009397 10544843 9940184 9532827 9283112 9013177 8674039 8292383 7761176 7038533
13002 7038533 6313109 5669837 5005467 4668623 4608457 4834889 5071609 5317477 5882917 6848876
$$ packed form
13065A0815801n4176j67703k65919k26613m00252k08905j80790k02881k48330
13056H860232k49576j67935q5658L19102O30021R77985J115838J462840J256316
13047A4119165J093406R88527Q85594R98066R49266R30786Q92187N44382R3370
13038B1494749l65679o09805p19827q16794p08610n63291q91715j058415j339119
13029A4421494j390927j450613j144602r07211m05869o2591J1955J76448J90012
13020I438096J15541J32038L15845M15817M64304M63426K13589j89119l60140
13011A1009397m64554o04659m07357k49715k69935l39138l81656n31207p22643
13002G038533p25424o43272o64370l36844o0166K26432K36720K45868N65440R65959
$$ plain form
12992 6848876 7797786 8581262 9245252 9685420 10154101 10729810 11335679 12001775 12567846
12983 12567846 12852953 12969981 12867965 12628963 12155403 11602861 11290841 11111364 10824752
12974 10824752 10443984 10089875 9651983 9480907 9541679 10054508 11015329 12386909 14030254
12965 14030254 15711741 17038593 18164197 19040525 19711732 20456481 21553892 22840897
12957 22840897 23916537 24493220 24540650 23841136 22719710 21517859 20457168 19573357 18734018
12948 18734018 17779994 16584354 15185668 13640257 12311299 11196782 10574518 10348030
12940 10348030 10393087 10590458 10808113 10834018 10985486 11345567 11693526 11934752 12132521 12316666
12930 12316666 12266356 11917610 11440164 10853645 10148924 9689162 9392832 8976622 8541521
$$ packed form
12992F848876R48910P83476O63990M40168M68681N75709O05869O66096N66071
12983A2567846K85107J17028j02016k39002m73560n52542l12020j79477k86612
12974A0824752l80768l54109m37892j71076O0772N12829R60821J371580J643345
12965A4030254J681487J326852J125604Q76328O71207P44749J097411J287005
12957B2840897J075640N76683M7430o99514j121426j201851j060691q83811q39339
12948A8734018r54024j195640j398686j545411j328958j114517o22264k26488
12940A0348030M5057J97371K17655K5905J51468L60081L47959K41226J97769J84145
12930A2316666n0310l48746m77446n86519p04721m59762k96330m16210m35101
$$ plain form
12921 8541521 7946111 7161711 6209697 5160602 4301748 3590879 3021858 2562645 2251787
12912 2251787 2012898 1729057 1433326 1263992 1233893 1206750 1136758 1032284 882242 782281
12902 782281 809313 818504 784824 740457 714919 632708 594292 584509 476536 389725 434631 463922
12890 463922 471299 459974 410404 305761 215038 194458 151579 77388 107752 139506 257441
12879 257441 273046 358391 389328 298659 279303 305629 273603 165594 192961 178906 80610
12868 80610 237887 313831 262957 131281 172347 316248 378476 299675 174048 175974 217153
12857 217153 208993 248058 232825 265322 241467 153836 188770 102980 -15838 -73178 32720
12846 32720 132580 98705 50543 51262 -12400 11029 14235 -60478 -28850 20219 -28596 -18665
$$ packed form
12921H541521n95410p84400r52014j049095q58854p10869n69021m59213l10858
12912B251787k38889k83841k95731j69334l0099k7143o9992j04474j50042r9961
12902G82281K7032R191l3680m4367k5538q2211l8416r783j07973q6811M4906K9291
12890D63922P377j1325m9570j04643r0723k0580m2879p4191L0364L1754J17935
12879B57441J5605Q5345L0937r0669j9356K6326l2026j08009K7367j4055r8296
12868H0610J57277P5944n0874j31676M1066J43901O2228p8801j25627J926M1179
12857B17153q160L9065j5233L2497k3855q7631L4934q5790j18818n7340J05898
12846C2720R9860l3875m8162P19o3662K3429L206p4713L1628M9069m8815R931
$$ plain form
12834 -18665 120395 173772 145234 137544 89311 82270 118664 90097 14956 42891 3501 56354
12822 56354 181831 295914 263908 281895 175072 196222 291457 266902 273996 147062 135737
12811 135737 101123 32742 90803 168371 98534 66598 5619 -45723 -10442 41952 94725
12800 94725 -19674 -134755 -169885 -59879 48085 115647 90471 146823 105378 23393 906
12789 906 57480 69866 27167 118337 82562 47201 99984 13196 -29868 -26790 -13226 30597
12777 30597 101167 141257 86503 -6499 117298 198086 193266 163048 140471 63893 21178 93052
12765 93052 138244 68495 -29611 -126454 -114323 -69013 29201 31646 76070 35299 -5549 26049
12753 26049 102871 91043 140752 247799 286216 214359 116068 71684 73032 135132 131181 99074
$$ packed form
12834a8665J39060N3377k8538p690m8233p041L6394k8567p5141K7935l9390N2853
12822E6354J25477J14083l2006J7987j06823K1150R5235k4555P094j26934j1325
12811A35737l4614o8381N8061P7568o9837l1936o0979n1342L5281N2394N2773
12800I4725j14399j15081l5130J10006J07964O7562k5176N6352m1445q1985k2487
12789I06N6574J2386m2699R1170l5775l5361N2783q6788m3064L078J3564M3823
12777C0597P0570M0090n4754r3002J23797Q0788m820l0218k2577p6578m2715P1874
12765I3052M5192o9749r8106r6843J2131M5310R8214K445M4424m0771m0848L1598
12753B6049P6822j1828M9709J07047L8417p1857r8291m4384J348O2100l951l2107
$$ plain form
12741 99074 -26778 78554 1205 11177 8746 -57293 -71097 -117901 -121937 -73257 54828 39044
12729 39044 -43282 10626 26256 10034 31061 7146 41497 109281 188554 193800 82786 45852
12717 45852 9816 -40418 -87711 -99992 -32721 -64692 -121377 -119817 -119375 -96280 -123328 -64087
12705 -64087 -19172 -67964 -52735 12886 41016 84806 86674 134695 195880 123706 103144 87549
12693 87549 47069 -69968 -141332 -212505 -180575 -70755 5166 -42517 -147127 21236 36210
12682 36210 21718 -1707 -77807 12300 48736 21093 69329 74510 41340 49375 34006 155879
12670 155879 177030 167877 223663 119148 116971 74618 -63233 -546 55440 -7305 -114738
12659 -114738 -78854 51043 137885 119433 -48572 -132623 -53167 42396 63134 25971 105670
$$ packed form
12741I9074j25852J05332p7349R972k431o6039j3804m6804m036M8680J28085j5784
12729C9044q2326N3908J5630j6222K1027k3915L4351O7784P9273N246j11014l6934
12717D5852l6036n0234m7293j2281O7271l1971n6685J560M42K3095k7048N9241
12705f4087M4915m8792J5229O5621K8130M3790J868M8021O1185p2174k0562j5595
12693H7549m0480j17037p1364p1173L1930J09820P5921m7683j04610J68363J4974
12682C6210j4492k3425p6100R0107L6436k7643M8236N181l3170Q035j5369J21873
12670A55879K1151r153N5786j04515k177m2353j37851O2687N5986o2745j07433
12659a14738L5884J29897Q6842j8452j68005q4051P9456R5563K0738l7163P9699
$$ plain form
12648 105670 114288 97153 41522 17323 27608 102961 107709 -11411 -153766 -130068 -183115
12637 -183115 -226240 -159166 -73240 -93938 -72761 -83742 -96266 -118950 21603 52925 114396
12626 114396 134620 149187 117272 173576 146363 16715 -17987 -30981 53110 52722 96086 67352
12614 67352 154792 235562 164682 166576 137128 112192 97904 70022 79906 99805 -75867 -68435
12602 -68435 -31078 29594 -42633 -83968 -5785 74417 80006 -8587 -60605 71439 112181 43994
12590 43994 -9859 20736 149810 175229 204767 239340 186357 -5566 -95669 -167609 -112629
12579 -112629 -40717 97808 266672 138849 172175 152574 86721 99535 108121 192929 118513
12568 118513 73145 14736 -81528 -51545 12736 -75069 -67665 33562 131545 70349 9247
$$ packed form
12648A05670Q618j7135n5631k4199J0285P5353M748j19120j42355K3698n3047
12637a83115m3125O7074Q5926k0698K1177j0981j2524k2684J40553L1322O1471
12626A14396K0224J4567l1915N6304k7213j29648l4702j2994Q4091l88M3364k8734
12614F7352Q7440Q0770p0880J894k9448k4936j4288k7882R884J9899j75672P432
12602f8435L7357O0672p2227m1335P8183Q0202N589q8593n2018J32044M0742o8187
12590D3994n3853L0595J29074K5419K9538L4573n2983j91923r0103p1940N4980
12579a12629P1912J38525J68864j27823L3326j9601o5853J2814Q586Q4808p4416
12568A18513m5368n8409r6264K9983O4281q7805P404J01227R7983o1196o1102
$$ plain form
12557 9247 -58120 -99642 -4147 -19576 3980 24621 70483 51893 96316 215839 262300 317048
12545 317048 326104 276802 143540 64618 -64865 -149234 -175094 -136836 -122509 -159950 -125811
12534 -125811 -130122 -107278 -83229 -131081 -76324 -4925 30408 4263 -9532 -136160 -153135
12523 -153135 -107550 50425 233590 309259 265694 183936 255503 402942 281427 116017
12513 116017 72007 62551 73337 88871 96392 181399 292157 303503 151381 17973 76015
12502 76015 -10431 -53691 9489 34585 -3603 -12354 48951 122795 146744 106948 168749 274516
12490 274516 311457 357251 319034 280804 261189 361905 298620 187416 -92164 -205734 -118734
12479 -118734 8923 53794 71866 98096 -25094 -134088 -263137 -204584 -73658 -79297 -86543
$$ packed form
12557I247o7367m1522R5495j5429K3556K0641M5862j8590M4423J19523M6461N4748
12545C17048R056m9302j33262p8922j29483q4369k5860L8258J4327l7441L4139
12534a25811m311K2844K4049m7852N4757P1399L5333k6145j3795j26628j6975
12523a53135M5585J57975J83165P5669m3565q1758P1567J47439j21515j65410
12513A16017m4010r456J0786J5534P521Q5007J10758J1346j52122j33408N8042
12502G6015q6446m3260O3180K5096l8188q751O1305P3844K3949l9796O1801J05767
12490B74516L6941M5794l8217l8230j9615J00716o3285j11204k79580j13570Q7000
12479a18734J27657M4871J8072K6230j23190j08994j29049N8553J30926n639p246
$$ plain form
12468 -86543 -60249 -15598 -1701 92682 180105 97895 59520 68612 103877 76305 67055 75386
12456 75386 105673 77074 113088 168780 114154 102991 42849 32102 83388 37042 -62141 -55040
12444 -55040 38259 8379 -6892 5477 21340 81335 162813 79389 -14374 105739 267698
12433 267698 250628 139521 36322 36567 55625 105286 102561 -42407 18323 186572 156770
12422 156770 163789 85502 -62411 26502 113185 23410 -19931 54922 662 -137252 -126977
12411 -126977 -89899 36357 72182 -57232 -61966 42010 121722 52957 30942 27931 -44759
12400 -44759 88121 114761 119071 109482 44046 -7525 -79639 -115084 -73580 -67997 -92981 -56965
12388 -56965 -58804 -13621 45950 -12545 -76683 -63941 -103068 -145909 -171433 -100779 19942 192803
$$ packed form
12468h6543K6294M4651J3897R4383Q7423q2210l8375R092L5265k7572r250Q331
12456G5386L0287k8599L6014N5692n4626j1163o0142j0747N1286m6346r9183P101
12444e5040R3299k9880j5271J2369J5863N9995Q1478q3424r3763J20113J61959
12433B67698j7070j11107j03199K45J9058M9661k725j44968O0730J68249k9802
12422A56770P019p8287j47913Q8913Q6683q9775m3341P4853n4260j37914J0275
12411a26977L7078J26256L5825j29414m734J03976P9712o8765k2015l011p2690
12400d4759J32880K6640M310r589o5436n1571p2114l5445M1504N583k4984L6016
12388e6965j839M5183N9571n8495o4138J2742l9127m2841k5524P0654J20721J72861
$$ plain form
12376 192803 161286 232978 279099 111964 39422 72801 8076 94404 100329 207143 152942
12365 152942 164624 146298 47934 -9258 -12358 -98510 5746 101979 187316 138459 32713
12354 32713 -77854 -93966 -28519 -96935 -179204 -155695 -47300 -50636 -41337 29 -7803 -79032
12342 -79032 -97867 -115888 8228 115322 24387 -32434 -58470 -29220 6073 -38560 -183116
12331 -183116 -192702 -61865 14447 -21620 11404 79996 96368 113025 -2970 -43744 -42506
12320 -42506 -59759 -134258 -166016 -73699 -98431 -164859 -217290 -155057 -6207 -24282 8320
12309 8320 180245 289150 293011 233557 187383 180536 172986 177421 211939 177728 192003 127090
12297 127090 44707 80066 -74177 -154333 -90755 5841 25796 -7749 5055 37606 56266
$$ packed form
12376A92803l1517P1692M6121j67135p2542L3379o4725Q6328N925J06814n4201
12365A52942J1682j8326r8364n7192l100q6152J04256R6233Q5337m8857j05746
12354C2713j10567j6112O5447o8416q2269K3509J08395l336R299M1366p832p1229
12342g9032j8835j8021J24116J07094r0935n6821k6036K9250L5293m4633j44556
12331a83116r586J30837P6312l6067L3024O8592J6372J6657j15995m0774J238
12320d2506j7253p4499l1758R2317k4732o6428n2431O2233J48850j8075L2602
12309H320J71925J08905L861n9454m6174o847p550M435L4518l4211J4275o4913
12297A27090q2383L5359j54243q0156O3578R6596J9955l3545J2804L2551J8660
$$ plain form
12286 56266 -29809 -105429 -115323 -6426 50259 -67351 -104558 -10115 83803 30853 -73244
12275 -73244 -39216 26909 -40979 -101345 -184858 -188241 -60122 -51440 -198654 -241312 -166948 -155594
12263 -155594 -173223 -157122 -64532 81334 57188 9747 55686 -44617 -26453 46742 -24264
12252 -24264 -40946 -115176 -49654 -10713 93872 52357 -51367 -46940 -62699 -133580 -69843
12241 -69843 104400 267168 284285 116661 30530 19489 -784 6485 -50230 -3119 -64821
12230 -64821 -79089 -55310 -55857 -109409 -160058 -169877 -48952 19013 20288 -26341 -6451 -25553
12218 -25553 -29449 -88160 -2436 116755 46943 -81791 -96303 -31313 -40973 -14010 -27878 -3642
12206 -3642 49960 -3841 -69327 -134068 -129878 -49872 -88282 -64340 -22726 -6436 -120096 -81469
$$ packed form
12286E6266q6075p5620r894J08897N6685j17610l7207R4443R3918n2950j04097
12275g3244L4028O6125o7888o0366q3513l383J28119Q682j47214m2658P4364J1354
12263a55594j7629J6101R2590J45866k4146m7441M5939j00303J8164P3195p1006
12252b4264j6682p4230O5522L8941J04585m1515j03724M427j5759p0881O3737
12241f9843J74243J62768J7117j67624q6131j1041k0273P269n6715M7111o1702
12230f4821j4268K3779n47n3552n0649r819J20925O7965J275m6629J9890j9102
12218b5553l896n8711Q5724J19191o9812j28734j4512O4990r660K6963j3868K4236
12206c642N3602n3801o5486o4741M190Q0006l8410K3942M1614J6290j13660L8627
$$ plain form
12194 -81469 105308 107535 48770 198575 151130 102477 26870 -96816 -75166 69632 128521
12183 128521 126699 165255 180311 208421 150622 282993 391881 328341 225072 253617 290783
12172 290783 283403 157791 149452 243191 312824 388798 399571 318931 197569 205617 137971 216967
12160 216967 297646 336041 327519 372675 242993 151332 56555 155222 146955 144406 136753 158196
12148 158196 212191 196800 133981 80462 129672 61423 -7906 -40201 5429 73550 7537
12137 7537 -87580 15401 212782 118193 -67173 -129193 -112796 -109376 -70359 20758 117929
12126 117929 171663 147904 48433 7905 128063 206011 204993 175963 280471 302180 189708
12115 189708 168076 180505 230894 425161 441034 526554 611312 539666 338748 332511 301920
$$ packed form
12194h1469J86777K227n8765J49805m7445m8653p5607j23686K1650J44798N8889
12183A28521j822L8556J5056K8110n7799J32371J08888o3540j03269K8545L7166
12172B90783p380j25612q339R3739O9633P5974J0773q0640j21362Q048o7646P8996
12160B16967Q0679L8395q522M5156j29682r1661r4777R8667q267k549p653K1443
12148A58196N3995j5391o2819n3519M9210o8249o9329l2295M5630O8121o6013
12137G537r5117J02981J97381r4589j85366o2020J6397L420L9017R1117R7171
12126A17929N3734k3759r9471m0528J20158P7948j018k9030J04508K1709j12472
12115A89708k1632J2429N0389J94267J5873Q5520Q4758p1646k00918o237l0591
$$ plain form
12104 301920 392267 539075 450097 355316 571771 633881 616666 650298 739420 988109 1011541
12093 1011541 1064518 1371599 1539919 1755286 2084588 2532531 2993356 3554421 4244570 5227541
12083 5227541 6631562 8249700 10522637 13920611 19075750 26247073 34339422 41336673
12075 41336673 44651665 43139283 37721721 30518281 23405236 17338517 13001146 10116233
12067 10116233 8199543 6771952 5640048 4896684 4135292 3521458 2801604 2382969 2179440
12058 2179440 2096030 1921812 1762434 1615532 1436655 1239659 1136663 1066762 1053824 964835
12048 964835 917291 1012443 989258 952843 939361 1015471 967373 757901 871888 1054425 1214268
12037 1214268 1344408 1314473 1300863 1345376 1464307 1725630 1975379 2338512 2638429 2922754
$$ packed form
12104C01920R0347J46808q8978r4781K16455O2110j7215L3632Q9122K48689K3432
12093A011541N2977L07081J68320K15367L29302M47943M60825N61065O90149R82971
12083E227541J404021J618138K272937L397974N155139P171323Q092349O997251
12075D1336673L314992j512382n417562p203440p113045o066719m337371k884913
12067A0116233j916690j427591j131904p43364p61392o13834p19854m18635k03529
12058B179440q3410j74218j59378j46902j78877j96996j02996o9901j2938q8989
12048I64835m7544R5152k3185l6415j3482P6110m8098k09472J13987J82537J59843
12037A214268J30140k9935j3610M4513J18931K61323K49749L63133K99917K84325
$$ plain form
12027 2922754 3256771 3873102 4542677 5455608 6658024 8069231 10033558 12790665 16785790
12018 16785790 22702935 30732257 40083447 48211322 52467481 51394535 45651970 37408031
12010 37408031 28981424 22099451 17087029 13655441 11365716 9851767 8937809 8244826
12002 8244826 7828753 7849237 8263420 9084661 10474268 12654333 16052052 21115795 27625420
11993 27625420 34510054 39365473 40492566 37564314 31933482 25386787 19343924 14622007
11985 14622007 11198342 8890559 7266920 5978251 5122591 4428055 3794213 3225711 2838026
11976 2838026 2514676 2108319 1902734 1794821 1729136 1648791 1536604 1497900 1463049 1465676
11966 1465676 1436985 1349834 1173114 986955 914956 907015 994962 1041664 1060233 1092005 1088911
$$ packed form
12027B922754L34017O16331O69575R12931J202416J411207J964327K757107L995125
12018A6785790N917145Q029322R351190Q127875M256159j072946n742565q243939
12010C7408031q426607o881973n012422l431588k289725j513949r13958o92983
12002H244826m16073K0484M14183Q21241J389607K180065L397719N063743O509625
11993B7625420O884634M855419J127093k928252n630832o546695o042863m721917
11985A4622007l423665k307783j623639j288669q55660o94536o33842n68502l87685
11976B838026l23350m06357k05585j07913o5685q0345j12187l8704l4851K627
11966A465676k8691q7151j76720j86159p1999p941Q7947M6702J8569L1772l094
$$ plain form
11955 1088911 1181506 1210072 1325164 1303123 1301167 1315050 1520059 1695060 1883800 2103629
11945 2103629 2413294 2744146 3136018 3751625 4512170 5384012 6390463 7782025 9787662
11936 9787662 12828826 17292372 23520545 31829187 40640847 47325220 49526358 46552077
11928 46552077 39724809 31327328 23568152 17515688 13191021 10215342 8206260 6923488
11920 6923488 6023352 4978370 4070465 3472610 3046344 2614445 2270923 1942650 1742400
11911 1742400 1627026 1481122 1234604 1129592 1005146 906072 782963 703823 654543 579679
11901 579679 522420 573433 620543 608707 558335 571907 514785 486514 516193 507344 511347 514342
11889 514342 481320 366331 322341 329826 308105 287199 323246 338905 353503 447051 476691
$$ packed form
11955A088911R2595K8566J15092k2041j956J3883K05009J75001J88740K19829
11945B103629L09665L30852L91872O15607P60545Q71842J006451J391562K005637
11936I787662L041164M463546O228173Q308642Q811660O684373K201138k974281
11928D6552077o827268q397481p759176o052464m324667k975679k009082j282772
11920F923488r00136j044982r07905n97855m26266m31899l43522l28273k00250
11911A742400j15374j45904k46518j05012j24446r9074j23109p9140m9280p4864
11901E79679n7259N1013M7110j1836n0372J3572n7122k8271K9679q849M003K995
11889E14342l3022j14989m3990P485k1721k0906L6047J5659J4598R3548K9640
$$ plain form
11878 476691 410657 277449 283199 262407 224960 246265 179452 104292 157756 197578 185734
11867 185734 112903 126051 157954 65463 201506 288282 261319 206532 226234 259605 176509
11856 176509 213392 173943 198907 281797 423862 381067 404681 303686 269258 353246 373089
11845 373089 338558 339081 396414 378408 430782 433374 437839 375109 314171 320240 273869 306087
11833 306087 294466 233481 161133 164132 73020 37156 123345 208680 158921 174852 199973 226039
11821 226039 268231 273911 249424 190414 204347 197149 288352 298022 99746 108021 189243 125247
11809 125247 35153 -15197 63173 204581 233653 220851 242165 291292 301181 360927 330686
11798 330686 202079 182765 187855 199532 134860 101341 68986 137486 209692 320510 421114
$$ packed form
11878D76691o6034j33208N750k0792l7447K1305o6813p5160N3464L9822j1844
11867A85734p2831J3148L1903r2491J36043Q6776k6963n4787J9702L3371q3096
11856A76509L6883l9449K4964Q2890J42065m2795K3614j00995l4428Q3988J9843
11845C73089l4531N23N7333j8006N2374K592M465o2730o0938O069m6371L2218
11833C06087j1621o0985p2348K999r1112l5864Q6189Q5335m9759J5931K5121K6066
11821B26039M2192N680k4487n9010J3933p198R1203R670j98276Q275Q1222o3996
11809A25247r0094n0350P8370J41408K9072j2802K1314M9127R889N9746l0241
11798C30686j28607j9314N090J1677o4672l3519l2355O8500P2206J10818J00604
$$ plain form
11787 421114 470339 441062 341004 309507 364740 433161 523924 486203 461550 538256 673771
11776 673771 788809 736094 707129 774788 797159 880039 991277 1105867 1213070 1350306
11766 1350306 1427845 1512963 1812942 2215298 2700046 3209872 3856617 4662953 5671455 7017745
11756 7017745 8693122 10882733 13436165 15982868 17971199 19072604 18836284 17561746
11748 17561746 15529089 13218265 11125677 9351019 8134506 7432970 6888806 6594609
11740 6594609 6533532 6607880 7031196 7926934 9118195 10905586 13317213 16125401 18738827
11731 18738827 20609371 21222063 20199387 17886139 15147967 12277376 9801600 7891015
11723 7891015 6419473 5277865 4546762 3985467 3539717 3119862 2766411 2635055 2397750
$$ packed form
11787D21114M9225k9277j00058l1497N5233O8421R0763l7721k4653P6706J35515
11776F73771J15038n2715k8965O7659K2371Q2880J11238J14590J07203J37236
11766A350306P7539Q5118K99979M02356M84748N09826O46745Q06336J008502J346290
11756G017745J675377K189611K553432K546703J988331J101405k36320j274538
11748A7561746k032657k310824k092588j774658j216513p01536n44164k94197
11740F594609o1077P4348M23316Q95738J191261J787391K411627K808188K613426
11731A8738827J870544O12692j022676k313248k738172k870591k475776j910585
11723G891015j471542j141608p31103n61295m45750m19855l53451j31356k37305
$$ plain form
11714 2397750 2111313 1976765 1861011 1819420 1797926 1658487 1608798 1659421 1712820 1698861
11704 1698861 1662554 1624003 1700506 1810656 1964383 2135334 2326643 2642065 3070935 3562316
11694 3562316 4112953 4857448 5857675 6947552 8409723 10401311 12837144 15687813
11686 15687813 18413188 20321245 21026523 20376723 18823280 16934366 15025684 13449223
11678 13449223 12411991 11955040 11819833 12036013 12688832 14032369 16188510 19101107 22627877
11669 22627877 26373916 29744596 32405219 34071517 34401097 33248555 30870061 27492406
11661 27492406 23793464 20289595 17115251 14681905 12899766 11713787 11064335 10816154
11653 10816154 11004068 11819716 13195249 15023022 17087687 18917852 19703664 19347249 17848680
$$ packed form
11714B397750k86437j34548j15754m1591k1494j39439m9689N0623N3399j3959
11704A698861l6307l8551P6503J10150J53727J70951J91309L15422M28870M91381
11694C562316N50637P44495J000227J089877J462171J991588K435833K850669
11686A5687813K725375J908057P05278o49800j553443j888914j908682j576461
11678A3449223j037232m56951j35207K16180O52819J343537K156141K912597L526770
11669B2627877L746039L370680K660623J666298L29580j152542k378494l377655
11661B7492406l698942l503869l174344k433346j782139j185979o49452k48181
11653A0816154J87914Q15648J375533J827773K064665J830165P85812l56415j498569
$$ plain form
11644 17848680 15551395 13207133 11023495 8883282 7254659 6043372 5092486 4283860
11636 4283860 3715585 3339822 3024256 2649839 2482732 2323179 2183547 2143141 2019599 1955915
11626 1955915 1905153 1830424 1675455 1662773 1705332 1870935 1903097 1798190 1825568 2018556
11616 2018556 2129396 2089737 2130108 2320510 2546608 2893336 3313738 3911813 4746398 5735989
11606 5735989 7096965 8988985 11506978 14262023 16900754 18810018 19495939 18970263
11598 18970263 17408835 15114022 12632023 10586446 8982777 7756924 6992361 6724002
11590 6724002 6605639 6731204 7164933 7877180 8999372 10511791 12459721 14683165 16668704
11581 16668704 17854909 18078895 17244096 15515743 13295861 10984548 8893384 7176958
$$ packed form
11644A7848680k297285k344262k183638k140213j628623j211287r50886q08626
11636D283860n68275l75763l15566l74417j67107j59553j39632m0406j23542o3684
11626A955915n0762p4729j54969j2682M2559J65603L2162j04907K7378J92988
11616B018556J10840l9659M0371J90402K26098L46728M20402N98075Q34585R89591
11606E735989J360976J892020K517993K755045K638731J909264O85921n25676
11598A8970263j561428k294813k481999k045577j603669j225853p64563k68359
11590F724002j18363J25565M33729P12247J122192J512419J947930K223444J985539
11581A6668704J186205K23986q34799j728353k219882k311313k091164j716426
$$ plain form
11573 7176958 5847141 4891423 4090423 3443701 2980956 2631032 2317970 2080324 2008223
11564 2008223 1835098 1699417 1637586 1616785 1401115 1310193 1215254 1038465 885446 744634
11554 744634 769532 729925 641976 597120 511943 408660 434612 439464 443965 461503 484941 542149
11542 542149 420562 345859 340527 374585 388026 352368 228796 183498 250179 261675 274711
11531 274711 262640 276252 351286 214837 144382 147009 174260 98098 860 102938 203827
11520 203827 237173 287130 379364 264981 178830 151850 140114 117929 235529 318721 276853
11509 276853 215927 187261 150919 39977 161990 241194 294293 290300 222545 257197 329902
11498 329902 333394 431230 557032 556037 592472 598808 636410 591584 393316 296248 280040 401887
$$ packed form
11573G176958j329817r55718q01000o46722m62745l49924l13062k37646p2101
11564B008223j73125j35681o1831k0801k15670r0922r4939j76789j53019j40812
11554G44634K4898l9607q7949m4856q5177j03283K5952M852M501J7538K3438N7208
11542E42149j21587p4703n332L4058J3441l5658j23572m5298O6681J1496J3036
11531B74711j2071J3612P5034j36449p0455K627K7251p6162r7238J02078J00889
11520B03827L3346M9957R2234j14383q6151k6980j1736k2185J17600Q3192m1868
11509B76853o0926k8666l6342j10942J22013P9204N3099l993o7755L4652P2705
11498C29902L492R7836J25802r95L6435O336L7602m4826j98268r7068j6208J21847
$$ plain form
11486 401887 366490 417883 378993 247248 186923 202407 257997 231413 162092 191723 231716
11475 231716 170889 142040 215172 140754 208275 269265 208487 247051 231594 210978 160966
11464 160966 165146 251872 235352 153168 165051 280293 255547 234389 350679 377192 494032
11453 494032 668819 720401 700076 776264 870519 984605 1221577 1432580 1545978 1786479
11443 1786479 2138259 2666324 3112332 3787223 4660273 5728789 7065070 8584225 9935225
11434 9935225 10436690 10107380 9137637 7823228 6529949 5439286 4765993 4111428 3726344
11425 3726344 3413615 3384805 3384629 3505277 3800402 4050786 4435808 4838121 5364993 6233933
11415 6233933 7466543 9370687 11960590 15188770 18739477 21535644 22354362 20969980
$$ packed form
11486D01887l5397N1393l8890j31745o0325J5484N5590k6584o9321K9631L9993
11475B31716o0827k8849P3132p4418O7521O0990o0778L8564j5457k0616n0012
11464A60966M180Q6726j6520q2184J1883J15242k4746k1158J16290K6513J16840
11453D94032J74787N1582k0325P6188R4255J14086K36972K11003J13398K40501
11443A786479L51780N28065M46008O74891Q73050J068516J336281J519155J351000
11434I935225N01465l29310r69743j314409j293279j090663o73293o54565l85084
11425C726344l12729k8810j76J20648K95125K50384L85022M02313N26872Q68940
11415F233933J232610J904144K589903L228180L550707K796167Q18718j384382
$$ plain form
11407 20969980 18255468 15142366 12174701 9678918 7805442 6476705 5518459 4925651
11399 4925651 4638601 4444043 4289115 4146752 4073990 4124321 4366100 4595748 4957122 5680956
11389 5680956 6711829 8171259 10316445 12587790 14186535 14527598 13747441 12248000
11381 12248000 10658908 9421555 8992214 9206173 10090421 11704999 13950088 16578112
11373 16578112 18909815 20279969 20470508 19354961 17191832 14641320 12235452 10301656
11365 10301656 8852751 7877642 7227746 6817586 6598669 6617644 6744164 7069574 7574067
11356 7574067 8280958 9310647 10756051 12920626 15779229 19759507 24699348 29798883
11348 29798883 34170218 36945973 37345954 35384862 31595762 26897605 22294842 18251493
$$ packed form
11407B0969980k714512l113102k967665k495783j873476j328737r58246n92808
11399D925651k87050j94558j54928j42363p2762N0331K41779K29648L61374P23834
11389E680956J030873J459430K145186K271345J598745L41063p80157j499441
11381A2248000j589092j237353m29341K13959Q84248J614578K245089K628024
11373A6578112K331703J370154J90539j115547k163129k550512k405868j933796
11365A0301656j448905r75109o49896m10160k18917J8975J26520L25410N04493
11356G574067P06891J029689J445404K164575K858603L980278M939841N099535
11348B9798883M371335K775755L99981j961092l789100m698157m602763m043349
$$ plain form
11340 18251493 14863827 12336083 10503467 9133831 8228684 7582132 7114968 6941034 6921913
11331 6921913 7100051 7405943 7927420 8947992 10334264 12315940 14649088 16960162 18661137
11322 18661137 19902709 20561211 20075730 18524977 16357896 13908846 11929449 10489877
11314 10489877 9868761 10052004 10940331 12225869 13034014 12902714 11894404 10217907 8563139
11305 8563139 7238600 6234130 5332605 4755356 4427636 4159684 3996027 3926246 4010454
11296 4010454 4219092 4428201 4636795 4878225 5354216 6134034 7109453 8571056 10651928
11287 10651928 13381181 16413973 18735852 19731095 19054329 16944192 14213956 11472076
11279 11472076 9231780 7466893 6071228 5020359 4373071 3984541 3614471 3410480 3254765
$$ packed form
11340A8251493l387666k527744j832616j369636r05147o46552m67164j73934j9121
11331F921913J78138L05892N21477J020572J386272J981676K333148K311074J700975
11322A8661137J241572O58502m85481j550753k167081k449050j979397j439572
11314A0489877o21116J83243Q88327J285538Q08145j31300j008310j676497j654768
11305H563139j324539j004470r01525n77249l27720k67952j63657o9781Q4208
11296D010454K08638K09109K08594K41430M75991P79818R75419J461603K080872
11287A0651928K729253L032792K321879R95243o76766k110137k730236k741880
11279A1472076k240296j764887j395665j050869o47288l88530l70070k03991j55715
$$ plain form
11270 3254765 3136314 3115960 3313849 3595821 3785663 4060169 4624690 5541668 6823594
11261 6823594 8240954 9510015 10169527 9933300 8929314 7523640 6091399 4825604
11253 4825604 3844983 3080099 2441542 2067009 1709113 1453823 1245069 1095239 1081862 1044855
11243 1044855 975797 933710 879948 752165 687518 653155 541247 539706 605489 660199 680830
11232 680830 637283 498684 442336 507093 621373 541500 432361 454786 416639 375340 347565
11221 347565 350753 366202 252448 277699 308777 347374 206221 163644 236972 307008 398004
11210 398004 348333 291036 296677 329567 320417 141258 -45896 47010 151179 89890 -4228
11199 -4228 129051 206136 190709 225616 142402 2394 222622 365625 391303 471615 531296
$$ packed form
11270C254765j18451k0354J97889K81972J89842K74506N64521R16978J281926
11261F823594J417360J269061O59512k36227j003986j405674j432241j265795
11253D825604r80621p64884o38557l74533l57896k55290k08754j49830j3377l7007
11243A044855o9058m2087n3762j27783o4647l4363j11908j541O5783N4710K0631
11232F80830m3547j38599n6348O4757J14280p9873j09139K2425l8147m1299k7775
11221C47565L188J5449j13754K5251L1078L8597j41153m2577P3328P0036R0996
11210C98004m9671n7297N641L2890r150j79159j87154R2906J04169o1289r4118
11199d228J33279P7085j5427L4907q3214j40008K20228J43003K5678Q0312N9681
$$ plain form
11188 531296 432771 308233 177109 78466 54722 156802 139651 91437 162618 195589 116933
11177 116933 101258 130929 232299 278602 294486 309537 207420 81089 93705 123457 78284
11166 78284 170364 228546 154455 214043 209677 163346 81688 3330 57166 144447 149706 128335
11154 128335 87558 128559 136431 196021 156813 -20039 34974 171652 202746 240350 220806
11143 220806 197998 163699 157244 111120 86752 85079 185439 188491 166605 103518 141494 125498
11131 125498 98987 64758 58212 -39616 -171289 -72894 -73619 -26735 -22534 -45122 55913 66867
11119 66867 49199 6890 -20496 -4282 24070 65434 27974 105959 111968 129251 97765 33952
11107 33952 152140 177237 157098 5417 -79908 -11076 18368 98879 235360 208883 154897
$$ packed form
11188E31296r8525j24538j31124r8643k3744J02080j7151m8214P1181L2971p8656
11177A16933j5675K9671J01370M6303J5884J5051j02117j26331J2616K9752m5173
11166G8284R2080N8182p4091N9588m366m6331q1658p8358N3836Q7281N259k1371
11154A28335m0777M1001P872N9590l9208j76852N5013J36678L1094L7604j9544
11143B20806k2808l4299o455m6124k4368j673J00360L052k1886o3087L7976j5996
11131A25498k6511l4229o546r7828j31673R8395p25M6884M201k2588J01035J0954
11119F6867j7668m2309k7386J6214K8352M1364l7460P7985O009J7283l1486o3813
11107C3952J18188K5097k0139j51681q5325O8832K9444Q0511J36481k6477n3986
$$ plain form
11096 154897 289884 272253 170112 191531 175696 56815 139628 200475 175721 150140 142418
11085 142418 79617 28451 2511 2779 72064 125108 191799 92946 35029 148851 79494 -73107
11073 -73107 -34250 -32009 5123 -84737 -107904 -102767 -124946 -126203 -70057 -71547 -124027 -174621
11061 -174621 -163177 -127557 -127429 -120957 -155137 -176701 -30332 -28364 -94142 -103140 -20255 -12422
11049 -12422 45097 56402 16417 61989 127026 102611 64833 128669 233019 396554 362794
11038 362794 200009 112006 157609 113204 39374 134742 180557 160933 126457 63136 42065
11027 42065 71380 88786 92267 -24096 -27500 -23171 5444 95015 -31978 -57202 125296 190682
11015 190682 90771 -24482 -21764 -42068 -83679 76749 310154 287783 127707 146641 76936
$$ packed form
11096A54897J34987j7631j02141K1419j5835j18881Q2813O0847k4754k5581p722
11085A42418o2801n1166k5940K68O9285N3044O6691r8853n7917J13822o9357j52601
11073g3107L8857K241L7132q9860k3167N137k2179j257N6146j490n2480n0594
11061a74621J1444L5620J28O472l4180k1564J46369J968o5778q998Q2885P833
11049a2422N7519J1305l9985M5572O5037k4415l7778O3836J04350J63535l3760
11038C62794j62785q8003M5603m4405p3830R5368M5815j9624l4476o3321k1071
11027D2065K9315J7406L481j16363l404M329K8615Q9571j26993k5224J82498O5386
11015A90682r9911j15253K718k0304m1611J60428K33405k2371j60076J8934o9705
$$ plain form
11004 76936 -2847 -12860 15082 60293 16910 62992 114179 142324 205559 230360 246360 207446
10992 207446 121763 137981 108784 121785 195380 188587 194870 103106 -2508 44547 -1251 -51505
10980 -51505 48090 79814 36402 16747 1905 66973 31827 -102380 -86762 -67977 11991
10969 11991 57864 165710 163562 132989 105712 138553 75669 -67895 -174770 -167534 -107218
10958 -107218 -7483 109326 145134 37537 42853 31722 50680 -8682 -31092 40948 20006
10947 20006 22645 90305 61227 -31688 -31631 -30918 -66325 80207 187645 221085 242018 119366
10935 119366 -43134 -36767 -59749 -118348 37243 282873 322900 314926 258310 192457 189469
10924 189469 68979 -174573 -174434 -9474 129588 20339 -59506 -68901 -196916 -192960 -72079
$$ packed form
11004G6936p9783j0013K7942M5211m3383M6082N1187K8145O3235K4801J6000l8914
10992B07446q5683J6218k9197J3001P3595o793O283r1764j05614M7055m5798n0254
10980e1505R9595L1724m3412j9655j4842O5068l5146j34207J5618J8785P9968
10969A1991M5873J07846k148l0573k7277L2841o2884j43564j06875P236O0316
10958a07218R9735J16809L5808j07597N316j1131J8958n9362k2410P2040k0942
10947B0006K639O7660k9078r2915N7P13l5407J46532J07438L3440K0933j22652
10935A19366j62500O367k2982n8599J55591K45630M0027p974n6616o5853k988
10924A89469j20490k43552J39J64960J39062j09249p9845r395j28015L956J20881
$$ plain form
10913 -72079 35905 39411 -8226 58873 16525 -14562 -14297 -74780 69131 68904 37135 -118989
10901 -118989 -151197 -96863 -62784 70290 215234 174531 204172 86965 65960 39190 19349
10890 19349 53857 125858 25026 31946 22843 38975 114603 119353 163620 92967 79888 96833
10878 96833 61505 -36315 15254 -54232 -45248 81717 101848 119980 138031 101664 -91452
10867 -91452 -66499 -37028 -80559 -52925 -116075 -82738 -40540 -35601 -107067 -183677 -96424 93733
10855 93733 148453 137059 186692 176059 106469 -9447 14513 86869 123903 73112 72168 116604
10843 116604 167932 234382 139674 52594 -19035 -14808 -46565 127661 180704 69384 -7214
10832 -7214 -38889 -149349 -223230 -168231 -166759 -138335 -45900 -76592 -99714 68587 232337
$$ packed form
10913g2079J07984L506m7637O7099m2348l1087K65o0483J43911k27l1769j56124
10901a18989l2208N4334L4079J33074J44944m0703K9641j17207k1005k6770j9841
10890A9349L4508P2001j00832O920r103J6132P5628M750M4267p0653j3079J6945
10878I6833l5328r7820N1569o9486Q984J26965K0131J8132J8051l6367j93116
10867i1452K4953K9471m3531K7634o3150L3337M2198M939p1466p6610Q7253J90157
10855I3733N4720j1394M9633j0633o9590j15916K3960P2356L7034n0791r44M4436
10843A16604N1328O6450r4708q7080p1629M227l1757J74226N3043j11320p6598
10832g214l1675j10460p3881N4999J472K8424R2435l0692k3122J68301J63750
$$ plain form
10821 232337 186531 9940 1393 173361 109799 5812 -162767 -193606 -78851 -60993 -65307
10810 -65307 -124154 -147652 -38234 -3670 97661 24732 1002 62873 101360 64173 159034
10799 159034 228554 207364 288975 461350 666300 879695 1215263 1523728 1935439 2266425
10789 2266425 2488095 2502638 2485556 2428094 2169998 1763257 1456449 1224998 948017 755157
10779 755157 663151 473324 359983 327209 290575 227808 249471 292305 287544 224266 184065
10768 184065 180341 205710 193022 204010 237655 300971 215224 140794 132353 222275 158727 102927
10756 102927 47513 7754 30431 72944 117748 285590 396941 289586 118658 63631 5119
10745 5119 -16531 54211 121825 96297 45604 -4455 46927 102139 177761 189425 136802 140334
$$ packed form
10821B32337m5806j76591q547J71968o3562j03987j68579l0839J14755J7858m314
10810f5307n8847k3498J09418L4564J01331p2929k3730O1871L8487l7187R4861
10799A59034O9520k1190Q1611J72375K04950K13395L35568L08465M11711L30986
10789B266425K21670J4543j7082n7462k58096m06741l06808k31451k76981j92860
10779G55157r2006j89827j13341l2774l6634o2767K1663M2834m761o3278m0201
10768A84065l724K5369j2688J0988L3645O3316q5747p4430q441Q9922o3548n5800
10756A02927n5414l9759K2677M2513M4804J67842J11351j07355j70928n5027n8512
10745E119k1650P0742O7614k5528n0693n0059N1382N5212P5622J1664n2623L532
$$ plain form
10733 140334 159018 233699 247702 152048 137837 162139 147316 126592 103438 64131 -16011
10722 -16011 -74844 -84683 -118103 -6804 127145 127352 101575 99184 131655 156601 61532 85672
10710 85672 177107 123816 94140 149752 186770 120792 201131 183632 117024 106219 88525 97530
10698 97530 136451 199674 186611 228114 225952 148059 129382 151819 173270 87095 51630 4313
10686 4313 -6017 66755 75894 44641 11330 72857 160593 177732 230783 168708 126156 142948
10674 142948 176166 208601 209887 124028 95820 123484 46155 70682 174084 148455 -4337
10663 -4337 101441 216568 153723 207530 185766 19444 -49137 -68426 -14578 -9903 -91696
10652 -91696 -59579 147266 269945 248366 202720 65202 128798 173093 178518 130511 238041
$$ packed form
10733A40334J8684P4681J4003r5654j4211K4302j4823k0724k3154l9307q0142
10722a6011n8833r839l3420J11299J33949K07k5777k391L2471K4946r5069K4140
10710H5672R1435n3291k9676N5612L7018o5978Q0339j7499o6608j0805j7694R005
10698I7530L8921O3223j3063M1503k162p7893j8677K2437K1451q6175l5465m7317
10686D313j0330P2772R139l1253l3311O1527Q7736J7139N3051o2075m2552J6792
10674A42948L3218L2435J286q5859k8208K7664p7329K4527J03402k5629j52792
10663d337J05778J15127o2845N3807k1764j66322o8581j9289N3848M675q1793
10652i1696L2117K06845J22679k1579m5646j37518O3596M4295N425m8007J07530
$$ plain form
10641 238041 281650 288424 335939 273385 275818 367503 248045 86015 86752 123899 150811 55970
10629 55970 32946 126410 189351 190227 159682 104091 57106 16660 -39984 -87745 -123264 -111717
10617 -111717 -145774 -84121 43750 205666 236095 245891 347939 254938 56566 11704 -56557
10606 -56557 -43166 328 11970 88654 95460 285308 434278 383176 366512 342513 416265
10595 416265 414390 293795 258329 302960 454921 502991 469945 403736 409015 355935 166906
10584 166906 10426 80245 181380 223207 150605 120442 111077 112565 20422 -127994 -57347
10573 -57347 58336 6726 12049 49813 -56783 -216985 -283834 -188282 -151894 -181587 -132857
10562 -132857 -100584 -34490 -120001 -164747 56954 -12461 -75392 -144195 -181292 -126713 3173
$$ packed form
10641B38041M3609O774M7515o2554K433R1685j19458j62030P37L7147K6912r4841
10629E5970k3024R3464O2941Q76l0545n5591m6985m0446n6644m7761l5519J1547
10617a11717l4057O1653J27871J61916L0429R796J02048r3001j98372m4862o8261
10606e6557J3391M3494J1642P6684O806J89848J48970n1102j6664k3999P3752
10595D16265j875j20595l5466M4631J51961M8070l3046o6209N279n3080j89029
10584A66906j56480O9819J01135M1827p2602l0163r365J488r2143j48416P0647
10573e7347J15683n1610N323L7764j06596j60202o6849R5552L6388k9693M8730
10562a32857L2273O6094q5511m4746K21701o9415o2931o8803l7097N4579J29886
$$ plain form
10551 3173 -46191 -128539 -11809 -14382 10216 106578 81150 155251 220969 285595 422268 527400
10539 527400 447356 397399 201755 88815 3244 15732 70699 -22686 55935 128351 191634
10528 191634 77887 -8562 41889 20390 -85166 -190901 -164453 -78832 -21542 11200 13399
10517 13399 -83723 -50559 -53210 -77839 -60232 -52902 108558 117181 85370 166615 102576 32174
10505 32174 -740 54459 184959 281551 292995 272493 308166 313505 389471 380669 399851 339700
10493 339700 169012 181430 260986 265474 279804 303264 324676 238175 258014 213351 302852
10482 302852 325183 196863 107884 70261 152418 174595 148748 108026 200854 293455 296574
10471 296574 194221 159940 152537 121200 150516 173369 159038 208612 216711 188361 243442 230551
$$ packed form
10551C173m9364q2348J16730k573K4598R6362k5428P4101O5718O4626J36673J05132
10539E27400q0044m9957j95644j12940q5571J2488N4967r3385P8621P2416O3283
10528A91634j13747q6449N0451k1499j05556j05735K6448Q5621N7290L2742K199
10517A3399r7122L3164k651k4629J7607P330J61460Q623l1811Q1245o4039p0402
10505C2174l2914N5199J30500R6592J1444k0502L5673N339P5966q802J9182o0151
10493C39700j70688J2418P9556M488J4330K3460K1412q6501J9839m4663Q9501
10482C02852K2331j28320q8979l7623Q2157K2177k5847m0722R2828R2601L119
10471B96574j02353l4281p403l1337K9316K2853j4331M9574Q099k8350N5081j2891
$$ plain form
10459 230551 240761 288040 412935 418700 336947 194774 184527 324523 431368 381079 348251
10448 348251 353685 379968 374825 478809 630647 674798 600962 654572 771271 853905 857520
10437 857520 830102 940070 1020411 956967 1050169 1176693 1194416 1209105 1319784 1393700 1526431
10426 1526431 1671048 1846631 1926383 2098590 2212046 2403889 2598869 2812273 3096401 3535489
10416 3535489 3951011 4352998 4948431 5672626 6422519 7156546 8148681 9437496 10702318
10407 10702318 11982593 13325811 14919573 16912231 19204546 22084911 25671592 30229338
10399 30229338 36619500 45486637 58288382 76869780 105459854 150791589 215199877
10392 215199877 277888799 324787832 378568510 440469824 474474695 461387249 431857624
$$ packed form
10459B30551J0210M7279J24895N765q1753j42173j0247J39996J06845n0289l2828
10448C48251N434K6283n143J03984J51838M4151p3836N3610J16699Q2634L615
10437H57520k7418J09968Q0341o3444R3202J26524J7723J4689J10679P3916J32731
10426A526431J44617J75583P9752J72207J13456J91843J94980K13404K84128M39088
10416C535489M15522M01987N95433P24195P49893P34027R92135J288815J264822
10407A0702318J280275J343218J593762J992658K292315K880365L586681M557746
10399C0229338O390162Q867137J2801745J8581398K8590074M5331735O4408288
10392B15199877O2688922M6899033N3780678O1901314L4004871j3087446k9529625
$$ plain form
10385 431857624 396974093 347113272 282567746 221742003 166226112 120410770 89076904
10378 89076904 68948613 55595075 46254508 39430889 34171255 29841942 26429619 23637435
10370 23637435 21170825 19123495 17439716 16004181 14563139 13324967 12223510 11201766
10362 11201766 10232959 9325829 8619485 8061869 7616255 7248475 6935220 6732379 6553307
10353 6553307 6330970 6097954 5655222 5306770 4832781 4438983 4168519 3888709 3775949
10344 3775949 3859774 3950619 3940577 3773475 3627145 3417375 3123159 2924999 2734933 2546092
10334 2546092 2433774 2350208 2221308 2087570 1864467 1759730 1765710 1780793 1823741 1942136
10324 1942136 2122500 2207662 2246188 2362395 2373946 2304070 2260861 2440598 2683793 2898839
$$ packed form
10385D31857624l4883531m9860821o4545526o0825743n5515891m5815342l1333866
10378H9076904k0128291j3353538r340567o823619n259634m329313l412323k792184
10370B3637435k466610k047330j683779j435535j441042j238172j101457j021744
10362A1201766r68807r07130p06344n57616m45614l67780l13255k02841j79072
10353F553307k22337k33016m42732l48452m73989l93798k70464k79810j12760
10344C775949Q3825R0845j0042j67102j46330k09770k94216j98160j90066j88841
10334B546092j12318q3566j28900j33738k23103j04737N980J5083M2948J18395
10324A942136J80364Q5162L8526J16207J1551o9876m3209J79737K43195K15046
$$ plain form
10314 2898839 3181615 3499484 3718758 4086029 4350863 4514808 4679603 4790677 4993031
10305 4993031 5155869 5387702 5487346 5583913 5596467 5411139 5408033 5539575 5599932 5450317
10295 5450317 5357452 5400387 5486418 5517386 5448736 5429864 5641638 6038750 6529555 7042716
10285 7042716 7602742 8030182 8703603 9413141 10078652 10806743 11431649 11769018 12145545
10276 12145545 12326436 12338105 12321287 12326304 12455829 12463285 12349407 12120808 11897603 11668670
10266 11668670 11568931 11450816 11143486 10766724 10493027 10279208 10043915 10027222 10288137 10633135
10256 10633135 11162124 11778302 12211157 12528526 12797831 12883464 12869953 13057793 13282363 13490078
10246 13490078 13530539 13416568 13019813 12589325 11967979 11247824 10718509 10147224 9586949
$$ packed form
10314B898839K82776L17869K19274L67271K64834J63945J64795J11074K02354
10305D993031J62838K31833R9644R6567J2554j85328l106J31542O0357j49615
10295E450317r2865M2935Q6031L0968o8650j8872K11774L97112M90805N13161
10285G042716N60026M27440O73421P09538O65511P28091O24906L37369L76527
10276A2145545J80891J1669j6818N017J29525P456j13878k28599k23205k28933
10266A1668670r9739j18115l07330l76762k73697k13819k35293j6693K60915L44998
10256A0633135N28989O16178M32855L17369K69305Q5633j3511J87840K24570K07715
10246A3490078M0461j13971l96755m30488o21346p20155n29315n71285n60275
$$ plain form
10237 9586949 9077597 8648406 8323283 8006111 7679319 7598983 7806867 8265718 8823072 9402820
10227 9402820 9870205 10278778 10626861 10968680 11456620 11970005 12271326 12570382 12656255 12593515
10217 12593515 12242703 11868668 11587763 11322639 10932711 10543501 10169756 9816113 9340970
10208 9340970 8987532 8793148 8915771 9367772 9843893 10516988 11449825 12425159 13312969
10199 13312969 14241100 15161475 16163796 17119751 17925500 18565898 18972855 19320381 19411868
10190 19411868 19247921 19127502 18872593 18409338 17891031 17152514 16328040 15566788 14708466
10181 14708466 14021334 13583637 13234215 13069374 13091464 13187120 13594064 14127436 14545809 15061082
10171 15061082 15725379 16303619 16901184 17519245 18030343 18522587 18638766 18339994 18092473
$$ packed form
10237I586949n09352m29191l25123l17172l26792q0336K07884M58851N57354N79748
10227I402820M67385M08573L48083L41819M87940N13385L01321K99056Q5873o2740
10217A2593515l50812l74035k80905k65124l89928l89210l73745l53643m75143
10208I340970l53438j94384J22623M52001M76121O73095R32837R75334Q87810
10199A3312969R28131R20375J002321R55955Q05749O40398M06957L47526R1487
10190A9411868j63947j20419k54909m63255n18307p38517q24474p61252q58322
10181A4708466o87132m37697l49422j64841K2090R5656M06944N33372M18373N15273
10171A5061082O64297N78240N97565O18061N11098M92244J16179k98772k47521
$$ plain form
10162 18092473 17793836 17350299 16953433 16642375 16111851 15470497 14576587 13336786 11941724
10153 11941724 10584580 9299907 8208040 7280912 6589665 6290096 6223527 6184209 6228516
10144 6228516 6263664 6150939 6200989 6402453 6607971 6760761 6988772 7143873 7252218 7209953
10134 7209953 7137406 7081990 6889345 6515908 6194365 5853380 5566785 5438308 5160015 4686662
10124 4686662 4172043 3605228 3151728 2752715 2277671 1973967 1692036 1496171 1371072
10115 1371072 1354370 1234383 1107339 1061572 1002532 1016941 1010033 927206 943235 957058 858406
10104 858406 787705 687054 630491 691968 779034 696022 773805 796308 802381 722441 657570
10093 657570 675635 574639 523680 639435 629382 566858 514278 525628 609098 565022 600313
$$ packed form
10162A8092473k98637m43537l96866l11058n30524o41354q93910j239801j395062
10153A1941724j357144j284673j091867r27128o91247k99569o6569l9318M4307
10144F228516L5148j12725N0050K01464K05518J52790K28011J55101J08345m2265
10134G209953p2547n5416j92645l73437l21543l40985k86595j28477k78293m73353
10124D686662n14619n66815m53500l99013m75044l03704k81931j95865j25099
10115A371072j6702j19987j27044m5767n9040J4409o908q2827J6029J3823r8652
10104H58406p0701j00651n6563O1477Q7066q3012P7783K2503O073p9940o4871
10093F57570J8065j00996n0959J15755j0053o2524n2580J1350Q3470m4076L5291
$$ plain form
10082 600313 614583 602012 632760 652366 621198 670543 596509 583848 557227 479886 325381
10071 325381 287823 342872 449682 459475 439384 268615 244786 404515 547365 611987 633625
10060 633625 641591 538867 447190 318320 208361 123253 184780 237430 350912 408901 316214
10049 316214 340438 384070 406081 274612 216426 375501 419180 369453 401618 441044 416671
10038 416671 439121 405990 313953 291930 343189 454615 388974 408184 328383 262923 346129
10027 346129 296527 239145 313546 339372 319679 374705 411074 375185 400228 358247 168812
10016 168812 280392 513386 469526 564794 504376 365932 402918 319191 253798 236179 299461
10005 299461 328338 236181 334332 421132 411161 374883 386849 368499 440750 424232 491982 662179
$$ packed form
10082F00313J4270j2571L0748J9606l1168M9345p4034j2661k6621p7341j54505
10071C25381l7558N5049J06810R793k0091j70769k3829J59729J42850O4622K1638
10060F33625P966j02724r1677j28870j09959q5108O1527N2650J13482N7989r2687
10049C16214K4224M3632K2011j31469n8186J59075M3679m9727L2165L9426k4373
10038D16671K2450l3131r2037k2023N1259J11426o5641J9210p9801o5460Q3206
10027C46129m9602n7382P4401K5826j9693N5026L6369l5889K5043m1981j89435
10016A68812J11580K32994m3860R5268o0418j38444L6986q3727o5393j7619O3282
10005B99461K8877r2157R8151Q6800r971l6278J1966j8350P2251j6518O7750J70197
$$ plain form
9993 662179 727101 739250 826198 886107 866855 1079729 1470415 1764918 1858958 2204636 2605190
9982 2605190 2788498 2735085 2512484 2279454 2068709 1770957 1365593 1147919 903420 631967
9972 631967 521559 557882 416952 370927 393192 476345 516324 318425 151884 265383 423633
9961 423633 494019 395742 300564 256743 252897 199286 108551 107198 146879 151158 184859 168756
9949 168756 218642 243734 139531 89618 67709 100785 126057 146923 77225 132677 236791
9938 236791 283477 387315 359315 337620 400808 431027 350850 400648 393833 369652 372264 381723
9926 381723 278550 212282 194616 224277 222437 256663 342735 381265 365952 443035 469663 356589
9914 356589 296971 296923 272422 194673 189464 169046 190485 181515 191984 189565 235303 211633 249530
$$ packed form
9993F62179O4922J2149Q6948N9909j9252K12874L90686K94503R4040L45678M00554
9982B605190J83308n3413k22601k33030k10745k97752m05364k17674k44499k71453
9972F31967j10408L6323j40930m6025K2265Q3153L9979j97899j66541J13499J58250
9961D23633P0386r8277r5178m3821l846n3611r0735j353L9681M279L3701j6103
9949A68756M9886K5092j04203m9913k1909L3076K5272K0866o9698N5452J04114
9938B36791M6686J03838k8000k1695O3188L0219q0177M9798o815k4181K612R459
9926C81723j03173o6268j7666K9661j840L4226Q6072L8530j5313P7083K6628j13074
9914C56589n9618m8k4501p7749n209k0418K1439q970J0469k419M5738k3670L7897
$$ plain form
9901 249530 328512 343566 331573 311726 346373 281322 149397 205977 285649 406963 333466
9890 333466 306938 237000 277575 412336 356912 321793 319330 271566 319928 417515 435605 524112
9878 524112 346759 281384 329253 412477 486481 409795 282421 343182 332272 371527 292144
9867 292144 269430 256300 329243 517009 428153 440835 536575 705049 906365 1088368 1154092
9856 1154092 1131551 1058183 1055506 1128535 1220315 1444684 1833393 2116362 2357087 2889186 3621066
9845 3621066 4430230 5506848 6761028 7948563 8782538 9040462 8668720 7807417 6895556
9836 6895556 5844265 4844635 3969080 3437866 3114524 2873961 2655192 2583480 2539694 2504583
9826 2504583 2655044 2858223 3044887 3370501 3952004 4706642 5902157 7272195 8679483
$$ packed form
9901B49530P8982J5054j1993j9847L4647o5051j31925N6580P9672J21314p3497
9890C33466k6528o9938M0575J34761n5424l5119k463m7764M8362R7587J8090Q8507
9878E24112j77353o5375M7869Q3224P4004p6686j27374O0761j0910L9255p9383
9867B92144k2714j3130P2943J87766q8856J2682R5740J68474K01316J82003O5724
9856A154092k2541p3368k677P3029R1780K24369L88709K82969K40725N32099P31880
9845C621066Q09164J076618J254180J187535Q33975K57924l71742q61303r11861
9836F895556j051291r99630q75555n31214l23342k40563k18769p1712m3786l5111
9826B504583J50461K03179J86664L25614N81503P54638J195515J370038J407288
$$ plain form
9817 8679483 10356279 11671474 12133546 11513166 10202383 8532938 6894104 5531926 4492296
9808 4492296 3695687 3105932 2810759 2548889 2256062 2119525 1941538 1709277 1621380 1590213
9798 1590213 1472199 1348252 1285410 1341334 1491226 1567512 1570563 1536753 1572123 1673500 1843091
9787 1843091 2142908 2454626 2673755 2871685 3256327 3891714 4684761 5585291 6762369
9778 6762369 8174618 9733401 11486185 13100766 14395103 15624263 16783832 17427903
9770 17427903 17162657 15982074 14063245 12202276 10471979 9096667 8262425 7853861 7818019
9761 7818019 8227425 8912083 9898363 11004621 11990839 12819565 13604784 14630682 15864131
9752 15864131 17490931 19196379 20666141 21635552 22308029 22666596 22692056 22102284 20698000
$$ packed form
9817H679483J676796J315195M62072o20380j310783j669445j638834j362178j039630
9808D492296p96609n89755k95173k61870k92827j36537j77987k32261q7897l1167
9798A590213j18014j23947o2842N5924J49892P6286L051l3810L5370J01377J69591
9787A843091K99817L11718K19129J97930L84642O35387P93047R00530J177078
9778F762369J412249J558783J752784J614581J294337J229160J159569O44071
9770A7427903k65246j180583j918829j860969j730297j375312q34242m08564l5842
9761G818019M09406O84658R86280J106258R86218Q28726P85219J025898J233449
9752A5864131J626800J705448J469762R69411O72477L58567K5460n89772j404284
$$ plain form
9743 20698000 18354880 15907603 13690338 11751164 10379899 9656962 9358228 9487223 9931977
9734 9931977 10682259 11266656 11433989 11076989 10097221 8775441 7475832 6539087 5754602
9725 5754602 5309892 4989242 4789725 4853280 5076967 5385247 5541216 5632048 5685499 5551848
9715 5551848 5333350 5299240 5498023 5787114 6328576 7092656 8260680 9557409 10657436
9706 10657436 11303338 11375880 10905824 10293957 9789063 9592582 9810810 10313139 11120529 12227259
9696 12227259 13489332 14731406 15746435 16453729 16870730 16979225 17002218 17444672 18583238
9687 18583238 20608954 23590408 27486688 31822606 35961930 38959342 39782706 38388837
9679 38388837 35471810 32309920 29774887 28128679 27266747 26761903 26773846 27557495 28700525
$$ packed form
9743B0698000k343120k447277k217265j939174j371265p22937k98734J28995M44754
9734I931977P50282N84397J67333l57000r79768j321780j299609r36745p84485
9725E754602m44710l20650j99517O3555K23687L08280J55969R0832N3451j33651
9715E551848k18498l4110J98783K89091N41462P64080J168024J296729J100027
9706A0657436O45902P2542m70056o11867n04894j96481K18228N02329Q07390J106730
9696A2227259J262073J242074J015029P07294M17001J08495K2993M42454J138566
9687A8583238K025716K981454L896280M335918M139324K997412Q23364j393869
9679C8388837k917027l161890k535033j646208q61932n04844J1943P83649J143030
$$ plain form
9670 28700525 29944991 30881513 31111198 30713092 29777195 28292755 26463145 24492583 22506686
9661 22506686 20737675 19534685 18532043 17282469 15782168 14160696 12476876 10951507
9653 10951507 9686562 8759720 8228095 8116962 8171968 8233854 8400935 8540291 8472125 8554022
9643 8554022 8761110 9174373 9924517 10662251 11231284 11636501 11766348 11773048 11856656 12054475
9633 12054475 12477497 13176402 13899834 14318633 14226361 13630325 12940393 12198642 11613484 11636128
9623 11636128 12281010 13418951 15021382 16674874 17788748 17920350 17298648 16409185 15642089
9614 15642089 15420282 15796136 16669515 17594190 18552715 19320155 19924326 20686786 21429574
9605 21429574 22200433 22913450 23237575 23171437 22856939 22276274 21588472 21048202 20643872 20114013
$$ packed form
9670B8700525J244466R36522K29685l98106r35897j484440j829610j970562j985897
9661B2506686j769011j202990j002642j249574j500301j621472j683820j525369
9653A0951507j264945r26842n31625j11133N5006O1886J67081J39356o8166Q1897
9643H554022K07088M13263P50144P37734N69033M05217J29847O700Q3608J97819
9633A2054475M23022O98905P23432M18799r2272n96036o89932p41751n85158K2644
9623A1636128O44882J137941J602431J653492J113874J31602o21702q89463p67096
9614A5642089k21807L75854Q73379R24675R58525P67440O04171P62460P42788
9605B1429574P70859P13017L24125o6138l14498n80665o87802n40270m04330n29859
$$ plain form
9595 20114013 19468264 18573680 17535077 16403366 15247177 14510073 14473863 14893803 15747550
9586 15747550 17179809 18696272 20250321 21719884 22906309 23962038 24734980 25098525
9578 25098525 24904406 24089476 23103141 21940639 20717978 19447789 18007566 16347695 14625158
9569 14625158 12891585 11322158 10111236 9406729 8974453 8711238 8715606 9065748 9830683
9560 9830683 10755641 11741471 12692111 13670627 14385969 15076671 15683669 16036385 16002278 15619149
9550 15619149 14876525 13870123 12797386 11619089 10395078 9064521 7930762 6914855
9542 6914855 5976123 5175914 4619890 4235348 3971984 3797416 3678879 3613186 3695075 3739904
9532 3739904 3888260 4218297 4610310 5003318 5320888 5440030 5231121 5091114 4733903 4232129
$$ packed form
9595B0114013o45749q94584j038603j131711j156189p37104l6210M19940Q53747
9586A5747550J432259J516463J554049J469563J186425J055729P72942L63545
9578B5098525j94119q14930r86335j162502j222661j270189j440223j659871j722537
9569A4625158j733573j569427j210922p04507m32276k63215M368L50142P64935
9560I830683R24958R85830R50640R78516P15342O90702O06998L52716l4107l83129
9550A5619149p42624j006402j072737j178297j224011j330557j133759j015907
9542F914855r38732q00209n56024l84542k63364j74568j18537o5693Q1889M4829
9532C739904J48356L30037L92013L93008L17570J19142k08909j40007l57211n01774
$$ plain form
9522 4232129 3659567 3080756 2639979 2330441 2106533 1912246 1705913 1413492 1284150 1290648
9512 1290648 1173364 1073927 914798 911269 996501 1012103 966915 903032 939872 866354 777680
9501 777680 613406 721106 804539 754622 727302 602311 570100 706464 784475 781279 792894
9490 792894 769307 661956 559259 521370 515177 559681 561624 563810 546757 527411 648311 678557
9478 678557 576602 533368 732005 713625 668637 748463 829756 746323 762918 740328 659474
9467 659474 632264 669498 579525 458635 476322 467802 463681 611527 777214 793981 854465
9456 854465 794918 778514 897718 950505 931881 975540 1073545 984882 931078 1083627 1258550
9445 1258550 1479495 1614250 1815941 2083795 2263525 2500708 3159108 3943648 4667943 5594642
$$ packed form
9522D232129n72562n78811m40777l09538k23908j94287k06333k92421j29342O498
9512A290648j17284r9437j59129l529Q5232J5602m5188o3883L6840p3518q8674
9501G77680j64274J07700Q3433m9917k7320j24991l2211J36364P8011l196J1615
9490G92894k3587j07351j02697l7889o193M4504J943K186j7053j9346J20900L0246
9478F78557j01955m3234J98637j8380m4988P9826Q1293q3433J6595k2590q0854
9467F59474k7210L7234q9973j20890J7687q520m121J47846J65687J6767O0484
9456H54465n9547j6404J19204N2787j8624M3659R8005q8663n3804J52549J74923
9445A258550K20945J34755K01691K67854J79730K37183O58400P84540P24295R26699
$$ plain form
9435 5594642 6684732 7400084 7663260 7514096 7056224 6362939 5507161 4784364 4181173
9426 4181173 3708015 3312487 3051377 2912271 2909061 2774692 2784254 2941635 3077254 3198319
9416 3198319 3422640 3770567 4196635 4753609 5454853 6291893 7173522 8082286 9077381 9974174
9406 9974174 10624186 10966200 10731059 10287569 9779312 9217040 8496922 7882871 7247678 6567998
9396 6567998 6097141 5566967 5089695 4667455 4203174 3793497 3550386 3465855 3463223 3615468
9386 3615468 3864586 4137298 4525228 5185907 6221915 7439359 8671699 9548996 9696686
9377 9696686 9252982 8404732 7571819 7065405 6690890 6615885 6903105 7584536 8463890 9161988
9367 9161988 9346455 9043249 8730794 8469506 8384247 8577284 8790047 8846249 8689408 8359548
$$ packed form
9435E594642J090090P15352K63176j49164m57872o93285q55778p22797o03191
9426D181173m73158l95528k61110j39106l210j34369R562J57381J35619J21065
9416C198319K24321L47927M26068N56974P01244Q37040Q81629R08764R95095Q96793
9406I974174O50012L42014k35141m43490n08257n62272p20118o14051o35193o79680
9396F567998m70857n30174m77272m22240m64281m09677k43111q4531k632J52245
9386C615468K49118K72712L87930O60679J036008J217444J232340Q77297J47690
9377I696686m43704q48250q32913n06414l74515p5005K87220O81431Q79354O98098
9367I161988J84467l03206l12455k61288q5259J93037K12763N6202j56841l29860
$$ plain form
9357 8359548 7852946 7003998 6433047 6201929 6015247 5970615 6240328 6749207 7327670 8068786
9347 8068786 9013324 10071323 11195959 12218338 13214693 14337171 15540806 16998286 18726396
9338 18726396 20316997 21435598 22056334 22121335 21160852 19235605 16905041 14450072 12303774
9329 12303774 10622159 9455246 8696630 8289981 8274806 8545114 9113577 9881474 11058415
9320 11058415 12395754 13372896 13758741 13638054 13418307 13363125 13641343 14092791 14411018
9311 14411018 14362383 14095169 13436229 12210896 10810071 9434205 8295702 7307283 6609789
9302 6609789 6240331 5985308 6067850 6314344 6710271 7406974 8481395 9890953 11098119
9293 11098119 11692048 11599817 10620280 9405968 8250733 7258651 6479522 5951791 5625903
$$ packed form
9357H359548n06602q48948n70951k31118j86682m4632K69713N08879N78463P41116
9347H068786R44538J057999J124636J022379R96355J122478J203635J457480J728110
9338A8726396J590601J118601O20736O5001r60483j925247k330564k454969k146298
9329A2303774j681615j166913p58616m06649j5175K70308N68463P67897J176941
9320A1058415J337339R77142L85845j20687k19747n5182K78218M51448L18227
9311A4411018m8635k67214o58940j225333j400825j375866j138503r88419o97494
9302F609789l69458k55023Q2542K46494L95927O96703J074421J409558J207166
9293A1098119N93929r2231r79537j214312j155235r92082p79129n27731l25888
$$ plain form
9284 5625903 5648052 5794797 5966196 6374885 7087278 7943110 8631946 9158688 9194544 9212894
9274 9212894 9308184 9682660 10521346 11580448 12800878 13816433 14363046 14146973 13260812
9265 13260812 11817065 10222631 8843315 7870237 7346821 7096163 7176939 7559861 8249803
9256 8249803 9100595 10315508 11898045 13298254 14112416 14227543 13721084 12871063 12040275
9247 12040275 11480322 11153651 10966604 10986145 11018258 10727477 10063605 9208987 8238941 7250182
9237 7250182 6502714 5905117 5513211 5267638 5150550 5049441 5254246 5678708 6379033 7133704
9227 7133704 7939593 8515474 8732907 8703208 8260679 7617200 6888800 6067624 5227790 4573046
9217 4573046 4078810 3732139 3524521 3361264 3296505 3395737 3517228 3665868 3873445 4046186
$$ packed form
9284E625903K2149J46745J71399M08689P12393Q55832O88836N26742L5856J8350
9274I212894R5290L74476Q38686J059102J220430J015555N46613k16073q86161
9265A3260812j443747j594434j379316r73078n23416k50658Q0776L82922O89942
9256H249803Q50792J214913J582537J400209Q14162J15127n06459q50021q30788
9247A2040275n59953l26671j87047J9541L2113k90781o63872q54618r70046r88759
9237G250182p47468n97597l91906k45573j17088j01109K04805M24462P00325P54671
9227G133704Q05889N75881K17433k9699m42529o43479p28400q21176q39834o54744
9217D573046m94236l46671k07618j63257o4759R9232J21491J48640K07577J72741
$$ plain form
9207 4046186 4415530 4951153 5505960 5826173 6010994 5903753 5571198 5172436 4970120 4879693
9197 4879693 4822389 4906734 5102186 5292628 5632875 5898827 6190214 6632339 7216987 7950598
9187 7950598 8759496 9684084 10750206 11861880 12847052 13522378 13896392 14149249 14261744
9178 14261744 14129298 13958371 13788313 13420427 13161159 13000317 12781676 12454915 12159889
9169 12159889 11806806 11288981 10788900 10457816 10157972 9732203 9376590 9112255 8881238
9160 8881238 8752124 8578570 8588506 8660853 8482328 7954699 7269175 6638229 6092391 5548140
9150 5548140 4974324 4566197 4294658 4075504 3685158 3390358 3261197 3153681 3065267 2904853
9140 2904853 2817479 2654629 2568064 2652031 2561156 2248307 2239160 2180300 2094299 1983724 2063517
$$ packed form
9207D046186L69344N35623N54807L20213J84821j07241l32555l98762k02316r0427
9197D879693n7304Q4345J95452J90442L40247K65952K91387M42125N84648P33611
9187G950598Q08898R24588J066122J111674R85172O75326L74014K52857J12495
9178A4261744j32446j70927j70058l67886k59268j60842k18641l26761k95026
9169A2159889l53083n17825n00081l31084k99844m25769l55613k64335k31017
9160H881238j29114j73554R936P2347j78525n27629o85524o30946n45838n44251
9150E548140n73816m08127k71539k19154l90346k94800j29161j07516q8414j60414
9140B904853q7374j62850q6565Q3967r0875l12849r147n8860q6001j10575P9793
$$ plain form
9129 2063517 2006386 1829339 1725887 1536381 1496354 1473368 1374630 1413566 1424680 1436231 1384299
9118 1384299 1206443 1186012 1286390 1286505 1167819 1127602 1068511 1117258 1157039 1267334 1334989
9107 1334989 1375404 1263248 1202908 1193834 1212137 1185624 1042830 1026455 1042141 1038430 967279
9096 967279 938306 1022544 1001499 950566 959422 873299 738584 710167 647087 496485 524538
9085 524538 681653 780143 762814 758847 788547 687331 730969 804368 789092 691722 751168
9074 751168 648221 667723 601209 494898 516925 481830 544580 609752 555792 542470 606647
9063 606647 598759 621465 644437 637933 728307 757410 717423 719633 591865 525241 535212 451175
9051 451175 548039 536614 401749 332818 350798 404338 396802 424568 432441 517818 595482 562887
$$ packed form
9129B063517n7131j77047j03452j89506m0027k2986r8738L8936J1114J1551n1932
9118A384299j77856k0431J00378J15j18686m0217n9091M8747L9781J10295O7655
9107A334989M0415j12156o0340r074J8303k6513j42794j6375J5686l711p1151
9096I67279k8973Q4238k1045n0933Q856q6123j34715k8417o3080j50602K8053
9085E24538J57115R8490j7329l967K9700j01216M3638P3399j5276r7370N9446
9074G51168j02947J9502o6514j06311K2027l5095O2750O5172n3960j3322O4177
9063F06647p888K2706K2972o504R0374K9103l9987K210j27768o6624R971q4037
9051D51175R6864j1425j34865o8931J7980N3540p536K7766P873Q5377P7664l2595
$$ plain form
9039 562887 468306 462154 516013 473128 465970 419256 451248 494897 503582 557003 600827 555854
9027 555854 404670 421231 505331 505071 456241 500215 469274 506139 566468 439084 366385 387280
9015 387280 477372 451155 358886 376658 438640 446439 496126 566200 613972 425742 314329
9004 314329 330409 455295 486762 521100 684657 709546 730113 730778 648192 561766 537216 404635
8992 404635 270141 316662 301923 336758 321087 228987 220889 266098 325843 414978 381897 469662
8980 469662 567469 557675 374874 430948 556023 659571 576919 474065 411687 290805 258356
8969 258356 208258 331694 512523 462617 424093 430177 275495 279361 171804 181486 252207
8958 252207 147511 145633 197127 172290 122416 248099 321756 326225 257436 271713 311354 377998
$$ packed form
9039E62887r4581o152N3859m2885p158m6714L1992M3649Q685N3421M3824m4973
9027E55854j51184J6561Q4100k60m8830M3974l0941L6865O0329j27384p2699K0895
9015C87280R0092k6217r2269J7772O1982P799M9687P0074M7772j88230j11413
9004C14329J6080J24886L1467L4338J63557K4889K0567O65q2586q6426k4550j32581
8992D04635j34494M6521j4739L4835j5671r2100q098M5209N9745Q9135l3081Q7765
8980D69662R7807r794j82801N6074J25075J03548q2652j02854o2378j20882l2449
8969B58356n0098J23436J80829m9906l8524O084j54682L866j07557R682P0721
8958B52207j04696j878N1494k4837m9874J25683P3657M469o8789J4277L9641O6644
$$ plain form
8946 377998 317487 326342 338254 410111 519828 552495 571251 513554 478112 441792 437753 400736
8934 400736 359162 350391 278278 326483 344024 356563 431988 540968 607733 479284 377045
8923 377045 272100 258906 219154 93833 52204 220326 327069 228051 199995 216593 248501
8912 248501 310835 405697 393197 435391 342208 305785 289414 320716 405034 514248 366890
8901 366890 267900 397918 383606 428928 378571 391234 421761 406655 417663 494155 387383
8890 387383 254954 303107 255584 11867 -9365 47221 172930 254231 319932 277323 107066
8879 107066 65055 195958 319646 239029 147961 209887 230221 219515 261876 313259 371524
8868 371524 511011 604364 636562 621389 477360 275362 256225 279125 278445 294450 336101
$$ packed form
8946C77998o0511Q855J1912P1857J09717L2667J8756n7697l5442l6320m039l7017
8934D00736m1574q771p2113M8205J7541J2539P5425J08980O6765j28449j02239
8923C77045j04945j3194l9752j25321m1629J68122J06743r9018k8056J6598L1908
8912B48501O2334R4862j2500M2194r3183l6423j6371L1302Q4318J09214j47358
8901C66890r8990J30018j4312M5322n0357J2663L0527j5106J1008P6492j06772
8890C87383j32429M8153m7523k43717k1232N6586J25709Q1301O5701m2609j70257
8879A07066m2011J30903J23688q0617r1068O1926K0334j0706M2361N1383N8265
8868C71524J39487R3353L2198j5173j44029k01998j9137K2900o80J6005M1651
$$ plain form
8857 336101 311180 372750 332535 307299 324692 412877 312494 314993 212919 104757 173064
8846 173064 335355 347561 314504 250729 220317 227859 173792 186550 344738 399917 313901
8835 313901 236134 185009 179867 235924 299925 279268 263825 81452 58154 157509 204544 267268
8823 267268 131193 65631 106872 194599 203315 121378 80497 191125 271782 255472 176596
8812 176596 140923 100865 97410 84298 119120 192229 284094 321673 294774 223993 245414 234999
8800 234999 297598 248643 290293 171941 56118 -4602 79566 244261 398544 339872 297201
8789 297201 166014 105009 149453 230987 323241 348825 352129 208025 290129 360748 255763
8778 255763 162338 184729 266904 279405 267217 286961 354424 315394 135015 49435 35372
$$ packed form
8857C36101k4921O1570m0215k5236J7393Q8185j00383K499j02074j08162O8307
8846A73064J62291J2206l3057o3775l0412P542n4067J2758J58188N5179q6016
8835C13901p7767n1125n142N6057O4001k0657j5443j82373k3298R9355M7035O2724
8823B67268j36075o5562M1241Q7727Q716q1937m0881J10628Q0657j6310p8876
8812A76596l5673m0058l455j3112L4822P3109R1865L7579k6899p0781K1421j0415
8800B34999O2599m8955M1650j18352j15823o0720Q4168J64695J54283n8672m2671
8789B97201j31187o1005M4444Q1534R2254K5584L304j44104Q2104P0619j04985
8778B55763r3425K2391Q2175J2501j2188J9744O7463l9030j80379q5580j4063
$$ plain form
8767 35372 95408 166538 232433 244867 316462 313797 368935 379750 288299 212518 179527 147199
8755 147199 154050 89413 26961 169811 216089 230822 340922 375097 254017 99542 91495
8744 91495 244304 324096 343320 389044 430351 381473 231959 213723 197141 216747 369618
8733 369618 319141 246728 212826 173878 218048 188394 216611 285725 216977 138113 147826 190111
8721 190111 163289 91826 31540 38218 35901 123305 235998 197928 144638 153416 224155 128696
8709 128696 3625 -18319 -65265 36732 284932 261695 330506 313186 320905 314677 203109
8698 203109 87817 105561 125127 119907 170747 231961 210779 168838 141371 198292 195569 143234
8686 143234 69435 -7840 48698 31818 21238 101052 103020 142350 173553 23894 3269 73512
$$ packed form
8767C5372O0036P1130O5895J2434P1595k665N5138J0815r1451p5781l2991l2328
8755A47199O851o4637o2452J42850M6278J4733J10100L4175j21080j54475q047
8744I1495J52809P9792J9224M5724M1307m8878j49514j8236j6582J9606J52871
8733C69618n0477p2413l3902l8948M4170k9654K8217O9114o8748p8864R713M2285
8721A90111k6822p1463o0286O678k317Q7404J12693l8070n3290Q778P0739r5459
8709A28696j25071k1944m6946J01997K48200k3237O8811j7320P719o228j11568
8698B03109j15292J7744J9566n220N0840O1214k1182m1941k7467N6921k723n2335
8686A43234p3799p7275N6538j6880j0580P9814J968L9330L1203j49659k0625P0243
$$ plain form
8674 73512 118195 146312 84984 111849 237360 280261 440790 640013 510660 452247 418174
8663 418174 323169 344308 316745 308978 372318 274983 191309 297555 414682 470848 368478
8652 368478 240127 233161 206851 125260 153977 236347 349075 299339 232935 231919 211106 195961
8640 195961 314965 326007 234056 171219 223716 285715 291821 303729 313244 416350 425635 358894
8628 358894 414159 549608 534180 579925 599105 811633 1008665 1111768 998002 957746 799079
8617 799079 571304 512414 490600 498217 590929 632527 671813 614313 484464 434957 389707
8606 389707 478421 519370 519703 486238 485831 486658 634959 652982 589099 543847 425889 474906
8594 474906 524757 470286 323393 298289 227099 240204 330948 320321 298404 353909 349514 358090
$$ packed form
8674G3512M4683K8117o1328K6865J25511M2901J60529J99223j29353n8413l4073
8663D18174r5005K1139k7563p767O3340r7335q3674J06246J17127N6166j02370
8652C68478j28351o966k6310q1591K8717Q2370J12728m9736o6404j016k0813j5145
8640A95961J19004J1042r1951o2837N2497O1999O106J1908R515J03106R285o6741
8628C58894N5265J35449j5428M5745J9180K12528J97032J03103j13766m0256j58667
8617G99079k27775n8890k1814P617R2712M1598L9286n7500j29849m9507m5250
8606C89707Q8714M0949L33l3465m07Q27J48301J8023o3883m5252j17958M9017
8594D74906M9851n4471j46893k5104p1190J3105R0744j0627k1917N5505m395Q576
$$ plain form
8582 358090 227616 66776 101513 179463 323804 520966 649432 653035 569797 474362 370801
8571 370801 343727 330971 236408 162100 80665 148628 222234 97710 134983 309150 369749
8560 369749 309723 250927 159419 195913 221167 236724 231794 208631 143362 62521 168523 203755
8548 203755 175156 254344 249856 96090 119792 155499 151727 10049 -11214 8594 21141 139223
8536 139223 199884 177882 111871 176242 218786 235709 346811 419134 442872 346372 369775
8525 369775 418560 460796 386038 271579 181748 159654 82527 72768 44626 17802 113723 323904
8513 323904 436377 419768 312161 155866 102470 120262 284603 248208 143878 253151
8503 253151 301251 202673 154642 58585 14567 22877 80517 106233 112465 93981 87442 171803
$$ packed form
8582C58090j30474j60840L4737P7950J44341J97162J28466L603q3238r5435j03561
8571C70801k7074j2756r4563p4308q1435O7963P3606j24524L7273J74167O0599
8560C69749o0026n8796r1508L6494K5254J5557m930k3163o5269q0841J06002L5232
8548B03755k8599P9188m488j53766K3702L5707l772j41678k1263J9808J2547J18082
8536A39223O0661k2002o6011O4371M2544J6923J11102P2323K3738r6500K3403
8525C69775M8785M2236p4758j14459q9831k2094p7127r759k8142k6824R5921K10181
8513C23904J12473j6609j07607j56295n3396J7792J64341l6395j04330J09273
8503B53151M8100r8578m8031r6057m4018Q310N7640K5716O232j8484o539Q4361
$$ plain form
8491 171803 240311 228686 93922 183930 281453 322137 360938 508374 609250 521258 371201
8480 371201 275489 180765 166063 155879 140180 245627 259621 161801 1517 80936 86706
8469 86706 85999 66090 211479 230175 71235 5515 92497 82497 97144 136348 147848 201927
8457 201927 205790 15252 -17845 66555 176974 134737 52638 -5319 83154 89768 239133
8446 239133 306364 200051 60376 60771 152347 166203 145466 121863 89966 192069 227888
8435 227888 101263 78803 65446 54435 28946 125793 161047 95263 184545 190967 111378 58146
8423 58146 92351 191168 296698 230728 98529 160077 273258 286934 258473 200788 211905
8412 211905 204267 182245 183991 124455 240426 187958 201876 291367 157671 11643 -90291
$$ packed form
8491A71803O8508j1625j34764R0008R7523M0684L8801J47436J00876q7992j50057
8480C71201r5712r4724j4702j0184j5699J05447J3994r7820j60284P9419N770
8469H6706p07j9909J45389J8696j58940o5720Q6982j0000J4647L9204J1500N4079
8457B01927L863j90538l3097Q4400J10419m2237q2099n7957Q8473O614J49365
8446B39133O7231j06313j39675L95R1576J3856k0737k3603l1897J02103L5819
8435B27888j26625k2460j3357j1011k5489R6847L5254o5784Q9282O422p9589n3232
8423E8146L4205R8817J05530o5970j32199O1548J13181J3676k8461n7685J1117
8412B11905p638k2022J746n9536J15971n2468J3918Q9491j33696j46028j01934
$$ plain form
8401 -90291 -122898 -45458 17151 18888 72257 81191 50100 66995 60965 52567 65885 37501 -36105
8388 -36105 -129413 11976 222998 141950 91858 -32406 -17981 -74123 -184335 -140001 -100271
8377 -100271 10178 -8069 -31667 2579 -35146 -56110 -9294 5864 -113594 -159006 -47148
8366 -47148 23229 38262 6198 106418 111887 26287 -3802 -45734 108155 293106 260698
8355 260698 292743 330518 272382 171171 178416 183345 98486 -11609 132940 255391 215887
8344 215887 141881 39775 15281 196265 245145 174512 65988 25552 -27775 -46580 -72951
8333 -72951 -9652 54887 123308 76805 147758 208811 97161 67804 40521 70090 76283 4444
8321 4444 41532 52641 157973 284260 288629 224355 182655 218165 254606 169558 151997 195517
$$ packed form
8401i0291l2607P7440O2609J737N3369Q934l1091J6895o030q398J3318k8384p3606
8388c6105r3308J41389K11022q1048n0092j24264J4425n6142j10212M4334L9730
8377a00271J10449j8247k3598L4246l7725k0964M6816J5158j19458m5412J11858
8366d7148P0377J5033l2064J00220N469q5600l0089m1932J53889J84951l2408
8355B60698L2045L7775n8136j01211P245M929q4859j10095J44549J22451l9504
8344B15887p4006j02106k4494J80984M8880p0633j08524m0436n3327j8805k6371
8333g2951O3299O4539O8421m6503P0953O1053j11650k9357k7283K9569O193p1839
8321D444L7088J1109J05332J26287M369o4274m1700L5510L6441q5048j7561M3520
$$ plain form
8309 195517 120456 128317 111907 50154 154266 214717 225205 271694 242364 39238 -4491
8298 -4491 98447 182744 129185 100531 85112 192265 203272 183014 117449 14900 16421 47077
8286 47077 166211 300354 341478 260154 103397 80291 -4573 5237 -52480 15712 99539
8275 99539 219508 82985 18366 119266 159198 87671 78272 93656 85041 112041 122444 96552
8263 96552 63025 48865 45205 95835 124226 28177 -58939 -28280 61346 175456 226850 95116
8251 95116 -4662 -9938 51349 -55145 -33103 -32948 -69427 2201 -76726 80145 193304 189822
8239 189822 140061 27075 -14871 58368 82359 27202 -52878 -109829 -55573 36932 76650
8228 76650 38385 -40071 16358 38904 78952 34361 -56996 2560 -67153 -157041 -166573 -202899
$$ packed form
8309A95517p5061P861j6410o1753J04112O0451J0488M6489k9330k03126m3729
8298d491J02938Q4297n3559k8654j5419J07153J1007k0258o5565j02549J521L0656
8286D7077J19134J34143M1124q1324j56757k3106q4864R810n7717O8192Q3827
8275I9539J19969j36523o4619J00900L9932p1527r399J5384q615K7000J0403k5892
8263I6552l3527j4160l660N0630K8391r6049q7116L0659Q9626J14110N1394j31734
8251I5116r9778n276O1287j06494K2042J55l6479P1628p8927J56871J13159l482
8239A89822m9761j12986m1946P3239K3991n5157q0080n6951N4256R2505L9718
8228G6650l8265p8456N6429K2546M0048m4591r1357N9556o9713q9888r532l6326
$$ plain form
8216 -202899 -176926 -135417 -55636 -114736 -130958 -84327 -241283 -288372 -198415 -188707 -83058
8205 -83058 -124522 -64941 9961 25820 31029 -62844 -133575 -65836 -56614 2941 13069 30773
8193 30773 57325 128620 107117 7495 124105 46921 -71969 -35070 -95065 -83813 -12228
8182 -12228 4375 51905 -26293 -62917 -86879 -181618 -221962 -137403 -113704 -67965 -66759 -49334
8170 -49334 -59515 -54207 -30854 137482 162550 48993 1445 7052 142914 169721 205901 298737
8158 298737 356863 293911 169747 46454 53895 54173 33682 -3223 -70800 -42483 -13361 -78526
8146 -78526 -121343 -50327 48183 58615 -104333 -85929 -3359 -85733 -173241 -163839 -84060 -137013
8134 -137013 -103276 -45476 -78540 -142525 -85138 -79002 -94820 -150336 -147140 -81809 -88447 -21576
$$ packed form
8216b02899K5973M1509P9781n9100j6222M6631j56956m7089Q9957R708J05649
8205h3058m1464N9581P4902J5859N209r3873p0731O7739R222N9555J0128J7704
8193C0773K6552P1295k1503r9622J16610p7184j18890L6899n9995J1252P1585
8182a2228J6603M7530p8198l6624k3962r4739m0344Q4559K3699M5739J206J7425
8170d9334j0181N308K3353J68336K5068j13557m7548N607J35862K6807L6180R2836
8158B98737N8126o2952j24164j23293P441K78k0491l6905o7577K8317K9122o5165
8146g8526m2817P1016R8510J0432j62948J8404Q2570q2374q7508R402P9779n2953
8134a37013L3737N7800l3064o3985N7387O136j5818n5516L196O5331o638O6871
$$ plain form
8122 -21576 25615 67175 133686 175652 162353 160405 129411 119838 91104 125202 63530 106013
8110 106013 86514 76708 137829 49598 -48758 -136992 -134103 -14525 110354 107223 155489 109254
8098 109254 134812 143860 175651 109119 36443 -58808 -59857 8616 121927 81444 2411 36332
8086 36332 71563 2659 117468 117542 52805 -19328 -21565 -48349 -32234 -108073 -91808 -129377
8074 -129377 -128893 -95242 -79657 -18393 -14156 -116291 -173851 -51017 -22288 -99636 -12531 -124059
8062 -124059 -190114 -123525 -19932 -83598 -178346 -185544 -208819 -237427 -172523 -33975 -22698
8051 -22698 127117 215876 198204 66183 40534 91428 207367 266499 342312 259868 227831
8040 227831 210935 251942 339575 344381 302877 228578 266763 312969 280967 221852 102096 44511
$$ packed form
8122b1576M7191M1560O6511M1966j3299j948l0994r573k8734L4098o1672M2483
8110A06013j9499r806O1121q8231r8356q8234K889J19578J24879l131M8266m6235
8098A09254K5558R048L1791o6532p2676r5251j049O8473J13311m0483p9033L3921
8086C6332L5231o8904J14809P4o4737p2133k237k6784J6115p5839J6265l7569
8074a29377M84L3651J5585O1264M237j02135n7560J22834K8729p7348Q7105j11528
8062a24059o6055O6589J03593o3666r4748p198k3275k8608O4904J38548J1277
8051b2698J49815Q8759j7672j32021k5649N0894J15939N9132P5813q2444l2037
8040B27831j6896M1007Q7633M806m1504p4299L8185M6206l2002n9115j19756n7585
$$ plain form
8028 44511 84246 137536 189064 98062 208680 271207 272247 114336 17086 98425 101165 18650
8016 18650 56646 138523 112360 236175 259512 262851 248560 297109 444846 546036 497633
8005 497633 518089 437621 347149 360367 439426 467030 389664 384921 414913 459866 441847 356070
7993 356070 329599 307289 175925 45576 21713 22114 96897 118706 38071 87404 164116 154747
7981 154747 207128 243230 249268 94798 13380 -42711 4030 40928 -9594 -36123 95228
7970 95228 202504 187935 195247 211077 236273 306355 396955 550080 493744 306522 214840
7959 214840 148340 108873 113206 183769 260453 362548 396668 394416 277887 188526 167191 180954
7947 180954 117080 139417 187019 183415 73140 126303 217084 212918 269910 264018 214344 242119
$$ packed form
8028D4511L9735N3290N1528r1002J10618O2527J040j57911r7250Q1339K740q2515
8016A8650L7996Q1877k6163J23815K3337L339j4291M8549J47737J01190m8403
8005D97633K0456q0468r0472J3218P9059K7604p7366m743K9992M4953j8019q5777
7993C56070k6471k2310j31364j30349k3863M01P4783K1809q0635M9333P6712r369
7981A54747N2381L6102O038j54470q1418n6091M6741L6898n0522k6529J31351
7970I5228J07276j4569P312J5830K5196P0082R0600J53125n6336j87222r1682
7959B14840o6500l9467M333P0563P6684J02095L4120k252j16529q9361k1335J3763
7947A80954o3874K2337M7602l604j10275N3163R0781m166N6992n892m9674K7775
$$ plain form
7935 242119 248280 166880 117686 56242 10558 -18550 63994 79795 121258 19201 -38530 40844
7923 40844 105462 187880 188701 127330 119935 -4066 -80996 -109862 -19605 37341 179043 164986
7911 164986 132076 163924 171443 67574 99415 163748 120917 65478 42561 37853 -18803 -131888
7899 -131888 -64561 40993 91262 69146 27462 7365 6285 115100 117200 -52053 -101383
7888 -101383 81058 130714 29529 -158807 -85002 56410 153619 115551 -1801 -27123 51925
7877 51925 86619 12215 45733 -3590 94624 139008 52438 -81484 -74857 17927 -145342 -157572
7865 -157572 -51982 -23801 25024 66205 50470 -43242 -83534 -96949 17909 28742 -25413
7854 -25413 -153695 -142455 -204164 -232746 -157471 -133060 -83950 -27063 -24590 -71336 -110543 -113992
$$ packed form
7935B42119O161q1400m9194o1444m5684k9108Q2544J5801M1463j02057n7731P9374
7923D0844O4618Q2418Q21o1371p395j24001p6930k8866R0257N6946J41702j4057
7911A64986l2910L1848P519j03869L1841O4333m2831n5439k2917m708n6656j13085
7899a31888O7327J05554N0269k2116m1684k0097j080J08815K100j69253m9330
7888a01383J82441M9656j01185j88336P3805J41412R7209l8068j17352k5322P9048
7877E1925L4694p4404L3518m9323R8214M4384q6570j33922O627R2784j63269j2230
7865a57572J05590K8181M8825M1181j5735r3712m0292j3415J14858J0833n4155
7854b5413j28282J1240o1709k8582P5275K4411M9110N6887K473m6746l9207l449
$$ plain form
7842 -113992 -85510 -54355 41198 24327 -37540 -197791 -307291 -141501 31987 57074 32085
7831 32085 13559 28716 -4506 -102098 -28996 -91985 -40454 107718 34960 -57270 4671 46390
7819 46390 -19638 -91311 -111730 31103 122726 153042 74998 -67929 -34827 -36847 -79349 -56327
7807 -56327 -45578 -52843 -68566 -105946 -54996 92945 185852 278128 256923 233824 186266 18974
7795 18974 -115975 -134452 -197206 -191796 -35531 58086 67347 16298 -106371 -86587 -93356 -148857
7783 -148857 -83435 -40059 41616 76275 45733 -24379 -29328 -56898 -56259 -68646 -8450 -14552
7771 -14552 4521 3909 71913 30918 -14123 10544 37873 14173 -22302 -51615 -47502 32871
7759 32871 49514 145343 105785 157927 143153 -102356 -153728 -40400 5531 5805 68138 47481
$$ packed form
7842a13992K8482L1155R5553j6871o1867j60251j09500J65790J73488K5087k4989
7831C2085j8526J5157l3222r7592P3102o2989N1531J48172p2758r2230O1941M1719
7819D6390o6028p1673k0419J42833R1623L0316p8044j42927L3102k020m2502K3022
7807e6327J0749p265j5723l7380N0950J47941R2907R2276k1205k3099m7558j67292
7795A8974j34949j8477o2754N410J56265R3617R261n1049j22669J9784o769n5501
7783a48857O5422M3376Q1675L4659l0542p0112m949k7570O39j2387O0196o102
7771a4552J9073o12O8004m0995m5041K4667K7329k3700l6475k9313M113Q0373
7759C2871J6643R5829l9558N2142j4774k45509n1372J13328M5931K74O2333k0657
$$ plain form
7747 47481 91780 136083 94247 102368 71442 64160 31267 137439 102259 134492 138494 -32526
7735 -32526 -83198 -38933 -103315 -85969 25579 97315 7509 166209 126704 -27476 -71740
7724 -71740 59840 55496 -27729 -74457 -96466 -38639 47358 38724 120871 220946 161106 -34483
7712 -34483 -131945 -206446 -137497 -70328 -44413 -173748 -254593 -237112 -192956 -133185 -95661 -92694
7700 -92694 -12664 18867 -31250 -43018 37440 13007 -44570 -119708 -197764 -189700 -136485 -41752
7688 -41752 -49731 -38331 11847 4215 40741 77201 150592 117074 80600 101079 118754 28899
7676 28899 107274 10373 -87247 -162217 -159964 7667 145135 85230 -22371 -15173 -78950 -61783
7664 -61783 -758 125822 273152 318350 316383 190092 178851 146459 93091 -17028 -128889
$$ packed form
7747D7481M4299M4303m1836Q121l0926p282l2893J06172l5180L2233M002j71020
7735c2526n0672M4265o4382J7346J11548P1736q9806J58700l9505j54180m4264
7724g1740J31580m344q3225m6728k2009N7827Q5997q634Q2147J00075n9840j95589
7712c4483r7462p4501O8949O7169K5915j29335q0845J7481M4156N9771L7524K967
7700i2694Q0030L1531n0117j1768Q0458k4433n7577p5138p8056Q064N3215R4733
7688d1752p979J1400N0178p632L6526L6460P3391l3518l6474K0479J7675q9855
7676B8899P8375r6901r7620p4970K253J67631J37468n9905j07601P198o3777J7167
7664f1783O1025J26580J47330M5198j967j26291j1241l2392n3368j10119j11861
$$ plain form
7653 -128889 -114802 -47804 -111857 -231587 -260434 -176346 -276864 -340021 -321289 -248354 -131814
7642 -131814 -130348 -116156 -130223 -153619 -103529 57701 33436 124198 142009 12832 -7555
7631 -7555 26750 93338 200630 239661 198415 117412 -45291 -31542 -61442 -89063 -203693
7620 -203693 -261716 -145418 -124528 -151462 -51693 93596 63712 -61596 -127579 -156991 -144571
7609 -144571 -117157 -116190 -37952 2318 -67494 -92842 -160982 -119726 -174572 -136599 -41446 -83646
7597 -83646 -122752 -68398 65891 66665 68598 76578 -49553 -158135 -80210 -96962 -117453 -140247
7585 -140247 -201434 -193474 -185233 -201210 -117789 -157494 -95848 -168549 -108298 766 22535 -90264
7573 -90264 -64913 -13965 44903 110688 147928 53345 14285 79975 122226 38575 80137 159286
$$ packed form
7653a28889J4087O6998o4053j19730k8847Q4088j00518o3157J8732P2935J16540
7642a31814J466J4192j4067k3396N0090J61230k4265R0762J7811j29177k0387
7631g555L4305O6588J07292L9031m1246q1003j62703J3749k9900k7621j14630
7620b03693n8023J16298K0890k6934R9769J45289k9884j25308o5983k9412J2420
7609a44571K7414R67P8238M0270o9812k5348o8140M1256n4846L7973R5153m2200
7597h3646l9106N4354J34289P74J933P980j26131j08582P7925j6752k0491k2794
7585a40247o1187P960Q241j5977Q3421l9705O1646p2701O0251J09064K1769j12799
7573i0264K5351N0948N8868O5785L7240r4583l9060O5690M2251q3651M1562P9149
$$ plain form
7561 159286 78514 64992 91758 113859 222599 216943 100419 89280 65597 169015 232972
7550 232972 184960 100781 -33818 -18093 -86355 -96117 104198 156773 6763 75884 129805
7539 129805 104994 32789 61271 90884 51395 -140152 -216253 -139910 -64761 -106603 -148599
7528 -148599 -150021 -33224 23474 -15785 -44397 -74511 -177045 -341645 -361226 -277179 -145537
7517 -145537 -119642 32403 49453 -101930 -62407 -98949 -120367 -20019 57534 89998 114291
7506 114291 -17610 -191321 -262104 -172828 -27660 15680 120906 148847 7802 15852 21292
7495 21292 28270 -105179 -131350 -152325 -138993 -110470 -138691 -144954 -184763 -167488 -36017 -101247
7483 -101247 -68838 -147780 -206698 -135705 -180999 -273346 -260969 -195030 -64187 6324 -165665
$$ packed form
7561A59286q0772j3522K6766K2101J08740n656j16524j1139k3683J03418O3957
7550B32972m8012q4179j34599J5725o8262r762K00315N2575j50010O9121N3921
7539A29805k4811p2205K8482K9613l9489j91547p6101P6343P5149m1842m1996
7528a48599j422J16797N6698l9259k8612l0114j02534j64600j9581Q4047J31642
7517a45537K5895J52045J7050j51383L9523l6542k1418J00348P7553L2464K4293
7506A14291j31901j73711p0783Q9276J45168M3340J05226K7941j41045Q050N440
7495B1292O978j33449k6171k0975J3332K8523k8221o263l9809J7275J31471o5230
7483a01247L2409p8942n8918P0993m5294r2347J2377O5939J30843P0511j71989
$$ plain form
7472 -165665 -240482 -214791 -192405 -82835 -18189 -26857 -31 -36110 -83551 -72423 -59048 -132569
7460 -132569 -58818 11700 62520 56845 68002 41560 259 -43520 -118816 -63968 100091 121210
7448 121210 72003 -45281 4497 65443 -71584 -27856 21007 57291 85896 19919 6029
7437 6029 21772 22329 53895 146287 -59924 -229524 -191397 -83690 -79536 -19603 8674 41116
7425 41116 113607 -82556 -134473 12040 -39166 -230135 -180467 -48529 33625 133003 147504
7414 147504 40622 -57505 -78135 -73239 -60821 21440 16365 -137007 -224126 -116171 -98821
7403 -98821 -209374 -139448 -29374 -5625 -105858 -149650 -69294 -75986 20345 -8284 -92181
7392 -92181 -159627 -209524 -105940 71796 -11591 -40847 -30405 -92008 -50533 49231 37801
$$ packed form
7472a65665p4817K5691K2386J09570O4646q668K6826l6079m7441J1128J3375p3521
7460a32569P3751P0518N0820n675J1157k6442m1301m3779p5296N4848J64059K1119
7448A21210m9207j17284M9778O0946j37027M3728M8863L6284K8605o5977j3890
7437F029J5743N57L1566R2392k06211j69600L8127J07707M154N9933K8277L2442
7425D1116P2491j96163n1917J46513n1206j90969M9668J31938Q2154R9378J4501
7414A47504j06882r8127k0630M896J2418Q2261n075j53372q7119J07955J7350
7403i8821j10553O9926J10074K3749j00233m3792Q0356o692R6331k8629q3897
7392i2181o7446m9897J03584J77736q3387k9256J0442o1603M1475R9764j1430
$$ plain form
7381 37801 -11726 -25689 -14765 -16114 -57638 -169685 -50337 61304 23699 75711 25870
7370 25870 -81549 3540 33954 -28316 -84472 -14022 -109664 -151478 -157601 -73612 13344 -87976
7358 -87976 -162909 -169298 -144112 34007 147792 97251 -56983 -38799 68416 27792 -125274
7347 -125274 -206308 -282363 -194109 -156292 3192 29390 -20643 -223030 -305927 -202264 -51346
7336 -51346 -8953 16303 30687 7152 -64819 -22042 -92062 -85355 -87515 -76290 -151650 -105783
7324 -105783 -163451 -123316 29043 117726 125728 123701 38196 -117922 -97575 -216948 -168152
7313 -168152 -139399 -175243 -95019 -67953 -36369 103048 75169 -37847 3377 -25116 -100913
7302 -100913 -152614 -188999 -257939 -275768 -281479 -110623 -208988 -191067 -169995 -68092 -67895 -38738
$$ packed form
7381C7801m9527j3963J0924j349m1524j12047J19348J11641l7605N2012m9841
7370B5870j07419Q5089L0414o2270n6156P0450r5642m1814o123Q3989Q6956j01320
7358h7976p4933o389K5186J78119J13785n0541j54234J8184J07215m0624j53066
7347a25274q1034p6055Q8254L7817J59484K6198n0033k02387q2897J03663J50918
7336e1346M2393K5256J4384k3535p1971M2777p0020O707k160J1225p5360M5867
7324a05783n7668M0135J52359Q8683Q002k027q5505j56118K0347j19373M8796
7313a68152K8753l5844Q0224K7066L1584J39417k7879j13016M1224k8493p5797
7302a00913n1701l6385o8940j7829n711J70856r8365J7921K1072J01903J97K9157
$$ plain form
7290 -38738 73136 188250 186809 154468 110153 117049 137517 74454 -35131 -29034 -6288 9664
7278 9664 74353 92566 38519 -34821 -24229 -103520 -41677 110924 159170 159530 144865 68373
7266 68373 45380 62702 35478 71120 126656 55921 2437 55066 -2429 -243209 -303340 -190032
7254 -190032 -87123 -150357 -33892 19725 -72652 -100997 -85796 -99362 -85467 17105 81164
7243 81164 95845 150932 117657 40365 -101885 -84599 -53499 -28508 -48647 -29641 16749 109614
7231 109614 235972 242765 130713 -67349 -139261 -198509 -60026 76249 128641 170632 -22209
7220 -22209 -89028 -124457 -193650 -175113 -175787 -16991 82543 84203 24347 -17689 38618 -54216
7208 -54216 -100500 -58547 -56220 -127091 -108046 -64817 71549 49501 33760 130053 144911 143623
$$ packed form
7290c8738J11874J15114j441l2341m4315O896K0468o3063j09585O097K2746J5952
7278I664O4689J8213n4047p3340J0592p9291O1843J52601M8246L60j4665p6492
7266F8373k2993J7322k7224L5642N5536p0735n3484N2629n7495k40780o0131J13308
7254a90032J02909o3234J16465N3617r2377k8345J5201j3566J3895J02572O4059
7243H1164J4681N5087l3275p7292j42250J7286L1100K4991k0139J9006M6390R2865
7231A09614J26358O793j12052j98062p1912n9248J38483J36275N2392M1991j92841
7220b2209o6819l5429o9193J8537o74J58796R9534J660n9856m2036N6307r2834
7208e4216m6284M1953K327p0871J9045M3229J36366k2048j5741R6293J4858j288
$$ plain form
7196 143623 242644 103043 -15822 -13562 -4893 -12125 -143281 -130789 -69484 -36497 -173676
7185 -173676 -284539 -285626 -166033 -5105 -50953 -115457 -157692 -48594 -59777 -125418 -137794
7174 -137794 -56647 -39665 -43772 -29128 -49116 -10858 -14924 -66334 -110624 -220597 -227320 -114917
7162 -114917 -8039 -22170 -22928 60510 126659 85001 83028 33822 -67724 -17839 -80202 -91980
7150 -91980 37858 67329 90920 -10390 -141894 -39700 1621 -140164 -80439 20472 72573
7139 72573 92838 63568 84199 170043 160746 114876 54009 -29702 -97701 -66859 -6567 80417
7127 80417 -5654 -37696 -63057 -9347 -90156 -231514 -257141 -186997 -186512 -108209 33010 65849
7115 65849 137322 171149 146305 251973 280418 189079 99827 84764 32753 -62598 -166242
$$ packed form
7196A43623R9021j39601j18865K260Q669p232j31156J2492O1305L2987j37179
7185a73676j10863j087J19593J60928m5848o4504m2235J09098j1183o5641j2376
7174a37794Q1147J6982m107J4644j9988L8258m066n1410m4290j09973o723J12403
7162a14917J06878j4131p58Q3438O6149m1658j973m9206j01546M9885o2363j1778
7150i1980J29838K9471K3591j01310j31504J02194M1321j41785N9725J00911N2101
7139G2573K0265k9270K0631Q5844r297m5870o0867q3711o7999L0842O0292Q6984
7127H0417q6071l2042k5361N3710q0809j41358k5627P0144M85P8303J41219L2839
7115F5849P1473L3827k4844J05668K8445r1339q9252j5063n2011r5351j03644
$$ plain form
7104 -166242 -147083 -131719 -104072 -168821 -186692 -154669 -73223 12778 -4342 73113 115402 155253
7092 155253 101839 18617 -63174 -28187 -96012 -136723 -66862 37358 94310 114993 134091
7081 134091 73155 64131 -37503 -43965 -91110 -142071 -143874 -269946 -265050 -265659 -163807 -159034
7069 -159034 -196227 -153211 14661 160873 182469 126478 53698 -39599 -86771 -71253 -2579
7058 -2579 80223 -43483 -244021 -376525 -322294 -45779 93748 151374 115650 49680 35453
7047 35453 -57989 -19860 59158 21827 4621 -90893 -52634 38292 148415 84773 -15620
7036 -15620 -42103 23288 -40224 -67719 -138268 -177587 -103774 -42464 -102855 -117810 -160518 -266954
7024 -266954 -240854 -141597 -55752 295 32347 -62005 -215036 -89250 -19781 -28040 -18792 102679
$$ packed form
7104a66242J9159J5364K7647o4749j7871L2023Q1446Q6001j7120P7455M2289L9851
7092A55253n3414q3222q1791L4987o7825m0711O9861J04220N6952K0683J9098
7081A34091o0936r024j01634o462m7145n0961j803j26072M896o09J01852M773
7069a59034l7193M3016J67872J46212K1596n5991p2780r3297m7172J5518O8674
7058b579Q2802j23706k00538j32504N4231K76515J39527N7626l5724o5970j4227
7047C5453r3442L8129P9018l7331j7206r5514L8259R0926J10123o3642j00393
7036a5620k6483O5391o3512k7495p0549l9319P3813O1310o0391j4955m2708j06436
7024b66954K6100R9257Q5845N6047L2052r4352j53031J25786O9469q259R248J21471
$$ plain form
7012 102679 86524 111303 65589 40796 9217 -49181 101034 115513 46976 27036 30106 -18963
7000 -18963 15043 65718 48246 15567 116369 83058 14763 -57802 -59315 -61557 -31614 -25966
6988 -25966 -88925 -36122 -4969 -84006 -63899 -79412 -159558 -106189 -69707 -60796 -98681 -90486
6976 -90486 13271 102362 36444 2815 12736 -19804 -26292 44582 127219 93033 94947 47251
6964 47251 27226 -3133 1452 -4615 -133049 -271411 -244356 -101217 -10711 67407 -30413 -206336
6952 -206336 -285928 -188475 -126230 -173287 -162386 -133649 -129241 -85689 -93225 -131844 -153518 -62910
6940 -62910 45609 -18312 -104292 -64281 12610 -2190 -6434 152599 163005 116713 126223 74990
6928 74990 143139 124578 68237 15169 -25033 -62386 -121307 -238300 -237366 -59024 -59241 -174984
$$ packed form
7012A02679j6155K4779m5714k4793l1579n8398J50215J4479o8537j9940L070m9069
7000a8963L4006N0675j7472l2679J00802l3311o8295p2565j513k242K9943N648
6988b5966o2959N2803L1153p9037K0107j5513q0146N3369L6482Q911l7885Q195
6976i0486J03757Q9091o5918l3629R921l2540o488P0874Q2637l4186J914m7696
6964D7251k0025l0359M585o067j28434j38362K7055J43139R0506P8118r7820j75923
6952b06336p9592R7453O2245m7057J0901K8737M408M3552p536l8619k1674R0608
6940f2910J08519o3921q5980M0011P6891j4800m244J59033J0406m6292R510n1233
6928G4990O8149j8561n6341n3068m0202l7353n8921j16993R34J78342k17j15743
$$ plain form
6916 -174984 -331464 -193939 18217 -10555 -64035 -82626 -47054 -48195 49073 69730 52127
6905 52127 166865 118748 49626 -983 27060 47817 16319 82627 -65746 -140939 -168844
6894 -168844 -134233 -70614 -68821 -54547 -137675 -130576 -80946 -4104 97731 102297 159617 161563
6882 161563 154239 8546 -44376 -118085 -61025 -91181 -107987 -26831 -65520 -39711 28938 62953
6870 62953 107821 106799 71924 60170 -45405 -129047 -193165 -70992 -73243 -25886 88967 164522
6858 164522 174141 78144 -37803 -72299 -102387 -141810 -42843 -33744 49979 58659 -20905 -55540
6846 -55540 -62822 -25770 39230 -64622 -142265 -73437 -52325 -53467 -58820 -46628 -103040 -186833
6834 -186833 -25469 187616 112393 121977 53488 1897 126661 138475 -20410 4467 175399
$$ packed form
6916a74984j56480J37525K12156k8772n3480j8591L5572j141R7268K0657j7603
6905E2127J14738m8117o9122n0609K8043K0757l1498O6308j48373p5193k7905
6894a68844L4611O3619J793J4274q3128P099M9630P6842J01835M566N7320J946
6882A61563p324j45693n2922p3709N7060l0156j6806Q1156l8689K5809O8649L4015
6870F2953M4868j022l4875j1754j05575q3642o4118J22173k251M7357J14853P5555
6858A64522R619r5997j15947l4496l0088l9423R8967R099Q3723Q680p9564l4635
6846e5540p282L7052O5000j03852p7643O8828K1112j142n353J2192n6412q3793
6834a86833J61364K13085p5223R584o8489n1591J24764J1814j58885K4877J70932
$$ plain form
6823 175399 221460 193272 97147 8596 -90842 -230335 -169594 -138496 -106003 -2608 110934
6812 110934 106957 144143 -9912 -90032 -101135 -36231 -129641 -183812 -61302 77704 49364
6801 49364 -5071 86021 114955 46055 -54116 -56659 -153753 -213306 -228994 -81933 -76918 -133239
6789 -133239 -141430 -108078 -40936 117869 132813 57806 -6936 16703 76935 7896 51738 31516
6777 31516 24324 -33242 -187238 -146264 -54004 -94428 -130797 -97136 -79393 -150933 -138921 -106131
6765 -106131 -56727 245 -88792 -115504 -202733 -136969 5632 36926 9870 -131218 -112648
6754 -112648 -141039 -75295 16796 26379 11709 35698 -111860 -106769 -106293 -182894 -68695 -27038
6742 -27038 34893 120485 111967 24442 -18063 3934 -45214 -159912 -133305 -39110 28066 -73391
$$ packed form
6823A75399M6061k8188r6125q8551r9438j39493O0741L1098L2493J03395J13542
6812A10934l977L7186j54055q0120j1103O4904r3410n4171J22510J39006k8340
6801D9364n4435R1092K8934o8900j00171k543r7094n9553j5688J47061N015n6321
6789a33239q191L3352O7142J58805J4944p5007o4742K3639O0232o9039M3842k0222
6777C1516p192n7566j53996M0974R2260m0424l6369L3661J7743p1540J2012L2790
6765a06131M9404N6972q9037k6712q7229O5764J42601L1294k7056j41088J8570
6754a12648k8391O5744R2091R583j4670K3989j47558N091M76p6601J14199M1657
6742b7038O1931Q5592q518q7525m2505K1997m9148j14698K6607R4195O7176j01457
$$ plain form
6730 -73391 -80741 -91241 -48547 -148335 -168080 -122038 95826 223216 118778 154083 191000
6719 191000 143539 58419 12441 -31099 -12508 -51444 -28722 -109656 -125676 -49061 32273 60384
6707 60384 -11701 -23512 -18439 -58717 -65426 -51987 -107297 -87138 -72391 -170924 -288045 -367568
6695 -367568 -164226 -5493 -140576 -224610 -180798 -135401 -83797 -56046 -169208 -188780 -131092
6684 -131092 -48160 1197 -23816 74616 75826 125174 25343 2096 -15888 -21771 44058 -42147
6672 -42147 -43838 -94500 -129614 -86297 -54824 -59143 -67347 -81590 39703 108643 90853 -60568
6660 -60568 -90496 -113183 24377 4398 31082 45404 43311 -91660 -292544 -326943 -167574
6649 -167574 -2203 27069 -40364 -92678 -26720 53566 -69710 -160168 -99633 -40479 372
$$ packed form
6730g3391p350j0500M2694r9788j9745M6042K17864J27390j04438L5305L6917
6719A91000m7461q5120m5978m3540J8591l8936K2722q0934j6020P6615Q1334K8111
6707F0384p2085j1811N073m0278o709J3439n5310K0159J4747r8533j17121p9523
6695c67568K03342J58733j35083q4034M3812M5397N1604K7751j13162j9572N7688
6684a31092Q2932M9357k5013R8432J210M9348r9831k3247j7984n883O5829q6205
6672d2147j691n0662l5114M3317L1473m319q204j4243J21293O8940j7790j51421
6660f0568k9928k2687J37560j9979K6684J4322k093j34971k00884l4399J59369
6649a67574J65371K9272o7433n2314O5958Q0286j23276r0458O0535N9154M0851
$$ plain form
6638 372 15494 -50367 -92683 -222099 -205109 -156246 -97766 -94018 -16601 351 -38301 -82860
6626 -82860 -82690 -101010 -186475 -138109 71617 81579 -14019 36151 13650 106450 89275 24374
6614 24374 -58631 -83034 -150164 -27510 52928 104763 81675 17258 17085 -27526 -65794 -114558
6602 -114558 -75815 -24529 -36289 42730 114361 97635 29093 -1349 -130369 -162305 -154309 -107079
6590 -107079 -76219 19954 48662 67603 13329 -94804 -196752 -159305 -206148 -243960 -134981
6579 -134981 -158755 -132521 -88875 -40572 -116827 -75885 25583 -24383 -117850 20002 12324
6568 12324 -152987 -164841 -137087 -50947 -20180 -46492 -67984 -125740 -157799 -112655 -101215 -130787
6556 -130787 -39691 31801 18880 29256 14994 44182 25843 -60960 -125845 -1271 68341
$$ packed form
6638C72J5122o5861m2316j29416J6990M8863N8480L748P7417J6952l8652m4559
6626h2860J70j8320q5465M8366K09726R962r5598N0170k2501R2800j7175o4901
6614B4374q3005k4403o7130J22654Q0438N1835k3088o4417j73m4611l8268m8764
6602a14558L8743N1286j1760P9019P1631j6726o8542l0442j29020l1936P996M7230
6590a07079L0860R6173K8708J8941n4274j08133j01948L7447m6843l7812J08979
6579a34981k3774K6234M3646M8303p6255M0942J01468m9966r3467J37852p678
6568A2324j65311j1854K7754Q6140L0767k6312k1492n7756l2059M5144J1440k9572
6556a30787R1096P1492j2921J0376j4262K9188j8339q6803o4885J24574O9612
$$ plain form
6545 68341 51065 115484 99102 18226 90534 103872 18811 27108 -34561 2422 88966 163123
6533 163123 88830 56246 128876 155214 49261 -49245 -101836 -87678 -117002 -9547 50496
6522 50496 -1673 -35035 7467 77496 46369 5189 -39909 -11133 -6289 -48443 -44592 -52888
6510 -52888 -23827 -59637 -88779 -111875 -147414 -94159 -136866 -45605 -8051 -38383 37372 1542
6498 1542 -39563 -113871 -239275 -299053 -183054 -86523 -55076 59680 126124 -4696 -38529
6487 -38529 -2032 -14468 -16591 -70472 -6980 -96359 -87862 38445 27846 -61243 -79366 -104456
6475 -104456 -176753 -71753 51963 160742 181070 106845 2094 -44202 -13544 -52982 -101643
6464 -101643 -9114 44654 94020 114979 41560 5607 29711 -9148 -133353 -96444 -37300
$$ packed form
6545F8341j7276O4419j6382q0876P2308J3338q5061Q297o1669L6983Q6544P4157
6533A63123p4293l2584P2630K6338j05953r8506n2591J4158k9324J07455O0043
6522E0496n2169l3362M2502P0029l1127m1180m5098K8776M844m2154L851q296
6510e2888K9061l5810k9142k3096l5539N3255m2707R1261L7554l0332P5755l5830
6498A542m1105p4308j25404n9778J15999R6531L1447J14756O6444j30820l3833
6487c8529L6497j2436k123n3881O3492q9379Q497J26307j0599q9089j8123k5090
6475a04456p2297J05000J23716J08779K0328p4225j04751m6296L0658l9438m8661
6464a01643R2529N3768M9366K0959p3419l5953K4104l8859j24205L6909N9144
$$ plain form
6453 -37300 -71537 -11481 -17847 -157005 -121196 -149940 -223766 -211894 -307323 -355803 -213621 -179112
6441 -179112 -109749 2353 -16257 -92815 -103461 -54365 57477 90887 69247 60556 5252
6430 5252 -21277 -126996 -209168 -182334 -143102 -87459 -89686 40377 182076 173584 14320 -6144
6418 -6144 18237 64314 77751 95727 -54603 -43776 41962 115574 76332 -6313 49104 -70342
6406 -70342 -152783 33641 153080 160491 136269 53283 45575 -28759 -114080 -183841 -321766 -422205
6394 -422205 -374780 -254744 -141612 -18601 -26410 -35015 -104853 -104735 -8282 16524 5714 66507
6382 66507 86546 54925 -9959 46835 13974 18528 157914 110292 99019 244616 232419 89357
6370 89357 42617 85224 104666 -10564 -52255 -71994 -25714 36641 75486 -91794 -72492
$$ packed form
6453c7300l4237O0056o366j39158L5809k8744p3826J1872r5429m8480J42182L4509
6441a79112O9363J12102j8610p6558j0646M9096J11842L3410k1640q691n5304
6430E252k6529j05719q2172K6834L9232N5643k227J30063J41699q492j59264k0464
6418f144K4381M6077J3437J7976j50330J0827Q5738P3612l9242q2645N5417j19446
6406g0342q2441J86424J19439P411k4222q2986p708p4334q5321o9761j37925j00439
6394d22205M7425J20036J13132J23011p809q605o9838J18R6453K4806j0810O0793
6382F6507K0039l1621o4884N6794l2861M554J39386m7622j1273J45597j2197j43062
6370H9357m6740M2607J9442j15230m1691j9739M6280O2355L8845j67280J9302
$$ plain form
6359 -72492 -16202 -1431 13634 66670 10882 -38432 -38465 -71720 -112021 -57733 -77149 -165908
6347 -165908 -155833 -133655 -71739 35679 104876 40151 1112 -93185 -94432 -52853 6069 -98079
6335 -98079 -36720 4858 -60841 -103917 -170172 -292549 -236596 -191866 -154212 -63269 60639
6324 60639 -45802 -100283 -120222 -224209 -280484 -288451 -217987 -124670 -115113 -155507 -178725 -165529
6312 -165529 -179435 -168822 -56193 -149226 -169060 -95336 -84828 -175166 -165440 -94818 -58424 -19128
6300 -19128 35156 -61249 -39171 -157432 -157772 -73279 -101093 -195235 -220603 -123628 -137025 -82721
6288 -82721 -65214 -96137 -42510 12991 19364 -121841 -154415 -107175 -188800 -212005 -162716 -122114
6276 -122114 -46462 -35041 -94992 -132508 -137787 -183362 -224831 -168123 -90030 -140899 -158733 -75057
$$ packed form
6359g2492N6290J4771J5065N3036n5788m9314l3l3255m0301N4288j9416q8759
6347a65908J0075K2178O1916J07418O9197o4725l9039r4297j247M1579N8922j04148
6335i8079O1359M1578o5699m3076o6255j22377N5953M4730L7654R0943J23908
6324F0639j06441n4481j9939j03987n6275p967P0464R3317R557m0394k3218J3196
6312a65529j3906J0613J12629r3033j9834P3724J0508r0338R726P0622L6394L9296
6300a9128N4284r6405K2078j18261l40Q4493k7814r4142k5368R6975j3397N4304
6288h2721J7507l0923N3627N5501O373j41205l2574M7240q1625k3205M9289M0602
6276a22114P5652J1421n9951l7516n279m5575m1469N6708P8093n0869j7834Q3676
$$ plain form
6264 -75057 -52632 -81494 -194798 -232243 -183940 -95824 -63824 -46926 -31846 100890 126382
6253 126382 -95922 -242981 -184604 -99864 -50990 19631 106332 93090 -46995 -17345 151733
6242 151733 125737 29178 -2429 56897 -13371 -160180 -84100 -78999 -76845 -75718 -82682 -129432
6230 -129432 -144513 -85708 -144382 -143299 -175539 -160709 -2601 11803 -98936 -55881 97614
6219 97614 175166 111692 41711 52575 26789 39569 74466 39555 -53266 -28023 -5188 -147520
6207 -147520 -65223 61045 52733 49820 -29825 -51667 -11354 54728 116134 91134 35801 -84875
6195 -84875 -65137 -17979 7762 7614 -8686 -4571 -59811 -14640 43248 86595 43381 29682
6183 29682 22557 -95025 -85829 -74691 -143876 -163807 -80336 8260 40971 127172 83691 -63858
$$ packed form
6264g5057K2425k8862j13304l7445M8303Q8116L2000J6898J5080J32736K5492
6253A26382k22304j47059N8377Q4740M8874P0621Q6701j3242j40085K9650J69078
6242A51733k5996r6559l1607N9326p0268j46809P6080N101K154J127o964m6750
6230a29432j5081N8805n8674J083l2240J4830J58108J4404j10739M3055J53495
6219I7614P7552o3474o9981J0864k5786J2780L4897l4911r2821K5243K2835j42332
6207a47520Q2297J26268q312k913p9645k1842M0313O6082O1406k5000n5333j20676
6195h4875J9738M7158K5741j48j6300M115n5240M5171N7888M3347m3214j3699
6183B9682p125j17582R196J1138o9185j9931Q3471Q8596L2711Q6201m3481j47549
$$ plain form
6171 -63858 -45805 9240 -66498 43887 66496 27033 100758 89920 32421 74799 111759 47986
6159 47986 -102732 -220953 -161722 -194489 -153567 -101159 -189599 -209234 -155566 -161224 -208763 -185853
6147 -185853 -93514 -79674 38989 151103 32462 -35676 -86666 -46596 -25055 -101166 -99468
6136 -99468 -121677 -75375 -132276 -132522 -17333 38152 61271 -104429 -234890 -104310 -44935
6125 -44935 27449 15730 -34185 61536 -14265 -212740 -115637 -152098 -188154 -129156 -103145 62941
6113 62941 62968 -4572 -27023 -116468 -162091 -170697 -200774 -186607 -136343 -27113 150489 229295
6101 229295 284464 191242 127527 86036 -58212 -92274 -84034 21187 27967 -19934 -9618 10521
6089 10521 -25325 -41628 -89934 -123479 -86087 -33858 45603 66740 -36598 78722 192664
$$ packed form
6171f3858J8053N5045p5738J10385K2609l9463P3725j0838n7499M2378L6960o3773
6159D7986j50718j18221N9231l2767M0922N2408q8440j9635N3668n658m7539K2910
6147a85853R2339J3840J18663J12114j18641o8138n0990M0070K1541p6111J698
6136i9468k2209M6302n6901k46J15189N5485K3119j65700j30461J30580N9375
6125d4935P2384j1719m9915R5721p5801j98475R7103l6461l6056N8998K6011J66086
6113F2941K7o7540k2451q9445m5623q606l0077J4167N0264J09230J77602P8806
6101B29295N5169r3222o3715m1491j44248l4062Q240J05221O780m7901J0316K0139
6089A0521l5846j6303m8306l3545L7392N2229P9461K1137j03338J15320J13942
$$ plain form
6078 192664 85313 18968 -68339 -154442 -208699 -116292 -43602 23958 32895 20682 -56310 -101523
6066 -101523 -89663 -51530 -123361 -159371 -207442 -197830 -110869 -119885 -166196 -205507 -96881 -3246
6054 -3246 17848 -46359 -92538 -38871 35067 -65413 -158616 -135858 3899 44495 90168 157550
6042 157550 170216 104989 -13175 -88381 -136260 -44090 38640 -74453 -121783 -178534 -69612
6031 -69612 18209 392 -94938 -5228 77787 -30413 -79826 -68946 -9663 58779 -30514 -56567
6019 -56567 -33376 43249 12694 -97316 -81213 -148547 -66519 -3020 279 61444 90069 27671
6007 27671 -15504 -76656 -59936 -66587 -46465 82838 37943 -55691 25003 109858 81369 25926
5995 25926 37749 31591 91635 19009 -75468 -93128 -74038 -30979 -55921 -98072 -88695 -72859
$$ packed form
6078A92664j07351o6345q7307q6103n4257R2407P2690O7560Q937j2213p6992m5213
6066a01523J1860L8133p1831l6010m8071R612Q6961r016m6311l9311J08626R3635
6054c246K1094o4207m6179N3667P3938j00480r3203K2758J39757M0596M5673O7382
6042A57550J2666o5227j18164p5206m7879R2170Q2730j13093m7330n6751J08922
6031f9612Q7821j7817r5330Q9710Q3015j08200m9413J0880N9283O8442q9293k6053
6019e6567K3191P6625l0555j10010J6103o7334Q2028O3499L299O1165K8625o2398
6007B7671m3175o1152J6720o651K0122J29303m4895r3634Q0694Q4855k8489n5443
5995B5926J1823o158O0044p2626r4477j7660J9090M3059k4942m2151R377J5836
$$ plain form
5983 -72859 -105892 -48637 -109273 -179590 -192993 -154805 -42977 55349 117751 196284 84354
5972 84354 -75780 -40343 -105175 -20863 -80411 -105042 -108693 -222680 -130515 -46106 55817
5961 55817 71285 30226 45657 16781 57796 6634 -43726 32378 70865 32027 21077 -63038
5949 -63038 -74812 -76816 -84059 -235738 -225284 -173042 -180964 -171168 -110724 -102258 -10838 -59187 -119310
5936 -119310 -73221 -60441 75944 169732 130672 -41542 -27745 -34312 -101807 -122556 -171141
5925 -171141 -142211 -1531 -45268 -135274 -239010 -292243 -239901 -188197 -166133 -140776 6352
5914 6352 132270 13815 27964 26668 -2402 58771 51205 24796 -46479 -90068 8009 87148
5902 87148 36808 -54451 -114536 -115014 -129023 -193662 -144659 -110880 -51178 -63677 -79171 -147620
$$ packed form
5983g2859l3033N7255o0636p0317j3403L8188J11828R8326O2402P8533j11930
5972H4354j60134L5437o4832Q4312n9548k4631l651j13987R2165Q4409J01923
5961E5817J5468m1059J5431k8876M1015n1162n0360P6104L8487l8838j0950q4115
5949f3038j1774k004p243j51679J0454N2242p922R796O0444Q466R1420m8349o0123
5936a19310M6089J2780J36385R3788l9060j72214J3797o567o7495k0749m8585
5925a71141K8930J40680m3737r0006j03736n3233N2342N1704K2064K5357J47128
5914F352J25918j18455J4149j296k9070O1173p566k6409p1275m3589R8077P9139
5902H7148n0340r1259o0085m78j4009o4639M9003L3779N9702j2499j5494o8449
$$ plain form
5890 -147620 -136904 -67285 3023 50048 -12228 -58793 -89922 -93077 -61067 33705 37555 -69043
5878 -69043 -111571 -10906 22816 -34142 -78298 -39270 9649 4207 32889 -50765 -166748 -70096
5866 -70096 47670 23823 -83584 -174896 -172869 -121900 -96962 -80840 -78282 -88692 -80973 -193827
5854 -193827 -183999 -107734 -100245 -35110 -66848 -112414 -95874 -100007 -48512 -64881 -7708 -34880
5842 -34880 -102845 -57266 21828 31589 -40314 -195831 -254989 -165494 -180190 -210926 -223189 -174773
5830 -174773 -195085 -237052 -329003 -320632 -377264 -387385 -297288 -113550 -64689 -18300 33902 38599
5818 38599 -29803 -71043 -155435 -201875 -197667 -58093 -55754 20243 -23724 -106602 -125157 -162699
5806 -162699 -196093 -122651 -143153 -161693 -169001 -53314 -67418 -55393 -56770 -151155 -120655 -180318
$$ packed form
5890a47620J0716O9619P0308M7025o2276m6565l1129l155L2010R4772L850j06598
5878f9043m2528J00665L3722n6958m4156L9028M8919n442K8682q3654j15983R6652
5866g0096J17766k3847j07407r1312K027N0969K4938J6122K558j0410P719j12854
5854a93827R828P6265P489O5135l1738m5566J6540m133N1495j6369N7173k7172
5842c4880o7965M5579P9094R761p1903j55517n9158Q9495j4696l0736j2263M8416
5830a74773k0312m1967r1951Q371n6632j0121R0097J83738M8861M6389N2202M697
5818C8599o8402m1240q4392m6440M208J39574K339P5997m3967q2878j8555l7542
5806a62699l3394P3442k0502j8540p308J15687j4104J2025j377r4385L0500n9663
$$ plain form
5794 -180318 -288217 -337923 -231876 -92954 -152458 -166113 -108072 4266 40734 42035 62663
5783 62663 186199 79942 9483 97152 118179 117986 136828 63879 -42077 -85499 -109570 -111248
5771 -111248 -49358 -30597 2388 -90254 -125450 -134510 -90528 -81055 -131550 -109934 -115775 -137995
5759 -137995 -68728 60030 108431 71239 26856 70608 42197 -133091 -147654 -54371 -50885
5748 -50885 -58162 -53467 -26501 -129481 -123219 -135104 -130725 -106827 -136952 -228438 -143337 777
5736 777 -3697 38479 23016 -52127 -167312 -204895 -154411 -159164 -122576 -39228 -131945 -160924
5724 -160924 -133145 -57469 5793 -46423 -124481 -46008 -7234 -69509 -37634 -60773 -104235 10364
5712 10364 -155396 -197135 -189973 -121217 -21384 -17931 -70813 -146200 -125877 -81801 -99840 -102852
$$ packed form
5794a80318j07899m9706J06047J38922n9504j3655N8041J12338L6468J301K0628
5783F2663J23536j06257p0459Q7669K1027j93J8842p2949j05956m3422k4071j678
5771a11248O1890J8761L2985r2642l5196r060M3982R473n0495K1616n841k2220
5759a37995O9267J28758M8401l7192m4383M3752k8411j75288j4563R3283L486
5748e0885p277M695K6966j02980O262j1885M379K3898l0125r1486Q5101J44114
5736G77m474M2176j5463p5143j15185l7583N0484m753L6588Q3348r2717k8979
5724a60924K7779P5676O3262n2216p8058P8473L8774o2275L1875k3139m3462J14599
5712A0364j65760m1739P162O8756R9833L453n2882p5387K0323M4076j8039l012
$$ plain form
5700 -102852 -67176 -43521 -107552 -166341 -219974 -283847 -155676 -38767 103971 11947 -105745
5689 -105745 -71065 -71268 -96484 -191394 -63949 59220 68763 62963 69998 139354 177740 182206
5677 182206 230012 144682 -43085 -147953 -50710 96472 119244 -12712 -35969 -77931 -187868
5666 -187868 -146750 -22000 -31156 -73151 -85714 -76917 74501 166966 40391 -86064 -45042
5655 -45042 -20172 3473 -41038 -56966 -180563 -225300 -175930 -149963 -87618 -61288 -99867 -195459
5643 -195459 -291483 -255212 -86826 -121772 -150568 -205277 -243741 -232891 -163959 -164608 -125375 -55252
5631 -55252 57080 49859 -152726 -286813 -213383 2194 -37574 -195885 -119930 -67551 -36543
5620 -36543 -91917 1026 -11613 -134855 -135852 -10547 19918 49368 20287 -79631 -109766 -200701
$$ packed form
5700a02852L5676K3655o4031n8789n3633o3873J28171J16909J42738r2024j17692
5689a05745L4680k03k5216r4910J27445J23169R543n800P035O9356L8386M466
5677A82206M7806q5330j87767j04868R7243J47182K2772j31956k3257m1962j09937
5666a87868M1118J24750r156m1995j2563Q797J51418R2465j26575j26455M1022
5655d5042K4870K3645m4511j5928j23597m4737M9370K5967O2345K6330l8579r5592
5643a95459r6024L6271J68386l4946k8796n4709l8464J0850O8932o49L9233P0123
5631e5252J12332p221k02585j34087P3430K15577l9768j58311P5955N2379L1008
5620c6543n5374R2943j2639j23242r97J25305L0465K9450k9081r9918l0135r0935
$$ plain form
5608 -200701 -265126 -187761 100058 240487 175813 60169 83503 114293 108732 12480 30969
5597 30969 188669 148929 74262 29201 -13166 -129698 -133736 -158065 -38609 78883 94595
5586 94595 83497 34084 -93321 -235935 -80481 -56848 -88952 -163149 -182995 -149441 -209966
5575 -209966 -136423 -133963 -159112 -141134 -62935 -41438 -87206 -157263 -149752 23465 -31260 -58025
5563 -58025 -100536 -144371 -230144 -176964 -192534 -102578 -24329 1404 27785 49978 33166 -24876
5551 -24876 -104063 3137 42239 -75920 -177311 -72520 -25397 -178397 -190282 -191572 -109953
5540 -109953 -25473 -53196 -181615 -115921 33065 -110817 -134685 -55053 -164521 -184785 -138103
5529 -138103 8353 -17031 -89786 -60658 -54070 -34579 -63952 -91404 -75112 23831 -8583 2231
$$ packed form
5608b00701o4425P7365K87819J40429o4674j15644K3334L0790n561r6252J8489
5597C0969J57700l9740p4667m5061m2367j16532m038k4329J19456J17492J5712
5586I4595j1098m9413j27405j42614J55454K3633l2104p4197j9846L3554o0525
5575b09966P3543K460k5149J7978P8199K1497m5768p0057P511J73217n4725k6765
5563e8025m2511m3835q5773N3180j5570Q9956P8249K5733K6381K2193j6812n8042
5551b4876p9187J07200L9102j18159j01391J04791M7123j53000j1885j290Q1619
5540a09953Q4480k7723j28419O5694J48986j43882k3868P9632j09468k0264M6682
5529a38103J46456k5384p2755K9128O588J9491k9373k7452J6292R8943l2414J0814
$$ plain form
5517 2231 17671 32342 57580 46934 89680 102388 76715 146646 125635 39265 53840 -55398
5505 -55398 -196753 -157608 -148224 -162611 -70924 -59054 12934 111968 87221 136147 137488 21620
5493 21620 -36567 15071 -13245 -64264 -56651 -110026 83881 209315 174073 132786 40267 -83414
5481 -83414 -61787 69281 11319 -2055 -57223 -131470 -75675 -80799 -107380 101187 128050 59081
5469 59081 -71161 -116291 -133470 -103702 -107914 -119110 -48547 32839 63260 50963 46875 99854
5457 99854 78677 102469 -16244 -91145 26986 11732 -103077 -27915 -21329 18652 21452 102933
5445 102933 186706 61698 -145331 -151186 -53693 -27436 -128894 -230889 -247714 -205277 -224008
5434 -224008 -175058 -34231 26172 -107187 -148085 -39993 12565 -3366 -41988 -96234 -14257
$$ packed form
5517B231J5440J4671K5238j0646M2746J2708k5673O9931k1011q6370J4575j09238
5505e5398j41355L9145R384j4387R1687J1870P1988R9034k4747M8926J341j15868
5493B1620n8187N1638k8316n1019P613n3375J93907J25434l5242m1287r2519j23681
5481h3414K1627J31068n7962j3374n5168p4247N5795n124k6581K08567K6863o8969
5469E9081j30242m5130j7179K9768m212j1196P0563Q1386L0421j2297m088N2979
5457I9854k1177K3792j18713p4901J18131j5254j14809P5162O586L9981K800Q1481
5445A02933Q3773j25008k07029n855R7493K6257j01458j01995j6825M2437j8731
5434b24008M8950J40827O0403j33359m0898J08092N2558j5931l8622n4246Q1977
$$ plain form
5423 -14257 57263 -59080 57831 49824 -108557 -172418 -11732 56129 60742 25276 -39793
5412 -39793 -141883 -98907 -68825 2544 -21846 -32211 -123467 -117462 -121779 -89423 -52557 44113
5400 44113 118457 155473 126882 22450 13167 -21376 -157578 -278070 -180259 -23186 -4596
5389 -4596 -54874 -198887 -294928 -332415 -260871 -271660 -277447 -253386 -80320 44177 96414 129492
5377 129492 -35589 -72330 9174 81321 7866 5062 -92136 -62332 -143846 -79969 13953 55881
5365 55881 63508 48032 -96948 -99912 -114686 -130682 -119185 -31351 -16951 -61421 28663 115104
5353 115104 144761 131160 113216 103106 157777 64385 -53670 -33740 59359 145096 176737
5342 176737 86620 13717 15817 11992 68043 190744 176846 126517 16088 -105285 -196903
$$ packed form
5423a4257P1520j16343J16911q007j58381o3861J60686O7861M613l5466o5069
5412c9793j02090M2976L0082P1369k4390j0365r1256O005m317L2356L6866R6670
5400D4113P4344L7016k8591j04432r283l4543j36202j20492R7811J57073J8590
5389d596n0278j44013r6041l7487P1544j0789n787K4061J73066J24497N2237L3078
5377A29492j65081l6741Q1504P2147p3455k804r7198K9804q1514O3877R3922M1928
5365E5881P627j5476j44980k964j4774j5996J1497Q7834J4400m4470R0084Q6441
5353A15104K9657j3601j7944j0110N4671r3392j18055J9930R3099Q5737L1641
5342A76737r0117p2903K100l825N6051J22701j3898n0329j10429j21373r1618
$$ plain form
5331 -196903 -123093 -96412 -64136 -115639 -10261 -44076 -165741 -86112 -49295 -65110 -65072 35734
5319 35734 26526 6147 64320 40995 6538 -18061 -44065 84212 109709 103168 135510 30959
5307 30959 -90597 15720 53425 17007 34867 65210 24166 9404 -4933 110634 80906
5296 80906 -44316 2310 108047 117163 75841 72948 18847 -17325 -39774 -90418 -144437 -99604
5284 -99604 -43379 -36254 -32995 -164870 -155839 -74491 -8136 -107864 -197349 -155534 -161832 -141258
5272 -141258 -85752 -58614 19000 90903 12474 -103500 -215404 -247814 -212618 -90691 -25904
5261 -25904 -51833 -39592 -44700 -16222 143061 134638 90935 202363 153451 77225 5650 -75960
5249 -75960 -144561 -63166 43799 71994 -15878 -25166 -8929 -17079 -20984 71323 126995 81167
$$ packed form
5331a96903P3810K6681L2276n1503J05378l3815j21665P9629L6817j5815L8J00806
5319C5734r208k0379N8173k3325l4457k4599k6004J28277K5497o541L2342j04551
5307C0959j21556J06317L7705l6418J7860L0343m1044j4762j4337J15567k9728
5296H0906j25222M6626J05737R116m1322k893n4101l6172k2449n0644n4019M4833
5284i9604N6225P125L259j31875R031Q1348O6355r9728q9485M1815o298K0574
5272a41258N5506K7138P7614P1903p8429j15974j11904l2410L5196J21927O4787
5261b5904k5929J2241n108K8478J59283q423m3703J11428m8912p6226p1575q1610
5249g5960o8601Q1395J06965K8195q7872r288J6237q150l905R2307N5672m5828
$$ plain form
5237 81167 24138 -47571 -77092 -92296 -127373 -111845 6506 6151 17856 -31689 -28210 130658
5225 130658 172880 83145 -24803 82703 195811 127902 52266 63508 -17252 9393 -71630
5214 -71630 -179036 -181600 -86741 65820 146836 37461 -48612 -29075 34614 -17464 -141118
5203 -141118 -135514 -154223 -177350 -137603 -28335 -59002 -2470 -74301 -70539 -73064 -8367 106250
5191 106250 140479 111928 -26397 10561 28395 -19965 -25690 -46782 -51550 -59084 -38296 -74943
5179 -74943 -8895 67556 55030 81329 44555 -24564 -87557 -111250 -36809 -22606 12395 30266
5167 30266 80010 60382 3616 1521 48663 41077 33511 -102279 -93023 -200148 -261858 -172774
5155 -172774 -74743 -16999 -37218 73063 60564 -39238 -62489 47589 31726 -26030 23499
$$ packed form
5237H1167n7029p1709k9521j5204l5077J5528J18351l55J1705m9545L479J58868
5225A30658M2222q9735j07948J07506J13108o7909p5636J1242q0760K6645q1023
5214g1630j07406k564R4859J52561Q1016j09375q6073J9537O3689n2078j23654
5203a41118N604j8709k3127L9747J09268l0667N6532p1831L762k525O4697J14617
5191A06250L4229k8551j38325L6958J7834m8360n725k1092m768p534K0788l6647
5179g4943O6048P6451j2526K6299l6774o9119o2993k3693P4441J4203L5001J7871
5167C0266M9744j9628n6766k095M7142p586p566j35790R256j07125o1710Q9084
5155a72774R8031N7744k0219J10281j2499r9802k3251J10078j5863n7756M9529
$$ plain form
5144 23499 118802 76323 49402 -53887 -31968 -534 72998 86856 114719 115881 8137 46117
5132 46117 109866 83357 124528 109634 -36722 -200361 -220853 -251136 -199646 -249664 -97995
5121 -97995 -121704 -208080 -168089 -117434 -131799 -141496 -124617 -16386 93716 78462 110125 6711
5109 6711 -48566 -163192 -163188 -78197 21583 42932 -36932 6921 16193 -132769 -244827 -134977
5097 -134977 -19215 91175 100219 196542 306498 203637 106212 92348 170158 88103 5601
5086 5601 18463 46716 94046 -59024 -70100 43882 61871 17347 2070 105939 156619
5075 156619 21809 -2241 65366 140385 137290 91712 38268 -26483 21889 81096 148408 139555
5063 139555 13090 -68066 40521 113197 100436 80363 60275 21812 -6165 -110667 -117655
$$ packed form
5144B3499R5303m2479k6921j03289K1919L1434P3532J3858K7863J162j07744L7980
5132D6117O3749k6509M1171j4894j46356j63639k0492l0283N1490n0018J51669
5121i7995k3709q6376L9991N0655j4365r697J6879J08231J10102j5254L1663j03414
5109F711n5277j14626MQ4991R9780K1349p9864M3853R272j48962j12058J09850
5097a34977J15762J10390R044R6323J09956j02861r7425j3864P7810q2055q2502
5086E601J2862K8253M7330j53070j1076J13982J7989m4524j5277J03869N0680
5075A56619j34810k4050O7607P5019l095m5578n3444o4751M8372N9207O7312q853
5063A39555j26465q1156J08587P2676j2761k0073k0088l8463k7977j04502o988
$$ plain form
5052 -117655 -41132 78273 10457 -54327 -60194 -114330 -129102 -86634 -18685 -241 -44629 22228
5040 22228 2708 56801 -7601 -100028 -82817 -105594 -40548 -30861 78720 111222 47139 -55251
$$ packed form
5052a17655P6523J19405o7816o4784n867n4136j4772M2468O7949J8444m4388O6857
5040B2228j9520N4093o4402r2427J7211k2777O5046R687J09581L2502o4083j02390
$$ [...]
##END NTUPLES=NMR SPECTRUM
##END=
