##TITLE=Analysis number 330319
Compound Code cc 61411
Book Reference 521/137
Project Code adrs
Chemist Name evam
##JCAMPDX= 6.0         $$ Bruker NMR JCAMP-DX V2.0
##DATA TYPE= NMR SPECTRUM
##DATA CLASS= NTUPLES
##ORIGIN= Bruker BioSpin GmbH
##OWNER= nmr
$$ XWIN-NMR		Version 3.5
$$ Fri Nov 16 09:29:26 2007 GMT Standard Time (UT+0h)  MAYBRIDGE\nmr@NMR_250MHZ
##.OBSERVE FREQUENCY= 250.131544655141
##.OBSERVE NUCLEUS= ^1H
##.ACQUISITION MODE= SIMULTANEOUS (DQD)
##.ACQUISITION SCHEME= undefined
##.AVERAGES= 16
##.DIGITISER RES= 18
##SPECTROMETER/DATA SYSTEM= dpx250
##.PULSE SEQUENCE= zg30
##.SOLVENT NAME= CDCl3
##.SHIFT REFERENCE= (INTERNAL, CDCl3, 0, 16.522)
##AUDIT TRAIL= $$ (NUMBER, WHEN, WHO, WHERE, WHAT)
$$ ##TITLE= Audit trail, XWIN-NMR		Version 3.5
$$ ##JCAMPDX= 5.01
$$ ##ORIGIN= Bruker BioSpin GmbH
$$ ##OWNER= nmr
$$ C:\u/data/dgb/nmr/ADRS/1740/pdata/1/auditp.txt
$$ ##AUDIT TRAIL=  $$ (NUMBER, WHEN, WHO, WHERE, WHAT)
(   1,<2007-11-16 09:28:58.62 +000>,<MAYBRIDGE\nmr>,<NMR_250MHZ>,
      <created by zg, POWCHK disabled, PULCHK disabled
       configuration hash MD5:
       76 6E 9A 78 1E 09 19 81 EC 84 63 8F B0 6A 59 2D
       data hash MD5: 64K
       27 6D 17 CC 9E AB 6F F3 C5 65 09 E4 C5 C8 8F 92>)
(   2,<2007-11-16 09:29:14.51 +000>,<MAYBRIDGE\nmr>,<NMR_250MHZ>,
      <Start of raw data processing
       ef LB = 0.3 FT_mod = 6 PKNL = 1 SI = 32K 
       data hash MD5: 32K
       CC E7 62 B2 14 ED DF D6 F6 AF 09 C4 0C EA 8D AA>)
(   3,<2007-11-16 09:29:16.20 +000>,<MAYBRIDGE\nmr>,<NMR_250MHZ>,
      <apk 
       data hash MD5: 32K
       2E AF C1 65 39 94 76 ED 50 C0 3E B3 2A 23 5A 48>)
(   4,<2007-11-16 09:29:16.93 +000>,<MAYBRIDGE\nmr>,<NMR_250MHZ>,
      <abs ABSG = 5 
       data hash MD5: 32K
       8B 52 F7 E2 48 46 38 52 02 C3 35 9F 71 EA FF A3>)
$$ ##END=
$$ 
$$ hash MD5
$$ 33 C4 6B 44 7A 86 83 DC FD 77 E9 54 5A DA 13 EF
##$RELAX= 
##$RELAX= 
##$RELAX= 
##$RELAX= 
##$RELAX= 
##$RELAX= 
##$RELAX= 
$$ Bruker specific parameters
$$ --------------------------
##$DU= <C:\u>
##$EXPNO= 1740
##$NAME= <ADRS>
##$PROCNO= 1
##$TYPE= <nmr>
##$USER= <dgb>
##$AMP= (0..31)
100 100 100 100 100 100 100 100 100 100 100 100 100 100 100 100 100 100 
100 100 100 100 100 100 100 100 100 100 100 100 100 100 
##$AQSEQ= 0
##$AQ_mod= 3
##$AUNM= <au_zg>
##$AUTOPOS= <8 >
##$BF1= 250.13
##$BF2= 250.13
##$BF3= 250.13
##$BF4= 250.13
##$BF5= 500.13
##$BF6= 500.13
##$BF7= 500.13
##$BF8= 500.13
##$BYTORDA= 1
##$CFDGTYP= 0
##$CFRGTYP= 5
##$CHEMSTR= <none>
##$CNST= (0..31)
1 1 145 1 1 1 1 1 1 1 1 1 1 1 1 1 1 1 1 1 1 1 1 1 1 1 1 1 1 1 1 1 
##$CPDPRG= <>
##$CPDPRG1= <>
##$CPDPRG2= <>
##$CPDPRG3= <>
##$CPDPRG4= <mlev>
##$CPDPRG5= <mlev>
##$CPDPRG6= <mlev>
##$CPDPRG7= <mlev>
##$CPDPRG8= <mlev>
##$CPDPRGB= <>
##$CPDPRGT= <>
##$D= (0..31)
0 1 0 0 0 0 0 0 0 0.06 0 0 0 0 0 0 0.0002 0 0 0 0 0 0 0 0 0 0 0 0 0 0 
0 
##$DATE= 1195205337
##$DBL= (0..7)
120 120 120 120 120 120 120 120 
##$DBP= (0..7)
150 150 150 150 150 150 150 150 
##$DBP07= 0
##$DBPNAM0= <>
##$DBPNAM1= <>
$$ [...]
##$SUBNAM7= <"">
##$SUBNAM8= <"">
##$SUBNAM9= <"">
##$SW= 20.6930455092707
##$SWIBOX= (0..15)
0 0 3 0 0 0 0 0 0 0 0 0 0 0 0 0 
##$SW_h= 5175.983436853
##$TD= 65536
##$TD0= 1
##$TE= 295.16
##$TE2= 300
##$TE3= 300
##$TEG= 300
##$TL= (0..7)
0 120 120 120 120 120 120 120 
##$TP= (0..7)
150 150 150 150 150 150 150 150 
##$TP07= 0
##$TPNAME0= <>
##$TPNAME1= <>
##$TPNAME2= <>
##$TPNAME3= <>
##$TPNAME4= <>
##$TPNAME5= <>
##$TPNAME6= <>
##$TPNAME7= <>
##$TPOAL= (0..7)
0.5 0.5 0.5 0.5 0.5 0.5 0.5 0.5 
##$TPOFFS= (0..7)
0 0 0 0 0 0 0 0 
##$TUNHIN= 0
##$TUNHOUT= 0
##$TUNXOUT= 0
##$USERA1= <user>
##$USERA2= <user>
##$USERA3= <user>
##$USERA4= <user>
##$USERA5= <user>
##$V9= 5
##$VALIST= <valist>
##$VCLIST= <CCCCCCCCCCCCCCC>
##$VD= 0
##$VDLIST= <DDDDDDDDDDDDDDD>
##$VPLIST= <PPPPPPPPPPPPPPP>
##$VTLIST= <TTTTTTTTTTTTTTT>
##$WBST= 1024
##$WBSW= 4
##$XGAIN= (0..3)
0 0 0 0 
##$XL= 0
##$YL= 0
##$YMAX_a= 273981
##$YMIN_a= -348810
##$ZGOPTNS= <>
##$ZL1= 120
##$ZL2= 120
##$ZL3= 120
##$ZL4= 120
##$ABSF1= 16.522
##$ABSF2= -4.171173
##$ABSG= 5
##$ABSL= 3
##$ALPHA= 0
##$AQORDER= 0
##$ASSFAC= 0
##$ASSFACI= 0
##$ASSFACX= 0
##$ASSWID= 0
##$AUNMP= <proc_1d>
##$AZFE= 0.1
##$AZFW= 0.1
##$BCFW= 0
##$BC_mod= 0
##$BYTORDP= 0
##$COROFFS= 0
##$CY= 12.5
##$DATMOD= 1
##$DC= 0
##$DFILT= <>
##$DTYPP= 0
##$F1P= 14.0000005364418
##$F2P= -0.99999901652339
##$FCOR= 0.5
##$FTSIZE= 32768
##$FT_mod= 6
##$GAMMA= 0
##$GB= 0
##$INTBC= 1
##$INTSCL= 1
##$ISEN= 128
##$LB= 0.3
##$LEV0= 0
##$LPBIN= 0
##$MAXI= 10000
##$MC2= 0
##$MEAN= 0
##$ME_mod= 0
##$MI= 0
##$NCOEF= 0
##$NC_proc= -3
##$NLEV= 6
##$NOISF1= 0
##$NOISF2= 0
##$NSP= 0
##$NTH_PI= 0
##$NZP= 0
##$OFFSET= 16.522
##$PC= 1
##$PHC0= 172.7415
##$PHC1= 3.523688
##$PH_mod= 1
##$PKNL= yes
##$PPARMOD= 0
##$PSCAL= 4
##$PSIGN= 0
##$REVERSE= no
##$SF= 250.13
##$SI= 32768
##$SIGF1= 0
##$SIGF2= 0
##$SINO= 400
##$SIOLD= 32768
##$SREGLST= <1H.CDCl3>
##$SSB= 0
##$STSI= 32768
##$STSR= 0
##$SW_p= 5175.98343685301
##$SYMM= 0
##$S_DEV= 0
##$TDeff= 65536
##$TDoff= 0
##$TI= <Analysis number 999999
Compound Code 99
Book Reference 9
Project Code 9>
##$TILT= no
##$TM1= 0
##$TM2= 0
##$TOPLEV= 0
##$USERP1= <user>
##$USERP2= <user>
##$USERP3= <user>
##$USERP4= <user>
##$USERP5= <user>
##$WDW= 1
##$XDIM= 32768
##$YMAX_p= 464113430
##$YMIN_p= -123142
$$ End of Bruker specific parameters
$$ ---------------------------------
##NTUPLES= NMR SPECTRUM
##VAR_NAME=  FREQUENCY,     SPECTRUM/REAL,   SPECTRUM/IMAG
##SYMBOL=    X,             R,               I
##VAR_TYPE=  INDEPENDENT,   DEPENDENT,       DEPENDENT
##VAR_FORM=  AFFN,          ASDF,            ASDF
##VAR_DIM=   32768,         32768,           32768
##UNITS=     HZ,            ARBITRARY UNITS, ARBITRARY UNITS
##FACTOR=    0.157963299565203, 1,           1
##FIRST=     4132.6476996994, 0,             0
##LAST=      -1043.33573715361, 0,           0
##MIN=       -1043.33573715361, -123142,     0
##MAX=       4132.6476996994, 464113430,     0
$$ Real data points
##PAGE= N=1
##DATA TABLE= (X++(R..R)), XYDATA
$$ [...]
20755 -9482 -12289 20886 39345 24903 4059 -46205 -63412 -66987 -36591 -16114 -26732 -25743 -35945
20742 -35945 -45849 -17622 -8251 321 -911 2554 18808 -9356 -11698 -19933 -21946 -15716 -25134 -21815
20728 -21815 -23280 -22866 -32355 -12098 3116 -933 -28017 -62242 -37311 -10404 -7222 18670 -5566
20715 -5566 -10123 -10401 -25626 -3762 12174 8151 -6766 -35106 -61050 -49666 -24638 -4398 -44867
20702 -44867 -55143 -47975 -39996 -40864 -31525 -58024 -58557 -51086 -36678 -78836 -67107 -47029 -56578
20689 -56578 -46768 -19258 19213 34651 24108 1850 -5581 -18481 -20538 -26971 -26395 -38467 -30581
20676 -30581 -16090 20553 10021 9361 26033 -6113 -34584 -43663 -45297 -21998 -17420 -28935 -29859
20663 -29859 -28588 -47841 -39487 -58795 -52899 -45958 -38035 -25811 -37867 -52976 -59537 -49365 -29469
20650 -29469 -6665 -16348 -6889 -3180 -36574 -16788 10158 -113 -22279 -14397 -1778 -11890
20638 -11890 204 7488 -860 10846 14409 33690 41652 31728 4989 -10877 12219 492 -29307
20625 -29307 -23417 2680 270 4541 -29203 -39965 -38882 -42443 -15214 -4723 1948 6219 4302
20612 4302 7036 4847 -12624 -38531 -81999 -67627 -15557 -30137 -51401 -47866 -38502 -33312 -55660
20599 -55660 -27939 -21837 -17637 6559 6154 -14827 -17535 -14928 -19184 -28829 -45116 -41212 -5686
20586 -5686 34127 32938 -1064 -43778 -46065 -47669 -24598 -5611 22750 13146 253 16487 -25432
20573 -25432 -28199 -13561 -9201 -21045 -3393 -8430 -5968 -9176 -51835 -37708 -36543 -12972 2733
20560 2733 14046 12544 16882 11286 -878 -6333 -14156 -36283 -47022 -33982 -48227 -65440 -61923
20547 -61923 -5176 25317 33776 29007 28256 355 -573 -2240 14606 13676 -34685 -44947 -21213
20534 -21213 -39876 -44741 -41882 -60339 -52902 -37835 -27404 -25055 -38187 -25481 -17947 -3568 6503
20521 6503 6642 4892 -25381 -56746 -67630 -88143 -99431 -104232 -54603 -7420 3416 -10664 -14146
20508 -14146 1033 1706 -5641 -16474 6035 13875 6255 -31658 -45600 -41820 -25173 -9427 -2863
20495 -2863 -12886 -1079 -15970 -32951 -20348 -41898 -18689 -2000 328 1842 5361 -22509
20483 -22509 -20536 -14946 -6411 -30522 -50742 -35146 -1196 16632 20526 7892 13683 17566 8236
20470 8236 -19408 -14370 -25678 -23903 -7558 12047 7102 6071 -17230 -9330 -10967 19205 12966
20457 12966 20614 8640 4127 3047 -25114 -15323 -3459 17504 43266 28763 31327 29730 48865
20444 48865 60935 58776 55016 25450 8615 4652 20261 5563 -6087 -44384 -52325 -34743
20432 -34743 -24690 -5245 12868 -274 -10245 -46230 -66930 -52979 -55970 -22846 12335 18215
20420 18215 4435 -42984 -56804 -25750 -5746 -8542 -29195 -44996 -34218 -33548 -35172 -23200
20408 -23200 -4380 -8102 -8370 -19083 -18409 -28345 -33678 -50069 -37432 -11818 -7268 -36358 -43074
20395 -43074 -53557 -47845 -48546 -60125 -46762 -45946 -26181 -38947 -76103 -79478 -60675 -36512 -17326
20382 -17326 -8205 18567 21650 -18932 -50544 -65438 -56238 -18296 -28897 -39052 -53976 -57595
20370 -57595 -29360 -39498 -37280 -67067 -98211 -58695 -5612 -952 9966 -4493 -10376 -11141 -27881
20357 -27881 -51995 -47249 -44783 -49065 -24763 -14127 -16974 3283 771 13318 17107 -21898 -25172
20344 -25172 -24536 14592 38029 35145 8502 -28644 -48176 -62361 -11645 25689 23312 20942 -2634
20331 -2634 -8313 -4800 597 -8585 16439 24738 -21598 -52093 -39803 -20615 -7395 23844 42853
20318 42853 37363 11400 5953 -14677 -36425 -35570 -44229 -39883 -37838 -10471 -13513 -25863 8535
20305 8535 21216 -5584 -44493 -41580 -49758 -36544 -10729 -11403 -16874 -26969 -21790 -18739 -1890
20292 -1890 12841 17638 -3406 -12106 -9013 18212 36282 17061 -2145 -22752 -20987 10288 -6843
20279 -6843 -5772 -5920 -17661 -7265 -3719 -18918 -11236 27581 47857 14857 -17238 -28961 -16440
20266 -16440 -5131 11122 24652 -5285 -27117 9004 9969 7655 1760 11498 19896 2386 -14841
20253 -14841 -13987 6980 759 -1336 -11056 -38475 -16325 15069 -15489 -24398 -19050 -38226 -35384
20240 -35384 -7063 -28947 -32210 -37282 -41229 -12725 22200 11905 -2023 25932 28997 28123 41003
20227 41003 4985 -31264 -1752 12805 -16180 -39468 -48741 -62349 -66594 -30319 -21152 -28507
20215 -28507 -14922 -17103 -39394 -33835 -55672 -73650 -60351 -21047 14279 32182 30268 -9253
20203 -9253 -23525 11509 28916 -8483 -20078 -49295 -32593 -4993 7828 -9064 -32499 -51413
20191 -51413 -46323 -37803 -20691 9641 14234 -9782 2899 54400 32132 3546 -4407 18940
20179 18940 3521 7847 24354 23674 5159 10369 -5053 -15631 -37898 -51652 -37589 -20226
20167 -20226 -34261 -9213 15147 15041 -40448 -46241 -29274 -16474 -3259 18181 4252 25352
20155 25352 36285 3524 -20455 -755 6662 -80 6831 1585 5341 26601 44295 51966 42070
20142 42070 12275 4987 12754 -24221 -51168 -53433 -34062 -3812 -11583 -29356 -57958 -68867
20130 -68867 -51055 -13840 1152 6573 7822 11089 -11229 -8800 166 -4985 -13903 -7844 14046
20117 14046 12121 3900 -3010 -14399 -1825 17600 14780 23881 44798 32779 25066 13857 -17404
20104 -17404 -28470 -36821 -27188 -21876 -48704 -35150 8185 781 -22889 -15090 -726 -1860 -21548
20091 -21548 -12826 7733 -14591 -3478 9280 18952 17230 30350 14728 -1925 19713 49048
20079 49048 27018 6065 7868 5761 2321 -15954 4357 17323 23414 13776 54940 40322 9219
20066 9219 4906 32570 55075 19717 14202 20408 12120 -20195 -27541 -18999 -7343 -25793 -19416
20053 -19416 -19344 -27905 -22709 -6840 35106 34309 37001 23290 -14512 -31235 -61456 -80150 -96946
20040 -96946 -79819 -38984 -43230 -41831 -56250 -40525 -9209 15619 -2926 199 7111 35886
20028 35886 55659 42582 29094 26196 18688 18374 2613 -27104 -39522 11215 28189 41762
20016 41762 44313 69977 50813 10461 1868 -1465 17491 -6810 -15749 -10896 -11205 -23415 -28004
20003 -28004 -17350 -14831 -33622 -40113 -38677 -28057 -20550 -21686 -27792 -61410 -58810 -45981 -57951
19990 -57951 -73758 -72547 -49079 -23479 -32168 -27893 -28524 -25808 -17443 -16561 -20462 -50655 -56428 -45050
19976 -45050 -19633 -16487 1406 -4096 -8488 -17043 17860 46576 25962 24283 17250 12880 37302
19963 37302 34573 9232 -658 12045 11215 34566 40198 39016 10266 2264 -9316 -12233 -4131
19950 -4131 -23038 -32929 -26303 -12269 -16949 18699 -5873 -3632 10674 26009 63809 59263 31320
19937 31320 -15029 -16831 -3775 24579 48238 39368 7497 -25447 -9051 -26317 -32857 -34124
19925 -34124 -45660 -36889 -26516 -16681 -5887 12566 5291 -20872 9061 23400 1947 445
19913 445 31316 19612 15900 1775 15304 63818 60441 64093 20689 131 -8847 -37266 -52537
19900 -52537 -70582 -52153 -37502 -5260 -23321 -31599 -48213 -43948 -43769 -55698 -45849 -36000 -52668
19887 -52668 -36113 -15065 -6735 -36445 -28302 161 18489 12771 5061 -12019 3422 28507
19875 28507 41786 6729 6117 -3575 -11918 3072 956 13050 17172 23727 27242 7231 415
19862 415 10706 15310 31915 35358 21467 17377 30146 25628 4071 -543 -2125 -15357 15132
19849 15132 35615 2749 -42122 -45179 -22988 -225 5407 14693 -9553 -17371 4781 31851
19837 31851 53472 43665 30593 21209 -18182 -55861 -67820 -56699 -21416 -9353 -3186 1481
19825 1481 -30232 -32617 -12648 -9988 9512 36941 36807 5952 -27428 -22189 -10224 -21956 -44409
19812 -44409 -42134 -45908 -26467 -34346 -40487 -41269 -44927 -37204 -26749 -31402 -22154 -15056 -15021 -16044 -21705
19797 -21705 -29724 -1316 -24145 -30752 -25791 -46050 -60364 -23353 -21416 -42725 -17589 -7827 11250
19784 11250 2636 -17486 -30843 -36655 -11491 -1963 -14940 -7984 8304 11174 15846 17657 12101
19771 12101 27314 28195 43287 55958 32904 36638 55048 42516 25882 -2977 -17512 -26208
19759 -26208 -2628 -9472 3646 -8786 -35428 -30922 -42167 -12203 20198 3931 -35781 -43454
19747 -43454 -52942 -56799 -28529 -30327 -55455 -28629 -811 13694 -288 -3641 -12928 7181 22963
19734 22963 11308 -27860 -37390 -12898 14618 10887 -14279 -15202 -25606 -7339 3228 -15537
19722 -15537 -14892 -19365 -39235 -46112 -10037 8952 21588 -8901 -17626 23548 30684 -25373 -61983
19709 -61983 -59229 -39189 -13801 -16673 -14199 -29485 -29258 -26317 -31570 -35219 -39293 -41022 -36741 -11308
19695 -11308 17585 -4844 -9536 -12203 -6656 18389 12402 -15866 -42715 -12313 -4667 -1349 15028
19682 15028 8617 36948 42148 31075 7690 15425 37240 40347 -12299 -41792 -33381 12044 4260
19669 4260 -8944 -30582 -58323 -54565 -10130 -4029 -18093 -32379 -24483 -32630 -29906 -5923 -13003
19656 -13003 -47182 -52608 -42975 -16851 -19710 -21027 -42811 -29653 -20768 -23065 -20842 -8778 14759
19643 14759 16198 -17603 -45910 -53838 -36730 -20638 -10733 -25462 -26598 -9648 7619 18242
19631 18242 37044 50267 35163 53707 67189 47235 44369 43733 19529 15097 -4419 -42456
19619 -42456 -28320 -5140 -10659 -11171 10542 30662 40313 29961 9311 -3451 -32138 -22728 -8720
19606 -8720 -3723 7832 13720 33787 33998 21215 4553 44261 51049 14525 -9224 -27658 -25610
19593 -25610 -25731 -47313 -68391 -55031 -31595 -15767 -28060 -10927 5166 -968 -17680 -54239
19581 -54239 -71625 -39732 -41052 -49726 -36014 -30345 -40134 -33689 -22534 -24742 -42319 -62049 -52261
19568 -52261 -34053 -6371 5544 -626 12993 53029 32377 11550 9107 39793 51751 32276
19556 32276 13255 -15958 -22425 -44159 -61670 -83435 -57956 -2569 13251 37727 69998 97957
19544 97957 106776 93432 95888 92723 110231 171938 234808 267233 231629 163419 131632 117232
19532 117232 129960 132226 140225 163737 184836 241619 295262 303704 229227 196683 187538 168443
19520 168443 132795 146511 191364 243328 193839 155671 137343 96576 56014 50416 53261 47312
19508 47312 42461 14964 -12140 4886 29546 9748 -4586 -2533 7406 34380 67149 94013
19496 94013 124909 134725 139253 137237 139948 125756 119365 99328 112089 133960 162132 212439 234437
19483 234437 238067 225150 256036 280998 286960 289762 303077 297834 255323 225594 218830 242280
19471 242280 272086 293082 300427 283683 196725 109252 97641 102309 100608 101504 89412 72323
19459 72323 72774 82548 76441 59939 33061 19196 28580 25847 23669 8751 18220 38391 30897
19446 30897 1467 7608 28903 32181 2025 -13647 -33044 -30932 -16923 7217 -6722 2215
19434 2215 5021 -2088 5077 34437 -14995 -42797 -10537 -16244 -19862 -9544 34237 46867 33983
19421 33983 26280 14162 9110 -1621 2448 18704 -5496 -26803 -8517 -8491 -28250 -13266 13351
19408 13351 29572 14365 29041 51584 57888 29915 7843 6752 -28096 -15360 -65 22320
19396 22320 24986 12162 14129 22199 -3276 -2787 -11114 -36364 -52461 -42484 -17325 2607 17599
19383 17599 38369 24946 440 -13171 -13397 25965 22002 4387 -2310 14032 -19016 -12303 -6768
19370 -6768 1453 1378 -1308 -8114 -70 8633 1434 -6219 2256 13739 20769 34420 49308 50640
19356 50640 73057 71717 60890 84258 65611 42864 25318 -15549 -56345 -70720 -37843 -21815
19344 -21815 3670 -7111 -16417 13227 13720 17965 30301 27896 13497 42538 13030 -7623 1375
19331 1375 -2340 -996 20493 17039 5945 -10656 -36409 -16344 10084 -2110 -4829 12648 13985
19318 13985 14225 38379 52352 28305 -9225 5744 37725 20408 26939 20714 1290 22951
19306 22951 21682 -15558 -14169 -30190 -8316 12014 15364 15080 -2251 -18054 -17116 15954 18847
19293 18847 17535 -15037 -2803 1658 -5524 22604 19488 -9894 -26525 -2676 -6159 -14862 -2756
19280 -2756 4663 -1508 -14871 28890 35086 21008 -2454 23747 35442 25771 12646 11743 23208
19267 23208 852 -25360 -26339 -32016 -44081 -23313 -9956 -25589 -19124 -6364 55203 108362
19255 108362 102273 92055 68850 48909 40779 23749 637 6283 -3267 -10809 -23430 -18831 -10161
19242 -10161 -6887 -4198 -11121 -13183 -15185 9690 50907 55738 67603 56936 62583 60507 62496
19229 62496 59623 69759 42704 29630 26827 30424 51088 30756 10706 16841 28968 43486
19217 43486 52922 40825 43203 11352 12379 39826 28374 37053 43785 43263 26357 17184 23055
19204 23055 39231 48515 79729 120804 117478 101513 98816 99191 82425 23654 7285 40393 53004
19191 53004 33854 22742 38946 53247 33325 9048 18184 27351 49931 72464 81309 83496
19179 83496 71530 37648 11296 16226 32647 46327 46213 19561 53659 55486 56937 87431 96021
19166 96021 85152 34231 42019 52569 40772 16576 -12374 -24777 -14565 -2737 36709 56067
19154 56067 66731 78034 92811 96532 119365 106264 88948 76106 56455 78614 70356 44982
19142 44982 24753 15685 -3366 -3193 -6013 3353 7941 35341 40430 25613 30380 51195 105088
19129 105088 135673 121812 103081 116711 116553 77432 42299 33924 22707 23941 64693 75780
19117 75780 48970 30585 14062 27067 69318 61396 39682 53564 34326 31638 53569 62509
19105 62509 44729 43474 37891 56318 67858 45539 64684 109655 103581 73056 77074 66886
19093 66886 41940 83777 100855 104752 123317 106727 106607 129792 113617 66774 66449 53970 51838
19080 51838 63306 94451 87142 140126 179301 173290 181215 186267 163863 143831 158645 145754
19068 145754 132120 114163 98870 113575 148246 148725 147135 161170 163571 189753 177989 140783
19056 140783 155325 168746 150437 156694 165316 178834 203461 244178 312778 311383 289537 307779
19044 307779 317640 329766 382057 409759 441094 446025 487879 550054 606737 689699 871226 1180273
19032 1180273 1380602 1488802 1563081 1601958 1626306 1734091 1933821 2269849 2803966 3729083
19022 3729083 5374788 7877023 10049556 10508056 9962185 8817174 7262938 6202516
19014 6202516 5829710 6073294 6778816 7869039 9427401 11637617 14820446 20034310 29690165
19005 29690165 48479901 76762453 97264518 98391434 92574482 80738582 64660137
18998 64660137 50427444 40161889 32140140 25512425 21918536 21395728 24020503 29213529
18990 29213529 33242039 32600554 29024768 23580560 17302763 12512316 9467519 7619499
18982 7619499 6484613 5759620 5246548 4910986 4784667 4743270 4745616 4746451 4674275 4535973
18972 4535973 4442240 4456493 4612514 4963696 5525796 6389981 7602095 9530884 12921505
18963 12921505 18823970 26594139 31878092 32383012 30365756 26487182 22587844 20851540
18955 20851540 21831927 26388668 35009361 44782984 54047217 69690164 94508058 112998188
18947 112998188 109934332 96519628 76643264 51967540 34286457 23970951 18054404
18940 18054404 14526589 12279766 10670883 9460653 8619837 8248247 8594300 10047284
18932 10047284 12340754 13487693 12663885 11108592 8817254 6499440 4936459 3982576
18924 3982576 3416612 3013135 2744019 2592900 2510414 2444217 2278817 2025383 1736720 1469000
18914 1469000 1254932 1129116 1051476 992423 921532 851612 804033 746617 711926 690768 671303
18903 671303 654330 617566 572245 557531 517287 486578 483185 440517 400195 378473 382627 363148
18891 363148 322012 263713 245885 254950 243042 229532 220299 230812 204659 204145 203367 194019 199229
18878 199229 200524 221883 235249 234676 212190 185131 164954 151395 166072 172088 177411 172788 150820
18865 150820 150337 156229 158849 141386 147187 137846 135145 121919 110695 125002 124363 99173 93826
18852 93826 85278 77950 105857 128456 149513 176265 179815 161722 135650 102797 105753 101601 68005
18839 68005 60408 74110 73708 106266 119560 117329 139935 174149 194238 167943 114959 62295
18827 62295 21824 58788 62652 67769 76571 70591 54981 26922 8645 14836 21519 50668 70658
18814 70658 71502 62540 76288 94954 92132 66187 85401 87706 86702 92283 76070 84789 91764
18801 91764 78407 64487 70400 60022 32886 15897 67855 100234 85751 56966 35950 35290
18789 35290 49811 71094 106746 121274 115283 68193 48714 23201 27636 28713 51085 81974
18777 81974 91343 70382 55758 78868 97955 76857 111394 226166 315985 353186 300733 266356
18765 266356 206925 169655 151684 110213 92166 95284 74061 80156 103239 93857 76898 43722
18753 43722 16171 32929 31556 25441 29390 51596 73856 91854 71996 32222 13647 48854
18741 48854 52029 50803 44699 60467 44101 24705 9645 10062 41886 52752 66548 69105 68226
18728 68226 66041 61411 50530 38035 1869 -3889 16395 23462 27979 40920 45044 21228 4015
18715 4015 9460 30825 53724 50372 22243 18326 24619 3280 -2599 -1081 11149 -7358 -1976
18702 -1976 29617 33787 35060 28792 8965 -10728 5550 27130 16016 12758 13144 17319 3731
18689 3731 -15800 302 39498 44595 28883 28367 22940 16249 6333 -3059 -16079 -5279 12246
18676 12246 1743 8836 2563 -7246 -58102 -47766 -29152 10477 -3311 -29773 -849 -6803
18664 -6803 -16387 -16348 -10246 -11941 -19018 -15153 -20302 -18740 -8193 2717 43687 17379 29683 22840
18650 22840 4906 35628 45561 45946 61408 90242 79083 59704 12214 6598 8170 25643 34306
18637 34306 30611 9927 -8085 -33724 -48611 -28746 15777 51633 16461 -9733 -975 -17503
18625 -17503 -18837 -28783 -21611 3953 3733 2422 16087 30329 19171 -13121 -8672 -8525 -2326 -1049
18611 -1049 -13346 -2643 -325 29523 35655 40850 63410 38468 27044 15575 16027 -8263 -3281
18598 -3281 13588 6455 1002 -8001 -25386 19319 14692 3011 23307 51444 64625 40405 32
18585 32 12123 19254 20528 33047 5006 -11799 -39780 -27146 -8639 13252 -11941 -37094 -29342
18572 -29342 -14988 -17973 1579 34180 -12949 -29766 611 42686 52051 25044 10500 -752
18560 -752 -1545 -23487 -10833 7126 -17916 -4830 -888 -11432 -240 -12659 -27150 -14000 1454
18547 1454 -8894 -21336 -35216 -41787 -33386 -14694 4989 19230 15503 -12456 -25923 -28148 -32083
18534 -32083 -46913 -33048 -21797 -16987 245 38827 17350 -919 14557 8190 6501 -5429
18522 -5429 -31260 -46330 -64692 -68481 -65338 -73395 -85211 -80483 -16562 -2271 -4662 -18046 -18987
18509 -18987 -18399 16623 7015 -18086 -36570 -21083 -16926 -11703 -8456 -23920 -26742 -7715 -9403
18496 -9403 16883 24100 13292 -15088 -33774 -32874 19484 12273 17912 42681 25490 38334 61731
18483 61731 70380 71438 75886 75259 81546 80438 125261 200048 218223 203770 183446 136577 158947
18470 158947 219293 267209 323685 302748 295474 253628 256061 277460 285802 262879 232430 178643
18458 178643 127785 89082 81422 93972 74999 55643 32397 35732 68137 58508 50447 76588
18446 76588 67487 62472 65408 61434 63162 44756 26896 41323 32260 26449 11061 41004 36275
18433 36275 33163 59842 79903 124463 158655 190334 201204 223023 242278 262462 249727 261033
18421 261033 326524 362142 338837 314463 258688 201051 151179 122979 122161 103038 113713 165557
18409 165557 248609 285816 287790 270674 258061 249211 235092 239791 207546 180683 123728 97532
18397 97532 90098 37946 1710 12836 5518 -7121 9794 19911 24965 17942 8774 -1039 9355
18384 9355 17461 57858 69487 78931 45893 39104 34139 6275 -5588 5764 7715 8329 8154 35518
18370 35518 42057 62509 27160 18630 48933 36599 24838 64060 76164 62163 63053 73622
18358 73622 83056 71780 47483 37081 27164 25207 10122 6107 25759 47476 45195 51212 40988
18345 40988 45809 53874 39537 46958 70167 102734 151371 215000 277048 351190 406839 417790
18333 417790 385918 340519 267167 262302 323340 381181 439446 456615 445552 397832 326818 271487
18321 271487 256918 293591 330308 353250 377544 362853 322371 295451 240924 200052 185723
18310 185723 149848 150914 170361 153754 194121 222548 225468 215535 221101 227695 246367 292211
18298 292211 301467 265751 228152 208385 237362 238114 206244 169050 164443 147712 108589 83286
18286 83286 57440 35309 17356 33657 45894 -3921 -4860 21934 34024 12541 22262 70244
18274 70244 96916 92807 94851 89843 73770 87998 76638 93136 106852 92108 123320 174959
18262 174959 245860 306547 333209 336338 307330 269991 291715 332992 389814 494349 586142
18251 586142 634098 643465 606351 536575 463721 459878 518103 623970 720036 713921 641763 498834
18239 498834 361764 260507 203963 159818 153259 123640 108347 121675 123405 120797 117892 89439
18227 89439 69517 69343 65097 60677 57044 37806 11495 9293 38723 69763 80709 80229 79637 80164
18213 80164 67286 93225 113920 104354 85499 66722 77070 67042 57630 31379 25179 29977
18201 29977 35089 54238 86572 115244 94647 82880 68191 34488 29909 58996 89446 58363
18189 58363 29785 30784 39546 54309 43540 31160 23078 43963 37354 24201 -1565 16027 22081
18176 22081 5627 4157 39800 75140 95940 108654 110183 65352 11759 20524 38348 68951
18164 68951 51265 55554 48962 54727 58500 62814 93693 80124 59341 92206 128279 126700 95131
18151 95131 79961 67292 72281 87351 85246 78944 64397 79921 74945 71545 100217 107509 132490
18138 132490 171928 204230 220102 210396 169821 195036 262467 323227 371809 452391 538455 603760
18126 603760 649999 726958 839441 959226 1107473 1331681 1633360 2064786 2655942 3451525
18116 3451525 4559079 6118516 8570630 13284252 23670736 42747906 58369039 57080887
18108 57080887 50422853 39210392 24406425 14943963 9884512 7099558 5388707 4285745
18100 4285745 3525860 2914520 2467555 2123164 1812166 1547891 1354792 1199324 1033428
18091 1033428 899710 843499 806254 800216 752146 670197 562345 499921 463642 422320 390303
18080 390303 398949 394454 384056 368475 338721 325140 337024 345214 296488 246667 238466 245332
18068 245332 244520 212013 181652 177618 160586 116418 121607 124541 136330 151170 157213 139305 110331
18055 110331 107571 104997 123616 138553 175406 164346 146393 177116 171177 212472 248376 241368
18043 241368 212449 164818 107534 102029 96880 111828 115622 129873 157760 173842 176942 168847
18031 168847 159497 131812 124485 147347 140819 106947 111025 128220 144224 147262 132324 94356
18019 94356 84554 86692 100605 114355 117996 100171 72880 80266 82857 78982 68464 109836 129233
18006 129233 114408 110205 82844 35642 12463 19302 34849 24564 33052 49159 59816 112447
17994 112447 132611 97249 117565 124525 131645 114545 111026 105488 99367 74633 86531 62260
17982 62260 33788 43879 45223 58132 49974 23058 21962 50935 81043 69135 91783 106651
17970 106651 123372 126391 115588 72073 85069 119806 131741 130012 80524 82163 78537 108937
17958 108937 102454 98460 88124 75830 83262 75711 70771 57673 63458 71909 101842 122737 129502
17945 129502 114270 104335 112659 142587 167094 176224 197319 221305 159568 118199 95508 69174
17933 69174 72629 95002 92358 95014 98091 106463 73773 62123 91400 118735 146315 134532 135459
17920 135459 140501 152416 163950 181107 172239 170128 134021 120352 129805 150276 176130 215247
17908 215247 248316 263924 228619 196236 175904 146155 125052 116064 118012 140188 156573 136189
17896 136189 115736 101276 98159 86316 94123 106420 104227 129965 138825 122601 117521 129627
17884 129627 160375 159795 153767 195146 213495 209294 207310 193123 182784 186380 175847 189241 226234
17871 226234 235771 223388 245699 272247 308543 305221 286484 292160 288174 296002 294647 287303 261971
17858 261971 259401 274461 290353 297198 267542 238846 251396 246620 239944 263645 280336 300930
17846 300930 310771 316931 337873 350801 343499 343951 321864 333067 365868 404576 438310 456159
17834 456159 468666 498136 521169 524259 587830 719895 872654 1037363 1176083 1259863 1301189
17823 1301189 1321156 1337654 1413496 1545399 1674057 1772500 1949569 2225750 2677653 3299883
17813 3299883 4289690 6004597 8693655 11282935 12021647 11440918 10266738 8573759 7375257
17804 7375257 6965842 7160772 7826733 9047580 10918361 13522465 17082328 22708631 33059092
17795 33059092 53059378 83385258 106297949 108303673 101864954 88819861 70633021
17788 70633021 55027816 44039028 35513534 28735864 24817852 23804984 25877190 30755207
17780 30755207 35188485 35137138 31662093 26299867 19837993 14670802 11379050 9403096
17772 9403096 8240195 7499481 6871143 6331081 5875846 5529288 5338874 5256957 5287358 5396560
17762 5396560 5626828 5917684 6246349 6667784 7274795 8087150 9249112 11088515 14260485
17753 14260485 19689024 27257263 33379320 35252527 34709690 32663661 30558840 31100427
17745 31100427 35583028 45303159 61841543 83713793 106886428 130065532 152566140
17738 152566140 163929130 153224192 133183627 112423678 94911621 91093416 96833527
17731 96833527 100204247 94896677 82480543 65840694 49084866 36113120 27663089
17724 27663089 22670611 20374831 19956313 19548846 17899011 15736560 13162182 10514020
17716 10514020 8531370 7156353 6178504 5464213 4939527 4551938 4262623 4049463 3876723
17707 3876723 3759978 3707404 3577768 3316970 3004710 2710897 2544709 2448420 2398243 2360201
17697 2360201 2289843 2161339 1994128 1825883 1698835 1633978 1573148 1555807 1580031 1597380
17687 1597380 1638988 1616076 1598705 1600756 1650548 1739248 1813179 1874006 1930931 1935353 1944808 1977676
17675 1977676 2036171 2190046 2431045 2591562 2680014 2690649 2656277 2718480 2963183 3275228
17665 3275228 3707993 4240793 4935772 5864623 7077378 8802382 11278250 15002250 21146207
17656 21146207 32343381 52075703 76306030 89322222 86904318 77357444 61764456
17649 61764456 47055724 39936353 41590709 52857403 69411681 77620724 73199673 62957016
17641 62957016 47608280 32422328 22179117 16024925 12223117 9754686 8093162 6947622
17633 6947622 6054338 5309014 4687582 4152462 3707651 3303808 2966732 2729952 2631763 2602541
17623 2602541 2534531 2465732 2327977 2102951 1859609 1672487 1506923 1408271 1388257 1391477
17613 1391477 1367611 1297343 1213386 1092719 979625 855983 789902 719046 661930 615279 585500
17602 585500 569758 555890 504193 481540 484438 467078 451750 450897 446249 451735 440980 441941 390732
17589 390732 340913 324431 313699 323958 308982 309132 321137 324043 297679 253367 238743 243599
17577 243599 217835 187133 189202 188322 158628 181750 187330 192890 220726 217513 220931 210354 185274
17564 185274 175995 160896 172416 177806 189015 169446 148169 129852 108839 120025 166850 194686
17552 194686 198286 217679 221084 204210 174413 183063 189287 172435 166700 178580 178639 152447 160386
17539 160386 133692 111922 97764 124896 130387 101220 99497 119360 140051 157025 120587 108697
17527 108697 103481 110239 101786 82042 65115 65111 84659 98280 107551 91399 75401 45428 63456
17514 63456 67427 72730 98147 90342 46491 35888 32237 23283 1810 7801 30156 67958 86326
17501 86326 79048 50009 56282 77143 91806 74363 39356 25302 42508 64322 74146 94597
17489 94597 120605 112284 94234 93036 91598 85284 81485 107267 134655 144123 136439 124887 113741
17476 113741 123198 96511 104706 101966 82311 83315 54727 21352 29197 48421 54639 64580 46751
17463 46751 51736 40249 36476 55528 60052 59556 68865 64098 64792 64388 58014 52203 46119 59815
17449 59815 85030 58381 50792 87218 177978 292357 324541 290751 273112 192645 129478 92946
17437 92946 67313 64020 48424 69812 101043 99290 72101 85884 108862 82163 62654 46192
17425 46192 33340 19628 14961 10430 30915 41203 27670 24803 43053 38578 48497 74532 80091
17412 80091 81063 64752 51153 52809 49562 66302 48526 43654 35957 33940 50115 65587 61608
17399 61608 45431 35272 42351 74727 45450 9939 -8605 25986 52662 56333 53033 33942
17387 33942 9778 16496 31762 11590 -15367 -9714 23588 31531 25046 24868 17841 -3544 -8657
17374 -8657 -31607 -29256 -21049 -18873 -8851 2934 2171 -8050 11344 -15017 -46672 -73483 -65492
17361 -65492 -16555 17527 -2825 5433 25203 -2764 -17561 -21930 -10487 7052 687 5251
17349 5251 35385 33886 37005 46472 32374 39828 23003 21238 12312 8756 11179 -15132 -22621 979
17335 979 16763 32171 25884 15343 -18493 -44940 -44501 -40635 20638 55342 69225 50432 33592
17322 33592 42622 42995 57048 75498 66782 48118 8482 4625 37085 50377 26803 29525 43401
17309 43401 36903 13429 19496 -290 -11539 -33772 -18927 -9033 -10488 -5582 -6136 9784 5326
17296 5326 -4624 6764 8950 14474 12146 -785 -854 -5672 -13572 -19571 -5534 28658 60787 105895
17282 105895 160140 195713 197762 219565 241342 238952 248061 250023 260052 254832 223733 151437
17270 151437 127031 131625 157710 192370 243185 300266 335377 326465 274804 208053 128555 101547
17258 101547 118157 104729 107975 105704 122547 102403 109124 126254 123122 103764 106717 133652
17246 133652 99945 72502 92819 62546 54282 65789 59139 50710 84316 95523 82936 92435
17234 92435 98283 119817 173642 215845 213590 222848 253777 292771 321709 320792 294181 267538 237767
17221 237767 205756 170413 134990 115855 108284 141042 143344 130821 122479 113660 147888 210158
17209 210158 266712 314938 333743 311103 256080 181557 139813 117411 94743 79778 37834
17198 37834 50507 35382 15566 17691 19240 34754 24283 44214 55802 9865 11039 -2909
17186 -2909 -25964 -20251 10076 6872 21803 28349 6637 22819 51277 35636 51488 52565 57510
17173 57510 44179 19632 23779 16400 3009 11398 -6892 -13511 -19811 -8089 854 26898 60952
17160 60952 75597 73204 52711 32033 15842 9686 28549 77939 99585 84518 78942 37214
17148 37214 -1148 15217 19940 25451 49398 84056 112184 133970 206419 273029 333083 419152
17136 419152 435101 394350 354055 329039 291712 253612 260122 352243 413483 378784 369807 341422
17124 341422 286125 184945 127151 97547 64722 49968 41699 20169 20998 40413 29250 29265
17112 29265 58082 15117 -22954 -4380 -10757 -24171 -5714 1287 -19846 -40881 -37028 -42210
17100 -42210 -32602 -10951 -2642 -11759 -3449 15915 32940 42021 64719 60866 72197 82042 46131
17087 46131 -11275 -12629 721 16464 13833 -13169 -35746 -49813 -20658 21165 25534 18491
17075 18491 -14819 -5779 -1572 15278 20724 28812 21487 7762 15032 -1498 -3062 16392 37116
17062 37116 59051 77517 69696 44860 27595 30885 30351 13132 27217 10630 16896 74473 194098
17049 194098 297402 355348 394485 397296 330720 271818 231962 242100 273640 341002 352560
17038 352560 335590 317597 277973 227201 156714 125254 73811 71505 60347 19830 -1316 -30429
17026 -30429 -2779 20918 13837 708 3830 -940 -28232 -8755 36325 72733 80247 76289 48522
17013 48522 19028 3244 -4190 5744 72522 88644 49063 8632 3315 -18337 -35348 -46076
17001 -46076 -53404 -25192 -3174 41159 61056 63394 82334 85660 53715 47304 35521 20618
16989 20618 -8063 -21406 -2239 -1905 -9160 -29786 -26387 -12567 -6439 11567 6109 -11141 -20380
16976 -20380 -20949 -29066 -41480 -19612 8392 22776 39284 8169 -9746 -20200 10621 5461
16964 5461 -5221 -13578 -9907 -12256 -1693 12449 13346 -6927 5450 29196 14633 21917 13034
16951 13034 -7068 -4199 25256 33896 11001 6489 -13469 3097 13912 22229 28134 12073 6973
16938 6973 36602 43083 29984 29459 27635 -10896 -52575 -64160 -53345 -45480 -47207 -30771 -18563
16925 -18563 -11717 -9432 -2098 27172 42948 28397 10791 -18531 -13459 5826 26368 23084 226
16912 226 911 10627 -22574 -13402 -3589 -39829 -66428 -55139 -51526 -50921 -18419 14708 1802 5506
16898 5506 19596 35372 31736 19580 -1449 -22433 2004 51806 59680 26906 -7259 -15381
16886 -15381 -23804 -27913 1258 17012 7243 2161 9517 1666 -26938 -29075 -18621 -16660 -12293
16873 -12293 4377 29042 12502 8319 14524 3894 25252 34001 5926 14977 -2176 -44868
16861 -44868 -19712 -6549 -7556 -24855 -33683 -25440 -17838 -24676 -41836 -39988 -20319 -26878 -47788
16848 -47788 -27452 -46687 -82176 -76743 -23580 9558 2758 27023 26011 14996 11723 -7983
16836 -7983 -15062 -50563 -45083 95 -20825 -61208 -67316 -67935 -66220 -80201 -84422 -48523 -3060
16823 -3060 -13357 -26773 -22494 -3519 -6533 -1928 12611 -23540 -32216 -26343 9174 15210 -16914
16810 -16914 -26122 -32542 14711 70025 32689 21093 42604 27219 37585 19734 3490 23923
16798 23923 29948 21387 33034 29746 4856 -24983 2453 2223 -231 -4917 -2713 -10209 892
16785 892 -8619 -34068 -22076 -8522 -10922 5952 27062 9017 -14589 4209 38373 45728 44892
16772 44892 25900 -18856 -32782 -33522 -16118 -25606 -26722 29107 39885 12439 4106 22319 35736
16759 35736 14472 -9649 -4771 1144 16439 17315 21427 20928 38963 -1059 -8577 28650 39827
16746 39827 10854 -11924 21515 47923 39242 43552 44403 11969 2586 -4098 -6534 -2945 14563
16733 14563 31994 56467 49628 56669 50633 34545 19639 26390 8476 -22474 -19907 -21022 -24582
16720 -24582 -11399 -9157 -4659 22074 20313 -2322 -26975 -51495 -60026 -52363 -37304 -25055 -33501
16707 -33501 -9783 15981 14254 -6788 -4191 -6755 -8798 -21257 -281 13769 20465 -6304 -26493
16694 -26493 -24697 22449 38785 23882 -6812 -26677 -8240 10221 24312 37360 22785 32772
16682 32772 25137 23457 11252 -10051 -10814 -16197 -22203 -33216 -58338 -15369 15460 -337 -44860
16669 -44860 -8290 -2957 -32714 -30393 1927 10175 7870 20385 18727 38884 35962 26865 11475
16656 11475 3066 10409 34956 13358 -32204 -28313 -31042 -14943 -4972 -38002 -51014 -30006 -42530
16643 -42530 -35831 -39664 -66249 -59888 -41861 -45163 -63595 -59557 -55748 -29152 -7647 -3070 -11924
16630 -11924 -20681 -40759 -47221 -52851 -56891 -50328 -49071 -13337 -5048 -17635 -21517 -14509 -21417 -23286
16616 -23286 -31514 -56327 -47418 -36460 -29358 -24346 -12660 -5289 -12367 -30293 -37510 -42510 -48554
16603 -48554 4590 46379 52945 33387 7225 8768 -13527 -21936 -16407 -10268 1528 -21295 -57041
16590 -57041 -68632 -70995 -48858 985 31182 44074 11045 -18048 -10832 -1066 -2162 -21685
16578 -21685 14365 30284 22190 23529 -3439 -7238 -1293 3698 7490 3826 -12794 6066 12851
16565 12851 -6643 -13265 -303 19790 852 -15056 -46329 -22529 25627 12063 -28044 -34761
16553 -34761 -30705 -23720 -30796 -9387 3203 -38043 -19484 14443 -3287 -10121 -5579 -15553 -4087
16540 -4087 -8449 24636 37758 -4712 -30135 -32524 -10944 -10903 -17903 5429 16457 8292 -9103
16527 -9103 5418 20833 32416 6449 -35991 -27065 -3614 6275 -7098 -9295 -12520 -5454 -8076
16514 -8076 -14316 -13375 -5610 -10674 -70194 -84571 -53373 -34949 -4504 1479 9338 -12434 -45482
16501 -45482 -46493 -32645 6521 30936 19351 -1407 -11991 -18292 37795 63385 44134 27773
16489 27773 16681 10250 28724 59595 47891 8413 16386 50797 59219 41941 28530 16450
16477 16450 -16223 -32142 -30755 -5679 -32911 -25130 -10497 -22792 -25517 -3736 20082 33666
16465 33666 22630 17700 36073 22756 28221 18271 30637 57770 46375 30188 20066 26752
16453 26752 35838 24650 2726 -10940 -6729 -11587 -7766 2922 -384 -5564 -12357 -21886 -41591
16440 -41591 -40832 -38829 -15685 7532 -1715 3703 24706 9454 16834 9935 -17312 -14531 27476
16427 27476 54701 51586 28879 25026 15812 -10805 -6532 -9050 -35843 -40135 -5320 -3845 -33475
16414 -33475 -28151 -28438 -43669 -61028 -78186 -58191 -43387 -50217 -48735 -73977 -43894 -27043 -56504
16401 -56504 -53162 -38119 -58418 -46804 -45888 -28747 -19911 2445 9299 -37694 -72459 -49158 -10336
16388 -10336 2928 4059 6970 5046 7303 -1655 -19649 -11113 -22821 -15681 -13 14345 7434
16375 7434 2473 9110 -9495 -9510 -48586 -50719 -53113 -2174 5877 7423 -3314 -23305 -12571 -5521
16361 -5521 -25717 -65369 -60751 -37578 -52550 -46295 -40438 -34723 -61600 -60852 -52853 -35427 -23302
16348 -23302 -5758 -10007 -27581 -19664 11717 4273 31949 13869 -24907 -28595 -1606 -18117
16336 -18117 -36229 -50358 -24903 -1770 -812 -2894 -4261 -17125 -20031 -1115 -10005 -13520 7876
16323 7876 -9108 -23269 -25349 -25923 -18702 -20123 -8678 13485 20073 23095 2945 -12816 -10085
16310 -10085 4918 14173 673 -22157 -29989 -13698 26489 45851 66467 48696 8347 20441
16298 20441 12164 -31215 -40819 -29649 -13035 -13249 -21881 -22479 -31896 -9579 -1282 -38424 -42128 -4412
16284 -4412 -12368 -13962 -3326 7167 -9396 20103 46523 52508 45587 27603 -2273 -13478 -10813
16271 -10813 -21576 -13766 4273 1630 -24248 -40938 -58081 -67372 -41889 -32905 -50478 -41560 -39102
16258 -39102 -10694 12403 2727 -4927 -1126 4967 -4224 28523 39709 33409 21020 6118 -29065
16245 -29065 -54768 -33866 -18163 15582 8737 10306 -14449 -31945 -13148 11312 144 -24398
16233 -24398 -21862 1452 13673 -2270 -10903 -14532 -11315 7254 4747 -8844 -8443 8323 12467
16220 12467 -7337 -27283 -22970 3073 -19594 -45758 -44011 -27632 -7830 -5832 -18188 12586
16208 12586 28238 31137 17955 13432 -149 -33083 -83055 -78630 -53740 -34186 -35587 -16121
16196 -16121 -2565 20360 64669 94335 71950 56226 28211 11853 42838 41648 16378 -6887
16184 -6887 -22381 -48194 -70945 -65472 -56866 -68291 -49824 -36924 -10282 33353 31575 -11351
16172 -11351 -32373 -23911 -28877 -26787 -7952 4157 -1720 4786 -12602 -28372 9816 15091 16775
16159 16775 -5873 -30877 -28097 -10757 -10196 -3721 -19161 -9724 3922 -13866 -32062 -31214 -35115
16146 -35115 -26729 -3449 31368 12625 -18722 -29506 -30637 -34560 -40572 -37242 -40217 -53670 -75986
16133 -75986 -92537 -55125 -46965 -57383 -60935 -52121 -39074 -1495 -9584 -31355 -41578 -5051
16121 -5051 8963 12660 22247 27382 8359 14002 9019 2294 9326 1361 4311 2830 -20213 -31504
16107 -31504 -24567 -25119 -18342 5703 16427 -9433 -15466 -3406 -23626 -18225 -3557 -3169 18599
16094 18599 22196 33781 15717 -15177 -28665 -31987 -57773 -46587 -21231 -3628 -14283 -40336
16082 -40336 -38902 -26335 -12162 -2243 19483 13268 10061 -3535 -26977 -4498 20023 48468
16070 48468 36567 19330 3579 28645 28572 2313 -21667 -29533 3313 11329 -6666 -12117 -24246
16057 -24246 -37787 -50754 -61564 -37195 -7633 29350 37697 12692 -9169 33725 51254 16670
16045 16670 -18128 -54641 -59080 -54253 -38698 -9737 4117 27287 11346 -14338 -14915 -12340 -36888
16032 -36888 -7720 -5012 -8895 -22408 7884 69524 67265 61936 68910 84687 54638 34825 5115
16019 5115 -1615 -5853 -12809 1778 1875 -9347 -14958 -28702 -32377 -30927 -701 23020 -4522 5051
16005 5051 -8418 1920 -8752 -36804 -30538 -5688 9381 -4330 -10733 17030 11624 -13988
15993 -13988 -1223 26721 15664 -816 -12538 -7914 -14237 -6142 12664 23989 34307 -3252
15981 -3252 4707 6742 6137 10725 18320 -15501 -30285 -41804 -16795 -20380 -47987 -64839 -44574
15968 -44574 -12656 -11618 2802 15241 26940 34201 25751 31171 8317 -16826 -15600 -22137 -19320
15955 -19320 -23334 -10443 21284 40553 32881 40458 34948 54265 67112 57938 20176 34372 59186
15942 59186 81153 75726 50931 38705 36451 44494 24634 -14350 -3839 23921 32164 35230 13452
15929 13452 -20730 -44176 -40003 -10363 11642 26018 24725 -2525 -30105 -31858 -20631 -18627
15917 -18627 13086 40569 32611 -8205 -36980 -42849 -53117 -61844 -47122 -10302 -31086 -57642
15905 -57642 -51936 -31986 -6517 -5720 -26870 -33317 -65352 -55603 -36857 -28865 -14718 25754 -1309
15892 -1309 -23697 3481 15409 13124 28397 45335 22436 11327 8310 -81 -5710 -2075 -8828
15879 -8828 14876 17619 -5759 -19925 -26555 3372 -8103 -28614 -50158 -35778 -32271 -15164
15867 -15164 2543 29950 38958 29935 -6068 -12687 -1719 -14950 -37240 -34035 -6828 -15255 -38825
15854 -38825 -25766 -36730 -69498 -57546 -41939 -35293 -11741 11362 7929 10553 -5920 -4517
15842 -4517 29616 26858 48688 43704 28948 26347 13779 6128 -8750 -13973 -7801 12672 14128
15829 14128 -35643 -38398 -36023 -47786 -42066 -29986 -19759 -11062 18530 14887 14931 36504 20855
15816 20855 10771 22427 34571 29015 9619 25280 27092 21622 -10344 -34819 -50806 -35644
15804 -35644 -39887 -48991 -53863 -53597 -16151 -19876 -29482 -13439 7442 39453 13814 -8766 -34286
15791 -34286 -41808 -6605 18430 5675 -15071 -18595 -3407 9718 1426 25292 34819 13478
15779 13478 3275 1076 27094 58025 43042 -3600 -22964 -30038 -35602 -41571 -14174 27454
15767 27454 19431 -7464 -8491 -1871 6811 14821 -6902 -7199 -2658 -22613 -4380 12413 43539
15754 43539 50798 18010 35578 42709 18069 19557 25144 43875 31789 14700 19726 38665 38237
15741 38237 411 9524 18703 5206 -5123 -6639 -29177 -6395 15994 27025 42353 19336
15729 19336 -5126 14783 7349 -864 7972 -28386 -46236 -60977 -50798 -36120 -18031 5670
15717 5670 3086 -1392 25277 30905 44954 20359 -13552 13047 36697 48156 23147 3109
15705 3109 14255 23976 20722 18505 34814 32581 20438 -35428 -47388 -50657 -25409 -18007 -23790
15692 -23790 -35012 -44220 -59223 -14741 -8027 -4930 34990 49165 25461 3838 -7524 -6670 -17721
15679 -17721 -33969 -30082 -23782 -9012 8014 10728 -5205 -20266 -3141 14515 20368 24170 -2285
15666 -2285 -9065 -6254 -16855 -6552 -29385 297 -3919 -27530 -38295 -7969 14744 6224 -13771
15653 -13771 -28575 -17245 -13812 -8590 -10265 -12077 -13867 -2250 11412 19336 295 -14410 2167
15640 2167 17697 21744 -29456 -57839 -56247 -61491 -26846 8801 2852 -129 -19282 -21852 -5483
15627 -5483 14926 24126 29167 31477 24428 5401 -5328 8538 18647 -8303 -19028 553 16052
15614 16052 15223 16566 8339 13318 20849 33811 42741 67122 55537 34190 18303 -67 17923
15601 17923 30939 39471 40196 20792 13967 -22443 -62505 -79734 -58301 -13086 -19229 -44717 -47976
15588 -47976 -53377 -18258 14948 32472 45920 53726 42133 48446 62770 33463 -1664 34617
15576 34617 38335 14181 5897 6013 16545 5625 22647 -1070 -16918 -14528 -33653 -26333 -26384
15563 -26384 -25234 -14042 -35281 -31475 -17087 -40893 -6720 59441 52270 29246 27671 45359
15551 45359 51156 22128 -5989 -53890 -78266 -50948 -55299 -38885 -19638 -7126 -29459 -27502
15539 -27502 -17744 -17657 -30474 -33262 -38706 -15311 29167 18565 -30164 -41419 -45994 -28209 -1792
15526 -1792 -1430 -10989 427 -47414 -86988 -89181 -53433 -41467 -22862 2672 5660 -21594 -21316
15513 -21316 -28253 -14373 24661 27806 43508 44545 40624 23899 -7804 -24187 12067 31224
15501 31224 58205 58293 31807 7723 -16817 -9042 6136 6032 6774 15669 10881 8006 -4553 14052
15487 14052 23255 48669 72549 65018 44307 27397 13529 9567 10604 7518 -20057 -30675 -28829
15474 -28829 17114 23206 4912 -7814 -21135 -7429 -13722 -31708 -27485 -12535 -6570 -5530 -8507
15461 -8507 -43610 -59602 -37983 13634 24401 10897 13204 22693 -19665 -69042 -56053 -1484
15449 -1484 4982 12804 11481 -2164 -2921 23402 42825 28212 1064 13068 9051 -2600 2920
15436 2920 4352 -33442 -21056 14474 28297 31190 8142 -19408 -40837 -57010 -62533 -30442
15424 -30442 7017 3742 724 -922 1073 -797 -49634 -47962 -24845 -31716 -32213 -28303 -18327 19396
15410 19396 29833 11556 1074 -21314 -22248 -10022 25521 35049 48835 44228 40726 23672 -2993
15397 -2993 -8119 29420 14963 -2022 29402 42662 50646 28394 -1644 -10577 -20156 -33822 -29420
15384 -29420 -22163 -16853 -11639 463 -10324 -10128 -23419 -49578 -20164 -5094 18043 36315 50198
15371 50198 46838 24812 17755 24575 22094 4469 1399 785 -13872 -30175 -53600 -31327 -11761
15358 -11761 -10322 -23478 -10451 7443 31689 28106 27817 -837 -9644 -39155 -27183 -11492 -2077
15345 -2077 11865 27186 8478 -17506 -14131 3033 4563 4560 -4480 -29890 -48295 -35317 -19165
15332 -19165 -2743 7285 16591 4732 -18017 -21524 -4279 9397 18490 -10806 -10107 9283 10341
15319 10341 22042 53995 64324 42076 27245 20860 14304 34838 62579 45381 -347 -4309
15307 -4309 -6464 10928 49736 48315 27956 32512 -108 -36662 -15441 -4750 8535 31876
15295 31876 57273 52493 22873 -12665 -30277 -10132 16229 41405 48880 7710 -2151 15107
15283 15107 1906 -4333 17985 -34479 -66580 -45743 -41407 -24332 -19978 -8665 -12846 -48585
15271 -48585 -71211 -58849 -21159 -12807 21523 24713 21728 24770 32662 -11353 -2138 1859 38181
15258 38181 50509 32029 45495 45530 -379 -26031 -33810 -7391 18113 21878 24419 -11522 -17281
15245 -17281 23929 12714 -8595 -6489 -39199 -35778 -64055 -52704 -69412 -90023 -67010 -50523
15233 -50523 -44564 -7525 -17010 -9914 949 -18853 -33990 -40517 -28755 -14424 -4027 -32195
15221 -32195 -7013 -21132 -20407 165 3519 -5830 -25665 -15450 -4928 -25303 -44564 -49094 -16994
15208 -16994 6934 18084 -2481 -26601 -22302 -8936 -2713 14256 12372 -34227 -28857 -13260
15196 -13260 -33162 -46794 -16278 -14141 12126 24202 29477 30057 35888 45176 52235 55435 49684
15183 49684 36387 4595 19446 33237 16893 22017 7812 -2759 -49015 -54136 -13328 -5234
15171 -5234 -7728 -411 4156 -4781 -18517 -30837 -54925 -42450 -11442 -7187 -9135 -39962 -49177
15158 -49177 -75122 -98047 -88616 -63218 -54041 -46061 3245 11056 7141 10455 -7599 5696 8748
15145 8748 -5778 -27702 -30555 -14943 -33717 -20382 28523 9091 -11642 -14670 -28399 -48991
15133 -48991 -50072 -44696 -34300 -29048 -35882 -20192 -7603 -3990 -31183 -51546 -52440 -49104 -34190
15120 -34190 7475 -271 -23011 -18496 -18837 -16946 -12184 10126 8165 8405 -1112 26434 34084 22803
15106 22803 7671 12087 -4024 8144 28720 36436 40851 27706 3134 -21595 -35324 -43896
15094 -43896 -44332 -6278 -3198 8995 12257 -15988 -27003 -34744 -3734 6520 21768 -5256 -13140
15081 -13140 -32088 -24204 -3077 -1351 11724 23214 29561 29230 -10045 328 729 30399 41053
15068 41053 33679 -20282 -52909 -49189 -28110 11155 30430 25134 7407 -13370 -5166 -6463 13615
15055 13615 40780 6399 -930 -4559 -20009 -6337 -5677 -1545 -38517 -30032 -26248 -2292 17097
15042 17097 3450 12597 10212 46542 34362 18560 19823 34715 26712 3355 6267 -31243 -28866
15029 -28866 -35767 -14090 11477 -25188 -36749 -11085 35778 12976 -21737 391 30525 30725
15017 30725 1593 -6575 -6979 -22909 -13661 -15807 -33436 -56499 -42351 -32083 -16022 12796 6657
15004 6657 -25807 -13225 10916 -2830 3328 4659 -700 10540 -21227 -32676 -72734 -80150 -60094
14991 -60094 -53765 -18247 16105 -15034 -44095 -17857 18740 41217 36224 12864 -3047 -11291
14979 -11291 16880 38004 17952 -5709 -24031 -47980 -60633 -75921 -62570 -98947 -107735 -68356
14967 -68356 -32680 -1561 -3928 -22198 1562 -11191 -23920 -19238 3521 -4216 -42296 -77357
14955 -77357 -64793 -13458 21741 23253 6162 5235 1890 -5869 -1447 7480 34421 31364 22544
14942 22544 18912 40496 58584 12905 11913 20047 4141 783 5011 10193 -21089 -27346 22126
14929 22126 33713 -1292 1631 -12821 -25311 -8615 -5265 30894 49391 62165 32060 -5428
14917 -5428 1035 16644 2019 -3011 -8379 -2 -10031 8639 2426 24168 17085 -1454 10318
14904 10318 24764 39143 44827 15962 40396 26731 -3348 4711 13622 -9953 -20817 -14969
14892 -14969 -19636 -12922 -40243 -35703 -61451 -60688 -59905 -59522 -26761 -16548 -27177 -48110 -36328
14879 -36328 -49592 -93630 -58533 -33543 -33368 -21728 -20402 -278 2209 9503 15974 13612 22407
14866 22407 11156 -634 -355 210 -11834 -24511 -2060 6262 -19028 -19100 -5939 -26841 -11870
14853 -11870 -5764 -24341 -33872 -20173 26933 18759 12715 19546 19238 18549 30131 51254 29271
14840 29271 7826 -6156 7536 1096 15674 10641 2396 11531 -15272 -1384 42670 60016
14828 60016 25942 -3088 -33069 -46713 -32937 3653 -20991 -36073 -15535 -6635 -23308 -16164
14816 -16164 -19412 -2751 3109 4542 14076 14681 5513 -4408 -85 4681 3210 19697 59555 84303
14802 84303 49880 27958 24706 -7510 86 -26210 -54631 -42940 -13302 -18512 -7894 -12325
14790 -12325 -55260 -61556 -66470 -44308 -28222 -14314 14598 12725 -13820 -6967 -3579 3794 -17936
14777 -17936 -22949 -3882 -22838 -4198 30825 41291 33328 23686 16153 29256 28906 25181 37935
14764 37935 33034 7986 -1395 2123 16710 17047 15714 18892 25897 16942 11329 25419 15476 15796
14750 15796 1630 -25674 -23006 -3142 30824 35376 20315 414 6907 -17037 -3180 11019
14738 11019 18569 14533 27656 50993 47707 37046 20575 6996 19028 17765 12995 16316 -16683
14725 -16683 -17174 -22307 -23840 -14703 -13232 -18247 -844 27744 35379 35786 24310 18329 41869 89199
14711 89199 67213 49070 28190 -10098 -27497 -37091 -30732 -7233 1628 9316 15154 15321 2239
14698 2239 -9768 -21057 -4650 24041 13278 3539 -5485 -15784 -27635 5856 18007 9445
14686 9445 4745 6576 -15415 -26712 -3987 4425 -16760 -15881 1705 10378 7736 14447 21676 6599
14672 6599 32322 8523 -5087 -57874 -57400 -52347 -17286 11761 53456 49161 30388 18482 18262
14659 18262 21969 4993 -2121 -2821 8943 22722 12320 -16199 -37901 -32215 -50320 -34780 -21975
14646 -21975 4574 22874 42002 31296 14641 23575 41859 54508 23429 32028 44174 39828
14634 39828 22710 2681 4708 -4698 23070 23942 18197 33345 25509 -11922 -19150 -1201 31697
14621 31697 52777 55571 25983 29236 53444 36779 20501 -37073 -29119 -10107 -17603 -13255 142
14608 142 -21723 -29265 -40090 -38993 -19805 11644 27869 23888 5129 6756 -29870 -32329 -24359
14595 -24359 -18559 -3967 17543 25544 21422 25431 23950 47192 55411 38353 21887 12493 -15443
14582 -15443 -26765 -49894 -34501 -13249 -6431 -10358 975 -2690 -772 -13665 -6336 -20859 -9568
14569 -9568 3990 48378 42496 37217 4967 -13609 -2455 -11564 -20476 -3771 -25168 -4630 26611
14556 26611 36484 83593 64872 -5232 -28449 -37474 -35877 -54840 -50345 -14911 12090 -8389
14544 -8389 -235 28131 25209 10806 5980 8106 31232 33658 17656 15311 9561 31312 15946
14531 15946 10752 6689 -1532 913 11942 6843 10032 31540 57322 45540 28275 1155 606
14518 606 12799 16034 15693 5180 8259 -18295 -52947 -44583 -17864 -8516 -23654 -26647 -11212
14505 -11212 -23408 -927 18701 26091 22263 -3967 -8651 -941 -7613 9666 36126 30652 -232
14492 -232 -12166 -8911 -13592 -14429 10850 -16749 -45667 -43836 -25456 -8069 -24253 -38631 -46401
14479 -46401 -42550 -12427 26146 21049 5036 21944 42667 30368 8765 1759 -1187 -8628 -51121
14466 -51121 -70700 -51895 -35052 -11937 -11701 -23918 -9254 -15529 -12470 -5198 -6524 2432 21582
14453 21582 33422 36142 25713 5928 -34009 -45389 -44068 -35446 -33052 -37139 -22923 -8370 -23236
14440 -23236 -41880 -34593 11938 -6664 -36064 -38099 -26730 -23400 -34903 -38484 -31222 -18464 7304
14427 7304 24917 10974 -19238 -32491 7835 8446 -19368 -21381 4260 9190 21785 20812 16707
14414 16707 -4917 -17527 -10522 21236 15344 34716 46608 52513 24329 -9705 -14770 -22501 -6609
14401 -6609 -5060 12900 20127 -3798 -14636 -9739 -3459 -24164 -13513 15943 49733 43571 25627
14388 25627 9473 -896 -15962 -34462 -50833 -57964 -44012 -39176 -26032 -14737 6641 20620
14376 20620 894 -13677 15614 37532 45590 31609 14505 2948 -21725 -18724 9186 -1521
14364 -1521 -3109 -4402 -5044 -17123 -18802 -21658 -26145 -12810 -19899 -39217 -11047 -22213 -22988 -9699
14350 -9699 -17059 -31685 -17234 -24370 -16075 -19630 -8219 31216 63163 66995 28127 40315 58869
14337 58869 28524 12893 29689 29004 11015 15977 32679 26618 36803 23091 21663 20235 16586
14324 16586 39909 35096 14138 13284 13597 -6798 -37518 -50836 -49699 -38719 -33618 -24348 -9074
14311 -9074 -5869 -3930 -8766 -35604 -30030 -19458 -27583 -24695 16489 51600 17679 6888 -4024
14298 -4024 3517 30241 47209 53891 68253 65248 30685 12134 481 18377 60027 59148 33760
14285 33760 19917 -3834 -15369 10281 23225 -3112 -20395 -6999 5818 4425 16792 15145
14273 15145 8468 8783 15669 8599 11449 -2419 -5511 -13215 -38119 -48665 -13421 -1312 -11825
14260 -11825 -14149 -38949 -69444 -20370 8122 10375 -27175 -39147 -42377 -43733 -23068 -38354
14248 -38354 -17727 3943 -24090 3683 20257 -19989 -6304 -11442 -20258 -24966 -77419 -49425
14236 -49425 837 -21116 -59543 -53482 -25898 -2143 9723 13966 -11031 -17133 -403 17606
14224 17606 18010 -15906 -41437 -34161 -30182 -20824 -11458 1086 -12348 -50987 -34275 -473 17303
14211 17303 34450 30818 18118 18356 7667 -4184 -15099 -9759 -17104 -40229 -67500 -60392 -39766
14198 -39766 -40378 -42218 -24989 -6286 19452 45219 44153 30318 29880 -4790 -20525 -9084 1516
14185 1516 -21649 -40354 -48123 -44725 -27598 -60751 -68826 -43604 -34683 -35513 -49331 -42688 -48879
14172 -48879 -48254 -31242 -8026 -17346 -18568 -9151 -15681 -19917 -10117 -11379 -8168 866 12317 -13908
14158 -13908 -25242 -14408 -32688 -40946 -41757 -30268 -28621 -31963 -23716 2579 -7158 -11183 -18885
14145 -18885 -35537 -43232 -45376 -21314 -2993 4905 -12597 3024 11005 2361 12965 10298 8114
14132 8114 8660 16909 12459 -18289 -39922 -47499 -42933 -42876 -38115 5235 35271 23602 23665 17311 -16552
14117 -16552 -36108 -31835 -4678 5131 7579 -34969 -28715 -5506 -5249 -7038 -25380 -40971 -31516
14104 -31516 5130 28952 39317 51857 30099 3178 -6985 -13863 -41558 -57935 -60002 -42196
14092 -42196 -22205 -16721 -13776 -11346 -42381 -7070 26144 9342 -11789 -20385 1573 -11342
14080 -11342 -20217 19773 23679 8229 22037 24414 18383 12666 22291 8371 -5439 -29066 -50890
14067 -50890 -53457 -22519 -12385 -14872 22009 42476 34435 40080 1322 -7536 -13568 17576 28478
14054 28478 14463 11817 7008 2645 -15897 -9385 -29076 -30389 24839 32451 -6213 -3652 -13756
14041 -13756 -42296 -58253 -35315 -37600 -23892 -3061 -14866 -45563 -28306 -3523 -26509 -14631
14029 -14631 3655 4616 -9962 -33683 -38025 -32619 -39735 -25763 -23782 -47115 -44923 -26325 -392
14016 -392 9071 24362 8073 -4575 -15947 -34758 -10489 -2107 20176 16391 6529 18272 20263
14003 20263 -7719 -15172 -19510 12481 14242 2619 -35494 -51268 -18117 6751 15665 19531 2947
13990 2947 -24200 -20115 -12687 -33478 -47524 -48806 -50478 -40629 -29713 -6629 35366 41111 23153
13977 23153 -1118 -27417 -32170 -20555 -22046 -34330 -40332 -48142 -35348 -34616 -29182 21148 52089
13964 52089 47478 19848 7604 -3651 3596 6016 12339 -33238 -23400 -11180 -11751 2601 7472
13951 7472 4210 8863 5388 28327 70138 78466 26749 -540 -23069 -41959 -59056 -47847 -29826
13938 -29826 -26576 -48580 -32458 -1086 9552 31227 34864 21634 32547 24866 23016 10885
13926 10885 15912 3884 -46967 -76370 -73188 -29719 -26275 -64730 -49383 -34522 -359 1674
13914 1674 -1842 -6403 -4112 10363 22945 43446 45460 45493 22743 28965 46393 43157 48008 34026
13900 34026 49615 67525 17807 -9643 15333 22124 26909 23838 6045 14028 54225 36409
13888 36409 1784 -28132 -15698 4376 29532 43784 30786 41688 26288 19567 -6202 -24411
13876 -24411 18770 11764 24647 34505 28216 20625 23458 18297 46052 59301 17052 -16517 6639
13863 6639 8498 -3873 -25765 -20884 3830 15902 38665 40260 17510 6413 -12788 -2231
13851 -2231 7943 39548 31985 -7537 -1632 42665 58746 65066 43974 62825 79262 78202 53846
13838 53846 51020 66520 31114 22112 35274 28206 13971 10944 8629 2104 34654 27094 7701
13825 7701 6081 -20934 -50306 -48235 -20119 -22533 -9004 11 2864 14480 45518 42688 16688
13812 16688 -10690 -8840 -14735 -11564 -16216 -17939 -9553 -16730 -26333 -56757 -68411 -33866 15280
13799 15280 35228 23882 312 -7489 8104 10250 5177 5519 -7794 9194 23515 31810 39415
13786 39415 52099 25603 -7862 -290 8375 32469 27415 -3269 -9351 -19483 -28687 -4831 -16538
13773 -16538 421 10077 -15073 -51485 -45163 -46575 5376 23001 919 -39761 -46290 -39163 -46873
13760 -46873 -36410 -29340 -32003 -6758 737 1828 22985 24840 8910 3128 9010 5227 -13808
13747 -13808 -22992 -25873 -44826 -34404 -8918 -40208 -60692 -37078 -30177 -9922 4981 -18513
13735 -18513 -12549 5469 -3012 3385 -24322 -44485 -55303 -74433 -61526 -12488 7920 7024 8235
13722 8235 -5154 -10812 15363 43285 24651 3841 -23458 -36186 -41674 -44601 -29309 -5442
13710 -5442 -24913 -25117 -37271 -36898 -15482 -1695 26788 56088 44489 17283 21274 38145 44430
13697 44430 50515 66902 50078 -6591 -24424 1669 42910 40748 21320 8760 -12338 -21936
13685 -21936 -5218 7142 38187 14976 22464 36767 18866 15895 27845 15667 15483 8536 9268
13672 9268 1046 -348 33642 27780 15410 -9432 -13835 -18415 -9472 -43081 -55531 -46519 -31015
13659 -31015 10639 -4535 7813 31769 49025 26237 -13725 -21916 -19671 -18491 -9626 1174
13647 1174 -36290 -27118 4257 13526 25952 26551 7999 5635 10872 7240 -1161 -11984 -18483 -9961
13633 -9961 -23690 -32348 -33747 -7339 32428 63557 53773 34389 -7890 -22944 -16925 -5031 -22927
13620 -22927 -51273 -26253 29360 -2466 -27401 -42267 -47003 -56433 -51993 -22210 -8772 -18152
13608 -18152 -18983 -3944 -17376 -12468 2041 2892 -1050 13472 4288 3690 2111 -5924 -20615 -6197
13594 -6197 17756 -1908 17763 -810 -26158 -12197 17135 18579 -9637 9358 30870 23282
13582 23282 34077 17569 4179 2548 -17644 -7148 2061 5734 -3884 3807 9603 7871 19238
13569 19238 10228 -7571 -8380 2818 -856 -20190 -17831 -12326 -11912 -33161 -29998 -27027 -49114 -36830
13555 -36830 -13437 -4360 -4126 -23895 -24316 -29465 -20722 -7683 -1438 -12055 -70 7503 -4991
13542 -4991 -15696 -12997 -34363 -28117 -21065 -14541 23035 44467 27425 -1667 -13276 -25239 -45606
13529 -45606 -40262 -30245 -28970 -41721 -68227 -72150 -63148 -30611 -10112 -12791 -12964 -22605 -28990
13516 -28990 -17688 12976 19451 28364 26722 8167 3468 845 -7723 -22592 -24665 -5764 21565
13503 21565 5050 -27403 -20702 9859 23611 36648 10304 4519 4835 -15254 -38050 -43607 -23757
13490 -23757 9354 24134 10367 -15848 -37874 -21806 -7829 -10321 7227 38696 43478 10259
13478 10259 -17373 -3212 6076 35696 18395 -34747 -36116 -50291 -61135 -56059 -34888 -31606
13466 -31606 -32431 -30170 -27875 724 1223 3220 -359 4873 -7701 -3766 12242 17893 24075 5339
13452 5339 10830 16855 33122 27956 6571 -28401 -16297 -28937 -17176 12325 12502 6694 -16305
13439 -16305 -36543 -13937 3917 -9997 -22043 -18599 -27811 504 29842 7664 11128 17181
13427 17181 -17837 -15572 -7624 -20536 -22043 -30883 -40830 -28828 -40432 -41539 -40515 -24530 -20759
13414 -20759 -16562 -19678 -19237 -13639 -10057 -13993 -5189 -655 10338 28738 11733 23454 28061 15547
13400 15547 8563 -6581 -12692 -6702 -17520 7078 15993 -13954 -2646 129 -18089 18611 27320
13387 27320 18496 1946 -7739 9270 16995 -1671 9811 26558 53532 46902 42383 45918 33272
13374 33272 17039 561 -22017 -38412 -10676 7211 -19761 -4825 3888 -28452 -25120 -5569
13362 -5569 -36279 -32174 -2469 -12534 -703 41402 4255 -15826 -7008 6121 6202 -14600 -12719
13349 -12719 -13740 -3753 7116 25933 -7510 -17781 -17413 -15430 7519 5102 17382 -1370 37295
13336 37295 51741 24143 -4863 -31505 -40561 -36273 -19816 -23930 -30642 -25455 -39428 -40238 -21136
13323 -21136 -9149 -5477 -6771 20386 29205 30288 11310 -21173 -16907 -45957 -39313 -38226 -25735
13310 -25735 5618 24474 20305 -5814 -46356 -42526 -24517 -4445 39218 49944 55143 45692
13298 45692 37040 24892 41219 31009 -1534 -1074 -36372 -37191 -18429 25135 23996 38176 42263
13285 42263 62576 60921 20633 14317 9602 -29510 -27417 15301 39976 42322 25274 25610 5295
13272 5295 -7367 -21384 -7687 -4808 -5186 -6393 -2090 -477 -10284 -10113 -28471 -34368 -34047 -11499
13258 -11499 -6724 -2183 14509 -7566 5186 27651 39908 17939 34503 35958 4814 8298
13246 8298 8971 -21279 -39661 -38578 -15275 -12465 -21845 -10823 -13657 5708 -2419 -19622 -1245
13233 -1245 12938 31909 66364 60848 73662 85620 55757 18769 7268 5167 -7906 -11473
13221 -11473 -7864 -20837 -46756 -62511 -68170 -60017 -28923 -8756 17236 40151 79772 82794
13209 82794 48694 27926 33996 15743 20778 40021 60848 33029 40693 43099 45920 26122 10982
13196 10982 37427 93257 134717 140919 147076 145940 100514 48764 55302 55315 54100 36781 24614
13183 24614 49072 53053 30832 17154 247 20973 23706 29960 21301 8119 -53 -8452 17254
13170 17254 45146 35071 2445 -2868 17399 34033 36461 49968 73216 109245 122897 79103
13158 79103 44632 38781 52811 99068 155222 151612 173424 258312 411252 543412 593307 580260
13146 580260 510756 421619 297081 187360 104507 42113 35373 40365 41276 66535 49518 40866
13134 40866 22406 33158 28617 -3506 -9588 19157 29278 33245 26781 -2538 -3243 29828 49470
13121 49470 46556 23245 26003 45658 25915 -9495 -24556 19542 16313 34605 52512 51957 74107
13108 74107 104082 149612 247452 378135 525839 620214 623864 551516 445470 346980 233390
13097 233390 127241 95110 77349 62890 62742 47570 38395 36278 24251 31303 2427 -195
13085 -195 -9370 -14664 -7971 -19029 -13850 15477 -1629 -6389 9320 -12109 -14826 -915 6961
13072 6961 18121 -3464 -214 1099 -12515 -34013 -15174 12202 49870 90659 83696 62136
13060 62136 113819 177892 218510 217273 195618 167814 137374 99666 62341 45609 29887 6796
13048 6796 -6227 -37325 -51024 -1024 16363 19711 10453 9914 3346 -498 -25467 -46310 -35223
13035 -35223 -36972 -33178 -12365 -8115 -6958 -11664 -23000 -13991 3792 -10414 -27908 -32402 -52482
13022 -52482 -35759 3417 13740 -7817 -1329 -6243 31980 43532 -17241 -24759 -14667 -5068
13010 -5068 -7983 19138 14080 -31730 -22923 15616 47503 35666 15341 31766 26265 -6249 5965
12997 5965 23618 25255 13481 -5581 -32757 -27780 -25402 -29515 -15560 -15083 -17328 -22463 -20175 -15183
12983 -15183 -31112 -19148 -6262 11135 11248 16998 14925 28034 43370 26783 24709 33379 55494
12970 55494 43508 13111 24375 16852 17249 -1869 -16964 6724 -4315 -16583 -15013 -18449 -14773
12957 -14773 -21574 -39903 -35494 -14657 -6485 -12420 -12268 -24785 -46004 -53906 -33536 -14525 -36154
12944 -36154 -25594 -16538 -36156 -31431 -8738 -4430 12299 38091 49280 5505 3476 15622
12932 15622 24347 18903 -6487 24817 56984 69792 47833 34965 18845 17612 9279 37475
12920 37475 45849 49951 79710 66556 33237 -431 -39971 -52774 -36340 -23238 -554 -26088
12908 -26088 -21159 -16808 -13264 -1031 -14069 -15005 -23328 -33340 -31513 -25858 -36279 -57320 -47516
12895 -47516 -24794 -11517 -12665 -30029 -43002 -36898 -15152 -13008 -24017 -30553 -55720 -70425
12883 -70425 -71518 -28002 -6563 -11965 -17678 -8742 -27593 -39419 -18045 14281 7331 -8036 -14923
12870 -14923 -2695 -3924 -11878 21015 35086 36321 7916 5105 10330 9440 28836 15096 7749
12857 7749 15798 28974 38297 51746 43608 29519 20026 -2610 -1362 9900 -858 -13487 8138
12844 8138 19502 12744 18329 12731 20508 14407 12868 37004 67789 88237 60434 34764 66215
12831 66215 53032 59658 46448 4052 -22944 -195 23361 29517 30600 8537 17876 15976 6185
12818 6185 13959 9805 840 -11147 -9087 -19861 -18336 -3313 11991 14367 20086 24695 39970
12805 39970 9356 2063 -3250 -4198 12219 35839 56571 87778 63363 57732 48271 -9882 -28006
12792 -28006 -60792 -54716 -39225 -16488 -4602 3864 10369 -2273 11588 6253 7602 26237 36971
12779 36971 19750 26655 -9639 -11880 22265 28088 34774 32921 14284 5249 28859 40731 48783
12766 48783 24398 -7803 -10612 2224 7629 8785 3204 7337 5672 14412 10659 -2362 -24518
12753 -24518 -25010 -8203 -6902 -1671 5099 -33994 -49123 -25280 -14313 -7009 -27466 -33670 -21712
12740 -21712 -1729 -51460 -47746 -29080 -27472 -51791 -39468 -21032 -25143 -47434 -53052 -45226 -12506
12727 -12506 3 -16465 1706 15789 -11049 5818 13292 10782 -12721 -27321 -25212 10512
12715 10512 4765 12807 15902 -2830 -36317 -25931 -2243 -29183 -19473 25251 3119 -3204 6590
12702 6590 3666 -11979 1609 855 13595 39369 27228 17131 21631 27467 46745 29022 -33177
12689 -33177 -38389 -958 989 9493 22571 15579 9532 -929 -12640 -13840 -4470 6261 52715
12676 52715 74075 59211 5995 -6088 -23917 -7082 8401 25767 34221 23996 -10436 -13299
12664 -13299 -5132 -21225 -37297 -29965 -13706 18157 -5544 -20703 -5594 640 -16322 -21330
12652 -21330 5137 41929 73118 74785 84790 75832 30719 13305 18294 11122 -3413 -10954 -20196
12639 -20196 -13908 8366 -10617 -30906 -31347 -4191 35045 32704 38840 16374 -3489 -3374 -3417 16129
12625 16129 27360 3126 21757 32883 54427 36929 -19235 -32909 -15309 -15790 -4466 -3280
12613 -3280 36091 58498 57277 47398 22544 -10967 13599 32780 43057 41721 38331 16191 1794
12600 1794 -9349 -8868 14272 22046 28801 4198 -41706 -49193 -11908 8639 -9800 7181 12562
12587 12562 5681 582 11302 -12895 -18232 -10697 -12043 -34803 -21818 -7579 34101 30233 39754
12574 39754 35792 40555 34402 12382 17644 55496 49804 36217 20430 -25628 -22884 -21304 27415
12561 27415 20163 3968 30134 40784 11815 -21292 -41294 -37646 -34794 -14022 6520 2546
12549 2546 -21730 14392 9310 -9432 -12104 13592 44974 55819 53987 51142 36436 34287 17921
12536 17921 -13555 -36992 -53088 -38590 525 19227 4001 -5658 15184 25087 17519 9457
12524 9457 26957 6016 -36810 -31683 -833 15896 8770 402 26628 28701 20392 20574 25842
12511 25842 14933 -460 -3631 -15944 -25343 -44749 -42303 -32348 -20656 -41924 -59916 -32861
12499 -32861 1085 11990 46204 32660 20177 2387 -22570 -14625 -19439 -22224 -35021 -42405
12487 -42405 -23161 3211 1793 -12452 -49930 -54646 -38088 655 19996 38075 17180 -7982
12475 -7982 9687 -903 -4216 12715 27897 29380 6031 -14776 -39364 -39336 -21972 -23628 -80
12462 -80 14738 12134 -9881 -4151 17848 26129 -317 2212 3863 -2318 28988 33388 15980 -4816
12448 -4816 -31686 -26153 -10634 -17071 -24498 -14454 -17533 -10195 -13497 -9762 13925 13769 -9976 -34129
12434 -34129 -3955 8688 10712 7865 7055 -1937 -32408 -26884 -24867 3020 5662 20758 15191
12421 15191 25495 31370 19873 61 3421 13953 -3658 -42924 -24635 -7179 -7388 -11888 7841
12408 7841 25927 19164 16476 47940 53031 15308 1543 -25311 -39811 -27334 -15190 17654
12396 17654 19585 20566 23470 24532 37991 40597 32756 30878 25901 20816 10499 5352 18951 1894
12382 1894 -9970 -14932 15071 26977 27468 19853 19242 11096 24652 8786 -16494 -20334 -24676 -36200
12368 -36200 -15608 8806 -291 -6647 -2230 -4165 -2774 11558 -5942 3531 6036 15145 44475
12355 44475 47884 30270 24820 29154 39803 33599 29523 33682 27198 -146 -8114 -12076 284
12342 284 -965 -10308 -7307 1188 2591 -3571 -2768 -13335 -27771 -4481 -3277 -3041 -14024 -19137
12328 -19137 -48708 -36641 5230 -5455 -204 13618 9813 -16907 -2776 -24685 -50537 -55557
12316 -55557 -42645 -44521 -41476 -37261 -12008 7832 -3753 -32647 -79478 -69823 -25607 -22850 -49921
12303 -49921 -58762 -17369 -4941 -2312 -1481 14611 29615 38132 42221 22046 -4604 10435 7339
12290 7339 15605 7344 -8044 2860 1017 25993 43140 51426 34718 21679 29055 23137 37231
12277 37231 23215 3956 -30143 -17282 16023 24034 35241 9831 -8629 -12496 9064 31639
12265 31639 26786 -5059 -39573 -36219 -11429 3989 7470 30780 34651 36770 23056 3233 -5751
12252 -5751 4466 -2039 3682 20160 25694 13450 9223 4383 26044 22676 21144 12433 2949 22358
12238 22358 17825 11096 -4893 -33303 -10137 11993 5996 -6335 5543 26035 17740 30111
12226 30111 33881 -8674 -47210 -25737 4343 -2975 -7050 -8805 -17046 -24067 -18744 -26131 -54839
12213 -54839 -9836 34468 37844 20049 3345 3147 -4276 5027 7717 8435 3371 14104 11489 -846
12199 -846 -13015 18277 17908 -17172 -13550 -22635 -40303 -30654 520 9501 17590 24856 31579 28603
12185 28603 37610 48417 45453 37592 34415 27163 26439 9766 -4648 7810 -3650 -3872 -1902 -3624
12171 -3624 -7854 -24713 -36993 -9621 15960 534 -24361 6860 28215 10448 -7424 -28248
12159 -28248 -23475 -35659 -52880 -78786 -28326 -8651 -29311 -24439 -15323 -29940 -34204 -23283
12147 -23283 -26116 -5992 7538 5776 4460 14050 29854 35461 10207 11918 29552 23696 -8206
12134 -8206 -48672 -43948 -28669 -41219 -64465 -48070 -26744 7746 19469 17271 -10708 -32988
12122 -32988 -16535 -5697 -5180 -26548 -72053 -51892 -24928 -3171 -34304 -43078 -38109 -43596 -29051
12109 -29051 -3852 -4550 -28455 -308 -2804 19120 44334 37399 34585 22445 31243 18376 -4872
12096 -4872 2236 -3233 3723 22142 42803 35489 26152 23393 35870 48812 48170 57003 50714 23352
12082 23352 1208 19777 44621 41951 42196 48584 11561 -7586 -1398 26444 17508 6368 5630
12069 5630 -335 -2586 -8482 -26008 -20814 -7702 12105 8493 5660 18794 6067 -37764 -43003
12056 -43003 -27965 -19093 8265 25125 38663 48931 28667 -12867 -43547 -50926 -49793 -40045
12044 -40045 4651 17431 -17475 -37468 -48800 -36619 -41901 -54157 -59357 -40285 -12854 -15634
12032 -15634 -21185 -44497 -49833 -25418 -30233 -6781 11597 -20797 -43261 -33223 -48141 -27215
12020 -27215 -14571 -11974 -39105 -76997 -48444 -43304 -33609 -18282 -4040 1877 -5511 -21379 -9481
12007 -9481 -7346 -16405 -30617 -19421 -27030 -55883 -50966 -26248 -3578 -5379 -14062 -4369 20203
11994 20203 27139 20362 2598 1207 11128 4984 3192 -35207 -39934 -43877 -12417 -10615 -5786 14379
11980 14379 49851 56550 11511 17774 16162 4490 6691 13933 -3202 -18702 -40525 -27534 -38150
11967 -38150 -42829 -24734 -26629 -36695 -47866 -28586 -7660 19833 20758 204 -40 -696 10807
11954 10807 7200 -16906 -11 -5303 -21955 -34559 -27053 -44078 -33023 -12794 -9002 13604
11942 13604 -17538 -47946 -39050 -4897 -6976 -23555 -53317 -51075 -62651 -59024 -2421 22815
11930 22815 18840 6190 18847 41342 8037 -23680 -29194 -37169 -34228 -27444 -9734 -18222 -37189
11917 -37189 -8964 5030 10538 3670 -6996 -15705 -32310 -24388 -34349 -5016 -2170 -12680 -15323
11904 -15323 -39676 -41686 -42937 -26808 10863 4530 9567 17201 8189 5848 5424 -11576 -996
11891 -996 11531 -1855 -15320 -51459 -47886 -10196 20387 25515 18388 -15725 -17954 3344 -6510
11878 -6510 -15831 -2780 -8247 -21410 -22287 -9784 -1515 -14876 -22471 -38752 -28335 -32036 -32595 -19471
11864 -19471 -26513 -38189 -31486 -18762 -48157 -36681 -31950 -3397 -9397 -21043 -58164 -45673
11852 -45673 -38672 -36921 -43321 -32085 3009 24058 31641 18407 -4056 -3601 -8984 -5624 6423
11839 6423 10160 42964 28598 35867 46946 30135 32777 21414 -28998 -32392 -4337 -3619 20521
11826 20521 9337 -3072 -19582 -38610 -41111 -40948 -37350 -23093 -22324 -22776 -4974 -4755 2361 12397
11812 12397 14643 3777 12312 2479 -14739 13940 27787 26160 13883 -6129 -17584 -33981
11800 -33981 -11316 31888 54696 52537 46332 39685 6738 -8828 -11863 1425 36089 37795 17312
11787 17312 6173 -11648 -12361 -10824 5504 28369 41894 45749 23690 6079 3233 -6495 -24610
11774 -24610 -39575 -2302 23202 20079 15439 32289 17151 25505 52854 48608 35039 8318
11762 8318 -21628 -35942 -32457 -23794 -6456 168 521 -6972 4350 35371 19234 6612 616
11749 616 7394 4827 26033 19269 11626 8348 26753 7532 16443 41831 47995 46067 23652 31992
11735 31992 22063 7138 11516 37370 50440 11805 13864 -10161 16714 29687 26818 53542
11723 53542 59376 50189 26375 21591 -309 -24934 -21771 -5934 -1032 8080 -7061 -23866 11582
11710 11582 49452 48417 26487 2032 6925 9527 6287 10140 22360 29627 24878 8821 -20199
11697 -20199 -11544 12127 33266 51178 35872 22109 -4623 -21340 -27591 -40014 -2570 -10022
11685 -10022 -8886 -11899 -6232 -30409 -26624 -19934 -1973 -1896 3775 -36065 -34935 -3321 25853 23969
11671 23969 43995 35503 27769 -12209 -20016 -27920 -36745 -40834 -35712 -9581 16667 -2783 -37553
11658 -37553 -33116 -23050 -19009 -45692 -45026 -40966 -54369 -51782 -27576 -18601 -26113 -13100 -8568
11645 -8568 8867 -2312 -23022 -24290 4196 22335 -15592 -5369 15939 17197 35193 -2641
11633 -2641 -28709 -31744 -35801 -28587 -12665 -16878 -24097 -15013 6542 16927 6173 10184 197
11620 197 -6000 -12783 3905 21731 -328 -4649 -9030 -3818 9528 36190 53874 44523 36255
11607 36255 27118 32277 17875 13203 2580 -1357 12098 38477 26103 46320 53696 15849 -10702
11594 -10702 6258 24913 19122 -508 6718 13360 18658 12796 -526 -9147 -18161 4107 532
11581 532 -28086 -22381 35549 28270 6154 33252 12239 -190 -26878 -32289 -30915 -32963 -2072
11568 -2072 24763 35382 35045 14166 -16821 5889 17523 -1395 -9864 -32765 -38530 -20312 -20685
11555 -20685 -20397 -1731 -2768 11063 21212 32869 48592 66515 64764 68211 45971 12031 -3040
11542 -3040 30018 43522 71244 88346 80055 58151 23355 -9540 -34517 -30487 -9350 -5180
11530 -5180 -11966 -2504 -7532 -2191 21146 38080 15558 26396 54367 41191 63233 51411 20459
11517 20459 -4387 -20708 1414 39679 37256 -13622 -43986 -59612 -47503 -17034 -28675 -7326
11505 -7326 2489 3604 -10767 10201 29022 23758 -1722 2193 12022 27782 23116 29633 -2020
11492 -2020 -10592 -18447 -21884 -31092 -1932 11869 -6879 10776 4432 -1353 6730 4228 11342 7336
11478 7336 -9575 -36443 -20198 -9051 -4835 -5179 -12091 1744 15883 -19026 -22600 -2375 10250
11465 10250 2962 13217 32252 45711 64568 76661 96882 53024 21445 -2916 23106 30610
11453 30610 4035 -2703 -1196 8237 11827 14295 14831 -169 26912 30977 12413 5822 6624 23459
11439 23459 24604 25597 14602 32198 51112 48356 21472 27103 1781 10566 30165 56673 27318
11426 27318 -15538 -42921 -43704 -29944 -22179 -40988 -62311 -80363 -62349 -64897 -56416 -20453 -1663
11413 -1663 1339 -13608 159 14226 12359 18819 27077 27678 33489 5538 5860 23225 35292 25845
11399 25845 11265 -5639 9189 22785 14401 -8300 7038 24779 21912 30241 27671 30818 39496
11386 39496 40850 41256 45041 52635 47929 36061 37464 28172 24725 3753 13778 21885 461 -15713
11372 -15713 5403 19924 11372 13488 14118 10400 14023 733 12338 10652 22522 9005 13430
11359 13430 37717 22863 6355 5581 4104 7657 1078 22341 15026 11314 7987 24294 14488
11346 14488 -1836 -24383 -5425 29410 54336 47029 21925 31686 -3160 -10386 24091 40124
11334 40124 28424 2088 -4681 1737 3362 -14148 12612 39786 28701 11604 -10314 -34053
11322 -34053 3460 8918 35708 50454 -449 -21237 -20314 -17184 -52649 -38302 -686 14072
11310 14072 52129 59111 48295 29801 8472 -12950 -5695 -26275 -42294 -17054 17750 66923
11298 66923 49020 17517 3113 33398 50136 36836 2228 5927 -13286 1119 -1169 -728
11286 -728 24928 24409 24535 18375 -9689 -21270 41529 69323 67300 53918 35372 36036 37324 22259
11272 22259 489 -39088 -32723 18589 25535 7215 9199 -6632 -13093 -30598 -19668 -23655 -25965
11259 -25965 3142 18300 13509 -2976 2287 -9237 16808 24030 19033 30427 29781 -92 4839
11246 4839 -16556 -4872 16014 -7866 -16695 6907 32649 31882 25322 854 -3774 18116 27821
11233 27821 21528 18899 20428 23350 23155 18940 963 19625 17141 27012 12231 14052 29915 4558
11219 4558 -14420 -18363 -14324 5220 -2498 -30990 -52413 -70353 -26390 8478 24760 43072
11207 43072 50796 35606 1485 6458 28638 36863 17984 -1938 -11928 -4461 -4678 -1679 4855
11194 4855 1896 -13223 16107 40873 45447 54483 41169 11411 -16245 13849 26787 30580 43468
11181 43468 35040 -5884 -14280 20932 25512 16764 18696 30444 61868 53720 23834 -11282 -39170
11168 -39170 -13347 -33893 -15017 14947 36097 27540 31419 32614 4899 -2588 -5045 -16322 57
11155 57 -19148 -44664 -26085 -11543 -9361 -21863 -14635 8 -1052 6030 49105 62881 56220
11142 56220 84286 93202 52067 7464 -25174 -38750 -40288 -42595 8265 24712 5270 -17611
11130 -17611 -31535 -11633 15190 25858 30513 20210 26624 18098 21225 25401 -786 13723 43670
11117 43670 54402 21586 -25067 -35082 -30426 -25608 24604 34074 19911 3987 8762 20780
11105 20780 7642 16150 -3594 -4161 13504 14076 6468 4052 -14549 -28732 -40802 -33600 -24367
11092 -24367 -14795 -10445 -20959 944 39703 37895 719 10798 -6239 -7737 -2062 19673 4237
11079 4237 -35271 -38092 -40191 -21038 2122 27793 36741 27924 22501 8472 1835 8804 15533
11066 15533 310 -36322 -25870 -8687 -2009 -21608 -7440 17613 -4022 -18799 -5836 -12807
11054 -12807 -1466 9387 -13145 -26027 -26748 -8092 31081 30372 30393 11376 -29593 -32730 -8048
11041 -8048 16216 21764 11705 -3083 -6882 693 -26047 -10373 -10973 -5557 13760 2993 -24113
11028 -24113 -19026 2181 11251 -185 5851 7701 -4537 -31871 -43214 -8258 44627 47420 42237
11015 42237 23784 35315 44509 38041 19829 1853 11559 47192 62517 56028 31292 23796 32542
11002 32542 100752 122207 116937 73623 28706 15394 2800 -3133 25935 44277 40464 24920
10990 24920 46344 68140 53778 54372 55765 62175 51925 37278 14663 4899 2370 19013 4078
10977 4078 13173 32145 -5117 -34294 -21676 -4226 -11119 -9727 14826 39101 22253 13295 -9123
10964 -9123 3539 34910 17222 -21656 3618 41314 66028 40523 42755 37259 30480 30186 42743
10951 42743 63405 45204 3672 -12456 -20139 12539 22578 4684 4679 9430 -1423 4363 9066
10938 9066 -30318 -24461 -1686 16328 22938 -2789 -30040 -25492 6789 33017 24799 41202 48232
10925 48232 8345 -29494 -40738 -50091 -38896 -24730 -15300 -21638 -11158 1132 8243 23252
10913 23252 12046 8386 33329 35873 5673 4541 4007 -24208 -4208 33269 22623 -23356 -1746
10900 -1746 25299 38026 15105 -6360 -33764 -66589 -42912 1181 8875 -5266 -21589 -33478
10888 -33478 -39054 -14158 1939 -25850 -16934 2924 1246 -11847 -12871 10679 24272 24501 38969
10875 38969 28810 52558 49592 26218 21157 13167 9983 -2399 18745 58421 63885 60547 46912
10862 46912 20350 39649 6597 33289 40817 11312 6248 13802 30285 33297 25597 8813 19615
10849 19615 34855 23833 2625 7076 -5338 -26162 -25438 -31811 -1401 34863 37867 34141 36891
10836 36891 35861 28997 35555 20838 19367 25497 15370 -9211 6684 51425 54995 22700 24727
10823 24727 48182 63058 78028 49820 27297 30794 2366 -18046 -10720 24317 32149 37758
10811 37758 63623 69729 40064 22731 -17234 -27801 3896 9651 45861 105717 105245 100703 105094
10798 105094 89774 81536 87779 106173 116858 133330 128672 111646 95033 67133 91327 115485
10786 115485 99952 94990 61976 52116 32209 20269 19200 24600 46596 69712 77842 87546 91790
10773 91790 109371 106571 80767 89981 97097 113316 117462 117290 101479 93476 96689 128079 130712
10760 130712 101705 95277 116299 144410 148674 165377 168572 165309 203998 275538 341133 448771
10748 448771 658378 1011041 1604173 2278711 2585236 2466186 2128736 1594388 1102973 759913
10738 759913 555123 460154 381628 309302 264850 224346 176527 141229 166120 159656 136841
10727 136841 128150 140001 151983 131042 125975 121494 100059 98126 96770 102787 120479 105090 116103
10714 116103 75016 75275 114485 118969 112528 88115 60284 57772 49953 78446 70897 48520 71391
10701 71391 105812 63007 8372 23791 61649 64952 39489 58152 81185 84781 87190 87316 68766
10688 68766 67077 58857 52266 47892 43435 57508 69771 71546 55594 64401 81126 114712 110864
10675 110864 98795 105121 80960 59605 28532 34519 58477 76758 76098 51773 32841 73850
10663 73850 95292 117097 144194 127328 104734 103201 89459 91163 104920 59216 24993 14970
10651 14970 8589 35204 33218 17290 28518 52262 83194 67818 45460 25791 15029 31801
10639 31801 37702 46311 57956 46347 36140 20061 34757 14476 19280 17533 59471 69789
10627 69789 82247 116777 106249 86637 97390 122154 128844 113679 114418 107400 93757 99329 85186
10614 85186 84928 79861 110928 136586 145179 140328 123947 112117 104473 100560 120504 106932 84672
10601 84672 81841 90115 110116 139564 143856 156165 181180 243008 308932 380807 363788 338282
10589 338282 282690 242614 182284 107966 59442 59210 85326 65563 41210 61137 97309 120480
10577 120480 122995 126378 130958 143796 92338 69461 76991 115916 137934 147196 156307 161109 161511
10564 161511 150285 131647 109781 115016 117449 84751 68610 62444 72666 88861 100045 107430
10552 107430 109716 89774 83121 82243 119018 138799 154655 148679 162662 175499 155349 123365
10540 123365 113884 90565 95537 97350 116430 124392 107681 131542 139848 123429 109842 73035
10528 73035 64847 65080 58595 38606 22620 23966 46776 55728 71219 84798 130181 127502 116470
10515 116470 117495 119672 108959 102105 119954 134490 127749 132267 136800 115023 130321 154378 122154
10502 122154 109324 98648 77774 70063 59965 50355 55521 66166 81802 109715 139657 161462
10490 161462 188948 228377 243959 235410 219366 214895 223850 234981 210213 189950 205742 219310
10478 219310 188814 187496 188794 161392 162486 226964 259682 256676 243303 271097 333323 402295
10466 402295 432066 437757 438118 392965 377154 349049 308032 275278 256469 240182 216431 241237
10454 241237 288273 295893 272205 272423 263107 234629 255576 277625 300017 294334 269768 298053
10442 298053 299777 324544 333672 325220 307105 267297 249282 248986 260632 294084 292860 276008 263230
10429 263230 281466 335098 348584 358351 343528 365145 391246 393545 394779 412527 431582 455019
10417 455019 475124 492045 489943 478778 474495 490437 512958 531116 517775 538724 549339 527743
10405 527743 504288 484749 486614 531909 569192 592294 617897 645414 685624 722250 741622 776762
10393 776762 811734 823570 833304 839027 869003 882483 876871 902018 970071 1033775 1077881 1113980
10381 1113980 1186165 1244421 1277026 1308022 1346766 1374768 1384692 1419492 1525248 1657982 1789663
10370 1789663 1965947 2159884 2391922 2676629 2992355 3340483 3791625 4497278 5436036
10361 5436036 6280247 6783826 7135260 7387348 7603419 7950876 8526899 9397476 10585069
10352 10585069 12174364 14151515 16758198 20374821 25430797 32283984 41567472 54367590
10344 54367590 72816717 102888490 158439281 257868818 385087195 464113430 457471598
10337 457471598 400925210 309332347 209198267 137049872 94045946 68684335 52779045
10330 52779045 42016458 34257763 28221874 23480113 19762259 16780745 14387092 12453662
10322 12453662 10837945 9536748 8529114 7858015 7655360 7818587 8044418 7847852 7211965
10313 7211965 6376945 5426842 4565226 3957949 3585981 3271123 3009257 2784396 2572714
10304 2572714 2392760 2241736 2099438 1930498 1783118 1620466 1439040 1314893 1234338 1162015
10294 1162015 1132681 1112471 1062613 1023011 1023135 969949 869203 823015 786831 747854 706863
10283 706863 643847 569044 511419 510702 499740 505315 521050 520516 531568 512995 470015 430065
10271 430065 366533 328426 351201 369705 377445 371006 307987 270086 268023 242180 216938 232023
10259 232023 222193 231032 226356 224307 235103 229193 267299 284777 276875 244320 213049 198408 228368
10246 228368 244217 227523 220086 219744 215434 210251 227769 221287 228508 205140 160978 159617 155567
10233 155567 125763 129785 139119 143605 146997 140706 126962 110115 134883 116475 85610 75136
10221 75136 77505 90662 120834 128649 124935 88811 53818 61894 20079 -8514 -2264 45064 91712
10208 91712 80251 108277 143539 149133 111106 79577 53928 72213 85380 83171 66279 45617
10196 45617 53923 79790 85032 44615 30340 57291 54937 44626 28844 -5313 7692 66075
10184 66075 95095 101923 75656 50460 57246 40477 35022 49090 77584 86141 58807 31595
10172 31595 46692 24141 6076 35273 34252 15916 39274 48032 53059 37718 813 -34559
10160 -34559 -16479 8920 45172 88431 98124 91580 77404 84374 105589 109000 79729 98836
10148 98836 102308 82491 79614 58170 61937 101078 81101 51448 29597 9732 7747 -10334
10136 -10334 -6000 6570 -2876 -14850 15612 51832 16572 36007 51669 50228 50855 51612 30294
10123 30294 -4942 -17700 3346 29804 49856 64792 25235 -30550 -63418 -63353 -61828 -44237
10111 -44237 -29625 -11453 9077 32907 27177 22916 11826 -9474 -14768 605 15591 20182
10099 20182 32303 28337 38165 72500 72473 59493 58453 76334 92413 70723 48279 35964 31101
10086 31101 9888 -8350 11990 8082 1952 382 -6422 6167 -9741 4815 12578 1426 -23038
10073 -23038 -49607 -26337 22353 19821 -8089 -35888 -42360 -37294 -30975 -46652 -53032 -60769 -44616
10060 -44616 -3901 828 -5450 -24359 -31545 -1148 12723 -725 -51271 -66576 -35687 -17929
10048 -17929 -36779 -52446 -34591 -545 21454 27043 26043 9158 11629 -5968 -27401 -22348
10036 -22348 1768 -3860 990 20808 30531 6456 26147 44516 27229 2176 -10822 -26948
10024 -26948 -31677 -10044 11556 23072 -30495 -55102 -50018 -3999 4526 8208 18431 24091 22263
10011 22263 16522 6949 12926 4637 16609 21426 -724 -5486 -18202 -20881 -185 -2135 17393
9998 17393 22616 45468 48829 44987 34556 37866 53049 69389 52612 49296 49942 15485 -2560
9985 -2560 -7733 -23183 -40626 -16802 -263 -15633 -27727 -22516 -20253 -21564 -26023 -2294 -5658
9972 -5658 7395 -9024 24316 44058 49611 50714 14457 -16218 -32195 -44707 -36055 -19864 -9343
9959 -9343 16203 47944 50090 17534 23638 15123 18751 8269 15153 31573 38638 64098 69306
9946 69306 60752 52374 67183 78170 75772 76683 84467 88776 135989 166597 228430 262888 337551
9933 337551 473803 648788 979616 1549314 2207415 2544369 2448006 2108732 1594891 1098004
9923 1098004 745294 515987 379141 288585 226352 195458 119539 42353 34248 45666 38082
9912 38082 34990 30202 26495 25703 23548 16012 32986 17178 11185 -8638 -4223 14007 61640 72586
9898 72586 78294 49451 23360 22261 32153 69586 65308 39052 1188 -37396 -673 35045 52526
9885 52526 34572 18347 13672 9442 11669 19167 24116 22311 -8661 -21075 25190 62140 77750
9872 77750 56810 80834 104149 88174 75302 86202 97911 102282 70633 73022 66597 58210 78803
9859 78803 98563 98139 100447 144885 192944 216228 237804 221897 223898 241015 280305 326234 371036
9846 371036 423534 553435 744992 1179921 1880211 2596943 2977468 2880893 2483470 1890247
9836 1890247 1315616 902295 662339 526379 459174 459635 503903 525438 542143 542905 583159
9825 583159 605377 647815 712317 752469 814165 898914 1023942 1161065 1305486 1471038 1697739
9814 1697739 1948452 2246736 2542198 2868870 3226646 3562326 3861625 4093153 4162520 4085975
9804 4085975 3868680 3592730 3233920 2898929 2559471 2221785 1923187 1686454 1491983 1306138
9794 1306138 1189346 1060544 935298 829303 718250 626841 572317 535214 494813 442984
9784 442984 409255 380599 325562 316946 329157 293902 267129 255281 253103 244498 195867 178349
9772 178349 154748 120329 97472 112080 118987 104572 118271 112642 120163 148711 148626 112427 75809
9759 75809 50584 70257 69193 65759 59663 50859 72108 76904 72078 66929 67322 64689 70542 95485
9745 95485 93485 62369 18780 25544 52283 57803 35320 -20960 -14482 25353 38491 34841 48876
9732 48876 33427 37404 37860 42373 57533 21907 28516 74843 111876 80148 42983 40634 41725
9719 41725 35737 38743 56824 51309 64169 44168 50189 69250 67159 24273 -27429 -18421 16396
9706 16396 34667 18862 17097 3565 593 17822 28086 17586 15819 11491 19121 32021 14792
9693 14792 21266 40272 55798 44864 30697 -7329 -7125 -17774 -15727 -12441 -24572 -17282 -1550
9680 -1550 7307 126 6274 6573 12945 6830 -9077 19151 15218 -14318 -17333 -16703 -13394 -6331 -13701
9665 -13701 5086 4038 -1124 -13864 3183 35747 497 -53600 -55245 -35004 -8771 9327
9653 9327 6925 15900 -5394 -6551 -415 6413 19114 24176 9879 2179 2494 13029 26693 13157
9639 13157 20356 4422 21763 30868 36160 24086 7929 17379 4129 9001 -14 -22467 -22514 5919
9625 5919 33789 63093 53636 19874 29686 38266 34424 24632 37207 32287 35954 32855 10939 -545
9611 -545 12408 4112 -14852 -21875 -11566 22605 47471 50056 47858 47918 25517 16814 -16075 -17252
9597 -17252 -8783 -30659 -68432 -43913 -21315 16402 6549 2210 -868 -5284 2650 8650 17607
9584 17607 11126 -1062 -2313 -2350 -8341 -16817 -16006 3723 17292 -31154 -46692 -13792 -11650 -43983
9570 -43983 -56298 -32424 446 -19575 -42741 -10404 -2850 -7330 3890 11284 7304 -5353 -15241
9557 -15241 -17180 -8373 -22742 -41145 -15444 11822 19860 -5785 -29696 -43744 -31573 -7709
9545 -7709 4761 -4841 -16613 10696 10985 25483 16750 11161 -13754 -17313 -32369 -35473 -13718
9532 -13718 -21846 -21685 -13047 11421 29577 23476 -1274 -10371 1555 -19793 -31257 -10681 3638
9519 3638 247 11822 41698 50549 51335 70112 72918 60780 37295 -3613 -15993 -25681 -24784 -7671
9505 -7671 18476 37351 42900 40575 43679 44957 37969 45775 47490 27843 35922 17181 32472 35275
9491 35275 19675 29676 52343 52360 42719 38400 39325 37919 -1571 -37704 -29723 -18322 -18089 -27697
9477 -27697 -38799 -20179 -19663 6659 27389 12399 18764 11580 8063 -26699 -40584 -18472 -19902
9464 -19902 -30484 -55246 -55235 -61670 -48847 -40910 -27856 -17633 2245 8389 -5068 9559 12312
9451 12312 10437 -2562 -7475 -271 -725 -40835 -25574 -18731 -21607 2617 41466 62427 26944
9438 26944 -27726 -25794 -6643 -2458 8709 41737 61237 77630 60066 28984 23155 6630
9426 6630 16436 -10635 -37690 -10793 -5710 -15590 12741 20854 26430 16390 2000 -19862 8809
9413 8809 10275 27055 34519 40847 61930 49678 33693 14182 -2583 -19148 9015 42371 31987
9400 31987 30822 31337 26448 11598 24420 23013 8957 13252 15211 8215 -18231 -13980 -313 29318
9386 29318 20484 18502 44871 75026 96849 85277 72131 48890 57089 53623 31559 11581 17055
9373 17055 12261 22558 40183 27797 25755 4474 26768 55066 50118 31980 9109 -7214
9361 -7214 8454 33728 53494 65858 33710 7415 13140 11107 -2851 -21037 -45274 -21829
9349 -21829 29224 51907 32142 19081 8827 28708 55396 68355 32928 18721 652 -507
9337 -507 10923 15329 7974 -12177 -4725 6686 20463 34273 34927 14081 -6167 -14438 -15909 14398
9323 14398 23282 73529 56322 35496 20719 22308 19968 33232 6609 -17058 -22955 -17630 -7971
9310 -7971 -8815 14578 33999 31295 23261 26224 36092 62445 75491 31736 1742 5606 7645 40405
9296 40405 34544 23664 60225 70096 24572 15542 5836 10539 55651 82601 74450 72760 76421
9283 76421 65243 76436 74546 60923 42915 22726 26398 143 7859 21824 -3270 -21799
9271 -21799 7771 36829 55452 29073 38393 64752 67748 52077 29883 -2811 -59736 -103692
9259 -103692 -88095 -39084 -5785 -18451 -36909 -14695 4598 -2585 2678 19260 61933 72396
9247 72396 67696 75297 70178 41484 3422 -5378 32653 43519 39584 46449 51813 66889 41673
9234 41673 35204 21993 -8562 27078 45531 58877 57821 27321 15985 -1574 17564 42016
9222 42016 58544 52753 44902 35038 47847 30714 12806 -12865 -13327 17739 28857 7637 9468
9209 9468 16910 9566 19691 47955 63855 54424 45849 72053 69241 41731 37784 72985 92930
9196 92930 88869 73282 62840 71539 83502 63021 89886 96353 95753 107076 103307 126544 112908
9183 112908 87114 97479 102557 88792 60369 56041 67330 69936 59882 38759 26334 49358
9171 49358 61786 68530 71119 63862 60692 68110 70207 85015 80740 72145 81378 67025 64132 65116
9157 65116 35200 29960 59838 101032 101577 113358 104855 92244 98085 71140 63902 38009 73854
9144 73854 118413 131602 136487 126004 107865 119341 95931 85657 59263 42627 50410 36994
9132 36994 27252 71193 113120 120660 110638 90384 79421 81657 63403 69887 91794 77374 64796
9119 64796 49858 24257 14142 48770 80626 51435 39807 59470 44098 2201 -13976 26566
9107 26566 23527 19199 31913 51062 76654 72061 54076 32802 19818 22790 32795 33874 68204
9094 68204 44883 57655 82741 58341 28729 28140 30553 19930 14575 23398 38095 39748 51853
9081 51853 53145 57319 40065 45425 73145 97295 98938 104088 68092 60137 39691 9703 47546
9068 47546 72138 75323 46666 28055 16858 32580 38402 47425 49507 66094 40371 44945 37611
9055 37611 16871 40757 51399 60078 70300 71960 78257 62857 56031 61720 63991 60109 41221
9042 41221 64920 66500 47595 46115 51634 72945 79768 58098 35674 50921 64422 71756 73877
9029 73877 63862 33571 41282 41253 40870 38311 72803 90834 82813 44648 17408 20043 -14111 -3079
9015 -3079 14979 31950 31537 37987 57913 63259 40767 -2221 25614 30668 15400 5248 33351
9002 33351 52784 58148 33681 32020 11197 4036 19847 17369 29028 50418 52779 19261 9772
8989 9772 2718 -9853 16696 22740 12756 -10101 -11861 -166 27433 73568 80544 52155 5675
8976 5675 -35 8642 -3690 -4016 19460 30877 36565 36219 16270 32922 43070 46756 49427 56651
8962 56651 76403 48864 59535 79323 77609 57217 50826 72440 68419 51991 42721 47145 81203
8949 81203 89786 60829 57075 54483 47026 32360 11372 11994 28130 9366 28465 39825 49899
8936 49899 51787 55075 49474 12771 1536 11452 6807 37696 38079 34439 33179 28965 17935 18170
8922 18170 27411 36035 21414 -41234 -7486 24963 18588 -22194 -13310 1182 9828 49147 61524
8909 61524 53346 41869 13355 360 21948 22363 -7632 -8979 413 -1342 -440 -38869 -42327 -28900
8895 -28900 -28796 -4919 18286 34859 45814 43143 44793 15013 -5673 -38077 -28410 -16572 10211
8882 10211 -978 3326 11219 40314 21454 4599 15611 -3101 -14611 35443 60040 52666
8870 52666 49456 57501 52531 44096 1536 8710 23568 1164 -5201 2257 25651 46814 39997
8857 39997 27789 34807 26934 32215 21699 -10824 -12083 18251 58995 62556 34917 28481 16310
8844 16310 12936 -3082 -18230 -18304 -2427 34230 47651 38253 26374 29263 52320 63261 49699
8831 49699 21076 38270 32966 9008 8492 -8518 -29176 -11053 -6798 -36492 -53306 -59387 -32870
8818 -32870 -20340 -22536 -51544 -32150 -22397 -22726 -32085 -36759 -28858 -631 11061 28754 23845
8805 23845 93 -10135 -35993 -15523 -3792 -8535 -22501 -33179 -30560 -20142 -30524 -16655
8793 -16655 -27625 -40686 -48911 -10086 11096 33930 21413 -13337 -42289 -41471 -30201 -29695 -30072
8780 -30072 -6111 2474 18017 28272 31634 20050 -5916 -13370 -32255 -40951 -29971 4587 32842
8767 32842 57045 39801 18000 -7964 16642 9976 -14000 10948 29697 53900 64899 53779
8755 53779 14893 9495 32619 20323 25439 19849 26451 37569 25537 27334 35129 30428 17701
8742 17701 15643 4100 24374 35776 32075 48559 66303 92601 91136 88319 66765 45937 36084
8729 36084 38846 46465 55953 67394 80391 84199 73070 29131 26733 67156 71688 70824 53093
8716 53093 59552 69653 49528 14460 18352 41467 26423 6698 19883 38004 25481 11819
8704 11819 22035 26644 19597 24527 21568 20462 40585 23955 53466 44153 33114 22818 15494
8691 15494 47393 47113 25649 15607 45251 58106 40543 27099 41629 62852 49760 14866
8679 14866 37919 39281 46863 53972 36230 18494 -10673 -22126 -36899 -21039 -14650 -13590 7692
8666 7692 19274 23890 60749 89045 81048 50603 55879 58074 21482 7891 25824 32844 22976
8653 22976 50165 61425 57171 98566 103971 109376 96538 88044 94391 140056 226528 346000 556400
8640 556400 725378 743266 689544 570747 382622 269903 230491 189107 149281 131007 137932
8629 137932 158354 133424 122535 100575 66051 54533 48933 62608 66220 76711 77974 63520
8617 63520 71308 96211 106261 148554 198979 203907 163473 163160 131047 94476 81624 103394 135481
8604 135481 160484 177068 173035 194234 253835 312542 426730 699689 1123158 1517840 1584275
8593 1584275 1458481 1237963 921294 690936 531020 429402 374663 364584 328742 291811
8583 291811 275637 243827 219948 200582 183192 177992 148504 124239 104679 126954 149027 164615
8571 164615 172237 146502 139620 132972 98683 63794 68961 95843 97122 114054 144459 153941 128992
8558 128992 119027 150398 151298 123557 124377 188076 278662 430691 628340 710295 682626 606514
8546 606514 466645 292796 227653 226016 192687 167416 168125 156357 126556 119758 134951 103678
8534 103678 78085 80682 73743 66137 52698 34078 39843 56113 62043 43905 40923 40564 39403
8521 39403 28159 45404 33601 24911 8729 -5569 7245 8187 -3890 -29193 -37043 -17575 11944
8508 11944 38647 64567 53037 30413 22418 11558 -446 -28511 -23739 -23558 -12916 4145 17311
8495 17311 21472 45319 35163 13665 21895 38653 84447 60990 29731 22515 -43014 -67583
8483 -67583 -49172 -23466 -26441 12373 6574 -1657 -1849 4444 -3975 -20543 -5930 8687 23841
8470 23841 30313 39051 59539 53158 40750 45670 14456 9754 15610 7724 -6054 13211 19384
8457 19384 9830 2150 4953 -2018 -5310 6987 25190 34285 52516 58471 43497 67491 61506
8444 61506 42489 -10283 -13316 -577 30686 34288 19021 25682 55668 82180 68323 36466
8432 36466 3977 13352 4041 -13257 -29837 -12469 12923 26002 40394 55937 71560 34986
8420 34986 -295 -7547 12293 29861 50066 36003 6036 2829 18176 11920 1499 112 -7518
8407 -7518 13689 -20089 -45979 -35696 -8745 -14091 -19365 -25314 -21562 -31 8061 3407 2990 -11624
8393 -11624 -22681 -15173 -8171 -3110 5681 -6233 -13851 -5916 8249 881 -20966 -9892 29413
8380 29413 70753 58112 46262 34672 21009 -7942 -1315 1796 -13812 -34677 -64032 -33399
8368 -33399 -5825 -2242 36340 31751 6990 -4208 -22261 -34397 -30958 -9739 30198 15401
8356 15401 468 -7056 14804 32549 34507 9119 13405 18831 4173 469 -21598 -19034 -16949
8343 -16949 -13755 -2587 -4516 2580 3029 2524 7711 -10001 1511 -1487 -16100 -24255 -13450 14289
8329 14289 37576 3802 16500 7753 2941 -18378 -3194 11990 3835 17643 19253 16946 36637
8316 36637 25046 46489 75489 46987 28718 683 -12754 -8183 9517 3099 4456 -16125
8304 -16125 -19916 -7132 8598 6563 5166 -11471 964 21417 14842 630 -20051 -40585 -38678
8291 -38678 -37212 -52627 -41919 -10834 20368 17046 -18633 -63058 -47295 -21995 13770 27714
8279 27714 -13224 -25124 -4259 29350 35443 55410 32155 7441 -5435 -7988 -59312 -68334
8267 -68334 -48703 -34971 -40456 -43692 -50038 -31124 -11866 -45582 -48897 -19610 -5574 -12622 -10788
8254 -10788 -22864 -24947 -25432 -12900 -10825 -38143 -52575 -41498 -25370 -30844 -33453 -19316 -6418
8241 -6418 -18265 4264 1347 8502 739 7194 3783 -1924 -25066 -25618 -19550 -3527 -24032 -8607
8227 -8607 7982 29544 25855 8541 31 -29554 -41017 -58341 -48519 -32510 -565 -15352 -47512
8214 -47512 -54333 -38259 -14843 -13005 -15705 -24362 -24390 2625 27722 14484 8669 33427 3675
8201 3675 -17725 -10412 -2644 10276 6795 11014 -942 -14138 -17118 -26023 -5106 11649 8281
8188 8281 -12391 -47205 -35007 -27740 -21761 -17686 4611 7120 -4757 -24642 -32932 -30508 -9415
8175 -9415 30304 12354 10509 14645 -8905 3617 10637 18680 19726 -334 -14676 -42941 -29552
8162 -29552 -9371 5923 -9893 -3726 -30274 -9661 6654 -11784 -32363 -31438 8185 30591
8150 30591 52443 30553 -1079 -23641 -13498 -2753 -5211 2830 12294 18876 24792 30351 36721
8137 36721 20041 -10213 -14333 -3648 -19182 -28606 -36844 -28450 -8327 -18797 -53333 -28251 4116
8124 4116 9533 16769 5157 10925 12112 19120 36171 31633 50827 41333 24313 34462 37440 -972
8110 -972 -30394 -16773 8502 49788 6653 -4395 -15192 -30355 -45695 -33636 -50768 -50790 -57709
8097 -57709 -66214 -57830 -55770 -64440 -51226 -43282 -54248 -31737 -15560 -16453 -35357 -6492 169
8084 169 -9601 -6372 1819 47174 45061 13155 25437 22835 33235 43662 28578 18821 -6531
8071 -6531 -34068 -51955 -46333 -29706 -5941 -4027 17489 796 -32286 -56693 -53435 -16007 15885
8058 15885 4472 -7764 15563 55492 50804 70474 57063 43947 20317 -3990 18661 48043
8046 48043 55965 55368 31299 40470 60261 41070 29968 35716 47671 72134 75483 73419 47804
8033 47804 38852 32515 40668 20772 -897 9204 9748 16682 15607 -13992 -5221 36608 59347
8020 59347 66437 53140 75525 65132 56213 58443 51189 58340 57562 21738 -8447 -6383 -26332
8007 -26332 3421 502 1586 30020 62314 37594 -233 10002 40342 54688 59737 108499
7995 108499 134523 132521 130367 117290 106375 87384 71835 100527 114672 107906 106591 104561 111746
7982 111746 111122 95740 64144 59649 86312 90791 70418 67112 73051 57117 16505 -14804 -6916
7969 -6916 2491 29309 4080 906 -7943 4059 20481 10871 18194 37275 68243 96560 85249
7956 85249 73330 65801 83790 92354 110207 131864 141418 131353 127722 91227 86958 84532 91965
7943 91965 133749 132024 118833 125314 106783 79693 59321 64846 81284 51006 60011 66398 48440
7930 48440 51259 49079 32984 27015 63101 90240 88242 67249 21906 -12613 -10046 -3870 -9269
7917 -9269 -13370 19433 36297 -10880 -3909 59062 76273 50566 37779 64153 91368 74735
7905 74735 50302 53319 42622 23218 37648 40898 69027 44517 3722 5354 12050 8838 4320
7892 4320 10575 1837 -6563 8877 8805 19103 19949 19171 -10349 -9590 -6045 -2576 -16611 1025 44036
7877 44036 40419 34133 8363 -47899 -57017 -42172 -41475 -47107 -39977 -31668 -2338 5418 18799 1145
7863 1145 9413 38447 23267 28020 20073 -6173 -13237 -19628 -44453 -40135 -24269 -7366 -15825
7850 -15825 -19504 4318 14912 -17901 -26950 3800 13575 22102 -21027 -14891 16635 14906 13706
7837 13706 -18257 -32130 -44905 -40778 -30784 -22762 -5824 14592 -481 -39930 -28528 -30243 -57218
7824 -57218 -77403 -42741 -11196 -3627 -26311 -48583 -42073 -7735 -21889 -114 7681 1391 -4832
7811 -4832 6287 3134 17726 30586 1817 -17459 3843 -4571 -14214 -32380 -24531 -24477 -34563
7798 -34563 -34169 -34415 -26036 -12646 5981 5490 -23030 -31563 -12927 12456 29061 42706 7160
7785 7160 11802 11329 -30913 -33521 1099 3454 -4100 2036 12583 8023 -39184 -71163 -68985 -49763
7771 -49763 -42583 -42863 -26361 -11088 -2384 -14470 -26242 -24838 -34957 7320 23512 -3660 -24346
7758 -24346 -33942 -10411 9866 31923 12017 9472 23957 2750 22197 28871 37550 40738 33259
7745 33259 49729 36509 30345 4003 -22730 -12571 8825 32959 55794 42494 3922 16572
7733 16572 31833 17716 30458 -15869 -28217 -38385 5829 40955 23587 11460 20217 30288
7721 30288 20676 8307 3120 11363 7410 -31509 -47511 -54658 -42288 -26186 -33153 -5833 16563
7708 16563 12795 -395 -21928 -5499 -2788 -6872 6831 39861 26092 3029 2703 -3821 -26326
7695 -26326 -11852 4028 5243 11444 26980 18022 4129 5720 34171 21125 21222 23505 3615
7682 3615 -1120 -6184 -5108 23106 856 4103 6654 -19909 -27718 -6331 35758 81543 56306
7669 56306 -19921 -48149 -23143 -21854 -31942 -50648 -57682 -48584 -48655 -33017 -38441 -45616 -41620 -33154
7655 -33154 -751 41301 12517 -7192 -535 53 12349 2500 5414 8784 -4660 -18951 -27971
7642 -27971 -44234 -58057 -40707 -52912 -62359 -10218 -24220 -61510 -41711 -30071 -9925 3887
7630 3887 7585 -51504 -41189 -31816 -25946 -25988 -19039 3179 13325 13598 22654 18120 46886 36352
7616 36352 10403 29601 38295 13527 -26947 -46085 -54887 -53267 -36982 -13348 -13351 14498 42367
7603 42367 30291 -4804 -17833 -11575 -15375 1634 -5734 -4213 15126 11277 -15287 -22358 -8599
7590 -8599 -23965 -38301 -39994 -53994 -72546 -49209 -35208 -15143 15551 28155 39837 -1506
7578 -1506 16414 -11136 -20499 -41509 -51105 -41530 -8431 -8041 -4777 -20250 -42950 -16547 11233
7565 11233 -7651 3081 -21196 -65475 -67042 -48521 -58422 -34549 755 3166 -32724 -34503 -38002
7552 -38002 -33840 -42740 -23953 -1432 -23446 -24706 -10485 -14743 -17996 -44500 -54549 -26536 -44434
7539 -44434 -55807 -23701 -27344 -14409 -25281 -14279 7637 41970 14945 -15253 -36153 -23679
7527 -23679 -34437 12957 13954 -8238 -16449 15188 21854 44959 41718 27041 16261 -6587 -9233
7514 -9233 -2226 -10665 -52349 -59997 -29430 1405 -977 -12052 -18014 -7580 -3883 -2235 15991
7501 15991 22563 15143 -11709 -32812 -47383 -43170 -41146 -24378 -16321 -6600 -18920 -49219 -54707
7488 -54707 -30673 -13852 -5293 -8658 -35886 -47989 -44123 -60211 -56541 -11851 10018 7066 -11251
7475 -11251 -18789 -23922 -29381 -29133 -32629 -8038 -209 12564 2924 720 7458 27722 11643 39666
7461 39666 46335 28334 14322 20374 27350 14481 10335 -10415 -14491 -30743 -361 18983 -6570
7448 -6570 -6278 -22114 -19084 -16919 16501 53172 76166 47607 34511 31363 39705 30897 58537
7435 58537 78142 29810 -14191 -48170 -17220 -3693 -18026 -37110 -18795 -19666 -6838 23234
7423 23234 6291 -30212 -46611 -24690 -34707 -20103 18114 41044 7409 -13914 -26696 -36992
7411 -36992 -30561 -39234 -33785 -4999 11685 -19335 -29966 -35534 -45735 -28683 -22925 -7414 -9491
7398 -9491 10723 5082 -12017 -9433 8565 12904 -21458 -28259 -34698 -31977 -38566 -33946 -29869 -34447
7384 -34447 -45927 -27661 -6143 -15429 -66009 -51740 -22659 -23372 -9930 -6043 -9530 -2531 -2886
7371 -2886 610 12939 17898 13705 2323 7136 9931 13461 -1542 7018 -17284 -30600 -38112 -27107
7357 -27107 8660 14476 19979 4111 -22162 -29676 -17899 -36864 -3252 7856 1071 -6091 -24358
7344 -24358 -53477 -59077 -13044 3874 -3278 19525 17553 20026 11195 23742 54380 77556 86464
7331 86464 60518 28298 864 -29221 -16981 -9993 -979 -3517 -8195 -16747 -19351 -16897 443
7318 443 -35171 -44716 -23852 -22490 -156 29096 35777 39701 26050 629 26029 18747 -4165
7305 -4165 -10285 -5687 -21737 -29907 -46519 -62567 -26714 5245 30874 19241 -8673 -37369 -14531
7292 -14531 2387 -5683 -46847 -68322 -34568 -19313 17793 37666 28017 18261 15125 3734 6203
7279 6203 -18581 -38808 -12771 -16162 -22418 -33783 -22523 -26096 -25210 22518 -7974 -36969 -49289
7266 -49289 -40239 -33882 -10997 20343 10279 11668 -18453 -58098 -51701 -20199 -516 11576 36324
7253 36324 26341 21821 14194 1721 15794 24647 47223 37130 30410 -274 20517 6677 -16641
7240 -16641 -37333 -25778 -42680 -52348 -32747 -22488 -43313 -54058 -33013 8379 3866 -19627
7228 -19627 -21589 -24641 -18820 3826 480 -1582 -3077 -4107 -6732 -9849 4009 -11895 -9407 11363
7214 11363 -14010 -45708 -17008 6538 3352 206 -14758 -18436 -2126 -40614 -57714 -24209
7202 -24209 -7328 9280 -713 -14702 -37851 1828 19905 -24512 -59430 -50563 -47887 -50290 -24637
7189 -24637 1364 -32670 -17020 -12026 -18071 -32898 -3749 21299 42881 9356 4959 31899
7177 31899 30521 8221 24516 8370 -17877 -12511 -29182 -63111 -63659 -32795 -9518 3557 -11023
7164 -11023 -32632 -10228 -6603 -19247 -12004 -1451 -5562 -1114 -47 25246 6428 -15929 -8874
7151 -8874 8807 21456 40282 55801 46794 52784 46604 30089 18774 12821 21090 14533 -13138
7138 -13138 11046 18689 19328 36877 28987 12344 -10247 -30421 -15697 -8812 -2203 16206 21190
7125 21190 26973 40065 32376 6869 -33149 -41033 -62117 -52146 -26519 -47118 -59454 -56946 -50961
7112 -50961 -63737 -58470 -32137 6920 15664 14791 -3736 -39491 -65939 -52466 -16560 -13710 -22924
7099 -22924 -23783 -35377 -39798 -12302 5526 -12191 -52260 -29955 -28949 -38107 -36323 -30126 -21338
7086 -21338 -18446 -21748 -35696 -32887 -3926 -40753 -35868 -12073 -16853 -32290 -21482 -319 17768
7073 17768 48338 59949 53962 15135 -29526 -16485 -11369 -12996 -979 -3872 -17650 -11817 -1805
7060 -1805 -9705 -26298 -51945 -39330 -15079 -30983 -49937 -61277 -40599 -15980 -918 5866
7048 5866 -9190 -29481 -38681 -16191 -1908 -10563 -15594 -24414 -15341 -118 5178 -11396 6924
7035 6924 23699 -18102 -40444 -38639 -46852 -44357 -4250 6074 -6178 -17629 -9760 -9866 -24171
7022 -24171 7756 49029 42181 28506 6429 -27174 -34773 -25180 -8177 -26045 -20971 -14008 -12199
7009 -12199 -10539 -25618 -26270 -29997 -34610 -57408 -50874 -25677 -13143 -14307 -40301 -26290 6090
6996 6090 8768 3067 12844 -5168 -30147 -6166 7633 1221 4810 -2836 -30472 -38467 -27510
6983 -27510 -17952 -17422 -27478 -13544 -1605 11800 -23750 -31191 4449 10133 3374 -6885 -16697
6970 -16697 -15176 10705 44189 57616 36331 11074 -17345 -43225 -49596 -59210 -78723 -49004
6958 -49004 -54111 -50684 -3406 2677 2354 -15251 -16774 -13430 -23083 -19988 -5934 17740 39514 18263
6944 18263 -35133 -66366 -72158 -34528 19936 5525 16811 -11709 -42139 -37642 -10440 7666
6932 7666 5271 -5719 -19411 -15334 8630 18518 4295 -4833 -7983 -25202 -27924 -13188 -2919
6919 -2919 13515 21320 20867 -11861 -23540 -34421 -57496 -53102 -13217 -4167 -857 22317 33929
6906 33929 13091 -7698 -12215 -7873 1447 -12521 -18572 -25555 11557 4130 15089 43512 12408
6893 12408 -14427 -19607 2719 12512 -8347 -28579 -32307 -42149 -37169 -19917 -25047 -33809 -37228
6880 -37228 -65438 -95474 -80237 -24128 -21301 -32400 -31843 -14094 7718 28472 22217 -1581 -36704
6867 -36704 -48033 -54709 -30227 -6911 10752 38493 35794 43343 33254 -1366 -12406 -26837
6855 -26837 -48551 -45825 -34037 -28464 -27764 4283 8486 3337 -27056 -13903 -4253 -9344 -6025 18764
6841 18764 -15620 5556 57708 55115 4699 -29701 -23141 -22375 -47973 -45826 -42379 -58757 -42303
6828 -42303 -8232 -13504 -33882 -20188 -10171 -13998 -2812 19736 15131 -12950 -1354 -15423
6816 -15423 -28528 -58751 -42318 -1805 19228 12596 23990 48632 47919 7071 -29663 -38168 -32622
6803 -32622 -9399 -12366 -3886 1932 -17431 -38269 -30254 -169 5645 4027 -12885 -35812 -9435
6790 -9435 -22399 -56350 -72703 -58116 -62060 -47999 -26925 -4630 -10011 -14431 -34521 -10955 18091
6777 18091 17144 5240 4470 -3987 -19799 -9712 -1521 27563 28858 16380 563 -9075 15104
6764 15104 12396 36994 50675 12031 -925 -6013 -49430 -78798 -98683 -57733 -21804 7185
6752 7185 2397 -31655 -23170 -19787 -10595 280 -219 -11261 -19070 -22185 -47360 -39151 932 11807
6738 11807 12367 18560 28501 53265 34948 6807 -7249 -14584 -17261 -24321 -16084 12048 -505
6725 -505 -8881 4775 2349 -2113 1636 27573 36745 16695 -4166 -4225 24174 12246 10938 19957
6711 19957 24857 22583 12967 4382 21744 13281 -1626 62560 72826 65667 38295 -1972 -5063
6698 -5063 -14819 -26502 -1536 3147 14477 12043 -6785 -2307 5778 -8324 -41934 -53149 -48624
6685 -48624 -19929 2821 -9203 -19179 -15461 -17060 5500 12079 -8401 -38677 -5241 40280 29874
6672 29874 27914 43676 30079 -10968 -1015 28849 27055 16068 29769 23716 -5265 -1554 3887
6659 3887 21718 23733 11887 7926 -6341 -36726 -43953 -71326 -44284 -23387 -12555 -10 5468
6646 5468 15404 -9181 -15277 -19602 -10705 -25564 -13892 6158 20313 34451 10475 9560 20301
6633 20301 17365 -3831 -6688 3144 -26692 -52174 -68020 -63501 -50192 -50420 -19865 10001 23971
6620 23971 10309 -11324 -3984 -10821 -3902 -45629 -80256 -94492 -89745 -41312 -40070 -26246 -26769
6607 -26769 -29158 -1226 38482 45017 36133 22972 -8846 -37901 -27182 -24945 -9886 13905 48506
6594 48506 35671 17594 7383 -2844 -12199 -34625 -43738 -57588 -49777 -52613 -19657 11388 12000
6581 12000 -9260 -9862 614 7058 15934 4848 10120 -9773 -27548 -25599 -30252 -42500 -31657
6568 -31657 -29867 -23975 298 2500 1236 14366 30805 -7190 -25381 -26639 -16978 -23492 -18347
6555 -18347 -18867 -15989 9875 14360 25032 34827 45338 52546 40199 17086 -749 877 -12415
6542 -12415 -6392 18179 29394 4257 -28271 -63067 -58479 -24458 -16735 -15126 306 -23408 -45762
6529 -45762 -42061 -5800 6315 20686 12891 -10435 -29523 -18312 -17528 -12514 -12207 -10066 3663
6516 3663 9804 28971 69348 64255 20547 18288 28162 33527 6823 -22102 -30410 -36577 -20650
6503 -20650 -18770 -15630 24673 13503 51901 86333 44573 3092 8385 45040 21928 5432
6491 5432 14133 16801 11885 6478 -32383 -2502 38301 45152 14988 13087 909 6367 39728
6478 39728 72434 79685 54798 28116 6879 35581 32629 34359 10169 -8554 -42994 -60271
6466 -60271 -55460 -64978 -66657 -36374 -18945 -36972 -47399 -31686 -15134 -14064 -20315 4847 25319
6453 25319 40115 23924 -7822 -34369 -25741 -18368 1998 16464 -13004 7023 27111 9785
6441 9785 -16895 -27695 -44812 -42842 -25534 -6061 -5206 1650 -21913 -48324 -33659 -2605 -9327
6428 -9327 -56136 -35167 2996 22741 37430 22516 2690 -28716 -66830 -32037 -23851 -12556
6416 -12556 -4854 31 39056 35980 -3033 -6252 -27410 -24292 -27017 881 8595 22461 22309 938
6402 938 4114 9636 -4731 -30748 -18515 -21765 -14855 -23442 -9427 12830 3542 -5672 2209 -1976
6388 -1976 -11515 -40944 -51590 -32018 -30994 -40938 -33153 -45192 -88612 -44459 -11103 -13918 -35095
6375 -35095 -50563 -49150 -38009 -13937 11079 2024 14838 28261 39075 -4052 -17814 -22167
6363 -22167 15777 18371 -11088 -13534 -8327 10762 -24439 -42847 -47026 -54480 -43685 -15742 -22782
6350 -22782 -38596 -29675 -43497 -50963 -40996 -38741 -20696 -3094 6395 -7492 -44246 -33694 -38807
6337 -38807 -50889 -37244 -22012 -26180 -36753 -33469 -14576 -4655 -29878 -34989 -51100 -56076 -34003
6324 -34003 -10514 -4798 14389 14619 18550 29431 -10833 -34506 -18734 -865 -25493 -11077 -598
6311 -598 -6121 -3160 -34973 -53575 -56033 -78526 -81845 -70587 -39524 -16804 -31355 -28891 -13600
6298 -13600 14476 11920 -37622 -57701 -49496 -22833 -2195 -19725 -14761 -19349 -7422 1690 -22562
6285 -22562 -33758 -53782 -10037 -20788 -18827 -3142 33885 51421 28577 14740 -9207 -32426
6273 -32426 -55415 -41642 -34256 -16189 -474 3006 -19751 -38511 -32008 -7114 -10189 -34174 -37397
6260 -37397 -59386 -36639 -9884 -16868 -31676 -14885 16792 11068 -15082 -27443 -1630 -28211
6248 -28211 -57704 -31756 -10383 10133 19749 30350 12813 8364 15614 556 -483 28013 16547
6235 16547 7364 24685 55731 42790 2936 -3260 15066 5126 -23331 -28448 -17704 -12916 -31766
6222 -31766 -24710 -6116 23774 23517 -2666 -7089 5479 21254 13648 -10722 -5078 -17516 -19813
6209 -19813 -22002 -24223 -36699 -54188 -40209 -43487 -22369 8473 6567 -27693 -37247 16084 13735
6196 13735 -5558 -29358 -7797 5818 -6160 41 19900 20770 -7549 -5452 4907 9051 -18548
6183 -18548 -39383 -39867 -52777 -45542 -16560 -13809 8082 24898 4372 -34519 -48104 -32425 -37652
6170 -37652 -40978 -28472 -5885 21212 51716 40348 6954 8596 24417 32310 33464 14352 13241
6157 13241 44450 58493 45231 -16904 -17497 451 8224 468 -31488 -40959 -25155 -4849 -18652
6144 -18652 -17237 -6713 -1742 -19371 -35526 -38895 -22410 -2441 15357 21098 16348 -15526 -5362
6131 -5362 14908 43722 30838 9901 -15495 -448 11270 16488 11451 -12740 -60867 -60086 -43069
6118 -43069 -11241 15952 6155 9240 24964 48139 54987 23808 -2255 -38109 -51051 -40739
6106 -40739 -11609 20988 34203 52017 57092 42336 37572 39612 26608 -7359 -34896 -48685
6094 -48685 -37173 -16559 26392 38603 77 -8404 -33025 -4885 -3776 16543 10055 -10353
6082 -10353 -27759 -16805 -26768 -15527 -22175 -12771 -23510 -18701 -32673 -35566 3628 7715 -15848
6069 -15848 2723 12339 9297 15470 36399 18439 30547 4902 -9280 -5875 -22544 2701 9249
6056 9249 9940 -2663 -9741 -5997 -13403 -4456 1286 27862 33978 25781 8735 -9533 2889 11193
6042 11193 6390 17432 25615 -12810 -41664 -21027 -27834 1810 -662 -36013 -33460 5115 -8874
6029 -8874 -17931 -1483 4274 14254 7659 -9987 -557 -8460 -31637 -54029 -32533 -42000 -47202 -37521
6015 -37521 -37854 -33935 -55164 -67481 -66491 -77241 -60196 -35782 -24094 -4947 20573 32474 24993
6002 24993 33005 31086 7756 -11569 -3007 -5564 -4168 1017 -13906 -11289 17227 24180 18697 36809
5988 36809 53702 56820 37968 2705 11506 50086 54111 35821 -1786 -39343 -41337 -57039 -39552
5975 -39552 -22859 -19125 -35065 -50355 -63341 -83142 -87558 -60673 -23629 -1690 15321 7090
5963 7090 13813 12195 3367 -2374 -1345 8221 1851 12388 7412 -10374 -19618 45237 65213 52210
5949 52210 59299 38345 -4445 -12290 -21556 -14007 -22989 -45153 -37140 -8315 1031 3366 19951
5936 19951 10782 21778 19781 12108 16877 18024 -7398 801 5196 -11180 -25855 -49753 -40931
5923 -40931 -20330 -34283 -62344 -46534 -29356 -50042 -60076 -46131 -46120 -31608 -18041 -16041 -1254
5910 -1254 9237 -8792 -15612 -7561 -25598 -21838 -10203 -20633 -34400 -39750 -22363 -32228 -33927
5897 -33927 -21866 4690 -27941 -7576 10862 12213 17140 20397 19869 -9556 -12381 -1711 -39018
5884 -39018 -9063 6565 -16469 -31998 -59558 -34247 -22659 9206 -3105 -41847 -47806 -18521
5872 -18521 -1487 -14309 -2295 6304 49114 44970 3777 -27434 -27232 -5210 -31124 -28112 -17629
5859 -17629 -21947 -3180 3835 -27822 -40231 -35850 -17565 -6716 1121 2613 -25442 -43764 -50627
5846 -50627 -23389 -25734 -35012 -37579 -33504 -21219 -6334 11505 -12760 -7682 13396 6752 -9553
5833 -9553 3969 21713 4838 -3592 -21063 -28823 -7162 -1922 -11984 -26605 -18535 -35457 -46032
5820 -46032 -56646 -48390 -64389 -41990 -32887 -6107 3327 -8576 -11329 -42603 -20455 2773 23499
5807 23499 46313 55898 32389 19943 18235 194 -31760 -18663 -11729 -6691 1822 -693 -9652
5794 -9652 -6718 21131 35690 21123 681 -18213 -16345 -11966 -55887 -49451 -21949 -46614 -44007
5781 -44007 -5333 8877 -9074 369 -12969 -40532 -40670 -23433 -25509 -28209 -39906 -52213 -58300
5768 -58300 -38514 -45758 -46825 -196 5504 -13065 -16568 -12114 -12151 -36750 -23745 -20880 -19337 -13974
5754 -13974 -14997 -28514 -778 -24766 -7046 -11304 -13605 -8844 -12836 -36709 -24640 -45843 -37496
5741 -37496 -23105 -32104 -35744 -45500 -22240 -21594 -34897 -24628 -25953 -25016 -23923 -29438 -43084 -48032
5727 -48032 -47980 -53312 -40938 -33531 -33870 -46129 -25977 -13207 -9974 -1531 -12565 -35883 -37960 -28466
5713 -28466 -6929 14507 38231 21209 -7826 7019 8275 28707 52959 55886 -115 -32409
5701 -32409 -34376 -33991 -34696 -21040 -8608 -16365 174 10256 28135 24534 11338 -15550 -12830
5688 -12830 -3075 -21826 -12681 -13395 -13416 -25892 -36982 -37268 -19547 -17100 -21833 -12962 -17128 -158
5674 -158 -691 5258 14729 9551 21747 11241 -17252 -29900 -20514 -19503 -26463 -35186 -71586 -78621
5660 -78621 -16257 13256 19891 30613 13626 -16185 -27576 -11091 -14209 -32191 -68603 -74111
5648 -74111 -28136 31419 25361 -709 -23674 -10874 -2774 -6559 -11470 -26356 -6950 -13813 -32905
5635 -32905 -29998 -5702 13397 -5295 -13213 1576 -7135 -12017 24765 44249 38090 17754 2537
5622 2537 8364 17364 43258 53026 26031 812 -418 -27403 -52825 -41181 -7974 18065 5890
5609 5890 -20949 -18503 -28620 -18577 -29116 -30045 -21619 -6328 -5403 -19996 -9779 -1171 -2814 -3660
5595 -3660 24928 46454 52255 47434 46232 40039 47604 37970 59717 80832 64526 47440 54097
5582 54097 61234 36540 33160 23077 20225 523 -10697 -11109 -27999 -23741 -12579 -29811 -24303
5569 -24303 -34441 -23134 -1757 25321 1692 -13579 -7426 2209 111 23947 34324 15492
5557 15492 -20810 -19134 -7060 1678 6881 -6101 15503 -15165 -12013 -60 19219 13916 16602
5544 16602 26563 18807 11187 6251 -10781 -7414 4246 32713 21927 4855 469 771 21488
5531 21488 -17993 -10161 7288 14922 6042 -3287 208 43537 61563 46841 32029 21802 19610
5518 19610 10611 14365 45810 41074 40840 37214 20380 19890 43251 48212 20498 4557 -21513 -51520
5504 -51520 -61250 -35425 -15592 -14280 -9405 13785 22710 5661 20663 23982 -9565 -40214 -34587
5491 -34587 -23269 -31209 -31440 -31917 -54842 -29707 -1378 5069 20942 46330 37593 15153 -16415
5478 -16415 7221 12146 43969 20800 5556 182 736 27508 35246 22331 4948 -8427 -33655
5465 -33655 -41362 -24739 7188 21980 -1609 -27102 -27486 -26475 -11924 -16178 -27471 -1934 -4400
5452 -4400 -31156 -23111 29498 -10353 -40680 -30963 13726 4842 5948 -3927 -30310 -26134 -207
5439 -207 9171 14522 33917 27511 8879 -27356 -30800 -38740 -43556 -23975 -22831 -263 5323 20297
5425 20297 16734 17818 -10917 -21622 2533 22355 33458 15647 16963 14606 7880 25541 9581
5412 9581 -24119 -23205 -27812 -28274 -56728 -42754 -11714 10596 -14761 -16093 -9977 -6027 -2284 -3719
5398 -3719 29701 7848 -18965 -799 -20334 -39758 -37576 -45259 -53656 -35085 -57261 -52509 -40834
5385 -40834 -53224 -37588 -4153 -9418 -14021 -36748 -42182 -24197 -38047 -39812 -38084 -12456 -3839
5372 -3839 -24184 16225 36370 20401 4863 2660 18642 18333 12063 4249 34055 45533 9871
5359 9871 -2584 -12379 7977 -7899 -15649 710 28861 15768 10389 20654 8712 34466 24743
5346 24743 10495 163 -19939 -32678 -44295 -44662 -21350 -17264 -27490 -54323 -16601 -7675 628
5333 628 -11389 -25009 -28121 -16233 -5470 -9606 -24355 -26160 -16877 -24248 14255 41740 43827
5320 43827 24435 22239 34411 34970 37264 16637 25739 25696 36680 44160 55135 45937 29316 8106
5306 8106 -9103 7037 46180 27278 -10289 -9911 -38531 -32854 -22198 -17162 -31257 -46208 -20574
5293 -20574 27503 53391 36442 -7353 -16921 -8819 -10957 -6073 -19102 -11180 -16644 -23945 -25556
5280 -25556 -33859 -38025 -71705 -76627 -50132 -40931 -36789 -9152 1350 -15643 -22106 -11970 6067
5267 6067 -13651 -3257 10517 9078 -2499 15770 21941 13479 -1869 -3460 41968 55136 49534
5254 49534 37391 15826 -14309 -13645 -21365 -33597 -29969 -14285 9809 13833 4985 5458 -11305
5241 -11305 -20709 -33097 -10942 21536 21055 18622 24720 32606 26008 20800 8991 -463 -16616 -43170
5227 -43170 -44197 -42422 -2292 27080 25275 17534 -11307 -28131 -16335 -8484 -2349 7393 -29398
5214 -29398 -19336 -15185 -14507 -21395 -3703 11711 -1416 -27377 -45013 -3161 30787 6432 -28598
5201 -28598 -21372 -21464 -8160 7396 11266 -18706 -28364 -21760 -21067 1578 13929 2829 -40095 -35587
5187 -35587 -7942 17689 34251 56437 35417 44803 47344 21319 -17973 -22242 -28197 -30274 -36929
5174 -36929 -28726 6545 -15219 -50011 -43105 -9674 33781 45587 45029 6127 5100 4034 19667
5161 19667 8255 -21726 -32620 -32177 2417 -227 -19040 -18289 -22660 -47850 -11701 10008 6519
5148 6519 16008 -960 -8076 -12092 -21384 -43699 -71414 -55024 -37596 -38804 -45243 -25066 -2345
5135 -2345 -14108 -26640 -39950 -46291 -21296 -23899 -40114 -34859 -22127 -28288 -26940 -68050 -54650
5122 -54650 -16662 3547 24394 56045 36893 -4098 3138 32136 15722 2816 -6729 -23384
5110 -23384 -11260 9090 -514 -4642 -5933 2565 34535 25959 13829 31590 34729 7959 -4794
5097 -4794 -19777 -9716 8440 37244 40688 48452 45096 35743 4661 -28837 -64426 -76555 -66326
5084 -66326 -50098 -45418 -37285 -13650 -17111 -23439 -10518 -22317 -46948 -59301 -46391 -37289 -26519
5071 -26519 -11279 -18434 -9242 -2931 -15968 -38093 -25844 -23632 -24382 -2559 -21229 -25534 -46377
5058 -46377 -36601 -30342 -25692 -10777 24519 27537 39861 41506 16489 -7697 -22002 -61322 -76311
5045 -76311 -72314 -36008 -12945 -10977 -13330 -19425 -28035 -21346 -25841 -26104 -24876 -51719 -61357 -70030
5031 -70030 -91782 -55349 -47174 -49574 -11631 -21593 -68720 -56208 -40871 -40447 -39272 -26392 10522
5018 10522 9254 13518 -2161 43456 90923 76265 20288 2075 21754 8054 -6821 15194
5006 15194 5660 243 -24633 -27448 -23194 -13304 -42881 -49869 -23901 -32826 -78352 -87433 -56593
4993 -56593 -44891 -60278 -43221 -26025 -3393 -16405 -40405 -36598 -45298 -55134 -40612 -34476 -22441
4980 -22441 -10848 -3004 -19973 -30797 -31081 -54634 -48125 -32270 -37543 -39688 -38151 -16477 2112
4967 2112 -28320 -10771 5988 2406 -22149 -16279 -11154 -13596 -6845 -22355 4755 7617 -3961
4954 -3961 11023 14293 8285 -7119 5001 -9468 -15000 -30828 -58296 -43752 -14318 -29542 -36012
4941 -36012 -14191 5221 48823 72119 65106 57919 45626 27077 13318 -37680 -18193 -13316
4929 -13316 -46746 -13144 -12872 9190 12668 10377 -8260 -36839 -36612 -27827 -11086 -27506 -34242
4916 -34242 -44510 -81511 -54063 -17585 -15551 -10006 22244 61824 42103 12155 -18087 -36473
4904 -36473 -25810 -6761 8701 -16433 -35068 -40610 -29724 -2714 12404 -16972 -15606 4823
4892 4823 22091 13423 -21140 -53261 -41852 -9011 -17975 -16844 -11316 -36468 -45737 -29382 -30663
4879 -30663 -23118 -13834 -25739 -26990 -4731 32980 36191 18231 -1426 -28168 -22302 -45874 -65635
4866 -65635 -92780 -54374 -15702 -4886 -18311 -31167 -10957 4375 -14035 -36426 -37161 -9012
4854 -9012 -1266 10826 33507 31185 12618 -4386 -45613 -77975 -71041 -54683 -46026 -24143 4752
4841 4752 194 -18997 -21439 -38161 -52447 -51157 -47500 -22362 -18317 -2037 -2605 -25072 -27679 -15613
4827 -15613 -41973 -47610 -49200 -22464 -28922 -23678 -14641 -13997 -13081 8022 1202 -24110 -15063 -12559
4813 -12559 -20115 -4528 -10819 -40298 -54550 -36928 6750 8241 -12276 -14602 -31514 -41861 -41582
4800 -41582 -2962 4341 -12253 -9592 9758 -5379 -47677 -36968 -3864 -23636 -54486 -51845
4788 -51845 5284 3368 -7305 22947 26203 695 -27480 -32912 -15085 -10293 -11853 -2588 -8314
4775 -8314 18992 25841 10514 -31959 -46071 -14325 -9259 -8043 -4240 9899 -3239 -38114 -20983
4762 -20983 -11443 519 1911 -31019 -47488 -36829 -23172 -20869 18632 53579 38410 -6835
4750 -6835 -24073 -22627 -33442 -44677 -30415 -23899 13494 40131 21070 4373 -18430 -27698 -30443
4737 -30443 -12314 36087 52238 35991 -3550 2518 2920 2540 16443 -7248 -48184 -60183 -18381
4724 -18381 21887 29405 3562 -25873 -25846 -9432 13926 17913 -18602 -43159 -30375 -47551 -42639
4711 -42639 -29972 -17789 16817 51692 38800 21720 598 1061 20773 33051 13125 20021
4699 20021 16117 3657 2518 1060 2019 -6678 -41273 -52719 -35346 -18339 -6801 10139 7086
4686 7086 -5895 -9406 -21105 -20495 -24336 -7365 -10292 -1778 -8416 -21957 -37187 -14925 10641
4673 10641 26223 11222 -4780 -43817 -45367 -25988 -9315 -20759 17189 41046 29581 16513
4661 16513 6409 853 -9173 -18514 -30214 -40990 -20138 -12116 -2151 -3059 -18656 -14006 -12526
4648 -12526 -3422 19828 7753 -7007 7945 -8513 9984 4861 16433 35656 26932 22925 11342
4635 11342 7831 -7409 -43077 -34172 -13133 5397 12361 10727 -41629 -74212 -53246 -63837 -73085
4622 -73085 -67423 -42461 -30667 -23546 -13524 -1770 -663 -23575 -43286 -43960 -34248 -28374 -21257
4609 -21257 -38610 -67452 -74273 -36450 -5348 -22366 -3935 18906 30217 37671 34804 23174
4597 23174 -7667 -26050 -42333 -36246 -27310 -28969 -22126 2740 16399 21955 20295 6307 15852
4584 15852 7148 -16299 -28312 -4269 28166 10021 -1833 -17015 -22366 -34918 -22145 17143
4572 17143 30967 23486 9285 -4802 -3362 8323 18409 14828 -17969 -35924 -49781 -29788
4560 -29788 -17751 -3320 2011 -23474 -17297 -7456 17983 13370 31674 19348 23597 50282 38970
4547 38970 17023 10643 4446 -313 -6999 -3310 2538 1720 -13040 -12554 -7175 -2783 5789 14518 8240
4532 8240 27226 20428 -2612 -1330 15107 2563 6636 -10148 -27140 -7509 5259 18272 36183
4519 36183 14526 -8236 -11919 -17996 -16578 -22755 -13426 -4409 -26879 -48868 -53964 -26143 -10560
4506 -10560 -15693 15615 30620 39712 16286 -33509 -12872 17853 9814 -8173 -11173 7560 27768
4493 27768 29184 12340 -6469 -33887 -50797 -35848 -12855 -1924 6623 22886 26709 21687 9666
4480 9666 13749 12715 -5123 -24376 -14460 -27695 -38406 -26051 -19209 -1535 -2731 -1694 12007
4467 12007 9788 -31309 -50471 -32105 -34627 -14933 955 -3838 2859 16515 33040 47750 67177
4454 67177 75656 70484 29812 7712 23142 52606 57062 33150 31909 19317 6441 2211 4867
4441 4867 18866 6605 -19744 -13318 -10529 -27708 -25936 12355 23103 7042 -780 16717 10812
4428 10812 -29206 -35192 -34806 -41633 -10422 28130 22378 23313 24146 37197 27756 36931 32177 28317
4414 28317 25908 32063 48692 22783 -5600 -19615 -8589 -7312 8879 -6654 -57671 -52837 -10296
4401 -10296 -4677 18797 41802 21634 13287 31351 24966 33404 38054 23479 -21883 -34629 -13593
4388 -13593 30210 24073 9559 17588 15394 -5830 -24897 -16251 -18403 -6802 468 1067 3868 15452
4374 15452 19850 42858 21143 6502 7405 22931 35898 64365 57924 43564 28863 5653 -19228
4361 -19228 -48114 -18823 -578 -5995 -1528 12015 5594 9753 4190 12313 17763 19237 11951 -11994
4347 -11994 -18763 -14097 -7172 10411 8105 -41942 -68024 -61609 -51136 -1626 4405 -20369 5244
4334 5244 41118 42160 -18281 -19651 -15669 -5662 9585 27134 8780 -7883 -6109 1247 -10801
4321 -10801 527 41366 30638 4193 1326 -17594 -7899 -20040 -9673 -11225 -34967 -28689 -26884
4308 -26884 -23683 -7330 -24071 -27087 -49809 -53135 -21227 10154 -2634 19658 62872 55785 34225
4295 34225 -8902 -29897 28991 44989 22740 -4297 -23731 -7616 -7788 2458 16451 -500
4283 -500 -21092 -32566 -30347 -42584 -25789 6786 7186 -19171 -9828 -29218 -47834 -40116 -49681
4270 -49681 -42099 2979 25873 9360 -12955 27130 71598 71891 43385 13503 17014 34491 10007
4257 10007 -26046 -37709 -30168 -5107 14610 4880 -9514 -32518 -85197 -70261 -48860 -50013
4245 -50013 -38093 3964 23487 11880 -9652 -16906 22159 14676 -7672 -36993 -62997 -59884
4233 -59884 -33780 -41404 -61352 -68185 -43141 -36093 -47866 -48198 -11979 28909 8877 -23319 -34182
4220 -34182 -11903 5699 -23580 -35061 -21668 -12067 -35738 -11855 14560 31112 3933 -22904
4208 -22904 -30999 -52508 -45494 -24293 -7204 -6104 -23347 -30841 -39012 -14284 -14992 13782 58154
4195 58154 30577 18009 17048 5192 -5047 -6085 -21496 -32775 -18466 -11461 -30603 -40316 -10627
4182 -10627 -10557 -41525 -45805 -31775 -31764 -15082 -16576 -16405 -519 1247 -799 -13131 -24713 3752
4168 3752 13869 10589 20156 -2570 -23038 -15375 -30036 -35750 -1167 9840 -219 17540 7085
4155 7085 30397 23804 13481 -31823 -87020 -81875 -34926 -5082 -3706 2561 18100 29411 -5425
4142 -5425 13504 18962 -6914 -13333 2186 -2415 -2857 -11127 -36698 -28540 4105 28194 -3421
4129 -3421 -5682 3157 22954 8118 -5903 -11037 -23881 -2188 12114 8083 -4486 -22983 -10343
4116 -10343 -21996 -16906 3499 -10657 -4758 18953 979 -28912 -23977 -38163 -14589 -14199 -32982
4103 -32982 -48683 -41949 -18118 -33036 -20535 2624 -3404 6993 -17475 -23744 6515 14794 4982
4090 4982 21903 35735 31070 22343 -9970 -24142 -40740 -40628 -32501 -8527 3617 -19467 -26724
4077 -26724 -27736 -41386 -55417 -45880 -49818 -33004 -9017 -11339 1047 -1800 -17961 -10741 -13940
4064 -13940 16532 18106 6027 20314 6031 -2489 -14120 -10349 -16370 -45901 -71719 -56250 -54934
4051 -54934 -51836 -32244 -8182 -5573 7931 27440 2667 -40014 -46568 -51682 -24684 1136 18110
4038 18110 31838 -5760 -32912 14232 39748 47650 23721 31503 19584 -2535 -1305 159 19879
4025 19879 3108 -4786 -11273 -13716 8739 14747 6052 -25127 -17012 -15514 -6389 22199 18564 25271
4011 25271 7977 -8919 4108 -11539 -16896 -15912 -36692 -59833 -68517 -23891 7289 4659 33976
3998 33976 53924 16106 -22257 -28496 5184 14942 -24071 -62772 -68650 -36410 -43791 -54182 -81925
3985 -81925 -53276 -37149 -35721 -58062 -44351 -19082 -21129 2238 6909 2529 -32378 -42556 -17600
3972 -17600 23541 11065 -26779 -38819 -14935 -3626 -6028 -7381 -2975 6771 10524 8284 15916
3959 15916 23718 31172 33549 65201 45376 36038 61749 73749 56691 10338 8616 -3798 -7328
3946 -7328 -5448 20950 64633 97429 84004 47811 19601 -8441 -3146 24024 48751 57030 41521
3933 41521 1946 5034 45507 45212 30736 21338 23960 -4240 -27713 -16241 5523 21066 4932
3920 4932 1249 -6192 5884 7222 6006 1243 15884 27231 13581 1414 653 540 4424 -21803
3906 -21803 -28884 -36429 -53228 -62036 -47665 -51334 -40375 -41114 -23976 -9133 2288 5616 -1184
3893 -1184 8996 -17095 -56369 -42652 -44182 -36876 -34234 -30125 -45032 -56460 -7934 -7280 -30249
3880 -30249 -20202 -5799 8965 118 -17079 -27369 -13184 -4800 -560 9180 -1353 -30556 -16805
3867 -16805 5251 5077 -16523 -18212 -1105 -2554 1657 -6445 13922 33732 9887 12117 17739
3854 17739 -18675 -26704 -8902 28158 38944 39064 9959 -17380 2370 29316 46680 35153
3842 35153 -7627 5410 6064 12083 27582 23106 35296 26115 19800 6273 25728 35722 29060
3829 29060 9494 26117 11317 -984 -11633 -9388 -11861 -25349 -28996 -3247 6092 -23439 -18757
3816 -18757 -35617 -2535 7162 -349 21428 19103 9062 24630 5622 -676 -16756 -35049 -9507
3803 -9507 3412 9776 1573 -18422 3768 -15974 -15405 7114 -1682 -3255 -5577 17347 30807
3790 30807 39656 45681 26175 5176 8717 4728 12766 14879 -5210 -24146 -10194 14414 13390
3777 13390 -8323 13064 25428 12383 8135 -8143 947 24894 11302 -3929 -2353 -794 11052
3764 11052 24158 24816 -2325 2936 -20357 -35306 -12442 -17138 -25963 -12083 -4057 17217 18401
3751 18401 4941 11441 42071 24062 7091 19479 11559 27594 -14969 -5420 5453 21722
3739 21722 34830 52294 50242 57082 43599 40569 46330 40114 7629 15105 -7360 -38262 -30526
3726 -30526 -3201 -17664 -17764 12318 47228 51393 47530 38120 37026 -6896 -31834 -14384 5070
3713 5070 2111 -36400 -28767 -1285 5085 1592 9890 35545 3387 18874 20900 17197 -703
3700 -703 6649 -358 -3304 -19793 -15314 13480 3119 24254 69328 52958 3406 -14778 -14812 -23342
3686 -23342 -21743 4379 37740 30746 37336 43830 40894 28222 18200 -80 14681 9749 -20218
3673 -20218 -9102 -8683 -822 39323 48281 -2905 -22189 -31258 -33201 -19918 1166 23375 15835
3660 15835 -4464 -15800 -32535 -34840 -35967 -38285 -39411 -20124 18773 22959 1245 -7898 -8483
3647 -8483 -12408 -9326 -30597 -17613 5884 -2261 -39085 -56679 -61650 -28713 5755 663 -13339
3634 -13339 -35670 -19673 -33291 -26037 -4598 -7428 -20367 -15044 -58393 -52645 -27401 -26622 -25703
3621 -25703 -38762 -63113 -58277 -37539 -41566 -12452 -10088 -14623 4836 -7802 -25973 -36036 -36642
3608 -36642 -43994 -44665 -78094 -71114 -70986 -19762 40081 31522 5288 -8245 -16126 6866 -2833 -21475
3594 -21475 -4815 -2620 31970 40609 16180 -6799 -39349 -45904 -26829 8434 36093 20720
3582 20720 -5352 -39910 -59728 -49683 -50460 -37488 -26141 -27154 -27108 -24578 -6072 -3353 -5819 9232
3568 9232 -15770 -13131 17504 17775 14310 -3615 16525 22643 6720 37238 32782 42568 62664
3555 62664 53237 38734 24343 20117 14458 12697 9434 -294 -6894 5467 27380 43606 56348
3542 56348 62721 47193 16694 8772 17914 531 -9708 6470 -14889 -44639 -6329 41193
3530 41193 42071 19405 -8516 14132 14950 22568 15363 22948 45710 68128 55893 46261 29508
3517 29508 4246 11531 14161 28673 5532 19047 15690 -2285 -15749 -12420 -50695 -75813 -86803
3504 -86803 -58702 -48097 -12362 37441 50141 14951 -15680 -32997 -38174 -36005 -38271 -50185
3492 -50185 -28954 -711 50626 84188 74459 68107 41573 47051 60178 50036 26357 8733
3480 8733 -272 -899 -13505 8596 9888 2456 -24272 -42286 -45119 -44966 -33253 -22625 6307 26410
3466 26410 31126 15310 3640 10378 2888 -7982 -33669 -31441 -19425 -49376 -56023 -42852 -25805
3453 -25805 -26544 -4815 24019 35689 -3237 -6094 -18631 -34892 -14571 4038 20443 29901 -7376
3440 -7376 -24211 -7631 5058 -2026 -10580 -22687 -11761 -18213 -39329 -5721 700 4063 -1643
3427 -1643 13064 2826 31535 59914 48249 49469 57623 70055 73928 87913 109518 82012 59555
3414 59555 45978 30396 25465 30055 19598 -19069 -45479 -12015 16502 -10056 535 18379
3402 18379 -2720 -29818 -40660 -51657 -58019 -55159 -37992 -40720 -22498 -24541 -30643 -8582 22097
3389 22097 12628 2248 9451 36407 30760 11799 1637 6210 -8992 1117 -25194 -30891 19751
3376 19751 34990 20882 12057 20607 5072 -16404 12537 27850 54254 84607 76218 53236
3364 53236 30107 37349 42925 20963 -11841 -26956 -2798 2517 -5666 -14613 -28896 -15692 10843
3351 10843 31128 17447 -18829 -20705 1730 7155 33104 14916 -6418 10581 14963 -4477
3339 -4477 -19007 -13468 -3635 -3453 -809 -16975 -37270 -39291 -34673 -11855 30848 27406 6210 14934
3325 14934 31246 43309 -2931 -48946 -66301 -45977 -27250 -31000 -11564 1109 5234 -4277
3313 -4277 -22252 7766 38817 37317 -1184 -30454 -55062 -89480 -80722 -66165 -50149 -48680 -39862
3300 -39862 -10632 19327 -2701 -25645 -13594 12652 54768 40778 36138 49178 72340 41905
3288 41905 10150 -3128 -27540 -14762 10786 28794 315 4959 51984 51838 28494 13790
3276 13790 14367 13789 -19227 -16220 4901 -17255 -30598 -13763 16464 199 9887 -1744 -32888
3263 -32888 1776 22702 28847 32609 28702 21815 33858 3534 -21043 -5052 -21199 -12841 29862
3250 29862 16974 16476 55526 52628 43172 21156 4370 8362 43203 62021 55524 38680 33346
3237 33346 50000 55656 44640 52349 66581 54577 40273 15207 13465 36025 52803 21689
3225 21689 11029 1438 -3028 -26378 -26234 -18625 -11909 -7261 -23607 -15196 35350 43020 36878 13613
3211 13613 -297 3579 12797 4874 11400 9390 -19823 -31268 -7574 10617 -20143 -43152 -5176
3198 -5176 26595 24813 -6902 -31782 -37812 -38137 -71446 -45916 -13028 25677 31467 14985 16981
3185 16981 -11978 -24884 -10719 -13121 13392 30066 33350 6847 3661 31749 61546 73681
3173 73681 54558 22796 35442 39572 60027 60052 20749 39688 42760 27771 15762 -2907 5835
3160 5835 19157 10562 10214 21022 25806 13636 2920 13032 4929 -9235 3291 -19572 13020
3147 13020 7024 -16211 -52278 -23672 32035 35190 47864 17785 2934 44605 45593 28009 20191
3134 20191 40058 48353 42820 42222 23799 45662 29097 -2477 -6172 24265 22497 6751 -13737
3121 -13737 -7742 9876 2677 22607 14701 -6704 -627 13694 -451 -15472 -26963 -37222 4076
3108 4076 20314 -402 -9572 12735 7222 -2729 -6540 -23387 -40206 -42542 -26430 33810 -5207
3095 -5207 -26259 -25225 8671 25471 26475 41091 45869 26420 31789 29725 21950 33135 3784
3082 3784 -19203 -18161 386 -31934 -38161 -16851 6031 41803 22848 15272 51376 59728 52913
3069 52913 31519 6784 29193 15940 -3670 10369 10446 8823 -9234 -32053 -57808 -18389 -22981
3056 -22981 -38466 -13713 1751 9082 4579 -18781 -32321 -20236 -29727 -52672 -45687 -23566 -29420
3043 -29420 -29550 -25174 3231 22046 8785 933 -3232 16564 19158 26781 22183 5855 -20483
3030 -20483 -5356 -10180 4676 29593 44270 28700 1933 -13030 -2391 -2203 -35015 -43342 -23602
3017 -23602 -17149 -6306 19805 1634 15235 24747 45537 44116 29544 30689 6063 -4381 20078
3004 20078 34686 42220 16865 -5333 10809 27060 29597 50733 16462 10448 13990 9680 22274
2991 22274 41034 32695 98 -21204 3694 30379 49871 53005 54812 41373 24241 28890 2635
2978 2635 18255 53919 49314 71699 66546 57183 39217 18370 11575 11910 -5159 16062 19650
2965 19650 21539 30417 30818 -652 -1582 -12223 -26451 -7726 12303 -13866 -19039 -25047 -27367 -29074
2951 -29074 -39761 -16790 -16118 -30249 -4475 -6948 -6288 -15908 -12874 -10928 -10514 29365 34848 38314
2937 38314 29285 30908 26096 -9415 -19311 -48405 -37899 1849 18082 5428 6149 37187 51967
2924 51967 41354 43123 37390 14365 36087 46979 25982 36765 25078 9451 20363 42684
2912 42684 48308 45561 49177 36294 46373 45744 28447 -20311 -13608 6855 2543 7227 32605
2899 32605 7523 -20783 -20716 -23257 -28342 -37240 5454 28204 38577 39928 45073 68340 93195
2886 93195 85509 57261 49676 15746 5370 -15068 -24791 11551 20733 30276 17562 -4193 -20067
2873 -20067 -14243 13926 23517 44011 58166 50822 22760 10804 12729 3238 18035 33278 20369
2860 20369 -17149 -33741 -42750 -27119 -13880 -2389 -9859 -22498 -31026 -15686 -28306 -37582 -34239
2847 -34239 -48407 -39401 -34657 -21766 -25267 -54477 -46168 -7839 4394 14895 12112 -20737 -8403
2834 -8403 -12777 -27275 -27298 -50003 -73540 -88138 -98630 -72974 -17256 6298 16029 -19691 -13328
2821 -13328 -15615 -2292 -12715 -1410 11265 20727 25484 24335 28957 29017 -1601 9263 19855
2808 19855 11704 26800 44791 31392 18112 8686 43553 35048 19430 -11842 -22791 -12343
2796 -12343 1173 5930 25133 31336 5862 11804 -15788 -20407 -8165 -7037 486 34778 47437
2783 47437 9231 -11611 -26549 -14463 -15909 -34690 -7659 18292 18240 18159 13292 3542 -21643 -52918
2769 -52918 -42658 11975 21895 -10790 -4666 -6757 -4507 -5908 6651 36972 13298 -19236 -34854
2756 -34854 -24413 -37214 -13952 20098 26532 18011 -9415 -16244 -24492 -11334 9769 31143 42720
2743 42720 33079 27074 12164 -16620 -4691 17172 -806 -1858 -3637 -9185 -17596 -58348 -66542
2730 -66542 -43654 -29837 -5662 12028 -8569 -19796 -41312 -2667 -4200 2157 5719 18229
2718 18229 8768 -1539 -24232 -2735 50734 78468 36020 10560 8500 17210 6622 12438 -2936
2705 -2936 19321 34118 2598 10717 8190 -38278 -35697 7414 32239 39887 12437 -8547 -13013
2692 -13013 7065 20036 20524 28420 10496 -3674 -3508 6525 18723 12809 35995 30864 23705
2679 23705 25034 18171 37032 24214 11289 -11711 -24664 6825 12777 20051 22496 21970 32942
2666 32942 5970 12984 8557 4205 17425 33118 41944 8823 -22818 -25571 -48229 -41999 -2589
2653 -2589 13710 11160 -13701 -44168 -57739 -48982 -35783 -30359 427 22983 19969 5818 10688
2640 10688 4248 -7201 -5418 -13196 -20469 -20608 14307 40015 48276 34677 21895 32011 -6801
2627 -6801 -8019 28509 27731 -9376 -36030 -30014 -15772 -8208 15500 -3563 -26459 -11638 1712
2614 1712 -13714 -69991 -78455 -45585 11584 29326 -5829 -15676 -28727 -19650 -27573 -29757 -30129
2601 -30129 -35843 -5219 -11586 -18406 -28198 -34038 -32373 -10831 30134 69648 93987 51101 1989
2588 1989 1230 -2132 -1506 12758 -1650 -39487 -23280 17085 43417 18489 20647 39360 23690
2575 23690 14790 14703 5607 -17559 18943 23417 19078 53815 22713 -15565 -22371 3169 18846
2562 18846 12966 6560 8082 5592 9666 -11879 14577 19280 4508 21725 23571 15082 11659 -19046
2548 -19046 -41490 -49583 -2920 16192 -3012 7566 8983 30418 21036 15663 7935 -2133 21675
2535 21675 40472 23745 11782 14266 14227 24903 5568 30574 49426 34909 15142 14219 409
2522 409 -7819 -40400 -68256 -28938 -17255 -33176 -8248 20748 12650 7512 35481 33097 14389
2509 14389 15328 4765 -9408 -9797 -26589 -12361 -21237 -58854 -37226 -54449 -56909 -36404 -7738
2496 -7738 -33637 -30249 -29431 -11985 -24063 -43440 -27534 -22136 -14194 6597 19955 15560 -13757
2483 -13757 -29124 -43884 -12770 35164 48008 32569 17898 -13641 -18390 -10580 3300 31114
2471 31114 34356 6595 -23235 -11346 -9058 -12359 -12580 -17224 -637 -26421 -44998 -26950 6903
2458 6903 31505 24838 39401 50087 39234 35546 33142 5999 -4384 11634 18051 7563 3053
2445 3053 12191 23988 5470 6561 -15935 -779 6453 6005 -31878 -51226 -59039 -36167 -34802
2432 -34802 -33485 -3164 3510 17131 29188 61841 59075 48618 32616 19943 30147 19688
2420 19688 -7671 -2659 -3683 4 -17552 -35109 -9004 1860 11187 13276 11505 -23354 -13441
2407 -13441 -2318 22942 49768 35907 2771 8373 -10978 4986 39073 26193 -16167 -14562
2395 -14562 -12840 -9920 -13221 -18271 -5442 16462 32379 43180 27030 18750 23094 26597 -9432
2382 -9432 -38602 -10915 11002 -3868 -149 13620 23645 31910 22333 1141 -3034 19051 38237
2369 38237 19045 -17534 -27486 -22275 -5152 -5800 3837 -7376 -13991 -15099 -26913 -12512 8635
2356 8635 -3614 10809 43137 30047 17421 13678 41309 48342 48253 59279 74489 69746 43160
2343 43160 4676 -8025 -27314 -25943 -21846 -16979 -7683 -7018 -3288 12070 30397 6011 -14845
2330 -14845 -35228 1893 1958 17205 26448 32558 33629 15406 13900 1695 15265 43222 23993
2317 23993 20353 23266 24651 4505 5070 23174 21642 25442 24545 22832 42350 24705 24834 21817
2303 21817 4149 -26031 319 20789 22975 21601 35898 17236 351 2345 -7842 14304
2291 14304 44979 21646 21338 14115 -8400 -18981 -9246 -14977 -12132 4550 4846 -11100 -25810
2278 -25810 3117 15020 4845 -15711 -16922 -391 26177 48673 41052 24196 17558 -3248
2266 -3248 -15549 12221 10503 10662 1326 -1903 -1560 -3187 -26503 -35680 -29123 -31126 -23131 39460
2252 39460 33853 -8905 -30679 -32205 -38060 -40320 -23256 5263 18482 20858 28610 21159 10077
2239 10077 -325 21621 43933 8531 -21486 -39078 -33725 -17688 -5079 13014 3099 -1540
2227 -1540 -6830 -13546 11596 19199 14258 27130 35787 26432 19141 6627 7058 34779 59011 87806
2213 87806 90518 87046 49732 -71 2692 15252 -11163 -20535 -13451 -227 -47 12838 7033
2200 7033 2295 33624 35225 18718 19362 3923 4057 38624 57101 57976 16926 21598 35649 5802
2186 5802 -12095 27285 40075 6918 -14216 -28766 -18343 -3665 38750 34222 19949 13560
2174 13560 2050 -29562 -57070 -65133 -50967 -25909 -17667 -26949 -17380 -10967 419 -10480 16116
2161 16116 28865 25935 16044 1253 11633 18187 12348 -8691 -20984 -43109 -69854 -54418 -20278
2148 -20278 -23733 -1424 -24261 -52812 -63738 -65187 -43991 -59174 -34411 -4551 23173 30415
2136 30415 -25554 -13904 26650 35214 24889 21851 29248 30211 35487 52346 51015 67291 68423
2123 68423 61407 31272 -2359 -15257 -23022 -18606 3934 22618 26050 -12705 -15615 17256 15402
2110 15402 7731 1336 17718 13219 22815 23547 12648 19866 38609 15359 -12601 -10522 7067
2097 7067 10557 -2622 -7942 -2923 16195 40968 8074 4942 35912 37273 40408 14192 -1634
2084 -1634 -21134 -32849 -27093 -19116 -3689 16809 24279 8750 21935 11469 9845 -13587 -20461
2071 -20461 -3599 6535 -11040 -19535 -21886 27060 21356 9055 -5274 -14064 -2025 20184 69820
2058 69820 61757 8307 12546 28262 20242 19328 7674 9308 -4456 -19504 -24705 7958 16790
2045 16790 -1426 -8555 -11877 1370 33830 25275 38960 36966 8146 -25921 -54102 -57721 -13084
2032 -13084 20221 8863 -7122 -45467 -53524 -5446 25595 32113 4089 15863 17560 8756 16459
2019 16459 14956 4586 26141 17482 -6512 15370 11614 -31595 -39311 -27758 -20273 -24264 -21435
2006 -21435 -17638 -41295 -36383 -1990 22016 5474 -17923 -33036 -49753 -8991 8264 8539 14138
1993 14138 3004 -35858 -19617 445 -5545 10670 37978 32127 5604 19085 9855 15834 33630
1980 33630 8257 8085 8024 37810 37588 6244 -18229 -2591 12499 -1654 9979 14198 -16023
1967 -16023 -14514 8723 -6764 -16344 10256 8404 37853 19140 17542 24381 12463 -27986 -26164
1954 -26164 10445 50962 55328 8557 2282 6234 12531 14281 17947 16038 10936 -23207 -47644
1941 -47644 -63314 -58329 -35377 -40336 -22455 -306 33546 33485 6124 -27605 -36960 -18838 26941
1928 26941 53959 21150 12941 -11110 -38648 -43432 -29533 -31666 -10149 10773 -6645 -26274
1916 -26274 -21419 -1762 781 12348 31134 24428 33075 30436 -8308 -24426 -10838 21160 47795
1903 47795 39014 17114 -9142 -24330 -10171 4013 18257 23615 12973 44536 56761 44049
1891 44049 38746 42329 40594 38201 7719 -24918 -8709 20518 18682 -9921 -22791 549 11982
1878 11982 17039 42432 30533 3151 259 25822 31891 8190 10845 14559 8747 4512 28736
1865 28736 26349 14668 -2598 7052 17481 22786 43685 10623 -25109 -33602 -30636 -27550 -11440
1852 -11440 -20012 9140 18203 15039 -5404 9494 13132 5548 -3341 -21895 -40666 -25101 -33360
1839 -33360 -15469 -17732 -43647 -42225 -38725 -33126 -28188 -8861 6632 6151 -1232 574 7895 4990
1825 4990 3239 -2513 -20402 -26049 -33316 -29971 -13366 22312 -19056 -32635 -16933 -30234 -12655
1812 -12655 19380 33129 20352 -14682 9808 44416 40967 41131 45314 42851 35492 12630 -11373
1799 -11373 -16814 -30615 -44110 -38477 -13760 10904 17760 4486 6124 -3760 -29994 -30476 -2820
1786 -2820 2925 6145 20571 51805 24807 1581 2595 28577 34169 28811 26546 1261 -22848
1773 -22848 -6923 39829 66952 69298 54879 -3886 -51213 -54960 -55476 -73419 -77552 -31221 -23071
1760 -23071 -16601 11612 31666 38348 18251 11327 13831 -11049 -40480 -45330 -20292 -15737 -8182
1747 -8182 -6843 -9599 13143 -7104 -39348 -21651 -5689 21459 2330 -4128 -16647 -12030 14141
1734 14141 35698 25995 31794 63809 80158 33926 30014 26796 -4947 14478 40758 27694 28674
1721 28674 32882 20786 21151 43318 62254 47038 9144 -10764 15564 43064 36977 6475 -5315
1708 -5315 -18891 -30494 -29875 -12058 -23933 -9568 7776 10588 10782 -24796 -25444 -20100 -20364 -33749
1694 -33749 -34379 -31951 -26643 -17694 -2508 3095 34539 64901 44391 19704 -3741 -18706 -24217
1681 -24217 -20772 -9039 7130 23384 50811 75822 86820 73497 52264 30081 -14024 -55506
1669 -55506 -39603 -20451 -19433 -13955 -21906 -11623 39200 36748 8742 3296 10952 20018 20341 24903
1655 24903 15581 -23138 -42354 -27743 11428 23463 26279 -14573 6429 15043 4036 -3150 -33594
1642 -33594 -34845 -883 32741 6939 -18061 5621 22178 13157 2000 -23231 -35448 -42359
1630 -42359 -51381 -49134 -20124 -2132 -11886 4444 18733 21664 37774 11826 -2271 15350 23454
1617 23454 32902 47625 42792 65772 99689 100141 93939 87952 75105 77015 65606 34464 19931
1604 19931 8678 6315 -18276 -22981 -3539 2664 28831 41269 16170 16717 11762 3966 4583 -14695
1590 -14695 -16421 -16032 -11624 -28696 -17644 -17268 -9032 -18729 -51373 -40918 -40891 -9282 9766 19119
1576 19119 28884 3501 -28729 -32983 -21523 -21481 1495 23567 17673 -4998 -5684 19891 32772
1563 32772 7136 9430 19788 30910 27842 65485 58175 -6314 -37558 -39715 -41490 -38333 -18309
1550 -18309 -22269 -11716 3682 -943 -3139 -5909 15529 25208 32825 25647 39736 11279 -4437
1537 -4437 25948 55588 72679 41211 9155 -4814 10615 -12300 -18387 -48033 -37172 -26332
1525 -26332 -15772 -9567 6582 27653 10796 8985 9840 26169 22508 37423 36537 18977 -2318
1512 -2318 -15507 -42385 -35811 -40903 -55999 -43422 -58045 -40164 -13784 -9311 -17831 -8402 -834
1499 -834 16751 10987 23503 28906 4738 -5740 -20443 -20465 2720 12199 9055 -11304 -12479 -6596
1485 -6596 5952 8768 22537 9826 -24792 -26440 -14685 434 -9412 -38613 -22703 -28036 -25112
1472 -25112 -14211 -3404 5758 686 -11979 -1344 19904 44619 39666 19405 -5315 -8502 -9450
1459 -9450 -4315 26923 19567 8643 37968 50491 31826 15944 18428 17119 14745 23862 -4601
1446 -4601 -687 -296 -16093 -23947 -7694 -17808 -31746 -35382 -38713 -5563 10198 15755 8499 13874
1432 13874 11223 35271 35969 29218 -601 -20752 -8665 6957 27813 44564 14965 -2885 -4514
1419 -4514 -11278 6685 34516 43991 58597 51383 36533 13504 -23390 -42129 -21764 3836 18016
1406 18016 27925 37272 5747 -19380 -3285 -15011 -10723 28384 43601 44001 15813 -14443 12439
1393 12439 14880 11162 40148 47428 45196 22305 5830 5780 -14092 -30100 -20170 -13279 -29403 5973
1379 5973 34803 1663 -4730 -24813 -30126 -7197 4419 23001 16188 -10211 -57678 -66070 -42060
1366 -42060 -35830 -26296 -26319 -23250 -5773 -7490 -16280 -7046 -6376 -2241 -13900 28806 65428 82455
1352 82455 57452 27787 46617 39274 37720 20560 4318 10087 -13955 -5940 -4209 2766 25601
1339 25601 38074 30305 -1379 -14187 -134 -34789 -31512 17499 46506 19532 7760 -14771
1327 -14771 -20948 -21910 -35625 -32248 -30108 3001 2089 5842 1397 -43336 -75381 -75578 -56422 -18263
1313 -18263 9755 18679 12500 -14029 -39150 -57491 -75266 -61479 -47492 -59590 -51030 -53692 -18209
1300 -18209 -5144 3664 11654 -3229 -9443 -11066 -13880 -15627 -36485 -44567 -13087 14591 13813 -8946
1286 -8946 -11958 -1805 19674 36304 -223 -17067 -33454 -29620 -12175 -13396 -6714 3012 10247
1273 10247 -19855 -20835 22687 38133 25073 -16555 -39326 -26901 -644 2992 1552 26955 19374
1260 19374 14921 1327 -25533 -21258 6693 28895 41723 8680 -21531 9602 18597 17609 12520
1247 12520 1140 9229 -3675 18608 31606 47981 61328 53607 30535 42685 66309 60192
1235 60192 43679 23393 -5692 -25773 -32149 -4311 58306 41202 39620 45994 50749 47188 57507
1222 57507 88841 76128 26187 14182 17030 5159 25338 7006 9655 434 16887 15602 26023
1209 26023 37772 36163 23590 -2520 -3873 43765 61044 7294 -23490 -7521 10687 12227
1197 12227 8038 6885 10713 -6870 -18037 -17036 -19842 -6333 1452 -18736 -37983 -50714 -48675
1184 -48675 -37958 -27882 -14255 -2201 -32946 -65760 -52750 2199 39020 45832 37672 11646
1172 11646 3701 19867 2163 -35183 -21391 -17290 -20251 -6083 26969 34090 -803 11043 28470
1159 28470 30926 26633 42818 65982 49759 25637 -10478 -5823 13954 6156 -29638 -45601 -18049
1146 -18049 -269 -5612 -4263 -3017 -6678 12322 8566 -4854 -7939 -31271 -37952 -5421 20651
1133 20651 37073 22936 -1003 -18355 -18037 -11857 22440 26365 19850 767 -4145 -2705 -15513
1120 -15513 -12102 -17887 -29333 -5140 2660 8769 12659 20782 8763 17048 30716 29816 14505 8069
1106 8069 25813 19246 1928 9802 3012 -13003 -3614 9139 20900 3785 -10745 -40066 -47371
1093 -47371 -18492 -16140 -7809 7978 29700 17947 5137 12878 15231 18359 10885 30326 46831
1080 46831 24078 7378 -17853 -13151 13845 40835 42437 61040 61283 50342 26183 12389 -28561
1067 -28561 -16308 1637 -824 -25504 10129 30513 30301 23046 -3728 -17169 -16768 -10038 -24052
1054 -24052 -47975 -64208 -69158 -58085 -22402 -35933 -51315 -50659 -7642 20431 33401 30586 26094
1041 26094 27188 22050 30884 11759 -18079 -30202 -22550 -33897 -33931 -21251 6685 -4488 -15860
1028 -15860 1911 24405 11636 -10077 -8421 1034 4972 -2366 -17211 -6049 -11038 -7950 20425
1015 20425 27523 30363 -10312 -31503 -7602 31137 56225 65682 33611 -19209 -35439 9459
1003 9459 -6644 -13890 -26833 -13799 -7706 -15669 -24929 -24068 -1424 -13269 -19796 -496 20927
990 20927 22130 -12179 -2327 -8365 13097 12011 21545 4354 -44020 -55668 -42635 -33137 -6508
977 -6508 14072 16362 20307 10015 -8512 -4270 -3158 12712 38791 35181 26300 11331 -31464
964 -31464 -39573 -59407 -48653 9255 26975 30708 35230 50968 54010 52422 56485 57909 48156 35037
950 35037 37485 35573 15137 28799 37564 29011 5921 -23558 -29649 -19130 -59769 -76007 -61748
937 -61748 -81894 -73028 -41897 -32026 1532 5590 38151 55880 38055 19564 16278 11777 -10317
924 -10317 -23764 -23555 -20374 -7230 1563 33211 19084 25236 39603 26446 -11279 -11024 -19989 -10985
910 -10985 -1626 27754 34992 37154 53191 31729 -6078 -28264 -4675 33728 45735 28637 19674
897 19674 420 -15472 -17684 -16416 -32310 -2691 26767 -1332 -45455 -52535 -31742 -50574 -26834
884 -26834 -7845 14425 111 -37669 -50383 -38449 -4525 14599 28537 -3475 -8574 -1242
872 -1242 12057 -314 1551 18431 53394 52839 32348 23819 26745 33606 23937 21600 24935 5440
858 5440 -6704 -15900 6218 31084 37045 37390 1259 -17337 -7240 27388 6951 -39802 -86943
845 -86943 -102313 -77961 -29665 -26189 -32552 -14689 -30531 -40748 -8446 -23065 -47610 -11326
833 -11326 -11572 -15578 4908 26518 12031 -12086 -22707 -36904 -48134 -36994 -7693 30039 8406
820 8406 -12377 -2048 21566 7554 2535 -1191 -9451 -14838 -44962 -50453 -45570 -60798 -76296
807 -76296 -72681 -24655 -11287 7416 2631 -29400 -39208 -17373 -21410 -12859 17583 15831 -9473
794 -9473 -4384 14940 8388 30594 23699 -5211 -29874 -40622 -39281 -48693 -39485 -44189 -43798 -12330
780 -12330 -27903 -53401 -53724 -33551 -7498 -1955 -1028 -39600 -21904 7999 -17604 -54049 -52066
767 -52066 -16294 7971 952 -12692 -10232 -2590 -5879 -28072 -53728 -34894 -27351 -52329 -71369
754 -71369 -38477 20515 19353 -14886 -37913 -38451 -22842 -35666 -21819 -19647 2402 9322 -2457
741 -2457 -4010 -12390 -43139 -33821 -66732 -63298 -56825 -22866 33947 30740 20415 -27092 2564
728 2564 16037 18478 31824 28204 6188 -8200 -21990 -25575 -49298 -27849 -5678 -4740 21476
715 21476 -2486 -37348 -49436 -22851 15828 6063 -36782 -16100 -14094 -51597 -43563 -26690 1218
702 1218 513 -2207 -24470 -28477 -26239 -14322 -30690 -3731 18447 3735 6857 2433 -27797 -38604
688 -38604 -35465 -32943 -29847 -8694 5705 15388 4156 -49385 -39755 -32638 -79256 -108673 -109903
675 -109903 -109236 -88774 -70495 -58412 -22833 -19315 -197 248 28409 15448 -13386 -24979 -28438
662 -28438 -54434 -35599 7454 -7567 -28639 -9734 -17784 1204 12469 5681 12158 1252 -7504
649 -7504 -19940 -34039 -40432 -45001 -54417 -32348 -7313 -16011 -33760 -18481 -7120 -17884 -1402
636 -1402 1386 -23435 -14195 -705 6157 36325 29348 -9088 -25622 -29018 -3820 -26099 -40385
623 -40385 -17742 8684 22653 18658 14666 -17464 -37991 -26675 -10816 -38830 -45341 -34967 -44654
610 -44654 -78774 -56800 -11035 7320 -4156 -10171 -22844 -19137 14790 20422 2726 -3029 -18342
597 -18342 -46402 -33223 1177 3191 10341 -15992 -39278 -60772 -53975 -49451 -32800 -31758 -71908
584 -71908 -87647 -42809 -22928 -24008 -17600 -20907 -9127 -21867 -35302 -55525 -66741 -26029 -9121
571 -9121 -33848 -17521 -34112 -46680 -23346 18827 36780 34421 24240 32638 31072 -16525 -44255
558 -44255 -51767 -58586 -42695 -50142 -56159 -61507 -56567 -13570 -5172 -4181 16217 35157 43825 -2825
544 -2825 -34260 -35606 -4384 3018 1077 -2611 -59836 -91719 -57914 895 12295 -22981 -40062
531 -40062 -57900 -50852 -25900 -24344 -43257 -36733 -889 17681 -13060 -29773 -20866 -2297 -963
518 -963 -14599 -47895 -13824 18008 5586 -21428 -9100 -15238 69 11924 -859 14693 27094
505 27094 12634 10935 1762 -7351 -14553 -19094 -40986 -46559 -55086 -46499 -37058 -41291 -38424 -24420
491 -24420 1329 7367 5719 7217 -2723 -29052 -47541 -56142 -64348 -69792 -57567 -30213 -50550
478 -50550 -63833 -40850 -41785 -47400 -36781 -21263 -15393 -16300 -11898 -7576 -7418 -8303 -8562 -12739 -26079
463 -26079 -12419 17310 20054 7611 -11695 -12061 -6046 -26153 -28992 -37730 -19224 -34849 -34152 -40508
449 -40508 -56159 -24153 460 31644 49553 42506 26531 -710 -25134 -41590 -52975 -74671
437 -74671 -74444 -47032 -12864 5986 23646 27201 27723 26432 20448 23472 19250 2732 17567 14478
423 14478 -42542 -87664 -88787 -47436 -20973 -20045 -57508 -28779 -8241 2576 -1860 -23555 -27634
410 -27634 -26366 -45502 -70479 -62729 -42377 -27800 -36574 -47275 -18413 7932 -4086 -17944 -18352
397 -18352 -44269 -35928 -26055 -32369 -12620 -14852 -29775 -34501 -43892 -51181 -39432 -30513 -36864 -16960
383 -16960 -3943 -9501 8739 -5228 -37792 -29925 -31775 -58148 -77816 -68336 -41867 12210 26544
370 26544 21486 -4938 -20232 -6772 -38845 -35954 -41175 -34320 -42722 -45671 -45584 -46156 -51593 -52095 -30055
355 -30055 -17217 3370 -19515 -31177 -7528 -8354 3249 26554 6436 4611 -3738 -6738 -798
342 -798 1785 -6494 6486 2302 -16743 -2201 8731 10981 -28673 -50731 -46780 -44344 -27384 -18223
328 -18223 -25639 -17294 7281 26915 26115 19290 -23987 -25122 -8636 -33854 -62529 -56731 -49989 -55824
314 -55824 -35599 -28806 -50976 -43652 -15944 -12866 -11291 -10336 14945 6009 -3763 11401 250 15169
300 15169 301 -25211 -44836 -43721 -51832 -36608 -25099 -23884 -3994 17699 6801 7905 -766
287 -766 -1999 -23721 -39513 -45325 -46099 -47468 -39761 -34400 -46367 -34995 -27261 12452 26685 17428
273 17428 -7407 -9955 -6806 -7846 -30674 -23364 -8042 -20623 -36815 -42812 -19160 9060 67
260 67 744 -11626 -24568 -37615 -66190 -63087 -65555 -96548 -84266 -50007 -14471 5106 -6776
247 -6776 -34034 -39775 -14181 -32622 -36820 -43221 -51129 -29778 3272 25394 12273 -3809 12036
234 12036 4371 4146 30227 43467 13706 -2691 -7269 -11219 -7449 -16330 -1660 1876 -11882 -20025
220 -20025 -31649 -55106 -65338 -58205 -54117 -36073 -26987 -23607 -27535 -9988 -25544 -29111 -47154
207 -47154 -52602 -33883 -19192 -6038 7468 -4545 -15148 -27331 -4104 -676 -22864 -18620 -23329
194 -23329 -24002 3466 26763 8009 -19383 -57019 -38044 -27061 -27438 -26219 -29736 -24155 -15084 969
180 969 -4008 -20603 -26839 -18869 -6963 -9994 -25972 -24186 -15637 175 -23310 -50706 -52648 -72351
166 -72351 -94308 -91815 -83264 -45498 -27299 -20935 844 8723 14097 -6432 1909 -1614 -14215
153 -14215 -29621 -6553 8077 -6306 -24055 -32716 -6435 12134 19317 11002 -15457 -34852 -42699
140 -42699 -41913 -32766 -2043 -10950 -11646 -2739 -33731 -48413 -38414 -12637 -10615 -30577 -26495 -45326
126 -45326 -39093 -38723 -42343 -31241 -18404 -12660 -32485 -45389 -38187 -63113 -59311 -60837 -43376 -38227
112 -38227 -39173 -48706 -31600 4260 5783 3780 -1119 4472 -15712 -49885 -30554 -3747 -279 -8321
98 -8321 -24785 -46594 -33104 -6678 4414 -1794 -11539 -10177 -3060 1915 957 28533 8887 -3485
84 -3485 -20164 -23543 -36903 -57321 -70265 -52257 -47303 -52266 -32701 -15715 8320 7297 -19284
71 -19284 -48529 -67328 -61449 -42495 -24614 -4217 15394 6355 -11516 6371 388 -18064 -18109
58 -18109 -16013 -19281 -24454 -21901 -24627 -36276 -42850 -14673 -10648 -13634 -24330 -30130 -37995 -49797
44 -49797 -59442 -54328 -49013 -35708 -15875 -9189 -2916 4553 -2831 -3574 11781 2877 -12838 -20751
30 -20751 -18681 -31960 -24188 -9793 -744 -10995 -14047 -11675 -20279 -21892 -30245 -29440 -9275 2850
16 2850 -12514 -27028 -36867 -25686 -16030 -9985 4772 -18652 -43362 -18462 -18471 -24070 -34778 -35734
2 -35734 -44655 -42147
0 -42147
$$ Imaginary data points
##PAGE= N=2
##DATA TABLE= (X++(I..I)), XYDATA
32767 80063 73040 73951 82417 77127 84324 89265 95334 89673 77306 79726 67110 57181 83271 93582
32753 93582 99855 109400 95493 71373 80825 90943 88367 91123 81551 73687 80634 87702 75232
32740 75232 68196 69710 65838 73047 86278 117796 101347 82344 88273 96957 95927 80225 102456
32727 102456 88417 65659 67083 64606 54620 72904 92695 109700 130340 125949 124135 129816 117944
32714 117944 113149 104488 107942 123418 137361 122721 95936 81532 83507 96840 118092 118645 135685
32701 135685 137050 146413 141987 139086 144062 138466 95079 75069 98109 127476 125109 97266 96884
32688 96884 106250 102471 100539 121589 136548 136983 116082 132138 140236 138240 141334 138736 130964 115449
32674 115449 130142 141492 119949 135120 158653 182558 174498 167816 154668 144909 153057 140802
32662 140802 137033 148104 140310 152835 148814 135626 111690 125823 122692 116107 102994 114255
32650 114255 128745 143617 141086 142251 147440 154318 140938 131695 128783 155560 163649 157587 156232
32637 156232 164771 176685 165140 166051 167047 169753 171481 157789 144276 140134 168873 196830 210066
32624 210066 198007 178673 165794 133023 150959 163441 171834 165380 152134 161190 171508 176849
32612 176849 191697 216848 195098 163763 167841 183184 194485 210106 212246 210573 217282 218426
32600 218426 187044 167662 164624 188574 198503 196895 203992 191859 182667 168501 151929 158230 175888
32587 175888 199382 232050 232099 209690 205635 238857 263392 261814 208875 189333 176954 190804
32575 190804 199213 180559 179855 188959 185601 193734 177768 168681 186887 185667 192303 189487 182366 195946
32561 195946 202434 214877 211811 207838 198277 188743 213326 222616 205337 180847 148066 148368 181913
32548 181913 191818 182168 186907 193449 175703 161777 168040 186038 192670 179050 172324 191555 209306
32535 209306 231670 230623 230717 234565 246067 232339 220859 200583 201084 214420 226827 241370 217093
32522 217093 223235 252770 242652 220220 225573 221142 233490 257001 250386 228172 228734 228468 232217
32509 232217 231177 216033 214767 239704 246949 242967 250578 231694 229462 239508 217346 230795 258272
32496 258272 273662 290247 287850 277240 261619 262547 237303 204792 207423 229326 236249 245485 241226
32483 241226 276707 286932 267510 254250 264273 287774 301323 299785 284157 285894 263524 268181
32471 268181 263439 251462 266011 278512 281726 292136 289912 297747 289497 285957 288085 274959 248035
32458 248035 226334 179857 186245 218371 209282 204866 222065 261379 292321 267903 260863 250928
32446 250928 216504 224858 221224 230388 220878 250584 240152 243355 250912 242409 270429 285046 272519
32433 272519 261778 277072 253480 244118 255853 227571 219330 213183 210614 218789 220955 218055 214892
32420 214892 223297 220531 208573 220357 232805 210340 226618 243898 244555 242218 242012 238735 218957
32407 218957 219084 244012 263073 269626 262135 265168 268021 246643 245005 261221 260432 259061 238495
32394 238495 240256 286825 313722 330051 343515 339731 306213 285162 282244 294704 254930 233528
32382 233528 237342 244171 253355 297662 305024 283390 273839 263840 267468 243065 251264 258125 268843
32369 268843 267447 268017 276887 270617 269516 272662 266575 264758 252968 249852 257421 262553 263190 263192 295474
32354 295474 311210 282318 263498 263895 263879 267693 272011 268618 246233 220002 214604 234612 249009
$$ [...]
##END NTUPLES=NMR SPECTRUM
##END=
