##TITLE=Analysis number 330175
Compound Code cc 61922
Project Code adrs
Chemist Name endeavour
##JCAMPDX= 6.0         $$ Bruker NMR JCAMP-DX V2.0
##DATA TYPE= NMR SPECTRUM
##DATA CLASS= NTUPLES
##ORIGIN= Bruker BioSpin GmbH
##OWNER= nmr
$$ XWIN-NMR		Version 3.5
$$ Fri Nov  2 10:54:49 2007 GMT Standard Time (UT+0h)  MAYBRIDGE\nmr@NMR_250MHZ
##.OBSERVE FREQUENCY= 250.131544655141
##.OBSERVE NUCLEUS= ^1H
##.ACQUISITION MODE= SIMULTANEOUS (DQD)
##.ACQUISITION SCHEME= undefined
##.AVERAGES= 16
##.DIGITISER RES= 18
##SPECTROMETER/DATA SYSTEM= dpx250
##.PULSE SEQUENCE= zg30
##.SOLVENT NAME= CDCl3
##.SHIFT REFERENCE= (INTERNAL, CDCl3, 0, 16.522)
##AUDIT TRAIL= $$ (NUMBER, WHEN, WHO, WHERE, WHAT)
$$ ##TITLE= Audit trail, XWIN-NMR		Version 3.5
$$ ##JCAMPDX= 5.01
$$ ##ORIGIN= Bruker BioSpin GmbH
$$ ##OWNER= nmr
$$ C:\u/data/dgb/nmr/ADRS/150/pdata/1/auditp.txt
$$ ##AUDIT TRAIL=  $$ (NUMBER, WHEN, WHO, WHERE, WHAT)
(   1,<2007-11-02 10:54:17.95 +000>,<MAYBRIDGE\nmr>,<NMR_250MHZ>,
      <created by zg, POWCHK disabled, PULCHK disabled
       configuration hash MD5:
       76 6E 9A 78 1E 09 19 81 EC 84 63 8F B0 6A 59 2D
       data hash MD5: 64K
       81 43 F7 00 BB D3 D6 8B C5 17 81 38 F8 48 85 5A>)
(   2,<2007-11-02 10:54:35.18 +000>,<MAYBRIDGE\nmr>,<NMR_250MHZ>,
      <Start of raw data processing
       ef LB = 0.3 FT_mod = 6 PKNL = 1 SI = 32K 
       data hash MD5: 32K
       07 3E 8E 23 42 30 78 E2 07 60 43 6F 14 CA 82 68>)
(   3,<2007-11-02 10:54:37.47 +000>,<MAYBRIDGE\nmr>,<NMR_250MHZ>,
      <apk 
       data hash MD5: 32K
       24 8A CF 6E 03 90 D3 FE D9 A4 6A AF 87 CA CA D0>)
(   4,<2007-11-02 10:54:38.31 +000>,<MAYBRIDGE\nmr>,<NMR_250MHZ>,
      <abs ABSG = 5 
       data hash MD5: 32K
       5C 0C 7E 31 A1 B9 10 AC 01 AE 30 8F 27 FD CA CD>)
$$ ##END=
$$ 
$$ hash MD5
$$ CC 1D F2 E2 DF 5C DD A5 F3 75 A8 66 0C A6 A9 17
##$RELAX= 
##$RELAX= 
##$RELAX= 
##$RELAX= 
##$RELAX= 
##$RELAX= 
##$RELAX= 
$$ Bruker specific parameters
$$ --------------------------
##$DU= <C:\u>
##$EXPNO= 150
##$NAME= <ADRS>
##$PROCNO= 1
##$TYPE= <nmr>
##$USER= <dgb>
##$AMP= (0..31)
100 100 100 100 100 100 100 100 100 100 100 100 100 100 100 100 100 100 
100 100 100 100 100 100 100 100 100 100 100 100 100 100 
##$AQSEQ= 0
##$AQ_mod= 3
##$AUNM= <au_zg>
##$AUTOPOS= <4 >
##$BF1= 250.13
##$BF2= 250.13
##$BF3= 250.13
##$BF4= 250.13
##$BF5= 500.13
##$BF6= 500.13
##$BF7= 500.13
##$BF8= 500.13
##$BYTORDA= 1
##$CFDGTYP= 0
##$CFRGTYP= 5
##$CHEMSTR= <none>
##$CNST= (0..31)
1 1 145 1 1 1 1 1 1 1 1 1 1 1 1 1 1 1 1 1 1 1 1 1 1 1 1 1 1 1 1 1 
##$CPDPRG= <>
##$CPDPRG1= <>
##$CPDPRG2= <>
##$CPDPRG3= <>
##$CPDPRG4= <mlev>
##$CPDPRG5= <mlev>
##$CPDPRG6= <mlev>
##$CPDPRG7= <mlev>
##$CPDPRG8= <mlev>
##$CPDPRGB= <>
##$CPDPRGT= <>
##$D= (0..31)
0 1 0 0 0 0 0 0 0 0.06 0 0 0 0 0 0 0.0002 0 0 0 0 0 0 0 0 0 0 0 0 0 0 
0 
##$DATE= 1194000855
##$DBL= (0..7)
120 120 120 120 120 120 120 120 
##$DBP= (0..7)
150 150 150 150 150 150 150 150 
##$DBP07= 0
##$DBPNAM0= <>
##$DBPNAM1= <>
##$DBPNAM2= <>
$$ [...]
##$SUBNAM7= <"">
##$SUBNAM8= <"">
##$SUBNAM9= <"">
##$SW= 20.6930455092707
##$SWIBOX= (0..15)
0 0 3 0 0 0 0 0 0 0 0 0 0 0 0 0 
##$SW_h= 5175.983436853
##$TD= 65536
##$TD0= 1
##$TE= 296.16
##$TE2= 300
##$TE3= 300
##$TEG= 300
##$TL= (0..7)
0 120 120 120 120 120 120 120 
##$TP= (0..7)
150 150 150 150 150 150 150 150 
##$TP07= 0
##$TPNAME0= <>
##$TPNAME1= <>
##$TPNAME2= <>
##$TPNAME3= <>
##$TPNAME4= <>
##$TPNAME5= <>
##$TPNAME6= <>
##$TPNAME7= <>
##$TPOAL= (0..7)
0.5 0.5 0.5 0.5 0.5 0.5 0.5 0.5 
##$TPOFFS= (0..7)
0 0 0 0 0 0 0 0 
##$TUNHIN= 0
##$TUNHOUT= 0
##$TUNXOUT= 0
##$USERA1= <user>
##$USERA2= <user>
##$USERA3= <user>
##$USERA4= <user>
##$USERA5= <user>
##$V9= 5
##$VALIST= <valist>
##$VCLIST= <CCCCCCCCCCCCCCC>
##$VD= 0
##$VDLIST= <DDDDDDDDDDDDDDD>
##$VPLIST= <PPPPPPPPPPPPPPP>
##$VTLIST= <TTTTTTTTTTTTTTT>
##$WBST= 1024
##$WBSW= 4
##$XGAIN= (0..3)
0 0 0 0 
##$XL= 0
##$YL= 0
##$YMAX_a= 595368
##$YMIN_a= -560234
##$ZGOPTNS= <>
##$ZL1= 120
##$ZL2= 120
##$ZL3= 120
##$ZL4= 120
##$ABSF1= 16.522
##$ABSF2= -4.171173
##$ABSG= 5
##$ABSL= 3
##$ALPHA= 0
##$AQORDER= 0
##$ASSFAC= 0
##$ASSFACI= 0
##$ASSFACX= 0
##$ASSWID= 0
##$AUNMP= <proc_1d>
##$AZFE= 0.1
##$AZFW= 0.1
##$BCFW= 0
##$BC_mod= 0
##$BYTORDP= 0
##$COROFFS= 0
##$CY= 12.5
##$DATMOD= 1
##$DC= 0
##$DFILT= <>
##$DTYPP= 0
##$F1P= 14.0000005364418
##$F2P= -0.99999901652339
##$FCOR= 0.5
##$FTSIZE= 32768
##$FT_mod= 6
##$GAMMA= 0
##$GB= 0
##$INTBC= 1
##$INTSCL= 1
##$ISEN= 128
##$LB= 0.3
##$LEV0= 0
##$LPBIN= 0
##$MAXI= 10000
##$MC2= 0
##$MEAN= 0
##$ME_mod= 0
##$MI= 0
##$NCOEF= 0
##$NC_proc= -2
##$NLEV= 6
##$NOISF1= 0
##$NOISF2= 0
##$NSP= 0
##$NTH_PI= 0
##$NZP= 0
##$OFFSET= 16.522
##$PC= 1
##$PHC0= 15.00238
##$PHC1= -11.4438
##$PH_mod= 1
##$PKNL= yes
##$PPARMOD= 0
##$PSCAL= 4
##$PSIGN= 0
##$REVERSE= no
##$SF= 250.13
##$SI= 32768
##$SIGF1= 0
##$SIGF2= 0
##$SINO= 400
##$SIOLD= 32768
##$SREGLST= <1H.CDCl3>
##$SSB= 0
##$STSI= 32768
##$STSR= 0
##$SW_p= 5175.98343685301
##$SYMM= 0
##$S_DEV= 0
##$TDeff= 65536
##$TDoff= 0
##$TI= <Analysis number 999999
Compound Code 99
Book Reference 9
Project Code 9>
##$TILT= no
##$TM1= 0
##$TM2= 0
##$TOPLEV= 0
##$USERP1= <user>
##$USERP2= <user>
##$USERP3= <user>
##$USERP4= <user>
##$USERP5= <user>
##$WDW= 1
##$XDIM= 32768
##$YMAX_p= 268658053
##$YMIN_p= -89526
$$ End of Bruker specific parameters
$$ ---------------------------------
##NTUPLES= NMR SPECTRUM
##VAR_NAME=  FREQUENCY,     SPECTRUM/REAL,   SPECTRUM/IMAG
##SYMBOL=    X,             R,               I
##VAR_TYPE=  INDEPENDENT,   DEPENDENT,       DEPENDENT
##VAR_FORM=  AFFN,          ASDF,            ASDF
##VAR_DIM=   32768,         32768,           32768
##UNITS=     HZ,            ARBITRARY UNITS, ARBITRARY UNITS
##FACTOR=    0.157963299565203, 1,           1
##FIRST=     4132.6476996994, 0,             0
##LAST=      -1043.33573715361, 0,           0
##MIN=       -1043.33573715361, -89526,      0
##MAX=       4132.6476996994, 268658053,     0
$$ Real data points
##PAGE= N=1
##DATA TABLE= (X++(R..R)), XYDATA
$$ [...]
19873B739j13l024K225J63k525J358J216k065l090K730L934n54l621k461Q94L008
$$ 2739 2626 -398 1827 1990 -535 823 2039 -26 -3116 -386 3548 2994 -627 -3088 -2194 814
19857H14L196J096p51j92J675r63j861k222l71P9J368J202o74j709j088J913P5
$$ 814 4010 5106 4355 4163 5838 4875 3014 792 421 500 1868 3070 2396 687 -401 1512 1587
19840A587m10j035o3P54J375k076j264k1n87J133qo78m6k23l5k727j727L41K926
$$ 1587 1177 142 79 833 2208 132 -1132 -1153 -1740 -607 -615 -1293 -1339 -1562 -1597 -4324 -6051 -5710 -2784
19821b784L827K34P58k285K367q34K071J737j112q32N69J523n58j34k28O29j510
$$ -2784 1043 1277 2035 -250 2117 1283 3354 5091 3979 3147 3716 5239 4681 4547 4319 4948 3438
19804C438k039J994N54k74l792J152J997m05n35j196n72j507p45J013J262J72
$$ 3438 1399 3393 3947 3673 -119 1033 3030 2625 2090 894 322 -1185 -1930 -917 345 517
19788E17J003J052K066m12l613N40O95J610Q64O81r81k95j024n8Q69j886k371
$$ 517 1520 2572 4638 4226 613 1153 1848 3458 4322 5003 4022 3727 2703 2645 3514 1628 -743
19771g43J03n14K781K399k27P5M38m19j625K419j150m248j824J044J928J60j806
$$ -743 -640 -1154 1627 4026 3799 3874 4312 3893 2268 4687 3537 -711 -2535 -1491 437 597 -1209
19754a209K92N72O69J228P10r3j8j206J70j393k075p53K040L303K695k773l003
$$ -1209 -917 -345 324 1552 2262 2169 2151 945 1115 -278 -2353 -3106 -1066 2237 4932 2159 -844
19737h44l56p76P02J070J054J516j398o31j099j935K88J641J460k40k525Q79K671
$$ -844 -1200 -1976 -1274 -204 850 2366 968 337 -762 -2697 -2409 -768 692 452 -2073 -1194 1477
19720A477m75J330n90j422n39O01J004r53j090J617P64j3m62k94n1r54J853Q52
$$ 1477 1002 2332 1742 320 -219 382 1386 433 -657 960 1724 1711 1249 955 904 -50 1803 2655
19702B655k7k279M39l19K14J73J590J559J893o28j125j463j481r73n94p29k03
$$ 2655 2628 349 788 469 683 856 2446 4005 5898 5270 4145 2682 1201 228 -366 -1095 -1298
19685a298J225N84m24k439J357J956j559p94R72N69K283O68k498q93q83J889l95
$$ -1298 -73 511 87 -2352 -995 961 -598 -1392 -420 149 2432 3100 602 -291 -1174 715 320
19668C20m32k79K43r0o95j71K180m94n82j019K72J672J342j244N87K811j39k312
$$ 320 -112 -391 -148 -238 -933 -1104 1076 582 0 -1019 -747 925 2267 1023 1610 4421 4282 1970
19650A970J428O49M49k010j584o64K962O63J968k326l968k629K684J058j245j889
$$ 1970 3398 4047 4496 2486 902 238 3200 3863 5831 3505 -463 -3092 -408 650 -595 -2484
19634b484Q6J619M58j116j086j224j527l56K230P28O44k293o04J629J515o37L64
$$ -2484 -2398 -779 -321 -1437 -2523 -3747 -5274 -5630 -3400 -2672 -2028 -4321 -4925 -3296 -1781 -2418 -2054
19617b054K207J304L35p96o97m56J765J697K067Q37p3k589j417o43J000k63J715
$$ -2054 153 1457 1792 996 299 -157 1608 3305 5372 6209 6136 3547 2130 1487 2487 2224 3939
19600C939j1m13j055J36J578l32K97R12J15k751k235p97k25N32L75L333M7l805
$$ 3939 3928 3515 2460 2596 4174 3842 4139 5051 5166 2415 180 -617 -842 -310 65 3398 3445 -360
19582c60m46J636P96J30j272j583j471P37Q97n12p40j41K039R12K766J6k775j271
$$ -360 -806 830 1626 1756 484 -1099 -2570 -1833 -936 -1448 -2188 -2329 -290 622 3388 3404 629 -642
19564f42l32n72p8q79J8J490J706J673j169j187k23j748q97R42J005J289j167
$$ -642 -974 -1546 -1624 -2503 -2485 -995 711 2384 1215 28 -195 -1943 -2840 -1898 -893 396 -771
19547g71n12K275n58k330J18K568m1J000j560j022O37L758K390j356j311j75M92
$$ -771 -1283 992 434 -1896 -1778 790 749 1749 189 -833 -196 3562 5952 4596 3285 3110 3602
19530C602j905j504n38R0L83j38j82J235J124k550o19N68o5K42J243K788j21j947
$$ 3602 1697 193 -345 -255 128 -10 -192 1043 2167 -383 -1002 -434 -499 -257 986 3774 3653 1706
19512A706j708J970J80k233l88k179q75K043r35j386MM109J159j180J125n92k890
$$ 1706 -2 1968 2148 -85 -473 -2652 -3527 -1484 -2419 -3805 -3801 308 1467 287 1412 820 -2070
19495b070k622K738J781k489j284q44M14P93N00P27q1J161J276J674K77l262l874
$$ -2070 -4692 -1954 -173 -2662 -3946 -4790 -4376 -3583 -3083 -2356 -2437 -1276 0 1674 1951 -1311 -5185
19478e185j511R10L760J238j306O0N240K964j200l393Q19n71k61o45j853N98J364
$$ -5185 -6696 -5786 -2026 -788 -2094 -2034 3206 6170 4970 1577 2396 1825 1564 919 -934 -336 1028
19461A028K75n8q9O16k26j175j720k093K403K136O90r41k008j443J75K295R28
$$ 1028 1303 1245 1156 1772 1546 371 -1349 -3442 -1039 1097 1787 846 -1162 -2605 -2430 -135 793
19444G93j041M0J727K12K054k120m52R51q54j773J598K514j945k556J528j376
$$ 793 -248 -208 1519 1731 3785 1665 1213 2164 1310 -463 1135 3649 1704 -852 676 -700
19428g00O61J40j823J807J517j205O17j309j376J92j174Q70R86j548j232J421
$$ -700 -39 101 -1722 85 1602 397 1014 -295 -1671 -1479 -2653 -1783 -797 -2345 -3577 -2156
19412b156m48O58N60j871o3J94q57K211J555P09N84l49k120J080R47K234j40N43
$$ -2156 -2604 -1946 -1386 -3257 -3320 -3126 -3983 -1772 -217 492 1076 727 -1393 -313 634 2868 2728 3271
19394C271P49j687o20J116Q56r78m37m85j720L10P3l98j366N61N11j734N17J666
$$ 3271 4020 2333 1713 2829 3685 2707 2270 1785 65 375 448 50 -1316 -755 -244 -1978 -1461 205
19376B05J748P74r03k049m69K843K12k383j667j487j33M480N30o37j20n17P7l11
$$ 205 1953 2727 1824 -225 -694 2149 2361 -22 -1689 -3176 -3309 1171 1701 1064 944 427 504 193
19358A93R2K48j78j686j19k72l3J42o96j58J067j987l82O09J997j192l84o81q47
$$ 193 285 533 355 -1331 -1450 -1722 -1755 -1613 -2309 -2467 -1400 -3387 -3769 -3160 -1163 -2355 -2739 -3420 -4267
19339d267j070Q55j317n98M577J562K84j160J424K874n98n89L37K08k664k48K073
$$ -4267 -5337 -4482 -5799 -6397 -1820 -258 26 -1134 290 3164 2566 1977 2314 2522 -142 -390 1683
19322A683j791m71o75r83k050J349J702j629L59L08m13Q85K419l24q78l202K809
$$ 1683 -108 -579 -1254 -2237 -4287 -2938 -1236 -2865 -2506 -2198 -2611 -1726 693 369 -509 -3711 -902
19305i02K864J003l02j706j666K038j871j100J82k786j058J626L22m09J949K078
$$ -902 1962 2965 2663 957 -709 1329 -542 -1642 -1460 -4246 -5304 -3678 -3356 -3765 -1816 262
19289B62m01J207K91l33j319J31r47Q51j64j014r9m47q41J92P95M60J36k676J275
$$ 262 -139 1068 1359 1026 -293 -162 -1109 -258 -422 -1436 -1535 -1982 -2823 -2631 -1836 -1376 -1240 -3916 -2641
19270b641j36P88j69L277p29j460Q33j246n80m23Q2j254l84K722N622p84j290
$$ -2641 -2777 -1989 -2158 1119 390 -1070 -237 -1483 -2063 -2486 -2404 -3658 -4042 -1320 4302 3518 2228
19253B228r12j100L836J096m266j657l74q71N73P01R20r53j57p4k701L46K074
$$ 2228 1316 216 4052 5148 882 -775 -1149 -2020 -1447 -746 174 -779 -936 -1010 -3711 -3365 -1291
19236a291j910L19N68j50J161N81K214J961J56J2k069m279O6P14J154R13K197
$$ -1291 -3201 -2882 -2314 -2464 -1303 -722 1492 3453 3609 3621 1552 -2727 -2661 -1947 -793 120 2317
19219B317j326k131N8n41p50J876J127J10R30l41r51p36r55Q54R73k79O01K69
$$ 2317 991 -1140 -1082 -1623 -2373 -497 630 740 1670 1329 378 -358 -1313 -459 514 235 836 1105
19201A105p42J0m78l29o87J294j847k380m50K745J034j19l48N26R1K1O54k45j257
$$ 1105 363 373 -105 -434 -1121 173 -1674 -4054 -4504 -1759 -725 -844 -1192 -666 -575 -554 100 -145 -1402
19182a402j734p32J322O82r51L98J877J845N87j662r17J005m18j354j821j358
$$ -1402 -3136 -3868 -2546 -1864 -2815 -2417 -540 1305 1892 230 -687 318 -100 -1454 -3275 -4633
19166d633J387K754J151q28j419O2Q68O55J90K58J807N00j066m21k97P94p07l564
$$ -4633 -3246 -492 659 -169 -1588 -1526 -658 -3 187 445 2252 2752 1686 1265 968 1762 1055 -2509
19148b509j394M94O95K532J401R3k214j301L95K248q17j27J8P28j909oJ620j292
$$ -2509 -3903 -3409 -2714 -182 1219 1312 -902 -2203 -1808 440 -377 -504 -486 242 -1667 -1673 -53 -1345
19130a345J082J282j465j045j564j924J429m61J32K300O44O65K798j6Q19K024
$$ -1345 -263 1019 -446 -1491 -3055 -4979 -3550 -4011 -3879 -1579 -935 -270 2528 2512 3331 5355
19114E355j854l076m86K9K92K15q79k74M12Q81Q12N7j156j643m05R65l42j403
$$ 5355 3501 425 -61 -32 260 475 -404 -678 -266 615 1427 1484 328 -1315 -1720 -755 -1097 -2500
19096b500K920J668j448m32n71J340K884P39J49q32j538l142r14K119P23k3L55
$$ -2500 420 2088 640 208 -363 977 3861 4600 4749 3917 2379 -763 -1677 442 1165 1142 1497
19079A497m08m7j787k796j62K535p93j821m26L668o52k42J624K032K66p98J930
$$ 1497 1089 1042 -745 -3541 -3703 -1168 -1961 -3782 -4208 -540 -1192 -1434 190 2222 2488 1690 3620
19062C620L41L11l995l567P63k15J314r33l23J047J859L18N83J035k53j070q20
$$ 3620 3961 4272 277 -3290 -2527 -2742 -1428 -2361 -2684 -1637 222 540 1123 2158 1905 835 15
19045A5o42J84j801O69q01K523L19l336q17n9m94mJ247Q55K410J191j608j647
$$ 15 -627 -443 -2244 -1575 -2376 147 466 -2870 -3687 -3746 -4240 -4244 -2997 -2142 268 1459 -149 -1796
19027a796K686J123J420J673k360k673L73N46p56P94J423l636P72J030j824k448
$$ -1796 890 2013 3433 5106 2746 73 446 992 236 1030 2453 -1183 -411 619 -1205 -3653
19011c653j108P87J96J691J703j618k805k241j045R04J034k14K85J653K312j244
$$ -3653 -4761 -3974 -3778 -2087 -384 -2002 -4807 -7048 -8093 -7189 -6155 -6369 -6084 -4431 -2119 -3363
18995c363O52K166p44l662p75J663P85J730K437J498k459j520k35p88K75K221
$$ -3363 -2711 -545 -1289 -4951 -5726 -4063 -3278 -1548 889 2387 -72 -1592 -1827 -2615 -2340 -119
18979a19j047l53J537O92J074J184j321j937k96j234O21P77O49J937J867K29j775
$$ -119 -1166 -1519 18 710 1784 2968 1647 -290 -586 -1820 -1199 -422 227 2164 4031 4260 2485
18962B485j396j796J5J341Q56p32q56J061N67k460k187J719K580r71j00J451R28
$$ 2485 1089 -707 -692 649 1505 773 -83 978 1545 -915 -3102 -1383 1197 226 126 1577 2505
18945B505k585l88L98N55J030p48j378j279N60J192R54j92m37L8j129k395M99
$$ 2505 -80 -468 -70 485 1515 767 -611 -1890 -1330 -138 816 624 187 225 -904 -3299 -2800
18928b800J599M95J229J433J793j150o41Q2n63j708L228k260j921j128j59K538
$$ -2800 -1201 -706 523 1956 3749 2599 1958 2040 1477 -231 2997 737 -1184 -2312 -2471 67
18912F7J763j983K17J093J22q13j841j406O06J824J024k548j464K907K846k826
$$ 67 1830 -153 64 1157 1279 466 -1375 -2781 -2175 -351 673 -1875 -3339 -432 2414 -412
18896d12j038k057J580JN56k577l49M664j322j592K511K28j08j053o80j459L61
$$ -412 -1450 -3507 -1927 -1926 -1370 -3947 -4296 368 -954 -2546 -35 193 85 -968 -1648 -3107 -2746
18879b746J611j22J58Q6k907K2R85J30k88R93M32J338j919k251L07O70J004j228
$$ -2746 -1135 -1257 -1099 -1013 -3920 -3898 -2913 -2783 -3071 -2078 -1646 -308 -2227 -4478 -4171 -3501 -2497 -3725
18861c725K150O79k052M17Q69O44J374j980k827q29l86K600K056r49Q2J200j648
$$ -3725 -1575 -896 -2948 -2531 -1662 -1018 356 -1624 -4451 -5280 -5666 -3066 -1010 -1959 -1877 -677 -2325
18844b325m3r64j167J881K315J360J420j034j735p27m90j42K54P72J221k212J7
$$ -2325 -2368 -3332 -4499 -2618 -303 1057 2477 1443 -292 -1019 -1509 -1651 -1397 -625 596 -1616 -1599
18827a599k083j393K096L54J353J771J58j625j080K683P34j085K469j728k279
$$ -1599 -3682 -5075 -2979 -2625 -1272 499 657 -968 -2048 635 1369 284 2753 1025 -1254
18812a254p70j366K9N01Q74n40l45j146P13K26J716J493k400n85J543n91j153
$$ -1254 -2024 -3390 -3361 -2860 -1986 -2526 -2871 -4017 -3304 -3078 -1362 131 -2269 -2854 -1311 -1902 -3055
18795c055J631Q93M99N48J91O80l3k909k119k386K570K495K615J15k012L57K298
$$ -3055 -1424 -531 -32 516 707 1387 1354 -1555 -3674 -6060 -3490 -995 1620 1735 -277 80 2378
18778B378r16J265P15N45J687q86n86L617P405R004Q20k207k791j0231k909k44
$$ 2378 1462 2727 3442 3987 5674 4788 4202 7819 15224 24228 25048 22841 20050 9819 6910 6666
18762F666r79k627j261k703j304p4K106m11l05k31J249N71n97J727m86k09l12
$$ 6666 5687 3060 1799 -904 -2208 -2282 -176 -587 -892 -1123 126 697 100 1827 1341 1132 820
18745H20J120k95k528J080K365p7k86J467J863J552p97j004j800j148J285j182
$$ 820 1940 1645 -883 197 2562 2485 2199 3666 5529 7081 6284 5280 3480 2332 3617 2435
18729B435k859m32o88n06P28K102n92n55K21L332q0j524l654J94M88o79k087O14
$$ 2435 -424 -856 -1544 -2050 -1322 780 188 -367 -146 3186 3106 1582 -2072 -1878 -1390 -2069 -4156 -3542
18711c542J966J927k188L77K622M00m89k094k493n65J32O69R21O11O90q64j626
$$ -3542 -1576 351 -1837 -1460 1162 1562 1073 -1021 -3514 -4079 -3947 -3278 -2357 -1746 -1056 -1920 -3546
18694c546r20m10K116R75p20m38J354K462J198O56J805m07j654k11R52j885r24
$$ -3546 -4466 -4876 -2760 -1785 -2505 -2943 -1589 873 2071 2727 4532 4125 2471 2260 3212 1327 403
18677D03O85m97j814j024r47J07K559j88r34M36p28n39k243J42R0j043L86K669
$$ 403 1088 591 -1223 -2247 -3194 -3087 -528 -716 -1650 -1214 -1942 -2481 -4724 -4582 -4492 -5535 -5149 -2480
18659b480R89Q84K149k88j805j567j361j885K067M71P77N52j424m15J609K232
$$ -2480 -1491 -607 1542 1254 -551 -2118 -3479 -5364 -3297 -2826 -2049 -1497 -2921 -3336 -1727 505
18643E05l4k745l818J674L625j23j299k26p85J301J005P87j546J001l788R80J253
$$ 505 471 -2274 -6092 -4418 -793 -916 -2215 -2441 -3226 -1925 -920 -133 -1679 -678 -4466 -3486 -2233
18626b233k33K069J881K124J390j028j772j322q21o34j082J179J731j05j487k98
$$ -2233 -2466 -397 1484 3608 4998 3970 2198 876 55 -579 -1661 -482 1249 1144 -343 -641
18610f41J100k409j561L413J381j747Q4K432J425o58j711k105J714k87j796l05
$$ -641 459 -1950 -3511 -98 1283 -464 -380 2052 3477 2819 1108 -997 717 430 -1366 -1671
18594a671J29m8J473J503l654j821J604K212K526q26j183j329j83J682J206k66
$$ -1671 -1542 -1590 -117 1386 -2268 -4089 -2485 -273 2253 1427 244 -1085 -1268 414 1620 1354
18578A354j598J840J274p02j460O92j069l3r00L42O20L501M03k189l392p99K024
$$ 1354 -244 1596 2870 2168 708 1400 331 298 -602 -260 360 3861 4264 2075 -1317 -2116 -92
18561i2j395Q91K755o13j41k53j513K00M63k520k12j171J76J42j365J054J45K76
$$ -92 -1487 -596 2159 1546 1405 1152 -361 -161 302 -2218 -2430 -3601 -3425 -3283 -4648 -3594 -3449 -3173
18543c173J505K81j401k520k16J709J41K950N8j774L90K481l70j041N20J362j82
$$ -3173 -1668 -1387 -2788 -5308 -5524 -3815 -3674 -724 -666 -2440 -2050 431 61 -980 -460 902 720
18526G20J840j613N05j35l90q60J045N05k505k91J029p34j560n18o96J824r77
$$ 720 2560 947 1452 1317 927 67 1112 1617 -888 -1179 -150 -884 -2444 -2962 -3658 -1834 -2811
18509b811l134p82J572j161J693j130j748K639J700J713N27j119K873J568M73
$$ -2811 -5945 -6727 -5155 -6316 -4623 -5753 -7501 -4862 -3162 -1449 -922 -2041 832 2400 2873
18494B873j058p79j441n51L255n71j152l15j733l238J716k407l79m92L462J864
$$ 2873 1815 1036 -405 -956 2299 1728 576 261 -1472 -4710 -2994 -5401 -5780 -6272 -2810 -946
18478i46j202l715j287M46j39K933K234J867j400r23N35k48R11l152j194N75Q63
$$ -946 -2148 -5863 -7150 -6704 -6843 -3910 -1676 191 -1209 -2132 -1597 -1845 -934 -4086 -5280 -4705 -3842
18461c842j004k836K71L038K65j952J185n12J381J537m82j3l12j923q6L359J502
$$ -3842 -4846 -7682 -7411 -4373 -4108 -6060 -4875 -5387 -4006 -2469 -2951 -2964 -3276 -5199 -5285 -1926 -424
18444d24O3j263r31J259K094J034Q69j891l89J649k651k304q5M80J054j056k64
$$ -424 -361 -1624 -2555 -1296 798 1832 2701 810 421 2070 -581 -2885 -2970 -2490 -1436 -2492 -2756
18427b756m07L05K139J929j352l067p48K462J599j099j983K03l59m28N10R3n8
$$ -2756 -3163 -2858 -719 1210 -142 -3209 -3957 -1495 104 -995 -2978 -2775 -3134 -3562 -3052 -2959 -3017
18410c017J180J528M96Q61J106j448k094j244K144K592K13m30k75J65k069j979
$$ -3017 -1837 -309 187 1048 2154 706 -1388 -2632 -488 2104 2317 1887 1612 1777 -292 -2271
18394b271p38J05p15O66R11n87K656K716O23j227j336j84k108k085L377J262l200
$$ -2271 -3009 -2904 -3619 -2953 -2042 -2629 27 2743 3366 2139 803 619 -1489 -3574 -197 1065 -2135
18377b135j042j204l135M43L590J974j376j673r9J406K444J140j623l410J326
$$ -2135 -3177 -4381 -7516 -7073 -3483 -1509 -2885 -4558 -4657 -3251 -807 333 -1290 -4700 -3374
18362c374K860J105r5r01n67m18j094J441Q02j527p32L277K002l57j119k63n69
$$ -3374 -514 591 496 -405 -972 -1390 -2484 -1043 -241 -1768 -2500 777 2779 2422 1303 1040 471
18345D71p16q14L58j619r09j654j392L289M668J4m235j637j56L719J971r08j362
$$ 471 -245 -1059 -701 -2320 -3229 -4883 -6275 -2986 1682 1696 -2539 -4176 -4332 -613 1358 450 -912
18328i12m369q72J72J662K310k97O82q30J268k426L49L2k095j39J303N68M74K10
$$ -912 -5281 -6153 -5981 -4319 -2009 -2306 -1624 -2454 -1186 -3612 -3263 -3231 -5326 -5465 -4162 -3594 -3120 -2910
18310b910K55J529j88o16k39m91M01k213J579Q84M73o88J672O67k355Q15m19j790
$$ -2910 -2655 -1126 -1314 -1930 -2169 -2660 -2259 -4472 -2893 -2009 -1536 -2224 -552 115 -2240 -1425 -1844 -3634
18292c634J539J250p51k232l70J081k94j744L94J641J087r89o78j957m04n94L38
$$ -3634 -2095 -845 -1596 -3828 -4198 -3117 -3411 -5155 -4761 -3120 -2033 -3022 -3700 -5657 -6061 -6655 -6317
18275f317J13N94K105J33j221K16l89J253J070J215k63o01P7p86J167J178m851
$$ -6317 -6204 -5610 -3505 -3372 -4593 -4377 -4766 -3513 -2443 -1228 -1491 -2092 -2015 -2801 -1634 -456 -5307
18258e307l629r1J210R74P34J194j476j845p27K408J572j35k32K97j114j040K476
$$ -5307 -8936 -9027 -7817 -6843 -6109 -4915 -6391 -8236 -8963 -6555 -4983 -5118 -5350 -5053 -6167 -7207 -4731
18241d731L588j44r47m84j115N1j245k424K040J87o31k08J735K599J352k769k086
$$ -4731 -1143 -1287 -2234 -2718 -3833 -3782 -5027 -7451 -5411 -5224 -5855 -6063 -4328 -1729 -377 -3146 -5232
18224e232j168l40Oj268M96nJ304J895N11M19j093j671J22J82N69k275j727M80
$$ -5232 -6400 -6740 -6734 -8002 -7506 -7511 -6207 -4312 -3801 -3382 -4475 -6146 -6024 -5842 -5273 -7548 -9275 -8795
18206h795M982J916p90M94j775j621j57j64j041j704K114J036o58m27m17n29o11
$$ -8795 -3813 -1897 -2687 -2193 -3968 -5589 -5746 -5910 -6951 -8655 -6541 -5505 -6163 -6590 -7007 -7536 -8147
18189h147R13o23P13J87J89l80j332P85n9K25L017K15j599J74J732O45J805p22
$$ -8147 -7234 -7857 -7144 -6957 -6768 -7148 -8480 -7695 -7754 -7529 -4512 -4297 -5896 -5722 -3990 -3345 -1540 -2262
18171b262p81k726l61J188J078k73k548k171P55J16J752O34l64k06l41J3J95n71
$$ -2262 -3043 -5769 -6130 -4942 -3864 -4137 -6685 -8856 -8101 -7985 -6233 -5599 -5963 -6169 -6510 -6497 -6302 -6873
18153f873R36N96P97K486k909l280J76n88K44J365K608m25j030J308l58L31K251
$$ -6873 -5937 -5341 -4544 -2058 -4967 -8247 -8071 -8659 -8415 -7050 -4442 -4867 -5897 -4589 -4947 -4616 -2365
18136b365J439J341j308N90K581K653J992J132O129L649L544L923J927O774J2374
$$ -2365 -926 415 -893 -303 2278 4931 6923 8055 14184 17833 21377 25300 27227 34001 46375
18121D6375J6407K6175L2008L9777O3966R2695J09283J33465K00515L55376P13822
$$ 46375 62782 88957 120965 160742 224708 317403 426686 560151 760666 1116042 1829864
18110A829864J380757J094069l00137p09386r84799q72287m95517k64735j57254
$$ 1829864 3210621 4304690 4004553 3295167 2310368 1438081 942564 677829 520575
18101E20575j01719p3409n5296m4402l4657k6393j8013j5712j5617j4059j4733
$$ 520575 418856 345447 290151 245749 211092 184699 166686 150974 135357 121298 106565
18090A06565j2356n974n870p408q546q067l134l789l200k151l341j762M59r73
$$ 106565 94209 88235 82365 74957 66411 58344 55210 51421 48221 46070 42729 40967 41426 40453
18076D0453l407k316j061k783k599j312o74j120j62R76Q64j851j449j95J177j192
$$ 40453 37046 34730 33669 30886 28287 26975 26301 25181 25019 25995 26859 25008 23559 23364 24541 23349
18060B3349j998k20N64J77j809n68j48k178l168n0J187R9j433o93m32R76J163
$$ 23349 21351 21131 21695 21872 20063 19495 19347 17169 14001 13951 15138 15237 13804 13111 12679 13655 14818
18043A4818R69k951k200J645j544J114J562M46N35j699p06L88P35L26J829M20
$$ 14818 15787 12836 10636 12281 10737 11851 13413 13859 14394 12695 11989 12377 13112 13438 15267 15687
18027A5687J709j84k366j15K314J328L99j362q61k67j414q79k68K34Q79q49j157
$$ 15687 17396 17212 14846 14731 17045 18373 18772 17410 16549 16282 14868 13989 13721 13955 14834 13985 12828
18010A2828k323J810k028l029n25P6K137L590n53o07N24N04j991k902j353p60
$$ 12828 10505 12315 10287 7258 6733 6809 8946 12536 11983 11376 11900 12404 10413 7511 6158 5398
17994E398L09J137O03j051l320J780J610O91j343J761K371J252K107J315R86k615
$$ 5398 5707 6844 7447 6396 3076 4856 6466 7157 5814 7575 9946 11198 13305 14620 15606 12991
17978A2991J159J929L029j846k958O30j556k67M58N56l606k112L49o45k348J786
$$ 12991 14150 16079 19108 17262 14304 14934 13378 13111 13569 14125 10519 8407 8756 8111 5763 7549
17962G549J289p08M59j202J981J47j136k77r02q15k472o47J229j629j992J829
$$ 7549 8838 8130 8589 7387 9368 9515 8379 8102 7200 6385 3913 3266 4495 2866 874 2703
17946B703J533j406J470p3l11N44M23J268K94J239j409k652K210J871j389j501
$$ 2703 4236 2830 4300 4227 3916 4460 4883 6151 6445 7684 6275 3623 5833 7704 6315 4814
17930D814O23P78R68l450K763M300n42j912J600M44m11k281k547P69J377J377
$$ 4814 5437 6215 7183 3733 6496 10796 10254 8342 9942 10386 9975 7694 5147 5916 7293 8670
17914H670j7q74L012M044K789j987o36k444m64J678j722k18j325j451j828l61
$$ 8670 8653 7779 10791 14835 17624 15637 15001 12557 12093 13771 12049 11831 10506 9055 7227 6866
17898F866j52j361j114j505k079m71J324K626K699k991k251M4K682o99K39j55
$$ 6866 6714 5353 4239 2734 655 184 1508 4134 6833 3842 1591 1635 4317 3618 3857 3702
17882C702n08k093j34K087J111M8R9n41n94P6K121K013R32j104j890J558r82j28
$$ 3702 3194 1101 967 3054 4165 4213 4312 3771 3177 3253 5374 7387 8319 7215 5325 6883 5901 5773
17864E773K31J98K512k123j209N13q07l9J744J794l42j495J178o2o36j304j964
$$ 5773 6004 6202 8714 6591 5382 5895 5088 5049 6793 8587 8245 6750 7928 7866 7230 5926 3962
17847C962j650N73l83j993L762J017q70j481k769J569q85R01P9l6K003Q72L11
$$ 3962 2312 2885 2502 509 4271 5288 4418 2937 168 1737 852 1753 1832 1796 3799 4671 4982
17830D982j566l451J74K380M70j837N72j268k421r57J70K109l23j61K763J181
$$ 4982 3416 -35 139 2519 2989 1152 1724 456 -1965 -2922 -2752 -643 -966 -1127 1636 2817
17814B817k907j275L772p41m28K79j076j305o5Q48O23M01K339K262j855Q71k51
$$ 2817 -90 -1365 2407 1666 1238 1517 441 -864 -929 -81 542 943 3282 5544 3689 4560 4309
17797D309j266j467j520j548M23J1J527J335K359K250L35k404j205N00o28k724
$$ 4309 3043 1576 56 -1492 -1069 -1058 469 1804 4163 6413 6748 4344 3139 3639 3011 287
17781B87k090J069J902j852J018j475k12R70j574k430K025K948p84l450l20J280
$$ 287 -1803 -734 1168 -684 334 -1141 -1353 -383 -1957 -4387 -2362 586 -198 -3648 -3968 -2688
17765b688J571k123j33k54J189j31r22J151J885J366m7J286K576k79m39j712J30
$$ -2688 -1117 -3240 -3373 -3627 -2438 -2569 -3491 -2340 -455 911 864 2150 4726 4447 4008 2296 2426
17748B426K061Q19j600P98o04o60J566q43j900j202n69K244j045q20j475L154
$$ 2426 4487 5306 3706 4504 3900 3240 4806 3963 2063 861 292 2536 1491 671 -804 2350
17732B350J776j502j699k494l59n93O67r89J60M21J499K097O62O03m99p63k09
$$ 2350 4126 2624 925 -1569 -1928 -2521 -1854 -2843 -2683 -2262 -763 1334 1996 2599 2100 1337 1128
17715A128m44L738m34l844j207m70J262P21O33J729o08J278j440j842M90J577
$$ 1128 684 4422 3988 144 -1063 -1533 -271 450 1083 2812 2204 3482 2042 200 690 2267
17699B267l011k022K255o58J877L00N2J327J398k70P59L74j19P57j869k274k782
$$ 2267 -744 -2766 -511 -1169 708 1008 1060 2387 3785 3515 4274 4648 4529 5286 3417 1143 -1639
17682a639j440J692L748P34k667J437J789j060k007r82k339j73K240O14j459J688
$$ -1639 -3079 -1387 2361 3095 428 1865 3654 2594 587 -395 -2734 -2907 -667 -53 -1512 176
17666A76K553q7k799p03q26j4p90L142J150o07k124N80K320J974N92m20J5O27
$$ 176 2729 2642 -157 -860 -1686 -1700 -2490 652 1802 1195 -929 -349 1971 3945 4537 4117 4132 4759
17648D759P20j086j911k428Q71J439j044J81k014L54j58N45L04j004J397l86O40
$$ 4759 5479 4393 2482 54 925 2364 1320 1501 -513 -159 -317 228 532 -472 925 539 1179
17631A179J742n55o77M15M99k22j041m01J38L37k251k64n27N12J713J406j924
$$ 1179 2921 2366 1689 2104 2603 2381 1340 939 1077 1414 -837 -1101 -1628 -1116 597 2003 79
17614G9j274J227l00J623nJ040J007J28m31jk88L30m71n01k532q65l24R23J271
$$ 79 -1195 32 -268 1355 1350 2390 3397 3525 3094 3093 2805 3135 2664 2163 -369 -1234 -1558 -635 636
17595F36L516p57j927j812J894J652l35m49O40O63LO46R60k240p25K27O36k414
$$ 636 4152 3395 1468 -344 1550 3202 2867 2418 3058 3721 3724 4370 5330 3090 2365 2592 3228 814
17577H14O12O53L72J597j075j51k06r09j213j071J556K375m52j52m02q77q88k052
$$ 814 1426 2079 2451 4048 2973 2822 2616 1707 494 -577 979 3354 2902 2750 2348 1471 583 -1469
17559a469j297J941Q99J768J210J017N49k532k765k74j45N96k016K45J321P08
$$ -1469 -2766 -825 74 1842 3052 4069 4618 2086 -679 -953 -1098 -502 -2518 -2273 -952 -244
17543b44j3r08J628j659j052M32L644O71k574K116j209j952o73k379j633J222
$$ -244 -257 -1165 463 -1196 -2248 -1816 1828 2499 -75 2041 832 -1120 -1793 -4172 -5805 -4583
17527d583L411J838L49k42m70n93J605M2k444j957O84L275K798J257j261k928
$$ -4583 -1172 666 1015 773 303 -290 1315 1357 -1087 -3044 -2360 915 3713 4970 3709 781
17511G81j822J18k99j638J676J184R80J651q56L19K744P95n80K49m82q69l512
$$ 781 -1041 -923 -1222 -2860 -1184 0 980 2631 1775 2094 4838 5633 5053 5302 4820 3951 439
17494D39j878J205j089k481K684qj360l101o54m17K472K503J23j071j593j44k579
$$ 439 -1439 -234 -1323 -3804 -1120 -1128 -2488 -5589 -6243 -6660 -4188 -1685 -1562 -2633 -4226 -4370 -6949
17477f949q42K938J2R55J012J7Q3L834R51J334Q81j710j29L3p57j655l8J351J468
$$ -6949 -7791 -4853 -4841 -3886 -2874 -2857 -2774 1060 2011 3345 4226 2516 2387 2420 1663 8 -30 1321 2789
17458B789o28j548n95Q46KJ622m300k574K098J803L51J410N68J505O195L345P173
$$ 2789 2161 613 18 864 866 2488 -1812 -4386 -2288 -485 -134 1276 1844 3349 9544 12889 20062
17441B0062M423r69l316o613o137m165N5K89k33n40j096j430J692M95j452j434
$$ 20062 24485 23516 20200 13587 7450 3285 3340 3629 3396 2856 1760 330 2022 2517 1065 -369
17425c69q43K025j79l88m82n61l46Q74Q41n22k98n78K285K61j030o76k910Q61
$$ -369 -1212 813 634 246 -236 -797 -1143 -269 572 50 -248 -826 1459 1720 690 14 -2896 -2035
17407b035K460j351k810R43K311n31N63R86R58L05M38m99o67j626K26J143J213
$$ -2035 425 -926 -3736 -2793 -482 -1013 -450 536 1494 1799 2237 1738 1071 -555 -329 814 2027
17390B027J89j013J404K685k560K27R59q09k515j831J427J413J993J117j262l994
$$ 2027 2216 1203 2607 5292 2732 2959 3918 3109 594 -1237 190 1603 3596 4713 3451 -543
17374e43q47n94j332J187J398L704J216Q93n78L61O12l452q33O76j209R53j642
$$ -543 -1390 -1984 -3316 -2129 -731 2973 4189 5082 4504 4865 5477 2025 1192 1868 659 1612 -30
17357c0l289p30J235P73M64l24Q11n90j297K4J271M16q54j02L57k54m86J483J751
$$ -30 -3319 -4049 -2814 -2041 -1577 -1901 -1090 -1680 -2977 -2953 -1682 -1266 -2120 -2222 -1865 -2119 -2605 -1122 629
17338F29j576k698j012j327R65J714Q23j85J651J153j401r10j421J075K86R94
$$ 629 -947 -3645 -4657 -5984 -5019 -3305 -2482 -2667 -1016 137 -1264 -2174 -3595 -2520 -2234 -1240
17322a240k843j215J388J666J471K371J444K78K44j709j074j59j301m80J752P05
$$ -1240 -4083 -5298 -3910 -2244 -773 1598 3042 3320 3564 1855 781 622 -679 -1159 593 1298
17306A298k60j822j229J145J994l32n21m72j4R28k61K91J813O37r02O57j414J60
$$ 1298 1038 -784 -2013 -868 1126 794 273 -199 -213 715 454 745 2558 3195 2293 2950 1536 1696
17288A696k305l103k785M76L198K010Q97L253J041m451j807J255K087J324Q54
$$ 1696 -609 -3712 -6497 -6021 -2823 -813 84 3337 4378 -73 -1880 -625 1462 2786 3640
17273C640k05J320n35k508k020n30Q24M38j577R06j085j634k69K92k99J288K610
$$ 3640 3435 4755 4220 1712 -308 -838 -14 424 -1153 -247 -1332 -2966 -3235 -2943 -3242 -1954 656
17256F56N62k588l60K989J981N4O47n65j103j479N77N04l38j020j736r63L27j116
$$ 656 1218 -1370 -1730 1259 3240 3294 3941 3376 2273 794 1371 1875 1537 517 -1219 -2182 -1855 -2971
17238b971M41r10r32M10J584o79l61K35N82K972J957j054j674l86Q68J328M85
$$ -2971 -2530 -3440 -4372 -3962 -2378 -3057 -3418 -3183 -2601 371 2328 1274 -400 -786 82 1410 1895
17221A895m138k52p19J242K854j748m07M40k714O32J796j57P7p5J217kk074k622
$$ 1895 -2243 -2495 -3214 -1972 882 -866 -1273 -833 -3547 -2915 -1119 -1276 -1199 -1274 -57 -59 -2133 -4755
17203d755q9K222R20J134L648J683P86J748k670q29J635k04j392K52q73l885k208
$$ -4755 -4844 -2622 -1702 -568 3080 4763 5549 7297 4627 3798 5433 5229 3837 4089 3216 -669 -2877
17186b877R06J024J948N23m61o73k509k251J459J638m81k616K063K339n50j020
$$ -2877 -1971 -947 1001 1524 1063 390 -2119 -4370 -2911 -1273 -1754 -4370 -2307 32 -518 -1538
17170a538K59j0k502j637K45J171L241K998k577j040M97j554J106J099J059J646
$$ -1538 -1279 -1289 -3791 -5428 -5183 -4012 -771 2227 -350 -1390 -893 -2447 -1341 -242 817 2463
17154B463k482l425q45K42J415J999kJ30M54K089J56j328k404j622J104m26K807
$$ 2463 -19 -3444 -4289 -4047 -2632 -633 -635 -505 -51 2038 2194 866 -1538 -3160 -2056 -2482 325
17137C25R91k438k345j378J386J368N86N03m5j501K316O74j154J308K0o00j768
$$ 325 1316 -1122 -3467 -4845 -3459 -2091 -1505 -1002 -1047 -2548 -232 442 -712 596 616 16 -1752
17120a752J116J843q67j678j320j028q8J95L50J908J169N32j620N29j246j037
$$ -1752 -636 1207 340 -1338 -2658 -3686 -3774 -3579 -3229 -1321 -152 380 -1240 -711 -1957 -2994
17104b994N06N0P59l94m1J42J793k102J883J523j389j797J34K061L815j68L14
$$ -2994 -2488 -2438 -1679 -2073 -2114 -1972 -179 -2281 -398 1125 -264 -2061 -1927 134 3949 3781 4095
17087D095N50l95Q57j582l842j104L329j449k381P05j075j294J701J928j243J853
$$ 4095 4645 4250 5107 3525 -317 -1421 1908 459 -1922 -1217 -2292 -3586 -1885 43 -1200 653
17071F53L93Q03j102J789O23r87m44L5J64O45o51j266k076k91R92j531J32L222
$$ 653 1046 1849 747 2536 3159 2172 1728 1763 1927 2572 1921 655 -1421 -1712 -720 -2251 -2119 1103
17053A103Q99j783k359K723J731p45r31K281J090j500R87N37Q68j059l024l389
$$ 1103 2002 219 -2140 583 2314 1569 638 2919 4009 2509 3496 4033 4901 3842 818 -2571
17037b571k460n8J408J271J174N02J339M73j904O88J356J898j486j587o5L091
$$ -2571 -5031 -5089 -3681 -2410 -1236 -734 605 1078 -826 -138 1218 3116 1630 43 -22 3069
17021C069K106j863k259j903J227J240K519J517j591k190n39J72j250k289K561
$$ 3069 5175 3312 1053 -850 377 1617 4136 5653 4062 1872 1333 1505 255 -2034 527
17006E27Q18j313k17p51j144J048N30k155j814k14K012M390J956q15j572k963
$$ 527 1345 32 -185 -936 -2080 -1032 -502 -2657 -4471 -4685 -2673 1717 3673 2858 1286 -1677
16990a677k240l794Q22K969K463J210p88j731Q51J76k92R29J279K040j91j760
$$ -1677 -3917 -7711 -6889 -3920 -1457 -247 -1035 -2766 -1915 -1739 -2031 -1102 177 2217 2026 266
16974B66r58J080j682j058O59J477P69j651k019m09K483J558m79j659R68L88j340
$$ 266 -692 388 -1294 -2352 -1693 -216 553 -1098 -3117 -3526 -1043 515 36 -1623 -655 -267 -1607
16957a607l20k61n81N97K005l11l076O45J956K042j368k271o3J115k023j96j075
$$ -1607 -1927 -2188 -2769 -2172 -167 -478 -3554 -2909 -953 1089 -279 -2550 -2613 -1498 -3521 -3717 -4792
16940d792J097M53R20L765K785K68l933l033K46K648K271K80O6l220r00K135J864
$$ -4792 -3695 -3242 -2322 1443 4228 4496 563 -2470 -2224 424 2695 2975 3041 -179 -1079 1056 2920
16923B920r68J439J65k262j354n33j827k3P53Q76p66J32r22J642K148Q33p74l468
$$ 2920 1952 3391 3556 1294 -60 -593 -2420 -2443 -1690 -814 -1580 -1448 -2370 -728 1420 2253 1479 -1989
16905a989j029r6N63K808j05k184q30K718K657j536k015p50K173j222k13J965
$$ -1989 -3018 -3114 -2551 257 152 -2032 -2862 -144 2513 977 -1038 -1788 385 -837 -1050 915
16889I15K045L40q37P84l562j196K9p54j571q32J332j025K859J723M6j894k936
$$ 915 2960 3300 2463 3247 -315 -1511 -1482 -2236 -3807 -4639 -3307 -4332 -1473 250 296 -1598 -4534
16872d534L12J935J415K827J036j505m08M06j31q73k341j367K951l70R69J611
$$ -4534 -4222 -2287 -872 1955 2991 1486 1078 1484 1353 480 -1861 -3228 -277 -647 322 1933
16856A933m93j638Q43Q56o0Q74q19j465J165n07J354J11k43k365q01M204K67k427
$$ 1933 1440 -198 645 1501 1441 2315 1496 31 1196 689 2043 2154 1911 -454 -1255 2949 3216 789
16838G89j238j936j377r51J359J435R68K01k2J91K068J479k823j265J067K185
$$ 789 -449 -2385 -3762 -4713 -3354 -1919 -951 -750 -772 -581 1487 2966 143 -1122 -55 2130
16822B130J433j067r90Q17K27k27n79k076j031j38m37j575R00J665j706k58J357
$$ 2130 3563 2496 1506 2323 2550 2323 1744 -332 -1363 -1501 -1938 -3513 -2613 -948 -2654 -2912 -1555
16805a555J541r93j882K466q07k392K09J541K309O36J016j366k080j212r61Q46
$$ -1555 -14 -1007 -2889 -423 -1230 -3622 -3413 -1872 437 1073 2089 723 -1357 -2569 -3530 -2684
16789b684K151j4R91j635j679k300L75K72J624K234j2j584P72K785J54q53j107
$$ -2684 -533 -547 444 -1191 -2870 -5170 -4795 -4523 -2899 -665 -677 -2261 -1489 1296 1450 597 -510
16772e10j428j140J545J777m83k150k280j628J579J737J20l55M73r1M64p88K427
$$ -510 -1938 -3078 -1533 244 -239 -2389 -4669 -6297 -4718 -2981 -2861 -3216 -2743 -2834 -2370 -3158 -731
16755g31j766o59n55J445M703K344n92l897O71o43K208N46k984k425n72k36j784
$$ -731 -2497 -3156 -3711 -2266 2437 4781 4189 292 963 320 2528 3074 90 -2335 -2907 -3143 -4927
16738d927J829J918N63q70j278j903j852J490J298Q33L91P17L9M89J641m55j865
$$ -4927 -3098 -1180 -617 -1487 -2765 -4668 -6520 -5030 -3732 -2899 -2508 -1791 -1752 -1263 378 -77 -1942
16721a942k584k526j113K122N16N80J252J230J668J624n22L10q89o92j509j902
$$ -1942 -4526 -7052 -8165 -6043 -5527 -4947 -3695 -2465 -797 827 305 615 -274 -966 -2475 -4377
16705d377J443J036n05R25J057k091j113k915R36K702K038l3J147O2M12j286j347
$$ -4377 -2934 -1898 -2403 -1478 -421 -2512 -3625 -6540 -5604 -2902 -864 -897 250 312 724 -562 -1909
16688a909J188J614q17J273q91r41k60r70m70J375M68P16J18k076J33L020J893
$$ -1909 -721 893 76 1349 458 -483 -743 -1713 -2183 -808 -340 376 494 -1582 -1449 1571 3464
16671C464K78p36k006o84q34J127k259j707k439J180J90J880P50L84J9k34K08
$$ 3464 3742 3006 1000 316 -518 609 -1650 -3357 -5796 -4616 -4426 -2546 -1796 -1412 -1393 -1627 -1419
16654a419m71m73J925J124J136j091L09R34J515K04pm585j220K91R96k15j514
$$ -1419 -1890 -2363 -438 686 1822 731 1040 1974 3489 3693 3686 -899 -2119 -1828 -832 -1047 -2561
16637b561p01J530L276j00k653k384j893P85J185r39J061M10j687J051K019n26
$$ -2561 -3262 -1732 1544 1444 -1209 -3593 -5486 -4701 -3516 -4455 -3394 -2984 -4671 -3620 -1601 -2127
16621b127O07J750j30p43q57j364J466O39p27j159l718K085M423j850k438p84
$$ -2127 -1520 230 100 -643 -1500 -2864 -1398 -759 -1486 -2645 -6363 -4278 145 -1705 -4143 -4927
16605d927J369m83J147J842L10k486N86j211K65J927N53j838J649J717n13j213
$$ -4927 -3558 -4041 -2894 -1052 -742 -3228 -2642 -3853 -3588 -1661 -1108 -2946 -1297 420 -93 -1306
16589a306J600K669q98k951l029k258p41K945M517K544m72j181r93j243R92j102
$$ -1306 294 2963 2065 -886 -3915 -6173 -6914 -3969 548 3092 2620 1439 446 -797 195 -907
16573i07k82J872K405p02j563j826n4Q46J085j023j183n72R01J897j086N23R79
$$ -907 -1189 683 3088 2386 823 -1003 -1057 -211 874 -149 -1332 -1904 -1003 894 -192 331 1310
16556A310q93j351K192J19l150M63M25r8m75K930j373j555K415J132n67k9O18
$$ 1310 417 -934 1258 1377 -1773 -1310 -885 -983 -1458 1472 99 -1456 959 2091 1524 1495 2113
16539B113j422k444Q56J293K886J688l24k131k484j965k201J93J333J621j542
$$ 2113 691 -1753 -897 396 3282 4970 4646 2515 31 -1934 -4135 -3942 -2609 -988 -2530
16524b530q29K261K814k04k207k245l96Q0k725J640J253K265K280J061q45Q73
$$ -2530 -3359 -1098 1716 1512 -695 -2940 -3336 -3256 -5981 -4341 -3088 -823 1457 2518 1673 2546
16508B546P65k596j550j047O20J19R4j005l85m01N78M53j011k060J607K736j13
$$ 2546 3311 715 -835 -1882 -1262 -1143 -1049 -2054 -2439 -2840 -2262 -1809 -2820 -4880 -3273 -537 -650
16491f50K592J186q51l99j823k681Q21O08k146L7m50L10j636Q40M04OJ522K441
$$ -650 1942 3128 2277 1878 55 -2626 -1805 -1197 -3343 -3306 -3756 -3446 -5082 -4242 -3838 -3832 -2310 131
16473A31K609o88J13q18O17J456j904q40J616j665k172j236j328k430j48K761
$$ 131 2740 2052 2165 1347 1964 3420 1516 676 2292 627 -1545 -2781 -4109 -6539 -6687 -3926
16457c926N20M25J66L17J225K081L25J157j65k46k40M06N37R68K577l256l148
$$ -3926 -3406 -2981 -2815 -2498 -1273 808 1133 2290 2125 1879 1639 2045 2582 3550 6127 2871 -277
16440b77j339n91J737J228K051j776m89o55k97M09J195m12p78M04O7N65n27m572
$$ -277 -1616 -2207 -470 758 2809 1033 544 -111 -408 1 1196 784 6 410 477 1042 515 -4057
16422d057Q40J974P73m71N0j747k5K558J792n77k607j856j88O31J854J72j450
$$ -4057 -3217 -1243 -470 -941 -891 -2638 -2663 -105 1687 1110 -1497 -3353 -3541 -2910 -1056 -884 -2334
16405b334j585r78Q99K774K300n92J433k63o93J29j661j779J169j422j666J024
$$ -2334 -3919 -4897 -3998 -1224 1076 484 1917 1654 961 1090 -571 -2350 -1181 -2603 -4269 -3245
16389c245L924J469k83k292j892j038n94O17O49k91j36j129p24m4R69K07J043
$$ -3245 679 2148 1865 -427 -2319 -3357 -3951 -3334 -2685 -2976 -3112 -4241 -4965 -5009 -4040 -3833 -2790
16372b790P63L87k29k140o48p58n30J16J332J443K160j11r75O44J375Q10k531
$$ -2790 -2027 -1640 -1869 -4009 -4657 -5415 -5945 -5829 -4497 -3054 -894 -1005 -1980 -1336 39 849 -1682
16355a682q63j00k13P9J964K008O46k040p06o27M84O99R21J184m38P96O06l350
$$ -1682 -2545 -2645 -2858 -2779 -815 1193 1839 -201 -907 -1534 -1050 -351 570 1754 1316 2112 2718 -632
16337f32l792j575M56J512K141J120j819j534O83J473j09M77q50k36N90L25K587
$$ -632 -4424 -5999 -5543 -4031 -1890 -770 -2589 -4123 -3440 -1967 -2076 -1599 -2449 -2685 -2095 -1770 817
16320H17K01l00r14k59n51P07m68k38j426l19P83N72O9J869J766k004J62N30l303
$$ 817 1018 718 -196 -455 -1006 -299 -767 -1005 -2431 -2750 -1967 -1395 -1326 543 2309 305 467 997 -2306
16301b306m412P71j503P71K779K351K576M14j627K56L83J147k070k324j801O47
$$ -2306 -6718 -5947 -7450 -6679 -3900 -1549 1027 1441 -186 70 453 1600 -470 -2794 -4595 -3948
16285c948L11M94K091K800j374r65r25j424J555k28j072j025n13J136P49j797
$$ -3948 -3637 -3143 -1052 1748 374 -591 -1516 -2940 -1385 -1613 -2685 -3710 -4223 -3087 -2338 -4135
16269d135O54K231K307J482k900l995k209lJ6J570J341K06N35k052M23Q05K656
$$ -4135 -3481 -1250 1057 2539 -361 -4356 -6565 -6568 -6552 -4982 -3641 -3435 -2900 -4952 -4529 -3724 -1068
16252a068J415m86L99J550j72k057k732J101l65J640L084j079j848k544L27r34
$$ -1068 347 -139 260 1810 1638 -419 -3151 -2050 -2415 -775 2309 1230 -618 -3162 -2835 -3769
16236c769j534rp7R50n28J245J862K397j7J5l61r35J204N60M37k091j647P09O
$$ -3769 -5303 -5312 -5389 -4439 -4967 -3722 -1860 537 520 535 174 -761 443 1003 1440 -651 -2298 -1589 -1583
16217a583N98k360j115K179K469L87L25N14L62p59L90k188k53Q81L38R94O71O29
$$ -1583 -985 -3345 -4460 -2281 188 575 900 1414 1776 1017 1407 -781 -1034 -153 185 1179 1850 2479
16199B479j409j667P13l26L21O4L29L372J485k110k424o72p46j271n02J585l016
$$ 2479 1070 -597 116 -210 111 175 504 3876 5361 3251 827 155 -591 -1862 -2364 -779 -3795
16182c795J880J259J622o8m57J564M42k185R38K00m551n59K342J775J580R92p44
$$ -3795 -1915 -656 966 898 441 2005 2447 262 1200 1400 -3151 -3710 -1368 407 1987 2979 2235
16165B235j792l667j310L282J561J773m87j275j450k669Q68K740l88j096M0l542
$$ 2235 443 -3224 -4534 -1252 309 2082 1595 320 -1130 -3799 -2931 -191 -579 -1675 -1635 -5177
16149e177r63n50K034M021k58M91L657J92j156r56J493J848L41j664p83J085j862
$$ -5177 -6140 -6690 -4656 -635 -893 -402 3255 3447 2291 1335 2828 4676 5017 3353 2570 3655 1793
16132A793J296J391j183k527j153j272l808k026j090J474O89K209j65P19K054
$$ 1793 3089 4480 3297 770 -383 -1655 -5463 -7489 -8579 -7105 -6416 -4207 -4372 -3653 -1599
16117a599J727K267p86N88J390m069l278o13k92K95N92J57N94j398J500K202J752
$$ -1599 128 2395 1609 2197 3587 -482 -3760 -4373 -4665 -4370 -3778 -3621 -3027 -4425 -2925 -723 1029
16100A029J074j173j551K40n09q14L44q97j545j05K37K224L59n76k307P64M014
$$ 1029 2103 930 -621 -381 -890 -1704 -1360 -2257 -3802 -3907 -3670 -1446 -1087 -1663 -3970 -3206 808
16083H08L831P28m057k238o70l87O42K13j168o74K79J239r93l584l18J990L514
$$ 808 4639 5367 1310 -928 -1598 -1985 -1343 -1130 -2298 -2972 -2693 -1454 -2447 -6031 -6349 -4359 -845
16066h45J276J555K15k554k028L18O64j52j018J310R35r54M74Q18K772p71n446
$$ -845 431 1986 2201 -353 -2381 -2063 -1399 -1551 -2569 -1259 -324 -1278 -804 14 2786 2015 -3431
16049c431n2K601J694j042k51j875j072j098r60J193L316L025J775n47j36P66
$$ -3431 -3483 -882 812 -230 -481 -2356 -3428 -4526 -5486 -4293 -977 2048 3823 3276 3140 3906
16033C906J200j342k907l553k970j332L0J62o22J701L184P49k27J738L75k247
$$ 3906 5106 3764 857 -2696 -5666 -6998 -6968 -6806 -7428 -5727 -2543 -1794 -2021 -283 92 -2155
16017b155j199j10P48L50J031J154j188N7j783P72j046k299Q83J165R23qj281
$$ -2155 -3354 -3464 -2716 -2366 -1335 -181 -1369 -1312 -3095 -2323 -3369 -5668 -4785 -3620 -2697 -2705 -3986
16000c986k550K55R92J138K70J313K981J419J12j235O43p73k961n91J468K147
$$ -3986 -6536 -6281 -5289 -4151 -3881 -2568 413 1832 1944 709 1352 579 -2382 -2973 -1505 642
15984F42J990K320j026j735o41j214L11J822q80j740J653q69k402l24NL64J024
$$ 642 2632 4952 3926 2191 1550 336 647 2469 1589 -151 1502 633 -1769 -2093 -2088 -1724 -700
15967g00j603o18L841j63j004o49K44k53k577m13J023K987k90p90M37m24J651
$$ -700 -2303 -2921 920 757 -247 -896 -652 -905 -3482 -3895 -2872 115 -175 -965 -528 -952 699
15950F99J360r38j551m22q71P72J050q40j529p54k343q80K513L724J030j528j095
$$ 699 2059 1121 -430 -852 -1723 -951 99 -741 -2270 -3024 -5367 -6247 -3734 -10 1020 -508 -1603
15933a603n43j053j480O74L88m5J474K174j217o03J255J178l857k313k20K119
$$ -1603 -2146 -3199 -4679 -4005 -3617 -3662 -2188 -14 -1231 -1834 -579 599 -3258 -5571 -5791 -3672
15917c672K253K70j026j439p75p96Q31J990L95K105J562j488k268r49J618J567
$$ -3672 -1419 -1149 -2175 -3614 -4389 -5185 -4354 -2364 -1969 136 1698 210 -2058 -3007 -1389 178
15901A78n95k052k800j296N23NM96O94K299P1m05M74J796k036P34K63k335l254
$$ 178 -417 -2469 -5269 -6565 -6042 -6037 -5541 -4847 -2548 -2477 -2882 -2408 -612 -2648 -1914 -1651 -3986 -7240
15883g240K73L079K546l265R57J566J237R30j380j97r54k673j18K624K043J175
$$ -7240 -6967 -3888 -1342 -4607 -3650 -2084 -847 83 -1297 -1494 -2448 -5121 -5239 -2615 -572 603
15867F03o53J48m77O05r09m17L491L19l301M4j125L185J637j038M12j036j281
$$ 603 -50 98 -379 226 -683 -1100 2391 2710 -591 -547 -1672 1513 3150 2112 2524 1488 207
15850B07j375j455M1K003m90M58J096K111L88p86J544J354j54j276j97l237r85
$$ 207 -1168 -2623 -2582 -579 -1069 -611 485 2596 2984 2198 3742 5096 4942 3666 3469 232 -753
15833g53N81M58j406N49J855n01j156p17J973K879O22o24m826k461Q60K987M190
$$ -753 -172 286 -1120 -571 1284 783 -373 -1090 883 3762 4384 3760 -1066 -3527 -2667 320 4510
15816D510q75l480p80O95k273j516j771R0K879J304j209k522L34J079R70N34l3
$$ 4510 3635 155 -625 70 -2203 -3719 -5490 -5400 -2521 -1217 -2426 -4948 -4614 -3535 -2565 -2031 -2064
15799b064N73J509N57J107j468m00k53j883P0J634j919j199J555l25N29K229q60
$$ -2064 -1491 18 575 1682 214 -186 -439 -2322 -2252 -618 -2537 -3736 -2181 -2506 -1977 252 -608
15782f08j935j471J652J497n0p9J987P08q11k055k779j701J607J530K84j13m36
$$ -608 -2543 -4014 -2362 -865 -915 -994 993 1701 890 -1165 -3944 -5645 -4038 -2508 -2224 -2337 -2773
15765b773J416J009J17j372K580p17k576l598p44L968K038q37J216q26j592m35
$$ -2773 -1357 -348 -231 -1603 977 260 -2316 -5914 -6658 -2690 -652 -1489 -273 -1099 -2691 -3126
15749c126L168J261j133R64O22j152k480k716j076J515K280j72J470n38j373P06
$$ -3126 42 1303 170 1134 1756 604 -1876 -4592 -5668 -4153 -1873 -2045 -575 -1113 -2486 -1780
15733a780o94N53m05L079J409o86j032R90K21p15J484l51k569N00k276N11J099
$$ -1780 -2474 -1921 -2326 753 2162 1476 444 1434 1655 940 2424 2073 -496 4 -2272 -1761 -662
15716f62j031j454j706Q2J822O2J646K038q55o95O08K48J25n62o12J176N72O63
$$ -662 -1693 -3147 -4853 -4771 -2949 -2887 -1241 797 -58 -753 -145 103 228 -334 -946 230 802 1465
15698A465o00J769P03j136j65k76q95P47M73l353j066J044O85k055j132l153J894
$$ 1465 865 2634 3337 2201 2036 1760 865 1612 2085 -1268 -2334 -1290 -605 -2660 -3792 -6945 -5051
15681e051K574R16k51J428J469o4k9p84N22J508n68L27j754l76P51j42m61j201
$$ -5051 -2477 -1561 -1812 -384 1085 1021 992 208 730 2238 1670 1997 243 -133 618 476 15 -1186
15663a186J256J471k598j028J906k683l175J483k18J53O41K388J515l02l110k58
$$ -1186 70 1541 -1057 -2085 -179 -2862 -6037 -4554 -4772 -4619 -3978 -1590 -75 -377 -3487 -3745
15647c745j458K414J004M06K031P12j305j721J402L45l102o63m29Q50J720J133
$$ -3745 -5203 -2789 -1785 -1379 652 1364 59 -1662 -260 85 -3017 -3680 -4109 -3259 -1539 -406
15631d06L32r73j880N88K149K421J40k176j594M85J261Rp03j15k358j381l29K209
$$ -406 -74 -1047 -2927 -2339 -190 2231 2371 195 -1399 -914 347 356 -347 -462 -2820 -4201 -4530 -2321
15613b321q61l36M55K172Q14P5L04k309m465k816j081K431L577L306L153j283
$$ -2321 -3182 -3518 -3063 -891 -77 -2 302 -2007 -6472 -9288 -10369 -7938 -4361 -1055 2098 815
15597H15k945l274J086K466K138J581j109j355J6l69P03j15R44K043Q33n26j640
$$ 815 -2130 -5404 -4318 -1852 286 1867 758 -597 -581 -950 -247 -362 582 2625 3458 2932 1292
15580A292m36q89n87p78R42l53K88q79j234R29K875pq0r53k506q71j406k676o27
$$ 1292 856 -33 -620 -1398 -456 -809 -521 -1400 -2634 -1705 1170 1163 1083 130 -2376 -3247 -4653 -7329 -7956
15561g956K714K280K534J344R8j369J1J024J602J489k79j230P88l06k130j234
$$ -7956 -5242 -2962 -428 916 1014 -355 -344 680 2282 3771 3492 2262 3050 2744 614 -620
15545f20P63j947n58J409J762l048j023p76j13o70k020m10l59j13L829L089L60
$$ -620 143 -1804 -2362 -953 809 -2239 -3262 -4038 -4151 -4821 -6841 -7251 -7610 -7723 -3894 -805 -445
15528d45n01O44l57j48J21j474o98J273l03K055J990j476n71J908Q41p51o93n09
$$ -445 -946 -302 -659 -807 -686 -2160 -2858 -1585 -1888 167 2157 681 110 2018 2859 2108 1415 906
15510I06j83j374o82J352J028l86k584j73j28k309n50k02J482J928Q23n94J512
$$ 906 723 -651 -1333 19 1047 661 -1923 -2096 -2224 -4533 -5083 -5285 -3803 -1875 -1052 -1646 -134
15493a34L47p75r95J038m5j031p23J336J231M55j557n45j407J222m99n65J430
$$ -134 213 -562 -1557 -519 -564 -1595 -2318 -982 249 704 -853 -1398 -2805 -1583 -2082 -2647 -1217
15476a217N18j897R87l7q58o47J298J118K980J514o54j892o32J53j88n39n8j182
$$ -1217 -699 -2596 -1609 -1646 -2504 -3151 -1853 -735 2245 3759 3105 1213 581 734 546 7 -51 -1233
15458a233o12J249j131r12q44P50K57J138k11R97K818r6k35o50n98l55o50k279
$$ -1233 -1845 -596 -1727 -2639 -3483 -2733 -2476 -1338 -1549 -552 2266 2170 1935 1285 687 332 -318 -2597
15440b597l96K925o39r03p74m03L68P66R49K394K164j794j287j419K466K453n61
$$ -2597 -2993 -68 -707 -1610 -2384 -2787 -2419 -1653 -704 1690 3854 2060 773 -646 1820 4273 3712
15423C712k066J341o97k338k351j554j711J117J510Q08k448J190J453K99P33J258
$$ 3712 1646 2987 2290 -48 -2399 -3953 -5664 -4547 -3037 -2229 -4677 -3487 -2034 -1735 -1002 256
15407B56Q16N7j138j661M31J285K95P00J853L18n55K143o95k018o46J357K330
$$ 256 1072 1129 -9 -1670 -1239 46 341 1041 2894 3212 2657 4800 4105 2087 1441 2798 5128
15390E128N65k922m67J06p19o47k77M00k093K88L51J61l84q93l78r79q11l5k104
$$ 5128 5693 2771 2304 2410 1691 1044 767 1167 -926 -638 -287 -126 -510 -1403 -1781 -2760 -3571 -3606 -5710
15371e710k64L75o11K379J488l85p55J272K651J93l41J00o69R29q68r20p25k248
$$ -5710 -5974 -5599 -6210 -3831 -2343 -2728 -3483 -2211 440 633 292 392 -277 652 -216 -1136 -1861 -4109
15353d109J102K308K404j549J66J591p79l63j084k442j858J047M110L032j884
$$ -4109 -3007 -699 1705 156 322 1913 1134 771 -313 -2755 -4613 -3566 544 3576 1692
15338A692l292j54K71Q82K25J253J144j010K43R15J591j722p74M43N66l943j066
$$ 1692 -1600 -1754 -1483 -601 -376 877 2021 1011 1254 2169 3760 2038 1264 1707 2273 -1670 -2736
15321b736J760K08L80j47n68J258K785k721m12j312k685N17L232K759m69K07k835
$$ -2736 -976 -768 -388 -535 -1103 155 2940 219 -193 -1505 -4190 -3673 -441 2318 1849 2056 -779
15304g79J213K210O61l209p07K75L68J776R98j312O93K95O48J274k252l584J27
$$ -779 434 2644 3305 96 -611 -336 32 1808 2806 1494 2187 2482 3130 4404 2152 -1432 -1305
15287a305K068K907j447k220k965O2r45j96n8p80J707K840K4k469J197L90j001
$$ -1305 763 3670 2223 3 -2962 -2900 -3845 -4041 -4099 -4879 -3172 -332 -308 -2777 -1580 -1190 -2191
15270b191l320k045J610L05J491K665L279j594l66J599J086j016J27r15j313p51
$$ -2191 -5511 -7556 -5946 -5641 -4150 -1485 1794 200 -166 1433 2519 1503 1630 715 -598 -1349
15254a349j30R14j81n60K333M64k247k261p74J588K928N01l23K78p70j134J230
$$ -1349 -1479 -565 -746 -1306 1027 1491 -756 -3017 -3791 -2203 725 1226 903 1181 411 -723 507
15237E07l882J79Q96L32K50j183K39J92J433J961r82j67J796k592j996j173q45
$$ 507 -3375 -3196 -2300 -1968 -1718 -2901 -2662 -2470 -1037 924 -58 -225 1571 -1021 -3017 -4190 -5035
15220e035R21K717J606n64r74J3r33m07J000N43R75Q22r15N30J662R25J890l317
$$ -5035 -4114 -1397 209 -355 -1329 -1316 -2249 -2656 -1656 -1113 -138 684 -231 299 1961 2886 4776 1459
15202A459j258k646j339m56l42n51K03K638j7J159q91N53J018N89j243l51j767
$$ 1459 201 -2445 -3784 -4240 -4582 -5133 -4930 -2292 -2309 -1150 -2041 -1488 -470 119 -1124 -1475 -3242
15185c242J542J377J318J174J50q60j958k388q90J778J332o66j752j118P05J85
$$ -3242 -1700 -323 995 2169 2319 1459 -499 -2887 -3777 -1999 -667 -1333 -3085 -4203 -3498 -3313
15169c313N01J218L53m20p24J037J615J00o27j2m30j368k207M10r39J297O22N96
$$ -3313 -2812 -1594 -1241 -1661 -2385 -1348 267 367 -260 -272 -702 -2070 -4277 -3867 -4806 -3509 -2887 -2291
15151b291r58Q75J271j360Q56J555K586n76J713j022l249O21J505J737r72k385
$$ -2291 -3249 -2374 -1103 -2463 -1607 -52 2534 1958 3671 2649 -600 21 1526 3263 2291 -94
15135i4P94k274N25K69J327j260n66j548K664J305j425r30J795J878j556m4p5
$$ -94 700 -1574 -1049 -780 547 -713 -1279 -2827 -163 1142 -283 -1213 582 2460 904 860 785
15118G85j422m2j018j131n35M19p69J52L183M82Q88o24k318j175R16n31J91n75
$$ 785 -637 -679 -1697 -2828 -3363 -2944 -3713 -3561 -378 104 992 368 -1950 -3125 -2209 -2740 -2549 -3124
15100c124L26R55K217J106j807k136J25j032q87K340K370j411m72J618k390k316
$$ -3124 -2798 -1843 374 1480 -327 -2463 -2338 -3370 -4257 -1917 453 -958 -1430 188 -2202 -4518
15084d518J098R13k43J173J639M63j985j417J286J903J717j21j488j025K620k291
$$ -4518 -3420 -2507 -2750 -1577 62 525 -1460 -2877 -1591 312 2029 1908 420 -605 2015 -276
15068b76k919n57N86J335K691L145J076k554k541m57m55L96R51j27m232j906l80
$$ -276 -3195 -3752 -3166 -1831 860 4005 5081 2527 -14 -471 -926 -530 421 294 -3938 -5844 -6224
15051f224L556J530J002J364J917M24j912l573j94K158l5m67m57l66J41qk4L355
$$ -6224 -2668 -1138 -136 1228 3145 3569 1657 -1916 -2110 48 13 -454 -911 -1277 -1136 -1144 -1168 2187
15033B187Q57o65J323r46j694K64M87j329L85r11k566m32J734K182J608l322j976
$$ 2187 3044 2379 3702 2756 1062 1326 1813 484 869 -42 -2608 -3040 -1306 876 2484 -838 -2814
15016b814p2l56j355o1m3R86L39Q73J121j504j925M45k362j434L864L359J112
$$ -2814 -2886 -3242 -4597 -4658 -4701 -3715 -3376 -2503 -1382 -2886 -4811 -4366 -6728 -8162 -4298 -939 173
14999A73j30k123p24J854m58p17J620M85R52M75j483o92K314J606q27q8N79k18
$$ 173 43 -2080 -2804 -950 -1408 -2125 -505 -20 932 1407 -76 -768 1546 3152 2325 2237 2816 2598
14981B598k643k403J3K297o28r16J872j673r48N71L031J542p47j295k98J931j903
$$ 2598 -45 -2448 -2435 -138 -766 -1682 190 -1483 -2431 -1860 1171 2713 1966 671 373 2304 401
14964D01L64J716M53K302K646K460L482P538J2442K4171J5622r089j6713j8656
$$ 401 765 2481 2934 5236 7882 10342 13824 21362 33804 57975 73597 64508 47795 29139
14950B9139j1940n214l526m639l07M08j924k31p58r97J050K017p58k066j739P49
$$ 29139 17199 11985 8459 3820 3513 3921 1997 1766 1008 11 1061 3078 2320 254 -1485 -736
14934g36k383R04L211J179j133j242q96n0j49K142n36k735K314J245Q86j718r12
$$ -736 -3119 -2215 996 2175 1042 -200 -1096 -1146 -1295 847 311 -2424 -110 1135 2021 303 -609
14917f09J82R18j544k69o99n82K604K980J301q89j401j941k71r38L029j538k043
$$ -609 -427 491 -1053 -1322 -2021 -2603 1 2981 4282 3393 1992 51 -220 -1158 1871 333 -1710
14900a710O36j94K210J275L51j436j581R73l19r27K013J783m38j486j007J485
$$ -1710 -1074 -1268 942 2217 2568 1132 -449 524 205 -722 1291 3074 2636 1150 143 1628
14884A628j046j605l084J353J831p3K021o40j761N8L35L25L05J979q28J63J514
$$ 1628 582 -1023 -4107 -2754 -923 -996 1025 385 -1376 -1318 -983 -658 -353 1626 798 961 2475
14867B475P89Q23k587k294j370P42P0k054j174K83P27L03K675J580j667p88q18
$$ 2475 3264 4087 1500 -794 -2164 -1422 -1352 -3406 -4580 -4297 -3570 -3267 -592 988 -679 -1467 -2285
14850b285l18L558J017k411J746M81J040K960j68J425R80p46m185l696J178k098
$$ -2285 -2603 955 1972 -439 1307 1788 2828 5788 5620 7045 8025 7279 3094 -602 576 -1522
14834a522o37J380r98J109K376M68j475k215O45j34J104N34K377j325m177j465
$$ -1522 -2159 -779 -1777 -668 1708 2176 701 -1514 -869 -1003 101 635 3012 1687 -2490 -3955
14818c955J092J354r49j5q73j286J016K526j31J167J732m33k693l080O90j443
$$ -3955 -2863 -1509 -2458 -2473 -3346 -4632 -3616 -1090 -1221 -54 1678 1245 -1448 -4528 -3838 -5281
14802e281k126J050K289K202j384J149L92P24j203m025K63l19Q55J568L722L96
$$ -5281 -7407 -6357 -4068 -1866 -3250 -2101 -1709 -985 -2188 -6213 -5950 -6269 -5414 -3846 -124 272
14786B72k942Q73L331M25l41k076j929r05j782p77P40J41J746J331j019Q60j08
$$ 272 -2670 -1797 1534 1959 1618 -458 -2387 -3292 -5074 -5851 -5111 -4970 -3224 -1893 -2912 -2052 -2160
14769b160K376J643j246j208M92o28q55NJ255j016l37J040N93J105J16k483k70
$$ -2160 216 1859 613 -595 -103 -731 -1586 -1581 -326 -1342 -1679 -639 -46 1059 1175 -1308 -1578
14752a578J77j47j237m75j13o72k085j790O27J920K214K516J92J057K580Q66p8
$$ -1578 -1401 -1548 -2785 -3260 -3373 -4045 -6130 -7920 -7293 -5373 -3159 -643 -451 606 3186 4052 3974
14735C974k10l030p58J832M11k242l046m397j483j078k06K224K377Q46m07K212
$$ 3974 3764 734 -24 1808 2219 -23 -3069 -7466 -8949 -10027 -10233 -8009 -5632 -4786 -5193 -2981
14719b981N4k17n47p64Q88L143R17J16j770k129Q97m64l17Q33J538K644j982k051
$$ -2981 -2927 -3144 -3691 -4455 -3567 -424 493 609 -1161 -3290 -2393 -2857 -3174 -2341 -803 1841 -141 -2192
14701b192o92K688O82l320p06j522k21J585N03L50J545k068L82L122n61j128L93
$$ -2192 -2884 -196 486 -2834 -3540 -5062 -5283 -3698 -3195 -2845 -1300 -3368 -2986 136 -425 -1553 -1160
14684a160J841j094K15M02L580J289p13k214j954L22n00j863J720N75Q30M70j802
$$ -1160 681 -413 -198 204 3784 5073 4360 2146 192 514 14 -1849 -129 446 1276 1746 -56
14667e6m31R93M9j04j111p82j271J443L280J648j688k964J288J634j4J88J175
$$ -56 -487 506 555 451 -660 -1442 -2713 -1270 2010 3658 1970 -994 294 1928 1914 2102 3277
14650C277N26j033j338O17J826K583j497k993k62J278p1j376N5l011Q36K243j855
$$ 3277 3803 2770 1432 2049 3875 6458 4961 1968 1706 2984 2913 1537 1592 -1419 -583 1660 -195
14633a95k960j006J551J256M58J780K41l730j12R37j295R52L69m74R06J977j273
$$ -195 -3155 -4161 -2610 -1354 -896 884 1125 -2605 -2717 -1780 -3075 -2123 -1754 -2228 -1322 655 -618
14616f18J085q51p66R28o73p85J366J579n52j861l02p89j617K1O45j749j10K26
$$ -618 467 -384 -1150 -222 -895 -1680 -314 1265 713 -1148 -1450 -2239 -3856 -3835 -3190 -4939 -5049 -4823
14598d823N20J041J224M78p7j344L89j162j260L92J852n7m70K435j209j147J060
$$ -4823 -4303 -3262 -2038 -1560 -1637 -2981 -2592 -3754 -5014 -4622 -2770 -2827 -3297 -862 -2071 -3218 -2158
14581b158k650j595M95K391K65r96K414K721J798j502j458J200Q83p88j982k512
$$ -2158 -4808 -6403 -5908 -3517 -3252 -4248 -1834 887 2685 1183 -275 925 1808 1020 -962 -3474
14565c474l70o55m20K017l050L95L393P65K063j282q96j760j975k963J617j707
$$ -3474 -3844 -4499 -4919 -2902 -5952 -5557 -2164 -1399 664 -618 -1514 -3274 -5249 -8212 -6595 -8302
14549h302L604J661j851k67K975J120j27K308K39l99o63r35k734J417K526J91
$$ -8302 -4698 -3037 -4888 -5155 -2180 -1060 -1187 1121 1360 961 298 -637 -3371 -1954 572 763
14533G63j840p48K57j076M98q18O3K447j36j835j426J065J000m66O38l8j136k376
$$ 763 -1077 -1825 -1568 -2644 -2146 -2964 -2901 -454 -590 -2425 -3851 -2786 -1786 -2252 -1614 -1652 -2788 -5164
14515e164J162J958K46j120N22M76N8N73J451J677k685j09J385n13k504k229k8
$$ -5164 -4002 -2044 -1798 -2918 -2396 -1920 -1862 -1289 162 1839 -846 -955 430 -83 -2587 -4816 -4844
14498d844K085J535o02l31J875K350J278j987k11J657l09k306K114K374M53k05
$$ -4844 -2759 -1224 -1826 -2157 -282 2068 3346 1359 1148 2805 2496 190 2304 4678 5131 4926
14482D926k19r35j723m038k551L84J674K025K93j211O22J113j170J661j6k10j475
$$ 4926 4707 3772 2049 -1989 -4540 -4156 -2482 -457 -164 -1375 -753 360 -810 851 835 625 -850
14465h50p90J224L09l87J426j340k491K39J538J232j302RR66N73j214q05N19j42
$$ -850 -1640 -416 -107 -494 932 -408 -2899 -2660 -1122 110 -1192 -1183 -217 356 -858 -1663 -1144 -1286
14447a286m50q87l73o66J5q85J772P35j057N29R11O83o58m91k711l26n78K670
$$ -1286 -1736 -2623 -2996 -3662 -3647 -4532 -2760 -2025 -3082 -2553 -1642 -959 -1617 -2108 -4819 -5145 -5723 -3053
14429c053N250J546k061j578O79K261o96j010k9j195K480J151m42K064N1l225
$$ -3053 2197 3743 1682 104 783 3044 2348 1338 1309 114 2594 3745 3303 5367 5418 2193
14413B193l49j321l16Q2l243k463J621J287J269K708o80J55J467L67N51l324k666
$$ 2193 1844 523 207 289 -2954 -5417 -3796 -2509 -1240 1468 788 943 2410 2777 3328 4 -2662
14396b662L243R68J564J140l757k250P34N75k84r64J779J667k219j793q10l93
$$ -2662 581 1549 3113 4253 496 -1754 -1020 -445 -729 -1693 86 1753 -466 -2259 -3069 -3462
14380c462k587nJ816j344L17r52J454L904K276o66k674l45k27n03m17J829Q65
$$ -3462 -6049 -6054 -4238 -5582 -5265 -6217 -4763 -859 1417 751 -1923 -2268 -2495 -2998 -3415 -1586 -721
14363g21k490P70J453L52j810p11J586K819j249j753j33k786J417J302R55o6o75
$$ -721 -3211 -2441 -988 -636 -2446 -3157 -1571 1248 -1 -1754 -1887 -4673 -3256 -1954 -999 -1065 -1740
14346a740k25j17K352j34K04N64j206j476j375J534j55o24O08K230l55j047l5
$$ -1740 -1965 -2082 270 136 340 904 -302 -1778 -3153 -1619 -1774 -2398 -1790 440 85 -962 -997
14329i97K7o38J971J67l10N21M89q43k779j643J952L297p30l020l338Q68Q83J628
$$ -997 -970 -1608 363 530 220 741 1230 387 -2392 -4035 -2083 1214 484 -2536 -5874 -5006 -4123 -2495
14311b495R86J073j280q66j770L73j01j567M21J116K161O36J36j649L82R79J296
$$ -2495 -1509 -436 -1716 -2582 -4352 -3979 -4080 -5647 -5226 -4110 -1949 -1313 -1177 -2826 -2444 -1465 -169
14294a69j55l97K36j231J07M12j413l19j77p15R58K022j676r52p07J195J926K506
$$ -169 -324 -721 -485 -1716 -1609 -1197 -2610 -2929 -3106 -3821 -2863 -841 -2517 -3469 -4176 -2981 -1055 1451
14276A451J824K63k331j665j117R16J6o10K131M85k283o10J57k196J081J919K466
$$ 1451 3275 3538 1207 -458 -1575 -659 -643 -1253 878 1363 -920 -1530 -1373 -3569 -2488 -569 1897
14259A897k003k251j506q8J90o06K202L76r40K56M55J349J399L044n84k44r88
$$ 1897 -106 -2357 -3863 -3951 -3761 -4367 -2165 -1789 -2729 -2473 -2018 -669 730 3774 3190 2946 1958
14242A958K44J279J339j103q44j109J97p38m79qj624q68l58J988J67M79J353m96
$$ 1958 2202 3481 4820 3717 2873 1764 1961 1223 744 736 -888 -1756 -2114 -126 41 520 1873 1377
14224A377j003n56R15J251j210l72j808l56J85m22J440J474m49R02J147K86j489
$$ 1377 374 -182 733 1984 774 402 -1406 -1762 -1577 -1999 -559 915 466 1368 2515 2801 1312
14207A312q86l229O97Q1N12j977L67J92k87j961O52Q03J225J52J147K289J958
$$ 1312 426 -2803 -2106 -2025 -1513 -3490 -3123 -2931 -3218 -5179 -4527 -3724 -2499 -2347 -1200 1089 3047
14190C047n61J589O50j614l268j941J803M034n08k106m75k238j139N33l96l23
$$ 3047 2486 4075 4725 3111 -157 -2098 -295 3739 3231 1125 650 -1588 -2727 -2194 -2590 -2913
14174b913J577J948J23r97N33K849j012k042J680l376k052m40J470K026j00K30
$$ -2913 -1336 612 735 -262 271 3120 2108 66 1746 -1630 -3682 -4122 -2652 -626 -726 -496
14158d96q32j247M52J175J240J571n78j846P07Q88J016J23j441j296J593m33k282
$$ -496 -1328 -2575 -2123 -948 292 1863 1285 -561 146 1034 2050 2173 732 -564 1029 596 -1686
14141a686k276K338j438j443L049K952m89J177J794j51j480j055q97o73r53j406
$$ -1686 -3962 -1624 -3062 -4505 -1456 1496 1007 2184 3978 3827 2347 1292 395 -278 -1231 -2637
14125b637l54J719O99J643P30J02j506j128R88J395k15j101j672J157K215j881
$$ -2637 -2991 -1272 -573 1070 1800 1902 396 -732 256 1651 1436 335 -1337 -180 2035 154
14109A54q64R44O49j433j638j367K330J071R58l013O97K07j965M41j14J592r41
$$ 154 -710 234 883 -550 -2188 -3555 -1225 -154 804 -2209 -1512 -1305 -3270 -2829 -2943 -1351 -2292
14092b292j012Q49j545jO96J274P95N50p54q60j618M40L629j918j116J024n48
$$ -2292 -3304 -2455 -4000 -4001 -3305 -2031 -1236 -686 -1440 -2300 -3918 -3478 151 -1767 -2883 -1859 -2407
14075b407k84J28j85p55J740R86m72k205J76K953k051j308j575R48M476j18o45
$$ -2407 -2691 -2563 -2748 -3503 -1763 -777 -1249 -3454 -3278 -325 -2376 -3684 -5259 -4311 165 47 -598
14058e98k308k19p04O30J730j394m69k007n50M28K141K874Q64j374j36j097l425
$$ -598 -2906 -3125 -3829 -3199 -1469 -2863 -3332 -5339 -5889 -5461 -3320 -446 418 -956 -1092 -2189 -5614
14041e614j354K364L370J132k402j066K146J517O25k806j520K978M581O303K488
$$ -5614 -6968 -4604 -1234 -102 -2504 -3570 -1424 93 718 -2088 -3608 -630 3951 10254 12742
14026A2742Q84j499l469n283m11O40j122j779l48k086m61J181k041q99R82J217
$$ 12742 13626 12127 8658 3375 2964 3604 2482 703 355 -1731 -2192 -1011 -3052 -3951 -2969 -1752
14010a752K379K071K745K78l260l228k123j369m07j414j560J303L642L480K010
$$ -1752 627 2698 5443 5721 2461 -767 -2890 -4259 -4666 -6080 -7640 -6337 -2695 785 2795
13995B795j14J19n38L381J369j485k557j315k028l41k471o19K825J992M280P263
$$ 2795 2681 2800 2262 5643 7012 5527 2970 1655 -373 -714 -3185 -3804 -979 1013 5293 12556
13979A2556M708k814n835k944j695k118k31l702l682K386J206k217l59l252J784
$$ 12556 17264 14450 8615 5671 3976 1858 1627 -2075 -5757 -3371 -2165 -4382 -4741 -7993 -6209
13964f209L310L718k723j736k78Q83K211L079M044K892L391K969j690m638n812
$$ -6209 -2899 819 -1904 -3640 -3918 -3035 -824 2255 6299 9191 12582 15551 13861 9223 3411
13949C411m695j518j096K129n14j772k330K770J201j837O0o8r19N29Q48l47N61
$$ 3411 -1284 -2802 -3898 -1769 -2283 -4055 -6385 -3615 -2414 -4251 -4191 -4259 -5178 -4649 -3801 -4148 -3587
13932c587j262l67K309N07j658j370M73l74J530K194O04j621j017P67J69K676
$$ -3587 -4849 -5216 -2907 -2400 -4058 -5428 -4955 -5329 -3799 -1605 -1001 -2622 -3639 -2872 -2703 -27
13916b7P35j359m30j019R24M71p22k275K475K932p67J29m262l184l85J908L304
$$ -27 708 -651 -1081 -2100 -1176 -705 -1427 -3702 -1227 1705 938 1067 -3195 -6379 -6764 -4856 -1552
13899a552M83j237Q80J188j151j042J126L86O11J74K503L02j41j664j797j242
$$ -1552 -1069 -2306 -1426 -238 -1389 -2431 -1305 -919 -308 -134 2369 2671 2530 866 -931 -2173
13883b173O73K579j2j460L14K71j414k633J607K922j0m77N13m7m66p93N0N22o01
$$ -2173 -1500 1079 1067 -393 -79 192 -1222 -3855 -2248 674 664 187 700 653 187 -606 -556 -34 -635
13864f35p93k46n6L496K742Q23K88j556j660k805j280o1j275K91R16P11J04J470
$$ -635 -1428 -1674 -1730 1766 4508 5331 5619 4063 2403 -402 -1682 -1743 -3018 -2727 -1811 -1100 -996 474
13846D74r50O12N84l022O27M05j755Jo91o22O18N14L111J593N7o59j340L59J790
$$ 474 -476 136 720 -2302 -1675 -1270 -3025 -3024 -3715 -4337 -3719 -3205 -94 1499 1556 897 -443 -84 1706
13827A706N92J712n4j370j465k556o91J77J519n2m50k043K35l34k600J670K742
$$ 1706 2298 4010 3956 2586 1121 -1435 -2126 -1949 -430 -482 -932 -2975 -2740 -3074 -5674 -4004 -1262
13810a262K626M37p38J290M07k05j379j355j516k019l74J927Q64K042Rk59j300
$$ -1262 1364 1801 1063 2353 2760 2555 1176 -179 -1695 -3714 -4088 -2161 -1297 745 754 495 -805
13793h05Q42k15N64n66J234O45m90r34p62j70J681J956q26N3J095K84j352M46
$$ -805 37 -178 386 -180 1054 1699 1209 275 -487 -657 1024 2980 2154 2207 3302 3586 2234 2680
13775B680k943l166J345O26J557L747o07l149l435N85J596m12J68q2Q66j417q3
$$ 2680 -263 -3429 -2084 -1458 99 3846 3239 90 -3345 -2760 -1164 -1576 -1408 -1490 -624 -2041 -2124
13758b124P75m75o51J254L534k611l450O10K100J370j404m91N9k62j155K445M158
$$ -2124 -1349 -1824 -2475 -1221 2313 -298 -3748 -3138 -1038 332 -1072 -1563 -1504 -1766 -2921 -476 3682
13741C682l71l128k66q59N81j151J68K145J754l057P0J866L78l003p35R84J396
$$ 3682 3311 183 -83 -942 -361 -1512 -1344 801 2555 -502 -432 1434 1812 -1191 -1926 -942 454
13724D54p43k246J122J04j290J750K821j02j7j972j553j053J264J596M7J735j937
$$ 454 -289 -2535 -1413 -1309 -2599 -849 1972 1870 1853 -119 -1672 -2725 -1461 135 182 1917 -20
13707b0n44J91Q52m72n96j936k290j611J174k28J154L868K223J230j912j471J824
$$ -20 -564 -373 479 7 -589 -2525 -4815 -6426 -5252 -5480 -4326 -458 1765 2995 1083 -388 1436
13690A436K212k022j113K392J241o69j122k365j140p41j270L814Q58k089o66J709
$$ 1436 3648 1626 513 2905 4146 3477 2355 -10 -1150 -1891 -3161 653 1511 -578 -1244 465
13674D65J491J96p2q45k616j064K462K709R63J098l934n133j95P81K126J214J62
$$ 465 1956 2152 2080 1235 -1381 -2445 17 2726 3689 4787 853 -4280 -4475 -3694 -1568 -354 -192
13657a92K671K251J46o56l68k39k114j055R90O39j422M20N76N83p67k403J47K071
$$ -192 2479 4730 4876 4220 3852 3613 1499 444 1434 2073 651 1071 1647 2230 1463 -940 -793 1278
13639A278J914K257Q60j161j227j764L93K328P41q07k295k595o36K605n23l728
$$ 1278 3192 5449 6309 5148 3921 2157 2550 4878 5619 4812 2517 -78 -714 1891 1368 -2360
13623b360J107J790l85K168O11j911k625J664k725m22J930k79J863N31K93J595
$$ -2360 -1253 537 152 2320 2931 1020 -1605 59 -2666 -3088 -1158 -1437 426 957 1250 2845
13607B845r58j426j430p58J262j050m8L606P71K6j40o84j393j182J042K251N2
$$ 2845 1887 461 -969 -1727 -465 -1515 -1563 2043 2814 2840 2700 2016 623 -559 483 2734 2786
13590B786q03j725p15k84n20l95j869j379K66K877Rm53J603Q66K03j06k045O06
$$ 2786 1983 258 -457 -741 -1261 -1656 -3525 -4904 -4638 -1761 -1752 -2205 -602 264 467 361 -1684 -1078
13572a078R21k401j851J136K679J312J191O92j795l073K44p18j014r91K660K006
$$ -1078 -157 -2558 -4409 -3273 -594 718 1909 2601 806 -2267 -2023 -2741 -3755 -4746 -2086 -80
13556h0n21M92N38j437J86L087k65k539j30N42R01j606j238j988K441P65l36p30
$$ -80 -601 -109 429 -1008 -822 2265 2000 -539 -669 -127 774 -832 -2070 -4058 -1617 -852 -1188 -1918
13538a918j111j90J725j322j523j0J106j084l25o74k80q72J162Q48k70L35P19
$$ -1918 -3029 -3219 -1494 -2816 -4339 -4349 -3243 -4327 -4652 -5326 -5606 -6478 -5316 -4468 -4738 -4403 -3684
13521c684o15K96J023L575j05k576k383K52J471M88q78j69J131j089L59N21j64
$$ -3684 -4299 -4003 -2980 595 490 -2086 -4469 -4217 -2746 -2258 -3136 -3305 -2174 -3263 -2904 -2383 -2547
13504b547p31N37J42J365J834j587k41K44j013J919K293o49k789R95J478j3J30
$$ -2547 -3278 -2741 -2599 -1234 600 -987 -1228 -984 -1997 -78 2215 1566 -1223 -228 1250 1237 1367
13487A367L66m81j816N60K273p46j797L51n1j232K4l465J26L376n82j39k3j30
$$ 1367 1733 1252 -564 -4 2269 1523 -274 77 26 -1206 -1182 -4647 -4521 -1145 -1727 -1866 -1889 -2019
13469b019J332p65J76K94j244J968r35J55K363J432j024l878L33j504j006K16
$$ -2019 -687 -1452 -1276 -982 -2226 -258 -1193 -1038 1325 2757 1733 -2145 -1812 -3316 -4322 -4106
13453d106J423Q18J262m58K620J685j532k889J363L266R3r65Q49J110m314l497
$$ -4106 -2683 -1865 -603 -1061 1559 3244 1712 -1177 186 3452 3545 2580 3429 4539 225 -3272
13437c272l77J709J317J802M56j427P74J128P20j230j43N9K105o6k702M3j239
$$ -3272 -3649 -1940 -623 1179 1635 208 982 2110 2830 1600 1457 1516 3621 3555 853 896 -343
13420c43r95q76j768J361J010K822J990L7k435o4J694K162k06j525j971j698j600
$$ -343 -1338 -2214 -3982 -2621 -1611 1211 3201 3238 803 739 2433 4595 4389 2864 893 -805 -2405
13403b405m43J267L52l602j031k03J305K489N9o51J189P35j82R91K466K915j082
$$ -2405 -2848 -1581 -1229 -4831 -5862 -6065 -4760 -2271 -2212 -2863 -1674 -939 -1121 -130 2336 5251 4169
13386D169l478L7O94N16L73O26J390k394k220M41J321m90rL212K19k26m01m09
$$ 4169 691 728 1422 1938 2311 2937 4327 1933 -287 154 1475 985 976 4188 4407 4181 3780 3371
13368C371l009m085l398N587M891J449l323p51j689j317p04m09j138j378R98m19
$$ 3371 362 -3723 -7121 -1534 3357 4806 1483 732 -957 -2274 -2978 -3387 -4525 -5903 -4905 -5324
13352e324K542M257j573K8k520J196Q91K193K27k615p48R82K990K738j698l935
$$ -5324 -2782 1475 -98 -70 -2590 -1394 -503 1690 1917 -698 -1446 -464 2526 5264 3566 -369
13336c69j194j542NJ051P34r54r40J43J601J152j479J132n04r21rK80K400O36
$$ -369 -1563 -3105 -3100 -2049 -1315 -2269 -3209 -3066 -1465 -313 -1792 -660 -1164 -2085 -2094 -1814 586 1222
13318A222N79J321k133l240j387j567J696J980K45N77j431O8K14J173J510k67
$$ 1222 1801 3122 989 -2251 -3638 -5205 -3509 -1529 -1284 -707 -2138 -2070 -1856 -683 827 560
13302E60k108j369J484J063L08j659l13J244J574J443k513n18J709k1J52K028
$$ 560 -1548 -2917 -1433 -370 -62 -1721 -2034 -790 784 2227 -286 -804 905 884 1036 3064
13286C064l64j973k33r81l541k498J345N01K309L960J376o13Q10K797O45j958
$$ 3064 2700 727 494 -487 -4028 -6526 -5181 -4680 -2371 1589 2965 2352 3162 5959 6604 4646
13270D646O65R50j683k449j089J245R11j320l161n24Q09P37l97N62M79K727L000
$$ 4646 5311 6261 4578 2129 1040 2285 3196 1876 -1285 -1809 -1000 -263 -660 -98 381 3108 6108
13253F108k306m36k119m81o89j949j485L294K548m37R9j783j904L16k80J410M40
$$ 6108 3802 3366 1247 766 77 -1872 -3357 -63 2485 2048 2147 364 -1540 -1224 -1504 -94 346
13236C46m64K183j428m056k533J928K089j02j614N35K609J69k323M9K288n80l91
$$ 346 -118 2065 637 -3419 -5952 -4024 -1935 -2037 -3651 -3116 -507 -338 -2661 -2612 -324 -904 -1295
13219a295j512j289j652J593J546M38j717k12L615J346j154kK499q84J17M26r87
$$ -1295 -2807 -4096 -5748 -4155 -2609 -2171 -3888 -4100 -485 861 -293 -295 2204 1320 1437 1863 876
13202H76K01j059p44R69Q13Q60R95K573q6o95j124k218p06K03k04N4k212k413
$$ 876 1077 18 -726 243 1056 1916 2911 5484 5398 4703 3579 1361 655 858 654 708 -1504 -3917
13184c917p93K896K877j753k735P07O60q68L16q78j827l35R3K674M454Q67j325
$$ -3917 -4710 -1814 1063 -690 -3425 -2718 -2058 -2926 -2610 -3488 -5315 -5650 -5557 -2883 1571 2438 1113
13167A113q84J710J224k00R61Q06J85p11k405k288q94j97P42K744K156j032J892
$$ 1113 229 1939 3163 2963 3924 4730 4915 4204 1799 -489 -1383 -1580 -838 1906 4062 3030 4922
13150D922K124k39J191M39m260k433n54j226N47J287J731M90o53l17J454j844
$$ 4922 7046 6807 7998 8437 4177 1744 1190 -36 511 1798 3529 4019 3366 3049 4503 2659
13134B659p56o25J758P92l98L56o11j596L363J342j04k107K65p09J266N19kL85
$$ 2659 1903 1278 3036 3828 3430 3786 3175 1579 4942 6284 6180 4073 4338 3629 4895 5414 5412 5797
13116E797j873L0J635J532K12j107J71l16L498L480m60l412L95j335j72j147j491
$$ 5797 3924 3954 5589 7121 7333 6226 6397 6081 9579 13059 12599 9187 9582 8247 8075 6928 5437
13099E437j289j750N69N8k110k506j721P07J818j116J63J090j23Q17J001N32K968
$$ 5437 4148 2398 2967 3025 915 -1591 -3312 -2605 -787 -1903 -1740 -650 -773 44 1045 1577 4545
13082D545K056J477M163J554J241k107k846k203j134j646j275R56k529j006r84
$$ 4545 6601 8078 12241 13795 15036 12929 10083 7880 6746 5100 3825 4781 2252 1246 262
13067B62J61K047J114J63J10J53k505j192K252j62j860m02J607L78k614p66k16
$$ 262 423 2470 3584 3747 3857 4010 1505 313 2565 2403 543 141 1748 2126 -488 -1254 -1470
13050a470M90N17J420j401J692N24r82J464K676p64j67j992O48M879L075l50O18
$$ -1470 -980 -463 957 -444 1248 1772 790 2254 4930 4166 3999 2007 2655 7534 10609 10259 10877
13033A0877M21p26j923j690o60j12O43L95j329k193o3q94o46k402L08Q04J150
$$ 10877 11298 10572 8649 6959 6299 6187 6830 7225 5896 3703 3640 2746 2100 -302 6 810 1960
13016A960j148l616j962J463J507q72N51K430N43K30r31K9Q09O16O14k07M51P91
$$ 1960 812 -2804 -4766 -3303 -1796 -2668 -2117 313 856 1086 155 184 993 1609 2223 2016 2467 3258
12998C258j711J130K317K95j600J83J357K371J822j371k467k309l484r65L325
$$ 3258 1547 2677 4994 5289 3689 3872 5229 7600 9422 8051 5584 3275 -209 -1174 2151
12983B151N90N07J117J403L271j688l686m033j493o32K119J684R05J26J276l83
$$ 2151 2741 3248 4365 5768 9039 7351 3665 -368 -1861 -2493 -374 1310 2215 2341 3617 3234
12967C234j962l10k99j504k37N09q26j582J873J719J519q19j04p18j495k421k141
$$ 3234 1272 962 663 -841 -1078 -569 -1395 -2977 -1104 615 2134 1315 1211 493 -1002 -3423 -5564
12950e564P61J025J216K363J293j480l254J997m39k673j494J354n12L02J758Q28
$$ -5564 -4803 -3778 -2562 -199 1094 -386 -3640 -1643 -2082 -4755 -6249 -4895 -5407 -5105 -3347 -2519
12934b519K109J001n30J06M44J047J122J19J209p94j172L62k148o53OR37k189
$$ -2519 -410 591 61 167 611 1658 2780 2899 4108 3314 2142 2504 356 -297 -291 646 -1543
12917a543j667J449k10j91J780K457K051K626L064j509k750k960J335L443j602
$$ -1543 -3210 -1761 -1971 -2162 -382 2075 4126 6752 9816 8307 5557 2597 3932 7375 5773
12902E773l75k63r77m26K3o98q2j684k245r06o4p91L744L693o2J065J031k548
$$ 5773 5398 5135 4158 3732 3755 3057 2975 1291 -954 -1860 -1924 -2715 1029 4722 4660 5725 6756 4208
12884D208j828o93l426j278j646Q36M257K435N400L320J900K8m181k820N9P07
$$ 4208 2380 1687 -1739 -3017 -4663 -3827 430 2865 8265 11585 13485 13513 9332 6512 6571 7278
12868G278j653j668K162J271j3P85K863K68l41k55L321K739n53l401j715j39j02
$$ 7278 5625 3957 6119 7390 7377 8162 11025 11293 10952 10697 14018 16757 16204 12803 11088 10949 10847
12851A0847J211k90J359N293L134N098M554Q669J3804J8482J9793K0713K9384
$$ 10847 12058 11768 13127 18420 21554 26652 31206 39875 53679 72161 91954 112667 142051
12838A42051M2502N0844O9874J13764J90151L22875L93088K23886j13137l44264
$$ 142051 184553 235397 305271 419035 609186 932061 1325149 1549035 1435898 1091634
12828A091634l64184k56240j49306q4271n0516l3370k3784j9318j2656j1681j1643
$$ 1091634 727450 471210 321904 237633 187117 153747 129963 110645 97989 86308 74665
12817G4665j0618j0598r487m098j721J83K857J484m24k864m278l523j315l638
$$ 74665 64047 53449 43962 39864 38143 38326 41183 42667 42243 39379 35101 31578 30263 26625
12803B6625l473k866j878k367j718j536q43j206M089M067K041j999k997j822j876
$$ 26625 23152 20286 18408 16041 14323 12787 11944 10738 14827 18894 20935 18936 15939 14117 12241
12788A2241m45m9q28M12J012K269J865j114m511l264k213j299j468N21J370N46
$$ 12241 11796 11747 10919 11331 12343 14612 16477 15363 10852 7588 5375 4076 2608 3129 4499 5045
12772E045m91j97r85J212l54j922l561j982k90k920P7J121K519M160J388m17l0
$$ 5045 4554 4357 3372 4584 4230 2308 -1253 -3235 -3525 -6445 -6368 -5247 -2728 1432 2820 2403 2373
12755B373j625q62K434K583J418q36k391l365l520l324L09M144K301L940K143
$$ 2373 748 -114 2320 4903 6321 5485 3094 -271 -3791 -7115 -6806 -2662 -361 3579 5722
12740E722L248J673j166r14J503J029k813j214l39R5L83l32p85J332J304r32l178
$$ 5722 8970 10643 9477 8563 10066 11095 8282 7068 6729 6824 7207 6875 6090 7422 8726 7794 4616
12723D616k157m7J066l942k71K22O29l211Q3J472l70k484j141M53R66J469J177
$$ 4616 2459 2412 3478 -464 -735 -513 116 -3095 -3012 -1540 -1910 -4394 -5535 -5082 -4116 -2647 -1470
12706a470j08o96j133N266M859o44l486m189n298n527k098J127N11m139l610J178
$$ -1470 -1578 -2274 -3407 1859 6718 6074 2588 -1601 -6899 -12426 -14524 -13397 -12886 -17025 -20635 -19457
12690a9457n83J544L347O33k969m401j774K671O758P739K768o062n401p652p262
$$ -19457 -20040 -18496 -15149 -14516 -17485 -21886 -23660 -20989 -14231 -6492 -3724 -9786 -15187 -22839 -30101
12675c0101k022O345J3883J6042J4724R849N363J718k939l463j136j667L29K982
$$ -30101 -32123 -25778 -11895 4147 18871 28720 34083 35801 32862 29399 28263 26596 26925 29907
12661B9907J073j517l790n355r78j263j225Q83R91L043L841J006k425m947m685
$$ 29907 30980 29463 25673 20318 19340 18077 16852 17735 18726 21769 25610 26616 24191 19244 14559
12646A4559k078Q92K243L376j710k283N49l96k59K159M738O986O369N343L626
$$ 14559 12481 13373 15616 18992 17282 14999 15548 15152 14893 17052 21790 28776 35145 40488 44114
12631D4114K342l3R31J0177J3705K1380K7946K8362L4665J3704k6030n2573m2886
$$ 44114 46456 46423 47354 57531 71236 92616 120562 148924 183589 197293 171263 118690 75804
12618G5804k2256j4950r180m458l777k311R7L90J359M010M157r10m124m568L59
$$ 75804 53548 38598 29418 24960 21183 18872 18969 19359 20718 24728 28885 27975 23851 19283 19642
12603A9642j772k691l962n827j171K835L112O087P156M423L813L167K692j89j467
$$ 19642 17870 15179 11217 5390 4219 7054 10166 16253 23409 27832 31645 34812 37504 37315 35848
12588C5848M474L888K251j4n054n937n200o667o599k574l056j109q21K72J509
$$ 35848 40322 44210 46461 46447 41393 35456 30256 23589 16990 14416 11360 10251 9430 9702 11211
12573A1211J752N90K842J0739J1538L329l666j794Q53L734L219m149j3320j8566
$$ 11211 12963 13553 16395 27134 38672 42001 38335 36541 37394 41128 44347 40198 26878 8312
12559H312j5201r403m452k669j16K390O302Q198J0103Q878P295J0336R963Q792
$$ 8312 -6889 -16292 -20744 -23413 -23529 -21139 -14837 -6639 3464 12342 19637 29973 39936 48728
12545D8728Q247M881L154p0p826j1492j0068k530P07K887K471J058K436J335K333
$$ 48728 56975 61856 65010 64940 57114 45622 35554 33024 33731 36618 39089 40147 42583 43918 46251
12530D6251K709L445l54j0311j5678j5215n990J442O237N250O442L083j19L401
$$ 46251 48960 52405 52051 41740 26062 10847 4857 6299 12536 17786 24228 27311 27192 30593
12516C0593K729n414j0218j2109q802k716K182J90l403k373p67J275M070k150
$$ 30593 33322 27908 17690 5581 -3221 -5937 -3755 -3565 -6968 -9341 -10108 -8833 -4763 -6913
12502f913p826j3733j1671j3993j6152Q275M0053O3769N1508K4702N903M721L514
$$ -6913 -14739 -28472 -40143 -54136 -70288 -62013 -21960 41809 93317 118019 123922 128643 132157
12489A32157J08l453k778j796m775p455j2800j5003j3209j1424o005k29L587Q067
$$ 132157 132265 128812 126034 124238 119463 112008 99208 84205 70996 59572 53567 53338 56925 64992
12475F4992J3499J5259J1325O173K122n375q761p886m243l903n315o701n007l208
$$ 64992 78491 93750 105075 111248 113370 107995 99234 91348 87105 83202 77887 71186 66179 62971
12461F2971k437k340j833O943J1177Q808N235L355M171P941J3962J5811K0020
$$ 62971 60534 58194 56361 63304 74481 83289 88524 91879 96050 103991 117953 133764 153784
12448A53784K3825K2357J6561J2542N298K96L548O458R824J1575J2290J0574J2174
$$ 153784 177609 199966 216527 229069 234367 234663 238211 244669 254493 266068 278358 288932 301106
12435C01106J2648J0403J0452O471N496Q654J3698Q539J658r89N098J2965J9244
$$ 301106 313754 324157 334609 341080 346576 355230 368928 377467 379125 378136 383234 396199 415443
12422D15443K5456L0859L5292M8552N1914L9330K0186J2917K0599L4373N0457
$$ 415443 440899 471758 507050 555602 607516 646846 667032 679949 700548 734921 785378
12411G85378N3504N5051O3157O8741P2645Q3279Q8185P6175O1740N2147N1563
$$ 785378 838882 893933 957090 1025831 1098476 1181755 1269940 1346115 1407855 1460002 1511565
12400A511565O3764R3800J44858J89011K07897K05008K05377K26868K58378L17650
$$ 1511565 1575329 1669129 1813987 2002998 2210895 2415903 2621280 2848148 3106526 3424176
12390C424176M13576N01771N74188O40859P48432R93853J426798J999546K483343
$$ 3424176 3837752 4339523 4913711 5554570 6303002 7296855 8723653 10723199 13206542
12381A3206542K882323L533709M743847O277198P699368R417642J3026689K0482048
$$ 13206542 16088865 19622574 24366421 30643619 38342987 47760629 60787318 81269366
12373H1269366L4433866N6171752O3296433L3486636j4459860n0583192o0357277
$$ 81269366 115703232 171874984 235171417 268658053 254198193 203615001 143257724
12366A43257724m7891271k9440076j7351871j0838171p313393n276320l906191
$$ 143257724 95366453 65926377 48574506 37736335 30422942 25146622 21240431
12359B1240431k824530k089445j793260j798727j748134j545550j267324j003665
$$ 21240431 18415901 16326456 14533196 12734469 10986335 9440785 8173461 7169796
12351G169796p81136o34741n48510m85350m45607m05008l48352k82092k24278
$$ 7169796 6388660 5753919 5205409 4720059 4274452 3869444 3521092 3239000 3014722
12342C014722j82777j75802j90411j95286j89543j74271j48692j10290q0401o0497
$$ 3014722 2831945 2656143 2465732 2270446 2080903 1906632 1757940 1647650 1567249 1506752
12332A506752n9401o5038o5981n3586m5064m4208m6243n7790o4429n4954l6619
$$ 1506752 1447351 1382313 1316332 1262746 1217682 1173474 1127231 1069441 1005012 950058 913439
12321I13439j9034m606m688j8174k1612k1169k9042l6703m1010l5597k4031j8230
$$ 913439 894405 889799 885111 866937 845325 824156 795114 758411 717401 681804 657773 639543
12309F39543k2837k6792k5067j9698j5559j4420j1493r519p158m781n911j1611
$$ 639543 616706 589914 564847 545149 529590 515170 503677 494158 487000 482219 476308 464697
12297D64697j5757j5561j6594r547L2L820O810O958O830N898L164l686r628o360
$$ 464697 448940 433379 416785 407238 407270 411090 417900 424858 431688 437586 440750 437064 427436 421076
12283D21076l317j151k383n611j0209j1434j0121q156j3553j7490j5776j0073
$$ 421076 417759 416608 414225 408614 398405 386971 376850 368694 355141 337651 321875 311802
12271C11802j2093j4048j1499n776j055L002O054O722N046L601L24p893j5664
$$ 311802 299709 285661 274162 268386 267331 270333 276387 283109 288155 291756 292080 284187 268523
12258B68523j9947k0656j8153j4885j0367q776p525o653p290m671j583R490K1022
$$ 268523 248576 227920 209767 194882 184515 175739 168214 161561 154271 149600 148017 157507 178529
12245A78529N3067P2207N9936K1839j1543k7192k9969k7405k1620j3271l155J700
$$ 178529 231596 303803 363739 385578 374035 346843 316874 289469 267849 254578 251423 253123
12233B53123l113l869m863m431j744k440o809j6498j5525j2832n332J254K934
$$ 253123 250010 246141 241278 236847 235103 232663 225854 209356 193831 180999 175667 176921 179855
12220A79855n44k058K902J435Q47l241j0798j4166j4666r962j552J682J157p94
$$ 179855 179311 177253 180155 181590 182437 179196 168398 154232 139566 129604 128052 129734 130891 130097
12206A30097J81o44k941j383j281l891q575j0340q953l455K042M714O827P534
$$ 130097 130278 129634 126693 125310 124029 120138 111563 101223 92270 88815 90857 95571 102398 109932
12192A09932N609N313M807P391P991P932J0093O877k48o491o364o770j3234j7438
$$ 109932 115541 120854 125661 133052 141043 148975 159068 165945 165697 159206 152842 146072 132838 115400
12178A15400j5479p973m586K530L40k802l550j276N128J1398M904K212j170p80
$$ 115400 99921 91948 87362 89892 90232 87430 83880 82604 87732 99130 104034 106246 105076 104296
12164A04296k920N32J508j799k011m009o344o391j0393o680k409j496L672M001
$$ 104296 101376 101908 103416 101617 99606 95597 89253 82862 72469 65789 63380 61884 65556 69557
12150F9557L2k380P73L348K186O036Q075P194N683k31n383k903k550k820k482
$$ 69557 69589 67209 67982 71330 73516 79552 87627 94821 100504 100273 94890 91987 89437 86617 84135
12135H4135j726k632j937J701J737Q54L746L586l243O21K433J465j080j808J597
$$ 84135 82409 79777 77840 79541 81278 82132 85878 89464 86221 86842 89275 90740 89660 87852 89449
12120H9449j530j145O63J014j268m241l610j435m254k700q33k937m936m98j495
$$ 89449 87919 86774 87437 88451 87183 82942 79332 77897 73643 70943 70110 67173 62237 61739 60244
12105F0244P99M637M821M231J902r10m699l792j32K90K516J180n212o196o393
$$ 60244 61043 65680 70501 74732 76634 75724 71025 67233 67101 67391 69907 71087 65875 59679 53286
12090E3286k987o4L212L372L376N89l041n381j444r90k194j301O11n38L315J569
$$ 53286 50299 50235 53447 56819 60195 60784 57743 52362 50918 49928 47734 46433 47044 46506 49821 51390
12074E1390k518k868l625n293r62P212J1943J6749J7179J4142R387k455j0516
$$ 51390 48872 46004 42379 37086 36124 43336 55279 72028 89207 103349 112736 110281 99765
12061I9765j6908j2476n4L955N919P566J382k088k062k442j585q36J517K024J61
$$ 99765 82857 70381 70327 74282 80201 87767 89149 87061 84999 82557 80972 80136 81653 83677 83838
12046H3838J94K62k485K109l35n518n741q637o793r5n57J408K515K779N78j466
$$ 83838 84032 84294 81809 83918 83583 78065 72324 63687 56894 56799 56242 57650 60165 62944 63522 62056
12030F2056l045l35J336J119K595P36l126k341j077M107M671J009n367n890k130
$$ 62056 59011 58676 60012 61131 63726 64462 61336 58995 57918 62025 66696 67705 62338 56448 54318
12015E4318r20j466j339j753p03q07l08O26J897j269N28L368K174k533k060J360
$$ 54318 53398 51932 50593 48840 48137 47330 47022 47648 49545 48276 48804 52172 54346 51813 49753 51113
11999E1113j097J460L543M084J696P43k640n125R40J304l202j475n38K160M41
$$ 51113 50016 51476 55019 59103 60799 61542 58902 53777 54717 56021 52819 51344 50806 52966 53407
11984E3407m34k2R19K588M408L615j337o29n41J82j664k236j191k244q0o48m05
$$ 53407 52973 52951 53870 56458 60866 64481 63144 62515 61974 62156 60492 58256 57065 54821 54741 54093 53688
11967E3688m29K471R14J005O51k028m189j498k136l157o29L07M44J498J835j255
$$ 53688 53259 55730 56644 57649 58300 56272 52083 50585 48449 45292 44663 44970 45414 46912 48747 47492
11951D7492N92Q94m4m137m800j325L2p34R61L082J640J856l71K07j915q36N4j953
$$ 47492 48084 48978 48934 44797 39997 38672 38704 37970 38931 42013 43653 45509 45138 45345 43430 42594 42648 40695
11933D0695l493j920k96l55K606O842P594P985L436q55j687j453j356J159L554
$$ 40695 37202 35282 34986 34631 37237 44079 51673 59658 63094 62239 60552 59099 57743 58902 62456
11918F2456J905K703O570J2463J5554J8949J8032J9440K4942L0470L3628M4193
$$ 62456 64361 67064 73634 86097 101651 120600 138632 158072 183014 213484 247112 291305
11906B91305O4314J07540J93677L27145L96907K30090j10398l44915l68742k64749
$$ 291305 355619 463159 656836 983981 1380888 1610978 1500580 1155665 786923 522174
11896E22174j48937q3834n2920l8577k7697k0383j4355q059n827q686r359j0271
$$ 522174 373237 289403 236483 197906 170209 149826 135471 127412 121585 112899 103540 93269
11884I3269r745o977l361l731k783l550j783n13j638m21R88l380k922k523q57
$$ 93269 83524 76547 73186 69455 66672 63122 61339 60826 59188 58767 59755 56375 53453 50930 50073
11869E0073R44j908j944K41M73r63O20N58Q18j3K825j97l633l197m812k858j566
$$ 50073 51017 49109 47165 47406 47879 46916 47536 48094 48912 48899 51724 51527 47894 44697 39885 37027 35461
11852C5461J207k83N4Q1L543L573J774m99k430k047j480K223j428m235q88L45
$$ 35461 36668 36385 36439 36520 40063 43636 45410 44911 42481 40434 38954 41177 39749 35514 34626 34971
11836C4971L591K401k400m853m60J528K212K609j868k466j398J744K038J543J941
$$ 34971 38562 40963 38563 33710 33250 34778 36990 39599 37731 35265 33867 35611 37649 39192 41133
11821D1133O06r65j347k203k582P5J643L832O65l837O87k707k86L030N98o74j124
$$ 41133 41739 40774 39427 37224 34642 34717 36360 40192 40857 37020 37707 35000 34714 37744 38342 37668 36544
11804C6544K09P21M50J6q53Q7J228O52l08J194J226r22J267L928l19k024k064
$$ 36544 36753 37474 37924 37940 37087 37174 38402 39054 38746 39940 41166 40244 41511 45439 45120 43096 41032
11787D1032O58k340l464p44J77J199r91R66L54o78P61J720J427L834k542k143
$$ 41032 41690 39350 35886 35142 35319 36518 35527 36493 36847 36169 36930 38650 40077 43911 41369 39226
11771C9226q70n316k171L311N26Q77J159J122j28L92j612k362J26P64k08J758
$$ 39226 38356 33040 30869 34180 34706 35583 36742 37864 37736 38128 36516 34154 34280 35044 34836 36594
11755C6594J780Q44J346J58l310k233o95J217j676P46J256J74J83J83r13n82j647
$$ 36594 38374 39218 40564 40722 37412 35179 34484 35701 34025 34771 36027 36201 36384 36567 35654 35072 33425
11738C3425j031q23n5R09N96Q89P73l81k7J773k6n1O17R85J205j072k259J848
$$ 33425 32394 31571 31516 32425 33021 33910 34683 34302 34275 36048 36022 35971 36588 37573 38778 37706 35447 37295
11720C7295n64l432k434K629L743Q40k69q04n02k17j190m08j583L650K769m68
$$ 37295 36731 33299 30865 33494 37237 38077 37808 37004 36502 36285 35095 34687 33104 36754 39523 39055
11704C9055k218k274p54J965Q95J421J060j664j681p5M03j851k95K561N52J604
$$ 39055 36837 34563 33809 35774 36669 38090 39150 37486 35805 35730 36133 34282 33987 36548 37100 38704
11688C8704k32J102P97m57P54m21k25k280k102j376m85K018M19O02K331J215k456
$$ 38704 38472 39574 40371 39914 40668 40247 40022 37742 35640 34264 33779 35797 36216 36818 39149 40364 37908
11671C7908l143j274M47r13l88NL576J366m09j489r91J067K744J108j91l46N702
$$ 37908 34765 33491 33938 33025 32637 32642 36218 37584 37175 35686 34695 35762 38506 39614 39423 39077 44779
11654D4779q74j162J808l205m587k465j585j059K050L263j601k768J114O29JO31
$$ 44779 43905 42743 44551 41346 36759 34294 32709 31650 33700 36963 35362 32594 33708 34337 34338 34969
11638C4969J440m34j904k806J274m10J385L501M14P82j036l321j386J611J077
$$ 34969 36409 35975 34071 31265 32539 32129 33514 37015 37429 38211 37175 33854 32468 34079 35156
11623C5156J505k271l51L327j684p99J121q10m28J423k21N79k46j808n12J377
$$ 35156 36661 34390 34039 37366 35682 34883 36004 35194 34766 36189 35968 36547 36301 34493 33981 35358
11607C5358L410k291j589J9m44J268j372r43L13N35p28L124J736q88m959k507
$$ 35358 38768 36477 34888 34907 34463 35731 34359 33416 33729 34264 33536 36660 38396 37508 32549 30042
11591C0042K63J872J69K377K985m82Q5R32L18n60N78O47j157r66k280j05j687
$$ 30042 30305 32177 32346 34723 37708 37226 37311 38243 38561 38001 38579 39226 38069 37103 34823 34718 33031
11574C3031k063Q96J560M20J52N98M686J499K703m1m304k389k023J479N22J426
$$ 33031 30968 31864 33424 33844 33996 34594 39280 40779 43482 43441 39137 36748 34725 36204 36726 38152
11558C8152L914l50l887k341j828K898J315j618j436j529R01K066M59j878J949
$$ 38152 42066 41716 37829 35488 33660 36558 37873 36255 34819 33290 34191 36257 36716 34838 36787
11543C6787j853l422O90L334J047R72K100N06m358n44J406k310n51K432J205j816
$$ 36787 34934 31512 32202 35536 36583 37555 39655 40161 35803 35259 36665 34355 33804 36236 37441 35625
11527C5625m29j844j369J607J651J680K179K035r28p94N88j269j373K119p07j312
$$ 35625 35196 33352 31983 33590 35241 36921 39100 41135 40207 39413 40001 38732 37359 39478 38771 37459
11511C7459j121Po41j29K074K166J693k378l068j681L13J833q24K510j173k40
$$ 37459 36338 36345 35704 35575 37649 39815 41508 39130 36062 34381 34694 36527 35703 38213 37040 36800
11495C6800J211j01k68P25j298q05J794K284p76j378j591P03Q84J578Q46k163
$$ 36800 38011 37910 37642 38367 37069 36264 38058 40342 39566 38188 36597 37300 38184 39762 40608 38445
11479C8445q04p34N82j593j78m85R28K759k21j158j922k59J169K258R10J242J627
$$ 38445 37641 36907 37489 35896 35718 35233 36161 38920 38699 37541 35619 35360 36529 38787 39697 40939 42566
11462D2566j497j576J607k85o26L46N08K96j253k22l93j707j271j225J227J835
$$ 42566 41069 39493 41100 40815 40189 40535 41043 41339 40086 39864 39471 37764 36493 35268 36495 38330
11446C8330j096k707J197J232l150j148K402K793J297o23j267J602J030l196j18
$$ 38330 37234 34527 35724 36956 33806 32658 35060 37853 39150 38527 37260 38862 39892 36696 36578
11431C6578J878J87K822K585J10j864J275L05m79j454L17j354p61O61J601J75
$$ 36578 38456 38643 41465 44050 44160 42296 43571 43876 43397 41943 42260 40906 40145 40806 42407 42582
11415D2582r47P93J195j252q28R92R98J94k409l20n13j583J463M21J579L02k20
$$ 42582 41635 42428 43623 42371 41543 42535 43533 43727 41318 40998 40485 38902 40365 40786 42365 42667 42447
11398D2447j59r0M36J111J26q63j339k536J069P90j387J756J400j775K363K085
$$ 42447 42288 42198 42634 43745 43871 43008 41669 39133 40202 40992 39605 41361 42761 40986 43349 45434
11382D5434j646j429r37n58K752K468R84J38M98j382Q9n87k344p13O61J523J213
$$ 45434 43788 42359 41422 40864 43616 46084 47068 47206 47704 46322 46411 45824 43480 42767 43428 44951 46164
11365D6164k019j536k627m09N839KJ85m09o95J065r24q08P55n32k211M49J532
$$ 46164 44145 42609 39982 39573 45412 45414 45599 45190 44495 45560 44636 43828 44583 44051 41840 42289 43821
11348D3821q31r19k36j970K470J534r56L48j271p01K018R35M85M73K96k11J94
$$ 43821 42990 42071 41835 39865 42335 43869 42913 43261 41990 41289 43307 44242 44727 45200 45496 45285 45479
11331D5479j567K579L386P47j833k940m74K391R93J132j223l839k037k276J140
$$ 45479 43912 46491 49877 50624 48791 45851 45377 47768 48761 49893 48670 44831 42794 40518 41658
11316D1658K467l95R06k141L94K001J2l60N22P7L77LQ83Q55j002q41o20K016k94
$$ 41658 44125 43730 44636 42495 42889 44890 44902 44542 45064 45141 45518 45521 46404 47259 46257 45416 44796 46812 46518
11297D6518R90k034n09J835J534j790o97N37O12o19L15K828k349k110J311l93
$$ 46518 47508 45474 44965 46800 48334 46544 45847 46384 46996 46377 46692 49520 47171 45061 46372 45979
11281D5979K229K481N94J374j584Q0J710J382R04K306K828l46q84J265K022k264
$$ 45979 48208 50689 51283 52657 51073 51153 52863 54245 55149 57455 60283 59937 59053 60318 62340 60076
11265F0076k928j028K204n41k566l41N17M01M10Mj317N18M06P92R1j19R23J739
$$ 60076 57148 56120 58324 57783 55217 54876 55393 55794 56204 56208 54891 55409 55815 56607 56698 56579 57502 59241
11247E9241M8k275j559K462K015J75K905K635J59L73M098M906L771J637K215Q373
$$ 59241 59289 57014 55455 57917 59932 60107 63012 65647 65806 66179 70277 75183 78954 80591 82806 91179
11231I1179P610P609J3001J7780K0979K5444L2879L7155L9136L2305J8368M745
$$ 91179 98789 106398 119399 137179 158158 183602 216481 253636 292772 325077 343445 348190
11219C48190r753k6653l4063l8373l3432k8011j9105j3863q866o448o52j305P63
$$ 348190 338437 311784 277721 239348 205916 177905 158800 144937 136071 129623 128971 127666 128429
11206A28429N813N968R351J8813K1811K4744L2683L7084L6385K9081J6039j306
$$ 128429 134242 140210 149561 168374 190185 214929 247612 284696 321081 350162 366201 364895
11194C64895j5575k6589k7173k4578k3616k0500j6514r442j000K563M530O474
$$ 364895 349320 322731 295558 270980 247364 226864 210350 200908 199908 202471 207001 213475
11182B13475P182L722k69n861j0020j2914r109r065n938J126J1679K3036L0725
$$ 213475 220657 224379 224110 218249 208229 195315 186206 177141 171203 172329 184008 207044 237769
11169B37769K9730J8739l204k5715l4216k6934k0254q470j423L045N465R128J2926
$$ 237769 267499 286238 283034 257319 223103 196169 175915 167445 166022 169067 174532 183660 196586
11156A96586J3953J5011J3029J2489J4390J5356J7833J8749J2259M23j3379k4891
$$ 196586 210539 225550 238579 251068 265458 280814 298647 317396 329655 330078 316699 291808
11144B91808l2671l5458l2485k8458k3131j5814j1754j0700n825m845n058m334
$$ 291808 259137 223679 191194 162736 139605 123791 112037 101337 95512 90667 85609 81275
11132H1275m46j570j202k062m433q50J2j162j14O3J357k537l027j939n10J471
$$ 81275 80829 79259 78057 75995 71562 70712 70724 69562 69448 69511 70868 68331 65304 63365 62855 64326
11116F4326j2K01j542k183r83j700j994K09j154J63j19K89J647N71j175K221K697
$$ 64326 64314 64515 62973 60790 59807 58107 56113 56322 55168 55331 55212 55501 57148 57719 56544 58765 61462
11099F1462q79K135J187O12j720j650J512K2l164L31J897O290M604Q19K32J367
$$ 61462 60583 62718 63905 64517 62797 61147 62659 62681 59517 59848 61745 68035 72639 73458 73690 75057
11083G5057K801K972L105l403k527j454j086j317l25q76k519j790J392j096j477
$$ 75057 77858 80830 83935 80532 78005 76551 75465 74148 73823 72947 70428 68638 70030 68934 67457
11068F7457N00M78L663L090l41J949K820J933J860J452k609j068P61J536J363
$$ 67457 67957 68435 72098 75188 74847 76796 79616 81549 83409 84861 82252 81184 81945 83481 84844
11053H4844k278M79K695L844J676O99P88J002M907J997M397L291L258M690P20
$$ 84844 82566 83045 85740 89584 91260 91959 92747 93749 98656 100653 105050 108341 111599 116289 117009
11038A17009o51m233o017j573J41l587l373k01k002k158N91L586K3J580K281J867
$$ 117009 116358 112125 106108 104535 104676 101089 97716 97515 95513 93355 93946 97532 97555 99135 101416 103283
11022A03283J215K440P51k61K280M358O498O100P250M878m78l641m056k768o75
$$ 103283 104498 106938 107689 107428 109708 114066 120564 126664 133914 138792 138314 134673 130617 127849 127174
11007A27174j194r00N54K457J555k421j432K431J03j080k167k565n691l241R72
$$ 127174 125980 125080 125634 128091 129646 127225 125793 128224 128327 127247 125080 122515 116824 113583 114555
10992A14555Q76j141M741K966L567N288K304N53p6L61n47j210q6Q31J99k206k258
$$ 114555 115431 114290 119031 121997 125564 130852 133156 133709 133633 133994 133447 132237 132151 132982 133181 130975 128717
10975A28717L63n83K032R77K05K373L725J302J393J359J410k56j49j962J708O96
$$ 128717 129080 128497 130529 131506 131711 134084 137809 139111 140504 141863 143273 143017 142868 140906 142614 143310
10959A43310k89k52k115j176J078k917m259j531J183j770l459R77Q34P72k39j628
$$ 143310 143021 142769 140654 139478 140556 137639 133380 131849 133032 131262 127803 128780 129614 130386 130147 128519
10943A28519K554N68n80J791K871L747M484L502K839P02j91l953j479P00k376
$$ 128519 131073 131641 131061 132852 135723 139470 143954 147456 150295 150997 150806 146853 145374 146074 143698
10928A43698N90J769J010j656j182j465j101j289M02J644q43k423l997q92M422
$$ 143698 144288 146057 147067 145411 144229 142764 141663 140374 140776 142420 141577 139154 135157 134265 138687
10913A38687Q472J1425P010P750P960P208N638j82j14k932j711k013n492k891
$$ 138687 147159 158584 165594 173344 181304 188512 194150 193968 193854 190922 189211 187198 181706 178815
10899A78815k152j922L6J113L545L403J115K109J950J852M335O980O070R581J2153
$$ 178815 176663 174741 174777 175890 179435 182838 183953 186062 188012 189864 194199 201179 207249 216830 228983
10884B28983N864K564K044K939j21Q60P18j978L487N186J601J724M904O719O978
$$ 228983 234847 237411 239455 242394 242273 243133 243851 241873 245360 250546 252147 253871 258775 265494 272472
10869B72472N437N756Q324J0210J1614J1423J2153J0801J0252J1213J4109J6064
$$ 272472 277909 283665 291989 302199 313813 325236 337389 348190 358442 369655 383764 399828
10857C99828J7511J6940K5092L3445L8898M0794L4842K3518J1984J0391J6329
$$ 399828 417339 434279 459371 492816 531714 572508 607350 630868 642852 653243 669572
10846F69572K1513K4175L1969M8194O5442R4567J24239J55508J87456K03632J89441
$$ 669572 691085 715260 747229 795423 860865 955432 1079671 1235179 1422635 1626267 1815708
10835A815708J35816O7794K6299Q128r426m0875q6893j33219j54327j47585j15401
$$ 1815708 1951524 2019318 2045617 2053745 2044319 2003444 1916551 1783332 1629005 1481420 1366019
10824A366019p4029k8932Q736K4635L1975L4225L8382M9772O9843Q8982J07426
$$ 1366019 1291990 1263058 1271794 1296429 1328404 1362629 1401011 1450783 1520626 1609608 1717034
10813A717034J19439J38706J65620J97980K30108K60499K93946L20258L28124
$$ 1717034 1836473 1975179 2140799 2338779 2568887 2829386 3123332 3443590 3771714
10804C771714L25206L21214L38942M02459N23900P02288R17394J178117J479408
$$ 3771714 4096920 4418134 4757076 5159535 5683435 6385723 7303117 8481234 9960642
10795I960642J835023K301744K971021L988255N563703P627063R065848Q120121
$$ 9960642 11795665 14097409 17068430 21056685 26620388 34247451 43313299 51433420
10787E1433420M670619M99591k715160m800820o114311o657976o313464n295369
$$ 51433420 56104039 56603630 53888470 49087650 42973339 36315363 30001899 24706530
10779B4706530m040451k923847k074323j396498q09825k89129J74206O48125J219245
$$ 24706530 20666079 17742232 15667909 14271411 13461586 13172457 13346663 13994788 15214033
10770A5214033J965924K881688L824634M610510N144012N531139O065611O634707
$$ 15214033 17179957 20061645 23886279 28496789 33640801 39171940 45237551 51872258
10762E1872258O192760L553713q60641n204167p662423p756420o262045m261511
$$ 51872258 58065018 61618731 60758090 55553923 47891500 40135080 33873035 29611524
10754B9611524k468098j070044R9849J054115J586678J564967J120001N27352
$$ 29611524 27143426 26073382 26173231 27227346 28814024 30378991 31498992 32026344
10746C2026344k34589j013079j578260j703459j508431j213918q42616k49739
$$ 32026344 31791755 30778676 29200416 27496957 25988526 24774608 23931992 23682253
10738B3682253O77069J882568L010654L379817K668885J139634p74413k590391
$$ 23682253 24359322 26241890 29252544 32632361 35301246 36440880 35666467 33076076
10730C3076076l764094l979499l314469k109430o95370O92182J866865K706799
$$ 33076076 29311982 25332483 22018014 19908584 19213214 19905396 21772261 24479060
10722B4479060L170967L228887K940234K612168K575979K974675L670659L850718
$$ 24479060 27650027 30878914 33819148 36431316 39007295 41981970 45652629 49503347
10714D9503347K422234m16393l362494n377539o347046o406180n793062m829209
$$ 49503347 51925581 51509188 48146694 42769155 36422109 30015929 24222867 19393658
10706A9393658l825314k976293k281805j716008j275015r57881p50506o19151
$$ 19393658 15568344 12592051 10310246 8594238 7319223 6361342 5610836 4991685
10698D991685n34251m80440m37931l88689l35532k85917k42443k08572j75799
$$ 4991685 4457434 3976994 3539063 3150374 2814842 2528925 2286482 2077910 1902111
10689A902111j54157j34007j15447r4196p9529o8222n3934l9776k4509l673K0181
$$ 1902111 1747954 1613947 1498500 1404304 1324775 1256553 1202619 1162843 1138334 1134661 1154842
10678A154842L0722J5917p371k7055m1217n1370n6441n3922m9760n4496n5794
$$ 1154842 1185564 1201481 1194110 1167055 1125838 1074468 1018027 964105 914345 859849 804055
10667H04055m8741l8500k7848j0773L752J1607J7768J9925K6145K8868M0195N1601
$$ 804055 755314 716814 688966 678193 681945 693552 711320 731245 757390 786258 826453 878054
10655H78054P1545R9050J29342J74822K15103K39073K61370K97105K97512J71734
$$ 878054 949599 1048649 1177991 1352813 1567916 1806989 2068359 2365464 2662976 2834710
10645B834710r0969l32304m34839l95213k93319k05340j42752r0528n0955k1149
$$ 2834710 2743741 2411437 1976598 1581385 1288066 1082726 939974 849446 798491 777342
10635G77342K503K1398L8319N7283Q8208J28594J44344J22590Q3210L9675L6o2015
$$ 777342 779845 801243 839562 896845 985053 1113647 1257991 1380581 1463791 1503466 1503502 1441487
10623A441487j28374j75329j86392j63024j28428r9287p6475n6319m1645l0508
$$ 1441487 1313113 1137784 951392 788368 659940 560653 484178 427859 386214 355706
10613C55706k3492k0001j6385j1093o943p727o817p823m571m107p115r483q936
$$ 355706 332214 312213 295828 284735 277792 270065 263248 255425 250854 246747 239632 230149 221213
10600B21213o234o580p481m554m244n254p320n282p7k163m21K410M848O423K710
$$ 221213 214979 208399 200918 196364 192120 186866 179546 174264 174187 172024 171603 174013 178861 185284 187994
10585A87994m37J602l141l568j189K25j716k833k068l340n207n527o446n398n475
$$ 187994 187557 189159 186018 182450 181261 181486 179770 176937 174869 171529 166322 160795 154349 148951 143476
10570A43476l745l527m209r04j344j93J185K874j92j964j692j921o49j210k298
$$ 143476 139731 136204 131995 131091 129747 129554 130739 133613 133421 131457 129765 127844 127195 125985 123687
10555A23687J365k84o190k295j204k598j38P0k35o26q97l328k657N5r34j275L253
$$ 123687 125052 124768 118578 116283 115079 112481 112343 112413 112178 111552 110655 107327 104670 104725 103791 102516 105769
10538A05769L065K128J418L285J930Q2m23K588K693j90K70J949L891K165R69j027
$$ 105769 108834 110962 112380 115665 117595 117677 117254 119842 122535 122345 122615 124564 128455 130620 131589 130562
10522A30562K041K171n67Q4L96k5l437k574j573k329J958Q17L75K079N539M200
$$ 130562 132603 134774 134207 134291 134687 134662 131225 128651 127078 124749 126707 127524 127899 129978 135517 139717
10506A39717O113M455J075K912L254R00n39J83R19O55m18N18j928m283l362l422
$$ 139717 145830 150285 151360 154272 157526 158426 157887 158070 158989 159644 159226 159744 157816 153533 150171 146749
10490A46749k752k55j064o97l09M160J814K931M255L940P42N532L723j020L71
$$ 146749 143997 143742 142678 141981 141672 145832 147646 150577 154832 158772 159514 165046 168769 167749 168120
10475A68120L838K138P1O87l332k384K533J167k905l866m973o725l389l815j761
$$ 168120 171958 174096 174167 174854 171522 169138 171671 172838 169933 166067 161094 154369 150980 147165 145404
10460A45404K452K109M085L912M650K766j01L07J261M604O140N832O796P476R353
$$ 145404 147856 149965 154050 157962 162612 165378 165277 165584 166845 171449 177589 183421 190217 197693 207046
10445B07046Q786Q350M384N029N047N405N589J469L896M393O288O242R920J3986
$$ 207046 215832 224182 228566 233595 238642 244047 249636 251105 255001 259394 265682 271924 281844 295830
10431B95830K0631K8322L7621M4738N1940N8880O9062Q5161J13095J48701K02258
$$ 295830 316461 344783 382404 427142 479082 537962 607024 692185 805280 953981 1156239
10420A156239K80595L83470M85631N28009M40994K12764q2911l38533m73602m72482
$$ 1156239 1436834 1820304 2305935 2833944 3274938 3487702 3404791 3066258 2592656 2120174
10410B120174l79700k57521j49892o5999n690M1401Q2603J20171J70229K42170
$$ 2120174 1740474 1482953 1333061 1267062 1261372 1302773 1385376 1505547 1675776 1917946
10400A917946L40785M89389P01372R43749J118828J074849P31498J41118m99037
$$ 1917946 2258731 2748120 3449492 4393241 5512069 6586918 7318416 7459534 6960497
10391F960497r74822j157622j071153q36382n83984l80458k37083j37939p1971
$$ 6960497 5985675 4828053 3756900 2920518 2336534 1956076 1718993 1581054 1509083
10382A509083k7101J2810N5818J09503J92122L12504M59674O05278O66360N57641
$$ 1509083 1481982 1494792 1550610 1660113 1852235 2164739 2624413 3229691 3896051 4453692
10372D453692K60543j39980m95725o86086o87134n64308m07051k70050j65843
$$ 4453692 4714235 4574255 4078530 3392444 2705310 2141002 1733951 1463901 1298058
10363A298058r7388m7541j1028J7051M2629O7261R5890J32901J81874K46917L39618
$$ 1298058 1200670 1153129 1142101 1159152 1201781 1269042 1364932 1497833 1679707 1926624 2266242
10352B266242M65116O41977Q61345J064876J121025R14250M44785j55995o91044
$$ 2266242 2731358 3373335 4234680 5299556 6420581 7334831 7779616 7623621 6932577
10343F932577r97483j024291q54737o12102l83032j98567n5712O1768J65629K67375
$$ 6932577 5935094 4910803 4056066 3443964 3060932 2862365 2806653 2868421 3034050 3301425
10333C301425L85963N42139P68241J118490J619061K206399K639344K568793J758221
$$ 3301425 3687388 4229527 4997768 6116258 7735319 9941718 12581062 15149855 16908076
10324A6908076L30831j221289k340978k732279k489225j920537j325366q49071
$$ 16908076 17238907 16017618 13676640 10944361 8455136 6534599 5209233 4360162
10316D360162n18688k99541j53013l3786P8211J95030L30072M96262O98486R20140
$$ 4360162 3841474 3541933 3388920 3355134 3433345 3628375 3958447 4454709 5153195 6073335
10306F073335J083658J077629Q15583L29806k60526p97322j154216j270616j170180
$$ 6073335 7156993 8234622 9050205 9380011 9119485 8322163 7167947 5897331 4727151
10297D727151r49526p07772m97430l43523k37215j67967j28585r9523p2292m2072
$$ 4727151 3777625 3069853 2572423 2228900 1991685 1823718 1695133 1595610 1523318 1481246
10287A481246j0442K4529O6336J28037K17540L48085N13464O71528P43299O32202
$$ 1481246 1470804 1495333 1561669 1689706 1907246 2255331 2768795 3440323 4183622 4815824
10277D815824L18308j09151m85609o86661o87653n57514l88578k41002j23174
$$ 4815824 5134132 5024981 4539372 3852711 3165058 2607544 2218966 1977964 1854790
10268A854790l2291L5608R3974J50578K20831L11784M47389O54872R56111J305335
$$ 1854790 1822499 1858107 1952081 2102659 2323490 2635274 3082663 3737535 4693646 5998981
10258E998981J561678J511004J013577J51744p75958j433993j649853j487513
$$ 5998981 7560659 9071663 10085240 10236984 9461026 8027033 6377180 4889667
10250D889667j140071p85487m96542k94030j61606p3347j2400M1768R6802J70018
$$ 4889667 3749596 2964109 2467567 2173537 2011931 1938584 1926184 1967952 2064754 2234772
10240B234772K72953M23264O23834Q25552R04086P40933L11322k60036p51037
$$ 2234772 2507725 2930989 3554823 4380375 5284461 6025394 6336716 6076680 5325643
10231E325643j002966r92151q13764n96331m09271k74472j87420j33962r9718
$$ 5325643 4322677 3330526 2516762 1920431 1511160 1236688 1049268 915306 815588
10222H15588q0502o6941o0215n4619n1454m6760l9260l0213k2325j9843j4713
$$ 815588 735086 668145 607930 553311 501857 455097 415837 385624 363299 343456 328743
10211C28743j0062o845o928r926r712q921r593j3643j5298j4961j0235m127J091
$$ 328743 318681 311836 304908 294982 285270 276349 266756 253113 237815 222854 212619 208492 209583
10198B09583N52L290M352j5K152j40J15L728M211J497L341K485K411L853L489
$$ 209583 210135 213425 217777 217762 219914 219774 219889 223617 227828 229325 232666 235151 237562 241415 244904
10183B44904n09m449o082m624l533j398K465j458L81J145K251K938L342J484L588
$$ 244904 244395 239946 233864 229240 225707 224309 226774 225316 225697 226842 229093 232031 235373 236857 240445
10168B40445M624L319J438O499N598J531K808M330J201K314J58K102K947K524
$$ 240445 245069 248388 249826 256325 261923 263454 266262 270592 271793 274107 274265 276367 279314 281838
10154B81838R39M845L094L630N338N876O026Q085R656R020J2106J3512J5473J5433
$$ 281838 282777 287622 290716 294346 299684 305560 311586 319671 329327 338347 350453 363965 379438 394871
10140C94871J9870K1458K3340K4632L0843L6428M0354M9960O1366P9971J04032
$$ 394871 414741 436199 459539 484171 515014 551442 591796 641756 703122 783093 887125
10129H87125J29860J48790J56808J67235K03704K56028L34385M55420O28196Q55085
$$ 887125 1016985 1165775 1322583 1489818 1693522 1949550 2283935 2739355 3367551 4222636
10119D222636J013505Q71104M19371m7489k88891k46864m8495Q8509K061k44093
$$ 4222636 5236141 6107245 6526616 6479127 6190236 5943372 5894877 5983386 5985447 5741354
10109E741354m61749n31681m22661k29949m1446J29914L10128M87740O59593Q96228
$$ 5741354 5279605 4747924 4325263 4095314 4053868 4183782 4493910 4981650 5641243 6537471
10099F537471J234304J607673J748486J335784N88619P062j23261J59934M99335
$$ 6537471 7771775 9379448 11127934 12463718 13052337 13059399 12936138 13096072 13595407
10090A3595407M91865L8915n17596r32655j115299j084839r62713q27470o98765
$$ 13595407 14087272 14126187 13608591 12675936 11560637 10475798 9513085 8685615 7986850
10081G986850n91889m66624k36170R7356M33067O84515P79493P11707N88615N61484
$$ 7986850 7394961 6928337 6692167 6789523 7222590 7907105 8686598 9398305 9986920 10548404
10071A0548404P08804Q67022P34932L39555j9342j79786l33748o02671q62059
$$ 10548404 11257208 12124230 12859162 13198717 13179375 12999589 12665841 12063170 11201111
10062A1201111r92596j056700j130588j170174j088166q77779o09671l55037j47637
$$ 11201111 10208515 9151815 8021227 6851053 5762887 4885108 4275437 3920400 3772763
10053C772763Q437J10590J90344K66693L41520L84813L14384J53191N9612J30999
$$ 3772763 3781200 3891790 4082134 4348827 4690347 5075160 5389544 5542735 5602347 5733346
10043E733346K06507J59290M6944j03623j98028j20686J13935M08798N76878N82581
$$ 5733346 5939853 6099143 6146087 6042464 5844436 5723750 5837685 6246483 6823361 7405942
10033G405942N88704N88539M60676J61936p2220j75007k90516m34973n81902o52157
$$ 7405942 7994646 8583185 9043861 9205797 9133577 8958570 8668054 8233081 7651179 6999022
10023F999022o23871n44994m07114k17451J71K23505M61181P20556J039286J421737
$$ 6999022 6375151 5830157 5423043 5205592 5205763 5429268 5890449 6611005 7650291 9072028
10013I072028J808188K160954K199150J820133J242147P71576N78717O07362P46840
$$ 9072028 10880216 13041170 15240320 17060453 18302600 19074176 19652893 20260255 21007095
10004B1007095N35713m18540j585451k308343k438561k211727j844060j388598
$$ 21007095 21542808 21124268 19538817 17230474 14791913 12580186 10736126 9347528
9996I347528r32137n52207k25168J17743N44825J025964J312518J324865J308353
$$ 9347528 8415391 7863184 7638016 7755759 8300584 9326548 10639066 11963931 13272284
9987A3272284J362343J389412J304381J217206R11268J88412n35731r40005j096116
$$ 13272284 14634627 16024039 17328420 18545626 19456894 19645306 19109575 18169570 17073454
9978A7073454j316644j649355j935624j945814j701021j369601j055503p87037
$$ 17073454 15756810 14107455 12171831 10226017 8524996 7155395 6099892 5312855
9970E312855n42347l00178q1942J13214K89497M04560M11997L21124J77223K9753
$$ 5312855 4770508 4470330 4388388 4501602 4791099 5195659 5607656 5928780 6106003 6135756
9960F135756L228J12868K15913J43646j32657n29896q39785r09066p82340o10616
$$ 6135756 6138984 6251852 6467765 6611411 6478754 5948858 5109073 4200007 3417667 2807051
9950B807051m73170l70529k77780k00681j56155j39603j31607j16888r7179q0038
$$ 2807051 2333881 1963352 1685572 1484891 1328736 1189133 1057526 940638 843459 763421
9940G63421o5448n5649m6120m1483l5488l3345k7106k2016j7907j4465j5035j9423
$$ 763421 697973 642324 596204 554721 519233 485888 458782 436766 418859 404394 389359 369936
9928C69936k1300j9438j3223p629l969j95M545J0549J5275J4526N076j0992j9064
$$ 369936 348636 329198 315975 308346 304377 304182 308727 319276 334551 349077 354153 343161 324097
9915C24097k3163k5251k0292j7158j1340p518m097j912k077J83M621O732Q340
$$ 324097 300934 275683 255391 238233 226893 219375 215278 213366 211289 211472 216093 222825 231165
9902B31165J1927J4974Q407J898k818q838j3127j3391j3217j3116j0314m474j455
$$ 231165 243092 258066 266473 268371 265553 256715 243588 230197 216980 203864 193550 189076 187621
9889A87621j780j196l201n084n727n127m28j589M2m60l02K26N96l011m632J687
$$ 187621 185841 184645 181444 176360 170633 165506 165078 163489 163531 163071 162769 162995 163591 160580 155948 157635
9873A57635J411m84l184m442m131l415j619Q86N63J493N36j321m597l758k035
$$ 157635 159046 158562 155378 150936 146805 143390 141771 142657 143220 144713 145249 143928 139331 135573 133538
9858A33538J209Q510J1703J4233J0634Q504M329k923j0005j4998j4208j5568j2133
$$ 133538 134747 143257 154960 169193 179827 188331 192660 189737 179732 164734 150526 134958 122825
9845A22825p216l966k926P24K711N496O789K679k154k116j866k518P7J738M570
$$ 122825 115609 111643 108717 109441 112152 117648 124437 127116 124962 122846 120980 118462 118539 120277 124847
9830A24847J610j947n015o941m897R07K38R4J82J706j4r92l467k722n43j430k737
$$ 124847 126457 124510 119495 112554 107657 108564 108802 108896 109078 110784 110770 109778 106311 103589 103046 101616 98879
9813I8879p23l617m581m021l597k898q02j689j41J188j240j324j064N41j753l228
$$ 98879 98156 94539 89958 85937 82340 79442 78640 76951 76810 77998 76758 75434 74370 74911 73158 69930
9797F9930j379j027J930L692p6k264l74K870K291K66j911o20K208L268K336J60
$$ 69930 68551 67524 69454 73146 73070 70806 70432 73302 75593 75859 73948 73328 75536 78804 81140 81300
9781H1300K305L833J413K860P510R338J2884J7361J0944Q3j5012j5222j3103r504
$$ 81300 83605 87438 88851 91711 99221 108559 121443 138804 149748 149831 134819 119597 106494 96990
9767I6990q229n984m478M4J894RJ205K36P09Q04k396k452k44K64L866J500l222
$$ 96990 88761 82777 78299 78343 80237 80246 81451 81687 82396 83200 80804 78352 78108 78372 82238 83738 80516
9750H0516o31P37j542J43L94j278P82R19o89Q2m74j281J339N58K001J80K598j034
$$ 80516 79885 80622 79080 79223 79617 78339 79121 80040 79351 79433 78959 77678 79017 79575 81576 81756 84354 83320
9732H3320K64L693J576L691K199L64j885k871q72R99R11j170j374m74M36N26l95
$$ 83320 83584 87277 88853 92544 94743 95107 93222 90351 89479 90478 91389 90219 88845 88371 88807 89333 88938
9715H8938J733J484K32L020N932P851K326L435K949P28j05K891J774P34K95K287
$$ 88938 90671 92155 92387 95407 101339 109190 111516 114951 117900 118628 118523 121414 123188 123922 124217 126504
9699A26504J793j212j473k644j545j750O86L837N826L315L576N321Q441O690N771
$$ 126504 128297 127085 125612 122968 121423 119673 120359 124196 130022 133337 136913 142234 150675 157365 163136
9684A63136P311P473N950L750L646M970Q077L555k045k230k501k757j825J21k825
$$ 163136 170447 177920 183870 187620 191266 196236 204313 207868 205823 203593 201092 198335 196510 196631 193806
9669A93806J678K268N534J1023J5194J2592J7267K4672K6790K8770L4517M1215
$$ 193806 195484 197752 203286 214309 229503 242095 259362 284034 310824 339594 374111 415326
9657D15326N6462P2116P4923N9339L8475L0501M2099N4927M5886K3495p019l6919
$$ 415326 471788 543904 618827 678166 716641 747142 789241 844168 890054 913549 906530 869611
9645H69611n6311o3906p0649p0399n9852m9840l5971k5669j6385q012k060J791
$$ 869611 813300 749394 678745 608346 548494 498654 462683 437014 420629 412617 410557 412348
9633D12348O963J3223J5136J7862J9605J7922J8290J8191K8013L5349M3175N6743
$$ 412348 419311 432534 447670 465532 485137 503059 521349 539540 567553 602902 646077 702820
9621G02820P5522R1669J11127J37973J75669K29023K97735L97545N27607O61141
$$ 702820 778342 870011 981138 1119111 1294780 1523803 1821538 2219083 2746690 3407831
9611C407831P85498R15271J021564J017254R44388Q67015O46567J55677n00018
$$ 3407831 4193329 5108600 6130164 7147418 8091806 8958821 9605388 9761065 9261047
9602I261047j023347j264015j308084j186237r54107o86541m61400l10480k16723
$$ 9261047 8237700 6973685 5665601 4479364 3525257 2838716 2377316 2066836 1850113
9593A850113j54911j04509o1220l0417k1277k1270k2702p680J9959N2794P7780
$$ 1850113 1695202 1590693 1529473 1499056 1477779 1456509 1433807 1426127 1446086 1498880 1576660
9582A576660Q1718P0986N7707O2130P3187Q9650R3857R1138R8444J34776K04344
$$ 1576660 1658378 1729364 1787071 1849201 1922388 2012038 2105895 2197033 2295477 2430253 2634597
9571B634597K94849L98221N20800O80345R00804J170358J438602J622936J621685
$$ 2634597 2929446 3327667 3848467 4528812 5429616 6599974 8038576 9661512 11283197
9562A1283197J357462R12918O04516M11085p2447p32197j156759j266027j266375
$$ 11283197 12640659 13553577 14158093 14569178 14496731 13764534 12607775 11341748 10075373
9553A0075373j249660j192241j114932j009514q26090n74226l16650r3920R4824
$$ 10075373 8825713 7633472 6518540 5509026 4682936 4108710 3792060 3698140 3792964
9544C792964K67617M14351N19322O27622P33497P68667P61868P70863O84078L24522
$$ 3792964 4060581 4474932 4994254 5621876 6355373 7124040 7885908 8656771 9340849 9665371
9534I665371k73567q44857j167990j152672q91140n40946k19535M6229L03433
$$ 9665371 9391804 8546947 7378957 6226285 5335145 4794199 4574664 4620893 4924326
9525D924326N55627P57964R04948J036357J081240R52693P09618M35448J92237
$$ 4924326 5479953 6237917 7142865 8179222 9260462 10213155 10922773 11358221 11550458
9516A1550458Q0348R1453P4164r7206m32768q63412j172278j184825j024686q88523
$$ 11550458 11630806 11722259 11796423 11699217 11266449 10403037 9230759 8045934 7021248 6132725
9506F132725p74979o11951l93013j77512k792J56833L26236N14124O87486Q25869
$$ 6132725 5357746 4745795 4352782 4175270 4172478 4329311 4655547 5169671 5857157 6683026
9496F683026R62533J149276J326770J414923J262217P10072L1335m35608n81030
$$ 6683026 7645559 8794835 10121605 11536528 12798745 13508817 13540152 13104544 12523514
9487A2523514m78626l97287m57016n55762n53435m63471l22030j41891l3054j10571
$$ 12523514 12044888 11647601 11190585 10634823 10081388 9617917 9295887 9153996 9120942 9010371
9477I010371k69759l38390k64643j16547p392o68l8080r0710j72118k64188k99948
$$ 9010371 8740612 8402222 8137579 8021032 8013640 8012972 7974892 7884182 7712064 7447876 7147928
9466G147928k98093l66287m69501m61452l42927k71927k64660k48364j28316R9753
$$ 7147928 6849835 6483548 6014047 5552595 5209668 4937741 4673081 4424717 4296401 4396154
9456D396154L93695O95397R05079J006986R54878P24926M55677J72866n9925r4519
$$ 4396154 4789849 5485246 6390325 7397311 8352189 9077115 9532792 9705658 9645733 9551214
9446I551214J0350R4853O6916j25780n32267r37843j083149j019067q82822o98352
$$ 9551214 9561564 9656417 9723333 9597553 9065286 8127443 7044294 6025227 5142405 4444053
9436D444053m67409k10618K9963K57573M55901N83449O44657O52493N51530K84336
$$ 4444053 3976644 3766026 3795989 4053562 4509463 5092912 5737569 6390062 6941592 7225928
9426G225928j16275m70866o92979p92688p39733n59257l46161j86830o5044O8532
$$ 7225928 7109653 6638787 5945808 5153120 4413387 3854130 3507969 3321139 3256095 3324627
9416C324627K26556L75551M45689M15633L43619L21616L60182L56594J87554r3609
$$ 3324627 3551183 3926734 4372423 4788056 5131675 5453291 5813473 6170067 6357621 6264012
9406F264012l05984l25326j77705L0764J83390J93201N6666j52988l07912m10979
$$ 6264012 5958028 5632702 5454997 5485761 5669151 5862352 5919018 5766030 5458118 5047139
9396E047139m43114m04484l57032l41289l83294m26316m15035l70601l03923k21216
$$ 5047139 4604025 4199541 3842509 3501220 3117926 2691610 2276575 1905974 1602051 1380835
9386A380835j41228p5030k8321m304o014k5979l8412m3580m8654m9667m6472m1530
$$ 1380835 1239607 1164577 1136256 1131952 1125938 1099959 1061547 1017967 969313 919646 873174 831644
9374H31644l1031j9914m103J4274M0111P0242J05789J42727J93122K71810L91822
$$ 831644 800613 780699 776596 790870 830981 901223 1007012 1149739 1342861 1614671 2006493
9363B006493N56763O97687P37585O85930N25188K40645j12396m31257o78310p95564
$$ 2006493 2563256 3260943 3998528 4684458 5209646 5450291 5337895 4906638 4228328 3432764
9353C432764p41304n68915l93057k97018k55282k19784j72247j25990r2532o4670
$$ 3432764 2691460 2122545 1729488 1432470 1177188 957404 785157 659167 566635 501965
9343E01965m6574l8869l9337l9266l9067l4759k9209k2636j7336j5051j2460r632
$$ 501965 455391 416522 377185 337919 298852 264093 234884 212248 194912 179861 167401 157769
9331A57769r370r020o921p703l254j466k364q83K159K779N757J1277J6634K0327
$$ 157769 148399 139379 132458 124755 121501 120035 117671 116788 118947 121726 127483 138760 155394 175721
9317A75721K5634L1516L1252K6788K2257J6264M480q352k1937k7200l0651k6440
$$ 175721 201355 232871 264123 290911 313168 329432 333912 325560 303623 276423 245772 219332
9305B19332j9223j9400k1899k0039k1495j9380j6458j2655r061p649n413j715
$$ 219332 200109 180709 158810 138771 117276 97896 81438 68783 59722 52073 46660 44945
9293D4945k808m493n357N21j086j416n72l53k338k380L6o41j780j079%k163m16
$$ 44945 42137 37644 32287 32808 31722 30306 29734 29381 27043 24663 24699 24058 22278 21199 21199 19036 18620
9276A8620k20J476p89j038q7j100n47O62L115l75J98J05K329k241k675k563k191
$$ 18620 18400 19876 19087 18049 17962 16862 16315 16977 20092 19717 19915 20020 22349 20108 17433 14870 12679
9259A2679q22M12J360j269k254o93j800k82L69j804l19K41j203K269L440K607
$$ 12679 11857 12269 13629 12360 10106 9413 7613 7331 7700 5896 5577 5818 4615 6884 10324 12931
9243A2931j581p81j148j550k28j037j849j732J942J670M628J098K4J293l40l651
$$ 12931 11350 10569 9421 7871 7643 6606 4757 3025 4967 6637 11265 12363 12387 13680 13340 9689
9227I689k697r94R14K362o60k32k83j178M10K526L10q67j722j032q85q94j185
$$ 9689 6992 5998 6912 9274 8614 8382 8099 6921 7331 9857 10167 9300 7578 6546 5661 4767 3582
9210C582m90J666K989l0j271j845K113J771R00K61jQ66J635Q40J964K614L250
$$ 3582 3092 4758 7747 7717 6446 4601 6714 8485 9385 9646 9645 10511 12146 12986 14950 17564 20814
9193B0814Q08N486Q349R381O109L786j737q479p835n473o230n465l93j75k883
$$ 20814 21622 27108 35457 44838 50947 54733 52996 44517 36682 31209 24979 19514 19121 18946 16063
9178A6063p74p06r85p02j937j442K954J77j523j896j172q13J037N45n32l94J203
$$ 16063 15289 14583 13598 12896 10959 9517 12471 12648 11125 9229 8057 7244 8281 8826 8294 7900 9103
9161I103J039R88J234o01j73J838q21K271O054L522K354J457L670P404P980J0006
$$ 9103 10142 11130 12364 11763 11590 13428 12607 14878 20932 24454 26808 28265 31935 39339 47319 57325
9145E7325R437P496L538J998l30k798m086q943r455o497n338p868m799p01m60
$$ 57325 66762 74258 77796 79794 79464 76666 72580 63637 54182 47685 42347 34479 29680 28979 28519
9130B8519j597k225k441J265L590K546L447K876O460Q564N777L675k245n573q147
$$ 28519 26922 24697 22256 23521 27111 29657 33104 35980 42440 51004 56781 60456 58211 52638 44491
9115D4491q993m030l325j826j96J086K784N623K838M240O906P485L807L799O33
$$ 44491 35498 31468 28143 26317 26121 27207 29991 35614 38452 42692 49598 57083 60890 64689 65322
9100F5322m229j33K057M183L131n89o265o490o022p859p051l878m242k086L31
$$ 65322 61093 60960 63017 67200 70331 69742 63477 56987 50965 43106 36055 32177 27935 25849 26180
9085B6180J651K000R2J117O95M471M315N348P792P684P227L584n53k233j088l59
$$ 26180 27831 29831 29923 31040 31735 36206 40521 45869 53661 61345 68572 72156 71603 69370 68282 67923
9069F7923j62K50l440m273l441O42R56O21k287l063l021m242o217m536k528L32
$$ 67923 67761 68011 64571 60298 56857 57499 58455 59076 56789 53726 50705 46463 40246 35710 33182 33514
9053C3514L635N361K601Q21j933n560m892p92j659m005k971Kp50j310N43N460
$$ 33514 37149 42510 45111 45932 43999 38439 33547 32755 31096 27091 24120 24122 23372 22062 22605 28065
9037B8065O841M806P728L509J904J296o36j297p65P45M322M102j807q282q961
$$ 28065 34906 39712 47440 50949 52853 54149 53513 52216 51451 52196 56518 60620 58813 50531 41570
9022D1570p039n871k461k058j774r08M24K590J699L082N275N694K535M93j668
$$ 41570 34531 28660 26199 24141 22367 21459 21883 24473 26172 29254 34529 40223 42758 43251 41583
9007D1583n670m085n442m611k311J063k79R38R44K472K666L661K143N142K239
$$ 41583 35913 31828 26386 21775 19464 20527 20248 21186 22130 24602 27268 30929 33072 38214 40453
8992D0453m42k776n545l906k572j973Q17K603L678K995N586j04j702l394j609
$$ 40453 40011 37235 31690 27784 25212 23239 24056 26659 30337 33332 38918 38814 37112 33718 32109
8977C2109l208l994k967l827r41l496k367j652l218k878L07J757l3p4p73K80L561
$$ 32109 28901 24907 21940 18113 17172 13676 11309 9657 6439 3561 3868 5625 5592 5518 4745 5025 8586
8960H586O49l101l403O12L528o68l10L65L506J381l34j042o24L154K978L096J890
$$ 8586 9235 6134 2731 3343 6871 6203 5893 6258 9764 11145 10811 9769 9145 12299 15277 18373 20263
8943B0263M696L088M042J461j438m053n896o250l912l328l189l084j799m47o67
$$ 20263 24959 28047 32089 33550 32112 28059 22163 15913 12001 8673 5484 2400 601 154 -513
8928e13K441K301r40j9J020p73qo27Q68j905J862J442r15k26J095q51k181j80
$$ -513 1928 4229 3289 3270 4290 3517 3509 2882 3750 1845 3707 5149 4234 4008 5103 4252 2071 1891
8910A891j905r57J200K58J97n18j829j61J577K30N88J917M018o34k488n48k199
$$ 1891 -14 -971 229 487 684 166 -1663 -1824 -247 -17 571 2488 6506 5872 3384 2836 637
8893F37j311R47Q00j467n87k019N18J861n31J313L946k114m307k31K350l30j113
$$ 637 -674 273 1073 -394 -981 -3000 -2482 -621 -1152 161 4107 1993 -2314 -2545 -195 -525 -1638
8876a638J707L086R68j914q52l07m050K20K546K16j101O26r99j882L24l60J825
$$ -1638 69 3155 4123 2209 1357 1050 -3000 -2780 -234 -18 -1119 -493 -1492 -3374 -3050 -3410 -1585
8859a585R31j947L12J720n52M8k217k022n3J532J076j124k83n56k94J900J350
$$ -1585 -654 -2601 -2289 -569 -1121 -1073 -3290 -5312 -5365 -3833 -2757 -3881 -4164 -4720 -5014 -3114 -1764
8842a764J378J54J72k404P32j062j83j27l083J010K362J505J956J468j400l546
$$ -1764 -386 -232 -60 -2464 -1732 -2794 -2977 -3104 -6187 -5177 -2815 -1310 646 2114 714 -2832
8826b832r4K048K97n14J48j76M9j311j859k80K426kj242n57K038k69o39K453K330
$$ -2832 -2926 -878 -581 -1095 -947 -1123 -1074 -2385 -4244 -4524 -2098 -2100 -3342 -3899 -1861 -2130 -2769 -316 2014
8807B014J241n81k652k245n37O05J288J248J786nL76j226J63q15J859j773k020
$$ 2014 3255 2674 22 -2223 -2760 -2155 -867 381 2167 2162 2538 1312 1475 660 2519 746 -1274
8790a274n37J760L01r74j287R16l70l32O5R52j10p85Q08q08l55l40j269j400K081
$$ -1274 -1811 -51 250 -724 -2011 -1095 -1465 -1797 -1732 -780 -890 -1675 -867 -1675 -2030 -2370 -3639 -5039 -2958
8771b958K38r55j320J501J80j230l05j349J229L970N68l8m03r05j390j424J188
$$ -2958 -2720 -3675 -4995 -3494 -3314 -4544 -4849 -6198 -4969 -999 -431 -469 -872 -1777 -3167 -4591 -3403
8754c403M70K90K08q00k742J60K385n03M79N64j680r67r30k20J518O8R78J610
$$ -3403 -2933 -2643 -2435 -3235 -5977 -5817 -3432 -3935 -3456 -2892 -4572 -5539 -6469 -6689 -5171 -5103 -4125 -2515
8736b515K57k302K34K572J135M05j257j226K061N93j874K35J780J410j582R76
$$ -2515 -2258 -4560 -4326 -1754 -619 -214 -1471 -2697 -636 -43 -1917 -1682 98 1508 -74 902
8720I02J920M56P4J0j47l54m94m32p76j732j221j129J478o2M88n4k226J910P23
$$ 902 2822 3278 3352 3362 3215 2861 2367 1935 1159 -573 -1794 -2923 -1445 -1507 -1019 -1073 -3299 -1389 -666
8701f66q99k72J170k31M36k71k454o95L501K415m66j710j02J408k080P54l83j75
$$ -666 -1565 -1837 -667 -898 -462 -733 -3187 -3882 -381 2034 1568 -142 -244 1164 -916 -162 -545 -720
8683g20J498P65q14M39N57J779j332J93j166L304J423l281k997o90J4j451m66
$$ -720 778 1543 729 1168 1725 3504 2172 2365 1199 4503 5926 2645 -352 -1042 -1028 -2479 -2945
8666b945J655n20j812O1m55k23j634m243K868K509J489j051o04m67j534j948J104
$$ -2945 -1290 -1810 -3622 -3561 -4016 -4239 -5873 -10116 -7248 -4739 -3250 -4301 -4905 -5372 -6906 -8854 -7750
8649g750L301L109j57k79j503j831k04K587J960m37l02Q17j309j544k157N16K77
$$ -7750 -4449 -1340 -1497 -1776 -3279 -5110 -5314 -2727 -767 -1204 -1506 -689 -1998 -3542 -5699 -5183 -4906
8632d906q54K658J295m08K468k00j272n32j949l6J118L12J922n42L61o41Q4R29
$$ -4906 -5760 -3102 -1807 -2215 253 53 -1219 -1751 -3700 -3736 -2618 -2306 -384 -926 -565 -1206 -1122 -193
8614a93o36j406R15N84j589j864J324R18L45M15r6k519Q70J711J563J97O90j723
$$ -193 -829 -2235 -1320 -736 -2325 -4189 -2865 -1947 -1602 -1187 -1283 -3802 -2932 -1221 342 539 1229 -494
8596d94R90j57k346n27J763j442j245j142J302K374R18j737q60L04L822P2k302
$$ -494 496 339 -2007 -2534 -771 -2213 -3458 -4600 -3298 -924 -6 -1743 -2603 -2299 1523 1595 -707
8579g07j267J595K054K131N131O605j619l040k710j834j075k91J769k02j162l710
$$ -707 -1974 -379 1675 3806 8937 15542 13923 10883 8173 6339 5264 4973 6742 6540 5378 1668
8563A668M63J398K36l130n56J340m99n37j690n32q71j208J051N22J410K469j579
$$ 1668 2131 3529 3765 635 79 1419 920 383 -1307 -1839 -2710 -3918 -2867 -2345 -935 1534 -45
8546d5O29J39o70K636K110O87K628J803k394k653N28K689K889J703K572M882O249
$$ -45 584 723 53 2689 4799 5486 8114 9917 7523 4870 5398 8087 10976 12679 15251 20133 26382
8529B6382O417k044m854n053l519p96J227k035m542l747k761K409j15k071j14
$$ 26382 32799 30755 25901 20848 17329 16533 17760 15725 11183 7436 4675 7084 6969 4898 4784
8514D784k681j063l1j30K47o89O58J155k995P10J173o34q66J038L57p55K080m72
$$ 4784 2103 1040 1009 879 1126 437 1095 2250 -745 -35 1138 504 -362 676 1033 278 2358 1886
8496A886j225Q87J065q72k067L69K698K567J044K878N877K776N59p03m433m153
$$ 1886 661 1548 2613 1741 -326 43 2741 5308 6352 9230 15107 17883 18442 17739 13306 9153
8480I153l597k165K225K065m628k452k72j545j08J105K80n65j788q92M05j446
$$ 9153 5556 3391 5616 7681 3053 601 329 -1216 -1324 -219 61 -504 -2292 -3184 -2779 -4225
8464d225NJ551J532k85q73J124L38K402K055l704R59M19j017K88K062J253R1R56
$$ -4225 -4220 -2669 -1137 -1422 -2295 -1171 -833 1569 3624 -80 879 1298 281 569 2631 3884 3975 4931
8446D931j90j262q01J88n50J787K18k542n40L63L65j991j616k146l20J623J62
$$ 4931 4741 3479 2678 2866 2316 4103 4321 1779 1239 1602 1967 -24 -1640 -3786 -4106 -2483 -2321
8429b321l187Q1K940j87j493K054J551l57j029J620P69r40K151L907J06m6m25
$$ -2321 -5508 -5427 -2487 -2674 -4167 -2113 -562 -919 -1948 -328 441 -499 1652 5559 5665 5619 5194
8412E194m184R15K368J49j127j367k303j569j182J58M069K986J277j022k05R16
$$ 5194 1010 1925 4293 4442 3315 1948 -355 -1924 -3106 -2948 1121 4107 5384 4362 4157 5073
8396E073j019l199p86O46o04k697j818j103P77o29J511J151n15P21R21J207J685
$$ 5073 4054 855 69 715 111 -2586 -4404 -5507 -4730 -5359 -3848 -2697 -3212 -2491 -1570 -363 1322
8379A322m11n22K264J443j122l247J80r73K4P03L51j32n17j59j02K432J43j370
$$ 1322 911 389 2653 4096 2974 -273 -93 -1066 -1042 -339 12 -120 -637 -796 -898 1534 1677 307
8361C07l186k66j54J353M71m58N38j886P22J71r91K766Q53j109P15m19j864R70
$$ 307 -2879 -3145 -3299 -1946 -1475 -1933 -1395 -3281 -2559 -2388 -3379 -613 240 -869 -154 -573 -2437 -1467
8343a467M251m72r52m39j80J260R0j788k889N17Kj03K446J407j71L27k476Q28
$$ -1467 2784 2312 1360 921 741 2001 2091 303 -2586 -2069 -2067 -2170 276 1683 1512 1839 -637 191
8325A91J743l93j826J883J424m38n25k983k599K782K244l074K53j93j916P22m87
$$ 191 1934 1541 -285 1598 3022 2584 2059 -924 -3523 -741 1503 -1571 -1318 -1511 -3427 -2705 -3192
8308c192m63J604J50L88J763j325l64j311n58l69k130L61O0k003l46L747K706
$$ -3192 -3655 -2051 -1901 -1513 250 -1075 -1439 -2750 -3308 -3677 -5807 -5446 -5386 -7389 -7735 -3988 -1282
8291a282J02J963r12j529j081r51O27K152L49q38l601J105K682j02l266J905J716
$$ -1282 -1180 783 -129 -1658 -2739 -3690 -3063 -911 -562 -1400 -5001 -3896 -1214 -1316 -4582 -2677 -961
8274i61p02J376j361l028k789J089K131L55J442L491P41n55l276j609J904L62
$$ -961 -1663 -287 -1648 -4676 -7465 -6376 -4245 -3890 -2448 1043 1784 1229 -2047 -3656 -1752 -1390
8258a390m062K36M020q80k3J34K84J690j68l92j289p0J082J918k97j512k245k95
$$ -1390 -5452 -5216 -1196 -2076 -2099 -1965 -1681 9 -159 -551 -1840 -1910 -828 1090 793 -719 -2964 -3259
8240c259J199k84j12K208L02J160J019J429M82l615n41o60k893K485J579j899
$$ -3259 -2060 -2344 -2456 -248 54 1214 2233 3662 4144 529 -12 -672 -3565 -1080 499 -1400
8224a400p23j291M97o6J13J292J89J117j054R1R06J019j090J05J159l000Q58Q90
$$ -1400 -2123 -3414 -2917 -2983 -2870 -1578 -1389 -272 -1326 -1235 -329 690 -400 -295 864 -2136 -1278 -388
8206c88r26j151J475J290j579J644K332M52j952k368l77J873J460m9j254l236
$$ -388 -1314 -2465 -990 300 -1279 365 2697 3149 1197 -1171 -1548 325 1785 1736 482 -2754
8190b754j101J39j410K691K630k3p32M28q24q15k467l17j209N27J85P24J50k74
$$ -2754 -3855 -3716 -5126 -2435 195 172 -560 -132 -956 -1771 -4238 -4555 -5764 -5237 -5052 -4328 -4178 -4452
8172d452J106j401q5K05K515L475R13j21J371n82N64k87n16k277k103j176k9J038
$$ -4452 -3346 -4747 -4832 -4627 -2112 1363 2276 2155 3526 2944 3508 3221 2705 428 -1675 -2851 -2880 -1842
8154a842K30M47n91L26j38j021K834o49r29r11j089P77J775o69k019L66K884J439
$$ -1842 -1612 -1165 -1756 -1430 -1568 -2589 245 -404 -1333 -2244 -3333 -2556 -781 -1450 -3469 -3103 -219 1220
8136A220j987l249p99J70O3M84J759K03J254O85j193n00l93rn18P43J327J779
$$ 1220 -767 -4016 -4815 -4645 -4582 -4098 -2339 -2136 -882 -197 -1390 -1890 -2283 -2292 -2810 -2067 -740 1039
8118A039P75n99k439J736J139L32J264r7o45J361M57k815m19O73j392j593j419
$$ 1039 1814 1215 -1224 512 1651 1983 3247 3150 2505 3866 4323 1508 1089 1762 370 -1223 -2642
8101b642j888k106k33L098m83l66K553K336R58o21j012k08K369l20j943j900L09
$$ -2642 -4530 -6636 -6869 -3771 -4254 -4620 -2067 269 1227 606 -406 -614 1755 1435 -508 -2408 -2099
8084b099J783q25j263r81k52k044O91L356J324M09R01l00L22L1j329m77N86n09
$$ -2099 -316 -1141 -2404 -3385 -3637 -5681 -4990 -1634 -310 99 1000 700 1022 1053 -276 -753 -167 -676
8066f76j888J80K634J282K358Q70J8R57k650l182o19l55j118k65J769K92O07p59
$$ -676 -2564 -2384 250 1532 3890 4760 4778 5735 3085 -97 -716 -1071 -2189 -2454 -685 -393 214 -545
8048e45O62q20J481K917l93j683r16m22J74j209k125k085j18L31K595J068j59
$$ -545 117 -703 778 3695 3302 1619 703 281 455 -754 -2879 -4964 -5082 -4751 -2156 -1088 -1247
8031a247J014J163k475M19k73j67K2j63J269n64k380r77K806R74J187r73k029
$$ -1247 -233 930 -1545 -1126 -1399 -1566 -1544 -1707 -438 -1002 -3382 -4359 -1553 -579 608 -365 -2394
8014b394k936P91o90l16K56O8k08j110n5L500L635J836q57m147j112J27q03L652
$$ -2394 -5330 -4539 -5229 -5545 -5289 -5221 -5429 -6539 -6594 -3094 541 2377 1520 -2627 -3739 -3612 -4415 -763
7996g63Q1o82K163R78o08n11M06k93j623K2m98K227M201j4j190O85l18j863j828
$$ -763 -682 -1364 799 1777 1169 658 1064 771 -852 -830 -1328 899 5100 5086 3896 4581 4263 2400 572
7977E72O42q55P66r77r59L33N96K171j94l009Q24K045l69r85m6j690r98r21J222
$$ 572 1214 359 1125 148 -811 -478 118 2289 2095 -914 -90 1955 1586 601 555 -1135 -2133 -3054 -1832
7958a832R80K108J276K91K12J97j228k224L15j206j071L908P94k191k419n4J31
$$ -1832 -852 1256 2532 2823 3035 3232 2004 -220 95 -1111 -2182 1726 2520 329 -2090 -2144 -2013
7941b013J171N58L75J888P88k056j836J977K01n40l54J155n48J276j79j16J303
$$ -2013 -842 -284 91 1979 2767 711 -1125 852 1053 513 159 1314 766 2042 1863 1747 3050
7924C050K08r64j950q96K11R95O33K229K55o77J076j417j943k43l188M52J120
$$ 3050 3258 2294 344 -552 -341 654 1287 3516 3771 3094 4170 2753 810 567 -2621 -2169 -1049
7907a049J079k163j567L433J181m22q20K349o4J198j01j078M74%j143k815o46
$$ -1049 30 -2133 -3700 -267 914 492 -328 2021 1957 3155 3054 1976 2450 2450 1307 -1508 -2154
7890b154J562K398J36p21R83L07j702k534J708J232J907K88j686l308j65N98j13
$$ -2154 -592 1806 1942 1221 2204 2511 809 -1725 -17 1215 3122 3410 1724 -1584 -1749 -1151 -1264
7873a264PJ881N35j122n31L3L49P50j05r62j332K314K379J623P86J252j512L38
$$ -1264 -1257 624 1159 37 -494 -461 -112 638 533 -429 -1761 553 2932 4555 5341 6593 5081 5419
7855E419j698l122n60J142p43M4J99K077J641o62j220j285j780L55J496q66k068
$$ 5419 3721 599 39 1181 438 482 681 2758 4399 3737 2517 1232 -548 -193 1303 437 -1631
7838a631l68n56J132J015p39K92K581R72j808j663O3J773J59r19k052j474J352
$$ -1631 -1999 -2555 -1423 -408 -1147 -855 1726 2698 890 -773 -710 1063 1222 303 -1749 -3223 -1871
7821a871O45J09M87K880J175l352n06M83Q99m22j218j016q61J015Q11J652N12
$$ -1871 -1226 -1117 -630 2250 3425 73 -433 50 949 527 -691 -1707 -2568 -1553 -742 910 1422
7804A422q05p15l00R09P15p43M13N11j482j696k75M07K018K446k821j961R84L389
$$ 1422 617 -98 -398 511 1226 483 896 1407 -75 -1771 -2046 -1639 379 2825 4 -1957 -973 2416
7786B416J0j703j613l57n05j173M234K564k771k593k162k83O96m34K277J804k4
$$ 2416 2426 723 -890 -1247 -1752 -2925 1309 3873 1102 -1491 -3653 -3936 -3240 -3674 -1397 407 383
7769C83j482p57q85j236P97M70j325j266M67l46r90K748J446R93M28j460L59J198
$$ 383 -1099 -1856 -2741 -3977 -3180 -2710 -4035 -5301 -4834 -5180 -6170 -3422 -1976 -983 -555 -2015 -1656 -458
7751d58j39k97K236J85l804j511K066n65J77N85J462k058p8N12j498N19j043Q39
$$ -458 -597 -894 1342 1527 -2277 -3788 -1722 -2287 -2110 -1525 -63 -2121 -2199 -1687 -3185 -2666 -3709 -2870
7733b870k20k189L200K339n46j750J44L91m37j547L75j618K545K091J670m54j571
$$ -2870 -3090 -5279 -2079 260 -286 -2036 -1892 -1501 -1938 -3485 -3110 -4728 -2183 -92 1578 1124 -447
7716d47k737l9J440J206l3l48Q57K176J951k196l558k865m75J240n59k476J73
$$ -447 -3184 -3223 -1783 -577 -610 -958 -101 2075 4026 1830 -1728 -4593 -5068 -3828 -4387 -6863 -6690
7699f690M564R17j638j767n84J073J16K379J417j604J106Q01k786k49K781K80
$$ -6690 -2126 -1209 -2847 -4614 -5198 -4125 -4009 -1630 -213 -1817 -711 90 -2696 -2945 -164 116
7683A16k970m08n12p11k66j29K26l78O72J091p69j567m74J204J005K466P44Q48
$$ 116 -2854 -3262 -3774 -4485 -4751 -4880 -4654 -5032 -4360 -3269 -4038 -5605 -6079 -4875 -3870 -1404 -660 188
7665A88j038k843P44K811J929M82k01k101k633K66M421L981k166l109k282j296
$$ 188 -850 -3693 -2949 -138 1791 2273 2072 -29 -2662 -2396 2025 6006 3840 731 -1551 -2847
7649b847j674M56L014o42j5m2J443R21O28p01k673J604m41k694l76k5N47M198
$$ -2847 -4521 -4065 -1051 -1693 -1708 -1750 -307 614 1242 541 -2132 -528 -969 -3663 -4039 -4064 -3517 681
7631F81K239N68l597j290j156m0J833J666k283j300j853m65Q27J923J377j064
$$ 681 2920 3488 -109 -1399 -2555 -2595 -762 904 -1379 -2679 -4532 -4997 -4170 -2247 -870 -1934
7615a934P15N01q67O32n11J079M06j71j704j390J314J844O24l099o30J009L86
$$ -1934 -1219 -718 -1585 -953 -1464 -385 21 -150 -1854 -3244 -1930 -86 538 -2561 -3191 -2182 -1796
7598a796k214k376J526Q52p66J424J254j111j77K22J974N42j272m17J59n01m7
$$ -1796 -4010 -6386 -4860 -4008 -4774 -3350 -2096 -3207 -3384 -3162 -1188 -646 -1918 -2335 -2176 -2677 -2724
7581b724M04J056J177l385j242R40j315r22L96J146J231J340K393R48j614m40
$$ -2724 -2320 -1264 -87 -3472 -4714 -3774 -5089 -6011 -5615 -4469 -3238 -1898 495 1443 -171 -611
7565f11p15j889K124o12K59J33K771N78L36J038J49j432j231j534M79O68j827
$$ -611 -1326 -3215 -1091 -1703 -1444 -1311 1460 2038 2374 3412 3561 2129 898 -636 -157 511 -1316
7548a316n66L04n58K068K02j001k131P06J021j645m29j279K633J194j471k262
$$ -1316 -1882 -1578 -2136 -68 134 -867 -2998 -2292 -1271 -2916 -3345 -4624 -1991 -797 -2268 -4530
7532d530j22J790l73p69j82K050o01j219O36j045o75m88k75K094K793j39J322
$$ -4530 -4652 -2862 -3235 -4004 -4186 -2136 -2737 -3956 -3320 -4365 -5040 -5528 -5803 -3709 -916 -1055 267
7515B67Q85R62j854j092p38j802P68J102K829J934k063j108j105j340k388J49
$$ 267 1152 2114 260 -832 -1570 -3372 -2604 -1502 1327 3261 1198 90 -1015 -2355 -4743 -4594
7499d594R28K033J302J69k727j02K423J454P3l677k550R02Q72K314J701J039r41
$$ -4594 -3666 -1633 -331 -162 -2889 -2991 -568 886 959 -2718 -5268 -4366 -3494 -1180 521 1560 619
7482F19q86j392j063n99K313l71j120P22L3p98j325j014J214J027M24l58Q06p07
$$ 619 -267 -1659 -2722 -3321 -1008 -1379 -2499 -1777 -1744 -2542 -3867 -4881 -3667 -2640 -2216 -2574 -1768 -2475
7464b475R85K893J693r13n06J915M51k885j108K685J134j67N51L31j368j670l143
$$ -2475 -1490 1403 3096 2183 1677 3592 4043 1158 50 2735 3869 3702 4253 4584 3216 1546 -1597
7447a597j863m72K3K589J859J117j073l08J208q90j715r20M62P91J192J402J38
$$ -1597 -3460 -3932 -3909 -1320 539 1656 583 275 1483 593 -1122 -2042 -1580 -789 403 1805 1943
7430A943r20J611j178m450J708J699j785q81J21J851J001J41L91q50P5j90J40
$$ 1943 1023 2634 1456 -2994 -1286 413 -1372 -2253 -2132 -281 720 861 1252 402 477 287 427
7413D27O95M97N66j435k645K780L025p73j267k117J260l132p43j38l78L541k96
$$ 427 1122 1619 2185 750 -1895 885 3910 3137 1870 -247 1013 -2119 -2862 -3000 -3378 163 -133
7396a33k547p13K59J541L42j848J255J836k093j557N31J322L17P46j636m97K592
$$ -133 -2680 -3393 -3134 -1593 -1251 -3099 -1844 -8 -2101 -3658 -3127 -1805 -1488 -742 -2378 -2875 -283
7379b83Q9Q19P22k965j465M4N22J117k84O18q04J688J822j383j583j594K20K931
$$ -283 -194 625 1347 -1618 -3083 -3039 -2517 -1400 -1684 -1066 -1870 -182 1640 257 -1326 -2920 -2700 231
7361B31Q69j397J604o24l1q12O06P60j808j051J432Q9m48R20J333n22j076k421
$$ 231 1100 -297 1307 683 652 -160 446 1206 -602 -1653 -221 -132 -580 340 1673 1151 75 -2346
7343b346J140K582j679r59M16K881J30p58r43J883K15j458O28r8j818k490j829
$$ -2346 -1206 1376 -303 -1262 -846 2035 2165 1407 464 2347 2562 1104 1732 1634 -184 -2674 -4503
7326d503J664K227J95k95p01J154l00k50L40N60P45j766k140o94R19L043J72j561
$$ -4503 -2839 -612 -417 -712 -1413 -259 -559 -809 -469 91 836 -930 -3070 -3764 -2845 198 370 -1191
7308a191j226p6L008k34j738m046j702p8K558M304K019N29k021L01P54j977k028
$$ -1191 -2417 -2493 515 281 -1457 -5503 -7205 -7283 -4725 -421 1598 2127 106 407 1161 -816 -2844
7291b844k68L870j485j488j363j241q77j933L27J843Q41P82M46J161K346j525
$$ -2844 -3112 758 -727 -2215 -3578 -4819 -5696 -7629 -7302 -5459 -4618 -3836 -3390 -2229 117 -1408
7275a408J119J679k40j35J951j018J478j07j655j187q90k87n59j783j558J69L292
$$ -1408 -289 1390 1150 1015 2966 1948 3426 3319 1664 477 -413 -700 -1259 -3042 -4600 -4431 -1139
7258a139K496K09k705p91P57K73J501j972j62j546J168l55n77j129q24J27J048
$$ -1139 1357 1566 -1139 -1930 -1173 -900 601 -1371 -1533 -3079 -1911 -2266 -2843 -3972 -4796 -4669 -3621
7241c621K932J935J810j034j117q90j434o73J20K585j917q27J674r10k037n81
$$ -3621 -689 1246 3056 2022 905 15 -1419 -2092 -1972 613 -1304 -2131 -457 -1367 -3404 -3985
7225c985J061J787n90J622J789P09R27J183p25j955j767p52J246K428q80k646
$$ -3985 -2924 -1137 -1727 -105 1684 2393 3320 4503 3778 1823 56 -696 550 2978 2098 -548
7209e48j515k474K94m65j061O2J759j132l66K74R53J596Q85L721J426k846j748
$$ -548 -2063 -4537 -4243 -4708 -5769 -5707 -3948 -5080 -5446 -5172 -4219 -2623 -1738 1983 3409 563 -1185
7192a185M48J236n4M81n57o53q08j605L24j001J821n61P90j77M07L099p55j279
$$ -1185 -737 499 445 926 369 -284 -1092 -2697 -2373 -3374 -1553 -2114 -1324 -1501 -1094 2005 1250 -29
7174b9P7K40j510j278j33K346j36k8R26m20l437J179N35r23k414J187K329n42
$$ -29 48 288 -1222 -2500 -2633 -287 -423 -451 475 55 -3382 -2203 -1668 -2591 -5005 -3818 -1489 -2031
7156b031r67k161j279Q37K900J865j475K89K455r68O7k51Q19l35l78p7O49j081
$$ -2031 -2998 -5159 -6438 -5601 -2701 -836 -2311 -2022 433 -535 -468 -719 100 -235 -613 -690 -41 -1122
7138a122J94J987R26J29k315j957p5O31J342K40j101m26o6J588J174J366q2L37
$$ -1122 -928 1059 1985 2114 -201 -2158 -2233 -1602 -260 -20 -1121 -1547 -1613 -25 1149 2515 2433 2770
7120B770k081k074j111J28j823M90j54j115J301J857J314j73j812j242K072j147
$$ 2770 689 -1385 -2496 -2368 -4191 -3701 -3855 -4970 -3669 -1812 -498 -671 -2483 -3725 -1653 -2800
7104b800N67K241q23J52j10k265P5K700R98j046n98j538k78j99n1N92J259K838
$$ -2800 -2233 8 -815 -663 -773 -3038 -2963 -263 735 -311 -909 -2447 -2725 -2924 -2975 -2383 -1124 1714
7086A714J218j644j165j0L13O19J293O16j587p3j017j799k038R31M93K501p39
$$ 1714 2932 1288 123 113 426 1045 2338 2954 1367 1294 277 -1522 -3560 -2629 -2136 365 -374
7069c74j317N63L796M51o39j081k834j394J491J700j47j377J477j984j715j335
$$ -374 -1691 -1128 2668 3119 2480 1399 -1435 -2829 -1338 362 215 -1162 315 -1669 -3384 -4719
7053d719Q87o66J804k99J138K109J500n28j670m90N99j207q84m72J557R72K484
$$ -4719 -3832 -4498 -2694 -2993 -1855 254 1754 1226 -444 -934 -335 -1542 -2426 -2898 -1341 -369 2115
7036B115K56l355l17K41K434K37j340l745j937J446K915J708j506r90J854K725
$$ 2115 2371 -984 -1301 -1060 1374 1611 271 -3474 -5411 -3965 -1050 658 -848 -1838 16 2741
7020B741p87p46k351K38K213J036j157r26j093j102J713J666k022M49K229o98
$$ 2741 1954 1208 -1143 -905 1308 2344 1187 261 -832 -1934 -221 1445 -577 -128 2101 1403
7004A403K126Q08j244J283Q77k495j790l350J85J520l30k0J014k62O57J82L3j192
$$ 1403 3529 4337 3093 4376 5253 2758 968 -2382 -2197 -677 -1007 -1027 -13 -275 382 564 597 -595
6986e95R38J033r32O18k87j80J188K178K920N32k552k133p04n250j304L444J654
$$ -595 343 1376 444 1062 775 595 1783 3961 6881 7413 4861 2728 2024 -3226 -4530 -1086 568
6969E68m46N45K506L144M14k140j611j308r84m87j047J434J141j116M75l87J92
$$ 568 122 667 3173 6317 6731 4591 2980 1672 688 201 -846 588 1729 613 1088 701 893
6952H93J298r79q18m60l14J293l25Q97p7k37q35k375j388J432n58j145J794M282
$$ 893 2191 1212 394 -66 -380 913 588 1485 1408 1171 336 -2039 -3427 -1995 -2553 -3698 -1904 2378
6934B378J769l949j305R50J267J08k03J493L40l10r29k483j358k30J890J328o24
$$ 2378 4147 198 -1107 -157 1110 1218 1015 2508 2848 2538 1609 -874 -2232 -2462 -572 756 132
6917A32J53o34m04J939K730K721j370k10j543k777j327O53J878Q34j638j063M20
$$ 132 285 -349 -753 1186 3916 6637 5267 5057 3514 737 -590 63 1941 2775 1137 74 494
6900D94J081j722j46J227M41Q02r70J141P17m065j597K133J085j771j076m16J763
$$ 494 1575 -147 -293 934 1375 2177 1207 2348 3065 -1000 -2597 -464 621 -1150 -2226 -2642 -879
6883h79J751n47k489p4K618r03l255j1Q65L373P38J067k092j086J436R73l53L296
$$ -879 872 325 -2164 -2238 380 -523 -3778 -3789 -2924 449 1187 2254 162 -924 512 1485 1132 4428
6865D428m77l335l53R70Q51k733P33M490j398l531j195O12k70M65K296P67p72
$$ 4428 3951 616 263 1233 2084 -649 84 4574 3176 -355 -1550 -938 -1208 -743 1553 2320 1548
6848A548j135K88q20j032k54N01R31j324J782L166n62J371k404j243N09J553n05
$$ 1548 413 701 -119 -1151 -1405 -904 27 -1297 485 3651 3089 4460 2056 813 1322 2875 2370
6831B370r79n00l689K06J894J261K51k943O02J267j176j971J98J151k3L71J047
$$ 2370 1391 891 -2798 -2592 -698 563 814 -2129 -1527 -260 -1436 -3407 -3209 -2058 -2081 -1710 -663
6814f63j427Q4J891K96m18J650r61o64j053p83J113j70j520R72J840P72J640j316
$$ -663 -2090 -2006 -115 181 -237 1413 452 -212 -1265 -2048 -935 -1105 -2625 -1653 187 959 2599 1283
6796A283j558l98n80p42J092q48J888J949J410J190N49N59k783K63K328J181k58
$$ 1283 -275 -673 -1253 -1995 -903 -1751 137 2086 3496 4686 5235 5794 3011 3274 5602 6783 6525
6779F525m383j302J394l525k902J607q16J110Q47J981K235k535q98L94K77k235
$$ 6525 2142 840 2234 -1291 -4193 -2586 -3402 -2292 -1445 536 2771 236 -662 -268 9 -2226
6763b226j659J128j1Q08qj716n52j250J211J531r88N48m48k94j989J386K891j258
$$ -2226 -3885 -2757 -2768 -1960 -1968 -3684 -4236 -5486 -4275 -2744 -3732 -3184 -3632 -3926 -5915 -4529 -1638 -2896
6745b896k998K555R43M70J546J432J293o80j494J720N86q47k115k054P39j82K971
$$ -2896 -5894 -3339 -2396 -1926 -380 1052 2345 1665 171 1891 2477 1630 -485 -2539 -1800 -1982 989
6728I89O69J835L100n79k639j807j780J029K551R58j741K352J364k300j459k17
$$ 989 1658 3493 6593 6014 3375 1568 -212 817 3368 4326 2585 4937 6301 4001 2542 2325
6712B325j40k38l640j360L470K522k069q29J186J006K16Q97Q83j431k122M46j789
$$ 2325 2185 1947 -1693 -3053 417 2939 870 41 1227 2233 2449 3346 4229 2798 676 1122 -667
6695f67J406J529j368j843k216j641J193K053J723K997L64m511J38J443j087j016
$$ -667 739 2268 900 -943 -3159 -4800 -3607 -1554 169 3166 3530 -981 -843 600 -487 -1503
6679a503j224l16J745J819Q76l51k86J202o64J3k35J867j131n13K65q95j659K776
$$ -1503 -2727 -3043 -1298 521 1397 1046 760 1962 1298 1311 1076 2943 1812 1299 1564 669 -990 1786
6661A786J542P33l42N53K007o03j728k179j517M01J480J461j420q34j47J36j357
$$ 1786 3328 4061 3719 4272 6279 5676 3948 1769 252 653 2133 3594 2174 1340 1193 1329 -28
6644b8Q11L236Q26p51o28m96n099k981Q99R93j524k219M024M253J91m59K82P51
$$ -28 783 4019 4845 4094 3466 2970 -2129 -5110 -4211 -3218 -4742 -6961 -2937 1316 1507 1048 1330 2081
6626B081L03r73j769O67k201j722J411J102J286K018K353K373j055O71j304l481
$$ 2081 2384 1411 -358 309 -1892 -3614 -2203 -1101 185 2203 4556 6929 5874 6545 5241 1760
6610A760J392l0l018j18P14P79J968k017j333q89j653l64M31J215m83l14R09l51
$$ 1760 3152 3122 104 -14 700 1479 3447 1430 97 -792 -2445 -2809 -2378 -1163 -1646 -1960 -1051 -1402
6592a402R50J145N14O06J77p49K07J1j281P18n40j030M93K106J103j523K42J548
$$ -1402 -452 693 1207 1813 1990 1241 1448 1459 178 896 356 -674 -181 1925 3028 1505 1747 3295
6574C295k151j430j621J128j43j774R57L350J457m55n00Q52K75j63q29l180k835
$$ 3295 1144 -286 -1907 -779 -922 -2696 -1739 1611 3068 2613 2113 2965 3240 3077 2248 -932 -3767
6557c767k68k171j34J862J480J12M117m21r19J574n01q90j594j719l14J032P88
$$ -3767 -4035 -6206 -6340 -4478 -2998 -2886 1231 810 -109 1465 964 74 -1520 -3239 -3553 -2521 -1733
6540a733j954J060L576J127j994n57L26Q17J940m46k367l62j694j246K753J653
$$ -1733 -3687 -2627 949 2076 82 -475 -149 668 2608 2162 -205 -567 -2261 -3507 -754 899
6524H99j215o77L89J871O06j630q70n88l90n3J659k389j466L1O31J316j482J212
$$ 899 -316 -993 -604 1267 1873 243 -627 -1215 -1605 -1658 1 -2388 -3854 -3823 -3192 -1876 -3358 -2146
6506b146K312n61m39J029k821j386P66K954J985M84m687j862o00R63K309O3P38
$$ -2146 166 -395 -834 195 -2626 -4012 -3246 -292 1693 2177 -2510 -4372 -4972 -4009 -1700 -1637 -899
6489h99j789k887L10Q76J507M89q14J620K777L05m38j342R91o75k600L5j55J096
$$ -899 -2688 -5575 -5265 -4389 -2882 -2393 -3207 -1587 1190 1495 1057 -285 706 31 -2569 -2534 -2689 -1593
6471a593J909k185k328O70L074J338O15Q2j95J57j28P4n76q82j613K037Q42n36
$$ -1593 316 -1869 -4197 -3527 -453 885 1500 1582 1387 1544 1416 1490 914 32 -1581 456 1298 762
6453G62j271M67m81r69k19J459j533l346L43J879K845J978R50l211j347J720M73
$$ 762 -509 -42 -523 -1492 -1711 -252 -1785 -5131 -4788 -2909 -64 1914 2864 -347 -1694 26 499
6436D99j022J673P95k654j659L9r33p57L88J357rN98N36R3K85o43p00m77J4J24
$$ 499 -523 1150 1945 -709 -2368 -2329 -3262 -4019 -3631 -2274 -2283 -1685 -1149 -1056 -771 -1414 -2114 -2591 -2577 -2453
6416b453J902j496j515J414L02Oo47J048o55Q94J017J635l66l8m96k627R25Q71
$$ -2453 -551 -2047 -3562 -2148 -1846 -1840 -2487 -1439 -2094 -1200 -183 1452 1086 1048 552 -2075 -1150 -279
6398b79Q92R71m86j121K048J928p06o22N8R00j752j129k22P6J385k201r70R9p61
$$ -279 613 1584 1098 -23 2025 3953 3247 2625 2683 3583 1831 702 480 556 1941 -260 -1230 -1131 -1892
6379a892J00J195j418Q38j499q5j412J328L169j635j875k352J834L531M39k830
$$ -1892 -1792 -597 -2015 -1177 -2676 -2761 -4173 -2845 324 -1311 -3186 -5538 -3704 -173 266 -2564
6363b564J197J220O8j68j937L05L60J026J801j699J41j398K3J721N1O25j583n91
$$ -2564 -1367 -147 -79 -247 -2184 -1879 -1519 -493 1308 -391 -250 -1648 -1625 96 147 772 -811 -1402
6345a402N81J508J992p85l817K335Q41j584l322P83m8J271K189P03j703j026j290
$$ -1402 -821 687 2679 1894 -1923 412 1253 -331 -3653 -2870 -2918 -1647 542 1245 -458 -1484 -2774
6328b774P84K834j188l483m16K072N69l22O80J526J7J324J84J62q49K26L63m40
$$ -2774 -1990 844 -344 -3827 -4243 -2171 -1602 -1924 -1244 282 299 1623 1807 1969 1120 1346 1709 1269
6310A269Q25j145j535P27J399J168K13j684o28K65j574m6l070R89n39k181J240
$$ 1269 2094 949 -586 141 1540 2708 2921 1237 609 874 -700 -746 -3816 -2827 -3366 -5547 -4307
6293d307N14l52O1J411J014j725J20Q12J392K91o60M51r68J421L379O30j944o02
$$ -4307 -3793 -4145 -4084 -2673 -1659 -3384 -3264 -2452 -1060 -769 -1429 -978 -1946 -525 2854 3484 1540 938
6275I38M39k071j302j64K509O06r75j645R0K028K53l235j179J151R09M19J62k622
$$ 938 1377 -694 -1996 -2160 349 955 -20 -1665 -1575 453 706 -2529 -3708 -2557 -1648 -1229 -1067 -3689
6257c689r76r89o89K650J679n59j332j018L318J104q12k562m049J921K303J310
$$ -3689 -4665 -5654 -6343 -3693 -2014 -2573 -3905 -4923 -1605 -501 -1313 -3875 -7924 -6003 -3700 -2390
6241b390J806O51O21kN9J10j150J295o27j000M60r46n77J901J980%j864J231J517
$$ -2390 -584 67 688 686 745 855 -295 1000 373 -627 -167 -1113 -1690 211 2191 2191 327 1558 3075
6222C075j2k277r09J398Q32k234m193r99j0J544K916K689k388j884K19N31j260
$$ 3075 3063 786 -123 1275 2107 -127 -4320 -5319 -5329 -3785 -869 1820 -568 -2452 -2233 -1702 -2962
6205b962p72M05J363J393q79p19k00P84R27p68N40J696J614j182K242n76j809
$$ -2962 -3734 -3329 -1966 -573 -1452 -2171 -2371 -1587 -660 -1428 -888 808 2422 1240 3482 2906 1097
6188A097j004j339k5l32n21q15N51K458R55J434l714k101K25L588M83j680l06
$$ 1097 93 -1246 -1271 -1603 -2124 -2939 -2388 70 1025 2459 -1255 -3356 -3131 457 940 -740 -1046
6171a046J615R53k228l034l70L95K477M56n15j393m73L298J427J255j242l504
$$ -1046 569 1522 -706 -3740 -4110 -3715 -1238 -782 -1297 -2690 -3163 135 1562 2817 1575 -1929
6155a929J283J507k00l74N67J401RJ01j816k787M15M2P35J064q88m48K422k5k610
$$ -1929 -646 861 661 287 854 2255 2264 2365 549 -2238 -1823 -1781 -1046 18 -870 -1318 1104 1079 -1531
6136a531k632P25K675K96J13m28k659J747R4q40L17M31j057m59O55M18l79j21
$$ -1531 -4163 -3438 -763 -467 -354 -782 -3441 -1694 -1600 -2440 -2123 -1692 -2749 -3208 -2553 -2135 -2514 -2635
6118b635o60R2R31J604J503M76j657j433J91K03O36n87L561K901j209j057k786
$$ -2635 -3295 -3203 -2272 -668 835 1311 -346 -1779 -1588 -1385 -749 -1336 2225 5126 3917 2860 74
6101G4r79K038M00J408L18K3q73q76M91j481J386J31l553R17O85R73m5L28J011
$$ 74 -905 1133 1533 2941 3259 3282 2409 1533 2024 543 1929 2060 -1493 -576 109 1082 1037 1365 2376
6082B376r01m30j200k188j013O14j858K048K036J224r92j040n72O59O0k326j074
$$ 2376 1475 1045 -155 -2343 -3356 -2742 -4600 -2552 -516 708 -284 -1324 -1896 -1237 -1177 -3503 -4577
6065d577j46J922j3o8J647K955J778j054r32J436J240l578j711J868P47j503j889
$$ -4577 -4723 -2801 -2814 -2882 -1235 1720 3498 2444 1512 2948 4188 610 -1101 767 1514 11 -1878
6048a878j543RK135n81O01K115J238m01R37k19j330j089j386J208J12k471j33
$$ -1878 -3421 -3412 -1277 -1858 -1257 858 2096 1695 2632 2413 1083 -6 -1392 -184 -72 -2543 -2676
6031b676R90j40j28J641M71J105J044K460K27j779k380K511R0N18j4k111j523
$$ -2676 -1686 -1826 -1954 -313 158 1263 2307 4767 4994 3215 835 3346 3436 3954 3940 1829 306
6014C06k696j08K205J154j93r99L37l12p70K4N90l92n94L58p07N43L147j065k120
$$ 306 -2390 -2498 -293 861 668 -331 6 -306 -1076 -1052 -462 -854 -1448 -1090 -1797 -1254 1893 828 -1292
5995a292K478J22j92j972J129k0j00K619J706l298l252r20K660o87k257J627K267
$$ -1292 1186 1308 1116 -856 273 253 153 2772 4478 1180 -2072 -2992 -332 -1019 -3276 -1649 618
5978F18J235k415p58J409q08j992Q7K885j346j585J450J624J433j2j07j561k213
$$ 618 1853 -562 -1320 89 -719 -2711 -2624 261 -1085 -2670 -1220 404 1837 1825 1718 157 -2056
5961b056n06K054L235K92j425p96M95J144k272l73L274k61j766M93q75j397N5
$$ -2056 -2562 -508 2727 3019 1594 798 1293 2437 165 -208 3066 2805 1039 1532 657 -740 -685
5944f85J733n55m15J065p09K796J189k794q10r97j142p72l11J658O73J589R16
$$ -685 1048 493 78 1143 434 3230 4419 1625 815 -182 -1324 -2096 -2407 -749 -76 1513 2429
5927B429l77q15k332K267j396q34J742P09m55p72M93J788J071j140m90J472k051
$$ 2429 2052 1237 -1095 1172 -224 -1058 684 1393 938 166 659 2447 3518 2378 1888 3360 1309
5910A309k113k20O81r3J919N45j429j10j217l126j55K661L21J478L218j828r90
$$ 1309 -804 -1024 -343 -436 1483 2028 599 489 -728 -3854 -4009 -1348 -1027 451 3669 1841 851
5893H51n15K52j136l272O65J131pO24j633J537o94k093k548K506J361j246k417
$$ 851 336 588 -548 -3820 -3155 -2024 -2031 -1407 -3040 -1503 -2197 -4290 -6838 -4332 -2971 -4217 -6634
5876f634L78M79K092J835K79N4K226K334J873k237j574K148O0q92Q37k25k477
$$ -6634 -6256 -5777 -3685 -1850 -1571 -1517 709 3043 4916 2679 1105 3253 3313 2421 3258 3033 556
5859E56J54j028j478J763k66p40j696N09L982l88j494J382k217n41j62J554J315
$$ 556 710 -318 -1796 -33 -299 -1039 -2735 -2226 1756 1368 -126 1256 -961 -1502 -1664 -110 1205
5842A205m57J172m68j386J83K534m06N21R4j446O26k690J670j087K39m61M61k8
$$ 1205 748 1920 1452 66 249 2783 2377 2898 2992 1546 2172 -518 1152 65 304 -157 304 276
5824B76K353J344n15m42J369l47p54k809k61j192K043M32M72o90j823L39M10k263
$$ 276 2629 3973 3458 3016 4385 4038 3284 475 214 -978 1065 1497 1969 1279 -544 -205 205 -2058
5806b058J725R24j746J454J128J28j526J470j746J08K6m57k111m8J97M01P71L05
$$ -2058 -333 591 -1155 299 1427 1555 29 1499 -247 -139 -113 -570 -2681 -2729 -2532 -2131 -1360 -1055
5788a055J411P14R83L009o19k779k45Q25p70J4j008k278J69J287J001J395J2p94
$$ -1055 356 1070 2053 5062 4443 1664 1419 2244 1474 1488 480 -1798 -1629 -342 659 2054 2066 1272
5770A272k295p34j16m34J860K980n69P2m03j370k265p89J731O68o80n67M73j101
$$ 1272 -1023 -1757 -1873 -2307 -447 2533 1964 2036 1633 263 -2002 -2791 -1060 -392 -1072 -1639 -1166 -2267
5752b267n40K312r98J196J008J28j661k364M14J212J518k64k667J73j641j00L060
$$ -2267 -2807 -495 -1493 -297 711 839 -822 -3186 -2772 -1560 -42 -306 -2973 -2800 -4441 -4541 -1481
5735a481K473l77j506J160r3N0J41l98K04l254j8K720N14k11J891L95k434K181
$$ -1481 992 615 -891 269 176 226 367 -31 173 -3081 -3099 -379 135 -76 1815 2210 -224 1957
5717A957Lq3j247J088j367j059L115P6j121M9L65K863K340k966j890J79J344k109
$$ 1957 1960 1877 630 1718 351 -708 2407 2483 1362 1411 1776 4639 6979 4013 2123 2302 3646 1537
5699A537j828j321r30J573R8m78j963n7J765j226j355J218J333O73l69j186J248
$$ 1537 -291 -1612 -2542 -969 -871 -1349 -3312 -3369 -1604 -2830 -4185 -2967 -1634 -961 -1330 -2516 -1268
5682a268R22p26r98Q8K338m08P80K906r10k068N74J866O49n7L10k225k436J533
$$ -1268 -346 -1072 -2070 -1982 356 -52 728 3634 2724 656 1230 3096 3745 3688 3998 1773 -663 870
5664H70O43j241m45J048K197r5k508j573q60L28K17O18J494p4Q79j826j102J55
$$ 870 1513 272 -173 875 3072 2977 469 -1104 -1964 -1636 -1419 -801 693 619 1498 -328 -1430 -1275
$$ [...]
##END NTUPLES=NMR SPECTRUM
##END=
