##TITLE=Analysis number 329808
Compound Code cc 61946
Project Code adrs
Chemist Name endeavour
##JCAMPDX= 6.0         $$ Bruker NMR JCAMP-DX V2.0
##DATA TYPE= NMR SPECTRUM
##DATA CLASS= NTUPLES
##ORIGIN= Bruker BioSpin GmbH
##OWNER= nmr
$$ XWIN-NMR		Version 3.5
$$ Mon Oct  1 11:54:30 2007 GMT Daylight Time (UT+1h)  MAYBRIDGE\nmr@NMR_250MHZ
##.OBSERVE FREQUENCY= 250.131544655141
##.OBSERVE NUCLEUS= ^1H
##.ACQUISITION MODE= SIMULTANEOUS (DQD)
##.ACQUISITION SCHEME= undefined
##.AVERAGES= 16
##.DIGITISER RES= 18
##SPECTROMETER/DATA SYSTEM= dpx250
##.PULSE SEQUENCE= zg30
##.SOLVENT NAME= CDCl3
##.SHIFT REFERENCE= (INTERNAL, CDCl3, 0, 16.522)
##AUDIT TRAIL= $$ (NUMBER, WHEN, WHO, WHERE, WHAT)
$$ ##TITLE= Audit trail, XWIN-NMR		Version 3.5
$$ ##JCAMPDX= 5.01
$$ ##ORIGIN= Bruker BioSpin GmbH
$$ ##OWNER= nmr
$$ C:\u/data/dgb/nmr/ADRS/40/pdata/1/auditp.txt
$$ ##AUDIT TRAIL=  $$ (NUMBER, WHEN, WHO, WHERE, WHAT)
(   1,<2007-10-01 11:54:08.92 +100>,<MAYBRIDGE\nmr>,<NMR_250MHZ>,
      <created by zg, POWCHK disabled, PULCHK disabled
       configuration hash MD5:
       76 6E 9A 78 1E 09 19 81 EC 84 63 8F B0 6A 59 2D
       data hash MD5: 64K
       8C 04 6A 6B 41 1B 20 85 0F CE 4B 8C 66 F7 4D 36>)
(   2,<2007-10-01 11:54:21.46 +100>,<MAYBRIDGE\nmr>,<NMR_250MHZ>,
      <Start of raw data processing
       ef LB = 0.3 FT_mod = 6 PKNL = 1 SI = 32K 
       data hash MD5: 32K
       C7 F2 0A A8 04 73 4F 63 78 2B 49 3D F1 3B 77 7B>)
(   3,<2007-10-01 11:54:23.32 +100>,<MAYBRIDGE\nmr>,<NMR_250MHZ>,
      <apk 
       data hash MD5: 32K
       59 86 42 EB DA A7 9C AD 81 A8 91 0B 31 DB 5C C8>)
(   4,<2007-10-01 11:54:24.14 +100>,<MAYBRIDGE\nmr>,<NMR_250MHZ>,
      <abs ABSG = 5 
       data hash MD5: 32K
       22 98 A6 25 77 31 3A F3 92 67 9F FF 5B 03 72 C4>)
$$ ##END=
$$ 
$$ hash MD5
$$ 52 27 A8 BA B9 6A 80 DF 50 54 B4 73 CD D7 7D 73
##$RELAX= 
##$RELAX= 
##$RELAX= 
##$RELAX= 
##$RELAX= 
##$RELAX= 
##$RELAX= 
$$ Bruker specific parameters
$$ --------------------------
##$DU= <C:\u>
##$EXPNO= 40
##$NAME= <ADRS>
##$PROCNO= 1
##$TYPE= <nmr>
##$USER= <dgb>
##$AMP= (0..31)
100 100 100 100 100 100 100 100 100 100 100 100 100 100 100 100 100 100 
100 100 100 100 100 100 100 100 100 100 100 100 100 100 
##$AQSEQ= 0
##$AQ_mod= 3
##$AUNM= <au_zg>
##$AUTOPOS= <51 >
##$BF1= 250.13
##$BF2= 250.13
##$BF3= 250.13
##$BF4= 250.13
##$BF5= 500.13
##$BF6= 500.13
##$BF7= 500.13
##$BF8= 500.13
##$BYTORDA= 1
##$CFDGTYP= 0
##$CFRGTYP= 5
##$CHEMSTR= <none>
##$CNST= (0..31)
1 1 145 1 1 1 1 1 1 1 1 1 1 1 1 1 1 1 1 1 1 1 1 1 1 1 1 1 1 1 1 1 
##$CPDPRG= <>
##$CPDPRG1= <>
##$CPDPRG2= <>
##$CPDPRG3= <>
##$CPDPRG4= <mlev>
##$CPDPRG5= <mlev>
##$CPDPRG6= <mlev>
##$CPDPRG7= <mlev>
##$CPDPRG8= <mlev>
##$CPDPRGB= <>
##$CPDPRGT= <>
##$D= (0..31)
0 1 0 0 0 0 0 0 0 0.06 0 0 0 0 0 0 0.0002 0 0 0 0 0 0 0 0 0 0 0 0 0 0 
0 
##$DATE= 1191236047
##$DBL= (0..7)
120 120 120 120 120 120 120 120 
##$DBP= (0..7)
150 150 150 150 150 150 150 150 
##$DBP07= 0
##$DBPNAM0= <>
##$DBPNAM1= <>
##$DBPNAM2= <>
$$ [...]
##$SUBNAM7= <"">
##$SUBNAM8= <"">
##$SUBNAM9= <"">
##$SW= 20.6930455092707
##$SWIBOX= (0..15)
0 0 3 0 0 0 0 0 0 0 0 0 0 0 0 0 
##$SW_h= 5175.983436853
##$TD= 65536
##$TD0= 1
##$TE= 297.16
##$TE2= 300
##$TE3= 300
##$TEG= 300
##$TL= (0..7)
0 120 120 120 120 120 120 120 
##$TP= (0..7)
150 150 150 150 150 150 150 150 
##$TP07= 0
##$TPNAME0= <>
##$TPNAME1= <>
##$TPNAME2= <>
##$TPNAME3= <>
##$TPNAME4= <>
##$TPNAME5= <>
##$TPNAME6= <>
##$TPNAME7= <>
##$TPOAL= (0..7)
0.5 0.5 0.5 0.5 0.5 0.5 0.5 0.5 
##$TPOFFS= (0..7)
0 0 0 0 0 0 0 0 
##$TUNHIN= 0
##$TUNHOUT= 0
##$TUNXOUT= 0
##$USERA1= <user>
##$USERA2= <user>
##$USERA3= <user>
##$USERA4= <user>
##$USERA5= <user>
##$V9= 5
##$VALIST= <valist>
##$VCLIST= <CCCCCCCCCCCCCCC>
##$VD= 0
##$VDLIST= <DDDDDDDDDDDDDDD>
##$VPLIST= <PPPPPPPPPPPPPPP>
##$VTLIST= <TTTTTTTTTTTTTTT>
##$WBST= 1024
##$WBSW= 4
##$XGAIN= (0..3)
0 0 0 0 
##$XL= 0
##$YL= 0
##$YMAX_a= 586224
##$YMIN_a= -613340
##$ZGOPTNS= <>
##$ZL1= 120
##$ZL2= 120
##$ZL3= 120
##$ZL4= 120
##$ABSF1= 16.522
##$ABSF2= -4.171173
##$ABSG= 5
##$ABSL= 3
##$ALPHA= 0
##$AQORDER= 0
##$ASSFAC= 0
##$ASSFACI= 0
##$ASSFACX= 0
##$ASSWID= 0
##$AUNMP= <proc_1d>
##$AZFE= 0.1
##$AZFW= 0.1
##$BCFW= 0
##$BC_mod= 0
##$BYTORDP= 0
##$COROFFS= 0
##$CY= 12.5
##$DATMOD= 1
##$DC= 0
##$DFILT= <>
##$DTYPP= 0
##$F1P= 14.0000005364418
##$F2P= -0.99999901652339
##$FCOR= 0.5
##$FTSIZE= 32768
##$FT_mod= 6
##$GAMMA= 0
##$GB= 0
##$INTBC= 1
##$INTSCL= 1
##$ISEN= 128
##$LB= 0.3
##$LEV0= 0
##$LPBIN= 0
##$MAXI= 10000
##$MC2= 0
##$MEAN= 0
##$ME_mod= 0
##$MI= 0
##$NCOEF= 0
##$NC_proc= -3
##$NLEV= 6
##$NOISF1= 0
##$NOISF2= 0
##$NSP= 0
##$NTH_PI= 0
##$NZP= 0
##$OFFSET= 16.522
##$PC= 1
##$PHC0= -10.78871
##$PHC1= 22.15981
##$PH_mod= 1
##$PKNL= yes
##$PPARMOD= 0
##$PSCAL= 4
##$PSIGN= 0
##$REVERSE= no
##$SF= 250.13
##$SI= 32768
##$SIGF1= 0
##$SIGF2= 0
##$SINO= 400
##$SIOLD= 32768
##$SREGLST= <1H.CDCl3>
##$SSB= 0
##$STSI= 32768
##$STSR= 0
##$SW_p= 5175.98343685301
##$SYMM= 0
##$S_DEV= 0
##$TDeff= 65536
##$TDoff= 0
##$TI= <Analysis number 999999
Compound Code 99
Book Reference 9
Project Code 9>
##$TILT= no
##$TM1= 0
##$TM2= 0
##$TOPLEV= 0
##$USERP1= <user>
##$USERP2= <user>
##$USERP3= <user>
##$USERP4= <user>
##$USERP5= <user>
##$WDW= 1
##$XDIM= 32768
##$YMAX_p= 399283185
##$YMIN_p= -51487
$$ End of Bruker specific parameters
$$ ---------------------------------
##NTUPLES= NMR SPECTRUM
##VAR_NAME=  FREQUENCY,     SPECTRUM/REAL,   SPECTRUM/IMAG
##SYMBOL=    X,             R,               I
##VAR_TYPE=  INDEPENDENT,   DEPENDENT,       DEPENDENT
##VAR_FORM=  AFFN,          ASDF,            ASDF
##VAR_DIM=   32768,         32768,           32768
##UNITS=     HZ,            ARBITRARY UNITS, ARBITRARY UNITS
##FACTOR=    0.157963299565203, 1,           1
##FIRST=     4132.6476996994, 0,             0
##LAST=      -1043.33573715361, 0,           0
##MIN=       -1043.33573715361, -51487,      0
##MAX=       4132.6476996994, 399283185,     0
$$ Real data points
##PAGE= N=1
##DATA TABLE= (X++(R..R)), XYDATA
$$ [...]
17077a720m415m08j555K22O323L384N898K39l595l297K417m14n204r69Q44J224
17061a026l794n4m20j576N29k469J155L081K127k650R07J21L79l27K973l842p49
17044e635l939k048K336o84L150K663J532m25N03N123M640l067m061l269q81m074
17028h136j169J479K428J62K382R11l711q6L895J785O84M06M075J573k658m843
17012h23L912k64K889M00n845r092J245M836M875l034o90l709j433O943L40L106
16996C656l015l104j252J820L874M296k677O42J727k060n66l226n010r21K862
16981b954l461j689L853M700k535m136K527K331n925N16L237J684n21j894m430
16966h697j329k165O78K840L183J246K192K18k595l778J373M41O919m969l445
$$ y = [-1720, -6135, -6543, -8098, -7876, -1553, 1831, 7729, 7968, 4373, 1076, 3493, 3079, -2125, -3094, -2250, -1026, -4820, -4874, -5294, -6870, -6341, -8810, -7655, -4574, -2447, -5097, -4190, -4069, -3690, -4017, -1044, -4886, -5635, -9574, -11622, -9286, -9970, -6820, -4157, -2625, -3050, -2547, 2576, 7216, 4149, 88, -3181, -4062, -8136, -9305, -7826, -5398, -5236, -2854, -1943, -5654, -5740, -1845, -60, 624, 1030, 5105, 6678, 4020, -823, 3089, 2825, 5714, 6114, 269, -8823, -7578, -2742, 2133, -901, -1591, -5300, -6733, 210, 550, 3656, 641, -2463, -3715, -1895, 1979, 6275, 3598, 4240, 5967, 3907, 3341, 115, -4895, -5816, -2954, -6415, -8104, -4251, 449, -2086, -6222, -3695, -1364, -7289, -6773, -3536, -1852, -2373, -4267, -8697, -10026, -12191, -11513, -8673, -5490, -4244, -2052, -1834, -4429, -8207, -6834, -6393, 526, -4443, -7888]
16951g888k649m871K984J329M440J3O98Q47p4l11J188m541r31q35k675N10M410
16934h356J030J025L281l78j729M645J032p910m94K843L601L210K551N127r78
16919H500n123l411q06M15k229m572r195L146M019M651k15J41Q74l614j494O885
16903b028M755j648j140L998n237N095N650p51n578l889m761P69N62l724j536
16888i463l68l743k108L789O944j611k537N060j841j563J368j913J38J67m858
16873a2539N94Q901O058l432q633j346K231l140k543K016L416K546N3j718K65
16858g271R49P05K58K365k222j313R21j100K691J27k269K937N190k052k824j610
16842d518j474J908K758j477J868Q18M44j769k041O389L199o906j125L505R50
$$ y = [-7888, -10537, -15408, -12424, -11095, -6655, -6642, -5944, -5097, -5171, -5482, -4294, -8835, -9766, -10601, -13276, -12766, -8356, -7326, -6301, -3020, -3398, -5127, -482, 550, -7360, -7854, -5011, -1410, 1800, 4351, 9478, 8500, 3377, -34, -840, -425, -2654, -7226, -16421, -13275, -9256, -4605, -4820, -4679, -3805, -7419, -8913, -2028, 2727, 1079, -61, 3937, -1300, 3795, 9445, 8694, 3116, -773, -5534, -4765, -4203, -7927, -9463, -9831, -13574, -15682, -11893, -4949, -6560, -9097, -4037, -5878, -7441, -6073, -7986, -7848, -7681, -12539, -11945, -3044, 3014, -418, -9051, -10397, -8166, -11306, -13849, -11833, -8417, -5871, -5818, -7536, -7271, -6322, -5617, -5359, -2994, -5216, -6529, -5608, -6708, -4017, -3890, -6159, -3222, 1968, -84, -2908, -4518, -5992, -4084, -1326, -2803, -935, -117, 327, -1442, -3483, 2906, 6105, -801, -1926, 1579, 2529]
16827B529n6k310o226k217j607L899N326K5j372l487N219k377p2M151j984K17
16811c42m322k56j026J874j278M73l318L06L970K476j96K735q57j8J371j200n91
16794a99k058J82j292J2L934o37l030m253o99K361K648p57m996n390K419O325
16778e430J581p81k052J344L596L622j711k364J553j78k5p52l831J946L209r47
16762a220j648L632R10j300l954L041k941m116J13O22J034N51j323M28n305j957
16746a3433K145K799J073J03M10j027J281O224n55m055m242j969j91L955J432
16731f050N241L541J201m369j805R48m149q35J041j087J870L665K283N23L767
16716E785J438l330o388l373j157J485J307M41m866j951J688j762P523M872l923
$$ y = [2529, 2473, 163, -6063, -8280, -9887, -5988, -662, -637, -2009, -5496, -277, -2654, -2726, 1425, -559, -342, -4664, -4920, -5946, -4072, -5350, -4877, -8195, -7889, -3919, -1443, -1639, 1096, 239, 221, 1592, 392, -199, -2257, -2075, -3367, -3355, 579, -58, -3088, -7341, -8040, -5679, -3031, -3788, -8784, -14174, -11755, -5430, -3849, -4630, -6682, -5338, -1742, 1880, 169, -2195, -642, -820, -845, -1597, -5428, -3482, -273, -1220, -2868, 764, 1674, 374, -3580, -539, -3480, -7596, -7483, -6861, -5827, -5276, -6599, -6171, -11476, -13433, -11288, -8489, -7416, -7313, -6903, -7930, -6649, -425, -980, -5035, -9277, -11246, -11437, -7482, -6050, -809, 2732, 3933, -436, -2241, -1293, -5442, -6277, -5236, -6323, -4453, -788, 1495, 2018, 5785, 7223, 3893, -2495, -5868, -7025, -5540, -4233, -3792, -8658, -10609, -8921, -10683, -3160, 1712, -2211]
16701b211k140K649p37l641k257o516j075qM869J523m0K294l59L380M56j760j025
16684f598K405l1p13k564n77l3K050L734K944K265k667M9N079j557o698j676L859
16667g29J686K922j193m0k959m941K19k65J883J05n17j657M97M829J069M11J88
16650A508J100o390n42J836j406J996j107%l03Q260M02q592o343J108m302P109
16634e666K192P28m474p676J381P566N883N419K098k525m124j907J34K554L761
16619E344l226M09J260M27n367k455j654L386L221L050j707J313K021l981o285
16604d244l373l029K3L733K190J091j209m033K496M121K150J962J358K74l687
16589a77j765j299K721q1l140j829J270M741N13j936j899k99n546k119J349L474
$$ y = [-2211, -4351, -1702, -2439, -6080, -8337, -14853, -15928, -15936, -11067, -9544, -9584, -7290, -7649, -4269, -3813, -5573, -6598, -4193, -4224, -4937, -7501, -8078, -8111, -6061, -2327, 617, 2882, 215, 264, 5343, 3786, -2912, -4588, -729, 957, 3879, 2686, 2646, -313, -5254, -5035, -5300, -3417, -3312, -3829, -5486, -4989, -160, 909, 1320, 1508, 2608, -3782, -4324, -2488, -3894, -1898, -3005, -3005, -3308, 4952, 5354, -3238, -9581, -8473, -12775, -5666, -3474, -2746, -7220, -14896, -13515, -5949, -66, 5353, 7451, 4926, 802, -1105, -971, 1583, 5344, 2118, 2527, 3787, 4214, -1153, -3608, -5262, -1876, 1345, 4395, 2688, 4001, 6022, 2041, -4244, -7617, -10646, -10623, -6890, -4700, -3609, -4818, -8851, -6355, -2234, -84, 1878, 3236, 3510, -177, -1942, -3241, -520, -601, -3741, -5570, -4300, 441, 954, -982, -2881, -3180, -8726, -10845, -9496, -6022]
16573f022O750J623L330q694k296j684J355L696J085o933j014l16Q49K259N909
16558a03L18j368L315J188j353j617k077k3M524j724k702k016j116j987K599N483
16542A341J020j592P30p417l700j456O06K409r59J315K231l046k163L073J055
16527f553K77j686M03l81n33N367L606M038L75o629o01M578K194J494R2o52p40
16510D649k359m418j987m136L402L215P3k78j254J010j365n834m9J476J949j8
16494e924k463r76J363N766n74l818K122J321K268K402K09l154k501J74K637R13
16478b35p36m29l483q36l840R93O721k014K9M509M886K555L712J759m554p025
16462B012n00k132k292k360J267L426M077m892l766J430l09r96J097n09Q478M968
$$ y = [-6022, 728, 2351, 5681, -3013, -5309, -6993, -5638, -1942, -857, -7790, -8804, -9120, -8271, -6012, -103, 215, -1153, 2162, 3350, 1997, 380, -1697, -1720, 2804, 1080, -1622, -3638, -4754, -6741, -4142, 1341, 2361, 769, 1499, -5918, -9618, -11074, -10468, -8059, -9018, -7703, -5472, -8518, -10681, -7608, -6553, -6276, -7962, -7559, -7940, -8473, -3106, 500, 4538, 4913, -1716, -2317, 2261, 4455, 5949, 6041, 5389, 4649, 2290, -2128, -4115, -8251, -4849, -1634, -1561, -1839, -3093, -2083, -3448, -9282, -9331, -7855, -5906, -5924, -8387, -9363, -8000, -2234, -2808, -6626, -4504, -3183, -915, 1487, 1696, -1458, -3959, -3785, -1148, -235, -971, -1400, -4883, -5719, -9559, -8566, -1845, -3859, -3830, 679, 5565, 8120, 11832, 13591, 9037, 2012, 1512, -620, -2912, -5272, -4005, -579, 3498, -1394, -5160, -3730, -4039, -5035, -3938, -4447, 4031, 8999]
16446H999j0860q183O5P918l20J666L080j913j983j17J221J402k016l267k011
16431f319r88L196M603J011J626l193P8j384k75J356J380m110o461R7M824M596
16415C7L185L115l112m457J075k900l099K091n92M444O327J830j885n20m530k296
16399a287L326j036J996K76K548N795k787m355K251m265n354L194J392j362k131
16384a799k243p73J000j814M18J37J508K745M440J871l299n838l401M500K904
16369C56j162N59J131m46l399m743J369N561J530k485q39J011L024l164p48L940
16353A495N64n281m980o358O706J991m435j117R69R97L045K588n84K270K485r85
16337f30k279k498J494J56N62J63j09l07M228O63P33l201l660j146r8p65q89L997
$$ y = [8999, -1861, -10044, -9979, -2061, -2381, -715, 2365, 452, -1531, -1648, -427, 975, -1041, -4308, -6319, -7307, -4111, 492, 1503, 3129, -64, 14, -1370, -1645, -289, 1091, -3019, -9480, -9383, -4559, 37, 3222, 6337, 3225, -1232, -157, -3057, -6156, -4065, -4657, -213, 6114, 7944, 6059, 5539, 1009, -1287, 2039, 1003, 2999, 3275, 5823, 11618, 8831, 4476, 6727, 2462, -2892, 302, 1694, 332, -1799, -4042, -4815, -3815, -5629, -5211, -5074, -3566, -821, 3619, 5490, 2191, -3647, -7048, -2548, 356, -806, -247, 884, 438, -2961, -7704, -6335, -774, 756, -1729, -2568, -1557, 1467, -1697, -2445, 1495, 2059, -3222, -8202, -14560, -7854, -5863, -10298, -11415, -10446, -9449, -6404, -3816, -4400, -2130, 355, -630, -2909, -5407, -3913, -3757, -3195, -3032, -3141, -3448, 780, 1443, 2176, -1025, -4685, -5831, -5929, -6694, -7583, -3586]
16319c586L707q73rj197m216l057O851L157j656J08J249M472j206p111K165O49
16303e53l473l78j580L768j253o929l71J1405M919j232j844l776j505N55K022
16288b25M272q13n231l785l681K045N273J657o88j975j372q73l44q13m17J660
16272e310K399K407R41L6j777J985k946r0L143Q29J175l122l160P38J665n738
16256f825m076J410L650k58L522N290J427o547k804K737L164J243m273J064O786
16241E510M771o466l537j734K468M274P73l173l376j73o77j445J010k743K836
16226a682n41j399O616j745j628L5p06K072K902q7l054o988k941J479L187k05
16210d685J833O415P38K695j489m763L680K479l849k107l970p98m777k242J15
$$ y = [-3586, 121, -752, -761, -1958, -6174, -9231, -2380, 777, -879, -771, 478, 4950, 3744, -3367, -1202, -553, -4026, -4404, -5984, -2216, -3469, -10398, -10769, 636, 5555, 4323, 2479, -1297, -2802, -2247, -225, 4047, 3234, -1997, -5782, -9463, -7418, -2145, -488, -1176, -3151, -4523, -5396, -5740, -6553, -6970, -5310, -2911, -504, 437, 473, -1304, 681, -2265, -2355, 788, 1617, 2792, -330, -3490, -2752, -1087, -6825, -10901, -9491, -5841, -6099, -2577, 2713, 4140, -2407, -5211, -2474, 690, 1933, -2340, -1276, 5510, 10281, 3815, 278, -1456, 1012, 5286, 6059, 2886, -490, -663, -1340, -2785, -1775, -4518, -1682, -2223, -3622, 2994, 1249, -379, -344, -1050, 1022, 3924, 3837, 783, -6205, -9146, -7667, -4480, -4685, -2852, 3563, 4301, 6996, 5507, 744, 4424, 6903, 3054, 947, -3023, -3821, -8598, -10840, -10725]
16195a0725n53k290K707Q335n40J108J682n039j556Q61J763j886k008K220K995
16180b926L164Q53m010K52L809M090K47q94N15o32j175p45k142l910j369P431
16164B558L963j284k498j126n853L444J484k581l173N676L559l262k757n002n623
16149a2475j582J97K444N553J302l347J501N088j410l094Q59L824j701o69N500
16134A990k629p760l292K960M939R02n22K42J30K175J853K338J913o723l999M677
16118h06K789l647k950J0j391m80J414L99j734n096P117L710J352M38j189K80
16102B16j315k083L804j748k735k288k317J385J244j015l00K568j043j473j353
16087h453J213K786p50L380l578l018J224M396O268j929l829j273l411J914M207
$$ y = [-10725, -11278, -13568, -10861, -2526, -3066, -1958, -276, -5315, -6871, -6010, -4247, -6133, -8141, -5921, -2926, 238, 1091, -2919, -2667, 1142, 5232, 5479, 4585, 5100, 4468, 3293, 2548, 406, -3504, -4873, 2558, 6521, 5237, 2739, 1613, -4240, -796, 688, -1893, -5066, 610, 4169, 907, -1850, -6852, -12475, -14057, -13860, -11416, -5863, -4561, -7908, -6407, -1319, -2729, -5823, -4964, -1140, -2841, -3510, 1990, -639, -8399, -11691, -8731, -3792, -2890, -3412, -3170, -3040, -865, 988, 3326, 5239, -1484, -5483, -806, 1983, -1664, -4614, -4604, -5995, -6475, -5061, -4662, -6396, -11492, -4375, -665, 687, 1125, -64, 216, -1099, -3182, 622, -1126, -3861, -6149, -8466, -7081, -5837, -6852, -7152, -4584, -5627, -7100, -8453, -7240, -4454, -5204, -1824, -5402, -8420, -7196, -2800, 3468, 1539, -2290, -3563, -6974, -5060, -853]
16072h53Q36n49o354o437k541L213K722M586l090P6O332M800q6j494l197k797
16056d833n028N44O98Q77O549Q84m707P722K899j968M29J02m360k752J106j74
16040b012o53k207k027K282N361p65q98M9M2M636l44J490n039J130j472o789j724
16023h940K822L82K869n03p05N418K476n494l712K120k6K216j264N86rl47K525
16006D14l08m215j122n73J199j194K17l43p58L217m906l23m70J918N78J960L050
15989a659j39J177N208j88m401p302k338M624l56l072l387M368N292J623j245
15974a795J339J005o085q36K220l349L046L020k506j592L759J823j023j272m846
15959g092J416J891K831j51K89J108l706K01R69l839k388q91j061K151k659L083
$$ y = [-853, -17, -566, -6920, -13357, -15898, -12685, -9963, -5377, -8467, -8391, -2059, 2741, 2655, 1161, -2036, -4833, -9861, -9317, -8619, -7742, -1193, -309, -5016, 2706, 5605, 3637, 4066, 4168, -192, -2944, -1838, -2012, -2665, -4872, -6899, -4617, 744, -21, -919, -870, -828, 3808, 3464, 4954, -85, 1045, -427, -7216, -8940, -6118, -5736, -2867, -3370, -4075, 1343, 3819, -1675, -5387, -3267, -3293, -1077, -2341, -1755, -1764, -2111, 414, 106, -4109, -5231, -5804, -4605, -5799, -5582, -5925, -6683, -3466, -8372, -8695, -9165, -7247, -6669, -4709, -1659, -1798, -621, 4587, 4399, -2, -7304, -9642, -5018, -5374, -8446, -11833, -7465, -2173, -550, -1795, -456, 549, -5536, -6372, -4152, -7501, -4455, -1435, -3941, -5533, -1774, 49, -974, -2246, -7092, -5676, -3785, -954, -1105, -816, 292, -3414, -3213, -2244, -6083, -8471, -9362, -10423, -8272, -10931, -7848]
15943g848J582m46L513J424m53m6J183r79J48j803j33L345M259L742J566p72n197
15926C085O51J752n430o123l24Q200j627k039j463M824O84k208j026j914j184
15911d142Q53N442N11n24L47O14J225j740k790l539K194M719J449K151j593l277
15895A900k187j563k027l074k53J093j261M97J987L209j419m29m690k977l58J028
15879a0524K254j723m444k111N992M625L880J145J128J537n98n349k460K946j083
15864d785L748j21MK103j494k000L620J773j849j676K71M198n16N87n416J206
15848c47q70l445N78O370L162k919J173L95R38o365n116j953j836L902K254o71
15832d750M869K043r24J064n693j391N60j193M798J227j364k212J033L487M804
$$ y = [-7848, -6266, -6712, -3199, -1775, -2228, -2274, -1091, -2070, -1922, -3725, -3858, -513, 3746, 7488, 9054, 8282, 3085, 3736, 5488, 58, -6065, -6389, 1811, 184, -1855, -3318, 1506, 2190, -18, -1044, -2958, -4142, -3289, 2153, 2664, 2140, 2487, 3101, 4326, 2586, -204, -3743, -1549, 3170, 4619, 6770, 5177, 1900, -287, -1850, -3877, -6951, -7204, -6111, -7372, -6875, -4888, -1679, -3098, -3527, -8217, -11194, -11552, -10524, -8270, -9993, -14437, -16548, -10556, -5931, -2051, -906, 222, 1759, 1161, -4188, -6648, -3702, -4785, -1037, -1158, -1154, 949, -545, -2545, 1075, 2848, 999, -677, -406, 3792, 3276, 3863, -1553, -347, -1217, -4662, -4084, 2286, 5448, 2529, 3702, 4097, 5035, -1330, -6446, -8399, -10235, -6333, -4079, -4750, 119, 2162, 1238, 2302, -3391, -4782, -4222, -5415, -617, 610, -754, -2966, -1933, 1554, 6358]
15817F358j846J406Q15K967J078l283l287n495K073K168o487J656J273n633J704
15802d533J361O45Q04L254l135m234J497J141j464O96L02j506n7J553M7j751l651
15785i031m827K797L255l08P76M803L105j989j019j174l234l185K867K706L196
15770a262J236k211j919M457j801J325m153l858J219l16o32L138M20L035N136
15755C814l467k811K236j288l56K811M06o172P92O471N961m34N03j004o649k714
15739a901L551J661k052l112R16J065j529j333KK228m327k216L239j72k163J727
15723d416m5k900K932N045k178L05J847O88k582J64m776j568N174R92L95L893
15707B970J765k92k221J777k600m145q62j650R16j423m212K858O123K414L46j898
$$ y = [6358, 4512, 5918, 6733, 9700, 10778, 7495, 4208, -1287, 786, 2954, -3533, -1877, -604, -6237, -4533, -3172, -2527, -1723, 1531, -1604, -5838, -4341, -3200, -4664, -3968, -3666, -5172, -5229, -3676, -3629, -5380, -9031, -13858, -11061, -7806, -8114, -7338, -2535, 570, -1419, -2438, -3612, -6846, -10031, -7164, -4458, -1262, -26, -2237, -4156, 301, -1500, -175, -4328, -8186, -6967, -7283, -7915, -4777, -4357, -1322, 3814, 347, -2464, -228, -1516, -1872, 939, 1345, -4827, -4035, 2436, 8397, 7963, 8466, 7462, 813, -1901, 1650, 3311, 1259, -1853, -937, 128, -1401, -2734, -2732, -504, -4831, -7047, -3808, -3980, -6143, -4416, -4461, -7361, -4429, 616, -1562, -1257, 590, 1278, -1304, -1140, -5916, -7484, -2310, -1318, -923, 2970, 4735, 4443, 2222, 3999, 1399, -2746, -3608, -5258, -4342, -5765, -9977, -7119, -996, 1418, 1764, -134]
15691a34k348P005N039j609j761j235m603l049L575n053p3J888M612k68Q5k784
15675g13m595J718k091L990L072l139k764l467k176M123m677m398P480L474l315
15660g478k26K334l507o016N99N923J65N826L13O93P687J13l739j647L88l697
15644b269m072o2k253p43M706M957K547m667m150Q05R70K56R41M767K626l708
15628F51k339J1L291R16j916K430J665K947K603m47m261n27m937k461k564l38
15612e276k046m55P46m11N027j466J937N64j115r42R34N170n536l740m204L117
15596g696J482l41N507K58k767r14Q592L292l597P14j835q63l207k234k380M12
15580e577M489J27K275K218k065j254p10N67o88m103J753N062l68j011L689j212
$$ y = [-134, -2482, 4523, 9562, 7953, 6192, 4957, 354, -2695, 880, -4173, -4246, -2358, 2254, 1986, 2071, -713, -5308, -3590, -5681, -1691, 1381, -1758, -4522, -7989, -10165, -6042, -10719, -15117, -7637, -4163, -7478, -7704, -5370, -8877, -14893, -14294, -8371, -8206, -2380, -2067, -1374, 6313, 6426, 2687, 1040, 1428, -2269, -6341, -6403, -8656, -9399, -4693, 264, 2811, -1856, -6006, -5201, -4231, -3975, -3034, 1733, 4359, 651, -1688, -1677, 1614, 2530, 614, 3044, 4709, 7656, 10259, 9812, 5551, 5024, 87, -2374, -4938, -5276, -7322, -7777, -7031, -7442, -2415, -3881, -1944, -1380, -2495, -3437, -2503, 2667, -2869, -6609, -10813, -7696, -6214, -6555, -1048, -790, -3557, -4471, 4121, 7413, 3816, 4530, 2695, 1832, -1375, -3609, -5989, -5577, -1088, -961, 1314, 3532, 1467, 213, -497, 70, -618, -4721, -2968, 2094, 1726, 715, 4404, 3192]
15564C192l518l173j342O718N437k540j769n768j420O51k520K306L430L446K19
15549C349p42l445p91k885k010N685K00L29k782j695O804P032m421k114k737r3
15533c16j443k691l106K376Q88L765m04j267L505K742J226k732j881l890k312
15518e540k731J628Q273K307q56j629l619n9M859N615j007r39J510L265l432l500
15502D145l670j227Q24q43l168j682j21J582J943M489N91p10J610J988n76J286
15486F461m7L83M86l666l821J656j57m026J099k387o854J92P641k610P82N518
15470F50j37m894Q10K453N308K718k484m845k150l24K166O88K545P33N33m763
15454i93k862m537J2P100l219j921o67j602M468L008K255L3L400K561m853p59
$$ y = [3192, -326, -3499, -4841, 1877, 7314, 4774, 3005, -2763, -4183, -3532, -6052, -3746, -316, 3130, 3349, 2607, -838, -1629, -4514, -6524, -839, -639, -310, -3092, -4787, 2017, 9049, 4628, 2514, -223, -316, -1759, -4450, -7556, -5180, -4292, -527, -931, -2198, 1307, 4049, 5275, 2543, 662, -3228, -5540, -8271, -6643, 1630, 3937, 3081, 1452, -2167, -2226, 2633, 8248, 7241, 6302, 7812, 11077, 7645, 4145, 475, -752, 72, -771, -3939, -5621, -5742, -4160, -2217, 2272, 2863, 2153, 3763, 5751, 5175, 6461, 6414, 6797, 7283, 3617, -204, 1452, 1295, -2731, -1632, -4019, -10873, -10681, -3040, -5650, -4868, 650, 513, -4381, -3571, -1118, 4190, 6908, 4424, -421, -2571, -2895, -729, -41, 2504, 3237, 3770, -993, -3855, -8392, -8380, -1280, -4499, -6420, -7087, -8689, -4221, -1213, 1042, 1075, 4475, 7036, 2183, 1424]
15438A424K072j578Q32K879J247m163L965k515m479J061N162m26m279k243j864
15423b905M442J377l568K346n073m825k881K682M873J931L274L886K509K8m248
15408C848p27l346j776L331R01l328J981L419o78j158l849J686N545J186J87K584
15392I806K209Nj214k620k673l695J212M066j804j170m460m293j548n78O592K672
15376B507k859j105M991J587j851N50M671j652o44K893M27l274l458j43j399L30
15360A571J285l726K607k656l789o782K778Q319R30l862m492L677J522M158L686
15345E226k652M154J927M318K885o2k760j703l505m137k571P10j336m974k171
15330f651M371K894Q231N172j595p000J03j312j763N50M923J571n945J38J098
$$ y = [1424, 3496, 1918, 2750, 5629, 6876, 2713, 6678, 4163, -316, 745, 5907, 5481, 1202, -1041, -2905, 1537, 2914, -654, 1692, -3381, -8206, -11087, -8405, -3532, -1601, 1673, 5559, 8068, 8096, 3848, 3121, -225, -2001, 1330, 2231, -1097, 884, 4303, 3625, 2467, -1382, 304, 5849, 7035, 7222, 9806, 12015, 12020, 10806, 8186, 5513, 1818, 3030, 7096, 5292, 4122, -338, -4631, -6179, -6757, -165, 2507, -352, -1457, 3534, 5121, 3270, 3820, 8491, 6839, 6195, 9088, 9515, 6241, 2783, 2640, 1241, 1571, 2856, -870, 1737, -919, -4708, -11490, -8712, -393, 537, -3325, -7817, -4140, -2618, 1540, 5226, 2574, 6728, 8655, 12973, 15858, 15796, 13036, 11333, 7828, 3691, 1120, 1830, 494, -4480, -6651, -2280, 614, 8845, 14017, 12422, 5422, 5525, 4213, 2450, 3000, 7923, 9494, 3549, 3687, 4785]
15315D785k489l785j828J352M128L602k632l99K737M669K415m399n247j353L302
15300D858n511J622k219J045J236j994J009K296k094J307K760k732l15K603K929
15285F800m601m641l943l445K044K451J186k225j943L652N005P14J81Q06m211
15270b170k120K190q79K923M530l497l534P31J305K559l111R16N857K607l411
15255D896p929k288J581J43O53M526J584l700l077L574J269j050K792k659o50
15240c35J354j919M225J206j142m265M85P527m48m654Q90K713Q97j622O15J663
15224G190p10k898j274J546j718r69P26P32om64J686n080k709P85K918J931k04
15207A482J353M624k194n721p99l1J126L844k192j028n31k179k880N16O217L859
$$ y = [4785, 2296, -1489, -3317, -1965, 2163, 5765, 3133, 2734, 5471, 10140, 12555, 8156, 2909, 1556, 4858, -653, 969, -1250, -205, 1031, -963, 46, 2342, 248, 1555, 4315, 1583, 1268, 3871, 6800, 2199, -2442, -6385, -9830, -7786, -5335, -4149, -6374, -8317, -4665, 340, 1054, 1235, 2041, -2170, -4290, -2100, -2979, -56, 4474, 977, -2557, -1826, -521, 2038, -1073, -157, 5700, 8307, 4896, -3033, -5321, -3740, -3597, -2944, 1582, 3166, -534, -3611, -37, 1232, 182, 2974, 315, -335, 1019, -900, 3325, 4531, 3389, -876, -391, 7136, 6688, 2034, 2924, 5637, 6534, 4912, 5527, 7190, 6480, 3582, 2308, 3854, 2136, 1167, 1893, 2625, 2619, 2155, 3841, -1239, -3948, -3163, -245, 1686, 1482, 2835, 7459, 5265, -456, -1255, -1286, -160, 3684, 1492, 464, -67, -2246, -5126, -4610, 1607, 5466]
15191E466k85p44K523K208k921l195l562J618O625O022k15m689j556k484k157
15176B654l241K13k290R21j663J141N297K423m119m440J721K36k357o522J119
15161h907N243O328N101j486k426l467L21K250L892J58K002M557J071j542k795
15146A0300n647K323K978K690O36l769m066k198l037J808j315k389J674L000j851
15131A137m90J684L009M719K2L324m841n184k570l903m94O904J100r21p50N24
15115C270n191n36N13m09Q74L691M35q97J113J428l439l430J300l761j598K202
15099d435L160J852R04r61n26K654P660l720n282Q37l904L46J614J874N157N46
15083G776R5O90K950R58n414j238K528j855J285j935l985n333R19L850O207K918
$$ y = [5466, 5181, 4437, 6960, 9168, 6247, 3052, -510, 1108, 7733, 13755, 13540, 8851, 7295, 4811, 2654, -587, -374, -2664, -1743, -3406, -2265, 3032, 5455, 1336, -3104, -1383, -1147, -3504, -10026, -8907, -3664, 2664, 7765, 6279, 3853, 386, 707, 2957, 6849, 7007, 9009, 13566, 14637, 13095, 10300, 4653, 6976, 9954, 12644, 13280, 9511, 5445, 3247, 210, 2018, 703, -1686, -12, 2988, 1137, 647, 2331, 5340, 10059, 10081, 13405, 8564, 3380, 810, -3093, -3587, 3317, 4417, 3496, 2746, 3270, -1921, -2457, -1944, -2353, -1479, 2212, 2647, 1750, 2863, 4291, 852, -2578, -1278, -5039, -6637, -4435, -1275, 577, 1481, 520, -6, 2648, 10308, 6588, 1306, 2143, -1761, -1415, 199, 2073, 7230, 7776, 7871, 8561, 11511, 12469, 7055, 5817, 8345, 6490, 7775, 5840, 1855, -3478, -2559, 1291, 7498, 10416]
15067A0416j411m027k720J834J921J099N962m20p851j642J945L968n3j841n67
15052F613Q00k565J788L135j059j918M681J660k252j447Q55p734L64K25L354J1
15036F511R37n84J081L066r30m616k527%J259M243L05l415p73K367P40l948l78
15019C338L413M99K205J469O67K212k143n82k603L02P03j840m989j457K991K510
15003F695j243p49j671J925q37m45J330j989j216K720J576k933N886N079o154
14988G974l471l093M91k862p19L14K36K891j566l656j252K230L557j123K954k80
14972B625M407l310k550l91M912k628k185m407l04K921L250N516N5m321J323K191
14956G104K324n83R8L763l371m352p915l096M012K832o74m298M399M713j462l184
$$ y = [10416, 9005, 4978, 2258, 4092, 6013, 7112, 13074, 12654, 4803, 3161, 5106, 9074, 9021, 7180, 6613, 7413, 4848, 6636, 9771, 8712, 6794, 11475, 13135, 10883, 9436, 10291, 2557, 2921, 3146, 6500, 6511, 7448, 6864, 7945, 11011, 10081, 5465, 2938, 2938, 4197, 8440, 8745, 5330, 4557, 6924, 7664, 3716, 3338, 6751, 7250, 9455, 10924, 11591, 13803, 11660, 11078, 8475, 8777, 9480, 7640, 2651, 1194, 4185, 6695, 5452, 4703, 3032, 4957, 4120, 3675, 5005, 3016, 1800, 4520, 6096, 3163, 9049, 14128, 7974, 4503, 1410, 1901, -961, -1680, -1366, -1130, 1761, 195, -3461, -4713, -2483, 1074, -49, 2905, 2625, 7032, 3722, 1172, 781, 5693, 3065, 880, -3527, -3831, -910, 2340, 7856, 7911, 3590, 4913, 7104, 9428, 8845, 8943, 12706, 9335, 4983, -2932, -6028, -2016, 816, 142, -4156, 243, 4956, 3494, 310]
14940C10N441K750m232m207k942r95L571K329M356R94j42j71L9l43R48L081M00
14923A1187p33p930P41M064L952m236l823L753J014Q70J331k64m311n88j01j398
14907C528m339l865k649K501N838M618J63k061L89J098q965o165K84J715J037
14892f873j294l61M074L969J58j78K588K439L221M699K0m507l904p020k788k133
14876g890K668K384Q55L146J65K593J540J465m120n603l168J278M595L09K566
14861B783P87l8o78k446J546l82J667O026j432k79j677l802K147O53L838m959
14845C754j644K793J356J774o177n373R06k294P42L711J426q40M190P92K349k603
14829D862m505j629K812j683J353J153P24k000l055l766j082l14L573N442K7N36
$$ y = [310, 5751, 8501, 4269, 62, -2880, -3875, -304, 2025, 6381, 7375, 7233, 7062, 7101, 6758, 7706, 10787, 11187, 10454, 2524, 3265, 7329, 11281, 7045, 3222, 6975, 7989, 8859, 10190, 9926, 5615, 5027, 4926, 3528, -811, -4676, -7325, -4824, 1014, 5632, 5795, 3734, 4123, 5221, -3744, -9909, -9625, -7910, -6873, -8167, -8528, -4454, -485, -327, -505, 2083, 4522, 7743, 12442, 12462, 7955, 4051, -2969, -5757, -7890, -5222, -2838, -1983, 1163, 1328, 3921, 5461, 6926, 2806, -2797, -5965, -4687, -92, 217, 2783, 3570, 3532, 2854, 408, 1954, 1572, 3239, 9265, 7833, 7554, 5877, 2075, 4222, 4875, 8713, 3754, 2110, 4903, 6259, 8033, 1856, -3517, -2611, -4905, -4163, -452, 974, 134, 4324, 5116, 7465, 4862, 357, -1272, 1540, -143, 1210, 2363, 3087, 1087, -1968, -5734, -6816, -7130, -3557, 1885, 1912, 2448]
14813B448k979k980J628J194m063k908Q9M55L383N917M944O403k230k604l342
14798E355j089m99N803O051p030o533k91J439q58k447j08J968M419m226j112L458
14782D300l04j893j017j646j323l593J428L118N631K156L198j058L32k372p41
14767F216q5l597K500N208m989n322k653J680K057j065K846m035K516N333L413
14752A0023n554k879L333j203k048N306K376k307k778j11k218j155j275K533L463
14737E506N579l562o315j155j206L197L794j235n182R82p22L054j015k064K812
14722B468k309k983N146M515l102l117j788k396M02j871K008m09O599L308m566
14707A905m108k83K636M542J001J013l033k207p92n62k769j674K826k574J741
$$ y = [2448, -531, -3511, -1883, -689, -4752, -7660, -7571, -7116, -3733, 2184, 7128, 13531, 11301, 8697, 5355, 4266, 3767, 9570, 15621, 8591, 2058, 1767, 3206, 2348, -99, -207, 1761, 6180, 1954, 842, 4300, 3996, 2103, 1086, -560, -1883, -5476, -4048, -930, 4701, 6857, 10055, 8997, 9329, 6957, 6216, 6131, 2534, 5034, 10242, 5253, -69, -2722, -1042, 1015, -50, 2796, -1239, 1277, 6610, 10023, 4469, 1590, 4923, 3720, 1672, 6978, 9354, 7047, 4269, 4158, 1940, 785, -490, 2043, 5506, 11085, 7523, 1208, 53, -1153, 2044, 5838, 4603, -579, 403, -319, 2735, 1720, -344, 2468, 159, -2824, 2322, 6837, 3735, 618, -1170, -3566, -3164, -5035, -3027, -3436, 3163, 6471, 1905, -2203, -2486, 150, 4692, 5693, 6706, 3673, 1466, 674, 112, -2657, -4331, -1505, -4079, -2338]
14692b338J0848N623l466k435J613l729m726J86L073K961N747k857k007L373k047
14677I819n398j606j011n62P08l178j335O669O194p89k721m023K531l422n196
14662c320J127N914L090k843J536j833K054J691K004J759q12o836m350L856L200
14647F237L524k367J770j035m093n260n237K10M013J024j259j281m157P494j458
14632a875P50K831k758k731M518O716K38n037l731r51N191J397o934l841J869
14617d348J250M415q26L921K467K123N12j834n232J720k006k172Q788N936p059
14602G655q351O63K203N574J985o96j397K289K033p17O90O85K374j330m698j004
14586G958k889l712L076K653j758N12K07j195j540J941J522K283p69l413k988
$$ y = [-2338, 8510, 14133, 10667, 8232, 9845, 6116, 1390, 1576, 4649, 7610, 13357, 10500, 8493, 11866, 9819, 4421, 2815, 1804, 1242, 1950, -1228, -2563, 4106, 10300, 9511, 6790, 2767, 5298, 1876, -3320, -2193, 3721, 6811, 3968, 5504, 3671, 5725, 7416, 9420, 11179, 10367, 3531, -819, 3037, 6237, 9761, 7394, 9164, 8129, 4036, -1224, -6461, -6251, -2238, -1214, -2473, -3754, -7911, -417, -1875, -1125, 1706, -1052, -3783, 735, 7451, 7689, 2652, -1079, -2030, 3161, 4558, -2376, -6217, -4348, -3098, 1317, 491, 4412, 6879, 9002, 9514, 7680, 2448, 4168, 2162, -10, 8778, 14714, 7655, -696, -33, 2170, 7744, 9729, 9033, 7636, 9925, 11958, 11241, 11931, 12616, 14990, 13660, 8962, 7958, 5069, 1357, 4433, 7086, 5328, 5840, 6047, 4852, 3312, 5253, 6775, 9058, 8289, 4876, 1888]
14571A888K453J276K078M54j827n996k106J695L101r06m107K463M713K501m212
14556C468k135L04K419J5j581J101J576k067P16K512L798n246m330o33M099J298
14540E314o0n427j238M762r63j868k871m72p4P4J607L567L845J477l069k997m317
14523b710m73J294R78N709J881K324m122n803K021r92L7r67M439J915J074P23
14507G328k811K040m041l357j585O351O73j734k855M37N07l011k629J316r89J464
14491b896M889N391j008n748j523J447o14r92J516J717L427o5m533k032L186O048
14475H210k798j773O54Q01M128j064L602L925j405n692j372l25j658N34j693J334
14459E408J346j01K783Q1n060J594l44m35L219Q97j065j894q155l337n01L980
$$ y = [1888, 4341, 5617, 7695, 8149, 6322, 326, -1780, -85, 3016, 2110, -1997, 466, 5179, 7680, 3468, 1333, 1637, 4056, 4071, 2490, 3591, 5167, 3100, 3816, 6328, 10126, 4880, 550, -83, 4016, 5314, 5254, -173, -1411, 3351, 2388, 520, -2351, -2823, -2897, -2823, -1216, 2351, 6196, 7673, 4604, 1607, -2710, -3183, -1889, -911, 4798, 6679, 9003, 4881, -922, 1099, 107, 144, -823, 3616, 5531, 6605, 7328, 4517, 6557, 2516, -841, -2426, 3925, 4598, 2864, 9, 446, 953, -2058, -4687, -3371, -4360, -2896, 1993, 7384, 6376, 628, -895, 552, -62, -1054, 462, 2179, 5606, 5541, 1008, -1024, 2162, 8210, 5412, 3639, 4293, 5094, 9222, 8158, 11760, 15685, 14280, 8588, 7216, 6891, 5233, 5767, 4074, 5408, 6754, 6653, 9436, 9517, 4457, 6051, 5707, 5272, 8491, 9388, 8323, 6429, -1726, -5063, -5564, -1584]
14443a584L115k488j893L013j582K273J651J977K860k190m829k430R32K181J202
14428B208K09M033J161j496l629M750K271o337r224K541O370L448R290J370l256
14413A3709m326k792q59o92k24K043K467J35O02l477r30K58j97l133J724K84o603
14396b011L782K414r79K57K631m590r3L502n613k792L81K467M349L375l65J465
14380H180K399j536k190l25L727k010j554j438o636J63M561K735K188O74k067
14365F871j575r75k955k077l44L294j042K126K684l443m485M088j084l757P80
14350a894L655J241K696l343j147N48M024m598m837O32N387m66K929J897K743
14335I467o57j951l203K980J8L50j534j98n299M791J534j969k325L864Q7r54J334
$$ y = [-1584, 1531, -957, -2850, 163, -1419, 854, 2505, 4482, 7342, 5152, 323, -2107, -1175, 1006, 2208, 2417, 6450, 7611, 6115, 2486, 7236, 9507, 3170, -6054, -3513, 2857, 6305, 15595, 16965, 13709, 9383, 6591, 5732, 5040, 4816, 6859, 9326, 9461, 10063, 6586, 5656, 5914, 5717, 2584, 4308, 4592, -2011, 1771, 4185, 3206, 3463, 6094, 1504, 1411, 4913, -700, -3492, -3111, -644, 3705, 7080, 6715, 8180, 10579, 9043, 6853, 6528, 10255, 8245, 6691, 5253, -1383, -1220, 3341, 6076, 8264, 8938, 6871, 5296, 4321, 1366, -711, -1055, 2239, 1197, 3323, 6007, 2564, -1921, 2167, 1083, -2674, -1894, 1761, 3002, 5698, 2355, 1208, 1756, 5780, 1182, -3655, -3023, 2364, 1898, 4827, 6724, 9467, 8810, 6859, 3656, 6636, 6654, 7004, 5470, 5272, -27, 4764, 6298, 4329, 2004, 5868, 5955, 5001, 6335]
14318F335p68l482l357J150k589M932j90K30j465R35J841j750K539L783J39o552
14302A731O94K197J929K29k77o894k172M881J112O5J42L362K68l29j498m235M891
14285F096L99o661L31P86N863K016j143l130p70j058P5Q41K034k455n686k288
14269d750k979J15J549N622J100m35K077R264L955m716o651k412j549j176L603
14254B617K20l384m010K301K367K756j362n800O75M081L646K549l438K08k653
14239G73j51K365L404m5L811k336o791k64O20k930l300J754K04L318P409N699
14223A3540l371m366k422M116k311j74J188n76j642j751J825L678l187o440J507
14208c86O212J574M46n58j43k34R78k50j310q37k596J822N142L883K618k672n042
$$ y = [6335, 5567, 2085, -1272, -122, -2711, 2221, 2031, 2261, 796, 1731, 3572, 1822, 4361, 8144, 8283, 1731, 2425, 4622, 6551, 6780, 6503, -391, -2563, 2318, 3430, 3495, 3637, 6999, 7267, 6938, 5440, 1205, 6096, 6495, -166, 165, 951, 6814, 8830, 7687, 4557, 3787, 2729, 2804, 3645, 5679, 3224, -2462, -4750, -7729, -7614, -6065, -443, 657, 222, 2299, 11563, 15518, 10802, 4151, 1739, 190, -986, 2617, 2837, -547, -4557, -2256, 111, 2867, 1505, -4295, -3620, 461, 4107, 6656, 3218, 3426, 773, 622, 2987, 6391, 6346, 10157, 7821, 1030, 766, 1386, -1544, -4844, -3090, -2886, 432, 7841, 13540, 10169, 5803, 3381, 7497, 5186, 5012, 6200, 5624, 3982, 2231, 4056, 7734, 4547, -1893, -386, 5826, 7400, 7846, 7288, 7145, 6911, 7889, 7639, 6329, 5492, 2896, 4718, 9860, 13743, 16361, 13689, 8647]
14191H647k697k542J873l47K453k234k690Q24L887L407l32r62N86J519l518l110
14175D764n033Q85j541J101J548n429R11L375L325M978N316j493k459l339j678
14160E231p46Q34q88O32O4j323J125o208k525K046M155j370L260J111P95k041
14144D152m021P93j160j324J989J452r15k210J898N627J020J464Q23k032m501
14129C055k875l047L236K561k423k021k269K662O123J355j504o440L685L378M889
14114A0365k162J560J921L883j699l393m727k602r30J191r77L068M87K164K777
14099A0926m219J674o75j268j87K417n90K90k32J451j292k0J90l309k791K792
14083E157N542J287j225L268O2k668n61O609O223L389J103n355o531l356m115
$$ y = [8647, 5950, 3408, 5281, 4934, 7387, 5153, 2463, 3287, 7174, 10581, 10249, 9287, 9873, 11392, 7874, 4764, -269, 616, -925, 176, 1724, -3705, -2794, 581, 3906, 8884, 14200, 12707, 10248, 6909, 5231, 4485, 5319, 4431, 5063, 5127, 3804, 4929, -1279, -3804, -1758, 2397, 1027, 4287, 5398, 6193, 4152, 131, 924, -236, -1560, 429, 1881, 966, -1244, 654, 6281, 7301, 8765, 9588, 7556, 3055, 180, -2867, 369, 2930, 507, -1514, -3783, -1121, 5002, 6357, 4853, -1587, 2098, 5476, 10365, 8203, 9763, 11684, 15567, 13868, 10475, 5748, 3146, 2216, 3407, 2430, 5498, 5985, 8149, 10926, 6707, 8381, 7706, 6438, 6251, 8668, 8078, 8368, 8136, 9587, 8295, 8275, 8465, 5156, 2365, 5157, 10699, 11986, 10761, 14029, 14091, 11423, 10862, 17471, 23694, 27083, 28186, 22831, 16300, 12944, 8829]
14068H829N21k797J084L628K445K531l585J838L955j436l56J231K072Q32n739
14053A5053m249K733N418j221L470J023J045Q54m521n773m584N63k36K095j61
14038A1509k297J962M498L071O74J885l692j018m74k589n652l122J469j223o54
14023D347M692K914j236M029M171j30K027k531r2m877l438l856l046j701o60J570
14007B183K676K231P15K319k226l542K327M699J206J992j528K75p176m000j467
13992F84M76K845P354Q83m234p20M00k166O832L215l776m057N04k897l88L037
13976G992K925K751J658m277n530K382J014r70l798N420Q126k898j428j990j381
13961I996j979k341J623J419K7k949M84Q70k238K356J069k342J31p6M787M91r10
$$ y = [8829, 9350, 6553, 7637, 11265, 13710, 16241, 12656, 14494, 18449, 17013, 16657, 17888, 19960, 20792, 15053, 10804, 13537, 18955, 17734, 21204, 22227, 23272, 24126, 19605, 13832, 9248, 9811, 9575, 11670, 11509, 9212, 11174, 15672, 18743, 19417, 21302, 17610, 16592, 16118, 13529, 7877, 4755, 6224, 5001, 4347, 9039, 11953, 10717, 14746, 18917, 18787, 20814, 18283, 18191, 13314, 9876, 6020, 2974, 1273, 613, 2183, 4859, 7090, 7805, 10124, 7898, 4356, 6683, 11382, 12588, 14580, 13052, 13327, 6151, 2151, 684, 1160, 4005, 11359, 12242, 8008, 7288, 7688, 5522, 12354, 15569, 11793, 7736, 8240, 5343, 4955, 7992, 10917, 13668, 15326, 11049, 5519, 7901, 8915, 7945, 4147, 9567, 17693, 14795, 13367, 11377, 9996, 8017, 5676, 7299, 8718, 8745, 5796, 6280, 7150, 4912, 7268, 8337, 5995, 6126, 6050, 10837, 11328, 10418]
13944A0418J061J661O178l456q119k310J81L379l90j058R5k246N42q4k186j864
13928A802k99L631k919k927O98j799j072L755m77k177O29K689K455N870l400m227
13912B232J419J506j482l262o17K08K121N58m514j764O342L115o314j870O090
13897C768L755K781J906j143J596r83j904l23l36p31O71m22k194j640j994j392
13881A415J51K555k091J897M274n23L600J547k343m435k027M266N033L11o473
13866G157o091k388J916J346J690J0l388k354K616J525M672O524n72R43m01j303
13850A1902j121p3j267j56J984j09p469p10o20M65L224k339M756j552k287p79
13834C849L394J635l506P316O105n765j310m921j203q97J111K646r17M47J806
$$ y = [10418, 11479, 13140, 19318, 15862, 7743, 5433, 5614, 8993, 8603, 7545, 7640, 5394, 5936, 5852, 3666, 1802, 1503, 5134, 2215, -712, -14, -1813, -2885, 870, 393, -1784, -1155, 1534, 3989, 9859, 6459, 2232, 3651, 5157, 3675, 413, -204, 4, 2125, 2683, -1831, -3595, 2747, 5862, -452, -2322, 3768, 7523, 10304, 12210, 11067, 12663, 11680, 9776, 9453, 9117, 8386, 9057, 8635, 6441, 4801, 2807, 1415, 1566, 4121, 2030, 3927, 8201, 7678, 11278, 12825, 10482, 6047, 4020, 8286, 13319, 13630, 7157, 1066, -1322, 594, 1940, 3630, 3640, 252, -2102, 514, 2039, 6711, 13235, 12663, 13606, 13205, 11902, 10781, 10708, 9441, 9285, 11269, 11160, 3691, 2981, 2361, 2826, 6050, 3711, 8467, 6915, 4628, 3849, 7243, 8878, 5372, 12688, 18793, 13028, 11718, 6797, 5594, 4697, 5808, 8454, 7537, 7984, 9790]
13819I790L253l265m162k376J891l974O25M83N65J963J765k652n908j127L282
13804A53K545R03J82K263J84j352o06k476J566M185k18k456l619j510K184L785
13788E713j490R06k61K0J155K748L992q38m507j288j53m480L31N236k179k883
13772B022k065M357L203P86K55M091N3l845l99L444L069l490O45J42L857k797
13756A3328m662j336P07J892l0l694J078Q35K303N9k966n860p77J67k788L486
13740A742M327n8L675J937J226n977l812L604m677j514J70K632J844l589L936
13725E466K129j110l602m143L076O863J718l607j370j567m371Q90O290j99J073
13710G536M28k858q4m682J281N315N65J365J348k421Q59j355m291p41K140K464
$$ y = [9790, 13043, 9778, 5616, 3240, 5131, 1157, 1782, 2265, 2830, 4793, 6558, 3906, -2002, -3129, 153, 2698, 3601, 3783, 6046, 6230, 4878, 4272, 1796, 3362, 7547, 7329, 4873, 1254, -256, 1928, 5713, 4223, 5129, 4868, 4888, 6043, 8791, 12783, 11945, 7438, 6150, 5997, 1517, 1848, 7084, 4905, 2022, -43, 4314, 7517, 8303, 8558, 12649, 12702, 8857, 8458, 11902, 14971, 11481, 12126, 12268, 16125, 13328, 8666, 7330, 8037, 9929, 9899, 6205, 7283, 8118, 10421, 10480, 7514, 1654, 877, 1044, -1744, 1742, 6069, 6011, 9686, 11623, 12849, 6872, 3060, 6664, 1987, 473, 643, 3275, 5119, 1530, 5466, 7595, 6485, 2883, -1260, 1816, 8679, 10397, 6790, 5420, 3853, -518, 372, 6662, 6463, 7536, 7964, 5106, 5022, 340, 1621, 6936, 7501, 8866, 10214, 7793, 8652, 7297, 3006, 2265, 4405, 6869]
13694F869K836J698J11k543j919k967q12L640M943J508l751k543j36P08o060J505
13678C087K22k530Q10N21J461L785L037m42l382J498l117O97l703n53M509J80
13662F080J328k448O63K355j312J56q64K719L014l50o595M200M264M250P09q056
13646A0113m890J29K615L832K067K29O95O35J202p44P2l644k557k284K078J640
13630A1188k268j562k198L940J149j384j2K375M055N726k967n633j259j438l458
13615F254O834L080l794j532K021l123J125L300j593k320m76j784O75m248J256
13600E675L719K250N82J888m001j747J008J216k212j730K724K730j312L453j101
13585A3142o222l475M002M055j731k978k620j859M330j030K101N585M982k177
$$ y = [6869, 9705, 11403, 11514, 8971, 7052, 4085, 3273, 6913, 11856, 13364, 9613, 7070, 6934, 7642, 1582, 3087, 3309, 779, 1589, 2110, 3571, 7356, 10393, 9951, 6569, 8067, 4950, 5647, 1944, 1391, 5900, 6080, 7408, 4960, 5623, 7978, 6666, 6822, 5958, 8677, 11691, 11341, 4746, 8946, 13210, 17460, 18169, 10113, 5223, 5352, 7967, 11799, 13866, 14095, 14790, 15425, 16627, 15883, 15955, 12311, 9754, 7470, 9548, 11188, 8920, 7358, 5160, 9100, 10249, 8865, 8853, 11228, 15283, 21009, 18042, 12409, 11150, 9712, 6254, 13088, 16168, 12374, 10842, 12863, 9740, 10865, 14165, 12572, 10252, 9776, 7992, 8667, 4419, 5675, 9394, 11644, 12226, 14114, 10113, 8366, 9374, 10590, 8378, 6648, 9372, 12102, 10790, 14243, 13142, 6920, 3445, 7447, 11502, 9771, 6793, 4173, 2314, 6644, 5614, 7715, 13300, 18282, 16105]
13571A6105o207k779q99K803N63m525n27N007n09k411K980N746K453l658J656
13556A5798L01l870o665l446m422q62Q685O446n47j542m833j117n86J163N672
13541A0175M46q72K668j719k940L5M769J732n2k621n794j526N73J710Q32m294
13525C122j614j155J208L163J646K831m63k35J29J558J550O90k782J807J649j53
13509A2951O60k996l886r52M45P258Q521J578l661o974p373l96n26Q11O027M101
13493A5588K371m085n707j383L514j800j924J832L938M63k085M665N84m022l799
13478H150m980N20K785L699O625k496k819K680K450l560p979J594L521p87R13
13463A0316k874j740l387J243J265O28L506K178n208j613Q45k231L039N346o3
$$ y = [16105, 9898, 7119, 6220, 9023, 9586, 5061, 4534, 9541, 9032, 6621, 9601, 15347, 17800, 14142, 15798, 16099, 12229, 5564, 2118, -2304, -3166, 5519, 11965, 11418, 9876, 5043, 3926, 3340, 4503, 10175, 10621, 9749, 12417, 10698, 7758, 7793, 12562, 14294, 14242, 11621, 5827, 4301, 4874, 6584, 7416, 3122, 1508, 353, 1561, 4724, 6370, 9201, 8738, 8503, 8632, 10190, 11740, 12430, 9648, 11455, 13104, 12951, 13611, 10615, 6729, 5777, 6222, 13480, 22001, 23579, 19918, 12944, 5571, 5175, 4649, 5460, 11487, 15588, 17959, 13874, 8167, 6784, 10298, 8498, 6574, 8406, 12344, 12807, 10722, 15387, 15971, 11949, 8150, 3170, 3690, 6475, 10174, 16799, 14303, 11484, 14164, 16614, 13054, 5075, 6669, 10190, 9403, 10316, 7442, 5702, 2315, 3558, 4823, 5451, 8957, 11135, 5927, 4314, 5159, 2928, 5967, 11313, 11250]
13448A1250j614k731J002L651K348j044L02j416M18J660L540J435n850j09J472
13433A4314k109K196j736O81m47k269n96l309k71k757l911M144K636L620K121
13418A2307j964k677J717L454p82j481l006k941L034N54L789L122m940j101J714
13403A0799n51n881M46J375Q48q7N11J884K39L108k461K257k39j727K45J415J52
13386A2333j263k136k73j269j309L260K273m402k471k950J998N99r9L559o13o61
13370F576J972K090l119J41N480L035N74k746j972l23k201l248k419l921j293
13355a374p56O299O098M53L030l57l052j38p52j860n690K621M940N74J075j405
13339I706o89l569R05L183N875j357j531J183k88k820K242q69j542j626K24J250
$$ y = [11250, 9636, 6905, 7907, 11558, 13906, 12862, 13164, 11748, 12166, 13826, 17366, 18801, 12951, 12842, 14314, 12205, 14401, 12665, 13346, 12899, 10630, 10034, 6725, 6454, 3697, -214, 3930, 6566, 10186, 12307, 10343, 7666, 9383, 12837, 12055, 10574, 7568, 4627, 7661, 8215, 12004, 15126, 10186, 9085, 10799, 10248, 4367, 4813, 6188, 7036, 6949, 7460, 9344, 9583, 12691, 10230, 12487, 12248, 10521, 10766, 12181, 12333, 11070, 8934, 8661, 7392, 6083, 9343, 11616, 7214, 4743, 1793, 3791, 4390, 4291, 7850, 7237, 6576, 8548, 10638, 7519, 7660, 13140, 16175, 16749, 14003, 12031, 11708, 9507, 6259, 3840, -81, -1374, -2130, 4169, 10267, 10720, 13750, 13393, 10341, 10203, 9451, 7591, 1901, 4522, 9462, 10036, 11111, 9706, 9017, 5448, 6353, 9536, 15411, 14054, 12523, 13706, 13418, 10598, 12840, 11971, 10429, 8803, 9027, 10277]
13323A0277Q4l331p44K46K640L438K560m559l560k781q93K523J323O131k2j707
13307A1625J307m00l33j128N78q515J356K655k059N09L434J467P081j113n148
13292A1316M152k429m433R23P88O531m106n520j449J715J333k091J252l143j803
13277C036r5L801o31k937J786j371o5M888L206K531n05q329k196N383P045K330
13261A7877R7k659m302k122l434k672M064N40O89l920J09J70M505K095o02n45
13245I890K820L674j634P18m670m962j176N349m823j235M310j50j359J926j353
13230G325k283J332J184J226R73n457k487J0035j463L097J990k004l066M449L517
13215A8368m71l419j69J422K866l111l255k315m552N42L452L824J582k419J590
$$ y = [10277, 10361, 7030, 6286, 6532, 9172, 12610, 15170, 10611, 7051, 4270, 3377, 5900, 7223, 13354, 13332, 11625, 12932, 12532, 12199, 11071, 11649, 3134, 4490, 7145, 5086, 5595, 9029, 10496, 17577, 16464, 11316, 15468, 13039, 8606, 9529, 10317, 16848, 12742, 7222, 5773, 7488, 8821, 6730, 7982, 4839, 3036, 2941, 6742, 6111, 3174, 4960, 3589, 3524, 8412, 11618, 14149, 13644, 5315, 3119, 8502, 15547, 17877, 17974, 15315, 11013, 8891, 5457, 2785, 6849, 7389, 8078, 4158, 4267, 4437, 8942, 11037, 10435, 9890, 12710, 16384, 14750, 15468, 10798, 5836, 4660, 10009, 5186, 3951, 8261, 8111, 6752, 8678, 7325, 5042, 6374, 7558, 8784, 9757, 4300, 1813, 11848, 10385, 13482, 15472, 13468, 10402, 14851, 18368, 17897, 14478, 14309, 15731, 18597, 15486, 12231, 9916, 5364, 5906, 9358, 13182, 14764, 12345, 13935]
13200A3935k113k883J300l0M581K559O83m899l510M897J660j331k55j125m275
13185I194j096J239O236K874n063N05K685j769n949N91Q25J866n40m416k97Q13
13169G698m17j754n51m341J78P123M208J255J217o07m65l090o07K610j013k760
13153H684o94L613j16k923l611J67J012L118M539j920j401K609K566j795j835
13138A2013K32q58j087o03l218m84j204K577L353j014N062Q224K271j149j896
13123B2219l674j711j424j682M14L422p223j664j245j366P94N100J675L404k461
13108A4578J195L51j027L196J347o208R2N109j435o302m022O78L881K514K038
13093A5985k772r35O488J413r60n681o6L558p97j340N2k66k088j878k469j310
$$ y = [13935, 11822, 8939, 10239, 10209, 14790, 17349, 18032, 13133, 9623, 14520, 16180, 14849, 14594, 13469, 9194, 8098, 9337, 15573, 18447, 13384, 13889, 16574, 14805, 8856, 9447, 10272, 12138, 11598, 7182, 6885, 7698, 7281, 5527, 4976, 635, 813, 7936, 12144, 13399, 14616, 14009, 13544, 10454, 9847, 12457, 11444, 8684, 7990, 11603, 11487, 8564, 4953, 5120, 6132, 9250, 13789, 11869, 10468, 13077, 15643, 13848, 12013, 12245, 11387, 10300, 9697, 6479, 5995, 4791, 7368, 10721, 9707, 14769, 22993, 25264, 24115, 22219, 18545, 16834, 15410, 13728, 14142, 17564, 10341, 8677, 7432, 6066, 6860, 11960, 13635, 17039, 14578, 15773, 16124, 15097, 18293, 19640, 13432, 13524, 18633, 17198, 10896, 6874, 7552, 11433, 13947, 15985, 13213, 12278, 18766, 20179, 19219, 13538, 13472, 17030, 16233, 14893, 14945, 14679, 12591, 10713, 8244, 6934]
13077F934P003J171n175m338j99K913j323J251p19K543N137m14j77j749j703j552
13061I603k82N158L739L39n066l81k463k503M045K674j974p32j041R62L333N73
13045A5984k40q89p68j275l382l147j722O34K523J011K795j650N532M357K48j611
13029A8400l362K033n907k441l087l75N617K750J569N88j141L180n220m933j528
13014F143P09J26N242J565j085j797J442j045j802l34j085L90j016K824M530K809
12998A7616k812q67N22n061k205j266j299M177J955k112M124M082j671O08m260
12983A1531k999Q08N42j961J482M406o92J130N822K120o576k065k06n294q51N716
12967A2913M900p8j681j107J727m904q84j280P97K74l00j701n06j362K224M97
$$ y = [6934, 13937, 15108, 9933, 5595, 5396, 8309, 6986, 8237, 7518, 10061, 15198, 14784, 14607, 12858, 11155, 9603, 9321, 14479, 18218, 18557, 13491, 13110, 10647, 8144, 12189, 14863, 12889, 12157, 11116, 12078, 15411, 15984, 15744, 14855, 14087, 12812, 9430, 6283, 4561, 5195, 7718, 8729, 11524, 9874, 15406, 19763, 20011, 18400, 15038, 17071, 11164, 8723, 5636, 5261, 10878, 13628, 15197, 15785, 14644, 17824, 12604, 7671, 6143, 6852, 6978, 12220, 13785, 12700, 10903, 12345, 11300, 9498, 9164, 8079, 8469, 7453, 10277, 14807, 17616, 14804, 13937, 14459, 9398, 7193, 5927, 4628, 8805, 10760, 8648, 12772, 16854, 15183, 15791, 11531, 8532, 9340, 9882, 7921, 9403, 13809, 13117, 14247, 20069, 22189, 15613, 13548, 13342, 8048, 7197, 12913, 17813, 17735, 16054, 14947, 16674, 11770, 10886, 9606, 10403, 10677, 10377, 8676, 8170, 6808, 9032, 9529]
12951I529j516K301L795l137J236J180k30N334J633m85M023J535k670l348k167
12936A7013m017O52K225M98j951j866j196r13K606J348j396n19J187n55m896r47
12920G273K133K224L143K525j07m766M928K219l557l287J906N937M49k989M12
12905A8443R95M254j052l218n115n508P83Q46j765l087j001O85p80j88K701M104
12889A1097K222K36N156j2l460K09P83Q98K31K1N03j311K499n14j546j147K484
12872A8349O585r96l270j983l577K040M527p63q110l878P438k011m995l698J483
12857G141K817J435L827M40k964J204n10m419L39r72M143k983r06O9P88k112M066
12840A1403L076K033K805j868r12k172O08L69K807j87j021j083j731J704l7j307
$$ y = [9529, 8013, 10314, 14109, 10972, 12208, 13388, 13158, 18492, 20125, 19640, 23663, 25198, 22528, 19180, 17013, 12996, 13648, 15873, 16371, 14420, 12554, 11358, 10445, 13051, 14399, 13003, 12484, 13671, 13116, 8220, 7273, 9406, 11630, 14773, 17298, 17191, 12425, 17353, 19572, 16015, 12728, 14634, 20571, 21020, 18031, 18443, 19438, 23692, 22640, 19422, 14307, 8799, 9582, 10428, 8663, 5576, 4575, 5260, 4480, 4292, 6993, 11097, 13319, 13555, 18711, 18699, 15239, 15448, 16231, 17129, 17360, 17381, 17884, 16573, 19072, 18558, 17012, 15865, 18349, 24934, 23938, 20668, 18685, 15108, 17148, 21675, 20912, 12802, 8924, 16362, 14351, 9356, 5658, 7141, 9958, 11393, 15220, 15660, 12696, 13900, 13390, 8971, 9310, 8338, 12481, 9498, 8592, 8661, 9449, 7337, 11403, 14479, 16512, 19317, 17449, 16537, 14365, 14973, 15342, 18149, 17962, 16941, 15858, 14127, 15831, 15794, 14487]
12824A4487N67N016L008p35m196m936j440l722q2O318P168N90k608n410j083J493
12808A4435L002L728K827L137j699j936n731k725j214j312O48N981j433j545L486
12793A9649n357j200k348K484P284K952m560p628n522J45P275j036J557l31l357
12778A0007k344M179N776j82K121L578L335n375o075j66l086j313m480K487L130
12763A1592l04o772p002K983P576K234j51N149M549j137l971m035m520K27j265
12748E153J438Q056j510j735k134L886N899n36j664l79O19j806l55j061k096N197
12732A6972J21k895k49J211K514K621k126j552M22J841P185L03k056l521K076
12717B2867K053j576J758J083M919j764n929o936n545N70J882m83O118P478n387
$$ y = [14487, 15054, 20070, 23078, 22343, 18147, 13211, 11771, 8049, 7967, 14285, 21453, 22043, 19435, 14025, 12942, 14435, 17437, 21165, 23992, 27129, 25430, 23494, 17763, 15038, 13824, 12512, 13160, 19141, 17708, 16163, 19649, 14292, 13092, 10744, 13228, 20512, 23464, 18904, 11276, 5754, 5899, 13174, 12138, 13695, 13364, 10007, 7663, 11842, 17618, 17436, 19557, 23135, 26470, 21095, 15020, 14854, 11768, 10455, 5975, 8462, 11592, 11288, 4516, -2486, 497, 8073, 10307, 10156, 15305, 19854, 18717, 14746, 10711, 6191, 6418, 5153, 6591, 14647, 13137, 11402, 9268, 13154, 19053, 18517, 16853, 16474, 17093, 15287, 14932, 13871, 11775, 16972, 17093, 14198, 13949, 15160, 17674, 20295, 18169, 16617, 17039, 18880, 26065, 26368, 24312, 20791, 22867, 24920, 23344, 25102, 26185, 31104, 29340, 23411, 16475, 10930, 11500, 13382, 12899, 19017, 26495, 21108]
12702B1108m192j561M610l069j047N585J948k435L258r74m297k216K98p81J559
12687A7794K355l678O31K397L51M03L050P30J204K466K998n788o584n303J726
12672A4752N826m319p944L89K177j661L145k695k747J708P711j51J11J131j677
12657A5756n342l37L298J650q80J748L440J975j383q02J491Q9L796J900j429l084
12641B1886p810K25l042M12o06j045J653J300J357N0r59K056K926K324L003L010
12625B6740j781m652l730M533K512j084l533n485k121K326M117O76j580j762L393
12610A8569J11J374M259L310l492n10L208r02j304j077J407J961K494k309j704
12595B5395k719J187P74o92P41m18m070r06n564O507N100j623j011m568J313L446
$$ y = [21108, 16916, 15355, 19965, 16896, 15849, 21434, 23382, 20947, 24205, 23231, 18934, 16718, 17016, 16235, 17794, 20149, 16471, 17102, 19499, 19850, 20253, 23303, 24033, 25237, 27703, 30701, 24913, 18329, 13026, 14752, 20578, 16259, 8315, 8704, 10881, 9220, 12365, 9670, 6923, 8631, 16342, 16191, 16302, 17433, 15756, 10414, 10077, 13375, 15025, 14145, 15893, 19333, 21308, 19925, 19123, 20614, 20703, 24499, 26399, 24970, 21886, 14076, 14301, 11259, 11671, 11065, 10020, 11673, 12973, 14330, 14380, 13421, 15477, 18403, 20727, 23730, 26740, 24959, 20307, 16577, 21110, 23622, 22538, 19005, 13520, 11399, 13725, 17842, 18518, 16938, 15176, 18569, 18680, 20054, 24313, 27623, 24131, 23621, 26829, 25927, 24623, 23546, 24953, 26914, 29408, 27099, 25395, 22676, 23863, 24637, 23945, 24686, 24268, 20198, 19292, 13728, 20235, 25335, 23712, 22701, 18133, 19446, 22892]
12579B2892l264l97j991j765k961O285L600J004l05J96o539l383j564P076P260
12564B6144M113m060k523l97l148l319M691k532m024J922K429J554K048Q69J88
12549B3955j893O95L928j32j931j626l073m650j105L616J616K003m85M74r73N25
12533B0944J173L150k675m142J960L492l268m032K728M478p95p161l750N149M414
12518B1665L95o508m002L743J539M045N065l704m313j586M973J746K904K064P06
12503B8732j924k204N87j775k808J823M634O378J832n172k504k029j32K68J393
12488B7099J587k866k211k398j335K985j966R19j184k31K539K410j655k976O313
12473B7030K353j989J227M480J458j609N93M018J214k216k670j826j700k413J60
$$ y = [22892, 19628, 19231, 17240, 15475, 12514, 18799, 22399, 23403, 23098, 23294, 16755, 13372, 11808, 18884, 26144, 30257, 26197, 23674, 23277, 20129, 16810, 21501, 18969, 14945, 16867, 19296, 20850, 22898, 23767, 23955, 22062, 22757, 26685, 26553, 24622, 22996, 19923, 15273, 14168, 17784, 19400, 21403, 20918, 21392, 20419, 20944, 22117, 25267, 22592, 18450, 20410, 23902, 20634, 16602, 19330, 23808, 23013, 15852, 12102, 17251, 21665, 22060, 15552, 11550, 15293, 16832, 20877, 25942, 22238, 17925, 16339, 21312, 23058, 25962, 28026, 28732, 26808, 24604, 25191, 23416, 20608, 22431, 27065, 33443, 35275, 30103, 27599, 25570, 25438, 25706, 27099, 28686, 25820, 23609, 21211, 19876, 22861, 20895, 21814, 20630, 20399, 22938, 25348, 23693, 20717, 27030, 29383, 27394, 28621, 33101, 34559, 32950, 33543, 37561, 38775, 36559, 33889, 32063, 30363, 27950, 28110]
12458B8110m620n554J153n53j095M881K217J631l117L071K596J451K265M955M499
12443D1890J076m10k756n820J182M97j639l560L91L549O811k341m943L611M593
12428D2131J30m71L70l056m746n60L981L359M138m486M42J28o514L44L739N217
12412D4146J0317L926l993l42j194p96n27J646o593m757J62K521n006o349N48
12397C3709L130L359o93L24L926L6p024m777J843J942J251n96l182K851L192P46
12381D0037m416l525r1L464J075M59k943j779K382n059k815j449J863L468J104
12366C1775R46K680O694J3265R489J975k827o755r465o379l270n170r112M305
12352B8151Q178o11l570j604l188n688j404J930N445N630R13m596l832l790m119
$$ y = [28110, 23490, 17936, 19089, 18536, 17441, 22322, 24539, 26170, 23053, 26124, 28720, 30171, 32436, 37391, 41890, 42966, 42556, 39800, 33980, 35162, 35659, 34020, 30460, 30851, 34400, 41211, 38870, 33927, 37538, 42131, 42261, 41790, 42160, 39104, 34358, 33798, 37779, 41138, 45276, 40790, 41232, 41360, 34846, 35190, 38929, 44146, 54463, 58389, 54396, 54054, 52860, 52064, 51537, 53183, 46590, 41833, 41995, 44516, 39510, 33161, 33709, 36839, 40198, 39505, 39829, 43755, 43791, 36767, 31990, 33833, 35775, 37026, 36430, 33248, 36099, 39291, 40037, 35621, 32096, 32005, 35469, 36544, 37003, 34060, 32281, 34663, 29604, 26789, 25340, 27203, 30671, 31775, 32721, 35401, 42095, 55360, 64849, 66824, 63997, 57242, 47777, 41398, 38128, 32958, 23846, 28151, 36329, 35718, 32148, 30544, 27356, 21668, 20264, 22194, 27639, 33269, 34182, 29586, 25754, 21964, 17845]
12337A7845K79R511L689q80l228O37j190k476K414L450L629M112n68l318J321
12322C5227N777M763L61l738K985O215R35j18j888k122m052k595k294J845M31
12307D1732o031L628L166k060j438j262k303L095j265k150K93J260L58N412P07
12292D3142m5Q036Q96l501J996N469P028N336k100l013m724l101l804j820J542
12277E1337N672M978L928N000J614m764n727m755n503k342J459q19Q94M239P47
12262E5958J29k738O99k243M442K418n84K490K976M059J465q315m828p89l815
12247E1324J003j835j149l1J435J503k361o79m429l849M331P303r89m680k82J058
12231D7673P558K772n197l783j938n523k945P07L507n333k307J984O90k491k042
$$ y = [17845, 18124, 27635, 31324, 30444, 27216, 27853, 26663, 24187, 26601, 30051, 33680, 37792, 37224, 33906, 35227, 41004, 45767, 46128, 42390, 45375, 51590, 52525, 52407, 50519, 48397, 44345, 41750, 39456, 41301, 41732, 35701, 39329, 42495, 40435, 38997, 37735, 35432, 38527, 37262, 35112, 35405, 36665, 37023, 42435, 43142, 43097, 51133, 52029, 48528, 50524, 55993, 63021, 68357, 66257, 63244, 58520, 55419, 51615, 49795, 51337, 57009, 61987, 65915, 70915, 72529, 67765, 62038, 57283, 51780, 49438, 50897, 50078, 50972, 55211, 55958, 56087, 53349, 54048, 51805, 56247, 58665, 58081, 60571, 63547, 67606, 69071, 60756, 55928, 55139, 51324, 52327, 50492, 49343, 49312, 50747, 52250, 49889, 49210, 44781, 40932, 45263, 52566, 51577, 46897, 46615, 47673, 55231, 58003, 52806, 49023, 47085, 41562, 38617, 39324, 42831, 37498, 35191, 37175, 37865, 35374, 33332]
12216C3332J584L824K031k282j951L727K7j83M408K443k622l963n250L62K808
12201C8295K640j49m121p251m736r21K869M455J226L150p6j356J608n2l97J792
12185C6976k278k922k920j006N743K084K412m633m861m46l48l213k035K428l37
12170B4644K842L301L621j724J670o71K3M7J516K370l991k160j112j98K331m402
12154B8107l267K565L078N213k939L282K201j32n548N27j905K713J062K009j88
12139C6778j270m315j861L836J236k84P24j676J957O62n114J136M267L396L65
12124C9837K468n784l381o32K688j510L2m68o702K360J265l532q75K998M080j438
12108C1406J574L349k821k534K536L957p87o917j189N058L950P43n014J361j692
$$ y = [33332, 34916, 38740, 40771, 38489, 36538, 40265, 40292, 40109, 44517, 46960, 44338, 40375, 35125, 35487, 38295, 40935, 40786, 36665, 29414, 24678, 23757, 26626, 31081, 32307, 35457, 35381, 34025, 35633, 35581, 35184, 36976, 34698, 31776, 28856, 27850, 33593, 35677, 38089, 33456, 28595, 28149, 27801, 24588, 22553, 24981, 24644, 27486, 30787, 34408, 32684, 34354, 33683, 33706, 33753, 35269, 37639, 33648, 31488, 30376, 30178, 32509, 28107, 24840, 27405, 30483, 35696, 32757, 36039, 38240, 38108, 32560, 33087, 31182, 33895, 34957, 36966, 36778, 35508, 31193, 29332, 33168, 34404, 34120, 34844, 33168, 35125, 35787, 30673, 31809, 36076, 39472, 39837, 42305, 36521, 33140, 32508, 35196, 33686, 33718, 33250, 26548, 28908, 30173, 26641, 25766, 28764, 32844, 31406, 32980, 36329, 33508, 30974, 33510, 37467, 36680, 29763, 28574, 33632, 37582, 38325, 33311, 34672, 32980]
12093C2980k606K37K579Q39k570o185N024P849O90J962l200k369J330j492k560
12078C2508j205R61o58j785p93P003K195k711r97j043K878J984L182J084N935
12063D8538L331j822Q74l646n094m078M54k088k672L39M623Q74k008m645o240
12048B6740p77K323l286k314J114J776K435J167O625j32M05K533J534k216q54
12033C7073j496k564l36J396L134N042J480K026L922k11j570l120Q8K357p654
12018C9567l794M471j529n292R7m41o861m899L039K951J004q67L040K903p89N70
12002C3170l51J619k45J858K935r72j753q25J401N918L838J119l027J78J112j897
11986D4078L83O552N18l811J962l242j042J25k41k452m16k091j893k090l891Q88
$$ y = [32980, 30374, 30611, 33190, 34029, 31459, 25274, 30298, 38147, 38837, 40799, 37599, 35230, 36560, 35068, 32508, 31303, 32264, 31606, 29821, 29028, 36031, 38226, 35515, 34518, 33475, 36353, 38337, 41519, 42603, 48538, 51869, 50047, 50921, 47275, 42181, 38103, 38557, 36469, 33797, 34136, 38759, 39633, 37625, 32980, 26740, 25963, 28286, 25000, 22686, 23800, 25576, 28011, 29178, 35803, 35671, 36076, 38609, 40143, 37927, 37073, 35577, 33013, 32677, 34073, 37207, 42249, 43729, 45755, 49677, 49466, 47896, 44776, 44864, 47221, 39567, 35773, 40244, 38715, 33423, 33520, 33079, 26218, 21319, 24358, 27309, 28313, 27446, 30486, 33389, 32600, 33170, 32819, 34438, 34193, 36051, 38986, 38014, 36261, 35436, 36837, 42755, 46593, 47712, 44685, 44863, 45975, 44078, 44461, 51013, 51531, 47720, 49682, 46440, 45398, 45523, 45282, 42830, 42414, 40323, 38430, 36340, 32449, 33337]
11970C3337L280J434J272k687O892L006j185O7m703k520J096K473K815K03L329
11955D8109l193r37J996l93m01P28L178M91j410l994l902k503J793K649L817k692
11939D3336k475k511K006l864m891J34L14j584m9M121K586k012j574M87L656L682
11923D1362m557o695J329N461K143J519O89P343K806l352q99o66J364j320L196
11908D9723N690K967o055m169p90K02Q60K552k165k548K704Q58m86m831k139l84
11892D1989K735l004K675K50k333k720k384O413R988M07p108j329l59M50L180
11877D8850k673k570k362q96K513K562m204k749K061q09k510R79J607J38N312
11862D5249q34J657k541k676J520j330K96J421k4l534m954r89l683K226K076J228
$$ y = [33337, 36617, 38051, 39323, 36636, 43528, 46534, 45349, 45416, 40713, 38193, 39289, 41762, 44577, 44780, 48109, 44916, 43979, 45975, 45582, 45181, 45909, 49087, 49578, 48168, 44174, 40272, 37769, 39562, 42211, 46028, 43336, 40861, 38350, 40356, 36492, 31601, 31735, 32049, 30465, 30416, 34537, 37123, 35111, 33537, 34024, 37680, 41362, 36805, 30110, 31439, 36900, 39043, 40562, 41251, 48594, 51400, 48048, 47149, 46483, 47847, 46527, 49723, 55413, 58380, 52325, 48156, 47366, 47568, 48428, 50980, 48815, 46267, 48971, 49829, 49343, 44512, 42373, 41989, 44724, 41720, 44395, 44645, 42312, 39592, 37208, 43621, 53609, 54016, 46908, 45579, 45220, 45670, 48850, 46177, 43607, 41245, 40349, 42862, 45424, 41220, 38471, 40532, 39723, 37213, 38192, 39799, 39937, 45249, 44415, 46072, 43531, 40855, 42375, 41045, 41341, 42762, 42738, 39204, 34250, 33261, 29578, 31804, 33880, 35108]
11846C5108J67K708p16J425J662k532J354n69M086k89J147K153o80N328M378K99
11830E5029j073l986m836j161J51j635M9L796j821m44m290K675J305J224J196
11815D6179J735l118l166L038L753k92Q39p9n837j759K910L874j755p755k511
11800C6056l44L090M94k934O45N044K310K365L251K927K631l044l448m37k703
11785D5903K525J63l913k113N29R31Q00K144o11K228O3j826m16J849l75o2k866
11768D4953j200L437m306q24J827M155k31K548l142p58M83n5K275j604R79K166
11752E0703J722L204o8n661J21M120k035J260L912r26k297L216L749k258k678
11737E6084J684J084j62R89l4J485N90K038L046J213l646l746q15j707K128M51
$$ y = [35108, 35275, 37983, 37267, 38692, 40354, 37822, 39176, 38607, 42693, 42404, 43551, 45704, 45024, 50352, 54730, 55029, 53956, 49970, 45134, 43973, 44124, 42489, 42538, 46334, 44513, 44069, 39779, 42454, 43759, 44983, 46179, 47914, 44796, 41630, 44668, 48421, 48129, 48968, 48889, 43052, 41293, 44203, 48077, 46322, 38567, 36056, 35712, 38802, 39296, 36362, 37007, 42051, 44361, 46726, 49977, 52904, 55535, 52491, 49043, 48606, 45903, 48428, 48591, 44678, 42565, 43094, 44025, 44825, 46969, 46358, 48586, 48649, 46823, 46407, 48256, 47881, 47819, 44953, 43753, 47190, 42884, 42060, 43887, 48042, 47811, 50359, 47217, 46459, 46942, 46887, 49162, 47558, 48537, 50703, 52425, 55629, 55561, 49900, 50021, 54141, 52106, 53366, 57278, 56352, 54055, 57271, 61020, 58762, 56084, 57768, 58852, 58690, 59679, 59645, 61130, 61720, 63758, 66804, 68017, 64371, 60625, 59810, 58103, 60231, 60682]
11721F0682L56r28m478m471j090J412j438K06K343K861L676M438J787k649k392
11706F0315n927J108M067J28L235l912q8K180p16L092M518J65o97K434K90o58
11690F9534j352L99k804K210l925k630R98P39o70K039K781j587j233r78m257K56
11674E9520m4k802l258r96K478j52j162K160K543O09l777j66K836M099L19J169
11658F3376m358l718OL670N681K032L593n73j675L27n693n645q7M003L189J70
11642F4298L118L464k885R2m151m073N696P252L225L418m887m244n090o889j255
11627E7089K110j782l358L909K60l26L753L671j397K70L529k277m982l18j6P407
11611F7542M836n757l179N58m115j06J134O73O05P689K204j357k81J783k918k058
$$ y = [60682, 61038, 60110, 55632, 51161, 50071, 51483, 50045, 50251, 52594, 55455, 59131, 63569, 65356, 62707, 60315, 54388, 55496, 59563, 59691, 62926, 59014, 58926, 61106, 60390, 63482, 68000, 68165, 67468, 69902, 70192, 69534, 68182, 68581, 65777, 67987, 64062, 61432, 62430, 63169, 62499, 64538, 67319, 65732, 64499, 63521, 59264, 59520, 59476, 56674, 53416, 52420, 54898, 54746, 53584, 55744, 58287, 58896, 55119, 54953, 57789, 61888, 62207, 63376, 59018, 55300, 55306, 58976, 64657, 66689, 70282, 69709, 68034, 68361, 62668, 57023, 56936, 60939, 64128, 64298, 67416, 70880, 67995, 68087, 63936, 59863, 65559, 72811, 76036, 79454, 74567, 70323, 65233, 58344, 57089, 59199, 57417, 54059, 57968, 58228, 57902, 61655, 65326, 63929, 64199, 67728, 65451, 60469, 60151, 60135, 67542, 72378, 66621, 63442, 64000, 59885, 59779, 60913, 61586, 62191, 69880, 72084, 70727, 70446, 72229, 69311, 67253]
11595F7253M675K011R16l116L043N654K767j127r24M993k177k710q639k31j842
11580G0546l70j35n169R81K523J770Q16j193l93k311p754J768M663j077n647q75
11564E8143N211N187R81K967k407p593l177K615J823n194j487Q1K975N416M603
11549G0144J669L244n20j908J136L663k37j249K34Q46M899j309q123k451k370
11534F7668j630P25L743p54n983j948K411K189j103l051j620P89Q62M448N290
11519G2036K857Q05j352J344J845M33L33k712L231J456k688J310p85N611K500
11504H6224J846J348J935L117J573k746j390k292j869J899K240j386J409o965
11490H4943K857k35M728K136L275r42K203k430p82K939N986Q01K23O961N818O036
$$ y = [67253, 71928, 73939, 74855, 71739, 74782, 80436, 83203, 82076, 81152, 86145, 83968, 81258, 72619, 72388, 70546, 70176, 70041, 64872, 65853, 68376, 70146, 70962, 69769, 69376, 67065, 59311, 61079, 65742, 64665, 59018, 58143, 63354, 68541, 69522, 72489, 70082, 62489, 59312, 61927, 63750, 58556, 57069, 57150, 60125, 65541, 70144, 71813, 75057, 74537, 72629, 73765, 77428, 77191, 75942, 76176, 77022, 81921, 80612, 72489, 70038, 67668, 66038, 66763, 70506, 69752, 63769, 61821, 64232, 66421, 65318, 62267, 60647, 61436, 62298, 66746, 72036, 74893, 75698, 74346, 75690, 77535, 77968, 78301, 75589, 78820, 80276, 77588, 78898, 78113, 83724, 86224, 88070, 89418, 91353, 94470, 96043, 93297, 91907, 89615, 87746, 89645, 91885, 90499, 91908, 84943, 87800, 87565, 92293, 94429, 97704, 96762, 98965, 96535, 95753, 98692, 104678, 105479, 105702, 112663, 118481, 124517]
11474A24517O912K603K128K570O988R434Q793Q287J0203Q225Q254Q862K716K456
11460B12948O729J1095L676r048q652l635m208j0228o263j1300p502j1385r370
11447A52857o602j421k426k478j414m899n597k1L846r51k902k338M263M854o49
11432A34122j21J397O388O372J283L551L642N408P492O180N561N073J1882Q042
11418B06272O310Q854J0009P447K152J398N47m328m336q206o872j1323j3081j4216
11404A80627o202l286n629m833o419m443l102k904o563n264k664J448n615k056
11390A23095m934o684k406j652j018q36j54K090J495o55J122l235p719k842J587
11375I7254R78p159o257j66J0531N421L522m421j653K006J368m284N42R1l73k565
$$ y = [124517, 131429, 134032, 136160, 138730, 145718, 155152, 163945, 172232, 182435, 190660, 198914, 207776, 210492, 212948, 219677, 230772, 234448, 225400, 216748, 213113, 208905, 198677, 192414, 181114, 173612, 162227, 152857, 146255, 144834, 142408, 139930, 138516, 133617, 128020, 127999, 131845, 130894, 127992, 125654, 129917, 134771, 134122, 134001, 135398, 141786, 148158, 149441, 152992, 156634, 162042, 169534, 175714, 181275, 186348, 198230, 206272, 212582, 221436, 231445, 238892, 241044, 242442, 242989, 238661, 234325, 226119, 219247, 207924, 194843, 180627, 174425, 171139, 165510, 160677, 154258, 149815, 146713, 143809, 137246, 131982, 129318, 130766, 125151, 123095, 118161, 111477, 109071, 107419, 106401, 105565, 105411, 107501, 108996, 108341, 109463, 106228, 98509, 95667, 97254, 98232, 91073, 84816, 84650, 95181, 100602, 104124, 99703, 98050, 100056, 101424, 97140, 97682, 97773, 97400, 94835]
11359I4835j043N143k361k537L138L473p45k376R19M123j177j039k566M67j737
11344I6517k45m244n74J392j24q86l35n16q23J866K144j600K133K810j191j081
11328I5243k818k734J395N140K341J424k082k122K944K164k82o10J678P194K708
11313A11583o524k999L299J876k565j472M825K723J672N346J1959J5090J6067
11300A60880P225j354n336j0608r795m284l788L767q83j128J551j562K916K168
11286A39769K627N694J1860R083K6j870k778q603q057p241q233p414o809l028
11272A15026O67L901K939R96j420k092l702q433j907M296N822M945o85m795m512
11257A11046j09O55k585K769L28m25O570l03L57K812M93l275j246L816J438j078
$$ y = [94835, 93792, 98935, 96574, 94037, 97175, 100648, 99903, 97527, 98446, 102569, 101392, 100353, 97787, 98254, 96517, 96272, 92028, 91454, 92846, 92722, 91836, 91501, 90985, 90162, 92028, 94172, 92572, 94705, 97515, 96324, 95243, 92425, 89691, 91086, 96226, 98567, 99991, 97909, 95787, 98731, 100895, 100613, 100003, 101681, 108875, 111583, 105059, 102060, 105359, 107235, 104670, 103198, 108023, 110746, 112418, 117764, 129723, 144813, 160880, 168105, 166751, 161415, 150807, 141012, 136728, 132940, 136707, 135824, 134696, 136247, 134685, 137601, 139769, 142396, 148090, 159950, 169033, 169059, 167189, 164411, 155808, 147751, 140510, 132277, 124863, 118054, 115026, 115693, 119594, 122533, 123529, 122109, 120017, 116315, 107882, 105975, 110271, 116093, 121038, 120353, 115558, 111046, 110937, 111592, 109007, 111776, 112104, 111679, 118249, 117946, 118303, 121115, 121608, 118333, 117087, 120903, 122341, 121263]
11241A21263k134Q31K915k577L138O808M259O421M560J4522J6233N480J011J240
11227A83970j28n305n260L129Q839Q036J0581J8215J8469J8581K4894K7832K5405
11214C37258J3755K50r943j8132k3341k5563j4925r009q745l737L700j755n938
11201B33875P82J2628J4441J6622J7825P862n733j2990j6249j5793j5750r315
11189B28205q705n310n327j213m165o197p171N75l030q52m581n590k20o536l710
11174A66173J552o487k913k390Q34K3k415L169J098L355j259l248j474R046J3208
11159A78272M436k38J566J2774J0367J1618J3267J4128J2231J6089K4749L2657
11147C31916L8675L9663L9254K5854Q876j2599j2517j3325j0451q017J0k921q820
$$ y = [121263, 119129, 119960, 122875, 120298, 123436, 130244, 134503, 140924, 145484, 160006, 176239, 181719, 182730, 183970, 183842, 178537, 173277, 176406, 185245, 193281, 203862, 222077, 240546, 259127, 284021, 311853, 337258, 351013, 351263, 341320, 323188, 299847, 274284, 259359, 250350, 241605, 237868, 241568, 239813, 233875, 234657, 247285, 261726, 278348, 296173, 304035, 298302, 285312, 269063, 253270, 237520, 228205, 219500, 214190, 208863, 207650, 203485, 197288, 190117, 190692, 187662, 186810, 182229, 176639, 176419, 169883, 166173, 167725, 161238, 158325, 155935, 156769, 156792, 154377, 157546, 158644, 161999, 160740, 157492, 156018, 165064, 178272, 182708, 182470, 184036, 196810, 207177, 218795, 232062, 246190, 258421, 274510, 299259, 331916, 370591, 410254, 449508, 475362, 484238, 471639, 459122, 445797, 435346, 427329, 427339, 424418, 415598]
11134D15598k483J969L183J999Q339J4484N190J5m169n411j5003k1794k1693j4973
11120C65251q953m875j372N198J4686K5264K4364K0068J5580J5933M269j0554
11108D64859j3459m235L30J174J5j611j923r430j4686j6760j7164j6196k0307
11095C50607j4369p837J904M087J2737J5239Q568R204P816L146l610o396r693
11082C71403q405m41o87M273Q804J3350J3917J5602J2079P617J6048J3165K0372
11069D87097L0641K7448K7227L3018L6336L8126K8742J8549N182m662j8750l0049
11057F78905l1405l8037m1034l5942k5844k6001k1287k1261j9933k2956j7714
11046C77491r482r866j5374r458n555q488r640q270n695q810j375L342P797O244
$$ y = [415598, 413115, 415084, 418267, 420266, 428605, 443089, 448279, 448294, 444125, 438714, 423711, 401917, 380224, 365251, 356298, 351423, 350051, 355249, 369935, 395199, 419563, 439631, 455211, 471144, 475413, 464859, 451400, 447165, 447495, 448669, 448684, 447073, 445150, 435720, 421034, 404274, 387110, 370914, 350607, 336238, 328401, 330305, 334392, 347129, 362368, 370936, 380140, 387956, 391102, 387492, 381096, 371403, 362998, 362557, 361870, 366143, 374947, 388297, 402214, 417816, 429895, 437512, 453560, 466725, 487097, 517738, 545186, 572413, 605431, 641767, 679893, 708635, 727184, 732366, 727704, 708954, 678905, 647500, 609463, 568429, 532487, 506643, 480642, 459355, 438094, 418161, 395205, 377491, 368009, 358143, 342769, 333311, 327756, 319268, 309628, 301358, 295663, 286853, 285478, 288820, 296617, 302861]
11032C02861P807N116L808k814J332K222L212N877l136r766j015J002O901L431
11018C26838k969m12l325l912n178q549p573j1165q461n670j869M30q23k135k503
11003B62724j320j305j59J923P13j1562n078Q39L643R82R78J47N126J486o9j213
10987B57855o891j847j312m21J200L57j340o455k543j673l657k577O344M409N342
10972B46791P22j69J375P386O007P031Q687P937M648L419M493k799n86L166R35
10957B99043k038q21N645Q13O53m67N083L253J0522N735q15O04K726K054Q2k056
10941C30016K618N70r32J928j71J964P494J1447O836K730Q895N305K858J280o136
10926C76702j127N725O821M680K756p52J173M21J123N23K998K786m467J710J1340
$$ y = [302861, 310668, 315784, 319592, 316778, 318110, 320332, 323544, 329421, 326285, 316519, 315504, 316506, 323407, 326838, 323869, 323457, 320132, 316220, 311042, 302493, 294920, 283755, 275294, 269624, 267755, 268185, 267362, 265227, 262724, 261404, 260099, 259940, 261863, 262576, 251014, 245936, 246775, 250418, 251400, 252378, 252525, 257651, 259137, 259068, 257855, 250964, 249117, 247805, 247384, 248584, 248941, 247601, 241146, 238603, 236930, 233273, 230696, 237040, 241449, 246791, 247513, 247344, 248719, 256105, 262112, 269143, 277830, 285767, 290415, 293834, 298327, 295528, 294942, 298108, 299043, 297005, 296184, 301829, 302642, 303295, 302828, 307911, 311164, 321686, 327421, 326606, 327210, 329936, 331990, 332072, 330016, 332634, 333204, 332272, 334200, 334029, 335993, 343487, 354934, 361770, 364500, 373395, 378700, 381558, 382838, 376702, 375575, 381300, 388121, 392801, 395557, 394805, 395978, 396399, 397522, 398045, 401043, 403829, 399362, 401072, 412412]
10911D12412P665Q118Q384L503Q458R360J2118J3940J3717M952O106J2048Q730
10898E29511R349P451J5674J5630J3312J5298J8775J5219L3438M1748L8752M1511
10886G95668N2895O0316P2056Q7738J11254J33251J55290J89930K36156K99267
10876B193821L71477M26057M84655N50464O41403P61258R00902J026122J138462
10867H494621J146677R13776M11272j83389o45875q84489r25088q56727p15569
10858F755209n17053k93090o4399J54544L64338N49921O62821O66964N81599L94928
10848I255782R2671k44663n06445o21238o11497n44423n14008n22018n34222n39494
10838D710445n22460m78685m09173l40276k81502k27986j80149j34507j04495
$$ y = [412412, 420077, 428195, 436579, 440082, 448540, 457900, 470018, 483958, 497675, 502627, 508733, 520781, 529511, 538860, 546311, 561985, 577615, 590927, 606225, 625000, 640219, 673657, 715405, 754157, 795668, 848563, 908879, 980935, 1068673, 1179927, 1313178, 1468468, 1658398, 1894554, 2193821, 2565298, 2991355, 3476010, 4026474, 4667877, 5429135, 6330037, 7356159, 8494621, 9641298, 10555074, 10966346, 10782957, 10137082, 9252593, 8327505, 7470778, 6755209, 6238156, 5945066, 5880667, 6035211, 6399549, 6949470, 7612291, 8279255, 8860854, 9255782, 9348453, 9103790, 8597345, 7976107, 7364610, 6820187, 6306179, 5784161, 5249939, 4710445, 4187985, 3709300, 3300127, 2959851, 2678349, 2450363, 2270214, 2135707, 2031212]
10829B031212o6186l6485j3741O856J8286L1162M4921N5167O6064P5081P9775
10818B292112O0461J4658l4405o1166n2744k2016J9940O6160J16920J70563K21269
10807B791752K79798L60787M45078N02100N40188N66317O38932P41759Q16144
10798G682855Q37251Q21556P99412P52350O29588N09123N12849O79508R74577
10789A4199069J353790J758290K047087K217689K434679K810927L145135L142067
10781C3108733K569489J469576K87046p12120j641052k482427k980056k979418
10773B6639771k561032j889344j136225m64291N6539M71298Q85591J306880J599597
10764B4908784J710827J465829N50163o10383j367531j676320j830241j975432
$$ y = [2031212, 1965026, 1928541, 1914800, 1921656, 1939942, 1971104, 2016025, 2071192, 2137256, 2212337, 2292112, 2352573, 2367231, 2332826, 2271660, 2218916, 2196900, 2216840, 2283000, 2399920, 2570483, 2791752, 3071550, 3432337, 3877415, 4379515, 4919703, 5486020, 6124952, 6866711, 7682855, 8520106, 9341662, 10141074, 10893424, 11523012, 12032135, 12544984, 13224492, 14199069, 15552859, 17311149, 19358236, 21575925, 24010604, 26821531, 29966666, 33108733, 35678222, 37147798, 37434844, 36722724, 35081672, 32599245, 29619189, 26639771, 24078739, 22189395, 21053170, 20588879, 20645418, 21116716, 22002307, 23309187, 24908784, 26619611, 28085440, 28635603, 28025220, 26657689, 24981369, 23151128, 21175696]
10756B1175696k085124k083539j975498j784310j521769j250343j027344q71747
10748H576022p72260o95267o09070m96115l52715j98903r0802p1651j14182j49894
10738E025163j43884j08046n4819O905N7303J00141J47955J96827K46123K85298
10728E758966L37646M13178N05292O19264P69699R74272J232319J547467J864905
10719A4023008K176718K550197L015776L434390L638190L844816M276099M587328
10711D1546522M065436K803218J678961J082721P79578M13334k56617j111709
10703E1001444j661083j492475o24776N16695J429751J788589J624053J214096
10695E3796294O96516m5421j271671k849227m006199m159278l457390k332710
$$ y = [21175696, 19090572, 17007033, 15031535, 13247225, 11725456, 10475113, 9447769, 8576022, 7803762, 7108495, 6499425, 6003310, 5650595, 5451692, 5360890, 5289239, 5175057, 5025163, 4881279, 4773233, 4718414, 4725319, 4782622, 4882763, 5030718, 5227545, 5473668, 5758966, 6096612, 6509790, 7015082, 7634346, 8404045, 9378317, 10610636, 12158103, 14023008, 16199726, 18749923, 21765699, 25200089, 28838279, 32683095, 36959194, 41546522, 45611958, 48415176, 50094137, 51176858, 51956436, 52369770, 52113153, 51001444, 49340361, 47847886, 47223110, 47739805, 49169556, 50958145, 52582198, 53796294, 54492810, 54447389, 53175718, 50326491, 46320292, 42161014, 38703624, 36370914]
10687C6370914j148343j47206N81019J073228J417028J816624K408648L249096
10679D5621008M043467M166843L224839J486779m00405j873858k712034l000017
10671E0556622k932881k676120k387103k376634k832718l390863l574045l217428
10663B7168830k467791j472487l94576N71429J151895J187421Q82157N88470M11773
10654B7627121K58590J01173O3493J68059J62784k17528r55003j692259k109953
10645B3406477k178575k120154k128172k127278k023033j830817j572623j291257
10637H134568j007402p81520o11827m87654l87727k79101j79648q6645l871Q4323
10627D393496J79527K78904L63413M16925M22642L94417L65052L65854L87199
$$ y = [36370914, 35222571, 35075365, 35656384, 36729612, 38146640, 39963264, 42371912, 45621008, 49664475, 53831318, 57056157, 58542936, 58142531, 56268673, 53556639, 50556622, 47623741, 44947621, 42560518, 40183884, 37351166, 33960303, 30386258, 27168830, 24701039, 23228552, 22833976, 23405405, 24557300, 25744721, 26626878, 27215348, 27627121, 27885711, 27986884, 28050377, 28218436, 28381220, 28163692, 27208689, 25516430, 23406477, 21227902, 19107748, 16979576, 14852298, 12829265, 10998448, 9425825, 8134568, 7127166, 6345646, 5733819, 5246165, 4858438, 4579337, 4399689, 4313044, 4309173, 4393496, 4573023, 4851927, 5215340, 5632265, 6054907, 6449324, 6814376, 7180230, 7567429]
10618G567429L90586L36890K01998L6422p1979j15871j47155j73007j95465k52562
10608G577286l59122m49638m56824l89408k73255j04174J12584L75382O71184
10599F704015R57056J079392J028602R17810P13506M99517L20062K34866K42076
10590A2696902K57134J72025l9270l42128o54851q68018r34336q87067p92930
10581H607461p14109o56395n84007m93734l42622j37838P6034K73804L86919L81392
10571F796905K58611O5437j20765k32650k74842k72667k60841k26870k19459k75088
10561E237771l67195m54175m98112n19164m94368m41553l76468l14561k59517
10552A512658k02632j60867j21091q0477o0829n2014m5890m9623n6814n2201n0786
$$ y = [7567429, 7958015, 8294905, 8496903, 8533325, 8461346, 8345475, 8198320, 8025313, 7829848, 7577286, 7218164, 6768526, 6311702, 5922294, 5649039, 5544865, 5657449, 6032831, 6704015, 7661071, 8740463, 9769065, 10686875, 11400381, 11899898, 12219960, 12454826, 12696902, 12954036, 13126061, 13086791, 12744663, 12089812, 11221794, 10287458, 9400391, 8607461, 7893352, 7236957, 6652950, 6159216, 5816594, 5678756, 5754790, 6028594, 6415513, 6796905, 7055516, 7120953, 7000188, 6767538, 6492696, 6220029, 5959188, 5732318, 5512859, 5237771, 4870576, 4416401, 3918289, 3399125, 2904757, 2463204, 2086736, 1772175, 1512658, 1310026, 1149159, 1028068, 947591, 886762, 834748, 788858, 739235, 682421, 630220, 579434]
10541E79434n4056m1971l3949k6942k1537j4057j1621o015M056K0205L6902L9988
10529D70437K4947R757P553N26r734j1649j1987j3979r593l756m449j3455j4025
10516D20593m847L207L263M703l271M784J2989J7731K4006J8805J3517J2308J2790
10503E40578M365j6711l7085k1219j1427j8081k1983p953J677J6640K3906L4555
10491D87262L8576L9658L4006J6705J408k668k064m31k134m823O59J0160J7981
10478F34295J7047J1282J0448J3661K5821M0078P8387J33265Q4028l0578q0410
10467I37324m7168L51L4855N5611P5712J04779J39089J60669J41422O8419k1645
10456A649418q2266j03069r8030p7965o3582m8870k8543j6631p782l342J2263
$$ y = [579434, 525378, 483407, 449458, 422516, 400979, 386922, 375301, 369286, 373342, 393547, 430449, 470437, 495384, 505141, 512694, 513220, 503486, 491837, 479850, 465871, 456278, 452522, 448073, 434618, 420593, 415746, 418953, 422216, 426919, 423648, 428432, 441421, 459152, 483158, 501963, 515480, 527788, 540578, 544943, 528232, 491147, 469928, 458501, 440420, 418437, 410484, 412161, 428801, 452707, 487262, 525838, 565496, 599502, 616207, 617615, 614947, 612883, 612452, 610318, 605495, 606154, 616314, 634295, 651342, 662624, 673072, 686733, 712554, 752632, 831019, 964284, 1048312, 1017734, 937324, 890156, 890507, 925362, 980973, 1056685, 1161464, 1300553, 1461222, 1602644, 1671063, 1649418, 1567152, 1464083, 1366053, 1288088, 1224506, 1175636, 1147093, 1130462, 1122680, 1119338, 1131601]
10445A131601J8106K3962M4161M8567M4454M0230M6713P0718P8276P8433Q3595
10434A708816R3239J22430J45855J67557J85636K00363K19043K42075K78185L22261
10424C685460L87442M61047N56538O97150Q62378J033878J188169J310902J400765
10415A1583729J529106J749061K154557K838018L938807N678436Q322688J1959372
10407D9753774J5949028J8164434J5689807P545459l201746j1710045j5483902
10400G6706809j5199829j2797445r881007p311739n337412l880099k860671k203766
10392A7234841j822227j604794j406471j177350r03540o02715l12791m3554J97295
10383I558694M15016O19893Q55596J125309J412630J702557J994634K337428K764513
$$ y = [1131601, 1149707, 1173669, 1217830, 1266397, 1310851, 1351081, 1397794, 1468512, 1546788, 1625221, 1708816, 1802055, 1924485, 2070340, 2237897, 2423533, 2623896, 2842939, 3085014, 3363199, 3685460, 4072902, 4533949, 5090487, 5787637, 6650015, 7683893, 8872062, 10182964, 11583729, 13112835, 14861896, 17016453, 19854471, 23793278, 29471714, 37794402, 49753774, 65702802, 83867236, 99557043, 107102502, 103900756, 92190711, 76706809, 61506980, 48709535, 38828528, 31516789, 26179377, 22299278, 19438607, 17234841, 15412614, 13807820, 12401349, 11223999, 10320459, 9717744, 9404953, 9361399, 9558694, 9973710, 10593603, 11449199, 12574508, 13987138, 15689695, 17684329, 20021757, 22786270]
10374B2786270L318157M081304N093867O411294Q102568J0070029J1827931J2544983
10366H4236403J1248828P373408J532463m686666r579333j2165704j2204777j0223901
10358E5530721p221173m036971j113842J417711L544673N487172P802092J1294607
10350G2704990J6944615K5894898M0247880O3779824R0207661P7894403J1608914
10343C99283185m5040495o7873137o7213863n6277035m2169103k9759954k0781018
10336G0168580j4780934j0781296p982895o056572m749910l798618k959823k122641
10328A6935891j527206j439838j538195j503338j350490j144613r22435p54639
10320F755137o26285n08396m18089l73534l17426k55840k24037k21458k36238
$$ y = [22786270, 26104427, 30185731, 35279598, 41690892, 49793460, 59863489, 71691420, 84236403, 95485231, 102858639, 104391102, 99704436, 90125103, 77959399, 65754622, 55530721, 48309548, 44272577, 43158735, 44576446, 48121119, 53608291, 61410383, 72704990, 89649605, 115544503, 155792383, 219572207, 309779868, 387674271, 399283185, 354242690, 286369553, 219155690, 162878655, 120709552, 90949598, 70168580, 55387646, 44606350, 36623455, 30566883, 25816973, 22018355, 19058532, 16935891, 15408685, 13968847, 12430652, 10927314, 9576824, 8432211, 7509776, 6755137, 6128852, 5620456, 5202367, 4828833, 4511407, 4255567, 4031530, 3810072, 3573834]
10311C573834k44928k34429k10739j80796j56763j29974r9558p9808p8692r7726
10301B060421j10310j16171j19251j08615q7661p8657o4184m7463l3458k6077
10291A268574j8840l020Q495J1914J951j4335j1588k4500m9846o6036o4177m7273
10279I91319l5090l5670j9078J204J3613J7707K9588L0744J7752m990k1177l8702
10267I47220m1367l8078l4487k9663k2404k2522k2627j2292k942Q312J2914J8897
10255G60961J1671N685o020j8426k5638k6171k5163j8251q925L871P850J2188
10243F73632Q134j009p948o026j0934k0534k2382j5448j0416j1319j2757j0214
10231E52779r874j4982j8308k1688k3779k1495j3311J462M213J0034K616m690
$$ y = [3573834, 3328906, 3094477, 2883738, 2702942, 2546179, 2416205, 2316647, 2236839, 2158147, 2060421, 1950111, 1833940, 1714689, 1606074, 1518413, 1439756, 1375572, 1328109, 1294651, 1268574, 1249734, 1246714, 1255209, 1267123, 1269074, 1254739, 1243151, 1218651, 1168805, 1102769, 1038592, 991319, 956229, 920559, 901481, 902685, 916298, 934005, 963593, 994337, 1012089, 1007099, 985922, 947220, 905853, 867775, 833288, 803625, 781221, 758699, 736072, 723780, 720838, 729150, 742064, 760961, 772632, 778317, 772297, 753871, 728233, 702062, 676899, 658648, 649723, 653594, 661444, 673632, 681766, 680757, 672809, 666783, 655849, 635315, 612933, 597485, 587069, 575750, 562993, 552779, 542905, 527923, 509615, 487927, 464148, 442653, 429342, 430804, 435017, 445051, 447667, 442977]
10219D42977J2896K1933J6278P497P219O293J0497M853J38o440j4999j6437k3290
10206D69415l2747l5241l9201k9738k1923j4123l8R195J6677J3712J2163J5452
10194C63603L008j2123j3982k2150k7744k3451j8841l0690k7861j6283o763l131
10182A63592k201J0261J6454J6670J4372J1661M260K724M939O326L913j4884j7406
10169B20681r289l126p350j3649j6141j1842j107O725J7221K1359K6378K9778
10157B59638L1275K2337M689J508L080L530O509O491l75j0115k0256j6806j3488
10144B78017j1891j6420j4015k610Q565J0016J3227O500j332P91J827j967m015
10131B66693K270J2751M410k933k893N525J9400L6976N0452O0165M8446M1800
$$ y = [442977, 455873, 477806, 494084, 501581, 508800, 515093, 525590, 530443, 530581, 524141, 509142, 492705, 469415, 436668, 401427, 362226, 332488, 310565, 296442, 296404, 305599, 322276, 335988, 348151, 363603, 366611, 354488, 340506, 318356, 290612, 267161, 248320, 217630, 189769, 173486, 166723, 163592, 161391, 171652, 188106, 204776, 219148, 230809, 235069, 237793, 242732, 249058, 252971, 238087, 220681, 211392, 208266, 200916, 187267, 171126, 159284, 158177, 164902, 182123, 203482, 229860, 259638, 290913, 313250, 317939, 319447, 322527, 326057, 332566, 339057, 338682, 328567, 308311, 291505, 278017, 266126, 249706, 235691, 233081, 241646, 251662, 264889, 271389, 270057, 270848, 272675, 270708, 266693, 268963, 281714, 286124, 283191, 280298, 285823, 305223, 342199, 392651, 452816, 501262, 543062]
10119E43062M0312M5505K5474j0395l0838k9594l3634m1912n7226o3229n4370
10108C33155m5179l7931k6321j4346j3869j1041p629k354l478p291j7574j0400
10096A35742M13P379P6m289j1387k1878j9677j0854J393R159R391j033l52j0448
10082H3635r649m115l16l543n176p411m556o244P27N805R815Q696O379j008j793
10067G1246o113k833M769N574K463J233o006n599j700k336n812O75l0j254J802
10052E6079O679O991R943Q347J4548J4635P107r83o053M140J2113O574j6322m0368
10038H3430m4938l7106k5401j6556j0916Q4M869J396N235P339j149P24k271L222
10024c2038K999N821P412Q174O339J472M44K937K775L322N096K867K073p1j648
$$ y = [543062, 583374, 628879, 654353, 643958, 613120, 583526, 549892, 507980, 450754, 387525, 333155, 287976, 250045, 223724, 209378, 195509, 184468, 176839, 174485, 171007, 163716, 146142, 135742, 136155, 143534, 143610, 139321, 127934, 106056, 86379, 75525, 76918, 86077, 95468, 94435, 94083, 83635, 73986, 69871, 69555, 66012, 60836, 53425, 48869, 42625, 43352, 49157, 58972, 67668, 74047, 73039, 71246, 65133, 62300, 67069, 72643, 75106, 76339, 70333, 64734, 63034, 60698, 54886, 55561, 55531, 54277, 56079, 62758, 69749, 79692, 88039, 102587, 117222, 124329, 123346, 117293, 121433, 133546, 140120, 123798, 83430, 38492, 1386, -24015, -40571, -51487, -51403, -46534, -45138, -39903, -32564, -33713, -32989, -35260, -32038, -29039, -23218, -15806, -7632, -1293, 179, 623, 3560, 6335, 9657, 14753, 17620, 19693, 19622, 17974]
10009A7974M347P735j497l872J820O772M774l404P29M396P037J3109J3003O558
9995G9481P383J2570J0076J4390K4018L0318M6831P3453R6034J08852R7288N1098
9983F51792q715n0584o2582o7443m8251j8998J6129M7964O0783L2673k0010o3961
9971D68797q1506p2807n1374l7397k3251r543m556m869j617N171P166P599J8285
9958B20098K0915K0994K0100K0800K0404R393R758K4437L8954N1336O4465P3912
9946E95566P5041N3628K7535n497m7471o5406p2208o5463o0258m7597m2346k7305
9934C18219j3305n994N933J2455K7238L9583M2169O2464R0373J36485K11725L47523
9922A274868N08308M89676J27948k45786m00211l88390l10793k23694j53693j04967
$$ y = [17974, 22321, 30056, 28559, 24687, 26507, 33279, 38053, 34649, 35378, 39774, 46811, 59920, 72923, 79481, 86864, 99434, 109510, 123900, 147918, 178236, 225067, 298520, 394554, 503406, 600694, 651792, 643077, 592493, 529911, 462468, 414217, 395219, 411348, 459312, 520095, 552768, 532758, 468797, 387291, 314484, 263110, 225713, 202462, 192919, 188363, 183494, 181877, 187048, 194214, 201813, 220098, 241013, 262007, 282107, 302907, 323311, 332704, 342462, 366899, 405853, 457189, 521654, 595566, 670607, 724235, 751770, 746273, 698802, 633396, 561188, 495725, 435467, 387870, 345524, 318219, 304914, 298920, 304853, 317308, 344546, 384129, 426298, 488762, 579135, 715620, 927345, 1274868, 1783176, 2272852, 2400800, 2155014, 1754803, 1366413, 1055620, 831926, 678233, 573266]
9912E73266o2924m7537l3052k9035k6947k5623k1517j5650j3360j1447r318r784
9900B67072j0280n448n822r329Q03J77l354r110j429J2318J3401J3601R961P08
9886B73269q358j0400p8N017l613o75J0075J0254R271M694M783Q550Q697J0387
9872C21873J6597K0251K5340K1063J7525J2577J5562K0323L2603L7022L3532L7924
9860F12192L9395M9058N4000O1078Q3491J03357J18302J43112J76605K01485K30051
9849A872126K58377K73211K90439L32021M15908N14109N88974O33078O79301P17352
9839F574896P09058O40975N27630L99704L27641L59125M60419N97279P40814Q88272
9829A2225813J012324J112901J178568J191234J135851R77247P39443N15663L81057
$$ y = [573266, 510342, 462805, 429753, 400718, 373771, 348148, 326631, 310981, 297621, 286174, 276856, 267072, 256792, 251344, 245522, 236193, 236996, 237173, 233819, 224709, 223280, 235598, 248999, 262600, 272561, 273269, 264911, 254511, 254433, 259450, 255837, 255162, 265237, 275491, 284762, 289456, 294239, 302789, 311486, 321873, 338470, 358721, 384061, 405124, 422649, 435226, 450788, 471111, 503714, 540736, 574268, 612192, 651587, 700645, 754645, 815723, 899214, 1002571, 1120873, 1263985, 1440590, 1642075, 1872126, 2130503, 2403714, 2694153, 3026174, 3442082, 3956191, 4545165, 5178243, 5857544, 6574896, 7283954, 7924929, 8452559, 8852263, 9179904, 9539029, 9999448, 10596727, 11337541, 12225813, 13238137, 14351038, 15529606, 16720840, 17856691, 18833938, 19573381, 20089044, 20470101]
9820B0470101L10669K33648J55923J39080J72780J51801K0350j44265k40788k61224
9810B1008075k34128j48148j4069J34596K99094M96037O84169P81968O63251L00026
9800B3970871j78420n46646o82833o54830o20418p06076q99181j104200j221807
9791A7356460j221650j133746j000228q13187n91104l91111k74230k32410j85637
9782A1513157j32419q1439n1379m8701p9000j84811l38992m66509n39153n33496
9772I057258m54679l23633j67515k4375J09096K43645L65304M59413N11707N55939
9762A0332160O28198P02299O90106N53501L45853J42397L9367P0794J88371K81416
9752A3974462K70773K17785K10035L00085M80923P14756R77921J218066J322030
$$ y = [20470101, 20780770, 21014418, 21170341, 21309421, 21482201, 21634002, 21654352, 21510087, 21269299, 21008075, 20773947, 20625799, 20611730, 20746326, 21045420, 21541457, 22225626, 23007594, 23670845, 23970871, 23792451, 23245805, 22562972, 21908142, 21287724, 20581648, 19682467, 18578267, 17356460, 16134810, 15001064, 14000836, 13187649, 12596545, 12205434, 11931204, 11698794, 11513157, 11380738, 11299299, 11247920, 11199219, 11120219, 10935408, 10596416, 10129907, 9590754, 9057258, 8602579, 8278946, 8111431, 8087056, 8196152, 8439797, 8805101, 9264514, 9776221, 10332160, 10960358, 11662657, 12352763, 12906264, 13252117, 13394514, 13433881, 13504675, 13693046, 13974462, 14245235, 14463020, 14673055, 14973140, 15454063, 16168819, 17146740, 18364806, 19686836]
9743A9686836J263787J099175Q97480O66468M47488L01969K08122Q0272j54598
9734B4496999m14354n53884n27871m21147k95820j72373r265K17947M49743N90743
9724B3360718N46458L43927J00863q0294j99938k75642l34533l92948m58920m75241
9714B2134450m37988m42353o12494r28375j249746j454143j485810j350628j124357
9705A3048556q44107n76935l97055k96209k45320k00729j26285m2595N190k6735
9695A0297776j45512l53457o00645q18921r53054r86532r16664p84868o35311
9686D102812m95975l83195k99455k42674k18089k13142k09531k07047j87471j64800
9676A481433j42545j22797j03225q3365p2193o0314n1394m9034m3265l6686l1901
$$ y = [19686836, 20950623, 22049798, 22947278, 23613746, 24061234, 24363203, 24571325, 24651597, 24496999, 24082645, 23528761, 23000890, 22579743, 22283923, 22111550, 22102285, 22320232, 22769975, 23360718, 23907176, 24251103, 24351966, 24271672, 24071734, 23796092, 23461559, 23068611, 22609691, 22134450, 21696462, 21254109, 20641615, 19713240, 18463494, 17009351, 15523541, 14172913, 13048556, 12204449, 11627514, 11230459, 10934250, 10688930, 10488201, 10361916, 10319321, 10324511, 10297776, 10152264, 9798807, 9198162, 8379241, 7426187, 6439655, 5522991, 4738123, 4102812, 3606837, 3223642, 2924187, 2681513, 2463424, 2250282, 2040751, 1833704, 1646233, 1481433, 1338888, 1216091, 1112866, 1029501, 957308, 896994, 845600, 796566, 753301, 716615, 684714]
9665F84714l1308k7528k7519k4285k3929j1855o594n694j0665o307j958n614n251
9652D96207r16n544r870j5992p348l494j1457p880r632j5013j6981j0542j0664
9639C70874p603n320q603l378l179m764p746j0686n327P55m38p938j0868p534
9625B88245p525m385j834O62L890k969j570p03m431l72l320J160J501M40k934
9610B65855l492nl71l195J043L16o14M739j375p183n345k173L752R11n645r733
9594B37485j1958q926q334p177n533k997m602o485r98j319r168r341Q09m982n998
9579A50476n784l499l052q60k386l613l964j446q98m419k178N51J581J431Q45
9564A22785j0707p80l571o899m642j635M830J53l437n419L033L419m308P62l192
$$ y = [684714, 653406, 625878, 598359, 574074, 550145, 538290, 531696, 526002, 515337, 509030, 507072, 501458, 496207, 495291, 489747, 479877, 463885, 456537, 453043, 441586, 433706, 424074, 409061, 392080, 381538, 370874, 363271, 357951, 349348, 345970, 342791, 338027, 330281, 319595, 314268, 315023, 314585, 306647, 295779, 288245, 280720, 276335, 274501, 275163, 279053, 276084, 274514, 273811, 269380, 269008, 265688, 266848, 268349, 268789, 265855, 262363, 262358, 261987, 258792, 259835, 260151, 259537, 264276, 262901, 255718, 250373, 248200, 251952, 252863, 247218, 237485, 225527, 216601, 208267, 201090, 195557, 192560, 187958, 181473, 180475, 179156, 169988, 160647, 161456, 156474, 150476, 144692, 141193, 138141, 137281, 134895, 131282, 127318, 125872, 124974, 120555, 118377, 118928, 120509, 121940, 122785, 112078, 111298, 107727, 100828, 96186, 94551, 99381, 99534, 96097, 90678, 93711, 97130, 92822, 93584, 90392]
9549I0392j805n329j784l787l422L2K44j62L055j505l782O08p17o24L997j851
9533G3560l924k941O185J811j814p043j397k688k855K265M493j624r66J733j944
9518F2851n722q594l596k138j731k659P86L207K863J721k655j789k835m963J813
9503C6559P91j662n62L9q09m460n506L160j69L086N253j162m712j368j654k818
9487B4006n385l553j89k522k94k127N640J808n487K484L617k662J776J907K743
9472B1762O93O459K266k063k532J069Q78K078K410K052Pm840n18M153R83N8K67
9455C5182J884O597K338L033J903m069R83M4J690j278J096J516K866L895L071
9440F0751J22Q99J897J235N436J930O50L544J647k147m251O015O747L178J144
$$ y = [90392, 88587, 83258, 81474, 77687, 74265, 74297, 74541, 74379, 77434, 75929, 72147, 72755, 72038, 71414, 75411, 73560, 69636, 66695, 72880, 74691, 72877, 65834, 64437, 61749, 58894, 61159, 65652, 64028, 63062, 64795, 62851, 57129, 48535, 44939, 42801, 41070, 38411, 39197, 42404, 45267, 46988, 44333, 42544, 39709, 34746, 36559, 37350, 35688, 35126, 35165, 34356, 29896, 24390, 27550, 27381, 30467, 35720, 34558, 29846, 28478, 26824, 24006, 18621, 15068, 14879, 12357, 12063, 9936, 15576, 17384, 11897, 14381, 17998, 15336, 17112, 19019, 21762, 22455, 28914, 31180, 29117, 26585, 27654, 28532, 30610, 33020, 35072, 35079, 30239, 29721, 33874, 34857, 34915, 35182, 37066, 43663, 46001, 49034, 50937, 46868, 47851, 47895, 49585, 48307, 49403, 50919, 53785, 57680, 60751, 60873, 61772, 63669, 64904, 70340, 72270, 72920, 76464, 78111, 75964, 71713, 77728, 84475, 87653, 88797]
9425H8797O732O784N813O677O190N829K941L222L129k353K052K532K60l770j0924
9410A23911l694J497J573m411m804k978L583L54J599P993L263K618J054j610j503
9395A28445K800P56m409k260L085r991j1307n848n824m313q083N98k862n884n380
9380F9523k229J942j978m939o34j856j594K845O93J719j695l434J007k426n081
9365E1863l029j88N96Q639L492j512j838O004K88m4L189K697K683L981O575O301
9349H9697p64O102M001K785N609R099M504K920R59J585N657P202R031N604Q355
9334A62346J1746O83j124m962k254o539m313m113R19J325J822L294K529j213N706
9319A65852j856j756L755k108M7O281N20n57k606k708m580n448n248r831q391
$$ y = [88797, 95529, 102313, 108126, 114803, 120993, 126822, 129763, 132985, 136114, 133761, 135813, 138345, 138605, 134835, 123911, 120217, 121714, 123287, 118876, 114072, 111094, 114677, 115031, 116630, 124623, 127886, 130504, 131558, 129948, 128445, 131245, 132001, 127592, 125332, 128417, 118426, 107119, 101271, 95447, 91134, 83051, 83649, 80787, 74903, 69523, 67294, 69236, 67258, 62319, 61685, 59829, 58235, 61080, 61773, 63492, 61797, 58363, 59370, 56944, 51863, 48834, 48646, 49242, 57881, 61373, 59861, 58023, 64027, 64315, 64271, 67460, 70157, 72840, 76821, 83396, 89697, 88933, 95035, 99036, 101821, 107430, 116529, 121033, 123953, 124912, 126497, 132154, 139356, 148387, 153991, 162346, 174092, 174775, 173651, 168689, 166435, 159896, 155583, 151470, 152389, 153714, 155536, 158830, 161359, 160146, 165852, 163996, 162240, 165995, 163887, 163934, 170215, 170735, 170178, 167572, 164864, 160284, 154836, 149588, 139757, 131366]
9304A31366n617m115j50l841O45p64K59M423m606j856k108k138o436p487p419
9289I0156k836j161q841o278k502n198M489O226M813K405L146O591J69q530o304
9274G6345m967r380n034M27q87N14j683l664k181j460L936K992M309Q84N40L705
9258F4396M809J165j311k150l312j031n336l354N48M743J622l62Q2K105o182r41
9242E5491J281R77j449N93K173k48K222L022k567K675O526L227o123O45K027M238
9226G4710O943P821r65J081O864P296m93M314K870k440m375q732p724n706n608
9211G5856Q84L158N662R865K079P78l851k891n172n478j401J187N653M66J797
9196H8592N379N961J528L396k024K129J858m231L954p99j726O423O83o277n618
$$ y = [131366, 125749, 121634, 121484, 117643, 118288, 117524, 117783, 122206, 117600, 115744, 113636, 111498, 105062, 97575, 90156, 87320, 86159, 77318, 71040, 68538, 63340, 67829, 74055, 78868, 81273, 84419, 91010, 91179, 82649, 76345, 71378, 61998, 56964, 57391, 56504, 57018, 55335, 51671, 49490, 48030, 51966, 54958, 59267, 60151, 60691, 64396, 69205, 70370, 69059, 66909, 63597, 62566, 57230, 53876, 54424, 59167, 60789, 60427, 60509, 62614, 56432, 55491, 56772, 57749, 56300, 56893, 59066, 58818, 61040, 64062, 61495, 64170, 70696, 73923, 67800, 68445, 70472, 74710, 81653, 89474, 88509, 89590, 96454, 103750, 103257, 107571, 110441, 108001, 103626, 94894, 87170, 81464, 75856, 76740, 79898, 85560, 95425, 97504, 98282, 94431, 91540, 86368, 80890, 79489, 80676, 86329, 86795, 88592, 93971, 99932, 101460, 104856, 102832, 104961, 106819, 102588, 106542, 105743, 104017, 110440, 111123, 104846, 99228]
9181I9228q375r474m958o09n55r642l966J479n79L556K366k87Q89P847J0415O578
9165I3913N239M789J741L248J121O04l055m483J106j681O495J1715J0815J1362
9151A42929J6535J6083J4309J2875Q146k37n419j0627q542p106m254n667J507
9138A70532K892n95l392m618n736J911nn753J861M810j859N697Q358J0714J0469
9123A95286O096l402r078j4297j5992j7015j0407r738l671m325l386l998k267
9110A03806N22n228j0671j0851p298l393J327j08k358j207k830M76L61K37L070
9095F5855j021n85j941j29M012N286N82J918j032N033Q913J2710J0167M356N557
9080A19681J3018J2187Q205M515J228J852K817K922l112j588M072L325N280R452
$$ y = [99228, 90853, 81379, 76421, 75812, 75257, 65615, 61649, 63128, 62549, 66105, 68471, 68184, 69073, 76920, 87335, 93913, 99152, 103941, 105682, 108930, 110051, 110655, 107600, 103117, 104223, 102542, 109037, 120752, 131567, 142929, 159464, 175547, 189856, 202731, 210877, 210640, 205221, 194594, 186052, 178946, 174692, 169025, 170532, 173424, 172829, 169437, 164819, 159083, 160994, 160989, 155236, 157097, 161907, 160048, 165745, 174103, 184817, 195286, 201382, 197980, 188902, 174605, 158613, 141598, 131191, 121453, 117782, 113457, 110071, 106073, 103806, 104328, 99100, 88429, 77578, 70280, 66887, 68214, 68106, 65748, 64541, 61711, 62187, 62548, 62785, 65855, 64834, 64249, 62308, 62179, 66191, 71477, 72059, 73977, 72945, 77978, 86891, 99601, 109768, 114124, 119681, 132699, 144886, 153091, 157606, 158834, 160686, 163503, 166425, 163313, 161725, 165797, 169122, 174402, 183854]
9066A83854J109m704k171n500n090o704k295k162J486M520K274N420Q144J3903
9052A92084Q280L864K976l533p603J094j657N401J5077J3596J2506Q483R339J1553
9038B71460O636J4508K0202L5958M7497N8632Q8839J21530J55620J78087J64569
9027A163538J08151K1273o1788j19360j34326j29126j04736p6224m1733j2458
9017F13211J1772L7976O5640R3662J39787K04506K63239K72038K16346Q6705o5982
9006A938900j78925k30776k25906j90184j43179r3683n4953k8309M886L1172M9469
8995H78512Q2135J18968J63418K06008K17513K12177K12453K20798K00369J27514
8985B639865o561j49378k39780k64270k41452j94564j30160p0026k1334K9128
$$ y = [183854, 184963, 180259, 178088, 172588, 167498, 160794, 158499, 156337, 157823, 162343, 164617, 170037, 178181, 192084, 200364, 204228, 207204, 203671, 196068, 197162, 195505, 200906, 215983, 229579, 242085, 250568, 259907, 271460, 278096, 292604, 312806, 348764, 396261, 454893, 543732, 665262, 820882, 998969, 1163538, 1271689, 1292962, 1231174, 1111814, 977488, 848362, 743626, 667402, 625669, 613211, 624983, 662959, 728599, 822261, 962048, 1166554, 1429793, 1701831, 1918177, 2004882, 1938900, 1759975, 1529199, 1303293, 1113109, 969930, 876247, 821294, 792985, 797871, 829043, 878512, 960647, 1079615, 1243033, 1449041, 1666554, 1878731, 2091184, 2311982, 2512351, 2639865, 2633304, 2483926, 2244146, 1979876, 1738424, 1543860, 1413700, 1343674, 1322340, 1351468]
8975A351468O7716J26477J99154K98462M18417M92622M53367K79970M0511j58896
8965C569268k65075k85600k29831j33660k8493O7263J55628K19648K40445K26094
8955C535687J86388J36957P7506J1112n7366j18037j32037r3040j9576N2665J03721
8944C683980J46093K12278L27604M72509N81486N86335L85204L6417l11499n36566
8934E583841n83722n06535l71646k19056r5512o527M0039O5904P6742Q6097J07052
8923D176677J48984J92450K19348K38091K61542K97725L25181L01696K29295J00187
8913F491176o6396k10465k86319l04407k76189j97855r1413L7959J76934L27512
8903E600537N18051P27592R16718J028132R42776N68991M614n59753r32124j048811
$$ y = [1351468, 1419184, 1545661, 1744815, 2043277, 2461694, 2954316, 3407683, 3687653, 3728164, 3569268, 3304193, 3018593, 2788762, 2655102, 2626609, 2693872, 2849500, 3069148, 3309593, 3535687, 3722075, 3859032, 3936538, 3947650, 3890284, 3772247, 3640210, 3547170, 3527594, 3580259, 3683980, 3830073, 4042351, 4369955, 4842464, 5423950, 6010285, 6395489, 6431906, 6120407, 5583841, 5000119, 4493584, 4121938, 3902882, 3807370, 3800843, 3840882, 3906786, 3983528, 4069625, 4176677, 4325661, 4518111, 4737459, 4975550, 5237092, 5534817, 5859998, 6161694, 6390989, 6491176, 6424780, 6214315, 5927996, 5623589, 5347400, 5149545, 5058132, 5096091, 5273025, 5600537, 6118588, 6846180, 7762898, 8791030, 9733806, 10302797, 10307411, 9747658, 8815534, 7766723]
8893G766723r63490p66089n30490k96344o3936J66998L88871N72062O28679M90802
8883G393786J74069j69551l99127m63706l99966k73362j33698k0113M5981Q4391
8873E838704J32346K29154M08624O66252Q74537Q65408N27197J8743l87095n53030
8863H620840n10141l62241j95759q8926p8291j38576j94723j85215p6886Q1508
8853F871590J98587J86067N9739q5506j30451m4541J86326M84524O75577N68774
8843H970686J56241l32099o56855p28201o04904l77915j30328J23996L91259P02947
8833G514827J070740J396698J489681J239290P79726K52089l10135p82154j018533
8824A1632229r84244p49748m31116j42998L4822R7589R6725Q8660R1700R3350
$$ y = [7766723, 6803233, 6037144, 5506654, 5210310, 5146374, 5313372, 5702243, 6274305, 6902984, 7393786, 7567855, 7398304, 6999177, 6535471, 6135505, 5862143, 5728445, 5708332, 5754313, 5838704, 5971050, 6200204, 6608828, 7275080, 8149617, 9015025, 9542222, 9560965, 9173870, 8620840, 8110699, 7748458, 7552699, 7463773, 7385482, 7246906, 7052183, 6866968, 6790082, 6871590, 7070177, 7256244, 7315983, 7230477, 7100026, 7055485, 7241811, 7726335, 8401912, 8970686, 9126927, 8794828, 8137973, 7409772, 6804868, 6426953, 6296625, 6420621, 6811880, 7514827, 8585567, 9982265, 11471946, 12711236, 13490962, 13743051, 13432916, 12650762, 11632229, 10647985, 9898237, 9467121, 9324123, 9358945, 9456534, 9553259, 9641919, 9733619, 9826969]
8814I826969Q6062J13675K05021L35470N03077P47705J104449J500147J740251
8805A6162826J659146J260617P46389K95095l8518k35028l43276m41987n03380
8796A8561884m81192m13872l77498l48986k17396N0060M10180P15069P80610M53860
8786A9132719m6581k57806j80504L3902K58915K87332K8694l06345n05727n92061
8776A7852538o77692q38432j085648j333162j482594j492755j389446j226828
8768H325981j045191q61953o93089n54539m44425l55824k79117k11088j62514
8759C718241j50384j36848j09267p0807j7562L5759P5083J09579J52598K01118
8749C807510K56408L06385L64973M40095N53955P38732R70924J220775J435578
$$ y = [9826969, 9913031, 10026706, 10231727, 10567197, 11070274, 11817979, 12922428, 14422575, 16162826, 17821972, 19082589, 19828978, 20124073, 20085555, 19850527, 19507251, 19065264, 18561884, 18080692, 17666820, 17289322, 16940336, 16722940, 16773000, 17183180, 17898249, 18678859, 19132719, 19086138, 18828332, 18647828, 18681730, 18940645, 19227977, 19256671, 18950326, 18444599, 17852538, 17174846, 16336414, 15250766, 13917604, 12435010, 10942255, 9552809, 8325981, 7280790, 6418837, 5725748, 5171209, 4726784, 4370960, 4091843, 3880755, 3718241, 3567857, 3431009, 3321742, 3250935, 3233373, 3269132, 3344215, 3453794, 3606392, 3807510, 4063918, 4370303, 4735276, 5175371, 5729326, 6468058, 7438982, 8659757, 10095335]
8740A0095335J549188J565091J559848J555209J545324J439226J130081O52290
8732B1091592J61169j94245l49118k84022n1218K30378L93901L05423r9957o50918
8722B0552985j007478j050286r22664p15241m13269l0982M18212Q61008J124572
8713A8816857J089449Q11212M85591K27334J8365j46513l09856n23681o67441
8704A9801317n78690k92913k9263k9404l04480o34165q20647r14213j049045j278896
8694A3869601j470889j509056j403174j225636j040963q53243o87568n39508m25645
8685D713919l42869k78663k04471j28428m8190L1488P9036J22746J71696K20553
8675D336817K66642L14812L42229L46543L47919L58332L56181L51066L82429M73571
$$ y = [10095335, 11644523, 13209614, 14769462, 16324671, 17869995, 19309221, 20439302, 21091592, 21252761, 21058516, 20709398, 20425376, 20374158, 20604536, 20998437, 21303860, 21203903, 20552985, 19545507, 18495221, 17572557, 16857316, 16444047, 16413065, 16831277, 17692285, 18816857, 19906306, 20717518, 21203109, 21430443, 21448808, 21302295, 20992439, 20468758, 19801317, 19222627, 18929714, 18900451, 18871047, 18566567, 17932402, 17111755, 16197542, 15148497, 13869601, 12398712, 10889656, 9486482, 8260846, 7219883, 6366640, 5679072, 5139564, 4713919, 4371050, 4092387, 3887916, 3759488, 3711298, 3742786, 3821822, 3944568, 4116264, 4336817, 4603459, 4918271, 5260500, 5607043, 5954962, 6313294, 6669475, 7020541, 7402970, 7876541]
8665G876541O05587P45803Q61960R34379R60531R59820R23079R21619J010406
8656A5799725J147426J131586Q31409L36097j89486o21983r04742j042048j064509
8647A5423475j014708r21475q05947p13814o35376n31723l87625j87115N1105
8638A0276797K71287M55157O34161Q14896R55373J017446J039026J024399R25152
8629A7413694O96406L69391k3880m97707r69712j356885j623464j710933j614825
8620A0682085j441305j287520j166035j026187q65702o99761n65205m39175l35265
8611B855930k64221k09482j72834j51947j26744j04578q6692o8155n0645k7820
8601A592812K393K5473M9917P4959J14461J55899J97972K45808L00191L52080
$$ y = [7876541, 8482128, 9227931, 10089891, 11024270, 11984801, 12944621, 13867700, 14789319, 15799725, 16947151, 18078737, 18910146, 19246243, 19056757, 18434774, 17530032, 16487984, 15423475, 14408767, 13487292, 12681345, 11967531, 11332155, 10800432, 10412807, 10225692, 10276797, 10548084, 11003241, 11637402, 12452298, 13407671, 14425117, 15464143, 16488542, 17413694, 18110100, 18479491, 18455611, 17957904, 16988192, 15631307, 14007843, 12296910, 10682085, 9240780, 7953260, 6787225, 5761038, 4895336, 4195575, 3630370, 3191195, 2855930, 2591709, 2382227, 2209393, 2057446, 1930702, 1826124, 1739432, 1671277, 1620632, 1592812, 1595205, 1620678, 1670595, 1745554, 1860015, 2015914, 2213886, 2459694, 2759885, 3111965]
8591C111965L88591L85045L58956L37697L31190L66410M06883L87618K80403Q7914
8581F442672j14508k66135l59829m36389n17423n52377n32921m50972l39231k29686
8571B643201j32769n4280J1529P4556J42171K25091L13991M17729M95087N43395
8561D679701N66122N77126N50064M11522J25058j97296m29213n24292n32246n19912
8551D706634n23979n34223n15679m65228l92931l15490k49860j99776j57938j26673
8541A224857j02738p8906o8536n7920n2584m6055m2085l8470k9405k1604j9062
8530F67492k0204j1012j0582j3286j1302j6375k5749k3920j1321j4174j6939j2764
8518D79864q749k834j581K573o78m862p067l998q42J001R88K420O699j115o077
$$ y = [3111965, 3500556, 3885601, 4244557, 4582254, 4913444, 5279854, 5686737, 6074355, 6354758, 6442672, 6328164, 6062029, 5702200, 5265811, 4748388, 4196011, 3663090, 3212118, 2872887, 2643201, 2510432, 2456152, 2467681, 2542237, 2684408, 2909499, 3223490, 3641219, 4136306, 4679701, 5245823, 5822949, 6373013, 6784535, 6909593, 6712297, 6283084, 5758792, 5226546, 4706634, 4182655, 3648432, 3132753, 2667525, 2274594, 1959104, 1709244, 1509468, 1351530, 1224857, 1122119, 1043213, 974677, 916757, 864173, 818118, 776033, 737563, 708158, 686554, 667492, 647288, 636276, 625694, 612408, 601106, 584731, 558982, 535062, 523741, 509567, 492628, 479864, 471115, 468281, 466700, 469273, 468595, 463733, 456666, 452668, 451826, 452827, 453815, 456235, 462934, 461819, 455742]
8503D55742l346p95J802N385R52O578k174r459n021p119n114L18K286l130m290
8488D32615j698q393l746N26L678M745P107R252J1023J1321O177J3353J1479J3317
8474E10756J1343R745J25L737l1l705n15L637K657J868M330L861M236J1523J2547
8459E76114J5789J6668J2992J3279Q631o357j1461r604k187L4o051n741J561Q096
8445F11763n41J570M376K289J1710J3080J1901J4654J3439J2995J3276P533L395
8432G21440N197Q874P857J2397J3641R115J1137Q639R951J8126J6042J3578J3442
8419H69436J6610K0982K6303K9621K8819K4999K3392L1679L7170L8145L5614L1035
8407A213805L6982L8075K7523J7536K6599K7999K6423K3250L0982L6221M2355
$$ y = [455742, 452396, 451601, 453403, 458788, 459740, 466318, 464144, 454685, 449664, 442545, 437431, 437749, 440035, 436905, 432615, 430917, 422524, 418778, 419304, 422982, 427727, 434834, 444086, 455109, 466430, 472607, 485960, 497439, 510756, 522099, 531844, 531969, 535706, 535675, 531970, 531455, 535092, 537749, 539617, 543947, 547808, 552044, 563567, 576114, 591903, 608571, 621563, 634842, 643473, 637116, 625655, 616051, 613864, 613898, 607847, 602106, 603667, 611763, 611222, 612792, 617168, 619457, 631167, 644247, 656148, 670802, 684241, 697236, 710512, 718045, 721440, 726637, 735511, 743368, 755765, 769406, 778521, 789658, 798297, 808248, 826374, 842416, 855994, 869436, 886046, 907028, 933331, 962952, 991771, 1016770, 1040162, 1071841, 1109011, 1147156, 1182770, 1213805, 1250787, 1288862, 1316385, 1333921, 1360520, 1388519, 1414942, 1438192, 1469174, 1505395, 1547750]
8396A547750M5641M7316M9436N6754O1787O0954O0123O0499P2688P7771Q6656
8385B227375Q9478R2459J01048J06256J01578J09177J09841J11631J18422J22667
8375C289932J32662J45965J59911J78358J87492K06164K16576K29194K48843K65681
8365E260778K88058L17301L43372L67617L96225M33556M71244N05293N49226N98534
8355I531204O41953P00872P54087Q08409Q74030R33113R89492J039391J099052
8346A7371603J155477J194741J231968J257907J277709J288585J280881J253504
8338B7312375J195243J104128R75521Q14565O16148L88990J39268j17015l77016
8329C2052207o27182q55902j039716j192016j306066j376388j412902j411317
$$ y = [1547750, 1593391, 1640707, 1690143, 1746897, 1808684, 1869638, 1929761, 1990260, 2062948, 2140719, 2227375, 2316853, 2409312, 2510360, 2616616, 2718194, 2827371, 2937212, 3048843, 3167265, 3289932, 3422594, 3568559, 3728470, 3906828, 4094320, 4300484, 4517060, 4746254, 4995097, 5260778, 5548836, 5866137, 6209509, 6577126, 6973351, 7406907, 7878151, 8383444, 8932670, 9531204, 10173157, 10874029, 11628116, 12436525, 13310555, 14243668, 15233160, 16272551, 17371603, 18527080, 19721821, 20953789, 22211696, 23489405, 24777990, 26058871, 27312375, 28507618, 29611746, 30587267, 31401832, 32017980, 32406970, 32546238, 32429223, 32052207, 31425025, 30569123, 29529407, 28337391, 27031325, 25654937, 24242035, 22830718]
8321B2830718j384536j348601j287608j231145j157499j077132r94676r11533
8313A3437988q29577p37626o44373n55815m68174m20601m64241n34688n68536
8304H214357n55468n16882m61955m04614l55907l13365k83936k60229k38100k31822
8294D592079k19552j96117j87934j69872j64666j54049j41030j32483j20536j09865
8284B995975j02292r6266r2006q5898p8243p2562o3981n6391m7142l7041l4158
8273B229995m1232m7704m3559l3239j5305R174L9350Q8234J67013K73700L03195
8262B929622J23792j24774k72443l00705k67268k09455j53265j09490p7042o2921
8252A476051n9229n7766m6819m8046m5552m6760m2453l8973l2353k3464j9409
$$ y = [22830718, 21446182, 20097581, 18809973, 17578828, 16421329, 15344197, 14349521, 13437988, 12608411, 11870785, 11226412, 10670597, 10202423, 9781822, 9317581, 8782893, 8214357, 7658889, 7142007, 6680052, 6275438, 5919531, 5606166, 5322230, 5062001, 4823901, 4592079, 4372527, 4176410, 3988476, 3818604, 3653938, 3499889, 3358859, 3226376, 3105840, 2995975, 2893683, 2797417, 2705411, 2619513, 2541270, 2468708, 2404727, 2348336, 2301194, 2264153, 2229995, 2188763, 2141059, 2097500, 2064261, 2048956, 2058130, 2097480, 2185714, 2352727, 2626427, 2929622, 3053414, 2928640, 2656197, 2355492, 2088224, 1878769, 1725504, 1616014, 1538972, 1476051, 1416822, 1359056, 1312237, 1264191, 1218639, 1171879, 1129426, 1090453, 1058100, 1034636, 1015227]
8241A015227j3576q908r734j6818j5354j1919j2959j5716j1724j0882k13Q440
8229H95864Q280L967J237N41m66k798q66J5013L5024O1608J01405J26873P9870
8216A325552k5709j04507j35498j27292j03925q0010o2694m2843l3172k4930j6815
8205E68157j5482j4154j7654j1286j2780j4406j0284r133k553q040q883m546n45
8192D38411k825k839p178k633k795Q37N028Q992J1587J575k483n450j0976j4564
8178D14687j4217j1447q225j0245j3040n781M387N354M942Q927Q849j923r620
8165C72648j0269j1908r209q320m846m529l061L7J997P509N562l464n338r152
8151C17657j3271r110o560q006m931l50K83j844m838L548Q379R341J3019J0953
$$ y = [1015227, 1001651, 992743, 983009, 966191, 950837, 938918, 925959, 910243, 898519, 887637, 887424, 895864, 904144, 908111, 909348, 909889, 909423, 906625, 905759, 920772, 955796, 1017404, 1118809, 1245682, 1325552, 1299843, 1195336, 1059838, 932546, 828621, 748611, 685917, 643074, 609902, 584972, 568157, 552675, 538521, 520867, 509581, 496801, 482395, 472111, 462978, 460425, 452385, 443502, 438956, 438411, 435586, 432747, 425569, 422936, 420141, 420978, 426006, 434998, 446585, 448160, 445677, 440227, 429251, 414687, 400470, 389023, 380798, 370553, 357513, 351732, 356119, 361473, 366415, 375342, 384191, 382268, 372648, 362379, 350471, 341262, 332942, 328096, 323567, 320506, 320543, 322540, 330049, 335611, 332147, 326809, 317657, 304386, 295276, 288716, 280710, 275779, 275429, 275712, 273868, 269030, 272578, 280957, 290298, 303317, 314270]
8137C14270P6p296j1774j0113j0956o492l224O419Q924O507p174j1519j4890j3336
8123B39422j5613p319k306m91n472l286J756m197l541l136M13k376m068l842k554
8108A83390q71m037j030l83k175j06n76K236J682j561j634L188N815M153L175
8093A91266J182j037j964l636n919o553m990o803j111l804n362j409k64J981l992
8078A47585m810n279p70Q8p2J494k57L008j239l338j300q77j757m5m622m257M256
8061A27808m68N70n758l795J334K708j756K725j148j424J031J292l925m907K381
8046A16668l144o858j618P19M086M450P45k701j410j477K040K136q1k11L176l988
8030A12532L75n596m121J887K796o693m89k54o125k964o8N86k688j786k617j608
$$ y = [314270, 314346, 307050, 295276, 285163, 274207, 267715, 264491, 270910, 279834, 286341, 279167, 267648, 252758, 239422, 223809, 216490, 214184, 213693, 208221, 204935, 206691, 202494, 198953, 195817, 196230, 193854, 189786, 185944, 183390, 182519, 178482, 177452, 177069, 174894, 174788, 174212, 176448, 178130, 176569, 174935, 178123, 183938, 188091, 191266, 192448, 191411, 189447, 185811, 179892, 173339, 168349, 161546, 160435, 156631, 151269, 149860, 149596, 151577, 147585, 142775, 137496, 136726, 136814, 136742, 138236, 137979, 140987, 139748, 136410, 135110, 134233, 132476, 132431, 127809, 123552, 127808, 127340, 127910, 122152, 118357, 119691, 122399, 120643, 123368, 122220, 120796, 121827, 123119, 119194, 114287, 116668, 113524, 106666, 105048, 105767, 109853, 114303, 115048, 112347, 110937, 109460, 111500, 113636, 113555, 113344, 116520, 112532, 112907, 107311, 103190, 105077, 107873, 101180, 100691, 100437, 94312, 91348, 91280, 91866, 89178, 87392, 84775, 83167]
8014H3167q35J697K965j04m513%M141R80K174l001j150j68O82M643l454m893R41
7997H3272o49K866j910J18r6j252Q01J40M993N943N013O484l19k564m976K207
7981A00071O168K047k129k898m854k89P191L658K628k530n371m732o126m624l019
7966H5191j623J655j46J812J988l952j928k563o275m261K626J217K118N004K050
7951H2913J82M185L623J660l424L276k67m76j224j778M375M766j091j895J0006
7936A04831Q172P10r69n78n75O190J0876J1265J2267K293q138r065j4875j4114
7922A08290j1759m775O52l214K126k398J006j514j919K587K279m850k788k275
7908H1448J299k519k062j262m113J304J693J640o635l885N769K876l80p03K368
$$ y = [83167, 82332, 84029, 86994, 86890, 82377, 82377, 86518, 87498, 89672, 86671, 85521, 85353, 86035, 90678, 87224, 82331, 83272, 82623, 85489, 83579, 83697, 83601, 82349, 83150, 83290, 88283, 94226, 99239, 105723, 105404, 102840, 97864, 100071, 106239, 108286, 106157, 103259, 98405, 98116, 105307, 108965, 111593, 109063, 103692, 98960, 92834, 88210, 85191, 83568, 85223, 85077, 86889, 88877, 84925, 82997, 80434, 74159, 69898, 72524, 73741, 75859, 80863, 82913, 83095, 87280, 90903, 92563, 89139, 92415, 92148, 91672, 90448, 88670, 93045, 97811, 96720, 94825, 104831, 113003, 113713, 112744, 112166, 111591, 117781, 128657, 139922, 152189, 154482, 146344, 137279, 122404, 108290, 96531, 91756, 92408, 89194, 91320, 88922, 89928, 88414, 86495, 89082, 91361, 86511, 83723, 81448, 82747, 80228, 78166, 76904, 72791, 74095, 75788, 77428, 70793, 66908, 72677, 75553, 75173, 74470, 76838]
7893G6838R07L197K513k221J350L213J953p37M059J791m17L184J094j239O452
7878A01937N71q367l397M61p755j0226k477J31m954j716J2J080N78N993J692m292
7862F9271l100n727l494k031k145k668k990j910N092J684n76l291J103N653j863
7847E3008k766m017m982k6J20Q18L321R225L542j627r9k08M75o320k407K470j459
7830D9068l632m186l271J206R461l279o952L76K272L853P086r5m129M47m371l22
7814D3532K55M54r45J854L24o53O83l770r43m68K325J52j490R57j75R93j065n881
7796C6139n129k280K680k428N63N396K847n085J51K309m089k42N500P216N433
7781D8981k616K05O00L375K955P985J5646K3528L1078J4002j283r881k1386j5397
$$ y = [76838, 77745, 80942, 83455, 81234, 82584, 85797, 87750, 87013, 91072, 92863, 92446, 95630, 96724, 95485, 101937, 102508, 94141, 90744, 91205, 83450, 73224, 70747, 70878, 65924, 64208, 64220, 65300, 65878, 71871, 73563, 69271, 66171, 60444, 56950, 54919, 52774, 50106, 47116, 45206, 50298, 51982, 51406, 48115, 49218, 54871, 53008, 50242, 46225, 41243, 41217, 41337, 42155, 45476, 54701, 58243, 56616, 56517, 56309, 56784, 50464, 48057, 50527, 49068, 45436, 41250, 37979, 39185, 48646, 45367, 38415, 38791, 41063, 44916, 52002, 51907, 47778, 48225, 43854, 43532, 43787, 44241, 43296, 45150, 45474, 44821, 45504, 41734, 40791, 40323, 42648, 42800, 41310, 42267, 42092, 43085, 42020, 36139, 31010, 28730, 31410, 28982, 29545, 34941, 37788, 32703, 32854, 35163, 31074, 30832, 36332, 43548, 48981, 46365, 46570, 47170, 50545, 53500, 61485, 77131, 100659, 131737, 145739, 144456, 134575, 113189, 97792]
7767I7792j6037j3565r279n682m030p238l627p43K23N306k205n012L46J136j459
7752C5926o619o959L89O180K430P77j892j457O547p93j628J886L173K52L20N875
7736D4407R225J1455J5125J8976K0110J6368j696j4227k2758j8686r344j4447
7724E4508m133k249l590k759n775n751M42K456j760l534J722p523P82O55l460
7709B0031p88l548L541N503L22k65n76J12k027J007J950p95n047j69L794J777
7693B4822J320K548J283J830o23k279L21k514k917k261L45N13q81m52J086n82
7677B1559k389K880J329K661l471j85j845o730l776k78J38K533L276k279q66j709
7661A0848r05L982O82J503k41J27L329L96n0j339j23M33o350l176L323L317O79
$$ y = [97792, 81755, 68190, 58911, 53229, 49199, 41961, 38334, 37591, 37814, 43120, 40915, 35903, 36249, 37385, 35926, 29307, 22348, 22737, 28917, 31347, 32124, 30232, 28775, 35322, 34529, 32901, 34787, 37960, 38212, 38532, 44407, 53632, 65087, 80212, 99188, 119298, 135666, 133970, 119743, 96985, 78299, 68955, 54508, 50375, 48126, 44536, 41777, 36002, 30251, 30693, 33149, 31389, 27855, 29577, 22054, 22836, 23491, 20031, 19243, 15695, 19236, 24739, 25061, 24796, 24220, 24332, 22305, 23312, 25262, 24467, 19420, 19251, 23045, 24822, 26142, 28690, 29973, 31803, 31180, 28901, 29222, 26708, 23791, 21530, 21875, 22388, 21507, 21055, 22141, 21559, 19170, 22050, 23379, 26040, 22569, 22384, 20539, 13809, 10033, 9755, 9893, 12426, 15702, 13423, 12557, 10848, 9943, 13925, 14607, 16110, 15869, 15996, 19325, 19721, 19671, 18332, 18209, 18642, 12292, 9116, 12439, 15756, 16435]
7644A6435L642J451k952J083j789m595m166K943j089J831J080K8K079n21m634
7629A0826J069J279j026l245j655R72M552l237p18L23l104J62K692J649J127K236
7613A3902L636r41j889j986K645j959L841M11K287J6n195M221L131r70k966J631
7597A9815L446n50j053j966k16j896j805K054l033n666m76L275L758k109k66L030
7581A6342K303K176l60n794l445k773O59M714K318M23m134k758K337L368l103
7566A2273j639L322M153l329R72M706q3l434k287o334j394L327o33R01m380m489
7550A652K429M983K147J810j276j54p0K615j292j070n989m747M59J271j395N15
7534A888M830J144m29N4l095m262K396J481o05J1M90J359J022l376J587J630K949
$$ y = [16435, 20077, 21528, 18576, 19659, 17870, 13275, 9109, 12052, 10963, 12794, 13874, 13902, 15981, 15460, 10826, 11895, 13174, 12148, 8903, 7248, 8220, 12772, 9535, 8817, 9140, 6036, 6198, 8890, 10539, 11666, 13902, 17538, 16597, 14708, 12722, 15367, 13408, 17249, 17660, 19947, 19963, 14768, 18989, 22120, 21150, 18184, 19815, 23261, 22711, 21658, 19692, 19476, 17580, 15775, 17829, 14796, 9130, 8654, 11929, 15687, 13578, 13312, 16342, 18645, 20821, 20461, 14667, 11222, 8449, 9108, 13822, 16140, 16563, 12429, 9671, 12008, 15376, 12273, 10634, 13956, 18109, 14780, 15752, 20458, 20375, 16941, 14654, 8320, 6926, 10253, 9620, 10521, 6141, 1652, 4081, 9064, 11211, 13021, 11745, 11591, 11521, 14136, 12844, 11774, 5785, 1038, 1497, 2768, 1373, 1888, 6718, 7862, 7433, 7487, 4392, 130, 2526, 4007, 3402, 3413, 3903, 5262, 6284, 2908, 4495, 6125, 9074]
7517I074j41l277j274j35L10k347m727m451L676L318M051J889r73p63J076O808
7501A2114L66o524k900K762j917L593l757L348K695K838m93J149M40N63k627j156
7485A0494j095k861N567n65q14J168L811K569l477Q88J981J99p340n395n18l478
7469A134L504M711k453j730n8N097k835m238J443M251k915m42K433m839M49R23
7453D435J932j929l595j062M458p69K751K774k048P00N93o23J036K899N47k255
7437I844N74j396K29J920M111M4n379j548j131N99K692J792L24R70k010j645k776
7420G214j062J926j900j983N51J464K43J701j434L321k225J697k687m979j504
7405C43l323J255L003l132Q965K572J969j99P10o91j086J126j065j337j202r37
$$ y = [9074, 8933, 5656, 4382, 4247, 4557, 2210, -2517, -6968, -3292, 26, 4077, 5966, 4993, 4230, 5306, 12114, 12480, 5956, 3056, 5818, 3901, 7494, 3737, 7085, 9780, 12618, 12125, 13274, 13714, 14277, 11650, 10494, 9399, 6538, 12105, 11540, 10726, 11894, 15705, 18274, 14797, 15685, 17666, 17865, 10525, 5130, 4612, 1134, 4638, 9349, 6896, 5166, 5108, 10205, 7370, 3132, 4575, 8826, 5911, 5469, 7902, 3063, 3512, 4435, 6367, 4438, 843, -219, 4239, 3470, 6221, 8995, 6947, 7647, 8240, 7617, 8653, 11552, 12099, 9844, 10418, 9022, 9251, 11171, 15282, 15326, 9947, 8399, 7268, 7867, 10559, 12351, 12675, 13645, 11635, 9990, 7214, 6152, 8078, 6178, 4195, 4746, 6210, 6453, 8154, 6720, 10041, 7816, 9513, 6826, 1847, 343, -2980, -1725, 1278, -1854, 7111, 9683, 11652, 11453, 12163, 11472, 10386, 11512, 10447, 9110, 7908, 6971]
7389F971j919n43r60J174j964Q08J788L406j30L401k46L108m619m251N571m277
7373G318j561K183k574J894J982M311k269K486j500l59J015p197o045J851L10
7358A845j404J918J104j01K516L915k376n546L375l77j27l028l447J004l037N380
7342A614P031Q24n497K02J8j786k589L481M374L524p49l519n38J544M459m67k666
7325I260l58L53P39k261l435n983k77q52P909M238k991j813J862k03p3j930N04
7308D689n19L212j360O14J709l749m995J897R30L304k841N262J787j864k272J036
7292F840Q00l298k163l31P147J464k139k72J972J474k7n719o05N091o30J25K047
7275A1776J995l618r091n037k088j445J810R067N619q43k335nn223J038L755M035
$$ y = [6971, 5052, 4509, 3549, 4723, 2759, 3567, 5355, 8761, 8631, 12032, 11786, 14894, 10275, 6024, 11595, 7318, 5757, 7940, 5366, 7260, 9242, 13553, 11284, 13770, 12270, 11911, 12926, 5729, -316, 1535, 1845, 441, 2359, 3463, 3362, 5878, 9793, 7417, 1871, 5246, 4869, 4742, 1714, -1733, -729, -3766, 1614, 8645, 9469, 3972, 4174, 4192, 2406, -183, 3298, 7672, 11196, 10447, 6928, 6390, 7934, 12393, 11926, 9260, 8902, 9255, 9994, 7733, 4298, -1685, -1962, -2814, 5095, 9333, 6342, 4529, 6391, 6188, 6115, 4185, 4689, 4170, 7382, 6022, 6636, 8345, 4596, -399, 1498, 2428, 5732, 2891, 8153, 9940, 8076, 5804, 6840, 7640, 4342, 2179, 1848, 8995, 10459, 8320, 8048, 10020, 11494, 11467, 5748, 5143, 10234, 9604, 9729, 11776, 13771, 10153, 1062, -3975, -6063, -7508, -5698, 3369, 8988, 8145, 5810, 5805, 582, 1620, 5375, 9410]
7259I410K368p281n690K872P76O67j159k278o074k122L933Q249k385lL366k405
7243B244k85L5J101L458R54k326k62j458K34J177l747J358l316J640K844j291
7227B360J813J03K164m513k697L212j50L712P29J99J226j218J593K579l747J695
7211I060J096n256N36j417o07J803L360J049k295J338J526n206m142M195K63n92
7195D711l278r29l767j036M240L740j405N80j58l416l821K271L659k133J46K991
7179B395M055k036k184J701j68J498l376J611J4M010p83k186n921J692K265K318
7163D905J284j216o65n149m154P4J189O487k034k44j169j43M37K556Q73J886P30
7146E647m05j513j977j982q66O803J473n698O64M194k754J229J13l999J128M402
$$ y = [9410, 11778, 4497, -1193, 1679, 2455, 3122, 1963, -315, -6389, -8511, -4578, 3671, 1286, 1283, 4649, 2244, 1959, 1994, 3095, 6553, 7507, 5181, 4919, 3461, 3695, 4872, 1125, 2483, -833, 807, 3651, 2360, 4173, 4276, 6440, 1927, -770, 2442, 2292, 6004, 6733, 6932, 8158, 6940, 8533, 11112, 7365, 9060, 10156, 4900, 5436, 4019, 3412, 5215, 8575, 9624, 7329, 8667, 10193, 4987, 845, 5040, 5303, 4711, 1433, 504, -3263, -4299, -59, 3681, 2276, 2856, 2698, -718, -4539, -2268, 1391, -742, -596, 2395, 6450, 4414, 2230, 3931, 3763, 5261, 1885, 3496, 3510, 7520, 6737, 4551, -1370, 322, 2587, 4905, 6189, 4973, 4308, -841, -4995, -4921, -3732, 2755, 721, 477, -692, -835, -398, 2158, 3031, 4917, 5647, 5242, 3729, 1752, -230, -1096, 5707, 7180, 1482, 2146, 6340, 3586, 4815, 4928, 929, 2057, 6459]
7130F459r80M67l242O343k193r55j033p14k039k611Q79j836J052L9k060K696L521
7113C793L409N78k326k928k58K15L381j420k706j532J20N37L125Q38J353o245
7097f6r62N071N719m75J654j410m476m237Q89k40J178K433j083P60o69J97K521
7080F804q27l311n128J686j40J80k711J499M342J773k215j292J075L903j282q42
7064C514o459J076M49K185j746l301K65l80L1N81J154o42K393J527J228N660R06
7047H441j556k519k94m18J591n76L099l230r186r25L462Q900j684J367k051L310
7031G731L24j664M376p96o096k837M749j626l399j034J536l343l207J422K315
7016a549j652n09J946P159L299L789l47R16l135l018l797m660J447Q83L344l051
$$ y = [6459, 5479, 5946, 2704, 9047, 6854, 5899, 4866, 4152, 2113, -498, 381, -1455, -403, -364, -2424, 272, 3793, 7202, 7780, 5454, 2526, 2268, 2483, 5864, 4444, 1738, 206, 326, 863, 3988, 4826, 6179, -66, -1028, 4043, 9762, 9287, 10941, 9531, 5055, 818, 1707, 1467, 2645, 5078, 3995, 4755, 4086, 4283, 6804, 5977, 2666, -2462, -776, -916, -736, -3447, -1948, 2394, 4167, 1952, 660, 1735, 5638, 4356, 3514, -2945, -1869, -1420, 765, -981, -4282, -4017, -4397, -4366, -3785, -2631, -3273, -880, 647, 1875, 7535, 8441, 6885, 4366, 4072, 3654, 5245, 4669, 7768, 4538, -4648, -5573, -2111, 6789, 5105, 6472, 4421, 7731, 8055, 6391, 10767, 9971, 3875, 1038, 5787, 4161, 762, -272, 1264, -2079, -5286, -3864, -1549, -3201, -3710, -1764, 5395, 8694, 12483, 12136, 13052, 9917, 6899, 3102, -1558, -111, 772, 4116, 1065]
7000A065j752K065l54j589j426l066L332R28N107J421j303q769J027L545M991
6985E222L666n834l715o91L574j959l978J704M076J636o61m796J926n74N9M048
6969C703N15K358K376k712p688o85L159L667j271m920l600J120L290K006K376
6954C694o40N00L523M23r44m188l537L07J656J50j798l92p24J402m071L640J612
6937F13K782K950K593K66l380l738j396k447r06m816K12P844K668N326j219n623
6921A729n845L643M46j901l47M432K928K96K362J876j667n629n041k394L359K883
6905A130R0l637r51N050L273j863k192J08r62K101M992J150o80J002l653j293
6889C665M381j640j81M314N12l504m021l940k981N784O274l22l079m755K477k750
$$ y = [1065, -687, 1378, 1024, -565, -1991, -5057, -1725, -797, 4310, 5731, 4428, -4341, -3314, 231, 5222, 8888, 3054, -661, -1352, 2222, 263, -3715, -2011, 2065, 3701, 3040, -1756, 170, -404, -345, 3703, 4218, 6576, 8952, 6240, -1448, -2133, 1026, 4693, 3422, -1498, -5098, -3978, -688, 1318, 3694, 3054, 3554, 7077, 7500, 6556, 2368, -1169, -862, 794, 944, -854, -1246, -1970, -568, -4639, -999, 613, 3395, 6345, 8938, 9204, 5824, 2086, 690, -1757, -2663, -7479, -7267, 577, 3245, 8571, 7352, 1729, -4116, -473, -27, -1928, -2275, 2157, 5085, 5381, 7743, 9619, 7952, 2323, -2718, -5112, -1753, 1130, 1220, -2417, -3368, 1682, 4955, 3092, 900, 1008, 46, 2147, 7139, 8289, 7609, 8611, 4958, 3665, 8046, 6406, 6225, 10539, 11051, 7547, 3526, -414, -3395, 2389, 8663, 8341, 5262, 507, 2984, 234]
6873B34K60M2M327m125j590L502L157k811j0354j235L030L899M207J492k656n138
6857c759j523L686L741j616j359j482K590j374k305L190J501j342j726J692M1
6842d5M462o06K05o024n626n05n09M089K943k762m183O70j469M221O373k22j906
6825h94k863K540L726K490m178m945j414R12J835N264K31J008K521L119k423O04
6809G533j731l1K302l205p303J88J310O22k97J792m96J492k263L090M717n82o645
6792D93k303J462j117J66K831J09l242L817P023m870n02o718K164J559L403j689
6776B586r83K551l999l634k66M971J65m98L600L732j848l822k484n152l10K802
6760b589M40o961j951L165p39J848L723J345K120K847L331M64k274k650j116J993
$$ y = [234, 494, 536, 4863, 738, -852, 2650, 5807, 2996, -7358, -8593, -5563, -1664, 2543, 4035, 1379, -3759, -5282, -1596, 2145, 529, -830, -2312, 278, -1096, -3401, -211, 1290, -52, -1778, -86, -45, 4417, 3811, 4016, -2008, -7634, -8139, -8648, -4559, -1616, -4378, -8561, -7891, -9360, -5139, 1234, 1012, -894, -3757, -1217, 2509, 4999, 821, -4124, -5538, -4626, -2791, 2473, 2704, 3712, 6233, 9352, 6929, 7533, 5802, 5771, 8073, 4868, -2435, -2247, -937, -315, -612, 1180, 684, 2176, -87, 3003, 7720, 7138, 493, -1810, -348, -1465, -1299, 1532, 1641, -1601, 2216, 9239, 4369, 3867, -2851, -687, 872, 4275, 2586, 1603, 4154, 155, -3479, -3745, 1226, 1391, 893, 4493, 8225, 6377, 2555, 71, -5081, -5391, -2589, -2149, -9110, -11061, -7896, -8635, -6787, -3064, -1719, 401, 3248, 6579, 7043, 4769, 2119, 1003, 2996]
6744B996J327k664k416L026N067R76l824q128j742L059L5o44L44O60K46j800L604
6727A22J787P51J250L043M920K376j56l222J7R389J6573R259n251p956q464q924
6711A5514n383L858L320j439p218k303O444J976j565p692l874J780L969M020M402
6696A5809K766K022l063m215l13M726k600m492L613k287k563p794m062J013r94
6681b434j558J938K899j098l90J457k972o995K900K462M170K89M02K320o53J206
6665C943K915l569q2N596L384l920p229k791N88J705O274j843m283k519r1K640
6649G18M67N0k321k275L298J541k530m376M063P58l507O416K145L33J656L424
6633I860N237j439j279m895l075K449j215J928k161j442l092k611M84K743k966
$$ y = [2996, 4323, 1659, -757, 2269, 7336, 8312, 4488, -3640, -5382, -2323, -2288, -2932, -2588, -1928, -1682, -3482, 122, 1909, 2660, 3910, 6953, 11873, 14249, 14093, 10871, 10888, 20277, 36850, 46109, 40858, 32902, 24438, 15514, 10131, 13989, 17309, 15870, 8652, 6349, 12793, 14769, 13204, 5512, 1638, 3418, 7387, 11407, 15809, 18575, 20597, 17534, 13319, 13006, 17732, 15132, 10640, 14253, 11966, 9403, 1609, -2453, -1440, -2434, -3992, -2054, 845, -253, -643, 814, -2158, -9153, -6253, -3791, 379, 668, 1070, 3390, 2737, 3943, 6858, 3289, 3207, 8803, 12187, 8267, 1038, -1753, -1165, 540, 6814, 4971, 688, -1831, -1922, 718, 1185, 1235, -1086, -3361, -63, 1478, -1052, -5428, -1365, -607, -4114, 2302, 4447, 4780, 6436, 9860, 15097, 13658, 12379, 7484, 4409, 6858, 5643, 7571, 5410, 3968, 876, -1735, -1251, 1492, -1474]
6618a474J382r31k063M215N742j980j169L148L781M518n528k898k668j325J552
6603D302K768l535P55Q52l508j164O261P743k689j038l828j786m186P23o095k547
6587f972L291K75n1J695j186K545M663k554k952k952J811Q92q36j468k104M207
6571a696o04k425J830L684j92n895k093N840L255j152k25o712j555L310J310m39
6555c759K626K757k237P80P71rJ800l691K08j999m569O88J690O97N957J678j764
6538A624l687J09K957L158k502N917J746m58j939q19n18l270k614o24m04K169
6522H45J410l053q32L068J409J750k780k911j582K146j1m39j164Q55J573L059
6506C343j366j141n028l950k644N518O395R30j086k503j675J104m55K681r5j719
$$ y = [-1474, -92, -1023, -3086, 1129, 6871, 4891, 3722, 6870, 10651, 15169, 9641, 6743, 4075, 2750, 4302, 7070, 3535, 4290, 5142, 1634, 470, 6731, 14474, 11785, 10747, 6919, 5133, 947, 1670, -4425, -6972, -3681, -3406, -3457, -1762, -2948, -403, 4260, 1706, -1246, -4198, -2387, -1495, -2331, -3799, -5903, -1696, -2300, -4725, -2895, 789, 597, -5298, -7391, -1551, 1704, 552, 327, -6385, -7940, -4630, -3320, -3759, -1133, 1624, -613, 167, 938, 929, 2729, -962, -754, -2753, -7322, -6634, -4944, -4247, 1710, 3388, 1624, -2063, -1954, 1003, 4161, 1659, 7576, 9322, 8864, 6925, 6106, 5588, 2318, -296, -920, -1324, 845, 2255, -798, -1630, 1438, 2847, 4597, 1817, -1094, -2676, -530, -541, -980, -2144, -1289, 284, 3343, 1977, 836, -4192, -8142, -10786, -5268, 1127, 2057, 971, -1532, -3207, -2103, -2558, 123, 28, -1691]
6490a691J774O366L10L708j21j258O0qm220l626K106k84k428q63o89m236M51L723
6472i26N623m537r76M77J79K818j046L750j212m044m67K326J83o61k250P96j858
6455a825m506p93J4J580J766n48J510l72p36k731K346K763K774O838M36j564O43
6438G595m603p144M40L862M277K489j642n265L045R18L878j970k395l129J926
6423B282J952N773m958n291m62M670K522m896j324L325m410m248M23L945M236
6408C539k053l515K264O94L494R87j987m167k887L761j076L737m223l461k197
6393g090j611J974N601M424R34K99l541q73l665m41n56j588j437q35L342L630
6377a433L080K43J198Q91m30k578l321L601L355k553M07p19r38l033J486M740
$$ y = [-1691, 83, 6449, 6759, 10467, 10346, 9088, 9148, 9140, 4920, 1294, 3400, 3116, 688, -175, -864, -5100, -4649, -926, 4697, 160, -816, -339, -160, 2658, 1612, 5362, 4150, 106, -361, 1965, 2148, 1487, -763, 33, -1825, -6331, -7124, -7110, -5530, -3764, -4312, -2802, -3174, -3910, -6641, -4295, -1532, 1242, 8080, 8516, 6952, 7595, 2992, -4152, -3712, 150, 4427, 6916, 5274, 9, 3054, 3972, 7850, 5880, 3485, 356, 2282, 4234, 10007, 5049, -242, -704, 3966, 6488, 1592, 268, 3593, -817, -5065, -4642, -697, 3539, 1486, -2029, 235, 929, 4423, 5410, 3423, -744, -3631, 130, -946, 2791, -1432, -4893, -7090, -8701, -6727, -1126, 3298, 4232, 4531, 990, 117, -3548, -3989, -4545, -6133, -7570, -8405, -5063, -1433, 1647, 1890, 3088, 3979, 3549, 971, -2350, 1251, 4606, 2053, 2460, 1741, 803, -2230, -744, 3996]
6361C996K040j123J387K060k741o589o71q7M422J86j912K318K0K279J223k333
6345D475p96J151j527n619K813J662M40M862M80p230n26P456m230k099N913j402
6329E823k770k001k092n478k479J356K661J309j85j106l97L46p78k84K051M226
6313B02K430K085l793m638K20OQ28J123j052J574L357m02m937J833M807R70q05
6296C808m632r28k81P75N325l332l383l01O57l824p59M218j312l391j054P034
6280a380N095L912p40l928l998K406j538k333k362j365k52N51M071O483n355m364
6264e097N143N154Q3M82K213j578l006N60L10o004l165J002K481k0J577o100k085
6247h050J855L20J733J543J337r7P15N585n455o233o892j121K196J282J954N450
$$ y = [3996, 6036, 4913, 6300, 8360, 5619, -970, -1641, -1728, 2694, 2880, 968, 3286, 3306, 5585, 6808, 4475, 3679, 4830, 3303, -2316, 497, 2159, 2599, 7461, 7941, 711, 185, 7641, 3411, 1312, 7225, 5823, 3053, 1052, -1040, -6518, -8997, -7641, -4980, -3671, -3856, -4962, -5359, -5013, -5791, -6075, -4024, 202, 2632, 4717, 924, -3714, -3494, -3488, -2660, -1537, -2589, -1015, 2342, 1940, -2997, -1164, 3643, 4613, 3808, -824, -1752, -2033, -1258, 4067, 735, -2648, -2949, -2292, -6116, -6875, -2657, -3969, -7360, -8414, -1380, 3715, 7627, 6887, 2959, -1039, 1367, -171, -2504, -4866, -6231, -6483, -5932, -1861, 4622, -733, -5097, 46, 5200, 5283, 5765, 7978, 6400, 3394, 3954, 4264, -1740, -4905, -3903, -1422, -1442, 135, -5965, -8050, -6195, -5875, -4142, -2599, -1262, -1359, -644, 4941, -514, -6747, -13639, -14760, -12564, -11282, -9328, -3878]
6231c878L839o04L071K99l215j698m232n391M715N677K972N089O58l574m912o847
6215h031J987L764K475k582j316k240p41j878l465M835o73m165L794R828p26Q5
6199I51K962j457o64Q24L223q4p650j299K272L409K548M88O85k414L355p46o567
6182a64k068j417k057l505K984j211L803R74K5p27j354r38L789K481l15j666j174
6165b540k313n07k314k473m11O136K352l424M204J192k981n83j381j120L280m98
6149c381l759k582K642N750N642j596n324q5J202K095m22p29M740l16j839m113
6133b075O87K345J483N186O86K229O63j941J900l894j481j044L6K48O54k384L291
6116F589J063j424M39p12j623m520k525M395j273l272O908l76j416j067k359l699
$$ y = [-3878, -39, -643, 2428, 2727, -488, -2186, -6418, -11809, -7094, -1417, 1555, 6644, 7302, 3728, -1184, -8031, -6044, -2280, 195, -2387, -3703, -5943, -6684, -8562, -12027, -7192, -7865, -12030, -8236, 1592, 866, 951, 3913, 2456, 1792, 2616, 5839, 5755, -1895, -3194, -922, 2487, 5035, 5523, 6208, 3794, 7149, 6403, -164, -2232, -3649, -5706, -9211, -6227, -7438, -3635, -2661, -2636, -3363, -4717, -5655, -1866, 615, 300, -1366, -2540, -4853, -5360, -7674, -10147, -10558, -4422, -2070, -5494, -1290, -98, -3079, -3662, -5043, -6163, -2883, -3381, -7140, -9722, -7080, -1330, 4312, 2716, -2608, -2693, -1491, 604, 182, -547, 4193, 3877, 2038, -2075, -1388, 957, 2440, 7626, 8312, 10541, 11204, 9263, 11163, 7269, 5788, 4744, 4780, 5028, 5682, 3298, 6589, 7652, 6228, 6667, 5955, 4332, -188, -2713, 1682, 409, -2863, 4045, 3669, 2253, 1186, -1173, -4872]
6100d872J536L424j481m352o06M332L194J195L856R81O81P14M98n179n133m67
6084a679J358K623K151J645K504J357K60j807n246m236M907N455p60n292m091
6069h51J76L29j436J919K299L26o52O68l454j353K726l567O85M372P42m790k835
6052d696m969j761L622L295K420M639p38L4N54P18m365k28j682J134L584k167
6036f06m421k287m4O61K441j970j240O97K092K313O575k082k091J228J055k382
6020f1j838J890J78j864Q75j233j322J889P27K679K485n96j953L80N89N97m370
6003i48J44O18J205k009m923l56J878J075K85J066M4m265m439k432N125M210O93
5986c029k449O766L124j21q95j789J071J362l863k998Q24M331J521k938j491p95
$$ y = [-4872, -3336, 88, -1393, -5745, -6351, -2019, 1175, 2370, 6226, 7207, 7888, 8602, 9100, 3921, -1212, -1679, -321, 2302, 4453, 6098, 8602, 9959, 10219, 8412, 3166, -1070, 3837, 9292, 8532, 3240, -851, -675, -346, -1782, 137, 2436, 2762, 2110, 2778, -676, -2029, 697, -2870, -2185, 2187, 2929, -1861, -4696, -9665, -11426, -7804, -4509, -2089, 2550, 1812, 1846, 2400, 3118, -1247, -1475, -3157, -2023, 1561, -606, -5027, -7314, -7358, -6697, -4256, -6226, -7466, -6769, -4677, -2364, 4211, 2129, 38, 1266, 2321, -61, -1899, -9, 169, -1695, -820, -2053, -3375, -1486, -759, 1920, 4405, 3809, 1856, 2236, 2825, 3422, -948, -804, -186, 1019, -990, -5913, -6269, -4391, -3316, -3031, -1965, -1921, -6186, -10625, -13057, -7932, -3722, -3029, -5478, 1288, 4412, 4291, 3396, 1607, 2678, 4040, 177, -2821, -1997, 2334, 3855, 917, -574, -1369]
5970a369J998l844m022l369n57M560O602j51n535m577J765P233M798M03j541o393
5954c999m806J186K455L390j208l550K376P61j369K688M790K080m013k762k250
5939d231J288j067K012K21L397K76l850o20L797Q22k300j719k222N28L773p24
5923f19l567l028j333J777N025J165l560j799K769K298p35k510q77k066j939j117
5907a0116J973M454L806k453k985m090Q04l87J990L798J783r22J31J324J969R89
5891B068k811l001J309l407j47J901L216R07J286l842m152K499N880o49Q02k329
5875d70k888Q58q63L124K578L16L449k373j998k246l081j989k97p1P186P498j042
5858G691k404j156n456l565j398L49K478K520N049k64n567J092K022r45r2q69
$$ y = [-1369, 629, -3215, -7237, -10606, -11163, -6603, -1, -152, -5687, -10264, -8499, -1266, 3532, 3935, 2394, -3999, -8805, -7619, -5164, -1774, -2982, -6532, -4156, -3395, -4764, -2076, 2714, 4794, 781, -1981, -4231, -2943, -4010, -1998, -1777, 1620, 1896, -1954, -2574, 1223, 2045, -255, -1974, -4196, -3668, 105, -619, -4186, -7214, -8547, -6770, -1745, -580, -4140, -5939, -3170, -872, -1607, -4117, -4994, -7060, -8999, -10116, -8143, -3689, 117, -2336, -5321, -9411, -8607, -8994, -7004, -3206, -1423, -2345, -2214, -890, 1079, 2068, -743, -3744, -2435, -5842, -5989, -4088, -872, 35, 1321, -2521, -6673, -4174, 1706, 1057, 1859, -470, -3358, -2500, -3363, -239, 2339, 2655, 6104, 3731, 1733, -513, -3594, -5583, -5880, -5951, 1235, 8733, 7691, 5287, 4131, -1325, -4890, -6288, -5939, -3461, -941, 4108, 3844, -1723, -631, 1391, 446, 354, -515]
5842e15O04l633j072k021J313K222J496M550j961P5J736r29k403m700l278L695
5826d821K807J481q73o003N8j533J975M346M638K504k856k797m413K861k138K224
5810b540l224l54J714J622P22k720j688P55K119J690J320l10O35k847J388N626
5794C908M099l706OL434K977l971l497j143j804k046l804M07K942K620L237J789
5778E448K292N52j388l86J54O45l973k715j405m024m429r6K444P863Q36l946n38
5761b666j763k113M909o30k547J459r61J08J28K427k898k133J305M732O558Rm150
5744A774k701J262j089J183J122n363J490K073l381K40M786L722j406l236J001
5729A477q9j192k83R80n76J403J466j692k527K334j9J730J022l59l677K154J081
$$ y = [-515, 89, -3544, -4616, -6637, -5324, -3102, -1606, 2944, 983, 1058, 2794, 1865, -538, -5238, -8516, -4821, -2014, -533, -1406, -7409, -7351, -8884, -6909, -2563, 2075, 4579, 1723, -1074, -5487, -2626, -4764, -2540, -5764, -6118, -4404, -2782, -2060, -4780, -6468, -5713, -3594, -1904, -584, -894, -259, -3106, -1718, 3908, 8007, 4301, 4307, 7741, 10718, 6747, 3250, 2107, 303, -1743, -5547, -5140, -2198, 422, 3659, 5448, 7740, 8292, 6904, 6518, 6672, 7317, 3344, 629, -776, -4800, -9229, -9325, -6881, 982, 1818, -2128, -2666, -4429, -6542, -1633, -2263, -4810, -3351, -4312, -4204, -4076, -1649, -4547, -6680, -5375, -643, 5915, 5924, 1774, -927, 335, -754, 429, 1551, -3812, -2322, -249, -3630, -3390, 1396, 5118, 3712, 476, 1477, 1388, 196, -87, 893, 317, 1720, 3186, 1494, -1033, 1301, 1282, 3012, 4034, 3675, -2, 2152, 3233]
5712C233M22L148j108o978J308J477n539p13k125p35O05K135K733k166k225Q55
5696e673O8L426K254l496K308P21L634K204m143n413l473m48N359M971R0l134
5680g45j38R29K542l75L739j813j654j008l603m909k628Q16J837j924M083L981
5664h70L68l173j773K981l76q97l789J02N029L132l982j421J862K445J814j101
5648C51M994k471k155J378K611K401l075m273m774M650N875n51n189l471K99k257
5632e657l958j965L56L85o55L057M469N628Q81L38k249j961K807j410j64J311
5616A213M315j223n422Q29M879J830k389j411M491j724o420l552J695P29J267
5601h93L03k112L659j992k822K526k239m552J691M894J902j291j593K017J879
$$ y = [3233, 3655, 6803, 5695, -1283, 25, 1502, -4037, -4750, -6875, -7610, -7005, -4870, -2137, -4303, -6528, -5673, -5605, -2179, 75, -3421, -1113, -392, 3242, 5446, 1303, -4110, -7583, -8031, -2672, 2299, 2389, -745, -883, 46, 2588, 2213, 5952, 4139, 2485, 1477, -2126, -7035, -9663, -8847, -7010, -8934, -4851, -870, -502, -3675, -5448, -2467, -2843, -3740, -7529, -7427, -2398, 734, -3248, -4669, -2807, -362, 1452, 351, 5345, 2874, 719, 2097, 4708, 7109, 4034, -239, -5013, -363, 5512, 4961, -228, -3699, -3400, -5657, -9615, -11580, -11224, -10839, -11494, -8437, -3968, 1660, 2541, 2879, 630, -1331, 1476, 66, -98, 1213, 5528, 4305, -1117, -288, 4591, 6421, 4032, 2621, 7112, 5388, -1032, -4584, -2889, -2160, -893, -590, -2702, 957, -1035, -3857, -1331, -3570, -8122, -6431, -1537, 365, -926, -2519, -502, 1377]
5586A377o796J542K486M64L4J888j222n192Q67j386l270M940q89k414m56j808
5570i835j252M389K93K046l502L445J507j170J015J461O836J015J58l421k819
5555A66L065m078m601r93J670O60L372L67O39o344j592n02O150J232k245j535
5539d569k998N55K446J782N358L364n441n349k082L86J217O790N533j968l271
5524A753l307J372L940M530k059J204K884q1l04j908l844J639n808j567L202L86
5508B032K945M510J494n976m422m558k82L335J107O10p859P5O503r3m882k2L684
5491a799J016J596j966k283m11K446n80M81O0m392K125N127K126l911k05k688
5475c258j58M05j714J832K940K075M30n904K8K591J417j75j614m536L54K166M582
$$ y = [1377, -5419, -3877, -1391, -927, -893, 995, -227, -5419, -4552, -5938, -9208, -4268, -5157, -7571, -8027, -9835, -11087, -6698, -6405, -4359, -7861, -4416, -2909, -4079, -3064, -1603, 5233, 6248, 6406, 2985, 166, 3231, -847, -5448, -6441, -4771, -4111, -739, -372, 267, -6077, -7669, -8171, -2021, -789, -3034, -4569, -7567, -7012, -4566, -2784, 2574, 5938, 497, -4852, -6934, -6548, -5331, 1459, 6992, 5024, 1753, -1554, -182, 3758, 8288, 6229, 7433, 10317, 10236, 9932, 8024, 4180, 5819, 11, -1556, 1646, 2032, 4977, 9487, 10981, 5005, 583, -3975, -4257, -922, 185, 795, -7064, -6989, -486, -579, -5461, -5483, -1799, -783, 813, -1153, -3436, -3847, -1401, -1981, -1500, -1440, -5832, -3707, 1420, 3546, -365, -570, -3258, -3416, -3011, -4725, -2893, 47, 2122, 2552, -3352, -3324, -733, 684, 509, -1105, -5641, -5287, -3121, 1461]
5458A461j262n165R93K194K942j632l876k179K714J850L575l122k214K223l204
5443d702p77M220M092M131J86n503k813J123o50j017N726m81j530k083l20M672
5427D274k665j403m58p68j022N076M083q73n584P10J687m942j846J55O68K522
5411c86R40k323K690L763k70o422l300k48l435O04P005M777m779L82M43o223j453
5394h235K990L348O553J406r659J94K908k583m038K028N522J445Q45J16k150m948
5378d258K422L587N628n644k868j146k941K875q45J215k000k513K360j065j77
5363e370J663r5p13K206R1j737j784j458r16l301k90K552K476K66k893N157M50
5346c696m838L915J91j06J792O66J536j989m244n7K007K87k417J442N528j567
$$ y = [1461, 199, -4966, -3973, -1779, 1163, -469, -4345, -6524, -3810, -1960, 1615, -1507, -3721, -1498, -4702, -5479, -1259, 2833, 6964, 7150, 1647, -1166, -43, -693, -1710, 4016, 3535, 2005, -78, -398, 4274, 1609, 206, -252, -1020, -2042, 3034, 7117, 6244, 660, 1370, 3057, -1885, -3731, -3576, -2908, -386, 554, -1769, 921, 4684, 4414, -2008, -5308, -5556, -8991, -8387, -1382, 3395, -1384, -1002, -559, -6782, -8235, -5245, -1897, 4656, 6062, -3597, -3403, -495, -3078, -7116, -5088, 434, 1879, 2724, 2840, 690, -4258, -1836, 1751, 7379, 1735, -1133, -2279, -5220, -2345, -3190, -1975, -3975, -6488, -4128, -5193, -5370, -3707, -3802, -4515, -2309, -2218, -3955, -5739, -7197, -8113, -11414, -11704, -9152, -6676, -6410, -9303, -4146, -3696, -8534, -4619, -4428, -4534, -2742, -2076, -540, -2529, -6773, -6830, -4823, -4536, -6953, -5511, 17, -1550]
5330a550l57o70P37o66m282P33L002K684K57r68J681j584O34m239q049K749P182
5313b706l533Q04L254M545N44j665j137j880J021p26L494l39m7r43l950K170L199
5296B105j847k189l324j836K057O593K498l470k371k122k895K797R08J090o084
5281h090P98J875j557L047m72l241M405J334j147L125k544K498M809J115m102
5266A853n328L263K466k17k148k978k788K383M720J465k263l611L331M10m144
5251c586k606K780J012O77J316m720M52k45k251K835L817kM083K553n269k487
5235a641j018m26k438j437J837K799j208K508l315k331R60L414k532l895O106
5220b617M916O33l036m309j858K15m82p4K964n35K294n61R37N06M035p6j972K326
$$ y = [-1550, -1907, -2577, -1840, -2506, -6788, -6055, -3053, -369, -112, -1080, 601, -983, -349, -4588, -12637, -9888, -2706, -6239, -5435, -2181, 2364, 2908, 1243, 106, -1774, -753, -1479, 2015, 1676, 1629, 686, -3264, -1094, 2105, 258, -1931, -5255, -7091, -5034, 1559, 4057, 587, -1784, -3906, -6801, -4004, -3096, -2006, -8090, -7292, -5417, -6974, -3927, -4399, -7640, -3235, -1901, -3048, 77, -2467, 31, 4840, 5955, 1853, -3475, -212, 2254, 2037, -111, -3089, -5877, -3494, 1226, 2691, 428, -3183, 148, 558, -3586, -6192, -3412, -2400, -1723, -407, -5127, -4675, -4920, -7171, -4336, -519, -521, 3562, 6115, 846, -1641, -2659, -3085, -5523, -6960, -5123, -2324, -3532, -1024, -4339, -6670, -5710, -2296, -4828, -8723, -2617, 2299, 2932, -104, -4413, -6271, -6056, -6538, -6612, -3648, -4183, -1889, -2450, -1513, -1007, 3028, 2952, 980, 3306]
5202C306k323k780n150j32J867M508k54j214j532p9k051j540L562P535K985l756
5186B952o402p39L107M055L96k887j746N91l308L981O113o81j773l438K547m339
5170a571j460K008P91O12J656R74m658p571j255L407K171r82L982m796K681r75
5154d986l046j700L288K616l14k041j452l079J915Q800J314n085j394M517Q19
5139A72m758l06O70j91J337j338k949M868N211k100p115n977M920O053P080J451
5123G028j889p193j433L465J129l936J97j066j672Q40K037J309k57P11L389j008
5107A651k423j406J06K971J684M780K838m966r168m900N366M653J809m1m166n555
5091f767j228P834M430K846L680l124k79M80J26J275j189k235p85m072o259j453
$$ y = [3306, 983, -1797, -6947, -7079, -5212, -704, -958, -2172, -3704, -3783, -5834, -7374, -3812, 3723, 6708, 2952, -3450, -4189, -1082, 2973, 3369, 482, -1264, -673, -3981, 0, 6113, 5432, 3659, 221, 2768, -1571, -3031, -1023, -232, 380, 2036, 3010, -1648, -9219, -10474, -7067, -4896, -5878, -1896, -6692, -4011, -4986, -8032, -9732, -6444, -3828, -4142, -6183, -7635, -10714, -8799, 1, 1315, -3770, -5164, -647, 172, -4586, -4892, -4222, -4413, -3076, -4414, -7363, -2495, 2716, 616, -6499, -12476, -7556, -1503, 5577, 7028, 5139, -2054, -3487, -22, 1107, -2829, -2632, -3698, -5370, -4530, -2493, -1184, -1441, -730, 2659, 1651, -772, -2178, -2072, 899, 2583, 7363, 10201, 5235, -3933, -8833, -3467, 1186, 2995, 2954, -1212, -6767, -7995, -161, 4269, 7115, 10795, 7671, 7392, 7872, 7998, 9273, 8084, 5849, 5064, 992, -5267, -6720]
5075f720K616L973M150L61m413l309k980J296M195P48p49k472j443J238K078M91
5059i40p15j657l084J015K391k60m458m41M75J965L189q13j412J917j753k306
5043f887k36K626P032n31l162K448K659Q39j339N27o59k608k122l998K428M722
5027A739l39j373J465K661J654k096m409k84q25n324m22M472k985K554M823j673
5011c62j983L330n5k465M59R77J963r70k441P0k762l451K051M459J828k326q39
4994b517K004R72k594J973J82M097J424p43J739m683j618k999l27n07l024L665
4978b956Q38l841k730j651K971L009Q13O79k545k939M262O163K28m35m806J653
4962a287R4O20J726k338n91J465K648m26j747Q53j919K23J035k878l118J474J75
$$ y = [-6720, -4104, -131, 4019, 4380, -33, -3342, -6322, -5026, -831, -83, -832, -3304, -4747, -3509, -1431, -940, -1655, -3312, -6396, -5381, -2990, -3250, -7708, -8149, -7674, -5709, -2520, -3333, -4745, -2828, -4581, -6887, -7123, -4497, 2535, 2004, -1158, 1290, 3949, 4788, 3449, 3976, 3317, 709, -1413, -5411, -2983, 1739, 1400, 27, 1492, 4153, 5807, 3711, -698, -982, -1807, -7131, -7553, -3081, -6066, -3512, 1311, -362, -2345, 985, 930, -1535, -1076, -99, 1864, 894, -1547, -1477, -4239, -7690, -5639, -1180, 648, -1678, -2517, -513, 459, -2135, -162, 20, 4117, 5541, 4798, 6537, 1854, 236, -2763, -3090, -3597, -6621, -2956, -2118, -5959, -8689, -10340, -7369, -4360, -3547, -2868, -5413, -8352, -4090, 2073, 2301, 1866, -2940, -1287, -1193, -573, 1153, -1185, -1776, -311, 2337, 1911, 164, 1017, -902, -679, 356, -2522, -5640, -4166, -3991]
4945c991n73M058L816l518m192K715q95k515L557M43l050L127N476J438K571L202
4929A1669n420o394l804k075l79J467K881k376J577P67j046q77j898K905j374
4914d377J147j441M87M349M150k399k405k829k673Q67L852Q18J507j160L20p59
4898e46j502L163N02o89J366J811r32k242m820q37J017K424k358l739r67n266
4882a3615M851L907j305p75P130k200L205M372p75l939Q48Q66k411l03K07k902
4866b839l873J984R97l49Oo134K011P76J497Q20L315N947K274n519m338K518M76
4849d31k631N36m08M47k160l505N559Q175N150J638l097o419n125k904j690R94
4833e871M943l31l476L124j893k399m50J596O18j174l010J700N189J902J387p024
$$ y = [-3991, -4564, -506, 3310, -208, -4400, -1685, -2580, -5095, -1538, -1095, -4145, -1018, 4458, 5896, 8467, 11669, 6249, -145, -3949, -6024, -6403, -4936, -2055, -4431, -2854, -2087, -3133, -4010, -5908, -3003, -4377, -3230, -4671, -4184, 165, 4315, 1916, -489, -3318, -5991, -5124, -1272, -454, 1053, -107, 213, -546, -2048, 1115, 1617, 928, 2294, 4105, 3173, 931, -3889, -4726, -3709, -1285, -3643, -7382, -8349, -13615, -8764, -4857, -6162, -6937, 193, -2007, 1198, 5570, 4795, 856, 1704, 2570, 159, -144, 63, -2839, -6712, -4728, -3731, -4080, -4074, -10208, -8197, -7421, -5924, -5104, -1789, 4158, 6432, 913, -3425, -907, -431, -3062, -2526, -2934, -2487, -4647, -8152, -2593, 5582, 10732, 12370, 9273, 2854, -2271, -5175, -6865, -5871, -928, -1259, -4735, -1611, -3504, -5903, -6353, -4757, -4139, -5313, -8323, -6623, -1434, 468, 1855, -5169]
4817e169m309M040J596K018j184L79P21J67M655L289o23q18l210L256j214n663
4801b069J9j02k05l59o84n882K44J743K987L105N24k878J08M034k05k266n34j182
4783c602J103m508m999K191J502M146M507J735l160M17J446k891r97R36l37L40
4767b171K545k161j193M598J167r47m476n554M91L89k98K533m371q62N296L286
4751a728m49k990J979J677k078j696K53L958N247p84k815k822L90l44j778J60
4735c820J56P36L06M59K151j306q64J244L886K380j167j785l388n129r09K050
4719e000o22K8j584m91j203K415L257M533N710k828L96M64j524N91j480m799m318
4702f455l393M886M577J834j03j999j247k964L269k008n769k76J233O055m42j001
$$ y = [-5169, -9478, -5438, -3842, -1824, -3008, -2629, -1908, -1741, 2914, 6203, 5580, 4762, 1552, 4808, 3594, -2069, -2050, -2152, -2357, -2716, -3400, -9282, -9038, -7295, -4308, -1203, -679, -3557, -3449, 585, 380, -1886, -2420, -3602, -2499, -7007, -12006, -9815, -8313, -4167, 340, 2075, -1085, -668, 778, -2113, -3110, -2174, -2511, -2171, 374, -1787, -2980, 1618, 2785, 1838, -2638, -8192, -7701, -7312, -7610, -5077, -9448, -10310, -5014, -1728, -2177, -5167, -3188, -1511, -3589, -5285, -5032, -1074, 4173, 3389, 574, -2248, -1858, -2202, -3980, -3820, -3664, -2928, -2622, -2163, -12, -1318, -2182, -938, 2948, 5328, 4161, 2376, -1012, -6141, -7050, -5000, -5622, -5594, -7178, -7669, -8872, -6457, -3200, 1333, 7043, 4215, 4611, 5075, 3551, 4142, 2662, -2137, -6455, -9848, -4962, -385, 1449, 1346, -653, -1900, -4864, -1595, -3603, -9372, -9648, -8415, -2360, -2802, -3803]
4686c803l383m034J279P13R90N214L739J450K359j948o036n910K298K753j381
4671e700L215K4J744K355L180l154n400J098j859k75J323J116j25L819j719j449
4655a807K985R84m871l944M812K160p16m574J024N79k187J70j968J076J5O08K93
4638e361M571M448K19j088J639m287o505N32J162j195K199K237K940M327n203
4623F35l199K218L353R37L62J032k031r88L233k769m491N55J844j631L39j997
4607b598k789m657j290N319M131N14l954K318j205J065L565K883j969l787J425
4592a029L111n021J966M13k165j093j183j050Q13O271L512j804r25m094j075L637
4576B84K229p66r11J514m46n07P9J803K227R6m350k814K168j554m145q61j225
$$ y = [-3803, -7186, -11220, -9941, -9228, -8238, -3024, 715, 2165, 4524, 2576, -3460, -9370, -7072, -4319, -5700, -2485, -2461, -717, 1638, 4818, 1664, -3736, -2638, -4497, -4772, -3449, -2333, -2458, 1361, -358, -1807, 1178, 2162, -2709, -6653, -1841, 319, -397, -4971, -3947, -3368, -5555, -5385, -7353, -6277, -6262, -5654, -5361, -790, 3658, 3877, 2789, 4428, 141, -6364, -5832, -4670, -5865, -3666, -1429, 1511, 5838, 635, -2564, -346, 3007, 3944, 4306, 5338, 3307, 2319, 5552, 2783, -1708, -1153, 691, -940, -601, -2598, -5387, -10044, -11334, -6015, -1884, -1370, -5324, -3006, -4211, -3146, 419, 3302, 1333, -2454, -1029, 2082, -2939, -973, -560, -2725, -3818, -5001, -6051, -5238, 1033, 4545, 2741, 1816, -2278, -3353, 284, 2513, 1747, 836, 2350, 1904, 1397, 1476, 3279, 5506, 5602, 1252, -1562, 606, -948, -5093, -5954, -7179]
4559g179k605K628O40K055l203N47R60j97J440J890J847j920J804M222j629j58
4543A142l775k845M579K791j485l75m213j508r92L10K98q08M872K481j611Q63
4527b76k96k587K785M960j221Q12J11j906J426l26k723J612j7j290J613K769k42
4510E204L285L943m402o755k345L058m354l827K353K568J017m362m2O30j886M16
4494e499K277N363R59J179J096J989L10k133n935j180j07l74k966O871L822m509
4478A163j570N86R7r96m882l755k591L297N594K241J535l358J280r49J734J528
4462I54j18J822Q61k861p747J106M758J103j450J589K858k068l221R37j425j104
4446d006j775K852K278N568m729k182O525l12n139k692k35K700M175l1j535l996
$$ y = [-7179, -9784, -7156, -6516, -4461, -7664, -7117, -6157, -6354, -4914, -3024, -1177, -3097, -1293, 2929, 1300, 1142, -2633, -5478, -899, 1892, 407, 32, -4181, -5689, -6681, -6371, -6073, -6881, -2009, 472, -1139, -276, -572, -3159, -374, 4586, 3365, 4177, 4288, 2382, 3808, 3482, 759, 2371, 2354, 1064, 2677, 5446, 5204, 8489, 12432, 8030, 1275, -1070, 1988, -2366, -6193, -3840, -1272, -255, -4617, -4659, -4029, -5915, -5499, -3222, 2141, 3100, 4279, 5375, 7364, 7674, 5541, -394, -1574, -1681, -2055, -5021, 1850, 5672, 1163, -407, 179, 276, -720, -5602, -9357, -11948, -8651, -3057, -816, 719, -2639, -1359, -2308, -574, 954, 836, 2658, 3519, 658, -7089, -5983, -1225, -122, -1572, 17, 2875, 807, -2414, -1477, -2902, -4006, -5781, -2929, -651, 4917, 188, -1994, 4531, 4219, -920, -3612, -3847, -1147, 3028, 2997, 1462, -2534]
4430b534q99Q68m22J642L58k402l586M019M957j203n09j466M383J749l587o97
4414F71l758l881K644M468O57J029j358k284J397J728o95K879K224O62K031L9
4398H453o495k418J476J907K471k92P37M03n007k415J989o14M873M014j861k769
4382D452K678J184j794k131j283M49l156L315K072k854K55M979k513j629l033
4367I91j19j62j389R60J305K11o4o116J326K280r00J633n26o254K70M230M483
4350B159K023L484K7O86K174l214j851m308J476Q79j259n807o394J305L570N065
4334A5Q67L49p04M027N50m331p62r13p90J857K057J120k292J409M074N65n877
4317A221j245J392K570k033j008J374q75l427j749K31J770L401K995j987l904
$$ y = [-2534, -3433, -2565, -2987, -1345, -987, -3389, -6975, -2956, 2001, 798, 289, -1177, 3206, 4955, 1368, 671, -3087, -6968, -4324, 144, 801, 1830, 472, -1812, -415, 1313, 618, 3497, 5721, 6383, 8414, 8453, 1958, -460, 1016, 2923, 5394, 5102, 5839, 6242, 1235, -1180, 809, 195, 5068, 9082, 7221, 4452, 7130, 8314, 6520, 4389, 3106, 3555, 399, 3714, 5786, 2932, 3187, 8166, 5653, 4024, 991, 872, 710, -679, 281, 1586, 1797, 1733, -4383, -3057, -777, -1677, -44, -570, -6824, -6554, -2324, 2159, 4182, 7666, 7693, 8379, 10553, 7339, 5488, 1180, 2656, 3535, 2276, -3531, -9925, -8620, -5050, 15, 882, 1231, 527, 4554, 5104, 773, 11, -902, -1692, 165, 2222, 3342, 1050, 2459, 6533, 7098, 1221, -24, 1368, 3938, 1905, 897, 2271, 1396, -2031, -3780, -3549, -1779, 1622, 4617, 2630, -1274]
4302a274J283L846L590m698n583J468m198k139j027J584O613J70j902L499J530
4287B762M84k333J788K08o338n902J821M429J742J892K292m64j789j130k340J06
4271b772j8j733M34j033m703L58K945L422M968M846O75m311J010k243r154N6J867
4254e386J453l252r26M630K943O67L016J432l310n794K832R75j648o274l346L530
4238h458J231l490l621L609L947L972l358J182L424L270j797k655k949K774K511
4223d08j854M494L340o689j894M695j807k442J579j522l088j24O96o98J223L662
4207h37K12O14L101K296j66p721O07J990l221k55K536k349l062K198M617r11m31
4190g82o58k881k072J698L087K119L389L715k260m997L224n55L197M797k889n156
$$ y = [-1274, 9, 3855, 7445, 2747, -2836, -1368, -5566, -7705, -8732, -7148, -535, -365, -2267, 1232, 2762, 3246, 913, 2701, 2909, -3429, -9331, -7510, -3081, -1339, 553, 2845, 2381, 592, -538, -2878, -2772, -2790, -4523, -4089, -5122, -9825, -9467, -6522, -3100, 1868, 6714, 7389, 3078, 4088, 1845, -7309, -7253, -5386, -3933, -7185, -8111, -3481, -538, 129, 3145, 4577, 1267, -4527, -1695, -720, -2368, -8642, -11988, -8458, -7227, -10717, -14338, -10729, -6782, -2810, -6168, -4986, -1562, 1708, -89, -2744, -5693, -2919, -408, -2262, 2232, 5572, -1117, -3011, 1684, -123, -2565, -986, -2508, -5596, -5720, -5024, -5722, -4499, -837, -625, -11, 3090, 5386, 5220, -2501, -1894, 96, -3125, -3380, -844, -3193, -6255, -4057, 560, -351, -782, -1440, -4321, -6393, -4695, -1608, 511, 3900, 7615, 5355, 358, 3582, 3027, 6224, 11021, 8132, 2976]
4174B976o069k524J737L208K840l975l504q59j286P77j265l06R93M964K345J620
4158A672M620K049j776k700J845L632Q38j723l711j602J596J196m124n742l621
4143g551p94R730J092J213M058k295j628k678j704K063k179k286J02J30J938j770
4127b559m30P159M447k019j372k217J822k241j890J608L306K108j824j038j993
4112B867r54k309P38L121M79K20k543l795K368K458l048l77j905p71o70P21K862
4095e38k000Q58J232o62J289q14j460j70j65l327K039K19q68m702J632M155J460
4078a822l624J278k995L826J51l977M225L933L718k29k892l45j058j997L171K546
4062C909j010o84k566J229l637k916K252N45l153m570K853N006P374m096n376
$$ y = [2976, -3093, -5617, -3880, -672, 2168, -1807, -5311, -6170, -7456, -6679, -7944, -8250, -7257, -2293, 52, 1672, 6292, 8341, 6565, 3865, 5710, 9342, 10180, 8457, 4746, 3144, 4740, 5936, 1812, -3930, -7551, -8345, 1385, 2477, 3690, 7748, 5453, 3825, 1147, -557, 1506, -673, -2959, -2857, -2727, -789, -2559, -2989, 4170, 8617, 6598, 5226, 3009, 4831, 2590, 700, 2308, 5614, 7722, 5898, 4860, 2867, 1913, -396, 342, 3463, 3942, 4162, 1619, -2176, 192, 2650, -398, -775, -2680, -3451, -4121, -3400, -538, -2538, -1680, -448, -1110, 179, -635, -2095, -2265, -2430, -5757, -3718, -3499, -4367, -9069, -7437, -3282, -1822, -5446, -4168, -7163, -3337, -3186, -7163, -2938, 995, 4713, 4484, 1592, 1247, 189, -1808, 1363, 3909, 2899, 2215, -351, 878, -2759, -5675, -3423, -2878, -6031, -10601, -7748, -2742, 4632, 536, -4840]
4047d840m625n281j89N937M158k432L708K763J380n888m482M47l8o41L294J348
4031e381l790J405Q85L366j667n13J24L040N459K217o032o016L359M2k955l688
4015a0145P538N549N86k144j087J97k599p45L518m004K753J731J84m14J023l440
3999a499l055P69m37p98k63J542l209k89K245J164j465K178M008L99l458K093
3983g5k396j92O88K284k874j779j764L472J799m56q12M042J292k985l025l440
3967f221J785L43l24K716o35j831m73K247m862k927M135L437j254k001p46L49
3951f262L057R132M413k624j952m300k709J759M79L838M46J33j341K85l084Q7
3935A357J835O55l32J934K200j996n767R08K006K967m957j618L455Q47j53m73
$$ y = [-4840, -9465, -14746, -14935, -8998, -4840, -7272, -3564, -801, 579, -5309, -9791, -9344, -9382, -10023, -6729, -5381, -9171, -7766, -6881, -3515, -5182, -5695, -5571, -2531, 2928, 5145, -887, -6903, -3544, -3502, -6457, -10145, -2607, 2942, 3528, 1384, 297, 494, -2105, -2850, 668, -3336, -583, 1148, 1332, 918, 1941, -1499, -4554, -3785, -4222, -5020, -5283, -3741, -6950, -7239, -4994, -3830, -5295, -3117, 891, 1290, -2168, -75, -2471, -2663, -1975, 309, -2565, -4344, -6108, -2636, -837, -1293, -2105, 1937, 3229, 244, -2781, -6221, -4436, -4093, -4417, -1701, -2336, -4167, -4640, -2393, -7255, -10182, -6047, -2610, -3864, -5865, -6611, -6262, -3205, 5927, 10340, 7716, 5764, 1464, -1245, 514, 993, 4831, 5277, 5410, 4069, 4354, 1270, 1357, 3192, 3847, 3515, 5449, 7649, 5653, -114, 794, 2800, 5767, 810, -808, 2647, 3494, 3341, 2868]
3919B868K711J214l702r29p762j377j347K352M928N527kq93l706J275J807k904
3903F0r79K978k544n404K492k753l104J265J565j110K210K735q55l390o53k005
3887i492k157L408N747m153J532J738M066K693j425k580L691k118m096r25P1K574
3871a426L960m27m974p106J706M513K648L314m166q62J972M578K253J218j916
3856E285k793J763M71l781k375k712q14M52n594L090M985K343l072m032Q80N180
3840g24K764R88J169M244k392j735p635j909J686M763l91o13k520l974J633O48
3824c998k173J870M945m71m861J997K556l312l629K072K58L15j623k212o72K102
3808f836J014L967O04l369M30K201Q81J902p67K07m688m505p11j620L174R183
$$ y = [2868, 5579, 6793, 3091, 2162, -5600, -6977, -8324, -5972, -1044, 4483, 4481, 3588, -118, 1157, 2964, 60, -919, 2059, -485, -5889, -3397, -6150, -9254, -7989, -6424, -7534, -5324, -2589, -3444, -6834, -7487, -9492, -11649, -8241, -2494, -6647, -5115, -3377, 689, 3382, 1957, -623, 3068, 950, -3146, -4071, -4000, -1426, 2534, 2107, -2867, -9973, -8267, -3754, -1106, 2208, -1958, -2820, -848, 3730, 5983, 7201, 5285, 2492, 4255, 4726, 945, -1430, -4142, -4956, -4504, -10098, -7008, -2023, 320, -2752, -6784, -5904, -724, 2040, 3028, 4197, 8441, 6049, 4314, -3321, -5230, -3544, 1219, 828, 215, -2305, -6279, -4646, -3998, -6171, -4301, 644, 173, -4688, -2691, -135, -3447, -7076, -5004, -4746, -4431, -6054, -8266, -8938, -6836, -5822, -1855, -1251, -4620, -4190, -1989, -1108, 794, 27, 234, -4454, -8959, -9670, -11290, -8116, 1067]
3792A067J204k833K625M010k977n619K346J440M428j99k997m716k504p23J816
3777c632L498L70k150m0L63j210L806k601k124K383L63N45n81k663j918M26P99
$$ y = [1067, 2271, -562, 2063, 6073, 3096, -2523, -177, 1263, 5691, 5492, 2495, -2221, -4725, -5448, -3632, -134, 236, -1914, -1954, -1591, -2801, 1005, -1596, -3720, -1337, -974, -429, -1010, -3673, -5591, -5165, -4366]
$$ [...]
##END NTUPLES=NMR SPECTRUM
##END=
