##TITLE=Analysis number 325311
Compound Code cc 05746
Book Reference 518/33
Project Code adrs
Chemist Name colinb
##JCAMPDX= 6.0         $$ Bruker NMR JCAMP-DX V2.0
##DATA TYPE= NMR SPECTRUM
##DATA CLASS= NTUPLES
##ORIGIN= Bruker BioSpin GmbH
##OWNER= nmr
$$ XWIN-NMR		Version 3.5
$$ Mon Dec 18 13:25:55 2006 GMT Standard Time (UT+0h)  MAYBRIDGE\nmr@NMR_250MHZ
##.OBSERVE FREQUENCY= 250.131544655141
##.OBSERVE NUCLEUS= ^1H
##.ACQUISITION MODE= SIMULTANEOUS (DQD)
##.ACQUISITION SCHEME= undefined
##.AVERAGES= 16
##.DIGITISER RES= 18
##SPECTROMETER/DATA SYSTEM= dpx250
##.PULSE SEQUENCE= zg30
##.SOLVENT NAME= CDCl3
##.SHIFT REFERENCE= (INTERNAL, CDCl3, 0, 16.5343)
##AUDIT TRAIL= $$ (NUMBER, WHEN, WHO, WHERE, WHAT)
$$ ##TITLE= Audit trail, XWIN-NMR		Version 3.5
$$ ##JCAMPDX= 5.01
$$ ##ORIGIN= Bruker BioSpin GmbH
$$ ##OWNER= nmr
$$ C:\u/data/dgb/nmr/ADRS/1820/pdata/1/auditp.txt
$$ ##AUDIT TRAIL=  $$ (NUMBER, WHEN, WHO, WHERE, WHAT)
(   1,<2006-12-18 13:25:32.21 +000>,<MAYBRIDGE\nmr>,<NMR_250MHZ>,
      <created by zg, POWCHK disabled, PULCHK disabled
       configuration hash MD5:
       49 4B E0 1D 92 C2 6B 37 9F E6 65 BC 52 41 86 1D
       data hash MD5: 64K
       EB 56 FD 08 4C F8 A1 89 5E 76 F8 15 37 84 54 1F>)
(   2,<2006-12-18 13:25:45.46 +000>,<MAYBRIDGE\nmr>,<NMR_250MHZ>,
      <Start of raw data processing
       ef LB = 0.3 FT_mod = 6 PKNL = 1 SI = 32K 
       data hash MD5: 32K
       0D 75 E9 EF 23 23 DD 10 33 B0 16 2C 55 5C 90 83>)
(   3,<2006-12-18 13:25:47.07 +000>,<MAYBRIDGE\nmr>,<NMR_250MHZ>,
      <apk 
       data hash MD5: 32K
       07 E1 E6 9F 3D E2 92 FE E7 B5 C1 98 6D E5 75 C8>)
(   4,<2006-12-18 13:25:47.77 +000>,<MAYBRIDGE\nmr>,<NMR_250MHZ>,
      <abs ABSG = 5 
       data hash MD5: 32K
       42 F9 50 F1 4E B2 D5 EB 4D EE ED C2 63 21 04 27>)
$$ ##END=
$$ 
$$ hash MD5
$$ 15 60 D7 55 A4 0D 95 97 30 F0 B1 78 DB B1 F1 CB
##$RELAX= 
##$RELAX= 
##$RELAX= 
##$RELAX= 
##$RELAX= 
##$RELAX= 
##$RELAX= 
$$ Bruker specific parameters
$$ --------------------------
##$DU= <C:\u>
##$EXPNO= 1820
##$NAME= <ADRS>
##$PROCNO= 1
##$TYPE= <nmr>
##$USER= <dgb>
##$AMP= (0..31)
100 100 100 100 100 100 100 100 100 100 100 100 100 100 100 100 100 100 
100 100 100 100 100 100 100 100 100 100 100 100 100 100 
##$AQSEQ= 0
##$AQ_mod= 3
##$AUNM= <au_zg>
##$AUTOPOS= <21 >
##$BF1= 250.13
##$BF2= 250.13
##$BF3= 250.13
##$BF4= 250.13
##$BF5= 500.13
##$BF6= 500.13
##$BF7= 500.13
##$BF8= 500.13
##$BYTORDA= 1
##$CFDGTYP= 0
##$CFRGTYP= 5
##$CHEMSTR= <none>
##$CNST= (0..31)
1 1 145 1 1 1 1 1 1 1 1 1 1 1 1 1 1 1 1 1 1 1 1 1 1 1 1 1 1 1 1 1 
##$CPDPRG= <>
##$CPDPRG1= <>
##$CPDPRG2= <>
##$CPDPRG3= <>
##$CPDPRG4= <mlev>
##$CPDPRG5= <mlev>
##$CPDPRG6= <mlev>
##$CPDPRG7= <mlev>
##$CPDPRG8= <mlev>
##$CPDPRGB= <>
##$CPDPRGT= <>
##$D= (0..31)
0 1 0 0 0 0 0 0 0 0.06 0 0 0 0 0 0 0.0002 0 0 0 0 0 0 0 0 0 0 0 0 0 0 
0 
##$DATE= 1166448330
##$DBL= (0..7)
120 120 120 120 120 120 120 120 
##$DBP= (0..7)
150 150 150 150 150 150 150 150 
##$DBP07= 0
##$DBPNAM0= <>
##$DBPNAM1= <>
$$ [...]
##$SUBNAM7= <"">
##$SUBNAM8= <"">
##$SUBNAM9= <"">
##$SW= 20.6930455092707
##$SWIBOX= (0..15)
0 0 3 0 0 0 0 0 0 0 0 0 0 0 0 0 
##$SW_h= 5175.983436853
##$TD= 65536
##$TD0= 1
##$TE= 295.16
##$TE2= 300
##$TE3= 300
##$TEG= 300
##$TL= (0..7)
0 120 120 120 120 120 120 120 
##$TP= (0..7)
150 150 150 150 150 150 150 150 
##$TP07= 0
##$TPNAME0= <>
##$TPNAME1= <>
##$TPNAME2= <>
##$TPNAME3= <>
##$TPNAME4= <>
##$TPNAME5= <>
##$TPNAME6= <>
##$TPNAME7= <>
##$TPOAL= (0..7)
0.5 0.5 0.5 0.5 0.5 0.5 0.5 0.5 
##$TPOFFS= (0..7)
0 0 0 0 0 0 0 0 
##$TUNHIN= 0
##$TUNHOUT= 0
##$TUNXOUT= 0
##$USERA1= <user>
##$USERA2= <user>
##$USERA3= <user>
##$USERA4= <user>
##$USERA5= <user>
##$V9= 5
##$VALIST= <valist>
##$VCLIST= <CCCCCCCCCCCCCCC>
##$VD= 0
##$VDLIST= <DDDDDDDDDDDDDDD>
##$VPLIST= <PPPPPPPPPPPPPPP>
##$VTLIST= <TTTTTTTTTTTTTTT>
##$WBST= 1024
##$WBSW= 4
##$XGAIN= (0..3)
0 0 0 0 
##$XL= 0
##$YL= 0
##$YMAX_a= 438585
##$YMIN_a= -416005
##$ZGOPTNS= <>
##$ZL1= 120
##$ZL2= 120
##$ZL3= 120
##$ZL4= 120
##$ABSF1= 16.53432
##$ABSF2= -4.158854
##$ABSG= 5
##$ABSL= 3
##$ALPHA= 0
##$AQORDER= 0
##$ASSFAC= 0
##$ASSFACI= 0
##$ASSFACX= 0
##$ASSWID= 0
##$AUNMP= <proc_1d>
##$AZFE= 0.1
##$AZFW= 0.1
##$BCFW= 0
##$BC_mod= 0
##$BYTORDP= 0
##$COROFFS= 0
##$CY= 12.5
##$DATMOD= 1
##$DC= 0
##$DFILT= <>
##$DTYPP= 0
##$F1P= 14.0000005364418
##$F2P= -0.99999901652339
##$FCOR= 0.5
##$FTSIZE= 32768
##$FT_mod= 6
##$GAMMA= 0
##$GB= 0
##$INTBC= 1
##$INTSCL= 1
##$ISEN= 128
##$LB= 0.3
##$LEV0= 0
##$LPBIN= 0
##$MAXI= 10000
##$MC2= 0
##$MEAN= 0
##$ME_mod= 0
##$MI= 0
##$NCOEF= 0
##$NC_proc= -2
##$NLEV= 6
##$NOISF1= 0
##$NOISF2= 0
##$NSP= 0
##$NTH_PI= 0
##$NZP= 0
##$OFFSET= 16.53432
##$PC= 1
##$PHC0= 225.4147
##$PHC1= 5.184366
##$PH_mod= 1
##$PKNL= yes
##$PPARMOD= 0
##$PSCAL= 4
##$PSIGN= 0
##$REVERSE= no
##$SF= 250.129996916457
##$SI= 32768
##$SIGF1= 0
##$SIGF2= 0
##$SINO= 400
##$SIOLD= 32768
##$SREGLST= <1H.CDCl3>
##$SSB= 0
##$STSI= 32768
##$STSR= 0
##$SW_p= 5175.98343685301
##$SYMM= 0
##$S_DEV= 0
##$TDeff= 65536
##$TDoff= 0
##$TI= <Analysis number 999999
Compound Code 99
Book Reference 9
Project Code 9>
##$TILT= no
##$TM1= 0
##$TM2= 0
##$TOPLEV= 0
##$USERP1= <user>
##$USERP2= <user>
##$USERP3= <user>
##$USERP4= <user>
##$USERP5= <user>
##$WDW= 1
##$XDIM= 32768
##$YMAX_p= 341770446
##$YMIN_p= -178117
$$ End of Bruker specific parameters
$$ ---------------------------------
##NTUPLES= NMR SPECTRUM
##VAR_NAME=  FREQUENCY,     SPECTRUM/REAL,   SPECTRUM/IMAG
##SYMBOL=    X,             R,               I
##VAR_TYPE=  INDEPENDENT,   DEPENDENT,       DEPENDENT
##VAR_FORM=  AFFN,          ASDF,            ASDF
##VAR_DIM=   32768,         32768,           32768
##UNITS=     HZ,            ARBITRARY UNITS, ARBITRARY UNITS
##FACTOR=    0.157963299565203, 1,           1
##FIRST=     4135.72961854849, 0,            0
##LAST=      -1040.25381830452, 0,           0
##MIN=       -1040.25381830452, -178117,     0
##MAX=       4135.72961854849, 341770446,    0
$$ Real data points
##PAGE= N=1
##DATA TABLE= (X++(R..R)), XYDATA
$$ [...]
22066 1828 8084 11269 -4029 2716 9758 19130 18541 15262 6030 4938 -12216 -16804 -7703 2453
22052 2453 -1639 1177 -1419 -13781 -21257 -16957 -6961 4612 5948 2084 2605 6784 9098 -3114
22038 -3114 -2858 4493 1868 -1950 -373 -56 -7310 -7235 -3851 1299 4988 -4618 -3018 2583 13937
22023 13937 9207 4449 4419 7933 6951 5441 -619 -7666 -376 9980 -512 -1044 5204 -3699 -5323
22008 -5323 -10254 -2992 -10217 -11291 -7786 -1054 -1986 -1679 1354 -5757 -20399 -19847 -11688 -5039 -5170
21993 -5170 -20553 -22308 -16186 -7966 -5523 5181 -6780 -5847 -11861 -16179 -6356 7540 12275 16951
21979 16951 9688 -217 2440 -14506 -19216 -10208 -16268 -24589 -25281 -16361 -5646 -6588 -2513 -6089
21965 -6089 1372 1409 824 -11844 -17933 -19695 -3872 -2482 2458 -1600 -7333 -1954 6548 12830 4394
21950 4394 2630 1604 -6603 -15630 -20913 -7634 3548 7773 -2746 -6737 -12632 -17086 -13538 -5399
21936 -5399 1781 -2671 -11509 -25751 -31635 -19068 -14392 -6077 -6578 -9496 -17651 -16420 -18375 -18433 -16261
21921 -16261 -19899 -12798 -10402 -8122 -2831 2318 5629 2411 -4704 -2068 758 4939 -1489 3030
21907 3030 6670 2025 -7819 -6258 -333 8165 6766 10024 10972 20289 29047 16153 -2487 -10997
21893 -10997 -6757 -5007 -767 -8008 -13185 -17430 -21719 -33320 -39195 -32830 -15614 -8312 -9233 -591
21879 -591 8124 8650 3615 4742 1289 5393 11887 12345 4060 -2736 5877 3799 6340 -11094 -18003
21864 -18003 -15908 -8752 -2511 -10053 -15860 -11306 -3225 -14509 -17631 -16635 -21586 -15987 -7981 -7620 -12399
21849 -12399 -9138 -2668 -13695 -10896 -8632 -4039 -8109 -14179 -5594 -3542 -12801 -17747 -15577 -10662
21835 -10662 678 5538 1051 -1546 1592 1542 -10111 -14478 -7392 -2528 -10581 -3370 -1250 -284 7343
21820 7343 16381 21925 16198 4761 -2806 -20973 -9796 -3797 -3672 -85 -1070 -1399 2519 18553
21806 18553 4531 -3792 -6748 -9452 -10250 -13880 -13968 -11129 -1125 -184 1600 202 -11871 -12441 -18629
21791 -18629 -15910 -22121 -28302 -29158 -25889 -9990 -9661 -6049 6359 5646 1348 -7318 -4706 -4579 -6111
21776 -6111 -15518 -21606 -19222 -19994 -23520 -7425 11904 19581 8600 11811 11908 -6013 -8173 -5983
21762 -5983 -2609 7135 9151 -1533 6446 1789 5335 19298 5757 -6132 -2537 -5948 -8007 -6267
21748 -6267 -4668 -8154 -2627 -9885 -10564 -8489 3561 1625 -3407 -5136 -4108 -2451 2742 -249 -8153
21733 -8153 -18224 -11715 6869 22040 17018 6870 -2075 -10373 -8342 7465 9825 2063 -6009
21720 -6009 3115 6457 -7480 -12004 -17115 -21159 -14993 -13403 -9306 -14472 -4658 -5 -4058 -10504
21706 -10504 -11618 -23048 -16771 -7104 -3750 -617 6860 10424 7252 -7665 -14270 -19911 -26384 -20509
21692 -20509 -10260 11400 25956 29555 21799 23135 22635 18675 16154 12241 6294 -2318 -18453 -12779
21678 -12779 4381 1915 2361 1405 2828 2382 6263 11427 5244 -906 7000 14135 6036 -3222 -21751
21663 -21751 -18453 -16766 -23795 -25168 -20420 -16884 -21791 -15310 -4920 -10457 -8671 4652 610 5257
21649 5257 16633 18962 8415 -427 -1372 -298 -1995 -2285 -2695 -5474 -205 9893 11387 16320 6377
21634 6377 4053 14108 4685 5459 -2348 -2550 -12256 -7494 -397 2351 9448 8720 -7431 -1738 3190
21619 3190 -217 -3220 -3336 -4849 -5415 -20812 -33108 -24234 -2200 -2073 2898 4824 6263 2903 -288
21604 -288 1785 165 2286 16347 18054 12209 -1179 -3893 -6593 -5407 -8579 -13022 -17264 -21200
21590 -21200 -33207 -27166 -18304 -18461 -15803 -13211 -15257 -19025 -18553 -12416 -12697 -7057 -3339 -121 -11
21575 -11 452 4608 6581 4424 441 -2870 -3095 3897 9352 -1937 -14520 -9389 1566 12966 5148
21560 5148 2772 -2371 -8288 -10253 -5839 -3497 -6415 -2049 -259 1574 373 -1878 -4453 -557 7309
21545 7309 13795 9613 -242 -5852 -2865 -4721 -1074 -1094 -1992 4409 5727 14380 12749 -1777 -24048
21530 -24048 -20578 -24122 -22739 -10114 -2449 -2704 3855 4011 2942 -1100 -3347 -8284 3651 11498
21516 11498 9939 -608 -10605 -12578 -7764 2674 4320 -114 -2430 -7747 -3250 2456 -148 -12216
21502 -12216 -10378 -9060 -8687 -3876 4968 -7362 -8153 -5241 -9474 -4397 -18212 -20443 -15382 -24319
21488 -24319 -15576 -2249 -6265 1640 15486 19195 7678 4534 831 -5890 -4826 -8679 -9199 -8166
21474 -8166 -26077 -28353 -14810 -14350 -16960 -10550 -1298 -3895 -10000 -7890 -20690 -18648 -8320 -7774
21460 -7774 -3650 -8597 -10963 2065 3337 -6142 -12852 -18405 -16847 -6932 6388 5107 -3697 -12352
21446 -12352 -13275 -11934 -14377 -15831 -17203 -2085 999 2013 3291 -4632 -8662 -4963 -9456 -4110
21432 -4110 9931 11819 13960 20725 8244 -15002 -14168 -1625 5963 12865 12419 6937 -1421 -9775
21418 -9775 -8716 -5603 1285 6599 -2332 9335 23169 21599 19572 21296 23855 18290 1780 -1839
21404 -1839 8451 16342 6408 -14556 -27292 -20667 -18355 -31720 -31987 -16459 -9714 -8276 -4469 -2013
21390 -2013 -14351 -8220 -3853 1913 7696 11042 15023 4541 -6672 -8124 5870 10725 5871 2961
21376 2961 9888 19910 18657 3749 -5829 -6241 5701 15464 3948 -10132 -15332 -27409 -23338
21363 -23338 -12612 4700 21100 22512 5107 -3807 -7016 -1396 6826 6904 4781 200 -7456 -9314
21349 -9314 -11598 -10422 -10656 -9266 -5634 -3379 -197 -1155 -3658 -3211 -6810 -8784 -15130 -29863 -34659
21334 -34659 -33480 -30272 -23181 -17590 -18658 129 2138 -5062 -1776 -523 -12907 -6602 -861 -9774
21320 -9774 13 9664 6400 8933 15266 15430 9018 1605 -11152 -8854 -1256 837 -2264 -1269 3804
21305 3804 6962 -3215 -11964 -12100 -4745 -2031 29 -7547 -18431 -18614 -1807 7225 20108 18685
21291 18685 16390 17885 22462 7661 5715 5085 -9309 -9288 -9481 -11031 -934 -3624 -5791 -4680 -8834
21276 -8834 -4509 -1999 361 -7757 -7891 -4195 -5913 1930 6347 5050 6333 3146 1315 -1764 -5190
21261 -5190 8147 3327 -8658 -3987 2294 4 -18355 -21186 1510 18713 14736 8560 4807
21248 4807 3308 165 -609 4329 2806 -7286 -5648 -9517 -20943 -12027 2095 5351 -881 -10195
21234 -10195 -15997 -8624 -8372 -19950 -9875 4846 9866 7230 6425 6436 8396 -774 -209 -4678 -8152
21219 -8152 -3415 -669 7152 15572 10686 5321 -1178 -2437 4535 8943 6923 2023 2055 -200 -11312
21204 -11312 -16410 -18545 -7003 3972 4783 2693 1903 -6822 -17415 -16151 -4586 10295 15961 19290
21190 19290 18170 6314 2738 1287 -1001 -5656 -11651 -4114 1176 10564 15956 20260 20822 10939
21176 10939 3057 11595 5642 296 3702 4061 -3638 -322 688 -6770 -2798 10795 14885 9532
21162 9532 6416 1364 1736 -13942 -19830 -1077 8567 22381 19547 788 -718 4919 -613 1250
21148 1250 5628 11861 2607 -1793 -2827 1581 8878 4392 -5115 -5642 -452 17652 12373 -9361
21134 -9361 -16746 -18060 -14602 -15850 -27461 -22649 -10781 -51 9632 12180 1073 5713 13792 5099
21120 5099 -6751 -14783 -8277 -3830 6990 5216 9202 5782 -4488 -13006 -6715 128 2158 -6618
21106 -6618 -9270 400 4074 2287 -6683 -9499 -8935 -17687 -14962 -23395 -25052 -37837 -26058 -9654
21092 -9654 -8281 -12915 -9027 1262 -10244 -9703 -2661 479 -689 -6546 -13525 -12811 -18357 -22579 -23001
21077 -23001 -16451 -15155 -18618 -18740 -13789 -11565 -6500 -16813 -21339 -8739 1379 3143 2380 754
21063 754 5109 1565 -2391 -10480 -1240 5116 -2382 -19215 -22888 -13295 -5608 457 2729 4024 16233
21048 16233 15079 2734 2753 -155 3818 16511 17855 -333 -12612 -11068 -795 -1656 8053 4903
21034 4903 14201 8081 -6432 -9179 -7341 872 11280 11958 10681 8358 9134 -2961 -1348 -2472
21020 -2472 -643 -2427 -2109 3713 15278 15356 -463 -2221 794 1821 -663 933 12852 10054 1042
21005 1042 -6470 651 1428 3184 9975 6773 982 -401 -5581 -9755 1295 -4931 -347 -8438 -17787
20990 -17787 -20249 -15856 -9192 -3570 7098 6929 10379 11807 14802 5794 1455 1866 9086 12843 6654
20975 6654 14001 15946 8355 5895 229 -3501 -2034 7036 11336 22256 14004 165 -6043 -9086
20961 -9086 -12010 -21284 -22190 -18820 -24309 -30074 -18330 -18728 -13946 -10847 -8360 -3941 -4515 -2958 6712
20946 6712 18155 12049 3550 -6168 -6518 -15837 -24042 -13468 2526 5634 7963 -4410 8302 7699
20932 7699 6813 5663 -2821 -6289 -8301 -9765 -11051 -3798 -6600 1353 -1692 -134 4758 4220 -4569
20917 -4569 1184 1991 -7866 -2288 -8408 -11343 -447 10538 19595 17847 5799 11820 19764 11305
20903 11305 -5709 -6130 -7897 699 3520 -1479 6683 5901 6641 12243 4059 -5460 -5546 -7497 -13927
20888 -13927 -17886 -21640 -21138 -10571 2278 2570 17967 14063 7967 5281 -5245 -9303 -11824 -24475
20874 -24475 -23563 -28799 -21750 -10372 9054 18589 8426 -1813 -5567 -1203 -9210 -7508 -8768 -12182
20860 -12182 -17185 -32410 -30589 -9810 455 -2172 -5254 -10823 -10318 -17147 -20372 -16679 -25317 -26130
20846 -26130 -19437 -1691 -124 -7085 -1308 3454 -6867 -2572 9468 7279 10594 14926 16076 1259
20832 1259 -7882 -289 6675 7693 1691 -6758 -11843 -360 6054 11172 12628 10537 10306 1692 5764
20817 5764 13071 11126 -1318 -17930 -14861 -6313 -4907 257 -4236 -5432 -6608 -7415 -8690 -8500 -8219
20802 -8219 -5689 -4169 -11726 -18844 -4962 -4398 -2692 -5640 -10247 -11067 -11018 -4409 -3194 9895 360
20787 360 -10269 -5445 6404 1884 663 -7597 -8001 -13116 -17056 -4835 7092 11049 -3015 -4646
20773 -4646 -3479 -4761 -1614 -2592 -4329 3053 -6729 -10071 -3234 -2776 -3062 -6384 -5452 -5644 -5658 3443
20757 3443 7285 -2029 4121 3277 -3902 -5857 2737 3648 8739 2140 -8805 -4140 1769 302 -4521
20742 -4521 4633 8051 -6725 -1388 3013 -3436 -9123 -6707 -1870 -7171 1841 2824 -1461 -4422 -8649
20727 -8649 -14018 -15367 -13293 -12990 -18450 -25000 -25003 -27296 -19695 -15203 -15001 -15254 -11473 -6795 -2033 12691
20711 12691 1839 -10657 -3829 4092 9757 3588 8981 17785 14853 -740 426 -5827 -11773 -16715
20697 -16715 -19399 -11112 -8721 -10986 -10993 -12469 -6625 -472 -11248 -7882 -5783 -4056 4134 15390 10934
20682 10934 1294 282 1300 5639 1738 -260 -6146 -11437 -5321 546 -9753 -21504 -20225 -3423
20668 -3423 13876 28863 23593 7165 -3891 -7955 4252 6553 10372 23230 28886 24247 14359
20655 14359 9402 -2837 -8162 4271 15066 16331 8142 -2262 1263 2976 -2976 -13591 -12406
20642 -12406 -7463 -7218 -9666 -4424 -9177 -7373 -1821 -12886 -22572 -17167 -17183 -19225 -15182 2365 3342
20627 3342 675 9880 11641 -4508 -13330 -12859 -7010 -3730 -7988 -7275 -4932 7449 19079 29943
20613 29943 18949 13377 6845 1517 9019 25160 17578 2195 -14805 -32756 -20198 -8226 -3515
20600 -3515 -8725 -14933 -10195 -7313 -5606 -601 -458 4374 12583 8388 -9130 -13805 -11230 -15144 -14068
20585 -14068 -8169 926 4624 16246 15001 8684 -5772 -15091 -17820 -8953 -3853 -14759 -3387
20572 -3387 27 -8368 -23807 -23001 -8812 -3025 -9595 -21976 -15633 3005 16549 21583 16654 3387
20558 3387 -614 11653 13749 11797 15913 6097 -5818 -5872 -5339 -3888 -3258 -10105 -8777 4072 11198
20543 11198 7668 -1182 -4114 -7947 -11364 -14099 -9433 2972 1530 -10662 -27397 -32545 -21286
20530 -21286 -9170 697 -1006 -4029 -13743 -7928 -246 -547 -3813 -14524 -17090 -13347 7147 6187
20516 6187 3025 -7119 -10314 -12767 -3003 4444 8863 597 -6146 -18019 -20794 -19270 -17716 -10444
20502 -10444 -4114 -5677 -21 7712 11794 14683 11107 -2550 -4222 -5458 -17168 -22648 -9565 -14552
20488 -14552 -16651 -12181 -7044 -11899 -19658 -21159 -24440 -14410 -13334 -26983 -35465 -28395 -21238 -22927
20474 -22927 -12192 -8076 -6751 -7591 -9551 -12350 -18895 -18800 -27540 -29915 -22216 -14081 -13360 -23239 -15789
20459 -15789 -26473 -28774 -19699 -16317 -13563 -7574 -3938 -12284 -12147 -3173 -5581 1068 11926 8412
20445 8412 623 -5409 -1742 12544 10731 -1633 -1888 12039 19741 20799 22641 11762 8818 7758
20431 7758 18088 35240 31437 23120 18017 15797 9744 1081 6622 12857 13124 4408 3757 658 10909
20416 10909 19167 9126 -436 -7491 -10008 -3654 -2852 -14597 -1608 329 -6191 -18575 -23074 -20184
20402 -20184 -12804 478 1039 14210 18 -9308 3199 14384 7108 -1620 -8031 -2048 12571
20389 12571 21560 11642 1006 936 -1889 1946 7720 4293 5174 -2167 -991 1791 6940 -3016 -11944
20374 -11944 1730 -2849 -6596 -7042 43 -1585 -16141 -10792 4946 13880 22660 13837 10480 12578
20360 12578 11807 1710 4205 8510 14388 -381 -4187 -3591 6498 21282 15344 7944 9233 13457
20346 13457 16033 11046 8029 508 -5913 2300 8675 -3549 -2510 4125 7378 219 -571 -6869
20332 -6869 -7326 -3523 -4593 -3389 -18535 -14439 -4301 4419 6679 8514 4038 6144 3501 -2233
20318 -2233 -5285 -16847 -10000 -3989 -5505 -5636 5581 1002 4028 3973 -8291 -17300 -9966 -3785 1200
20303 1200 -1829 -5433 9814 10837 3589 7106 -5045 -10951 -18815 -12799 -2520 -4935 5772 14350
20289 14350 16299 12570 -1454 -12205 -6404 -7094 -7381 684 -10536 -10846 -5781 1587 11464 17075
20275 17075 21586 16192 12855 17001 9321 4794 3896 -3806 1392 8455 2764 3237 10352 11202 3828
20260 3828 -1747 -1143 1362 3256 10720 21526 24708 15346 18426 14479 4479 -526 -4470 85
20246 85 7535 8092 7712 -6080 -19528 -17513 1220 -278 -9497 -20366 -18503 -4945 -231 1976
20232 1976 -7811 -13078 -2357 -8870 -259 -4408 -12583 -5875 807 -1832 -10349 -13610 -10455 -4861
20218 -4861 -2406 -1683 18484 16249 6152 5006 11161 12034 11897 8195 11688 11638 8301 6571 5381
20203 5381 3414 11079 20243 19676 15570 7239 -5982 -6892 -12718 -17522 -20520 -29028 -28413 -13306 -7394
20188 -7394 -8063 -1979 -3434 -19635 -29697 -20350 -5703 -6804 2919 7957 -3909 -6773 4092 9788
20174 9788 5275 5295 12925 -1839 -10373 -11362 1442 12520 -479 -3072 -7159 -17503 -980 2731
20160 2731 1884 8202 -154 2690 -453 -7864 547 3131 2339 9490 5458 5555 10598 15038 16261 13058
20144 13058 5973 1708 7484 7580 83 -1638 -4440 -2331 -915 -1527 -216 -697 -1412 6914 23497
20129 23497 14613 2938 12966 12970 -3613 -7221 -6016 -3881 2864 -59 -2452 3156 -6160 -15338
20115 -15338 -11751 -5520 -8871 -16398 -4744 1765 7954 -475 -8892 -3002 7928 2455 -5761 6902
20101 6902 11973 915 -18405 -22472 -14335 -2707 -6390 -7761 -2721 -5239 -10846 -11997 -14047 -9245
20087 -9245 -9003 -5372 -15612 -1030 3830 269 7183 12806 8896 15000 14900 12491 7833 -593 -6933
20072 -6933 -22243 -38065 -26891 -4100 11223 4724 -378 -7291 -3403 -8483 -13164 -3693 8033
20059 8033 21185 14208 3560 3656 5149 10827 6921 8467 9671 2476 -6216 -5024 1789 457 -2838
20044 -2838 1099 -1244 449 11882 14499 5938 11522 17392 14067 9631 -4887 4662 11521 3183
20030 3183 -6153 -6304 -1435 -4813 -5222 -9286 -12735 -7097 7427 3433 -637 5679 812 4072 20847
20015 20847 16834 5110 -11863 -13621 1334 -18 2643 907 710 2497 -13295 -12800 -7125 -11082
20001 -11082 -7230 -334 -8690 -13678 -8148 -7150 7673 8324 37 -4642 4119 -1442 -5817 -11202 -18163
19986 -18163 -11901 14558 26638 33221 22283 13893 8155 -2096 -3727 -5765 -5286 -3417 8233
19973 8233 8568 15067 21484 21795 14928 5090 -5977 -9383 -8725 -22181 -17137 -9550 -11886 -20142 -22712
19958 -22712 -17806 -19190 -10457 -11872 -13391 -10228 -4589 1391 -1593 -6895 -4554 -3267 -7549 -8469 -7831
19943 -7831 -7264 4860 10780 11010 2641 -4961 -6683 3244 12768 6876 14389 11925 -3872 95 5624
19928 5624 11051 16987 8433 -207 -7448 -14961 -14291 -11648 8004 16047 10157 -4842 -15196 -8628
19914 -8628 -5500 -1529 -1572 -4524 -8468 -3971 17 1387 3164 273 -1187 -3467 -8543 -9171 -8616 -7441
19898 -7441 -6106 -1863 -5700 -15724 -23605 -15615 2261 18070 14422 -4212 -17504 -19350 -5000
19885 -5000 82 -2719 -3903 -2644 -7962 552 -512 -20 -9635 -10067 -13254 -21040 -13960 -9402 -14628
19870 -14628 -16880 -15425 -12871 -10546 -6441 -7005 -7671 -3042 -8556 -4595 6442 1860 1194 -9192 -8706
19855 -8706 -3232 12824 14716 11560 14899 21665 19527 7676 3138 -2244 2583 5352 2008 1205
19841 1205 961 1474 6611 9401 7300 12234 5061 -661 2175 7569 7827 5286 7646 9209 -1481
19826 -1481 -5415 -1107 12418 4989 4576 -1189 -5996 -9000 -15830 -16321 -25414 -22063 -14788 -5504 -6066
19811 -6066 444 -3699 -2351 6819 16204 10786 4702 243 8020 5160 -2239 -5240 -5722 -1742 636
19796 636 -10821 -7961 -717 -4956 -7194 -13271 -14935 -4011 -412 1424 3782 3514 8537 8824 20900
19781 20900 19261 27065 28819 29356 26374 -6276 -9206 4927 13320 20789 22549 33825 55704 78771
19767 78771 73741 60548 52688 50662 49792 49475 52430 75871 79387 73200 78320 70520 49981 29751
19753 29751 26514 32696 44132 41545 36038 36600 37343 35531 31716 27180 24882 17079 -599 -8834
19739 -8834 -4691 -4138 -4598 -10899 -12537 -9427 -6691 -9625 -15052 -14338 -12822 -5458 -6019 -1409 8497 3046
19723 3046 -12246 -9846 -13430 -11456 -8532 -15154 -19465 -23470 -10723 269 1243 -4505 13761 14213
19709 14213 12386 9628 2766 145 8824 21429 16053 7609 -512 -2049 -1728 -13450 -16503 -7488
19695 -7488 4176 15140 23883 18098 7172 3883 -6991 -16098 -11667 -1835 -1181 1888 -6540 -17274
19681 -17274 -22881 -27963 -24410 -25426 -17796 -11966 -9428 -9888 -12673 -11709 -16534 -22061 -18285 -16759 -15806
19666 -15806 -15299 -11778 -12612 -11617 -6785 -3865 -202 2725 2339 3841 7530 -8676 -16970 -17580 -16998 -22817
19650 -22817 -13211 -6595 1277 -12009 -27525 -30179 -15069 -6566 7800 13389 8997 7160 3394
19637 3394 -2612 -13274 -10324 -6251 2729 5273 -5634 608 5253 18214 21394 11754 5736 10679
19623 10679 12681 16693 8341 7699 14884 22243 22738 8446 -4816 -4 2757 2615 -2946 -5225 -12033
19608 -12033 -94 12301 5798 11698 16966 10973 9101 -4250 -16233 -20465 -10290 -7335 -9398
19595 -9398 -19130 -26899 -8142 5067 -123 -2422 -2422 1642 3022 -9693 -15405 -19644 -19458 -19894 -19195
19580 -19195 -14570 -5136 -3986 -11320 -15822 -21633 -8452 6690 12421 10469 736 -1735 -2025 -8892
19566 -8892 -7062 216 8333 3346 -3194 4042 5591 -7555 -12640 -7208 -12278 -7723 2159 -6243
19552 -6243 -9332 -12400 -11949 -10140 -17105 -24752 -25452 -14425 -6380 -1065 -6230 -12437 -9395 703 4234
19537 4234 7354 2552 1965 -9042 -14161 -12586 -9638 -12548 1506 -3212 -9197 -4728 -4313 -10434 -7286
19522 -7286 3838 -746 -9009 -8182 -1147 -1449 -7943 -2825 6945 -1344 -9611 98 5557 14632 18202
19507 18202 6588 7914 11276 14615 16210 10066 9320 8498 -490 -203 -2396 131 5204 -6257 -11139
19492 -11139 -7580 -4587 -21826 -30534 -22239 -17326 -20095 -12505 -2279 -5914 -14046 -25866 -21352 -10108
19478 -10108 -18409 -11087 -10581 -14239 -15416 -13813 -5147 -13831 -15897 -15819 -13478 -10954 -7387 -14845 -20266
19463 -20266 -21284 -9096 2739 13579 14661 8849 4368 -4935 -7919 -1692 3572 18054 16690
19450 16690 7871 11436 18370 12100 5654 -5638 5621 -4954 -9138 -14960 -24051 -22300 -21611 -20857
19436 -20857 -8903 -12536 -16187 -16070 986 7166 -9018 -13147 -22214 -26563 -13790 -7822 -13857 -7509
19422 -7509 -12554 -7148 -4914 -5363 -8239 -9098 -16276 -16128 -12241 -12932 -18929 -20321 -3634 6244 11335
19407 11335 19800 27439 17176 3237 -5282 -6805 7599 24085 16362 15283 12072 11828 8147 -6068
19393 -6068 -11505 1373 12017 9332 4543 6427 3764 -2190 -7960 -7479 -4945 -250 -10227 -10146 -5672
19378 -5672 9943 10739 13147 9744 18498 21799 7113 1167 -7385 -3724 -5559 -4825 -7831 1702 16089
19363 16089 12127 13382 2309 -5220 -13449 -17774 -20936 -20699 -18896 -16468 -16143 -15950 -9033 -11997 -6355
19348 -6355 6499 4274 8738 11476 1218 -17403 -25652 -10206 -1577 -9812 -2552 5439 2020 4079
19334 4079 -2151 -22814 -26662 -29100 -19611 -11485 -17116 -15525 -9413 -2911 -3634 -7817 -7528 -5392 714
19319 714 -3520 -398 9559 11460 11320 3108 -801 -1716 -6709 -10619 -7994 -9526 -3693 4751 18355
19304 18355 9236 2487 10220 15800 7414 7800 9773 12976 11413 14807 6641 -11569 -14961 -5153
19290 -5153 1238 -10539 -19148 -19436 -16041 -14662 -21099 -5264 580 1046 1638 6355 7600 17411 3125
19275 3125 1789 -1287 12771 16103 3546 -13630 -13776 1127 12304 9290 985 -5999 -4321 8502
19261 8502 12835 5080 4674 -9261 -10301 -7051 -12726 -5488 -3488 -3531 -939 1518 8707 7579 9986
19246 9986 3650 7182 12894 15657 7034 810 -1879 -7539 -10032 -6508 -5026 -7665 -717 12220
19232 12220 18780 16476 12039 9450 19914 18536 9777 4325 -5198 -5492 -12500 -21796 -25671 -15593
19218 -15593 1473 4202 4053 10893 11261 18024 13294 6998 -4779 -6171 -6873 -2178 8198 -7429
19204 -7429 -19793 -22234 -17471 -4855 -5564 -3405 5629 1187 -3613 570 -5364 -15918 -22975 -20587
19190 -20587 -19608 -15268 -18719 -18028 -12382 -9318 1725 5081 388 -7790 -1300 2697 -2072 -1292 -1031
19175 -1031 -2305 -8759 -2822 -291 7000 10455 8576 -7952 -13813 -18909 -13951 -7262 -15710 -21385
19161 -21385 -18357 -12726 2221 310 -4044 4889 -4391 -9669 4845 25609 41475 45217 32027
19148 32027 18569 6805 1555 -3930 3959 1969 -2545 -8363 -13429 -14680 -7790 5310 3016 -7400
19134 -7400 -6948 -14157 -16346 -3303 1439 -5270 -15750 -5870 -11758 -16181 -6802 777 -7386 -17436
19120 -17436 -13062 -7093 -16693 -9791 -7387 -10967 -15954 -15105 -12515 -5509 -7249 -15226 -15806 -13794 -26202
19105 -26202 -20664 -19356 -27095 -19895 -13760 -5946 -8068 -5362 -3563 -2528 3609 13013 9321 2500
19091 2500 7164 11800 -537 -10490 -10361 4697 10197 5099 -15394 -24742 -18355 -22930 -23525 -15125
19077 -15125 -3246 -11070 -4954 121 -5554 -13674 -19244 -14782 -18078 -18215 -13574 -21252 -25648 -21279
19063 -21279 -13374 -10308 -7391 -5936 -5068 -7401 -6738 -9469 -3139 -6742 4549 2100 -13507 -8148
19049 -8148 2203 10120 14406 15343 11699 7332 2497 1695 10175 8813 6779 6358 6474 610 -3178
19034 -3178 -1918 -4104 -12905 -21091 -12951 -2268 -4196 -10768 -11938 -16368 -11430 -17639 -16709 -16341 -5211
19019 -5211 -6685 -1880 14583 21875 21629 17559 14871 10318 8010 11645 5485 2813 6178 3410 9252
19004 9252 17341 17166 5963 -5678 -4166 -7374 -14568 -9901 465 -5088 -15042 -18259 -19825 -20087
18990 -20087 -14746 -7912 -6763 -11813 -4554 -987 -2181 4046 7920 232 -9157 -12594 -11724 -10362 -5712
18975 -5712 -3246 -2896 -8954 -6825 -817 -5151 -7775 1214 6201 13533 -4869 -5262 11632 24398
18961 24398 30648 33631 22256 16760 14841 11981 11691 6298 9286 3641 9560 4523 9202 11330
18947 11330 2811 -7665 -11107 -2912 -5173 -13737 -15817 -10849 -7683 -9249 -9479 -12540 -12107 -11856 -15610
18932 -15610 -11031 -10493 -9437 -5623 -8688 6093 1896 -7271 -7969 -8599 913 3255 7450 10146 5322
18917 5322 6283 -387 -1936 2974 8689 -4137 -14436 -14684 -22119 -20310 -13041 -12034 -8167 1704 -1768
18902 -1768 -11671 -13766 -8598 -5844 -4176 -12796 -6688 -3233 -7886 -16216 -11141 817 2195 -4767
18888 -4767 -11853 -11805 -7477 1693 8939 14260 7604 -257 -13262 -8264 5848 -1171 -229 -538 -1506
18873 -1506 -8571 2561 9682 3899 2412 4484 7529 3910 5970 24367 28876 18276 2384 2579
18859 2579 6612 3260 3371 -8390 -11439 -8475 -4383 7073 3964 1685 3366 -6910 -20070 -30535
18845 -30535 -20405 -5762 263 5776 -2543 -18238 -12097 -17439 -13517 -13204 -14275 -12826 -2794 6041
18831 6041 9414 6508 4128 1920 7319 -89 -9989 -14088 -916 2263 -7309 -7905 -8107 -13829 -2468
18816 -2468 3427 4041 -5844 -13030 -10838 -6945 -11475 -4434 739 -6080 -7277 -8015 -9845 -14806 -8905
18801 -8905 -4566 -9059 -10376 -9375 -1765 -201 -5450 -15056 -14872 -19404 -16267 -16000 -6925 1234 5139
18786 5139 9454 6112 11578 18101 22887 11640 3601 -5709 -2126 9736 1380 -11853 -19021 -9927
18772 -9927 3943 14122 29143 57548 100973 158634 154767 101879 65725 31742 10679 5877
18760 5877 -2783 143 3457 4894 -3611 -14390 -14263 -10866 -5808 3501 8988 -5609 -14133 -11932
18746 -11932 -10441 -15091 -5770 2382 2742 940 11387 9638 3510 3210 7984 10195 12835 16891 923
18731 923 -4354 -5557 -2118 8844 8577 11268 16604 14179 7167 406 3249 -7737 -15450 -20610 -11064
18716 -11064 -16048 -14287 -12772 -16401 -12084 -1829 3566 15845 17642 10260 2257 584 -6154 -6785
18702 -6785 5364 2050 -9649 -16965 -24206 -14595 -23664 -21010 -16621 -19579 -16954 -18246 -9839 -3848
18688 -3848 813 2854 16696 26145 28676 45616 45618 26790 21948 5027 5959 11703 9922 1884 -5208
18673 -5208 -4587 1979 -5812 -6109 -14024 -1018 11424 3899 -5557 -4197 4668 3002 -380 4270 3163
18658 3163 3102 1492 -1141 -5894 -25806 -32427 -23360 -16834 -5709 -4244 -7215 -5480 1557 2971 7496
18643 7496 -195 -12081 -9276 -9606 -8637 -16494 -15206 -13312 57 7854 -1815 1486 10836 12315 -3742
18628 -3742 -15523 -6902 531 -7270 -5384 -4975 -7085 4642 -2925 -15810 -24040 -30971 -20335 -11544
18614 -11544 -5980 -8704 -14301 -14279 -24369 -29345 -26052 -33889 -29347 -17590 -13175 -4681 -516 -1579
18600 -1579 1976 -82 -12553 -21975 -16549 -27713 -19351 -7537 896 -2409 -16167 -27226 -10776
18587 -10776 8721 8910 5046 3515 13597 11290 15183 9774 2987 7873 3099 -4633 -14545 3411
18573 3411 12555 4581 -9751 -14205 -8586 1991 11242 16880 8177 8873 18227 11640 -284 -1389
18559 -1389 -3779 -1701 -8095 -14372 -21774 -13649 -8994 -14170 -27452 -27921 -14377 -1118 3275 3470
18545 3470 -8782 -14650 -4177 10572 4145 15272 16190 8753 -13197 -11671 -5572 -17484 -27126
18532 -27126 -15630 -13491 -13991 -5835 -4955 -8956 -8283 -15482 -9165 5919 28591 26032 17096 16883 14395
18517 14395 14508 19116 7082 -8714 -4038 -2506 -923 1344 -4892 -8735 -10907 -12443 -11904 -14368
18503 -14368 692 25272 34186 20810 19003 22562 23888 762 5240 12932 9595 10300 16996 15417
18489 15417 22849 21692 13978 13091 23414 40343 70489 111564 147382 165958 165404 159640 135781
18476 135781 98141 68990 49011 42421 29556 19189 14933 14759 7786 6092 -6938 -9919 -9380
18463 -9380 -12657 -18016 -20090 -5280 4894 7372 5522 17389 16796 16597 24375 11650 6567 13227
18449 13227 13899 16313 9968 2897 -10076 -7334 -8472 -4011 -8166 -8613 -1785 -323 -8590 -4834 1754
18434 1754 -3884 -17629 -29065 -27200 -24425 -23944 -20223 -20600 -20779 -11086 1135 3081 10662 12012 4372
18419 4372 2241 -2487 -4960 -4358 -5688 -4289 -3516 -2886 -3632 -10185 -9515 -2002 7551 7104 2315 -7258
18403 -7258 2036 -5259 -14572 -12097 -5772 -8253 -16497 -14387 -14195 -16075 -15295 -21644 -20426 -20219 -21125 -16961
18387 -16961 -15330 -17212 -14950 -8021 7434 16159 10999 19380 24336 23345 16059 12008 -6011 -3551
18373 -3551 4586 1526 -6263 -1860 3365 -2670 2048 7452 15761 13849 13717 23236 23550 19329 18534
18358 18534 12786 9404 11082 -2716 -7044 -10046 -5220 225 6296 -3299 -5826 5489 9762 -8006
18344 -8006 -4240 6802 -8785 -14594 -1536 -2836 -4358 -7624 -10870 -775 7848 7145 319 -7798
18330 -7798 2720 7543 889 1243 -5113 -17679 -27364 -31713 -32142 -26776 -15722 -13962 -8792 1653
18316 1653 -9895 -19044 -11051 -4448 -281 11518 154 -6964 -4699 -7933 -14678 -4873 -9754 -23293
18302 -23293 -19359 -16330 -21056 -6703 10050 15394 3238 -12039 -23269 -15812 -2718 3301 7669
18289 7669 3815 1554 4856 8352 -468 -6826 -1561 -1357 -1582 2870 11232 12966 9167 2124 6572
18274 6572 8293 19610 18929 10914 8371 6630 -1075 -7257 -15716 -18758 -11601 -6927 -4507 -3245 1917
18259 1917 -787 -9474 -18048 -26204 -32128 -17037 -3912 6345 8334 3450 -8551 -15871 -17625 -1349
18245 -1349 4453 4393 -315 -12460 -17636 -11449 -18529 -25909 -18964 2035 39948 55250 51286 33188
18231 33188 19206 20955 21715 25127 27904 26067 29164 19667 17746 16548 24682 29370 21627 1276
18217 1276 4769 7206 -792 4033 -375 -5955 8810 12223 4464 13067 11320 10990 14365 16903 18138
18202 18138 16589 -2338 5653 14839 8122 -2238 -2504 -8935 -17331 -16019 -6385 3209 7244 9425
18188 9425 5186 4352 13655 14611 7892 6924 17729 23162 16852 16337 7978 18017 27823 21844 23678
18173 23678 23180 21492 25209 30334 32886 29950 23736 24496 32347 31537 33493 42939 52529 42955 43497
18158 43497 42636 35523 39764 43739 37530 44451 56919 63711 70635 72451 73549 71712 71546 78716 88752
18143 88752 102866 127301 157381 194655 247204 274768 281318 289408 344916 428807 472754 443103
18131 443103 382854 364413 374813 393632 373447 328070 318578 340106 369177 411995 457970 535071
18119 535071 631559 749126 911818 1155975 1531907 2112108 3067328 4795094 8169099
18110 8169099 14653095 23842670 25169955 17350339 10162403 6063564 3970891 2817513
18102 2817513 2093281 1622677 1295987 1037461 854377 734642 638875 552333 467801 402382
18092 402382 360741 333484 289428 233386 214417 206358 203886 199138 183583 155815 141688 122895
18080 122895 110507 103602 97409 86078 84159 83775 81949 81950 74083 65244 69956 72682 62877 62180 50896
18065 50896 31680 15003 5732 12047 17090 19961 19719 13880 21043 19958 15386 28120 25949 15638
18051 15638 10440 14220 16721 11195 5772 10687 2451 2680 3510 18785 25689 17195 4955 2826
18037 2826 9327 6898 10103 18211 15186 3043 -2646 100 16 -3244 1201 9830 3676 -8837 -16528
18022 -16528 -13760 6032 14148 15773 8622 7835 14528 15376 13845 4764 2549 14723 29407 31566
18008 31566 28370 23194 14436 5460 4305 15201 17506 15130 7399 -3491 -9582 -3197 -10567 -10701
17994 -10701 -7987 -3293 -2665 -2040 -5716 -8343 -13439 -16674 -7932 2317 244 9394 9214 18555 22003
17979 22003 16162 7679 15529 9018 11365 9258 12797 11663 -796 702 6693 6520 8594 19967
17965 19967 27696 26661 17490 20142 19931 19841 17154 25988 29646 14876 6448 12560 18270 15372 18835
17950 18835 21250 20293 19970 28212 26521 23046 13695 5657 6398 3641 1963 3283 -5839 -9009 481
17935 481 5131 4614 19084 29316 28507 19931 15094 15345 11727 2959 10931 13809 11752 7883 10654
17920 10654 599 -8273 5698 8278 3350 5201 8761 15691 10993 1007 -2867 1649 5342 11000
17906 11000 22550 23441 14398 12953 9543 7358 -630 4169 18801 9161 4772 4669 10620 10149 -4949
17891 -4949 -5536 1182 3405 542 -1990 3798 1587 5645 6561 832 3740 -2335 -11378 -15173 -9284
17876 -9284 -13234 -22032 -19252 -4489 -491 -1225 -229 4461 -322 -11625 -2518 5900 13385 12988 21110
17861 21110 26471 23825 17849 8596 4611 7414 12735 18942 25842 27654 24040 12678 5249 10505
17847 10505 2360 -6366 9062 9018 12188 14957 2453 2078 10827 7933 508 -3419 -6575 -9056 -16544
17832 -16544 -20012 -28804 -15862 1119 10947 13243 22873 19529 11935 18148 24875 16377 7480 919
17818 919 9030 15167 40590 47317 26043 8001 3302 17836 18859 33327 35214 27179 31039 32737
17804 32737 36625 35219 24865 33263 38563 37475 44656 26841 13107 24392 37537 29909 30513
17791 30513 36949 31602 35169 30586 25603 26897 21556 22110 16838 11374 17824 19021 10374 11468 13444
17776 13444 18794 17014 24180 24254 21428 27220 25410 19198 36735 50568 57995 47560 41782 27521
17762 27521 16180 14240 17564 19268 22547 25073 9983 -5767 3375 23537 30577 29758 18830
17749 18830 7599 855 13601 20947 1575 -4131 3220 13277 15662 17452 5246 11089 8776
17736 8776 8051 8505 -2833 -16450 -5966 18596 28231 22055 19382 21795 31329 38783 34363 18909
17722 18909 10873 18109 14093 7935 9133 11261 2252 8998 29668 41388 39769 17336 10488 14460
17708 14460 14615 9718 6790 9010 22255 45783 53253 69949 99953 102949 82430 86779 107630
17695 107630 135677 150272 126402 105989 91819 86574 86932 80878 74452 59883 38866 26077
17683 26077 32520 32852 25777 5491 -5039 -4767 6647 22079 31885 28252 23953 43456 85143
17670 85143 109947 118022 115847 126812 133243 133897 132444 129690 115081 107610 110246 95833 74140
17657 74140 68973 69343 65337 71320 69273 62580 47868 50773 63749 67208 69668 68524 63726 62765
17643 62765 72123 86160 90567 87393 83744 70681 80590 90709 90047 89877 90484 91478 87037 80088 87221
17628 87221 103328 94467 84656 98008 92285 87882 92121 98439 85754 82683 100874 104601 106026
17615 106026 113309 123750 122115 114508 114850 118470 123471 130198 137769 136780 138799 143682 142200 144415
17601 144415 156000 169015 172988 179881 182088 170174 174792 185965 209925 216038 217405 241377 268269
17588 268269 284945 303423 344008 355417 353022 373282 412914 464691 486306 486250 464931 478633
17576 478633 528692 584211 625351 671294 745351 861459 954904 1031688 1174452 1440522 1844652
17565 1844652 2221773 2346568 2383398 2630848 3186793 3801793 4011055 4015197 4347455 5198977
17555 5198977 6534176 8399205 11573871 17471747 26893225 35421671 35993385 33874374
17547 33874374 36789354 48316432 64462204 65328711 51048886 39023224 35132970 37360656
17539 37360656 37426361 29540164 20062563 13385036 9455976 7135313 5647313 4634259
17531 4634259 3900424 3336552 2921701 2619272 2394892 2219292 2087035 1936220 1813888
17522 1813888 1659063 1479801 1323444 1193652 1086955 988770 862981 740742 628748 563558
17512 563558 506775 461802 419877 384158 354944 322490 303875 284412 267748 248269 226440
17501 226440 213072 198950 180235 169951 152847 135053 136304 139782 140458 130352 124108 113665
17489 113665 105692 103005 104660 96857 93001 82343 75992 81529 81283 84137 79782 65173 52867 40137
17475 40137 38287 44627 47183 60735 68631 64775 60547 53256 52251 43472 39211 32528 40188 34962
17461 34962 31454 31361 22454 17428 21589 17846 14119 14613 14673 22227 21951 16720 19292 22922 22725 24196
17445 24196 42018 54041 83910 122756 99400 54937 28729 11595 11539 7490 -1288 -11424 -10204
17432 -10204 -6964 -1896 -2108 -5618 -19238 -29550 -29929 -35243 -49986 -47413 -41129 -31691 -39709 -24552
17418 -24552 1595 28584 49791 46018 36575 29835 45932 56559 64241 54322 41565 28813 22524
17405 22524 30505 49164 51750 46998 47968 37160 28084 35868 34790 33098 35426 46143 46037 44076
17391 44076 33388 21910 20188 14253 13672 8513 9789 19503 16194 19914 30986 37297 37453 24363
17377 24363 5079 4228 18859 17725 15042 8380 11486 14816 20168 10235 8650 16004 10164 11144
17363 11144 12295 12558 10279 17140 37415 46966 43701 25229 11936 11213 22270 23032 14521 8596
17349 8596 8176 22495 22546 8249 7844 10109 5610 -3989 -8051 -4794 2851 -3226 -7664 -1301 -2667
17334 -2667 -12098 -25114 -33817 -24055 -5523 -420 -2679 -20207 -19815 -9780 -13428 -14270 -8869 -9846
17320 -9846 -17931 -24363 -24996 -19389 -20844 -19001 -11268 -3396 -5343 -1942 3958 -3532 -17787 -17688 -6941
17305 -6941 4269 12834 10010 14069 25504 37595 34624 31981 31170 37745 32442 6297 -5347 -7166
17291 -7166 -3286 -1615 13850 12560 12184 1931 -12662 -19947 -13507 -16304 -18234 -13944 -15645 -17342
17277 -17342 -11988 -831 3725 -796 622 -4422 -3585 -7271 -4788 -12245 -7813 -3808 -4867 3031
17263 3031 2894 7176 7500 -4515 -19825 -20394 -21093 -28075 -26901 -25128 -13139 -11528 -11602 -9517 -9540 -1863
17247 -1863 -555 2277 1543 -2571 -2396 -1316 -1652 -2348 -5560 -9927 -14575 -8296 1049 3538 3914 -11362
17231 -11362 -21017 -25904 -33125 -29910 -28594 -30893 -15346 -2587 -13705 -16488 -11469 -5609 3987 5510
17217 5510 9184 -1072 -16481 -6985 -6339 -12538 -8807 -4947 -4135 -6587 1568 4384 -685 -8337 -25851
17202 -25851 -32358 -36421 -30821 -24184 -23163 -16750 -12872 -3633 -2854 3140 2750 3022 9705 -568 -8776
17187 -8776 1446 -3022 -15490 -14874 -7829 -7945 -2010 231 6411 4941 -823 702 1983 16392
17173 16392 22720 20403 13037 10711 10097 16500 11384 4382 2499 -4094 -11119 -14301 -12507 9855
17159 9855 24947 20036 4665 -2808 1205 3437 1198 -1682 -8597 -4165 -13697 -12764 -12279 -19318 -25352
17144 -25352 -21804 -23910 -25511 -13048 -9874 -1415 6225 10401 3069 -6594 -16441 -11283 -11369 -6688 -4831
17129 -4831 -7658 -6055 6364 15762 12650 5813 4726 3322 -4163 6758 15562 13859 18188 12375
17115 12375 -3328 -16315 -14158 -20472 -18905 -15644 -7573 -5409 -2772 1107 3664 5905 10530 12117
17101 12117 5610 2069 2390 -8429 3154 13215 17153 3020 -16447 -9150 -19011 -25540 -21409
17088 -21409 -16218 -13070 -7418 -2558 4449 9315 -2561 -1543 682 3401 4622 285 -10077 -12147
17074 -12147 -7852 -3139 -4874 -17363 -8359 -4154 -377 -2196 -642 -3421 -16167 -32559 -24013 -12245
17060 -12245 -1002 11694 18807 18289 8615 7149 1662 -3228 -6983 -4227 1555 -3916 -1162 -778
17046 -778 -12704 -16136 -15722 -7423 -410 -3151 -9330 -11082 -14719 -6508 10049 382 -26180 -36188
17032 -36188 -30455 -21747 -21466 -13340 -13996 -19974 -16559 -2190 17154 22563 18657 16439 16192 12364 2810
17017 2810 5287 -4128 -15156 -23428 -21758 -20546 -16553 -13386 -11331 -7509 -10986 -5403 -7669 -16271
17003 -16271 -16503 -8352 -27 -5826 -28047 -43722 -47828 -38401 -18211 -13980 -14699 -12524 -3768 -948
16989 -948 -6540 -11104 -9181 26 5333 67 -324 -15676 -25675 -31828 -23135 -10578 -12724 -4318 3404
16974 3404 -4710 1368 -4387 -2686 -912 2683 5955 -3575 -3487 15442 24236 31903 27574 23923 25001
16959 25001 37811 49017 56316 84957 128338 185194 201808 198881 196526 228008 294074 352471
16947 352471 319433 252721 219263 215039 204640 172930 127279 86985 57740 21805 18629 24846
16935 24846 15383 13727 15477 15238 25566 34433 32262 24200 10497 6066 4871 -5856 -14077 -11833
16921 -11833 -15498 -18353 -8000 8843 12972 9455 1640 -3707 -5117 -7915 -10105 -12365 -11666 -16102
16907 -16102 -8843 -4388 4547 8534 8393 -2037 -8441 -6921 -7561 -15373 -13544 -21742 -21407 -14783 -4934
16892 -4934 7745 -850 -10999 -14192 -15079 -10607 -13778 -5352 -3214 2538 1551 -17583 -21907 -9030
16878 -9030 -14685 -15507 -16471 -4484 7515 12280 -6302 -5520 -8834 -2148 4240 6102 12601 10147 -2482
16863 -2482 -12611 -15341 -10762 -11129 -9763 -13396 -13327 -11697 -5118 -9448 -15447 -8065 -8038 -6367 -4317 5676
16847 5676 10265 16469 12511 10696 8939 15917 11101 1980 2602 13443 6026 4252 -9658 -19826
16833 -19826 -25924 -14213 -987 10435 14010 7135 -6596 -11603 -4636 315 -4686 -7307 -4215
16820 -4215 7771 -1235 2558 -3908 -4321 2583 -3187 5518 2393 -4134 -7759 -13117 -12168 -30457 -38091
16805 -38091 -33251 -21507 -7843 -6256 -16883 -22617 -19020 -3118 9588 3673 -9829 -15901 -20037
16792 -20037 -28490 -22936 -11054 -5544 4752 20785 20951 6594 696 2124 -4050 2615 11728 10532
16778 10532 1897 2350 9258 6410 -1341 -1199 -430 -710 5796 -4031 -10740 -20288 -20949 -13290 -6594 -13439
16762 -13439 -12859 -7359 -1110 -7454 -17822 -11957 3281 13706 13185 7627 5755 2958 -1010 1648
16748 1648 -2183 -11358 -12780 -13740 -22063 -15832 -18351 -21072 -25154 -19217 -9349 -20224 -27899 -19531 -29850
16733 -29850 -33257 -25246 -20398 -23505 -29761 -30422 -25210 -11211 -4179 7416 9799 4420 7232 15362
16719 15362 12629 -2093 -6019 7394 2550 -11042 -19808 -32907 -22672 -11952 -3422 7900 8714
16706 8714 -1951 -4673 -2695 -3031 -7893 -13675 -11969 -10036 758 -5491 -8298 -3053 -4337 -15374
16692 -15374 -17256 -21806 -16265 -5819 -5547 -3824 -11354 -13556 -11897 -2769 -10170 -19318 -18439 -17784 -20607
16677 -20607 -14049 -8104 -19580 -17111 -17408 -5604 4417 249 -12867 -19393 -12592 -3679 6685
16664 6685 5450 -1380 -12678 -10635 -6797 -9269 -6122 -12783 -8467 -6170 -13264 -10228 -6273 -17899
16650 -17899 -6175 -5248 -5053 -2250 -7033 -12936 -12657 -6658 -9037 -15940 -20911 -8686 17024 13692
16636 13692 448 932 -13853 -15327 -16302 -9549 1667 -7 -8240 -14292 -6838 -13973 -8615 636
16622 636 5676 4674 -4120 -466 7224 11949 -527 -4603 -10194 -16442 -8107 -2190 -11936 -18812 -19316
16607 -19316 -16522 -5746 -13878 -19608 -16538 -18092 -22905 -15892 -26734 -22693 -7840 -1456 -5933 1139
16593 1139 5996 4188 2971 9680 7434 8571 6940 14179 15841 17619 2420 -10167 -7870 -2357
16579 -2357 4345 -4681 -3933 -8493 -8720 -7407 -1361 10730 6815 6043 -7403 -6981 9535 15045 3369
16564 3369 4082 4123 5756 8226 5873 -1073 -3181 -4637 -238 2133 7826 6237 8608 4363 -9950
16549 -9950 -14603 -14011 -17219 -18203 -18987 -18735 -13695 -16971 -9281 3788 18361 19679 17947 15292 19494
16534 19494 17632 6107 1623 8476 5433 -4921 -1074 -1093 1916 7329 14842 8890 -3701 -130
16520 -130 -7534 -4473 927 -2534 3924 629 -9897 -12004 -9988 -18785 -22849 -19306 -17105 -11713 -13022
16505 -13022 -10603 2514 9848 10946 17067 16123 6639 164 -7980 -12624 1711 21467 24248 17180
16491 17180 10607 4638 1107 -331 5620 -196 -2456 66 2010 -4079 -4660 -4692 -17061 -9660 4912
16476 4912 -7427 -10407 4187 3656 7828 14972 14600 3790 -8620 -7883 -9663 -15272 -13467 3928
16462 3928 11180 4060 -4825 -2675 -2327 -6292 218 -2613 -2177 -3486 1712 4317 -3724 -15736 -26623
16447 -26623 -24347 -4316 -1910 -1064 -2554 -5651 85 10718 7095 7381 12197 4641 -1819 6234
16433 6234 13078 3017 -10276 -13097 -5224 7035 7145 10254 8234 8948 7356 4487 14898 -1281
16419 -1281 -8463 -9586 -2438 -1268 -18415 -25320 -15920 -7280 -10466 -25016 -25847 -23810 -12354 -3502
16405 -3502 5564 5068 11919 11191 3654 6478 682 -7432 -8141 -17786 -17766 -8097 -4008 -14390 -34325
16390 -34325 -18893 3461 6774 4064 1419 3670 1845 -7856 -14903 -10830 474 1784 -12511
16377 -12511 -23891 -12106 -7330 -10448 -5174 6157 9119 7851 249 -11598 -15180 -3157 -3241 -3592
16363 -3592 -3405 -184 4783 4917 6274 -4553 -10807 -19817 -26321 -15446 -15891 -27516 -23528 -15746 -6904
16348 -6904 -8091 -12930 -4292 -9002 -11382 4057 12014 14296 14111 8274 3787 4423 4910 -1697 6687
16333 6687 4955 -3478 1552 9876 296 3500 2661 -5028 -10897 -14106 -12828 -5870 -13730 -11465 -15551
16318 -15551 -21276 -16616 -12087 -1801 7275 5839 404 -13569 -11801 -12630 -14456 -21058 -19799 -21269
16304 -21269 -16081 -11903 -17164 -4332 -6206 -2443 -7506 -14735 -15731 -22577 -18898 -14074 5815 11825
16290 11825 18899 8218 -7503 -19098 -22936 -23886 -9592 4193 2730 -3321 -7867 -10583 -15287
16277 -15287 -24582 -27416 -32877 -34232 -31295 -21131 -18815 -19223 -20411 -26524 -22054 -12543 -11465 -22494
16263 -22494 -25385 -18924 -9228 -20766 -21285 -9995 1330 8158 5219 7615 3976 -4549 -4903 -5547
16249 -5547 -14312 -11807 -8656 -4023 -919 -6902 -9287 -16479 -18484 -14527 -22516 -22426 -19165 -16109 -22104
16234 -22104 -16776 -6129 -7260 3807 13198 -1655 -7600 -11030 -8091 -17658 -6963 5006 1964
16221 1964 1394 2460 -3335 -9879 -17142 -29109 -14442 -30 -7750 -16979 -11861 -5399 -10649 -14661
16207 -14661 -8823 -4006 -11003 -19472 -24665 -25536 -28963 -22569 -8554 -8769 -5329 -15298 -23811 -25696 -33161
16192 -33161 -27961 -16333 -8259 -7557 -7079 -8143 -2857 -2109 5268 5795 12508 15201 10378 4011 9134
16177 9134 9599 10146 -1764 -14064 -13644 -4661 -11646 -9621 -3405 -7167 -5555 -5819 -22324 -22825 -11090
16162 -11090 -459 2010 4077 7051 5280 12027 19455 9637 1685 6406 5331 9001 10998 5785
16148 5785 -7832 -14120 -9235 -19826 -21984 -13871 -8411 5114 14989 18077 21228 24858 18607 12621
16134 12621 9070 3133 4065 -4649 -6907 -6134 -16803 -22691 -21786 -2448 4740 -14007 -19217 -13696
16120 -13696 -16768 -14155 -3099 -3728 -11620 -11987 -2940 -6283 -8885 -6942 -10761 -18991 -13553 3527
16106 3527 13354 6284 -2022 725 7868 10060 -3864 -366 10383 1483 -14531 -25336 -25577 -11834
16092 -11834 -11533 -12260 -3992 -2277 -6184 -5428 -1679 -4477 7101 11556 4224 6297 8123 11180 6405
16077 6405 8460 14672 7411 1349 4274 2017 -3310 -8785 1685 4392 -1918 14070 24448 21202
16063 21202 15978 14449 14826 5652 6639 3264 -24 -6937 -5018 -12213 -24809 -24492 -17487 -5711 762
16048 762 679 -1945 -1220 -3248 -9539 -4378 6143 5095 -4142 -5027 -15321 -19197 -22134 -16749 1419
16033 1419 9905 20392 10825 6455 6424 12481 14510 8631 14650 909 -24305 -34206 -24440 -15103
16019 -15103 -14029 -8691 5246 4723 -4603 23 5166 10710 1417 3361 4608 3951 10839 20452 13206
16004 13206 2518 -1352 -548 -6528 -5776 -4996 -1591 5252 12472 10103 4626 -2944 2256 12471 9560
15989 9560 12547 12320 23729 23792 21241 7495 -5121 -13209 -12477 -4703 8141 3839 -2193 -12523
15975 -12523 -9046 4512 2769 4429 -6012 -10135 -12203 -9808 -10333 -12641 -22364 -19084 -1301 -2198
15961 -2198 8521 18277 9212 -5183 -16204 -6825 -2553 1377 5457 3328 -1976 -5756 -14511 -19132
15947 -19132 -25441 -26523 -29293 -30509 -29333 -34595 -27109 -22811 -29134 -28176 -12135 -4900 -11317 -4947
15933 -4947 6808 7581 9921 13378 5879 -332 7753 11104 17058 10310 5526 -3395 252 1759 7864
15918 7864 3261 2863 1844 -11939 -15333 -13043 -16055 -8574 -8769 -1835 -9749 -4882 2829 -4629 -9909
15903 -9909 3192 13175 17468 16625 913 -2029 7404 3905 -4434 -3868 7521 18546 18202 6585
15889 6585 6733 7226 8389 7414 5268 -4076 -9389 -9562 -1254 4186 -575 -6046 4361 5237 3671 1141
15873 1141 -2011 -5739 -14597 -12671 -19073 -10757 -1279 1027 2784 -12361 -19763 -9773 656 -7733
15859 -7733 -9224 2110 4845 542 12280 18610 21295 16348 13027 7097 6727 4183 -6537 -19074
15845 -19074 -22561 -13167 1323 11082 12274 10999 -4733 -4640 10981 15764 5278 4059 3755 -4396
15831 -4396 -805 -2025 -14188 -18093 -6240 658 -6219 -10288 -12715 -20196 -16993 -19606 -17917 -13609
15817 -13609 -15516 -23065 -21936 -12220 2228 -1322 -2832 1315 1006 1221 255 -3686 11061 21448
15803 21448 13005 8352 6056 -5347 -15643 -17955 -17216 -5141 2105 6131 9567 -84 -3805 -15966
15789 -15966 -28161 -27303 -19595 -9516 -7887 2810 12986 7548 -406 4378 8691 5540 3820 -4456
15775 -4456 5106 11339 7488 5202 2534 5106 14770 10318 4085 -2545 -4719 -7722 -10941 -10811 -2084
15760 -2084 -5293 -11163 2155 3909 -5151 -20287 -22044 -17347 -5851 -2944 -11381 -16118 -15921 -25798
15746 -25798 -24906 -25462 -26527 -31086 -21804 -13367 -19097 -9165 3733 7381 11716 16774 10227 5007 4334
15731 4334 2557 -11427 -13153 -2433 -7 -21193 -27962 -24550 -19009 -6301 -13276 -10197 -6314 -11494
15717 -11494 -10693 -12040 -7621 -3470 -6582 -11759 -14253 -13408 -10762 -13201 -15863 -9067 -3963 -7060 -10512
15702 -10512 -851 9080 19865 23596 9153 -3517 622 4576 -402 -6246 1682 5800 3810 5004
15688 5004 9590 9768 3483 5361 12319 14894 -313 -14827 -6672 8395 -572 -8818 -17585 -28063
15674 -28063 -29931 -14535 -12785 -4195 8527 11267 2955 -6889 -14143 -15322 -11189 -13164 -5548 -8959
15660 -8959 -19799 -23288 -21254 -7281 -8055 -19565 -28978 -27421 -19484 -19130 -10348 -4101 -4879 -3167 -2993
15645 -2993 -3825 9343 20987 30593 29259 18089 10426 4065 165 1743 7654 11853 12462 8036
15631 8036 -5238 -16871 -19109 -10679 -9754 668 12504 19931 24557 30002 21402 17253 17890 3586
15617 3586 -17135 -22566 -28752 -26428 -21930 -11990 1174 -3950 -17260 -10654 -33 5638 -11020
15604 -11020 -17979 -23206 -20362 -5732 -2088 -1665 -2702 -7298 -8846 -781 10201 11218 4816 -1661
15590 -1661 -3714 -7979 -10717 -15049 -27456 -40815 -36857 -43373 -34673 -20854 -12465 -3716 -368 -1468
15576 -1468 -6983 -3103 -776 319 -11708 -14264 -3847 463 -6391 -12048 2101 3792 -3939 -13953
15562 -13953 -20085 -18351 -12677 -6110 -13751 -9246 2434 8660 8290 11974 19203 13532 11974 8951
15548 8951 1435 -15437 -21401 -16652 -11247 -6090 -3638 -2207 5689 17511 -3900 -17172 -11849 -6192
15534 -6192 3620 13794 17988 6581 -9460 -3388 19304 19708 13657 16404 11481 6681 5429 9236
15520 9236 11389 1565 -4621 -4746 1994 4156 9221 501 3820 -335 -3325 -3068 -3973 -6247 -12630
15505 -12630 -3762 -4278 -15621 -15228 -11301 -1582 -1137 3403 4905 4414 -1398 -16849 -31988 -23695 -4027
15490 -4027 1508 7550 16104 30790 37857 27885 24256 11419 556 -8970 -526 2512 -6943 -7370
15476 -7370 195 -97 -4506 -1379 -6480 -23104 -16854 -22461 -21214 -19981 -20821 -17782 -6989 -6833 -6947
15461 -6947 -11699 -13218 -2283 -1182 -430 1019 3725 17392 14815 6494 8096 1049 1622 -5058 -7035
15446 -7035 -6339 558 11910 15114 4409 5532 -5843 -18147 -13876 364 9591 12759 10144 -83
15432 -83 -11687 4545 16833 12853 -6619 -12158 -21715 -18328 -14305 -21709 -17746 -5230 4929 12442
15418 12442 7842 2595 8218 5124 4240 1637 5278 3219 -2254 -3375 -8560 -22933 -15182 -3240
15404 -3240 -7904 -23185 -35547 -27563 -6251 -3660 -165 -350 -6625 -6250 2236 4117 2249 1493 5282
15389 5282 10256 17709 23496 26543 14532 -2869 -8599 -1206 4372 12667 15033 -6007 -26825 -22006
15375 -22006 -14286 -14157 -7398 -3954 -7735 -4092 -5184 -12733 -17074 -18415 -29342 -16602 -1021 1103
15361 1103 -12837 -12718 -8810 -1950 -7517 -9228 4241 5842 -256 2781 11479 7312 5330 -3210
15347 -3210 -16259 -10511 -711 6472 7181 7336 2826 -11252 -24092 -25417 -17630 -1127 8776 6128
15333 6128 3736 -4001 -4078 -2101 3934 15867 9545 822 3250 11085 16241 12713 22651 16423 108
15318 108 -10122 -11877 -7509 2179 -4683 -9455 -4237 -2464 -2924 2460 804 -114 167 1656 587
15303 587 -4116 -6062 -1111 -604 -7467 -3651 2090 -14549 -15410 -11998 -12345 -3467 -7485 -24050 -19278
15288 -19278 -14340 -7620 -6246 -2181 1771 17868 10963 13807 2744 -2196 -9210 -14028 -8117 7934
15274 7934 12942 10407 -4928 -14882 -14988 -16323 -15178 -6299 -10825 -7801 -6428 -7983 -18931 -15101
15260 -15101 -4730 -7513 -15031 -15456 -9813 -2059 10339 7682 2005 -4717 -160 -11696 -16032 17
15246 17 4343 4962 1150 5107 9231 16951 14167 7063 2909 7924 723 3471 14880 12347 13925
15231 13925 -726 -1983 14526 16240 12108 6195 -1930 -1542 -12176 -17858 -3045 -941 5722 1851
15217 1851 -5164 -1189 11003 10426 -96 -4894 1079 6085 -2646 -10440 -10748 -12692 -22136 -21088 -6295
15202 -6295 -3897 -9785 -14043 -13102 -9099 -169 11730 21060 19802 15039 16537 14790 12399 5879 5727
15187 5727 16626 17768 10313 -1948 -14 -2513 -20668 -23082 -15797 -5290 194 4293 -6048
15174 -6048 -17330 1853 14831 24309 16509 -4722 -9905 -11956 -18560 -10006 665 12724 9899
15161 9899 1271 -3083 -5417 339 3967 -6527 -8703 -890 -2528 123 -4861 -2547 -10247 -4204
15147 -4204 -195 -9851 -19335 -10506 -8399 5546 -3429 -11224 -6716 2203 1961 2928 10840 11209 752
15132 752 -9583 -7077 -1746 8299 16676 12771 3960 -4870 -4869 -6580 -3532 2293 -7288 -11138 -12467
15117 -12467 -13850 -7177 2929 -11578 -22355 -26562 -16995 -10331 -13390 -26782 -33640 -34140 -31608 -21524
15103 -21524 -11977 -7377 -2955 -4542 849 -4350 -9203 -15927 -17721 -12695 4495 12427 1424 -4989
15089 -4989 735 -6016 -12435 -14119 -14825 -7558 -3738 -9876 -2254 3355 -1014 -10653 -9525 -10668 -13742
15074 -13742 -9642 -4290 -2111 -8000 -2743 10907 13352 8016 1878 -8532 -9317 -3076 -5119 -3684
15060 -3684 -9237 -19943 -12854 -4786 6192 8871 6188 7426 5846 2356 6791 18816 22048 19876
15046 19876 18513 13062 11408 8652 16322 16759 8078 1811 1164 6602 7874 6644 5151 8247 -1608
15031 -1608 -8357 -7195 -18615 -28699 -20019 -655 -4488 -14993 -3051 6550 6718 -364 -8838 -9359
15017 -9359 -6547 2978 6807 3367 -4307 -12361 -8720 -2972 4757 6237 3203 -4974 578 6360 5600
15002 5600 1872 3332 -5075 4431 -7232 -15144 -3855 -2533 -15710 -20615 -7853 -8168 -7238 -4900
14988 -4900 1024 11772 16971 10937 10302 13559 980 -13310 -20495 -20423 -23071 -15235 -7423 -10879 -2593
14973 -2593 1747 10664 10665 5479 2261 -14547 -13599 -15409 -14262 4436 7128 5804 7184 6613 6337 6576
14957 6576 10267 5299 -5420 -14641 -13911 -7257 -2495 -7401 -7035 -1769 7767 12907 6000 5127 7706
14942 7706 -864 1223 1115 -5265 -7908 2168 21284 16107 472 -8637 -9441 -11512 -6168 -4839
14928 -4839 -8428 2296 7377 -7404 -14008 -7045 5542 16090 29508 24709 10826 21976 26341
14915 26341 21295 8293 2454 -2602 893 1241 -7861 -7225 -10231 -12512 -13408 -6807 -6541 586 6424
14900 6424 15326 16523 11061 1639 -690 -6738 -14192 -19323 -11068 -2107 3683 6623 3785 2376 -10321
14885 -10321 -10917 -11937 -4449 -5533 3167 411 -6195 -5196 2949 7512 4198 -1752 -8440 -12407 -5390
14870 -5390 -1146 -8792 -11792 -2487 440 -4758 -10912 -16452 -16966 -19347 -25040 -4971 -1133 -11309
14856 -11309 -25703 -20280 -10849 -1216 -5205 -9869 -8412 -4180 3000 12659 19204 18102 -420 -15451
14842 -15451 -14449 -14430 -18244 -12826 -21536 -20779 -14918 4595 19826 20209 7453 -6773 1344 5326
14828 5326 9611 11263 4276 1115 -8114 -4269 3473 1445 3958 3519 -8985 -14342 -8460 5645
14814 5645 10867 8799 4487 16105 20579 23934 17589 13013 4345 8838 20201 19792 13322 4852
14800 4852 8626 8470 13203 16200 16648 5914 -6562 -11371 -4976 3158 4137 1016 12417 16462 16044
14785 16044 18673 647 -16269 -13641 -11026 -7578 -5353 -8924 -14612 -22599 -10246 -2475 3278 -7784
14771 -7784 -5165 5012 11523 9599 3634 4381 -57 9801 14798 19879 16463 6681 -2564 -25021
14757 -25021 -32819 -21246 -24444 -22731 -14464 -13752 -8031 -8395 -6893 669 3307 -4724 -9023 -4427 -3145
14742 -3145 -626 -1979 5427 3736 -11066 -7166 2025 6387 11246 16345 6879 3854 11419 22520
14728 22520 22442 17737 15469 23566 22721 17614 14247 10957 13992 18297 6482 -5004 -4946 -6327 -10346
14713 -10346 -4193 -8293 1816 -2947 715 48 -1251 862 -982 12127 4789 -1888 2295 -439
14699 -439 12718 8644 8284 5318 1449 -3245 3526 866 -1071 -7512 -13633 -15009 -17470 -2679 1176
14684 1176 -482 2280 8781 -8816 -14682 -5399 -1513 2732 -6016 -6837 -11113 -20000 -11880 -4250 6451
14669 6451 3860 4126 -1832 -1147 -495 -7275 -6274 -3299 3658 -2682 -3349 -7373 -7093 -6144 -871 6894
14653 6894 5495 16509 20788 9805 12975 19858 13460 4282 561 4484 9784 3804 1281 677
14639 677 2598 11415 10612 12793 9050 6613 -4123 -3224 10730 3175 -9830 -2012 8953 15620
14625 15620 20358 8456 -2907 -2764 -6408 -9036 -8628 -4014 -3749 -2877 -5807 -3903 -5212 -10258 -5892
14610 -5892 2179 10443 7769 11134 4903 7279 9246 2185 -3525 -7685 -11254 -6270 14950 9393
14596 9393 555 1315 3615 -10934 -13081 -9334 -20724 -22921 -7195 -13389 -7768 9978 13123 3834
14582 3834 1714 8109 5401 3957 11752 730 -4251 -5792 -7872 1279 -1757 -3456 -540 776
14568 776 1298 -6363 106 13906 15460 13696 17166 17613 7707 -7191 -12430 -18538 -10912 -9293 -254
14553 -254 4849 2463 -4314 -13218 -13502 -8473 -5072 -8956 -10413 -8285 9111 8598 12352 19691 3025
14538 3025 -7132 -3731 5599 15271 15190 6944 -1739 -6354 -7254 -9790 -655 7710 7166 -5722 -3064
14523 -3064 13450 2225 5775 13207 20043 12408 -11756 -4332 4016 4857 6121 4690 -4874 -13339
14509 -13339 -513 -338 3649 5332 -2384 2904 6960 17976 17649 7520 -7340 -8720 -3814 9435
14495 9435 5963 11287 11370 14016 10641 -597 -6216 -5065 -3404 -14468 -16303 -2979 1996 -11026
14481 -11026 -20970 -21429 -15370 -8579 -22560 -14873 -3032 4072 24112 22538 2943 -8022 -14596
14468 -14596 -13676 -12173 -9973 -7872 -130 13537 27082 22029 19520 19025 13329 -286 -4719 -1624
14454 -1624 680 -8042 -413 -6252 -12591 -12793 -15633 -17287 -15470 8032 6487 -913 603 7701 10277
14439 10277 8706 13025 24547 33626 28687 27057 21800 16856 14066 24244 21091 12921 17304 13981
14425 13981 -13414 -26637 -3267 5131 1482 -1805 -296 3310 -8825 -4808 4673 -1164 -5258
14412 -5258 471 6931 7105 4253 -2898 -5682 -5627 -11164 -27146 -23842 -248 10309 14100 19590 8141
14397 8141 -4739 -1812 -3747 -10729 -4439 -4400 -14928 -20556 -30190 -27242 -19391 -16533 -2766 3682
14383 3682 12685 15519 12461 20313 17996 18951 15718 13650 4283 5565 59 3786 5305 4005 4121
14368 4121 9973 11286 2023 -7939 -3806 4683 19014 36106 42043 30289 26006 29645 37100 47943
14354 47943 52342 49957 42888 36437 18984 14911 13230 17654 12484 15858 22936 15625 6630 18464
14340 18464 11653 15381 18769 14462 9316 7127 7795 12072 16500 13045 11065 1103 -235 -1124 2250
14325 2250 -114 -4990 2478 10398 9737 4903 9534 16236 31291 33048 21066 13464 11085 -5790
14311 -5790 -17787 -4708 -893 723 12598 3593 1405 -10900 -20282 -20864 -13807 -12168 -8208 -7635
14297 -7635 558 -773 -4415 -10631 -2306 1819 -3676 -5086 1529 2045 -6942 -12775 3722 17732
14283 17732 23865 7470 -4646 2004 13190 6195 242 668 4392 -4741 -16016 -21059 -20270 -5911
14269 -5911 10367 21441 19983 12718 11521 4295 -475 854 2982 8983 9824 7158 1216 9692
14255 9692 12861 18110 12410 7899 2453 5828 1656 -590 3503 -1803 -22379 -27408 -25908 -12055
14241 -12055 -8578 -5799 1891 -161 -7190 -5744 -161 -16237 -15128 -9256 -3436 -13987 -20416 -20173
14227 -20173 -1218 2036 -909 -1893 7492 13692 11493 11652 17174 19652 12913 15544 10394 11867 13129
14212 13129 13833 13271 5877 2896 6490 1785 -5694 -906 8605 16177 17441 7068 -7463 -13091
14198 -13091 5479 9503 6434 4462 3598 1569 -4688 -1468 -3090 491 -9414 4332 4868 2479
14184 2479 -14810 -23218 -17385 -6367 6244 773 -2465 -3308 11303 14811 17985 15365 7694 8175
14170 8175 -611 6916 18812 25524 12337 10627 4404 5809 3196 2576 117 2731 394 -14141
14156 -14141 -16206 -5542 -20697 -24865 -22101 -7800 -2249 -9646 -15027 -6537 -55 7907 15701 19479
14142 19479 14198 14599 16998 14088 4177 -75 7452 15987 12926 11406 3243 2887 -2389 9394 12138
14127 12138 -5251 -12241 775 9081 1757 -13541 -25156 -16753 -9633 -7393 -11830 -8772 2552
14114 2552 5346 728 3569 6673 6482 -4418 -653 -4135 -13176 -16711 -12004 -7255 -6902 -18593 -14105
14099 -14105 2585 6826 2563 -2152 -1869 6031 -1827 -10020 -9753 2953 14602 23487 16303 3368
14085 3368 -2138 -9096 -4377 -7255 2956 11658 15041 4336 3810 12664 21354 24274 30201 51781
14071 51781 88993 136204 192486 228986 216244 187596 168994 181319 209059 241745 223919 167998
14059 167998 126376 90426 67530 56508 35203 12917 13098 8518 12314 10544 -6804 -10576 3405
14046 3405 14381 20005 12248 -9006 -15379 -6044 -766 10226 10015 -7191 1853 14007 17570 17315
14032 17315 21623 24094 14285 4516 6928 -3042 -2602 8309 20116 13775 8514 5538 122 -5014
14018 -5014 -10017 -7889 -5776 -8124 -3277 3503 2143 10213 10312 13056 11922 2161 2989 13917 23314
14003 23314 22558 15004 6673 3704 3183 2858 1366 -1694 -11044 -7929 -836 2477 12014 4618 -932
13988 -932 6100 11361 -4100 -12736 -9933 -5351 5583 7833 11531 21242 18426 5839 10630 8013
13974 8013 2831 -7058 -3997 5158 5920 -11062 -5734 -9026 -12195 -5080 155 -14477 912 15973
13960 15973 13843 9764 2185 -2500 -7350 -13592 -11508 -131 2198 -301 1374 -549 -5966 -10854
13946 -10854 1140 10576 10856 14021 7549 -3214 -11282 -6983 -511 -320 -13770 -16156 -12521 -9534
13932 -9534 -9115 1385 13898 9796 7566 7850 9863 3902 -9330 -10881 2138 12961 7035 -4908
13918 -4908 405 10056 3013 -3633 -71 -11140 -20981 -28655 -26703 -4196 -3338 -9395 -10274 -2674 13654
13903 13654 15279 13167 14192 3787 227 8266 9947 5092 4273 12652 13998 11975 13933 22601
13889 22601 18087 14759 10654 1727 7137 10468 7088 -2213 7526 10683 4389 7625 18471 19430
13875 19430 14342 12026 8156 6759 1813 154 -667 2725 1815 6426 6522 4721 -170 -1615 -1847 7070
13859 7070 7764 3294 2307 -5643 -4100 4896 3606 12291 14925 14539 4161 17384 16569 13061 11837
13844 11837 16710 20065 17569 18623 18452 17329 22321 29493 25401 10406 15490 24463 17791 7705
13830 7705 9601 10428 3687 2757 9063 2737 -4440 -4955 -2148 -5076 305 9483 5072 -10888 -11706
13815 -11706 -15546 -13462 -6926 -8980 -14645 -4289 2945 -2954 366 4945 20380 23226 904 -1429
13801 -1429 4365 7934 19818 5915 -5412 4872 16317 15396 -1157 -6367 -5096 -15737 -11463
13788 -11463 -1573 916 -10698 -6259 -13172 -17570 -14291 -1942 10956 12466 13378 9623 5746 9228
13774 9228 10581 5448 2972 -4437 -1234 54 -570 461 4329 -1316 -1884 -17733 -18547 347 7991
13759 7991 5284 -253 1965 14681 23003 21228 9257 8769 7944 3071 3101 16568 26395 28987 17024
13744 17024 14394 7873 8634 2227 6983 8001 8999 10214 19666 26042 30443 20296 2030 5268
13730 5268 15670 20764 18218 11869 7430 4479 1618 -9636 -10741 -2834 9320 7425 -4105 -1567
13716 -1567 -3956 1630 20835 19254 1816 5038 8223 21423 20186 9116 4258 -3025 -2728 864
13702 864 -12338 -19561 -8227 -1163 5657 4386 8145 11954 12260 19861 15557 15159 18018 16967 7134
13687 7134 14582 5710 -9375 -10473 2974 24584 29335 24819 9511 7013 6712 -3214 4033 19989
13673 19989 17111 -2172 -4925 -4970 -2077 13368 25649 27541 17490 14562 13862 13288 18538 20847
13659 20847 24365 15038 6145 12136 22502 22548 20619 25695 22478 12389 17492 24953 22541 8630
13645 8630 -1075 4933 -2605 -129 11831 19407 18808 6732 6877 9743 17390 17425 16132 13604 4733
13630 4733 252 -3638 -5076 -5428 -2631 -2821 -8114 -5616 -2516 -4736 494 4139 9574 2427 11051
13615 11051 12840 14476 1328 4131 17146 18003 26565 25190 15620 1883 -21037 -20084 -2232 6877
13601 6877 4785 -9715 -14429 -14151 -7033 -5871 -4304 1367 3379 4997 14817 20324 27409 19216 11385
13586 11385 7092 10964 15487 9203 4240 14470 17094 26071 25037 19640 15459 8080 14277 21187
13572 21187 41466 37038 32411 21985 23182 14728 10664 13745 3180 -8588 -8845 -248 8865 5410
13558 5410 13322 17589 10975 14925 14815 17079 14286 17950 21760 10215 7032 -1491 -21166 -28434
13544 -28434 -31328 -15686 9093 19838 18345 15118 967 -2251 -2214 4073 8960 3747 -3050 427
13530 427 -4919 -27801 -20227 -9743 -21752 -26571 -16485 -2870 -2836 3528 15387 14049 17984 18855
13516 18855 11937 6326 -5833 -11929 -5521 204 1597 7643 19231 20517 17515 12897 7912 6035
13502 6035 8199 4970 1871 -3499 3324 10008 14967 16592 15567 18120 17405 9644 2975 -11644 -14548
13487 -14548 -12648 -5593 1103 10238 11843 21904 23820 32103 20399 5644 -2744 -1072 5458 12411
13473 12411 11124 13884 18155 26115 25860 25154 9204 9102 10299 12338 17065 13048 8797 5490 -3835
13458 -3835 -3071 -1894 -3290 -645 1563 -3938 1324 12154 7493 -1119 -2557 9907 10362 4342 5913
13443 5913 -1492 -9280 -2026 5131 2023 -284 -3360 -15449 -17986 -14103 -9772 4731 10918 8584
13429 8584 6372 3684 11251 10753 10747 11797 -2633 -11280 -6338 4478 8756 835 12136 20768 14241
13414 14241 12914 6031 8203 83 -6452 235 12733 15621 10701 7936 9915 -837 -9439 -11291
13400 -11291 -7704 7014 7411 6150 7936 14965 19343 18905 4756 9189 19855 19758 28049 41872
13386 41872 27652 1077 -7125 -10233 -7452 -10308 -10071 -8683 -6180 -4470 -6041 2845 6014 13509
13372 13509 13372 7417 7294 17281 17935 6917 -6858 -9477 -4575 2674 9879 6345 5695 16073 9480
13357 9480 7392 17425 21631 10874 14229 17923 7436 15324 22938 16825 17573 21441 16793 17093
13343 17093 20918 18608 16890 23331 23543 14052 2878 11269 14154 4995 176 9481 11257 3000
13329 3000 -4774 -3335 7241 13232 12838 7352 14509 10469 -1685 2903 9479 1418 -121 3450
13315 3450 5702 -288 -7727 -8352 -2411 -4002 5254 12803 220 1097 6754 1977 -12119 -8109 -4178
13300 -4178 -8478 2480 1079 -8327 -8070 -6785 -2652 5725 18546 23970 17852 17907 4618 6612 11190
13285 11190 2713 1420 -3977 -13924 -6717 3847 18861 19493 22189 30889 42150 41497 33750 16045
13271 16045 15603 14558 22652 27648 20987 6236 8611 15820 13172 24841 28346 18711 18024 20437
13257 20437 5639 -7562 -270 822 16746 22154 12639 25589 35346 31163 29180 22388 6543
13244 6543 227 16820 18787 15397 19668 23631 16310 16853 19451 13368 16556 5707 4216 5333
13230 5333 4748 4627 5982 5034 7793 13424 -720 -4247 -1625 12103 20102 24769 25428 18057 8035
13215 8035 11702 20230 28875 39787 46206 40332 29976 15673 23711 36860 24156 10410 9061
13202 9061 8772 15668 17359 22436 26237 23405 24174 19161 15003 20537 23848 20198 14529 14576 9518 9705
13186 9705 13815 17123 39687 34866 24769 33777 36152 28086 18437 8191 6980 7969 10103 15858
13172 15858 28594 30943 22668 19098 17172 4606 2800 12005 20606 21850 25300 23477 19234 17463
13158 17463 23531 12779 7704 15936 27371 28621 20865 10809 -1923 4430 19770 24197 25696
13145 25696 28281 35055 34869 40250 41796 49911 42103 35075 32438 29843 27286 26241 23635 30512 25612
13130 25612 20310 19966 16710 12601 14788 17649 21833 24327 24427 28259 16446 12457 17375 18297 15014
13115 15014 8064 9784 12037 16002 14072 18093 10468 5338 13967 22810 25171 36566 44204 45474
13101 45474 34752 27462 23948 21973 16841 24304 41006 28769 13108 3113 9751 5447 10450
13088 10450 22771 27119 24544 32079 35532 28113 27303 27564 26625 33691 43816 39785 43745 42710 45189
13073 45189 46934 57474 78586 87210 73922 72342 97011 117582 145389 168984 222901 301464
13061 301464 419191 536914 601184 602013 571359 579096 623238 637725 572751 459429 340810
13050 340810 245868 180800 146813 119937 112134 103397 102255 94647 87471 86884 79255 58908 56980
13037 56980 51070 49694 47276 44571 34509 36158 39634 39910 44091 42764 43824 36767 36277 42342 39693
13022 39693 29679 15593 1776 -3958 -8630 -10640 3159 5500 -7433 -14387 3452 31168 35360
13009 35360 41152 39243 45953 45265 41828 41215 37031 20892 10402 14354 12862 13414 16639 7605 7462
12994 7462 7598 6498 3198 -6011 8294 23553 31025 26318 18976 29610 30217 21439 -809 11662
12980 11662 19924 14711 16833 25470 19253 15700 23509 37976 36682 32740 34228 28987 17456 29637
12966 29637 37121 19652 13506 5515 124 4942 13192 17240 19549 27730 36677 34211 36136 34048
12952 34048 31375 17071 7297 13629 24922 28061 24909 16614 13534 21730 21883 36514 34170 23642
12938 23642 25513 26074 11385 5261 10762 25056 10725 10435 16080 24944 39964 32844 25229 30711
12924 30711 40476 44556 38502 29097 29660 22846 14633 7052 8076 26000 25013 24830 23306 27154 23454
12909 23454 18751 16183 18054 24125 40860 46471 46343 54166 63003 52372 43098 38301 41589 43518
12895 43518 45537 51415 51898 72050 81249 100347 111247 112710 100744 95560 113885 131260 119155
12882 119155 108115 94726 66262 45333 38380 38641 30408 35687 54308 61495 55155 48596 44899
12869 44899 42089 48806 55984 51870 44411 33059 30656 25415 33505 53351 61474 52903 38926 30944
12855 30944 27214 24422 26574 28906 28896 20730 15289 20254 28570 39352 36846 36287 35489 34801 33031
12840 33031 22888 22208 33093 45826 54213 58059 47746 46049 56092 66914 58767 50157 53910
12827 53910 64781 55543 31644 24434 21380 22717 27161 23017 34230 38920 40138 49099 58566 61608
12813 61608 62351 62995 56605 50162 45579 50110 58618 60841 66697 52937 33679 30468 30308 34944 29224
12798 29224 23949 18005 33575 50601 52448 55628 58778 53839 49659 50233 50742 50895 54517 54570 47810
12783 47810 48935 36812 28688 33898 26645 26736 18123 18300 13771 15880 16054 18779 13959 3274 -7653
12768 -7653 -14581 -8338 -19575 -20388 15512 66685 117370 166565 196139 215130 229787 256852 304604
12755 304604 337060 338099 305106 263780 237933 229475 214107 201616 194432 202053 201916 194805 192382
12742 192382 201385 200402 187268 188249 197251 195470 184240 177162 178726 190118 191441 187293 180536 170187
12728 170187 155788 160645 171644 188730 190065 200911 208035 218706 222037 214930 214057 200635 193841
12715 193841 187008 192939 196553 199420 202083 204004 206292 218769 247465 260764 264593 265622 274557
12702 274557 279374 284824 286232 308605 330577 341716 342766 336378 338903 357253 359540 369793 376584
12689 376584 382539 384069 397383 420783 440419 449948 448137 461366 478339 509077 544286 571020
12677 571020 588049 615432 646099 676474 695924 720361 746236 772739 810185 859560 913690
12666 913690 965167 1004487 1057432 1117782 1199658 1285690 1398724 1498924 1622067 1783079 1980744
12655 1980744 2229489 2557057 2977622 3520224 4142436 4780005 5392782 5996513 6671233
12646 6671233 7528112 8618875 10032127 11883635 14475850 18464019 25007092 36026056
12638 36026056 53870322 78581251 102795170 114004972 109419606 101145522 101772242 111075357
12630 111075357 115877442 104620621 81045081 57055730 39405862 28221370 21374324
12623 21374324 17053726 14103295 11905091 10227353 8988747 8068859 7307160 6578457
12615 6578457 5841954 5178303 4591739 4028372 3488775 3017857 2655181 2368330 2138400
12606 2138400 1941765 1763422 1599987 1470087 1357959 1252460 1156103 1063873 982287 904938
12596 904938 847318 798473 739866 692533 647086 606214 568926 535708 492922 464112 443445
12585 443445 415494 396634 377960 359622 347620 339616 327144 313775 276787 248217 244099 239854
12573 239854 232295 228604 209776 192155 184701 175022 164842 168478 169513 164416 163398 160873 160419 158953
12559 158953 146594 126696 112947 114878 130645 142324 131372 113807 111838 124469 140610 149977
12547 149977 165286 195488 215687 227806 241707 231153 224736 229254 243482 250593 237677 207472
12535 207472 166702 122192 89697 62352 47572 52798 42323 28499 19877 23910 21708 11316
12523 11316 2150 7477 1273 -8006 -12049 -14285 -22204 -11668 -7485 -33053 -59637 -68279 -80496
12510 -80496 -82211 -60991 -33132 1325 37601 44935 68321 110856 147992 168530 171969 175753
12498 175753 172631 156052 135259 123132 117153 110691 107215 103177 93813 94141 87775 76639 77064 77931
12484 77931 70022 70473 77643 82936 72216 66613 71680 80152 84702 79187 56883 49431 51661 66100
12470 66100 75481 69578 65082 62230 54442 54955 67441 88946 78070 74194 61055 57012 56443 43027
12456 43027 37341 44367 52409 42085 40705 39222 47828 60113 63164 66089 67784 72527 72693 70212
12442 70212 57174 49819 34246 29126 34905 38934 39354 45666 44410 41275 44819 52180 39514 31953
12428 31953 28126 21435 14261 17770 17414 6348 7638 8830 -578 1205 8585 11065 11102 17315 24612
12413 24612 30596 19009 15757 25692 37596 36136 26566 22540 25434 14080 15163 8278 1603 9596
12399 9596 14184 12689 6523 12882 12793 15718 9987 3483 9450 17162 24921 38539 36550 25772 24200
12384 24200 22044 22222 29710 41721 44126 36880 42472 33562 24365 27469 17125 7093 -1697 -2110
12370 -2110 -8543 -20174 -32266 -32286 -12883 1473 12640 21266 17112 -1443 -5568 -762 373 487
12356 487 4669 13826 -1146 -10386 -11756 -20745 -15112 -20062 -8996 10480 7156 6596 -583 -6058
12342 -6058 -7593 -4735 9699 15359 16890 8686 18717 24509 26837 23782 16346 8585 -2337 576
12328 576 8556 12393 13919 17877 11552 2118 -8390 -12859 712 8571 2382 -7723 -7106 4307
12314 4307 4430 8039 13966 16681 24188 18788 14697 8145 8953 12443 13530 2371 -2874 -13740 -15833
12299 -15833 -880 14385 16411 7433 10262 8606 -196 2808 -105 10972 23487 11088 9904
12286 9904 11361 18334 8559 -1655 204 6496 15203 16787 23675 23771 23829 31860 43204 39363 32984
12271 32984 28907 24903 12441 3669 1056 -8007 -1752 28414 49404 39882 32559 34889 39974 53943
12257 53943 50573 34117 25041 21257 28526 33849 33017 20694 14265 20042 31721 25734 24512 13921
12243 13921 10259 14628 10231 12445 13605 13547 1858 -2378 1859 8751 16419 26090 20295 15435 -4013
12228 -4013 -21810 -15117 2353 21378 25924 14476 14207 33328 52670 52656 46052 46984 58500 75741
12214 75741 82112 99718 117390 137074 182325 251045 340843 465242 579119 639537 620084
12203 620084 574695 564999 595776 612460 557005 456038 351437 259910 206669 173483 145468
12192 145468 146171 148909 147271 135691 143963 153461 198960 256813 331974 414833 463008 495174 474756
12179 474756 414281 372307 368128 411721 505337 665050 922144 1228410 1581429 1937986 2219087
12168 2219087 2377205 2432206 2441323 2423210 2360417 2210695 1938972 1582443 1208354 894725
12158 894725 666196 504475 389433 326100 272797 222548 200467 193382 182422 167449 143977
12147 143977 133309 130620 131622 114996 86591 70862 68333 65124 52501 40684 31498 20847
12135 20847 19944 29169 22860 15217 12838 13006 6811 21311 19656 6113 -2446 695 2046 7363
12121 7363 14452 16167 8093 12746 20770 18020 20044 22711 15107 4236 9911 12230 -1988 -6527
12107 -6527 -2322 4738 -744 13358 12682 4850 -3094 271 16643 23296 30883 44440 34575 29012
12093 29012 33845 30473 18183 12994 7287 5092 6329 7388 13968 12959 9987 9709 8422 23140
12079 23140 40815 55261 69834 80162 104964 134851 183576 270154 454839 816759 1394449
12068 1394449 1646353 1222346 740169 444089 291137 208642 147116 113426 90327 79619
12058 79619 64401 50533 41376 32622 27925 11486 -2693 1093 5991 15108 16780 10540 5800
12045 5800 9884 17737 18032 17036 15327 14536 11281 10760 17814 10360 7319 1675 6704 3110 -7039
12030 -7039 -15061 -11086 -6084 -4734 102 -4433 -6567 1417 6101 837 4632 14270 14722 12361 12510
12015 12510 13566 14825 11164 1969 715 -5791 -11639 -12021 -12697 -2065 7241 14495 19345 20835 11204
12000 11204 10548 8447 -457 -11916 -10513 4610 4544 -2578 -9427 -16907 -15642 -7014 -1799 -1113 -5260
11985 -5260 -11037 -2923 -3162 -5231 11720 23684 30160 28410 23722 12952 1266 -1824 -5949 -6441
11971 -6441 10227 16062 15350 19682 8330 5833 6280 1767 -5945 -8541 -6309 498 4691 -2065 -3563
11956 -3563 -6380 -16659 -8650 3305 13811 23274 15373 16365 20231 13764 7889 -2106 -8344 -2593
11942 -2593 9103 5657 10065 19426 12318 8552 11228 27138 32146 18795 9396 642 1090 -5600
11928 -5600 -5260 5530 4594 -1078 -7786 -9760 -7674 -12266 -15044 -9488 -10205 -9703 -9027 -11131 -23822
11913 -23822 -10112 3816 -20 -1286 -13104 -13408 -18306 -17307 -22517 -16576 1701 -4822 -4179 -1299
11899 -1299 10506 15115 16952 23968 27976 25830 11980 -3799 -15061 -25251 -21573 -3548 -2273
11886 -2273 -3085 -4487 -8055 -2240 9267 8357 11367 16154 14631 -1736 -6415 2386 10061 8070 1284
11871 1284 -2656 -6070 -3739 -3575 -1826 4563 7216 12569 26096 29694 26619 28040 22761 22496 20934
11856 20934 8131 -7934 -12681 -8621 -1238 549 -3273 -8890 -7519 -8034 -403 1925 -4348 152
11842 152 -2054 -4888 2249 5647 -1779 -3580 -4941 3795 14111 18922 17358 22120 16376 13714 10512
11827 10512 8440 15182 10570 1143 -1146 -521 -8690 -1714 15941 21939 11427 13250 15484 24902
11813 24902 30906 22979 22763 19812 15107 3156 1079 4515 18263 15460 9705 11969 12438 9327
11799 9327 5206 8849 3755 -5193 -8481 -240 3568 6138 -869 -6123 -6715 -1698 8476 6492 8584
11784 8584 17542 18289 19733 12045 -1504 -2765 -5631 -8839 -12148 -13487 -6123 -6677 -8193 -7546 -8514
11769 -8514 -9730 -3952 15045 19050 22758 36207 28332 15527 -1585 -132 4387 5644 6466 -4704
11755 -4704 -5281 535 9377 3193 593 1816 4642 14365 12894 17938 5594 4687 16859 28923
11741 28923 33614 34066 23577 25669 18367 18227 12120 4579 5834 6526 16566 21102 16148 13676 7598
11726 7598 12608 13509 5822 5032 8071 5502 12793 16146 21711 24894 24159 26253 23239 10981 7549
11711 7549 7036 10232 15627 8517 7473 10714 13931 16785 14043 10417 1031 4930 2024 -12989 -15992
11696 -15992 -4443 15189 28719 17433 14111 8451 2976 774 -3289 2299 9543 15217 18107
11683 18107 23977 15932 10218 13131 9341 9518 13417 20936 15192 23768 31322 33789 30797 32069 17399
11668 17399 8738 8040 13155 14385 10822 4468 10703 21007 22377 28771 30079 20057 23499 19690
11654 19690 29886 36100 34045 16581 1489 3321 15283 19743 14083 5670 9362 15678 10001
11641 10001 8477 104 -5257 2206 11774 18341 20019 19709 8988 22163 26776 16818 27326 25888
11627 25888 11089 -495 -2961 4528 -1524 4968 2261 -6666 432 9871 10634 9690 8866 14610 15130
11612 15130 18065 24547 23634 15589 10728 -4573 -12291 -11379 -20530 -10640 -14776 -9119 9834 18448
11598 18448 21205 23244 29910 42642 31075 17138 10670 7227 14753 13801 10891 25311 23037 14023
11584 14023 1143 4712 21095 14265 7097 9722 6978 2423 4273 13632 15969 4093 6108 10891
11570 10891 7813 10800 3300 2579 5569 4146 -3974 -1510 5964 -1727 -2584 17121 27284 34789
11556 34789 39791 19039 25085 23391 15948 32381 39059 32519 30904 37113 46030 59988 70618
11543 70618 78766 110680 142932 158730 160839 162585 150621 129543 108330 95026 74099 51916
11531 51916 41806 33753 31007 34934 37531 41818 37203 30714 29950 21357 20620 18715 25209 32478 33989
11516 33989 22153 10875 12478 26015 32643 36985 23994 10158 8456 5840 11085 19309 14460
11503 14460 18364 21754 25638 24078 6994 4887 10403 26625 34085 27833 22164 28258 34137 28779
11489 28779 14861 14737 27064 22720 19341 30268 30700 21886 25399 23166 20328 35481 38574 42179
11475 42179 38113 29813 23279 32147 29539 21865 22554 24529 24155 37323 35587 31361 22271 16178 13645
11460 13645 8321 8611 4912 8598 15341 6388 7067 4354 4676 14535 15207 28584 31939 13049 4202
11445 4202 5583 13299 3022 1075 2770 14668 18895 22306 26027 26667 17636 21216 24078 20361
11431 20361 9197 12597 21496 24118 22435 28895 16583 18247 20313 15762 21369 30699 24470 20316
11417 20316 22311 14348 11274 14793 12645 21532 31395 24121 15965 15610 17038 14857 26136 21879
11403 21879 22713 26925 27258 32257 37489 39086 31506 35007 38424 40908 49187 46813 36723 30387 25241
11388 25241 13385 14551 25799 32522 31901 45050 43537 22442 19255 23612 21368 28636 26744 19773
11374 19773 24346 28179 21368 34079 41662 50849 45466 42760 43864 45439 33627 25200 25462 37263
11360 37263 33475 28718 25225 19347 30876 37494 37471 44098 64268 93120 117538 136105 134226 100516
11346 100516 73742 68610 60469 41762 26070 23066 23645 18247 32039 36639 35155 28513 26261
11333 26261 35021 41497 54102 49247 41514 44686 57747 54681 49570 62563 72610 83659 99823
11320 99823 95263 93192 109627 130046 127023 114888 90613 64233 44003 48845 43698 36785 34609
11307 34609 41746 48688 34059 35158 66254 74986 87333 83204 86496 80211 70393 55192 49461
11294 49461 48079 54259 67301 70298 56663 46934 41006 50786 54512 57846 71905 96435 112412
11281 112412 110576 130514 156863 173697 179217 190087 206357 240956 314948 451792 704712
11270 704712 1127109 1666934 1930431 1631051 1113825 721345 493100 365725 283443 220801
11260 220801 183562 153591 122375 108122 103471 94559 88506 80099 73315 64552 57306 54248 51715
11247 51715 49890 46541 47966 56643 56946 45560 33236 28248 15804 13084 17113 16944 26868 65793
11233 65793 92060 90417 60867 42458 32013 21471 25739 27107 24973 33102 31894 35320 43672
11220 43672 47182 52263 59355 55640 55741 67584 60731 66943 76541 65308 56663 42369 34539 31124
11206 31124 28106 29487 39187 48022 47952 44575 33812 29900 20584 27337 44743 42258 33204 35106
11192 35106 46417 44956 44232 28167 20227 17528 28032 30207 32176 43709 61340 77995 73183
11179 73183 58772 46705 42185 50812 52033 48143 45817 49741 52065 68000 82380 88742 82511
11166 82511 75576 46629 23786 14512 17328 18903 31552 41924 58957 65436 62287 61920 73739
11153 73739 83136 83382 97572 102909 97825 93978 83723 63604 55728 71772 68501 66709 65978 58649
11139 58649 57679 70922 78248 67752 66332 72653 67917 60195 67906 75531 99125 104021 87489 69256
11125 69256 53661 62651 81417 99740 115136 104891 89067 85184 96504 141474 220536 279105
11113 279105 259436 202684 154770 123237 107595 101165 95176 87612 88316 79814 66808 52972 57527
11100 57527 55094 64995 81697 79611 64131 64007 67926 65726 78976 81936 87680 98727 92747 93910
11086 93910 96471 89695 87581 86203 77928 67814 59226 52894 68291 78701 77067 68270 68759 65250
11072 65250 61481 65863 78152 81897 86978 95489 98220 91026 86308 75819 79077 86862 76908 71163
11058 71163 75726 77312 71853 56839 44211 28062 19742 21728 26528 26956 13710 6692 23790
11045 23790 44727 53896 70059 79526 77296 74766 94255 98571 93787 90428 85830 91749 86594 74943
11031 74943 69526 58913 45910 35958 14985 17346 31963 42348 53861 66287 74312 80299 83834
11018 83834 84706 87309 82934 90344 80364 62271 68601 79577 74751 79980 90531 91951 82740 73478
11004 73478 69340 62059 48018 40652 46551 43692 43490 45260 38605 29181 19582 -1349 -33845 -59275
10990 -59275 -54541 11282 162068 410286 651083 740213 678968 573755 479043 412893 373008
10979 373008 338816 317138 307838 304322 299552 289870 285768 297211 303541 300672 295304 287788 266613
10966 266613 256886 268811 270011 280231 285594 297189 304305 299187 289099 276754 278933 294563 316660
10953 316660 328108 329536 325893 343513 359648 381912 422350 465477 504875 537662 548393 542562
10941 542562 554692 612108 756027 996102 1218312 1155592 916745 721495 613755 563293
10931 563293 549498 545447 540973 542385 535819 528613 525870 533622 577059 608862 625965 633087 648975
10918 648975 652716 660580 690308 724275 765127 823446 906075 1040100 1230157 1543977 1992982
10907 1992982 2428802 2507736 2191054 1812365 1545803 1377417 1289085 1257900 1265002 1293336
10897 1293336 1309967 1340531 1411934 1504358 1605324 1720853 1820302 1915824 2010131 2135095 2349157
10886 2349157 2656755 3092975 3727805 4441847 4759167 4676938 4597922 4711008 5042297 5597200
10876 5597200 6369555 7367258 8785882 10974856 14290438 18478813 21895159 23598735
10868 23598735 25586987 30122294 38904282 54401317 81753269 130307810 211160608
10861 211160608 308250590 341770446 276916890 184829369 117134881 77078521 53968222
10854 53968222 40036818 31156647 25058627 20429277 16768137 14019640 11971417 10314187
10846 10314187 8899747 7740725 6811474 6083291 5489843 5018282 4726520 4641244 4772440
10837 4772440 5045160 5048909 4476007 3714517 3111883 2676352 2331753 2065415 1864807 1720628
10827 1720628 1594920 1475017 1353310 1231703 1127371 1038302 985987 927627 866726 795105
10817 795105 721390 682870 633335 574897 535926 508125 489328 478493 475389 464789 446826 419822
10805 419822 399843 385441 371011 343915 314341 287927 268840 271117 284251 299194 301697 273269
10793 273269 237981 216575 201218 193148 190904 188366 193819 198476 196115 176359 164909 182002 200841
10780 200841 200977 196355 179167 155290 134818 115900 111047 117712 124951 141934 153241 148412 139222
10767 139222 135172 120033 118798 124768 116379 111492 95754 90561 96262 90469 97125 100423 93715 92078
10753 92078 83617 76261 65856 61656 65664 55711 40015 21865 22963 50304 109635 169599 186631
10740 186631 122261 37820 -34962 -107563 -146061 -118638 -18283 128989 256769 309296 287899
10729 287899 258776 242475 238012 225449 206823 184740 156836 152393 160891 162520 176602 191775
10717 191775 185779 172693 161695 169567 176061 178853 170637 155119 143276 135319 110101 98452 86725
10704 86725 90712 111778 121522 119630 112422 110671 121806 122873 137479 167896 186521 163918 131020
10691 131020 107975 116281 122589 124439 126217 121420 121048 123487 120976 112643 96038 83936 65364
10678 65364 53099 56933 68535 73916 74674 75871 74628 98020 110166 115662 108848 95963 91197
10665 91197 86155 87091 85571 83856 69818 59810 53769 57624 62135 54681 34828 24012 26228 53941
10651 53941 73337 81482 92212 99889 100605 114297 119405 129027 125190 119000 108417 92695 79761
10638 79761 58781 27464 11047 20144 38348 56396 61732 49266 51792 51172 48793 55505 60453
10625 60453 63716 59862 49375 27954 32771 27277 8150 -17890 -10524 68109 241246 492037
10613 492037 693143 746248 676127 570318 509582 464327 414917 376280 353135 347162 333835
10602 333835 317797 295789 275103 262885 260890 249360 246284 247353 254955 256432 242804 241008 242093
10589 242093 241573 243163 253580 248439 252261 258545 272734 290954 302950 301457 287573 272781 269475
10576 269475 271119 290317 318756 335821 335381 322944 300463 279478 283897 305055 317914 318559 327029
10563 327029 338472 361624 389064 417612 446469 463804 476223 467469 443653 430753 413639 426749
10551 426749 452471 487572 533975 566410 576504 580301 582134 583554 588477 596424 607602 627546
10539 627546 662108 706148 758738 796081 815946 840946 864164 886399 912546 949734 975026
10528 975026 1001984 1061047 1117560 1167404 1197324 1232275 1286183 1360976 1445665 1545502 1653950
10517 1653950 1761282 1873751 2009135 2172145 2339552 2512565 2751740 3080038 3549651
10508 3549651 4208886 5015807 5845377 6398122 6646234 6898831 7343727 8099537 9252310
10499 9252310 10838837 12884009 15506921 19023080 24014448 31454673 43073697 62137237
10491 62137237 94960227 151421416 236294678 315550757 317145672 243948436 162097916
10484 162097916 105070174 71213830 51081180 38369264 29833266 23815763 19443970
10477 19443970 16231282 13850570 12007631 10486334 9250507 8383682 7882206 7598498
10469 7598498 7178905 6396332 5528630 4823323 4260199 3811293 3418544 3062344 2779559
10460 2779559 2561751 2365250 2189493 2036639 1915164 1801533 1701622 1620669 1572859 1581912
10450 1581912 1689513 1971630 2446830 2784975 2581960 2044399 1561612 1231753 1006167
10441 1006167 854523 756654 693262 632634 596971 564165 534399 506983 468719 434786 417321
10430 417321 395322 381822 346258 328665 320017 303981 309373 314327 299672 262163 239600 237949
10418 237949 226403 214008 213511 212567 210115 209298 204383 188978 163601 153069 159153 172313 174666
10405 174666 181072 158817 126654 101595 83585 73263 72436 79159 80986 72710 63076 68304 95415
10392 95415 93688 84304 68784 55934 49005 45974 53123 43420 24914 26466 39148 46694 48415
10379 48415 39430 33424 10304 -19208 -24912 -24487 -29323 -26728 -27536 -42595 -68059 -87696 -114538
10366 -114538 -136447 -151514 -175145 -178117 -126000 -14775 119739 202860 226225 219318 196346
10355 196346 181337 172368 167141 167009 156785 139613 125547 126131 122014 111307 113477 116644 104325
10342 104325 94793 105585 120095 117075 104857 89440 75561 72055 63634 60116 53247 70592 78165
10329 78165 71153 70310 73027 78867 86875 89902 100502 121922 127561 124694 119004 104008 89468 66704
10315 66704 59439 62841 70798 73137 73349 71348 63011 65120 78267 97644 106658 99097 101022 111290
10301 111290 122176 124100 127474 138290 134232 134130 137883 160049 202199 253064 330818 409282 488234
10288 488234 528395 498674 434750 356452 278891 221688 176374 135870 107578 103579 104799 94329
10276 94329 94263 73394 62010 71470 79815 85616 75073 67476 61695 53789 40114 22336 16423 16276
10262 16276 19380 32045 24891 25162 16853 17775 24761 40005 44158 42478 49709 49745 56893 63373 69834
10247 69834 65470 58151 53938 62808 58940 64742 77381 92760 83419 77438 87896 117998 131315
10234 131315 120106 121087 131745 137318 129389 122592 99922 89741 103043 131549 140079 142651 163546
10221 163546 193514 229783 269668 310324 349984 368131 392053 421961 476905 538636 632346
10210 632346 771808 954878 1234651 1678254 2402385 3584903 5530194 8289861 11023352
10201 11023352 12209782 10979447 8329417 5698081 3803871 2628701 1930516 1480511
10193 1480511 1170041 957930 814033 720938 655428 602456 573217 540309 501830 465573 420551
10182 420551 362661 298754 246610 219742 199305 168380 148798 135937 122976 129149 116290 95615
10170 95615 80766 78904 73818 57940 56111 67221 82782 78168 74579 72981 62294 60010 53117
10157 53117 47157 51141 45457 39837 45315 61886 51342 36724 34803 43175 50130 50894 49048 42472
10143 42472 33550 36823 40752 22037 9062 -2991 -7874 -4528 -7686 -4168 -3981 3113 1791 6146
10129 6146 4413 12233 25165 21727 20050 17452 26643 24664 15883 13663 14328 13415 20895 44205 58802
10114 58802 57257 30295 13939 21168 24714 26310 33429 37494 34856 35965 17853 24684 37611
10101 37611 43350 45751 41844 27221 19501 21994 19465 13829 7368 8723 13014 9273 12531 16835
10087 16835 27203 17726 10261 12039 18297 20901 19574 16535 10732 12608 16488 31227 40457 47315
10073 47315 72561 102580 112467 133793 181702 241053 323329 483666 745849 1142428 1572685
10062 1572685 1695674 1383258 947746 614518 416786 312018 229132 168111 134442 100341
10052 100341 94576 85475 76449 71173 54208 39599 38672 35272 37825 37983 40142 29010 20702 13428
10038 13428 10583 15430 25300 25192 25282 38329 39524 36881 72979 121878 171247 135325 87485 60164
10024 60164 44362 29140 31093 38197 30218 27900 32484 14987 6763 3612 8334 20815 18147
10011 18147 23258 13975 18582 14805 15889 21299 21278 13413 11467 9337 10039 18842 10056 -6976 -14338
9996 -14338 -5473 -1685 -8162 -15016 -14854 5164 12923 6591 -8492 -1428 1450 1440 -2388 5091 -2352
9981 -2352 -5623 -2115 4231 13986 9761 11550 16421 18734 10666 1027 8510 17928 10467 -3143 -7803
9966 -7803 -876 1354 -1417 3207 5923 13512 10183 6003 4523 -758 -13105 -23951 -10351 -1052
9952 -1052 -5808 -2057 -2551 6775 9983 15650 5051 8824 1554 -30 1779 2523 340 -6512 -13406
9937 -13406 -6095 334 -6972 -7067 -7469 -16908 -6184 7276 7414 -7127 -18889 -16470 -15623 -12817 -4270
9922 -4270 -206 12621 14701 9794 10362 3337 2977 4506 5342 1593 2762 14524 15178 21991 11631
9907 11631 10594 8792 -1729 -5467 434 -5450 -8147 -1009 14461 22311 22783 11912 6187 12728
9893 12728 9031 4834 -10289 -19201 -14828 -8945 -9155 -17439 -18225 659 3918 157 -5655 354 13892
9878 13892 26126 31072 28555 27630 17545 26077 27315 15898 12124 20363 18170 5675 2679 6785
9864 6785 -641 8947 7473 -1124 -1179 15343 2427 -5475 4664 2582 -6695 -88 10333 15744
9850 15744 13468 14520 19173 9926 5664 2610 -1919 6606 20877 15624 25690 20724 18305 15935
9836 15935 16270 25297 31243 23921 16056 3408 -13283 -15281 -6614 -1243 3426 6908 6948 -438 -3423
9821 -3423 -593 1580 1545 3479 6322 11977 7046 13731 12318 7766 15269 9299 3064 821 2910
9806 2910 5495 4045 4873 3467 -1294 3772 7026 10381 8376 6715 8332 13829 3758 -6826 -2074
9791 -2074 -2679 1692 1982 8705 17140 22141 24798 26804 29693 20014 14245 32261 48977 54202 51752
9776 51752 51584 42361 32479 19414 5420 12676 18581 8175 12410 16472 26000 26655 8751 -6519
9762 -6519 -2187 1765 7601 14677 14069 7706 19154 34287 21534 9596 17772 29664 34011 33476
9748 33476 32355 20256 17733 21375 9698 543 10967 23222 23133 24979 30179 36300 31779 18391
9734 18391 2820 -222 12673 7858 68 17509 38300 44590 40447 38001 34653 49855 63554
9721 63554 61690 77592 78769 83402 90615 90588 71439 64239 56261 48134 39252 39398 35982 33779 33884
9706 33884 30636 19877 12972 20129 21138 23766 32847 41319 36613 40842 38625 31499 34351 28141
9692 28141 25459 25384 19481 20155 16687 11944 15432 -2151 -6315 -6967 3255 6819 10220 13437 19986
9677 19986 32357 35290 40934 30906 25239 12878 18914 27780 34969 35020 28566 30333 34040 31059
9663 31059 23635 22321 26435 33349 30750 31477 29933 24091 31643 29092 32223 29766 33292 25309 16890
9648 16890 27455 31567 29590 17835 12276 15414 17876 12556 12618 3886 5785 8514 7199 -3471
9634 -3471 9997 29984 26730 21523 16147 17638 23072 32759 39200 24768 10595 -323 3385 13269
9620 13269 28848 47483 48590 49567 38115 31468 29739 14849 15652 15022 19827 22796 32340 28671
9606 28671 23465 25036 26238 26835 29417 26929 17035 22894 38321 36303 32346 32612 32907 48351 58309
9591 58309 49508 42418 28050 10066 5166 10898 15407 14042 10184 14274 19445 20264 15130 23567
9577 23567 29826 38807 32469 21463 36174 44153 42796 41388 52472 49801 36567 26186 23061
9564 23061 16838 24790 30212 36042 41138 47861 46227 45910 39855 38709 33229 34219 35767 41720 40098
9549 40098 52765 59221 50054 39655 37494 35521 36235 38457 35631 39032 40629 40146 33710 40068 39183
9534 39183 24448 15699 26108 43663 44947 45152 41685 37782 42967 41462 46164 45052 45842 42820
9520 42820 36327 41741 38423 43958 43123 39914 41889 37222 39204 41975 38612 33227 32061 44172 48254
9505 48254 46365 43723 45795 45483 49580 48361 51404 54847 56236 55162 46635 34454 36360 34365 36728
9490 36728 46160 45595 56134 56979 57156 51145 47982 44713 56664 61392 54786 52556 55106 48241 42860
9475 42860 35508 45715 59554 65650 67817 59948 64290 65792 58786 49794 44141 35506 38652 51182
9461 51182 55375 53169 61425 63057 54685 63614 60813 61582 70505 73155 68666 69095 72600 70071 66047
9446 66047 74317 71124 63815 66677 65409 69920 92138 89343 81450 80747 70769 68803 63948 65202 76282
9431 76282 75935 72364 70976 68165 74090 80621 78565 80364 81979 79225 78416 83837 80424 64594 66658
9416 66658 83257 101483 112271 102284 96261 99784 87264 82130 79710 87246 80376 71300 77410 79652
9402 79652 82745 81652 82524 98338 102343 99971 93263 101605 102186 101990 100515 103376 92174 82413 85676
9387 85676 79761 75261 79275 77421 75261 81275 78649 84257 90064 100711 104761 103470 103816 98619 94732
9372 94732 93994 101944 109714 113229 120344 125178 120153 124974 119325 106177 111990 114888 119136 118115 121108
9357 121108 118660 114605 108481 111657 117195 116321 124773 123433 115214 125676 143710 147038 151957 158841
9343 158841 148960 138905 141257 141581 139243 136204 145768 162164 163622 157985 154692 147871 144784 149920
9329 149920 153042 149700 151053 156219 157087 166271 169312 169045 172313 179454 173657 167760 176099 176263 188521
9314 188521 197830 192520 182734 184221 186639 188411 194588 196634 194302 191711 183886 180190 192210 196714
9300 196714 190760 202377 209166 194307 177961 173381 178949 192855 194991 188967 192366 202661 212374
9287 212374 210289 220329 219922 209126 204652 203011 218432 213070 212346 217796 222783 224418 215788 219654
9273 219654 234537 241044 239843 236456 250101 266969 271322 266013 258336 262922 261842 263632 267471 274210
9259 274210 279611 282236 280234 279992 281616 285963 288720 297745 312877 316010 316760 318683 306010 306624 325868
9244 325868 339683 359642 358187 359443 363417 369973 374882 380241 385205 394222 408540 410910 409452 420068
9230 420068 426303 425166 430753 439792 451129 453247 459795 466100 472973 478129 493173 509745 508950 514503
9216 514503 523764 553209 580253 583173 575166 571831 572505 582047 595744 607205 631329 642424 656483
9203 656483 658164 661081 683074 700330 712465 717129 726292 745536 760466 769951 785553 791883 805596
9190 805596 827738 837837 842789 861655 879919 893044 916089 936692 961283 982748 1008313 1027112
9178 1027112 1049240 1087258 1094772 1112062 1135152 1149962 1178945 1210635 1236904 1262200 1284431 1311567
9166 1311567 1345578 1386828 1424091 1453244 1495463 1529303 1560250 1596330 1638886 1690836 1735682
9155 1735682 1773634 1818953 1873867 1925458 1981274 2043537 2095521 2153682 2226599 2298243 2367257
9144 2367257 2445950 2528245 2600676 2692325 2790887 2867418 2946499 3047053 3161131 3259452 3368926
9133 3368926 3491607 3607543 3736422 3883910 4027994 4170030 4328751 4495453 4672522 4849524
9123 4849524 5026042 5218874 5441721 5665680 5880200 6104063 6340397 6593889 6860832 7140052
9113 7140052 7422455 7705740 8007499 8314473 8622545 8930887 9249779 9551777 9849004 10159981
9103 10159981 10474886 10763640 11044665 11305809 11552741 11764881 11953421 12104739 12218678
9094 12218678 12303776 12352774 12375057 12357476 12303951 12215133 12076612 11921516 11739183 11525408
9084 11525408 11285934 11014547 10737179 10456042 10164526 9859439 9543716 9227813 8912099
9075 8912099 8608080 8306905 7999054 7698470 7418965 7141971 6864044 6603620 6354259 6124627
9065 6124627 5891132 5654771 5436352 5237974 5032172 4843958 4662746 4487642 4314110 4156087
9055 4156087 4023092 3885869 3730686 3591711 3460375 3340474 3227310 3114156 3010372 2905250
9045 2905250 2806344 2726272 2641536 2549455 2456988 2386210 2324803 2265483 2190812 2113346 2035284
9034 2035284 1970840 1920902 1860151 1805793 1758399 1720847 1673751 1623715 1567997 1518807 1488682
9023 1488682 1456549 1424262 1386903 1348469 1309853 1285579 1251773 1226748 1199377 1164459 1133083
9012 1133083 1110239 1086497 1054866 1044510 1013485 987517 965411 956811 937781 904104 877451 864288
9000 864288 845432 829422 799210 789144 787971 776083 764070 745847 732218 717878 709279 677782
8988 677782 659154 650095 640905 627636 617763 607292 597680 593734 572814 543580 540747 537705 529728
8975 529728 534575 529811 516699 508548 498763 488363 484770 474451 457592 459121 472704 474398 463668
8962 463668 448524 428708 417724 414644 404688 405341 406199 413944 416951 404929 388230 378410 377617 375598
8948 375598 372862 360959 364066 369954 360148 343316 330489 320630 310514 309068 313603 304061 308439
8935 308439 301985 298624 293443 288607 277927 285702 281349 278593 289467 303537 301309 303562 302817 303010
8921 303010 290286 269860 255412 233855 231541 246074 246836 239903 231335 232724 241523 236618 238998
8908 238998 237577 229306 224911 225025 233222 227791 224724 218917 210192 216514 213773 209917 204020 202549 197881
8893 197881 189595 189123 172088 183081 184364 182030 196001 197249 186991 187531 192187 190809 186935 187795
8879 187795 187046 177011 169148 162790 165815 172591 166158 161377 173565 177117 153718 151560 160229 170410
8865 170410 171658 162044 165295 171608 158008 159925 170317 190050 205159 227886 255891 292603 302581
8852 302581 267041 217994 182300 151266 133129 119775 114118 126235 128030 111469 107729 113214
8840 113214 117478 113703 113526 112954 122696 131598 121822 115790 117765 126886 122907 115678 127106 119576 112343
8825 112343 118827 113754 98274 91901 105414 109836 99894 81143 77421 81618 90598 91521 89270 91738
8811 91738 75499 67041 71443 78850 76499 76158 65108 54028 61140 65435 72363 84015 100211 101661
8797 101661 95865 89358 80632 62978 56327 61876 71775 70291 65899 69950 67569 65701 73251 75373
8783 75373 79569 72627 73606 81433 74035 67046 74127 74513 66189 67651 69431 65839 58460 54488 46318
8768 46318 47585 51107 49593 43737 60770 66211 61115 59916 49273 44271 55763 69304 70379 71945
8754 71945 65807 63386 58191 56150 48925 49894 54007 54570 55960 59326 60349 62602 65544 67622 45134
8739 45134 43769 50861 46156 44515 46680 47518 49442 50117 50678 50762 47022 42409 51122 52146 47547 42569
8723 42569 30272 29069 36915 47748 50898 58885 62119 53960 47240 39103 44491 47773 51012 53098
8709 53098 49148 51205 60330 45282 30217 41409 45081 32361 23147 31808 40165 40288 41684 39382
8695 39382 45311 54047 61908 53153 31077 11906 9473 17809 25090 23903 28384 29906 37409 39016
8681 39016 31953 28512 29215 27913 30995 37259 40134 35303 23941 20054 25581 28868 24035 30026 32128
8666 32128 19458 18549 9374 14812 15751 18992 31883 34595 41784 47366 45813 46095 41594 29054 15297
8651 15297 22433 28989 30900 28370 24615 23120 28472 32565 30667 29723 28614 26351 12583 2937 11975
8636 11975 18254 25967 24802 17073 12594 19623 16681 20139 21251 24934 33786 39421 45176 41895 29897
8621 29897 37454 43270 38262 25861 24159 28626 41936 48804 43705 47552 34204 27988 35672 41925
8607 41925 45021 32762 22692 12750 15647 24688 36331 35051 38261 33895 40572 49426 39461 36897
8593 36897 35544 21297 19155 21626 20365 25863 32283 36775 42648 37604 23703 22877 27642 19340
8579 19340 19851 22795 14223 12222 14213 15382 23207 32790 34804 32486 31082 30419 24755 22994 28206
8564 28206 28715 32804 34612 34255 28808 30523 30396 28805 27548 36866 44110 31948 28031 28808 17013
8549 17013 9675 16079 27579 25411 25691 24517 22273 25297 22732 33247 38290 36757 24236 25021
8535 25021 29506 33919 20517 15126 23724 26697 21362 23399 17645 13956 24813 27960 19218 28856
8521 28856 32304 34040 38218 20801 4954 4275 7853 20414 25270 21352 25946 26450 26359 15793 10506
8506 10506 9687 -258 3493 9775 19796 16455 11067 10554 10370 9907 10528 30166 32081 31268 26194 28569
8490 28569 26766 38815 41614 45411 40564 25259 15949 21433 24542 13964 1064 7098 8669 4038
8476 4038 4319 8425 14954 18117 21145 19854 10077 11447 8349 17666 29561 41546 33265 25651 17498
8461 17498 16410 15714 15005 13077 17081 9045 4201 12898 16369 22619 22134 25835 21840 19864 15927
8446 15927 8472 -2366 5363 12451 9241 17528 16983 7168 6086 18248 18995 19093 5545 -4307 -5619
8431 -5619 -3268 -6921 -15637 -10162 -5025 -13563 -18240 -9865 9931 9758 3442 9871 14885 11743 8962
8416 8962 7931 15193 26202 27760 17945 14170 10009 10590 11873 15486 11016 5918 -4311 1747 16487
8401 16487 24908 15948 8626 -668 -5989 4962 12996 9978 14593 16789 14988 16503 28074 37052
8387 37052 32172 24655 13576 6175 21039 27370 15468 -7476 -15628 -8078 8268 10119 -110
8374 -110 -11139 -5637 -2816 7450 5797 -1924 2975 4622 -3513 -3554 2847 -3727 4140 8032 8666
8359 8666 2188 -3138 -2270 -2713 2775 11642 9579 23146 22170 21988 25821 22509 23446 20617 12411 7998
8343 7998 4273 12270 20147 15285 6431 12428 8799 11189 19671 19872 14425 5904 -13707 -14520 -1793
8328 -1793 1090 6316 -135 -1454 5498 15492 6679 793 -396 -6481 -8240 -5588 3659 13582 12893
8313 12893 15984 8622 10656 7015 -1711 4759 9453 18372 29026 20338 10693 -6888 -8427 -5694
8299 -5694 -8674 -23049 -29524 -20900 -6319 9286 6079 11887 4208 2762 -1161 2580 5928 5397
8285 5397 5850 3259 -6409 -3178 1274 11704 -3409 -24724 -21586 -21546 -6170 851 794 1260 -5853
8270 -5853 -6576 -2413 1305 -2164 -3697 3380 -4931 -18511 -16629 6008 21773 10410 1939 8587
8256 8587 12600 2986 -8272 -7604 -820 7646 2222 -1867 -5046 -3260 8830 8115 1184 -1645 -19023
8241 -19023 -21915 -21210 -7980 4392 -1571 -7457 -17056 -22999 -23346 -21802 -15819 -14282 -7862 -4643 -8827
8226 -8827 -2242 5659 4951 186 -4195 -12299 -19484 -13624 -2657 -954 1289 7297 14059 3751 7915
8211 7915 12627 14852 8371 10490 7254 11025 -180 -3506 1746 1499 5107 2996 -11984 -9373 -5286
8196 -5286 -1558 -4551 102 3710 -2312 -21153 -22431 -16331 -18369 -7571 2068 3729 -11684 -2413
8182 -2413 22417 21830 18193 21328 5473 -3472 7454 10149 5755 -3198 1479 3555 5841 6751 6878
8167 6878 9378 9734 5758 -2039 5150 652 -939 -5228 -5535 -6888 -2948 -4764 -11178 -14872 -10512
8152 -10512 -3824 115 -2761 -6270 -13538 -14077 -7109 2830 -269 -470 8212 6604 4030 1289 8486
8137 8486 11357 5784 -4553 -9998 -11409 -19091 -15869 -15130 -3825 -39 449 2582 -2611 -5077 4162
8122 4162 -422 -8159 -2007 -2965 -5861 -15065 -13804 4565 8276 -4206 893 17990 22857 17677
8108 17677 7106 5702 22703 10257 8960 3082 -13597 -21108 -10862 -668 -600 -2204 -9188 -13012
8094 -13012 -25989 -21756 -21718 -21892 -15222 -5469 -340 -4300 -11863 -4907 3937 -7251 -11284 -1817 -7062
8079 -7062 -13344 -4521 -3391 -6724 -3920 -5223 2631 10299 7124 -2744 -1672 -9241 -16095 -17804 -14212
8064 -14212 -16985 -18422 -14696 -4277 6529 9606 6970 19017 20909 15402 2048 -9865 -6357
8051 -6357 10300 12021 -744 -13573 -11196 713 -3144 -14502 -19765 -18296 -14173 -6769 4296
8038 4296 1555 7070 8437 8998 5881 10177 11365 19141 18001 4506 7021 4017 -1931 2225 -413
8023 -413 2953 7417 14279 14181 -9056 -12543 -448 9547 16117 19671 28677 22146 16871 12063 1458
8008 1458 6300 -3203 -3198 4501 4477 8481 12885 11550 4373 3541 -1583 -167 6777 3252 1723 -9225
7992 -9225 -6728 -4383 1363 927 -7080 -9984 -53 3696 1592 -6397 -6364 -1642 -2338 -2660 7819 12601
7976 12601 17450 12497 12464 6989 45 -1315 -11139 -8338 -1558 -7142 -9603 -2678 -4113 -6556 -3046
7961 -3046 2629 3093 2702 -431 -770 -7347 -18755 -21314 -5738 -360 -2117 -504 -8894 -8183 6255
7946 6255 21236 17908 19125 25747 26334 20835 13518 9779 -984 -9239 -8933 -3431 5866 5638 6896
7931 6896 11876 14598 7511 7135 17375 21857 11587 658 4847 4771 4480 9083 -3301 -10876 -5719
7916 -5719 5219 5596 9780 17093 9478 2354 -2739 -12818 -10776 -577 11320 6128 12229 13320
7902 13320 10418 8363 5970 613 1187 6233 -4642 -3344 9480 24443 29096 20723 23011 11890
7888 11890 -3478 8312 11139 7424 21727 10720 8084 3637 9854 9245 3674 -4234 -2222 10078
7874 10078 7435 6099 -2954 -4396 -6009 -4662 -2727 -15875 -15336 -8313 -6299 -16610 -18621 -9491
7860 -9491 -12200 -2411 172 -4243 -8179 5382 9894 7427 5911 -1960 -1504 497 2529 83 2502
7845 2502 2262 -4824 -14939 -15838 -15823 -10436 -5646 -18635 -16184 -9990 -8390 -4372 -4045 -4645 -1055 -2829
7829 -2829 -3315 -2206 -8686 -13351 -14058 -9467 -13187 -19365 -22418 -23556 -21149 -14066 -12530 372 5791
7814 5791 -9002 -9950 -2239 -406 -4082 -1183 5115 3275 1005 1700 7041 9495 172 -4312 11612
7799 11612 20745 13161 5706 1253 1968 6812 6824 -324 -6092 -15188 -22071 -28102 -18906 -11907 -7481
7784 -7481 7956 6977 -6970 -5101 6812 6142 3365 4744 15493 33674 29462 8190 162 3610
7770 3610 5505 13691 11477 2124 -12634 -4310 -585 -8652 -14928 -12751 -19456 -14078 -5296 -7882 -11583
7755 -11583 -9567 -275 5706 11836 1498 -14264 -15417 -7958 -9796 3434 6739 8242 13286 10105
7741 10105 -5201 -7766 508 11597 12198 26263 21717 16290 19153 4106 -12778 -1514 1993
7728 1993 6447 8663 -4153 -7271 -15193 -10159 1085 3149 3076 -7749 -7839 -3268 5167 7638 -1709
7713 -1709 -6943 -4165 -5523 -4917 -2672 10678 10516 4038 -3949 -13829 -9019 -5008 -11324 -4294 -21
7698 -21 5074 11867 5064 -4577 7695 12811 5827 -4680 -13704 -8959 662 5293 -1690 -9959 -18909
7683 -18909 -12229 -8675 -10499 -17784 -12850 -11245 -13354 -20085 -19989 -11697 -9238 1663 -950 -6900 -5597
7668 -5597 275 751 -908 -8741 -8535 -9061 -7174 -19457 -28855 -17999 -8145 -2532 -8604 -13341 -14990
7653 -14990 -3877 7758 9758 -2528 -1071 -6037 4283 8157 -1485 -1892 2616 -5693 -27646 -19314
7639 -19314 -653 2324 -3198 1626 1478 7663 10630 1997 -7505 2874 16102 13830 957 -3226
7625 -3226 -1795 -6264 1102 4012 5042 -3337 -10384 -23550 -17298 -20909 -7997 -5354 -13021 -9859
7611 -9859 1984 -82 256 4852 2412 6335 17871 21799 14391 15529 14777 -844 -5191 491 -978
7596 -978 -5066 -9236 -20515 -21363 -17510 -15078 -20625 -30717 -25104 -21711 -14331 -6139 -4138 -12551 -11591
7581 -11591 -20871 -28348 -25524 -13146 -9885 -9075 -2847 -1162 12181 3876 -6150 -19338 -23009 -27435
7567 -27435 -28552 -19447 3397 9023 -6049 -6687 -10032 -5915 -3613 2618 12459 9828 5730 -3768
7553 -3768 -3920 -823 -993 -3505 387 -6065 -3108 9104 -6251 -8354 -7784 -21738 -26449 -17468 -1515
7538 -1515 8668 14528 10998 5914 6192 -1196 -3558 -3409 -3437 -875 346 12093 8092 -702 -1089 3888
7522 3888 -1980 -12366 -9290 -9684 -6950 -12208 -10265 -4513 -5209 -3664 4340 11345 110 1459 -6682
7507 -6682 -10871 -18051 -21844 -19876 -22787 -5934 4447 -12118 -19680 -15249 -7431 -7410 -1629 -592 -14428
7492 -14428 -16707 5076 12361 3204 1708 -2559 -8758 -21230 -17399 -13076 -25050 -19695 -13210 -8441
7478 -8441 -12767 -17226 -16620 -14724 -9341 -295 -4529 -689 1646 5081 6340 5443 -7285 -19359 -20897
7463 -20897 -17126 -16723 -7210 2726 3951 -156 -13336 -13946 -1449 9470 12403 2664 -4413 -1830
7449 -1830 1801 1809 7116 -773 -8306 -7103 -6058 -7178 6914 6584 -1550 -10007 -11640 -16193 -22371 -14659
7433 -14659 -3608 -3451 1120 9501 11159 14629 24171 32446 43911 25906 6376 457 -4387 -8173
7419 -8173 888 -677 -11442 -15905 -8276 -9226 -8584 -2680 -17976 -39028 -39756 -22462 -22462 -35319 -25108
7404 -25108 -19018 -21367 -18823 -26000 -20608 -3589 -3280 -4019 7707 12559 12709 7143 4701 3225 9432
7389 9432 1766 -3855 3655 1515 -4916 -10622 -4786 1924 813 1791 4266 4164 27 -7585 7662
7374 7662 8379 8183 3843 4598 15413 186 4390 5422 -1050 1367 -4148 -1182 4405 1420 -2445
7359 -2445 -10168 -9083 -10598 -19340 -19914 -11718 8558 10122 10187 8215 4986 3272 10190 13868 8456
7344 8456 3412 -1454 -16212 -9996 -6247 -7850 -19649 -19614 2019 5642 3328 1560 9368 -834
7330 -834 -8140 -18364 -26054 -30407 -30120 -15649 -5984 -2673 -9233 -11068 -6849 -625 -15559 -22078 -17955
7315 -17955 -2332 1686 -10575 -20594 -31559 -25435 -14795 -19352 -9327 2807 -6301 -3844 12871
7302 12871 5783 -2747 -9260 -7483 -11857 -11465 -10367 -9373 -8996 1280 4741 -2112 -9453 -10808 -10885 477
7286 477 2067 -5415 -8295 -18469 -17086 -6967 -3520 -7249 -4910 -10692 -5385 -10092 -16683 -31047
7272 -31047 -24861 -16924 -12098 -16207 -14538 -10421 -10763 -17047 -9334 -1265 52 -5587 -6853 -8674 -12435
7257 -12435 -14912 -16215 -20395 -10684 -8279 -2932 -9199 -17112 -13919 -5546 -13423 -6549 1331 -3857 -11847
7242 -11847 -9561 -5893 -10366 -8612 -8164 -14254 -12883 -4446 -2420 -699 -6660 -6812 -8287 -15855 -19036
7227 -19036 -7048 -8098 -7952 -9934 -9825 -4842 -5180 -9756 -8868 -13566 -7497 1790 3878 -8225 -15758
7212 -15758 -26831 -24041 -19518 -18618 -4387 4367 432 -7341 -12656 -10235 4492 -417 490 1143 -12016
7197 -12016 -8577 -5480 -940 2995 -1875 -3072 3974 5945 12324 9169 6370 9797 9427 -8642 -8757
7182 -8757 -5138 6270 18910 30313 33212 14091 5621 -2003 -7941 -7806 -1660 6755 -2182 -8549
7168 -8549 -12941 -20165 -25786 -13806 6797 11357 6708 -1099 -3311 652 -1461 -932 -1424 -10189 -16241
7153 -16241 -12943 -11706 -6816 -13398 -10599 -10878 -14863 -15012 -7830 -602 -11633 -22552 -17934 -9347 -15044
7138 -15044 -10151 1453 408 4588 16682 17130 28 -8815 -5089 -5369 1365 5119 -5975 -25276
7124 -25276 -23956 -11654 -17012 -19649 -9674 -13502 -20447 -14752 -7762 -7664 -3789 -2140 -2722 3485 518
7109 518 4875 12272 7875 454 -1495 -3456 -7856 -5018 3404 13496 2941 -2318 -4337 -4896 -6597
7094 -6597 500 7719 -1500 -11220 -2027 4719 5556 6156 10225 4374 5204 -2489 -5930 -12368 -8693 -6571
7078 -6571 -8735 -15452 -12010 -2647 -18113 -27083 -23199 -14314 -20149 -21429 -23954 -22097 -27899 -24776 -22052
7063 -22052 -22276 -14808 -785 -7656 -17848 -17339 -5873 8102 16369 915 -9958 -13179 -22215 -16153
7049 -16153 -20559 -7108 -17291 -11862 -10763 -10395 -22403 -14973 -8898 -8789 -18261 -7297 1263 2611
7035 2611 10633 -6064 -18601 -19145 -19940 -15426 -1811 837 -3313 -9099 -9167 -2609 2601 4588 -5696
7020 -5696 -7654 -803 -5354 518 -9090 -7912 -5819 -3906 -2025 -1715 -5220 -4923 2838 -1037 -15924
7005 -15924 -19629 -6782 -6023 -13642 -17169 -17834 -11139 -19042 -27214 -28858 -27975 -21579 -16918 -7186 -5259
6990 -5259 -4866 -7089 -5809 -18741 -17848 -16999 -12770 -4182 -12599 -1167 10200 11010 9547 7619 11842
6975 11842 18072 13546 8633 -594 -6285 2257 12818 12308 10941 14956 22045 22056 31222 30150 27786
6960 27786 41596 52960 51030 41989 23936 19970 6661 -7043 -1774 -3959 -3546 -6054 -6059 6604
6946 6604 5662 -4111 -4561 -4022 -3516 1088 -2052 -7162 -8023 -3749 -1467 10002 5327 4908 9513 11898
6930 11898 -3897 -10763 -1633 680 1393 3037 5258 4044 -2106 548 1389 -680 -20913 -28143 -15601
6915 -15601 -18195 -12080 2750 1846 -14054 -13311 -7492 -16708 -24797 -12098 -1647 -4540 -9736 -4675
6901 -4675 3396 -1064 -4263 1239 1165 -5665 -4106 -7172 -10420 -6391 -5655 -3475 -5451 -5999 113 -8664
6885 -8664 -13925 -15267 -8971 -2775 -2704 -9202 -8136 10997 18926 21042 20782 22769 27780 33076 18669
6870 18669 14921 16463 10061 208 -4510 -4574 2735 -1575 10240 18144 1772 -2083 2667 269 -5324
6855 -5324 -15696 -14124 -13038 -9951 -16732 -9463 -4430 -8325 -4207 -959 -4210 -5296 -12367 -20202 -12654
6840 -12654 -11994 -5252 -8431 -2378 -2303 -11672 -13912 2210 1115 -3381 -745 -19480 -32534 -27603 -15231
6825 -15231 -15245 -21442 -12025 -4549 7271 12183 10173 17302 12366 2522 -1185 -2214 -4599 -5655 -2037
6810 -2037 -15330 -15818 -7677 -10590 -5671 570 -10130 -13922 -2692 9265 7017 -6845 -7122 -3266
6796 -3266 -361 -5578 2185 -100 -6718 -6238 -8405 -16651 -10825 -2303 -2021 -4785 276 -1220 -430 -4647
6780 -4647 -18756 -23914 -6287 2732 -3506 -1953 7260 11976 -3313 -5005 7287 4271 -1437 -4887
6766 -4887 -4400 -731 70 3485 -2116 -9606 -11352 -2992 1792 2574 4618 9919 14808 9886 16645 14689
6750 14689 5680 7830 10529 10697 -1953 -11890 -24643 -39624 -36507 -31882 -12833 -5562 622 -1907
6736 -1907 -2205 -418 2103 8269 -984 3828 10733 -4964 570 14063 18065 10649 467 -732
6722 -732 -1573 -2723 -4811 -22137 -31598 -30036 -26420 -16131 -4266 -4430 6644 28762 46453 52809
6708 52809 38670 28083 22563 13118 6203 12234 17922 23131 13954 16306 12238 -1176 9258 12115
6694 12115 6507 2944 14384 20413 11153 -1710 -12604 -9940 -161 8470 5499 -6497 -2727 10516
6680 10516 7139 1878 13632 8628 -4949 1202 18334 25392 16686 8754 6500 3274 9783 14093
6666 14093 15522 16272 7540 1075 -12044 -19372 -11997 710 3965 -1072 1915 3558 7178 5730
6652 5730 5374 -506 866 5677 3426 -964 2585 11283 12537 7557 4527 -4879 -1901 15359 19261
6637 19261 13667 11353 20108 14020 11267 10726 20426 22670 19232 11512 2866 9197 20261 41428
6623 41428 53388 53301 45514 38313 36682 45739 52559 49078 47038 49907 54750 64050 88508 121632
6609 121632 165681 241051 360724 390281 299390 221550 184479 179764 188410 203486 216594 234073
6597 234073 277704 338586 435498 563687 726266 931318 1211455 1684701 2582921 4387382
6587 4387382 7850098 12210559 11668466 7619104 4416412 2707458 1857527 1396611 1118872
6578 1118872 907208 714334 573089 468463 391425 337534 285205 242552 210378 199159 208319
6567 208319 226979 302034 397051 374552 268421 187895 145207 114097 94789 93560 84603 66570
6555 66570 49193 36835 41283 43423 36346 33181 31443 27259 14652 4847 2003 -8109 -5548 -99
6541 -99 6738 9109 6072 8898 11967 10190 4592 -6597 562 53 -2313 -2243 -6763 -2522 1623 -5408
6525 -5408 -4475 -1073 -949 -1681 -12075 -11955 -2113 5274 2496 -1549 -1679 2667 17242 21089 21448 10514
6509 10514 2745 -9165 -1910 3922 -4250 -14286 -17357 -14572 -4761 -1748 10197 1858 -10951 -10928
6495 -10928 4379 4328 1210 5640 16041 22372 29134 30857 21955 10162 -247 -183 156 1787 -5891
6480 -5891 -3671 6659 5305 4302 881 3317 5292 -947 -4127 -1068 3125 8463 9439 7934 7800
6465 7800 8992 3428 -1637 -2342 -2427 -545 8031 6654 2059 -6473 -15966 -6080 4468 7203 9719
6450 9719 12987 18425 9495 14499 6653 -3833 -6863 -2311 -50 -2254 -3259 -12296 -5559 4013 11145
6435 11145 1671 -5176 2091 12046 15674 15642 19889 25794 27822 23331 12478 9134 6379 -4406 294
6420 294 10404 1889 -12629 -12977 -9571 -7312 -5969 4635 12677 14732 5023 9263 13952 18578 6646
6405 6646 -10763 -17977 -745 8959 -2435 -13443 -10763 -7452 -15027 -10516 4134 16608 8544
6392 8544 -8641 -17734 -8193 -5185 3631 5692 1966 2992 812 -3602 -911 9856 8456 7996 -2037
6377 -2037 -11748 -3766 7735 18924 24955 17392 5261 -1418 -4819 61 683 4644 11652 5914
6363 5914 -5032 -13923 -7167 -5895 -1683 9396 19492 15343 -373 -5994 4664 11094 7631 9820
6349 9820 6749 -2864 -7848 -7382 -26391 -29050 -21631 -9701 -10007 -11261 -7042 -17796 -19876 -6478
6335 -6478 -2381 3879 3129 -6888 -21161 -15849 -7091 -13365 -12036 -5606 8109 3849 -2923 -6868
6321 -6868 -4305 -4675 -11236 -9518 -4924 2896 417 -16151 -25038 -17424 -13727 -7360 -17040 -18700 -7300
6306 -7300 2998 -5382 -19305 -20733 -25123 -24925 -21101 -21168 -4769 1773 73 -2972 -8666 -14815 -18870
6291 -18870 -15019 -8908 -10349 -14924 -3285 5167 21847 19389 5225 390 -4673 -3384 -352 -8621
6277 -8621 -13667 -2547 -1604 -12247 -4308 6334 2399 -2098 -5180 2923 1036 538 -13171 -16254
6263 -16254 -7612 3280 9170 11705 8791 8774 9638 -2706 -5140 -7568 -11425 4198 12866 17502 4527
6248 4527 -5104 -7449 -7400 -9737 -9937 -11770 -2767 -13769 -12847 -11630 -1222 -4095 -9912 -5028 5370
6233 5370 7981 7075 10152 7496 -5583 -8370 -6112 -5217 -759 3603 1630 -4340 -2141 -11358 -14935
6218 -14935 -13014 -17430 -8455 -6240 -6573 1752 7726 16571 36898 47715 40839 31194 23692 24436 24139
6203 24139 16577 10342 5792 -5722 -5087 -9672 -13204 -15926 -15709 -18855 -2086 -3096 4034 -1049 6120
6188 6120 12208 10650 4546 -921 2101 4178 13782 15290 2770 -16988 -22020 -13427 -2128 -6237
6174 -6237 -9479 -14097 -6793 -5752 -6108 2598 -1433 -8717 845 5221 15568 12154 -4305 -2446 -622
6159 -622 -6929 -21286 -7493 -5847 -9006 -15615 -5324 7662 3260 -3885 -12164 -12524 -7842 -11163
6145 -11163 -2875 18952 22303 18225 15286 9671 690 -4180 -7153 -9119 -9335 -3521 -7599 -16546 -21146
6130 -21146 -15994 -9961 -856 126 -9315 -9620 -4811 -11900 -8007 94 -4361 159 -1429 -19030 -6888
6115 -6888 9092 9096 3414 2895 8982 9300 421 -15245 -10356 -5998 -10262 -6412 2846 -3143 -16215
6100 -16215 -15502 -9044 -6844 -8688 -6829 -11256 -11874 -5639 -11474 -18877 -5592 3008 -3640 535 1426
6085 1426 42 -6284 -12468 -19993 -13898 -15384 -21808 -11350 13988 17742 12887 275 -22477 -36141
6071 -36141 -32452 -19351 -5055 -3374 -15474 -25971 -12414 238 -4821 -18867 -26022 -15796 -7352
6058 -7352 -10738 -3930 3315 -6028 -7323 6190 7441 -3756 -9017 -7748 -10470 -9991 -17737 -18637 -12082
6043 -12082 -7483 -7245 -7542 -19344 -26658 -22076 -8005 -3368 -3723 -751 -673 -6806 -8260 -8845 -18231 -10333
6027 -10333 -8224 -14787 -16493 -4247 9323 15774 15703 14689 9281 9213 5973 12694 23414 8967 2417
6012 2417 4916 11409 2796 -7460 -17795 -10369 -3824 -71 -3063 3616 -8292 -11314 664 532
5998 532 2707 7477 3531 -9926 -7672 -13614 -10867 -9045 -4488 1643 5540 -2204 -13 2646 795
5983 795 -5961 -6185 -847 7593 12094 2764 -136 14622 13996 12098 9965 9402 9957 6782 2998 -5915
5967 -5915 -3486 -6239 -7582 -7080 -14128 -21201 -16989 -13134 -10796 -772 -4212 836 1362 8203 1056
5952 1056 9927 11825 7319 1106 -3032 -6774 8650 17542 7769 156 11614 24107 30261 18605
5938 18605 5531 -16744 -25059 -17197 -14026 -15566 -10211 -13892 -14408 -6373 -7610 -6458 5853 11553
5924 11553 1749 -6619 -6453 -4869 -86 -129 -5117 -11099 -20803 -12605 3900 -1791 -2813 -3928 -1505
5909 -1505 8790 10995 15459 9684 604 1590 12843 11004 -2625 -11285 -11949 -1718 -8884 -19668
5895 -19668 -10098 1353 -18064 -34282 -18624 -10407 -3364 -7986 -15930 -13594 -924 4869 -1004
5882 -1004 -4027 -4361 -4380 -4145 -12667 -17372 -7869 -13783 -15682 -2270 1624 -12802 -8943 -7475 -14912
5867 -14912 -7076 2662 5169 3578 775 -2199 -2229 -10635 7158 8903 6933 12170 3524 428 -5221
5852 -5221 -8809 -12242 -12464 -11141 -7453 -13298 -12939 -9777 -13451 -14892 -20033 -9772 -1485 4467 3080
5837 3080 -14391 -20650 -3495 3860 -11181 -3480 -3834 -13358 -19546 -15703 7338 10324 8897 -1431
5823 -1431 -8832 -5554 -8193 -13924 -9619 5728 15801 11903 6345 -7192 -6747 -4379 -9868 -9783 -12032
5808 -12032 -6702 -7396 -11075 -8927 -8368 -8127 -8965 5930 22058 7910 -7931 -11367 -18735 -13836 -10290
5793 -10290 -7040 -12785 -21459 -22536 -17212 -4836 -4929 -9763 -14969 -10480 -4793 1019 5939 1501 7593
5778 7593 10057 3407 -9021 -15919 -7195 -821 2643 6814 11731 2294 -6848 -2640 -8242 -15184 -13573
5763 -13573 -13068 -11558 -2438 2604 -983 -11513 -6928 3268 -2290 -7141 -1733 1213 -1406 5266
5749 5266 10153 10468 -2118 -16369 -20190 -10583 4028 6515 1164 369 -2531 4168 13197 2962
5735 2962 642 13775 16464 7499 7065 13933 2470 -2222 -657 -18724 -24514 -21550 -23277 -20387
5721 -20387 -10450 -7712 -17789 -13789 -7053 -5392 1575 6452 6807 3971 2802 7368 14638 6073 -1464
5706 -1464 -3123 -9457 -10392 -12762 -11229 1928 -408 -11869 -14180 -13132 -17149 -13411 -10591 -15962 -19089
5691 -19089 -15711 -4736 -5960 -6176 -10211 -15698 -21633 -22217 -14489 -6503 -13230 -16115 -1023 3654 1577
5676 1577 4232 -6853 -11170 -3353 3019 7098 5163 7021 7452 3250 -3239 -1297 15379 21437 10697
5661 10697 3667 11406 -536 -5727 -6491 -8739 -8256 2607 -6314 -6409 -4672 -8184 -12411 -2815 925
5646 925 8634 -5367 -9354 -2633 4882 4370 2150 -4618 -11937 -10128 -2880 -2142 8240 1538 -482
5631 -482 7340 7405 -637 -5220 2938 2146 4870 1677 -4557 -8439 -12249 7161 9654 9854 11466 7096
5615 7096 10997 11444 16140 22058 18996 14547 10748 -607 -889 -2598 -10117 -10848 -8315 -12573 -8156
5600 -8156 -10397 2358 3767 -1630 -8049 -8539 6001 10207 -1448 -2786 5439 14445 11231 -4588
5586 -4588 -11792 -419 2700 1280 1859 -12650 -19722 -7705 -3081 -4032 -3619 -10565 -14509 -11562 -15981
5571 -15981 -13756 -6770 -9065 -16057 -19414 -12964 -8995 -18010 -23447 -16718 -9983 -1703 -9546 -15588 -19255
5556 -19255 -17883 -13986 -16546 -16541 -11974 -6526 -3530 178 2602 -2234 -7086 -12320 -5532 -14063 -18127
5541 -18127 -15090 -14852 -12812 -16530 -27443 -26068 -22022 -21177 -8475 8876 821 2416 -4974 -3219
5527 -3219 -5971 -13147 -4419 -3998 -8168 -1638 1885 1063 -877 1359 -5813 -15402 -9252 -9169 -21696 -23816
5511 -23816 -23250 -19280 -11863 -12873 -13041 -28316 -30314 -17528 -11408 -8886 4501 -4542 -9308 891
5497 891 1789 -1475 -9716 -13337 -159 7332 10050 4994 2868 6758 -4346 -17682 -20243 -18572 -344
5482 -344 -1440 -14360 -3625 -4382 -9497 -4038 -9589 823 7387 11285 13562 5135 -4446 -5308 -10452
5467 -10452 -6401 -342 5222 10133 19509 9370 8428 5760 -4271 -605 2211 -4392 -1337 5333
5453 5333 5909 10016 12911 1059 -2518 6287 6366 -249 -1770 -6427 -9972 -14235 -19187 -3276 4298
5438 4298 11230 -3859 -17787 -15584 -5533 1590 3718 4181 7446 9010 10852 4619 -5989 -5062
5424 -5062 -1813 -10507 -9662 -7311 -9516 -5630 2497 13316 20846 1482 -12755 -1605 5091 -1201
5410 -1201 138 10376 20947 20454 11312 8774 9092 11192 -4730 -13443 -26561 -22057 -11198 -5206
5396 -5206 -11315 -8233 -4002 -2396 -8633 -9588 -2772 2605 -12534 -11597 -12416 -15197 -17916 -13706 2266
5381 2266 17040 15938 8122 8277 3438 4187 8492 8711 3217 -1025 3616 462 -8591 -9728 -5162
5366 -5162 -7070 -8730 778 3610 4119 10190 1597 861 -4047 -8632 -3813 -7367 -9848 -7644 -1149
5351 -1149 7550 3960 5753 1530 484 4467 8421 8823 14880 5675 3776 9601 5234 -787 -1573
5336 -1573 3056 4217 -1605 1306 5048 3421 -3504 -4136 -2514 -1785 575 -4852 -8638 936 5445
5321 5445 1312 2155 1068 -5619 -14183 -8389 10243 14674 2985 1047 -5772 -4623 -271 151 -6285
5306 -6285 -7483 -2959 -596 3273 -1945 -4642 -9916 -15418 -22695 -23103 -7415 -514 7742 10474 -1682
5291 -1682 -13901 -10238 -4189 -3734 3798 -5112 -21410 -17671 -5557 5581 3704 -523 -8263 -19038
5277 -19038 -20595 -16389 -20755 -10309 6213 5963 1275 -1076 4126 11568 8578 3023 5406 2521
5263 2521 4456 8949 1747 -1214 -7051 -14731 -5700 3414 -281 -4407 -6325 -11061 6792 19953
5249 19953 19045 4783 -7440 -17345 -25460 -32675 -29850 -17734 -2574 14405 8653 7840 4995 -4054
5235 -4054 -10100 -12991 -500 -3977 -8059 -3521 292 8812 14302 10082 -878 -6228 -3348 -7610
5221 -7610 -7751 -9068 -13959 -7470 -8931 -13689 -7228 2779 115 3339 12830 3286 -18476 -17184 -12381
5206 -12381 -18209 -16081 -15386 -22321 -26217 -16654 -5933 -8406 -2891 -7319 -12653 -15772 -9418 -3226 2947
5191 2947 1387 -4739 -13768 -11641 -15587 -18739 -9998 14925 18500 5097 404 -2173 -28 -4147
5177 -4147 -2181 3173 1811 -4660 -7992 924 7382 21633 28558 18391 14463 7343 -5909 -16718
5163 -16718 -12803 3767 2823 6135 9289 3549 11943 17965 11006 -6327 -19207 -17210 -13726 -16716
5149 -16716 -15224 -10997 5017 10360 7189 -681 4014 13973 13356 6406 -8700 -11676 -11036 -8797 -13999
5134 -13999 -12354 -4108 -369 -764 6088 -6918 -14495 -8873 -17169 -14888 -13332 -6422 -9897 -18274 -12858
5119 -12858 -12843 -12493 -3616 -18149 -26177 -23646 -14984 -380 -2057 -3673 -10105 -10927 2977 1595 -1807
5104 -1807 -3704 -3519 3033 216 -1201 -6482 -17501 -19712 -16407 -7520 -7708 4204 17551 1214
5090 1214 -10030 -728 5186 11547 7795 -11105 -18201 -9554 -9526 -13419 -18395 -23578 -13243 -7548 -11178
5075 -11178 -14118 -9890 -1006 5994 4136 5758 -5411 -10971 -12112 -3486 23253 23346 29450 16262
5061 16262 18455 21439 4104 -6452 -7321 -4820 4003 7512 -9596 -14236 -7406 -218 -12075 -328
5047 -328 -1691 -11016 -7636 -11876 -13021 -21086 -13561 -10914 -13110 -21810 -17813 -16267 -11864 5441 17826
5032 17826 29672 15660 3026 -255 -7348 -3393 -5406 -6322 -7604 -6234 9763 20619 19666 16670
5018 16670 19333 6100 -7013 -7371 -2380 -2672 16029 25747 4995 -10492 -14030 -5192 -1855 500
5004 500 -3470 -4792 -5599 -13689 -10685 -2386 8828 8649 12115 8608 12160 12213 2885 -3645 2460 5710
4988 5710 4163 -9102 -13921 -8099 -9208 -2938 -8654 -10494 -8279 -3805 4311 6172 -1920 -21800
4974 -21800 -23378 -16535 -20808 -37700 -23400 -12273 -9868 -18482 -21514 -12879 -3933 3310 8975 7874
4960 7874 -7987 -14546 -12194 -6074 -9183 -1329 -13065 -26002 -24354 -21239 -15417 -11402 -12327 -14846
4946 -14846 -14483 -2773 -2607 -4766 5194 16008 3182 -4955 3910 -4418 -5074 -7275 -7461 -1389 6004
4931 6004 1446 -3973 -14845 -22763 -17309 -2855 2815 8133 9278 8469 6744 2344 6419 24069
4917 24069 27857 29139 20764 11944 16179 16777 10732 3376 -5426 -3919 -8443 6488 7631 -724 -8331
4902 -8331 -5308 3884 1905 3749 2006 9282 11605 6161 1715 -10066 -17725 -12339 -14146 -20319 -23635
4887 -23635 -7313 -3286 -2087 -653 -3643 -7813 -399 4945 20293 16404 3971 -9821 -834 22334
4873 22334 23292 14372 -8616 -12520 -3868 2940 -2946 -20376 -33060 -26806 -14776 -11621 -18498 -10406
4859 -10406 -3823 1492 3934 3521 405 -2676 -7616 -14389 -11834 -9686 -4801 -8898 -11031 -4372 -895
4844 -895 6808 5156 2535 -10386 -14984 99 2355 11916 7314 8375 -1314 -8637 1104 6212 4226
4829 4226 6010 15409 14503 11405 12170 8999 5126 6751 7059 3811 -5260 -14480 -3241 1721 -2833
4814 -2833 -8960 -9611 -7132 -769 4898 10366 6449 3356 3481 5881 -1788 623 -4124 -2567 -4596
4799 -4596 -12325 -12468 -4932 1427 7466 2869 -9970 -23141 -15508 -1200 9295 8163 2509 -9792
4785 -9792 -3233 -1073 -7237 -3318 -4373 -11954 65 9906 6255 12762 7781 4672 11494 6448 -4969
4770 -4969 -11766 -15884 -12224 1818 4612 11807 6625 -1515 -12335 -16554 -5263 6067 7974 4294
4756 4294 -5262 -2464 4690 10612 3290 -10563 -8565 6383 16170 8272 -6301 -650 -9894 -10077
4742 -10077 -1549 -1391 -2459 -2257 -206 6400 15133 14871 18844 18246 13328 8049 6521 -5689 -4418
4727 -4418 -13641 -13920 4667 12814 1494 -14006 -11564 -4537 -11840 -13573 -15480 -14025 -15685 -19308
4713 -19308 -14358 2529 10088 -135 -8411 -15792 -10448 9201 -1233 -13998 -9022 953 15115
4700 15115 17283 14444 13821 3209 1059 1687 11848 874 -11696 -5815 -6187 -15602 -19631 -22023
4686 -22023 -13712 3215 7656 7692 8904 3553 11865 18875 8051 8877 1994 1937 6025 526 -1149
4671 -1149 -3739 -2480 -4010 590 1367 1023 10012 -7325 -13189 -3823 3781 17255 11369 4168 6909
4656 6909 -2589 -3716 -1325 -10896 -9490 -1873 -8575 -8454 -21248 -36858 -32332 -9693 -1222 7276
4642 7276 650 -16662 -32688 -31649 -27389 -11806 -1695 6408 1441 -10218 -8340 -2845 -5623 -17920
4628 -17920 -15707 -6110 9140 5098 11212 -5054 -30125 -28819 -12721 -11463 -9617 -4404 3380 15140
4614 15140 11789 3353 -5452 -3312 11966 16038 1971 5287 2348 3574 214 -3059 -1724 9723
4600 9723 12260 1559 -15305 -26768 -25541 -20710 2036 20106 28803 25638 16706 5805 -12280
4587 -12280 -7605 2091 -9703 -8056 -2634 6746 -3523 2699 -286 -7361 -10071 -17218 -16137 -3463
4573 -3463 4153 8525 -5750 -10275 -9093 -7583 8524 12476 9331 5326 3215 -1367 2874 6422
4559 6422 1077 3224 -2397 -9246 -10914 -10666 -11497 -15206 -21660 -30235 -25028 -28402 -28640 -13407 -15364
4544 -15364 -21952 -14229 1 1086 -10829 -8998 -8253 -7129 -362 -413 -5163 -2516 2660 -6230 -15853
4529 -15853 -17569 -1610 -459 -17419 -25117 -23498 -14200 -10733 -7035 -11471 -14876 -10005 -11003 -16013
4515 -16013 -9620 -768 3440 -6179 -10043 942 9630 -1186 -10936 -11004 -11541 -6124 -9533 -7069 -4047
4500 -4047 -3567 -1296 5383 11376 14883 11134 8531 -1034 -5593 -10115 -15471 -313 8123 9126 8962
4485 8962 -79 -205 -7338 -15486 -22917 -18767 -12420 2080 -127 2001 -315 -2622 -8481 -7406 -742
4470 -742 7706 3374 -603 1519 2784 2760 15468 13410 5271 8620 11059 18687 17292 7788 5272
4455 5272 -1970 -10454 408 7106 17706 1062 -12794 -19391 -20268 -17399 -28364 -15126 11931
4442 11931 14145 9535 5125 -13844 -27897 -35338 -21616 -3474 5036 -3901 9035 12464 -360
4429 -360 7278 8007 3793 5201 779 3548 13022 16826 13952 18940 28465 19753 11598 15090 12800
4414 12800 14001 3714 -4058 4538 19214 17016 13860 16723 20763 14572 5198 1333 -400 -5127
4400 -5127 -13797 -13579 -9718 -7834 -17972 -23155 -28326 -18989 -6422 -10098 -9033 5025 8502 11856
4386 11856 8598 4140 8552 10696 8088 14474 5162 -3018 5224 17700 8347 -7030 -10530 -8734
4372 -8734 -10131 -12351 -18266 -20079 -24709 -25633 -26286 -15460 -7978 -16651 -16010 -4103 5532 7311 160
4357 160 1493 12732 19415 16826 11411 156 274 -1146 -10996 -9772 -17282 -16827 -7267 -3859 -1121
4342 -1121 2410 7729 -3315 -13398 -4139 4715 549 -7422 -29658 -30699 -16491 -13333 -12626 -2518
4328 -2518 1628 9346 9347 1139 3499 10949 17344 13611 10043 12598 24738 14089 23390 16991 14787
4313 14787 13352 3648 7533 13790 9518 3676 -1294 -3068 -20168 -25912 -10612 -4715 -2790 -7305
4299 -7305 -18270 -11437 -10897 -15240 -9859 -7518 -3699 10704 16990 14565 4087 7681 397 -831
4285 -831 -3030 5465 11905 11343 3929 -1563 1665 7270 8935 8255 11671 -7913 -22154 -21503 -14014
4270 -14014 -19779 -9362 2388 -5220 -8666 -2254 -7806 -11049 -1932 -1022 -4328 -5491 459 -2689
4256 -2689 -11851 -16339 -23108 -15062 -10110 -2851 -2719 -10973 -12265 -9204 -6143 -2615 6562 -1073 -6860
4241 -6860 -6438 -9168 -13880 -8625 -11050 -5935 11769 16463 11006 9329 14066 12556 14423 5183 -12195
4226 -12195 -24161 -23233 -26377 -24643 -18851 -21705 -26598 -27366 -25141 -13984 -13736 -5518 -7609 -7918 -9223
4211 -9223 5389 14281 9539 -159 -7937 -5308 -1864 -6821 -7022 888 4172 22250 25733 23033 17396
4196 17396 14888 17510 25671 27670 18204 -5180 -11447 -12999 -9163 -9477 -3126 -1895 -5853 1954 -1017
4181 -1017 -6354 752 3483 3556 3359 -1864 -9425 -11307 -10917 -3327 -4340 -4876 -9815 -11378 -2363 3049
4165 3049 -2744 -4434 1815 2023 764 -319 -7207 -12780 -10763 -8716 -21116 -23600 -27252 -19674 -2920
4150 -2920 5148 7429 4044 8543 7997 7185 -913 -13765 -16483 -5514 9810 1630 -12821 -15358
4136 -15358 -6046 -1767 -14756 -23397 -11347 -751 4412 2487 2620 -6011 -458 -1025 -3007 -13612
4122 -13612 7225 29719 18843 6117 13726 14497 -979 761 8290 3309 9515 13480 14163 10445
4108 10445 7505 15803 15450 -7825 -7841 -255 139 5179 13031 17839 8224 -647 255 -10150 -10638 -3574
4092 -3574 -6277 -14664 -10386 1503 11834 16261 9500 6701 3168 11640 13644 7789 7194 -3939
4078 -3939 -10321 -4634 211 -9894 -7971 4624 11909 -1436 3595 5975 6398 11531 6334 4884
4064 4884 1336 570 -657 -3399 1186 10775 10614 15066 15315 7499 1295 -2823 -13288 -15886 -666
4049 -666 1239 11979 19190 -4827 -21827 -9384 -2619 -2707 6784 3586 -1301 6742 1524 -418 1007
4034 1007 -4732 -2296 -3076 -8314 -9794 -13052 -6664 -11098 -19723 -17510 -22243 -23421 -17850 -3070 1641
4019 1641 4931 1195 2122 1238 -640 -14671 -10155 8343 -462 -5369 -13324 -13559 -5485 -3164 4148
4004 4148 -8240 -11485 -1548 2092 777 -7859 -10084 -7438 6036 5659 1872 3014 1616 -2786 -460
3989 -460 -5800 -12455 -15527 -15389 -20821 -10527 -287 -3397 -7746 -6688 -11077 -14144 -8051 -7225 4424
3974 4424 11172 9075 7363 8598 4112 -10615 -10075 -6633 8110 8982 -1825 5618 12426 14015 2003
3959 2003 -5943 -11242 -10050 -6049 -12266 -5417 769 3896 2624 9545 -1812 -8697 -6892 -6331 -1921
3944 -1921 -2137 8675 -1846 -8287 -14272 -22807 -18602 -11916 -7602 1557 734 2661 899 2618 -2238
3929 -2238 -6052 -12690 -12780 -10793 -5972 -14201 -15471 -4815 10416 26815 27219 18443 6242 2851 -532
3914 -532 3987 10520 410 -1574 1445 18761 19187 11108 -13 10471 17163 8992 -12500 -21871
3900 -21871 -15290 -18451 1542 10715 599 11459 20040 18737 11870 2423 1823 -503 -4286 5238
3886 5238 8783 4522 16359 17266 19499 14414 14429 6886 3629 -5099 -9966 -1252 1536 7466 1670
3871 1670 1052 -5939 -14367 -13115 -15055 -7692 -1964 -7866 -1376 -9271 -12721 -14599 -11182 3971 4826
3856 4826 6356 -9464 -17236 -10036 2081 5955 11263 13203 3235 1623 9427 10200 1746 -4759 -10166
3841 -10166 -10942 387 10726 17293 16680 5431 1542 6560 2390 3661 -1437 3191 4340 -1642
3827 -1642 -2251 6803 5264 -4548 -6317 3118 8280 5721 6279 5662 8394 7142 3409 3465 12009 8297
3811 8297 8525 9306 7801 1280 -4 13876 23247 17150 23403 13352 -6 8044 22496 12436
3797 12436 10659 10666 10719 12171 5729 3649 790 -5780 -3708 1766 -2933 2140 11374 14044 6588 15808
3781 15808 24552 15233 6039 7232 2151 9394 16941 12893 5847 10354 19137 24054 17767 8904 -657
3766 -657 -16863 -12544 -7872 -9518 -10692 -12777 -8655 -2548 1085 -8635 -10664 -11546 617 11051 8667
3751 8667 3338 -6333 -8459 571 278 3851 7819 14437 14539 8515 -34 -949 799 -3851 -5670 4161
3735 4161 2472 -5528 -6775 -11805 -6081 -13954 -15864 -16773 -9780 5911 4715 -6299 -7974 5186
3721 5186 10777 11303 10736 10760 15055 12088 8144 -7932 -16283 -12251 3877 10156 5528 2722 -5033
3706 -5033 -8519 -6434 -3776 -2797 3097 7738 -13075 -17260 -10290 -9558 -7743 -11107 -3161 -4642 3839
3691 3839 5674 -3592 -14644 -17899 -821 -1338 -8814 -1457 7035 6683 1391 4220 661 -14519 -15045
3676 -15045 -10691 -9383 -8090 -3487 -7176 -1707 -1493 -8328 -7409 4365 6540 7855 9014 6625 -9682
3661 -9682 -10200 -1381 12933 1030 -9644 -6789 -11204 -11152 1217 -2135 -6674 2215 -4419 -10399 -8419
3646 -8419 -19548 -15154 -2123 4810 7626 -36 -14964 -14315 -7784 -2370 -2006 -5521 1243 -49 -2106
3631 -2106 -1085 1169 3548 6101 10971 7000 6661 10855 16277 4749 -11867 -5362 3794 5213 9305
3616 9305 8706 2651 -3523 -5869 -7621 1776 10613 22460 12448 8565 9723 690 -4501 -5995 2461
3601 2461 12145 15335 14534 13496 7435 8189 7139 919 659 -10876 -10060 -1969 16864 9692 929
3586 929 -1320 6513 10939 10112 3127 3082 909 -712 -2489 6463 9636 13209 9534 -2146 -9275 -114
3570 -114 3997 17065 9632 3586 11 -3483 -9725 -14383 -7734 7523 2054 -17407 -18285 -12500 -7398
3555 -7398 2999 10447 1097 -4726 -511 -1772 1005 9103 12370 10159 7750 3851 -6300 -3213
3541 -3213 3218 7581 541 -3160 8009 9193 -1328 -4451 1772 5839 5598 5360 2841 -8564 6121
3526 6121 8306 7744 15102 15601 12861 3423 -679 -2148 -12454 -24120 -21306 -36055 -32793 -19608
3512 -19608 280 3552 1357 -12655 -13899 -8125 -8772 -497 10800 3581 113 -8033 -694 6365
3498 6365 -3866 -1722 4001 4275 -7319 -8347 -11259 -4323 3045 12432 14147 9880 -1648 -5565
3484 -5565 4207 4239 -2865 -494 4364 6417 3805 -10155 -10253 -10767 -10121 -8809 -3669 746 -3624 -14418
3468 -14418 -6044 -3700 -1934 5990 6968 4307 12430 20721 6322 8929 20052 16034 4514 -14571
3454 -14571 -23426 -18181 -16927 -20670 -18425 -16960 -28007 -27583 -27270 -20756 -17086 -10075 1990 11591 16373
3439 16373 4894 -2950 -10645 -5281 1229 -9863 -8538 -4427 -10482 -8231 -288 14101 13822 15993
3425 15993 7758 -3173 -9731 -8386 -2168 -4055 -3265 9372 12418 13862 3579 -11623 -11361 -4310
3411 -4310 7809 7767 12490 4307 -7686 -19924 -15569 490 8428 9548 20266 21162 3763 -1550
3397 -1550 -6450 -1818 6004 6706 7452 9657 4449 -1596 -6107 -5002 -7694 -17489 -18427 -9354 -6837 3459
3381 3459 21567 19741 13110 -2467 -28562 -23882 -14656 -7487 -4480 18272 28041 25278 20528 7155
3367 7155 -14405 -19129 -21388 -17285 -16140 -9643 2983 18392 9874 455 -3902 3820 6231 6593
3353 6593 4592 2007 1580 8225 5598 -12274 -19153 -6985 677 12195 20036 18073 13612 5812
3339 5812 2551 6631 -950 -19 551 -1448 -4874 -5291 747 -900 -8346 -8961 -6245 -4848 -14835 -24414
3323 -24414 -15606 -211 -4641 -7506 -3346 3141 12753 1048 -3876 -951 2350 -2570 -10566 -4642
3309 -4642 -5462 -6063 -6008 2254 7662 6704 913 -1171 1320 -2642 -3939 1890 8745 22375 24036 8546
3293 8546 2006 -7387 -11142 -20718 -14131 -5839 -2098 943 4653 -2051 -3171 -9562 -12459 -7778 2369
3278 2369 -845 -14513 -9129 -7672 -10146 -9056 -5860 1471 4770 -390 1664 4166 11697 9494 2881
3263 2881 -8437 -6773 11726 8199 7033 11331 9224 -5814 -13707 -8893 -1899 8430 14579 9006
3249 9006 6292 4831 9632 4411 -8173 -6262 -5568 -15638 -11378 -39 1295 7247 10451 10078 7474
3234 7474 -880 -9437 -4760 -711 -6557 -10974 -10054 279 19423 25811 13754 16332 14235 9425
3220 9425 5230 7342 16003 14745 9662 12453 16477 15707 7144 -8277 -4883 18797 19605 11428 8235
3205 8235 7988 8239 8569 9044 2675 4391 1019 -6957 -2608 13034 25123 19395 -2629 377 11874
3190 11874 5975 6127 10781 7926 -1076 -3364 -12577 -15586 -17039 -17375 -3447 5052 7092 4694 2073
3175 2073 -4302 -11166 -5488 -8931 -16496 -7263 4262 9203 3523 3774 -3068 -8986 -14306 -15443 -4149
3160 -4149 3438 4013 -6025 -4238 -8888 -3444 -6030 -19685 -5999 -2273 151 4306 1377 9421
3146 9421 14568 16687 5794 291 -2936 9489 11973 5906 2478 4352 10584 6869 -11192 -11266 -3616
3131 -3616 -3580 -4746 -9765 6762 13371 3039 5504 6148 -2235 -12065 -23428 -6841 11498 3147
3117 3147 359 8338 17088 10446 -2238 -1151 725 5890 1736 7542 19904 20375 11377 -1048
3103 -1048 -7907 -2260 1774 1627 -5816 -6986 2775 11496 10584 8164 6635 2460 -947 6149 6649 -5771
3087 -5771 -11458 -15271 -12679 -6937 -3110 -11071 -14953 -65 6014 6003 10234 7421 5150 4609 -4971
3072 -4971 -8806 -7103 2100 -272 -6727 -672 3410 -3806 6347 12942 612 -3153 1923 -681
3058 -681 2944 3986 5931 -3466 -3506 6171 6758 4844 -229 2570 1406 2219 3546 -1546 -3293 -9245
3042 -9245 -9683 -2078 8278 11764 13144 11303 21239 23618 17900 11300 4705 -3861 -11634 -13563 -3532
3027 -3532 -929 8266 11832 11465 13308 13935 7628 -405 -5656 3307 9620 4644 1445 -275 -3846
3012 -3846 -8464 -6759 -2677 -929 -3414 -8405 9685 23105 19634 12741 13164 19206 15026 7782 6715
2997 6715 5755 -6372 -535 -10427 -6563 17025 23885 17144 2835 -2904 12167 11676 3064 -14724
2983 -14724 -14474 -4930 6013 10590 5743 -4510 -4152 -6568 -16775 -14539 -6905 -6611 3171 361 -4550
2968 -4550 12003 8972 -1838 -6541 -10206 -987 2929 5671 8893 7959 814 6147 -3935 -9545
2954 -9545 -13880 -21246 -15170 -10185 -7071 -11405 -10368 -2884 1650 -4753 -15318 -8008 -4127 -3759 -4655
2939 -4655 -1003 1674 7031 8600 -1184 4377 11060 4731 11170 18711 10117 -2264 -5603 -9961 -10197
2924 -10197 -10799 -9779 -8749 6668 6968 1389 1830 -9132 -18366 -24267 -20965 -28932 -24605 2134 11107
2909 11107 9130 -4027 -6674 -4329 -3380 3822 6156 13945 28724 27484 20123 26853 26116 6296
2895 6296 -14101 -5973 8696 11752 3216 -5518 -12454 -1953 -136 1786 10058 5730 -4898 -2374
2881 -2374 8375 16273 11080 7048 8174 2457 -5973 3347 6323 8701 3570 -1313 268 2954 -564
2866 -564 5829 1513 6125 3248 286 -6282 -18454 -16959 -8552 -7171 -124 11485 9311 16945 3362
2851 3362 -154 5270 1810 -6040 5278 9084 3055 -1860 -143 3059 6676 11770 4698 813 -4330
2836 -4330 -6049 -12098 -17472 -372 -1052 -6330 -11861 -12612 -6846 -8067 136 5715 -3301 -7590 2454
2821 2454 13122 11412 7116 15535 22549 28067 26168 15847 693 -9243 -7000 -5495 -6125 -25432
2807 -25432 -13382 -3742 -1204 -5178 -6532 -3982 5493 -417 10584 14337 3660 -13076 -20550 -13567
2793 -13567 -11872 245 2476 932 -1871 -3486 -4039 -1871 -3009 -14656 -6100 -6721 -549 -3742 -15269
2778 -15269 -17853 -14122 -7379 5769 13152 7191 -6456 -8952 5351 7612 4722 8546 10333 6502
2764 6502 4001 9891 2889 -4318 2484 1515 -4520 -4197 1442 11862 13079 1720 -6064 5846 4607
2749 4607 6877 5740 3340 1596 -13644 -14984 -9549 2359 6118 -2892 -747 8282 4632 3522
2735 3522 -9584 3762 16879 16837 13484 11653 4195 9026 13280 23047 20281 22188 16997 13166 9155
2720 9155 12706 2087 3549 8381 6489 -5816 1005 4612 4210 1918 -4433 4934 13378 16895 16684
2705 16684 10178 3524 -3036 2655 2179 10112 4493 -4032 380 13975 2656 -11316 -8955 -206
2691 -206 737 -4838 -2586 7084 6298 16689 19622 26540 19326 4997 2026 13882 14575 20958 24157
2676 24157 16381 15545 9345 2585 1789 7594 883 -1150 -8133 -18393 -22975 -17118 -12724 -8071 -14785
2661 -14785 -7077 -912 -6308 -4730 -4550 -2595 15987 18407 11383 15219 24473 15853 15139 1340 555
2646 555 199 7912 -2585 -2574 1877 2783 1361 -377 -8221 -5007 2536 -1306 -24410 -24083 -9896 -15009
2630 -15009 -17628 -17105 -7038 -400 -2460 -4361 203 -5240 -6120 -11584 -11510 -10182 -19889 -17804 -14851
2615 -14851 -9513 -8595 -11346 -17103 -9485 -11310 -5348 -7123 -7551 -1088 4163 1022 5328 -153 845
2600 845 19401 15680 -3027 197 -1084 -20973 -21032 -15326 -1178 10714 14728 19036 21081 15140
2586 15140 7079 -2768 -19949 -26517 -18825 -18243 -2428 9893 7533 15993 22292 19541 20070 17688
2572 17688 7840 13501 14811 2912 351 8089 8443 15281 27438 19185 9720 16220 6939 -2239
2558 -2239 -824 -9424 -11478 -4024 -10765 -11198 -991 -1094 4076 2893 7980 17824 15675 4447 -9440
2543 -9440 -12024 -14772 -7955 -15817 -21259 -21305 -27180 -26786 -16827 -12364 -8214 -10520 -3837 -509 5500 1231
2527 1231 -11613 -4555 4332 -1717 -1071 5423 13593 15685 20135 6130 -11403 -5337 -647 -2233
2513 -2233 8305 15424 15163 8477 -1008 -1736 -1585 5696 14683 7626 7414 10302 19144 14343 5802 2083
2497 2083 -649 3174 13685 21472 15281 8188 -1696 -1711 4262 -4186 -5472 -1019 -2278 -13217 -16709
2482 -16709 -547 3519 9725 15688 6635 2033 5474 3943 19301 9191 -8023 5381 12251
2469 12251 9250 16182 19305 14114 -5660 -2942 9621 6491 -312 -3648 -3599 -9820 -11771 -11676 -13643
2454 -13643 -16644 -16788 4904 6388 -362 -10107 -596 5879 14981 6895 -588 -2592 -7969 -5800 1464
2439 1464 7782 9551 4787 12286 9515 15606 22021 12126 5400 11512 8829 11986 19412 11260 -4137
2424 -4137 2851 4118 -7524 -12460 -14253 -23058 -11351 4729 4249 -7082 -20098 -22438 -21528 -19056
2410 -19056 -7753 -10970 -6957 -7208 -2492 3725 9109 5508 -5475 3853 8332 6272 -6482 -8037
2396 -8037 5909 2917 7439 13766 -2261 -6324 -9258 -4524 4216 2512 6281 15787 21305 25236
2382 25236 22149 12687 10805 13256 9386 6000 -713 -825 3276 11278 14265 10976 -5468 -6299 7136
2367 7136 8981 -1067 -5750 -1429 2026 -2138 95 4336 2679 -8690 -7432 2320 6350 2750
2353 2750 221 4166 -747 832 3868 11532 3775 -5894 -2673 6605 5746 2224 6553 8370 -494
2338 -494 -1437 3587 -7397 -14332 -17579 -13144 -8373 -19637 -24543 -23235 -19756 -13189 -1218 25 8221
2323 8221 16142 10672 6996 4187 4002 -3140 -13863 -9042 8848 14166 12490 8739 692 -1605 13451
2308 13451 21700 16872 9058 6194 8150 12833 13626 16037 9609 -2385 -11898 -2732 2579 13693
2294 13693 14749 20053 18495 10890 3738 5569 11125 9617 -14529 -12723 -315 3807 -3379 -13668
2280 -13668 -6277 -6216 -5732 -7493 1237 10981 12374 10947 16071 15258 14080 7941 2780 5294 6985 -1963
2264 -1963 -3846 -859 -4812 -5816 1422 8309 7525 11991 904 2953 6324 -67 -2296 996 1988
2249 1988 1072 -5371 -16050 -12399 -2263 1582 4321 -1963 -10366 -18918 -33838 -28659 -16051 -14770
2235 -14770 -15438 -15012 -2774 -6116 -16030 -19820 -5357 -5167 -7693 -5281 -1668 -2786 1998 12232 4337
2220 4337 1908 5627 7479 9710 10038 2711 678 3783 -1355 1556 9752 17459 22906 14824 -54
2205 -54 -4669 -2052 1145 -8522 -21850 -16007 -7756 -1569 -8311 -17192 -30534 -20493 -1816 -13238
2191 -13238 -18864 -14780 -12910 -3201 8993 6877 -4522 -2841 6867 9408 10557 7679 3350 2697
2177 2697 6570 9389 5659 1320 3138 -3515 -5826 -13136 -16570 -11282 2549 -5152 -2959 -2875 -331
2162 -331 -11358 -8038 -5491 636 8579 2115 1452 398 -9528 -14093 -13021 -11612 -16044 -6859 25
2147 25 1497 10224 6317 5309 13155 21423 19000 14777 2973 -2738 -539 12810 10309 4185 8350
2132 8350 12095 7084 -888 10873 5479 -9559 1506 17675 17690 26394 30536 27776 28419 15188
2118 15188 18677 11439 295 -2850 258 -2593 1621 15844 15152 2559 -4471 -5817 -12074 -17316
2104 -17316 -10215 -13255 -10354 -4360 525 -4286 5242 8249 8389 10664 7288 12420 6130 -6653 -1211
2089 -1211 16180 27028 20237 18175 24538 20053 5508 -9066 -7948 5935 -2755 4950 15819
2076 15819 12607 -195 -5594 -5287 1579 12738 11508 -19827 -17570 -6742 -17150 -20910 -17809 1796
2062 1796 -7785 -8940 -12321 -6875 289 -2310 3339 8216 8206 4377 3969 9135 16018 24294 17486 10521
2046 10521 14750 10907 1190 -6502 -9103 -4168 5154 -8847 -11121 -10658 -8118 -5266 801 1645 -2274
2031 -2274 -7732 -1208 -2652 -7742 -7693 -4471 2166 1118 1366 2438 999 -140 5010 9469 4401 -4213
2015 -4213 -3416 5501 -246 -6946 160 3895 3506 1003 3448 2909 -3931 -7612 -1876 566 5364 2507
1999 2507 5897 15599 6089 -7232 -12124 8574 25427 27908 19309 13239 12337 3284 9950 3846
1985 3846 -4721 -8877 744 -4685 9226 14209 -344 -14437 -15588 -13437 -7163 7206 10441 368
1971 368 -5838 -3535 -2791 -6009 6132 14703 3709 -1342 2360 4663 9835 9511 2496 6158 13582
1956 13582 4559 -7685 -13261 -4313 -7974 -3722 -3913 1824 2476 5668 8529 13065 12081 5994 2015
1941 2015 -2898 -14059 -15487 -10282 8809 21846 25303 23848 9327 10956 14227 18107 17293 23677
1927 23677 19446 18999 26636 27726 14394 17933 21413 22299 17376 18788 13564 11271 9691 6917 17162
1912 17162 17250 10562 17321 25874 22804 8600 -4435 -9960 -6436 -3161 -8210 -18972 -21181 -11297
1898 -11297 2815 4619 -1027 2539 11870 9234 8918 17693 15991 13816 10791 5976 6453 -12016 -33066
1883 -33066 -41666 -27237 -8459 -3392 -8002 -17158 -17580 -10231 -1576 -5277 -11569 -12091 -7606 4702
1869 4702 9085 13305 6898 -2302 3157 12864 7850 2238 -1985 1247 -8732 -8735 2525 13605 25440
1854 25440 28434 29382 23356 15902 13345 14855 2808 -5865 11793 10007 4515 15422 8760 2122
1840 2122 -6916 -9988 -4093 892 -11533 -19673 -17553 -8838 -8963 -9371 -8052 -1246 -2229 3786 -5889
1825 -5889 -16414 -10172 -13121 -18599 -19360 -13491 -12017 -14249 -14147 -12154 -11147 2550 6158 179 -4462
1810 -4462 -7335 -6939 7045 4587 8535 11995 11480 7226 5470 6255 7862 10761 20207 -734 -8915
1795 -8915 -2682 -4121 -881 615 -3700 -3783 5071 6459 7071 3289 -4924 -11545 -11718 -4103 -1699 -6752
1779 -6752 8565 13351 754 -7926 5039 -2815 -9970 -7858 250 2107 -2900 4246 15949 11196
1765 11196 5686 8739 10021 3678 -7297 -9482 1691 11274 6825 5805 9624 16039 9199 10142
1751 10142 11951 9376 13792 493 -10244 3041 16000 14763 19938 23225 17745 17265 12592 8586
1737 8586 -1493 -3039 -15385 -15417 -155 20760 25677 5996 664 5426 77 -3330 -8968 -9581
1723 -9581 -4980 -1354 -3939 -7966 -11319 -14181 -9744 1388 4129 2331 3856 6004 4584 4115 2666
1708 2666 5338 12140 4080 7955 8053 247 -12230 -6971 -5093 -10276 -9632 -400 11750 16701 7605
1693 7605 8945 13473 5454 5803 6811 -1544 -8138 -6292 878 2867 1190 -95 -1891 6153 7356
1678 7356 9253 8449 2428 -513 -9546 -17772 -14064 4520 12708 16826 9644 4708 4220 10655 13965
1663 13965 8491 -1869 5638 27101 31260 9570 -5558 -5708 2543 13591 19054 13145 10521 11856
1649 11856 2470 -361 -3732 -289 -5008 -5658 -12159 -11445 -6996 3658 3464 9530 14831 10036 12167
1634 12167 8185 16099 14883 10806 6603 -142 215 -5082 -5835 -1818 -3263 1843 365 -2709 -2648 -1575
1618 -1575 394 2484 11371 21149 17782 8416 -8453 -4840 5153 6909 5626 1646 -4083 -86 -2499
1603 -2499 -11418 -4203 3026 -5168 -7452 -9568 -21324 -13328 -5971 -9367 -14323 -14328 -16392 -15588 -12173 -9132
1587 -9132 -2329 -7546 -5231 -414 -7821 -11678 -3068 7175 11426 1936 3068 3579 15130 3240
1573 3240 -1927 1267 5543 -3605 -12786 -8733 -11076 -17199 -15919 -3298 78 -5494 -9679 -6468 3663
1558 3663 14264 14167 1362 7356 -585 -5733 7838 -2806 -11969 -10088 -11406 -2115 7901 19169
1544 19169 9902 -515 -28 2907 2309 -10169 -7437 -12068 -5718 1501 15013 26320 18608 18317
1530 18317 20347 22677 29163 26535 10127 -14904 -19486 -3552 10160 3320 -3673 -7410 -13608 -9114
1516 -9114 -13546 -26852 -18861 -2827 -3255 -1688 -2057 566 19328 18416 17418 5408 -1751 -1156 5115
1501 5115 10693 12755 15884 19404 5962 -1238 9582 20774 27841 17191 -3633 -13980 -14390 -5853
1487 -5853 2129 6872 9840 11205 7831 -8511 -9180 -12204 -2439 12497 3904 -3514 -3458 -2462 3426
1472 3426 9023 8657 8050 3222 -3829 2606 766 -2817 -10179 -4202 6167 9674 19871 19852 2468
1457 2468 -12137 -16900 -6704 4616 9557 8283 3536 2289 1553 6740 8302 8462 3660 4107 4301
1442 4301 -1585 -3565 1858 -387 -10461 -12225 -9210 -979 2558 13085 11364 13088 19303 9952
1428 9952 -6166 -6746 4500 7467 -10333 -9497 -6581 -5200 -868 -4914 -2079 -3108 -3713 13429 20654
1413 20654 16851 19761 23838 26795 16701 28329 29098 17072 17043 10135 -3762 -13632 -10058 -8865
1399 -8865 -4725 -5602 -5123 1288 3844 -491 -10098 -16886 -10085 2402 -11095 -14370 -995 669 1115
1384 1115 2366 -499 5737 1257 -2106 -4393 -16163 -10541 -12532 -15866 -11221 -15319 -18467 -14825 -14760
1369 -14760 -13938 -15135 -12287 -9776 -4014 4204 7038 4024 15271 18755 10196 11287 14391 6468 8328
1354 8328 1423 -2088 -5724 -7574 -4827 -4684 -3360 -346 -5306 -14995 -16174 -5258 -2330 1277 135
1339 135 -1848 5900 19740 26218 26558 12619 -5878 -1633 12012 17137 13068 7154 -1116 -991 2435
1324 2435 6627 1961 4658 5353 5272 11217 7826 -2952 1228 6869 1486 1435 -4177 -5431 -6497 -11244
1308 -11244 -16211 -8886 70 974 -2004 -4318 -12549 -5464 -4160 4036 4795 8275 11040 17801 12678
1293 12678 -2146 -8521 -16463 -18538 -8842 -881 3169 131 -891 1110 -3563 -24879 -20791 -13557
1279 -13557 -3560 -6136 -15022 -20959 -17645 -16506 -10966 -708 3821 2543 -5315 -4644 -3762 1591 2576
1264 2576 -10998 -18447 -19798 -11364 -6066 -4288 -8284 -14691 -10131 5101 2650 1141 14596 20612
1250 20612 8829 -312 -2034 11242 15626 14438 20808 13718 16263 12544 -1767 8716 27214
1237 27214 20296 13914 13184 17472 24337 27181 10363 -7970 -8204 -7569 -607 7917 22363 16865 6249
1222 6249 13584 26391 35345 26925 17488 16399 15966 18256 9510 -1504 -3158 2341 4760 4584 5475
1207 5475 11066 2494 4210 -835 -4581 3621 11477 15121 8093 4776 5835 6945 13305 6202 7149
1192 7149 4153 2429 4721 9680 109 3431 10234 19568 6125 -87 1439 16704 24782 5501
1178 5501 -9417 -17295 -8509 4283 1073 4548 7722 18784 25430 12915 19867 18751 -846 -3745
1164 -3745 -8386 -5663 7921 3624 -7839 -3744 179 7477 13434 21989 20350 8988 6742 6169
1150 6169 7355 10693 14558 9592 10797 362 591 26187 29451 30730 28722 26311 16242 -3484
1136 -3484 -12989 -6879 630 24806 25105 10499 4613 822 5416 7538 7642 -117 -703 -2460 -2614
1121 -2614 -13019 -12713 -6300 9378 8900 2303 12826 23613 15248 7494 5395 4514 9928 -2267
1107 -2267 -4816 -5187 -12858 -5551 3865 -291 1295 5456 -7705 -16029 -3052 -6009 -1636 -5947 -13404
1092 -13404 -8613 -8749 -15429 -16639 -12795 -4674 727 -1646 -15571 -28359 -30867 -15528 -5454 -3119
1078 -3119 -4288 -3868 -3713 -6137 2610 10163 -3482 -5220 -9168 -14556 -9998 -6151 -16772 -10955 -4857
1063 -4857 -15159 -12600 -10411 -8018 -1384 15515 19272 12605 1933 -5047 -15322 -14690 5829 11078
1049 11078 -1655 -5246 -13582 -12567 -4075 -548 2730 10147 2280 -5331 -8048 -5039 2085 12565
1035 12565 21147 25145 28714 37734 22302 7731 -1579 3361 -343 2303 256 -8606 1710 18638
1021 18638 7950 11608 9415 -5680 -16377 -9866 -700 5416 10484 8417 11784 15708 13723 11426
1007 11426 16055 20173 11386 7635 -3415 -7922 2411 13614 4274 1314 9078 7792 6424 7531
993 7531 5016 4326 8998 166 -7571 -1947 3168 3288 -11265 -16671 -10007 -12903 -8861 -7939 -6581 -8119
977 -8119 -674 -393 -6999 -1250 -3759 -2132 7631 11156 8288 1832 -978 3134 4405 5441 9862
962 9862 9882 4158 13542 5645 7510 9258 -1451 -12478 -3872 13258 15800 6823 9937 13723 1109
947 1109 -13841 -6634 2518 5485 3150 2721 -11302 -14903 -11867 -18608 -23211 -16801 -11448 -8516 840
932 840 8566 5680 2171 1670 2153 2603 11193 14115 16864 9448 17241 8936 3526 -4935 -11397 -7121
916 -7121 -1483 8642 11685 2131 -9168 -5850 -21591 -18691 -4224 -6367 -89 876 -668 -10877
902 -10877 947 3058 4165 9080 6546 7230 11109 7134 1874 -4025 1040 9485 12139 13797 1132
887 1132 -1011 -3265 -1017 9400 3664 734 -4560 -18657 -19497 7800 17074 11865 1575 -4821
873 -4821 -6812 -4955 -255 4159 4517 -4199 -13687 -7313 -7382 -2158 7771 1810 4876 16702 14651 5672
857 5672 604 -8123 -18554 -13766 -3177 -6294 182 6669 -4086 -2342 7226 1283 -742 -7744
843 -7744 -23870 -21985 -20014 -30347 -33961 -26909 -24654 -6875 7378 10846 15130 19991 30367 15351
829 15351 1245 2356 4083 -11177 -17734 -13541 -8865 -3886 -13201 -10430 -3991 1534 -3209 -2651 -9877
814 -9877 -11774 2266 18795 13459 7016 2211 5887 2911 14441 12567 2719 1146 3722 -1080
800 -1080 732 4628 21595 26193 22218 3186 610 -637 5057 15435 8871 8062 14864 14081 4657
785 4657 -14268 -8251 -7549 -15286 -8150 -10366 -1100 1689 -1602 -3650 -2269 -1224 -5501 -7681 -9189
770 -9189 -9811 1557 1501 -3621 -616 -2108 -6060 382 3556 -6159 -5697 1648 2929 -2345 -9195 -12311
754 -12311 -7530 -5290 -2517 5952 3843 5404 6155 11107 9388 -102 4896 7982 300 5710 306
739 306 -1364 4498 13244 15214 9334 2148 -3234 1580 2627 -1420 -10669 -7148 -6605 -5125 -562 5733
723 5733 1772 -3240 -10986 -11255 -11406 -9740 -6926 -3090 -1489 2476 14018 14069 8194 323 2650 -93
707 -93 5355 15099 4382 -9391 -10950 -14533 -4503 -2813 -4125 4404 19425 10026 -4641 -12562
693 -12562 -23290 -25365 -18621 -15290 -12018 -7392 -4464 -5453 -4366 -4409 -3785 -5113 -852 1307 6930 4908
677 4908 11194 14334 14773 -843 -8286 -12697 -9311 -11116 -9646 -7552 -11961 -15912 -10308 -11715 -9858
662 -9858 391 7190 9872 6975 -2379 -1630 3616 4214 3569 7677 15776 16057 8672 9986 13656 9532
646 9532 3938 5842 19914 22167 19891 7055 5170 -2679 1482 1742 16846 29170 13256 -1002
632 -1002 5126 12987 11380 10212 7923 -2505 -10707 -3394 -3523 -6865 -9941 -10332 5589 13627 6065
617 6065 1393 8656 13507 13199 3254 10851 3594 -5790 -2671 6927 8378 7756 17738 24137 15180 3234
601 3234 530 -1025 -14634 -10772 2003 -8963 -17508 -12480 374 11275 5644 -1290 4992 9224
587 9224 -1208 1427 12581 15534 2288 -11080 -17913 -18477 -21249 -9723 -61 6146 9409 14415
573 14415 10604 -4665 -10652 6122 4590 2815 5176 6965 -1786 -1166 2630 -8617 -12659 -15945
559 -15945 1560 1325 -10654 -9676 -7145 -5842 -514 8578 14867 12244 15841 13026 7786 16737 11517
544 11517 1893 -8342 -5345 5990 6390 13185 2721 -8575 -13985 -9587 3326 2957 -6870 3600
530 3600 6006 6560 2899 2677 575 -8374 -6588 12366 15584 6486 4944 -805 -6425 -5082 -1018
515 -1018 -2885 1641 2448 8020 17917 19776 18275 10633 4004 -1129 -3197 542 -9522 -4046 -2581
500 -2581 -5284 4895 7738 8361 3990 -9775 -4706 -3604 -4732 -11899 -11873 -9271 -9449 7977 14787
485 14787 2175 -9165 2536 4539 1164 866 1560 6128 1440 10453 19851 16581 6631 141 914
470 914 -6911 -10674 -6518 1386 3371 6699 -564 -4444 -4273 9394 13290 3780 9149 4259 10581
455 10581 11646 8564 946 4293 3785 1881 4276 2856 7116 8978 -2742 -9414 -15995 -13861 -10342
440 -10342 -4024 -6428 -1711 11290 17558 5916 -2507 599 20115 23595 18681 12019 6400 -1962
426 -1962 -7800 -9215 -7129 -17009 -17115 -3268 2457 -3765 -2389 -9551 -2499 321 730 -8092 -13060
411 -13060 -12376 -1733 -5704 -12399 654 5610 -4029 -12350 -17192 -18154 -16607 -12216 -2021 -855 -11667
396 -11667 -10388 -10480 -6364 -3198 -7265 -6712 -7231 -3508 12394 14664 13625 16869 7173 12292 9297 6168
380 6168 11227 17474 10172 6250 12476 13246 7732 3503 1324 -2606 -1475 -5348 -12489 -12680 -6650 -8336
364 -8336 -12969 -12470 -14172 -6600 44 -5034 -406 7655 8444 4495 4314 14862 17610 16505 16680 8476
348 8476 12318 11419 4688 -13381 -18471 -3267 4810 10095 5537 8940 9076 8417 10264 8251 -2577
333 -2577 2474 -89 7059 5194 -5762 -14273 -17177 -15370 -9153 2730 12939 1219 -10781 -17956
319 -17956 -13341 -288 -1508 -14442 -17004 -12638 -8131 2055 11952 17739 9634 -10176 -16003 -5840
305 -5840 -7212 -13393 -16329 -9590 4381 5970 -7839 -21076 -14663 -3466 -6933 -2065 -2513 7434
291 7434 10740 15856 11773 -5147 -1474 783 10542 16502 21157 21798 18734 10378 -3000 -12600 -13132
276 -13132 -18094 -15062 -9866 -11505 -1592 4744 5342 6639 -3625 882 7614 3927 13643 15963 13653
261 13653 5539 2408 1768 5183 14166 9014 817 3609 4587 637 -12754 -10732 -14584 -1907 6981
246 6981 18104 16058 6688 -3057 -9099 -7144 -7269 1715 -3097 -7271 -5661 1882 2325 4550 10749
231 10749 12877 8957 2082 5995 9388 11103 11495 2320 3448 12323 11941 5000 -2074 -4326 -11754
216 -11754 -13052 -2903 1027 2343 -6986 -9589 -3249 5644 8781 16277 20098 13858 14869 10015 3565
201 3565 6292 7865 12194 8070 5316 13410 11226 6252 106 -5383 -11281 -16285 -8348 -3699 772
186 772 -13143 -21624 -11601 -4448 447 -1960 5935 2796 -4433 3230 10068 19493 12481 10818 12155
171 12155 6017 807 -1303 -7267 -2348 2059 -5460 -638 7610 2891 92 -1772 -788 -354 -9624
156 -9624 -8405 -8696 -8940 -3434 -1664 1011 2959 7755 8000 -1711 -1121 2378 -3465 -4474 -4423 -6719 7462
139 7462 14584 15792 2722 2623 2320 3548 -2014 -10709 -3627 4240 -1741 -3876 -6339 -4233 -496 -4291
123 -4291 -3807 802 -2329 -5141 -6181 -8541 -9229 1039 6971 2200 -4738 -5861 -4082 -2397 -8602
108 -8602 -2939 12518 7092 8958 6586 1632 5836 9860 12220 12251 4979 230 -8909 -3439 -2628 -919
92 -919 7700 5507 -3034 -7160 -4622 1125 6346 -1234 -3496 7705 14525 18177 13629 10964 4982
77 4982 165 -995 -4978 -4693 1259 2662 5731 1144 -867 -434 -80 -4335 -7431 -14696 -11325 -2541
61 -2541 2750 8822 8213 -3183 -11092 -8802 -6652 -5385 3984 13970 15121 11519 8038 -730 -4993
46 -4993 774 523 -5304 -5883 -1234 2554 -200 1690 1597 1941 4162 -2927 -91 1594 4321 9594 -227
29 -227 -12737 -11567 -12735 -8528 -5954 -8487 -6395 4114 5885 2831 6794 7186 10278 4914 -2896
14 -2896 -4759 -4737 -7833 -4250 -10926 -13647 -2234 3740 8809 12428 17686 12845 7581 1887
0 1887
$$ Imaginary data points
##PAGE= N=2
##DATA TABLE= (X++(I..I)), XYDATA
32767 16589 22160 26903 19307 20030 19919 23323 27928 35895 38011 28060 18865 15386 15199 17036 16361
32752 16361 25959 28760 26032 27221 25543 32021 33664 38128 37872 41555 39709 36666 22373 15700
32738 15700 21475 31574 34063 29536 25487 27306 35383 31126 29266 31840 38358 47091 50651 49892
32724 49892 44597 38308 34087 29296 26263 26728 18758 16633 27667 40572 44615 40473 37432 40191
32710 40191 42444 39622 50643 55607 54432 49915 56594 54438 56356 57371 55176 48487 49622 47665
32696 47665 47464 48910 39447 35806 36070 42067 50591 62245 67737 64842 62209 65768 62641 63141 53301
32681 53301 49794 50523 49028 51123 58131 66477 70201 71446 72892 76868 73687 75801 74419 70830 63158
32666 63158 57081 63051 68057 67573 67797 68737 76144 76367 67100 66164 60573 64237 53050 51668 57924
32651 57924 58125 58053 55986 57324 59320 60202 62143 58382 66489 75035 78557 89933 85195 77959 77239
32636 77239 73701 73270 72128 64400 71453 76733 77050 69267 66586 65417 63151 60461 61360 69483 75825
32621 75825 73799 73053 71850 68667 72211 74585 76681 72601 68695 66044 85918 90152 90288 95559 97939
32606 97939 90600 83067 81997 81755 84450 80449 83002 81853 78298 81006 84892 84670 84243 85718 90171
32591 90171 95175 95607 92340 91688 89368 86783 90769 94984 96958 94709 94877 95333 91136 103256 98949
32576 98949 89551 88070 82786 90968 86369 85226 90138 80814 73893 93897 109279 110631 107320 99249
32562 99249 96405 95026 92979 93229 104703 108722 112017 116824 114869 99409 88586 85663 87438 93430
32548 93430 104775 111805 106273 101343 95850 85240 86188 93413 94657 100716 103102 95530 96679 101786
32534 101786 109050 102939 100797 107687 114846 125728 121863 113512 102068 97367 103507 109084 115696 105129
32520 105129 102453 101428 105722 118304 110275 105221 101071 112945 122571 128006 129446 115832 109661
32507 109661 119830 123285 120443 115437 109458 112525 115696 121946 123129 121920 112841 114982 117168 118946
32493 118946 112433 112807 112652 114990 115421 118604 117664 116759 131050 134581 135075 144724 150253 138398 135786
32478 135786 143714 146534 129496 115479 112962 106899 114061 109780 112954 120121 125521 125039 116002 118623
32464 118623 121927 118857 113569 114271 114141 115353 119216 119341 126517 131323 133716 126825 123860 121206 115581
32449 115581 116445 119523 120945 122803 121252 125374 126735 121818 129490 145221 143999 137490 141193 141771
32435 141771 145436 157389 158356 158442 152566 144268 151264 158348 147805 131440 122462 123583 125666 126427
32421 126427 123053 133181 139924 127046 119831 130567 137743 149178 146193 139035 139606 149411 158254
32408 158254 167877 160840 142114 128546 122306 123530 130168 136324 128996 136084 145567 150302 159122 159576
32394 159576 151969 147317 135294 124231 131977 142411 136595 130280 128330 118789 123443 120288 115870
32381 115870 124464 134602 137345 143572 147346 144626 155361 162990 150700 137034 128686 141132 152669
32368 152669 151221 141443 140150 136113 146073 149844 153142 163168 162036 154855 147673 135880 133871 134373
32354 134373 134714 143919 151964 140348 137888 139000 125385 117518 117424 109795 112096 121310 130431 134951
32340 134951 139155 137205 131780 136005 136148 134356 134486 130107 125004 133644 136663 129196 110453 111051 123748
32325 123748 126842 132218 138951 141271 138727 146900 155894 151736 150131 157323 164926 160199 148043 138624
32311 138624 142365 146231 150097 146753 142316 138930 141373 146064 135783 133219 126145 128177 133124 146827
32297 146827 148064 145251 137237 134020 140608 148657 159632 166442 157628 151305 158911 164058 151034 138947
32283 138947 133519 139177 157216 155643 155337 153867 151169 144991 148411 146065 150707 153148 149303 148464
32269 148464 138050 148911 161384 155043 154975 158591 155133 150557 138397 133075 145580 153875 147624
$$ [...]
##END NTUPLES=NMR SPECTRUM
##END=
