##TITLE=Analysis number 325221
Compound Code cc 09214
Project Code adrs
Chemist Name ugmt
##JCAMPDX= 6.0         $$ Bruker NMR JCAMP-DX V2.0
##DATA TYPE= NMR SPECTRUM
##DATA CLASS= NTUPLES
##ORIGIN= Bruker BioSpin GmbH
##OWNER= nmr
$$ XWIN-NMR		Version 3.5
$$ Thu Dec 14 14:52:38 2006 GMT Standard Time (UT+0h)  MAYBRIDGE\nmr@NMR_250MHZ
##.OBSERVE FREQUENCY= 250.131544655141
##.OBSERVE NUCLEUS= ^1H
##.ACQUISITION MODE= SIMULTANEOUS (DQD)
##.ACQUISITION SCHEME= undefined
##.AVERAGES= 16
##.DIGITISER RES= 18
##SPECTROMETER/DATA SYSTEM= dpx250
##.PULSE SEQUENCE= zg30
##.SOLVENT NAME= DMSO
##.SHIFT REFERENCE= (INTERNAL, DMSO, 0, 16.522)
##AUDIT TRAIL= $$ (NUMBER, WHEN, WHO, WHERE, WHAT)
$$ ##TITLE= Audit trail, XWIN-NMR		Version 3.5
$$ ##JCAMPDX= 5.01
$$ ##ORIGIN= Bruker BioSpin GmbH
$$ ##OWNER= nmr
$$ C:\u/data/dgb/nmr/ADRS/1580/pdata/1/auditp.txt
$$ ##AUDIT TRAIL=  $$ (NUMBER, WHEN, WHO, WHERE, WHAT)
(   1,<2006-12-14 14:51:54.67 +000>,<MAYBRIDGE\nmr>,<NMR_250MHZ>,
      <created by zg, POWCHK disabled, PULCHK disabled
       configuration hash MD5:
       49 4B E0 1D 92 C2 6B 37 9F E6 65 BC 52 41 86 1D
       data hash MD5: 64K
       79 D0 7B 00 7D A9 8C C8 DC A0 4A 56 00 BF BA C1>)
(   2,<2006-12-14 14:52:16.71 +000>,<MAYBRIDGE\nmr>,<NMR_250MHZ>,
      <Start of raw data processing
       ef LB = 0.3 FT_mod = 6 PKNL = 1 SI = 32K 
       data hash MD5: 32K
       2C 1C AB 04 65 99 B0 45 41 44 9C F3 A8 70 EB 01>)
(   3,<2006-12-14 14:52:20.98 +000>,<MAYBRIDGE\nmr>,<NMR_250MHZ>,
      <apk 
       data hash MD5: 32K
       65 33 98 C2 6C 5D 2F 6F FC 60 C4 48 89 9D D5 EA>)
(   4,<2006-12-14 14:52:22.64 +000>,<MAYBRIDGE\nmr>,<NMR_250MHZ>,
      <abs ABSG = 5 
       data hash MD5: 32K
       B9 03 6D 8D D8 55 ED B6 97 70 C5 E7 2C EF CF 91>)
$$ ##END=
$$ 
$$ hash MD5
$$ 9F C6 C0 34 AD BA 03 76 A3 68 94 BB 86 D5 C1 B3
##$RELAX= 
##$RELAX= 
##$RELAX= 
##$RELAX= 
##$RELAX= 
##$RELAX= 
##$RELAX= 
$$ Bruker specific parameters
$$ --------------------------
##$DU= <C:\u>
##$EXPNO= 1580
##$NAME= <ADRS>
##$PROCNO= 1
##$TYPE= <nmr>
##$USER= <dgb>
##$AMP= (0..31)
100 100 100 100 100 100 100 100 100 100 100 100 100 100 100 100 100 100 
100 100 100 100 100 100 100 100 100 100 100 100 100 100 
##$AQSEQ= 0
##$AQ_mod= 3
##$AUNM= <au_zg>
##$AUTOPOS= <23 >
##$BF1= 250.13
##$BF2= 250.13
##$BF3= 250.13
##$BF4= 250.13
##$BF5= 500.13
##$BF6= 500.13
##$BF7= 500.13
##$BF8= 500.13
##$BYTORDA= 1
##$CFDGTYP= 0
##$CFRGTYP= 5
##$CHEMSTR= <none>
##$CNST= (0..31)
1 1 145 1 1 1 1 1 1 1 1 1 1 1 1 1 1 1 1 1 1 1 1 1 1 1 1 1 1 1 1 1 
##$CPDPRG= <>
##$CPDPRG1= <>
##$CPDPRG2= <>
##$CPDPRG3= <>
##$CPDPRG4= <mlev>
##$CPDPRG5= <mlev>
##$CPDPRG6= <mlev>
##$CPDPRG7= <mlev>
##$CPDPRG8= <mlev>
##$CPDPRGB= <>
##$CPDPRGT= <>
##$D= (0..31)
0 1 0 0 0 0 0 0 0 0.06 0 0 0 0 0 0 0.0002 0 0 0 0 0 0 0 0 0 0 0 0 0 0 
0 
##$DATE= 1166107912
##$DBL= (0..7)
120 120 120 120 120 120 120 120 
##$DBP= (0..7)
150 150 150 150 150 150 150 150 
##$DBP07= 0
##$DBPNAM0= <>
##$DBPNAM1= <>
##$DBPNAM2= <>
##$DBPNAM3= <>
$$ [...]
##$SUBNAM7= <"">
##$SUBNAM8= <"">
##$SUBNAM9= <"">
##$SW= 20.6930455092707
##$SWIBOX= (0..15)
0 0 3 0 0 0 0 0 0 0 0 0 0 0 0 0 
##$SW_h= 5175.983436853
##$TD= 65536
##$TD0= 1
##$TE= 295.16
##$TE2= 300
##$TE3= 300
##$TEG= 300
##$TL= (0..7)
0 120 120 120 120 120 120 120 
##$TP= (0..7)
150 150 150 150 150 150 150 150 
##$TP07= 0
##$TPNAME0= <>
##$TPNAME1= <>
##$TPNAME2= <>
##$TPNAME3= <>
##$TPNAME4= <>
##$TPNAME5= <>
##$TPNAME6= <>
##$TPNAME7= <>
##$TPOAL= (0..7)
0.5 0.5 0.5 0.5 0.5 0.5 0.5 0.5 
##$TPOFFS= (0..7)
0 0 0 0 0 0 0 0 
##$TUNHIN= 0
##$TUNHOUT= 0
##$TUNXOUT= 0
##$USERA1= <user>
##$USERA2= <user>
##$USERA3= <user>
##$USERA4= <user>
##$USERA5= <user>
##$V9= 5
##$VALIST= <valist>
##$VCLIST= <CCCCCCCCCCCCCCC>
##$VD= 0
##$VDLIST= <DDDDDDDDDDDDDDD>
##$VPLIST= <PPPPPPPPPPPPPPP>
##$VTLIST= <TTTTTTTTTTTTTTT>
##$WBST= 1024
##$WBSW= 4
##$XGAIN= (0..3)
0 0 0 0 
##$XL= 0
##$YL= 0
##$YMAX_a= 228877
##$YMIN_a= -300328
##$ZGOPTNS= <>
##$ZL1= 120
##$ZL2= 120
##$ZL3= 120
##$ZL4= 120
##$ABSF1= 16.522
##$ABSF2= -4.171173
##$ABSG= 5
##$ABSL= 3
##$ALPHA= 0
##$AQORDER= 0
##$ASSFAC= 0
##$ASSFACI= 0
##$ASSFACX= 0
##$ASSWID= 0
##$AUNMP= <proc_1d>
##$AZFE= 0.1
##$AZFW= 0.1
##$BCFW= 0
##$BC_mod= 0
##$BYTORDP= 0
##$COROFFS= 0
##$CY= 12.5
##$DATMOD= 1
##$DC= 0
##$DFILT= <>
##$DTYPP= 0
##$F1P= 14.0000005364418
##$F2P= -0.99999901652339
##$FCOR= 0.5
##$FTSIZE= 32768
##$FT_mod= 6
##$GAMMA= 0
##$GB= 0
##$INTBC= 1
##$INTSCL= 1
##$ISEN= 128
##$LB= 0.3
##$LEV0= 0
##$LPBIN= 0
##$MAXI= 10000
##$MC2= 0
##$MEAN= 0
##$ME_mod= 0
##$MI= 0
##$NCOEF= 0
##$NC_proc= -5
##$NLEV= 6
##$NOISF1= 0
##$NOISF2= 0
##$NSP= 0
##$NTH_PI= 0
##$NZP= 0
##$OFFSET= 16.522
##$PC= 1
##$PHC0= 211.4025
##$PHC1= 7.939301
##$PH_mod= 1
##$PKNL= yes
##$PPARMOD= 0
##$PSCAL= 4
##$PSIGN= 0
##$REVERSE= no
##$SF= 250.13
##$SI= 32768
##$SIGF1= 0
##$SIGF2= 0
##$SINO= 400
##$SIOLD= 32768
##$SREGLST= <1H.DMSO>
##$SSB= 0
##$STSI= 32768
##$STSR= 0
##$SW_p= 5175.98343685301
##$SYMM= 0
##$S_DEV= 0
##$TDeff= 65536
##$TDoff= 0
##$TI= <Analysis number 999999
Compound Code 99
Book Reference 9
Project Code 9>
##$TILT= no
##$TM1= 0
##$TM2= 0
##$TOPLEV= 0
##$USERP1= <user>
##$USERP2= <user>
##$USERP3= <user>
##$USERP4= <user>
##$USERP5= <user>
##$WDW= 1
##$XDIM= 32768
##$YMAX_p= 549284573
##$YMIN_p= -542182
$$ End of Bruker specific parameters
$$ ---------------------------------
##NTUPLES= NMR SPECTRUM
##VAR_NAME=  FREQUENCY,     SPECTRUM/REAL,   SPECTRUM/IMAG
##SYMBOL=    X,             R,               I
##VAR_TYPE=  INDEPENDENT,   DEPENDENT,       DEPENDENT
##VAR_FORM=  AFFN,          ASDF,            ASDF
##VAR_DIM=   32768,         32768,           32768
##UNITS=     HZ,            ARBITRARY UNITS, ARBITRARY UNITS
##FACTOR=    0.157963299565203, 1,           1
##FIRST=     4132.6476996994, 0,             0
##LAST=      -1043.33573715361, 0,           0
##MIN=       -1043.33573715361, -542182,     0
##MAX=       4132.6476996994, 549284573,     0
$$ Real data points
##PAGE= N=1
##DATA TABLE= (X++(R..R)), XYDATA
$$ [...]
$$ plain form
17216 828025 833205 827022 741103 660707 779532 840326 775178 840820 823034 756917 663483 608409
17204 608409 694979 697819 609297 519249 474075 434620 404850 511466 605144 609869 593461 646505
17192 646505 623536 514019 290093 406328 668115 768293 816811 816055 695778 865816
17182 865816 798283 703074 678205 487897 536958 666583 691692 699853 722511 576845 481330
17171 481330 606015 738578 809418 746277 567200 426116 412320 522196 617716 639725
17161 639725 641463 541457 469194 451112 404609 324893 383244 343257 304643 346801 383304
17150 383304 262604 276380 242505 366670 428485 292346 294310 400904 417227 388927 182602
17139 182602 112482 200436 221788 47232 81256 39997 70615 138754 140106 96756 128194
$$ packed form
17216H28025N180o183q5919q0396J18825O0794o5148O5642j7786o6117r3434n5074
17204F08409Q6570K840q8522r0048m5174l9455k9770J06616R3678M725j6408N3044
17192F46505k2969j09517k23926J16235K61787J00178M8518p56j20277J70038
17182H65816o7533r5209k4869j90308M9061J29625K5109Q161K2658j45666r5515
17171D81330J24685J32563P0840o3141j79077j41084j3796J09876R5520K2009
17161F39725J738j00006p2263j8082m6503p9716N8351l9987l8614M2158L6503
17150C83304j20700J3776l3875J24165O1815j36139J964J06594J6323k8300k06325
17139A82602p0120Q7954K1352j74556L4024m1259L0618O8139J352m3350L1438
$$ plain form
17128 128194 216774 190857 69675 186546 185181 126842 137694 99965 121486 159044 199243
17117 199243 195901 105093 90571 154013 137172 137135 195970 277239 340312 319232 311780 241132
17105 241132 214038 63903 -18064 -7856 70782 117630 81530 -28137 -109467 -104395 -3613
17094 -3613 79069 297958 392996 264185 165869 243698 295977 232132 227463 263022 330336 292160
17082 292160 278499 215199 119799 233664 274646 246941 179054 156653 222823 251853 138272
17071 138272 210301 241738 308524 320518 338875 491509 631616 702584 674566 396768 242160
17060 242160 242927 303681 380725 403203 313196 342821 421248 311384 325973 397510 377218 329740
17048 329740 251600 255586 253315 228667 132601 169946 160269 41438 113684 138212 -3144 8642
$$ packed form
17128A28194Q8580k5917j21182J16871j365n8339J0852l7729K1521L7558M0199
17117A99243l342r0808j4522O3442j6841l7N8835Q1269O3073k1080p452p0648
17105B41132k7094j50135q1967J0208P8638M6848l6100j09667q1330N072J00782
17094c613Q2682K18889R5038j28811r8316P7829N2279o3845m669L5559O7314l8176
17082B92160j3661o3300r5400J13865M0982k7705o7887k2401O6170K9030j13581
17071A38272P2029L1437O6786J1994J8357J52634J40107P0968k8018k77798j54608
17060B42160P67O0754P7044K2478r0007K9625P8427j09864J4589P1537k0292m7478
17048C29740p8140L986k271k4648r6066L7345r677j18831P2246K4528j41356J1786
$$ plain form
17036 8642 171362 124002 21373 76687 101673 75251 224050 169086 166400 332864 450058
17025 450058 464687 431369 447276 376188 283565 186579 76793 102162 186466 165110 252109
17014 252109 332938 375461 382057 381625 265434 121735 80923 109291 63691 65770 182906 244154
17002 244154 200456 294752 290305 219998 129698 128951 165936 214288 223493 139561 100878 166149
16990 166149 244009 311311 427557 528670 743275 1142755 1456739 1841942 2161004 2256019
16980 2256019 2182986 2031074 1691245 1275837 991531 838707 723049 662066 469903 270101
16970 270101 284451 365250 417232 430293 455026 292862 288548 258285 234526 338358 450564
16959 450564 446943 401979 243194 254980 328824 359997 324878 290938 270257 339199 366808
$$ packed form
17036H642J62720m7360j02629N5314K4986k6422J48799n4964k686J66464J17194
17025D50058J4629l3318J5907p1088r2623r6986j09786K5369Q4304k1356Q6999
17014B52109Q0829M2523O596m32j16191j43699m0812K8368m5600K079J17136O1248
17002B44154m3698R4296m447p0307r0300p47L6985M8352R205q3932l8683O5271
16990A66149P7860O7302J16246J01113K14605L99480L13984L85203L19062R5015
16980B256019p3033j51912l39829m15408k84306j52824j15658o0983j92163j99802
16970B70101J4350Q0799N1982J3061K4733j62164m314l0263k3759J03832J12206
16959D50564l621m4964j58785J1786P3844L1173l5119l3940k0681O8942K7609
$$ plain form
16948 366808 404461 248820 123945 76180 16700 179944 283891 230768 190654 261013 225542
16937 225542 212121 363488 512857 558658 813783 1246768 1654731 1742323 1859745 1947174
16927 1947174 2107509 2013657 1727542 1315713 1007932 745941 656319 601377 455293 358856
16917 358856 228627 120644 231951 366491 277484 141511 59258 161463 152385 241891
16907 241891 154639 174504 140335 144816 181589 239457 265566 176829 96477 41837 93468 -14205
16895 -14205 56271 142598 267847 231202 173642 351215 355607 250299 214997 217325 165850
16884 165850 201075 182438 142228 29656 108730 191657 245067 207326 152789 120551 185628
16873 185628 98168 53380 90454 150094 117599 -123567 -73858 33629 30059 29530 132757
$$ packed form
16948C66808L7653j55641j24875m7765n9480J63244J03947n3123m0114P0359l5471
16937B25542j3421J51367J49369M5801K55125M32985M07963Q7592J17422Q7429
16927A947174J60335r3852k86115m11829l07781k61991q9622n4942j46084r6437
16917C58856j30229j07983J11307J34540q9007j35973q2253J02205r078Q9506
16907B41891q7252J9865l4169M481L6773N7868K6109q8737q0352n4640N1631j07673
16895a4205P0476Q6327J25249l6645n7560J77573M392j05308l5302K328n1475
16884A65850L5225j8637m0210j12572P9074Q2927N3410l7741n4537l2238O5077
16873A85628q7460m4788L7074N9640l2495k41166M9709J07487l570n29J03227
$$ plain form
16862 132757 170907 164823 216971 180337 101810 62680 185375 132765 93419 65378 114711
16851 114711 110945 -52226 -159932 -94089 12745 124642 206756 230578 264262 331259 153276
16840 153276 250777 306245 321330 334316 202001 56367 179622 264250 368965 464767 250225
16829 250225 119773 94294 148931 204252 176390 113818 46520 -56602 -41910 18227 60120
16818 60120 56972 13892 22982 139798 215342 176677 104863 136034 203117 378347 414123 421835
16806 421835 380809 381592 374309 441023 560674 698588 1009120 1291364 1393053 1462404 1584713
16795 1584713 1646742 1699121 1626785 1462785 1244742 1082245 902852 905110 884122 1041451
16785 1041451 1405117 1588628 1625797 1496401 1441162 1515925 1478571 1219175 913978 556737
$$ packed form
16862A32757L8150o084N2148l6634p8527l9130J22695n2610l9346k8041M9333
16851A14711l766j63171j07706O5843J06834J11897Q2114K3822L3684O6997j77983
16840A53276R7501N5468J5085J2986j32315j45634J23255Q4628J04715R5802k14542
16829B50225j30452k5479N4637N5321k7862o2572o7298j03122J4692O0137M1893
16818F0120l148m3080R090J16816P5544l8665p1814L1171O7083J75230L5776P712
16806D21835m1026P83p283O6714J19651J37914L10532K82244J01689O9351J22309
16795A584713O2029N2379p2336j64000k18043j62497j79393K258k0988J57329
16785A041451L63666J83511L7169j29396n5239P4763l7354k59396l05197l57241
$$ plain form
16775 556737 492748 596107 450954 250525 277920 514336 529182 487303 301284 143773
16765 143773 118653 116351 159931 272044 405392 439161 355541 218610 205930 274385 174100
16754 174100 187819 226524 182618 239605 247337 295055 393132 418383 382284 314978 306526 253176
16742 253176 200757 140363 220207 295928 323460 273000 146929 33308 96198 252330 427139
16731 427139 371111 181291 159589 262291 375454 397703 449029 396408 400200 587129 579341
16720 579341 527826 662285 825136 860830 808732 840372 893901 990768 912380 799878 698716
16709 698716 619431 739194 851116 773442 726652 734886 695820 687456 691382 669349 781533
16698 781533 806192 715402 708652 747389 818977 804190 629977 420413 424828 457488 404792
$$ packed form
16775E56737o3989J03359j45153k00429K7395K36416J4846m1879j86019j57511
16765A43773k5120k302M3580J12113J33348L3769q3620j36931j2680O8455j00285
16754A74100J3719L8705m3906N6987P732M7718R8077K5251l6099o7306q452n3350
16742B53176n2419o0394P9844P5721K7532n0460j26071j13621O2890J56132J74809
16731D27139n6028j89820k1702J02702J13163K2249N1326n2621L792J86929p788
16720E79341n1515J34459J62851L5694n2098L1640N3529R6867p8388j12502j01162
16709F98716p9285J19763J11922p7674m6790Q234l9066q364L926k2033J12184
16698G81533K4659r0790o750L8737P1588j4787j74213k09564M415L2660n2696
$$ plain form
16687 404792 404717 541960 620252 666617 643600 580765 617800 645648 600991 566913 587167 563670
16675 563670 475771 449562 576364 559122 534273 540142 420095 405132 419762 527775 610666
16664 610666 568713 605954 560198 480105 512163 680332 657269 598554 571903 482156 320887
16653 320887 333134 354143 281798 218597 278361 333971 426922 321274 428208 412694 332134
16642 332134 304427 224925 308270 366987 234889 356809 419741 454435 342265 345311 291651
16631 291651 267300 512880 482019 482330 490240 517789 575835 686384 689348 572520 529686 520048
16619 520048 392497 393844 530819 480154 419717 490058 466755 326524 443704 508263 534753
16608 534753 586673 696503 687326 532045 497601 671510 647523 661285 794577 743781 792874
$$ packed form
16687D04792p5J37243P8292M6365k3017o2835L7035K7848m4657l4078K0254k3497
16675E63670q7899k6209J26802j7242k4849N869j20047j4963J4630J08013Q2891
16664F10666m1953L7241m5756q0093L2058J68169k3063n8715k6651q9747j61269
16653C20887J2247K1009p2345o3201N9764N5610R2951j05648J06934j5514q0560
16642C32134k7707p9502Q3345N8717j32098J21920O2932L4694j12170L046n3660
16631B91651k4351K45580l0861L11P910K7549N8046J10549K964j16828m2834r638
16619E20048j27551J347J36975n0665o0437P0341k3303j40231J17180O4559K6490
16608E34753N1920J09830r177j55281l4444J73909k3987J3762J33292n0796M9093
$$ plain form
16597 792874 905296 944421 923987 845084 802393 769248 839276 905164 1015403 1054461 1089351
16586 1089351 1131296 1029639 1059189 958837 958518 875419 893184 1004655 1141232 1261011 1456061
16575 1456061 1715007 2022947 2222765 2588911 2716259 2577126 2301677 2079275 1760549
16566 1760549 1420882 1211678 1098351 1113973 1125634 1133883 1030814 920799 971103 987068
16556 987068 1106311 1031315 1044594 1135463 1049119 1104115 1118278 1203382 1271529 1239363 1181458
16545 1181458 1226318 1128565 1072636 1172233 1245508 1193158 1129637 1046637 1115868 1171615 1049918
16534 1049918 1014069 998280 962015 1096284 1044452 1044378 1004750 1002622 1027943 919058 899958 941748
16522 941748 897703 975033 1100276 1131055 1128060 1126342 1077664 1024654 1173213 1248321 1252334 1171826
$$ packed form
16597G92874J12422L9125k0434p8903m2691l3145P0028O5888J10239L9058L4890
16586A089351M1945j01657K9550j00352l19q3099J7765J11471J36577J19779J95050
16575A456061K58946L07940J99818L66146J27348j39133k75449k22402l18726
16566A760549l39667k09204j13327J5622J1661Q249j03069j10015N0304J5965
16556I87068J19243p4996J3279R0869q6344N4996J4163Q5104O8147l2166n7905
16545A181458M4860r7753n5929R9597P3275n2350o3521q3000O9231N5747j21697
16534A049918l5849j5789l6265J34269n1832p4l9628k128K5321j08885j9100M1790
16522I41748m4045P7330J25243L0779k995j718m8678n3010J48559P5108M013q0508
$$ plain form
16510 1171826 1211798 1268330 1364002 1372810 1525475 1612631 1542247 1392475 1350947 1367967 1326802
16499 1326802 1322486 1448866 1547839 1598401 1442810 1442783 1543419 1617603 1709189 1730149 1666646
16488 1666646 1706969 1708989 1798664 1878672 1960081 1876786 1974691 1985510 1909992 1884463 1920737
16477 1920737 1928304 1975761 2004757 2061453 2121822 2143222 2208404 2206949 2199561 2310748 2314965 2296778
16465 2296778 2309624 2437755 2510276 2576607 2576155 2537904 2373973 2397506 2481270 2539024 2518417
16454 2518417 2443040 2590276 2607499 2596332 2584361 2757978 2784433 2684198 2654222 2858961
16444 2858961 2953146 3052956 3102688 3092244 2966401 3038921 3224654 3147787 3141585 3118088 3089268
16433 3089268 3069054 3174960 3197653 3164554 3278103 3478093 3586563 3604864 3559464 3655632
$$ packed form
16510A171826L9972N6532R5672Q808J52665Q7156p0384j49772m1528J7020m1165
16499A326802m316J26380R8973N0562j55591k7J00636P4184R1586K0960o3503
16488A666646M0323K020Q9675Q0008Q1409q3295R7905J0819p5518k5529L6274
16477A920737P567M7457K8996N6696O0369K1400O5182j455p388J11187M217j8187
16465B296778J2846J28131P2521O6331m52l8251j63931K3533Q3764N7754k0607
16454B518417p5377J47236J7223j1167j1971J73617K6455j00235k9976K04739
16444B858961R4185R9810M9732j0444j25843P2520J85733p6867o202k3497k8820
16433C089268k0214J05906K2693l3099J13549J99990J08470J8301m5400R6168
$$ plain form
16423 3655632 3719352 3635388 3585875 3714621 3884841 3942918 3899001 4043968 4180713 4393416
16413 4393416 4501358 4723567 4832060 4739736 4840060 4942375 4960291 5179748 5282053 5357519
16403 5357519 5444122 5504116 5544221 5608433 5739664 5790483 5917463 6035551 6095304 6200858
16393 6200858 6283857 6444138 6550239 6719717 6907521 6971268 7212157 7432432 7351705 7521765
16383 7521765 7736287 7994640 8236809 8354293 8575028 8901850 9195873 9378006 9606558
16374 9606558 9876803 10091672 10291627 10629137 10879397 11014833 11314390 11658269 12025432
16365 12025432 12198759 12389253 12753958 13098825 13589909 14023636 14632511 15197760 15691299
16356 15691299 16014526 16524653 17019172 17614609 18229476 18997272 19546287 20184832 20860431
$$ packed form
16423C655632O3720q3964m9513J28746J70220N8077m3917J44967J36745K12703
16413D393416J07942K22209J08493r2324J00324J02315J7916K19457J02305P5466
16403E357519Q6603N9994M0105O4212J31231N0819J26980J18088N9753J05554
16393F200858Q2999J60281J06101J69478J87804O3747K40889K20275q0727J70060
16383G521765K14522K58353K42169J17484K20735L26822K94023J82133K28552
16374I606558K70245K14869J99955L37510K50260J35436K99557L43879L67163
16365A2025432J73327J90494L64705L44867M91084M33727O08875N65249M93539
16356A5691299L23227N10127M94519N95437O14867P67796N49015O38545O75599
$$ plain form
16347 20860431 21742092 22562759 23450436 24438634 25399328 26313888 27308889 28385187 29491898
16338 29491898 30744877 32083610 33596266 35126096 36733063 38513565 40417695 42459042
16330 42459042 44780893 47097410 49486084 52095939 54743819 57716160 61035400 64476735
16322 64476735 68165029 72048227 76312878 80885368 85957901 91318352 96908532 102959798
16314 102959798 109483017 116634495 124191503 132208317 140900098 150094000 159576649 169666238
16306 169666238 180200271 190838133 201395308 211929262 221929014 231057143 239161810
16299 239161810 245928721 251159371 254458585 255750787 255029710 252298346 247770006 241475577
16291 241475577 233712178 224880052 215125249 204940107 194651579 184327312 174065078
$$ packed form
16347B0860431Q81661Q20667Q87677R88198R60694R14560R95001J076298J106711
16338B9491898J252979J338733J512656J529830J606967J780502J904130K041347
16330D2459042K321851K316517K388674K609855K647880K972341L319240L441335
16322F4476735L688294L883198M264651M572490N072533N360451N590180O051266
16314A02959798O523219P151478P557008Q016814Q691781R193902R482649J0089589
16306A69666238J0534033J0637862J0557175J0533954R999752R128129Q104667
16299B39161810O766911N230650L299214J292202p21077k731364m528340o294429
16291B41475577p763399q832126r754803j0185142j0288528j0324267j0262234
$$ plain form
16284 174065078 164130735 154481237 145196432 136404899 128151185 120430743 113251362 106478697
16276 106478697 100008346 94056534 88526247 83453867 78675013 74220928 70059034 66140013
16268 66140013 62586678 59204808 56112700 53275944 50489749 47778956 45423315 43325343
16260 43325343 41458008 39473847 37606670 35885618 34382179 32909946 31607852 30222191
16252 30222191 28913819 27873410 26742607 25704977 24692414 23656116 22759128 21879695
16244 21879695 21067319 20397354 19723072 19024551 18263885 17693968 17233127 16797138 16280969
16235 16280969 15761801 15231052 14805549 14512947 14102160 13554334 13206844 12973757 12664447
16226 12664447 12294183 12070668 11759538 11438583 11141599 11045378 10976981 10890768 10630481 10342976
$$ packed form
16284A74065078r934343r649498r284805q791533q253714p720442p179381o772665
16276A06478697o470351n951812n530287n072380m778854m454085m161894l919021
16268F6140013l553335l381870l092108k836756k786195k710793k355641k097972
16260D3325343j867335j984161j867177j721052j503439j472233j302094j385661
16252C0222191j308372j040409j130803j037630j012563j036298q96988q79433
16244B1879695q12376o69965o74282o98521p60666n69917m60841m35989n16169
16235A6280969n19168n30749m25503k92602m10787n47826l47490k33087l09310
16226A2664447l70264k23515l11130l20955k96984r6221o8397q6213k60287k87505
$$ plain form
16216 10342976 10221229 10237421 10134003 9972381 9779707 9679624 9664150 9516830 9257019 9204763
16206 9204763 9150773 9139230 9051255 8853325 8773196 8617145 8295129 8107033 7970199 7851425
16196 7851425 7629626 7375252 7094962 6859311 6709889 6476561 6175871 5975754 5820076
16187 5820076 5594280 5503495 5452530 5296854 5021033 4957962 4959596 4950140 5081207 4959900 4903281
16176 4903281 4761857 4548388 4416478 4382224 4375372 4420731 4395477 4304732 4268269 4101049 4017092
16165 4017092 3970307 4012670 4073536 3931042 3749838 3510555 3445244 3518670 3565322 3544694 3354365
16154 3354365 3275914 3191891 3174749 3030438 3081187 3208196 3054052 2938941 2847816 2898512
16144 2898512 2850934 2790046 2777637 2738371 2688491 2640961 2535898 2465671 2379162 2413230 2485667
$$ packed form
16216A0342976j21747J6192j03418j61622j92674j00083j5474j47320k59811n2256
16206I204763n3990j1543q7975j97930q0129j56051l22016j88096j36834j18774
16196G851425k21799k54374k80290k35651j49422k33328l00690k00117j55678
16187E820076k25796r0785n0965j55676k75821o3071J634r456J31067j21307n6619
16176D903281j41424k13469j31910l4254o852M5359k5254r0745l6463j67220q3957
16165D017092m6785M2363O0866j42494j81204k39283o5311P3426M6652k0628j90329
16154C354365p8451q4023j7142j44311N0749J27009j54144j15111r1125N0696
16144B898512m7578o0888j2409l9266m9880m7530j05063p0227q6509L4068P2437
$$ plain form
16133 2485667 2408797 2370353 2272655 2257614 2451940 2441687 2356671 2261748 2168789 2028702 1941457
16122 1941457 1986205 1974918 1937189 1908951 1952756 2081729 2082145 2028837 1858329 1749302 1802032
16111 1802032 1967705 2040892 2027534 1817856 1770886 1821083 1831806 1731879 1732465 1733163 1793160 1868991
16099 1868991 1808711 1668328 1633505 1593585 1704107 1791611 1810508 1883056 1852127 1621191 1356449
16088 1356449 1450447 1440452 1381258 1508035 1537644 1466539 1355856 1395642 1406751 1336569 1361164
16077 1361164 1369500 1470581 1444230 1255850 1213185 1140102 1051802 1105082 1160705 1186908 1233921
16066 1233921 1141228 1172281 1295983 1215918 1139655 1165649 1147769 1162307 1270420 1243555 1084747
16055 1084747 994976 994804 939504 970923 1023632 987076 974474 1089573 1146287 1056053 1080045
$$ packed form
16133B485667p6870l8444r7698j5041J94326j0253q5016r4923r2959j40087q7245
16122A941457M4748j1287l7729k8238M3805J28973M16n3308j70508j09027N2730
16111A802032J65673P3187j3358k09678m6970N0197J0723r9927N86O98N9997P5831
16099A868991o0280j40383l4823l9920J10522Q7504J8897P2548l0929k30936k64742
16088A356449R3998r995n9194J26777K9609p1105j10683L9786J1109p0182K4595
16077A361164Q336J01081k6351j88380m2665p3083q8300N3280N5623K6203M7013
16066A233921r2693L1053J23702q0065p6263K5994j7880J4538J08113k6865j58808
16055A084747q9771j72n5300L1419N2709l6556j2602J15099N6714r0234K3992
$$ plain form
16044 1080045 965307 796641 886743 1007852 1109336 1091765 1021470 990767 1026308 1051546
16034 1051546 965780 1044564 1119457 1055277 1040575 1203921 1333111 1392485 1393962 1466558 1792498
16023 1792498 2167208 2527833 2699421 2724045 2686541 2544037 2297241 1983690 1685062 1346366
16013 1346366 1191779 1106317 1041144 1030802 1111278 1018440 975739 964157 931402 948555 709137
16002 709137 618690 538442 544279 475640 460225 608466 686255 664930 766750 806063 697100
15991 697100 677362 701165 690532 668809 640547 539317 561662 635222 655254 585544 434461
15980 434461 351475 377972 430268 574416 604971 517616 418536 503495 587866 597297 428502
15969 428502 384890 483637 435744 521041 645523 616367 609538 657298 502346 353825 382002
$$ packed form
16044A080045j14738j68666R0102J21109J01484j7571p0295l0703L5541K5238
16034A051546q5766P8784P4893o4180j4702J63346J29190N9374J477P2596L25940
16023A792498L74710L60625J71588K4624l7504j42504k46796l13551k98628l38696
16013A346366j54587q5462o5173j0342Q0476r2838m2701j1582l2755J7153k39418
16002G09137r0447q0248N837o8639j5415J48241P7789k1325J01820L9313j08963
15991F97100j9738K3803j0633k1723k8262j01230K2345P3560K0032o9710j51083
15980D34461q2986K6497N2296J44148L0555q7355r9080Q4959Q4371R431j68795
15969D28502m3612R8747m7893Q5297J24482k9156o829M7760j54952j48521K8177
$$ plain form
15958 382002 476309 517097 452158 438752 507260 581692 468669 404712 381506 432020 471679
15947 471679 424120 492968 413687 331095 348122 327404 285019 227619 242985 250945 305525 225040
15935 225040 229750 330669 355462 346582 431191 502934 488777 435054 371578 253788 224806
15924 224806 289773 352032 472714 453442 380197 308797 360324 291355 285321 96416 88560
15913 88560 196252 303789 351146 313696 308588 385081 363411 406553 379377 415678 289469
15902 289469 249629 103060 -77803 -91093 44093 129619 105581 134718 245630 302343 284097
15891 284097 256244 436143 538402 459900 469496 469387 414224 345616 176664 47045 22170
15880 22170 199625 167515 117233 186543 272318 292483 273459 271775 243418 128908 191420
$$ packed form
15958C82002R4307M0788o4939j3406O8508P4432j13023o3957k3206N0514L9659
15947D71679m7559O8848p9281q2592J7027k0718m2385n7400J5366P960N4580q0485
15935B25040M710J00919K4793q880Q4609P1743j4157n3723o3476j17790k8982
15924B24806O4967O2259J20682j9272p3245p1400N1527o8969o034j88905p856
15913H8560J07692J07537M7357l7450n108P6493k1670M3142k7176L6301j26209
15902B89469l9840j46569j80863j3290J35186Q5526k4038K9137J10912N6713j8246
15891B84097k7853J79899J02259p8502R596j09n5163o8608j68952j29619k4875
15880B2170J77455l2110n0282O9310Q5775K0165j9024j684k8357j14510O2512
$$ plain form
15869 191420 232099 280334 160580 120054 96567 -12693 2608 -58188 -32878 13951 -11221
15858 -11221 73164 123260 215892 251535 170907 145227 150415 274193 315095 326501 216084
15847 216084 119792 7230 59786 158532 42857 -4533 -40745 -37620 86705 105570 184533
15836 184533 273568 113632 78817 162653 100196 71472 63677 -221 -43481 105938 265829
15825 265829 376296 328166 300180 294046 172297 123036 205625 216902 21129 102153 220849
15814 220849 239910 195254 245288 207376 144937 124276 191074 290068 393165 441886 401376
15803 401376 325342 313121 429141 412239 272202 279311 205640 285363 152971 243262 333055
15792 333055 278691 228934 164806 111535 175784 244703 251266 284468 269687 406126 317846
$$ packed form
15869A91420M0679M8235j19754m0526k3487j09260J5301o0796K5310M6829k5172
15858a1221Q4385N0096R2632L5643q0628k5680N188J23778M0902J1406j10417
15847B16084r6292j12562N2556R8746j15675m7390l6212L125J24325J8865P8963
15836A84533Q9035j59936l4815Q3836o2457k8724p795o3898m3260J49419J59891
15825B65829J10467m8130k7986o134j21749m9261Q2589J1277j95773Q1024J18696
15814B20849J9061m4656N0034l7912o2439k0661O6798R8994J03097M8721m0510
15803D01376p6034j2221J16020j6902j40037P109p3671P9723j32392R0291Q9793
15792C33055n4364m9757o4128n3271O4249O8919O563L3202j4781J36439q8280
$$ plain form
15781 317846 187481 264221 296344 245019 361640 346136 262992 102844 178114 138340 154267
15770 154267 153862 126679 182905 299960 288067 219910 203083 224054 212550 213395 226903 133770
15758 133770 169883 261590 161985 165104 201652 199586 75562 -67530 -125203 -152836 -137744
15747 -137744 -121941 -24026 102705 195246 284151 243857 234027 434359 339499 239181 228111
15736 228111 152596 165121 194464 183204 125788 140250 161257 45249 20019 70436 119322
15725 119322 149344 151141 146262 217957 137599 75936 29125 -9649 28245 84912 144396 104539
15713 104539 138680 86322 -2942 -87132 -31461 20145 49014 78550 44952 -63819 43177
15702 43177 79644 104550 37676 -22661 23624 203591 235269 145057 92598 -8539 -105741
$$ packed form
15781C17846j30365P6740L2123n1325J16621j5504q3144j60148P5270l9774J5927
15770A54267m05k7183N6226J17055j1893o8157j6827K0971j1504Q45J3508r3133
15758A33770L6113R1707r9605L119L6548k066j24024j43092n7673k7633J5092
15747a37744J5803R7915J26731R2541Q8905m0294r830K00332r4860j00318j1070
15736B28111p5515J2525K9343j1260n7416J4462K1007j16008k5230N0417M8886
15725A19322L0022J797m879P1695q0358o1663m6811l8774L7894N6667N9484l9857
15713A04539L4141n2358q9264q4190N5671N1606K8869K9536l3598j08771J06996
15702D3177L6467K4906o6874o0337M6285J79967L1678r0212n2459j01137r7202
$$ plain form
15691 -105741 -14598 109388 159719 69307 51289 127560 131920 179048 187616 148747 92074 37109
15679 37109 120269 173878 118562 25353 24904 21066 251253 285873 208376 204218 175388 136661
15667 136661 108225 18280 42012 38941 81131 111222 57440 112290 242864 257204 280395
15656 280395 298253 195110 -19196 -99635 -106645 -73954 -180006 -92780 -90395 -44829 -27469
15645 -27469 -145629 -26423 -15755 -89484 -109861 -42837 91844 38498 18163 -10600 42086
15634 42086 126457 127834 88650 83889 183627 81731 130873 231615 208251 119794 131889 160097
15622 160097 193841 -41056 -152615 -47347 155 125064 229946 250105 292583 367749
15612 367749 210670 91153 103739 140617 92745 127345 4087 -106527 -52345 27134 102946
$$ packed form
15691a05741R1143J23986N0331r0412j8018P6271M360M7128Q568l8869n6673n4965
15679C7109Q3160N3609n5316r3209m49l838K30187L4620p7497m158k8830l8727
15667A36661k8436q9945K3732l071M2190L0091n3782N4850J30574J4340K3191
15656B80395J7858j03143k14306q0439p010L2691j06052Q7226K385M5566J7360
15645b7469j18160J19206J0668p3729k0377O7024J34681n3346k0335k8763N2686
15634D2086Q4371J377l9184m761R9738j01896M9142J00742k3364q8457J2095K8208
15622A60097L3744k34897j11559J05268M7502J24909J04882K0159M2478P5166
15612C67749j57079j19517J2586L6878m7872L4600j23258j10614N4182P9479P5812
$$ plain form
15601 102946 100287 169576 185645 86214 41987 102750 242423 182322 164615 65270 21230
15590 21230 58587 82068 137266 7487 42768 176314 83685 48473 58018 22706 56632
15579 56632 30240 -21487 -174056 -289218 -89812 23477 13366 106485 -5817 -83908 -88967
15568 -88967 39534 7397 -24272 -104064 -75123 -14300 -62949 5240 87376 -86816 -33566
15557 -33566 156578 193585 78712 -27172 -93492 -104464 -81883 -11700 -3090 -54485 -185218
15546 -185218 -182724 -31913 -3496 73510 141679 150547 217379 412389 451828 436760 350980
15535 350980 130874 41502 111067 96588 31273 -3068 168162 117658 33330 16097 77975
15524 77975 66619 63082 90142 189468 182736 86698 245510 174197 162426 171737 187394 231369
$$ packed form
15601A02946k659O9289J6069r9431m4227O0763J39673o0101j7707r9345m4040
15590B1230L7357K3481N5198j29779L5281J33546r2629l5212R545l5312L3926
15579E6632k6392n1727j52569j15162J99406J13289j0111R3119j12302p8091n059
15568h8967J28501l2137l1669p9792K8941O0823m8649O8189Q2136j74192N3250
15557c3566J90144L7007j14873j05884o6320j0972K2581P0183Q610n1395j30733
15546a85218K494J50811K8417P7006O8169Q868O6832J95010L9439j5068q5780
15535C50980k20106q9372O9565j4479o5315l4341J71230n0504q4328j7233O1878
15524G7975j1356l537K7060R9326o732r6038J58812p1313j1771R311J5657M3975
$$ plain form
15512 231369 128285 -71750 -110466 -79219 -46075 16334 223864 298574 175647 94943 137563
15501 137563 139243 286803 180646 -28959 -36752 45471 104672 105425 122133 158597 106188 103225
15489 103225 17949 -93085 -93199 -112841 -173096 -146403 -3728 102464 148570 172936 166935
15478 166935 163129 110521 50304 24419 -115914 -105404 -11579 94148 219307 318246 277048
15467 277048 152741 116950 89028 209583 317048 357273 446883 454303 425311 479003 482819
15456 482819 401508 370562 330833 376878 531676 690256 728999 792925 809872 756963 760491
15445 760491 829998 903545 943881 922075 1002681 1158665 1173594 1117718 975014 953483 770967
15434 770967 749097 790401 775407 635893 561726 525656 567796 530886 307058 293810 313845
$$ packed form
15512B31369j03084k00035l8716L1247L3144O2409K07530P4710j22927q0704M2620
15501A37563J680J47560j06157k09605p793Q2223N9201P53J6708L6464n2409k963
15489A03225q5276j11034j14j9642o0255K6693J42675J06192M6106K4366o001
15478A66935l806n2608o0217k5885j40333J0510R3825J05727J25159R8939m1198
15467B77048j24307l5791k7922J20555J07465M0225Q9610P420k8992N3692L816
15456D82819q1311l0946l9729M6045J54798J58580L8743O3926J6947n2909L528
15445G60491O9507P3547M0336k1806Q0606J55984J4929n5876j42704k1531j82516
15434G70967k1870M1304j4994j39514p4167l6070M2140l6910k23828j3248K0035
$$ plain form
15423 313845 370320 455221 528798 529836 487671 532646 417964 357383 273627 208651 110025
15412 110025 152549 136794 106845 204140 201996 115779 85191 177781 78241 179060 263266
15401 263266 141433 60733 64909 -324 -20561 13227 -42153 -13429 -2637 -72181 -65942 101852
15389 101852 79782 159488 179649 178411 255147 323222 308591 298359 224971 84825 124223
15378 124223 153096 119075 170439 198697 163027 134197 115510 137618 102049 37323 22432
15367 22432 -20887 -19475 24597 41574 59174 87141 123483 209934 207931 272546 175579 206281
15355 206281 189233 121597 101594 37034 93621 79731 181808 261978 177996 136522 95274
15344 95274 -4547 55758 111623 135346 24008 -157730 -87620 5851 9294 26509 54347
$$ packed form
15423C13845N6475Q4901P3577J038m2165M4975j14682o0581q3756o4976r8626
15412A10025M2524j5755k9949R7295k144q6217l0588R2590r9540J00819Q4206
15401B63266j21833q0700M176o5233k0237L3788n5380K8724J0792o9544O239J67794
15389A01852k2070P9706K0161j238P6736O8075j4631j0232p3388j40146L9398
15378A24223K8873l4021N1364K8258l5670k8830j8687K2108l5569o4726j4891
15367B2432m3319J412M4072J6977J7600K7967L6342Q6451k003O4615r6967L0702
15355B06281j7048o7636k0003o4560N6587j3890J02077Q0170q3982m1474m1248
15344I5274r9821O0305N5865K3723j11338j81738P0110R3471L443J7215K7838
$$ plain form
15333 54347 -41146 -220687 -168720 706 122283 146397 174705 57113 -6642 -17470 82585
15322 82585 95165 139232 170583 100802 178037 113387 74200 142314 248014 236758 88523
15311 88523 65739 49594 134183 182439 120860 191396 214611 139368 122164 169096 248210 120510
15299 120510 189779 202742 160487 139712 126217 242830 316940 256195 185781 245162 303719
15288 303719 293439 229028 205468 150528 79892 66049 61742 52828 79590 172439 88688 7385
15276 7385 22698 -102655 -216069 -196477 -122448 -102020 -86907 -22395 85669 44448 113239
15265 113239 218868 298058 355798 300290 99022 -52058 -124369 -75410 34231 129764 99759
15254 99759 76984 92644 179421 313698 376586 283871 256652 270443 223364 208779 44277
$$ packed form
15333E4347r5493j79541N1967J69426J21577K4114K8308j17592o3755j0828J00055
15322H2585J2580M4067L1351o9781P7235o4650l9187O8114J05700j1256j48235
15311H8523k2784j6145Q4589M8256o1579P0536K3215p5243j7204M6932P9114j27700
15299A20510O9269J2963m2255k0775j3495J16613P4110o0745p0414N9381N8557
15288C03719j0280o4411k3560n4940p0636j3843m307q914K6762R2849q3751q1303
15276G385J5313j25353j13414J9592P4029K0428J5113O4512J08064m1221O8791
15265A13239J05629P9190N7740n5508k01268j51080p2311M8959J09641R5533l0005
15254I9759k2775J5660Q6777J34277O2888r2715k7219J3791m7079j4585j64502
$$ plain form
15243 44277 -27248 -102980 -136844 -15462 94271 103663 78232 21314 65343 109854 17559
15232 17559 44082 155134 268834 244688 109233 73228 32088 15679 51217 180080 74137
15221 74137 -76180 -114596 -29370 62673 -33812 -48531 -42887 15267 -10177 -43252 -76688 43619
15209 43619 70561 4735 -128442 -229597 -268075 -92114 -37342 -184528 -236358 -92248 -19311
15198 -19311 -27232 -71186 -56360 101661 178739 162682 240022 71103 8244 -6773 -52711
15187 -52711 -202014 -245926 -325821 -305779 -251992 -179565 -48941 -28180 -63093 -25702 85493
15176 85493 68085 89425 43082 -50159 -93455 -11657 96174 126914 149688 58794 21294
15165 21294 -50678 -76499 -139341 -79401 -67080 -156511 -155020 -114321 -141118 -159280 -143267 -181009
$$ packed form
15243D4277p1525p5732l3864J21382J09733R392k5431n6918M4029M4511r2295
15232A7559K6523J11052J13700k4146j35455l6005m1140j6409L5538J28863j05943
15221G4137j50317l8416Q5226R2043r6485j4719N644N8154k5444l3075l3436J20307
15209D3619K6942o5826j33177j01155l8478J75961N4772j47186n1830J44110P2937
15198a9311p921m3954J4826J58021P7078j6057P7340j68919o2859j5017m5938
15187e2711j49303m3912p9895K0042N3787P2427J30624K0761l4913L7391J11195
15176H5493j7408K1340m6343r3241m3296Q1798J07831L0740K2774r0894l7500
15165B1294p1972k5821o2842N9940J2321q9431J491M0699k6797j8162J6013l7742
$$ plain form
15153 -181009 -168585 -246864 -206682 -83577 -77609 -81004 -138520 -149873 -102786 -40177 63778
15142 63778 -71583 -161547 -178798 -106798 -75230 -106144 -150079 -136315 -99038 29501 -20902
15131 -20902 -141421 -132324 -125970 -59446 -94661 -142419 -31338 -24306 -42234 -36599 -22476 -62084
15119 -62084 -118254 -2046 46045 114690 -61896 -136730 -63894 26417 42685 19936 3762
15108 3762 30977 64661 90245 1838 -66113 41479 90201 -52497 -166330 -131880 -71442
15097 -71442 -122959 -134968 -29913 27851 -55401 -151169 -146475 -41413 12145 32118 -456
15086 -456 19442 53565 13316 -77014 -93595 3764 51878 3844 -74086 -342898 -248549 -46572
15074 -46572 -148383 -185843 -96433 18557 -35974 -104601 -123209 -64774 93086 81097 -19759
$$ packed form
15153a81009J2424p8279M0182J23105N968l395n7516j1353M7087O2609J03955
15142F3778j35361q9964j7251P2000L1568l0914m3935J3764L7277J28539n0403
15131b0902j20519R097O354O6524l5215m7758J11081P032j7928N635J4123l9608
15119f2084n6170J16208M8091O8645j76586p4834P2836R0311J6268k2749j6174
15108C762K7215L3684K5584q8407o7951J07592M8722j42698j13833L4450O0438
15097g1442n1517j2009J05055N7764q3252r5768M694J05062N3558J9973l2574
15086d56J9898L4123m0249r0330j6581R7359M8114m8034p7930k68812R4349K01977
15074d6572j01811l7460Q9410J14990n4531o8627j8608N8435J57860j1989j00856
$$ plain form
15063 -19759 -74270 -84964 -108995 -109954 -181455 -137315 -2237 -75486 -102976 -89789 -89393 -143108
15051 -143108 -101948 -21766 -16379 -13430 -151695 -154912 -112921 -149324 -183855 -227870 -218510 -193986
15039 -193986 -253540 -161670 -116403 49559 33892 123079 204436 119852 6259 47420 -47639
15028 -47639 -110827 -136163 -280764 -213042 -115085 -109294 -240289 -290374 -297038 -371286 -211412
15017 -211412 -162577 -186095 -244035 -137803 -117175 -116712 -27709 41316 -20982 -109717 -153870 -132456
15005 -132456 -59453 -70256 -68767 47593 173386 208148 270360 291841 255457 215679 142174
14994 142174 140693 122407 138898 109060 -80521 -48903 90574 88399 319 -25625 43275
14983 43275 161422 190625 190330 165784 171861 211960 248667 161958 124285 71056 4108 -89978
$$ packed form
15063a9759n4511j0694k4031r59p1501M4140J35078p3249k7490J3187L96n3715
15051a43108M1160Q0182N387K949j38265l217M1991l6403l4531m4015R360K4524
15039a93986n9554R1870M5267J65962j5667Q9187Q1357q4584j13593M1161r5059
15028d7639o3188k5336j44601O7722R7957N791j30995n0085o664p4248J59874
15017b11412M8835k3518n7940J06232K0628M63Q9003O9025o2298q8735m4153K1414
15005a32456P3003j0803J489J16360J25793L4762O2212K1481l6384l9778p3505
14994A42174j481j8286J6491k9838j89581L1618J39477k175q8080k5944O8900
14983D3275J18147K9203k95k4546O077M0099L6707q6709l7673n3229o6948r4086
$$ plain form
14971 -89978 -21389 73084 101394 38053 62876 -80118 -50468 3965 -98834 -147623 -46884
14960 -46884 47463 938 -67442 -44129 -26154 -28030 53406 79743 62585 85304 234376 252666
14948 252666 165189 130331 115824 121460 177389 55476 -43766 -180087 -210878 -152719 -117825
14937 -117825 -29941 13740 -14596 -51537 -112929 -156971 -103829 -86744 -96261 -170682 -150872 -118174
14925 -118174 -192889 -218203 -299293 -309268 -279137 -36381 28699 6575 -95747 -85148 26473
14914 26473 -117601 -153159 -47661 113538 202484 171997 130489 25383 35610 36668 -91879
14903 -91879 -143236 -58417 25750 84648 26540 -15623 43451 46165 98961 153936 83734 39885
14891 39885 -103862 -189201 -194596 -201939 -193277 19714 39687 -48231 -115764 -107841 -25028 22896
$$ packed form
14971h9978O8589R4473K8310o3341K4823j42994K9650N4433j02799m8789J00739
14960d6884R4347m6525o8380K3313J7975j876Q1436K6337j7158K2719J49072J8290
14948B52666q7477l4858j4507N636N5929j21913r9242j36321l0791N8159L4894
14937a17825Q7884M3681k8336l6941o1392m4042N3142J7085r517p4421J9810L2698
14925a18174p4715k5314q1090r975L0131K42756O5080k2124j02322J0599J11621
14914B6473j44074l5558J05498J61199Q8946l0487m1508j05106J0227J058j28547
14903i1879n1357Q4819Q4167N8898n8108m2163N9074K714N2796N4975p0202m3849
14891C9885j43747q5339n395p343Q662K12991J9973q7918o7533P923Q2813M7924
$$ plain form
14879 22896 57828 -6535 -59202 30109 131008 114754 38477 215604 267938 139620 104906
14868 104906 30867 39344 -81013 -129384 -93599 -39593 -113763 -93503 -40256 -57385 -86632
14857 -86632 -27529 35764 82629 175313 91577 72325 89588 11891 -36038 -79794 -68760 -59258
14845 -59258 -61410 -53303 -18833 37914 -60665 -94012 -64957 22554 -49964 -16757 129072 82930
14833 82930 7629 -89881 -41622 -131446 -118131 -109607 -74795 2569 -46697 -106401 -19186 52980
14821 52980 176842 53000 -195836 -268097 -211450 -69071 -19730 -16072 -1794 55429 176838
14810 176838 179883 78044 8685 52030 15545 -44586 -101769 43711 179721 197194 205739
14799 205739 67576 77186 264124 266364 165417 -55127 -153667 -192027 -185489 -234784 -172389
$$ packed form
14879B2896L4932o4363n2667Q9311J00899j6254p6277J77127N2334j28318l4714
14868A04906p4039Q477j20357m8371L5785N4006p4170K0260N3247j7129k9247
14857h6632N9103O3293M6865R2684q3736j9252J7263p7697m7929m3756J1034R502
14845e9258k152Q107L4470N6747r8579l3347K9055Q7511p2518L3207J45829m6142
14833H2930p5301r7510M8259q9824J3315Q524L4812P7364m9266n9704Q7215P2166
14821E2980J23862j23842k48836p2261N6647J42379M9341L658J4278N7223J21409
14810A76838L045j01839o9359M3345l6485o0131n7183J45480J36010J7473Q545
14799B05739j38163R610J86938K240j00947k20544r8540l8360O538m9295O2395
$$ plain form
14788 -172389 -19462 -55519 -18377 94907 135841 126425 68577 34268 123006 116019 -35158
14777 -35158 -135467 36106 171166 129341 88794 53153 41109 55879 72648 77888 -54404
14766 -54404 -116208 -154621 -123986 -172472 -191852 -196386 -77539 41913 68844 -58957 -55878
14755 -55878 -66539 18515 -62928 -169291 -127933 -76074 -40045 -132506 -254918 -218701 -143006
14744 -143006 -135122 -73528 -138180 -198734 -213238 -190709 -257849 -203124 -77958 -164179 -132521
14733 -132521 -72222 -157045 -149824 -86402 -11798 120007 99236 66225 -45469 -19015 76024
14722 76024 160077 218318 198381 188087 222582 236191 169605 78270 14284 -66643 -16687 149145
14710 149145 82983 87997 96463 33985 -5971 -52169 -50470 6613 38724 1728 9426 90258
$$ packed form
14788a72389J52927l6057L7142J13284M0934r416n7848l4309Q8738o987j51177
14777c5158j00309J71573J35060m1825m0547l5641j2044J4770J6769N240j32292
14766e4404o1804l8413L0635m8486j9380m534J18847J19452K6931j27801L079
14755e5878j0661Q5054q1443j06363M1358N1859L6029r2461j22412L6217P5695
14744a43006P884O1594o4652o0554j4504K2529o7140N4725J25166q6221L1658
14733a32521O0299q4823P221O3422P4604J31805k0771l3011j11694K6454R5039
14722G6024Q4053N8241j9937j0294L4495J3609o6586r1335o3986q0927M9956J65832
14710A49145o6162N014Q466o2478l9956m6198J699N7083L2111l6996P698Q0832
$$ plain form
14698 90258 142360 13491 -119923 -59098 23282 38951 51071 79216 111899 135329 118615
14687 118615 135883 285471 204530 152684 184972 239928 342838 330058 444760 464276 353353
14676 353353 350067 396236 343227 422510 489177 437613 365323 464295 531568 511594 605302 698348
14664 698348 792070 927941 926733 956142 1011356 986910 1118855 1217038 1425750 1430289 1393868
14653 1393868 1489265 1686323 1925692 1999987 2056108 2111024 2068588 2145380 2144132 2164418 2198659
14642 2198659 2148041 2146329 2087162 2000279 1798892 1750156 1744461 1532037 1274372 1268603 1164175
14631 1164175 1055608 929917 891276 939597 916192 744853 609185 537931 494064 422055
14621 422055 433464 456830 484023 468205 533876 471264 384893 313350 202313 197009 296058
$$ packed form
14698I0258N2102j28869j33414O0825Q2380J5669J2120K8145L2683K3430j6714
14687A18615J7268J49588q0941n1846L2288N4956J02910j2780J14702J9516j10923
14676C53353l286M6169n3009P9283O6667n1564p2290R8972O7273j9974R3708R3046
14664F98348R3722J35871j208K9409N5214k4446J31945R8183K08712M539l6421
14653A393868R5397J97058K39369P4295N6121N4916m2436P6792j248K0286L4241
14642B198659n0618j712n9167q6883k01387m8736n695k12424k57665n769j04428
14631A164175j08567j25691l8641M8321k3405j71339j35668p1254m3867p2009
14621D22055J1409K3366K7193j5818O5671o2612q6371p1543j11037n304R9049
$$ plain form
14610 296058 274197 177679 64498 103126 137200 67195 20596 65457 67311 125335 164307
14599 164307 136228 53771 -95747 -158348 -132049 -43712 132924 117513 63269 238125 295194
14588 295194 338853 360685 222025 104641 108948 112605 170324 258365 251399 277950 222974 176453
14576 176453 124708 144274 201361 12284 -39816 -152009 -220629 -201210 -159546 -34044 6665
14565 6665 -36693 -47081 -28274 -208585 -221177 -140207 -58324 35986 -49466 -114272 -213527 -176371
14553 -176371 -156447 -170880 -65609 48820 80706 139457 175236 194598 82180 56894 126353
14542 126353 206754 128117 40085 17807 141278 70522 -19711 -43969 -56211 -40850 -81569
14531 -81569 -201298 -211218 -186809 -97916 24670 97120 170702 118294 44000 61875 -20195
$$ packed form
14610B96058k1861r6518j13181L8628L4074p0005m6599M4861J854N8024L8972
14599A64307k8079q2457j49518o2601K6299Q8337J76636j5411n4244J74856N7069
14588B95194M3659K1832j38660j17384M307L657N7719Q8041o966K6551n4976m6521
14576A76453n1745J9566N7087j89077n2100j12193o8620J9419M1664J25502M0709
14565F665m3358j0388J8807j80311j2592Q0970Q1883R4310q5452o4806r9255L7156
14553a76371J9924j4433J05271J14429L1886N8751L5779J9362j12418k5286O9459
14542A26353Q0401p8637q8032k2278J23471p0756r0233k4258j2242J5361m0719
14531h1569j19729r920K4409Q8893J22586P2450P3582n2408p4294J7875q2070
$$ plain form
14520 -20195 -87552 -29518 128744 249314 104756 61765 -70403 -190162 -122330 18528
14510 18528 -39008 -48646 -10006 -5966 -71742 -145489 -20188 87974 90095 56745 65703 -28497
14498 -28497 -107282 -196277 -116232 -113218 -134172 9982 -29839 -30687 -1651 10503 114634 43172
14486 43172 5362 -582 -77510 -232183 -207312 -30686 -73691 -92591 16127 140329 63829
14475 63829 10281 -129927 -152587 -201268 -115940 95852 52315 -57751 55471 58597 7663
14464 7663 36887 30899 29774 -95367 -293341 -209573 -116506 -46680 84815 128853 112137 100319
14452 100319 -7445 -145756 -278044 -268918 -130803 -47565 -66252 -50585 94409 217499
14442 217499 260955 159692 80247 72744 -78840 -156566 -202988 -229030 -153436 -150909 -238606
$$ packed form
14520b0195o7357N8034J58262J20570j44558m2991j32168j19759O7832J40858
14510A8528n7536r638L8640M040o5776p3747J25301J08162K121l3350Q958r4200
14498b8497p8785q8995Q0045L014k0954J44154l9821q48K9036J2154J04131p1462
14486D3172l7810n944p6928j54673K4871J76626m3005j8900J08718J24202p6500
14475F3829n3548j40208k2660m8681Q5328K11792m3537j10066J13222L126n0934
14464G663K9224n988j125j25141j97974Q3768R3067O9826J31495M4038j6716j1818
14452A00319j07764j38311j32288R126J38115Q3238j8687J5667J44994J23090
14442B17499M3456j01263p9445p503j51584p7726m6422k6042P5594K527q7697
$$ plain form
14431 -238606 -299443 -204356 -179220 -227092 -269740 -175713 -1926 -3668 -47222 47527 -19433
14420 -19433 -150410 -228392 -259572 -138323 -89258 58839 48898 -121346 -212078 -109359 104369
14409 104369 140430 78739 -7957 32118 93481 62992 54979 23572 -37409 -19194 88755
14398 88755 202092 78457 -93011 -150993 -64366 -115948 -92216 -125016 -169848 -142912 18822
14387 18822 124470 1306 -22814 78133 74648 83730 72606 49780 53898 235677 169737
14376 169737 148218 168953 103922 -17051 -236332 -268369 -204801 -116749 -32461 171376 125036
14365 125036 -107843 -211430 -180418 -228576 -246644 -285710 -225480 -64089 -34337 -74598 -72911
14354 -72911 -137672 -214381 -201475 -114704 -25931 -68600 -213148 -253683 -177607 -94427 -161092
$$ packed form
14431b38606o0837R5087K5136m7872m2648R4027J73787j742m3554R4749o6960
14420a9433j30977p7982l1180J21249M9065J48097r941j70244r0732J02719K13728
14409A04369L6061o1691q6696M0075O1363l0489q013l1407o0981J8215J07949
14398H8755J13337j23635j71468n7982Q6627n1582K3732l2800m4832K6936J61734
14387A8822J05648j23164k4120J00947l485R082j1124k2826M118J81779o5940
14376A69737k1519K0735o5031j20973k19281l2037O3568Q8052Q4288K03837m6340
14365A25036k32879j03587L1012m8158j8068l9066O0230J61391K9752m0261J687
14354g2911o4761p6709J2906Q6771Q8773m2669j44548m0535P6076Q3180o6665
$$ plain form
14343 -161092 -161801 -52410 -60554 -63692 -37227 -110783 -60601 9134 -45549 41866 -40342 8096
14331 8096 -142727 -139720 -52425 -42421 1192 51742 -61547 -24167 -49264 -45597 -14330 -24658
14319 -24658 -98962 -139478 -313450 -382336 -320172 -379581 -307281 -241549 -204983 -119881 -113719 92304
14307 92304 257176 89806 -43057 -105674 -17507 77984 71937 22245 -43116 -77111 -84574
14296 -84574 -35122 -53048 -75112 -41335 -74317 -15165 123593 225371 239969 120777 73071
14285 73071 18724 21418 -36859 -34454 -36817 64 98108 43410 32341 65827 101575 84364
14273 84364 159701 216459 236810 164980 61318 -40562 -63590 -98441 -84327 -34284 -59555
14262 -59555 -80850 -57610 -44132 5946 -36989 53299 25606 -18838 -18293 -131370 -118524 -90556
$$ packed form
14343a61092p09J09391q144l138K6465p3556N0182O9735n4683Q7415q2208M8438
14331H096j50823L007Q7295J0004M3613N0550j13289L7380k5097L667L1267j0328
14319b4658p4304m0516j73972o8886O2164n9409P2300O5732L6566Q5102O162K06023
14307I2304J64872j67370j32863o2617Q8167R5491o047m9692o5361l3995p463
14296h4574M9452j7926k2064L3777l2982N9152J38758J01778J4598j19192m7706
14285G3071n4347K694n8277K405k363L6881R8044n4698j1069L3486L5748j7211
14273H4364P5337N6758K0351p1830j03662j01880k3028l4851J4114N0043k5271
14262e9555k1295K3240J3478N0078m2935R0288k7693m4444N45j13077J2846K7968
$$ plain form
14250 -90556 -66438 -1727 146001 154970 -79393 -261310 -243018 -125971 -98729 -130978 -84555
14239 -84555 -118063 -179854 -220796 -140844 -111479 -170983 -176740 -167217 -118877 -132150 -86517 50955
14227 50955 14725 -66215 -111168 -119071 -132407 -118672 -62975 -213507 -280448 -171112 -153792
14216 -153792 -226752 -173937 -75847 -48290 -94406 -100148 -11864 119797 -42810 -157340 -48698
14205 -48698 23054 -87641 -169684 -181830 -67424 -49768 -228938 -248133 -249480 -205071 -53517
14194 -53517 -116298 -183319 -64515 63149 117073 -13999 -99657 -60760 42320 109170 177026
14183 177026 121009 75441 -84695 -45670 -75138 -125516 -18786 -25161 -35912 -46647 -110968
14172 -110968 -35591 -6041 -103180 -203232 -187968 -66027 -83973 -106258 -229800 -191357 -56691
$$ packed form
14250i0556K4118O4711J47728Q969k34363j81917J8292J17047K7242l2249M6423
14239h4555l3508o1791m0942P9952K9365n9504n757R523M8340j3273M5633J37472
14227E0955l6230q0940m4953p903j3336J3735N5697j50532o6941J09336J7320
14216a53792p2960N2815R8090K7557m6116n742Q8284J31661j62607j14530J08642
14205d8698P1752j10695q2043j2146J14406J7656j79170j9195j347M4409J51554
14194e3517o2781o7021J18804J27664N3924j31072q5658L8897J03080O6850O7856
14183A77026n6017m5568j60136L9025k9468n0378J06730o375j0751j0735o4321
14172a10968P5377K9550r7139j00052J5264J21941j7946k2285j23542L8443J34666
$$ plain form
14161 -56691 -199839 -327137 -214528 -227481 -285129 -263119 -134444 -53930 -120838 -100645 -63662
14150 -63662 -51390 -202006 -118914 13003 135919 146344 18404 -79668 47809 170865
14140 170865 168950 128280 -17029 31964 29485 -2866 -146934 -183422 -198726 -229335 -196396
14129 -196396 -57354 117936 171223 131600 89739 -21774 -151470 -181272 -184798 -89218 51459
14118 51459 108827 210111 168856 76132 48713 -40200 -228611 -256530 -106746 106829 94404
14107 94404 100565 68529 -61593 -74632 -79823 41659 -63732 -188420 -307791 -318577 -308566
14096 -308566 -97673 31519 -22984 29192 -38743 -114104 -116329 -146692 -88818 -40281 -12295
14085 -12295 9958 -31863 -77739 -127929 -110992 -89987 1872 88759 32736 -151543 -108108
$$ packed form
14161e6691j43148j27298J12609j2953n7648K2010J28675Q0514o6908K0193L6983
14150f3662J2272j50616Q3092J31917J22916J0425j27940r8072J27477J23056
14140A70865j915m0670j45309M8993k479l2351j44068l6488j5304l0609L2939
14129a96396J39042J75290N3287l9623m1861j11513j29696k9802l526R5580J40677
14118E1459N7368J01284m1255r2724k7419q8913j88411k7919J49784K13575j2425
14107I4404O161l2036j30122j3039n191J21482j05391j24688j19371j0786J0011
14096c08566K10893J29192n4503N2176o7935p5361k225l0363N7874M8537K7986
14085a2295K2253m1821m5876n0190J6937K1005R1859Q6887n6023j84279M3435
$$ plain form
14074 -108108 -140584 -30023 68748 -23568 -120079 -70933 -44058 -62385 -33460 96211 127437
14063 127437 10187 -117650 -78546 -48871 -42971 -78796 -123945 -74947 4250 -86190 -49617
14052 -49617 -58395 -313098 -333912 -356510 -312433 -223156 -167182 -89045 -88883 -5396 85984 56801
14040 56801 -85668 -5126 -112217 -174751 -244608 -243441 -162933 -140516 -86986 -151504 -70761
14029 -70761 -110458 -59990 -45784 -258486 -263595 -137194 3179 -31221 -105679 -178918 -67143
14018 -67143 -61513 -48211 -14984 22400 47150 12342 12907 -95253 -274005 -275526 -252189 -106020
14006 -106020 -70464 -29544 -134653 -48707 161908 266923 234076 127575 -42670 -224686
13996 -224686 -295360 -230900 -116448 -50513 -95149 -74241 -43636 -60262 -103309 -217118 -226339
$$ packed form
14074a08108l2476J10561R8771r2316r6511M9146K6875j8327K8925J29671L1226
14063A27437j17250j27837L9104K9675N900l5825m5149M8998P9197r0440L6573
14052d9617q778k54703k0814k2598M4077Q9277N5974P8137J62Q3487R1380k9183
14040E6801j42469Q0542j07091o2534o9857J167Q0508K2417N3530o4518Q0743
14029g0761l9697N0468J4206k12702n109J26401J40373l4400p4458p3239J11775
14018f7143N630J3302L3227L7384K4750l4808N65j08160j78752j521K3337J46169
14006a06020L5556M0920j05109Q5946K10615J05015l2847j06501j70245j82016
13996b24686p0674O4460J14452O5935m4636K0908L0605j6626m3047j13809r221
$$ plain form
13985 -226339 -123341 -139926 -134455 -207370 -116268 -128753 -92221 -47136 47177 24695 -38982
13974 -38982 -57488 -6331 -62779 -125044 -39097 -28276 -67904 -70234 -98229 13966 49157 72011
13962 72011 -1740 -56484 -98751 65220 20236 -27995 75890 24759 -132309 -67684 -119829
13951 -119829 -136056 -79883 75771 104115 -65832 -103220 -93545 -70474 3142 -87585 -120238
13940 -120238 -65529 -25784 -31468 12915 22727 -109460 -106088 -3153 -73720 -117366 -129686 -89033
13928 -89033 -126133 -92190 -96158 -93751 -43949 -7866 -35318 -46474 -89284 -138744 -119932 -76335
13916 -76335 -101972 -57852 -149615 -116960 -93258 12234 6658 -59546 5230 15436 38852 41667
13904 41667 117828 17570 48478 21356 -190316 -399608 -354512 -170470 -164551 -103816 -120404
$$ packed form
13985b26339J02998j6585N471p2915R1102j2485L6532M5085R4313k2482o3677
13974c8982j8506N1157n6448o2265Q5947J0821l9628k330k7995J12195L5191K2854
13962G2011p3751n4744m2267J63971m4984m8231J03885n1131j57068O4625n2145
13951a19829j6227N6173J55654K8344j69947l7388R675K3071P3616r0727l2653
13940a20238N4709L9745n684M4383R812j32187L372J02935p0567m3646j2320M0653
13928h9033l7100L3943l968K407M9802L6083k7452j1156m2810m9460J8812M3597
13916g6335k5637M4120r1763L2655K3702J05492n576o6204O4776J0206K3416K815
13904D1667P6161j00258L0908k7122k11672k09292M5096J84042N919O0735j6588
$$ plain form
13893 -120404 -95631 -146633 -91223 -64336 -80661 -122658 -32543 -27658 -27903 -89225 12459 -17717
13881 -17717 -71354 -78309 -88238 -29000 -4499 -12883 -973 -120594 -79408 -115624 -168388 -146397
13869 -146397 -164098 -166838 -71936 11728 -21589 -85347 -154087 -206927 -194779 -145903 -107111 -102604
13857 -102604 -86197 37747 136762 150571 77647 -47910 -24459 101780 165018 171199 136740
13846 136740 267405 179894 156417 36835 -54128 -29573 178461 357584 345181 62166
13836 62166 -85198 -165485 -154438 -122727 -127580 -43420 107579 7464 -187804 -275610 -146034
13825 -146034 -43387 -21897 -98839 -192784 -184063 -116843 -108473 -195032 -135639 -40942 -42160 -81466
13813 -81466 -26732 -29021 -70083 -106716 -84023 119358 199682 11975 -169885 -272249 -258983
$$ packed form
13893a20404K4773n1002N5410K6887j6325m1997R0115M885k45o1322J01684l0176
13881a7717n3637o955r929N9238K4501q384J1910j19621M1186l6216n2764K1991
13869a46397j7701k740R4902Q3664l3317o3758o8740n2840J2148M8876L8792M507
13857a02604J6407J23944R9015J3809p2924j25557K3451J26239O3238O181l4459
13846A36740J30665q7511k3477j19582r0963K4555K08034J79123j2403k83015
13836F2166j47364q0287J1047L1711m853Q4160J50999j00115j95268q7806J29576
13825a46034J02647K1490p6942r3945Q721O7220Q370q6559N9393R4697j218l9306
13813h1466N4734k289m1062l6633K2693K03381Q0324j87707j81860j02364J3266
$$ plain form
13802 -258983 -45632 48001 20972 -84632 -97750 -180320 -289588 -343543 -229557 -134935 -25764
13791 -25764 18097 52591 -70681 -199385 -361108 -306028 -221074 -250116 -287867 -219944 -22678
13780 -22678 -7674 -140362 -172410 -66216 10339 46969 99474 54495 -95198 -129553 -60362
13769 -60362 -69316 -122414 -74989 -274094 -185438 -47334 -128796 -256583 -201851 -105141 -214859
13758 -214859 -348726 -352885 -372237 -256201 -167556 -109717 -72011 -153830 -266029 -186578 -182117
13747 -182117 -116089 1915 120378 30989 -62515 -132579 -206221 -298082 -218818 -5175 32837
13736 32837 164945 146801 184295 94502 -55123 -150941 -292463 -350724 -373082 -265772 -145126
13725 -145126 784 49176 176823 134274 30284 60799 6070 -88925 -91617 -171961 -93428
$$ packed form
13802b58983K13351R3633k7029j05604j3118q2570j09268n3955J13986R4622J09171
13791b5764M3861L4494j23272j28704j61723N5080Q4954k9042l7751O7923J97266
13780b2678J5004j32688l2048J06194P6555L6630N2505m4979j49693l4355O9191
13769f0362q954n3098M7425j99105Q8656J38104q1462j27787N4732R6710j09718
13758b14859j33867m159j9352J16036Q8645N7839L7706q1819j12199P9451M461
13747a82117O6028J18004J18463q9389r3504p0064p3642r1861P9264K13643L8012
13736C2837J32108j8144L7494q9793j49625r5818j41522n8261k2358J07310J20646
13725a45126J45910M8392J27647m2549j03990L0515n4729r4995k692q0344P8533
$$ plain form
13714 -93428 -45097 56148 120095 163038 331055 509201 619186 600611 559571 371652 128993
13703 128993 168529 192934 186226 170293 26087 -114368 -106017 56606 154957 165769 148133
13692 148133 118980 13853 86195 123097 128385 114939 110315 22877 34603 55585 75698 106880
13680 106880 -28663 -171998 -232861 -197571 -155372 -213963 -147988 -49130 -112257 -92482 -98607
13669 -98607 -168716 -142188 -163799 -129635 -73743 28640 14501 -132684 -186951 -42756 -41414
13658 -41414 -55453 -81326 -211872 -209757 -65625 -62466 10422 -8529 -164343 -311913 -354123
13647 -354123 -296650 -205624 -198029 -150764 -66235 -150222 -224177 -163161 -89276 -101588 -149562 -264914
13635 -264914 -256748 -315423 -264652 -198974 -195597 -244495 -135057 83448 64027 -98692 -217859
$$ packed form
13714i3428M8331J01245O3947M2943J68017J78146J09985j8575m1040j87919k42659
13703A28993L9536K4405o708j5933j44206j40455Q351J62623R8351J0812j7636
13692A48133k9153j05127P2342L6902N288j3446m624q7438J1726K0982K0113L1182
13680A06880j35543j43335o0863L5290M2199n8591O5975R8858o3127J9775o125
13669i8607p0109K6528k1611L4164N5892J02383j4139j47185n4267J44195J342
13658d1414j4039k5873j30546K115J44132L159P2888j8951j55814j47570m2210
13647c54123N7473R1026P595M7265Q4529q3987p3955O1016P3885j2312m7974j15352
13635b64914Q166n8675N0771O5678L377m8898J09438K18505j9421j62719j19167
$$ plain form
13624 -217859 -196296 -62428 30907 -50835 -27439 -14892 -131829 -115309 -142234 -193476 -123270
13613 -123270 -20805 87264 90858 1435 -47342 16055 55837 43207 125297 48676 -39316
13602 -39316 -154189 -179814 -152100 -163104 -194895 -199044 -79225 -185394 -227492 -98284 -197274
13591 -197274 -146228 -113642 -114163 1929 120913 158335 93589 1160 6909 -25620 -156767
13580 -156767 -202101 -127345 -115732 -118738 -156718 -188939 -216491 -189970 -101007 20599 27986 -43805
13568 -43805 -106945 -77886 -111470 -187101 -120655 19667 22944 -79956 -11073 -47723 -163342
13557 -163342 -212817 -168927 -167821 -293224 -364682 -162852 -76620 -38722 -40735 -51698 13098
13546 13098 -24941 -141352 -189716 -195632 -197910 -107624 8001 -3593 44318 149061 161777
$$ packed form
13624b17859K1563J33868R3335q1742K3396J2547j16937J6520k6925n1242P0206
13613a23270J02465J08069L594q9423m8777O3397L9782j2630Q2090p6621q7992
13602c9316j14873k5625K7714j1004l1791m149J19819j06169m2098J29208r8990
13591a97274N1046L2586n21J16092J18984L7422o4746r2429N749l2529j31147
13580a56767m5334P4756J1613l006l7980l2221k7552K6521Q8963J21606P387p1791
13568d3805o3140K9059l3584p5631O6446J40322L277j02900O8883l6650j15619
13557a63342m9475M3890J106j25403p1458K01830Q6232L7898k013j0963O4796
13546A3098l8039j16411m8364n916k278R0286J15625j1594M7911J04743J2716
$$ plain form
13535 161777 54667 -77396 -97972 -179010 -159171 -167785 -148805 -202034 -22796 32597 8331
13524 8331 61386 2771 -180223 -248628 -67191 19262 21980 -2055 73884 98251 49996 -42085
13512 -42085 -89875 -240759 -278617 -145283 -71000 -48298 -103796 -225361 -317088 -291529 -150309
13501 -150309 -13834 -22468 -70829 3420 91112 102882 42546 50555 80216 53738 -109270
13490 -109270 -270404 -219806 -192897 -344453 -311927 -230809 -195218 -129401 -198409 -285190 -130247
13479 -130247 59958 92567 -20799 -15184 -55187 -27518 22648 130779 66345 -6032 -76902
13468 -76902 -104183 -85467 -12952 40082 221 -56811 -43560 46667 15303 49974 125142 103675
13456 103675 -40069 -49806 -29486 -125935 -29686 65053 -85350 -272562 -96726 -72468 -112880
$$ packed form
13535A61777j07110j32063k0576q1038J9839q614J8980n3229J79238N5393k4266
13524H331N3055n8615j82994o8405J81437Q6453K718k4035P5939K4367m8255r2081
13512d2085m7790j50884l7858J33334P4283K2702n5498j21565r1727K5559J41220
13501a50309J36475q634m8361P4249Q7692J1770o0336Q009K9661k6478j63008
13490a09270j61134N0598K6909j51556L2526Q1118L5591O5817o9008q6781J54943
13479a30247J90205L2609j13366N615m0003K7669N0166J08131o4434p2377p0870
13468g6902k7281J8716P2515N3034l9861n7032J3251R0227l1364L4671P5168k1467
13456A03675j43744r737K0320r6449R6249R4739j50403j87212J75836K4258m0412
$$ plain form
13445 -112880 -101223 23436 -22098 -183591 -236158 -186420 -74538 -6138 -51777 -185432 -134998
13434 -134998 77703 113766 76879 139195 84978 -60818 -81303 32437 18277 -418 38977
13423 38977 81758 88702 141638 93147 458 -116519 -165503 -89817 -83786 -25724 58112 5630
13411 5630 -63645 -44599 -70109 -22092 33481 -8645 -117553 -143061 -24152 -44834 -39555 -58790
13399 -58790 -169697 -101090 8148 -44570 -7167 -6699 27338 58590 -48543 1817 151125
13388 151125 179612 131495 28199 -16989 -106561 -199443 -229605 -160014 -25827 -13370 21004
13377 21004 50408 -17502 -26959 -113048 -135781 -114031 -81389 -68548 -55683 -74738 -34034 34204
13365 34204 -36674 -84558 -20560 -25465 -83512 -107672 -92560 -175636 -140246 -227628 -99971 6156
$$ packed form
13445a12880J1657J24659m5534j61493n2567M9738J11882O8400m5639j33655N0434
13434a34998K12701L6063l6887O2316n4217j45796k0485J13740j4160j8695L9395
13423C8977M2781O944N2936m8491r2689j16977m8984P5686O031N8062Q3836n2482
13411E630o9275J9046k5510M8017N5573m2126j08908k5508J18909k0682N279j9235
13399e8790j10907O8607J09238n2718L7403M68L4037L1252j07133N0360J49308
13388A51125K8487m8117j03296m5188q9572r2882l0162O9591J34187J2457L4374
13377B1004K9404o7910r457q6089k2733K1750L2642J2841J2865j9055M0704O8238
13365C4204p0878m7884O3998m905n8047k4160J5112q3076L5390q7382J27657J06127
$$ plain form
13353 6156 8382 -39388 -80150 1754 70961 133274 119715 103546 -43290 -190549 -251860 -144494
13341 -144494 59729 59188 -194841 -331859 -319269 -136826 -75006 -135477 -169353 -141687 -204868
13330 -204868 -141251 -124407 -78773 -29339 17574 6876 -21308 -16029 -60941 -93623 52268
13319 52268 153320 132993 159525 227893 39230 -34772 -30767 86563 102099 32195 58971
13308 58971 65803 110846 116182 147548 75091 -108025 -204558 -195478 -136806 -149070 -243058 -134557
13296 -134557 -2435 15663 -15335 -112760 -141694 -111472 4030 152831 143182 327068 487304
13285 487304 626122 746204 1108328 1482010 1446258 1296902 1153062 830014 545176 272659
13275 272659 121634 20141 -14921 -3716 69058 196180 207762 69973 -7391 48874 84501
$$ packed form
13353F156K226m7770m0762Q1904O9207O2313j3559j6169j46836j47259o1311J07366
13341a44494K04223n41k54029j37018J2590J82443O1820o0471l3876K7666o3181
13330b04868O3617J6844M5634M9434M6913j0698k8184N279m4912l2682J45891
13319E2268J01052k0327K6532O8368j88663p4002M005J17330J5536o9904K6776
13308E8971O832M5043N336L1366p2457j83116r6533R080N8672j2264r3988J08501
13296a34557J32122J8098l0998r7425k8934L0222J15502J48801r649J83886J60236
13285D87304J38818J20082L62124L73682l5752j49356j43840l23048k84838k72517
13275B72659j51025j01493l5062J1205P2774J27122J1582j37789p7364N6265L5627
$$ plain form
13264 84501 111944 78915 5440 61372 59996 86758 241711 256665 132728 42404 -7056
13253 -7056 -5065 -120469 -102356 -74262 -66898 44024 101173 -88974 -130576 -72481 -29785 64558
13241 64558 49810 -16172 51252 42357 46614 -88047 -17586 26299 -33849 -21054 -38620 9365
13229 9365 52880 25784 -18445 -36792 -101263 -57188 -114037 -73257 -9343 -34023 -114618 -30512
13217 -30512 168175 214494 107180 -45646 -143382 -91420 -140136 -239735 -215893 -120244 -176775
13206 -176775 -196679 -185764 11458 100155 84033 -96289 -174163 -91854 -268558 -231947 -124963
13195 -124963 -108513 -184981 -221326 -156054 -262907 -178310 11600 -9262 -21051 2840 -139179
13184 -139179 -238961 -125477 -88282 -178322 -162889 -131269 -145447 -131717 -59591 -91463 -137999
$$ packed form
13264H4501K7443l3029p3475N5932j376K6762J54953J4954j23937r0324m9460
13253g056J991j15404J8113K8094P364J10922N7149j90147m1602N8095M2696R4343
13241F4558j4748o5982O7424q895M257j34661P0461M3885o0148J2795j7566M7985
13229I365M3515k7096m4229j8347o4471M4075n6849M0780O3914k4680q0595Q4106
13217c0512J98687M6319j07314j52826r7736N1962m8716r9599K3842R5649n6531
13206a76775j9904J0915J97222Q8697j6122j80322p7874Q2309j76704L6611J06984
13195a24963J6450p6468l6345O5272j06853Q4597J89910k0862j1789K3891j42019
13184a39179r9782J13484L7195r0040J5433L1620j4178J3730P2126l1872m6536
$$ plain form
13173 -137999 -153479 -163860 -136896 -188981 -80018 -68467 -9398 65010 5722 -119583 -17461
13162 -17461 18682 -103938 -179299 -209771 -210776 -90596 10161 17701 158875 182003 216141
13151 216141 200033 89340 55152 67185 8683 39772 153621 3397 73916 235118 319719
13140 319719 231654 54336 -50605 -97745 -115645 -202497 -162891 -118026 19934 -16595 -72864
13129 -72864 -34822 -57257 -88350 -84477 -50970 -7153 -30597 2732 121486 254844 231853
13118 231853 32753 -106418 -34437 -65695 -82710 -57126 -61451 49777 12087 73519 117824
13107 117824 117529 -129938 -172709 -126996 -175524 -218673 -224934 -129173 -45429 -106011 -111090 -90549
13095 -90549 -108096 -132375 -265870 -169422 -54160 -129472 -325771 -180878 -138098 -16705 97414
$$ packed form
13173a37999j5480j0381K6964n2085J08963J1551N9069P4408n9288j25305J02122
13162a7461L6143j22620p5361l0472j005J20180J00757P540J41174K3128L4138
13151B16141j6108j10693l4188J2033n8502L1089J13849j50224P0519J61202Q4601
13140C19719q8065j77318j04941m7140j7900q6852L9606M4865J37960l6529n6269
13129g2864L8042k2435l1093L873L3507M3817k3444L3329J18754J33358k2991
13118B31853j99100j39171P1981l1258j7015K5584m325J11228l7690O1432M4305
13107A17824k95k47467m2771M5713m8528m3149o261R5761Q3744o0582n079K0541
13095i0549j7547k4279j33495R6448J15262p5312j96299J44893M2780J21393J14119
$$ plain form
13084 97414 218683 206544 152891 134103 192644 211663 166476 168236 247373 193932 55861
13073 55861 40576 36957 -35414 -116394 -34527 208205 213322 124830 65811 -41801 -61798 -91235
13061 -91235 -11376 41137 -20039 -110962 -88505 84407 130797 -20709 -157383 -11109 200534
13050 200534 213294 109109 130785 225179 129283 -2383 -63479 -140556 -144720 -82795 -114724
13039 -114724 -135671 -116502 -182652 -108082 -151279 -44365 -99413 -205918 -160618 -191461 -143099
13028 -143099 -189818 -217999 -210188 -162364 -2264 -61064 -161242 -263364 -306867 -271066 -257593
13017 -257593 -154610 -25637 7630 -86840 -81891 -102777 -24536 21355 71472 108974 55549
13006 55549 -83211 21455 81507 -111165 -50773 83069 79776 16700 -58072 -86592 -137955
$$ packed form
13084I7414J21269j2139n3653j8788N8541J9019m5187J760P9137n3441j38071
13073E5861j5285l619p2371q0980Q1867K42732N117q8492n9019j07612j9997k9437
13061i1235P9859N2513o1176r0923K2457J72912M6390j51506j36674J46274K11643
13050B00534J2760j04185K1676R4394r5896j31666o1096p7077m164O1925l1929
13039a14724k0947J9169o6150P4570m3197J06914n5048j06505M5300l0843M8362
13028a43099m6719k8181P811M7824J60100n8800j00178j02122m3503L5801J3473
13017b57593J02983J28973L3267r4470M949k0886P8241M5891N0117L7502n3425
13006E5549j38760J04666O0052j92672O0392J33842l293o3076p4772k8520n1363
$$ plain form
12995 -137955 -107883 -131700 -51901 -75049 -132651 -83626 20093 -8635 -74747 -101055 -53510
12984 -53510 -93591 -70639 -63317 77704 206447 168578 100907 105447 121056 118736 123010 147848
12972 147848 134730 125209 55669 -49647 71991 -18570 9847 59103 192133 68418 -26173
12961 -26173 -18539 24824 -64684 -51551 76215 176977 84647 -30571 14233 -29991 -141078
12950 -141078 -76323 -6598 81316 137399 164245 215471 156883 127921 115118 138160 129750 147123
12938 147123 90634 20338 15372 -5240 -50070 -3300 80432 34939 71538 101918 -117747
12927 -117747 -219375 -158596 -6878 -1709 -31346 -38372 -24994 -104509 -182417 -138004 -9207
12916 -9207 -4999 -58332 56890 270521 363450 181597 195172 167835 -14729 -97809 -31589
$$ packed form
12995a37955L0072k3817P9799k3148n7602M9025J03719k8728o6112k6308M7545
12984e3510m0081K2952P322J41021J28743l7869o7671M540J5609k320M274K4838
12972A47848j3118r521o9540j05316J21638r0561K8417M9256J33030j23715r4591
12961b6173P634M3363q9508J3133J27766J00762r2330j15218M4804m4224j11087
12950a41078O4755O9725Q7914N6083K6846N1226n8588k8962j2803K3042q410J7373
12938A47123n6489p0296m966k0612m4830M6770Q3732m5493L6599L0380k19665
12927a17747j01628O0779J51718N169k9637p026J3378p9515p7908M4413J28797
12916i207M208n3333J15222K13631R2929j81853J3575k7337j82564q3080O6220
$$ plain form
12905 -31589 -91918 -38806 -4527 -13201 -1670 -50040 -1571 49246 17324 -56704 -83966 -18472
12893 -18472 -24006 -134790 -184070 -228420 -25097 14818 81113 151529 185890 172905 151911
12882 151911 294837 363097 287023 286772 258740 228906 186503 122897 74106 -36120 -70746
12871 -70746 -97011 -76369 -72292 1682 85562 19880 36125 12590 -161885 -28864 28788
12860 28788 -8814 -47537 19306 -49206 -49745 18519 166770 208345 62361 -86973 26693
12849 26693 -75494 -234694 -53873 72245 -72602 -239900 -158921 -66328 -47670 53485
12839 53485 47000 65409 183469 173524 150413 129132 17555 -73077 -11778 -84744 -175172 -168968
12827 -168968 -130964 -58587 -88086 -46434 -22802 -60954 -134812 -178770 -161166 -230903 -170096
$$ packed form
12905c1589o0329N3112L4279q674J1531m8370M8469N0817l1922p4028k7262O5494
12893a8472n534j10784m9280m4350K03323L9915O6295P0416L4361j2985k0994
12882A51911J42926O8260p6074k51k8032k9834m2403o3606m8791j10226l4626
12871g0746k6265K0642M077P3974Q3880o5682J6245k3535j74475J33021N7652
12860B8788l7602l8723O6843o8512n39O8264J48251M1575j45984j49334J13666
12849B6693j02187j59200J80821J26118j44847j67298Q0979R2593J8658J01155
12839E3485o485J8409J18060r945k3111k1281j11577r0632O1299p2966r0428O204
12827a68968L8004P2377k9499M1652K3632l8152p3858m3958J7604o9737O0807
$$ plain form
12816 -170096 -82358 57178 78798 -13783 -129186 -138978 -143390 -6576 113514 119160 44629
12805 44629 22085 39156 -63049 -10268 7385 -160486 -155464 -53866 -78642 -48166 20821
12794 20821 21191 -22061 50317 -152020 -228106 -119434 -206623 -183743 -91580 -191888 -221294
12783 -221294 -174947 -37111 -52686 -95028 -235029 -292091 -304956 -253268 -116666 -66623 -124662
12772 -124662 -164262 -146873 -211987 -212760 -114540 -66547 -36234 -101116 -146262 -3733 51065 67226
12760 67226 -22915 -47295 69187 54273 58230 -83586 -17650 -179571 -264004 -149287 -269886
12749 -269886 -354545 -150858 -90913 49916 -57406 -71919 -77983 -115746 -136438 -195245 -238208
12738 -238208 -41835 -74115 -95724 10807 74724 32400 -135703 -283698 -261662 -193198 -178370
$$ packed form
12816a70096Q7738J39536K1620r2581j15403r792m412J36814J20090N646p4531
12805D4629k2544J7071j02205N2781J7653j67871N022J01598k4776L0476O8987
12794B0821L70m3252P2378k02337p6086J08672q7189K2880R2163j00308k9406
12783b21294M6347J37836j5575m2342j40001n7062j2865N1688J36602N0043n8039
12772a24662l9600J7389o5114p73R8220M7993L0313o4882m5146J42529N4798J6161
12760F7226r0141k4380J16482j4914L957j41816O5936j61921q4433J14717j20599
12749b69886q4659K03687N9945J40829j07322j4513o064l7763k0692n8807m2963
12738b38208J96373l2280k1609J06531O3917m2324j68103j47995K2036O8464J4828
$$ plain form
12727 -178370 -198897 -277185 -348913 -266418 -120499 -6651 -79577 -71232 -51186 -120733 -156389
12716 -156389 -244886 -236586 -240637 -181546 -85456 -119994 -125485 -145577 -139691 -58912 -14341 -29243
12704 -29243 -97104 -32328 11792 69836 91062 40293 -20995 -94773 -112596 -63910 -29677 -52541
12692 -52541 -90580 -137638 -256893 -255778 -152615 -161218 -39414 104003 110266 -5541 -130811
12681 -130811 -169765 -313570 -245089 -65411 -72618 -130986 -54909 -50515 -24055 -67304 -71730 -120528
12669 -120528 -182811 -18944 -30129 -116451 -14965 74452 -111319 -242584 -94793 115004
12659 115004 80089 -96488 -104902 70398 160680 128451 11687 -169215 -326152 -275099 -160553
12648 -160553 -63475 -15624 11759 7975 -37647 70878 -16815 -88601 -25913 -5249 -51113
$$ packed form
12727a78370k0527p8288p1728Q2495J45919J13848p2926Q345K0046o9547l5656
12716a56389q8497Q300m051N9091R6090l4538n491k0092N886Q0779M4571j4902
12704b9243o7861O4776M4120N8044K1226n0769o1288p3778j7823M8686L4233k2864
12692e2541l8039m7058j19255J115J03163q603J21804J43417O263j15807j25270
12681a30811l8954j43805O8481J79678p207n8368P6077M394K6460m3249m426m8798
12669a20528o2283J63867j1185q6322J01486Q9417j85771j31265J47791K09797
12659A15004l4915j76577q414J75300R0282l2229j16764j80902j56937N1053J14546
12648a60553R7078M7851K7383l784m5622J08525q7693p1786O2688K0664m5864
$$ plain form
12637 -51113 -65790 -64724 -99164 -29387 3919 -64442 93453 138933 126032 94957 -94487
12626 -94487 -168247 -216412 -324823 -376290 -354198 -240293 -5764 62676 -18132 73399 54318
12615 54318 97426 106286 -128111 -127766 -86173 -108762 -31776 35827 72360 116084 88733 68099
12603 68099 110317 113199 88680 -17105 -62723 -183943 -310018 -393605 -402429 -160478 -73484
12592 -73484 -167838 -206812 -368227 -312359 -138022 -124408 -108023 -79273 -81456 -158337 -139213
12581 -139213 -41570 -56481 -129862 -92129 56134 146555 141222 144460 68677 -149232 -282015
12570 -282015 -252375 -267474 -249199 -121221 -105983 -280885 -193161 -28089 2684 14975 -48392
12559 -48392 -99169 -45583 -54678 -25285 -57978 -22676 -40902 -262692 -273864 -181292 -126652 -61726
$$ packed form
12637e1113j4677J066l4440O9777L3306o8361J57895M5480j2901l1075j89444
12626i4487p3760m8165j08411n1467K2092J13905K34529O8440q0808R1531j9081
12615E4318M3108Q860k34397L45M1593k2589P6986O7603L6533M3724k7351k0634
12603F8099M2218K882k4519j05785m5618j21220j26075q3587q824K41951Q6994
12592g3484r4354l8974j61415N5868J74337J3614J6385K8750k183p6881J9124
12581a39213R7643j4911p3381L7733J48263R0421n333L238p5783k17909j32783
12570b82015K9640j5099J8275J27978J5238j74902Q7724J65072L0773J2291o3367
12559d8392n0777N3586r095K9393l2693L5302j8226k21790j1172R2572N4640O4926
$$ plain form
12547 -61726 53741 43026 -67322 -184018 -229372 -76181 -5408 -81699 -61393 -40492 59789
12536 59789 113574 75737 -35306 -92938 82657 101205 -5292 -46408 -97706 -79428 -18417
12525 -18417 -75762 -118498 -37288 65800 137336 171125 69763 -28728 14857 60354 115780
12514 115780 51424 57835 64159 -16036 -118581 -26875 -79402 4074 53217 -28098 -113924 -26006
12502 -26006 -46292 -33633 6983 11933 -63249 59496 -9640 -32895 -16026 -32221 -6788 14877
12490 14877 -73826 -121393 -112105 -147704 -121944 -204185 -209560 -156971 -206074 -220014 -127006 -124949
12478 -124949 -163747 -152865 -122180 -87366 -53001 63673 138851 72988 49942 51965 -17087
12467 -17087 -89025 -109298 -42835 -27075 -152890 -207495 -182837 -112238 -189418 -100059 56273
$$ packed form
12547f1726J15467j0715j10348j16696m5354J53191P0773p6291K0306K0901J00281
12536E9789N3785l7837j11043n7632J75595J8548j06497m1116n1298J8278O1011
12525a8417n7345m2736Q1210J03088P1536L3789j01362r8491M3585M5497N5426
12514A15780o4356O411O324q0195j02545R1706n2527Q3476M9143q1315q5826Q7918
12502b6006k0286J2659M0616M950p5182J22745o9136k3255J6869j6195K5433K1665
12490A4877q8703m7567R288l5599K5760q2241n375N2589m9103j3940R3008K057
12478a24949l8798J0882L0685L4814L4365J16674P5178o5863k3046K023o9052
12467a7087p1938k0273O6463J5760j25815n4605K4658P0599p7180Q9359J56332
$$ plain form
12456 56273 181963 287600 192022 96120 44543 135144 189225 158609 -11090 47160 55455
12445 55455 44569 60414 -79973 -53774 -106463 -97303 -123102 19979 151553 112684 63932
12434 63932 -58194 -88596 30488 120239 3006 -68816 -44707 -7015 -5242 -7448 -25847
12423 -25847 79323 48099 -1164 12260 71251 63977 -39603 -10115 90580 147514 121182
12412 121182 -36445 -107755 -45057 -10740 -37626 -103403 -145632 -85723 -131082 -43645 -9875
12401 -9875 -112666 -111306 41017 121706 145983 124470 41250 71986 5453 -28569 -46856 -97788
12389 -97788 -85074 38694 127278 107175 27658 -14036 -78458 44446 -12570 -185051 -107126
12378 -107126 -12322 -185731 -286033 -238539 -125785 -76145 -49996 11566 47550 202606 141635
$$ packed form
12456E6273J25690J05637r5578r5902n1577R0601N4081l0616j69699N8250Q295
12445E5455j0886J5845j40387K6199n2689R160k5799J43081J31574l8869m8752
12434F3932j22126l0402J19084Q9751j17233p1822K4109L7692J773k206j8399
12423b5847J05170l1224m9263J3424N8991p274j03580K9488J00695N6934k6332
12412A21182j57627p1310O2698L4317k6886o5777m2229N9909m5359Q7437L3770
12401i875j02791J360J52323Q0689K4277k1513q3220L0736o6533l4022j8287n0932
12389i7788J2714J23768Q8584k0103p9517m1694o4422J22904n7016j72481P7925
12378a07126R4804j73409j00302M7494J12754M9640K6149O1562L5984J55056o0971
$$ plain form
12367 141635 99505 -7107 -54511 136132 -1467 -143356 -201572 -326138 -306836 -188470
12357 -188470 -183212 -128539 -215891 -263968 -207208 -154111 -169643 -112420 -36777 -64437 -22062 -5418
12345 -5418 -33955 -22360 -90839 -87786 -83442 -7834 26202 -61386 -42740 -43693 -100262 -136268 -201075
12332 -201075 -198620 -196305 -149309 -204770 -207011 -84042 -87862 -65411 23864 -49311 -184013 -279301
12320 -279301 -241793 -302454 -248422 -110069 115139 211407 161476 -3989 -72265 7864 32479
12309 32479 6291 -31191 -70388 -101263 -81859 537 25278 36721 82760 43629 -95896
12298 -95896 -192029 -247885 -279421 -329758 -392955 -320007 -387076 -357992 -241058 -54282 -25577
12287 -25577 -166616 -190591 -188756 -240672 -144112 -170615 -113108 -115378 -108762 -71128 61205 87458
$$ packed form
12367A41635m2130j06612m7404J90643j37599j41889n8216j24566J9302J18366
12357a88470N258N4673q7352m8077N6760N3097j5532N7223P5643k7660M2375J6644
12345e418k8537J1595o8479L053M344P5608L4036q7588J8646r53n6569l6006o4807
12332b01075K455K315M6996n5461k241J22969l820K2451Q9275p3175j34702r5288
12320b79301L7508o0661N4032J38353K25208R6268m9931j65465o8276Q0129K4615
12309C2479k6188l7482l9197l0875J9404Q2396K4741J1443M6039l9131j39525
12298i5896r6133n5856l1536n0337o3197P2948o7069K9084J16934J86776K8705
12287b5577j41039k3975J835n1916R6560k6503N7507k270O616L7634J32333K6253
$$ plain form
12275 87458 -36584 -9174 55872 19023 -19077 -14992 22747 53638 10343 20406 -38559 -67457
12263 -67457 -138581 -193525 -140880 -130166 -204327 -200398 -188953 -96924 -47018 -93846 -182151 -234159
12251 -234159 -155128 -94695 -17828 -99241 -91042 -146828 -207260 -99789 -273847 -278545 -103883
12240 -103883 -44088 -82865 -27943 -57684 51450 20811 22093 64037 215310 133581 100544
12229 100544 200630 16527 -155901 -238320 -146129 -57504 -18285 -45208 -134907 -142700 -110274
12218 -110274 -208175 -250548 -335639 -357168 -195645 -90694 -57676 75212 68874 92050 160841
12207 160841 277755 198332 205480 236354 184741 101455 35131 65255 107970 161211 87218
12196 87218 -12208 -3057 21612 -8423 -2523 -16173 -63033 -37471 41037 189340 380518 414016
$$ packed form
12275H7458j24042K7410O5046l6849l8100M085L7739L0891m3295J0063n8965k8898
12263f7457p1124n4944N2645J0714p4161L929J1445R2029M9906m6828q8305n2008
12251b34159P9031O0433P6867q1413Q199n5786o0432J07471j74058m698J74662
12240a03883N9795l8777N4922k9741J09134l0639J282M1944J51273q1729l3037
12229A00544J00086j84103j72428q2419R2191Q8625L9219k6923q9699p793L2426
12218a10274r7901m2373q5091k1529J61523J04951L3018J32888o338K3176O8791
12207A60841J16914p9423P148L0874n1613q3286o6324L0124M2715N3241p3993
12196H7218r9426R151K4669l0035N900j3650m6860K5562P8508J48303J91178L3498
$$ plain form
12184 414016 492566 417320 329923 256607 134947 100538 197508 81573 29018 -29976 31104
12173 31104 64763 63327 74350 88257 129395 54679 7906 131137 106709 -28283 38435
12162 38435 115960 69086 46095 -81140 -74868 8264 98650 85080 120649 169311 159556 51260
12150 51260 40034 73792 52031 77610 -431 9794 29691 29016 131031 92912 136810 317711
12138 317711 212890 98650 135558 169563 191680 127840 96536 99292 94524 45773 109968
12127 109968 125529 -42431 -107411 -79619 14385 92321 49461 -8113 26155 96163 90220
12116 90220 164137 234557 241351 294416 353400 214476 172004 140512 84398 21357 -5456 -9279
12104 -9279 18265 -84680 -81011 133668 220423 197933 129112 38180 92533 32452 22928 155833
$$ packed form
12184D14016P8550p5246q7397p3316j21660l4409R6970j15935n2555n8994O1080
12173C1104L3659j436J1023J3907M1138p4716m6773J23231k4428j34992O6718
12162C8435P7525m6874k2991j27235O272Q3132R0386j3570L5569M8662r755j08296
12150E1260j1226L3758k1761K5579p8041J0225J9897o75J02015l8119M3898J80901
12138C17711j04821j14240L6908L4005K2117o3840l1304K756m768m8751O4195
12127A09968J5561j67960o4980K7792R4004P7936m2860n7574L4268P0008n943
12116I0220P3917P0420O794N3065N8984j38924m2472l1492n6114o3041k6813l823
12104i279K7544j02945L669K14679Q6755k2490o8821r0932N4353o0081r524J32905
$$ plain form
12092 155833 228000 203074 166557 261083 319002 306411 296458 380414 315739 298980 260337 454345
12080 454345 438108 296068 265224 336431 430508 234620 69461 65337 35753 61300 145190
12069 145190 352290 450231 504849 375888 293237 265081 276416 316655 269324 187762 171963
12058 171963 -5274 -156966 -324923 -338658 -139917 51402 230209 217741 280521 324163
12048 324163 299320 328545 253436 240167 376375 283851 253829 490602 601216 661989 723723
12037 723723 751840 732643 625851 545144 456176 437535 480326 581175 471345 387221 370016
12026 370016 280512 441944 511930 441259 437937 386788 306310 269954 230228 355086 360630
12015 360630 419240 561773 625212 729433 688150 510689 401766 397433 351821 478357 577951
$$ packed form
12092A55833P2167k4926l6517R4526N7919j2591r953Q3956o4675j6759l8643J94008
12080D54345j6237j42040l0844P1207R4077j95888j65159m124k9584K5547Q3890
12069A45190K07100R7941N4618j28961q2651k8156J1335M0239m7331q1562j5799
12058A71963j77237j51692j67957j3735J98741J91319J78807j2468O2780M3642
12048C24163k4843K9225p5109j3269J36208r2524l0022K36773J10614O0773O1734
12037G23723K8117j9197j06792q0707q8968j8641M2791J00849j09830q4124j7205
12026C70016q9504J61432O9986p0671l322n1149q0478l6356l9726J24858N544
12015C60630N8610J42533O3439J04221m1283j77461j08923m333m5612J26536R9594
$$ plain form
12004 577951 597438 527402 514964 669409 849557 819823 912844 1118910 1210944 1181967 1139906
11993 1139906 1055384 1047895 905649 934467 1066739 1249718 1383659 1417192 1416854 1430729 1384558
11982 1384558 1480203 1458464 1322760 1380968 1437120 1471981 1515212 1623043 1725505 1739111 1782082
11971 1782082 2018760 2248921 2308743 2450950 2593981 2650411 2891214 3064389 3253218 3434115
11961 3434115 3748565 3880530 4033931 4286214 4580405 4944654 5431026 5969047 6482276
11952 6482276 7068067 7787878 8402668 8974740 9630185 10483305 11502289 12610696 14057337
11943 14057337 16022367 18549110 21592001 25147727 29746251 35677098 43628082 54864375
11935 54864375 70928391 94571534 130300787 185681657 270342467 384048364 498029254
$$ packed form
12004E77951J9487p0036j2438J54445J80148k9734R3021K06066R2034k8977m2061
11993A139906q4522p489j42246K8818J32272J82979J33941L3533l38J3875m6171
11982A384558R5645k1739j35704N8208N6152L4861M3231J07831J02462J3606M2971
11971A782082K36678K30161N9822J42207J43031N6430K40803J73175J88829J80897
11961C434115L14450J31965J53401K52283K94191L64249M86372N38021N13229
11952F482276N85791P19811O14790N72072O55445Q53120J018984J108407J446641
11943A4057337J965030K526743L042891L555726M598524N930847P950984J1236293
11935E4864375J6064016K3643143L5729253N5380870Q4660810J13705897J13980890
$$ plain form
11928 498029254 549284573 487497181 364023368 255891399 182024101 134360491 102887258
11921 102887258 80973401 65066617 53310203 44351704 37133183 31264434 26713899
11914 26713899 23281545 20398468 17957197 15739562 13968753 12515199 11260195 10227790
11906 10227790 9276894 8388348 7789237 7221657 6696623 6103353 5500329 5058876 4740343
11897 4740343 4486328 4204507 3920976 3677493 3502608 3200145 2911155 2760219 2614181
11888 2614181 2460798 2393762 2437002 2524288 2385025 2185889 1993064 1867793 1909867 2008044
11878 2008044 1761005 1436925 1274981 1273235 1238154 1171861 1210084 1095916 1004790 1041525 1084168
11867 1084168 1049783 1068444 1093700 1116199 1051055 947602 841842 802702 822603 755946 671875
$$ packed form
11928D98029254N1255319o1787392j23473813j08131969p3867298m7663610l1473233
11921A02887258k1913857j5906784j1756414q958499p218521n868749m550535
11914B6713899l432354k883077k441271k217635j770809j453554j255004j032405
11906A0227790r50896q88546n99111n67580n25034n93270o03024m41453l18533
11897D740343k54015k81821k83531k43483j74885l02463k88990j50936j46038
11888B614181j53383o7036M3240Q7286j39263j99136j92825j25271M2074R8177
11878B008044k47039l24080j61944j746l5081o6293L8223j14168r1126L6735M2643
11867A084168l4385J8661K5256K2499o5144j03453j05760l9140J9901o6657q4071
$$ plain form
11856 671875 741877 864648 903079 783391 615810 554065 573189 653568 633231 652719 664134
11845 664134 592326 607939 555863 509344 433790 419821 427502 321134 165552 212414 257680
11834 257680 233301 204590 316838 451096 481445 522683 491509 490658 310426 211001 196711
11823 196711 228172 324130 326602 228423 318269 383481 265950 163326 106139 120560 85410
11812 85410 33957 161816 58517 6332 46918 181016 194339 230183 328042 534238 867822
11801 867822 1087326 1016641 787528 570254 477498 399091 364376 311763 325105 348018 452758
11790 452758 426017 343686 221517 225297 131870 40925 136225 148414 105260 213431 201775
11779 201775 255636 338637 381706 383499 378223 406878 427352 480003 473549 319625 107363 68196
$$ packed form
11856F71875P0002J22771L8431j19688j67581o1745J9124Q0379k0337J9488J1415
11845F64134p1808J5613n2076m6519p5554j3969P681j06368j55582M6862M5266
11834B57680k4379k8711J12248J34258L0349M1238l1174q51j80232r9425j4290
11823A96711L1461R5958K472r8179Q9846O5212j17531j02624n7187J4421l5150
11812H5410n1453J27859j03299n2185M0586J34098J3323L5844R7859K06196L33584
11801H67822K19504p0685k29113k17274r2756p8407l4715n2613J3342K2913J04740
11790D52758k6741q2331j22169L780r3427r0945R5300J2189m3154J08171j1656
11779B01775N3861Q3001M3069J793n276K8655K0474N2651o454j53924k12262l9167
$$ plain form
11767 68196 111828 253398 261271 228664 105871 11530 -11344 35001 92855 165716 85762
11756 85762 68097 10773 10324 -2459 22961 28783 -380 -66760 3001 -35897 -29337 -39207 26816
11743 26816 101066 84634 6974 105683 220213 81659 163028 239645 277722 287224 291717 343154
11731 343154 305356 145081 -23305 7722 118324 146162 130949 35432 -29134 -140192 -46648
11720 -46648 196781 222994 88508 -69308 -16733 129820 152838 108540 167193 259712 280730
11709 280730 201056 201271 165034 193813 182540 298845 399307 285631 176993 97171 11572
11698 11572 -33081 69814 125867 185760 236188 83411 17907 20749 6975 -86980 -146503
11687 -146503 -115941 120033 275155 312057 242761 88275 26301 102707 175751 216426 91739
$$ packed form
11767F8196M3632J41570P873l2607j22793r4341k2874M6345N7854P2861p9954
11756H5762j7665n7324m49j2783K5420N822k9163o6380O9761l8898O560r870O6023
11743B6816P4250j6432p7660R8709J14530j38554Q1369P6617L8077R502M493N1437
11731C43154l7798j60275j68386L1027J10602K7838j5213r5517o4566j11058R3544
11720d6648K43429K6213j34486j57816N2575J46553K3018m4298N8653R2519K1018
11709B80730p9674K15l6237K8779j1273J16305J00462j13676j08638p9822q5599
11698A1572m4653J02895N6053N9893N0428j52777o5504K842j3774r3955n9523
11687a46503L0562K35974J55122L6902o9296j54486o1974P6406P3044M0675j24687
$$ plain form
11676 91739 -63971 -141860 -64360 -80078 12683 8018 40150 124854 113979 215637 266466
11665 266466 204091 150268 31072 69861 54203 45329 49611 1663 -36672 42942 155174
11654 155174 310725 372313 272374 256144 265282 188024 122331 56860 -8846 -72199 -146963
11643 -146963 -102453 5237 68356 121934 227627 199077 93736 -19906 -10876 17541 -47082
11632 -47082 -35201 118599 72763 -88262 -130581 -125189 -197807 -105229 -92225 -48442 -841
11621 -841 -46655 -152264 -235470 -212035 -197661 -127656 -119714 -122657 -55471 -116579 -111391 -4822
11609 -4822 54255 22938 -83834 35255 141401 34213 63064 -38278 -89225 22846 32534
11598 32534 39484 22965 -26030 -41003 -124097 -141184 -173869 -187616 -221367 -123180 22546 -31046
$$ packed form
11676I1739j55710p7889P7500j5718R2761m665L2132Q4704j0875J01658N0829
11665B66466o2375n3823j19196L8789j5658q874M282m7948l8335P9614J12232
11654A55174J55551O1588r9939j6230R138p7258o5693o5471o5706o3353p4764
11643a46963M4510J07690O3119N3578J05693k8550j05341j13642R030K8417o4623
11632d7082J1881J53800m5836j61025m2319N392p2618R2578J3004M3783M7601
11621h41m5814j05609q3206K3435J4374P0005P942k943O7186o1108N188J06569
11609d822N9077l1317j06772J19089J06146j07188K8851j01342n0947J12071R688
11598C2534O950j6519m8995j4973q3094j7087l2685j3747l3751R8187J45726n3592
$$ plain form
11586 -31046 -31288 63582 27247 -35150 -168317 -178417 -133520 -110268 -172443 -67595 -1192 25605
11574 25605 -90821 -36201 71321 31079 -7699 -111438 -178555 -99979 -94764 -133170 -127882
11563 -127882 -189862 -244935 -112940 56092 37760 -13215 -62109 -114827 -16497 -43700 -45828
11552 -45828 -25534 -6227 22884 1254 -84412 -91389 -15742 -148085 -277307 -271871 -221717 -120911
11540 -120911 -104256 -82053 -22821 -56875 15716 -2695 -120107 -191053 -207601 -260154 -255949
11529 -255949 -127911 -79764 -39390 60353 124098 256300 269454 218410 221536 172426 96388
11518 96388 -22321 -62263 -587 -14083 -14988 28242 145678 160988 85046 70744 122798 36837
11506 36837 -20685 -77130 -92875 -57384 29250 80219 36739 -90335 -88235 -10718 85018 -57465
$$ packed form
11586c1046k42R4870l6335o2397j33167j0100M4897K3252o2175J04848O6403K6797
11574B5605j16426N4620J07522m0242l8778j03739o7117P8576N215l8406N288
11563a27882o1980n5073J31995J69032j8332n0975m8894n2718R8330k7203k128
11552d5828K0294J9307K9111k1630q5666o977P5647j32343j29222N436N0154J00806
11540a20911J6655K2203N9232l4054P2591j8411j17412p0946j6548n2553M205
11529b55949J28038M8147M0374R9743O3745J32202J3154n1044L126m9110p6038
11518I6388j18709l9942O1676j3496r05M3230J17436J5310p5942j4302N2054q5961
11506C6837n7522n6445j5745L5491Q6634N0969m3480j27074K100P7517R5736j42483
$$ plain form
11494 -57465 -57314 70182 -13294 -43757 121109 157979 16494 -208653 -45374 49653 57927
11483 57927 76609 125796 38056 -121344 -163061 -19115 67662 18864 96608 108921 249084
11472 249084 291123 226828 312129 366110 308566 232307 188672 145140 69374 -105138 -188836
11461 -188836 -46485 133297 67780 -34377 -46287 -60499 -216686 -198602 -75705 24467
11451 24467 6002 -107123 -81421 15510 55634 -71946 -65540 23211 37427 73456 30833
11440 30833 227 4750 79427 51591 -61418 -128022 -102249 -141940 -56391 125298 93653
11429 93653 -51685 -74526 -143700 -136962 -131003 -68935 23475 23606 -31754 -7782 -29395 -128964
11417 -128964 -21273 218651 240612 114148 77338 82762 -79925 -107119 -109251 -68848 41473
$$ packed form
11494e7465J51J27496q3476l0463J64866L6870j41485k25147J63279R5027Q274
11483E7927J8682M9187q7740j59400m1717J43946Q6777m8798P7744J2313J40163
11472B49084M2039o4295Q5301N3981n7544p6259m3635m3532p5766j74512q3698
11461a88836J42351J79782o5517j02157j1910j4212j56187J8084J22897J00172
11451B4467j8465j13125K5702R6931M0124j27580O406Q8751J4216L6029m2623
11440C0833l0606M523P4677k7836j13009o6604K5773l9691Q5549J81689l1645
11429I3653j45338k2841o9174O738N959O2068R2410J31n5360K3972k1613r9569
11417a28964J07691K39924K1961j26464l6810N424j62687k7194k132M0403J10321
$$ plain form
11406 41473 80465 119506 -7218 -181410 -181354 -26189 40951 30753 -39635 38650 59603 37698
11394 37698 -17110 -71019 -131210 -118219 -66890 -46177 -63838 -24735 39419 -60438 -55541 4882
11382 4882 -49951 -31821 97121 131093 137095 78198 -24350 -113944 -125601 -41767 -123095 -170998
11370 -170998 -122535 -86815 -25284 -106230 -340047 -341577 -318714 -162134 -20924 -64574 -61903
11359 -61903 -106830 -118701 -103370 13794 109169 51940 23560 -3575 -48985 89359 76806
11348 76806 120718 226751 195874 -77019 -193569 -214311 -251175 -39571 50506 -56942 -23034
11337 -23034 -185527 -354142 -273332 -94344 -157107 -139444 -7687 -16150 41910 66843 17919
11326 17919 -31225 -72076 -104709 -42260 20397 -9660 112877 50153 -10761 -9369 -91801 -125231
$$ packed form
11406D1473L8992L9041j26724j74192N6J55165O7140j0198p0388P8285K0953k1905
11394C7698n4808n3909o0191J2991N1329K0713j7661L9103O4154r9857M897O0423
11382D882n4833J8130J28942L3972O002n8897j02548q9594j1657Q3834q1328m7903
11370a70998M8463L5720O1531q0946k33817j530K2863J56580J41210m3650K671
11359f1903m4927j1871J5331J17164R5375n7229k8380k7135m5410J38344j2553
11348G6806M3912J06033l0877k72893j16550k0742l6864K11604R0077j07448L3908
11337b3034j62493j68615Q0810J78988o2763J7663J31757q463N8060K4933m8924
11326A7919m9144m0851l2633O2449O2657l0057J22537o2724o0914J392q2432l3430
$$ plain form
11314 -125231 -121948 -161330 -41679 -53715 -84963 -85419 -66394 -175714 -262207 -291864 -261128 -46373
11302 -46373 81535 45219 78976 87043 99876 82736 -16704 -120325 -92209 -2593 -64037
11291 -64037 -152769 -147987 -57280 -177809 -168936 -46917 -43110 -103025 -72059 -139685 -120478 -169016
11279 -169016 -162844 -85186 890 -66011 -79480 -39322 -154038 -287406 -216158 -89008 -54129
11268 -54129 -70298 -82737 17237 -27432 -42673 19402 65211 47006 -38741 24131 74491 -46324
11256 -46324 47338 110094 140044 250805 254819 156672 13840 -29542 10289 68197 102217
11245 102217 72000 80904 34517 -24250 -87686 -159759 -101546 -46798 -130901 -184312 -171907 -123274
11233 -123274 -151950 -202026 -249029 -299056 -270694 -44891 -90891 -144804 -39780 78019 5152
$$ packed form
11314a25231L283l9382J19651j2036l1248m56J9025j09320q6493k9657L0736K14755
11302d6373J27908l6316L3757Q067J2833j7140r9440j03621K8116Q9616o1444
11291f4037q8732M782R0707j20529Q873J22019L807n9915L0966o7626J9207m8538
11279a69016O172P7658Q6076o6901j3469M0158j14716j33368P1248J27150L4879
11268e4129j6169j2439R9974m4669j5241O2075M5809j8205q5747O2872N0360j20815
11256d6324R3662O2756K9950J10761M014r8147j42832m3382L9831N7908L4020
11245A02217l0217Q904m6387n8767o3436p2073N8213N4748q4103n3411J2405M8633
11233a23274k8676n0076m7003n0027K8362K25803m6000n3913J05024J17799p2867
$$ plain form
11222 5152 -53856 -123356 -148249 -195964 -152435 -109458 -211409 -169504 -13296 73895 2089
11211 2089 -38633 -70077 61619 127398 151077 140830 -1430 -5005 -40521 50602 201043
11200 201043 158933 34142 35186 45516 -56468 25989 5548 -90137 -173474 -190491 -77252
11189 -77252 99974 98684 50778 -19687 -189286 -183195 -115236 -112103 -209864 -180793 -269386 -231106
11177 -231106 -82268 14622 159 19580 -104601 -137875 -165418 -265002 -296090 -224245 -261252
11166 -261252 -236193 -109506 -65385 -16064 -85540 5742 64293 63082 94902 115507 -18068
11155 -18068 -16722 -41131 -172567 -155630 -58219 8110 25737 -84861 -158433 -90365 106327
11144 106327 88499 74918 149048 169946 107707 -13351 -88987 -163237 -256644 -327431 -223902
$$ packed form
11222E152n9008o9500k4893m7715M3529M2977j01951M1905J56208Q7191p1806
11211B089m0722l1444J31696O5779K3679j0247j42260l575l5516R1123J50441
11200B01043m2110j24791J044J0330j01984Q2457k0441r5685q3337j7017J13239
11189g7252J77226j290m7906p0465j69599O091O7959L133r7761K9071q8593L8280
11177b31106J48838R6890j4463J9421j24181l3274k7543r9584l1088P1845l7007
11166b61252K5059J26687M4121M9321o9476R1282N8551j211L1820K0605j33575
11155a8068J346k4409j31436J6937R7411O6329J7627j10598p3572O8068J96692
11144A06327j7828j3581P4130K0898o2239j21058p5636p4250r3407p0787J03529
$$ plain form
11133 -223902 -130487 -27493 225 -14370 -30786 -122590 -55210 4900 42309 -40980 -54787
11122 -54787 -164557 -267093 -237284 -179919 -127622 -154977 -141163 -234075 -232219 -195307 -162518
11111 -162518 -167504 -92749 -49806 -74749 -130892 -148088 -250263 -217004 -121016 -118040 -107576 73757
11099 73757 31540 -62476 20261 -41444 3693 80713 -63333 -212506 -75375 -76866 -20929
11088 -20929 99080 203042 210210 131760 56916 16749 73306 74109 32429 -174512 -247304 -74814
11076 -74814 62189 57527 -95886 -118800 -90685 -68152 -16373 -15208 -136089 -238396 -200353
11065 -200353 57944 177727 124256 25102 -92398 -7705 127071 115970 97853 184807 85190
11054 85190 404 -4735 204266 265410 263246 246873 200554 340196 458484 530212 545507
$$ packed form
11133b23902R3415J02994K7718j4595j6416r1804O7380O0110L7409q3289j3807
11122e4787j09770j02536K9809N7365N2297k7355J3814r2912J856L6912L2789
11111a62518m986P4755M2943k4943n6143j7196j02175L3259R5988K976J0464J81333
11099G3757m2217r4016Q2737o1705M5137P7020j44046j49173J37131j491N5937
11088b0929J20009J03962P168p8450p4844m0167N6557Q03m1680k06941p2792J72490
11076g4814J37003m662j53413k2914K8115K2533N1779J165j20881j02307L8043
11065b00353K58297J19783n3471r9154j17500Q4693J34776j1101j8117Q6954r9617
11054H5190q4786n139K09001O1144k164j6373m6319J39642J18288P1728J5295
$$ plain form
11043 545507 469631 441405 448262 560151 670669 759151 674336 734539 761866 797318 904143
11032 904143 860176 778913 689761 703962 559815 498206 707121 890697 955199 1110391 1201921
11021 1201921 1297184 1236048 1158360 1044086 851101 642135 571802 717471 809205 837409
11011 837409 809011 964189 1054890 971796 946741 857016 674433 444858 303234 164887
11001 164887 233732 318187 407104 347383 295927 324310 343315 317229 365966 344654 299358
10990 299358 314975 208538 204531 189239 214022 207708 263986 142925 59186 51552 3780 15417
10978 15417 155035 126647 -34843 -30296 -31510 -20651 -49045 29293 61142 20835 71505 137161
10966 137161 143153 200700 -46700 -65195 -72068 -77383 -113042 -97346 -8348 -39822 -85469 -60454
$$ packed form
11043E45507p5876k8226O857J11889J10518Q8482q4815O0203K7327L5452J06825
11032I04143m3967q1263q9152J4201j44147o1609K08915J83576O4502J55192R1530
11021A201921R5263o1136p7688j14274j92985k08966p0333J45669R1734K8204
11011H37409k8398J55178R0701q3094k5055q9725j82583k29575j41624j38347
11001A64887O8845Q4455Q8917n9721n1456K8383J9005k6086M8737k1312m5296
10990B99358J5617j06437m007j5292K4783o314N6278j21061q3739p634m7772J1637
10978A5417J39618k8388j61490M547j214J0859k8394P8338L1849m0307N0670O5656
10966A37161N992N7547k47400j8495o873n315l5659J5696Q8998l1474m5647K5015
$$ plain form
10954 -60454 -58005 25981 -29771 -62507 -20380 -138884 -104658 -44484 21096 -11075 -13497 79717
10942 79717 40813 -61624 -234358 -100794 -63564 -29095 128032 99684 56685 -83371 -52394
10931 -52394 -129334 -183769 -155692 -99993 -50405 -68591 -134464 -140534 59430 37278 10164 -98514
10919 -98514 29923 153146 213566 253803 214675 191023 140858 51105 62014 -3662 -99675
10908 -99675 -5005 -17092 -89211 -126154 -100080 -22430 -13872 30277 -19159 -232573 -281872 -117256
10896 -117256 -31325 -11706 73216 172347 192047 93350 -16653 29966 -16036 30532 -50736
10885 -50736 -16937 -25067 -866 127418 -85359 -227421 -258038 -301566 -220366 -228362 -100796
10874 -100796 -134375 -158231 -216773 -125073 -37222 -67700 -86800 -150005 -188175 -161848 -180550
$$ packed form
10954f0454K449Q3986n5752l2736M2127j18504L4226O0174O5580l2171k422R3214
10942G9717l8904j02437j72734J33564L7230L4469J57127k8348m2999j40056L0977
10931e2394p6940n4435K8077N5699M9588j8186o5873o070J99964k2152k7114j08678
10919i8514J28437J23223O0420M0237l9128k3652n0165q9753J0909o5676r6013
10908i9675R4670j2087p2119l6943K6074P7650Q558M4149m9436k13414m9299J64616
10896a17256Q5931J9619Q4922R9131J9700r8697j10003M6619m6002M6568q1268
10885e0736L3799q130K4201J28284k12777j42062l0617m3528Q1200p996J27566
10874a00796l3579k3856n8542R1700Q7851l0478j9100o3205l8170K6327j8702
$$ plain form
10863 -180550 -44933 -25261 -110455 -198926 -118228 123545 111021 21801 -121252 -207920 -161216
10852 -161216 -147441 -81440 117911 171604 172589 262641 259910 306409 312815 344667 368254 333082
10840 333082 257881 76559 95176 204948 187913 127621 173763 135108 27244 41125 -31666
10829 -31666 -88570 -213736 -132216 -13377 -60889 24418 97706 150100 125451 156769 50581
10818 50581 77458 64999 73191 -13852 -53674 -56137 -210045 -400179 -374750 -446652 -402061 -279392
10806 -279392 -196243 -61047 -22058 -98198 -72106 -43823 -105168 -154805 -116830 -59449 -3274
10795 -3274 -75492 -86051 -174572 -117584 52143 202470 167198 57416 38611 57711 157073
10784 157073 139148 69513 158628 118712 48330 47606 108007 163498 186081 122689 29549 64897
$$ packed form
10863a80550J35617J9672q5194q8471Q0698K41773j2524q9220j43053q6668M6704
10852a61216J3775O6001J99351N3693R85R0052k731M6499O406L1852K3587l5172
10840C33082p5201j81322J8617J09772j7035o0292M6142l8655j07864J3881p2791
10829c1666n6904j25166Q1520J18839m7512Q5307P3288N2394k4649L1318j06188
10818E0581K6877j2459Q192q7043l9822k463j53908j90134K5429p1902M4591J22669
10806b79392Q3149J35196L8989p6140K6092K8283o1345m9637L7975N7381N6175
10795c274p2218j0559q8521N6988J69727J50327l5272j09782j8805J9100R9362
10784A57073j7925o9635Q9115l9916p0382p24O0401N5491K2583o3392r3140L5348
$$ plain form
10772 64897 225814 177095 -50826 -197333 -191659 -146120 -137664 -151879 -35452 58543 21807
10761 21807 69517 71260 88407 4343 -46752 -89449 -71319 1657 7094 -156292 -231939 -199614
10749 -199614 -221220 -255438 -113529 -2660 -15443 -78111 -174179 -216748 -206667 -63456 -20664
10738 -20664 64946 108879 252737 300181 161961 18309 -74003 -80935 -11083 10959 52563
10727 52563 153923 214700 315661 136516 72446 205536 120950 91715 34040 -3775 -15113
10716 -15113 130096 144400 141225 176809 326846 288392 185977 119208 212545 282430 303073
10705 303073 427948 653513 767686 830194 812552 746175 588741 676807 812860 684919
10695 684919 533542 533972 706573 772716 652835 763561 818368 821025 853770 716923 596322
$$ packed form
10772F4897J60917m8719k27921j46507N674M5539Q456j4215J16427R3995l6736
10761B1807M7710J743J7147q4064n1095m2697J8130P2976N437j63386p5647L2325
10749a99614k1606l4218J41909J10869j2783o2668r6068m2569J0081J43211M2792
10738b0664Q5610M3933J43858M7444j38220j43652r2312o932O9852K2042M1604
10727E2563J01360O0777J00961j79145o4070J33090q4586k9235n7675l7815j1338
10716a5113J45209J4304l175L5584J50037l8454j02415o6769R3337O9885K0643
10705C03073J24875K25565J14173O2508j7642o6377j57434Q8066J36053j27941
10695F84919j51377M30J72601O6143j19881J10726N4807K657L2745j36847j20601
$$ plain form
10684 596322 594914 640231 775657 930622 927971 918808 936186 990416 923684 958940 1066288
10673 1066288 987818 1036403 1115924 1098399 1106450 1123972 1157637 1031139 870734 958871 1028432
10662 1028432 948376 973726 966567 993082 982308 1054757 1263117 1466910 1560526 1738251 2101606
10651 2101606 2467370 2699766 2893558 2943784 2770703 2526649 2239712 2167379 2210285 2314127
10641 2314127 2244913 2432836 2667948 2823951 2896380 3223861 3648688 4017561 4633072 5345017
10631 5345017 5972025 6452614 6834264 7330191 8080749 8986735 10135366 11596192 13771518
10622 13771518 16644927 20432975 25650302 32752191 41655487 52403358 63772962 73254030
10614 73254030 78167256 77861287 74560706 71179834 69938834 71783865 77891659 88959182
$$ packed form
10684E96322j408M5317J35426J54965k651r163J7378N4230o6732L5256J07348
10673A066288p8470M8585P9521j7525Q051J7522L3665j26498j60405Q8137O9561
10662A028432q0056K5350p159K6515j0774P2449K08360K03793R3616J77725L63355
10651B101606L65764K32396J93792N0226j73081k44054k86937p2333M2906J03842
10641B314127o9214J87923K35112J56003P2429L27481M24827L68873O15511P11945
10631E345017O27008M80589L81650M95927P50558R05986J148631J460826K175326
10622A3771518K873409L788048N217327P101889Q903296J0747871J1369604R481068
10614G3254030M913226l05969l300581l380872j241000J845031O107794J1067523
$$ plain form
10606 88959182 105496181 127046387 149982894 167226478 171755157 163026977 148009968
10599 148009968 134287131 125897617 124299879 129896594 143204207 164705992 192597117
10592 192597117 220493322 237804975 235363990 214239751 185530581 159570489 140901486
10585 140901486 130146292 127007594 130827767 141056698 155500811 169034226 174412460
10578 174412460 166133474 146508252 123291879 103014571 88227082 79042544 74443630
10571 74443630 73597213 75512996 78668073 81033978 79855347 73327341 62823732 51202665
10563 51202665 40790321 32470636 26196603 21483609 17788061 15012869 12975644 11335236
10555 11335236 9973755 8781702 7803124 7040058 6432682 5918702 5338922 4770583 4316642
$$ packed form
10606H8959182J6536999K1550206K2936507J7243584M528679q728180j5017009
10599A48009968j3722837q389514j597738N596715J3307613K1501785K7891125
10592A92597117K7896205J7311653k440985k1124239k8709170k5960092j8669003
10585A40901486j0755194l138698L820173J0228931J4444113J3533415N378234
10578A74412460q278986j9625222k3216373k0277308j4787489r184538m598914
10571G4443630q46417J915783L155077K365905j178631o528006j0503609j1621067
10563E1202665j0412344q319685o274033m712994l695548k775192k037225j640408
10555A1335236j361481j192053r78578p63066o07376n13980n79780n68339m53941
$$ plain form
10546 4316642 3928450 3592492 3381095 3163726 2943304 2805476 2773206 2706666 2571697 2253569
10536 2253569 2067410 2003963 1984940 1897545 1806615 1582111 1450531 1380147 1384840 1230702 1240515
10525 1240515 1294898 1244293 1187201 1173537 1054684 873232 890542 906624 984802 915291 802866
10514 802866 729103 679073 611241 680386 718730 717913 797073 784510 754018 799423 809287 761094
10502 761094 625753 457398 324455 457607 537971 619466 637584 511355 387682 352133
10492 352133 339840 518997 683995 695919 676460 453962 417269 408474 521334 565584 508355
10481 508355 508169 428959 419354 550573 724794 717468 652937 696592 711231 638771 461313 460119
10469 460119 479714 531369 490114 457470 640443 631127 573654 620440 682379 644660 619558
$$ packed form
10546D316642l88192l35958k11397k17369k20422j37828l2270o6540j34969l18128
10536B253569j86159o3447j9023q7395r0930k24504j31580p0384M693j54138R813
10525A240515N4383n0605n7092j3664j18853j81452J7310J6082P8178o9511j12425
10514H02866p3763n0030o7832O9145L8344q17P9160j2563l0492M5405R864m8193
10502G61094j35341j68355j32943J33152Q0364Q1495J8118j26229j23673l5549
10492C52133j2293J79157J64998J1924j9459k22498l6693q795J12860M4250n7229
10481E08355j86p9210r605J31219J74221p326o4531M3655J4639p2460j77458j194
10469D60119J9595N1655m1255l2644J82973r316n7473M6786O1939l7719k5102
$$ plain form
10458 619558 641915 689791 605344 603489 786352 805614 701808 601403 469036 362137 297887
10447 297887 385942 474468 429609 281239 266116 300145 349247 344040 458600 529548 493622
10436 493622 410079 402208 353938 316142 308883 256165 315059 274108 208023 112888 -38026 75907
10424 75907 196216 243190 296614 270227 230625 215455 130068 -28360 -79373 60289 200135
10413 200135 231772 236267 294891 252852 262385 322648 265116 130409 38221 133490 337392
10402 337392 406721 441792 277432 176247 244825 257540 244096 233240 228204 132785 175118
10391 175118 373050 489008 480166 433480 371088 337119 293664 128376 73718 -31977 -8971
10380 -8971 -62521 102957 314815 177654 195733 162458 146241 144693 327942 392742 422010
$$ packed form
10458F19558K2357M7876q4447j855J82863J9262j03806j00405j32367j06899o4250
10447B97887Q8055Q8526m4859j48370j5123L4029M9102n207J14560P0948l5926
10436D93622q3543p871m8270l7796p259n2718N8894m0951o6085r5135j50914J13933
10424G5907J20309M6974N3424k6387l9602j5170q5387j58428n1013J39662J39846
10413B00135L1637M495N8624m2039R533O0263n7532j34707r2188R5269K03902
10402C37392O9329L5071j64360j01185O8578J2715j3444j0856n036r5419M2333
10391A75118J97932J15958q842m6686o2392l3969m3455j65288n4658j05695K3006
10380h971n3550J65478K11858j37161J8079l3275j6217j548J83249O4800K9268
$$ plain form
10369 422010 393953 221235 247355 302983 290229 206893 272158 387227 319489 268305 210291
10358 210291 299104 321360 379299 456703 410904 391971 296631 305654 343098 214148 -47400
10347 -47400 -69648 -64479 -89871 -73977 -37300 156431 153900 -8827 -89010 -167755 -57243
10336 -57243 53671 118870 184865 87774 159248 306589 261089 224011 164054 59418 -44142
10325 -44142 -67644 96750 123459 94377 129562 197160 189358 61499 -38999 -2515 135041
10314 135041 134956 137558 118106 32720 8082 -56547 -106809 -54393 70528 33540 33327 -4533
10302 -4533 -92422 -104955 -91973 -29202 -2595 -63468 -171660 -143356 -84550 17289 -49829
10291 -49829 -106824 -182280 -12588 104867 90283 106267 127808 197227 246852 205157 222232
$$ packed form
10369D22010k8057j72718K6120N5628j2754q3336O5265J15069o7738n1184n8014
10358B10291Q8813K2256N7939P7404m5799j8933r5340R023L7444j28950k61548
10347d7400k2248N169k5392J5894L6677J93731k531j62727q0183p8745J10512
10336e7243J10914O5199O5995r7091P1474J47341m5500l7078n9957j04636j03560
10325d4142k3502J64394K6709k9082L5185O7598p802j27859j00498L6484J37556
10314A35041q5K602j9452q5386k4638o4629n0262N2416J24921l6988k13l7860
10302d533q7889j2533J2982O2771K6607o0873j08192K8304N8806J01839o7118
10291d9829n6995p5456J69692J17455j4584J5984K1541O9419M9625m1695J7075
$$ plain form
10280 222232 193395 111062 149935 39211 33182 60197 81125 91785 -2444 -115222 -204383
10269 -204383 -49609 128910 172154 120372 166713 145562 117864 10311 -126417 -199421 -117781
10258 -117781 -65125 -122141 -160505 -166375 -103209 37279 126001 254181 289230 342546 280936
10247 280936 44138 1366 -28348 -35132 89458 84118 -19998 42202 79478 53687 -138023
10236 -138023 -251788 -212016 -172288 -149033 -142130 -74371 3894 54576 149857 47660 -23372
10225 -23372 -78544 -99839 -13681 -45526 -106618 -100297 -79229 -138980 -71215 -126671 -147254 -240644
10213 -240644 -191435 -120482 -117502 -210964 -289840 -135749 -34850 49752 62687 27410 -35060
10202 -35060 -30522 -52922 -65799 -2998 -116624 -120046 59171 24474 126438 323045 285695
$$ packed form
10280B22232k8837q2333L8873j10724o029K7015K0928J0660r4229j12778q9161
10269b04383J54774J78519M3244n1782M6341k1151k7698j07553j36728p3004Q1640
10258a17781N2656n7016l8364n870O3166J40488Q8722J28180L5049N3316o1610
10247B80936k36798m2772k9714o784J24590n340j04116O2200L7276k5791j91710
10236a38023j13765L9772L9728K3255O903O7759P8265N0682R5281j02197p1032
10225b3372n5172k1295Q6158l1845o1092O321K1068n9751O7765n5456k0583r3390
10213b40644M9209P0953K980r3462p8876J54091J00899Q4602J2935l5277o2470
10202c5060M538k2400j2877O2801j13626l422J79217l4697J01964J96607l7350
$$ plain form
10191 285695 208293 121194 -14357 -8648 -46615 -113228 -71491 67323 182170 182375 111153
10180 111153 267521 256648 233730 144136 216204 294575 282661 264594 300079 409863 558766
10169 558766 756666 920339 1194653 1358350 1359204 1269092 1017481 796121 785302 778601 821020
10158 821020 917824 988412 1048745 1255448 1462343 1547447 1564710 1209213 963702 851995
10148 851995 778943 775697 887070 846366 888325 796217 724771 801312 723887 622846 556767
10137 556767 364191 391127 335402 449949 507805 536150 514468 549356 491540 334536 206916
10126 206916 138983 132016 105312 63557 73016 18184 43267 114285 71200 -131620 -277085
10115 -277085 -181701 -13507 -20662 76520 218005 308506 311431 220769 199202 168228 141638
$$ packed form
10191B85695p7402q7099j35551N709l7967o6613M1737J38814J14847K05p1222
10180A11153J56368j0873k2918q9594P2068P8371j1914j8067L5485J09784J48903
10169E58766J97900J63673K74314J63697Q54r0112k51611k21360j0819o701M2419
10158H21020R6804P0588O0333K06703K06895Q5104J7263l55497k45511j11707
10148H51995p3052l246J11373m0704M1959r2108p1446P6541p7425j01041o6079
10137E56767j92576K6936n5725J14547N7856K8345k1682L4888n7816j57004j27620
10126B06916o7933o967k6704m1755R459n4832K5083P1018m3085k02820j45465
10115b77085R5384J68194p155R7182J41485R0501K925r0662k1567l0974k6590
$$ plain form
10104 141638 81222 -88105 -71137 21256 75728 82439 102210 -59567 -111671 -113181 -7506
10093 -7506 117906 101048 135324 154987 8855 -54714 47700 141720 77930 74057 100729
10082 100729 47035 -139204 -147418 -202305 -134701 -128926 -218328 -220165 -34287 9861 -79258 -151918
10070 -151918 -189925 -131050 -141355 -222974 -145531 -83224 24895 153705 189092 13484 89730
10059 89730 101911 10685 40068 33326 71952 64424 53297 39098 179979 172167 61169 76762
10047 76762 145680 58215 122367 116890 185811 202275 5773 -20418 -33967 46982 146478 66217
10035 66217 32198 64895 -14546 68194 274761 442053 475821 450881 455252 388744 255848
10024 255848 162990 77013 -7698 -70599 -66639 -83705 5079 90898 55615 -97733 -201391
$$ packed form
10104A41638o0416j69327J6968R2393N4472O711J9771j61777n2104j510J05675
10093g506J25412j6858L4276J9663j46132o3569J02414R4020o3790l873K6672
10082A00729n3694j86239q214n4887O7604N775q9402j837J85878M4148q9119p2660
10070a51918l8007N8875j0305q1619P7443O2307J08119J28810L5387j75608P6246
10059H9730J2181r1226K9383o742L8626p528j1127j4199J40881p812j10998J5593
10047G6762O8918q7465O4152n477O8921J6464j96502k6191j3549Q0949R9496q0261
10035F6217l4019L2697p9441Q2740K06567J67292L3768k4940M371o6508j32896
10024B55848r2858q5977q4711o2901L960j7066Q8784Q5819l5283j53348j03658
$$ plain form
10013 -201391 -146337 -200963 -173567 -163930 -144643 -106140 36836 103818 -11552 55862 233116
10002 233116 296594 75352 -69124 -32628 27057 -40281 -67840 -42965 -162406 -217299 -195616
9991 -195616 -60517 57316 109661 85113 23672 64392 -11801 -136072 -67800 39044 81102
9980 81102 95139 -2581 -22342 -32070 79872 131405 122730 33560 -77193 -7697 7733 65848
9968 65848 163606 87059 45246 -52495 -190869 -134735 -56342 -33611 26391 -15353 -46929 -51436
9956 -51436 42822 135573 29705 -63911 124414 101848 106767 65542 107146 -7708 47092
9945 47092 195860 113481 5460 8327 187104 219440 164401 141415 140174 85843 148847 233250
9933 233250 260767 304196 287886 316695 363658 482226 575860 450632 425590 332022 257214
$$ packed form
10013b01391N5054n4626K7396R637J9287L8503J42976O6982j15370O7414J77254
10002B33116O3478k21242j44476L6496N9685o7338k7559K4875j19441n4893K1683
9991a95616J35099J17833N2345k4548o1441M0720p6193j24271O8272J06844M2058
9980H1102J4037r7720j9761r728J11942N1533q675q9170j10753O9496J5430N8115
9968F5848R7758p6547m1813r7741j38374N6134P8393K2731O0002m1744l1576m507
9956e1436R4258R2751j05868r3616J88325k2566M919m1225M1604j14854N4800
9945D7092J48768q2379j08021K867J78777L2336n5039k2986j241n4331O3004Q4403
9933B33250K7517M3429j6310K8809M6963J18568R3634j25228k5042r3568p4808
$$ plain form
9922 257214 226521 84517 101835 160649 170051 193266 201346 133607 63696 -43062 -44875 -115152
9910 -115152 -180522 -179085 -174733 -214759 -179692 -117997 -96265 -91400 -16601 67398 90280 121729
9898 121729 181447 126210 69196 39415 105764 202829 186090 80200 -3279 10664 50334
9887 50334 26465 90731 -155100 -206907 -73251 7912 -22424 -52538 -24487 24 -54470
9876 -54470 -219434 -210960 -58882 36682 -46397 -99217 -9127 75522 143206 151628 33813 -79077
9864 -79077 -79225 -51941 15717 -39596 -95803 -41328 75178 85766 167870 243710 362379 393689
9852 393689 444613 597728 775270 819191 855943 770668 698556 597508 516689 407377 453647
9841 453647 413777 419520 465311 442597 406477 336149 280037 236164 111019 123826 134646 107972
$$ packed form
9922B57214l0693j42004J7318N8814R402K3215Q080o7739o9911j06758j813p0277
9910a15152o5370J437M352m0026L5067O1695K1732M865P4799Q3999K2882L1449
9898A21729N9718n5237n7014k9781O6349R7065j6739j05890q3479J3943L9670
9887E0334k3869O4266k45831n1807J33656Q1163l0336l0114K8051K4511n4494
9876e4470j64964Q474J52078R5564q3079n2820R0090Q4649O7684Q422j17815j12890
9864g9077j48K7284O7658n5313n6207N4475J16506J0588Q2104P5840J18669L1310
9852C93689N0924J53115J77542M3921L6752q5275p2112j01048q0819j09312M6270
9841D53647l9870N743M5791k2714l6120p0328n6112m3873j25145J2807J0820k6674
$$ plain form
9829 107972 181676 203579 234117 275685 223572 170621 150833 136399 192735 246753 215498 180919
9817 180919 133689 65838 -7659 45716 -6895 -35678 60284 64613 146868 330440 439772
9806 439772 440581 533970 589141 496792 543592 775100 958916 868645 648570 474404 449353
9795 449353 403071 439850 380671 238064 229766 213530 297491 319216 176117 64877 46219
9784 46219 68286 59370 -7275 19554 193998 302784 462350 648761 711726 718675 600942
9773 600942 418324 227375 112672 -47424 -182033 -308604 -379106 -191674 91410 121174
9763 121174 60865 1779 -11889 -40122 -24427 -30423 -667 32194 -17300 -114391 -181765 -196370
9751 -196370 -157129 -36607 -4569 -31364 -93875 -94477 -154029 -89000 -32561 -32715 -36446 -24599
$$ packed form
9829A07972P3704K1903L0538M1568n2113n2951j9788j4434N6336N4018l1255l4579
9817A80919m7230o7851p3497N3375n2611k8783R5962M329Q2255J83572J09332
9806D39772Q09R3389N5171r2349M6800K31508J83816r0271k20075j74166k5051
9795D49353m6282L6779n9179j42607q298j6236Q3961K1725j43099j11240j8658
9784D6219K2067q916o6645K6829J74444J08786J59566J86411O2965O949j17733
9773F00942j82618j90949j14703j60096j34609j26571p0502J87432K83084K9764
9763A21174o0309n9086j3668k8233J5695n996K9756L2861m9494r7091o7374j4605
9751a96370L9241J20522L2038k6795o2511o02n9552O5029N6439j54l731J1847
$$ plain form
9739 -24599 -79155 -138207 -180947 -108529 -53036 -148313 -140503 -16850 -53371 -83750 -29979 -152383
9727 -152383 -178666 -212125 -168573 -34666 -31851 -58449 2718 -33866 56723 89501 -11950
9716 -11950 -38479 -36910 -138878 -58457 -117952 -175156 -185929 -232129 -221983 -74106 5705 -20171
9704 -20171 -86884 -143667 -200848 -273992 -183742 -73640 -11658 24339 148477 290932 121323
9693 121323 -122076 -199185 -50742 41829 171661 210424 255620 174144 114205 127771 83666
9682 83666 30518 981 9625 208535 249430 143033 242308 246440 41840 -12687 2030 -12211
9670 -12211 -107458 -23691 146337 111845 72662 26917 21235 -1415 44868 227618 325139 361757
9658 361757 479392 692079 1088422 1648089 2449858 3297094 3604942 2836653 1866319 1140450
$$ packed form
9739b4599n4556n9052m2740P2418N5493r5277P810J23653l6521l0379N3771j22404
9727a52383k6283l3459M3552J33907K815k6598O1167l6584R0589L2778j01451
9716a1950k6529J569j01968Q0421n9495n7204j0773m6200J0146J47877P9811k5876
9704b0171o6713n6783n7181p3144R0250J10102O1982L5997J24138J42455j69609
9693A21323k43399p7109J48443R2571J29832L8763M5196q1476n9939J3566m4105
9682H3666n3148k9537Q644J98910M0895j06397R9275M132k04600n4527J4717j4241
9670a2211r5247Q3767J70028l4492l9183m5745n682k2650M6283J82750R7521L6618
9658C61757J17635K12687L96343N59667Q01769Q47236L07848p68289r70334p25869
$$ plain form
9648 1140450 727881 462358 345023 511931 364115 252193 286100 246448 215683 388949
9638 388949 174177 -10652 18608 -11074 -43963 -61570 32724 103723 182875 118349 59630
9627 59630 44852 131971 -9675 27614 -29237 -3485 67144 169325 180013 65913 47045
9616 47045 119546 80581 30629 105993 96748 65964 -63774 -163139 -146590 -92680 -81059 -123825
9604 -123825 -99350 18302 -77922 33887 22124 -75862 -69019 -55692 84770 185844 142639
9593 142639 -7373 -6295 68507 160313 149995 65712 75149 24426 4157 -26090 16149 -49889
9581 -49889 -37121 -139933 -274877 -269865 -238030 -89730 -150765 -174087 -155804 -57640 -54578 -219391
9569 -219391 -259657 -247173 -193226 -137965 -173863 -121053 -97820 -160373 -106240 -99643 -58612 -2621
$$ packed form
9648A140450m12569k65523j17335J66908j47816j11922L3907l9652l0765J73266
9638C88949k14772j84829K9260k9682l2889j7607R4294P0999P9152o4526n8719
9627E9630j4778Q7119j41646L7289n6851K5752P0629J02181J0688j14100j8868
9616D7045P2501l8965m9952P5364r245l0784j29738r9365J6549N3910J1621m2766
9604a23825K4475J17652r6224J11809j1763r7986O843J3327J40462J01074m3205
9593A42639j50012J078P4802R1806j0318q4283R437n0723k0269l0247M2239o6038
9581d9889J2768j02812j34944N012L1835J48300o1035k3322J8283R8164L062j64813
9569b19391m0266J2484N3947N5261l5898N2810K3233o2553N4133O597M1031N5991
$$ plain form
9557 -2621 17635 169125 120100 74525 30803 2493 -76593 -136369 -75546 30780 -82969
9546 -82969 -83927 -122569 -102268 -117493 -44489 93956 57393 31078 29373 -117483 -245166 -222479
9534 -222479 -148507 -128178 -179931 -208868 -93365 -99621 -62623 -181280 -297479 -349360 -224579
9523 -224579 -204845 -257712 -225629 -273847 -173372 -132658 -141473 -169522 -208984 -218571 -208218 -206445
9511 -206445 -210994 -216707 -207962 -140681 -118354 49738 114079 63848 103187 192989 134614 82542
9499 82542 -10765 21165 104562 185260 130594 38165 45600 41418 33305 101757 83752 -14354
9487 -14354 -155914 -156412 -117065 149151 200096 160548 31584 -18126 54534 148141 175777 87935
9475 87935 34553 48521 -33852 -73929 -156433 -135907 -30906 73500 75073 19214 -88100
$$ packed form
9557b621K0256J51490m9025m5575m3722k8310p9086n9776O0823J06326j13749
9546h2969r58l8642K0301j5225P3004J38445l6563k6315j705j46856j27683K2687
9534b22479P3972K0329n1753k8937J15503o256L6998j18657j16199n1881J24781
9523b24579J9734n2867L2083m8218J00475M0714q815k8049l9462r587J0353J773
9511b06445m549n713Q745O7281K2327J68092O4341n0231L9339Q9802n8375n2072
9499H2542r3307L1930Q3397Q0698n4666r2429P435m182q113O8452j8005r8106
9487a4354j41560m98L9347K66216N0945l9548j28964m9710P2660R3607K7636q7842
9475H7935n3382J3968q2373m0077q2504K0526J05001J04406J573n5859j07314
$$ plain form
9464 -88100 -171058 -169402 -146971 -31214 1225 -34971 -11755 20286 -109846 -110952 -57279 -34866
9452 -34866 -71221 2464 57164 -19641 16806 -79026 -132616 -201256 -86452 51812 -54796
9441 -54796 -104529 -23923 -2572 76846 133560 79392 -111987 -95623 -6147 26078 119689 2256
9429 2256 -191263 -135477 -39357 9738 -257 -18074 52776 67582 87047 14461 4526 7900
9417 7900 -83645 10989 70059 -37108 -119842 -24663 74569 -18432 -103053 -87838 -37913 -44992
9405 -44992 69051 110372 96890 43987 -16382 -54430 -98717 -56485 14221 -116673 -153929
9394 -153929 -101206 -14360 -4918 -44598 -8003 -35851 -114341 16165 34829 80323 136907 -49493
9382 -49493 21231 183088 114914 56097 108868 111280 153338 165007 84147 106840 70575 103258
$$ packed form
9464h8100q2958J656K2431J15757L2439l6196K3216L2041j30132j106N3673K2413
9452c4866l6355P3685N4700p6805L6447r5832n3590o8640J14804J38264j06608
9441e4796m9733Q0606K1351P9418N6714n4168j91379J6364Q9476L2225R3611j17433
9429B256j93519N5786R6120M9095r995j7817P0850J4806J9465p2586r935L374
9417G900r1545R4634N9070j07167q2734R5179R9232r3001q4621J5215M9925p079
9405d4992J14043M1321j3482n2903o0369l8048m4287M2232P0706j30894l7256
9394a53929N2723Q6846R442l9680L6595k7848p8490J30506J8664M5494N6584j86400
9382d9493P0724J61857o8174n8817N2771K412M2058J1669q0860K2693l6265L2683
$$ plain form
9370 103258 191558 413544 411172 306002 132935 163258 213647 190258 119085 70268 97212
9359 97212 92015 10527 39703 51627 -47456 -83207 -150870 -87672 -24902 57585 -28486 -90468
9347 -90468 -109601 -56187 -14208 -20396 20562 56485 61288 67272 88262 -34085 -45774 56506
9335 56506 85146 -17461 -4139 53516 132959 136480 52594 -4957 12390 -7240 -83399 -70891
9323 -70891 3993 76985 52361 -20299 22479 62305 137368 268548 339963 230821 258389
9312 258389 317084 281402 206763 215376 252889 254883 261655 350690 295161 288564 321761 371417
9300 371417 307927 169561 52128 33449 -560 -61680 -172607 -100922 21377 124581 181344
9289 181344 55466 40102 -63616 -29090 -111711 -93122 -21379 29324 1217 33880 84374
$$ packed form
9370A03258Q8300K21986k372j05170j73067L0323N0389k3389p1173m8817K6944
9359I7212n197q1488K9176J1924r9083l5751o7663O3198O2770Q2487q6071o1982
9347i0468j9133N3414M1979o188M0958L5923M803N984K0990j22347j1689J02280
9335E6506K8640j02607J3322N7655P9443L521q3886n7551J7347j9630p6159J2508
9323g0891P4884P2992k4624p2660M2778L9826P5063J31180P1415j09142K7568
9312B58389N8695l5682p4639Q613L7513J994O772Q9035n5529o597L3197M9656
9300C71417o3490j38366j17433j8679l4009o1120j10927P1685J22299J03204N6763
9289A81344j25878j5364j03718L4526q2621J8589P1743N0703k8107L2663N0494
$$ plain form
9278 84374 114928 59781 15577 138758 111624 13676 -13320 37313 35141 37465 99039 255518
9266 255518 322854 276654 125799 57651 169138 185009 170077 180444 218985 336239 402845
9255 402845 405870 371048 297601 283876 103703 42269 25300 30930 80986 171096 175622 236082
9243 236082 247796 268602 238723 88256 66105 42609 -50274 -21696 -77190 -16115 60181
9232 60181 152262 151698 68976 31642 -61213 -37925 -60746 -87964 -24678 86365 271643 371907
9220 371907 334377 277570 359430 259887 175346 129485 139075 216606 219378 175167 234777 263262
9208 263262 189874 272007 377594 346130 200939 106328 155791 117050 38512 139945 88990
9197 88990 27401 -76098 -72716 88835 53022 100666 13556 -12710 23307 67552 39709 30302
$$ packed form
9278H4374L0554n5147m4204J23181k7134r7948k6996N0633k172K324O1574J56479
9266B55518O7336m6200j50855o8148J11487J5871j4932J0367L8541J17254O6606
9255D02845L025l4822p3447j3725j80173o1434j6969N630N0056R0110M526O0460
9243B36082J1714K0806k9879j50467k2151k3496r2883K8578n5494O1075P6296
9232F0181R2081n64q2722l7334r2855K3288k2821k7218O3286J11043J85278J00264
9220C71907l7530n6807Q1860r9543q4541m5861R590P7531K772m4211N9610K8485
9208B63262p3388Q2133J05587l1464j45191r4611M9463l8741p8538J01433n0955
9197H8990o1589j03499L382J61551l5813M7644q7110k6266L6017M4245k7843r407
$$ plain form
9185 30302 63562 159318 240445 211650 243639 178244 9500 -57631 29656 32745 74683 102363
9173 102363 92447 -12477 60368 111259 75648 38502 53690 77065 -499 -37413 -120755 -220748
9161 -220748 -201001 -90956 28204 -25221 3154 6812 46369 123409 139537 95175 74805
9150 74805 -46919 -177948 -142099 -116853 1124 48463 -63514 -64780 70974 184028 173893
9139 173893 18533 -125211 -165550 -221137 -139782 7121 -88623 -146541 -121183 -76127 49071
9128 49071 90634 40899 84398 22963 -44938 -56446 -66003 87754 211067 190288 95778 19110
9116 19110 -119933 -155917 -18884 51711 -58379 -80783 -60305 62959 116882 189893 18276
9105 18276 28657 97630 39373 176752 243085 66484 -33531 113129 174295 142527 140546
$$ packed form
9185C0302L3260R5756Q1127k8795L1989o5395j68744o7131Q7287L089M1938K7680
9173A02363r916j04924P2845N0891l5611l7146J5188K3375p7564l6914q3342r9993
9161b20748J9747J10045J19160n3425K8375L658L9557P7040J6128m4362k0370
9150G4805j21724j31029L5849K5246J17977M7339j11977j266J35754J13054j0135
9139A73893j55360j43744m0339n5587Q1355J46903r5744n7918K5358M5056J25198
9128D9071M1563m9735M3499o1435o7901j1508r557J53757J23313k0779r4510p6668
9116A9110j39043l5984J37033P0595j10090k2404K0478J23264N3923P3011j71617
9105A8276J0381O8973n8257J37379O6333j76601j00015J46660O1166l1768j981
$$ plain form
9094 140546 80414 -80351 -157077 -154345 -120678 -164182 -170027 4993 37566 170105 306342
9083 306342 269556 202259 189265 196430 84265 7121 116081 135800 185580 161782 51016
9072 51016 -4673 23273 79655 231551 186176 174670 87665 5677 97925 252247 155690
9061 155690 64142 79225 138472 203015 253469 442599 629781 652782 628525 548684 528867
9050 528867 543228 459547 272715 223479 124030 94031 76898 128531 79204 104514 94051
9039 94051 111180 103533 21122 5502 -14957 57983 105473 112384 66467 34664 11041 8836
9027 8836 41620 74854 -51302 -175600 -31868 131776 105664 146142 173884 272590 384057
9016 384057 642351 688522 643198 594651 708939 705876 662821 639475 335520 162204 102698
$$ packed form
9094A40546o0132j60765p6726K732L3667m3504n845J75020L2573J32539J36237
9083C06342l6786o7297j2994P165j12165p7144J08960J9719M9780k3798j10766
9072E1016n5689K7946N6382J51896m5375j1506q7005q1988R2248J54322r6557
9061A55690r1548J5083N9247O4543N0454J89130J87182K3001k4257p9841j9817
9050E28867J4361q3681j86832m9236r9449k9999j7133N1633m9327K5310j0463
9039I4051J7129p647q2411j5620k0459P2940M7490O911m5917l1803k3623k205
9027H836L2784L3234j26156j24298J43732J63644k6112M0478K7742R8706J11467
9016C84057K58294M6171m5324m8547J14288l063m3055k3346l03955j73316n9506
$$ plain form
9005 102698 58239 42387 76688 231643 282802 180011 98231 27556 9189 -64987 -70549
8994 -70549 -26271 -72149 3275 -3013 39465 23240 53295 112113 97940 107534 51608 216360
8982 216360 302196 205617 68887 -68460 -21736 66006 125710 99678 -11111 -31320 75635
8971 75635 175743 225125 189302 72939 97078 73964 38455 65847 67661 115032 117804 139029
8959 139029 100564 25951 -74569 -105650 -124306 -175425 18056 49837 -68642 -29523 18268
8948 18268 -63584 11133 63297 86949 20087 590 34759 102651 154937 -28209 -63944 -92439
8936 -92439 -3141 -11393 -57696 -110633 38980 182631 77961 56297 68425 38771 68768
8925 68768 141406 184364 177633 71414 -77969 -212730 -217860 -94559 -51714 -92638 -10110
$$ packed form
9005A02698m4459j5852L4301J54955N1159j02791q1780p0675j8367p4176n562
8994g0549M4278m5878P5424o288M2478j6225L0055N8818j4173R594n5926J64752
8982B16360Q5836r6579j36730j37347M6724Q7742N9704k6032j10789k0209J06955
8971G5635J00108M9382l5823j16363K4139k3114l5509K7392J814M7371K772K1225
8959A39029l8465p4613j00520l1081j8656n1119J93481L1781j18479L9119M7791
8948A8268q1852P4717N2164K3652o6862j9497L4169O7892N2286j83146l5735k8495
8936i2439Q9298q252m6303n2937J49613J43651j04670k1664J2128k9654K9997
8925F8768P2638M2958o731j06219j49383j34761n130J23301M2845m0924Q2528
$$ plain form
8914 -10110 58414 91213 109566 184842 120822 74495 71672 72706 97233 204845 252491 206735
8902 206735 41754 4577 34555 106679 258852 134381 -99351 -197759 -39270 163478
8892 163478 271414 174951 80339 105180 145009 94568 -102072 -99583 -88397 -135153 -96295
8881 -96295 -94008 -43334 14954 151917 152999 27882 61095 -430 55761 89152 101347 158330
8869 158330 169841 20648 -64789 -76054 -39062 -110168 12373 79775 158118 174774 241908
8858 241908 237826 201983 132930 187435 266378 187372 98681 -66416 -90499 -104926 -112054 -38043
8846 -38043 -19200 34838 34515 -51192 -143302 -212705 -138951 13715 112563 184322 178784 161709
8834 161709 137360 90619 86032 281250 255547 135759 49972 63913 158955 93035 147981
$$ packed form
8914a0110O8524L2799J8353P5276o4020m6327k823J034K4527J07612M7646m5756
8902B06735j64981l7177K9978P2124J52173j24471k33732r8408J58489K02748
8892A63478J07936r6463r4612K4841L9829n0441j96640K489J1186m6756L8858
8881i6295K287N0674N8288J36963J082j25117L3213o1525N6191L3391J2195N6983
8869A58330J1511j49193q5437j1265L6992p1106J22541O7402P8343J6656O7134
8858B41908m082l5843o9053N4505P8943p9006q8691j65097k4083j4427p128P4011
8846c8043J8843N4038l23q5707r2110o9403P3754J52666R8848P1759n538j7075
8834A61709k4349m6741m587J95218k5703j19788q5787J3941R5042o5920N4946
$$ plain form
8823 147981 177617 38951 -24420 40219 99057 99444 6751 57382 201673 159441 72235 -114094
8811 -114094 -152063 -159361 -200498 -178725 -47174 90190 156567 51121 -34905 17390 -9789
8800 -9789 -133953 -284105 -148027 43241 -15288 -56376 -567 150501 123436 139383 194750
8789 194750 246680 283553 132331 19105 31492 189795 178863 46547 23110 90338 39902
8778 39902 93041 143261 103697 -44876 -101942 -2340 -116300 -163806 -96113 -43499 -60459
8767 -60459 -15965 98811 47158 -44083 -888 -5301 -84101 4202 177894 185484 209464 230432
8755 230432 244412 269981 195879 91971 1191 30139 16135 -43770 -108654 -85203 -43283
8744 -43283 72263 170326 245673 209913 150761 155649 117068 187327 279833 292510 294022 336495
$$ packed form
8823A47981K9636j38666o3371O4639N8838L87r2693N0631J44291m2232q7206j86329
8811a14094l7969p298m1137K1773J31551J37364O6377j05446q6026N2295k7179
8800i789j24164j50152J36078J91268n8529m1088N5809J51068k7065J5947N5367
8789A94750N1930L6873j51222j13226J2387J58303j0932j32316k3437O7228n0436
8778C9902N3139N0220l9564j48573n7066R9602j13960m7506O7693N2614j6960
8767f0459M4494J14776n1653r1241M3195m413p8800Q8303J73692P590K3980K0968
8755B30432J3980K5569p4102j03908r0780K8948j4004n9905o4884K3451M1920
8744d3283J15546R8063P5347l5760n9152M888l8581P0259R2506J2677J512M2473
$$ plain form
8732 336495 283003 176059 142680 23170 152727 128721 52606 68505 98153 84013 33547
8721 33547 -93559 -150255 -123037 -145478 -11048 168816 200439 193215 170302 249504 244148 154290
8709 154290 131232 159645 166831 89521 97528 210540 193023 176198 248321 171719 128902 148660
8697 148660 147668 29511 65104 141551 128631 120275 106987 201936 152121 95390 210095 424435
8685 424435 483288 407740 202164 210629 148378 182137 273118 219027 124261 249853 373397
8674 373397 294432 105923 73401 168708 301161 333379 398214 357420 216271 282074 285446
8663 285446 167559 58132 -6835 -31175 -66753 69934 199825 198791 148826 118031 67151
8652 67151 157159 294725 294819 247054 354439 458059 477817 450974 539036 434559 392452 419085
$$ packed form
8732C36495n3492j06944l3379j19510J29557k4006p6115J5899K9648j4140n0466
8721C3547j27106n6696K7218k2441J34430J79864L1623p224k2913P9202n356q9858
8709A54290k3058K8413P186p7310Q007J13012j7517j6825P2123p6602m2817J9758
8697A48660r92j18157L5593P6447j2920q356j3288R4949m9815n6731J14705K14340
8685D24435N8853p5548k05576Q465o2251L3759R0981n4091r4766J25592J23544
8674C73397p8965j88509l2522R5307J32453L2218O4835m0794j41149O5803L372
8663B85446j17887j09427o4967k4340l5578J36687J29891j034m9965l0795n0880
8652F7151R0008J37566R4m7765J07385J03620J9758k6843Q8062j04477m2107K6633
$$ plain form
8640 419085 438347 343441 291680 178183 62544 9708 117409 160041 121963 170670 122916
8629 122916 95345 88346 178773 262550 281962 297706 337703 221446 200983 304839 431357
8618 431357 401934 363578 464700 549427 420021 419379 528514 576858 527615 485795 490723 414084
8606 414084 362529 319246 314229 299493 360068 351107 368564 401006 459354 398905 390819 393616
8594 393616 459057 517911 496111 411206 451405 413434 244745 389412 496019 483683 408068
8583 408068 388554 423815 449898 431363 464001 621941 736287 722769 789310 681372 758101
8572 758101 919878 911891 1020668 1107806 1031389 1121210 1158669 1228444 1421472 1484855 1533224
8561 1533224 1449850 1498884 1310513 1048099 949942 748806 674962 702534 672127 630232 549276
$$ packed form
8640D19085J9262r4906n1761j13497j15639n2836J07701M2632l8078M8707m7754
8629A22916k7571o999R0427Q3777J9412J5744L9997j16257k0463J03856J26518
8618D31357k9423l8356J01122Q4727j29406o42J09135M8344m9243m1820M928p6639
8606D14084n1555m3283n017j4736O0575q961J7457L2442N8348o0449q086K797
8594C93616O5441N8854k1800q4905M0199l7971j68689J44667J06607j2336p5615
8583D08068j9514L5261K6083j8535L2638J57940J14346j3518O6541j07938P6729
8572G58101J61777p987J08777Q7138p6417Q9821L7459O9775J93028O3383M8369
8561A533224q3374M9034j88371k62414r8157k01136p3844K7572l0407m1895q0956
$$ plain form
8550 549276 473387 316394 287087 289724 384963 468342 606971 682156 592879 418101 287590
8539 287590 179476 124670 214656 228593 187690 170989 118667 67956 59418 88833 368749
8528 368749 453537 454407 508359 492856 413771 406887 456850 345812 294698 275158 330384 215384
8516 215384 52830 -8101 74000 159470 232120 391566 408423 337633 339539 271992 197047
8505 197047 94565 9375 -91284 -2628 133807 221195 133024 159814 216601 300458 228291
8494 228291 135067 155435 184323 299104 441830 392549 385284 309114 362613 522499 528015
8483 528015 503092 578744 712995 673022 527615 556977 522615 557329 457729 320286 307389
8472 307389 255303 303820 263386 224397 257179 254427 224760 202180 129800 128831 280112 279926
$$ packed form
8550E49276p5889j56993k9307K637R5239Q3379J38629P5185q9277j74778j30511
8539B87590j08114n4806Q9986J3937m0903j6701n2322n0711q538K9415K79916
8528C68749Q4788Q70N3952j5503p9085o884M9963j11038n1114j9540N5226j15000
8516B15384j62554o0931Q2101Q5470P2650J59446J6857p0790J906o7547p4945
8505A97047j02482q5190j00659Q8656J36435Q7388q8171K6790N6787Q3857p2167
8494B28291r3224K0368K8888J14781J42726m9281p265p6170N3499J59886N516
8483E28015k4923P5652J34251l9973j45407K9362l4362L4714r9600j37443j2897
8472C07389n2086M8517m0434l8989L2782k752k9667k2580p2380r69J51281j86
$$ plain form
8460 279926 190160 159423 177882 219729 44893 -88922 -196432 -42083 15982 101026 109675
8449 109675 15958 2525 150025 182225 119739 104460 91216 85695 240813 313075 245933
8438 245933 185213 73005 64346 114768 154689 220965 103817 -34492 -15173 17248 18087 -49432
8426 -49432 -128090 -164397 -60377 137155 229081 177662 77073 61148 190536 188463 128122
8415 128122 69907 -1877 43658 65307 -1632 -4930 20859 16118 -63069 -31126 17087 29079
8403 29079 30177 -7015 106442 270986 287396 276397 221175 256545 322568 432236 471414
8392 471414 630136 743916 717958 608040 452720 247877 117142 7019 63232 231511
8382 231511 394565 444169 375054 270703 218229 152925 55838 101257 234000 181715 70675
$$ packed form
8460B79926q9766l0737J8459M1847j74836j33815j07510J54349N8065Q5044Q649
8449A09675r3717j3433J47500L2200o2486j5279j3244n521J55118P2262o7142
8438B45933o0720j12208q659N0422L9921O6276j17148j38309J9319L2421Q39o7519
8426d9432p8658l6307J04020J97532R1926n1419j00589j5925J29388k073o0341
8415A28122n8215p1784M5535K1649o6939l298K5789m741p9187L1943M8213J1992
8403B9079J098l7192J13457J64544J6410j0999n5222L5370O6023J09668L9178
8392D71414J58722J13780k5958j09918j55320k04843j30735j10123N6213J68279
8382B31511J63054M9604o9115j04351n2474o5304r7087M5419J32743n2285j11040
$$ plain form
8371 70675 34286 -67270 50502 64453 151064 245824 128608 139209 235626 235709 245143 172343
8359 172343 272172 352121 433194 380436 314129 236450 199121 277982 389638 510293 658489
8348 658489 1008408 1296107 1241689 1022256 653883 469574 412262 412145 383894 389266 227620
8337 227620 87072 142323 300621 346958 324907 327997 371439 321014 205700 220307 278508
8326 278508 263595 206143 230669 232459 223320 146832 65302 56917 47854 78147 144150 230615
8314 230615 241816 232261 157937 87968 163378 200975 345276 300551 258452 311255 434588
8303 434588 578344 654519 480398 482593 458011 505131 560850 777289 783648 490431 372250
8292 372250 330459 209049 179796 99561 90390 134972 106197 192632 149811 319374 326041 365678
$$ packed form
8371G0675l6389j01556J17772J3951Q6611R4760j17216J0601R6417Q3R434p2800
8359A72343R9829P9949Q1073n2758o6307p7679l7329P8861J11656J20655J48196
8348F58489L49919K87699n4418k19433l68373j84309n7312j17k8251N372j61646
8337B27620j40548N5251J58298M6337k2051L090M3442n0425j15314J4607N8201
8326B78508j4913n7452K4526J790r139p6488q1530q385r063L0293O6003Q6465
8314B30615J1201r555p4324o9969P5410L7597J44301m4725m2099N2803J23333
8303D34588J43756P6175j74121K195k4582M7120N5719K16439O359k93217j18181
8292C72250m1791j21410k9253q0235r171M4582k8775Q6435m2821J69563O667L9637
$$ plain form
8280 365678 291378 144886 4021 47129 -14319 -64605 -35375 -64851 79559 70090 87918
8269 87918 95694 121038 228497 254574 210510 244016 401073 338207 64309 -66700 -24078
8258 -24078 48091 25355 13715 106370 101187 251013 301496 378615 379331 272685 50004 9386
8246 9386 150983 177832 91598 198419 157802 118934 51868 50154 29789 5697 -31733 24440
8234 24440 61797 29883 -5427 -44513 7279 -6837 23405 116572 268511 215490 200822 145333
8222 145333 42934 -58228 -153771 -157129 -172740 -3168 58279 94166 45090 99673 140499
8211 140499 215117 281435 207433 206817 213224 229789 218418 208644 158855 29449 17977 56506
8199 56506 89301 177081 243795 208607 -27158 15414 -9608 -118142 -184298 -110511 -28194
$$ packed form
8280C65678p4300j46492j40865M3108o1448n0286K9230k9476J44410r469J7828
8269H7918P776K5344J07459K6077m4064L3506J57057o2866k73898j31009M2622
8258b4078P2169k2736j1640R2655n183J49826N0483P7119P16j06646k22681m0618
8246I386J41597K6849q6234J06821m0617l8868o7066j714k0365k4092l7430N6173
8234B4440L7357l1914l5310l9086N1792j4116L0242R3167J51939n3021j4668n5489
8222A45333j02399j01162r5543l358j5611J69572O1447L5887m9076N4583M0826
8211A40499P4618O6318p4002o16O407J6565j1371r774m9789j29406j1472L8529
8199E6506L2795Q7780O6714l5188k35765M2572k5022j08534o6156P3787Q2317
$$ plain form
8188 -28194 -156016 -44407 -83824 -119878 -75305 -67321 29672 120351 115862 29976 -59 28139
8176 28139 129018 116178 147602 113187 44561 55106 132266 88418 70588 -28821 66257 107936
8164 107936 88924 82622 205453 155334 66160 -30865 -36189 -21883 13059 72451 202149 207334
8152 207334 49476 -15032 17535 38515 -97978 -123983 73295 112444 94871 138486 100161
8141 100161 41005 37758 187872 244948 90097 -9249 -120895 -195025 -149981 -182437 -121606
8130 -121606 -27048 60521 100014 84549 27954 -2260 -16307 124057 142183 182163 93702
8119 93702 -43318 -114687 -65816 -64227 23688 110969 152407 162751 60000 7070 37421 31428
8107 31428 -13851 277 75357 128021 222671 180712 135765 171092 109075 54032 6070 -146209
$$ packed form
8188b8194j27822J11609l9417l6054M4573P984R6993R0679m489q5886l0035K8198
8176B8139J00879j2840L1424l4415o8626J0545P7160m3848j7830r9409R5078M1679
8164A07936j9012o302J22831n0119q9174r7025n324J4306L4942N9392J29698N185
8152B07334j57858o4508L2567K0980j36493k6005J97278L9149j7573M3615l8325
8141A00161n9156l247J50114N7076j54851r9346j11646p4130M5044l2456O0831
8130a21606R4558Q7569L9493j5465n6595l0214j4047J40364J8126L9980q8461
8119I3702j37020p1369M8871J589Q7915Q7281M1438J0344j02751n2930L0351n993
8107C1428m5279J4128P5080N2664R4650m1959m4947L5327o2017n5043m7962j52279
$$ plain form
8095 -146209 -267807 -336485 -361930 -419483 -396525 -346480 -263557 -166718 -128300 -53030 -36831
8084 -36831 64709 7547 5149 33005 44304 -85923 -129800 -195457 -126414 1235 197909
8073 197909 185927 154132 195546 207405 88758 -102563 -116456 -92906 12422 87629 55543
8062 55543 43182 -84940 -12455 6426 -160174 -238109 -290439 -134141 59350 112175 92351
8051 92351 77241 175877 158300 109516 4516 1722 95494 193869 75088 -26892 -46722
8040 -46722 -43321 -101704 -36597 -24354 -2801 81090 59948 85408 90756 73320 -21880 44781
8028 44781 204477 141691 62016 19363 94335 62228 10346 -28396 -49988 -68150 69125
8017 69125 103894 89497 85051 96482 131050 115558 186185 274368 259039 90889 238092 377772
$$ packed form
8095a46209j21598o8678k5445n7553K2958N0045Q2923R6839L8418P5270J6199
8084c6831J01540n7162k398K7856J1299j30227m3877o5657O9043J27649J96674
8073A97909j1982l1795M1414J1859j18647j91321j3893K3550J05328P5207l2086
8062E5543j2361j28122P2485J8881j66600p7935n2330J56298J93491N2825j9824
8051I2351j5110R8636j7577m8784j05000k794R3772R8375j18781j01980j9830
8040d6722L401n8383O5107J2243K1553Q3891k1142K5460N348j7436r5200O6661
8028D4781J59696o2786p9675m2653P4972l2107n1882l8742k1592j8162J37275
8017F9125L4769j4397m446J1431L4568j5492P0627Q8183j5329j68150J47203J39680
$$ plain form
8005 377772 261586 280672 271571 229468 150491 197479 255742 261319 332253 275654 267756 301787
7993 301787 295195 253565 162939 171691 174964 109703 -79149 -196877 -46068 -21308 44057 47054
7981 47054 83700 147923 170459 225500 281697 242430 314625 357413 397888 532247 515438 445897
7969 445897 449359 465525 453078 357287 260355 237460 240494 187979 194797 319182 389851 366187
7957 366187 250473 180552 148166 117640 143249 130040 33167 -22478 31453 153561 247761
7946 247761 218014 131828 85662 169711 400758 517739 401361 221701 220210 181690 183203
7935 183203 124517 173523 188608 165727 220914 234456 256342 168539 158736 233615 194779 155757
7923 155757 195334 183015 209425 244890 274420 289176 260358 256933 280257 280943 99280 19875
$$ packed form
8005C77772j16186J9086r101m2103p8977M6988N8263N577P0934n6599p898L4031
7993C01787o592m1630r0626Q752L273o5261j88852j17728J50809K4760O5365K997
7981D7054L6646O4223K2536N5041N6197l9267P2195M2788M0475J34359j6809o9541
7969D45897L462J6166j2447r5791r6932k2895L034n2515O818J24385P0669k3664
7957C66187j15714o9921l2386l0526K5609j3209r6873n5645N3931J22108R4200
7946B47761k9747q6186m6166Q4049K31047J16981j16378j79660j491l8520J513
7935A83203n8686M9006J5085k2881N5187J3542K1886q7803r803P4879l8836l9022
7923A55757L9577j2319K6410L5465K9530J4756k8818l425K3324O86j81663p9405
$$ plain form
7911 19875 -95158 91768 134217 103465 170321 241349 206726 43111 -211461 -216529 -79145
7900 -79145 7972 40984 87486 185934 200108 139713 151752 55552 8554 78434 159883 162545
7888 162545 166382 65565 -80506 -46997 107590 18203 77169 107918 -27997 -46636 120139
7877 120139 184916 109110 31311 164482 262204 193782 48738 46303 43692 43508 123328 236528
7865 236528 288485 286602 219826 115791 11518 64256 31911 -10796 -101803 -72986 -5008
7854 -5008 97377 176636 127277 87782 -18485 -42270 89533 30234 -46610 21528 125205
7843 125205 37083 107606 144890 153807 125791 74833 31696 59671 99252 249475 282878 208207
7831 208207 248046 229370 160404 94800 177245 332034 351788 392156 395926 200758 215640
$$ packed form
7911A9875j15033J86926M2449l0752O6856P1028l4623j63615k54572n068J37384
7900g9145Q7117L3012M6502R8448J4174o0395J2039r6200m6998O9880Q1449K662
7888A62545L837j00817j46071L3509J54587q9387N8966L0749j35915j8639J66775
7877A20139O4777p5806p7799J33171R7722o8422j45044k435k611j84P9820J13200
7865B36528N1957j883o6776j04035j04273N2738l2345m2707r1007K8817O7978
7854e008J02385P9259m9359l9495j06267k3785J31803n9299p6844O8138J03677
7843A25205q8122P0523L7284Q917k8016n0958m3137K7975L9581J50223L3403p4671
7831B08207L9839j8676o8966o5604Q2445J54789J9754M0368L770j95168J4882
$$ plain form
7820 215640 54514 -35784 -4814 57287 152029 173191 216708 132911 197067 157006 49295
7809 49295 82034 199878 193039 41324 -10324 -8789 88711 203718 258834 179510 119919 73913
7797 73913 -7374 3192 59950 178173 54699 12084 37258 -52493 -61047 61589 196080
7786 196080 275954 184544 2357 -88887 -207920 -142032 27560 31994 492 -4853 -11955 27691
7774 27691 136666 20053 -14668 30381 83803 145247 216667 196758 143139 107983 175048
7763 175048 243618 162898 75960 29713 -45415 -2000 -48823 25872 94335 120744 23945 -50299
7751 -50299 -196919 -337581 -197317 -16416 47765 187175 264482 161342 18497 100897
7741 100897 -2930 -70793 -10643 -59368 -111212 -79581 52439 86305 161200 156231 171872
$$ packed form
7820B15640j61126r0298L0970O2101R4742K1162M3517q3797O4156m0061j07711
7809D9295L2739J17844o839j51715n1648J535R7500J15007N5116p9324n9591m6006
7797G3913q1287J0566N6758J18223j23474m2615K5174q9751q554J22636J34491
7786A96080P9874r1410j82187r1244j19033O5888J69592M434l1502n345p102L9646
7774B7691J08975j16613l4721M5049N3422O1444P1420j9909n3619l5156O7065
7763A75048O8570q0720q6938m6247p5128M3415m6823P4695O8463K6409r6799p4244
7751e0299j46620j40662J40264J80901O4181J39410P7307j03140j42845Q2400
7741A00897j03827o7863O0150m8725n1844L1631J32020L3866P4895m969J5641
$$ plain form
7730 171872 36814 -75317 -8083 147744 104740 -37211 -67323 -42489 8752 -78442 -57902
7719 -57902 12922 4259 -82088 -93810 -212006 -170481 -210331 -251272 -167753 -23967 55244 -1783
7707 -1783 91981 92111 -106889 -131840 2262 31837 64078 -122389 -180478 -86070 35153 108857
7695 108857 40105 38203 -39911 -88066 -119655 44255 114244 42238 -36386 -214951 -326128
7684 -326128 -361641 -333788 -123134 -66902 -82462 -101412 -124463 -60798 -29838 -52903 40406
7673 40406 6775 -124985 -171922 -189804 -166099 -195286 -303098 -273730 -204247 -206836 -251373 -250625
7661 -250625 -72191 -12275 -10180 -1358 -11662 57414 41135 -81500 -70686 -113383 -91661 -102704
7649 -102704 -19106 -48540 -163661 -167056 -85710 -221325 -451883 -355013 -199591 -96737 -73835
$$ packed form
7730A71872j35058j12131O7234J55827m3004j41951l0112K4834N1241q7194K0540
7719e7902P0824q663q6347j1722j18196M1525l9850m0941Q3519J43786P9211n7027
7707a783R3764J30j99000k4951J34102K9575L2241j86467n8089R4408J21223P3704
7695A08857o8752j902p8114m8155l1589J63910O9989p2006p8624j78565j11177
7684c26128l5513K7853K10654N6232j5560j8950k3051O3665L0960k3065R3309
7673D0406l3631j31760m6937j7882K3705k9187j07812K9368O9483k589m4537P48
7661b50625J78434N9916K095Q822j0304O9076j6279j22635J0814m2697K1722j1043
7649a02704Q3598k9434j15121l395Q1346j35615k30558R6870J55422J02854K2902
$$ plain form
7638 -73835 -98766 -56670 33601 87662 49221 54902 58639 17599 -65751 -98544 -124090 -94654
7626 -94654 -137627 -249332 -265395 -347944 -287727 -174130 -145071 -141774 -154154 -208402 -200695 -93077
7614 -93077 -37792 -59749 -39026 40647 73403 -774 35903 180625 120980 -122620 -155016
7603 -155016 -156287 -77643 -4672 80189 63012 28566 -69554 -107857 -145115 -98069 -20705 56645
7591 56645 79928 62281 13889 95394 26822 -85113 -163610 -119188 45498 93217 166273
7580 166273 175077 53484 42804 138707 73717 -21577 -25010 -18101 -35631 -134504 -213044 -243621
7568 -243621 -231140 -106216 -116288 -108799 -293 57479 41673 23457 129400 123306 61964
7557 61964 -27799 -106082 1835 125004 -7177 -120528 -126772 -100576 -120682 -125983 -89924
$$ packed form
7638g3835k4931M2096R0271N4061l8441N681L737m1040q3350l2793k5546K9436
7626i4654m2973j11705j6063q2549O0217J13597K9059L297j2380n4248P707J07618
7614i3077N5285k1957K0723P9673L2756p4177L6677J44722n9645k43600l2396
7603a55016j271P8644P2971Q4861j7177l4446r8120l8303l7258M7046P7364P7350
7591E6645K3283j7647m8392Q1505o8572j11935p8497M4422J64686M7719P3056
7580A66273Q804j21593j0680R5903o4990r5294l433O909j7530r8873p8540l0577
7568b43621J2481J24924j0072P489J08506N7772j5806j8216J05943o094o1342
7557F1964q9763p8283J07917J23169j32181j13351o244K6196k0106n301L6059
$$ plain form
7546 -89924 -154507 -160534 -43537 -16236 -85872 -113887 -154166 1265 34166 -146407 -187988
7535 -187988 -154534 -14698 -90210 -129822 -88903 -92688 -62916 14010 58879 142508 26255
7524 26255 -21116 72194 42088 -86969 15076 117401 49849 33809 -36380 -84967 -123310
7513 -123310 -154865 -72107 -40365 -6124 26113 5706 -148960 -88060 -95944 -144954 -213491 -113267
7501 -113267 -7138 126768 208436 122303 87925 2589 -105642 -129920 -103758 -70288 -430
7490 -430 -84791 -4701 93596 -37310 -121303 -178975 -208242 -231946 -134886 -113119 -50031 124649
7478 124649 73962 210697 229687 229543 96557 97756 37962 24801 -25121 -18112 -81116 -34793
7466 -34793 3626 33297 54889 40463 52796 -3873 17262 85773 22295 -83432 -23634 51114
$$ packed form
7546h9924o4583o027J16997K7301o9636k8015m0279J55431L2901j80573m1581
7535a87988L3454J39836p5512l9612M0919l785K9772P6926M4869Q3629j16253
7524B6255m7371R3310l0106j29057J02045J02325o7552j6040p0189m8587l8343
7513a23310l1555Q2758L1742L4241L2237k0407j54666O0900p884m9010o8537J00224
7501a13267J06129J33906Q1668q6133l4378q5336j08231k4278K6162L3470O9858
7490d30q4361Q0090R8297j30906q3993n7672k9267k3704R7060K1767O3088J74680
7478A24649n0687J36735J8990j44j32986J199n9794j3161m9922P009o3004M6323
7466c4793L8419K9671K1592j4426J2333n6669K1135O8511o3478j05727N9798P4748
$$ plain form
7454 51114 69069 -14877 -97460 -25656 -54031 28629 111166 119168 23570 -7947 -62437 -86973
7442 -86973 -86015 64964 137051 -47774 -105729 -111854 -91166 -170151 -138387 -100199 -10956 -1967
7430 -1967 -48079 -221050 -148423 -48275 122379 32088 -211851 -295983 -357426 -279960 -60521
7419 -60521 25999 36812 -396 -92943 -169081 -127331 -54691 -23397 -141793 -60095 -53119 -67969
7407 -67969 37424 -72418 -101768 -66123 -146945 -126063 -126129 -100868 -87767 -171557 -291374 -251188
7395 -251188 -110342 -118310 -107907 -30494 -94018 -227354 -284641 -140429 -3531 91777 149629
7384 149629 130056 87300 19896 74062 35833 -8354 -102280 12573 158718 256333 201450
7373 201450 120912 143068 1407 4007 96535 89431 -16199 -50905 -91768 -101134 -31786 53111
$$ packed form
7454E1114J7955q3946q2583P1804k8375Q2660Q2537Q002r5598l1517n4490k4536
7442h6973R58J50979P2087j84825n7955o125K0688p8985L1764L8188Q9243Q989
7430a967m6112j72971P2627J00148J70654r0291k43939q4132o1443P7466K19439
7419f0521Q6520J0813l7208r2547p6138M1750P2640L1294j18396Q1698O976j4850
7407f7969J05393j09842k9350L5645q0822K0882o6K5261J3101q3790j19817M0186
7395b51188J40846p968J0403P7413o3524j33336n7287J44212J36898R5308N7852
7384A49629j9573m2756o7404N4166l8229m4187r3926J14853J46145R7615n4883
7373B01450q0538K2156j41661K600R2528p104j05630l4706m0863r366O9348Q4897
$$ plain form
7361 53111 53284 1996 -95132 -87538 -39363 -41844 -162999 -191287 -71001 -117257 -155660 -198502
7349 -198502 -238361 -221653 -215695 -179856 -108553 -137801 -114227 -59561 91620 160945 15469
7338 15469 -44333 50549 88462 14677 -232801 -143120 -30653 -37452 48001 -46326 -32217 -87051
7326 -87051 -183738 -203279 -166930 -194598 -150944 -204433 -196788 -16053 79675 -74746 -84941 -28418
7314 -28418 -13767 -35830 -103721 -178129 -240231 -157286 -48594 129389 77550 -15924 7361
7303 7361 30707 -100031 -193315 -141828 -151644 -145813 -57844 -46067 -93946 -131388 -10833 95250
7291 95250 -19077 -69368 -30287 -11215 36422 38912 -21973 -68510 -55746 -115106 -189735 -185224
7279 -185224 -109494 -47486 -28396 -199892 -185825 -153058 -227832 -261450 -207343 -118830 -68994
$$ packed form
7361E3111J73n1288r7128P594M8175k481j21155k8288J20286m6256l8403m2842
7349a98502l9859J6708N958L5839P1303k9248K3574N4666J51181O9325j45476
7338A5469n9802R4882L7913p3785k47478Q9681J12467o799Q5453r4327J4109n4834
7326h7051r6687j9541L6349k7668M3654n3489P645J80735R5728j54421j0195N6523
7314b8418J4651k2063o7891p4408o2102Q2945J08692J77983n1839r3474K3285
7303G361K3346j30738r3284N1487r816N831Q7969J1777m7879l7442J20555J06083
7291I5250j14327n0291L9081J9072M7637K490o0885m6537J2764n9360p4629M511
7279a85224P5730O2008J9090j71496J4067L2767p4774l3618N4107Q8513M9836
$$ plain form
7268 -68994 -106311 71392 97739 -6353 -38072 -23003 37710 89790 -9018 -191024 -226320
7257 -226320 -133762 -22844 57410 104108 41878 -56142 -90975 -163960 -181617 -163136 -124804
7246 -124804 -134486 -152460 -144546 -104748 -181867 -340248 -359540 -302817 -275133 -242831 -232059 -177163
7234 -177163 -27227 88541 42998 -34995 -9313 -69999 -156668 -130282 -69527 -102266 -137531
7223 -137531 -159565 -38639 -123289 -190145 -241825 -301509 -398751 -320684 -186384 -19963 46948
7212 46948 90167 -1171 -128023 -107586 -48972 -6525 37197 133755 75048 6996 177214
7201 177214 153855 15082 100021 164164 41395 19991 -34590 -30330 47831 15914 8718 -56751
7189 -56751 -285677 -230797 -149638 -103035 -58505 -76397 -65943 -7182 -120461 -27757 59515
$$ packed form
7268f8994l7317J77703K6347j04092l1719J5069O0713N2080r8808j82006l5296
7257b26320R2558J10918Q0254M6698o2230r8020l4833p2985j7657J8481L8332
7246a24804r682j7974P914L9798p7119j58381j9292N6723K7684L2302J0772N4896
7234a77163J49936J15768m5543p7993K5682o0686q6669K6386O0755l2739l5265
7223a37531k2034J20926q4650o6856n1680n9684r7242P8067J34300J66421O6911
7212D6948M3219r1338j26852K0437N8614M2447M3722R6558n8707o8052J70218
7201A77214k3359j38773Q4939O4143j22769k1404n4581M260P8161l1917p196o5469
7189e6751k28926N4880Q1159M6603M4530j7892J0454N8761j13279R2704Q7272
$$ plain form
7178 59515 81692 260014 213746 213658 126651 28077 69016 -14470 -125337 -101509 7600 105837
7166 105837 121947 101365 102071 58566 148851 77493 -145467 -100098 -55171 1807 -86888 -126948
7154 -126948 -83602 -190032 -249379 -116649 -52448 97141 187569 80295 51059 7709 -2792
7143 -2792 6898 -29323 66693 114590 180956 144922 28809 -89056 -115205 -91771 -171862 -99224
7131 -99224 -28824 17021 103350 40155 32411 -80182 -132023 -54783 -104196 -43566 46893 69798
7119 69798 -63314 -199288 -174785 -88757 22367 -33337 -36201 -143236 -135049 -211301 -274942
7108 -274942 -200186 -178893 -160393 -203987 -229257 -181690 -159296 -240331 -228155 -150627 -98449 -30745
7096 -30745 -78819 -109615 -189927 -238185 -271122 -236138 -179705 -78941 -112042 -183080 -68803
$$ packed form
7178E9515K2177J78322m6268q8q7007r8574M0939q3486j10867K3828J09109R8237
7166A05837J6110k0582P06m3505R0285p1358k22960M5369M4927N6978q8695m0060
7154a26948M3346j06430n9347J32730O4201J49589R0428j07274k9236m3350j0501
7143b792R690l6221R6016M7897O6366l6034j16113j17865k6149K3434q0091P2638
7131i9224P0400M5845Q6329o3195p744j12593n1841P7240m9413O0630R0459K2905
7119F9798j33112j35974K4503Q6028J11124n5704k864j07035Q187p6252o3641
7108b74942P4756K1293J8500m3594k5270M7567K2394q1035J2176P7528N2178O7704
7096c0745m8074l0796q0312m8258l2937L4984N6433J00764l3101p1038J14277
$$ plain form
7085 -68803 11824 -90197 -108681 16630 145554 326920 326553 78626 -108156 -186177 -73143
7074 -73143 98260 198466 31891 104031 46764 12028 -39877 12901 -24432 -91257 -88248
7063 -88248 -58310 3779 19267 94170 157286 243066 247401 159463 95827 181250 276151 402148
7051 402148 369903 161997 -50805 -98696 -18151 -14387 85969 58315 146817 220049 136633
7040 136633 -17716 64370 189149 187297 178806 104787 70848 48759 115274 217882 226954 212025
7028 212025 71302 58997 46488 -19393 -132878 -79955 -66316 -35659 -16923 -74720 -159497
7017 -159497 -71464 -92337 -37140 -69443 -189793 -181671 -69502 -9989 -20750 62008 81256
7006 81256 45832 121330 254624 226295 127365 76395 109044 215003 313524 297719 187329
$$ packed form
7085f8803Q0627j02021j8484J25311J28924J81366l67k47927j86782p8021J13034
7074g3143J71403J00206j66575P2140n7267l4736n1905N2778l7333o6825L009
7063h8248K9938O2089J5488P4903O3116Q5780M335q7938o3636Q5423R4901J25997
7051D02148l2245k07906k12802m7891Q0545L764J00356k7654Q8502P3232q3416
7040A36633j54349Q2086J24779j852q491p4019l3939k2089O6515J02608R072j4929
7028B12025j40723j2305j2509o5881j13485N2923J3639L0657J8736n7797q4777
7017a59497Q8033k0873N5197l2303j20350Q122J12169N9513j0761Q2758J9248
7006H1256l5424P5498J33294k8329r8930n0970L2649J05959R8521j5805j10390
$$ plain form
6995 187329 99754 18637 -13714 -77396 -122506 -129152 -137923 -54656 39345 -88352 -55057 83147
6983 83147 65127 42504 -12651 13388 11435 -133387 -214107 -77042 60344 35785 -54998
6972 -54998 -198722 -242897 -262677 -300364 -74448 16756 16167 -5722 -105606 56787 115856 -64206
6960 -64206 -245289 -317962 -211797 -132137 -153727 -174404 16085 35629 29088 -153732 -179508
6949 -179508 -72426 90021 100787 -20145 -139069 -206984 -136733 16242 156979 148461 37094
6938 37094 13586 -76558 -156391 -227763 -160311 -99145 -6405 45874 -1018 20699 -8023 29005
6926 29005 90744 115854 11572 5572 -101762 -150911 -246102 -170505 -152490 -203345 -233149 -241763
6914 -241763 -259791 -197452 -152539 -249531 -281130 -318857 -258222 -159656 -234112 -215306 -233710 -271521
$$ packed form
6995A87329q7575q1117l2351o3682m5110o646q771Q3267R4001j27697L3295J38204
6983H3147j8020k2623n5155K6039j953j44822q0720J37065J37386k4559r0783
6972e4998j43724m4175j9780l7687K25916R1204n89k1889r9884J62393N9069j80062
6960f4206j81083p2673J06165P9660k1590k0677J90489J9544o541j82820k5776
6949a79508J07082J62447J0766j20932j18924o7915P0251J52975J40737q518j11367
6938C7094k3508r0144p9833p1372O7452O1166R2740N2279m6892K1717k8722L7028
6926B9005O1739K5110j04282o000j07334m9149r5191P5597J8015n0855k9804q614
6914b41763j8028O2339M4913r6992l1599l7727O0635R8566p4456J8806j8404l7811
$$ plain form
6902 -271521 -157076 74552 99183 -190252 -244445 -37685 72305 64223 -8160 -89850 -149234
6891 -149234 -134726 -66399 -176343 -195615 -126910 -62713 -15212 -130923 -84074 -3855 -23619
6880 -23619 -53437 -133463 -162641 -51557 49431 140690 40547 34834 -26382 -15057 -21830 33970
6868 33970 112590 133689 33182 -108662 -64891 -120305 -157364 -21586 -49335 -62653 -85932
6857 -85932 -2027 -36988 -39083 -93134 -144785 -122053 -93053 -76913 -57253 -101465 -21922 18000
6845 18000 -147637 -244535 5110 42613 -87176 -139298 -60680 -49646 128862 181146 40257
6834 40257 29007 -141777 -252524 -311379 -293219 -290145 -267965 -76421 -115829 -183364 -263386
6823 -263386 -197591 -103466 -79733 26949 32388 -46697 -160713 -104924 -6252 120714 197416
$$ packed form
6902b71521J14445K31628K4631k89435n4193K06760J09990q082p2383q1690n9384
6891a49234J4508O8327j09944j9272O8705O4197M7501j15711M6849Q0219j9764
6880b3619k9818q0026k9178J11084J00988R1259j00143n713o1216J1325o773N5800
6868C3970P8620K1099j00507j41844M3771n5414l7059J35778k7749j3318k3279
6857h5932Q3905l4961k095n4051n1651K2732K9000J6140J9660m4212P9543L9922
6845A8000j65637r6898K49645L7503j29789n2122P8618J1034J78508N2284j40889
6834D0257j1250j70784j10747n8855J8160L074K2180J91544l9408o7535q0022
6823b63386O5795R4125K3733J06682N439p9085j14016N5789R8672J26966P6702
$$ plain form
6812 197416 160880 99831 -83359 -191858 -155647 -83628 -60933 -120583 -130649 -91319 -99776
6801 -99776 -125922 -109647 38828 15768 82673 99456 11328 -57785 -42277 -11189 39729 -4461
6789 -4461 -153847 -129948 42104 59503 95835 90168 13846 -11895 -57205 -23563 -39217 -25068
6777 -25068 -13562 34529 1518 88716 98431 16587 -73868 9255 52835 -22402 -47532 -84632
6765 -84632 -132519 -178905 -192541 -256333 -209800 -112567 -164861 -197542 -86001 -18227 31872 -43384
6753 -43384 -11739 -93159 -88754 -39720 -1347 59410 43503 52073 -94101 -102028 -87007 -83952
6741 -83952 -61879 25676 3483 80681 108250 -12732 -10136 -6930 -16894 -17366 -169462 -102150
6729 -102150 38941 80649 20373 -21732 -112135 -90592 -34301 -24779 -28863 -16364 35907 77676
$$ packed form
6812A97416l6536o1049j83190j08499L6211P2019K2695n9650j0066L9330q457
6801i9776k6146J6275J48475k3060O6905J6783q8128o9113J5508L1088N0918m4190
6789d461j49386K3899J72052J7399L6332n667p6322k5741m5310L3642j5654J4149
6777b5068J1506M8091l3011Q7198R715q1844r0455Q3123M3580p5237k5130l7100
6765h4632m7887m6386j3636o3792M6533R7233n2294l2681J11541O7774N0099p5256
6753d3384L1645q1420M405M9034L8373O0757j5907Q570j46174p927J5021L055
6741h3952K2073Q7555k2193P7198K7569j20982K596L206r964m72j52096O7312
6729a02150J41091M1708o0276m2105r0403K1543N6291R522m084J2499N2271M1769
$$ plain form
6717 77676 17679 22757 26261 -1368 -8008 36027 97655 197571 124209 -21475 75841 114319
6705 114319 48268 -14396 3691 -143941 -273293 -164124 -72236 300 -22426 62565 182443
6694 182443 165642 161995 21899 -20703 -3616 -96320 -108010 25236 49436 -68100 -70275
6683 -70275 -14991 67729 184360 288299 276159 231138 178532 171000 81381 72338 -68450 -189567
6671 -189567 -240929 -113287 74571 97601 54715 49644 -30585 76856 -36164 -9414 -56881
6660 -56881 -87655 -108480 -42157 1574 -19559 -151489 -174045 -142626 -181132 -236131 -106749
6649 -106749 9678 10528 31015 53976 -20615 -3224 110940 151577 138031 90710 182516 -47017
6637 -47017 -332907 -318891 -307327 -132171 -88292 -35659 -15338 34899 34464 -22418 -171069 -296599
$$ packed form
6717G7676n9997N078L504k7629o640M4035O1628R9916p3362j45684R7316L8478
6705A14319o6051o2664J8087j47632j29352J09169R1888P2536k2726Q4991J19878
6694A82443j6801l647j40096m2602J7087r2704j1690J33246K4200j17536k175
6683g0275N5284Q2720J16631J03939j2140m5021n2606p532q9619r043j40788j21117
6671a89567n1362J27642J87858K3030m2886n071q0229J07441j13020K6750m7467
6660e6881l0774k0825O6323M3731k1133j31930k2556L1419l8506n4999J29382
6649a06749J16427Q50K0487K2961p4591J7391J14164M0637j3546m7321R1806k29533
6637d7017k85890J4016J1564J75156M3879N2633K0321N0237m35n6882j48651j25530
$$ plain form
6625 -296599 -257690 -107375 -96859 73261 175030 151045 154558 127546 79590 -25554 -32047
6614 -32047 -62690 -65898 -59391 13892 -92741 -194500 -205591 -170570 -86577 14317 55534 63972
6602 63972 181623 173504 171938 139891 298634 317698 209691 138221 63304 104047 -14900
6591 -14900 -28826 77344 45946 9138 -65653 -122214 -70482 3478 10295 123745 137654 92794
6579 92794 -47837 -3113 52488 58942 -58013 -115446 -96909 -141261 -116917 -103424 -187767 -122983
6567 -122983 -207012 -172484 -154157 -142192 -203087 -249879 -161958 -81932 41740 -42154 -157276
6556 -157276 -55865 -29181 63746 87318 83690 23477 10732 49876 -55457 -87491 -49561
6545 -49561 20228 136466 39203 96073 131694 176687 65747 -113518 -233505 -195898 17212
$$ packed form
6625b96599L8909J50315J0516J70120J01769k3985L513k7012m7956j05144o493
6614c2047l0643l208O507P3283j06633j01759j1091L5021Q3993J00894M1217Q438
6602F3972J17651q119j566l2047J58743J9064j08007p1470p4917M0743j18947
6591a4900j3926J06170l1398l6808p4791n6561N1732P3960O817J13450J3909m4860
6579I2794j40631M4724N5601O454j16955n7433J8537m4352K4344J3493q4343O4784
6567a22983q4029L4528J8327J1965o0895m6792Q7921Q0026J23672q3894j15122
6556a57276J01411K6684R2927K3572l628o0213j2745L9144j05333l2034L7930
6545d9561O9789J16238r7263N6870L5621M4993j10940j79265j19987L7607K13110
$$ plain form
6534 17212 17966 -37078 -16991 -72068 -84080 -128176 -213761 -387150 -292675 -237921 -274288 -283982
$$ packed form
6534A7212P54n5044K0087n5077j2012m4096q5585j73389R4475N4754l6367r694
$$ [...]
##END NTUPLES=NMR SPECTRUM
##END=
