##TITLE=Analysis number 324894
Compound Code cc 12509
Project Code adrs
Chemist Name prosynth
##JCAMPDX= 6.0         $$ Bruker NMR JCAMP-DX V2.0
##DATA TYPE= NMR SPECTRUM
##DATA CLASS= NTUPLES
##ORIGIN= Bruker BioSpin GmbH
##OWNER= nmr
$$ XWIN-NMR		Version 3.5
$$ Mon Dec  4 16:05:40 2006 GMT Standard Time (UT+0h)  MAYBRIDGE\nmr@NMR_250MHZ
##.OBSERVE FREQUENCY= 250.131544655141
##.OBSERVE NUCLEUS= ^1H
##.ACQUISITION MODE= SIMULTANEOUS (DQD)
##.ACQUISITION SCHEME= undefined
##.AVERAGES= 16
##.DIGITISER RES= 18
##SPECTROMETER/DATA SYSTEM= dpx250
##.PULSE SEQUENCE= zg30
##.SOLVENT NAME= CDCl3
##.SHIFT REFERENCE= (INTERNAL, CDCl3, 0, 16.522)
##AUDIT TRAIL= $$ (NUMBER, WHEN, WHO, WHERE, WHAT)
$$ ##TITLE= Audit trail, XWIN-NMR		Version 3.5
$$ ##JCAMPDX= 5.01
$$ ##ORIGIN= Bruker BioSpin GmbH
$$ ##OWNER= nmr
$$ C:\u/data/dgb/nmr/ADRS/250/pdata/1/auditp.txt
$$ ##AUDIT TRAIL=  $$ (NUMBER, WHEN, WHO, WHERE, WHAT)
(   1,<2006-12-04 16:05:19.26 +000>,<MAYBRIDGE\nmr>,<NMR_250MHZ>,
      <created by zg, POWCHK disabled, PULCHK disabled
       configuration hash MD5:
       49 4B E0 1D 92 C2 6B 37 9F E6 65 BC 52 41 86 1D
       data hash MD5: 64K
       1A 41 C7 7C 00 0C C3 9A FE AE BE DA 47 71 49 E2>)
(   2,<2006-12-04 16:05:31.18 +000>,<MAYBRIDGE\nmr>,<NMR_250MHZ>,
      <Start of raw data processing
       ef LB = 0.3 FT_mod = 6 PKNL = 1 SI = 32K 
       data hash MD5: 32K
       67 3F DF 03 F8 45 97 FE C3 A4 33 C9 73 50 42 27>)
(   3,<2006-12-04 16:05:33.40 +000>,<MAYBRIDGE\nmr>,<NMR_250MHZ>,
      <apk 
       data hash MD5: 32K
       6A F9 9F 4A CE DE 15 08 7D B4 89 AF CE 3A B0 75>)
(   4,<2006-12-04 16:05:34.15 +000>,<MAYBRIDGE\nmr>,<NMR_250MHZ>,
      <abs ABSG = 5 
       data hash MD5: 32K
       7F 87 9E EC AF FD 4E FA B2 8A C1 61 97 5C 4A F7>)
$$ ##END=
$$ 
$$ hash MD5
$$ 6F 65 2A C2 E4 B2 7A B4 47 36 97 9D 5C 98 3E 19
##$RELAX= 
##$RELAX= 
##$RELAX= 
##$RELAX= 
##$RELAX= 
##$RELAX= 
##$RELAX= 
$$ Bruker specific parameters
$$ --------------------------
##$DU= <C:\u>
##$EXPNO= 250
##$NAME= <ADRS>
##$PROCNO= 1
##$TYPE= <nmr>
##$USER= <dgb>
##$AMP= (0..31)
100 100 100 100 100 100 100 100 100 100 100 100 100 100 100 100 100 100 
100 100 100 100 100 100 100 100 100 100 100 100 100 100 
##$AQSEQ= 0
##$AQ_mod= 3
##$AUNM= <au_zg>
##$AUTOPOS= <52 >
##$BF1= 250.13
##$BF2= 250.13
##$BF3= 250.13
##$BF4= 250.13
##$BF5= 500.13
##$BF6= 500.13
##$BF7= 500.13
##$BF8= 500.13
##$BYTORDA= 1
##$CFDGTYP= 0
##$CFRGTYP= 5
##$CHEMSTR= <none>
##$CNST= (0..31)
1 1 145 1 1 1 1 1 1 1 1 1 1 1 1 1 1 1 1 1 1 1 1 1 1 1 1 1 1 1 1 1 
##$CPDPRG= <>
##$CPDPRG1= <>
##$CPDPRG2= <>
##$CPDPRG3= <>
##$CPDPRG4= <mlev>
##$CPDPRG5= <mlev>
##$CPDPRG6= <mlev>
##$CPDPRG7= <mlev>
##$CPDPRG8= <mlev>
##$CPDPRGB= <>
##$CPDPRGT= <>
##$D= (0..31)
0 1 0 0 0 0 0 0 0 0.06 0 0 0 0 0 0 0.0002 0 0 0 0 0 0 0 0 0 0 0 0 0 0 
0 
##$DATE= 1165248317
##$DBL= (0..7)
120 120 120 120 120 120 120 120 
##$DBP= (0..7)
150 150 150 150 150 150 150 150 
##$DBP07= 0
##$DBPNAM0= <>
##$DBPNAM1= <>
##$DBPNAM2= <>
$$ [...]
##$SUBNAM7= <"">
##$SUBNAM8= <"">
##$SUBNAM9= <"">
##$SW= 20.6930455092707
##$SWIBOX= (0..15)
0 0 3 0 0 0 0 0 0 0 0 0 0 0 0 0 
##$SW_h= 5175.983436853
##$TD= 65536
##$TD0= 1
##$TE= 294.16
##$TE2= 300
##$TE3= 300
##$TEG= 300
##$TL= (0..7)
0 120 120 120 120 120 120 120 
##$TP= (0..7)
150 150 150 150 150 150 150 150 
##$TP07= 0
##$TPNAME0= <>
##$TPNAME1= <>
##$TPNAME2= <>
##$TPNAME3= <>
##$TPNAME4= <>
##$TPNAME5= <>
##$TPNAME6= <>
##$TPNAME7= <>
##$TPOAL= (0..7)
0.5 0.5 0.5 0.5 0.5 0.5 0.5 0.5 
##$TPOFFS= (0..7)
0 0 0 0 0 0 0 0 
##$TUNHIN= 0
##$TUNHOUT= 0
##$TUNXOUT= 0
##$USERA1= <user>
##$USERA2= <user>
##$USERA3= <user>
##$USERA4= <user>
##$USERA5= <user>
##$V9= 5
##$VALIST= <valist>
##$VCLIST= <CCCCCCCCCCCCCCC>
##$VD= 0
##$VDLIST= <DDDDDDDDDDDDDDD>
##$VPLIST= <PPPPPPPPPPPPPPP>
##$VTLIST= <TTTTTTTTTTTTTTT>
##$WBST= 1024
##$WBSW= 4
##$XGAIN= (0..3)
0 0 0 0 
##$XL= 0
##$YL= 0
##$YMAX_a= 508655
##$YMIN_a= -535792
##$ZGOPTNS= <>
##$ZL1= 120
##$ZL2= 120
##$ZL3= 120
##$ZL4= 120
##$ABSF1= 16.522
##$ABSF2= -4.171173
##$ABSG= 5
##$ABSL= 3
##$ALPHA= 0
##$AQORDER= 0
##$ASSFAC= 0
##$ASSFACI= 0
##$ASSFACX= 0
##$ASSWID= 0
##$AUNMP= <proc_1d>
##$AZFE= 0.1
##$AZFW= 0.1
##$BCFW= 0
##$BC_mod= 0
##$BYTORDP= 0
##$COROFFS= 0
##$CY= 12.5
##$DATMOD= 1
##$DC= 0
##$DFILT= <>
##$DTYPP= 0
##$F1P= 14.0000005364418
##$F2P= -0.99999901652339
##$FCOR= 0.5
##$FTSIZE= 32768
##$FT_mod= 6
##$GAMMA= 0
##$GB= 0
##$INTBC= 1
##$INTSCL= 1
##$ISEN= 128
##$LB= 0.3
##$LEV0= 0
##$LPBIN= 0
##$MAXI= 10000
##$MC2= 0
##$MEAN= 0
##$ME_mod= 0
##$MI= 0
##$NCOEF= 0
##$NC_proc= -2
##$NLEV= 6
##$NOISF1= 0
##$NOISF2= 0
##$NSP= 0
##$NTH_PI= 0
##$NZP= 0
##$OFFSET= 16.522
##$PC= 1
##$PHC0= 231.1799
##$PHC1= -7.860057
##$PH_mod= 1
##$PKNL= yes
##$PPARMOD= 0
##$PSCAL= 4
##$PSIGN= 0
##$REVERSE= no
##$SF= 250.13
##$SI= 32768
##$SIGF1= 0
##$SIGF2= 0
##$SINO= 400
##$SIOLD= 32768
##$SREGLST= <1H.CDCl3>
##$SSB= 0
##$STSI= 32768
##$STSR= 0
##$SW_p= 5175.98343685301
##$SYMM= 0
##$S_DEV= 0
##$TDeff= 65536
##$TDoff= 0
##$TI= <Analysis number 999999
Compound Code 99
Book Reference 9
Project Code 9>
##$TILT= no
##$TM1= 0
##$TM2= 0
##$TOPLEV= 0
##$USERP1= <user>
##$USERP2= <user>
##$USERP3= <user>
##$USERP4= <user>
##$USERP5= <user>
##$WDW= 1
##$XDIM= 32768
##$YMAX_p= 308255378
##$YMIN_p= -107698
$$ End of Bruker specific parameters
$$ ---------------------------------
##NTUPLES= NMR SPECTRUM
##VAR_NAME=  FREQUENCY,     SPECTRUM/REAL,   SPECTRUM/IMAG
##SYMBOL=    X,             R,               I
##VAR_TYPE=  INDEPENDENT,   DEPENDENT,       DEPENDENT
##VAR_FORM=  AFFN,          ASDF,            ASDF
##VAR_DIM=   32768,         32768,           32768
##UNITS=     HZ,            ARBITRARY UNITS, ARBITRARY UNITS
##FACTOR=    0.157963299565203, 1,           1
##FIRST=     4132.6476996994, 0,             0
##LAST=      -1043.33573715361, 0,           0
##MIN=       -1043.33573715361, -107698,     0
##MAX=       4132.6476996994, 308255378,     0
$$ Real data points
##PAGE= N=1
##DATA TABLE= (X++(R..R)), XYDATA
$$ [...]
18966a664J426L399l055o366k375N10j524J499K642k947m13l972O096N923M214
18951C393j90n09k671l125l413m762K723L379j09m351o38P07k17N48Q061j091
18935b265n226L045q534K329N807m91J796n23P95J458m7Q86p012r82j767R80N080
18918d671o725j0586L230N452L883K735l431k18M190P43k143o139j689K656R887
18903b826O653j506o241o066K657j790l627k041N197R855M08j1122n246p132L510
18888a9317J7056K562j983J884J758j374q858j883N27l604o892M720O020l393
18874a2777k84M947O843J704Q448j24m77l298q312k938j913k293K272J309k449
18859i342m362n240K274j046J266O094J906M662L203o96P22j575p86L273J213
$$ plain form
18966 -1664 -238 3161 106 -6260 -8635 -8125 -9649 -8150 -5508 -8455 -8868 -12840 -6744 -821 3393
18951 3393 3203 2694 23 -3102 -6515 -11277 -8554 -5175 -5284 -9635 -10273 -9566 -9783 -9235 -1174 -2265
18935 -2265 -7491 -4446 -12980 -10651 -4844 -5335 -3539 -4062 -3267 -1809 -1856 -970 -7982 -8964 -10731 -9751 -4671
18918 -4671 -11396 -21982 -18752 -13300 -9417 -6682 -10113 -10331 -6141 -5398 -7541 -13680 -15369 -12713 -2826
18903 -2826 3827 2321 -3920 -9986 -7329 -9119 -12746 -14787 -9590 265 673 -10449 -15695 -22827 -19317
18888 -19317 -2261 301 -1682 202 1960 586 -8272 -10155 -9628 -13232 -20124 -15404 -9384 -12777
18874 -12777 -13061 -8114 -1271 433 8881 8757 8280 4982 -3330 -6268 -8181 -10474 -8202 -6893 -9342
18859 -9342 -13704 -18944 -16670 -17716 -16450 -10356 -8450 -3788 -585 -1281 -559 -2134 -2920 353 1566
18844A566n625n87m204k840K418P892k798J48N400N46j322j925j015L34K292K075
18828B355J171p011k518J71k975m90N620Q38l004L552R247J425m541j956l576
18813a692p332k220k916n513l780L889O342P320J894K744M731K498p656l609j419
18798f719n61k477L289J0153L65j2492m12J1513l722L745k433k550o990k494M962
18783f823J640l133K252q11N438O367R19q066l5R586O107j381J1902J0929K0311
18768E5202K7898J495j6883k3790k2852r826m592k144l152k059J74L71M472p381
18754c067o295o227K726N215l062l52K6K995J255L718R61K524n58n342J84R068
18738C769O113p738j0175K119N431m608l893k084l894J584j097O69K472M766P053
$$ plain form
18844 1566 -4059 -4646 -8850 -11690 -9272 -1380 -4178 -4030 1370 1916 594 -1331 -2346 -2012 280 2355
18828 2355 3526 -3485 -6003 -5832 -8807 -9297 -3677 -2839 -5843 -2291 6956 8381 3840 1884 -1692
18813 -1692 -9024 -11244 -14160 -19673 -23453 -19564 -13222 -5902 -4008 -1264 3467 5965 -1691 -5300 -6719
18798 -6719 -7280 -9757 -6468 3685 4050 -8442 -8854 2659 -1063 2682 249 -2301 -9291 -11785 -6823
18783 -6823 -5183 -8316 -6064 -6875 -1437 4930 5849 -2217 -2252 7334 13441 12060 23962 34891 55202
18768 55202 83100 84595 67712 43922 21070 11244 6652 4508 1356 -703 -529 -158 4314 -3067
18754 -3067 -9362 -15589 -12863 -7648 -10710 -11062 -11036 -8041 -6786 -3068 -2107 417 -141 -5483 -5299 3769
18738 3769 9882 2144 -8031 -5912 -481 -5089 -8982 -11066 -14960 -13376 -14473 -13804 -11332 -6566 487
18723D87M621P83j245r159r084j947J628K766P049M064o90j690k66k436O986K559
18707D426j2521K402M671n845j0214m984J624M471L140L964K186O83k575O047
18693b525j290m207m886l966l636j011j700N923P726r26m247J2908L389l696k983
18678e127p77L934L652r61j794n89m820l196K429J840l279j569k053n277J384
18663a6203J276p26J301O156O385P023m662j1866M24Q205k582R90j145j102n506
18648a2032O652j788L022M059p09m383j478O1n151K961J282O388j011m261O93
18633e695l126m81L296o82P74M58m252j197L476P10M833K074m456l51J712l414
18617f321q717k55P272j197n650j095N525L484k100K75l860M161M887J904n447
$$ plain form
18723 487 5108 5891 4646 -4513 -13597 -15544 -13916 -11150 -4101 -37 -727 -2417 -2683 -5119 1867 4426
18707 4426 -8095 -5693 -1022 -6867 -17081 -22065 -20441 -15970 -12830 -8866 -6680 -5997 -8572 -2525
18693 -2525 -3815 -8022 -12908 -16874 -20510 -21521 -23221 -17298 -9572 -10498 -14745 -1837 1552 -2144 -5127
18678 -5127 -5904 -1970 1682 721 -1073 -1662 -6482 -9678 -7249 -5409 -8688 -10257 -12310 -17587 -16203
18663 -16203 -14927 -15653 -14352 -8196 -1811 5212 550 -11316 -10892 -2687 -5269 -4279 -5424 -6526 -12032
18648 -12032 -5380 -7168 -4146 -87 -796 -5179 -6657 -6596 -11747 -8786 -7504 -1116 -2127 -6388 -5695
18633 -5695 -8821 -9302 -6006 -6688 -5914 -5456 -9708 -10905 -7429 -6719 -1886 188 -4268 -4619 -2907 -6321
18617 -6321 -15038 -15293 -8021 -9218 -14868 -15963 -10438 -6954 -9054 -8779 -12639 -8478 -3591 -1687 -7134
18602g134l371Q16o290Q050L554l80P65P45N052k016l022k493k718l369n676L316
18586a4171Q249o257L79K205o284m361M758L023P126Q58O18O05k516o24p405m815
18570a8612k733K442N662O798m73j009j831K338K612l75k49P047m320L185J640
18555B122n64j444n698L772P234J225j321r710j610K913k939J988K251K505j251
18540e27k308k134O60K632J397O966P022m837j366j859p702n41N829p088L012
18525h44J966k001l432k416K511m692j461L734m429o410J0056Q801q976k801n713
18510a6107O328K198k815L16K543L66N271N532k939L549L640m423L083j074q773
18495c305K231N237j073l558k001N886K658l403l389J189n588l674K767N355l291
$$ plain form
18602 -7134 -10505 -9689 -15979 -7929 -4375 -4755 -3990 -3245 1807 -209 -3231 -5724 -8442 -11811 -17487 -14171
18586 -14171 -5922 -12179 -11800 -9595 -15879 -20240 -15482 -12459 -5333 -4475 -3857 -3252 -5768 -6392 -13797 -18612
18570 -18612 -21345 -18903 -13241 -6443 -6916 -7925 -9756 -7418 -4806 -5181 -5430 1617 -2703 482 2122
18555 2122 1558 114 -5584 -1812 5422 6647 5326 -4384 -5994 -3081 -6020 -4032 -1781 724 -527
18540 -527 -2835 -4969 -4309 -1677 -280 6686 13708 8871 7505 5646 -2056 -2597 3232 -3856 -844
18525 -844 1122 -879 -4311 -6727 -4216 -8908 -10369 -6635 -11064 -17474 -7418 1383 -7593 -10394 -16107
18510 -16107 -9779 -7581 -10396 -10080 -7537 -7171 -1900 3632 693 4242 7882 3459 6542 5468 -3305
18495 -3305 -1074 4163 3090 -468 -2469 3417 6075 2672 -717 472 -5116 -8790 -6023 -668 -3959
18480c959o229J214M127J040r183p901M053N622K176J283P56k73n347l718K623
18465a3716L292M344m638k31K414R083p91k961K819m797J920K363K612L703L002
18450H418q240J186q672l438N990L066p51n587K976k84k049m125K056M228m80
18435e706j047K141k716m822n823l195L918j188J647K443L173k935K808M516L047
18420c739L765K022j297N790j211k355p58j780o725k831M029J975o794o10n267
18405a5786o092P55J1236P421n630m596O541o21K252J394k439K040N714K4p954
18390e741J1N130K115j527j262l507j736L867J707K716j177L441m69p307K006
18375a733K080N81L497O49j610m539P589P545n398j0836J306O537m162o505p125
$$ plain form
18480 -3959 -10188 -8974 -4847 -3807 -12990 -20891 -16838 -11216 -9040 -7757 -7001 -7274 -12621 -16339 -13716
18465 -13716 -10424 -6080 -10718 -10949 -8535 548 -243 -3204 -385 -5182 -3262 -899 1713 5416 8418
18450 8418 178 1364 -7308 -10746 -4756 -1690 -2441 -8028 -5052 -5336 -7385 -11510 -9454 -5226 -5706
18435 -5706 -6753 -4612 -7328 -12150 -17973 -21168 -17250 -18438 -16791 -14348 -11175 -14110 -11302 -6786 -3739
18420 -3739 26 2048 751 6541 5330 2975 2217 437 -6288 -9119 -5090 -3115 -9909 -10519 -15786
18405 -15786 -21878 -21123 -9887 -2466 -8096 -12692 -6151 -6772 -4520 -3126 -5565 -3525 2189 2213 -5741
18390 -5741 -5730 -600 1515 -12 -1274 -4781 -6517 -2650 -943 1773 596 4037 3568 -3739 -1733
18375 -1733 347 928 4425 5074 3464 -1075 6514 14059 8661 -2175 -869 5668 1506 -4999 -12124
18360a2124P189m826k717K383n48L314j826n537L028L809p51k50J171K825l57
18345e217m26k092n19K453L770O746L765j735l245j679j654l728l586m631m029
18330a5807K237L20Q691M25J903k761o444J685J321N500O867m222R94O35j191
18315A53M112j086J541M640l540l451p032j478L765R053P968p336j1082K360R42
18300d71j451k784O421L564P31n883l559l642r63k561P882M403j028l179k812
18285e332J866p573m349O49L676J515K56J1263N814p148n08K782j32k281M458
18270D956q63k089J18n561m212L965L171q601q632M767O430m892m5R272J680l182
18254c718k242j70o628K169j038L611j449l143j248m96M765P008L418j438k465
$$ plain form
18360 -12124 -4935 -9761 -12478 -10095 -10643 -7329 -9155 -14692 -11664 -7855 -8606 -8856 -7685 -4860 -5217
18345 -5217 -5643 -7735 -8254 -5801 -2031 4715 8480 6745 3500 1821 167 -3561 -7147 -11778 -15807
18330 -15807 -13570 -13250 -4559 -4134 -2231 -4992 -11436 -9751 -8430 -2930 3937 -285 709 1344 153
18315 153 4265 3179 4720 9360 5820 2369 -4663 -6141 -2376 6677 14645 7309 -3773 -1413 -471
18300 -471 -1922 -4706 1715 5279 6010 127 -3432 -7074 -8037 -10598 -2716 1687 659 -2520 -5332
18285 -5332 -3466 -11039 -15388 -14739 -11063 -9548 -9292 1971 7785 637 129 2911 2779 498 4956
18270 4956 4093 2004 2122 -3439 -7651 -3686 -515 -9116 -17748 -12981 -6551 -11443 -11488 -2216 -536 -3718
18254 -3718 -5960 -6130 -12758 -10589 -11627 -8016 -9465 -12608 -13856 -14352 -9587 -2579 839 -599 -3064
18239c064k648Q88j7r61k201O685K020j44o90m432L760O882o13q011n575m089
18223a2210j630k031m103N470L615L883n729m557M433L294l05j111J149J764p136
18208a5204l187N075P378k719J002J026j329l595m37j346J499r55o99m709j319
18193a9519m906L313m918l362Q527Q114L637p15l275l949P22Q368k361k895P08
18178a2511j390O158K856j995k446j010j966n190Q40N684J13n97K520J1998J788
18163D852r188n139j169n800p906K917J378j001n760M104O152N541M596N332m313
18148e404j991J193J98J398N278P149l802j060r29r44K726L330K292P055P927
18133B4416Q391K038K418R778J2038N548Q908J1426K1215J7979K2370K4062L0466
$$ plain form
18239 -3064 -5712 -4824 -4841 -5802 -8003 -1318 702 558 -132 -4564 -804 6078 5465 -2546 -8121 -12210
18223 -12210 -13840 -15871 -19974 -14504 -10889 -7006 -12735 -17292 -12859 -9565 -9870 -10981 -9832 -8068 -15204
18208 -15204 -18391 -13316 -5938 -8657 -7655 -6629 -7958 -11553 -11990 -13336 -11837 -12792 -13491 -18200 -19519
18193 -19519 -24425 -21112 -26030 -29392 -20865 -12751 -9114 -9829 -13104 -17053 -16331 -7963 -10324 -13219 -12511
18178 -12511 -13901 -7743 -4887 -6882 -9328 -10338 -12304 -17494 -16654 -10970 -10857 -11454 -8934 3064 4852
18163 4852 -4336 -9475 -10644 -16444 -24350 -21433 -20055 -21056 -26816 -22712 -16560 -11019 -6423 -1091 -5404
18148 -5404 -7395 -6202 -6004 -4606 672 7821 4019 2959 2030 1086 3812 7142 9434 16489 24416
18133 24416 32807 34845 37263 47041 59079 64627 73535 84961 106176 124155 146525 170587 201053
18120B01053M7143P8176R9122J39735J92456L07987N31354R22364J673568K960911
18110G153869M854673M186856j147897l673411m165541k801493j456140q22957
18102B127959n12332l26706k25576j74225j27830j06911r4963p6924n3360m4383
18092C84749l6630l4471k9227l5626k0421j5467j4211j4462j7109j5317j2957
18081A38851q320j0190q336m844J432j0471m067L78j106q563j0184K872o099p151
18067F4202o60m416K91L14k868k858l240l593J791J673J0685Q65j4022o303K990
18052D4851J006k539K066m712j1233q704K846n44m039J427P198J222l637r317
18038A5891O15Q069j727N885K02n290j2264l559M101j014J873R047K771J069P62
$$ plain form
18120 201053 248196 326372 425494 565229 757685 1065672 1597026 2519390 4192958 7153869
18110 7153869 12008542 16195398 15047501 11374090 7208549 4407056 2950916 2127959
18102 2127959 1615627 1288921 1063345 889120 761290 654379 559416 482492 429132 384749
18092 384749 348119 313648 284421 248795 228374 212907 198696 184234 167125 151808 138851
18081 138851 130531 120341 112005 107161 108593 98122 94055 94433 93327 84764 74580 77452 71353 64202
18067 64202 63542 59126 59417 59731 56863 54005 50765 47172 48963 50636 61321 62186 48164 41861 44851
18052 44851 45857 43318 45384 40672 29439 20735 23581 23037 18998 20425 27623 28845 25208 15891
18038 15891 16506 24575 22848 28733 28935 23645 11381 7822 11923 10909 12782 21829 24600 25669 26431
18023B6431K67J304n966q394Q309M49o986Q846n52R26k885n7o340r036O435J0390
18007B3141k799o856P97l463n104k431L136P021M703k273m347J297O366M37o432
17992A3193l100m325J514m319p63J555J189N076N759n136l693L71j489k085M235
17977G982N663r48M66q430l165m35N97k696l468M076O123k672L481J082L76j210
17961F822l463J696j814p575n769R61j872l721J1090Q322N219j949J792l881L25
17946F183k612k724j15J2114J938j0999n419P988L0J968j395P13r259P29l47L617
17930B410K010K291k392J505K505m103o949K562P642N259n409p131M620O376k466
17915H730p586L69k595k171J1090K950L12m700p311P69K471p45R501K879k372
$$ plain form
18023 26431 26698 28002 22036 13642 21951 22400 15414 24260 23708 24634 21749 21692 15352 6316 12751 23141
18007 23141 20342 13486 14283 10820 5716 3285 6421 13442 18145 15872 11525 12822 19188 19625 13193
17992 13193 10093 5768 7282 2963 2200 3755 4944 10020 15779 10643 6950 7321 5832 3747 7982
17977 7982 13645 12697 13163 4733 1568 1133 1730 -966 -4434 -358 5765 3093 6574 7656 8032 6822
17961 6822 3359 5055 3241 -4334 -10103 -9142 -11014 -14735 -3645 4677 9896 7947 9739 5858 6183
17946 6183 3571 847 732 12846 14784 3785 -1634 6354 6384 8352 6957 7670 -1589 -860 -1207 2410
17930 2410 4420 6711 4319 5824 8329 4226 -2723 -161 7481 12740 7331 200 4820 11196 8730
17915 8730 1144 1513 -1082 -3253 7837 10787 11099 6399 -912 -143 2328 1583 11084 13963 11591
17900A1591p437l963J525N635m5m20K202K300L418p026j0473J547M006j247N793
17885G406R53o65m828j172N17L265M665n993k935n23J833q66k236M349K901K403
17869I074k593L330r63l226r79L112J674l447o014j108l374J253J1866m022n796
17854a213L885N740l564q312m586M587M362p22m358m070J569j108o214N916R001
17839I13K81M076n949p573K262M859l695k741k943k87M015J1910p662m947J067
17824f414N194J701j636j087O898K46j95K689J353K806K575l146m528M036k135
17809H357m049j438j63k663m25o453j977M943O935m992k636K506N372M672K482
17794A0471o244K500R20l475o709n47m539r62M230K913O36j169K025N862j377
$$ plain form
17900 11591 4154 191 1716 7351 7306 6886 9088 11388 14806 7780 -2693 -1146 2860 1613 7406
17885 7406 8359 7694 2866 1694 2211 5476 10141 4148 1213 690 2523 1657 -579 3770 6671 9074
17869 9074 6481 9811 8848 5622 4643 7755 9429 5982 -32 -1140 -4514 -3261 8605 4583 -1213
17854 -1213 2672 8412 4848 -3464 -8050 -3463 899 177 -4181 -8251 -6682 -7790 -14004 -8088 913
17839 913 1194 5270 -679 -8252 -5990 -1131 -4826 -7567 -10510 -10797 -6782 5128 -2534 -7481 -6414
17824 -6414 -1220 481 -1155 -2242 4656 4902 4707 7396 8749 11555 14130 10984 6456 10492 8357
17809 8357 4308 2870 2707 44 -381 -6834 -8811 -3868 3067 -1925 -4561 -2055 3317 7989 10471
17794 10471 4227 6727 7647 4172 -2537 -3084 -7623 -8585 -4355 -1442 -806 -1975 50 5912 4535
17779D535l884K082J212L531l571j1319l904P022K925M277O859O086K363o252
17765A1962l991j762j602k52J128N06R18o465n662j399j599M508J928L098O114
17750G430K99k690n174k617j440M49L733K369l094J043r20J818k078P747Q630
17735A5505j624k748m012l186J101J987j36l724n072m542k576J48O282O088j197
17720B294L78L528K245K168k762j486m25j0723m139K103O535J361k737O35k663
17705c688l348K737J1479N197m478l094l570n145j666k875J676J215k053K389
17691e224M851L009P881l027m902o154k760K187O222k89R3l507L345M259L44k981
17675C347n9K179j364l280K343K868N11j404m146m936j216P095L241j4155l900
$$ plain form
17779 4535 651 2733 3945 7476 3905 -7414 -11318 -4296 -1371 2906 9765 15851 18214 11962
17765 11962 7971 6209 4607 4355 5483 5989 6907 442 -5220 -6619 -8218 -3710 -1782 1316 7430
17750 7430 7729 5039 -135 -2752 -4192 -3743 -10 2359 -735 308 -612 1206 -872 6875 15505
17735 15505 13881 11133 7121 3935 5036 7023 6887 3163 -1909 -6451 -9027 -8879 -2597 3491 2294
17720 2294 2672 6200 8445 10613 7851 6365 5940 -4783 -8922 -6819 -284 1077 -1660 -1025 -3688
17705 -3688 -7036 -4299 7180 12377 7899 4805 1235 -3910 -5576 -8451 -6775 -5560 -7613 -5224
17691 -5224 -373 2636 10517 7490 2588 -3566 -6326 -4139 2083 1794 1887 -1620 1725 5984 6328 3347
17675 3347 3288 5467 4103 823 3166 6034 6545 5141 995 -3941 -5157 1938 5179 -8976 -12876
17660a2876N392K67K36j84o30j068J084K055L587j492J943O86L521Q072q6n296
17644E211O864O627j748M86k310m314j346L615K0l800q5K11l801n574R72l774
17628b746k33k88J858R063J3411O8l870o744M9l060l69n461K111j457m222O710
17612D820n399l058J786l04J831n129p111M776P065l51M472Q53o368k727J575
17597c269O220O154N867L116p08l259m752o69m204M404J599o953k85l938N37K500
17581B360q486o281L012q01J144L524M223J150l966j797L27o07K286J010K514
17566c88K146n094l801m462K36P069N038N827O001l902j311q570K922M092o0j596
17550D147m180l51o890j35R135R536l650l049O876K543o403k245O7k052j0449
$$ plain form
17660 -12876 -7484 -7217 -6981 -7165 -7795 -8863 -7779 -5724 -2137 -3629 -1686 -1000 2521 10593 10507 5211
17644 5211 12075 18702 16954 17440 15130 10816 9470 13085 13105 9305 9220 9431 5630 56 1028 -2746
17628 -2746 -2979 -3267 -1409 7654 21065 21133 17263 10519 10568 7508 7139 1678 3789 2332 -1890 4820
17612 4820 -579 -3637 -1851 -2155 -324 -5453 -12564 -7788 -723 -1074 3398 4251 -2117 -4844 -3269
17597 -3269 2951 9105 14972 18088 17380 14121 9369 8700 4496 8900 10499 3546 3261 -677 -140 2360
17581 2360 -6126 -12407 -9395 -10196 -9052 -5528 -1305 -155 -4121 -5918 -5591 -6198 -3912 -2902 -388
17566 -388 1758 -3336 -7137 -11599 -11363 -4294 744 6571 12572 8670 7359 -1211 1711 5803 5743 4147
17550 4147 -33 -384 -7274 -7409 1726 11262 7612 4563 11439 13982 7579 5334 5401 3349 -7100
17535g100L354R057l458p301K598J0066Q31M904J601j763j430P82n387m191L823
17520F386N191j043M302L244l032o947k663j925P63L486J643m621j4378n884r04
17505a6382O913Q377N616m110j18N320k296k449o146j284O28k307j279k47K425
17490g339O132L218J643l142K919L889k54K199K525k709Q83K488J494n022j448
17475G476j332Q458K479m637o529j455k312p110O45O543O775j1646m318J3350
17461F387P058K461q126j064J37n61m711r582l340P836M105L010M012m436O313
17446I499J4034J0154J2389K2731J3807k977j6713k4170j8697n577r17j203k344
17433A0016k723J198j343o652n726M91J203L466j002k508L0L25N483M651O276
$$ plain form
17535 -7100 -3746 5311 1853 -5448 -2850 7216 8047 12951 14552 12789 11359 12141 6754 2563 6386
17520 6386 11577 10534 14836 18080 15048 8101 5438 3513 4276 7762 9405 4784 -9594 -15478 -16382
17505 -16382 -9469 -1092 4524 414 296 5616 3320 871 -5275 -6559 -5931 -8238 -9517 -9764 -7339
17490 -7339 -1207 2011 3654 512 3431 7320 7066 9265 11790 9081 9964 12452 13946 8924 7476
17475 7476 6144 14602 17081 12444 5915 4460 2148 -4962 -4317 2226 9001 -2645 -6963 6387
17461 6387 13445 15906 7780 6716 6853 6292 1581 -8001 -11341 -3505 600 3610 7622 3186 9499
17446 9499 23533 33687 46076 68807 82614 79637 62924 38754 20057 14480 13563 12360 10016
17433 10016 7293 8491 7148 496 -5230 -4739 -3536 -70 -1072 -3580 -3550 -3225 2258 6909 13185
17418A3185m853o549m972j4N333R497L342j030k770n92j771j183j561o853Q60
17403F9o81P99m212k564j216k55K601j486k370J080N250O316Q101k012l137L110
17387I393O534K071n088j541l213p92k227l841l29N43P22p101o121Q008J784r129
17371a0327N737j529l28K227m721K996J753O88M227L741L529M41J820j485k914
17356E855n72l864l892J037N880M804L557j02k297K317m649r596j687O000j163
17341A628k576R39K637o112K975n247l23m485L971J1644P87K132J278l688q136
17326b576L50M579L602k231k07l996j334L179k903r83j059L872L044n05p827M947
17310d8K699n626k206K944r3M056J113J408m274r400O325O353k430k385N272J05
$$ plain form
17418 13185 8332 1783 -3189 -3203 2130 11627 14969 13939 11169 10577 8806 7623 6062 -791 69
17403 69 -612 187 -4025 -6589 -7805 -8060 -5459 -6945 -9315 -8235 -2985 3331 11432 9420 6283 9393
17387 9393 15927 17998 12910 11369 8156 7364 5137 1296 967 1510 2232 -4869 -10990 -2982 -1198 -10327
17371 -10327 -4590 -6119 -6447 -4220 -8941 -5945 -4192 -3504 723 4464 7993 8434 10254 8769 5855
17356 5855 5283 1419 -2473 -1436 4444 9248 12805 12703 10406 12723 8074 -1522 -3209 2791 1628
17341 1628 -948 -9 2628 -3484 -509 -5756 -6079 -10564 -6593 5051 5838 7970 9248 5560 -2576
17326 -2576 -2226 2353 5955 3724 3517 -479 -1813 1366 -1537 -2520 -3579 293 3337 2832 -4995 -48
17310 -48 2651 -2975 -5181 -2237 -2330 1726 2839 4247 -27 -9427 -3102 3251 821 -1564 3708 3813
17294C813L39J08J798R15O66n900q64k599m99J118m897L193L340m22j384J187
17278h8K767l152K319p74r53k510k761k132l665N019L753k938J659j041K268K503
17262B74n501j897j811k856k23P732Q929J144r82M171n561n383L461O810l747
17247D560n920n07q83O91J941K190m257k104r40l154k135m244P471J477R4P479
17231A759r18l000J771n67J022n64O16M257j455j419L812j043k491l740M046J532
17215C618L149O037m059r244J192J223l633q197l339J989l66Q021M346l664n392
17200h319l581J666J939M916L708l53m045M706J738l520o62m539l525k414k205
17185a4490l76J556J19M863l474J99r67K747N30k587O715J395j964j62k57m748
$$ plain form
17294 3813 4152 4260 6058 6973 7639 1739 875 -1724 -2223 -1105 -6002 -2809 531 109 -1275 -88
17278 -88 2679 -473 1846 1072 119 -2391 -5152 -7284 -10949 -5930 -2177 -5115 -3456 -4497 -2229 274
17262 274 -5227 -7124 -8935 -11791 -12014 -4282 4647 5791 4809 8980 3419 -1964 1497 8307 4560
17247 4560 -1360 -1867 -2750 -2059 -118 2072 -2185 -4289 -5229 -8383 -10518 -14762 -7291 -5814 -5720 1759
17231 1759 841 -2159 -388 -955 67 -497 119 4376 2921 1502 5314 4271 1780 -1960 2086 3618
17215 3618 6767 12804 8745 -499 693 1916 -1717 -9914 -13253 -11264 -11630 -3609 737 -2927 -8319
17200 -8319 -11900 -10234 -8295 -3379 329 -24 -4069 637 2375 -1145 -1807 -6346 -9871 -12285 -14490
17185 -14490 -14866 -13310 -13191 -8328 -11802 -11603 -12570 -9823 -9293 -11880 -5165 -3770 -5734 -5896 -6153 -10901
17169a0901p201Q44j722P36J0318K981q166k813J0384k81p573m10M16J149N10
17154a1729P36L503j741m011O97N077l337K4M545N612K495k425N037Q777l884
17139I376j0354k55P653L546m305l443q179R20M969M15n40l010L419M130K978
17124G320K848K665Q77k098n046m71K009L461J355L151L221P418R071K351M714
17109D2846J3150K4057L3550L1122M4708L8460J5787M001L685j3283l2548l2631
17097A72904l1281k4028k6777k6814j3257j4629l293k015j0171j922L394l424
17085A8687q891k492p47J623j49M173m482k437L69K003M312M254K090p958r338
17070A017r253J382L065J780K492l381o17J249L701Q177l973p695n634J22M869
$$ plain form
17169 -10901 -18102 -17258 -18980 -18244 -7926 -4945 -13111 -15924 -5540 -5821 -13394 -13804 -13388 -12239 -11729
17154 -11729 -10993 -7490 -9231 -13242 -12545 -7468 -10805 -10781 -6236 -624 1871 -554 4483 13260 9376
17139 9376 -978 -1233 6420 9966 5661 2218 -5961 -5041 -72 343 -197 -3207 212 4342 7320
17124 7320 10168 12833 13710 11612 6566 6095 8104 11565 12920 16071 19292 26710 35781 38132 42846
17109 42846 55996 80053 113603 144725 189433 227893 243680 247681 251366 238083 205535 172904
17097 172904 141623 117595 90818 64004 50747 36118 32825 30810 20639 18717 22111 18687
17085 18687 9796 7304 6557 8180 8031 12204 7722 5285 5654 7657 11969 16223 18313 10355 1017
17070 1017 -8236 -6854 -3789 -2009 483 -2898 -3515 -2266 1435 9612 5639 -2056 -7690 -7568 -2699
17055b699K896j588p272p401J947J0565M868K50n960m356k747N292J062m14j692
17040g249n708N16J557R31M976K118k876P710j958l953K32m338l237K007l472
17025a2744k090M326Q724R779L203K373K893m035q743K552J127O47o5o635j4736
17010a3424J306N529q12k798n077l168Q096O940k876l561L570L248L523k825Q0
16995b249M131J138R10k480p183l68N610M334K737O44n514l048n50o858n827m9
16979a4622M386J849N063j191m7N95l777O85O1M452K494J268k950k564o483n426
16963a6207L025n06N866N68K820O55J343J037o252l558P368o44r156n762L054
16948a6349N11O818M05Q27J52L82p65l390r528K293K308L580J391Q030o63m382
$$ plain form
17055 -2699 197 -1391 -8663 -16064 -14117 -3552 1316 1566 -4394 -8750 -11497 -6205 -5143 -5557 -7249
17040 -7249 -12957 -12441 -10884 -9953 -4977 -2859 -5735 1975 17 -3936 -3704 -8042 -11279 -9272 -12744
17025 -12744 -14834 -10508 -1784 7995 11198 13571 16464 12429 3686 6238 7365 8012 7947 1312 -13424
17010 -13424 -12118 -6589 -7401 -10199 -15276 -18444 -10348 -3408 -6284 -9845 -6275 -3027 496 -2329 -2249
16995 -2249 1882 3020 3930 1450 -5733 -6101 -491 3843 6580 7224 1710 -1338 -1888 -8746 -14573 -14622
16979 -14622 -10236 -8387 -3324 -4515 -4562 -3967 -7744 -7059 -6998 -2546 -52 1216 -1734 -4298 -10781 -16207
16963 -16207 -13182 -13688 -7822 -7254 -4434 -3779 -2436 -1399 -7651 -11209 -3841 -4485 -13641 -19403 -16349
16948 -16349 -15838 -9020 -8615 -7788 -7636 -7254 -8019 -11409 -20937 -18644 -16336 -12756 -11365 -3335 -3998 -8380
16932h380k33k81K138M11j146j11N257M567o565n751l962J718N645P133j954n120
16916f634p157K839L46k668l138L481J862J564M22L121m426N899n248K590K675
16901d472K997l589l964J086N067O398J51l595o255n416k336K12L547k959J08
16886a3020m602J289L171P596k982k294L478j793l220r80m4k926n664J756K086
16871a8149J465J769K085P157P64j159N54J0291j625j624j1578l511r80p789o99
16856b3029P480Q268n070J200n47L150p43j742K148K278m705L869k365k004k613
16841a4425K429L754O887p20j3047r27L972M281j822P26K854j974l310K895J0478
16826B051L062p296l238R89l886J059J774M372J0454p736n455O884N896p878k814
$$ plain form
16932 -8380 -8613 -8894 -6756 -6345 -7491 -7602 -2345 2222 -4343 -10094 -14056 -12338 -6693 440 -1514 -6634
16916 -6634 -13791 -10952 -10606 -13274 -16412 -12931 -11069 -9505 -9083 -5962 -10388 -4489 -9737 -7147 -4472
16901 -4472 -1475 -5064 -9028 -7942 -2875 3523 3674 79 -6176 -11592 -13928 -13716 -10169 -13128 -13020
16886 -13020 -17622 -16333 -13162 -5566 -8548 -10842 -7364 -9157 -12377 -13357 -13401 -16327 -21991 -20235 -18149
16871 -18149 -16684 -14915 -12830 -5673 -4909 -6068 -5514 4777 3152 1528 -10050 -13561 -14541 -22330 -23029
16856 -23029 -15549 -7281 -12351 -11151 -11698 -8548 -9291 -11033 -8885 -6607 -11312 -7443 -9808 -11812 -14425
16841 -14425 -11996 -8242 -1355 -2075 -15122 -16049 -12077 -7796 -9618 -8892 -6038 -8012 -11322 -8427 2051
16826 2051 5113 -2183 -5421 -4432 -8318 -7259 -5485 -1113 9341 1605 -3850 3034 8930 1052 -1762
16811a762j329l140M1j380J601O960l184k857o245R3o660r26J388L680Q294L279
16795b147k958J555j463M70n019L814k347j334k7N876j422n154k863M25O86m748
16779a6656l391m231K278n619L173L387K265K821p043P608P464K419j616k821
16765i962J727Q450k208j253k620k483j816L220o223j424L676N602j737k994J295
16750h750m760M288J0372K611m217k285m174K717m494j247K51J143k573J995P85
16735h338m993j939L533O046M036K56n505m759N150J215J100P515j197m336K751
16720E35j8M752k274l526n369l860j800M111j781P346O04m471N08n541Q15Q176
16704a793K1k586k449L581J503j722m261o433j684k742K990K927l44l333O68M584
$$ plain form
16811 -1762 -3091 -6231 -6190 -7570 -5969 991 -2193 -5050 -11295 -11202 -17862 -18788 -17400 -13720 -5426 -2147
16795 -2147 -5105 -3550 -5013 -4543 -9562 -5748 -8095 -9429 -9456 -3580 -5002 -10156 -13019 -12594 -11908 -16656
16779 -16656 -20047 -24278 -22000 -27619 -24446 -21059 -18794 -15973 -23016 -15408 -7944 -5525 -7141 -9962
16765 -9962 -8235 215 -1993 -3246 -5866 -8349 -10165 -6945 -13168 -14592 -10916 -5314 -7051 -10045 -8750
16750 -8750 -13510 -9222 1150 3761 -456 -2741 -6915 -4198 -8692 -9939 -9688 -8545 -11118 -9123 -8338
16735 -8338 -13331 -15270 -11737 -5691 -1655 -1399 -6904 -11663 -6513 -5298 -4198 3317 2120 -2216 535
16720 535 517 5269 2995 -531 -5900 -9760 -11560 -7449 -9230 -1884 -1280 -5751 -5243 -10784 -9969 -1793
16704 -1793 -1772 -4358 -6807 -3226 -1723 -3445 -7706 -14139 -15823 -18565 -15575 -12648 -12992 -16325 -15657 -11073
16688a1073Q863l439j121O022P050l609o597m808j597q829L368K06P143J3572
16674E151M390k778L320j359l617M386m30j156J73n314r129o835k274m6K615k435
16658a5338P77j049p852k765k261J745K62Q161J220n72L937j8j1637L918J2460
16643i012j180k021J227K147L255K432N90M054r86j386l199l081j920J76k804
16628a1708M207K466o247L334M150j176k161L225j255l70J396k40N904M34L399
16613E358p075j941P4k032L542k573K576o36j6k385M640N790j0791p588k90k051
16597a5398k81N64j651M920N596N829p674K687L930o545l982J516K416J057o09
16582g625j326J449L298l278K330M868k185p332n160n095L908M385j436K631O38
$$ plain form
16688 -11073 -2210 -5649 -6770 -748 6302 2693 -3904 -8712 -10309 -19138 -15770 -15564 -8421 5151
16674 5151 9541 6763 10083 8724 5107 9493 9063 7907 8080 2766 -6363 -13198 -15472 -15518 -12903 -15338
16658 -15338 -14561 -15610 -23462 -26227 -28488 -26743 -26481 -18320 -17100 -17672 -13735 -13753 -25390 -21472 -9012
16643 -9012 -10192 -12213 -10986 -8839 -5584 -3152 -2562 1492 506 -880 -4079 -7160 -9080 -8904 -11708
16628 -11708 -7501 -5035 -11282 -7948 -3798 -4974 -7135 -3910 -5165 -5535 -4139 -4379 1525 1959 5358
16613 5358 -1717 -3658 -3584 -5616 -2074 -4647 -2071 -2707 -2723 -5108 -468 5322 -5469 -13057 -13347 -15398
16597 -15398 -15679 -15115 -16766 -11846 -6250 -421 -8095 -5408 -1478 -8023 -12005 -10489 -8073 -7016 -7625
16582 -7625 -8951 -7502 -4204 -7482 -5152 -284 -2469 -9801 -14961 -20056 -16148 -11763 -13199 -10568 -9930
16567i930m538N426J0667O976m764n023r114k52O030K106k295n163L571L781M387
16552A865j472L242k015j121m271O502P566J1872K742k666n169N124Q128J0908
16538D1235K4447K6795K8050K8857M3477M7196M2831M5518L5574J3186n773j9960
16526C51433l9195l8684m6854m4299l7822l4711k6229k1033j7959j1509j1353
16515B1785J087K897n773O779m426m239L731o757q042o615m839m468j427O925
16501c382L369K154n560P41O846l120k175l95m749l330M160O508o1p597m831R409
16485b013L651r30L414M70P638M40j0372o608n145J802M235m67L855M578j170
16470C378j20l226J902j982j0490o616n521K860R13P492L746n069j99K491M980
$$ plain form
16567 -9930 -14468 -9042 1625 8601 3837 -1186 -10300 -10552 -4522 -2416 -4711 -9874 -6303 -2522 1865
16552 1865 393 3635 1620 499 -3772 2730 10296 22168 24910 22244 17075 22199 30327 41235
16538 41235 65682 92477 120527 149384 192861 240057 282888 328406 363980 377166 371393 351433
16526 351433 312238 273554 226700 182401 144579 109868 83639 62606 44647 33138 21785
16515 21785 22872 25769 19996 26775 22349 18110 21841 15084 7042 427 -4412 -8880 -10307 -3382
16501 -3382 -13 2141 -3419 -2678 4168 1048 -1127 -1522 -6271 -9601 -5441 1067 1006 -6591 -11422 -2013
16485 -2013 1638 708 4122 4592 12230 12670 2298 -4310 -9455 -7653 -3418 -3885 -30 4548 3378
16470 3378 3258 32 1934 -48 -10538 -17154 -22675 -19815 -18902 -11410 -7664 -12733 -12932 -10441 -5461
16455e461j984K405j438r176L710L209L891o147j455J003L133r07j55m615J362
16440a2625R742O418m163q748l618K592J696l50m248Q37l8J188M3m90L482N86
16424g696J462L623J690l473k216K065K196n323l281P28O076M767m248o235l162
16409a3027K37j022j439L894M207l808k66N1M478Q200M405j293n657l774N965
16394A151O612m193j2117m439L346L665Q119O644m194l707o01L794j418p966r131
16379a4435J59J625L859K398k544l088K940K979L007l075k294N064M828m293l557
16364f427m406l385L135k81l495J309J366l089k367K436k889L911L856m395K045
16349a2676k127O6J0465O988k702j754k65m023m760M474Q479l800L92n196m855
$$ plain form
16455 -5461 -7445 -5040 -6478 -15654 -11944 -8735 -4844 -10991 -12446 -11443 -8310 -9217 -9372 -13987 -12625
16440 -12625 -2883 3535 -628 -9376 -12994 -10402 -8706 -9056 -13304 -12467 -12505 -11317 -11274 -11764 -8282 -7696
16424 -7696 -6234 -2611 -921 -4394 -6610 -4545 -2349 -7672 -10953 -10225 -4149 618 -3630 -9865 -13027
16409 -13027 -12790 -13812 -15251 -11357 -7150 -10958 -11224 -11173 -6695 1505 5910 4617 -1040 -4814 1151
16394 1151 7763 3570 -8547 -12986 -9640 -5975 2144 8788 4594 887 286 4080 2662 -5304 -14435
16379 -14435 -14276 -12651 -8792 -6394 -8938 -12026 -9086 -6107 -3100 -6175 -8469 -3405 1423 -2870 -6427
16364 -6427 -10833 -14218 -11083 -11364 -14859 -13550 -12184 -15273 -17640 -15204 -18093 -14182 -10326 -14721 -12676
16349 -12676 -14803 -14737 -4272 2716 14 -1740 -2005 -6028 -10788 -6314 2165 -1635 -1243 -6439 -11294
16334a1294M783L967p903n057J3449O070K201M175M225n093j0022n349l069k381
16320a1298O603J086m722n660k535K413L610Q909j381n025o606J060O943L107
16306c496m191K839M734J504n00k91J717j975l356Q138O008P817o45j486j655
16291A5162q249l378k342j847n342m060M661k079l369l275n564m619K006N833
16277a6462L580K647k706N23n56n764r914Q293P293M584j903j960j645m884J068
16262a7806M337J107J762j154k309P6L241l179j190M029K584J497P218j561J632
16247B84J599m919N320P831K491O171L135n492p53L602N636j313J730k633m442
16232A8247L831p213P75m804o75k168J482K524j726j0935j698O727M993R659K488
$$ plain form
16334 -11294 -6511 -2544 -10447 -15504 -2055 4015 6216 10391 14616 9523 -499 -5848 -8917 -11298
16320 -11298 -4695 -3609 -8331 -13991 -16526 -14113 -10503 -1594 -2975 -8000 -14606 -13546 -6603 -3496
16306 -3496 -7687 -4848 -114 1390 890 599 2316 341 -3015 5123 11131 18948 18303 16817 15162
16291 15162 6913 3535 1193 -654 -5996 -10056 -5395 -7474 -10843 -14118 -19682 -24301 -22295 -16462
16277 -16462 -12882 -10235 -12941 -12418 -12974 -18738 -28652 -20359 -13066 -8482 -10385 -12345 -13990 -18874 -17806
16262 -17806 -13469 -12362 -10600 -11754 -14063 -13987 -10746 -13925 -15115 -11086 -8502 -7005 213 -1348 284
16247 284 1883 -3036 2284 10115 12606 18777 21912 16420 15667 19269 24905 23592 25322 22689 18247
16232 18247 22078 14865 15640 10836 10161 7993 9475 11999 10273 -662 -2360 4367 9360 19019 21507
16217B1507P24k487J390k241P81N400L514K085J4213K5375J9621L7908P0806Q1707
16203B80303R5955J25456J37951J43581J39184R9027M8537K1304m4411r4761j26960
16192H25166j54838j37073j22820j03395p2998n3778l2904k4789j6769j0217q079
16181H7506m406p815o859j663l053j1652m376l985k458o846j818K73o343Ql85
16166B6128l050L919o222m697k216m864m646L45L829K606k194n07J501K670N418
16151A8020J990l942L507K907P226J243m625P22Q34N220M147n523l320k37r07
16136B7262n095q608j3529k567J81j448k821k262m930l096L519Q348K06n83l970
16121i393M389K359J5092P050n161j70L909K438N199M766J393n067j88l187n520
$$ plain form
16217 21507 22231 19744 21134 18893 19674 25074 28588 30673 44886 70261 89882 127790 198596 280303
16203 280303 376258 501714 639665 783246 922430 1021457 1069994 1091298 1046887 952126 825166
16192 825166 670328 533255 410435 307040 234042 180264 147360 122571 105802 95585 87506
16181 87506 83100 75285 68426 66763 63710 52058 47682 43697 41239 34393 32575 32848 26505 26513 26128
16166 26128 23078 26997 20775 16078 13862 8998 4352 4697 8526 11132 8938 8431 9932 12602 18020
16151 18020 20010 16068 19575 22482 29708 30951 26326 27048 27882 33102 37249 31726 28406 28169 27262
16136 27262 22167 13559 30 -2537 -2356 -3804 -6625 -8887 -13817 -16913 -13394 -5046 -4840 -5423 -9393
16121 -9393 -5004 -2645 12447 19497 14336 14166 18075 20513 25712 30478 31871 26804 26616 23429 17909
16106A7909k800r01n85l69p206o480k715j47O84M369P245n288l411J885L102R18
16090F210K226M658q18j274J6281J1878N808J2169R526J3412M296K245M306L446
16076I4369R87k872o494j8896j6952k152n359j1050j3780k559O37n919K349K528
16062A4837N764N144O17j441L887j468l804l263M631R725O900Q180P253m143Q139
16047F0958l637K354K621n297n004J212k663R250J1402K664J703L787M310l301
16033H0359L819Q633P666Q932P847J1412J1119O091J6773J6056P889J6105K5809
16020B28510L0359L4450L4297M4526O5433P4355R2755R2907R8228J12325J07140
16009A015285J00559R6677R7286J02128J23111J48136J79835K04654K39078L04064
$$ plain form
16106 17909 15109 14208 13623 13254 6048 -432 -3147 -3294 -2610 1759 9004 3716 305 2190 5292 6210
16090 6210 8436 13094 12276 11002 27283 39161 44969 57138 66664 80076 84372 86617 90923 94369
16076 94369 95356 92484 85990 67094 50142 47990 42631 31581 17801 15242 15879 9960 12309 14837
16062 14837 20601 25745 26362 24921 28808 27340 23536 20273 24904 34629 41529 49709 56962 52819 60958
16047 60958 57321 59675 62296 56999 51995 53207 50544 59794 71196 73860 75563 79350 83660 80359
16033 80359 84178 92811 100477 109409 117256 128668 139787 145878 162651 178707 186596 202701 228510
16020 228510 258869 293319 327616 372142 437575 511930 604685 697592 795820 908145 1015285
16009 1015285 1115844 1212521 1309807 1411935 1535046 1683182 1863017 2067671 2306749 2610813
15999B610813L67330M61547O20545Q68316J246323J831726K709377L837221N155481
15990A9708679O766978Q305308Q806325Q927284Q913467O435226L122975R78783
15982G1965025k353014n875220p539205q516300q758472q057468o875946n451246
15974A8538154m108566l025526k159449j519381j106608q23901o35048n13101
15966D646574m34186l70961l27688k86528k45242k17858j92561j57361j30216
15957B283973j22089j19148j14620j22945j28669j26178j24675j12196j00315
15948A213138r6782q3572p6302o2603n0365m7743m5745m9026m0574l6871l5432
15937E88123l1984k2544j8969k4063k0508l1501j7081j6098k2442j9528r659j5775
$$ plain form
15999 2610813 2978143 3439690 4060235 4928551 6174874 8006600 10715977 14553198 19708679
15990 19708679 26475657 34780965 43587290 52514574 61428041 67863267 70986242 71965025
15982 71965025 69612011 63736791 56197586 47681286 38922814 30865346 23989400 18538154
15974 18538154 14429588 11404062 9244613 7725232 6618624 5794723 5159675 4646574
15966 4646574 4212388 3841427 3513739 3227211 2981969 2764111 2571550 2414189 2283973
15957 2283973 2161884 2042736 1928116 1805171 1676502 1550324 1425649 1313453 1213138
15948 1213138 1116356 1032784 956482 893879 843514 795771 750026 701000 660426 623555 588123
15937 588123 556139 533595 514626 490563 470055 438554 421473 405375 382933 363405 353746 337971
15925C37971j7794j5022j0497j0081r790m532k030j1796q544o76l627m603l582
15912B35397p509m494L290m624n873j1501l194N436j507j3338j1738l578J9K884
15898A79670J540j813m716m515l548J787N278l969p184p156r01q101m87J783o293
15883A41375q976k71O527m159n376m659j113L243k049M84l599o47j069L24k446
15868A17589n304p52N935O885o093j704l72m593p300K628J3052n90n192J408m838
15853A10759j1165n682J163N62k447o639p728n426m091N787R586k048p169r88
15839G4474k390l977J55N135l812l478P18j2105j6097j777k719o471K254R01j639
15824B9172m575R7P861K157M66o79j408o32J891N008J666p79m112J084M189K079
$$ plain form
15925 337971 320177 305155 294658 284577 274787 270255 268225 256429 247885 247209 243582 238979 235397
15912 235397 227888 223394 226684 222060 216187 204686 201492 206928 205421 192083 180345 176767 176786 179670
15898 179670 181210 179397 174681 170166 166618 168405 173683 169714 162530 155374 154473 146372 145885 147668 141375
15883 141375 132399 132128 138655 134496 129120 124461 123348 126591 124542 125026 121427 120780 119711 120035 117589
15868 117589 112285 111533 117468 124353 118260 116556 116184 111591 104291 106919 119971 119381 114189 115597 110759
15853 110759 99594 93912 95075 95637 93190 86551 78823 73397 69306 75093 84679 82631 75462 74474
15839 74474 72084 68107 68262 73397 69585 66107 66825 54720 38623 36846 34127 27656 29910 30811 29172
15824 29172 24597 24694 32555 34712 35178 34499 33091 32459 34350 39358 41024 40245 36133 37217 41406 43485
15808D3485k2N7L66M845L909J815L767j1135p951m193j732L523m837j2662q655
15793A0580l597J096J736P293L473L358N720M229J608m49L314Q639O813q12J007
15778E4008N84N57k367j43j281J132o570l233P818n027k805k194K75L694J935
15763D6383L68q44L128K289m44J33p96n51J340l43k127r59k786j258k016K665
15747D4182j501m213M296n615o62j565K762O207p109K168o17K945Q56r84M142
15732D5292K18Q90N004K836k152m971n438O184M03k553n03l823k82r1j570J020
15716D0464L333l6k548L071l024o892j951L967j443m658k367m374M698L553k432
15701B9361o760P886P652n921j475Q152K028L25j061m944l202l253L056Q738K165
$$ plain form
15808 43485 43463 43520 43886 48731 52640 54455 58222 47087 39136 34943 33211 36734 31897 19235 10580
15793 10580 6983 8079 9815 17108 20581 23939 29659 33888 35496 35047 38361 47000 53813 53001 54008
15778 54008 54592 55149 52782 52639 51358 52490 45920 42687 50505 45478 42673 40479 40754 44448 46383
15763 46383 46751 45907 49035 51324 50880 51013 50217 49666 51006 50663 48536 47577 44791 43533 41517 44182
15747 44182 42681 38468 42764 37149 36487 34922 37684 43891 36782 38950 38333 41278 42134 41150 45292
15732 45292 45510 46400 51404 54240 52088 47117 41679 47863 48266 45713 45210 41387 41105 41014 39444 40464
15716 40464 43797 43761 41213 44284 41260 34368 32417 36384 34941 30283 27916 23542 28240 31793 29361
15701 29361 22601 30487 38139 32218 30743 38895 40923 41248 40187 35243 32041 28788 31844 40582 42747
15686D2747N790j526o174p195n978l93L66l127m182j0601p137n055L577L360l866
15671F06k382O925L053l764L351k501J319R869J0627K278m602k656q89K00J26
15656B1560j258L802p41l365k212K504P359L116k434q888K507K336K939K521K657
15641C2403m062k73j076L74K25L042K534o306j678j361k001n65Q37M38p41n980
15625A5810m518Q497N371Q526o029k389n28p635j703L327J697j27N934N743q897
15610B3079j555P6Q83j937j869Q775L270m781r40j604o280m320K168P559l455
15595A9069l830O749k115k015p65j091p56l358O52k188L40N799j042r25n324N001
15579A4201j478l101O243M539J990K328J823K401k324m107l743q16L107L97L804
$$ plain form
15686 42747 48537 47011 40837 33642 27664 27271 27637 24510 20328 9727 2590 -2465 1112 4472 606
15671 606 -1776 5149 8202 4438 7789 5288 6607 16476 27103 29381 24779 22123 21234 21434 21560
15656 21560 20302 24104 23363 19998 17786 20290 27649 30765 28331 19443 21950 24286 27225 29746 32403
15641 32403 28341 28068 26992 27366 27591 30633 33167 26861 25183 23822 21821 21256 22093 22531 21790 15810
15625 15810 11292 19789 25160 33686 27657 25268 24740 17105 15402 18729 20426 20299 26233 31976 23079
15610 23079 21524 21600 22483 20546 18677 27452 30722 25941 25001 23397 17117 12797 14965 22524 19069
15595 19069 15239 21988 19873 17858 17093 16002 15246 11888 12540 10352 10692 16491 15449 14524 9200 14201
15579 14201 12723 9622 15865 20404 22394 24722 26545 28946 26622 22515 18772 17956 21063 21460 25264
15564B5264J032j26L486j433o314j057J519N77J781P385k403j185q062r821l209
15549G434k498M145J731K0L65j747j899m627M723M761j593L443M387K769q85q608
15533A1921o814M834L467Q619Q467L93j727m713J975L515n922j936M822p06o148
15518B0047J901K897J129K775l019J595J277o587p006J10O388j488j742K871k843
15503A8305j726j134l156J68Q025J613k031l795n26o28k437l631j274M03O510
15488A4686R45l568N173n736n97M54P79m336n28J134J297n52N66O568Q63Q20M84
15471A8452P12j391o3K58l470m558K196J005N167P056m359m508m599j569M957
15456A5286K425J377j106j858P053J751p195N113Q087j133L188M98N298J0998
$$ plain form
15564 25264 26296 26170 29656 28223 21909 20852 22371 22948 24729 32114 29711 28526 20464 10643 7434
15549 7434 4936 9081 10812 10832 11197 9450 7551 2924 7647 12408 10815 14258 18645 21414 20529 11921
15533 11921 5107 9941 13408 22027 30494 30887 29160 24447 26422 29937 24015 22079 26901 26195 20047
15518 20047 21948 24845 25974 28749 25730 27325 28602 22015 15009 15119 21507 20019 18277 21148 18305
15503 18305 16579 15445 12289 12457 20482 22095 20064 16269 15743 15115 12678 9047 7773 8176 14686
15488 14686 15631 12063 17236 11500 10903 11357 12136 7800 7272 8406 9703 9151 9717 16285 17148 17968 18452
15471 18452 19164 17773 17710 17968 14498 9940 12136 13141 18308 25364 21005 16497 11898 10329 15286
15456 15286 17711 19088 17982 16124 23177 24928 17733 22846 30933 29800 32988 33486 38784 49782
15442D9782M578O649J8714K3896L7868M5984N2484N2008M9492L0550J6913L579
15430C92497j2448k2892l7963l9758m6429m5767l8401l0792k1230j0155j2127
15419G4535j0463j1087j5477k346Q294J663O15p407j916N020j431q364j045P22
15405C1313p557l956M404N738J673p670k396N414L335l885o937r779L324O684
15391A9705O9k044q616n347M434J195K041P101O178O77j4578l646R29K980K785
15376A3863k474L171j283l485M514K429K143O87k838M86Q923k139R59P2l367k116
15360A9545n213k933R01n06m284K027j903J391k017n787K032O567l45M484Q116
15345B2075j916m186J997l043r927m877L038J791J722J447j269o596Q389K560
$$ plain form
15442 49782 54360 61009 79723 103619 141487 187471 239955 291963 341455 372005 388918 392497
15430 392497 380049 357157 319194 279436 233007 187240 148839 118047 96817 86662 74535
15419 74535 64072 52985 37508 35162 43456 45119 45734 38327 36411 41431 40000 31636 30591 31313
15405 31313 23756 19800 24204 29942 31615 23945 21549 26963 30298 26413 19476 9697 13021 19705
15391 19705 19774 17730 9114 3767 8201 9396 11437 18538 24716 25393 10815 7169 8098 11078 13863
15376 13863 11389 14560 13277 9792 14306 16735 18878 19565 16727 17213 26136 23997 24956 25028 21661 19545
15360 19545 14332 11399 12300 11794 7510 9537 7634 9025 7008 1221 3253 9820 9475 13959 22075
15345 22075 20159 15973 17970 14927 5000 123 3161 4952 6674 8121 6852 256 8645 11205
15331A1205r07n51k53L006j385j191j933N298K077n793m26j934Q08P643N040L301
15315B4005j953J189K891m201j3577p451j016J2970Q352j003J523L268j0454p898
15301F645K619L451P668K324o817p355L091N178M45K390J294J481N149J300M075
15286C2938Q9p854j1165k299J096K242j600m961m378L965Q540p10k430j586j61
15271A1726J323P6q14k208L433l827q016J716N962P429P40K221k303q706k004
15256F748O585L191L309k901p563k245J933L199M075L763l522m424O2K078n80
15241A3708k169m677o81J227M372j685m40l425K300o30k464J084L486L703m155
15226I554j174L199M35j512L387p390k628K095j946M944l21k321K650L996L672
$$ plain form
15331 11205 10298 9747 9494 12500 11115 9924 7991 13289 15366 9573 9147 7213 8021 15664 20704 24005
15315 24005 22052 23241 26132 21931 8354 903 -113 12857 21209 20206 21729 24997 14543 6645
15301 6645 9264 12715 20383 22707 15890 8535 11626 16804 17249 19639 20933 22414 27563 28863 32938
15286 32938 33027 25173 14008 11709 12805 15047 13447 8486 4108 8073 16613 15903 13473 11887 11726
15271 11726 13049 13125 12311 10103 13536 9709 1693 3409 9371 16800 17540 19761 17458 8752 6748
15256 6748 13333 16524 19833 16932 9369 7124 9057 12256 16331 20094 16572 12148 12210 14288 13708
15241 13708 11539 6862 6181 7408 11780 10095 9655 6230 8530 7900 5436 6520 10006 13709 9554
15226 9554 8380 11579 12014 10502 13889 6499 3871 5966 4020 8964 8643 6322 8972 12968 16640
15211A6640k544N802J036m784k018J255k677l461Q3N345J906r18j293k122l369
15196H881l057k159l524N057M89K787j007M672O421J523q310J480N973j674l433
15181A4119j264l57r408M835N597K272o182n10M66m116o484J54Q185J883o468
15166B722L964R486m409o400K552N076R48l228k997L405M092K045p477q832o498
15151e551J490J2432O612K852K705P147k537n086k340j594r50n890k75k107k860
15136D048r10P036L819O08J724l693k644o221n129P470K320j002K375N397m11
15121A4787m067O920J02l427k504j362J56j48m60o955n028K957K037K411L038
15106H457P78J467m054K654N496p844J123R46K100R84k689k154J610J113K612
$$ plain form
15211 16640 14096 19898 20934 16150 14132 15387 12710 9249 9332 14677 16583 15665 14372 12250 8881
15196 8881 5824 3665 141 5198 5687 8474 7467 12139 18560 20083 11773 13253 19226 17552 14119
15181 14119 12855 12498 3090 7925 13522 15794 9612 9102 9568 5452 -1032 -878 7307 9190 2722
15166 2722 6686 16172 11763 5363 7915 12991 13939 10711 7714 11119 15211 17256 9779 947 -5551
15151 -5551 -4061 8371 14983 17835 20540 27687 25150 20064 17724 16130 15180 9290 9015 6908 4048
15136 4048 3138 10174 13993 14601 16325 12632 9988 3767 -1362 6108 8428 7426 9801 15198 14787
15121 14787 10720 17640 17742 14315 11811 10449 10605 10457 9997 3042 -1986 971 3008 5419 8457
15106 8457 9235 10702 6648 9302 14798 6954 8077 9023 11123 12107 9418 7264 8874 9987 12599
15091A2599p810K70k646k103L621P497l569k929k79L246l43k97R47J4Q19j397
15075G640K417O443n11j403j082r294j996L853l221M670N689P147L056k091K247
15060B3564r16j45n769M86k452J923l027l954o297K86P827n18L163Q223M950m918
15044B2426j4184n33J345j291K370L248N894j299K284P851R408L686j674m133
15030C5398j0234l982p900o646k596J2576J7995J1609L857j892j3474j5050j1676
15017G985l177m09K023K433M66K81M623k779q780k928J641O699j389o566N058
15002E181J1647q97n905j727L58K100j869J883M945P30j17J302n280q075R713
14987A3989K193n104k053M259J276K36R73l474m077k188K249L814Q263L656l590
$$ plain form
15091 12599 4789 5059 2413 310 3931 11428 7859 4930 4651 7897 7554 7257 8204 8218 9037 7640
15075 7640 10057 16500 15989 14586 13504 4210 2214 6067 2846 7516 13205 20352 23408 21317 23564
15060 23564 22648 22503 16734 17220 14768 16691 13664 9710 3413 3699 11526 11008 14171 22394 27344 22426
15044 22426 8242 7709 9054 7763 10133 13381 19275 17976 20260 28111 37519 41205 39531 35398
15030 35398 25164 21182 13282 6636 4040 16616 34611 46220 50077 48185 34711 19661 7985
15017 7985 4808 4399 6422 8855 9321 9602 14225 11446 2666 -262 1379 8078 6689 123 5181
15002 5181 16828 15931 10026 8299 8657 10757 8888 10771 15716 16446 16329 17631 12351 4276 13989
14987 13989 16182 11078 9025 13284 14560 14796 15769 12295 8218 6030 8279 12093 20356 24012 20422
14972B0422m546P2J888j215k871l881m626m180L502J932j244j99R833J027J618
14957A7532j53Q70J671m267j048n136m789K370l014n757J850N976O174Q3n26J684
14941A3520K562J639J473K97m545O178R70p862p43Q13o81p896L670l479j900J72
14925D188l094K699N318M807n62L965P283j659m970k376N52n162j586r79J969
14910A0393q4k755l027K064O336r29j388K368q828M312O786K44j902K575K427
14895A8592k091O261l961p635m279K989K472L749K763J084K372m71J235k743p98
14880A9539k262l592m169K135N777L354L824m829n204o311M318N241j44M381R19
14865B2977m648n519k744M053M17j756k066j67m32r76o798j968Q85O067P488M564
$$ plain form
14972 20422 15876 15948 17836 16621 13750 9869 5243 1063 4565 6497 5253 5054 14887 15914 17532
14957 17532 17379 18249 19920 15653 14605 9469 4680 7050 4036 -1721 129 6105 12279 12362 11836 13520
14941 13520 16082 17721 19194 19491 14946 21124 22094 14232 13489 14302 13621 5725 9395 5916 4016 4188
14925 4188 1094 3793 9111 13918 13356 17321 24604 22945 17975 15599 16151 10989 9403 8424 10393
14910 10393 10309 7554 4527 6591 12927 11998 10610 12978 4150 8462 15248 15492 13590 16165 18592
14895 18592 16501 22762 18801 11166 6887 9876 12348 16097 18860 19944 22316 21845 23080 20337 19539
14880 19539 17277 13685 9516 11651 17428 20782 24606 19777 14573 8262 12580 17821 17677 22058 22977
14865 22977 18329 12810 10066 14119 14536 12780 10714 10547 10115 9139 2341 373 1258 7325 14813 19377
14849A9377k522L37k224n780J112k654O422M819m328k449M488J853j661Q34P43
14834A8367N14M314l050j0091k178K090J848L035m53J091M496l176n760M431j342
14819A4136j457k100m497r067m652M395J4022J251m404l66J371M97J204j381j482
14804G470r145K737J0719K030J94o656o106O111J5132L47r840m786O170L986k218
14789A6145J549K398k298l081K129L089l553n755L644k924j736j389L93j285J527
14774H853P360N899p407o121q59j226J935R81N257N354m282J594L470M87j413
14759A9882o51K01M92j131J701k701k867m125m657K526j171K254M176l639j966
14744H324Q958P912j800j699o609r239k814j150P297O122l203j796L417p60k606
$$ plain form
14849 19377 16855 17192 14968 9188 10300 7646 14068 18887 14559 12110 16598 18451 16790 17624 18367
14834 18367 18881 23195 20145 10054 7876 9966 11814 14849 14396 15487 19983 16807 11047 15478 14136
14819 14136 12679 10579 6082 -2985 -7637 -3242 10780 12031 7627 7261 8632 9129 10333 8952 7470
14804 7470 -1675 1062 11781 13811 14005 7349 1243 7354 22486 22833 12993 8207 14377 18363 16145
14789 16145 17694 20092 17794 14713 16842 19931 16378 10623 14267 11343 9607 8218 8611 7326 8853
14774 8853 16213 22112 14705 8584 7725 6499 8434 9415 14672 20026 15744 17338 20808 21295 19882
14759 19882 19231 19432 19924 18793 20494 17793 14926 10801 6144 8670 7499 9753 13929 10290 8324
14744 8324 17282 25194 23394 21695 15086 5847 3033 1883 9180 15302 12099 10303 13720 12960 10354
14729A0354K138K026l187o517o9J925M3j163M369O128J274p436m559L814l505
14714E635l141K062N418M370K150J045q396R50L576K625l75n09k715K278P25l821
14698A1877k83J052K084q1k166J088J0183K738l928q79n861j077m257j261O527
14683A5756L386J737J035j364q058l117J0943Q04o784KL45k432k896o131N599
14668H825R593M721m075L333r02r847n91Q641L48j954q90m839n094M997r80j618
14652I668M828J60L681N423N413m465l790l552l42L603J626k885L022Q17K128
14637B5335n209m631n408l973Q60P284P825L204K389K161l019L54k343j1839l447
14622I543K488j936L769J268q44J377O72L498K476M30k773j217L418K932o965
$$ plain form
14729 10354 12492 14518 11331 4814 4745 6670 6713 5550 9919 16047 17321 9885 5326 9140 5635
14714 5635 2494 4556 9974 14344 16494 17539 9143 10093 13669 16294 15919 15410 12695 14973 15698 11877
14698 11877 11594 12646 14730 14649 12483 13571 23754 26492 22564 21685 15824 14747 10490 9229 15756
14683 15756 19142 20879 21914 20550 12492 9375 20318 21122 14338 14340 14685 12253 9357 3226 8825
14668 8825 18418 23139 19064 22397 21495 11648 11057 19698 20046 18092 17202 12363 7269 12266 11286 9668
14652 9668 14496 14656 18337 23760 29173 24708 20918 17366 17024 20627 22253 19368 22390 23207 25335
14637 25335 20126 15495 10087 6114 6974 14258 22083 25287 27676 29837 26818 27172 24829 12990 9543
14622 9543 12031 10095 13864 15132 14288 15665 16337 19835 22311 22741 19968 18751 22169 25101 18136
14607A8136K887Q49l914L424M624O215l813l556l993k006k335O321O611O062P204
14592D2716j709J187k999J766m063q99p4P667J0130J740J3098J5340J6493J3286
14578A13679J2235K4663K4620L4338L8767N5683R4661J40635K20532L57215N05199
14567A622227N61148M88430K80631K280k79362m80931n38034m65259l42180k24833
14557F24117j41877p8846o8886n5787l3769k7141k9477k3991k0394k5527j2336
14546A06086r264q413m511o723l809q563j411m842q440m194o293l950M21j616
14532C4478O019r340K091Q447n19j2301l725N52j249L626N230K435K386N183P069
14517E0382O618P326k22n661n165n292j0974o316j842n504m186M054O030K207
$$ plain form
14607 18136 21023 21872 17958 21382 26006 32221 28408 24852 20859 18853 16518 22839 29450 35512 42716
14592 42716 41007 42194 39195 40961 36898 35999 35925 43592 53722 55462 68560 83900 100393 113679
14578 113679 125914 150577 175197 209535 248302 303985 398646 539281 759813 1117028 1622227
14567 1622227 2183375 2671805 2952436 2954716 2675354 2194423 1656389 1191130 848950 624117
14557 624117 482240 403394 334508 278721 244952 217811 188334 164343 143949 118422 106086
14546 106086 96822 88409 83898 77175 73366 64803 63392 58550 50110 45916 39623 35673 36094 34478
14532 34478 40497 31157 33248 41695 41176 28875 25150 25702 24453 28079 33309 35744 38130 43313 50382
14517 50382 57000 64326 64104 58443 53278 47986 37012 30696 28854 23350 19164 23218 29248 31455
14503C1455R60o164p229n305M649K195n83N137L800m790l891J593O344n55l656
14488B3960l142K378N954J566l006k42n305m651l954O410L530l566n797l965Q46
14473A1016J029L006m113p846M922K995O204l55O48j241P213N49J891l051o673
14458A6194k214M41k47j876L281M533K908L15L956j914l756J549M32p299j486
14443A4817m04j262m2Q564O476N64m434m136J607K368N543n742m083P008L439
14428C0283k675o892o027O557J162l872l286l71O996K218J798j802j945m015m443
14413A3686N015l003K92K028P406L033r52q706K098L374k527m401M656K3K270
14398B4292r37m369j274L476N224O538R19j443q985p893J588l289o674K422M013
$$ plain form
14503 31455 32415 26251 19022 13717 18366 20561 19978 25115 28915 24125 20234 21827 28171 27616 23960
14488 23960 20818 23196 29150 30716 27710 27468 22163 17512 13558 19968 23498 19932 14135 10170 11016
14473 11016 12045 15051 10938 3092 8014 11009 17213 16858 17506 16265 23478 24027 25918 22867 16194
14458 16194 13980 14421 14174 12298 15579 20112 23020 23335 27291 25377 21621 23170 23602 16303 14817
14443 14817 14413 13151 13109 21673 28149 28713 24279 20143 21750 24118 29661 23919 19836 26844 30283
14428 30283 27608 20716 14689 21246 22408 18536 15250 14879 21875 24093 25891 24089 22144 18129 13686
14413 13686 18701 15698 15990 18018 25424 28457 27505 18799 20897 24271 21744 17343 21999 22022 24292
14398 24292 23355 18986 17712 21188 26412 32950 33869 32426 23441 15548 17136 13847 7173 9595 13608
14383A3608j123j991M710N561p034m943M724j524L5J0032l010J607K426O732O874
14368C6684l951k902M573j745m742K25K571J034m857m250k32K703k285K021N311
14353C0158r46l412M41j347p26j448l25j068M11K60m212P665L956l020o583L903
14337B3707M187k402N053O301N355o156p190L941N91n174l07O37K906l022R91
14322B9418J0468J0011l30k479o115p205L304M889K756j563J659K140O363m138
14308D9178P73M365K548O965J9135J6748J2201K8795K7611K9655M8470O9852P3094
14295C89390R4053J09909J02507P9237M2026j4928o2430r8078j08412r6792q7386
14284C49096o1926m7014l3682k9362j8076j4203j1998j1479j5380l836p611r936
$$ plain form
14383 13608 12485 10494 15204 20765 13731 8788 13512 11988 12023 22055 19045 20652 23078 29810 36684
14368 36684 32733 29831 34404 32659 27917 28142 30713 31747 26890 22640 22408 25111 22826 24847 30158
14353 30158 29212 25800 26241 24894 24168 22720 22395 21327 21738 21998 17786 25451 29407 26387 19804 23707
14337 23707 27894 25492 30545 36846 42201 36045 28855 32796 33387 28213 27906 28543 31449 28427 29418
14322 29418 39886 49897 49567 47088 40973 33768 37072 41961 44717 43154 44813 46953 53316 49178
14308 49178 49951 54316 56864 63829 82964 99712 111913 140708 168319 197974 246444 316296 389390
14295 389390 483443 593352 695859 775096 817122 802194 739764 641686 533274 436482 349096
14284 349096 287170 240156 206474 177112 159036 144833 132835 121356 105976 102140 94529 84593
14272H4593r936o852o292r34J551q08o782k927n41l731k293R81l067J9L1N295
14256D8307J361j994m610n944l134M126j847P558M205N73R35l89r208j472J038
14241C9505M431K867M083L407M397k559k151n661M647R50L977J15k555j543N562
14226E9472M998L781k345K90M203O731k749r035N265N082M621K355J732k824N018
14211H6595M74l984K285N226M556N404R372P751Q146P807J2834J2777M771K86
14197A64300J0759J4262J4746O311J0368J9325K0348N337R346J5499J7670J6835
14185C25106J4986J9865K2228K9018L3096J7159K1377K4307J9657K3012K2393
14174E72204J9825K3131J9645J9244K2106J3205J5234J3514J2325J2564L819R434
$$ plain form
14272 84593 74657 67805 61513 60579 62130 61322 54540 51613 51072 47341 45048 46029 42962 42981 43012 48307
14256 48307 49668 47674 43064 37120 33986 38112 36265 43823 48028 48601 49536 49147 39939 38467 39505
14241 39505 43936 46803 50886 54293 58690 56131 53980 48319 52966 53916 57893 58008 55453 53910 59472
14226 59472 64470 68251 65906 66196 70399 77130 74381 65346 70611 75693 80314 82669 84401 81577 86595
14211 86595 87069 83085 85370 90596 95152 100556 109928 117679 125825 133632 146466 159243 164014 164300
14197 164300 175059 189321 204067 210378 220746 240071 260419 265756 275102 290601 308271 325106
14185 325106 340092 359957 382185 411203 444299 461458 482835 507142 526799 549811 572204
14174 572204 592029 615160 634805 654049 676155 689360 704594 718108 730433 742997 746816 756250
14162G56250Q557K170P789J1508L393o706j1612q885j0393j0078j5788k2468l1779
14149F71958l2968l6726l2508l7202l9559l4725l1929l2798k0291j8794k0561
14138C33897k0155j3375j9046k6019j5899j4250j2032q217q008j3979m293n852
14126A72772j0412p454p968M0q90m31J580l690j537p954m728P48m539j465k975
14111A21097O960K8p089l180N15J718J0522J1412J3573L371j583K511J713m85
14097A61083J1800L037j3538q625k696k431l49n315r145k551k633o682j4715j6974
14083I0266j6335l455M254R19k677N594j369j060J650m85J487l59n557o422n795
14068F0656j19M158j948n243l731l198O640N101J413M367K351l470O787Q651l512
$$ plain form
14162 756250 764807 766977 774766 786274 789667 782961 771349 762464 752071 741993 726205 703737 671958
14149 671958 638990 602264 569756 532554 492995 458270 426341 393543 373252 354458 333897
14138 333897 313742 300367 281321 255302 239403 225153 213121 204904 196896 182917 178624 172772
14126 172772 162360 154906 146938 146978 146088 145657 147237 143547 142010 134056 129328 130076 125537 124072 121097
14111 121097 128057 128085 120996 117816 118331 120049 130571 141983 155556 158927 157344 159855 161568 161083
14097 161083 172883 175920 162382 153757 151061 148630 148281 142966 133821 131270 128637 121955 107240 90266
14083 90266 73931 70476 74730 75649 72972 78566 77197 76137 77787 77302 78789 78430 72873 66451 60656
14068 60656 60537 64695 62747 57504 53773 50575 57215 62316 63729 68096 70447 66977 73764 82415 78903
14053G8903j480k185q841o883m544P106M955M469R44K053J142M84O490Q902J0129
14038A01644J1451J7665L160l493K451K198L49m600j522q99J580j465l244j767
14024A23508p933p878M461J757o552n447j957m322r04K735L030L917j519M642
14010A07538L621O445P319R014P865P785J1059O299r084p450Q366R292P139L278
13996A78486M21k091r333j1403q762j4417j4401j0403q34k777k145K727O154J1247
13982A22469J2348J3451M041n275L264M151Q723J2958R285P160o497M159N645
13969A95882O987J976m89J438l584K773p535j6873q823K611P822j638m624n66
13955A75357l85k621n356K098l132j0577K487R533P808P093M837K234q55n29J871
$$ plain form
14053 78903 77423 75238 66397 59514 54970 62076 67031 71500 72444 74497 75639 76123 82613 91515 101644
14038 101644 113095 130760 133920 130427 132878 135076 135425 130825 129303 128404 129984 128519 125275 123508
14024 123508 115575 107697 112158 113915 107363 101916 99959 95637 94733 97468 100498 104415 102896 107538
14010 107538 111159 117604 124923 133937 141802 149587 160646 166945 157861 150411 158777 168069 175208 178486
13996 178486 178907 176816 167483 156080 147318 132901 118500 108097 107263 104486 102341 105068 111222 122469
13982 122469 134817 148268 152309 147034 150298 154449 163172 176130 185415 192575 186078 190237 195882
13969 195882 202869 204845 204356 205794 202210 204983 197448 180575 171752 174363 182185 180547 175923 175357
13955 175357 174972 172351 166995 169093 165961 155384 157871 167404 175212 182305 187142 189376 188521 187992 189863
13940A89863P328K867l850k170J69J485Q154M37j762O642P171Q010K888O855k993
13925B31094J867O484N884Q894J6783R200O217R454J0380P698O116J1357J3028
13912C44456J5900J6234J3528J3985J0976J7194K3166J6234J7616J2674J6421
13901E18384J3560J2597Q305J4503K3445K3020J9195K1727K2619J7671K5809L1901
13889G52736K9302K6775L4903M3695M2615M6023M9337M7894M8539N8810O8873
13878A249502O8596Q0141R3134J04428J18683J27429J40885J44350J56639J71357
13868B455144J81516K00542K32922K75489L12527L69134M15121M80094N68801
13859E491290O69019P92861R61579J170522J425665J722094K084477K542881L160191
$$ plain form
13940 189863 197191 200058 196208 194038 194207 195692 203846 204283 202521 209163 216334 224344 227232 234087 231094
13925 231094 232961 239445 245329 254223 271006 280206 286423 295877 306257 313955 320071 331428 344456
13912 344456 360356 376590 390118 404103 415079 432273 455439 471673 489289 501963 518384
13901 518384 531944 544541 552846 567349 590794 613814 633009 654736 677355 695026 720835 752736
13889 752736 782038 808813 843716 887411 930026 976049 1025386 1073280 1121819 1180629 1249502
13878 1249502 1318098 1398239 1491373 1595801 1714484 1841913 1982798 2127148 2283787 2455144
13868 2455144 2636660 2837202 3070124 3345613 3658140 4027274 4442395 4922489 5491290
13859 5491290 6160309 6953170 7914749 9085271 10510936 12233030 14317507 16860388 20020579
13850B0020579M067101N429642P472655J0432810J4391810J8921811K2446239
13843A03182647K2273088J7023088Q576926j051216j0885160j8569892k1877353
13836I8672128k0793148j7074951j2864877r380622o844280n104122l921226l122588
13828A9566314k573556k177655j878203j612019j364533j157332r66952q11956
13820G024108o80349n86344n15606m41669l90573l47350l16574k88166k51278
13811C206199k15120j93426j69064j51722j33820j21568j10435j06847j03633
13802A900564r8723q5218p3558p4700o8127o5011o3005n1637m7293l3832j7313
13791A222147p88N546J247j7328k8496m4421o4031p1405p0521o3552n6072n5665
$$ plain form
13850 20020579 24087680 29517322 36989977 47422787 61814597 80736408 103182647
13843 103182647 125455735 142478823 151055749 150004533 139119373 120549481 98672128
13836 98672128 77878980 60804029 47939152 38558530 31714250 26610128 22688902 19566314
13828 19566314 16992758 14815103 12936900 11324881 9960348 8803016 7836064 7024108
13820 7024108 6343759 5757415 5241809 4800140 4409567 4062217 3745643 3457477 3206199
13811 3206199 2991079 2797653 2628589 2476867 2343047 2221479 2111044 2004197 1900564
13802 1900564 1801841 1716623 1643065 1568365 1500238 1435227 1372222 1320585 1273292 1239460 1222147
13791 1222147 1221359 1226905 1228152 1210824 1182328 1137907 1073876 1002471 931950 868398 812326 756661
13779G56661m2677l8683l1973k2255j6302j7540j0561j2122j3131j1876j6607
13768E22934j4986q915o089j4725j1008j3981j3319j1017j2870l547m592r279
13756C98606o745l562p322r926l034p918j2151o459o114J950p714j2756p940p120
13742C01795j5155p410r88p80J153m154l604k532k667l352q420m247p619k315
13728B39705K885l959m825K601R410K303m438n940j107j835j275M937k801j850
13714B33811O079m422r910q092j1675j1938o020l948m168m247o658N69j693o724
13700A60964M02K970n40n283o0o454l737j769n048j2560j5793q192j1814j3675
13686G9411p274j2145l423L73p62k254l485M576L51j366k576K371P802R394R077
$$ plain form
13779 756661 713984 675301 643328 621073 604771 587231 576670 564548 551417 539541 522934
13768 522934 507948 499033 492944 478219 467211 453230 439911 428894 416024 412477 407885 398606
13756 398606 391861 388299 380977 371051 368017 360099 347948 341489 335375 337325 329611 316855 308915 301795
13742 301795 286640 279230 278242 277462 278615 274461 270857 268325 265658 262306 253886 249639 242020 239705
13728 239705 242590 238631 233806 236407 245817 248120 243682 237742 236635 234800 233525 238462 235661 233811
13714 233811 239890 235468 225558 217466 205791 193853 187833 183885 179717 175470 168812 169381 167688 160964
13700 160964 161366 164336 163796 158513 158453 151999 148262 146493 141445 128885 113092 104900 93086 79411
13686 79411 72137 59992 56569 56942 56180 53926 50441 55017 55368 54002 51426 53797 61599 70993 80070
13671H0070L418K796K973N039K094K637O22n394l695k225m946K959m150m456n229
13656G2513j0904r915p43M51o657r594k040p000J989O510L40L491P204P111L888
13641E6644M651P550O640Q119N219M219O289M832j476J142k75k835l078l800K518
13626I6359O118O331k788n961l448l332j402O423n44L802j565n336p247n326Q394
13611I0478K088l546l517k234m357q370N118L693R89O492o407l694K174O225L40
13596H5472P60N579M837l936q030J978L84K152p69m814r77K808l565p819j748
13581G2312L709L5L127L27J716K886J094n706o122n860k983K493N019n26q594
13566F2927j1571K909P819M242O991j258l970O2K48M371K567m689l804K767l010
$$ plain form
13671 80070 83488 86284 89257 94296 96390 99027 99649 94255 90560 88335 83389 86348 82198 77742 72513
13656 72513 61609 51694 50951 51402 44745 35151 33111 26111 28100 34610 34950 38441 45645 52756 56644
13641 56644 61295 68845 75485 83604 88823 93042 99331 104163 102687 103829 103554 100719 97641 93841 96359
13626 96359 102477 108808 106020 100059 96611 93279 91877 98300 97756 101558 99993 94657 87410 82084 90478
13611 90478 92566 89020 85503 83269 78912 70542 75660 79353 80342 86834 80427 76733 78907 85132 85472
13596 85472 86232 91811 96648 92712 84682 86660 87044 89196 88427 83613 82636 85444 81879 74060 72312
13581 72312 76021 76056 79183 79510 81226 84112 85206 79500 73378 67518 64535 67028 72047 71521 62927
13566 62927 51356 54265 62084 66326 73317 72059 68089 68151 68399 72770 75337 70648 66844 69611 66601
13551F6601n53l208O513R75N304O898o98l819j039q90j0361j5838j946l415r670
13536C4854p955j4089j1667q194k445J059N774J0115Q83K751Q967J2120l538j41
13522B8494N008P359q38P31L230q122j19J1504Q064k0o614l549K62N34L99J006
13506D7329Q601l760J578K896J302J577o939k910q28K562K71p801N04L343k233
13491D5492l157j115J095J213o109K52j180N288K990K248N299K180o981m187m12
13476D2916k79J291J683J526K853k101m452P613k436n412l702m79O44M560k17
13461D4008n596l072j743J94j402L684L334L883L781M895l491q371J069K618L937
13446D7728J183j48p5j912k176n963J284L378R049j615m178j814o036j944P242
$$ plain form
13551 66601 66048 62840 69353 70328 75632 82530 81832 78013 76974 76084 65723 49885 47939 44524 34854
13536 34854 26899 12810 1143 -7051 -9496 -8437 -2663 7452 8335 11086 20053 32173 28635 28494
13522 28494 33502 40861 40023 40754 43984 35862 35743 47247 55311 55291 48677 45128 45390 45924 46323 47329
13506 47329 55930 52170 53748 56644 57946 59523 52584 49674 48846 51408 51679 43878 44382 47725 45492
13491 45492 42335 41220 42315 43528 37419 37671 36491 41779 44769 47017 52316 54496 47515 43328 42916
13476 42916 42637 43928 45611 47137 49990 47889 43437 51050 48614 43202 39500 39021 39665 44225 44008
13461 44008 38412 35340 33597 33791 32389 36073 39407 43290 47071 51966 48475 40104 41173 43791 47728
13446 47728 48911 48763 48688 46776 44600 38637 39921 43299 52348 50733 46555 44741 38705 36761 44003
13431D4003P58M465L289J53L386l380n002O509Q477l943K865m25K745r545J714
13416E6069o84l793K154j952N08l745Q038N373J56L384O809k016j862l76l437
13401F4626Q481J0830R078R394Q761J2710J8765K2215K2449K7552M5363N3371
13389C13595O2841Q6906J12226J12400R2308N4759J0347l7454p8278j06124j04967
13378E18559r3959p3046n3765m0567l7845k6207k3713j5990j2109j4986r663p577
13366A09132m16n360j1538l667L90m304r911n099J371J057n092j590k23k964m414
13351E7372r92k024l062J142N535j399M119K637m889P98P8l464n300m582n030
13336D0939k422L372P243n000N060Q835l846p623J47q86K231j073J936P95j268
$$ plain form
13431 44003 44761 49226 52515 52668 56054 52674 47672 54181 62658 58715 61580 61155 63900 54355 56069
13416 56069 55385 51592 53746 51794 52302 48557 56595 61968 62124 65508 72317 70301 68439 68063 64626
13401 64626 73107 83937 93015 102409 111170 123880 142645 164860 187309 214861 260224 313595
13389 313595 376436 463342 575568 687968 780276 835035 845382 807928 729650 623526 518559
13378 518559 424600 351554 297789 257222 219377 193170 169457 153467 141358 126372 116709 109132
13366 109132 108716 103356 91818 88151 88541 84237 74326 69227 70598 71655 66563 64973 64750 61786 57372
13351 57372 56380 54356 51294 52436 57971 56572 60691 63328 58439 59237 59315 55851 50551 45969 40939
13336 40939 38517 41889 49132 44132 49192 58027 54181 46558 46705 45819 48050 46977 48913 49708 48440
13321D8440n291l505M618k76j511J324M021M174L963m147k006n932k971M539N582
13306E1022j338J644l70n263N94j291l666K491j080j097M498j501O11K868N93
13291D8715O66J964q40M699j753k428n130l515m427M796j607l151J611O146N859
13276E1605M092J687r580n000L36p568m402N25R269N452j807P93j984j641J448
13261D3225p82j305J328N93K006n309k658j198L033K425L107k735r72l829L084
13246D0013J198q66j370M467l153J19O587l686k247L102R553L325m726p099l021
13231D2196J0394K311j952K876j448n724q654L4Q749K119J60m306n824L25J291
13216D2547j597l454k712R493K618N838j607K257l512k855M51N888q201n530O259
$$ plain form
13321 48440 43149 39644 44262 43986 42475 43799 47820 51994 55957 51810 49804 43872 40901 45440 51022
13306 51022 49684 51328 50958 45695 46289 44998 41332 43823 42743 41646 46144 44643 45254 48122 48715
13291 48715 49381 51345 50505 55204 53451 51023 45893 42378 37951 42747 41140 37989 39600 45746 51605
13276 51605 55697 57384 47804 42804 43140 35572 31170 31695 40964 46416 44609 45402 43418 41777 43225
13261 43225 42443 41138 42466 43059 45065 39756 37098 35900 38933 41358 44465 41730 40758 36929 40013
13246 40013 41211 40345 38975 43442 40289 40408 46995 43309 41062 44164 53717 57042 52316 45217 42196
13231 42196 52590 54901 52949 55825 54377 48653 39999 40033 48782 50901 51061 46755 40931 41256 42547
13216 42547 40950 37496 34784 44277 46895 52733 51126 53383 49871 47016 47467 53355 45154 39624 45883
13201D5883R433O452m661j002P655n405j550K657l461R02J843k890M70J828K214
13186F0368K957j408k338l325j629O163j157m366l685o721m997j949m999L559
13172C6473J0427M242K545K550l211o729n165n858k57P902Q481m371q021j630
13158C7378O708Q93J912N484k222j346o53k192N505N627l189O730M471m852J112
13143F1366N254n58n675p339k755M418M490j0j708q01O858m963o346K228m630
13128D9829k319K625r34O982N922O68M318j607r555o706O30K816L033K826N106
13113F3634J281k744m154N80o383l193j42R14l057R368M561k530l483J067M440
13098F0159L761k11l063O896m8m094j196k913n232N65Q671k77k64J599l894m53
$$ plain form
13201 45883 55316 61768 57107 56105 63760 58355 56805 59462 56001 56903 58746 55856 56326 58154 60368
13186 60368 63325 61917 59579 56254 54625 60788 59631 55265 51580 44859 39862 37913 32914 36473
13172 36473 46900 51142 53687 56237 53026 46297 41132 35274 35017 42919 51400 47029 39008 37378
13158 37378 44086 44979 46891 52375 50153 48807 48154 45962 51467 57094 53905 60635 65106 60254 61366
13143 61366 66620 66062 60387 53048 50293 54711 59201 59191 57483 56682 63540 58577 52231 54459 49829
13128 49829 47510 50135 49201 56183 62105 62773 67091 65484 55929 49223 49853 52669 55702 58528 63634
13113 63634 64915 62171 58017 58597 52214 49021 48879 49793 46736 56104 60665 58135 54652 55719 60159
13098 60159 63920 63709 60646 67542 67494 63400 62204 59291 54059 54624 63295 63018 62754 64353 60459 60006
13082F0006K410J35J056O090K040M718Q412K734k617L451L843K463J3748N963
13068A14452K2645L1111M0299O6631R6263J45678K09610K40295J69579J6973j42294
13057A011242k13945k00880j44662j00033o6196m8066m6698k8604k1441k0639
13047A20078m570k112o770k951j597k487j662m945j014M50o875r42j873L696J425
13032H7851m715o448m261r14n621m991J784M658K677N174l231l576N391M37K977
13017G7192m07k027K223M60n804k453O59L294K610j877p088p096k409l986o459
13002D6832q456M86R319J2172J8536J2249R959p90M226L532M871M81J396J3539
12988A28352J2956K0371K1670K9300M0415N6568Q5828J35281J97597K82552L38443
$$ plain form
13082 60006 62416 62551 63607 69697 71737 76455 84867 87601 84984 88435 92278 94741 108489 114452
13068 114452 137097 168208 208507 275138 371401 517079 726689 966984 1136563 1153536 1011242
13057 1011242 797297 596417 451755 351722 285526 237460 190762 162158 140717 120078
13047 120078 115508 113396 106626 103675 102078 99591 97929 92984 91970 92420 85545 84603 82730 86426 87851
13032 87851 83136 76688 72427 71513 65892 60901 62685 67343 70020 75194 71963 68387 73778 74215 77192
13017 77192 76785 74758 76981 77441 71637 69184 69843 73137 75747 73870 66782 59686 57277 53291 46832
13002 46832 38376 38862 48181 60353 78889 91138 101097 100307 104533 108065 112936 113417 114813 128352
12988 128352 141308 161679 183349 212649 253064 309632 395460 530741 728338 1010890 1349333
12977A349333K80749J24527p3898k49249l13728k83513k20868j47857r1153o6550
12967C07793m4244l3469l8848k1861j2343q697k545j5119o753l609q726l077r47
12954A07555o951J85K546M197l888n858l918n269K657K551o384l862k180j734
12940G9647J49O311K021q455R38L133J238J545M231N199J970O019l840j574r718
12925H8814m713J279N668L482J969k101k541N205j110j332K495R1o461j013j648
12910H8084o667k373j179M16k398Q112J0066k8j938l27k096n980o130M739M731
12895H7032N086L481m557r429m211J460K239L554N842N293K349q034m765j795
12881H3545j054K008K196L437k86j356J783N205M47N124P56k11j628M766Q595
$$ plain form
12977 1349333 1630082 1754609 1680711 1431462 1117734 834221 613353 465496 374343 307793
12967 307793 263549 230080 191232 169371 157028 148331 145786 130667 123914 120305 111579 108502 107555
12954 107555 100604 100789 103335 107532 103644 97786 93868 88599 91256 93807 87423 83561 81381 79647
12940 79647 79796 86107 88128 79673 80611 83744 84982 86527 90758 95957 97927 103946 100106 98532 88814
12925 88814 84101 85380 91048 94530 96499 94398 91857 97062 95952 94620 97115 97206 90745 89732 88084
12910 88084 81417 79044 77865 78281 75883 83995 94061 94033 92095 91768 89672 83692 77562 82301 87032
12895 87032 92118 95599 91042 81613 77402 78862 81101 84655 90497 95790 98139 90105 85340 83545
12881 83545 82491 84499 86695 90132 89846 88490 90273 95478 95925 101049 101805 101594 99966 104732 113327
12866A13327n413m950l445o194j503K963M321J840O314J1626P744J344K76K292
12852A30542Q525J3171J9072K0723J6518J5597j62m641k1929k4087k5705k5597
12840A22027j7480o029m57n246j0261j909P856R65M25K65j2295K886m794N815
12826H1768O468O869l895q960n988J0416R472N672k318n961q954n60K854L125
12812I0008J598k951n261K327R542J3994Q430P487L016R715J2794J1286J1693
12799A73678K4950J8765J8949J4195k85r120j2134r297p303j1942n091m517q195
12786A82653o565o060p741r765n860r771q374o009n206q957l638N402N289K675
12772A18073O285K690m369l148l531k767m110o416r223j978M515N020P920j564
$$ plain form
12866 113327 107914 102964 99519 93325 91822 94785 99106 100946 107260 118886 126630 127974 128250 130542
12852 130542 139067 152238 171310 192033 208551 224148 223986 219345 197416 173329 147624 122027
12840 122027 104547 98518 98061 92815 82554 80645 88501 89466 89891 90156 77861 80747 75953 81768
12826 81768 88236 95105 91210 82250 76262 86678 96150 101822 99504 93543 84589 84029 86883 90008
12812 90008 91606 88655 83394 85721 95263 109257 117687 125174 128190 137905 150699 161985 173678
12799 173678 198628 217393 236342 250537 250252 241132 228998 219701 212398 200456 195365 190848 182653
12786 182653 176088 170028 162287 152522 146662 136891 128517 122508 117302 108345 104707 110109 115398 118073
12772 118073 124358 127048 122679 119531 116000 113233 109123 102707 93484 91506 96021 101041 108961 107397
12758A07397m872o636M545O29J592Q471L712L749K680q98K114O503r90k94J99
12743A27901N367O648N29L01P720J8797J7670J7476J3324J0483J4104R971M779
12730B55070l610k071q547q494J055L675j64p428q381o740j6774j0297o26k084
12716A84584O598O193N189j1228j2244K80P38N15P784O375J2602K9686K9179R418
12702B75669N926K051k953J70k413P341Q771J0692J2721R170O5j9612k5693l3241
12688B48664k5901k1757j1205j110L221k535k66O916P843J0872J4763J2879R406
12675B51790J2828J5678J1401P328j454R060J6741J1180O986L474j243M731K136
12662C50636j055j2484k4866k6827j3798j625j376O688o33l871N30K396K460m010
$$ plain form
12758 107397 102525 95889 100434 101063 102655 111126 114838 118587 121267 120369 122483 128986 127996 127702 127901
12743 127901 133268 139916 140445 140746 148466 167263 184933 202409 215733 226216 240320 250291 255070
12730 255070 251460 249389 240842 232348 233403 237078 236914 229486 221105 214365 197591 187294 186668 184584
12716 184584 191182 197375 202564 191336 179092 179372 180110 180625 188409 194784 207386 237072 266251 275669
12702 275669 281595 283646 280693 280863 278450 285791 294562 305254 317975 327145 327210 307598 281905 248664
12688 248664 222763 201006 189801 188691 191912 189377 189111 196027 203870 214742 229505 242384 251790
12675 251790 264618 280296 291697 299025 297571 306631 323372 334552 341538 345012 343769 348500 350636
12662 350636 349581 337097 312231 285404 271606 269981 268605 275293 274660 270789 271319 273715 276175 272165
12648B72165r876q427o060R938N786n120r71Q249J4290O607P252J114J502j704
12634B94745j907K046J161o6k317O836O791M492J2014J2014J2793K650J373K060
12620C54685k926O47O576J0478J7898K0821J5445N628O579J3776J3962J2860J6334
12607D92763J3235J5776K5428K4523J8951J6913J3971J3921K0679J8459N857J4118
12595F94594R818m472K699J6293J8259J7104K0942L4499M0226L5699K6828K8385
12583I40874L1165L9562M9999L9858M6024N1239N0862N9511O7714Q1500R3333
12572A551641R9198J20410J47247J59630J67436J59030J53263J54069J67085K08061
12562C087070K61705L18656L67822M29412M99135N72054O66425P96217R53907
$$ plain form
12648 272165 262289 253862 247802 257740 263526 258406 257435 265684 279974 286581 293833 294947 296449 294745
12634 294745 292838 294884 296045 295979 293662 300498 307289 311781 323795 335809 348602 351252 352625 354685
12620 354685 351759 352406 358982 369460 387358 408179 423624 429252 435831 449607 463569 476429 492763
12607 492763 505998 521774 547202 571725 590676 607589 621560 635481 656160 674619 680476 694594
12595 694594 704412 699940 702639 718932 737191 754295 775237 809736 849962 885661 912489 940874
12583 940874 972039 1011601 1061600 1101458 1147482 1198721 1249583 1309094 1376808 1458308 1551641
12572 1551641 1650839 1771249 1918496 2078126 2245562 2404592 2557855 2711924 2879009 3087070
12562 3087070 3348775 3667431 4035253 4464665 4963800 5535854 6202279 6998496 7952403
12553G952403J208240J602061K166911K898023L675040M314501N036819O205311
12545C5059309Q615747J3211413K1056462L3158411M8171018N9543612N6595404
12538B75411376L2844002o31704l5851672n5076157n6893459m6043467l2017713
12531H1741206k0889358j3797579r628404p043033n289385m063336l168078k503609
12523A5358424k017500j654354j384462j160428r65571p99761o63710n63389m81319
12514E667930m20936l79915l56802l37090l10986k65950k23939j74657j32296
12505C065359j10127r8609q9055q5100p8468p7083o9291p3674p0727n4233m9395
12494B209597m4815m3967l9457l7734l9145m6515n1236m1212m8875n7372o4824
$$ plain form
12553 7952403 9160643 10762704 12929615 15827638 19502678 23817179 28853998 35059309
12545 35059309 43675056 56886469 77942931 111101342 159272360 218815972 275411376
12538 275411376 308255378 307623674 271772002 216695845 159802386 113758919 81741206
12531 81741206 60851848 47054269 37425865 30382832 25093447 21030111 17862033 15358424
12523 15358424 13340924 11686570 10302108 9141680 8176109 7376348 6712638 6149249 5667930
12514 5667930 5246994 4867079 4510277 4173187 3862201 3596251 3372312 3197655 3065359
12505 3065359 2955232 2856623 2767568 2682468 2604000 2526917 2457626 2383952 2313225 2258992 2209597
12494 2209597 2164782 2120815 2081358 2043624 2004479 1957964 1906728 1865516 1816641 1759269 1694445
12483A694445p5617q1636q6464p6383o6000n8181m6669m0975m0011m0217n3593
12472A028699m3398l9621l5660k9444k5709k1577j9143j5538j8359j6912j7638
12461G45700j5087j8439k4269r232q413j2339r529j3840j1466p169p743r232m124
12448E94818q168N284P582n11l771J942J344R818L968K669J0731J3875J3490J1226
12434F64297K0170K7166K0814J3070J9505J7335R389J4386J3524J9874J5999J2136
12422H67665R623J3594J7622K5712M2900P8016J12949J20591P3377j8340j12700
12411A231009j64535j49713j20590r3228p9071o8117n8622m5015l3045l0806j8599
12400C69668j1850j5191j6184p585p34l46O347j967o372p783j2723j2327j2755
$$ plain form
12483 1694445 1618828 1537192 1450728 1374345 1308345 1250164 1203495 1162520 1122509 1082292 1028699
12472 1028699 985301 945680 910020 880576 854867 833290 814147 798609 780250 763338 745700
12461 745700 730613 712174 687905 678673 670260 657921 648392 634552 623086 615917 608174 598942 594818
12448 594818 586650 591934 599516 599005 595234 597176 598520 608338 612306 614975 625706 639581 653071 664297
12434 664297 684467 711633 732447 745517 765022 782357 791746 806132 819656 839530 855529 867665
12422 867665 877288 890882 908504 934216 977116 1055132 1168081 1288672 1362049 1343709 1231009
12411 1231009 1066474 916761 796171 702943 623872 555755 497133 452118 419073 388267 369668
12400 369668 357818 342627 326443 318858 318124 317778 324125 322158 315786 308003 295280 282953 270198
12387B70198j4088k5265l9804l7512k1845q268k676M041R178L437O209M763n530
12374A42838r809k311P875J0851J4111J8628K2082R078R039M658J645j454n629
12361B21602j2648j5539j42R264N476n28p368r169j3390j0394j8401o759J828
12348A43832J286J244o187q587l343N59R935J5509J6639J8261J4716J3566J3082
12335B30512J874J031O04P590J2254M822k178j346P483M387J895J066J499M132
12321B75625J0457n364n160J999J274l907k081n233Q52L751p331K664O683k429
12307B71800j0799m902j60p915Q390N692J518O163N499N142N925M830l459j1150
12293B76574p991N193R830Q560J1176M299l529m961P73j924qM87n99K163q675
$$ plain form
12387 270198 256110 230845 191041 153529 131684 123416 120740 124781 133959 137396 143605 148368 142838
12374 142838 133029 130718 138593 149444 163555 182183 204265 213343 222382 227040 228685 227231 221602
12361 221602 208954 193415 193273 202537 208013 207485 200117 190948 177558 167164 148763 142004 143832
12348 143832 145118 146362 140175 131588 128245 128804 138739 154248 170887 189148 203864 217430 230512
12335 230512 232386 233417 234021 241611 253865 258687 256509 255163 262646 267033 268928 269994 271493 275625
12321 275625 286082 280718 275558 277557 278831 274924 272843 267610 268462 272213 264882 267546 274229 271800
12307 271800 261001 256099 255939 248024 256414 262106 263624 269787 275286 280428 286353 291183 287724 276574
12293 276574 268583 273776 283606 292166 303342 307641 304112 299151 299924 298000 297992 298479 297880 300043 291368
12278B91368o331n69L7P645L651k077k379J114L78o34L386K619J673O582N38N273
12262C12274K455k433J733p30K508M113J0328P029O441N85k31j468l011M31R843
12247C49867L890p34k949j698k74k530R82L146R328l05p201q225j0092m264j6375
12232C12566k8002k9028j5691o534N590J4350K0661K0971J6607K1467P364l15
12220C40006N439O726J1824J7188O422O136j781l55m396K237K656Q146K11l64
12206D00095J498k677m277L071J1384J0605K003J164k22P419J1254K60N140k62
12192D46455O108N372K350K235m037K356P909J3318N384L907K346K113j079j397
12178D93340r56L210O516K516l315O550M063J1958P231K615L019L933R47L695
$$ plain form
12278 291368 285037 284468 284505 292150 295801 293724 291345 292459 292837 292203 295589 298208 299881 306463 307001 312274
12262 312274 314729 312296 314029 313299 315807 319920 330248 337277 343718 344303 344072 342604 339593 340024 349867
12247 349867 353757 353023 350074 348376 348102 345572 346554 349700 359028 358723 351522 343297 333205 328941 312566
12232 312566 284564 255536 239845 233311 238901 253251 273912 294883 311490 332957 340321 340006
12220 340006 345445 352171 363995 381183 387605 393741 391960 391605 387209 389446 392102 400248 400459 400095
12206 400095 401593 398916 394639 397710 409094 419699 421702 422866 422644 430063 441317 441577 446717 446455
12192 446455 452563 457935 460285 462520 458483 460839 468748 482066 487450 491357 493703 495816 494737 493340
12178 493340 492384 495594 502110 504626 501311 507861 511924 523882 531113 533728 536747 540680 541627 545322
12164E45322L203N030Q36L492N333O978J100J349Q049K906J851J1733J0598Q137
12150F15917L811M956J344O154R09n622k11N634J4542J4895R779Q494l44L236
12136F83494R139N519P973J0342N060M414O726P267O769J0519J2454J0338N105
12123G85119Q070L341O738O982Q688O594P114J7405J2381M982J5388R478R729
12110I02009J2518J4894R992P725J2650J9275L7640L8340L2957L5560O0012P8190
12098A261762J01716J60139K54787L20909L34954K35063M8838j48774k76779k92685
12088A999930k47770j76100j19043p3953m8824k8611j7753j9512r397M452R715
12077A273134J3305J3141J3712J8892J1614R996N900O603J0502L512K890J0773
$$ plain form
12164 545322 548525 553555 554391 557883 563216 570194 571294 572643 580692 583598 585449 597182 607780 615917
12150 615917 619728 624684 626028 632182 633091 627469 627258 632892 647434 662329 672108 680602 680258 683494
12136 683494 692633 698152 706125 716467 721527 725941 732667 739934 746703 757222 769676 780014 785119
12123 785119 793189 796530 803268 810250 818938 825532 832646 850051 862432 867414 882802 892280 902009
12110 902009 914527 929421 939413 947138 959788 979063 1016703 1055043 1088000 1123560 1183572 1261762
12098 1261762 1363478 1523617 1778404 2099313 2434267 2669330 2718168 2569394 2292615 1999930
12088 1999930 1752160 1576060 1457017 1383064 1334240 1305629 1287876 1268364 1258967 1263419 1273134
12077 1273134 1286439 1299580 1313292 1332184 1343798 1353794 1359694 1366297 1376799 1380311 1383201 1393974
12065A393974J5977J1146J6803J2541J5374J5123K0999J6453R156J6896J7666
12054A562108J1686N955J9794K5653K2076J3477K0525J8674K1685J7857J2914
12043A752404J5861J6292K3663K0347J6988K1690J9559K2109K2768K0226J6878
12032A968785K2260K1074J9810J8137J8493K2269L2040K4830J6890K2601K2414
12021B209603L0210K6175K7550K7910K7480K8099K1594K0106K0993K1922K6586
12010B488228K0355J9998K4756K5912L4964K5456K3394K8904K7346K8039K7836
11999B775188K5498K5967K4793K5868K0766K1776K2265K5411K9511K7210L4696
11988C058949K5301K4453K2912K3263K3331J7317K2592K4096L1154K8910J4408
$$ plain form
12065 1393974 1409951 1421097 1437900 1450441 1465815 1480938 1501937 1518390 1527546 1544442 1562108
12054 1562108 1573794 1579749 1599543 1625196 1647272 1660749 1681274 1699948 1721633 1739490 1752404
12043 1752404 1768265 1784557 1808220 1828567 1845555 1867245 1886804 1908913 1931681 1951907 1968785
12032 1968785 1991045 2012119 2031929 2050066 2068559 2090828 2122868 2147698 2164588 2187189 2209603
12021 2209603 2239813 2265988 2293538 2321448 2348928 2377027 2398621 2418727 2439720 2461642 2488228
12010 2488228 2508583 2528581 2553337 2579249 2614213 2639669 2663063 2691967 2719313 2747352 2775188
11999 2775188 2800686 2826653 2851446 2877314 2898080 2919856 2942121 2967532 2997043 3024253 3058949
11988 3058949 3084250 3108703 3131615 3154878 3178209 3195526 3218118 3242214 3273368 3302278 3316686
11977C316686J6399K8575K2389J8885K0161K5619J8734J0390J5336K3114J0848
11966C527136J1514J6861J6909J6137J3368M146K718K624J5497J9400O771R718
11954C662799Q797P859N703P500N328k99j21k522K057L264m161j0130k385Q510
11940C692199q579p262j482p213p305r409j9102j2892n541q101r879r392j0240
11927C575802j0473q758p256j4416k3882k2612k7891j7846j5738k0469j6570j1418
11915C378473j8909j6473j7802k3296k3653l0264k2839k2786k0669j7925k8103
11904C135754k1848k0377k0486k2946k6956k2936k2885j9969k0568k3901l0759
11893B882123k8946k3022k7914k5712k3468j8282k2092k7148k8500k8772j5982
$$ plain form
11977 3316686 3333085 3361660 3384049 3402934 3423095 3448714 3467448 3477838 3493174 3516288 3527136
11966 3527136 3538650 3555511 3572420 3588557 3601925 3606071 3608789 3611413 3626910 3646310 3653081 3662799
11954 3662799 3671596 3679455 3685158 3692658 3697986 3697687 3697566 3695044 3697101 3700365 3696204 3686074 3683689 3692199
11940 3692199 3683620 3676358 3674876 3667663 3660358 3650949 3631847 3618955 3613414 3605313 3595434 3586042 3575802
11927 3575802 3565329 3556571 3549315 3534899 3511017 3488405 3460514 3442668 3426930 3406461 3389891 3378473
11915 3378473 3359564 3343091 3325289 3301993 3278340 3248076 3225237 3202451 3181782 3163857 3135754
11904 3135754 3113906 3093529 3073043 3050097 3023141 3000205 2977320 2957351 2936783 2912882 2882123
11893 2882123 2853177 2830155 2802241 2776529 2753061 2734779 2712687 2685539 2657039 2628267 2612285
11882B612285k1868k7379k1882k0688k3841k4311k8237k4830j8560k3887k9079
11871B347723k6899k1573k2351k0689j9045j8979j6456j9726k5304k3831j7452
11860B115418k0581k5454k1691j9848k1174k0217j9539j6453j7911j9955k4852
11849A887743k3764j6563j9518j1167j3166j6739j9600j6877j7850j7665j5631
11838A699203j9086k2395j0015r696j4769j5885q116j1689j6872k3084j9198j7476
11826A510922j2351j0218j3262j1197j4607j4599r052j6960j4073j5356r016j3995
11814A356236j8479j4935p291r766q728m173j0563j4232k0556j4143j4214j1807
11802A207349j3273j0161j0373q175m659o361r927j0118j6976j4260p546p373
$$ plain form
11882 2612285 2590417 2563038 2541156 2520468 2496627 2472316 2444079 2419249 2400689 2376802 2347723
11871 2347723 2320824 2299251 2276900 2256211 2237166 2218187 2201731 2182005 2156701 2132870 2115418
11860 2115418 2094837 2069383 2047692 2027844 2006670 1986453 1966914 1950461 1932550 1912595 1887743
11849 1887743 1863979 1847416 1827898 1816731 1803565 1786826 1767226 1750349 1732499 1714834 1699203
11838 1699203 1680117 1657722 1647707 1638011 1623242 1607357 1599241 1587552 1570680 1547596 1528398 1510922
11826 1510922 1498571 1488353 1475091 1463894 1449287 1434688 1425636 1408676 1394603 1379247 1370231 1356236
11814 1356236 1337757 1322822 1315531 1305765 1297037 1292864 1282301 1268069 1247513 1233370 1219156 1207349
11802 1207349 1194076 1183915 1173542 1165367 1160708 1154347 1144420 1134302 1117326 1103066 1095520 1088147
11790A088147m415j0347j2480j624q282j1727j5476r716r154j0023p739n301k551
11777I79312j2001p364p782m729r961j0409r143q631m884K519m775j4177j5070
11764H72905l719m697k080o786j653p811j1414r192j2167m588R18m153m515l062
11750G97986j1875r431p018l709r058p309n623l945o727o749r290o546R37j1123
11736G00520k996j718p877m670k410o295l130k062m677k689j474K519n753m091
11722F53197lp559j0750o732k778J185k892J454p258r980l379n772k982k580n944
11707E87227m150L317n263m280P39m979n146j0408k054J849j924k691j0230p133
11693E34874l296J70l104k669k821N55j647p684l867O34K490m939n062p324j430
$$ plain form
11790 1088147 1083732 1073385 1060905 1059281 1050999 1039272 1023796 1014080 1004926 994903 987164 981863 979312
11777 979312 967311 959947 952165 947436 937475 927066 917923 909292 904408 906927 902152 887975 872905
11764 872905 869186 864489 862409 855623 853970 846159 834745 825553 813386 808798 809716 805563 801048 797986
11750 797986 786111 776680 769662 765953 756895 749586 743963 740018 733291 726542 717252 710706 711643 700520
11736 700520 697524 695806 687929 683259 680849 674554 671424 669362 664685 661996 660522 663041 657288 653197
11722 653197 653194 645635 634885 628153 625375 626560 623668 625122 617864 607884 604505 598733 595751 593171 587227
11707 587227 583077 586394 581131 576851 577590 572611 567465 557057 555003 556852 554928 552237 542007 534874
11693 534874 531578 531748 528644 525975 523154 523709 522062 514378 510511 511145 513635 508696 503634 496310 494880
11678D94880P41n260m391n305j1416j366l940m042P72q23J770j1529q608J336
11664D42819L225N267k104p287r927k127n976k169m24J0683R75J058K32Q92l987
11649D31150j1833q899j0148l880m32Q64L839L122k467J355L931J272j738j0542
11635C95594o374k736m748n805j717O33k152k642k886p20n127K368Q187q587j980
11620C61308N405J70k028k032l610k743q685r981K160m893j103J539J549M193
11606C41249K700N826o624o309m504j529k238L671K810j132k553k611j1655n077
11592C12024o437j771P341M127K896J278k973o052l635K585K502k674j3327l790
11578B92094l578K940M984L59m164l327L557j620l847J540J00k625k19n121k751
$$ plain form
11678 494880 495621 490361 485970 480665 469249 467883 463943 459901 460673 459850 461620 450091 441483 442819
11664 442819 446044 451311 449207 441920 431993 429866 423890 421721 421297 431980 432955 434013 434245 435137 431150
11649 431150 419317 410418 400270 396390 395958 396822 400661 403783 401316 402671 406602 407874 406136 395594
11635 395594 389220 386484 381736 375931 374214 374847 372695 370053 367167 366447 361320 363688 371875 363288 361308
11620 361308 366713 366883 364855 362823 359213 356470 347785 337804 339964 335071 333968 335507 337056 341249
11606 341249 343949 349775 343151 336842 332338 330809 328571 332242 335052 333920 331367 328756 317101 312024
11592 312024 305587 303816 311157 315284 318180 319458 316485 310433 306798 309383 311885 309211 295884 292094
11578 292094 288516 291456 296440 296799 292635 289308 292865 291245 287398 288938 289038 286413 286194 281073 278322
11563B78322N118o543n16o470J011J965L874k1l155j450n333r26K707J324l277
11548B66630L901J955o041J054j273j3608p281R60P061O50l328L853N297J186
11534B61016L088Q79m404m944k444m963q644q60R082Q609P150l510p631l926m883
11519B43615M84k291o721P39J9N336L312Oj855o281k26R74L185J044K205m93p916
11502B35136o951k348M17M480n565m547j454M228k676p89j518M022O137K702p70
11487B30504o040m687K994K447l00l033k017o47L154j851k480J477l154n241n67
11472B10559m397l276k836p378o2K488M055J510N149j510m776N910J873l138k432
11457B01739K721J641l918K785M944q56j2052P52L062l852l317N168J567o933
$$ plain form
11563 278322 283440 276897 276381 269911 270922 272887 276761 276740 273585 272135 266802 265876 268583 269907 266630
11548 266630 270531 272486 266445 267499 266226 252618 245337 246297 253358 254008 250680 254533 259830 261016
11534 261016 264104 264983 260579 255635 253191 248228 239584 238724 247806 256415 263565 260055 252424 248498 243615
11519 243615 244099 241808 235087 235826 235845 241181 244493 244499 242644 236363 236137 237111 240296 241340 243545 243052 235136
11502 235136 228185 225837 226254 230734 225169 220622 219168 223396 220720 219931 218413 222435 228572 231274 230504
11487 230504 224464 219777 222771 225218 224918 221885 219868 219221 222375 220524 218044 219521 216367 211126 210559
11472 210559 206162 202886 200050 192672 192610 195098 199153 200663 205812 204302 199526 205436 207309 204171 201739
11457 201739 204460 206101 202183 204968 209912 209056 197004 197756 200818 196966 193649 198817 200384 193451
11443A93451j0370O92M415M782N274j68J475n632l898M183O538l510p873n393
11429A83966O300O037j140l32o045p847Q82L535L338L66K888j404n103l742m557
11414A77142M107N807K991l733j639Q188o085n598N901J24J426P568M739p830
11400A93108l487o201l543K105j003l193M542L718r046j409L851K463k084l400
11386A76421q501k418M945l794j459j697N077R647N570q954r940M50j987N345
11372A68705Q879p13l396l185j271J676l259l093m640l180N536k821J335K070
11358A62643J2778N815L40Q08r024q037k585n621p006k360k15j872N008j483L589
11343A52778J438q54l03k926k285O54L272J936n33O801M136j381j571N20l79n956
$$ plain form
11443 193451 183081 183773 188188 192970 198244 198076 199551 193919 190021 194204 200742 197232 189359 183966
11429 183966 190266 196303 195163 194831 188786 180939 181821 185356 188694 189060 191948 190544 185441 181699 177142
11414 177142 181249 187056 190047 186314 184675 192863 186778 181180 187081 187205 188631 196199 200938 193108
11400 193108 189621 183420 179877 181982 180979 177786 182328 186046 177000 175591 179442 181905 179821 176421
11386 176421 167920 165502 170447 166653 165194 163497 168574 178221 183791 174837 164897 165347 163360 168705
11372 168705 177584 176871 173475 170290 169019 170695 167436 164343 159703 156523 162059 159238 160573 162643
11358 162643 175421 181236 181576 182384 173360 165323 162738 157117 150111 147751 147536 145664 150672 149189 152778
11343 152778 154216 153362 153059 150133 147848 148502 151774 153710 153177 159978 164114 162733 161162 161682 161303 155347
11327A55347n281L209P823L394j074N476N02o262o230K926L901R87m073o083J256
11312A55818J266l56o314k997N743J267j30J2380K035r142j0114m121N123J19
11298A50577o970n350K84K766j306j30l704J233L353n924O508J525K013j536k804
11283A40535m082l855M972k71N196m985k558j152J658n1Q02K090R447P075M03
11268A55224M607o082o817n379J029J885K48K802k811q254j888K149J045p76Q569
11253A45551L381p316q95J162k45l92m189j093J0518N341n29j625l175m514j1931
11238A30049k736M702L461N079M268k26o187J14j65j075O010n837q55K135k156
11223A36581l716j539j789M727O876J885o843n345P167K031m02M933L708L00q513
$$ plain form
11327 155347 150066 153275 161098 164492 163418 168894 169396 163134 156904 159830 163731 164718 160645 154562 155818
11312 155818 157084 156728 150414 147417 153160 154427 154297 166677 168712 159570 149456 145335 150458 150577
11298 150577 143607 138257 138541 141307 140001 139871 136167 137400 140753 134829 141337 142862 144875 143339 140535
11283 140535 136453 132598 137570 137299 142495 137510 134952 133800 135458 135407 136209 138299 147746 154821 155224
11268 155224 159831 153749 146932 141553 142582 144467 144715 147517 144706 136452 134564 136713 137758 136982 145551
11253 145551 148932 141616 140721 141883 141638 141246 137057 135964 146482 151823 151294 149669 146494 141980 130049
11238 130049 127313 132015 135476 140555 144823 144597 138410 138524 138359 137284 143294 137457 136602 138737 136581
11223 136581 132865 131326 129537 134264 141140 143025 136182 130837 138004 140035 139633 144566 148274 148574 140061
11208A40061o789k855r165k201M349P187R130M36q026Q35j734J0322L395N143
11194A50088o177q408m114j830P574k427l8L711j921j185n290o527M287R05m69
11179A28179k87Q913j946q502J619K00L438J124n105N347P261O407l12n273M800
11164A45863R353P66j0535j1195n7k293K613M198j517j347l488k045l897j827
11150A24592K785K801M13l008k466P03j92O968K354m806O263j32r19P811N173
11135A48340P170l589o443l373m004l378o778K927K923P27k527j529m610o335
11121A19521m18L551k030K405O39L327K736m430j416r732J089L958K099m734L225
11106A19790Q228K161k302J271n439k016L027J756P842n643l124P150k368m397
$$ plain form
11208 140061 133272 130417 121252 119051 123400 130587 139717 140153 132127 132962 131228 141550 144945 150088
11194 150088 143911 135503 131389 129559 137133 134706 134668 138379 136458 135273 129983 123456 127743 128648 128179
11179 128179 127892 136805 134859 126357 127976 128176 131614 132738 127633 132980 140241 146648 146336 141063 145863
11164 145863 155216 155982 145447 134252 134195 131902 134515 138713 137196 135849 132361 130316 126419 124592
11150 124592 127377 130178 130591 127583 125117 125820 125628 132596 134950 130144 136407 136275 135356 143167 148340
11135 148340 155510 151921 145478 142105 138101 134723 127945 130872 133795 134522 131995 130466 125856 119521
11121 119521 119103 122654 120624 123029 123668 126995 129731 125301 123885 114153 115242 119200 121299 116565 119790
11106 119790 128018 130179 127877 129148 123709 121693 124720 126476 134318 128675 125551 132701 130333 125936
11092A25936o079o513L049K58m15L470K734l177L934J1406J08l380l561K25J183
11077A29178k175l8J242p86J53l821l786J400O974O156q238M879R993r06m927
11062A35298k624n194j0261j909P229J185m901J878m411m597N961J0666l193m574
11048A20553o650O17O188J107J600K089L863P342k147m635J227j250L628j343
11034A32189j280k097k954M00l518M531J497k41p834o349K193K676Q210K150m064
11019A25509j066O182r359r04j44k561N18L801j906M38j593p19L436M611N842
11004A32085o6o870j0272k828M282j596K998P856J202p906O38L551L029K33m547
10989A21789k340m51O644J517O14j237j452k071o324n927k126K90j030qp23R18
$$ plain form
11092 125936 119857 113344 116393 116651 116236 119706 122440 119263 123197 134603 134711 131331 127770 127995 129178
11077 129178 127003 126965 128207 127421 127574 123753 119967 121367 128341 134497 126259 131138 141131 140225 135298
11062 135298 132674 127480 117219 115310 122539 123724 118823 120701 116290 111693 117654 128320 125127 120553
11048 120553 113903 114520 120708 121815 123415 125504 129367 136709 134562 129927 131154 129904 133532 132189
11034 132189 130909 128812 125858 126258 122740 127271 128768 128527 120693 114344 116537 119213 127423 129573 125509
11019 125509 124443 130625 121266 120362 120218 117657 118175 121976 120070 120508 118915 118196 121632 126243 132085
11004 132085 132019 125149 114877 112049 116331 114735 117733 125589 126791 118885 119523 123074 126103 126336 121789
10989 121789 119449 118998 125642 127159 127773 126536 125084 123013 116689 110762 108636 108926 107896 107888 107165 108083
10973A08083R217J1394K61p048l302n67o796L284L188m71J703K382Q05j497J252
10958A21888J028J311L05k88J584j735m434j100m22K482n430k815N181m774K145
10943A14926j43M365q0o677j431R892K948K156K473k909r064Q3o044q63M001j149
10927A12484n5L764L236k296m275K720O204K917K2n820n656M083K905J816j644
10912A20405l508o19M172L789Q5l678N896j298o188n80p72j71L611j978p983P014
10896A18197O420O58N521r397r272L052j8L487N8Q40o24O91j36K017m589J695
10880A18600N370J420r4K88K550L16p650m741L426M74l933n086L958R272Q191
10865A32361O744N924p25L569q74p24o362j235l566m386l651m065J288k77P334
$$ plain form
10973 108083 117300 128694 128955 121907 118605 118038 111242 114526 117714 117243 118946 121328 122133 120636 121888
10958 121888 122916 124227 124532 124244 125828 124093 119659 118559 118137 120619 115189 112374 117555 112781 114926
10943 114926 114783 119148 119068 112391 110960 120852 123800 125956 128429 125520 116456 116539 110495 109632 113633 112484
10927 112484 112429 116193 119429 117133 112858 115578 121782 124699 124721 118901 113245 117328 120233 122049 120405
10912 120405 116897 116278 120450 124239 124324 120646 126542 125244 119056 118476 117704 117533 121144 119166 111183 118197
10896 118197 124617 125275 130796 121399 112127 115179 115161 118648 118706 119546 118922 119613 119477 121494 116905 118600
10880 118600 123970 125390 125296 125584 128134 128450 120800 116059 119485 119959 116026 110940 114898 124170 132361
10865 132361 139105 145029 144304 147873 146999 146275 139913 138678 135112 130726 127075 123010 124298 124021 131355
10850A31355J497l578m752K542n099J071K613n33N668j552j532p810m176J272
10836A16986L083K112L061N308M794o161r087m236j954K431P057M553J165q594
10822A20518l449N614K347j150l064N804Q414O809p010m671N256l83j224l700
10808A30111j484j637o390N125K518L157j40n485m276K517J29L309J51K736J938
10793A32279P308K083o307Q68J438k086l313j209k065k490k652J0046M075R124
10779A47099J2291K2694J7207K080k447n226k0125j7268o476m566l204k442n305
10766A34312j663n438m047P065M330J220m157J403M615j713n362k750L566J0396
10752A41777K113P416J390n847j1080J180Q60n504k464M781O219l62K666m034
$$ plain form
10850 131355 132852 129274 124522 127064 121965 123036 125649 125116 130784 129232 127700 119890 115714 116986
10836 116986 120069 122181 125242 130550 135344 129183 120096 115860 113906 116337 123394 127947 129112 120518
10822 120518 117069 122683 125030 123880 120816 126620 135034 141843 134833 130162 135418 135035 133811 130111
10808 130111 128627 126990 120600 125725 128243 131400 131260 125775 121499 124016 124145 127454 127605 130341 132279
10793 132279 139587 141670 135363 136231 137669 135583 132270 131061 128996 126506 123854 133900 137975 147099
10779 147099 159390 182084 199291 201371 198924 193698 173573 156305 149829 145263 142059 139617 134312
10766 134312 132649 127211 123164 130229 134559 135779 131622 133025 137640 135927 130565 127815 131381 141777
10752 141777 143890 151306 152696 146849 135769 136949 137809 132305 129841 134622 140841 140479 143145 139111
10738A39111Q1L439O589O028l201o72q83n089m024l327q83K508J872q428L681
10723A36802J047j7J180L534m314p401l96k82k464j621L140j123l263N111O287
10708A36220K979n251q584L623L295n744k402O167K579L70j110k224j36P05q630
10693A21857N144L858N572J584M197j763m448k442Q34n473m49J1832P863k198
10679A45968P25p054j647K102k702n269L422M475J045R09n77J23n690j708R978
10664A44100P901j78Mk703l844l081J964j399o35K329j434P73M969O036l02J329
10648A55829q302k156J28q364q280J823L402r81k678k62K957M083Q330J468k014
10633A44983l417k171o671L524N691k763N473K298J31J508m246k5p133n555N11
$$ plain form
10738 139111 139192 142631 149220 155248 152047 151375 150492 145403 141379 138052 137169 139677 141549 133121 136802
10723 136802 137849 137832 139012 142546 138232 130831 130435 130153 127689 126068 129208 128085 124822 129933 136220
10708 136220 139199 133948 125364 128987 132282 126538 124136 130303 132882 133252 132142 129918 129782 130487 121857
10693 121857 127001 130859 136431 138015 142212 140449 136001 133559 134393 128920 128471 140303 148166 145968
10679 145968 146693 139639 137992 140094 137392 132123 135545 140020 141065 141974 141397 141520 135830 134122 144100
10664 144100 152001 151823 151827 149124 145280 142199 144163 142764 142129 144458 143024 143797 148766 154802 154500 155829
10648 155829 147527 145371 145499 137135 128855 130678 134080 133099 130421 130159 133116 137199 145529 146997 144983
10633 144983 141566 139395 132724 136248 141939 139176 144649 146947 147078 148586 144340 144315 137182 131627 132138
10618A32138Q884L169J122m80m273j638O944o235L1J920j0722k776K090O832M544
10603A41550m458o499M223M095P798K344j051K683N09M30k213k366k537K77N550
10588A50335J42J61J015M693M370K80o446k84K311L030m798l861m884m187N204
10573A47081K783m98K432Q448R456q61m983p611K433Q085k354k728m808J51l91
10558A56635J545L006m534k452o40O361O131k169j152l878j987K572l673j611
10544A54154R04L535l507K44K229P747L526q604j906L304j013k427j45L34j263
10529A57112k452l95n022k464K827k6o590j365k190n405K463l312o151J120R756
10514A37906O258J0876J2430L076m372j299J861o30o951k734j354m298l428P78
$$ plain form
10618 132138 141022 144191 145313 144833 140560 138922 145866 139631 139662 141582 130860 128084 130174 137006 141550
10603 141550 137092 130593 134816 138911 146709 149053 148002 150685 151194 151624 149411 147045 144508 144785 150335
10588 150335 150477 150638 151653 156346 160716 160996 154550 154266 156577 159607 154809 150948 146064 141877 147081
10573 147081 149864 149366 151798 160246 169702 168841 163858 156247 158680 166765 164411 161683 156875 157026 156635
10558 156635 158180 161186 156652 154200 153560 159921 166052 163883 162731 158853 156866 159438 155765 154154
10544 154154 155058 158593 155086 155330 157559 165306 168832 160228 158322 161626 160613 158186 158041 158375 157112
10529 157112 154660 154265 149243 146779 149606 149580 142990 141625 139435 134030 136493 133181 127030 128150 137906
10514 137906 144164 155040 167470 170546 166174 164875 166736 166106 159155 156421 155067 150769 147341 148119
10500A48119M496K359j857P706N380J0212P034m428m003P188M185P642O358O508
10486B06899r7M552k043j0967j2162k043j23P962P525Q10j984k581J959J0129
10472B07836q22R480J2448M893O206O583M189J8670K1669K2083L3258N4874P8463
10459D79830J13186J56541K02516K28416K20328J54630O7017l8303j36610k10379
10449A237172k30486k14024j72849j24055q2260n1709k8869k0032j9095k0621
10439B73172j2973p050k927j002k699J165N342k590o092k331n513m34p198j2903
10425B15967o999k203j254j573l875n434N189P876Q75j219l98L884j46j1821l502
10410A95367l110k225R26Q79N88o30J568j862K531O301J041l051O050j805J974
$$ plain form
10500 148119 152615 154974 153117 160823 166203 176415 183449 179021 175018 182206 186391 194033 200391 206899
10486 206899 206802 211354 209311 198344 186182 184139 184016 191978 199503 200313 198329 195748 197707 207836
10472 207836 207014 216494 228942 233835 240041 246624 250813 269483 291152 313235 346493 401367 479830
10459 479830 593016 749557 952073 1180489 1400817 1555447 1622464 1584161 1447551 1237172
10449 1237172 1006686 792662 619813 495758 413498 361789 332920 312888 293793 273172
10439 273172 260199 253149 250222 249220 246521 247686 253028 250438 244346 242015 236502 236068 228870 215967
10425 215967 208968 206765 205511 203938 200063 194629 199818 207694 208569 207350 206952 210836 210690 198869 195367
10410 195367 192257 190032 190958 191837 192425 191795 193363 191501 194032 200333 201374 198323 204373 202568 204542
10395B04542n052q515k831J193L465J495P152N142m053j415K574Q319L679j166
10381B14529m436K168K149k518k640k179J515n50j317j023l82P718M132J2517
10367B29683J5352P353J4053J2691J3965M986q984p933j6879j5707j9348j4489
10355B14743j1152o023j259J079j747l699k983l521N16n189N441O036l128J892
10341A91006Q617L472m271K972J105K129j987l768O21M221l615N831N509Q80J485
10326B14207j425O817o39O630J1679L474N027K520J586J0855K0669J9455K1651
10313C22506J1985L07R425M710q537q591p817r874n894o061q982j1629q874m002
10299B68672O72p414p501j2616j3718n975L221J803R74N330N968k45P549J4195
$$ plain form
10395 204542 199490 190975 188144 189337 192802 194297 201449 206591 202538 201123 203697 212016 215695 214529
10381 214529 210093 212261 214410 211892 209252 207073 208588 208038 206721 205698 205316 213034 217166 229683
10367 229683 245035 252388 266441 279132 293097 298083 289099 281166 264287 248580 229232 214743
10355 214743 203591 197568 196309 197388 195641 191942 188959 185438 185954 180765 186206 192242 189114 191006
10341 191006 199623 203095 198824 201796 202901 205030 203043 199275 199896 204117 200502 206333 211842 212722 214207
10326 214207 212782 219599 218960 225590 237269 240743 245770 248290 249876 260731 281400 300855 322506
10313 322506 334491 334798 344223 348933 340396 331805 323988 314114 308220 302159 293177 281548 272674 268672
10299 268672 269344 261930 254429 241813 228095 222120 225341 227144 228118 233448 239416 239171 246720 260915
10285B60915P560k907j2612j3041n907n32J958l643O258N779r7m770l121l686
10271B32154N27L152L049L359J307n88K925M702r07k295P945L459L871L884K657
10256B69201L803J2867J5507J3626J1150J1196P379J778J3698J2085N353l074
10244C74569m419k650l602j0560M43k905o353n180m098o003p300L945M105m465
10230C25527j309k757n751n26O234J3379Q730Q272K0399K8697K5482K0311J8722
10217D65410J1127J803l835j0129m372k319k447n73M035R27n538j5536j6113k3119
10203C99321k3702j9139q154M327O707J0188O258L903R193J5952J0351K969P939
10190D26113J7185K4815J5103P825J4785J0223J3104J0862J7602J9243O05k051
$$ plain form
10285 260915 268475 265568 252956 239915 234008 233476 235434 231791 238049 243828 243731 238961 235840 232154
10271 232154 232681 235833 238882 242241 243548 242960 245885 250587 249680 247385 255330 258789 262660 266544 269201
10256 269201 273004 285871 301378 315004 326154 337350 344729 346507 360205 372290 377643 374569
10244 374569 370150 367500 363898 353338 353781 350876 344523 339343 335245 329242 321942 325887 329992 325527
10230 325527 324218 321461 315710 315184 321418 334797 343527 351799 372198 400895 426377 446688 465410
10217 465410 476537 478340 474505 464376 460004 457685 455238 454665 458700 459627 454089 438553 422440 399321
10203 399321 375619 356480 348326 352653 359360 369548 375806 379709 388902 404854 415205 418174 426113
10190 426113 443298 468113 483216 491041 505826 516049 529153 540015 557617 576860 577465 575414
10178E75414l575q778j9384j9760j1379r523r883k564o678M60J0747J3771M866
10165E13734R541K0196J4089K3915M9795P3031J05984J36437J46315J25584P9323
10154A297944K9521j0885n6910j04852j33651j21690q8697m8046k6716j5477q044
10143G12497o914O031K3417K8920M4949O7483Q3818Q3591N1509J4071P843J7788
10131A135003J165l1706o2214o9105n2476l4066j4544k372R07J0462K2384K4025
10119I27463K1940J7879K0294K5060K3711K4787J5685J9353L0076K3149K1747
10108A171144K6127K8571L5068M7737N3283N2002N9577O5238P2066Q4575J01632
10097A797020J01041J23592J63103K15932L02193M29941N92924P53175Q36783
$$ plain form
10178 575414 571839 563061 543677 523917 512538 503015 493132 490568 483890 484350 495097 508868 513734
10165 513734 523275 543471 557560 581475 631270 704301 810285 946722 1093037 1218621 1297944
10154 1297944 1327465 1316580 1259670 1154818 1021167 899477 810780 762734 736018 720541 712497
10143 712497 705583 711614 735031 763951 808900 876383 960201 1043792 1095301 1109372 1117215 1135003
10131 1135003 1136168 1104462 1042248 973143 920667 886601 872057 869685 870592 881054 903438 927463
10119 927463 949403 967282 987576 1012636 1036347 1061134 1076819 1096172 1126248 1149397 1171144
10108 1171144 1197271 1225842 1260910 1308647 1361930 1413932 1473509 1538747 1610813 1695388 1797020
10097 1797020 1898061 2021653 2184756 2400688 2702881 3132822 3725746 4478921 5315704
10088E315704P82624O12143L41267L6160k22049l87530m03285k88334p4930J48937
10078E860707L61959N19366O22845O78141O74258O52336O53770O80913P88107
10069A1492402J009835J327737J764924K276930K906300L772827N070290P157305
10061C6778550J0564214J5970056K3775261L2979330M0396914M1532116L4708561
10054B36705002K1651405M183375j3709991k8861342l9179852m1540792l6937642
10047A02310163k8361850j9662051j3009478q675117o046485m461369l481992
10040A8611821k821285k312722j873736j481814j123529q31230o47146n42841
10032F977518m99283n10927n47112n69438n69304n45337m76050l81516l09844
$$ plain form
10088 5315704 6098328 6710471 7051738 7087898 6865849 6478319 6075034 5786700 5711770 5860707
10078 5860707 6222666 6742032 7364877 8043018 8717276 9369612 10023382 10704295 11492402
10069 11492402 12502237 13829974 15594898 17871828 20778128 24550955 29621245 36778550
10061 36778550 47342764 63312820 87088081 120067411 160464325 201996441 236705002
10054 236705002 258356407 262539782 248829791 219968449 180788597 139247805 102310163
10047 102310163 73948313 54286262 41276784 32601667 26555182 22093813 18611821
10040 18611821 15790536 13477814 11604078 10122264 8998735 8167505 7520359 6977518
10032 6977518 6478235 5967308 5420196 4850758 4281454 3736117 3260067 2878551 2568707
10023B568707k46345j91636j62822j36637j23650j05215r9901q4039o6515m7944
10013A304003j2012m1431j06605j16626j10024q1406n8201n6327n0589m0863l0310
10002E99609l3914l1111l2858l5212m1931l5665k7806k4103k9931k7645k4720
9991B54713j7511q900j7347j7424o387n152N133J151n102n396j541N85l350n213
9977A68259o307K930O720l706q516K80o139o248o987q164r82N61j1747q237K199
9962A13916O09k715n574l672J542J59q834j1434j0827n428L266J633K589P986
9948H3216N602o38R5j707p813n614q705j497l836P68M990n112J878R123L474O186
9932H0410R578N364L484O729Q034J106K852l875j2940r879k0137j7514p430p728
$$ plain form
10023 2568707 2322362 2130726 1967904 1831267 1707617 1602402 1502501 1418462 1351947 1304003
10013 1304003 1291991 1250560 1143955 1027329 917305 835899 777698 721371 670782 629919 599609
10002 599609 565695 534584 501726 466514 424583 388918 361112 337009 307078 279433 254713
9991 254713 237202 228302 210955 193531 187144 181992 187125 188276 183174 177778 176237 176822 173472 168259
9977 168259 161952 164882 171602 167896 159380 159660 153521 147273 140286 132122 131140 131701 119954 111717 113916
9962 113916 114525 111810 106236 102564 104106 104265 95431 83997 73170 67742 71008 72641 75230 83216
9948 83216 88818 88180 88275 86568 78755 73141 64436 62939 59103 59871 64861 59749 61627 70750 74224 80410
9932 80410 89988 95352 98836 105565 113599 114705 117557 113682 100742 90863 70726 53212 45782 38054
9918C8054n834n801m623m1k510p586J565R085R801O553Q63l362R5N585r682j4953
9902A7209p557r970j0112r803m447K658M15K59J0721J6335J3762J3374Q144K0334
9888F1322L3250M5433N6350P4030R6534J34292K01034L22582N60395R16496J364160
9877C865878J512715O64704o66113j391015j381269r70839n70708l27161j97078
9868E39114j28614r4516o5754m5782k8836j7806k6828l2810l6529k6005j8158
9857A7476J86O258J2158J8314J1524l315m136j337k315j253j942P868J0127N898
9843G5511J5199J8502Q393J9662L7340O2106J06267J79099K53641K16340m0962
9832I51098j99809k39150j76704j03781o1275l7842l1199k3157j6417j4447j0467
$$ plain form
9918 38054 32220 26419 21796 21755 19245 11659 13224 22309 32110 38663 39526 36164 36259 41844 32162 17209
9902 17209 9652 -318 -10430 -20233 -24680 -22022 -21607 -21348 -10627 5708 19470 32844 40988 61322
9888 61322 94572 140005 196355 270385 366919 501211 702245 1024827 1585222 2501718 3865878
9877 3865878 5378593 6043297 5377184 3986169 2604900 1634061 1063353 736192 539114
9868 539114 410500 315984 250230 204448 175612 157806 130978 98168 61639 35634 17476
9857 17476 17662 23920 36078 54392 65916 62601 58465 57128 54813 53560 51618 59486 69613 75511
9843 75511 90710 109212 117605 137267 174607 236713 342980 522079 775720 992060 951098
9832 951098 751289 512139 335435 231654 170379 132537 101338 78181 61764 47317 36850
9821C6850n147K232n011l410O355K173k684P576R261L823j487J639p068q384n258
9806C1460J311K726j621o48p228K311M009n327l264l825r896l008R16L08L99M747
9790A3370n14j383M741k034r846n102J368O312j850l896j487Q1j506Q40P13L714
9774C521J279L414k713k428j329N218M365J832M975L795j422l015J021J607m621
9759A5499j247k452j854j427k526l492p913r709j270j0582k7276k3263j2274r382
9745i9168p735p95Q136K152N212J7652J7868K272M043M968p64R010P296O829K224
9730b0800n724J140M040L168q076j1925Q20j315k514M076M838j24K752L83n283
9715c4544J677K711M879J0077J574j646k210j529j408N800j056J271M177l136
$$ plain form
9821 36850 31703 33935 28924 25514 31869 34042 31358 38934 48195 52018 50531 52170 45102 36718 31460
9806 31460 32771 35497 33876 33228 26000 28311 32320 26993 23729 19904 10008 7000 7916 8224 8623 13370
9790 13370 12856 11473 16214 14180 4334 -768 600 6912 5062 1166 -321 -240 -1746 -906 -193 3521
9774 3521 4800 8214 5501 3073 1744 6962 11327 13159 18134 21929 20507 17492 18513 20120 15499
9759 15499 14252 11800 9946 8519 5993 2501 -5412 -15121 -16391 -26973 -54249 -77512 -89786 -99168
9745 -99168 -106903 -107698 -99562 -97410 -92198 -74546 -56678 -54406 -50363 -45395 -46159 -37149 -29853 -23024 -20800
9730 -20800 -26524 -25384 -21344 -18176 -26252 -38177 -37357 -38672 -41186 -37110 -32272 -32396 -29644 -29261 -34544
9715 -34544 -32867 -30156 -25277 -15200 -13626 -15272 -17482 -19011 -20419 -14619 -15675 -14404 -10227 -13363
9701a3363J311M769M213l690k65l988r12l524j137R51K459p26l730K538J1434
9686c660P560M225L659M861N242L206K669l844o042m945k363o85J027j370j044
9671H496R297O768j180N07R088P954m77J855R256J2933J2327J5334J6811K2888
9657A31857L2251M5320Q2385J18369J67525K15764K35755K07857J38510N2383
9647A427976n8536j42780k09003k36678k07286j63132j15041p4815n0013l5049
9637A35643k5778k8108j4056L32p565r638j0682q419L685n62j0326j757j0745
9624A2024p400o925o056J031j156o158K775l95l098j022L766N166O58k922j320
9609a1032J351L377J0196P042J545QL875K645p66n929k328p974m813j199j77M850
$$ plain form
9701 -13363 -12052 -7283 -3070 -6760 -7025 -11013 -11925 -15449 -16586 -15635 -13176 -13902 -17632 -15094 -3660
9686 -3660 3900 8125 11784 16645 21887 25093 27762 23918 17876 12931 10568 9883 10910 9540 8496
9671 8496 17793 24561 23381 23888 32976 40930 40453 42308 51564 64497 76824 92158 108969 131857
9657 131857 164108 209428 291813 410182 577707 793471 1029226 1237083 1375593 1427976
9647 1427976 1369440 1226660 1017657 780979 573693 410561 295520 220705 170692 135643
9637 135643 109865 81757 67701 68033 60468 50830 40148 31729 35414 34852 24526 22769 12024
9624 12024 4624 -2301 -8357 -7326 -8482 -14640 -11865 -12260 -15358 -16380 -12614 -7448 -6790 -9712 -11032
9609 -11032 -9681 -6304 3892 10934 12479 12487 16362 19007 18241 12312 9984 2010 -2803 -4002 -4179 671
9593F71J0400J6395J7027L775k913j069K363k031j125j091M42l941j6331m662
9579A7910l641n911L349K342j3000j4203l847K671N377L113l159M163L555n585
9565f866q008k974L996q46k703l301K055K794j752M028k037p838k43M824M621
9550a4250K122r41n354k921j484M704M485j215J0735J981o06K108O732m624j1839
9535a0367n379L349P302M878j296j459L488P45j1168j640N414J1860n59l301K093
9520C960j630j1224q477l835L044q84J095k17j928N69q440n31M493P428M394J928
9504a0255j543m141J589L499l148q458o3p032k137O286L658J257J989m156J821
9489b0834N645M32O416k637j433N509K097j586N813n270k073L611J120k181K604
$$ plain form
9593 671 11071 27466 44493 48268 45355 44286 46649 44618 43493 42402 42844 38903 22572 17910
9579 17910 14269 8358 11707 14049 1049 -13154 -17001 -14330 -8953 -5840 -8999 -4836 -1281 -6866
9565 -6866 -14874 -17848 -13852 -14698 -17401 -20702 -18647 -15853 -17605 -13577 -15614 -23452 -23695 -18871 -14250
9550 -14250 -12128 -13069 -18423 -21344 -22828 -18124 -13639 -14854 -4119 -2138 -2744 -636 6096 1472 -10367
9535 -10367 -15746 -12397 -5095 -217 -1513 -2972 516 1261 -9907 -11547 -6133 5727 5168 1867 3960
9520 3960 2330 -8894 -17371 -21206 -18162 -19046 -17951 -18168 -20096 -19527 -27967 -28498 -24005 -16577 -12183 -10255
9504 -10255 -11798 -15939 -14350 -10851 -13999 -22457 -22520 -29552 -31689 -25403 -21745 -20488 -18499 -22655 -20834
9489 -20834 -15189 -14757 -8341 -10978 -12411 -6902 -4805 -6391 -578 -5848 -7921 -4310 -3190 -5371 -2767
9474b767L354r58l850n083J266J066m400n896L042J0377J3004J2435K166k996
9460B0760j6276l417m45n234l301l987l532R78K929k587L253r39m012K848O996
9445e966m395n289j844J569l433k538l20P451Q344k67m336j734K779M422n840
9430a1397l482N728M892r974m015q34J378P639J19l516l826J61R24N702O13j894
9414a1782J634Q86J89N55k346M152N242j885o875j727K115O075P70K204O056J624
9398F887o039q64K887J3r481r189Q600N600n724k529k007n293j327M206J608M26
9382a2226l466M253K715L692l279k64L064J299p60l086J161J783j0500j832M262
9367a3184R62O960Q96p558j327M160k19j1168L31Q651O398N154J40p958K184n848
$$ plain form
9474 -2767 587 -371 -4221 -9304 -8038 -6972 -11372 -17268 -14226 -3849 9155 21590 23756 20760
9460 20760 4484 1067 622 -4612 -7913 -11900 -15432 -14454 -11525 -14112 -10859 -11798 -15810 -12962 -5966
9445 -5966 -10361 -15650 -17494 -15925 -19358 -21896 -22216 -14765 -6421 -6688 -11024 -12758 -9979 -5557 -11397
9430 -11397 -14879 -9151 -4259 -14233 -18248 -19082 -17704 -10065 -9946 -13462 -17288 -17127 -16203 -10501 -9888 -11782
9414 -11782 -10148 -9262 -9073 -8518 -10864 -6712 -1470 -3355 -10230 -11957 -9842 -3767 -2997 -793 5263 6887
9398 6887 848 -16 2871 2884 -6597 -15786 -7186 -1586 -7310 -9839 -11846 -17139 -18466 -14260 -12652 -12226
9382 -12226 -15692 -11439 -8724 -5032 -8311 -8575 -5511 -4212 -4972 -8058 -6897 -5114 -15614 -17446 -13184
9367 -13184 -12222 -5262 -4366 -11924 -13251 -9091 -9310 -20478 -20147 -11496 -5098 56 196 -7762 -5578 -11426
9351a1426m99O236m940m724l211k654M003O751l199K809k43l125n972m734R867
9336a5061O825J999m32k189j3050n103k42L027Q263O206l234l493K352L708o465
9321a6889k763K280n31n627L364K213J310L45M095L934O834J0838m105o282r56
9306a940l262L13P995k098j2406q004J936K418j855j562L036N578r88L827o51
9291g663p887m451k380O860N912l43O0J020K664L926m169l157k085k588j594k485
9275a8360j084M453L027M830K94l731L025K320k873l510P162N530J409m563j978
9260d049k188p99l29j809k827l086M562K936N013K10j669m572J085M773J906k445
9244c288p026n066j402K856Q57k749L769L938J51Q5p91n01J829N974N406k648
$$ plain form
9351 -11426 -11925 -5689 -10629 -15353 -18564 -21218 -17215 -10464 -13663 -10854 -11097 -14222 -20194 -24928 -15061
9336 -15061 -8236 -6237 -6669 -8858 -21908 -27011 -27253 -24226 -15963 -9757 -12991 -16484 -14132 -10424 -16889
9321 -16889 -19652 -17372 -17903 -23530 -20166 -17953 -16643 -16298 -12203 -8269 -1435 9403 5298 -984 -1940
9306 -1940 -5202 -4889 3106 1008 -11398 -19402 -17466 -15048 -16903 -18465 -15429 -9851 -10839 -7012 -7663
9291 -7663 -15550 -20001 -22381 -15521 -9609 -9952 -9892 -8872 -6208 -2282 -6451 -9608 -11693 -14281 -15875 -18360
9275 -18360 -19444 -14991 -11964 -7134 -6840 -10571 -7546 -5226 -8099 -11609 -4447 1083 2492 -2071 -4049
9260 -4049 -6237 -7036 -7365 -9174 -12001 -15087 -10525 -7589 -2576 -2366 -4035 -8607 -7522 -2749 -843 -3288
9244 -3288 -10314 -15380 -16782 -13926 -13069 -15818 -12049 -8111 -7960 -7875 -8666 -9167 -7338 -1364 4042 1394
9228A394j68J005m049L46M41l228J143l528l716j715L501P584o12m401j883o565
9212a4451O278M918K652p79j582o998l455L884Q297L837J835K933o364K647k14
9197C438j317l489L81j904J000q563n220k509J1883O257M497k617j0082l817K306
9182i756O596o151L694M63J074J288N55L194p408O275j35r142m618J955N606K850
9166c660l403N5J527M180N33J1621J556p287l07k23r987j0420M13L629L177k614
9150a1210J776j922L390k094J073L68o145K712K368r03L015N102k688p203j335
9135a3696L510o418n66O688J4485K662n127j2207r602m17O265R07j62J0583M579
9120A484j627N798j515o060L054K175M932r434l200J270N004n11j440J080l669
$$ plain form
9228 1394 1226 2231 -1818 -1472 -1031 -4259 -3116 -6644 -10360 -12075 -8574 -990 -1602 -6003 -7886 -14451
9212 -14451 -8173 -3255 -603 -1382 -2964 -9962 -13417 -9533 -1236 2601 4436 7369 1005 3652 3438
9197 3438 2121 -1368 -987 -2891 -1891 -10454 -15674 -18183 -6300 -43 4454 1837 -8245 -12062 -9756
9182 -9756 -3160 -9311 -5617 -5154 -4080 -2792 -2237 957 -6451 -176 -311 -9453 -14071 -12116 -6510 -3660
9166 -3660 -7063 -7008 -5481 -1301 -768 10853 12409 5122 4815 4592 -5395 -15815 -15402 -11773 -8596 -11210
9150 -11210 -9434 -11356 -7966 -10060 -8987 -8619 -14764 -12052 -9684 -10587 -7572 -2470 -5158 -12361 -13696
9135 -13696 -10186 -16604 -17170 -10482 4003 6665 1538 -10669 -20271 -20688 -14423 -13516 -13678 -3095 1484
9120 1484 -143 5655 4140 -1920 1134 3309 8241 -1193 -4393 -3123 1881 1370 -70 1010 -2659
9105b659n153m71K050r0K591J837q939k703J509L738L064j368Q22J0820N097L522
9089A3667L000l538p253M396L354K07q203q810j093k554j637K493L358L585j900
9074i28Q0J641m3j0428O98M147J1943N910p99q350m20l650J675Q7l9N514M07K912
9056A0357m269L269l669o083j805L035N015L215l785j9623q910J3701Q345O124
9042D917k140j1864K632J737j807q86m585J610L235m65k666q10J254K014n889
9027a3713o438J387O601Q659O736K583l267k321l8K147J197J033k833r05J548
9012B376k987o5Q728q031j787L036K002J24n449N557O027o529n305j264J723M308
8996B464J761L899n95N906KN112n134o691N60J348n244M981O384k309l133p958
$$ plain form
9105 -2659 -7812 -8283 -6233 -6323 -3732 -1895 -10834 -13537 -12028 -8290 -5226 -6594 -5772 5048 10145 13667
9089 13667 16667 13129 5876 10272 13626 13833 5630 -3180 -4273 -6827 -8464 -5971 -2613 972 -928
9074 -928 -848 793 750 -9678 -8980 -4833 7110 13020 12221 3871 3451 -199 1476 1563 1524 7038 7445 10357
9056 10357 6088 9357 5688 -395 -2200 835 5850 9065 5280 -14343 -23253 -9552 -1207 4917
9042 4917 2777 -9087 -6455 -4718 -6525 -7411 -11996 -10386 -7151 -7616 -10282 -11092 -9838 -7824 -13713
9027 -13713 -20151 -18764 -12163 -3504 3232 5815 2548 227 189 2336 3533 4566 1733 828 2376
9012 2376 -611 -676 8052 21 -1766 1270 3272 3396 -2053 3504 9531 3002 -2303 -3567 -1844 2464
8996 2464 4225 8124 7529 13435 13437 18549 13415 6724 7284 8632 3388 8369 14753 12444 9311 1353
8980A353l018K882n328l205k301L54K764J904Q04k07K674l982m755P121R270j037
8964E293o620n873j53M257m833L981M296m411k503R86j060Q15M277K747L931K936
8948H066j102r490n095k211k424O673M069M592L86p486r64N322J059M383Q321
8933A4099K87l061q225q478J806P409l787j160j543k851q191M765R721k516o272
8918g997m157p078L173M098k362j650k284k858m051K600K662L863j697k461P271
8903a2928K480j542K634n481K388o284O424J442o76O213O691o933l252N117j166
8888d873M33M454M185n738k104q24j006l226k136J756J644j031K536m119p319
8873a7368n594N400J931P39O154K256O926Ol323L707M461k726j182J917N70k746
$$ plain form
8980 1353 -1665 1217 -4111 -7316 -9617 -9263 -6499 -4595 -3791 -3998 -1324 -5306 -10061 -2940 6330 5293
8964 5293 -1327 -7200 -7353 -3096 -7929 -3948 348 -4063 -6566 -5580 -6640 -5825 -1548 1199 5130 8066
8948 8066 6964 -2526 -7621 -9832 -12256 -5583 -1514 3078 3464 -4022 -4986 336 1395 5778 14099
8933 14099 14386 11325 3100 -5378 -3572 3837 50 -1110 -2653 -5504 -13695 -8930 791 -1725 -7997
8918 -7997 -12154 -19232 -16059 -11961 -14323 -15973 -18257 -21115 -25166 -22566 -19904 -16041 -17738 -20199 -12928
8903 -12928 -10448 -11990 -9356 -14837 -12449 -18733 -12309 -10867 -11543 -5330 1361 -5572 -8824 -3707 -4873
8888 -4873 -4440 14 4199 -1539 -3643 -4467 -5473 -8699 -10835 -9079 -7435 -8466 -5930 -10049 -17368
8873 -17368 -22962 -17562 -15631 -14892 -8738 -6482 444 450 -2873 834 5295 2569 1387 3304 3874 1128
8857A128M586N742Q64M962O922K1591K8734K7890J7735n666k4452l7584k7607
8844B4845j0784K57j293n465J00j518L077l55k150l315n631n201j632N947N098
8829A980O556P93o087j1047M77J643K795n430k88M66L778L990J071k584o630o071
8813a4588J308K659Q621O659O236j0075m412k42m05K580P22m006l933k044M378
8798f542k979o611K906J1033M98m767q56k027K523J324j739k289m418P099O192
8783f53J028K68j42J386j738K865k747j267O762L88J45q449L518O700N77m496
8767D145j799k414m620o937M911P361N458j965r346k016j335J88j313P886O148
8752D352N762P190r04m503o41J881r564p87o70m72O92N004j239N28j315l05k235
$$ plain form
8857 1128 5714 11456 12320 17282 24204 45795 74529 102419 120154 114488 90036 52452 24845
8844 24845 14061 14318 13025 7560 7660 6142 9219 8864 6714 3399 -2232 -7433 -9065 -3118 1980
8829 1980 8536 9329 3242 -7805 -7328 -5685 -2890 -8320 -8608 -8142 -4364 -374 697 -1887 -8517 -14588
8813 -14588 -13280 -10621 -2000 4659 10895 820 -3592 -3834 -4239 -1659 -937 -4943 -8876 -10920 -6542
8798 -6542 -9521 -16132 -13226 -2193 -1695 -6462 -7318 -9345 -6822 -5498 -7237 -9526 -13944 -6845 -653
8783 -653 375 643 501 1887 149 3014 267 -1000 5762 6150 6295 -2154 1364 8064 8641 4145
8767 4145 2346 -68 -4688 -11625 -6714 647 6105 4140 -5206 -7222 -8557 -8369 -9682 -1796 4352
8752 4352 10114 17304 16400 11897 11256 13137 3573 2786 2116 1644 2336 7340 6101 6629 5314 5009 2774
8735B774p001J667O136N840m344p26K971J314m750j1157k435M941J412M33l32
8720c257R121J45l555K495N680p841j365P005m80q411J810L908l921l416K008
8705g4O531n530n348Q87L3M178J175l719n69K859M199J215L036O557N685k283
8689A8832M106J700o964j0617m84O258l688m059K900K370p210r721N954O982P453
8674A3812J0602p729m992K983P8p565p358N46K452M451P870K005K815l354m827
8659A1789L632K687K78j273j398J841K282N538L314J377N919K19p717o94K930
8644C0724J342R29n819o514n922L501R134L722N780N115J660j1496j0403K02Q504
8629C0459P049k760r86N211j895R98r52J556N502k222j143O265K190o280k797
$$ plain form
8735 2774 -4227 -2560 3576 9416 5072 4346 7317 8631 3881 -7276 -9711 -4770 -3358 -2925 -3257
8720 -3257 5864 6009 2454 4949 10629 2788 1423 8428 7948 -463 1347 5255 1334 -2082 -74
8705 -74 6457 927 -4421 -3534 -3501 677 1852 -1867 -2436 423 4622 5837 8873 15430 21115 18832
8689 18832 22938 24638 17674 7057 6573 12831 9143 5084 7984 10354 3144 -6577 -623 6359 13812
8674 13812 24414 16685 11693 14676 14754 7189 -169 377 2829 7280 15150 17155 19970 16616 11789
8659 11789 15421 18108 18386 17113 15715 17556 19838 25376 28690 30067 35986 36205 28488 27794 30724
8644 30724 32066 32995 27176 20662 14740 18241 27375 31097 36877 41992 43652 32156 21753 21955 30459
8629 30459 37508 34748 33762 38973 37078 38076 37124 38680 44182 41960 40817 47082 49272 42992 40195
8614D0195L267M164p815o467J628k976n861m524P478O387M034Q283Q250L004L75
8599E9422N29K722K241L09K77J86L61R179Q513N329J0860M173P558J1691R366
8584A32716P819K851j143Q310J1861R332J1399J2083K1702K5984K5286L0420J4955
8571C13575J2507Q618n220k2407k3563l5705l4824k7154k0471j6351j1513n880
8559A31612r798j2005K343J4874K6024K7084K0902o682k1453k9367l3824k4469
8547H5241p428j1929q673K37o52j626q270j462k94K131k037r242o142J739J519
8532C3112k672l840M737P468J839M749J340M769m303n466n7j1051o489K702N054
8517C1892O03l363O9j273o448k365J409j363k278m7N295N153n866l843j895M746
$$ plain form
8614 40195 43462 47626 39811 33344 34972 31996 26135 21611 29089 35476 39510 47793 56043 59047 59422
8599 59422 59951 62673 64914 65223 65500 65686 66047 75226 83739 89068 99928 104101 111659 123350 132716
8584 132716 140535 143386 142243 150553 162414 171746 183145 195228 216930 242914 268200 298620 313575
8571 313575 326082 334700 329480 307073 283510 247805 212981 185827 165356 149005 137492 131612
8559 131612 121814 109809 112152 127026 153050 180134 201036 194354 172901 143534 109710 85241
8547 85241 77813 65884 57211 57448 56796 55170 46900 45438 45144 47275 45238 35996 29854 31593 33112
8532 33112 30440 26600 31337 38805 40644 45393 46733 51502 47199 41733 41676 30625 24136 26838 31892
8517 31892 32495 29132 29201 27928 21480 19115 20524 19161 16883 16836 22131 27284 21418 17575 15680 20426
8501B0426P242k931j042J1438k646M911k856o946m898M235k826k057j754k002
8487A8294K663R53O225n87n291K324R85j526k062M662l033R7J250n143o899m461
8471H451k07l91P982j006r744N170k71N87M699R602M780l200m678K154O17n878
8455A8667n34L007m232k47q233k35P054J251P705l81k018q219q131N280P017j1989
8439E762o644M425R646L870j849J781m10q699j480L237R61m324M95M239M90O688
8423A8188K690P895P77n978M397l109l190M02R00l417m469M219J811r47l908m540
8407A1721L982J52L106K377K72K156J1394J1343R211J4998K0833K2972K9270O165
8393A49952j7906k9468k8315j9022j7661j0293o084p576p502O310l825m520O62
$$ plain form
8501 20426 27668 24737 23695 35133 32487 37398 34542 27596 22698 26933 24107 22050 20296 18294
8487 18294 20957 21910 28135 27548 22257 24581 25566 24040 21978 26640 23607 23704 24954 19811 12912 8451
8471 8451 8244 7853 15835 14829 5085 10255 9984 10571 15270 24872 29652 26452 21774 23928 24545 18667
8455 18667 18133 21140 16908 16661 8428 8193 15247 16498 24203 23822 21804 13585 5454 10734 17751 5762
8439 5762 -882 3543 13189 17059 15210 16991 16581 7882 6402 9639 10600 6276 6771 11010 11500 18188
8423 18188 20878 28773 29550 23572 27969 24860 21670 22072 22972 19555 15086 19305 21116 20169 16261 11721
8407 11721 15703 15855 18961 21338 21610 23766 35160 46503 55714 70712 91545 114517 143787 149952
8393 149952 132046 102578 74263 55241 37580 27287 21203 13627 6125 12435 8610 4090 4752
8380D752O722N042j508j652m936O13M028j692M429o707k307J732L074n663j1279
8365e352M492M458J83k086p612K738J026L13J862L963L84M226P30N81n825o80
8349C401j060m634nK953K939k707k149n371j015k79M168J923m876j173O018k308
8333d175o162P276R38o26K517j860n388N800L610l542P698K952L147k407q668
8318A110K358o295o749k492j057P462J0129k746j767l352j483l100K981N109K511
8303B619j78Q89j104M246K512J352l93m300J971N897k032j986N233l868o873m685
8287g00L617J557p95J982l903j151L306j110m9J571J657l916J13M146p331k008
8271c014L793o205J623P84k302l015K703J310n049M20M91p06k143P542r5l617
$$ plain form
8380 4752 11474 16516 15008 13356 8420 9033 13061 11369 15798 9091 6784 8516 11590 5927 -5352
8365 -5352 -860 3598 3781 1695 -5917 -3179 -2153 -1840 22 3985 4369 8595 9325 9906 4081 3401
8349 3401 2341 -2293 -2298 655 3594 887 -1262 -6633 -7648 -7927 -3759 -1836 -6712 -7885 -1867 -4175
8333 -4175 -10337 -3061 -2123 -2749 -232 -2092 -7480 -1680 1930 -1612 6086 9038 12185 9778 1110
8318 1110 3468 -2827 -9576 -12068 -13125 -5663 4466 1720 -47 -3399 -4882 -7982 -5001 108 2619
8303 2619 2441 3330 2226 6472 8984 10336 9943 5643 7614 13511 11479 9493 14726 10858 3985 -700
8287 -700 2917 4474 3679 5661 1758 607 3913 2803 2754 4325 5982 2066 2179 6325 -1006 -3014
8271 -3014 779 -5426 -3803 -3019 -5321 -8336 -5633 -4323 -9372 -8952 -8461 -9167 -11310 -3768 -3863 -7480
8255g480q300P21O960M275j401K833J466o896Q41L801k8j858q400P299N295j420
8239b292Q66O86m465J433J624L624Q28m1P99M050O872M558k314n782M170n607
8223I009k869M367N966o99m92l76p267j1584o495K369N75r66L961R529N209l920
8207F317o324N067m701L983N98M271k683p080k644K907n513m618P6K91L509Q029
8191A485L783n027j370L962J012k335j647N89L012l590n414r946o05O127R50n03
8175i517J103K879k17l361k829R2K359N320k086l713n94N812M946K004O177P818
8159A6193q601K547K057l675k445J135M937o187j68J430k852J567m228j042l930
8144c262l545j23M389N620K686m279j03n5L969M636l277m938k761J022M709M40
$$ plain form
8255 -7480 -15780 -15059 -8099 -3824 -5225 -2392 -926 -7822 -6981 -3180 -3208 -5066 -13466 -6167 -872 -2292
8239 -2292 -1426 -740 -5205 -3772 -2148 1476 2304 2263 3062 7112 13984 18542 16228 10446 14616 9009
8223 9009 6140 10507 16473 15774 15282 14906 7639 -3945 -10440 -8071 -7496 -8462 -4501 5028 10237 6317
8207 6317 -7 5060 359 4342 4940 9211 6528 -552 -3196 -289 -5802 -10420 -10344 -10053 -6544 1485
8191 1485 5268 241 -1129 2833 3845 1510 -137 452 3464 -126 -5540 -15486 -16091 -9964 -9014 -9517
8175 -9517 -8414 -5535 -5752 -9113 -11942 -11850 -9491 -4171 -6257 -9970 -10564 -4752 194 2198 8375 16193
8159 16193 7592 10139 12196 8521 6076 7211 12148 5961 5793 7223 4371 5938 1710 668 -3262
8144 -3262 -6807 -6930 -2541 3079 5765 1486 1383 1328 5297 9933 6656 1718 -1043 -21 4688 5128
8128E128j768n891o662O078M588j468k269M467J097o92M756J934m339l805l640
8113b486K296N196j1227j2171j106O375L693O344J90k119m776L481M928K207k701
8098a876l176J067o48n033l364N46J0456M051p472m190L850N714J887n902j0275
8083a4365m024P555O117R26L651L795n52j687L14m26M708L011r062k324n00m028
8067f891J443K104K635l997n117P883N686O078n436r57N503K136J228L03j0488
8052B113n600N116l903l660m717j9Q957J1786N265n592j1216k952J109M442L863
8037D992K00j243q511j933M031N934o97r81l680l339K384N955L335M69K604k576
8021F944O309Q684M56J059m42q04n965n927J664O447L062p66l907N2j23K537O45
$$ plain form
8128 5128 3360 -2531 -9193 -3115 1473 5 -2264 2203 3300 2608 7364 9298 4959 1154 -2486
8113 -2486 -190 5006 -6221 -18392 -19498 -13123 -9430 -3086 -2896 -5015 -9791 -6310 -1382 825 -1876
8098 -1876 -5052 -3985 -4633 -9666 -13030 -12484 -2028 2023 -5449 -9639 -5789 -75 1812 -4090 -14365
8083 -14365 -18389 -10834 -4717 -3791 -140 3655 3103 1416 1730 1304 6012 9023 -39 -2363 -2863 -6891
8067 -6891 -5448 -3344 -709 -4706 -9823 -1940 3746 9824 4388 3431 8934 11070 12298 12601 2113
8052 2113 -3487 1629 -2274 -5934 -10651 -10670 -1713 10073 15338 9746 -1470 -4422 -3313 1129 4992
8037 4992 5192 3949 -4562 -6495 -2464 3470 2773 1792 -1888 -5227 -2843 3112 6447 6916 9520 6944
8021 6944 13253 21937 22393 23452 23010 22206 16241 10314 11978 18425 21487 20721 16814 16866 16743 19280 19925
8004A9925K926l988K889r9k704l037l703J54N723N892J294q48k412k793j289P864
7988B5794O435J995k220l779l818l619L437P816M872J2755O695M670J957r902
7974E3088j2158o191k648M381J484k176n59k697n900l690m077J688J996j363K301
7959B3479p084n657L120k32K173j127n168O045K097p829L701N046k076j879L528
7944A8137L623k610K005l699K176J972L595M084Q185j191K552K944M39p8l652
7929C8482n577m235l811J724l405m283m64j289o759n886K316K605R05m457n800
7914F6M770M690j88J311o149n188r99M484R513O77Q486Q415k980n462p176r171
7898E099l47n388m76J2751P953M948K555j690k329n741L69o872n750R57Q810m979
$$ plain form
8004 19925 22851 18863 21752 21653 18949 15912 12209 12363 18086 23978 25272 24424 22012 19219 17930 25794
7988 25794 32229 34224 32004 28225 24407 20788 24225 32041 36913 49668 56363 61033 62990 53088
7974 53088 40930 34739 32091 36472 37956 35780 35221 32524 26624 22934 18857 20545 22541 21178 23479
7959 23479 16395 10738 13858 13626 15799 14672 9504 15549 17646 9817 13518 18564 16488 14609 18137
7944 18137 21760 19150 21155 17456 19632 21604 25199 29283 37468 36277 38829 41773 42212 42134 38482
7929 38482 32905 28670 24859 26583 23178 18895 18431 17142 10383 4497 6813 9418 10323 5866 66
7914 66 4836 9526 9338 10649 4500 -688 -1687 2797 12310 12987 21473 29888 26908 21446 14270 5099
7898 5099 4752 -636 -1112 11639 19592 24540 27095 25405 23076 17335 17704 10832 5082 6039 14849 9870
7882I870o146m744k780Q49k512K885N446k84R78l488O078J808p394p014L304P218
7866D074j621o991k595P212N169l924R185Q81j789k3n321j1112n360q29N678O464
7850i02M358q589r55j139o260R9O485P219P416L203q85k212n428k996K495N841
7834G750n668k747l759m12R00n91l72l513R97R070l089k267K610n749j0277N31
7818a6586N078L670P293M881k451J325k107l081o595j276K104j038J666K021M913
7803a83p43J315n229j548o64j6480N261O538K655O475j294K1j546j579O400N30
7787g1p444P36J279M114K792k227k000k753p928q581P32O761P151j135m41l731
7771a2746J0790O869n581n878k506k864J722O546P749k005K36j0019o551K039
$$ plain form
7882 9870 3724 -1020 -3800 -2951 -5463 -2578 2868 2584 3562 74 6152 7960 566 -6448 -3144 4074
7866 4074 2453 -4538 -7133 79 5248 1324 10509 11390 9601 9578 4257 -6855 -12215 -13044 -7366 -902
7850 -902 3456 -5133 -6088 -7227 -13487 -13388 -6903 316 7732 10935 10050 7838 2410 -586 1909 7750
7834 7750 2082 -665 -4424 -4836 -3936 -4527 -4899 -8412 -7415 1655 -1434 -3701 -1091 -6840 -17117 -16586
7818 -16586 -11508 -7838 -545 4336 1885 3210 1103 -1978 -8573 -9849 -7745 -8783 -7117 -5096 -183
7803 -183 -926 389 -4840 -6388 -7052 -23532 -18271 -11733 -9078 -2603 -3897 -3876 -5422 -7001 -601 -71
7787 -71 -7515 -6779 -5500 -1386 1406 -821 -2821 -5574 -13502 -22083 -21351 -14590 -7439 -8574 -9015 -12746
7771 -12746 -1956 4913 -668 -6546 -9052 -11916 -10194 -3648 4101 2096 2332 -7687 -14238 -12199
7757a2199p44M150N827L508o69r16J330K592l707p685K419O88k937N063L712p22
7741b90L226k027n960l268k893Q089L685l597K995L73n262o810q28N09N314m674
7725a1418l747k980L364K322l342k667m926L078J167K367L530L01m10n065J499
7710a6927O427L817m04J433M554R28q73J105o542N8J304J042K133l584l882o319
7694a5730m214L742l995K754M52J923N523L099n877o67R213K937m336m614L360
7679f430Q311K55j154p335l468r2q90J339L247M563k291Jj214k562L398L524l357
7662d155l255K044M38K586M006o546n914q200l354K200K971M874K920L930j069
7647f524o625l03L17J0250O144j1272j2822k959K841n109N39N402K564K257M297
$$ plain form
7757 -12199 -12943 -8793 -2966 542 -127 -1043 287 2879 -828 -8513 -6094 -5406 -8343 -3280 432 -290
7741 -290 2936 909 -5051 -8319 -11212 -3123 562 -3035 -40 333 -4929 -11739 -12567 -12058 -6744 -11418
7725 -11418 -15165 -18145 -14781 -12459 -15801 -18468 -23394 -20316 -19149 -16782 -13252 -12951 -13361 -18426 -16927
7710 -16927 -10500 -6683 -7087 -5654 -1100 -172 -1045 60 -6482 -6424 -5120 -4078 -1945 -5529 -9411 -15730
7694 -15730 -19944 -16202 -20197 -17443 -16991 -15068 -9545 -6446 -12323 -12990 -3777 -840 -5176 -9790 -6430
7679 -6430 1881 2136 982 -6353 -9821 -9913 -10803 -9464 -6217 -1654 -3945 -3944 -5158 -7720 -4322 -798 -4155
7662 -4155 -7410 -5366 -4928 -2342 1664 -4882 -10796 -18996 -22350 -20150 -17179 -12305 -9385 -5455 -6524
7647 -6524 -13149 -13452 -13135 -2885 3259 -8013 -20835 -23794 -20953 -26062 -25523 -20121 -17557 -15300 -11003
7632a1003M337K09o937r20M177N207p157m565L284M516j356j827m274r8N54K915
7616a2938j022l101n85L704P135N763K916n434L720m564q649m282j175J792O153
7601a0567K652K392M75L71l215M92P678J700k35K802l530k27M511M361m018p496
7585a854L440N041o773q495q28J983J08K316M674N03K461J093M059j53l22j316
7569E937j897j385l733k938L027n916j082j138K01j132J113m487O832J809N225
7554D36K022o212o891P97J366k286P527l49o666o999O644K607j148k701M33j133
7538a2553r20Q191q760l295j579l512p631Q401N246O576N099L048p149r2k587
7523a1517m653M9L489J629K273J377l716o249M11O073N538L76m592o423J797L844
$$ plain form
7632 -11003 -6666 -6457 -13394 -14314 -10137 -4930 -12087 -16652 -13368 -8852 -10208 -12035 -16309 -16407 -15853 -12938
7616 -12938 -13960 -17061 -17646 -13942 -6807 -1044 1872 -3562 158 -4406 -13055 -17337 -18512 -16720 -10567
7601 -10567 -7915 -5523 -5048 -4677 -7892 -7400 278 1978 1743 4545 1015 788 5299 9660 5642 -1854
7585 -1854 1586 6627 -146 -8641 -9469 -7486 -7378 -5062 -388 115 2576 3669 7728 7575 7253 5937
7569 5937 4040 2655 -1078 -4016 -989 -6905 -7987 -9125 -8924 -10056 -8943 -13430 -6598 -4789 436
7554 436 2458 -3754 -10645 -9848 -8482 -10768 -3241 -3590 -10256 -17255 -10611 -8004 -9152 -11853 -11420 -12553
7538 -12553 -13473 -5282 -14042 -17337 -18916 -22428 -30059 -21658 -16412 -9836 -4737 -1689 -8838 -8930 -11517
7523 -11517 -16170 -16121 -12632 -11003 -8730 -7353 -11069 -17318 -16907 -10834 -5296 -4920 -9512 -15935 -14138 -10294
7507a0294n70k769J855J560LL067n84P05j329m3L13m610K913J257J691J91N765
7490h79N69l536n759m647j105m234m635K874L681L285j232J331O781m191J165
7475a0532L011j536P762r97p427m291r9L385j018L766O676r1J196j1127q570K865
7459a7027K479M247k81J01R246O275l823l983l568n508p089L600P004L439r74
7444e862P22P25l88O062P056j343m632p195l636L931L207P093J404l7L602p182
7428C527q392k422k16k010n300M51l12M469N811Q371n729r172j031l223M624O929
7412c625K861l396l070l410K48o07K070N030O131p86l184K602n509o667J744q84
7396a0452R88L769l656n885K324J267L049j422m692m698r71J407M406M205M737
$$ plain form
7507 -10294 -10864 -13633 -11778 -10218 -10215 -7148 -7732 -7027 -8356 -8399 -8086 -12696 -9783 -8526 -6835 -6644 -879
7490 -879 -310 -3846 -9605 -14252 -15357 -19591 -24226 -21352 -17671 -14386 -15618 -14287 -7506 -11697 -10532
7475 -10532 -7521 -9057 -1295 -2292 -9719 -14010 -14109 -10724 -11742 -7976 -1300 -1391 -195 -11322 -19892 -17027
7459 -17027 -14548 -10301 -10582 -10481 -1235 5040 1217 -2766 -6334 -11842 -18931 -15331 -8327 -4888 -5862
7444 -5862 -5140 -4415 -4803 1259 8315 6972 2340 -4855 -8491 -4560 -1353 5740 7144 7107 10709 3527
7428 3527 -4865 -7287 -7503 -9513 -14813 -14362 -14674 -10205 -4394 3977 -1752 -10924 -11955 -15178 -10554 -3625
7412 -3625 -764 -4160 -7230 -10640 -10392 -10999 -8929 -3899 2232 1446 -1738 864 -4645 -11312 -9568 -10452
7396 -10452 -9464 -5695 -9351 -15236 -12912 -11645 -8596 -10018 -14710 -19408 -20379 -18972 -14566 -10361 -5624
7381e624p749j554L243k390J787k166k273N960K931O676M829m445m243l641J298
7366g361M74O468j279o169M88K654j36j0179l421L203r61N168M092N224n273l201
7350a0209q07R289m127k302n67m340L039O510j091r135j822J1163K253m564n243
7335a1953k50L113N352K38R26q8j904l085J521j390m222k013L294O425j336o093
7319a1465n715K559k6k600n211K982q65M87N070j190J50J256P422J164k756M23
7303h315J599K48L405N190N61j730m876n08q25J519l789l773j732k443n69P095
7287h943N459l607j342r85k099p67k274l000Q34M076N02j089N408K229L033j288
7271c853K739N482P56k702o177m142m690p925j134M909K305O608k88J492n035
$$ plain form
7381 -5624 -13373 -14927 -11684 -14074 -12287 -14453 -16726 -10766 -7835 -1159 3670 -775 -5018 -8659 -7361
7366 -7361 -6887 -419 -1698 -7867 -7379 -4725 -4861 -15040 -18461 -15258 -16219 -11051 -6959 -1735 -7008 -10209
7350 -10209 -11016 -1727 -5854 -8156 -8723 -13063 -10024 -3514 -4605 -13740 -15562 -4399 -2146 -6710 -11953
7335 -11953 -12203 -9090 -3738 -3500 -2574 -2662 -4566 -7651 -6130 -7520 -11742 -13755 -10461 -4036 -5372 -11465
7319 -11465 -17180 -14621 -14647 -17247 -22458 -19476 -20341 -19854 -14784 -15974 -15824 -14568 -7146 -5982 -8738 -8315
7303 -8315 -6716 -6468 -3063 2127 2688 958 -3918 -4426 -5251 -3732 -7521 -11294 -13026 -15469 -16038 -8943
7287 -8943 -3484 -7091 -8433 -9418 -11517 -12284 -14558 -17558 -16724 -12648 -12146 -13235 -7827 -5598 -2565 -3853
7271 -3853 -1114 4368 5124 2422 -3755 -7897 -12587 -20512 -21646 -16737 -14432 -7824 -8112 -6620 -11655
7256a1655L367K442O165r63n104J008J660m025r506l62K990L175n47J009L89k340
7240a2297l036K708J934O547N846O315o738l907Q4k21J168p722k853R50J925K798
7224f499L552Q50J294J963j241k170K804J004j704j409p60k541p024K198N208
7209d475Q736K118J56l872k284n875k766J521L317n44q172J114K643J995l217
7194i605j633k03k586l200m231L996M746O164j300N085p04K54q13J916q06J905
7178a015n194m664N806J919n034r800j816J017L913N150P827k677K728n148J67
7163f821K13l675J477L005j134K583O364q18k711M060Q239o829o716k731J504
7148c990o0o00j645j829N42r73M330p386n659j864Q885M158J065J881o807m342
$$ plain form
7256 -11655 -8288 -5846 319 -644 -5748 -4740 -3080 -7105 -16611 -16973 -13983 -10808 -11355 -10346 -9957 -12297
7240 -12297 -15333 -12625 -10691 -4144 1702 8017 1279 -2628 -2544 -2765 -1597 -9319 -12172 -11222 -9297 -6499
7224 -6499 -2947 -2097 -803 1160 -81 -2251 553 1557 -147 -1556 -2316 -4857 -11881 -9683 -4475
7209 -4475 4261 6379 6535 2663 379 -5496 -8262 -6741 -3424 -3968 -12140 -11026 -8383 -6388 -9605
7194 -9605 -11238 -11441 -14027 -17227 -21458 -17462 -12716 -6552 -7852 -2767 -3471 -3217 -4030 -2114 -2920 -1015
7178 -1015 -6209 -10873 -5067 -3148 -8182 -17982 -19798 -18781 -14868 -9718 -1891 -4568 -1840 -6988 -6821
7163 -6821 -6608 -10283 -8806 -5801 -6935 -4352 2012 1194 -1517 2543 10782 3953 -2763 -5494 -3990
7148 -3990 -4050 -4650 -6295 -8124 -7582 -8555 -4225 -11611 -17270 -19134 -10249 -6091 -5026 -3145 -9952 -14294
7132a4294P852Q313L886J170R94j950m510q223l170K359k13k257k404O841j99
7117e805l258k589K548m515j111Q756P422p912n024k001p841K508k005Q094K961
7102i772L823J551M065L210J079p261m716p82k781O249N941O018l502n207q79
7087b964j138N304P81o335L292Q18L711r225N38L208J819j572l333Q44L743p24
7071a233k885j093J091J101l052N179l57l311j2848l95M43O42Q497L257k504J215
7055f253m305M565O459q335n346M63P356N064j441Q10O322N475l743q492l054
7040d455k428L01k592J901m138m736m298J026N479K620l539j705k692K628j949
7025a8577j108M329P436O78k739j228K974K65P774M105o001l839k815L419n96
$$ plain form
7132 -14294 -6442 1871 5757 6927 7921 5971 1461 -6762 -9932 -7573 -7786 -10043 -12447 -5606 -5805
7117 -5805 -9063 -11652 -9104 -13619 -14730 -5974 1448 -6464 -11488 -13489 -21330 -18822 -20827 -12733 -9772
7102 -9772 -5949 -4398 -333 2877 3956 -3305 -8021 -8803 -11584 -5335 606 6624 3122 -2085 -2964
7087 -2964 -4102 1202 1983 -4352 -1060 -242 3469 -5756 -5218 -2010 -191 -1763 -5096 -4252 -509 -1233
7071 -1233 -4118 -5211 -4120 -3019 -6071 -892 -1249 -4560 -17408 -17803 -17360 -16718 -8221 -4964 -7468 -6253
7055 -6253 -10558 -5993 466 -7869 -13215 -12752 -5396 -332 -1773 -963 5359 10834 7091 -1401 -4455
7040 -4455 -6883 -6582 -9174 -7273 -11411 -16147 -20445 -19419 -13940 -11320 -14859 -16564 -19256 -16628 -18577
7025 -18577 -19685 -15356 -7920 -7242 -9981 -11209 -8235 -7970 -196 3909 -2092 -5931 -8746 -5327 -5923
7010e923m573j488L278K174K42J349r469k773K612M793J512O215J290j212l022
6995d995l051k239L45q8J941O862O17p725o354j651O281P848K177l105L02k893
6979e728n619o086K124P368M588m197q023j873R41K933O542L332l748m81n277
6964a3204n01M815k569N149j306j552P28j61k672l913j82P128J0621m624n880
6949h123O951N815l737k924n146J631qj124L051m716J286k037p00K312K060m973
6933a0382r32M031O680j625n775n735p797M607M967J470K236j779k544N986M034
6918b558l103n93m794k854q68K538j732O89K256j671N908M314n207j683K484j55
6902g029J53M99K78O309l066N81l459k87J372L560M696R141k232p801q67P14M495
$$ plain form
7010 -5923 -10496 -11984 -8706 -6532 -6290 -4941 -14410 -17183 -14571 -9778 -8266 -2051 -761 -1973 -4995
6995 -4995 -8046 -10285 -9940 -10028 -8087 -1225 -608 -8333 -14687 -16338 -10057 -2209 -32 -3137 -2835 -5728
6979 -5728 -11347 -17433 -15309 -7941 -3353 -7550 -15573 -17446 -16505 -13572 -7030 -3698 -7446 -7927 -13204
6964 -13204 -13705 -8890 -11459 -6310 -7616 -9168 -8440 -8601 -11273 -15186 -15368 -8240 2381 -2243 -8123
6949 -8123 -1172 4643 906 -2018 -7164 -5533 -5541 -6665 -3614 -8330 -7044 -9081 -9781 -7469 -5409 -10382
6933 -10382 -11314 -7283 -603 -2228 -8003 -13738 -21535 -16928 -11961 -10491 -8255 -10034 -12578 -6592 -2558
6918 -2558 -5661 -6254 -11048 -13902 -14770 -12232 -13964 -13275 -11019 -12690 -6782 -2468 -7675 -9358 -6874 -7029
6902 -7029 -6876 -6377 -6099 210 -2856 -2275 -5734 -6021 -4649 -1089 3607 12748 10516 2715 1848 2562 7057
6885G057k77p058k938k50L401n299K356R8P37k079m085m339K012j718O105R044
6869B767J825j119r430q268K941M823N426O84j746p301L021N873l319m516r056
6854a7395M58P231J3139K376J413m339l092K801m169l721J996K395N42l813n985
6839a0163l540N3J121N061K525l338K234L351J01j925l075N72p61n554J339Q655
6823c344M255M589L699L227k48q23n62j2296J267M068K533n592Q43n15j826O40
6807h5K492K203k099k392j499O300J686o260k218n241r122r71m22n130p65N551
6791a7972O821L451q782q648Q650R412L087L228o963k234l576J02M14O117L741
6776c152n108K173q21K752L395k843n890P80P68o98K993N828m026m51j064L850
$$ plain form
6885 7057 6780 -278 -3216 -3466 -65 -5364 -3008 -2910 -2173 -4252 -8337 -12676 -10664 -12382 -6277 2767
6869 2767 4592 3473 -5957 -14225 -11284 -6461 -1035 -351 -2097 -9398 -6377 -504 -3823 -8339 -17395
6854 -17395 -16937 -9706 3433 5809 7222 2883 -209 2592 -1577 -5298 -3302 -907 -365 -4178 -10163
6839 -10163 -13703 -13650 -12529 -7468 -4943 -8281 -6047 -2696 -2595 -4520 -7595 -7023 -7784 -13338 -11999 -3344
6823 -3344 911 5500 9199 12426 12178 11355 10793 -1503 -236 3832 6365 773 1616 1101 -725 -85
6807 -85 2407 4610 2511 119 -1380 4920 6606 346 -1872 -7113 -16235 -17206 -17628 -22758 -23523 -17972
6791 -17972 -11151 -7700 -16482 -25130 -16480 -7068 -3981 -753 -7716 -9950 -13526 -13424 -13010 -6893 -3152
6776 -3152 -8260 -6087 -6908 -4156 -761 -3604 -9494 -8714 -7946 -8644 -5651 177 -3849 -4300 -5364 -1514
6760a514o40n936m963K890P96o836J715K006n003O048P606K781j646q46k142J356
6744d328j564l486n598M456P762j936j836n946m556J0515K356m781m984j668O467
6729i127J622J118k42k514o643Q360L857q691M795Q199P354N230L169j810j0614
6714D063K033k72P63M836K913j869l389R330M824n45M166R044M822P898J8706
6699F7323K0842J2493q601k2214j5841j7932j8698q249n56N69k526k438j629N79
6685C122m76r32k00k585m212k118l255L609O797n54L613l813n286L210J687j29
6669a522p16j895J547q17K542J781l856r691p026O483P863M367N949p848p731
6654a0570J131k346L110j297n585l60j375O110J2214L246m910l97J809p345k98
$$ plain form
6760 -1514 -2154 -8090 -13053 -10163 -9367 -16203 -14488 -12482 -17485 -11437 -3831 -1050 -2696 -3542 -5684 -4328
6744 -4328 -5892 -9378 -14976 -10520 -2758 -4694 -6530 -12476 -17032 -6517 -4161 -8942 -13926 -15594 -9127
6729 -9127 -7505 -6387 -6629 -9143 -15786 -7426 -3569 -12260 -7465 734 8088 13318 16487 14677 4063
6714 4063 6096 5824 6587 11423 14336 12467 9078 18408 23232 22687 26853 35897 40719 48617 67323
6699 67323 88165 100658 92057 69843 54002 36070 17372 9123 8567 9136 6610 4172 2543 3122
6685 3122 2646 1714 1514 -1071 -5283 -7401 -10656 -7047 -250 -804 2809 -1004 -6290 -3080 -1393 -1522
6669 -1522 -2238 -4133 -2586 -3403 -861 920 -2936 -12627 -19653 -13170 -5307 -940 5009 -2839 -10570
6654 -10570 -9439 -11785 -8675 -9972 -15557 -15917 -17292 -11182 1032 4278 -632 -1029 780 -6565 -6863
6639f863K246n80K426l781L240m52l537n499K81O663J0845L76o398l604M622K212
6623B197o55l326r5n6m184j0545n357J86N526O667Q75K934O699Q285J706n717
6607E140l677J161o640j171N601m65o805j429m893J567P167k24J076k493k981
6592i066j388k423L89M287L306M116m69O510K731K648o173l504k75M689K957l278
6576E057L571m158m124m540l670j995j828M57O583N438K674j347o42l03l037K104
6560B40l642k934L495L22P99m081N015L81M48p308n094j336Q545N281J607m419
6544b681k089j916k449o85K498K582K508k537p898n373L108K181n770J06N534
6529a2881R052J617n432l316k785L206N312J861J530o237k531r40k907M605O942
$$ plain form
6639 -6863 -4617 -5197 -2771 -6552 -3312 -3764 -7301 -12800 -12519 -5856 4989 5365 -1033 -4637 -15 2197
6623 2197 1542 -1784 -1879 -1935 -6119 -16664 -22021 -21835 -16309 -9642 -8767 -5833 866 9151 10857 5140
6607 5140 1463 2624 -4016 -5187 414 -51 -6856 -8285 -13178 -11611 -4444 -4668 -3592 -6085 -9066
6592 -9066 -10454 -12877 -12488 -8201 -4895 -779 -1248 5262 7993 10641 4468 964 689 5378 8335 5057
6576 5057 8628 4470 346 -4194 -7864 -9859 -11687 -11230 -4647 791 3465 2118 1476 1173 -1864 240
6560 240 -3402 -6336 -2841 -2519 -1720 -5801 -786 -405 43 -7265 -12359 -13695 -5150 131 1738 -2681
6544 -2681 -4770 -6686 -9135 -9820 -7322 -4740 -2232 -4769 -12667 -18040 -14932 -12751 -18521 -18415 -12881
6529 -12881 -3829 -2212 -7644 -10960 -13745 -10539 -5227 -3366 -1836 -8073 -10604 -11544 -14451 -9846 -2904
6514b904J100L313J159q70j673k444l286l39N157L959j951n786k962j303K366
6499f464R65m877L249N591j350l458j966K831L784N48k013M380J508J702l288
6484A142k193J247J894n476q581L67O290K741L108m479k283K041L318m134P32
6469d266N757m567j648K005L155o17m903J222m458J440K108L738o562k83N080
6454b799Q42p0M530L363r99o672q640q129k64J0236O766J192j853q780M637P135
6438D95j591k896p06n003m320J193k254m573O920K925L582j107j0811K33K592
6423a5321j276L120M133M534j819m027k046N84M711L397K297n570m206N614J191
6408d684l33L367n350N96l460N87J972O891j262l882j473L099J84K238M414l99
$$ plain form
6514 -2904 -1804 1509 2668 1798 125 -2319 -5605 -5944 -787 3172 1221 -4565 -7527 -8830 -6464
6499 -6464 -5499 -10376 -7127 -1536 -2886 -6344 -8310 -5479 -1695 -1147 -3160 1220 2728 4430 1142
6484 1142 -1051 196 2090 -3386 -11967 -11600 -5310 -2569 539 -3940 -6223 -4182 -864 -4998 -4266
6469 -4266 1491 -3076 -4724 -2719 436 -181 -5084 -3862 -8320 -6880 -4772 -1034 -7596 -7879 -2799
6454 -2799 -1957 -2027 2503 5866 4867 -1805 -10445 -18574 -18838 -8602 -1836 -644 -2497 -11277 -6640 495
6438 495 -1096 -3992 -4698 -9701 -14021 -12828 -15082 -19655 -12735 -9810 -6228 -7335 -18146 -17913 -15321
6423 -15321 -16597 -13477 -9344 -4810 -6629 -10656 -12702 -12118 -7407 -4010 -1713 -7283 -11489 -5875 -4684
6408 -4684 -5017 -1650 -7000 -6404 -9864 -9277 -7305 -414 -1676 -5558 -7031 -3932 -3748 -1510 2904 2505
6392B505j832L349k770q695o10j298q96M296n94l48m670K926K676K904K768j439
6376a728m933p33J312o29N49P427Q364n923l586R05K20l08n273m480K086j200
6360g930m462K715K848K861J178k801K166J788k372L514o89O148Q922k946j2276
6345a336p826l841J17J278Q345k14J761l779n848n278k564N653N863K269k159
6330g559R77K708O814L38m077n160l058O887M97L616J190k100Q11k616m494j533
6314f759O156L672K862q17J657j457m129N73l20k500l73M487k066m266L079o15
6298h16rq66K900l92M818j336j0292J942N156m07m451k999j0334O131J0315k896
6282c536k550n07L231M40j430k208n59R16j36J906P092m030l63j628j874J16P211
$$ plain form
6392 2505 673 4022 1252 -7443 -8053 -9351 -10247 -5951 -6545 -6893 -11563 -8637 -5961 -3057 -289 -1728
6376 -1728 -6661 -7394 -6082 -6711 -6162 1265 9629 3706 120 1025 1245 937 -4336 -8816 -6730 -7930
6360 -7930 -12392 -9677 -6829 -3968 -2790 -5591 -3425 -1637 -4009 -495 -1184 4964 13886 10940 -1336
6345 -1336 -9162 -13003 -12886 -11608 -3263 -3477 -1716 -5495 -11343 -16621 -19185 -13532 -7669 -5400 -7559
6330 -7559 -6582 -3874 2940 3278 -799 -5959 -9017 -2130 -1633 1983 3173 1073 1884 -732 -5226 -6759
6314 -6759 -603 3069 5931 5114 6771 5314 1185 1758 1438 -1062 -1435 3052 986 -3280 -201 -816
6298 -816 -825 -1691 1209 817 5635 4299 -5993 -4051 1105 698 -3753 -6752 -17086 -10955 -640 -3536
6282 -3536 -6086 -6593 -3362 -2922 -4352 -6560 -7119 -6203 -6339 -4433 2659 -1371 -1734 -3362 -5236 -5120 2091
6265B091p206l573K006O35Q286L733l110k323L375K746n46k029j3469k503M967
6250f920N408k52m47J81N55L913L985K361j310k327l575K756L287P3l190k33o375
6233b110k906N708j172k842m738L863L754l819N84J40l664K909J626J807l602
6218d462l082j653L021K182l142L11l480L565O365o82k256J08K498J419p310q45
6202g443P096L071O08j282j701l126p744N454J0929O576l395o221K580m237n476
6187d311O83P220K236m072j3924m548O703O962P50m187P29N03P103p61m435j166
6171d515l889m282L574R877M157r61l732m942M419P479p504l879j844N225jo349
6155g167l848j065O023M484L858M418L380m061m708n248m263j82M592J458L627
$$ plain form
6265 2091 -5115 -8688 -6682 -6047 2239 5972 2862 539 3914 6660 6114 4085 -9384 -11887 -6920
6250 -6920 -1512 -1764 -2211 -2030 -1475 2438 6423 8784 7474 5147 1572 4328 7615 7688 4498 4265 -2110
6233 -2110 -5016 692 -480 -3322 -8060 -4197 -443 -4262 -3678 -3538 -7202 -4293 -2667 -860 -4462
6218 -4462 -7544 -9197 -6176 -3994 -7136 -6825 -10305 -6740 -375 -1057 -3313 -3205 -707 712 -6598 -7443
6202 -7443 -347 2724 3332 2050 349 -2777 -10521 -5067 5862 12438 9043 2822 5402 1165 -4311
6187 -4311 -3628 3592 5828 1756 -12168 -16716 -10013 -3051 -2301 -6488 -5759 -5256 1847 1086 -3349 -4515
6171 -4515 -8404 -12686 -9112 765 4922 3961 229 -4713 -294 7185 -319 -4198 -6042 -817 -818 -7167
6155 -7167 -11015 -12080 -6057 -1573 2285 6703 10083 6022 1314 -3934 -8197 -8379 -3787 -2329 1298
6140A298j032m305j063k641l909M400J0346m27q99o036R30J946O362p560q0L993
6124A323M603P891j310k523j562M24k148p71L13p377n534m247j523N938J2492
6109E989K965n15J571o259j622O290M133q274j1721o750M789P291J529o002n135
6094a1721L455m69m23O297p38N919K590N25J438l145J260l000J13K05m519n696
6078g909N374M270N91k917o082M85k492n781N9L50J902l974k230M874N191N23
6062g766L391J307k08m522k700J966k70q595J228J900J758J837n117N323O086
$$ plain form
6140 1298 266 -4039 -5102 -7743 -11652 -7252 3094 2667 1768 -4268 -3338 -1392 4970 -2590 -2670 1323
6124 1323 5926 13817 12507 9984 8422 8846 6698 5927 6240 -1137 -6671 -10918 -12441 -6503 5989
6109 5989 8954 8439 10010 3751 2129 8419 12552 4278 -7443 -14193 -9404 -2113 -584 -6586 -11721
6094 -11721 -8266 -8735 -9158 -2861 -3599 2320 4910 5435 6873 3728 4988 1988 2101 2306 -2213 -7909
6078 -7909 -2535 1735 2326 -591 -6673 -6188 -8680 -14461 -14402 -14052 -12150 -16124 -18354 -13480 -8289 -7766
6062 -7766 -4375 -3068 -3276 -7798 -10498 -8532 -8802 -17397 -16169 -14269 -12511 -10674 -15791 -10468 -4382
$$ [...]
##END NTUPLES=NMR SPECTRUM
##END=
