##TITLE=Analysis number 324994
Compound Code cc 17446
Project Code adrs
Chemist Name ugmt ltd
##JCAMPDX= 6.0         $$ Bruker NMR JCAMP-DX V2.0
##DATA TYPE= NMR SPECTRUM
##DATA CLASS= NTUPLES
##ORIGIN= Bruker BioSpin GmbH
##OWNER= nmr
$$ XWIN-NMR		Version 3.5
$$ Wed Dec  6 11:06:24 2006 GMT Standard Time (UT+0h)  MAYBRIDGE\nmr@NMR_250MHZ
##.OBSERVE FREQUENCY= 250.131544655141
##.OBSERVE NUCLEUS= ^1H
##.ACQUISITION MODE= SIMULTANEOUS (DQD)
##.ACQUISITION SCHEME= undefined
##.AVERAGES= 16
##.DIGITISER RES= 18
##SPECTROMETER/DATA SYSTEM= dpx250
##.PULSE SEQUENCE= zg30
##.SOLVENT NAME= CDCl3
##.SHIFT REFERENCE= (INTERNAL, CDCl3, 0, 16.4509)
##AUDIT TRAIL= $$ (NUMBER, WHEN, WHO, WHERE, WHAT)
$$ ##TITLE= Audit trail, XWIN-NMR		Version 3.5
$$ ##JCAMPDX= 5.01
$$ ##ORIGIN= Bruker BioSpin GmbH
$$ ##OWNER= nmr
$$ C:\u/data/dgb/nmr/ADRS/410/pdata/1/auditp.txt
$$ ##AUDIT TRAIL=  $$ (NUMBER, WHEN, WHO, WHERE, WHAT)
(   1,<2006-12-06 11:06:03.03 +000>,<MAYBRIDGE\nmr>,<NMR_250MHZ>,
      <created by zg, POWCHK disabled, PULCHK disabled
       configuration hash MD5:
       49 4B E0 1D 92 C2 6B 37 9F E6 65 BC 52 41 86 1D
       data hash MD5: 64K
       4D 64 99 02 E2 E2 FE 19 18 F9 01 BA 97 D1 F2 D4>)
(   2,<2006-12-06 11:06:15.17 +000>,<MAYBRIDGE\nmr>,<NMR_250MHZ>,
      <Start of raw data processing
       ef LB = 0.3 FT_mod = 6 PKNL = 1 SI = 32K 
       data hash MD5: 32K
       D7 33 C8 61 8B 1D 9D D9 BF A5 61 D8 D5 C3 63 68>)
(   3,<2006-12-06 11:06:16.75 +000>,<MAYBRIDGE\nmr>,<NMR_250MHZ>,
      <apk 
       data hash MD5: 32K
       77 5C C5 FD E3 59 3E 4E 02 96 F0 92 37 3F 95 89>)
(   4,<2006-12-06 11:06:17.40 +000>,<MAYBRIDGE\nmr>,<NMR_250MHZ>,
      <abs ABSG = 5 
       data hash MD5: 32K
       97 66 0F CA 6D 8C 7F F7 83 21 A7 D5 E6 EA 23 61>)
$$ ##END=
$$ 
$$ hash MD5
$$ 03 F9 3F 51 A2 AC D0 33 63 8C 04 94 7A 0E C7 05
##$RELAX= 
##$RELAX= 
##$RELAX= 
##$RELAX= 
##$RELAX= 
##$RELAX= 
##$RELAX= 
$$ Bruker specific parameters
$$ --------------------------
##$DU= <C:\u>
##$EXPNO= 410
##$NAME= <ADRS>
##$PROCNO= 1
##$TYPE= <nmr>
##$USER= <dgb>
##$AMP= (0..31)
100 100 100 100 100 100 100 100 100 100 100 100 100 100 100 100 100 100 
100 100 100 100 100 100 100 100 100 100 100 100 100 100 
##$AQSEQ= 0
##$AQ_mod= 3
##$AUNM= <au_zg>
##$AUTOPOS= <40 >
##$BF1= 250.13
##$BF2= 250.13
##$BF3= 250.13
##$BF4= 250.13
##$BF5= 500.13
##$BF6= 500.13
##$BF7= 500.13
##$BF8= 500.13
##$BYTORDA= 1
##$CFDGTYP= 0
##$CFRGTYP= 5
##$CHEMSTR= <none>
##$CNST= (0..31)
1 1 145 1 1 1 1 1 1 1 1 1 1 1 1 1 1 1 1 1 1 1 1 1 1 1 1 1 1 1 1 1 
##$CPDPRG= <>
##$CPDPRG1= <>
##$CPDPRG2= <>
##$CPDPRG3= <>
##$CPDPRG4= <mlev>
##$CPDPRG5= <mlev>
##$CPDPRG6= <mlev>
##$CPDPRG7= <mlev>
##$CPDPRG8= <mlev>
##$CPDPRGB= <>
##$CPDPRGT= <>
##$D= (0..31)
0 1 0 0 0 0 0 0 0 0.06 0 0 0 0 0 0 0.0002 0 0 0 0 0 0 0 0 0 0 0 0 0 0 
0 
##$DATE= 1165403161
##$DBL= (0..7)
120 120 120 120 120 120 120 120 
##$DBP= (0..7)
150 150 150 150 150 150 150 150 
##$DBP07= 0
##$DBPNAM0= <>
##$DBPNAM1= <>
##$DBPNAM2= <>
$$ [...]
##$SUBNAM7= <"">
##$SUBNAM8= <"">
##$SUBNAM9= <"">
##$SW= 20.6930455092707
##$SWIBOX= (0..15)
0 0 3 0 0 0 0 0 0 0 0 0 0 0 0 0 
##$SW_h= 5175.983436853
##$TD= 65536
##$TD0= 1
##$TE= 295.16
##$TE2= 300
##$TE3= 300
##$TEG= 300
##$TL= (0..7)
0 120 120 120 120 120 120 120 
##$TP= (0..7)
150 150 150 150 150 150 150 150 
##$TP07= 0
##$TPNAME0= <>
##$TPNAME1= <>
##$TPNAME2= <>
##$TPNAME3= <>
##$TPNAME4= <>
##$TPNAME5= <>
##$TPNAME6= <>
##$TPNAME7= <>
##$TPOAL= (0..7)
0.5 0.5 0.5 0.5 0.5 0.5 0.5 0.5 
##$TPOFFS= (0..7)
0 0 0 0 0 0 0 0 
##$TUNHIN= 0
##$TUNHOUT= 0
##$TUNXOUT= 0
##$USERA1= <user>
##$USERA2= <user>
##$USERA3= <user>
##$USERA4= <user>
##$USERA5= <user>
##$V9= 5
##$VALIST= <valist>
##$VCLIST= <CCCCCCCCCCCCCCC>
##$VD= 0
##$VDLIST= <DDDDDDDDDDDDDDD>
##$VPLIST= <PPPPPPPPPPPPPPP>
##$VTLIST= <TTTTTTTTTTTTTTT>
##$WBST= 1024
##$WBSW= 4
##$XGAIN= (0..3)
0 0 0 0 
##$XL= 0
##$YL= 0
##$YMAX_a= 302495
##$YMIN_a= -369618
##$ZGOPTNS= <>
##$ZL1= 120
##$ZL2= 120
##$ZL3= 120
##$ZL4= 120
##$ABSF1= 16.45088
##$ABSF2= -4.242292
##$ABSG= 5
##$ABSL= 3
##$ALPHA= 0
##$AQORDER= 0
##$ASSFAC= 0
##$ASSFACI= 0
##$ASSFACX= 0
##$ASSWID= 0
##$AUNMP= <proc_1d>
##$AZFE= 0.1
##$AZFW= 0.1
##$BCFW= 0
##$BC_mod= 0
##$BYTORDP= 0
##$COROFFS= 0
##$CY= 12.5
##$DATMOD= 1
##$DC= 0
##$DFILT= <>
##$DTYPP= 0
##$F1P= 14.0000005364418
##$F2P= -0.99999901652339
##$FCOR= 0.5
##$FTSIZE= 32768
##$FT_mod= 6
##$GAMMA= 0
##$GB= 0
##$INTBC= 1
##$INTSCL= 1
##$ISEN= 128
##$LB= 0.3
##$LEV0= 0
##$LPBIN= 0
##$MAXI= 10000
##$MC2= 0
##$MEAN= 0
##$ME_mod= 0
##$MI= 0
##$NCOEF= 0
##$NC_proc= -4
##$NLEV= 6
##$NOISF1= 0
##$NOISF2= 0
##$NSP= 0
##$NTH_PI= 0
##$NZP= 0
##$OFFSET= 16.45088
##$PC= 1
##$PHC0= 226.4898
##$PHC1= 2.646867
##$PH_mod= 1
##$PKNL= yes
##$PPARMOD= 0
##$PSCAL= 4
##$PSIGN= 0
##$REVERSE= no
##$SF= 250.130017786721
##$SI= 32768
##$SIGF1= 0
##$SIGF2= 0
##$SINO= 400
##$SIOLD= 32768
##$SREGLST= <1H.CDCl3>
##$SSB= 0
##$STSI= 32768
##$STSR= 0
##$SW_p= 5175.98343685301
##$SYMM= 0
##$S_DEV= 0
##$TDeff= 65536
##$TDoff= 0
##$TI= <Analysis number 999999
Compound Code 99
Book Reference 9
Project Code 9>
##$TILT= no
##$TM1= 0
##$TM2= 0
##$TOPLEV= 0
##$USERP1= <user>
##$USERP2= <user>
##$USERP3= <user>
##$USERP4= <user>
##$USERP5= <user>
##$WDW= 1
##$XDIM= 32768
##$YMAX_p= 402415879
##$YMIN_p= -112700
$$ End of Bruker specific parameters
$$ ---------------------------------
##NTUPLES= NMR SPECTRUM
##VAR_NAME=  FREQUENCY,     SPECTRUM/REAL,   SPECTRUM/IMAG
##SYMBOL=    X,             R,               I
##VAR_TYPE=  INDEPENDENT,   DEPENDENT,       DEPENDENT
##VAR_FORM=  AFFN,          ASDF,            ASDF
##VAR_DIM=   32768,         32768,           32768
##UNITS=     HZ,            ARBITRARY UNITS, ARBITRARY UNITS
##FACTOR=    0.157963299565203, 1,           1
##FIRST=     4114.85891967859, 0,            0
##LAST=      -1061.12451717442, 0,           0
##MIN=       -1061.12451717442, -112700,     0
##MAX=       4114.85891967859, 402415879,    0
$$ Real data points
##PAGE= N=1
##DATA TABLE= (X++(R..R)), XYDATA
$$ [...]
20446 -25743 -21160 -14254 6975 18591 -10870 -18159 -9199 -4419 -12101 1467 10151 -2068 -3368
20433 -3368 -13721 -37539 -42159 -38646 -31170 -25025 -5690 15952 21816 24074 12959 2642 -7266
20420 -7266 -19436 -32399 -38153 -24900 -35494 -40203 -18885 -3594 468 3054 22481 117 -34183
20407 -34183 -46993 -31245 -8238 3652 -11197 -30181 -43291 -39840 -24885 -38859 -19647 -5646
20395 -5646 -47463 -43600 -33664 -2980 14308 -11141 -62301 -87592 -71333 -37024 -24378 -13664
20383 -13664 -44612 -44129 -33478 -51162 -51926 -48010 -37613 -38736 -30649 3820 1549 -23167 -19933
20370 -19933 -16694 -45776 -53334 -46549 -55014 -40509 -26099 -25078 5810 -4242 -27880 -27106 -32532
20357 -32532 -31481 -22793 165 5744 -3474 -12236 -34730 -8205 -3128 -43482 -47949 -44668 -73900
20344 -73900 -93086 -82592 -57559 -58774 -41808 -41993 -54589 -65161 -67942 -29423 -27971 -49559 -57224
20331 -57224 -37424 -18271 -37956 -18447 -28316 -40803 -18093 9736 13087 -14374 -39594 -21100
20319 -21100 10823 16549 36350 37794 31452 -9391 -51828 -44309 -32591 -999 7289 -26256 -36757
20306 -36757 -25006 -11971 -11200 9893 28616 24749 13470 266 813 -3329 10938 5752 -38061
20293 -38061 -47909 -36751 -17478 -15055 -7224 8134 -53 -19945 -29282 -56649 -57366 -41176 -51555
20280 -51555 -32557 -18161 -30625 -62063 -46686 -44053 -8778 21845 19726 30571 34367 -18289
20268 -18289 -10229 -61 -2569 -37424 -49911 -31663 -3786 -24567 -46476 -30271 -6811 3460
20256 3460 10944 23966 27231 16450 7685 -9269 -7961 -3773 4349 37523 41295 62308 82325
20243 82325 58752 40738 39804 40049 42403 60139 49086 11758 -10261 -5321 14251 19278 10973
20230 10973 -10545 -37319 -48035 -69282 -45721 -30831 -30615 -6296 -16341 -7579 -1805 -15896
20218 -15896 -32361 -31867 -43367 -41742 -7516 1303 -35280 -28966 -3829 -7920 6477 4664 -7981
20205 -7981 -5878 -25217 -27187 -23432 -26220 -9437 -27304 -10560 21551 38427 43718 29985 32290
20192 32290 23991 2076 -19038 -32336 -37742 -31765 -22802 -44066 -46406 -40629 8628 47202 14586
20179 14586 -10406 -12701 -4312 27301 5417 -7128 -6440 3238 16915 25214 -56 -1168 17663
20166 17663 79 -40144 -50169 -32373 -15926 -4266 1940 -5340 -30926 -36350 -9034 12907
20154 12907 25879 9557 7870 -9703 2057 -6394 -25261 -8079 -24428 -18336 -36467 -27457
20142 -27457 -13182 188 3339 -20164 -47657 -53347 -41519 1110 3970 -6923 -12322 -15656 -10113
20129 -10113 -2377 -972 10943 107 -2556 -6607 10264 211 -8695 -28896 -32829 -40357 -12449
20116 -12449 -1017 -9453 -25029 -44225 -48852 -48138 -42816 -23575 -23951 -32682 -29721 -40857 -63602
20103 -63602 -47703 -20058 3594 5256 -18153 -20076 -20563 -40528 -60085 -65802 -38769 -29163 -20617
20090 -20617 -19686 -9639 17092 16596 1389 -1189 12222 24037 19530 3541 15314 -18196 -28492
20077 -28492 -18580 -35580 -42682 -24217 -10941 -3857 -5111 7253 -1122 -5704 -22709 -252 -4256
20064 -4256 -19454 7324 -10367 -44962 -55426 -16709 7284 -8873 -13407 -1254 -9895 -20359
20052 -20359 -20129 -22557 -9956 30896 17288 -16981 -22784 -11672 -39735 -47949 -41832 -29406 -40863
20039 -40863 -53473 -40931 -30399 -23989 -10842 18843 1150 -22243 -18527 -7035 -10147 -33108
20027 -33108 -49175 -48394 -22265 -15211 -44359 -52597 -25836 -10167 5119 -3041 -8495 -9239 -3985
20014 -3985 -385 2174 6925 3693 -22206 -5475 -6106 -4161 3248 -10777 -2337 428 20899 -10989
20000 -10989 -46010 -52110 -64528 -61519 -25096 -34628 -46461 -36534 -26150 -15856 -13389 -44834 -37624
19987 -37624 843 12500 18106 -114 -19781 -24819 -35614 -45881 -43878 -49294 -51559 -26228 15405
19974 15405 37432 22031 -13842 -5964 -1471 -6105 -21753 -11271 2395 4394 16641 25827 -7463
19961 -7463 -20310 -13596 11566 25936 151 -42615 -34903 -15550 -27239 -44241 -47975 -41387 -35158
19948 -35158 -47364 -28139 -7837 -2795 4206 12272 20835 21205 30464 3209 -22796 -7101 -10573
19935 -10573 -33737 -47236 -33288 -2077 16261 24262 6907 -22608 -34732 -78572 -74605 -39493
19923 -39493 -10715 2806 -19321 -39323 -32457 -80300 -66677 -44437 -33431 -41259 -52013 -54963
19911 -54963 -61211 -36742 -7570 -8555 -10513 -19773 -12366 -4107 -4509 2877 -5758 -3278 -11179 -1361
19897 -1361 5781 -1400 -12604 -5196 13783 18687 -6479 -2809 11928 173 -3806 -13933 -42081
19884 -42081 -60998 -64097 -48982 6669 32420 34836 19155 -29057 -44509 -40650 -41492 -38711 -29650
19871 -29650 -19869 -14167 -40425 -57278 -57175 -44865 -23701 -6638 5264 -18379 -32532 -25383 -35549
19858 -35549 -38212 -8372 -4072 -20130 -37517 -35131 -24926 -35064 -43724 -40719 -34126 -40798 -18078
19845 -18078 -2828 -1387 -47377 -49662 -26159 -16977 -7529 -16920 -19524 -15756 -23197 -33658 -36786
19832 -36786 -35798 -51583 -60819 -51555 -43748 -36960 -22492 -2592 23013 1285 -4543 20907 8318
19819 8318 16206 51055 68350 54616 -5835 -24233 -7662 -23107 -44711 -55031 -36404 -24923
19807 -24923 -30404 -24291 -21158 -24024 -29309 -32446 -45586 -24188 14459 43796 52274 30669 -4973
19794 -4973 -13940 -20460 -6162 -16342 -10707 -30176 -70289 -58591 -34294 4162 4470 -21361 -25237
19781 -25237 917 16547 6726 -8877 -10829 13667 -4393 -24576 -38049 -53878 -50512 -51330 -50682
19768 -50682 -37813 -3772 28460 43819 17897 5679 15838 41790 31617 15074 9978 -23048
19756 -23048 -48803 -51009 -17452 -7865 -40265 -44350 -43642 -39226 -25121 -18549 -5478 3391 -25810
19743 -25810 -14800 -2163 -4790 -13412 13832 22852 15720 19525 14482 10737 12081 736 13004
19730 13004 -4840 -12604 -5033 20198 32551 34654 9012 -13442 -10144 -3871 22292 9235 145
19717 145 4148 -21876 -21633 -13837 -25537 -34893 -10090 12617 7100 -15075 1856 41272 51807
19704 51807 49385 38120 27338 6479 -10865 -3810 19056 16404 -158 -14453 -15591 -10243 -17893
19691 -17893 4155 51998 58880 26818 9058 2308 13413 39866 47558 13837 -4755 -9298
19679 -9298 -9241 -2193 9042 9949 23420 16206 12186 1663 -27348 -65762 -74260 -22399 4537 3584
19665 3584 30247 36855 26961 27319 16272 -6118 -7851 -3089 -14255 -10824 -23185 -36587 -30018
19652 -30018 -38093 -31262 -28601 -21742 2866 24498 3716 -30015 -23068 5381 19213 33732 51026
19639 51026 32136 1281 -17564 -21447 5714 25133 29051 32579 -939 -7116 -12482 -10125 -28335
19626 -28335 -27251 535 11137 37017 32374 17343 15250 22593 36224 73735 64411 36323 -21255
19613 -21255 -42036 -18680 -28416 -34732 -15691 -8384 -14298 -32300 -26978 -10454 5409 6320 -24979
19600 -24979 -17732 -24921 -18017 40 24786 26415 12772 34741 18744 -23821 -31178 -37436 -14588
19587 -14588 9843 -7991 -12748 9351 -3645 -15217 -1272 11691 29385 30599 33284 26507
19575 26507 16818 -3427 18205 38345 39209 49319 59375 43834 34384 82282 129412 104169
19563 104169 110357 112612 117944 115100 101252 91908 84111 112421 137242 128825 118503 77828 55436
19550 55436 58383 59243 69318 46936 39181 53503 31948 33135 34377 30437 24798 8237 -5029
19537 -5029 -11217 -15329 -9751 -20049 3052 23754 7169 10098 26409 30377 17070 -18176 5452
19524 5452 13774 -2198 -14823 -11791 4970 17712 23570 14759 6457 11667 -12921 -50469 -45749
19511 -45749 -22524 -14219 -3133 -21066 -37833 -28056 -12882 -1669 9803 13574 -300 -1795
19499 -1795 2457 -8542 -39023 -60396 -53011 -35739 -13985 -2325 -21652 -271 17169 2526
19487 2526 -21710 11621 26449 29536 22501 -12448 -17042 -12488 -14772 -1664 -1914 -2887 -6600 -7480
19473 -7480 -6047 12944 17409 -2364 -14155 -29347 -24308 -3205 -10230 -16008 -13746 -22990 -20710
19460 -20710 3586 1654 4325 2313 20861 20930 20799 8861 2045 5730 -29211 -55909 -52197 -54084
19446 -54084 -19502 22288 -9608 -35647 -42965 -46548 -33270 -50390 -50825 -15377 6682 -3519
19434 -3519 10975 52840 62699 38432 -708 -8006 -546 -5048 -2762 -2102 -9653 -4850 1183 -25025
19420 -25025 -32613 -18646 4177 -724 417 14901 20256 -6360 -16578 7939 -2043 -14629 -1296
19407 -1296 12340 -12063 -15565 -24379 -27539 -43388 -48530 -50083 -2784 -11189 -9899 -5700 -727 -26470
19393 -26470 -34123 -32514 -10594 28948 34759 9977 232 -25699 -29898 -10608 12131 17042 36826
19380 36826 41749 50712 48376 34068 33790 40472 4683 -15418 5921 24629 -5165 -5519 -2934
19367 -2934 4894 8698 4935 -18862 -21530 13371 23890 27101 22884 -17084 -15391 23552 9236
19354 9236 -5725 10830 3571 -431 -15561 -26342 -20143 -8217 -30302 -36420 -36491 -56440 -55016
19341 -55016 -71123 -54487 -15184 -11331 -19019 -36986 -23874 -11539 -31235 -34262 -5273 8893
19329 8893 8323 18616 463 3033 3892 32783 31196 4493 -5487 -16998 -23125 -28009 -29094 -51341
19315 -51341 -45461 -38644 -26962 -5869 20851 4491 -5595 8219 44309 63817 68303 35819
19303 35819 12494 10070 15628 17685 16138 22570 27592 34728 32529 30396 14872 -6016 -13408 -32064
19289 -32064 -46010 -47113 -29719 -26532 -51722 -47123 -31057 -26532 3302 34364 44959 40378 40611
19276 40611 30898 23543 16662 2328 -10007 -15446 -4875 -24338 421 23090 31265 18275 13532
19263 13532 29632 36747 25697 3408 -8656 -1917 13371 2929 1983 -6568 -15848 -8696 -18937
19250 -18937 -22111 -15303 -18474 -15340 3010 21242 26168 32432 35654 32695 30934 24906 11576 1737
19236 1737 -996 32220 38894 21503 10610 -5309 -10110 -8908 -7139 -1112 -11183 -3594 -25303
19223 -25303 -31188 -4270 33633 31934 19516 -6763 -18784 2940 19401 27481 52393 43143
19211 43143 24154 21222 -2268 -10482 -2673 28241 10849 -646 -10224 -26900 -27908 -17930 -8774
19198 -8774 -24351 -25852 -3453 15246 17540 6111 24447 27439 27925 6312 11203 4967 11099
19185 11099 20420 3711 5381 2811 17120 18858 1406 -2321 2694 19044 25592 31315 45482
19172 45482 52725 28257 -16970 -54698 -55274 -53647 -49049 -55464 -29388 -16125 8793 11951 6245
19159 6245 3180 15804 10916 10913 18950 11136 17458 16975 -5787 12893 -4487 -20587 -18827 -27776
19145 -27776 -31175 -66709 -56636 -17288 -16245 -27425 -24969 -29622 -29196 13734 31446 13555 28286
19132 28286 43601 4691 -24444 -29838 -17511 -8565 -28818 -39467 -8094 10099 -15228 -21705
19120 -21705 -20493 11957 4655 -22388 -16433 -11880 4558 34654 52325 38232 18172 8186 -3267
19107 -3267 -21393 -30744 4497 5994 -19189 -5362 19140 29320 15811 5686 18429 5613
19095 5613 3937 -5429 -22983 -46726 -54002 -28305 -6956 7914 7758 11903 1093 1972 -45138
19082 -45138 -44775 4459 7424 8390 -5094 -22394 -35197 -35209 -24158 1204 -1424 -38501 -54091
19069 -54091 -60795 -39940 -16640 -11866 -33322 -77846 -58845 -33373 -33809 -32615 -15652 13127 13493
19056 13493 -3360 -6421 -6454 -12804 -16141 -10540 -11204 -13582 21005 -6195 -31514 -10132 15005 21272
19042 21272 14436 13132 8287 -5846 4756 3293 -4314 -14506 -28411 7849 9137 25037 41797
19029 41797 30133 21198 24688 26343 14290 31607 32795 8448 3125 7736 10641 34642 37648
19016 37648 19991 -13692 -16513 -42927 -44434 -27394 -26980 -10561 16746 507 -8910 -26562 -39661
19003 -39661 -46638 -42691 -9538 -7169 -11755 -13843 -29515 -8181 13183 1280 -16449 -19628 -12157
18990 -12157 -8133 17159 -13838 -25453 -27662 -30960 -40506 -32955 -18199 -20614 -5630 2274 14967
18977 14967 15496 18105 7066 4172 9926 18036 16029 26099 31614 4272 -1413 1370 11278 10372
18963 10372 12554 21086 6922 22325 34530 15470 7423 11296 60217 67512 67103 86065 93572
18950 93572 71102 57325 42668 32280 30049 45597 57657 40722 34280 44634 24473 25192
18938 25192 23002 30393 12055 -18653 -36999 -37923 -11337 10322 13404 20284 2277 1512 17414
18925 17414 -12737 -24739 -37701 -20059 22575 47778 44588 -1623 -20620 1618 7495 -6696
18913 -6696 -9068 -8989 -3039 -11608 -5793 39837 82813 35750 43148 63138 40395 43324 63279 61927
18899 61927 45894 35813 14083 34960 27649 25335 21646 41608 31645 20598 22380 39770 48831
18886 48831 39920 36631 26734 23163 31712 32389 30362 38298 26903 8842 -24797 -26308 7793 18824
18872 18824 12592 19137 4958 13215 24672 35696 29269 27222 26359 42712 14932 -13603 163
18859 163 14191 6825 -12683 -26022 6756 25326 6260 2350 29081 9909 2888 -22016 -6776
18846 -6776 1149 768 -9968 16949 40689 48263 23014 2716 11145 21636 21301 47170 57057
18833 57057 50292 37773 20703 23748 29197 43427 34399 18349 -5168 -32218 -52428 -23410
18821 -23410 8410 7610 10515 27311 48076 55167 36900 9218 -1623 3900 21215 8769 12314
18808 12314 33992 49206 65419 72571 77489 49647 26137 40205 54575 45963 33980 32288
18796 32288 53876 64312 52465 35646 21624 43498 62297 58672 50293 50264 46484 23053 17862
18783 17862 6197 12565 26925 9231 748 -29807 -18834 26473 71858 110495 120642 90942
18771 90942 83074 110855 144654 216113 293376 259789 174557 111979 77728 59806 28264 767
18759 767 1174 17555 2237 5803 31761 2160 -26645 -4478 8368 21147 6585 3335 -8504
18746 -8504 -21466 -40811 -14259 1445 5075 19127 33313 7593 24132 42452 38200 17241
18734 17241 29201 43096 58622 43518 1670 -2230 -23228 -62227 3064 70253 67880 58541
18722 58541 49739 70165 62500 55322 53617 58612 37526 16898 6861 -5238 -12620 -2892 19934
18709 19934 21771 34078 31629 34262 47813 83075 44641 17216 22153 25091 37559 30844 56344
18696 56344 67858 65445 125557 177049 182103 170501 174833 174352 174006 139053 112879 134508 134281
18683 134281 104554 83638 59096 66922 69949 96703 94437 86496 84803 84434 72367 54053 33804
18670 33804 33872 21920 38183 50240 34637 12399 10107 14411 38379 49155 42109 40597 51429
18657 51429 74472 60975 54151 42178 37705 43808 58986 92692 116421 144655 160438 148189
18645 148189 161294 125241 96979 101650 106611 127894 128002 156263 204932 229652 227625 221626 212620
18632 212620 180889 151017 134383 94472 76105 87132 70966 36399 36018 46592 47317 34695
18620 34695 32172 22009 31997 71231 58850 28859 28522 37793 41686 74471 73069 103388 98424
18607 98424 50073 27705 44834 74131 101233 105461 94446 82115 72331 82857 84852 81496
18595 81496 78331 82784 40924 36988 67850 73810 85923 66118 58880 73199 106715 92610 109980
18582 109980 137926 143987 149797 136440 164621 191343 217824 229423 247116 227286 186206 171539
18570 171539 205341 239637 240037 248053 253873 287450 291209 274848 281947 285771 286803 270247 247999
18557 247999 240258 254026 235165 233249 229848 230474 226352 244711 227364 192864 169935 132666 87045
18544 87045 74922 104578 101325 66223 33428 46491 66929 87621 100650 100341 129919 146343
18532 146343 116813 112376 127944 144473 167969 174927 172047 194609 222990 234301 249196 260667
18520 260667 264593 274740 260425 264223 288105 309518 320021 337442 350153 359854 325226 299377
18508 299377 295947 287195 297442 305438 303229 302266 285641 233345 214590 228364 232911 185864 153044
18495 153044 150298 146204 151469 163229 131792 98225 98003 92538 106072 125477 139180 119502 99826
18482 99826 56923 28709 38719 66235 71215 58536 62568 45196 53969 70635 65839 54688
18470 54688 39697 16995 21987 34254 41411 40507 47579 55973 22945 35829 71305 71373 48750
18457 48750 29364 42924 69408 70005 67784 64964 55192 62585 65111 53128 48161 62361 68912
18444 68912 37299 51821 81343 93000 88634 72680 78044 58932 54880 36464 43498 30712
18432 30712 25263 25888 14999 10825 -12083 -2843 11839 23480 31939 43446 48408 75834 59720
18419 59720 38611 30688 36829 39062 33624 37078 39935 21447 57457 89234 94099 82676 54109
18406 54109 31723 43234 55778 58824 38119 34244 35605 37992 28458 35995 73533 59040 52428
18393 52428 60711 53198 40787 43982 54723 45789 32691 49456 71622 107099 117155 125640 100409
18380 100409 99320 102861 97110 78710 88898 80193 64372 61194 62080 82875 93913 95919 104260
18367 104260 116773 118079 114067 119956 112084 123655 126796 111564 91690 97534 90878 109169 103888
18354 103888 111876 120127 126038 120001 127096 105413 90617 92393 104594 135039 131738 112435 110535
18341 110535 113005 123836 105067 129064 144946 125869 110072 117321 123799 149014 184555 218476
18329 218476 205758 207667 194078 185032 169858 171898 178718 170014 144523 129551 145553 153913 135376
18316 135376 127501 121817 101964 80666 101845 112769 114905 132597 145208 163945 153325 156939
18304 156939 173163 157991 172863 181884 129764 107828 107098 113000 112232 118481 139638 147303 145593
18291 145593 162985 162627 155645 188903 181666 176563 183639 176037 166033 166164 159919 151904 161969 177166
18277 177166 196634 206092 212478 200982 219490 214194 199033 175712 184142 166456 172800 170921 187597
18264 187597 205981 216558 257414 274238 281985 286042 270394 239935 252561 249093 265752 278808
18252 278808 275337 267524 277635 276846 249043 253463 265818 273917 285773 291302 283757 296302 300637
18239 300637 306599 266776 241692 241094 263350 297411 347850 335162 316967 325661 332313 329115 344598
18226 344598 370582 359122 335948 305767 314501 283339 275085 257441 266291 278674 305365 324603
18214 324603 329310 317337 304841 306121 288100 290880 305831 310368 331552 354497 399354 414672
18202 414672 403258 390447 431246 450316 458088 473493 503174 497566 488147 459673 400710 400854
18190 400854 444524 462574 473386 479627 493465 545373 584291 589116 619685 656311 726599 763740
18178 763740 772391 804998 832674 820398 805689 852738 905930 988424 1047175 1167408 1322333
18167 1322333 1554652 1908643 2288298 2647445 2992214 3355293 3548355 3468721 3282208 3094586
18157 3094586 2882944 2575886 2259662 2071676 1939800 1874885 1838539 1833808 1868862 1878722 1892522
18146 1892522 1812806 1761107 1693136 1611975 1522987 1424519 1367501 1386913 1372607 1346210 1377066
18135 1377066 1431988 1450649 1506887 1601413 1688350 1758649 1866171 2004945 2218529 2463827
18125 2463827 2729996 3042048 3396260 3800893 4263090 4783231 5325524 5900667 6691275
18116 6691275 7818448 9493575 12011541 15902195 22084709 32514713 49899260 67831432
18108 67831432 63753481 46149057 30991580 22143354 17007375 13885386 11991119 10780033
18100 10780033 9995322 9706032 9795726 10128842 10591819 11132155 11619470 11850443 11861177 11829619
18090 11829619 11877753 12050769 12460924 13183737 14409687 16350653 19238784 23479912 29465276
18081 29465276 37279772 46094780 54779674 63340880 71354786 76055086 75631472 71880350
18073 71880350 66797791 60417678 52807587 45351016 39468920 35385504 32734940 31171680
18065 31171680 30363401 30042550 29744142 28694876 26653349 24081943 21344244 18585882
18057 18585882 15950191 13698251 11973595 10736597 9920212 9430971 9185410 9100876 9115125
18048 9115125 9206405 9390219 9688371 10083696 10677117 11550525 12782016 14514092 16788017
18039 16788017 19529214 22505095 25519332 28499913 31168348 32860389 33548414 33926965
18031 33926965 34655968 36113994 38690233 42752346 48680337 56795840 66624822 76055904
18023 76055904 83549616 89656591 93684675 92260814 84623436 74195470 63343196 52197219
18015 52197219 41392546 32304763 25545274 20868878 17704462 15683288 14548019 14010531
18007 14010531 13793072 13679190 13641898 13630477 13359756 12591167 11470314 10279403 9038128
17998 9038128 7813822 6708380 5759391 5064108 4528766 4059582 3661143 3362470 3090885
17989 3090885 2811397 2564893 2365173 2195491 2038946 1892575 1794995 1725633 1684141 1630948
17979 1630948 1567129 1502945 1415395 1354866 1314665 1211746 1143735 1100739 1057922 1017433 1000120
17968 1000120 961511 948499 911427 871674 836067 816362 813062 760709 738403 739655 723730 703246
17956 703246 677224 658763 658620 640401 617563 596952 566692 543121 518955 478689 468909 437298
17944 437298 408177 413350 399818 416408 454183 477458 472014 479603 480398 455272 407355 394439
17932 394439 386791 360924 370871 365253 370016 384698 387369 416984 449473 443273 446125 458761 453439
17919 453439 431887 378370 333554 317090 286882 267995 252340 235873 249320 260221 278754
17908 278754 281743 287278 285088 263759 262697 257148 219468 195389 187705 198539 156745 155424 171938
17895 171938 187888 190723 171528 158774 180042 198526 163436 138499 117363 133739 137519 123856
17883 123856 136739 115614 99530 89492 96641 112766 117032 130996 129392 123240 115423 116818 120658
17870 120658 148112 154297 164655 162316 137917 138254 141051 145511 154309 134798 114101 113118 119236
17857 119236 100664 82764 91313 124775 136304 134006 128810 146136 145183 152147 194137 203587 180094
17844 180094 144574 139190 156430 125348 91635 101473 130340 162802 163478 176003 193991 218727
17832 218727 189739 166566 137011 118097 106698 96442 89658 77690 80575 110770 135142 148429
17820 148429 152952 125951 129366 136759 121792 104785 128520 148413 134715 112672 93362 96740
17808 96740 122982 105813 92174 106301 92428 85276 100712 99337 103929 107450 126088 151481
17796 151481 137125 132069 155047 179140 180896 168989 181432 197558 221520 213852 196141 207167
17784 207167 190968 201864 197266 205065 200861 224877 227655 187474 164439 156816 139726 144705 158662
17771 158662 151980 131969 121889 110035 116479 145596 162154 168578 150682 147208 152373 147130 131520
17758 131520 118500 107298 91366 74869 73909 82270 99188 126475 123565 111056 100809 108156
17746 108156 105191 102436 122115 133037 139267 142208 121953 82856 68564 83743 93821 116702
17734 116702 159694 183575 167258 166595 160038 159428 147927 146050 161071 162690 158240 154090 123505
17721 123505 125488 138766 128522 131875 144834 136023 151269 170695 157304 136203 161714 159039
17709 159039 165194 172948 152335 137745 160279 164242 139073 144487 141031 141167 160861 170891 152689
17696 152689 139414 153727 170684 164506 137606 138816 133173 170999 182857 180497 188337 190526 190420
17683 190420 206364 227107 210263 196673 209591 190047 197149 228633 230057 252173 263786 270617
17671 270617 289249 298212 298946 304312 303651 291463 309322 337970 324924 330078 331710 321990 314013
17658 314013 354179 373374 380477 355976 339157 337700 326926 297063 270258 274002 297126 293890
17646 293890 323444 342611 317604 309117 291035 296762 290201 297036 304550 307017 314358 329132 349193
17633 349193 379836 383010 366513 377133 418323 420447 394815 432061 439371 430536 435226 446902
17621 446902 461770 477277 462362 455363 483453 496232 545244 568407 576272 586148 599867 608443
17609 608443 599702 605787 638997 623021 610976 651435 698713 749071 798784 800154 838205 856355
17597 856355 873003 874366 886737 898162 942840 965471 986858 1015321 1016896 1061460 1114558 1212879
17585 1212879 1310402 1405488 1494570 1547537 1608131 1649281 1645754 1670389 1701880 1789993 1902554
17574 1902554 1993310 2138024 2331020 2598148 2965333 3488574 4160950 4994376 5845960 6540737
17564 6540737 6942294 7041667 6912253 6736020 6625778 6640932 6803198 7226326 7942605 8999727
17554 8999727 10371233 12017595 13705186 15028325 15622083 15437906 14744404 13999368 13602214
17545 13602214 13716810 14357607 15609783 17563415 20431505 24576103 30493132 38873105
17537 38873105 50432057 65200902 81636462 96276531 104961016 105256906 98071749 86547316
17529 86547316 73849074 62008640 51889411 43897756 38198856 34774110 33415356 33618885
17521 33618885 34643564 35549833 35325620 33396753 30038704 26050814 22283658 19241886
17513 19241886 17032708 15541361 14567306 13869051 13241683 12545776 11741625 10952359 10342338
17504 10342338 9973326 9853007 10050090 10487918 11099422 11869907 12873396 14239969 16164731
17495 16164731 18856129 22272405 26020688 29409889 31650323 32297306 31620398 30474771
17487 30474771 29843317 30555310 33027145 37444064 43747714 51670131 60770804 70429441
17479 70429441 79322249 85070465 85035373 78202789 66285853 52699189 40329265 30577523
17471 30577523 23522556 18645982 15303999 13025058 11430469 10384403 9778161 9554913
17463 9554913 9722363 10146164 10617019 10851814 10603945 9846430 8738155 7522612 6404111
17454 6404111 5484144 4756007 4205690 3772104 3450206 3222181 3060829 2994097 2986161 3023291
17444 3023291 3046506 2998885 2841815 2534314 2205267 1892416 1646428 1485426 1363779 1267237
17434 1267237 1179043 1096057 1006752 937204 883910 864080 857681 854227 834516 822172 813709 776267
17422 776267 697037 642926 619981 568268 513590 480158 468586 449200 428142 428891 402676 382570
17410 382570 391072 365023 347382 372490 381203 385240 359893 355192 337538 302405 292986 283344 261564
17397 261564 219945 188707 153870 165857 199879 222937 226439 194503 154307 153006 155907 135335
17385 135335 169215 184873 185533 189851 181994 173707 168569 162847 143319 118182 145467 189023 192103
17372 192103 173319 170530 178854 165891 136500 128078 137920 157730 166159 181680 173097 166457 163111
17359 163111 153044 125998 117281 100483 85563 97151 91215 80313 95007 97953 84719 88570
17347 88570 52779 41952 41248 69244 78608 55034 63676 106556 129521 116269 95638 74292
17335 74292 74559 86777 74051 63539 75873 90435 54731 49335 53877 89938 97658 95628 76789
17322 76789 78229 88077 83144 79046 84886 100190 97297 79948 90719 98317 73801 71930 61129
17309 61129 48493 29816 54073 82076 60808 56702 30837 29438 65448 89121 85541 88588
17297 88588 67373 46151 78322 78535 44904 38652 46680 59980 67956 64348 43538 40071 76371
17284 76371 90039 88851 66970 46820 53927 31563 10609 26211 44585 65789 76668 65141
17272 65141 65143 55461 42775 70849 52340 51925 43956 41432 36259 8400 6970 16794 50739 78784
17258 78784 80329 57171 25348 20297 14802 23878 38327 50409 39906 -1296 -16369 -16457 -24812
17245 -24812 -12931 -16873 -13160 17580 19395 -8709 -17091 -10531 -6930 7136 15577 6559 -29407
17232 -29407 -35054 -4186 15100 40188 47181 33001 825 -12670 -19051 10816 56802 42114
17220 42114 5371 -23085 -27858 -7683 -3175 13465 30690 27909 39695 25381 12491 20901
17208 20901 36639 19152 6797 -2303 7510 2264 8721 19028 14742 8403 -2368 -5018 20385
17195 20385 21286 -7839 -2413 10551 18988 16957 -22728 -7407 15771 -3759 -17610 -37565 -37014
17182 -37014 -3501 2133 -9030 -35859 -33752 -38379 -50518 -50707 -46196 -54469 -49585 -21907 1018
17169 1018 14394 8668 -18765 -45417 -9745 -6837 -30878 -28278 -26083 -34325 -30000 2380 4619
17156 4619 -370 25233 19441 1701 -8648 -7863 17187 32305 61610 77403 46204 13935 7690
17143 7690 -30877 -25104 -2660 -8688 -4466 -21444 -24254 4324 -1696 -18272 7702 26805 16751
17130 16751 21857 2397 8442 14313 15213 30540 25990 34860 30983 2784 3819 4966 13633 -4246
17116 -4246 5684 26841 8650 15189 11004 -1810 -4392 14777 32770 32876 29988 3672 -9060
17103 -9060 -16573 -44679 -51909 -35359 20239 26748 -2064 -6275 11508 -5 18393 17897 -5260
17090 -5260 -52160 -49693 7803 2315 -2246 318 2845 12679 16412 18639 42131 27727 10622
17077 10622 32179 43813 38026 62327 69967 52201 30605 44883 47821 46738 20184 -9548
17065 -9548 -19877 -3622 27153 33100 33053 46480 47409 45686 42086 65140 82837 87405 68418 43797
17051 43797 63825 89564 132354 139690 166248 221377 269237 290929 283071 274968 254298 247057
17039 247057 239445 220893 207259 204740 215463 225291 220212 231479 243160 268796 276196 277599 258815
17026 258815 228778 210111 180206 173621 131874 92587 50369 71725 89883 91199 96015 94417
17014 94417 81487 63183 36404 40300 55578 53453 52181 45657 52563 105006 95011 105444 117116
17001 117116 118384 111320 120920 157614 187537 209567 217322 233227 240218 237937 242818 265976 286980
16988 286980 294467 290431 255809 221809 174157 108093 120406 124418 82740 78863 79003 127124 179241
16975 179241 205128 230967 259157 275655 258794 212451 171589 118738 107046 117630 126630 110066
16963 110066 81577 65352 74658 51836 35733 44210 45528 40914 45120 24747 31680 37853 54956
16950 54956 40449 34618 39074 51099 59609 64820 30144 24926 5612 14987 21725 44053 28533
16937 28533 -7382 -26271 -1155 9076 3472 -18988 -51575 -58887 -17957 8344 23097 2598
16925 2598 -2903 -8849 -33816 -51980 -62408 -62164 -52126 -16499 -7133 -14884 -20291 -6859 20405
16912 20405 4958 -29715 -9446 -3159 -6768 6367 -3319 787 9952 15924 16652 7175 -6833
16899 -6833 -24391 -31034 -25843 -18078 -19805 -30412 -16208 -5318 33 -13225 -24335 -41559 -64082
16886 -64082 -45029 -9571 -7843 -24847 -42764 -41171 2198 18616 14918 1025 5197 17969
16874 17969 19101 4999 -6 -13658 -24102 -32622 -26641 -11940 -4086 7650 -1517 13118 11685
16861 11685 -18411 -40082 -53037 -28506 -32496 -37138 -52308 -34034 -32126 -40660 -46195 -44494 -14850
16848 -14850 -2878 -4327 -7286 -2241 -20557 -5218 14779 2112 -15811 -15962 35781 51974 32759
16835 32759 21192 2507 -21703 -53394 -55012 -16012 5456 23284 35119 43066 32891 -2140
16823 -2140 -16179 -17499 -29227 6812 38147 33939 19280 23260 23404 22557 29028 23957 32211 17685
16809 17685 3380 1093 18313 25174 13472 6072 -17028 -19399 1768 6245 13211 -8284 -8733
16796 -8733 -11850 -22283 -14270 7478 15801 -29203 -37026 -25527 -2330 216 -7080 -10074 -10283 -12531
16782 -12531 -9567 -23763 -21148 3399 20481 -6760 -33877 -35883 -16068 -1724 6212 -22019
16770 -22019 -37075 -2396 20609 14582 -10167 -16515 1097 14462 6136 11707 23338 477
16758 477 -16620 -17338 -29178 -32247 -39412 -50129 -39844 -37485 -41135 -17471 -16281 -28565 -14637
16745 -14637 -184 15386 -8362 -3022 -26560 -25391 -34469 -30300 -37046 -17957 -19654 -7683 -12047
16732 -12047 -38271 -50202 -81316 -71182 -66764 -61654 -53082 -45713 -24489 25489 28715 -1149 -21736
16719 -21736 -47415 -58505 -44907 -33331 8666 9280 -18014 -34509 -14002 11053 3511 -6799
16707 -6799 -13958 -35229 -51243 -31618 -20197 -24337 -8115 13227 22029 15454 5857 888 -7529
16694 -7529 -25290 -46758 -39686 -9430 33384 23870 17385 5311 -11957 7735 22860 38397
16682 38397 46062 51512 49366 34941 35718 25765 -3925 -21879 -18313 5903 12113 -443 -7137
16669 -7137 -27197 -12414 -9201 -36682 -38701 -39025 -65022 -67571 -51349 -48971 -17165 -17856 -47394
16656 -47394 -44396 -25829 -22159 -8955 3686 -7829 -23205 -25350 -41303 -41508 -12070 11208 7059
16643 7059 26654 28063 14638 -9211 -23404 -4192 -9258 -32893 -22142 -16385 -18443 -41228 -51057
16630 -51057 -47750 -27247 -38744 -38998 -8989 -627 -14963 268 23359 19152 14041 20150 29190
16617 29190 24948 1944 10178 14112 12667 -5767 -36049 -33750 -42061 -26857 -21459 -14649 -6596
16604 -6596 -4412 -53 -8072 -5846 -11729 -46482 -64505 -59461 -48141 -25227 -22594 -21877 -9182 -17245
16590 -17245 -35557 -42410 -22589 -11830 -22599 12462 1310 1366 12518 4907 3988 5287 -11465
16577 -11465 -13052 3407 3295 18165 17424 4512 -2939 -17422 2947 14717 -11194 -26707 -44886
16564 -44886 -47444 -20176 -38837 -46450 -23532 1298 2649 -9410 -31080 -54404 -20997 17818
16552 17818 37812 29380 10675 20644 39630 34613 25778 40025 41652 55993 38362 40182 42760
16539 42760 41900 38405 49341 34171 36395 47778 62511 40663 20469 -7070 -3871 9995 14513
16526 14513 1132 -16376 -10083 2582 20 -13595 5008 27866 26862 -1063 -35268 -46380
16514 -46380 -49778 -9025 14403 795 17737 27135 32331 44018 41689 34398 14030 -1632 -4162
16501 -4162 -18412 -35314 -6722 20646 12328 8684 16946 10114 9408 10894 5474 -25377 -37175
16488 -37175 -60362 -54128 -42973 -30570 -5282 -14287 -17540 -33364 -61587 -50900 -21491 2780
16476 2780 -5060 -22148 -56833 -51193 -63508 -75749 -56164 -40823 -25329 13329 35111 37607
16464 37607 27232 -26135 -50944 -11784 18176 36000 12829 1476 -5445 -18126 -27452 -28160
16452 -28160 -40383 -18605 -8483 -19417 -46653 -53960 -57122 -11684 6729 -1470 17065 14039
16440 14039 14896 4405 -8365 -25767 -28697 -38695 -21135 -15622 -6280 -12595 -11365 -23719 -29916
16427 -29916 -25718 -23995 -19349 -19107 3838 43407 39858 25775 32779 44139 35267 9963 -6190
16414 -6190 -17846 -16151 3596 -22527 -16783 1036 -5016 5631 18074 -3207 -20457 -18339 -18018
16401 -18018 -11516 -17949 -27965 -36366 -42637 -56062 -61115 -36116 -28032 -30271 -28866 2336 -738
16388 -738 6346 20238 31790 10824 -3667 27339 35482 4141 -4384 -7870 -22532 -25736 -19452
16375 -19452 1199 22421 12495 -10841 2220 -712 -5341 -18364 -15461 6236 20148 19030 -4365
16362 -4365 3919 16385 35296 15363 18198 15999 37155 10703 634 -3736 -26505 -24419 -3624
16349 -3624 7130 31220 14654 -15505 -29379 -21694 -22374 -8688 -16234 -8775 9265 8308 -2887
16336 -2887 -4567 -7034 -4258 8008 5486 -12078 -6798 1498 4978 20648 19846 165 -12112 1426
16322 1426 14182 21372 -24271 -32830 -12427 -8568 -28208 -27242 -21520 -22997 -14676 -33761 4428
16309 4428 28757 1786 6150 20355 34489 46377 46633 42160 32653 12945 -4987 6099 14053
16296 14053 15554 8955 13067 27918 50227 44503 17378 5034 276 6395 -16337 1961 12284
16283 12284 14924 8332 -5779 1027 11556 5750 5635 16399 14717 23564 35435 33488 9528
16270 9528 -100 16574 -6505 -40771 -43412 -15190 11009 -3814 -7111 -1913 25088 23396 21711
16257 21711 12169 -13290 -27277 -20046 -19332 -36796 -11532 20400 34668 43991 45922 26870 21345
16244 21345 7978 20548 4701 -14067 -5794 24214 9086 -6527 -247 15278 10402 -1692
16232 -1692 -11828 1055 -6222 1928 1675 -16596 -3787 8420 5762 43142 40022 6566 1818
16219 1818 -23315 -14480 2077 9584 1542 -9424 -2464 -612 -8204 -2003 7461 -15949 -7267 26401
16205 26401 6339 -14952 -10908 -11079 -2037 13898 2106 -17658 -7252 -4383 8295 -5983 2188
16192 2188 20567 19229 29952 10036 3634 3876 24355 45209 22929 -10376 -9607 -10497 2570
16179 2570 -4402 -16808 12142 29511 23985 6746 4855 2137 -1119 11669 18604 2485 -13814
16166 -13814 -11501 -19538 -16624 -12352 1187 33335 7364 926 -7651 -5279 7841 26108 6833
16153 6833 -19150 -35536 -21562 -26020 -33711 -37656 -30040 -12693 -9382 -22261 -32986 -62285 -76791
16140 -76791 -56155 7329 52833 56311 51795 52287 58737 39374 30216 37315 46195 39257 12791
16127 12791 2987 -4263 18194 28174 24372 28852 512 -10597 737 -1492 -3602 9034 35181
16114 35181 23421 26554 27305 17466 26258 24227 -1279 -7329 10859 -4790 -8927 -19386 -18436 -45015
16100 -45015 -66650 -52423 -58292 -63700 -49982 -25779 -17801 -44675 -69270 -49374 10421 41994
16088 41994 15764 15563 9675 -4441 4342 3291 -17314 -11398 -32522 -26126 -5893 8457 18549
16075 18549 24877 21751 11801 13243 -887 27025 73380 77699 69055 72666 60298 63956 60581
16062 60581 36134 32975 8800 -44242 -42405 -6316 4932 5555 -3817 -10028 -12515 5647 16739
16049 16739 12790 4943 -1194 -4077 -5988 -19007 -23365 -31219 -41097 -53328 -33871 44 4054
16036 4054 -1961 -5503 -3955 -33277 -43429 -33885 -6422 32 15877 12269 -7672 15314 9077
16023 9077 -10852 -22814 -30340 -5244 4925 -19044 -1159 -760 15246 8422 1243 5822 14767
16010 14767 -22991 -20189 -27745 -24147 -16207 -29189 -20491 -8549 -4436 -18680 -20788 -39309 -30287
15997 -30287 -24893 -39246 -15024 -591 14975 23660 24791 21730 36472 51772 40656 15595
15985 15595 2621 25044 39710 9628 -20122 -23246 -21524 -5678 -12663 -12415 -10196 -20066 -41506
15972 -41506 -30182 2254 5441 -16611 -29321 -27845 2623 -1637 -7409 -2399 841 -10052 12107
15959 12107 -3258 -20688 -7993 -10511 -19710 6278 12107 -30623 -22777 -3003 -1273 -3078 18350
15946 18350 38886 32124 26962 18100 30869 47302 28362 5722 28559 33190 24393 51977 49905
15933 49905 24824 -4126 -21173 -34359 -28910 -12485 -16767 -35880 -27006 -16803 -7712 7926
15921 7926 16524 18625 39483 42365 44215 55037 67254 42443 9386 27038 26947 20160 20602 8734
15907 8734 -9811 -1754 20678 33547 11362 17956 16889 -7113 -22091 -31094 -19924 -10303 -3041
15894 -3041 -1079 -2751 4751 17557 8369 1648 -9820 8391 28157 18722 -29419 -20647 16367
15881 16367 -6439 -47769 -33111 -21626 -11274 16038 -25607 -36063 -22485 -39732 -25075 -39168
15869 -39168 -61154 -27040 3951 33305 20923 6560 -17735 -34460 -39364 -20751 -39940 -62451
15857 -62451 -19815 23199 22498 33519 8831 4755 12063 21800 -8668 -19694 8856 34178 30689
15844 30689 23400 40252 26153 1466 4805 11817 3024 -1430 -43807 -23047 -8295 -8589 -11394
15831 -11394 -22294 -46606 -38000 -12440 -1357 -1022 7488 23100 32143 35632 2157 -27918 -35868
15818 -35868 -24884 -1610 26833 33536 -10821 -26779 -36726 -56993 -68138 -24659 13463 -16368
15806 -16368 -8118 5076 2368 -10901 5748 11418 29007 37278 37448 28426 17530 -3872 -17864
15793 -17864 -51146 -59420 -41173 -21344 -8375 2108 -2448 -1735 6783 3137 -23931 -40274 -12578
15780 -12578 -8008 18599 46950 55439 21092 21802 10787 17756 18490 3582 -25548 -25375 1112
15767 1112 746 -4978 -17290 -33963 -42899 -36347 -12866 -1279 3776 -12771 -24708 -9265 -2530
15754 -2530 19282 48175 14523 -18501 -24246 3433 14927 10722 10183 -8279 -6013 -10951 8209
15741 8209 13529 17570 28804 20463 26303 36238 36971 19110 -16551 -2139 520 4690 6710 -10758
15727 -10758 -7021 12285 1071 -4509 -10249 -16703 -5017 20855 12481 6432 35875 66476 61295
15714 61295 16391 -28532 -11674 15535 -1868 -36291 -45046 -22432 -32969 -8245 15447 28510
15702 28510 33895 34655 25242 16763 52859 40959 42067 42670 20072 1173 -2934 -10387 -27098 -37213
15688 -37213 -5491 23733 48854 39310 30427 12004 24220 13636 5334 54892 42494 16638
15676 16638 18244 29719 11572 -139 -9059 -18884 8252 22640 18384 28392 31935 14543 12858
15663 12858 6819 4048 20622 20263 12465 4267 1299 16754 21469 4977 -118 1225 -7313 14683
15649 14683 13359 9145 1956 22225 28776 26936 13752 13819 -2050 7605 -15077 -43525 -25542
15636 -25542 9257 5507 4814 -10546 -1364 -8674 -5579 20613 26024 53998 55716 33635 13037
15623 13037 1503 16329 11047 1313 241 20728 8855 -15527 -18041 19390 43277 27760
15611 27760 33290 58215 45670 23862 20130 20538 11721 -7349 -13064 10901 33051 34494 34412 57393
15597 57393 42783 32974 12611 6440 31160 57631 56131 61368 53368 58108 51837 31464 47639
15584 47639 46864 50205 43911 37530 34701 52402 54687 35111 10855 -9381 1982 14695 34584
15571 34584 46539 52643 65276 64507 48845 47985 28746 14630 -481 -21423 -24267 -2367 65
15558 65 -1894 8319 -17811 -19188 -12227 -13279 -20709 -30452 -18138 -17454 -5186 -15055 -20713 -28273
15544 -28273 -27852 -20707 -14421 2497 9205 10945 -18907 -3635 15401 3798 -22532 -42664 -33375
15531 -33375 -31326 -11424 -7464 -15846 -3304 -5878 -21013 -18489 -14481 3927 -6702 10458 14356
15518 14356 18377 21437 14453 15319 2607 -30729 -29983 -2772 202 -12198 -28869 -18440 -8620
15505 -8620 9126 9312 39096 39342 18043 23232 49547 41710 6197 -2543 -15123 -21728 -128
15492 -128 6871 19186 44559 28304 -8517 -3724 12685 30938 5491 2944 5937 -9839 -22564
15479 -22564 -10620 -28379 -26894 -17392 -5838 12111 5781 21212 26049 14571 38067 66295
15467 66295 30871 18383 577 8626 -8001 -25097 -2441 17468 19534 11269 5706 -36003
15455 -36003 -13951 17994 46807 33923 -18854 -36723 -11732 6299 10978 28922 35411 46924
15443 46924 41125 11063 4869 -21377 -30768 -39075 -40044 -24474 -1456 15586 17348 -1956 1794
15430 1794 11199 8430 20232 14866 242 -8897 1585 20009 30054 13362 -7705 -27173 -29654
15417 -29654 -27899 -14941 9468 34139 37649 40294 50796 40669 31899 41890 33936 21019 8734
15404 8734 12251 -13628 -33726 -4483 22268 41417 21333 42760 41317 24372 1025 1488 5511
15391 5511 -7579 108 43462 34728 1434 -29395 -24010 -16520 -18161 -11762 -34432 -41647 4462
15378 4462 5582 -7300 22671 54233 64936 43148 33999 30411 32883 35638 42666 52480 53370 58914
15364 58914 66239 50349 26761 36150 67987 42150 12736 24082 11849 2926 -6055 -21335
15352 -21335 4352 14717 -2858 -8479 -6280 -8965 -8762 -7935 2119 6364 23090 17332 -3092
15339 -3092 1095 12531 41460 6557 44 10149 4783 12609 2789 14011 18231 10638 3489
15326 3489 -10944 24418 42745 27190 28806 -2650 -23834 -36005 -34193 -25001 8523 -11635
15314 -11635 -9128 15146 50707 47484 -459 -20115 10170 -5505 731 20731 21480 29835 33483
15301 33483 41187 40658 46069 33578 9316 11981 -13885 -5776 -4606 -14128 -4660 18364 19708 9810
15287 9810 -12160 5729 34914 36873 31273 16516 18020 45849 71227 66201 70291 50821 32482
15274 32482 12002 31420 11116 3484 2986 4182 4774 13628 22142 11781 -14567 8040 4162
15261 4162 -502 10488 36899 52188 54886 34740 51314 71319 66078 38631 30902 26430 25821
15248 25821 43200 39626 38351 64152 52508 32933 35913 47291 43153 24614 -732 -16473
15236 -16473 -36222 -58693 -25104 16668 1992 -3639 2813 21455 30350 51900 85782 86137 81642
15223 81642 85582 57734 61716 45095 49309 70769 53645 16291 -16588 -27068 -9087 -16560
15211 -16560 -2142 -9436 -10387 9458 22865 40943 60421 38589 49992 53068 48561 40561 33062
15198 33062 32744 43702 55369 69912 84677 110070 104594 83459 66467 49342 42640 37150 53959
15185 53959 39297 44993 37601 8002 2485 28879 61214 66354 29891 12816 1629 13403
15173 13403 -3729 -703 12055 8201 23778 22640 22912 14023 27173 32110 23199 -7006 -45377
15160 -45377 -44239 -6074 36877 38326 22295 6213 -9069 -15488 -4166 21506 34611 20401
15148 20401 36933 40372 19565 28846 37076 32283 31361 26070 16279 13734 15655 1248 2328 39690
15134 39690 45559 36653 58628 73701 49381 62278 47225 44447 27907 7813 1467 17508
15122 17508 6942 -6292 -7358 2300 30180 24753 -19406 -981 3647 31204 58152 46242
15110 46242 19046 19454 18654 13377 14126 10502 -4624 12900 20810 31105 38853 49790 41288 24985
15096 24985 2918 -3982 4583 27465 47441 52621 51885 33845 39057 39912 32030 10855 -10094
15083 -10094 -8757 6719 10859 10169 14538 20207 16363 7582 -1731 -31333 -29066 -23641 -16875 -4146
15069 -4146 18021 67082 62161 50690 39069 6088 19653 36963 53506 33825 18158 12635
15057 12635 21640 14846 15528 7493 10416 26483 16490 -2107 17396 35228 30175 22942 34403
15044 34403 36391 38310 27943 10791 13888 14615 13128 30420 38116 53518 51941 20858 -19492
15031 -19492 -32927 546 8563 16946 -1424 -31900 -40731 -7407 27861 44144 33421 27933
15019 27933 -8989 -17051 6638 29684 82629 84660 62349 47122 16098 9733 -3894 -18002
15007 -18002 26272 53606 27481 21620 22855 27314 34784 11904 9847 19250 38445 57875 77046
14994 77046 109695 123028 100828 78644 63629 21571 37664 19995 26781 52932 34275 30667
14982 30667 23079 3393 1963 4103 16297 26873 59573 88944 51390 35637 45985 25493
14970 25493 32235 16519 10282 9177 10733 36626 23968 2829 -16443 -2806 21224 17155 3989
14957 3989 9034 9494 9458 12224 -12706 -26610 -11713 -31231 -20603 10004 39437 50121 10891
14944 10891 -1503 22718 49008 55178 29927 21890 54507 28925 -953 -9730 -34358 -24601
14932 -24601 -3529 4807 -319 -4154 19798 42630 42630 50280 58051 27025 -2774 19639 17140 12471
14918 12471 -15710 -4767 22817 53983 49999 9192 4888 24150 34256 39349 -3454 -756
14906 -756 6669 -19694 -67 12845 34163 46564 43834 44762 22093 15033 11379 5134 -8496
14893 -8496 -12725 -2899 -19403 -34113 -20804 26309 20322 15330 36816 45184 44278 43350 25321 13240
14879 13240 31541 33034 39679 25194 17717 9596 16771 -3920 1690 6307 23321 34886 48260
14866 48260 61352 63511 50099 22756 -12360 -18312 -32652 -10712 11574 -1725 11005 30939
14854 30939 31464 30995 14575 -2900 -9578 17403 35588 44086 49318 -3480 -44351 -43549 -26185
14841 -26185 10985 21395 30127 33739 25841 17563 22868 12689 -1935 15762 8708 -17495 -6025
14828 -6025 4101 -5877 -14156 -28516 -16376 -13195 -6671 -3982 21689 32551 36279 53318 50745
14815 50745 36947 30883 20962 30626 20903 18896 35390 58604 55438 58117 69068 72869 63471
14802 63471 32236 23563 7402 22703 25987 37414 53296 52561 51764 50767 37663 22397 13331
14789 13331 9366 27706 31442 24611 19748 11920 8826 -90 -7792 -13912 6895 25720 25281 13695
14775 13695 21634 35238 29045 46622 33679 19997 16045 25782 16124 -15238 -10336 -1200 -4649
14762 -4649 -9738 -14722 22231 56858 22339 -16438 -17527 -6437 -993 3250 28608 21121 -1814
14749 -1814 -10083 34463 98132 107750 104547 84832 64998 65707 83533 93937 86278 79624 49999
14736 49999 50509 31024 6462 4065 10005 15747 45004 64648 43749 44402 45928 50688 50494 50438
14722 50438 46428 42774 30591 10678 -8528 -20203 -555 38513 53146 19734 40661 72994
14710 72994 71143 48387 27075 11706 32898 24441 31679 49209 46536 31223 11590 30807
14698 30807 59365 83661 75097 53434 16730 -14208 -4412 19369 18377 14659 28013 38065 30077
14685 30077 20732 36684 63315 69454 39233 35726 62712 54742 68883 56765 18820 -2942
14673 -2942 23233 39183 37988 39404 30619 14291 2472 7832 15492 10541 30062 54795 57065
14660 57065 69926 64121 17725 14858 27691 39938 38600 29872 34466 31621 12746 -1647 -10538
14647 -10538 25774 49752 60558 55562 42490 49993 32122 25482 54975 78859 78769 67891 44763
14634 44763 25986 15443 15526 12762 -7879 -11965 -24187 -5273 9928 8583 -5575 -23656 -43567
14621 -43567 1313 46735 48049 30163 28501 25416 40379 66624 66370 38213 19462 35083 65661
14608 65661 51009 62914 42534 9836 6107 24850 54618 41091 43421 49149 43377 45372 51176
14595 51176 56536 71500 62675 56084 44402 36455 13104 -10588 12848 27656 -9472 -39485
14583 -39485 -13221 22042 33027 34549 10889 3161 18351 16957 16136 15280 25594 36716 46940
14570 46940 46638 58065 62935 45501 25580 40683 73295 82482 99287 119588 122538 112422 107996
14557 107996 79519 55281 43113 55610 64484 41781 59607 75845 61935 32941 26796 17634
14545 17634 17617 34523 38356 35508 10638 17855 37873 61125 56258 37406 27541 18927 15131 35387
14531 35387 51447 43904 19592 18587 18634 27777 52564 55829 39672 24639 25083 34017 31565 26287
14517 26287 37217 45585 80561 70576 35154 3115 14094 39950 57077 35635 14300 31324
14505 31324 44953 63263 24360 4687 49170 61078 78659 62690 32490 28745 64239 77220
14493 77220 50124 32196 33424 52329 63474 48991 50398 38967 45407 63538 58006 71396
14481 71396 57606 17296 -20007 -16418 -6866 19177 43240 45867 71765 58527 31524 14929
14469 14929 13109 7747 12679 32535 20755 16920 22747 55912 35766 -551 2861 32109 50675
14456 50675 57503 68107 51262 32526 32635 24415 17347 11819 10154 -29372 -40151 -14177 32500
14443 32500 55320 47920 19952 22869 51423 46243 41422 69977 54097 22259 17887 4983 -6179
14430 -6179 9464 19759 47603 46392 40854 49443 54260 78223 72934 71805 78187 79355 71702 66873
14416 66873 32542 33375 29052 13114 13334 3293 -16253 12133 7894 -27528 -22609 601 9759
14403 9759 -11112 -25001 -14056 -20981 -129 38275 61244 54255 70081 56848 58373 63168 76919
14390 76919 73053 58805 67788 92111 102677 103222 97143 73157 57677 49572 32446 33243 19692
14377 19692 18706 33014 47980 57592 56928 52903 60028 63780 85935 70904 70842 39661 -4450 23572
14363 23572 34668 53800 49219 36893 32510 27350 -21131 -14693 -12431 -2719 18705 41456 60783
14350 60783 70559 76976 33809 36196 31481 35476 17710 12621 -4691 3354 7765 28001 41106
14337 41106 43055 45264 49684 35121 39469 33037 25076 -4901 -13167 39397 86315 70111 51459
14324 51459 57673 44700 51127 30664 39833 31608 55873 105177 91906 81563 84096 65403 23411
14311 23411 6454 10835 41601 42894 29874 -2448 206 13897 25042 12199 6572 12131 56895
14298 56895 87324 77647 78300 82518 61369 54838 60751 58797 42920 23461 14478 58035 80018
14285 80018 107763 97410 73246 51136 43953 38091 49600 71814 72477 70759 54335 63123 84406
14272 84406 91945 79747 69226 49061 51502 37155 46780 53238 46798 45722 51676 49930 43236
14259 43236 35788 38434 67166 49913 47285 70169 46962 42983 59680 34066 3879 14095
14247 14095 55129 75761 72149 63336 75825 84604 65271 68796 77248 51231 34498 17818 3485
14234 3485 14490 24507 32950 20961 41808 29528 25423 22666 22471 31794 21342 29976 29168 38969
14220 38969 56179 39438 60247 83346 75329 45590 29373 19425 47582 34943 18012 22009
14208 22009 26412 36760 7926 16139 10374 18947 24922 54451 43251 -2883 7400 -11018 3996
14195 3996 13421 39375 27728 11779 19428 19531 17286 11972 4947 12785 25343 5430 19896
14182 19896 32563 45185 60688 71030 49628 32641 39113 38234 29045 45653 56267 52782 32360
14169 32360 14109 19432 52550 53263 18041 -8128 4883 16749 72303 72078 49575 46458 42764
14156 42764 46807 68372 72564 74259 81090 102622 126211 128936 113647 91948 70651 68073 38587
14143 38587 16333 12302 25377 31451 19270 37350 41424 49437 69310 80811 70718 82491
14131 82491 86421 85408 73067 31457 27850 38649 55223 81774 66927 8893 2858 27875
14119 27875 49751 37564 10408 16752 38408 58387 53015 68716 69609 48680 25601 23632 34343
14106 34343 32928 47062 80404 78411 56263 50641 26983 20882 20511 25162 25731 20668 28701 79295
14092 79295 83620 95215 109860 96963 91690 105927 134019 112463 96308 86711 87723 83302 80076
14079 80076 74840 64136 73518 83230 59038 37166 43612 63574 69573 64992 55107 51179 46408
14066 46408 90993 100025 93906 91457 96229 75694 59519 59825 55781 63855 74973 86697 87388 70160
14052 70160 57893 57927 71527 85424 90639 105996 102243 86315 88710 101802 107060 75563 53147
14039 53147 64374 95664 82740 66290 87653 87567 67926 69223 75026 86566 80780 90828 73796
14026 73796 48142 59923 70347 61096 75123 82839 80844 62749 45853 62261 68031 70296 68159
14013 68159 57327 64506 65231 78943 81005 91542 96777 103856 110807 102808 87729 80318 87160 99521
13999 99521 111721 120073 117938 89377 43910 55360 83241 85808 61413 55111 82070 101230
13987 101230 103286 134470 106734 71374 69731 61542 57095 55734 59462 84914 103101 79455 50269
13974 50269 63132 58152 51018 79047 95199 95516 84346 73161 81684 71860 82228 87867 115967
13961 115967 118527 75882 64453 40910 55453 41298 26949 55324 68358 65413 70219 66822
13949 66822 82910 116751 110927 93590 92734 74639 87641 101699 109973 127524 116804 131501
13937 131501 126351 120885 136050 156692 186752 216784 215264 165735 144480 111310 93289 121031
13925 121031 119662 111121 114958 116357 111271 91228 122397 172890 188690 172082 145849 149979 169410
13912 169410 181077 173620 173598 172495 178438 181149 207960 217748 214550 199998 202856 226233 231570 265605
13898 265605 306984 327171 341214 394764 445389 459967 516504 594377 633481 703518 800006
13887 800006 910594 1032077 1199355 1426654 1705531 2148272 2762307 3574153 4521531 5502048
13877 5502048 6445065 7287647 7911660 8150596 7907694 7286434 6454001 5496668 4454255
13868 4454255 3477594 2666119 2036755 1623208 1317916 1092231 913312 810415 735600 673496
13858 673496 600914 536694 476620 405052 367820 359952 344033 306524 257944 233056 235604 253889
13846 253889 254568 241082 220963 186550 187980 176838 180785 173756 163682 185767 161373 192391
13834 192391 216945 190444 146470 121966 119484 121644 89098 70101 108440 120467 115664 119665
13822 119665 131345 111909 107170 97893 70723 66448 72170 97547 99093 93846 106559 85402 98732
13809 98732 88872 83912 96054 122582 132018 120188 115129 121007 123600 102795 96734 100953 96387
13796 96387 98231 133781 116188 97378 115959 120720 128978 127418 166956 159327 120254 99214 61903
13783 61903 83103 81709 79870 82919 83967 73901 54098 68058 80477 64051 92993 109968
13771 109968 109531 108457 73372 57315 66748 66804 64740 35528 -11478 -19361 31836 69260 88848
13758 88848 94298 78171 58472 36792 50869 65107 38623 31239 43477 48533 64719 85062
13746 85062 93581 113930 124875 110985 87858 120487 138103 104580 102627 108481 147210 147752 175272
13733 175272 167320 162095 145012 138335 141289 135132 120815 110409 105619 119057 122526 113676 103418
13720 103418 116132 114883 111089 107846 109232 110667 112995 105387 99735 128032 139535 136121 121412
13707 121412 143579 149015 135387 123163 95691 86702 99583 85993 86198 60997 66966 101080
13695 101080 90740 81514 81314 120584 146447 127109 118575 120915 96573 89630 122996 130717 129044
13682 129044 101571 107620 140616 147881 118647 93206 88829 108925 104034 104140 122839 158649 177810
13669 177810 154972 162577 169602 185918 184808 176003 143966 113379 78995 78434 79335 94323 108699
13656 108699 109935 129122 116403 115571 123659 127682 144951 159300 172263 134055 146260 196134
13644 196134 228868 236428 193992 197219 205231 215655 248226 220728 166195 148081 161987 191041
13632 191041 225236 233492 246179 206936 210830 182804 130509 145873 146891 172825 176378 163324
13620 163324 163873 161221 164025 173249 196384 192451 168463 189238 185733 153703 162227 186525 201328
13607 201328 195869 180956 177532 155646 171913 192125 197530 182399 158196 155809 155992 150420 179832
13594 179832 197151 181908 160119 166202 148999 129117 128096 145134 157264 177269 198563 196420
13582 196420 182843 173872 156249 139346 152104 154913 162536 176363 156546 135956 114074 130004
13570 130004 150025 168028 179258 178427 177499 146738 144822 139133 146992 170870 137688 114470 146332
13557 146332 182403 183308 170312 166354 142795 146525 148253 162836 149997 138985 158445 179816
13545 179816 181596 169402 120493 121327 149699 160585 157317 133703 88283 101066 163819 178656
13533 178656 196970 198003 165358 173145 164475 161616 159870 172996 188507 185485 177510 186676 152137
13520 152137 134831 123161 125513 120450 116089 136530 137978 152627 141027 143392 143864 134536 147727
13507 147727 157197 149871 150065 157701 149514 131417 136227 141167 153677 141790 139593 122667 131599
13494 131599 137797 126218 151423 184054 155430 140336 137869 111790 124381 136799 157133 165062
13482 165062 140220 119074 127689 150299 146648 132715 116911 136817 130798 100671 95267 79755
13470 79755 90685 111241 130941 136104 148544 146757 102777 124864 176424 179017 159270 150904
13458 150904 138725 128626 132876 116354 116887 109321 133506 147425 153336 153379 145274 119929 109644
13445 109644 101497 105821 133795 130380 116429 120918 132600 111990 95379 106043 117019 111200
13433 111200 105409 125670 148082 166750 163099 144597 167678 173484 181291 188386 211637 193400
13421 193400 180399 178408 172213 181112 192487 167958 179542 189949 166732 124704 90716 77452
13409 77452 92866 95665 73365 83916 95013 88920 69424 94475 113734 130044 134943 151396
13397 151396 123614 108693 99128 121742 131057 128874 131146 139507 152168 137347 126142 132314 142399
13384 142399 138562 129143 107105 112088 108797 130274 161468 185879 190285 173503 176265 166388 151587
13371 151587 143552 147649 146111 159965 160373 135348 134185 134607 117173 124857 119856 116462 109500 105358
13357 105358 68836 84498 112592 137899 120814 124732 141558 151459 148602 129008 139209 160090
13345 160090 156806 142686 126940 122961 127945 146513 162512 144320 142758 138703 159738 155638 135429
13332 135429 112024 105220 100935 115201 138092 134422 132584 129596 127175 113330 128031 165507 142539
13319 142539 133562 143718 160795 174145 155879 158649 150900 155719 171619 158406 167182 169824 171543
13306 171543 171375 133225 128703 104663 98671 115604 121676 143325 171349 192572 220527 220747 181149
13293 181149 162145 161584 174459 184706 180299 174916 187941 204622 203868 175347 172413 177678 165015
13280 165015 174502 187748 208377 199919 165738 157502 180081 210727 215035 202397 192104 157355
13268 157355 145844 188326 175415 177201 170362 149126 155106 162369 167572 157630 184014 214299 202555
13255 202555 208704 193067 182039 173941 160255 156540 154828 149185 171266 165426 160406 172271 186487
13242 186487 207476 224655 214018 188379 159350 166282 160513 132437 171826 198811 187833 203421
13230 203421 195818 160946 129029 134490 157067 183693 175968 201739 211318 229091 226678 239974
13218 239974 258026 262442 265410 243841 261331 296917 297816 295860 288008 269515 276404 332196 415125
13205 415125 479883 529546 608808 674874 780388 876870 906919 870890 815477 739365 675299
13194 675299 598520 515964 481788 455275 432659 427407 460470 473529 479550 509176 540781 563066
13182 563066 593224 619164 661552 729115 750964 722891 712264 709052 730270 774409 804297 819108
13170 819108 838222 873358 868892 861072 796953 733969 695428 666127 645308 612668 620311 620822
13158 620822 630961 665999 704190 705429 659231 609715 565393 522190 489945 472676 467526 472452
13146 472452 492379 504519 506710 539002 592253 670822 771846 874586 903315 902759 850116 742486
13134 742486 630887 540962 492481 432739 397715 366417 331717 335547 321996 281212 287980 260882
13122 260882 234231 231223 246340 233503 224479 209265 206993 214304 231639 266472 297297 299270
13110 299270 310135 327765 336433 332046 300101 249237 223427 245668 249168 257856 261452 251280
13098 251280 250093 259012 246028 273404 303197 314643 277537 271154 254049 247683 269518 269321 253678
13085 253678 246794 232685 220881 189240 226556 223247 225048 229598 221343 250545 273921 249559
13073 249559 212868 220273 239070 267185 255960 258968 254596 225915 237072 243082 244911 250774 233710
13060 233710 221060 221219 225075 209997 227600 252359 273932 265680 269162 273372 290887 288240 283263
13047 283263 265256 268600 267353 275266 273456 276625 281612 278857 296241 302697 283478 294160 339989
13034 339989 346569 343032 304755 311096 306884 305889 301167 286298 286694 303371 310506 317516 311084 320476
13020 320476 321308 330163 316529 332084 343092 315152 307853 305496 314857 346931 370180 397820 396871
13007 396871 365521 345789 382635 399153 399042 386119 393908 434747 469792 496568 509992 481307
12995 481307 466275 479356 472898 431724 386383 356585 370443 394810 409743 403920 401354 407593
12983 407593 406662 423922 430197 436848 431674 425187 439917 448371 442913 425333 410819 409714 411200
12970 411200 438025 444970 445261 451247 456652 452634 484487 504513 502999 488154 476991 450669 418983
12957 418983 396284 398400 419854 436437 424633 427086 431537 422400 402816 402706 412461 411782 416830
12944 416830 447295 458237 451976 465843 482680 488576 475845 459225 482596 494066 475466 487327
12932 487327 507761 474451 436595 408422 424984 446794 446334 471348 473399 467026 451336 426299
12920 426299 422372 416363 433540 423438 437071 429967 423395 431826 441751 428312 441888 447485 446657
12907 446657 441668 443390 510582 543731 558252 568590 580079 595043 602716 602950 613488 628861
12895 628861 650827 613385 583503 576663 590772 615633 646445 653638 673936 684105 702835 698215
12883 698215 717366 740156 732932 728429 767495 806868 809674 807643 860173 942784 1004523 1030022
12871 1030022 1037857 1045859 1088643 1118157 1138319 1086884 1038801 999448 997913 1004521 1013635 997894
12859 997894 985984 976248 1005694 1037641 1069770 1100497 1157425 1176288 1175083 1186347 1206247 1255497
12847 1255497 1269487 1279087 1321841 1419379 1530071 1657165 1779345 1885587 1950470 2000197 2029219
12836 2029219 2045505 2022072 1988008 1889148 1779202 1673278 1590062 1529935 1487021 1440255 1404949
12825 1404949 1383875 1402130 1401507 1399254 1400025 1440251 1446095 1461001 1460481 1473393 1485607 1510491 1558748
12812 1558748 1587595 1621211 1628219 1647583 1657994 1681205 1709351 1728830 1756925 1783591 1804993
12801 1804993 1863232 1895398 1931949 1999494 2052521 2109662 2153410 2236283 2305292 2377169 2460941
12790 2460941 2551450 2646428 2730560 2848728 2942935 3054746 3179292 3311967 3476008 3633804
12780 3633804 3791871 3979390 4175524 4355510 4604005 4886603 5184185 5494644 5860203
12771 5860203 6289333 6846079 7440982 8081767 8843836 9728424 10755577 11928305 13261613
12762 13261613 14860690 16835761 19293764 22451695 26492395 31681844 38264766 46381955
12754 46381955 56355600 68666420 83474245 99827461 114585993 122396778 119683998
12747 119683998 108259119 92952548 77866247 65104072 55283485 48278329 43726313
12740 43726313 41215383 40409812 41072252 42962655 45947153 50071704 55303685 61448441
12732 61448441 67921508 73989431 78995362 82557042 84870514 86679783 88796543 91897915
12724 91897915 96584357 103276568 111922349 121513442 130043444 134709515 133148500 125628622
12716 125628622 114826631 103757530 94306727 87242480 82497044 79719211 78359441 77947465
12708 77947465 77927452 77596279 76059552 72798535 67985612 62222515 56472512 51559564
12700 51559564 47885668 45670617 44935835 45801055 48435725 53037446 59827205 68998071
12692 68998071 80850792 95284631 111103253 125302844 133201780 130553534 117471172
12685 117471172 98691398 79550193 62988999 49771313 39603301 31912832 26131158
12678 26131158 21762148 18448780 15894507 13899966 12352788 11135055 10112231 9153117
12670 9153117 8289743 7539562 6850151 6214254 5669576 5191174 4779310 4411663 4060208
12661 4060208 3789457 3540770 3321079 3129767 2974123 2818580 2692719 2556778 2458247 2374786
12651 2374786 2236037 2133271 2062802 1996001 1936642 1838380 1744094 1676738 1646237 1612521 1545945
12640 1545945 1482912 1488082 1465450 1394557 1339621 1306762 1294314 1253679 1217419 1175505 1147453
12629 1147453 1117816 1051667 989017 971708 976883 960750 942742 939127 918475 868912 846371 827265
12617 827265 802665 772993 748854 743881 761725 784583 770444 766157 746814 745961 751209 730234
12605 730234 704357 692721 703930 724088 699397 661181 644932 638685 611433 607804 606815 617560
12593 617560 671617 710793 715423 710395 709545 682921 662010 617532 596289 584422 611966 640158
12581 640158 644771 641887 649107 659888 687065 734064 779461 824787 927196 1022378 1056203 1051824
12569 1051824 1005995 962943 906540 827527 772029 733681 694061 667285 664337 699931 691764 676376
12557 676376 636351 645095 657835 665914 669459 672813 678242 685834 688729 688899 686590 702022 711459 721200
12543 721200 732640 750954 755946 759478 737141 693516 678272 665107 653496 666888 689212 690706
12531 690706 676309 674472 695208 682742 659476 663342 698763 688012 678634 703346 705919 725463
12519 725463 754738 768042 767115 757865 725683 705494 731007 729585 760256 779266 786350 821868
12507 821868 826287 834850 856326 839915 845110 878051 920390 916616 933935 977328 992023 994121
12495 994121 1008659 1051493 1090404 1173061 1242664 1273061 1295080 1310617 1298771 1284514 1296866
12484 1296866 1372086 1435647 1442987 1459224 1493843 1545279 1571423 1603210 1653762 1681029 1744393
12473 1744393 1802055 1825033 1867556 1918459 1977581 2037693 2121243 2199705 2286423 2359894 2424471
12462 2424471 2521415 2645031 2781530 2904526 3066883 3205579 3353060 3495906 3664997 3865215
12452 3865215 4099318 4384340 4671068 4940986 5245257 5594043 5984669 6409833 6871930
12443 6871930 7395223 7965970 8671286 9528934 10529101 11687319 13068586 14668448 16469821
12434 16469821 18479302 20728904 23249453 26097092 29481973 33695192 39033810 46052718
12426 46052718 55329144 67458465 82797085 101146773 121394316 141779594 160287690
12419 160287690 174871847 183506692 184683778 178120948 164930933 147049108 126559672
12412 126559672 105525580 85864236 68998434 55525686 45255172 37592976 31934695
12405 31934695 27696525 24352824 21627078 19336873 17326669 15479814 13742642 12174637
12397 12174637 10786305 9532901 8492800 7598087 6878139 6284986 5748972 5284731 4850187
12388 4850187 4489708 4168211 3904882 3671588 3432717 3217951 3035628 2863062 2689119
12379 2689119 2564444 2452488 2323976 2221066 2136511 2080195 1985377 1878426 1794189 1716426
12369 1716426 1658675 1597021 1529603 1480155 1433402 1383499 1361225 1287783 1210931 1174038 1147706
12358 1147706 1095945 1059182 1022152 970000 949792 922411 892240 878844 876715 861478 847215
12347 847215 822152 778953 750916 725512 715676 673621 698741 732961 724413 677610 651354 627633
12335 627633 589480 555580 534100 560243 572815 549379 557573 558648 556011 547559 567344 560580
12323 560580 538066 530650 538539 560600 567765 550107 553054 553448 556876 522045 499573 493255 468215
12310 468215 468020 484956 499830 496266 488203 467694 455805 452025 429582 436310 477274 546355 578428
12297 578428 577791 633083 706841 778995 817240 824149 787387 720136 643969 593015 562432 496893
12285 496893 454713 408481 392299 382218 383361 381371 398299 442099 478505 504722 526432 524115
12273 524115 543753 571098 592709 622613 662132 683536 692122 725078 774883 810584 876306 900240
12261 900240 833249 790263 751588 704159 635799 616825 633841 648261 668599 664458 646378 612026
12249 612026 586609 577427 554885 540720 532062 510215 506859 522691 516993 501641 499640 527905
12237 527905 597133 676282 766152 858837 979664 1057606 1119589 1148466 1160426 1137030 1107150
12226 1107150 1129682 1184525 1255800 1383892 1558764 1718603 1896781 2121641 2308361 2445621
12216 2445621 2515687 2505179 2442831 2295626 2056977 1858137 1654362 1415955 1197559 1004030
12206 1004030 875964 754967 641277 536529 483850 432723 375948 340523 345602 353673 326988
12195 326988 307048 292438 270229 265780 272968 262128 216446 204329 197439 200827 202884 191505
12183 191505 188464 175168 169637 172536 189362 202040 198313 179365 167543 176513 167688 169215 151854
12170 151854 148157 165618 175248 158390 151244 182706 168270 155630 156883 143165 137516 134714 143186
12157 143186 115374 113087 144712 173247 188359 178965 169397 135275 130534 112057 123044 107075
12145 107075 82904 58788 72811 66398 47708 63498 74818 88919 120885 110814 102376 117532
12133 117532 121004 121824 115475 127376 131592 120569 100581 110211 141130 146513 166529 160644 143054
12120 143054 159964 142884 133917 126612 140892 158708 178027 202351 236221 285015 337249 394641
12108 394641 499936 578898 585502 512464 457415 397312 360445 358782 398113 470264 559531 586011
12096 586011 558079 510985 457529 386503 350359 285374 217471 184933 183078 189099 193268 209364
12084 209364 203984 206181 195946 227187 248445 257010 216734 219921 244225 261732 254838 229550
12072 229550 214276 199536 198826 187955 176678 188008 180881 202500 218338 224156 234629 255126
12060 255126 254657 257087 260056 263609 265986 273865 286117 280799 295034 307026 309510 308031 329139
12047 329139 360838 386329 431895 489798 524640 559475 630510 725561 820681 882688 934008
12036 934008 1010286 1055760 1060128 1031756 1006592 997266 988722 965571 945028 923611 909087 874080
12024 874080 830066 803199 808086 817207 798391 779266 796376 826748 854655 868137 880425 917895
12012 917895 952933 1013924 1112961 1227564 1381731 1582059 1852579 2181250 2503280 2764444
12002 2764444 2910364 2885755 2653326 2362485 2077640 1893291 1771885 1709488 1717649 1764524
11992 1764524 1720702 1670961 1583422 1480806 1354585 1203182 1083804 980607 921650 870604
11982 870604 846029 876473 903089 919582 952117 961721 936172 921976 909349 876537 839530 822675
11970 822675 794357 776078 796132 859142 959083 1101366 1317701 1600223 1934039 2280273
11960 2280273 2576714 2817608 2970407 2965862 2833016 2638429 2421822 2230035 1962056 1609176
11950 1609176 1272829 1007316 816038 689741 598122 541523 509986 478641 428247 419748 404884
11939 404884 415871 429041 436762 451998 424286 389063 380385 356354 350413 344914 338896 363832
11927 363832 420075 457741 452580 491742 517532 527511 584258 642963 757361 915571 1119401
11916 1119401 1398216 1765343 2098478 2340266 2404792 2234757 1900593 1554383 1242364 989902
11906 989902 843335 714307 634719 597648 561722 515415 470021 455686 451907 413385 400770
11895 400770 422395 427746 424600 403305 377295 351262 330072 322872 335429 355658 363083 363829 382090
11882 382090 392512 378754 389084 385902 378369 382207 382901 399828 397769 369540 353798 363630 365154
11869 365154 382697 384345 374051 351712 332799 307874 339661 381710 400919 422371 415689 364657
11857 364657 315486 310473 348852 341898 297646 279750 289190 320529 326549 308296 294495 302863
11845 302863 319180 328434 318944 350244 384620 399043 397079 392032 377505 352530 347953 367169
11833 367169 398188 412506 403514 393376 370005 363418 391503 387444 377973 372307 352544 352211 357624
11820 357624 344517 344443 316486 294884 289267 319007 333703 334184 313774 320356 327410 374038 402325
11807 402325 389702 382632 380762 407580 431608 439251 407985 433820 454519 447486 405087 407671
11795 407671 413093 374094 370710 378860 383400 372060 377511 390315 373717 370135 370860 375439 373407
11782 373407 373816 383390 391190 426699 459943 439327 437672 415124 422372 440116 439634 463020 487100
11769 487100 479625 517380 555043 573797 584787 632530 694227 735623 785926 814367 836447 825886
11757 825886 782020 766171 767235 750245 703712 699588 714073 730196 736753 763860 769247 793422
11745 793422 840277 872293 900726 928588 918878 964641 1026094 1084772 1128822 1153111 1199489 1226233
11733 1226233 1277187 1331500 1393537 1422982 1431631 1459051 1432420 1371352 1336180 1270971 1186607
11722 1186607 1156010 1145534 1148861 1141389 1137804 1132891 1130289 1141183 1151491 1137050 1126117 1108409
11710 1108409 1093980 1099828 1114257 1115227 1139456 1188662 1225142 1224697 1250079 1280267 1303683 1326578
11698 1326578 1380631 1397440 1406023 1394354 1346697 1322261 1289308 1252642 1265120 1259557 1252842 1270285
11686 1270285 1278519 1300055 1377398 1405484 1429023 1464494 1479994 1497782 1551204 1580581 1601374
11675 1601374 1641040 1692225 1738404 1781175 1837384 1848347 1906846 2015603 2046289 2038357 2072188
11664 2072188 2094106 2114697 2149645 2178506 2214376 2251721 2302554 2388308 2505511 2630215 2737690
11653 2737690 2853877 2967301 3086649 3230062 3381515 3542806 3696822 3892963 4074817
11644 4074817 4298994 4540656 4797494 5102480 5436138 5781186 6185678 6659096 7206480
11635 7206480 7875736 8714352 9714473 10895909 12281699 13763073 15157768 16293875
11627 16293875 17238036 18153458 19294652 20837291 22971708 25871654 29790680 35053776
11619 35053776 42059890 51317109 63225939 77938230 94890225 111898997 125006937
11612 125006937 130050166 125552095 113689246 98549734 83581986 70672138 60557287
11605 60557287 53278795 48615427 46261184 45899657 47278244 50211702 54569115 59914218
11597 59914218 65547584 70686937 74770957 77672265 79493836 80326763 80179192 79454949
11589 79454949 78927337 79818359 83294485 89891664 99493631 111045681 122510853 131096579
11581 131096579 134164846 130683269 121899581 110564378 99646442 91171285 85745293 82856165
11573 82856165 81437597 80426685 79019226 76915887 73970969 69967789 64760555 58631551
11565 58631551 52386622 46936291 42874899 40380411 39424917 39896085 41931760 45720911
11557 45720911 51579762 59659846 70057751 82487090 95798912 107322327 113286152
11550 113286152 110839993 100287022 85067285 69225072 55209327 43845686 35013521
11543 35013521 28344573 23343861 19596708 16756687 14549081 12720530 11163156 9844017
11535 9844017 8703745 7753673 6945008 6245658 5663865 5173540 4740489 4355286 4009132
11526 4009132 3705539 3420652 3174660 2967699 2779752 2627525 2485261 2374071 2267200
11517 2267200 2147472 2034984 1942525 1838626 1767566 1699637 1651208 1612843 1557302 1495469 1440764
11506 1440764 1383127 1275184 1209474 1199030 1155393 1102497 1038469 1003512 988850 968414 932324
11495 932324 882573 846855 817265 790044 760576 734906 729283 723550 702536 682622 645582 624987
11483 624987 612132 603219 577595 523958 524681 523099 538743 525610 498024 468600 472930 471351 439248
11470 439248 417550 399551 376340 342953 352163 379022 391625 355369 337010 336980 314558 282560
11458 282560 272264 265001 278665 314785 304052 286292 280088 238810 231973 224364 246315 249159
11446 249159 235029 232270 225227 217877 211911 214529 215973 242345 290118 312046 333457 359650 405509
11433 405509 418426 379042 339448 300551 265162 256102 226924 217340 231850 231145 202284 162972
11421 162972 127939 106151 113751 116348 143667 143135 137307 129158 96482 98442 102790 114955 141193
11408 141193 130396 105828 92866 92128 101466 83168 78912 73910 73705 93548 75337 78085 94596
11395 94596 99873 91697 119890 133266 100799 94952 94816 112892 109938 124547 128726 106009 97957
11382 97957 101902 109650 126221 144119 147601 169957 161104 119194 115923 145004 141191 130527 111033
11369 111033 93009 74143 77624 77140 77702 92297 87211 105253 117107 111682 110195 104305 127483
11356 127483 140385 134244 128105 152060 155037 146053 138743 134489 131338 150023 182593 220278 245559
11343 245559 245598 268507 296928 333226 375069 429886 503452 569735 672733 810342 969940
11332 969940 1171675 1346971 1483502 1528155 1439343 1253901 1052321 869441 694275 547663
11322 547663 432759 380530 378450 360698 313133 246043 201479 174400 168340 173556 155444 130237
11310 130237 107856 68107 61099 63469 66371 77275 62803 42401 43824 48571 42456 59852 41190
11297 41190 24328 6089 -46528 -23889 32687 70936 94671 135245 161923 130196 92136 58467
11285 58467 31166 27253 30231 38446 48212 48150 54649 61471 63861 56055 21726 14425 15742 10256
11271 10256 37016 46864 26885 39675 42264 50282 54265 65023 72202 73540 77502 111950 146857
11258 146857 152243 135760 127984 93576 71524 78649 74154 83603 63882 43006 22576 16498 24428
11245 24428 20941 10710 7712 31831 77321 94154 78050 56802 56144 55113 33040 17294 23051
11232 23051 61057 60935 79434 101628 94686 96300 130824 119290 104101 111688 112338 129569 145621
11219 145621 149260 161840 160652 175242 213020 202931 191332 159956 141116 136705 111231 106994
11207 106994 141611 145292 138445 124527 116499 135333 170753 193529 158025 146895 181509 207941
11195 207941 240650 241791 250334 238339 259274 324514 420085 466279 494369 568508 642014 745235
11183 745235 835025 904468 937219 867122 759807 659091 590658 529587 458511 428181 398492
11172 398492 370985 379516 402440 428470 447745 470168 482642 492569 518680 569354 588991 641602
11160 641602 645498 597610 626635 695978 709510 715393 718514 773397 828244 856491 883440 874922
11148 874922 840197 793641 726989 660748 619413 584621 586699 597042 609845 620479 612157 606725
11136 606725 621613 606009 574364 545205 542551 569340 606012 622815 673630 754382 850039 938646
11124 938646 1049162 1210328 1410707 1622753 1872390 2144737 2522938 3118252 4007329 5151402
11114 5151402 6135635 6551546 6845010 7637020 9049428 9989622 9388731 7909879 6798913
11105 6798913 6381676 6012686 5100384 3857340 2754060 2030110 1543390 1225043 985153
11096 985153 836374 742187 663197 583251 536244 490577 435439 390347 388657 373340 359666
11085 359666 326922 280561 250101 261740 250842 250339 242801 256306 262971 250332 238795 205663
11073 205663 203851 190123 197319 216042 234904 216275 206255 181540 175992 172041 182498 194046
11061 194046 206011 185065 172194 178231 176725 176359 213449 251369 306499 352413 384012 413141
11049 413141 414678 394786 334940 271137 245430 243795 225629 190561 182820 192994 166698 148085
11037 148085 145299 154770 181517 183207 167076 183413 215844 227595 229068 215561 197068 188440
11025 188440 186822 219680 266127 296629 300621 309854 354268 381895 348888 307024 250282 200217
11013 200217 185220 181767 150293 141645 161345 176274 167925 176219 163334 184152 151917 107376
11001 107376 96571 96153 88588 107119 125185 98379 119995 120294 72504 74222 53973 19981 29523
10988 29523 46074 58675 85540 100357 75480 68516 106227 101548 90724 100565 97022 100154 99965
10975 99965 90581 46447 63060 121789 155174 155114 166604 185471 179629 174731 159019 136647 131060
10962 131060 117494 98986 72355 75266 74134 83116 99090 120894 133946 149663 163411 155025
10950 155025 127561 131761 148175 143505 142969 151790 160612 116992 112906 124812 114951 83933 74342
10937 74342 67498 76153 98074 103553 119341 104547 85506 91894 82568 74744 66136 95917 108329
10924 108329 110592 167875 196856 195403 161452 114522 106878 135610 137750 166553 147652 125184
10912 125184 125908 132587 141596 174979 203849 230129 225655 189788 190484 197213 189200 197790 186288
10899 186288 192434 191238 216206 252826 281037 311678 316870 375593 448621 540218 678948 845830
10887 845830 1045846 1295399 1617535 1954579 2207021 2198787 1926418 1537704 1204942 976227
10877 976227 787001 600217 477172 389268 344548 315386 279505 233712 233846 227688 227373 206049
10865 206049 198961 196644 200172 194274 220792 204768 179877 203208 193985 159898 174660 155922
10853 155922 179224 214074 227835 245576 233586 218393 210470 200492 183415 175641 189238 181525
10841 181525 160783 178600 209612 173031 130994 108968 111282 92995 86678 97140 102903 96150
10829 96150 115438 132970 121546 118343 153690 222969 243279 207716 192854 221947 220916 200300
10817 200300 189903 172553 166569 158256 143427 137053 106231 101750 131892 147481 145848 143912 126935
10804 126935 130755 158794 150592 163997 177749 182915 196055 190510 228904 208997 193801 193072 192815
10791 192815 200830 185106 148123 115749 86656 99814 122920 126086 139284 172811 212573 164607
10779 164607 163979 216264 253062 245673 242591 235230 208587 213330 209182 226250 255041 267222 270595
10766 270595 246035 231722 221913 189619 173712 179448 198943 182939 173912 176209 162657 144782
10754 144782 146572 162962 184004 204543 195508 185659 204009 189273 167248 160854 152407 177314
10742 177314 207036 210360 215266 221439 227343 242027 260546 223271 219538 237542 237006 252193 251949
10729 251949 234550 230596 235634 247988 270822 283510 296180 326860 339874 338787 313092 280641
10717 280641 299158 334289 372633 413155 416478 416410 407993 373496 307112 277539 269579 239259 252240
10704 252240 242275 222377 216929 215629 228941 242971 233076 225877 226897 220955 225569 228933 227476
10691 227476 227089 227299 233494 254286 270654 258080 262022 264516 276370 270298 292850 286514 270265
10678 270265 270211 273086 255889 242038 240039 252889 265484 301168 318595 303454 264127 217218
10666 217218 217822 245620 266969 268274 305187 293335 244530 234725 261843 278009 270838 261264 281113
10653 281113 288609 296464 303426 324782 366981 383694 385894 385991 377208 384701 376906 397116 396623 359231
10639 359231 342160 352966 380835 373558 328868 319539 357779 412169 438348 449727 456345 436096
10627 436096 406121 401566 398621 399479 426915 438406 445060 462420 489914 504053 520926 546279
10615 546279 572983 596058 571513 576206 582124 562712 532777 554670 585998 621130 644144 683051
10603 683051 715433 719234 723523 734316 753983 814184 895931 916784 880828 848587 815712 795686
10591 795686 856766 935931 1021105 1061539 1029331 943641 861583 807503 782419 756052 754604 749803
10579 749803 748135 746466 745341 731879 694616 710698 720697 694953 693287 707011 742996 775486
10567 775486 809741 846320 853733 860311 871854 882765 890172 897001 907818 932361 961813 994635
10555 994635 1040774 1051616 1046162 1096217 1150620 1167446 1183570 1186032 1176856 1167021 1168933 1226303
10543 1226303 1258635 1298838 1327399 1352505 1402496 1452747 1488559 1546041 1600822 1634922 1661187
10532 1661187 1707153 1780688 1869094 1931921 1986683 2033055 2107561 2149126 2210973 2268320 2309166
10521 2309166 2360092 2419663 2475382 2519533 2594935 2690685 2793014 2870061 2986985 3104291 3287642
10510 3287642 3473222 3662328 3839687 4010477 4183179 4382706 4594547 4818238 5051176
10501 5051176 5318876 5597266 5858438 6171635 6539206 6941672 7343633 7753937 8190958
10492 8190958 8681341 9226864 9853919 10601437 11448322 12422102 13593785 14974343 16548662
10483 16548662 18336371 20294632 22378300 24609942 27148277 30239321 34117642 38919491
10475 38919491 44933287 52566428 62362760 75246292 92469107 115780398 147629807
10468 147629807 190993368 248061063 315906095 377659755 402415879 373372739 308621820
10461 308621820 238332891 179795144 136191342 104853843 82380797 66057073 53961785
10454 53961785 44825556 37875927 32471239 28253434 25011977 22477435 20445101 18697964
10446 18697964 17055096 15445777 13881536 12455911 11186121 10072752 9126458 8351200
10438 8351200 7721834 7132146 6584884 6109096 5707205 5380765 5112573 4910471 4752841
10429 4752841 4625259 4507412 4395531 4298743 4212045 4100755 3975367 3838488 3712993 3591662
10419 3591662 3469597 3347743 3201873 3018113 2880183 2748179 2611409 2482526 2302204
10410 2302204 2139310 1990637 1844113 1716746 1617784 1527870 1441046 1361893 1322254 1306885
10400 1306885 1285269 1238781 1191485 1162205 1164767 1192237 1230328 1276444 1318843 1317118 1310191 1290108
10388 1290108 1261808 1207503 1142679 1103095 1066028 1035047 1031703 1022646 1063153 1167611 1276391
10377 1276391 1383396 1531308 1658094 1819529 2002066 2141556 2240099 2300206 2358737 2359066
10367 2359066 2311211 2255776 2180871 2096292 1963990 1777764 1633954 1506058 1380098 1262085
10357 1262085 1146350 1029558 900486 812315 754211 674551 633992 580504 537887 525506 518600
10346 518600 438678 388083 408037 404065 367266 328874 304005 292344 346531 405319 452623 429212
10334 429212 369515 309522 273617 275025 293938 343803 421707 485171 526395 595436 676984 795938
10322 795938 926003 1042505 1144647 1256371 1345516 1403639 1436384 1391855 1344120 1272167 1193288
10311 1193288 1102261 975696 865426 753305 631232 540677 450153 358982 294298 236126
10301 236126 196601 151690 113480 75389 111499 131771 151709 152511 129434 116875 102303 93186
10289 93186 55487 54628 75780 56965 24080 19315 33145 35733 41896 41507 39237 40571 19374
10276 19374 10077 24783 53693 80091 101958 113569 124936 124659 122508 101941 108955 114692 94632
10263 94632 73414 42907 42570 77367 87536 85756 83329 122148 118531 82968 68232 54132 69280
10250 69280 51684 22592 33176 23851 41099 55411 42128 33505 42075 33708 39762 40734 27007
10237 27007 20609 7366 1340 14640 30686 33917 25431 49865 72066 86054 108100 109673 93706
10224 93706 118786 114513 146711 178711 191270 179113 155675 168963 177715 154483 136595 94069
10212 94069 80263 72746 78545 58430 48982 36405 18033 3425 30382 14378 -24926 -8386
10200 -8386 26804 36807 50699 42127 47410 88545 103801 104402 83023 41704 23949 26918 28542
10187 28542 2129 -12763 -11290 -37552 -52464 -59137 -29360 -1206 16313 30908 23190 2936
10175 2936 -4636 -9678 -774 8077 -25277 -4252 13950 -1762 -10183 -10654 -12064 -23620 -24531 -39505
10161 -39505 -62690 -23316 -7815 -9059 -24000 -46578 -26157 5762 28352 50609 61030 51085
10149 51085 25458 33971 35771 30324 52011 47458 55685 35348 29746 18957 38882 43529 37560
10136 37560 58489 63404 85669 102769 111525 110751 133446 137237 127523 123192 150476 149555 149867 179880
10122 179880 211113 253604 308097 380173 459650 569503 714601 797368 790597 744353 617862
10111 617862 499078 404769 349394 324408 294363 320244 353621 343271 360304 385226 445979
10100 445979 506555 557333 605584 629970 687845 768811 868901 1010562 1194606 1443330 1758919
10089 1758919 2159557 2668124 3277656 3931994 4519037 4858153 4740114 4277436 3633051
10080 3633051 2945753 2351882 1880500 1487097 1185062 983043 833596 698377 625298 593023
10070 593023 522036 476629 433395 400860 377950 351751 288836 287934 285257 277225 271836 231465
10058 231465 225095 229664 242553 224367 219064 246148 270508 293729 314167 358619 442569 542299
10046 542299 620694 737976 923733 1161460 1438973 1777755 2057730 2137959 1967742 1625172
10036 1625172 1236699 951149 783060 646354 537073 444288 384551 333136 295987 262978
10026 262978 243503 220730 174358 172748 179145 172019 137404 103700 101614 77190 105232 117599
10014 117599 90022 93307 96197 94943 100605 101633 89512 100228 134943 162239 192268 234181
10002 234181 315885 401745 444797 478899 495310 495407 467422 424501 374217 312575 281104 230930
9990 230930 206299 191690 174932 192734 217805 247427 242068 219161 166353 136627 114093 84161
9978 84161 58796 33856 57466 43161 25326 7981 8588 -2514 12198 42218 33715 37053 26839
9965 26839 21956 32567 38495 46042 51032 45671 23844 4353 5470 -10015 -1567 -3388 -42435
9952 -42435 -45943 -16999 -1126 17596 12807 5180 10572 44361 46523 16622 32425 29746 13516
9939 13516 26983 62055 41911 26241 17998 41895 18278 -7568 -30870 -6131 13009 10366
9927 10366 43552 96512 114277 100663 100822 114625 135194 132436 107052 116677 90054 74860 67087
9914 67087 53767 21988 23582 31980 33949 47616 70003 92061 148358 183865 199631 216672
9902 216672 270963 365362 446365 531314 512860 483550 491736 548705 556540 513009 403735 290443
9890 290443 199291 147827 154976 179786 200534 209341 262640 283737 245532 172846 168532 206415
9878 206415 199807 185798 196883 202268 212336 184949 165058 159581 126910 106616 91154 135118
9866 135118 189610 189760 172944 194007 209919 217246 227734 306161 410788 540845 712869 932204
9854 932204 1105885 1268386 1364176 1400190 1358173 1244891 1121640 1085137 1132328 1271200 1380334
9843 1380334 1352813 1197504 989078 782656 577695 463941 397375 323592 296846 280554
9833 280554 285198 291089 303352 314751 336902 337551 287193 273130 284282 276805 262461 262615 275036
9820 275036 298239 329516 323765 315265 340608 344470 330875 388384 462761 558757 736717 897905
9808 897905 1064024 1275838 1430610 1532675 1535967 1471763 1347786 1217255 1176776 1163317 1142286
9797 1142286 1139495 1160044 1115831 1030532 967751 890741 774954 609843 485380 410262 365603
9786 365603 308504 268580 258157 258517 236212 227089 240046 278616 296998 295055 287419 269141 258920
9773 258920 244800 198826 190795 171757 148933 170405 209502 254424 305576 375668 437245 484090
9761 484090 503214 497326 524317 624481 729882 894133 1048677 1122147 1118517 1078597 992171
9750 992171 865385 727607 633301 623688 645997 629134 630944 582452 493516 382750 308624
9739 308624 281010 262390 259481 256202 281929 317594 356517 405712 458252 469292 493075 485888
9727 485888 470417 422777 383297 342235 275530 202766 145356 105957 97306 93196 96532 85910
9715 85910 83023 95138 92311 119555 147773 205651 262968 309061 355347 361078 334708 312256
9703 312256 326432 334150 306303 272222 224417 149251 107121 78295 55179 39544 59166 76684
9691 76684 70172 81846 89636 82010 61488 64319 68404 47788 61625 103131 116253 116927 89482
9678 89482 76191 74796 70367 60943 60532 54320 68867 92821 62167 71025 65348 77569 91598
9665 91598 91680 123126 139913 118706 108638 111398 108103 94242 107714 110096 78534 75323 108815
9652 108815 86972 67466 59984 30324 7193 23904 48923 75488 47544 51740 80679 61655
9640 61655 27758 27660 44666 71585 86098 92978 85007 86001 71541 91635 86578 104483 103694 93946
9626 93946 95916 68086 55255 79139 95970 110302 114331 106061 86039 73875 93127 112938
9614 112938 77903 80558 92841 97866 110121 120467 117366 116844 116045 77933 44856 53192 89293
9601 89293 99953 67488 81471 117495 167551 188789 175664 168159 152798 129570 124221 105014
9589 105014 87259 95450 99509 86379 88108 103713 82367 79742 113716 112426 112456 110231 132544
9576 132544 146160 162448 134900 109612 115115 150411 151115 131919 144879 183986 172879 153992
9564 153992 141843 135448 152268 167394 171232 155532 157846 157233 131229 134409 121718 125891 134914
9551 134914 122079 119891 107157 116829 129025 141293 152055 121389 113797 130899 130126 138056 156835
9538 156835 154977 153271 147332 130046 146429 142712 145805 161228 165119 185875 175611 161735 144670
9525 144670 131263 157479 171256 199217 192890 167510 154823 169001 169329 198401 217954 189912
9513 189912 168842 167390 195574 222411 220549 192902 182313 193088 189893 204299 198674 184568
9501 184568 178045 194521 209716 208005 216393 236340 268671 258763 262161 290162 295413 313333 277603
9488 277603 248293 232428 232149 243964 246904 262233 259989 244912 258290 269071 282799 269893
9476 269893 284350 272182 258588 266222 282780 283121 300124 291381 264111 210556 203425 205828 234322
9463 234322 280758 291237 295251 307263 294775 286260 291096 287821 312460 340073 344754 325767 313971
9450 313971 300913 318645 343612 339136 338369 327497 328313 324627 330905 360951 329734 310349 318470
9437 318470 344280 349969 343186 338003 357133 373136 374294 346424 358969 362803 356654 358690 384016
9424 384016 373697 353245 342833 333510 320466 337093 353173 365694 369802 370826 374203 373902 373747
9411 373747 384014 414916 435248 448525 442303 413045 400554 386864 409641 430470 435151 432069
9399 432069 404507 380458 383027 422210 451205 465681 496704 520162 505885 503875 520316 521770
9387 521770 551825 555008 530921 511907 532353 548196 547021 535817 544583 548228 538986 572302 610146
9374 610146 648284 643966 642559 642221 632679 631341 663069 646590 646227 651193 643290 649934 670012 689846
9360 689846 729838 730405 734092 733983 748985 763903 761220 759932 799463 824470 846398 901604 927461
9347 927461 908541 908102 920998 915763 897110 899369 907695 926897 951393 955950 969697 993517 998654
9334 998654 1003283 1004945 1030272 1069438 1069590 1074218 1099579 1126426 1153607 1188625 1198217 1201001 1210492
9321 1210492 1207321 1198902 1194827 1225827 1258511 1263705 1277414 1307359 1307157 1321874 1338527 1323265 1352930
9308 1352930 1399088 1422752 1448767 1448176 1465046 1503236 1539612 1561605 1585552 1633793 1656707 1681969
9296 1681969 1740989 1786092 1823803 1881195 1913053 1902238 1943499 1991982 2029625 2087382 2103004
9285 2103004 2162875 2227288 2255520 2275179 2301298 2362802 2421493 2476363 2551665 2629717 2699014
9274 2699014 2777234 2839181 2896765 2977903 3084649 3194040 3274970 3343650 3425590 3539631 3630007
9263 3630007 3721097 3835955 3955579 4099977 4220976 4344698 4472628 4625338 4771229 4933057
9253 4933057 5104592 5277334 5452878 5634963 5844452 6076987 6292314 6512558 6757831 7024719
9243 7024719 7344304 7653006 7998855 8335505 8659204 9039198 9482682 9921906 10352235 10850592
9233 10850592 11396499 11947783 12531909 13195533 13908593 14642758 15422654 16279454 17227103
9224 17227103 18204148 19250407 20375638 21597180 22879913 24246000 25718353 27308650
9216 27308650 28975948 30737410 32586949 34506986 36466114 38488759 40570209 42620506
9208 42620506 44607071 46492312 48204916 49736288 51024303 51978643 52567844 52741639 52590720
9199 52590720 52031125 51061414 49794905 48268425 46548174 44645279 42606035 40510280
9191 40510280 38395529 36295573 34252154 32278849 30372015 28561345 26837801 25217338
9183 25217338 23716907 22305972 20990145 19756587 18576929 17521971 16576446 15688643
9175 15688643 14833138 14006221 13241869 12552007 11939397 11340236 10761697 10210975 9727914
9166 9727914 9299853 8881375 8482889 8104182 7747877 7428354 7140700 6838988 6570341 6318062
9156 6318062 6059350 5802942 5539548 5330541 5130488 4936941 4777832 4609057 4448561 4284628
9146 4284628 4156853 4018784 3903387 3776774 3644395 3531550 3417236 3296546 3228242 3143495
9136 3143495 3033653 2947648 2870546 2805736 2734913 2644602 2535882 2449169 2403623 2363383 2309390
9125 2309390 2252816 2186110 2137424 2066080 1991640 1955304 1937965 1883882 1824465 1760685 1719654
9114 1719654 1703242 1699899 1655779 1614605 1574542 1520290 1479712 1477849 1472010 1407455 1367799 1363349
9102 1363349 1349974 1325399 1312178 1303738 1304697 1308202 1265445 1208783 1159253 1110946 1089827 1054461
9090 1054461 1009499 997889 965609 912564 900877 891863 906204 905400 905966 905979 896799 865459 858014
9077 858014 813815 774919 775650 786632 780420 772388 784572 758840 733805 708990 663826 647417
9065 647417 656679 640680 623300 622067 627895 605429 552977 513262 542595 554094 558451 543157
9053 543157 481783 457575 467172 479355 499041 498565 492116 492736 468508 452435 444765 416227 400659
9040 400659 410254 421315 440746 441213 441929 461643 453384 447582 429824 409703 393757 364978 355367
9027 355367 344228 374766 403664 385023 374887 367139 331909 303322 306271 330592 330192 314509
9015 314509 289490 295928 308508 312608 345725 352231 329479 309642 295347 285544 301790 295215 304950
9002 304950 308157 310945 326339 314829 300353 284469 294283 264900 255549 259969 251476 244619 259323
8989 259323 264178 238285 202853 195459 193751 218456 230868 235466 222285 200439 189475 189802 211699
8976 211699 219607 216122 211790 216114 235677 220604 207865 245685 232100 177596 173892 187821 182050
8963 182050 181719 160513 173998 198165 199893 193286 186746 194447 186411 166857 179625 179079 138626
8950 138626 127397 139969 144116 130295 112364 124241 135904 130615 142971 163427 167757 163856
8938 163856 144992 141624 159182 154434 151918 136390 115746 111111 108683 87656 96081 110713 128873
8925 128873 135088 106174 94891 110708 129222 137509 97766 70910 66768 64595 76571 64677
8913 64677 62699 70634 71897 79748 72959 54782 62888 76950 111021 98870 76907 99767 118724
8900 118724 113496 131853 106726 92221 116491 98979 81254 71585 66553 76376 105657 106894 70436
8887 70436 57145 58081 56090 52053 48896 48714 41520 38443 73147 78553 63564 45144 42455 58146
8873 58146 100375 122085 103956 68318 74065 62345 27656 29130 71505 97497 101288 91891 66429
8860 66429 64289 74554 76628 77344 88129 92495 112176 95653 72653 66968 54355 30605 20556
8847 20556 19719 36369 49995 52622 79994 60524 53854 63875 42645 28988 34546 60431 67839
8834 67839 68753 76821 93861 79457 66674 27137 3555 1923 38274 48028 37231 29992 29583
8821 29583 27257 55067 39010 24317 24807 -267 -14590 1379 21504 35905 32586 39014 60959
8808 60959 66300 41183 36532 56346 80266 70903 40864 41615 58564 81436 57686 36208 17860
8795 17860 -4547 15069 33626 52639 60794 41055 41825 45329 21075 -9516 -7817 7690 11042
8782 11042 14159 12516 12495 33563 56141 62559 61815 34022 41003 52980 82165 102979 124415 116334
8768 116334 112021 63281 15730 8157 10514 40158 41621 47403 58790 57256 52105 39364 46501
8755 46501 42734 35628 42852 45135 41184 47674 42144 41384 28198 36289 51469 59821 57848 54713
8741 54713 49269 50404 57584 49996 77667 71940 45575 37549 42524 54669 70230 49527 54567
8728 54567 60673 39278 37045 36748 46115 67748 84937 96399 73312 83728 67826 74158 60056
8715 60056 52002 58292 74613 71720 58386 39706 47401 79451 92053 106326 69434 51514 59890
8702 59890 56972 42472 23852 31751 38347 62825 30114 10805 22053 23380 31444 34278 20113
8689 20113 15234 1452 7628 -21210 -40357 -42481 -6061 246 -18246 -13599 -8399 14649 52685
8676 52685 78097 83609 78469 57747 33422 32150 15812 20227 18220 24886 25535 5294 11919 19679
8662 19679 7631 19640 18238 24529 5701 7056 19156 36580 51260 45602 38806 65828 65691
8649 65691 61973 88273 88134 106370 171013 199020 175398 141604 129260 127088 121644 95965 72975
8636 72975 58463 44026 55659 53892 37695 46772 74445 69598 70654 93665 80851 111510 117436
8623 117436 91220 58420 69780 62750 51098 63970 109138 126574 138144 157901 172113 153651
8611 153651 139739 130203 153603 165085 148806 132845 160845 205691 272783 338309 432185 549023
8599 549023 589719 571605 494977 445853 445142 455764 486612 484721 457936 427210 412843 393923
8587 393923 359908 299040 251926 226381 190215 153268 110531 91901 90731 93525 99154 96081
8575 96081 82156 93679 109387 111794 85504 66136 90410 105051 85978 76793 95764 113407
8563 113407 110546 98025 75266 55249 77261 162257 257649 316030 361318 358743 275386 192061
8551 192061 114177 93522 66753 59803 63503 51085 36731 26025 34884 43074 52442 39554 31267
8538 31267 -5374 -11929 19541 37586 38331 55768 65384 83442 100890 129526 116784 76584 52762
8525 52762 57591 42608 21870 33095 68622 66246 67957 72493 79521 69618 59148 77788 125873
8512 125873 180515 241704 217528 150402 90424 54698 50509 53588 36606 9671 -1022 11271
8500 11271 15596 25020 130 -2718 19047 25874 33499 45444 71607 103766 103663 85949 41948
8487 41948 47089 40074 26033 30409 45548 43094 48503 56966 69403 67714 31432 21805 30592 28330
8473 28330 37528 15340 16501 677 331 1237 4676 -14575 -18862 17745 36356 24318 -10615
8460 -10615 -13014 16328 3008 13201 5791 -6854 16697 13290 16554 34285 27954 -4997 -7524
8447 -7524 19851 31532 17229 20156 14220 1340 -10950 -12396 -28524 -20586 -27018 -13825 -7994
8434 -7994 -50571 -72097 -26624 13026 37476 56256 66193 41491 28437 29541 31318 13902 19053
8421 19053 21777 21836 8658 9016 -726 20445 55338 51725 38255 -1554 -24707 -25822 -6580 -14035
8407 -14035 -6073 17247 19434 17840 18787 3779 -6933 -37745 -42872 -15626 4425 -571 -8475
8394 -8475 9955 39932 64097 59475 27931 23516 25607 -4071 -39506 -58346 -48565 -10406 7994
8381 7994 -4583 7142 3967 13731 15786 25934 23453 33034 54852 52653 53244 25537 -25000 -32885
8367 -32885 -9343 -2912 -12225 -11463 538 30769 57079 72743 51126 8026 -18616 -22815 -37731
8354 -37731 -24781 -7212 -12736 -12935 10736 31944 27916 20743 29699 30019 18615 11799 -1969 -19185
8340 -19185 -30643 -22131 -9898 4321 -11488 -31668 -29620 -20871 -28846 -19626 6186 -3279 -998
8327 -998 -18116 -44566 -47098 -32708 -25152 -25794 -3982 -528 10290 9056 11186 -949 -19232 -30240
8313 -30240 -55670 -37850 -61795 -47108 6337 26350 26112 12480 15460 11782 5851 15389 29804
8300 29804 9697 -1448 -8158 1028 1900 5925 -3670 1643 -8897 -27912 -23076 -12406 -79
8287 -79 14061 25161 18774 7983 29360 26043 25561 16969 10081 23056 3604 -7839 -22826 -47109
8273 -47109 -46301 -16315 -13757 -10734 25909 15130 -9822 24 26018 31789 8035 -643 18943
8260 18943 11773 -4845 -7164 -14287 -8606 -9059 -14343 -9650 -14335 9166 8121 -19059 -63690 -37379
8246 -37379 39289 47280 61009 65064 42820 26934 44388 71376 42881 -1562 -28704 -45154
8234 -45154 -67688 -51309 -4966 -1646 -7171 28873 37020 30739 29208 11886 809 -4085 15762
8221 15762 20912 -8133 -32462 -37968 -21742 -6682 -11045 -20626 -39881 -46914 -28227 -15849 13154
8208 13154 39421 24833 24030 19472 14957 6040 31931 53867 30474 -23267 -17126 -5522 -33288
8195 -33288 -60538 -67113 -25952 487 1130 4064 -18246 -32410 -57999 -62953 -31770 7697 17602
8182 17602 19794 6177 -5954 -1531 2922 -2315 458 -6920 -12248 -10984 14271 1285 -12494
8169 -12494 -24137 -24057 -10398 -6494 -14698 -17601 8437 15156 34403 4517 -1275 12881 -12997
8156 -12997 -39699 -49688 -37844 -25377 -14734 -39480 -38639 -21720 -6412 -16840 -23225 -29122 -27361
8143 -27361 -33028 -66653 -61086 -29602 -26704 -41002 -30167 5562 53492 61051 68736 68780 56263
8130 56263 68528 65618 53776 35606 18764 -27557 -40413 -33085 -44837 -50446 -36875 -23791
8118 -23791 -33722 -26601 -23099 -6654 -11460 15729 21942 22796 589 9119 16335 6996 -1325 -20368
8104 -20368 -30178 -22537 -20894 -36364 -27087 -16120 -5080 -1657 -13542 19369 35470 42696 52965
8091 52965 29172 27767 40932 37632 56530 60647 65830 68535 40432 30868 22921 20898 323
8078 323 -21277 -60577 -29000 19362 2655 -17139 5000 25978 38140 16655 25212 34040 25684
8065 25684 29342 25812 19571 19438 8595 32666 47388 61548 71085 47052 11502 -7134 -24602
8052 -24602 -21630 -17442 -13265 -11187 -6791 1616 -26817 -24032 -9457 14703 9948 19372 26403 24883
8038 24883 21227 16301 56 -3975 11629 36580 49538 44422 27690 44748 37312 40665 19450
8025 19450 -11607 760 6440 14454 21757 17633 6848 17877 18810 -1380 436 -1063 19219
8012 19219 19627 29681 21997 4568 15838 57973 50635 25744 47733 59477 57385 68239 96267
7999 96267 110995 96538 96251 118407 124663 109743 86514 98438 84621 59600 25826 25328 40613
7986 40613 60994 39266 35435 60577 49127 61255 97085 140507 147324 116673 102229 83816
7974 83816 92219 102726 84844 60353 62617 88613 95988 118596 130335 144364 149367 151441 142620
7961 142620 145716 127205 115625 111509 66522 87908 126143 117417 140123 165418 171766 166748 175717
7948 175717 172200 165214 152130 151358 160660 152292 151940 137157 123196 110452 121148 126369 82026
7935 82026 66784 67879 84396 97359 113208 115498 82530 79092 72063 82295 89602 99200 123308
7922 123308 140539 139769 124046 96124 88039 80360 92409 95646 135266 131012 93766 88419 94061
7909 94061 80267 64156 79287 85271 93701 122647 106044 88710 99424 101102 105709 108752 95439
7896 95439 81514 71367 64806 56273 55625 32595 16798 45115 12892 15628 62358 84801 92101
7883 92101 79962 55724 51978 97262 92391 81605 64104 67415 46898 37337 28835 38856 58542
7870 58542 50365 17559 13830 14572 11634 -16537 -49920 -48345 -17593 -9290 11664 33197 21215
7857 21215 -2348 -11007 2426 24591 29002 8459 -5360 -32707 -33912 -53620 -36900 10996
7845 10996 22165 33220 18489 13305 14191 -7942 -22524 -9798 -31423 -42677 -41736 -22719 6456
7832 6456 -7464 -12630 -24248 -39243 -39920 -31945 -36292 -37752 -28674 -31758 -13560 -15154 -37669 -33906
7818 -33906 -32303 -47642 -42713 -34874 -26139 5716 45798 46345 24691 3464 -17274 -21270 -13476
7805 -13476 1214 46332 14258 -37767 -64340 -65013 -46327 -45047 -42695 -30142 -12578 -34798 -58954
7792 -58954 -21751 -7396 -33338 -34652 -54717 -29728 -19010 -7709 1712 -16297 -24998 -16361 11254
7779 11254 -3753 -43158 -74177 -92200 -59821 -42135 -44999 -33036 -25685 -20793 -38206 -59028
7767 -59028 -61795 -34984 -26250 -52391 -81179 -38297 -4582 -5923 -8003 -11614 -12051 30157 30942 18219
7753 18219 14732 37214 43739 27917 18910 234 -5920 -26011 -14260 1673 -2376 5129 -4047
7740 -4047 -42264 -55303 -36547 -10394 -28165 -36455 -19688 -13969 -33030 -43857 -56045 -25586
7728 -25586 -25018 -15693 -12000 -29034 -20202 -17112 -7385 -17415 -58734 -74313 -66839 -44288 -39042 -46694
7714 -46694 -7347 11594 9675 -5456 -22461 -31965 -40747 -30250 -18999 -41967 -55775 -28879
7702 -28879 -19019 -28203 -43807 -40640 -33283 -32633 -9365 15288 2717 -4352 10989 -10300 -54671
7689 -54671 -70137 -46320 -65880 -91988 -66766 -64294 -64655 -53461 -62580 -48602 -58472 -58574 -39090
7676 -39090 -4913 -29694 -21310 -10052 -18264 -19106 2255 11896 36307 6537 -34971 -49285 -64862
7663 -64862 -64136 -52244 -32177 4798 34027 14073 7297 17712 13486 13189 8628 23339 38831
7650 38831 28424 17624 349 -25724 -23052 -7028 -11226 -42320 -46238 -62292 -48525 -6690
7638 -6690 1070 -22507 -41979 -35618 -3404 -36624 -39232 -40577 -38883 -23267 -39778 -57209 -38418
7625 -38418 -33398 -26177 -25241 -21750 -18611 -6361 -12357 -2686 4039 -2432 -23469 -27831 -24177 1805
7611 1805 21025 28624 13821 23524 28647 5000 -1561 -17372 -19658 -13150 -19776 -26122 -47325 -16177
7597 -16177 -10957 -29463 -41668 -46891 -33369 -9416 -2199 -2013 43212 55523 63622 11694 -12691
7584 -12691 2781 15976 -16886 -44640 -37208 -44142 -44735 -30510 -37072 -36028 -23231 -26338 -25440 -39547
7570 -39547 366 18909 5018 1187 -2717 -27123 -46089 -31904 -9938 -55242 -73707 -54473
7558 -54473 -49292 -51793 -40864 -22952 2441 28042 14105 5526 -1935 -14767 -12236 -18579 -37718
7545 -37718 -54573 -81918 -92599 -51895 -7859 -15279 -46105 -36962 -18252 -18061 -35013 -46050 -10693
7532 -10693 19563 15956 -14200 -21044 -22825 -18236 -33299 -4479 18243 4730 460 2979 13422
7519 13422 -4326 -24236 -14998 -2815 -12720 -14657 -24754 -29011 -39078 -17764 -20275 9621 1181
7506 1181 13822 5412 -44113 -43084 -17187 -20329 -55733 -67291 -23594 -12888 3186 -8142 -6079
7493 -6079 17567 14001 13054 7598 14582 21129 19416 -209 -9460 -16488 -40957 -40903 -16648 -2971
7479 -2971 219 -7857 6505 10032 -3058 -12555 -21427 -39426 -45494 -28697 -9694 11692 -9410
7466 -9410 -58474 -61962 -22599 -22029 -31785 -20589 -23717 -29780 -24304 -4263 11354 15438 1431 -24115
7452 -24115 -54714 -25132 3030 24605 17838 -14596 -20520 -17240 -42690 -34672 -20252 -51000 -50554
7439 -50554 -30053 -10407 1221 151 2232 26498 2311 -26783 -45108 -41768 -26539 -35633 -36050
7426 -36050 -20033 -27174 -45201 -66075 -39655 -14780 3568 6789 19916 7267 -8671 -52997
7414 -52997 -62021 -69269 -58390 -52578 -31652 7712 32678 23234 28250 12821 -19411 -39591 -26080
7401 -26080 -6779 -17065 -60776 -60166 -36658 -23501 9388 11484 15939 58474 66049 38980 40410
7388 40410 51787 35813 7668 -12337 -24856 -25096 -36247 -5876 -6334 -3369 -8555 -52395 -80483
7375 -80483 -57214 -44919 -32589 -25440 -40364 -29884 -47249 -41786 -8893 -36621 -76887 -79702
7363 -79702 -71476 -36810 -25580 -13032 -21651 -35454 -35782 -15299 24825 58569 73934 49453 33564
7350 33564 13380 1426 12721 45852 50463 24167 -3750 -21339 -59026 -86496 -86817 -75723
7338 -75723 -40762 -18721 -34324 -32330 -13407 7913 22444 9484 2607 -44527 -52098 -56521 -60939
7325 -60939 -45184 17371 42291 31803 15141 -14290 -23411 -24942 -37127 -22363 -13308 -15953 -26918
7312 -26918 -37069 -16779 7841 13292 -13518 -34647 -33526 -36465 -54541 -52696 -35420 -34219 -38116
7299 -38116 -40960 -20527 7827 9399 16956 18806 4249 -15676 -25504 -12128 5308 -4303 -11448
7286 -11448 -5579 2945 6291 7984 -8046 -16813 1042 -9404 -8627 -9800 -4141 -29874 -17629 7304
7272 7304 2434 -7067 5601 -10811 -21565 -36590 -26065 5475 57181 68464 50187 23641
7260 23641 -13611 -23769 -25029 -20175 -30671 -30716 -49987 -22133 -5723 7933 23068 -860 -28403
7247 -28403 -42745 -42561 -24341 -19507 -40800 -46224 -52250 -24488 -22676 -20221 -18600 -39989 -55067
7234 -55067 -42726 -16704 -13388 -24048 -45906 -48523 -13998 -5989 -2999 1297 -4751 -7269 -17881
7221 -17881 -36345 -34291 -45399 -70896 -75440 -56127 -42454 -31529 -27846 -30909 -41614 -62770 -59982
7208 -59982 -99367 -96626 -53561 -35444 -18644 3679 15087 -6320 -22396 1388 31329 36206
7196 36206 18172 -21854 -20955 -16277 -22204 -14299 5686 -2352 -21820 -21364 -29546 -23893 -18106 -25056
7182 -25056 -23094 -13637 7864 30133 10615 -5449 -17019 -9133 -26835 -35932 -31232 -44348 -36964
7169 -36964 -24925 3955 6973 5516 -1264 -1099 14158 17219 12593 -7830 -26743 -41043 -40617 -27570
7155 -27570 -28881 -5368 -11338 -24908 -20613 -6889 -8522 -27796 -45526 -39725 -17607 -20713 -7121
7142 -7121 -10650 -30946 -43139 -26050 -272 4655 -12518 4811 2953 -3945 -9795 -11005 -19831
7129 -19831 -5307 7886 2760 -21356 -36541 -38473 -38939 -46512 -61271 -57115 -9190 41848 55623
7116 55623 33593 43593 38603 19587 -7718 -49430 -40108 -25370 -33336 -48865 -34882 -42442 -56014
7103 -56014 -48108 -14287 8426 29099 17178 19014 13834 -21424 -39209 -47473 -17669 62 -20937
7090 -20937 -18350 -18019 -22023 -16113 -15430 -45426 -55020 -43886 -28428 -10524 -7155 -2996 -10513 -9606
7076 -9606 -29826 -21986 -8993 -12450 -33556 -56820 -58072 -33258 -24867 -16535 -8188 -30894 -34474
7063 -34474 -19665 6608 13778 -873 -4550 35922 43347 9103 10654 26704 28853 482 -14684
7050 -14684 4793 22930 16668 21911 -12622 -28903 -44942 -69298 -73145 -49735 -29348 -60229
7038 -60229 -76986 -53065 -59176 -52709 -42808 -48440 -24856 -10155 -30046 -41765 -56761 -77807 -71281
7025 -71281 -28169 11095 23591 7067 -1061 -2774 -3441 -1628 -9221 -20149 3832 15058 388
7012 388 -24141 -27998 -16743 -11415 -38545 -24291 2780 3526 -9553 -11624 -21961 -39110 -28124
6999 -28124 -11810 -12798 -12664 -16456 -1757 17391 12323 -25914 -43691 -38719 -51113 -36569 -22209
6986 -22209 -25333 -39208 -9524 -17269 10294 14234 5371 -4725 -13482 30707 46179 35207 40693
6973 40693 7473 -9399 7796 12079 667 -11037 -31979 -19068 40000 48925 29838 30835 51935
6960 51935 41215 29438 5944 -23866 -12154 15371 10354 -2995 6543 -12376 -4611 -5246 3831
6947 3831 24017 24526 -2025 -2552 -10555 -11915 -13635 -6741 -8524 -5223 2273 -17448 -34445 -43427
6933 -43427 -59338 -42052 -26563 -8038 -2229 -18455 -6920 -11463 20324 3362 -20017 -12674
6921 -12674 -35218 -58852 -40883 -7316 10572 21080 -9535 -21069 -14499 -22737 -47638 -30870
6909 -30870 14070 12652 -7070 -29683 -44511 -48273 -39956 -24584 -14116 -41138 -53726 -62236 -59728
6896 -59728 -53657 -50245 -21578 -13807 -17816 -28348 -12660 -939 7117 6945 5274 -7883 -39302
6883 -39302 -50571 -53639 -65372 -40870 -26322 -27994 -25138 -22297 -19558 -14051 -4262 9551 -16294
6870 -16294 -34337 -23933 -11082 13714 30939 45427 37998 34366 30019 15834 22109 13039 -16533
6857 -16533 -19336 -19290 6861 21460 -14888 -41522 -27431 -4319 17491 4533 17018 17182 -16576
6844 -16576 -4114 20888 10052 7817 7781 13673 -8374 -5777 26205 45626 17448 -3596 7570
6831 7570 -7190 -16353 -17409 -20452 1375 -11037 -20238 -9490 -9592 6314 -3746 -15045 -25747
6818 -25747 -18275 -21524 -37164 -45752 -31808 -34733 -1137 -24745 -11125 10158 9600 21100 14167
6805 14167 15372 33624 29411 22806 13528 14442 -7473 -20900 -30301 -33225 -2391 -1378 21353 44815
6791 44815 10663 -19175 -3788 -9093 -13219 -19241 -25253 -33003 -45205 -51857 -42395 -38457 -33176 -20352
6777 -20352 -5906 32294 22311 -4799 14683 -277 -15573 -22377 7676 31020 2325 -29302
6765 -29302 -43190 -37469 -10128 4681 -16773 7286 26946 28773 -14262 -53737 -64336 -43977
6753 -43977 -19698 -16532 -51750 -58998 -35131 -33762 1565 3338 -14874 -18145 -26032 -30709 -23636
6740 -23636 6440 3787 -17111 -6910 12678 2150 9316 42869 28615 13075 9804 28305
6728 28305 31817 33949 10787 34176 66386 86677 122639 176182 265433 334426 393311 375019
6716 375019 275124 197002 140711 97415 62671 61369 55647 42425 40608 10727 3177 15673
6704 15673 38328 15372 -7926 -15335 -35214 -30476 -50749 -87101 -66307 -56393 -34795 -15717
6692 -15717 -26375 -48433 -63711 -46395 -35119 -35943 -39709 -53990 -59100 -25725 11052 -5974 -17190
6679 -17190 -13884 -7360 -23991 -35231 -60143 -72969 -77064 -57187 -33539 -30918 -3875 -14949 -22735
6666 -22735 -13236 6570 -13855 -24379 -17069 6988 11123 34346 56332 45003 24655 6558
6654 6558 -662 3462 -17107 -48555 -49692 -36266 1209 -3656 -19772 -10899 -6535 -8272 -13231 -22589
6640 -22589 -19143 -14014 -20755 -45551 -33074 -4738 1994 -16826 -11150 -4394 -16147 -5812 -4243
6627 -4243 -22353 -31713 -61352 -64658 -44432 -30554 -23625 -30804 -33280 -35571 -37099 -15975 -6855 -11284
6613 -11284 -19039 -12210 -7308 2464 22426 9196 -10636 -15958 -4333 11187 -16375 -47984 -56879
6600 -56879 -36948 -31002 -20733 -2195 18894 24810 19678 33644 7241 -26685 -16730 -5175 -5403
6587 -5403 -2516 16615 15403 -4361 -5898 259 -8655 -11136 6253 -4488 2885 50211 30613
6574 30613 -30015 -67924 -68663 -47845 -16794 -1273 -5128 -23879 -49190 -51993 -33765 -35842 -37120
6561 -37120 -13645 -10294 -24555 -15895 -14712 -20020 -17409 -20214 -24622 -18383 -12811 -3790 13232 13917
6547 13917 8689 1015 -21747 200 19438 -20502 -47656 -40589 -39471 -4962 14193 18648 14421
6534 14421 5204 11016 580 3857 19161 1738 -3384 10025 17620 27228 11442 1957 -1141
6521 -1141 -12382 -32170 -55119 -76070 -69647 -52312 -40270 -39488 -25122 -11182 -24344 -52450 -48842
6508 -48842 -44067 -42013 -47324 -20441 31077 34390 10932 -1963 -42456 -71009 -38663 -23797 -32427
6495 -32427 -5826 21436 19055 14589 24611 10252 2097 -954 4296 -8357 -35851 -55419 -44153
6482 -44153 -32248 -12993 -38401 -52257 -9097 -5222 -44521 -28820 -3590 -7954 -16198 -10855 -14740
6469 -14740 -43210 -55364 -49190 -41326 -33127 -48625 -48820 -41909 -34699 -18119 -22406 -34248 -8700
6456 -8700 -4912 -9762 -4481 730 3104 11105 21789 21595 -4080 -29152 -75645 -79122 -76911 -69198
6442 -69198 -74396 -80743 -57849 -44537 -24567 -843 3438 10921 8949 23265 14351 -21663 -12463
6429 -12463 13196 9671 17835 19651 30163 37665 43502 33648 -7099 -36338 -25161 -3168 5135
6416 5135 1883 -6322 -11043 26316 14885 -24206 -19366 -7102 -4778 -13953 -20902 -4604 -8129 5674
6402 5674 7513 -3269 -1295 12562 11584 -15213 -20361 -11193 2345 20307 37457 27048 13919
6389 13919 -10277 -2662 -7572 -25036 -18699 -12941 -48274 -77100 -52506 -11209 1864 -7257 9396
6376 9396 22485 24008 11618 -25138 -28724 -12731 -10276 -11562 1573 7579 13265 14911 2076
6363 2076 -14640 -23113 9366 19478 -11745 -7959 10065 -4778 -10748 -9790 6636 -2016 -921
6350 -921 24293 27648 8906 7410 -16035 -10696 6260 16834 20441 42092 49458 54863 32376
6337 32376 6033 -23408 -24151 -29833 -56178 -48196 -32956 -28328 -9169 5030 -10934 -26627 -20217
6324 -20217 -18236 1635 6362 -22923 -19747 14948 28647 -399 2550 -15596 -19015 -6362 4981
6311 4981 -3358 -1277 22138 46404 39798 18359 26507 43148 27782 14586 2719 17561 6495
6298 6495 3001 27049 20092 -30739 -53065 -53973 -45438 -41020 -9011 3187 1388 -13505 -30500
6285 -30500 -37262 -28896 -35980 -10507 -13617 -25186 -20729 -15459 -3699 -17644 -16720 2079 -4037 13
6271 13 8459 -8252 -34915 -64194 -20427 2170 -2896 -11658 -3949 -5606 -7826 -10437 -5556 -9073
6257 -9073 -10610 -10605 3404 -7789 -23000 -30193 -46861 -34718 -22905 -17617 -16984 -14980 -4826 11185
6243 11185 -3282 -10156 -1339 -10640 -27831 29355 58847 49057 18076 5811 -26606 -24210 -17165
6230 -17165 -24491 -34252 -40042 -27132 -20109 -24778 -27512 14986 35595 5649 -4264 -21562 -40594
6217 -40594 -36779 -31200 -2346 -2830 -7484 5117 23951 13251 3305 471 10153 13426 -18731 -34002
6203 -34002 -12284 -23688 -39040 -22471 4128 -27414 -30112 -1150 23575 -9209 -35026 -29944
6191 -29944 -29981 -14867 -24987 -17736 -7856 -6249 7083 -2796 3979 -2764 -25138 -22769 -9086 4975
6177 4975 -11837 -58151 -42293 -37859 -34508 3417 24278 21679 -7407 -27162 -20113 14401 17814
6164 17814 18118 4038 -25189 -28812 -3266 -16583 5026 24297 23925 25251 41484 15944 -15004
6151 -15004 -35093 -22783 -11815 -33031 -42219 -39054 -40808 -32989 -10671 10479 -6961 -3259 -4042
6138 -4042 -10606 -9055 11940 834 -31909 -33180 -23795 -4335 13773 7620 5294 12019 -3330
6125 -3330 -14294 -7704 -14594 1647 -23853 -21398 -2502 5287 38139 27150 21004 35100 15515
6112 15515 -3338 23597 30802 18343 7979 -25655 -48900 -59177 -74734 -58385 -30479 -21785
6100 -21785 -14596 -35499 -50225 -21608 -26147 -37644 -31833 -16810 2483 7897 -43049 -79777 -41393
6087 -41393 628 872 -5697 -20877 -55425 -36953 -4718 5314 799 23055 32221 43316 35203
6074 35203 24249 16564 26383 48669 60766 59963 51284 36688 -8040 -74520 -66392 -39253 -18620
6061 -18620 881 -2139 14419 16595 9504 25017 27724 7713 -7387 -18902 -17338 -24270 -44409
6048 -44409 -46482 -32517 -28974 -31921 -34747 -25417 -17843 -22822 -28192 -7515 -8763 -15567 -6365 -5883
6034 -5883 -16554 -14719 -4584 -1749 -23351 -44197 -35226 -21116 -16317 -10738 2611 10134 20145
6021 20145 4454 8568 -11763 -13616 13655 17413 -12164 -24630 -26263 -44723 -42119 -29090 -6775
6008 -6775 15858 3597 -1733 14226 13560 -16993 -33644 -35395 -55002 -64958 -54224 -26037 -1023
5995 -1023 -21999 -29455 -38280 -54078 -47081 -35467 -30360 22769 39933 45076 47665 56279 43082
5982 43082 13073 -722 -16633 -16178 -12292 -35096 -29642 -20799 -32652 -39393 -12649 5134 -2083
5969 -2083 -9567 7370 6627 98 5970 4157 734 3847 11995 -19212 -31897 -29994 -25838 -28575
5955 -28575 -48895 -44869 -56265 -49684 -18318 4559 -2378 -21876 -19163 -4598 -7502 -24125 -51370
5942 -51370 -56683 -29633 6585 29763 32346 8769 -2804 9193 11871 686 26433 29217 -8135
5929 -8135 -20606 -33751 -5782 -161 8582 9532 14721 8037 23420 47248 43204 35466 32894 8430
5915 8430 10010 40353 29192 -9368 -65624 -83834 -83519 -55282 -21896 -23141 -120 23477 13883
5902 13883 15762 4168 14392 -3770 148 -22152 -20690 -26227 -22173 4185 22669 -9963 -43905
5889 -43905 -52597 -35391 -34090 -19672 -12221 -5944 -10027 -21634 -39356 -5283 24519 8966 -35888
5876 -35888 -41756 -7628 -13439 -16160 -34032 -65127 -37594 -16517 -26799 -38510 -27321 -8918
5864 -8918 -22514 -27133 -15129 -12371 -10557 -6949 -6957 5541 -848 -25252 12178 42737 8112 -14613
5850 -14613 -15847 -524 -17187 -26774 -41833 -36894 -46056 -45614 -22002 14984 2648 2386 8731 5448
5836 5448 13361 15105 8031 2261 10852 8341 -6208 -24428 -11142 5174 -34253 -45685 -45351 -52105
5822 -52105 -25257 5599 18485 -12309 -15831 3871 26729 14532 -6680 -926 12466 7551
5810 7551 3771 5163 12907 20807 9753 -9243 -24126 -30258 13411 -6604 -41319 -53428 -35629
5797 -35629 -30210 -18063 -30916 -5632 25161 44149 63098 48930 28792 21343 24351 51601
5785 51601 39978 22143 29342 48713 26921 14826 9952 22371 30643 29024 21163 20524 18538
5772 18538 11789 -2527 -16095 -4660 10579 6776 13828 4607 -576 24254 32740 39998 17378
5759 17378 -32362 -42570 -21338 -7191 -30881 -15635 96 14384 46240 43906 23765 -7705
5747 -7705 -23156 -20516 7852 -307 852 -27581 -41759 -58826 -42595 -38339 -28338 114 12646
5734 12646 12683 -2885 -19707 -45856 -55896 -71119 -36261 -26017 -36128 -12549 -2122 -1724 -16239
5721 -16239 -22589 -20366 -35512 -47552 -41400 -13016 3318 7339 18 14026 -28377 -22976 2001
5708 2001 -24545 -38613 -20688 -15866 14077 30078 29635 10741 24894 25627 33568 58265 46471
5695 46471 35983 40776 37856 5880 2150 19860 8525 7134 11119 -9531 -5825 15458 21430
5682 21430 4192 9431 -13578 -13360 11385 -368 -25177 -30071 -35443 -9020 5091 12799 -171
5669 -171 -957 20844 -4641 6589 19032 29363 18140 25433 -5666 -33151 -27181 -36774 -25462
5656 -25462 3388 34016 26215 24703 41757 11718 12452 7429 -415 9306 -417 6611 -2631 -10435
5642 -10435 -1199 2884 2349 -13938 -5179 12123 31572 19385 27221 29787 1540 6884 23544
5629 23544 27962 9852 19858 19669 1467 138 19571 44033 31032 18814 33179 18039 -1671
5616 -1671 -2777 -4851 -23538 -69049 -89966 -80162 -53081 -34053 -18591 -42851 -45300 -32312 -32479
5603 -32479 -49301 -35610 -9782 24781 10036 -15871 -33737 -46667 -31150 -5233 12569 39765
5591 39765 32075 13444 1278 4124 -4675 -12693 -15672 -9498 18335 28221 14181 -14521 -18811
5578 -18811 -9039 -1970 746 -2164 1432 11005 19676 11979 -15421 -23916 -7548 4257 -20447 -10055
5564 -10055 5977 -3905 -29572 -52114 -33185 -501 -8361 -13282 -9272 -10574 -23145 -44318 -75147
5551 -75147 -96420 -98823 -85412 -76581 -45579 -48261 -51158 -31537 -26200 -36354 -51341 -59141 -51005
5538 -51005 -51344 -42690 -28164 -19353 2531 1443 -21183 -35922 -49524 -49639 -38804 -41246 -34741 -31111
5524 -31111 -25057 -2916 9786 34302 14807 13994 20378 26057 -10856 -11148 5372 -6800 -17015
5511 -17015 17200 21179 -6655 -30873 -24289 -29764 -57053 -34359 215 10994 7835 -13684 -29350
5498 -29350 -41930 -48839 -19135 1080 10637 13510 12625 26499 24877 4473 8307 673 13324
5485 13324 19492 39148 59241 54876 31794 26763 19128 20636 25186 26144 3494 -7385 358 27070
5471 27070 47548 39551 12569 3960 2081 15364 -2197 -9157 -83 251 -8709 -16267 -20539 -34689
5457 -34689 -39190 -28230 -27520 -12514 7019 29962 58787 70420 51760 14733 14291 27185 12357
5444 12357 -11497 -18256 3409 16789 20950 6431 40883 43807 23395 -9396 -14946 -28436 -12103
5431 -12103 22596 33044 21118 36943 27646 -180 -20254 -28949 -30968 -30060 -41260 -41995 -39310
5418 -39310 -24050 2805 21662 34202 34015 38399 -2459 -23289 -10183 16909 33554 33144 17636
5405 17636 6745 10341 1583 -11992 -19904 -40230 -7237 13543 16049 7234 -2888 9512 16510
5392 16510 26166 14343 5652 -4963 -5803 282 11484 1016 -521 20383 19973 9420 22710
5379 22710 2149 994 5937 -38391 -37063 -18833 -4117 -10994 3850 10771 26041 25232 9590
5366 9590 25105 12923 2074 -8342 -7211 -6531 -7992 -6794 -2295 2622 -14961 -2692 51 2684
5352 2684 4722 12014 9940 -4470 -18047 -16394 -17426 -31896 -46885 -56630 -36829 -2362 12212
5339 12212 -7660 -1238 7478 7381 5852 4891 -7505 -16220 -10061 -4530 -14486 -21808 -4505 -8746 714
5324 714 872 16397 -9334 -5118 27353 15403 -5745 -9276 -27876 -39933 -38173 -18648 -39341
5311 -39341 -40175 -24975 -42997 -49028 -33893 -21929 16420 18824 -4956 13999 18926 -5400 -35151
5298 -35151 -33082 -54523 -32934 -31345 -27985 258 1965 -7415 -16492 -26521 -20983 -10505 -9081
5285 -9081 -8843 -828 37003 47555 13784 10053 6368 51243 57073 34136 8805 6917 22465
5272 22465 28054 -1634 1406 13599 41955 33019 -16510 -35713 -32258 -10109 13672 10922 6980
5259 6980 17908 4063 -17472 -21366 -25294 2182 22234 33291 31279 20933 1012 -24516 -23020
5246 -23020 -460 21785 9006 -2235 -1196 33507 44442 49992 32164 10202 -956 -29031
5234 -29031 -20147 803 9621 -3086 3902 6225 38581 42558 34277 -11595 -38759 -43100 -28534
5221 -28534 -3933 4869 -6272 -28078 -30625 -14121 10044 -8463 -28512 -26898 -45116 -6683
5209 -6683 15350 -5449 -28000 -38623 -21106 -15944 -15311 -16916 -18938 -9122 -10006 -4360 12272 -9514
5195 -9514 -25421 -18254 -12081 -25123 -20288 -32610 -36270 -38984 -37970 -7951 7426 11511 -2790
5182 -2790 -10634 11392 11895 -24715 -14517 14260 13111 9491 20513 37001 20062 -2167 -27314
5169 -27314 -36739 -38986 -37254 -12552 3457 -15255 -31307 -21056 -9214 -24699 -58251 -45132
5157 -45132 -26723 5873 9414 -342 12796 18615 25672 -12213 -9000 14928 6759 9362 29231
5144 29231 31083 19051 -2348 4157 -614 1140 26620 24402 -3555 -6858 21924 60239 58337
5131 58337 65566 78352 88002 53567 49651 32569 -1509 7248 -25127 487 14304 3082 -30662
5118 -30662 -34318 -13682 15086 24655 15961 -23016 -33035 -24686 -16737 -17885 -27247 -38058 -39644
5105 -39644 -43735 -19626 -6886 -151 17292 -6474 -12442 -25224 -35059 -16058 -43617 -64913 -78255
5092 -78255 -79977 -48624 338 24754 5545 -18329 -25759 -24866 -47551 -53969 -35463 -16756 4210
5079 4210 16656 32900 44568 39104 37367 13938 5868 4915 7282 -16568 -10886 4192 -2177 13616
5065 13616 8970 24077 42881 52294 55031 39128 30554 21800 19170 25631 35670 16773 32409
5052 32409 29864 26215 21604 -349 -19593 -2509 16775 12373 -1600 -6980 -38140 -27828 -5165
5039 -5165 1758 228 -18021 -29347 -15007 10327 3761 -17631 -17468 -35173 -42243 -41111 -44635 -41188
5025 -41188 -43187 -62060 -65217 -74896 -87776 -70737 -50448 -45582 -54301 -53112 -8456 -7530 -27797
5012 -27797 -32125 -30030 -19726 4434 19775 33882 19542 33451 17239 10157 24653 40911
5000 40911 39314 29433 34461 769 -2790 -24553 -21103 11615 35707 6894 -11505 -11637 4854
4987 4854 20237 11387 15988 31258 44036 61514 89901 67964 36524 5365 -12736 -38585
4975 -38585 -36211 -235 31210 34966 18421 20811 29457 -15142 -33844 -42793 -37635 -11676 -7414
4962 -7414 -15939 -34267 -27618 -19032 -55630 -66441 -30669 12436 1774 -25536 -42646 -18936 -9374
4949 -9374 5321 18941 20252 35614 28505 49497 39942 42677 1395 9664 27981 35373 24159
4936 24159 13760 26194 20834 773 -4768 -1876 -7319 -143 -17567 -36829 -33212 -13320 -607
4923 -607 -29977 -35779 -10959 4660 66 -5621 -8354 -20574 -54522 -40569 -24662 -14585 -29717
4910 -29717 -18958 -8661 -27165 -37158 -11092 -45964 -31487 6883 3214 -8336 -34186 -35912
4898 -35912 -17889 -38627 -55295 -43873 -22419 -462 16904 19153 7203 -14287 -16102 -28841
4886 -28841 -24447 -16743 -32281 -21269 -15700 -15981 4772 5066 -14005 -18588 8271 -963 -1228 24417
4872 24417 7641 -8147 -9267 2254 19505 36441 22962 13788 5154 52549 74428 79806 57233
4859 57233 24712 7734 -8437 5292 17166 13376 -7710 -17606 -18469 -7822 -3135 668 5402
4846 5402 22761 31956 1823 -27689 -45883 -28320 -8456 1333 5470 19926 16725 5212 -36568
4833 -36568 -51462 -39494 -41608 -52836 -43914 -22356 -495 -11824 -4651 8580 14777 38957 61054
4820 61054 43108 25618 13606 37250 40827 17146 -17457 -19313 -2183 30078 41757 30652
4808 30652 32269 16338 -28370 -25396 -21101 -3894 31655 39165 10485 -28515 -22594 -20812 -3165
4795 -3165 -6867 -8316 -8844 -34829 -43035 -40246 -43664 -8149 16959 9977 -4455 -31007 -37407 -51319
4781 -51319 -50340 -40166 -28478 -37874 -29270 -18033 -19310 -35006 -52756 -17614 7234 -24572 -47819
4768 -47819 -18312 -2391 8795 21538 4621 11640 -11800 -20020 -19309 -40077 -35329 -33344 -14880
4755 -14880 -14390 -17737 -25523 -12699 -14565 -30155 -21299 288 1276 6754 14143 12101 6474 16048
4741 16048 -3348 -18548 -12650 -22030 -9938 -14200 -21892 -22556 -4565 -11646 -29104 -12931 -23940
4728 -23940 -28003 -29691 -27418 -19911 -2666 29792 10297 4578 28198 14266 -7250 1767 1437
4715 1437 23100 39324 20326 6633 14534 3234 8921 6987 -31943 -23096 -3369 -19800 -19687
4702 -19687 -5220 12723 12499 -8836 -23081 -17537 8400 35291 33693 15697 39092 52292 8441
4689 8441 -32232 -38963 -50625 -60894 -37203 17471 24226 8434 12763 17637 11705 29569 18465
4676 18465 -25574 -21060 -9674 -14946 -13698 652 -9257 -9129 -7506 -30225 -26274 1492 7796 -12987
4662 -12987 14038 30489 28810 36973 41061 5358 2748 29352 33109 16460 5235 16965 31874
4649 31874 35850 15185 -4499 -24112 -28956 -4285 9927 2829 9303 9075 9363 -1082 4945 -834
4635 -834 -15085 -32807 -48695 -40089 -28546 -16146 -3655 8864 3708 -19011 -12620 9804 -4654
4622 -4654 -25443 -35840 -24269 701 -15664 -27284 -23418 -19878 -26243 -13763 4723 4527 26845
4609 26845 48486 27747 -13686 -27373 -38234 -17173 -20439 -2426 33288 3677 -7885 -8212
4597 -8212 -12927 6048 10774 5206 -5246 -22102 -49286 -68230 -34780 -732 35384 27506 21008
4584 21008 -17086 -32671 -42818 -27341 -22656 -25566 -21659 -6650 -5020 -11089 5123 24836 40873
4571 40873 22538 -6077 1151 -2638 -37196 -47928 -4615 15795 -3094 -15426 -4625 -10026
4559 -10026 -12842 6099 24148 11414 73 2024 5421 -844 16662 30998 27315 21018 -17181
4546 -17181 -34202 -28836 -914 4715 -12583 -19878 -20106 -35257 -36128 -38697 -32792 -23739 7982 45258
4532 45258 34731 5269 -5829 -2602 31238 14540 -4175 9344 22029 1673 -5307 -10646
4520 -10646 1223 -7175 1089 -3419 12888 7738 13988 -1687 -26036 -32358 -24417 -35206 -42435
4507 -42435 -52119 -75205 -64474 -12536 -14368 -19279 -20300 -5779 -9224 816 11894 27641 16274
4494 16274 -30673 -27059 -8950 -46739 -57177 -57583 -67854 -33725 714 9319 3105 -11087 -16861
4481 -16861 3722 9590 -21081 -12873 -3730 -19133 -18512 -22280 -23907 -24214 -13506 -5282 20729 28177
4467 28177 18892 35600 28333 20639 5612 1274 -8511 -6633 -691 -21468 -1312 -7154 16338
4454 16338 52238 34988 2866 -4684 -7013 -11502 2000 21776 32278 -20501 -46424 -33974
4442 -33974 -12607 -16395 -7531 1431 -15742 -25152 3347 11059 -13020 -20011 -10362 7718 6750 33286
4428 33286 43867 46510 39004 10250 -7182 -11506 -11785 -7277 -7573 -9818 -9658 -19632 24163 27525
4414 27525 902 -19687 -298 1745 18895 26334 21404 20695 27514 46838 30906 24115 26277
4401 26277 26195 26370 -10100 -18856 5175 10741 10601 -1951 -9303 -17443 -50565 -38085 -26931 -17935
4387 -17935 -10114 -22061 -4633 9558 11916 3176 3283 3547 23934 33584 18788 4279 -2468 -8772
4373 -8772 -134 -31881 -27349 -5976 -10562 -18557 4155 44204 63534 54778 54347 20441 -16397
4360 -16397 -6991 3013 2363 -27488 -48563 -66455 -57620 -58635 -40799 -15572 -20777 -1774 19332
4347 19332 -5368 -13304 -30630 -49504 -44700 -46690 -33564 -10364 -1292 -14099 -23743 6589 13430
4334 13430 10303 30738 49458 27305 23339 34450 37039 38379 39143 34519 -14195 -26355 -10224
4321 -10224 12464 19611 31063 -6443 -22715 -24314 -24598 -34527 -31003 -38296 -15648 -14771 -38947 -43348
4307 -43348 -19576 -1035 5837 35344 49714 27347 10519 20416 35259 51453 50505 45900 42420
4294 42420 29190 13588 16060 35277 28805 -1642 -4578 5510 1276 -16603 -22619 -28025 -33673
4281 -33673 -41432 -27445 -5651 -13068 -11026 -17088 6428 3392 -20025 -40091 -23114 -5242 -21447
4268 -21447 -12496 -5227 9 -7132 5779 27320 11793 -10766 -14979 -14797 9419 17680 38739
4255 38739 50926 39943 32123 19982 22702 13683 1346 15063 23180 11657 -2160 -14798 -11826
4242 -11826 -3236 -11287 -32224 -24102 5006 3144 7830 1103 -4628 5059 7589 9580 17691 19583
4228 19583 21094 -5884 14610 31428 25278 35803 24060 51252 74692 46498 24272 18682
4216 18682 16887 6182 4330 -22621 -24524 -16690 -6828 23021 32256 19947 12119 -4383 861
4203 861 4964 26664 29592 28220 34650 32996 21475 6350 -4230 -15018 -21133 -20855 -17337 -11023
4189 -11023 -12802 -22051 -1637 -14005 -1722 16315 10636 12239 28557 -8486 12476 35822 43943
4176 43943 28278 1903 -10948 11961 20429 27301 9068 -3947 19835 36788 36691 40583 33533
4163 33533 35537 50062 22569 588 -6704 -17202 -8228 -1624 -27805 -22314 5084 7663 2761
4150 2761 24925 23332 8909 -8064 -4984 -6143 -4608 3781 -3748 -14160 -11107 -7774 -6299 -20517
4136 -20517 -7923 -481 4889 27865 30206 28553 16323 -5093 12744 42356 33230 35038 62227
4123 62227 81621 63017 44265 39171 31360 23919 -654 2368 24032 37075 27575 17365 26597
4110 26597 -9682 -18115 -21450 -8302 8297 7254 1895 -680 -14853 531 28715 27567 36582
4097 36582 14823 30993 66721 46370 38359 54326 23375 -11837 -15105 4296 5234 -9353 -15697
4084 -15697 -4537 7643 4678 -8159 -2812 -1558 1660 19826 30925 61667 33527 2583 7250
4071 7250 24987 31287 14267 5523 -17189 -36473 -41746 -44089 -44810 -27612 -13052 -3855 14050
4058 14050 15073 13033 26680 27207 32735 33311 27962 24558 21710 17312 -23949 -48372 -37195 -55053
4044 -55053 -43467 -43089 -56087 -14759 -13539 -45555 -44176 -13469 24481 25991 10795 7603 -10746
4031 -10746 -22868 -25675 2903 21731 33073 44633 22937 15700 28594 21823 30116 7282 5689
4018 5689 -17432 -32449 -43034 -27631 -27347 -18564 -8485 4681 5096 -21755 -29005 -26007 -5959
4005 -5959 -25606 -45137 -25171 -10717 -9174 -1330 13890 -5250 -3047 -3542 -15845 -17093 -24915
3992 -24915 -21242 -15505 -35585 -34269 -31624 -25624 -15287 -10297 16213 57929 33446 -6621 -9338
3979 -9338 7087 -2144 -2969 8032 2630 -8202 8334 768 746 -6446 -5093 -21495 15688 26877
3965 26877 -1118 -20185 10450 44228 32171 1105 -25890 -48348 -52071 -9534 23515 13793
3953 13793 -26160 -9253 18914 34226 26677 34126 52437 43538 -2080 -17305 -33807 -36812 3331
3940 3331 8554 3966 9888 20042 42773 47519 35882 20947 -799 -16673 -42421 -49191 -24062
3927 -24062 -27244 -13208 2954 -12523 -17948 -14596 -4444 -11456 -11435 -11550 -33002 -34463 12147 12155 -6622
3912 -6622 5839 45151 45554 42666 39961 24319 18415 7363 20649 20929 14473 3874 6845 620
3898 620 -6175 10450 2608 -8457 -544 -4128 4540 8618 -16976 -8190 20485 26244 38592 39798
3884 39798 36722 22481 496 -13539 -23515 7994 16711 -1715 -29610 -49317 -33944 -23497
3872 -23497 618 33465 56650 63376 46063 1812 12554 33805 32 -21877 -5346 2102
3860 2102 13000 9644 14157 36512 47822 43462 63881 66976 57809 42237 14097 -6780 -8021
3847 -8021 15988 23744 -14607 4018 24607 5086 14624 23743 17110 4883 -12416 -1596 -6557
3834 -6557 -15370 -16196 -27827 -22733 -17784 -13398 29631 26581 6232 -16171 61 8855 3354 12508
3820 12508 7473 17026 649 -14251 -12812 -152 38923 79064 76121 74600 69333 46210 -1859
3807 -1859 -10511 5196 9850 32367 48739 36867 11083 6282 -5862 -29840 -28853 -32062 -38179
3794 -38179 -43673 -21892 1412 -14052 -13715 773 23749 43942 21217 -17374 -20478 -8102 -14922
3781 -14922 -4301 -22971 -31676 -5490 4100 -13736 -34241 -747 26550 23372 19561 46389 23093
3768 23093 18977 40676 17957 5372 21430 16842 6170 -4165 -7807 24075 37249 45107 44543
3755 44543 29446 49133 59131 55710 28514 17501 24464 23911 29621 19126 -9037 -16970 -28186
3742 -28186 -17810 -1399 -18302 -45489 -64277 -39540 -26766 -53694 -53520 -34296 -35603 -40901 -48595
3729 -48595 -55556 -58165 -61997 -43387 -12151 12408 31960 19819 -2513 9204 17729 4287 13692
3716 13692 16980 8777 -4016 13479 11430 12553 16064 -215 18487 20421 30798 19153 -6676
3703 -6676 -39138 -47175 -30535 -24877 -13856 14060 36429 49922 38667 36986 21362 -9533 -7308
3690 -7308 -6386 -15488 -7769 7171 27085 36527 42605 55716 23399 2882 304 5603 13321 24747
3676 24747 30816 34850 46158 27316 19747 29962 16130 29768 55155 56186 10871 -16360 -14136
3663 -14136 -3173 5211 -299 -3121 -11099 -29223 -1286 -11114 -19858 -6217 -11557 -20192 -26100 -9192
3649 -9192 -1717 12412 13651 15356 15777 7277 15566 16895 10826 13839 -11923 -29965 1944 44553
3635 44553 49420 19627 -9351 -18333 -25790 -19526 -14999 -28952 -40605 -28007 -4313 17228 -2626
3622 -2626 -23000 -30373 -20717 834 -7404 -22946 -14199 -1441 10966 3032 -1105 -20884 -1736
3609 -1736 -17395 -14215 -7716 9951 6415 21819 3056 -3888 -26287 -20938 -4740 21927 -8262
3596 -8262 -24799 -7828 -5120 24359 37148 36930 56685 60621 67583 74564 43257 14381 31335
3583 31335 57511 36287 55490 67294 30325 -19957 -13481 8015 20967 28438 44866 47854
3571 47854 55961 44288 69147 90907 71201 43517 13320 -590 10215 16272 10551 27061
3559 27061 47647 44531 45026 46780 44219 26996 32858 41117 46133 53589 46900 23959 14371 9118
3545 9118 -8026 -23900 2402 18420 23699 17077 -15620 -17798 -24368 -28488 11366 23581 37015
3532 37015 30443 31111 5301 -6302 -1589 9269 -4965 -24957 -26919 -19789 -49679 -31927 -6350
3519 -6350 -11688 -2635 -12238 -35235 -62886 -52643 -24467 -19062 15064 39207 48640 55444 53990
3506 53990 23865 -11378 -4084 -2789 -18041 -10786 -3579 325 586 -47623 -66696 -61818 -42414
3493 -42414 -9870 14488 21319 11186 -16668 -30849 -56380 -54815 -37003 -18409 -8913 4113
3481 4113 -15557 -13656 -2787 -9970 -8256 -9358 16830 48299 49651 30160 11348 18609 9715
3468 9715 -5858 -24703 -25101 3658 24794 21154 -3767 -25662 -10587 -21507 -12245 8729 29149
3455 29149 62730 77839 77898 70263 61119 51044 37435 57591 62688 39688 38444 32925 21685
3442 21685 37897 43150 35097 19789 10230 12502 20197 31547 47797 52043 29769 20648 262
3429 262 -1646 -11324 -33487 -28229 -21050 726 20264 31407 13942 5467 -5467 2321 19052
3416 19052 23451 2708 -2484 1355 -789 9197 32647 55232 45932 27861 14186 25266 14414
3403 14414 -7661 -2826 46323 80625 74170 47556 6536 16352 4185 12698 27961 9628 -33400
3390 -33400 -69941 -59355 -33042 -48498 -58892 -30890 1919 23823 43398 27964 2978 -2358
3378 -2358 -12967 -33810 -40131 -17839 -4048 -21212 -17428 -12724 -1850 -2495 -33069 -34261 -26991
3365 -26991 -33821 -50660 -21229 19416 24975 18197 9433 -10993 12828 9962 -271 3778 20695
3352 20695 4139 5617 5612 -13491 -16432 -11880 21314 42188 32127 22553 28336 50215 47058 42596
3338 42596 25063 3777 1549 16486 9348 15392 4738 -5502 498 -5788 8232 26653 53145
3325 53145 26812 16995 12132 16843 27135 1582 -21476 -11645 -5553 25336 27077 20038 20149 23597
3311 23597 9052 25424 12694 -6794 5587 24114 37936 13018 12836 417 -18198 -25422
3299 -25422 -21452 17898 13558 -3981 15535 21815 30292 53473 28632 27137 12360 -4878 -38595
3286 -38595 -38599 -32323 -20066 -548 37516 31468 -7454 -12656 -5572 9596 23593 26954 36518 28809
3272 28809 25703 30530 -2664 -16273 -1186 5541 16200 37882 51398 44234 23770 -1830 -5555
3259 -5555 16952 14540 11543 3350 -19752 -19801 -12683 -9450 -4722 -6385 -29692 -29326 -30698 2407 17942
3244 17942 8496 23214 31943 23811 15223 19318 37359 50508 27240 20415 15165 13871 5566 2391
3230 2391 -4663 -2534 6205 15067 11828 27252 36670 20685 19701 3074 32379 37719 53638 44955
3216 44955 9974 -5917 -10724 1693 5231 -2782 -270 -16087 -33461 -21505 10252 16582 22970
3203 22970 13445 -19711 -37698 -12315 107 4460 9113 15369 28569 26167 39448 23071 18295
3190 18295 41065 45205 5720 -10154 -19227 -20742 -28926 -10282 19611 44289 29017 -7892 -17087
3177 -17087 -20803 -16117 -45246 -41377 -31202 3797 22314 -10424 -572 15846 25631 26787 5814
3164 5814 -1422 -5959 -19169 -22173 -28879 -38803 -24793 -30247 -32005 4209 17688 38758 12806
3151 12806 -11122 4349 -7711 10870 34920 43560 27383 34868 29497 18318 -5782 -21242
3139 -21242 -13162 -6344 12189 9770 14390 6407 15169 31409 29792 29027 23349 17449 5586 31873
3125 31873 45622 23378 26894 17402 22587 16518 766 -3824 -4067 1684 7062 2002 -13502 -20504
3111 -20504 -16377 -28387 -48660 -16541 -2333 8945 -9527 -11378 12522 33450 30996 20996
3099 20996 33264 37037 20738 14889 51241 94651 61310 53146 61224 47607 17735 -8073 -44166
3086 -44166 -31490 -13954 -16854 8015 12517 17351 24112 9190 -24134 -8886 30878 15817 8736
3073 8736 11434 5108 20109 45030 45462 41708 19936 7374 -19311 299 41343 33144 15677
3060 15677 -17092 -12375 6243 11565 36884 50455 49211 29923 24713 39753 21875 167 9554
3047 9554 11409 15877 -20977 -50683 -53213 -32801 -53049 -37564 -14962 -1584 -22169 5789 -11227
3034 -11227 -37271 -27824 -15905 995 1685 -3794 -12466 9832 17276 -17822 -26686 -20414 -1147
3021 -1147 -2925 -352 4804 31509 1585 -5301 3954 30926 59518 57110 49945 38176 25333
3008 25333 9591 8258 27675 35799 -2307 -43296 -48759 -24179 -18601 -9556 5856 -13479 -7786
2995 -7786 -16011 4139 34437 31908 -22404 -22681 -31835 -41229 -47954 -15106 -19763 -58657 -42789 -4253
2981 -4253 -8778 11582 33857 45617 26772 -5696 5046 10036 -24984 -26286 -24530 19988 35499
2968 35499 23031 583 -5070 -2428 11460 -1645 -29540 -12178 -2446 -12945 -36707 -46880
2956 -46880 -29551 -16769 -26781 -34541 -2072 35860 -2248 -5439 -15363 -17066 -28096 -23144 -16736
2943 -16736 -5747 24849 19814 15117 -4767 -17846 -21729 -4656 23332 30376 10428 31839 55092
2930 55092 34762 3395 -11983 2180 -1575 -7743 9815 14339 22394 29059 -1847 -3576 -14906
2917 -14906 -35014 -35306 -33086 -31867 -28914 -3723 -459 -3524 -15430 -17468 32438 51815 43833 29924
2903 29924 1931 -32049 -33562 -19070 -22563 -23475 -6033 25600 28970 32374 25191 17290 -11129
2890 -11129 -24640 -14312 8131 18954 3942 -8675 7656 18589 5704 -9420 -20792 -25399
2878 -25399 -29340 -31842 -23724 -20356 -25371 -17437 -18902 -20141 -42880 -29781 -23403 -27337 -2078 -23475
2864 -23475 -53675 -67469 -43964 -11133 -2411 21759 14685 37628 16186 -7351 10456 8526
2852 8526 -17431 -2502 -463 -6165 -30758 -26781 -18251 -6365 -191 1261 -911 2220 2492 7042
2838 7042 12205 -3692 -29061 -29704 -11315 12390 21157 14591 8329 5431 -7053 -22114 -30334 2406
2824 2406 19453 40696 35947 12758 1470 27885 34784 49033 26880 -2019 -13455 3756
2812 3756 36546 46449 44188 58444 19310 -8937 -1683 9131 3698 21822 26176 14241 12468
2799 12468 30723 53166 44217 34661 29478 26781 189 2307 -4899 -9910 -4717 29161 49259
2786 49259 28771 11952 29257 29909 33660 47475 38678 31114 108 -25659 -16419 31771 33042
2773 33042 43725 30507 10694 12615 26334 17762 5421 12934 24132 43675 24418 8671
2761 8671 2691 17475 50403 71188 46591 193 -11689 -14651 -9717 559 6684 9437 24997
2748 24997 22640 14467 -5143 -6484 -2972 14908 -14237 -37911 -37895 879 10373 23328 18910 2402
2734 2402 26952 33889 -4762 287 -17361 -43193 -23820 -1182 -10207 -16989 -16181 1324 4544
2721 4544 -6557 -34703 -53714 -13121 -5063 -10808 3534 14363 8983 -20704 -32459 -33060 -46609
2708 -46609 -15198 7959 20653 -4191 -5110 3619 18392 11098 4417 -1263 1980 22284 7558
2695 7558 -8060 -8207 1843 22495 64088 37897 4682 -3677 559 91 -6985 -8881 -3164 -16689
2681 -16689 -10931 1970 12764 -29770 -32438 -11233 -11454 -35411 -45584 -36258 -32602 -29520 -10416
2668 -10416 7648 345 -7632 15564 29801 35416 17883 25678 41481 34781 -4913 -38810 -49760
2655 -49760 10042 49409 48349 45560 31144 1547 2231 30365 25886 13314 -8269 -16174 -14581
2642 -14581 14010 15351 -9735 -35082 -34089 -18895 -10198 -13889 -1048 9072 4561 -9495 -8056
2629 -8056 -3528 3111 16497 21812 19984 12773 7357 -16689 -43672 -55324 -22950 -8541 -1071
2616 -1071 14131 -5989 -51110 -65694 -30495 -25172 -23850 -12125 -52530 -33250 10902 17686 26948
2603 26948 49647 63476 48675 11390 3363 31888 11297 -3145 -15581 11219 9165 5176
2591 5176 3288 4573 17320 -7884 6070 32576 21184 26742 23977 9924 12679 4354 -15112
2578 -15112 -12674 -12872 15613 18086 -14628 -38536 -32567 -40124 -52306 -43677 -33703 -37270 -26315 -43249
2564 -43249 -32064 661 -4013 4813 37088 42024 31430 23879 25962 22235 16903 -24828 -6923
2551 -6923 30664 11412 -18309 -26275 -14381 711 7917 13234 3993 1789 -773 -17369 -17691 -5959
2537 -5959 -16427 21801 26653 20146 -6297 -36111 5319 11412 11185 -4974 -29685 -64245 -47774
2524 -47774 -25695 -7446 -6227 -27784 -31675 -2024 14801 34344 16453 14126 25233 15514 9565
2511 9565 11587 -805 12333 15254 30753 38135 31357 14492 -13985 -13509 -4682 47355 37580 22017
2497 22017 14409 7062 29371 30102 36254 36727 26039 1771 5442 -27761 -39497 -14944 -7228 3560
2483 3560 8173 -19808 -33324 -19809 26599 18427 34794 18431 -26 -22167 -31066 -23107 7118
2470 7118 765 17816 21339 9555 13106 1976 -10183 -4904 -7526 -2179 -21095 -19065 -2588
2457 -2588 9387 24015 32986 2607 -23548 -5344 -11134 -26321 660 5472 -20878 -49406 -23637
2444 -23637 -3904 23597 25051 22082 21497 7303 9865 11306 8800 -8582 -32368 -39992 -54904
2431 -54904 -34471 -8367 -1693 2574 3233 7355 22813 -4294 -13050 -32465 -41824 -62132 -42031
2418 -42031 -29595 -38124 -46420 -43895 -17123 -13903 -15558 1984 -5284 -22801 -17039 -7157 12 -15861
2404 -15861 -22900 -51333 -47697 -41146 -28436 -1989 -13203 -35055 -45928 -20214 5055 6049 19603
2391 19603 31076 28710 -417 -171 -8063 -1382 13200 9267 16782 -7867 -42758 -35721 -14647
2378 -14647 -11969 12209 21597 6264 -4586 -25797 -10185 8666 211 -9439 1790 1855 22815
2365 22815 23879 26422 8695 -11440 6008 -13176 -33424 -23138 -37786 -50079 -32265 17521
2353 17521 28789 -1896 1992 5821 -23825 -25531 -23298 1166 15446 -896 -6610 -1842 20055
2340 20055 4315 26904 13951 36431 53373 32518 19859 23171 35691 36933 14902 18739
2328 18739 70855 65553 14213 -18943 -10900 14871 7501 -21191 -24735 3472 21732 35397 35641
2315 35641 -7048 -5506 3035 6373 17139 22656 5304 -29020 -14692 27534 43696 23746 11080
2302 11080 23880 279 -19153 -17698 -26544 -4083 9230 20123 22041 24755 25322 24625 23517 13450
2288 13450 17710 32048 9328 -3599 -3936 4306 -19167 -30978 -28642 -29791 -58226 -69659 -50981
2275 -50981 -300 270 31709 36396 27945 27843 28393 14754 453 402 20373 31736 27651 3812
2261 3812 12441 -2575 -12745 5061 26437 14464 30289 46060 34225 47203 61376 65688
2249 65688 59549 42491 28799 42100 35511 18951 3318 12848 27079 39573 31328 -2355 -1974
2236 -1974 -8742 -20633 -11634 17605 30084 18704 25079 21717 14669 -8482 -2886 4894 -9545
2223 -9545 22576 39230 47367 59935 26194 10964 10347 35106 59700 51354 42338 25637 13276
2210 13276 18050 7416 12056 5844 -11767 -13143 26515 45198 26765 58 347 -20697 -15837
2197 -15837 -10915 -16615 -31869 -5072 52838 48579 25445 3139 -3166 -23812 -31769 -43089 -29439
2184 -29439 -12977 -1455 5338 11375 35964 49212 29596 28701 24684 22573 1767 15580 32476
2171 32476 35329 29946 22146 13263 13472 23962 29760 18162 -5233 -13541 -7417 -10704 -38648 -26538
2157 -26538 -1379 8484 -8370 -15208 -25999 -27721 -954 28366 19755 -11930 1079 8406 19110
2144 19110 34515 15351 2668 -1135 -3720 -12168 13374 21125 10170 28745 9594 -21656 -23181
2131 -23181 -22525 13734 25375 8472 -14206 -13493 6497 -1954 1100 -18347 -41811 -35159 -8331
2118 -8331 15785 19104 2298 906 -11762 -39626 -27831 -15480 -9015 -23808 -28485 -17858 -1475
2105 -1475 13497 29920 3347 21350 23485 12229 104 -6704 31263 21816 30806 28646 21919
2092 21919 5791 20676 8408 16703 4904 -10164 -14447 -5915 -29117 -62213 -65714 -50417 -68734
2079 -68734 -63652 -16440 3478 -13940 -14894 7352 7284 4167 7857 26036 5622 2351 10935 12849
2065 12849 19146 20707 -886 -6596 15439 15651 -1205 -26580 -21408 -20560 -8990 -8919 -21269 -14740
2051 -14740 -32115 -35651 -1742 28591 7236 -27080 557 30701 42731 26648 1583 11942
2039 11942 22110 16924 8049 31418 59290 49423 44256 13591 -5285 10152 5886 -7946 -36752
2026 -36752 -31036 -21066 -17030 -18273 -13088 -13307 -7909 -410 -12420 -12163 -34160 -22801 -28424 -7411
2012 -7411 -1483 -10376 -2978 3133 13903 26973 13799 12756 39965 50410 68523 80492 45837
1999 45837 20107 57731 82896 39540 22938 8381 -20177 -23748 -10100 16452 10184 20104
1987 20104 35223 48091 12957 -8006 -27986 -5851 21610 30486 26964 -2067 -36027 -44377
1975 -44377 -19244 27949 30161 28348 17062 -22333 -45310 -19161 -2541 27083 18309 42386
1963 42386 40690 46528 44287 23953 21843 16146 13929 26736 35904 34171 5761 17876 26802 -511
1949 -511 -28807 -22342 1707 21889 -1460 507 20349 22653 19094 23907 20668 52127 62232
1936 62232 12490 -6335 -25770 -28378 3225 33709 14114 3791 -2066 -22777 -58414 -40383
1924 -40383 -10137 12181 19838 -8851 -17410 -4370 20768 27829 9751 12794 -20698 -35876 -15453
1911 -15453 -9777 17975 5605 -27626 6967 14355 12855 5150 22890 23570 8774 543 -8470
1898 -8470 -18235 -26830 -19816 12979 44632 14953 -18634 -15684 9366 22640 11123 -1409 -23478
1885 -23478 -19303 24950 45152 35258 60902 59917 16711 -28501 -25743 -27776 -45957 -38631 -32806
1872 -32806 -20515 4055 20850 20921 14741 -24848 -53527 -44955 -30887 -21104 -22653 -43077 -37363
1859 -37363 -6425 -20046 -29319 -20109 -15158 -37668 -22836 -6693 -4766 2454 -13506 -12650 -13992
1846 -13992 -39645 -38231 -4813 9329 -17473 -40388 -28749 10267 11225 -13773 -17751 -13590 -6069
1833 -6069 -8994 -39604 -50706 -30555 -10330 4457 8314 4231 8725 18212 -2562 -5447 -13642
1820 -13642 -3883 914 3764 43618 43248 38961 35411 21970 8325 -8760 -7422 -31689 -52770
1807 -52770 -38428 -10172 -9399 -1091 -235 -13811 -32444 -9436 -7339 543 27457 27852 16130 32213
1793 32213 20281 -5090 -13345 -40510 -36597 -22106 -12437 1276 -9834 -19134 -11459 1416 -10459
1780 -10459 -11679 4728 40699 23479 19698 28867 -7919 -8946 1318 11468 13186 19967 -8720
1767 -8720 -37519 -17600 25461 44033 31903 484 8494 43448 66274 54018 34174 23181
1755 23181 13060 19335 8429 1426 615 -20215 -31186 -26016 -40974 -37915 -20952 -21524 -30538 -16134
1741 -16134 17081 3402 -11465 -5657 1079 -3771 -11739 -11821 -15788 -21639 -15374 -37469 -39303 -8401
1727 -8401 16927 1902 -11852 -23952 -31195 -22335 -20993 -28507 -14585 -3112 -6573 -14207 -15680
1714 -15680 -2915 3562 16011 22247 6638 9161 21963 34579 48792 30921 43025 51195 22454
1701 22454 13510 7929 -3822 -7067 -11016 -3138 -5920 -20666 -48122 -61902 -50531 -30435 -5658
1688 -5658 5909 -17651 -34344 -36141 -35973 -24013 -21926 -31696 -57176 -67802 -26204 -12620 18699
1675 18699 32386 36502 24279 2892 -15336 -35511 -36308 -44348 -31754 -23214 -6118 -5357 -540
1662 -540 -5576 12542 15067 -3811 3523 -1445 1994 -21768 620 20868 23941 19221 -4526 -18276
1648 -18276 -26771 -23404 -18202 -115 -10259 -19732 -7201 -3958 -24139 -26985 -36068 -30671 -32443 -32190
1634 -32190 -35247 -12927 10628 40517 32383 15034 -8889 -2986 10619 15218 3592 20615 12439
1621 12439 13928 12375 4644 12590 23218 27924 26900 13822 -6779 -15072 458 -3397 14049
1608 14049 4642 -569 -9058 4004 -7531 -4408 8532 -16416 -39738 -25697 -11258 20962 39065
1595 39065 28867 25325 6154 25906 12696 -15010 1936 5398 7950 47978 55856 39399 18836
1582 18836 14839 15748 20628 26384 23045 30357 50144 57437 28964 26350 24184 22285 -10335 -37375
1568 -37375 -33100 10496 42143 34345 42187 42249 -2166 -15040 -22998 -20266 -23357 3132 17794 32465
1554 32465 31212 65288 50422 16566 29403 45277 28318 32318 38787 36445 43235 49974 62856
1541 62856 52164 41939 50735 47293 20120 1223 13843 4062 -27154 -39369 -29907 -29830 -16508
1528 -16508 -10112 13966 19689 7378 -7702 -5664 5423 11360 53740 59527 32359 9035 3214
1515 3214 23430 28893 23429 -21997 -6747 -9448 -4610 -2190 25257 12868 10246 27186 22174
1502 22174 7252 -16997 -37952 -37148 -4666 -6087 -9387 -5091 -9351 -3111 -9232 -18022 -16633 7536
1488 7536 -561 -2148 16997 32710 35991 40987 18145 12478 11575 15930 14706 11127 7382 -18826
1474 -18826 -3057 -10438 -22788 -69596 -80192 -84781 -80360 -76488 -57423 -25233 -4699 -3729 1558
1461 1558 -17124 -21364 -1533 12476 13868 11576 11082 18110 14109 -5927 1465 10068 5887 -4000
1447 -4000 -17522 -22022 -17712 -24408 -5174 -6651 14940 20242 6283 4523 -16303 -41572 -19116
1434 -19116 5810 27433 68122 57965 3840 -10854 -18713 -2471 -7247 -31254 -36488 -38260 -18482
1421 -18482 -12883 -24922 74 -16766 1402 19543 16198 11126 28843 31688 24585 36125 29736
1408 29736 18103 12329 6111 -16582 -37065 -17148 6762 38333 64344 71998 67536 57756 6962
1395 6962 -21928 -27099 -40992 -21389 10532 16610 -17768 -19021 -40675 -53778 -29792 -11988 -22579
1382 -22579 -9995 -14101 3711 16484 5859 2919 7285 11453 -1723 -3820 8124 16274 10196
1369 10196 33599 28337 -5616 -13731 11329 -12011 -38794 -43103 447 3918 -26052 -44993 -13627
1356 -13627 15894 12339 7027 6030 8807 21298 -8690 -20558 -52146 -36692 9111 44569 39990
1343 39990 47475 34321 15811 33485 58923 28010 -31478 -59490 -38635 14945 25275 15438
1331 15438 12151 1649 15834 31577 22494 9336 -661 -27863 -47431 -40154 -17354 3941 -23768
1318 -23768 -28291 -28233 -26452 -48373 -86548 -73685 -33934 3199 18124 4863 -6862 11032 31018
1305 31018 -9877 -31496 -30051 -33331 -47876 -8550 6528 650 -12515 -15852 -32871 -19700 11508
1292 11508 18023 28635 5472 -28000 -19787 -6257 -4164 6097 -1312 -22015 -27442 -26322 -28909
1279 -28909 -40823 -45728 -70101 -44727 -32136 -6245 5149 1946 -18347 -14432 24732 37035
1267 37035 23019 27338 9601 -6221 -3942 8983 25947 1823 4503 9325 19166 4750 20263
1254 20263 47850 54257 14986 -2424 -15801 -37650 -5428 -6268 -12334 -8812 -8245 -11437 2785
1241 2785 2970 -12317 -6322 -16421 -12614 6629 21843 31937 27074 23124 21564 27080 61389 75356
1227 75356 56802 46534 30692 11990 3591 -35757 -32014 -29955 -21743 -28612 -24937 -18809 -4062
1214 -4062 36970 58971 43681 54067 56185 64450 53888 19913 12957 19362 312 7391 12530
1201 12530 10839 -7070 15692 47952 29943 6852 23814 5226 4430 -5873 -3599 -23590 -32759
1188 -32759 -13657 -1980 -7761 -4076 813 -9972 -4438 3308 606 -1998 11769 -2902 -6960
1175 -6960 -10843 -19015 -35678 -34912 -21649 -17983 15200 32257 43175 47647 33185 11821 10444
1162 10444 6368 28491 29284 24298 12803 12939 24933 190 -2342 -11880 -36646 -38893 -13838 -17748
1148 -17748 -29096 -32473 -44192 -32859 -24479 2307 5539 24361 -7793 -25110 -31400 -22286 3728
1135 3728 28253 21621 18888 30757 6891 -7038 -11276 -18043 -27269 -19464 -14663 -14635 -2866 17468
1121 17468 -15128 -25441 -5456 664 -4127 12336 70 13039 29131 20186 13478 38648 36436
1108 36436 25303 27995 1969 -15118 -24004 -24355 3002 15287 -1704 -16738 -10523 -1532 11411
1095 11411 14412 33434 41382 35184 38417 32353 7405 -6605 -23303 -9596 16012 24711 23542
1082 23542 -15261 -13159 -2860 10476 -4308 -4370 12935 20234 11887 1884 -9937 -2088 15995
1069 15995 22530 35169 41541 54472 41301 32873 18951 -6870 513 19633 11241 -17947 -16549
1056 -16549 -20158 -12474 -18461 -18988 -10279 -22481 -20322 217 19022 24733 27417 8868 -1300 -10879
1042 -10879 -7173 -25087 -1493 668 -3150 -19963 -12681 -2287 -23904 -35560 -17791 -6789 1356
1029 1356 21078 32368 25118 -5116 -33878 -51587 -59564 -38897 -18614 -24894 -33382 -33037 919
1016 919 -12423 -10732 10129 400 4742 29409 -262 -14262 -32224 -27949 -12304 17028 20003
1003 20003 -8648 8759 -3035 5729 7532 7297 8498 16603 15744 9296 -737 -5363 -16453 -15391
989 -15391 -22965 -11556 6049 21200 13315 9896 -1592 -18804 -14055 1585 17106 17020 21450 23938
975 23938 29318 19641 7543 13720 38103 50945 37993 23004 -2432 -2565 -8799 -14173 -15693 -15974
961 -15974 7805 21418 19949 14365 9575 -1180 -9633 -12829 -34192 -35654 -5377 394 -21716
948 -21716 -34010 -26499 -32864 -38982 -30202 -21354 -24745 -12983 -28512 -40309 -26547 -1911 -7136
935 -7136 14568 39725 15834 -10373 -33322 -6735 7694 -15032 -21422 -33723 -54792 -28162
923 -28162 1712 -71 -10214 -14540 -1179 17750 -13280 -23081 -31564 -40242 -28897 -23189 -39829
910 -39829 -28555 17207 39448 36071 9682 21679 30879 18771 12746 12859 18826 -19757 -52931
897 -52931 -35582 -23939 -17751 -23315 -22129 9829 12714 2960 3286 18750 27900 13912 -31393 -47769
883 -47769 -50787 -67690 -77393 -51446 -48788 -32303 -4282 13175 42104 50061 18609 -15830 -20802
870 -20802 1671 11079 -4160 6202 8466 -3420 -34258 -29189 -24592 -21659 -9729 7112 -1437
857 -1437 -33212 -24488 4944 1404 -30231 -36554 -9625 999 -1343 12425 2324 5748 17145
844 17145 32842 24140 -28530 -31951 -22747 -56634 -41271 -21973 -26724 -21033 -4866 14365 22665
831 22665 9101 -9621 -32165 -18612 -7470 -13581 -13653 -5832 1781 19933 30240 18565 -2494
818 -2494 -1676 3924 13344 22638 41003 52341 53324 19218 2186 5600 12731 15313 5910 32444
804 32444 -9853 -29952 2227 26625 14431 10238 -1547 -22513 -15458 -27595 -33121 -38268 -51948
791 -51948 -36130 -12757 15781 -14669 -21518 -3056 -6310 9922 9226 -7734 17104 9747 -5342
778 -5342 -10062 2723 25021 26586 30097 45450 13775 6893 10318 -17138 -14090 -14354 -7000 16325
764 16325 22371 12041 9121 -2796 -12432 -13754 -14519 -17241 -11268 -7883 374 -9954 -2243 -3615
750 -3615 18537 38300 51089 24711 -6779 -16640 -5520 720 16491 16293 13717 -14431 -40886
737 -40886 -26752 -28719 -15507 -68 -19101 -30997 -11126 -7255 -1337 -10501 7639 4382 6839
724 6839 11941 7675 -7830 -4154 -3530 19052 29568 21922 -4503 4092 34657 39792 21784 4723
710 4723 22110 28563 31525 22678 32265 31792 20650 22861 24795 42000 54196 31041 4220 8311
696 8311 30671 44494 25955 11184 19017 7904 -4401 -28956 -37753 -34401 -59895 -77012 -42247
683 -42247 -9395 20074 25643 7460 34096 41210 7202 -20079 -12260 6925 10512 1485 6690
670 6690 26317 28614 25924 8352 21352 36896 38532 38840 30341 19449 20719 5885 24039 21621
656 21621 9216 -6478 -14365 16166 51584 30590 -4381 -748 8551 -8349 -8618 886 21660
643 21660 -1728 6361 -1647 -10916 -18823 -8018 22452 16629 16057 34841 34570 -718 -29978 -49820
629 -49820 -35733 -11353 5423 2888 5779 13593 -973 -8355 -15025 9107 -6775 20509 19894
616 19894 -20736 -34345 -19779 15708 988 -12880 -28923 -35444 -18413 841 1624 9168 12548
603 12548 16423 19373 -1576 -10310 -18561 -22051 -22219 -31684 -23510 -6360 17877 22796 -3813 -11092
589 -11092 -482 13000 -8837 10716 30012 8467 -2031 -2545 -4678 10946 18637 2649 -2355
576 -2355 24446 44897 31811 34802 24927 1206 14334 2178 -1345 1635 1896 -36398 -42434 -31022
562 -31022 -18989 -8093 -13683 -11696 9007 14287 19021 -17986 -36829 -27301 -27539 -18660 -5422 25472
548 25472 12973 20252 25320 16551 38379 30912 12862 42254 31317 8925 10457 26682 -5688
535 -5688 -2813 -7331 2527 -495 -13182 -16407 -14980 -47456 -43377 -10031 -2534 71 -1250 -20060
521 -20060 -33090 -7141 -9938 20286 21648 -14336 -24823 -15796 1694 7308 -1750 -10279 -5654
508 -5654 -6671 5615 12845 14378 4159 -15088 1064 15902 -21213 -15901 -6906 -23801 -31655
495 -31655 -34599 -46497 -27694 4623 37466 29802 12347 13563 475 5237 13978 26101 12299
482 12299 -14093 -20084 -31417 -8106 29036 42217 41935 42791 13251 -20693 814 47518 64666
469 64666 22780 -14619 -13856 36 21983 29697 27753 27937 554 -5276 -28243 -48421 -39493 -36737
455 -36737 -33617 -22627 -17860 -5470 18501 6825 -19563 2618 14385 18095 -11863 -31044 -33692
442 -33692 -9882 4738 -13275 -31168 -37203 -37382 -37882 -33315 422 -8530 -24909 -24368 -4953 -21997
428 -21997 -38817 -21453 14918 17056 23497 19948 -16417 -24833 -15006 -12351 -4530 -16021 -41881
415 -41881 -32704 -19044 -20633 3081 9772 1949 -13812 -5184 4702 -5882 8278 -1186 7832 5307
401 5307 -17807 -13775 25898 33571 13599 38862 29397 9848 28112 61613 62418 31199 11081
388 11081 14502 -1789 -18344 -39175 -35061 -17967 -32106 -29919 -4094 6231 17063 3856 6281
375 6281 6304 10977 21538 8394 -9154 8056 21023 27049 20011 5011 -6450 -24191 -21220 -8281
361 -8281 2550 -1869 4180 3817 31603 39582 10945 39246 33918 24182 28944 5290 -12937 3107
347 3107 -8921 -2510 29139 27231 29961 39400 11193 1526 13314 42423 29438 10261 14735
334 14735 46982 41274 21782 20766 13526 15745 5299 2187 -7603 -5835 23235 39608 26671
321 26671 30451 40416 35392 37732 10839 -11307 -2136 -11890 590 23523 14876 27033 26928 24157
307 24157 10523 -1869 -17326 -14259 -3894 -317 13818 35939 39677 8400 -33391 -49611 -55056
294 -55056 -32590 -13990 -12256 3436 25301 12738 15976 16050 -8548 -24437 -18172 -15178 -22545 -39735
280 -39735 -47811 -35895 -7605 9007 10664 20465 22996 23382 32654 20000 -18841 -24683 -20261 6127
266 6127 9621 5690 9010 9563 -6268 -9078 -14950 -15555 -34166 -63717 -59242 -64111 -54979 -50432 -66823
251 -66823 -50157 -18181 -14492 -12947 -9385 2991 2852 -2197 -4618 -9015 19345 16977 -1718 -1202
237 -1202 -10023 -43083 -44635 -34866 -14727 -8024 -26828 -26385 -7546 -22416 -7537 4344 -11725
224 -11725 9225 31316 30563 5258 -16305 -36810 -61141 -39853 -2352 14012 9894 -23935 -7209
211 -7209 -7480 -977 20303 11560 713 21341 27817 -1164 -5706 -4457 -6307 -3118 11473 45813
197 45813 44403 40379 17147 957 22278 7865 -23131 -15682 -15090 -18469 -22733 5348 21858
184 21858 24331 7217 -827 2447 -17626 -15033 14510 31235 17474 12224 12868 -2609 -13333
171 -13333 -50674 -50785 -22781 -13052 -26744 -9632 867 4942 -5621 -37866 -49415 -30975 -9701
158 -9701 4921 18088 23755 -389 11412 29549 5741 -19974 -11675 2875 -8072 -19197 -15826
145 -15826 8382 -7957 -11985 -12674 -24153 -18129 -21024 -17183 -14081 -12487 3545 13509 11748 14424
131 14424 19995 32708 23075 18350 22301 9380 9187 14508 17651 13785 22680 20680 25195 11530
117 11530 -31853 -37644 -3267 4663 4591 -2661 -2400 -14510 -26860 -35621 -61530 -64221 -49609 -36173
103 -36173 -28057 -17865 -24953 -33761 -31344 -19380 1721 9293 -15 -1506 -6034 895 17598 12093
89 12093 -3492 -2355 -3749 -13706 -22474 -18370 -6510 -1546 327 -14879 -31501 -38716 -35420 -36185
75 -36185 -23197 -16002 -6445 -3059 -2557 2740 5422 19274 15231 6425 19362 28199 39450 34444
61 34444 22316 -3171 -9648 -8687 -25647 -31557 -20310 -13784 167 18295 28864 17228 -10106
48 -10106 -6030 8336 22263 16145 25103 28381 25224 23227 24766 18399 14685 4972 4930 1931 17851
33 17851 14812 10355 -2339 -17968 -13054 -7214 -30001 -41376 -22923 -10153 -1562 -22321 -17248
20 -17248 -25523 -36110 -23556 -7141 9705 17132 9888 6672 6032 4176 -3905 -18422 -16921 -5488
6 -5488 -15199 -30294 -25934 -12946 -5846 2567
0 2567
$$ Imaginary data points
##PAGE= N=2
##DATA TABLE= (X++(I..I)), XYDATA
32767 113568 100145 110575 131613 121851 120961 112492 117116 121888 122215 127577 135023 142198 130582 129320
32753 129320 137055 150208 159355 151724 158486 154390 132832 111680 108578 120717 134632 125265 130608
32740 130608 144371 142871 137455 150391 161354 167014 157257 137749 122339 128272 150361 163987
32728 163987 186548 188458 173299 154862 154636 162031 162214 166056 180222 188664 186625 190535 202424
32715 202424 203383 193671 202005 213039 219760 208025 205867 209053 212573 208525 207234 201832 209108 239501
32701 239501 243431 243120 263955 259854 248744 232698 214837 211670 209020 210056 227909 238562 229794
32688 229794 216497 209199 218805 223718 241614 256829 276532 265187 256668 246097 251407 256377 265010
32675 265010 269843 280505 277323 263462 261010 270716 255437 252775 267881 259428 247669 252530 268456
32662 268456 261008 259780 278687 273570 260814 252970 251329 253005 251040 256628 267590 272299 264891
$$ [...]
##END NTUPLES=NMR SPECTRUM
##END=
