##TITLE=Analysis number 325114
Compound Code cc 21114
Book Reference 483/90
Project Code adrs
Chemist Name mattw
##JCAMPDX= 6.0         $$ Bruker NMR JCAMP-DX V2.0
##DATA TYPE= NMR SPECTRUM
##DATA CLASS= NTUPLES
##ORIGIN= Bruker BioSpin GmbH
##OWNER= nmr
$$ XWIN-NMR		Version 3.5
$$ Tue Dec 12 12:25:25 2006 GMT Standard Time (UT+0h)  MAYBRIDGE\nmr@NMR_250MHZ
##.OBSERVE FREQUENCY= 250.131544655141
##.OBSERVE NUCLEUS= ^1H
##.ACQUISITION MODE= SIMULTANEOUS (DQD)
##.ACQUISITION SCHEME= undefined
##.AVERAGES= 16
##.DIGITISER RES= 18
##SPECTROMETER/DATA SYSTEM= dpx250
##.PULSE SEQUENCE= zg30
##.SOLVENT NAME= CDCl3
##.SHIFT REFERENCE= (INTERNAL, CDCl3, 0, 16.5158)
##AUDIT TRAIL= $$ (NUMBER, WHEN, WHO, WHERE, WHAT)
$$ ##TITLE= Audit trail, XWIN-NMR		Version 3.5
$$ ##JCAMPDX= 5.01
$$ ##ORIGIN= Bruker BioSpin GmbH
$$ ##OWNER= nmr
$$ C:\u/data/dgb/nmr/ADRS/760/pdata/1/auditp.txt
$$ ##AUDIT TRAIL=  $$ (NUMBER, WHEN, WHO, WHERE, WHAT)
(   1,<2006-12-12 12:25:03.08 +000>,<MAYBRIDGE\nmr>,<NMR_250MHZ>,
      <created by zg, POWCHK disabled, PULCHK disabled
       configuration hash MD5:
       49 4B E0 1D 92 C2 6B 37 9F E6 65 BC 52 41 86 1D
       data hash MD5: 64K
       25 3F C3 73 F3 E1 6D 59 B4 3D 9B 6B FA 58 4B D5>)
(   2,<2006-12-12 12:25:15.33 +000>,<MAYBRIDGE\nmr>,<NMR_250MHZ>,
      <Start of raw data processing
       ef LB = 0.3 FT_mod = 6 PKNL = 1 SI = 32K 
       data hash MD5: 32K
       C6 F1 1E 00 4D E8 21 B6 59 E9 D8 DB 66 28 67 FB>)
(   3,<2006-12-12 12:25:16.99 +000>,<MAYBRIDGE\nmr>,<NMR_250MHZ>,
      <apk 
       data hash MD5: 32K
       DA FA 3E 3D 91 FB 9E 2A A7 63 6B 80 74 34 90 F6>)
(   4,<2006-12-12 12:25:17.71 +000>,<MAYBRIDGE\nmr>,<NMR_250MHZ>,
      <abs ABSG = 5 
       data hash MD5: 32K
       F9 FC 4E CA 36 9B 88 07 20 91 15 B8 43 DD 26 07>)
$$ ##END=
$$ 
$$ hash MD5
$$ 9B 2B A5 88 D3 4D 0C 05 69 D9 A3 E3 51 BD F7 16
##$RELAX= 
##$RELAX= 
##$RELAX= 
##$RELAX= 
##$RELAX= 
##$RELAX= 
##$RELAX= 
$$ Bruker specific parameters
$$ --------------------------
##$DU= <C:\u>
##$EXPNO= 760
##$NAME= <ADRS>
##$PROCNO= 1
##$TYPE= <nmr>
##$USER= <dgb>
##$AMP= (0..31)
100 100 100 100 100 100 100 100 100 100 100 100 100 100 100 100 100 100 
100 100 100 100 100 100 100 100 100 100 100 100 100 100 
##$AQSEQ= 0
##$AQ_mod= 3
##$AUNM= <au_zg>
##$AUTOPOS= <40 >
##$BF1= 250.13
##$BF2= 250.13
##$BF3= 250.13
##$BF4= 250.13
##$BF5= 500.13
##$BF6= 500.13
##$BF7= 500.13
##$BF8= 500.13
##$BYTORDA= 1
##$CFDGTYP= 0
##$CFRGTYP= 5
##$CHEMSTR= <none>
##$CNST= (0..31)
1 1 145 1 1 1 1 1 1 1 1 1 1 1 1 1 1 1 1 1 1 1 1 1 1 1 1 1 1 1 1 1 
##$CPDPRG= <>
##$CPDPRG1= <>
##$CPDPRG2= <>
##$CPDPRG3= <>
##$CPDPRG4= <mlev>
##$CPDPRG5= <mlev>
##$CPDPRG6= <mlev>
##$CPDPRG7= <mlev>
##$CPDPRG8= <mlev>
##$CPDPRGB= <>
##$CPDPRGT= <>
##$D= (0..31)
0 1 0 0 0 0 0 0 0 0.06 0 0 0 0 0 0 0.0002 0 0 0 0 0 0 0 0 0 0 0 0 0 0 
0 
##$DATE= 1165926301
##$DBL= (0..7)
120 120 120 120 120 120 120 120 
##$DBP= (0..7)
150 150 150 150 150 150 150 150 
##$DBP07= 0
##$DBPNAM0= <>
##$DBPNAM1= <>
$$ [...]
##$SUBNAM7= <"">
##$SUBNAM8= <"">
##$SUBNAM9= <"">
##$SW= 20.6930455092707
##$SWIBOX= (0..15)
0 0 3 0 0 0 0 0 0 0 0 0 0 0 0 0 
##$SW_h= 5175.983436853
##$TD= 65536
##$TD0= 1
##$TE= 295.16
##$TE2= 300
##$TE3= 300
##$TEG= 300
##$TL= (0..7)
0 120 120 120 120 120 120 120 
##$TP= (0..7)
150 150 150 150 150 150 150 150 
##$TP07= 0
##$TPNAME0= <>
##$TPNAME1= <>
##$TPNAME2= <>
##$TPNAME3= <>
##$TPNAME4= <>
##$TPNAME5= <>
##$TPNAME6= <>
##$TPNAME7= <>
##$TPOAL= (0..7)
0.5 0.5 0.5 0.5 0.5 0.5 0.5 0.5 
##$TPOFFS= (0..7)
0 0 0 0 0 0 0 0 
##$TUNHIN= 0
##$TUNHOUT= 0
##$TUNXOUT= 0
##$USERA1= <user>
##$USERA2= <user>
##$USERA3= <user>
##$USERA4= <user>
##$USERA5= <user>
##$V9= 5
##$VALIST= <valist>
##$VCLIST= <CCCCCCCCCCCCCCC>
##$VD= 0
##$VDLIST= <DDDDDDDDDDDDDDD>
##$VPLIST= <PPPPPPPPPPPPPPP>
##$VTLIST= <TTTTTTTTTTTTTTT>
##$WBST= 1024
##$WBSW= 4
##$XGAIN= (0..3)
0 0 0 0 
##$XL= 0
##$YL= 0
##$YMAX_a= 348518
##$YMIN_a= -462379
##$ZGOPTNS= <>
##$ZL1= 120
##$ZL2= 120
##$ZL3= 120
##$ZL4= 120
##$ABSF1= 16.51575
##$ABSF2= -4.177422
##$ABSG= 5
##$ABSL= 3
##$ALPHA= 0
##$AQORDER= 0
##$ASSFAC= 0
##$ASSFACI= 0
##$ASSFACX= 0
##$ASSWID= 0
##$AUNMP= <proc_1d>
##$AZFE= 0.1
##$AZFW= 0.1
##$BCFW= 0
##$BC_mod= 0
##$BYTORDP= 0
##$COROFFS= 0
##$CY= 12.5
##$DATMOD= 1
##$DC= 0
##$DFILT= <>
##$DTYPP= 0
##$F1P= 14.0000005364418
##$F2P= -0.99999901652339
##$FCOR= 0.5
##$FTSIZE= 32768
##$FT_mod= 6
##$GAMMA= 0
##$GB= 0
##$INTBC= 1
##$INTSCL= 1
##$ISEN= 128
##$LB= 0.3
##$LEV0= 0
##$LPBIN= 0
##$MAXI= 10000
##$MC2= 0
##$MEAN= 0
##$ME_mod= 0
##$MI= 0
##$NCOEF= 0
##$NC_proc= -5
##$NLEV= 6
##$NOISF1= 0
##$NOISF2= 0
##$NSP= 0
##$NTH_PI= 0
##$NZP= 0
##$OFFSET= 16.51575
##$PC= 1
##$PHC0= 227.3046
##$PHC1= 1.052525
##$PH_mod= 1
##$PKNL= yes
##$PPARMOD= 0
##$PSCAL= 4
##$PSIGN= 0
##$REVERSE= no
##$SF= 250.130001562349
##$SI= 32768
##$SIGF1= 0
##$SIGF2= 0
##$SINO= 400
##$SIOLD= 32768
##$SREGLST= <1H.CDCl3>
##$SSB= 0
##$STSI= 32768
##$STSR= 0
##$SW_p= 5175.98343685301
##$SYMM= 0
##$S_DEV= 0
##$TDeff= 65536
##$TDoff= 0
##$TI= <Analysis number 999999
Compound Code 99
Book Reference 9
Project Code 9>
##$TILT= no
##$TM1= 0
##$TM2= 0
##$TOPLEV= 0
##$USERP1= <user>
##$USERP2= <user>
##$USERP3= <user>
##$USERP4= <user>
##$USERP5= <user>
##$WDW= 1
##$XDIM= 32768
##$YMAX_p= 352335295
##$YMIN_p= -475788
$$ End of Bruker specific parameters
$$ ---------------------------------
##NTUPLES= NMR SPECTRUM
##VAR_NAME=  FREQUENCY,     SPECTRUM/REAL,   SPECTRUM/IMAG
##SYMBOL=    X,             R,               I
##VAR_TYPE=  INDEPENDENT,   DEPENDENT,       DEPENDENT
##VAR_FORM=  AFFN,          ASDF,            ASDF
##VAR_DIM=   32768,         32768,           32768
##UNITS=     HZ,            ARBITRARY UNITS, ARBITRARY UNITS
##FACTOR=    0.157963299565203, 1,           1
##FIRST=     4131.08479467086, 0,            0
##LAST=      -1044.89864218215, 0,           0
##MIN=       -1044.89864218215, -475788,     0
##MAX=       4131.08479467086, 352335295,    0
$$ Real data points
##PAGE= N=1
##DATA TABLE= (X++(R..R)), XYDATA
$$ [...]
23626A47747M2545m0991q284j8215p80m7941l9386O1265q1546q4817j6295o2423
23614a49121l5450M3223O8864l4984Q6377J88780Q506j19136j85277p311Q3184
23603e2345r216O9307p2221L3215P8853M4852J5188n2765l2571m0934j24994Q6450
23591e7181J39415P8583k0880j15648l4492K2119P0977R1014j18182J91K4214
23580H0130p9358l9439j76440K6232J68529J28719P7839j14653j19161J3121l3013
23569f7494m6321O9766M2780N8849L3998N1562n6965m7872j0801k2296l9300J7056
23557a7038J10450J4108j3288o6395j947J7514p6769J4104J1152N5255l6405j9983
23545i242K1694N1522P9431L5378n0018l7233l3887j30879N935P4493K1244o658
$$ y = [147747, 190292, 149301, 141017, 122802, 122022, 74081, 34695, 95960, 14414, -70403, -86698, -149121, -184571, -141348, -72484, -107468, -21091, 167689, 176195, 57059, -128218, -135529, -52345, -61561, 7746, -64475, -31260, 47593, 92445, 107633, 54868, 22297, -18637, -143631, -57181, 82234, 160817, 139937, 24289, -10203, 11916, 82893, 173907, 55725, 55916, 80130, 772, -38667, -215107, -188875, -20346, 108373, 186212, 71559, -47602, -34481, -67494, -113815, -44049, -1269, 57580, 91578, 143140, 86175, 38303, 27502, 5206, -34094, -17038, 93412, 107520, 94232, 27837, 25890, 43404, -33365, -19261, -8109, 47146, 10741, -9242, 12452, 63974, 143405, 178783, 128765, 91532, 57645, -73234, -67299, 7194, 28438, 21780]
23533B1780K7172O0398p1115k4P5221O4918p0133O5221J27199n4038p2385j5633
23521A58581m8988j08398j12400J8087K5508n2105J2086M7967O9584R2597o4386
23510C8133K5515P0779p5635j58442R1440J53138J07059j8088k08310o5656J32839
23499I2772M338r2019p1801L2613R1437r8484p0365K1569Q2393J8726l6782M9705
23487B4102L1540l1395k0362M0044J6724k7620j4717Q5969K0754q8362O139K080
23475D4896n1224n6376q4806K7168Q1146j1665m7868N3791N4498l0716m0536K3253
23463c8439r7614j05163k8763J3861J51658J21649l0263q2444l9417Q0281J08830
23452E4176Q8779l3577n1051r3415M3232N3321m4984j00722k3352R9304q174l3793
$$ y = [21780, 48952, 109350, 38235, 38211, 113432, 178350, 108217, 173438, 300637, 246599, 174214, 158581, 109593, 1195, -111205, -93118, -67610, -119715, -107629, -59662, 9922, 102519, 38133, 63648, 134427, 58792, -99650, -8210, 144928, 251987, 233899, 25589, -40067, 92772, 97110, 5091, -66710, -34097, 57340, -41144, -111509, -89940, -7547, 11179, -25603, 24102, 55642, 24247, 3885, 43929, 60653, 33033, 18316, 104285, 125039, 36677, 42816, 44896, -6328, -62704, -147510, -120342, -39196, -50861, -98729, -44938, 9560, -21156, -61692, -38439, -136053, -241216, -269979, -256118, -104460, 17189, -13074, -95518, -134935, -54654, 54176, 142955, 109378, 58327, -35088, 8144, 61465, 16481, -84241, -107593, -8289, -16463, -50256]
23440e0256J42616n3000j9702J03204N9010k5332P7299M8691l4216j21897j41118
23429a4701q8716N1095K4410J9474j9845m3525J711J88196R7805j5562M6633l757
23417B43218n3317o1595j26904j9036o6238p5280k6659j5521q0792J32904J08189
23406d1031j8702O45k1728j7483M8314N6852J37296P1030J9475j3248j4442p5228
23394A31750j69137j61920R6324P9033j1444p7253p0629n9307q1078n5571p1388
23383d50620J47535J93233m08R8888Q8875R1347n2429k33768l6261P4029Q2561
23372B982N1610R32p6251k1005j4030p0832P1109L2932l8229p5148k7459K722
23360a60667r4463J28225J30244P575J08019L8091k34453J6891R1388J3211M3619
$$ y = [-50256, 92360, 39360, 19658, 122862, 181872, 156540, 233839, 282530, 248314, 126417, -14701, -103417, -52322, -27912, -8438, -28283, -71808, -70097, 118099, 215904, 200342, 246975, 243218, 189901, 128306, 1402, -17634, -83872, -159152, -185811, -201332, -282124, -149220, -41031, -59733, -59088, -80816, -98299, -49985, 6867, 144163, 215193, 234668, 221420, 206978, 131750, -37387, -199307, -102983, -23950, -35394, -112647, -183276, -242583, -323661, -379232, -450620, -303085, -109852, -110260, -11372, 77503, 168850, 116421, -117347, -153608, -79579, 2982, 54592, 55524, -20727, -41732, -55762, -126594, -55485, -22553, -60782, -135930, -163389, -160667, -255130, -126905, 3339, 10914, 118933, 157024, -77429, -60538, 30850, 44061, 87680]
23349H7680p2524o8065k6899l9127L2087j9480j14909n6863J12462J78802K65
23338A3429j03099p4251Q3842J43214P238p065o1214M71j4325p1335R661N0004
23326b3430k0906m5729J9741n8018M7037P453N775J15128P523m6900n8218r9246
23314a49790q3336L5442R2585K8963q9912M9542k1093k1162J18144O4497L830
23303B7710r0947j02932J3899J52821Q9632J07411J6152j90274o2697k2480o4100
23292a25805J932M2857O1778k4596p909R8188J7129m8503m335k0343j05505O5231
23280d9881N7483r676J84600Q0228j23802p0377k776r3415o3894N3262j7715M2145
23268a3818p673j7392j22101L5096J8338N365j4549K1339K418j3564R8226K5511
$$ y = [87680, 15156, -52909, -79808, -118935, -86848, -106328, -221237, -278100, -165638, 13164, 13429, -89670, -163921, -80079, 63135, 70373, 63308, 2094, 2565, -11760, -83095, -73434, -23430, -44336, -90065, -70324, -128342, -81305, -73852, -68077, 47051, 54574, 7674, -50544, -149790, -233126, -197684, -105099, -76136, -166048, -116506, -137599, -158761, -40617, 23880, 27710, -63237, -166169, -152270, 551, 90183, 197594, 213746, 23472, -39225, -61705, -125805, -123873, -81016, -19238, -43834, -51743, 46445, 63574, 15071, 10736, -9607, -115112, -49881, 7602, -2074, 182526, 262754, 138952, 68575, 65799, -27616, -91510, -38248, -55963, -13818, -21491, -38883, -160984, -125888, -107550, -102185, -116734, -95395, -92977, -106541, -8315, 17196]
23256A7196J5545m7216n7823J517L9589q1086P0522J09669J58753J8266n0224
23245A94708L0026j7262j65062J0914l4419j6025m3022p7783Q4820J57935J142
23234A25972j14578j0530q6552l6313L0803R2662p6310Q22p3018P9357O013P4710
23222A3038j07791P3010J19588J6225L1330J2855J5744N0634k7781p0005o2018
23211F4829m7648p782l6441L0615P4407N7904m7032j38176j11679K3951j9857
23200a56909q13l1680J002J23434J36203Q936r2964l547m0689N5771M1485l6534
23188C695l3312P1665O682j24040j09769j6695J21224m994M5045Q4107j7972J1526
23176C7162O2165K1955o077l9793J2575K7433R5255m3075j30385N6191p4959O1128
$$ y = [17196, 32741, -14475, -72298, -70781, -31192, -112278, -41756, 67913, 226666, 244932, 194708, 224734, 207472, 42410, 53324, 18905, 2880, -40142, -117925, -33105, 124830, 125972, 11394, 864, -85688, -122001, -91198, 1464, -74846, -74024, -147042, -67685, -61672, 13038, -94753, -21743, 97845, 114070, 145400, 158255, 173999, 224633, 196852, 126847, 64829, 17181, 9399, -27042, 3573, 77980, 135884, 88852, -49324, -161003, -137052, -156909, -157722, -189402, -188400, -64966, 71237, 80173, -12791, -16338, -57027, -1256, 40229, 3695, -29617, 42048, 48730, -75310, -185079, -201774, -80550, -85544, -40499, 43608, 25636, 37162, 99327, 121282, 115205, 75412, 87987, 115420, 210675, 167600, 37215, 93406, 18447, 79575]
23164G9575k4838M2497J24623m4998j04830J3515r537k0217l9285p0790j7112
23153g1397J79491j9308j10118o5470O128J52738P5997l8070l3695p9905o1203
23142f4812j3694K4343p2773n3583k4090J27631O2306O5465K4830Q903r4919k0917
23130c1310o8216M1217J01831M835m5029K9197n2777l0711o9338J00591P0586
23119E0876Q4499J9848l6015r7081o9800p254j967m6676l3203O7397Q9469o3095
23107d3002m1590L2523J7153n5609o4564p8592K4254J13685O55K9374J16344J23493
23095A74124O7587o8175m1168q4293r8273n0m6226K8792M6519L1934Q5987M1771
23083A38529m0635l2454Q77k1747j4403J6341j16908l5781P1769N6724K9829m1627
$$ y = [79575, 54737, 97234, 221857, 176859, 72029, 85544, 76007, 55790, 16505, -54285, -71397, 108094, 88786, -21332, -86802, -80674, 72064, 148061, 109991, 76296, -3609, -64812, -78506, -54163, -126936, -180519, -204609, -76978, -14672, 50793, 75623, 84526, -10393, -31310, -99526, -58309, 43522, 48357, 3328, 32525, -20252, -50963, -120301, -19710, 50876, 135375, 155223, 119208, 22127, -47673, -54927, -56894, -103570, -136773, -69376, 20093, -43002, -84592, -52069, -34916, -90525, -155089, -233681, -209427, -95742, -95087, -65713, 50631, 174124, 241711, 173536, 132368, 48075, -50198, -50248, -96474, -67682, -21163, 10771, 96758, 138529, 97894, 65440, 66317, 44570, 30167, 46508, -70400, -106181, -34412, 22312, 52141, 10514]
23071A0514j11447K7900j6971j11647J0019M3516R2991J7003n3584n9953J09593
23060d2066q7908J3063J12362J16942j07235r8842J10287J6140l275K3113P8506
23049A31087N9455M1255M0609r8167q6721n8183O9332J04923m5732j21664O816
23038D3010l9102K1381L7158o6167p4663P770J12307J162J26025R0930m7726j08424
23026A03661r1985L1940N9672J572l2537p0796j3628K455L3386r058n3145l634
23014d2097l3708O1008Q5531J14982K8456q9683j95605o4695l4023M0414M8300
23003h1120N1042p2637p4258l117O0211J17923J04334K2457p0564q1897m0600
22992f8226Q3668O599m0600q2705o768O5413r1492r7075J5031J08047k7634o4028
$$ y = [10514, -100933, -73033, -90004, -201651, -191632, -148116, -55125, -38122, -91706, -151659, -42066, -129974, -116911, -4549, 112393, 5158, -93684, 16603, 32743, 29468, 52581, 131087, 190542, 231797, 272406, 174239, 87518, 29335, 98667, 203590, 157858, 36194, 43010, 3908, 25289, 62447, -3720, -78383, -70613, 41694, 42856, 168881, 259811, 212085, 103661, 11676, 43616, 103288, 104860, 72323, 1527, -12101, -9646, 23740, 14682, -38463, -42097, -75805, -14797, 70734, 185716, 214172, 124489, -71116, -135811, -169834, -129420, -81120, -30078, -102715, -176973, -180090, -119879, -1956, 102378, 124835, 54271, -27626, -68226, 15442, 22041, -18559, -101264, -108032, -42619, -134111, -231186, -216155, -108108, -135742, -199770]
22980a99770J04266O8824m9758k081L8112q748J89R3337M3003n3111j52174o0714
22968a78625N8716J27360n0260j8679n4467O9515M8889R7057p3184j19727J5426
22957g7979Q883Q9176n3766q0463M7379q4445L6931P8524K648k8526L2117L0437
22945I16J65149J25179m5142k6543m3374K2809L0930k3235q8567j96843m2183
22934a20904J8059p755P6499J05187P7322r7378n1693n3844J23139J24907L7196
22923B30735j47892j81844l7660N1565J55829k0826k24841l0360J23026o086j941
22912i0295J36032K5330q8664q2805O8410p496l1179J6128k0207k0710m2265n4881
22900a92602J55836O6781Q76m4880Q6767j20735r4172Q2625J23475j171j04653
$$ y = [-199770, -95504, -26680, -76438, -78519, -40407, -49155, -48966, 44371, 87374, 34263, -117911, -178625, -119909, 7451, -42809, -61488, -115955, -46440, 2449, 99506, 26322, -93405, -77979, -69096, 20080, -33686, -114149, -66770, -151215, -114284, -35760, -33112, -61638, -29521, 916, 166065, 291244, 246102, 219559, 176185, 198994, 229924, 206689, 118122, -78721, -120904, -102845, -110600, -34101, 71086, 148408, 51030, -663, -54507, 68632, 193539, 230735, 82843, -99001, -136661, -85096, 70733, 49907, -174934, -205294, -82268, -88354, -90295, 45737, 71067, -17597, -100402, -31992, -39488, -70667, -54539, -74746, -95456, -137721, -192602, -36766, 30015, 30891, -13989, 72778, -47957, -142129, -59504, 63971, 62800, -41853]
22889d1853k9443l254k2666J38058j8341j9383M5985j86918m9398k9818Q0245
22878a36786J17886Q8931n5018r9845R3467J73256J6664j06021m0169L6123J06302
22867A94790k915p7665o9192j38959Q3771P2885p8823j17416M9580q1921L2803
22856a33062Q3367j1950K8948k6274q5152M8325m7577J7465M2548J1994p769r232
22844h8369o9273j8125K3163P0556L0457n2727J14489J78901L2689j07848q6259
22833B7654o7514J9042p2242l936j9113k2131Q5816j4535J46233q042q0357O9607
22821F0482m0712L1496J0291J45436p824j71020l7031n1913j05846J44738R3142
22810G1239j36776J8522L9632p004L9672O7465P302r4891l9100N6169r3621l5460
$$ y = [-41853, -71296, -74550, -97216, 40842, 22501, 3118, 49103, -137815, -187213, -217031, -136786, -18900, 70031, 15013, -84832, 8635, 181891, 198555, 92534, 52365, 88488, 194790, 191875, 114210, 45018, -93941, -10170, 62715, -16108, -133524, -83944, -165865, -133062, -49695, -61645, -32697, -58971, -144123, -95798, -143375, -125910, -83362, -71368, -79137, -88369, -157642, -175767, -152604, -82048, -51591, -104318, 10171, 189072, 221761, 113913, 27654, -39860, -20818, -93060, -96996, -116109, -138240, -52424, -66959, 79274, 71232, -9125, 60482, 19770, 51266, 61557, 206993, 199169, 28149, -8882, -60795, -166641, -21903, 71239, -65537, -47015, -7383, -14387, 25285, 92750, 100052, 5161, -33939, 22230, -71391, -106851]
22798a06851j8400L3331P9862L2965o2457p6068L7925n9712J22370J30277j09476
22787C766p9436L1564o1080j02284J09845J60290j7318R414n1127K4823n4464
22776b6007l0782K6177j3563k3662L1726o1549R0668N5585j40092j58738J37254
22765a12983O6024n7425K1948j1293j7180l9764j11166J7247K27036R2730j5512
22754E9662L1170J4795r1590k1994m959l3219N6732M3493o0946j38345p2747M1302
22742a76646J46023K8711j21427p6546J1516J57566m627q796K4316L4644K4152
22731C8886M4115J29467M2002L9437m2743j28589j88797L9202O5758J0826m2844
22720F720k1635m209p0114Q170o6725M7778Q9113j7726j36930N9233M6529R712
$$ y = [-106851, -125251, -91920, -12058, 20907, -41550, -117618, -79693, -139405, -17035, 113242, 3766, -75670, -44106, -105186, -207470, -97625, 62665, 45347, 54761, 3634, 28457, -26007, -56789, -30612, -44175, -67837, -36111, -97660, -6992, 48593, -91499, -250237, -112983, -46959, -104384, -82436, -93729, -110909, -150673, -261839, -244592, -17556, 75174, 59662, 90832, 105627, 14037, -7957, -12916, -46135, 10597, 54090, -6856, -145201, -217948, -176646, -30623, -1912, -123339, -199885, -188369, -30803, -35430, -44226, -19910, 14734, 38886, 83001, 212468, 254470, 293907, 251164, 122575, -66222, -27020, 38738, 49564, 6720, -14915, -19124, -89238, -81068, -147793, -100015, -10902, -28628, -165558, -106325, -59796, -50084]
22708e0084p3816P1050N6308q1750l6074r370k18493j16955J33772J15271J20316
22697h9825N5153R1736o7347n6791Q311O5194k5236M3880j8280p2504K1640k7137
22685g1206m7238o4314p8318l5474k711J39611J16899p4791r1243P8129J78906
22674D8250J2904q7919j6223J25062M968r244J5623Q154j76384j20573O1742J6748
22662a16892M6245q1876L9763P8138n1424J4403Q6311O2176l66m3796j2166K1519
22650D2035j36861N2333R2942j10905l6689K2813J5581J6912j40070J8494J84801
22639B1386n0053j01351K2040j3743N2567M5659l6194j21220J2137o6998l7390
22628b73160J25173J46143j11022n9506j243R5889Q0526l896p7761P9145K4897
$$ y = [-50084, -123900, -52850, 3458, -78292, -114366, -123736, -342229, -459184, -325412, -210141, -89825, -34672, 57064, -10283, -67074, -58763, 6431, -18805, 25075, 6795, -65709, -44069, -71206, -118444, -182758, -261076, -296550, -299261, -159650, -42751, -117542, -208785, -130656, 48250, 61154, -26765, -42988, 82074, 87042, 77798, 93421, 101575, -74809, -195382, -133640, -116892, -70647, -152523, -112760, -34622, -86046, -71643, 14668, 76844, 76478, 32682, 20516, 42035, -94826, -42493, 50449, -60456, -97145, -74332, -58751, -41839, -181909, -163415, 21386, -28667, -130018, -107978, -121721, -69154, -23495, -59689, -180909, -168772, -235770, -273160, -147987, -1844, -112866, -172372, -173615, -77726, 2800, -1096, -78857, 288, 25185]
22617B5185j46381n4875M5609J8699n8338q5269K0494P0621M4219j914K0972P47
22605a00231P7139R3927M8974j33742O3346R5408k8988l3611L1844k8660j9937
22594F5469L4536J27710O0771j87100j08756m1251L993k1467l2142J5639O1672
22583b0926K3273q1759j1201O6925K6989j5906p1653L3203L3069O2447O56k4963
22571B0154O4208k5562j56175j00601l6063P747K18591K6174L6556O4927Q978
22560A28934p3078o4559p0631N992r328k8419Q2118k2796n4208R7823o70j6490
22548b5312j00993Q5822P0517m9400j06653j4440L3272N0644O1946r1356p885
22537i3838J5303n9024j29719O6295P2919K4942M5631M7419K8485l8309q8335
$$ y = [25185, -121196, -176071, -130462, -111763, -170101, -255370, -234876, -164255, -120036, -121950, -100978, -100231, -23092, 70835, 119809, -13933, 49413, 144821, 115833, 82222, 114066, 85406, 65469, 100005, 227715, 288486, 101386, -7370, -48621, -44628, -66095, -98237, -82598, -20926, 2347, -79412, -90613, -23688, 3301, -12605, -84258, -51055, -17986, 44461, 45117, 20154, 84362, 58800, -97375, -197976, -234039, -226292, -7701, 18473, 55029, 119956, 128934, 55856, -8703, -79334, -73342, -82670, -111089, -28971, -51767, -105975, -8152, -8822, -25312, -126305, -40483, 30034, -19366, -126019, -140459, -107187, -56543, 5403, -85953, -93838, -78535, -137559, -267278, -200983, -128064, -103122, -57491, -10072, 18413, -19896, -108231]
22526a08231o6602J6818J02133P9898Q1256j365p1579k9884j9321J03184Q8870
22515A75177L7919r1813m6346M4530N7025j8870q2566n2482p03L1771p656m8238
22503b252Q9989J6143p7306J3282n3342m2523P7574K4118L1602m1487n1038l650
22491a8890J4383j01662r0733M7509l7039o178O27j192N0345P2928Q5886J6311
22479C2295J21623r1158r7940k2563L5418j1342K2801p4248M0949O1002j35614
22468a18777P46j1389l4600P587P9608R0359R6591j25294K5346J23472k9483j71536
22456f7370j08541O0407O1882p7766K8188K21382J04365o4429j53409M3631m0822
22445G518l8344K4960J8777k6867o486k3425q5413L7589J02387J0861l4316n0605
$$ y = [-108231, -174833, -158015, -55882, 24016, 105272, 103907, 32328, 2444, -16877, 86307, 175177, 213096, 121283, 74937, 119467, 176492, 157622, 75056, 22574, 21871, 53642, 45986, -2252, 87737, 103880, 26574, 39856, -13486, -56009, 21565, 45683, 77285, 35798, -15240, -18890, -4507, -106169, -196902, -149393, -186432, -192610, -191983, -193175, -142830, -69902, 15984, 32295, 153918, 62760, -35180, -57743, -22325, -33667, -10866, -85114, -44165, 16837, -118777, -118031, -129420, -164020, -156433, -76825, 13534, 110125, -15169, 10177, 133649, 104166, -67370, -175911, -115504, -53622, -131388, -103200, 118182, 222547, 158118, 4709, 48340, 7518, -30826, -5866, 12911, -13956, -20442, -43867, -129280, -91691, 10696, 21557, -12759, -63364]
22433f3364j1083K2391M3371J2665q2774M7968n667k273n6236j22568n0352R0603
22421a77319J29326M0010r586j29268m5193R9931J24232q1575r3574n4786J34300
22410f3502J41684m6709p5371j3981o5741J9996n3200K7342N3013J98673J81918
22399C04122j15013k38069M3122L2287n5202N0323O588l1944l33R3524m5049j07162
22387f2806l5363O5050J74565j1746J2616l3165p303k5094o2430k5813L1642r9802
22375g9649p9314J4502L1452j38203J34995J3426L1730J42795M3742j04233q8338
22364g7095L7008q6057p982n5849N3650o420k0656K0846M7435j7824K4139J45698
22352E6893J16123l4492r9930J2036q0604n9228n193j8096r8737P9200J47938
$$ y = [-63364, -74447, -52056, -8685, 3980, -78794, -30826, -36493, -38766, -95002, -217570, -267922, -177319, -47993, -7983, -17569, -146837, -192030, -92099, 32133, -49442, -143016, -197802, -63502, 78182, 31473, -43898, -57879, -123620, -103624, -156824, -129482, -76469, 122204, 304122, 189109, -48960, -5838, 26449, -28753, 21570, 28158, -3786, -4119, 89405, 44356, -62806, -98169, -33119, 141446, 129700, 142316, 109151, 101848, 76754, 14324, -11489, 20153, -79649, -158963, -144461, -113009, -251212, -116217, -102791, -71061, 71734, 115476, 11243, -77095, -40087, -126144, -134126, -189975, -136325, -142745, -163401, -142555, -95120, -112944, -88805, 56893, 173016, 138524, 38594, 50630, -29974, -89202, -94395, -112491, -211228, -132028, 15910]
22341A5910R6524N3670K2451j4513l3300R8577j24615j64958k061p8531q1763
22330b12609Q9439N5615N3702R067o8284k7881l8209Q1892R9164J25553R9202
22319B66651j39431q0629J53175l8853r7124q6355m9500J8689L1863K9105J2052
22308A9643k9329l314o6125j20147j8953J51512J12981N0055o7623O2761M6012
22297A37473m1053q0086L9300M0571n6018K562Q241p1080O4171O6607R8766k3506
22285A85948j66333J5462R9675J1808M329J6259k03019m8766N3415M9790l916
22274A4652m2245O0043k9598r1858l1770r1090P8694R4209k3635j19884p4257
22263b56739J24737l4162l6522j0208L0932L9561r22r5631R9611J28670N7758
$$ y = [15910, 112434, 166104, 188555, 174042, 140742, 239319, 114704, -50254, -52315, -130846, -212609, -123170, -67555, -13853, -4786, -73070, -100951, -139160, -57268, 41896, 167449, 266651, 127220, 46591, 199766, 160913, 63789, -22566, -72066, -53377, -21514, 7591, 19643, -9686, -13000, -79125, -199272, -218225, -66713, 46268, 96323, 28700, 91461, 137473, 96420, 16334, 55634, 96205, 40187, 42749, 50990, -20090, 44081, 110688, 209454, 185948, 19615, 35077, 134752, 146560, 150889, 167148, -35871, -84637, -31222, 18568, 14652, -27593, 32450, 2852, -89006, -120776, -211866, -133172, -38963, -62598, -182482, -256739, -132002, -166164, -202686, -212894, -181962, -142401, -143323, -238954, -139343, -10673, 47085]
22252D7085M940j01500n9056J13432P5620M6418o6644o9295m061J17500o5689
22241C8750l5609O8403Q1338Q1585j2369j35516j09668j19157J6388R7234O2780
22230C4159R0054P0609j48935M47L041k9907K067J3922l9074m7585J3975k5139
22218f2366o6187j25192m245J26323P8429m366J4184n2139Q1476J55j6887P0143
22206C9328m9260j36910l9900L5186J7269Q821N671J24289j362o419J07852J8012
22194A22577J4256p8149m9512L5336P4077K3128n8753j29158J27340J11725K1759
22183B14626j16292K3375r6566r4977j4035r67M6065J30594M7660r2777N9217
22172A05923m693o5445j16171N0572M7012J0577L3896O3977J176m4525p4620o3446
$$ y = [47085, 52025, -49475, -108531, 4901, 80521, 126939, 60295, -9000, -13061, 104439, 38750, 3141, 71544, 152882, 234467, 222098, 86582, -23086, -142243, -125855, -28621, 34159, 124213, 194822, 45887, 46334, 49375, 19468, 21535, 35457, -3617, -51202, -37227, -62366, -128553, -253745, -257990, -131667, -53238, -57604, -43420, -95559, -14083, -13928, -30815, 39328, -9932, -146842, -186742, -151556, -134287, -125466, -119795, 4494, 3132, -3287, 104565, 122577, 136833, 58684, 9172, 44508, 118585, 141713, 82960, -46198, 81142, 192867, 214626, 98334, 121709, 25143, -69834, -83869, -84836, -38771, 91823, 139483, 46706, 105923, 101230, 35785, -80386, -29814, 17198, 27775, 61671, 125648, 126824, 82299, 7679, -55767]
22160e5767m8380j8172l3898R1121L9900K2706J3868n7427k9678M2418k9625o0984
22148a23918J36160L0729m575K4905j1341n5028l4908l053N1665M2868Q9751l9392
22136A03863l0727P9926p665R5676n4794r0531j06579j35427n8617k6045l3214
22125b64134R8436J10012k8613o9856M2591L6179J43655l7697J02436o3619K7280
22114I6670J6946K9675m7088r2513l1177j9754l9405m2093J39868p3127j7184
22103g9182L1945M7064Q8709L9149o3029o3110l2606j3881J24652Q7790k0263
22092A47238p9859j30923L7060Q7664O1698j5508m8573N5382q9640j53708p548
22081a36717p806N0073K9210L4218n0215M2049j2468J20078O6089j15927M322
$$ y = [-55767, -104147, -122319, -156217, -65096, -25196, -2490, 11378, -46049, -75727, -33309, -62934, -123918, 12242, 42971, 38396, 63301, 51960, -3068, -37976, -41029, 10636, 53504, 143255, 103863, 73136, 153062, 145397, 241073, 186279, 95748, -10831, -146258, -204875, -230920, -264134, -165698, -55686, -84299, -154155, -111564, -75385, 68270, 30573, 133009, 69390, 96670, 113616, 143291, 96203, 3690, -27487, -47241, -86646, -128739, 11129, -61998, -79182, -47237, -173, 88536, 127685, 64656, 1546, -31060, -44941, 79711, 167501, 147238, 67379, -63544, -26484, 61180, 122878, 107370, 58797, 114179, 24539, -129169, -136717, -144523, -94450, -65240, -31022, -81237, -39188, -51656, 68422, 134511, 18584, 22906]
22070B2906R0895O4501l8968j03994j5440j3360L2763l7224o1143J7446J6267
22059b5351l281P6174j7832m5096o0885P1577q7994n282n2045j2838R8581M3772
22047b0500J7640J01723m467k9725q363l8674o4118M3905J65488n1834o1614m3174
22035F287O3737M5154j6224o5874p5963r872L3088M5781R1258m6097K6175O6861
22023A64311m2703m4089j35980M1997N0152P2247j4051m0705r9439K6204m239
22012b6295P212p3426J7527J25085L8324l2619n7350n1769K2774R1422k1295o9642
22000c0052o1058r6845J53349O0354o4836r6360J80013P406j19538m7654l1560
21989a46781L3003Q3638l1634n9130K7027M116m130j16242m2259K3765o2667J6925
$$ y = [22906, 113801, 178302, 139334, 35340, 19900, 6540, 39303, 2079, -59064, -41618, -25351, -28632, 47542, 29710, -15386, -76271, -4694, -92688, -97970, -150015, -162853, -64272, -20500, -2860, 98863, 94396, 64671, 56308, 17634, -46484, -2579, 162909, 111075, 49461, 6287, 70024, 115178, 98954, 33080, -42883, -52755, -19667, 26114, 117372, 71275, 97450, 164311, 121608, 77519, -58461, -16464, 33688, 105935, 91884, 51179, -48260, -22056, -26295, -19083, -92509, -74982, 50103, 88427, 55808, -1542, -53311, -30537, 60885, 39590, -30052, -91110, -187955, -34606, 25748, -39088, -135448, 44565, 51971, -67567, -115221, -146781, -113778, -30140, -61774, -120904, -93877, -89761, -93891, -210133, -252392, -228627, -291294, -274369]
21977b74369Q3685J02945k213L7747J16366K1397k3815j45019M184J4302K4779
21966d0011l1444K9993P0497M1117j05250J415J03440M3818K1411q4764j9069
21955C1153n6946J02281J02985o0022N2677p3081r6660L8823N8636m0540l005
21944E6301k0052m5210n7781K7472N8915N1200p5587j18023L390O1399L4206L6742
21932A2972m9506J48864Q7457r7319p2768p9844k5632O1315k9735J6946r369Q7003
21920E0384K1511r5188l9715O8079L9432K9835M8557j32428k453j510Q3691O2854
21908A33049r1478p3568k6149J09062N0769L9891j0731q428Q2640M3217m1496
21897B06778o5885n5957r0311q1659m8612o2573J8469Q3440J15078q231L532k4555
$$ y = [-274369, -190684, -87739, -89952, -52205, 64161, 85558, 61743, -83276, -79092, -64790, -40011, -71455, -41462, 29035, 70152, -35098, -33683, 69757, 113575, 134986, 50222, 31153, -25793, 76488, 179473, 119451, 172128, 99047, 2387, 41210, 99846, 59306, 56301, 36249, -8961, -66742, -39270, 19645, 70845, -4742, -122765, -119375, -57976, -23770, 12972, -36534, 112330, 199787, 102468, 29700, -50144, -75776, -14461, -44196, -27250, -36619, 50384, 71895, -23293, -63008, 5071, 44503, 74338, 122895, -9533, -11986, -13496, 70195, 133049, 41571, -31997, -58146, 50916, 101685, 141576, 130845, 122417, 205057, 248274, 206778, 140893, 84936, -5375, -87034, -135646, -198219, -179750, -96310, 18768, 10537, 14069, -10486]
21885a0486j24836j50320N0978Q1877J41306P6440L1005o0863k7596N7873J75689
21874B41067K6472j17927L395J0390K1555J184r5996j9509K7723k8070n1852m67
21862A7965l4944K8338P1403m7214o8873l4887Q641L5128M2215j51406r410J57163
21850A4119j7196j00168O3883O3786o2980J5204N9880j22991r9740Q5429O8978
21839c1796R9606N5107j04974p1624j7807N6858j13965n0390N8820O5669n1771
21828a06267r1174R9248N3805n8333m9545M5970O3617j10098m5220M9251P7612
21817g1134R4497J37675O8846m7042o2783m6646p7340o1460k6755P698L1178m1099
21805i4365n524N0427o498r1165M2474j2904o2390j4877Q4931j3202O2690M1411
$$ y = [-10486, -135322, -285642, -234664, -152787, -11481, 64959, 95964, 35101, 7505, 65378, 241067, 267539, 149612, 153007, 163397, 184952, 186136, 90140, 70631, 98354, 70284, 18432, 17965, -16979, 11359, 82762, 35548, -33325, -68212, -59571, -24443, 17772, -133634, -143044, 14119, -3077, -103245, -39362, 24424, -38556, -23352, 36528, -86463, -186203, -100774, -31796, 67810, 122917, 17943, -53681, -71488, -14630, -128595, -178985, -120165, -54496, -106267, -197441, -98193, -44388, -102721, -152266, -106296, -42679, -152777, -197997, -148746, -71134, 23363, 161038, 229884, 182842, 120059, 73413, -3927, -65387, -92142, -84444, -53266, -94365, -99889, -49462, -55960, -147125, -104651, -117555, -179945, -194822, -109891, -123093, -60403, -18992]
21793a8992R8800k5262o1468p7343N5234n7315R918m5886k1261m6078m6334J91611
21781d4376J11102m2359Q4458M3757L3057M2741m7044j23048q2183L7002O6459
21770G9566J5698J1651p9583n028J0947J3335M9966p0812j05486p244R296j04547
21758a82241p130J40424L8964O6935M2201r838q4444k0587J7738j7991j7133J31321
21746I8219k1067j1685O6361r3858j07916K4886K7876R4090j1671j25063N2704
21735g124j01147N0226K5189O4216P4448k0373L9482l6560o1223k1060q6266L681
21723g6511k485r2503m4790J10430J67171O3894Q999j38855o0899P7760J02837
21712A15048Q1445j34715j9500o6408O5689J2836j42003j6758l1398M9306J61626
$$ y = [-18992, 79808, 54546, -6922, -84265, -29031, -86346, -76428, -122314, -143575, -189653, -235987, -44376, 66726, 24367, 108825, 152582, 185639, 228380, 181336, 58288, -23895, 13107, 79566, 95264, 106915, 27332, 22304, 33251, 46586, 96552, 25740, -79746, -86990, -77694, -182241, -189371, -48947, -9983, 56952, 99153, 89315, 4871, -15716, 2022, -15969, -33102, 98219, 77152, 65467, 131828, 37970, -69946, -45060, -17184, 76906, 65235, -59828, -7124, -108271, -58045, -32856, 31360, 105808, 85435, 124917, 88357, 27134, 6074, -80192, -76511, -78996, -171499, -216289, -105859, 61312, 125206, 134205, -4650, -65549, 12211, 115048, 196493, 61778, 42278, -24130, 41559, 54395, -87608, -104366, -135764, -86458, 75168]
21701G5168j10822q393K8577M0044o356j9099J42848O095p7877j4467J0722O7777
21689A34217J3036j14273j05182k8669N0001m7528n617n6695m0142K8976j3443
21678a85319o2972Q3356J34679K4573J6345P7711j00327k6177J5475o9578n090
21667i7324j4013k6675P4794j1493m4253O4763J1006n486k6027L4097j6193O20
21655e6184M4494k6026Q182m0179p4284J06837M1337j27144j39705Q6526N2664
21644a23482O6281L2474R1936L7706j26549j05338L0551k5805l4809R5727J54046
21633I2738J07174K0762q7768L7754K4240o8508o7152K8198l5457o9089m9434
21622f6542j7132j31208L0099J47040L8336M4803M890j6456L3016K0495l4479
$$ y = [75168, -35654, -44047, -15470, 24574, 18218, -881, 141967, 148062, 70185, 55718, 66440, 134217, 147253, 32980, -72202, -100871, -50870, -98398, -104015, -160710, -200852, -171876, -185319, -248291, -164935, -30256, -5683, 10662, 88373, -11954, -38131, -22656, -92234, -97324, -111337, -138012, -63218, -74711, -118964, -54201, -43195, -48681, -74708, -40611, -56804, -56184, -11690, -37716, -29534, -69713, -143997, -37160, 4177, -122967, -262672, -176146, -123482, -57201, -24727, 67209, 104915, -21634, -126972, -96421, -122226, -157035, -61308, 92738, 199912, 220674, 132906, 170660, 194900, 126392, 59240, 87438, 51981, -17108, -66542, -83674, -214882, -184783, -37743, 593, 45396, 50286, 33830, 66846, 87341, 52862]
21611E2862L2236p618m2282J1998j29861j00868O6941P9847J7034j963m0041m7174
21599a08889R3300J88685M0552p5910q2993k4895j4226M3385j0091L029j33492
21588h1545j24019N6157P4177M282n4502L4546J39534j8964k7016Q7084n1767
21577C7967j06364p0414Q2978Q656r6617r0080n1898J41541M8894l0418P4494
21566e1261J1202j15513O8743Q3544n0997j1934R9013L2819o2081O4507R7732
21555A65774J01969l7388j18002r7445m8658j00860l487r98q8626M5786J14363
21544f7572J5883o0346L4484Q0569l3304k370q631k9487l0167j6297P1140J56536
21532A10438r4976p5782P4442J24870K9438J4133j20288p1535n2038K2732j3781
$$ y = [52862, 85098, 77480, 35198, 47196, -82665, -183533, -116592, -36745, -19711, -21674, -61715, -108889, -15589, 173096, 213648, 137738, 54745, 29850, 15624, 59009, 48918, 51947, -81545, -205564, -149407, -75230, -70948, -125450, -90904, 48630, 29666, 2650, 89734, 37967, -68397, -138811, -55833, -47177, -143794, -233874, -285772, -144231, -95337, -125755, -51261, -40059, -155572, -86829, -3285, -54282, -66216, 32797, 65616, 3535, 68042, 165774, 267743, 230355, 112353, 14908, -33750, -134610, -138097, -139095, -227721, -181935, -67572, -51689, -112035, -77551, 3018, -30286, -32656, -41287, -70774, -100941, -117238, -46098, 110438, 15462, -60320, 14122, 138992, 168430, 182563, 62275, -9260, -61298, -38566, -52347]
21521e2347o9400p9600j5844R8589R7598j6377p7094j19871O6916P7105O5018
21510b5307N6904J75706Q2569q5100r6347n0408m4572j34890O245j1481P4913
21499e1768N4413j6683M4508R1210n0969j43327l3713M1106l2905j12297J0594
21488a99831J09081k2251o3416q321P348L5956j8538M9866N5260O2219k6836j62692
21476a82155l332J30359l868l6078K8902L2144n0952p5326K4611J64831R7988
21465A27124K9050k4891j44111o4268P0129J52764l3240j44925n4542j3784p539
21454a08233K07256Q9551K5645l6206l9126j34435j66560o7394o2137Q7220J09001
21443i5418J97413j14851o3349k8926L2503N6692m5656O247K044n0150j01065
$$ y = [-52347, -121747, -201347, -217191, -118602, -21004, -37381, -114475, -234346, -167430, -90325, -25307, 31597, 207303, 289872, 204772, 108425, 58017, 13445, -121445, -115200, -126681, -51768, 2645, -14038, 30470, 121680, 70711, -72616, -106329, -65223, -98128, -210425, -199831, -90750, -113001, -176417, -184738, -177390, -141434, -159972, -110106, -54846, 7373, -19463, -182155, -185487, -55128, -58996, -95074, -66172, -34028, -84980, -160306, -135695, 29136, 127124, 156174, 131283, -12828, -77096, -6967, 145797, 112557, -32368, -86910, -100694, -108233, 99023, 188574, 214219, 178013, 138887, 4452, -162108, -229502, -291639, -204419, -95418, 101995, -12856, -76205, -105131, -72628, -15936, -61592, -55345, -53301, -103451, -204516]
21432b04516o2197o1705J01539O0937O12O518J26926M0236k038M0403J03612l6569
21420A13758J5884k5466q7480K6315N6810j58590P3700Q9466M2288j5936K2355
21409A53104J1049p032o4365N1316j51606j05001N5247K5467R3569R9511J1050
21398A72309o3674o2876K5422m5053Q4474r5179R2718M4097P2832J15747O7425
21387D08242O2473q7773K7173P6202N6029o8677j00697j10282j426j9072J08292
21376C50484J52146j6537l4578R4919m6705J4499k3127L3176J37018L7428j64363
21365E34360j49689o5401n1823k0655q6960q0913M7837R6469l7703l9892o1121
21354H4509K4289q3467l4891j0260o2962J14903J67616R6460R269j15131p0743
$$ y = [-204516, -266713, -328418, -226879, -165942, -165330, -158812, -31886, 8350, 6312, 46715, 150327, 113758, 129642, 104176, 16696, 43011, 99821, -58769, 14931, 104397, 146685, 130749, 153104, 164153, 157121, 92756, 144072, -7534, -112535, -57288, -31821, 61748, 161259, 172309, 108635, 45759, 71181, 26128, 110602, 15423, 108141, 152238, 225070, 340817, 408242, 470715, 382942, 410115, 486317, 542346, 473669, 372972, 262690, 261264, 242192, 350484, 502630, 486093, 451515, 546434, 499729, 514228, 491101, 524277, 661295, 698723, 534360, 384671, 319270, 267447, 246792, 159832, 78919, 126756, 223225, 185522, 145630, 84509, 108798, 25331, -9560, -19820, -82782, 32121, 199737, 296197, 305466, 190335, 119592]
21343A19592L8087q3124q0818m6239p03o1202q61m1899K0956R2665K25835k9638
21331A52651Q0162l228r4797j06796j06858m0118l5090J49490N8002L0507K1609
21320A05534q0805m1019l6183k6090r6475N6656O4464L726O4115k6343l7751J4704
21308c5467M6444K4986r9981O1223P9154o3766j27664o0649O3701O2337M5000
21297d682k7012m8585k8457j00632J0700O8038J19161P7009J9324n861j9648N343
21285F4698j7572J7340j68931M012K9967o400n1641J7417K1930k4686N211J16334
21273G679R8976O127m264J4713P667O4589p3006r7063l2706k8999k6568P1444
21261H589M8224m8866k06336j17619Q4613J28551O2218R965j6652L0056K9532
$$ y = [119592, 157679, 74555, -6263, -52502, -53205, -114407, -115268, -157167, -136211, -43546, 182289, 152651, 232813, 229585, 134788, 27992, -78866, -118984, -154074, -4584, 53418, 83925, 105534, 24729, -16290, -52473, -78563, -175038, -118382, -53918, -50192, 13923, -12420, -50171, -35467, 10977, 35963, -64018, -2795, 76359, 12593, -115071, -175720, -112019, -49682, -4682, -31694, -80279, -108736, -209368, -198668, -130630, -11469, 65540, 84864, 79003, 59355, 64698, 47126, 64466, -104465, -100453, -70486, -76886, -128527, -111110, -89180, -113866, -108655, 7679, 106655, 112782, 108518, 123231, 130898, 195487, 122481, 25418, -7288, -36287, -62855, 8589, 56813, 7947, -198389, -316008, -231395, -102844, -40626, -30661, -47313, -17257, 12275]
21250A2275n9255o2947J6195J11997L9021k812M299j10829m9620J01409J33345
21239A33078K2053O6444P91Q5070k13367k45397m9181J62267P5214N6993l6436
21228E7529Q5076J07598j08159q1860o2774j30853L662P4099O3175O4666j4322
21217E7837m4869j28500m7601l222K536N4494L0850P8184O2780r373j2576k14100
21205a73560k7687K204R0211J27370q0950j09528o8136P146J39943R074Q0599
21194c314K2755N2250j19670m9687q0801P3884J47750K3701O7943n4367j0282
21183G0162j9687k8373m4798L8104M1085p6961M3834o131P882k3764k5354N964
21171a8037O113m3850K5633J21264L3242l9396j69096k0994l8993K1722J14083
$$ y = [12275, -46980, -109927, -93732, 18265, 57286, 54474, 58773, -52056, -101676, -267, 133078, 155131, 221575, 222366, 307436, 94069, -151328, -200509, -38242, 36972, 93965, 57529, 142605, 250203, 142044, 60184, -2590, -133443, -129781, -55682, 7493, 72159, 57837, 12968, -115532, -163133, -166355, -163819, -109325, -78475, -291, 62489, 53116, 40540, -173560, -201247, -199043, -108832, 18538, -62412, -171940, -240076, -232930, -92987, -83913, -3314, 19441, 71691, -47979, -97666, -178467, -104583, 43167, 66868, 134811, 80444, 70162, 50475, 22102, -22696, 15408, 56493, -20468, 23366, 17235, 25117, 1353, -24001, -18037, -11924, -55774, -30141, 91123, 124365, 84969, -84127, -105121, -144114, -122392, -8309]
21160h309Q4301K9216K0174m1669j27561j6129l5178L6367N5177N2228o8264n8868
21148g8515l368k4212q1428J94J72906J20224K7437j1048m3037j625l6958N1759
21136I2329m8988k7876n5000m0949J17040p2591j0068O9908o771n8299p6553l2237
21124a50055N7699J00060N6649J03803n0460q2377o1526O3769J9994K5534K2129
21113A05219o9556j18329n0406L9787N6193O7985J7065m2840k1419K4626N4618
21102F2943q3278R387P0261m4137j03822k4682J19223l6688j737N1745M2872m9929
21090A2158n4279J7607M7694m3649Q40j02616N1107O3174J297N4451N3510o9548
21078C1746k3576k7172R273K2664n581l423P5202N497j51p8589r223P5805O0592
$$ y = [-8309, 75992, 105208, 125382, 83713, -43848, -59977, -95155, -58788, -3611, 48617, -19647, -78515, -81883, -106095, -187523, -187329, -14423, 105801, 133238, 122190, 79153, 77528, 40570, 92329, 43341, 15465, -39535, -80484, 36556, -36035, -46103, 23805, 17034, -41265, -117818, -150055, -92356, 7704, 64353, 168156, 117696, 35319, -26207, 37562, 57556, 83090, 105219, 35663, -82666, -133072, -93285, -37092, 30893, 47958, 5118, -16301, 8325, 62943, -20335, -10948, 59313, 15176, -88646, -113328, 5895, -30793, -32530, 19215, 62087, 12158, -42121, -24514, 23180, -20469, -19629, -122245, -71138, -7964, -6667, 47784, 101294, 31746, 8170, -19002, -9729, 12935, 7354, 3931, 79133, 84630, 84479, 5890, -3333, 72472, 133064]
21065A33064J851m1100l4069p0863l2643K3194M198J31019j0686j03765K6290
21054B6490k4420r8554K2195P4605J00063p8138j2159j12516L1395Q8223o2654
21043d5470p5642O3142n2121M8350K27551j1515j04792j00225m2883N9866K16822
21032A83083J3927j13459n112Q238p4756r2073O035N9089L5280j13056J1037R4977
21020A3210Q1616n0493j1520j00775o5666K2185j2226J47214l1826r6385Q3256
21009b1410K02227l2608q0335l7200k05859n3713R6843R1249R364N075j02763
20998a29130p9134R7415O0500Q7857o357J9442l7653r9883j2049k3480l5609K4483
20986a33598R7467L6576K1877K2027J01712l7334J09338p1456n8568J2138k8583
$$ y = [133064, 134915, 93815, 59746, -11117, -43760, -20566, -16368, 114651, 103965, 200, 26490, 2070, -96484, -74289, 316, 100379, 22241, 10082, -102434, -71039, 17184, -45470, -121112, -57970, -110091, -61741, 165810, 154295, 49503, -50722, -93605, -33739, 183083, 197010, 83551, 78439, 86677, 11921, -80152, -74117, -15028, 20252, -92804, -81767, 13210, 94826, 44333, 32813, -67962, -133628, -111443, -123669, 23545, -8281, -104666, -21410, 180817, 148209, 67874, 30674, -175185, -228898, -132055, -40806, -31442, -26367, -129130, -208264, -110849, -50349, 37508, 31151, 50593, 12940, -86943, -98992, -122472, -158081, -133598, -36131, 445, 22322, 44349, 146061, 108727, 218065, 146609, 88041, 100179, 71596]
20975G1596j11097M0991J76701n4595j45914l611P122q3591l0669R3930P3529
20964C4392K8567k1859K0059p6633J2204L405j51385n0140M5270K0475l622K708
20952a36559o2833k1835j3325R4893K7352O9034Q1348Q751m9766n5625k843p873
20940f9281q3461Q0045J08327P5411q7240j72997k7527O0692N2292J55340J9331
20929A10932m879j10576M211j54785P929R2630K58089l2984j49938m0115j5823
20918c5309P0677Q6779m934p9678Q197P9773j21908j9544R755Q0191j0790J21591
20906A84800P2817j56843l3418J06464M934n0825k1395j45411m9715O9299m2866
20895f2159R4547J21710K7010q2634j01600q6028M3804n5199K3727J34968k6531
$$ y = [71596, -39501, 1490, 178191, 123596, -22318, -25929, -18807, -102398, -133067, -39137, 34392, 62959, 41100, 61159, -15474, -3270, 135, -151250, -201390, -156120, -135645, -139267, -136559, -199392, -221227, -234552, -139659, -112307, -43273, 38075, 46826, -2940, -58565, -61408, -69281, -152742, -72697, 35630, 111041, 23801, -149196, -176723, -116031, -63739, 91601, 110932, 106053, -4523, -312, -155097, -147168, -54538, 203551, 170567, 20629, -19486, -35309, 35368, 122147, 117213, 37535, 45732, 125505, 3597, -15947, -6192, 73999, 63209, 184800, 257617, 100774, 67356, 173820, 178754, 127929, 106534, -38877, -88592, -19293, -62159, 32388, 154098, 181108, 98474, -3126, -89154, -45350, -100549, -76822, 58146, 31615]
20884C1615n7909l221O7773n7637o512Q2926n2717r4274j2005L6916J03992K0143
20872E9090n9626Q3393J04999m2894j7561N723j15995j39985m5026l8841Q5551
20861a21172K15587J19714n3396n6135o4883J2470l6437r5518J04845O5882o5343
20850B5614q2119o3689J00473J68991J4087l5950r8642J6462N2904N6956o8887
20839H6200m1472N695p4183O9829q1122q75J9591r3861k5670Q8648m827L2367
20827a9680J10395L8074j60222j23903M0017J15651J39856L8888j24687k0818
20817C3571M7521j24375P567p1624r3933O6721P6307N4251M5075P8268M7871J5168
20805A82388k6557K4999J03857n2235k33595j54395J33359R6197J16408J28183
$$ y = [31615, -26294, -29515, 38258, -19379, -25891, 57035, 4318, -89956, -101961, -65045, 38947, 59090, -536, 82857, 187856, 144962, 127401, 133124, 17129, -122856, -167882, -206723, -121172, 94415, 214129, 160733, 104598, 39715, 52185, 15748, -79770, 25075, 90957, 25614, -56505, -120194, -19721, 149270, 163357, 127407, 28765, 45227, 98131, 155087, 86200, 44728, 50423, -23760, 46069, -35053, -35928, -16337, -110198, -135868, -47220, -52047, -19680, 90715, 128789, -31433, -155336, -115319, 332, 140188, 179076, 54389, 33571, 81092, -43283, -35716, -107340, -201273, -134552, -58245, -3994, 41081, 119349, 167220, 182388, 155831, 180830, 284687, 232452, -1143, -155538, -22179, 74018, 190426, 318609]
20795C18609k6493j48686p0775l3504K7439N8839o6735n108J4817j29474m2752
20784a03823J31084J17207p8281l4324J03896M1598j35560n7805n7641l4534Q1595
20773b6588J05311M8859p7786p1779m992M607Q1391J7702k8201K8498J55476r7058
20761A35440n6886P0279n9481p9826M2484j20688j06778j3779L3575O7097K1152
20750f7411L2663r768J46504R1730P4143k6179j23863j04795j5035Q8655m9052
20739C7592m637m0183k5271p583R751K2367j7843l0277R2555J9910k8133K1883
20727E0131k1390j5233J18262L5651j00256r0950P1989O0112k3713j07912j09423
20716a32732j57750O6768J50646K32101l6787k100q5933n9145J097R533k6075
$$ y = [318609, 292116, 143430, 72655, 39151, 66590, 125429, 58694, 53586, 68403, -61071, -103823, 27261, 144468, 66187, 31863, 135759, 177357, 41797, -16008, -73649, -108183, -26588, 78723, 127582, 49796, -21983, -26975, -22368, 59023, 76725, 48524, 77022, 232498, 135440, 78554, 148833, 89352, 9526, 52010, -68678, -175456, -189235, -155660, -88563, -67411, -34748, -44516, 101988, 193718, 267861, 241682, 117819, 13024, -2011, 86644, 37592, 32955, -7228, -32499, -40082, -30331, -7964, -25807, -56084, 36471, 56381, 28248, 50131, 28741, 13508, 131770, 167421, 67165, -23785, 48204, 108316, 84603, -23309, -132732, -290482, -223714, -73068, 159033, 122246, 120146, 34213, -24932, -23835, -14302, -40377]
20705d0377l3949q154K8076L6028M8452R6748p6001O6059O3024o8344n0757o6988
20693f183p7263j6790q9759L8950q15P6664J51600J0786o0824j0946L4759n0884
20681g05o5422l7005J8345K5838l2169M1273q4198j8754P8462m8922M4655J4386
20669f4216r5562Q2703J41568J2167q2159j26312q3148L7802J14804P210Q8318
20658C3175o2942k0371K9086M0505J01696O7187O6876k1871J16474m6261m7415
20647B56139r1897o0383M3511L7138O8149K5383m8312o1556n9829j5504j8322
20636G4517J1981j06727j48137j0139J7349J45872p471j34586J6472M0131J10616
20625I878N7879k5232j5352o7266j0064m7347P4940q9413n7948P0729J987j7961
$$ y = [-40377, -74326, -82480, -54404, -18376, 30076, 126824, 50823, 116882, 179906, 111562, 60805, -6183, -83446, -100236, -189995, -151045, -151860, -75196, 76404, 87190, 26366, 15420, 50179, -705, -66127, -103132, -84787, -58949, -91118, -49845, -134043, -152797, -74335, -123257, -78602, -64216, -159778, -77075, 64493, 76660, -5499, -131811, -214959, -177157, -62353, -55143, 33175, -29767, -50138, -21052, 19453, 121149, 188336, 255212, 233341, 349815, 303554, 256139, 164242, 103859, 147370, 184508, 252657, 278040, 229728, 168172, 108343, 92839, 74517, 86498, -20229, -168366, -178505, -161156, -15284, -22755, -157341, -140869, -100738, 9878, 67757, 42525, 27173, -40093, -50157, -97504, -22564, -111977, -169925, -99196, -97209, -115170]
20613a15170O8556J18124k335J2892Q4899J9462j7603L9823R111o2860O0365O4780
20601B80044j19647r7121R8027l3132k4976N9380j26864j55401n401P3000K6474
20590b5617j25909k9875P1061R3481O3203l0606j46927r2894P320J19511P9643
20579a7609k0757P4665j7187P8681J33515q1606N7537J26107j16585j25758j64536
20568g3533K9131M824l0138J2659J58455n759l072m6446m1676l1825J03773O0943
20556A37336p0888j362m7093n9385k3295J92747O0095l7060M6464O9832k8534
20545B38857j02889m1705j64355k2610J56001n96M7963r714O0292p743p0722J4909
20533I7688k631m866m3878o1701K0270j31982n0487O5105j7610N3198R002R3531
$$ y = [-115170, -46614, 71510, 69175, 82067, 166966, 186428, 168825, 208648, 217759, 154899, 215264, 280044, 160397, 63276, 161303, 128171, 103195, 162575, 35711, -119690, -125091, -52091, -25617, -151526, -181401, -110340, -16859, 46344, 15738, -131189, -224083, -216763, -97252, -17609, -38366, 36299, 19112, 97793, 231308, 149702, 207239, 333346, 216761, 91003, -73533, -44402, -39578, -69716, -57057, 101398, 95639, 92567, 46121, 4445, -27380, 76393, 137336, 66448, 65086, 17993, -41392, -64687, 128060, 188155, 151095, 197559, 267391, 238857, 135968, 94263, -70092, -92702, 63299, 62703, 110666, 100952, 161244, 153501, 82779, 97688, 95057, 90191, 46313, -15388, 4882, -127100, -177587, -112482, -130092, -76894, -67892, 25639]
20521B5639o8456q7550J9206K05552l7733n3027j2600j7343m7834J6316P5794
20510A7964M9104j42767L2673K7194J9539l3059P0584O633n3820L3252K1002j1951
20498C6348j5883J1165J2104j169P7658o2935q1004O9533J03762P4342m8064l3758
20486A42099m2999j5445O399k0030O697K792n6148m0353N4001O5050l0018k2699
20474D9346j10066j36317R3789J72062l9839j0728k8960J6851l376K6261l6978
20463g955j08103j17290J07149J02642Q8546m7983n6794k8151J32357k5825m8047
20452i454m9598N0444J18062O9288J6778m1873p1238P7365l9381j40978K06643
20441A86058J36615o5963K7671p5997j13784K6046O406O7803J14542j1464p2051
$$ y = [25639, -42817, -130367, -111161, 94391, 56658, 3631, -8969, -26312, -74146, -57830, 17964, 67068, -75699, -43026, -15832, 3707, -29352, 41232, 47865, -5955, 27297, 48299, 36348, 20465, 31630, 43734, 42565, 120223, 57288, -23716, 45817, 149579, 223921, 175857, 142099, 99100, 83655, 90054, 70024, 76721, 79513, 23365, -16988, 37013, 102063, 72045, 49346, -60720, -197037, -103248, 68814, 28975, 18247, -10713, 6138, 2762, 29023, -7955, -116058, -233348, -126199, -23557, 64989, 17006, -39788, -67939, 64418, 38593, -9454, -59052, -8608, 109454, 178742, 195520, 153647, 82409, 159774, 120393, -20585, 186058, 322673, 256710, 284381, 208384, 94600, 120646, 127052, 194855, 309397, 297933, 225882]
20430B25882J7575n844l9620N7983M3659q8442j04337j15200J1756J07770J29120
20419B40302J4039o7086m4951m7274n1633p394j22674j6996M7794n1325N9635
20408d7563K13688K428J7561l5710j6422l8553p0466o5193K4344K746L0015K8031
20396D4906r8094j3865m4423k1942J1739k5079J02531O9064N9569M9618r4542
20385C9482l3266m0584k3362m6164J76300J41708M4341L8026j11476j43763m9208
20374g966M8212O6792O2498J2625r7799m4519Q6832M093n0669O505O2056j12178
20362C6482j59607l6707J04203K2745J16109J15139L5873J6105j15865p2446O3043
20351A25074R5429m3996j28884p7793j962L98k2145R5569J09153n4144o8615j9530
$$ y = [225882, 243457, 237613, 197993, 255976, 299635, 211193, 106856, -8344, 3412, 111182, 240302, 254341, 187255, 142304, 95030, 43397, 36003, -86671, -103667, -55873, -107198, -47563, 166125, 168553, 186114, 150404, 133982, 95429, 24963, -40230, -15886, -13140, 16875, 44906, -53188, -67053, -111476, -133418, -121679, -146758, -44227, 24837, 84406, 134024, 39482, 6216, -34368, -57730, -103894, 72406, 214114, 258455, 296481, 185005, 41242, -7966, 40246, 107038, 169536, 182161, 84362, 39843, 126675, 130768, 80099, 86604, 148660, 36482, -123125, -159832, -55629, -32884, 83225, 198364, 234237, 250342, 134477, 62031, 125074, 220503, 176507, 47623, -30170, -32132, -31734, -53879, 41690, 150843, 96699, 28084, 8554]
20339H554K7465R9544k1739j9557m9423N5932J8577R5332p282q4608k42481j28343
20327b48029Q2380J54429R6729m3879P1414R6169M3224j90869j73961O203K00414
20316I4224J01896j00788j56165J2093K1917N983k939Q913O8682J7206P0491p080
20304A34433K4846N3341o0075K0712Q5423j5554N0781q1477R5468N0346j45314
20293B12930m5083N2603P3531o2252j52469j8438k4362J2988r7266R3960j6482
20282B9660l1266k7486J7760m0350m9406j22522j10391O2389J39480J27614J01578
20271I7060J12889K8244P3222M8141j24078j09291r5670j9063r159L7173Q7042
20260A26510j25807n4559p3017r379J07866Q3826O3207l6921n9701Q3152J0702
$$ y = [8554, 36019, 135563, 113824, 94267, 44844, 100776, 119353, 214685, 207403, 122795, -119686, -248029, -165649, -11220, 85509, 41630, 113044, 209213, 252437, 61568, -112393, -106190, 94224, 196120, 95332, -60833, -48740, -26823, -20840, -23779, -14866, 53816, 71022, 141513, 134433, 159279, 212620, 152545, 173257, 258680, 243126, 293907, 212430, 307898, 358244, 212930, 167847, 220450, 293981, 231729, 79260, 60822, 36460, 49448, -47818, 46142, 29660, -1606, -29092, -11332, -51682, -101088, -223610, -334001, -271612, -132132, -4518, 97060, 209949, 238193, 311415, 359556, 235478, 126187, 30517, 11454, 2295, 39468, 126510, 703, -53856, -126873, -136252, -28386, 55440, 118647, 81726, 22025, 105177, 115879]
20249A15879o3376j08678o5870J1986R3028L1103R6441K11745P0036j01374p7367
20238B13553j29547k5248j22339K3946P2222K0603J46556k1078m3454n1467j82338
20227i8591j0980J78006L1452L5197O2959Q3704o4714n436k1207k2803n9918j4243
20215I3426l6094M4540Q6694j1132p8280O4308K7660j6194N2026l0309o542K3346
20203B13449j08508l8730J0624n899J2911J3062l649M5642P6691o5616r1430j74
20191E8373Q8453J3063m7644j57887n1421J14960M3204J02083N0871j62819j83716
20180a32480j06969R8067N3332m321o21O7062N223k8379J06828J99947L1778r9792
20168A89675j55144j08524p88J42952Q4861m7766k8643r132o8256j0259J06465
$$ y = [115879, 52503, -56175, -122045, -110059, -17031, 14072, 110513, 322258, 392294, 290920, 213553, 84006, 58758, -63581, -39635, 32587, 53190, 199746, 178668, 135214, 83747, -98591, -109571, 68435, 99887, 135084, 198043, 281747, 217033, 211597, 190390, 167587, 107669, 93426, 57332, 101872, 188566, 177434, 99154, 163462, 191122, 174928, 226954, 196645, 190103, 213449, 104941, 66211, 76835, 70936, 83847, 96909, 93260, 138902, 215593, 149977, 58547, 58373, 146826, 159889, 112245, -45642, -97063, 17897, 61101, 163184, 214055, 51236, -132480, -239449, -141382, -88050, -92371, -92992, -25930, -20707, -49086, 57742, 257689, 289467, 189675, 34531, -73993, -74781, 68171, 153032, 105266, 76623, 67491, -765, -11024, 95441]
20157I5441L0263L8481p6953K1966P9060j8756K3520k2018Q7195L4942l8934j06110
20145A48097p2241q1039n312K00678J90092M3740J0564J14576L41867K05821K870
20134A099713N3740n9083o5221M1870j24610j72848j32114r7825J001q0886q5149
20123C78588k4337P6697J37159K35160J48379J51151J37305K397m1692O642K2278
20112A229727j61081k52068k46453k29231m4312j0794L7652l1352j07004R5122
20102B80206L1256r146q5812j28888j11385L2473M5117Q8562k2406R0748L4355
20091B45080o7437j04183N632J01913m1273n1494m7584M2996J6448q907K887j4171
20079G9907L2863N3347m7539N1537m3073L1227L4439n9236r7380n319J5852L5782
$$ y = [95441, 125704, 164185, 87232, 109198, 188258, 169502, 193022, 171004, 258199, 293141, 254207, 148097, 75856, -5183, -10495, 190183, 380275, 424015, 434579, 549155, 891022, 1096843, 1099713, 1153453, 1094370, 1029149, 1071019, 946409, 773561, 641447, 543622, 544623, 463737, 378588, 354251, 430948, 568107, 803267, 951646, 1102797, 1240102, 1242499, 1200807, 1207449, 1229727, 1068646, 816578, 570125, 340894, 296582, 285788, 323440, 292088, 185084, 280206, 311462, 302316, 216504, 87616, -23769, 8704, 53821, 142383, 119977, 210725, 245080, 177643, 73460, 79092, 181005, 139732, 88238, 40654, 83650, 100098, 91191, 94078, 79907, 112770, 166117, 118578, 170115, 127042, 158269, 192708, 133472, 36092, 30773, 46625, 82407]
20067H2407N9088J0319o4165l7019k9181J00285k655o9635M0166N1430j2211j05122
20055B3707K4740Q2059O0064o8078O1618K8685m6487K5905k1199L0334m4935k1110
20043A35303j46646n4627R3059J72562l169k75n9112Q7646P0580M5391N0699q3777
20031C07634o9043j8995K3466r5637j32103N0431o8810p1417J6195Q2072l610
20020B0183q9423N7105P6552M3408O1115l9986m6441L268N0486m47j17200j61411
20008a42791J00323J84558R6370O719r995q2282n4072M777Q0828L3157k20955
19997c363o893J24195N408R9015J69916Q1568j81027q7450p2757o3334q1688O6469
19985E0059R3543M6979K6767j6827Q7301L7644l377j97462j8304R8057k2339o1358
$$ y = [82407, 141495, 151814, 87649, 50630, 21449, 121734, 119079, 49444, 89610, 141040, 128829, 23707, 48447, 130506, 190570, 122492, 184110, 212795, 166308, 192213, 171014, 201348, 156413, 135303, -11343, -65970, 27089, 199651, 196482, 196207, 137095, 224741, 295321, 340712, 391411, 307634, 238591, 219596, 243062, 147425, 15322, 65753, -3057, -74474, -58279, 23793, 20183, -69240, -12135, 64417, 107825, 168940, 128954, 82513, 85781, 136267, 135820, 18620, -142791, -42468, 142090, 238460, 245179, 235184, 152902, 98830, 103607, 184435, 217592, -3363, -10256, 113939, 119347, 218362, 388278, 469846, 288819, 201369, 128612, 65278, -16410, 50059, 143602, 190581, 217348, 200521, 287822, 325466, 322089, 124627, 106323, 204380, 182041, 120683]
19973A20683O1353n2865j04649p2684J62240j6605k1949p2673m9340k5260J51987
19962H0238M6481n3899j34994L3947R8308J1802R0480O8944j44911j03080m3314
19951d9998J03442Q8543O7784L1428j298n686j27084M263O1202m0112n2696l7558
19939D2230n0698m0282j29263q0063o5645J05875P3007J43773N4352l5077j29247
19928a11038L7475J68899k3357K0649l3451k7727L220j7621O1651j5741l0046
19917C2913j18125Q3249N5082J04152L1742j24922K8207K03328j720l8593r3117
19906A62196n9313J14424k6849n0535K9727n5804n2145J8890N072J29091J5410
19895B30164q7233n0031m85L0061j2179L0216M6458n8037r4890J58442K35846
$$ y = [120683, 182036, 129171, 24522, -48162, 114078, 97473, 75524, 2851, -46489, -71749, 80238, 126719, 72820, -62174, -28227, 70081, 81883, 172363, 241307, 96396, -6684, -49998, 53444, 141987, 209771, 241199, 239901, 234215, 107131, 111394, 172596, 132484, 79788, 42230, -8468, -48750, -178013, -258076, -323721, -217846, -144839, -1066, 53286, 18209, -111038, -73563, 95336, 71979, 92628, 59177, 31450, 34670, 17049, 78700, 62959, 32913, -85212, -1963, 53119, 157271, 189013, 64091, 92298, 295626, 293906, 255313, 162196, 102883, 217307, 190458, 139923, 169650, 113846, 61701, 80591, 85663, 214754, 230164, 142931, 92900, 92415, 122476, 110297, 140513, 186971, 128934, 34044, 192486, 428332]
19884D28332q7828l5796L7657q3484j65934m6270L8088N124p8251P8128O4610
19873A54376P2191J2668o1898k0169j1078M1560M1040O5685l1601Q2183J4391
19862C59348p2781j63279j31315K8414R4951N9587l4564J2400J22889J26671j7020
19851C85301m2016J041r8761L2271l089o0315j5165N5422N0197L2267o9829j55312
19839A12012K3044Q6525P4936Q6097J14842j2592n5576L1036j07687m0106p066
19828C05465l8463J00839o3649j40003N518R1381M0682K5272J43847N1144J17138
19817F39171p1010o1627j14379j75277j23919J67296P2667r0682j07062j1841
19807A23337J93901P792P562l8416R1526J1067r130o9375J6865N7559n6467L5520
$$ y = [428332, 340504, 304708, 342365, 258881, 92947, 46677, 84765, 89889, 11638, 89766, 154376, 226567, 239235, 177337, 157168, 146090, 187650, 228690, 294375, 262774, 344957, 359348, 286567, 123288, -8027, 20387, 115338, 174925, 140361, 152761, 275650, 402321, 385301, 343285, 344326, 245565, 277836, 274747, 214432, 199267, 254689, 304886, 337153, 267324, 112012, 135056, 221581, 296517, 382614, 497456, 484864, 429288, 460324, 352637, 312531, 305465, 267002, 367841, 304192, 164189, 169707, 261088, 301770, 327042, 470889, 522033, 639171, 568161, 506534, 392155, 216878, 92959, 260255, 332922, 242240, 135178, 123337, 317238, 325030, 332592, 294176, 385702, 396769, 387639, 318264, 335129, 392688, 336221, 371741]
19795C71741M2145J5070O942l4062k398l5277n6771Q2001P47j20190N1586L4692
19783C56226l9263k26N7333r3445j9068r303M4799K5454o0118k6392M6537K2942
19771C05476o7j4481J07701J19250M3314m1555r831q217j65278L7639P3188l0800
19759D16339M2321q4574r1201K0677J2250R591n8174j20590m9186J17402J99066
19748D13921M7991m9037n3111N6986J93500J49420P3653o7329n4704l2734k24254
19737D54302r9810N4612L5852L9877l5334r3935L126O3736J12179J44719K4652
19726G03976o419l8116p0441P310K758k4827K6395j49428r0113J47325K6182q3166
19714D51436p4977J7314m6044M7307K3836R5820K23546O9590J40401j16677j65303
$$ y = [371741, 413886, 428956, 435898, 401836, 399438, 364161, 307390, 389391, 390138, 269948, 321534, 356226, 316963, 316737, 374070, 280625, 261557, 252254, 297053, 322507, 262389, 235997, 282534, 305476, 305409, 290928, 398629, 517879, 561193, 519638, 509807, 501590, 336312, 373951, 447139, 416339, 458660, 374086, 282885, 303562, 315812, 325403, 267229, 146639, 97453, 214855, 413921, 461912, 412875, 359764, 416750, 610250, 759670, 833323, 765994, 711290, 678556, 454302, 354492, 409104, 444956, 484833, 449499, 355564, 358690, 422426, 534605, 679324, 703976, 697557, 659441, 589000, 596310, 599068, 574241, 600636, 451208, 361095, 508420, 534602, 451436, 376459, 393773, 347729, 395036, 418872, 514692, 738238, 807828, 948229, 831552, 666249]
19703F66249k2645N3549n2983n8674n4732p884J61004o217m9938K1862N7480J44231
19691H51302J24728O5414J24363J58l7924j28611j19270j55033j43475j52499
19681D29153k0258K31424L9231P749J17191O8014Q3544Q8062K72715N9909k38297
19670A138437k14456k0594L6444j59081P261Q4196k7036J7193K395P5653Q5065
19659A025477Q3953L6592o472j1347P1963Q6264P8917J59049J66882K0014K1974
19648A733266N6896J0287J30591J22758M1165j03819Q739O8688P517m4752L4876
19637B066212O9420q416n1508M5989R4549R967J73568J02443q9780j19855j3598
19626B278991P7962J03149K0656J62359J19891L0606J06712L47533M25922M61369
$$ y = [666249, 643604, 697153, 644170, 585496, 530764, 522880, 683884, 677667, 627729, 649591, 707071, 851302, 976030, 1041444, 1165807, 1165965, 1128041, 999430, 880160, 725127, 581652, 429153, 408895, 640319, 679550, 687299, 804490, 872504, 956048, 1044110, 1316825, 1376734, 1138437, 923981, 903387, 939831, 780750, 788011, 872207, 845171, 862364, 864759, 940412, 1025477, 1109430, 1146022, 1139550, 1128203, 1200166, 1286430, 1365347, 1524396, 1691278, 1711292, 1733266, 1790162, 1800449, 1931040, 2053798, 2094963, 1991144, 1999883, 2068571, 2076088, 2031336, 2066212, 2135632, 2127216, 2075708, 2121697, 2216246, 2226213, 2399781, 2502224, 2412444, 2292589, 2278991, 2356953, 2460102, 2480758, 2643117, 2763008, 2793614, 2900326, 3247859, 3673781, 4135150]
19616D135150J68515P4079J40849K32017Q2453Q7247j7535N6804K50559K96394
19606E506532N78752O54238N12784P29992R31012R90426J303195J183773R90978
19597A3381682R95025J182564J756578K216104K734247L534327N144953P766563
19589C8712043J2117475J9049463K9691928M1878665M2587286J7858998n294960
19582A96600898k746731J1952171R463591j9688966l9913597l8133030k7244354
19575I0289982j6671841r180484l487488J666737P268109J4683505K5489119L8851531
19567A48909170M3237636K1124127o212441q114463O218299Q662238j7228874
19560A96595692m0734124m1928452l1869166k1231827j3975373r475560o487721
$$ y = [4135150, 4303665, 4377744, 4518593, 4750610, 4833063, 4920310, 4902775, 4959579, 5210138, 5506532, 6085284, 6739522, 7252306, 7982298, 8913310, 9903736, 11206931, 12390704, 13381682, 14376707, 15559271, 17315849, 19531953, 22266200, 25800527, 30945480, 38712043, 50829518, 69878981, 99570909, 141449574, 184036860, 201895858, 196600898, 193854167, 205806338, 215269929, 195580963, 155667366, 117534336, 90289982, 73618141, 64437657, 60950169, 62616906, 69885015, 84568520, 110057639, 148909170, 192146806, 213270933, 207058492, 198944029, 205162328, 213824566, 196595692, 155861568, 113933116, 82063950, 60832123, 46856750, 37381190, 30893469]
19553C0893469m554762l264240k653865k204897j785550j362123r68253j083800
19545A3015979j316281j325624j004268p12031q28634p83343p90643o25120m42663
19536E187372l05549j78441m360J58292k2359j85652k56571j66491L5004k32159
19526D029086m88239n39866k73155j49227k63108j79400j39959j98904j24536
19517A672692J1742n6844n2058K443N7160m4043q5311n1280J9763l9762r4143
19506A340359l0245P3301J64220J05770m2004j23595j10771j62785m8453p0400
19496A095397m1262K2503l5068o1702J67158K06627k1728j18842o6644q9761l9730
19485A016948l2415j89971l4888J15220j7563m3154r0254p712k1794P9384n8784
$$ y = [30893469, 26338707, 23074467, 20420602, 18215705, 16430155, 15068032, 14099779, 13015979, 11699698, 10374074, 9369806, 8657775, 7829141, 7045798, 6255155, 5630035, 5187372, 4881823, 4703382, 4699022, 4857314, 4834955, 4649303, 4392732, 4226241, 4261245, 4029086, 3540847, 3000981, 2727826, 2578599, 2315491, 2136091, 1996132, 1797228, 1672692, 1684434, 1627590, 1575532, 1577975, 1635135, 1591092, 1505781, 1454501, 1474264, 1434502, 1340359, 1310114, 1383415, 1547635, 1653405, 1611401, 1487806, 1377035, 1214250, 1165797, 1095397, 1054135, 1076638, 1041570, 979868, 1147026, 1353653, 1331925, 1213083, 1146439, 1056678, 1016948, 984533, 794562, 759674, 874894, 857331, 814177, 723923, 716211, 694417, 773801, 715017]
19474G15017j22594p0785o8823P9565K8227J2780K160L382R5100P5495r5906o9106
19462E84512P0409J8289m6570n2044J40114K03512J56952J3035j20097Q7740O2492
19451A118344L9946K2958n1985j09316r3270p5542J11182J62075J61984N0723
19441A337099j57900O4350L791r4193j37691j39207q1254j11913k2775n9803N168
19430F05672k7696J4569K1002M4085J27586M5027k7766j07758j6132q7726P7889
19419F68752k8372j09257J2041j17005L7899Q7107n4453p7120N4815O783L753
19408D84943P2244L293q5526M8531K3473Q8593J05774J07321J78378r5946j60831
19397G70247o315j8875q6835o0320L428m1010m972n5435M2503J34876l660q2070
$$ y = [715017, 592423, 521638, 452815, 532380, 560607, 573387, 575547, 578929, 674029, 749524, 653618, 584512, 654921, 673210, 626640, 574596, 714710, 918222, 1075174, 1088209, 968112, 1055852, 1118344, 1158290, 1181248, 1129263, 1019947, 926677, 851135, 962317, 1124392, 1286376, 1337099, 1179199, 1243549, 1247340, 1153147, 1015456, 876249, 794995, 683082, 660307, 600504, 605672, 577976, 592545, 613547, 657632, 785218, 830245, 802479, 694721, 678589, 590863, 668752, 640380, 531123, 543164, 426159, 464058, 551165, 496712, 419592, 474407, 481190, 484943, 557187, 560480, 474954, 523485, 546958, 635551, 741325, 848646, 1027024, 931078, 770247, 763932, 745057, 658222, 597902, 601330, 560320, 555348, 499913, 542416, 677292, 673632, 591562]
19385E91562n7614r7946j00193N7153J73772R764j49035k9213R8625M8452P9346
19374F24673k5647k3854L3521q0437k24146K9985Q9631r9286n5332Q6394O6844
19363D22346K3788r5777j1379J26559P7285p7670N5212m2492o180N4056J12177
19352F37925O6263l5753n8224r3711R6533j7135P9374N8921n2518r817J53059
19341H24917J8739k9590k4419j34309O5150L9258j04769j63994j14965n720K04031
19330E74329Q6756j6286K7537P8149n5852j79058j08451k2450J8400j6910K8895
19319D15059k6241Q2686N5575P8405r9424j38940j08843J0065N9229P3728k0143
19308C81156j7079l3467k2197J0434J30332L3637O0495J19135J6508q1223M7499
$$ y = [591562, 533948, 436002, 335809, 392962, 566734, 576498, 427463, 398250, 496875, 545327, 624673, 599026, 575172, 608693, 528256, 304110, 334095, 423726, 324440, 269108, 355502, 422346, 446134, 350357, 338978, 465537, 542822, 465152, 520364, 477872, 471692, 525748, 637925, 704188, 668435, 610211, 516500, 613033, 595898, 675272, 734193, 681675, 671858, 824917, 843656, 814066, 789647, 655338, 720488, 759746, 654977, 490983, 376018, 370298, 574329, 661085, 644799, 672336, 750485, 694633, 515575, 407124, 384674, 403074, 386164, 415059, 388818, 471504, 527079, 605484, 506060, 367120, 258277, 268342, 327571, 401299, 381156, 364077, 330610, 308413, 318847, 449179, 482816, 543311, 662446, 678954, 597731, 645230]
19297F45230q5395j61685P208J56116J04480O9384J72641N7425j54567r4552R865
19286G26150J9060Q6328r7149j58767m9921M0377j5440Q4312r0616j37650l1393
19275C75291n3908R3416J34080P8681j2989m6209J02179n9615p9259J06379J01357
19264G39403j7730P0408j43250k06757L2133J15269R0274J61050r3948l6937K1151
19253G31066J56313k1136k0147j235q8683N4773n28K9920n6949P1135N4751q3735
19241H25545J9157L5425N8245K0565p6691k265p3970M2997M8624J9347j6393M4479
19229I45065j00545P4785P5125P1438J70329J3718j29750j1294Q3283O6753J66511
19218A425418J61181O491K1888j06430n2776J48530O1056N357j12309n0896l8214
$$ y = [645230, 559835, 398150, 405358, 561474, 665954, 735338, 907979, 965404, 810837, 716285, 726150, 745210, 831538, 734389, 575622, 525701, 566078, 550638, 634950, 544334, 406684, 375291, 321383, 414799, 548879, 627560, 614571, 568362, 670541, 610926, 531667, 638046, 739403, 721673, 792081, 648831, 442074, 474207, 589476, 679750, 840800, 746852, 709915, 731066, 887379, 866243, 846096, 844861, 756178, 810951, 810423, 840343, 783394, 854529, 909280, 825545, 844702, 880127, 938372, 958937, 882246, 879981, 806011, 849008, 897632, 916979, 900586, 945065, 844520, 919305, 994430, 1065868, 1236197, 1249915, 1120165, 1108871, 1192154, 1258907, 1425418, 1586599, 1593090, 1614978, 1508548, 1455772, 1604302, 1665358, 1670715, 1558406, 1507510, 1469296]
19207A469296M5806R1660p1331P5551L9007K333r0468K5610J26365N9047J33071
19196A905947K09624J2768k240N7399R947o5132j38634J1890J62870J26092J81479
19185B472010L68754K85942J42503J52262P3786J42471L21739M70933M05420L73050
19175E208870N55362O04813N88776M24426K27597J27662J0054K15576O87172J021355
19165I671663J065964J110614J036523J155374J472678J932588K572685L577178
19157B3595267N445072Q707833J4007290K0346979K2191897J8801084K1355799
19150A34451221L0884869L7393849J8687213k3063760l9854012l0786966j2818603
19143A14893811N968577K6529394N1995689P3332502N2872223r483354n0414798
$$ y = [1469296, 1515102, 1606762, 1535431, 1610982, 1649989, 1652322, 1561854, 1587464, 1713829, 1772876, 1905947, 2115571, 2128339, 2126099, 2183498, 2193445, 2128313, 1989679, 2001569, 2164439, 2290531, 2472010, 2840764, 3126706, 3269209, 3421471, 3495257, 3637728, 3959467, 4430400, 4835820, 5208870, 5764232, 6369045, 6957821, 7382247, 7609844, 7737506, 7747560, 7963136, 8650308, 9671663, 10737627, 11848241, 12884764, 14040138, 15512816, 17445404, 20018089, 23595267, 29040339, 37748172, 51755462, 72102441, 94294338, 113095422, 134451221, 165336090, 202729939, 221417152, 198353392, 158499380, 127712414, 114893811, 120862388, 147391782, 199387471, 272719973, 325592196, 316108842, 265694044]
19136B65694044n4207442m1512780l4676225l0399453k2583200j4065270o893542
19129F1356132p42196N309589J0365235R210794j914685j2546258j4571831j1557776
19121D4909004p719760m826208k930619j796761j216516o81071j82247O09260
19113B6165082J489098K246819L418490N531842R059231J4941899K2664537K7411132
19105A12928130K2050402R403842l556839n114530K491327M637999J649992P629504
19097A52119827K7663445N4098317N2534117Q901240j1575028j1194253k0687813
19090B51859852j9235753m631994J3692972K2677506r232005n0976802n7391273
19083A46762503m3357276k7470639j7299082j1334882p523154n089404l019172
$$ y = [265694044, 211486602, 169973822, 135297597, 104898144, 82314944, 68249674, 61356132, 60613936, 65923525, 76288760, 85499554, 83584869, 71038611, 56466780, 44909004, 37189244, 32363036, 29432417, 27635656, 26419140, 25738069, 25555822, 26165082, 27654180, 29900999, 33319489, 38851331, 47910562, 62852461, 85516998, 112928130, 134978532, 144382374, 140825535, 135711005, 138202332, 142840331, 144490323, 152119827, 179783272, 233881589, 286415706, 295316946, 283741918, 272547665, 251859852, 232624099, 227992105, 241685077, 264362583, 255130578, 204153776, 146762503, 103405227, 75934588, 58635506, 47300624, 39777470, 34688066, 31668894]
19076C1668894j086240J079419L342450L748049l38906n441713o738061n627867
19068B0606025l926061k594308k056579j573813j076953p62433n77893n93565
19060G444420o25551o97209n75674n77317n26559l96417k78340k04811j49096
19051C413446k08320k66773j69707r4630j47634r8714j28773m1398j41690j69568
19041A946239k4678m1967J7790K7832J36458K59377K73731J37332l9148j45040
19031B547926R4123K21422M7967o6331j84989k30683j49890j46139r9004p1187
19021A963215o7902k16849q2335o6802n0093N0665r3239q5080p3391M7414J98831
19010A524434K55622L11421N5122j68030j94411j35640K743o6285q5291j46537
$$ y = [31668894, 30582654, 31662073, 35004523, 38752572, 38413666, 32971953, 26233892, 20606025, 16679964, 14085656, 12029077, 10455264, 9378311, 8615878, 8037985, 7444420, 6818869, 6121660, 5545986, 4968669, 4442110, 4045693, 3767353, 3562542, 3413446, 3205126, 2938353, 2768646, 2674016, 2526382, 2427668, 2298895, 2257497, 2115807, 1946239, 1921561, 1879594, 1897384, 1925216, 2061674, 2321051, 2594782, 2732114, 2692966, 2547926, 2642049, 2863471, 2911438, 2845107, 2660118, 2429435, 2279545, 2133406, 2034402, 1963215, 1895313, 1678464, 1596129, 1529327, 1479234, 1529899, 1436660, 1351580, 1278189, 1325603, 1524434, 1780056, 2091477, 2146599, 1978569, 1784158, 1648518, 1651261, 1584976, 1499685, 1353148]
19000A353148j68354q4774N997j01554j52030M6312m320q7899j25451M9282O3059
18989G93416m6702j2508N4985j8509n2975m3627K6545L9512k6316p0570M208m1736
18977F05723Q3794R0614j41720p6623O1224j01428J2027K8330j9804J39888J98122
18966H80147J1520J8183O2677J35356M1569k05651k77718m1048P0848j00144n1575
18955E44164j53008l4491J1441k8729N7591J0813R8102M799K7770R6795m5927
18944E89320n7748O2868r5713P0334J82649p7306n4501j9254J8340J04681m1359
18933F82311J6932K58343J88114K52770j0551q9473j13590m8414j05715l6886
18923I93841R687K12057K7423K6791N6502k0944j45611j43332j32480j1116M6731
$$ y = [1353148, 1184794, 1100020, 1106017, 1004463, 852433, 898745, 894425, 806526, 681075, 730357, 793416, 746714, 734206, 789191, 770682, 717707, 674080, 700625, 740137, 713821, 643251, 647459, 605723, 689517, 780131, 638411, 561788, 623012, 521584, 533611, 561941, 542137, 682025, 880147, 891667, 909850, 972527, 1107883, 1149452, 943801, 666083, 625035, 695883, 595739, 544164, 391156, 356665, 368106, 339377, 396968, 407781, 505883, 510682, 538452, 635247, 589320, 531572, 594440, 498727, 569061, 751710, 674404, 619903, 600649, 618989, 723670, 682311, 699243, 957586, 1145700, 1398470, 1387919, 1298446, 1184856, 1136442, 1030727, 993841, 1003528, 1215585, 1243008, 1269799, 1326301, 1305357, 1159746, 1016414, 883934, 872818, 919549]
18912I19549m102j59054j57507m9169K632m9736m4111k6916j49144n3861J1171
18901B39752L6833M0829J71531P5162l6746j34455L8600M4926N5911L9907J19923
18890F92173N1117K63328J80529O9366K5816P8088J72825M5416j57066k4814o6979
18879A329799N3005J00023K19284K76429J98419j0635k32085k39381k45328j24426
18869A325104o8039l7292O1592p3220j32542j78525j57154o1354j07426p9087
18859D92057o1721Q3129J15740J28906M436J13754Q6131O5701o9054o5428J34250
18848A027901j45936j2977J57027J48264J62326O2071o8184q2184j38175p1617
18838A038516M7603L9255R8697M325o1351N5611Q9381K04000J55090J1114k5615
$$ y = [919549, 915447, 756393, 598886, 549717, 552349, 502613, 458502, 431586, 282442, 228581, 239752, 276585, 317414, 488945, 564107, 527361, 392906, 431506, 476432, 532343, 572250, 692173, 743290, 1006618, 1187147, 1256513, 1282329, 1360417, 1533242, 1578658, 1421592, 1396778, 1329799, 1382804, 1482827, 1702111, 1978540, 2176959, 2166324, 1934239, 1694858, 1449530, 1325104, 1257065, 1219773, 1281365, 1208145, 1075603, 897078, 739924, 678570, 571144, 492057, 430336, 513465, 629205, 758111, 762547, 876301, 962432, 1028133, 959079, 893651, 1027901, 881965, 868988, 1026015, 1174279, 1336605, 1398676, 1330492, 1248308, 1110133, 1038516, 1086119, 1125374, 1224071, 1228396, 1167045, 1222656, 1312037, 1516037, 1671127, 1682241, 1656626]
18827A656626j12511k15506j12301l5103L9962k9117j18192r8162k8164k1536
18817I25996k0948l9424p2772M209J57586k8961j05786N3198m6871j07260N4280
18806G73247J18100J83969o0020j88127m8568p0105P3215L015R2447k38j21295
18795G55640o9812P9367R6962n7041n7134o8239j740R747m9086N5104J12957M3756
18783H50481J41036J05359j35411m3325J0070K5945J21661M3441L6955M0218J52760
18772A349190j35076p6507j8209J38711L13578M28754J36473k52976k98392j50245
18762A435301n2157k23226j38635l8408r8200k12865j00213J3273Q1490M6517
18752G12877n9552r8322l8845J4449N3457Q355m3660r98j24315n9596O4438J15189
$$ y = [1656626, 1544115, 1328609, 1216308, 1181205, 1221167, 1192050, 1073858, 975696, 947532, 925996, 905048, 865624, 792852, 797061, 954647, 925686, 819900, 873098, 826227, 718967, 773247, 891347, 1075316, 1015296, 827169, 778601, 708496, 781711, 784726, 877173, 876935, 755640, 685828, 765195, 862157, 805116, 747982, 679743, 678003, 687750, 638664, 693768, 806725, 850481, 991517, 1096876, 961465, 918140, 928210, 954155, 1075816, 1119257, 1156212, 1196430, 1349190, 1214114, 1137607, 1119398, 1258109, 1571687, 2000441, 2136914, 1883938, 1585546, 1435301, 1383144, 1159918, 1021283, 982875, 884675, 671810, 571597, 584870, 666360, 712877, 653325, 555003, 516158, 530607, 584064, 592419, 548759, 547761, 423446, 363850, 428288, 543477]
18740E43477Q8575P737J64444N484m2l1426N7729J71311K9445O3383R1919L2975
18728A225011J05335J30454j58400n9434K9468M597j6439j90054j65418k8327
18718H76793r0142J7926j8748l0677k6702o3127r9467J43780J43340k324q5044
18707G65608R70J00889L5279m6660q5320p9445O277K4589j29251p3208M8211J25748
18695F93687O0792L3833K0757K8317P9889n875J01663Q2657R5433M123R5438P0424
18683A361138N3497J5534J6194N5897p8208q0583m2106p9714l0679R19J01707
18672A293596j9589j05890k1622M7520k0054q4544N7242r3906k8904N5259J09627
18661A188735k3731j25871L5533R1889R4585O1758J0566Q7002J47653Q8955L0983
$$ y = [543477, 632052, 639789, 804233, 809717, 809675, 778249, 835978, 1007289, 1036734, 1100117, 1192036, 1225011, 1330346, 1460800, 1302400, 1242966, 1272434, 1277031, 1260592, 1070538, 905120, 876793, 786651, 804577, 785829, 755152, 728450, 665323, 565856, 709636, 852976, 850652, 765608, 766578, 867467, 902746, 856086, 770766, 691321, 697598, 722187, 592936, 519728, 567939, 693687, 754479, 788312, 809069, 837386, 917275, 911400, 1013063, 1095720, 1191153, 1195276, 1290714, 1361138, 1414635, 1430169, 1446363, 1502260, 1424052, 1343469, 1301363, 1221649, 1190970, 1191889, 1293596, 1274007, 1168117, 1146495, 1194015, 1173961, 1089417, 1146659, 1052753, 1023849, 1079108, 1188735, 1165004, 1039133, 1074666, 1166555, 1261140, 1322898, 1333464, 1420466, 1568119, 1657074, 1688057]
18650A688057R7701Q2521Q4906k729q1469q9469J19928Q6892J37770k1841J14975
18639B217242K09420K17172J28973K297O5476P4696J1766J092Q2870p979k73260
18628B729765j58598j61481j11216q3618k2803K5803j0280m8988L0008P2111R5535
18617B356238M4626J9976J83319K63525L33900L42349K74312L36958L72943K63839
18607D791985J25435L00886M53460N37557M17576K48208K32241L74953O31209
18598H113510Q55994J017215J202330J795968K346576L156090M589150O899252
18590B9976085J0090872J5892411K6104409M2371588N4350959L1907780q038766
18583B02655338j4607724O262634J9852961p958819m2911999m7553150l5724951
$$ y = [1688057, 1785758, 1868279, 1953185, 1950456, 1868987, 1779518, 1899446, 1986338, 2124108, 2102267, 2217242, 2426662, 2643834, 2772807, 2775104, 2840580, 2915276, 2927042, 2928134, 3011004, 3003025, 2729765, 2571167, 2409686, 2298470, 2214852, 2192049, 2217852, 2207572, 2158584, 2188592, 2260703, 2356238, 2400864, 2420840, 2604159, 2867684, 3201584, 3543933, 3818245, 4155203, 4528146, 4791985, 4917420, 5218306, 5671766, 6209323, 6626899, 6875107, 7107348, 7482301, 8113510, 8969504, 9986719, 11189049, 12985017, 15331593, 18487683, 23076833, 29976085, 40066957, 55959368, 82063777, 124435365, 178786324, 210694104, 202655338, 188047614, 194310248, 214163209, 206204390, 163292391, 115739241, 80014290]
18576H0014290k2646402j3967753r100648o527360m943355l688785k917833k094328
18568A4127826j509595j091524r07541o93828l96256k89218l86137l32451k70248
18559H251028k65583M055J32361J3467o8036k67027k00510R0920M60171L21520
18549H472366J32441J82885J69005L41394P19165R99751J366625J547315K157621
18540A6088568K954397M149668O031132Q938529J3749188K2027638L6600051N6062444
18532A66601615N7665080J7211186j7761220r898355J6483266J5476009k7934521
18525B17843060n5438271n0430155l4568330k1309709j3325868q870108o398482
18518B7502137m893001l749003k753175k135598j703524j366259q53925o11316
$$ y = [80014290, 57367888, 43400135, 34299487, 27772127, 22828772, 19139987, 16222154, 14127826, 12618231, 11526707, 10619166, 9925338, 9529082, 9239864, 8853727, 8521276, 8251028, 7985445, 7989500, 8121861, 8135328, 8067292, 7800265, 7599755, 7690675, 8150846, 8472366, 8604807, 8787692, 8956697, 9298091, 10017256, 11017007, 12383632, 13930947, 16088568, 19042965, 23192633, 29223765, 38162294, 51911482, 73939120, 110539171, 166601615, 224266695, 241477881, 223716661, 213818306, 230301572, 245777581, 217843060, 162404789, 111974634, 77406304, 56096595, 42770727, 33900619, 27502137, 22609136, 18860133, 16106958, 13971360, 12267836, 10901577, 10047652, 9436336]
18510I436336m98531k83574l28066n04295o14988l35809k14910m16424n43797
18501E695942n00552l34924j28659k44706k23772j63298j18367k25446l02545
18492C453673k98249q2530k5737j31215k30728o1594M4687j2385k1415r1151j31433
18481B411923j26505j7844J6973R7130j1358o4292J32483J7601q163l1107Q8927
18470B505768R0517J27511J20412k647j6569J6454J55921J70731R6770J69754
18460C434622J01374K69711L73709J39063J60172P8143K01726M22468O12487N04500
18450F297975L86650K69504R7215R2940K03789N62865R48606J221129J935406
18441A2016079K827110M612672P098339R663814R026024N711491O978246J2789587
$$ y = [9436336, 8937805, 8654231, 8326165, 7821870, 7206882, 6871073, 6656163, 6239739, 5695942, 5195390, 4860466, 4731807, 4487101, 4263329, 4100031, 3981664, 3756218, 3453673, 3155424, 3072894, 3047157, 2915942, 2685214, 2623620, 2668307, 2655922, 2634507, 2543356, 2411923, 2285418, 2267574, 2284547, 2381677, 2370319, 2306027, 2438510, 2456111, 2447948, 2416841, 2505768, 2596285, 2723796, 2844208, 2841561, 2824992, 2841446, 2997367, 3168098, 3264868, 3434622, 3535996, 3805707, 4179416, 4318479, 4478651, 4556794, 4758520, 5180988, 5793475, 6297975, 6684625, 6954129, 7051344, 7144284, 7348073, 7910938, 8859544, 10080673, 12016079, 14843189, 19455861, 26554200, 36218014, 45244038, 50955529, 57933775, 70723362]
18433G0723362J3364422J71933j0963292r722405j993463Q601278K0478702K9950225
18425A20610762K8037465L745962k6418671l3166773k5779506j6251305r043796
18418D1734138m080293Q5510L939630P963414Q990334J324040q314196j0770976
18410D0871601q844170n882617l525419k134635j356320m78271L22188L05089
18402A9277446L54633M56083Q98062J779114L190249N352075Q403247J0390460
18394E0101369O964160K071336K852731O889980P366300M587923O972133J6549400
18386A04355332L1188192M2105157L4094309K4129298L6273645M9544844L0644518
18379C52335295j5921229n2281040o4350344n3139158l3212093j4305834J893165
$$ y = [70723362, 84087784, 84259717, 73296425, 63574020, 61580557, 70181835, 90660537, 120610762, 148648227, 152394189, 125975518, 92808745, 67029239, 50777934, 41734138, 37653845, 37739355, 41678985, 49642399, 58632733, 59956773, 51642577, 40871601, 32027431, 26144814, 22619395, 20484760, 19128440, 18650169, 18972357, 19277446, 19632079, 20088162, 20986224, 22765338, 25955587, 31307662, 39710909, 50101369, 57065529, 59136865, 61989596, 68879576, 76245876, 80833799, 87805932, 104355332, 135543524, 177648681, 211742990, 235872288, 272145933, 321690777, 352335295, 336414066, 284133026, 219782682, 166643524, 133431431, 119125597, 121018762]
18372A21018762J5727719K2787814J2883309j0884607k6876194k6046577k1930998
18365H6679228j8860359j4388914j0069668o700715m833825l536414k410707j619773
18357B4258853j236372r69776q30764p62886m08781J10173L26060P19437J118064
18348B2324008J967210L187441M857613P657676J2169132J8316356K2078274J3244231
18340A05801941m219582j1422856p039460L352146J6904766L1650252L9497163
18333A74524370L4842529J8992506p272104k1152403j2365042n133265k0711566
18326A61725025l6136830l3870318k4010625j5002299r073874n062237j545162
18319C7023680J541284K726462j022991o139176o990790n508112l474345j845040
$$ y = [121018762, 136746481, 159534295, 172417604, 161532997, 134656803, 108610226, 86679228, 67818869, 53429955, 43360287, 36659572, 31825747, 28289333, 25878626, 24258853, 23022481, 22052705, 21221941, 20459055, 20050274, 20160447, 20486507, 21205944, 22324008, 24291218, 27478659, 32336272, 39993948, 52163080, 70479436, 92557710, 105801941, 101582359, 90159503, 83120043, 86472189, 103376955, 135027207, 174524370, 209366899, 228359405, 221087301, 199934898, 187569856, 182436591, 161725025, 125588195, 91717877, 67707252, 52704953, 43631079, 38568842, 37023680, 38564964, 41291426, 40268435, 34129259, 27138469, 21630357, 18156012, 16310972]
18311A6310972j076974j100509j423925j321229j052650p85975n51768n95841
18303H402101o42742n76728j81504j51158k85431l23380n4427K62427K87405K81257
18293G017820L01918j02371m00371m09767k03097J9875Q3114K89583L64817N39358
18283G500879L71778K6923m0813K95808O58569R95990J562161K290058L160015
18274A6821368M494391P001933J1079985J6981601J9787790Q728653p671930j2179622
18266F5044169p830422l80036Q340708J8970122L2057243L6408705J0468130k4564330
18258A38514289l3643520k6024961j4511548m392585M810753J3269881J3897671
18251I1919980k023185j7697334j9540102j4612654r245044n559989l657778k485748
$$ y = [16310972, 15233998, 14133489, 12709564, 11388335, 10335685, 9549710, 8997942, 8402101, 7759359, 7182631, 7001127, 6849969, 6564538, 6241158, 6186731, 6449158, 6736563, 7017820, 7319738, 7217367, 6816996, 6407229, 6204132, 6224007, 6307121, 6596704, 6961521, 7500879, 7872657, 7899580, 7858767, 8154575, 8813144, 9809134, 11371295, 13661353, 16821368, 21315759, 28317692, 39397677, 56379278, 76167068, 84895721, 77223791, 65044169, 57213747, 56833711, 65174419, 84144541, 116201784, 152610489, 163078619, 138514289, 104870769, 78845808, 64334260, 59941675, 64752428, 78022309, 91919980, 89896795, 72199461, 52659359, 38046705, 28801661, 23241672, 19583894, 17098146]
18243A7098146j544896q33732m59503q2554J19715J30356L39483N13859J048403
18234A6329277K231353M160395P224296J1250459J1393196J734460p830305r474036
18226C7019095o503907k990062k18712K266293N044882Q615058J4372589K2905736
18218H0510972K9760173K5397466J7160683J5467470M544832j7971115k8996594
18211A25873887k8862540k4948729j8889831j2942954q533334n185971l239540
18204B3270988k186409r82661N44318K318277M847143O701545L517827l684664
18196C4346364p279880o642676m503136k627363j737249j299362j038666p47297
18188H470735o21005m85024j83355J22867L93106N81584R96612J944303L321325
$$ y = [17098146, 15553250, 14719518, 14260015, 14177461, 14297176, 14427532, 14767015, 15280874, 16329277, 18560630, 22721025, 29945321, 41195780, 52588976, 54323436, 46493131, 37019095, 30515188, 27525126, 27306414, 29572707, 34617589, 43232647, 57605236, 80510972, 110271145, 135668611, 152829294, 168296764, 172841596, 154870481, 125873887, 97011347, 72062618, 53172787, 40229833, 31696499, 26510528, 23270988, 21084579, 20101918, 20646236, 22964513, 27811656, 34513201, 38031028, 34346364, 27066484, 20423808, 15920672, 13293309, 11556060, 10256698, 9218032, 8470735, 7849730, 7364706, 7181351, 7304218, 7697324, 8278908, 9275520, 11219823, 14541148]
18179A4541148N526191P241538M402725j986166m644663l452736p37580K604175
18171B3494632O591652J1032713J0735206M1904r583031j0601110p315144l689953
18163B0706869n97303K442929M037448J254841m172578o016943n041239l335953
18155I278071k008956j369707j017870o72827m35620l51015k74898k48603j05534
18146B793041Q689Q738k71032k67142j33613N1623J10022l8720m1183K7410M0840
18135B288673o5974o5617N7341N7406J32680p5326l3953J59221J85049K66941
18125B906441M08616L30364L18921N60828O35168Q05925J162060J242972J800854
18116A0172149K525853L535591N583834R250793J6271184K9219861N2566949P5442837
$$ y = [14541148, 20067339, 27308877, 31711602, 29725436, 25080773, 21628037, 20890457, 23494632, 30086284, 41118997, 51854203, 51896107, 42313076, 31711966, 24396822, 20706869, 20109566, 22552495, 26589943, 27844784, 23672206, 17655263, 12614024, 9278071, 7269115, 5899408, 4881538, 4208711, 3773091, 3422076, 3147178, 2898575, 2793041, 2801730, 2810468, 2539436, 2272294, 2138681, 2190304, 2300326, 2261606, 2220423, 2247833, 2288673, 2222699, 2157082, 2214423, 2271829, 2404509, 2329183, 2295230, 2454451, 2639500, 2906441, 3315057, 3645421, 3964342, 4525170, 5160338, 5966263, 7128323, 8371295, 10172149, 12698002, 16233593, 21817427, 31068220, 47339404, 76559265, 129126214, 204569051]
18108B04569051L1603861m9255693o4043366m7093026k6716750j4932710q864266
18101B5267101n573918l825855k907820k365662j786260j312897j025933q82763
18093E585993p07506m12704m34960l96899k47374k09888k55428k47525k00435
18084B473274j80960r4767j17989L4082j2286l0512R0915r4837j61716j49857
18074A755347j31225O6521L9370k36229j89146j96581j32250o9367n8241j32597
18064G15602j8174j03810q967J1154p1468k7484K0790M9061O8522l7977r2400
18053E04849k623O9210J8203j10011L0856K14233J72030m6871n5749j04687n1853
18042F37587j39530j84910N831m0566l2231O9855p8027O0877k6776L5872k3715
$$ y = [204569051, 236172912, 186917219, 122873853, 75780827, 49064077, 34131367, 25267101, 19693183, 15867328, 12959508, 10593846, 8807586, 7494689, 6468756, 5585993, 4878487, 4465783, 4030823, 3633924, 3386550, 3176662, 2921234, 2673709, 2473274, 2292314, 2197547, 2079558, 2113640, 2101354, 2070842, 2161757, 2066920, 1905204, 1755347, 1624122, 1690643, 1730013, 1493784, 1304638, 1108057, 975807, 906440, 848199, 715602, 697428, 593618, 584651, 595805, 524337, 496853, 517643, 566704, 635226, 597249, 504849, 502226, 571436, 589639, 479628, 510484, 724717, 896747, 849876, 794127, 689440, 637587, 498057, 313147, 318978, 278412, 246181, 316036, 238009, 298886, 272110, 307982, 284267]
18031B84267J2528J03365Q0235L0801J87822L64963L49758J14938r4609j47510
18021A286558n0433K36933o192k17490k83264j55768j10916j04937r3970j29321
18011C71200N9541K0018l9016k7742k1610q025O1009j21651M8223J5942j18372
18000B39517r290M1011m6843M3188N6690R6636p615L5386M344p678Q27j28157
17988C18016l8746k3747K8457K8718N7340N145J9967o7980J8161p1804n3174o3294
17976A57059j0347O305J3498P0598r242k6033j6315l3798R0506R9083N8596J21002
17964E20912k7671n6513j07544j57214J3337P0102J5357l5478r612q1406n2598
17953I1672Q5192R3086J05576j02990L1672n1003P7540L5676O3382P310L4969
$$ y = [284267, 296795, 400160, 480395, 511196, 699018, 1063981, 1413739, 1528677, 1434068, 1286558, 1236125, 1473058, 1466866, 1249376, 966112, 810344, 699428, 594491, 500521, 371200, 430741, 450759, 411743, 384001, 362391, 354366, 415375, 293724, 341947, 357889, 239517, 230227, 271238, 224395, 267583, 324273, 420909, 413294, 448680, 453024, 445346, 446173, 318016, 279270, 255523, 283980, 312698, 370038, 375183, 395150, 327170, 345331, 273527, 220353, 157059, 146712, 153017, 166515, 237113, 227871, 201838, 185523, 151725, 242231, 341314, 399910, 520912, 493241, 436728, 329184, 171970, 185307, 255409, 270766, 235288, 225676, 144270, 91672, 176864, 269950, 375526, 272536, 304208, 253205, 330745, 366421, 429803, 437113, 472082]
17942D72082L5523j43340j76399l1156R5864J36827J2475j19813j18356j13002
17932E0705P3448J09056J4871K4840R9437n0080J6861J82603K81263J71564R6275
17921A070843m0950m672j34506J9861K23452R8698J12118N6842r6316q4528j19459
17910A101383k11885l06577j99970q8821L2111J06990N9740j33826l6752n2365
17900B70028L1503J10110P7345R6485J40514m7091j29786o7810Q545Q9250q0842
17889D98251j2814M9782M5089j1630K0288J63522J04748q1391J4561J12035J31499
17878A033940K01037K66463J55330R6667k1345j06410o0883J00476J03902J69065
17868A938242J96133J03704n9874k13223j54349l02664r8473Q5355K03639J39186
$$ y = [472082, 507605, 364265, 187866, 156710, 252574, 389401, 401876, 282063, 163707, 50705, 124153, 233209, 248080, 272920, 372357, 322277, 339138, 521741, 803004, 974568, 1070843, 1029893, 1025221, 890715, 910576, 1134028, 1232726, 1344844, 1401686, 1305370, 1220842, 1101383, 889498, 582921, 382951, 294130, 326241, 433231, 492971, 359145, 322393, 270028, 301531, 411641, 488986, 585471, 725985, 678894, 549108, 481298, 489843, 579093, 498251, 485437, 535219, 580308, 568678, 588966, 752488, 857236, 775845, 790406, 902441, 1033940, 1234977, 1501440, 1656770, 1753437, 1732092, 1625682, 1564799, 1665275, 1769177, 1938242, 2134375, 2238079, 2178205, 1964982, 1810633, 1507969, 1409496, 1494851, 1698490, 1837676]
17858A837676K0401m3060k00118j50506j16766j21274j350K8911p9157J85469
17848A360226P0932O7787J38094j2238o5318k090J47676K56676J87745J10095
17838B259585J89304K67731L31907N21806K95243Q2376J12429K83234O59413Q02431
17828E805459N30699L55052M26144N61611R04381J101328J548691K159991K991076
17819A6384432M646025O907875J1451918J8914394L1303076M9586716N4392981
17812A93587417R062863m0745084m8274321l5748422k1959807j3241119q141062
17805C4540465m895486k740859j133179M49409K372869N035683R149835J6200512
17797E8979249K7535892M4405056N3514802J7019433l6128789m8763957l7932972
$$ y = [1837676, 1858077, 1815017, 1614899, 1464393, 1347627, 1226353, 1225003, 1253914, 1174757, 1360226, 1431158, 1498945, 1637039, 1624801, 1559483, 1557393, 1705069, 1961745, 2149490, 2259585, 2448889, 2716620, 3048527, 3570333, 3865576, 3947952, 4060381, 4343615, 5003028, 5805459, 6336158, 6691210, 7117354, 7678965, 8583346, 9684674, 11233365, 13393356, 16384432, 21030457, 27938332, 39390250, 58304644, 89607720, 139194436, 193587417, 202650280, 161905196, 113630875, 77882453, 55922646, 42681527, 34540465, 29644979, 26904120, 25770941, 26220350, 28593219, 33628902, 42778737, 58979249, 86515141, 130920197, 184434999, 201454432, 165325643, 116561686, 78628714]
17790G8628714k3904234j4713069r396223o298098m338885l131231k306607j573052
17782A2967315q94632o05233n79717o15877n99582m09235m8146K55238M02532
17773I872663J26528n4167J21132M14661R87753J250066J876622L036909M633996
17764B2266163P140290J1712492J9873754L3129265M8376582L7085110j3650563
17757A65933093m2022136l9007767k6145695j5558908r397938n707846l481387
17750B4611416j770845m34012R75233K847806N635216R987938J7468031K9356164
17742H8676947M4723388M0275806o702403m0997855m0553010k8161445j7117352
17735D0144076j0673983o929960m683017l360356k561426j922191j485610j144606
$$ y = [78628714, 54724480, 40011411, 30615188, 24317090, 19978205, 16846974, 14540367, 12967315, 12072683, 11467450, 10887733, 10271856, 9672274, 9263039, 9214893, 9470131, 9872663, 9999191, 9945024, 10066156, 10480817, 11468570, 12718636, 14595258, 17632167, 22266163, 29406453, 41118945, 60992699, 94121964, 142498546, 179583656, 165933093, 123910957, 84903190, 58757495, 43198587, 33800649, 28092803, 24611416, 22840571, 22406559, 23381792, 26229598, 31864814, 41852752, 59320783, 88676947, 133400335, 173676141, 166973738, 125975883, 85422873, 57261428, 40144076, 29470093, 22540133, 17857116, 14496760, 11935334, 10013143, 8527533, 7382927]
17727G382927q12963m75345m78857o43540m83841j83215k5856J27503j31949m91743
17717C783121n99326m13022k76558r0578n815O3592j25627k97143j70779k47644
17707A620221k02035r3049r1062j40935K3274J1396j7736j92409j91987j28201
17697E97477r527m2336M294o0763k3328m2983j24727N2130J812M8800j443N9226
17685D58632j20245J2649Q5323O1138M2756j37445N2156R8717j11651k24512j24458
17674I3060M7840N7473J7565j8248J03592q4213J2902J11554K87811K16669j07138
17663G38867j38256j78386r5954K5596k3557p616o611R4163k3880m1361L8823
17652C81828j3110j54711j18937N4511Q3054q7567j71822K3236K1014l4716R5934
$$ y = [7382927, 6569964, 6094619, 5615762, 4972222, 4488381, 4305166, 4279310, 4406813, 4274864, 3783121, 3183795, 2770773, 2494215, 2403637, 2397822, 2461414, 2335787, 2038644, 1867865, 1620221, 1418186, 1325137, 1234075, 1093140, 1116414, 1127810, 1110074, 917665, 725678, 597477, 587950, 545614, 549908, 489145, 465817, 422834, 298107, 350237, 352049, 400849, 399406, 458632, 338387, 351036, 436359, 497497, 540253, 402808, 454964, 553681, 442030, 217518, 93060, 140900, 198373, 215938, 197690, 301282, 217069, 229971, 341525, 629336, 846005, 738867, 600611, 422225, 326271, 351867, 328310, 320694, 314083, 408246, 384366, 343005, 381828, 368718, 214007, 95070, 149581, 232635, 145068, -26754, -3518, 17496, -17220, 78714]
17641G8714J1248j16697K510O699J2232J42222p9302j47478M8741J72727R3437
17630B25053j35O674m113m2808j6496M0292K249n9656p2922K8740j71243k63056
17618c27421J17068J27138K2436j50236Q6621J97988J05115k8430j63818L9031
17608B5492r305k270j8105L2461m593k6488q6941R869O3014m8635M3010o284O6107
17595C7332l3623N2920R7407Q439n5187j70502O9370j8830l2186n8989k4607M1852
17583h6604m8044K817r2711Q3073J5571P9815q2073L5813J11949L1629J6687j42766
17571g4844k0393M0770L44K6095o3430J2481l8251r6981K7782J03726J60378Q6113
17559A63790j68544K8845J47223k6017J2776j59463j41944m0179j4735N7042J58091
$$ y = [78714, 89962, -26735, -24225, -17526, -5294, 136928, 57626, -89852, -41111, 131616, 225053, 224918, 231592, 227479, 184671, 168175, 208467, 210716, 151060, 78138, 106878, -64365, -327421, -210353, -83215, -60779, -211015, -124394, 73594, 178709, 150279, -13539, 25492, 16187, 13917, -4188, 28273, 23680, -2808, -89749, -79880, -16866, -65501, -22491, -28775, 37332, 3709, 56629, 154036, 162475, 107288, -63214, 6156, -12674, -44860, -103849, -128456, -86604, -134648, -131831, -224542, -141469, -125898, -46083, -128156, -92343, 19606, 51235, 67922, -74844, -95237, -54467, -54123, -28028, -91458, -78977, -117228, -214209, -186427, -82701, 77677, 163790, -4754, 24091, 171314, 145297, 158073, -1390, -143334, -183513, -198248, -141206, 16885]
17548A6885K6078j96966j04036J58771N2509l6351K7108j619N1229j04615m762
17537a15769j0924l533l5889N4130k2813k0077m0037k5693j9235J16725Q0131
17526d2984r27P475L5679m97L3343o5312j11493m7122L9392P8218R9589O5732
17514I1093j12133o2954o0723J3491J4623m9230j36941R7766J6265J46311k4529
17503f6961J3744j7493n9194K6837j0938n1168L6601O7090r8083p2986Q476o2492
17491b86567m435P1895R5463n4867l9751J47384K2043r5488Q2115L7210l0581
17480e5579L7879J0096L0533J256j42323o4072J39403R2927m8532j56749J5464
17469a39697J37455p1861M1262J5921r3527j852r9268n3954J13643q6244Q473
$$ y = [16885, 42963, -154003, -258039, -99268, -46759, -83110, -56002, -57621, -6392, -111007, -115769, -126693, -130226, -166115, -111985, -134798, -154875, -194912, -220605, -239840, -123115, -42984, -43911, -36436, -757, -1254, 32089, -33223, -144716, -191838, -152446, -74228, 25361, 91093, -21040, -83994, -144717, -131226, -116603, -165833, -302774, -205008, -188743, -42432, -66961, -53217, -70710, -129904, -103067, -114005, -165173, -128572, -61482, -159565, -232551, -224075, -286567, -291002, -219107, -123644, -178511, -218262, -70878, -48835, -144323, -62208, -24998, -55579, -17700, -7604, 22929, 24185, -118138, -182210, -42807, 50120, 1588, -155161, -139697, -2242, -74103, -32841, -16920, -110447, -112299, -211567, -265521, -151878, -238122, -229649]
17458b29649J42940r135q2456Q4839j0508k6308M8833N4784O3677M8313L0625
17447A15955o6804J1947J65383K11773L12890J66333j61751k55752k57601j99038
17437D3335o2143l5805R0319J54367R0397l9779j48137j25840M3205r3667n1503
17426a35251j47802O9823J42820p7707j2293L6666J39599k9037j30106n0187M4385
17415a49090P7550p4374j0538k4169p8620r5138M7640J12649M8576l8421K5901
17404a58034o5747r8662J7949L8104N0236l1772m0467J5417J53917J25520L50
17393F811k8714q459l8111M0933M0335M3573k2581k9056L8378m7491m1741o5254
17381a11377o3527L0568K3289O5237p1121m0957o3937L6748M3693r6540N4160
$$ y = [-229649, -86709, -95844, -178300, -93461, -103969, -130277, -81444, -26660, 37017, 85330, 115955, 49151, 61098, 226481, 438254, 751144, 917477, 755726, 499974, 242373, 43335, -18808, -54613, 35706, 190073, 280470, 240691, 92554, -33286, 9919, -83748, -135251, -283053, -213230, -70410, -148117, -160410, -123744, 15855, -13182, -143288, -193475, -149090, -71540, -145914, -156452, -180621, -259241, -354379, -306739, -194090, -145514, -183935, -158034, -223781, -322443, -304494, -266390, -216154, -247926, -288393, -272976, -119059, 6461, 6811, -21903, -30362, -68473, -27540, 12795, 56368, 33787, 4731, 43109, -4382, -46123, -111377, -174904, -144336, -121047, -55810, -126931, -167888, -231825, -195077, -151384, -247924, -193764]
17370a93764o326L0734J31386J14780J29450q3005p3880o4213k0425J21761P7969
17359A64467j04299j40255J64646K9452j32285j0177m3927q8011o8318R7311J32445
17348A049N6676J22497n5920j61162M135J0462l5184n0538k9330n219O8497J49299
17336G5262N2652O9658k5537j41266q1287n0636K6612j8083m6231J19018Q0202
17325F0364M0291k330P2873j2967l7931J07103L3571m980j44793K2093P2388j02904
17313A02778o892M8289j5934J10632K05787K32769J25994k6325k01660k24534
17303C50904k55187m2892n3790N3219q1273j0128J01713K6630j8206K7619J22205
17292B20814O6412J26872J76408L34874Q5575r8829k61930l12919j01809j26547
$$ y = [-193764, -200090, -169356, -37970, 76810, 206260, 123255, 49375, -14838, -35263, 86498, 164467, 60168, -80087, 84559, 114011, -18274, -28451, -72378, -160389, -228707, -131396, 1049, 57725, 180222, 124302, -36860, -32725, -22263, -57447, -107985, -137315, -142534, -74037, 75262, 127914, 197572, 172035, 30769, -50518, -101154, -74542, -92625, -138856, -19838, 60364, 100655, 98325, 171198, 158231, 120300, 227403, 260974, 255994, 111201, 133294, 205682, 102778, 95886, 144175, 128241, 238873, 444660, 677429, 803423, 777098, 575438, 350904, 95717, 52825, -965, 52254, -29019, -39147, 62566, 89196, 70990, 98609, 220814, 287226, 414098, 590506, 925380, 1010955, 912126, 650196, 337277, 235468, 108921]
17282A08921j67834l5292K5967J02786J2542j31659q9670n118l3590J26127J86811
17271I9991K7228M3842p4424n9144r761o5974k3929M4714K7696K4473K7665p2012
17259i635M2072j1944J62563J58943J06142K12288J72239J11880j80529j97967
17249E66052k30920k57389j66819Q5705J9523L7443l4758j7671J04M8896P3584
17238A23750P8621R5454L43305J97618m0230j74512j56642j98769j6371o0209
17228A92015j26411j08808K9216L5285M6855R7168J2158j22152j41803L1181q9651
17217a44947j23188j586J06603O717J7039j3533J08093P454l3938N951r1875o2917
17205b20127m1812L4619P5336R397o1789O6854R496p9259K7647p5117l7273j1689
$$ y = [108921, -58913, -94205, -68238, 34548, 47090, -84569, -174239, -179357, -212947, -86820, 99991, 127219, 171061, 96637, 37493, 27732, -38242, -62171, -17457, 10239, 34712, 62377, -9635, 32437, 20493, 183056, 341999, 448141, 660429, 832668, 944548, 764019, 566052, 335132, 77743, -89076, -3371, 16152, 53595, 18837, 1166, 1270, 50166, 123750, 202371, 297825, 641130, 838748, 798518, 624006, 467364, 268595, 252224, 192015, 65604, -43204, -13988, 21297, 68152, 165320, 177478, 55326, -86477, -55296, -144947, -268135, -269721, -163118, -156401, -139362, -152895, -44802, -37348, -71286, -65335, -157210, -220127, -261939, -227320, -151984, -142587, -204376, -137522, -128026, -207285, -179638, -254755, -292028, -303717]
17193c03717K2967J48879R7011o3349J6946P2865n342k4908q6723q721L6343m5562
17181a43311M4889P0175p8663m9982M0988L4320L7298M7628L3169j46340N9947
17170d9882j7044K9572p400J52010J94221p9406j40215j39139k3641l8552n2251
17159a71727M500L6832p3514M1566N1424j02066o3153k4119p5361K3250O5985
17148b86383k6576j7892m820R0926Q4959N8088P7915N8050j62159l0401P3463
17137h4830k1716q101R518k4109K4627M8124o4949j32204N155J05008K02818J13139
17125A72480j2119p8325j17003j27765q3874M7240O9071q273j54670p5065J28391
17114b39912M4823O9550O2607K0436p6752L7303O6146j82154p1126J14566J21281
$$ y = [-303717, -280750, -131871, -34860, -98209, -81263, -8398, -13740, -38648, -125371, -134092, -97749, -143311, -98422, -28247, -106910, -156892, -115904, -81584, -44286, 3342, 36511, -109829, -49882, -66926, -37354, -44754, 107256, 301477, 222071, 81856, -57283, -80924, -119476, -171727, -167227, -130395, -203909, -162343, -110919, -212985, -276138, -300257, -375618, -352368, -286383, -312959, -330851, -335671, -244745, -159786, -101698, -23783, 34267, -127892, -158293, -84830, -106546, -114647, -105129, -129238, -104611, -56487, -121436, -253640, -248485, -143477, 59341, 172480, 160361, 82036, -34967, -162732, -246606, -199366, -130295, -138568, -293238, -368303, -239912, -195089, -125539, -62932, -42496, -119248, -81945, -15799, -197953, -269079, -154513, -33232]
17103c3232q0816j39488j02501Q4919P4222J17278J7072L3547J3008l8282k4780
17092g9053l405L0792n8770L1172m9149q9548L3548J00506N9273j0273N4090R759
17080B8942Q2956K0791r3318k6802q0182o8768j0908O3504R38k6999m0548n9517
17068b09911l8840o3812K5558J1267n5070j8064J5346j6643p443O9912J33318
17057a54382L3000m5143J11779J24681j10792q0708j0409k1732K7536n0305J29769
17046d6706j2752j47M7298p8224n9212p6506R6528k6912j36569L0864J04927P280
17034a50131L475L7689j1647j2488j5090o976k0456n548k3545j39886N7362O2188
17022b25053R1650J2271j04639k2618J31281M2521Q3282M8566j03514j81873k557
$$ y = [-33232, -114048, -253536, -356037, -271118, -196896, -79618, -62546, -28999, -15991, -54273, -79053, -82458, -51666, -110436, -79264, -128413, -217961, -184413, -83907, -24634, -34907, 19183, 28942, 111898, 132689, 39371, 12569, -67613, -136381, -147289, -83785, -82847, -109846, -150394, -209911, -248751, -312563, -287005, -275738, -330808, -348872, -333526, -350169, -357612, -287700, -154382, -121382, -166525, -54746, 69935, -40857, -121565, -131974, -153706, -126170, -176475, -46706, -59458, -59605, -12307, -90531, -149743, -226249, -129721, -156633, -293202, -262338, -157411, -150131, -146656, -108967, -120614, -133102, -148192, -155168, -175624, -181172, -204717, -344603, -287241, -225053, -133403, -121132, -225771, -248389, -117108, -74587, 8695, 57261, -46253, -228126, -230683]
17011b30683Q1293P4104l1916j4293k4205m8395N3284K2459R1720P807p4698n6123
16999a49646M9017J51995J21715j78421j47998N0687J1893l0860j35149J71042
16989h5725P1920Q139p5178l4773n2051M6383L1885k5700M653Q277j11394R4239
16977a19325J033l525r165L5955j4549J07106J0235k9689l3970k3195J04936J1794
16965C7641k19003p955l4832P8587j1794o6051q9549M095J6541J6990m049M4432
16953b34947K06534K5147r6028j06198N6315M0896j04744M0291L3980P65P5278
16942f2711M2591n0026o201k2385r6553p6292K3693J02542l533o1307n6958J41890
16930a25250J04510n7290j8666J5644M086m7039l9168N0242r6148n1058o3176
$$ y = [-230683, -149390, -75286, -107202, -121495, -145700, -194095, -140811, -118352, -26632, -18825, -93523, -149646, -100629, 51366, 173081, -5340, -153338, -102651, -90758, -121618, -256767, -85725, -13805, -5666, -80844, -115617, -167668, -121285, -89400, -115100, -110447, -102170, -213564, -119325, -118292, -121817, -130982, -95027, -109576, -2470, 7765, -21924, -55894, -79089, 25847, 37641, -181362, -189317, -224149, -145562, -157356, -223407, -312956, -308861, -292320, -275330, -279379, -234947, -28413, -3266, -99294, -205492, -149177, -108281, -213025, -172734, -138754, -137989, -62711, -20120, -70146, -76347, -98732, -195285, -271577, -247884, -145342, -148875, -210182, -267140, -125250, -20740, -78030, -96696, -81052, -76966, -124005, -163173, -112931, -209079, -260137, -323313]
16919c23313R2772O4341J29779J8515j52255j59658M3615J31576J04868m9031
16909i8791j19411M8442J60411l992L8077m4189m8708m243l6288k5523k4155M351
16897a54019N6310j5395n0679k7454n9393J3801O4783P3369p5069j8659J6179
16886a76226J62012L428K3209P5368m1941q5399j06L2909Q6009j23552j33381
16875a77670j4810P5801j4026j09280J09367R9934P1048K2566p7781q654M478
16864a9027o6974L13p0575R7259J56312r4043m0353o3044l3971p2581r5608j4062
16852c16354N4947r7625q048J30L7539R2767K10583r0342j70326N8014J09334
16841a19381Q211J4300O357q3995p5152K0944J16415O3419m098r0777L2464m6351
$$ y = [-323313, -230541, -166200, -36421, -17906, -170161, -329819, -286204, -154628, -49760, -98791, -218202, -169760, -9349, -13341, 24736, -19453, -68161, -72404, -108692, -134215, -158370, -154019, -97709, -113104, -163783, -191237, -250630, -236829, -172046, -98677, -173746, -192405, -176226, -14214, -10786, 12423, 87791, 45850, -39549, -39655, -6746, 79263, -44289, -177670, -192480, -116679, -130705, -239985, -130618, -30684, 40364, 62930, -14851, -23505, -19027, -86001, -85688, -156263, -59004, 97308, 3265, -37088, -100132, -134103, -206684, -302292, -316354, -261407, -359032, -367080, -366950, -329411, -236644, -26061, -116403, -286729, -228715, -119381, -111170, -96870, -90513, -174508, -249660, -228716, -112301, -48882, -52980, -143757, -111293, -157644]
16829a57644l6733P4022J43783k0279l3437L1125l13p8243m3744k7393j2836P1286
16817i0406R9043L5891j8049J28038l091o8857j48304j13024P9408J32344n8050
16806b5057r0139N0758j6323Q074p527M8462l3742o4547n642l9861N6037j5689
16794a35196m3403n0104n4440P4842K26403n7699j23786N1643L5661o6907Q6369
16783e6617M7663j6349L8966M2863K2762M9621m2213j93526l8449K2228J09418
16772a3633N8181J800N967O8474J0416k6851P3824q8915j05435q4169Q911J36616
16760D5186Q0570j4714p1848j21997N17j5957j05322n8431R1117J7170l2410j19467
16748c05586R1653M8697M3094R2250r5664p7312N9848k753m9163J1051O1735p6621
$$ y = [-157644, -194377, -120355, 23428, 3149, -30288, 837, 524, -77719, -121463, -148856, -161692, -90406, 8637, 44528, 26479, 154517, 151426, 82569, -65735, -178759, -99351, 32993, -25057, -115196, -64438, -80761, -72687, -80214, -31752, -65494, -130041, -135683, -175544, -119507, -135196, -178599, -228703, -283143, -208301, 18102, -39597, -163383, -111740, -76079, -142986, -56617, -8954, -25303, 13663, 56526, 79288, 128909, 86696, -106830, -145279, -123051, -13633, 44548, 46348, 52315, 120789, 131205, 104354, 178178, 89263, -16172, -100341, -91430, 45186, 125756, 111042, 39194, -82803, -82286, -98243, -203565, -261996, -170879, -153709, -186119, -305586, -213933, -165236, -122142, -29892, -125556, -202868, -143020, -145773, -194936, -183885, -122150, -198771]
16736a98771N8671n3710J1603Q6150k9468l5909P0787m8628J9258o1445p4865
16725b56327n684n243N7787Q7774N8348O7565J10692J8373j27773j12954J158
16714a06284l893K5232n5709m1981j16276l6144l258k1372J50155Q8666k5396
16703a46260Q8034j008M2798M404k637q0998K5905o8356r2047m8374R3847k0277
16691b04969J11216J876K8632O8710l557r7494j01939M1113K6594J6903P0159
16680d2756l7302o6315J02096N4461J3831n8262n0206M1762m382q3079l9605j02224
16668b71981k4315J13282l3486J65060P4189J2395p4713p5974Q2034K2045n4175
16657f5639p5911j1240O9295K616m6861N7922J365p2477n3978J01442J1291o8882
$$ y = [-198771, -140100, -193810, -182207, -96057, -125525, -161434, -90647, -139275, -120017, -181462, -256327, -262011, -267254, -209467, -121693, -63345, 4220, 114912, 133285, 5512, -107442, -106284, -110177, -84945, -140654, -182635, -298911, -335055, -338313, -359685, -209530, -120864, -146260, -58226, -59234, -16436, -12032, -14669, -95667, -69762, -138118, -230165, -278539, -184692, -204969, -93753, -91877, -63245, 5465, 1908, -95586, -197525, -156412, -129818, -112915, -42756, -80058, -146373, -44277, 10184, 24015, -34247, -84453, -42691, -47073, -130152, -169757, -271981, -296296, -183014, -216500, -51440, 22749, 35144, -39569, -115543, -33509, -11464, -65639, -141550, -152790, -83495, -80879, -127740, -69818, -68453, -140930, -194908, -93466, -82175, -151057]
16645a51057M0462L6114J1804L6934J3609j09010j56132k3866n0332Q5436M2635
16634b23403J57462m172o8374j8261j15166K3620N4129N9828R4094j713p5496
16623a17452J8102O2718Q5900r3618j41049n9082J02446M2795l7044j17826r3982
16612c48092M7804L4567n4837N7778J3302Q7711q266l8070J4768J3208p1361R819
16600b41669J19117q5100p1038L0890Q5013J9270k7876j10656L6576Q4535J09478
16589e1460Q175j04310L0384J05237p5049j46819p7792l9440J32605J73015K5751
16578a9703q6311m1671o4104l6836Q148M9577P5031r392Q4962q0660K6110M127
16566i0722J6291j0414j698O4294O2350n8471P4094K4194q6617Q354O2398P2044
$$ y = [-151057, -110595, -74481, -62677, -25743, -12134, -121144, -277276, -301142, -351474, -266038, -223403, -65941, -70113, -138487, -156748, -271914, -248294, -194165, -134337, -40243, -41956, -117452, -99350, -36632, 49268, -44350, -185399, -244481, -142035, -99240, -136284, -254110, -348092, -300288, -265721, -320558, -262780, -249478, -161767, -170033, -208103, -193335, -180127, -251488, -241669, -122552, -207652, -278690, -247800, -162787, -143517, -171393, -282049, -245473, -160938, -51460, -43285, -147595, -117211, -11974, -87023, -233842, -311634, -351074, -218469, -45454, -19703, -106014, -147685, -211789, -248625, -240477, -190900, -115869, -125261, -40299, -120959, -94849, -90722, -74431, -84845, -86543, -22249, 40101, -18370, 55724, 79918, -6699, 1655, 64053, 136097]
16554A36097o1398K2029L81k5977n2199r3205m2512J2400M2840M5338k4795K7761
16542a3240O2527k2030n7669l0360J8079l6948R3795q270q3942M2748j20396j2106
16530a67812J48157P3052l0326j31461j02148n6348k08902O7019J41943J64941
16520a01885J64299o1050j72634J3715M1876N1699l2697k5316l3641j953L6935
16509a20652O3166K7111q9596K467L3111L3742P250m340j11227j12458J44013
16498a27413R9882Q9377K196j06221j8601J3250R18L0349p3842P0369m2542l9996
16486a02274Q4494r350K1209L7237l2553m4756p0107m9358L0075j04681J1466
16475b28598M5300Q185l774n4139J358l754r3121r3326K6457J83231J57393O3332
$$ y = [136097, 74699, 96728, 97109, 71132, 18933, -74272, -116784, -104384, -61544, -16206, -41001, -13240, 49287, 27257, -30412, -60772, -42693, -79641, 14154, 5884, -78058, -35310, -155706, -167812, -19655, 53397, 23071, -108390, -210538, -266886, -475788, -408769, -266826, -101885, 62414, 1364, -171270, -157555, -115679, -63980, -96677, -121993, -155634, -157587, -120652, -57486, -30375, -119971, -117504, -84393, -50651, -43401, -47741, -158968, -271426, -127413, -27531, 61846, 64042, -42179, -60780, -47530, -46612, -16263, -90105, -19736, -62278, -102274, -17780, -27130, -5921, 31316, -1237, -45993, -116100, -165458, -135383, -240064, -228598, -183298, -175113, -178887, -233026, -231668, -235422, -328543, -421869, -395412, -212181, -54788, 8544]
16463H544L8481Q4217K1293L3689j19257j17529p2137O2453l1083q6398P0703
16452a07024J9435m0659Q823N5280j120j0437R360q7993l7226q5569P4960J7955
16440a84215R6785R4598j38134j94177J1085O6645O6452O5470k592N7845L2974
16429b7264q3974l4551K6179n7453N4237O1518j3911j505O2378N5800j4449p5309
16417d8304M78m8858l9959j1275L5748k6657o2229K955k0438J23631n9836L8598
16405a16146J31819M408l7143R6013M5683m6598n789l7249k5626n7414n6806o4313
16393a69161p7696j06177J41726J80065Q105k5555J08730K459p4378j30013p3944
16382b15839q0677M1290j1965M2643L0435J18359P0833N2057j13290p617N7595
$$ y = [8544, 47025, 131242, 152535, 186224, 66967, -50562, -122699, -60246, -91329, -177727, -107024, -87589, -128248, -119425, -64145, -65265, -75702, -66342, -154335, -191561, -277130, -202170, -184215, -87430, 7168, -130966, -325143, -314058, -247413, -180961, -115491, -118083, -60238, -27264, -111238, -145789, -119610, -177063, -122826, -61308, -75219, -76724, -14346, 41454, 27005, -48304, -47826, -96684, -136643, -147918, -112170, -138827, -201056, -198101, -218539, -94908, -154744, -116146, 15673, 20081, -17062, 78951, 124634, 78036, 72247, 34998, 9372, -48042, -104848, -169161, -246857, -353034, -211308, -31243, -23138, -48693, 60037, 62496, -11882, -141895, -215839, -296516, -255226, -267191, -224548, -194113, -75754, -4921, 47136, -66154, -73771, -16176]
16371a6176L5037o8291p8629K7108j1178n7818Q1387M0782j3895k7278J8602M9174
16359b1175R6530J6072R43N9909o5434L73N7655j22440j58511j19580l9258J2777
16347b82139J07848P4973k3447R1928J45766n942o6764l8614p7573J5512K9237
16336b9215K8689L6904J9024J3920p4879m4168Q519j526r8928N1229J309J6621
16324g2501Q6613l4684q302M4121o3029j29632L5415P5361L2328o3772j084J02138
16312B972R15l6011j438l0436K1526R717K0160l8514m2593k0993M0681N1995j349
16299b3368o8231p9736J66862j2719l2980P5470Q2623n1942o6731j4472j259q2200
16287a08683J13738L9838j45581o0182k0926J7777P3041m3944p6864j8032N989
$$ y = [-16176, 18861, -49430, -128059, -100951, -112129, -169947, -88560, -47778, -61673, -88951, -70349, -21175, 75355, 91427, 92370, 152279, 86845, 87218, 144873, 22433, -136078, -255658, -294916, -282139, -174291, -99318, -122765, -30837, 114929, 108987, 42223, 3609, -73964, -58452, -29215, -526, 36378, 55402, 69322, -5557, -49725, -41206, -42732, -141660, -90431, -89122, -72501, 14112, -20572, -28874, 15247, -47782, -177414, -141999, -66638, -34310, -98082, -99166, 2972, 3887, -32124, -33562, -63998, -42472, -32755, -12595, -51109, -93702, -114695, -74014, -22019, -23368, -91599, -171335, -4473, -17192, -50172, 25298, 107921, 55979, -10752, -25224, -26483, -108683, 5055, 44893, -100688, -160870, -181796, -164019, -90978, -134922, -211786, -229818, -223829]
16276b23829M2814N9543L352J3250q5495M426Q9836O9790r7827m7050j6785J4201
16264a73774M2661L436J07016o92k3752J13131O5687K1613l8540n5368k0198L3531
16252G4751m482l977N113l4731M1599N2523L5384p3601P1445r8584j34640j1476
16240h0676K280K2749M7885J06585L9628m5307l2792m5371J4468m9021m4J1442
16228h174P0684n880J5018q2935k8114P3277P105l1610j09079J2500k0315l6268
16216a43791J26876Q8327k9254n7969k8413O7677Q4727j66748q8040m3292O408
16205a83492m3966K8416J42356m6231j12837r5720M3941J6523J62494J13500q822
16194A6162o1818N4563r933k3807k6042j4147j7472J06274L5586k0337p2803j1500
$$ y = [-223829, -181015, -121472, -118120, -104870, -190365, -185939, -96103, -26313, -124140, -171190, -187975, -173774, -131113, -127677, -20661, -21353, -45105, 68026, 133713, 155326, 116786, 61418, 41220, 74751, 70269, 66292, 71405, 36674, 78273, 130796, 166180, 92579, 164024, 65440, -69200, -80676, -78396, -55647, -7762, 98823, 138451, 93144, 60352, 14981, 29449, -19572, -19616, -8174, 62510, 56630, 71648, -11287, -39401, 33876, 40981, 9371, -99708, -87208, -107523, -143791, -16915, 71412, 42158, -15811, -44224, 23453, 108180, -58568, -146608, -189900, -183492, -227458, -199042, -56686, -102917, -215754, -311474, -267533, -251010, -88516, 24984, 16162, -45656, 8907, -1026, -24833, -50875, -65022, -82494, 23780, 59366, 39029, -33774, -45274]
16182d5274l7294j6344l94l4673n9773L1004l3432l897J11462q493n383j9041
16170a21532N2405P9549L0754M6402Q3301r5197m0571P741o6985O14M505o7118
16158h6132l5118J21465Q8590O2800K0743j10910k05175m4799M4092J12516M0678
16147H750K7200q9712L2955L3869R961m894q30j2330L5375j8004n343J0518P504
16134C5019m9354r95J0418J0629k7967J9654p639J9443J01359R856l4471o5153
16122B0799r6211O9872J20337p4582K4603l1529l9014N6994Q26r4234k9784J63026
16110I1103m7644O0004M5696k5774j39039n2901J6974l7817Q853K2004p1831o1162
16098a91534J2990J07138o716k1071n7491J7435L6215N2872k7507k885k763J1065
$$ y = [-45274, -82568, -98912, -99306, -133979, -193752, -162748, -196180, -200077, -88615, -97108, -102491, -121532, -69127, 10422, 41176, 87578, 170879, 75682, 35111, 42852, -24133, -23519, -19014, -86132, -121250, 215, 88805, 151605, 172348, 61438, -143737, -188536, -144444, -31928, 8750, 35950, -53762, -20807, 13062, 23023, 18129, 17299, 4969, 40344, 22340, 16997, 27515, 35019, -14335, -15330, -4912, 5717, -22250, -2596, -10235, 9208, 110567, 120423, 85952, 20799, -75412, -5540, 114797, 40215, 64818, 33289, -5725, 51269, 52095, -42139, -71923, 91103, 43459, 103463, 149159, 123385, -15654, -68555, -51581, -89398, -80545, -58541, -130372, -191534, -178544, -71406, -78122, -99193, -156684, -139249, -103034, -50162, -77669, -80554, -83317, -72252]
16086g2252p532J10108r3761q2383J13944L7038p3514n4439j0428P8154q0221
16075a35286M5958m0965l7641j03434M0046P1199J51305J34576l4090p1157q4075
16064f3564r2370k5905n9545J19161L027O4617K2460r2477l2745Q9609O1884Q7231
16052H1383j7019k845L9506l7991j78973j19485K169M5520J2199P1006l903P8741
16040b9692l5510J3292J80492J4084j08425n0572j9533M5416p9050j6099K9431
16029e6166J312J1284j2841P228P326M5014j4645k2127P5857o5817N1713P6404
16017A04542j06291j43412j34098j4756O6569P7603K3510J984k9893J28722n5958
16006h1478o9914j06168K6061J21961J40214O8301n4337m6714J5766N6544n6390
$$ y = [-72252, -79784, 30324, -63437, -145820, -31876, 5162, -68352, -122791, -133219, -55065, -135286, -89328, -130293, -167934, -271368, -231322, -160123, -8818, 125758, 91668, 20511, -63564, -155934, -181839, -241384, -122223, -119196, -54579, -32119, -124596, -157341, -67732, -5848, 81383, 64364, 61519, 101025, 63034, -115939, -235424, -233255, -187735, -175536, -104530, -108433, -29692, -65202, -51910, 128582, 142666, 34241, -16331, -35864, 9552, -69498, -85597, -56166, -54854, -43570, -56411, -49183, -41857, 3157, -11488, -33615, 42242, -23575, 28138, 104542, -1749, -145161, -279259, -294015, -227446, -149843, -126333, -124349, -154242, -25520, -81478, -151392, -257560, -231499, -109538, 30676, 98977, 44640, -2074, 13692, 70236, 13846]
15995A3846l4221J591M3659p4867j37323J991K13250N402q8979l9158k6935k9219
15983a50963P2873n9792p453M9624J07758K5540J11780P3872j06873L658J17490
15972B37514M6950K5362j56632m7350P9576J07412J9571m4775m8289l4899o7987
15961A16453r1836J4358J2580j4786Q9153J03149J91j09933o2339r0541p4221
15950a07772J2729n5741n0486N7349J05481N6102l8781j0714m933O5165j07724
15939g9325K7907J2189Q4043J11605l352n8679r5121P1852N341j547k9822j8197
15927B6894M0457L2567j5195k1259o4811J2088n5702K4173Q2630p7819p3120n5571
15915a44668J39229N3311Q8300J7891l4643K0233n5952m9517p7925j7278J63343
$$ y = [13846, -20375, -18784, 24875, -49992, -187315, -185324, 27926, 33328, -55651, -94809, -121744, -150963, -78090, -137882, -145335, -95711, 12047, 37587, 149367, 223239, 116366, 120024, 237514, 284464, 309826, 153194, 105844, 185420, 292832, 312403, 267628, 219339, 184440, 116453, 24617, 38975, 51555, 36769, 125922, 229071, 229262, 119329, 56990, -33551, -107772, -95043, -150784, -201270, -143921, -38440, 17662, -21119, -31833, -36766, 28399, -79325, -51418, -39229, 44814, 156419, 153067, 94388, -733, 71119, 76460, 74913, 45091, 26894, 67351, 99918, 84723, 63464, -1347, 10741, -44961, -20788, 61842, -15977, -89097, -144668, -5439, 47872, 136172, 154063, 119420, 139653, 83701, 34184, -43741, -61019, 102324]
15904A02324Q0739p8392j48162L5371J49578j6927p0121J51173O8657o2426j52685
15893E9129p9121r9947n3032J6148p059J98073K0023l6957p4064Q991L9883N3899
15881D5966K2059j26233N102j1495q6049L2915J634J6122K49630J4428n9121l1580
15869G3378J2224n263K3961N5697k1204o6125p5598l8136O2413J45380m0564o5968
15857F0195Q52J5456o3384n5362J9945J05932M2560J565j13683j21629j17319
15846b24872l52J21820m9198m8958k9819J1620L7371Q0557o859r975k4644M7718
15834i5591l5826m8459J03086K0172r8929k1473J12777N5923j6880O7427O2711
15823A04938Q3489N9138k6164m0375k4413J0160n9698J8227L6863N1027r4597
$$ y = [102324, 183063, 104671, -43491, -8120, 141458, 124531, 54410, 205583, 274240, 211814, 59129, -19992, -119939, -172971, -156823, -163882, 34191, 54214, 17257, -56807, -47816, -7933, 45966, 68025, -58208, -53106, -64601, -150650, -117735, -116101, -99979, 149651, 164079, 104958, 73378, 85602, 80339, 104300, 159997, 138793, 72668, -2930, -41066, 21347, 166727, 126163, 60195, 61047, 76503, 13119, -42243, -22298, 83634, 126194, 127759, 14076, -107553, -224872, -225224, -103404, -152602, -201560, -231379, -219759, -182388, -101831, -108690, -118665, -143309, -95591, -131417, -179876, -76790, -56618, -155547, -177020, -64243, -8320, -25200, 42227, 104938, 188427, 247565, 221401, 181026, 156613, 166773, 107075, 125302, 162165, 213192, 118595]
15812A18595N6618k2100m9830j19335n2639r456k3381M2723P0821k5844n6400
15801g0228p8239j212P4597N264l95R253M081O917J20476n143j10628P3821Q5160
15788A13724n9254j5732J05875r7069j07574L7707P5570p1554p6662p5614P907
15777a62676o8429O3711N9354P8018K8391p0331q0477n3199j7750J24708J25242
15766B6562R2559l3221j90261p0856n528n1507o4606L6207L7137O5522M5546L6233
15754g6213J01657J4886j8291p1225N1942j35630p9843M7638p2835K3228m256
15743b18942O5455N3031J21552M4707k878k3146j06780m8696O8573N0947q7540
15732h3717O7272J02539J59149m0936r1058l6021q6862j218L4231j07718k5354
$$ y = [118595, 175213, 153113, 103283, -16052, -68691, -78147, -101528, -58805, 12016, -13828, -70228, -148467, -149679, -75082, -69818, -70213, -60960, -56879, -49962, 70514, 65371, -45257, 28564, 113724, 54470, 38738, 144613, 47544, -60030, -22323, 53247, -18307, -94969, -170583, -162676, -231105, -167394, -108040, -30022, -1631, -71962, -152439, -205638, -223388, -98680, 26562, 119121, 85900, -104361, -175217, -180745, -232252, -296858, -260651, -223514, -157992, -112446, -76213, 25444, 40330, 22039, -49186, 2756, -132874, -212717, -165079, -237914, -214686, -218942, -153487, -100456, 21096, 65803, 62925, 39779, -67001, -115697, -47124, 3823, -83717, -16445, 86094, 245243, 204307, 113249, 77228, -9634, -10852, 23379, -84339, -109693]
15721a09693k1028K8687o8379m00M3291K3639K2288M1757m0028m7298M9569N7171
15709b0424K8285p5747M197m263m8984j4476r913J01614K2010r742j5560r1936
15697a34939L0644R4400M5295p6146j32671N4116j9053K8842R4497J40383K5068
15686A50436m9411o4693k5577L0150J01721k2352J772o2512m2120j1933m4624
15675c9143L4068N264p0275j2723l5227J0446R6484O0285J32435j8157L3446j33674
15663F3229k43059J5342J53870m3957k4736l0602J946l9854M4295P5317M9247
15652B1038K9440N8550K9234m0818J4261J1443q0383o7791j40975j6787L5331
15641a47457O8194M7367j37j0527Q8600M5768R44J4378Q1946J18706k2087k3727
$$ y = [-109693, -130721, -102034, -170413, -170813, -127522, -103883, -81595, -39838, -79866, -127164, -77595, -20424, 7861, -67886, -63689, -67952, -116936, -131412, -141325, -39711, -17701, -27443, -43003, -134939, -104295, -9895, 35400, -40746, -173417, -119301, -138354, -109512, -15015, 125368, 150436, 101025, 36332, 10755, 40905, 142626, 120274, 122046, 59534, 17414, 5481, -39143, -5075, 189, -70086, -82809, -118036, -107590, -11106, 49179, 181614, 163457, 196903, 63229, -179830, -164488, -10618, -54575, -79311, -109913, -107967, -147821, -103526, -28209, 21038, 50478, 109028, 138262, 97444, 111705, 123148, 42765, -25026, -166001, -182788, -147457, -79263, -31896, -32033, -42560, 46040, 91808, 92752, 107130, 189076, 307782, 285695, 261968]
15629B61968j19646j18841K4278P5019j1695k3118l8699l2112n9457p9169M5650
15618g5822J07373R3407j0739r2457q4472O170R2574J9903j4479j15842K5689
15607d8695L665Q210k946n2486l0516J03245J85945j7735n9480l0565o2465n5155
15595e8978N6606o9743l5594M7142m0840R139J48250K340J51180N9819o0765l1991
15583A76565O2921j10697r3640J14537o0455r5789P9341m2458p8062O6044q623
15572I684p8781p6973J161N0125J76623J13301p5061J5506M580o2153p0433q6183
15560g8604k8863M5200M7338K0517r4939m1182n8631q434L3999Q3583J57947J43639
15548B21570m1485j71435j15541m8067P9269j9291l0670Q1629L5751j9934M6715
$$ y = [261968, 142322, 23481, 47759, 122778, 111083, 87965, 49266, 17154, -42303, -121472, -75822, 31551, 124958, 114219, 21762, -62710, -56540, 36034, 55937, 41458, -74384, -48695, -45030, -36820, -39766, -92252, -122768, -19523, 166422, 148687, 89207, 58642, -3823, -58978, -2372, -72115, -107709, -60567, -101407, -92268, 55982, 58322, 209502, 269321, 208556, 176565, 239486, 128789, 35149, 149686, 89231, -6558, 72783, 30325, -47737, 18307, 9684, -69097, -146070, -144909, -94784, 81839, 195140, 120079, 135585, 140165, 78012, 7579, -78604, -107467, -62267, -14929, 5588, -89351, -130533, -189164, -197598, -163599, -80016, 77931, 221570, 180085, 8650, -106891, -154958, -75689, -94980, -125650, -44021, -8270, -28204, 18511]
15537A8511k9801j4447j8334j3811l4009j05068r9M2311k2280l3958P6213K26632
15525I1860j6718m3012L594P289M293j08619q1380J7496M4318J2541J00734Q7681
15513A20077J3152J08j40136m8115j62240J09344L6754j0639L1151J31217N8870
15502A39543m1163k5368J40786o6967j93605n2029N0707k9071L2601M3732K7839
15491B7005j6049K4881m5114Q8661K881o7155n8486l97r791j15683j2828R6654
15479h5421J09784J22430k27362j98570J27761J03752P8069J03977K711j53317
15469a6186N8987L4243j2019p8685m9398n7703l843N0501J04352J068p5028j5293
15457e9004l3096n2179Q9663l9704J9626P2306N8584O3717q5713J3106Q146n6257
$$ y = [18511, -11290, -25737, -44071, -57882, -91891, -196959, -197058, -154747, -177027, -210985, -134772, 91860, 75142, 32130, 35724, 43013, 47306, -61313, -142693, -125197, -80879, -68338, 32396, 120077, 133229, 133337, -6799, -54914, -217154, -107810, -71056, -81695, -50544, 80673, 139543, 98380, 73012, 213798, 146831, -46774, -98803, -48096, -77167, -44566, -834, 27005, 10956, 35837, -9277, 79384, 82265, 15110, -43376, -43773, -53564, -169247, -182075, -85421, 24363, 146793, -80569, -279139, -151378, -47626, 30443, 134420, 137131, -16186, 42801, 77044, 65025, -13660, -63058, -120761, -124604, -74103, 30249, 31317, -43711, -59004, -92100, -144279, -54616, -94320, -74694, -2388, 56196, 119913, 34200, 47306, 55452, -805]
15445h05J2599J0622n456L6572L1348J4795o2071Q293P7541K1066P6654o2239
15433A58919m3651o3290q6638m7550j0971q350n5338K1774j5616M6970l07j1563
15421a15611P8815J990n753J11730O9729n9480r1254j02956o640j1158J02727
15410b7861O9172m1443l8504j1334R7825N1569O7878J0769j50404m9123n4878
15399g6334l8105L7077N8555J76644m3035L0238o44k7936j79465r8582J23086
15388c8501K5276j14711L977p8183K7841J47052N9176M3790l0620n3810m2082
15377e0795P4332P5139K9129j1682k8584j94p9497j53168j26563l5599N2489K39517
15365a5476Q0345K7794L2505k7149k2374j47801j43199K9540J63442R7338j0873
$$ y = [-805, 11794, 22416, 16960, 53532, 84880, 99675, 37604, 45897, 123438, 144504, 221158, 158919, 115268, 51978, -34660, -82210, -93181, -101531, -156869, -135095, -150711, -103741, -104048, -115611, -36796, -34806, -40559, 71171, 140900, 81420, -9834, -112790, -119430, -130588, -27861, 41311, -132, -38636, -49970, 47855, 99424, 167302, 178071, 27667, -21456, -76334, -114439, -77362, -18807, 157837, 114802, 145040, 144396, 116460, -63005, -161587, -38501, -13225, -127936, -123959, -202142, -174301, -27249, 31927, 75717, 45097, -8713, -50795, 23537, 98676, 127805, 116123, 87539, 87345, 7848, -145320, -271883, -307482, -254993, -15476, 64869, 92663, 125168, 98019, 75645, -72156, -215355, -185815, -22373, 74965, 64092]
15354F4092J14380N013j26574k5227o0378J9777M9972P1944N4256j22265J6299
15343F1289R5848P5358L1208N9998m0793k63571j14601O4258O431m14k9593p6298
15331a30880j1735n6021q6607O3702J91328R8795L0203n5900O043P883m0745r6259
15319h0193Q9473p0728q5652j7188J02113J89671n3395p6952p1299p1446O674
15308a38922J7185Q5625O8370j4749o4700J39227J39726j24475j68711r2445p7481
15297b31350l7620J48102L9246K451M1450O380M0736k5282q3140j6695k3272m4689
15285a83683N5623P1042k251J3061J2480K4345J7008O7526o8846k2327m3625J0636
15273d9011R9782O9106M0612M9644p6538j00030o9951J2841J905J22334O0936
$$ y = [64092, 178472, 183485, 56911, 31684, -28694, -8917, 41055, 112999, 167255, 44990, 61289, 157137, 232495, 263703, 323701, 282908, 19337, -95264, -31006, -24575, -24989, -54582, -130880, -142615, -198636, -285243, -221541, -30213, 68582, 98785, 42885, 48928, 56811, 16066, -80193, 9280, -61448, -147100, -164288, -62175, 127496, 74101, -2851, -74150, -145596, -138922, -121737, -36112, 32258, 17509, -47191, 92036, 231762, 107287, -61424, -153869, -231350, -268970, -120868, -81622, -79171, -37721, -31341, 9395, -15887, -99027, -115722, -138994, -183683, -128060, -57018, -59269, -46208, -33728, -9383, 7625, 75151, 6305, -16022, -59647, -49011, 50771, 119877, 160489, 210133, 133595, 33565, -36386, -23545, -21640, 100694, 161630]
15262A61630j56418k808P5400j4675n9947r1479k2716r2418J2572r8461o3393
15251c52713l4578J95758Q0466J918L4686J44176R3081l7110q4597n8751K8372
15240A0708M1301n2204J24127K8282j18390j05763L1340J22868m3318j15228P1178
15229e099J5750k1253R779N1324q790Q888O7855m4760j58629q9215Q6852J24709
15217C7411Q3502o8607J26017m0191j27870q3694l8940R999l8462J00854J17351
15206G7370J10434j20537j20173N0515Q027N996K5362o0007l0475Q3586R949o3783
15194b3736n8357P0165P0317q2846m983p4001p4264K4604q0167M5928J94394m151
15182B903m1801m9819j77032m9203O5070J63675J7012q259O9223k7441j25292
$$ y = [161630, 5212, 2404, 77804, 63129, 3182, -88297, -111013, -203431, -190859, -289320, -352713, -387291, -191533, -111067, -109149, -74463, 69713, 162794, 125684, 41087, -17664, 10708, 52009, -195, 123932, 152214, 33824, -71939, -40599, 82269, 38951, -76277, -5099, 10651, -10602, -823, 50501, 41711, 50599, 118454, 73694, -84935, -174150, -87298, 37411, 120913, 52306, 178323, 138132, 10262, -73432, -112372, -102373, -140835, -39981, 77370, 187804, 67267, -52906, -2391, 5636, 11632, 36994, -23013, -53488, 30098, 40047, -23736, -82093, -11928, 58389, -24457, -29440, -103441, -177705, -153101, -233268, -187340, 7054, 2903, -38898, -88717, -265749, -314952, -249882, -86207, -69195, -77454, -8231, -35672, -160964]
15171a60964P675K0400L0601m1695k9865J35296K8367J01883Q159j15873r983
15160b5999j8002l4561m5582J20488M0960J0583m9839q0350m9430J07533k5892
15149e0091k3741M0532q26j10043M8643J32197J01554n887o4880j42813j9774
15138i5129N1481J51389k9504j87276K2324M9015K088P8570N1890m9579o2839
15127a7570N3590J43932o5668r1514j33649l4413O005p0537P1061L3583p8965
15116a84145r7267M5737M7370J89532o3811r2781r2295j0440K6826L3641J03828
15105i3805J72861K3794j52215j40640k6093N8692k1039L2931O5281Q3256J02837
15094A05860N6507j00334j07913m4024j6551l0410J4767N5749K39235M2051k14606
$$ y = [-160964, -153289, -132889, -102288, -143983, -173848, -38552, -10185, 91698, 99857, -16016, -25999, -44001, -78562, -124144, -3656, 37304, 47887, -1952, -82302, -131732, -24199, -50091, -73832, -33300, -34126, -144169, -95526, 36671, 138225, 132338, 67458, -75355, -95129, -43648, 107741, 78237, -109039, -86715, -37700, -35612, 42958, 94848, 45269, -17570, 36020, 179952, 114284, 22770, -110879, -145292, -139287, -209824, -138763, -105180, -184145, -281412, -235675, -188305, 1227, -62584, -155365, -247660, -258100, -231274, -197633, -93805, 79056, 102850, -49365, -190005, -216098, -157406, -178445, -145514, -80233, 3023, 105860, 162367, 62033, -45880, -89904, -106455, -136865, -122098, -66349, 172886, 214937, 331]
15083C31j3723N0862L6359Q8745Q2812j53329o2852m7680p2442k2649q5144J38251
15071f0459O9573N7843l0676l5487J07598N481o2332r3917l2343M9236n040R6321
15059F5798P4830l3544l1608O3106o3366j95806l3247N3684J91867N6854o451
15048A42117j04196j05211o9719J0442J69283n8900K6608l1327j03182q2982N2228
15037a54839L667n3937J77202N1155n0780r620j60637n4253N8200N3390L0109
15026a10343j8810Q9391N2413J05409L9301j45459p5153K2116K9384O1131o2224
15015a2844m1501o8943r9966N1233J86088J14616M3852q7017m1714M1232Q5546
15004A70582k05195J7760J01871K1135J12381m5924p8288k2449j66675m5767n0113
$$ y = [331, -13392, 37470, 73829, 162574, 245386, 92057, 29205, -18475, -90917, -113566, -198710, -60459, 9114, 66957, 36281, 794, 108392, 113873, 51541, -42376, -74719, -25483, -30523, 65798, 140628, 107084, 75476, 138582, 75216, -120590, -153837, -100153, 91714, 148568, 142117, 37921, -67290, -137009, -126567, 42716, -16184, 10424, -20903, -124085, -207067, -154839, -151172, -205109, -27907, 23248, -27532, -37152, -197789, -252042, -193842, -140452, -110343, -129153, -39762, 12651, 118060, 157361, 11902, -63251, -41135, -11751, 49380, -12844, -54345, -123288, -223254, -172021, 14067, 128683, 172535, 85518, 43804, 85036, 170582, -34613, -16853, 85018, 106153, 218534, 172610, 94322, 71873, -94802, -140569, -190682]
14993a90682L4788O6245N9906q2353Q6446k0042p6543q7462j0613R4981J34923
14982I594K7362j02395o947n9245n6408N1164J05613J10270q4327j30102Q5540
14971d9881j3334J8343m5734k0218m584k42p831L9284M1963q230j12742j4935
14959a78141K5447L768M2179j47814J08494N6845K6550K4140k2239K2989Q7619
14948D9837J8119k7615j32298J5441M524j3668Q0263n484j02373m8014p5299J69032
14936f7535Q6413n0602j1179J4367R2116j2821q7037L2185m1752l0810K6924M0492
14924i239P2979M6728j30975j27121J25513l9022j10747o2496m946J76427K49445
14913A86546K6083j1082j08800p4479k278j6934Q4168o832k9841k8272j11502
$$ y = [-190682, -155894, -89649, -29743, -112096, -25650, -45692, -122235, -209697, -220310, -125329, 9594, 36956, -65439, -72386, -131631, -188039, -136875, -31262, 79008, -5319, -135421, -49881, -63215, -44872, -90606, -110824, -115408, -115650, -123481, -84197, -42234, -50464, -163206, -178141, -152694, -148926, -106747, -254561, -146067, -89222, -62672, -38532, -60771, -37782, 49837, 67956, 40341, -91957, -76516, -71992, -85660, -5397, -10881, -113254, -161268, -236567, -67535, 18878, -31724, -42903, -28536, 63580, 50759, -36278, -4093, -45845, -76655, -49731, -9239, 63740, 110468, -20507, -147628, -22115, -61137, -171884, -234380, -239326, -62899, 186546, 212629, 201547, 92747, 18268, 15990, -944, 83224, 76392, 46551, 18279, -93223]
14902i3223O0702R0316k9661j09039p9937n2588M0271J55440O2624r0424o4757
14891a10276O422J06403j5915m1846J1328J52168j7109o5419o6407K8689J3303
14880A341J42568l4014J818l7276l5919L8431p1854n6306q2463N2100Q2844Q810
14868A0080n7590M8229O4184o3128P0395L8747n7849p4155n7985K0709N2865K2435
14856A6937L2505R4496K3568k1197J2111j5657m5602M763R6749N7361j8173n4018
14844A83843j02053O6595K8612q5493j43345J8118J5929j1506j8564j0086J0964
14833d6986P3647J38074L0620j13592O0015R1334j11817j79037k1155N3024j7575
14822d3448k8752P5419J7723p1602R551P3473J2371q6445m9369j6325P8172N9181
$$ y = [-93223, -32521, 57795, 28134, -80905, -160842, -213430, -173159, -17719, 44905, -45519, -110276, -103854, 2549, -13366, -55212, -43884, 108284, 91175, 25756, -40651, -11962, 1341, 143909, 109895, 111713, 74437, 38518, 76949, 5095, -51211, -133674, -81574, 1270, 10080, -47510, 719, 64903, 1775, 72170, 110917, 53068, -21087, -79072, -58363, -5498, 16937, 49442, 143938, 167506, 146309, 158420, 142763, 97161, 101924, 198673, 256034, 237861, 183843, 81790, 148385, 176997, 91504, -51841, -33723, -17794, -29300, -47864, -57950, -46986, 26661, 164735, 195355, 81763, 141778, 233112, 121295, -57742, -78897, -25873, -43448, -72200, 3219, 20942, -50660, -41109, 32364, 44735, -41710, -91079, -107404, -29232, 29949]
14810B9949J9623n2691M0538n1833r4406J38599J83021j13087o261K1761O3962
14799A79175P274j34480l7396L3837l4266l2074N5757R9103j1195j07165j2131
14788F439P7552J0016j03880o9879M6758o9177N5658P8863j5615k273M0581o3456
14776h413p8633j9744P3980k5983Q5712K1289Q526O3741p9549O3719m7323J0560
14764F7882n9013J2092M8316o2307J04815k6606q1372M5480M9573k2961j2316
14753F3583J82244j9275q2248j3705j42692M4808L2271m8496L946q2208o4994
14742a26766J7219k8681R0334n2743j3147O1875N37J5138r4106k1076k2788J7475
14730a56729Q0240J8307m8704R0624Q6891o9521J6796O0704j16233q6447J37696
$$ y = [29949, 49572, -3119, 37419, -14414, -108820, 29779, 212800, 99713, 93452, 115213, 179175, 186449, 51969, 14573, 48410, 14144, -17930, 37827, 136930, 125735, 18570, 6439, 83991, 94007, -9873, -79752, -32994, -102171, -46513, 32350, 16735, 14462, 55043, -8413, -87046, -106790, -32810, -58793, 26919, 48208, 56734, 120475, 40926, 104645, 57322, 67882, 8869, 20961, 69277, 6970, 111785, 85179, 3807, 49287, 98860, 75899, 63583, 245827, 226552, 144304, 130599, -12093, 32715, 64986, 16490, 20436, -61772, -126766, -109547, -138228, -47894, -100637, -113784, -51909, -51372, -36234, -130340, -151416, -174204, -156729, -76489, -58182, -106886, -16262, 70629, 1108, 17904, 78608, -37625, -124072, 13624]
14719A3624R6456o4929j4462N7054L1036j09771N4525j3564m76M2071l2395q1921
14707b2752n8767L8435K7785K6792m912P8913m2814n4188M067n2847n1728l0794
14695a42810O2768J3648m4694N2618N9385m1313n7347J10928M4741p4701m0070
14684e6847J8771Q8781n3050q617j5327M3251M6642O8630o0074p3206j78159L9122
14672a40083R970L1002l3778R9412J88863L1528o3637o7563n8108O9615P505R2873
14660A67599R7710J05463p2007j53853n0429l6289j11391N4480P4751j3717m6133
14649A6184l0907J2763J19091k2294j012j48760p0249M9210K9460J60887K3117
14638A37490q8531p7364j4441O7201L0232J5608R6681k9613r078L277o4732r4368
$$ y = [13624, 110080, 45151, 30689, 87743, 118779, 9008, 63533, 49969, 49493, 91564, 59169, -22752, -81519, -43084, -15299, 11493, 6581, 85494, 42680, -11508, -7441, -60288, -112016, -142810, -80042, -66394, -111088, -58470, 915, -40398, -97745, 13183, 57924, -16777, -56847, -38076, 50705, -2345, -10962, -26289, 16962, 63604, 132234, 72160, -1046, -179205, -140083, -130113, -99111, -132889, -33477, 155386, 186914, 123277, 55714, -2394, 67221, 74726, 167599, 265309, 370772, 298765, 144912, 94483, 58194, -53197, 1283, 76034, 62317, 16184, -14723, -1960, 117131, 94837, 93825, -54935, -125184, -75974, -46514, 114373, 137490, 48959, -28405, -42846, 24355, 54587, 70195, 166876, 137263, 128185, 131462, 66730, -27638]
14626b7638J1946M305Q898K5653N109Q454p2131j2126n7656K02113J76118r6656
14614A76389j37237Q9053j5673o7645R1615Q3192q3598j02509j5472n0557K3607
14603h835K613m561l3879K6786Q6518o9289l3467n2441L9074L028r8095N6549
14591h5999J0387J787J4775j99342L629J20342L5110L6819M385M371j55915J2345
14579a97306J5360j22559O6269Q7114N0276N2432q0179N6691R4931P5585l3901
14568F4713k9633N9077K9485M1845j4839k15730M1666Q7610l3171O218L0873n4723
14556A3391L4433L9525L1094j6814N398l3901l3273P6145M0208J0362k5734L7447
14544A78281o606l5396m1866l6306J7449o129q8957j2839J373J20515J02008m6345
$$ y = [-27638, -15692, -11387, -2489, 23164, 28273, 36727, -35404, -47530, -105186, 96927, 273045, 176389, 39152, 128205, 112532, 44887, 136502, 219694, 136096, 33587, 18115, -32442, -8835, -6222, -10783, -44662, -17876, 68642, -647, -34114, -86555, -47481, -44453, -142548, -85999, -75612, -73825, -59050, -258392, -254763, -134421, -99311, -62492, -58107, -53736, -209651, -197306, -181946, -304505, -238236, -151122, -100846, -48414, -128593, -71902, 23029, 98614, 64713, 35080, 94157, 123642, 165487, 150648, -65082, -23416, 64194, 31023, 37241, 68114, 13391, 47824, 87349, 118443, 101629, 107027, 73126, 39853, 115998, 156206, 166568, 140834, 178281, 171675, 136279, 94413, 58107, 75556, 69427, -19530, -32369, -30996, 89519, 191527, 145182]
14532A45182q9976o0987N8525N7785q7955j05437k3746j57267r9171J24239M0532
14521a98276P0659p247L7718J79833q533j91400K3500R8672N3862O8533m4438
14510H2883p5544j15685n2141K1401n622p388N4888J08906M5601M3141k2956l7831
14498C9653k9765M3546K2280j6043M9254K411q6155J9116J7497m8040k710q5474
14486g4430p2161O8430J56173M5018K0842J15549M2784j60507j13393o4347n2827
14475h8869Q281M9828p0620p4173M7133M5264M4221Q877o5469j4787L2432M5138
14463c2744M6214N571L8243K4976r2122p0557L9932J60621k5944m7966N0084Q7291
14451A83599p5587j19801m0951M9324J1280M865m8259Q0839Q6087o7652L2153
$$ y = [145182, 55206, -5781, 52744, 110529, 22574, -82863, -106609, -263876, -363047, -238808, -198276, -127617, -134864, -97146, 82687, 74154, -117246, -93746, 4926, 58788, 127321, 82883, 7339, -108346, -160487, -139086, -144708, -152096, -97208, 11698, 57299, 100440, 77484, 39653, 9888, 53434, 75714, 59671, 108925, 111336, 25181, 44297, 61794, 13754, 11044, -74430, -146591, -78161, 78012, 123030, 143872, 259421, 302205, 141698, 28305, -36042, -88869, -80588, -30760, -101380, -175553, -128420, -83156, -38935, -30058, -95527, -110314, -77882, -32744, 13470, 19041, 57284, 82260, -9862, -80419, -40487, 120134, 94190, 46224, 96308, 183599, 108012, -11789, -52740, -3416, 7864, 12729, -35530, 45309, 131396, 63744, 95897]
14440I5897L8283L9721j5830j43737K1505j006m4545j1109N5051j2251m4189J4944
14428g266O2809l3127j31087R2670J26292N6675J516j19188k4293k5739r575O1423
14416E1110o5207K5156j8855k4229J25364l3435n7799j384M862L8883P4901J3447
14404A32814l1096j02153k4966M0490J7547J07281P7047o1897l297j1474q1967
14393E8329n6138q1058l6712N7051k9234o9926J38033R5388N2769K5002K4146
14382A77650j0158j2510j08179K6043O2053p8929p4226J2474J6805j06494l9383
14371a34854K6282l4634O1035O9076J544k4819M8259J43639j991q7374n5450m4312
14359c3599N3581R3560m1657n650p8881j13414J07999k1982j33022K1661M1301
$$ y = [95897, 134180, 173901, 158071, 14334, 35839, 34833, -9712, -20821, 34230, 21979, -22210, -7266, 55543, 22416, -108671, -16001, 110291, 166966, 168482, 49294, 25001, -738, -10313, 51110, -14097, 11059, -7796, -32025, 93339, 59904, 2105, 721, 5583, 44466, 119367, 132814, 101718, -435, -25401, 15089, 32636, 139917, 216964, 155067, 151770, 140296, 58329, 2191, -78867, -115579, -58528, -87762, -157688, -19655, 75733, 128502, 153504, 177650, 167492, 154982, 46803, 72846, 134899, 55970, -18256, -5782, 11023, -95471, -134854, -108572, -143206, -82171, -13095, -11551, -36370, 11889, 155528, 153537, 66163, 10713, -33599, 19982, 113542, 71885, 66235, -12646, -126060, -18061, -40043, -173065, -151404, -110103]
14348a10103O8667O4365Q4823q6744r0146l165P5889k8678Q672J5036m4151Q8427
14336D2892M2852n053j6360L6650J7143K5995l8982j72099J9606L0557j10762
14325a27561p8394M3756J19879O2200j4632L0301p170L8728L1278l2981k7262
14314C8142M4083l9466J19095N3182l0831J02336K1226j52148j48749O5812L4515
14303A07197m8800l4096j1500l3855O8631n4202J45235P1455j6606j51218n5000
14292a2759n1459q5505l9133O0310L42k204J9367J37569L9834M8377J5387p2771
14280E7355J4197J01178L9133j40168n3625p3947R6088O2420K3140j55640j34813
14269a64682r84M4937J10210O3443O834J15538O4911j0527q2440L7889n9752L145
$$ y = [-110103, -41436, 22929, 107752, 21008, -69138, -72303, 3586, -25092, -16420, -1384, -45535, 42892, 85744, 80691, 64331, 100981, 118124, 144119, 105137, -66962, -47356, -16799, -127561, -205955, -162199, -42320, 19880, 5248, 35549, 28379, 67107, 98385, 65404, 38142, 82225, 42759, 161854, 215036, 184205, 286541, 307767, 155619, 6870, 72682, 107197, 58397, 24301, 12801, -21054, 47577, -6625, 138610, 210065, 193459, 42241, -12759, -64218, -149723, -188856, -128546, -128204, -130408, -111041, 26528, 66362, 114739, 130126, 57355, 71552, 172730, 211863, 71695, 18070, -55877, 40211, 102631, 125771, -29869, -164682, -165666, -120729, -10519, 52924, 59758, 175296, 240207, 229680, 147240, 185129, 125377, 128522]
14257A28522l4883p714m433k3734J03873R9750L6747m0402j03479J3969l6014
14246A32202o2851j18330p5552O0013m764Q831k3543l3746J9556R6035M6028P444
14234E1323r4162k5723J29021J05998M8474r197o6269k5263n6822l0384K4028
14223E1024J04065J884j1217r1547P4275l4583l0878m4856J44363K06358M7713
14212D16601m2036j80218j04342R9565l4376j9137L6917j08200l3797J02609l3274
14201A00312m612N49L9209J21982j0227j27175J55055M6507j2671n7461j1458
14190B40010j05449M194O2237p2123o1210L9075p7245j29220R1604N2217k8256
14179A5834o7749J32226K7505L2128N3454O5936M7847q2058m8029J5604P0631
$$ y = [128522, 93639, 85925, 81492, 57758, 161631, 261381, 298128, 257726, 154247, 168216, 132202, 69351, -48979, -124531, -64518, -69282, -60451, -83994, -117740, -98184, -2149, 43879, 51323, -42839, -68562, 60459, 166457, 214931, 205734, 139465, 114202, 57380, 26996, 51024, 155089, 156973, 145756, 54209, 128484, 93901, 63023, 18167, 162530, 368888, 416601, 374565, 194347, 90005, 189570, 155194, 136057, 172974, 64774, 30977, 133586, 100312, 95700, 96249, 135458, 257440, 247213, 120038, 275093, 321600, 308929, 251468, 240010, 134561, 138755, 200992, 128869, 67659, 106734, 29489, -99731, -8127, 44090, 15834, -51915, 80311, 107816, 139944, 193398, 259334, 307181, 225123, 177094, 192698, 263329]
14168B63329l773J1531q4556p0334m8128n7298L0983J01298P118P9554L1909j13615
14156A48018o5757n9532P6992r6553K7655J17979J02285l6843r2254Q741j35020
14145d289P1965J34555m6167j22302l5249P5119J31046k9886q8243L5250O5835
14134A87634J3468L056o6660N1994k0695P5261O3093K6360r6186o5472n3131O6369
14122A85091J32874j3145j04698j07656L2546K5732J2255j00150l2396n6079P609
14111a8017R2697J24997r206K197k8629j28122n3047p7786k0954m6839J1813N0872
14099a00024J54744O2795q0952p2645k0725k4796P6740K0042m0173J0836K6185
14088A2027M0286l1931l5141j2246R6266k1987K51P4268P0633N7611k5594j7382
$$ y = [263329, 259556, 271087, 186531, 116197, 68069, 10771, 41754, 143052, 150170, 229724, 261633, 148018, 82261, 22729, 99721, 3168, 30823, 148802, 251087, 214244, 121990, 130731, -4289, 67676, 202231, 156064, 33762, -1487, 73632, 204678, 174792, 86549, 121799, 187634, 201102, 204158, 137498, 189492, 168797, 244058, 307151, 333511, 237325, 171853, 118722, 185091, 317965, 304820, 200122, 92466, 125012, 150744, 162999, 62849, 30453, -25626, -18017, 74680, 199677, 190471, 192668, 164039, 35917, -17130, -94916, -115870, -162709, -150896, -100024, 54720, 117515, 36563, -36082, -56807, -81603, -4863, 15179, -24994, -14158, 12027, 52313, 20382, -14759, -27005, 69261, 47274, 47525, 121793, 192426, 250037, 224443, 207061]
14076B07061P6957l3507j34700K2678R9746K336o4217l2267o5214K1080q817k2309
14064F8827j18747P5631L8995p0902J7710q925k4354M957N1986P7845J9723l0503
14052A02243k8977j1078J25695p684j09993j02930l7254N9736J09277O0009M8675
14041B07719O8550N6752m3423k16753p2937l1314l1546J05122R1003J06503N2440
14030B92116m7115o7067J7120r3429M4435n613L5993N0870M936R7587j2498k1689
14018B95646m291n9760o3084L5894P4091j04057j09325q9293J37717L4362L8717
14007A86617j1391L3152P3266j57705n2161k5714R0J40600J72455K459j2889j16222
13995B32557m1781j17627k4042N0748j7840L2738M2025k627P986K8200n2942r6951
$$ y = [207061, 284018, 250511, 115811, 138489, 238235, 240571, 176354, 144087, 78873, 99953, 91136, 68827, -49920, 25711, 64706, -6196, 11514, 2589, -21765, -16808, 35178, 113023, 132746, 102243, 73266, 62188, 187883, 180199, 70206, -32724, -69978, -10242, 99035, 159044, 207719, 276269, 333021, 289598, 72845, -92, -31406, -62952, 42170, 133173, 239676, 292116, 245001, 177934, 195054, 101625, 146060, 140447, 176440, 227310, 232246, 329833, 317335, 295646, 291355, 231595, 168511, 204405, 278496, 174439, 65114, -24179, 113538, 147900, 186617, 175226, 208378, 281644, 123939, 71778, 46064, 46154, 186754, 359209, 361668, 348779, 232557, 190776, 73149, 49107, 99855, 82015, 114753, 156778, 154151, 162137, 190337, 137395, 40444]
13983D0444o0977m4962J10416J75125M7048n9146l1494p0537M9980Q9117j08505
13972A36509j41172P8838K43477k392j13715r3771K3282K458q5983R1064j0538
13961A28057K3236l7019J3539O081p1667j24380r582J32326r436k02L6288q104
13949G9137J8842p4149j04488J7675J01579J7617K7672M8377P2166j3430k4539
13938A66459r028p2022L1569Q2541N5876M9453j54826o436K2620L6986L0438j65164
13926F8466q4835P1775J32265M7388l2815j9128Q0014J0230j12838q6855N1852
13915A25519L1104L209P5263K5470j40474K6462l2487o0704M517r8842q4070L4669
13903i0364J43839J71440K7566o1351p5673K7311R0324J39409j89911j66648L1547
$$ y = [40444, -20533, -65495, 44921, 220046, 267094, 207948, 176454, 105917, 155897, 245014, 136509, -4663, 74175, 317652, 315260, 201545, 107774, 131056, 133514, 47531, 138595, 128057, 151293, 114274, 127813, 133894, 62227, -62153, -71735, 60591, 51155, 50953, 87241, 79137, 97979, 23830, -80658, -62983, 38596, 56213, 83885, 132262, 204428, 190998, 166459, 157431, 85409, 116978, 199519, 255395, 304848, 150022, 143586, 166206, 203192, 233630, 68466, -16369, 55406, 187671, 235059, 202244, 183116, 263130, 273360, 160522, 73667, 125519, 156623, 159832, 235095, 260565, 120091, 146553, 114066, 53362, 57879, -40963, -125033, -90364, 53475, 224915, 252481, 191130, 115457, 142768, 233092, 372501, 182590, 15942, 47489]
13892D7489M9391q4976r3985j26096N2657J77642l62P0573j2719L6810q4944l9819
13880h339O9364n0313L0654J46934k8128j07968M4508Q6176j6427k4245r5874
13869D6342l0284L2080r315q2255O2373J51807L5714j7623r4639o5480j625n4602
13857b7507L184j8638J0291P4035J19079M4623m9212r0641q599J2292J903J15828
13845A86638J82875j13290j28559l0688J7115J01050l680j481l8029n9921q5718
13834B6312o092j8531q5674n1049J70065J115J06160J05330P5217m2650j01444
13823A78759j0151L4982p3008j7840J05435L3472j22811j7152q7726L491K426
13812B9877K7720L6580J05711M3643p5453P6007R1873p2365P181j28266k7164
$$ y = [47489, 96880, 11904, -82081, -208177, -155520, 22122, 21760, 92333, 79614, 116424, 31480, -8339, 61025, 10712, 41366, 188300, 160172, 52204, 96712, 182888, 166461, 142216, 46342, 16058, 48138, 38823, -43432, 18941, 170748, 206462, 188839, 94200, 28720, 27095, -27507, -24323, -42961, -32670, 41365, 160444, 205067, 155855, 65214, 56615, 68907, 70810, 186638, 369513, 256223, 127664, 96976, 114091, 215141, 211461, 209980, 171951, 112030, 26312, 20220, 1689, -83985, -135034, 35031, 36146, 142306, 247636, 322853, 280203, 178759, 168608, 203590, 130582, 112742, 218177, 251649, 128838, 111686, 23960, 27451, 29877, 57597, 94177, 199888, 243531, 168078, 244085, 335958, 263593, 270774, 142508, 115344]
13801A15344O7466p8457N221L2960K9243J25408k1661p1381q4265M2207r07O5357
13789B26535N0912j2841j19077L255o7462p0907k3208J5242k3994L1647j64823
13778a54721k2174J21431J27153J51300K2960k0028K4266n1402m3983q0102n5041
13767A9659n429L7834l7177J0177j9837Q5150n18j01703J14935P5790n4629p9752
13755D4500m971p9522O1356k540J4257J31703K4626K6919j4906M1792K777r3256
13743A52735j9650n2476p4427M0744n700J02925J2762l5805k220k4919l1526L9636
13731A02079R7174j0816O0680q0997j25655P1327M7257M6679L5474K9324P0461
13720C42987k4382o1340j66785j7886N8369O2020L2174L7435o053q9998o906k01
$$ y = [115344, 182810, 104353, 109574, 142534, 171777, 297185, 275524, 204143, 119878, 162085, 161178, 226535, 277447, 264606, 145529, 148784, 81322, 10415, -12793, 2449, -21545, 10102, -154721, -176895, -55464, 71689, 222989, 245949, 225921, 250187, 198785, 154802, 74700, 19659, 14230, 52064, 14887, 25064, 5227, 90377, 89859, -11844, 103091, 178881, 124252, 44500, 39529, -39993, 21363, 18823, 33080, 164783, 189409, 216328, 201422, 243214, 245991, 152735, 133085, 80609, 6182, 46926, 41226, 144151, 156913, 121108, 118888, 93969, 62443, 102079, 199253, 188437, 249117, 168120, 42465, 113792, 161049, 207728, 243202, 272526, 342987, 318605, 257265, 90480, 72594, 130963, 192983, 225157, 262592, 256539, 166541, 159635, 159434]
13708A59434L7249N4158r1354p7531o5517N9727J11648K9089l4916q3694L0000
13697A28293J50000L0112m8621j6777j30696N491N012k2268o068J09287l4763
13686A69002P060j6335L8694j34930k0996J83991O2973j28503o1393L5235l4770
13675A00028J9704l2787k0515m1996R1198O910Q9715J42234p3785n784k8733l9702
13663B06487L258L3353j1753r3793p3169L8739N4332K8679j8681K3656J16641
13652C07749L4073m1367q063O8905r2722n3253K7754J1371L4246n0019j11075
13641A27599J29962Q815n2117O321J5508r4829j3814O9659o2428l0834J3262k8876
13629H8228p2364N9951k9736K9704L3974R9109R7551q6543j28765L8542Q7204
$$ y = [159434, 196683, 250841, 159487, 81956, 16439, 76166, 187814, 216903, 181987, 98293, 128293, 278293, 308405, 259784, 243007, 112311, 117802, 122814, 100546, 94478, 203765, 169002, 176062, 159727, 198421, 63491, 42495, 226486, 289459, 160956, 99563, 134798, 100028, 119732, 86945, 66430, 24434, 115632, 122542, 212257, 354491, 280706, 274922, 246189, 206487, 209745, 243098, 231345, 137552, 64383, 103122, 157454, 186133, 167452, 191108, 307749, 341822, 300455, 292392, 361297, 268575, 215322, 243076, 254447, 288693, 238674, 127599, 257561, 266376, 214259, 220580, 236088, 141259, 127445, 197104, 134676, 103842, 117104, 88228, 15864, 75815, 46079, 75783, 109757, 208866, 306417, 219874, 91109, 129651, 216855]
13618B16855Q093K4758p7412j32810L463P5269N7622N2732o8253j16330o7964
13607b3977R4858J05901L4900J6013o58n2031k8275K300p9970q0545J05547O5076
13595A59139Q400P6062N250N960j22576r7600O2397J8417m4710N2604Q6825J6641
13583B26809L9059L210n2937o8223K3432O0544n9956n8410Q5524Q3603l5835L4505
13571B81325J4397J0112j34338j34328P495J0637j6376L2564J18237l896k4907
13560A60922n847Q8010N2704r7718j6673M4789j27966r4267o827j2140O4922J48238
13548A98147O9105M3429n4123l3207M3327O8727O2557K3545j88607L5998K8850
13537B97748j04493N0008O9169O4993k6317J9507R2426J1184k4319r6165j51002
$$ y = [216855, 224948, 249706, 172294, 39484, 42947, 118216, 175838, 228570, 160317, 43987, -23977, 70881, 176782, 211682, 227695, 227037, 175006, 146731, 149031, 69061, -11484, 94063, 159139, 167539, 243601, 248851, 254811, 132235, 34635, 97032, 115449, 70739, 123343, 210168, 226809, 265868, 269078, 216141, 147918, 171350, 231894, 171938, 113528, 199052, 282655, 246820, 281325, 295722, 305834, 171496, 37168, 44663, 55300, 38924, 71488, 189725, 185829, 160922, 155075, 243085, 295789, 198071, 181398, 226187, 98221, 3954, -2873, -15013, 49909, 198147, 267252, 310681, 256558, 223351, 266678, 335405, 397962, 421507, 232900, 268898, 297748, 193255, 243263, 312432, 377425, 351108, 370615, 463041, 474225, 449906, 353741, 202739]
13526B02739m0238Q3514K028L2910K5653J6268j13811n6320P2920M2283n5056
13515B12890l8480J7387P7956N9849k2559j9421K3420p2387m9688l3009k2559
13504A33399J2079O7019M0775P7589l4843l3651l3002M0455J30687N6630K8243
13493D85380k1092j83685n7414K8178N574o8232L5349k796k4760l8849N7612n293
13481B09972j2979J15830J04141n3118L5538k896r149j7216j64952j75766J28726
13470A58131J11388j2659j10191K761J21753M4K3519N9296k5346P081r38N1005
13458C85844l649Q4750L0059j08119q7856j55818j06312P4597J8792n3911J1921
13447I0298O3287o0841m9395K6738J59821J09239O9839P7931l8171K6409m929
$$ y = [202739, 162501, 246015, 248043, 280953, 306606, 322874, 209063, 152743, 225663, 267946, 212890, 174410, 191797, 269753, 329602, 307043, 287622, 311042, 238655, 188967, 155958, 133399, 145478, 212497, 253272, 330861, 296018, 262367, 229365, 269820, 400507, 457137, 485380, 464288, 280603, 223189, 251367, 256941, 188709, 224058, 221262, 196502, 157653, 215265, 209972, 196993, 312823, 416964, 363846, 399384, 396488, 387339, 370123, 205171, 29405, 158131, 269519, 256860, 146669, 149430, 271183, 271227, 294746, 354042, 328696, 335777, 334839, 385844, 382195, 466945, 497004, 388885, 301029, 145211, 38899, 113496, 132288, 78377, 90298, 153585, 92744, 43349, 70087, 229908, 339147, 408986, 486917, 448746, 475155, 470226]
13436D70226j38745j36243L13K2780M3070r907j07717m2519J41480j2275j5924
13425B14539J11647J3624o7942n7203O6331L2551m6455j80960J55831J15357R9064
13414D56384P9195p2810j14849q6382p1285L9730K23009Q4306q4418R1857M9587
13403E94324j74472j00969j47459p4388J32412J13239R1857R5077k8442J35557
13393F36736k4691n5944k7092j11134o4094m9811l1882J15850J131q1454q5563
13382B22052N5230Q6742k7761O603J35498J5157m247p5324j25909o0421k4574
13371B03046m6150J06829J68774P248n2417q3780k5030J60269O4865J47549p6412
13360E74791j45560R5810O0860K6008P998j18997j10112k9272R1000L7558M6604
$$ y = [470226, 331481, 195238, 195551, 218331, 261401, 251494, 143777, 101258, 242738, 230463, 214539, 326186, 339810, 271868, 214665, 280996, 313547, 267092, 86132, 241963, 357320, 456384, 535579, 462769, 347920, 261538, 190253, 229983, 452992, 537298, 452880, 544737, 594324, 419852, 318883, 171424, 97036, 229448, 342687, 434544, 529621, 501179, 636736, 612045, 556101, 529009, 417875, 353781, 303970, 272088, 387938, 389069, 307615, 222052, 277282, 364024, 336263, 342866, 478364, 493521, 489274, 413950, 288041, 227620, 203046, 156896, 263725, 432499, 439747, 387330, 303550, 278520, 438789, 503654, 651203, 574791, 429231, 525041, 585901, 611909, 619907, 500910, 390798, 361526, 452526, 490084, 536688]
13349E36688n256j9269j25095l2158K7840P9286M3143P7900n0827j03002K0650
13338D49900m7887n1033R6298N4589k5094J0103K3814p1516j15028L6903J48948
13327E09997K1372Q0845L6230j8670m3011j50760k3659K6548L3274k7042r303
13316D35821k8514q2250n8450O2227J12147N323l1574k4832r8383q824N0467P2423
13304D05581L9618n6490n7141L9385L9868j6699K3484j2825K9716p0691k3766
13293C40040J39868N6098N761j28967p9356q7926m2586Q8544P0017Q5593L7360
13282D84446R8772J9974k341n6513N3283J1743m3016j01594k02507J7902J46675
13271D26824O9574k1310R2391R6185r2934j73583K0680j3976N8562l1870p4944
$$ y = [536688, 531432, 512163, 387068, 354910, 382750, 462036, 505179, 583079, 532252, 429250, 449900, 402013, 350980, 447278, 501867, 476773, 486876, 510690, 439174, 324146, 361049, 509997, 531369, 612214, 648444, 629774, 586763, 436003, 412344, 438892, 472166, 445124, 435821, 407307, 325057, 266607, 328834, 440981, 446304, 414730, 389898, 291515, 282691, 333158, 405581, 445199, 388709, 331568, 370953, 410821, 394122, 417606, 404781, 434497, 363806, 340040, 479908, 536006, 541767, 412800, 333444, 245518, 202932, 291476, 361493, 447086, 484446, 583218, 603192, 600851, 544338, 597621, 609364, 566348, 464754, 262247, 280149, 426824, 496398, 475088, 567479, 663664, 570730, 397147, 417827, 403851, 462413, 430543, 355599]
13260C55599J44729J14605N7932o1356o8406p1921k3266N3822l8959O2079j1638
13249E13220n1683N259P1093Q8008J05998l0668n9550j98867n8125J01322L3167
13238E19174K5106l6763n6163J73231Q767k642J4807n7683l6598k3501N2267J8288
13226E98290j05773r7433P2960L2493m5979R1774J2935j38050p054N828M0065
13215D60056K7665M9155K26330o6160p1777J12043J68584R8428K4185r6728p3184
13204H58597p7708j14598q8725j753J67601N003j46429n3819j9485N7395L6125
13193F22204P2623R4034O7337l9754j28824n7452M6306q595O834L4948J6273L5108
13181G61042m6549o644O9970L7822j2315j4299l7571q2426K5709J12884P343J489
$$ y = [355599, 500328, 614933, 672865, 611509, 543103, 471182, 447916, 501738, 462779, 524858, 513220, 461537, 466796, 537889, 625897, 731895, 701227, 641677, 442810, 384685, 486007, 519174, 544280, 507517, 451354, 624585, 633352, 630710, 645517, 587834, 551236, 527735, 580002, 598290, 492517, 395084, 468044, 500537, 454558, 546332, 559267, 421217, 414163, 419991, 460056, 487721, 536876, 763206, 697046, 625269, 737312, 905896, 1004324, 1028509, 931781, 858597, 780889, 666291, 577566, 575813, 743414, 748417, 601988, 548169, 528684, 586079, 622204, 694827, 788861, 856198, 816444, 687620, 630168, 676474, 667879, 674713, 709661, 725934, 761042, 714493, 707849, 777819, 815641, 803326, 789027, 751456, 669030, 694739, 807623, 814966, 816455]
13169H16455J06328J81421J13188J7455j5452J75959J13348J4740r9713j02616
13159A321113j92952j57212N6113l796l8082j19146N5604P5j25326o2954L1454
13148G64891J5811M7252K7300l5752j43534j04347o6781K1350R795M1874J8783
13137E96642J8425N7946J84521J3378l9612J23040p8681j1842o4398Q5268L7271
13126I21958o2172l9916j5090p8622P5073J80245J62436J91320J72663j1903o7199
13115A428793j04735j47919j43455j50960M8831n5521k360m1682K3196o2424j77047
13104F14717O1540K53651J12081j30637q3852m5362Q0222O0060l9033o0504l4727
13093G88156o0215N3518p4589j26546L161P2171K7336O4319P6220m7435O2433
$$ y = [816455, 922783, 1104204, 1217392, 1234847, 1219395, 1395354, 1508702, 1523442, 1423729, 1321113, 1128161, 970949, 1027062, 1023266, 985184, 866038, 921642, 921717, 796391, 733437, 764891, 780702, 827954, 855254, 819502, 675968, 571621, 504840, 526190, 535985, 577859, 596642, 615067, 673013, 857534, 870912, 831300, 954340, 875659, 863817, 799419, 884687, 921958, 859786, 819870, 804780, 726158, 801231, 981476, 1143912, 1335232, 1507895, 1495992, 1428793, 1324058, 1176139, 1032684, 881724, 930555, 875034, 872674, 830992, 854188, 791764, 614717, 676257, 929908, 1041989, 911352, 827500, 782138, 862360, 922420, 883387, 822883, 788156, 727941, 781459, 706870, 580324, 583485, 655656, 682992, 747311, 823531, 776096, 838529]
$$ [...]
##END NTUPLES=NMR SPECTRUM
##END=
