##TITLE=Analysis number 324850
Compound Code cc 24326
Book Reference 407/135/1
Project Code adrs
Chemist Name andyw
##JCAMPDX= 6.0         $$ Bruker NMR JCAMP-DX V2.0
##DATA TYPE= NMR SPECTRUM
##DATA CLASS= NTUPLES
##ORIGIN= Bruker BioSpin GmbH
##OWNER= nmr
$$ XWIN-NMR		Version 3.5
$$ Mon Dec  4 10:37:17 2006 GMT Standard Time (UT+0h)  MAYBRIDGE\nmr@NMR_250MHZ
##.OBSERVE FREQUENCY= 250.131544655141
##.OBSERVE NUCLEUS= ^1H
##.ACQUISITION MODE= SIMULTANEOUS (DQD)
##.ACQUISITION SCHEME= undefined
##.AVERAGES= 16
##.DIGITISER RES= 18
##SPECTROMETER/DATA SYSTEM= dpx250
##.PULSE SEQUENCE= zg30
##.SOLVENT NAME= CDCl3
##.SHIFT REFERENCE= (INTERNAL, CDCl3, 0, 16.4485)
##AUDIT TRAIL= $$ (NUMBER, WHEN, WHO, WHERE, WHAT)
$$ ##TITLE= Audit trail, XWIN-NMR		Version 3.5
$$ ##JCAMPDX= 5.01
$$ ##ORIGIN= Bruker BioSpin GmbH
$$ ##OWNER= nmr
$$ C:\u/data/dgb/nmr/ADRS/120/pdata/1/auditp.txt
$$ ##AUDIT TRAIL=  $$ (NUMBER, WHEN, WHO, WHERE, WHAT)
(   1,<2006-12-04 10:36:57.82 +000>,<MAYBRIDGE\nmr>,<NMR_250MHZ>,
      <created by zg, POWCHK disabled, PULCHK disabled
       configuration hash MD5:
       49 4B E0 1D 92 C2 6B 37 9F E6 65 BC 52 41 86 1D
       data hash MD5: 64K
       B2 3D 7F B9 F9 A6 04 1A 3F C9 93 FF 1A BF E5 9F>)
(   2,<2006-12-04 10:37:08.82 +000>,<MAYBRIDGE\nmr>,<NMR_250MHZ>,
      <Start of raw data processing
       ef LB = 0.3 FT_mod = 6 PKNL = 1 SI = 32K 
       data hash MD5: 32K
       29 78 27 85 EC 58 3B 88 D0 1B E4 7D 81 AB 0B 01>)
(   3,<2006-12-04 10:37:10.39 +000>,<MAYBRIDGE\nmr>,<NMR_250MHZ>,
      <apk 
       data hash MD5: 32K
       4E 3B 8A 63 35 EC 1A A7 0E 7F F4 D5 AC AF C7 3C>)
(   4,<2006-12-04 10:37:11.07 +000>,<MAYBRIDGE\nmr>,<NMR_250MHZ>,
      <abs ABSG = 5 
       data hash MD5: 32K
       54 7E F5 74 C4 7D DA AE 2E F3 F7 6A 97 1D 9D BC>)
$$ ##END=
$$ 
$$ hash MD5
$$ 5D A8 52 B4 6A ED 17 2F F5 99 30 E6 C3 43 9A FE
##$RELAX= 
##$RELAX= 
##$RELAX= 
##$RELAX= 
##$RELAX= 
##$RELAX= 
##$RELAX= 
$$ Bruker specific parameters
$$ --------------------------
##$DU= <C:\u>
##$EXPNO= 120
##$NAME= <ADRS>
##$PROCNO= 1
##$TYPE= <nmr>
##$USER= <dgb>
##$AMP= (0..31)
100 100 100 100 100 100 100 100 100 100 100 100 100 100 100 100 100 100 
100 100 100 100 100 100 100 100 100 100 100 100 100 100 
##$AQSEQ= 0
##$AQ_mod= 3
##$AUNM= <au_zg>
##$AUTOPOS= <7 >
##$BF1= 250.13
##$BF2= 250.13
##$BF3= 250.13
##$BF4= 250.13
##$BF5= 500.13
##$BF6= 500.13
##$BF7= 500.13
##$BF8= 500.13
##$BYTORDA= 1
##$CFDGTYP= 0
##$CFRGTYP= 5
##$CHEMSTR= <none>
##$CNST= (0..31)
1 1 145 1 1 1 1 1 1 1 1 1 1 1 1 1 1 1 1 1 1 1 1 1 1 1 1 1 1 1 1 1 
##$CPDPRG= <>
##$CPDPRG1= <>
##$CPDPRG2= <>
##$CPDPRG3= <>
##$CPDPRG4= <mlev>
##$CPDPRG5= <mlev>
##$CPDPRG6= <mlev>
##$CPDPRG7= <mlev>
##$CPDPRG8= <mlev>
##$CPDPRGB= <>
##$CPDPRGT= <>
##$D= (0..31)
0 1 0 0 0 0 0 0 0 0.06 0 0 0 0 0 0 0.0002 0 0 0 0 0 0 0 0 0 0 0 0 0 0 
0 
##$DATE= 1165228616
##$DBL= (0..7)
120 120 120 120 120 120 120 120 
##$DBP= (0..7)
150 150 150 150 150 150 150 150 
##$DBP07= 0
##$DBPNAM0= <>
##$DBPNAM1= <>
$$ [...]
##$SUBNAM7= <"">
##$SUBNAM8= <"">
##$SUBNAM9= <"">
##$SW= 20.6930455092707
##$SWIBOX= (0..15)
0 0 3 0 0 0 0 0 0 0 0 0 0 0 0 0 
##$SW_h= 5175.983436853
##$TD= 65536
##$TD0= 1
##$TE= 294.16
##$TE2= 300
##$TE3= 300
##$TEG= 300
##$TL= (0..7)
0 120 120 120 120 120 120 120 
##$TP= (0..7)
150 150 150 150 150 150 150 150 
##$TP07= 0
##$TPNAME0= <>
##$TPNAME1= <>
##$TPNAME2= <>
##$TPNAME3= <>
##$TPNAME4= <>
##$TPNAME5= <>
##$TPNAME6= <>
##$TPNAME7= <>
##$TPOAL= (0..7)
0.5 0.5 0.5 0.5 0.5 0.5 0.5 0.5 
##$TPOFFS= (0..7)
0 0 0 0 0 0 0 0 
##$TUNHIN= 0
##$TUNHOUT= 0
##$TUNXOUT= 0
##$USERA1= <user>
##$USERA2= <user>
##$USERA3= <user>
##$USERA4= <user>
##$USERA5= <user>
##$V9= 5
##$VALIST= <valist>
##$VCLIST= <CCCCCCCCCCCCCCC>
##$VD= 0
##$VDLIST= <DDDDDDDDDDDDDDD>
##$VPLIST= <PPPPPPPPPPPPPPP>
##$VTLIST= <TTTTTTTTTTTTTTT>
##$WBST= 1024
##$WBSW= 4
##$XGAIN= (0..3)
0 0 0 0 
##$XL= 0
##$YL= 0
##$YMAX_a= 211824
##$YMIN_a= -280454
##$ZGOPTNS= <>
##$ZL1= 120
##$ZL2= 120
##$ZL3= 120
##$ZL4= 120
##$ABSF1= 16.44855
##$ABSF2= -4.244623
##$ABSG= 5
##$ABSL= 3
##$ALPHA= 0
##$AQORDER= 0
##$ASSFAC= 0
##$ASSFACI= 0
##$ASSFACX= 0
##$ASSWID= 0
##$AUNMP= <proc_1d>
##$AZFE= 0.1
##$AZFW= 0.1
##$BCFW= 0
##$BC_mod= 0
##$BYTORDP= 0
##$COROFFS= 0
##$CY= 12.5
##$DATMOD= 1
##$DC= 0
##$DFILT= <>
##$DTYPP= 0
##$F1P= 14.0000005364418
##$F2P= -0.99999901652339
##$FCOR= 0.5
##$FTSIZE= 32768
##$FT_mod= 6
##$GAMMA= 0
##$GB= 0
##$INTBC= 1
##$INTSCL= 1
##$ISEN= 128
##$LB= 0.3
##$LEV0= 0
##$LPBIN= 0
##$MAXI= 10000
##$MC2= 0
##$MEAN= 0
##$ME_mod= 0
##$MI= 0
##$NCOEF= 0
##$NC_proc= -5
##$NLEV= 6
##$NOISF1= 0
##$NOISF2= 0
##$NSP= 0
##$NTH_PI= 0
##$NZP= 0
##$OFFSET= 16.44855
##$PC= 1
##$PHC0= 228.6755
##$PHC1= 10.74226
##$PH_mod= 1
##$PKNL= yes
##$PPARMOD= 0
##$PSCAL= 4
##$PSIGN= 0
##$REVERSE= no
##$SF= 250.130018369501
##$SI= 32768
##$SIGF1= 0
##$SIGF2= 0
##$SINO= 400
##$SIOLD= 32768
##$SREGLST= <1H.CDCl3>
##$SSB= 0
##$STSI= 32768
##$STSR= 0
##$SW_p= 5175.98343685301
##$SYMM= 0
##$S_DEV= 0
##$TDeff= 65536
##$TDoff= 0
##$TI= <Analysis number 999999
Compound Code 99
Book Reference 9
Project Code 9>
##$TILT= no
##$TM1= 0
##$TM2= 0
##$TOPLEV= 0
##$USERP1= <user>
##$USERP2= <user>
##$USERP3= <user>
##$USERP4= <user>
##$USERP5= <user>
##$WDW= 1
##$XDIM= 32768
##$YMAX_p= 436485834
##$YMIN_p= -769711
$$ End of Bruker specific parameters
$$ ---------------------------------
##NTUPLES= NMR SPECTRUM
##VAR_NAME=  FREQUENCY,     SPECTRUM/REAL,   SPECTRUM/IMAG
##SYMBOL=    X,             R,               I
##VAR_TYPE=  INDEPENDENT,   DEPENDENT,       DEPENDENT
##VAR_FORM=  AFFN,          ASDF,            ASDF
##VAR_DIM=   32768,         32768,           32768
##UNITS=     HZ,            ARBITRARY UNITS, ARBITRARY UNITS
##FACTOR=    0.157963299565203, 1,           1
##FIRST=     4114.27593121429, 0,            0
##LAST=      -1061.70750563872, 0,           0
##MIN=       -1061.70750563872, -769711,     0
##MAX=       4114.27593121429, 436485834,    0
$$ Real data points
##PAGE= N=1
##DATA TABLE= (X++(R..R)), XYDATA
$$ [...]
16756D7070r7401k9258k5148J62429J1128j71598L314Q0234J08463p2986o4109
16745d7862L0724j9066o7313J11394N5120m8003J3686k8746P057m7184l6063K8861
16733d7395J1244J10819j6908j96214K1557o5074m9924R4587J49968m0206j16417
16722a43963j51783K4233K7813P5327R6888N4829j832k6337R8644Q2595j81245
16711d4831m1437r7740j3138M5257M1168n5351L5459J17384Q1022n5335k9990
16700a7532K9610L834l2539j4608p3167J32160j16981m0261J89918O5106o6951
16689E8589n3501j74881L4151n891M9873k6946m7072K23824L9178p2460j50917
16678a26053l1370l2439p4558P4981N8532R4643j24882q3304M7213L06491K17754
$$ y = [47070, -50331, -79589, -104737, 57692, 68820, -102778, -99464, -19230, 89233, 16247, -47862, -17138, -36204, -103517, 7877, 62997, 14994, 28680, -66, 6991, -40193, -76256, -47395, -36151, 74668, 57760, -138454, -116897, -181971, -231895, -137308, 12660, -27546, -143963, -295746, -271513, -243700, -168373, -71485, -16656, -18488, -44825, 53819, 136414, -44831, -86268, -184008, -197146, -151889, -110721, -166072, -130613, -13229, 67793, 12458, -17532, 12078, 15912, -16627, -31235, -104402, 27758, -89223, -129484, 60434, 125540, 58589, 5088, -169793, -135642, -141533, -91660, -118606, -165678, 58146, 97324, 24864, -126053, -157423, -189862, -264420, -189439, -130907, -36264, -161146, -244450, -197237, 109254, 327008]
16667C27008K5031m4569l1747o6984p2479j23757J8520Q4801L3010o5365K6555
16656A10024q0866r3940l3697k036k6981j40237l6959n7913m7658j0091m7216
16645d67570N3927K17602o778O671m1767l9667J54899N5009m2201P7777Q3702
16634E1604j24225M9879Q7252R3523j83426K10876o5271j74572j12018J70118
16624C740L0575n0833p6126j57385P681m2521L7267J04710n327O19m1236J48130
16612d0706J88757n3588O1569P8748j42341L1598k690j21010q0873K522k1185
16601i9199J6659J05967j39700o3792N3654r8573o9050J67196J06775j1282R7590
16590F6245k31749P9373r5492p863J28430l5115K2202L8000K00136P3208k05614
$$ y = [327008, 352039, 307470, 275723, 208739, 136260, 12503, 31023, 115824, 148834, 83469, 110024, 29158, -64782, -98479, -100515, -127496, -267733, -304692, -362605, -410263, -420354, -467570, -413643, -196041, -202819, -196148, -237915, -277582, -122683, -67674, -109875, -32098, 51604, -72621, -22742, 64510, 158033, -25393, 185483, 120212, -54360, -166378, 3740, 34315, -16518, -92644, -250029, -242348, -284869, -247602, -142892, -148219, -147600, -188836, -40706, 148051, 94463, 156032, 234780, 92439, 124037, 121347, 337, -80536, -78014, -99199, -82540, 23427, -116273, -180065, -126411, -224984, -294034, -126838, -20063, -31345, 66245, -165504, -86131, -181623, -189486, -61056, -96171, -73969, -35969, 164167, 237375, 31761]
16579C1761j28989m1531m6356l3594J17412L9762j60849q7103J22377J53841o3102
16568i6371j67324J44715Q7102j30127J5346O8588j7444j9337q4364J30197N0171
16557a8848L2354j64832n2463J28373Q4182q1967j92851O0670J14443j82340N4647
16546b18632R060j49994k3164l9692j19087J41974J79748J01066r5304Q5911P4348
16535e3766j05694m2382l2953P3177l1812n8768j8059q8361J93482J88611l934
16524A9541l9599j76052j39481n294J37215N8920K2456K9485Q1555o5004j59138
16513b35396J98098J01177Q4041N9183L0698L913j59394o4932O2799J4056n754
16502H8489L1633j38916k18338P722q928M9038m1257k637r6840R1807J45678K9014
$$ y = [31761, -97228, -138759, -185115, -218709, -101297, -61535, -222384, -309487, -187110, -33269, -96371, -263695, -118980, -31878, -162005, -146659, -78071, -95515, -114852, -199216, -69019, -18848, 13506, -151326, -203789, -75416, 8766, -73201, -266052, -205382, -90939, -273279, -218632, -209572, -359566, -382730, -422422, -541509, -399535, -219787, -118721, -214025, -128114, -53766, -159460, -201842, -234795, -161618, -193430, -252198, -270257, -358618, -165136, 23475, 19541, -20058, -196110, -335591, -340885, -203670, -144750, -122294, -92809, -11254, -76258, -235396, -37298, 63879, 147920, 207103, 237801, 241714, 82320, 17388, 80187, 94243, 88489, 120122, -18794, -237132, -229410, -238338, -189300, -230557, -233194, -330034, -238227, -92549, -63535]
16490f3535j8885J28054P1863q2569j38138M2547l7360l9961j9032J32614K11114
16479A86712j14026n8134q3527q5102J09226L8918O4748k19850j36145J51540
16469a45640J23555L3830j34864j3026J47447k3655N0811l7837q0996L7004J15488
16458G2117l8661N2122p1806p1063N5980K9918j19583k09100J5658J79243L1898
16447g3277j00993o1255j00011N938P0971R663r2623O276j19626j37684J4555
16436e78066K21679n649J07669K55181p1583m2038L7716k2354m5663L8234J17248
16425A2374j12087n1539K3109R5506L2312M7675O6514J24082j36111j66962n7899
16414a23026M5097L3104L3739P9806O4792j20402j35177q8092N0929M5895k4177
$$ y = [-63535, -82420, 45634, 117497, 34928, -103210, -60663, -98023, -137984, -157016, -24402, 186712, 72686, 14552, -68975, -154077, -44851, -5933, 58815, -161035, -297180, -145640, -22085, 11745, -123119, -136145, 11302, -12353, 38458, 621, -80375, -43371, 72117, 33456, 85578, 13772, -57291, -1311, 28607, -90976, -300076, -284418, -105175, -73277, -174270, -235525, -335536, -329598, -258627, -248964, -341587, -335311, -454937, -592621, -578066, -356387, -362036, -254367, 814, -70769, -112807, -75091, -97445, -143108, -104874, 12374, -99713, -151252, -128143, -32637, -325, 47350, 113864, 237946, 101835, -65127, -123026, -77929, -44825, -11086, 68720, 133512, 13110, -122067, -210159, -159230, -113335, -137512]
16403a37512M0375K9800P847Q5401m8957N6215r918k29893j66581J05331J30572
16392a37320J2515j86386J37177K3913n5202M1365M0633J105Q1821N8496J62854
16381A80971J06803K7109j45526j23811Q7484p9005j09397Q7754L7122j1490r6978
16370c8964n7670O3002k3107n1711p9068J09192m012P8715O7318P9997j45979
16359b287j34927k638P7404P4970j2102k42311L57761J08459N5493J07329j59548
16348B27603L4795R3911O3040n4224j43970j9662K3845j01572j35563j5406j3221
16337d0424k33013k7194J96082J67783P5566j88549j01611j18735j34039K18942
16327a85192K33645K8589j14514K7228P9206n3838Q5322n9606j90711j61080o7341
$$ y = [-137512, -97137, -67337, -59490, 25911, -23046, 33169, 23251, -206642, -373223, -267892, -137320, -124805, -311191, -174014, -150101, -205303, -163938, -123305, -122200, -40379, 18117, 180971, 287774, 314883, 169357, 45546, 133030, 54025, -55372, 32382, 69504, 58014, -38964, -96634, -33632, -56739, -108450, -187518, -78326, -82338, -3623, 63695, 143692, -2287, -137214, -139852, -62448, 12522, 420, -241891, 115870, 224329, 279822, 387151, 227603, 262398, 356309, 419349, 365125, 221155, 201493, 225338, 123766, -11797, -27203, -40424, -273437, -300631, -104549, 63234, 138800, -49749, -151360, -270095, -404134, -185192, 48453, 77042, -37472, -10244, 68962, 15124, 100446, 40840, -149871, -310951, -378292]
16316c78292r7201J09216K69508r680o2817m8058o4148o4621j8921P9959l1480
16305c16535l5475J07031J23334R7162K13j2815j23672L094R6355M9743o7309
16294g8874j2303J37892N2076J3797l6577Q756l1515P3989o434k5283j49824K8274
16282b6026O8319J2878j51791k11116n389L5964L8055J04950K30407K1184n7123
16271F0312J959M746k20842n1067J47108M3096j04334M8705l3854n0719R4742
16260f0148k2839L7813n018j41696n7408M7682J10179O416m5719r9517k4368K0013
16248b34610J95090O5522o3640p6140j13471n3199O3776J26189K35727k2014j97331
16237g4101n0923l4396o6881K90785J42688Q0154j31137k54442M3795k0069o6713
$$ y = [-378292, -475493, -366277, -96769, -106449, -169266, -217324, -281472, -346093, -365014, -285055, -316535, -352010, -244979, -121645, -24483, -24270, -37085, -160757, -157663, -61308, -11565, -78874, -91177, 46715, 98791, 112588, 76011, 84767, 53252, 127241, 120807, 95524, -54300, -26026, 42293, 55171, -96620, -307736, -313125, -277161, -239106, -134156, 96251, 117435, 60312, 62271, 67017, -153825, -204892, -57784, -14688, -119022, -70317, -104171, -154890, -60148, -82987, -45174, -50192, -191888, -249296, -201614, -91435, -85019, -130738, -230255, -254623, -234610, -39520, 26002, -37638, -113778, -227249, -280448, -216672, -90483, 145244, 123230, -74101, -125024, -159420, -226301, 64484, 207172, 287326, 156189, -98253, -54458, -74527, -141240]
16226a41240L7412M9243P2266L0010k7679p9430k9388J16817J60472j34655k01437
16215a47609o3288n4888L5603N9978L0186J07708J30926K5277k2786j87668j75060
16204b61621q6008P0756J04181N8535J56227K86716P1121P3058p9040k06663r03
16193A86359O7774k9194J09859J7381k1358j37984k17591j33397M8698R7110k9571
16182d1914J1264R8121j10509j65707N5413O3443J5703m5356J30041R9281M1030
16171A50810p3426p7121L571P8632L2799j91331o6731J19982J59538J08523p9954
16160A65292l0781O3807p6022n908l377M981Q3630l3613q4375m4752K5550J08732
16148A73164m4953j21157M312J11600J6253n5778K0657J03048j25145o5546m307
$$ y = [-141240, -103828, -54585, 17681, 47691, 20012, -59418, -88806, 28011, 188483, 53828, -147609, -210897, -265785, -230182, -170204, -140018, -32310, 98616, 123893, 101107, -86561, -261621, -347629, -276873, -172692, -114157, 42070, 328786, 399907, 472965, 393925, 187262, 186359, 254133, 224939, 334798, 352179, 330821, 192837, -24754, -158151, -109453, -12343, -41914, -30650, 67471, -43038, -208745, -153332, -89889, -74186, -119542, 10499, 109780, 150810, 77384, 263, 3834, 82466, 115265, -76066, -142797, -22815, 136723, 245246, 165292, 134511, 198318, 122296, 116388, 113011, 117992, 201622, 168009, 83634, 38882, 64432, 173164, 128211, 7054, 11366, 122966, 139219, 83441, 104098, 207146, 82001, 16455, 12148]
16137A2148J93206n9905k6901j16347j27863Q6119J24995K1123p6001n1084l6504
16126e7014m9127j07784N5241J51414M5131l6064j55016p1443O7283N2187m9625
16115a54817O730k0331J38054R7681P488q0158j85169j61659k3293J77369k0693
16104b18798l7531k3824m9753p9387J19340Q120J40976K67321o9091j58981K1961
16093g9647J31298p939j66612k6465O3879p780K14198m005o3032J9677K3507N8745
16081A55824n1817K4941o4570p3794J46867r7530j06472n6472m9510Q6642J37740
16070E1849J89843j08087j24910m3635j58396L0062n349l2981J35468J45391J62751
16059B42006l4930P1013j88255k40120J0244J15198J67406J5041j46344j74618
$$ y = [12148, 205354, 145449, 118548, 2201, -125662, -39543, 85452, 106575, 30574, -20510, -57014, -106141, -213925, -158684, -7270, 37861, 1797, -153219, -224662, -157379, -105192, -154817, -148087, -168418, -30364, 67317, 74805, -5353, -190522, -352181, -375474, -198105, -218798, -256329, -280153, -329906, -409293, -289953, -281833, -140857, 126464, 57373, -101608, -79647, 51651, 43712, -122900, -149365, -85486, -93266, 120932, 116927, 53895, 73572, 97079, 155824, 104007, 128948, 64378, -9416, 137451, 39921, -66551, -123023, -172533, -85891, 51849, 241692, 133605, 8695, -34940, -193336, -163274, -168623, -201604, -66136, 79255, 242006, 207076, 278089, 89834, -150286, -140042, -24844, 142562, 157603, 11259, -163359]
16049a63359p1714M3022J72970j0136K2439J23093o6808m3454O6441n4207m2532
16038b4245O9418L8048J25499J27392j20556l7062m0541J7045j55985K4269J09433
16027A32715Q4828J0208k9695j6884L1719n7371m5771J81438J40595k04872k29092
16016b182K0535J54921J40007n4886k12376k16607j48112P9738Q2266Q2804J5494
16005e8398j8755J0970K24361K01226p9189o9846N4018m5261Q88N5683P4002m3460
15993C06239K58k05570j25051n1896j27943M7623K70905Q160k02258l7276L8486
15982g8323M9803K8141M6445J07063J06614J15849j51375q1085L3549K4948n0216
15971A51413j08040n9225p2916L825k3462r0826J68725M9440j30712m9906Q2394
$$ y = [-163359, -235073, -192051, -19081, -29217, -6778, 116315, 49507, 6053, 72494, 18287, -24245, 45173, 83221, 208720, 336112, 215556, 178494, 137953, 154998, -987, 23282, 132715, 217543, 227751, 198056, 181172, 212891, 155520, 109749, 291187, 431782, 226910, -2182, 18353, 173274, 313281, 258395, 46019, -170588, -318700, -238962, -156696, -73892, -58398, -77153, -66183, 158178, 359404, 280215, 210369, 264387, 219126, 220014, 275697, 349699, 306239, 306497, 100927, -24124, -76020, -203963, -156340, 114565, 122725, -79533, -116809, -78323, -28520, -379, 46066, 153129, 259743, 375592, 224217, 143132, 176681, 201629, 151413, 43373, -15852, -88768, -84943, -108405, -199231, -30506, 18934, -111778, -161684, -79290]
15960g9290L3135K07236P6960K2089j36248j85026q7604K48433J52848L1863K6631
15949C11027j05068j1660p9949n8569l9457J24605j2994k87364o0685J37533j00303
15938a82884j34854p52m2736J80222J95588O6775j22556J4468k33745k46704K08751
15927b98427K19427J68832R4179j22281r2582J30014m667j74852K7287Q469l9728
15916h4329P3268P1814l0709q5768j31326k1140Q0561j6794O4276l30N2423J01907
15904G3853K3283j56979M5293J22459M6612o6187k3584O8204l9857j22679n9733
15893h9315R2753N8590k33127J1757N6950J0115J32466n561M001p2042r9262Q5369
15881d7306J4423J1350j7920O7975N9461q9971l1491j5024n7141l0449J43j63
$$ y = [-79290, -46155, 161081, 238041, 260130, 123882, -61144, -148748, 99685, 252533, 284396, 311027, 205959, 194299, 114350, 55781, 16324, 140929, 127935, -159429, -220114, -82581, -182884, -317738, -318490, -361226, -181004, 14584, 81359, -41197, -26729, -260474, -507178, -298427, -79000, 89832, 184011, 61730, -30852, 99162, 94495, -80357, -53070, -44601, -84329, -11061, 60753, 30044, -55724, -187050, -208190, -127629, -144423, -80147, -80477, -28054, 73853, 97136, -59843, -14550, 107909, 154521, 88334, 64750, 132954, 93097, -29582, -89315, 3438, 62028, -171099, -159342, -102392, -92277, 40189, 34628, 38629, -33413, -132675, -47306, -32883, -21533, -39453, 28522, 87983, -1988, -33479, -48503, -105644, -136093, -135950, -136113]
15869a36113K8101j66988N7471n5785p1648O3870J15766L4833p3764J36915q4691
15858a52033p5374O0671m7507M1004J41609O0765J25381l2095L8562j04636j19233
15847f2886j97600o6268P4503J88605J40082R2724r4504j09892L8867Q551J8860
15836C1042k283K4565j59979p9328J57903R6571Q099r2316p0814O5594j18302
15825a39248r4418J60158J4766J12695Q5202j04305Q1864K5881n9855p375p6330
15814i65j17497Q5051J56263O4652o9022J2774J41914P7141k05106k3563l1017
15803I0625j33303q6799J05568r6415o905J31745M1216P7788n290l1502O0180
15792A46908n3583j0590j17726K6620k9037p3214m1817o8991O025j70312L5880
$$ y = [-136113, -108012, -275000, -217529, -273314, -344962, -281092, -165326, -130493, -204257, -67342, -152033, -227407, -166736, -214243, -173239, -31630, 29135, 154516, 122421, 160983, 56347, -62886, -260486, -326754, -252251, -63646, 76436, 169160, 74656, -35236, 3631, 12182, 31042, 28759, 53324, -106655, -185983, -28080, 68491, 76590, -15726, -86540, -20946, -139248, -233666, -73508, -58742, 53953, 139155, 34850, 116714, 142595, 82740, 75365, -965, -118462, -33411, 122852, 187504, 118482, 131256, 273170, 350311, 145205, 121642, 90625, -42678, -129477, -23909, -120324, -127229, 4516, 45732, 123520, 118230, 86728, 146908, 93325, 82735, -34991, -8371, -37408, -110622, -152439, -221430, -215405, -385717, -349837]
15781c49837J12314R6365M6513R6229O1051N9891M1650j77024l11611k0909P6735
15770b68633J02408p1344K7520J22189K1521o8000p2614k7259k1268P0936R466
15759a75078k0399J34940p990Q6747k6174j01921n2599J57004k8438n5827J2152
15748g7583K237p8688M5196M4115l7223j89245o1220J44676J60045J44888J05400
15737B02598L727j04548l2362M9270Q1246R5471j63253k02017j3032l2417m4437
15726a59754J05457J5557N6786p4099K4536j8807l2173j08834n5585k2789K2365
15715b47340J46264J53592o7570q159J2640K2957M3961N3284k09703L783j3633
15704a09924n4017L3503J2103J12523j06610k0357J92178j6221m0115Q8217Q2371
$$ y = [-349837, -237523, -141158, -94645, 1584, 62635, 122526, 164176, -12848, -324459, -345368, -268633, -166225, -237569, -210049, -87860, -66339, -134339, -206953, -234212, -255480, -184544, -175078, -195477, -60537, -68527, 18220, -7954, -109875, -162474, -5470, -33908, -89735, -77583, -75346, -154034, -108838, -64723, -101946, -291191, -352411, -207735, -47690, 97198, 202598, 206325, 101777, 69415, 118685, 199931, 295402, 132149, -69868, -82900, -115317, -159754, -54297, -38740, 18046, -56053, -31517, -50324, -82497, -191331, -246916, -269705, -247340, -101076, 52516, -15054, -23213, -10573, 12384, 56345, 109629, -100074, -96291, -109924, -163941, -130438, -118335, -5812, -112422, -132779, 59399, 43178, 3063, 91280, 173651]
15693A73651r1497K8593J63977M8996l4460j45303q0885j76458Q0890R0968J04141
15682A62613k2936n9376K5132n867J4105k1809Q8709Q1934K1961p6440p4068q3372
15670E0586M0707o765L611k9124n7653R4545j22194l0062N1650L2262n2540k50026
15658b75003Q127K09360O4620P8933J6278O0838r2163m4182q9116m7913J5195
15647i5026M6548O2666L9208J5662K58o2650M3279J2405n7350N447J44097m6646
15635A07898n1567j13360O2458M5542j35189o6116J5177O4369m7997Q3181K06156
15624A70552J06814j45122k12713n6408J26984J94873m2108N5537m8164j16268
15614C3977j43867P8501j6875R5222J46255k77977k9651L2107R786J53147m0277
$$ y = [173651, 82154, 110747, 274724, 323720, 289260, 143957, 63072, -113386, -32496, 58472, 162613, 139677, 80301, 105433, 99566, 113671, 91862, 180571, 262505, 284466, 208026, 133958, 50586, 91293, 84528, 88139, 59015, 1362, 95907, -26287, -56349, -4699, 27563, -24977, -275003, -266876, -57516, 7104, 86037, 102315, 163153, 70990, 26808, -62308, -110221, -95026, -48478, 14188, 53396, 69058, 69316, 6666, 49945, 62350, 5000, 10447, 154544, 107898, 56331, -57029, 5429, 50971, -84218, -150334, -135157, -70788, -118785, -35604, 170552, 277366, 132244, -80469, -136877, -9893, 184980, 142872, 198409, 150245, 33977, -109890, -31389, -48264, 46958, 193213, -84764, -114415, -82308, -72522, 80625, 40348]
15603D0348j13781N4132m0466J277O9163j54109j06101M4900J39285J73504P543
15592A15695o0571J06776M8343j38074M2120o9180j6012j68455P1689Q423K1131
15581c8115Q8851l858P6684j56585q7669Q437k4419n5012K69099K23323n4689
15570B46047k27847j4133J33058R3348j85482k17739K03258J45780O787J03682
15560B86759m2828m9097n8503l12121p0774J61938J6855m7688J72794K14908l9465
15549B32778j44434R7558P5141O8849l7021r9387n1387o0949J34359N2594M861
15538B72962N1928r7849n6339o1406j73676j58141L3064J12578N2086j11158q5941
15527b21892Q2877K25990J3369j16053k62604r7829J81029L6957J3701r3600j87136
$$ y = [40348, -73433, -19301, -59767, -58490, 10673, -143436, -249537, -204637, -65352, 108152, 115695, 55124, 161900, 210243, 72169, 114289, 45109, 29097, -139358, -67669, -59246, -38115, 50736, 46878, 123562, -33023, -120692, -112255, -136674, -191686, 77413, 300736, 246047, 18200, 4067, 137125, 230473, 44991, -172748, 30510, 176290, 183077, 286759, 243931, 194834, 136331, -175790, -246564, -84626, -67771, -115459, 57335, 272243, 232778, 88344, 185902, 261043, 329892, 292871, 193484, 142097, 81148, 215507, 268101, 272962, 324890, 227041, 170702, 109296, -64380, -222521, -189457, -76879, -24793, -135951, -221892, -139015, 86975, 100344, -15709, -278313, -376142, -195113, -158156, -144455, -238055, -425191]
15516d25191J68556J93308J13p8342R1443j9221o4349r221j42662R1869N371Q4390
15504a03936K67486R7151r5181l28035j77111L9887J38362n4374J83471N8221
15494B5941l2275j1693o9931m5460j22286j5525N9411O7119j0150N3462R6680
15483d707K3824q9336J48858J71670j85522j05860j60985L7868R5990J35490M0596
15472A07886L4739j44903p3363M3071R570r910Q1393m0388J71322Q3528J1978
15461B74923K2824p6631M2735N0496j03173k13268q08n5899O4091K12842K8136
15450B46268k01373j33323N0983J21028j7758j28341N5867K2934m8677M3776R5746
15439A07130n734M2957m3513r7700j23106r2361P5511m8028J5529q8273J46030
$$ y = [-425191, -256635, -63327, -63214, -141556, -50113, -69334, -133683, -142904, -285566, -193697, -188326, -103936, 163550, 260701, 165520, -162515, -339626, -299739, -161377, -215751, -32280, 25941, -6334, -18027, -87958, -133418, -255704, -271229, -211818, -144699, -154849, -101387, -4707, 19117, -70219, 78639, 250309, 64787, -41073, -202058, -164190, -68200, 67290, 107886, 142625, -2278, -75641, -32570, -23000, -32910, 48483, 8095, 179417, 262945, 274923, 297747, 221116, 263851, 314347, 211174, -2094, -2902, -58801, 5290, 218132, 246268, 44895, -88428, -37445, 83583, 65825, -62516, -6649, 16285, -32392, 11384, 107130, 101396, 144353, 100840, 3140, -119966, -212327, -136816, -184844, -169315, -257588, -111558]
15428a11558J59674o3868k1792n34R9995r925j21993n6225m6525R3912J29082
15417E0243K05318J38029r9524q1625q1901j02253j433M8325j24305j90380J8628
15406b20878J68133R7231J2170L6435o6111j21487P728J24667P4458O2151J2780
15395A87277j02009l0943j66418p377j1015j33413R0846Q9342q1545P4782J46885
15384E6412p2492J21269q2468p5005q3823P0010K67132K01382l6301r9378q3617
15373A83121r0311O1880l9951j9143O3680o3224k29q3542n1943J26362r3080p1837
15361g8217R1933n5506M9777r513J0554n5292k1585Q4998O0464K0855p6912K0784
15349D2340j80318q1429J22226M9006j1697k0223p2325l8580P9529P2791K03634
$$ y = [-111558, 48116, -15752, -37544, -38078, 61917, 51992, -70001, -126226, -172751, -78839, 50243, 255561, 393590, 294066, 212441, 130540, 28287, 26854, 75179, -49126, -239506, -220878, -52745, 44486, 56656, 93091, 26980, -94507, -86779, 37888, 112346, 174497, 187277, 85268, 54325, -112093, -119470, -130485, -263898, -173052, -83710, -165255, -90473, 56412, -16080, 105189, 22721, -52284, -136107, -66097, 201035, 402417, 366116, 266738, 183121, 92810, 154690, 114739, 95596, 159276, 96052, 95823, 12281, -39662, 86700, -6380, -78217, 13716, -41790, 7987, -1526, 9028, -46264, -67849, 17149, 77613, 98468, 21556, 42340, -137978, -219407, -97181, -48175, -59872, -80095, -152420, -191000, -111471, -38680, 164954]
15338A64954J53909n8004m4631j81452m1055q1312j1152J6584m4176N5946J43616
15327G3227m500o95K1659q6436J50470J04956j02812p7398Q4116P2782j85299
15316E0070m3237J461N7193M899j07680L7712J93559n1478j70957O6065O9044
15305A06651j07737j21319R3518L2198K8357j14795j92165O163O9803O7734k1333
15294a52925N3813L39430l0538j56741L4329Q3908L8776r1103l4436r5368J0398
15283d57J12044Q4618N2672n8269j04167L5571k6416O7757l1781r5025Q9188J13493
15271B39228j83680l897J55337Q4070j18169r4723n5495k9099P7314J35192j5524
15260A90554j6778N6657j30163k0353n5686n1177o7363r108O5834j22049m9992
$$ y = [164954, 318863, 260859, 216228, 34776, -6279, -87591, -98743, -82159, -126335, -70389, 73227, 68727, 68032, 89691, 3255, 153725, 258681, 155869, 78471, 162587, 235369, 50070, 6833, 8294, 65487, 70386, -37294, 418, 193977, 142499, -28458, 37607, 106651, -1086, -122405, -28887, 3311, 31668, -83127, -275292, -269129, -199326, -131592, -152925, -99112, 240318, 209780, 53039, 87368, 171276, 210052, 118949, 84513, -10855, -457, 111587, 196205, 248877, 190608, 86441, 122012, 95596, 163353, 131572, 36547, 125735, 239228, 55548, 51651, 206988, 291058, 172889, 78166, 22671, -6428, 70886, 206078, 190554, 173776, 230433, 100270, 79917, 24231, -26946, -94309, -103417, -37583, -159632, -209624]
15249b09624J92079K43966j5372j54459j21979n8626O7651N0701J07060J15015
15239B16412j9194o0284j34408k155J83666n1462j25018L0326M1607j6836k3946
15228C8708k8868J410p1244q8249k0828K7278M2117P3479J619J82740K42273o388
15216C94047k34670k54873j7801M8351o6442j0687J00263J6267j09212l2908K5481
15205a42184k5286k1317j6357K72279R5677J1755j13908l7431j87472q4285J52755
15194i5774M6895K05310k7616k5865p8327m5738O1011J8837j01047q5227j11380
15183b38921n5000L2819Q0568L141p9742j47808M8669J26300q720J50825m5210
15172a33079J0824R1083m692K1600N6291j6418k3110K952r7189k1631K09837J56161
$$ y = [-209624, -17545, 226421, 211049, 56590, -65389, -124015, -56364, -5663, 101397, 216412, 197218, 136934, 2526, 371, 184037, 132575, 7557, 37883, 79490, 62654, 38708, 9840, 11250, -59994, -148243, -169071, -141793, -99676, -26197, -24578, 158162, 400435, 394047, 159377, -95496, -113297, -64946, -131388, -142075, -41812, -25545, -134757, -167665, -142184, -167470, -188787, -205144, 67135, 162812, 174567, 60659, 23228, -164244, -248529, -95774, -48879, 156431, 128815, 102950, 24623, -21115, 39896, 58733, -42314, -127541, -238921, -293921, -261102, -180534, -177393, -257135, -404943, -356274, -229974, -238694, -87869, -133079, -122255, -31172, -35864, -14264, 42027, 25609, 2499, 5451, -91738, -113369, 96468, 252629]
15160B52629O7445l1107o6596p5987j19217m3988l4586r2494j974Q2853q6555
15149a49577J2118j38365j44505j27352J61076J22094l1381J78383K9242j09988
15139a98255M1672L0219K17969O0418j9327J58561j45817r5079o5213m087M933
15128a4006M3678q9849N8132q4494r3546q1277r9956J47020R1241P1596J19632
15117F8171j97332J38926J95957j61636j66929K25017r559p062j21045j53419
15107a88911o598K8921K13794q2318j72799J58010K00803M3260j39730j9712Q4727
15096A19447p0401n4948j0928j93028L149J49430L08425P5432j68355n9102N3774
15085A52895j13149k63652M1591J03540l5413O9165J37664N0993j01328n9847
$$ y = [252629, 320074, 288967, 222371, 146384, 27167, -16821, -51407, -143901, -145875, -63022, -149577, -137459, -275824, -420329, -547681, -386605, -264511, -295892, -117509, -88267, -198255, -156583, -126364, 91605, 152023, 132696, 291257, 145440, 50361, -14852, -18939, -14006, 29672, -60177, -2045, -86539, -180085, -261362, -361318, -214298, -123057, -51461, 68171, -129161, 9765, 205722, 44086, -122843, 102174, 92615, 85553, -35492, -188911, -195509, -166588, 47206, -35112, -207911, -49901, 150902, 194162, 54432, 34720, 119447, 49046, -5902, -16830, -209858, -206709, -57279, 251146, 326578, 158223, 99121, 152895, 39746, -223906, -182315, -78775, -114188, -45023, 92641, 143634, 42306, -17541]
15075a7541m8591p9799K7160J35569Q3113L3407j72649j34423R8564k2533q2908
15064a80631J72599R8241l7123k02694j07518k0853J32294R8901J9501p3316q5860
15053a86459j2096Q6637K2740j34097r3695L5499R046M5639J7018J01079j04836
15042b13525p2211O213P9270J22177M0565j5022J06570K4713J40667o9754j68589
15031a8926n3478K81193L4979n9016K9498j35573l35868j1087K55336J95948l5093
15020A47913k188m4164r1182r3162J25152O1089j03265p832J03010J3494l5273
15009G3592R118j40535k4458J29641L1888q61j26362q4783p8785J21150J17134
14998B6739Q8216Q4401p4365j93723p7053J09715M6229o5700j33356J72338J20271
$$ y = [-17541, -66132, -145931, -118771, 16798, 99911, 133318, -39331, -173754, -75190, -97723, -180631, -8032, 90209, 53086, -149608, -257126, -277979, -145685, -46784, -27283, -100599, -186459, -198555, -111918, -89178, -223275, -316970, -281471, -272425, -226786, -209768, -108689, -213525, -285736, -279523, -200253, -78076, -37511, -52533, 54037, 78750, 219417, 149663, -18926, -72404, 208789, 243768, 184752, 214250, 78677, -257191, -268278, -12942, 183006, 147913, 145725, 101561, 10379, -82783, 42369, 103458, 193, -7639, 95371, 108865, 73592, 82710, -57825, -82283, 47358, 79246, 78385, -47977, -132760, -211545, -90395, 26739, 114955, 199356, 124991, -68732, -145785, -36070, 10159, -55541, -188897, -16559, 103712]
14987A03712Q9406k11277j19934J31615K24680K5543j33180Q4653M0817p3294
14977A62741j46090P0868M7073r3675p4572R681J16179K9383p6040J3888n406
14966E4030p5380N6964J40342M6394j89702r6339j34434J09399K6935K7493j22563
14955a56861K3859K19928P7815j58318r2168J17184N1031J34705N0362j3360J3921
14944B68098K6423j72541L9343l5303m2277p0844k741p5377P270m0745Q747j59765
14932b49712J2544O1008J68466J96071o4440p464n525j076j2066k9224p7653q3379
14920i2450L9250j0579J8091j03308J19088M9265r3462O8315M549Q8800p0272
14909A7287p6215M0155j54884P0705K29356R8533J24267k08834j50792k2519N4760
$$ y = [103712, 193118, -18159, -138093, -6478, 218202, 243745, 110565, 195218, 236035, 162741, 16651, 87519, 134592, 40917, -33655, -23974, 92205, 121588, 45548, 59436, 54030, -21350, 35614, 175956, 222350, 32648, -63691, -198125, -88726, -61791, -34298, -156861, -133002, 86926, 164741, 6423, -85745, 31439, 82470, 217175, 267537, 254177, 268098, 294521, 121980, 161323, 126020, 83743, 12899, 10158, -65219, -57949, -98694, -89947, -249712, -237168, -176160, -7694, 188377, 123937, 116473, 110948, 109872, 97806, 68582, -9071, -92450, -53200, -63779, -45688, -148996, -29908, 19357, -74105, -5790, -1241, 87559, 17287, -58928, -18773, -173657, -102952, 126404, 224937, 349204, 140370, -10422, -32941, 21819]
14898B1819l7235j4587K6446K31223O1352N7624O5110j85816k75828j1594J43809
14887H2323n7469P2565L6332J0511n9076P9564m8955q5432j35720j33526N1668
14876a87215o7157K9806J06819J56511n6889j120O6165J22891J94426K4361n5787
14865C32811P4038j4269j27304j60621j87205Q3135K1043o0156j78099r2345R7191
14854b11781K06110m0612k02485O2921Q4028j61059O9140j0444J08597k5261k3210
14843a44056O3857J43894p9107K2702L2690o1050j52726O6167q9978j26041J26528
14832a97120K64352Q7949p2050j36337L2646l7168m9331j3366k893j06855O298
14821b23875L5298l9667M4707P3631P6272o7764r5915L5875j42133O7490Q7049
$$ y = [21819, -15416, -30003, -3557, 227666, 289018, 346642, 411752, 225936, -49892, -61486, 82323, 24854, 97419, 133751, 144262, 85186, 164750, 115795, 30363, -105357, -238883, -187215, -254372, -224566, -117747, 38764, -18125, -19245, 46920, 169811, 364237, 388598, 332811, 406849, 392580, 265276, 104655, -82550, 585, 21628, -38528, -216627, -308972, -211781, -5671, -46283, -248768, -185847, -101819, -262878, -193738, -204182, -95585, -120846, -144056, -80199, 63695, -15412, 7290, 39980, -21070, -173796, -107629, -197607, -323648, -197120, 67232, 155181, 83131, -53206, -20560, -57728, -107059, -120425, -123318, -230173, -223875, -188577, -228244, -183537, -109906, -33634, -101398, -197313, -161438, -303571, -236081, -149032]
14810a49032o5414J62994J29935J2936j62504M9111J4100O1157o331K06429P4083
14799C27464k44563p7063k4164l2099N5156k6662M6050k8126N1269n4036k1351
14788b8125M7998J66240j73829j36905j0333j1322K01759K11502r1495j34461
14778D1029r6066q0476r2114m7452O4434n291K4021O7648r1807m7443J12720K34648
14766H3851l6959r9406O2598k0854l4725q259J44532M7132j5950R3242J07676
14755C22878o0358k04968r190j02134q0186L8104O5458P1524O555O9450K00289
14744C17422k2680q5819j39560j78493p7525Q8160N9437J524o8746j70552M7755
14733b29077J63643J06191M1026p0301J2837p63p3083P0715P7810j57920n894
$$ y = [-149032, -214446, -51452, 78483, 91419, -71085, -21974, -7874, 53283, 46952, 253381, 327464, 82901, 5838, -18326, -50425, 4731, -21931, 24119, -4007, 47262, -6774, -28125, 19873, 186113, 12284, -124621, -134954, -146276, 55483, 266985, 175490, 41029, -55037, -135513, -227627, -275079, -210645, -215936, -191915, -124267, -216074, -263517, -150797, 83851, 46892, -52514, 10084, -10770, -45495, -53754, 90778, 137910, 121960, 215202, 322878, 262520, 57552, 48362, -53772, -133958, -95854, -30396, 41128, 47683, 117133, 317422, 294742, 208923, 69363, -109130, -186655, -98495, -39058, -37534, -106280, -276832, -229077, -65434, 40757, 81783, 11482, 24319, 23556, -49527, 21188, 98998, -58922, -64816]
14722f4816R7482K34542L2264j59338M2875p9143K441R535j98181P6961m161O0112
14710E0573r171j8858l5019j4345K9245q6599l268j11692J8294J08530J44859
14699G2549J54834r1380N4163J5540L3512j67474j49010K2425J03991L6442j09222
14688b3630M1170J16293n6417k40491q2595N2503m5679J66165P3989l4806j19718
14677a53216R5366j6040L3274O6772O4401R9793j60126Q1579J66974j98666k63178
14666a83067j39795J35883J74760R6673o5289l9321n9242K082K092Q86J5096l4691
14654i3933R639J4434L0669j8254P9847l7616j15876R1470R2413k2998j2162k3620
14642e987j9994M8698m3380j24298o2133J81334N9470j07906m5315k19508O9332
$$ y = [-64816, 32666, 267208, 299472, 140134, 183009, 103866, 106307, 115842, -82339, -5378, -9539, 50573, 41402, 22544, -12475, -26820, 2425, -84174, -87442, -199134, -180840, -72310, 72549, 227383, 136003, 190166, 205706, 239218, 71744, -77266, -54841, 49150, 85592, -23630, 17540, 133833, 77416, -163075, -245670, -193167, -238846, -72681, 1308, -33498, -153216, -57850, -73890, -40616, 26156, 90557, 190350, 30224, 111803, 278777, 80111, -183067, -322862, -186979, -12219, 84454, 19165, -20156, -79398, -77316, -75224, -74338, -59242, -93933, -84294, -69860, -39191, -57445, 22402, -15214, -131090, -39620, 52793, 29795, 17633, -5987, -25981, 22717, -20663, -144961, -207094, -25760, 33710, -74196, -119511, -339019, -269687]
14631b69687J76703R4828J66087j245j7478M0639J3930p3228r9335j18038m7967
14620a34791j7810N8794R311j01077J39590K3338j41100J1867J7250L5319M9363
14609d9946j8893j77505J865J25503l5330m6367j34815n0447M5994P9453o2722
14598c23210k2481M0821P6853L93n8906J25210O7671J05239J40368j14227k53220
14587b15489j46824l849J26711J14347K5626J73710J56725K9773Q4139J4726k00374
14576A59221o5690k46346j42407K40761K70666M0296J9813n4821j30226N1506
14566A42773M5075l4027j45911J5305L8767q2756m8597Q5934P3606J86559K34551
14555E11279n0574k36197j01438M7328N500P1973j17343K5726n6887k9439j0562
$$ y = [-269687, -92984, 1844, 167931, 166686, 149208, 189847, 203777, 130549, 31214, -86824, -134791, -152601, -93807, -84496, -185573, -45983, -22645, -163745, -151878, -134628, -99309, -49946, -68839, -246344, -244479, -118976, -154306, -200673, -335488, -385935, -339941, -260488, -323210, -345691, -304870, -228017, -227624, -286530, -161320, -93649, 11590, 151958, 37731, -215489, -362313, -366162, -239451, -125104, -99478, 74232, 230957, 260730, 344869, 359595, 159221, 93531, -152815, -295222, -54461, 216205, 256501, 276314, 221493, 91267, 142773, 187848, 153821, 7910, 23215, 61982, -20774, -69371, 16563, 90169, 276728, 511279, 460705, 224508, 123070, 170398, 175898, 247871, 130528, 156254, 99367, 69928, 59366]
14544E9366r5001L2070M4496J9568J17695J9185j04856j0480j63529q6608O0313
14533a07781o0858m7856K42115L8410P7222m4798j91585m5846j3350j5796P6886
14522i3237J02980L0699k4726o9238j16330m1713p4048J54181J91622J13898k09726
14511c5638j11189J46291J32365p9572o6869m5876j00880j70724L7023P4668J69068
14500e1333K20231r4791j23906o2496m9811J35689J50318L0695k156j11856n0146
14489i562J14358j2073J59247M179n9749j74854j11141K03322k6954j60464m7939
14478a21630K6205k5461j38948Q5034K96745K3402j90608j11074P2968J69324
14468H5957J80963q1946k0947J53424j33517k07915M3399O991j43615J7626k9584
$$ y = [59366, -35635, -3565, 40931, 60499, 178194, 197379, 92523, 82043, -81486, -168094, -107781, -168639, -216495, 25620, 64030, 141252, 96454, -95131, -140977, -154327, -170123, -93237, 9743, 40442, 15716, -53522, -169852, -211565, -285613, -131432, 60190, 174088, -35638, -146827, -536, 131829, 52257, -14612, -60488, -161368, -332092, -295069, -220401, -51333, 168898, 74107, -49799, -112295, -162106, -26417, 123901, 154596, 152440, 40584, -9562, 104796, 92723, 251970, 256149, 196400, 21546, -89595, 113727, 86773, -73691, -121630, -95425, -120886, -259834, -174800, 121945, 145347, -45261, -156335, -83367, 85957, 266920, 184974, 164027, 317451, 183934, -23981, 19418, 26409, -117206, -99580, -129164]
14457a29164K68881R3923j20639L0579L39O2444N3624o4241q0728J12496n7447
14446A70067q1605M0482O09J09629j49168k01499R372P2590J3704r6315O4492
14435d7642M9994J67816j96303J25786J29548m1637M242J14597k5572j43685k16292
14424g9148J1309J5783J36071p528r9851n8684j02691o2426J41877O1422Q632
14413c5234L354m8380k3934O8881J85071O3165l2907p7613m5776m2189j37266
14402a22828m9027P8746J49892o6019J46142J27584j95463j77521M8903J3299
14392d6292Q4143k7237p0310M4557N0821P1291j0276j07656o4880j52600O7441
14381a60998K05495M4163J16769R6627n4863k22126l8352J75129J06059K6445
$$ y = [-129164, 139717, 233640, 113001, 143580, 143919, 206363, 259987, 195746, 115018, 227514, 170067, 88462, 128944, 129553, 239182, 90014, -111485, -102113, -29523, -15819, -112134, -47642, 2352, 170168, -26135, 99651, 229199, 187562, 191804, 306401, 280829, 137144, -79148, -67839, -52056, 84015, 76487, -23364, -82048, -184739, -247165, -105288, -43866, -35234, -31880, -80260, -104194, -35313, 149758, 212923, 180016, 102403, 56627, 14438, -122828, -171855, -93109, 56783, -9236, 136906, 264490, 69027, -108494, -59591, -46292, 37851, 10614, -59696, -15139, 35682, 106973, 96697, -10959, -75839, -228439, -160998, 44497, 88660, 205429, 302056, 247193, 25067, -13285, 161844, 267903, 294348]
14371B94348l5642M7615j51715J21920J52166j32524k22839o9462k18245R923
14361b04455j0845l3592K81051J33622L9243l0452m3732J7341j03335k578L765
14350D6033M5886j78825R2275j11186k24103J53968J66102N2487o8784l3949l6681
14339i6777q149m7688L3625J26463K4094r2734o7244o8015p8576L7365K24488
14328a3148P0578j87600j02080J5350M9571Q2820k0014q4775k2331J65198K15190
14317A68759N5583j81774k2488l2122N2548l876K5495n772j01396k31743J7206
14306b59580J69227K47084M4370l4314r0391j31236R3447r4437o1096j01192j397
14295b19515Q3141J27106p4200j18369j0921j33963j25739J2860K5661K19748
$$ y = [294348, 258706, 306321, 154606, 276526, 428692, 296168, 73329, 3867, -214378, -204455, -215300, -248892, 32159, 165781, 205024, 174572, 130840, 148181, 44846, 42268, 46033, 91919, -86906, 5369, -105817, -329920, -175952, -9850, 42637, -26147, -60096, -96777, -104926, -152614, -118989, 7474, 31568, -61166, -128410, -196425, -275001, -237636, -13148, 57430, -130170, -232250, -216900, -167329, -84509, -104523, -189298, -211629, -46431, 168759, 224342, 42568, 20080, -12042, 40506, 36630, 62125, 56353, -45043, -276786, -259580, -90353, 156731, 201101, 166787, 76396, -54840, 38607, -55830, -116926, -218118, -219515, -136374, -9268, -83468, -201837, -212758, -346721, -472460, -459600, -433939, -214191]
14285b14191K07815j0570j01354O0520j21864k10255J90651J29552M0471J02907
14275G3682l309n8397P2391K9207r8634q3317J6513L5798J6059q3375n6666l0337
14263a70385j10635K913K741L6967J90642N5828N0989j6124j21200k9000k3177
14252a30441j9184P1620O8647m7309J49677J51290J04294k5663k35778j84680
14242i7527j11918n7603P6936J74903R0391k5925k3482q35p555j22940J0006M2751
14230e2798k6571j09368J40649J63233j4223p628k2195j19904j23116j37209m3378
14219c52508J29918K44956K0365r1635N4660r2696l4409J12033o0965K0881Q3078
14208C3678j9480Q730L8817j6153j09478j20101N423J3838R4524O8235k29415
$$ y = [-214191, -6376, -16946, -118300, -57780, -179644, -389899, -199248, -69696, -29225, 73682, 70373, 11976, 84367, 113574, 14940, -68377, -51864, -16066, -7, -83382, -140048, -170385, -281020, -278107, -275366, -238399, -47757, 8071, 59060, 42936, -78264, -107264, -130441, -149625, -78005, -9358, -56667, 93010, 244300, 348594, 322931, 87153, -97527, -209445, -267048, -190112, -15209, 75182, 49257, 25775, 24940, 17385, -105555, -95549, -52798, -79369, -188737, -48088, 115145, 100922, 93294, 71099, -48805, -171921, -309130, -352508, -222590, 22366, 42731, -48904, 5756, -86940, -121349, -9316, -70281, -49400, 33678, 14198, 22928, 61745, 45592, -63886, -183987, -178564, -164726, -70202, -1967, -231382]
14197b31382j35520J24551J36932J93352m4943j48267O0039R9622q3506K8090
14187a032J43042l3271j10088p2988q2195o15K177M1258J38727j20129m8706J68435
14175B4615J38805Q6890j51723j23435q4109R8201P3288m9775l65571j2976J87369
14164a78421J13476o4836J96772j2312j46796J8355j2732N4930K3540L4957R923
14153C6856m7841J07005O8186j48799m7169j63775K922J68626q0140k5659j01943
14142b31731O8957L0301n0342J4491q2957J4241K79376Q7168j31538n9875K1195
14131d0714r5095p760J03559j03161J6194N0552N6043o1157J36825l1976K333
14120B5643o3889j44691p9435N1410P7955p312J4209J4184m0942J00082l2124
$$ y = [-231382, -366902, -242351, -105419, 87933, 42990, -105277, -45238, 54384, -29122, -1032, 142010, 108739, -1349, -74337, -156532, -157147, -154970, -113712, 25015, -95114, -143820, 24615, 163420, 250310, 98587, -24848, -108957, -10756, 62532, 12757, -352814, -365790, -178421, -64945, -129781, 66991, 54679, -92117, -73762, -86494, -31564, -8024, 26933, 36856, -10985, 96020, 164206, 15407, -31762, -195537, -192615, -23989, -104129, -129788, -231731, -162774, -132473, -182815, -168324, -251281, -237040, 42336, 129504, -2034, -61909, -40714, -135809, -143569, -40010, -143171, -126977, -76425, -20382, -81539, 55286, 23310, 25643, -38246, -182937, -262372, -210962, -133007, -140319, -126110, -111926, -152868, -52786, -84910]
14109h4910k6407l1115m4953O5219R5298J41919L8388j28410j49820N6873P9135
14098A1217O329j23668l9769l6054K0875l1551R8155J92270J43861k4965L4602
14087B51302R148o4696k25109j30568m7716K01685J9886m0729k767L8321l067
14076E690p3952p4159m6982L0299P7758p1877k4313L2861N6734l0707p1268N7853
14064a32063J14832j14561n0839J25446K2884P9982R6399n606j48696n2280n6439
14053a20941j29229j1042K31575J12633J8814p340q7444j67508L2123n9529R619
14042a78269J71025J76517n7075o8748O6093M8873O2990j2553J1013m2498K7662
14031B05030j58949j46927J1022J43820O5577o3162n7408J87075J7425j52025
$$ y = [-84910, -111317, -142432, -187385, -122166, -26868, 115051, 153439, 25029, -124791, -67918, 11217, 17546, -106122, -145891, -181945, -161070, -192621, -94466, 97804, 241665, 216700, 251302, 260450, 195754, -29355, -159923, -207639, -5954, 13932, -26797, -29564, 8757, 5690, -68262, -142421, -189403, -159104, -81346, -153223, -177536, -144675, -87941, -118648, -189916, -132063, -17231, -131792, -182631, -57185, -34301, 45681, 142080, 136474, -12222, -64502, -120941, -250170, -261212, -29637, 82996, 101810, 94470, 7026, -160482, -128359, -187888, -178269, -7244, 169273, 112198, 43450, 109543, 158416, 221406, 208853, 219866, 177368, 205030, 46081, -100846, -89824, 53996, 119573, 56411, -997, 186078, 203503, 51478]
14021E1478J0868j32000k2145j10075k8664J00334J9183p8225K01052M9245l2451
14010B8600P918j9057r333J18084p6206p5380N8574K9279j02479o5159l780p5089
13998a84028j38969J34448J34184O1509j43909J18177Q670M7450o633j28510J5071
13987h2540J06763J7004J3180Q1201J10038j46715j95051r7988J29182Q7391o6274
13976d3809N5817L176r096j6009J85976k9067k12287M0848J04441j08510M8607
13965B0087m7029P2018J86759o7880q2507M7O5376j83706Q0085K2628j00480l2582
13953f7184j8801n6207k8390J04784j3525r1488q7437l9064J76956K45132Q0397
13942B05173J2920q492j58420q2641p5396j61630j10377O8955J72394J01099r3441
$$ y = [51478, 62346, -69654, -91799, -201874, -230538, -130204, -111021, -189246, 11806, 61051, 28600, 36518, 17461, 8128, 126212, 50006, -25374, 33200, 62479, -40000, -105159, -108939, -184028, -322997, -188549, -54365, 7144, -136765, -18588, -9918, 37532, 30899, -97611, -82540, 24223, 41227, 54407, 135608, 245646, 98931, -96120, -194108, -64926, 22465, -43809, 12008, 15184, 6088, -9921, 176055, 146988, -65299, -24451, 79990, -28520, 20087, -26942, 45076, 231835, 163955, 81448, 81495, 146871, -36835, 43250, 65878, -34602, -67184, -85985, -142192, -170582, -65798, -79323, -170811, -258248, -297312, -120356, 124776, 205173, 218093, 209601, 51181, -31460, -106856, -268486, -378863, -309908, -137514, -36415, -129856]
13931a29856K8902m0761M2618k9263O5647K47190k6742L2753K1864q2572l9377
13920I0403r5250q2732p6817j4224J40838K12413r5402j16640p3911l2835J36148
13909h009k7284J13254J4527N8735o8292r1475j967J08130P3048N4311j07207
13898A17771j74032j3730O4598k0279j92090L5419j08798n1384R0064P4130l5871
13887b14202k1858K4659J5479J84890J82616m8811j85501k28368Q5573J21011
13877h4512N8321J64616L2924p0776J8648j72801j15122N9375J71962J50391j20357
13866I2669k43427q5960j5664R313N1333J56912K24314j44435j24241P0681r70
13855i475p4771L1637O0270L4373l2393j21700j9674o7178M0632N3087N0188J99590
$$ y = [-129856, -100954, -141715, -99097, -128360, -62713, 184477, 157735, 190488, 212352, 129780, 90403, -4847, -87579, -164396, -178620, -37782, 174631, 79229, -37411, -111322, -144157, -8009, -35293, 77961, 92488, 151223, 82931, -8544, -10511, 97619, 170667, 224978, 117771, -56261, -69991, -5393, -25672, -217762, -182343, -291141, -342525, -252461, -178331, -214202, -236060, -211401, -195922, -11032, 171584, 122773, -62728, -291096, -205523, -84512, -26191, 138425, 171349, 100573, 119221, -53580, -168702, -109327, 62635, 213026, 92669, -150758, -236718, -252382, -243069, -191736, -34824, 189490, 45055, -79186, -8505, -9475, -84246, -52609, 7661, 42034, 9641, -112059, -131733, -198911, -158279, -105192, -55004, 144586]
13843A44586j04194k59814L3871J58833R8450p9965M5147j29457k5247L1771m7785
13832a33804k9463K4561J26532j7257R9623J53378k69422k6217O1535M7806R8177
13821A35449O3660L5624j99206l08615K9075R4759j00306m9305J41388J01666
13811e5811j47491r1638J29657M3609j01156J4961k9882O19J18165L27955l9161
13800A69827j95900n6075J0623j00245j02493P6129R5195J38894p1889j60553
13790a96487N1682j1925m5634J60238J66434Q3652J3001j8961n9555j49065j3629
13779b0249J0286j25544q0768n6147r3572M7884J11256m3286K32443J51923J20384
13768B54610j6756J5425q8541j05916m9515J9412J16792k2008k07160j12157l3048
$$ y = [144586, 40392, -219422, -185551, -26718, 71732, -8233, 36914, -92543, -117790, -86019, -133804, -163267, -138706, -12174, -29431, 70192, 223570, -45852, -72069, -10534, 37272, 135449, 199109, 234733, 35527, -273088, -244013, -149254, -249560, -298865, -157477, -55811, -203302, -294940, -165283, -121674, -222830, -207869, -237751, -237132, -118967, 208988, 169827, -26073, -82148, -71525, -171770, -274263, -198134, -102939, 35955, -35934, -196487, -144805, -156730, -202364, -42126, 124308, 207960, 220961, 202000, 142445, -6620, -20249, -9963, -135507, -216275, -272422, -365994, -318110, -206854, -250140, -17697, 134226, 254610, 237854, 253279, 164738, 58822, 9307, 28719, 145511, 123503, -83657, -195814, -228862]
13757b28862J71360l2519N0493R2218p861O0658J86048k19511l7623m2535M8287
13746D0153R1645L2950q571p4182K7735j02788O338l4228q6566l1049J98928P3134
13734A33499j62370n4875L6832J2296J00964J20557j42943n4403l2469q1775k4075
13723a48762J95666j23467k11669K80912K84868j0757q1326l05661r233J19827
13713i602J40896q4615j55170k7604k0102L34360J98118j58721k6910m1949j13936
13702C4765m5997J62384J65915o6430r2837j82668p5546P3644J9031j30331J30809
13691g261Q0240j984L5190j3003j4916J22347p9656n357K49149N2267M1614j76155
13679B82475k33733l3722J55568P4545j58938j50758k2499n3230J13914j4202
$$ y = [-228862, -57502, -90021, -39528, 52690, 44829, 105487, 291535, 72024, 34401, -8134, 40153, 131798, 164748, 156177, 81995, 109730, 6942, 13280, -20948, -107514, -138563, 60365, 133499, -28871, -83746, -46914, -34618, 66346, 186903, 43960, -10443, -42912, -124687, -148762, 46904, -76563, -288232, -7320, 277548, 266791, 185465, -120196, -129429, -9602, 131294, 46679, -108491, -136095, -156197, 178163, 376281, 217560, 190650, 148701, 34765, -11232, 151152, 317067, 250637, 157800, -24868, -100414, -26770, -7739, -138070, -7261, 72979, 70995, 106185, 93182, 78266, 200613, 120957, 115600, 364749, 417016, 458630, 282475, 48742, 15020, 170588, 245133, 86195, -64563, -87062, -140292, -26378, -40580]
13669d0580n6901J07575l3492K918J97582j13750j14212l7212l4022r7985j16660
13658c36739J28053N552P6484N7720k8173j02183J21656J57457j41455r7444J11481
13647d7591O8139j6848O4676J65517q2845j97018r741r0373k1193J33683k2402
13636e5996n1535r3452q7678J07355K33483J60802j8217j82791j06175p1213p5000
13625b40417J26777L86K7982j75906j40318L6719K26126L25735P2779j38144j34163
13614a2444J62216R2331p6523j96229k05949n1196M7083l4286j03205p0673R9098
13603c49777J18698J2097J25523q46P2396R9724j08463j29611m3856K6467N9713
13592a17935k2132m1156j40693P9315O8215J35333O2578P6798p3242r6218K8580
$$ y = [-40580, -97481, 10094, -23398, -20480, 177102, 63352, -50860, -88072, -122094, -220079, -336739, -208686, -203134, -126650, -68930, -97103, -199286, -77630, 79827, -61628, -159072, -47591, 20548, 3700, 68376, 233893, 151048, -45970, -55711, -146084, -167277, -33594, -55996, -107531, -200983, -288661, -181306, 52177, 212979, 194762, 11971, -94204, -165417, -240417, -113640, -113254, -85272, -261178, -401496, -364777, -138651, 187084, 259863, 121719, -12444, 149772, 242103, 165580, -30649, -236598, -287794, -240711, -274997, -378202, -448875, -349777, -231079, -218982, -93459, -94305, -21909, 77815, -30648, -160259, -204115, -177648, -117935, -140067, -181223, -321916, -242601, -174386, -39053, 23525, 100323, 27081, -69137, -40557]
13581d0557K74590P6302m6476n0839m5856j88221j33494P6098N2124P0599j66919
13570a22649q4001J17804J21756M5619K9600j47071j19915l8858J69645L8747
13560A0677q6548j92919j1730J92119J51071j47325n6972J78751J09574k7392
13550A19306k9778k1729l7890j44600j00802q9837Q8517O2180J80352K49515r0241
13539A84993m9219r7896j14547J9154R5700j4273k22918n9207l9393O1960R9054
13528a36592J32594N7417j09968J10589N3652p4446j49058o7314Q5515Q9381q3378
13517i1608P9165l6488j64638l8801J21664K02491K6268Q1218N294j92673L6927
13506B8819K13940L9916n5034r6821j38447j72142r0596R5642J25179J12172J21603
$$ y = [-40557, 234033, 310335, 263859, 213020, 167164, -21057, -154551, -78453, -26329, 44270, -122649, -206650, -88846, 32910, 78529, 108129, -38942, -158857, -197715, -28070, 10677, -75871, -268790, -280520, -88401, 62670, -84655, -141627, 37124, 146698, 119306, 89528, 67799, 29909, -114691, -215493, -305330, -216813, -154633, 25719, 275234, 184993, 135774, 37878, -76669, -57515, 38185, 23912, -199006, -258213, -297606, -235646, -136592, -3998, 53419, -56549, 54040, 107692, 33246, -115812, -183126, -97611, -8230, -91608, -12443, -48931, -213569, -252370, -130706, 71785, 98053, 179271, 184565, -8108, 28819, 242759, 282675, 227641, 130820, -7627, -179769, -270365, -174723, -49544, 62628, 184231]
13495A84231P0429R8013P5994j47998R0035o2542j29611n0957j7632k5917j31445
13484d7400q2908J35523l6364k01123J94429Q3371n7815l8732j40765J52779J93958
13473A54953J0106P3294J1531k03110r3339m915j07862l3500n0732Q4583J38253
13462b0738m8956L5893q1862j35293M0744O7041N7416j00485j2253o525j3808
13451b18826J02027J60602J73377L5229j20944j39203n9527j6740K7946n930K6757
13440c5232o2189K27266K8591j87526j71404P9933J17673P5002l7891q542o4889
13429c9208r7813J57509l9306P5893J30675k9662j63827q5958L8871M0997J4576
13418B747j46954j81307Q578J02052N5923P3393J75689P1792o9258o1222o9912
$$ y = [184231, 254660, 352673, 428667, 280669, 370704, 308162, 178551, 127594, 109962, 84045, -47400, -130308, 5215, -31149, -232272, -37843, 45528, -12287, -51019, -191784, -39005, 154953, 165059, 238353, 249884, 46774, -46565, -51480, -159342, -192842, -243574, -158991, -20738, -69694, -33801, -115663, -250956, -210212, -143171, -85755, -186240, -198493, -205018, -218826, -116799, 43803, 217180, 252409, 131465, -7738, -67265, -84005, -56059, -61989, -35232, -97421, 129845, 158436, -29090, -200494, -120561, -2888, 72114, 34223, 25681, -39208, -137021, 20488, -18818, 57075, 187750, 158088, -5739, -91697, -52826, -11829, 2747, -144207, -325514, -316936, -214884, -158961, -85568, 90121, 161913, 92655, 31433, -38479]
13407c8479l2668o0472N1562l044o6448Q7917J80661R0685p3500p5066L7334n0647
13395D7835l0493o3162n7035M8446j1527m3645M9853O8686r4104L0508O4790L1836
13383D1988l0032q3426M0546R7800l4280k0810j09279P7881o0293J2622J2200
13372e5083j94276j49011J55483N1603j0121M7678J8140j46310Q799J58594J74239
13361E9735q9034m2543M714J19090n3435p2822j36974Q0033K88254j10605m0772
13350E641p8784j15427P7258N8113n0278n0336P5985J20596m2852M6202K40167
13339B86285n69j67157o5252o6530q5736j16184p1072j1610l3898o459R5232l529
13327b46479R1469o8164M3354K27107R2445m1552p0678j22836O7676k3239J1402
$$ y = [-38479, -71147, -131619, -80057, -83101, -149549, -61632, 119029, 209714, 136214, 61148, 98482, 47835, 17342, -45820, -102855, -54409, -65936, -109581, -59728, 8958, -85146, -54638, 10152, 41988, 11956, -71470, -30924, 66876, 32596, 11786, -97493, -19612, -79905, -67283, -55083, -249359, -398370, -242887, -191284, -201405, -153727, -135587, -281897, -273098, -114504, 59735, -29299, -71842, -67128, 51962, -1473, -74295, -211269, -131236, 157018, 46413, 5641, -73143, -188570, -111312, -53199, -103477, -153813, -77828, 42768, -84, 46118, 286285, 285716, 118559, 53307, -13223, -98959, -215143, -286215, -297825, -331723, -338182, -242950, -246479, -155010, -223174, -179820, 47287, 139732, 98180, 27502, -95334, -27658, -50897, -39495]
13316c9495j50213j2027R4344Q5231R2350J46960k07281J1008P3386j53882o2508
13305a22127p017K6829q5574l6340j4173J19838P2201L9871M0596j98495j94693
13294c59084j864O6365L8277J96314K02465L1289j97630j49304J01053j7761m6266
13283a36146r8394M8548J02174j9143N0654q8716K0810J54623n2575o555q4950
13272a09670O8612J13995K0604o0707k33384j4951M9284k6321m9835K8935M3808
13261a69630J27909j4171j37109m4853L9140R2725L6620O829K15838L6689p7530
13250A12457r7946j62808j12852p1056K19588Q3747J5349J2250O1832m0032L2773
13239E3302M21j00402N3059R1196N4860N8084p022j4562l7045K004n7078j5357
$$ y = [-39495, -189708, -201735, -107391, -22160, 70190, 217150, 9869, 20877, 94263, -59619, -122127, -129144, -102315, -187889, -224229, -238402, -118564, -46363, -6492, 34104, -164391, -359084, -360948, -294583, -256306, -59992, 142473, 173762, -23868, -173172, -72119, -89880, -136146, -234540, -185992, -83818, -102961, -52307, -141023, -120213, 34410, -18165, -24720, -109670, -41058, 72937, 93541, 32834, -200550, -215501, -166217, -192538, -242373, -213438, -169630, -41721, -55892, -193001, -237854, -198714, -105989, -69369, -62540, 153298, 189987, 112457, 14511, -148297, -261149, -332205, -112617, -28870, -13521, -1271, 60561, 20529, 53302, 53723, -46679, 6380, 97576, 152436, 210520, 203498, 188936, 151891, 153895, 96817, 81460]
13227H1460j18492j28508j3534K4261r578J11079J44669N1787J46609n5882p3065
13216A60806J27286P9622j29336K3724l7512j00025k3215Q6208L6525J32058O374
13205C62515j4834o8375j82877K2380K52853J93521L08675K82332O0686r8030
13195A118846j0452l14978l30392K3172M0025m3090J19574R4822N4004j25640
13185F25891J8029J46693Q2313l05436L6956J75578J10395q8514j02952J12727
13175H11680P1812k21718R8944J73356R8403j5888P9949J16334M7804j62951l8236
13164A059489j9673L8249K08902r5769o1638j41276j13541O8699m0864j16944
13154G85634k74841j72173k05540N4882N9791l985K34616N2340j37622J5331O409
$$ y = [81460, -37032, -165540, -179074, -154813, -164391, -53312, 91357, 143144, 289753, 233871, 160806, 288092, 367714, 238378, 262102, 224590, 124565, 101350, 187558, 224083, 356141, 362515, 347681, 279306, 96429, 118809, 371662, 565183, 873858, 1156190, 1216876, 1118846, 1108394, 793416, 463024, 486196, 526221, 483131, 602705, 697527, 751531, 625891, 643920, 790613, 872926, 567490, 604446, 780024, 890419, 801905, 698953, 811680, 883492, 661774, 760718, 934074, 1032477, 1016589, 1096538, 1212872, 1260676, 1097725, 1059489, 1039816, 1078065, 1286967, 1191198, 1129560, 988284, 874743, 943442, 902578, 785634, 510793, 338620, 133080, 187962, 247753, 243768, 478384, 530724, 393102, 408433, 414842]
13143D14842J99455K03882J05654R8484m2221j39562j25114L0796o4766j42653
13133E38797r5925k62161q6584j15769K8621J03919j53712k05802P0261J05939
13123g2416M0549M8578J6747R2461J40722J19884L7653q4936j64297l2162m8509
13112I4274k39762o9552K41825O6918j8130p6441k01857J18467k3814J0712p8730
13101a76090N7883N0792j7587J21178o8253n1405j368k468k0351r1438J63P5928
13089a23016L5314Q0692p0956L7141r6884J3841j3679L4749J97214N4628j37965
13078A1079j07641q3087J28972M9446o3546n3766K17729L4149M6069J04887j45529
13067A38762j96247L7798L2262j4148M7140n2262j38422N1948P9798P0635m7208
$$ y = [414842, 614297, 818179, 923833, 1022317, 980096, 840534, 715420, 746216, 681450, 538797, 442872, 180711, 94127, -21642, 6979, 110898, -42814, -248616, -178355, -72416, -31867, 16711, 33458, 125919, 266641, 386525, 424178, 339242, 174945, 142783, 94274, -145488, -215040, 26785, 93703, 75573, -868, -202725, -84258, -108072, -97360, -176090, -118207, -67415, -85002, 36176, -32077, -83482, -84850, -87318, -107669, -199107, -198944, -123016, -87702, -7010, -77966, -40825, -137709, -123868, -137547, -102798, 94416, 149044, 11079, -96562, -179649, -50677, -1231, -64777, -118543, 99186, 133335, 179404, 284291, 138762, -57485, -19687, 12575, -1573, 45567, -6695, -145117, -93169, -13371, 57264, 10056]
13056A0056K0584q1158k0064N2656m4517o5135J78996J38785j51828l5307J20137
13045A23205j11544j70233L801K204L4835o8447Q2983p6658j32891P1518o808
13034b48035O0902l1835k3057J6785J72348K91767k5615j16142j15515O8455m224
13023D5834L8275n6254J5866K4504M5839M9399l469o5144q2176j95007M351j2342
13011a90324k6929N6200J56167k5553K37720J77199j91051k38519M6441r8598
13001i7247R722J47904J49751M254r1888p1573J41137m1024r8738L3869O3636
12990A49803j06541n9773M8459n0806k57046m759J82774J26923J34770j51592
12980A2212j67015q170k214P8424j8485m3981K5047j2389J92990K26726J8035
$$ y = [10056, 30640, -50518, -70582, -17926, -62443, -127578, 51418, 190203, 38375, 3068, 123205, 11661, -158572, -154771, -152567, -117732, -186179, -103196, -179854, -312745, -241227, -248035, -187133, -218968, -242025, -225240, -52892, 238875, 213260, 97118, -18397, 50058, 45834, 84109, 27855, 43721, 68225, 114064, 163463, 159994, 94850, 12674, -182333, -177982, -190324, -217253, -161053, -4886, -30439, 207281, 384480, 193429, -45090, 1351, -97247, -87525, 60379, 210130, 214384, 122496, 50923, 192060, 151036, 52298, 86167, 149803, 43262, -16511, 31948, -18858, -275904, -280663, -97889, 29034, 163804, 12212, -154803, -162973, -165187, -86763, -105248, -149229, -124182, -136571, 56419, 283145, 301180]
12969C01180j3677j41456p7184R7246J55666k75301j10358J42258O1855J38038
12959B78267L0370j03466j54464k1520p461j28705n8240J00674M4808L2599J10656
12948A23518p7872M1172L4665r8768j42500m4986J07252J38852R1571N7500P1413
12937C01817O3182l3214k9206l3865j49734n1190l709K6917K4518J29838J06951
12926C52305r7877n7627o8499K6974K5964l5742M1454O2389o9217j3486R3081
12915B59719K20893j50687k01077q6047R8765q1233q596m6362K489O1128J71431
12904B40423m0347k7233l9894q8084l1111K2478l6620r6006K1239J53052o228
12893G1669N1419R2509J00838p010m5185k3021J9784J11677J18464M438K5238
$$ y = [301180, 287503, 146047, 68863, 166109, 321775, 46474, -63884, 78374, 140229, 278267, 308637, 205171, 50707, 29187, 21726, -106979, -165219, -64545, -19737, 12862, 123518, 45646, 86818, 121483, 22715, -119785, -164771, -57519, 81333, 172904, 230404, 301817, 364999, 331785, 302579, 268714, 118980, 67790, 64081, 90998, 115516, 245354, 352305, 254428, 196801, 128302, 155276, 181240, 145498, 186952, 249341, 180124, 166638, 259719, 480612, 329925, 128848, 42801, 141566, 60333, 51737, 5375, 7864, 68992, 240423, 200076, 172843, 132949, 44865, 13754, 36232, -388, -96394, -75155, 77897, 71669, 123088, 215597, 316435, 309425, 264240, 241219, 261003, 372680, 491144, 495582, 520820]
12882E20820Q672O3313j35385j25844Q1359j07586p82J7648j68837J26852P251
12871B87481J481J33599L622O2410M8027J59650m6637k3209K03800Q2695n1838
12860H61081N2159o5963q2740j0736m1161j1392p1686O1126o8483j87806o165
12849D28234Q2662r5283k25409l3097m6390K6571K8905k4215j34817J27529J8131
12838A52821J10812j295K8820q2736m8861J31388R2596J2300o9285m8773K703
12827B80490R5196K6465n5862j4021J47864Q7481j39987j68300j22563K9063J58404
12816C24230j35396m0277J11329j42117q0974N3301P3955l4381J86085J61118
12806D76873m664J1121m2103m2782M5967j1158m6880J40281J14366P5823K68794
$$ y = [520820, 529492, 592805, 457420, 331576, 412935, 305349, 304567, 322215, 153378, 280230, 287481, 288962, 422561, 426183, 488593, 536620, 696270, 649633, 626424, 830224, 912919, 861081, 913240, 847277, 764537, 753801, 712640, 701248, 629562, 690688, 622205, 434399, 428234, 510896, 415613, 190204, 157107, 110717, 137288, 166193, 141978, 7161, 134690, 152821, 263633, 262338, 291158, 208422, 159561, 290949, 383545, 395845, 326560, 277787, 280490, 375686, 402151, 346289, 332268, 480132, 567613, 427626, 259326, 136763, 165826, 324230, 188834, 148557, 259886, 117769, 36795, 90096, 164051, 129670, 315755, 476873, 472209, 483330, 441227, 398445, 444412, 433254, 386374, 526655, 641021, 716844, 985638]
12795I85638j46224k17613N5936K68514J99101Q7122L92l3255M2110J28406J44937
12784A515064q3303j132L3666J05341J74596L03847K00294J04520Q4994K56406
12774B694293M44305M13702K23000L9547P7497L50261M19586M39618O02689P08714
12764F413212P06970J107432J217351J386351J477447J711270K017165K545905
12756A8583103L173434M244066N759396P709879J0354591J3924405J8426012K3450342
12748A05625228K8458970L1364640K8444249J6680190k210289j8423503k5907567
12741A64031918k5733914k1937739j6880018j1822911p342304l134794L86535
12734G7566773L687774O333155Q389738R925721R963274Q640331O455217M193861
$$ y = [985638, 839414, 621801, 677737, 946251, 1145352, 1232474, 1232866, 1199611, 1241721, 1370127, 1515064, 1431761, 1430629, 1464295, 1569636, 1744232, 2048079, 2248373, 2352893, 2437887, 2694293, 3138598, 3552300, 3775300, 3814847, 3892344, 4242605, 4662191, 5101809, 5704498, 6413212, 7120182, 8227614, 9444965, 10831316, 12308763, 14020033, 16037198, 18583103, 21756537, 26000603, 31759999, 39469878, 49824469, 63748874, 82174886, 105625228, 134084198, 165448838, 193893087, 210573277, 208362988, 189939485, 164031918, 138298004, 116360265, 99480247, 87657336, 80315032, 77180238, 77566773, 81254547, 87587702, 95977440, 105903161, 115866435, 124506766, 130961983, 135155844]
12726A35155844K811256K134456K517441L768312O432922R958522J3465276J5673042
12718A91917071J5314846J1327400L988421n127462j2482666j5868598j5728902
12711A73340110j3574617j0474670o716091l531118j337941o5593M49417K32778
12703A38322275j419988l928388o627649q789558r591235q807740o875091l874970
12695H8407656j78474M009873Q854377J4720698K0975256K6595851K9643293K7064777
12687B20093307J6386053j751551k0989317l2061925l3334292k9024300k3609471
12680I5708504j8475752j4194929j0891269q230039o363511m860872m021629l188530
12672B5481973k676390k208139j813542j989642j570357j307882j328834r68612
$$ y = [135155844, 137967100, 140101556, 142618997, 146387309, 152820231, 162778753, 176244029, 191917071, 207231917, 218559317, 222547738, 217420276, 204937610, 189069012, 173340110, 159765493, 149290823, 142574732, 139043614, 137705673, 137640080, 138089497, 138322275, 136902287, 132973899, 126346250, 117556692, 107965457, 99157717, 92282626, 88407656, 88229182, 92239055, 101093432, 115814130, 136789386, 163385237, 193028530, 220093307, 236479360, 234727809, 213738492, 181676567, 148342275, 119317975, 95708504, 77232752, 63037823, 52146554, 43916515, 37553004, 32692132, 28670503, 25481973, 22805583, 20597444, 18783902, 16794260, 15223903, 13916021, 12587187, 11618575]
12664A1618575q28020p01534n74295m99977o44415m63146n55241n91427l52755
12655F407765m29119n64883k53846k99129l25046k39040o7153k07630k24954q5015
12645C711950j83075k22166k31170j44977n3752q0782L2171J7414j01700j02611
12635B641302l8463r8821m5982M7905j2739j19885p6225J57318k8006j96420r8533
12624B131451J5930p1137k55066o6005J14646J0607J47619j12756j43855j8146
12614A753288l1278p9336l0068K9848q3769J25990M1548j65265L7322N1820j56849
12603A493251k04270m9704o974J4135j10390J2978J18797J16105P3539q9043p4984
12592A293440k09421P8444N7634J5021L832K1926M6809j04581j10197n2604l8478
$$ y = [11618575, 10790555, 10089021, 9514726, 9014749, 8370334, 7907188, 7351947, 6760520, 6407765, 5978646, 5413763, 5159917, 4860788, 4535742, 4296702, 4229549, 4021919, 3796965, 3711950, 3528875, 3306709, 3075539, 2930562, 2876810, 2796028, 2828199, 2845613, 2743913, 2641302, 2602839, 2504018, 2458036, 2505941, 2493202, 2373317, 2297092, 2454410, 2426404, 2229984, 2131451, 2147381, 2076244, 1821178, 1755173, 1869819, 1880426, 2028045, 1915289, 1771434, 1753288, 1722010, 1642674, 1612606, 1642454, 1558685, 1684675, 1726223, 1560958, 1598280, 1650100, 1493251, 1288981, 1239277, 1232303, 1246438, 1136048, 1149026, 1267823, 1383928, 1457467, 1368424, 1293440, 1084019, 1162463, 1220097, 1235118, 1238950, 1260876, 1307685, 1203104, 1092907, 1040303, 1001825]
12581A001825J5566Q2191N3960L2288Q3071K483K46331K41369j47752j61374Q1668
12570A531626K54714K7189l4257r3757j49097j8624j12122j08295m1030j89425
12560A066922O275j51942j00736j8281k21524N1639R5034K6948q1020M8993p6015
12549F46293m6847l4354q4054P5611j5790j44952q1041r1939O2101J08692J09343
12538E03063K8965P0637K5672r5393p0152o363J85086l6591p7867j19030j9221
12527C88806j26001l1168K71671L7691P4344L2507q0356R411J1439M8676j16131
12516E20889j91487k07674K1802J86176N2901O835m985j0967n7130l5906J57357
12505D37811J63737k657j208J20022o3207j72477o2661K775r0297n9921l4687
$$ y = [1001825, 1017391, 1099582, 1153542, 1185830, 1268901, 1271384, 1517715, 1759084, 1611332, 1449958, 1531626, 1786340, 1813529, 1779272, 1685515, 1536418, 1517794, 1405672, 1297377, 1256347, 1066922, 1073197, 921255, 820519, 802238, 580714, 632353, 727387, 754335, 673315, 722308, 646293, 599446, 565092, 481038, 556649, 540859, 395907, 314866, 222927, 285028, 393720, 503063, 532028, 602665, 628337, 532944, 462792, 456429, 641515, 604924, 527057, 408027, 388806, 262805, 231637, 503308, 540999, 615343, 647850, 567494, 576905, 588344, 637020, 520889, 329402, 121728, 143530, 329706, 382607, 389442, 384457, 373490, 316360, 280454, 437811, 601548, 598891, 597683, 717705, 654498, 482021, 419360, 422135, 331838, 271917, 237230]
12494B37230K6231J03478J29543J28040n1512j12884l2123K5853J5692L2244j0126
12483D91666R4058j25524j91254r8020j014p4222j10647n8515J61912J01503n859
12472A84084j5965K1879J2889r6407l0073j30080J05229J48793Q1829M4154k8286
12461B98046K5387m2737l6582J18255J03560o9737j15867j31472k22962j14487
12451a88596J66396K45985J10090J08955j69741P2617r0249j95630J92923J11322
12441C64072q0946j77749N4749j4249k5067J59827L1186O8282N0363N5178j7636
12430D68010K4652j68832m7207j2337N2325J31104M340o8189n4872j05125q6454
12419A37415p9700l5854J0528J66182M5750Q9814O5822J0941O7245K0715j00547
$$ y = [237230, 263461, 366939, 496482, 624522, 573010, 460126, 428003, 453856, 469548, 501792, 491666, 585724, 460200, 268946, 170926, 169912, 95690, -14957, -73472, 88440, 189943, 184084, 168119, 189998, 202887, 106480, 76407, -53673, 51556, 200349, 282178, 326332, 298046, 323433, 280696, 244114, 362369, 465929, 396192, 280325, 148853, -74109, -188596, -22200, 223785, 333875, 442830, 273089, 345706, 255457, 59827, 252750, 364072, 283126, 105377, 160126, 145877, 120810, 280637, 311823, 380105, 430468, 485646, 468010, 492662, 323830, 276623, 264286, 316611, 447715, 452055, 383866, 328994, 223869, 137415, 57715, 21861, 32389, 198571, 244321, 334135, 399957, 410898, 478143, 498858, 398311]
12408C98311j84765K0595Q1917J21547J71934l443Q2579q2642p9758j44888k36798
12397A44589r2066j5706J3562K25400j36977k19468J1489j8674J39751K34001
12387B85901K7191n2880n0484J488M7828J23431k10569k72924J82406L49652J9987
12376D51027k04560M4019J34182L0007j28696J18923o7993j52076m8317N3622
12366B30138j99066n3868J15481J89552K6805K7838k54455n208J77979J92154
12356D47350L8847p119k59823j13120n4023R2167N6774r2726j0972J2970j51837
12345d1512J35932M7465J80240m274q7636J29877J6742P0663m129j46643M8016
12334C44741m7100j20319j46249r0330n3185R423N2945M8897j12351m8646J08518
$$ y = [398311, 213546, 234141, 316058, 437605, 609539, 606096, 688675, 606033, 526275, 381387, 144589, 52523, 36817, 50379, 275779, 138802, -80666, -69177, -87851, 51900, 285901, 313092, 260212, 209728, 211216, 259044, 382475, 171906, -101018, 81388, 431040, 451027, 246467, 290486, 424668, 454675, 325979, 444902, 376909, 224833, 176516, 230138, 31072, -22796, 92685, 282237, 309042, 336880, 82425, 77217, 255196, 447350, 486197, 479078, 219255, 106135, 52112, 144279, 201053, 108327, 97355, 110325, -41512, 94420, 141885, 322125, 317851, 230215, 360092, 376834, 447497, 443368, 296725, 344741, 297641, 177322, 31073, -59257, -112442, -103019, -50074, -1177, -113528, -162174, -53656]
12323e3656P6369k5124K2155p4664J73416J90706J3855J37766K8361k7766k08393
12312B53025j89334Q8851L3855M6797p7704n2706p0551O5642J67686J05466M7581
12301D18608J9851k8134j06765o0495L0275l5535j36919p1221m0093P1538J91792
12290B52902J94525K23613P0003J26218M6431l2078J08529j98998j32878L3872
12280F92139n1076q4347l0614J03633O6j05496J38891k9776j73754K50685J17458
12269H27809j03840j04380N4197J31389K24916p7892j6613r8077n093J93317L04209
12258A329942J5808j28839k49290m5888J31805j4878j35727r5474l1381J18737
12248H94815J37644J1542m9459m1281p1748k46033m3904k4230L5018j01128j76577
$$ y = [-53656, 22713, -2411, 19744, -54920, 118496, 309202, 323057, 460823, 489184, 461418, 253025, 63691, 152542, 186397, 233194, 155490, 102784, 32233, 97875, 265561, 371027, 418608, 438459, 410325, 303560, 243065, 273340, 237805, 100886, 29665, -10428, 61110, 252902, 447427, 671040, 741043, 867261, 913692, 881614, 990143, 791145, 658267, 692139, 641063, 556716, 526102, 629735, 629801, 524305, 663196, 633420, 459666, 710351, 827809, 723969, 619589, 673786, 805175, 1030091, 952199, 935586, 837509, 832416, 1025733, 1329942, 1345750, 1216911, 967621, 921733, 1053538, 1038660, 902933, 807459, 776078, 894815, 1032459, 1044001, 994542, 953261, 881513, 635480, 591576, 567346, 602364, 501236, 324659]
12237C24659o2830Q2988J46585L69212J76906j67538p5302l2670J43944K53613
12227A159567J41063k0982j44284j61176j81687l08083j14420j19964j11687J6023
12217A54370J85086o1225k07188j30622J26939k2071Q8593j71447J1703N9051
12207C3189j2225K27954J18052k8188p4710j37899j5910j46879j10747m2006R6572
12196i2797J46143k1280Q0341j9745N1048o6801r4296m6788P9846R7493j19576
12185f412j28510K31660R2394j8499j02704j03901K5156j44136k6169R0280Q167
12174h2674R8388J02309o2397r4801n670J17659l2605r1405p1937Q2432l1145
12163g1846r7989o2243P5141K24053O3381Q8580m0659m7710O2393K8100j48085
$$ y = [324659, 261829, 344817, 491402, 860614, 1037520, 869982, 794680, 762010, 905954, 1159567, 1300630, 1279648, 1135364, 974188, 792501, 484418, 369998, 250034, 138347, 154370, 339456, 278231, 71043, -59579, 67360, 45289, 133882, -37565, -25862, 33189, 20964, 248918, 366970, 338782, 264072, 126173, 110263, -36616, -147363, -189369, -92797, 53346, 32066, 112407, 92662, 143710, 76909, -17387, -64175, 15671, 113164, -6412, -134922, 96738, 189132, 170633, 67929, -35972, -10816, -154952, -181121, -90841, -82674, 15714, 118023, 55626, -39175, -44845, 72814, 40209, -51196, -123133, -40701, -71846, -169835, -232078, -156937, 67116, 130497, 219077, 178418, 130708, 193101, 221201, 73116]
12152G3116o0696J51814J16034m5710m5294O3405j0108K3518L0521k70858j87316
12141a61574N906N8438N1009J22432P4103j03325q6685K07099O3409j01626j15700
12130A3486q743Q4818L5000p3182J24413J41341J8134K3120j08530k41316k1790
12119a3249J33446R5692j47787r1486j06630j10162P1301o3962p0378K917n1391
12108c51689J11624J01243m3555l8363J12339O4264m8910k9839K1555n0037R4360
12097e7008R1795L64801N7136j55236k04724j24343m2881O8007J00054K2636R8440
12086B18677n4422p2638n5183q4260m8799O0128Q0140k0672n7802j5883N893j01250
12074a46071M9860J08510q0487k0961O5783L8744J1242o7329M6901Q2580n9763
$$ y = [73116, 12420, 164234, 280268, 234558, 189264, 252669, 242561, 266079, 296600, 25742, -161574, -155668, -97230, -46221, 76211, 150314, 46989, -39696, 167403, 230812, 129186, 13486, 4743, 89561, 124561, 51379, 175792, 317133, 335267, 358387, 249857, 8541, -13249, 120197, 215889, 68102, -23384, -130014, -240176, -168875, -232837, -303215, -300298, -351689, -240065, -138822, -182377, -220740, -108401, -44137, -93047, -122886, -101331, -151368, -57008, 34787, 399588, 456724, 301488, 96764, -27579, -70460, -2453, 97601, 120237, 218677, 164255, 91617, 36434, -47826, -96625, -36497, 43643, 22971, -34831, -50714, -44821, -146071, -96211, 12299, -68188, -89149, -23366, 15378, 26620, -40709, 6192, 88772, 29009]
12063B9009l1404q5553n0606P6613J56203j5779L8669J40032p8294j53747L4067
12052E9210J1804O6337R1784r2843l2538K8844o8233l233J97309j45077M4037
12041A57401J52471l360L1971L2924j12670j27732N0406J2522r4818j29398N2948
12030B2665r8041k7948L1187N6810J23569j73117p6070K05859k9292J05005J85869
12019C26496J62777q273j57198j96191n2661n7139K19540P587M7569n9655Q1751
12008C14603J17784J72599K1537j07817P4010J60635L2459l4344K77757K96980
11998A326203m708p2389j61706r6891j56357k4696j46363j24678J2387Q9374Q1780
11987G21956l7673O890K7420r8845k8993O9988j39449J9446L052J08358Q6034
$$ y = [29009, -2395, -87948, -138554, -61941, 94262, 78483, 117152, 257184, 178890, 25143, 59210, 71014, 137351, 229135, 136292, 103754, 132598, 64365, 61132, 258441, 113364, 157401, 309872, 306512, 338483, 371407, 258737, 131005, 181411, 193933, 99115, -30283, 22665, -75376, -103324, -72137, -15327, 108242, -64875, -140945, 64914, 35622, 140627, 326496, 489273, 481000, 323802, 127611, 74950, 17811, 237351, 244938, 292507, 232852, 314603, 432387, 604986, 626523, 518706, 592716, 753351, 785810, 751466, 1029223, 1326203, 1321495, 1249106, 1087400, 990509, 834152, 809456, 663093, 538415, 550802, 640176, 721956, 684283, 691173, 718593, 619748, 590755, 660743, 521294, 540740, 543792, 652150, 738184]
11976G38184N3714N9733k08184J2783K10127J60963M7861M5626J18910j0707j19833
11965A109177q0028J7768m5366p9687j3927M3832K6924J1372k05129r6367m5853
11954F42716L6086L3858l1943j64401j45858n1565j8325P5258M8132J31279M711
11943E59948j0164j7996P9949K04535m2493j94788J8005N1291r9776p5148K4748
11932D98111m5838k7235J8673p6952q646n1551j96288o6531k1520J05570j13094
11921A4699j59670k5556K03519K09616k82597N10Q8931j06337J42093R6408r862
11910A71754j44470q5210N5101R6693L1696n8838j26990j55577R1897K6938j41703
11899b38709k8995J96887J40011L9728p6944j9685m1545q5609q7877j6259J68753
$$ y = [738184, 791898, 851631, 643447, 656230, 866357, 1027320, 1075181, 1120807, 1239717, 1229010, 1109177, 1029149, 1046917, 1001551, 921864, 907937, 951769, 978693, 990065, 784936, 688569, 642716, 678802, 712660, 680717, 516316, 370458, 318893, 300568, 375826, 423958, 555237, 559948, 549784, 531788, 611737, 816272, 773779, 578991, 596996, 648287, 548511, 473363, 498111, 452273, 425038, 443711, 366759, 358113, 306562, 110274, 43743, 22223, 127793, 14699, -144971, -170527, 32992, 242608, -39989, -39479, 49452, -56885, 85208, 181616, 171754, 27284, -57926, -2825, 93868, 125564, 66726, -60264, -215841, -123944, -97006, -238709, -267704, -70817, 69194, 108922, 31978, 12293, -29252, -114861, -202738, -218997, -50244]
11888e0244j8959j14434J27925L4274j00610J55793J0284J10973m774j48676Q4429
11877H5981R3509J3938k3869J155k4471J6288k74566K0893J25739J06784J76199
11866C17580m1910j73502m0264n0428p4715J2129P6845J29426k3428R4190N1635
11855B77558l8530o3255J8710j12735l7471k9625r7049q4791l7474j66416j76457
11844e47535Q1220J61058K44022K09719k9312j22045J51705j99575k3886j3616
11834h8245j10440q9030J38803J11479L5212m9158j26101n8166J77981J1593j09943
11823a56015J01309q1081j3255N6322J69840j22602J254o4652K35969k7086j15856
11812a5853Q5403O5550r0720n4176j22860l5423R5208J1029k8746m63P8811j71435
$$ y = [-50244, -69203, -183637, -55712, -21438, -122048, 33745, 44029, 155002, 150228, 1552, 85981, 179490, 193428, 169559, 170714, 146243, 162531, -112035, -91142, 34597, 141381, 317580, 275670, 102168, 61904, 11476, -63239, -51110, 25735, 155161, 131733, 225923, 277558, 239028, 175773, 194483, 81748, 44277, 14652, -82397, -167188, -204662, -371078, -547535, -466315, -305257, -61235, 148484, 119172, -2873, 148832, -50743, -74629, -88245, -198685, -287715, -148912, -37433, -2221, -51379, -177480, -235646, -57665, -46072, -156015, -54706, -135787, -149042, -92720, 77120, -45482, -44228, -108880, 127089, 100003, -15853, 69550, 135100, 44380, -9796, -132656, -168079, -72871, -61842, -90588, -91051, -12240, -183675]
11800a83675l0568N3244J36436j815j04281k2588k8534l060O3122O5680O7272
11789A1233J71665J31150j3509j59645j24930j09771j5796Q9391J12876n0520
11779D2144j85264P0075L9496J51161N3904J1615p0254n9589j63211j44987k4518
11768b79428J99630O9169P9636J25043N0578Q655J0962J07246J38142k7725k81760
11757B00148k22669L9896j00855p4564M9110R9476k2244L7322L0645N5610J1360
11746A03235l1941r861J01322j8362n9778L6880Q3430L7648J7251j17197q9745
11735E2882L1651k1537k0433j7854p6713J22558J64068j35057j79197m6748K29501
11724A03121J33584j44626O9382J91957n3337j03808o0935k4758k6364m0513P0446
$$ y = [-183675, -214243, -160999, -24563, -26378, -130659, -153247, -181781, -184841, -121719, -56039, 11233, 182898, 314048, 300539, 140894, 15964, -93807, -109603, -20212, 92664, 42144, -143120, -73045, -33549, 117612, 171516, 183131, 112877, 53288, -109923, -254910, -279428, -79798, -10629, 69007, 194050, 244628, 253283, 264245, 371491, 509633, 481908, 200148, -22521, 17375, -83480, -158044, -108934, -9458, -31702, 5620, 36265, 91875, 103235, 71294, 61433, 162755, 144393, 84615, 121495, 204925, 242573, 259824, 142627, 52882, 84533, 62996, 42563, 24709, -52004, 70554, 234622, 99565, -79632, -126380, 103121, 236705, 92079, 161461, 353418, 300081, 196273, 135338, 110580, 84216, 43703, 114149]
11713A14149L3351K0197J87301J72306J3026o3246J3430m3943l0842j57838m046
11702B53845O317O862j2240p8194L0613K22285j11633L8443J26924J27502J44636
11691G55360Q880j03618J25505K9886j299j29611j31701k3581P90j10953j8137
11680D01521o6811k0412L6150r7190j28203R4564K05573Q9750p4731k85098n0631
11669A04482k2454O4144N277O1031m2173k3934L8254Q7025j77874j09217k4582
11658d0021J0858N5507K5367m73Q7433Q5921M6493N7319N3967j22186L3728Q1639
11646C75552k63265j15305J4036O5340J47395J33175m0035O659J32870j4772M3429
11635D85079J07334j5428p6573j6621m7186L6680J66221O1321k0232p6338k35070
$$ y = [114149, 147500, 167697, 354998, 527304, 540330, 477084, 490514, 446571, 415729, 257891, 253845, 260162, 267024, 254784, 176590, 207203, 429488, 317855, 356298, 483222, 610724, 755360, 764240, 660622, 786127, 816013, 814714, 685103, 553402, 529821, 530611, 419658, 401521, 334710, 314298, 350448, 253258, 125055, 219619, 425192, 514942, 440211, 155113, 104482, 82028, 146172, 151449, 212480, 170307, 146373, 184627, 271652, 93778, -15439, -40021, -29163, 26344, 51711, 51238, 138671, 224592, 271085, 328404, 382371, 260185, 293913, 375552, 112287, -3018, 11018, 76358, 223753, 356928, 316893, 323552, 456422, 441650, 485079, 592413, 576985, 500412, 483791, 436605, 473285, 639506, 700827, 680595, 604257, 369187]
11624C69187q0058J80692N8573N9976M4459J50504P8318J79409L6160L5285O0184
11613A172689J81259K50723m6164j5069J45060J78915K39294L64107K33592R2728
11603B797134R823J47937J74386L18118L80952K09997J60130L29563M98571N05038
11593E531649Q27474J023415J078032J357994J315702J364919J645428K113766
11585A6258379K364151K889377L643196M890179O647703R126747J2359570J6386968
11577G4566270K1387603K6884715L1154332L1900200K6045631J1897229n421785
11570B18414195j8893372k4781507k4702641k2007801j7952480j3024147p805208
11563H9247039l057071J576763N472034Q148552R168551Q666905O661452M419513
$$ y = [369187, 289129, 469821, 528394, 588370, 632829, 783333, 861651, 1041060, 1077220, 1112505, 1172689, 1353948, 1604671, 1558507, 1543438, 1688498, 1867413, 2106707, 2470814, 2704406, 2797134, 2806957, 2954894, 3129280, 3447398, 3828350, 4038347, 4198477, 4528040, 5026611, 5531649, 6359123, 7382538, 8460570, 9818564, 11134266, 12499185, 14144613, 16258379, 18622530, 21511907, 25155103, 30045282, 36692985, 45819732, 58179302, 74566270, 95953873, 122838588, 153992920, 185893120, 211938751, 223835980, 218414195, 199520823, 174739316, 150036675, 128028874, 110076394, 97052247, 89247039, 86189968, 87766731, 93238765, 101387317, 110555868, 119222773, 125884225, 130303738]
11555A30303738K885640J180047j160434k954588k484090j58312L928030R464492
11547A41004523J5616232K1016342K3672255K1521751J3636193J606721j0428592
11540B27645425j8515350k1228516j9026341j4035867q579818m191992j401787
11533A40665754l32079o62539k408353m215896n900229p969325r747000j0404305
11525I9026028r005056o513649l278370L02773M642522R146666J3685004J7951986
11517A25957904K1545274K3407299K1281990J3719529L06868j5026452k5525051
11510A65667361k8475346k6116245k1580180j6837919j2981485r988953p604841
11503D2082392n946890m761308l958087l121141k700649k182636j880570j635971
$$ y = [130303738, 133189378, 134369425, 133208991, 130254403, 127770313, 127612001, 131540031, 141004523, 156620755, 177637097, 201309352, 222831103, 236467296, 238074017, 227645425, 209130075, 187901559, 168875218, 154839351, 146259533, 142067541, 140665754, 140333675, 139671136, 137262783, 133046887, 127146658, 119177333, 109430333, 99026028, 90020972, 83507323, 80228953, 80531726, 85174248, 94320914, 108005918, 125957904, 147503178, 170910477, 192192467, 205911996, 206218864, 191192412, 165667361, 137192015, 111075770, 89495590, 72657671, 59676186, 49687233, 42082392, 36135502, 31374194, 27416107, 24294966, 21594317, 19411681, 17531111, 15895140]
11495A5895140j460193j192581j165044r87547p73659o47036o21586p34082m92096
11486G821316m68910m18234m82440l28214k62847l53098l52387j20099l6232k43353
11476D755502l39328k85706j58450j27488m4149m8717p1008j63928l01546j02017
11466C113165N6488j73680Q7399q1260j01273n7407k4795p2286n0581p2860k5087
11455B597823P9142n6911j24845m0291p299q5733N869N6731l8007j73830N0070
11444B262719n396L3489j08279o5274L6945j79293j20568j4883j55445j17092
11434A566923R2099Q0566j41156j12042o4930p836J44232k0840K2957O8345j38792
11423A489526K3344M5403p206J8036J73940o2704R373n765j01850r0092o0390
$$ y = [15895140, 14434947, 13242366, 12077322, 11089775, 10316116, 9669080, 9047494, 8313412, 7821316, 7352406, 6934172, 6451732, 6123518, 5860671, 5507573, 5155186, 5035087, 4998855, 4755502, 4416174, 4130468, 3972018, 3844530, 3800381, 3751664, 3680656, 3516728, 3215182, 3113165, 3169653, 2995973, 3083372, 3002112, 2900839, 2843432, 2818637, 2746351, 2695770, 2622910, 2597823, 2676965, 2620054, 2495209, 2454918, 2447619, 2361886, 2367755, 2424486, 2386479, 2212649, 2262719, 2257323, 2290812, 2182533, 2117259, 2154204, 1974911, 1854343, 1839460, 1684015, 1566923, 1659022, 1739588, 1598432, 1486390, 1421460, 1413624, 1557856, 1537016, 1559973, 1628318, 1489526, 1512870, 1558273, 1551067, 1569103, 1743043, 1680339, 1689712, 1683947, 1582097, 1492005, 1431615]
11412A431615J00493m8765j59042R6324j69944n9228q4224P2904R5604J43739
11402A419476o0212j19500J46165J11274n4823N5698P8434j90024r4328Q4398
11392A376558k7702j11339o2871J10422L0973m588j1191j03208n977M4998p5028
11381A161047m1935j31851j9530J16658j01550j49208L222j5268P7724J70005
11371A069314j58942r3655O3148N5436l9621q3120o7571K08189J65386p6143k48603
11360G93818r4876j8715K9831J53500L5031m3561j51969m9575J07909J4880J31107
11349I07380Q139k57044j65348j85891j51716O4046K93368J60996j55999M2916
11339E60847M6835q0245j65025l2562P3963L2833Q2542M8278n5329j0097r1005
$$ y = [1431615, 1532108, 1483343, 1324301, 1420625, 1250681, 1191453, 1107229, 1180133, 1275737, 1419476, 1359264, 1239764, 1385929, 1497203, 1442380, 1498078, 1576512, 1386488, 1292160, 1376558, 1348856, 1237517, 1174646, 1285068, 1316041, 1311453, 1300262, 1197054, 1191077, 1236075, 1161047, 1119112, 987261, 967731, 1084389, 982839, 833631, 836853, 821585, 899309, 1069314, 910372, 816717, 879865, 935301, 895680, 812560, 744989, 953178, 1118564, 1042421, 793818, 698942, 680227, 710058, 863558, 898589, 855028, 703059, 653484, 761393, 776273, 907380, 915519, 658475, 493127, 307236, 155520, 219566, 512934, 673930, 517931, 560847, 607682, 527437, 362412, 329850, 403813, 436646, 519188, 567466, 512137, 502040, 411035]
11328D11035l1742O6577j13457j7934J48577J82440L52208K1589j82359k8357
11318H08577j05520l4758k51118j91853o6034J084J4905J72483J26438R4035J22177
11307F90416P094j88425k8390q269m8321j83733P7250K31609O8520q5542Q1034
11296F13243J13246o4685n7040j10371r6057K0511K88829K4015k44727N3136J71152
11285G11252R3990K1578k02235j47677J18499K5136j31905N7513J6820L4667l2098
11274E65540p9846p2560R9915J28457M3733k66361m9438m3737J0795M1725M7273
11263D25496M1754m8072j73651J8357m7337R6478J518j3812j17121k298L4278
11252B15590J18235J36811J104K06613o8287j56770n1080j10411j77412L2295
$$ y = [411035, 379293, 445870, 332413, 314479, 463056, 645496, 997704, 1019293, 836934, 808577, 703057, 668299, 417181, 225328, 159294, 160378, 175283, 347766, 474204, 568239, 690416, 697510, 509085, 480695, 472426, 424105, 240372, 317622, 549231, 617751, 532209, 613243, 726489, 661804, 604764, 494393, 398336, 418847, 707676, 731691, 486964, 540100, 711252, 805242, 826820, 624585, 476908, 595407, 620543, 488638, 546151, 562971, 597638, 565540, 485694, 413134, 513049, 641506, 685239, 418878, 369440, 325703, 336498, 378223, 425496, 467250, 419178, 245527, 263884, 216547, 313025, 314543, 300731, 183610, 181312, 215590, 333825, 470636, 471740, 678353, 610066, 453296, 402216, 291805, 114393, 146688]
11242A46688J08188J59514k4533P7017q2492j00298n8638k8991J76217K4990L5772
11231D33434q8348r7579j6709j6404P5442O3516J431j8696J1771k637n4443m7487
11219B43291j08916J08479L4138J22098R9036J8901j25280j11445j24792J9631
11209A75141P1163J15624m3172j16155k7187M4721q1327N9875O5016N6545J02882
11198D23126L3372j06824J22458j9677q0045j33026m7421J41396O7932Q3137Q0002
11187E64430L4514p5067j56451M7543M4839j12593j19806K2257j8788p5815J43063
11176B98126J28987q3270L2100R0908j21212o1110N9686k4568k9174k7100n0181
11165B13192j99074k3402K44618k5481M8942N8854P8118J06351j70916L0501q6232
$$ y = [146688, 254876, 414390, 389857, 466874, 384382, 284084, 225446, 196455, 372672, 397662, 433434, 345086, 247507, 230798, 214394, 289836, 353352, 354783, 336087, 347858, 345221, 290778, 243291, 134375, 242854, 276992, 399090, 498126, 517027, 391747, 280302, 155510, 175141, 246304, 361928, 318756, 202601, 175414, 220135, 138808, 198683, 263699, 320244, 423126, 456498, 349674, 472132, 452455, 372410, 239384, 191963, 333359, 401291, 484428, 564430, 598944, 523877, 367426, 414969, 459808, 347215, 227409, 249666, 230878, 155063, 298126, 427113, 343843, 375943, 466851, 345639, 284529, 344215, 319647, 290473, 263373, 213192, 14118, -9284, 235334, 209853, 258795, 317649, 395767, 502118, 331202, 361703, 275471]
11154B75471o9654l2097Q9741J59176R011J21663J239j15706j16939J99294K20601
11143G41800K53235L0720K37572K09453j18998k72034j6548J11440j10361j28370
11133I37909k34461r5234l6143o4812N496K7481O1602M0M3581J7810K3749J20951
11121H07969J08366O4643R2201J2769r0107J54520J18423m9358N0368m2784o9933
11110A157077O4008k2463j41896r877q7954p3824j4487J13922J9415l0616O8096
11099A041401k0949n0516l00667p9868Q7958K4372k41257j39523M2080J31418
11089D94449J3072L704R5218J64340K07196k081j37024k3842j31961k0360j24387
11078E38324R2072Q6663K7413j07898k37240j70261J0721q1357L6677k3213l9574
$$ y = [275471, 205817, 173720, 263461, 422637, 431648, 553311, 554550, 438844, 321905, 521199, 741800, 995035, 1025755, 1263327, 1472780, 1353782, 1081748, 1065200, 1176640, 1066279, 937909, 703448, 608214, 572071, 507259, 512755, 540236, 601838, 601878, 645459, 663269, 687018, 807969, 916335, 980978, 1073179, 1085948, 995841, 1150361, 1268784, 1219426, 1269794, 1227010, 1157077, 1221085, 1198622, 1056726, 1046849, 958895, 885071, 870584, 984506, 1003921, 973305, 1041401, 1020452, 969936, 669269, 589401, 677359, 701731, 460474, 320951, 363031, 494449, 507521, 511225, 606443, 770783, 977979, 975898, 838874, 815032, 683071, 662711, 538324, 630396, 717059, 744472, 636574, 399334, 229073, 239794, 158437, 195114, 171901, 132327]
11067A32327O53Q7025L0788o4757k4769L9069p2634Q1873l2729j10540n748J34057
11055A94615L0763j86477l6795K3708L6149J20949O2697r3218J37346K906r8748
11044A93895j28688n1467k7926j8706o6509M9117j8878j7809j8449Q2174j17286
11033a40532p7528J4035J37639K98477Q1783j29905k6002j07995j38585r7492
11023a86105K36246J42287j6441J30127m6950p999l5497j54942J22767O6069m7874
11012B01688q22j37128j4979p3407J00534J33454k7224k01295m9481J28597L3233
11001I3170j09398j25139L5401j8040m0764O3825M5855R586K4118m1351R2079
10990B9342J40452Q2278M9986m1375l6936K8823j23892j74768q4007Q2464J37653
$$ y = [132327, 132980, 220005, 250793, 186036, 161267, 200336, 127702, 209575, 176846, 66306, 60558, 194615, 225378, 38901, 2106, 25814, 61963, 182912, 245609, 152391, 289737, 292643, 193895, 65207, 13740, -14186, -32892, -99401, -50284, -69162, -86971, -105420, -23246, -140532, -218060, -204025, -66386, 232091, 313874, 183969, 157967, 49972, -88613, -186105, 50141, 192428, 175987, 306114, 259164, 251165, 215668, 60726, 183493, 249562, 201688, 200866, 63738, 48759, -24648, 75886, 209340, 182116, -19179, -68660, 59937, 93170, -16228, -141367, -105966, -124006, -164770, -100945, -55090, -45504, -21386, -62737, 29342, 169794, 252072, 302058, 260683, 223747, 252570, 128678, -46090, -130097, -47633, 90020]
10979I0020J51949k5006l6354j60811M1926Q8701N4171J02020m2777L1522K0037
10968C15398j01976n8334R4742J43218k27096j71940O283m0078K07524K29651
10958C97392q8491J67480L114j70022j33471j60808j38185M9418J84621K46496
10948C57544m850J7694j08314O2228r7099j18890p2045p285J9843q848k5032J59770
10936A74716L5322J35960K4673m9185O030j86121k1873J35762k90609j64371N9180
10925a40516m1831Q6935J87568N6621M130J09815J08543o6668j21997P271J33269
10914C23140o7165j95872k10315m7831J18008Q5754K1892l4515J38503J15332
10904B46931R7124k1162q6093l26963j92785P2580N1237J70868j32259m8422L12980
$$ y = [90020, 241969, 216963, 180609, 19798, 61724, 150425, 204596, 306616, 263839, 295361, 315398, 213422, 155088, 249830, 393048, 165952, -5988, 295, -39783, 167741, 397392, 308901, 476381, 479495, 309473, 176002, 15194, -122991, -73573, 111048, 357544, 352694, 370388, 262074, 324302, 227203, 108313, 36268, 28983, 48826, 39978, 14946, 174716, 210038, 345998, 370671, 321486, 327516, 141395, 119522, 255284, -35325, -199696, -140516, -182347, -95412, 92156, 148777, 152907, 262722, 371265, 304597, 182600, 189871, 323140, 255975, 60103, -150212, -198043, -80035, 5719, 27611, -6904, 131599, 246931, 344055, 322893, 236800, -90163, -282948, -210368, -159131, 11737, -120522, -168944, 144036]
10893A44036k4714j57345q2357m2600J9930J60580l9599p3700p2425J63596J37829
10882A33231N1465R5756K7029q9705O674P0793r1556q5100j9285j02681p3768
10871g7147R5383J08046o5916j63700k1544Q3281O1241Q4571J35795k3810m0126
10860A76074j23627p683R8430Q663J05834j3659J46861n2900j23549j25542j31959
10849d3057k09675o6985P5240l7711o7777J80007K8418j19396R2675J54012R4083
10838G9834Q2761J29686R0950K5067j12213j28286j24695l9941j09433j43836
10828b50106r8349P854J59909J39238O1143j3528p0186N7559J30903m235L9890
10817A60092n8478j05423j0138J77979P5879j42641j33742J7648J74805j15791
$$ y = [144036, 119322, -38023, -120380, -162980, -143050, 17530, -22069, -95769, -168194, -4598, 133231, 184696, 280452, 307481, 217776, 224450, 295243, 203687, 118587, 99302, -3379, -77147, 18236, 126282, 60366, -103334, -124878, -41597, 19644, 104215, 240010, 216200, 176074, 52447, 44764, 143194, 151857, 257691, 244032, 390893, 337993, 214444, 88902, -43057, -252732, -319717, -244477, -282188, -349965, -169958, -141540, -260936, -168261, -14249, 79834, 162595, 292281, 383231, 408298, 296085, 167799, 43104, 3163, -106270, -250106, -348455, -340601, -180692, -41454, 19689, 6161, -64025, -6466, 124437, 120202, 160092, 101614, -3809, -13947, 164032, 239911, 97270, -36472, -18824, 155981, 40190]
10807D0190o807J68891K03322p3662j59952j55068n3503J22382J44790L5853o7452
10796A98984q1615p83n9761N8119J52942o0621j60286l2708J527o6871R5360j0223
10784C4064N756p5688j14121L7166J48438J2007k4333j53384L4637J54961L1831
10773I1334N212J4973p0202J7347q790o1561Q0925M3039j02785m5055M0581Q2201
10761H7219j506n7451j9400l9069L3824K1552K8739m0086J25955J12301J01061
10750C53139j16705J31111O3348k35794j02178j71791J44703K5232N1066J60948
10740C03079N9012l8546j0997j62501o0657K1877K2350R007r3714O1108R9610
10729B09628r3877m2296M101j21828q6482J82103L2896p6073J20916n5731j55677
$$ y = [40190, 33383, 202274, 405596, 331934, 171982, 16914, -36589, 85793, 230583, 266436, 198984, 117369, 116586, 56825, 114944, 267886, 207265, 46979, 14271, 15798, -51073, 44287, 34064, 39820, -35868, -149989, -112823, 35615, 47622, 23289, -130095, -95458, 59503, 91334, 96546, 111519, 41317, 58664, 49874, -11687, 69238, 112277, 9492, -35563, 5018, 87219, 85713, 28262, 8862, -30207, 3617, 25169, 53908, 13822, 139777, 252078, 353139, 236434, 367545, 430893, 195099, 92921, -78870, 65833, 91065, 142131, 303079, 362091, 323545, 312548, 150047, 89390, 111267, 133617, 142624, 48910, 110018, 209628, 115751, 73455, 77556, -44272, -130754, 51349, 84245, 8172, 129088, 73357, -82320]
10718h2320j35610l6450R4901K42975M7562J18397M6821L4747j72040k24663R913
10707e5767J62515M0212J3409O121j56103k09554j3950J72873K6885L4036j00601
10696g9924J8978Q3093N0940J25551K3461k06021L846K1453K6101k77166j65368
10685c75056Q0377J47574R0767Q2733K02480q9419k47168J5170J31762J25049
10675A64269Q3087O8893j91596r6214J55347J48921j52685j42224q1161K6072
10665a7291J07821m1470r8779J7524m4261J79421K4995j01237n0332K8716M5236
10654E0343J55079M9776k9841n7488N3273m99o3854p986K07070J1104j8753j15687
10642B32537k34781j86601N3106O1357J18037Q5003m8587P2771q3719j33348q5795
$$ y = [-82320, -217930, -254380, -159479, 83496, 131058, 249455, 296276, 331023, 158983, -65680, -55767, 106748, 146960, 160369, 166490, 10387, -199167, -213117, -40244, -13359, 20677, -79924, -60946, 22147, 73087, 198638, 222099, 16078, 19924, 41377, 67478, -209688, -375056, -294679, -147105, -56338, 26395, 228875, 139456, -107712, -92542, 39220, 164269, 247356, 316249, 124653, 28439, 183786, 332707, 180022, 37798, -43363, -17291, 90530, 49060, -49719, -32195, -76456, 102965, 127960, 26723, -23609, 5107, 50343, 205422, 255198, 225357, 167869, 221142, 220643, 156789, 148803, 355873, 366977, 348224, 232537, -2244, -188845, -135739, -74382, 43655, 128658, 80071, 152842, 69123, -64225, -150020]
10631a50020k1510K05004J60833j95167j19763m0541R4669J08076J19872l0598
10621A30855n0697J9212j14114l04818k2701J90025P8637J03562k3494P8411K10465
10610B95343q5291j78222J52389q6818j94328j2077N0284N8498p569j23876Q1830
10599d9837Q7632J169J6046M6650j17139j11695P976J7880J30170m3389P7392
10588F2855N0736J32034K99608L5858k48973j72527J3074R7983L8056k10934k5796
10577G1974k09704q7716M2281J59313O7218p9309p9968j324N9411N0826J42280
10566A35282j04290P831K4634j365j57685K2731J40243j61756n4190m0061J13372
10555g5254m6982o6350J29445O8211L944J0909R2564q442k0143K11868l3241l55961
$$ y = [-150020, -171530, 33474, 194307, -860, -120623, -161164, -66495, 41581, 161453, 130855, 80158, 99370, -14744, -319562, -342263, -152238, -73601, 29961, 6467, 84878, 295343, 210052, 31830, 184219, 97401, -96927, -109004, -58720, -222, -7791, -131667, -49837, 37795, 38964, 55010, 101660, -15479, -127174, -119198, -101318, 28852, -14537, 62855, 113591, 245625, 545233, 581091, 332118, 159591, 172665, 270648, 308704, 97770, 71974, -137730, -225446, -183165, -23852, 43366, -35943, -115911, -117235, -57824, -6998, 135282, 30992, 38823, 63457, 62092, -95593, -72862, 67381, -94375, -148565, -188626, -75254, -122236, -188586, -59141, 9070, 13014, 23923, 116487, 108045, 87902, 299770, 266529, -89432]
10543h9432j91932M7024J18747N1715m0488J5547q1897n1136o0300r890K9873
10532b62169J67377J84189O4218R5857M4833j75607q5065O7589j3374o7064j15041
10521i4257j00279j5381j14954K20963P2400R3519J08953P7960R0345P3204j21403
10510B91070o2015l3191M415L6360j18999j82046k08010J2342J34194N5380k5622
10499i6122k28J35312J24398J8301o1017L5644J12872k7198r5052j260m5760J00697
10487B00587L7794m2253l1300k09486j63411j20114J13650N9713l1278M8021k1137
10476a59214J00737J69442K1183J29360n9128M4957m663P5491q1773j04896j71791
10465d0295j70798j24684N7599K42621J05720r5358m2516J52797J7897l5670N5039
$$ y = [-89432, -281364, -234340, -115593, -63878, -104366, -88819, -170716, -221852, -282152, -292042, -262169, -94792, 89397, 153615, 249472, 294305, 118698, 33633, 101222, 87848, 20784, -94257, -194536, -209917, -324871, -103908, -31508, 62011, 170964, 248924, 339269, 412473, 291070, 229055, 195864, 200279, 236639, 117640, -64406, -272416, -260074, -125880, -70500, -96122, -96350, 38962, 163360, 181661, 120644, 156288, 269160, 241962, 146910, 145650, 99890, 200587, 238381, 196128, 164828, -44658, -208069, -328183, -214533, -154820, -186098, -138077, -159214, -58477, 110965, 132148, 261508, 202380, 247337, 242674, 318165, 236392, 131496, -40295, -211093, -335777, -278178, -35557, 70163, -25195, -67711, 85086, 102983, 67313, 122352]
10454A22352j11862j5435J42991o2621r3077K38298J35601O0493j32308j0370
10444B74062J6118Q897k51433j63502J8390P4524o2605n1914J9704J58386O4984
10433A05611l2374q2262j7968K111m6043O4424p8839q2658n9784j2979K06107
10422c4654N8749j11336K9847j21801q9381J3768N7828J21086p8095L0813R6411
10411b6765n8767k5536O2429M9305J25561J4382r1937j689J2549j42589q0912
10400a63969J41737J75406J15089o5169M8047N4551Q458p5294N6406L278O772
10389C05312J5706r4366q6685K6233J7237j5534q0247l8070L9536j2929j1810
10378F4383k9555L7988j5924M0359R7525N5060j15713j05340R7055n344r7897
$$ y = [122352, 10490, -4945, 138046, 75425, -17652, 220646, 356247, 416740, 284432, 274062, 290180, 299077, 47644, -115858, -97468, -22944, -85549, -137463, -117759, 40627, 105611, 73237, -9025, -26993, -24882, -70925, -6501, -85340, -167998, -227782, -240761, -34654, 24095, -87241, -57394, -179195, -268576, -254808, -196980, -75894, -153989, -123176, -26765, -85532, -111068, -48639, 666, 126227, 140609, 48672, 46983, 59532, -83057, -163969, -22232, 153174, 268263, 203094, 251141, 305692, 314150, 238856, 295262, 298540, 305312, 321018, 226652, 139967, 166200, 183437, 167903, 87656, 49586, 89122, 76193, 64383, 34828, 72816, 56892, 97251, 194776, 249836, 134123, 28783, 125838, 120494, 22597]
10367B2597R9841k3404l5432p5005j64452p9882Q5365J62526L2542p5145K4028
10356b6421J22984L9106j38641M0266k1686L3950L5350L3181j94980P837P2221
10345C167K21806j5974r2850j8294k7607r9256L8904J60425j40080l8007J62539
10334A54773N6213l4429j6102p406j76881M012l2049K0841O6322P8487P1015N9999
10322B44795j32098j3j1856r6020P6409O124n3499m2088j19692k939Q7448J29241
10310H5812O938r9756M917P0296j5028r5516J21063O4428j59831o0394O9357J66180
10298A58466p0552K2893J12676l6314j11730J0666M3906J35698N8899j63404j59612
10287A592j05867k2440J17640J9339k61038j24541O8723P9324L1143k5106J57484
$$ y = [22597, 122438, 99034, 63602, -11403, -175855, -255737, -170372, -7846, 24696, -50449, -26421, 96563, 135669, -2972, 37294, 15608, 49558, 84908, 118089, -76891, -69054, 3167, 224973, 208999, 116149, 97855, 70248, -29008, 9896, 170321, 30241, -7766, 154773, 210986, 176557, 160455, 153049, -23832, -19820, -51869, -31028, 35294, 113781, 184796, 244795, 112697, 112684, 100828, 4808, 81217, 87341, 33842, -8246, -127938, -130877, -43429, 85812, 92750, -7006, -2089, 68207, 53179, -42337, 78726, 143154, -16677, -77071, -7714, 158466, 87914, 110807, 223483, 187169, 75439, 86105, 130011, 265709, 324608, 161204, 1592, -104275, -126715, -9075, 10264, -250774, -375315, -306592, -227268, -196125, -221231, -63747]
10276f3747J51912j2055K7987O5873J01671K1836o5981m1165J25735j14733N309
10265B02642K0818n9053L3745P8979J2274q7194N2737j45232Q7370J65234m9854
10254C12466j88920j47660p9006O8750K1118J8237l2825R2049J46329j63418K7043
10243G4163j5153j05385k7658Q9123K3961k6315p8620P9398J19471n0265o141
10232G6579j18463j46913R1540n6191l3273J0919J69854K6160j495p5944j57405
10221b14632M0512J9538n8887J22546K8443j3529L2148p4268p072J6646N73J80570
10209G2588L5509j07139j32286J49844o9725l8223J94855k3986o4305L856j23405
10198a02417O3757J13475j5237l491J76917L7783j89983j14720N6989K9440K12160
$$ y = [-63747, 88165, 76110, 104097, 169970, 271641, 293477, 227496, 186331, 312066, 197333, 202642, 223460, 164407, 198152, 277131, 289405, 202211, 254948, 109716, 197086, 362320, 312466, 123546, -24114, -103120, -34370, -13252, 4985, -27840, 64209, 210538, 47120, 74163, 59010, -46375, -74033, 15090, 39051, 12736, -65884, 13514, 132985, 82720, 76579, -41884, -188797, -97257, -153448, -186721, -175802, -5948, 20212, 18717, -57227, -214632, -174120, -154582, -213469, -90923, -62480, -76009, -43861, -118129, -125201, -108555, -107982, 72588, 108097, 958, -131328, 18516, -51209, -89432, 105423, 81437, 17132, 20988, -102417, -38660, 74815, 59578, 56087, 233004, 270787, 80804, -33916, 23073, 52513, 264673]
10187B64673q604j10292j04607r4279J05272K05192j16112P4689R9784j47822
10177A67894j36093j1076L6484q1067J68336k9263K1433n521l9996m6157O3669
10166A08643j33574j55633R0121L6916p767J83444J28976l4817k2516j53431j75235
10155a34873q6460N7916Q2227r0841n2898J7637N2763R7542J42017k7196K1191
10144G9025J08582N905n0690j21825J29719J0074p8538j10714j02452K27371M8076
10133A44533n8936M464q2739M9689R9735j52983n0705m7789P9206Q1998l6832
10122B9641J71500J1341j72405L100P0825L0834N8481R7205l993j48437j9736
10111A28356m3394r6615K1321l9486Q2521N4912m9464l354l4909K5728j7776N2667
$$ y = [264673, 256069, 145777, 41170, -53109, 52163, 257355, 141243, 215932, 315716, 167894, 31801, 20725, 57209, -23858, 144478, 115215, 136648, 131127, 91131, 44974, 108643, -24931, -180564, -90443, -53527, -61294, 122150, 251126, 216309, 193793, 40362, -134873, -221333, -163417, -81190, -172031, -224929, -207292, -154529, -56987, 85030, 57834, 79025, 187607, 193512, 142822, 20997, 150716, 160790, 82252, -28462, -130914, 96457, 144533, 85597, 90061, 7322, 57011, 156746, 3763, -46942, -94731, -15525, 66473, 29641, 201141, 212482, 40077, 43177, 114002, 144836, 203317, 300522, 296529, 148092, 128356, 84962, -11653, 9668, -29818, 52703, 107615, 58151, 54797, 19888, 45616, 27840, 80507]
10099H0507j0112n1990k14507n4157m0515q625K01909N8426n2699n3871R775m1799
10087a77658J70576O6839k26331r3807J61296J9634p1183k28346j3939K44756
10077a48163K17067O0470K6756N6j56744K58443J43704l86737j31788k8408R6277
10066d9067O4379N5677Q9857r3206n4457K24936K9824n6028J8222J01199K01710
10055E33046L98959M30763k64719n37987k82334k41517q5442P5374j50409K3357
10045a00909P123q7787j2773m1018k15379J61188J08028L7286q5821P1068K10579
10034E1585j25392n6956J33250j29749l7879R8496J00076J36442K4366j7614k3752
10023A52873q7548q6494j18760K2396p3922j5227L6307L8835M3548N708j21571
$$ y = [80507, 70395, 18405, -196102, -250259, -290774, -299399, -97490, -39064, -91763, -145634, -135859, -177658, -7082, 59757, -166574, -260381, -99085, -79451, -150634, -378980, -392919, -148163, 68904, 129374, 156130, 156186, -558, 257885, 401589, 14852, -116936, -145344, -49067, 15312, 70989, 160846, 67640, 13183, 238119, 267943, 211915, 230137, 331336, 533046, 932005, 1362768, 1098049, 560062, 277728, 36211, -49231, 26143, -124266, -100909, -93786, -181573, -194346, -235364, -450743, -289555, -181527, -144241, -230062, -158994, 51585, -73807, -130763, 2487, -127262, -165141, -66645, 33431, 169873, 194239, 176625, 152873, 65325, -21169, -139929, -117533, -191455, -206682, -170375, -131540, -87992, -82284, -203855]
10012b03855j17140l9501J08987O9628P1610P4150N6522J8918p0754j09124j8589
10001a59148j16819o9227N0173O1547m5110J29855N2325J9908J02975K6607j07453
9990e4367p4459q0897J41336l982r9691J95063J85118l5045l894L506j93562J20869
9978I9995k7806j26835J05542N3528l4008l6223j32387J32550K0067J1962Q945
9967G5330L4776j10936m5848p6810L199l8956o5384p8884K2667J69383Q2263p3718
9955a02918M9000r6050J0362L2027M8241m8037Q7289J058N1362J46697r0308k05688
9943a16965k4843j16542J2861J64977K5433j1196j2063j45121j10851K87783R2356
9932D5829k01811j60434Q527M1451K14789Q7739Q6519n2938P341J5173J446p4014
$$ y = [-203855, -320995, -360496, -251509, -181881, -110271, -36121, 20401, 39319, -31435, -140559, -159148, -275967, -345194, -295021, -233474, -278584, -148729, -96404, -76496, 26479, 53086, -54367, -128826, -209723, -68387, -72369, -172060, 23003, 208121, 173076, 169182, 172688, -20874, 99995, 72189, -54646, 50896, 104424, 70416, 34193, -98194, 34356, 54423, 66385, 75330, 110106, -830, -46678, -123488, -120289, -159245, -224629, -303513, -280846, -111463, -29200, -102918, -53918, -149968, -139606, -107579, -59338, -107375, -20086, -19028, 32334, 179031, 88723, -116965, -141808, -258350, -245489, -80512, -55079, -66275, -78338, -223459, -334310, -46527, 45829, -155982, -316416, -307889, -266438, -51649, 36090, 122609, 69671, 77012, 92185, 93631, 19617]
9920A9617J12559k3835m1225N0562r3307j08837k0910J59510L7619q2079P8052
9909H7726J04178j10131n1864p8067k8941k6327M0386J74861P8399n3343K4936
9898A61813j27739o152N1144k9036K1826o6689O733j73756L46P273K8829J03187
9886b2221J02062n2831J21868Q6404p2503N6322r9861o7571O0447R095K17205
9875C38416N9351j09088j41810r4091O5659L081M6340M6835P1475M1406m1708
9864B85866K598J04124l0562j33153p5124J10593j643M0618K93883N33181L59741
9853A490122k0201m37576m57850k73122k97697r1516K4384j4086J73403J73263
9843B69124Q275k1737J9074P1867j11102j25395j25853j56680p5633j5016J33963
$$ y = [19617, 132176, 108341, 67116, 117678, 24371, -84466, -105376, 54134, 91753, 9674, 87726, 191904, 81773, 29909, -48158, -77099, -103426, -63040, 111821, 190220, 136877, 161813, 34074, 27922, 79066, 50030, 71856, 5167, 11900, -161856, -161510, -154237, -125408, -22221, 79841, 27010, 148878, 235282, 162779, 219101, 119240, 51669, 112116, 121211, 338416, 397767, 288679, 146869, 52778, 118437, 121518, 167858, 214693, 286168, 327574, 285866, 288464, 392588, 362026, 228873, 153749, 264342, 262699, 303317, 597200, 1130381, 1490122, 1469921, 1032345, 574495, 301373, 3676, -87840, -63456, -77542, 95861, 269124, 277399, 255662, 274736, 346603, 235501, 110106, -15747, -172427, -248060, -263076, -129113]
9832a29113K63425J50910J30468j33036k15079j10451J21629O066j06481M9681
9822B8019j4740J2068j2128j0687n1130j16947L2261N328l5144J09317O5626o1901
9810e0058K3391q4343O2582O6855k5525m5845K7020p5652j56167k0528J01315
9799a76955J91455J75566N9805k3575j65000q25k7781m2212M2534K96559K1718
9788C51289j29657j66888j03333k30810j18832n577J03329O4292K42095K9416
9778C5324n7399P7300J43206K5486O1796n2385j28987j32176k7741Q377o5525
9767a12724j49263k38904Q6665R4368r7365M0964k368J34120L9677K02665o9472
9756g1637M2497N0981p8569r493j5352r2754J23798J83678j2299M7973R8j23463
$$ y = [-129113, 134312, 285222, 415690, 282654, 67575, -42876, 78753, 84819, -21662, 28019, 13279, 25347, 13219, 2532, -48598, -165545, -133284, -127956, -163100, -53783, 11843, -50058, -26667, -111010, -48428, 18427, -7098, -52943, -25923, -101575, -257742, -278270, -176955, 14500, 190066, 249871, 226296, 61296, 60471, 32690, -9522, 33012, 329571, 351289, 221632, 54744, -48589, -279399, -398231, -403808, -300479, -236187, 5908, 35324, -22075, 55225, 198431, 223917, 285713, 233328, 104341, -27835, -55576, -47199, -112724, -261987, -500891, -414226, -319858, -417223, -376259, -378627, -244507, -204830, -2165, -71637, -29140, 21841, -56728, -66221, -81573, -174327, -50529, 133149, 120850, 168823, 168921, 45458]
9744D5458k59922p7965L1117J30823J61492l0379p9347m4787K3602m6555N2910
9733i3553m9607k3289J84683J05941k6920j70468j74997k6550J01677R0123K13843
9722A30883M7389j59781m5663M7341M2775k2531j54530N9925N8307l7517m656
9711c8058o2695p8462j35221J57316p5363j34313j3023K08883n0291J28000K31332
9700A38105P6417j65008j73372l6282J34661N4927J52991p0638j06580j00864
9690i5643k44854j430J16775Q528l1206j0739k3045J29210J82927J45534N112
9679A81169J12233j30868j32167q2986r0919r5321q7217N2637J94088O4516J19514
9668A04679L2804P609L4030j9736q6868j29910N18P790k5288m422J18695K2477
$$ y = [45458, -214464, -292429, -261312, -130489, 31003, 624, -78723, -123510, -99908, -146463, -93553, -143160, -166449, 18234, 124175, 97255, -73213, -248210, -274760, -173083, -82960, 130883, 178272, 18491, -27172, 20169, 62944, 40413, -114117, -54192, 4115, -33402, -38058, -100753, -179215, -314436, -157120, -232483, -366796, -379819, -170936, -221227, -93227, 138105, 214522, 49514, -123858, -160140, -25479, 29448, 182439, 111801, 5221, -95643, -340497, -341927, -225152, -216624, -247830, -258569, -281614, -152404, 30523, 176057, 181169, 293402, 162534, 30367, -52619, -143538, -238859, -326076, -273439, -79351, -14835, 104679, 137483, 145092, 179122, 159386, 72518, -57392, -56874, -49084, -74372, -78794, 39901, 62378]
9656F2378M0287n6476l6286j596j32447j32687q4372J64307k0011L77N3352R0021
9644e3153q02j0241R5844O5653k15579j25581k6930J8795j13413M0736n7217O3009
9632c18879J83663j6950j831P2475l1295Q8733M3656p2868J03013l879j53212
9621a07374l1519J74527Q6052J11265r812k6344l4847O5627j54867J33177K32
9610B06117o6697o1072k1648N4688J21544j27948m5293J9040M102J17057n4867
9599A45023j10769r2435Q6067l3148q0032J2223n3337M4150J0998k784L915L3683
9587c6446J3304N5921m8332p5697k2256n7777m3297J41217n6316J33124P3898
9576G7343o3335j52518J5336k7303L6905m9727q370N335j9054n1669o0305K13630
$$ y = [62378, 102665, 46189, 9903, 8307, -124140, -256827, -341199, -176892, -196903, -196526, -143174, -53153, -53955, -64196, 31648, 97301, -118278, -243859, -270789, -251994, -365407, -324671, -381888, -318879, -135216, -152166, -153997, -81522, -112817, -24084, 19572, -53296, 49717, 45838, -107374, -138893, 35634, 121686, 232951, 223139, 196795, 161948, 227575, 72708, 205885, 206117, 139420, 78348, 56700, 111388, 232932, 104984, 59691, 78731, 82833, 199890, 145023, 34254, -58181, 27886, -5262, -85294, -73071, -126408, -82258, -71260, -74044, -70129, -36446, -23142, 32779, -15553, -91250, -113506, -171283, -214580, -73363, -129679, 3445, 77343, 14008, -138510, -123174, -150477, -113572, -163299, -171669, -166334, -185388, -237057, -297362, -83732]
9564h3732m111r9668P9268P2456L1527J31932J70666q7770r8753j66162j32183
9553a86530m1106K0857J02852J32517O6969j72199j8676L7081m2996m8592K6084
9542a23739L5408L5801Q7588Q8532j6985L1279m2342o003l6893p4449J18126J08906
9530B05229j40111j24799q0295m9074k0470j89333Q8806K25940K10684j32300
9520e723p1652m4876Q919L2946J15568K64532R7004j70559k17818M7493J16126
9509A71960j08138J29862M7352m7304K9266q3337k04652J2756J85105k438o775
9498A23657J1104p7493k03812P9392K27073j10835L6016j12222p0421k878k4991
9487a25410p7909J69740M1807K4578j80p3226M4100l4380L919Q2330r0678q4583
$$ y = [-83732, -87843, -187511, -108243, -35787, -4260, 127672, 298338, 210568, 111815, -54347, -186530, -227636, -206779, -103927, 28590, 95559, -76640, -95316, -58235, -101231, -149823, -123739, -88331, -52530, 35058, 123590, 106605, 137884, 95542, 89539, 52646, -21803, 96323, 205229, 65118, -59681, -139976, -189050, -209520, -398853, -310047, -84107, 126577, -5723, -77375, -122251, -113332, -80386, 35182, 299714, 396718, 226159, 8341, 55834, 171960, 63822, 193684, 241036, 193732, 222998, 139661, -64991, -52235, 132870, 130432, 123657, 134761, 57268, -146544, -67152, 159921, 49086, 85102, -27120, -97541, -100419, -125410, -203319, -33579, 8228, 32806, 32626, -40600, 3500, -30880, -26961, 55369, -35309, -119892]
9475a19892O5300K676j01597L5705J81188J25508P8775r8112j70644k19890j69896
9464c90879J19399K15251J6560M6578J18554M1583k41789j11107M5403O4870J48187
9453G2610O6671n1650m0145N5779J59529K5371k5948j54775j00812m218p0176
9442f7764m592j3400P5198j6707J5109J42595j95869j49731j94957O504J74937
9431b28677J51359m0857P7788K23734L53k7220l3568k13803o5234K03181L7253
9420H4309j34765m4311J83986n0669m6419r3973R7236K79407O0781J07632n1982
9409C91232n7091P5127L4655k34497M0790J22003j74781k16359j8056J5655o4559
9398h5881p649J93163M512p4783p9405j90984J25475L5188L3519R1661j15500
$$ y = [-119892, -54592, -51916, -153513, -117808, 63380, 188888, 267663, 169551, -1093, -220983, -390879, -271480, -56229, -39669, 6909, 125463, 167046, -74743, -185850, -140447, -75577, 72610, 139281, 87631, 47486, 103265, 262794, 288165, 262217, 107442, 6630, 2412, -67764, -72356, -85756, -10558, -27265, -12156, 130439, -65430, -215161, -410118, -403614, -228677, -77318, -118175, -40387, 183347, 183700, 156480, 122912, -90891, -156125, 47056, 84309, -50456, -94767, 89219, 38550, -7869, -101842, -4606, 274801, 335582, 443214, 391232, 334141, 409268, 443923, 209426, 250216, 372219, 197438, -18921, -36977, -21322, -85881, -93530, 99633, 104145, 29362, -50043, -241027, -115552, -80364, -46845, 44816, -70684]
9387g0684o612j24469J5622K482J7125L1880p0860r2255k1872J47404K1216j34799
9375b85822M3817J24272Q0663m6694O9220l747J02842j52038j30331m0024P1192
9364a66650n1279n8806R3922J05531J22342J85422o7713q3766J50683J00785j33471
9353A97000k27442q3003K5501n7363J4143l7026j6958O2199N9539r122R022J2563
9341e0947K0873L1773M6658m4995R6465M8534j15404j22409J55018N5869Q9177
9330B10612N6848O2426M2368j06491k89234M2334l5948L4165J47126Q8405j63193
9319H9418q5040n1852r9288K24236M0093q8982j1355R918J5838j60908r6762J7188
9307a97496L5829o5934O6182j7544O8338o0104l9706J29562J7922o1440l1960
$$ y = [-70684, -77296, -201765, -186143, -183661, -166536, -134656, -205516, -297771, -319643, -172239, -151023, -285822, -242005, -117733, -37070, -83764, -14544, -18291, 84551, -67487, -197818, -237842, -166650, -217929, -276735, -182813, -77282, 45060, 230482, 162769, 79003, 229686, 330471, 197000, -30442, -113445, -87944, -145307, -131164, -168190, -185148, -122949, -63410, -72532, -63510, -50947, -30074, 1699, 48357, 3362, 99827, 148361, 32957, -89452, 65566, 121435, 210612, 267460, 329886, 372254, 265763, -23471, 18863, -17085, 17080, 164206, 252611, 89418, 4378, -47474, -146762, 77474, 117567, 28585, 17230, 27148, 42986, -117922, -214684, -197496, -161667, -227601, -161419, -178963, -110625, -170729, -210435, -80873, -62951, -124391, -156351]
9296a56351M9281L4684j09992j06341q9431R2150J34573N9993N1896K1591n622
9285b3569N6187j27191m2524J25855k8554N9259r8944j8276J7762o3203j5845
9274a59043j8852J7519j28757o1056L32357M7412j51644k19899J20399J55090
9264f6474l0507n3605J63239n4501n3962k4904j37213J49002J59734l9699q5790
9253g4680K27412N3797M934N1816k9046j69180j41469j4274k7955J32826M2048
9242E6229k68572m8555J36675J10066J39038M7681j03368N416j26093m8141p9541
9231a79165m8235p1906J55178J07574J54631K6332j9501k08629l5396l1878n1970
9220b02965K4063m3776J79295m4692m1759R2560n6417j25015N2491J84284j538
$$ y = [-156351, -107070, -72386, -182378, -288719, -378150, -286000, -151427, -91434, -39538, -17947, -23569, 32618, -94573, -137097, -11242, -39796, 19463, -79481, -97757, -79995, -143198, -159043, -177895, -160376, -289133, -350189, -17832, 29580, -122064, -341963, -221564, -66474, -96981, -150586, 12653, -41848, -95810, -120714, -257927, -108925, 50809, 11110, -74680, 152732, 206529, 211463, 263279, 234233, 65053, -76416, -90690, -118645, 14181, 56229, -212343, -260898, -124223, -14157, 124881, 172562, 69194, 74610, -51483, -99624, -179165, -227400, -299306, -144128, -36554, 118077, 144409, 124908, -83721, -119117, -150995, -202965, -178902, -222678, -43383, -88075, -129834, -37274, -93691, -218706, -166215, 18069, 16531]
9209A6531j34651j9458r6060J36624M455j7636j32466L2541O6309K335O2757j58
9197g8877j06507m7757O8439Q8972K35077l2202k24333l8426k5060o8985O8565
9186a61094k7192j21708K45445K6604p4477J26359l1979j55530M8092R6387r2021
9175a21114j30497j34163J48872K08515K17542p065j18121k3482O3619R5549q259
9164A91396k2050O2094o525j04162j26052J6257j35915J17082J62069L2880N166
9153A92240j86495o2541Q0650j3143R2926n2099L5423Q9936q6667j96552m8320
9142a54642K37367J87728L1310J53599J19474j6789j13652j09509K2595m5296
9132C12185L6490j80288M3935J30199j83822k5893P2203M1409Q3397J49456m9477
$$ y = [16531, -118120, -137578, -233638, -97014, -92559, -110195, -242661, -210120, -143811, -141476, -78719, -78877, -185384, -233141, -164702, -75730, 159347, 127145, -97188, -135614, -160674, -229659, -161094, -188286, -309994, -64549, -37945, -112422, 13937, -18042, -173572, -125480, -29093, -121114, -251611, -385774, -236902, -28387, 189155, 182090, 63969, 40487, 104106, 199655, 191396, 169346, 231440, 224915, 120753, -5299, 10958, -124957, -7875, 154194, 187074, 192240, 5745, -56796, 23854, 10711, 103637, 51538, 86961, 176897, 90230, -106322, -154642, 82725, 270453, 301763, 455362, 574836, 558047, 444395, 334886, 357481, 312185, 348675, 168387, 212322, 342521, 158699, 132806, 205009, 246418, 329815, 479271, 429794]
9121D29794r122L0718K1419j4295k693J52357k9849q4096J48222O1985l006j37755
9109E63679j7048J48490J19367J02356K82471K46494Q5628K15338L16139K67821
9099B330735M71978N85585N97241Q79248J131322J673141K532976M016578O206474
9090B0425278J0521616J9038778L3400381N1671446N8322418m23603o7428112
9083A25528202n0336243k6528441j4226096q537833n519556l882167k805369k081842
9075A1610655j706682j632410j206807q49260o24761o53526n82624k44153k96349
9066C814083k48192k79375j98090k74315l92147k10795o2359k12299k12306j02451
9056A621754r846j23290r9379j41115j15334r5063j39139j11132Q6805O1564j58393
$$ y = [429794, 420672, 451390, 472809, 458514, 455821, 608178, 578329, 494233, 642455, 704440, 701434, 563679, 546631, 695121, 814488, 916844, 1199315, 1445809, 1531437, 1746775, 2062914, 2330735, 2802713, 3388298, 3985539, 4864787, 5996109, 7669250, 10202226, 14218804, 20425278, 30946894, 49985672, 83386053, 135057499, 193379917, 192956314, 125528202, 75191959, 48663518, 34437422, 25899589, 20380033, 16497866, 13692497, 11610655, 9903973, 8271563, 7064756, 6215496, 5590735, 4937209, 4354585, 4110432, 3814083, 3565891, 3286516, 3088426, 2814111, 2421964, 2211169, 2148810, 1936511, 1724205, 1621754, 1611908, 1488618, 1389239, 1248124, 1132790, 1037727, 898588, 787456, 874261, 935825, 777432]
9045G77432j22631J79730O5486J15407j02891j98812r277M1067J11859n0410j24584
9034F82376j00468j60200M1076J43324j1672q2013j40566M9381Q8060J12648j8709
9023F03237j06307r5228j45641p2986M5391k634p3081L3821O122M2156P0315n8624
9011B46541m1313K2947M1532L6884J09619J37308P1819j79866j8154L9375k1084
9000D45608n5749o0527l8319K0062m0996j090m8219n0416K03470q2781j59786
8989A31257k9316J22978O0993Q3110k85o5072J14808k0705q3770n5363N5258N4926
8977C68819q517j33081m4706N8202K6519K0772l566R4363k6156o0019K5226j483
8965C16373k11656j42088R6103P6032K67979p677J6537j65197q6623J99946l7958
$$ y = [777432, 654801, 834531, 900017, 1015424, 912533, 713721, 704444, 745511, 857370, 806960, 682376, 581908, 421708, 462784, 606108, 594436, 512423, 371857, 421238, 509298, 621946, 603237, 496930, 401702, 256061, 183075, 228466, 225832, 152751, 186572, 192694, 234850, 305165, 246541, 205228, 228175, 269707, 306591, 416210, 553518, 625337, 445471, 427317, 466692, 445608, 389859, 329332, 291013, 311075, 270079, 268989, 220770, 170354, 373824, 291043, 131257, 101941, 224919, 285912, 369022, 368737, 303665, 418473, 397768, 313998, 258635, 313893, 368819, 360302, 227221, 182515, 240717, 267236, 288008, 284442, 378805, 352649, 292630, 317856, 316373, 104717, -37371, 58732, 134764, 402743, 395066, 411603, 246406, 159783, 359729, 321771]
8954C21771l04524k3450J09526P1616M2445k05769j48659J06805P9855J69557
8944B19173J2931j1355j85028p2116k4923K6185O883q7846j5194o0578Q8369K40039
8932A36540n5038j33250L8863J02621K0668j11171j1638J24960m9442j25776M379
8921e8284J18039j00915L7760O2493N8616L1504j22170j17193R4052j80339L9318
8910a37119N9831J19251m5888p972n8936M1894K0278P6727L3805n6810K5835J9083
8898H9979n9163M5367J26189p4840k90R3066j19360n1988j50944l9583O8885J09593
8886C6911O1809J41968q4898p6391q7228J23705p7717j8373R0626N6753r1693
8875G5472j8946J30941O8399l866k34958k17618n86J67241J51301J087l8385J66142
$$ y = [321771, 17247, -6203, 103323, 174939, 217384, 11615, -137044, -30239, 49616, 219173, 232104, 220749, 35721, -36395, -61318, -35133, -28250, -116096, -131290, -191868, -103499, 136540, 81502, -51748, -12885, 89736, 110404, -767, -12405, 112555, 63113, -62663, -58284, 59755, -41160, -3400, 59093, 117709, 149213, 27043, -90150, 3902, -176437, -137119, -77288, 41963, -3925, -11897, -70833, -28939, -8661, 68066, 101871, 45061, 70896, 89979, 30816, 76183, 202372, 127532, 127242, 220308, 100948, 48960, -101984, -141567, -72682, 36911, 98720, 240688, 155790, 79399, -7829, 115876, 38159, 19786, 110412, 167165, 75472, 56526, 187467, 255866, 252000, 17042, -200576, -201162, -33921, 117380, 118467, 80082, 246224]
8863B46224N6682P4370r503q9846k228p7281k56530p6609j6342L39070K12449
8852D00456k97224M7667J20973j62714j21014j86j7161l4622O777J99252O4017
8841B06221j51271Q8893n1691j74326J07197j04710p7226M2129P9906r5706j14687
8830b45271J07148J17934J28898K9250j0892j20146n4451k171Q8395N6199K8308
8819A23201O5946l8569r5047N8276Q5530l1238n9257l5335k11668n8548J02819
8808i3890J69621J36041p1110j24454P6052j35347k8405J48196o2201j98979L9990
8797a44486L2886Q3488j49025r6817l4049k9517J26117J33727j6496j11834K151
8786b03855J4308J38471L0144m7041J05712J21468m3578j80280j08839K51639
$$ y = [246224, 302906, 377276, 367773, 277927, 275699, 198418, -58112, -134721, -151063, 188007, 400456, 103232, 150899, 271872, 109158, -11856, -12042, -29203, -63825, -57048, 142204, 206221, 54950, 143843, 92152, -82174, 25023, -79687, -156913, -114784, -34878, -130584, -245271, -138123, -20189, 108709, 137959, 127067, 6921, -47530, -49701, 38694, 94893, 123201, 189147, 150578, 55531, 113807, 199337, 168099, 108842, 73507, -138161, -196709, -93890, 75731, 211772, 140662, 16208, 92260, -43087, -71492, 76704, 14503, -184476, -144486, -111600, -28112, -177137, -273954, -308003, -337520, -211403, -77676, -94172, -206006, -203855, -189547, -51076, -20932, -67973, 37739, 159207, 115629, -64651, -173490, 78149]
8776G8149J92334o4392O0649l2862L182j10460j3899P2903m9598j44927n4383
8765f3304L3018O8339k7617J12320L6455p4546j64199k056l3136K23331J24904
8754B33509k5292j18041n7829L5514J29365K0422k9992J11862r073j37121j36504
8743A6820j03718K5240K3098m9327o8150l910m0672k7517P6610K06368L6135k60246
8731a69269L1898K9700j42264p4837N3703J23763J66548K65973k779j75217k2976
8720H4243j26922J7230P0832L9682q9087J34231J3246o9935j10321j63970k7850
8709b28621J19727J45818o4983n6546m4756j8029K9571J00758J11052P1028r8402
8698F6617N6416J16460l1427q1702J34914j71027j54871k6858j12507N0024J62220
$$ y = [78149, 270483, 206091, 266740, 233878, 237060, 126600, 112701, 185604, 136006, -8921, -63304, -30286, 38053, 10436, 122756, 159211, 84665, -79534, -81590, -114726, 108605, 233509, 208217, 90176, 32347, 67861, 197226, 217648, 187656, 299518, 290445, 153324, 16820, -86898, -61658, -38560, -87887, -156037, -159947, -200619, -228136, -151526, 54842, 90977, -169269, -137371, -107671, -249935, -324772, -271069, -147306, 19242, 285215, 282436, 107219, 84243, -42679, -25449, 45383, 85065, -4022, 130209, 143455, 73520, -36801, -200771, -228621, -108894, 36924, -28059, -84605, -129361, -147390, -117819, -17061, 93991, 165019, 66617, 123033, 239493, 208066, 126364, 261278, 90251, -64620, -91478, -203985, -153961, 8259]
8687H259O9599q2901j29942o7594j65910Q4150J99466l6645p8859r0135N9711
8676b30801L07080K29641K371j40014l7664p2498j64925M2229L357r7449j1493
8665a70166L3882Q1972K3065O1532J45264j42967j691j4135l885q4617L9242M0834
8653H330J81225Q8822J3612k08913r9935J02672Q3908j09092P5947r1445l034
8642D2097l9656n4634N8368L7065k3245p6898M7931l8099J18986R1900j15210
8631D8605J41286Q7190q4258l7101j77582n4687J18960J04221r3095l0586J89393
8620B12346J53538R4222j48426P752K7107j14324j37709J9652O517L040j73962
8609e0247j6123L56851L09091J69775l68399l03428R6443j137j04562r8086Q6444
$$ y = [8259, 77858, -5043, -134985, -202579, -368489, -284339, -84873, -121518, -200377, -290512, -230801, 76279, 305920, 308291, 168277, 130613, 58115, -106810, -64581, -61224, -158673, -170166, -136284, -54312, -31247, 30285, 175549, 32582, 30891, 16756, 12871, -71746, -32504, 8330, 189555, 278377, 291989, 83076, -16859, 85813, 169721, 60629, 136576, 45131, 42097, 2441, -52193, 6175, 43240, 19995, -56903, -8972, -47071, 71915, 163815, 48605, 189891, 277081, 192823, 155722, -21860, -76547, 42413, 146634, 53539, 22953, 212346, 365884, 460106, 311680, 319432, 346539, 232215, 94506, 114158, 120675, 123715, -50247, -66370, 290481, 599572, 769347, 400948, 97520, 193963, 192826, 88264, -9822, 76622]
8598G6622J83992k31482j07555k9485N7818J07814J25798p623J92793O8541N6717
8587D93950j08972r9402n1021j77480k9688m0635m3810k7008l0463M2680K14602
8576A42753K7789j00480m4466o6966N8232k7154O531K9835J10415K16658l1807
8565C21340R1223J40488j55450j66361J79980J58790k26773j30725P7780O623
8555B96915j99715k6272Q1794k21311l9116J12778j04323J43677j8804j0269j51431
8544a36077j21098N4831M9454P3621r7559j14199l4084J12646L27712J42736P4804
8533C32787n3134k17137k07880k6004L6328J9054o3439N8408K93798Q5373r4606
8522A63548l9783R7562J9801j21766Q5791o4331j19651k00853j24223J07010R4925
$$ y = [76622, 260614, 29132, -78423, -107908, -50090, 57724, 183522, 175899, 368692, 437233, 493950, 384978, 285576, 234555, 57075, 27387, -13248, -57058, -84066, -114529, -71849, 142753, 170542, 70062, 25596, -41370, 16862, -10292, -3761, 26074, 136489, 353147, 321340, 412563, 553051, 397601, 231240, 411220, 570010, 343237, 212512, 290292, 296915, 97200, 70928, 152722, -68589, -107705, 5073, -99250, 44427, 25623, 15354, -136077, -257175, -202344, -152890, -79269, -176828, -291027, -325111, -212465, 115247, 257983, 332787, 279653, 62516, -145364, -171368, -135040, -115986, -179425, -121017, 172781, 258154, 163548, 123765, 221327, 241128, 119362, 205153, 140822, 21171, -179682, -303905, -196895, -101970]
8511a01970j22214L0080L27060J3091p5181n7284p0526K01273J7895j20696o2258
8500b0730p3551j3759R4512J36277Q753n6548q2957J5895K8234n545N8521K4113
8488A13215j3942l6920Q9781o6993j49935K0367J43635o5577N5946m012O216j7610
8476G4171R8324K2393L9133j38086L6166N2345Q6311N0659j6951k12764j96616
8465a04915N894m9869R8817k0048p8888O0846j1098k4780L2869N5112j8373l1081
8453h5514M3545m1958r8607J81396J35064j9355j24606l5535Q8709J2751q9057
8442c3167K03812J39100n6302j13154L3534J00889Q1377n3973n8972N1412j03540
8431A91016q9615j4720k04555n1291j20814p5280K27306J40660n7683N323R7100
$$ y = [-101970, -224184, -194104, 132956, 146047, 70866, 13582, -56944, 144329, 162224, 41528, -20730, -94281, -108040, -13528, 122749, 131502, 74954, -8003, 7892, 36126, 30581, 89102, 113215, 99273, 62353, 152134, 85141, -64794, -44427, 99208, 33631, 89577, 85565, 91781, 74171, 172495, 194888, 234021, 95935, 132101, 184446, 270757, 321416, 304465, 91701, -104915, -99021, -148890, -50073, -70121, -149009, -88163, -99261, -124041, -91172, -36060, -54433, -85514, -41969, -83927, -182534, -1138, 133926, 114571, -10035, -45570, 43139, 55890, -33167, 170645, 309745, 253443, 140289, 173823, 274712, 356089, 302116, 243144, 294556, 191016, 101401, 86681, -117874, -169165, -289979, -365259, -137953, 2707, -54976, -49653, 47447]
8420D7447o1076n6124n9761j09927j09301J27229L1474K059M016J08383M1269
8409c4312M5736k04867p3240R2472N3086J9670m2779N0302j5096k3428J37445
8398D989l2968K2733j99535j04546J60444J20095j315j7144R7015j275o0448J20150
8386A08195Q7231o1818O579n6568q3944J61082j33942j53415R931J63880L6437
8375H3648r2441k7616q2611J15536O056j14004q1644o0112Q0428q5882m2292L4819
8363b66115J15961L7512J25649K1736r9306O8250j6565J9186P5597j05417j65956
8352a89468m1019R4781J46557n7625K6202J04028J29068l6809j989M3352n7958
8341A59120j10704J51833r0894m6545M527K4653j2861L1935L9372k52173j53373
$$ y = [47447, -13629, -69753, -129514, -239441, -348742, -221513, -190039, -187980, -183964, -75581, -34312, 11424, -193443, -266683, -174211, -121125, -101455, -144234, -93932, -109028, -132456, 4989, -27979, -5246, -204781, -309327, -148883, -28788, -30103, -47247, 49768, 48493, -11955, 108195, 195426, 133608, 140187, 83619, -325, 160757, 26815, -126600, -116669, 47211, 83648, -8793, -36409, -119020, -3484, 2572, -111432, -193076, -253188, -172760, -258642, -300934, -266115, -150154, -112642, 13007, 34743, -64563, 3687, -12878, 6308, 81905, -23512, -189468, -230487, -135706, 10851, -46774, -20572, 83456, 212524, 175715, 173726, 217078, 159120, 48416, 200249, 109355, 62810, 67337, 91990, 79129, 111064, 150436, -101737, -255110]
8330b55110K08966Q1429M2440M3659J19913j01406K391M8002J58346N4245j59431
8319B43444m0676k0828R1972K00431l9386k31937k45521n8597n966J53323M769
8308E1028L2811Q2568m1500L9768K6796j04002j5163O8405q5529J35495J50785
8297C41462k7576j34678k87927n8121K33381J73048K2281q2909K273n6302o6706
8286E8226m4962r735j9089j30785J1647P2530P4297M0261j40745k55421j44252
8275d88028J28722R5639Q841J06702J68815m6299p1549O1164O1569m9462N7471
8264C3585R5733L6013j48189o8482P7435N3552J07747j1123j30122j00320j59031
8253b13202r4841K91147J61753j43699m4523j7025J14925K23335k51682p1603
$$ y = [-255110, -46144, 35285, 77725, 121384, 241297, 139891, 142282, 190284, 348630, 402875, 243444, 202768, 181940, 273912, 474343, 434957, 203020, -42501, -101098, -107064, 46259, 51028, 83839, 166407, 124907, 164675, 191471, 87469, 72306, 140711, 55182, 190677, 341462, 313886, 179208, -108719, -166840, 66541, 239589, 261870, 178961, 181234, 124932, 58226, 13264, 3529, -15560, -146345, -134698, -62168, 12129, 52390, -88355, -343776, -488028, -359306, -263667, -254826, -148124, 20691, -25608, -97157, -35993, 25576, -23886, 33585, 129318, 165331, 17142, -51340, 26095, 79647, 187394, 176271, 46149, -54171, -213202, -308043, -16896, 144857, 1158, -43365, -60390, 54535, 277870, 26188, -45415]
8243d5415K06549N8793q5083k3581j30642k5430J12419m1425J27K05944J5718
8232B47974p0070N24r5713r6307N7452J31592M2017M4425m3231Q8112l7615j21488
8220A47672j77441O1732Q8482L5010k3885l8901J14186K36730P972j07711j92296
8209A51550j7926o809j21511j77933j65242R1985L14690J61519r7376m4415j4410
8198G4122O1313k6275p2720J21990J51070K51947o4896k11543p4194l9705J69586
8187C40695J32541j91394j79137k20576J09230l1041o9875Q7077j02275P5997
8177d8758j00056k5197K7518J11957J4633K8459o3454j81570J7933K72791m326
8166D9930j36720n6800O5099J52336J47387J5476q4967J8879M4332j20240P8310
$$ y = [-45415, 161134, 219927, 134844, 111263, -19379, -44809, 67610, 26185, 26312, 232256, 247974, 177904, 178428, 82715, -13592, 43860, 175452, 217469, 261894, 218663, 306775, 269160, 147672, -29769, 31963, 120445, 155455, 131570, 92669, 206855, 443585, 451557, 343846, 151550, 133624, 126815, 5304, -172629, -337871, -245886, 68804, 230323, 132947, 88532, 74122, 135435, 109160, 36440, 158430, 309500, 561447, 496551, 285008, 210814, 171109, 340695, 473236, 281842, 102705, -117871, -8641, -39682, -109557, -22480, -124755, -48758, -148814, -174011, -146493, -34536, -19903, 8556, -54898, -236468, -218535, 54256, 49930, -86790, -143590, -78491, 73845, 221232, 236708, 151741, 170620, 214952, 94712, 173022]
8155A73022j04100j16507j04896j58248Q4580n6535j5446J52802K52497J5937
8145A23106M7427O4959k89191k31859J0776R8856K3490r108q8338q0824j3730
8134c44436m7051K33298J21216L4289j23150j4183r362m1362M9674J71321J58722
8123A88976J63296o6582j41858j14193J31503J9237l30005K9182Q0291l5567O0193
8112a5527Q6223n0050j48160p3557j84111M5510J26936J07561K1691J13616L8988
8101F9120j5038k24740q7678j349Q1140R8930k751j96889K87301J24541k44092
8090a11505k02073P3487L07267J8679k39498k8457J38324J94505J13936j052j18297
8079A45316j84554K59J49797o976j06596P0182j10590j43010j35635J28524j468
$$ y = [173022, 68922, -47585, -152481, -310729, -226149, -282684, -298130, -145328, 107169, 123106, 170533, 235492, -53699, -285558, -274782, -175926, -152436, -161544, -249882, -330706, -344436, -391487, -158189, -36973, -2684, -125834, -140017, -149379, -190741, -141067, 30254, 188976, 352272, 285690, 143832, 29639, 161142, 180379, -149626, -120444, -40153, -75720, -15527, 70696, 20646, -127514, -201071, -385182, -339672, -212736, -105175, -83484, 30132, 69120, 54082, -170658, -258336, -259685, -178545, -79615, -82366, -279255, 8046, 132587, -111505, -313578, -240091, 67176, 85855, -153643, -182100, -43776, 150729, 264665, 263613, 145316, -39238, -38979, 110818, 103842, -2754, 67428, -43162, -186172, -321807, -193283, -194751]
8068a94751l7849K35161J59444L9567k6107j19827k08595R5545O0656J38966R2272
8057B34482J4728Q0002j02935n3475R747r3377o2783J65224J58574l6166n1800
8046B62221J07113q2615k42529j78528k0805K85974J54165o6537j52630m3011
8036B2818j40703k0397K59440J01054j12791k5119j49123j29468J00473N1807
8026d2009m0578J01126J98098M0904j58405j10943J3934j6304j61292K18616L4022
8015G7169j55761K7577L7187L15209O9625P6574Q759l0277J9269J3283L6558j83750
8003C11422k82570k07326p5217J33847O3518K53725K3656K6664n6592j16768L0677
7992A05036J26660l5731M4666K5525j32780j23478r0588j8784Q6896k158J84659
$$ y = [-194751, -232600, 2561, 162005, 201572, 175465, 55638, -152957, -57412, 3244, 142210, 234482, 249210, 329212, 226277, 172802, 182549, 89172, 26389, 191613, 350187, 314021, 262221, 369334, 286719, 44190, -134338, -155143, 130831, 284996, 218459, 65829, 22818, -117885, -138282, 121158, 222212, 109421, 84302, -64821, -194289, -93816, -42009, -82587, 18539, 216637, 257541, 99136, -11807, 2127, -14177, -175469, 43147, 77169, -78592, -51015, -13828, 301381, 371006, 447580, 456339, 426062, 445331, 458614, 495172, 311422, 28852, -178474, -253691, -119844, -56326, 197399, 221055, 247719, 191127, 74359, 105036, 231696, 195965, 240631, 266156, 133376, 9898, -80690, -99474, -12578, -14736, 169923]
7981A69923J14023k4451r8836j39017j07969N54J05888q6070j0743j3091M0733
7970d9056R6876K216j8139J9897L2702J59803j26438j850j855j5739K4569o9251
7958E3735L3551P7710J21451r269j33524k2259j4194q5242L77J00429m5695r0818
7946a3748l4689L9472j22068l360l1149K8952j6947l7272J93965J22187P9777
7935B05120o0893j7332O0625R4446p4394k9081M201m8578j70752l3613L2286P0801
7923C2836J27143J50733M7201j0535j954j0730k59836j21194J54081J44455j11992
7912A40208J59491J53351r1224k25111O5038l3413K519p5098J9497q98o3718P5874
7900A26516j2281j20838P7315J31662n6343j70791j95751l9717M1469k6569Q7626
$$ y = [169923, 283946, 259495, 160659, 21642, -86327, -85773, 20115, -65955, -76698, -89789, -49056, 47820, 50036, 31897, 51794, 84496, 244299, 117861, 116011, 114156, 98417, 122986, 53735, 87286, 164996, 286447, 277178, 143654, 121395, 107201, 21959, 22336, 122765, 77070, -13748, -48437, -8965, -131033, -134393, -165542, -136590, -153537, -190809, 3156, 125343, 205120, 144227, 126895, 187520, 281966, 207572, 178491, 182692, 134114, -36638, -70251, -37965, 32836, 159979, 310712, 357913, 347378, 345424, 334694, 74858, -46336, 107745, 252200, 140208, 299699, 453050, 361826, 136715, 201753, 168340, 170859, 95761, 115258, 114360, 50642, 126516, 114235, -6603, 70712, 202374, 146031, -24760, -220511, -260228, -218759, -245328, -157702]
7889a57702L928j01830n1261J61603J85008J24495M4374p0760j57639P3595O901
7878F0712j02062j8080J12158J9117k37092p4265R3050J65916J49730L9491m5932
7867A62743l6541r5532M409M6512J2113q6533j08219J8211K6420j0938k3491M4451
7855d6395L4511K0931Q2652N3370k9096J33461M0984o6651o1574M743o5264J4367
7843A16039j57854j56194O0335J72159J66042n4508N8834P932j92109j46841m821
7832a30986J10424m7022J8377o142M4709J38167L7147o2752j22598j18666J52239
7821A2897K8846L3059N5628N9416k35396k25240J08620J16617j98479J43900J79537
7810G9405p0385j95037n9034K22970J57151l2110j3609p8438p3507J15707j39824
$$ y = [-157702, -153774, -255604, -306865, -145262, 39746, 164241, 208615, 137855, -19784, 53811, 60712, -41350, -59430, 52728, 71845, -165247, -239512, -146462, 19454, 169184, 208675, 162743, 126202, 30670, 35079, 81591, 93704, 7171, -101048, -82837, -56417, -67355, -90846, -46395, -11884, 9047, 91699, 145069, 115973, 249434, 290418, 223767, 162193, 166936, 101672, 116039, -41815, -198009, -137674, 34485, 200527, 146019, 204853, 212785, 20676, -126165, -130986, -20562, -67584, -49207, -55349, -10640, 127527, 164674, 101922, -20676, -139342, 12897, 41743, 74802, 130430, 189846, -45550, -270790, -162170, -45553, -244032, -100132, 79405, 9020, -186017, -245051, -22081, 135070, 102960, 89351, 10913, -62594, 53113, -86711]
7799h6711l01044J2837R1184O0423m0237l3922K04414P2144p98k5217J4480M4246
7787A1799k8540J0549q0234r3617o4785n1200J70201N6817j3405j5744J4265l6098
7775a19992j46108j39847J19131Q6488J00884K01891p2924r5165p0879P3851J89993
7764A27323L5646p01j9584j71224k9642K1924j16493N7934N5215J24596J30709
7753B15703k11471m2881M7879K5151K03246J56344N2997j50362l9078n3768r0713
7742A13047r8j05715O2713O5449j20165j07883P9090J11180p8721o2742K77193
7731B33348J00817j57643k29284M374K3458l3175J42167j8899Q648l3986L7961
7720G7786k55372j2958R5537J28088J53669K5912j96887j10809j126Q6649J03438
$$ y = [-86711, -387755, -374918, -283734, -223311, -263548, -297470, -93056, -20912, -21710, -46927, -32447, 11799, -16741, -6192, -86426, -180043, -244828, -296028, -125827, -69010, -82415, -98159, -83894, -119992, -266100, -405947, -286816, -200328, -99444, 102447, 29523, -65642, -136521, -62670, 127323, 162969, 162268, 142684, -28540, -58182, -36258, -152751, -94817, -39602, 84994, 215703, 4232, -38649, 9230, 34381, 237627, 393971, 446968, 296606, 257528, 203760, 113047, 112949, 7234, 69947, 135396, 15231, -92652, -13562, 97618, 18897, -43845, 233348, 334165, 176522, -52762, -48388, -24930, -58105, 84062, 65163, 73811, 39825, 77786, -177586, -190544, -95007, 33081, 186750, 212662, 15775, -95034, -96160, -9511, 93927]
7709I3927l0773j17004l35237O0967L48414K03362j04292j74517j33068K1634
7699a66587k232J01479k5717M4483J30223j48919j63488M2712l7188P1266j3087
7688a67055J38673M4605j02220j35018q7976m6232J89142Q6706n5615K7293O4693
7677d3004K0384m0537K10988J23642L4860j16348P4290j33467j27645q2466j0438
7666h9741M5712p1760q7996k4390K3441K3747K256M8162K65467N5746o346q0762
7654A03536m1440L2132k22751j73467J58652R9789m4900k9804J31411J6365J62414
7643A91937j55638l03342J90515K56128j9993j50594J2679K06573J43403K5779
7633C97447o6877j99944n3901j34380j23960j9782o7701N4733J63660J28502M284
$$ y = [93927, 63154, -53850, -389087, -328120, 20294, 223656, 119364, -55153, -188221, -166587, -168819, -67340, -93057, -48574, 81649, -67270, -230758, -188046, -225234, -153968, -167055, -28382, 16223, -85997, -221015, -308991, -355223, -166081, -79375, -134990, -107697, -43004, -22620, -63157, 147831, 271473, 306333, 189985, 264275, 130808, 3163, -79303, -89741, -44029, -115789, -203785, -228175, -204734, -180987, -178731, -130569, 134898, 190644, 184298, 103536, 62096, 94228, -128523, -301990, -143338, -43549, -88449, -118253, 13158, 29523, 191937, 36299, -267043, -76528, 179600, 159607, 9013, 21692, 228265, 371668, 397447, 330570, 130626, 76725, -57655, -181615, -201397, -269098, -214365, -50705, 77797, 82081]
7622H2081N5615k4076j32851r0113j78399J43390k1519K8264M4126j48363R840
7611b32005J29798n484J54371J38211p2563k44230J3897J18393O9679L9922K12503
7600C22492o5535j38522j43028k5373M2035L1773k6955p1021L2289Q7184k6391
7589A8948j4805j6007K628o8602L0924R268j40872J01336M474N6454J87396N6721
7577B27863k45727Q9103Q8964j05001r7426J23042L0571j02398k3920L0892j58282
7566a42319j51794J27430k4331k7200R9719K8376j7103J22807M7785j01656k40741
7555b79027j05986L2902J01457J82860k4340j61375m793J1017m252J46036k3635
7544a29136L171n0130r6543J6345J32762J07676K03817j77221m1556j55240n795
$$ y = [82081, 137696, 113620, -19231, -109344, -287743, -144353, -165872, -137608, -93482, -241845, -232005, -102207, -107691, 46680, 184891, 112328, -131902, -118005, 388, 70067, 109989, 322492, 256957, 118435, -24593, -49966, -7931, 23842, -3113, -74134, -41845, 45339, 18948, 4143, -11864, -9236, -77838, -46914, -37646, -178518, -77182, -72708, -16254, 171142, 227863, -17864, 71239, 160203, 55202, -42224, 80818, 111389, 8991, -14929, 15963, -142319, -294113, -166683, -191014, -218214, -118495, -90119, -107222, 15585, 63370, -38286, -279027, -385013, -352111, -250654, -67794, -92134, -253509, -258302, -247285, -251537, -105501, -129136, -125965, -176095, -272638, -256293, -123531, -15855, 187962, 10741, -30815, -186055, -191850]
7533a91850O8764J43196k1788l4358L6411l4474m3067m1444j82592n179l1435
7522c37816R4751K4137J26983R9965p6245p1374J18571J97694K5181j02889N7008
7511A55966j08473j34064L413J17341P660J00211J73168K441k26398j26181k1472
7500e6388n2841k4451k02112n55K27522n5845j57434O377N1354J09829J38865
7489a5679J55856n7747k27692l7708J76703J66311P6096m8068p9837r0612j56975
7478a39352j42257M3014J42289j18702k8967M4347M8421J02618l7517k0052L6188
7467f9970j520Q5887K7082j81816k22883J22141O6860n1711l4190J10507J14287
7456c5326j31874N3563p4029j10080J22984K49875J21100J2992K16643K5383n0525
$$ y = [-191850, -123086, 20110, -1678, -36036, 375, -34099, -77166, -118610, -301202, -306381, -337816, -243065, -218928, -91945, 8020, -68225, -139599, -21028, 176666, 201847, 98958, 155966, 47493, -86571, -83158, 34183, 41843, 142054, 315222, 317663, 91265, -34916, -56388, -109229, -133680, -335792, -336347, -108825, -164670, -322104, -315727, -264373, -154544, -15679, 140177, 82430, -145262, -182970, -6267, 160044, 236140, 188072, 108235, 17623, -139352, -281609, -238595, -96306, -215008, -243975, -199628, -151207, -48589, -86106, -106158, -69970, -71490, 14397, 41479, -140337, -363220, -241079, -174219, -225930, -260120, -149613, -35326, -167200, -113637, -187666, -297746, -174762, 75113, 196213, 209205, 425848, 451231, 400706]
7445D00706j69109k13597q8154j50036o0789j27159k4841O037R1666J23112P1740
7434a40424O358J0998j24301r1564l6884J1651J35760J29289L4107J28240P2269
7423A35499j15995n6427n6275o6333J587M0747o4624J57201O304N9356L0977j76298
7411a04281j92883p6946J39193K43731J44301o4357j25382k1328p7450j1034Q4120
7400f2316R935J08363m4844r6397J0006o8343p4603q614J92958J87190O354k44987
7388h5298j45960Q0439J79933M3266q985o0106J08827J05813o5980j58155n5782
7377f1988O4766o9229p744J39601J7549m1368Q0268O277j03015N570O4850j03852
7365h315J30481l0008j2317o6960O7406q6009p9439J06590O6562Q940q8975j63072
$$ y = [400706, 231597, 18000, -70154, -220190, -280979, -408138, -432979, -426942, -335276, -212164, -140424, -134066, -123068, -247369, -338933, -375817, -364166, -228406, -99117, -65010, 63230, 135499, 19504, -36923, -93198, -159531, -157944, -117197, -181821, -24620, -18316, 41040, 72017, -104281, -297164, -374110, -234917, 8814, 153115, 88758, -36624, -57952, -135402, -146436, -62316, -52381, 55982, 11138, -85259, -75253, -143596, -218199, -226813, -33855, 153335, 159689, -85298, -231258, -150819, 29114, 72380, 63395, 3289, 112116, 217929, 151949, -6206, -61988, 2778, -66451, -74195, 65406, 82955, 41587, 121855, 128132, 25117, 30687, 95537, -8315, 122166, 92158, 79841, 12881, 80287, -5722, -85161, 21429, 87991, 96931, 7956, -155116]
7353a55116j98018J20347K42126r6282j33382K3339O3757J08527q7118r0586J71339
7342c1067Q9217j07533P4872L65989L9720k45503j43868L7544Q7219l1210j05084
7331C0296r2704k9424J63167K6488n3403j19397O7050r5P5087n3464Q300q9025
7319f7124j19677M4467J92094M6564p0686L896n3108J26802N8556J1669j11118
7308F2335j35836J67631J27059j9483k18363k15486m6504P9424P2990O9747q3811
7297a40297J9949N3580P8645R5020j24172m3350J01796N5771k16605M966n1883
7286a66580P1593J71157m4387m7919K9376o128R1070J28554j8624l2270n3770
7275A22072L3366J91891K4782j36315j9494Q0919O5527n5344m8077N2963O2139
$$ y = [-155116, -353134, -232787, 9339, -86943, -220325, -196986, -133229, -24702, -111820, -202406, -31067, 58150, -49383, 25489, 391478, 431198, 185695, 41827, 79371, 166590, 135380, 30296, -62408, -91832, 71335, 97823, 44420, -74977, -7927, -8022, 67065, 13601, 21901, -67124, -186801, -142334, 49760, 96324, 25638, 29534, -23574, 103228, 161784, 173453, 62335, -73501, 94130, 221189, 201706, -16657, -232143, -278647, -199223, -126233, -56486, -140297, -120348, -66768, 11877, 106897, -17275, -60625, 41171, 96942, -119663, -114697, -166580, -94987, 76170, 31783, -16136, 13240, 7112, 98182, 226736, 208112, 175842, 122072, 155438, 347329, 372111, 235796, 216302, 297221, 362748, 307404, 259327, 312290, 374429]
7264C74429l59897Q2807P6955j62612J6724K2297m6524L064P0657q3297j04534
7253a09931j0177J88454r1382k1584j50181O2447o3690L8953Q0847O9910N3732
7242D7398P1493o0386p8878l598J4591m1549q7280M1220k2494r1045N4605Q8369
7230f7554R1655P6995J9802j10002K0634o0471l02722J9617R1484P599j42237
7219c55200K5447K66544J00875k5657N8477n0691Q4814q1510l8070m2058l2275
7208h9304O3771m9273P4365l964N1538p7545l0996L0223J28215j7179j02587j8531
7196d1267M3293r702o0825j3650P7860n6587q6897j02830Q200J49626J22915m069
7184B6067j42960j51253r1715j107n3940J52988J43286J07079J51168m1189k07784
$$ y = [374429, 14532, 97339, 174294, 11682, 28406, 50703, 4179, 7243, 77900, -5397, -109931, -120108, 68346, -23036, -44620, -194801, -132354, -196044, -157091, -76244, -6334, 47398, 118891, 58505, -20373, -23971, -9380, -50929, -138209, -96989, -119483, -210528, -155923, -67554, 24101, 101096, 120898, 10896, 31530, -28941, -331663, -312046, -220562, -212963, -355200, -329753, -63209, 37666, 12009, 70486, 19795, 104609, 23099, -14971, -57029, -89304, -25533, -74806, -441, -4405, 47133, -30412, -61408, -31185, 97030, 79851, -22736, -41267, 2026, -7676, -68501, -82151, -4291, -60878, -147775, -250605, -242405, -92779, 30136, 26067, -116893, -268146, -359861, -360968, -414908, -261920, -118634, -11555, 139613, 98424, -109360]
7173a09360j43518n7172Q0280J87350J39358r9356k5201m2799p93N7495k8056
7162d1772J01136M2857p1102n3490O2307L0228J28029l817o536o9392j78876k01487
7150b61915J03965J38312P5864K6164K8357q6518P6422j63532k12017O0507K48783
7139C4392J25462j05322k3258N2224j71424j18131O0182l938j52868J13534R2195
7128i6952M4667J31317q8437j17803j91586R0078J02044j6985N7892j54627j03568
7117c43960p3790K0890p1754O0393R2696j06761p8523J15139k4094k921L0490
7106c82195J45212J80360M6876k9731O9891k04821j54821O4504J61008J87108
7096H3391R8334K9996j13750n6580O8072k8758J5254j47497l7449K23420R4343
$$ y = [-109360, -252878, -310050, -229770, -42420, 96938, -2418, -27619, -70418, -71211, -13716, -41772, 59364, 102221, 31119, -22371, 39936, 70164, 198193, 194376, 187840, 118448, -60428, -261915, -157950, -19638, 56226, 82390, 110747, 24229, 100651, -62881, -274898, -214391, 34392, 159854, 54532, 31274, 83498, -87926, -206057, -145875, -149813, -302681, -189147, -96952, -52285, 79032, -9405, -127208, -318794, -228716, -126672, -143657, -85765, -240392, -343960, -417750, -396860, -468614, -408221, -315525, -422286, -500809, -385670, -409764, -412685, -382195, -236983, -56623, -9747, -39478, 30413, -174408, -329229, -264725, -103717, 83391, 181725, 211721, 97971, 41391, 109463, 80705, 95959, -51538, -88987, 134433, 228776]
7085B28776K8972L1060M0216j59432L2023P1320r1580m3000j07730k3160n945
7074A520j0425k1197k3409M8085Q6519O6181O4310K01085l9804r6649p8633M3331
7062B40914j55664k86635j6756J67443O2166P1887Q3654r3215J7052M8226j80771
7051d1699o7367j9149p2296R2200N3509R923m584J49393J03643r7810M9878j4903
7039A40738o080n5392L7648j5286P7966J05441j16850p8887N6644l5223j11575
7028h56J22676J21926o7906n8912k24178k1528J21859p1134k36671J86923J47540
7017A9739j27739m0741J03681O4300l6146j7237J27210J02071j4845p415j57769
7006A5109J9593R4565L8170j22596k06159R2927J03083J3919p4519J39230J14563
$$ y = [228776, 257748, 288808, 329024, 169592, 201615, 272935, 181355, 138355, 30625, 7465, 1520, -8905, -30102, -53511, -5426, 81093, 147274, 211584, 412669, 372865, 276216, 197583, 240914, 85250, -201385, -218141, -50698, 11468, 83355, 167009, 73794, 90846, 139072, -41699, -109066, -128215, -200511, -108311, -54802, -44879, -49463, 99930, 203573, 105763, 155641, 140738, 134658, 79266, 116914, 101628, 179594, 285035, 168185, 89298, 145942, 110719, -856, 121820, 243746, 175840, 116928, -107250, -128778, -6919, -78053, -314724, -127801, 19739, -108000, -148741, -45060, 19240, -16906, -34143, 93067, 195138, 180293, 172878, 15109, 34702, 129267, 167437, 44841, -161318, -68391, 34692, 48611, -25908, 113322, 227885]
6995B27885O0682Q5307M7507j30118n4864q0499j04614j47267j9426J35316l5463
6984a5554l1563J32279r488J0466j8067p7743J4962Q9731J1192P2835L7684l2329
6972A84405j40469l3243k2608L9244J83803j07410k25361j61719J43221J29294
6962a0843J4062L9429j0377k24338j85668J5378q3579k5171M6811J2589J85617
6951b26090L4273l9766q1781M2899l2294J52211L0592p3056L9756j9865K8882
6940a44239L8976n5049L8703J45742J7594j81430j56900J4570J56048J37487L9914
6929E1416p6359j01870L4196K01338r7295o4239J52470M7919o0604j04032j60001
6918a77061J24875Q2133L3602M7609R4874k1219p2013m6822p7996N7217l5162
$$ y = [227885, 288567, 373874, 421381, 291263, 236399, 155900, 51286, -95981, -115407, 19909, -15554, -47117, 85162, 75674, 86140, 68073, -9670, 5292, 95023, 106215, 179050, 216734, 184405, 43936, 10693, -11915, 27329, 211132, 103722, -121639, -283358, -140137, -10843, 3219, 42648, 32271, -192067, -377735, -362357, -445936, -471107, -424296, -411707, -226090, -191817, -231583, -313364, -270465, -302759, -150548, -119956, -193012, -153256, -173121, -144239, -105263, -160312, -121609, 24133, 41727, -139703, -296603, -282033, -125985, 11502, 51416, -24943, -126813, -92617, 108721, 11426, -52813, 99657, 147576, 86972, -17060, -177061, -52186, 29947, 63549, 111158, 206032, 184813, 112800, 65978, -12018, 45199, 10037]
6907A0037P0494K788j36593j22186K864j46336N5405K7854q4413O0125P0221P1986
6895a17754p794N0328j6960M3928K508P1758N3375j9431m3994K7480K5314J01045
6883A69803L7766m8430J7054j42180K6125j4495K1655l4664n1599Q9002j52582
6872h2545j3526K32297J79022l7545k55135K662Q5313m2722k4623O3167J44360
6861B50725j42752k23518j39872J21462R0708K44406p2252l14483j15011N5467
6851b45120K7913P581P741j00840j92J97234N5077K2884q5766J23162R8015k44411
6839a36722k01982J12952P9344M5813n526k6894N599J75978j2884J2712K19596
6828B67986r2789j29817N5567J7897j61560j19303N8663J20485J18371m1496m1244
$$ y = [10037, 80531, 83319, -53274, -175460, -172596, -318932, -263527, -235673, -320086, -259961, -189740, -117754, -125548, -75220, -92180, -48252, -45744, 26014, 79389, 59958, 15964, 43444, 68758, 169803, 207569, 159139, 176193, 34013, 60138, 45643, 67298, 32634, -18965, 70037, -82545, -96071, 136226, 315248, 277703, 22568, 25230, 110543, 67821, 43198, 106365, 250725, 107973, -115545, -255417, -133955, -43247, 201159, 128907, -185576, -300587, -245120, -217207, -209626, -201885, -302725, -302917, -105683, -50606, -27722, -113488, 9674, 107689, -136722, -338704, -225752, -146408, -100595, -106121, -133015, -127416, 48562, 35678, 48390, 267986, 175197, 45380, 100947, 118844, -42716, -162019, -103356, 17129, 135500, 94004, 52760]
6817E2760n4555k9700J4406J63639N4808k81186n2250J48726L1362l5843N7179
6806F9346k1492n2289l7135m2666j18063J06758L3846N3178Q1663k9167J1022
6795E5001J31892J45280k3053j05079l5302r4913M3725J56206l3495M2012J24268
6784D06542n058j43823k21973j26193L9352m956K5117N5601O5392p3366P9462
6773I6097J3923m4445r3721o6617J26073O1287m0650r769L3917m2N3793J26869
6761B56715O6095j06451l86345j14371l3610K91147J48142j0820Q9694m2095K8847
6750A86948p1110j89183n4625n5561J24531N0713O1760Q3357k5307k04485j55965
6739b48927j22077l7789M8944n4895Q0852O5416Q8189J22175o6611j35829Q3465
$$ y = [52760, -1795, -31495, -17089, 146550, 201358, -79828, -132078, 16648, 48010, 12167, 69346, 47854, -4435, -41570, -84236, -202299, -95541, -61695, -8517, 73146, 43979, 55001, 186893, 332173, 309120, 204041, 168739, 73826, 117551, 273757, 240262, 282274, 406542, 401484, 257661, 35688, -90505, -51153, -56109, -30992, 24609, 90001, 16635, 96097, 110020, 65575, -28146, -94763, 31310, 92597, 51947, 42178, 76095, 76053, 129846, 256715, 322810, 216359, -169986, -284357, -317967, -26820, 121322, 110502, 200196, 158101, 186948, 115838, -73345, -127970, -183531, -59000, -8287, 53473, 136830, 111523, -92962, -248927, -371004, -408793, -359849, -414744, -333892, -268476, -180287, -58112, -124723, -260552, -177087]
6728a77087K04195J2138m5969J80156K37851L45299M22120K5665l22663l87246
6718D94459m73293r9757K9096J09363J8022r2127r1708j47744J5796Q2315J57199
6707A621J06469j01515j54857r1739J82717M6082l1828n5407k3872J88264m7836
6696A8099j9881n9825Q402J68538L6328R623n5291k3210r9831J1869L7322J66400
6684A98543J55410q3880j87138j27250k6486J24594L9781j26337q5375k2725J00139
6673d0724m1379p4785j77938l8860K86585R2546m5936k8287n5506p277M0448J6350
6661g4763j50781J27277J22590K3446k1399m778j6584l9170N5062p9553P9603
6650B0950K7507q4672m9579o463l2940N5510j41796k9391J25772p32m310K4222
$$ y = [-177087, 27108, 39246, -6723, 173433, 411284, 756583, 1178703, 1204368, 881705, 494459, 21166, -78591, -49495, 59868, 77890, -14237, -105945, -253689, -237893, -155578, 1621, 108090, 6575, -148282, -240021, -57304, -11222, -43050, -98457, -122329, 65935, 18099, -1782, -61607, -53205, 115333, 151661, 161284, 105993, 82783, -17048, -5179, 32143, 198543, 353953, 270073, 82935, -44315, -70801, 53793, 93574, -32763, -118138, -140863, -40724, -82103, -156888, -334826, -373686, -87101, 5445, -40491, -68778, -124284, -131561, -91113, -74763, -225544, -98267, 24323, 47769, 26370, 21592, 5008, -34162, 20900, -58653, 20950, 48457, -36215, -85794, -92257, -125197, -69687, -211483, -240874, -115102, -115834, -120144, -95922]
6638i5922J9401k8615R236O0790Q1311O445p5468L0425n2302r1237P4114o624
6626f8446l6548j02314O0042l4020n8028l9189J17096R0901J83381J26854q9181
6615A50548k7368K5796P0297o5610J2336j24144l0326l5946j87526J51668J34378
6604G4103k1401K5939j53967j23360O8629j325N6241J9092m9579N816K4474j55761
6592b31099P1475N8381L5513M3281R9143J95489r368j04108j32614j5682O8434
6581G8845J29594P3655n8267j12268l7385L9353p8677J4569m0422n8981M5117
6570d867J8247j40566L2277J8163J4038N0285L8442j14315q3242K0063k6321p2992
6558b50788q7907Q9319J58413m2224R6680P6046J21148Q1121j40176K6510P263
$$ y = [-95922, -76521, -105136, -95900, -35110, 46201, 52646, -22822, 7603, -44699, -135936, -61822, -68446, -104994, -207308, -147266, -181286, -239314, -278503, -161407, -70506, 112875, 239729, 150548, 123180, 148976, 219273, 153663, 165999, 41855, 11529, -24417, -211943, -60275, 74103, 52702, 78641, -75326, -198686, -130057, -131382, -75141, -56049, -105628, -99812, -75338, -231099, -159624, -101243, -65730, -22449, 76694, 272183, 262815, 158707, 26093, 10411, 78845, 208439, 282094, 223827, 111559, 74174, 113527, 34850, 49419, 8997, -49984, -4867, 13380, -127186, -94909, -76746, -62708, -12423, 26019, -88296, -171538, -151475, -177796, -250788, -338695, -249376, -90963, -133187, -36507, 39539, 160687, 241808, 101632, 128142, 135405]
6547A35405O8149J17925k7809k4740j21578l2972j0651l1990j67990j7842n9015
6536a73108J06626K8814Q449M0911m1404L361j37897J2443K1862O994R9446Q4536
6524F1033j01559p1969J1666J99793N2137j29186p2080J29344q517j55122j16262
6513b00722J83770k7332m4550M1052P579r3566r0181J16625l044L517J07293m1761
6501d1320k22799n0075O8194J91760J09475j65666o8486q9238K16320N0971j72970
6490a73834L4623N8263L3270k46651o3594N0697L8109M7183M5278J06619J11223
6479D1186m2069R5898o423r8782K12188j21038k26126m2230J17960L0394q9616
6468a28658O8949j10331k7168J36610M2296o5723R2741M9683m2133K0701L8196
$$ y = [135405, 203554, 321479, 293670, 268930, 147352, 114380, 103729, 71739, -96251, -114093, -173108, -66482, -37668, -29219, 11692, -29712, -26351, -164248, -151805, -129943, -122949, -23503, 61033, -40526, -112495, -100829, 98964, 151101, 21915, -50165, 79179, 70662, -84460, -200722, -16952, -44284, -88834, -47782, -40203, -133769, -223950, -107325, -110369, -106852, 441, -41320, -264119, -314194, -246000, -54240, 55235, -110431, -178917, -268155, -51835, -864, -173834, -139211, -80948, -47678, -294329, -357923, -307226, -269117, -221934, -176656, -70037, 41186, -883, 95015, 88592, -10190, 201998, 80960, -145166, -187396, -69436, -39042, -128658, -59709, -170040, -197208, -60598, -18302, -84025, 8716, 58399, 16266, 36967, 75163]
6457G5163J02766J62382j99088j18174j81009r9281n7402J90552J72322j14144
6447f5913k57716j163N924M0012J64304J52749J34653L2525j86983r6456N769
6436g2295J34964K19305j66780j68560r5617J1857J87764k7103l5777K8371J04141
6425A20270L0417j81893k06563O707R7551J85356J02739p1708j38408j19153j89810
6414c64495J22773K39584j2071k398n0359N1211L7077j29660j62264q0804R2973
6403b58433O4294O8680l3316k8858n9045j60764n7420K05916K26916Q1592q4083
6392c4521R250R3465k6475j70608n9901J51549O8011j7526n6276j39243Q8960
6381i3315R5611J8307J58073K2321l9015l9428j15978n0861Q5204n0787J83L7102
$$ y = [75163, 177929, 340311, 141223, 23049, -157960, -257241, -314643, -124091, 48231, -65913, -323629, -324792, -318868, -278856, -114552, 38197, 172850, 205375, 18392, -78064, -72295, 62669, 281974, 115194, -53366, -148983, -137126, 50638, 23535, -12242, 16129, 120270, 150687, -31206, -237769, -231062, -133511, 51845, 154584, 82876, -55532, -174685, -364495, -241722, -2138, -14209, -16607, -66966, -15755, 21322, -108338, -270602, -351406, -258433, -194139, -125459, -158775, -187633, -246678, -407442, -464862, -258946, -32030, 49562, -34521, -25271, 68194, 41719, -128889, -188790, -37241, 30770, 13244, -43032, -182275, -93315, 2296, 20603, 178676, 200997, 161982, 122554, 6576, -44285, 40919, -9868, -9685, 27417]
6369B7417o7065J06876m537j32419k4449L1866j17199J54390m482N1465J82891
6358B04754R1613k90918j12457K01213Q0454q7730j67785r7630p7466P0944K74962
6347H9954L6000j92153J30926P0233J15355j06666j43370Q0458K10171r7180r7880
6336I5848Q5934o1888j53635p4367J11885k1137K02j77552q2726K6832J79448
6325g1156k0696J14021J66744j02284n7594j03461j94483K9058J49985j6281J35767
6314B9620J28035N0847J01956J47219r4376k40335j46837k6227L3508j28357p4135
6303b19082K4001P8446k0811k05424O010J51143P966N3653j0530J095J09520k8540
6291e2553p5429Q0697l8736j9060J9982n7451l1569P7030q4142j12225M3091K0267
$$ y = [27417, -39648, 67228, 62691, -69728, -94177, -62311, -179510, -25120, -29602, 21863, 204754, 296367, 5449, -107008, 94205, 174659, 86929, -80856, -178486, -255952, -185008, 89954, 125954, -66199, 64727, 134960, 250315, 143649, 279, 80737, 290908, 193728, 95848, 181782, 119894, -33741, -108108, 3777, -17360, -17158, -194710, -277436, -250604, -71156, -91852, 22169, 188913, 86629, 29035, -74426, -268909, -239851, -89866, -106147, 29620, 157655, 208502, 310458, 457677, 363301, 122966, -23871, -50098, -16590, -144947, -219082, -195081, -116635, -137446, -342870, -336860, -185717, -177751, -124098, -134628, -133533, -24013, -52553, -127982, -47285, -86021, -105081, -85099, -142550, -174119, -97089, -181231, -293456, -250365, -230098]
6279b30098o1592J37982K6461j15719P0252K47979m3920K1144O2683J3264q2139
6268D6297o4689m3708j14655q2518k3870N6409J54977J11986l3548R7336j0198
6257I3819j2N4845m269p2377P2763N376m4214j36660M0087l6533q1972q5229N674
6244a88702O4892P7370Q7289K636N6334Q2136j19015k10209j51493j9323R6908
6233b21177K30477J8915o2472q1069Q1849M0448O3985L776K03793p9816J13012
6222C11721n767k80140j32664j9268m3245q1131Q6249J03497k3580j00613j36620
$$ y = [-230098, -291690, -153708, -127247, -242966, -172714, 75265, 31345, 52489, 115172, 128436, 46297, -18392, -62100, -176755, -259273, -283143, -226734, -71757, 40229, 6681, 104017, 93819, 93807, 148652, 144383, 72006, 144769, 150145, 105931, -30729, 9358, -27175, -109147, -194376, -188702, -123810, -46440, 40849, 43485, 99819, 181955, 62940, -147269, -298762, -318085, -221177, 9300, 28215, -34257, -115326, -33477, 6971, 70956, 74732, 278525, 198709, 311721, 305954, 25814, -106850, -126118, -169363, -250494, -164245, -60748, -84328, -184941, -321561]
$$ [...]
##END NTUPLES=NMR SPECTRUM
##END=
