##TITLE=Analysis number 324837
Compound Code cc 40209
Book Reference 518/15
Project Code adrs
Chemist Name colinb
##JCAMPDX= 6.0         $$ Bruker NMR JCAMP-DX V2.0
##DATA TYPE= NMR SPECTRUM
##DATA CLASS= NTUPLES
##ORIGIN= Bruker BioSpin GmbH
##OWNER= nmr
$$ XWIN-NMR		Version 3.5
$$ Fri Dec  1 10:46:20 2006 GMT Standard Time (UT+0h)  MAYBRIDGE\nmr@NMR_250MHZ
##.OBSERVE FREQUENCY= 250.131544655141
##.OBSERVE NUCLEUS= ^1H
##.ACQUISITION MODE= SIMULTANEOUS (DQD)
##.ACQUISITION SCHEME= undefined
##.AVERAGES= 16
##.DIGITISER RES= 18
##SPECTROMETER/DATA SYSTEM= dpx250
##.PULSE SEQUENCE= zg30
##.SOLVENT NAME= CDCl3
##.SHIFT REFERENCE= (INTERNAL, CDCl3, 0, 16.522)
##AUDIT TRAIL= $$ (NUMBER, WHEN, WHO, WHERE, WHAT)
$$ ##TITLE= Audit trail, XWIN-NMR		Version 3.5
$$ ##JCAMPDX= 5.01
$$ ##ORIGIN= Bruker BioSpin GmbH
$$ ##OWNER= nmr
$$ C:\u/data/dgb/nmr/ADRS/60/pdata/1/auditp.txt
$$ ##AUDIT TRAIL=  $$ (NUMBER, WHEN, WHO, WHERE, WHAT)
(   1,<2006-12-01 10:45:58.26 +000>,<MAYBRIDGE\nmr>,<NMR_250MHZ>,
      <created by zg, POWCHK disabled, PULCHK disabled
       configuration hash MD5:
       49 4B E0 1D 92 C2 6B 37 9F E6 65 BC 52 41 86 1D
       data hash MD5: 64K
       FD 4D 15 C2 EF 93 58 0E D6 7E 74 F2 7C F8 BA 26>)
(   2,<2006-12-01 10:46:11.21 +000>,<MAYBRIDGE\nmr>,<NMR_250MHZ>,
      <Start of raw data processing
       ef LB = 0.3 FT_mod = 6 PKNL = 1 SI = 32K 
       data hash MD5: 32K
       4D AD 1D A6 86 E1 DD F1 89 D9 B3 22 C2 24 BE 3B>)
(   3,<2006-12-01 10:46:12.92 +000>,<MAYBRIDGE\nmr>,<NMR_250MHZ>,
      <apk 
       data hash MD5: 32K
       5E AA 3E CB 52 4D 85 23 36 8B 41 1B 11 2A AB BE>)
(   4,<2006-12-01 10:46:13.65 +000>,<MAYBRIDGE\nmr>,<NMR_250MHZ>,
      <abs ABSG = 5 
       data hash MD5: 32K
       1F AB A9 59 5C CC ED 04 FE 42 42 CB 75 1A BA 5D>)
$$ ##END=
$$ 
$$ hash MD5
$$ 4F EE BF E0 3E 93 AB 6B AD 14 99 55 22 65 EA 18
##$RELAX= 
##$RELAX= 
##$RELAX= 
##$RELAX= 
##$RELAX= 
##$RELAX= 
##$RELAX= 
$$ Bruker specific parameters
$$ --------------------------
##$DU= <C:\u>
##$EXPNO= 60
##$NAME= <ADRS>
##$PROCNO= 1
##$TYPE= <nmr>
##$USER= <dgb>
##$AMP= (0..31)
100 100 100 100 100 100 100 100 100 100 100 100 100 100 100 100 100 100 
100 100 100 100 100 100 100 100 100 100 100 100 100 100 
##$AQSEQ= 0
##$AQ_mod= 3
##$AUNM= <au_zg>
##$AUTOPOS= <15 >
##$BF1= 250.13
##$BF2= 250.13
##$BF3= 250.13
##$BF4= 250.13
##$BF5= 500.13
##$BF6= 500.13
##$BF7= 500.13
##$BF8= 500.13
##$BYTORDA= 1
##$CFDGTYP= 0
##$CFRGTYP= 5
##$CHEMSTR= <none>
##$CNST= (0..31)
1 1 145 1 1 1 1 1 1 1 1 1 1 1 1 1 1 1 1 1 1 1 1 1 1 1 1 1 1 1 1 1 
##$CPDPRG= <>
##$CPDPRG1= <>
##$CPDPRG2= <>
##$CPDPRG3= <>
##$CPDPRG4= <mlev>
##$CPDPRG5= <mlev>
##$CPDPRG6= <mlev>
##$CPDPRG7= <mlev>
##$CPDPRG8= <mlev>
##$CPDPRGB= <>
##$CPDPRGT= <>
##$D= (0..31)
0 1 0 0 0 0 0 0 0 0.06 0 0 0 0 0 0 0.0002 0 0 0 0 0 0 0 0 0 0 0 0 0 0 
0 
##$DATE= 1164969957
##$DBL= (0..7)
120 120 120 120 120 120 120 120 
##$DBP= (0..7)
150 150 150 150 150 150 150 150 
##$DBP07= 0
##$DBPNAM0= <>
##$DBPNAM1= <>
$$ [...]
##$SUBNAM7= <"">
##$SUBNAM8= <"">
##$SUBNAM9= <"">
##$SW= 20.6930455092707
##$SWIBOX= (0..15)
0 0 3 0 0 0 0 0 0 0 0 0 0 0 0 0 
##$SW_h= 5175.983436853
##$TD= 65536
##$TD0= 1
##$TE= 295.16
##$TE2= 300
##$TE3= 300
##$TEG= 300
##$TL= (0..7)
0 120 120 120 120 120 120 120 
##$TP= (0..7)
150 150 150 150 150 150 150 150 
##$TP07= 0
##$TPNAME0= <>
##$TPNAME1= <>
##$TPNAME2= <>
##$TPNAME3= <>
##$TPNAME4= <>
##$TPNAME5= <>
##$TPNAME6= <>
##$TPNAME7= <>
##$TPOAL= (0..7)
0.5 0.5 0.5 0.5 0.5 0.5 0.5 0.5 
##$TPOFFS= (0..7)
0 0 0 0 0 0 0 0 
##$TUNHIN= 0
##$TUNHOUT= 0
##$TUNXOUT= 0
##$USERA1= <user>
##$USERA2= <user>
##$USERA3= <user>
##$USERA4= <user>
##$USERA5= <user>
##$V9= 5
##$VALIST= <valist>
##$VCLIST= <CCCCCCCCCCCCCCC>
##$VD= 0
##$VDLIST= <DDDDDDDDDDDDDDD>
##$VPLIST= <PPPPPPPPPPPPPPP>
##$VTLIST= <TTTTTTTTTTTTTTT>
##$WBST= 1024
##$WBSW= 4
##$XGAIN= (0..3)
0 0 0 0 
##$XL= 0
##$YL= 0
##$YMAX_a= 287843
##$YMIN_a= -353359
##$ZGOPTNS= <>
##$ZL1= 120
##$ZL2= 120
##$ZL3= 120
##$ZL4= 120
##$ABSF1= 16.522
##$ABSF2= -4.171173
##$ABSG= 5
##$ABSL= 3
##$ALPHA= 0
##$AQORDER= 0
##$ASSFAC= 0
##$ASSFACI= 0
##$ASSFACX= 0
##$ASSWID= 0
##$AUNMP= <proc_1d>
##$AZFE= 0.1
##$AZFW= 0.1
##$BCFW= 0
##$BC_mod= 0
##$BYTORDP= 0
##$COROFFS= 0
##$CY= 12.5
##$DATMOD= 1
##$DC= 0
##$DFILT= <>
##$DTYPP= 0
##$F1P= 14.0000005364418
##$F2P= -0.99999901652339
##$FCOR= 0.5
##$FTSIZE= 32768
##$FT_mod= 6
##$GAMMA= 0
##$GB= 0
##$INTBC= 1
##$INTSCL= 1
##$ISEN= 128
##$LB= 0.3
##$LEV0= 0
##$LPBIN= 0
##$MAXI= 10000
##$MC2= 0
##$MEAN= 0
##$ME_mod= 0
##$MI= 0
##$NCOEF= 0
##$NC_proc= -5
##$NLEV= 6
##$NOISF1= 0
##$NOISF2= 0
##$NSP= 0
##$NTH_PI= 0
##$NZP= 0
##$OFFSET= 16.522
##$PC= 1
##$PHC0= 226.1026
##$PHC1= 8.091142
##$PH_mod= 1
##$PKNL= yes
##$PPARMOD= 0
##$PSCAL= 4
##$PSIGN= 0
##$REVERSE= no
##$SF= 250.13
##$SI= 32768
##$SIGF1= 0
##$SIGF2= 0
##$SINO= 400
##$SIOLD= 32768
##$SREGLST= <1H.CDCl3>
##$SSB= 0
##$STSI= 32768
##$STSR= 0
##$SW_p= 5175.98343685301
##$SYMM= 0
##$S_DEV= 0
##$TDeff= 65536
##$TDoff= 0
##$TI= <Analysis number 999999
Compound Code 99
Book Reference 9
Project Code 9>
##$TILT= no
##$TM1= 0
##$TM2= 0
##$TOPLEV= 0
##$USERP1= <user>
##$USERP2= <user>
##$USERP3= <user>
##$USERP4= <user>
##$USERP5= <user>
##$WDW= 1
##$XDIM= 32768
##$YMAX_p= 453870945
##$YMIN_p= -639106
$$ End of Bruker specific parameters
$$ ---------------------------------
##NTUPLES= NMR SPECTRUM
##VAR_NAME=  FREQUENCY,     SPECTRUM/REAL,   SPECTRUM/IMAG
##SYMBOL=    X,             R,               I
##VAR_TYPE=  INDEPENDENT,   DEPENDENT,       DEPENDENT
##VAR_FORM=  AFFN,          ASDF,            ASDF
##VAR_DIM=   32768,         32768,           32768
##UNITS=     HZ,            ARBITRARY UNITS, ARBITRARY UNITS
##FACTOR=    0.157963299565203, 1,           1
##FIRST=     4132.6476996994, 0,             0
##LAST=      -1043.33573715361, 0,           0
##MIN=       -1043.33573715361, -639106,     0
##MAX=       4132.6476996994, 453870945,     0
$$ Real data points
##PAGE= N=1
##DATA TABLE= (X++(R..R)), XYDATA
$$ [...]
24439A0115m929J8462L8118j08273R2550J9043J3972r3032q8679l2362P8604M4885
24427a1526p2486m4128n8812M366J45775K46927k32149j18823L0145j64557J55182
24416a20086l786j51523k1294J94881R0701k0226Q8434p6941l9402q2230J7166
24405a24306R8616Q6892o819R4289q4414O7458l6548r8258k8247j40812j44138
24394c16287M5686K49909J00269k61101k9477J26077J3501p3108m7605k3545J40545
24383g5136k9081j0196k0459L3863l8325p5353J27017n047K818L3980r2580j13522
24371b62021L3117j2722j34468m2838N6959J19389J45137K39244O4334j78000
24361B8131J7587K0578m3081k4709j10956j60294o9951J25253J7894J77522n0241
$$ y = [10115, 5186, 23648, 61766, -46507, 46043, 65086, 79058, -13974, -102653, -135015, -56411, -11526, -84012, -128140, -186952, -182586, -36811, 210116, -22033, -140856, -110711, -275268, -120086, -123872, -275395, -296689, -101808, -11107, -31333, 57101, -19840, -59242, -141472, -124306, -25690, 61202, 54383, 148672, 64258, 131716, 95168, -3090, -31337, -172149, -316287, -270601, -20692, 79577, -181524, -211001, -84924, -71423, -144531, -192136, -215681, -75136, -104217, -114413, -134872, -101009, -139334, -214687, -87670, -92717, -89899, -55919, -148499, -262021, -228904, -241626, -376094, -418932, -361973, -242584, -97447, 141797, 206131, 28131, 45718, 66296, 23215, -1494, -112450, -272744, -342695, -217442, -199548, -22026, -72267]
24350g2267m6260M6789q225q9624M7873J27878K03868L7317k07013j35805k1398
24339a16867Q6872n3206r2647j25261L8403R5799R9991J38795l9618P1741j7915
24328H6087O9228K3731j8789Q3101n6562j28206j36019K1937Q9269l4798j38389
24317a39410Q6931J0190J7279M2715P4352p6284k3198r0109m7948j2004m442r7587
24305b59515J292L2624J2145J81286J71372J96998n2845k6330M9845q0282n7784
24294A68806m744j71009n2404l291R649L4053j9207l526N9862q991R6587o304
24282I9481J01621k7961j41827m3473R0916o0593J59940O2281k29466j14944J8346
24271h5679J1764J27410O737M9329Q8142J08860q8858k18401j70057l6190K28268
$$ y = [-72267, -118527, -71738, -79963, -169587, -121714, 6164, 210032, 247349, 40336, -95469, -116867, -29995, -83201, -175848, -301109, -262706, -166907, -66916, 71879, 32261, 104002, 86087, 155315, 179046, 160257, 243358, 186796, 58590, -77429, -55492, 33777, -1021, -139410, -52479, -42289, -25010, 17705, 92057, 15773, -7425, -97534, -145482, -157486, -161928, -259515, -258223, -225599, -213454, -32168, 139204, 336202, 283357, 257027, 306872, 226590, 168806, 164062, -6947, -59351, -62642, -52993, -18940, -38147, -41673, 18189, 9198, 105785, 99481, 201102, 173141, 31314, -12159, 78757, 18164, 178104, 240385, 10919, -104025, -85679, -73915, 53495, 60232, 109561, 197703, 306563, 217705, -696, -170753, -206943, 21325]
24260B1325P7448M427m6959N9770m3080j11095r2545j08012L5376n3447j41285
24249c98077O606L0480P923J12902L1039m4070N6914J71550r3875j59555L5474
24238b42689K53437J53697j30802j3245L3989J1554q387o2185k7128N0396k8396
24227i759J12650P4078M3634J40484o0077k39260k02499m8158J87286P7693r5006
24216a8934K882j41653K1095J85020M3280L7517j57480o5103R9594P3945R1353
24205A71516j00795j02512n0243K4239j1402q2848q1699q45R5855M7886J74687
24194H3839Q8340j05504J69171J62906l2864r5500n9455P3448O560j33523r3414
24183F4004n1818L9203P8766r6400j42508o7254l5342J11959O4001r3019k151
$$ y = [21325, 98773, 103200, 56241, 116011, 72931, -38164, -130709, -238721, -203345, -256792, -398077, -391471, -360991, -353068, -240166, -209127, -253197, -196283, -24733, -118608, -278163, -242689, 10748, 164445, 33643, 20398, 54387, 65941, 57554, -4631, -31759, 18637, -9759, 102891, 176969, 220603, 361087, 301010, 61750, -140749, -188907, -1621, 76072, -18934, -16052, -157705, -136610, 48410, 91690, 129207, -28273, -93376, 6218, 80163, 171516, 70721, -31791, -82034, -57795, -69197, -152045, -233744, -234589, -138734, -90848, 83839, 172179, 66675, 235846, 398752, 365888, 270388, 210933, 284381, 290941, 157418, 64004, 12186, 51389, 130155, 33755, -108753, -176007, -211349, -99390, -35389, -128408, -130559]
24172a30559J93060P742r1958j34928j15621J48081R094n6206P7804j5336M396
24161a04431J7499M1499R6939P7500j012O978k14387j10759J62689R6462K6261
24150I5238n758j3944J3840j9953l2302j12684J28859J88759m3904k1760o0833
24139A15558r025J67909L3084k15540j40384M8395Q7276o9137q6581L5053j5400
24128d8792L1442P2911j30937l0242O0371m2704J14571j24763j16475J85461m7299
24117g6456j17893K5884p8144J06714K4728J0468J1939m5798R6603r0025k4849
24106a56829N4051r8208n1383l1184j9595K3574P9878J02589J69436J85302r4501
24095A63130q3979r3979J21168P7630M2148m9892p0524n1338j9194J79K6940K246
$$ y = [-130559, 62501, 70243, -21715, -156643, -272264, -124183, -115089, -171295, -93491, -108827, -104431, -86932, -45433, 51506, 129006, 127994, 134972, -79415, -190174, -27485, 68977, 95238, 89480, 75536, 89376, 69423, 37121, -75563, 53296, 242055, 198151, 176391, 115558, 106533, 274442, 307526, 91986, -48398, -3, 87273, 18136, -68445, -33392, -48792, -17350, 55561, -75376, -105618, -45247, -87951, 26620, -98143, -214618, -29157, -76456, -194349, -168465, -246609, -139895, -115167, -104699, -92760, -138558, -41955, -131980, -156829, -102778, -200986, -252369, -283553, -303148, -279574, -199696, -97107, 72329, 257631, 163130, 79151, -14828, 106340, 183970, 226118, 176226, 105702, 54364, 35170, 35349, 62289, 64535]
24083F4535m2028j00890j00036M6857J44406j21164j12782P2438J02282M0112
24073f270o0185L062o8633j51462R5430K23727J45209p710j30432K1528q041J03891
24061A60114O817m2455q3995k3913Q6126r4194L9831m5412N2691K6029j0295O8393
24049A39737j9948q2656o2566k6493n2647J88346L9417K2710p3967j00358k15860
24038b44285J3792K17871J78738K7309j24425Q4517N7827l5850O1913L1443q994
24027B59856j6929O064P3385l3240j16087q6704j25795r0416N7154p8699J17147
24016c4264k0569r998Q6167J5104n9111O0207O024J56979K35166j15396j47564
24005A72745q6149L1616l4345K565l1389L4663L4940j04270L8145r4468j51543
$$ y = [64535, 22507, -78383, -178419, -131562, 12844, -108320, -221102, -148664, -46382, -6270, -66455, -63393, -132026, -283488, -188058, 35669, 180878, 173168, 42736, 64264, 56223, 160114, 166931, 124476, 40481, 16568, 102694, 8500, 48331, 2919, 55610, 81639, 71344, 139737, 119789, 37133, -25433, -51926, -104573, 83773, 123190, 145900, 71933, -28425, -244285, -230493, -12622, 166116, 193425, 69000, 153517, 211344, 175494, 237407, 268850, 259856, 242927, 248991, 322376, 289136, 173049, 86345, -39450, -129866, -72712, -151411, -34264, -54833, -64831, 21336, 36440, -22671, 37536, 43560, 200539, 435705, 320309, 172745, 86596, 118212, 83867, 86432, 55043, 89706, 124646, 20376, 58521, -35947, -187490]
23994a87490j9903l136Q3928K70531K33606L78l49935n0382R2411j4812r9619
23983d4423n7367p8826P5100M9771j38804j02744J79277p5624m6637P5070J18761
23972d6446J80509j59164k48696j70237J36138K40323J15576l1517M7687J46029
23962B10202o29p6809q2555q799J5405l3370r0785J61398Q7116J1787k93617j36705
23950b37361j05275J66148R5070K0546P3233j4586j59990j476l265K2635J17971
23939b6350J94766j14311k09312J47987J9608q3599q7212k1082j9359M9378J3199
23928a36287K04017J54197m8902j01961M9147m8576l5030J85807n9555o9232j3128
23917H0497k15790j09067n8134K43109P6665j36179M9791Q758j04696l2660J86025
$$ y = [-187490, -207393, -210529, -126601, 143930, 377536, 377914, 27979, -22403, 70008, 55196, -44423, -101790, -180616, -105516, -55745, -194549, -297293, -118016, -193640, -240277, -165207, -46446, 134063, -25101, -273797, -444034, -307896, -67573, 48003, 16486, 64173, 210202, 209573, 132764, 50209, 41410, 56815, 23445, -67340, 94058, 181174, 192961, -100656, -237361, -342636, -176488, -81418, -60872, 12361, -2225, -162215, -163691, -166956, -144321, -26350, 168416, 54105, -155207, -7220, 12388, -71211, -158423, -179505, -198864, -149486, -136287, 67730, 221927, 173025, 71064, 120211, 71635, 36605, 222412, 162857, 93625, 80497, -135293, -244360, -302494, -59385, 17280, -118899, -69108, -60350, -165046, -197706, -11681]
23906a1681o1707l8381k3698Q6435J48838m569Q657j06455l3721q3918L4051P4371
23894a1778q6969k0867q5344l8483p9243j7099K15527K67687r5200k22504o6205
23883b40478J1684P1292O9267j0879Q1919P3119J4362k08734j58565N1092J5990
23872b29931o6817P7607L02655k787L5105m9810o6327J4826M7849j44730j3837
23861i6197J06824M5086j45954R2327O7722P814m9830j03051j23383l2820J10087
23850a21375K5078O4206J93389K8245o3649R1404N7480M7508L1913j16067L8433
23839B76565p2299k68781k00600n9289q796L74417R7186n148q0355j21035j64704
23828b32839r5538L1250J59920j408k2786J6739R3122K3861k2059J60869o2966
$$ y = [-11681, -73388, -111769, -135467, -49032, 99806, 95237, 103894, -2561, -36282, -120200, -86149, -11778, -98747, -119614, -204958, -243441, -322684, -339783, -124256, 143431, 48231, -174273, -240478, -228794, -157502, -88235, -99114, -17195, 55924, 70286, -138448, -297013, -245921, -229931, -296748, -219141, 83514, 80727, 115832, 66022, -305, 14521, 62370, -82360, -96197, 10627, 55713, -90241, 2086, 69808, 77622, 27792, -75259, -198642, -231462, -121375, -96297, -32091, 161298, 189543, 125894, 217298, 274778, 322286, 354199, 238132, 276565, 204266, -64515, -265115, -324404, -333200, 41217, 138403, 133255, 52900, -68135, -232839, -328377, -297127, -137207, -138615, -161401, -144662, -51540, -27679, -49738, 111131, 48165]
23817D8165J24881Q3884j52487m7165j8900J61586Q8909q7580j77046j46243Q8066
23806c3930J31689J00355j619j58220J10348K39878J0651j40284j25800L4746
23796A67814R768J04099l5260j3254j04753j85306j15535P3210Q8440m9816Q8174
23785B7581R2240j2225m2053q6213O3651L0714r5085J23669O0580o9658j34340
23774d1139l4794q1493k56j17072N5831J16607J9738O7724J1702m6066J1045K4460
23762a3713K8142j00550q9700N7041r8107J9905p5243m196q402O4581J08555M99
23750a11188Q5315O0683k4893o1573n9894J21166J62214O3152j50059j41952P3657
23739A6628J35769m5727j64229Q5812m9600j11294J20836J36937l4998r9934P2275
$$ y = [48165, 173046, 256930, 104443, 57278, 38378, 199964, 288873, 201293, 24247, -121996, -33930, 97759, 198114, 196495, 38275, 148623, 388501, 399152, 258868, 133068, 167814, 177582, 281681, 246421, 233167, 128414, -56892, -172427, -99217, -10777, -60593, 27581, 119821, 107596, 65543, -20670, 42981, 73695, -21390, 102279, 162859, 93201, -41139, -75933, -157426, -157682, -274754, -218923, -102316, -82578, -14854, -3152, -49218, -38173, -13713, 14429, -86121, -175821, -118780, -216887, -196982, -272225, -276421, -284823, -220242, -111687, -111188, -25873, 34810, 9917, -51656, -111550, 9616, 171830, 234982, 84923, -57029, 16628, 152397, 106670, -57559, 28253, -21347, -132641, -11805, 125132, 90134, -9800, 62475]
23728F2475n1128m407R0543J46426J6607N2660j18321k23322N8977n4875J32646
23717A08281n262j50399O3856p4774j30940L7479K0883K8177N518P3046J58213
23706A34078q985j67451m6136M5336P3710L3351o8430j24775N6540J34575O9962
23695A31775J30654p2599k9696K1036J7681j11619j49456m0315o241P1078o7556
23684a05258j31295J34088J26300j12904j46501J39673K8396j3385j5299L1404
23674f4781Q2463N1461l4799j06928K51489K14671J8246j47962j91736j9740r1003
23663c8619o5780K5263j7677l3435J20373J03711l9171j00465j71240k0793J70458
23652f7375n3098j24793J2627J00516J65992j7460r8339M0086p0384j0336N62
$$ y = [62475, 11347, 6940, 97483, 243909, 260516, 313176, 194855, -28467, 30510, -24365, 108281, 103019, -47380, 16476, -58298, -189238, -151759, -130876, -102699, -97181, -24135, 134078, 125093, -42358, -88494, -43158, 30552, 63903, -4527, -129302, -72762, 61813, 131775, 262429, 189830, 160134, 181170, 198851, 87232, -62224, -102539, -108780, -37702, -105258, -236553, -102465, 23835, -89069, -235570, -95897, -67501, -80886, -96185, -64781, 17682, 69143, 34344, -72584, 178905, 393576, 411822, 263860, 72124, 52384, -38619, -104399, -79136, -96813, -130248, -9875, 93836, 54665, -45800, -217040, -237833, -67375, -120473, -245266, -232639, -132123, 33869, 16409, -81930, -41844, -112228, -122564, -122002]
23641a22002J84338M488j54141r3351K15466J51085l5718j96770l5324J48335
23631F6406m1397l3381J12401j66632n9539J31947q1990j81474O0141j34159l3498
23620c61175M3976J27505J68111J5720J6084J5913P0768J00376j06585q3927n3485
23609d6719K2720R1052l6896j40792m2054O3841l3367j38284m6636R6566J08433
23598a02136O5115N2823L7433Q7252j32265L6214O8992j16668j54335j24306m9261
23587c31142J97641Q3154r1980L9452J69377J14536m9132l00497n1616J70975
23577d9232j9922n8007q755O1531J02441J00875o2651m8523n2638P7728n9346
23566a6499p200p6086r9987l1416M2325N9471M304R4244P1120O3311N8537N6701
$$ y = [-122002, 62336, 66824, -87317, -180668, 34798, 185883, 150165, -46605, -81929, 66406, 25009, -8372, 104029, -62603, -122142, 9805, -72185, -253659, -193518, -327677, -361175, -317199, -189694, -21583, -5863, 10221, 26134, 96902, 197278, 90693, 6766, -46719, -23999, 67053, 30157, -110635, -152689, -88848, -122215, -260499, -307135, -210569, -102136, -37021, 15802, 53235, 140487, 8222, 44436, 113428, -3240, -157575, -281881, -331142, -133501, -50347, -142327, -102875, 66502, 181038, 131906, -168591, -220207, -49232, -69154, -127161, -135916, -74385, 28056, 128931, 66280, 17757, -34881, 42847, -16499, -23699, -99785, -199772, -231188, -188863, -129392, -125088, -30844, 40276, 103587, 162124, 218825]
23554B18825N1102k6947P1227J37310j49903j19206n0586K8215p5514j17990r2269
23543a25736j42704j65813O3641J66798N5749K8176r7376J6654J37944K35343
23533A72676r689q2284n5651N6423L2626r7055p4212p4067P543J50123Q9507j09374
23521F566K7811j27172j28711J16874K2270j49382L1958J03477R4323L522J14148
23510A15684K42521M3435j98173k78165o8806J45219J18764j8779o15O9789L4397
23499B05271j06682n8473J14678k0772m8800q8510r072l2311O5550k736R064j03133
23487g5926j50165r5469K79014m2684O3066J62626J04967Q7149j47024l0288M9087
23476B04353J97980L1892j94350j26925q6553O2812k9265L6213n0278j44516j33207
$$ y = [218825, 269927, 242980, 314207, 451517, 301614, 182408, 131822, 160037, 84523, -33467, -125736, -268440, -434253, -370612, -203814, -148065, -119889, -217265, -200611, -62667, 172676, 162987, 80703, 25052, 81475, 114101, 17046, -57166, -131233, -123690, 26433, 115940, 6566, 34377, -92795, -221506, -104632, -82362, -231744, -199786, -96309, -1986, 1536, 115684, 358205, 401640, 203467, -74698, -143504, 1715, 120479, 101700, 101085, 170874, 205271, 98589, 40116, 154794, 134022, 85222, -3288, -12360, -44671, 20879, 18143, 27207, -75926, -226091, -321560, -42546, -85230, -22164, 140462, 245429, 332578, 185554, 155266, 204353, 402333, 434225, 239875, 112950, 26397, 89209, 59944, 96157, 45879, -98637, -231844]
23465b31844J05860J84563K7886l0177m8779q0863J12433J30253j21996q651J36500
23454A75185n8145k93140m2577Q4357J59381r7076r4361R8684J61535m5806k04471
23443a56434l4131J50875K63525L7640K4361J1392j27228n2645l8734o0904r455
23432H262L6404Q3242q9766R5756O3848O0801p5655K1885j7205l4123K1671j35815
23420C9305j66050j82141J26486K59468Q283p8210j15332q2342M5247k5916Q4856
23409h6346N9431j1116Q1291N8034l5995P1058j36513j33092P0348k5702N2256
23398c6346j1413L8277Q7793j41121k9883p6220J21189J32461j6318j07793l4321
23387g3695j2447r1103J57664K1930J2943O3908p0283K3878O6511J33515m798
$$ y = [-231844, -125984, 58579, 86465, 56288, 7509, -73354, 39079, 169332, 47336, 38685, 175185, 117040, -176100, -218677, -134320, 25061, -72015, -166376, -67692, 93843, 48037, -156434, -190565, -39690, 223835, 261475, 285836, 297228, 170000, 117355, 78621, 17717, 8262, 44666, 127908, 38142, 133898, 197746, 258547, 182892, 204777, 187572, 153449, 175120, 39305, -126745, -308886, -182400, 77068, 85351, 7141, -108191, -190533, -145286, -171202, -86346, -26915, -38031, 43260, 101294, 65299, 136357, -156, -133248, -62900, -88602, -36346, -47759, -9482, 78311, -62810, -92693, -168913, -47724, 84737, 68419, -39374, -73695, -86142, -177245, -19581, 2349, 15292, 79200, 8917, 32795, 99306, 232821, 228023]
23376B28023k65625J1789J37419J80896n6153j46598M7818P755J20828P2544j19616
23365B19080m1010j30019q3042M2308R617q6599o4514N2637J00007L3055n5644
23354d124k5205M5938N2735R5943k9014J13103M47M3761r9536j19061o3773K9520
23342D0734o3445J2066j65581p0151Q0327K8018j8709N679j00665J23644L9256
23331h8827n6304J36369O7226N9505J03626p2894J7895k0435J52649J17428k38424
23320A77814k71045O9652N1484o9900O041L4398q1770j57191p7986L7717K24905
23309e5881P7676K3850J01745o411j72398R76p415K6436j4030J0502l2413M682
23297d2681o8758j24422r294n482P3596J53493n1172j10117j18567P3938K22730
$$ y = [228023, -37602, -25813, 111606, 292502, 236349, 89751, 137569, 145324, 266152, 338696, 219080, 178070, 48051, -34991, 7317, 16934, -69665, -134179, -81542, 18465, 51520, -4124, -29329, 16609, 69344, 165287, 136273, 249376, 249823, 293584, 194048, 74987, 11214, 40734, -22711, -10645, -176226, -246377, -166050, -138032, -156741, -151062, -251727, -128083, -88827, -145131, -8762, 58464, 117969, 221595, 148701, 166596, 146161, 298810, 416238, 177814, -93231, -23579, 27905, -41995, -35954, -1556, -83326, -240517, -318503, -280786, -55881, 21795, 45645, 147390, 140979, -31419, -30443, -37858, -11422, -25452, -14950, -47363, -42681, -111439, -235861, -245155, -250637, -177041, -23548, -74720, -184837, -303404, -229466, -6736]
23286f736P530o3702Q1160K5866J7279J1929l9606j8309N8109N8933j07298j10753
23274h5598L9314R3162o1851J3694O3885N4833J5770k04097J096R121J1822p0544
23262a19393R0626l5777m057J38561l3345Q1005q8639o5708r5800j83855r4991
23251d11373J59923K25696j4589q0141Q6226P9771k2801L8993o4960r4976K67388
23240A69157R4215l0552m0594k38461j16898k4219J37239K17224k1462j64747
23230a9098j40020R7100N6546j23661k421l1965k2353r9712M1372J28216K24715
23219A08719L513k9552q2802j67426j56342L829K26357N9200K7213j03984M3567
23208f7708J8585P4682J4895j99848K5862K14050M5335j28961j17608O4115q0700
$$ y = [-6736, 794, -62908, 18252, 44118, 61397, 73326, 33720, 15411, 73520, 132453, 25155, -85598, -46284, 46878, -14973, -1279, 62606, 117439, 133209, -70888, -69792, -60671, -48849, -119393, -28767, -64544, -68601, 69960, 36615, 117620, 28981, -36727, -132527, -316382, -411373, -251450, -25754, -40343, -120484, -34258, 45513, 22712, 61705, -3255, -98231, 169157, 263372, 232820, 192226, -46235, -163133, -187352, -50113, 167111, 145649, -19098, -159118, -62018, -5472, -129133, -131554, -163519, -185872, -285584, -244212, -115996, 108719, 112232, 82680, -122, -167548, -323890, -320061, -93704, -34504, -7291, -111275, -67708, -49123, 25559, 40454, -159394, -133532, 80518, 125853, -3108, -120716, -56601, -137301]
23197a37301k32233R825K57241J10023j0941N952J2177n4284k8065P9807L1677
23186D3878q3095K29763n5054j77065P0165l4227K04498P7743o6599q2195o8028
23175E9784q5815l8541n0113m3050o8642P8466J91911J2246q9749j2282R8027
23164E2242p6221O5224O4762o0453j5273J20731q6607j01695l9761N5414J28813
23153A07176P6673L4686j59336j51930L7864m9042N0530P6478j2004l2981j3197
23142c5083m2983J52843J50058p3078L3466r7399j50599j31557q6680K05453N7187
23131a8372j75377M8289J52333O6061Q2513L2130j01418k0820R8753n8002l11168
23120b05078R2951J54082L4365j23797r2451q7135J250o4937J2791L2908R5180
$$ y = [-137301, -369534, -359709, -102468, 7555, -3386, 2566, 14743, -39541, -67606, 12201, 43878, -39217, 190546, 135492, -41573, 28592, -5635, 198863, 276606, 210007, 127812, 59784, -26031, -64572, -114685, -157735, -226377, -147911, 44000, 56246, -33503, -45785, 52242, -23979, 41245, 106007, 45554, 30281, 151012, 64405, -37290, -77051, -21637, 107176, 183849, 218535, 59199, -92731, -54867, -103909, -53379, 23099, 11095, -21886, -35083, -78066, 74777, 224835, 151757, 185223, 87824, -62775, -194332, -281012, -75559, -18372, -193749, -145460, 6873, 72934, 155447, 187577, 86159, 65339, 164092, 106090, -205078, -112127, 41955, 76320, -47477, -139928, -227063, -225813, -290750, -277959, -245051, -149871]
23109a49871J81466l0006k22153J11418J13436o2876j21323J04088o11q9166o7722
23098b33320p1046j4230n520P4060N7452L9685L5428N1407M4295j27919M2951
23087a06757J680k6192k5302N6943L1895R5912r6672J11616L0127k5790N0773
23076I8233P2373j03450j27654j35397N738j34914N4021J80221J14007l1332j4955
23065b3109Q3162J45333j14219j72219J1415J1774j68358j45188K09310J94846
23055C2747K13876O4094n3146k16390j81528L4536l8943Q7638p880k5404K9736
23044f0664J53530O8447j38635L5459j12383j02680J43405q3179p0279J08203
23034e8776K49299J31720o5892j4868j89622j50463J42609J38168k09240l1685
$$ y = [-149871, 31595, 1589, -220564, -109146, 4290, -58586, -179909, -75821, -76432, -165598, -233320, -304366, -318596, -324116, -250056, -192604, -152919, -117491, -66084, -21789, -149708, -106757, -105077, -131269, -156571, -99628, -67733, 28179, -68493, 43123, 73250, 47460, 98233, 170606, 67156, -60498, -195895, -190157, -325071, -271050, -90829, 23178, -8154, -23109, 60053, 205386, 91167, -81052, -69637, -57863, -226221, -371409, -162099, 32747, 246623, 310717, 257571, 41181, -140347, -105811, -144754, -57116, -64996, -90400, -60664, 92866, 161313, 22678, 58137, -54246, -156926, -13521, -96700, -166979, -58776, 190523, 322243, 256351, 241483, 51861, -98602, 44007, 182175, -27065, -58750]
23024e8750K3200L4617J38403N8977j03786k63431k11966K499L58421K97202L345
23013B78731k11776p2954P8639o6642r0297M866n3357R9799L7884j07138j19573
23002b21818M9763K5321j05665J1060J80878L3020l7949J2700q3650n8249j3662
22991b08251M1187J06682Q0828N0792O2924M4392l5839n025o8573r1231k6933
22980d9047m5134o2599P0007j6610j3643N4868j15303j5620J2578J81510J09176
22969A10183l1764K5040J60678O1511n3837j57435j30506r9676n6227J60527p9363
22958i0869l2010J3876O7917R7968J5551J25113j01383q7736k813J57029O4411
22947B27054j62059k9612m5405M9621q1253q5758L1640n9224j17543l0850R0608
$$ y = [-58750, -35550, -933, 137470, 196447, 92661, -170770, -382736, -380237, -21816, 275386, 278731, 66955, -5999, 72640, 5998, -84299, -79433, -132790, -32991, 4893, -102245, -221818, -172055, -146734, -252399, -241339, -60461, -27441, -65390, -52690, -136340, -194589, -208251, -167064, -60382, 20446, 71238, 134162, 178554, 142715, 137690, 69117, -22114, -49047, -94181, -156780, -86773, -103383, -117026, -62158, -177461, -193081, -180503, 1007, 110183, 78419, 103459, 264137, 325648, 271811, 114376, -16130, -115806, -172033, -11506, -90869, -122879, -109003, -41086, 56882, 72433, 197546, 96163, 8427, 5614, 162643, 227054, 64995, 35383, -10022, 39599, -41654, -127412, -95772, -154996, -272539, -303389, -212781]
22936b12781m4861O2920r5381O7781Q2315j072K8864J56793j30865O4119L8148
22925A5980j0273R2125K03724m2278j27144j6389L4288n2242J773J42015N4679
22914B96258j27853J681M4045o119j18274l0689o1591l9754M1238q4471k8897
22903a14426J21159o3908J46738Q6659K32J10803j20135j48449p6108K0659J32284
22892I5508j26487m7653O9251r4853r8786K61084N8141j39148N654N5584r569
22881B8726J14106N6857j71170M9748M1651j71702K6379Q2075K58564R2764o1831
22870C46167J03479L4214j55635j96866n29r2086j02153j15574K34725J13263
22860A69005q2526j68405k55057O3762J41601j256M0833j1993j89734J75658J38997
$$ y = [-212781, -257642, -194722, -290103, -222322, -140007, -141079, -112215, 44578, -86287, -22168, 15980, 5707, 97832, 301556, 259278, 132134, 115745, 150033, 97791, 99564, 241579, 296258, 168405, 170086, 214131, 208012, 89738, 59049, -2542, -42296, -1058, -85529, -114426, 6733, -57175, 89563, 176222, 176454, 287257, 167122, 18673, -57435, -36776, 95508, -30979, -78632, -9381, -104234, -203020, 58064, 116205, -22943, -17289, 38295, 28726, 142832, 199689, 28519, 78267, 119918, -51784, -25405, 56670, 315234, 407998, 346167, 449646, 483860, 328225, 131359, 130830, 38744, -63409, -178983, 55742, 169005, 86479, -81926, -336983, -273221, -131620, -132876, -92043, -104036, -293770, -118112, 20885]
22849B0885k9256Q854m9415m1430R1059P5692j7472j15316m6179J00644o152R0428
22837H2342r3133j08682P3404m1713k3145p8710o9457K32779R0447l6169r9875
22826g1912J05720M6198j5694j5179q9744L5976o933r9684l0949Q2038M1762o7802
22814h6203p9597J22754Q4734O5605P1411l9701j21358J5788j01225k1576K3803
22803f5565j70317O2874N5034q8046J64261J69515J55367j65866k39440k02296
22793c24479Q1728J74780L3971j63060P785O7672J25574K3423N9613j28128j25890
22782a67011r6798P1954J36667m2780Q0220Q6266m2006p1527l8691N0052J18221
22771H4567K0671j82013k5052m0059O3062k2174m4683J2611n3095j0294N3583
$$ y = [20885, -8371, 483, -48932, -90362, 697, 76389, 58917, -56399, -102578, -1934, -8086, 82342, -10791, -119473, -46069, -87782, -110927, -189637, -259094, -26315, 64132, 27963, -71912, 33808, 80006, 64312, 49133, -40611, -4635, -11568, -111252, -142201, -60163, -18401, -86203, -165800, -43046, 41688, 107293, 178704, 139003, 17645, 33433, -67792, -89368, -65565, -235882, -173008, -117974, -206020, -41759, 127756, 283123, 117257, -122183, -324479, -242751, -67971, -34000, -197060, -189275, -121603, 3971, 27394, 87007, -41121, -167011, -263809, -191855, -55188, -97968, -17748, 68518, 26512, -45015, -83706, -33654, 84567, 105238, -76775, -101827, -141886, -78824, -100998, -145681, -133070, -186165, -196459, -142876]
22760a42876N0859J27274j9754n7080l2147J04582L6497r1038p0609k1575R9975
22749a5892M7163r4830R3458n8K6406K4733l0840j7579P6619K21656K27918o0948
22737D97806k67997k54593o4100J43739o851j11914J1504r5597J07O0340J886
22726h5670N2363M9574K6437N3400R8912M1042o1912j25120j5453J0359j29140
22715h5208O9428J1231j9518J06110o694j56135n2072K3710M1501j42843j7209
22704b27699N7035J92008N7409j20644l9896J0618n4713j6921Q6347R1636J72437
22693B07617Q3839j86511j56910j19089M7071R6900l0637l5593R3168r5859o3570
22682a59574N9509K05075N6324J4564j05882J28876l2932k82178j59266J40346
$$ y = [-142876, -92017, 35257, 15503, -41577, -73724, 30858, 67355, -23683, -94292, -115867, -15892, 31271, -63559, 29899, 29841, 56247, 80980, 50140, 32561, 109180, 330836, 558754, 497806, 229809, -24784, -88884, 54855, 48004, -63910, -52406, -148003, -147896, -87556, -85670, -33307, 16267, 42704, 96104, 195016, 236058, 174146, 49026, 33573, 43932, -85208, -15780, -4549, -24067, 82043, 75349, -80786, -132858, -109148, -67647, -210490, -227699, -170664, 21344, 78753, -41891, -81787, -71169, -125882, -142803, -56456, 35180, 207617, 291456, 104945, -51965, -171054, -123983, -27083, -57720, -93313, -145, -96004, -159574, -100065, 105010, 161334, 175898, 70016, 198892, 165960, -116218, -275484, -135138]
22672a35138m0858K9138O5706J16646Q2082p6681j09685J03260N0433r1669M0758
22661C3992J8491k6169K2573r1927k02673j04037P8799J64881J15552Q2919J57336
22650B49737r1001j37116j4913K35280O605r0396N6625q9243r6926j05027K8402
22639d7973P1301J0639J5324j5097K2644O8246K1417K0302j78039j55300O5394
22628a01142J35172R6155r8328N8016m3031j15202j46790j8949J99279M9235n4166
22617c9751j53047r2655J68973L1049j54258N1045J73412J74814K4413N1835j46711
22606H9119k39295p6159O5490J53746l3503p2500j36401J8578M7650O1961J15640
22595e674o6986N0278O4982j13523J00673K95110r3364p7790p8622l2797q6410
$$ y = [-135138, -175996, -146858, -81152, 35494, 117576, 40895, -68790, 34470, 84903, -6766, 33992, 52483, 26314, 48887, -43040, -245713, -349750, -270951, -106070, 9482, 92401, 249737, 158736, 21620, 6707, 241987, 248592, 158196, 214821, 125578, 28652, -76375, -47973, 23328, 33967, 49291, 34194, 56838, 125084, 146501, 166803, -11236, -166536, -101142, 34030, 130185, 31857, 89873, 46842, -68360, -215150, -234099, -34820, 14415, -39751, -192798, -285453, -116480, -85431, -239689, -188644, -15232, 159582, 183995, 235830, 89119, -150176, -226335, -160845, -7099, -40602, -113102, -249503, -230925, -183275, -121314, -5674, -72660, -22382, 42600, -70923, 29750, 324860, 231496, 153706, 75084, 42287, -44123]
22584d4123J18365K2803l5093n2785q7116k9482O5570j22098j64445l1337Q8687
22573b71054J5394N1633P9808m3242J02581K58757K2509j89442p2306j35507J7917
22562a62952O2176p5824q2050K2523J08214Q3233M9059k8562K5820K6782J27494
22551A55913m9627K8267m8380j34676K1070p2757q2093j07533J57015J49366o6187
22540d9622j24106l9627j08305N8699R3892O3634k9642P3126n7692n794J39472
22529A4035M142p6938l4438P2318K8102m1775k6769n1741O0149p5498Q6164P768
22517c4481k3922M770J53407R7514K0715O698p2028l3903O3863J1676j29321m9629
22505A5359J45127R1877j80295j8336N1832J0617q4632j99680L3465n1347r1771
$$ y = [-44123, 74242, 97045, 61952, 9167, -77949, -107431, -41861, -163959, -328404, -359741, -271054, -255660, -204027, -124219, -167461, -64880, 193877, 216386, 26944, -45362, -180869, -162952, -100776, -176600, -258650, -236127, -127913, -44680, 4379, -24183, 1637, 28419, 155913, 106286, 134553, 86173, -48503, -27433, -100190, -182283, -289816, -132801, 16565, -49622, -173728, -213355, -321660, -262961, -169069, -105435, -135077, -61951, -119643, -125437, 14035, 18177, -58761, -93199, -20881, 7221, -34554, -61323, -113064, -52915, -128413, -42249, -34481, -58403, -53633, 99774, 197288, 218003, 224701, 152673, 118770, 182633, 194309, 64988, 15359, 160486, 252363, 72068, 53732, 105564, 116181, 31549, -168131, -134666, -186013, -277784]
22494b77784J2417J01805N4050j14245O4070J1301J9701j3755P4491m0212L357
22483a04804R6628l2580M7770j8620j25892l7150m2993q8399j49233L0839J49367
22472b75067L1101J17775K20284q043o540l8997m1291n4492J8015j6448j03248
22461a56951q62J80376J98421j3948L4154K02918k9741j94556l05420k36183M4281
22450b77511J70419R3981o2389j4611K1465k7603r557K18993L5787R306J11815
22439B70095M4332o9448k6594q9103j95128l2510Q3949P3386J08485k28564j35869
22428a96969J91315R584p370j44999j03252R5316P2197J532N6478m3091l7931
22417a07190J54473J37010r4761j00628o4992j5249O3340J97819n8824p9185R158
$$ y = [-277784, -265367, -163562, -109512, -223757, -159687, -148386, -128685, -142440, -67949, -108161, -104804, -8176, -40756, 7014, -11606, -137498, -174648, -217641, -306040, -455273, -424434, -275067, -243966, -126191, 94093, 86050, 79510, 40513, -778, -55270, -37255, -53703, -156951, -157813, 22563, 220984, 207036, 241190, 444108, 414367, 219811, -85609, -321792, -277511, -107092, -13111, -75500, -90111, -68646, -96249, -105806, 113187, 148974, 158280, 270095, 314427, 244979, 218385, 129282, -65846, -98356, -14407, 58979, 167464, -61100, -196969, -5654, 3930, -3440, -148439, -251691, -156375, -84178, -82646, -26168, -69259, -107190, 47283, 184293, 89532, -11096, -76088, -91337, -27997, 169822, 110998, 31813, 40971]
22406D0971l5357M9487J65861m3219j1546k54481j09729o087J04139l7655j21608
22395b59224j65693o5694J54928J10552M5199n742J23165J11905o4790M7662k9792
22384B476M9243J29520q4890P4379j14350j72577j59776p8419J11378q060P8540
22373a72536L8305j70435j30559J7802K43416J64703o4744J20150k4152j99929
22363a77979j36821K4460j20935K44429K18003M4252j84919m35624n5396K03476
22353c77054J78526R189l8508J92671p3075j01225p773o5222J7076J33489M5285
22342h6621R3244j96399r0830N3789J37418N2421J21545J5922p0628j6067J829
22331A5623j48344O126n9112j30334R6412J12807L9171R3527N8136O567J576L4980
$$ y = [40971, 5614, 55101, 220962, 177743, 166197, -88284, -198013, -204100, -99961, -137616, -259224, -424917, -490611, -335683, -225131, -179932, -185674, -62509, 49396, -15394, 32268, 2476, 51719, 181239, 96349, 170728, 56378, -116199, -275975, -354394, -243016, -251076, -172536, -134231, -304666, -435225, -417423, -174007, -9304, -74048, 46102, 21950, -177979, -314800, -290340, -411275, -166846, 51157, 95409, -89510, -525134, -580530, -377054, -198528, -189339, -227847, -35176, -108251, -209476, -217249, -282471, -265395, -131906, -86621, 6623, -189776, -280606, -226817, -89399, -36978, 84567, 100489, 29861, 13794, 15623, -132721, -126595, -185707, -316041, -219629, -106822, -67651, 25876, 84012, 90579, 92155, 127135]
22319A27135O6865j30060j78794L466N043p9388j19791p0750J82902K7831O0344
22308a05197J62452J5731j5596j78287J37578J23316k8620k9841o2838r4495J51737
22297G5940M0388k60183k3874K6448Q2398N0650j00756n1580K2005J48294p9311
22286f9581J0442o8564m5332o0348J8565p7172P9652J03239J31384J6497o6277
22275b7495n4947L9926j0119L6273m2475j97633J21354K08809j37990K7562R0075
22264E3340J7530l137M884J3959m681R2756o4085l1450k8277M2937n7966p6678
22252d0868p5050j21905n8330J8349m379J19621O2725J6701J21098R7045N7732
22241A92739o4192n390l5456k56626j52433o262Q2947N4545L2606R5464j339K4167
$$ y = [127135, 194000, 63940, -114854, -111388, -106345, -185733, -305524, -376274, -193372, -165541, -105197, 57255, 72986, 57390, -120897, 16681, 139997, 111377, 81536, 18698, -75797, 75940, 116328, -143855, -167729, -141281, -58883, -8233, -108989, -160569, -138564, 9730, -69581, -59139, -127703, -173035, -233383, -214818, -291990, -212338, -109099, 22285, 38782, -27495, -82442, -42516, -52635, -16362, -58837, -256470, -135116, 73693, -64297, -36735, 53340, 70870, 67733, 72617, 86576, 81895, 174651, 110566, 79116, 50839, 93776, 35810, -40868, -115918, -237823, -296153, -277804, -282183, -162562, -99837, -83136, 37962, 135007, 192739, 128547, 123157, 87701, -168925, -321358, -327620, -244673, -190128, -157522, -62058, -63397, -39230]
22229c9230q4633k39510q6518R4293P7787k806q0502K6866L5024O383J02119J41374
22217d9353J64689p4599n9791l0402n563J04111O5242m5046o4627k4203q2908
22206a02450N8306l9753j31443o3937Q2412L1251l6283l0776J58061j41912m6999
22195b63523M9909J10445k0748O0119J6725j00678j6249L5027L373q9609M1867
22184a73342J35482J30948Q8332k02913n7312K8547n8099Q0766R4036k15030L6835
22173a11750Q9424j5823m269m8047j02463M1800Q5298M6665j9370M2109m2938
22162c9364K5327J49949j54930j32952R6367M0896L4856L3178j30626j31458J44001
22151f4756N3841p674j33016J5241J18903K41354j3352R7704Q5641j05740l3421
$$ y = [-39230, -123863, -363373, -449891, -355598, -277811, -280617, -361119, -334253, -299229, -292846, -190727, -49353, 115336, 40737, -19054, -49456, -55019, 49092, 114334, 69288, 4661, -19542, -102450, -44144, -83897, -215340, -279277, -196865, -165614, -201897, -232673, -74612, -216524, -263523, -213614, -103169, -123917, -63798, -47073, -147751, -164000, -128973, -125600, -215209, -173342, -37860, 93088, 181420, -21493, -78805, -50258, -108357, -27591, 66445, -148585, -111750, -22326, -38149, -42418, -90465, -192928, -151128, -65830, -19165, -38535, 3574, -39364, -14037, 135912, -19018, -151970, -55603, -14707, 20149, 53327, -77299, -208757, -64756, -10915, -18589, -151605, -136364, -17461, 223893, 210541, 308245, 393886, 288146, 254725]
22140B54725j03630P5435l2760q4142j3941j96958j57500K6796J79016J25011
22130G2052j34491J08422k5022n2542j07892j07233M7385J27075J08254N4150
22120I0158J02329N6412m6052j64184q2663J22259p8878m6838n0885r1429p4211
22109b63982J8684K5609J13507O6469M5386j70301j18050L5719j4131N1901K28730
22098A9541q1024P9845J25499n8003j4957j33372k9022J40889J55756R8357p5456
22087B28053j94056o1889k5754P8754o0840P1166N0590k0260M633R5590R0235
22076B56222j17024j87785k7741L5110J66195Q463o11J08203j5345p1183r0505
22065F3999k8254k0264k47422R9302k8512j0282q6338l6821Q9970J93202Q3024
$$ y = [254725, 151095, 226530, 193770, 109628, 95687, -101271, -258771, -231975, -52959, 72052, -62439, 45983, 20961, -31581, -139473, -246706, -199321, -72246, 36008, 90158, 192487, 248899, 202847, 38663, -44000, 78259, -619, -47457, -98342, -189771, -263982, -245298, -219689, -106182, -39713, 5673, -164628, -282678, -246959, -261090, -209189, 19541, -61483, 18362, 143861, 85858, 70901, -62471, -91493, 49396, 205152, 303509, 228053, 33997, -27892, -53646, 25108, -35732, 35434, 86024, 65764, 70397, 165987, 256222, 139198, -48587, -76328, -41218, 124977, 133440, 132829, 241032, 225687, 154504, 63999, 35745, 15481, -231941, -132639, -161151, -171433, -257771, -294592, -204622, -11420, 71604]
22054G1604o7996m1399j44426K07510J63294j19307l7036l3080j09973o5451n0150
22043b26410j35718K2327N0692L7999J16422J93878m5385p5351n422n1675l0358
22032a49001J34188J54837J7092n1487j34779o6146O8862N1670O6996P8822j50401
22021B0653k57494J45634O6873j39681N8427J95581P8416j03225l2645J11510
22011A44049j44556k22977J44496N5103J1984m4113R7999j25444k2662O9471m8025
22000h4675m7529k5252Q655N5046r360r0250O9245K8236M0946j23875m8496J25693
21988a01616P7422l9236j37996J50917O2901J13085q2947m3527O9743J2444j54538
21977g3348j00031P3284K27909R3551P6868j2496q6011Q8114j2893o668q5167
$$ y = [71604, 3608, -37791, -182217, 25293, 188587, 69280, 32244, -836, -110809, -176260, -226410, -362128, -339801, -289109, -251110, -134688, 59190, 13805, -61546, -66968, -118643, -149001, -14813, 140024, 157116, 105629, -29150, -95296, -26434, 25236, 92232, 171054, 20653, -236841, -91207, -24334, -164015, -105588, 89993, 168409, 65184, 32539, 144049, -507, -223484, -78988, -23885, -11901, -56014, 41985, -83459, -106121, -36650, -84675, -132204, -157456, -148801, -93755, -103115, -193365, -124120, -95884, -54938, -178813, -227309, -101616, -24194, -63430, -201426, -50509, 12392, 125477, 42530, -997, 68746, 81190, -73348, -173379, -100095, 127814, 221365, 298233, 285737, 199726, 287840, 274947, 268279, 183112]
21966A83112M2144J84664k0351k05293p262K1781r0595k06303j41310J43762M7413
21955d8238P5489K3298j52528P5514K45942l7043j54085j19867O9222m351J33239
21944A06592J6934k484l3854P7358J8273P3911P278k13249j12981n8847J31919
21933A0850R5553J9330k42172p165M9649Q342j4236J35170k510k43671j65202
21922c56062l116k2870J50781M5628J76705o8053J0576l6952j31362l1422J61929
21911a04218Q6201k23306q798P6503j62258Q7479K65766J53368j06256j40121
21901g5640o5948J24357j6680j49551K28811K15159q1701j38052J7666k3891j6828
21890A7702j01751k7372Q505j84582N6754M7678O2144o8328O2790j05345k18675
$$ y = [183112, 225256, 409920, 389569, 184276, 177014, 198795, 108200, -98103, -239413, -95651, -48238, 27251, 50549, -101979, -26465, 219477, 182434, 28349, -91518, -22296, -26647, 106592, 123526, 121042, 87188, 164546, 182819, 256730, 264008, 50759, -62222, -121069, 10850, 106403, 125733, -116439, -123604, -73955, -65613, -79849, 55321, 52811, -190860, -356062, -359178, -382048, -231267, -185639, -8934, -76987, -66411, -103363, -234725, -266147, -104218, -18017, -241323, -250121, -173618, -335876, -248397, 17369, 170737, 64481, -75640, -141588, -17231, -33911, -183462, 45349, 260508, 178807, 40755, 58421, 34530, 17702, -84049, -111421, -102916, -287498, -230744, -183066, -120922, -189250, -126460, -231805, -450480]
21879d50480J82519J21589P5013K3268K21379J24667j02454q5381j07753j11375
21869a09008O4220J11413R7224n5391n2275j8960Q6705m0941O4230n7196j10974
21858b0953p0637J24162K6890j39413k5087j5149p4470J31793J11676m5034N0556
21847E4334P669j7303o0901K0929j7080P0278k0527N2738M7308j55208j994J09633
21835H9876j27312j42477j05071m6163P6068J37050O3786q1541J9672q033q1630
21824b05775J11301j21824o1922O5840p2111q7843N8475J00173K06055O3157j78673
21813a23147o4773J3611J16983P2813o1619j81603m9432K5235J09589n4686K8283
21802a68746j4888J57538j211J31034J28967j61142k17801K6571j65091o6940
$$ y = [-450480, -267961, -146372, -71359, -48091, 173288, 297955, 195501, 110120, 2367, -109008, -44788, 66625, 163849, 108458, 56183, 37223, 123928, 82987, 147217, 90021, -20953, -91590, 32572, 59462, -79951, -105038, -120187, -194657, -62864, 48812, 3778, 54334, 62003, 44700, -16201, 4728, -12352, 57926, 37399, 90137, 137445, -17763, -19757, 89876, -37436, -179913, -284984, -331147, -255079, -118029, -54243, -135784, -116112, -124145, -205775, -94474, -216298, -278220, -212380, -284491, -372334, -313859, -213686, -7631, 55526, -123147, -187920, -174309, -57326, 15487, -46132, -227735, -277167, -251932, -142343, -197029, -168746, -183634, -26096, -27307, 103727, 232694, 71552, -146249, -119678, -284769, -351709]
21792c51709P4420J04775J8071M9879N1691O4028J23031J0432m6062n622o1239
21781C1695J38387J9344J7363N0379J5968l2097r494P378R577m4772M602Q2611
21769B90941N3493L08p4701j22500k2215j15085M8839J47065l5034j70668j11354
21758a10911M6273K68373k2192j21914m0298J36237j1114j83298j67723N7237
21748a49330J57430J76250k37080o5302R8641J24993l4016m3397n1844k36674
21738b60329L5179J31114J87953k9793j14545k5000K757Q2774O579j577j89428
21727a74316m177P0750R1290m5099J42781K8019N4414j6026p6856j3897Q0422
21716A37305p450q5107k01501j06333J44255k6269p1361L9679J06421K00498J30377
$$ y = [-351709, -277289, -172514, -154443, -104564, -52873, 11155, 134186, 144618, 98556, 92934, 31695, 170082, 189426, 206789, 257168, 273136, 241039, 231545, 238923, 248500, 203728, 208330, 290941, 344434, 344742, 270041, 147541, 125326, 10241, 59080, 206145, 171111, 443, -110911, -64638, 203735, 181543, 59629, 19331, 155568, 144454, -38844, -206567, -149330, 8100, 184350, -52730, -118032, -19391, 105602, 71586, 28189, -23655, -260329, -225150, -94036, 93917, 64124, -50421, -75421, -72664, 10110, 16689, 15112, -174316, -178493, -107743, -16453, -61552, 81229, 109248, 163662, 147636, 70780, 56883, 137305, 129855, 44748, -156753, -263086, -118831, -145100, -216461, -176782, -70361, 130137, 260514]
21705B60514n9705j79176j36454j35149O1918K3461K38846K3845l1071l1672l5882
21694e25J39343J08425j7279K3598j15685n5628j15232m210J9164N5651R0877
21683A28499j10785j44656l6048o6001J37116O5521K419q11o3263p0146N1346
21672a06809l5655o7026J52017Q6289N5457J8226q2315k9672P6365j03315q6911
21661a23349O6387m9517j30009M8621j4122J20q8102p4317N3017J22355K06429
21650A7513P3041M3790k34943j41646J21311J48475L4340L881j09910j8169N865
21639e6452p6945q9650P6348J73434N4093o1009o9910J00217l4161O232M5396
21628F7593k14074j18384J58533M288J33546J48937O2256r5422K1604K6123k9023
$$ y = [260514, 200809, 21633, -114821, -249970, -188052, -164591, 74255, 98100, 67029, 35357, -525, 138818, 247243, 229964, 253562, 137877, 82249, -32983, -37193, -18029, 37622, 128499, 17714, -126942, -162990, -228991, -91875, -26354, -23935, -24746, -88009, -158155, -106809, -142464, -209490, -57473, 28816, 84273, 102499, 20184, -9488, 66877, -36438, -123349, -56962, -106479, -236488, -187867, -201989, -201869, -289971, -364288, -311271, -188916, 17513, 90554, 134344, -100599, -242245, -120934, 27541, 61881, 65762, -44148, -62317, -56452, -133397, -223047, -146699, 26735, 80828, 19819, -50091, 50126, 15965, 22197, 67593, -146481, -264865, -106332, -102044, 31502, 180439, 242695, 147273, 168877, 195000, 165977]
21617A65977k27873j74518Q6310J54503J36474J5206l7450k03089r0927O2053
21607a13334K11917J67252R9996j15564j29199L4629l371j75473k23332P9614
21597a66865J57075K9453p0995p5399M5424K8587j22143j17050q9886J19215N9108
21586b03476Q6119r7184r4393J05733L5559J96202J12241j07205o9373M5589P2531
21575H2343j58108J2477J82842r2394j15133k4742m9118r0569J86996J7598M0505
21564g303n9378J21543r820j03723j03717J66841J7061n2569J13457J48051Q5085
21553C15528r6657o9790N8511o1947j69281J1479N2464Q5079J25675N768n8389
21542A98440q5606j76557j17706k7966K76303O4315M2544q1255m3333p0563j35225
$$ y = [165977, -61896, -236414, -150104, 4399, 140873, 156079, 118629, -84460, -175387, -113334, 98583, 265835, 365831, 250267, 121068, 155697, 152326, -23147, -246479, -166865, -9790, 19663, -51332, -126731, -81307, -52720, -174863, -291913, -381799, -262584, -203476, -117357, -214541, -308934, -203201, -167642, 28560, 140801, 33596, -35777, 9812, 82343, -75765, -63288, 119554, 27160, -87973, -112715, -161833, -252402, -65406, -47808, -7303, -66681, 54862, 45042, -58681, -162398, 4443, 21504, -31065, 82392, 230443, 315528, 218871, 149081, 207592, 145645, -23636, -12157, 40307, 125386, 251061, 256829, 198440, 112834, -63723, -181429, -209395, 66908, 131223, 173767, 92512, 49179, -21384, -156609]
21531a56609k53261r0276P1420J28451J59236J03026J43890P6622k9788l9358
21521A13353o6452n7526P7109K8676j31855M5420n6468J03266J94466k9290k49146
21510b8447Q7268K18854J01053j43463m1988L1724q7428o6538p8961L1008J22672
21499A45754L6719j24370j81715k49816q1605N092J70566Q398K7071J60974J40354
21488E7422R2753k5691N0623j43942o4565j3440K1146N2465K6391R5080o5864
21477H2378o3833j87807k7887K20781J58250m2749R2878K2269Q6383m6547k94538
21466d22j02756r1643l0793J03885l2826k9066M4664j89820J27830J56701P838
21455c6408P417j03204j34135K72497Q4004j4033l16468j22591K11899K00597
$$ y = [-156609, -409870, -500146, -428726, -300275, -141039, -38013, 105877, 182499, 152711, 113353, 46901, -10625, 66484, 95160, -36695, 8725, -47743, 55523, 249989, 220699, -28447, 58821, 277675, 378728, 235265, 193277, 225001, 137573, 71035, -7926, 23082, 145754, 182473, 58103, -123612, -373428, -455033, -449941, -279375, -270977, -243906, -82932, 57422, 150175, 124484, 175107, 31165, -33400, -46840, -25694, 26771, 53162, 148242, 82378, 18545, -169262, -197149, 23632, 181882, 139133, 232011, 254280, 340663, 294116, -422, -103178, -194821, -225614, -121729, -154555, -183621, -138957, -328777, -200947, -44246, -36408, -28991, -132195, -266330, 6167, 90171, 76138, -240330, -362921, -151022, 49575]
21445D9575J5212L1938q9832j39358L2490J7833P0296l8248P1249N9061r0386
21434a0170j3741O8789J113k12123n9627L3016k7912J17505P5769n7674K5469
21423e9586j6780j03000k3077j668L3373Q7523O2733n5610N0668k1926o7435J7351
21411i7434j9621J39404N3460J28446k4739j02734k2813P819k07476j23732M5920
21400b23500o2202N3987J49639K62088Q8620j5400j78662j83710L498K49605N5378
21389A99341j10391j34341J34664J1100j5280r0750j18106O9721J37059n1587
21379C1430j19510L400j01189m9532J39523J28082j07744o8211M6687J67685J07188
21368A77809j20542k43780O1102J53236M7760p6874m7981o5254j99923j0259J19388
$$ y = [49575, 64787, 96725, 6893, -132465, -99975, -82142, -11846, -50094, 21155, 80216, -10170, -23911, 44878, 45991, -166132, -225759, -192743, -220655, -103150, -27381, -85055, -59586, -76366, -179366, -202443, -204111, -170738, -83215, -20482, -76092, -25424, -47350, -114785, -97434, -117055, 22349, 75809, 204255, 179516, 76782, 53969, 61788, -145688, -269420, -223500, -285702, -231715, -82076, 180012, 268632, 253232, 74570, -109140, -105642, 143963, 199341, 88950, -45391, 89273, 100373, 85093, -5657, -123763, -54042, 83017, 31430, -88080, -84680, -185869, -235401, -95878, 32204, -75540, -143751, -97064, 70621, 177809, 57267, -186513, -125411, 27825, 75585, -1289, -49270, -114524, -314447, -324706, -205318]
21357b05318M1233j06145K985J15189J26276J5873j66363n1115n4918R3509J37549
21346e1245q0124k4664M58Q426P7089j4332n4477J3762O825J40220P1115k2660
21334G0393m0612k17277Q4648P6623J44318M3807m8557j05449j76997P2150J24856
21323B7903j35082j7331Q5304o0485L4630k672q5015L3986j74308m1899J41922
21312a93047N4438P5940q6347k0058j2402p1577n7809J97176K42795j13967l1773
21301a6631K3103J43988k181q0976j36361k53495J2117Q2389J17796p2551J83959
21290A157O2689j9507N5575L858M231k3594K8425m9324O0233R4205o3031k25067
21278g0150M2119O4984j7324O4566J11059j18037O9023l5059j64857M726M6825
$$ y = [-205318, -164085, -270230, -267245, -152056, -25780, -9907, -176270, -227385, -282303, -188794, -51245, -131369, -156033, -155575, -147149, -70060, -84392, -138869, -125107, -118282, 21938, 93053, 70393, 29781, -187496, -102848, -26225, 118093, 161900, 113343, 7894, -169103, -96953, 27903, -107179, -124510, -39206, -99691, -65061, -67733, -152748, -118762, -293070, -334969, -193047, -138609, -62669, -149016, -169074, -181476, -253053, -310862, -113686, 129109, 15142, -16631, 6472, 150460, 148279, 67303, -69058, -322553, -310436, -228047, -110251, -182802, 1157, 63846, 44339, 99914, 103772, 108003, 84409, 112834, 63510, 123743, 217948, 154917, -70150, -28031, 36953, 19629, 84195, 195254, 77217, 146240, 111181, -53676, -48950, -2125]
21267b125j87964r6213J21005l2565O713k3746J04587K0604L9293p1185j11378
21256b32974q9725J69545j1553J41010q868J27063j6462N0220J11342M5263N636
21245B90497j36398k2647o8703j60538n6856n0018l4011J04828J13280n3924j86526
21234b61016J57188J99317J2638j0516Q6158r574j28249n3543K6705P5701L2187
21223A26996M571j59787J54513K6425j07372L52N1849p1074j03016J2868K94774
21212B31099P0572l7876l5346J0645l9713j04493m5193K0037l4250j10948r0465
21201a65931l19K11400p32j54207n586O1073p0353j30903O3565J33372N0134K6447
21189A7960k45354p7373P3909M6910j20976L1912K5751N1358p4556k0690m7687
$$ y = [-2125, -190089, -286302, -165297, -197862, -191149, -214895, -110308, -89704, -50411, -121596, -232974, -322699, -153154, -164707, -23697, -32565, 94498, 78036, 128256, 239598, 284861, 290497, 154099, 131452, 62749, -97789, -154645, -204663, -238674, -133846, -20566, -74490, -261016, -103828, 95489, 108127, 97611, 183769, 174195, 45946, -7597, 19108, 94809, 126996, 131567, -28220, 126293, 152718, 45346, 45698, 97547, 26473, -76543, -63675, 231099, 301671, 263795, 228449, 239094, 199381, 94888, 49695, 69732, 35482, -75466, -165931, -166250, 45150, 44418, -109789, -115375, -54302, -124655, -255558, -191993, -58621, -8487, 17960, -227394, -304767, -230858, -183948, -304924, -273012, -247261, -195903, -270459, -291149, -338836]
21178c38836j75214J61586J58890K18640R4446l6014r6618K5774R419J54326J33617
21167C10016o6463k02142l527J7876j19189o6742o7381O748l8080J6300O569P2993
21155a33022J66900k3658o9274j7250m9651r6688P012J44320n0738p3752J90569
21144e232J62164J6026k81864O675j16576q1069O4890j2895l4159Q3186J63027
21133c5827M758J45734k8050j52847O5004k319n7722j8926J9436Q0300L82024
21122D01565J14102q8757j38766k01512j91967L0404O8378J15929Q3415J44719
21112C37510N9540j39805k07369j62602K70228N5025m5392j5399j17885j41810
21102a07959J3973j57725r2613l1392l3747q2392L8736L15509K24752J0377j6545
$$ y = [-338836, -514050, -352464, -193574, 25066, 119512, 83498, -13120, 12654, 22073, 176399, 310016, 243553, 41411, 37884, 55760, -63429, -130171, -197552, -190804, -228884, -212584, -206015, -133022, 33878, 10220, -59054, -76304, -125955, -222643, -215631, -71311, -122049, -195801, -5232, 156932, 172958, -108906, -102231, -218807, -299876, -234986, -247881, -282040, -198854, -35827, -31069, 114665, 86615, -66232, -1228, -3547, -61269, -80195, -60759, 19541, 401565, 515667, 426910, 288144, 86632, -105335, -74931, -6553, 109376, 192791, 337510, 397050, 257245, 49876, -112726, 157502, 212527, 167135, 151736, 33851, -107959, -93986, -251711, -344324, -375716, -409463, -491855, -453119, -137610, 87142, 97519, 80974]
21091H0974n8830j3994n2564J40735N7366l8113k823M809P4756j19793j52011
21080g9488K604J3748q580m7752m2671M2975J97436K60716P5334J6824p1582j11019
21068B48545j80767j16870j37562J82118J84469L5375R5854j42786j23719m9282
21058d625o4248r9860j32204j7084J52873O4981J24028M0307r5256j02641j18153
21047b51882m7614J2574P9620K33326O3319j31034O9127J17091J0213p4225j6214
21036F4301m9238J28603j23144o8728J27953L6258j13703r4069N8490n0501O573
21025g7205L1316R158K2875r4634l701M0806P0668m3317r2859n6437J6904k6158
21013b02584N2144K11580L1364p3813J03361J892r7444p5862k47124n6124J01546
$$ y = [80974, 22144, 8150, -44414, 96321, 153687, 115574, 112751, 117560, 192316, 72523, -79488, -76884, -63136, -71716, -119468, -162139, -119164, 78272, 338988, 414322, 431146, 359564, 248545, 67778, -49092, -186654, -4536, 179933, 215308, 311162, 168376, 44657, -4625, -68873, -168733, -300937, -318021, -165148, -100167, 23861, 64168, -31088, -133729, -251882, -299496, -286922, -207302, 26024, 89343, -41691, 27436, 144527, 154740, 80515, 64301, 15063, 143666, 20522, -48206, 79747, 116005, 2302, -91767, -33277, -83778, -77205, -45889, -36731, -13856, -108490, -112191, -71385, -717, -44034, -136893, -193330, -176426, -202584, -150440, 61140, 92504, 18691, 122052, 123944, 26500, -49362, -296486, -352610, -251064]
21002b51064J01032P0432o2363k07138J06461O9557j28284o4695n0637j7434J73427
20991b60706K12322j8155P8893J34634o0071N0431K8734j27691n9421Q3098q2482
20980b0414N7965Q2874j12468N8042p2292k03939q7452R6571J41249Q094j39273
20969a91043j07463O8016J66783O2724n9886q4844j38713q8604n778o3386M5266
20958c96928J87945P4222j00021N2918J71427P033o1395j8916Q6438Q4564r4761
20947g474j24675K5513J790k2882q0614l3808J12794K8956R0718k550l1625p7629
20935a21486J3889n5554J22850q3771j25725L4293P2779p1070j549J8275J08130
20924h8939J39170j85459j79226k6443M4460j5112j9748P5465J29528Q2128K25842
$$ y = [-251064, -150032, -79600, -141963, -349101, -242640, -173083, -301367, -366062, -416699, -434133, -260706, -48384, -66539, 12354, 146988, 86917, 137348, 166082, 38391, -21030, 62068, -20414, 37551, 120425, 7957, 65999, -6293, -210232, -297684, -201113, -59864, -51770, -191043, -298506, -230490, -63707, -983, -60869, -145713, -284426, -373030, -378808, -442194, -396928, -208983, -134761, -234782, -181864, -10437, -3404, -64799, -83715, 2723, 87287, -7474, -132149, -106636, -104846, -127728, -208342, -242150, -129356, -100400, -9682, -12232, -43857, -121486, -107597, -163151, -40301, -124072, -249797, -215504, -142725, -213795, -215344, -197069, -88939, 50231, -135228, -314454, -340897, -296437, -311549, -331297, -255832, -126304, -44176, 181666]
20913A81666o42j14329Q5212j592l8027r879k4882N1824J3503q4169k1790k3223
20901A3672O2264p5164l1317m3476J13492j37051M0673K54992p9840j53169R4516
20890E9592K00721K5951j44560j03474j7228r4291j58587r1934L8394Q4839k8165
20879b28742j76676j25297J30499J48291M845n628K4457m577k4899Q0986K18875
20868D2134l9155J3557m8792j1578L6286N8215r2557j30453Q9327P3183k5692
20857c5525O3539p3584L9715J6525j15925m1236j11163J32294K41173R4879j05278
20846A05414m8675K8970j21672M0763P0359j52682j30302K8207m6263M0051J8046
20835a67784o6361M8521m0565R3730M8495P6099L3326q3788Q5616K3402p7126
$$ y = [181666, 181024, 66695, 151907, 150315, 112288, 102409, 77527, 129351, 142854, 58685, 36895, 13672, 75936, 772, -30545, -74021, 39471, -97580, -56907, 198085, 118245, -34924, 59592, 260313, 286264, 141704, 38230, 21002, -73289, -231876, -323810, -285416, -200577, -228742, -405418, -530715, -400216, -251925, -247080, -252708, -228251, -232828, -257727, -176741, 42134, 2979, 16536, -32256, -43834, -7548, 50667, -41890, -172343, -83016, -9833, -35525, 28014, -45570, -5855, 10670, -105255, -146491, -257654, -125360, 115813, 210692, 105414, 56739, 85709, -35963, 4800, 75159, -77523, -207825, -179618, -225881, -185830, -167784, -234145, -185624, -226189, -132459, -83964, -7865, 25461, -58327, 27289, 50691, -26435]
20824b6435r405j24690q675Q4551J17193K3684n3959J11591l6875k93256j05412
20813c21688l5421L4041K59525J85182k1042j96837M8520q6770J04032J52348
20803A21890Q8473q6508j89651J10771J41826j09952j11508j1659o1925J77888
20793F9645Q2552q8585M033J34759j52829j23893J19625P4674j9105j740p1247
20782B7889j2988R2721m0682p0304Q4283P9169j74593q6160K20551j31201q6706
20771i8021P4835m459J07181M7846l6828J00865Q9263m7268p3654j33508J28636
20760A54888r8333j39611P4689p891r5775j1198L5207n0941p5306J15118p277
20749a06430k4760o6592R4072P4160L8169q3468j36633N4369l5743N6402J43235
$$ y = [-26435, -35840, -160530, -169205, -84654, 32539, 56223, 2264, 113855, 76980, -216276, -321688, -357109, -323068, -63543, 121639, 100597, -96240, -47720, -134490, -30458, 121890, 210363, 123855, -65796, 44975, 186801, 76849, -34659, -46318, -108243, 69645, 152197, 63612, 67645, 202404, 49575, -74318, 45307, 119981, 100876, 99136, 27889, 14901, 107622, 66940, -3364, 80919, 160088, -14505, -100665, 119886, -11315, -98021, -23186, -27645, 79536, 127382, 90554, 191419, 280682, 233414, 159760, 26252, 154888, 56555, -83056, -8367, -16258, -112033, -123231, -88024, -138965, -214271, -99153, -106430, -131190, -197782, -103710, -29550, 8619, -74849, -211482, -157113, -192856, -136454, 6781]
20738F781L6635j3656n523l0760j2137k2726J15566R9433q4677k02753P0366r228
20726e2679P0286r7543M7225O1077j5977j02354q7491K25123J22278r6138o0660
20715A3147Q2952O1540R8332n6874P5388M1547k92843K890j9217k19420J6079
20704a96479J04133P2593k6818o8757o8734J026j0004J13952l3006P4063J19821
20693H1790K4683j45961n7749Q7610j8457J29720J50004j29665M6100P3641k19958
20682B1758j42549J26508J44332j28451k24226J2153J35932O9531q4723j9960
20672h9695J78799m9120l1119j89309o2799K34982n7318l4916J00023J05284J9414
20661A24226n2690q755R0883J58844j96879m0428j69387j63165J7637M5931P3139
$$ y = [6781, 43416, 29760, 24237, -6523, -18660, -41386, 74180, 173613, 88936, -113817, -43451, -52679, 17607, -79936, -32711, 28366, 12389, -89965, -177456, 47667, 169945, 73807, 13147, 96099, 157639, 255971, 199097, 274485, 316032, 23189, 26079, 6862, -212558, -196479, -92346, -19753, -46571, -115328, -184062, -183036, -193040, -79088, -112094, -38031, 81790, 106473, -39488, -97237, -9627, -28084, 101636, 251640, 121975, 168075, 241716, 21758, -120791, 5717, 150049, 21598, -202628, -190475, -54543, 14988, -69735, -89695, 89104, 39984, 8865, -180444, -243243, -8261, -65579, -100495, -472, 104812, 124226, 71536, 62781, 153664, 312508, 115629, 75201, -94186, -257351, -239714, -193783, -120644]
20650a20644J66694M9727r9000n9737l1728p06l0827l5028J9998J44517N7299
20639F0565J39634J5570m6808j45994O9648j1324o7402n945o416K1793N4728Q3873
20627A61922j25415k9728j8676R8941k07107K6383K1449j8525R3355R3575o5504
20616C0670J68023j68701j00048k286K2838J632P6804k9045l5347J33974M3402
20605A41916j82780j98187j60766J67883J55289Q7694M4890J24458k09987J6765
20595a2825R6771r4140J02726N5929J14403j64988o3425P3005O8656j02841j14457
20584d1186j9257j9065j34021J30590P1386k4000j8050N5001j9231P8226k3384
20573C7009p0309m5506J84703M7140L7068l0911j87941L2350k0925N2372L7705
$$ y = [-120644, 46050, 95777, -3223, -62960, -94688, -95394, -126221, -161249, -141251, 3266, 60565, 200199, 215769, 168961, 22967, 92615, 81291, 13889, 7944, 1528, 23321, 78049, 161922, 36507, 6779, -11897, 87044, -120063, -93680, -72231, -90756, 2599, 96174, 30670, 198693, 29992, -70056, -72342, -49504, -47872, 28932, -113, -35460, 98514, 141916, -40864, -239051, -399817, -231934, -76645, 11049, 55939, 180397, -29590, -12825, 83946, -10194, 92532, 148461, 262864, 97876, 34451, 107456, 176112, 73271, -41186, -60443, -79508, -213529, -82939, -11553, -35553, -53603, 1398, -17833, 60393, 37009, -33300, -78806, 105897, 153037, 190105, 159194, -28747, 3603, -17322, 35050, 72755]
20562G2755r8026j07000J3836j01p2344p5754P8275J46522K17200M6403r1341
20551A30425j56487k6700J2060j02409p4190R1146J55884J63641K7848j00846
20541A20372j6988j99925L112p9457j51770j06148k0894J64305J28420Q5532R0740
20530A7299J780J60338Q7003j35834j52637m3542m316J0373J15695J14007L9302
20519B09468M0116j63652q8686l3825l1759Q3046O6426k7402n2504o8595j82748
20508b50115k7455J35950n7998r6012j4868J04031K6563J12236J13356o0336q6726
20497a01374j10920K5169P2660j07363K0233J07498K850j24739n359O3061J3169
20486a45115J8893J21073O7332j10851l9821J2745K0761p154M0432q792l9309
$$ y = [72755, -25271, -132271, -118435, -118536, -190880, -266634, -188359, -41837, 175363, 221766, 130425, -26062, -52762, -40702, -143111, -217301, -126155, 29729, 193370, 221218, 120372, 103384, -96541, -93429, -172886, -324656, -430804, -451698, -287393, -158973, -73441, 17299, 19079, 179417, 266420, 130586, -22051, -65593, -69909, -59536, 56159, 170166, 209468, 249584, 85932, -2754, -36579, -68338, 14708, 81134, 53732, 1228, -67367, -250115, -277570, -141620, -199618, -295630, -310498, -206467, -179904, -67668, 45688, -14648, -101374, -212294, -187125, -114465, -221828, -201595, -94097, -91247, -215986, -221345, -158284, -145115, -126222, -5149, 62183, -48668, -88489, -75744, -54983, -62137, -21705, -30497, -69806]
20475f9806l6067J10048O8508J8278r334m5551k4879j49636n6337J71836K8730
20464E790j41407J5730j08017p658J10777K17061j3458p7714J3962Q011n7875
20453c4798j47879l6925K85680Q9445k3511p4365k20344n6093J17738J04349q0034
20442g6737P8766P7018J5591J6277m6361n6428r030O1309m0288L5570r4046n091
20430d3450K3853p7306n3951J36437O2698J47322q4892j92332j21991o1977j0022
20419b75611J10505J36462K57717O1906p3259j8122L2401l6880j31803j77503
20409a14187p8655J02379q4031P212n9223J17495Q6074j36809P5512J26043o3850
20398b2040o7981Q5940q8474m6104J65475N3326m9023J05718j14204j93619l7224
$$ y = [-69806, -105873, 4175, 72683, 90961, 81627, 36076, 11197, -138439, -194776, -22940, 5790, -135617, -119887, -227904, -235562, -124785, 92276, 78818, 1104, 15066, 23077, -34798, -182677, -219602, 66078, 155523, 132012, 57647, -162697, -218790, -101052, 3297, -76737, 2029, 79047, 94638, 110915, 64554, 8126, -904, 60405, 20117, 55687, -38359, -43450, -19597, -96903, -150854, -14417, 48281, 195603, 110711, -81621, -203612, -265589, -275611, -165106, -28644, 229073, 290979, 217720, 199598, 231999, 195119, 63316, -114187, -192842, -90463, -174494, -167282, -226505, -109010, -22936, -159745, -84233, 41810, -22040, -90021, -4081, -92555, -138659, 26816, 80142, 31119, 136837, 22633, -170986, -208210]
20387b08210N8556j19523K4942J09154K2071j113J1580J19328K5996M5513l7314
20376E0980n2269o5285J7211N9216L1017j03400k29715Q410Q2458P9738p8076
20365a99715J61605Q3960J1344m657j5934q0220P9879m4224L9232L0371r0175
20354b8534m5629M0335P5312J1035q4349r4998l4395R4750l2086r8495K6503J5063
20342a55488J62045J22610J3445J9101N9820l2749l9045j41394k54914P0888k9292
20331b04973O7585J47147j07150O647J45054n6875r2925Q860j98196L6118M2646
20320b06062J13954L2045P1015M1610L5444Q0526r4789m2667K7973R2762N6037
20309B07848M5085j38838j90166O5767j6290K8697N6365o8134o8055L6713l7445
$$ y = [-208210, -149654, -269177, -244235, -135081, -113010, -114123, -102543, 16785, 42781, 88294, 50980, -1289, -66574, -49363, 9853, 40870, -62530, -292245, -283835, -201377, -121639, -199715, -38110, 45850, 57194, 52537, 36603, -43617, 36262, -7962, 31270, 61641, -28534, -74163, -33828, 41484, 52519, -31830, -126828, -161223, -66473, -98559, -197054, -170551, -155488, 6557, 129167, 142612, 161713, 221533, 188784, 149739, 8345, -246569, -175681, -204973, -137388, 9759, -97391, -90744, 54310, -2565, -95490, -86630, -284826, -248708, -206062, -92108, -60063, 10952, 52562, 88006, 168532, 73743, 31076, 59049, 151811, 207848, 252933, 114095, -76071, -10304, -26594, 2103, 58468, -9666, -77721, -41008, -78453]
20298g8453k6593K3034r4762Q138K4859j17791o3168J37192L7253J48128Q5638
20287H3475J8341m3677O5776k2791k6205j07570m7835L5649J54224J198J0376
20276A20961J06350j04651j42990J9196j28958k5196l7643J2323K981k3521J17729
20265h3419k5055k2858K6773K7148n8842R376K6742p5444o1428J63987m879j03378
20253a81277m3926n8249L427J24755J7478R5731P4125J20292O7310l6996k8677
20242A53993K2119j2173o0254J07199M1472j04564j7821l4970j16755j2404p0408
20231a04566K876N07J8788R2275K66267j2827q2754O9911o9840j08592n1814Q833
20219B9064O7121j25389n9746j0762O3023Q9387l7280j65983r546j58539Q536
$$ y = [-78453, -105046, -82012, -176774, -168636, -143777, -261568, -324736, -187544, -150291, -2163, 83475, 101816, 58139, 123915, 101124, 74919, -32651, -80486, -44837, 109387, 110585, 120961, 227311, 122660, -20330, -1134, -130092, -155288, -192931, -180608, -177627, -201148, -83419, -108474, -131332, -104559, -77411, -136253, -126877, -100135, -175579, -237007, -73020, -77899, -181277, -225203, -283452, -280025, -155270, -137792, -42061, 32064, 152356, 219666, 182670, 153993, 176112, 163939, 103685, 210884, 252356, 147792, 129971, 95001, -21754, -34158, -104566, -101690, -101183, -82395, 9880, 276147, 263320, 180566, 250477, 180637, 72045, 20231, 29064, 96185, -29204, -88950, -99712, -36689, 52698, 15418, -150565, -160111, -318650, -310114]
20208c10114J39810J72626J55344J6517q0436J87668J0715j67080j18103K21946
20198B28893J06666k96862m3509j58356L8180P91q0283R817l9336K54653J47374
20187A68028m7051j37788j92587o677J13299j05819Q114P4726M1157j35643L3696
20176a86545K0627q2216O666P4375R3679O7035l789J53339q079p2333m4559L6461
20164E4661r0935l523J11891K1120j3150j24520j0792J2010j47882J9687J79689
20153H256J3070k7227r6846q9743K4139N7078j2664J39276K11677K0205r0351
20142A56870o739k68169p6180J86891O1846r6390j12914N9819Q4859J8553P1151
20131G9597p1037J10063K849j18156n6925K2831m1993J0155R2196o3948o0047
$$ y = [-310114, -170304, 2322, 157666, 174183, 93747, 281415, 292130, 125050, 6947, 228893, 335559, 38697, -4812, -163168, -124988, -124197, -204480, -194663, -233999, 20654, 168028, 120977, -16811, -209398, -216075, -102776, -208595, -200481, -125755, -84598, -220241, -186545, -165918, -248134, -241468, -167093, -73414, -6379, -10168, 143171, 135092, 62759, 18200, 54661, -36274, -39797, 72094, 93214, 80064, -44456, -55248, -43238, -191120, -171433, 8256, 21326, -5901, -102747, -192490, -168351, -111273, -123937, 15339, 227016, 247221, 156870, 150131, -118038, -194218, -7327, 54519, -41871, -154785, -94966, -10107, 8446, 79597, 8560, 118623, 121472, 3316, -53609, -30778, -72771, -62616, 29580, -34368, -94415]
20120i4415j0451J34422J28678N5724r1733l4556n6447l0734o742L7459O5441
20109I6646q885p958J47861Q6729j32136l9024P6531J5344N3643r606k08154r6685
20097b5694m2880O5962m5456k4531j03256n2282J42344P3809K10175j3099k36943
20086e1851k0878q8582J42959M2877R613R8869j3281j17746N9677l5227K9582
20075E6012J24577q8135m8142j41207J35830j3513k00552Q0375K82748q7946l00046
20064a99999m9905J42782K03730l1665k37969m9794L20796J56052p4623j3805
20054A65600L6489p3186j25369j55543j69205Q2347K27519k5352q9636J86186
20044E9850J30821p429j52407J06707K02638L7968j72658M347q7368P649K682
$$ y = [-94415, -104866, 29556, 158234, 213958, 122225, 87669, 31222, 488, -6254, 31205, 96646, 87761, 79803, 227664, 314393, 182257, 143233, 219764, 235108, 288751, 279145, 70991, -25694, -68574, -2612, -48068, -72599, -175855, -228137, -85793, -11984, 198191, 185092, -51851, -72729, -161311, -18352, 24525, 34138, 133007, 119726, 1980, 61657, 26430, 56012, 180589, 92454, 44312, -96895, 38935, 25422, -175130, -94755, 187993, 100047, -199999, -249904, -107122, 96608, 64943, -173026, -222820, 97976, 254028, 179405, 165600, 202089, 128903, 3534, -152009, -321214, -238867, -11348, -36700, -126336, 59850, 190671, 183242, 30835, 137542, 340180, 378148, 205490, 209837, 122469, 130118, 132800]
20033A32800l7314L5242Q1969l8233k18825m9508J94132r0173p9841l1861M1950
20022e9662Q6908n2828m9189l8101k6872J00636j4645j53504J64253Q1974K6829
20011F5799Q5676q0312j42865j56949r997Q7699n853N2961M7699J33052Q4728
20000A61638k1571r6042J5190P3359m9449p3483k6428K2410P2919r9017j41793
19989a62267N6153r202j28032K15234K12723j85939j41714K993o0619p8483j07174
19978c86327P7008K2265J64236n664J71929R0466j72599j12471q345K12063J18778
19967A71339j61215j55699J1726J83397Q6231j3280n8114R727r9248j68536j96440
19956c90112K17281J93866n0673N489Q7687l5425r1408Q5018j23654J32898J52810
$$ y = [132800, 95486, 130728, 212697, 174464, -44361, -93869, 100263, 10090, -69751, -101612, -59662, 27246, -25582, -74771, -112872, -139744, -39108, -53753, -207257, -43004, 38970, 65799, 151475, 71163, -71702, -228651, -238648, -150949, -156802, -103841, -56142, 76910, 161638, 140067, 44025, 59215, 132574, 83125, 9642, -16786, 5624, 78543, -20474, -162267, -106114, -115316, -243348, -28114, 184609, -1330, -143044, -140051, -200670, -279153, -386327, -309319, -287054, -122818, -128482, 43447, 133913, -38686, -151157, -159502, 52561, 171339, 10124, -145575, -133849, 49548, 135779, 122499, 64385, 74112, -25136, -193672, -390112, -172831, 21035, -29638, -24149, 63538, 28113, -63295, 21723, -101931, 30967, 183777]
19945A83777o5637K4367M9463q3807r6980N054j70724n5019J35492J53904Q9367
19934A69257n9418j37786p8915j7477J53401N9554r8674l2286p4041j00341N2103
19923a64623J16351l1732l719j1583j26798P7475L5602Q0442J48062J45453J48350
19912D13280o470j55952k98056j92309J44443J66723Q6150K1252r9207j32653
19902e2799M4467K35192J7580j90793m3415o5896k31113R53R7805P1263R3659
19891b3097J1535j33598l8089Q7993q4977l149J76149R5192j49629m3713J53734
19880D8351K58909J4677j14132J15048K5937K5178P167k16850J26216m1828j7013
19869B31660k2633N5248K24094K26770l25244j70908k3600P964L8762l8882M960
$$ y = [183777, 118140, 142507, 191970, 108163, 11183, 16237, -154487, -209506, -74014, 79890, 169257, 109839, -27947, -106862, -124339, 29062, 88616, -10058, -42344, -116385, -216726, -164623, -48272, -80004, -83723, -95306, -222104, -144629, -109027, -28585, 119477, 264930, 413280, 406810, 250858, -47198, -239507, -95064, 71659, 157809, 179061, 79854, -52799, -8332, 226860, 244440, 53647, 10232, -55664, -286777, -285824, -188019, -116756, -23097, -11562, -145160, -183249, -95256, -180233, -183382, -7233, 87959, -61670, -105383, 48351, 307260, 321937, 207805, 322853, 348790, 373968, 381135, 164285, 290501, 248673, 231660, 209027, 264275, 488369, 715139, 389895, 218987, 195387, 203351, 242113, 203231, 208191]
19858B08191j01090k04J33365j45403n871N0087R0356J04119j35196j99111j48013
19847a48770r6184j3601M9502J33085K04277n7191K0650Q8940l6111k08161p8920
19836a42484K17776J33581o6428o0193o5548J7227P6767j09226R099N8242m9154
19825A9659k3248K0216N26l5561k1522K3656n8068J30796P9709j35399N6402L2105
19813H9271k2136l2160j6259R044r7459J01006k2800j03245K7031J03007M2640
19802G7940k0132l8615m2975k0333n4089p3448J10462q1365o6362l8950l2049
19791b79916J18115J06014K24319J13093L3174O8406j5637q3654R0694k263P403
19780C79748l6547j87952j13714J6557j36059P4657j17243k0181l531N8404J42610
$$ y = [208191, 107101, 106897, 240262, 94859, 88988, 139075, 229431, 333550, 198354, -757, -148770, -244954, -258555, -209053, -75968, 128309, 71118, 91768, 180708, 144597, -63564, -142484, 75292, 208873, 142445, 82252, 16704, 33931, 110698, 1472, 10571, 68813, 19659, -3589, 16627, 17153, -18408, -39930, -16274, -74342, 56454, 136163, 764, 57166, 89271, 67135, 34975, 18716, 27760, -69699, 31307, 8507, -94738, -67707, 35300, 77940, 57808, 19193, -23782, -44115, -98204, -171652, -61190, -142555, -208917, -247867, -279916, -161801, -55787, 168532, 281625, 314799, 383205, 367568, 283914, 374608, 372345, 379748, 343201, 155249, 41535, 58092, -77967, -3310, -120553, -140734, -144265, -85861, 56749]
19769E6749j65673m2073J05836M0969j6502M5709N0121J74p1237J56580l8744
19758A21909j85960R9562K9924j85823p4643K2579J84588o0307k27602J48351
19748a27422L00916p9831p9244L1112P430P1807o4897L2990m3762o181l9372J78174
19736A81720K55218L27405K06122J57868R6779Q8367j10518k42346k27824r7626
19726F35165k08268j63204N3401J20686Q4579N3078J44995Q9691O3281m2917j18732
19715G11755L0504k5554j04606j25558P3744m221j78219r1347j34118j25115J4507
19704D1772J31073J00995j45309j69666P116p6262J23908J12345J44864J19339
19694C90175j18871l7155j00357J16979l7455J1545J3308r4906n5386l495L2603
$$ y = [56749, -108924, -150997, -45161, -4192, -20694, 25015, 75136, 75310, 4073, 160653, 121909, -64051, 35511, 65435, -120388, -195031, -172452, 12136, -48171, -275773, -127422, 173494, 93663, 14419, 45531, 52961, 124768, 59871, 92861, 49099, 42918, 3546, 181720, 436938, 764343, 970465, 1128333, 1225112, 1313479, 1202961, 960615, 732791, 635165, 426897, 263693, 317094, 437780, 522359, 575437, 720432, 810123, 873404, 830487, 711755, 742259, 716705, 612099, 486541, 560285, 556064, 377845, 286498, 152380, 27265, 41772, 172845, 273840, 128531, -41135, -34019, -110281, 13627, 125972, 270836, 390175, 271304, 234149, 133792, 250771, 213316, 224861, 238169, 143263, 87877, 84382, 116985]
19683A16985O2457J8813N3868J79826K56742L67343K17712q079o1055l6511n5972
19672A112129j58378q589J48104m8980L1534J23475Q4964j96298j44317l0882
19662I12762j65684j88145M54N647j50786k28617J40375J38184N4962J21210L72021
19651A012383L48184J55917j71863k85466l94171k19152M657o40j0874J33131
19641E72106j76173j32580J97449O1745j66604j1315J48346R7697J81514J53938
19631I26123L85522J83054K12568j67694l64176m78704n05222j19502J36328o0202
19621A48095j52098o0359j19624j09631J24337J2147L6822J38067K17878o1936
19611A73698k24989j85065m0065J24585J98942l3707j57695j50391j2542K11943
$$ y = [116985, 179442, 198255, 252123, 431949, 688691, 1056034, 1273746, 1265667, 1204612, 1168101, 1112129, 953751, 945162, 1093266, 1044286, 1075820, 1199295, 1284259, 1087961, 943644, 912762, 747078, 558933, 559387, 565034, 414248, 185631, 326006, 464190, 519152, 640362, 1012383, 1360567, 1516484, 1344621, 1059155, 664984, 445832, 450489, 449849, 438975, 572106, 395933, 263353, 460802, 522547, 355943, 344628, 492974, 590671, 772185, 926123, 1311645, 1494699, 1707267, 1539573, 1175397, 696693, 191471, 71969, 208297, 148095, -4003, -64362, -183986, -293617, -169280, -157133, -120311, 17756, 235634, 173698, -51291, -236356, -276421, -151836, 47106, 13399, -144296, -294687, -307229, -95286]
19601i5286J76530J8702m9121j67712n0581J1719m3654j0852K9065O8445L05680
19590A92935J02016q3078j04806n0766j63167m379J06704Q9918J09977r6466J74221
19579B73109l217j19324r782o8127L1439J34309R5703m7964k4717K30532m0969
19568D50992j22678j74623n5978p3394j90746n5020P4179J4537J52868J50782
19558A70919j1874j0569l69264r9911K88757j7407m8988j02336J98211J60109
19548A57647q7832j98929j63268r7219K92079J14034j69025j55137M2701K20928
19538d4021K11436r5417J04727J31994p0062q1958P957O1675o372o0985Q4748
19527B43722P3614q077m8212J7461j3632j13034l00222n4783J37677J61391l1489
$$ y = [-95286, 81244, 99946, 50825, -116887, -167468, -155749, -199403, -210255, -181190, -112745, 192935, 294951, 211873, 107067, 56301, -106866, -111245, -4541, 85377, 195354, 98888, 273109, 269892, 150568, 140786, 72659, 104098, 238407, 334110, 286146, 261429, 491961, 450992, 328314, 153691, 97713, 24319, -166427, -221447, -147268, -132731, 20137, 170919, 159045, 148476, -220788, -320699, -31942, -49349, -98337, -200673, -2462, 157647, 69815, -129114, -292382, -389601, -97522, 16512, -152513, -307650, -264949, -44021, 167415, 71998, 176725, 308719, 238657, 156699, 164656, 226331, 219959, 158974, 243722, 317336, 309259, 261047, 278508, 264876, 151842, -148380, -203163, -65486, 95905, 64416]
19516F4416J16779J82446N2311j03814L4066L70598r617k13051k23134j25016
19506A45984k2776l147j51362M8943m9771J2738m3340N0170Q9967j62758k8495
19495a13847R4169L9206l9276P6933P8008J2749j25050j04773j3532L12909K40384
19484D57880K9262m9627j11624j80237j06684Q3362J88664N029j50381n8339J69643
19473B76948Q7397r1839q025k5115J32726p6207q0431j00585q5273J29305j49961
19462H940j74952N8594M0502j7748J17433Q2895Q0386J45594P9823l718j86603
19451B31146j86386j40959P3570J3680k5004J39477n4840R1947p1782j22414M0515
19440a1050J37008k2261k9986J41805j20313k0949J85299J01759J755j15831j45434
$$ y = [64416, 181195, 363641, 415952, 312138, 346204, 716802, 707185, 494134, 271000, 145984, 123208, 120061, -31301, 17642, -32129, -19391, -62731, -12561, 77406, -85352, -113847, -19678, 19528, -19748, 57185, 135193, 147942, 22892, -81881, -95413, 217496, 457880, 487142, 437515, 325891, 145654, 38970, 122332, 310996, 316025, 165644, 107305, 276948, 364345, 272506, 264481, 239366, 372092, 295885, 215454, 114869, 29596, 158901, 8940, -166012, -107418, -66916, -84664, 32769, 115664, 196050, 341644, 421467, 417749, 231146, 44760, -96199, -22629, -8949, -33953, 105524, 50684, 142631, 70849, -51565, -11050, 125958, 103697, 73711, 215516, 95203, 74254, 259553, 361312, 363067, 247236, 101802]
19429A01802r5027j5116P468J75407l8114L2095J70675q1625q3934m4141k6481
19418A03009M0851k0812k5460L3553q405k6064Q2491J79127N1001p6270j72972
19407A60049K0175O3032n9932N958k2684q7955j40281j04702J34987J53873J33587
19396B56107k6976p0798l0616n1167R7744j35658m9441O1505j4618N4243Q2868
19385A73193j53987R2541L0499o0659R2371m4525J484q9385o4450n3327Q2217
19374E972o1800L4637J12175J85690N0392j69881K0003l3868M6863J17905K01641
19363E09729J49255K687k48817n5625k9739O4742J10246o2729N878m2833J69139
19352E71933J96124j18546J80322K11457k4539k46832l9472j20234m1308Q3111
$$ y = [101802, 6775, -8341, -873, 174534, 136420, 168515, 339190, 257565, 173631, 129490, 103009, 143860, 123048, 97588, 131141, 122736, 96672, 179163, 358290, 409291, 333021, 160049, 180224, 243256, 183324, 189282, 166598, 78643, -61638, -166340, -31353, 122520, 256107, 229131, 158333, 127717, 76550, 174294, 38636, -10805, 50700, 36082, 90325, 173193, 19206, 111747, 142246, 81587, 173958, 129433, 130917, 41532, -22918, -76245, 5972, -55828, -21191, 90984, 276674, 327066, 157185, 177188, 143320, 190183, 308088, 509729, 658984, 661671, 412854, 357229, 327490, 392232, 502478, 439749, 445627, 402794, 571933, 768057, 649511, 829833, 1041290, 1016751, 769919, 730447, 610213, 568905, 652016]
19342F52016j55168j42562j0022J5382n2992l3776J20851L7951j0746Q2859q6574
19331D17219j42900J1308R5600n1975r1199j59907L6558j32350Q2510Q9104J16453
19320B70421L2592L8330p2692j0992k4979J2448J91212L17612J46210l9697j29219
19309G31246j61187j21641k8525Q9323j16651j60668P2643J98218J1932k5832
19299D88858K82462J21542j53836j55691J064m1117L448r750j11408J60049P8281
19288F63902J6100j5332j83916K5616n3142m6336l5762J77297n9Q136J6366J7487
19276E90357J34471J436p0915J50093N3425J58339M541j0728l2995J00414P1457
19265A149895N1113L6536k9882J07250J96881K68376K92829R8409J37869K2331
$$ y = [652016, 496848, 354286, 344264, 359646, 306654, 272878, 393729, 431680, 420934, 503793, 417219, 274319, 285627, 381227, 329252, 238053, 78146, 114704, -17646, 64864, 153968, 270421, 303013, 341343, 268651, 257659, 232680, 245128, 436340, 753952, 900162, 860465, 731246, 570059, 448418, 419893, 509216, 392565, 231897, 304540, 502758, 514690, 488858, 771320, 892862, 739026, 583335, 584399, 543282, 546730, 536980, 425572, 585621, 663902, 680002, 664670, 480754, 506370, 453228, 406892, 371130, 548427, 548368, 556504, 572870, 590357, 724828, 726264, 655349, 805442, 858867, 1017206, 1021747, 1011019, 978024, 1078438, 1149895, 1201008, 1237544, 1207662, 1314912, 1511793, 1780169, 2072998, 2171407, 2309276, 2331607]
19255B331607j81530J05601J90549J03760J01673J96407L39593N41939N89412
19246D319011P06750P06797N58197L05665M90432M53623O72566J111783J878946
19237A1203770L081612M654955O655512P507015O788115M632293j17199l092581
19229D1313492k956501n19464M229114J1303197K1751461L6871653N3839281N9905362
19221B25737595N4922699L4985271l802172k4115529l4926247m3579795m3664651
19214A65557171l6253966k7342276j4330864n60315Q377112R908270N801117n168206
19206A05988043j5498568j8817527j8089423j3781831q737374n348111l106564
19199B2608645j830028j303098r91627m81897j81613j55006j72935k17323j68184
$$ y = [2331607, 2150077, 2255678, 2446227, 2549987, 2651660, 2848067, 3187660, 3729599, 4319011, 5025761, 5732558, 6290755, 6596420, 7086852, 7540475, 8213041, 9324824, 11203770, 14285382, 18940337, 25595849, 33102864, 39890979, 44523272, 44406073, 41313492, 38356991, 37837527, 42066641, 53369838, 75121299, 111992952, 165832233, 225737595, 280660294, 315645565, 311843393, 287727864, 252801617, 209221822, 165557171, 129303205, 101960929, 87630065, 87069750, 95446862, 105355132, 111156249, 105988043, 90489475, 71671948, 53582525, 39800694, 31063320, 25715209, 22608645, 20778617, 19475519, 18483892, 18001995, 17820382, 17665376, 17492441, 17275118, 17106934]
19190A7106934k01013J58038O62539J145882K453472M183723O998307J1308908
19182D3816790J6476876J9877591J8631566J2879550K99362r740573j1558029
19175I0683133o851590M084298J8862223L4514193M5507519N3799987N6053068
19168B96652831M2984141K4068355m51008m4668093o7288688o7400537n8258252
19161A25638749l8282216k0986008j0278040l012959J471107K803498J840544
19154E9194675k345514p632859r241386r111172p216487m768661k826798j657979
19146A4393819j090609o83114o50789p31763j055748j075373r28436j021604p95978
19137F360405q08922o72207l69556l89105l56592q0622j24277k58347k43720k37768
$$ y = [17106934, 16905921, 17063959, 17726498, 18872380, 21325852, 25509575, 32507882, 43816790, 60293666, 80171257, 98802823, 111682373, 111981735, 102241162, 90683133, 83831543, 87915841, 106778064, 141292257, 186799776, 240599763, 296652831, 339636972, 363705327, 363254319, 318586226, 251297538, 183897001, 125638749, 87356533, 66370525, 56092485, 53079526, 54550633, 57354131, 59194675, 56849161, 49216302, 39974916, 30863744, 23647257, 18878596, 16051798, 14393819, 13303210, 12620096, 11969307, 11237544, 10181796, 9106423, 8177987, 7156383, 6360405, 5551483, 4879276, 4509720, 4120615, 3764023, 3683401, 3559124, 3300777, 3057057, 2819289]
19127B819289j76367j5025k79639j61139o3352K2617Q5084O8774J16356N8268
19117B474866k2509J9746K24955L42545L08064K06790J85206J28117j320k57628
19107C608832k82193j97698k79206M600P3814n2505j35827R9866k4222K8668L28269
19096C172398L98482L7079K24013M59904M41920M23768L78108J46096k3156m36063
19086E222549m32649k2201Q6982K42129K62403L73121O79948P76942Q52810J051741
19076I093775J349636J646346J654769K164282L146962M683914O745606J0417571
19068D0902861J6890732K7285594M3509703O1707337O6908830K4780285m8134023
19061B33851319p2015051n2582129l1411733j8804845j1845190p408246m525441
$$ y = [2819289, 2642922, 2627897, 2348258, 2187119, 2123767, 2146384, 2231468, 2300242, 2416598, 2474866, 2452357, 2472103, 2697058, 3039603, 3347667, 3554457, 3739663, 3867780, 3866460, 3608832, 3326639, 3128941, 2849735, 2854335, 2928149, 2875644, 2739817, 2839683, 2815461, 2844129, 3172398, 3570880, 3607959, 3831972, 4291876, 4733796, 5157564, 5535672, 5681768, 5658612, 5222549, 4789900, 4767699, 4854681, 5096810, 5359213, 5732334, 6412282, 7189224, 8042034, 9093775, 10443411, 12089757, 13744526, 15908808, 19055770, 23739684, 30485290, 40902861, 57793593, 85079187, 128588890, 190296227, 257205057, 281985342, 233851319, 161836268, 109254139, 77842406, 59037561, 47192371, 39784125, 35258684]
19054C5258684k529882j252677N2913J380356L283998O302179J1136091J8926961
19046G2558623L1712285M9605773O7611954O4074692N312955o4859077p4303348
19039A51713857n0472532l0060839j8151755j1954204q027315n774742m294894
19032B2977576l294769k941809k406466j649546j488338j611755j294657r25896
19024G364340n87032l41990k44147j87967q489r5825J64008j07207l67570l49140
19014E238981l28387j58150j05415k86631m82928l08203q3385k05098l02427k61694
19004B716663k63532k07779o8295K08583J46586Q9745J23232L18542K33916j19103
18994C178558k35128j12399J65970j673l89989m01921l16413l68257k25833k25455
$$ y = [35258684, 32728802, 31476125, 31529038, 32909394, 36193392, 42495571, 53631662, 72558623, 104270908, 153876681, 221488635, 285563327, 290876282, 226017205, 151713857, 101241325, 71180486, 53028731, 41074527, 33047212, 27272470, 22977576, 19682807, 16740998, 14334532, 12684986, 11196648, 9584893, 8290236, 7364340, 6777308, 6435318, 6191171, 6003204, 5994715, 5898890, 6062898, 5955691, 5588121, 5238981, 4910594, 4752444, 4647029, 4360398, 3877470, 3569267, 3485882, 3280784, 2978357, 2716663, 2453131, 2245352, 2177057, 2385640, 2532226, 2621971, 2745203, 3063745, 3297661, 3178558, 2943430, 2831031, 2997001, 2995328, 2605339, 2203418, 1887005, 1518748, 1292915, 1067460]
18984A067460o4736l5942N5800O4099j09989j34647J11470M5208M4429m01073
18974F42079k45237J23572J35205k857r5769J56626R0824j10355j6038j27459
18964E50591j8802P1543J1860m6092o5710k4228J42892Q527l8767l9573N5068
18953F07309J68130j0562j90401k4537j10314J6773K5830N1109J3253L0867N4295
18942F31752J8819K4115j46840k50670k10749J19364J83913J47951o7812q8677
18932C61166O7274l5766L4312J68280J67494o5096j16228L9031j5346L8497R1077
18921G34695J30802J94387K16406j1386q8899K7381L90703k7939j27451j07823
18911A330876j27294j23330O3725n6529J09872J3436j63384N2404k4993j30333
$$ y = [1067460, 1002724, 966782, 1022582, 1086681, 976692, 842045, 953515, 998723, 1043152, 642079, 396842, 520414, 655619, 652762, 556993, 713619, 804443, 694088, 678050, 550591, 531789, 603332, 615192, 569100, 503390, 479162, 622054, 630581, 591814, 552241, 607309, 775439, 764877, 574476, 549939, 439625, 456398, 482228, 533337, 546590, 577457, 631752, 650571, 674686, 527846, 277176, 66427, 185791, 369704, 517655, 449843, 361166, 428440, 392674, 426986, 595266, 762760, 697664, 581436, 620467, 605121, 643618, 734695, 865497, 1059884, 1276290, 1264904, 1176005, 1203386, 1594089, 1566150, 1438699, 1330876, 1203582, 1080252, 1143977, 1087448, 1197320, 1210756, 1047372, 1099776, 1074783, 944450]
18901I44450k99700j9361k4904j44010m7647Q808j6065j3362L7910j12679K2275
18890C35715Q3043j02918j24994J07935K16616M9926q7233n8755j23926K3013
18880C18422l5153N6183O1695J36311k5311n7296r8928k1527J0832R4959j0092
18869D30095j5188j19672O8172K86758J99007K63370J11801j81358o991O9498
18859A105492J51904j06215j02619o5073j38911n6678L0465j37626l04656n8878
18849C17205J83095K05564m8269q4523J8335o2433j09281O52m8031n9839O3079
18838C75554k0089j4956J21467K02933j47120j90322j4941J16371M1848R427J9546
18827D99718K61485K41239K83598N21222J14646m95786m91476j93408r9463j22033
$$ y = [944450, 644750, 625389, 600485, 456475, 408828, 417636, 401571, 388209, 426119, 313440, 335715, 418758, 315840, 190846, 298781, 515397, 565323, 478090, 419335, 295409, 318422, 283269, 339452, 401147, 537458, 512147, 454851, 355923, 334396, 345228, 440187, 430095, 414907, 295235, 363407, 650165, 849172, 1112542, 1224343, 1042985, 1035994, 1105492, 1257396, 1151181, 1048562, 983489, 844578, 787900, 818365, 680739, 376083, 317205, 500300, 705864, 657595, 573072, 591407, 528974, 419693, 420345, 372314, 312475, 375554, 355465, 340509, 461976, 664909, 517789, 327467, 312526, 428897, 470745, 480172, 499718, 761203, 1002442, 1286040, 1807262, 1921908, 1426122, 934646, 741238, 641775, 519742]
18817E19742j41762l5265j41534L65J8901O0035r9125L232J62666p3784J27875
18806D01346M47711M62062M45334J74115o0528l24978m78271l40930j53802j10272
18796D61787j97933o4602M5557j00812j24141j53693Q4778Q6310l0880J85916
18786A92287M307k21217K6087n4790J2849J82499k9496J3481n7336J37836J58473
18775C64980K074j40116j44502L9220J81369L35413M22033O22924P39468l01655
18765B121208p98729m51053k93087j63097j5379M388P492J83780j7263l1052k08817
18754C38391j53511j09605k1484O5943M6368l4598Q8131P090P4487J1319j06836
18743B05695P6971J29993j9463k86290j01484q5151J17221K3245K18924J7542
$$ y = [519742, 377980, 342715, 201181, 201546, 220447, 280482, 181357, 184589, 347255, 273471, 401346, 849057, 1311119, 1756453, 1930568, 1870040, 1545062, 1066791, 725861, 572059, 461787, 263854, 199252, 244809, 143997, 19856, -133837, -49059, 37251, 6371, 192287, 196594, -24623, 1464, -53326, -40477, 142022, 112526, 126007, 68671, 206507, 364980, 367054, 226938, 82436, 121656, 303025, 638438, 1060471, 1683395, 2422863, 2121208, 1322479, 871426, 578339, 415242, 399863, 404251, 411743, 595523, 578260, 547208, 338391, 184880, 75275, 53791, 119734, 166102, 131504, 219635, 226725, 301212, 312531, 205695, 282666, 412659, 393196, 106906, 5422, -79729, 37492, 60737, 279661, 297203]
18733B97203r5969j9110J68736m8799L9177R6184o8485j9308q8708j33242j4537
18722A13142k5003M3795J92161J69616L5956L08575J32228n5478J00605q3762
18712I31835k6048n4456n2497j34546J12687O1039r1161J69699K90110l7003l07013
18701H62646j79935q6078k07468p2092j6011o0292n1681p1737q4156J31337P3906
18690B38439J38372K882r7957j12891R9456K06018l5017j63153j47179p6058p3428
18679b0516j88030j15676K01646J64996J77526K07571J97409m3008J34300J88773
18669I04991J49159O1823J59276Q8116J14940J390J55228M1486o2791k47144k70128
18658A096346j12013j913k6576K8187L0550K42462J77672P8313K08602j61135
$$ y = [297203, 201234, 182124, 350860, 302061, 341238, 437422, 368937, 349629, 260921, 127679, 113142, 88139, 131934, 324095, 493711, 529667, 838242, 970470, 914992, 1015597, 931835, 905787, 851331, 798834, 664288, 776975, 838014, 746853, 916552, 1206662, 1169659, 862646, 682711, 596633, 389165, 317073, 301062, 240770, 189089, 117352, 33196, 164533, 238439, 376811, 379693, 281736, 168845, 268301, 474319, 439302, 276149, 128970, 52912, -20516, -208546, -324222, -122576, 42420, 219946, 427517, 624926, 581918, 716218, 904991, 1054150, 1115973, 1275249, 1363365, 1478305, 1479695, 1634923, 1676409, 1613618, 1366474, 1096346, 984333, 982420, 955844, 984031, 1014581, 1257043, 1434715, 1513028, 1721630, 1560495]
18648A560495l12147l54748j60681j95513k08164J7081p6396n7584R0574l804
18638B99113j41472r6894p7272J78588K86887Q9430j28323j01572j72609j27169
18628H707N0948J66346O472Q843l1668Q8774p0351r0283J41962N0632L7055M6191
18616D13628r8547l9380J26471J85371N9028k1433m804J39448J16261j9379k03277
18605F53387j8446o8521r3557Q0325r5174p2350j81711k0753j0448L3625q9041
18594A17336P39k3615o9793Q7448J13676j52240Q9926J07388o7026j79444m6220
18583b1825q3962m5729L56523J25023k93178M7818J46038K376Q0486J18996j30852
18572C01714O6785j727M6388K20926J9057q324J31035J20179k69613j86690j10202
$$ y = [1560495, 1248348, 893600, 732919, 537406, 329242, 346323, 269927, 212343, 302917, 299113, 157641, 60747, -16525, 162063, 448950, 538380, 410057, 308485, 135876, 8707, 59655, 226001, 232473, 241316, 209648, 298422, 228071, 137788, 279750, 330382, 367437, 413628, 315081, 275701, 402172, 587543, 646571, 625138, 620334, 759782, 876043, 856664, 653387, 634941, 566420, 472863, 553188, 458014, 385664, 203953, 183200, 172752, 206377, 117336, 118075, 94460, 24667, 112115, 225791, 73551, 163477, 270865, 203839, 24395, -21825, -105787, -151516, 205007, 330030, 36852, 84670, 230708, 233084, 313570, 432566, 301714, 368499, 366772, 413160, 634086, 653143, 644819, 775854, 896033, 626420, 439730, 329528]
18561C29528N1264KJ7786J8670j4901K8624l3757N3158R4175L33257j14182k49092
18549E14532j83709j93013j11761j01260J39685J96555J20403j38799L6338J21660
18539D00631L9550L1890M4039K141r5134q1694m3207m0134Q7068J06547J09392
18528E61089k6845P0308r6143j3171P6371r286m654N095p3847P001J39355m9982
18516E85291M1072k1935N2725O9900r1898M582o2580l7841l1122l6925r5075m7965
18504C28229k7398L7743J63346J10375j25259m4231J05371J98018r1619j33588
18494E20987o2106L1999p9811J5886J1231J4054O895P933K1509l145R1340J15355
18482F92127P6265m4904j38258K5773J87613J30382m8134J9429J28807Q9493J66019
$$ y = [329528, 380792, 380794, 398580, 417250, 402349, 430973, 397216, 450374, 544549, 877806, 763624, 514532, 330823, 137810, 26049, -75211, 64474, 261029, 381432, 242633, 278971, 400631, 440181, 472071, 516110, 518251, 423117, 341423, 298216, 258082, 345150, 451697, 561089, 534244, 604552, 508409, 495238, 571609, 562323, 557669, 562764, 488917, 495918, 635273, 585291, 626363, 604428, 657153, 727053, 635155, 639737, 577157, 539316, 508194, 471269, 376194, 328229, 300831, 338574, 501920, 612295, 487036, 442805, 548176, 746194, 654575, 520987, 458881, 490880, 411069, 426955, 438186, 452240, 459135, 467068, 488577, 485432, 576772, 692127, 768392, 723488, 585230, 611003, 798616, 928998, 880864, 900293, 1029100, 1118593, 1284612]
18471A284612M20691L28492J66454j27492m05156k39419j74876M6848P3044l6268
18461A336930n4758O3588J43254J27311M2835p8825P7262K44420J93136L44163
18451B439316L64801L52163L63992L04082J43208N2013j53457L9943L16320M7930
18441D270311M58693N36401M62810N57183K62211K88204P85626J103082J391069
18432A0115590K009625L224067M606240N312400L596281K177813M476964P323464
18424D2842444N430404l80742J353102Q327528J6078789K3613048L2862426L0582870
18416A60709869J5982539K6952280N1351909M5184330j3279607l2047742j387920
18409B53465658K934463l0696638m4685147k6033644j1801793j6204805j8962404
$$ y = [1284612, 1705303, 2033795, 2200249, 2072757, 1667601, 1428182, 1253306, 1300154, 1373198, 1336930, 1282172, 1345760, 1489014, 1616325, 1659160, 1580335, 1657597, 1902017, 2095153, 2439316, 2804117, 3156280, 3520272, 3824354, 3967562, 4019575, 3866118, 3906061, 4222381, 4270311, 4729004, 5265405, 5728215, 6285398, 6547609, 6835813, 7621439, 8724521, 10115590, 12125215, 15349282, 19955522, 25267922, 28864203, 31042016, 35518980, 42842444, 48272848, 47892106, 49245208, 57572736, 73651525, 97264573, 130126999, 160709869, 176692408, 203644688, 254996597, 300180927, 286901320, 254853578, 253465658, 256400121, 225703483, 181018336, 154984692, 143182899, 126978094, 108015690]
18402A08015690r439612J194285J921145j0676873j5180524r161952m820504p976735
18394E3874920j1464427r395063o147156l771284k432221j527903o99670p19345
18386A7717851p56356k39177P1920m810O2225J083706K009712L305219N337614
18377B8587904Q394116J0471183P863852M635126Q007784J3506768J0772887r61935
18369I1277685o98852J0231694J8422233J3798523J1810941K7248019M0160618
18362B12250861J8592399q880401N184458L0423570L066893m8926688m3722633
18355A67988459j7137180j1671475k8115688k8649759j8107220j1045567n723009
18348D7538561j178125K0042m620444o746907m187607k191425l160160m842954
$$ y = [108015690, 98576078, 99770363, 101691508, 91014635, 75834111, 66672159, 61851655, 53874920, 42410493, 33015430, 26868274, 23096990, 20664769, 19136866, 18437196, 17717851, 16961495, 16722318, 16794238, 16789428, 16851653, 17935359, 19945071, 23250290, 28587904, 36982020, 47453203, 55317055, 59952181, 67959965, 81466733, 92239620, 91277685, 90578833, 100810527, 119232760, 133031283, 144842224, 172090243, 212250861, 230843260, 221962859, 227147317, 257570887, 260637780, 211711092, 167988459, 150851279, 139179804, 111064116, 82414357, 64307137, 53261570, 47538561, 46360436, 46380478, 41760034, 35013127, 30825520, 28634095, 25473935, 20630981]
18340B0630981m118654k630122j595666j262511j251841r11638o18928p06057
18332G535564q68205p00883n87348n48766m06031l87854n44747o14893j08311
18323B768526K457j01483R9677j38704k60216p3976j97835j04823P2542L534p2327
18312A997372J2212Q6443o5947l8747q7090J9505o4694l6277O793m4147N6252
18301A841675K38606J42426J3524K8636J83500k26810j04563p7240J13958J13844
18291B267556j70012k72628j37652j36424j08354m4612p3013Q8895J06773k51481
18281A269048L795l1636j76411k375K2153J04564m9232L2293N6137j48417J7301
18270A097220l9800J04620N1698m3709J63867J75593K72644j34031k31205N7187
$$ y = [20630981, 16512327, 13882205, 12286539, 11024028, 9772187, 8860549, 8241621, 7535564, 6667359, 5966476, 5379128, 4830362, 4424331, 4036477, 3491730, 2876837, 2768526, 2770983, 2669500, 2769177, 2630473, 2370257, 2296281, 2098446, 1993623, 2066165, 2069699, 1997372, 2009584, 2096027, 2030080, 1991333, 1904243, 1923748, 1859054, 1822777, 1829570, 1785423, 1841675, 2080281, 2222707, 2236231, 2264867, 2448367, 2221557, 2116994, 2039754, 2153712, 2267556, 2097544, 1824916, 1687264, 1550840, 1442486, 1397874, 1324861, 1413756, 1520529, 1269048, 1272843, 1241207, 1064796, 1062421, 1084574, 1189138, 1139906, 1172199, 1228336, 1079919, 1097220, 1057420, 1162040, 1213738, 1170029, 1333896, 1509489, 1782133, 1648102, 1416897, 1474084]
18260A474084J67174J52839O8131K28290J26150J01649K45494j6019L13276N91223
18250C452291Q65319J290211J111939L05588j44556m20848j41778J71092N86744
18241G076002Q38684J054280J282436J664896K509612L834935N948695R669753
18233C3879293J7342500L2143373N7863878R2878450J12761347L0347403j01778253
18226B75437991j12617747o3932093l2303386j7621415j0589067o916927m542794
18219B6914562k713193j211705P518J209245K726294N611784R854330J8616937
18211F1015772L5807356O2820708R6096142R8623878p890084j13866694r8482507
18204A34124571n2159103k6671975j5191788r599075o718778m725497l346300
$$ y = [1474084, 1641258, 1794097, 1862228, 2090518, 2216668, 2318317, 2563811, 2547792, 2861068, 3452291, 4317610, 5607821, 6719760, 7025348, 6880792, 6459944, 6318166, 6489258, 7076002, 7914686, 8968966, 10251402, 11916298, 14425910, 18260845, 24209540, 33879293, 51221793, 83365166, 141229044, 234107494, 346868841, 377216244, 275437991, 162820244, 98888151, 66584765, 48963350, 38374283, 31457356, 26914562, 24201369, 22989664, 22997182, 24206427, 26932721, 32544505, 42398835, 61015772, 96823128, 159643836, 255739978, 354363856, 346473772, 232607078, 134124571, 81965468, 55293493, 40101705, 30502630, 23783852, 19058355, 15712055]
18197A5712055k391064j802500j350857j017227r35169p88698k88478K63009O52093
18188H053164L55275l8983n61890j108921j502564j033168m70423m06505l76876
18179B909109k56388k13902n8211j07379j77146j63063j88959Q7954N2241j37584
18169A746672j49576k0019j6064Q4575j03801j16822R1327q7456k52779n1856
18159A124201J23061J01976O4364l7922j73249q4352O4466P2696q2183k9661M4745
18148A188142p693Q504K2719J7511K23447N7949j01913j27234j86226N656K88676
18137A389538J79314q631R8659J12339M6814q3842J47511N411J52704J80493L30889
18126B551199O38145O53156N36054L33058O97981R15200J193653J650419K189687
$$ y = [15712055, 13320991, 11518491, 10167634, 9150407, 8215238, 7426540, 7138062, 7401071, 8053164, 8408439, 8369456, 7807566, 6698645, 5196081, 4162913, 3692490, 3285985, 2909109, 2652721, 2438819, 2380608, 2273229, 2096083, 1933020, 1744061, 1832015, 1884256, 1746672, 1597096, 1577077, 1561013, 1645588, 1541787, 1424965, 1516292, 1428836, 1176057, 1124201, 1247262, 1349238, 1413602, 1375680, 1202431, 1118079, 1182545, 1255241, 1173058, 1143397, 1188142, 1180449, 1188953, 1211672, 1229183, 1452630, 1510579, 1408666, 1281432, 1095206, 1100862, 1389538, 1568852, 1560221, 1658880, 1771219, 1818033, 1734191, 1881702, 1887113, 2039817, 2220310, 2551199, 3189344, 3842500, 4378554, 4711612, 5409593, 6324793, 7518446, 9168865, 11358552]
18117A1358552L028083M049157O570981J1343879K0926842M1369412P5640253
18110A74287159J24809245J54774541k5533713j78670079j16151517n1892755
18104H1622881k5785439j5191934r942034p018381m811598l400185k570864j924505
18096A0977941j499129j047258j157723j020335o84712n01797l81849j68082l12701
18087D204355l16334k97144l73823k80263k59276k71080j40946o4453p2877j34442
18077A993717j30260j29740j23678j49166q109j49785m2794j61961j66338k722
18067I29164m0527R9887r185P2036l7823m5511m6219n9475j97261R6874J30815
18056H92775L6302N892j84673m3609P7988R093j46213R4432K16144q333k14026
$$ y = [11358552, 14386635, 18435792, 25006773, 36350652, 57277494, 98646906, 174287159, 299096404, 453870945, 428337232, 249667153, 133515636, 81622881, 55837442, 40645508, 30703474, 23685093, 18873495, 15473310, 12902446, 10977941, 9478812, 8431554, 7273831, 6253496, 5568784, 5066987, 4685138, 4517056, 4204355, 3888021, 3590877, 3217054, 2936791, 2677515, 2406435, 2265489, 2201036, 2128159, 1993717, 1863457, 1733717, 1610039, 1460873, 1452764, 1302979, 1260185, 1098224, 931886, 929164, 888637, 988524, 979339, 1051375, 1013552, 968041, 921822, 862347, 665086, 761960, 892775, 929077, 934969, 750296, 706687, 784675, 793768, 647555, 741987, 958131, 949798, 735772]
18045G35772j93434j05702j7176l8204J2504J04259K6224o857K3003M6498k6625
18034E60262K0860o519m1666P6988o2533k6674n9963k309K2094j5098j33057j7923
18022C14462j31604k37005n287J82249J60868j33702p1213P6504J33854J45030
18012D34156K9105p5505j46807R996N3463J8447j21382K6501O8820N6138K3230
18001C76162J3293L6970m4272j29247J06253n0755j47907J09462L5996m4663j2257
17990B49035O4252O5123j83541j16870J64091J75552j00670N1634J5456j3351
17980C70711o413J92504J13393k0645p8913j10200J14905Q0982j02805o2831j11122
17969C79566r6868j19339p0506P8211Q2822N1005q1210r7964j2172n1566O5222
$$ y = [735772, 542338, 436636, 419460, 381256, 393760, 498019, 524243, 517386, 540389, 586887, 560262, 581122, 574603, 532937, 609925, 547392, 520718, 460755, 458446, 480540, 465442, 332385, 314462, 182858, -54147, -59434, 122815, 283683, 149981, 78768, 155272, 289126, 434156, 463261, 387756, 240949, 250945, 304408, 322855, 201473, 227974, 296794, 352932, 376162, 389455, 426425, 382153, 252906, 359159, 308404, 160497, 269959, 305955, 261292, 249035, 313287, 378410, 194869, 77999, 242090, 417642, 316972, 368606, 384062, 370711, 364298, 556802, 670195, 649550, 570637, 460437, 575342, 656324, 553519, 490688, 379566, 282698, 163359, 92853, 171064, 253886, 304891, 223681, 125717, 113545, 61979, 127201]
17958A27201N1537J65472m6277n6649l5481j30977j08373K3311n7746O6710m6463
17947d7735J42119K17243K178j85481m3570J01975M6461Q588P4101N7690j27740
17936B45829j02810J76993J27551J8968j49880p4562J10120L5236j72523P839
17926B22761m6860O7384M7663j18228J50621n1568N5660J04748p068J7262q1480
17915C60895k6266P2668J59047K14823J39278j1175l6331J80697J89636l9787
17905A203485o0759j13201q5917q4848O1252J30870l8281n3990j54174j69398
17895F35039k46490k26902O7434M971J23622K63059K5271j81033l3947N50k7345
17884D04229n359j62164j97440K1278J6356J21771J03043l6095j29207n6079J67122
$$ y = [127201, 178738, 344210, 297933, 241284, 205803, 74826, -33547, -10236, -67982, -1272, -47735, 94384, 311627, 313805, 128324, 84754, 186729, 233190, 241778, 315879, 373569, 245829, 143019, 320012, 447563, 466531, 316651, 242089, 352209, 387445, 214922, 222761, 175901, 243285, 290948, 172720, 323341, 271773, 327433, 432181, 425113, 442375, 360895, 334629, 407297, 566344, 781167, 920445, 909270, 872939, 1053636, 1243272, 1203485, 1142726, 1029525, 943608, 858760, 920012, 1050882, 1012601, 958611, 804437, 635039, 388549, 161647, 229081, 234052, 357674, 620733, 646004, 464971, 431024, 431574, 404229, 398870, 236706, 39266, 60544, 76900, 198671, 301714, 265619, 136412, 80333, 247455]
17873B47455R2351m5206m7525O5241J61275R1658N7362J56081J83325K07221K5580
17862A194818j81445q8499r5705l0758J44132k7745j00072n8280j01406q9659
17852E65381j06727L6315M2420M2143P628o2583K66927l2216k83971m9987k0138
17841D05192P0565r3954j28356j53606o8995L2426J29800o4204O734k0806j85554
17830g0758l6514J57669J06166M5736j8606p8297K1300j01596L714j41367j09808
17819b22361J03110K54103J08492k9826n5294J6519m9987k3136O4221m4546Q610
17808A29905r4048N394J85887O5102l9032j06310n5963K9691J0787P0067N1323
17797B52803j16864J0335l0859r2923M1979J03726K9308j04970n2148n5510l553
$$ y = [247455, 339806, 294600, 247075, 312316, 473591, 565249, 622611, 778692, 962017, 1169238, 1194818, 1013373, 924874, 829169, 798411, 942543, 914798, 814726, 756446, 655040, 565381, 458654, 494969, 537389, 579532, 587160, 524577, 791504, 759288, 475317, 425330, 405192, 475757, 381803, 253447, 99841, 30846, 63272, 193072, 128868, 135602, 114796, -70758, -107272, 50397, 156563, 202299, 183693, 105396, 126696, 25100, 28814, -112553, -222361, -119251, 134852, 243344, 213518, 158224, 174743, 124756, 101620, 165841, 121295, 129905, 35857, 41251, 227138, 292240, 253208, 146898, 90935, 120626, 131413, 201480, 252803, 135939, 146274, 115415, 22492, 64471, 168197, 197505, 92535, 40387, -15123, -18676]
17786a8676J42445J02021O1341M7004j28275j82317j04084O8134O931L2663J40518
17775A67705j04771j21142p2971J79598J58787L6886L0712Q3552j26468k78562
17765d6674o6231J4670J24857M4241L7182M2422J68251j27032m9733p951j38506
17754d504L6100J04876J8321p5400J32718P4442j42944Q0385J6078M3687L5843
17743C19602j31959o6099J19355J5997j64671j35730j66572O6727K00751Q5007
17733A42408Q2734j8784o7008K1055l5836j66262q7047J21276K47276O0940K6827
17722C27579M1095j5545k27989k1870K4279l0874j7852k7346L5587l9241p8161
17711c0338R214n4780j5099j51733m9140J75363K37910n0343o0593K24889N0813
$$ y = [-18676, 123769, 225790, 287131, 334135, 205860, 23543, -80541, -12407, -5476, 27187, 167705, 62934, -58208, -131179, 48419, 207206, 244092, 274804, 358356, 231888, -46674, -112905, -98235, 26622, 70863, 108045, 150467, 318718, 191686, 141953, 134002, -4504, 31596, 136472, 154793, 79393, 212111, 286553, 143609, 223994, 240072, 283759, 319602, 187643, 121544, 240899, 256896, 92225, -43505, -210077, -143350, 57401, 142408, 225142, 206358, 139350, 160405, 124569, -41693, -128740, -7464, 239812, 300752, 327579, 368674, 353129, 125140, 103270, 127549, 96675, 78823, 51477, 87064, 47823, -30338, -21124, -75904, -91003, -242736, -291876, -116513, 121397, 71054, 10461, 235350, 286163]
17700B86163m1255q0221k07754J2060m462P2414M9661M1627j83687m6067K708
17689i8813Q1663j58094O8129M3323l518J33736L9743j73361j9840j5166k5494
17678a27692N0304M3304J58967m4889j51754j32283j74217J38518J40584J0279
17668h8879l2944L6200j09547l4086N1638j23146p6406O6343R1153N4051J86110
17657B0487J61595k8689m3058r13R0887K706j21517j07090L515J28118j14130
17646h089J9938J29383R5614L842k7617q1145j52695k36889l7357K8817K52405
17635a3793J4921j36124Q1079J60059O4824l5008K42695K48617L67851O17251
17625A612372K23213j76195n15894l51526k19776j51860m0258J7907k4468K107
$$ y = [286163, 244908, 164687, -43067, -31007, -35469, 36945, 86606, 128233, -55454, -101521, -98813, -17150, -175244, -107115, -63792, -67310, 66426, 106169, -67192, -87032, -102198, -127692, -77388, -34084, 124883, 79994, -71760, -204043, -378260, -239742, -99158, -88879, -121823, -85623, -195170, -229256, -177618, -300764, -377170, -310827, -219674, -165623, 20487, 182082, 153393, 110335, 109422, 200309, 203015, 81498, -25592, -22077, 106041, -8089, 11849, 141232, 236846, 240688, 213071, 131926, -20769, -257658, -295015, -266198, -13793, 1128, -134996, -53917, 106142, 170966, 135958, 378653, 627270, 995121, 1612372, 1835585, 1659390, 1143496, 791970, 572194, 420334, 380076, 397983, 373515, 375622]
17615C75622k41661j79397j4047K2815K05504Q0392J20097J64731J41904M05814
17605A081774N99589K32716l00048n28870m40619k5717j94179j96161q2006n2919
17595I3560j455r6307J95907J08870Q361r8091j19154j92020M5434K88437m9863
17584A83679j08655j54975O4962p4536l1989j07003Q8752L1646K0919J62505J14427
17573A89732n8228k4154j33015j11410J5024J50741K36878P7488l9312n3385j8422
17562B31937j16251o0022L5403J1425J6064o0744j43407J09670J19433p0067p2123
17551A318j10427m522J1019J42707q6768n401l5008O9382j0872K65401k7319j12263
17539I7247Q4926p6909j12944Q7934Q2622j46795m6477q6575n8491Q1382O921
$$ y = [375622, 133961, -45436, -59483, -36668, 168836, 249228, 369325, 534056, 675960, 1081774, 1681363, 1914079, 1614031, 1085161, 644542, 618825, 424646, 228485, 146479, 93560, 92105, -4202, 191705, 300575, 308936, 210845, 91691, -100329, -54895, 233542, 183679, 75024, -79951, -14989, -89525, -121514, -228517, -139765, -108119, -87200, 75305, 189732, 131504, 107350, -25665, -137075, -122051, 28690, 265568, 343056, 303744, 250359, 231937, 115686, 55664, 91067, 102492, 118556, 57812, -85595, 24075, 143508, 73441, 1318, -109109, -113631, -102612, 40095, -46673, -52074, -87082, -17700, -28572, 236829, 209510, 97247, 182173, 105264, -7680, 80254, 162876, 16081, -30396, -116971, -175462, -94080, -87159]
17528h7159j19549K09351J40585P126n8051p028j72948P5114M5920j24423j05164
17517a96226j33393K2962J60591r9016J04356M9423p781k7886j6348J29546k9377
17506d3149o222P6082J46722j3882o5039J24682p1413l7654m3020j30384j18129
17495a81406o1186k0248N3127M4714j00910k9160J093M7211L6846J39280N9490
17484a1149j8928m7596r6644L3064J09263J31748l5519j46228r2027P1893K00894
17473I8771K29997J58951r6040j52580J9879o6821m0506j38916q4499J17286K15012
17462B60534J3051k3343R9708R6261l9694P04j59624o0612M4192k64l21408j73500
17450b63995q6568K47749K02966J65696Q5887L44687P31593P68554K73603p66156
$$ y = [-87159, -206708, 2643, 143228, 150354, 92303, 85275, -87673, -12559, 33361, -91062, -196226, -329619, -306657, -146066, -245082, -140726, -91303, -99084, -126970, -143318, -13772, -43149, -49371, 26711, 173433, 159551, 94512, 219194, 147781, 110127, 67107, -63277, -181406, -242592, -262840, -209713, -164999, -265909, -295069, -293976, -246765, -209919, -70639, -11149, -30077, -77673, -174317, -141253, -31990, 99758, 64239, -81989, -174016, -102123, 98771, 328768, 487719, 391679, 239099, 258978, 192157, 151651, 12735, -71764, 45522, 260534, 273585, 250242, 349950, 446211, 406517, 407221, 247597, 186985, 231177, 230913, -90495, -263995, -350563, -102814, 100152, 265848, 351735, 696422, 1428015, 2196569, 2470172, 1704016]
17440A704016r06495k66963r5199j43659j95301l7018L0060L807j40740j60223
17430b07715K4933Q1218J24794J91130L4685j50212j32939m201O1147l404k5462
17419f026M9093N1971P3704l7611L119M3391j54037J10176R9154j35232j06433
17408h731l5357m8189n7829J40065j7372P830N7072O0896L8466o2107P6469L2003
17396A83216m2585r9438j89123j12402l6549M5880L0932J65753R8606j6877L5807
17385F3220p2379j3157q4879K1593R6804P0730q2486m7297o554M8733R2248j39903
17373e3327j98901M2645K12599P5764k5472O8277p6487r7949j81321q7721R3148
17362b28745N4253N7105j9124j61444m4471K41648Q739j11782O3515P9986P7240
$$ y = [1704016, 797521, 530558, 435359, 291700, 96399, 59381, 89441, 93248, -47492, -207715, -182782, -101564, 23230, 214360, 249045, 98833, -34106, -38307, 22840, 19436, -6026, 43067, 95038, 168742, 131131, 134250, 177641, 23604, 133780, 232934, 97702, -8731, -44088, -92277, -150106, -10041, -27413, -19583, 37489, 98385, 136851, 74744, 151213, 183216, 140631, 41193, -147930, -260332, -296881, -251001, -220069, -54316, 44290, 27413, 63220, -9159, -22316, -107195, -85602, 11202, 81932, -554, -47851, -54405, -5672, 86576, -53327, -252228, -209583, 3016, 78780, 53308, 121585, 45098, -52851, -234172, -321893, -228745, -174492, -117387, -136511, -297955, -342426, -100778, -92039, -203821, -140306, -60320, 16920]
17351A6920J11462J94492n8245k56305L4128J05886m8633j58728p385o2492o3783
17340a92683j38795J08714K25902Q2875k24384l5397J5416J47322r0663m5258
17330a46951r1837n7363P7627Q9054J21558J07536j34755o5640J85455P0653j17322
17319C8015q2647K6308j1055Q3502O4206j13375k02052j19035j28467J45242L04444
17308E086L2358k51914j02271M0150J9947M253J17598Q7198O0766N7303J7494
17297H7968R864l946p9569p5232j32017M4846j11444M2106J63959K303N329k9385
17285g5218k2408k6649k2309P6964J08460j4822q3586j11006J75804K77775J53200
17274D36205k7964k00012q8154J5711N4455Q4498r6838j56875j4421j81471M2108
$$ y = [16920, 128382, 322874, 264629, 8324, 42452, 148338, 99705, -59023, -66408, -128900, -192683, -331478, -222764, 3138, 86013, -138371, -173768, -158352, -11030, -101693, -146951, -238788, -296151, -218524, -129470, -7912, 99624, -35131, -100771, 84684, 155337, 38015, -44632, -18324, -29379, 54123, 118329, 4954, -197098, -316133, -444600, -299358, 5086, 37444, -214470, -316741, -276591, -256644, -252391, -134793, -47595, 13171, 70474, 87968, 97832, 93886, 14317, -60915, -192932, -148086, -259530, -217424, -53465, -51162, -45833, -75218, -97626, -124275, -146584, -69620, 38840, 24018, -59568, -170574, 5230, 283005, 436205, 408241, 208229, 120075, 135786, 190241, 274739, 177901, 21026, 6605, -174866, -132758]
17263a32758N5998P5781O8575R3665r2693j06139K1015p1488K4621K786P5659
17252A5022J37409J24859P862o7380j25426r3416j52923N2391p4611o5511N2793
17241a88931j1298k0623J71550J77719P8972j12271j84385J7461k9541J69166
17231F7819K27832K220n3858Q607K2353j17539l9444j54396r4189k629k1033K211
17219a52046R6337Q045K7026J2542j47910k6140j02514K4727J79836Q6462J10475
17208A16840M0631j33550k40263m2920R9519J31416M3589j26069j02181J2666
17198b00322J49736m873j06987J52749N0433m1001j07804P1570J14110j6362j21523
17187f0274j37586j03289N2930J05499r1083L5685J13610J23261o5942j99676
$$ y = [-132758, -76760, -979, 67596, 161261, 68568, -37571, -16556, -88044, -63423, -60637, 15022, 152431, 277290, 285152, 217772, 92346, -1070, -153993, -101602, -176213, -241724, -188931, -200229, -220852, -49302, 128417, 207389, 95118, -89267, -71806, -101347, 67819, 295651, 297871, 244013, 252620, 274973, 157434, 117990, -36406, -130595, -133224, -154257, -152046, -55709, -47664, -20638, -8096, -156006, -182146, -284660, -259933, -80097, 6365, 116840, 157471, 23921, -216342, -259262, -159743, -28327, 15262, -110807, -212988, -200322, -50586, -55459, -162446, -9697, 40736, -265, -108069, -36499, 77611, 61249, -60274, -197860, -301149, -248219, -142720, -233803, -198118, -84508, 38753, -27189, -226865]
17177b26865p1737R5104J09417N5125j12220o9629R3617J67149R4767M4580o8681
17166A10627j9621j63774N0963j57496J473P409m1828Q5877J13187j77009o542
17155a96734n6299n1384N9388P9433K08557m8972p2536r4479M2313Q3890L3262
17144a3561M4746j27293Q505R2794r3179L9482Q8179J38363m4230m0632j36710
17133d3536m8559j67144o8860Q3641J98165K9792J27531j13787j35838J5233q4558
17122b07920j67249n45K08714R695Q4519J37204r4055r169l7199p1427k5975l0179
17110b03586J13990J09002k1060Q5865n3515j1894j1952J28707M8652L1395l9666
17099A75938q6918r3509J25964J8027j80721r7635J03979J02502N4148J55998
$$ y = [-226865, -298602, -203498, -94081, -38956, -151176, -220805, -127188, 39961, 134728, 179308, 110627, 91006, -72768, -21805, -179301, -177828, -170419, -212247, -126370, -13183, -190192, -196734, -253033, -304417, -245029, -165596, 42961, -6011, -78547, -173026, -130713, -46823, -13561, 31185, -96108, -87603, 5191, -87988, -48506, 39673, 178036, 133806, 93174, -43536, -92095, -259239, -328099, -244458, -46293, -16501, 111030, -2757, -138595, -123362, -207920, -375169, -375714, -167000, -157305, -72786, 64418, -29637, -38806, -76005, -147432, -173407, -203586, -89596, 19406, -1654, 84211, 30696, 18802, 6850, 135557, 184209, 215604, 175938, 89020, -4489, 121475, 139502, -41219, -138854, -34875, 67627, 121775, 277773]
17089B77773p768k01325p4021l7108J9341N4955O0142q9496p9977J612Q5232q0797
17077g1437m2484J3306p3453k45229n3180P9853L07105M8516j43061O6751J17844
17066D531J61488j05354k55036j6243J90263K8368l7395r0143r1125k06818l2516
17055d49980J50835J00214J01822R9768k3649j8522J6567J0550L0684m7415p1864
17044a00990L8698J8813Q3284j2496K8710J32664m8001j36426k32887J5544J15849
17033i7238J65799M1246k8963l0842N0160J06144O7850j75161M428K7020j5153
17022A15290j28502q8101J86776J65707r1631j39278k08885j57344l7158P3700
17012c09426j4840K533K6821R391r7346Q8227J00062K01174N8949J64092j25169
$$ y = [277773, 270005, 68680, -5341, -42449, -23108, 31847, 91989, 2493, -77484, -75872, 9360, -71437, -113921, -100615, -174068, -419297, -472477, -392624, -85519, -37003, -180064, -113313, 4531, 166019, 60665, -194371, -210614, -20351, 8017, -29378, -119521, -210646, -417464, -449980, -299145, -198931, -97109, 2659, -20990, -39512, -22945, -12395, 18289, -29126, -100990, -62292, -43479, 39805, 27309, 56019, 188683, 140682, 4256, -228631, -213087, -97238, 68561, 109807, 80844, 50002, 100162, 206306, 274156, 98995, 103423, 130443, 115290, -13212, -101313, 85463, 251170, 159539, 20261, -188624, -345968, -383126, -309426, -324266, -321733, -294912, -285521, -382867, -294640, -194578, 6596, 65545, 229637, 104468]
17001A04468k54928k28836K79784J77649L5977l8929n6943o7223n0296o099J27627
16990B2251L2512P8618j69908j75778R1926p6456k26152J47105L59707J72069
16980B55894P2407j43218M7216n9368j55995N070J1473o9360m0723o5825q1027
16969b23456J06958K00985R2063J2014j0740M2014j30523r0148J2218L0721k4690
16958A7416k18039n7991k9581J5402J12826J72737K9671k18647m5035j8997n1453
16947b91691J36923r02L9700Q7285j35515l9135N6295K55757j03089m5722n0670
16936i0764k36164q7646k1450K58448J73913r4918P612L2542J34160j71784j47455
16925b43506J5820j0432n6774L3216O4121L4170K34728L9987k4307j39027J49117
$$ y = [104468, -150460, -379296, -99512, 78137, 114114, 75185, 18242, -48981, -99277, -105376, 22251, 54763, 133381, -36527, -212305, -120379, -196835, -422987, -275882, 83825, 255894, 328301, 185083, 232299, 172931, 16936, 22006, 33479, -35881, -76604, -142429, -223456, -116498, 84487, 176550, 188564, 177824, 219838, 89315, -833, 11385, 42106, 17416, -200623, -258614, -288195, -272793, -159967, 12770, 42441, -176206, -221241, -240238, -291691, -154768, -155670, -115970, -28685, -164200, -203335, -147040, 108717, 5628, -40094, -90764, -326928, -414574, -436024, -177576, -3663, -98581, -90969, -58427, 75733, -96051, -243506, -227686, -238118, -294892, -261676, -197555, -163385, 71343, 111330, 87023, -52004, 97113]
16914I7113l122N179r0148o2416M5941n6707o8202j40343M9502K13849p0720q4825
16902a64899J14050J17045O4158j56819N4568M7418j53854n3561J28455K04882
16892B01443K4272k26413r3554j36606J4585J45933J42315j50851k01953j42494
16882d23323k7103Q9071j05k01594p6052J38029K57370J15906J19744q8056r7508
16871a93621R471M540n8931J06340j8987K9420j3710K1333O3260q2605j03813
16860b37303N4424J60106O4790j0321o1731p6636P0732N4739n1047L5835j8429
16849a4841l4130n2465N6665L188P5995J06120q1557O9798L6960L0189j09801
16838H6121k1913j7627m7449N5223L5526j6491j3947j00298L4361J41359j32345
$$ y = [97113, 93991, 99170, 9022, -53394, -7453, -64160, -132362, -272705, -223203, -9354, -80074, -164899, -50849, 66196, 130354, -26465, 28103, 75521, -78333, -131894, -3439, 201443, 225715, -698, -94252, -230858, -216273, -70340, 71975, -78876, -280829, -423323, -450426, -361355, -361460, -563054, -639106, -501077, -243707, -127801, -8057, -96113, -193621, -184150, -179610, -238541, -132201, -151188, -121768, -135478, -114145, -50885, -133490, -237303, -182879, -22773, 42017, 31696, -30035, -106671, -35939, 18800, -32247, 3588, -14841, -48971, -101436, -44771, -41583, 34412, 140532, 58975, 128773, 165733, 195922, 86121, 64208, 46581, -868, 54355, 89881, 73390, 59443, -40855, -6494, 134865, 2520]
16827B520o1459K55177J00446j97167k85940j17192J2046R7338P2150r1264j64422
16816c77767j13332l0894O6305N8732K7921L3718J9124L1919Q7016L5072K2596
16805a39590m2617p1058J53821L9822O0019j03247j12716J6475N1335R0446n9043
16794a16353J7520J12883l9104n7116J8192L3666O5033j49658J59419K34400r9120
16783A79762m2320M1641l2010r9851o1259N0873n3651k51584o2673J14366J4684
16772b02022L5724q2354J57925K78488J73461j21037j78007j08895n0512j3178
16762a10407P6893o964r9160j29818J90205J229J08065J2414K8991J26094m8567
16751A48975q6340O0123q4802j81498o8382Q7571J57513O5331n5635k62919K5410
$$ y = [2520, -58939, 196238, 296684, 99517, -186423, -303615, -291569, -194231, -122081, -213345, -377767, -491099, -521993, -455688, -396956, -369035, -335317, -316193, -284274, -197258, -162186, -139590, -182207, -253265, -99444, -59622, 397, -102850, -215566, -199091, -147756, -57310, -116353, -98833, 14050, -25054, -82170, -63978, -30312, 34721, -114937, 44482, 278882, 179762, 137442, 179083, 147073, 47222, -14037, 36836, -16815, -268399, -331072, -216706, -202022, -166298, -248652, -90727, 187761, 361222, 240185, 62178, -46717, -97229, -110407, -33514, -40478, -139638, -269456, -79251, -78022, 30043, 42457, 71448, 197542, 148975, 62635, 122758, 37956, -143542, -211924, -124353, 33160, 98491, 42856, -220063, -194653]
16740a94653R0614o0717j1739l3712J53698O395m7249R513q690k6824J24692J6802
16728A8130j18192m6409o0344m3711J75900J27214M115l6961m10n7840r8591p9467
16716b16566J7980L9965k1275N1154J58346p6448J7906J02933K8077J2804q4936
16705B9940j97812j898J56666q732P6098l4356J9583J14362L1833j81406j85724
16694a81446p1826n5540J32742J21565k8876o2570o3102p6874O7363j6937J92471
16683d3030J31177j24960o6962R2313M8086Q7128J06016j42012j77495R93n2902
16672a41648N2095J2774J08684L2216J0790J75464L9432j68709q4158J9638k6743
16661B9835l6968n6708k1172K1546N2758L7081j7099j53537n8723J05161J22188
$$ y = [-194653, -104039, -164756, -176495, -210207, -56509, -50114, -97363, -87850, -96540, -123364, 1328, 18130, -100062, -146471, -206815, -250526, -74626, 52588, 56703, 19742, 19332, -38508, -137099, -216566, -198586, -158621, -179896, -128742, 29604, -46844, -28938, 73995, 102072, 114876, 29940, -167872, -169770, -13104, -21836, 54262, 19906, 39489, 153851, 185684, 4278, -181446, -253272, -308812, -176070, -54505, -83381, -145951, -209053, -285927, -218564, -235501, -43030, 88147, -36813, -103775, -11462, 36624, 123752, 229768, 87756, -89739, -88746, -141648, -89553, -76779, 31905, 64121, 74911, 250375, 289807, 121098, 36940, 56578, 29835, -7133, -63841, -85013, -63467, -10709, 26372, 9273, -144264, -202987, -97826, 24362]
16650B4362K2774k34127r3485N6744M6083J68262o742j24336P2648K6359R038
16639c2420K35338P241l9473j9919j51443q9626j32966n9117P7445l853K41579
16628C2786J21353l2917P1412K8940j40500j70663M3501N161m0697j4484M4431
16617e1677k45329j78225Q8339N4266l5331R0294p0094R446Q8227J30916O2742
16606e6426k3301j88421Q8824J05455k00468M4029K60319j2979j18906n0483N1304
16595a01053P9830r1268J22828P2931j63002j53338J29028R0973R5181k3293j92576
16584a33759K3979k1629j20707Q843R5751j5573O6560M7553p9709k9402J60001
16573A908k5375j36293m8406m348R5186M2104j40214n4242m9017n9355J13189
$$ y = [24362, 47136, -186991, -280476, -223732, -177649, -9387, -16129, -140465, -67817, -41458, -32420, 202918, 210159, 170686, 150767, -676, -90302, -223268, -282385, -204940, -208793, 32786, 154139, 121222, 192634, 221574, 81074, -89589, -46088, -40927, -81624, -96108, -51677, -297006, -475231, -386892, -332626, -367957, -277663, -347757, -338311, -250084, -119168, -56426, -79727, -268148, -179324, -73869, -274337, -230308, 30011, 17032, -101874, -152357, -101053, -21223, -112491, 10337, 83268, -79734, -233072, -104044, -13071, 82110, 58817, -133759, -109780, -131409, -252116, -243273, -147522, -163095, -96535, -48982, -128691, -158093, 1908, -23467, -159760, -208166, -212514, -117328, -75224, -215438, -269680, -318697, -378052, -264863]
16562b64863J44603J63314L5520m8994N848L4601j0881q1092j81039L5035J53112
16551a4836P9832J03808L4678p164j17953o9151j91722j24419q0756o7N4608M6305
16539b86837m8538K03757N3959k9906K5663p2339P9141J23863n2895k02906N6870
16528a50168K25039K03902R985j74030m9911K4305J3551j14559q6293J4008J33629
16517D9458M0987n073m0664j2419j6663k7749k7302o1357j6204J8380j86541J31975
16505a53172Q7995J37278R3940j00318J53230l0921j49227k4789j68921m2156
16495a97061J75729J32316J4039j98685m1419K39169q4878n2214m2334P1128m8850
16484c3060O1J30709j83060q231P5630P6982r1231m9916j53784m203J14072J14957
$$ y = [-264863, -120260, 43054, 78574, 29580, 35428, 70029, 59148, -21944, -202983, -167948, -14836, 64996, 168804, 203482, 196318, 78365, 9214, -182508, -306927, -387683, -387750, -333142, -286837, -335375, -131618, -77659, -107565, -81902, -154241, -75100, 48763, -4132, -207038, -150168, 74871, 278773, 288758, 114728, 64817, 89122, 102673, -11886, -98179, -84171, 49458, 90445, 85372, 44708, 32289, 15626, -12123, -39425, -100782, -116986, -98606, -285147, -153172, -65177, 72101, 166041, 65723, 218953, 188032, 38805, 14016, -154905, -197061, -21332, 110984, 125023, -73662, -115081, 124088, 39210, -13004, -55338, 15790, -33060, -32999, 97710, -85350, -93581, -17951, 59031, -32200, -82116, -235900, -240103, -126031, -11074]
16472a1074l6824m1049J80409J46522j70448q7136P0956R1255p2365j56347n1500
16461a37601O7931J11685L14762L1352o828j32814j11381m0301m3292M5853M8126
16450A47492M3542L7935M0605p6042J72525k6881j70740j20488p1000J8225Q401
16439C574k2270j4635p0250L6223o587J25457J12732n5656L7367O511j52345j4420
16427a4299l3923M8061L5034J52969N4313q2382r3437k3364m9128o4579K8718
16416d2017R0911j57546j45365j43346l7184K70519p469O1676Q5125Q5887P1629
16405A32820M180q3609n7605p9851J2786r3538o0962R5128J15106j58749K4018
16394a50276M5799j17072o2415J00953j6535M2643M8900o8747J22909R8991J12
$$ y = [-11074, -47898, -88947, 91462, 237984, 67536, -19600, 51356, 142611, 70246, -86101, -137601, -69670, 42015, 356777, 388129, 381301, 248487, 137106, 96805, 53513, 99366, 147492, 191034, 228969, 269574, 193532, 366057, 339176, 168436, 47948, -23052, -4827, 3574, -18696, -33331, -103581, -67358, -73945, 51512, 164244, 108588, 145955, 152466, 121, -14299, -48222, -161, 34873, 187842, 242155, 159773, 66336, 42972, -6156, -70735, -42017, 48894, -108652, -254017, -397363, -434547, -164028, -171497, -109821, -24696, 61191, 132820, 137000, 53391, -4214, -84065, -71279, -164817, -225779, -130651, -15545, -174294, -150276, -104477, -221549, -283964, -183011, -199546, -156903, -108003, -176750, -53841, 45150, 45262]
16383D5262M9425J2501j21181j48155L6049P7355J24473p2003j36825R1002N6490
16372A4393N8432o2238R5158j73876j96337k7177R4984Q090j1769L6389j7038
16361a80989L2962R2112J16156j2465l8985n738N8920J59332R29j5628k1969j59269
16349B5368M1421J10294J82211O4101O1284j22576o0244L7755j0366j12829j17904
16338I8515r9911N0107L3262L3661l2537J22743q284p8945Q1562J5871j98408
16327A7636k7758J9401P9768K9923j02896P62J26349O3471q3710k14060k08958
16316c00072K4512J85440K61557j8330j12380R5899K5181M258N7523m6422J2823
16305A89989j00134m2669m1536p5865L235L4773r097J25781K8908j3737J05464
$$ y = [45262, 94687, 107188, -13993, -162148, -126099, -48744, 75729, 3726, -133099, -42097, 14393, 72825, 10587, 105745, -68131, -264468, -291645, -196661, -188571, -200340, -163951, -180989, -148027, -55915, 60241, 47776, 8791, 3053, 61973, 221305, 222234, 206606, 184637, 25368, 66789, 177083, 359294, 423395, 484679, 362103, 301859, 339614, 329248, 216419, 98515, -1396, 48711, 81973, 115634, 83097, 205840, 197556, 118611, 200173, 216044, 17636, -10122, 9279, 89047, 118970, 16074, 16836, 143185, 206656, 122946, -91114, -300072, -275560, -90120, 171437, 153107, 40727, 136626, 161807, 166065, 223588, 177166, 189989, 89855, 47186, 5650, -70215, -66980, -32207, -41304, 84477, 113385, 99648, 205112]
16294B05112P6109n0007j57108o3743L4292N0638r770j07328p8707p9515q3933
16283b63960J0731n126K4522K6972J53142K1474Ln4046J31411j29489o7985J31278
16271b1073J84599n6209j2960K1033j25510p1025O4990P0368J82341r0894k13791
16260f8131q0050q1835j9698L9665P1617L0154N9166J64103J70571k3432q470
16249B53660j7141l59858p056M1430P5493K8141K15693N2068j66678J86721J01926
16238D04399k41954K784N1989m8999k19721j63459N8505N2989O1398p1628k2279
16227a35976R041J26747l5696m0977O7762P0033N2542J40115l6124j12147n3168
16216E2152O6489M6647j38738P9534J49711o4147j80611m8742M1873J30966o6211
$$ y = [205112, 281221, 231214, 74106, 10363, 44655, 95293, 85523, -21805, -100512, -180027, -263960, -253229, -258355, -233833, -206861, -53719, -32245, -32242, -86288, 45123, -84366, -152351, -21073, 163526, 107317, 94357, 115390, -10120, -81145, -16155, 54213, 236554, 145660, -68131, -148181, -230016, -249714, -210049, -138432, -108278, -49112, 114991, 285562, 262130, 253660, 236519, -123339, -130395, -88965, -13472, 14669, 230362, 282430, 115752, 302473, 404399, 162445, 165229, 217218, 168219, -51502, -214961, -156456, -103467, -42069, -113697, -135976, -126935, -188, -35884, -76861, -9099, 60934, 113476, 253591, 217467, 105320, 52152, 118641, 165288, 26550, 106084, 255795, 191648, 11037, -37705, 4168, 135134, 68923]
16205F8923J13973O636l03141m7669q7142j71649R14J99938j9245j6280J31547
16194a23195J28417p8119r3512j807J6929K1615P8572P3703l5145o7456k2345
16183a02343O6669J2877k6915l4122k5902O440r445n7334j42503k476K13044J24773
16171B2763j81515K15014J46470K8995k5974o7040J19575m7635O730q8120j73270
16160d4007k30326j9556J56668J00311N3567L1507N1519p7870K0757J669j00965
16149e6726j52360o1408J93982j4038l5488P5134O8118M1918L9312Q6186J74453
16138C59083J13471q9412o3985j33536l3780Q8435j17973j32983J79819N1064
16128B20203k64205m082J60769p9945k21185K668q8729p9528J05674o87p3847
$$ y = [68923, 182896, 189532, -113609, -161278, -248420, -420069, -419155, -219217, -238462, -254742, -123195, 5222, -72897, -166409, -168216, -151287, -129672, -51100, 22603, -12542, -79998, -102343, -35674, -22797, -49712, -83834, -109736, -103296, -112741, -170075, -312578, -315054, -102010, 22763, -158752, 56262, 202732, 231727, 205753, 138713, 258288, 210653, 217383, 129263, -44007, -274333, -293889, -137221, -36910, 16657, 48164, 99683, 21813, 42570, 44239, -56726, -209086, -270494, -76512, -90550, -126038, -50904, 17214, 59132, 98444, 184630, 359083, 472554, 383142, 319157, 185621, 151841, 240276, 122303, -10680, 169139, 220203, -44002, -48084, 112685, 32740, -188445, -185777, -274506, -354034, -248360, -249047, -322894]
16117c22894K5558J36113K9661L632n8448k0521O0297J25635L0710j2662p1712
16106g4631r7460R3150n4704K4323P132j06063K0769J28899J21097j02258j25160
16095a64906M9901P435O5500k0552j76845j2799Q5334q1917J2716O0029k1903
16084a98007p0428M5770j2716L1572J50311j35304J24630l0650m8285J1604j00100
16073b31603P9226J78973J95004m4645j94283l6919L3039o7582l0190N9608K9610
16062b9762J8936M2229m7833j49541J19755R8029N2678k1895n5259j2347P1695
16051H6685j32064M4453Q2966J43818K3118j30293r3797n6115j19860Q7793k9494
16040i2790N6508l4732q1581K96199J74162m7115r7757j44703o4365j68351J80518
$$ y = [-322894, -297336, -161223, -131562, -127930, -186378, -206899, -146602, -20967, 9743, -2919, -74631, -172091, -78941, -133645, -109322, -102190, -208253, -187484, -58585, 62512, -39746, -164906, -115005, -107570, -42070, -62622, -239467, -252266, -166932, -248849, -236133, -176104, -198007, -268435, -222665, -235381, -203809, -53498, -188802, -64172, -94822, -143107, -131503, -231603, -152377, 26596, 221600, 176955, -17328, -54247, -21208, -88790, -118980, -59372, -29762, -10826, 31403, -16430, -165971, -46216, 51813, 104491, 82596, 27337, 14990, 86685, -45379, -926, 82040, 225858, 248976, 118683, 24886, -31229, -151089, -63296, -92790, -36282, -71014, -152595, 143604, 317766, 270651, 172894, 28191, -36174, -204525, -24007]
16029b4007Q6483k5353O1608P0275l1136j06079P8595J55595m5683p4422l6328
16018A09548K01970j1507j48812j19689k09054K7724O3112O2075j3197m3860K37100
16007A55410K6716P8228R132j37299l1182J04151J14960J5231j09942N509j46203
15996H4711j97313l9422N53P8718Q7777J05917R0943Q052p8478j4504k29832m9924
15984a52802P8779J8020l5084M6199L1027P848K7926n2290j6361j01637J67323
15973A8948J41135o4437q3683M7052J05290L4422j56219o5663j45064O7239J05700
15962D720L4468Q01k048L9537J73872j65993m2733J32565r1071p1478J4831J9738
15950D7209n6583q0749K3800N5591r67j23370l6155J48042K59457M5818j25608
$$ y = [-24007, 62476, 37123, 98731, 169006, 137870, 31791, 110386, 265981, 220298, 145876, 109548, 311518, 300011, 151199, 31510, -177544, -149820, -86708, -24633, -37830, -81690, 155410, 182126, 260354, 269486, 132187, 101005, 205156, 320116, 335347, 225405, 230914, 84711, -112602, -152024, -151471, -72753, 15024, 120941, 211884, 219936, 141458, 126954, -102878, -152802, -74023, -56003, -91087, -44888, -13861, -6013, 21913, -30377, -46738, -148375, 18948, 160083, 95646, 11963, 59015, 164305, 198727, 42508, -23155, -168219, -100980, 4720, 39188, 39989, 37941, 77478, 251350, 85357, 42624, 175189, 84118, 12640, 27471, 47209, -9374, -90123, -66323, -10732, -11699, -135069, -171224, -23182, 236275, 282093, 156485]
15939A56485L2556j39573j44448j03807Q1045J26139j04471L9225J09290O6745
15929A19186M3097J20469M9272j56537n1236j55674m8576j0566L2805Q6326l8269
15918i703L2598m5746r8519o4812m4760o9759N4432J45451L8253N6582j03760
15907a09743Q3780Q7686p6005O2030Q3854j42537L8023J9700j19846l9873p8736
15896a91667K8111j07515L6084J02803J74400J74230R307K2238J01968j70341
15886A79618l2733l5088m5699l9587L1616L289o191m7053j25432K133R0867J3991
15874a0269m8403M3931L5723R5467P4756O7914O9988k0801M8597q1349j20628
15863A54926j1967j97821j28624L5575J50477k6977k1111K427O5934q2183J39839
$$ y = [156485, 189041, 49468, -94980, -198787, -117742, 8397, -96074, -56849, 52441, 119186, 162283, 282752, 332024, 175487, 124251, -31423, -79999, -90565, -57760, 28566, -9703, 22895, -22851, -121370, -186182, -230942, -300701, -246269, -100818, -62565, -5983, -109743, -25963, 61723, -14282, 47748, 131602, -10935, 27088, 46788, -73058, -112931, -191667, -163556, -271071, -234987, -132184, 42216, 216446, 225753, 247991, 349959, 179618, 146885, 111797, 66098, 26511, 58127, 61416, 55225, 8172, -117260, -115127, -24260, -10269, -58672, -14741, 20982, 116449, 191205, 259119, 329107, 308306, 356903, 275554, 154926, 142959, -54862, -183486, -147911, 2566, -24411, -45522, -43095, 22839, -59344, 80495]
15852H0495J49136O5501J87737j29037m51115R201J14955O4706q3605j11160O4408
15841c8778n5004J12301m6447M4672j003l1927P8239J44600L7594p1021p3540
15830I9686m4279m7174m5910j06385J28926q517r1337j7406J01508J9211j41153
15819a52830k3057J87603j8609j30503q9194p6332P0251o7152p8208o4542J15554
15808c27019J00546J81213j68365o8111J87704K01234k1093n7087p0152K4462
15798a6668J24068J02154j53507r4619P7389k5785p9265j01619j06492k0761J19337
15787a75768L2375J13980J50758Q8312j4260m1071k00682k52487Q6737L8056J70023
15776d027O4142k5403q098r519K7111J53586j2665j28072q1658l1957p2919l0700
$$ y = [80495, 229631, 295132, 482869, 353832, -97283, -88082, 26873, 91579, 7974, -103186, -38778, -93782, 18519, -27928, 16744, 15741, -16186, 62053, 206653, 244247, 173226, 99686, 55407, 8233, -37677, -144062, -15136, -23653, -114990, -132396, -30888, -11677, -152830, -175887, 11716, -6893, -137396, -226590, -302922, -232671, -299823, -378031, -442573, -327019, -226473, -45260, -213625, -281736, -94032, 107202, 86109, 29022, -41130, -16668, 107400, 209554, 56047, -38572, 38817, 13032, -66233, -167852, -274344, -295105, -175768, -143393, -29413, 121345, 209657, 195397, 154326, -46356, -298843, -212106, -174050, -4027, 60115, 34712, 26614, 17095, 44206, 197792, 185127, 57055, -24603, -56560, -129479, -160179]
15764a60179R8748L4621r6351Q302M1913P9831J3955k68q0546l1910l4414o7762
15752a94060J29429k1864j6662N4918k1783N2677J4478N9488L8539j89133j11936
15741b05909Q4634J59940N3534k4630o7690Q7588k5602j08218o1479J25797L992
15730B1957O0616J44058P3014Q7622j44816r1521o3821l3616k6130j38974N1087
15719f0524J21643K0893k5051O2999m9882n5936K5015m6658J15l1618n461R8803
15707E4338P821N9969J63027j34210j97427n1883L4167M0511j33791j73799M9627
15696b81650K55763J0320L8538k0935N3035j86365L2396K0018Q697r0079l5534
15685a95796j8102O405j05302R8625J36537l2270r1310k2366J67285K17732P3437
$$ y = [-160179, -61431, -26810, -123161, -114859, -72946, 6885, 20840, 20572, -59974, -91884, -126298, -194060, -64631, -86495, -103157, -48239, -70022, -17345, -2867, 56621, 95160, -93973, -205909, -121275, 38665, 92199, 67569, -121, 87467, 61865, -46353, -107832, 17965, 21957, 82573, 226631, 299645, 387267, 242451, 150930, 87109, 53493, 27363, -111611, -60524, 61119, 82012, 56961, 119960, 70078, 14142, 39157, -7501, -7386, -39004, -44465, 54338, 62159, 122128, 285155, 150945, -46482, -98365, -64198, -23687, -157478, -331277, -281650, -25887, -15567, 22971, 2036, 55071, -131294, -98898, -78880, -70183, -160262, -195796, -213898, -207493, -312795, -214170, -77633, -109903, -201213, -223579, -56294, 161438, 234875]
15674B34875o8959n7911k26484k81546O5606K53873J67276o733j36992q9905j55843
15663c02743n9848k9439P9711J20637o5967N2333L1422n3828m6734M8635j9385
15652b45206j09048M1164J11347J521M6313J51341p1325k16639R2007r775j11659
15641c19959J3265R7556j41144P7411P2564N1627j32302J97981J2031J10092J17906
15630A57028q7573j40633r560j87892k371K2500j1667q709r2255r6418P3087J56987
15618b27476J14805M4956P1541J24166O1665P9179R010j04694n5170o9286j1574
15607C7122J18207O2151L6009K17597P9427r8526p6062p9218j01857q9124N3214
15596A58940j49513k36607r3641J75601J99057R5776J05069j86365o3508J3136
$$ y = [234875, 165916, 108005, -118479, -400025, -334419, -80546, 86730, 79997, -56995, -146900, -302743, -362591, -392030, -312319, -191682, -257649, -205316, -173894, -227722, -274456, -225821, -245206, -354254, -313090, -201743, -200222, -153909, -2568, -73893, -290532, -198525, -208300, -319959, -306694, -209138, -350282, -272871, -200307, -148680, -280982, -83001, -70970, 39122, 157028, 69455, -71178, -80738, -268630, -271001, -248501, -260168, -268877, -361132, -457550, -384463, -227476, -112671, -67715, 3826, 127992, 189657, 268836, 277846, 173152, 117982, 48696, 37122, 155329, 217480, 253489, 471086, 550513, 451987, 375925, 296707, 194850, 105726, 158940, 9427, -227180, -320821, -145220, 53837, 149613, 254682, 68317, 4809, 17945]
15586A7945O0100J00721P2514j02642J6129J45475J547q6001P3886j28556l4069
15575A37049j73308j7884N5177l3778j3034p6657L2448K50712P0386p1907j31758
15564B7446m6612j49342k8380K6501k7909K05284O8127n9335N2814N0171J42643
15553B61408n1992p8258k02586j9325R0764J06980o2875P8387m2508j66944j7078
15542a04027p796j0535J13915Q4301L856j3685j17846N1993J39092j9448j17219
15531B601k1990j54778l5226n8554o7309N6655K8583M8280N0334K0106Q7675K8859
15519a4764J0156m4726Q1719n604J4987L7182o7034o6353n109n612J41436j6100
15507F0178j7083L9602j64419N2468J76290K7365R7998o6437o5525o5818J55503
$$ y = [17945, 78045, 178766, 251280, 148638, 164767, 310242, 311789, 225788, 299674, 171118, 137049, -36259, -54143, 1034, -32744, -45778, -122435, -89987, 160725, 231111, 159204, 27446, -19166, -168508, -196888, -170387, -198296, 6988, 75115, 15780, 68594, 118765, 261408, 209416, 131158, -71428, -90753, 11, 106991, 44116, 122503, 79995, -86949, -104027, -111823, -122358, -8443, 75858, 79714, 66029, -51817, 176, 139268, 119820, 2601, -19389, -174167, -209393, -267947, -335256, -278601, -250018, -201738, -151404, -131298, -43623, -14764, -4608, -49334, 32385, 26781, 41768, 78950, 11916, -54437, -59546, -65158, 76278, 60178, 43095, 82697, -81722, -29254, 147036, 174401, 272399, 205962, 140437, 74619, 230122]
15496B30122m1597r0297k03897O6433Q2257l083o856o0695R924J96708O1919j01092
15484A39846r4126k12221r5384J17870R5549P1825O801k29686n0722J78003Q3508
15473A1263J1718m4733j40303j08225l5289L2169J38351J64966Q0053j41243M6722
15462A5449p888j27011j8681J01994l6579n3338p1384m4566m2480J6063O2772
15451b05649m0237O2227J1719J55617r8491J20807p588M8124P1171m875n4028
15440E8797P577R8110R6664r3248m6559N5381j1989M439J47442j79950j82469
15429d5805R2546K3274p1164j9469J24254J16473n2782j81045j90043Q5886O4732
15418e3143M3855j13644O3775K61187P8762j8935L1413k29091J13157P5748r8553
$$ y = [230122, 188525, 98228, -105669, -39236, 43021, 39938, 33082, -27613, -17689, 179019, 240938, 139846, 45720, -166501, -261885, -144015, -48466, 23359, 30160, -199526, -250248, -72245, 11263, 22981, -21752, -162055, -270280, -305569, -273400, -135049, 29917, 109970, -31273, 15449, 7561, -119450, -138131, -36137, -72716, -126054, -197438, -242004, -284484, -268421, -205649, -245886, -183659, -171940, -16323, -114814, 5993, -1595, 46529, 117700, 112825, 58797, 66374, 164484, 261148, 167900, 121341, 176722, 164733, 169172, 316614, 136664, -45805, 46741, 70015, -1149, -20618, 103636, 220109, 167327, -13718, -203761, -117875, -53143, -9288, -122932, -59157, 202030, 280792, 261857, 293270, 64179, 177336, 253084, 154531]
15407A54531q3161J8811r9040n911K4257k06683L0903N0358j572O6272o7598J3088
15395a05745N1510J6779m6304o9475o9005J43782J30406o054j9735l3838Q0675
15384G2996J56358o7811j29202p1868j96021P7743K20554J57017q6575j09930
15374B3261j10664K1032o9197q5391o6743K11272J17498r7294L3548K07624k4108
15363A60838j17197j0243L9630L9861n6957j49470j2399m6784n5366J74068J63219
15352A29200J20800n6048k27235q843L609j43649J06402J03775o8495J06543m1462
15341B4597k5042J51101j3722O500q4221Q8069K5075Q2630j19196j39290j36705
15330a40204J03916J02167m6327Q1484L4052j68221J61436M4928n3735m5803K7469
$$ y = [154531, 71370, 90181, -8859, -14770, 9487, -197196, -166293, -115935, -117507, -51235, -118833, -105745, -54235, -37456, -83760, -153235, -222240, -78458, 51948, 45894, 26159, -7679, 72996, 229354, 161543, 32341, -39527, -235548, -157805, 62749, 219766, 133191, 23261, -87403, -66371, -135568, -220959, -287702, -76430, 41068, -56226, -22678, 184946, 160838, 43641, 33398, 73028, 112889, 55932, -93538, -105937, -152721, -208087, -34019, 129200, 250000, 193952, -33283, -42126, -38517, -182166, -75764, 28011, -40484, 66059, 24597, -445, 150656, 136934, 143434, 59213, 147282, 172357, 254987, 135791, -3499, -140204, -36288, 65879, 19552, 101036, 135088, -33133, 128303, 173231, 119496, 73693, 101162]
15319A01162J05082R8052n0326j38711o008M4856j01429j4433K5617p5711n5802
15308f7651K83J33041r3043j17881l5222p7751o0265L6369J84145L1282k2130
15297h8823M8420l963M3765Q4854P1906P1277j44782O5403r0284j30102m2518
15286a14847J3305K2163m0305O2348r0360M9566K09569L3827j40966j29426O1534
15275f3592k1563j2526J29687J85363K4554n2672K0815j66978j48375j78376J67134
15264a16529J67414q7275j47809k7855J09472J20063R5649j58271N5965Q7280
15254I8104o7465o2491K0168l9428l8950L2688r8163q735L3672k0510j6295L432
15242a63973R7611J13514j5052j32727k0142Q1511K4292k69071L3017K92292P3593
$$ y = [101162, 206244, 304296, 253970, 115259, 109251, 154107, 52678, 38245, 63862, -11849, -67651, -67368, 65673, -27370, -145251, -180473, -258224, -318489, -282120, -97975, -66693, -88823, -40403, -44366, -601, 84253, 156159, 227436, 82654, 148057, 57773, -72329, -114847, -101542, -79379, -119684, -57336, -147696, -98130, 111439, 145266, 4300, -125126, -63592, -85155, -97681, 32006, 217369, 241923, 189251, 210066, 43088, -105287, -283663, -116529, 50885, -36390, -184199, -212054, -102582, 17481, 113130, -45141, 10824, 98104, 30639, -31852, -11684, -51112, -90062, -57374, -155537, -164272, -130600, -151110, -167405, -163973, -66362, 47152, 32100, -100627, -120769, -39258, -14966, -284037, -251020, 41272, 114865]
15231A14865L9772J79527J13834J51392l2407m7606o7495L9733M4081j8212j44094
15220C73390k07052j24409J76366Q8790r4484n8521j55883o1489O428j2611K7127
15209d2348P8253m9399r1415M3158l5430J90212j2059k9330J06701j40175k15863
15198a97695m9319K6200j1402J01567l7024N3773J51631p4310J2259K58328M8949
15187B82957k54061r239J49311P2326K0414k1666j05643q9376j22220K8465k199
15176e0931L3221Q8575R3042m7413L7919P0236M1200p5323J1723r0334k34857
15165a22942p7657J05075J84713J18891O1994J36561O9675q4467j09639L8949
15155C21153j18595l5576j15539n6529m7387j59749J7725M4203M2462K0391l1525
$$ y = [114865, 154637, 334164, 447998, 599390, 566983, 519377, 451882, 491615, 535696, 517484, 373390, 166338, 41929, 218295, 307085, 212601, 154080, -1803, -63292, -56864, -69475, -42348, 35905, -13494, -104909, -61751, -97181, 93031, 80972, 51642, 158343, 18168, -197695, -247014, -220814, -232216, -130649, -167673, -113900, 37731, -36579, -24320, 234008, 282957, 28896, 19657, 168968, 241294, 261708, 240042, 134399, 45023, -77197, -48732, -50931, -17710, 70865, 163907, 116494, 154413, 224649, 265849, 190526, 202249, 111915, -122942, -200599, -95524, 89189, 208080, 270074, 406635, 476310, 391843, 282204, 321153, 202558, 166982, 51443, -5086, -52473, -212222, -194497, -150294, -107832, -87441, -118966]
15144a18966J53281K59940j59770l04013J06656P0879q8046l8466p4318j67022
15134c59845o3130J08025K60251M9451p0273m9716Q6221N0794j06640o9877j0933
15123a75672l0611L7063L2605J06509R6935j85462j52648J7883K01560J1277j4620
15112e5181k9364K8122O2623J36365R665m7081j67477k18374N1072J42804O2346
15101b4480l3288L2014R3799j11259j91320k9339J76023P6001j22721q0054P6983
15090a37641J85978M6338J1678L3388r6735j48773m1904M2825p055M4744K50669
15079A83512q4119n8847j0173P4601k14118r698J36569p1667l4444L0709J38627
15068H0952N7225J1197N3640r589j39120j28301j2009l3268K00922N628j51847
$$ y = [-118966, 34315, 294255, 134485, -169528, -62872, 8007, -80039, -118505, -192823, -359845, -422975, -314950, -54699, -5248, -75521, -125237, -39016, 11778, -94862, -164739, -175672, -206283, -169220, -136615, -30106, 66829, -118633, -271281, -253398, -51838, -40561, -55181, -84545, -56423, 6200, 142565, 152230, 105149, -62328, -280702, -229630, -86826, -24480, -57768, -25754, 68045, -43214, -234534, -263873, -87850, -11849, -134570, -214624, -137641, 48337, 94675, 106353, 139741, 43006, -105767, -147671, -104846, -111901, -67157, 183512, 99393, 40546, 30373, 104974, -109144, -118842, 17727, -53940, -88384, -57675, 80952, 138177, 149374, 203014, 193425, 54305, -73996, -86005, -119273, 81649, 87277, -64570]
15057f4570K5466J53334j25447j18698o2457K42231J5966q3591j22071r6022j47667
15046c83526J28261o6822n3673K54878Q6208j72007J16057J6426o175J82583R0020
15035A92230q650K2698n6047q6659P5384j57786j48022P6328O9055j87164j4062
15024b22695J10709o7236M0155l1715M1173J7599L1915J41321l8217p8742j23108
15013a78841r257K06217N8600n2226r3533J08946J28507p0074J39140k0083j42838
15002G4558j90573r4921k0833J14814K5654J19295j4254k22652K7418K07267J68306
14991A94079N5408q6207o4327j47041j26022J54990J04753m9025j6700o0654j4258
14980e5004R3068J78870j02074m5107J25276m9823k15448o1181N2877N5012o1956
$$ y = [-64570, -39104, 114230, -11217, -129915, -192372, 49859, 65825, -17766, -139837, -235859, -383526, -255265, -322087, -375760, -120882, -34674, -206681, -90624, -74198, -80373, 102210, 192230, 183580, 206278, 150231, 63572, 138956, -18830, -166852, -90524, -21469, -208633, -222695, -111986, -179222, -139067, -170782, -129609, -112010, -80095, 61226, 23009, -55733, -178841, -188098, 18119, 76719, 24493, -69040, 39906, 168413, 98339, 237479, 217396, 74558, -116015, -210936, -231769, -116955, -91301, 27994, 13740, -208912, -181494, 25773, 194079, 249487, 163280, 98953, -48088, -174110, -19120, 85633, 36608, 19908, -40746, -55004, 38064, 216934, 114860, 69753, 195029, 145206, -70242, -131423, -78546, -23534, -85490]
14969h5490j29227J14633L1804J00871j0628J26265M9538q5773O6602L622j55651
14958B6566m499Q7466J01559j626k34413j52371o2343l3321J41916J00585M5888
14947A5407O7510O7096N6930j7465N947k03345k25642Q1056R0195N0982l256N8911
14935D4326l3693J29406q8170n270J41310p6718j02495M2004j4156K9999J42960
14924B09503j09982k6265l326k08884j81574P5096Q2338J14841l000J05900J47863
14913B02510J4138k08881j26219M4649k9390J3890o0618j0269p0452Q906M5664
14902a76072L91R5322J68292J3394J32392q7312n5752K6322j41963P425j43778
14891a61339o0302K36382J58521P9022R219R084K7368n9604k8722j48937o9526
$$ y = [-85490, -214717, -100084, -68280, 32591, 21963, 148228, 197766, 111993, 178595, 182217, 26566, 22067, 109533, 211092, 209466, -24947, -177318, -239661, -272982, -131066, -30481, 15407, 82917, 150013, 206943, 189478, 195425, -7920, -233562, -152506, -62311, -11329, -14585, 44326, 10633, 140039, 51869, 46599, 187909, 111191, 8696, 50700, 36544, 66543, 209503, 99521, 73256, 69930, -138954, -320528, -245432, -163094, -48253, -51253, 54647, 202510, 216648, 7767, -118452, -73803, -103193, -89303, -149921, -160190, -230642, -221736, -176072, -175681, -80359, 87933, 101327, 233719, 146407, 90655, 116977, -24986, -17561, -161339, -221641, 14741, 173262, 252284, 261503, 270587, 297955, 238351, 209629, 60692, -8834]
14880h834J51165J37152o1118r8534L5108J14433q0478p8849J89635P9143j14120
14869B64703j01537j34445j3564O3988K14101M9392k40113j01014r6071L0624
14859f3936j43714j8918j09144j3569O8378m789Q4368J99814J72464N1791N3517
14848B76262n0933m6455O673K803o0079J8155n2167p5446N4023R6234M3880K2324
14836B35274l07674l1754K38973J71072L4667j79800j21813m2492k18692j088
14826b23327k3698k4794j8751l8916k5754J07257J2920O8784m6105J90468J15312
14815I3396j37857j68109J76623K14587j77450m8279k092J06734j4762K6985J73942
14804B43718O2035j83578j14294q6875R0671R6106j45827q4678m6438k4863j52900
$$ y = [-8834, 142331, 279483, 218365, 119831, 154939, 269372, 188894, 110045, 299680, 378823, 264703, 163166, 28721, 15157, 79145, 293246, 342638, 102525, 1511, -94560, -63936, -207650, -226568, -335712, -349281, -280903, -285692, -201324, -1510, 170954, 222745, 276262, 225329, 178874, 185547, 188350, 128271, 146426, 94259, 18813, 72836, 169070, 212950, 235274, -72400, -104154, 134819, 305891, 340558, 160758, 38945, -3547, -222239, -223327, -247025, -271819, -290570, -329486, -355240, -247983, -235063, -166279, -212384, -21916, 93396, -44461, -212570, -35947, 178640, 1190, -47089, -49181, 57553, 42791, 69776, 243718, 305753, 122175, 7881, -78994, 11677, 107783, -38044, -122722, -169160, -194023, -346923]
14793c46923n0276J90466K08593J26823j0165l3243k2115j25854j39939N9085
14783a43548J37938K3467l0350L8170l9715O3664n2584n7073P8901K4400K8473
14772G1743N4114L324j36470Q3918J51459K65338j961j11006k25749K10246m6534
14761C18422n8691n3535p8495N2156r3110n7468Q5708j45803j5820K3317Q3254
14750E9935K9040L6563K6714M0209p0239j18252k3768L0874L1821q7025l0380
14739g4508J14930J78052j18334j64757j6558Q1087L6637j44190J5997J2000N467
14728g4177m9648Q9830o8233K4500J01793m4314P12J7558M3697l4057n2656Q6776
14716D1781J5615o6629j10465n9301J33484L7594N4929J9096L9004j8895q310
$$ y = [-346923, -397199, -206733, 1860, 128683, 118518, 85275, 63160, -62694, -202633, -143548, -5610, 17857, -12493, 25677, -14038, 49626, -2958, -60031, 18870, 43270, 71743, 125857, 129181, -7289, 76629, 228088, 493426, 491465, 380459, 154710, 364956, 318422, 259731, 206196, 127701, 179857, 86747, 29279, 114987, -30816, -46636, -23319, 59935, 88975, 125538, 152252, 192461, 122222, 3970, -19798, 11076, 42897, -44128, -74508, 40422, 218474, 100140, -64617, -81175, -88, 36549, -107641, -91644, -79644, -74177, -123825, -33995, -102228, -77728, 24065, -20249, -19537, -1979, 41718, 7661, -44995, 41781, 57396, -9233, -119698, -178999, -45515, -7921, 47008, 66104, 105108, 86213, 77903]
14705G7903o1311O9976K08718O5950N6853j4422k28650j22126n0528N2060Q1016
14694A35439O7312j21129l6522j18569J12531J37394n4559j00737j1662K0096
14684B9594n7598J3425k5594J20886J16834n4920j33312R9127K2264j24717m4269
14673c8280O7645l3529j23392P1915J50871L8092M0891l595l4629n9933k25317
14662a49261k3985J44949J12065k09617J4884N3109q2727l6362Q1382n7441J21500
14651c1504J68326k3693k04804j95168l999J44130r2499J70387K6736j92453O0663
14640a73878J08111J35733J70269O8664j05752p8160j13417k8298J45706K7249
14630A56227P1303j49021j12956J67788Q0862j99373m2318J01076j42678n1355
$$ y = [77903, 16592, 86568, 295286, 361236, 418089, 403667, 175017, 52891, 2363, 54423, 135439, 202751, 81622, 45100, -73469, 39062, 176456, 121897, 21160, 9498, 29594, -28004, -14579, -40173, 80713, 197547, 142627, 9315, 108442, 130706, 5989, -38280, 29365, -4164, -127556, -55641, 95230, 133322, 174213, 170618, 135989, 76056, -149261, -173246, -28297, 83768, -125849, -110965, -57856, -140583, -176945, -95563, -153004, -31504, 136822, 113129, -91675, -286843, -290842, -146712, -239211, -68824, -42088, -234541, -173878, -65767, 69966, 240235, 308899, 203147, 124987, 11570, -16728, 128978, 156227, 227530, 78509, -34447, 133341, 214203, 14830, -27488, 73588, -69090, -120445]
14620a20445N6898N3112J0479J4582O965l0402k0544l8237M362J43599J94524
14609B74893k1283j5381n5089J47676K12832K08154L2169o5216Q2030K15706J60933
14598A177424J04515K11376L49841L32568L75217K97393L8638L27108K34934R8838
14588C547852l7809O7698k40428l63469l40205l05380j88991k48441l34229m02949
14578A153649k54959j09716r5857j5903J26602L1577m9059j27j44773j39991J67213
14567F68656J46924O7049J0642K5354k4002N1539K8678m5425L8822K02220R7366
14556A267823q1888J04365J22183r6344j05467j22801k85686r0660P1159j70058
14546F12626k27596M8274o2866j18456k924N6595j02659m9309k2491J52469J65703
$$ y = [-120445, -63547, -10435, 44, 14626, 21591, -8811, -29355, -67592, -63230, 80369, 274893, 253610, 238229, 183140, 330816, 543648, 751802, 783971, 718755, 800785, 1016491, 1177424, 1281939, 1493315, 1843156, 2175724, 2550941, 2848334, 2886972, 3214080, 3449014, 3547852, 3510043, 3577741, 3337313, 2973844, 2633639, 2328259, 2139268, 1890827, 1556598, 1153649, 898690, 788974, 693117, 677214, 803816, 835393, 786334, 786207, 641434, 501443, 668656, 815580, 882629, 893271, 918625, 894623, 946162, 974840, 929415, 968237, 1170457, 1267823, 1185935, 1290300, 1412483, 1316139, 1210672, 1087871, 802185, 711525, 782684, 612626, 385030, 433304, 370438, 251982, 249058, 305653, 202994, 153685, 131194, 283663, 449366]
14535D49366O3266J43595k23653k56223r1455J58069R6306P748O7744K09993K35917
14524H60673r9022j13109O123p7222j74887K044J44M8437r0435N7562k2031j75915
14512B22362j11154o1743m597J18106o9703K7996l7134O8545J41153N7939k2125
14501C29645J41918o4570q9207m4603Q156J3909p614J8118M398O308P2905o0504
14489C28859p94m0407k30492n9419j60649K2177j7496j10198N6233J70401P244
14478c4541l7605J13456Q6886m0896j5283j12952q6145j4005Q3316K5903J22528
14467I0662J01248R184n0061j30872j48217j8407K95956K18439q8160j58441k03154
14456h1823o9192N7043p8193l7968J09155J48256N4982j48644L4787R2201K13457
$$ y = [449366, 512632, 656227, 432574, 176351, 84896, 242965, 339271, 347019, 414763, 624756, 860673, 761651, 648542, 654665, 577443, 402556, 404600, 404744, 453181, 362746, 420308, 398277, 222362, 111208, 49465, 44868, 162974, 93271, 121267, 84133, 152678, 293831, 351770, 329645, 471563, 406993, 317786, 273183, 281339, 295248, 287634, 305752, 310150, 316458, 389363, 328859, 328065, 287658, 57166, -2253, -162902, -140725, -158221, -268419, -212186, -41785, -34541, -72146, 41310, 128196, 87300, 72017, -40935, -127080, -141085, -57769, -31866, 90662, 191910, 201094, 151033, 20161, -128056, -146463, 149493, 367932, 279772, 121331, -81823, -151015, -93972, -172165, -210133, -100978, 47278, 102260, -46384, -11597, 80604, 294061]
14445B94061k9956j61204q7777o6122j08859M9143J60567J61413l9155p2252J73223
14434B73082k0442j75632R566J28513Q956j50187q6030o1283O9356J03967j25042
14423b5176j81054o6608p3843j59420P364L13959J66142J57172N7998K8612j9038
14412B06108N6437J23108q8093j60021J9137J20644M6407l3492j730Q6588P4361
14401D49454n1991k63228q6697J25074M1622p3017J51934N3273m4305N5496q8327
14390B69288R657r4351k07182j1399p6540j51602P8746J47311q3503m402J39210
14379A5233P2431M5032p3046n4532J73161l081N0465R252J2448r5957n8020j711
14367I1675N665R5198j208J40154J38376K89663j68361l61261j80219k3967J39149
$$ y = [294061, 264105, 102901, 15124, -50998, -159857, -110714, 49853, 211266, 172111, 99859, 273082, 252640, 77008, 86574, 215087, 224043, 73856, -12174, -73457, -4101, 99866, -25176, -206230, -272838, -346681, -506101, -498737, -184778, -18636, 138536, 196534, 225146, 206108, 262545, 385653, 297560, 137539, 156676, 277320, 323727, 290235, 288505, 375093, 449454, 397463, 134235, 47538, 172612, 214234, 141217, 293151, 346424, 302119, 357615, 269288, 278945, 184594, -22588, -33987, -110527, -262129, -183383, -36072, -119575, -123977, 15233, 87664, 132696, 59650, 5118, 178279, 175198, 225663, 234915, 247363, 151406, 93386, 91675, 97340, 192538, 191330, 331484, 469860, 759523, 591162, 229901, 49682, 25715, 164864]
14356A64864Q578j9135Q8228Q770j97802M610J18654l574l9400J6345L6427m3144
14344A43421j85279l129O2939J04375J5651Q3932Q2487n5155n5453m9020J37785
14333B82554n5319m672o6245K08082K60402j33663k90702n333P2668p816n3841
14322B06115q7316J4105R760L9632q667o3080O3993n9893M5360q228L8018J1287
14310B01086K81473k00498o4421K3683Q601N6480J06133o0716K6492j59412k8488
14299A90413J35395J34212l1430j19950n4234J7702O4136O2357l3606K7130j10900
14288B81225q0039J4346l1291q8878K12115J34733j22011q1188j2419r3779L8126
14277A70940K7515K308Q6024J9724K8071J77425N6081j65924l2117l1211q2938
$$ y = [164864, 173442, 154307, 242535, 251305, 53503, 58113, 176767, 173193, 133793, 150138, 186565, 143421, -41858, -44987, 17952, 122327, 137978, 221910, 304397, 249242, 193789, 144769, 282554, 227235, 222563, 156318, 364400, 624802, 491139, 200437, 195104, 267772, 259956, 206115, 118799, 132904, 142664, 182296, 173629, 110549, 174542, 114649, 160009, 151781, 189799, 201086, 482559, 282061, 217640, 241323, 249924, 306404, 412537, 351821, 378313, 218901, 190413, 325808, 460020, 428590, 308640, 254406, 272108, 336244, 398601, 364995, 392125, 281225, 201186, 215532, 184241, 95363, 307478, 442211, 320200, 239012, 226593, 132814, 170940, 198455, 200763, 286787, 306511, 334582, 512007, 568088, 402164, 370047, 338836, 255898]
14266B55898q480r364J9244J01050q6118l6969j4253j10471J45725P3143j06313
14255B23092o7777r5899K5331O2654L6649n7273J58242K04128Q224j03275q5291
14244C08805j11408L3139L6108K7741Q4356m4213O6188n192k23722R9N7069J72862
14232D01832r1363j40075m443l9510K30685J36537K6983m4107q4531n3781l7773
14221C00454O9765J1872j40242O8903J20214r8940p2551Q7634J40865n652J0456
14210D92778l5687j74032n132O7145P1579N9639M6712P3464O3840J72278q7028
14199G45556j912P7877K52038O3254k5972q0770J53972P0092P1649P9019K30703
14188A635506J29982J40927P9696Q0114O2740J73598J51118M6120J37122P1150
$$ y = [255898, 247418, 238054, 257298, 358348, 272230, 235261, 221008, 110537, 256262, 329405, 223092, 155315, 59416, 84747, 147401, 184050, 126777, 285019, 489147, 497371, 394096, 308805, 197397, 230536, 266644, 294385, 378741, 334528, 400716, 395524, 171802, 171901, 228970, 401832, 310469, 170394, 165951, 126441, 357126, 493663, 520646, 476539, 392008, 338227, 300454, 370219, 382091, 241849, 310752, 430966, 332026, 259475, 347109, 487974, 482322, 492778, 457091, 283059, 277927, 345072, 416651, 476290, 523002, 596466, 660306, 832584, 745556, 743644, 821521, 1073559, 1136813, 1110841, 1030071, 1184043, 1254135, 1325784, 1404803, 1635506, 1765488, 1906415, 1986111, 2066225, 2128965, 2302563, 2453681, 2499801, 2636923, 2708073]
14178B708073J25756K91971M05249L35283L70561L69024L41848L45363O59064
14169E952192P84168Q02308R86741J199022J251202J467901J747784K030200K560095
14160A8781613L051079L500542M351195N326869O658396Q302799J0588927J2853740
14152G3415160J5463750J7774435J9764836K0876314K0674006J9266854J6685664
14145B03921019J2555133P770395K027485l395042q116807j1772462j4374314
14138A88615407j5800887j6257185j5462866j4003775j2308769j0220679q146133
14131I6415113o578433n188491m136578l134993k088703j061524q4624M98730
14123G4640497J594917K584599L698623M675834O036141P854915R740626J1933603
$$ y = [2708073, 2833829, 3125800, 3531049, 3866332, 4236893, 4605917, 4947765, 5293128, 5952192, 6736360, 7538668, 8525409, 9724431, 10975633, 12443534, 14191318, 16221518, 18781613, 21832692, 25333234, 29684429, 35011298, 41669694, 49972493, 60561420, 73415160, 88878910, 106653345, 126418181, 147294495, 167968501, 187235355, 203921019, 216476152, 224246547, 226274032, 222878990, 214762183, 202989721, 188615407, 172814520, 156557335, 141094469, 127090694, 114781925, 104561246, 96415113, 89836680, 84648189, 80511611, 77376618, 75287915, 74226391, 74141767, 74640497, 76235414, 78820013, 82518636, 87194470, 93230611, 101085526, 110826152, 122759755]
14115A22759755J4146989J5843093J6716647J6933595J5881945J3560740J0188707
14108B26031471N244567m1703n584335j0930697j5430446j8501298k0139964k0597205
14100A40050390j9973050j8321144j6321100j3744565j1289033r029342p390608
14093D3981548n992611m991094m134258l352847k928077k585687k314011k170173
14085A5512790j499358j128721j116556r58349j148448q92839o62085n39446n88775
14076F978213o86674o63753l85665j88348p4793k74943l84564l04115l50256l59164
14066C305938j03987r5253j9925P1295j38303j55138k06211K9759p6139n5616
14056B556420o0002k46065L8809n5865k21500k00177j60213j04350n7319j80714
$$ y = [122759755, 136906744, 152749837, 169466484, 186400079, 202282024, 215842764, 226031471, 231276038, 231234335, 225650000, 214719303, 199288857, 180787559, 160647595, 140050390, 120077340, 101756196, 85435096, 71690531, 60401498, 51372156, 43981548, 37988937, 32997843, 28863585, 25510738, 22582661, 19996974, 17682963, 15512790, 14013432, 12884711, 11768155, 10809806, 9661358, 8768519, 8106434, 7566988, 6978213, 6291539, 5627786, 5242121, 5053773, 4978980, 4704037, 4319473, 4015358, 3665102, 3305938, 3201951, 3106698, 3086773, 3158068, 3019765, 2864627, 2658416, 2688175, 2612036, 2556420, 2496418, 2250353, 2289162, 2233297, 2011797, 1811620, 1651407, 1547057, 1489738, 1309024]
$$ [...]
##END NTUPLES=NMR SPECTRUM
##END=
