##TITLE=Analysis number 325301
Compound Code cc 52404
Book Reference 464/80/1
Project Code adrs
Chemist Name chrisr
##JCAMPDX= 6.0         $$ Bruker NMR JCAMP-DX V2.0
##DATA TYPE= NMR SPECTRUM
##DATA CLASS= NTUPLES
##ORIGIN= Bruker BioSpin GmbH
##OWNER= nmr
$$ XWIN-NMR		Version 3.5
$$ Mon Dec 18 11:02:51 2006 GMT Standard Time (UT+0h)  MAYBRIDGE\nmr@NMR_250MHZ
##.OBSERVE FREQUENCY= 250.131544655141
##.OBSERVE NUCLEUS= ^1H
##.ACQUISITION MODE= SIMULTANEOUS (DQD)
##.ACQUISITION SCHEME= undefined
##.AVERAGES= 16
##.DIGITISER RES= 18
##SPECTROMETER/DATA SYSTEM= dpx250
##.PULSE SEQUENCE= zg30
##.SOLVENT NAME= CDCl3
##.SHIFT REFERENCE= (INTERNAL, CDCl3, 0, 16.5247)
##AUDIT TRAIL= $$ (NUMBER, WHEN, WHO, WHERE, WHAT)
$$ ##TITLE= Audit trail, XWIN-NMR		Version 3.5
$$ ##JCAMPDX= 5.01
$$ ##ORIGIN= Bruker BioSpin GmbH
$$ ##OWNER= nmr
$$ C:\u/data/dgb/nmr/ADRS/1800/pdata/1/auditp.txt
$$ ##AUDIT TRAIL=  $$ (NUMBER, WHEN, WHO, WHERE, WHAT)
(   1,<2006-12-18 11:02:26.78 +000>,<MAYBRIDGE\nmr>,<NMR_250MHZ>,
      <created by zg, POWCHK disabled, PULCHK disabled
       configuration hash MD5:
       49 4B E0 1D 92 C2 6B 37 9F E6 65 BC 52 41 86 1D
       data hash MD5: 64K
       88 CC 0D B8 FE E7 90 A3 3E 79 DB C2 88 09 8B 8C>)
(   2,<2006-12-18 11:02:41.78 +000>,<MAYBRIDGE\nmr>,<NMR_250MHZ>,
      <Start of raw data processing
       ef LB = 0.3 FT_mod = 6 PKNL = 1 SI = 32K 
       data hash MD5: 32K
       BF FE 23 E4 90 D3 D5 58 C3 08 EC 0F 01 1C D2 6C>)
(   3,<2006-12-18 11:02:43.35 +000>,<MAYBRIDGE\nmr>,<NMR_250MHZ>,
      <apk 
       data hash MD5: 32K
       B5 F9 C9 31 0D C1 EC 1D B7 FA 60 49 34 4C AF C0>)
(   4,<2006-12-18 11:02:44.10 +000>,<MAYBRIDGE\nmr>,<NMR_250MHZ>,
      <abs ABSG = 5 
       data hash MD5: 32K
       26 FC D9 7B 38 3F C9 59 9E F6 5F 8A AA 4A 7F A0>)
$$ ##END=
$$ 
$$ hash MD5
$$ 26 09 64 77 46 28 3B 8B FF 5A 59 2B 7C ED C3 9F
##$RELAX= 
##$RELAX= 
##$RELAX= 
##$RELAX= 
##$RELAX= 
##$RELAX= 
##$RELAX= 
$$ Bruker specific parameters
$$ --------------------------
##$DU= <C:\u>
##$EXPNO= 1800
##$NAME= <ADRS>
##$PROCNO= 1
##$TYPE= <nmr>
##$USER= <dgb>
##$AMP= (0..31)
100 100 100 100 100 100 100 100 100 100 100 100 100 100 100 100 100 100 
100 100 100 100 100 100 100 100 100 100 100 100 100 100 
##$AQSEQ= 0
##$AQ_mod= 3
##$AUNM= <au_zg>
##$AUTOPOS= <8 >
##$BF1= 250.13
##$BF2= 250.13
##$BF3= 250.13
##$BF4= 250.13
##$BF5= 500.13
##$BF6= 500.13
##$BF7= 500.13
##$BF8= 500.13
##$BYTORDA= 1
##$CFDGTYP= 0
##$CFRGTYP= 5
##$CHEMSTR= <none>
##$CNST= (0..31)
1 1 145 1 1 1 1 1 1 1 1 1 1 1 1 1 1 1 1 1 1 1 1 1 1 1 1 1 1 1 1 1 
##$CPDPRG= <>
##$CPDPRG1= <>
##$CPDPRG2= <>
##$CPDPRG3= <>
##$CPDPRG4= <mlev>
##$CPDPRG5= <mlev>
##$CPDPRG6= <mlev>
##$CPDPRG7= <mlev>
##$CPDPRG8= <mlev>
##$CPDPRGB= <>
##$CPDPRGT= <>
##$D= (0..31)
0 1 0 0 0 0 0 0 0 0.06 0 0 0 0 0 0 0.0002 0 0 0 0 0 0 0 0 0 0 0 0 0 0 
0 
##$DATE= 1166439745
##$DBL= (0..7)
120 120 120 120 120 120 120 120 
##$DBP= (0..7)
150 150 150 150 150 150 150 150 
##$DBP07= 0
##$DBPNAM0= <>
##$DBPNAM1= <>
$$ [...]
##$SUBNAM7= <"">
##$SUBNAM8= <"">
##$SUBNAM9= <"">
##$SW= 20.6930455092707
##$SWIBOX= (0..15)
0 0 3 0 0 0 0 0 0 0 0 0 0 0 0 0 
##$SW_h= 5175.983436853
##$TD= 65536
##$TD0= 1
##$TE= 295.16
##$TE2= 300
##$TE3= 300
##$TEG= 300
##$TL= (0..7)
0 120 120 120 120 120 120 120 
##$TP= (0..7)
150 150 150 150 150 150 150 150 
##$TP07= 0
##$TPNAME0= <>
##$TPNAME1= <>
##$TPNAME2= <>
##$TPNAME3= <>
##$TPNAME4= <>
##$TPNAME5= <>
##$TPNAME6= <>
##$TPNAME7= <>
##$TPOAL= (0..7)
0.5 0.5 0.5 0.5 0.5 0.5 0.5 0.5 
##$TPOFFS= (0..7)
0 0 0 0 0 0 0 0 
##$TUNHIN= 0
##$TUNHOUT= 0
##$TUNXOUT= 0
##$USERA1= <user>
##$USERA2= <user>
##$USERA3= <user>
##$USERA4= <user>
##$USERA5= <user>
##$V9= 5
##$VALIST= <valist>
##$VCLIST= <CCCCCCCCCCCCCCC>
##$VD= 0
##$VDLIST= <DDDDDDDDDDDDDDD>
##$VPLIST= <PPPPPPPPPPPPPPP>
##$VTLIST= <TTTTTTTTTTTTTTT>
##$WBST= 1024
##$WBSW= 4
##$XGAIN= (0..3)
0 0 0 0 
##$XL= 0
##$YL= 0
##$YMAX_a= 286117
##$YMIN_a= -462767
##$ZGOPTNS= <>
##$ZL1= 120
##$ZL2= 120
##$ZL3= 120
##$ZL4= 120
##$ABSF1= 16.5247
##$ABSF2= -4.168472
##$ABSG= 5
##$ABSL= 3
##$ALPHA= 0
##$AQORDER= 0
##$ASSFAC= 0
##$ASSFACI= 0
##$ASSFACX= 0
##$ASSWID= 0
##$AUNMP= <proc_1d>
##$AZFE= 0.1
##$AZFW= 0.1
##$BCFW= 0
##$BC_mod= 0
##$BYTORDP= 0
##$COROFFS= 0
##$CY= 12.5
##$DATMOD= 1
##$DC= 0
##$DFILT= <>
##$DTYPP= 0
##$F1P= 14.0000005364418
##$F2P= -0.99999901652339
##$FCOR= 0.5
##$FTSIZE= 32768
##$FT_mod= 6
##$GAMMA= 0
##$GB= 0
##$INTBC= 1
##$INTSCL= 1
##$ISEN= 128
##$LB= 0.3
##$LEV0= 0
##$LPBIN= 0
##$MAXI= 10000
##$MC2= 0
##$MEAN= 0
##$ME_mod= 0
##$MI= 0
##$NCOEF= 0
##$NC_proc= -5
##$NLEV= 6
##$NOISF1= 0
##$NOISF2= 0
##$NSP= 0
##$NTH_PI= 0
##$NZP= 0
##$OFFSET= 16.5247
##$PC= 1
##$PHC0= 226.3436
##$PHC1= 6.422848
##$PH_mod= 1
##$PKNL= yes
##$PPARMOD= 0
##$PSCAL= 4
##$PSIGN= 0
##$REVERSE= no
##$SF= 250.12999932409
##$SI= 32768
##$SIGF1= 0
##$SIGF2= 0
##$SINO= 400
##$SIOLD= 32768
##$SREGLST= <1H.CDCl3>
##$SSB= 0
##$STSI= 32768
##$STSR= 0
##$SW_p= 5175.98343685301
##$SYMM= 0
##$S_DEV= 0
##$TDeff= 65536
##$TDoff= 0
##$TI= <Analysis number 999999
Compound Code 99
Book Reference 9
Project Code 9>
##$TILT= no
##$TM1= 0
##$TM2= 0
##$TOPLEV= 0
##$USERP1= <user>
##$USERP2= <user>
##$USERP3= <user>
##$USERP4= <user>
##$USERP5= <user>
##$WDW= 1
##$XDIM= 32768
##$YMAX_p= 541119592
##$YMIN_p= -1063196
$$ End of Bruker specific parameters
$$ ---------------------------------
##NTUPLES= NMR SPECTRUM
##VAR_NAME=  FREQUENCY,     SPECTRUM/REAL,   SPECTRUM/IMAG
##SYMBOL=    X,             R,               I
##VAR_TYPE=  INDEPENDENT,   DEPENDENT,       DEPENDENT
##VAR_FORM=  AFFN,          ASDF,            ASDF
##VAR_DIM=   32768,         32768,           32768
##UNITS=     HZ,            ARBITRARY UNITS, ARBITRARY UNITS
##FACTOR=    0.157963299565203, 1,           1
##FIRST=     4133.32324105094, 0,            0
##LAST=      -1042.66019580207, 0,           0
##MIN=       -1042.66019580207, -1063196,    0
##MAX=       4133.32324105094, 541119592,    0
$$ Real data points
##PAGE= N=1
##DATA TABLE= (X++(R..R)), XYDATA
$$ [...]
24424C7217R0761j2309M3828m5772q8528j49903J1900L8075K5278O2946j8682
24413e189r4055L9008l107o0066M4476l9263j3663J8157P960o9215k012J8787
24401a58182M9085J6798O4461l9965L5231K5767Q1766o8969j37529m0686M2942
24390a29281M7504o1702K6210O8679m1948r9229J0190n1432J8515J39457N7785
24379a5252l3457P828N2748M6182j12167m5503m2825R3232M3764Q4688q1024j03837
24367a05623o7855N3131M4861r630L9416M0527L1750Q7529k1702Q549j07428o1457
24355f7932M6840J5075J7160l1884O6994P5215L0372k1550k3306o1221J2942L8870
24343I7575n3345R0487l1151k4173j7943j517L7037O0061k5881j01527K0177j37347
$$ y = [37217, 127978, 115669, 159497, 113725, 25197, -124706, -112806, -74731, -49453, 13493, -5189, -99244, -60236, -63343, -123409, -78933, -118196, -131859, -113702, -105742, -174957, -176969, -158182, -109097, -92299, -27838, -67803, -32572, -6805, 74961, 5992, -131537, -172223, -129281, -81777, -143479, -117269, -48590, -90538, -189767, -179577, -231009, -212494, -73037, -15252, -48709, -40881, 11867, 58049, -54118, -99621, -142446, -49214, -5450, 79238, -1786, -105623, -173478, -120347, -75486, -85116, -45700, -5173, 26577, 114106, 92404, 100953, -6475, -67932, -21092, -6017, 11143, -20741, 46253, 121468, 151840, 130290, 106984, 45763, 58705, 97575, 44230, 134717, 103566, 79393, 61450, 59933, 96970, 157031, 131150, 29623, 49800, -87547]
24331h7547j32163J33554Q0215m7788j5629Q787M2770N0950q5994j12552Q7037
24320g8360J02265o8526M2833J6733K8780p2900r3359l2774J6808M4263m3272
24309a37509M6420O6386N8084o1091k8447p4033p245P9540n7870K7036M1301J34339
24297H6911J4353r5365m390k0553O9612n1511n5281M2818K3446o7397O047L2617
24285a8693J9723Q85j6260N2236J17883o8722K6251o9791p6796k4797q2651k4632
24273a65364R3765J45239M4630l9610n0320J2282P459r6877m3086M9171L1540
24262a1171N1731l2288o4797o8864j6200P9248m021j61492j2565L8605P5576R5826
24250c0412k0742m4973P3034J34552J1528p9726Q994J00681l4007n1442K2100
$$ y = [-87547, -219710, -86156, -5941, -53729, -69358, -60571, -17801, 33149, -52845, -165397, -78360, 23905, -44621, -1788, 14945, 43725, -29175, -122534, -155308, -138500, -94237, -137509, -91089, -24703, 33381, -27710, -56157, -130190, -137435, -57895, -115765, -88729, -47428, 86911, 101264, 5899, 1509, -19044, 50568, -943, -56224, -13406, 10040, -57357, -51310, -18693, 1030, 1915, -14345, 37891, 155774, 87052, 113303, 43512, -33284, -58081, -140732, -165364, -71599, 73640, 118270, 78660, 28340, 40622, 48081, -48796, -91882, -42711, -11171, 40560, 8272, -56525, -125389, -141589, -62341, -66362, -227854, -240419, -201814, -126238, -30412, -51154, -96127, -23093, 111459, 122987, 43261, 52255, 152936, 118929, 67487, 89587]
24239H9587o4882o5813K3681N1649p272q8924k7813q12k3529l7324J40827n2239
24227f2864r889N4820K2959J9930r1102n741j6824l1747Q9063p444P7583J9021
24215E7765K9497N914n2865k4086j1268k0071l8062J6984N240Q400Q0369j5105
24203D2712K5527N5676q3690k4359m6640m5685N9779J08572N2725m0592j02363
24192A662j01574l2214J16561m0363O2665O754M124k4994q00L5315Q2697N690
24180A15523n0238m3057M1704P8331o2419o8738Q2814N2181n084n2858k6854n7926
24168C379r697P1355R898J784J1977O576l5805q2850n4554J1024n2800l1900q8305
24155b39918k0008J00608J089J823N3742J58383O6555l6350j44513m2818k7529
$$ y = [89587, 24705, -41108, -17427, 34222, 26950, -61974, -89787, -90599, -114128, -151452, -10625, -62864, -72753, -17933, 5026, 24956, -66146, -71887, -88711, -120458, -31395, -38839, 38744, 57765, 87262, 93176, 40311, 16225, 4957, -15114, -53176, -36192, -30952, -22552, 57817, 42712, 68239, 123915, 40225, 15866, -30774, -76459, -16680, 91892, 144617, 104025, 1662, -99912, -132126, -15565, -55928, 6737, 13491, 17615, -7379, -8179, 27136, 109833, 115523, 65285, 22228, 63932, 142263, 79844, 11106, 93920, 146101, 141017, 88159, 61305, 3379, -6318, 65037, 74935, 76719, 88696, 95272, 59467, -23383, -77937, -66913, -119713, -151613, -239918, -259926, -159318, -158229, -156406, -102664, 55719, 122274, 85924, -58589, -101407, -128936]
24144a28936K986R3242L2378K3585j6403m9273k886J6519J7011j5892l1555q6890
24132a46114O9330N8735L9106L9313k2548K3901k6964j0800j4030k620k3256M9888
24120C3941R6815J18480j7325j48168k2501L1489M1440o2238M2334J56109J574
24109B71950j64294k6014k9722p8146m4762R933J272M5783j40396l3615L1812
24098a56199J00874M8438M4652o1133n2211J4n6662r8126L0293J69667M9397j1827
24086G177J6933O4243j2440m2166j02686m0048J02450J10253L4791L340j02091
24075C9756M8833M5197q5016m3645k9498J6650j23225k3376j8979O5942Q9852
24064a7509K9586J43208k2843j78669M1559O0669K7577o0577j00944M0021L9988
$$ y = [-128936, -125950, -32708, -330, 23255, 6852, -42421, -45307, -28788, -11777, -27669, -59224, -146114, -76784, -18049, 21057, 60370, 37822, 61723, 34759, 23959, 9929, 7309, -15947, 33941, 130756, 249236, 231911, 83743, 61242, 92731, 134171, 71933, 114267, 270376, 271950, 107656, 81642, 51920, -26226, -70988, -61055, -59783, -14000, -154396, -188011, -156199, -55325, -6887, 37765, -23368, -75579, -75565, -132227, -230353, -200060, -30393, 19004, 7177, 24110, 88353, 75913, 33747, -68939, -108987, -6537, 103716, 138507, 141847, 39756, 88589, 133786, 48770, 5125, -24373, -7723, -130948, -154324, -173303, -107361, -17509, 12077, 155285, 132442, -46227, -4668, 56001, 83578, 23001, -77943, -37922, 2066]
24053B066J8979p154R4799O1697r842k7115q3560k2717M620L0986o1781n5759
24041e4781q03K3006K47O1275M9999J152k7700k1365o8739p6903Q4226M8492j41574
24028a23468n5916J10226Q885l4711J9740P6207M7047j2182o078n7192p334m9684
24016h4460M4935Q4160l0086p6280K1224K7242J40112k9401l6643j07525l0937
24005g7659l0874m9654j9690N5906N5572m6668r248P8202O1961n7314k7324P5184
23993H394L5012p8548P8920K9313j6198j856p1318k1454j659p69K2180k6015j12610
23980a56608l5177J65217J11629K9258l8507N9581j53284O522J4126P929O7839
23969G8525O90P6402J9365k2716J4259k08229j05647Q6499J75341P578q6443p0687
$$ y = [2066, 21045, 13891, 108690, 170387, 160545, 133430, 49870, 27153, 31773, 62759, 978, -54781, -55584, -32578, -32331, 28944, 78943, 80095, 52395, 31030, -37709, -114612, -30386, 18106, -123468, -179384, -69158, -60273, -94984, -75244, 963, 48010, 35828, 29750, -27442, -34776, -84460, -39525, 44635, 14549, -61731, -40507, -13265, 126847, 97446, 60803, -46722, -77659, -108533, -158187, -177877, -121971, -66399, -113067, -122315, -44113, 17848, -39466, -66790, 8394, 43406, -35142, 43778, 73091, 56893, 55037, -16281, -37735, -39394, -40163, -17983, -43998, -156608, -191785, -26568, 85061, 114319, 75812, 135393, -17891, -11369, 2757, 10686, 78525, 79215, 155617, 174982, 152266, 166525, -41704, -147351, -60852, 114489, 122067, 35624, -35063]
23957c5063m8962m5744o386J9075Q208L4562J27763P4366j41827j24031N1849
23946h6190O1204K5420P5215L6655m4213O2141M7303n3358l595r803K5200M4604
23934A80583K4684n5197j62600m7380J4322L5454m0414n0888M5459r2031r6805
23923b44813N1358K0116N4783M4324K459K5029J6958l460K9804j86836J0015J06894
23911g3369m0178l782j4005m1179L1098j2853P8164P2865N2175N212N0154m0383
23899F3919r4105j0045k1086o5998J9937M6178K5640n6008j4100k9945M3927N8257
23887c3429R4460j1823j22663j5955Q1899j8688L6822N1857l3636j46000k4289
23876a41445M3001J23034l7112K1589M7419p7585k1165q2967k3232K8505R3053
$$ y = [-35063, -84025, -129769, -136155, -117080, -108872, -74310, 53453, 127819, -14008, -138039, -86190, -24986, 434, 75649, 112304, 68091, 130232, 177535, 124177, 120582, 110779, 135979, 180583, 205267, 150070, -12530, -59910, -45588, -10134, -50548, -101436, -55977, -148008, -244813, -193455, -173339, -118556, -74232, -71773, -46744, -29786, -33246, -3442, -190278, -180263, -73369, -113547, -117329, -131334, -172513, -141415, -154268, -76104, -3239, 48936, 54148, 104302, 63919, -30186, -40231, -61317, -127315, -107378, -61200, -35560, -91568, -105668, -135613, -91686, -33429, 61031, 49208, -73455, -89410, -7511, -26199, 10623, 62480, 28844, -117156, -141445, -98444, 24590, -12522, 9067, 56486, -21099, -42264, -125231, -148463, -119958, -26905]
23865b6905K5981O7364M0509J43605r6043m1443q814m35j3501J0509o373M345
23853I8799r0525q82K5186J544M9697l074p6655N5796K4218l5370j2915j14721
23841g8902j646M6968K0241m6859M0674L6856O1827m1184j9359n6479K8463J1617
23829B217L4854M4379n9875k5644k7983O2980R946M3352k6003l282J2632n6561
23817A1012n2682K4673n3285L0166J60115R7195j0392L2088p3185o2700l7173
23806F5832Q218n8689l39J3634O199k8153o4630M036J60768N7693k0247r4328
23794D9994j7855j7426L039j20969M5681k6511m1919m4709q6771L5024J43459
23783g8963L0168J6131o4477P189Q9846p7401K4643k6281J9725R2489J1827p5749
$$ y = [-26905, -924, 66440, 106949, 250554, 154511, 113068, 104254, 103819, 90318, 100827, 94454, 98799, 8274, 7392, 32578, 34122, 83819, 80745, 4090, 59886, 84104, 48734, 35819, -78902, -80548, -33580, -13339, -60198, -19524, 17332, 79159, 37975, 18616, -37863, -9400, 2217, 37071, 81450, 21575, -4069, -32052, 30928, 40874, 84226, 58223, 54941, 67573, 11012, -41670, -16997, -70282, -40116, 119999, 217194, 206802, 238890, 165705, 103005, 65832, 74050, 15361, 15022, 28656, 34855, 6702, -57928, -53892, 106876, 164569, 144322, 49994, 32139, 14713, 17752, -103217, -57536, -84047, -125966, -170675, -257446, -222422, -78963, -48795, -32664, -97141, -89952, -106, -77507, -52864, -79145, -59420, 33069, 44896, -30853]
23771c0853j05909o8263M1738j4952m7215R6683J50904R9940p5662O4519J49518
23760B60448o9892j99913j10356l6277L5919L9777J44679J6554q3133o9747J1873
23749f0068J03022L517N5295N5685K5439q435j47173p0387N9226J13639j6086
23738A13674r214R1682k6018O3299o615o3797n6220m5474P1516M3012l0851l2135
23726A12859k2471l6022j22048m8522P8530O7991K2786j2669r7431j7659Q4736
23715A0080P511K2258j1847m2519r5847K5564q5912j1705P70m3882J01821Q5775
23703c7933l5365j4445L5608J12350r4902o8051j06086K3404Q2034M2584J1024
23692d9778m9559J05388L8783k661o4589k3541o7986j2403m6407m6716J46209
$$ y = [-30853, -136762, -205025, -163287, -178239, -225454, -128771, 22133, 122073, 46411, 110930, 260448, 190556, -9357, -119713, -155990, -120071, -80294, 64385, 80939, -2194, -71941, -60068, 42954, 46471, 101766, 157451, 182890, 174455, 27282, -43105, 16121, 129760, 113674, 104460, 196142, 170124, 233423, 226808, 163011, 106791, 61317, 132833, 175845, 144994, 112859, 90388, 54366, -67682, -116204, -37674, 30317, 53103, 40434, -56997, -74656, 10080, 17591, 39849, 28002, -14517, -110364, -84800, -170712, -182417, -181647, -225529, -123708, -37933, -73298, -87743, -52135, 60215, -34687, -102738, -208824, -185420, -103386, -60802, -49778, -99337, 6051, 44834, 42173, -22416, -45957, -113943, -126346, -172753, -219469, -73260]
23681g3260M2863m5622K2383k4218k6584m3252Q0789J47173K2507m024n0295J3050
23669F1510P6429j13254j936J21417N6239m7098j20525J4103q7788L4197K0607
23658A3901n5541K0930J01607O2312l4657K2102j7508k8170j03996K2115l0640
23647b7545j48542m9080O0822r755Q0485J60294L9069N6971O0733j45966j6980
23636F0506P8629M3556j36150m8195N0977P4843o1306j8295L0069l6196J8901
23625E7339l9306m7512N540q2708M9652J02872R772K7281R4504J1840J1274r5332
23613A05216k3970k7694k2580N2948P52r0047j21071K7897P4486J4791j11278
23602a20550L7537R4663J751Q807j0628n5805P444q2555l5360r429n591J13753
$$ y = [-73260, -30397, -76019, -53636, -77854, -104438, -147690, -66901, 80272, 102779, 98755, 48460, 61510, 137939, 24685, 22749, 144166, 200405, 153307, 32782, 46885, -40903, -6706, 13901, -41640, -20710, 80897, 143209, 108552, 130654, 113146, 84976, -19020, 3095, -27545, -176087, -225167, -164345, -174100, -93615, 66679, 105748, 162719, 223452, 77486, 60506, 139135, 182691, 46541, -1654, 49323, 124166, 62860, 44565, 74634, 38438, 57339, 18033, -29479, -23939, -106647, -56995, 45877, 55649, 82930, 177434, 189274, 200548, 105216, 81246, 53552, 30972, 83920, 84672, -5375, -126446, -98549, -24063, -9272, -120550, -83013, 11650, 13401, 22208, 11580, -44225, -36781, -119336, -154696, -164125, -169716, -55963]
23590e5963j32651m9875O2617O4036L2091Q0203k0978J13410L5629j9424j12731
23579c636j35382N1002J09783Q3368k8259p1692k3958J6189l7051k0131J18040
23568E8273M6245J9278n8344L4556p3033o0978k802M1461J2585K1909J39748Q4804
23556B63702n9715p2918m2657j14170j14357k7695k6790Q0402J32117K9332P939
23545E5190j6179l0387l7019k6762J2200J31217o7567p0020J08614M9783N4452
23534A63522k2261l5328P444P34l0897m5717n26N676N6126n8983p2878o5365J2928
23521h5525J15201o5705j0464N9900L1091K3855k932J7744n6666K816P2982R827
23509A12124j08556q5069M6525n469L8524K9376M0814j04369m9685j0010O5955
$$ y = [-55963, -188614, -238489, -175872, -111836, -79745, 458, -20520, 92890, 128519, 109095, -3636, -139018, -88016, 21767, 105135, 76876, 5184, -18774, -2585, -39636, -59767, 58273, 104518, 123796, 65452, 100008, 26975, -34003, -36805, 4656, 17241, 39150, 178898, 263702, 203987, 131069, 88412, -25758, -140115, -167810, -194600, -114198, 17919, 47251, 55190, 39011, 8624, -28395, -55157, -42957, 88260, 20693, -49327, 59287, 109070, 163522, 141261, 105933, 113377, 114111, 83214, 37497, 36971, 42647, 98773, 39790, -33088, -98453, -85525, 29676, -36029, -46493, 13407, 44498, 68353, 65421, 83165, 26499, 29315, 102297, 112124, 3568, -81501, -34976, -40445, -1921, 27455, 68269, -36100, -85785, -95795, -29840]
23498b9840Q40P8255k5411J7433k4899n9280J586n9136J07979n5618j55983n6051
23486b60125L3930Q6052J33508l1508l2134J7735O9807o3332Q9321K06712J08900
23475C58866j12128j61864J0184N5757r8967m4524M887n0552k2979k0554m1010
23464a22884M2253J12619k0962O350M2902n3047K8406J1385q5294p821O5702M6269
23452F5878n1114J8709L5111o6808n5819Q3324k8528r9303M5484O627r3115q1835
23440b21389J41926Q8587k8285l9320m6246J4512P2807j3987n3170P4804k3152
23429c2913k0302k038O9010M5045q6575Q8007o165k9925j95235p9339J74810j552
23417g7172p1783m3634O4368M4214l605m6588j22903k7572Q2920R6416N4627K6707
$$ y = [-29840, -29000, 49255, 23844, 41277, 16378, -42902, -41316, -100452, 7527, -48091, -204074, -260125, -226195, -140143, -6635, -38143, -70277, -52542, 17265, -46067, 43254, 249966, 358866, 246738, 84874, 95058, 150815, 51848, 7324, 12211, -38341, -61320, -81874, -122884, -80631, 31988, 11026, 17376, 60278, 7231, 35637, 47022, -38272, -46093, 19609, 65878, 14764, 33473, 68584, 1776, -54043, 29281, 753, -98550, -53066, -46439, -139554, -221389, -79463, 9124, -19161, -58481, -104727, -90215, -17408, -31395, -84565, -9761, -32913, -53215, -55253, 13757, 58802, -27773, 60234, 54069, 24144, -171091, -250430, -75620, -77172, -148955, -192589, -128221, -84007, -87612, -134200, -257103, -284675, -201755, -105339, -50712, -24005]
23405b4005j2688Q2893K5557n2357M0260k8908l4769j0874l743L3760M3330K5210
23393H3666J18180l5861j8569K7982Q9287J2247r4743j2240k4745n9759r7547
23382a2102j06880N713K193P1209M7237k2934L9319o3544M4398j1028O158K5313
23370B5052N3129n8960j27345n8863p5777Q7763R4009P827k9784m6346J705M0986
23358h6604K0706m595o0657n8555k1247J05503R365P8620n3724q389Q094l1478
23346a02961L9187j6429k0559M7552M3423Q387k1543j07825J2433M7659J22657
23335E1981N8230r5209q4892p4319L6782J16205M6729L3540m0626k132p6311m3611
23323g3633L0215N2148m6581j11427O5973O7030J32683L9757m1649o1550l7612
$$ y = [-24005, -36693, 46200, 71757, 19400, 59660, 30752, -4017, -14891, -18634, 15126, 58456, 83666, 201846, 165985, 147416, 175398, 264685, 276932, 182189, 169949, 145204, 85445, -12102, -118982, -113269, -111076, -39867, 7370, -15564, 23755, -39789, 4609, -6419, -261, 25052, 78181, 19221, -108124, -166987, -242764, -155001, -60992, -53165, -82949, -129295, -127590, -86604, -65898, -70493, -131150, -189705, -210952, -105449, -96084, -17464, -71188, -79577, -71483, -102961, -63774, -80203, -100762, -53210, -9787, -1400, -22943, -130768, -118335, -70676, 51981, 110211, 15002, -69890, -144209, -107427, 8778, 55507, 89047, 48421, 46289, -30022, -73633, -43418, 8730, -37851, -149278, -83305, -16275, 116408, 156165, 114516, 52966, 15354]
23312A5354P6380K853Q0363L1481o2723l2775j54005n7748Q2656L2647j3902l6176
23300c5595m8135o5499M1549N5322n5380p7495j1963P2315Q9467P5147R148l3915
23288A4966o1902n8618q298K2854P8523L7699m1927k9782J20655M2059m0707K5599
23276A01121o8787m1644o3278n067M3076j20158j108J35671J9472n3601J33633
23265G9330K5128q4064r1855m4508k7806L1394q937J30832M3071N3586p124m2510
23253E6537q8593N9398J28806R3218j13636p9614L1086k9022j31849m6983k3573
23242a44225J34566L6589r4637n5305k3482M4439J15369O3851o7640j04176K0329
23231g4322J4342m9635j329Q519r4424j8132Q1397r4038j53538q3282J59530J59433
$$ y = [15354, 91734, 94587, 174950, 206431, 143708, 110933, -43072, -100820, -18164, 14483, 581, -35595, -83730, -149229, -107680, -52358, -107738, -185233, -197196, -124881, -35414, 39733, 48881, 14966, -46936, -105554, -113852, -90998, -12475, 25224, -16703, -46485, 74170, 116229, 75522, 101121, 32334, -9310, -72588, -77655, -34579, -154737, -155845, -20174, -702, -54303, 79330, 104458, 20394, -71461, -115969, -143775, -112381, -121318, 9514, 52585, 106171, 99047, 56537, -32056, 27342, 156148, 249366, 135730, 56116, 87202, 58180, -73669, -120652, -144225, -9659, 26930, -67707, -123012, -146494, -102055, 13314, 77165, 9525, -94651, -74322, -59980, -109615, -110944, -102425, -196849, -214981, -133584, -227622, -381160, -464442, -304912, -145479]
23219a45479J10831N1604N426j7719k6565K7198l9422j27349n5176n2666N8123
23208b11194N6606Q1424N0014N3884P6383m9442l7532J5709k8501j67779j1592
23197a72020O9848J20680o905J7506J14038J8361r1459p0054N466M8222K6786
23186H0469j1293m9116N1956L3851p2196L4874j9308l6443p7710J0631r774J8104
23174d5955J2490k8826N0599R675M7248R5435J258p8811n0579n8743Q4119Q667
23162D6577o4962N6109Q7460J8876o1639M6606k37l997o217J06677M2367K4265
23150B91885j0371r2973l4354q3760l2781P387j00902m1986Q8827k2435m6073
23139g7536K8964K5654q169J4929Q9299O9016N2884k2499m0156j9207j21024j16111
$$ y = [-145479, -34648, 16956, 22382, 4663, -21902, 5296, -34126, -161475, -216651, -269317, -211194, -154588, -73164, -23150, 30734, 107117, 57675, 20143, 35852, 7351, -160428, -172020, -102172, 18508, 11603, 29109, 143147, 161508, 70049, -5, 5461, 53683, 80469, 69176, 20060, 72016, 105867, 33671, 68545, 49237, 12794, -64916, -54285, -64059, -45955, -33465, -62291, -11692, -2017, 45231, 140666, 141924, 63113, 12534, -46209, 37910, 46577, -18385, 37724, 125184, 144060, 82421, 129027, 128790, 124793, 118576, 225253, 267620, 291885, 281514, 188541, 154187, 70427, 37646, 45033, -55869, -97855, -9028, -31463, -77536, -48572, -22918, -31087, -16158, 73141, 142157, 195041, 172542, 132386, 113179, -7845, -123956]
23127a23956l2890n333j103P5487N6805k7689J5834L437m5796Q306L1470j0328
23115e5756K6011J28533o7138j6331L1647J37088M2890j8788l092L3955k23561
23104A5458j38055o792Q2598o1544j3813K3417N5469J5757O743J2574J20317N3812
23092A65941P668j4187M0479n187m7724K275O4504J9986m6940k6992J0705N8273
23080B28801l7810p9240j18913M786K4334q5485L882P0219Q9041J74249M6754
23069C20618k06156j10744o1844j18043K5759P1022l9754N0409j8326j9614j1514
23058a18187N1595J37802N8835k1993p9755n4018j04801m3911R0561J2248l9569
23047a11193M1935J08730P796k069P9017n7672r7186J2502M8635n0067K9093k0650
$$ y = [-123956, -156846, -162179, -163282, -87795, -30990, -58679, -42845, -39408, -85204, -76898, -45428, -55756, -29745, 98788, 31650, 15319, 46966, 184054, 226944, 208156, 205064, 239019, 15458, -122597, -129389, -46791, -108335, -122148, -98731, -43262, -27505, -20762, -8188, 112129, 165941, 173609, 159422, 199901, 194714, 146990, 149265, 213769, 233755, 186815, 159823, 170528, 228801, 190991, 111751, -7162, -2376, 21958, -63527, -59645, 10574, 99615, 273864, 320618, 114462, 3718, -58126, -176169, -150410, -79388, -119142, -68733, -87059, -106673, -118187, -66592, 71210, 130045, 108052, 28297, -25721, -130522, -174433, -83872, -71624, -111193, -69258, 39472, 47268, 45199, 124216, 66544, -30642, -18140, 30495, -19572, 9521, -11129]
23035a1129R9086J5773n7282N86P6774R509p7065L8170K0554r0091J8481k0043
23023B3323r5681Q9852L2474N084J9884J51209K0999p5198p0646p9851q1482J9897
23011d0136L4052M2542m5840n6042K4750P5787k7910o81q040k6934j2429J9894
22999b0987n1773O8964O2819q8604j02321P4820N6262q7471l3555j678M3827M8303
22987c1394N9735J05120j0155k47901r3257O9683Q918J06997R8316l448p0564
22976g950j05974m7707L4509Q3063l7273o0402P453K0871j3254K6762Q7522L524
22964h856J4523l1853P959L9513j31520l5536J80223J7450l7094P975l6677o183
22952b0076O7288O3207L1498p8208j18851k0945M5252Q0195R9537o2692j37258
$$ y = [-11129, 87957, 103730, 46448, 47034, 123808, 133317, 56252, 94422, 114976, 24885, 43366, 23323, -72358, 17494, 49968, 55052, 74936, 226145, 247144, 171946, 101300, 21449, -60033, -40136, -6084, 36458, -9382, -65424, -40674, 35113, 7203, 6522, -1518, -28452, -40881, -20987, -72760, -3796, 59023, -29581, -131902, -57082, -820, -88291, -121846, -123524, -79697, -31394, 28341, 133461, 123306, -124595, -217852, -148169, -139251, -32254, 66062, 62614, -7950, -113924, -161631, -127122, -44059, -81332, -141734, -134281, -113410, -126664, -99902, -12380, -8856, 5667, -26186, -18227, 21286, -110234, -145770, 34453, 51903, 14809, 22784, -13893, -20076, 47212, 110419, 141917, 63709, -55142, -76087, -30835, 49360, 148897, 86205, -51053]
22941e1053p605K4577m8311k8408N6193j1340p5800k4577J63579J21339l8417
22930H0177M0803k2376p3797p2732M5309K198p9929o0277Q9245k0245m3368p1940
22918a86932M1505O4053M9453J65015k6656j22421m6559Q5146l7932K0417m0957
22907c5868p3586M3509K6134K8123P4633J31667J3554l1843O5347m19j14941n6061
22895G0249n1536m3366M6321n3199r4019L0093P3762R5381N2844K8809n3062j01696
22883E81n4751N0252K632K0771Q4825L2448j46978n652O7005j0709p0962M92j7921
22870d7967K8742J6160m7513k1890M5808M9744k753P2011J20990J13990j41048
22859A86274j19056p1646O2356m8198j7829n5388O1249p4584M1083J3026J5491
$$ y = [-51053, -58658, -34081, -82392, -110800, -54607, -65947, -141747, -166324, -2745, 118594, 80177, 120980, 98604, 24807, -47925, -2616, -418, -80347, -140624, -51379, -71624, -114992, -186932, -145427, -81374, -31921, 133094, 106438, -15983, -62542, 22604, -15328, 5089, -35868, -109454, -65945, -39811, -11688, 62945, 194612, 208166, 176323, 241670, 241251, 126310, 70249, 18713, -24653, 21668, -31531, -125550, -95457, -21695, 73686, 126530, 155339, 102277, 581, -54170, -3918, -1286, 19485, 104310, 136758, -10220, -15872, 51133, 40424, -30538, -30046, -47967, -19225, -3065, -50578, -72468, -26660, 23084, 20331, 92342, 213332, 327322, 186274, 67218, -4428, 57928, 9730, -8099, -63487, -2238, -76822, -35739, -22713, -7222]
22848g222O3768J9055N7660p0425r3743M0455Q9554j064m9085q3032M5866j2615
22836h28n4032k0463K8919P5616o6848j0269L5503p3921M5507J05198m4188P2963
22824I3157R199j25225j48663J2507L2433n4366P5949o1611o9053L8192O6673
22813a30808J28460l709n4393Q2931l1678M5060J84506J22585k15j0568O8126
22802D00297M8495P88J12191J63310R2290K28512M88957N53701L94693L29570
22792B812804k1603k77805l60126m05893l74280m17855k98364j60104j50123j55160
22782A91491r1891j9777O3115J30049K2302q5223n5052m419m3711l2230O53N9887
22770A35194m20p9096j28301q9218O4224J28603N0084l8912n8518l1351O787J9290
$$ y = [-7222, 56546, 75601, 133261, 62836, -30907, 9548, 99102, 98038, 48953, -34079, 11787, -828, -54860, -75323, -46404, 29212, -37636, -47905, -12402, -86323, -40816, 64382, 20194, 93157, 102356, -22869, -171532, -159025, -126592, -180958, -105009, -166620, -235673, -197481, -130808, -2348, -6057, -60450, 22481, -9197, 35863, 220369, 342954, 342739, 332171, 400297, 448792, 449580, 561771, 725081, 817371, 1045883, 1534840, 2088541, 2483234, 2812804, 2791201, 2513396, 2153270, 1747377, 1373097, 955242, 656878, 496774, 346651, 191491, 99600, 79823, 142938, 272987, 295289, 210066, 155014, 150595, 106884, 74654, 75307, 135194, 134774, 55678, -72623, -161841, -97617, 30986, 81070, 42158, -16360, -47711, -40924, -21634]
22758b1634L1780J5466k6980p4027n2879m8133L2986J38085L3122J8764Q4847
22747A31397o056o4049n2665J0643N0069n586p4847m1850l7154L2407j3580K0245
22735e1026q992J5485p203n0215j1680J16133R7383p4150r7688j23276N257K0125
22723a69847J7036O9439O8782M8031k4204L8595o1260j13468j12837P2264J69954
22712B485J34638M5256p9673j07168p19N2827j2820k9282j3172L6454j4443J56959
22700A71342O6299j36830o1709o2360o7098q455l4355k4963K5202J73146L0299
22689G0518n0211o9117k1195O1450M2827P9745j1216j28708q9711k883l0643O1046
22677h8098J11059Q4573L9756j24012o9900Q4783k6634j50720j00578Q7888J46306
$$ y = [-21634, 10146, 25612, -1368, -75395, -128274, -176407, -143421, -5336, 27786, 46550, 131397, 125341, 61292, 8627, 19270, 69339, 63753, -11094, -52944, -90098, -57691, -71271, -51026, -60018, -44533, -51736, -101951, -113631, 2502, 99885, 25735, -71953, -195229, -189972, -169847, -152811, -83372, -14590, 33441, 9237, 47832, -13428, -126896, -239733, -167469, 2485, 137123, 182379, 102706, -4462, -5181, 47646, 34826, 5544, -7628, 28826, 14383, 171342, 237641, 100811, 39102, -23258, -90356, -98811, -133166, -158129, -132927, 40219, 70518, 20307, -48810, -70005, -8555, 34272, 114017, 102801, -25907, -115618, -118501, -149144, -88098, 22961, 107534, 147290, 23278, -46622, 38161, 11527, -139193, -239771, -151883, -5577]
22666e577P9607R624P043k7746j1922n0938l5819j2235p560q1295P0768P2599
22654F549O5560M9427p0262n9603l1476m4085o884l0797L5754N1346n082K680
22642c6873R5021j1178j39819l67q6759O2134P5979L6253m0561j31259Q351J29465
22630c9613L5768M6651P0927j212M4136J853P949l0957r7853k8674K9516p0637
22618c2146J9289M7923K5735p3333p6073p6774K1445J23446J6749l2787m0329
22607g6855K9857m6318L1976N4737R4083j03632p7224R2700P7757N0603l9047
22596H8637m7999J674k1011n8763r0644N5125M9539o2141j3110J58190L1884m7440
22584D3941r0346J0205k107l0618n3101L8944J5245p068R1644n323M1178k5476
$$ y = [-5577, 74030, 83654, 90697, 62951, 51029, 91, -35728, -47963, -55523, -136818, -66050, 6549, 72109, 121536, 51274, -8329, -39805, -83890, -90774, -121571, -85817, -34471, -39553, -36873, 58148, 46970, -92849, -93216, -179975, -117841, -41862, -5609, -46170, -177429, -169078, -39613, -3845, 42806, 113733, 112521, 156657, 158510, 166459, 135502, 37649, 8975, 38491, -32146, -12857, 35066, 60801, -12532, -88605, -165379, -143934, -20488, -3739, -36526, -76855, -46998, -93316, -61340, -6603, 87480, -16152, -93376, -676, 77081, 127684, 88637, 40638, 42312, 21301, -37462, -128106, -72981, -23442, -85583, -98693, 59497, 91381, 43941, -46405, -36200, -38307, -68925, -122026, -83082, -67837, -74905, 16739, 11416, 52594, 27118]
22572B7118l6618o108j232J7881m803o4365M1928P4269m4194q0497j5177N584
22560h6214j60336O283P8441M4413J13625J15574k6264j57126r0184O3307N9584
22549c8897M5280J12261j6875n8806K4377j8455j24642J0955J9368n46L8110o870
22537a4740j7066M037K7658O808j35956j34892J02668n058M7185J43858J03814
22526A28316j29226Q727L784M1347L9105J2999j3342l22J01228l4493q446o128
22514A43549L5169j16053m4200N068P8386J19362N4530Q8697M4944l2125r634
22503C67693o5879o6383q5730j4299j43332N059P1442M9806K9840L1442J9885
22492A99544M3099l4078m7295K4482J2398Q4574L2082j81994j21855o7636N9146
$$ y = [27118, -9500, -15608, -16840, 1041, -3762, -68127, -26199, 48070, 3876, -76621, -91798, -86214, -246550, -240267, -161826, -117413, -3788, 111786, 85522, -71604, -161788, -98481, -38897, 6383, 118644, 101769, 42963, 67340, 48885, -75757, -64802, -45434, -45980, -7870, -14740, -31806, -27769, -111, 6697, -129259, -264151, -161483, -166541, -119356, 24502, 128316, -910, 7817, 11601, 52948, 92053, 105052, 91710, 91388, 192616, 158123, 149677, 143549, 178718, 62665, 18465, 23533, 101919, 221281, 275811, 364508, 409452, 377327, 367693, 301814, 235431, 149701, 135402, -7930, -2871, 68571, 118377, 148217, 179659, 199544, 242643, 208565, 161270, 185752, 198150, 282724, 314806, 132812, 10957, -56679, 2467]
22481B467M7617o9672K846P2736J9543m0848l5870j29141j4747J10479Q5947P4284
22469A25641J53562J3224j50363j28315J8584Q493Q774m6956Ml7916k5117m7991
22457a08376J9519l5019j3838j32886k51J06291J05376k98j4192k8504J7413J18391
22445C3626M0208j58776j11159L2857Q5337J21067j28701r3772J37478J69040
22435A27205O5367N0500j7066l6418J7617m828K7604m1070o3357l0736L4266K25760
22423C54844m0109q4005k6104K68l7802l4417J28893K2652j21671j94686j7644
22412d9781l2820m904K8258M9481J57508J1275R7320J54016j40251j55172M3681
22401A58611L3088j44823j41676Q0676K6823M1215R769q3190J9746J9872j6403
$$ y = [2467, 50084, -19588, -16742, 55994, 75537, 34689, -1181, -130322, -145069, -34590, 51357, 125641, 279203, 292427, 142064, 13749, 32333, 40826, 49600, 2644, 2648, -35268, -60385, -108376, -88857, -123876, -137714, -270600, -270851, -164560, -59184, -59482, -73674, -102178, -84765, 33626, 73834, -84942, -196101, -163244, -77907, 43160, -85541, -179313, -41835, 127205, 192572, 243072, 226006, 189588, 207205, 202377, 229981, 188911, 125554, 94818, 129084, 354844, 314735, 230730, 204626, 204894, 167092, 132675, 261568, 284220, 162549, -32137, -49781, -82601, -87505, -59247, -9766, 147742, 159017, 256337, 410353, 270102, 114930, 158611, 191699, 46876, -94800, -14124, 12699, 53914, 63683, -19507, 239, 20111, 3708]
22390C708n3879K0558N0106k9444j3164L0317P0953p1233K4553J7939N7694Q0822
22378A88930N5623n6281L6794K5185K2303J16136j38209j30427o8142q3843N3982
22367B2051k6100m0719J1375l9637Q3300J47314n1627L368J1648k8510N2499L7740
22355A82702J4521l7646l2188p6979q931R7531o3382l1007P4182J59085j360p9010
22343A97518N1000j3804j7333N8002J25433P0353m802j28989p5330N1313J80527
22332D93888K45476M48370L55730N88797O09770M03269K25973j77520n30715n60759
22322B102279l99841m18870l37285j91421p3187o1712J5706k7035M2829Q4266
22312G35729K9148N4912k4854N6426j8355N6701o4648j9094K085k5154j21750
$$ y = [3708, -50171, -29613, 20493, -8951, -22115, 8202, 79155, 7922, 32475, 50414, 108108, 188930, 244553, 188272, 225066, 250251, 272554, 388690, 250481, 120054, 51912, -31931, 22051, -4049, -44768, -33393, -73030, 10270, 157584, 105957, 109325, 120973, 92463, 144962, 182702, 197223, 159577, 127389, 50410, 41479, 139010, 75628, 44621, 118803, 277888, 276528, 197518, 248518, 234714, 217381, 275383, 400816, 471169, 466367, 337378, 262048, 313361, 493888, 739364, 1187734, 1543464, 2132261, 2742031, 3145300, 3371273, 3193753, 2663038, 2102279, 1702438, 1283568, 946283, 754862, 681675, 619963, 635669, 608634, 651463, 735729, 764877, 819789, 794935, 851361, 833006, 889707, 825059, 805965, 808050, 782896, 661146]
22301F61146j33138l6314L8025J48175J32538J87903P2208K9297R9136P1730R0309
22290A361015Q6416R1061m5153m292J47165J34363O0247J42515J76638J95183
22280B345158K32523K54974L58746K96334K78771K94195M02993N31485N66190
22271E561369N91363Q44870Q51290J147497J468900J747627K372080L162559M418887
22262B2166442O033826Q202374J1617220J7658785K9049655M9504157P7857514
22255B22089973R6934105R6417544Q2161627M3516343j7472301o6067525r0399134
22248C67180632r8338476q6392615o0286630l5802923k1107228j3717451r668880
22241D1866429p451039n795424m603555l544829k842617k351126j848403j546813
$$ y = [661146, 528008, 491694, 529719, 677894, 810432, 998335, 1070543, 1099840, 1198976, 1270706, 1361015, 1447431, 1538492, 1493339, 1489047, 1636212, 1770575, 1830822, 1973337, 2149975, 2345158, 2577681, 2832655, 3191401, 3487735, 3766506, 4060701, 4463694, 4995179, 5561369, 6152732, 6997602, 7848892, 8996389, 10465289, 12212916, 14584996, 17747555, 22166442, 28200268, 36402642, 48019862, 65678647, 94728302, 144232459, 222089973, 319024078, 415441622, 497603249, 541119592, 523647291, 457579766, 367180632, 268842156, 182449541, 122162911, 86359988, 65252760, 51535309, 41866429, 34415390, 28619966, 24016411, 20471582, 17628965, 15277839, 13429436, 11882623]
22233A1882623j403631j156657r13317p70013o69915n89803n14072m82667l53460
22224E029088l48011l61850l05135j61930k62327j96990j88783j40929j83236
22215B879897j52542j12991j36643j27396j27789l7048m9011j14072j25362j26535
22205A770508n3925l9779j64798q0581k6006J3213j4813l9498j40707P688m854
22194A226448J993m1943j87750k60814j1879R8313L1557J9662J1320K9452K9510
22183I45869O7681J40689K43286M74121M67326N37926M60556J94320q2098l54164
22173C095512m89401o09382n78359l09511j05301q8176k12296o5440o321j60052
22163D71273k042K7698o1140j13743O8042J37314K2274j06928M4263K6039N5651
$$ y = [11882623, 10478992, 9322335, 8409018, 7639005, 6969090, 6379287, 5865215, 5382548, 5029088, 4681077, 4319227, 4014092, 3852162, 3589835, 3392845, 3204062, 3063133, 2879897, 2727355, 2614364, 2477721, 2350325, 2222536, 2185488, 2136477, 2022405, 1897043, 1770508, 1716583, 1676804, 1512006, 1431425, 1405419, 1418632, 1403819, 1364321, 1223614, 1231302, 1226448, 1228441, 1186498, 998748, 737934, 726055, 824368, 855925, 875587, 886907, 916359, 945869, 1013550, 1154239, 1397525, 1871646, 2338972, 2876898, 3337454, 3531774, 3449676, 3095512, 2606111, 1996729, 1418370, 1108859, 1003558, 915382, 703086, 637646, 631325, 471273, 469231, 496929, 435789, 322046, 390088, 527402, 549676, 442748, 487011, 513050, 568701]
22152E68701P4j42914o8789o6866m9932o6782j9904m2938k0061K0663O8487O1965
22140B41704J7510k722J5579P4296M3420J34764J1681j31686j80263O827O7859
22129B98969k7641P6938K6004L6887K5756r356j33127j5359J53087P7588J6901
22118E26647N28j39863j67573r3418L9720L4572m7941N4625k8440N7706Q768K978
22106B48309J0995P1407l2972j03452o2176k4223o9430j23956M1415N7601J23185
22095A36703J39059j8144M6249r948j21297j46642k7312m6557L1048K7158l0033
22084a9716r392k6598J6753R97j01320m0590L5504L4170K1548j494P6631Q3003
22072F9496q6662L9902J39169P9373j25290m8533Q2943O3478K8011j9676j8657
$$ y = [568701, 568775, 425861, 357072, 290206, 240274, 173492, 153588, 110650, 90589, 111252, 179739, 241704, 259214, 256492, 272071, 346367, 389787, 524551, 536232, 404546, 224283, 231110, 298969, 271328, 348266, 374270, 411157, 436913, 427557, 294430, 279071, 432158, 509746, 526647, 527175, 387312, 219739, 126321, 166041, 200613, 152672, 207297, 178857, 236563, 245331, 248309, 259304, 330711, 297739, 194287, 132111, 107888, 38458, -85498, -44083, 13518, 136703, 275762, 257618, 303867, 293919, 172622, 25980, -1332, -47889, -16841, 10317, -19716, -29108, -55706, -38953, -37956, -139276, -179866, -144362, -110192, -88644, -90138, -13507, 69496, -17166, 22736, 161905, 241278, 115988, 67455, 150398, 213876, 241887, 222211, 203554]
22061B03554m5092j0371l0746j0128O2463o998n4134L4933N4167m0690J490k6456
22049A31992l4695n5089J22708J7047m6662Q8645k1451j48530P1344l766J2034
22038A33577j34095j06298Q0997J31644k239J09167L7353j4128o8875p2867L1014
22027A25250Q4658J4602L1445r8927j44384L609o3567Q168N4802J03593P1141
22016A90390m5328j29104l3041J11207K4537J637r45j8406J6900m6176j12860
22005d1189o6326R8249J58828R9180L3461l1636o5660K1133Q9100m0224p4144
21994A80772p2418q701j3003P407P2981k6940j31186j09387K4955l2085O4453
21983d3152J28424k2344J2018Q1515j5201k7980R3057n5832j2685J00016O4959
$$ y = [203554, 158462, 148091, 117345, 107217, 169680, 162682, 108548, 143481, 197648, 156958, 158448, 131992, 97297, 42208, 164916, 181963, 135301, 223946, 202495, 53965, 125309, 121543, 133577, -518, -106816, -25819, 105825, 103586, 212753, 250106, 235978, 167103, 94236, 125250, 209908, 224510, 255955, 157028, 12644, 16253, -47314, -39146, 15656, 119249, 190390, 145062, 15958, -17083, 94124, 118661, 120298, 119353, 100947, 117847, 71671, -41189, -107515, -9266, 149562, 248742, 282203, 250567, 184907, 206040, 295140, 254916, 180772, 108354, 99653, 86650, 94057, 167038, 140098, 8912, -100475, -75520, -107605, -43152, 85272, 62928, 74946, 156461, 141260, 113280, 206337, 150505, 137820, 237836, 302795]
21972C02795j47785k6507o4541p636K6501q9797j0439L8408l5722j7553j6912
21961d9188o1574M4013J09492O122n3065k6064k4574j65938l5767J13234R2154
21950e1155r5783L780J40352K23503o438p0563N5268L6093j35569p3550r2642
21939f6704m4743r4730j799J36761J45571J010j70055l7219J11423N2765r2437
21928f0157K7388o708p9142l9222N0497J60960q726j39336j40082J573N7231k7168
21916b02892r1237J11661J27008N7555O5341l3985j6684p5364m3156n425k6671
21905a33849K6755M1142M2901P4510M721o4715l7370L6946K9594K4517p2594J9878
21893g564k9349N8073O7993J6945m01j05008p0375K8412K4239l0551o4151Q2432
$$ y = [302795, 155010, 128503, 63962, 56326, 82827, -6970, -17409, 20999, -14723, -32276, -49188, -110762, -66749, 42743, 48865, -4200, -30264, -54838, -220776, -256543, -143309, -51155, -146938, -143158, -2806, 220697, 214259, 143696, 198964, 235057, 99488, 25938, -66704, -111447, -206177, -207976, -71215, 74356, 75366, -94689, -131908, -20485, 32280, -60157, -32769, -39477, -118619, -157841, -107344, 53616, 44890, -94446, -234528, -232955, -175724, -202892, -294129, -182468, -55460, 2095, 67436, 33451, 16767, -58597, -101753, -107178, -133849, -107094, -65952, -23051, 51459, 56180, -8535, -45905, -8959, 20635, 45152, -27442, -7564, -36913, 21160, 89153, 106098, 105697, 689, -69686, -41274, -17035, -47586, -111737, -29305]
21881b9305J845j2713M0244q289r7785J6360N2791J33382L1420r1629q7185m9473
21869a00337R252J14744r08q0560k7937j4726k7184m6067N5265Q3147J85413P8234
21857B28336o4578j23776J5662j7425J6174K9335J38454k8341j13320o7054K7291
21846D0758J2871j2620L1953j04559r2662K476j8355J0587Q3834K9769k3870L1200
21834h618o2435l0650J11476P9067k5282m3603p2641K5180K8266m8127l7497o5524
21822a50388Q4974J08611P0559j04458p8219P117Q483R5514q9152o6494n654L5930
21810h3177K3760R4975k9977m2436M4716N643R4335P7544p6443n6755m7592q2864
21798g8271k343K0334j19172J23803J34346n7106J0527K2813l6985m2741p2687
$$ y = [-29305, -27460, -40173, 71, -8218, -106003, -89643, -36852, 96530, 127950, 36321, -50864, -100337, -91085, 23659, 22751, -57809, -85746, -100472, -127656, -173723, -118458, -35311, 150102, 228336, 163758, 39982, 55644, 38219, 54393, 83728, 222182, 193841, 80521, 13467, 40758, 53629, 41009, 72962, -31597, -124259, -121783, -140138, -129551, -45717, -15948, -39818, -8618, -71053, -101703, 9773, 88840, 63558, 19955, -52686, -27506, 760, -47367, -84864, -150388, -65414, 43197, 113756, 9298, -68921, -61804, -53321, 42193, -46959, -113453, -119107, -83177, -59417, 35558, 5581, -36855, 7861, 13504, 107839, 185383, 108940, 52185, 4593, -78271, -80614, -60280, -179452, -55649, 78697, 21591, 32118, 54931, 17946, -24795, -97482]
21787i7482l9016O1640M3069m405J3460j895r135m2575o9240J47357N2164j31141
21775g7199l4187L8250P0779J05539j7366m3107m0669l0565l5149m1529J280L6594
21763f7329Q6549n8641l7304m0970p1149m9256M661N9375L7810J17592O7911p6313
21751b7064n0967q8281M6512J53935K2024j32217n0278l3240J4562L4750p1979
21740a82243n3827R1036O5964N0456J28696P1316p5044r4163j2226L4513j3844
21729A0634m9317k4690L3203J02003J6715j5191r7186o9195k9277M3867O8967
21718i467J44625L1902j54566r6001M1266P7883K683R8602J48494J26672J44042
21707E56135K00247L42505M62182M81776M61699J79162j9366k70369m14001n35902
$$ y = [-97482, -136498, -74858, -31789, -36194, -22734, -24629, -33764, -76339, -145579, 1778, 53942, -77199, -111386, -73136, -2357, 103182, 85816, 42709, 2040, -28525, -63674, -105203, -103923, -67329, 19220, -39421, -76725, -117695, -188844, -238100, -233439, -174064, -136254, -18662, 49249, -27064, -78031, -166312, -119800, 34135, 56159, -76058, -126336, -159576, -145014, -110264, -182243, -236070, -145034, -79070, -28614, 100082, 171398, 96354, 2191, -10035, 24478, 10634, -38683, -63373, -30170, 71833, 88548, 73357, -23829, -93024, -122301, -78434, -9467, 135158, 167060, 12494, -83507, -42241, 35642, 38325, 136927, 285421, 412093, 556135, 756382, 1098887, 1561069, 2042845, 2504544, 2683706, 2664340, 2393971, 1979970, 1444068]
21697A444068m65742l58605j92566j10565K2421q7936m0194j44349l9358R9340
21687A26514k5662o5299O5094N5321L5215j07072j26791N2180K6324P2013p1965
21676C5872q1902J8473o644J3505j7470L465J2931M5767O5496O5997O582r0176
21664G1896j94175l425Q3209l7141o8155j3212P8223J4345N608l4110O8711P3923
21652D5697l0264r7625q0226Q6786L9320l1088O8220o0399J4J50263J90967j6439
21640B65226r1640J4917m6741q7054O721q3438n4354L4021j9558o7113L4389O232
21628h8392k8967J7992K7884J0470m7179N4004l8957j20983p6539l0950Q1889
21617b39728J11796J04007j22871o8312Q9812n1162P1586J26355J00044j8180
$$ y = [1444068, 978326, 619721, 427155, 316590, 339011, 251075, 210881, 66532, 27174, 126514, 100852, 35553, 100647, 155968, 191183, 84111, -42680, 9500, 35824, 107837, 35872, -46030, -27557, -34201, -20696, -38166, -34701, -21770, 23997, 89493, 155490, 162072, 71896, -122279, -125704, -42495, -79636, -147791, -161003, -82780, -68435, -62827, -96937, -28226, 45697, 15433, -82192, -162418, -75632, -36312, -67400, 820, -59579, -59565, 90698, 281665, 265226, 173586, 188503, 141762, 54708, 61429, -22009, -76363, -42342, -61900, -129013, -94624, -88392, -117359, -99367, -71483, -61013, -108192, -54188, -93145, -214128, -290667, -321617, -239728, -127932, -23925, -146796, -215108, -125296, -176458, -104872, 21483, 121527, 103347]
21607A03347J581k6699j3720J8157l1412k7469j24541j05318m645R6830O2515
21596e1374l8895m9148L8213K0264l6886j5859l8216n1764p964O6320O7184Q3276
21584a4849R0787j01510q2246K1169L1148J10505l8176J77q467r3006P838J08253
21572C1623K4879Q1974O1546m5724q4795n6250J373Q561n245n0096p3272p7859
21560a83285L0935J60262K5445j14510o0600n307k9105n2333O7559J90742M5234
21549G5037m9193r602o1644Q9348p9929l961J58997J0741l4470j40156o2905q056
21537a15793Q02l1482j2892J17801M5304q085l8113j08391O7434Q8401L20r3656
21525h8350L364K9299K4427L3830O6439n2169L8857K6151J4101L0109L0421j06744
$$ y = [103347, 104928, 78229, 64509, 82666, 51254, 23785, -100756, -206074, -210719, -113889, -51374, -90269, -139417, -101204, -80940, -117826, -133685, -171901, -223665, -231629, -165309, -98125, -14849, 75938, -25572, -107818, -86649, -55501, 55004, 16828, 17005, 8538, -84468, -76630, 31623, 56502, 138476, 200022, 154298, 69503, 13253, 14626, 23187, 17942, -32154, -105426, -183285, -152350, 7912, 33357, -81153, -141753, -147060, -176165, -228498, -160939, 29803, 75037, 25844, 16242, -45402, 43946, -35983, -39944, 119053, 129794, 95324, -44832, -107737, -115793, -114991, -146473, -159365, -41564, 3740, -4345, -42458, -150849, -83415, 4986, 5306, -88350, -84986, -55687, -31260, 2570, 69009, 16840, 55697, 81848, 95949, 126058, 156479, 49735]
21513D9735p6050J6538j4601j3128m3566M3319P6444K9856j37274o0988M2674
21502h7041M4542o881n8418K8324K6728q734j8241Q3724j0110l319o2611K3910
21490d8127J8136n6081p5346j2798P9704L1694Q7524K9080n7820J8455L7395J46749
21478A98565J6493j25089o3897l7151k9721J18649J51543j57384j18673O423P5388
21467C5146L2927R075j01344j714K9302M151j28521J00615L4220k2858q0613M7290
21455d2324J87119q227j23980o453P0540L6114m5366q6110m9344L066l5554J18522
21443A8003n5406j25821O5140N0109m4760J4424j13049J13891L1009N9679R896
21432B3115k4392l9745k7792L1696r1333L7820Q5797l7043Q5961j1580m3377N9344
$$ y = [49735, -26315, -9777, -24378, -37506, -81072, -37753, 38691, 68547, -68727, -129715, -87041, -42499, -49380, -107798, -79474, -52746, -61480, -79721, 4003, -6107, -9426, -72037, -48127, -29991, -86072, -161418, -174216, -94512, -62818, 24706, 53786, -4034, 14421, 51816, 198565, 215058, 89969, 26072, -11079, -40800, 77849, 229392, 72008, -46665, -40242, 35146, 68073, 77148, -24196, -25910, 3392, 7543, -120978, -20363, 13857, -9001, -89614, -42324, 144795, 136568, 12588, 6135, 76675, 112789, 67423, -18687, -68031, -64965, -100519, 18003, -37403, -163224, -98084, -47975, -92735, -78311, -191360, -77469, -46460, 13219, 23115, -1277, -41022, -68814, -37118, -128451, -90631, -4834, -41877, 44084, 32504, -10873, 48471]
21420D8471J9799M5813p0776J2102P8235o0323k5429R1970M1418n7202L1677l2789
21408A22966n6519k6851l7389n0393n1217p717N2318p0825N6520j0146p5528k4336
21396a79117K4028M2308Q9435J79713k0422n3517l9836Q939J6542m1087N9077
21385H6063K0213J8661L2945M3347m1766p4789j26762J2353M0742M0017L0200
21374H1224q4731k9879m292m9764o1322J23104K2360q4080j4445O4562J9036k2085
21362d0312q4502O6818J102j9148L3073J3929K2434k307o7987j5316L2685j6658
21350g6189J18064J5774p3925j7396k7208k5388o9820Q9915J09560o4501J7944
21339c170R276p1934Q5052n3153p1619K2357J09976N1236n4471n0557n6306r4341
$$ y = [48471, 68270, 114083, 43307, 55409, 133644, 73321, 47892, 139862, 181280, 124078, 155755, 122966, 66447, 39596, 2207, -48186, -99403, -107120, -54802, -125627, -69107, -79253, -154781, -179117, -155089, -112781, -23346, 156367, 135945, 82428, 42592, 51531, 68073, 26986, 86063, 106276, 124937, 157882, 201229, 159463, 84674, -42088, -29735, 11007, 51024, 81224, -3507, -33386, -37678, -87442, -148764, -25660, -3300, -87380, -101825, -37263, -18227, -40312, -124814, -57996, -56894, -76042, -42969, -29040, -6606, -8913, -76900, -92216, -59531, -76189, 41875, 57649, -16276, -33672, -60880, -86268, -156088, -66173, 43387, -21114, -3170, 6106, -65828, 19224, -33929, -105548, -83191, 26785, 78021, 23550, -27007, -83313, -177654]
21327a77654R125K8693J7994o8342L0461L0683P1636Q8697R940k4095m9576k2752
21315e5190r6510Q6795J78709J824n3172n7219L1203Q8130J2004n0506J440L4570
21303A22078K0415r2249j7619r928P742K2723m1696p6381k235k7844Q144l5632
21291a22482L5211N4836q096K7316Q8264p9753o5825o8452j2987N8161O5332N7609
21279B9134R146m7878o1485P2570O3899L7450J3046L1792l7767o7113r978n3105
21267b0289K7860L0764j1010j0127l0384L2630j22772l4228N3030M9546m0121
21256g5101j71210m2914Q8175Q0844j3471k9318m7310p34Q8451J35232r2285o1032
21244a40673k8388K1053M8584k1042j15349J07110J25028J4993L7329J33327j4290
$$ y = [-177654, -168529, -139836, -121842, -190184, -159723, -129040, -57404, 31293, 41233, 17138, -32438, -55190, -151700, -64905, 113804, 115628, 62456, 5237, 36440, 124570, 136574, 86068, 87508, 122078, 142493, 50244, 32625, 22697, 30439, 53162, 11466, -64915, -67150, -94994, -86850, -122482, -87271, -32435, -40531, -13215, 75049, -4704, -70529, -138981, -151968, -93807, -28475, 29134, 38280, -9598, -71083, 1487, 65386, 102836, 115882, 147674, 109907, 42794, 32816, -20289, 7571, 38335, 27325, 17198, -13186, 19444, -103328, -137556, -84526, -34980, -75101, -246311, -289225, -201050, -120206, -133677, -162995, -210305, -211039, -122588, 12644, -79641, -140673, -169061, -148008, -99424, -120466, -235815, -128705, -3677, 11316, 48645, 181972, 167682]
21233A67682j23943j11207p3919N482M8991K854N5566k7757L7460P5991M6062
21222A03262P1784o9049l0075J925j2832K2512Q1008R5799P928k0822k3020p9763
21210A48657m1149K601L9648o2909n8902P5415j755P6819l9341l0627P5823m3178
21198A41102n0319O202j5274Q120O0426m2843K7722K6757n8233p0887M748K8905
21186F6426o204K9194j534K3757O1275k2627q6929p0007K4250l7059j9217P681
21174c0994O6180J6490m7292N7457L7403j68028q0774R515q7473K6987J40966
21163e9563R889o6216L207J20043n1398K0915O707L5443K0219j00785P9579j0244
21151G796j5931O6531L8168o917j0054j46811p7203l1639M8829Q2304J628J1932
$$ y = [167682, 43739, -67468, -141387, -135905, -86914, -84060, -28494, -56251, -18791, 57200, 103262, 175046, 105997, 75922, 77847, 65015, 87527, 168535, 264334, 272262, 251440, 228420, 148657, 107508, 110109, 149757, 86848, 27946, 103361, 101606, 178425, 139084, 108457, 184280, 141102, 90783, 96985, 81711, 89831, 150257, 107414, 135136, 161893, 103660, 32773, 37521, 66426, 60222, 89416, 87882, 111639, 172914, 150287, 63358, -6649, 17601, -19458, -38675, -30994, 35186, 51676, 4384, 61841, 99244, -68784, -149558, -140043, -227516, -200529, -59563, -49674, -115890, -112683, 7360, -44038, -23123, -16416, 19027, 39246, -61539, 18040, 7796, -8135, 58396, 96564, 89647, 79593, -67218, -144421, -176060, -127231, -44927, -43299, -31367]
21139c1367j0109k2158n4392P0896R271R4331N0280j12418j07873Q7623J32287
21128A06371l2777k4830p4993M2637K7141r2817L9710n8760n7709J7238Q056N1003
21116d9730J5674R0068m5003n4708r63J02305J49753Q5340k0137j11089j52811
21105H699j08410n5556J42532P0945n8624m224N8523J2353q4090o3585p6912K6154
21093a32195M4173P3045j3994j0083Q9545R9888k8147j73027n3532L2103L0841
21082d1383j07958J8681o6623J7264n0264k005R8251M2706O1090M9378m6098k3592
21070e0553J5078O08J63633L9026j06688q5216N7648P443L4671l7125k1398j01400
21058h4273j6824M2162L0705Q4902m1593j4549R9090K4151r4756n4689o966K8916
$$ y = [-31367, -41476, -63634, -118026, -47130, -37859, 56472, 106752, -5666, -113539, -25916, 106371, 73594, 48764, -26229, 16408, 43549, -49268, -9558, -68318, -126027, -108789, -100733, -49730, -34056, 56012, 11009, -43699, -44662, 57643, 207396, 292736, 272599, 161510, 8699, -99711, -155267, -12735, 58210, -414, -4638, 53885, 66238, -17852, -81437, -158349, -132195, -88022, -14977, -28971, -39054, 50491, 150379, 122232, -50795, -104327, -72224, -41383, -149341, -130660, -197283, -180019, -230283, -232288, -134037, -91331, -30241, 19137, -26961, -50553, -35475, -34867, 128766, 167792, 61104, -24112, 33536, 40979, 75650, 38525, 17127, -84273, -101097, -58935, -28230, 56672, 15079, 530, 99620, 123771, 29015, -25674, -32640, -3724]
21046c724J5507n1469r9427k2292O1370R1777N3219j7082L816j9749m2896L4459
21034C509l796o7581j7310m8550P5006P6604j8690n5767N322K2476N7637Q6288
21022A15148J7673q8154L294L6206q7220o7887J6299q80L9735j3923m1818k1161
21010i2688O4200K8678n9187M0867R9950Q191l7755j3411j8494j39161q6049m923
20998b09782O1430l0535M2425K8182M5985Q4633O3301r6642p7963m3995n4180
20987a87141O9792l814o9837R3829n592N8710j06955n0694J43354Q5737r6641
20976f9252L8726R2668J3617m82o5529j25163r1408q9381J20795J26971J7647
20965c0791k9920K6780M686m8451R5299P1170k1999j7255o7513j46788L8895N0086
$$ y = [-3724, 11783, -39686, -139113, -161405, -100035, -8258, 44961, 27879, 31695, 11946, -30950, 3509, -287, -67868, -85178, -133728, -58722, 17882, -808, -56575, -51253, -28777, 28860, 115148, 132821, 44667, 47961, 84167, -3053, -70940, -54641, -55521, -15786, -29709, -71527, -92688, -28488, 190, -58997, -18130, 81820, 90011, 52256, 38845, 20351, -118810, -204859, -209782, -148352, -178887, -136462, -108280, -62295, 22338, 85639, -11003, -88966, -132961, -187141, -117349, -121163, -191000, -97171, -102763, -44053, -151008, -201702, -58348, 27389, -69252, -30526, 62142, 75759, 75277, 9748, -115415, -206823, -296204, -175409, -48438, -30791, -60711, -33931, -29245, -77696, 17603, 88773, 66774, 49519, -17994, -164782, -125887, -75801]
20953g5801K1257J9447k5110M9345J24402Q6172o8967j4802N6730o8725M4994
20942A48942n262j53602q7246j22234N0469p548J05120O9574n0685K2468J1740
20931a8264q3593n4471R63j7296m5645N8740P8539J35762P7523J6559n0474o6337
20919C2006p2031M8221J362m3599q8011N7334L1167p0533n8569m287L9942R2600
20907c4398N0670K7513N7957m7361l3172L9716j29241j6149M626j8080P341N7300
20895c3278J9230n4119p4174k4273M9111k4201m3729K4629R3398O1296m5011O8199
20883A7078j5979j06836K4085J1701k8824P0727M8786q9239j01996K5446k8504
20872a73555J04025O7555p4298L3333J34075R6943L8685l0633j08677n0226q4905
$$ y = [-75801, -54544, -35097, -60207, -10862, 113540, 199712, 130745, 115943, 172673, 103948, 148942, 143680, -9922, -97168, -219402, -168933, -176481, -71361, -1787, -52472, -30004, -18264, -101857, -156328, -155365, -172661, -218306, -159566, -81027, 54735, 132258, 148817, 98343, 32006, -40025, 8196, 9558, -34041, -122052, -64718, -33551, -104084, -162653, -166940, -126998, -34398, 16272, 43785, 101742, 54381, 21209, 60925, -68316, -84465, -79839, -97919, -90578, -33278, -14048, -68167, -142341, -166614, -117503, -141704, -185433, -160804, -67406, -6110, -51121, 17078, 1099, -105737, -81652, -69951, -98775, -28048, 20738, -68501, -170497, -145051, -173555, -69530, -1975, -76273, -42940, 91135, 188078, 226763, 196130, 87453, 37227, -47678]
20861d7678R0106o8470j03866J47596J23990k6520m1299J8853p1009q8623O286
20850f0634J1279m5416n9714J10483L9929m1660r7613p1865M0635R5032P2057
20839g487R9103q4942l0034K1089j08033r6413L4177J51136M9719J2157n2277
20828a1805j13603q3197R4961Q8138p192n8249o6767o945J4153O5604P888k9537
20816a06551L8022J80621J245j77447Q731L8171R500r03J3616J05232P9666n3435
20804A36468m6147k5751l2508j00122J843R7578K3697j26930q7635r2529K9673
20793b22363R2289K5499O2977L0272j40405j1131O8351k5524l8323q5811Q6555
20782a57614J6982M7899J29992P2121j30867m1605Q1709k7516o5737n0012j57219
$$ y = [-47678, 42428, -26042, -129908, 17688, 141678, 115158, 73859, 92712, 21703, -66920, -60634, -49355, -94771, -154485, -44002, -4073, -45733, -143346, -215211, -174576, -79544, -7487, 91616, 6674, -23360, -2271, -110304, -206717, -172540, -21404, 28315, 40472, -11805, -125408, -208605, -113644, -25506, -32698, -90947, -157714, -164659, -150506, -84902, -77014, -106551, -68529, 112092, 113337, -64110, -55379, -17208, -7708, -8611, 5005, 110237, 189903, 136468, 90321, 64570, 32062, -68060, -66217, 31361, 55058, -71872, -159507, -252036, -222363, -130074, -104575, -41598, -11326, -151731, -162862, -94511, -120035, -158358, -244169, -157614, -140632, -92733, 37259, 109380, -21487, -63092, 18617, -8899, -74636, -124648, -281867]
20771b81867J8948P240J01260q4673j12527J04816J2400j8155J26149J15934J3111
20760B636N4534M8337p8158j24133M757O2422P2001o0237o2044M795j1254L932
20748h2412K8744N2825j02090q7735K6463R789L0248K6179M8367P2049O9650p2415
20736A9662o9140j9823j0575K2980q1634l9004q5481j9784P8466O5359J55299
20725A6325j3411k5623K4587L759j32147j6052L1013J1685q9534o7091Q1434O8767
20713a06288R5886K0700k8024L4551j05009r1208M7895J6125J35806O7822j17209
20702b8953j300j3728L5102L2960N6273J9036j10524j11626J3315O688O3675n4860
20690i3942m9654J1340J04012N3102n778M7714j453k8883p7927R943P1216J7460
$$ y = [-281867, -262919, -255679, -154419, -239092, -351619, -246803, -234403, -252558, -126409, -10475, 2636, 57170, 105507, 27349, -96784, -92027, -29605, 42396, -17841, -79885, -75090, -86344, -82412, -53668, -843, -102933, -190668, -164205, -154416, -124168, -97989, -49622, 22427, 92077, 19662, -49478, -69301, -79876, -56896, -138530, -177534, -263015, -282799, -204333, -138974, 16325, 2914, -22709, 1878, 5637, -126510, -142562, -111549, -99864, -189398, -256489, -175055, -106288, -10402, 10298, -17726, 16825, -88184, -179392, -131497, -115372, 20434, 88256, -28953, -30253, -43981, -8879, 24081, 80354, 99390, -11134, -122760, -109445, -102757, -39082, -93942, -143596, -132256, -28244, 24858, 19080, 66794, 65341, 36458, -41469, -31526, 39690, 57150]
20678E7150r2773p2365J4322l0220M3960M1390M9270K4391n9178j66642j28099
20667c18794R327K9507Q8895J25517M0563l2776q368P9625K2902m4882L878p0125
20655g4731q3208O5881K1803r7928K9312R5248l8971J6207j11509l7814J4174
20644b01536K1102L8578j9017N6500J29811O9643q2706J9110L7335r4775j03951
20633a29906k9989j5731j0691M8447P6384R6398L2346r6720k2543m9011O9372
20622c1644l6130N4877J17486j16134r3593p1331o597m0572J3216J02533P3679
20611c4210J36148R4547n1300r4475p9027k1632k0406k0146K2169R5595l4361
20600g098m350J00779j1837j22150k7932K4642L2461R285p8565m4154L3060k5908
$$ y = [57150, -35623, -107988, -93666, -123886, -79926, -38536, 10734, 35125, -24053, -190695, -318794, -309467, -279960, -191065, -65548, -24985, -57761, -66129, 13496, 36398, -8484, -4606, -74731, -157939, -92058, -70255, -168183, -138871, -43623, -82594, -66387, -177896, -215710, -201536, -180434, -141856, -160873, -104373, 25438, 95081, 12375, 31485, 68820, -25955, -129906, -159895, -175626, -186317, -137870, -61486, 34912, 67258, -29462, -52005, -101016, -31644, -67774, -12897, 104589, -11545, -105138, -176469, -183066, -223638, -210422, -107889, -34210, 101938, 196485, 145185, 50710, -28317, -49949, -70355, -90501, -68332, 27263, -7098, -11448, 89331, 77494, -44656, -72588, -47946, -15485, -6200, -84765, -128919, -95859, -121767]
20588a21767N5222K0695L5076J6258m5664j06351p2902l9689L116M2754J60054
20577e3198K4511k5066j7859l6284q7443j13425K3780N7590N3735K4842Q121p0913
20565b11609k9544L0205N0615l1093r2999J20635J4749k6062o8081M7783Q7290
20554a08111N5155K3942l4282k3133O9076K8580K0458N0325j01170j43507P5267
20543h7400Q0383R4520J9173K9955l0625J8961J4866M6116j21307J6518K9830
20532A10990j72656k5575J5053J8332R6120j4873j00417j7809m3306p7995J9193
20521a92943Q6756J13720K2023m2850k6787l2489P9604l4610r4817p3457M850
20510a91000Q6321O2618l9681N0200P1691j33939k3727P9239l0862l3568j3654
$$ y = [-121767, -66545, -45850, -10774, 5484, -40180, -146531, -219433, -259122, -256006, -213252, -53198, -28687, -53753, -71612, -107896, -195339, -308764, -284984, -227394, -173659, -148817, -140696, -211609, -241153, -210948, -160333, -191426, -284425, -163790, -149041, -175103, -243184, -195401, -108111, -52956, -29014, -63296, -86429, -17353, 11227, 31685, 82010, -19160, -162667, -87400, -7017, 87503, 106676, 136631, 106006, 124967, 139833, 185949, 64642, 81160, 110990, -61666, -87241, -72188, -53856, 42264, 27391, -73026, -90835, -134141, -212136, -192943, -106187, 7533, 29556, -13294, -40081, -72570, 7034, -27576, -122393, -195850, -191000, -104679, -42061, -81742, -31542, 40149, -93790, -117517, -38278, -69140, -102708, -116362]
20499a16362n3479J02699K1641r8671q3679n522P5440K41336N5361J4583n4932
20488I8415n3078l5056m498p1535o6582M211O7183l1243J1292N841Q7634O7049
20476G9633k6148L0559j15836L997N1152m1310k8587P8073l0881L865M1280J9703
20464F5500q6308M8219R1191o1099r209j5918m4446K5398k6705j717k9752q5689
20452a30535r632J19964O0721n8169j6807L5580l8244J7076M7746J4168Q2226
20441A24094M3121j42542j2792j3875j19330o5441K3742J27490L9562k5897J47164
20430A25296L6479o9104p4826j33314o2881O8168L078q8136P3299P7871O7987
20419B3917n0690K4212l5577r1844N960O4247l6683L6984k6307n2119j8232k0185
$$ y = [-116362, -169841, -67142, -45501, -144172, -227851, -233373, -157933, 83403, 138764, 153347, 98415, 45337, 10281, 5783, -65752, -132334, -128123, -60940, -92183, -80891, -75050, 12584, 79633, 53485, 84044, -31792, -27795, 23357, -17953, -46540, 31533, 652, 4517, 45797, 65500, -20808, 27411, 118602, 57503, 48294, 32376, -12070, 13328, -13377, -15094, -44846, -130535, -140167, -20203, 40518, -17651, -34458, 1122, -37122, -20046, 27700, 41868, 124094, 167215, 24673, 11881, -1994, -121324, -186765, -163023, -35533, 4029, -21868, 125296, 161775, 92671, 17845, -115469, -178350, -110182, -107104, -195240, -121941, -44070, 23917, -26773, -2561, -38138, -129982, -124022, -59775, -96458, -59474, -85781, -137900, -156132, -176317]
20407a76317M133o247q0800Q5291J5770J8450m2025Q3944J56707J37342K6314
20396B22562n2441p9801n303n268K9783n6980j18048Q868Q4132R6259j419M462
20384A26806p219r9365l7358l6219Q0280P9887l2307j3811p2279o3092n3639L3993
20372i4323L9167o4650k7841J6601r324m8001M0291K1652R321j2896O7149J05169
20360D2315p8115J0217M4746k282j8537N3767L0155M2538j17955j71929m9031
20349b14111J65994J9357j80885J0426J08839J01043P8773K2610L8635J3622j53882
20338A0421k5694j9183q8150l7242m8495M9929J4831J1020j4037K1098L1987M7960
20326d5555O588k2497n8481j1755O0639L4915M15M0326L6951L8334j5052r5965
$$ y = [-176317, -172184, -178431, -259231, -173940, -158170, -139720, -181745, -97801, 58906, 196248, 222562, 170121, 90320, 85017, 79749, 109532, 52552, -65496, -56628, 27504, 123763, 122344, 126806, 119587, 20222, -17136, -53355, 26925, 106812, 74505, 60694, -11585, -74677, -128316, -94323, -55156, -119806, -147647, -131046, -140370, -188371, -148080, -126428, -117107, -130003, -62854, 42315, -35800, -25583, 19163, 16881, -1656, 52111, 82266, 124804, 6849, -165080, -214111, -48117, -28760, -209645, -199219, -90380, 10663, 89436, 112046, 150681, 164303, 10421, -15273, -34456, -122606, -159848, -208343, -158414, -143583, -132563, -146600, -125502, -93515, -45555, -38967, -61464, -119945, -131700, -71061, -36146, -35731, 4595, 41546, 79880, 64828, -31137]
20314c1137n5353O8622L0002L948q2700q557j7016J7551O0876J7881r572n3122
20302e8577K3480J06501Q6377j15619o1468K2557r020J2729j2830J29873M9468
20291A73471L5174o3418n6944p3878j03604l7200j8128K1722q885Q1766Q2153
20280C2229q2816N3156K8074k2011J093m5350K727M9082O0171j786N6793J9235
20268A50597j42281j48010l1780k9463L6292m2397K4916J20605L8521j0596k7419
20257f1015k1294j4127p778r1112l0057J22862J77191l9778j25123l5675P0927
20246e4979Q1365J20936m051o8996j12273n3047n5839J1067o1065o3838Q303J83610
20234f8807J33479q6053q7830j2565K5668o7675L7537J36853J4628j1795J4774
$$ y = [-31137, -86490, -17868, 12134, 16082, -66618, -75175, -92191, -74640, -13764, 4117, -5455, -58577, -35097, 71404, 157781, 42162, -19306, 3251, -5769, 6960, -5870, 124003, 173471, 208645, 145227, 88283, 14405, -89199, -126399, -144527, -122805, -131690, -49924, 32229, -50587, 2569, 30643, 8632, 9725, -35625, -32898, 16184, 76355, 74569, 131362, 150597, 8316, -139694, -171474, -200937, -164645, -207042, -182126, -61521, -23000, -33596, -61015, -82309, -96436, -104214, -195326, -225383, -102521, 74670, 34892, -90231, -125906, -54979, 26386, 147322, 143271, 74275, -37998, -91045, -146884, -135817, -196882, -260720, -252417, -68807, 64672, -21381, -109211, -121776, -96108, -163783, -126246, 10607, 25235, 13440, 28214]
20223B8214L7404q0228Q232J2149j0131j15970n0365O6988O5528J75632k5093
20212A12360p3781J886N252J05445N1894l2911j03720j5488Q7243o9281k0135
20201D8764l1236m0536n3106n2353O7288L3787M6964L6985K0209j19266l3449
20190g5949K9715K0656J004K6003P5383M5944j3313k4032j18112k8515K9562O5815
20178C4161q3788q106J18425J4970p5226j09284K5261O0693L6000k5947n1980
20167f4821K3232r5070k2351j20667j9805J40181Q2215q702k2460n8425r835N2982
20155a23526K7778P57j1047m051N9762l5200l3305j15518j8659N4787l2094J10803
20143a19513N5690K2744M7320l768J0831k6288Q147P504k4170P0717O2937k0834
$$ y = [28214, 65618, -14610, -6378, 5771, -4360, -120330, -170695, -103707, -38179, 137453, 112360, 38579, 40465, 45717, 151162, 203056, 170145, 66425, 50937, 138180, 68899, 48764, 17528, -23008, -76114, -128467, -61179, -27392, 19572, 56557, 76766, -42500, -75949, -46234, -25578, -24574, 1429, 76812, 122756, 109443, 85411, -32701, -61216, -31654, 34161, -49627, -57733, 60692, 75662, 436, -108848, -83587, -22894, 13106, -12841, -64821, -41589, -136659, -159010, -279677, -299482, -159301, -77086, -85788, -108248, -166673, -176508, -123526, -95748, -94991, -106038, -110089, -50327, -85527, -118832, -234350, -253009, -198222, -230316, -119513, -63823, -41079, 6241, 2473, 13304, -12984, -4837, 2667, -21503, 49214, 112151, 91317]
20131I1317n8175k3119n4132J1318L7006J353k0286m200K9220J2964m2387m6844
20119f5965Q4840o628M3752J3943k236m6024m9915J07234R8028j2866j14517o0799
20107a1153K533R1846n6583n3311l945N417j3044P270o9163p5017j5725N3687
20095a37188K8250N5623R6921l1888j33369l5854J24063P3729P7809l6436m8797
20084C2863m5480q967M997L6367P9423j07764j4512n5619n2849J06608K7980n9975
20072e6928p6212N751m3808N5650R1103n8875k1725o960K6788q5027P7387R8577
20060E721j6939j4035j1730P4446l5510k3968j1004r1716l1611M6604j5707M290
20048a21159o7832J08909Q6593k073P7115N9923m0424j2511r4820J6415Q0474
$$ y = [91317, 33142, 10023, -44109, -32791, 4215, 5568, -14718, -18918, 10302, 23266, -19121, -65965, 18875, 12247, 55999, 69942, 67706, 21682, -28233, 79001, 177029, 164163, 49646, -11153, -8620, 83226, 26643, -26668, -30613, -25196, -38240, -30970, -100133, -175150, -190875, -137188, -108938, -53315, 43606, 11718, -121651, -157505, -33442, 40287, 118096, 81660, 32863, -12617, -21584, -16587, 19780, 99203, -8561, -23073, -78692, -131541, -24933, 3047, -56928, -133140, -127389, -171197, -115547, -24444, -83319, -105044, -112004, -85216, -170243, -92856, 5721, -11218, -25253, -36983, 37463, 1953, -22015, -33019, -124735, -156346, -109742, -125449, -121159, -188991, -80082, 6511, 4438, 81553, 141476, 101052, 88541, -6279, 10136, 90610]
20037I0610K7371P1887j356l4008K0091r2908J2707O477q5326n5366P4879J14582
20025A49640l9957j00176j06346m2984J08010J15112K1231J8421m3391m7384m0393
20014h217K2701o6215j6788j3671j1024L6725L7900N3514r7518P519l4420j6497
20002a05991K9355j0424r8157K0423L5066P4246J79912P0330j7955r5541k8458
19991E2806N229n0614q5238Q730L2358J7242m8889m8630M3047j8291R643n6675
19979a39282L3157J40360J5216O191O9213K291j0228p9842o0135j8567j17671
19968a59297n8540R5454R1508p639l6497p1434N9204P8468O8864J39075M5106
19957B44272l6532j01542q6571m0192M826l2638r3081K0673J8825L6646R0030
$$ y = [90610, 117981, 189868, 188512, 154504, 174595, 81687, 94394, 100871, 15545, -39821, 35058, 149640, 109683, 9507, -96839, -139823, -31813, 83299, 104530, 122951, 79560, 32176, -8217, 14484, -51731, -68519, -82190, -93214, -56489, -18589, 34925, -62593, -55074, -89494, -105991, -76636, -87060, -185217, -164794, -129728, -55482, 124430, 194760, 176805, 81264, 52806, 58035, 7421, -77817, -69087, -36729, -19487, -68376, -117006, -73959, -92250, -82607, -139282, -106125, 34235, 49451, 55642, 124855, 127146, 116918, 37076, -23059, -41626, -159297, -217837, -122383, -30875, -38514, -75011, -146445, -87241, -8773, 60091, 199166, 244272, 207740, 106198, 19627, -20565, -15739, -48377, -141458, -120785, -101960, -65314, 24716]
19946B4716K7204j62588k9652O3687m0648o4217p4401o4869Q8122J15135O7857
19935d9654l5903J3777J01038J9442L8755J8604j60862o3922q0136l2989P5366
19924a56484L9067K9379J05251o5304r3927m4363Q989k7751K2523K0592J5644
19913a46384K5358R2451O6318m6274j7116j0409P5791M5296Q8901J0658k8190
19902A56400N5338j493j7322r8695j32430o501K9181L9913j6689L2880j9623j9405
19890A554L5598n0253j2686L1904L1424J00117m5440j10520n7175J9397K6224
19879b9856n9776M5646L2047o253o2102j23718M259K2199R2816L2149n0497J4353
19867h8733j7446p8618j1921k1474j1699M2123R0138R9516L9378K0496n3290l2865
$$ y = [24716, 51920, -110668, -140320, -76633, -117281, -181498, -255899, -320768, -232646, -117511, -49654, -85557, -71780, 29258, 48700, 87455, 106059, -54803, -118725, -198861, -231850, -156484, -117417, -88038, 17213, -48091, -142018, -186381, -177392, -205143, -182620, -162028, -146384, -121026, -28575, 37743, -8531, -25647, -36056, 39735, 85031, 173932, 184590, 156400, 211738, 210245, 192923, 94228, -38202, -44703, -15522, 24391, 7702, 40582, 20959, 1554, 37152, -13101, -25787, 6117, 37541, 137658, 92218, -18302, -75477, -56080, -29856, -89632, -43986, -11939, -18192, -80294, -204012, -199753, -177554, -84738, -52589, -103086, -88733, -106179, -184797, -196718, -218192, -229891, -187768, -97630, 1886, 41264, 61760, 8470, -24395]
19855b4395Q6457O9719l080o8762l8639o7602m9100J8568J6609k122K0464J10832
19843F8949N7522n971j17855j12463j30452J54130L8945l0135K6999p609J47559
19832H9619N6683r2119l6469L1520p8882J207O6485q867j74113o6820q375q0936
19820c01067J4546J8784Q6469P4249J4470L0930Q5235L8121m039K7892n1472o7155
19808c3037j4792L9989j3499j3482P616k8644l0773q5757J11172Q3502o248q3961
19796f7914J04524P2789j13301j38604K3406m5776K4217J02570K05n2678j37174
19785b27736p1009J7787N4813j5793K46382J20413J2132K508q2904o01K6319j27229
19773d4918j02789J07335L1049J5960j13019j07616m296l1175o642Q1555K2128
$$ y = [-24395, 62062, 131781, 128701, 59939, 21300, -46302, -95402, -76834, -60225, -62347, -41883, 68949, 126471, 120500, 2645, -109818, -240270, -86140, -47195, -77330, -50331, -57940, 89619, 146302, 54183, 17714, 49234, -29648, -28441, 38044, 29177, -144936, -211756, -220131, -301067, -286521, -267737, -181268, -107019, -92549, -61619, 23616, 61737, 57698, 85590, 34118, -33037, -47829, -7840, -21339, -34821, -27205, -55849, -86622, -172379, -61207, 22295, 16047, -67914, 36610, 109399, -3902, -142506, -119100, -164876, -140659, -38089, -37884, -90562, -227736, -298745, -280958, -226145, -241938, 4444, 124857, 136989, 139497, 56593, 55992, 82311, -44918, -147707, -40372, -9323, 6637, -106382, -213998, -218294, -249469, -256111, -174556, -152428]
19762a52428M8596P6454L1095N7121o6500j5072L4045Q3391m4603j72124J0382
19751a09643L6901r710Q6079P8423O803r806J1792r3198k9150J00662J16222m0196
19739A45179q6922l8829j8916M3153k8408n7740K6033M956k2780Q5299k8953k6457
19727d385k887Q2141N0576n3316j13974K0034m09j09037l0269J16144p5459M8428
19715g2413k5315p6041O425K9928N840J34857L1490j7816R7084p5882k2089o7045
19703e0977q3523q4727Q5588j2627L071M614j0682N4320O9390L2697j09928j29194
19691b31978l126K64328O6836j02054l7710J2601J00002l3915q4598J9457J7981
19680a2176q7621l6411K1035P7633m312M1736L6682n9018p1499O6876J1976O5901
$$ y = [-152428, -103832, -27378, 3717, 60838, -5662, -20734, 13311, 96702, 52099, -120025, -109643, -72742, -82452, 3627, 82050, 88853, 79047, 90839, -2359, -31509, 69153, 185375, 145179, 58257, 19428, 512, 43665, 15257, -42483, -16450, -11494, -34274, 51025, 22072, -4385, -7272, 74869, 125445, 72129, -41845, -21811, -22220, -131257, -161526, -45382, -120841, -72413, -97728, -173769, -167344, -137416, -131576, 3281, 34771, 16955, 114039, 38157, 16068, -50977, -134500, -219227, -133639, -146266, -143195, -138581, -149263, -94943, -25553, 7144, -102784, -231978, -235104, 29224, 96060, -5994, -43704, -31103, 68899, 34984, -49614, -30157, -12176, -99797, -136208, -115173, -37540, -41852, -116, 36566, -22452, -93951, -27075, -15099, 50802]
19668E0802K1725p870L0672o3243p4710J12125J6382N087j0300j25661o5430o2709
19656a73130k2693M1740m2369N6074M0103J3490l9313O411R8263L7443n6708o8030
19644a08719o3208m7708M7433L443L6596N9514L3337q0900m471N0418M5554n7796
19632h6507O1004N5935o2057m9724p2023K0569N2493P0077N6916k9271L9268k6790
19620B9890l9969k367l466M2697l3009M9942L4732j3686M4409P7863o1451n1615
19608G3970N0304j4532o6447m0780n0230J23186J05897q3891k0003m6675L3135
19597F3934P5905p0696n9412j5861n5039m6068O7110K3115o9432J9700J7464P8588
19585B9308R99l4715N1098K7173o6615p4117j1416q975N9539J9221l5432m0788
$$ y = [50802, 72527, 64657, 95329, 32086, -42624, 69501, 85883, 90970, 80670, -44991, -110421, -173130, -195823, -154083, -196452, -140378, -100275, -86785, -126098, -119687, -21424, 16019, -40689, -108719, -171927, -219635, -172202, -168759, -132163, -72649, -39312, -120212, -124683, -74265, -28711, -86507, -25503, 30432, -31625, -81349, -153372, -132803, -80310, -10233, 46683, 17412, 56680, 29890, -10079, -12446, -15912, 26785, -6224, 43718, 78450, 64764, 109173, 187036, 125585, 73970, 124274, 109742, 43295, 2515, -47715, 75471, 181368, 97477, 77474, 30799, 63934, 139839, 69143, 9731, -6130, -61169, -107237, -40127, -17012, -86444, -66744, -49280, 29308, 30307, -4408, 46690, 73863, 7248, -66869, -78285, -87260, -27721, -8500, -43932, -84720]
19573h4720O1711P3999p1088p2545Q7101R1309O582m1935m821j2242J5678l4330
19561A4699J1172N0276J68372Q9461Q6627J24170J9089n4595K6879J42967J06770
19550G85887J3641n7186j22947r1116q204R3009J49851J58239O8080J725J5984
19539A006963j2619M054N0942J6492j89965j17491j27955j82645r5710M2286J05674
19528E00026Q9566N1717j08546j48878q6439r16r3312k06989l3204J31270L2768
19517A27063M1037K5015K9728j13956j2292O1046l9311r8486M6342J01347P8652
19506B46185J55201j5196J07044J23758j03335k0697J2688O4685j0625P566J25683
19495F92957K28119J37492m6800j40856M4139J94219K0570r0747j28231j33360
$$ y = [-84720, -23009, 50990, -20098, -92643, -5542, 85767, 92349, 50414, 45593, 33351, 49029, 14699, 25871, 76147, 244519, 333980, 420607, 544777, 563866, 509271, 536150, 679117, 785887, 799528, 742342, 619395, 528279, 520075, 613084, 762935, 921174, 989254, 990979, 1006963, 994344, 998398, 1049340, 1065832, 875867, 758376, 630421, 447776, 352066, 394352, 500026, 589592, 641309, 532763, 383885, 297446, 296530, 203218, -3771, -36975, 94295, 127063, 168100, 193115, 222843, 108887, 96595, 157641, 118330, 19844, 66186, 167533, 246185, 401386, 386190, 493234, 616992, 513657, 492960, 505648, 570333, 559708, 567274, 692957, 921076, 1058568, 1011768, 870912, 915051, 1109270, 1129840, 1039093, 910862, 777502]
19485G77502j17969J469M2547Q2821J03237P6352n6064j64461j52153j43002j5126
19474D35153J24427k0427j13062j37444r0297p6138p2865p6486O5907J03833r5758
19463D6843j35287r718J5803q6764L6955P5916N0990O9794M5807J1964K1078j36705
19451F676K1274K9438q660m79K8512L8432N0001l4569k1848Q4235o514n5095O1506
19438A92909q3126j12217p6925K4841R7433J6268J4207M8235p0647l9784l0682
19427a9488L9186P8056n4811J6972O5405l0124n7532l4305Q380o306m3765R5391
19415E7059J5938O642J5549n2583j79066m9053j11381k9622K14467J35854n8968
19404c5164K3280J25738n424j11401m8455r3624L2388M5588N0604K3059R4981
$$ y = [777502, 659533, 661002, 703549, 786370, 889607, 965959, 909895, 745434, 593281, 450279, 435153, 559580, 539153, 426091, 288647, 198350, 122212, 49347, -27139, 38768, 142601, 46843, -88444, -98162, -82359, -169123, -132168, -56252, -5262, 64532, 110339, 122303, 143381, 6676, 27950, 57388, 48728, 48249, 76761, 115193, 165194, 130625, 108777, 193012, 186498, 131403, 192909, 109783, -2434, -79359, -54518, 42915, 59183, 73390, 121625, 50978, 11194, -19488, 19698, 97754, 42943, 59915, 125320, 95196, 37664, 3359, 11739, 5433, -38332, 57059, 72997, 79639, 95188, 42605, -136461, -185514, -296895, -326517, -112050, 23804, -35164, -11884, 113854, 108430, -2971, -51426, -145050, -112662, -67074, -16470, 6589, 101570]
19393A01570L6455L4595k7858j4590n9976k00821j8616K9601N4593P6223r839
19382A337p1847n3920J17233L0482J3722p7443j2313J02137O3215k8165p95l7305
19370D6338j21858r013J34899N3416m5915l6026l276m7445J14916K6855J9345
19359A32236O7171N1341m5784m0870j53366j80482K3425k8745o4837K4062Q2722
19348a33127M2944j093L7549M8462L5627O3862l4496L0247q484j52011M4769N101
19336b0650k2352j7516J00137L8550J2539n8312M1708j12j5827n0515m5302K2206
19324a5446n379O9911k4063J763J1715J11716J0066K0428n4079K8446M9166n987
19312A98257o9289j301q1543k4784N2660J7571k6513o6083j6296J34776M1896
$$ y = [101570, 138025, 172620, 144762, 130172, 70196, -130625, -149241, -119640, -65047, 11176, 1337, -70510, -124430, -7197, 23285, 37007, -40436, -52749, 49388, 112603, 84438, 83643, 46338, -75520, -84533, 50366, 103782, 57867, 21841, 18565, -28880, 86036, 112891, 132236, 199407, 250748, 204964, 164094, 10728, -169754, -146329, -175074, -239911, -215849, -133127, -90183, -91276, -53727, -5265, 30362, 94224, 59728, 89975, 81491, -70520, -25751, -20650, -43002, -60518, 39619, 78169, 90708, 32396, 74104, 73992, 58165, 7650, -37652, -15446, -20825, 49086, 25023, 26786, 38501, 150217, 160283, 180711, 126632, 155078, 204244, 198257, 128968, 127667, 46124, 21340, 74000, 91571, 65058, -1025, -17321, 117455, 159351]
19301A59351n2937q367N3343R3337n1556j8532n6162j9677M2319J26174R6723
19290C64016L6439m7153k5381p8854n4853m9566K5319K5245q1172n8445J2369
19279F7964M4715K2429R908p5822K0519j0262M8296j14700L7097Q0658l4144j00172
19267c514j25056M0560M8174P518J39923Q6186p7202r4911o0456j983J05407P7188
19255A41834j40433J17848j7788J914Q2295P2682N279p3378L1235L0758r4566
19244A57680O2170p7693j29764M6357J50167J08442Q4878J18383N8696j04001
19234D75315r6556j54601j14222r4589k7837K0467O1393Q5052j1031j3624n9452
19223G0315m0353M9766k4703q0842k2687P767O3822J27668O7857m961k6073J806
$$ y = [159351, 106414, 98047, 151390, 244727, 193171, 174639, 118477, 98800, 141119, 267293, 364016, 400455, 353302, 327921, 249067, 194214, 144648, 169967, 195212, 114040, 55595, 67964, 112679, 135108, 145016, 69194, 89713, 79451, 127747, 13047, 50144, 130802, 96658, -3514, -128570, -88010, -39836, -32318, 107605, 193791, 116589, 21678, -38778, -40761, 64646, 141834, 1401, 119249, 101461, 103375, 185670, 258352, 263631, 190253, 221488, 252246, 157680, 219850, 142157, 12393, 58750, 208917, 317359, 402237, 520620, 579316, 475315, 378759, 224158, 109936, 15347, -12490, 7977, 69370, 154422, 143391, 129767, 70315, 29962, 79728, 55025, -25817, -48504, -40737, 23085, 150753, 218610, 213649, 187576, 189382]
19211A89382N3819J5410K5693q0678m6061J6414J41884k5400n5041M527m3932
19200A96017O7250K8941l5560o9603j7304K8748R2575Q0075l7548j081l1846j23035
19188A77629m5438m6890l8530j0242J833J0333j33713o8659j9865N6367L9429
19177g7746j992J05435O6903K6434M373K1916K4774J23994O467n3345K3040M9516
19165C19769p8904q480m4380L4733J18827K2558M4806j38539q0825K2181Q4556
19154B96302l2036N9652l8653K3116m6510o8736K83m872m3182r3598m9066O5342
19142F8042J37333q229L6900K8410K6345J7429k9195j05944J6756L9543p1675
19131A55715m914k6944m7621M8782N9670J35203r4135J8798J05463K1633m4400
$$ y = [189382, 243201, 258611, 284304, 203626, 157565, 173979, 315863, 290463, 235422, 239949, 196017, 263267, 292208, 256648, 187045, 169741, 198489, 291064, 371139, 333591, 332510, 300664, 177629, 132191, 85301, 46771, 36529, 38362, 48695, -85018, -153677, -173542, -117175, -77746, -79738, 25697, 92600, 119034, 123407, 145323, 170097, 294091, 300558, 247213, 270253, 319769, 240865, 232385, 188005, 222738, 341565, 364123, 408929, 270390, 189565, 211746, 296302, 264266, 323918, 285265, 308381, 261871, 193135, 193418, 188546, 145364, 51766, 2700, 68042, 205375, 197146, 234046, 262456, 288801, 306230, 277035, 171091, 187847, 227390, 155715, 150801, 123857, 76236, 125018, 184688, 319891, 225756, 244554, 350017, 371650, 327250]
19120C27250L860j3652K5596j11743k4235L0886K7526J70198n3865j2674R4611
19109D63758R547J1887L010j756P1438M7434M3167Q4909k0296K9857l5148k6282
19097F81525O1924J25621k3777j6024m3403M6420P1751n3517k3315P7813j2510
19086H92508N8935P2348O4715J78083Q5455J2285J5828J45453K15213K35035J64600
19075B140458J69534K04295K29586M71774O60047Q46204Q66774N66680j27012
19066F028340k91575j8134L38023N24320R28717J470272K150420L254944N255447
19057A9640774Q275345J0908236Q248776k19096p217981q095139n291329k163146
19049B4086440m9528J648300L242400N053821P871229J2582138K0542989L4830586
$$ y = [327250, 331110, 317458, 343054, 231311, 207076, 237962, 265488, 435686, 381821, 369147, 463758, 473305, 485192, 488202, 486446, 557884, 605318, 648485, 733394, 713098, 742955, 707807, 681525, 743449, 869070, 845293, 829269, 785866, 832286, 904037, 850520, 827205, 905018, 892508, 951443, 1023791, 1088506, 1266589, 1352044, 1364329, 1380157, 1525610, 1740823, 1975858, 2140458, 2309992, 2514287, 2743873, 3215647, 3875694, 4721898, 5588672, 6155352, 6028340, 5736765, 5718631, 6056654, 6580974, 7509691, 8979963, 11130383, 14385327, 19640774, 27916119, 38824355, 47073131, 46854035, 39636054, 31540915, 26249586, 24086440, 24036912, 25685212, 28927612, 33981433, 41852662, 54434800, 74977789, 109808375]
19041A09808375O0017694R6933072J15329945O2074470k6793317p2906954p2841750
19034B71621535o3798748n4525842l9556770k3217286j0485335r16664Q467214
19027H7588104J8034048K2272618J0628267j2596738k7585333k7102319j9240223
19020E1998424j2250385p874472n093979l388819k151163j408703n50178O8703
19012A9349428M22910J67853k37983l54098m42187m82551k38312K66096Q56145
19003A9307301J760452K908951M602962P073572J0886415J7307112K5509292K9598452
18995A18954509J8209103n335973k1139931k0723258j1742019j870018P988452
18988H4340865K0023819L6611264N5727196O8367935P6981133Q6863282N9997046
$$ y = [109808375, 169826069, 266759141, 382089086, 444163556, 417370239, 344463285, 271621535, 207822787, 153296945, 113740175, 90522889, 80037554, 79120890, 87588104, 105622152, 127894770, 138523037, 125926299, 98340966, 71238647, 51998424, 39748039, 31873567, 26779588, 23390769, 21239606, 19830903, 19280725, 19349428, 19772338, 19940191, 19702208, 19348110, 18905923, 18423372, 18185060, 18451156, 19307301, 21067753, 23976704, 28579666, 35653238, 46539653, 63846765, 89356057, 118954509, 137163612, 131827639, 110687708, 89964450, 78222431, 76352413, 84340865, 104364684, 140975948, 196703144, 265071079, 342052212, 428915494, 488912540]
18981D88912540l1172577j11755500j18092479q0682108m5962630k6292927j5889818
18974E9064501j0036898o666866m489243k635781r07086J401119M311639P812316
18966D7853701Q853162K456693p767944j2690555j0838893o845132m124857k676273
18958A4219902j857735j281677p66571l06811j20333r4355j91379p20244j234086
18949G646711j194585r07871o25097m21146k65311k80948j55406j28365k32128
18940C435854j86475o5846j11892j89196j36391j69476j25207j02555M835o1540
18930B292111j62036j77056l9889j14471j25068k49979j67650R8229P7600q2981
18920A348810r0553L6455p0849K2343k9669j12831o3762J19924j415o0790o6740
$$ y = [488912540, 457739963, 345984463, 227891984, 147209876, 101247246, 74954319, 59064501, 49027603, 42360737, 37871494, 35235713, 34328627, 35729746, 40041385, 47853701, 56706863, 59163556, 51395612, 38705057, 27866164, 21021032, 16896175, 14219902, 12362167, 11080490, 10313919, 10007108, 9886775, 9792420, 9601041, 8880797, 7646711, 6452126, 5544255, 4919158, 4498012, 4232701, 3951753, 3796347, 3667982, 3435854, 3249379, 3183533, 3071641, 2882445, 2746054, 2576578, 2451371, 2348816, 2353651, 2292111, 2130075, 1953019, 1913130, 1798659, 1673591, 1423612, 1255962, 1354191, 1431791, 1348810, 1258257, 1294712, 1223863, 1246206, 1216537, 1103706, 1039944, 1159868, 1158453, 1097663, 1030923]
18909A030923N9132K6439L5349j46513p3230l613l7973k0047J8664m9028m7260
18898G92843N5336M575k8548P715L2257J4658k4816l8453k7602J542j9024k3437
18886G47046P597q6535o5544m5839p5473n9080P2514O6346N0637K7597m9442q3283
18874E06541j14530Q945j713P9576p9235L8078Q602p3360l7552q1525k4460R6927
18862C26294N2661J07568K3208p0509p117K08984J36612q5678j30196k13460O3835
18851D12202J5122O6283p7004j37114M9747M952M7772J0660o883N386p2898P9882
18839C98107Q6818p4801l3140N5126j0193m5548r6474j1488M9929r906p6513m9909
18827A82008k9835M9910J12124m5154r8806j97963o977J50010J08209J6114K1847
$$ y = [1030923, 1090055, 1116494, 1151843, 1005330, 932100, 928487, 890514, 870467, 889131, 840103, 792843, 848179, 852754, 824206, 831921, 864178, 878836, 854020, 815567, 787965, 789507, 770483, 747046, 754643, 668108, 602564, 556725, 481252, 422172, 494686, 561032, 611669, 639266, 589824, 506541, 392011, 400956, 399243, 478819, 399584, 437662, 446264, 372904, 335352, 253827, 229367, 326294, 378955, 486523, 509731, 439222, 432105, 641089, 777701, 692023, 561827, 348367, 412202, 427324, 493607, 416603, 279489, 329236, 334188, 381960, 392620, 385737, 391123, 318225, 398107, 484925, 410124, 376984, 432110, 421917, 376369, 279895, 268407, 318336, 308430, 231917, 182008, 152173, 202083, 314207, 269053, 170247, -27716, -34693, 115317, 223526, 239640, 261487]
18816B61487M8612o5069j54089j01557N1855J3719j2360J01511O3879k1286o71
18805A86031J4240p6063l1863N7159l4542J53842L3710j44518j9865j3380n4681
18794G0070Q6815L9286m0422l985L140L9663J6802p5124q815K176Q3614m0053
18782A73167m9345o1947N6145J02909J05727m6206j27724q1550P8578j4520j00806
18771C4428R4821K68391J37280K68752M57573K44934k77001l83604l23645k47928
18761B74001k8383R8376n8624p2984O0655j7112p8422o7752j05997q20r64J26726
18749A28700J24844O9975p025j56362j35000p2445P3188J35434k7702j2662n3336
18738F7609M0829N4202m3721O858k3935P6401J19403k7225M2908j5090o4237j03591
$$ y = [261487, 310099, 245030, 90941, -10616, 41239, 54958, 42598, 144109, 207988, 186702, 186031, 200271, 124208, 92345, 149504, 114962, 268804, 302514, 157996, 138131, 124751, 70070, 156885, 196171, 155749, 151764, 154904, 194567, 211369, 136245, 127430, 129606, 213220, 173167, 123822, 61875, 118020, 220929, 326656, 280450, 152726, 71176, 149754, 135234, 34428, 129249, 397640, 534920, 803672, 1261245, 1506179, 1229178, 845574, 521929, 274001, 245618, 343994, 285370, 212386, 273041, 255929, 177507, 109755, 3758, 2938, 1974, 128700, 253544, 323519, 316494, 160132, 25132, -47313, 25875, 161309, 133607, 120945, 67609, 108438, 162640, 118919, 125777, 101842, 178243, 297646, 270421, 313329, 298239, 234002, 130411]
18726A30411k6384K616q5698n7630n3852p3370J69737L8057n9370n6652O7705
18715d430R7695N8208m9291J1638K5135N903j9140p8649J1705M2003j10112n7876
18703f7211R3802J7542m8479L4835j7165n6596L843P0820n5151n1918p805J2111
18691g1372L6656l4648j6026j564R3149M569k3875l4441J20871L2214j46836n4429
18679i5732M4929R0133J31197J7761P4314n9544j26252N1446L0630l0141o7899
18668F0842j16298J759J12243L1201J02086l4657J4726L6396l305q1753n8075
18657F5165L0998k14j17266K764M4999K4706J21001N6088l906r4689q9738J8606
18645E8514j8685r2852K2528J1267O4030J9860R2685j185o7323j4545N6895M9095
$$ y = [130411, 104027, 106643, 20945, -36685, -90537, -163907, 5830, 43887, -15483, -72135, -4430, 93265, 151473, 102182, 113820, 138955, 144858, 125718, 47069, 58774, 100777, -9335, -67211, 26591, 44133, -4346, 30489, 13324, -43272, -39429, 31391, -23760, -75678, -83483, -71372, -34716, -69364, -85390, -86954, 6195, 10764, -13111, -47552, 73319, 105533, -41303, -95732, -50803, 39330, 170527, 188288, 262602, 203058, 76806, 128252, 158882, 128741, 60842, -55456, -53697, 58546, 89747, 191833, 157176, 171902, 208298, 204993, 123240, 65165, 96163, 95949, -21317, -18553, 26446, 51152, 172153, 228241, 224335, 129646, 39908, 58514, 39829, -53023, -30495, -19228, 44802, 64662, 157347, 156162, 88839, 74294, 131189, 180284]
18633A80284n7151p301o8571j06169k9041P5736J20913M351l0994m2209K3885
18622F3733k0418k7386l3282j03031o8801J04044Q5863r5434J7985J26453M6300
18611I6026J29905j47469M3082L7532m2569l0159o3798q3627M1178l0408o3815
18600a14122j0444O230J65851Q0624r4652o7578K6591l5827k9873L9455L6115
18589B370k5043K2097L4211Q642K3135k3976L1692m2078k5080o7678n1471O4958
18577d8221p764k2031K4677J53634M1915O9344o7027j22583l2840O3346J16992
18566A69442P6684j6826O783p7818j10464M5759J0098J3963j12987O092J4049
18555B4775O7754p327J9606p2852N242L9502j7056Q255L971n5262j8850M1926
$$ y = [180284, 123133, 115832, 47261, -58908, -87949, -12213, 108700, 113051, 82057, 39848, 63733, 43315, 15929, -17353, -120384, -189185, -85141, 722, -94712, -76727, 49726, 96026, 225931, 78462, 121544, 159076, 116507, 86348, 22550, -61077, -19899, -50307, -114122, -124566, -118336, 47515, 128139, 33487, -34091, -7500, -43327, -73200, -33745, 2370, -22673, -576, 33635, 42277, 65412, 41436, 73128, 31050, 5970, -61708, -113179, -48221, -55985, -78016, -53339, 100295, 142210, 211554, 144527, 21944, -10896, 52450, 169442, 246126, 229300, 236083, 158265, 47801, 93560, 103658, 117621, 4634, 10726, 24775, 92529, 85202, 104808, 31956, 37198, 76700, 59644, 67899, 71870, 16608, -2242, 39684]
18543C9684J42416J36341J4353r511j19648J6396J01430J60310J04713K63552
18533H50036J12046j21460j07792k6986l8548O3316J48678K60998q225k73448
18523H58615k3345J12751J33569K0812k05103k32681j75480p0690k01970o1428
18513A55050n0946l321J18695Q4248J62538L1788j31445q4565n3105O24N9275
18502B88836k1169p5397o9670m231M3470K130K8309O722o7299J7935j6841n0463
18490H2332R2974J53443J3434N2429J75782J30524J07670j01363j44788P6229
18480F38666R5634J58856K82978K87135L265j91323j99951j14962j84206j52525
18470F23567N2261P6215R4893m7837J7109P3316J69541J93j10800j30815j16456
$$ y = [39684, 182100, 318441, 332794, 323283, 203635, 220031, 321461, 481771, 586484, 850036, 962082, 840622, 732830, 705844, 667296, 730612, 879290, 1140288, 1132063, 858615, 835270, 948021, 1081590, 1102402, 897299, 664618, 489138, 418448, 216478, 155050, 104104, 100783, 219478, 303726, 466264, 498052, 366607, 282042, 228937, 229561, 288836, 267667, 192270, 122600, 118369, 161839, 163969, 192278, 199000, 131701, 149636, 132795, 82332, 175306, 328749, 342183, 394612, 570394, 700918, 808588, 707225, 562437, 638666, 734300, 893156, 1176134, 1463269, 1466534, 1275211, 1075260, 960298, 776092, 623567, 675828, 752043, 846936, 799099, 816208, 889524, 1059065, 1059258, 948458, 817643, 701187]
18459G01187p9715j3664n9756q138o6883k07445j23949k4962o5307L9296J340
18448I2004o7137k1360M7504J51958q8677m8962R721j41547j223M8628o788p0229
18436i6108L8928M0069j5125j13946j120J45059N9089k2181L5727m2397j2217
18425A5778o2135j37170L2934J22281R8403k4248j16032N1909L7797M7125P5400
18414A42042r8034n3077r4560N970J17601J23753R2283k0785p8155o6247m5632
18403B5159k0452o2614j28580p7129P3824J60542J7506n6552n9908j0069R7470
18392d0803M1181n9803m4140j6163R10N0283N1030M3751K9728n2427o1671l3118
18380i1242P0457K0011N714Q1954o2508n6495P5549k5145m2383k5534N9290Q4826
$$ y = [701187, 621472, 607808, 548052, 539914, 473031, 265586, 141637, 116675, 51368, 90664, 92004, 24867, 3507, 51011, 202969, 114292, 65330, 75051, -66496, -67719, -19091, -25879, -96108, -57180, -17111, -32236, -146182, -147302, -2243, 56846, 34665, 70392, 27995, 15778, -46357, -183527, -150593, -28312, 70091, 45843, -70189, -18280, 19517, 66642, 142042, 44008, -9069, -103629, -97659, 19942, 143695, 235978, 215193, 137038, 70791, 25159, 4707, -57907, -186487, -263616, -189792, -29250, -11744, -68296, -128204, -138273, -40803, 378, -59425, -103565, -119728, -118818, -68535, -17505, 26246, 55974, 3547, -58124, -91242, -20785, -774, 4940, 86894, 24386, -32109, 43440, 18295, -24088, -49622, 9668, 94494]
18368I4494m4594M005q0820N4917L0860o936l5421O9805M9068Q686j03398L9453
18356H0119L6381k3723l5371r5637j5067m6210O231l4677M4172l2853o6026J8340
18344a64321R0821L8671M7899m677q7453K212M4029k0440n0945P0445Q9354l4022
18332B1573m121j06356r5038l1508Q707P2667N2546P458P1477Q5938K8068Q18
18320A12229k9276M3400R9885j14298j12563J7621m7083J2970j3374J42j7277
18309d7624J7172P7290k7701K8257k5398m5756n999l8039M1156O5151J6771L4162
18297H9442r0071p5982j1414n7956L2402O4954L4695N1937L0958M1659P3984n125
18285A79483l2200o2063m8501P0320K1201K5142M4471p0165j05213R3274J43505
$$ y = [94494, 49900, 53905, -26915, 28002, 58862, 51926, 16505, 86310, 135378, 144064, 40666, 80119, 116500, 92777, 57406, -38231, -53298, -99508, -93277, -127954, -83782, -116635, -182661, -164321, -73500, -34829, 13070, 8393, -79060, -76848, -32819, -53259, -104204, -33759, 55595, 21573, 17452, -88904, -183942, -215450, -206743, -134076, -81530, -74072, -2595, 83343, 111411, 112229, 82953, 126353, 226238, 111940, -623, 16998, -30085, -17115, -30489, -30347, -47624, -30452, 46838, 19137, 47394, 21996, -23760, -29759, -67798, -26642, 38509, 55280, 89442, -629, -76611, -88025, -145981, -113579, -48625, -13930, 38007, 68965, 110624, 184608, 179483, 147283, 85220, 36719, 107039, 128240, 153382, 197853, 127688, 22475, 115749, 259254]
18274B59254R3276o9827q5008j21219K395K5403N1488M7174J39298k0836j33119
18263A88279o9249J36l338N4220j9483K605M2364J98390O3146P4651J55181J35253
18251H22155P7040J58104M659k0361j31572j48485j7485l3384o9671q1939J1850
18240E70911J62151l7242K6210J51020J48160R1776K1650l7887r6807j3555J5766
18229A002153n1193j62114l6192l3807q1865q9912r5707l0527j19369q3082o2685
18218A55700P1140P8932n7612k2269N6377j6522j1278L3157j6157k7236j04479
18207A39753k0585J37173O2887R5144m341L0171o1136k02636k3455R0964J10400
18196C54339J27278O9804K4839K33796J72497N4450J13943L1798j46359o3403
$$ y = [259254, 352530, 282703, 197695, 76476, 78871, 104274, 155762, 202936, 342234, 321398, 188279, 119030, 119166, 115828, 170048, 150565, 153170, 195534, 393924, 457070, 531721, 686902, 822155, 899195, 1057299, 1061958, 1041597, 910025, 761540, 744055, 710671, 641000, 559061, 570911, 733062, 695820, 722030, 873050, 1021210, 1112986, 1134636, 1096749, 999942, 986387, 1002153, 950960, 788846, 752654, 718847, 636982, 547070, 451363, 420836, 301467, 218385, 155700, 226840, 305772, 248160, 225891, 282268, 265746, 254468, 287625, 271468, 244232, 139753, 119168, 256341, 319228, 414372, 410031, 440202, 379066, 176430, 152975, 243939, 354339, 481617, 551421, 576260, 810056, 982553, 1037003, 1150946, 1182744, 1036385, 972982]
18186I72982L3549J267l7433k2619j21077J332J27420K6814J64170m6083j32857
18175I67465p3224L7179j51552k07431q618M8753N7217l4079r7190j2089j4299
18164E12132j5034J5217l4747K6971o0230j17791p7842P3980J03358j3961O3922
18153D75975J11471O1202J06560M4095J9108l8525M3025J29976J75112K12858
18143A340857K16595J63456n9833k84177k02388j80573j13802M5899K04691J58454
18133A289179O5075N3024P630O6025O6548J42986K31144J29519K24096L18824
18123B594050K59217K54020L12833M70073Q56447J010162J293248J825694K713910
18114A1589654M262567O950701J1905988K1817898M1320697P2243049O1444211
$$ y = [972982, 1006531, 1007798, 970365, 947746, 826669, 828001, 955421, 982235, 1146405, 1100322, 967465, 894241, 931420, 779868, 572437, 563819, 612572, 669789, 635710, 538520, 526431, 512132, 497098, 512315, 477568, 504539, 444309, 326518, 248676, 322656, 426014, 412053, 475975, 587446, 648648, 755208, 799303, 818411, 779886, 822911, 952887, 1127999, 1340857, 1557452, 1720908, 1661075, 1376898, 1174510, 993937, 880135, 926034, 1130725, 1289179, 1354254, 1407278, 1414908, 1480933, 1547481, 1690467, 1921611, 2051130, 2275226, 2594050, 2853267, 3107287, 3420120, 3890193, 4746640, 5756802, 7050050, 8875744, 11589654, 15852221, 22802922, 34708910, 56526808, 97847505, 170090554, 231534765]
18107B31534765k9867221p2373746n7277725k8434445j3963955p554482m483281
18100A7579910k711284k010851j541153j006219r39385j030597j176766j063874
18092F099781o45880l07784o6896k11906j98113k08183l97758n18447n27193m62958
18082B554663l44919k34048j77592j26163q6221j18712p1815j67895j12549N970
18072A120719J67607J91495J12022L1591o2290k25551r0162j26292j55554j24242
18062H39343p7643R4796Q8679O8981K89491L57133N20665P79548Q52105N16093
18052D329191R3472j86267l03070k16295k56745l69011m69349l95359l11166j73027
18042A742374j94528j42012j65536j78536k16238q5347r2541p2686j23295L936
$$ y = [231534765, 201667544, 129293798, 72016073, 43581628, 29617673, 22063191, 17579910, 14868626, 12857775, 11316622, 10310403, 9371018, 8340421, 7163655, 6099781, 5453901, 5146117, 5079221, 4867315, 4669202, 4461019, 4063261, 3544814, 3017621, 2554663, 2209744, 1975696, 1798104, 1671941, 1585720, 1467008, 1395193, 1227298, 1114749, 1120719, 1288326, 1479821, 1591843, 1623434, 1561144, 1335593, 1245431, 1119139, 963585, 839343, 761700, 856496, 945175, 1014156, 1303647, 1660780, 2181445, 2960993, 3813098, 4329191, 4422663, 4236396, 3933326, 3717031, 3460286, 3091275, 2621926, 2226567, 1915401, 1742374, 1547846, 1405834, 1240298, 1061762, 845524, 760177, 667636, 594950, 471655, 475591]
18032D75591Q2033m2565j27391k1236p5381N2647L4594j7972M539L7439p559j14298
18020B80441M176j1789r8714k3797P305k6137M2307R5693M2182N3024n2976q8988
18008B22727N4242K6734J10560J45861N8795M9475K00586O1448J77266J46555
17998A254249J38779J04973K76478M08029L60667L25079K06242M76383N88189
17989D139068L00815M30685M56757L00854l8795o6174K13388O5262k75302k63639
17979E262919l88960l35964k42592l26202m70165m15103l97503l54921l43178
17970A988331l14293j13688q8401j94927j08486n8517J8662j1292j01246p1069
17960I45074m9953M2517k3887n5782K898M5380J17508J72539K01141J18592J59186
$$ y = [475591, 557624, 515059, 387668, 366432, 291051, 343698, 378292, 360320, 364859, 402298, 394739, 280441, 284617, 272828, 174114, 150317, 157622, 131485, 173792, 269485, 311667, 364691, 311715, 222727, 276969, 303703, 414263, 560124, 618919, 668394, 868980, 930428, 1107694, 1254249, 1393028, 1498001, 1774479, 2182508, 2543175, 2868254, 3074496, 3550879, 4139068, 4439883, 4870568, 5327325, 5628179, 5589384, 5523210, 5736598, 5801860, 5526558, 5262919, 4873959, 4537995, 4295403, 3969201, 3499036, 3083933, 2686430, 2331509, 1988331, 1674038, 1560350, 1471949, 1277022, 1168536, 1110019, 1128681, 1117389, 1016143, 945074, 895121, 937638, 913751, 857969, 860867, 906247, 1023755, 1196294, 1397435, 1516027, 1675213]
17949A675213K48451K39650O1699P31J78435K35479K16398N1597q235J9958L953
17938B923329O2165N8638k9973m0426J28061J998n2439j2982j80828k31542j50498
17927B475503k54579m13162l82045k97752k14234j05042j36136K805L5138J81127
17917H91623k0261k03004m3480O2495M492r579M8304n2966m5103N9949j52826
17906E39644j18098o4965J7208k7874R554M364K2987K2986o5452J1960Q8924N4067
17894D95305k9069n2953l3046R2472K09822K5240Q2197n9122l9037l9325j05839
17883E46645J294m0548j06445L4234n20o0118q0062n8390l7383N8015K1354K9430
17871C07506J2749j56381m6512L1877p961l8769J6745J06887K5972l6228q5057
$$ y = [1675213, 1923664, 2163314, 2225013, 2225744, 2404179, 2639658, 2856056, 2907653, 2899418, 2919376, 2923329, 2985494, 3044132, 3014159, 2973733, 3101794, 3103792, 3051353, 3038371, 2857543, 2626001, 2475503, 2220924, 1807762, 1425717, 1127965, 913731, 808689, 672553, 675358, 710496, 891623, 871362, 668358, 624878, 687373, 691865, 682286, 730590, 677624, 632521, 692470, 539644, 421546, 356581, 373789, 345915, 355469, 359833, 382820, 405806, 340354, 352314, 441238, 495305, 466236, 413283, 380237, 472709, 682531, 707771, 789968, 730846, 691809, 652484, 546645, 547939, 507391, 400946, 435180, 434660, 374542, 294480, 236090, 198707, 256722, 278076, 307506, 320255, 163874, 117362, 149239, 141278, 102509, 119254, 226141, 252113, 215885, 130828]
17860A30828O7830M3896q3846k9534L2997P275K0082P554L6608m7093M4261R421
17848B40279M280Q3636l0135M0310M2052j28741j17792Q0898J55827k9596j74555
17837A66463r7197K1772J46267J01379K1505q7025j42213n0584P2249M4198N2111
17826B48925m2024n9668M5920J0209q4057k5580P0893K5655P7541l4723N8189
17815B91280K1669L6528K6008J48860N4917j4654o0474l8557l0996L1832Q7187
17804E53600Q381j41578P2245J71318L4796j19639O4792k9881O3727Q5575q6215
17793F77121n8317J8912J05292M7781k398L5087M4073l8934l8917q226j929R1237
17781H70782L9103P2425J35793L2937P012N1329J0917L9226J72012J39886J50330
$$ y = [130828, 198658, 242554, 158708, 129174, 162171, 169446, 189528, 197082, 233690, 186597, 230858, 240279, 244559, 328195, 298060, 338370, 380422, 251681, 133889, 214787, 370614, 341018, 166463, 69266, 91038, 237305, 338684, 360189, 273164, 130951, 80367, 152616, 196814, 248925, 206901, 147233, 193153, 203362, 119305, 93725, 164618, 190273, 267814, 233091, 291280, 312949, 349477, 375485, 524345, 579262, 564608, 504134, 465577, 434581, 466413, 553600, 561981, 420403, 492648, 663966, 698762, 579123, 643915, 614034, 677761, 763336, 677121, 618804, 637716, 743008, 790789, 788391, 823478, 867551, 828617, 789700, 781474, 779545, 870782, 909885, 982310, 1118103, 1151040, 1158052, 1209381, 1220298, 1259524, 1431536, 1571422, 1721752]
17770A721752K40131J78652J54978J56859J95746K76845L11810K01535K94577
17761C732885N97235Q97291J024090J340872J692213K107365K711085L724717
17753A7827753N409366O695273O558926N148940K349040j037992l434726m623600
17745C4892980l736593j403173J252468L704289O304497R814276J5445139K5215774
17737I1489657M1390662O2133952P2883864O7460703M8905362J5756268k0405782
17730C79614686n0113503o3839728o0005070m6251330l2354471j9567453p715020
17723I9768111K286873Q220090Q046385L758356l812797j1621024j7025373j8974929
17715G0645692j6706945j1994086p590357m749405l159511k423850k024329j768518
$$ y = [1721752, 1961883, 2140535, 2295513, 2452372, 2648118, 2924963, 3236773, 3438308, 3732885, 4330120, 5227411, 6251501, 7592373, 9284586, 11391951, 14103036, 17827753, 23237119, 29932392, 36491318, 41640258, 43989298, 42951306, 39516580, 34892980, 31156387, 29753214, 31005682, 34709971, 41014468, 50828744, 66273883, 91489657, 132880319, 195014271, 267898135, 335358838, 384264200, 400020468, 379614686, 329501183, 265661455, 205656385, 159405055, 127050584, 107483131, 99768111, 102054984, 110275074, 118321459, 122079815, 118267018, 106645994, 89620621, 70645692, 53938747, 41944661, 34354304, 29604899, 26445388, 24021538, 21997209, 20228691]
17707B0228691j306946j148834q14780l92158r0028L80270P31062R41758J297609
17698A9826644J871562K483768L757797N962770R429919J4043750J7196326J6545176
17690I1117712J2770912N683941j715455o806274q124032l763248N171463J6418089
17682A10753108K7871778L9788957N2423985N9134343N0103881K7289308n587782
17675C61777578l7357970n7426341o6871014n9578015m2177435k5511410j5048619
17668E7806774r395605o347048m271459k590928o13048J604861L026757K943520
17660D2163824J335578j374795l909116n685534o231893n301249l889029k826205
17652A4281581k144333j704058j425472j144474p99052n91910n70110m34201m35132
$$ y = [20228691, 18921745, 17772911, 16958131, 16565973, 16475945, 16856215, 17587277, 18529035, 19826644, 21698206, 24181974, 27939771, 33902541, 43332460, 57376210, 74572536, 91117712, 103888624, 109572565, 107857110, 101050836, 92926804, 89163556, 94335019, 110753108, 138624886, 178413843, 230837828, 289972171, 340076052, 367365360, 361777578, 324419608, 266993267, 200122253, 140544238, 98366803, 72855393, 57806774, 48411169, 42064121, 37792662, 35201734, 34588686, 36193547, 39220304, 42163824, 43499402, 42124607, 38215491, 32529957, 26298064, 20996815, 17107786, 14281581, 12137248, 10433190, 9007718, 7863244, 7064192, 6472282, 5902172, 5467971, 5032839]
17643E032839m63877m03200k26242j90870k49010j21310j23328j41639j83114
17634B930249j75698r6949j25615j44151j74455r3748J8831m8069r0219q6216
17624A913960L1003r073n7022j18333j37140j18276j11913n1266M4996O2445K9335
17613A478716n1013l8190K2222n8191P5021q8178N393q7238p9690j63180j6229
17602I99443M7807N6695K1680j11485J1060N3633j8128m7770j25153l81J569O661
17590H95631K7625m7869j17649l8849m5622k8584J6033j1277j11374p167J07306
17579F38204j5245k6003l1759Q4221R1385P0630j4687j447l5460o2730k584j5356
17567F79169j56043j6764j4068k7949n5168J5893J4625n1183J05117j0119p9533
$$ y = [5032839, 4568962, 4165762, 3939520, 3748650, 3499640, 3378330, 3255002, 3113363, 2930249, 2754551, 2657602, 2531987, 2387836, 2213381, 2119633, 2138464, 2090395, 2000176, 1913960, 1944963, 1935890, 1878868, 1760535, 1623395, 1505119, 1393206, 1341940, 1386936, 1449381, 1478716, 1427703, 1389513, 1411735, 1353544, 1428565, 1340387, 1345780, 1258542, 1178852, 1015672, 999443, 1047250, 1103945, 1125625, 1014140, 1025200, 1078833, 1060705, 1012935, 887782, 887401, 888970, 895631, 923256, 875387, 757738, 718889, 673267, 644683, 660716, 649439, 538065, 530898, 638204, 622959, 596956, 565197, 649418, 740803, 811433, 796746, 795299, 759839, 697109, 694525, 679169, 523126, 506362, 492294, 464345, 409177, 425070, 439695, 388512, 493629, 483510, 403977]
17556D03977R644J06713O9637K2266K746J4847O275p9157l7084J3675q8896j7760
17544D26883R9302n170k670k4884O8977P562R524m2071j04868j45501p1107N5838
17532B71815J03052k6092M3359m0911l7969O0252j7961l8220R998L8309J9122
17521C84754o2166k3075j8828L1687J03762J2885j28204r5825j46959n7763Q8936
17510H9204j8477k3260O3725P2972N4834p1829J5053q0022N5986J19307M3318
17499C20811p689l3014N1736l9195r8374l2928Q4064Q2856j20188o5897j5983
17488A26199n3903J12019M3094M2460K5850P554j3412j9890N0134q6642l8831
17477A94632L4327J0470o734q3424j30398J2440N3003O4868j1946n3774k8527
$$ y = [403977, 413621, 520334, 589971, 612237, 614983, 629830, 636105, 556948, 519864, 533539, 444643, 426883, 526185, 521015, 518345, 493461, 562438, 570000, 579524, 537453, 432585, 287084, 215977, 271815, 374867, 348775, 392134, 351223, 313254, 373506, 355545, 317325, 327323, 365632, 384754, 322588, 299513, 280685, 312372, 416134, 429019, 300815, 204990, 58031, 268, 89204, 70727, 47467, 111192, 184164, 238998, 167169, 182222, 102200, 158186, 277493, 320811, 313122, 280108, 331844, 292649, 194275, 161347, 245411, 328267, 208079, 142182, 126199, 72296, 184315, 227409, 269869, 295719, 303273, 289861, 269971, 320105, 233463, 194632, 228959, 239429, 232695, 149271, 18873, 31313, 84316, 149184, 137238, 83464, 54937]
17466E4937j3274N8980K365l5381k8992j7322R7834J01503L1047k3797l1805p3760
17454A22335J55029Q5631j42446k7855J49832M1240l2707O6862k1431L7259J87801
17443F21550L55082L96530j2652l17372m24652j33249k41813j38738l4254J15385
17433A85817k9911L9092L742k1678J6681O8697o7589j30524N9554o324J04959
17422B22516J63752l1900p492J0656p4623o5302p4683j8830P5214j1500l6145
17411A51663O3147j5830P0925l4130q2728n240m7474l2908J06424P5315l187q1405
17399A64572m015O0555N1000n0495n1755L8068M839j7617j09889j36230J32092
17388H1125P2766m8826R6073n8029o2759m0488o8602J03783J1141o1253O187L007
$$ y = [54937, 41663, 100643, 103008, 67627, 38635, 21313, 119147, 220650, 251697, 227900, 196095, 122335, 277364, 362995, 220549, 192694, 342526, 383766, 351059, 417921, 396490, 433749, 621550, 976632, 1373162, 1360510, 1043138, 618486, 485237, 243424, 104686, 70432, 185817, 155906, 194998, 198740, 177062, 193743, 262440, 194851, 64327, 123881, 117557, 222516, 386268, 354368, 346876, 357532, 282909, 217607, 142924, 124094, 199308, 187808, 151663, 214810, 198980, 269905, 235775, 153047, 147807, 100333, 67425, 173849, 249164, 245977, 164572, 160557, 221112, 272112, 221617, 169862, 207930, 212769, 195152, 85263, -50967, 81125, 153891, 105065, 201138, 143109, 80350, 39862, -28740, 75043, 86184, 24931, 31118, 34125]
17376C4125O8479M3267K393j2185O7495J13455J8803N757m0308P631L3698l0863
17364C11747j19397q8017r8258n2171P1544Q4448J0058k1698R920R8701Q3517
17353B90394j15922j18875K2266m5640L2778K7872N5442m2063P454R856n3265
17342G0297K0271J8194J5811k7642r7378j00633R0146Q0672N8120m6736Q9764
17331A70886l4669p8855k0420L2717j8074m9730p4485Q2135K16633L9206r674
17320B55670l3546r6272J5848j37634m7747J21186m2726j21514n0109M5912P9835
17309a1097P3022n2340K9577J17216L1786m6874j963p7224j30670q4528j1189
17298a64284J01536p5477J0527J123m5927P5046Q7450P1413j7792j03695N5681
$$ y = [34125, 102604, 145871, 148264, 136079, 203574, 317029, 335832, 341589, 301281, 308912, 342610, 311747, 192350, 104333, 6075, -46096, 25448, 109896, 119954, 98256, 108176, 206877, 290394, 174472, 55597, 77863, 32223, 65001, 92873, 148315, 106252, 113706, 123562, 70297, 90568, 108762, 124573, 96931, -447, -101080, -10934, 69738, 127858, 81122, 170886, 136217, 57362, 36942, 69659, 51585, 1855, -72630, 9505, 226138, 265344, 255670, 222124, 125852, 141700, 4066, -43681, 77505, 34779, -86735, -136844, -90932, -11097, 61925, 9585, 39162, 156378, 188164, 141290, 139327, 62103, -68567, -153095, -164284, -62748, -138225, -127698, -126575, -172502, -97456, -10006, 61407, 43615, -60080, -4399]
17287d399J5331k1937n6668p9475M1680J24247N5350m9002O236k6541J9900q9153
17275f4431o2895p398j6468Q8327K8136P6653P5695N2855M1263j2248J0411j4632
17263A95268o5776n4200m4014q2224M0949O9047J76707L3113J9806j7546n4535
17252B16595m4767k3605o3065K1643M9196n2396l8587K616O0771l1828m5533p0366
17240a9326O9492M957Q2802J36380o9631r3522M9742Q3810M6608J77197J72973
17229F41482K10361J87163M9711J7263p9451j51720j16204k6157J06659J9688
17219H58795q7132j3319K0838J37823J33169Q1068O5847J9384j02651r7542j07756
17208I08524l36751k49149j26702j9699J15545O13j11343N6214J75712R0104m7036
$$ y = [-4399, 10932, -11005, -67673, -147148, -105468, 18779, 74129, 25127, 31363, 4822, 24722, -64431, -127326, -134724, -151192, -62865, -34729, 41924, 117619, 170474, 211737, 199489, 209900, 195268, 129492, 75292, 31278, -50946, -9997, 59050, 235757, 268870, 288676, 271130, 216595, 171828, 148223, 85158, 106801, 155997, 103601, 65014, 67630, 128401, 96573, 51040, -19326, 50166, 55123, 137925, 274305, 204674, 111152, 160894, 244704, 291312, 468509, 641482, 851843, 1039006, 1088717, 1105980, 1026529, 874809, 758605, 732448, 839107, 858795, 771663, 758344, 779182, 917005, 1050174, 1131242, 1197089, 1216473, 1113822, 1016280, 908524, 571773, 322624, 195922, 176223, 291768, 292381, 181038, 237252, 412964, 503068, 456032]
17197D56032o4105p9407m1420N4192R1925j55443r3924l5297k32979p1626P7392
17186i4660J00735N6710J21661M7731l9981J6808J06970L3258J36931K32422J65553
17175H84138l4794l0698J01870P1091R5152l7495p2336j44019j88440q9354p8783
17164D76332j14456l3967M1776J03934J23155J10677O4260J03101P6081j315J2203
17153I61781l4813k54544j46852n9860j11125m13n780p6879j00703l6057K5067
17142A59822j7467n3096k8109J16115O1997j34465p6044M7256J06444k7868m3362
17131A11223j06965m4237k6173k6858K6888L0520k3353N1356k8576L2492k3868
17120b7551j34285l7677R4036K9414n5546P7191N2338q7346n0229J22339L9030
$$ y = [456032, 391927, 312520, 271100, 325292, 417217, 261774, 167850, 132553, -100426, -172052, -94660, 6075, 62785, 184446, 232177, 192196, 209004, 315974, 349232, 486163, 718585, 884138, 849344, 818646, 920516, 991607, 1086759, 1049264, 976928, 832909, 644469, 555115, 476332, 361876, 327909, 369685, 473619, 596774, 707451, 771711, 874812, 950893, 949578, 961781, 926968, 672424, 525572, 465712, 354587, 354174, 348394, 271515, 170812, 134755, 159822, 142355, 89259, 61150, 177265, 239262, 104797, 28753, 76009, 182453, 154585, 111223, 4258, -39979, -66152, -93010, -66122, -35602, -58955, -7599, -36175, -3683, -27551, -161836, -199513, -105477, -76063, -131609, -54418, -2080, -89426, -139655, -17316, 21714]
17109B1714L8280o88j09092j8966J3629K5505k885r896L5982L5731n5469j04569
17097a30724K1965M9480M7765K9115p215O9928n724N1311K0289j5294K2478n49
17085A52825o1506n9496j5608M0101o6182K0305m4903p4057O625K4329n7058l7365
17073a71990p326N6678J20403M6322K6611n5520m0609K2549P1160q0726j5642
17062b8090J5484k9206o8082M7750J27962M7883r4805o8757o4940P1604p8141
17051a21338j0146K2533j0396k1375P7592R8984j363n7467j15527p4511M3438
17040a69576Q3658J19247L7162J09274O6097o6817j27056J04528p6776p8621j1119
17029i999M9710N8797j6722o7741M891R275k4154j40M3411m5173n9519L6258M4612
$$ y = [21714, 59994, 59306, -49786, -68752, -55123, -29618, -32503, -42399, -6417, 29314, -26155, -130724, -108759, -59279, -11514, 17601, 10386, 80314, 74590, 125901, 146190, 130896, 153374, 152825, 91319, 31823, 16215, 56316, -9866, 10439, -34464, -108521, -101896, -77567, -134625, -171990, -179316, -122638, -2235, 44087, 70698, 15178, -25431, -2882, 68278, -12448, -28090, -12606, -41812, -109894, -62144, 65818, 113701, 18896, -49861, -114801, -43197, -121338, -131484, -108951, -119347, -140722, -63130, 35854, 34491, -22976, -138503, -213014, -169576, -85918, 33329, 70491, 179765, 245862, 179045, 51989, 156517, 79741, 1120, -9999, 39711, 98508, 81786, 14045, 18936, 28211, 4057, 3917, 47328, 2155, -57364, -21106, 23506]
17016B3506N668J12043k1370n4248j5415m4785o727q1915L9245L5174l9222R8024
17004D9978O3946p5632J5128q9110p5337J61842P5631o4024N6575R651j00932
16993B7716n3850N33N866L9927M0368L283k6075j15026j08284M8120K4335m2462
16981a55549n0502j531M2793Q5424L6386l5452P5849j7415O3839K9995o961o8805
16969a929J8664k725R1273J8123p8147j7617k2435P0722L6947J2429p8343m319
16957D2643M980q6159j41507P152P7012r366m366J77255J17283o0762j03065J2500
16945C3600m3865N378K0902M5164K8607j12045m1684r3518J2740J01195L9820
16934c706l3652P263M5372R0086J02879l5839p4343M4735r5191n2705L4457J6810
$$ y = [23506, 29174, 141217, 119847, 65599, 50184, 5399, -1328, -83243, -43998, -8824, -48046, 49978, 113924, 38292, 53420, -35690, -111027, 50815, 126446, 62422, 118997, 128648, 27716, -26134, -25601, -19735, 20192, 60560, 63843, 37768, -77258, -185542, -137422, -113087, -155549, -206051, -207582, -164789, -79365, -42979, -78431, -2582, -19997, 43842, 73837, 66876, -1929, 16735, 14010, 105283, 123406, 45259, 27642, 5207, 75929, 112876, 125305, 46962, 42643, 47623, -38536, -180043, -172891, -95879, -105245, -109611, 67644, 184927, 124165, 21100, 33600, -10265, -4887, 16015, 61179, 89786, -22259, -63943, -157461, -144721, -43526, -3706, -37358, -30095, 15277, 105363, 208242, 172403, 98060, 142795, 47604, -5101, 29356, 46166]
16922D6166L4536l2556j4569O0849r7018j14474m7433m9512N0887R4716J7772
16911e0636N7694k9384j16630l6006K03709R7945k8364j37851o0462J40802J59185
16900B00002l9210K6916m6665j01026m3327k1394p7719n2664k6118J20538L2729
16889b7938L7529r232k4351M8942m5600j28196K6527N8005j8577k7406L8813m5667
16877a17151k2285o0047J05685J37875k8191n9347p2858M460M3717L1823o8239
16866a04558n8637J722K344k9047p0582J58985J50596P2954R1894k7131n7283
16855A31257j17875l5100l2737j4827K4579k6641J0601Q653J7945P7193m3672
16844f24r0047o5414O310J01738O2514J4061j4608m6388m2293m8370M5431l8941
$$ y = [46166, 80702, 48146, 33577, 94426, -2592, -117066, -164499, -214011, -163124, -68408, -50636, 7058, -22326, -138956, -174962, 28747, 126692, 98328, -39523, -99985, 40817, 200002, 160792, 187708, 141043, 40017, -3310, -24704, -102423, -155087, -181205, -60667, -27938, 9591, 359, -23992, 24950, -20650, -148846, -122319, -64314, -82891, -110297, -71484, -117151, -139436, -199483, -93798, 44077, 15886, -43461, -116319, -111859, -68142, -36319, -104558, -163195, -161473, -159129, -188176, -258758, -99773, 50823, 123777, 215671, 188540, 131257, 13382, -21718, -54455, -69282, -44703, -71344, -60743, -52090, -34145, 43048, -624, -90671, -156085, -149775, -48037, 14477, 28538, 13930, -32458, -74751, -123121, -77690, -116631]
16832a16631r971J3741M3993L3540O1081J53111q1177j10772l0381m249K6694
16821b1021K501R514N940J07567R5619k9318j54917k1707k08j22542M3977M4825
16809c9770L744N8705o9304q2870p5862R4768J51745P2792n3485j584l4065p3459
16797d8645O675j6429j54271j8864J43399K9043q5284M0698P6491N7124P3703
16786A03640N1097l8056L6818n6987q3088r9587K9995K6931n1575R3286Q4550
16775I7024j01435m4973N8053J188j1377n2504l2950P5600n9974K8149J8598m7546
16763g2147O111L6094Q320k2263M7812m1800P0191L68J3526p3109l0013J2341
16751d4569J284Q1384j41301o2569p801O4055j0419L0376k9109P5325J34255j23418
$$ y = [-116631, -126602, -112861, -68868, -35328, 25753, 178864, 97687, -13085, -43466, -47715, -21021, -18520, -9006, -3066, 104501, 200120, 170802, 15885, -5822, -6030, -128572, -84595, -39770, -36026, 22679, -46625, -129495, -205357, -110589, 41156, 113948, 60463, 58879, 24814, -48645, -41970, -58399, -212670, -231534, -88135, -59092, -144376, -103678, -27187, 29937, 103640, 154737, 116681, 153499, 96512, 13424, -86163, -56168, -29237, -80812, 12474, 97024, -4411, -49384, 8669, 9857, -1520, -54024, -86974, -11374, -71348, -43199, -24601, -72147, -66036, -29942, -21622, -43885, 3927, -37873, 32318, 32686, 46212, -26897, -56910, -44569, -43285, 38099, -103202, -165771, -173572, -109517, -119936, -89560, -118669, -43344, 90911, -32507]
16739c2507j64140N6265R5920R091J6120J3646M3056j2983O5160M1765j6555r499
16727A05339n9652O060m970o7450p2067j02095K4442K7363J33815J62453J7027
16716A70265j24457j12901l5067K9243R0612M7311m1248N0525L4120p3393l1630
16705C380n5805q0626j8054N4050k7602K8206J02067n6136j4711Q7708M145K2285
16693D8907o7144L0375o6837K9697J2311L9909k0898l015j7988l7394n7827k6137
16681a36041R805L4456r47L690O0089k9275K5068m9736M5312Q5031q9183n2375
16669i4106k8714o781r047L9275o29o5626O76K0094N6293L5760K9123Q5653q8548
16656b6577k5045O5752R5560J0852p3032m5171j500j9003N6109J67620m589j32852
$$ y = [-32507, -196647, -140382, -44462, -35371, -19251, -5605, 37451, 24468, 89628, 131393, 114838, 105339, 45687, 51747, 46777, -20673, -92740, -194835, -170393, -143030, -9215, 153238, 170265, 45808, -67093, -102160, -72917, 17695, 65006, 23758, 74283, 108403, 35010, 3380, -52425, -133051, -151105, -97055, -124657, -96451, 5616, -50520, -65231, 22477, 26622, 48907, -18237, 12138, -54699, -25002, -12691, 27218, 6320, 3305, -14683, -52077, -109904, -136041, -126236, -91780, -92727, -89037, -28948, -58223, -33155, -82891, -37579, 47452, -41731, -94106, -122820, -129601, -138648, -99373, -100002, -165628, -164952, -144858, -88565, -52805, -23682, 61971, -26577, -51622, 14130, 109690, 120542, 47510, 2339, 839, -18164, 37945, 205565, 200976, 68124]
16644F8124j00455l6863j49772Q2518n198N6362l7994N5808P0758O942N9824j23202
16632e3148q8777R1795Q6841K1681M6125n6559r457o6213n1730l693K8178M5516
16620i441p287R2332j8623j7968m5548k3875J06187k8938L0175q4307o5794m6994
16608a20081J0670J43921O4262K2416r1064j2498J9003m1898M3763o4290j023
16597b6819K3737n7018K1661K0484J6365Q3098o0398N5534j7902l8214O3345R8799
16585A82672j1977m1564q1167M1568o2606k8509N6644K3011m3054l4321K7668
16574B8365k3546j3796o8002q488J4072R0008L0064o8955p9539p2669M0456P7154
16562e4876J1905O1086K1698m0694P769J5120p3180p3507q572Q8495Q9945Q1690
$$ y = [68124, -32331, -69194, -218966, -136448, -141646, -85284, -123278, -67470, 3288, 10230, 70054, -53148, -141925, -50130, 36711, 58392, 104517, 47958, 38501, -27712, -79442, -83135, -54957, -9441, -16728, 75604, 56981, 39013, -6535, -30410, 75777, 46839, 77014, -7293, -73087, -120081, -109411, 34510, 98772, 121188, 30124, 17626, 36629, -5269, 38494, -25796, -26819, -3082, -60100, -38439, -17955, -1590, 81508, 21110, 76644, 58742, 20528, 83873, 182672, 170695, 129131, 47964, 89532, 26926, -1583, 55061, 78072, 35018, 697, 28365, 4819, -8977, -76979, -85467, -71395, 18613, 48677, -20278, -99817, -172486, -132030, -54876, -42971, 18115, 39813, -881, 6888, 22008, -51172, -124679, -133251, -44756, 45189, 126879]
16550A26879o2850n7950J613o0196k9287N377M4975O2693N8725o4975Q5498k706
16538A07796q1755k5432K4042P1564j39363j88567R9258L9699J26356j9282p4683
16527f0367M6850P5473k9078m0152k0899L0857J422l8193o287m1560P4706r2084
16515i9312K8175N5456J599o2585r5669M3487M9055N3042P1694j9459j24053q883
16503a07453P5414J2238q739K9921L8115J01481M0060o451j58775q9974p0233
16492a44396m1612q107m7390J26305J67950j5545n782j00321o8999n3908M3323
16481a48482K5133J0783M651P1079n7206N483M0247m4595M1282N3265N6577r258
16469D8959O832j10202r0265J0992R506J85157R930J493j17989j65107k505J37753
$$ y = [126879, 64029, 6079, 7692, -52504, -81791, -76414, -31439, 31254, 89979, 25004, 110502, 107796, 26041, 609, 24651, 96215, -43148, -231715, -132457, -92758, 33598, 14316, -60367, -13517, 61956, 32878, -7274, -28173, 2684, 4106, -34087, -40374, -81934, -7228, -99312, -71137, -15681, -14082, -76667, -172336, -128849, -79794, -26752, 44942, 25483, -98570, -107453, -32039, -19801, -28540, 1381, 39496, 140977, 181037, 174586, 15811, -74163, -144396, -186008, -194115, -241505, -115200, 52750, 37205, 31423, -68898, -137897, -191805, -148482, -123349, -112566, -107915, -36836, -94042, -88559, -48312, -92907, -51625, 1640, 58217, 48959, 55791, -54411, -144676, -133684, -124178, 60979, 70909, 72402, -45587, -210694, -213199, -75446]
16457g5446J6034r1942J5440N3006K9780J54921m3755p426j7444q4924r5606q1346
16445b28708K0948N5178N3202N5981R4310N2681o3501k300k0121M0490L7342J16226
16433B11728m1045n1031j9148L1941N2952n5540q8198q092o2302J03j6034q0339
16421a25005j20363j2378J05175R5693K6442N340k9290K2154R9159Q437m5796
16410B9568j3468j11088j8487o128n7984K5565n3675L5781M0274R92M4593k6631
16398a10688q6339O8287J83143Q2313N015o7655p907k8614j34761P7920K7912
16387H626n0712L3351J00437J08759N1710q4077j6207o2502o2804q186m8962J3442
16375a7125l0280K9411O3023M6024r3449j01758n4092J4202N9347L2082J43938
$$ y = [-75446, -59412, -151354, -135914, -82908, -53128, 101793, 58038, 50612, 33168, -51756, -147362, -228708, -207760, -152582, -99380, -43399, 50911, 103592, 40091, 37791, 17670, 58160, 95502, 211728, 170683, 119652, 100504, 132445, 185397, 129857, 41659, 33567, -28735, -28632, -44666, -125005, -245368, -257746, -152571, -56878, -30436, -25096, -54386, -32232, 66927, 75364, 29568, 16100, -94988, -113475, -119603, -177587, -152022, -205697, -169916, -129642, -128650, -84057, -110688, -197027, -128740, 54403, 136716, 141731, 74076, 66169, 37555, -97206, -19286, 8626, -42086, -8735, 91702, 200461, 252171, 168094, 151887, 89385, 26581, 18395, -30567, -17125, -47405, -17994, 45029, 91053, -2396, -104154, -158246, -144044, -84697, -52615, 91323]
16364I1323j5758n8138j8907l2969o7755M9754j6833j44499L520J23977k0290
16353a06575K2480N1880l3412K8789l1323r2704l9535P568P1835R8269l1539p8637
16341a32904O6442M5028n6692R1791j8054L0678l4995m0523L3772l0185l8478
16330h4120P862k5502p3124l0764L1356k1894P8210O9440k4021P0735R1042J7857
16318A07077J341j4843j74468j12895M2710l463j8219Q1259J46047k6211r2467
16307f4132q5098k6341N505K3107L4600q8876n2193P0887J8712k0753J8644J13113
16295e2825n5309q9282j3900o141K5679P1194L916M2490L65L2852m80p7434Q4525
16282c4350K2177L5212m2955L121J8359r6197m7080N6431P0019O3161N4530m5433
$$ y = [91323, 75565, 17427, -1480, -34449, -102204, -52450, -69283, -213782, -210262, -86285, -106575, -84095, -32215, -65627, -36838, -68161, -160865, -200400, -192832, -120997, -22728, -54267, -132904, -66462, -21434, -78126, 13665, -4389, 26289, -8706, -49229, -15457, -45642, -84120, -76258, -101760, -174884, -205648, -174292, -196186, -117976, -48536, -72557, -1822, 89220, 107077, 108418, 93575, -80893, -193788, -151078, -154541, -172760, -91501, 54546, 28335, -64132, -149230, -175571, -170066, -146959, -112359, -201235, -253428, -182541, -163829, -184582, -165938, -52825, -108134, -197416, -211316, -217457, -191778, -120584, -116668, -74178, -73813, -40961, -41441, -118875, -34350, -12173, 23039, -19916, -16795, 1564, -94633, -141713, -85282, -15263, 47898, 102428, 56995]
16270E6995J6140Q0315n7797q6038j1172j0894O268l9993J8175k5613j11501O9863
16258i5252O1136l9811R7703O0058r7449k895m9108j11983k8443R4628p5207j00915
16246b87538O1380J98263L5656j11977n8002L5657J8915j2311N0496L6153j14501
16235a47809J8585O8881Q9794P3024m7641k7449O9562O9726q0775j7789J5852
16224H3961m7110J36904r073J793O0804R766j11766r0214q4277n0827N5283J805
16212d2951J177m3296o6795n4881N2991K1095M3942J60526J02884J2241j26931
16201F0002k9624l7482K1941P8638M2942n4528j05106p2883M8649Q3116n700P3629
16189A03594j4926p7347j05283N958O1601N9658n8788k0012j8181n1220J7433
$$ y = [56995, 73135, 153450, 95653, 9615, -1557, -12451, -6183, -46176, -28001, -53614, -165115, -95252, -34116, -73927, 23776, 83834, -13615, -16510, -65618, -177601, -206044, -111416, -186623, -287538, -226158, -27895, 7761, -104216, -162218, -126561, -107646, -119957, -69461, -33308, -147809, -129224, -60343, 29451, 102475, 54834, 27385, 96947, 166673, 85898, 68109, 83961, 36851, 173755, 164682, 166475, 227279, 237045, 125279, 35065, -49212, -100039, -44756, -42951, -41774, -85070, -151865, -206746, -153755, -132660, -88718, 71808, 174692, 186933, 60002, 30378, -7104, 14837, 93475, 136417, 81889, -23217, -96100, -47451, 35665, 29965, 103594, 88668, 11321, -93962, -88004, -26403, 33255, -25533, -45545, -63726, -114946, -97513]
16178i7513P200l369R9853J05441n2473m3573N0024r4567k1783r8887n0054Q5282
16166a14419P3281m6564M0161L3316J1002N0810J33361K616m6513j87623k5894
16155g6466l3107P5453N813L478M2022L9839j08809q8217n4878J1778O5108o0828
16143a78814k7393N5746j1538Q1851O8858M2573O2180p9880m2001R2811j1716
16132E2677n0136K9400N3952J38230j30061j04558P3844P6148m380j50907o2809
16121g8600J04124L3260p5719o6376N4727j7557K2110j1466P7828K9140r0657
16110a9186j9178L4733P0320l3647j17650L4705R0885j4509j4842m4556q6704
16099a19629j6400k1961N7110O8080o3998o6486J60831Q6559r2865p1758J3478
$$ y = [-97513, -90313, -93682, 6171, 111612, 59139, 15566, 65590, -28977, -50760, -149647, -199701, -114419, -41138, -87702, -47541, -14225, -3223, 47587, 180948, 183564, 137051, -50572, -76466, -109573, -34120, -28307, -24829, 17193, 57032, -51777, -139994, -194872, -183094, -117986, -178814, -206207, -150461, -161999, -80148, -11290, 31283, 93463, 13583, -28418, 64393, 52677, 2541, 31941, 85893, 224123, 94062, -10496, 63348, 139496, 135116, -15791, -78600, 25524, 58784, -16935, -83311, -28584, -46141, -24031, -35497, 42331, 71471, -19186, -38364, -3631, 66689, 33042, -84608, -49903, 40982, 26473, 11631, -32925, -119629, -136029, -157990, -100880, -32800, -96798, -163284, -2453, 84106, -8759, -80517, -67039]
16088f7039J20808l1979O3232J0175Q635l7155o0731M2762P1847j44129n9097
16077h2671J90919O0347o2283o6636l6040l0995m1203p692j7459j11307m2394
16066b47414J4451O0015O2733M016L9487K1575J11781L2212p8420r2467J2400
16055e9631J21476M2405m8720n1177Q3386M3637q0960j42625m4273J67549P4206
16044A05273k175j15012n8309K1325M0106P4823j4931j4841p6153k5744l1400
16033i7038J73977J08109L3175r3573r6779r358M0676l9947j35153K7023J44340
16022E5452L8231k5178j9196k2301j3702O121k8052o3367P061M8073K7375N768
16010A6285j0817j43209m2142J16480m4964j8873O7403K6284Q8251O1712q611
$$ y = [-67039, 53769, 21790, 85022, 95197, 103832, 66677, 5946, 48708, 120555, -23574, -82671, 108248, 168595, 106312, 39676, 3636, -27359, -68562, -76254, -93713, -205020, -247414, -232963, -172948, -110215, -106199, -66712, -45137, 66644, 98856, 20436, -72031, -59631, 61845, 104250, 55530, 4353, 87739, 131376, 50416, -92209, -136482, 31067, 105273, 103098, -11914, -70223, -48898, -8792, 66031, 51100, 36259, -39894, -65638, -97038, 76939, 185048, 218223, 124650, 27871, 18513, 59189, 19242, -115911, -88888, 55452, 93683, 68505, 49309, 27008, 13306, 19427, -8625, -71992, -64931, -16858, 10517, 16285, 5468, -137741, -179883, -63403, -108367, -127240, -59837, -33553, 54698, 116410, 107799]
15999A07799j30914k223l3834J319J05281K2762L9012o4140n5976l3059L0277
15988a3696O149j13099j889J88199l4145o4869j2041K457j28396q2791n186K6908
15976b32399R0769j50091L055J21810J61601o0616k9112R2348O1800K5599o5313
15965A9451O6409N1459L98j09348J0000L1715L1619k3997N596L8625L3945J3494
15953A69366l7706j33230k8515l6220P9949j48743j4459Q1460P5213L7693n0503
15942e695P2669O3259j04682j7411k1426m09n2587p8896l4063k6783J9105K9364
15930a57555j2528m891J03198j1863k4430M2044M8992N5250n6812m9935P5248
15919F718R2823J50925o378j12588j19065j940r8650n219n272o4017K8148J26590
$$ y = [107799, -23115, -25338, -59172, -57853, 47428, 70190, 109202, 45062, -10914, -43973, -13696, -7547, -120646, -122535, 65664, 31519, -33350, -45391, -42934, -171330, -254121, -259307, -232399, -141630, -291721, -288666, -166856, -5255, -65871, -94983, -2635, 59165, 84764, 19451, 85860, 137319, 137717, 28369, 38369, 70084, 101703, 77706, 83302, 121927, 155872, 169366, 131660, -1570, -30085, -66305, 13644, -135099, -149558, -68098, 7115, 44808, -5695, 66974, 130233, 25551, 8140, -13286, -13695, -66282, -145178, -179241, -206024, -186919, -157555, -170083, -174974, -71776, -83639, -108069, -66025, -17033, 38217, -18595, -68530, 6718, 99541, 250466, 244088, 131500, 12435, 10495, -88155, -93374, -98646, -162663, -134515, -7925]
15907g925J25628r6016r1445m4468m8280q3763r097L8980K2819J16805N3700L3586
15895A0524Q1219o6474j71121K1177m3300P4417P8879p957p8751r462J619P1835
15883c7395o8039J8352r781j8497N6055J30768L477J9100K0421K6025p7551m0612
15871B2323R1113O6513M1212j01020j01846R138N2284l1914l8026n4533R033O630
15859b9093Q495j02379p5662J40761M4468m229L4219K9050o443N1949k7723J47053
15847B10466P3822m1811r8307k0058K1484k1279L1431K0018j04550p071o8673
15836d528K9000K7791p8170j04361q8589J69753Q5512n1845k0146N118P3718m986
15824C8267j3996J7276K5294N9042p2308q7318o4946K2234P7228n124o3305Q8306
$$ y = [-7925, 117703, 21687, -69758, -114226, -162506, -246269, -255366, -216386, -193567, -76762, -23062, 10524, 91743, 25269, -145852, -124675, -167975, -93558, -14679, -22636, -101387, -110849, -109230, -37395, -105434, -87082, -96863, -115360, -59305, 71463, 74940, 94040, 114461, 140486, 62935, 22323, 113436, 179949, 221161, 120141, 18295, 27433, 79717, 47803, 9777, -44756, -35723, -29093, -20598, -122977, -198639, -57878, -13410, -17639, 16580, 45630, 39187, 91136, 63413, 210466, 284288, 242477, 144170, 124112, 145596, 124317, 155748, 175766, 71216, 64145, -4528, 24472, 52263, -25907, -130268, -218857, -49104, 36408, -15437, -35583, -30465, 43253, 38267, 24271, 41547, 66841, 125883, 53575, -33743, -98689, -76455, 773, -4351, -67656, 20650]
15812B0650L4535k3769k0297L7914k6133j8280o1193p5131J5033N1982R32N6382
15800g375o1032N3744K5570j81963k2534p2976N2660L9041J12711m1651j10184
15789b13989N9553M1775P4150J28167J1250j24280o5900n2932J025L2272O4268
15778d4641J9426j22108m8807N5496J36721m3088m2701J0146J35124n088n2329
15767a849r7722m7939j3341M4517J5746j3491r3735K696J08378K5266M1241N838
15755b4395j12313p3932N4381J58264M1498k1793m1422l4263l9543L3602m5253
15744a05169M0514n5855L7723K4962P6371J22047O6306j00444o3470p0496l5549
15733f3060J340R0278L2817p4777M4645N6891j6708j05688J2027J3795j4145j0696
$$ y = [20650, 55185, 31416, 11119, 49033, 22900, 4620, -56573, -131704, -116671, -64689, -63757, -7375, -68407, -14663, 10907, -171056, -193590, -266566, -213906, -174865, -62154, -103805, -213989, -154436, -112661, -38511, 89656, 100906, -23374, -89274, -142206, -141181, -108909, -44641, -25215, -147323, -196130, -140634, -3913, -47001, -89702, -79556, 55568, 50480, -1849, -99571, -147510, -160851, -116334, -100588, -114079, -207814, -205118, -96740, -71474, -30233, -24395, -136708, -210640, -156259, 2005, 43503, 21710, -19712, -53975, -93518, -59916, -105169, -64655, -120510, -82787, -57825, 18546, 140593, 206899, 106455, 42985, -27511, -63060, -61720, 28558, 61375, -13402, 31243, 88134, 71426, -34262, -22235, -8440, -22585, -33281]
15721c3281J3480k2400p6921Q9128J34045R0564j15238r2987q2586K0869N0815
15710b4512P5780N4188l736m1894n6762q2191R9094k5782l2852P665m4805m4805
15698a20612L8701J3630J5547M5293Q684j6853p2185l9282J20087N5789J22594
15687A71393l8941j60724n4517Q8617k9826l3098j0203J8853o5713N8042K4150
15676c1967n5581m4547l494q2608N7456R0250J1140M1907m7598J2010L2807Q8507
15664F8282m8441o0645K6984j8299j0062j6450j5739K756R5947L5830L4868j6819
15652G8212l5695O7551l142m9955j3411k9049l3124o025k0658k9134K4912k346
15640e1864K2204q624q1777j7722J15395K6304j6155J2396Q7224J0615j57701
$$ y = [-33281, -19801, -42201, -119122, -29994, 104051, 194615, 79377, -13610, -96196, -75327, -24512, 51268, 105456, 101720, 59826, 3064, -79127, 19967, -5815, -38667, -31002, -75807, -120612, -81911, -68281, -52734, -7441, 1243, -15610, -87795, -127077, -6990, 48799, 171393, 132452, -28272, -82789, 5828, -23998, -57096, -67299, -48446, -114159, -56117, -31967, -87548, -132095, -135589, -218197, -160741, -70491, -59351, -17444, -65042, -53032, -20225, 68282, 19841, -40804, -13820, -32119, -42181, -58631, -74370, -71614, 24333, 60163, 95031, 78212, 42517, 110068, 106926, 56971, 43560, 14511, -18613, -24638, -45296, -74430, -49518, -51864, -29660, -38284, -120061, -137783, -22388, 3916, -12239, 157, 87381, 97996, -59705]
15629e9705o0722O5563k0379N8893J04312J85409r9487j74623m8215Q3912L8015
15618G2973j02415r2579j0811O4591J59448J79486m5549k13313j80665n6054N1473
15607a73415J48708P1280N8560l4554o3977p9420J34418o870o5553p926K8024
15596I275O979L0359J08805N6690j33067j00506N578M804o6137q0974k159N4191
15584a06162j0681O9318K4605J8899O1685l338j20758O2258J20250j6920l0238
15573F8918j9916j35574L1895K6444j6876O9812N0655m9695j13197J9458K3986
15562d4090K7031J1449j0935o9744m6374r985J79390J19716K538j04114j24914
15551g0032m3297R1363R6252j3951Q924l0036j4062k422m7917l6458m5836R4960
$$ y = [-59705, -120427, -54864, -75243, -16350, 87962, 273371, 173884, -739, -48954, 34958, 72973, -29442, -122021, -132832, -68241, 91207, 270693, 225144, 11831, -168834, -224888, -173415, -24707, 46573, 105133, 70579, 6602, -72818, 61600, 54730, -10823, -18749, 9275, 16254, 46613, 155418, 212108, 79041, -21465, -15887, -11083, -77220, -158194, -160353, -106162, -116843, -47525, -22920, -4021, 57664, 54326, -66432, -4174, 116076, 99156, 68918, 49002, -86572, -54677, -28233, -45109, 24703, 75358, 25663, -87534, -68076, -44090, -17059, -5610, -16545, -86289, -132663, -142648, 36742, 156458, 158996, 54882, -70032, -113329, -21966, 74286, 60335, 69259, 39223, 25161, 22739, -25178, -61636, -107472, -12512]
15539a2512M3642M5249p4604o7601Q700J1407M1883J07535J942k8060r0633K3180
15527A0128M2664k7461M2404M9583l5369n9170N6985N0205q7785p0731J9895J9477
15515A0825j3306K4476m0873J6694l5661O097J79465M350o1568K1939n5035q1080
15503b3677p3074j272L2996l9090k690J3004L2935m5413K4251Q6004M0918n228
15491C9664r4569o465O3569j5250L679j05999q7234P4703J1588o917j10880J4894
15479b19217J82382l9103m706k1862o4380K2578J02060J4092l2262n8565K1913
15468i7070L7614Q9407N4748q8134o5878J11243K7004p3413J6254r1665j7958
15457i7848k0706l2425k5036P9862K9372J6962m5876o0722M82l559j3015N748
$$ y = [-12512, 31130, 76379, 1775, -65826, -57126, -45719, -3836, 103699, 105641, 77581, -13052, 10128, 52792, 25331, 67735, 117318, 81949, 22779, 79764, 129969, 42184, -28547, -8652, 10825, -2481, 21995, -18878, -2184, -37845, -31748, 147717, 152067, 90499, 112438, 57403, -23677, -96751, -98023, -65027, -104117, -106807, -93803, -60868, -106281, -82030, 3974, 44892, 39664, -54905, -61370, 2199, -13051, -9372, -115371, -202605, -127902, -116314, -123231, -234111, -219217, -36835, -75938, -80644, -102506, -166886, -144308, -42248, -28156, -60418, -118983, -97070, -59456, 29951, 84699, -3435, -69313, 41930, 68934, -4479, 11775, -79890, -97848, -118554, -150979, -176015, -96153, -66781, -49819, -95695, -156417, -155935, -159494, -172509, -166761]
15445a66761J9483j026J00222N0596j4618m6207k1290m6107l6789n813M5532P0818
15433e1960M7278j1913l0548O5287l6342r8774J20635R0894M9985q4919j66471
15422a06848n5637L2128M2100P366J02630Q8389o3319k556M7121R17k8400J24419
15410A88310M3794o8443k6244J3722O493K1787q6344n2638K322n9010K525p3939
15398h7665N0731m052N3838K6170K999q0293l0608R0511N2262l6538j30535l13
15386i3493J12598J04380J0097l7719o5174o7166L3018q8662L5990N2163L0044
15375B6076P7274j53472l0754J01739N7892o6280p8174J5339r830N5124R6765
15364I1699l7571K4396j1569k42588k1684P8981K4900m7930p544J17841M2951
$$ y = [-166761, -147278, -148304, -48082, 2514, -12104, -58311, -79601, -125708, -162497, -168310, -122778, -51960, -4682, -16595, -47143, 18144, -18198, -116972, 3663, 94557, 144542, 59623, -106848, -162485, -130357, -88257, -80891, 21739, 110128, 46809, 44253, 91374, 92291, 63891, 188310, 232104, 163661, 137417, 151139, 157632, 179419, 93075, 40437, 42759, -16251, -13726, -87665, -36934, -40986, 12852, 39022, 42021, -38272, -68880, 21631, 73893, 37355, -93180, -93493, 19105, 123485, 133582, 95863, 30689, -36477, -3459, -92121, -56131, -3968, 26076, 103350, -50122, -80876, 20863, 78755, 12475, -65699, -50360, -60190, -5066, 91699, 54128, 78524, 66955, -175633, -197317, -118336, -93436, -141366, -148910, -31069, 11882]
15353A1882m8852r3500n5051n1304P787L350O0977J6451N6751R1903O8051O6932
15341A35377M6848r6542j12628j4268m0593Q137K465P875J4091l8882K1758o8756
15329a35118J25870N2302p9508r1973O135N264P411L9506l815n936j10117N445
15317a84534M2592p9182k2447J21829R3008L931Q1342O5810O5749K3074j89034
15306B2138j02483M2293m1795p203M561j494P1817l7242J5682Q9385j0911o5628
15294b0880o4863J1216k9379P5685J65373p941j2280n6386r4986N4801m9756m975
15282c4371K2672P898J6311j5103n7852N3974j2493l7869k9076n029K1882Q3367
15270A4311o8709k0972L3399Q2235m7738k13573k2814J79361J59680O2496n2271
$$ y = [11882, -36970, -130470, -185521, -236825, -229038, -225688, -164711, -148260, -91509, 394, 68445, 135377, 182225, 85683, -26945, -41213, -81806, -73669, -71204, -63329, -49238, -88120, -66362, -135118, -9248, 43054, -36454, -128427, -122292, -117028, -109617, -70111, -73926, -79862, -189979, -184534, -141942, -221124, -243571, -121742, -28734, -24803, 56539, 122349, 188098, 211172, 22138, -80345, -38052, -79847, -87050, -82489, -83983, -12166, -49408, -33726, 55659, 44748, -20880, -85743, -74527, -103906, -28221, 137152, 129211, 116931, 60545, -34441, 20360, -29396, -34371, -11699, -3801, 12510, -2593, -60445, -6471, -18964, -56833, -85909, -90938, -69056, 14311, -54398, -75370, -41971, 40264, -7474, -221047, -243861, -64500, 95180, 157676, 105405]
15259A05405j84253j00415O0730J5350K7486n6921N8387Q7970M920K6698j2335
15248C3022n8468Q7927M1426P620n4461m2832n879n3170P047M4627P230M3609
15236E7698K4347K7290J18276K7551l9875j45578j23511m7884K8234J3350j3265
15225g3367j9874O3016P632m1308n6569k1091J9969N2417L8679o6852l2365K2420
15213a07293J39598J6609k9810p8718j24297R973J61986o9245j58920K4653O7751
15202a47713O7684M264k805J866l8390J0408P2867M0969q4703k9747J01145M1199
15190C7044L5167q3027j7144L1379J46094J61454p8002n0433L350q8770j20098
15179b2986m8574L0214m9628K2025O3117Q9864r7143p5990j4744J39961J8121
$$ y = [105405, -78848, -179263, -118533, -103183, -75697, -132618, -74231, 13739, 18659, 45357, 33022, -25446, 62481, 103907, 111527, 57066, 14234, 8355, -44815, -37768, 6859, 14089, 57698, 82045, 109335, 227611, 255162, 215287, 69709, -53802, -101686, -73452, -60102, -73367, -93241, -30225, -22593, -63901, -120470, -141561, -121592, -69175, -30496, -97348, -129713, -107293, 32305, 48914, 19104, -59614, -183911, -173938, -11952, -81197, -240117, -215464, -147713, -80029, -75765, -78570, -76704, -115094, -104686, -31819, 9150, -75553, -105300, -4155, 37044, 72211, -10816, -27960, 3419, 149513, 310967, 232965, 182532, 185882, 97112, -22986, -71560, -41346, -90974, -68949, -5832, 84032, -13111, -89101, -103845, 36116, 54237]
15168E4237q6421k1324L3676Q1047J7226r126j32892j07534M6291K1571R6571
15157f678Q9027k6220L0996Q934L3516j12838l5072O8101l9654N5931Q5603l5034
15145A16612j70269j65399q2P7269J02068n4471L4694m1465O072P1148j9710O8829
15133B5296m9213O0486N1432j6647l2584J6166m8115r514r193P1046L9128O4244
15121A62532m7373j37877n8613N6581o356j9751m350K6985l9858K2917J18361
15110G3198J5611o3733o3348k5821n6266l5595Q0658N3827R7250j07210q3727
15099a15156k3086L2503m4875O6485J5200p8032k0694J09706O2785M7224J2809
15088F4869L2640j22158l5810Q761j01653k9186L0398l8620o1159k3910P2828
$$ y = [54237, -32184, -53508, -19832, 61215, 78441, 69315, -63577, -171111, -124820, -103249, -6678, 82349, 56129, 87125, 96059, 129575, 16737, -18335, 49766, 10112, 66043, 151646, 116612, -53657, -219056, -219138, -141869, -39801, -94272, -59578, -101043, -94971, -23823, -43533, 25296, -23917, 36569, 88001, 71354, 38770, 54936, 6821, -2693, -11886, 59160, 98288, 162532, 115159, -22718, -81331, -24750, -31106, -50857, -55207, -28222, -68080, -45163, 73198, 88809, 25076, -38272, -64093, -120359, -155954, -75296, -21469, 75781, -31429, -115156, -138242, -105739, -150614, -84129, -68929, -146961, -167655, -57949, 4836, 52060, 64869, 97509, -24649, -60459, -51698, -153351, -182537, -152139, -190759, -251918, -275828, -203000]
15077b03000K1953J81259J43517p5862j27573n3328j2385m026p262q158K1396
15066a23469M3998P9917j05505m1818K4944O7343J11845r0198p4587M5375O2812
15055F57j8023o0980L0126K7463j1483k6485j3466R6621J12848J9366n6877J4181
15043A13948p4843j29873j21365J70496K6151l6959L2832r08j04277j07442Q6889
15032a45351J27462l0142J9418K2862k2216J2508m6871l5097Q7346J17880N9008
15021A66807j2536j76572j35670R7043j1659q8475K5833j7666K2661P9531M9087
15010a616k8345n9547l9767L0982J63023k8314m9729n9474L9307L2990q2646o8012
14998a51148k8521m7261P5953J22798J034M294P3043l5511n5319o2828K616L0717
$$ y = [-203000, -181047, 212, 143729, 67867, -59706, -113034, -125419, -129445, -136707, -144865, -123469, -79471, 446, -105059, -146877, -121933, -54590, 57255, -32943, -107530, -62155, 657, -17366, -78346, -48220, -20757, -32240, -58725, -72191, 24430, 137278, 156644, 99767, 113948, 39105, -90768, -212133, -41637, -15486, -52445, -19613, -20521, -124798, -232240, -145351, -17889, -48031, -28613, -5751, -27967, -15459, -62330, -97427, -10081, 107799, 166807, 154271, -22301, -157971, -60928, -72587, -161062, -135229, -152895, -130234, -50703, -1616, -29961, -89508, -129275, -98293, 64730, 36416, -13313, -72787, -33480, -490, -83136, -151148, -179669, -226930, -150977, -28179, -27145, -22851, 50192, 14681, -40638, -103466, -100850, -70133]
14986g0133j6208L5027n109J5829L8888j16311P1272J12511q191o3033Q2472M0506
14974A17520N2712k7272p5751j19371M66K4153p0155R123J28324R6182N2269m7405
14962A40795j24246K2643p9451j8441j2731K8290O9594L7046r4196j06001K3204
14951a13494M3572O9806o984m0269K727j762J23060J3493j19554q8885p9285K9216
14939a68359J62113J6698k8077Q7822N1409P876n8720o1531O8469M0377k427m7668
14927F7982p7719j19132n1058K6715R090j12035M5688M9053N2640P179p2846J6305
14915a58138M2708K9030r7696r9372J1227Q8822Q0284M0546K793L0393M1926j259
14903A1264k9311Q5996P6551o9453k7135R1407k4146l6289q5427L5896J0361P2886
$$ y = [-70133, -86341, -51314, -56423, -40594, -1706, -118017, -46745, 65766, 57575, -5458, 77014, 117520, 170232, 142960, 67209, -52162, -51696, -27543, -97698, -88575, 39749, 135931, 188200, 140795, 16549, 39192, -40259, -58700, -71431, -43141, 26453, 63499, -30697, -136698, -113494, -69922, -116, -7100, -47369, -44642, -46404, 76656, 90149, -29405, -118290, -197575, -168359, -6246, 10452, -17625, 70197, 121606, 129482, 70762, 9231, 77700, 118077, 115650, 67982, -9737, -128869, -179927, -153212, -144122, -256157, -210469, -161416, -108776, -101597, -174443, -158138, -115430, -86400, -184096, -283468, -272241, -183419, -103135, -62589, -59796, -29403, 12523, 11264, -18047, 67949, 144500, 75047, 47912, 139319, 115173, 78884, -6543, 29353, 39714, 112600]
14891A12600J6959J3365j01985q5771j28117Q0425K6779q7861N6575N6380k2946
14880f3597K6332r834m9131j50008K4178O0172R6850J5066l0345J8761L3262o1036
14868h9330j768J38403P302k3889j1094o3865q2352p2289j8250p6483j0901J28653
14856a75863K34750J34814j2453p5349r0259o5003O8968P2334p3731j27385m5214
14845a54391n7115j2901J03074M8873O8039N3642K9068Q7444L674p4217m2279
14834E2911L1951R451K7313m8472L920O5k6867R7161J24242K446j35928q2520
14822E5673m8725J1532O9487l3456o3207n3092o0218P4857o542j44109k1571O0375
14810a58996R4338R3946Q830L7262o8670j27919j04772P5029L9408p3294K521
$$ y = [112600, 129559, 142924, 40939, -44832, -172949, -92524, -65745, -153606, -97031, -40651, -63597, -37265, -47099, -96230, -246238, -222060, -161888, -65038, -49972, -80317, -61556, -28294, -89330, -91098, 47305, 54607, 30718, 19624, -44241, -126593, -198882, -217132, -293615, -304516, -175863, 58887, 193701, 181248, 105899, 15640, -49363, 19605, 91939, 18208, -109177, -154391, -211506, -224407, -121333, -72460, -4421, 49221, 78289, 165733, 169407, 95190, 52911, 84862, 94313, 121626, 73154, 77074, 77139, 50272, 147433, 271675, 274121, 138193, 55673, 6948, 18480, 87967, 54511, -8696, -61788, -122006, -47149, -53691, -197800, -219371, -158996, -64658, 29288, 38118, 75380, 6710, -121209, -225981, -150952, -111544, -184838, -182317]
14799a82317J01112K3396j3444J0823j6761p3837p4315J9123J2364M0351M9387
14788a04118K9522L8095J01151N9561j0411K2662r9773o7560N4686J8290M6085
14777H8190n8019p9275q7211l4769O5777P6578J3244K4476L741p757k8895K8547
14765D627k2987l4355j0856J7827j1140K6712O5135Q602N3059m3842j07749K668
14753e2299J9545l01R7960L580j01606N8326l399n7563n9777L8193O6793j18560
14741a09108m3959L4577M0886m535m5951J4212R4197n1352j26145l1598M4333
14730a84443J02226J0532q1099J20472O5943n1909q623m1911j04125k5984L079
14719a95842K5359L8583n0685J4060J15463O4220q7940r6738P793N7098J19128
$$ y = [-182317, -81205, -57809, -71253, -60430, -77191, -151028, -225343, -206220, -193856, -153505, -104118, -74596, -36501, 64650, 124211, 113800, 136462, 36689, -30871, 23815, 42105, 88190, 30171, -49104, -136315, -171084, -105307, -28729, -15485, 8991, 12732, 4975, -23920, 4627, -18360, -52715, -63571, -45744, -56884, -30172, 34963, 43565, 96624, 52782, -54967, -52299, -32754, -33055, 64905, 68485, -33121, 25205, 21806, -35757, -95534, -57341, 9452, -109108, -153067, -118490, -77604, -82139, -128090, -113878, -19681, -71033, -197178, -228776, -184443, -82217, -71685, -152784, -32312, 33631, -18278, -26901, -68812, -172937, -198921, -195842, -170483, -131900, -182585, -168525, -53062, 11158, -76782, -173520, -165727, -108629, 10499]
14708A0499P8438j54513L9353N2777O596l6508P4005J40346r4635o8043r2184
14697d3869K0092R886l5390l2484P5305M7680k5201K390N319j02999K2334L8478
14685a8459j16430J9838J5652J01078L1760R5936J07673n7924o1990j06441k1782
14674a1089J20534M2186k6489l6860M3261k9823J16486N2574j02432p3079n6983
14663C8286q3011j28442j683J71843Q0348j01243p8801P7082N6689r0295r9901
14652a59128m4704l0007P4469O8274M1826m5521q55R6241N6156p9554q9329M5604
14640f6528O9632m8983J11295N6540m9698k06999m8872M5287N6530R0555n0550
14629d1791o8722J7758O5217j07185Q3350J14832L1655l3113L7326K6310q0517
$$ y = [10499, 88937, -65576, -26223, 26554, 33150, -3358, 70647, 210993, 116358, 48315, -43869, -23777, -13891, -49281, -81765, -6460, 41220, 16019, 18409, 23728, -79271, -56937, -18459, -134889, -115051, -99399, 1679, 33439, 129375, 237048, 179124, 117134, 10693, -11089, 109445, 151631, 125142, 88282, 131543, 101720, 218206, 270780, 168348, 95269, 38286, -44725, -173167, -174850, -3007, 77341, -23902, -102703, -25621, 31068, -59227, -159128, -203832, -233839, -159370, -91096, -49270, -94791, -95646, 595, 56751, -22803, -112132, -66528, 3104, -45879, 65416, 121956, 72258, -134741, -183613, -138326, -81796, 8759, -41791, -110513, -92755, -27538, -134723, -51373, 63459, 95114, 62001, 99327, 125637, 45120]
14618D5120L6939L2725J7023K8982J2782o5932r5028l1000r5018m3763k2952j0528
14606a90650J03945N3896L2595r2136P1594J00545j00504n6177J05787R0905j12521
14595G279j44391m5188p1660p488K1848R7904j9712O7854L2759l5918M3643J5683
14583c7387m9319k5344J0240J9900K0388j30344l6299M1911R9783R9062j2777
14572a86j3367Q5337R2904m0446l5558j82793J816j1944Q9531n1514R431L2311
14560b4478n5660o0823p3555P0450N4630K4964m2624n8116L8224R1327J1977R3965
14548G0281m5389m0200l537M940o926k3782K2605k4620n4468J3156O3889L5136
14536A1085m306q1L9275N280o1348L4930m8238q2665J3452J6207n7061P7295O6498
$$ y = [45120, 82059, 114784, 131807, 160789, 173571, 107639, 12611, -18389, -113407, -157170, -180122, -190650, -86705, -32809, -214, -92350, -20756, 79789, -20715, -76892, 28895, 119800, 7279, -137112, -182300, -253960, -261448, -239600, -141696, -161408, -93554, -60795, -96713, -53070, -37387, -86706, -112050, -101810, -81910, -61522, -191866, -228165, -186254, -86471, 12591, -186, -13553, 71784, 164688, 124242, 88684, -94109, -92293, -104237, -14706, -66220, -56789, -24478, -80138, -140961, -214516, -144066, -89436, -64472, -107096, -165212, -126988, -35661, -23684, 70281, 24892, -15308, -18845, -13905, -20831, -44613, -22008, -46628, -101096, -87940, -24051, 11085, 6779, 6698, 45973, 51253, -10095, 24835, -23403, -106068, -92616, -76409, -133470, -56175, 10323]
14523A0323K2669m8179r25l533J9107j41573L2422p964P12J6399K9860j9434L267
14510h6849K4269L4156M8266J2982L6853m799K6735Q850L0590O2664J1566m1078
14498A64205l8514j8705j02329q7707r1314L9517K5084P2554Q0957Q6591M8156
14487A78495n2615N581j06575q5584r6738K0939K4950R2265K0121L3054J13362
14476A47255M8467j02216M3442K018m7976M3095N5041Q5703j29690j34324J44640
14465A55455J51848r920j6898M3115J174j80158o9500p4923j493Q251n2443k9458
14453g4950L6888l8453L1470o45J8626J06471R6337j12384j73Q8469Q8743O7164
14441C07563j5421L3085n6644r5766L718Q9274l1806j07931l7600r98K5777M6989
$$ y = [10323, 32992, -15187, -16112, -19645, -538, -142111, -109689, -117653, -116941, -100542, -70682, -90116, -86849, -62580, -28424, 19842, 32824, 69677, 64878, 91613, 100463, 131053, 193717, 205283, 164205, 125691, 106986, 4657, -83050, -174364, -134847, -109763, -37209, 43748, 130339, 178495, 125880, 131461, 24886, -60698, -157436, -136497, -111547, -19282, 839, 33893, 147255, 195722, 93506, 136948, 138966, 90990, 134085, 189126, 274829, 145139, 10815, 155455, 307303, 297383, 280485, 323600, 324774, 144616, 75116, 193, -1300, 6951, -45492, -74950, -38062, -76515, -45045, -45690, -27064, 79407, 175744, 63360, 63187, 151656, 240399, 307563, 292142, 325227, 268583, 172817, 176535, 265809, 234003, 126072, 88472, 87474, 113251, 160240]
14429A60240l6069Q9931J4590j6827j29631L4149r493Q6074O5973r186k7174p3518
14417A49059k4398O1668L8070J29705m0066l3402K3518j03818o7257j4782r2805
14406B5492K4102M2191J07228r8947j61792K3218K7737j1348O5094P0860J16363
14395B30198J62983J65290J7813k6236p3597n2928R975O1407n9165k7989j04306
14384C03445q7220j8877j7779M441O1650m3475n5400J449l1555o2519Q7287o0539
14372H0908j11531k0169J32149J35491M8352N7502J13103J6059L2088j02286j15274
14361B66392p0500N1565q0853j20154m6760R5370R2914O8527l5778o1673j12319
14350D6731q2178m3564M160j8649j4931R1428J19610K3326R3873K7872j47238
$$ y = [160240, 124171, 214102, 228692, 211865, 82234, 116383, 106890, 192964, 258937, 249751, 222577, 149059, 124661, 186329, 224399, 354104, 314038, 280636, 304154, 200336, 133079, 118297, 25492, 49594, 91785, 199013, 100066, -61726, -38508, -10771, -22119, 42975, 113835, 230198, 393181, 558471, 576284, 550048, 476451, 423523, 433498, 494905, 435740, 407751, 303445, 216225, 197348, 179569, 184010, 245660, 202185, 146785, 148234, 116679, 54160, 141447, 80908, -30623, -50792, 81357, 216848, 265200, 322702, 435805, 451864, 483952, 381666, 266392, 195892, 247457, 166604, 46450, -310, 95060, 187974, 256501, 220723, 159050, 46731, -35447, -79011, -74851, -93500, -108431, -17003, 102607, 125933, 219806, 247678, 100440]
14339A00440J5237N2706L3065K8909m2234k003j47714K6194l5794n1334L3792
14328A1264M0604m1462p5867J14161M8543Q6120k2753m7273P8243J30661N2012
14317C74253o5021j25184m7143l0602N0085l6885k5839L7201m058q8277o7608
14306b9078L8567R918M5891J92796M1979k9056l4642n6342q2834N823n0596K2501
14294G4927L2924q769m2058o3020j4499J1290J2973O000O0563M7039O0564j24976
14282E2958j52389m7018K6240J78332J91181m7302p6228j10248k8167M6969n6998
14271b2670o8152n609P9812l2797k0360M3924L8578k5087j08857O4553M5267p4634
14259h6032m4684L2334m8959o4201P8733J15094j7602l9733J01509P9493m5684
$$ y = [100440, 115677, 168383, 201448, 230357, 188123, 186120, 38406, 64600, 28806, -22528, 11264, 51868, 10406, -65461, 48700, 97243, 183363, 160610, 113337, 191580, 322241, 374253, 309232, 184048, 136905, 106303, 156388, 119503, 93664, 130865, 126807, 38530, -29078, 9489, 19407, 65298, 258094, 300073, 271017, 236375, 180033, 97199, 103022, 52426, 74927, 107851, 99082, 57024, -5996, -20495, -9205, 3768, 9768, 70331, 117370, 177934, 52958, -99431, -146449, -120209, 58123, 249304, 202002, 125774, 15526, -12641, 34328, -22670, -90822, -96431, -16619, -49416, -69776, -25852, 12726, -12361, -121218, -56665, -11398, -86032, -130716, -98382, -147341, -211542, -132809, -17715, -35317, -75050, 26459, 105952, 60268]
14248F0268k7051K8286l2389k4194k5081P0780J01330J8051j10757n6111J9291
14237B2423J3696N736j9245L4097R080J3213J04270m8029J3945l6642O0295q2167
14225I0672j05208j9758R385J10114m2116l7016L4477l0557k7588K9651q9267
14214g7211Q4229J13469J02579j283k0223j55313j66186r5009K1160p538J60383
14203d0943O4168j46682k1615M966M1461k2889o776L2445m3347q016P1562J70
14191g5496L3768L3863J23066J7347j20327M5018J1147Q28j36522q7034O6064
14180h8278m7185L3729L1326J2408K1485K9202k7070O68O4539l253Q8021k4701
14168I0891p8436m4795k7984M9683Q9771l2312k6822L580O062j72424j4109J47293
$$ y = [60268, 33217, 61503, 29114, 4920, -20161, 50619, 151949, 170000, 59243, 3132, 22423, 36119, 41855, 22610, 56707, 65787, 79000, 183270, 135241, 149186, 112544, 172839, 90672, -14536, -34294, -24909, 85205, 43089, 6073, 40550, 9993, -17595, 12056, -77211, 7018, 120487, 223066, 221783, 201560, 46247, -119939, -214948, -193788, -201326, -40943, 23225, -123457, -145072, -140106, -98645, -121534, -128310, -95865, -139212, -147228, -75666, -75496, -41728, -7865, 115201, 132548, 12221, 57239, 68386, 69214, -67308, -154342, -88278, -135463, -101734, -70408, -58000, -36515, -7313, -34383, -33715, 30824, 27571, 115592, 90891, 12455, -32340, -60324, -10641, 79130, 46818, 19996, 23576, 29638, -142786, -156895, -9602]
14156i602K825K4k9070J867L7404Q8678m7075n6053K4514q736j37701l5961J38618
14143c0268M6219K4984J34349l9390M6939J5832O159n123m1139O0301o5020j08318
14131D5525k4848L4703M4304N23q8772k8885o3842J4075M5677J5523O549k8785
14119b8253m5922J5700R389n6001N0972M6380n56L3678j8648j03028M4171K3961
14107b8157R3122O8815P1696l1058j08969j04673K1925J35821K8413J6905R516
14096A73356j2501Q4607o0841j2532L1231m9303n8429k1540m7653k3576n7586
14085e4767k7340J12521J02285j3413j8208o3497r2349L2843Q5933o2339j19364
14074a17695M8553N8425N2615j0564j16335K6257k1247L0083J45194J72504J8619
$$ y = [-9602, -6777, -6753, -35823, -33956, 3448, 92126, 45051, -11002, 13512, 4776, -132925, -168886, -30268, 15951, 40935, 175284, 135894, 182833, 198665, 204824, 199701, 158562, 218863, 153843, 45525, 20677, 55380, 99684, 100207, 11435, -17450, -81292, -67217, -21540, -6017, 532, -28253, -74175, -58475, -49086, -105087, -54115, -7735, -8291, 25387, 6739, -96289, -52118, -28157, 64965, 133780, 205476, 174418, 65449, -39224, -17299, 118522, 146935, 163840, 173356, 160855, 245462, 184621, 172089, 203320, 154017, 95588, 74048, 26395, 2819, -54767, -82107, 30414, 132699, 119286, 101078, 37581, -54768, -21925, 64008, 1669, -117695, -69142, -10717, 41898, 31334, -85001, -58744, -79991, -49908, 95286, 267790, 286409]
14063B86409p3431j3214L9308l9186j21172J7114J57486Q9019o1806m1697K437
14052B41267J5989L8746k7402l5632J5507n8237R6361J07134N6135m5027j18800
14041B86041m5473Q7468J29200L9051k1350L3856M1067J02830O5737K004P2862
14030G93293P0925J19122J08260J62708J31271K34831J96594J94519K24079M98560
14020B734162O31835Q12325J240897J550602K263278K690263K945772L085111
14012A7954245K671123J888665R27213k51685j345844k043917k518802k697403
14004A4583595k312472j830560j350607q44890n27136j77264Q4583L34202P03412
13995H662863J181757J823824K631302L733827M601059N467955N962658N793377
$$ y = [286409, 212978, 199764, 239072, 199886, 78714, 95828, 253314, 342333, 280527, 238830, 241267, 257256, 296002, 268600, 232968, 248475, 190238, 286599, 393733, 449868, 404841, 286041, 240568, 328036, 457236, 496287, 474937, 508793, 549860, 652690, 718427, 720431, 793293, 864218, 983340, 1091600, 1254308, 1385579, 1620410, 1817004, 2011523, 2235602, 2734162, 3365997, 4178322, 5419219, 6969821, 9233099, 11923362, 14869134, 17954245, 20625368, 22514033, 23441246, 23189561, 21843717, 19799800, 17280998, 14583595, 12271123, 10440563, 9089956, 8245066, 7717930, 7540666, 7625249, 7959451, 8662863, 9844620, 11668444, 14299746, 18033573, 22634632, 28102587, 34065245, 39858622]
13987C9858622M762698K971192O65558j739055l708642m987655n655629n507713
13979B6659376m684370l598825k576671j680473r55767m16260O1275O14541J173908
13970A4596734J950954K856237M273014N989810P651246Q902408R130522Q371102
13962F3722027O560358L456421k81346l971358o771239q346532q593105q048621
13954C7726605o761638n096626l512367k219137j393400m95271K14086R73084
13946A9435336J782682K992134M519138O636639Q797969J0875322J2180165J1951086
13938G9170471J0227444O958315K428175k804518p135849j0122703j1699888j1617727
13930E5403720j0437916q602195o486984m456054l059220j929119j083508l66543
$$ y = [39858622, 44621320, 47592512, 48258070, 46519015, 42810373, 37822718, 32167089, 26659376, 21975006, 18376181, 15799510, 14119037, 13163270, 12747010, 12808285, 13422826, 14596734, 16547688, 19403925, 23676939, 29666749, 37317995, 46220403, 55350925, 63722027, 70282385, 73738806, 73457460, 69486102, 62714863, 54368331, 45775226, 37726605, 30964967, 25868341, 22355974, 20136837, 18743437, 18248166, 18462252, 19435336, 21218018, 24210152, 28729290, 35365929, 44163898, 55039220, 67219385, 79170471, 89397915, 96356230, 98784405, 95979887, 88844038, 78721335, 67021447, 55403720, 44965804, 36363609, 29876625, 25420571, 22361351, 20432232, 19348724, 18982181]
13922A8982181L47033J235606K275728L795248N263671O907664Q384722R016260
13914E6208113Q577703O956699L960816K55839l509258o629613q552915r250771
13906D8016613q778454p410494n930318m380212k995700k043157j377290q06291
13898A4294697k84372K54025Q87465J804897K793039L941655N040084N890696
13890C4622186O025633N353127L935873J716650p81562l161912m974655o120360
13882C6614980o215842n745643m840137l655767k511415j857543j342016q78354
13874I568263n46238k56724J28507M61233P95004J442008K113778K650130K815038
13865A9170999K710367K230804J335806L59307p97147j991600k846890l062852
$$ y = [18982181, 19329214, 20564820, 22840548, 26635796, 31899467, 38807131, 47191853, 56208113, 64785816, 71742515, 75703331, 75959170, 72449912, 65820299, 57267384, 48016613, 39238159, 31827665, 25897347, 21517135, 18521435, 16478278, 15100988, 14294697, 14010325, 14264350, 15151815, 16956712, 19749751, 23691406, 28731490, 34622186, 40647819, 46000946, 49936819, 51653469, 50871907, 47709995, 42735340, 36614980, 30399138, 24653495, 19813358, 16157591, 13646176, 11788633, 10446617, 9568263, 9022025, 8765301, 8893808, 9355041, 10150045, 11592053, 13705831, 16355961, 19170999, 21881366, 24112170, 25447976, 25807283, 25010136, 23018536, 20171646, 17108794]
13857A7108794k942291k775337k350492j786238j209230r72595q61151n82534
13849C628926l73347k87566l09521l25849k67378j66306k46092j91005j09659
13840A352203P9402L5674r4563l7747j75563k34597m7069L9194M7675o6605m4960
13829H53044N632n023L30K9413k5176j21815J975l5767p2208o8887k1272O1323
13817F01569p9695n5708O6510K1482K6172j2508J006M7052O1575n3055j6251m3602
13805E64547p7079j06830J8669L5369K7371q5758n9789j5244R467L4096N3788
13794C98607J5705m150J07723o9309j77274J17890M4205o6464m4253j668k2467
13783B98545n99L367M975j21133o8406J01977Q9233k1771n3285j3460n2422j48245
$$ y = [17108794, 14166503, 11391166, 9040674, 7254436, 6045206, 5072611, 4211460, 3628926, 3255579, 2968013, 2658492, 2332643, 2065265, 1898959, 1652867, 1461862, 1352203, 1431605, 1467279, 1372716, 1334969, 1159406, 924809, 877740, 916934, 964609, 898004, 853044, 858676, 853653, 853983, 883396, 858220, 736405, 738380, 702613, 630405, 561518, 540246, 601569, 521874, 466166, 532676, 554158, 580330, 567822, 568828, 615880, 677455, 624400, 608149, 564547, 487468, 380638, 399307, 434676, 462047, 376289, 316500, 301256, 310723, 344819, 398607, 414312, 410162, 517885, 448576, 271302, 389192, 433397, 366933, 322680, 321012, 298545, 297946, 301313, 306288, 185155, 116749, 218726, 307959, 286188, 232903, 219443, 167021, 18776]
13771A8776r2209O5866P3954J08046J1624j13858K9037L909N184j3905N541J8979
13759A20944P4543M3956O6880l5958j44111O4421N7036j9574Q0142j6745j0022
13748B81512Q676j7458n764L4676k4737n7419j45960o0792P4512n8816K2945P9773
13736A31148Q4261O391q6237p7933j0843P8673R0140j0277J0299p6912k8689n0571
13724E9450J29414N7432q0629j9700O7318P3702m8315p7130O194l22J63748Q2998
13712D14160J0675l9388j08798k2325P763N0616K4999o0610N254j9370m3552k3557
13700A95867O550m2977O8485r1746j18961Q2258J02139n4866o3832L4580K7298
13689A44795J683O9512n9679J027J28438n5270o6981O1269J1889p4954L5635K2776
$$ y = [18776, -73433, -7567, 66387, 174433, 186057, 72199, 101236, 105145, 110329, 96424, 101965, 120944, 195487, 239443, 306323, 270365, 126254, 190675, 247711, 228137, 308279, 291534, 281512, 290188, 272730, 266966, 301642, 276905, 219486, 73526, 12734, 87246, 28430, 51375, 131148, 215409, 221800, 135563, 57630, 46787, 125460, 215600, 205323, 215622, 138710, 110021, 59450, 188864, 246296, 165667, 145967, 213285, 286987, 238672, 161542, 167736, 167414, 331162, 414160, 424835, 385447, 276649, 254324, 262087, 312703, 337702, 277092, 282346, 262976, 219424, 195867, 202417, 159440, 227925, 136179, 17218, 99476, 201615, 146749, 82917, 117497, 144795, 146478, 215990, 156311, 157338, 285776, 230506, 163525, 224794, 236683, 161729, 197364, 220140]
13677B20140n2069m8826j20041L1302J17141J36789p2193o5378k5544j8706j2111
$$ y = [220140, 168071, 119245, -796, 30506, 147647, 284436, 212243, 146865, 121321, 102615, 90504]
$$ [...]
##END NTUPLES=NMR SPECTRUM
##END=
