##TITLE=Analysis number 324851
Compound Code cc 53016
Book Reference 407/141
Project Code adrs
Chemist Name andyw
##JCAMPDX= 6.0         $$ Bruker NMR JCAMP-DX V2.0
##DATA TYPE= NMR SPECTRUM
##DATA CLASS= NTUPLES
##ORIGIN= Bruker BioSpin GmbH
##OWNER= nmr
$$ XWIN-NMR		Version 3.5
$$ Mon Dec  4 10:45:13 2006 GMT Standard Time (UT+0h)  MAYBRIDGE\nmr@NMR_250MHZ
##.OBSERVE FREQUENCY= 250.131544655141
##.OBSERVE NUCLEUS= ^1H
##.ACQUISITION MODE= SIMULTANEOUS (DQD)
##.ACQUISITION SCHEME= undefined
##.AVERAGES= 16
##.DIGITISER RES= 18
##SPECTROMETER/DATA SYSTEM= dpx250
##.PULSE SEQUENCE= zg30
##.SOLVENT NAME= CDCl3
##.SHIFT REFERENCE= (INTERNAL, CDCl3, 0, 16.522)
##AUDIT TRAIL= $$ (NUMBER, WHEN, WHO, WHERE, WHAT)
$$ ##TITLE= Audit trail, XWIN-NMR		Version 3.5
$$ ##JCAMPDX= 5.01
$$ ##ORIGIN= Bruker BioSpin GmbH
$$ ##OWNER= nmr
$$ C:\u/data/dgb/nmr/ADRS/130/pdata/1/auditp.txt
$$ ##AUDIT TRAIL=  $$ (NUMBER, WHEN, WHO, WHERE, WHAT)
(   1,<2006-12-04 10:44:50.79 +000>,<MAYBRIDGE\nmr>,<NMR_250MHZ>,
      <created by zg, POWCHK disabled, PULCHK disabled
       configuration hash MD5:
       49 4B E0 1D 92 C2 6B 37 9F E6 65 BC 52 41 86 1D
       data hash MD5: 64K
       8D 16 F5 33 7F B8 92 E0 80 30 31 E9 62 E7 11 0E>)
(   2,<2006-12-04 10:45:03.54 +000>,<MAYBRIDGE\nmr>,<NMR_250MHZ>,
      <Start of raw data processing
       ef LB = 0.3 FT_mod = 6 PKNL = 1 SI = 32K 
       data hash MD5: 32K
       0E AF 85 AA 12 59 3E 77 E4 0C D1 18 58 08 9B B7>)
(   3,<2006-12-04 10:45:05.17 +000>,<MAYBRIDGE\nmr>,<NMR_250MHZ>,
      <apk 
       data hash MD5: 32K
       7E 7F B8 35 5A 57 8E FA EC AD 80 2D 14 1D 45 E2>)
(   4,<2006-12-04 10:45:05.93 +000>,<MAYBRIDGE\nmr>,<NMR_250MHZ>,
      <abs ABSG = 5 
       data hash MD5: 32K
       3D E3 73 8E 07 49 58 02 6B CC BD 32 36 EE 31 5F>)
$$ ##END=
$$ 
$$ hash MD5
$$ F9 BB CB 1E D4 DA 3E 33 6C 27 3B 5B 8E 8D 2E 29
##$RELAX= 
##$RELAX= 
##$RELAX= 
##$RELAX= 
##$RELAX= 
##$RELAX= 
##$RELAX= 
$$ Bruker specific parameters
$$ --------------------------
##$DU= <C:\u>
##$EXPNO= 130
##$NAME= <ADRS>
##$PROCNO= 1
##$TYPE= <nmr>
##$USER= <dgb>
##$AMP= (0..31)
100 100 100 100 100 100 100 100 100 100 100 100 100 100 100 100 100 100 
100 100 100 100 100 100 100 100 100 100 100 100 100 100 
##$AQSEQ= 0
##$AQ_mod= 3
##$AUNM= <au_zg>
##$AUTOPOS= <8 >
##$BF1= 250.13
##$BF2= 250.13
##$BF3= 250.13
##$BF4= 250.13
##$BF5= 500.13
##$BF6= 500.13
##$BF7= 500.13
##$BF8= 500.13
##$BYTORDA= 1
##$CFDGTYP= 0
##$CFRGTYP= 5
##$CHEMSTR= <none>
##$CNST= (0..31)
1 1 145 1 1 1 1 1 1 1 1 1 1 1 1 1 1 1 1 1 1 1 1 1 1 1 1 1 1 1 1 1 
##$CPDPRG= <>
##$CPDPRG1= <>
##$CPDPRG2= <>
##$CPDPRG3= <>
##$CPDPRG4= <mlev>
##$CPDPRG5= <mlev>
##$CPDPRG6= <mlev>
##$CPDPRG7= <mlev>
##$CPDPRG8= <mlev>
##$CPDPRGB= <>
##$CPDPRGT= <>
##$D= (0..31)
0 1 0 0 0 0 0 0 0 0.06 0 0 0 0 0 0 0.0002 0 0 0 0 0 0 0 0 0 0 0 0 0 0 
0 
##$DATE= 1165229089
##$DBL= (0..7)
120 120 120 120 120 120 120 120 
##$DBP= (0..7)
150 150 150 150 150 150 150 150 
##$DBP07= 0
##$DBPNAM0= <>
##$DBPNAM1= <>
$$ [...]
##$SUBNAM7= <"">
##$SUBNAM8= <"">
##$SUBNAM9= <"">
##$SW= 20.6930455092707
##$SWIBOX= (0..15)
0 0 3 0 0 0 0 0 0 0 0 0 0 0 0 0 
##$SW_h= 5175.983436853
##$TD= 65536
##$TD0= 1
##$TE= 294.16
##$TE2= 300
##$TE3= 300
##$TEG= 300
##$TL= (0..7)
0 120 120 120 120 120 120 120 
##$TP= (0..7)
150 150 150 150 150 150 150 150 
##$TP07= 0
##$TPNAME0= <>
##$TPNAME1= <>
##$TPNAME2= <>
##$TPNAME3= <>
##$TPNAME4= <>
##$TPNAME5= <>
##$TPNAME6= <>
##$TPNAME7= <>
##$TPOAL= (0..7)
0.5 0.5 0.5 0.5 0.5 0.5 0.5 0.5 
##$TPOFFS= (0..7)
0 0 0 0 0 0 0 0 
##$TUNHIN= 0
##$TUNHOUT= 0
##$TUNXOUT= 0
##$USERA1= <user>
##$USERA2= <user>
##$USERA3= <user>
##$USERA4= <user>
##$USERA5= <user>
##$V9= 5
##$VALIST= <valist>
##$VCLIST= <CCCCCCCCCCCCCCC>
##$VD= 0
##$VDLIST= <DDDDDDDDDDDDDDD>
##$VPLIST= <PPPPPPPPPPPPPPP>
##$VTLIST= <TTTTTTTTTTTTTTT>
##$WBST= 1024
##$WBSW= 4
##$XGAIN= (0..3)
0 0 0 0 
##$XL= 0
##$YL= 0
##$YMAX_a= 293246
##$YMIN_a= -341117
##$ZGOPTNS= <>
##$ZL1= 120
##$ZL2= 120
##$ZL3= 120
##$ZL4= 120
##$ABSF1= 16.522
##$ABSF2= -4.171173
##$ABSG= 5
##$ABSL= 3
##$ALPHA= 0
##$AQORDER= 0
##$ASSFAC= 0
##$ASSFACI= 0
##$ASSFACX= 0
##$ASSWID= 0
##$AUNMP= <proc_1d>
##$AZFE= 0.1
##$AZFW= 0.1
##$BCFW= 0
##$BC_mod= 0
##$BYTORDP= 0
##$COROFFS= 0
##$CY= 12.5
##$DATMOD= 1
##$DC= 0
##$DFILT= <>
##$DTYPP= 0
##$F1P= 14.0000005364418
##$F2P= -0.99999901652339
##$FCOR= 0.5
##$FTSIZE= 32768
##$FT_mod= 6
##$GAMMA= 0
##$GB= 0
##$INTBC= 1
##$INTSCL= 1
##$ISEN= 128
##$LB= 0.3
##$LEV0= 0
##$LPBIN= 0
##$MAXI= 10000
##$MC2= 0
##$MEAN= 0
##$ME_mod= 0
##$MI= 0
##$NCOEF= 0
##$NC_proc= -5
##$NLEV= 6
##$NOISF1= 0
##$NOISF2= 0
##$NSP= 0
##$NTH_PI= 0
##$NZP= 0
##$OFFSET= 16.522
##$PC= 1
##$PHC0= 230.4043
##$PHC1= 4.978768
##$PH_mod= 1
##$PKNL= yes
##$PPARMOD= 0
##$PSCAL= 4
##$PSIGN= 0
##$REVERSE= no
##$SF= 250.13
##$SI= 32768
##$SIGF1= 0
##$SIGF2= 0
##$SINO= 400
##$SIOLD= 32768
##$SREGLST= <1H.CDCl3>
##$SSB= 0
##$STSI= 32768
##$STSR= 0
##$SW_p= 5175.98343685301
##$SYMM= 0
##$S_DEV= 0
##$TDeff= 65536
##$TDoff= 0
##$TI= <Analysis number 999999
Compound Code 99
Book Reference 9
Project Code 9>
##$TILT= no
##$TM1= 0
##$TM2= 0
##$TOPLEV= 0
##$USERP1= <user>
##$USERP2= <user>
##$USERP3= <user>
##$USERP4= <user>
##$USERP5= <user>
##$WDW= 1
##$XDIM= 32768
##$YMAX_p= 436386624
##$YMIN_p= -726079
$$ End of Bruker specific parameters
$$ ---------------------------------
##NTUPLES= NMR SPECTRUM
##VAR_NAME=  FREQUENCY,     SPECTRUM/REAL,   SPECTRUM/IMAG
##SYMBOL=    X,             R,               I
##VAR_TYPE=  INDEPENDENT,   DEPENDENT,       DEPENDENT
##VAR_FORM=  AFFN,          ASDF,            ASDF
##VAR_DIM=   32768,         32768,           32768
##UNITS=     HZ,            ARBITRARY UNITS, ARBITRARY UNITS
##FACTOR=    0.157963299565203, 1,           1
##FIRST=     4132.6476996994, 0,             0
##LAST=      -1043.33573715361, 0,           0
##MIN=       -1043.33573715361, -726079,     0
##MAX=       4132.6476996994, 436386624,     0
$$ Real data points
##PAGE= N=1
##DATA TABLE= (X++(R..R)), XYDATA
$$ [...]
24759e7068N8053k791n5943L9531m5582n6984l7630J37219p7377Q6549M8095k2408
$$ -57068 985 -1806 -57749 -18218 -63800 -120784 -158414 -21195 -98572 -12023 36072 13664
24747A3664N4254m0622l5355J5007l6400M134n9250K7686L1078K18131m9986r8254
$$ 13664 67918 27296 -8059 6948 -29452 -25318 -84568 -56882 -25804 192327 142341 44087
24735D4087J04004k6225n3079m975q2498J00751j63643j99587J47547J7232J02226
$$ 44087 148091 121866 68787 63812 -18686 82065 -81578 -281165 -133618 -116386 -14160
24724a4160k6789j0120n3337O051r6812l8432K69027R0073p3984r8436j05846
$$ -14160 -40949 -51069 -104406 -98355 -195167 -233599 35428 125501 51517 -46919 -152765
24713a52765N0857O5533L4813J63874Q5637l1351j26940j6051m4592Q6171l1099
$$ -152765 -101908 -36375 -1562 162312 247949 216598 89658 73607 29015 115186 84087
24702H4087n7388l0095j59044k05967L0718J59539J79447O0784L4719J21399j34262
$$ 84087 26699 -3396 -162440 -368407 -337689 -178150 1297 62081 96800 218199 83937
24691H3937j48675M3277J795l8494M2860Q2155j312N572M3143j3355k226o7575
$$ 83937 -64738 -21461 -19666 -58160 -15300 66855 65543 71115 114258 100903 98677 31102
24679C1102j7026l26K3180m2499P6012J92949O110R635J13107N4951j92509j43025
$$ 31102 14076 13750 36930 -5569 70443 263392 269502 279137 392244 447195 254686 111661
24667A11661j0833M6822j35025r6721N8597L14872P7905k35021j37722Q2796n9348
$$ 111661 100828 147650 12625 -84096 -25499 289373 367278 132257 -5465 77331 17983
24656A7983j00000K5201R2420J21508k39829j29116K05975J41248L3294k23439
$$ 17983 -82017 -56816 35604 157112 -82717 -211833 -5858 135390 168684 -54755
24646e4755r4439J78652Q5084q474k35402j49345N8485K36642j961J9851L2941
$$ -54755 -149194 29458 114542 106068 -129334 -278679 -220194 16448 14487 34338 67279
24635F7279J25635o616L092j11732j97131K0358R3334J41311M5724l2510j31186
$$ 67279 192914 186298 189390 77658 -119473 -99115 -5781 135530 181254 148744 17558
24624A7558J20247J3347j79758J2141P6717J19649M7234j9764m3538k2010J8291
$$ 17558 137805 151152 -28606 -16465 60252 179901 227135 207371 163833 141823 160114
24613A60114j27004j00887Q4593M8561j18184l8302J23982M0536R858l8523r3759
$$ 160114 33110 -67777 16816 65377 -52807 -91109 32873 73409 83267 44744 -49015
24602d9015r4604M2776N4556p0307j86003O0211O9656K8848K37926J69892Q2681
$$ -49015 -143619 -100843 -46287 -116594 -302597 -242386 -172730 -143882 94044 263936 346617
24591C46617q9619k9672J05516j84672j20234j68728j7646J07077j69451j50197
$$ 346617 256998 227326 332842 148170 27936 -140792 -158438 -51361 -220812 -371009
24581c71009J75619j2015J62982K89083M5646k71471r7570J9062Q5800q1280P3737
$$ -371009 -195390 -207405 -44423 244660 290306 18835 -78735 -59673 26127 -55153 18584
24570A8584l8955n9207P3594J23546K41200p4837k16665K4189o6901j51900r0891
$$ 18584 -20371 -79578 -5984 117562 358762 283925 67260 91449 24548 -127352 -218243
24559b18243J5602J70056Q8814j25319K14779n9223p2844j06215J93955J93124
$$ -218243 -202641 -32585 56229 -69090 145689 86466 13622 -92593 101362 294486
24549B94486M307p5484j41623k33938Q0900N4602J05070N5315J00079k3679p9067
$$ 294486 298793 223309 81686 -152252 -71352 -16750 88320 143635 243714 220035 140968
24538A40968j8284p5192P3825p5139j06148J34312j5241m3179R3036J84213k3812
$$ 140968 122684 47492 121317 46178 -59970 74342 59101 15922 108958 293171 269359
24527B69359j59911O2861N9985R7255j17452k83983o7619P95M9782n273L1214
$$ 269359 109448 172309 232294 329549 212097 -71886 -139505 -138710 -88928 -94201 -62987
24516f2987J43450L6179o8180n5023r2284J77315q3309j00857J64874J03161n0542
$$ -62987 80463 116642 48462 -6561 -98845 78470 -4839 -105696 59178 162339 111797
24505A11797j73562P1970j18139N6499J58659R8676o0098j01677j12850Q8048
$$ 111797 -61765 10205 -107934 -51435 107224 205900 145802 44125 -68725 19323
24495A9323J62286M4804o5808m1751J35750m0707L387j12772q4822j05165L9811
$$ 19323 181609 226413 160605 118854 254604 213897 217284 104512 19690 -85475 -45664
24484d5664L9582J32130N1023k1262j8823R9843o277j87627r8583j96990q1064
$$ -45664 -6082 126048 177071 155809 136986 236829 230552 42925 -55658 -252648 -333712
24473c33712J05906j45489O5838J13796K357l1798K06891N6323j87604j9200M0423
$$ -333712 -227806 -373295 -307457 -193661 -191304 -223102 -16211 40112 -147492 -166692 -126269
24462a26269j2796l7970p328J31284L24559j13450j00853J724j4073p7078l5740
$$ -126269 -139065 -177035 -184363 -53079 271480 158030 57177 58901 44828 -32250 -67990
24451f7990j00265j33694M392K07403M8446j26246l8059m3111R8850J68765L4002
$$ -67990 -168255 -301949 -297557 -90154 -41708 -167954 -206013 -249124 -150274 18491 52493
24440E2493q2401n7438M4316R8987M6933P070k9629j79528l5228j4065Q5709K8630
$$ 52493 -29908 -87346 -43030 55957 102890 109960 80331 -99197 -134425 -148490 -62781 -34151
24428c4151n6604J70348J05832j02500j03212k3997m6406Q1677R8013J14914n1870
$$ -34151 -90755 79593 185425 82925 -20287 -44284 -90690 -9013 89000 203914 152044
24417A52044R2572q4850q8709k9039q0149K9136l7434J1473j47198J32936l1692
$$ 152044 244616 159766 71057 42018 -38131 -8995 -46429 -34956 -182154 -49218 -80910
24406h0910Q1895J71691p3653j37060p1186O97O4493l9387j13404N5862R4630
$$ -80910 985 172676 99023 -38037 -109223 -108526 -44033 -83420 -196824 -140962 -46332
24395d6332J54727M0023l9697l4871J3889Q621M2857r2767Q7349n0810j06081
$$ -46332 108395 148418 108721 73850 87739 96360 139217 46450 133799 82989 -23092
24384b3092j15724j26936L0946m1432Q5166J21993K2338P077p8283J9916o8862
$$ -23092 -138816 -265752 -234806 -276238 -191072 -69079 -46741 -39664 -117947 -98031 -166893
24373a66893j29095r5842q469L1328J53248J89137J12265n9781o9567j32410N1889
$$ -166893 -295988 -391830 -400299 -368971 -215723 -26586 85679 25898 -43669 -176079 -124190
24362a24190j12549k26776J95247J41418K03462O5347r5105R9351N8847J4198
$$ -124190 -236739 -463515 -268268 -126850 76612 141959 46854 146205 205052 219250
24352B19250m4775j68444j68015l2343L4482J39574J47518q1505j15290Q835J8902
$$ 219250 174475 6031 -161984 -194327 -159845 -20271 127247 45742 -69548 -60713 -41811
24341d1811R377j6703j34502J92995j87814j8964j9811q5797R8708J31053N0643
$$ -41811 -32434 -49137 -183639 9356 -178458 -197422 -217233 -303030 -204322 -73269 -22626
24330b2626j54708K7874J42939L1747m6562p9233L4694J13928n4085n5494j5491
$$ -22626 -177334 -149460 -6521 25226 -21336 -100569 -65875 48053 -6032 -61526 -77017
24319g7017Q2917Q7375M4761L1952r4768m5528J28260k06759j48798J57801R8345
$$ -77017 5900 93275 138036 169988 75220 29692 157952 -48807 -197605 -39804 58541
24308E8541N2888N6392L4356k5124J02338n5086j69910j32037J49617P1742j61937
$$ 58541 111429 167821 202177 177053 279391 224305 54395 -77642 71975 143717 -18220
24297a8220k07158k87633M4617J18145J23498J64309Q5453J5066n666J8277J40844
$$ -18220 -225378 -513011 -468394 -350249 -226751 -62442 23011 38077 32411 50688 191532
24286A91532o0314j04318P8789J3234k7994L1904J07269r8310l7735P0781o6615
$$ 191532 131218 26900 105689 118923 90929 122833 230102 131792 94057 164838 98223
24275I8223l7830k19307r3883M0309J12994J20333j6917P2313P2015q4883j41291
$$ 98223 60393 -158914 -252797 -212488 -99494 20839 3922 76235 148250 63367 -77924
24264g7924j5838M8380l583N9914R7817L3718M5797j11396j35108L1759O084j9833
$$ -77924 -93762 -45382 -48965 10949 108766 142484 188281 76885 -58223 -26464 -20380 -40213
24252d0213j55289r6314j2650O7415l4203l6693J82088J56501m3520l9775L6567
$$ -40213 -195502 -291816 -304466 -237051 -271254 -307947 -125859 30642 -12878 -52653 -16086
24241a6086L6508O6114n6496j16570Q547l0836j50365l7193J93413Q2040R7191
$$ -16086 20422 86536 30040 -86530 -77983 -108819 -259184 -296377 -102964 -20924 76267
24230G6267N2422k5290J2338J5307j18601J53830n0820L344Q316j20540j12628
$$ 76267 128689 103399 115737 131044 12443 166273 115453 118797 127113 6573 -106055
24219a06055n0503N3458J25846l4938P6460K7128Q682K0511j25860L9654P8506
$$ -106055 -156558 -103100 22746 -12192 64268 91396 100078 120589 -5271 34383 112889
24208A12889J15893j8611j12437o3027n369j9146N9795m9019J6869j10303j55261
$$ 112889 228782 210171 97734 34707 29338 10192 69987 20968 37837 -72466 -227727
24197b27727p3976J13082p7029N844k7005K6486J3486l8041o5878K30151R1559
$$ -227727 -301703 -188621 -265650 -259806 -286811 -260325 -246839 -284880 -350758 -120607 -29048
24186b9048m6166o6033N7220J07544J44914K3444p3885j70362p1566r5582j20144
$$ -29048 -75214 -141247 -84027 23517 168431 191875 117990 -52372 -123938 -219520 -339664
24175c39664R1108K15684J44355J32958j38473M5862R1477r9615J3243n374L9018
$$ -339664 -248556 -32872 111483 244441 105968 151830 243307 143692 156935 151561 190579
24164A90579r6751m2014O2119o5599r1226J40399J51929j43516k03025r6444N2314
$$ 190579 93828 51814 113933 48334 -42892 97507 249436 105920 -97105 -193549 -141235
24153a41235M7448m9446J5587q2423J7440n4863N4879K3489N6590k9593J63138
$$ -141235 -93787 -143233 -127646 -210069 -192629 -247492 -192613 -169124 -112534 -142127 21011
24142B1011L7924N4427j07212k46757j8506j3688J77344n869k9333J17884O9535
$$ 21011 58935 113362 6150 -240607 -259113 -272801 -95457 -101326 -130659 -12775 56760
24131E6760L2523N2326o1063k8197l5956j26775Q1026J88136P1486j04375J1041
$$ 56760 89283 141609 80546 52349 16393 -110382 -29356 158780 230266 125891 136932
24120A36932P8260K65l0925M1258j26769j49776n9710J6784j819J01950J06355
$$ 136932 215192 215457 184532 225790 99021 -50755 -110465 -93681 -95500 6450 112805
24109A12805l6879l2061K8175j28061q9126M9199M5186N0786p8067J10284J4253
$$ 112805 75926 43865 72040 -56021 -145147 -95948 -50762 24 -78043 32241 46494
24098D6494K9430k42977j55789P0361K80611J8610j15694L5540J70741j6977j20222
$$ 46494 75924 -167053 -322842 -252481 28130 46740 -68954 -33414 137327 120350 128
24087A28j69545J3936Q2300n8052j97043P0266J26128J08637N1182P4411M6594
$$ 128 -169417 -155481 -73181 -131233 -328276 -258010 -131882 -23245 27937 102348 148942
24076A48942N3938o2257q9624p9151n5171k2950L7482J58402K1628J20813J00080
$$ 148942 202880 140623 50999 -28152 -83323 -106273 -68791 89611 111239 232052 332132
24065C32132R0278j09540j68709p2197K9178l9102o9755L0648r2966J5701M1657
$$ 332132 422410 312870 144161 71964 101142 62040 -7715 22933 -70033 -54332 -12675
24054a2675q6856K9100J18243k0072o1402J67842j6400j02479K952j67314k4477
$$ -12675 -99531 -70431 47812 27740 -33662 134180 117780 15301 18253 -149061 -173538
24043a73538J5235L29916J2920J17302L6243m6054q4180j73123J2052l2428j15703
$$ -173538 -158303 171613 184533 301835 338078 292024 207844 34721 46773 14345 -101358
24032a01358J10441m0182j27064Q3323k0072M2158n8988q6555l6410p1218m4595
$$ -101358 9083 -31099 -158163 -74840 -94912 -52754 -111742 -198297 -234707 -305925 -350520
24021c50520o1762J21110L05089J19776j26684j12645M8742L7725k6732n2075
$$ -350520 -412282 -291172 13917 133693 7009 -105636 -56894 -19169 -45901 -97976
24011i7976O4763J47539M5399j19068j57995K2102p5639J91271K12361q3391j20424
$$ -97976 -33213 114326 159725 40657 -117338 -95236 -170875 20396 232757 149366 28942
24000B8942j04682K4933j7070m7997O8249j1493o5524K6136m2429N2360p7274
$$ 28942 -75740 -50807 -67877 -115874 -47625 -59118 -124642 -98506 -140935 -88575 -165849
23989a65849k6944l7336J1083J23565k6739N8754L1294O9220n3779R5843K2993
$$ -165849 -192793 -230129 -219046 -95481 -122220 -63466 -32172 37048 -16731 79112 102105
23978A02105r6497m727j7565o0825r1667N5392p4530n1120p4793k4601J23360
$$ 102105 5608 881 -16684 -77509 -169176 -113784 -188314 -239434 -314227 -338828 -215468
23967b15468R2238J34683o5327J6353Q2911K7179j73650m4970M3469P6885J06715
$$ -215468 -123230 11453 -53874 -37521 45390 72569 -101081 -146051 -102582 -25697 81018
23956H1018p8733K2905K00994P7027l9971k54902n5659Q3327Q6758J44676n2452
$$ 81018 2285 25190 226184 303211 263240 8338 -47321 36006 122764 267440 214988
23945B14988p4964m8485J7144j84230j05635n5408R8909j0855K4009n9333R1967
$$ 214988 140024 91539 108683 -75547 -181182 -236590 -137681 -148536 -124527 -183860 -91893
23934i1893R6848P2176m1970Q6517J47345J93779q5220j66061p5567l8420N7604
$$ -91893 4955 77131 35161 121678 269023 462802 377582 211521 135954 97534 155138
23923A55138J0950P7025r8281j92433Q683j25165m1140P9255J10052K22451j7885
$$ 155138 166088 243113 144832 -47601 -38918 -164083 -205223 -125968 -15916 206535 188650
23912A88650M0065M9234j84800l3317q9056j3788r4584O1015j22753j30564O1195
$$ 188650 228715 277949 93149 59832 -29224 -43012 -137596 -76581 -199334 -329898 -268703
23901b68703J59102L3346o4502R3790L7698J711L1516K8520M2163l86m9294o2241
$$ -268703 -109601 -76255 -140757 -46967 -9269 -7558 23958 52478 94641 94255 44961 -17280
23889a7280J26159J41637j59326p3814j18163k9528J29355M6662p806J54588m3514
$$ -17280 108879 250516 91190 17376 -100787 -130315 -960 45702 37896 192484 148970
23878A48970k7063K1348k1057j72810j47602q7464O0603J66706J23448q3614P034
$$ 148970 121907 143255 122198 -50612 -198214 -285678 -225075 -58369 65079 -18535 -11501
23867a1501j0304J9368J88213J69211L0993r9114j44865j39478o0767o9559k3414
$$ -11501 -21805 -2437 185776 354987 385980 286866 142001 2523 -58244 -127803 -151217
23856a51217N0564K31879j6864p9406r2373j9872P2815q5010k6394l8614L6575
$$ -151217 -100653 131226 114362 34956 -57417 -77289 -4474 -89484 -115878 -154492 -117917
23845a17917J99184J8118N5557q0963r956O0135m2356j7497j51576o1155L8454
$$ -117917 81267 99385 154942 73979 64023 124158 81802 64305 -87271 -148426 -109972
23834a09972J08931N3723Q6365r5925M4732k2106M7322J01579O4995o3922o5002
$$ -109972 -1041 52682 139047 43122 87854 65748 113070 214649 279644 215722 150720
23823A50720j40581P1991j05334k1014o3303p2162J30895p0011l005J02999P9104
$$ 150720 10139 82130 -23204 -44218 -107521 -179683 -48788 -118799 -121804 -18805 60299
23812F0299l3374L7666j2519m1856k5344P7861R0744j0008P3770q3195j16129
$$ 60299 26925 64591 52072 10216 -15128 62733 153477 143469 217239 134044 17915
23801A7915j41395L8508K02202j97698P419J62232j1509q1909j85405j03139M2248
$$ 17915 -123480 -84972 117230 -80468 -73049 89183 77674 -4235 -189640 -292779 -250531
23790b50531J01364P9859n4271M3957j2536j91833N5588M1907K6061K0136K8484
$$ -250531 -149167 -69308 -123579 -79622 -92158 -283991 -228403 -186496 -160435 -140299 -111815
23779a11815J05582j12423J87901O5655l7503m4267l2691J56353L9383j60141
$$ -111815 -6233 -118656 69245 134900 97397 53130 20439 176792 216175 56034
23769E6034m1741j15941N7576K25957K1196j12723J8478j67758j98102J24906
$$ 56034 14293 -101648 -44072 181885 203081 90358 108836 -58922 -257024 -132118
23759a32118J33933P3924O1003J08675q0681k2949Q6063o4118K2626o4701r7561
$$ -132118 1815 75739 136742 245417 164736 141787 227850 163732 186358 121657 24096
23748B4096p6168o6045q9271O7538Q3401J52118O2532l4631r2j11161r9460l5863
$$ 24096 -52072 -118117 -207388 -139850 -56449 95669 158201 123570 123478 12317 -87143 -123006
23736a23006P3395Q727K4748m7504L6324q8225k06493r4879J1329J56902K10074
$$ -123006 -49611 -40884 -16136 -63640 -27316 -115541 -322034 -416913 -405584 -248682 -38608
23725c8608L2015p2066k0434q3062n7741J04514m0021P9740O8117O6486R9164
$$ -38608 -6593 -78659 -99093 -182155 -239896 -135382 -175403 -95663 -27546 38940 138104
23714A38104k8770n5838L346K9014m6191J35408J00752Q3896n4673j49623N741
$$ 138104 109334 53496 56842 85856 39665 175073 275825 359721 305048 155425 161166
23703A61166J02320M3277p5096K5114q672k18124q7471J4861R3981p6009j21296
$$ 161166 263486 306763 231667 256781 248109 29985 -57486 -42625 51356 -24653 -145949
23692a45949R8022K4989k92528j3579J23989P5814Q9162N1347L8042m167o3679
$$ -145949 -47927 -22938 -315466 -329045 -205056 -129242 -40080 11267 49309 45142 -18537
23681a8537J66772j18172j9872o2741k06798l9854J28526j35930k0372K81775
$$ -18537 148235 30063 10191 -52550 -259348 -299202 -170676 -306606 -326978 -45203
23671d5203K24035R8167r6762q4424j04150j05291J4781J20286J48080k1347L2581
$$ -45203 178832 276999 180237 95813 -8337 -113628 -98847 21439 169519 148172 180753
23660A80753o4701o6453l7987k519j7987P6817M304n8819j9277n320M95j04320
$$ 180753 116052 49599 11612 9093 -8894 67923 72227 13408 -5869 -11189 -10694 -115014
23648a15014j72832J13475J96421l9614q5181k50911q1367Q0865L6410J37549
$$ -115014 -287846 -174371 22050 -17564 -102745 -353656 -435023 -354158 -317748 -180199
23638a80199J85710k7932j00803O6619J11253N2175l4423J9619j95596K23254
$$ -180199 5511 -22421 -123224 -56605 54648 106823 72400 92019 -103577 119677
23628A19677J03560j98096j68582J23250J23328l744J07916l3671l4779K9109
$$ 119677 223237 25141 -143441 -20191 103137 99393 207309 173638 138859 167968
23618A67968P6987o5962l8827J2166j11081J9682j00195j6536n4113k09454l2194
$$ 167968 244955 178993 140166 152332 41251 60933 -39262 -55798 -109911 -319365 -351559
23607c51559m9781J98173O5124P0464P7459M3166j10098M5639K20810r6012k83989
$$ -351559 -401340 -203167 -138043 -67579 9880 53046 -57052 -11413 209397 113385 -170604
23596a70604j01775q197M0341J75809J11554Q082n2643J6679m4746j05959j8314
$$ -170604 -272379 -280576 -240235 -64426 47128 55210 2567 19246 -25500 -131459 -149773
23585a49773J56000K18512k5818j49226n5994K13916J01368j46880j34861K29801
$$ -149773 6227 224739 198921 49695 -6299 207617 308985 162105 27244 257045
23575B57045R0337r4519K2268j744j38222p6263j1835L7322o5979J00719M9980
$$ 257045 347382 252863 275131 273387 135165 58902 47067 84389 18410 119129 169109
23564A69109M9287m7150k06017N4220J51840J1816p7682P6928l09741k07366Q6731
$$ 169109 218396 171246 -34771 19449 171289 183105 105423 182351 -127390 -334756 -248025
23553b48025K38046N613Q146q3164o1354M4208Q8856j19075j67438j57347O2466
$$ -248025 -9979 -4366 3780 -79384 -140738 -96530 -7674 -126749 -294187 -451534 -389068
23542c89068J34939J0291J783P9694J5946n8192N5138j19117q0581J68806O3162
$$ -389068 -254129 -243838 -242055 -162361 -146415 -204607 -149469 -268586 -349167 -180361 -117199
23531a17199K9767M4970o5666j38066M2997L685J3868J14869l2910J4771L6589
$$ -117199 -87432 -42462 -108128 -246194 -203197 -199512 -185644 -70775 -103685 -88914 -52325
23520e2325j49470j49702j15096n5866J77301J84453l2570L5310M2343J35464
$$ -52325 -201795 -351497 -466593 -522459 -345158 -160705 -193275 -157965 -115622 19842
23510A9842o2873j70350O339K1913n6249M3907J26144q8517k5337J71729M8211
$$ 19842 -43031 -213381 -207042 -185129 -241378 -197471 -71327 -159844 -185181 -13452 34759
23499C4759o8928j33438L3294J33669J08640J6567j40242j8J66451q2433k4333
$$ 34759 -34169 -167607 -134313 -644 107996 124563 -15679 -15697 150754 68321 43988
23488D3988k6674j85066j06418N2848J33165p1588J9981R2312K28168Q1207n2391
$$ 43988 17314 -167752 -274170 -221322 -88157 -159745 -139764 -47452 180716 261923 209532
23477B09532n9788j62485k19476k7987j22188J82472J26284j89541k448J61648
$$ 209532 149744 -12741 -232217 -260204 -382392 -199920 -73636 -263177 -265625 -103977
23467a03977J16542J9049k5091k5221P027q4019m855J36083n5077M0236m1998
$$ -103977 12565 31614 6523 -18698 -11671 -95690 -100545 35538 -19539 20697 -21301
23456b1301l6193P843r1331N3296Q0206P4059K98n2474R8100J49589m1279j47057
$$ -21301 -57494 -49651 -140982 -87686 -7480 66579 66877 14403 112503 262092 220813 73756
23444G3756K4836N3187l037N4132q0724j14044p1934j46950Q1493N9469R6730
$$ 73756 98592 151779 148742 202874 122150 8106 -63828 -210778 -129285 -69816 26914
23433B6914j55492o9785J17504J08208p7403j55008J02715N3224j50341R4126
$$ 26914 -128578 -198363 -80859 27349 -50054 -205062 -102347 -49123 -199464 -105338
23423a05338J67893O4826k14777j63091k2409J07753K2321j05838J88821J65762
$$ -105338 62555 127381 -87396 -250487 -272896 -165143 -142822 -248660 -59839 105923
23413A05923J2556k5797o6582j1221j06262p6320j3812K36791K02832P3093j69567
$$ 105923 118479 92682 26100 14879 -91383 -167703 -181515 55276 258108 331201 161634
23402A61634j24223J18983J30270j32973o6696J57084k14337k50823l6484K0257
$$ 161634 37411 156394 286664 153691 86995 244079 29742 -221081 -257565 -237308
23392b37308L5256J24465J85799n2352j42545j18466L2351j2441Q551J77449j7005
$$ -237308 -202052 -77587 108212 55860 -86685 -205151 -172800 -185241 -176690 759 -16246
23381a6246L5452j14897K0297N8986o1830j21993j5743M3989P2848Q7595l7118
$$ -16246 19206 -95691 -75394 -16408 -78238 -200231 -215974 -171985 -99137 -11542 -48660
23370d8660l1695K39471j29225j70138J09865J2501o9485l3496Q0047J05621Q3382
$$ -48660 -80355 159116 29891 -140247 -30382 -17881 -87366 -120862 -40815 64806 148188
23359A48188j09826j99601j42409j38877K81535K12253Q5973o6793j92931j7091
$$ 148188 38362 -161239 -303648 -442525 -160990 51263 137236 70443 -122488 -139579
23349a39579J0764O0121J72328k61053m8148J57905Q4622L0570Q7051J18608n2434
$$ -139579 -128815 -68694 103634 -157419 -205567 -47662 36960 67530 154581 273189 220755
23338B20755j12924j04209j14241m0796O9824r641J18463K6023l1146q5539j97733
$$ 220755 107831 3622 -110619 -151415 -81591 -91232 27231 53254 22108 -63431 -261164
23327b61164J27653K6827L0783L9965j29997j56530o8659L9522J82922O3640l9435
$$ -261164 -133511 -106684 -75901 -35936 -165933 -322463 -391122 -351600 -168678 -105038 -144473
23316a44473j05876o8691P1232P3066J40941m5744P7994K16862m1186L283O4727
$$ -144473 -250349 -319040 -247808 -174742 -33801 -79545 -1551 215311 174125 177408 242135
23305B42135m2184j79413K1085P7701j11279r1426j14585m5614Q9405J51795m3327
$$ 242135 199951 20538 41623 119324 8045 -83381 -197966 -243580 -154175 -2380 -45707
23294d5707K0834K9184J108q1283j25240K1033j14791o558J83415J42298n9348
$$ -45707 -24873 4311 5419 -75864 -201104 -180071 -294862 -301420 -118005 24293 -35055
23283c5055l6255P273m9390J0336J9976p984j1445k2672k9263L3115J39840o9947
$$ -35055 -71310 -64037 -113427 -103091 -83115 -91099 -102544 -125216 -154479 -121364 18476 -51471
23271e1471j9028J44450N6958P1862N682J45J09853j31323j16482J14329Q2840
$$ -51471 -70499 73951 130909 202771 208453 208598 318451 187128 70646 184975 267815
23260B67815o1306j29787j66071j05598n9774O4793N7567P6997J8681J19645Q1705
$$ 267815 206509 76722 -89349 -194947 -254721 -189928 -132361 -55364 -36683 82962 164667
23249A64667r0098r1303Q8223P7828o382k94092j8913K01573J15989r0945l3997
$$ 164667 74569 -16734 71489 149317 142935 -151157 -170070 31503 147492 56547 22550
23238B2550K6284N8374j11918p3589O0316J99034j4202j68001j43505Q5223Q2381
$$ 22550 48834 107208 -4710 -78299 -17983 181051 166849 -1152 -144657 -59434 22947
23227B2947L1917O5316J5398k2753n9266K8741R081j07011j29693O8155J09135
$$ 22947 54864 120180 135578 112825 53559 82300 91381 -15630 -145323 -77168 31967
23216C1967m2336j75918m933J05570m4587l8543R3677K06892J47914k63755k94747
$$ 31967 -10369 -186287 -191220 -85650 -130237 -168780 -75103 131789 279703 15948 -278799
23205b78799j61204J43992P7096m6334r4864J01571N5765j6366o4416m5711J45410
$$ -278799 -440003 -296011 -218915 -265249 -360113 -258542 -202777 -219143 -283559 -329270 -183860
23194a83860J44194K5331R7796Q0662j24111o992j68675l0814Q1052j04368m7005
$$ -183860 -39666 -14335 83461 164123 40012 33020 -135655 -166469 -85417 -189785 -236790
23183b36790K12999J59469l21215j8224m1020j03362K2915J95944J5964q738j21260
$$ -236790 -23791 135678 -185537 -203761 -244781 -348143 -325228 -129284 -113320 -122058 -243318
23172b43318Q6671J89008J8288j04345j24581J48226Q575j3671J23604m9896r1943
$$ -243318 -156647 32361 50649 -53696 -178277 -30051 -21476 -35147 88457 38561 -53382
23161e3382j2101j26835J9013J05925j0737k0392J4783K2205N3824K7604N5443
$$ -53382 -65483 -192318 -173305 -67380 -78117 -98509 -83726 -61521 -7697 19907 75350
23150G5350N3918j10667l4325j8780l8319p7908K7097J69783M7276j04044n1930
$$ 75350 129268 18601 -15724 -34504 -72823 -150731 -123634 46149 93425 -10619 -62549
23139f2549P6111J45967K8784m95r2652l58794l7655K20958R7385l8469M1180
$$ -62549 13562 159529 188313 187818 95166 -263628 -301283 -80325 17060 -21409 19771
23128A9771J19329k7744r4821J38971M8715j08136J9037n1153j6090j34803J64872
$$ 19771 139100 111356 16535 155506 204221 96085 115122 63969 47879 -86924 77948
23117G7948J3149j02987k2574n5020M5135J1700j65745o3583J00138p591o0060
$$ 77948 91097 -11890 -34464 -89484 -44349 -32649 -198394 -261977 -161839 -169430 -229490
23106b29490l9051J4037k3357N9673R9534J76205L1j46953L102M0826l1946m8219
$$ -229490 -268541 -254504 -277861 -218188 -118654 57551 57582 -89371 -86269 -45443 -77389 -125608
23094a25608k4654p7040m8228J70348N7956j72548O1022Q7579k6730J75065J3112
$$ -125608 -150262 -227302 -275530 -105182 -47226 -219774 -158752 -71173 -97903 77162 90274
23083I0274O2705j8924l6678J42433o7630j58780p434r5487o0696J09695j05682
$$ 90274 152979 134055 97377 239810 172180 13400 5966 -89521 -150217 -40522 -146204
23072a46204m5327J84433K49442l3403j15884l61264q2763K11879J19966q3505
$$ -146204 -191531 -7098 242344 208941 93057 -268207 -350970 -139091 -19125 -102630
23062a02630o8679j6424n8845K9871J40654J09061j20125n1346K0254J29868N5729
$$ -102630 -171309 -187733 -246578 -216707 -76053 33008 -87117 -138463 -118209 11659 67388
23051F7388M9020Q4788j1615j15806m0536J00204P7947o4631j18084k14908n124
$$ 67388 116408 201196 189581 73775 33239 133443 211390 146759 28675 -186233 -191357
23040a91357N8177J0867Q5661n9868p5070M4288J86113k7959j9527j6317n9230
$$ -191357 -133180 -122313 -36652 -96520 -171590 -127302 58811 30852 11325 -4992 -64222
23029f4222k09198R1789J34132L1207K7920N2733r7133q0940j29406k40447n5016
$$ -64222 -273420 -181631 -47499 -16292 11628 64361 -32772 -113712 -243118 -483565 -538581
23018e38581J04477K20834O2950J01880P2163R3202k10495j06980L9679K1615
$$ -538581 -434104 -213270 -150320 -48440 23723 116925 -93570 -200550 -160871 -139256
23008a39256J73781m0887j57405R6596k0827P8912J22038j51388n3078J36933
$$ -139256 34525 -6362 -163767 -67171 -87998 -9086 112952 -38436 -91514 45419
22998D5419J21531p3538J14097j62374q6576j1506k5185j01216J2031R9781N853
$$ 45419 166950 93412 207509 45135 -41441 -52947 -78132 -179348 -167317 -67536 -61683
22987f1683l9882J07587J07748j5051J69030M1909o9945N4289K5918r4212J8655
$$ -61683 -101565 6022 113770 98719 267749 309658 239713 294002 319920 225708 244363
22976B44363m8288j06252Q1101M3431j74974m9551k1994n3082O9126r2473N4669
$$ 244363 196075 89823 170924 214355 39381 -10170 -32164 -85246 -16120 -108593 -53924
22965e3924J8304q2950L2795J27984J84300o5726k48261M9734p7474k04949p788
$$ -53924 -35620 -118570 -85775 42209 226509 160783 -87478 -37744 -115218 -320167 -327955
22954c27955p043Q5846R477J18885J86597P4788N8004K9100M1363j01459R3336
$$ -327955 -334998 -249152 -239675 -120790 65807 140595 198599 227699 269062 167603 260939
22943B60939j9051j12462r8543J0118O3103j82504q4320J29556L1400p2841n6135
$$ 260939 241888 129426 30883 41001 104104 -78400 -162720 -33164 -1764 -74605 -130740
22932a30740J25538M5333m1263p252L9426O660J19110K7250k7798k5469k07988
$$ -130740 -5202 40131 -1132 -8384 31042 37702 156812 184062 156264 130795 -77193
22921g7193k06275N9126K23872J50779j643M2600l3716j16568j87169r7594J20935
$$ -77193 -283468 -224342 -470 150309 148666 191266 157550 40982 -146187 -243781 -122846
22910a22846J43239o8812R0217J0520K2281L4279j14651p9163q674p8471J10880
$$ -122846 20393 -48419 41798 52318 74599 108878 -5773 -84936 -93610 -172081 -61201
22899f1201J52246k0499j0320o0265q4115k2666o59K31750j2745n4947K7357k06841
$$ -61201 91045 70546 60226 -39 -84154 -106820 -107479 124271 111526 56579 83936 -122905
22887a22905m4357q2505J43104L9426R468L1551j8057J62665o7680P5342n1457
$$ -122905 -167262 -249767 -106663 -67237 -57769 -26218 -44275 118390 50710 126052 74595
22876G4595j65545J32665J79142N1514m0350J1896k21144J6717p2541j35175J60700
$$ 74595 -90950 41715 220857 272371 232021 243917 22773 39490 -33051 -168226 -7526
22865g526N7045N2169O3961l5808j23057M7455j8453n5508l0975p8945j63011
$$ -7526 49519 101688 165649 129841 6784 54239 35786 -19722 -50697 -129642 -292653
22854b92653r0307J32662J01734p945J40764n290j37700J26776m0449l8968L8811
$$ -292653 -382960 -250298 -148564 -156509 -15745 -21035 -158735 -31959 -72408 -111376 -72565
22843g2565R1008J17718Q0988J5155j5486k24128m9258J38859j2742j48827O8129
$$ -72565 18443 136161 217149 232304 216818 -7310 -56568 82291 69549 -79278 -11149
22832a1149M1601j04292q4605J59058k5129o8577J0082j27395p9647p3810O913
$$ -11149 30452 -73840 -158445 613 -24516 -93093 -83011 -210406 -290053 -363863 -356950
22821c56950M0577K0871O2920J28928k4597j40877j55107J02501L25721J34361
$$ -356950 -316373 -295502 -232582 -103654 -128251 -269128 -424235 -321734 3987 138348
22811A38348o8986p2704l0825j56775j75525o5160J08200J26121l5301j10142
$$ 138348 69362 -3342 -34167 -190942 -366467 -431627 -323427 -197306 -232607 -342749
22801c42749P077J40140L9718p1377J6931L4027J42841K7923j72438J66192K01252
$$ -342749 -335672 -195532 -155814 -227191 -210260 -176233 -33392 -5469 -177907 -11715 189537
22790A89537j08772j24328p9898p2354J37286K08492p3353j76516q1738j24838
$$ 189537 80765 -43563 -123461 -195815 -58529 149963 76610 -99906 -181644 -306482
22780c06482L4790Q8533M2172N6058j7196N8861j3464n3181k1109L8714l1934
$$ -306482 -271692 -183159 -140987 -84929 -102125 -43264 -56728 -109909 -131018 -92304 -124238
22769a24238K07391J24840p3525j46233J24607J20775k4899j25664p5034K4959
$$ -124238 83153 207993 134468 -11765 112842 233617 208718 83054 8020 32979
22759C2979j13101J2523O9115P3881J89628P4962r4106r0942j8288K601j25035
$$ 32979 -80122 -67599 1516 75397 265025 339987 245881 154939 136651 139252 14217
22748A4217j50217k254k7958J89748J36438n2689R2246J32756k4441l0377j26404
$$ 14217 -136000 -138254 -166212 23536 159974 107285 199531 332287 307846 277469 151065
22737A51065o3284j11997N0976J5547P9170L6177o306L9957k57395o8954L9767
$$ 151065 87781 -24216 26760 42307 121477 157654 151348 191305 -66090 -135044 -95277
22726i5277J76777J8732l1717J16018J0314j73485j52959M0290M9849r853m909
$$ -95277 81500 100232 68515 184533 194847 21362 -131597 -91307 -41458 -51311 -56220
22715e6220n5045M2049n6533q3134Q5363R8157J36813k1692j23532m9033J9044
$$ -56220 -111265 -69216 -125749 -208883 -123520 -25363 111450 89758 -33774 -82807 -63763
22704f3763j73364p8011J6599N3181N7143J8778j31408R1237J82622N0312L8324
$$ -63763 -237127 -315138 -298539 -245358 -188215 -169437 -300845 -209608 -26986 23326 61650
22693F1650n3858J00016l2383k68870r9418l235j17306Q3998l1158P6059p8565
$$ 61650 7792 107808 75425 -193445 -292863 -296098 -413404 -329406 -360564 -284505 -363070
22682c63070j3998P0348P0784J19639N6380l0855m4610l3048J55420O6968N0129
$$ -363070 -377068 -306720 -235936 -116297 -59917 -90772 -135382 -168430 -13010 53958 104087
22671A04087J60309R1209J1696n0532o7032q4916k20888k16015P319J29104p6328
$$ 104087 264396 355605 367301 316769 249737 164821 -56067 -272082 -264763 -135659 -211987
22660b11987P0915J06416J65227L3456j0120p6894J1620q51L7085J50P468n6475
$$ -211987 -141072 -34656 130571 164027 153907 77013 88633 87782 124867 125017 132485 76010
22648G6010j28418j90984R5615J87079p1158r4101r592J1459O7100Q1948J8298
$$ 76010 -52408 -243392 -147777 39302 -31856 -125957 -135549 -124090 -56990 24958 43256
22637D3256j52810j4708J56275N7617k8292J4244j1759j4706k9182N1387J18110
$$ 43256 -109554 -124262 32013 89630 61338 75582 63823 49117 19935 71322 189432
22626A89432j49725j88645K07909O2506q3012q4933J54651K39535J08912J4136
$$ 189432 39707 -148938 58971 121477 38465 -46468 108183 347718 456630 470766
22616D70766j45748j34737j70595J8611j16134n0892N9304J2413O2272L6631n6881
$$ 470766 325018 190281 19686 38297 -77837 -128729 -69425 -57012 5260 41891 -14990
22605a4990m7572k7386J34610M8098q5395r2304J45331j26854k10823J96466J31891
$$ -14990 -62562 -89948 44662 92760 7365 -84939 60392 -66462 -277285 -80819 51072
22594E1072R480P0959O298j40129l392N477j16229N2801j2544o3627J46098j7600
$$ 51072 60552 131511 137809 -2320 -5712 -235 -116464 -63663 -76207 -139834 6264 -11336
22582a1336j65283p5027J79977J51377l1989L0644J8590n3465M4613j03615k12170
$$ -11336 -176619 -251646 -71669 79708 47719 78363 96953 43488 88101 -15514 -227684
22571b27684M7445K61450J73717m3308k3100j01047p0681N3174m9793r0628o7861
$$ -227684 -180239 81211 254928 211620 188520 87473 16792 69966 20173 -70455 -138316
22560a38316O065J49178J36219n3260l8767l9898j1809K7685m8478m6872O8512
$$ -138316 -132251 16927 153146 99886 61119 21221 9412 37097 -11381 -58253 10259
22549A0259k4421p6333M8884R5431n3652R5257j43086N4905Q7048P3950p5988
$$ 10259 -14162 -90495 -41611 53820 168 95425 -47661 7244 94292 168242 92254
22538I2254k40819k5698K04795J24766o4123k7996K72094j55075J6286J83527
$$ 92254 -148565 -174263 30532 155298 91175 63179 335273 180198 196484 380011
22528C80011q1645k05097Q499Q1571j23230j28108P0949K9844k8213Q232N0170
$$ 380011 298366 93269 101768 183339 60109 -67999 2950 32794 4581 12813 62983
22517F2983J4057M5529J9515r9530j08695o5035j6138J87234j42227J8028J2745
$$ 62983 77040 122569 142084 42554 -66141 -131176 -147314 39920 -102307 -84279 -71534
22506g1534L2502J4014o2191N7621J11845j8462J0665J03616k8683j71520m2025
$$ -71534 -39032 -25018 -87209 -29588 82257 63795 74460 178076 149393 -22127 -64152
22495f4152M9101O8699J89563J4192j27624o9018J8469p6851j72712q8548J73480
$$ -64152 -15051 53648 243211 257403 129779 60761 79230 2379 -170333 -258881 -85401
22484h5401M567J67005J485K7463m6286n2740k1313K7321n7726l6698J54940J61219
$$ -85401 -80834 86171 87656 115119 68833 16093 -5220 22101 -35625 -72323 82617 243836
22472B43836n5611j31114j4627q069J35617m1124j77011Q7718N8808P4049j2486
$$ 243836 188225 57111 42484 34415 170032 128908 -48103 39615 98423 172472 159986
22461A59986K6682j95450k04143L2453M7971n2574L7312L8444M2815j36683k8589
$$ 159986 186668 -8782 -212925 -180472 -132501 -185075 -147763 -109319 -66504 -203187 -231776
22450b31776R9687Q5716P1965l2000l415P7058J78811J03940j14947q2324P9780
$$ -231776 -132089 -46373 25592 -6408 -9823 67235 246046 349986 235039 152715 232495
22439B32495k9993J976o152k06706k08360K0272J31316r8648Q3532M0584j3239
$$ 232495 202502 204478 198326 -8380 -216740 -196468 -65152 -163800 -80268 -39684 -52923
22428e2923n9432O1068L1958p4786l1740J92053o2282Q2152J81839l85j46569
$$ -52923 -112355 -51287 -19329 -94115 -125855 66198 3916 86068 267907 267522 120953
22417A20953k41962J73006J53285j0155j96415k22807j9757J68828J20480J27956
$$ 120953 -121009 51997 205282 195127 -1288 -224095 -243852 -75024 45456 173412
22407A73412J1122q6020m8153k1988Q6828p9609M4258O7407N4307K4270J3003
$$ 173412 184534 98514 50361 28373 115201 35592 79850 147257 201564 225834 238837
22396B38837j21689j63271N700m8609o4952O1024J45898M8385j23713k31263J8385
$$ 238837 117148 -46123 -40423 -89032 -153984 -92960 52938 101323 -22390 -253653 -235268
22385b35268K12954R2973O6538o0988j555j75416j20621k1946J8536Q716K18940
$$ -235268 -22314 70659 137197 76209 74654 -100762 -221383 -243329 -224793 -216077 2863
22374B863j11305o6607n0165O4296J42755K5493m4149M6272k7421R3348K1717
$$ 2863 -108442 -175049 -225214 -160918 -18163 7330 -36819 9453 -17968 75380 97097
22363I7097L3795q890M9226n520J25317o7991j48004p2403O9675o301O9615J33723
$$ 97097 130892 122002 171228 165708 291025 223034 75030 2627 72302 66001 135616 269339
22351B69339o9276j38848q1394L9908j2724l9913J13713L1447N7749O6270l499
$$ 269339 200063 61215 -20179 19729 7005 -32908 80805 112252 170001 236271 232772
22340B32772k32930J17232m453r9433o0191J73246L4836P8413p5822o9810j24188
$$ 232772 -158 117074 112621 13188 -47003 126243 161079 239492 163670 93860 -30328
22329c0328n9872j80894K16970J05192k12818q4267J7487M3258J64792L4637m9325
$$ -30328 -90200 -271094 -54124 51068 -161750 -246017 -228530 -185272 -20480 14157 -35168
22318c5168J5640j7274N555O0011J4206J5314J6869j1072q7748k06101J50117
$$ -35168 -19528 -36802 -31247 28764 42970 58284 75153 64081 -23667 -229768 -79651
22307g9651J90081K203q9129j52919K5312J66938r3966M2480n4775n2806j1477
$$ -79651 110430 112633 23504 -129415 -104103 62835 -31131 11349 -43426 -96232 -107709
22296a07709J06608p3129K0512j8166k0242j47478j71515J79233K24654J78367
$$ -107709 -1101 -74230 -53718 -71884 -92126 -239604 -411119 -231886 -7232 171135
22286A71135N5436p7664j20041j24546L73J64397L5915m6825k9479l6404k6450
$$ 171135 226571 148907 28866 -95680 -95307 69090 105005 58180 28701 -7703 -34153
22275c4153l8982J25736p1288j25705o2604m9262R697P6777Q3016J49031J65185
$$ -34153 -73135 52601 -18687 -144392 -206996 -256258 -246561 -169784 -86768 62263 227448
22264B27448J70709p3827k54878o0896j43731r2222K4335O7796K1864n5130j35241
$$ 227448 398157 324330 69452 8556 -135175 -227397 -203062 -135266 -113402 -168532 -303773
22253c03773j074J77977R268j71236Q8567J88808J45801O6494j66592j7148P4893
$$ -303773 -304847 -126870 -117602 -288838 -200271 -11463 134338 200832 34240 17092 91985
22242I1985o9611p9652L5445J7170J00583M0147J58434K6288r9798k05707J4510
$$ 91985 22374 -57278 -21833 -4663 95920 136067 294501 320789 220991 15284 29794
22231B9794N4243l5697J7381p8985o8090R577k828J36223N6704k0624M7358k32319
$$ 29794 84037 48340 65721 -13264 -81354 -71777 -74605 61618 118322 97698 145056 -87263
22219h7263N185K06479J15440M6988p3169m3567J1411j13781j20914m3334k2929
$$ -87263 -82078 124401 239841 286829 213660 170093 181504 67723 -53191 -96525 -119454
22208a19454J58682o6360j90129J4438m4755J07496J61478O0379J31992J64017
$$ -119454 39228 -27132 -217261 -202823 -247578 -140082 21396 81775 213767 377784
22198C77784j56160j64708r9033j8282L9071J50706K03667j04652K2167J1317
$$ 377784 221624 56916 -42117 -60399 -21328 129378 333045 228393 250560 261877
22188B61877M916k37580o6246O7131J11077l3403O2394j60906k79966k7889P7599
$$ 261877 266793 29213 -37033 30098 141175 107772 170166 9260 -270706 -298595 -220996
22177b20996j7862N1672K6665K7849R0243P4444N9823K02784J43327j17331M1240
$$ -220996 -238858 -187186 -160521 -132672 -42429 32015 91838 294622 437949 320618 361858
22166C61858L1098j95759j13549o1495O6615R9572J04861J7951j84105K5584k8543
$$ 361858 392956 197197 83648 22153 88768 188340 293201 311152 127047 152631 124088
22155A24088j56513O509k0392k1742J05075q7765l026N7117m737K3878j8207j2092
$$ 124088 -32425 -25916 -46308 -68050 37025 -50740 -53766 3351 -1386 22492 4285 -7807
22143g807o0966r99J6391k53606j18659J48920k2047j26896k0727o8523L4070
$$ -7807 -68773 -69772 -53381 -306987 -425646 -276726 -298773 -425669 -446396 -514919 -480849
22132d80849J90532M9214k6732n9848k3970J76337L2564j46926J09514M0813J07212
$$ -480849 -290317 -241103 -267835 -327683 -351653 -175316 -142752 -289678 -180164 -139351 -32139
22121c2139P5532O8667j38355r7085M6630J04157k13569j01153Q7205o8969K01268
$$ -32139 43393 112060 -26295 -123380 -76750 27407 -186162 -287315 -200110 -269079 -67811
22110f7811k4411k3667P6341N5739O201K6929q9329O6216J75743j62346j91568
$$ -67811 -92222 -115889 -39548 16191 22392 49321 -40008 26208 201951 39605 -151963
22099a51963L6527N7891j48269K8980J53063J09541r1299j17769n825J47527J26023
$$ -151963 -115436 -57545 -205814 -176834 -23771 85770 -5529 -123298 -129123 18404 144427
22088A44427j12559k0784O7018n5047j79089q0050J20232Q9567j3465n4104K0329
$$ 144427 31868 11084 78102 23055 -156034 -236084 -115852 -26285 -39750 -93854 -73525
22077g3525l2171P4083P6086j32780j2666P3482L5887m8529j4085K2637Q1840
$$ -73525 -105696 -31613 44473 -88307 -100973 -27491 8396 -40133 -54218 -31581 50259
22066E0259K4393R4602N478j07258m1613l9249k9816j61561l9754q637M9931P4071
$$ 50259 74652 169254 174732 67474 25861 -13388 -43204 -204765 -244519 -253156 -203225 -129154
22054a29154j5834K5043n2558q3340J08025K41589J44151J8701j11850j69805
$$ -129154 -144988 -119945 -172503 -255843 -147818 93771 237922 256623 144773 -25032
22044b5032o7348Q7183q2915m1031J0113N4904k5010O1286J26403Q0488J07673
$$ -25032 -92380 -5197 -88112 -129143 -119030 -64126 -89136 -27850 98553 179041 286714
22033B86714r6036j09707j79632J4833J41981o0576m5581J04040J34136n1371
$$ 286714 190678 80971 -98661 -83828 58153 -2423 -48004 56036 190172 138801
22023A38801j31459o2063N6573L200j46319j00376Q7802J05682J35294M9963m9814
$$ 138801 7342 -54721 1852 5052 -141267 -241643 -153841 -48159 87135 137098 87284
22012H7284m1970P8859j31380n9090k14441L3755J51294Q4948L5955l0407M1090
$$ 87284 45314 124173 -7207 -66297 -280738 -246983 -95689 -10741 25214 -5193 35897
22001C5897J12199o8947k13290m1151L1541p0724O8579P120R0734Q4383j23457
$$ 35897 148096 79149 -134141 -175292 -143751 -214475 -145896 -138776 -48042 36341 -87116
21990h7116Q046P1869q7875n405P0858n1168J7622o5696j15684m6560J09789J47835
$$ -87116 -79070 -7201 -95076 -100481 -29623 -80791 -63169 -128865 -244549 -291109 -181320 -33485
21978c3485O6290j77316r9904p287m5930J34902K17304K5487m518k2469j53157
$$ -33485 32805 -144511 -244415 -251702 -297632 -162730 54574 80061 75543 53074 -100083
21967a00083l5399L3188j43292q7313J56949J92193j66074j3512K1858j33768
$$ -100083 -135482 -102294 -245586 -332899 -175950 16243 -149831 -163343 -141485 -275253
21957b75253K2315J46211J29228N813j18366r159O8664j2599N695J37602k5844
$$ -275253 -252938 -106727 22501 28314 -90052 -99211 -30547 -43146 -37451 100151 74307
21946G4307j01117r8017J11106q4676J0209K01051L6683j25863k9952k4571J30978
$$ 74307 -26810 -124827 -13721 -98397 -88188 112863 149546 23683 -6269 -30840 100138
21935A00138M3137j93791o4552J02506O4014j9430n6667j38590O024J83971Q2903
$$ 100138 143275 -50516 -115068 -12562 51452 32022 -24645 -163235 -157211 26760 109663
21924A09663L9658L8865Q6005j35125q8795j3860j9364O5498m6882r70L2983k0912
$$ 109663 149321 188186 274191 139066 50271 36411 17047 82545 35663 34693 67676 46764
21912D6764j19068q2017o5371j98945K5029J11245J62479R7950N5267o9388o97
$$ 46764 -72304 -154321 -219692 -418637 -393608 -282363 -119884 -21934 33333 -36055 -36752
21901c6752N3099j3214N9801P9487R1748j48281j55497j34595J27445L0743j73474
$$ -36752 16347 3133 62934 142421 234169 85888 -69609 -204204 -76759 -46016 -219490
21890b19490R5041K90762J31678j19349q5207j58279j12152N9710J4854m358K02220
$$ -219490 -124449 166313 297991 178642 93435 -64844 -176996 -117286 -102432 -106790 95430
21879I5430k9756m8071O1493N2813O2097j19596p9249l833N2409r4302L6336J48503
$$ 95430 65674 17603 79096 131909 194006 74410 -4839 -8672 43737 -50565 -14229 134274
21867A34274J19806j29753k35969O1004M0184m7807j54836Q5217j2601O7762Q1040
$$ 134274 254080 124327 -111642 -50638 -10454 -58261 -213097 -127880 -140481 -72719 8321
21856H321j36980l7149n5799j38516Q3259j35094j74969K38299K85202J94983
$$ 8321 -128659 -165808 -221607 -360123 -276864 -411958 -586927 -348628 -63426 131557
21846A31557n9361N4943K4524j23478j38128p6396l3175o5757O1056J89269J28974
$$ 131557 72196 127139 151663 28185 -109943 -186339 -219514 -285271 -224215 -34946 94028
21835I4028j12840j26677J09269l9814K26201n5243k10659o8550l0850j7979P5496
$$ 94028 -18812 -145489 -36220 -76034 150167 94924 -115735 -184285 -215135 -233114 -157618
21824a57618J6837n2688o6035k0829K35636M3501k53102m3255n2176p8480J7597
$$ -157618 -140781 -193469 -259504 -280333 -44697 -1196 -254298 -297553 -349729 -428209 -410612
21813d10612J73050P9084N5620M5380j2312k444J01176j57587l3317J45097R5452
$$ -410612 -237562 -158478 -102858 -57478 -69790 -72234 28942 -128645 -161962 -16865 78587
21802G8587k7115n6727j01888J6465p5847q4352q5039j35707J17152J77572j5534
$$ 78587 51472 -5255 -107143 -90678 -166525 -250877 -335916 -471623 -354471 -176899 -192433
21791a92433n6654o1875K42055J63365j84492j50035O2398P3985n6629J21743
$$ -192433 -249087 -310962 -68907 94458 -90034 -240069 -177671 -103686 -160315 -38572
21781c8572J97780N3701o5856j80469L1439Q2611J15046n1132j19273j3223l6024
$$ -38572 159208 212909 147053 -33416 -1977 80634 195680 144548 25275 12052 -23972
21770b3972M3231m0129R094R639Q4806O2997j03050j18418j48325N0870J82297
$$ -23972 19259 -20870 -11776 -2137 82669 145666 42616 -75802 -224127 -173257 9040
21759I040J38469R6090O0878K1231j08740j84820j48309J03793P2664J48405j00679
$$ 9040 147509 243599 304477 325708 216968 32148 -116161 -12368 60296 208701 108022
21748A08022r5200K5203R2771R2736J34274j38055l25337P3208n836j48718j11626
$$ 108022 12822 38025 130796 223532 357806 219751 -105586 -32378 -38214 -186932 -298558
21737b98558Q5772M6918L8110Q7966K9770p0877J25093j6200J6436R8663l1169
$$ -298558 -212786 -165868 -127758 -39792 -10022 -80899 44194 27994 44430 143093 111924
21726A11924m1790l968p1234q2627J81429J58270o1875j87052j50485O9870J6632
$$ 111924 70134 66166 -5068 -87695 93734 252004 190129 3077 -147408 -77538 -60906
21715f0906N3227j0079o3687Q721L1062M0121j05070m1128K4802J12833O3578
$$ -60906 -7679 -17758 -81445 -72724 -41662 -1541 -106611 -147739 -122937 -10104 53474
21704E3474M5861j09444j42904N7239j2118j5490n7505m1272J12613j32021J819
$$ 53474 99335 -10109 -153013 -95774 -107892 -123382 -180887 -222159 -109546 -241567 -239748
21693b39748N7952J34361K3001k237P0811q9573o6979P5995Q5350r0556L8771
$$ -239748 -181796 -47435 -24434 -26671 44140 -45433 -112412 -36417 48933 -41623 -2852
21682b852p452o0972Q8545M4922r860j72191j16822K8932K62503P9894k3265L3460
$$ -2852 -10304 -71276 17269 62191 52331 -119860 -236682 -207750 54753 134647 111382 144842
21670A44842J445P3114j5257j24593r6759L895J20915L0080J11251j3716k10141
$$ 144842 146287 219401 204144 79551 -17208 -13313 107602 137682 248933 235217 25076
21659B5076j10946Q2082O7980j24338j26511j8403J23181L8113m273q696k6990
$$ 25076 -85870 -3788 64192 -60146 -186657 -205060 -81879 -43766 -48039 -56735 -83725
21648h3725j584O9464J9203l3263l2238l6513L1236j08072n7642M3348n4279P6027
$$ -83725 -85309 -15845 3358 -29905 -62143 -98656 -67420 -175492 -233134 -189786 -244065 -168038
21636a68038M4863Q4730P2332j06105M5888J14932L9614n0692j31623K8576J008
$$ -168038 -123175 -38445 33887 -72218 -26330 88602 128216 77524 -54099 -25523 -24515
21625b4515l6229r2439j62343p7312J62675J12463J8002L201Q0992m307M6305
$$ -24515 -60744 -153183 -315526 -392838 -230163 -117700 -99698 -96497 -15505 -19812 26493
21614B6493J95493P0632m7651N9049J9561q9414j44703O4722J31052j10688j6529
$$ 26493 221986 292618 244967 304016 323577 234163 89460 154182 285234 174546 158017
21603A58017N030p8024p5716L2220K4560r191J53994l278l3829M6076k23904j09438
$$ 158017 163047 85023 9307 41527 66087 56896 210890 207612 173783 219859 -4045 -113483
21591a13483N4568M2551p4464J3781J97721n8177k42257r0217K73180J86829m2191
$$ -113483 -58915 -16364 -90828 -77047 120674 62497 -179760 -269977 3203 190032 147841
21580A47841k9242n3729q5827J57095K3794K7081n6710m7292R674K1121J39018
$$ 147841 118599 64870 -20957 136138 159932 187013 130303 83011 92685 113806 252824
21569B52824j47522m7304m1520p7653j12522j88016P6442J49037O950N650Q4872
$$ 252824 105302 57998 16478 -61175 -173697 -361713 -285271 -136234 -129284 -123634 -38762
21558c8762l7055l08008j15856K9397m3603P3418j9700K35644J57678j13603q1272
$$ -38762 -75817 -383825 -499681 -470284 -513887 -440469 -460169 -224525 -66847 -180450 -261722
21547b61722n0777R869J48635Q3227M771L6750j03808j65346J4237J28341K9255
$$ -261722 -312499 -302630 -153995 -70768 -65997 -29247 -133055 -298401 -284164 -155823 -126568
21536a26568Q045Q2534J71630K6324j53509r8745j7004R5391K60689J0057l8094
$$ -126568 -118523 -35989 135641 161965 8456 -90289 -107293 -11902 248787 258844 220750
21525B20750k2400M8001K5955k64381l56451J07565K46662J12655Q6206J42840
$$ 220750 198350 246351 272306 7925 -348526 -240961 5701 118356 204562 347402
21515C47402J15918j95259k86709q1375N6569J22889N8207n4297J54688l6114
$$ 347402 463320 268061 -18648 -100023 -43454 79435 137642 83345 238033 201919
21505B01919j06167m3775K8865N0512L5764k10400k9318j09521K23524j5182l5602
$$ 201919 95752 51977 80842 131354 167118 -43282 -72600 -182121 41403 26221 -9381
21494i381r5513j70061J87323J81803j9357j34502j20606J2945k0671k0685J14144
$$ -9381 -104894 -274955 -87632 94171 74814 -59688 -180294 -167349 -188020 -208705 -94561
21483i4561P6508k6397K43640J73194M3254k6087L7658R2852k16762j70750j33961
$$ -94561 -18053 -44450 199190 372384 415638 389551 427209 520061 303299 132549 -1412
21472a412m6686k2990N5391k5027N0936l2244r8077J17895Q2739J19431N7944
$$ -1412 -48098 -71088 -15697 -40724 10212 -22032 -120109 -2214 80525 199956 257900
21461B57900J07279N6014j25401m0948n3405p3615j01058n2857J58885m8332m4731
$$ 257900 365179 421193 295792 254844 201439 127824 26766 -26091 132794 84462 39731
21450C9731R880J11170J3085J9197J53871L3858j41229O3623J13244j7303j6156
$$ 39731 49611 160781 173866 193063 346934 380792 239563 303186 416430 399127 382971
21439C82971p7809N8803J56999R2620J36333J46176J81261j08623k6033k4566
$$ 382971 305162 363965 520964 613584 749917 896093 1077354 968731 942698 918132
21429I18132q3306J5868j3774J40490J0154l9335R4980K2541j11472L3968P7689
$$ 918132 834826 850694 836920 977410 987564 948229 1043209 1065750 954278 988246 1065935
21418A065935M4696L6634q9445j12662j38632q148k59656k10598q2044K23603
$$ 1065935 1110631 1147265 1057820 945158 806526 798378 538722 328124 246080 469683
21408D69683q0197j36469j03140J64322j5555P0639k8645j77827r2526L9547L0826
$$ 469683 389486 253017 149877 314199 298644 369283 340638 162811 70285 109832 140658
21397A40658O3983J27465q9572o2112L7737N6496k1440m7859k2350L1419j332
$$ 140658 204641 332106 242534 180422 218159 274655 253215 205356 183006 214425 213093
21386B13093j58684q4126Q0138J26787J41383J16172M7857M0178j92408j87036
$$ 213093 54409 -29717 50421 177208 318591 434763 482620 522798 330390 143354
21376A43354j48879p2312K8917L6739O9499J92131J33778j48453q9582M1906j43294
$$ 143354 -5525 -77837 -48920 -12181 57318 249449 383227 234774 145192 187098 43804
21365D3804k26917q324p4603l2092J19711J37638O4134j33582j26235J08066j87
$$ 43804 -183113 -191437 -266040 -298132 -178421 -40783 23351 -110231 -236466 -128400 -128587
21354a28587o0874J99965Q2761p5424r6460l5260k4786O2018K56427J58183j38084
$$ -128587 -189461 10504 93265 17841 -78619 -113879 -138665 -76647 179780 337963 199879
21343A99879m1523p0221m9232p8403J0401N3392m2650J10496J6355n18r0863K3886
$$ 199879 158356 88135 38903 -39500 -29099 24293 -18357 92139 108494 107976 17113 40999
21331D0999J15840M8244N9461r0075k25227n5010J75888Q4718k44589j85053N4210
$$ 40999 156839 205083 264544 174469 -50758 -105768 70120 154838 -89751 -274804 -220594
21320b20594O9818L1218p526l3389j57766J1206J46383P4802J37631k0942j78556
$$ -220594 -150776 -119558 -127084 -160473 -318239 -307033 -160650 -85848 51783 30841 -147715
21309a47715K1039o65L1779k4036k6951P516J07459N1778k65661k03692J45065
$$ -147715 -126676 -127341 -95562 -119598 -146549 -139033 -31574 20204 -245457 -449149 -304084
21298c04084L21183P3618m924J58163J06931k3552p254j0177L5076L5871k29045
$$ -304084 17099 90717 85793 243956 350887 327335 320081 309904 344980 380851 151806
21287A51806L2496j54628k02535k03366Q8057J75989J18365N0837M987o9586r072
$$ 151806 184302 29674 -172861 -376227 -288170 -112181 6184 57021 62008 -7578 -16650
21276a6650J302M6540j89626p5798J50068K49670j30554m0358O1486l1757R8710
$$ -16650 -15348 31192 -158434 -234232 -84164 165506 34952 -5406 56080 24323 123033
21265A23033O3042r2042j32431j2097n9673M7634n1877L62K5999q5819o9899J55353
$$ 123033 186075 94033 -38398 -50495 -110168 -62534 -114411 -114049 -88050 -173869 -243768 -88415
21253h8415l913P6707J30412k3845j34938p6187M411j6292R56n779K8502J19695
$$ -88415 -92328 -15621 114791 90946 -43992 -120179 -115768 -132060 -131104 -136883 -108381 11314
21241A1314j2015J32492k955J46981J35191L8771j92232k09397l8035J02650k2446
$$ 11314 -701 131791 128836 275817 411008 449779 257547 48150 10115 112765 90319
21230I0319j11062O9476j60376r9127Q4623R2346j29768j02564N305l280R2995
$$ 90319 -20743 48733 -111643 -210770 -126147 -33801 -163569 -266133 -260828 -264108 -171113
21219a71113R7731k38968p5460O7800M4067K3553J30881J06432j8396J5848M3302
$$ -171113 -73382 -312350 -387810 -320010 -275943 -252390 -121509 -15077 -33473 -17625 25677
21208B5677r3353J9912L9325n1944o5526o0953n468M8002J52505p5666n2211Q8723
$$ 25677 -67676 -47764 -8439 -60383 -125909 -186862 -192330 -144328 8177 -67489 -119700 -30977
21196c0977N6917L1209J35612J7262j37508n3157M0405o5286n3460J8979J1367
$$ -30977 25940 57149 192761 210023 72515 19358 59763 -5523 -58983 -40004 -28637
21185b8637o1972R9K6998O8775J48541R9454Q0918j14643O4076M2351K9599j42668
$$ -28637 -90609 -90510 -63512 5263 153804 253258 334176 219533 283609 325960 355559 212891
21173B12891j23776P01j1761k73945j09125J31931K31610J00111M5004j51087
$$ 212891 89115 89816 78055 -195890 -305015 -173084 58526 158637 203641 52554
21163E2554p5193M996M8033K4216j3094r356m8233p0022J35972K0561k00018n5318
$$ 52554 -22639 -17643 30390 54606 41512 32156 -16077 -86099 49873 70434 -129584 -184902
21151a84902R873R6501L0461j41276J00810l1566j44J24114K42531j64249k31842
$$ -184902 -175029 -78528 -48067 -189343 -88533 -120099 -120243 3871 246402 82153 -149689
21140a49689j03155R2725j2904Q35o1657J88600J17292j79241R0542J10461J8604
$$ -149689 -252844 -160119 -173023 -172188 -233845 -45245 72047 -107194 -16652 93809 112413
21129A12413j51075Q1008Q7822O6757L0446J05843J4260l7183p1589l4024q8475
$$ 112413 -38662 42346 130168 196925 227371 333214 347474 310291 238702 204678 116203
21118A16203p662o3488n9218J41664M7028J51916n2678j14365j79398M1289p489
$$ 116203 108541 45053 -14165 127499 174527 326443 273765 159400 -19998 21291 13802
21107A3802J5959K82443J23644j74819k32237j18101J87293R4838M3796J9504
$$ 13802 29761 312204 435848 261029 28792 -89309 97984 192822 236618 256122
21097B56122m2281P2839j26716K1898J6458j27663r4841l2790l6553K13491K00713
$$ 256122 213841 286680 159964 181862 198320 70657 -24184 -56974 -93527 119964 320677
21086C20677j30317q4224p7428j22393n8912N7941J53552J25492p3921j0685n2458
$$ 320677 190360 106136 28708 -93685 -152597 -94656 58896 184388 110467 99782 47324
21075D7324j9709J19650j8633J20131K7891j59209p4846J22131J00783j46971
$$ 47324 27615 147265 128632 248763 276654 117445 42599 164730 265513 118542
21065A18542j54598J05474p1882o7850j27839o6831N6432K43920J07964m1476
$$ 118542 -36056 69418 -2464 -70314 -198153 -264984 -208552 35368 143332 101856
21055A01856r0782j81837o9052M2348R2113Q184J22031M6204J04670J2224k3873
$$ 101856 11074 -170763 -239815 -197467 -105354 -97170 24861 71065 175735 187959 164086
21044A64086Q4626q7756q8940K093l3866J13428r972q4381k8467n0848k2892M5288
$$ 164086 248712 160956 72016 74109 40243 153671 143699 59318 30851 -19997 -42889 2399
21032B399J30433M1599p8213O4138K18367N1303r6487L5717k11439p5513O7933
$$ 2399 132832 174431 96218 160356 378723 430026 333539 369256 157817 82304 150237
21021A50237P9002m6548M2399P4581J2779j22477j68918J24616K8244k23123o3394
$$ 150237 229239 182691 225090 299671 312450 189973 21055 145671 173915 -49208 -112602
21010a12602O0383R7394L50J17397K3174p9057k0842K62L3434J6078j59681M2078
$$ -112602 -52219 45175 45525 162922 186096 107039 86197 86459 119893 135971 -23710 18368
20998A8368J3986N6258l2500r7179p154L577J48277P1340L7100p8647j6961J1120
$$ 18368 32354 88612 56112 -41067 -48221 -44644 103633 174973 212073 133426 116465 127585
20986A27585O6322n6209r7278k0795J10336O0857p771J36942P6236J5030j60137
$$ 127585 193907 137698 40420 19625 129961 190818 183047 319989 396225 411255 251118
20975B51118j62746K4245J10507L8516K14214J21949k7680q5482k3915L9245j27706
$$ 251118 88372 112617 223124 261640 475854 597803 570123 484641 460726 499971 372265
20964C72265k23885K1415K95718K10971n7357j43906j56539K2520O3652l4606
$$ 372265 148380 169795 465513 676484 619127 475221 318682 341202 404854 370248
20954C70248Q350j41426o4813J62141J16768l0259p0584j66731m2485K14597J11659
$$ 370248 378598 237172 172359 334500 451268 421009 350425 183694 141209 355806 467465
20943D67465o3458J24956k70095q5658J40590M9221m4199R0886K3505n7069q4163
$$ 467465 404007 528963 258868 173210 313800 363021 318822 409708 433213 376144 291981
20932B91981J05899Q5325j346l317p319P1779o121J99394K8209p7989p2998j26244
$$ 291981 397880 483205 481859 478542 471223 543002 536881 736275 764484 686495 613497 487253
20920D87253O0657J57047Q66j21938J620J17280Q6794P078M6032K2692J30007
$$ 487253 547910 704957 705823 583885 585505 702785 789579 796657 842689 865381 995388
20909I95388K8896j43916L0678J29054J79082M9459p6616M6752n374L2616J83531
$$ 995388 1024284 880368 911046 1040100 1219182 1268641 1192025 1238777 1233403 1266019 1449550
20898A449550K03553K10074K57286K27505J41678K67466P3280R6894K0462J54064
$$ 1449550 1653103 1863177 2120463 2347968 2489646 2757112 2830392 2927286 2947748 3101812
20888C101812K74392Q9125L64075L29875J09362Q6739K31927N69683L63684L64114
$$ 3101812 3376204 3465329 3829404 4159279 4268641 4355380 4587307 5156990 5520674 5884788
20878E884788N74955M08115N89463R22722J177657J122884J179460J769746K121114
$$ 5884788 6459743 6867858 7457321 8380043 9557700 10680584 11860044 13629790 15750904
20869A5750904K797243M084027N498581O443421O582367O567096P439382J0291870
$$ 15750904 18548147 22632174 28130755 34574176 41156543 47723639 55163021 65454891
20861F5454891J4055253J4875860J0280670M845809M196881Q578356J3402292
$$ 65454891 79510144 94386004 104666674 109512483 113709364 122287720 135690012
20854A35690012J1598235K779885k877608k476158J208424L678679J676682n23771
$$ 135690012 147288247 150068132 147190524 144714366 145922790 149601469 151278151 150754380
20846A50754380R19064K327504m92904l858940l819143P34717N362075K585574
$$ 150754380 151673444 154000948 153508044 149649104 145829961 146564678 151926753 154512327
20838A54512327o796256j2506285j1827451p252156m434432p765687j2635741
$$ 154512327 147716071 135209786 123382335 116130179 111695747 103930060 91294319
20831I1294319j4097393j2489815r453589p609972p175157o942259n888787m802119
$$ 91294319 77196926 64707111 55253522 47643550 40468393 33526134 27637347 22835228
20823B2835228l716918k811765k120465j658533j258137r77463q25573o25301
$$ 22835228 19118310 16306545 14186080 12527547 11269410 10291947 9466374 8841073
20815H841073p13234p55943n65616m57411k94667m44255l51340m44412m86486
$$ 8841073 8127839 7371896 6806280 6348869 6054202 5609947 5258607 4814195 4327709
20806D327709j66805o2286k34734l01550k53710j54347j44427o9717k49083k35405
$$ 4327709 4160904 4098618 3863884 3562334 3308624 3154277 3009850 2940133 2691050 2455645
20796B455645k25319k17461q8147J6619o3498k91763l26805L0547R4064r1073
$$ 2455645 2230326 2012865 1924718 1941337 1877839 1586076 1259271 1289818 1383882 1292809
20786A292809j8603j58635j14147p4427j0521j35325n244n4492K0965R3505l3742
$$ 1292809 1274206 1115571 1001424 926997 916476 781151 775907 721415 742380 835885 802143
20775H02143M3730l065p4781J42648O4781k9234o9656j80052j06879p4173P073
$$ 802143 845873 842808 768027 910675 975456 946222 876566 696514 589635 515462 522535
20764E22535q9638K8701k2709k0460o6532r242P2038J86331l0486j22685J64931
$$ 522535 432897 461598 438889 418429 351897 342655 414693 601024 570538 447853 612784
20753F12784j0886k2109j47620j99738R0947Q0931J1491J53036o0243J6906Q9470
$$ 612784 601898 579789 432169 232431 323378 404309 415800 568836 508593 525499 614969
20742F14969O0515j27021j5036J32920R8707j59946k62348p6106L162j9231n6304
$$ 614969 675484 548463 533427 666347 765054 605108 342760 266654 269816 250585 194281
20731A94281J02283J62242o0027k134j7568K1828r6196j6861O9013r3930j62956
$$ 194281 296564 458806 398779 396645 379077 400905 304709 287848 356861 262931 99975
20720I9975K7567J00457J47399P7304n0964j79418o2610j1522m9130J52061J57458
$$ 99975 127542 227999 375398 452702 401738 222320 159710 148188 99058 251119 408577
20709D08577m1590j39852O7066L7508j95614j8893J23632o6653n8180O1046O9250
$$ 408577 366987 227135 294201 331709 136095 117202 240834 174181 116001 177047 246297
20698B46297R5013K4160O5622k27789N0473K30450j17069j91409j08932q71J47561
$$ 246297 341310 365470 431092 203303 253776 484226 367157 175748 66816 65945 213506
20687B13506J91756L5707j92053m1135L9530k7123j40831M8501j1356j67548j68879
$$ 213506 405262 440969 248916 207781 247311 220188 79357 127858 116502 -51046 -219925
20676b19925q8186J06319R0735l5264J20928N9335K9796j12549J0215m2690q9923
$$ -219925 -308111 -201792 -111057 -146321 -25393 33942 63738 -48811 -38596 -81286 -171209
20665a71209k01864k3772K4664J02349J29966Q2683R3825l9j10307k5303m576
$$ -171209 -373073 -396845 -372181 -269832 -139866 -57183 36642 36603 -73704 -99007 -103583
20654a03583L04747K85459k2695m6262j72852m3768K0368j23901J43590L1857
$$ -103583 201164 486623 463928 417666 244814 201046 221414 97513 241103 272960
20644B72960j1934m85p5968P08J602N202j78342j16165K5887K04990R6730J83373
$$ 272960 261026 260541 184573 185281 186883 192085 13743 -102422 -76535 128455 225185 408558
20632D08558j80752k46152M4702K68056J28441k15085j94442n1774j9403K02717
$$ 408558 227806 -18346 26356 294412 422853 207768 13326 -38448 -57851 144866
20622A44866O5448r5158l4491N3986j5130l6576J9010P1864J26287N1034L8172
$$ 144866 210314 115156 80665 134651 119521 82945 101955 173819 300106 351140 389312
20611C89312k85927k72447K6015Q2879J06667L0788n3975R2156o0457l7367O3626
$$ 389312 103385 -169062 -143047 -60168 46499 77287 23312 115468 55011 17644 81270
20600H1270J12481M5343o8465q6794N9317Q2622j09169q2333J64630K8359L0344
$$ 81270 193751 239094 170629 83835 143152 225774 116605 34272 198902 227261 257605
20589B57605k3591m360l4548K202o1763O6056l0553P7419q518O177R177J1669
$$ 257605 234014 229654 195106 197308 135545 201601 171048 248467 239949 246126 255303 266972
20577B66972j9239o0685k70071O2856K7938J0885J75660J71743l6917R140j16061
$$ 266972 247733 187048 -83023 -20167 7771 18656 194316 366059 329142 338282 222221
20566B22221j93404l2343R8893Q3095o890l0580R374K6088N5153n493j30991M7677
$$ 222221 28817 -3526 95367 178462 171572 140992 150366 176454 231607 226114 95123 142800
20554A42800P4135o3259k19604p0954P0771j28973r4473q8870J09112J95691M7953
$$ 142800 216935 153676 -65928 -136882 -66111 -195084 -289557 -378427 -269315 -73624 -25671
20543b5671q3538k2827N6035M7941o2341Q3437k0822j17933L9057J52129l2638
$$ -25671 -109209 -132036 -76001 -28060 -90401 -6964 -27786 -145719 -106662 45467 12829
20532A2829L1480Q3421J1205j3091j97736J9574L5529q9810K7589n0510P9502
$$ 12829 44309 127730 138935 125844 -71892 -52318 -16789 -106599 -79010 -129520 -50018
20521e0018K0240K6271m7021O6082N8253l4653j27238J8030J7218J53898M9590
$$ -50018 -29778 -3507 -50528 15554 73807 39154 -88084 -70054 -52836 101062 150652
20510A50652j96355p1246O5793p5611j32285J30946J08906J36072Q3290K7077
$$ 150652 -45703 -116949 -51156 -126767 -259052 -128106 -19200 116872 200162 227239
20500B27239j8011J6919k5795Q689r4389r082J02687n0521j41031l0274N2139
$$ 227239 209228 226147 200352 209041 114652 105570 208257 157736 16705 -13569 38570
20489C8570L3247R8934Q9145j88217j89137n1331j09827K6388J72536J09564o8558
$$ 38570 71817 170751 259896 71679 -117458 -168789 -278616 -252228 -79692 29872 -38686
20478c8686q1212r2340J47520J18889J0076m8056n3498P6882k1774j7002L4039
$$ -38686 -119898 -212238 -64718 54171 64247 16191 -37307 39575 17801 799 34838
20467C4838J06401K6882k56416j13964j2629J663P061M4307Q6053k2459J4454
$$ 34838 141239 168121 -88295 -202259 -214888 -213225 -206164 -161857 -75804 -98263 -83809
20456h3809N5521p0057j58043m4200J76545R1020J23750J51446l8690j7963n5418
$$ -83809 -28288 -98345 -256388 -300588 -124043 -33023 90727 242173 203483 185520 130102
20445A30102p0593q4399N4467L0912k3704j25805j82j08406m4231J00692L0527
$$ 130102 59509 -24890 29577 60489 36785 -89020 -89202 -197608 -241839 -141147 -110620
20434a10620j19391M4537Q2683Q2359j20610r6775J4764J32662J34066m4041Q5051
$$ -110620 -230011 -185474 -102791 -20432 -141042 -237817 -223053 -90391 43675 -366 84685
20423H4685N8711J72604J43494k9620k37532j71726K751K6248n1418q9434o0185
$$ 84685 143396 316000 459494 429874 192342 20616 23367 49615 -1803 -91237 -151422
20412a51422R87J56761r791r1668K47135J8559j50110r3852L7020J0828L1644
$$ -151422 -150435 6326 -3465 -95133 152002 170561 20451 -73401 -36381 -25553 6091
20401F091J26495O8044j4346N3925q392j544j08609j77764p5269l6611Q5440J1357
$$ 6091 132586 200630 186284 240209 231817 230273 121664 -56100 -131369 -167980 -82540 -71183
20389g1183K3347N5311l2999N6379j00927k62952J39464K70993j6958l6370O2165
$$ -71183 -47836 7475 -25524 30855 -70072 -333024 -193560 77433 60475 24105 86270
20378H6270o2605M1072j00140O1422Q021L7321j56866j88477J50250Q9971L6956
$$ 86270 23665 64737 -35403 26019 34040 71361 -85505 -273982 -123732 -33761 3195
20367C195J184O5828m9860J31571J09388j12033j09340j25806m2785n3537L5563
$$ 3195 4379 70207 20347 151918 261306 149273 39933 -85873 -128658 -182195 -146632
20356a46632Q3096K7919R5836K8945j23311Q7927j00760j06612J27720Q1722j76564
$$ -146632 -63536 -35617 60219 89164 -34147 53780 -46980 -153592 -25872 55850 -120714
20345a20714q1692J64823J7046j5876J06134N5956q1881J81641K07152n9036l58336
$$ -120714 -202406 -37583 -20537 -36413 69721 125677 43796 225437 432589 373553 15217
20334A5217q3108n5117N4269n8640M9410o1850m1195N3254r8266o6695K05385
$$ 15217 -67891 -123008 -68739 -127379 -77969 -139819 -181014 -127760 -226026 -292721 -87336
20323h7336J43878Q2942j18j02918k1168R5004k5525j8788o2635j5239M6097o0409
$$ -87336 56542 139484 139366 36448 15280 110284 84759 65971 3336 -11903 34194 -26215
20311b6215j0991j5185q1145L8631N3576M2205j9745Q4287j28875N8220N7441
$$ -26215 -37206 -52391 -133536 -94905 -41329 876 -18869 65418 -63457 -5237 52204
20300E2204P0052j08841j7256J07925Q4099j4672k989q0124l3412K1796l3507
$$ 52204 122256 13415 -3841 104084 188183 173511 170522 90398 56986 78782 45275
20289D5275j2185Q5814l9151k476K18366J35094k2402j35876k6580Q009J6835
$$ 45275 33090 118904 79753 77277 295643 430737 408335 272459 245879 253888 270723
20278B70723J89670J83858l2843J3762k2212k3545J07757P6452R7017N6897J60229
$$ 270723 460393 644251 611408 625170 602958 579413 687170 763622 860639 917536 1077765
20267A077765O0281J911j83305n0518R2919m3993j20211j05651K02345J53390
$$ 1077765 1138046 1139957 956652 906134 999053 955060 834849 729198 931543 1084933
20257A084933K0180R8465m602p683q4005j21511k21149j01236r6870p8050k9351
$$ 1084933 1105113 1203578 1198976 1191293 1107288 985777 764628 663392 566522 488472 459121
20246D59121J48818J03564P2342j51320j65905l3336j88965j12425N8340N673
$$ 459121 607939 711503 783845 632525 466620 433284 244319 131894 190234 195907
20236A95907n5160j08501O6449J28277J06424p6983m4075J7423M017J8680J33870
$$ 195907 140747 32246 98695 226972 333396 256413 212338 229761 233778 252458 386328
20225C86328q8810L2308j2390j0951j6986j19413N4735q2784q6879J118M0881
$$ 386328 297518 329826 317436 306485 289499 170086 224821 142037 55158 56276 97157
20214I7157J25338l0151J4444J2823p5737j04601l8929K7708j34350j75973K77041
$$ 97157 222495 192344 206788 219611 143874 39273 344 28052 -106298 -282271 -5230
20203e230K87948l2568M04k19437j74111L1168J01741p781j13433J56584K0740
$$ -5230 282718 250150 250554 31117 -142994 -111826 -10085 -17866 -131299 25285 46025
20192D6025J18309K069p5097j77315L581Q6556L1891j05701J03075J01316K7615
$$ 46025 164334 166403 91306 -86009 -82428 4128 36019 -69682 33393 134709 162324
20181A62324p506K46371o6262k8380P1602p3105M215r488l9309N2916r1207j40508
$$ 162324 154818 401189 334927 306547 378149 305044 309259 299771 260462 313378 222171 81663
20169H1663j47341m644J10387N0354L2916N1341q131q8948j74778P9693J42396
$$ 81663 -65678 -70322 40065 90419 123335 174676 166545 77597 -97181 -17488 124908
20158A24908R0762L1956j5860r4772j25519J4566o4776j057Q261J84811j04302
$$ 124908 215670 247626 231766 136994 11475 26041 -38735 -39792 -31531 153280 48978
20147D8978m2397j5915j26484Q1681L2881L1012P2629N4106N4701k0769k1898
$$ 48978 6581 -9334 -135818 -54137 -21256 9756 82385 136491 191192 170423 148525
20136A48525k9232mL8151j9326j66920M9493o0694j78916J21655K96752N3627
$$ 148525 119293 119289 157440 138114 -28806 20687 -40007 -218923 -97268 199484 253111
20125B53111j43806J19896M4459r2349o2932L6367L1689J8409r615O3483K29305
$$ 253111 109305 229201 273660 181311 118379 154746 186435 204844 195229 258712 488017
20114D88017j39935r1763p0965L2413L8583r561J15593m2902M4199j3679J94870
$$ 488017 348082 256319 185354 217767 256350 246789 362382 319480 363679 350000 544870
20103E44870L68704L17994K3067N0059j14899j65810n2798j69790k53727k23454
$$ 544870 913574 1231568 1254635 1304694 1189795 1023985 971187 801397 547670 324216
20093C24216j6434J86070K75806K94155K39093M8803J9931r9311j33690k10486
$$ 324216 307782 493852 769658 1063813 1302906 1351709 1371640 1272329 1138639 928153
20083I28153K7671o2524q2382j14041k58574k72110j24413N5389n449J8516j09158
$$ 928153 955824 893300 810918 696877 438303 166193 41780 97169 91720 110236 1078
20072A078o5210P9415L0612M8843O7854o1082J13637K84376Q5454j17920j90069
$$ 1078 -64132 15283 45895 94738 162592 101510 215147 499523 584977 467057 276988
20061B76988j48915m0958K09716K09008M7560P6658j28943j30783m9685j64800
$$ 276988 128073 87115 296831 505839 553399 630057 501114 370331 320646 155846
20051A55846j19878M9078K85704L02000K09480K92746M13956J34108k43003k08245
$$ 155846 35968 85046 370750 672750 882230 1174976 1588932 1723040 1480037 1271792
20041A271792j13059p588J19263n4934j09405q5070n7341K5716O8428M9126k47840
$$ 1271792 1158733 1151145 1270408 1215474 1106069 1020999 963658 989374 1057802 1106928 859088
20030H59088j94297J5291n8026q6136o0551l2813p8759O6788j47648p5961L0472
$$ 859088 664791 680082 622056 535920 475369 442556 363797 430585 282937 206976 237448
20019B37448o1607j62684P5850l631J1367k602L1973J83607J21094k9441q4347
$$ 237448 175841 13157 89007 85376 96743 94141 126114 309721 430815 401374 317027
20008C17027k40655l0976N1016n8297N1864j09527N253Q879o4594J20438Q9767
$$ 317027 76372 45396 96412 38115 89979 -19548 -14295 -5416 -70010 50428 140195
19997A40195m9629J01411l052r1598j18738k3856K19465J30655j4707m0687q037
$$ 140195 90566 191977 188925 97327 -21411 -45267 174198 304853 290146 249459 241422
19986B41422j91812j5815P7773m4094p6832J6535K32826q05k37364r3865R7869
$$ 241422 49610 33795 111568 67474 -9358 7177 240003 239198 1834 -92031 5838
19975E838M7215J73517R1257j1854n0697m4648O2881K1085j72126Q1346J32262
$$ 5838 53053 226570 317827 305973 255276 210628 273509 294594 122468 203814 336076
19964C36076j57331K9759k3667J43668J42418j7967L2411M260j00563o5813k33387
$$ 336076 178745 208504 184837 328505 470923 452956 485367 489627 389064 323251 89864
19953H9864k19995l6554R4363n8382M8277J86679J4573j20521j0077J19750M8907
$$ 89864 -130131 -166685 -72322 -130704 -82427 104252 118825 -1696 -11773 107977 156884
19942A56884j23870Q4963J71956j95361j10327L9582J56542R0102O2356l6216
$$ 156884 33014 117977 289933 94572 -15755 23827 180369 270471 332827 296611
19932B96611r971J35270J55050k5279r4342r9500o3510J7620K05635J17329L205
$$ 296611 286640 421910 576960 551681 457339 357839 294329 311949 517584 634913 638118
19921F38118k25243j15773m9378L0234k7639J10376L7132L7111o9132L7319l723
$$ 638118 412875 297102 247724 277958 250319 360695 397827 434938 365806 403125 399402
19910C99402q9003m0904o9555j26244J67394Q1604n0547r2077j58307j14905r95
$$ 399402 310399 269495 199940 73696 241090 322694 272147 180070 21763 -93142 -94137
19899i4137J36002P4995m7208M6489J65545j4831k07800k39487o4216R9522J92236
$$ -94137 41865 116860 69652 116141 281686 266855 59055 -180432 -244648 -145126 47110
19888D7110K458j68103p8120K63011J20485J45440j10199j18782J15195P2970
$$ 47110 49568 -118535 -196655 66356 186841 332281 222082 103300 218495 291465
19878B91465R6174n3432Q1530P0550m9225n0009J3406l0126q9489J29851j3976
$$ 291465 387639 334207 415737 486287 437062 387053 400459 370333 280844 410695 396719
19867C96719m1721q108l7357j63184J16378Q2943Q1652J5635J70772k0307O5P458
$$ 396719 354998 346890 309533 146349 262727 345670 427322 442957 613729 593422 593487 600945
19855F00945j74939m3486J13120l9546j61588q7186j92247k5321J12622J51362
$$ 600945 426006 382520 495640 456094 294506 207320 15073 -10248 102374 253736
19845B53736N8488j58020o9353p3082M6292Q8001J3640p4390n5448m516J2093
$$ 253736 312224 154204 84851 11769 58061 146062 159702 85312 29864 25348 37441
19834C7441M9505K07682L2539n6896o0648R9514J8062m2570k7858q2183n3890
$$ 37441 86946 294628 327167 270271 209623 309137 327199 284629 256771 174588 120698
19823A20698J3343j76630j26450K19688N565J51699K5049p679n7694o1356n2386
$$ 120698 134041 -42589 -169039 50649 56214 207913 232962 225283 167589 106233 53847
19812E3847j14344L2688m70Q991J12002j55776Q7023O6300K5752l8174R0135J52026
$$ 53847 -60497 -27809 -28279 -19288 92714 -63062 23961 90261 116013 77839 167974 320000
19800C20000J04719j13513K8731j805j26333o8987J3052J26576p6808J7430j665
$$ 320000 424719 311206 339937 338132 211799 142812 155864 282440 205632 223062 221397
19789B21397j02166r402P7132J6380M6701k4136k1752K76036K25667l7473k43456
$$ 221397 119231 109829 186961 203341 250042 225906 204154 480190 705857 668384 424928
19778D24928m3789J08875J98945j36599j10559j03273M8519j15328n4836o503
$$ 424928 381139 490014 688959 552360 441801 338528 387047 271719 216883 210380
19768B10380q533j68250J152n8057K9594o6311j97185P1622K26948K16137p8887
$$ 210380 201847 33597 34749 -23308 6286 -60025 -257210 -185588 41360 257497 178610
19757A78610q0603J2099r1639J9263J00115j1899L2339P1430o1637Q1563M7436
$$ 178610 98007 110106 18467 37730 137845 125946 158285 229715 168078 249641 297077
19746B97077M8992K4650N6395Q4415K18014j34417j22586j47890m9344l6233n6561
$$ 297077 346069 370719 427114 511529 729543 595126 472540 324650 275306 239073 182512
19735A82512l4390o1827j34286J8600J30938K20645J15388k90490k09294O8529
$$ 182512 148122 86295 -47991 -29391 101547 322192 437580 147090 -62204 6325
19725F325J54810J61314J57728j33149j37399j42858J021J40062K048Q0735M8405
$$ 6325 161135 322449 480177 347028 209629 66771 67792 207854 209902 290637 339042
19714C39042J67138j01248K424l3389j34195l338M9988J97868j13682M2246R8345
$$ 339042 506180 404932 407356 373967 239772 236434 286422 484290 370608 412854 511199
19703E11199J8041l473j21875O4929J36919J00963k570m9659L6162p6100j68859
$$ 511199 529240 525767 403892 468821 605740 706703 704133 654474 690636 614536 445677
19692D45677Q1801N8544j08174q0739J29365o096j46319n4675J08018M4101q4415
$$ 445677 527478 586022 477848 397109 526474 520378 374059 319384 427402 471503 387088
19681C87088j37011n1503J15490R2270K3741J14928K79946K26293L7455Q3618
$$ 387088 250077 198574 314064 406334 430075 545003 824949 1051242 1088697 1172315
19671A172315O2507J85295N8615n0905k00746p4713r6237j9691M7002J5374J32809
$$ 1172315 1234822 1420117 1478732 1427827 1227081 1152368 1056131 1036440 1083442 1098816 1231625
19660A231625p2633n5536J36717n4034J1009j06132o4696J72135J72046j5365
$$ 1231625 1158992 1103456 1240173 1186139 1197148 1091016 1026320 1198455 1370501 1355136
19650A355136q2653j85057q6294j73292M4373J50512J72149q4433j82261O5725
$$ 1355136 1272483 1087426 1001132 827840 872213 1022725 1194874 1110441 928180 993905
19640I93905J62155J62461o9200j51522j1908K66710J35302R3380m870j5498o9627
$$ 993905 1156060 1318521 1249321 1097799 1085891 1352601 1487903 1581283 1576413 1560915 1491288
19629A491288j8196o1626J09543L32460K9843L2537J58676K53416K76184J62207
$$ 1491288 1473092 1411466 1521009 1853469 1883312 1915849 2074525 2327941 2604125 2766332
19619B766332P6316K61403K37740Q6085K90354k4594m5488K99804L59589M99641
$$ 2766332 2842648 3104051 3341791 3427876 3718230 3693636 3648148 3947952 4307541 4807182
19609D807182P48936O30756K93919K36688L72376K41829J39742K13896N11515
$$ 4807182 5556118 6186874 6480793 6717481 7089857 7331686 7471428 7685324 8196839
19600H196839N05134Q55675J069669J595196K417124K876040M020960N827138
$$ 8196839 8701973 9557648 10627317 12222513 14639637 17515677 21536637 27363775
19592B7363775P985659J0386890R235485L327010j635804j674792J763191P853016
$$ 27363775 35349434 45736324 54971809 58298819 56663015 54988223 56751414 64604430
19584F4604430J5369737K5567747M2588524O7360489Q1353389M8830989q290299
$$ 64604430 79974167 105541914 148130438 215490927 296844316 345675305 337385006
19577C37385006k9898183k7396022k9236496m0395823m3804568l6763018k3057773
$$ 337385006 307486823 280090801 250854305 210458482 166653914 129890896 106833123
19570A06833123q598966L991271J3237984J2489807k105938j7708540k3333948
$$ 106833123 98234157 102225428 115463412 127953219 125847281 108138741 84804793
19563H4804793k1396849j5809447j0369897o599692m307555k719167j648270r63268
$$ 84804793 63407944 47598497 37228600 30628908 26321353 23602186 21953916 20990648
19555B0990648n75729l70366q6842J1751J87159J06919l5213J95562R00117J395217
$$ 20990648 20414919 20044553 19957711 19969462 20156621 20263540 20228327 20423889 21324006 22719223
19545B2719223K104446L016364M064564N930398Q592874J2936504K0025368K6466652
$$ 22719223 24823669 27840033 31904597 37834995 46427869 59364373 79389741 105856393
19537A05856393K4053072P649124q629881j3547753r029826R15907J3486054K9406811
$$ 105856393 129909465 137558589 128928708 115380955 106351129 107267036 120753090 150159901
19529A50159901M8696796O0975488N1918682L9462023M6528536L7564566k2224636
$$ 150159901 198856697 259832185 311750867 351212890 397741426 435305992 413081356
19522D13081356p7811358q9734718p4932878m8797073k7494676j3995029m555236
$$ 413081356 335269998 245535280 170602402 121805329 94310653 80315624 75760388
19515G5760388K170072M359420j763387j0079730j3709831j3087914r948181o771254
$$ 75760388 77930460 82289880 80526493 70446763 56736932 43649018 33700837 26929583
19507B6929583m681368l209462k325491j793021j266863j082525j114295p59196
$$ 26929583 22248215 19038753 16713262 14920241 13653378 12570853 11456558 10697362
19499A0697362n52200l84411m41197n21088o22914q71858q55311p96278n85801
$$ 10697362 10145162 9760751 9319554 8798466 8175552 7303694 6448383 5652105 5066304
19490E066304l90379l78720k25131j69296j29632k01368k01320j46693j43706
$$ 5066304 4675925 4297205 4072074 3902778 3773146 3571778 3370458 3223765 3080059
19481C080059j31635j56129j26076j01910j24711j63820p5120O0198K1065j92121
$$ 3080059 2948424 2792295 2666219 2564309 2439598 2275778 2200658 2260856 2281921 2089800
19471B089800N4948Q6653m0874p6019p1015j47989k9394M9754K9443m3655j44202
$$ 2089800 2144748 2231401 2190527 2114508 2043493 1895504 1866110 1915864 1945307 1901652 1757450
19460A757450r5964Q1096L564m9065l0707l5850K7967Q4440k08416l45505R832
$$ 1757450 1661486 1742582 1746146 1697081 1666374 1630524 1658491 1742931 1534515 1189010 1198842
19449A198842J00300Q7275j12178J7787L9032o5777k3620J10859J14710K1483
$$ 1198842 1299142 1386417 1274239 1292026 1331058 1265281 1241661 1352520 1467230 1488713
19439A488713J26937J00000M0755P3Q2962O3913L42653J82042P2355L09102L38855
$$ 1488713 1615650 1715650 1756405 1756478 1839440 1903353 2246006 2428048 2500403 2809505 3148360
19428C148360J51935J85095K85578L46618K88706J63910P2801L61560N65910O83194
$$ 3148360 3300295 3485390 3770968 4117586 4406292 4570202 4643003 5004563 5570473 6253667
19418F253667Q51526J175783J846652K635709M004990N474214O616464O347857
$$ 6253667 7105193 8280976 10127628 12763337 16768327 22242541 28859005 35206862
19410C5206862N935288P748349J0467255R097187K505896m75858R99167K428511
$$ 35206862 41142150 48890499 59357754 68454941 70960837 70484979 71484146 73912657
19402G3912657j550121o092405o174834l953602j106056L00419m7503O09502L707047
$$ 73912657 72362536 66270131 60095297 56141695 55035639 55336058 55288555 55898057 59605104
19393E9605104P032731N737956J44210j710079k69090J11719m162801p989461
$$ 59605104 66637835 72375791 72520001 70809922 70540832 70652551 66489750 58500289
19385E8500289q548825p572380o703204o336324n663146m635014l420905k290329
$$ 58500289 49951464 42379084 35675880 29339556 23676410 19041396 15620491 13330162
19377A3330162j349091j004448n66190m54840o3747j88502p7598N3316J06342
$$ 13330162 11981071 10976623 10410433 9955593 9891846 9703344 9625746 9679062 9785404
19368I785404L84746P23075R54452J491516J904446K708481L924388N876540Q227278
$$ 9785404 10170150 10893225 11847677 13339193 15243639 17952120 21876508 27753048 35980326
19359C5980326R472805R007766R421275J2520833J5606949J1294465K398514J07400
$$ 35980326 45453131 54460897 63882172 76403005 92009954 103304419 105702933 105810333
19351A05810333K635740L310497m203254r634680q565240m931932j607898n25632
$$ 105810333 108446073 111756570 107553316 97918636 89353396 84421464 82813566 82287934
19343H2287934l97143J716712P205323J1406002P277254n64612j968642L53085
$$ 82287934 81890791 83607503 90812826 102218828 109496082 108931470 106962828 107315913
19335A07315913k46878q135779j3190612j3376528j1550373j0319168j0078424
$$ 107315913 107069035 98933256 85742644 72366116 60815743 50496575 40418151
19328D0418151q989859p099811m976058l639494k626074j760793j419347j230933
$$ 40418151 31428292 24328481 19352423 15712929 13086855 11326062 9906715 8675782
19320H675782r52065n67327n23650o19022m28760n03160n61360n49543l01262
$$ 8675782 7723717 7156390 6632740 6013718 5584958 5081798 4520438 3970895 3669633
19311C669633l82249j60118l68448l35417o8095j79733j87789k5939l7762j19461
$$ 3669633 3287384 3127266 2758818 2423401 2355306 2175573 1987784 1961845 1924083 1804622
19301A804622j54786j74379j58078J47420Q691j59974l0746Q1450j49636k20323
$$ 1804622 1649836 1475457 1317379 1464799 1473490 1313516 1282770 1364220 1214584 994261
19291I94261j05250j1499P5078J836k391R3824P1391Q8252j7564j63478L8633
$$ 994261 889011 877512 952590 954426 952035 1045859 1117250 1205502 1187938 1024460 1063093
19280A063093J03455m3440n4211j59689o7303M8527N8168J09817m5470k2086Q1534
$$ 1063093 1166548 1123108 1068897 909208 841905 890432 948600 1058417 1012947 990861 1072395
19269A072395Q0355l9113m7315j03043p8289j14465j21073L4822J8689N7538K18734
$$ 1072395 1152750 1113637 1066322 963279 884990 770525 649452 684274 702963 760501 979235
19258I79235N4955j32161K727j1281J64846l4384j34912j02749p3655j04164M9602
$$ 979235 1034190 902029 904756 893475 1058321 1023937 889025 786276 712621 608457 658059
19247F58059p0052o3179Q5392M8939M0980L1367J03013K4432J30913q896M24m6595
$$ 658059 588007 524828 610220 659159 700139 731506 834519 858951 989864 980968 981392 934797
19235I34797r0900l7048n0262m6626R8433j33817j4846J82058M8172j20275j80077
$$ 934797 843897 806849 756587 709961 808394 674577 659731 841789 889961 769686 589609
19224E89609p6469K75559J09125n8603J27623k1677k1149J35031Q6064P0475j15882
$$ 589609 513140 788699 897824 839221 966844 945167 924018 1059049 1145113 1215588 1099706
19213A099706j9670N1937Q2352j32812q844J23780L0958J19299J02675r7990j23510
$$ 1099706 1080036 1131973 1214325 1081513 1072669 1196449 1227407 1346706 1449381 1351391 1227881
19202A227881r1668J6887J71290J78109J06820j88694p1487q5944l6084R9511
$$ 1227881 1136213 1153100 1324390 1502499 1609319 1420625 1349138 1263194 1227110 1326621
19192A326621j0659M2543M7507M0353L7211R3798j30741j04347L7079K65946K59855
$$ 1326621 1315962 1358505 1406012 1446365 1483576 1577374 1446633 1342286 1379365 1645311 1905166
19181A905166K57558J05202k8404J96537L67049J41986J42683K26271L10925L83592
$$ 1905166 2162724 2267926 2239522 2436059 2803108 2945094 3087777 3314048 3624973 4008565
19171D008565L19778K99308M88870N49429O31175N76028N06235O29353R31976
$$ 4008565 4328343 4627651 5116521 5665950 6297125 6873153 7379388 8008741 8940717
19162H940717J487058K136594K409030L109529M576839O625485R092206J1204448
$$ 8940717 10427775 12564369 14973399 18082928 22659767 29285252 38377458 49581906
19154D9581906J1693358J2645383J6419211K0764030J9699243J2676981Q647171
$$ 49581906 61275264 73920647 90339858 111103888 130803131 143480112 152127283
19147A52127283J0733264J4480536J0131123k628175j2184304j2536898q115900
$$ 152127283 162860547 177341083 187472206 184844031 172659727 160122829 152006929
19140A52006929q398861j5747681k0585811j8910959j4999741j2028975j1137651
$$ 152006929 143608068 127860387 107274576 88363617 73363876 61334901 50197250
19133E0197250j0298488q545457o312443m574002l132801k367729j872120j448900
$$ 50197250 39898762 31353305 25040862 20466860 17334059 14966330 13094210 11645310
19125A1645310j063478o37063q36098n83954l14437l22357j82994q2963j89111
$$ 11645310 10581832 9944769 9108671 8524717 8210280 7887923 7704929 7621966 7432855
19116G432855j58605k09451M1612J98556K47182K77280L86992P93415J137340
$$ 7432855 7274250 7064799 7106411 7304967 7552149 7829429 8216421 9009836 10147176
19107A0147176J695298K207975L066118M507998O208812P358872P695094Q923542
$$ 10147176 11842474 14050449 17116567 21624565 27833377 35192249 42887343 51810885
19099E1810885J1609543J4184672J2427613P266737N712496P635582R549388N191619
$$ 51810885 63420428 77605100 90032713 97299450 103011946 110647528 120196916 125388535
19091A25388535l479339q753322p960764n236170o420850j1713692j3781416j2222823
$$ 125388535 121909196 113155874 105195110 99958940 93538090 81824398 68042982 55820159
19083E5820159r347153p549187p169506o570655n507798m040608k705443j773611
$$ 55820159 46473006 38923819 31754313 25183658 19675860 15635252 12929809 11156198
19075A1156198j289390j110180r57125o10422n57361o59423l71409l18539j67892
$$ 11156198 9866808 8756628 7799503 7189081 6631720 5972297 5600888 5282349 5114457
19066E114457m14116m61182j78769r9995j20038j46475l05003p9158m4968k05942
$$ 5114457 4700341 4239159 4060390 3960395 3840357 3693882 3388879 3309721 3264753 3058811
19056C058811j8295q8535j39153p4448j15869j09910R4952J19051K8489N1921
$$ 3058811 3040516 2951981 2812828 2738380 2622511 2512601 2607553 2726604 2755093 2807014
19046B807014Q231K5942P1907J54236K06787K1643M8647P8464L86670J93865J06622
$$ 2807014 2815245 2841187 2913094 3067330 3274117 3295760 3344407 3422871 3809541 4003406 4110028
19035D110028L51763K42258J38349M50073O21791J088420J291094J206644R34707
$$ 4110028 4461791 4704049 4842398 5292471 5914262 7002682 8293776 9500420 10435127
19026A0435127N64512O98986Q94771J150385J431586J886305K659191L248689
$$ 10435127 10999639 11698625 12593396 13743781 15175367 17061672 19720863 22969552
19018B2969552M322694N807512Q412563J2607092J4567178P440184j758256l285542
$$ 22969552 27292246 33099758 41512321 54119413 68686591 76126775 74368519 71082977
19010G1082977P85357Q813956J8231845L0321436N0761473Q3419896J07977535
$$ 71082977 71868334 80682290 98914135 129235571 179997044 263416940 371394475
19003C71394475O4992149j5679069l8536374l8833515m8329338n9733708n5615663
$$ 371394475 436386624 420707555 382171181 343337666 295008328 235274620 179658957
18996A79658957m2281634k4205267q802786L320504J3622695J7425531M179834
$$ 179658957 137377323 113172056 104369270 107689774 121312469 138738000 142917834
18989A42917834j6672882k5567331k5126923j9081151j2037197p245037m612813
$$ 142917834 126244952 100677621 75550698 56469547 44432350 37187313 32574500
18982C2574500k954608k086482j540475j342173j163610r98996p05471n43781
$$ 32574500 29619892 27533410 25992935 24650762 23487152 22488156 21782685 21238904
18974B1238904m2358O74181J313377J876132K416389K234095J593964K277935
$$ 21238904 21196546 21870727 23184104 25060236 27476625 29710720 31304684 33582619
18966C3582619M203616O708037R329413J4268892K1642596K4824037J3144694
$$ 33582619 37786235 44494272 53823685 68092577 89735173 114559210 127703904
18959A27703904n435110j2576320j0133711j056175J1425519K7534370M5335927
$$ 127703904 122268794 109692474 99558763 98502588 109928107 137462477 182798404
18952A82798404M8711934K7841667K0894606L9664092M0697716k0946251p0283494
$$ 182798404 231510338 259352005 280246611 319910703 360608419 339662168 269378674
18945B69378674p6821381o2033527l7800628k0637608j1100590m619176R21814
$$ 269378674 192557293 130523766 92723138 72085530 60984940 56365764 57287578
18938E7287578M613617J199926p051767j0445616j0071900p321654m379965k966747
$$ 57287578 61901195 63101121 56049354 45603738 35531838 28210184 23830219 20863472
18930B0863472j977824r82325p69761j325407j446432j280322q29243n59850n15784
$$ 20863472 18885648 17903323 17133562 15808155 14361723 13081401 12252158 11692308 11176524
18921A1176524k39252M81044J308939K135629K426027J879878J701770M72467
$$ 11176524 10937272 11418316 12727255 14862884 17288911 19168789 20870559 21343026
18913B1343026j514179l497039l703414k896930j908992j012055m12770k206p0538
$$ 21343026 19828847 16331808 12628394 9731464 7822472 6810417 6397647 6395441 6324903
18904F324903o55270q74169p64600p00618l19841k84828l27203k36065l7179M1933
$$ 6324903 5669633 4795464 4030864 3330246 3010405 2725577 2398374 2162309 2125130 2167063
18894B167063p5502r7877j19109j38709j67789r6145O4442Q1326n3725k19274
$$ 2167063 2091561 1993684 1874575 1735866 1568077 1471932 1536374 1617700 1563975 1344701
18884A344701k761K12677J31054r8060j15996l5857J09240j02583l0228k1939
$$ 1344701 1341940 1554617 1685671 1587611 1471615 1435758 1544998 1442415 1412187 1390248
18874A390248L7613J72558L1236j16578k25564n3836J2422q5977j07343L0240
$$ 1390248 1427861 1600419 1631655 1515077 1289513 1235677 1248099 1162122 1054779 1085019
18864A085019j075J73675p4599j19154P4279J42699l4603o435j04461p6772J8031
$$ 1085019 1083944 1257619 1183020 1063866 1138145 1280844 1246241 1239806 1135345 1058573 1076604
18853A076604R9501L04409K52328n2155j23131j43805j50752N0975l06669k08375
$$ 1076604 1176105 1480514 1732842 1680687 1557556 1413751 1262999 1313974 1007305 798930
18843G98930k67L830K5967j9453K68201J05373Q1959l1703J72731K17532n3841
$$ 798930 798663 802493 828460 809007 1077208 1182581 1264540 1232837 1405568 1623100 1569259
18832A569259K7086L79487N33987N74855P99487M36388j37838p1773N91957J051153
$$ 1569259 1596345 1975832 2509819 3084674 3884161 4320549 4182711 4110938 4702895 5754048
18822E754048J872002L050482L793094K951049P32584r14468j459178k427731
$$ 5754048 7626050 10676532 14469626 17420675 18153259 17238791 15779613 13351882
18814A3351882k895071k461215j829046j181467p25434m94502J40905L91374O21085
$$ 13351882 10456811 7995596 6166550 4985083 4259649 3765147 3906052 4297426 4918511
18805D918511M63510l71952p16603q14539o74040m79539m57588k10371k19289
$$ 4918511 5382021 5010069 4293466 3478927 2804887 2325348 1867760 1657389 1438100
18796A438100j6250Q29j49993p2553L0266m2692l5941k24129k20181P0841Q2764
$$ 1438100 1421850 1422679 1272686 1200133 1230399 1187707 1151766 927637 707456 778297 861061
18785H61061Q1530j7671n8167J03680J74635J51156N25158O42381O35357L33123
$$ 861061 942591 924920 866753 970433 1145068 1296224 1821382 2463763 3099120 3432243
18775C432243j7447l46643l89939q283N01275R71912J423217J626564R26141q763
$$ 3432243 3414796 3068153 2678214 2669931 3171206 4143118 5566335 7192899 8119040 8110277
18765H110277K10071L90390l74108j336515j628006j601975j147930n89213l63488
$$ 8110277 8320348 8710738 8336630 7000115 5372109 3770134 2622204 2032991 1669503
18756A669503r5842J57617o0416o6553j64189l2256k72427m09183j27512J56102
$$ 1669503 1573661 1731278 1670862 1604309 1440120 1407864 1135437 726254 598742 754844
18746G54844j20393k06391j34330R8009L0918j13743J0439R3618J06606k4264
$$ 754844 634451 428060 293730 391739 422657 308914 319353 412971 519577 495313
18736D95313j19420l6008k07733K4993J13258j19682n7726O9791K7514p2911L8580
$$ 495313 375893 339885 132152 157145 270403 150721 92995 162786 190300 117389 155969
18725A55969p4593n9797j99928P1907J73818L5658J94405J40817J21816m1896
$$ 155969 81376 21579 -178349 -106442 67376 103034 297439 438256 560072 518176
18715E18176j07075j99479j37304Q7031J04844r0006j799k6646L5062P2838k57
$$ 518176 411101 211622 74318 161349 266193 176187 174388 147742 182804 255642 255385
18704B55385k505j25561j87386j28061M5558J58864K83938J09483J02820j3362
$$ 255385 252880 127319 -60067 -188128 -142570 16294 300232 409715 512535 499173
18694D99173r3308R4972r6346j30667l4185R4623j37303j43967Q527P0138J51173
$$ 499173 405865 500837 404491 273824 239639 334262 196959 52992 61519 131657 282830
18683B82830J24931J7631n4174j17044r5722o0924O1845M5802L164J08481P9924
$$ 282830 407761 425392 371218 254174 158452 97528 159373 205175 208339 316820 396744
18672C96744n0630k01263j80914M532l0062m8806j2937l83K06830Q9247j61177
$$ 396744 346114 144851 -36063 -31531 -61593 -110399 -123336 -123719 83111 172358 11181
18661A1181q5861J55852J58579j12656l03521J8622r903R1549R7372J13779L2160
$$ 11181 -74680 81172 239751 127095 -176426 -157804 -167707 -76158 21214 134993 167153
18650A67153P2618o8620j76181J19750J80125P9326j11670r3924k73163Q5212
$$ 167153 239771 171151 -5030 114720 294845 374171 262501 168577 -104586 -19374
18640a9374Q5227K02715M8118j65429k2369J09870M2150J8321J29774J60991k4620
$$ -19374 65853 268568 316686 151257 128888 238758 280908 299229 429003 589994 565374
18629E65374L0149O4742O9169L6262J37965Q8927P8566r8199n9268k01319n3073
$$ 565374 595523 660265 729434 765696 903661 992588 1071154 972955 913687 712368 659295
18618F59295q2652N3180k43301N528j479J26621m2453l5777K6628k2484p6556
$$ 659295 576643 629823 386522 392050 390571 517192 474739 438962 465590 443106 366550
18607C66550k9741j32956o2298m9052K51363J16257k20489j59391o9019k2562
$$ 366550 336809 203853 141555 92503 343866 460123 239634 80243 11224 -11338
18597a1338p6416p2867p7552M6212Q9241L9568j56201J08118j43893r6959J67581
$$ -11338 -87754 -160621 -238173 -191961 -102720 -63152 -219353 -111235 -255128 -352087 -184506
18586a84506J27415Q107Q7612L3917L5670J624K36008K45638n5764M271J69078
$$ -184506 -57091 -48984 38628 72545 108215 109839 345847 591485 535721 539992 709070
18575G09070p1607L4870j7703N2062J94941N6197k3141J38636j63860j34987j4762
$$ 709070 637463 672333 654630 706692 901633 957830 934689 1073325 909465 774478 759716
18564G59716J12339r8933n7468p8904j85487j46036o3492j81447k2735O2299Q7091
$$ 759716 872055 773122 715654 636750 451263 305227 241735 60288 37553 99852 186943
18553A86943r3852k51434r1169K07409L34440J90695j41330k30005J4577J38254
$$ 186943 93091 -158343 -249512 -42103 292337 483032 341702 111697 126274 264528
18543B64528J33575j7872K0815j05545P3871j6112j74266n6180J46633J38119
$$ 264528 398103 380231 401046 295501 369372 353260 178994 122814 269447 407566
18533D07566n9968O75o4560j71190j11034J1155r323K12991J26920K2473J8018
$$ 407566 347598 348273 283713 112523 1489 12644 3321 216312 343232 365705 383723
18522C83723j21792l15929K177J69060o4842p894q6664j93717j02089J05941J75701
$$ 383723 261931 -53998 -51821 117239 52397 44503 -42161 -235878 -337967 -232026 -56325
18511e6325N7090j16812j01893M1974J8929J39591O7477p7015M1394N5559O1195
$$ -56325 765 -116047 -217940 -175966 -157037 -17446 50031 -26984 14410 69969 131164
18500A31164J09042p1600o0677N8626J2183O3212L5924j8129J08787J70046o5928
$$ 131164 240206 168606 107929 166555 178738 241950 277874 259745 368532 538578 472650
18489D72650j46497P5150L7408j36904j75544J13573J90275K50043L45647K11170
$$ 472650 326153 401303 438711 301807 126263 239836 430111 680154 1025801 1236971
18479A236971j3255j07767j95208j04532M6014K31652L54895r9199P6497Q7563
$$ 1236971 1223716 1115949 920741 816209 862223 1093875 1448770 1349571 1426068 1513631
18469A513631J23837J00726j0031l84558n36020l63214q0970j65433j8995Q7668
$$ 1513631 1637468 1738194 1728163 1343605 807585 444371 363401 197968 178973 266641
18459B66641k1390j22158k5848Q0520P4343M5643J00160k9897N7835l1850j05896
$$ 266641 245251 123093 97245 177765 252108 297751 397911 368014 425849 393999 288103
18448B88103J18934j18318j24213k3240q0907R073K4492o6906K13515j5921l9212
$$ 288103 407037 288719 164506 141266 60359 69432 93924 27018 240533 224612 185400
18437A85400M3639n3495R9707J11552j09550Q7356J17666L42074L01274K4147
$$ 185400 229039 175544 275251 386803 277253 364609 482275 824349 1125623 1149770
18427A149770m7051J74019k5256j99613J657o3353k80332k60424m9350K285l172
$$ 1149770 1102719 1276738 1251482 1051869 1053526 990173 709841 449417 400067 402352 399180
18416C99180L2442K78962N61955L48939j60501l59145l50062l33774j90669l4733
$$ 399180 431622 710584 1272539 1621478 1460977 1101832 751770 417996 227327 192594
18406A92594k20627j3711O4778J10979j00773p5274j2753r9767J5060p175l9098
$$ 192594 -28033 -41744 23034 134013 33240 -42034 -54787 -154554 -139494 -146669 -185767
18395a85767l8301J93664R2028M511O6493P2105J9982k403P939J02409J27222
$$ -185767 -224068 -30404 61624 66135 132628 204733 224715 222312 230251 332660 459882
18384D59882J08418k9460J1551p5131k65621j34544k3814O5572m1897N0756j24886
$$ 459882 568300 538840 550391 475260 209639 75095 51281 116853 74956 125712 826
18373H26o1453K9424N6762j03856O7878m2782j0866J05045L9348o6778K8322O6151
$$ 826 -60627 -31203 25559 -78297 -10419 -53201 -64067 40978 80326 13548 41870 108021
18361A08021N7178j03588j44147j0950l1280O1140K50565L2568j05284J65419
$$ 108021 165199 61611 -82536 -93486 -124766 -63626 186939 219507 114223 279642
18351B79642m3366n4612j48547k5437l5421j3079O9842K2385n0030n3584L1207
$$ 279642 236276 181664 33117 7680 -27741 -40820 29022 51407 1377 -52207 -21000
18340b1000j18432l7335p7949L9824J05763J4735O9409J08167l0006k04j09247
$$ -21000 -139432 -176767 -254716 -214892 -109129 -94394 -24985 83182 53176 52972 -56275
18329e6275l6740n0939p3972m0012O9766j053M0091n4467j2406M6188K05939j16012
$$ -56275 -93015 -143954 -217926 -257938 -188172 -189225 -149134 -203601 -216007 -169819 36120 -79892
18317g9892j46320J24037J5248M3694J40882O0733J3285R3982m2696j40869n8959
$$ -79892 -226212 -102175 -86927 -43233 97649 158382 171667 265649 222953 82084 23125
18306B3125J8068j17110J8755j42809l0211P2514J01459L5198r2968J37856J53664
$$ 23125 41193 -75917 -57162 -199971 -230182 -157668 -56209 -21011 -113979 23877 177541
18295A77541J07802P8194K5801J3463r6500n7739J3868N0462m5343p4763n9532
$$ 177541 285343 363537 389338 402801 306301 248562 262430 312892 267549 192786 133254
18284A33254K3690L9717J07867L4177p2922J43749J6915k22497Q0358R4276q9174
$$ 133254 156944 196661 304528 338705 265783 409532 426447 203950 284308 378584 289410
18273B89410k6134K1026j34616N7090m9196k21015K9946J51124K6783j84265k69008
$$ 289410 263276 284302 149686 206776 157580 -63435 -33489 117635 144418 -39847 -308855
18262c08855k93105j24119M25788K69206M5784J67107j00651n5331K2454p8677
$$ -308855 -601960 -726079 -300291 -31085 14699 181806 81155 25824 48278 -30399
18252c0399j52023m2732J10978M6180Q1406J13506J51413m9046n6696n2122J24843
$$ -30399 -182422 -225154 -114176 -67996 13410 126916 278329 229283 172587 120465 245308
18241B45308R9854k07960j77239L05K8481J6543K2906o4560n1431J17358J03574
$$ 245308 345162 137202 -40037 -39732 -11251 5292 28198 -36362 -87793 29565 133139
18230A33139J0648m8252m6845k7941P5424N7087r3883r7016q3715J14098L12506
$$ 133139 143787 95535 48690 20749 96173 153260 59377 -37639 -121354 -7256 305250
18219C05250P2704j75788j59805j42994k21445K27204J77897k5989j9057L9807
$$ 305250 377954 202166 42361 -100633 -322078 -94874 83023 57034 37977 77784
18209G7784J36764r5178m7951M1220J16293k55108k03881R6875R8360J65634N1057
$$ 77784 214548 119370 71419 112639 228932 -26176 -230057 -133182 -34822 130812 181869
18198A81869J47650M2120j04819o0602O7575k4959K4793J2736l9594r9539N9706
$$ 181869 329519 371639 266820 206218 273793 248834 273627 286363 246769 147230 206936
18187B06936J03251j42028r8273K05207L104j46542j50378K7693L223n4132J85292
$$ 206936 310187 168159 69886 275093 278197 131655 -18723 8970 12193 -41939 143353
18176A43353J3211L0326P4426m4063P6097R7622K3236K2859K7539o1203K1706
$$ 143353 156564 186890 261316 217253 293350 390972 414208 437067 464606 403403 425109
18165D25109k8944o8654Q6254m1185k9416J51143m1599m6894n7899n3696Q0607
$$ 425109 396165 327511 413765 372580 343164 494307 452708 405814 347915 294219 374826
18154C74826J92492j33476J18440P327Q601J87712J35000K4531j64447K4960K08965
$$ 374826 567318 433842 552282 559609 568210 755922 890922 915453 751006 775966 984931
18143I84931J54030K65658m4559K1120J12517L3744m1833J43079J82684O6417
$$ 984931 1138961 1404619 1360060 1381180 1493697 1527441 1485608 1628687 1811371 1877788
18133A877788K40630J78034J64012K78318N66678M19516K93429L05928M44356
$$ 1877788 2118418 2296452 2460464 2738782 3305460 3724976 4018405 4324333 4768689
18124D768689P68759J062088J039379J167094J514137K540578L505679N156344
$$ 4768689 5537448 6599536 7638915 8806009 10320146 12860724 16366403 21522747
18116B1522747P450819J0689045J5551351K2539822L6815587O8674149J13347736
$$ 21522747 28973566 39662611 55213962 77753784 114569371 183243520 296591256
18109B96591256R4041452m3137203r1172673r3762186o5042725l3590881j8355208
$$ 296591256 390632708 347495505 256322832 162560646 97517921 63927040 45571832
18102D5571832j1297260p306212n100078l557115k787048k253291k045410j647652
$$ 45571832 34274572 26968360 21868282 18311167 15524119 13270828 11225418 9577766
18094I577766j399363j320735r76435p21913n46132m63373k62450l16398m25197
$$ 9577766 8178403 6857668 5881233 5159320 4613188 4149815 3887365 3570967 3145770
18085C145770l08624r8614k5890j96059j12916j07727k08729k48087j89494L8173
$$ 3145770 2837146 2738532 2712642 2516583 2403667 2295940 2087211 1839124 1649630 1687803
18075A687803K1714k58903j47683R6526j41265j65111j10226m1683r8574o9349
$$ 1687803 1709517 1450614 1302931 1399457 1258192 1093081 982855 941172 842598 773249
18065G73249J9641n1254m5029r3927j35447j9160J45148k0034k913j08609l2146
$$ 773249 792890 741636 696607 602680 467233 448073 593221 573187 570274 461665 429519
18054D29519Q0751o4648L2323j06876p8422l0044n141P6712j14359q0944M6350
$$ 429519 510270 445622 477945 371069 292647 262603 257462 334174 219815 138871 185221
18043A85221p6717L3631J07249o5669j08608k7791l1664l0696P1645k5215J0996
$$ 185221 108504 142135 249384 183715 75107 47316 15652 -15044 56601 31386 42382
18032D2382P103J19934j698k1683j641p4761Q6332o7048J8420j10962q2929k0412
$$ 42382 49485 169419 167721 146038 144397 69636 155968 88920 107340 -3622 -86551 -106963
18020a06963N4536J39296L3763j94159l4940J32204K23682k3918p5445j6947M7252
$$ -106963 -52427 86869 120632 -73527 -108467 23737 247419 223501 148056 131109 178361
18009A78361J71580q6564l63160k51354J65547J47518p619J60371Q1564j01154
$$ 178361 349941 263377 -99783 -351137 -185590 -38072 -45691 114680 196244 95090
17999I5090Q787j03316P0303K00948L7360p9362r242j80828N2626j3657J8904
$$ 95090 103877 561 70864 271812 309172 229810 220568 39740 92366 78709 97613
17988I7613Q1983K936P219J15711o7611o7410k6727j01544Q40j46381N6340Q8607
$$ 97613 179596 182532 189751 305462 237851 170441 143714 42170 43010 -103371 -47031 41576
17976D1576J03083J7895R6637p8069o7546j78142p9Q3339N242R2700N4083J45498
$$ 41576 144659 162554 259191 181122 113576 -64566 -64645 18694 23936 116636 170719 316217
17964C16217J285M4324j65497k896k5333r9836L0053Q3907J11957K8718k17216
$$ 316217 317502 361826 196329 193433 168100 68264 98317 182224 294181 322899 105683
17953A05683j29321J12694j2988j11166j58225n1797J27562q5899j28271m93J11680
$$ 105683 -23638 89056 76068 -35098 -193323 -245120 -117558 -203457 -331728 -332221 -220541
17942b20541k4047P8339P408M1856J282o5578R1672n6296q5548j4355L3210J1523
$$ -220541 -244588 -166249 -158841 -116985 -115703 -181281 -89609 -145905 -231453 -245808 -212598 -201075
17930b01075k06137l663J61966J30732j4173j98602l4137M3214j52538O8210J42739
$$ -201075 -407212 -410875 -248909 -118177 -132350 -330952 -365089 -321875 -474413 -406203 -263464
17919b63464J94716K63556J48099m3430m3273m5475l3610m6979K2533j6560r7402
$$ -263464 -68748 194808 342907 299477 256204 210729 177119 130140 152673 136113 38711
17908C8711k8510o4150K58L3763o044j03590P2777K31194J06477r5575q6239Q835
$$ 38711 10201 -53949 -53691 -19928 -25972 -129562 -56785 174409 280886 185311 99072 107907
17896A07907j09882j70867j43629k8185J43267J18602L0536j22836J42306j47805
$$ 107907 -1975 -172842 -316471 -344656 -201389 -82787 -52251 -175087 -32781 -180586
17886a80586j10319J61350K06544R1230j1079m9930M6644J93361K188k55657k34341
$$ -180586 -290905 -129555 76989 168219 157140 107210 153854 347215 349403 93746 -140595
17875a40595K2826P4549m7636p5456k487M0270Q4555J10265J03043j07093M5480
$$ -140595 -117769 -43220 -90856 -166312 -168799 -128529 -43974 66291 169334 62241 107721
17864A07721K00544J47146k47481k93987p2232R3665P6895K1702j65570Q1579
$$ 107721 308265 455411 207930 -86057 -158289 -64624 12271 33973 -131597 -50018
17854e0018J75258Q7347K7303k0349j07928J8713N6153j66568n913o6375j0019
$$ -50018 125240 212587 239890 219541 111613 130326 186479 19911 13998 -52377 -62396
17843f2396q5927M5303N7109L6605K03653R864r0291N122j31484k72905j19050
$$ -62396 -148323 -103020 -45911 -9306 194347 204211 113920 119042 -12442 -285347 -404397
17832d04397K62010K5507p7122o4750Q259N1110J07592q446k3494J09685K0543
$$ -404397 -142387 -116880 -194002 -258752 -250493 -199383 -91791 -100237 -123731 -14046 6497
17821F497l5769r4956p955m3536l1192J24572P4070l6011K6826L3539m0831l2300
$$ 6497 -29272 -124228 -132183 -175719 -206911 -82339 -8269 -44280 -17454 16085 -24746 -57046
17809e7046k7399P3112J00947j45698k49347M2866L01396K42502j38645j37842
$$ -57046 -84445 -11333 89614 -56084 -305431 -262565 38831 281333 142688 4846
17799D846O3756j4368j29387k5130J5874k03284j02853m9786J47922j96499m635
$$ 4846 68602 54234 -75153 -100283 -84409 -287693 -390546 -440332 -292410 -488909 -493544
17788d93544K53654N0339j05523N7139J40227p6693j63608m3530J19204J32423
$$ -493544 -239890 -189551 -295074 -237935 -97708 -174401 -338009 -381539 -262335 -129912
17778a29912l162o9567M2249Q962j03844n3617j06002M1934P5407R5124J23274
$$ -129912 -133074 -202641 -160392 -151430 -255274 -308891 -414893 -372959 -297552 -202428 -79154
17767g9154j07353p1718K8842k4869p2122j2842J65056J11888K7408M7270P8970
$$ -79154 -186507 -258225 -229383 -254252 -326374 -339216 -174160 -62272 -34864 12406 91376
17756I1376Q2795j80533j2512J33589r77r6764j23835o4704O3370m5472K2217
$$ 91376 174171 -6362 -18874 114715 113738 16974 -106861 -171565 -108195 -153667 -131450
17745a31450K37332o8231l1087j23208m736R9561l9510k5035J86465J13628j05905
$$ -131450 105882 37651 6564 -116644 -121380 -21819 -61329 -86364 100101 213729 107824
17734A07824j44028l4500n8496J64184J11252p5732j10533K00m6594N4708K2515
$$ 107824 -36204 -70704 -129200 34984 146236 70504 -40029 -39829 -86423 -31715 -9200
17723i200N3661J17442J20844N1600j2410j1061o790q9780o5749r5938o2789J06613
$$ -9200 44461 161903 282747 334347 321937 310876 304086 214306 148557 52619 -10170 96443
17711I6443j03450N7045J109L1812j90154m5984K29021J03628j71258j47337j5393
$$ 96443 -7007 50038 51147 82959 -107195 -153179 75842 179470 8212 -139125 -154518
17700a54518j05198J40143J61143p9235J38560J32475R601j15655j23239m1289
$$ -154518 -259716 -119573 41570 -37665 100895 233370 242971 127316 4077 -37212
17690c7212j14581M3876O5426P3626q2653j45738K31549J55348l7108p8137o2919
$$ -37212 -151793 -107917 -42491 31135 -51518 -197256 34293 189641 152533 74396 11477
17679A1477p0804N9908P5612j02375Q0757l4360q3961R3910J4150p486J136L0783
$$ 11477 -59327 581 76193 -26182 54575 20215 -63746 30164 44314 36828 37964 68747
17667F8747J09526j9845j16307k6456P5908Q0266K8711q2292L0704R1165k169
$$ 68747 178273 158428 42121 15665 91573 171839 200550 118258 148962 240127 237958
17656B37958j34643k12838j4262Q3264j13484j23731P1240r0832n9435L4655Q509
$$ 237958 103315 -109523 -123785 -40521 -154005 -277736 -206496 -297328 -356763 -322108 -313599
17645c13599J35389J2327J08594M644j26204k3840K909K1395N4011K51682o0952
$$ -313599 -178210 -165883 -57289 -52645 -178849 -202689 -199780 -178385 -124374 127308 66356
17634F6356k25260l8809P2204O7253O7830L6870m8285j07032m1412j0651J05843
$$ 66356 -158904 -197713 -125509 -58256 9574 46444 -1841 -108873 -150285 -160936 -55093
17623e5093O1505R851j35743m5498k144O5988q6950j32676k5384k4186J45879
$$ -55093 6412 16263 -119480 -164978 -167122 -101134 -188084 -320760 -346144 -370330 -224451
17612b24451N1664J3343L5111L0462Q3337N955q7946o3000p5771r6408j0926p695
$$ -224451 -172787 -159444 -124333 -93871 -10534 -4579 -92525 -155525 -231296 -327704 -338630 -346325
17600c46325J6357K42670J00354j43011J5807J0326l3037N2037J2721l193R0248
$$ -346325 -329968 -87298 13056 -129955 -114148 -103822 -136859 -84822 -72101 -75294 14954
17589A4954p201O8415j18393k37423J76081R9426r312R8219n3114j98151P082
$$ 14954 7753 76168 -42225 -279648 -103567 -4141 -13453 84766 31652 -166499 -159417
17578a59417J6496n3343K2587J38461j0338N5763J41208P9094N8820r3187j94140
$$ -159417 -142921 -196264 -173677 -35216 -45554 10209 151417 230511 289331 196144 2004
17567B004J0388k07994p9704J12890L02138r2157k77312j4343J02457R9185J60497
$$ 2004 12392 -195602 -275306 -162416 139722 47565 -229747 -244090 -141633 -42448 118049
17556A18049M4531m840l8955j04471N035K3108o012J06609N3376j96816k20727
$$ 118049 162580 157740 118785 14314 19349 42457 36445 143054 196430 -386 -221113
17545b21113Q923p860M0397J31215K59495L4635l8509m7637j46854p3151o2271
$$ -221113 -212190 -220050 -179653 -48438 211057 245692 207183 159546 12692 -60459 -122730
17534a22730J06624j9951j63519N2870J06163K4524p2463m9189q4039J23380K79339
$$ -122730 -16106 -36057 -199576 -146706 -40543 -16019 -88482 -137671 -221710 -98330 181009
17523A81009J44375j72886n4554J07778r787q2799j57231K0749j18085o4814L0581
$$ 181009 325384 152498 97944 205722 195935 113136 -44095 -23346 -141431 -206245 -175664
17512a75664j62092J4399J36803j18121j12663o7382P3944J29579j4570J49019
$$ -175664 -337756 -323357 -186554 -304675 -417338 -484720 -410776 -281197 -295767 -146748
17502a46748J01753Q053O2153M7635p6415j49122l893j5602j710J09796J66721
$$ -146748 -44995 -36942 25211 72846 -3569 -152691 -156584 -172186 -173896 -64100 102621
17491A02621K07270R0636j12746j1669J4824o4965n5246j0120P5258K5501j521
$$ 102621 309891 400527 287781 276112 290936 225971 170725 160605 235863 261364 259843
17480B59843j03209j51830p4652Q3188Q5097Q660O7666m3665P0725j4537k19346
$$ 259843 156634 4804 -69848 13340 98437 107097 174763 131098 201823 187286 -32060
17469c2060j09673J76453J71001m009N306N5598j44349k09777n3236r404J01641
$$ -32060 -141733 34720 205721 201712 207018 262616 118267 -91510 -144746 -154150 -52509
17458e2509N4975j60911n6182O5598N1544J72345L38468K6004j59494R7229J25928
$$ -52509 2466 -158445 -214627 -149029 -97485 74860 413328 439332 279838 377067 502995
17447E02995N2904M152K88613M86059O97316O7428n56668n36513l52944k71457
$$ 502995 555899 560051 848664 1334723 2032039 2099467 1542799 1006286 653342 381885
17437C81885j15194o3673q8160k0899M9837j40122J6262J54951j09727O8204j98710
$$ 381885 266691 203018 114858 93959 143796 3674 19936 174887 65160 133364 -65346
17426f5346j23011L8134q9804Q3805N1171J44139N4556m8593K4835k33691j05315
$$ -65346 -188357 -150223 -240027 -156222 -105051 39088 93644 45051 69886 -163805 -269120
17415b69120L7463J08776l2315M6603n1907m4o447q5277K3969J08749M6604J9767
$$ -269120 -231657 -122881 -155196 -108593 -160500 -160544 -166991 -252268 -228299 -119550 -72946 -53179
17403e3179O1807J26360j99600j90510R1163J37519K08838K9273q2431p5608m0719
$$ -53179 8628 134988 -64612 -255122 -163959 -26440 182398 211671 129240 53632 12913
17392A2913r2413k1168k13963Q986K90485J35662n5919j73774j01842J09088J43516
$$ 12913 -79500 -100668 -314631 -305645 -15160 120502 64583 -109191 -211033 -101945 41571
17381D1571m3549j11437J19621j6921J66224P4778q1987l20989m7547J88653r38
$$ 41571 -1978 -113415 6206 -10715 155509 230287 148300 -172689 -220236 -31583 -32521
17370c2521O617j26016M3193K8k3273M7614L3973J8047J4265j69933L1727L5049
$$ -32521 -25904 -151920 -108727 -108699 -131972 -84358 -50385 -32338 -18073 -188006 -156279 -121230
17358a21230j46324p9650M0314R1748k4371r2001J41476O201J49970R573j92265
$$ -121230 -267554 -347204 -306890 -215142 -239513 -331514 -190038 -183837 -33867 -24294 -216559
17347b16559J30258K4385Q7728l9533J9230k52676j37232P2494R7043N3713K4019
$$ -216559 -86301 -61916 25812 -13721 5509 -247167 -384399 -311905 -214862 -161149 -137130
17336a37130k6740l2583J72986J44947j67576j06536n349N7046K10529J5543j6555
$$ -137130 -163870 -196453 -23467 121480 -46096 -152632 -157981 -100935 109594 125137 108582
17325A08582j23964j02347j52618J85944M5044k4119j03647o5306o5296j09887
$$ 108582 -15382 -117729 -270347 -84403 -39359 -63478 -167125 -232431 -297727 -407614
17315d07614J03333j8294L3610J91700J29223j1098j29922Q6870Q1926j13237
$$ -407614 -304281 -322575 -288965 -97265 31958 20860 -109062 -22192 59734 -53503
17305e3503r8657l5242L8039K19724k3743l23904j12589J20052P0436R0090J53062
$$ -53503 -152160 -187402 -149363 70361 46618 -277286 -389875 -269823 -199387 -109297 43765
17294D3765l8117M9617q0458J13644P956K4717p1657K1851l1785p1859J3024J04001
$$ 43765 5648 55265 -25193 88451 96407 121124 49467 71318 39533 -32326 -19302 84699
17282H4699K2113J7477p9313p9502N325L7520r5995j07536L8139J61410J0093
$$ 84699 106812 124289 44976 -34526 -29201 8319 -87676 -195212 -157073 4337 14430
17271A4430j9576j9739k60247m4712J33995Q4261K09471O1879j44610j48920N6354
$$ 14430 -5146 -24885 -285132 -329844 -195849 -111588 97883 159762 15152 -133768 -77414
17260g7414Q7974R9548O812q0308j06224K1249N9749J01599N8582j19639j43437
$$ -77414 10560 110108 116920 36612 -69612 -48363 11386 112985 171567 51928 -91509
17249i1509k5380l1724l9281O4691N6285J31470J69311J71771p6304k59798j15262
$$ -91509 -116889 -148613 -187894 -123203 -66918 64552 233863 405634 329330 69532 -45730
17238d5730l43745j26669K80469J62377J60935k9882m8187j57900r1583K10328
$$ -45730 -389475 -516144 -235675 -73298 87637 57755 9568 -148332 -239915 -29587
17228b9587J72922j29666p1535J32306r6166j16851l9342Q3727j7723P8929K29669
$$ -29587 143335 13669 -57866 74440 -21726 -138577 -177919 -94192 -111915 -32986 196683
17217A96683q44j53387j57777j46514j14781N7827P0452R9609R4134L7036L2344
$$ 196683 195839 42452 -115325 -261839 -376620 -318793 -248341 -148732 -54598 -17562 14782
17206A4782L4156k0073j6931j80894k1282K6907j47368J04156J10181j29788K3248
$$ 14782 48938 28865 11934 -168960 -190242 -163335 -310703 -206547 -96366 -226154 -202906
17195b02906P259P0011J08633J8323p5765q4465j06968q3312N4536J3030l2460
$$ -202906 -195647 -125636 -17003 1320 -74445 -158910 -265878 -349190 -294654 -281624 -314084
17184c14084O8546J48355K16817O2417o0702L1698L9800o9971R9378r4762J65458
$$ -314084 -245538 -97183 119634 182051 121349 153047 192847 122876 222254 127492 292950
17173B92950P979k58138o769J67223q9755n4865N390j99209n7969M0702m8797
$$ 292950 300929 42791 36022 203245 113490 58625 64015 -135194 -193163 -152461 -201258
17162b01258n6576K9532K48058o624j60553o856K7333q6339P7817O4064J06413
$$ -201258 -257834 -228302 19756 13132 -147421 -154277 -126944 -213283 -135466 -71402 35011
17151C5011j42049J8162Q5757P8714K06283J10227p8035j13181k04433p9509l6522
$$ 35011 -107038 -88876 -3119 75595 281878 392105 314070 200889 -3544 -83053 -119575
17140a19575j0372L2077n6864k122N5816j11769k6455J58277K29085J41024j3280
$$ -119575 -129947 -97870 -154734 -156856 -101040 -212809 -239264 -80987 148098 289122 275842
17129B75842k2365j73898k14511M6057j9306m4674P479J78395O8845q3608j14704
$$ 275842 253477 79579 -134932 -88875 -108181 -152855 -145376 33019 101864 18256 -96448
17118i6448Q2861r979r2710j2623R85j47576L7405M4984J47250J08694j03574
$$ -96448 -13587 -23566 -116276 -128899 -127914 -275490 -238085 -193101 -45851 62843 -40731
17107d0731r7523J00437J34073m8981n6279J5701n9632P3881J29103l4136k14543
$$ -40731 -138254 -37817 96256 47275 -9004 6697 -52935 20946 150049 115913 -98630
17096i8630j8007J34650J61495j91411j90081p7688R0838O0348q3516P4911J54357
$$ -98630 -116637 18013 179508 -11903 -201984 -279672 -188834 -128486 -212002 -137091 17266
17085A7266L2383J6991j19306k09143q0688J21779K18051P3446j74804J1319K70769
$$ 17266 49649 66640 -52666 -261809 -342497 -220718 -2667 70779 -104025 -92706 178063
17074A78063K9165j45287j23578k6446P7114Q5873N2186O6728m8794p7932q751
$$ 178063 207228 61941 -61637 -88083 -10969 74904 127090 193818 145024 67092 58341
17063E8341J39261n9594k9359O3344p2547j03623j0579K10848M3206M5183P0680
$$ 58341 197602 138008 108649 171993 99446 -4177 -14756 196092 239298 284481 355161
17052C55161j70118j20674j28343k41575L512K14090J34643o4343n3692l6740
$$ 355161 185043 64369 -63974 -305549 -302037 -87947 46696 -17647 -71339 -108079
17042a08079K71136K63710r9458j18841L2127J12369K8080j44640j92195m3367
$$ -108079 163057 426767 327309 208468 240595 352964 381044 236404 44209 842
17032H42o8522R5798L4644O6224O5778M4721j79749k57399o608k4838J67889Q1518
$$ 842 -67680 28118 62762 128986 194764 239485 59736 -197663 -204271 -229109 -61220 20298
17020B0298J05682k14283k42231l0177J08843J09295o5986J06187Q7092o3476
$$ 20298 125980 -88303 -330534 -360711 -251868 -142573 -208559 -102372 -15280 -78756
17010g8756O7287O4278k7011J731r5173L809K9083p1984j40953N8863J73206L4125
$$ -78756 -11469 52809 25798 27529 -67644 -63835 -34752 -106736 -247689 -188826 -15620 18505
16998A8505N5267q783N4017j59694M3734P1602r6980P1654J02044J31342q5339
$$ 18505 73772 64989 119006 -40688 3046 74648 -22332 49322 151366 282708 197369
16987A97369K1455j16916k05641o3788k2296Q6586M1622m668r3998k9514P1972
$$ 197369 218824 101908 -103733 -167521 -189817 -103231 -61609 -66277 -160275 -189789 -117817
16976a17817J04105r7953J9188J0594J04233J36944L154K9090j02026r7910R0432
$$ -117817 -13712 -111665 -92477 -81883 22350 159294 162448 191538 89512 -8398 82034
16965H2034Q3560l9572m1123j40486j38693O6756L6931j58299K2534l8422M478
$$ 82034 165594 126022 84899 -55587 -194280 -127524 -90593 -248892 -226358 -264780 -260302
16954b60302j39847J12228J19150q5247K1888J08452p2107N6505N5207j06990
$$ -260302 -400149 -287921 -168771 -254018 -232130 -123678 -195785 -139280 -84073 -191063
16944a91063R5432K82363J08725k90049k20209j29406j41638J21368J18690M7539
$$ -191063 -95631 186732 295457 5408 -214801 -344207 -485845 -364477 -245787 -198248
16934a98248K58020J59712J03895k34215l23332j02357J16985O3906j59135j31955
$$ -198248 59772 219484 323379 89164 -234168 -336525 -219540 -155634 -314769 -446724
16924d46724P6192K13793N9375n534n5726j17981r8795J7311p6333O4012R5204
$$ -446724 -370532 -156739 -97364 -102898 -158624 -276605 -375400 -358089 -434422 -370410 -275206
16913b75206J81626m7369l9572L6188m9131J21795K59371M4858j45701k8860K10629
$$ -275206 -93580 -140949 -180521 -144333 -193464 -71669 187702 232560 86859 57999 268628
16902B68628L5224M1667P2217l5120q2125j29154J8631J6147r7083m8744r2446
$$ 268628 303852 345519 417736 382616 300491 171337 189968 206115 109032 60288 -32158
16891c2158j5158j3992l3749J44466j3979l7670n1877J76715M9549j28944n7433
$$ -32158 -47316 -61308 -95057 49409 35430 -2240 -54117 122598 172147 43203 -14230
16880a4230O0137k9506Q8967n5898l1383R7309J0692k30929j8360M2910k3692
$$ -14230 45907 16401 105368 49470 18087 115396 126088 -104841 -123201 -80291 -103983
16869a03983q6372J19291n459m5531J24980n3789J27742K84974J408j34320j39156
$$ -103983 -190355 -71064 -76523 -122054 2926 -50863 76879 361853 363261 228941 89785
16858H9785j59733o3797J46640P3917o5995k1140p9105J08729l5050r4935k0275
$$ 89785 -69948 -133745 12895 86812 20817 -323 -79428 29301 -5749 -100684 -120959
16847a20959j55029j4947o1784P3103L49308J70425p6566j27610j86710r0330
$$ -120959 -275988 -290935 -352719 -279616 69692 240117 163551 35941 -150769 -241099
16837b41099M9380J33812j26676R1054L03582L7580j63053j68647J12458R7540
$$ -241099 -191719 -57907 -184583 -93529 210053 247633 84580 -84067 28391 125931
16827A25931m2831J3046J63333M7743l1690j23674j20000k14346j18210N9511
$$ 125931 83100 96146 259479 307222 275532 151858 31858 -182488 -300698 -241187
16817b41187k9838R9887l7693J15487J67367K1777n3084n3756l9221J20097o2119
$$ -241187 -271025 -171138 -208831 -93344 74023 95800 42716 -11040 -50261 69836 7717
16806G717j43629K1733O4314J32798m7591o6733K11237L9551L5585k4221j46800
$$ 7717 -135912 -114179 -49865 82933 35342 -31391 179846 219397 254982 230761 83961
16795H3961j12432k2488Q4041N0801k46262j40527M1860N3459Q840J96617L0501
$$ 83961 -28471 -50959 33082 83883 -162379 -302906 -261046 -207587 -198747 -2130 28371
16784B8371j47391L6806J29871K2666P8088j36192J02675l6514j42585K5344l7038
$$ 28371 -119020 -82214 47657 70323 148411 12219 114894 78380 -64205 -38861 -75899
16773g5899m1021p8468R8043Q1293Q4164J5785k1373J9784o4111J16969q079j91220
$$ -75899 -116920 -195388 -97345 -16052 68112 83897 62524 82308 18197 135166 127087 -64133
16761f4133k86595M8729J28091j68481J15289L63457J17517j66578r0972p9559
$$ -64133 -350728 -301999 -173908 -342389 -227100 136357 253874 87296 -3676 -83235
16751h3235m5183j43163J94612K4662p1844Q952J1990m221M20q5328q2324M9344
$$ -83235 -128418 -271581 -76969 -52307 -124151 -115199 -103209 -107430 -107010 -192338 -274662 -225318
16739b25318J48018r2008o7765J41558J87679J2034q128J02244k4969m3753J7254
$$ -225318 -77300 -169308 -237073 -95515 92164 104198 96070 198314 173345 129592 146846
16728A46846q2535K2859R7806j00741j27341j4663J14778L8103O122M6090q8636
$$ 146846 64311 87170 184976 84235 -43106 -57769 57009 95112 101234 147324 58688
16717E8688l3600J55528M5415N4142j07810q2795j71695l9527R0842K80963J26097
$$ 58688 25088 180616 226031 280173 172363 89568 -82127 -121654 -30812 250151 376248
16706C76248k05323J626R4303o5837j21826m4211m7822J8648k8584k16664k5604
$$ 376248 170925 172551 266854 201017 79191 34980 -12842 5806 -22778 -239442 -265046
16695b65046K80389m9105j91709p6284J61033J55046k5061N1693k7764o8995M6489
$$ -265046 15343 -33762 -225471 -301755 -140722 14324 -10737 40956 13192 -55803 -9314
16684i314P2145l1547M4380k25451j41999o5814j12492M6908J46715Q6336j2293
$$ -9314 62831 31284 75664 -149787 -291786 -357600 -470092 -423184 -276469 -190133 -202426
16673b02426K17410J82742l7668l6037r8445j56871L6757P3818p1614R7517q7360
$$ -202426 14984 197726 160058 124021 25576 -131295 -94538 -20720 -92334 5183 -82177
16662h2177K40052R3372j47509j75397J35356k3814P0689k5086L2053K25535j12661
$$ -82177 157875 251247 103738 -71659 63697 39883 110572 85486 117539 343074 230413
16651B30413j59611R4334N8948j83916J9109q0625j80470n2962J45992P3724L7078
$$ 230413 70802 165136 224084 40168 59277 -21348 -201818 -254780 -108788 -35064 2014
16640B014P6527m5800p6739Q87j2770j7218j76098L3331L059M3077J24966j66557
$$ 2014 78541 32741 -43998 -43111 -55881 -73099 -249197 -215866 -212807 -169730 -44764 -211321
16628b11321j50327K46573J8563p1260j05451p853J2943J03310P7406O9120J72240
$$ -211321 -361648 -115075 -96512 -167772 -273223 -281076 -268133 -164823 -87417 -18297 153943
16617A53943P3655j25404J9499q3112J3012N7326j1278j69456j15747L2460J1454
$$ 153943 227598 102194 121693 38581 51593 108919 97641 -71815 -187562 -155102 -143648
16606a43648J07657K7223o6162J89262O5728N6074j35207k27257j47406J02047
$$ -143648 -35991 -8768 -74930 114332 180060 236134 100927 -126330 -273736 -171689
16596a71689k9594j06258p5792P4993J57679M267n8819K1474J16146J68201j03694
$$ -171689 -201283 -307541 -383333 -308340 -150661 -146394 -205213 -183739 -67593 100608 -3086
16585c086j04348k24204j73184j15577K17342L08912P4048P0415J88878o6946
$$ -3086 -107434 -331638 -504822 -620399 -403057 -94145 -20097 50318 239196 172250
16575A72250k89013k6243J33971n8257j2911K3084J3438q561p5729J10969R2941
$$ 172250 -116763 -143006 -9035 -67292 -80203 -57119 -43681 -52242 -127971 -17002 75939
16564G5939K774k43530k81418N35J60104O5122P7469K08819R33j45240j56378
$$ 75939 78713 -164817 -446235 -445700 -285596 -220474 -143005 65814 66747 -78493 -234871
16553b34871k5189R4680N7388J24272K29069M3789m1071k23933J51088j4333k89912
$$ -234871 -260060 -165380 -107992 16280 245349 289138 248067 24134 175222 160889 -129023
16542a29023K6981M3484j79025k7071Q5998N9324k5542j19171L9323J25272J7426
$$ -129023 -102042 -58558 -237583 -264654 -178656 -119332 -144874 -264045 -224722 -99450 -82024
16531h2024O747L3396M1344o365n1535j38316L54660J07703m2806j2459r5499
$$ -82024 -75277 -41881 -537 -6902 -58437 -196753 157907 265610 222804 210345 114846
16520A14846j06867j90588M0699R7886q9416l0856O2718K7978J12521J72258k7908
$$ 114846 7979 -182609 -141910 -44024 -133440 -164296 -101578 -73600 38921 211179 183271
16509A83271j77525O6198L4690O2243j17696j23076J85366O1730l002m3553m05
$$ 183271 5746 71944 106634 168877 51181 -71895 113471 175201 172199 128646 128241
16498A28241j09655J01148J22931j79529m9928k9606n1473j6736M2337l0912k4603
$$ 128241 18586 119734 242665 63136 13208 -16398 -67871 -84607 -42270 -73182 -97785
16487i7785R8862J73131q124J09826N8799j09459j51066J6044p0769J21325N292
$$ -97785 1077 174208 166084 275910 334709 225250 74184 90228 19459 140784 146076
16476A46076q8640j47149m2446Q6143K7319o1156q2527j45517O4992P1130P0640
$$ 146076 57436 -89713 -132159 -46016 -18697 -79853 -162380 -307897 -242905 -171775 -101135
16465a01135j60616j9082N1769R5148k7960O7452M0451n4905M1533R255r9346
$$ -101135 -261751 -280833 -229064 -133916 -161876 -94424 -53973 -108878 -67345 -58090 -157436
16454a57436Q1986J6001J13371j63431j3906q5997O3716j7174J3998L8051p7516
$$ -157436 -75450 -59449 53922 -109509 -123415 -209412 -145696 -162870 -148872 -110821 -188337
16443a88337j12671j94824r516P1066J88676J32405L4608J2322r9530j0895l1236
$$ -188337 -301008 -495832 -505348 -434282 -245606 -113201 -78593 -66271 -165801 -176696 -207932
16432b07932r4712K8831Q9770J28906P9881O6930P2961j54875n6322L2268n6871
$$ -207932 -302644 -273813 -184043 -55137 24744 91674 164635 9760 -46562 -14294 -71165
16421g1165j22397j24J36726J22698l9511j32544K5969k0619O9252o6500j2547
$$ -71165 -193562 -193686 -56960 65738 26227 -106317 -80348 -100967 -31715 -98215 -110762
16410a10762j29249K17475R8422R2555R5784n303j21347J5760J9032k1234R2319
$$ -110762 -240011 -22536 75886 168441 264225 258922 137575 153335 172367 151133 243452
16399B43452j17633l09479j25454J8066J14628J36811M4971k5691r7347k7814
$$ 243452 125819 -183660 -309114 -291048 -176420 -39609 5362 -20329 -117676 -145490
16389a45490j33595P9923k2809m1226j1618J4750J66491J17530M5023K7485J52
$$ -145490 -279085 -199162 -221971 -263197 -274815 -260065 -93574 23956 68979 96464 96616
16378I6616p5232r5138j0753j8331N4474K6301j9816J84934K7174o95j9451j59824
$$ 96616 21384 -73754 -84507 -102838 -48364 -22063 -41879 143055 170229 169534 150083 -9741
16366i741O3414O5715J6235p1677n575k5154j23586m2081L0847J3026j02820l7815
$$ -9741 53673 119388 135623 63946 58371 33217 -90369 -132450 -101603 -88577 -191397 -229212
16354b29212J45954K82232J2780l66094j88395k210J00815K33929K8499P74P5319
$$ -229212 -83258 198974 211754 -154340 -342735 -344945 -244130 -10201 18298 19072 94391
16343I4391o1119j28193l6584J41802j54390j71513l1195J41101R752N0893o187
$$ 94391 33272 -94921 -131505 10297 -144093 -315606 -346801 -205700 -195948 -145055 -151242
16332a51242o9242J6869J89778P6840L667N9615M2259l0550m1650m0289M7444
$$ -151242 -220484 -203615 -13837 63003 66670 126285 168544 137994 96344 56055 103499
16321A03499n0251p8722K1857O1828j12993o5909k922N3686o3795j76354l9697
$$ 103499 53248 -25474 -3617 58211 -54782 -120691 -123613 -69927 -133722 -310076 -349773
16310c49773M8726J65275Q2471M7044q8327k4830J96730q6477j35115J31449K5693
$$ -349773 -301047 -135772 -53301 -6257 -94584 -119414 77316 -9161 -144276 -12827 12866
16299A2866K31946J6495k28619n9240K5387J0020M3096j57170k22534L0700K30269
$$ 12866 244812 261307 32688 -26552 -1165 8855 51951 -105219 -327753 -297053 -66784
16288f6784K4860O6506M5235r6454R3398J22399p2038m254q8269Q4376j1380J5634
$$ -66784 -41924 24582 69817 -26637 66761 189160 117122 112868 24599 108975 97595 113229
16276A13229m4592O1190P4348J0764L3562j29515j66464l5868J37496k3314l5644
$$ 113229 68637 129827 204175 214939 248501 118986 -47478 -83346 54150 30836 -4808
16265d808n2025j39462m7681k348L0052R9176J05226j25570j64257N6146J36547
$$ -4808 -56833 -196295 -243976 -246324 -216272 -117096 -11870 -137440 -301697 -245551 -109004
16254a09004J15652m0158O266m2401j13220Q7517J07202P0535k6083l1332p8120
$$ -109004 6648 -33510 -27244 -69645 -182865 -95348 11854 82389 56306 24974 -53146
16243e3146Q0923J28535o3646q8232j15815j40847J90583J03794J5886p9031M095
$$ -53146 27777 156312 92666 4434 -111381 -252228 -61645 42149 58035 -20996 -16901
16232a6901M2040M6959q303k465q5873l7800O8508K1565N2190J66246p0204j08993
$$ -16901 25139 72098 63795 61330 -24543 -62343 6165 27730 79920 246166 175962 66969
16220F6969N8176P4141o3370j79716j62812J40142j4696q4109M3617Q3857n2034
$$ 66969 125145 199286 135916 -43800 -206612 -66470 -81166 -165275 -121658 -37801 -89835
16209h9835o4900R890n5300Q2303o582J43279R7365j26938k5196L0449j34493
$$ -89835 -154735 -144845 -200145 -117842 -124424 18855 116220 -10718 -35914 -5465 -139958
16198a39958M4583K7044K02341N4298p8096m7238j03823r6531m8023j45206N7342
$$ -139958 -95375 -68331 134010 188308 110212 62974 -40849 -137380 -185403 -330609 -273267
16187b73267J30676q236j4886K7178M7982J13130J91482K2639j38178q7330j23908
$$ -273267 -142591 -150827 -165713 -138535 -90553 22577 214059 236698 98520 11190 -112718
16176a12718m2277m0231O9999M2094L6177J6409p3152q9798Q4718o120J14882
$$ -112718 -154995 -195226 -125227 -83133 -46956 -30547 -103699 -193497 -108779 -114899 -17
16165a7p8962j77289j33085K00352L5316J03002m7731L729o8783l221J03595P5270
$$ -17 -78979 -256268 -389353 -189001 -153685 -50683 -98414 -94685 -163468 -166689 -63094 12176
16153A2176l0678M6205k1872J51557O9165R3109o2892q6109m6778j52731q0186
$$ 12176 -18502 27703 5831 157388 226553 319662 256770 170661 123883 -28848 -109034
16142a09034J33082J1790q8663J71121Q3973N5378K2012n5466J15497l4959j40077
$$ -109034 24048 35838 -52825 118296 202269 257647 279659 224193 339690 304731 164654
16131A64654J7154N9432j60332q403j15452j71266L1820J42426m4561l9751n2888
$$ 164654 181808 241240 80908 72505 -42947 -214213 -182393 -39967 -84528 -124279 -177167
16120a77167L8352N2762K4234j12522J04306J04942Q1782J33662r6664j15286
$$ -177167 -138815 -86053 -61819 -174341 -70035 34907 116689 250351 153687 38401
16110C8401N2193j0279l7870Q2101K9856j36711j46116k4629Q3082j045L6667
$$ 38401 90594 80315 42445 124546 154402 17691 -128425 -153054 -69972 -71017 -34350
16099c4350l2994j11954J44767J43122Q8534j62446q3627J11408P7707o0059k08925
$$ -34350 -67344 -179298 -34531 108591 197125 34679 -48948 62460 140167 80108 -128817
16088a28817j64186k4422J30991J04335N1225m8064j27928P6392M9262j2749j5139
$$ -128817 -293003 -317425 -186434 -82099 -30874 -78938 -206866 -130474 -81212 -93961 -109100
16077a09100M7625P4454J11213k4983K3532q1318o9416J06307P8287j78818j25884
$$ -109100 -61475 12979 124192 99209 122741 41423 -27993 78314 156601 -22217 -148101
16066a48101j10718L6710N2368J495p2677K55657J84202L254J22736P516j97017
$$ -148101 -258819 -222109 -169741 -168246 -240923 14734 198936 202190 324926 332442 135425
16055A35425m920L3970L7574o2328j24923N6198K42757k17344l21098k5723J03468
$$ 135425 130505 164475 202049 139721 14798 70996 313753 96409 -224689 -250412 -146944
16044a46944K56064k38915j64922N0068J15791J76974Q1243R5814q7288q2747
$$ -146944 109120 -129795 -294717 -244649 -128858 48116 129359 225173 137885 55138
16034E5138o3958j0474P4023J45991L6208n7076j34119N5900j5094j30610j63790
$$ 55138 -8820 -19294 54729 200720 236928 179852 45733 101633 86539 -44071 -207861
16023b07861j22308J85599J30120o6070O356k8481j01588M2345P8462o5974r7112
$$ -207861 -330169 -144570 -14450 -80520 -74164 -102645 -204233 -161888 -83426 -149400 -246512
16012b46512j4441K7581Q2018J2934K66534K0836j04111j31696j32200J9360K18097
$$ -246512 -260953 -233372 -151354 -138420 128114 148950 44839 -86857 -219057 -199697 18400
16001A8400K37644o5691q2850p2579L0125j05897k42303n740k7452J5772J72568
$$ 18400 256044 190353 107503 34924 65049 -40848 -283151 -288891 -316343 -300571 -128003
15990a28003J46157R3333j08634K8263J64291k7798J286m2724J39020l5537m3648
$$ -128003 18154 111487 2853 31116 195407 167609 168895 126171 265191 229654 186006
15979A86006j82746k19115l9184n539R6418R2067K6509m5521k4900N7331P0940
$$ 186006 3260 -215855 -255039 -260578 -164160 -72093 -45584 -91105 -116005 -58674 12266
15968A2266q8034p4572m8142p7408o7563O1685J73129J14544j7461Q3415K5279
$$ 12266 -75768 -150340 -198482 -275890 -343453 -281768 -108639 5905 -11556 71859 97138
15957I7138j26725O5004o3082r3126j11244j4026P0328R3028Q8555n7520j23105
$$ 97138 -29587 35417 -27665 -120791 -232035 -246061 -175733 -82705 5850 -51670 -174775
15946a74775k4235j21908K5715M808q5948o8832J36873J00220N3509J1676Q6690
$$ -174775 -199010 -320918 -295203 -290395 -376343 -445175 -308302 -208082 -154573 -142897 -56207
15935e6207K0890J46995N9720P9977j45660k72980O4372J07595N2734j7989k483
$$ -56207 -35317 111678 171398 251375 105715 -167265 -102893 4702 57436 39447 36964
15924C6964j30085j78837J30493M4889K8321P1094l0911O0186m7984j32969k3831
$$ 36964 -93121 -271958 -141465 -96576 -68255 2839 -28072 32114 -15870 -148839 -172670
15913a72670j44486R427R0908J60900P0203k24244K3239P7641J38974l9159j06886
$$ -172670 -317156 -307729 -216821 -55921 14282 -209962 -186723 -109082 29892 -9267 -116153
15902a16153O6466q7610J08800J42585J110j91182j11290O3235r3679J7885r282
$$ -116153 -49687 -137297 -28497 114088 115198 -75984 -187274 -124039 -217718 -199833 -209115
15891b09115R2532K94176m3235j45923o748R201p1281J62530q3839j45250K7075
$$ -209115 -116583 177593 134358 -11565 -18313 -9112 -80393 82137 -1702 -146952 -119877
15880a19877n2914J51518J45537Q3026j49167j28973J13452l0833j30095K8383
$$ -119877 -172791 -21273 124264 207290 58123 -70850 42602 11769 -118326 -89943
15870h9943J51405r1376J22416O0786j41453j11742Q6768j6779j01536J29085
$$ -89943 61462 -29914 92502 153288 11835 -99907 -13139 -29918 -131454 -2369
15860b369n4874j51062O3919J66312k7846j28075J2935K04835Q7702O7463j11210
$$ -2369 -57243 -208305 -144386 21926 -5920 -133995 -121060 83775 171477 238940 127730
15849A27730r0204n1264q4915Q7124J41602J7336k4925M9928K3253j33340L3774
$$ 127730 37526 -13738 -98653 -11529 130073 147409 122484 172412 195665 62325 96099
15838I6099K04788p7700j87021J1002N5220O6112j3936p6848J68146R4982R677
$$ 96099 300887 223187 36166 47168 102388 168500 154564 77716 245862 340844 350521
15827C50521p6301j71580r1760K1298l1861P3816J05271j72810q8152J6290R3137
$$ 350521 274220 102640 10880 32178 317 74133 179404 6594 -81558 -65268 27869
15816B7869Q0149R5090m9830p3000p7294l1443j33242J63467J42768p4073M8510
$$ 27869 108018 203108 153278 80278 2984 -28459 -161701 1766 144534 70461 118971
15805A18971j56437j63217n5923q0786N7083O6005J61138J4603o9751L2164l3137
$$ 118971 -37466 -200683 -256606 -337392 -280309 -214304 -53166 -38563 -108314 -76150 -109287
15794a09287o5412J44517J52235M0064P1555K12846j62879n4323n1125k51298
$$ -109287 -174699 -30182 122053 162117 233672 446518 283639 229316 178191 -73107
15784g3107m7278K6993J94780J03656P7413r8502p7865m535J37205j33844j11896
$$ -73107 -120385 -93392 101388 205044 282457 183955 106090 101555 238760 104916 -6980
15773f980L8295j8862J0829q0963l6175L9051P8960J03687O4380q2069L0798r1473
$$ -6980 31315 12453 23282 -57681 -93856 -54805 24155 127842 192222 110153 140951 49478
15761D9478p602J1312j22768k9322J16560j1387o6919M7109m5514n0131K2543
$$ 49478 41876 53188 -69580 -98902 17658 6271 -60648 -13539 -59053 -109184 -86641
15750h6641J27296J00492r6862K7105O1227j81858L2911R9491r4518o3923k5052
$$ -86641 40655 141147 44285 71390 132617 -49241 -16330 83161 -11357 -75280 -100332
15739a00332k4114M3011K1627J10774j42077K5649o0771K43475P1962j22709j54891
$$ -100332 -124446 -81435 -59808 50966 -91111 -65462 -126233 117242 189204 66495 -88396
15728h8396L7579J25832j44106L6343l0967K9046J35076m7212K6240l896j01157
$$ -88396 -50817 75015 -69091 -32748 -63715 -34669 100407 53195 79435 75539 -25618
15717b5618j0072P3507q1579K1636j9911P3056Q468l5303r7056K05401M3645j14195
$$ -25618 -35690 37817 -43762 -22126 -42037 31019 39487 4184 -92872 112529 156174 41979
15705D1979j50332o0623N7812j55747r128J03212J47412j98335j40369J45889
$$ 41979 -108353 -168976 -111164 -266911 -276039 -172827 -25415 -223750 -364119 -218230
15695b18230j90800M5137o395m9970K0925J88805M07007k1781p2057o5210j23777
$$ -218230 -409030 -363893 -370288 -420258 -399333 -210528 196479 174698 102641 37431 -86346
15684h6346Q606R7439Q0565j5411J09916m5451r7653j26349q4630O1588j21815
$$ -86346 -77740 19699 100264 84853 194769 149318 51665 -74684 -159314 -97726 -219541
15673b19541J41158J75480J8036o4316M5084O368l2702P3378j50795q2126P5554
$$ -219541 -78383 97097 115133 50817 95901 102269 69567 142945 -7850 -89976 -14422
15662a4422j34139l7475O2290J19062Q0734Q4891q8454n977l4490k2058m0152
$$ -14422 -148561 -186036 -123746 -4684 76050 160941 72487 66510 32020 9962 -30190
15651c0190j12405j13672R9339k8919J2134Q5676R4328K25342p923j35294l8692
$$ -30190 -142595 -256267 -156928 -185847 -173713 -88037 6291 231633 223710 88416 49724
15640D9724m7741Q2468Q1268j4332R0767J1689j65420n5656j4140j03921M7422
$$ 49724 1983 84451 165719 151387 242154 253843 88423 32767 18627 -85294 -37872
15629c7872O325J30021K28454M4538j50444k98999n8608O7860O7220N2601O5594
$$ -37872 -31547 98474 326928 371466 221022 -77977 -136585 -68725 -1505 51096 116690
15618A16690N073K5359m8445j06629j42122j79432J3437l9304J79113K18302o4219
$$ 116690 121763 147122 98677 -7952 -150074 -329506 -316069 -355373 -176260 42042 -22177
15607b2177K7258p2660m1970J40293n2614p8641J03432K20511o2839m0697m0893
$$ -22177 5081 -67579 -109549 30744 -21870 -100511 2921 223432 160593 119896 79003
15596G9003j01898K1355N1147N6190R487l9201J2563k3852L1088j34076k0819
$$ 79003 -22895 -1540 49607 105797 115284 76083 88646 64794 95882 -38194 -59013
15585e9013j51342J28547j9485j84041K66912Q0783N1458j43801j49201M9172
$$ -59013 -210355 -81808 -101293 -285334 -18422 62361 113819 -29982 -179183 -130011
15575a30011J36117Q0346K292j39637r6499J15708J84528J74194l8335j19330
$$ -130011 6106 86452 88744 -50893 -147392 -31684 152844 327038 288703 169373
15565A69373j19895k22531m0507L5466j04346M1549J48281J66920l5148j36319
$$ 169373 49478 -173053 -213560 -178094 -282440 -240891 -92610 74310 39162 -97157
15555i7157o1375R9566J02429j48306L4391O9249n7982n1339J22146j01005j13504
$$ -97157 -158532 -58966 43463 -104843 -70452 -1203 -59185 -110524 11622 -89383 -202887
15544b02887J26059M734o3710Q7532K36688n1613r4521q8004n669m6538j32596
$$ -202887 -76828 -72094 -135804 -48272 188416 136803 42282 -45722 -51391 -97929 -230525
15533b30525K9112j2016K6388Q2826J36767o9146K4176P0600j99586j14131R4270
$$ -230525 -201413 -213429 -187041 -104215 32552 -36594 -12418 58182 -141404 -255535 -161265
15522a61265J92020L6228O7202p1j86219q4342o9702P5987J68332Q522o2606n9742
$$ -161265 30755 66983 134185 134114 -52105 -136447 -206149 -130162 38170 46692 -15914 -75656
15510g5656O9017J6724l8584N6516J47147L2465L3007j80440j84267r8265Q721
$$ -75656 -6639 10085 -28499 28017 175164 207629 240636 60196 -124071 -222336 -213615
15499b13615k0956j3046J58989R8367o3655j3945j30J90506K0472m3717R970j536
$$ -213615 -234571 -247617 -88628 9739 -53916 -67861 -67991 122515 142987 99270 109240 107704
15487A07704O1523L0147o1479j03351j84402R2261P1391q0552l8531J3598n0450
$$ 107704 169227 199374 137895 34544 -149858 -57597 13794 -66758 -105289 -91691 -142141
15476a42141o543n6290J3586J70477M718l4786J55777j50811k99573L2939J55244
$$ -142141 -148684 -204974 -191388 -20911 -16193 -50979 104798 -46013 -345586 -312647 -157403
15465a57403J2483m0094J35230L5750r9224Q2550n123o5584N9430J96322q9264
$$ -157403 -144920 -185014 -49784 -14034 -113258 -30708 -35831 -101415 -41985 154337 65073
15454F5073j48536j5519n60J2978r9089J65008r9391J91879n3394j66981p5417
$$ 65073 -83463 -98982 -99542 -86564 -185653 -20645 -120036 71843 18449 -148532 -223949
15443b23949j41187J46756K71115K28814k23240j51358r2038m3745P8771J70001
$$ -223949 -365136 -218380 52735 281549 58309 -93049 -185087 -228832 -150061 19940
15433A9940P4465M070o2762j64763J09890J19093m2865n6213R3432j56190m07867
$$ 19940 94405 98475 35713 -129050 -19160 99933 57068 855 94287 -61903 -469770
15422d69770Q189L23018Q2513j06618n5628J69442N0887P1487K1391j06799q7617
$$ -469770 -461581 -138563 -56050 -162668 -218296 -48854 2033 73520 94911 -11888 -99505
15411i9505k9231M6394J53246M865j10659K014j7053J1198J64570R8992j69046
$$ -99505 -128736 -82342 70904 75769 -34890 -32876 -49929 -38731 125839 224831 55785
15400E5785q5137k4199l7658l5443J03033l243n3137j28303M8222P5358m0737
$$ 55785 -29352 -53551 -91209 -126652 -23619 -26862 -79999 -208302 -160080 -84722 -125459
15389a25459j6641J1262J05079K10855j5087k05114j16443M3959j7469N8903J51221
$$ -125459 -142100 -130838 -25759 185096 170009 -35105 -151548 -107589 -125058 -66155 85066
15378H5066J87536j33182n3511o8161J32450J50084j2390j31794k1668O8589M2822
$$ 85066 272602 139420 85909 17748 150198 300282 287892 156098 134430 203019 245841
15367B45841k92556j05926P1453k0741n0237K9274N9466j47984n9710Q0613J20020
$$ 245841 -46715 -152641 -81188 -101929 -152166 -122892 -63426 -211410 -271120 -190507 -70487
15356g0487K29775n1268j47299J0842Q0744o2445r3856R4959J1772M1090l8291
$$ -70487 159288 108020 -39279 -28437 52307 -10138 -103994 -9035 2737 43827 5536
15345E536r8905j49851k2596k3047k2828J90628K17201J35647j22684j01079j05200
$$ 5536 -93369 -243220 -265816 -288863 -311691 -121063 96138 231785 109101 8022 -97178
15334i7178k28613K6174L46105L15553N7699k40877j42607p1542k0621M3661j15901
$$ -97178 -325791 -299617 46488 362041 419740 178863 36256 -35286 -55907 -12246 -128147
15323a28147k31892m2733J51808L8430P1030J4297j04965m4385P8184n5789N0269
$$ -128147 -360039 -402772 -250964 -212534 -141504 -127207 -232172 -276557 -198373 -254162 -203893
15312b03893J27639R7197j27248O4365n2725p7693j1908k4093J32864Q6257r0569
$$ -203893 -76254 20943 -106305 -41940 -94665 -172358 -184266 -208359 -75495 10762 -79807
15301g9807J21090J09393n7570P0077L2486j56808r0959K8379Q685J8439J22783
$$ -79807 41283 150676 93106 163183 195669 38861 -52098 -23719 -15034 3405 126188
15290A26188r1077j13016o7107o391J24192L51696r6312k01220q8693M9382J03588
$$ 126188 35111 -77905 -145012 -151403 -27211 324485 228173 26953 -61740 -12358 91230
15279I1230J80454O8606q6479j71204Q2555J06896q5911k21508k5748J22662L3965
$$ 91230 271684 340290 253811 82607 165162 272058 186147 -35361 -61109 61553 95518
15268I5518p0990n7679Q5578K4412O1556M8187K309j92854j00982J49481J54370
$$ 95518 24528 -33151 52427 76839 138395 186582 188891 -3963 -104945 44536 198906
15257A98906J54041J1853l7701J21557l5274j28345j4797j7064o851J1689r3492
$$ 198906 352947 364800 327099 448656 413382 285037 270240 253176 246325 258014 164522
15246A64522j12167O8220N0635k3531o1474n1710r6703j19231l7536P6435R2248
$$ 164522 52355 120575 171210 147679 86205 34495 -62208 -181439 -218975 -142540 -50292
15235e0292p7078k02616M0537J84544P7000j11617O2894l5845J45896J55857m1682
$$ -50292 -127370 -329986 -289449 -104905 -27905 -139522 -76628 -112473 33423 189280 147598
15224A47598P6096J27983P5154l28524k92717n8934J8654o0983K297J39223k2218
$$ 147598 223694 351677 426831 98307 -194410 -253344 -234690 -295673 -293376 -154153 -176371
15213a76371p4768M6629J30315j07493p2707K8499j540o0415M6033L8349j47551
$$ -176371 -251139 -204510 -74195 -181688 -254395 -225896 -227436 -287851 -241818 -203469 -351020
15202c51020n9841J55265P2403o7866l4170J54465M7559J59259k2022l4175R3
$$ -351020 -410861 -255596 -183193 -251059 -285229 -130764 -83205 76054 54032 19857 19950
15191A9950n4665o1556k6466N6914M3638K3827P1817Q8898M2136M2556j15341
$$ 19950 -34715 -96271 -122737 -65823 -22185 1642 73459 162357 204493 247049 131708
15180A31708m8338J32411J64689K9623k6152l989O7817O044n1226l6002j01325
$$ 131708 83370 215781 380470 410093 383941 379952 447769 453813 402587 366585 265260
15169B65260j98538n2942J4780o6445j8289O9376O9656J1858q1724r2095J4211
$$ 265260 66722 13780 28560 -37885 -56174 13202 82858 94716 12992 -79103 -64892
15158f4892l8023m0984k2859O8462j20178j5440J35724J23300R3553J50361P7466
$$ -64892 -102915 -143899 -166758 -98296 -218474 -233914 -98190 25110 118663 269024 346490
15147C46490R180m8106k56378l0101J64318J44494p620N0968j75214q6439j6518
$$ 346490 355670 307564 51186 21085 185403 329897 322277 373245 198031 111592 95074
15136I5074m2490k29985j52120j54131R6650L34297K62681q8463n8301O2936l6837
$$ 95074 52584 -177401 -329521 -483652 -387002 -52705 209976 121513 63212 126148 89311
15125H9311o8964o338P1029J33512o1403n6872K287j2645o9564l6110K883M4655
$$ 89311 20347 14009 85038 218550 157147 100275 102562 89917 20353 -15757 -12874 31781
15113C1781J705j9392q183K7276j55578j36908Q489J88952J05789j12213P5444
$$ 31781 33486 14094 5911 33187 -122391 -259299 -250810 -61858 43931 -68282 7162
15102G162l2506o9652O5178O3928J2720L8528O4807M9261J53080j63659j37785
$$ 7162 -25344 -94996 -29818 34110 46830 85358 150165 199426 352506 188847 51062
15091E1062R9447l5616q8991m2668Q6217m2109K1375J64026j39457k05502R5685
$$ 51062 150509 114893 25902 -16766 69451 27342 48717 212743 73286 -132216 -36531
15080c6531J25938J96342m4446j74166j16273n8036J37563K14237k6226j35530
$$ -36531 89407 285749 241303 67137 -49136 -107172 30391 244628 218402 82872
15070H2872p2764J07107l6953o7969J10620r3839j72760k1819J42962R6855J1126
$$ 82872 10108 117215 80262 12293 122913 29074 -143686 -165505 -22543 74312 85438
15059H5438K3793j19603j70516R5972J78131J08194l9947p983m5601j70988J553
$$ 85438 109231 -10372 -180888 -84916 93215 201409 161462 153479 107878 -63110 -61557
15048f1557K4068J74465K51084o8734j01817q6289J33890M7199R4782p6932p6218
$$ -61557 -37489 136976 388060 319326 217509 131220 265110 312309 407091 330159 253941
15037B53941n3967l7504j1892r0365l8724L0346L0550o1504m7850O2077j32110
$$ 253941 199974 162470 150578 60213 21489 51835 82385 20881 -26969 35108 -97002
15026i7002j49965J61379P5697Q1861R4854r120o2439K5213P7764l2593j63854
$$ -97002 -246967 -85588 -9891 71970 166824 157704 95265 120478 198242 165649 1795
15015A795o9394r5090P4570J27321R4350J2936j7263K2670j4890O433L5707J27617
$$ 1795 -67599 -162689 -88119 39202 133552 146488 129225 151895 137005 143438 179145 306762
15003C06762J49591j96821j00928m4302Q3998l0364j82389k3285p395J19756J40469
$$ 306762 456353 259532 158604 114302 198300 167936 -14453 -37738 -45133 74623 215092
14992B15092j43805j25116O9533j46935m8646J75117N7014Q9165l3299o76q3867
$$ 215092 71287 -53829 15704 -131231 -179877 -4760 52254 141419 108120 107444 23577
14981B3577n6265j29247o5144J62596J21073Q6651p1459r5295n8923n9043J70003
$$ 23577 -32688 -161935 -227079 -64483 56590 143241 71782 -23513 -82436 -141479 28524
14970B8524K47375J37635R9247p5166k96126j99969m5427O3416j13177Q285J9588
$$ 28524 275899 413534 512781 437615 141489 -58480 -103907 -40491 -153668 -145383 -125795
14959a25795K6287k2315M7830K17250J74550p5556k81676J7606m7752N4971J49875
$$ -125795 -99508 -121823 -73993 143257 317807 242251 -39425 -21819 -69571 -14600 135275
14948A35275J21371j09836o1292P2791J50019k8622l8742j32882Q3523J8290j32816
$$ 135275 256646 146810 85518 158309 308328 279706 240964 108082 191605 209895 77079
14937G7079P014j4216Q4320Q1459n493j94229j44458l01736k2351J41874K23066
$$ 77079 84093 69877 154197 235656 230163 35934 -108524 -410260 -432611 -290737 -67671
14926f7671K08516J03830Q2639p7919k96119O1353K2154M9643M8491j13965J47530
$$ -67671 140845 244675 327314 249395 -46724 14629 36783 86426 134917 20952 168482
14915A68482J1573j10680l2935k6429p1911n3988q9386m6203J02991o3498R0455
$$ 168482 180055 69375 36440 10011 -61900 -115888 -205274 -251477 -148486 -211984 -121529
14904a21529l6910r6091K08653J84652j1053L8129j3913r7613k17511Q969Q7326
$$ -121529 -158439 -254530 -45877 138775 127722 165851 151938 54325 -163186 -154217 -66891
14893f6891K34821N0394Q551l879P665M1185j22106j40222j68604n7847J02875
$$ -66891 167930 218324 226875 222996 230661 271846 149740 9518 -159086 -216933 -114058
14882a14058l8374K2512l2688O865n6154O4837r8938l926N7193J15914P6861P8657
$$ -114058 -152432 -129920 -162608 -155743 -211897 -147060 -245998 -249924 -192731 -76817 44 78701
14870G8701j5171k65590k4159R9681J38054J7200M3175P9223M8297M2070r5162
$$ 78701 63530 -202060 -226219 -126538 11516 28716 71891 151114 199411 241481 146319
14859A46319L2289o7327m7549J9466M6830n5302n5275Q2982J45531j00699j80544
$$ 146319 178608 111281 63732 83198 130028 74726 19451 102433 247964 147265 -33279
14848c3279l4380k2834p4750j3970L4941j1984j28410J56104N4675J5465J41705
$$ -33279 -67659 -90493 -165243 -179213 -144272 -156256 -284666 -128562 -73887 -58422 83283
14837H3283J73211k4278L5975J53831r6317j71717R119L5099K1563M166M7315
$$ 83283 256494 232216 268191 422022 325705 153988 163107 198206 219769 223935 271250
14826B71250j93582r6715n4372O0188j04064j68858Q9453L08534L0183r7105l8514
$$ 271250 77668 -19047 -73419 -13231 -117295 -286153 -196700 111834 142017 44912 6398
14815F398J7891l0912J00274K2534q6821j2587r3319O9526o4980O769j8530k4651
$$ 6398 24289 -6623 93651 116185 29364 16777 -76542 -7016 -71996 -65227 -83757 -108408
14803a08408j6407o705n3943J50668K2959k9588K245K27462K08580K1271L7145
$$ -108408 -124815 -131520 -185463 -34795 -11836 -41424 -39179 188283 396863 418134 455279
14792D55279k795j12444k18669J18193M9205k53939l1473O7833N6490j00164L3393
$$ 455279 452484 340040 121371 239564 288769 34830 3357 71190 127680 27516 60909
14781F0909o2844J3452R3312n1643m5141j80568j0729J68446O0374M3592R207
$$ 60909 -1935 11517 104829 53186 8045 -172523 -183252 -14806 45568 89160 98367
14770I8367p5992j309K35985J01187j18857p5978j54446Q0590J92411k19545j40406
$$ 98367 22375 21066 257051 358238 239381 163403 8957 89547 281958 62413 -77993
14759g7993l4776K5757L2761r7720n1188N8183J06799r2236R1765j01010o3861
$$ -77993 -112769 -87012 -54251 -151971 -203159 -144976 -38177 -130413 -38648 -139658 -203519
14748b03519K41894J79770j34260Q1299k3659R4080n439m842j34628J47113J68071
$$ -203519 38375 218145 83885 165184 141525 235605 230166 225324 90696 237809 405880
14737D05880p645j96420j16487j00316l8269l3856K3281l875P9730K58544q449
$$ 405880 398235 201815 85328 -14988 -53257 -87113 -63832 -67707 12023 270567 262118
14726B62118k30270p8317j60457j94113j6201J08472J23820J93606J434N6347
$$ 262118 31848 -46469 -206926 -401039 -417240 -308768 -184948 8658 10092 66439
14716F6439n123n3042p0681R2964J74613r7095K4881M1474l7404j07960J1808
$$ 66439 61316 8274 -62407 30557 205170 108075 132956 174430 137026 29066 40874
14705D0874J5561p465j4655J53322J5859O0027j5433j4581r3890q9990Q7078K870
$$ 40874 56435 48970 34315 187637 203496 263523 248090 233509 139619 49629 136707 139577
14693A39577J3675k9587k10239r4760K0032Q1737L2627J073j76228M6134M182
$$ 139577 153252 123665 -86574 -181334 -161302 -79565 -46938 -45865 -222093 -175959 -171777
14682a71777K88418N7111j06766j36879j18643m253K19714R7273J11072j3658
$$ -171777 116641 173752 66986 -69893 -188536 -192789 26925 124198 235270 221612
14672B21612J6220m0142J3218j78033J07822r1530n3506J85922Q3578J5258j4864
$$ 221612 237832 197690 210908 32875 140697 49167 -4339 181583 265161 280419 265555
14661B65555l6941j03901l7765j15390j2110O1355J27329m8193j14926N437q6618
$$ 265555 228614 124713 86948 -28442 -40552 20803 148132 99939 -14987 -9550 -96168
14650i6168Q2878J96587k8983j66151M8595Q0590J48190J01040j20824k73818
$$ -96168 -13290 183297 154314 -11837 36758 117348 265538 366578 245754 -28064
14640b8064j8266J00529n5112j13705J57150M530K5870k2922j28072k07864m274
$$ -28064 -46330 54199 -913 -114618 42532 47062 72932 50010 -78062 -285926 -290200
14629b90200J21463J92349q9499L0434J72151n8083p6756N3833l7115P0139o3282
$$ -290200 -168737 23612 -65887 -35453 136698 78615 1859 55692 18577 88716 25434
14618B5434m1385p4032K8233L8325n6083p3077J99163J94904N872p0239p1581
$$ 25434 -15951 -89983 -61750 -23425 -79508 -152585 46578 241482 247354 177115 105534
14607A05534j13240j2492Q3276P191q166O7695J01694l1431j07457N9121o800
$$ 105534 -7706 -20198 63078 70269 62103 129798 231492 200061 92604 151725 144925
14596A44925L3860O6047O6073K1168k40112j40836q7206J57442J97075m169O7917
$$ 144925 178785 244832 310905 332073 91961 -48875 -136081 21361 218436 214267 282184
14585B82184M282n7841j7885J35206p5956j59587j1695K8976m3126q9748J9835
$$ 282184 286466 228625 210740 345946 269990 110403 98708 127684 84558 -5190 14645
14574A4645J38589J38894k8851j25679q7183K06991K84089L2142n3188n3383k64531
$$ 14645 153234 292128 263277 137598 50415 257406 541495 573637 520449 467066 202535
14563B02535k70680N1299j0058Q1416M2462o5525p2125p2299K5319J20068O7835
$$ 202535 -68145 -16846 -26904 54512 96974 31449 -40676 -112975 -87656 32412 100247
14552A00247o7130j05367j05383q2783j24594J05214J81479M2636j47218N1000
$$ 100247 33117 -72250 -177633 -260416 -385010 -279796 -98317 -55681 -202899 -151899
14542a51899j347m8787R7670J21333N5419l0284n4255N6208l1912M9025l3254
$$ -151899 -153246 -202033 -104363 16970 72389 42105 -12150 44058 12146 61171 27917
14531B7917j19749J48231K46305j92751j95642k64725N8951K00051P3822N7924
$$ 27917 -91832 56399 302704 109953 -85689 -350414 -291463 -91412 -17590 40334
14521D0334n4852q3627Q0934J8023j33504j05879O5959P6944J17059o1595p3504
$$ 40334 -14518 -98145 -17211 812 -132692 -238571 -172612 -95668 21391 -40204 -113708
14510a13708J09771O6284M3380n8502J625p9912p7568J48314K9878k8363p0295
$$ -113708 -3937 62347 105727 47225 48850 -31062 -108630 39684 69562 41199 -29096
14499b9096R8012p019P9159j22379q8701M6149n3121J2891n2003j7660J4479P7664
$$ -29096 68916 61897 141056 18677 -70024 -23875 -76996 -64105 -116108 -133768 -119289 -41625
14487d1625M0866J691j03146j02954K3515J74184Q8771M0198m6792j9624Q4498
$$ -41625 -759 932 -102214 -205168 -181653 -7469 81302 121500 74708 55084 139582
14476A39582n8213j24328K9422L4885k115K2840j20224l4325N4115Q4515J4733
$$ 139582 81369 -42959 -13537 21348 19233 42073 -78151 -112476 -58361 26154 40887
14465D0887n3457M4499L9635o0674J23624K1292p0336J2508m322M1435j00842
$$ 40887 -12570 31929 71564 10890 134514 155806 85470 97978 93656 135091 34249
14454C4249O22J9183L238k57154j31925J77279R3301O2831M9229p7342N2207j08712
$$ 34249 34871 54054 57292 -199862 -331787 -154508 -61207 1624 50853 -26489 25718 -82994
14442h2994n7380j16738J18045l50j968p0474n6997J50601J16724K37686J63586
$$ -82994 -140374 -257112 -139067 -139417 -141385 -211859 -268856 -118255 -1531 236155 399741
14431C99741l2179j46667k50818p1172q1574k2058j6825O9722R4265J51818j50074
$$ 399741 367562 220895 -29923 -101095 -182669 -204727 -221552 -151830 -57565 94253 -55821
14420e5821K59513K33592j01239J02396N0759j01405l8397k2965j00138n2602
$$ -55821 203692 437284 336045 438441 489200 387795 349398 326433 226295 173693
14410A73693M8428m2708J10200J58349n7424j18369K0044M6667n0859j68431j40813
$$ 173693 222121 179413 289613 447962 390538 272169 292213 338880 288021 119590 -21223
$$ [...]
##END NTUPLES=NMR SPECTRUM
##END=
