##TITLE=Analysis number 325069
Compound Code cc 56301
Book Reference 513/15/38
Project Code adrs
Chemist Name ronp
##JCAMPDX= 6.0         $$ Bruker NMR JCAMP-DX V2.0
##DATA TYPE= NMR SPECTRUM
##DATA CLASS= NTUPLES
##ORIGIN= Bruker BioSpin GmbH
##OWNER= nmr
$$ XWIN-NMR		Version 3.5
$$ Fri Dec  8 11:53:14 2006 GMT Standard Time (UT+0h)  MAYBRIDGE\nmr@NMR_250MHZ
##.OBSERVE FREQUENCY= 250.131544655141
##.OBSERVE NUCLEUS= ^1H
##.ACQUISITION MODE= SIMULTANEOUS (DQD)
##.ACQUISITION SCHEME= undefined
##.AVERAGES= 16
##.DIGITISER RES= 18
##SPECTROMETER/DATA SYSTEM= dpx250
##.PULSE SEQUENCE= zg30
##.SOLVENT NAME= DMSO
##.SHIFT REFERENCE= (INTERNAL, DMSO, 0, 16.522)
##AUDIT TRAIL= $$ (NUMBER, WHEN, WHO, WHERE, WHAT)
$$ ##TITLE= Audit trail, XWIN-NMR		Version 3.5
$$ ##JCAMPDX= 5.01
$$ ##ORIGIN= Bruker BioSpin GmbH
$$ ##OWNER= nmr
$$ C:\u/data/dgb/nmr/ADRS/540/pdata/1/auditp.txt
$$ ##AUDIT TRAIL=  $$ (NUMBER, WHEN, WHO, WHERE, WHAT)
(   1,<2006-12-08 11:52:52.65 +000>,<MAYBRIDGE\nmr>,<NMR_250MHZ>,
      <created by zg, POWCHK disabled, PULCHK disabled
       configuration hash MD5:
       49 4B E0 1D 92 C2 6B 37 9F E6 65 BC 52 41 86 1D
       data hash MD5: 64K
       6F AC 6E 2D B9 56 E5 2A 7C 20 C0 70 FA EC 9A FD>)
(   2,<2006-12-08 11:53:05.42 +000>,<MAYBRIDGE\nmr>,<NMR_250MHZ>,
      <Start of raw data processing
       ef LB = 0.3 FT_mod = 6 PKNL = 1 SI = 32K 
       data hash MD5: 32K
       1C B4 27 A9 CC C9 FD F6 1E E8 C8 32 50 5A 65 E9>)
(   3,<2006-12-08 11:53:07.35 +000>,<MAYBRIDGE\nmr>,<NMR_250MHZ>,
      <apk 
       data hash MD5: 32K
       B6 FA E2 92 A2 D9 D7 D5 99 9D 8F 55 86 CA 11 F8>)
(   4,<2006-12-08 11:53:08.14 +000>,<MAYBRIDGE\nmr>,<NMR_250MHZ>,
      <abs ABSG = 5 
       data hash MD5: 32K
       8D 39 B5 F0 B7 16 13 22 F7 92 DE A3 E5 EB 04 BE>)
$$ ##END=
$$ 
$$ hash MD5
$$ 13 05 1E 81 89 31 B5 DA 01 A3 D3 A2 B7 71 CF A7
##$RELAX= 
##$RELAX= 
##$RELAX= 
##$RELAX= 
##$RELAX= 
##$RELAX= 
##$RELAX= 
$$ Bruker specific parameters
$$ --------------------------
##$DU= <C:\u>
##$EXPNO= 540
##$NAME= <ADRS>
##$PROCNO= 1
##$TYPE= <nmr>
##$USER= <dgb>
##$AMP= (0..31)
100 100 100 100 100 100 100 100 100 100 100 100 100 100 100 100 100 100 
100 100 100 100 100 100 100 100 100 100 100 100 100 100 
##$AQSEQ= 0
##$AQ_mod= 3
##$AUNM= <au_zg>
##$AUTOPOS= <23 >
##$BF1= 250.13
##$BF2= 250.13
##$BF3= 250.13
##$BF4= 250.13
##$BF5= 500.13
##$BF6= 500.13
##$BF7= 500.13
##$BF8= 500.13
##$BYTORDA= 1
##$CFDGTYP= 0
##$CFRGTYP= 5
##$CHEMSTR= <none>
##$CNST= (0..31)
1 1 145 1 1 1 1 1 1 1 1 1 1 1 1 1 1 1 1 1 1 1 1 1 1 1 1 1 1 1 1 1 
##$CPDPRG= <>
##$CPDPRG1= <>
##$CPDPRG2= <>
##$CPDPRG3= <>
##$CPDPRG4= <mlev>
##$CPDPRG5= <mlev>
##$CPDPRG6= <mlev>
##$CPDPRG7= <mlev>
##$CPDPRG8= <mlev>
##$CPDPRGB= <>
##$CPDPRGT= <>
##$D= (0..31)
0 1 0 0 0 0 0 0 0 0.06 0 0 0 0 0 0 0.0002 0 0 0 0 0 0 0 0 0 0 0 0 0 0 
0 
##$DATE= 1165578771
##$DBL= (0..7)
120 120 120 120 120 120 120 120 
##$DBP= (0..7)
150 150 150 150 150 150 150 150 
##$DBP07= 0
##$DBPNAM0= <>
##$DBPNAM1= <>
$$ [...]
##$SUBNAM7= <"">
##$SUBNAM8= <"">
##$SUBNAM9= <"">
##$SW= 20.6930455092707
##$SWIBOX= (0..15)
0 0 3 0 0 0 0 0 0 0 0 0 0 0 0 0 
##$SW_h= 5175.983436853
##$TD= 65536
##$TD0= 1
##$TE= 295.16
##$TE2= 300
##$TE3= 300
##$TEG= 300
##$TL= (0..7)
0 120 120 120 120 120 120 120 
##$TP= (0..7)
150 150 150 150 150 150 150 150 
##$TP07= 0
##$TPNAME0= <>
##$TPNAME1= <>
##$TPNAME2= <>
##$TPNAME3= <>
##$TPNAME4= <>
##$TPNAME5= <>
##$TPNAME6= <>
##$TPNAME7= <>
##$TPOAL= (0..7)
0.5 0.5 0.5 0.5 0.5 0.5 0.5 0.5 
##$TPOFFS= (0..7)
0 0 0 0 0 0 0 0 
##$TUNHIN= 0
##$TUNHOUT= 0
##$TUNXOUT= 0
##$USERA1= <user>
##$USERA2= <user>
##$USERA3= <user>
##$USERA4= <user>
##$USERA5= <user>
##$V9= 5
##$VALIST= <valist>
##$VCLIST= <CCCCCCCCCCCCCCC>
##$VD= 0
##$VDLIST= <DDDDDDDDDDDDDDD>
##$VPLIST= <PPPPPPPPPPPPPPP>
##$VTLIST= <TTTTTTTTTTTTTTT>
##$WBST= 1024
##$WBSW= 4
##$XGAIN= (0..3)
0 0 0 0 
##$XL= 0
##$YL= 0
##$YMAX_a= 218712
##$YMIN_a= -273186
##$ZGOPTNS= <>
##$ZL1= 120
##$ZL2= 120
##$ZL3= 120
##$ZL4= 120
##$ABSF1= 16.522
##$ABSF2= -4.171173
##$ABSG= 5
##$ABSL= 3
##$ALPHA= 0
##$AQORDER= 0
##$ASSFAC= 0
##$ASSFACI= 0
##$ASSFACX= 0
##$ASSWID= 0
##$AUNMP= <proc_1d>
##$AZFE= 0.1
##$AZFW= 0.1
##$BCFW= 0
##$BC_mod= 0
##$BYTORDP= 0
##$COROFFS= 0
##$CY= 12.5
##$DATMOD= 1
##$DC= 0
##$DFILT= <>
##$DTYPP= 0
##$F1P= 14.0000005364418
##$F2P= -0.99999901652339
##$FCOR= 0.5
##$FTSIZE= 32768
##$FT_mod= 6
##$GAMMA= 0
##$GB= 0
##$INTBC= 1
##$INTSCL= 1
##$ISEN= 128
##$LB= 0.3
##$LEV0= 0
##$LPBIN= 0
##$MAXI= 10000
##$MC2= 0
##$MEAN= 0
##$ME_mod= 0
##$MI= 0
##$NCOEF= 0
##$NC_proc= -5
##$NLEV= 6
##$NOISF1= 0
##$NOISF2= 0
##$NSP= 0
##$NTH_PI= 0
##$NZP= 0
##$OFFSET= 16.522
##$PC= 1
##$PHC0= 187.3011
##$PHC1= 74.86932
##$PH_mod= 1
##$PKNL= yes
##$PPARMOD= 0
##$PSCAL= 4
##$PSIGN= 0
##$REVERSE= no
##$SF= 250.13
##$SI= 32768
##$SIGF1= 0
##$SIGF2= 0
##$SINO= 400
##$SIOLD= 32768
##$SREGLST= <1H.DMSO>
##$SSB= 0
##$STSI= 32768
##$STSR= 0
##$SW_p= 5175.98343685301
##$SYMM= 0
##$S_DEV= 0
##$TDeff= 65536
##$TDoff= 0
##$TI= <Analysis number 999999
Compound Code 99
Book Reference 9
Project Code 9>
##$TILT= no
##$TM1= 0
##$TM2= 0
##$TOPLEV= 0
##$USERP1= <user>
##$USERP2= <user>
##$USERP3= <user>
##$USERP4= <user>
##$USERP5= <user>
##$WDW= 1
##$XDIM= 32768
##$YMAX_p= 500288581
##$YMIN_p= -24856735
$$ End of Bruker specific parameters
$$ ---------------------------------
##NTUPLES= NMR SPECTRUM
##VAR_NAME=  FREQUENCY,     SPECTRUM/REAL,   SPECTRUM/IMAG
##SYMBOL=    X,             R,               I
##VAR_TYPE=  INDEPENDENT,   DEPENDENT,       DEPENDENT
##VAR_FORM=  AFFN,          ASDF,            ASDF
##VAR_DIM=   32768,         32768,           32768
##UNITS=     HZ,            ARBITRARY UNITS, ARBITRARY UNITS
##FACTOR=    0.157963299565203, 1,           1
##FIRST=     4132.6476996994, 0,             0
##LAST=      -1043.33573715361, 0,           0
##MIN=       -1043.33573715361, -24856735,   0
##MAX=       4132.6476996994, 500288581,     0
$$ Real data points
##PAGE= N=1
##DATA TABLE= (X++(R..R)), XYDATA
$$ [...]
15861G784M4492P8408L1343N2536j3674j00968p7548l1425O0255k2591l9796M9199
$$ 7784 52276 130684 162027 214563 200889 99921 22373 -9052 51203 28612 -11184 38015
15849C8015N1612M6772J0369m3562k9044l3559O9966M3463j25883p3909L5192
$$ 38015 89627 136399 146768 103206 74162 40603 110569 154032 28149 -45760 -10568
15838a0568q2042R2660K9747j0521m9460K5792j47724j64156j0391J7171m2980
$$ -10568 -92610 50 29797 19276 -30184 -4392 -152116 -316272 -326663 -309492 -352472
15827c52472J95725J03844J24937m4648j01622P7841Q0791p2940r7298l4850O758
$$ -352472 -156747 -52903 72034 27386 -74236 3605 84396 11456 -85842 -120692 -113934
15816a13934k303k7185J04032n9270m3236R3428M8655J6153q3921M0287N9126
$$ -113934 -116237 -143422 -39390 -98660 -141896 -48468 187 16340 -67581 -27294 31832
15805C1832j8465j27170j9193P1766J06902k4806K8857j15451l3720p3765o357
$$ 31832 13367 -113803 -132996 -61230 45672 20866 49723 -65728 -99448 -173213 -179570
15794a79570m332o1651r0505N3102J69277J43154j46933K9395M3947o807J6213
$$ -179570 -183902 -245553 -336058 -282956 -113679 29475 -117458 -88063 -44116 -50923 -34710
15783c4710J15241J24275O8258j28325k01437l4379N1029M9515p7722j7139K3710
$$ -34710 80531 204806 273064 144739 -56698 -91077 -40048 9467 -68255 -85394 -61684
15772f1684k913K3586L0273r37q2585o8632M4606o6857j00346M003O1473p4878
$$ -61684 -64597 -41011 -10738 -11675 -94260 -162892 -118286 -185143 -285489 -281486 -220013 -294891
15760b94891P0970K400N6917O0024J66954J56003qL49994Q70374J836652L089564
$$ -294891 -223921 -221521 -164604 -104580 62374 218377 218369 568363 1438737 3275389 6364953
15749F364953J915756j568309k209759j609318r18445o19833k95829k49742k54414
$$ 6364953 8280709 6712400 4502641 2893323 1974878 1355045 1059216 809474 555060
15740E55060j57870q1189L2800J0849N8254p2742o7383j5893L6019P777m1052
$$ 555060 397190 316001 348801 359650 417904 345162 277779 261886 297905 305682 264630
15729B64630j07847P2708j15931p3518J9767j6112L419J4781Q3105j23012J09178
$$ 264630 156783 229491 113560 40042 59809 43697 47116 61897 145002 21990 131168
15718A31168N6962j15230j32243P9080P8788P2271L9k3648m6534J49666l0060
$$ 131168 188130 72900 -59343 19737 98525 170796 170835 147187 100653 250319 220259
15707B20259j86393K445P2546Q6733j52398r6703J38544K115k1020J6508Q3460
$$ 220259 33866 36311 108857 195590 43192 -53511 85033 87148 66128 82636 166096
15696A66096N3627l1394R817m6548j68652j47928O0565J00333k0226l6691j96
$$ 166096 219723 188329 198146 151598 -17054 -164982 -104417 -4084 -24310 -61001 -61197
15685f1197O6264N0322p4036K3049M2539O4770J1763k7562j46996J6095O1n3325
$$ -61197 5067 55389 -18647 4402 46941 111711 123474 95912 -51084 -34989 -34928 -88253
15673h8253J0714M3744J4120j8580j30154n9507J12686O8624O6045K2239l2557
$$ -88253 -77539 -33795 -19675 -38255 -168409 -227916 -115230 -46606 19439 41678 9121
15662I121l8904K9614P3932L0225k1163J2503k6287m3037K2199l1212J01449J0250
$$ 9121 -29783 -169 73763 103988 82825 95328 69041 26004 48203 16991 118440 128690
15650A28690K5366J8487p1322L155M4459l5481o0537m6064q7588j9493M5086O4841
$$ 128690 154056 172543 101221 104376 148835 113354 52817 6753 -80835 -100328 -55242 9599
15638I599L8295n7114k7879K9957R0017q3087o4448N1855J38416L9730L7396p613
$$ 9599 47894 -9220 -37099 -7142 82875 -212 -64660 -12805 125611 165341 202737 195124
15626A95124j45532J9774j1886L3071L0909O1617o753k4147l8599r2998m7508
$$ 195124 49592 69366 57480 90551 121460 183077 176324 152177 113578 20580 -26928
15615b6928M845O5900Q1942M5642M789j19472Q03j59306J1594J13029R0716M386
$$ -26928 -22083 43817 125759 171401 176190 56718 57521 -101785 -90191 22838 113554 117940
15603A17940j70584m8332P3354J05925K7842J4451m032p3638o6294N8239Q336
$$ 117940 -52644 -100976 -27622 78303 106145 120596 116564 42926 -23368 34871 43207
15592D3207M306O1668n9075j07704j31147L1073o4299P6490O5930K7008k006N9861
$$ 43207 47513 109181 50106 -57598 -188745 -157672 -221971 -145481 -79551 -52543 -54549 5312
15580E312j44447n9064J07433L1608j27322M2773K23320K1328p8092m2900P1732
$$ 5312 -139135 -198199 -90766 -59158 -186480 -143707 79613 100941 22849 -20051 51681
15569E1681j0875P4780o0146p2974k10425R2993J15398O8207k7873l9159L5723
$$ 51681 40806 115586 55440 -17534 -227959 -134966 -19568 48639 20766 -18393 17330
15558A7330m6157J7177O2149Q3332j00132j43620J31128M4111k123M8723o6297
$$ 17330 -28827 -11650 50499 133831 33699 -109921 21207 65318 63195 111918 45621
15547D5621j65027m7811k7359Q6066k2753M1432R3075Q5261r408j29784j19886
$$ 45621 -119406 -167217 -194576 -108510 -131263 -89831 3244 88505 79097 -50687 -170573
15536a70573Q0689M1018K709J19971j7712L8950J5458n8261m8461N5945q6513
$$ -170573 -89884 -48866 -46157 73814 56102 95052 110510 52249 3788 59733 -26780
15525b6780m3861J9025n2531N68J12350r8654j21089J7064K6891J21583q7112
$$ -26780 -70641 -51616 -104147 -103579 8771 -89883 -210972 -193908 -167017 -45434 -132546
15514a32546N3693J08449k9222k8341n911L880J0482o2069O7349m1258p3806R9024
$$ -132546 -78853 29596 374 -27967 -33878 -29998 -19516 -81585 -14236 -55494 -129300 -30276
15502c0276m5003p2322o9643N1063P8778r198p9099r1453L655J41001J33129K19567
$$ -30276 -75279 -147601 -217244 -166181 -87403 -96601 -175700 -267153 -263498 -122497 10632 230199
15490B30199J0792l0518k5636j00988j47510j29990j917P2224O2687K849P8825
$$ 230199 240991 210473 184837 83849 -63661 -193651 -195568 -123344 -60657 -57808 21017
15479B1017j1212l4542J32707j9348j69405l1651L1820m5033P6211O2096p7589
$$ 21017 9805 -24737 107970 88622 -80783 -112434 -80614 -125647 -49436 12660 -64929
15468f4929q6181j14863K1664J76256Q0483j14830N5293R6483r0707m5286K018
$$ -64929 -151110 -265973 -244309 -68053 12430 -102400 -47107 49376 -41331 -86617 -84599
15457h4599J3802m5901L0950l1910O2082M575p9880p9198l6987j1092L5533Q0373
$$ -84599 -70797 -116698 -85748 -117658 -55576 -51001 -130881 -210079 -247066 -258158 -222625 -142252
15445a42252R1386k450l7499P7929M7197L2089J1133p0371l7706P3067P7971r263
$$ -142252 -50866 -53316 -90815 -12886 34311 66400 77533 7162 -30544 42523 120494 111231
15433A11231r7703J17187N3396j19199l0708J4922Q403L7651k9665j04005o1616
$$ 111231 13528 130715 184111 64912 34204 49126 57529 95180 65515 -38490 -100106
15422a00106j9215M6243M5517P1242M960J1201n7675j28967j6513o6537k500J40291
$$ -100106 -119321 -73078 -27561 43681 48641 59842 2167 -126800 -143313 -209850 -212350 -72059
15410g2059Q1559o9783j06672M6548N7107q3898R3311J91092l7656l9885K365
$$ -72059 9500 -60283 -166955 -120407 -63300 -147198 -53887 137205 99549 59664 62029
15399F2029p9013k3835j4543J6676k9679P809L1401k7658l0676N228N7936j1699
$$ 62029 -16984 -40819 -55362 -38686 -68365 -60556 -29155 -56813 -87489 -82261 -24325 -36024
15387c6024J6209j4198J8898K4383o6552r1318j8697J68212J09631j19420K1990
$$ -36024 -19815 -34013 -15115 9268 -57284 -148602 -167299 913 110544 -8876 13114
15376A3114o5227r0056k1653L687M0891O4721l4995n9119k039J1355L4259J4642
$$ 13114 -52113 -142169 -163822 -160135 -119244 -54523 -89518 -148637 -150676 -139321 -105062 -90420
15364i0420J1989j58250j14889J0231J14122J46484K9150k6175j24731Q6291L2203
$$ -90420 -78431 -236681 -351570 -341339 -227217 -80733 -51583 -77758 -202489 -116198 -83995
15353h3995J5087j11497p9750n26J31899Q8525q3862j8899q2545Q2741K9283J01476
$$ -83995 -68908 -180405 -260155 -260681 -128782 -40257 -124119 -143018 -225563 -142822 -113539 -12063
15341a2063p018P014K0413r3832O9467M778j11079j17774J5517L2509j6219N4464
$$ -12063 -19081 -12067 8346 -85486 -16019 -11241 -122320 -240094 -224577 -192068 -208287 -153823
15329a53823L4695L4340J18256O9027l8450p6881M4506k5517J8017n2028k7631
$$ -153823 -119128 -84788 33468 102495 64045 -12836 31670 6153 24170 -27858 -55489
15318e5489J30944N9133M0020j08352j8177M4914j31748k34983O076M8190o7111
$$ -55489 75455 134588 174608 66256 48079 92993 -38755 -273738 -267662 -219472 -286583
15307b86583J11126J42281q5107j60453P4097M867q4583P2123J90370n9399o5698
$$ -286583 -175457 -33176 -118283 -278736 -204639 -199772 -284355 -212232 -21862 -81261 -146959
15296a46959K3213Q9155K9004J30554O6023o3414j89940j7844M6178j04541j37123
$$ -146959 -123746 -34591 -5587 124967 190990 127576 -62364 -80208 -34030 -138571 -275694
15285b75694l0137J10399J15683K3621p9548m6367L5408L2534l3226m4069O1045
$$ -275694 -305831 -195432 -79749 -56128 -135676 -182043 -146635 -114101 -147327 -191396 -130351
15274a30351J72764j6406q3314j45822j82887K8341M9228N3077L6593j2908p4464
$$ -130351 42413 26007 -57307 -203129 -386016 -357675 -308447 -255370 -218777 -231685 -306149
15263c06149J22732J18136M1952j25694o8074K1052N9800K3253J13532k9966k9490
$$ -306149 -183417 -65281 -23329 -149023 -217097 -196045 -136245 -112992 540 -29426 -58916
15252e8916M830J8074j2033q9835N4133K4630J06610N817r4627l4262j2662j55087
$$ -58916 -54086 -36012 -48045 -137880 -83747 -59117 47493 53310 -41317 -75579 -88241 -243328
15240b43328L8980R5311P7801j7610l9382L9792m1367N9264J1057p4702M0950
$$ -243328 -204348 -109037 -31236 -48846 -88228 -48436 -89803 -30539 -19482 -94184 -53234
15229e3234p1429o8834L530J6189l7332l8935j37124q330K4999j6675L9331M149
$$ -53234 -124663 -193497 -189967 -173778 -211110 -250045 -387169 -395499 -370500 -387175 -347844 -343695
15217c43695J46561O6114o1329k8117R0011M6395o0329L4565m1259J9489R517
$$ -343695 -197134 -131020 -192349 -220466 -130455 -84060 -144389 -109824 -151083 -131594 -122077
15206a22077k5385J12758N313l7351K3695L4013L0810L4866j25931M951P6716
$$ -122077 -147462 -34704 -29391 -66742 -43047 -9034 21776 56642 -69289 -64338 12378
15195A2378N3409k7881m9653m4289l5620n3755j11026L1628Q4061J11621q6641
$$ 12378 65787 37906 -11747 -56036 -91656 -145411 -256437 -224809 -140748 -29127 -115768
15184a15768j54962J25144O3893N9690k4504l9419l335k0767J16623K362n1981
$$ -115768 -270730 -145586 -81693 -22003 -46507 -85926 -89261 -110028 6595 8957 -43024
15173d3024J71641J21543j12016k13690q6550O716N8795J28460r7301j9390m7919
$$ -43024 128617 250160 138144 -75546 -162096 -155380 -96585 31875 -65426 -84816 -132735
15162a32735j09383K8675Q1078l2197j15742O3528L0819m3885j8684J14481k6894
$$ -132735 -242118 -213443 -132365 -164562 -280304 -216776 -185957 -229842 -248526 -134045 -160939
15151a60939r841M5397J22843l7443M539Q3713M17p0905P694p648p5853m621J05120
$$ -160939 -170780 -125383 -2540 -39983 -35444 48269 48686 -22219 -14525 -22173 -98026 -102647 2473
15138B473j4491L0748P2442J6421j43103l0718l3028p3357m7770K4911R9054O6200
$$ 2473 -12018 18730 91172 107593 -35510 -66228 -99256 -172613 -220383 -195472 -96418 -30218
15126c0218l1743M565R9516J9542r7828p2128J1553p2633N1612m4714L904k0381
$$ -30218 -61961 -57396 42120 61662 -36166 -108294 -96741 -169374 -117762 -162476 -158572 -178953
15114a78953L9623k9212J53895J45790m9196j3103q9018j73229l9256R4109K0069
$$ -178953 -139330 -168542 -14647 131143 81947 68844 -20174 -193403 -232659 -138550 -118481
15103a18481j30846Q9327J72963R1452K8481K8556n4054J5244j0953K0645M0197
$$ -118481 -249327 -160000 12963 104415 132896 161452 107398 122642 111689 132334 172531
15092A72531j2020J3730N256j00625R943j0294n5591J8816N896o781j834j47292
$$ 172531 160511 174241 179497 78872 88815 78521 22930 41746 47642 40861 39027 -108265
15080a08265P414Q0465n9899q2006l5039K2174J3058R3010J13582p8809n0223
$$ -108265 -100851 -20386 -80285 -162291 -197330 -175156 -162098 -69088 44494 -34315 -84538
15069h4538J1005q0355j25067m062O8928P9534J27194O5152m6557j20030j04180
$$ -84538 -73533 -153888 -278955 -283017 -214089 -134555 -7361 57791 11234 -108796 -212976
15058b12976L8572Q4970K3779q589P7149J12577n716o3123M476p4315o7594n2170
$$ -212976 -174404 -89434 -65655 -74244 2905 115482 109766 46643 51119 -23196 -90790 -142960
15046a42960K151K4605N5746j3039j51417l9909p7359n3590J05597R5370O1666
$$ -142960 -140809 -116204 -60458 -73497 -224914 -264823 -342182 -395772 -290175 -194805 -133139
15035a33139N4215l053m336Q8376l7984M8997o5142m5255M4060J8140o5646k9593
$$ -133139 -78924 -81977 -86313 2063 -35921 13076 -52066 -97321 -53261 -35121 -100767 -130360
15023a30360O7192q166j76487N3727J14020l851j16840k3262O8745J95026L6123
$$ -130360 -63168 -71334 -247821 -194094 -80074 -83925 -200765 -224027 -155282 39744 75867
15012G5867k4007o21m0640p2150l5137k3875J09211J33780j04876j88742Q4482
$$ 75867 51860 51239 10599 -61551 -96688 -120563 -11352 122428 17552 -171190 -86708
15001h6708J45351j8193q8158j04273L1769J6660j03189M2720P3274J02755M7034
$$ -86708 58643 40450 -47708 -151981 -120212 -103552 -206741 -164021 -90747 12008 59042
14990E9042n5952j25102M344n2845q5061L018K5779P4005J60864O3304J8478r2590
$$ 59042 3090 -122012 -117668 -170513 -255574 -252556 -226777 -152772 8092 71396 89874 -2716
14978b716j8497J4457l2301k7934P0247j0110m3556P891o2132L6943k3165j4788
$$ -2716 -21213 -6756 -39057 -66991 3256 -6854 -50410 -42519 -104651 -67708 -90873 -105661
14966a05661o9882p9482M7789N5470n4774n0123N1986o0402l7361J07235k234
$$ -105661 -175543 -255025 -207236 -151766 -206540 -256663 -204677 -265079 -302440 -195205 -197439
14955a97439J0792K2262j00580N6903J17556j36343j32537j486J69291N7773K8183
$$ -197439 -186647 -164385 -264965 -208062 -90506 -226849 -359386 -360872 -191581 -133808 -105625
14944a05625j14368p5458O3091J17730q076O0199k031n7871o6167j3817k4462
$$ -105625 -219993 -295451 -232360 -114630 -122706 -62507 -64538 -122409 -188576 -202393 -226855
14933b26855M2435J5387N8160j1214N3756J09938o1046n3854Q8764p6800j0050
$$ -226855 -184420 -169033 -110873 -122087 -68331 41607 -19439 -73293 15471 -61329 -71379
14922g1379l4469n7856j320Q2605J11413l4303P336K6212o8186r5444q6347N7043
$$ -71379 -105848 -163704 -165024 -82419 28994 -5309 2027 28239 -39947 -135391 -221738 -164695
14910a64695L8460R934L1849N5791J04858P0912m8563K9475o8188q4616k4899
$$ -164695 -126235 -116301 -84452 -28661 76197 147109 98546 128021 59833 -24783 -49682
14899d9682O1855r6072j00824J06394Q2339R6534L7189q7078j43643m5879N6924
$$ -49682 12173 -83899 -184723 -78329 4010 100544 137733 50655 -92988 -138867 -81943
14888h1943n8821n5612q2966K5465J37825j5251j40098r713P8276R2934K0419
$$ -81943 -140764 -196376 -279342 -253877 -116052 -131303 -271401 -281114 -202838 -109904 -89485
14877h9485O7235R1829K0947j4074m0608M1047O206M2384q6802n9284q8912j37352
$$ -89485 -22250 69579 90526 76452 35844 76891 83097 125481 38679 -20605 -109517 -246869
14865b46869J0615P0257j5976J11850R6575p6203k1396j6413k5133K0705J83698
$$ -246869 -236254 -165997 -181973 -70123 26452 -49751 -71147 -87560 -112693 -91988 91710
14854I1710J3334m5854k4369o0007n0934O7593K7536o2728k9609L9141j2179l1086
$$ 91710 105044 59190 34821 -25186 -76120 -8527 19009 -43719 -73328 -34187 -46366 -77452
14842g7452J23255M6235N3650n2582L8113l8306L4426L0210j13221o9678l9120
$$ -77452 45803 92038 145688 93106 131219 92913 127339 157549 44328 -25350 -64470
14831f4470j18127n6047n0182K21493K6584j5889Q2685r0083l2549O3378N9180
$$ -64470 -182597 -238644 -288826 -67333 -40749 -56638 26047 -64036 -96585 -33207 25973
14820B5973k7557l977q2483n6408R229k1210N7372N1349K5635K5841K0035L6855
$$ 25973 -1584 -5561 -88044 -144452 -135223 -156433 -99061 -47712 -22077 3764 23799 60654
14808F0654J9313L2902k3111j65430j00837L7562J92699l201N419K1082l7296
$$ 60654 79967 112869 89758 -75672 -176509 -138947 53752 50551 55970 77052 39756
14797C9756p2632Q700J39607J19172K1158j83368j47971n1110N6556M1085m3019
$$ 39756 -32876 -24176 115431 234603 255761 72393 -75578 -126688 -70132 -29047 -72066
14786g2066p6383M344O1019M7732l1771j12068j05401j33811m8796J10550J19531
$$ -72066 -148449 -144105 -83086 -35354 -67125 -179193 -284594 -418405 -467201 -356651 -237120
14775b37120K464q348M9891L7188n0808J98K1015R3407l0125j03467n3226L6153
$$ -237120 -234656 -243004 -193113 -155925 -206733 -206535 -185520 -92113 -122238 -225705 -278931 -242778
14763b42778p5242n5241Q0036R5689Q2656k4454M4894L296j10636j6213P6128
$$ -242778 -318020 -373261 -293225 -197536 -114880 -139334 -94440 -91144 -201780 -217993 -141865
14752a41865J33498M7413j31005J3971j9573m1125r530L1773Q746j23641M7489
$$ -141865 -8367 39046 -91959 -77988 -97561 -138686 -148216 -116443 -107697 -231338 -183849
14741a83849L0642j2160J7020O258J34918J32437p9732j67760j41094l7089k7951
$$ -183849 -153207 -165367 -148347 -142089 -7171 125266 45534 -122226 -263320 -300409 -328360
14730c28360J77624N7752n5800n6269J6670J18796P0373N1287l9625j41847j03698
$$ -328360 -150736 -92984 -148784 -205053 -188383 -69587 786 52073 12448 -129399 -233097
14719b33097R38R4309N6290L0417p0264j1224L1393n3479o0777P6209N5141N6531
$$ -233097 -232159 -137850 -81560 -51143 -121407 -132631 -101238 -154717 -215494 -139285 -84144 -27613
14707b7613n9554p0588K3199Q8766M9276L1018j18885L9634L736K7533p9575l4033
$$ -27613 -87167 -157755 -134556 -45790 3486 34504 -84381 -44747 -41011 -13478 -93053 -127086
14695a27086J08829J08859O2005j9846o6320q4989j45952P7886J37776L4119k7289
$$ -127086 -18257 90602 152607 132761 66441 -18548 -164500 -86614 51162 85281 57992
14684E7992q2758l5536K9177l8459J10025n1950p8039k037n820o3913O6771o3371
$$ 57992 -24766 -60302 -31125 -69584 40441 -11509 -89548 -91585 -97405 -161318 -94547 -157918
14672a57918N731L3644N9673Q1352K4319k1686r7031m2247j905m1704J8589P6752
$$ -157918 -152187 -118543 -58870 22482 46801 25115 -71916 -114163 -116068 -157772 -139183 -62431
14660f2431p9550j10931m9433P1799R0319N2049L9829J5213k708p4279p4645N5591
$$ -62431 -141981 -252912 -302345 -230546 -140227 -88178 -48349 -33136 -35844 -110123 -184768 -129177
14648a29177R17J44857N7573m9524j5333n6191l3141j42694j11929M7744J42300
$$ -129177 -128260 16597 74170 24646 9313 -46878 -80019 -222713 -334642 -286898 -144598
14637a44598k4063o2854r112o412M3340M7153J03362Q7700l7353k1660N2890n8178
$$ -144598 -168661 -231515 -240627 -247039 -203699 -156546 -53184 34516 -2837 -24497 28393 -29785
14625b9785j4039J47693K525j59424o7693n1419n6370K2081M8679K8454m6244
$$ -29785 -43824 103869 106394 -53030 -120723 -172142 -228512 -206431 -157752 -129298 -175542
14614a75542l1757j8453O5387J52393Q4989L3716p8844q7672L3516Q6589o4765
$$ -175542 -207299 -225752 -160365 -7972 77017 110733 31889 -55783 -22267 64322 -443
14603d43o381k5241j35906k7187k3228k9875K3192M5815Q6144J1088j40226L6311
$$ -443 -6824 -32065 -167971 -195158 -218386 -248261 -225069 -179254 -93110 -82022 -222248 -185937
14591a85937J70715O4507r8856l3874j01134K7045p010r8r1689M8331l6138m4690
$$ -185937 -15222 49285 -49571 -83445 -184579 -157534 -164544 -164642 -256331 -208000 -244138 -288828
14579b88828n1781O3063J08632M7661M405N4896q299J668J9806m6455l0948k2758
$$ -288828 -340609 -277546 -168914 -121253 -116848 -61952 -70251 -68583 -48777 -95232 -126180 -148938
14567a48938n8696J8301J03918n659j7426k308R742j4881N0868j0278k7208n8955
$$ -148938 -207634 -189333 -85415 -91074 -108500 -110808 -101066 -115947 -65079 -75357 -102565 -161520
14555a61520j7153o4156p4539j0094r306J27784J24385J31661o6694n6805j7918
$$ -161520 -178673 -242829 -317368 -327462 -336768 -208984 -84599 47062 -19632 -76437 -94355
14544i4355j4183q2157j1498N4646l0770N021j06586N6722M6496M7809m5594k2031
$$ -94355 -108538 -190695 -202193 -147547 -178317 -173296 -279882 -223160 -176664 -128855 -174449 -196480
14532a96480Q497L7143Q2590l5007r0525l6560K85K0756R0456k9537J28844P1322
$$ -196480 -187983 -150840 -68250 -103257 -193782 -230342 -230057 -209301 -118845 -148382 -19538 51784
14520E1784l0241m4873j8562J6434R6645k1357r5919r9995L0988o0643K9227K339
$$ 51784 21543 -23330 -41892 -25458 71187 49830 -46089 -146084 -115096 -175739 -146512 -144173
14508a44173O3771Q5258j05686r1334L7140R4645p793p5430k7742P5521O4801
$$ -144173 -80402 4856 -100830 -192164 -155024 -60379 -68172 -143602 -171344 -95823 -31022
14497c1022M5463K1454p2445m6835l8789j15266k1180M6188J68179R063j07520
$$ -31022 14441 35895 -36550 -83385 -122174 -237440 -258620 -212432 -44253 -35190 -142710
14486a42710k9330J2958N0547k8199j19759j12486R2471N1538O9310Q1709J19549
$$ -142710 -172040 -159082 -108535 -136734 -256493 -368979 -276508 -224970 -155660 -73951 45598
14475D5598k9524j1061p598m3648j30974j8879n2405j3972m8907o286J6852J59818
$$ 45598 16074 5013 -2585 -46233 -177207 -196086 -248491 -262463 -311370 -317656 -300804 -140986
14463a40986K52018K0268q9714J6963j43297L4040m02K1599j5251o9982J0264
$$ -140986 111032 131300 41586 58549 -84748 -50708 -51110 -29511 -44762 -114744 -104480
14452a04480O5524R6780L6098j38135K998j629N0370J66667L8980j6122j47505
$$ -104480 -38956 57824 93922 -44213 -41215 -42844 7526 174193 213173 197051 49546
14441D9546k00424J24425J79354M9799o9747q938P517j68817o9298j04445N1905
$$ 49546 -150878 -26453 152901 202700 132953 124015 131532 -37285 -106583 -211028 -159123
14430a59123J22073j2358N3791P1563J8482m5733j15946j74561N5975J31924j21312
$$ -159123 -37050 -49408 4383 75946 94428 48695 -67251 -241812 -185837 -53913 -175225
14419a75225p6728R947R7729P3685J01058Q5842j09499j1732J4297J13640j3113
$$ -175225 -251953 -242006 -144277 -70592 30466 116308 6809 -4923 9374 123014 109901
14408A09901p79j41543j34673m8521p5131L0982Q5643j9247j25769N4058R3872
$$ 109901 109122 -32421 -167094 -215615 -290746 -259764 -174121 -193368 -319137 -265079 -171207
14397a71207q5088j027m838q163P3282J3262l5047L7368J04008J3075m6536J3915
$$ -171207 -256295 -257322 -262160 -270323 -197041 -183779 -218826 -181458 -77450 -64375 -110911 -96996
14385i6996L7906K714n9414n5325O9206m459q1097J10599k5364J7911j6995j56387
$$ -96996 -59090 -56376 -115790 -171115 -101909 -106368 -187465 -76866 -102230 -84319 -101314 -257701
14373b57701O4353J41823k6374L8064L2067l2013P5032J3879j10878l2361m0616
$$ -257701 -193348 -51525 -77899 -39835 -7768 -39781 35251 49130 -61748 -94109 -134725
14362a34725q8193L0524J71131N3283j18278r065N9923l2692n326j05435j10005
$$ -134725 -222918 -192394 -21263 32020 -86258 -95323 -35400 -68092 -73418 -178853 -288858
14351b88858L0011J36937R061L757P3129j0590j18220q5116j6215K44519J84757
$$ -288858 -258847 -121910 -112849 -109092 -35963 -46553 -164773 -249889 -266104 -21585 163172
14340A63172n9035j62938j08320q156Q1326J08794K6807o7763n2248J95781k6878
$$ 163172 104137 -58801 -167121 -175277 -93951 14843 41650 -26113 -78361 117420 90542
14329I0542j30252j47562j00452j7883R1992P5643K8648l1793n254l694P699M6054
$$ 90542 -39710 -187272 -287724 -305607 -213615 -137972 -109324 -141117 -146371 -150065 -142366 -96312
14317i6312l91m7233m1724O7323J19348J32231r9525j55773oJ63517L5694m0954
$$ -96312 -96703 -143936 -185660 -118337 1011 133242 33717 -122056 -122062 41455 77149 36195
14305C6195K5340j7239p4700k4977q664J0359j44429j16073m4411P4611J65689
$$ 36195 61535 44296 -30404 -55381 -64045 -53686 -198115 -314188 -358599 -283988 -118299
14294a18299R7575q1855J9333J98884L6887j28457j8878R7125k4919P188J65535
$$ -118299 -20724 -102579 -83246 115638 152525 24068 5190 102315 77396 84584 250119
14283B50119n0569j48160m696K9018n5074l8196j9412L9579o1346Q065J03702
$$ 250119 199550 51390 46694 75712 20638 -17558 -36970 2609 -58737 -50672 53030
14272E3030J6108j21710J0401N7682O7904j7893J7621M1496l0591q0616j05329
$$ 53030 69138 -52572 -42171 15511 83415 65522 83143 124639 94048 13432 -91897
14261i1897L784O9813r0147n4786L3683Q4427o3708j51657o8630J9242M858J47042
$$ -91897 -88113 -18300 -108447 -163233 -129550 -45123 -108831 -260488 -329118 -309876 -305018 -157976
14249a57976J38190L7251R0250o936r8867Q949m5211j31190L1013Q4661o0101
$$ -157976 -19786 17465 107715 100779 1912 10861 -34350 -165540 -134527 -49866 -109967
14238a09967J5318P1472J40323l6978r7820q0686k7999q409K8324l3124K7060
$$ -109967 -94649 -23177 117146 80168 -17652 -98338 -126337 -134746 -106422 -139546 -112486
14227a12486J16421O1208o2559l0268P4185j144j03692M919n3499j36219Q629
$$ -112486 3935 65143 2584 -27684 46501 45357 -58335 -53416 -106915 -243134 -234505
14216b34505J80157P1781j3147n8093R7879R1879n6695j71707J23351M1814L0235
$$ -234505 -54348 17433 4286 -53807 44072 135951 79256 -92451 30900 72714 102949
14205A02949K8961Q0262j33902o8209Q14l9655j8418j061m8873J36363M1314j24854
$$ 102949 131910 212172 78270 10061 10875 -28780 -47198 -48259 -97132 39231 80545 -44309
14193d4309k50666P7182J13899o1540M490L3001K4534J25637o8876k31245j28250
$$ -44309 -294975 -217793 -103894 -165434 -160944 -127943 -103409 22228 -46648 -277893 -406143
14182d06143O1033J42350O4705m9829j16418r7782R1902J76170M4836j00196j29731
$$ -406143 -345110 -202760 -138055 -187884 -304302 -402084 -310182 -134012 -89176 -189372 -319103
14171c19103L4510J34194n047L1018m9295n9986l6542k0662P3122P7508L4500
$$ -319103 -284593 -150399 -155446 -124428 -173723 -233709 -270251 -290913 -217791 -140283 -105783
14160a05783m4654m3865j1685Q7378K182q2035q7091K9227J08894L6526O9336
$$ -105783 -150437 -194302 -205987 -118609 -116427 -198462 -285553 -256326 -147432 -110906 -41570
14149d1570M2714J12206l5355j59599K0649P7317K6355P6871j48214j46883o5875
$$ -41570 1144 113350 77995 -81604 -60955 16362 42717 119588 -28626 -175509 -241384
14138b41384m1105Q3254k8599O4248J51410L7766n8389k1858J5586N5594N7252
$$ -241384 -282489 -199235 -227834 -163586 -12176 25590 -32799 -54657 -39071 16523 73775
14127G3775M0195j97703j51934m895K4124Q8462L4852N1535j9928n3785O3668
$$ 73775 113970 -83733 -235667 -240562 -216438 -127976 -93124 -41589 -61517 -115302 -51634
14116e1634q5564o1787M2809k3085J4005r917N478L029K2230P6802M2590m9441
$$ -51634 -137198 -198985 -156176 -179261 -165256 -175173 -169695 -166666 -144436 -67634 -25044 -74485
14104g4485n6033m918q29P0585O904j45000K1796N1479J21700j3533L203r5932
$$ -74485 -130518 -135436 -136265 -65680 -58776 -203776 -181980 -130501 -8801 -22334 -19131 -115063
14092a15063m498m4341l0351J8021k0715Q536J9578j1599J0782J36836Q1906r9808
$$ -115063 -119561 -163902 -194253 -176232 -196947 -188411 -168833 -180432 -169650 -32814 49092 -50716
14080e0716j11722m5816Q344n4171L5521J03755J7014O705N9478O3408j5124j76321
$$ -50716 -162438 -208254 -199910 -254081 -218560 -114805 -97791 -91086 -31608 31800 16676 -159645
14068a59645O5587J16158J30741j7244k00602j1555n1857K8897N6162J08277O8268
$$ -159645 -94058 22100 152841 135597 -65005 -76560 -128417 -99520 -43358 64919 133187
14057A33187r0199m5504k9643j75290M1939J31200K37o5605j9930Q0186m2172
$$ 133187 42988 -2516 -32159 -207449 -165510 -34310 -34073 -99678 -119608 -39422 -81594
14046h1594j06394k399J45807M753J40473J03847m0208j76659l3584O3619q5004
$$ -81594 -187988 -190387 -44580 -39827 100646 204493 164285 -12374 -45958 17661 -67343
14035f7343Q8656K3807P817M4425m7895p0922n6217p8889m2227J7200Q3128L5209
$$ -67343 21313 45120 52937 97362 49467 -21455 -77672 -156561 -198788 -181588 -98460 -63251
14023f3251j16396j71806K2301Q6988L3603J09192j3081O1091k3950o1614m0922
$$ -63251 -179647 -351453 -329152 -242164 -208561 -99369 -112450 -51359 -75309 -136923 -177845
14012a77845K97j2380K3319J31309J13734m2592o1140J2106J07691o3704j16905
$$ -177845 -177548 -189928 -166609 -35300 78434 35842 -25298 -13192 94499 30795 -86110
14001h6110O6939O9757k6096o1286o5417J9748J69814l3045j08782J9365J4364
$$ -86110 -19171 50586 24490 -36796 -102213 -82465 87349 54304 -54478 -35113 -20749
13990b0749K8546P9600J01103j4810n4649q3890q7735K1554k2205j2578N2583
$$ -20749 7797 87397 188500 173690 119041 35151 -52584 -31030 -53235 -65813 -13230
13979a3230O8363Q0262p940j0167l7344Q62r9085L3250q5960k5440j10151l1854
$$ -13230 55133 135395 127455 117288 79944 80806 -18279 14971 -70989 -96429 -206580 -238434
13967b38434P7700O8852J06331j8443m7353l3685N9554J65418j06061n396L8581
$$ -238434 -160734 -91882 14449 -3994 -51347 -85032 -25478 139940 33879 28483 67064
13956F7064j12181j29573j72895j44895J7351J75436J33642k8191O2163R9904
$$ 67064 -45117 -174690 -347585 -492480 -475129 -299693 -166051 -194242 -132079 -32175
13946c2175M8582j3143O2508J12947l9149j52993L7424r7084m4115K4671N8591
$$ -32175 16407 3264 65772 178719 139570 -13423 24001 -73083 -117198 -92527 -33936
13935c3936J22L7122j1341j58739l1199O0365O8473K4837p9333q4258j25917k8182
$$ -33936 -33814 3308 -8033 -166772 -197971 -137606 -69133 -44296 -123629 -207887 -333804 -361986
13923c61986J68871Q8244J13274K3759P2588j4318M5587n6287k25142q4141M9305
$$ -361986 -193115 -104871 8403 32162 104750 90432 136019 79732 -145410 -229551 -180246
13912a80246P0193p3390M6074n098K5100N4311N6041j7999L6436n4345n2423J3785
$$ -180246 -110053 -183443 -137369 -142467 -117367 -63056 -7015 -25014 11422 -42923 -95346 -81561
13900h1561p4670K9192M0196j00537l4639p2769p2357R2525J31595r9641k9018
$$ -81561 -156231 -127039 -86843 -187380 -222019 -294788 -367145 -274620 -143025 -242666 -271684
13889b71684N8006j3234M1743J0740j4798M2278R4411K6135n7171L3116p9829
$$ -271684 -213678 -226912 -185169 -174429 -189227 -146949 -52538 -26403 -83574 -50458 -130287
13878a30287k4483J4339k0153O8252P0215J07631j2258j43336k7071O7262N76
$$ -130287 -154770 -140431 -160584 -92332 -22117 85514 73256 -70080 -97151 -29889 -29313
13867b9313L0843J6815j07952j0417n3427o7071Q9656K2101P2501P1908j1369
$$ -29313 1530 18345 -89607 -100024 -153451 -220522 -130866 -108765 -36264 35644 24275
13856B4275N3693Q7577J1749N9967m9759j78583j00892N2975O3389P3772q2154
$$ 24275 77968 165545 177294 237261 187502 8919 -91973 -38998 24391 98163 16009
13845A6009l7537k3899m2747o2130j73447Q8124J02555J0178L9872J75225n2241
$$ 16009 -21528 -45427 -88174 -150304 -323751 -235627 -133072 -122894 -83022 92203 39962
13834C9962j15681q700M745J11130n864j86078r8275l9127M4432M3614K15776
$$ 39962 -75719 -84419 -79674 31456 25592 -160486 -258761 -297888 -253456 -209842 5934
13823E934k9175R086R756j0142l8240l6032n425O4236L4466o031j26195j32765
$$ 5934 -23241 -14155 -4399 -14541 -52781 -88813 -94238 -30002 4464 -1567 -127762 -260527
13811b60527L6035J31851O8416N4703M3595N4276q764o3507k25379j44510R6523
$$ -260527 -224492 -92641 -24225 30478 74073 128349 119585 56078 -169301 -313811 -217288
13800b17288N5311k1310l2189p2871j1565L2156k6500N8147P4567J33928p3726
$$ -217288 -161977 -183287 -215476 -288347 -299912 -267756 -294256 -236109 -161542 -27614 -101340
13789a01340p7627l8596R9872J8391L3254K6706Q618j01036R5304J5971q6684
$$ -101340 -178967 -217563 -117691 -99300 -66046 -39340 -30722 -131758 -36454 -20483 -107167
13778a07167J2886O7432J120j64101N0800K08425k4720p3701J02988J15162j48105
$$ -107167 -94281 -26849 -25729 -189830 -139030 69395 44675 -29026 73962 189124 41019
13767D1019j71840r0542n9471k5183J50185J21384L7599k1954j34734p2157K6059
$$ 41019 -130821 -221363 -280834 -306017 -155832 -34448 3151 -18803 -153537 -225694 -199635
13756a99635Q8232L8888J3942M5954M4583L9614j2596m8524m0496r345M5137K7706
$$ -199635 -111403 -72515 -58573 -12619 31964 71578 58982 10458 -30038 -39383 5754 33460
13744C3460l4252J3900M9850q4980k045M5951n2632R044J25573J2912r4541j2971
$$ 33460 -792 13108 62958 -22022 -24067 21884 -30748 -21704 103869 116781 22240 9269
13732I269J4509l2456m957M620n29j4001p5876k461J20782j4865o2828k9249R3925
$$ 9269 23778 -8678 -13635 -9015 -9544 -23545 -99421 -101882 18900 4035 -58793 -88042 5883
13719E883J3003l7915j09524l5751n7072l3359Q5317O8369j865J06542n776j27757
$$ 5883 18886 -19029 -128553 -164304 -221376 -254735 -169418 -101049 -102914 3628 -2148 -129905
13707a29905J11969J38106j41696j02195L0843R2401J0510o5791j759O4P5901
$$ -129905 -17936 120170 -21526 -123721 -92878 -477 10033 -55758 -57517 -57453 18448
13696A8448L2695m8828L4830P7506J4981j0967J0458n5643j07665k3530j3801
$$ 18448 51143 2315 37145 114651 129632 118665 129123 73480 -34185 -57715 -71516
13685g1516n3349r132Q4290Q2161n0006l7571j9669N8731J31927r2502N916j6829
$$ -71516 -124865 -133997 -49707 32454 -17552 -55123 -74792 -16061 115866 23364 29280 12451
13673A2451Q5831L7524j3112O786K6039M6860k2025p8146q1614k9523P2327J2594
$$ 12451 98282 135806 122694 129480 155519 202379 180354 102208 20594 -8929 63398 75992
13661G5992K4310J1287K1382k9782K76j03466p3386o7774q2384q7550k1692L7381
$$ 75992 100302 111589 132971 103189 103465 -1 -73387 -141161 -223545 -311095 -332787 -295406
13649b95406L6341J34537M4383l8918L1312J708K9244J40122R3602k8040Q805
$$ -295406 -259065 -124528 -80145 -119063 -87751 -86043 -56799 83323 176925 148885 157690
13638A57690Q6729r693m1933J440O4721j25108q3690R2513L1397M072R373j15339
$$ 157690 244419 234726 192793 194233 258954 133846 50156 142669 174066 178138 187511 72172
13626G2172q648n7254l7603K1128L4943J12733L5430K0996o2082k6004j30829
$$ 72172 63524 6270 -31333 -10205 24738 137471 172901 193897 131815 105811 -25018
13615b5018m8859k2167J35541p0237j00660P7346J51590N7492j12595j60128q4209
$$ -25018 -73877 -96044 39497 -30740 -131400 -54054 97536 155028 42433 -117695 -201904
13604b01904J15074m928n1185P1091J14401L4808o7848j26999J0705J19511N8419
$$ -201904 -86830 -91758 -142943 -71852 42549 77357 9509 -117490 -106785 12726 71145
13593G1145J17294J05757j47847k17510J0328M2907J06457Q6196m191K9054q8334
$$ 71145 188439 294196 146349 -71161 -60833 -17926 88531 174727 170536 199590 111256
13582A11256n4730j0118q6337J2003J06490l2358o6042Q037q194J13877J21399
$$ 111256 56526 46408 -39929 -27926 78564 46206 -19836 -11799 -19993 93884 215283
13571B15283l8966K3565r6644q7535M8727q6961K867n6123L7187J0155O4031M4519
$$ 215283 176317 199882 103238 15703 64430 -22531 -19664 -75787 -38600 -28445 35586 80105
13559H0105j2267n4646q3696M380Q828q057k3406k6236R88N7176J67730K7401
$$ 80105 67838 13192 -70504 -66124 -57296 -65353 -88759 -114995 -114007 -56831 110899 138300
13547A38300p805K4371M6402p5545J4072m8617j07440M9729M1075K4407O8736
$$ 138300 130495 154866 201268 125723 139795 91178 -16262 33467 74542 98949 167685
13536A67685J569q83m3136j64099k7065L9311P0338J04989k3753j92379m4657
$$ 167685 169254 168371 125235 -38864 -65929 -26618 43720 148709 124956 -67423 -112080
13525a12080j1964l2905N9286J0009p6712N9870J66411o3840j68834o0246J26434
$$ -112080 -124044 -156949 -97663 -87654 -164366 -104496 61915 -1925 -170759 -231005 -104571
13514a04571J2372M8250k2090K3954N369o8178l0983q9663P4423J26299L2479
$$ -104571 -92199 -43949 -66039 -42085 -36716 -104894 -135877 -225540 -151117 -24818 7661
13503G661q8359j1068m7313o1397R007J00118r570N0588L4288J1188J6995q7363
$$ 7661 -80698 -91766 -139079 -200476 -191469 -91351 -100921 -50333 -16045 -4857 12138 -75225
13491g5225r4037m0236j6423L4980N6506J8402k1446P6943Q3679J30768J18505
$$ -75225 -169262 -209498 -225921 -190941 -134435 -116033 -137479 -60536 23143 153911 272416
13480B72416n4951j13768j9940K4025L7335o2160q5174p2229r656Q0932L3146
$$ 272416 217465 103697 83757 107782 145117 82957 -2217 -74446 -84102 -3170 29976
13469B9976M6733J0559p5566q9785j8888O3051J7052J9351Q0236N1708J8777R0824
$$ 29976 76709 87268 11702 -78083 -96971 -33920 -16868 2483 82719 134427 153204 244028
13457B44028J26218o1147j32987k5436p7324o6809j60776o9816j1791J29216J1164
$$ 244028 370246 309099 176112 150676 73352 6543 -154233 -224049 -235840 -106624 -95460
13446i5460J31660k6031J4218Q0602n7942j48156k5432J33179L6685p0361o7957
$$ -95460 36200 10169 24387 104989 47047 -101109 -126541 6638 43323 -27038 -94995
13435i4995P2637L9370J3908p555O174Q6352n4916J2365M2856L8667j06711q318
$$ -94995 -22358 17012 30920 23365 29539 115891 60975 73340 116196 154863 48152 39834
13423C9834K6446j11251j06266r372N8841Q9469Q0515l8953M2002k7895K7715
$$ 39834 66280 -44971 -151237 -160609 -101768 -12299 68216 29263 71265 43370 71085
13412G1085k3096o3387L6445q324Q5033L421K7310L9407j468L5993j11063j08476
$$ 71085 47989 -15398 21047 12723 97756 101177 128487 167894 166426 202419 91356 -17120
13400a7120l2664n7122o6801J0349J34266R7597j5765J7993Q576o0031k6249n4056
$$ -17120 -49784 -106906 -173707 -163358 -29092 68505 52740 70733 79309 19278 -6971 -61027
13388f1027O9183R117L5680L5660p1245n8873O0924k0866r7720m0515k0728K6072
$$ -61027 8156 17273 52953 88613 17368 -41505 19419 -1447 -99167 -139682 -160410 -134338
13376a34338K1723N4542k3751m4631O769J15289O0231O956j08609J25233J62683
$$ -134338 -112615 -58073 -81824 -126455 -119686 -4397 55834 62790 -45819 79414 242097
13365B42097j4557j40769m3227O3114M1235o8248k7399R9051R9518R4202o2772
$$ 242097 227540 86771 43544 106658 147893 79645 52246 151297 250815 345017 282245
13354B82245m7003o8458q3432k8601o4415l4071l2117K2791o7900L8489l8537
$$ 282245 235242 166784 83352 54751 -9664 -43735 -75852 -53061 -120961 -82472 -121009
13343a21009J19231M9606N5437r650k9505k6710j8041K498P8395p6640j36749
$$ -121009 -1778 47828 103265 93615 64110 37400 19359 21857 100252 23612 -113137
13332a13137j311J16347M1581K3101p09P104J3631l8086q1256n1312Q8848K1987
$$ -113137 -114448 1899 43480 66581 65872 72976 86607 48521 -32735 -84047 4801 26788
13320B6788q4736q3840Q5771L6275R3288R4447j4132n6654m9781n3981k918J4674
$$ 26788 -57948 -141788 -56017 -19742 73546 167993 153861 97207 47426 -6555 -9473 5201
13308E201j07290j03779J25163J75301L5023k819O2054p8102n384j16296n2840
$$ 5201 -102089 -205868 -80705 94596 129619 126800 188854 110752 105368 -10928 -63768
13297f3768J50436M3477m542j4289r8753j3041J2910J5814k1933q8544P5655R5410
$$ -63768 86668 130145 125603 111314 12561 -480 12430 28244 6311 -82233 -6578 88832
13285H8832K4234K0511l2290n220J3775J09820J10688o9726j88118r1275R6768
$$ 88832 113066 133577 101287 96067 109842 219662 330350 260624 72506 -18769 77999
13274G7999J07913J53801m1472k13696n3232m4287j1426M6752M4015Q9575L1044
$$ 77999 185912 339713 298241 84545 31313 -12974 -24400 22352 66367 155942 186986
13263A86986K3477l2666J2321m429J7544o6052l1873j8179n1780k2077Q64J3134
$$ 186986 210463 177797 190118 185689 203233 137181 105308 87129 35349 13272 14136 27270
13251B7270P559J16768M6802M8116R3782p1505j14201o4236k7529k0990m7564
$$ 27270 34829 151597 198399 246515 340297 268792 154591 90355 62826 41836 -5728
13240e728K2281L2948J08137m8804p9810J2792N3000K05608l4049j76690j11975
$$ -5728 16553 49501 157638 108834 29024 41816 94816 300424 266375 89685 -22290
13229b2290J4152N9882k0529r568l3019R7267Q6858n8469q685M8928J0791K0458
$$ -22290 -8138 51744 31215 21647 -11372 85895 172753 114284 105599 154527 165318 185776
13217A85776L3755j1965p5056J08797o3670j14973l6229o3247M9607L9439M154
$$ 185776 219531 207566 132510 241307 177637 62664 26435 -36812 12795 52234 56388
13206E6388J6518J1155j3024j0395J03011J02685o1672l7057N0158J0657q0679
$$ 56388 72906 84061 71037 60642 163653 266338 204666 167609 217767 228424 147745
13195A47745j08770L2237r983J41928J02434j04920j35721K9836l3091P967r236
$$ 147745 38975 71212 61229 203157 305591 200671 64950 94786 61695 69662 60426
13184F0426K8196L2420L1568l3573J4967p2212J25840J07687k0807k2997m1389
$$ 60426 88622 121042 152610 119037 134004 61792 187632 295319 274512 251515 210126
13173B10126P1035J33282p6360j46908m7382j0845j6366n699P6203n5534M1578
$$ 210126 281161 414443 338083 191175 143793 132948 116582 110883 187086 131552 173130
13162A73130n04Q8235l5502q694j5133K4093n7520K8604n2624j1153q0972j27275
$$ 173130 172626 260861 225359 216665 201532 225625 168105 196709 144085 132932 51960 -75315
13150g5315N5798J00516J18018J3618q4869j2406J6261L8567O7293m6040O2504
$$ -75315 -19517 80999 199017 212635 127766 115360 131621 170188 237481 191441 253945
13139B53945k9881r154L3236P7063p3590j58641R8061K8291R5825r0402m6387
$$ 253945 224064 214910 248146 325209 251619 92978 191039 219330 315155 224753 178366
13128A78366J51422R0918L8851k4162l7835q5052k6847o5638j7282n9423Q136
$$ 178366 329788 420706 459557 435395 397560 312508 285661 220023 202741 143318 151454
13117A51454N6166M3420m4921J7037m028j26414o5234R5276K2126N5473j7625
$$ 151454 207620 251040 206119 223156 219128 92714 27480 122756 144882 200355 182730
13106A82730j10792O6206N5193J26519K7772q2585J681j1099M620o8992m7545
$$ 182730 71938 138144 193337 319856 347628 265043 266724 255625 260245 191253 143708
13095A43708n2884l9374Q0622N7806p597k3092J0009N598O226K4061P8000R3205
$$ 143708 90824 51450 132072 189878 182281 159189 169198 174796 181022 205083 283083 376288
13083C76288o5702j21264j48223o5833K1487P8471J48634M2500r2177K1382Q5346
$$ 376288 310586 189322 41099 -24734 -3247 75224 223858 266358 174181 195563 280909
13072B80909Q8462o5795j47313P1113J2434n8436m2689l8746k8992j2928J7557
$$ 280909 369371 303576 156263 227376 239810 181374 138685 99939 70947 58019 75576
13061G5576j8475L4448Q3361K30j1525P529j41748q7529k9039J40207q893Q5562
$$ 75576 57101 91549 174910 175140 163615 171144 29396 -58133 -87172 53035 44142 129704
13049A29704M9556L4391k9464M8130J10577R8602l0499l4607j12836n2089M3539
$$ 129704 179260 213651 184187 232317 342894 441496 410997 376390 263554 211465 255004
13038B55004j6682L5169j50540n5296L2119J7367k1856J0709K5167M9038K8463
$$ 255004 238322 273491 122951 67655 99774 117141 95285 105994 131161 180199 208662
13027B08662J00716l0231J6255q3234j15304o9848L3259J2387P3684j03704l5481
$$ 208662 309378 279147 295402 212168 96864 27016 60275 72662 146346 42642 7161
13016G161M8343k0050n4316Q4914J13462Q1761N7752j5246J1938o0546o0534k7959
$$ 7161 55504 35454 -18862 66052 179514 261275 319027 303781 315719 255173 194639 166680
13004A66680O1433K0383J8732j03077k3805K2016p1655O9196K04542P5906m7999
$$ 166680 228113 248496 267228 164151 140346 162362 90707 159903 364445 440351 392352
12993C92352o214m6796j27600N5331k4455J9208K0226j21282j6996J09120M1308
$$ 392352 386138 339342 211742 267073 242618 261826 282052 160770 143774 252894 294202
12982B94202k75j0782m5918L5526K6501P3312P674n3885k2830K4017P275k7188
$$ 294202 293927 283145 237227 272753 299254 372566 380240 326355 303525 327542 334817 307629
12970C07629p7679r3868k3163K9345N4823j9197N3024n9575J36266M9124K2283
$$ 307629 229950 136082 112919 142264 197087 177890 230914 171339 307605 356729 379012
12959C79012K0989m159j35100J9908Q5129J0692j6963j76023k2054J3967J31712
$$ 379012 400001 395842 260742 280650 365779 376471 359508 183485 161431 175398 307110
12948C07110J06561j09581j35930j15529P3751j3147J02743J3451J6937L8445
$$ 307110 413671 304090 168160 52631 126382 113235 215978 229429 246366 284811
12938B84811J7573k9685n8500P2945J1481l8609m5424l705o7677L5720O947J2172
$$ 284811 302384 272699 214199 287144 298625 260016 214592 210887 143210 178930 185877 198049
12926A98049K1204o2789l6144j1907J0935o8421K2782N5143M8089J33108J2370
$$ 198049 219253 156464 120320 108413 119348 50927 73709 128852 176941 310049 322419
12915C22419p4482j3770J7758K7950P3960J91293K8409l3078j09735o6711K0537
$$ 322419 247937 234167 251925 279875 353835 545128 573537 540459 430724 364013 384550
12904C84550l855m1368j49565N3313N1238j01137q9524p2793J14500J0874O7813
$$ 384550 380695 339327 189762 243075 294313 193176 103652 30859 145359 156233 224046
12893B24046J51132J37998k0671J27427J044k4622K8669j36786j74478r6127N4580
$$ 224046 375178 513176 492505 619932 620976 596354 625023 488237 313759 217632 272212
12882B72212M3936o2484k7148J04527Q6595j13475R234J57120N4713q8851L28
$$ 272212 316148 253664 226516 331043 417638 304163 313397 470517 525230 436379 436707
12871D36707m883n9280p9102j11394j3720M1414O333J8822N1960J33572O8386
$$ 436707 431824 372544 293442 182048 168328 209742 216075 234897 286857 420429 488815
12860D88815r2866j19151o6069J2393O1180L1761M5093K0170j05085j00442m6957
$$ 488815 395949 276798 210729 223122 284302 316063 361156 381326 276241 175799 128842
12849A28842M3448l5413N9109J18105J6343L3817j4708r5843N2129Q5872n9543
$$ 128842 172290 136877 195986 314091 330434 364251 349543 253700 305829 391701 332158
12838C32158J8035n0704m4723O4086R6005K6687p844m3246M1612j03917j36510
$$ 332158 350193 299489 254766 318852 414857 441544 433700 390454 432066 328149 191639
12827A91639P7796J50785J788m6010r4696q4477Q9301L4781p2522P7269O0193
$$ 191639 269435 420220 422008 375998 281302 196825 286126 320907 248385 325654 385847
12816C85847n2577K4373o0795L8097R8046P5435k2080N5639m5294n9269n2641
$$ 385847 333270 357643 296848 334945 432991 508426 486346 541985 496691 437422 384781
12805C84781j23296l7342O735l6483N1755J10830j06218m8849m2120O7926J17100
$$ 384781 261485 224143 230878 194395 246150 356980 250762 201913 159793 227719 344819
12794C44819P9047q9235p4024Q9346k914k7166K2052M4904K8929J22022q1943
$$ 344819 423866 334631 260607 349953 347039 319873 341925 386829 415758 537780 455837
12783D55837o2755J25251l5618j09692l0816M9733m5626R3812M5740P6820n4363
$$ 455837 393082 518333 482715 373023 342207 391940 346314 440126 485866 562686 508323
12772E08323k17720q6325J33437j5690k5687J1136j093p3061N8395J19528o6218
$$ 508323 290603 204278 337715 322025 296338 307474 306381 233320 291715 411243 345025
12761C45025J9405q9550P7574O6055J5384q0261K7184L3757k6887o0537j9159
$$ 345025 364430 274880 352454 418509 433893 353632 380816 414573 387686 327149 307990
12750C07990P0879N7233M0314J08104r1107j60037j13897l1838O1998J3706q5975
$$ 307990 378869 436102 476416 584520 493413 333376 219479 187641 249639 263345 177370
12739A77370r2046L814J17544J32199K5081k9776j256K1648o5102N7314J15613
$$ 177370 85324 89138 206682 338881 363962 334186 332930 354578 289476 346790 462403
12728D62403M9488n9080K2541R00J3782j8351M943N9466l3406o1965k4183j1416
$$ 462403 511891 452811 475352 476252 490034 471683 476626 536092 502686 440721 416538 405122
12716D05122J02897Q7790o2787j39657r1525J6613N3265L6841L3454L9438R2855
$$ 405122 508019 595809 533022 393365 301840 318453 371718 408559 442013 481451 574306
12705E74306o2406L1345R861n5277j02044j351J10633R4700m3947j2815m7515
$$ 574306 511900 543245 553106 497829 395785 394434 505067 599767 555820 543005 495490
12694D95490r5328K6514R0286J04890n8766k19264L8942Q91j8028J0888L3761
$$ 495490 400162 426676 516962 621852 563086 343822 382764 383655 365627 376515 410276
12683D10276m6984J23953O3508l1152J43252N031j10014O2023N9037L7352J8029
$$ 410276 363292 487245 550753 519601 662853 667884 557870 619893 678930 716282 734311
12672G34311m7462p3514j30305j5132L7844M7533J1111j47546K3811L9544N3848
$$ 734311 686849 613335 483030 467898 505742 553275 564386 416840 440651 480195 534043
12661E34043N7601l6379J22839L4271j318n403M3634K7833q2421o7359k4571K9371
$$ 534043 591644 555265 678104 712375 711057 705654 749288 777121 694700 627341 602770 632141
12649F32141j6519j25903o3113J9015N2308R754r6036k0683O1549J10065J57420
$$ 632141 615622 489719 426606 445621 497929 507683 411647 390964 452513 562578 719998
12638G19998j43218j30950K9344J46598K5279o541L7739l6863N613J1940R592
$$ 719998 576780 445830 475174 621772 647051 640510 678249 641386 646999 658939 668531
12627F68531K4672r802j45075m4759P5587N8576m6336J8580k6911L3928o5999
$$ 668531 693203 683401 538326 493567 569154 627730 581394 599974 573063 606991 540992
12616E40992n3835P390L1758J03670k2975j46118J5484N2511n1327Q6659j0839
$$ 540992 487157 494547 526305 629975 607000 460882 476366 528877 477550 564209 553370
12605E53370M1030M9013j03297o5807J4181J5352M9091m914K5306n9812j65100
$$ 553370 594400 643413 540116 474309 488490 503842 552933 548019 573325 513513 348413
12594C48413J03815J97233j6885m8042o7140n070n5440m7096K00384Q3640N4370
$$ 348413 452228 649461 632576 584534 517394 512324 456884 409788 610172 693812 748182
12583G48182j01302j38779k6337R367Q057j0712O2636K9769K2953J4372j2747
$$ 748182 646880 508101 481764 491131 499188 488476 551112 580881 603834 618206 605459
12572F05459p7358j10284q7426k3886P9838N0841P2218Q7842O4219n685j41197
$$ 605459 528101 417817 330391 306505 386343 437184 509402 597244 661463 655778 514581
12561E14581r6295m2326O6580K463L1398J05842O6766p5605K4186O9848R9624
$$ 514581 418286 375960 442540 445003 476401 582243 649009 573404 597590 667438 767062
12550G67062k6399o7884L7852n8587L9624L4936R466Q4199j3620l1247j49907
$$ 767062 740663 672779 710631 652044 691668 726604 736070 820269 806649 775402 625495
12539F25495q7570P8222K7813J9662l4491N0368M1735n0270l0569K9653p0569
$$ 625495 537925 616147 643960 663622 629131 679499 721234 670964 640395 670048 599479
12528E99479L1448O6837k0100O7586N9792o0616n889j0788K3550J05538j01690
$$ 599479 630927 697764 677664 745250 805042 744426 738537 727749 751299 856837 755147
12517G55147j56406o2552J8860p2294l4336P3594M1611L2094Q2494J00043o3073
$$ 755147 598741 536189 555049 482755 448419 522013 563624 595718 678212 778255 715182
12506G15182r2170j47545J7246N4002K1462l8082J4336M9289N6580k2870p9813
$$ 715182 623012 475467 492713 546715 568177 530095 544431 593720 650300 627430 547617
12495E47617J04098O0545l4648M6114K8201n247P2329j670m1565j1612k2606j3789
$$ 547617 651715 712260 677612 723726 751927 746680 819009 817339 775774 764162 741556 727767
12483G27767J32873r1087K0767L9403n9969Q5777j8957q9993o3107J1004K5360
$$ 727767 860640 769553 790320 829723 769754 855531 836574 746581 683474 694478 719838
12472G19838j10062K6166J0183R7665L5634L2643R104p5469m3014q5851O2451
$$ 719838 609776 635942 646125 743790 779424 812067 821171 745702 702688 616837 679288
12461F79288J24838m945k144m109q0518n9580Q142Q0876J89973n7834j14829M8126
$$ 679288 804126 799181 797037 792928 712410 652830 660972 741848 931821 873987 759158 807284
12449H07284K0959n3069r2104l5357m4369J03116J32331n8630o5901o6225r571
$$ 807284 828243 775174 683070 647713 603344 706460 838791 780161 714260 648035 638464
12438F38464n3871p8155M5066R7176L6110P4736n1050M2444N1973L7590j5031
$$ 638464 584593 506438 551504 648680 684790 759526 708476 750920 802893 840483 825452
12427H25452j9216r9956j12534Q5063k53Q787N57K965Q9223m5037o4248o0928
$$ 825452 806236 706280 593746 678809 678556 687343 687900 690865 780088 735051 670803 609875
12415F09875n8913Q4210J00647J30385M7694r7269j5532n9393L5271Q4648o5908
$$ 609875 550962 635172 735819 866204 913898 816629 801097 741704 776975 861623 795715
12404G95715j33527q8825m153J45314L2924m4015p1075m8150L2021O9714O6204
$$ 795715 662188 573363 569210 714524 747448 703433 632358 584208 616229 685943 752147
12393G52147M2296Q3234L8768k8120k2821m5977M7997Q8645m4261L4450M3393
$$ 752147 794443 877677 916445 888325 865504 819527 867524 956169 911908 946358 989751
12382I89751n2435n3755n8265r8534N4865j35476j41444n704J10411K1283K9604
$$ 989751 937316 883561 825296 726762 781627 646151 504707 499003 609414 630697 660301
12371F60301L4193o2437p7138J09395P0463j30714k8882O3978N481R0695j37523
$$ 660301 694494 632057 554919 664314 734777 604063 575181 639159 644640 735335 597812
12360E97812q1979J12142J44904r060P2658K8836j323J4547o0882N3125n05q0431
$$ 597812 515833 627975 772879 763819 836477 865313 863990 878537 817655 870780 870275 789844
12348G89844j24418O0662k901K8919L1448J8626l9223P459L4623n9904j22927
$$ 789844 665426 726088 723187 752106 783554 802180 762957 770416 805039 745135 622208
12337F22208L3440J24777M1736J9464m1878q2902n9051k9753K7951l5525O7027
$$ 622208 655648 780425 822161 841625 799747 716845 657794 628041 655992 620467 687494
12326F87494n1973k1926Q9389p2431o9112J09665Q4062O797o7726Q4858O4739
$$ 687494 635521 613595 702984 630553 561441 671106 755168 761965 694239 779097 843836
12315H43836k5974l2084l4225n765k8623M2065K5859r11j1089r1019L334N4105
$$ 843836 817862 785778 751553 745788 717165 759230 785089 784178 773089 682070 685404 739509
12303G39509O9325q829m0619P3917R4349L5307n4763j09526M315k8021j76907
$$ 739509 808834 800005 759386 833303 927652 962959 908196 798670 802985 774964 598057
12292E98057P1842J40463r0820j5384O1709m9677r348R7633K9553R3074J25997
$$ 598057 669899 810362 719542 704158 765867 716190 706842 804475 834028 927102 1053099
12281A053099R7158q6027j02039m7386j47638M5706R5779k9064p9304N8976J41619
$$ 1053099 1150257 1064230 962191 914805 767167 812873 908652 879588 800284 859260 1000879
12270A000879k5465p7720o0510n1774J37528J06080R4268l3324l0712k9184k13515
$$ 1000879 975414 897694 837184 785410 922938 1029018 1123286 1089962 1059250 1030066 816551
12259H16551o1454J45786L1032l284j25228m1310J3993K9865N1010O2640p2145
$$ 816551 755097 900883 931915 928631 803403 762093 776086 805951 856961 919601 847456
12248H47456j81439Q2113J51803P2489j01733q8770j978K7847L6574j1439P0315
$$ 847456 666017 748130 899933 972422 870689 781919 779941 807788 844362 832923 903238
12237I03238R441O3197J21520N7104j29123k4239m0178k6053n0246k409L5202
$$ 903238 912679 975876 1097396 1154500 1025377 1001138 960960 934907 884661 882252 917454
12226I17454R0123j5409l5624l4807l3162m9037M6092J49424J27142j89845j18803
$$ 917454 1007577 992168 956544 921737 888575 839538 885630 1035054 1162196 972351 853548
12215H53548o3594P1569o2650m2218l7656O131k5918m357M1536O290R6211P5915
$$ 853548 789954 861523 798873 756655 718999 725130 699212 694855 736391 742681 838892 914807
12203I14807K3325j31362J6205p193j1428N0428J20129O3242j43428j44945J08185
$$ 914807 938132 806770 822975 815782 804354 854782 974911 1038153 894725 749780 857965
12192H57965L3655j13176M4155O7683M4372O3488j9140K0879R851j11616o8957
$$ 857965 891620 778444 822599 890282 934654 998142 979002 999881 1009732 898116 829159
12181H29159R606Q1237k2131O1912P1615L1232J8147j1351J5694j12633o2179
$$ 829159 838765 920002 897871 959783 1031398 1062630 1080777 1069426 1085120 972487 910308
12170I10308J13169n3749l5851m458K919J47927j06997j51402J14214N9427n8289
$$ 910308 1023477 969728 933877 929419 932338 1080265 973268 821866 936080 995507 937218
12159I37218l1151j08784n161N2415K3849k8820n4408M6034K1974O1884J02071
$$ 937218 906067 797283 792122 844537 868386 839566 785158 831192 853166 915050 1017121
12148A017121N0354j45154o4355R757R9546j58255k946L3483O8059p9003k584
$$ 1017121 1067475 922321 857966 867723 967269 809014 806068 839551 907610 828607 826023
12137H26023J11783j7726m7619n3270n2813q081L8885K4975p212l8566q058o2518
$$ 826023 937806 920080 872461 819191 766378 758297 797182 822157 814945 776379 768321 705803
12125G05803J12731K9901R1858P8320R4717O6174r2186q4518j47733p5089L7142
$$ 705803 818534 848435 940293 1018613 1113330 1179504 1087318 1002800 855067 779978 817120
12114H17120Q9744Q1019N8022L7067j02489l5775J56791R500n1682N702n4770
$$ 817120 906864 987883 1045905 1082972 980483 944708 1101499 1110999 1059317 1065019 1010249
12103A010249n5471k1944K5299l9759k2369O3440K2334N3780j29331j55423j69993
$$ 1010249 954778 932834 958133 918374 896005 959445 981779 1035559 906228 750805 580812
12092E80812R771M4656Q1810J30210K933q1276n5690n1976p3648M8525N5659P5852
$$ 580812 590583 635239 717049 847259 850192 768916 713226 661250 587602 636127 691786 767638
12080G67638Q9993l2266r1649J279L9497R1017N7221k9664k9873q3775J4024J6796
$$ 767638 857631 825365 733716 734995 774492 865509 922730 893066 863193 779418 793442 810238
12068H10238m9616n4809p9783P0089J68972q071O4316Q8993J10909m6039j81830
$$ 810238 760622 705813 626030 696119 865091 857020 921336 1010329 1121238 1075199 893369
12057H93369p6731M9632L4475M2611m3781n3329k0346k4540N9380o1587n4728
$$ 893369 816638 866270 900745 943356 899575 846246 825900 801360 860740 799153 744425
12046G44425L0307J00277O3238n9933N288N9056N6698n7013J560M1157n3299J969
$$ 744425 774732 875009 938247 878314 883602 942658 999356 942343 943903 985060 931761 933730
12034I33730j1766K8380p7588J22309K876L7954R3608Q022R991l7868j32071k1167
$$ 933730 921964 950344 872756 995065 997941 1035895 1129503 1137525 1147516 1109648 977577 956410
12022I56410N3513k5515k8437N0592J5949j1251O5089l2226m8865j15399k615
$$ 956410 1009923 984408 955971 1006563 1022512 1011261 1076350 1044124 995259 879860 877245
12011H77245M769n4853m907N4035J40121R4103M8757L0391q9639j29388j74186
$$ 877245 882014 827161 822254 876289 1016410 1110513 1159270 1189661 1100022 970634 796448
12000G96448j1374K3372q5580J06484J52712Q1329l4756j6931m1717m3668O3130
$$ 796448 785074 808446 722866 829350 982062 1063391 1028635 1011704 969987 926319 989449
11989I89449p0007Q7234p444m5896m2705Q953j6506J9319L0782L5618k3186p7023
$$ 989449 919442 1006676 999232 953336 910631 919584 903078 922397 953179 988797 965611 888588
11977H88588k5486m6001k89k7467O8825M6954L0046m6947q0794j7854M9018J1478
$$ 888588 863102 817101 816812 789345 858170 905124 935170 888223 807429 789575 838593 850071
11965H50071j8583N120j5826N3017q0929R3412M1592J159m6730o7072o5279R002
$$ 850071 831488 836608 820782 873799 792870 886282 927874 929033 882303 815231 749952 758954
11953G58954K9981J05294R6313k5875j39808j22869L2817Q9188p637O1475O5227
$$ 758954 788935 894229 990542 964667 824859 701990 734807 823995 816358 877833 943060
11942I43060j8993j9311n0581R3261J01379r22n0588l3065m289l2945m6206N962
$$ 943060 924067 904756 854175 947436 1048815 1047893 997305 964240 959951 927006 880800 886762
11930H86762K4333L6323M8359k9241K8857j7942j47746k504M970l3084K1808q5073
$$ 886762 911095 947418 995777 966536 995393 977451 829705 827201 832171 799087 820895 735822
11918G35822m2566K9152K42263L5326q2789K9256j10613O6537Q3944L9286N546
$$ 735822 693256 722408 964671 999997 917208 946464 835851 902388 986332 1025618 1031164
11907A031164r4004Q876J7483n9263j7618J3781k8026q7645J138R0216J55859
$$ 1031164 937160 946036 963519 904256 886638 900419 872393 784748 785886 876102 1031961
11896A031961L6463r2832n812K7281o672o6630L6450M7411P530M5606N5436r8205
$$ 1031961 1068424 975592 969780 997061 990389 923759 960209 1007620 1015150 1060756 1116192 1017987
11884A017987r7323M1748o9887q3163k5705K1885k7590J1966l1098p814N1324
$$ 1017987 920664 962412 892525 809362 783657 805542 777952 789918 758820 751006 802330
11873H02330M6097m5086k7735P976Q5416K23309O1237j06843j46353j40882l8064
$$ 802330 848427 803341 775606 783582 868998 1092307 1153544 1046701 900348 759466 721402
11862G21402K7981O7126j6406m0597N0436J46103j8135r6405J725J25665k5123
$$ 721402 749383 816509 800103 759506 809942 956045 937910 841505 843230 968895 943772
11851I43772m4318l2132j8649q2214O1048J20560K7131K5565k4305j10617m8051
$$ 943772 899454 867322 848673 766459 827507 948067 975198 1000763 976458 865841 817790
11840H17790Q827k745l4951n0578j0106K6880J39761J33003m2926o7842O1669
$$ 817790 826617 823872 788921 738343 728237 755117 894878 1027881 984955 917113 978782
11829I78782K3098o6896j6875q1584q5459j0427j63018j2922J52942J2944j2255
$$ 978782 1001880 934984 918109 836525 751066 740639 577621 564699 717641 730585 718330
11818G18330J51013k5095k816k53m7281j1896K1802K1983N1830J5480p3165l8280
$$ 718330 869343 844248 841432 841179 793898 782002 803804 825787 877617 893097 819932 781652
11806G81652N6353j05872J6260P9861o7189J5593J9365r7345l2485R2085J02021
$$ 781652 838005 732133 748393 828254 761065 776658 796023 698678 666193 758278 860299
11795H60299p5031M9418M7864P8342n9403o6547k2963r5466M3089N3524p6139
$$ 860299 785268 834686 882550 960892 901489 834942 811979 716513 759602 813126 736987
11784G36987n4245q0670o4288K3274J14691J38089L1705j4043o3197j46215l4293
$$ 736987 682742 602072 537784 561058 675749 813838 845543 831500 768303 622088 587795
11773E87795p393N141R8628L1176o0493q177M7571K5089n4846K0216R0544K2484
$$ 587795 580402 585543 684171 715347 654854 646677 694248 719337 664491 684707 775251 797735
11761G97735m4612o3498J1718p26m0613j5322K1388n7240o0126j8212j085P2931
$$ 797735 753123 689625 701343 700617 660004 644682 666070 608830 548704 530492 529407 602338
11749F02338P7537n4611q5845j4806K5434m9265r1096O53Q2750J06532j930m084
$$ 602338 679875 625264 539419 524613 550047 500782 409686 410339 493089 599621 597691 593607
11737E93607J9788n4777J9632r856L656j6957M4715Q5283O5422L8407M2084p627
$$ 593607 613395 558618 578250 568394 572050 555093 599808 685091 750513 788920 831004 823377
11725H23377p0330L9739J9308o3990n1228Q661k7850m375j3437K0367P6270N125
$$ 823377 753047 792786 812094 748104 696876 705537 677687 673312 659875 680242 756512 761637
11713G61637k08131M3859O3237q3492l7696k9844J57476J15193p5055q9087m4866
$$ 761637 553506 597365 660602 577110 539414 509570 667046 782239 707184 618097 573231
11702E73231p8857m6555p531p0793P5243J82961L9340n1057p7035k9036l3205
$$ 573231 494374 447819 440288 369495 444738 627699 667039 615982 538947 509911 476706
11691D76706n1752J3996R4633N3781K1565j48523j46714O6989J25308R3058M8197
$$ 476706 424954 438950 533583 587364 608929 460406 313692 380681 505989 599047 647244
11680F47244j2038q4015k4813m6560p0983P1525J840Q245L9678M8611L0780Q2680
$$ 647244 635206 551191 526378 479818 408835 480360 482200 490445 530123 578734 609514 692194
11668F92194J7209j18547k4280o900n5953J01876K6915J7980j585J2451P6751
$$ 692194 709403 590856 566576 559676 503723 605599 632514 650494 648909 661360 738111
11657G38111j06291q0508J15061n5916m2944j9220p7321j45l4849J1929K8312
$$ 738111 631820 551312 666373 610457 567513 548293 470972 470827 435978 447907 476219
11646D76219j16127j6023P4087P4622R2560L0386n6836l6493M2224P949J17485
$$ 476219 360092 344069 418156 492778 585338 615724 558888 522395 564619 572568 690053
11635F90053q0626j9046J4543j26895n280P274m8852m5508M4107O391j10310J4686
$$ 690053 609427 590381 604924 478029 472749 480023 431171 385663 429770 436161 325851 340537
11623C40537M6035l9481J2908j2038j3677J22317M5812j42062q5242l017L6821
$$ 340537 386572 347091 359999 347961 334284 456601 502413 360351 275109 272092 308913
11612C08913K7790J1922j764J21270j6608Q9279M2858j49778m0375K3007r973
$$ 308913 336703 348625 346861 468131 451523 540802 583660 433882 393507 416514 406541
11601D06541Q8145J18687P869m2167k8049n9301j25750l1289R7269J16405j1217
$$ 406541 494686 613373 621242 579075 551026 491725 365975 334686 431955 548360 537143
11590E37143n8683r4064j19577j2779R0558J8457J28420k9939j6434j1003q662
$$ 537143 478460 384396 264819 252040 342598 361055 489475 459536 443102 432099 423437
11579D23437m4662o4576K8852M702k7277l3512R9931j438J7193P4797j04514L0750
$$ 423437 378775 314199 343051 347753 320476 286964 386895 385457 402650 477447 372933 403683
11567D03683R3873j23515l5208j9801M5909j3117Q1426q5162q1239R9081R2716
$$ 403683 497556 374041 338833 319032 364941 351824 433250 348088 266849 365930 458646
11556D58646J24315q3275j07697K8432Q9583Q679l6693j16979l2128k4094l5315
$$ 458646 582961 499686 391989 420421 510004 518683 481990 365011 332883 308789 273474
11545B73474Q2577p2975M807M6150M1055R4008P353M0986m2938q4914o731l1933
$$ 273474 356051 283076 287883 334033 375088 469096 476449 517435 474497 389583 382852 350919
11533C50919n9398q4682M4949J18773o2411L264o6317J7834p505J0745r654J02998
$$ 350919 291521 206839 251788 370561 308150 311414 245097 262931 255426 266171 256517 359515
11521C59515N2790J9264l6224K7604q725p2381p8887M0352m6276j75834j1960
$$ 359515 412305 431569 395345 422949 414224 341843 262956 303308 257032 81198 69238
11510F9238O3614l3906k28O0427N8195J91489p625j87159l04993p0479Q1290K69969
$$ 69238 132852 98946 98718 159145 217340 408829 401204 214045 -90948 -161427 -80137 189832
11498A89832M6915L1332j5691J3203j25658q2688P1175m4056O6193M9286m154
$$ 189832 236747 268079 252388 265591 139933 57245 128420 84364 150557 199843 195689
11487A95689o515j1411O385k4050o6157p3829L2134N3670j5570M5357j907k9275
$$ 195689 189174 177763 184148 160098 93941 20112 52246 105916 90346 135703 133796 104521
11475A04521r7507j1540l8141J7023K11934k8618m4331M5273l8016L2827l589
$$ 104521 7014 -4526 -42667 -25644 186290 157672 113341 158614 120598 153425 149836
11464A49836K0778j42419n3596k6842J80321Q7650n5751k8907p4154k1871l0049
$$ 149836 170614 28195 -25401 -52243 128078 215728 159977 131070 56916 35045 4996
11453D996J22808m6258j19487K0848J11419K5384l0168k9440j21899j7413j9343
$$ 4996 127804 81546 -37941 -17093 94326 119710 89542 60102 -61797 -79210 -98553
11442i8553O0611J3231Q2660M6403R2788j38964m6007j6634q5517K1496M3969
$$ -98553 -37942 -24711 57949 104352 197140 58176 12169 -4465 -89982 -68486 -24517
11431b4517n6599L5082P602J7302J6408p8215k7469P2546R8423j13048L7662k816
$$ -24517 -81116 -46034 -38432 -21130 -4722 -82937 -110406 -37860 60563 -52485 -14823 -17639
11419a7639Q571p5289P6182n370j00358j45q1096j07223P4212J23717l0520j1527
$$ -17639 -9068 -84357 -8175 -13545 -113903 -114048 -195144 -302367 -228155 -104438 -134958 -146485
11407a46485k4309J4373J34041J2288m5705k4761k707j02737n2465J03598P2615
$$ -146485 -170794 -156421 -22380 -10092 -55797 -80558 -83265 -186002 -238467 -134869 -62254
11396f2254N5511N9888O0696m3157k5872l2806r4390q3117p9927m5462J00912
$$ -62254 -6743 53145 113841 70684 44812 12006 -82384 -165501 -245428 -290890 -189978
11385a89978J35978O0063J19165N4368l6717j53266m8273J0763P8587r9630L5264
$$ -189978 -54000 6063 125228 179596 142879 -10387 -58660 -47897 30690 -68940 -33676
11374c3676k0267l8972m4677q3847r7624K3878J7061J7083R6022J7155j5035p558
$$ -33676 -53943 -92915 -137592 -221439 -319063 -295185 -278124 -261041 -165019 -147864 -162899 -170457
11362a70457P0977J8842M8191p1808q1877n4666K7369o169o8471O2188J34624
$$ -170457 -99480 -80638 -32447 -104255 -186132 -240798 -213429 -219598 -288069 -225881 -91257
11351i1257K7094q3421r9496R9431M1553n3130j52019j22403J299J82137M8785
$$ -91257 -64163 -147584 -247080 -147649 -106096 -159226 -311245 -433648 -432349 -250212 -201427
11340b01427M9001L2903k0112o0574L7965J31040P543n2488p8177j23548j84898
$$ -201427 -152426 -119523 -139635 -200209 -162244 -31204 -23661 -76149 -154326 -277874 -462772
11329d62772o894L5068Q0363M3967o2279M2924M133M0712j3337m8280R266M8339
$$ -462772 -469666 -434598 -354235 -310268 -372547 -329623 -325490 -284778 -298115 -346395 -337129 -288790
11317b88790o03L9768K9431r8898j08614l6425L9599m6463K8480R0959l9570j04488
$$ -288790 -289393 -249625 -220194 -319092 -427706 -464131 -424532 -470995 -442515 -351556 -391126 -495614
11305d95614N9161P5804J13156j71533j82077O5207J62116J32168k2699o4580
$$ -495614 -436453 -360649 -247493 -419026 -601103 -535896 -373780 -241612 -264311 -328891
11295c28891o3261q2272M5539m4216m1541M3437j6069k3544M7983p6823r1537
$$ -328891 -392152 -474424 -428885 -473101 -514642 -471205 -487274 -510818 -462835 -539658 -631195
11284f31195O5330L5724J23077J61131n5214l2526N646m9298k4857j6645q5781
$$ -631195 -565865 -530141 -407064 -245933 -301147 -333673 -328027 -377325 -402182 -418827 -504608
11273e04608j58318O1337J74964l3560j55864m2123R943N709J0496K085L4210
$$ -504608 -662926 -601589 -426625 -460185 -616049 -658172 -648229 -642520 -632024 -629939 -595729
11262e95729J01841K55j5281R535L512L9948J1633n381J484k019p468J0662O2239
$$ -595729 -493888 -493633 -508914 -499379 -495867 -455919 -444286 -449667 -448183 -450202 -457670 -447008 -384769
11249c84769j9072k0153R831p5000m723q2920M1052l2533J7466J24183k1464K478
$$ -384769 -403841 -423994 -414163 -489163 -493886 -576806 -535754 -568287 -550821 -426638 -448102 -445624
11237d45624l9865j01861K0049J453N8515m7269r30L7931O3879o1782n0808j116
$$ -445624 -485489 -587350 -567301 -565848 -507333 -554602 -555532 -517601 -453722 -515504 -566312 -567428
11225e67428R8673K1069M2391j00457p8648n6458l8586M5014J22096P477j50584
$$ -567428 -468755 -447686 -405295 -505752 -584400 -640858 -679444 -634430 -512334 -504857 -655441
11214f55441o4062k0619J33983J03364q6273o8121k0274n0917Q733m1055R1086
$$ -655441 -719503 -740122 -606139 -502775 -589048 -657169 -677443 -728360 -719627 -760682 -669596
11203f69596l9170r8563O6643J17949M6227l9326j58727m62L519Q7825L2870O5516
$$ -669596 -708766 -807329 -740686 -622737 -576510 -615836 -774563 -775025 -771506 -683681 -650811 -585295
11191e85295l3147m0434Q3518N7131j23482j22737M45J55705m273r5034j75080
$$ -585295 -618442 -658876 -575358 -518227 -641709 -764446 -764001 -608296 -612569 -707603 -882683
11180h82683o2437j6104Q0460k1937n2540N7971m7740n8864Q0888J1352P030j04812
$$ -882683 -945120 -961224 -880764 -902701 -955241 -897270 -945010 -1003874 -922986 -911634 -904604 -1009416
11168a009416r620k2120j3141L4323m388L3375j1849p1982J06154P7041j25109
$$ -1009416 -1019036 -1041156 -1054297 -1019974 -1024362 -990987 -1002836 -1074818 -968664 -891623 -1016732
11157a016732o5432l3964r140J58791m9749M13n1529O3209N4297o407P0570J31756
$$ -1016732 -1082164 -1116128 -1125268 -966477 -1016226 -1015813 -1067342 -1004133 -949836 -956243 -885673 -753917
11145g53917R5771q1448q6657p8776j51608J3018K5245l282K055r5610l2541m6351
$$ -753917 -658146 -739594 -826251 -905027 -1056635 -1043617 -1018372 -1021654 -1019599 -1115209 -1147750 -1194101
11133a194101L3931N0936Q1636Q3006q7762p6100j1000n7058o860N665N5882J47967
$$ -1194101 -1160170 -1109234 -1027598 -944592 -1032354 -1108454 -1119454 -1176512 -1183372 -1177707 -1121825 -973858
11121i73858l6860q9110o855p4964r4057Q0721J71732j06152o6144R1781m1524
$$ -973858 -1010718 -1099828 -1106683 -1181647 -1275704 -1194983 -1023251 -1129403 -1195547 -1103766 -1145290
11110a145290j09849O0642J79422M0559j21952j06139n0599P2117Q1575P6319
$$ -1145290 -1255139 -1194497 -1015075 -974516 -1096468 -1202607 -1253206 -1181089 -1099514 -1023195
11100a023195M4297k9550q1966n9715k315P9562q8640j10793r9893m3264Q4659
$$ -1023195 -978898 -1008448 -1090414 -1150129 -1152444 -1072882 -1161522 -1272315 -1372208 -1415472 -1330813
11089a330813M0361n439j3215O3692L1311k6533K4645j33083j9515M7693J1542
$$ -1330813 -1290452 -1295891 -1309106 -1245414 -1214103 -1240636 -1215991 -1349074 -1368589 -1320896 -1309354
11078a309354j02776P0010J10036p522m7915p6647j54641n4548M0150K1868M1105
$$ -1309354 -1412130 -1342120 -1232084 -1239606 -1287521 -1364168 -1518809 -1573357 -1533207 -1511339 -1470234
11067a470234K4984M2913j21926N2809J59032Q155p3207j30449q4164L0615M8432
$$ -1470234 -1445250 -1402337 -1524263 -1471454 -1312422 -1304267 -1377474 -1507923 -1592087 -1561472 -1513040
11056a513040P1401L6194J2443L0218j22727M0881J83871K02035L0350q0100K71
$$ -1513040 -1441639 -1405445 -1393002 -1362784 -1485511 -1444630 -1260759 -1058724 -1028374 -1108474 -1108203
11045a108203r412N9587m3255q7084k9521o403n8736N9401L6953J66758K99468
$$ -1108203 -1117615 -1058028 -1101283 -1188367 -1217888 -1224291 -1283027 -1223626 -1186673 -1019915 -720447
11034g20447K05055J49615j56068k10530j40573o9635n6620n326J19680K00111
$$ -720447 -515392 -365777 -521845 -732375 -872948 -942583 -999203 -1004529 -884849 -684738
11024f84738L64316J99675J36198j10648j97114k14080j57256J0483j34038l3452
$$ -684738 -320422 -120747 15451 -95197 -292311 -506391 -663647 -653164 -787202 -820654
11014h20654J24085P1812J90182J62053J3570O372j61452j16937k61895j49133
$$ -820654 -696569 -624757 -434575 -272522 -258952 -252580 -414032 -530969 -792864 -941997
11004i41997K1021N5386p8663l3427J433J8338K1487k6304j39287j20652j92603
$$ -941997 -920976 -865590 -944253 -977680 -976247 -957909 -936422 -962726 -1102013 -1222665 -1415268
10993a415268n239M2600Q237k0378o9469M7869j25674j68736j94088J31412J50597
$$ -1415268 -1420507 -1377907 -1369670 -1390048 -1459517 -1411648 -1537322 -1706058 -1900146 -1768734 -1618137
10982a618137J0857r9066j57859j22492j1816M6708l8693O362J45231O5660l6010
$$ -1618137 -1607280 -1706346 -1864205 -1986697 -1998513 -1951805 -1990498 -1984136 -1838905 -1773245 -1809255
10971a809255j38373q6173K6901O6556P9832M2711q3308n6173K1527N8669j27918
$$ -1809255 -1947628 -2033801 -2006900 -1940344 -1860512 -1817801 -1901109 -1957282 -1935755 -1877086 -2005004
10960b005004j8626k7885J8696K0485l7341n5203J48629l6235K836K3005K9703
$$ -2005004 -2023630 -2051515 -2032819 -2012334 -2049675 -2104878 -1956249 -1992484 -1989648 -1966643 -1936940
10949a936940m6885m868j4318m1757l5859r665L9395R8373n7823j33450j15358
$$ -1936940 -1983825 -1988693 -2003011 -2044768 -2080627 -2090292 -2050897 -1952524 -2010347 -2143797 -2259155
10938b259155j19273l6132R7197j07K0408Q827k4461m3794j29127O4489P0417
$$ -2259155 -2378428 -2414560 -2317363 -2317470 -2297062 -2288235 -2312696 -2356490 -2485617 -2421128 -2350711
10927b350711j809N922j08911L9043Q0543j63m7521J34470J8706r5645j45578
$$ -2350711 -2352520 -2346598 -2455509 -2416466 -2335923 -2336086 -2383607 -2249137 -2230431 -2326076 -2471654
10916b471654K9960R7266K8968l3237q1290k2586j6675p0888J8817k4099K3409
$$ -2471654 -2441694 -2344428 -2315460 -2348697 -2429987 -2452573 -2469248 -2540136 -2521319 -2545418 -2522009
10905b522009j70567j47704l62O0629j6501O9061K2534L9485K2952N9460o4490
$$ -2522009 -2692576 -2840280 -2840642 -2780013 -2796514 -2727453 -2704919 -2665434 -2642482 -2583022 -2647512
10894b647512r0024j05266p0507M9902J8373Q944J00552M7060q6316j10714p6571
$$ -2647512 -2737536 -2842802 -2913309 -2863407 -2845034 -2836090 -2735538 -2688478 -2774794 -2885508 -2962079
10883b962079P1671O7356M5731Q2754k3831j33696j10398l5305P3573K142P257
$$ -2962079 -2890408 -2823052 -2777321 -2694567 -2718398 -2852094 -2962492 -2997797 -2924224 -2922082 -2914825
10872b914825p7967p8591m1190O5334m5234l1908j7385J22544N2748j49015J5540
$$ -2914825 -2992792 -3071383 -3112573 -3047239 -3092473 -3124381 -3141766 -3019222 -2966474 -3115489 -3099949
10861c099949Q9154n9801r1953N2137O3778q5535j29434j812O3647O7335n8452
$$ -3099949 -3010795 -3070596 -3162549 -3110412 -3046634 -3132169 -3261603 -3263415 -3199768 -3132433 -3190885
10850c190885p1309k2456o4153K5864Q4473j51733J6130J38886N2708L2739l899
$$ -3190885 -3262194 -3284650 -3348803 -3322939 -3238466 -3390199 -3374069 -3235183 -3182475 -3149736 -3153635
10839c153635o5268O5085p0430j19010P052q5756k1458L4213m3532p702q8989
$$ -3153635 -3218903 -3153818 -3224248 -3343258 -3336206 -3421962 -3443420 -3409207 -3452739 -3460441 -3549430
10828c549430q1676p0220J1875J21160O5274j7696r5530j2136k6169m3731J19839
$$ -3549430 -3631106 -3701326 -3689451 -3568291 -3503017 -3520713 -3616243 -3628379 -3654548 -3698279 -3578440
10817c578440l4248j12777q1311n8107M738J8531J1757n5027m9037m2629p2323
$$ -3578440 -3612688 -3725465 -3806776 -3864883 -3860145 -3841614 -3829857 -3884884 -3933921 -3976550 -4048873
10806d048873L3891j5488j19691j50465n4024j8705r4718r4478K6669j4505K5110
$$ -4048873 -4014982 -4030470 -4150161 -4300626 -4354650 -4373355 -4468073 -4562551 -4535882 -4550387 -4525277
10795d525277K0775M0151P5927M1742n0380j59442j27824o5516O2262j9945j02599
$$ -4525277 -4504502 -4464351 -4388424 -4346682 -4397062 -4556504 -4684328 -4749844 -4687582 -4707527 -4810126
10784d810126p7513J05227j1575L0353L2908N0623m9755J4133j41009k16128j51484
$$ -4810126 -4887639 -4782412 -4793987 -4763634 -4730726 -4680103 -4729858 -4715725 -4856734 -5072862 -5224346
10773e224346O8312L0697p2374k5631M9829n1681k09423r7460K3882O7419J3990
$$ -5224346 -5156034 -5125337 -5197711 -5223342 -5173513 -5225194 -5434617 -5532077 -5508195 -5440776 -5426786
10762e426786l2253j45635r9382Q1761M527k4568k70j37579j30978J1850m2277
$$ -5426786 -5459039 -5604674 -5704056 -5622295 -5617768 -5642336 -5642606 -5780185 -5911163 -5899313 -5941590
10751e941590j2743m6405j56797j27409r9017L4286J23543J0639j11116r0519
$$ -5941590 -5954333 -6000738 -6157535 -6284944 -6383961 -6349675 -6226132 -6215493 -6326609 -6417128
10741f417128Q6241l3511o8165o3243k16956j05886K6399k6695J08582R0893o723
$$ -6417128 -6330887 -6364398 -6432563 -6495806 -6712762 -6818648 -6792249 -6818944 -6710362 -6619469 -6626192
10730f626192l7200k18275r4896K3861j5680q1033j22887J2655J859j3931l3714
$$ -6626192 -6663392 -6881667 -6976563 -6952702 -6968382 -7049415 -7172302 -7159647 -7157788 -7171719 -7205433
10719g205433J5369k1832j73911j25471N9794n010n0926l4755j36871j25406k28019
$$ -7205433 -7190064 -7211896 -7385807 -7511278 -7451484 -7456494 -7507420 -7542175 -7679046 -7804452 -8032471
10708h032471O7692R4861j05804L3394K291k08309o7739j36196k43545j74541
$$ -8032471 -7964779 -7869918 -7975722 -7942328 -7940037 -8148346 -8216085 -8352281 -8595826 -8770367
10698h770367n624j49859q8890l1504r1810l7014p1691k26310j42124j74561q4556
$$ -8770367 -8775991 -8925850 -9014740 -9046244 -9138054 -9175068 -9246759 -9473069 -9615193 -9789754 -9874310
10687i874310o7707k3186m4666k03783k19748k24380j04811n6895j42515k02483
$$ -9874310 -9942017 -9965203 -10009869 -10213652 -10433400 -10657780 -10762591 -10819486 -10962001 -11164484
10677a1164484j25533j33787k08163q0499j55224k41619k82676j24248j33190
$$ -11164484 -11290017 -11423804 -11631967 -11712466 -11867690 -12109309 -12391985 -12516233 -12649423
10668a2649423k79845k12211k52123k02123o3520j36032k66837k56900k25766
$$ -12649423 -12929268 -13141479 -13393602 -13595725 -13659245 -13795277 -14062114 -14319014 -14544780
10659a4544780k11842k37279k68274p4764J05869R2715p1102j50715j02236N6746
$$ -14544780 -14756622 -14993901 -15262175 -15336939 -15231070 -15138355 -15209457 -15360172 -15462408 -15405662
10649a5405662k95586o80666p49663o19898m38659n05250o08790n18622m39317
$$ -15405662 -15701248 -16381914 -17131577 -17751475 -18190134 -18695384 -19304174 -19822796 -20262113
10640b0262113m20033l76404k14813r4300q015K81060M25239L91383K2958q28461
$$ -20262113 -20682146 -21058550 -21273363 -21367663 -21375678 -21094618 -20669379 -20277996 -20255038 -21083499
10630b1083499j076376r31465q38910o82912k43573L19402R55592J744864L291090
$$ -21083499 -22159875 -23091340 -23930250 -24613162 -24856735 -24537333 -23581741 -21836877 -18545787
10621a8545787N238908P136291R957960J3595032J5625967J3270686O465856q20690
$$ -18545787 -13306879 -6170588 3787372 17382404 33008371 46279057 52744913 51924223
10613E1924223n068486n556041l412556L58521N584208J2316652K1403260L1009451
$$ 51924223 46855737 41299696 37887140 38245661 43829869 56146521 77549781 108559232
10605A08559232L5495540K7480099Q209498r886719j8227723j7765782j2194765
$$ 108559232 144054772 171534871 179744369 169857650 151629927 133864145 121669380
10598A21669380m223097N283719J6974104L0892946M3639378M7033047L1527111
$$ 121669380 117446283 122730002 139704106 170597052 214236430 261269477 292796588
10591B92796588J658281k3360681l3200167l1044731k3317432j4315714m820470
$$ 292796588 294454869 271094188 237894021 206849290 183531858 169216144 164395674
10584A64395674N434079J5903576K4359695K4861608J2616068p593964k3027302
$$ 164395674 169829753 185733329 210093024 234954632 247570700 239976736 216949434
10577B16949434k7633326k4744371j8757321j2471809o670225j194663L400285
$$ 216949434 189316108 164571737 145814416 133342607 126672382 125477719 128878004
10570A28878004O256096N593509J55526p348727j2907449j4642389j3423154j1046114
$$ 128878004 135134100 140727609 140883135 133534408 120626959 105984570 92561416 81515302
10562H1515302q906285p115171n708445m687335l913660l216903k792844k438896
$$ 81515302 72609017 65493846 59785401 55098066 51184406 47967503 45174659 42735763
10554D2735763k146452j955446j813277j464886j369580j322321j263788j120511
$$ 42735763 40589311 38633865 36820588 35355702 33986122 32663801 31400013 30279502
10546C0279502r95275r85903q19070q56036q79900p46675o14778n76016m67647
$$ 30279502 29284227 28298324 27479254 26623218 25743318 24996643 24381865 23805849 23338202
10537B3338202m58757n35266n06377m48871m47011l46477m18449o51710m89805
$$ 23338202 22879445 22344179 21837802 21388931 20941920 20595443 20176994 19525284 19035479
10528A9035479l17029l09180l21939k52966l81688k75129j77851l96299k79071
$$ 19035479 18718450 18409270 18087331 17834365 17452677 17177548 16999697 16603398 16324327
10519A6324327j43419k96705k31724p1258k88403k48038j82824k97558k52048
$$ 16324327 16180908 15884203 15652479 15581221 15292818 15044780 14861956 14564398 14312350
10510A4312350k21904r4092j84961k02775j91986j37268k43392j41425r7368k27607
$$ 14312350 14090446 13996354 13811393 13608618 13416632 13279364 13035972 12894547 12797179 12569572
10500A2569572j70186p2331k2421j55360k39177j27943k57783l10593p2566q9377
$$ 12569572 12399386 12327055 12304634 12149274 11910097 11782154 11524371 11213778 11141212 11051835
10490A1051835n8656p3410j00741n8319k01607j12412L3425j48758j45550j32145
$$ 11051835 10993179 10919769 10819028 10760709 10559102 10446690 10480115 10331357 10185807 10053662
10480A0053662j47460j04572n3746o2161j26634m3659J8473j73107j28473j22080
$$ 10053662 9906202 9801630 9747884 9685723 9559089 9515430 9533903 9360796 9232323 9110243
10470I110243j04561r0755m7986k83808k05767R906n0556K4157P1896R857j09339
$$ 9110243 9005682 8914927 8866941 8583133 8377366 8387272 8336716 8360873 8432769 8442626 8333287
10459H333287m2431j34051L3057j1293j40998l5643P3003n4441L6033l913o0711
$$ 8333287 8290856 8156805 8189862 8178569 8037571 8001928 8074931 8020490 8056523 8052610 7991899
10448G991899m4703P7537r0183r3200K5525m9999m3990m7157r9771j20938j40024
$$ 7991899 7947196 8024733 7934550 7841350 7866875 7816876 7772886 7725729 7625958 7505020 7364996
10437G364996l1113K4240L3065r1417l3400m5478j25656l7907j04427q0968M5053
$$ 7364996 7333883 7358123 7391188 7299771 7266371 7220893 7095237 7057330 6952903 6871935 6916988
10426F916988k6391O078O6249j0512O6328j34590j06127P011M309n1817m679j3122
$$ 6916988 6890597 6896675 6962924 6952412 7018740 6884150 6778023 6785034 6789343 6737526 6732847 6719725
10414F719725o9076m3079j6138j35125j26601j02112M8068m2126J887m8459m1941
$$ 6719725 6650649 6607570 6591432 6456307 6329706 6227594 6275662 6233536 6235423 6186964 6145023
10403F145023m4600n6697n3402j45961L0965O6275M9638J23756o762j18033j42497
$$ 6145023 6100423 6043726 5990324 5844363 5875328 5941603 5991241 6114997 6108235 5990202 5847705
10392E847705k7246r7353l723Q2415j16267o9890M7675j6580o840j18042r9718
$$ 5847705 5820459 5723106 5719383 5801798 5685531 5615641 5663316 5646736 5639896 5521854 5422136
10381E422136p1399j3200j0064L506O2334m017r9499l4410j36342j10577K3437
$$ 5422136 5350737 5337537 5327473 5330979 5393313 5389296 5289797 5255387 5119045 5008468 5031905
10370E031905k0790l0879k8277L9250N4023j05328o0776K7946Q2138n315o3184
$$ 5031905 5011115 4980236 4951959 4991209 5045232 4939904 4879128 4907074 4989212 4983897 4920713
10359D920713m7443k4774N4148p7221m1840j9965k7009l8661q8187L8539Q3455
$$ 4920713 4873270 4848496 4902644 4825423 4783583 4763618 4736609 4697948 4609761 4648300 4731755
10348D731755Q4549l8274N1280J9863j62226n2118m5792l9917O606j08681l2880
$$ 4731755 4816304 4778030 4829310 4849173 4686947 4634829 4589037 4549120 4555726 4447045 4414165
10337D414165j13734K3768j07152J5748J50875Q7995n4256r6892r350N6790r3185
$$ 4414165 4300431 4324199 4217047 4232795 4383670 4471665 4417409 4320517 4311167 4367957 4274772
10326D274772p2943l2062P5143L9028K5698o4731k8444Q3634m6650J0944O6833
$$ 4274772 4201829 4169767 4244910 4283938 4309636 4244905 4216461 4300095 4253445 4264389 4331222
10315D331222L9906j17034j02761J01286l5994m9518P762Q7538n6702j07986J8596
$$ 4331222 4371128 4254094 4151333 4252619 4216625 4167107 4174869 4262407 4205705 4097719 4116315
10304D116315M4221o8597n4430j1358K136N6387k6347l4343O6128k2811M730L3702
$$ 4116315 4160536 4091939 4037509 4026151 4028287 4084674 4058327 4023984 4090112 4067301 4072031 4105733
10292D105733m7476q870j14006m6150P3898o3334j60269n2797q7014j23260L5409
$$ 4105733 4058257 4049387 3935381 3889231 3963129 3899795 3739526 3686729 3599715 3476455 3511864
10281C511864J01506K544j21137o6825J47670O4009j06585j57435K8645J25282
$$ 3511864 3613370 3615914 3494777 3427952 3575622 3639631 3533046 3375611 3404256 3529538
10271C529538p8301O6040R7493q2847r5697N6348O5058m5772J574J648o3142p8925
$$ 3529538 3451237 3517277 3614770 3531923 3436226 3492574 3557632 3511860 3513434 3515082 3451940 3373015
10259C373015N3093N6771N9130k8467j3491L3368n0849k8285r2729K2538m2883
$$ 3373015 3426108 3482879 3542009 3513542 3500051 3533419 3482570 3454285 3361556 3384094 3341211
10248C341211r0854O7837o5113O8160R9208j44631p3018N7741O7051j2029L6080
$$ 3341211 3250357 3318194 3253081 3321241 3420449 3275818 3202800 3260541 3327592 3315563 3351643
10237C351643k311j52193k8448L296r6748j45743Q1971J85878K6423n5006O5596
$$ 3351643 3349332 3197139 3168691 3171987 3075239 2929496 3011467 3197345 3223768 3168762 3234358
10226C234358O2207j52000j13807L6963R9999m4289j32563J1559n2096j15157
$$ 3234358 3296565 3144565 3030758 3067721 3167720 3123431 2990868 3002427 2950331 2835174
10216B835174R845O59L0481l1367j2619k800Q6747N9771j124r5443r7653j18008
$$ 2835174 2845019 2845678 2876159 2844792 2832173 2829373 2916120 2975891 2974767 2879324 2781671 2663663
10204B663663K6472J32490q9731O8232J63310j957Q96q6210o5877j32432L104
$$ 2663663 2690135 2822625 2732894 2801126 2964436 2962479 2963375 2877165 2811288 2678856 2681960
10193B681960Q5786M7269M6945l7728p9389p6286J452L5988m3821L0840j2825
$$ 2681960 2767746 2815015 2861960 2824232 2744843 2668557 2670009 2705997 2662176 2693016 2680191
10182B680191L6679J28952J56133K9933K8243L09j5625m6593j03511j0612L4529
$$ 2680191 2716870 2845822 3001955 3031888 3060131 3060440 3044815 2998222 2894711 2884099 2918628
10171B918628M8680J41621L03456K68686K0724j37411q3108j89150p2596m6456
$$ 2918628 2967308 3108929 3412385 3681071 3701795 3564384 3481276 3292126 3219530 3173074
10161C173074Q6692J33932J91392K17245J47090L26040K1964o1665j78366k19111
$$ 3173074 3259766 3393698 3585090 3802335 3949425 4275465 4297429 4235764 4057398 3838287
10151C838287j08040j76J4487j12211M9484M1043J69534O8596j0986j57316k57321
$$ 3838287 3730247 3730071 3744558 3632347 3681831 3722874 3892408 3961004 3950018 3792702 3535381
10140C535381n4146J9058n1231r6374M0508J1197j35103p3100j5149J5006r1676
$$ 3535381 3481235 3500293 3449062 3352688 3393196 3404393 3269290 3196190 3181041 3196047 3104371
10129C104371O719q2487q9211n1682K1819p3491J6455j4018m9461j09265J4289
$$ 3104371 3111090 3028603 2939392 2887710 2909529 2836038 2852493 2838475 2789014 2679749 2694038
10118B694038m0131o4697q9343n1620K41624M98j41139J6921M556Q976j01201
$$ 2694038 2653907 2589210 2499867 2448247 2689871 2690369 2549230 2566151 2570707 2579683 2478482
10107B478482l6245j06788k9673J30384j7895m9189J51398n973p1759m4204n4318
$$ 2478482 2442237 2335449 2305776 2436160 2418265 2369076 2520474 2514501 2442742 2398538 2344220
10096B344220R5928R7457o9298j07444j08464n2270O9521K6401j9555o847m4040
$$ 2344220 2440148 2537605 2468307 2360863 2252399 2200129 2269650 2296051 2276496 2269649 2225609
10085B225609p8344o965J08827P8612n6902L5751J41216k5350j12313k0311M9505
$$ 2225609 2147265 2140300 2249127 2327739 2270837 2306588 2447804 2422454 2310141 2289830 2339335
10074B339335M4955j16465n3376J02042k8776o1397M5066M4211j65066j8541J2472
$$ 2339335 2384290 2267825 2214449 2316491 2287715 2226318 2271384 2315595 2150529 2131988 2144460
10063B144460P4447L3574j5056p6527l7428J51900J20056Q2089m9852P57r1389
$$ 2144460 2218907 2252481 2237425 2160898 2123470 2275370 2395426 2477515 2427663 2428420 2337031
10052B337031j30980j68575L0986J51637j7721q3682j8316Q9222J6524j0989O5788
$$ 2337031 2206051 2037476 2068462 2220099 2202378 2118696 2100380 2189602 2206126 2195137 2260925
10041B260925j21330p9272R0547k1418R4230N9326j29344j5612n0657j4543j11853
$$ 2260925 2139595 2060323 2150870 2129452 2223682 2283008 2153664 2138052 2087395 2072852 1960999
10030A960999M1219N5811j35710K1136Q0575M9893L7933n0159j0705K30k0046
$$ 1960999 2002218 2058029 1922319 1943455 2024030 2073923 2111856 2061697 2050992 2051222 2031176
10019B031176o4864r1602K8442n9615j44550O965M5324O5523J22638J8148j5019
$$ 2031176 1966312 1874710 1903152 1843537 1698987 1705952 1751276 1816799 1939437 1957585 1942566
10008A942566M1819j47767j36300P6332J27610k7723j54155q9677k7391J1692
$$ 1942566 1984385 1836618 1700318 1776650 1904260 1876537 1722382 1632705 1605314 1617006
9998A617006L7054J0542J1653J53063p679n0816L5666O0801R9060j6124o3521
$$ 1617006 1654060 1664602 1676255 1829318 1821639 1770823 1806489 1867290 1966350 1950226 1886705
9987A886705k9993l3498j2470L2069q8822j01164k8519J17036n3731J02938O8899
$$ 1886705 1856712 1823214 1810744 1842813 1753991 1652827 1624308 1741344 1687613 1790551 1859450
9976A859450L3526o9257m2902j096l7030N1483P0559n1615p7980K2916N277L01
$$ 1859450 1892976 1823719 1780817 1779721 1742691 1794174 1864733 1813118 1735138 1758054 1763331 1763632
9964A763632N1900n9058k6857p4932R822q8981N4431n4873J5985O2685r030k6885
$$ 1763632 1815532 1756474 1729617 1654685 1664507 1575526 1629957 1575084 1591069 1653754 1644724 1617839
9952A617839M7405j6249R5143P1639o3041J196p339j8977M7312q0397j27577j50410
$$ 1617839 1665244 1648995 1744138 1815777 1752736 1753932 1746593 1727616 1774928 1694531 1566954 1416544
9940A416544q3921J2249J58127O7723J19798L1770J2806j799K2971o596N282N0144
$$ 1416544 1332623 1344872 1502999 1570722 1690520 1722290 1735096 1733297 1756268 1749672 1754954 1805098
9928A805098M3449N6871j12270j48321j2543L7551L6734N6870K62281M96745O97911
$$ 1805098 1848547 1905418 1793148 1644827 1632284 1669835 1706569 1763439 2025720 2522465 3220376
9917C220376L10417l19807n41401m97254j75655j28385j59681l8888P2283O9725
$$ 3220376 3530793 3210986 2669585 2172331 1996676 1868291 1708610 1669722 1742005 1811730
9907A811730p9183j16523r2375J78486P7141K3472q4927l8172l6554j15953p8523
$$ 1811730 1732547 1616024 1523649 1702135 1779276 1802748 1717821 1679649 1643095 1527142 1448619
9896A448619J6237l7255p994l3535N7502K6676l274J09610J38236k6921o4658
$$ 1448619 1464856 1427601 1419607 1386072 1443574 1470250 1466976 1576586 1714822 1687901 1623243
9885A623243j41438o8740K6359p177O2001j1708P6930J02074M6377J11933K8998
$$ 1623243 1481805 1413065 1439424 1432247 1494248 1482540 1559470 1661544 1707921 1819854 1848852
9874A848852n3311n3177q1922r2427O4111Q1490l4304M3144k8384j505M1873L2232
$$ 1848852 1795541 1742364 1660442 1568015 1632126 1713616 1679312 1722456 1694072 1692567 1734440 1766672
9862A766672n9469j29206J5970L7992J1442Q330p0592k6468m1839l2752r1214
$$ 1766672 1707203 1577997 1593967 1631959 1643401 1651731 1581139 1554671 1512832 1480080 1388866
9851A388866p6542m1167j5601n4714P5120J21534J14285j1324p9996J70202M1494
$$ 1388866 1312324 1271157 1255556 1200842 1275962 1397496 1511781 1500457 1420461 1590663 1632157
9840A632157J775k7242j41573j02407J4357K3518J00559J09879k561n5641k0145
$$ 1632157 1633932 1606690 1465117 1362710 1377067 1400585 1501144 1611023 1608462 1552821 1532676
9829A532676p13l1411n1306o6114r5880l6345M7198O4682L1559L6341K6190j2571
$$ 1532676 1531963 1500552 1449246 1383132 1287252 1250907 1298105 1362787 1394346 1430687 1456877 1444306
9817A444306o3879M5526j1679j35199k5443m4796Q8166M3796N2455l2653p3049
$$ 1444306 1380427 1425953 1414274 1279075 1253632 1208836 1297002 1340798 1393253 1360600 1287551
9806A287551J38010R6460q8951l7449N0549m6372M8687R983o4600j28802M3785
$$ 1287551 1425561 1522021 1433070 1395621 1446170 1399798 1448485 1458468 1393868 1265066 1308851
9795A308851R585p1136n0060j3410Q9952J16134N2181L2695p1340K3802o5194
$$ 1308851 1318436 1247300 1197240 1183830 1273782 1389916 1442097 1474792 1403452 1427254 1362060
9784A362060j12076l7661p8302P6053J65799R9937p5237l5321j42356n5066J1233
$$ 1362060 1249984 1212323 1134021 1210074 1375873 1475810 1400573 1365252 1222896 1167830 1179063
9773A179063l4843Q9409P9906n4654o7325R265l239j3163q0614J8741N7556K2338
$$ 1179063 1144220 1233629 1313535 1258881 1191556 1200821 1197582 1184419 1103805 1122546 1180102 1202440
9761A202440O063n199L5382O0280Q347j74307p3275R0200k6599q3170p1422j7025
$$ 1202440 1208503 1203304 1238686 1298966 1307313 1133006 1059731 1149931 1123332 1040162 968740 951715
9749I51715Q0262L7752P8136o7070K178K692j2232J2775l8497j60228N9896J19256
$$ 951715 1031977 1069729 1147865 1080795 1082973 1085665 1073433 1086208 1047711 887483 947379 1066635
9737A066635K4876j19123j4042R5649M17j29557k2328J47467J07818k8735j03088
$$ 1066635 1091511 972388 958346 1053995 1054412 924855 902527 1049994 1157812 1129077 1025989
9726A025989j25447m3494o9002o0963P7361q5424r8201P1272J22759J44286O3374
$$ 1025989 900542 857048 788046 727083 804444 719020 620819 692091 814850 959136 1022510
9715A022510L3817l9123m7674k5804l5846r2508p359L4022K5903L6601m016q4313
$$ 1022510 1056327 1017204 969530 943726 907880 815372 808013 842035 867938 904539 900523 816210
9703H16210m9160r5672j05759l2503J6413J8289P8329K2764r3426k927m0226P8184
$$ 816210 767050 671378 565619 533116 549529 567818 646147 668911 575485 572558 532332 610516
9691F10516q2042p5536N5564P791m0503p8611n2264J2254j8203m5397j01181L1208
$$ 610516 528474 452938 508502 516293 475790 397179 344915 357169 338966 293569 192388 223596
9679B23596J72323k6006j38520k4688j494R3481r2575j17699o7664p5038k05022
$$ 223596 395919 369913 231393 206705 205211 298692 206117 88418 20754 -54284 -259306
9668b59306L5512k5605j9234p484n3430j4327j28255j7271L7777L36876J035327
$$ -259306 -223794 -249399 -268633 -276117 -329547 -343874 -472129 -489400 -451623 -114747 920580
9657I20580K332422M872176R247769J3258749O683728n553578q060500o402104
$$ 920580 3253002 8125178 17372947 30631696 37315424 31761846 23701346 17299242
9649A7299242m272400k647403j629674j148888q94082p12802m73801l80331l25584
$$ 17299242 13026842 10379439 8749765 7600877 6706795 5993993 5520192 5139861 4814277
9640D814277l92099l36534k54021j46134j56956j90889j42653j22390m7743m4905
$$ 4814277 4422178 4085644 3831623 3685489 3528533 3337644 3194991 3072601 3024858 2979953
9630B979953q8412K7492q7894j41970j17127n96j06506r021O8674l277M344j56123
$$ 2979953 2891541 2919033 2831139 2689169 2572042 2571446 2464940 2455919 2524593 2521316 2525660 2369537
9618B369537j08728N4802l4126J3578m9673r8114n3101j19171o362K1715m9862
$$ 2369537 2260809 2315611 2281485 2295063 2245390 2147276 2094175 1975004 1968642 1990357 1940495
9607A940495j72209N1434O1236k2806p806K3222P4197m2352k26308j52100O0908
$$ 1940495 1768286 1819720 1880956 1858150 1850344 1873566 1947763 1905411 1679103 1527003 1587911
9596A587911Q8485K281N789l9039n7350j36920m2554J25185J02535M9987J510
$$ 1587911 1676396 1678677 1684466 1645427 1588077 1451157 1408603 1533788 1636323 1686310 1687820
9585A687820N114l04L0600O0888k3146m5041j26505N6239K6277q5744p2527P8836
$$ 1687820 1692934 1692630 1723230 1784118 1760972 1715931 1589426 1645665 1671942 1586198 1513671 1592507
9573A592507L5957o6707q8169K599K3158M1187q797j82872L2821R1415j9744l458
$$ 1592507 1628464 1561757 1473588 1476187 1499345 1540532 1531735 1348863 1381684 1473099 1453355 1449897
9561A449897l1977K8309J6548q3582q0444O3347R2126j919m9867N3592R3697j33047
$$ 1449897 1417920 1446229 1462777 1379195 1298751 1362098 1454224 1452305 1402438 1456030 1549727 1416680
9549A416680j28709o9141M9155P566j9999P4723m4521O1649M5020K4142L5088
$$ 1416680 1287971 1218830 1267985 1275551 1255552 1330275 1285754 1347403 1392423 1416565 1451653
9538A451653k8295o7024R7464k6921n4687j9092j09312M1970O0233P1995k8615
$$ 1451653 1423358 1356334 1453798 1426877 1372190 1353098 1243786 1285756 1345989 1417984 1389369
9527A389369q7112K028L3798R4002K6808j52268j22723k9755K7635N2157N3229
$$ 1389369 1302257 1304285 1338083 1432085 1458893 1306625 1183902 1154147 1181782 1233939 1287168
9516A287168q6220J26739p746n5557q9515J35702M7506q6843N3216K4821K3026
$$ 1287168 1200948 1327687 1319941 1264384 1174869 1310571 1358077 1271234 1324450 1349271 1372297
9505A372297N057j04564L9281P0342m0160J1869j9100P2613m0257j27752J7893
$$ 1372297 1377354 1272790 1312071 1382413 1342253 1354122 1335022 1407635 1367378 1239626 1257519
9494A257519K1707p2019n7986J1307L8465n5969N6040Q34q1643m7163Q6922N4337
$$ 1257519 1279226 1207207 1149221 1160528 1198993 1143024 1199064 1199898 1118255 1071092 1158014 1212351
9482A212351m764J34904j0751j29381p3142j32257k3069L3316N3923L196k1034
$$ 1212351 1207587 1342491 1331740 1202359 1129217 996960 973891 1007207 1061130 1064326 1043292
9471A043292P6558j1990m3727M7867L2820M6336j8862n37q6788o7704L6493R2474
$$ 1043292 1119850 1107860 1064133 1112000 1144820 1191156 1172294 1171757 1084969 1017265 1053758 1146232
9459A146232J52918K9382M5191j74971o3257N7444k1671q9437p6926J13137J40890
$$ 1146232 1299150 1328532 1373723 1198752 1135495 1192939 1171268 1081831 1004905 1118042 1258932
9448A258932j6047j1973l3356n291o7134o9906r3120O5808M1003l3295K1048J8287
$$ 1258932 1242885 1230912 1197556 1192265 1125131 1055225 962105 1027913 1068916 1035621 1056669 1074956
9436A074956j24488J2372J36376j042j12532k379r6479J41536R6528k6460j32651
$$ 1074956 950468 962840 1099216 1098174 985642 983263 886784 1028320 1124848 1098388 965737
9425I65737q8091N3429O2147o447Q4277n7459j13995P5205k3343L5341K35907
$$ 965737 877646 931075 993222 986775 1071052 1013593 899598 974803 951460 986801 1222708
9414A222708K61288M84798N33360L21148K28545O5920K03933O3170j50384l80906
$$ 1222708 1483996 1968794 2502154 2823302 3051847 3117767 3321700 3384870 3234486 2853580
9404B853580m57802l26195r4801m9731j61494j0178k1902j51788j67784k04956
$$ 2853580 2395778 2069583 1974782 1925051 1763557 1753379 1731477 1579689 1411905 1206949
9394A206949r0274M3041q1159K4398L9487J3291p768n9434O6601m203O8453l78
$$ 1206949 1116675 1159716 1078557 1102955 1142442 1155733 1147965 1088531 1155132 1150929 1219382 1219004
9382A219004n1306N91j32Q2285N91J5411q6064j477n0020m7764M5158K0840J09438
$$ 1219004 1167698 1168289 1168157 1250442 1251033 1266444 1180380 1178903 1128883 1081119 1126277 1147117 1256555
9369A256555N9755j39997r9488r7094j2361R3371O8310p0807l8051J0672j103
$$ 1256555 1316310 1176313 1076825 979731 967370 1060741 1129051 1058244 1020193 1030865 1029762
9358A029762R7248R6494p1521J7481J5329n7460j19855j12527M3610R3528q2431
$$ 1029762 1127010 1223504 1151983 1169464 1184793 1127333 1007478 894951 938561 1032089 949658
9347I49658r4918o6276P9595R0861J2375m6092k3372K6657R2813K3735L6381j37475
$$ 949658 854740 788464 868059 958920 971295 925203 901831 928488 1021301 1045036 1081417 943942
9335I43942m0646R8545N3835k3497J11438K7349l1235p5456j67206l3258K942
$$ 943942 903296 1001841 1055676 1032179 1143617 1170966 1139731 1064275 897069 863811 866753
9324H66753P6853J03397O5420N4995m9485o9556R0924n0057j75091p2521L1866
$$ 866753 943606 1047003 1112423 1167418 1117933 1048377 1139301 1089244 914153 841632 873498
9313H73498J07662J06164Q403j05158K8430K1847p7259R050J34514N8745l0651
$$ 873498 981160 1087324 1095727 990569 1018999 1040846 963587 972637 1107151 1165896 1135245
9302A135245m7961p1634j20379l3923m1651M8548M0473J1698P7645Q3199j4008
$$ 1135245 1087284 1015650 895271 861348 819697 868245 908718 920416 998061 1081260 1067252
9291A067252r572p7659l0680k07578j28258N8776K5683j6754O5079J00059N7781
$$ 1067252 1057680 980021 949341 741763 613505 672281 697964 681210 746289 846348 904129
9280I04129K6843N7462j484k7499o1582j33275J7046Q9147M5175K2202j40618
$$ 904129 930972 988434 986950 959451 897869 764594 781640 870787 915962 938164 797546
9269G97546m4622m1896K8185M1915M8235L120O5396l468L6683o2830m3526j03351
$$ 797546 752924 711028 739213 781128 829363 832483 897879 894411 931094 868264 824738 721387
9257G21387K0844J19302o337n8740P3189k0443p3248p5793J43989J37069j6822
$$ 721387 742231 861533 855196 796456 869645 849202 775954 700161 844150 981219 964397
9246I64397l0625J39935K40873Q7538j28508j06122l4175j42875q08J26951N1529
$$ 964397 933772 1073707 1314580 1402118 1273610 1167488 1133313 990438 989630 1116581 1168110
9235A168110R3841j24999J7457l673p1723K0845n8864m9799j61978q3468J40054
$$ 1168110 1261951 1136952 1154409 1150736 1079013 1099858 1040994 991195 829217 745749 885803
9224H85803N1441L1857N3254q5266m9893J83885N6786r3686p3691J6181R6571
$$ 885803 937244 969101 1022355 937089 887196 1071081 1127867 1034181 960490 976671 1073242
9213A073242p4801j47173J7395m5327Q9657l0386k7515l7738R335M9282J14994
$$ 1073242 998441 851268 868663 823336 912993 882607 855092 817354 826689 875971 990965
9202I90965j12414l2060p0805r8794m6731M0569M7214J27673R9339m8223k2964
$$ 990965 878551 846491 775686 676892 630161 670730 717944 845617 944956 896733 873769
9191H73769l1038j7487K17311Q758j42769l1733O1413n0280l1153J0742k0148
$$ 873769 842731 825244 1042555 1051313 908544 876811 938224 887944 856791 867533 847385
9180H47385K232J1111k5141J6304Q2137R328q9557j07511j06073Q6201M3574k3127
$$ 847385 849617 860728 835587 851891 934028 943356 853799 746288 640215 726416 769990 746863
9168G46863k4657p1283J03547K1018l8229L9719L9589O8196p7920k8645L0039
$$ 746863 722206 650923 754470 775488 737259 776978 816567 884763 806843 778198 808237
9157H08237J2369M9117M4592j1370j19497P024k9020k1802J49202J79984N7777
$$ 808237 820606 869723 914315 902945 783448 790472 761452 739650 888852 1068836 1126613
9146A126613j62126l7279k6059m0402n786j06108p3815N9888L1655k8068L425
$$ 1126613 964487 927208 901149 860747 854961 748853 675038 734926 766581 738513 741938
9135G41938K5593o3827L9046K6488l8647M7830O9729J06295m4416N3776N3095
$$ 741938 767531 703704 742750 769238 730591 778421 848150 954445 910029 963805 1016900
9124A016900m2275K1658n4705r4366p9275k9214p8647N4504J36506j09485n2703
$$ 1016900 974625 996283 941578 847212 767937 738723 660076 714580 851086 741601 688898
9113F88898m069K0394r1220J2550K46398J02332j71747m305M4241N7046k781r2030
$$ 688898 684829 705223 614003 626553 872951 975283 803536 799231 843472 900518 897737 805707
9101H05707l7002Q1908J06663j5616J0035l9219j25125p943J04537r2656r3613
$$ 805707 768705 850613 957276 941660 951695 912476 787351 779408 883945 791289 697676
9090F97676j2464m1491J15242J46132N3813j11402k9341k013K295j14348n3891
$$ 697676 685212 643721 758963 905095 958908 847506 818165 816152 818447 704099 650208
9079F50208R1590J5625P8081r538j5691m4021M4353O482l8904O3836P8491n6942
$$ 650208 741798 757423 835504 825966 810275 766254 810607 817089 778185 842021 920512 863570
9067H63570Q1185M0621r417m2430J34811R2073j62285n1639n5329p6755l1053
$$ 863570 944755 985376 975959 933529 1068340 1160413 998128 946489 891160 814405 783352
9056G83352p7842r2072P2733L2812q2487r9375j2813J44608J02359O6861j7517
$$ 783352 705510 613438 686171 718983 636496 537121 524308 668916 771275 838136 820619
9045H20619j8467o8876o3818l7255P0174J10344Q060l2529l6164k5114K7132k13731
$$ 820619 802152 733276 669458 632203 702377 812721 820781 788252 752088 726974 754106 540375
9033E40375m5347J23588N2343q2918j4183J09766O4711j34305J6278J19691M137
$$ 540375 495028 618616 670959 588041 573858 683624 748335 614030 630308 749999 754136
9022G54136j02133p5879q6582K8807n34J49134J25159N775k889o2815l5946K339
$$ 754136 652003 576124 489542 518349 517815 666949 792108 797883 794994 732179 696233 698572
9010F98572n758N1112O8965Q0652q6841p8085j36293n6286O0231L7455j01718
$$ 698572 692814 743926 812891 893543 806702 728617 592324 536038 596269 633724 532006
8999E32006p5833R3717P4022N1273O5146J10841j3951j24884j33420M0699J44337
$$ 532006 456173 549890 623912 675185 740331 851172 837221 712337 578917 619616 763953
8988G63953p5832l2432J08235Q9301k9705o4662j1690p656k8677l1630m9640k1647
$$ 763953 688121 655689 763924 853225 823520 758858 747168 739512 710835 679205 629565 607918
8976F07918K1218p2699o2054P0097l8514R8949P5107p5213k3310m9409R4247Q0206
$$ 607918 629136 556437 494383 564480 525966 624915 700022 624809 601499 552090 646337 726543
8964G26543O28j24151J5644J24165L9779p1886J9722m1655l227l8308p4359k292
$$ 726543 727171 603020 618664 742829 782608 710722 730444 688789 685562 647254 572895 570603
8952E70603Q6733K0633j2271M8304L3118J18313n323j17291j61106j26037N9270
$$ 570603 657336 677969 665698 714002 747120 865433 860110 742819 581713 455676 514946
8941E14946K5091J32090J1963P3000o494j65874p9199J07611L4613p3234p557
$$ 514946 540037 672127 684090 757090 750596 584722 505523 613134 647747 574513 566956
8930E66956Q7653P1407N5356j20466n7379J38095O4955n0210j1101o949q1789
$$ 566956 654609 726016 781372 660906 603527 741622 806577 756367 745266 738317 656528
8919F56528q0999P5130J9474L3958o423k987M924P9079n4611n593O1683K268R9022
$$ 656528 575529 650659 670133 704091 697668 694681 699605 778684 724073 718480 780163 782431 881453
8906H81453Q4092j12653j18419j2202j34547o8493O5740J42070P1888l0642J4726
$$ 881453 965545 852892 734473 722271 587724 519231 584971 727041 798929 768287 783013
8895G83013j84611j94823P7766J14258l6242m3180M6984m8855M7634J18248P5489
$$ 783013 598402 403579 481345 595603 559361 516181 563165 514310 561944 680192 755681
8884G55681J33560j32458k19699p7207P0376O7461K6448L1180K5448k1446q6995
$$ 755681 889241 756783 537084 459877 530253 597714 624162 655342 680790 659344 572349
8873E72349p339K2004J26719M809j52437o5142J59670P6207P253l2462L5397r0926
$$ 572349 565010 587014 713733 718542 566105 500963 660633 736840 744093 711631 747028 656102
8861F56102j39837k5398j7652J8064K9942j5558j526l8547k2020J2725J06376
$$ 656102 516265 490867 473215 491279 521221 505663 504137 465590 443570 456295 562671
8850E62671k791m4969j0109q6901N5820P687o2269J25577K1616r6428N6500J84165
$$ 562671 559880 514911 504802 417901 473721 481408 419139 544716 566332 469904 526404 710569
8838G10569J17879m2998r0578j27641K4118K6731M5109n4672r1887O11l6627O057
$$ 710569 828448 785450 694872 567231 591349 618080 663189 608517 516630 517241 480614 486671
8826D86671M8398J6306l2680j01910Q8026J29479n454l4229m1679m7451P7984
$$ 486671 535069 551375 518695 416785 504811 634290 628836 594607 552928 505477 583461
8815E83461P2882J05757l8101j1892o2289J0134n8084j24096o73L6423m8089j0147
$$ 583461 656343 762100 723999 712107 649818 659952 601868 477772 477099 513522 465433 455286
8803D55286J48043q583j3912o3418L4348P7845o3896J05860R9335r2743k3452
$$ 455286 603329 594746 580834 517416 551764 629609 565713 671573 770908 678165 654713
8792F54713P9185l1162j13808j34827l0209q452J15772P3597j2458p0533K0736
$$ 654713 733898 702736 588928 454101 423892 415440 531212 604809 592351 521818 542554
8781E42554N5121l2983L8313N376Q7494L7021q7773m5530q5488L3035N9697m179
$$ 542554 597675 564692 603005 608381 695875 732896 645123 599593 514105 547140 606837 602658
8769F02658n2935p5859q9435k6958Q0216J1347J32074J1080j38625M4776Q2801
$$ 602658 549723 473864 384429 357471 437687 449034 581108 592188 453563 498339 581140
8758E81140l6424k0911q8245L5980K1615p1756m8418O9004L4307M6101N738o079
$$ 581140 544716 523805 435560 471540 493155 421399 372981 441985 476292 522393 528131 522052
8746E22052L864L3842k8262O8735O6005l6646r4422p8948k2674n1327j52111j5265
$$ 522052 525916 559758 531496 600231 666236 629590 535168 456220 433546 382219 230108 214843
8734B14843J60223Q4127j31912J2394R4497J34366J1179n2000K3344k1627o5111
$$ 214843 375066 459193 327281 339675 434172 568538 579717 527717 551061 529434 464323
8723D64323L8876K9587P6953n6465Q0061J5503j2267j10933p9412O5126J5710
$$ 464323 503199 532786 609739 553274 633335 648838 636571 525638 446226 511352 527062
8712E27062K8896l9947k6548k0129N2633Q3623j27666k2371p9408j2486Q4250
$$ 527062 555958 516011 489463 469334 521967 605590 477924 455553 376145 363659 447909
8701D47909R8430N0596q8320j11661q6908j2126P1397j2627N986J18686R8629
$$ 447909 546339 596935 508615 396954 310046 297920 369317 356690 362676 481362 579991
8690E79991k9188m3004q3167j45235M93m858Q6440O1650m8132j1339J24003L8613
$$ 579991 550803 507799 424632 279397 279890 275032 361472 423122 374990 363651 487654 526267
8678E26267K7069j0934m5122l8558j02726J64482j7556j5034O4955K5279j00369
$$ 526267 553336 542402 497280 458722 355996 520478 502922 487888 552843 578122 477753
8667D77753j39233r3778o6381J01435N5505o2859m140L4249R6574J04888N9538
$$ 477753 338520 244742 178361 279796 335301 272442 268302 302551 399125 504013 563551
8656E63551R4266r3103j55606j16212O9412j6548l364O282N6966m8104m5824J13774
$$ 563551 657817 564714 409108 292896 362308 345760 342396 348678 405644 357540 311716 425490
8644D25490R2118P2599N9967j29480j37936J28179O7956L1138j07946r2950J9131
$$ 425490 517608 590207 650174 520694 382758 510937 578893 610031 502085 409135 428266
8633D28266l770n1834q2686k4682J11877M4274P827q7880Q8929K53454J5771p1176
$$ 428266 424496 372662 289976 265294 377171 421445 429272 341392 430321 683775 699546 628370
8621F28370p6353j23783Q3814L5423L1045K7397k277q0883j63703k5329J32882
$$ 628370 552017 428234 512048 547471 578516 605913 603636 522753 359050 333721 466603
8610D66603L169n1558O0066M2759O7305j8370Q2323J18416m8640o1354j9891n3260
$$ 466603 469772 418214 478280 521039 588344 569974 652297 770713 722073 660719 640828 587568
8598E87568l5215J03802j51894j56804l1809k0604Q5693N2079K6664j4639J8042
$$ 587568 552353 656155 504261 347457 315648 295044 380737 432816 459480 444841 462883
8587D62883M6362j8996K8269J6956M882J1671k4970l1818k2766R1475o6072n8797
$$ 462883 509245 490249 518518 535474 540356 552027 527057 495239 472473 563948 497876 439079
8575D39079Q4052J2815q2425j4090Q6188M8761m4444p1267r1182L903j1384J12424
$$ 439079 523131 535946 453521 439431 525619 574380 529936 458669 367487 371390 360006 472430
8563D72430P3738l6448j6372N3622j8236n0494o1178O8759o1640p1795Q7145n0664
$$ 472430 546168 509720 493348 546970 528734 478240 417062 485821 424181 352386 439531 388867
8551C88867P7422m6518p966M7298Q0872Q0280N4124j98j26130j26284n2683j12440
$$ 388867 466289 419771 411805 459103 539975 620255 674379 674181 548051 421767 369084 256644
8539B56644n1876L3748L5197R5607K9952j5910q8193J01390K365R020n2528m6998
$$ 256644 204768 238516 273713 369320 399272 383362 295169 396559 398924 407944 355416 308418
8527C08418O1374N5380L5167J92J8069k7067Q311L6362l6983O9105O0807m0035
$$ 308418 369792 425172 460339 460531 478600 451533 459844 496206 459223 528328 589135 549100
8515E49100k257m5794l1759j8258P158O1621P0323M1733N9137O6576j21597o8531
$$ 549100 546843 501049 469290 451032 458190 519811 590134 631867 691004 757580 635983 567452
8503E67452p4249M5068q4051p4715O9455R0884r3965q1805j07604l453j7181N9793
$$ 567452 493203 538271 454220 379505 448960 539844 445879 364074 256470 253017 235836 295629
8491B95629M1568Q9569M7799j09776k5604P8866L2817O2694p2039j48652j8625
$$ 295629 337197 426766 474565 364789 339185 418051 450868 513562 441523 292871 274246
8480B74246P798Q2091P5822p044j3188q4296p5096Q7410n843J3541J3594M2926
$$ 274246 282044 364135 439957 432913 419725 335429 260333 347743 341900 355441 369035 411961
8468D11961N1564J6221R7454J619p2046j189K03794M710j48292o8337K03j0767
$$ 411961 463525 479746 577200 578819 506773 505584 709378 714088 565796 497459 497662 486895
8456D86895j15229p485j9405J660K3212L463j70054q8410j0397N9691J72589K0423
$$ 486895 371666 364181 344776 346436 369648 373111 203057 114647 104250 163941 336530 356953
8444C56953m3108Q269j64471K3502P8714N8762k9630J7888J35847P0230k5501
$$ 356953 313845 322114 157643 181145 259859 318621 288991 306879 442726 512956 487455
8433D87455j09579q1810M5411K660M2437k4923m7529L3316j00036o8619P8474
$$ 487455 377876 296066 341477 344137 386574 361651 314122 347438 247402 178783 257257
8422B57257Q0243P8117o3559j5891Q6980J3592l0960p1888l2463J0830K11100
$$ 257257 337500 415617 352058 336167 423147 436739 405779 333891 301428 312258 523358
8411E23358k2422q1646j61366o9400l675k8346M8627J24068k1477O110K8457q8652
$$ 523358 500936 419290 257924 188524 184849 156503 205130 329198 307721 313831 342288 253636
8399B53636l3028o9359R7440Q0577n8294J02286J67208r524j03566j24503L1873
$$ 253636 220608 151249 248689 329266 270972 373258 540466 530942 427376 302873 334746
8388C34746j7958j11832R7864J46918K7419K8181k8108M248n3091p2583o4711
$$ 334746 316788 204956 302820 449738 477157 505338 477230 481478 428387 355804 291093
8377B91093l127K7933N114n2288M9254O9417J8318m0429J2064K1803l5417N515
$$ 291093 287966 315899 321013 268725 317979 387396 405714 365285 377349 399152 363735 369250
8365C69250R4774k2287p7903p6471M8242J57074k566m6757o6152M0147J08316
$$ 369250 464024 441737 363834 287363 335605 492679 490113 443356 377204 417351 525667
8354E25667n6828k0039p7216j35685O8536j1658J767M7944j4794p1426q621O1888
$$ 525667 468839 448800 371584 235899 304435 292777 294544 342488 327694 256268 247647 309535
8342C09535Q1987O6273L3513o1989j0806J12356M6058j45459k4438m0496M8806
$$ 309535 391522 457795 491308 429319 418513 530869 576927 431468 407030 366534 415340
8331D15340n9599r9662O0848J7743o14J11463l1650l7585P2383K70l1552P4581
$$ 415340 355741 256079 316927 334670 334056 445519 413869 376284 448667 448937 417385 491966
8319D91966q4186j15920L3336k2029L7989M7144k7024r318Q1388M5692N70L6660
$$ 491966 407780 291860 325196 303167 341156 388300 361276 351958 433346 479038 479608 516268
8307E16268j68313m1679K1631k7149o505l9792k0810J8410J05005J79028O4233
$$ 516268 347955 306276 327907 300758 294253 254461 233651 252061 357066 536094 600327
8296F00327j20495J0311L2500l8104j05042p4323R3482J2706j45715m5209K2954
$$ 600327 479832 490143 522643 484539 379497 305174 398656 411362 265647 220438 243392
8285B43392J6760K03283P8763l4456l6349n0952j9859j1896k2336M9065n101j14215
$$ 243392 260152 463435 542198 507742 471393 420441 400582 388686 366350 415415 410314 296099
8273B96099q9663q0597O7252J25156J4982N4340q1919j4044O5325J18384J3323
$$ 296099 206436 125839 193091 318247 333229 387569 305650 291606 356931 475315 488638
8262D88638n6039J35632P481n5276J2866M400q3787Q1955L4407k23305n7836L1953
$$ 488638 432599 568231 575712 520436 533302 537702 453915 535870 570277 346972 289136 321089
8250C21089M730J9284J26638j3802r64q6809p820j03654K5670m47l2304L3995
$$ 321089 325819 345103 471741 457939 456975 370166 362346 258692 284362 283915 251611 285606
8238B85606l8151L0757P8410J03511K9593j12119j22912L3257M7007j06766N2441
$$ 285606 247455 278212 356622 460133 489726 377607 254695 287952 334959 228193 280634
8227B80634J58501p1257m4034n7022j4918L8145J8817m5440j14435K9106j6554
$$ 280634 439135 367878 323844 266822 251904 290049 308866 263426 148991 178097 161543
8216A61543r239J4824n6926L0620O7675P9594N9266M7728l8065p5163J62166J25051
$$ 161543 152304 167128 110202 140822 208497 288091 347357 395085 357020 281857 444023 569074
8204E69074o6720r4529j00252n2519M7444P4128K6839j00213p601M5141M5871
$$ 569074 502354 407825 307573 255054 302498 376626 403465 303252 295651 340792 386663
8193C86663O7551r54n6673J4814L8531q8940p7768K4973J00850N5816k4737n5695
$$ 386663 454214 453260 396587 411401 449932 360992 283224 308197 409047 464863 440126 384431
8181C84431n4744m0218J11550J3483N9147j3347j25349o7162m7521Q3566K6699
$$ 384431 329687 289469 401019 414502 473649 460302 334953 267791 220270 303836 330535
8170C30535p1170k5847o35J18187l3058q5975P7741j4096n2298O8391P1869n8826
$$ 330535 259365 233518 232883 351070 318012 232037 309778 295682 243384 311775 383644 324818
8158C24818j31279K2227P4854L0803m3061K1059m3239j33L2121P7085Q36p3588
$$ 324818 193539 215766 290620 321423 278362 299421 256182 256049 288170 365255 366091 292503
8146B92503o4837Q6098r704p1071q509j08792J37958K25799l432p7545K9447O7019
$$ 292503 227666 313764 304060 232989 224480 115688 253646 479445 476013 398468 427915 494934
8134D94934q0834N353n2147p1896j1003M0452j3772l8558N754J6890m8869K9825
$$ 494934 414100 419453 367306 295410 284407 324859 311087 272529 278283 295173 246304 276129
8122B76129M2638n3565j52159m2911L6511J8012J53853r3777j58727M588J46809
$$ 276129 318767 265202 113043 70132 106643 124655 278508 184731 26004 30592 177401
8111A77401J21016R5484L2959K4422n8359j11299q0921J09927L1268n3370k2968
$$ 177401 298417 393901 426860 451282 392923 281624 200703 310630 341898 288528 265560
8100B65560j3067o8829k5033L6677Q787O9031m3885L5308L3129r7970L5658Q0526
$$ 265560 252493 183664 158631 195308 204095 273126 229241 264549 297678 199708 235366 315892
8088C15892L1676q2695o718n296q6264M1463Q9733o682O1873m0808l2019J2671
$$ 315892 347568 264873 258155 252859 166595 208058 297791 291109 352982 312174 280155 292826
8076B92826r850j8687J3790o2316k607k3718k7304L1424M8012o2260o7099j1192
$$ 292826 282976 264289 278079 215763 213156 189438 162134 193558 241570 179310 112211 101019
8064A01019K6880j3916O4569J16080J10555m5610N865K9487O0921p0424j85294
$$ 101019 127899 113983 178552 294632 405187 359577 365442 394929 455850 385426 200132
8053B00132o4644P5505M2363q5365M4721J43178j6284r5348q9316Q6915J22798
$$ 200132 135488 210993 253356 167991 212712 355890 339606 244258 154942 241857 364655
8042C64655q9341j08964o2590n5523N3548N3853j4306Q0900O5092k8790K9916
$$ 364655 275314 166350 103760 48237 101785 155638 141332 222232 287324 258534 288450
8031B88450q0113J9773M6293R0097O8495Q3762k6395q8891n8148j15825M5885
$$ 288450 208337 228110 274403 364500 432995 516757 490362 401471 343323 227498 273383
8020B73383L528l9942K5254O3872l5236j01091o0965M7533j0324M0022K2945M4250
$$ 273383 276911 236969 262223 326095 290859 189768 128803 176336 166012 206034 228979 273229
8008B73229q2202j44236o5604P2381N3317J06535P6573p5698n3728K593O0547
$$ 273229 191027 46791 -18813 53568 106885 213420 289993 214295 160567 163160 223707
7997B23707Q3968K1933L2902Q9258L1098j08177j20108j14720K2352K9226p5379
$$ 223707 307675 329608 362510 451768 482866 374689 254581 139861 162213 191439 116060
7986A16060o6250J20399Q7037J25100k2517M2783M2909j1098l9195M3947j11467
$$ 116060 49810 170209 257246 382346 359829 402612 445521 434423 395228 439175 327708
7975C27708p1553P6764N918p4798j39749m2234J24548K6553j75276K4338J4906
$$ 327708 256155 332919 338837 264039 124290 82056 206604 233157 57881 82219 97125
7964I7125l6374M0342M0546J29052R92M513N7878k3426P1933P5595j53016q8883
$$ 97125 60751 101093 141639 270691 271683 276196 334074 310648 382581 458176 305160 216277
7952B16277q4665k7535M4349K4144k1524P6194m8783j1278r283J32771N0414l7360
$$ 216277 131612 104077 148426 172570 151046 227240 178457 167179 157896 290667 341081 303721
7940C03721q4864K4050J05320J4437k4021m5557l427K4193N2263Q038o5024m1155
$$ 303721 218857 242907 348227 362664 338643 293086 289659 313852 366115 374153 309129 267974
7928B67974R9733O0118j08899j01388q3406K5520M1070j00191O6724N7573o7540
$$ 267974 367707 427825 318926 217538 134132 159652 200722 100531 167255 224828 157288
7917A57288o829R8706Q1257l2804j01477j23686M7087J26951O065J9399M2075
$$ 157288 150459 249165 330422 297618 196141 72455 119542 246493 252558 271957 314032
7906C14032l8342l5752R5317J24035P909n7464o2250p8933J4044l9574k0736L2740
$$ 314032 275690 239938 335255 459290 467199 409735 347485 268552 282596 243022 222286 255026
7894B55026j258K2150K9024O105J1516J3279J04246j05973j17639L588K0000K176
$$ 255026 253768 275918 304942 311047 322563 335842 440088 334115 216476 220064 240064 242240
7882B42240l5557j00988L4995J7149K7780k8986p2445P2235L8222q439n907M2600
$$ 242240 206683 105695 140690 157839 185619 156633 84188 156423 194645 186206 180299 222899
7870B22899J9389n5560R454J42196O2400o309n9212R0678J2130l4392j04215j31324
$$ 222899 242288 186728 196182 338378 400778 394469 335257 425935 438065 403673 299458 168134
7858A68134m3304K2625R1451J13753k5648L2116j14214r9909J02249R2425J15737
$$ 168134 124830 147455 238906 352659 327011 359127 244913 145004 247253 339678 455415
7847D55415k6519o4180o6211m3916M7694m090K076J4296q1665n1022o6645k1253
$$ 455415 428896 364716 298505 254589 302283 298193 300269 314565 232900 181878 115233 93980
7835I3980J92631J39247p1125o3208L2722l4616k6268P1963j3760m4197J5501
$$ 93980 286611 425858 354733 291525 324247 289631 263363 335326 321566 277369 292870
7824B92870n1512o9514J7809M3988K4442L5004j01393M790o1274k6592J7514q6653
$$ 292870 241358 171844 189653 233641 258083 293087 191694 196484 135210 108618 126132 39479
7812C9479L7643J40020J0032K6954n3994K0404m2092n9421j6976K2315P6091P1762
$$ 39479 77122 217142 227174 254128 200134 220538 178446 119025 102049 124364 200455 272217
7800B72217J08979j09599j59791O0516P4708l7776M2098j0715m8240o143q0614
$$ 272217 381196 271597 111806 172322 247030 209254 251352 240637 192397 186254 105640
7789A05640R1519Q2792j2724j2828q5427L026r2862J09539J09940K9333n4893
$$ 105640 197159 279951 267227 254399 168972 171998 79136 188675 298615 327948 273055
7778B73055j2853m5703q077L7682J20445p2592p5720k0202r2366M3356M2652m6311
$$ 273055 260202 214499 206422 244104 364549 291957 216237 196035 103669 147025 189677 143366
7766A43366O0601J01700k0730l2850k1784j15355k6219N9275J22314j06409K9982
$$ 143366 203967 305667 284937 252087 230303 114948 88729 148004 270318 163909 193891
7755A93891J29726L3986P198q1936k5047M9019K394j63323p9494R9323m1422O5774
$$ 193891 323617 357603 364801 282865 257818 306837 309231 145908 66414 165737 124315 190089
7743A90089L1899l7677P4138K8375j1479j19897p7096M0953k8953R9112Q2814
$$ 190089 221988 184311 258449 286824 275345 155448 78352 119305 90352 189464 272278
7732B72278J36719k1352j44279o0651k3940k1915L6956P7723P8941O3386j01830
$$ 272278 408997 387645 243366 182715 158775 136860 173816 251539 330480 393866 292036
7721B92036m0535j2586q3920P6907Q962q5377j38269k2715J18512J22513N7098
$$ 292036 251501 238915 154995 231902 240864 155487 17218 -5497 113015 235528 292626
7710B92626j9805N8975L9015L8712k2181j30270l8J76684l8343j38976p6157M7254
$$ 292626 272821 331796 370811 409523 387342 257072 257034 433718 395375 256399 180242 227496
7698B27496K93m0481j20949J0539L3854j07970P7298l9426n3277J06451J42597
$$ 227496 227789 187308 66359 76898 110752 2782 80080 40654 -12623 93828 236425
7687B36425n860j4063J20502p8039J1991k9782O1818j04459j6692J6702J0064
$$ 236425 230565 216502 337004 258965 270956 241174 302992 198533 181841 198543 208607
7676B08607r461n5051M6340N5986O0361n420j06073n5348R7861K2228l6486r014
$$ 208607 199146 144095 190435 246421 306782 301362 195289 139941 237802 260030 223544 214530
7664B14530K9950J7596j9175o4574m6873r3075Q0284K473q1437p7317K08654L3544
$$ 214530 244480 262076 242901 178327 131454 38379 118663 121136 39699 -37618 171036 204580
7652B04580m6995J00430k2826n6056m1708j6344o8927j00387m3901K0026N8317
$$ 204580 157585 258015 235189 179133 137425 121081 52154 -48233 -92134 -72108 -13791
7641a3791K5552k6452J23663L4885j732o1809N778k7637J00812M891o4m3040O1518
$$ -13791 11761 -14691 108972 143857 142125 80316 86094 58457 159269 164160 164096 121056 182574
7628A82574q2500l3055N4214L4238n5076O8538J8266o5690j95L1144k8897N0651
$$ 182574 100074 67019 121233 155471 100395 168933 187199 121509 121314 152458 123561 174212
7616A74212J37961j05972k00066M8355l7176P496L0622L8749l4347k0771M6708
$$ 174212 312173 206201 6135 54490 17314 24810 55432 94181 59834 39063 85771
7605H5771Q926N1906m4344j23611l6973L3652J72756K6313p9855l2245J31172
$$ 85771 94697 146603 102259 -21352 -58325 -24673 148083 174396 94541 62296 193468
7594A93468K236p4042M1571O4115O5977j3567Q217p1176j1508n3150j17611J02996
$$ 193468 195704 121662 163233 227348 293325 279758 287975 216799 205291 152141 34530 137526
7582A37526O5818k0225N5835m9589J05024m515J4220J0015j11378O129L7161k1232
$$ 137526 203344 183119 238954 189365 294389 289874 304094 314109 202731 208860 246021 224789
7570B24789o814M6795q5394m3479n2337L9593J13967l1294n8836m1840j4097N0549
$$ 224789 217975 264770 179376 135897 83560 123153 237120 205826 146990 105150 91053 141602
7558A41602R6049R711J58630J3794j22341n6785p5209j36434J59250R9532L994
$$ 141602 237651 247362 405992 419786 297445 240660 165451 29017 188267 287799 291793
7547B91793k9508j0731N3243m4866p9982q7735O1818o2061o0695Q5992Q8575q7989
$$ 291793 262285 251554 304797 259931 179949 92214 154032 91971 31276 117268 205843 117854
7535A17854p4238Q610L3470L0044p4649q0032L2372O4369k0083J32295J23055
$$ 117854 43616 52226 85696 115740 41091 -38941 -6569 57800 37717 170012 293067
7524B93067l0061j68839j19154P5085K4406n6014k5393M1654O954J271L30R4188
$$ 293067 263006 94167 -24987 50098 74504 18490 -6903 34751 41705 42976 43306 137494
7512A37494J39720l0633o2299l8918j30249K0772J07092j3889m1540m1414k8358
$$ 137494 277214 246581 184282 145364 15115 35887 142979 129090 87550 46136 17778
7501A7778M4874q0907j0894J11905J3390J2926J2921j05662Q961M6406J9092J23374
$$ 17778 62652 -18255 -29149 82756 96146 109072 121993 16331 25292 71698 90790 214164
7489B14164M1382k1532j16725O7287J15535J770n7448j53120j35753l2662O6544
$$ 214164 255546 234014 117289 184576 300111 301881 244433 91313 -44440 -77102 -10558
7478a0558N0778o3282j221J3427j6837J2301M204k3273p1771K7011R8533Q4634
$$ -10558 40220 -23062 -24283 -10856 -27693 -15392 -11188 -34461 -106232 -79221 19312 103946
7466A03946K4071L9348L7821Q4520J6258j96380k8661n7673n9359o0988l529Q7555
$$ 103946 128017 167365 205186 289706 305964 109584 80923 23250 -36109 -97097 -100626 -13071
7454a3071J4686N5481k0943l2799J9916N2599J9744N4026j37652K6671O9356J06468
$$ -13071 1615 57096 36153 3354 23270 75869 95613 149639 11987 38658 108014 214482
7442B14482o7171j09215K0490Q2824R8964m3319n2402j00879r6053m4074N1750
$$ 214482 147311 38096 58586 141410 240374 197055 144653 43774 -52279 -96353 -44603
7431d4603N8132j03665m414M3982J79211N7522l7695o697M1813j87398l9807M6432
$$ -44603 13529 -90136 -94550 -50568 128643 186165 148470 141773 183586 -3812 -43619 2813
7419B813n7944j2813J47880N2125L3271k4975p3037P685l0833M81J4905j12454
$$ 2813 -55131 -67944 79936 132061 165332 140357 67320 75005 44172 44653 59558 -52896
7407e2896j3790M4901L8858N3549K5812J25516K2638j22588n9462J10006n027
$$ -52896 -66686 -21785 17073 70622 96434 221950 244588 122000 62538 172544 167517
7396A67517n9297m2082O8607L0064J9468O6052j16928N535O3633j4250j7663L445
$$ 167517 108220 66138 134745 164809 184277 250329 133401 138936 202569 188319 170656 174101
7384A74101o9605p1575j2458L4996K0140J03438M4671J5552P1398l4891r4081
$$ 174101 104496 32921 20463 55459 75599 179037 223708 239260 310658 275767 181686
7373A81686j29247o6958j4207K747M009n9999q9849K8935N2124J58139m6621J9417
$$ 181686 52439 -14519 -28726 -25979 -21970 -81969 -171818 -142883 -90759 67380 20759 40176
7361D0176l3029O7673p2821K4483q4134M7783L828J529K6612K7792L5433K0772
$$ 40176 7147 74820 1999 26482 -57652 -9869 -6041 -4512 22100 49892 85325 106097
7349A06097M8595M782n0798L8911j0360j00233r2269j40569N9644J46933j6075
$$ 106097 154692 159474 108676 147587 137227 36994 -55275 -195844 -136200 10733 -5342
7338e342J104J09825Q7024j44799j43930L0552P6770J13133L1125M677o7144j92939
$$ -5342 -4238 105587 192611 47812 -96118 -65566 11204 124337 155462 160139 92995 -99944
7326i9944M894J41473O5803p6305o1684P549M4871L1586N4691N1495R6888j06014
$$ -99944 -95050 46423 112226 35921 -25763 -18214 26657 58243 112934 164429 261317 155303
7314A55303n0351L6703K7147O2516p7774l4759J00161P1013o3095j5914k7153
$$ 155303 104952 141655 168802 231318 153544 118785 218946 289959 226864 210950 183797
7303A83797N1147l7724J9475p0056j23569r273J02376J51635j4160m1066M9927
$$ 183797 234944 197220 216695 146639 23070 13797 116173 267808 253648 212582 262509
7292B62509k23179J9711N1874j616q181J5025o1049R587j24605K4945j8317P3676
$$ 262509 39330 59041 110915 109299 101118 116143 55094 64681 -59924 -34979 -53296 20380
7280B0380R2812j2552O5671n0351m8616M8080l5185P603m0196j0753O3788m4019
$$ 20380 113192 100640 166311 115960 67344 115424 80239 87842 47646 36893 100681 56662
7268E6662o1439o57m1439P703r372K6392R6525r4594k7095Q0830J00478Q2216
$$ 56662 -4777 -5434 -46873 -39170 -48542 -22150 74375 -20219 -47314 33516 133994 216210
7256B16210m263j02205J19024n0558l3446j9580j07077q1955M1495J3277M8410
$$ 216210 211947 109742 228766 178208 144762 125182 18105 -63850 -22355 -9078 39332
7245C9332N9370O8326P328N749J06330J9298l4358j4689o7563l5582J1431P3135
$$ 39332 98702 167028 174356 180105 286435 305733 271375 256686 189123 153541 164972 238107
7233B38107j2323K4364m7542m3936j14212j27910O3128P6662n8746j13564r8525
$$ 238107 225784 250148 202606 158670 44458 -83452 -20324 56338 -2408 -115972 -214497
7222b14497Q5519R5100M5014j51887r72J71165J68360r2770j30895j2630J08136
$$ -214497 -128978 -33878 11136 -140751 -141723 29442 197802 105032 -25863 -38493 69643
7211F9643M4611r758o4893M2123n2101l8163j7143o6935Q6574L7879N0426M7280
$$ 69643 114254 104496 39603 81726 29625 -8538 -25681 -92616 -6042 31837 82263 129543
7199A29543Q2601n4918q2833J37444J35164r9643j24125m1225J876j3471M6154
$$ 129543 212144 157226 74393 211837 347001 247358 123233 82008 83884 70413 116567
7188A16567J0924R1955L9672k8448n8891M3359J03023L4963o6555n6603r0064
$$ 116567 127491 219446 259118 230670 171779 215138 318161 353124 286569 229966 139902
7177A39902j0211M4710n5624k0765p1198l9417k0782L38O1963K8169Q8996J3868
$$ 139902 129691 174401 118777 98012 26814 -12603 -33385 -33047 28916 57085 146081 159949
7165A59949o5084M6072l487q038J2303J01554l1187R5N0936l8429j13616l2935
$$ 159949 94865 140937 137450 129412 141715 243269 212082 212177 263113 224684 111068 78133
7153G8133r5748r7638n2107M2225J94848P1117l5269O9453o833m1790Q9029J0689
$$ 78133 -17615 -115253 -167360 -125135 69713 140830 105561 175014 168181 126391 215420 226109
7141B26109J5264j28638L6470p8890j52662O3307K8487P0654M3361j23743l321
$$ 226109 241373 112735 149205 70315 -82347 -19040 9447 80101 123462 -281 -3602
7130c602J12673l0441j20275o1677R5937J14370l3670j03873o9553k6409L4212
$$ -3602 109071 78630 -41645 -103322 -7385 106985 73315 -30558 -100111 -126520 -92308
7119i2308J16811l1309n274P0690q4378P8117l8292l1199k2259L3043N5719K3308
$$ -92308 24503 -6806 -12080 58610 -25768 52349 14057 -17142 -39401 -6358 49361 72669
7107G2669J8401j01812j13800N1958M8965q1768J8800N5711j6150P174J30897
$$ 72669 91070 -10742 -124542 -72584 -23619 -105387 -86587 -30876 -47026 -39852 91045
7096I1045J26783P6005p3216j11951m0780j7304K0681l3467O1238J3145j705M3832
$$ 91045 217828 293833 220617 108666 67886 50582 71263 37796 99034 112179 110474 154306
7084A54306R235M5484J5463j06010j09325k3479p4569O5396M2178J44779o0657
$$ 154306 163541 209025 224488 118478 9153 -14326 -88895 -23499 18679 163458 102801
7073A02801j64965M3773Q5831K0220L8984R9832l8107o8587l3295m5882L6801
$$ 102801 -62164 -18391 67440 87660 126644 226476 188369 119782 86487 40605 77406
7062G7406N4556k069j26892k3889K9663J07867J9558k2789Q6799k6142j60871
$$ 77406 131962 129893 3001 -20888 8775 116642 136200 113411 200210 174068 13197
7051A3197o1378M4514P171J0215R0258O7857l376j48324j05789j9650O798P472
$$ 13197 -48181 -3667 3504 13719 103977 171834 168458 20134 -85655 -105305 -98507 -91035
7039i1035q4305K2863Q3764L6613l6346N0578R3245K3501J05350r4080n6544J3329
$$ -91035 -175340 -152477 -68713 -32100 -68446 -17868 75377 98878 204228 110148 53604 66933
7027F6933r2257o9335J22111N8916N5957j05925j6321J09365o5874O430J31625
$$ 66933 -25324 -94659 27452 86368 142325 36400 20079 129444 63570 70000 201625
7016B01625O4970R7311K2054j47012l3275n4842p6035M4809j6904j3086l135M9494
$$ 201625 266595 363906 385960 238948 205673 150831 74796 119605 102701 89615 86480 135974
7004A35974q8346n8665N7998L5043M607o3783k5738l2985j5627M371J098l7864
$$ 135974 47628 -11037 46961 82004 86611 22828 -2910 -35895 -51522 -47151 -46053 -83917
6992h3917m7232m09n1953J54680N3406q6558l8824J12746L2946o0783r3875j32820
$$ -83917 -131149 -131558 -183511 -28831 24575 -61983 -100807 11939 44885 -15898 -109773 -242593
6980b42593J7510J55266J57777J27246J0086j10631l8418L9687M355N2246j15244
$$ -242593 -225083 -69817 87960 215206 225292 114661 76243 115930 120285 172531 57287
6969E7287l7826l785Q607r3599O8092P2131M6890J3716m1780P3993m8106k3949
$$ 57287 19461 15676 24283 -69316 -1224 70907 117797 131513 89733 163726 115620 91671
6957I1671p8745k3161Q7361m3229q3891n073o0823m1873n9806Q3604J18022Q9565
$$ 91671 12926 -10235 77126 33897 -49994 -55067 -115890 -157763 -217569 -133965 -15943 73622
6945G3622J3750J13480j349j09728j12439j10083K1476k2548O8338P7641R9026
$$ 73622 87372 200852 199503 89775 -22664 -132747 -111271 -133819 -65481 12160 111186
6934A11186j148J9544K8152j3553L23m9899p0333j20351r8966J07699J5489J58970
$$ 111186 110038 129582 157734 144181 144504 94605 24272 -96079 -195045 -87346 -71857 87113
6922H7113J50025k6273j1485j60148j4799K7369q8117L5497O8257j3233j04306
$$ 87113 237138 210865 199380 39232 24433 51802 -36315 -818 67439 54206 -50100
6911e0100J06759K0475K9083O7083Q172l4258m9874J0328m447J3858k2159m294
$$ -50100 56659 77134 106217 173300 181472 147214 97340 107668 103221 117079 94920 90626
6899I0626L4319j24070j07989R2049J17307L2571n6050P7297N4981j6404k7085
$$ 90626 124945 875 -107114 -15065 102242 134813 78763 156060 211041 194637 167552
6888A67552j8979n025l2256j16711K6557J55305j5424q2085j3624r950J37210
$$ 167552 148573 143548 111292 -5419 21138 176443 161019 78934 65310 55360 192570
6877A92570M51j42223l6209R3903J61855k254p3477r5005L0494L8953o4814o2855
$$ 192570 193021 50798 14589 108492 270347 268093 194616 99611 130105 169058 104244 41389
6865D1389L1925K7199m0759j48540r4301m2456o4554J63065J86655M4779r2160
$$ 41389 73314 100513 59754 -88786 -183087 -225543 -290097 -127032 59623 104402 12242
6854A2242o5756l549k4888q7793O6926R6665j545R235J09913r307N895r7799M438
$$ 12242 -53514 -57063 -81951 -169744 -102818 -6153 -7698 1537 111450 102143 108038 10239 14677
6841A4677L766m5336M8691L2367p950Q1979M6016P1383L3335j64146j7891k2819
$$ 14677 18443 -26893 21798 54165 46215 128194 174210 245593 278928 114782 96891 74072
6829G4072p6481O1559L824J7884O8051o369n7370Q636O2093L6663j9583r3349
$$ 74072 -2409 59150 62974 80858 148909 142540 85170 93806 155899 192562 172979 79630
6817G9630m7073k6737K649Q8137N1890J00994O0341n7382q8060r9164j366P5515
$$ 79630 32557 5820 8469 96606 148496 249490 309831 252449 164389 65225 63859 139374
6805A39374j4035j31595j4603M2211o0014j939k2046K27326O7430j86362p6114
$$ 139374 125339 -6256 -20859 21352 -38662 -40601 -62647 164679 232109 45747 -30367
6794c0367m2698k998J7580P4800M6920n6038P9407M0849j29990P3250M9477j01716
$$ -30367 -73065 -76063 -58483 16317 63237 7199 86606 127455 -2535 70715 120192 18476
6782A8476m880M0643L8180R5141k8105o9608m0763m1976r5154k0828P7000k6550
$$ 18476 13596 54239 92419 187560 159455 89847 49084 7108 -88046 -108874 -31874 -58424
6770e8424O4199Q9095m6329j16648J6955M8660L6814l8050r8698L6505L3025J5374
$$ -58424 5775 94870 48541 -68107 -51152 -2492 34322 -3728 -102426 -65921 -32896 -17522
6758a7522L7253q3425q9364j0474N83L9172l763J07282K7679l2226K29873J18811
$$ -17522 19731 -63694 -153058 -163532 -162949 -123777 -127540 -20258 7421 -24805 205068 323879
6746C23879l2407k15280j48555J17421N8413k8147l075M1603j5517r4272q0541
$$ 323879 291472 76192 -72363 45058 103471 75324 72249 113852 98335 4063 -76478
6735g6478Q7299O8978q3458o1359k3355l92R5933M5574J24191j8614j0010k8311
$$ -76478 10821 79799 -3659 -65018 -88373 -88765 7168 52742 176933 158319 148309 119998
6723A19998j13641P9522R6148j2123j14121k6075l8668p1311L8479O29m3009k6085
$$ 119998 6357 85879 182027 169904 55783 29708 -8960 -80271 -41792 -41163 -84172 -110257
6711a10257p8912J18737J64707p743O322j1743J0608L4694j18235j17527J05984
$$ -110257 -189169 -70432 94275 86532 92854 81111 91719 126413 8178 -109349 -3365
6700c365N8554m5520r4329K026Q6373l8559q2231j8665J0610M1023N0109Q3972
$$ -3365 55189 9669 -84660 -82634 3739 -34820 -117051 -135716 -125106 -84083 -33974 49998
6688D9998J19989j02616j12007p7154j26555P2507K03998Q892K0756J8248r4285
$$ 49998 169987 67371 -44636 -121790 -248345 -175838 28160 37052 57808 76056 -18229
6677a8229k6370L2419k4457K1667L2036J612O3323N20m4972o0522n6923J22395
$$ -18229 -44599 -12180 -36637 -14970 17066 18678 82001 82521 37549 -22973 -79896 42499
6665D2499L6731m2131j01829m0972M0815Q5732O2078m0233j797k6281l6762k8586
$$ 42499 79230 37099 -64730 -105702 -64887 20845 82923 42690 40893 14612 -22150 -50736
6653e0736Q5214R2480l4260j4158K2810l3714q7099j00862o393K5943P5710L8007
$$ -50736 34478 126958 92698 78540 101350 67636 -19463 -120325 -126718 -100775 -25065 12942
6641A2942l5063o7892J17030K9225n2307m8843p3707r9385l9667J07903L7290
$$ 12942 -22121 -90013 27017 56242 3935 -44908 -118615 -218000 -257667 -149764 -112474
6630a12474N556J02108L4571M1843k8658l8011j4586p6208M1217R5567O7990L109
$$ -112474 -106918 -4810 29761 71604 42946 4935 -9651 -85859 -44642 50925 118915 122024
6618A22024J02305M2546j17091k938p0456n2543j38280l6041J68921J16274P2416
$$ 122024 224329 266875 149784 146846 76390 23847 -114433 -150474 18447 134721 207137
6607B07137l4381o3207l0729j4435N4281j8556K9449n6290j16711m1820R7933
$$ 207137 172756 109549 78820 64385 118666 100110 129559 73269 -43442 -85262 12671
6596A2671P4306N910r8314J6230M972j6348l584n4500o6368K7456Q1870J67752
$$ 12671 86977 92887 -5427 10803 15775 -573 -4157 -58657 -125025 -97569 -15699 152053
6584A52053l3615j44851j43212j690N4861O2494m7680k8374j4872K0118Q8947
$$ 152053 118438 -26413 -169625 -171315 -116454 -53960 -101640 -130014 -144886 -124768 -35821
6573c5821Q684J0075n4892k1120M1138p5978L326P5387Q505J0541O4645Q3200
$$ -35821 -27137 -17062 -71954 -93074 -51936 -127914 -124588 -49201 -40696 -30155 34490 117690
6561A17690O387P087J7007n0159j39471j8818R9758R435j6029J00337q2523j05754
$$ 117690 124077 131164 148171 98012 -41459 -60277 39481 48916 32887 133224 50701 -55053
6549e5053n9511P5451J2766m1948N4704j8761p6224o8554P8994j6094k6608J73222
$$ -55053 -114564 -39113 -26347 -68295 -13591 -32352 -108576 -177130 -98136 -114230 -140838 32384
6537C2384J00245q6914o3646Q2128j1418l9288P1385j10489j1307j4217j2753
$$ 32384 132629 45715 -17931 64197 52779 13491 84876 -25613 -36920 -51137 -63890
6526f3890N290p1087J0977M6133j8875o8237O5896M8659O6793K51082K5211r2352
$$ -63890 -58600 -129687 -118710 -72577 -91452 -159689 -93793 -45134 21659 272741 297952 205600
6514B05600l8880m8259k1061r839J22314j5625K6384k3113j3295p8976j10424
$$ 205600 166720 118461 97400 87561 209875 194250 220634 197521 184226 105250 -5174
6503e174j45065q5360Q8954P1653L2548K5112j6354K6956p748P053j4274L8787
$$ -5174 -150239 -235599 -146645 -74992 -42444 -17332 -33686 -6730 -14478 -7425 -21699 17088
6491A7088j4644j03617o2094m9820J35396O1799j4602q2914j6086N18N5973N3785
$$ 17088 2444 -101173 -163267 -213087 -77691 -15892 -30494 -113408 -129494 -128976 -73003 -19218
6479a9218J11539J30074j68602j92952j27651P3223J11676K4428N7980k3852j03369
$$ -19218 92321 222395 53793 -139159 -266810 -193587 -81911 -57483 497 -23355 -126724
6468a26724J8917P5780M6547J26177q0318j9819m4209k4919J17249Q4372L218
$$ -126724 -107807 -32027 14520 140697 60379 40560 -3649 -28568 88681 173053 176271
6457A76271m8477m3451q0997k4309Q0302L3670p8527O8802K6220p6932j46325
$$ 176271 127794 84343 3346 -20963 59339 93009 14482 83284 109504 32572 -113753
6446a13753n1249K4746P7362J2627k5503L5278P8921P823m8979l6478k9429O4671
$$ -113753 -165002 -140256 -62894 -50267 -75770 -40492 38429 46252 -2727 -39205 -68634 -3963
6434c963O655q5621j31144p2556J79748R3599L6335P2933R849o6028j0770R572
$$ -3963 2692 -82929 -214073 -286629 -106881 -13282 23053 95986 105835 39807 29037 38609
6422C8609K3452l7816n9577l4112J2299p981q812J01584j02941p8138R390Q6129
$$ 38609 62061 24245 -35332 -69444 -57145 -65126 -73938 27646 -75295 -153433 -144043 -57914
6410e7914O9020J19521N624j4083m0587j15304K1354N3429j9598j3181m2615N3910
$$ -57914 11106 130627 136251 122168 81581 -33723 -12369 41060 21462 8281 -34334 19576
6398A9576J19243K752q3340n6046j0574K6204k6786p9642J7476k1339M150j0333
$$ 19576 138819 141571 58231 2185 -8389 17815 -8971 -88613 -71137 -92476 -88326 -98659
6386i8659J07558O4486K1640q4165q3206M7186K5696k2317r6475j70031m4413
$$ -98659 8899 73385 95025 10860 -72346 -25160 536 -21781 -118256 -288287 -332700
6375c32700R6136J62184J9771j9068O2272Q1483j50822k9581J62692l6989j09967
$$ -332700 -236564 -74380 -54609 -73677 -11405 70078 -80744 -110325 52367 15378 -94589
6364i4589q7545K9965J61151O8624J17177j4358r7367p7507n6165l4120M4011
$$ -94589 -182134 -152169 8982 77606 194783 180425 83058 5551 -50614 -84734 -40723
6353d0723Q0497M972O9991m3889j29803j25866q1315L1351n4191r7497N8735K1772
$$ -40723 39774 44746 114737 70848 -58955 -184821 -266136 -234785 -288976 -386473 -327738 -305966
6341c05966J08678M6922j22473N9837J68472Q4477N5695J7019p9558K547p337
$$ -305966 -197288 -150366 -272839 -213002 -44530 39947 95642 112661 33103 35650 28313
6330B8313o0654j429j9537q4438M2826J44285M7670j18448q6871k0856k9758P3132
$$ 28313 -32341 -33770 -53307 -137745 -94919 49366 97036 -21412 -108283 -129139 -158897 -85765
6318h5765N9702N6280k5883M2968N8823p7051m6002k1906k7678k4421L2805l1053
$$ -85765 -26063 30217 4334 47302 106125 29074 -16928 -38834 -66512 -90933 -58128 -89181
6306h9181J1662n5511j42239n7483o0863J05471J86907J26537R308j870p1832
$$ -89181 -77519 -133030 -275269 -332752 -393615 -288144 -101237 25300 34608 32738 -39094
6295c9094m2398k8121o0060P9839J5648o8724k9671l79Q4233O5629l1880m7883
$$ -39094 -81492 -109613 -169673 -89834 -74186 -142910 -172581 -172960 -88727 -23098 -54978 -102861
6283a02861O0423p4848K7586j1426L183q169K6949P471J7792k3211P9131J06627
$$ -102861 -42438 -117286 -89700 -101126 -97943 -106112 -79163 -71692 -53900 -77111 2020 108647
6271A08647N460r576l2548j5581j7820k6884M0533M0159P7791P2673j38092n0552
$$ 108647 114107 104531 71983 56402 38582 11698 52231 92390 170181 242854 104762 54210
6259E4210N5415k4484q9274K5748p4572o0389r0721o2413O0187P6318l9934M4013
$$ 54210 109625 85141 -4133 21615 -52957 -113346 -204067 -266480 -206293 -129975 -169909 -125896
6247a25896L9383k509o4692O1267K7977l7797o8111J04974L1530j22702R769k5502
$$ -125896 -86513 -89022 -153714 -92447 -64470 -102267 -170378 -65404 -33874 -156576 -146807 -172309
6235a72309Q8391J48535J0549J552O7817p1601p3346o3752N0894j63168n2981
$$ -172309 -83918 64617 75166 76718 144535 72934 -412 -64164 -13270 -176438 -229419
6224b29419Q9731J86548O4695l7231j01325n9560J7776j8769o8986P8684K17820
$$ -229419 -139688 46860 111555 74324 -27001 -86561 -68785 -87554 -156540 -77856 139964
6213A39964Q1234r9478r3205Q326r4457o3622N8218K7179N8956J10676j4678o9260
$$ 139964 221198 121720 28515 36841 -57616 -121238 -63020 -35841 23115 133791 119113 49853
6201D9853J9776K2093K4505q5959j90870p0551J00208M9440K7599N1024J04585
$$ 49853 69629 91722 116227 30268 -160602 -231153 -130945 -81505 -53906 -2882 101703
6190A01703n2699N619l082j14671p4977l497N7472R3399L8997R318J4668o6742
$$ 101703 49004 54623 51541 -63130 -138107 -141604 -84132 9267 48264 57582 72250 5508
6178E508P928m42j565j1100m5723p0324l3495P803m5813M5795J31006k5770M63
$$ 5508 13436 12994 11429 329 -45394 -115718 -149213 -141410 -187223 -141428 -10422 -36192 -35729
6165c5729N4088j5512k6701Q4452J8137l8977L520j08668j09437M1352N5229j0268
$$ -35729 18359 2847 -23854 60598 78735 39758 43278 -65390 -174827 -133475 -78246 -88514
6153h8514J4663L8221n6497p0819L6699q0460o8425M3039M3939L6545j8364P9129
$$ -88514 -73851 -35630 -92127 -162946 -126247 -206707 -275132 -232093 -188154 -151609 -169973 -90844
6141i0844K5458K4114m4322p0240J70Q0037R3279o5728p5686K3142N4660J1377
$$ -90844 -65386 -41272 -85594 -155834 -155664 -75627 17652 -48076 -123762 -100620 -45960 -34583
6129c4583O0291m9794r0960J1824N8529L5695K6934o9817n2026r6342O9947O5762
$$ -34583 25708 -24086 -115046 -103222 -44693 -8998 17936 -51881 -103907 -200249 -130302 -64540
6117f4540K5688n1498O574P9333M3086P3422j8473r0714j28551l1019Q2167m4155
$$ -64540 -38852 -90350 -83776 -4443 38643 112065 93592 2878 -125673 -156692 -74525 -118680
6105a18680j14233o1582J5046n753J0259J27614J04744J00885O6931r0619p6387
$$ -118680 -232913 -294495 -279449 -285202 -274943 -147329 -42585 58300 125231 34612 -41775
6094d1775m1363k9751j59519N0313J30085J35637q4613l5992K6461j3961j01989
$$ -41775 -83138 -112889 -272408 -222095 -92010 43627 -40986 -76978 -50517 -64478 -166467
6083a66467J2851M0712n0843Q1810j7470M6341J5107l4796j09079r429J32605
$$ -166467 -153616 -112904 -163747 -81937 -99407 -53066 -37959 -72755 -181834 -191263 -58658
6072e8658J6769j26295J9568j7711m8213j9192N910N5399p2536N7575o1375J8471
$$ -58658 -41889 -168184 -148616 -166327 -214540 -233732 -227822 -172423 -244959 -187384 -248759 -230288
6060b30288J686O7985l379K8124P873J13704J1021n7564r3759L6091K6725m3168
$$ -230288 -228602 -160617 -163996 -135872 -127999 -14295 -3274 -60838 -154597 -118506 -91781 -134949
6048a34949k9041J8527Q5308O7807k4023k7119p2040J0446K9542K9248K5249j0109
$$ -134949 -163990 -145463 -60155 7652 -16371 -43490 -115530 -105084 -75542 -46294 -21045 -31154
6036c1154m3965J0048R5684k4927m5018K9753L7568k8142r4648j4778L890o3103
$$ -31154 -75119 -65071 30613 5686 -39332 -9579 27989 -153 -94801 -109579 -105689 -168792
6024a68792l9864M0884j3091J1553L0959J39840J23266l7136j42299M282q861
$$ -168792 -208656 -167772 -180863 -169310 -138351 1489 124755 87619 -54680 -50398 -59259
6013e9259J7592n8962p1226j3223l3827J15121J7283M2776m193j29191P8840P7158
$$ -59259 -41667 -100629 -171855 -185078 -218905 -103784 -86501 -43725 -47918 -177109 -98269 -21111
6001b1111J0752o6007j08418M1293o4801r0649j9221J95229K85213R2175m4765
$$ -21111 -10359 -76366 -184784 -143491 -208292 -298941 -318162 -122933 162280 254455 209690
5990B09690j7033L0481o1447j89324j62468L0404J43592L8854R373l9466j5002
$$ 209690 192657 223138 161691 -27633 -190101 -159697 -16105 22749 32122 -7344 -22346
5979b2346R79m5605K522J3845M3378l2189o8992j2539Q6714K8780K0543J5152
$$ -22346 -21367 -66972 -64450 -50605 -7227 -39416 -108408 -120947 -34233 -5453 15090 30242
5967C0242n4156j00826O4896J61831l5106j06861O2338q4358m8101K709P5367
$$ 30242 -23914 -124740 -59844 101987 66881 -39980 22358 -62000 -110101 -107392 -32025
5956c2025J3563o1167j03400o5573j42200J4484J1860J12817J31850P6508K0179
$$ -32025 -18462 -79629 -183029 -248602 -390802 -376318 -364458 -251641 -119791 -43283 -23104
5945b3104R5443J6125M1324J3434n1582k7432p2575o8115l1427m840l0017M7240
$$ -23104 72339 88464 129788 143222 91640 64208 -8367 -76482 -107909 -112749 -142766 -95526
5933i5526j61J52365R5697r8038j05704n7231R6869M9518r0106J038O4398q302
$$ -95526 -95687 56678 152375 54337 -51367 -108598 -11729 37789 -52317 -51279 13119 4817
5921D817l1056k6153L822Q567q370N3710K9463j83842L518J81275J32379p4448
$$ 4817 -26239 -52392 -48570 -40003 -48373 5337 34800 -149042 -145524 35751 168130 93682
5909I3682q3895o9068n7289N7152j2172P5183N6710j5181j1860J06103j11765
$$ 93682 9787 -59281 -116570 -59418 -71590 3593 60303 45122 33262 139365 27600
5898B7600p7800o4511K1258P5810n5629k8451q0899P9607J04726O2909m7994o9818
$$ 27600 -50200 -114711 -93453 -17643 -73272 -101723 -182622 -103015 1711 64620 16626 -53192
5886e3192p1465K8411J55811O9467k1981m1775j1168j51888j05355J06826N7099
$$ -53192 -124657 -96246 59565 129032 107051 65276 54108 -97780 -203135 -96309 -39210
5875c9210L6415O5033N4682N2320j15874r6530L2381J97501l8164j27844j4562
$$ -39210 -2795 62238 116920 169240 53366 -43164 -10783 186718 148554 20710 6148
5864F148K2497k5248o1011Q2684J95238J3720j29674r0992p5921n7658m8410O1226
$$ 6148 28645 3397 -57614 25070 220308 234028 104354 13362 -62559 -120217 -168627 -107401
5852a07401j40689R1270N6086l0595J27309j2978l239k7863j50725J58851Q2392
$$ -107401 -248090 -156820 -100734 -131329 -4020 -16998 -20237 -48100 -198825 -39974 42418
5841D2418j56666j06516L5239n2860Q3539J77833m3268l5802K5288m8641O0217
$$ 42418 -114248 -220764 -185525 -238385 -154846 22987 -20281 -56083 -30795 -79436 -19219
5830a9219O209j14391J5845K4795N1121O1759N9937k9775p7203j1633j08669k7214
$$ -19219 -13010 -127401 -111556 -86761 -35640 26119 86056 56281 -20922 -32555 -141224 -168438
5818a68438J13849k4546M2253Q9011m7834n5659k544n0985j22621N731O0677k8604
$$ -168438 -54589 -79135 -36882 52129 4295 -51364 -53908 -104893 -227514 -221783 -161106 -189710
5806a89710K4620J61437L6680m2959q3417N3749K8955m2986p0199R2772M9755
$$ -189710 -165090 -3653 33027 -9932 -93349 -39600 -10645 -53631 -123830 -31058 18697
5795A8697r462R615o3207j01448P0153Q2393K2987n3057m398o8351j2754M4746
$$ 18697 9235 18850 -44357 -145805 -75652 6741 29728 -23329 -27727 -96078 -108832 -64086
5783f4086J749l7840R0704R0407r999j12690N7659L1694J29239o402r7036j51636
$$ -64086 -62337 -100177 -9473 80934 70935 -41755 15904 47598 176837 170435 73399 -78237
5771g8237K1098P020k0522R5945J32340L1263L7548j99333o6086j02716j72288
$$ -78237 -57139 -50119 -70641 25304 157644 188907 226455 27122 -38964 -141680 -313968
5760c13968Q997L3067Q5719K6171P872j17394J9264J70528K02899K9731l9717
$$ -313968 -304971 -271904 -186185 -160014 -152142 -269536 -250272 -79744 123155 152886 113169
5749A13169Q9072k6917j15451o3178j0187m4493N9970m8618J0706Q3283n1647
$$ 113169 202241 175324 59873 -3305 -13492 -57985 1985 -46633 -35927 47356 -4291
5738d291k1037M3279O8255j303J8994q8298j04807K9493M1266m6163p1752O58
$$ -4291 -25328 17951 86206 84903 103897 15599 -89208 -59715 -18449 -64612 -136364 -135706
5726a35706Q529O1407j3460p1789m8049N1472J666L7156q7920Q7216j1448q7221
$$ -135706 -127177 -65770 -79230 -151019 -199068 -147596 -145930 -108774 -196694 -109478 -120926 -208147
5714b08147N090K1167q0387J21861L4227q4367N5705Q8643q818K988J1104k0122
$$ -208147 -203057 -181890 -262277 -140416 -106189 -190556 -134851 -46208 -55026 -52038 -40934 -61056
5702f1056n5989r6829J11764L8701l2910P4548N363m6297n9464m5477j03224J1821
$$ -61056 -117045 -213874 -102110 -63409 -96319 -21771 -16408 -62705 -122169 -167646 -270870 -259049
5690b59049N4099k2164p3011K8632R3652J21940n1313j6083J02357J5520N8424
$$ -259049 -204950 -227114 -300125 -271493 -177841 -55901 -107214 -123297 -20940 -5420 53004
5679E3004k2601p5194L009k9153n8451J9719l7697J12M7466l6735K8942M1179
$$ 53004 30403 -44791 -41782 -70935 -129386 -109667 -147364 -147252 -99786 -136521 -107579 -66400
5667f6400O5458n2106J00344Q1562n9496j01005J330m4197j1378J31564Q0360
$$ -66400 -942 -53048 47296 128858 69362 -31643 -30313 -74510 -85888 45676 126036
5656A26036p1515j31505q2895o4055L5639M3841o3572M5782q3728j21101N0047
$$ 126036 54521 -76984 -159879 -223934 -188295 -144454 -208026 -162244 -245972 -367073 -317026
5645c17026N8423J9824K5944P8086J01452J2548l128N049j59744L6425J35161
$$ -317026 -258603 -238779 -212835 -134749 -33297 -20749 -23877 -18828 -178572 -142147 -6986
5634f986q843p9599K4000K377L3536k5138o3018m3671j9030p17J0270o5092L1967
$$ -6986 -15829 -95428 -71428 -69051 -35515 -60653 -123671 -167342 -186372 -187089 -176819 -241911 -209944
5621b09944J01717M1033J2397j7666J16401M3815m4361J970K7417r0112j43526
$$ -209944 -108227 -67194 -54797 -72463 43938 87753 43392 45362 72779 -17333 -160859
5610a60859j5877k6893P2602J52567q214k1584K0723n4147j7124p6836M9620P0631
$$ -160859 -176736 -203629 -131027 21540 13326 -8258 12465 -41682 -58806 -135642 -86022 -15391
5598a5391l3505k8432N5409k3623P3727M5039J815J43656J786p8929o570o2612
$$ -15391 -48896 -77328 -21919 -45542 28185 73224 75039 218695 220481 141552 134982 72370
5586G2370j0974r2639n6675M8906J5763O1667o063K8031J7796q7177k8261q8845
$$ 72370 61396 -31243 -87918 -39012 -23249 38418 32355 60386 78182 -8995 -37256 -126101
5574a26101m8861R2543L7677L6421k0301l8229j110M3928Q5792j15767J9685n198
$$ -126101 -174962 -82419 -44742 -8321 -28622 -66851 -67961 -24033 61759 -54008 -34323 -39521
5562c9521j04501L3229O1274M0747l859q6933j52662K8754J43320M9785N2619
$$ -39521 -144022 -110793 -49519 -8772 -12631 -99564 -252226 -223472 -80152 -30367 22252
5551B2252J92883j4187K5719J4478o5392J6448j46786k1224o0350l2283K089M1165
$$ 22252 215135 200948 226667 241145 175753 192201 45415 24191 -36159 -68442 -66353 -25188
5539b5188M6358R286p5768o7144K9315K9794J68Q8020m4050q2803n9970n3505
$$ -25188 21170 30456 -45312 -112456 -83141 -53347 -53179 34841 -9209 -92012 -151982 -205487
5527b05487J8675P6207o734L9112K310n7327l7202J30019r435p368o3881R4186
$$ -205487 -186812 -110605 -117339 -78227 -75917 -133244 -170446 -40427 -49862 -57230 -121111 -26925
5515b6925k2078K0395l3967R6212j8279q2613J1130L3150j04J1340j07375j05570
$$ -26925 -49003 -28608 -62575 33637 15358 -67255 -56125 -22975 -23079 -11739 -119114 -224684
5503b24684O7756L4740o9194k1855O2402k102l2093R0063R1530m5650q6554l6230
$$ -224684 -156928 -122188 -191382 -213237 -150835 -152937 -185030 -94967 -3437 -49087 -135641 -171871
5491a71871O3985L8299P1809L2555k8992k990m1171j00661J32957N5962r318m0245
$$ -171871 -107886 -69587 2222 34777 5785 2795 -38376 -139037 -6080 49882 40564 319
5479C19p1124m7918l309L5731l6796q1225l4029J15946N7378O8699K9974K3283
$$ 319 -70805 -118723 -122032 -86301 -123097 -204322 -238351 -122405 -65027 3672 33646 56929
5467E6929k8259j23247j05276L5590J14505J35686o7082m6695L3741K2935k7752
$$ 56929 28670 -94577 -199853 -164263 -49758 85928 18846 -27849 5892 28827 1075
5456A075q8057N4074J40742N5976j50461o7279J13861K8232m5606J0182k7039
$$ 1075 -86982 -32908 107834 163810 13349 -53930 59931 88163 42557 52739 25700
5445B5700n3263J1405j19539j7223o9016j26977J01101Q0940j78520n2261J77781
$$ 25700 -27563 -16158 -135697 -152920 -221936 -348913 -247812 -166872 -345392 -397653 -219872
5434b19872P0274j51949j23455J46249K9883p3672o0577P6062N1873N2786p5183
$$ -219872 -149598 -301547 -425002 -278753 -248870 -322542 -383119 -307057 -255184 -202398 -277581
5423b77581m39R1495R881L0556l0234O1882j9971O9709Q8243o0638n8693J4863
$$ -277581 -278020 -186525 -176644 -146088 -176322 -114440 -134411 -64702 23541 -37097 -95790 -80927
5411h0927P0193J44950j9304o8840l5905M1298J23955N9980q502l2200r9498r9820
$$ -80927 -10734 134216 114912 46072 10167 51465 175420 235400 226898 194698 95200 -4620
5399d620J7864n8473L9683P765j9656N7868J5130m2342k0808L7276n3544m4636
$$ -4620 13244 -45229 -5546 2219 -17437 40431 55561 13219 -7589 29687 -23857 -68493
5387f8493m1144J05807P8672m9048n788Q7664J15807j07693j38699O9022j24573
$$ -68493 -109637 -3830 74842 25794 20006 107670 223477 115784 -22915 46107 -78466
5376g8466j01179Q0135j5000m3292j12985L9547o566L9792O3995j9130L1519l1484
$$ -78466 -179645 -99510 -114510 -157802 -270787 -231240 -237806 -198014 -134019 -153149 -121630 -153114
5364a53114q2452M8223N1903O7180J7045q7223o7726R2611K3513N7669k4746O8889
$$ -153114 -235566 -187343 -135440 -68260 -51215 -138438 -206164 -113553 -90040 -32371 -57117 11772
5352A1772j1440r8965M082Q9436J569L8615O1890N0889j7802j00599J5817o286
$$ 11772 332 -98633 -94551 -5115 -3546 35069 96959 147848 130046 29447 45264 38978
5340C8978P0819k8302l4182m6073P1323o0281q0150L5894j7634j09776j8576J3143
$$ 38978 109797 81495 47313 1240 72563 12282 -67868 -31974 -49608 -159384 -177960 -164817
5328a64817J39501R0029q0592j70873j15757R5077J06250J7543M8217L6559Q4192
$$ -164817 -25316 64713 -15879 -186752 -302509 -207432 -101182 -83639 -35422 1137 85329
5317H5329j6324n1199l8351O1724m2282k9703P4076P4207r4659l4330K5438K2373
$$ 85329 69005 17806 -20545 41179 -1103 -30806 43270 117477 22818 -11512 13926 36299
5305C6299n0874l9292J8916M6857p7696o5409q031j4205l1722J17496L3367L7378
$$ 36299 -14575 -53867 -34951 11906 -65790 -131199 -139230 -153435 -185157 -67661 -34294 3084
5293C084J3013J4831j18360K9273k8785K6266q296J27261j5606j34550n6735j0076
$$ 3084 16097 30928 -87432 -58159 -86944 -60678 -68974 58287 42681 -91869 -148604 -158680
5281a58680K7777O6388M3132r5958k9580q6933k7650j0004O5225R2595L3577j4723
$$ -158680 -130903 -64515 -21383 -117341 -146921 -233854 -261504 -271508 -206283 -113688 -80111 -94834
5269i4834m8104n5429Q6173L3527n1393n0727k1438J100N6579M3036J5974p5112
$$ -94834 -142938 -198367 -112194 -78667 -130060 -180787 -202225 -201125 -144546 -101510 -85536 -160648
5257a60648J5994K3066k0711j1626q9780r9056N1741J15521N9251L6151N0399
$$ -160648 -144654 -121588 -142299 -153925 -243705 -342761 -291020 -175499 -116248 -80097 -29698
5246b9698L6225m2604j23652Q920J37787P3475r0436l2079N4580o7025K6240J04662
$$ -29698 6527 -36077 -159729 -150809 -13022 60453 -29983 -62062 -7482 -74507 -48267 56395
5234E6395O9923L1827J06232L7643r571m3475o3514p7813k7549p5602j5477J0771
$$ 56395 126318 158145 264377 302020 292449 248974 185460 107647 80098 4496 -10981 -210
$$ [...]
##END NTUPLES=NMR SPECTRUM
##END=
