##TITLE=Analysis number 324838
Compound Code cc 56304
Book Reference 513/5/21
Project Code adrs
Chemist Name ronp
##JCAMPDX= 6.0         $$ Bruker NMR JCAMP-DX V2.0
##DATA TYPE= NMR SPECTRUM
##DATA CLASS= NTUPLES
##ORIGIN= Bruker BioSpin GmbH
##OWNER= nmr
$$ XWIN-NMR		Version 3.5
$$ Mon Dec  4 09:43:51 2006 GMT Standard Time (UT+0h)  MAYBRIDGE\nmr@NMR_250MHZ
##.OBSERVE FREQUENCY= 250.131544655141
##.OBSERVE NUCLEUS= ^1H
##.ACQUISITION MODE= SIMULTANEOUS (DQD)
##.ACQUISITION SCHEME= undefined
##.AVERAGES= 16
##.DIGITISER RES= 18
##SPECTROMETER/DATA SYSTEM= dpx250
##.PULSE SEQUENCE= zg30
##.SOLVENT NAME= CDCl3
##.SHIFT REFERENCE= (INTERNAL, CDCl3, 0, 16.522)
##AUDIT TRAIL= $$ (NUMBER, WHEN, WHO, WHERE, WHAT)
$$ ##TITLE= Audit trail, XWIN-NMR		Version 3.5
$$ ##JCAMPDX= 5.01
$$ ##ORIGIN= Bruker BioSpin GmbH
$$ ##OWNER= nmr
$$ C:\u/data/dgb/nmr/ADRS/70/pdata/1/auditp.txt
$$ ##AUDIT TRAIL=  $$ (NUMBER, WHEN, WHO, WHERE, WHAT)
(   1,<2006-12-04 09:43:24.75 +000>,<MAYBRIDGE\nmr>,<NMR_250MHZ>,
      <created by zg, POWCHK disabled, PULCHK disabled
       configuration hash MD5:
       49 4B E0 1D 92 C2 6B 37 9F E6 65 BC 52 41 86 1D
       data hash MD5: 64K
       65 40 E6 E1 B7 DE 5B 12 16 5A 61 AF AF 7F 16 B0>)
(   2,<2006-12-04 09:43:40.83 +000>,<MAYBRIDGE\nmr>,<NMR_250MHZ>,
      <Start of raw data processing
       ef LB = 0.3 FT_mod = 6 PKNL = 1 SI = 32K 
       data hash MD5: 32K
       2D 85 16 D3 A4 AE B1 DE AA 39 BC B5 66 7F 85 EF>)
(   3,<2006-12-04 09:43:42.52 +000>,<MAYBRIDGE\nmr>,<NMR_250MHZ>,
      <apk 
       data hash MD5: 32K
       1D 3F 2B 45 78 AC 1B F7 5A 73 FD E1 B4 58 04 56>)
(   4,<2006-12-04 09:43:43.30 +000>,<MAYBRIDGE\nmr>,<NMR_250MHZ>,
      <abs ABSG = 5 
       data hash MD5: 32K
       A2 AF A7 F8 AD 83 40 8F 49 B2 94 8D 1D 16 05 1A>)
$$ ##END=
$$ 
$$ hash MD5
$$ 5C EF 81 90 EE AC CF C8 68 4E 51 65 1D AB 10 D4
##$RELAX= 
##$RELAX= 
##$RELAX= 
##$RELAX= 
##$RELAX= 
##$RELAX= 
##$RELAX= 
$$ Bruker specific parameters
$$ --------------------------
##$DU= <C:\u>
##$EXPNO= 70
##$NAME= <ADRS>
##$PROCNO= 1
##$TYPE= <nmr>
##$USER= <dgb>
##$AMP= (0..31)
100 100 100 100 100 100 100 100 100 100 100 100 100 100 100 100 100 100 
100 100 100 100 100 100 100 100 100 100 100 100 100 100 
##$AQSEQ= 0
##$AQ_mod= 3
##$AUNM= <au_zg>
##$AUTOPOS= <2 >
##$BF1= 250.13
##$BF2= 250.13
##$BF3= 250.13
##$BF4= 250.13
##$BF5= 500.13
##$BF6= 500.13
##$BF7= 500.13
##$BF8= 500.13
##$BYTORDA= 1
##$CFDGTYP= 0
##$CFRGTYP= 5
##$CHEMSTR= <none>
##$CNST= (0..31)
1 1 145 1 1 1 1 1 1 1 1 1 1 1 1 1 1 1 1 1 1 1 1 1 1 1 1 1 1 1 1 1 
##$CPDPRG= <>
##$CPDPRG1= <>
##$CPDPRG2= <>
##$CPDPRG3= <>
##$CPDPRG4= <mlev>
##$CPDPRG5= <mlev>
##$CPDPRG6= <mlev>
##$CPDPRG7= <mlev>
##$CPDPRG8= <mlev>
##$CPDPRGB= <>
##$CPDPRGT= <>
##$D= (0..31)
0 1 0 0 0 0 0 0 0 0.06 0 0 0 0 0 0 0.0002 0 0 0 0 0 0 0 0 0 0 0 0 0 0 
0 
##$DATE= 1165225402
##$DBL= (0..7)
120 120 120 120 120 120 120 120 
##$DBP= (0..7)
150 150 150 150 150 150 150 150 
##$DBP07= 0
##$DBPNAM0= <>
##$DBPNAM1= <>
$$ [...]
##$SUBNAM7= <"">
##$SUBNAM8= <"">
##$SUBNAM9= <"">
##$SW= 20.6930455092707
##$SWIBOX= (0..15)
0 0 3 0 0 0 0 0 0 0 0 0 0 0 0 0 
##$SW_h= 5175.983436853
##$TD= 65536
##$TD0= 1
##$TE= 294.16
##$TE2= 300
##$TE3= 300
##$TEG= 300
##$TL= (0..7)
0 120 120 120 120 120 120 120 
##$TP= (0..7)
150 150 150 150 150 150 150 150 
##$TP07= 0
##$TPNAME0= <>
##$TPNAME1= <>
##$TPNAME2= <>
##$TPNAME3= <>
##$TPNAME4= <>
##$TPNAME5= <>
##$TPNAME6= <>
##$TPNAME7= <>
##$TPOAL= (0..7)
0.5 0.5 0.5 0.5 0.5 0.5 0.5 0.5 
##$TPOFFS= (0..7)
0 0 0 0 0 0 0 0 
##$TUNHIN= 0
##$TUNHOUT= 0
##$TUNXOUT= 0
##$USERA1= <user>
##$USERA2= <user>
##$USERA3= <user>
##$USERA4= <user>
##$USERA5= <user>
##$V9= 5
##$VALIST= <valist>
##$VCLIST= <CCCCCCCCCCCCCCC>
##$VD= 0
##$VDLIST= <DDDDDDDDDDDDDDD>
##$VPLIST= <PPPPPPPPPPPPPPP>
##$VTLIST= <TTTTTTTTTTTTTTT>
##$WBST= 1024
##$WBSW= 4
##$XGAIN= (0..3)
0 0 0 0 
##$XL= 0
##$YL= 0
##$YMAX_a= 293552
##$YMIN_a= -374366
##$ZGOPTNS= <>
##$ZL1= 120
##$ZL2= 120
##$ZL3= 120
##$ZL4= 120
##$ABSF1= 16.522
##$ABSF2= -4.171173
##$ABSG= 5
##$ABSL= 3
##$ALPHA= 0
##$AQORDER= 0
##$ASSFAC= 0
##$ASSFACI= 0
##$ASSFACX= 0
##$ASSWID= 0
##$AUNMP= <proc_1d>
##$AZFE= 0.1
##$AZFW= 0.1
##$BCFW= 0
##$BC_mod= 0
##$BYTORDP= 0
##$COROFFS= 0
##$CY= 12.5
##$DATMOD= 1
##$DC= 0
##$DFILT= <>
##$DTYPP= 0
##$F1P= 14.0000005364418
##$F2P= -0.99999901652339
##$FCOR= 0.5
##$FTSIZE= 32768
##$FT_mod= 6
##$GAMMA= 0
##$GB= 0
##$INTBC= 1
##$INTSCL= 1
##$ISEN= 128
##$LB= 0.3
##$LEV0= 0
##$LPBIN= 0
##$MAXI= 10000
##$MC2= 0
##$MEAN= 0
##$ME_mod= 0
##$MI= 0
##$NCOEF= 0
##$NC_proc= -4
##$NLEV= 6
##$NOISF1= 0
##$NOISF2= 0
##$NSP= 0
##$NTH_PI= 0
##$NZP= 0
##$OFFSET= 16.522
##$PC= 1
##$PHC0= 224.7047
##$PHC1= 20.28707
##$PH_mod= 1
##$PKNL= yes
##$PPARMOD= 0
##$PSCAL= 4
##$PSIGN= 0
##$REVERSE= no
##$SF= 250.13
##$SI= 32768
##$SIGF1= 0
##$SIGF2= 0
##$SINO= 400
##$SIOLD= 32768
##$SREGLST= <1H.CDCl3>
##$SSB= 0
##$STSI= 32768
##$STSR= 0
##$SW_p= 5175.98343685301
##$SYMM= 0
##$S_DEV= 0
##$TDeff= 65536
##$TDoff= 0
##$TI= <Analysis number 999999
Compound Code 99
Book Reference 9
Project Code 9>
##$TILT= no
##$TM1= 0
##$TM2= 0
##$TOPLEV= 0
##$USERP1= <user>
##$USERP2= <user>
##$USERP3= <user>
##$USERP4= <user>
##$USERP5= <user>
##$WDW= 1
##$XDIM= 32768
##$YMAX_p= 289245924
##$YMIN_p= -495800
$$ End of Bruker specific parameters
$$ ---------------------------------
##NTUPLES= NMR SPECTRUM
##VAR_NAME=  FREQUENCY,     SPECTRUM/REAL,   SPECTRUM/IMAG
##SYMBOL=    X,             R,               I
##VAR_TYPE=  INDEPENDENT,   DEPENDENT,       DEPENDENT
##VAR_FORM=  AFFN,          ASDF,            ASDF
##VAR_DIM=   32768,         32768,           32768
##UNITS=     HZ,            ARBITRARY UNITS, ARBITRARY UNITS
##FACTOR=    0.157963299565203, 1,           1
##FIRST=     4132.6476996994, 0,             0
##LAST=      -1043.33573715361, 0,           0
##MIN=       -1043.33573715361, -495800,     0
##MAX=       4132.6476996994, 289245924,     0
$$ Real data points
##PAGE= N=1
##DATA TABLE= (X++(R..R)), XYDATA
$$ [...]
28334C2114N7271N053n1182m1251K7977k3975m5548J0687R140l7105R5739M6044
28322H4964j40557l2278K4787J2815M8473K7409N7963k1250m6748L2971j8260
28311C0289p977K7068L876o32o3683j8211l9563k5624L185K2876k6762P3905K8124
28298F871r380M8758k4908o4091m926N1920j2776L2415L4312k8178J1358k4294
28286A7081K2102J0643J243r3856n7431k9732N9832R7518l082j2321O2555q525
28274F6027k5844k9407M6600k7999o3540j7302J7580J0380N9052M5889k2383q0325
28262b1272l9261P471l0234k8538R1454K6606k5981m2905M3871j2633l9834Q476
28250f2780O8434J09994K6866o6954m5570k6409M1987l1190K1194l028M5420J7486
$$ y = [32114, 89385, 94438, 43256, 2005, 29982, 6007, -39541, -28854, -19714, -56819, 38920, 84964, -55593, -87871, -63084, -50269, -1796, 25613, 83576, 62326, 15578, 48549, 30289, 22312, 49380, 53256, 52624, -11059, -29270, -68833, -94457, -91272, -68396, -95158, -21253, 6871, -2509, 46249, 21341, -42750, -47676, 4244, -8532, 23883, 58195, 30017, 41375, 17081, 39183, 49826, 51069, -42787, -100218, -129950, -70118, 27400, 24318, 11997, 74552, 66027, 40183, 10776, 57376, 29377, -34163, -51465, -33885, -23505, 35547, 81436, 59053, -21272, -60533, -53062, -83296, -111834, -20380, 6226, -19755, -62660, -18789, -31422, -71256, -62780, 5654, 115648, 142514, 75560, 29990, 3581, 45568, 14378, 35572, 32544, 77964, 95450]
28238I5450q3031r3612J4343Q507M977J4541J3299o4263J4036Q1119m1524k2603
28226e8761O313K6973N0347q5020N1592O4712M2857J6046J5001m5001o4606j6544
28214C909m3611m13r150j1503R7605M3560k3561k8990m4182K8054p877o1853m0070
28201i8082l3463Q3110L4646m7561K4150R4002K9231j49682r1176N1340Q728Q775
28189h5982P0933J66888j7810q8058q3282N3483J20266q1367q3190l8669L3386
28178c3402P299n3272o773N8952P4691K2015k1352p1377m4225N2056J32651J0549
28166A27812p9933l2903P6262k6306r1755J7749j2871J3431O8434j7651l9853
28155B416K9531K6745j747j1054L390k3794l9030K846O7910l1118q2858k1684
$$ y = [95450, 12419, -81193, -66850, -58343, -53366, -38825, -25526, -89789, -75753, 5366, -36158, -58761, -52448, -25475, 24872, -60148, -8556, 56156, 99013, 115059, 130060, 85059, 20453, 3909, -39702, -40115, -49265, -60768, 36837, 80397, 56836, 27846, -16336, 11718, 3841, -58012, -98082, -131545, -48435, -13789, -61350, -37200, 56802, 86033, -63649, -154825, -103485, -94757, -85982, -15049, 151839, 134029, 45971, -37311, 16172, 136438, 55071, -28119, -66788, -33402, -26103, -79375, -86148, -27196, 47495, 69510, 48158, -23219, -67444, -15388, 117263, 127812, 47879, 14976, 91238, 64932, -26823, -9074, -21945, -8514, 59920, 42269, 2416, 31947, 58692, 56945, 45891, 49281, 25487, -13543, -10697, 57213, 26095, -56763, -78447]
28143g8447R751N4052N0526n7576r963n3656P0656P3247m532o0248o0782L6095
28131c0877m804n2505M4995O9119J2720K3292M321k5620N046l4525O955K5175
28119D3292L0614N1922K5914m9800p6090m0472J0584m9149l272l6274l9868M4800
28107h7799P4653J0332O668M6450m7642k2946L364M7644L7703l3333o5632N5196
28095B4658R674n6099k7109R1771Q3939K3901j4891l9781m6686k0436M540N3156
28083H6637N0356m3368m0471r059n0806k5555L0149o2621l4942l8533N4917O0352
28071b2944j2941n7997n040N3632k5714M715R551L3133L0916j0618k2436L020
28059b2723l2837Q307j4772O5863M9260k6424m8387K8897N2545M4798J9140o5119
$$ y = [-78447, -68696, -14644, 35882, -21694, -31657, -85313, -14657, 58590, 54058, -6190, -66972, -30877, -35681, -88186, -43191, 25928, 38648, 61940, 66261, 40641, 45687, 11162, 18117, 43292, 73906, 125828, 151742, 101942, 25852, -14620, -4036, -53185, -56457, -92731, -132599, -87799, -13146, -2814, 3854, 50304, 2662, -20284, -16920, 30724, 68427, 35094, -30538, 24658, 34332, -21767, -48876, 42895, 126834, 150735, 135844, 96063, 49377, 28941, 33481, 86637, 136993, 93625, 53154, 44095, -6711, -32266, -2117, -64738, -99680, -138213, -83296, -22944, -35885, -93882, -98922, -45290, -71004, -66289, -56738, -23605, 7311, -3307, -25743, -22723, -55560, -47253, -62025, 3838, 53098, 26674, -21713, 7184, 59729, 104527, 123667, 58548]
28047E8548J5403o8776j7654P6966j729p4468l8938K8840N3903N2593O6454m0029
28035A11113M812l52L6728l2675j42063r5866L9356k1869P6Q7547N6633L5852
28023G9292j6531l9866j51125M943P1754P1434j5956m1252M7014q040k0151P626
28011a0858N8878N3238k4366J8011L6474M1435M6433N4271m7582j06880n4828
28000F4226P674P486M518q26m9721q1979J2268r091n5934m0068Q1929O7230k6045
27987a8333j2901n4137K5591N9817m7817n9080J00538k6008n3502N8043L6626
27976H837p3512n3714N7167J3767J8260J2896M6368j6199q669k2674l5288K1700
27964c1061k0858J8843Q6038J2673p1070L0094K0776L8219m7170l2312j16636
$$ y = [58548, 73951, 5175, -12479, 64487, 62758, -11710, -50648, -21808, 32095, 84688, 151142, 111113, 115925, 115573, 152301, 119626, -22437, -118303, -78947, -100816, -100740, -13193, 43440, 79292, 62761, 22895, -128230, -123287, -51533, 19901, 3945, -37307, 9707, 1667, -18484, -10858, 48020, 101258, 76892, 94903, 131377, 172812, 219245, 273516, 225934, 119054, 64226, 71900, 79386, 83904, 83078, 33357, -48622, -36354, -45445, -101379, -141447, -59518, 7712, -18333, -31234, -85371, -59780, 37, -47780, -106860, -6322, -32330, -85832, -27789, 8837, -64675, -118389, -61222, -47455, -29195, -16299, 30069, 13870, 5201, -17473, -52761, -31061, -51919, -33076, 52962, 65635, -5435, 24659, 45435, 83654, 36484, 4172, -112464]
27953a12464l7782L7469J6926r919m8953M0810R0869J29540n9539n781k3427j6758
27941I91j18439k6763L0793J4869J39571j1448J1331J2363m6917k8685j03530
27930a25864n1793N8490l248L2648m4470n121J47342L4878l7229l1883L0282J2524
27918A6556J2214k8890n7031P702N0839Q8417k3553j4371n3553n1842P3058o9893
27906e0347K2969L8258N132L4858m5714j9982k1909J14197K6853q1633n479J9607
27894C6810m7173O115j0387N438J00509K8854j2029j09577p0810k2797M3156O5819
27882A3928k8617L89k5604k6783m5201O6091J14701R011l2699n9273r935k9121
27870e3113O0951k762j07397j54323J01430R7494M7912L9699K7857k0723J9150
$$ y = [-112464, -150246, -112777, -95851, -105770, -154723, -113913, -23044, 106496, 46957, 41176, 17749, 991, -117448, -144211, -113418, -98549, 41022, 29574, 40905, 53268, 6351, -22334, -125864, -177657, -119167, -122415, -89767, -134237, -139358, 7984, 42862, 5633, -26250, 4032, 16556, 28770, -120, -57151, -49449, 1390, 89807, 66254, 51883, -1670, -53512, 19546, -50347, -27378, 10880, 16012, 50870, 5156, -14826, -36735, 77462, 104315, 22682, 17203, 36810, -10363, -4248, -14635, -9197, 91312, 120166, 108137, -1440, -72250, -95047, -51891, 13928, -14689, -14300, -39904, -66687, -111888, -45797, 68904, 77915, 45216, -14057, -23992, -53113, 7838, 5076, -102321, -256644, -155214, -57720, -9808, 29891, 57748, 37025, 56175]
27859E6175j5395m5185N540K5271L6189O7394l2117n8452m1746O821k2161n7118
27847g4784M5158J07675J7636m5287J6197M67J6045n0189o6067j676K8167q584
27835a5242n6606J0193M2202L63L6611m1131m728n379m8865o6477O5180J10236
27823B6357M5599o0185k6870L3686L0897j1L4801l3243k4233L7776n789M9656
27811A08441P6165r4000r8307O879Q31K1004L0075n9930p6404q4387P143N5525
27799a06965P6722J13008q0592n4683o4811j12584l8916J01346N1411M0733J14221
27788C8890n2571K5944L9210j8697r3538l6160J7566O799L018L5786Q1436o1506
27776a3823j0563K3951j3705l2220m2567O7684J5686M1R0154J1962l9738p9305
$$ y = [56175, 40780, -4405, 1135, 26406, 62595, 129989, 97872, 39420, -2326, 4495, -17666, -74784, -29626, 78049, 95685, 50398, 66595, 67062, 83107, 32918, -33149, -34825, -6658, -15242, -71848, -61655, -19453, -19090, 17521, -23610, -28338, -33717, -82582, -149059, -83879, 26357, 71956, 11771, -15099, 18587, 49484, 49473, 84274, 51031, 26798, 64574, 58785, 108441, 184606, 90606, -7701, -822, 9, 21013, 51088, -8842, -85246, -169633, -162490, -106965, -30243, 82765, 2173, -52510, -117321, -229905, -268821, -167475, -116064, -75331, 38890, -13681, 12263, 51473, 32776, -60762, -96922, -79356, -72557, -69539, -33753, 47683, -13823, -24386, -435, -14140, -46360, -88927, -21243, -5557, -5516, 84638, 96600, 56862, -22443]
27764b2443k5575L1435j0224k4766k6529M2774m6814j1656N7805P524n1992J580
27752g8881L89M2895M8087n1201J3654N0543L2031M2784m1867p6171Q4647O607
27740G3517n2304j4946n7183l0050P3444P1063J217m9432m2157J4334k5398r6994
27728a34889O4420N4810n4198O8586L7143p3512j05837J01917L5789n4502o706
27717f6979J00877R4248m1536n0314k5968o390o5130K2333L1491K551m108j1939
27705b0864L3353N1001m4737m1080q7224j6918L6438Q2733L565k8145k6811Q2248
27693B3559M1136Q0500J8173n3562j18621k8624L5665J8407N1854q361k9587o6100
27681c5561n8050k3230p5844K4288R3949J4389l4452J6606M536l3288L2718j2157
$$ y = [-22443, -48018, -16583, -26807, -51573, -78102, -35328, -82142, -93798, -35993, -28469, -80461, -78881, -78492, -35597, 12490, -38711, -25057, 25486, 57517, 100301, 58434, -17737, 66910, 73517, 21213, 6267, -50916, -80966, -7522, 63541, 64758, 15326, -26831, -12497, -37895, -134889, -70469, -15659, -69857, -1271, 35872, -37640, -143477, -41560, -5771, -60273, -66979, 33898, 128146, 86610, 36296, 10328, 3938, -61192, -38859, -7368, -4817, -8925, -20864, 12489, 63490, 18753, -22327, -109551, -126469, -90031, -7298, -3733, -31878, -58689, 23559, 64695, 145195, 163368, 109806, -8815, -37439, -1774, 16633, 68487, 60126, 30539, -35561, -93611, -116841, -192685, -168397, -74448, -60059, -94511, -77905, -73369, -106657, -73939, -86096]
27669h6096k1401P7339K3356m4954n8956l6641L4379k4707l504Q5952K0141k2992
27657e8084k3740J26490k7799o275Q987p9283r4533K3592M6798l8914J1711P7523
27645c3527J3968q6617o9366K8590R4893O39m5341N2086K475l8527l0578k0100
27633a31405R1100R1419o0329p7477K8336O0266N1332J5514j5810J6898o9031
27622H13N2452k2519l6581k3396K46L1836n0765K097O6125N4644j57596m8429
27610a31073J19755R2050L022J7790n15l6436l3988J6969Q7834k855q1845j5381
27598C5327n1799k6785k7930J0862M9346P0996m8436J9186k285o1783l5399l1627
27586a00327K6944O9672j0853m2386J3049N1112J7540j03754p0059j8708R7459
$$ y = [-86096, -107497, -30158, -6802, -51756, -110712, -147353, -112974, -137681, -141185, -55233, -35092, -58084, -81824, 44666, 16867, 10592, 19579, -59704, -154237, -130645, -83847, -122761, -111050, -33527, -19559, -106176, -175542, -146952, -52059, -51420, -96761, -44675, -42200, -80727, -111305, -131405, -40305, 51114, -9215, -86692, -58356, 1910, 53242, 68756, 52946, 69844, 813, 53265, 30746, -5835, -29231, -28985, 2851, -47914, -45817, 20308, 74952, -82644, -131073, -11318, 80732, 83754, 101544, 101029, 64593, 30605, 47574, 135408, 132553, 50708, 35327, -16472, -43257, -71187, -60325, -10979, 60017, 11581, 30767, 28482, -33301, -68700, -100327, -73383, -3711, -14564, -56950, -43901, 7211, 24751, -79003, -149062, -167770, -70311]
27575g0311O0926J3630m4148m366k6942K702o9493Q7116L3046j8758J02790j4179
27563E2013k9244M4192M4291p0289k5074N5362q2023r4952o388K0700P4997n2192
27551f8607m411K4869k6875K6198l1932M2007Q8460Q1493m8983o6156L4308K9078
27539G9449K4206K4058j8238J0504k2832p517l8299o1148J5851K5179L0481j565
27527F0129M295l6384j05060J1866N8962n454L5492K1243K6969m3282O7402N8983
27515A55161N335m3833m2409j1856j9461N0408K2432r0745n4204K2286j682k6874
27503c5442k9162j01j3409m0166M0270j446r1577L9410o928M4457R7508J5334
27491A8748J02077K6997l9146q6274J1686q361j9773n6031m757k4M0484O9043
$$ y = [-70311, -9385, 4245, -39903, -44269, -71211, -68509, -138002, -50886, -17840, -36598, 66192, 52013, 22769, 66961, 111252, 40963, 15889, 71251, -10772, -105724, -112112, -91412, -16415, -68607, -73018, -48149, -75024, -48826, -80758, -38751, 49709, 131202, 82219, 16063, 50371, 79449, 103655, 127713, 109475, 119979, 97147, 89630, 51331, -9817, 6034, 31213, 61694, 60129, 64424, 28040, -77020, -65154, -6192, -11646, 23846, 45089, 72058, 28776, 96178, 155161, 160496, 116663, 74254, 62398, 42937, 93345, 115777, 25032, -29172, -6886, -8568, -35442, -64604, -64705, -78114, -118280, -78010, -79456, -171033, -131623, -138551, -94094, 3414, 18748, 120825, 147822, 108676, 22402, 34088, 25727, 5954, -50077, -54834, -54858, -14374, 54669]
27479E4669J0146L4461j5151p9358l1735p7976l0903J06628Q1680Q791j1388L5987
27467H5851n918n7998p5009Q245O1244J2907L0790j7446p0546k7309M7148M0745
27455C2704N0659M1793k2943q2968r5912r181L3591L7042P7189J7629K3327j7723
27443H5207l5223j26488J4927O1464J40744M2802r6672m8157K667L6103J0108
27432H7482l1807l1551o2876n2562n4014L9337R8311M6108L1469K7249n2191L6130
27420H1085m0969J4694L1249J474k1645M4601o0773j08895j1518J91182M2388
27409A62873L9364q3024j05268J0273L2492r2092k5527J03309Q2899o192K9304
27398A48411o3588L3604J7527j17970P454Q9229O8583k1157j03819j04620m9975
$$ y = [54669, 64815, 99276, 84125, 4767, -26968, -104944, -135847, -29219, 52461, 61252, 49864, 85851, 79933, 21935, -53074, -44829, 16415, 29322, 60112, 42666, -27880, -55189, -8041, 32704, 83363, 125156, 102213, 19245, -76667, -85848, -52257, -15215, 61974, 79603, 102930, 85207, 49984, -76504, -61577, -113, 140631, 183433, 86761, 38604, 41271, 77374, 87482, 55675, 24124, -38752, -91314, -145328, -105991, -7680, 38428, 69897, 97146, 44955, 81085, 40116, 54810, 86059, 87533, 65888, 110489, 49716, -59179, -70697, 120485, 162873, 202237, 119213, 13945, 24218, 56710, -35382, -60909, 42400, 125299, 119107, 148411, 84823, 118427, 135954, 17984, 25438, 114667, 183250, 162093, 58274, -46346, -96321]
27387i6321l8398N505m264n0280O8662P1348J6847P6220P0414o2172p1852l3711
27375d8002n1760J00124Q5926L4852m6924m6099M4874j7202M9622o0112k7716
27364A7583O1065J1033J7400N5715L3455l2493j11271M0749N9275n5537k6397
27353G0577n0732j311l0517N3653k7976L3035j6775N892M7022K8429j032r9118
27341A1147M0142M6012K7786l3694j8793j0799N33o410m1024k8385N8194Q0926
27329A25635j44449o4912L3982L4935n075K509K6857O0156K486M7215Q054j108
27317A26285N3172K0709l5705k4660O5631m889m9246j4369n1492m4179j8976j6065
27305F216K6853K5582k0465J3703j0113Q497L7318j6203o6387K2853l1673n6072
$$ y = [-96321, -134719, -129214, -133478, -183758, -115096, -43748, -26901, 49319, 119733, 57561, -14291, -48002, -99762, 362, 86288, 121140, 74216, 28117, 72991, 55789, 105411, 45299, 17583, 78648, 89681, 107081, 162796, 196251, 163758, 52487, 93236, 152511, 96974, 70577, 19845, 18534, -11983, 41670, 13694, 46729, 29954, 35846, 82868, 111297, 110265, 11147, 51289, 97301, 125087, 91393, 72600, 61801, 62334, 55924, 14900, -13485, 44709, 125635, -18814, -83726, -49744, -14809, -19884, -17375, 9482, 69638, 72124, 119339, 127393, 126285, 179457, 200166, 164461, 139801, 205432, 200543, 151297, 136928, 85436, 41257, 22281, 6216, 33069, 58651, 38186, 51889, 41776, 50273, 87591, 71388, 5001, 27854, -3819, -59891]
27293e9891K5155J3132j01150J07679N7343J0653M6475j9497M357n3766r8332
27282f7842o9343j8737M0362J9827Q811N9059J5794L5872k7746j6547j6501L1123
27270e868M2759K0528k2428m9390p462l6929j3978N0807l6017l2032N1763m4332
27258h2579N9621j6406J5668L7092R701l974p2509N9406l4141j4674K6493L3820
27246A7518O6205L6939n3948p610N958m0935J2919L2546J6009p871o9920m9720
27234d1910J7619Q5668J9797j00903m9005N2311J5086M5589N2063Q994L448L6856
27222A45613j0069m1154m2822l1915k2674l6605k473M5439j020p4353m3658N7119
27210e8572K2930n2239O699l109L4481j6472l5093L5335N011k55Q807P8045K7662
$$ y = [-59891, -34736, -21604, -122754, -15075, 42268, 52921, 99396, 79899, 84256, 30490, -67842, -137185, -155922, -115560, -95733, -86922, -27863, -12069, 23803, -3943, -20490, -36991, -5868, 36891, 57419, 34991, -14399, -21861, -58790, -72768, -21961, -57978, -90010, -38247, -82579, -22958, -39364, -23696, 13396, 23097, 19123, -53386, 6020, -28121, -42795, -16302, 17518, 83723, 120662, 66714, 59104, 65062, 24127, 37046, 69592, 85601, 77730, 7810, -41910, -24291, 61377, 81174, -19729, -68734, -16423, -1337, 44252, 96315, 105309, 108757, 145613, 135544, 94390, 51568, 19653, -3021, -39626, -42099, 3340, 2320, -72033, -115691, -58572, -35642, -87881, -81182, -84291, -49810, -66282, -101375, -66040, -61029, -61284, -52477, 25568, 53230]
27197E3230o4757j2995M1412K207q026P0888r4099q4047N310j5453J6491N270
27185h4569k6614L0769k604o871L7669J00896L9787j11884q8284J907R7830k4846
27173c6814j9298O1252N2988j08757m2189N3432Q9729J1246K763m2999j53249
27162a31896o6143L1815N9241K7006k2369K8333N2907q3952r330P9506K0177k4500
27150c9205m769N1915Q966n9782q1537m4047J8553K0724L5844Q1279R538M060
27138A539J5041Q104j3088j5942m5667k0546o1062J5336L2455L9187M3552P5132
27126G4041P6980K0892j9419r8585m3077j8680k7430n198l1304j4558N7719r833
27114c8452k9170p0230o223J36202M0045J180k0189K826j277L7836m0819L0438
$$ y = [53230, -11527, -24522, 16890, 19097, 11071, 81959, -12140, -96187, -90877, -106330, -89839, -84569, -111183, -80414, -83018, -89889, -52220, 48676, 88463, -23421, -111705, -109798, -11968, -36814, -56112, 5140, 58128, -50629, -92818, -39386, 50343, 61589, 64352, 21353, -131896, -198039, -166224, -106983, -79977, -102346, -74013, -21106, -105058, -114388, -34882, -14705, -39205, -43974, 7941, 16907, -42875, -124412, -168459, -149906, -129182, -93338, -12059, -2521, 1539, 16580, 24684, 11596, -4346, -50013, -70559, -131621, -116285, -83830, -44643, -1091, 74041, 151021, 171913, 152494, 53909, 10832, -7848, -35278, -40476, -71780, -86338, -28619, -38452, -67622, -137852, -144075, -7873, 32172, 33352, 13163, 15989, 14712, 52548, 11729, 42167]
27102D2167J5283l6333n6545J9721j1100m954L1760k1419N3514Q6182l6457p9517
27090B302q816O4236m233l1740q8952L3883J2912K0965J282j7560n1086K3099
27078d3708R155P578Q9797l4874j00432O3513L2743r3685O941N7129j7824m1680
27066f5347M5264P345P6640N4347r9823R159j7231l2285N2129J7572k4286J2089
27054C5573n8259p1435O6164O5661j6751R095O3691K9433J09549R042q0795q7812
27042G3156n3436m5116o075K3156R954m1905m3397K5415N1158n9451r9966k3795
27030a90302R3153M2892P6L427M403j3563K7627M8077k3018j0378n8002k744J3131
27017f5221K1051l8464O5349J5006m2228K1205N2127P5808m6942j0865L2921l6103
$$ y = [42167, 57450, 21117, -35428, -15707, -26807, -31761, -1, -21420, 32094, 118276, 81819, 2302, -6514, 57722, 53489, 21749, -67203, -33320, -20408, 557, 1839, -15721, -66807, -43708, -34553, -26975, 62822, 27948, -72484, -8971, 23772, -69913, -62972, -5843, -23667, -65347, -20083, -12738, 63902, 118249, 18426, 27585, 10354, -21931, 30198, 47770, 23484, 35573, -22686, -94121, -27957, 37704, 20953, 30048, 93739, 123172, 232721, 241763, 160968, 73156, 19720, -25396, -31471, -8315, 1639, -40266, -83663, -58248, -7090, -66541, -166507, -190302, -97149, -54257, -54181, -50754, -46351, -59914, -32287, 15790, -7228, -17606, -75608, -78352, -65221, -44170, -82634, -17285, -2279, -44507, -23302, 28825, 104633, 57691, 46826, 79747, 43644]
27005D3644m2939p4612Q1406J83709k8189m4966O1623p2840j12134j6731K3464
26994A435j5302L9995n4933N092M0270K3018K6856Q0827k4055p2746o6140M3519
26982B7836K2395o3659O1568J1265n5262k4438j0827M0102m4177r7999P9538J69630
26970A15972M7116j8996n948r2323p8327N604P8957R3663l9264j6963m6489K5977
26958F8979k6882o6912J3066L9458J04070q2326o2469N4369L6193q9860r101j7300
26946c8715P2613N1206j8380K3318p2412j00854l5656M2418J57676j9170m8763
26935A3281n824L2702N0937m4513o0063J9468N2895K6510o0427L167j42M312n3325
26922b1022k2798J53764O0772l8319j06252m5096K5566l9171p6592J5968O5283
$$ y = [43644, 705, -73907, 7499, 191208, 163019, 118053, 179676, 106836, -5298, -22029, 1435, -13867, 26128, -28805, -23713, 16557, 39575, 66431, 147258, 123203, 50457, -15683, 27836, 50231, -13428, 48140, 59405, 4143, -20295, -31122, 8980, -35197, -133196, -53658, 115972, 163088, 144092, 138144, 45821, -32506, -26902, 52055, 145718, 106454, 89491, 43002, 68979, 42097, -24815, -11749, 27709, 131779, 49453, -13016, 41353, 77546, -12314, -21415, -38715, 33898, 85104, 66724, 90042, 17630, -83224, -118880, -76462, 81214, 62044, 13281, 7457, 40159, 91096, 46583, -13480, 5988, 58883, 85393, 24966, 28133, 27991, 32303, -21022, -43820, 109944, 170716, 132397, 26145, -18951, 6615, -32556, -109148, -93180, -27897]
26911b7897k745K0461K0613L7840o8024q923K6879l3457M7640J3221L5819J6158
26899G7585n2614Q907l072j5794Q335P952P797O8711O925k3852k8020J5474K9336
26886A07670J6159j05923j24762r8936R0414M9476P4899M4429J7764L7120L1378
26875A39688o178J8396l4110k4748n947k5337j9501O5906N996n9933N3231K693
26863A10156o9114P6071J8173q9913m6985j00561j63P4955L7458j5622m176N3798
26851D4077J6029J08761l0730m8996l5235j5996p487k1269m7649N1132J6847l5045
26839e561o7590o9052K0404Q2357J17305O2743r3275j3426j8330q727O331o0149
26827d6970m4640L2435J689N641N4286J9044n2318J7065N6432n114l8874o0626
$$ y = [-27897, -30642, -10181, 10432, 48272, -19752, -28675, -1796, -35253, 12387, 25608, 61427, 77585, 24971, 33878, 30806, 15012, 23347, 31299, 39096, 107807, 114732, 90880, 62860, 78334, 107670, 123829, 17906, -106856, -205792, -115378, -65902, 8997, 53426, 71190, 108310, 139688, 133510, 151906, 117796, 93048, 87101, 61764, 42263, 108169, 114165, 54232, 107463, 110156, 41042, 117113, 135286, 45373, -1612, -102173, -102336, -27381, 10077, -5545, -9721, 44077, 60106, 168867, 138137, 89141, 53906, 37910, 30423, 9154, -38495, 12637, 29484, -5561, -73151, -142203, -121799, -39442, 77863, 140606, 47331, 33905, 15575, 6848, 13179, -46970, -91610, -59175, -57486, -51845, 2441, 21485, -30833, -13768, 42664, 37550, -1324, -61950]
26815f1950K1792O3226O21j3559o9729m292L2917p3213K8864N308j865J2209l5759
26802i5430Q7689J21632l4403k4602L8182p9836M659N2633n213j7388l9805m1476
26790c3358r815M8671J0299n5602o8974j9167N5934N0345J8479K8516q919n7067
26778d0658n369k99N321M5594M7357J5163L0324M1510l1893J0537o1998m8756
26766F833k0665M2318R9371n892q4408m3965K4548l0031L6278K8551k5667J4906
26754D2177n04m0241q3974J578P7003R9539Q98r976j09703j6292N8741P532O611
26741C3389M625k85p9206L1359P3709l118j6751k5408m5084K371M8368O7848k835
26728H8982l8326l7404l2384n0568K1664k3N6552j8207n0258q9484M0620Q3282
$$ y = [-61950, -40158, 23068, 23689, 10130, -59599, -63891, -30974, -104187, -75323, -70015, -71880, -59671, -95430, -7741, 113891, 79488, 54886, 93068, 13232, 17891, 70524, 65311, 47923, 8118, -33358, -43173, 5498, 15797, -39805, -108779, -127946, -72012, -21667, -3188, 25328, 16409, -40658, -46027, -46326, -41005, 4589, 51946, 67109, 97433, 138943, 107050, 117587, 55589, 6833, -13832, 28486, 127857, 121965, 37557, -6408, 18140, -11891, 24387, 52938, 27271, 42177, 41673, 1432, -82542, -80964, -3961, 95578, 96476, 86500, -23203, -39495, 19246, 26778, 33389, 38014, 37729, -41477, -10118, 63591, 60473, 43722, 18314, -26770, -24399, 23969, 91817, 88982, 50656, 13252, -19132, -69700, -48036, -48059, 8493, -9714, -59972, -149456, -108836, -25554]
26716b5554R7419O953J4088p9626o4099k3593q5645k7493Q6761P3489J2320N5128
26704D0148m9110K7173L7673p3075o9458L9185K3458q351j2917K8278J3017j5647
26692a9626k6630R549Q3357N1739k9121j31906k8263L9827k7557J1818K9725l276
26680d0364O0799k7411L1308o0686J8721J1699l3249j4981L5172O029p3473o059
26668i2495L6554J4495N0630J7620q0250N2877J8505n7548J5778j41813J499O5232
26656i8916j2863J2835J47102K5873p3057n5344k1768P46k6691k1888J9351k2938
26644a27558P4969Q7959O0234k9712j00441o7664k9063J7222J8412k8226r3690
26633b17558Q0132N0884J1588L3200m3753J4168n0914l5564K7308L8018L2788
$$ y = [-25554, 71865, 78818, 92906, 13280, -50819, -74412, -160057, -187550, -100789, -27300, -14980, 40148, -8962, 18211, 55884, -17191, -86649, -47464, -24006, -32357, -45274, -16996, -3979, -19626, -46256, -36707, 46650, 98389, 69268, -62638, -90901, -51074, -78631, -66813, -37088, -40364, 20435, -6976, 24332, -36354, -17633, -5934, -39183, -54164, -18992, -12963, -86436, -92495, -55941, -41446, 9184, 26804, -53446, -569, 17936, -39612, -23834, -165647, -164148, -98916, -111779, -98944, 48158, 74031, 974, -54370, -76138, -75392, -102083, -123971, -104620, -127558, -52589, 35370, 95604, 65892, -34549, -102213, -131276, -114054, -95642, -123868, -217558, -137426, -86542, -74954, -41754, -85507, -71339, -122253, -157817, -130509, -92491, -59703]
26622e9703K5345O8283k4034O757M5410M9898Q943O9379l0165l9783r4480o0572
26610c4722L3188p0728K6970k9166N384L5327O234m1351k1789J23548P2792j6800
26598H8887j07882k2115q4039L1958J26334l963r0856o9549L2549n0369j7922
26587a66967J06648J01071j4947p1975o9203K4129k0806L6620O1362k0982O868
26576b8182M4689m7478N8611l1353n1044Q3655J03109n1543j13437l1372P673
26565e6672M9851M0515J4152J1658M9518O728p7565l1460j9477M357m3372M1363
26553a0404l9231k5669l0357j2000p16k7583N3846M9165k5117L5017L2061K4425
26541B3437Q0927K4647j9871K045n6952l1315j9322L9655l2689j1974l5634n339
$$ y = [-59703, -34358, 33925, 9891, 16648, 62058, 111956, 120899, 190278, 160113, 120330, 25850, -34722, -1534, -72262, -45292, -74458, -69074, -33747, -27513, -68864, -90653, 32895, 105687, 88887, -18995, -41110, -125149, -93191, 33143, 29180, -61676, -131225, -98676, -149045, -166967, -60319, 40752, 25805, -46170, -115373, -91244, -112050, -75430, -14068, -35050, -28182, 16507, -30971, 27640, -3713, -54757, 28898, 132007, 80464, -32973, -64345, -56672, -6821, 33694, 47846, 59504, 109022, 115750, 38185, 6725, -12752, -8395, -51767, -10404, -49635, -75304, -105661, -117661, -118377, -145960, -92114, -42949, -68066, -33049, -988, 23437, 104364, 129011, 109140, 111185, 54233, 22918, 3596, 43251, 10562, -1412, -37046, -42385]
26529d2385K7025L5087J4211M5557k07j01563K2770O499l7735k9313l6222J9940
26517g6336L7204J11568J342p3260k6268k9003j0814l2095J7539m7070l2557K5913
26505a33837M6774M9974j317j9527N1192P7519M3615K5280K403o0369j9539k4486
26493C7682J337O241p8213n4058P625j8359J5283J2641O6466O4369r166m5980
26481E868q8293M6676O2884m5818L7694L946q0722o7506M3892o70N239K3581q9953
26468a43182K4473J31297L2159p2115n3642M9378K0977K0393R6562l7317l8768
26457C0215j3250j6690j2321O4160o3453k3799N8004N1890J5781m3767k6897J9975
26445C9848q6259l5040J4517k982j7289P6447N3297O2492j14631j23999L8448
$$ y = [-42385, -15360, 19727, 33938, 79495, 79288, -22275, 495, 6994, -30741, -60054, -96276, -76336, -39132, 72436, 73778, 518, -25750, -54753, -65567, -97662, -80123, -127193, -159750, -133837, -87063, -37089, -38406, -57933, -6741, 70778, 114393, 139673, 142076, 81707, 62168, 37682, 39019, 45260, -32953, -87011, -79386, -97745, -82462, -69821, -3355, 61014, 51848, 5868, -82425, -35749, 27135, -18683, 19011, 22957, -57765, -125271, -81379, -82049, -76810, -53229, -143182, -118709, 12588, 44747, -27368, -81010, -31632, -10655, 9738, 106300, 68983, 30215, 16965, 275, -12046, 52114, -11339, -35138, 22866, 74756, 90537, 46770, 19873, 39848, -46411, -81451, -66934, -69916, -87205, -10758, 42539, 105031, -9600, -133599, -95151]
26434i5151n1742j9388L1030R6500J03336j0161p2921m2398n295J01785n5051
26423a9456K11L6142M9400l6856m6838K6331j1006k3591N2538K2306k2381M2038
26411F8838M5892r1658j2859K6290J2948j181Q118P965l747k5020o6979l767m4807
26398g9967m7783M6422o338J5292K1394o4053K1740O4784l8817o2706j8989P0412
26386g8609K9272k0223j3326L0588M0955n7765n9471J8959n707n7704Q5918J13851
26374B6738K0521Q77K0328m8491n8843l2985p704O5988k7609n8678l6466q440
26362a44764k0440J41648K0356N4673m583p349n2609j16473j00095N1533j736
26351a79839N1782P6572K8662L9452M4875M9933k9502q1962r4120p2130K1179
$$ y = [-95151, -146893, -166281, -135251, -38751, 64585, 54424, -18497, -60895, -66190, 35595, -19456, -19245, 16897, 66297, 29441, -17397, 8934, -2072, -25663, 26875, 49181, 26800, 68838, 114730, 23072, 10213, 36503, 49451, 48270, 56388, 64353, 60606, 35586, -31393, -35160, -79967, -127750, -81328, -87666, -72374, -50980, -115033, -93293, -28509, -67326, -130032, -149021, -78609, -49337, -69560, -82886, -52298, -11343, -69108, -128579, -109620, -115327, -173031, -87113, 26738, 47259, 48136, 68464, 19973, -38870, -71855, -79559, -13571, -41180, -99858, -136324, -144764, -165204, -23556, -3200, 51473, 46890, 39541, -13068, -129541, -229636, -178103, -179839, -128057, -51485, -22823, 16629, 61504, 111437, 81935, -27, -94147, -166277, -145098]
26340a45098J8035M476j8764j2402M6937k6087l9640J16769N5789m8335q8725
26329a37045L9507Q3016L2205o7173j8145m5701K5736N8754k440r406K6342J4491
26317A41j570J2696J7432o5516m3715L8747M7377k8558O547j7O0604k1162k1092
26304A914M5597L3286R5834k8012J4511N4449m7902j07704K3584L3777l3979p9835
26292E520j0948O913k8449J767O555L8034k8478K079k2638k0211N71M2459r00
26279g726J7984K8839j2643l51p5952o1548K2896L4140N2974P6091L753L5024
26267A13481K2590m8629K0569q733R311N324p8641m2127Q6135j7589k719M7390
26255A06362K372l2275O9984k8584n8794j5138l0140m6164l6286r334j4997P7581
$$ y = [-145098, -127063, -122587, -141351, -153753, -106816, -132903, -172543, -55774, 15, -48320, -137045, -97538, -14522, 17683, -49490, -67635, -113336, -87600, -28846, -31286, -40692, -14350, 141, -1429, 11267, 28699, -36817, -80532, -41785, 5592, -22966, -16419, -16436, 44168, 23006, 1914, 47511, 80797, 176631, 148619, 163130, 217579, 169677, 61973, 85557, 119334, 85355, 5520, -5428, 1485, -26964, -25197, -18642, 19392, -9086, -7007, -29645, -49856, -49285, -6826, -7726, 10258, 39097, 26454, 26103, -49849, -111397, -88501, -54361, -1387, 74704, 78457, 113481, 136071, 87442, 108011, 99278, 108589, 113913, 35272, -6855, 79280, 61691, 58972, 106362, 108734, 76459, 146443, 117859, 59065, 43927, 13787, -32377, -68663, -77997, -92994, -15413]
26243a5413k9990N7571P1159p2693o3292j9168P7532N355j47667j4896J46106
26232e396J02715L0139J95m927m7825Q829J06449j8771q1136r1312p1424J17785
26220D5321K1195k127p7987p1024M4029K7546n4250K1040N3800o9802j122m4870
26208a08251l8763o103l1211J9191P3753j9313K1827J3936j24660M398J73458
26197b1738J9711n0784J5843m5457P5483L0349r8945j6316M5001p493j1537P9113
26185A3230J2107m9381p9842O0055j0615p3167j0448N1920L7734m047p1346J74
26173a23626J03122R4067l5116L1173R4682M8902o5940m0147j26169q8792P6611
26162c1233J9458o6236n9928j3536J02089J09602N074O0506l5894j20994o9258
$$ y = [-15413, -45403, 12168, 83327, 10634, -52658, -71826, 5706, 11061, -136606, -151502, -5396, 97319, 127458, 127653, 122726, 74901, 83730, 190179, 171408, 90272, -1040, -72464, 45321, 66516, 64389, -13598, -84622, -40593, -13047, -67297, -46257, 7543, -62259, -63381, -108251, -147014, -153117, -184328, -165137, -91384, -110697, -88870, -74934, -199594, -195196, -21738, -2027, -52811, -36968, -82425, -6942, 23407, -75538, -91854, -46853, -54346, -65883, 13230, 25337, -24044, -103886, -43831, -54446, -127613, -138061, -86141, -48407, -52454, -123800, -123626, -20504, 73563, 38447, 69620, 164302, 213204, 147264, 107117, -19052, -107844, -31233, -11775, -78011, -137939, -151475, -49386, 60216, 65290, 125796, 89902, -31092, -100350]
26151a00350q6740N2102R7466M2866k4794L2985j3469j7489M1217L2847l9671
26140A6970k0976J7822n0668p869M2798O2311M808p9872P607K3510j5965j4958
26128a4482n357M2513k2466r184O1980k2065n2695j2068M3572j2295L2338L3628
26116F3419k3982l4003L4984M0070q3434r8105o1632K6595K9432M9031p487M9518
26104a5594K478o0514k0462p1258N1713P4038P9128O3055J205k0420n9799k3916
26092c46N83o2072M2853J06894k5161j8483k430o05o0518n388N36J26682j3020
26079H9525r556o791k510o3677n9623O341N31M0110q743l6437K1939J12450K2092
26066A05651j8996o7476j1891M991r677O6502L8747n7727j25857M5925P3148J9079
$$ y = [-100350, -187090, -134988, -37522, 5344, -19450, 13535, 66, -17423, 23794, 56641, 16970, -4006, 13816, -36852, -44721, -1923, 60388, 65196, -14676, -7069, 16441, 476, -14482, -19839, 22674, 208, -8976, 53004, 30939, -21756, -33824, 9748, -2547, 29791, 63419, 39437, 5434, 40418, 80488, -2946, -101051, -162683, -136088, -106656, -57625, -65112, -15594, -13116, -73630, -94092, -165350, -113637, -39599, 39529, 102584, 103789, 83369, 23570, -346, 237, -61835, -18982, 87912, 62751, 44268, 41838, 41233, -19285, -24673, -24137, 102545, 89525, 79969, 73178, 70668, 6991, -52632, -46291, -45760, -5650, -14393, -50830, -28891, 83559, 105651, 86655, 19179, 7288, 12279, 2602, 69104, 107851, 50124, -75733, -29808, 43340, 62419]
26054F2419q41m5902J4280M3365P244o7418k8698J8978O7275K6825p7537L734
26042B3724j0690M2513K7495k8481p5670K181O15Q5565K4614L1395k5463m007
26030I3791k4634l6258P2570n5045O728L4877Q075l8099m5795j4011J0202P2262
26018H4663M5033o8328q6786L1885m239n7840K5744N7565n5845l553P8662M3155
26006I0116l5856n6262j1282k7508O4024K5880m3345k7130O0972Q079j9629J854
25994B9913K6792L2972n6590o8438l4256J8909M7614L3077q2361r2512J7406M4111
25982h3363R4423L827r0873N5285O7256l670J6635P5066k815r3495l8645j4001
25970a4370k8341J8553M0730M6375j3082r6606O0780L3433j2103m2717q203l2964
$$ y = [62419, 61578, 15676, 29956, 73321, 80565, 13147, -15551, 3427, 70702, 97527, 19990, 23724, 13034, 55547, 83042, 54561, -21109, -18928, -18313, 67252, 91866, 123261, 97798, 93791, 69157, 32899, 105469, 50424, 57152, 92029, 100104, 62005, 16210, 2199, 12401, 84663, 129696, 61368, -25418, 6467, 2228, -55612, -29868, 27697, -28148, -31701, 46961, 90116, 54260, -2002, -13284, -40792, 23232, 49112, 5767, -21363, 39609, 47688, 28059, 29913, 56705, 89677, 33087, -35351, -69607, -50698, -3084, 29993, -52368, -144880, -127474, -83363, 11060, 14887, -75986, -20701, 46555, 42885, 59520, 134586, 131771, 38276, -369, -14370, -42711, -24158, 16572, 62947, 49865, -46741, 14039, 47472, 35369, -7348, -15551, -48515]
25958d8515L7554N4463o978m0905K2118l0001q095L400M5023j4460P8768L742
25946I6114q7536n2981k2743n607M9158M0292O444k8589J3076J1635N4984K7441
25934A01688n0965o9920m397J7048k104j00430L7988j8368p285J10673R1840k1799
25922H3969r9374m6829Q919M1215J4993J166o1777J2243M4516N4305O0580m4195
25910F9731o3926p5572J7288J0655L3466R785j5313k8615j1183q9039l4434J0543
25898a66614K8939J08596N9457o4770J3152o435m4873N2564R2291O535M7442m1520
25886H4764L062p0600m2906l1305l5930j17743l0501O6035J24550J53040R8890
25875B01356K1309k6321q5288j56296r0963m8276j6198J7352N9144O9374J08910
$$ y = [-48515, -10961, 43502, 36524, -4381, 17737, -12264, -20359, -16959, 28064, 13604, 92372, 96114, 8578, -44403, -67146, -72753, -23595, 16697, 23141, -5448, 7628, 19263, 74247, 101688, 50723, -19197, -23594, -6546, -8650, -109080, -71092, -89460, -96745, 13928, 105768, 83969, -15405, -62234, -53315, -12100, 2893, 4059, -57718, -45475, -959, 53346, 113926, 69731, 5805, -69767, -52479, -41824, -8358, 1427, -13886, -42501, -53684, -142723, -177157, -166614, -137675, -29079, 30378, -34392, -21240, -27675, -72548, -19984, 72307, 78842, 126284, 84764, 87826, 17226, -25680, -56985, -92915, -210658, -241159, -175124, -50574, 102466, 201356, 222665, 196344, 111056, -45240, -136203, -184479, -200677, -183325, -124181, -54807, 54103]
25864E4103L1600L3836o4851k0010J9222m9661n3978M4485L2129k4474m9137J6250
25852c0486j881n4944p3088N0662O3102n3539j6082J2948p060M8217j3380L2717
25840d2814l124o0003P9111L1645L8006R756l6549l0956P093Q5406L3529j67386
25828e6286o7128L8111N1397J1756K2587j18914P2905Q8994j02566k6403J5363
25817g0184N3641J2806m637j3430m239n7124k4758M2350J02923L4403o1030p5945
25805f5224l706K753m5598R4292P0134k0725K0511L3087K2005l2191m4837l4644
25793d143K6630o3404n3040j87L4742Q392k9045L9977J0780P5463K7914o6116
25781G963m8030R51n0581p2036k1601J10934Q1590l1065N3970M6998J5823o0684
$$ y = [54103, 85703, 119539, 54688, 34678, 53900, 4239, -49739, -5254, 26875, 2401, -46736, -30486, -32367, -87311, -160399, -109737, -46635, -100174, -116256, -103308, -110368, -62151, -75531, -42814, -45938, -105941, -26830, 4815, 42821, 52577, 16028, -14928, -7835, 77571, 111100, -56286, -123414, -85303, -33906, -22150, 437, -118477, -45572, 43422, -59144, -85547, -70184, -16543, -3737, -8374, -21804, -26043, -83167, -107925, -65575, 37348, 71751, 10721, -65224, -68930, -66177, -111775, -17483, 52651, 31926, 52437, 85524, 107529, 75338, 30501, -4143, 22487, -40917, -93957, -94144, -59402, -51010, -80055, -40078, -29298, 46165, 74079, 7963, -40067, -39116, -89697, -161733, -183334, -72400, 9190, -21875, 32095, 79093, 94916, 34232]
25769C4232K8571k0194n0161L3474Q8262M3172p202p6564m2041n4433M0350K2962
25757D0428l8934n947o202l9921O6942p278p1437J6762j13J3518k606J2001O8269
25744D5482Q833n6665p820N065j9751j0351l6129m9705K7713P217J9974K5843
25732d0294l529j21987k8150M1368N7359K289Q2385M9447j1940L4488l2162o7913
25720c8639M3090k6668n3999M7969P5628j758n7189N1068L2558L998O8466L8052
25708A82576J4010n6650m7765K5890p3477o4007n9689K4713N6721N3583n5220
25697F85K178K9213n0971j6366N4906q1580L0958k9490K7998Q9779Q5416j6029
25685A26697j04391L6533O9730n2338l9697j7640m1538m46m5989N3839P4024J8168
$$ y = [34232, 62803, 42609, -7552, 25922, 114184, 157356, 150154, 73590, 31549, -22884, 17466, 40428, 1494, -4453, -10655, -50576, 16366, 9088, -62349, -45587, -45700, -32182, -34788, -22787, 45482, 54315, -2350, -10170, -5105, -24856, -35207, -71336, -121041, -93328, -86111, -66137, -40294, -43823, -165810, -193960, -152592, -95233, -92944, -10559, 38888, 26948, 61436, 29274, -38639, 4451, -22217, -76216, -28247, 47381, 45623, -11566, 39502, 72060, 76058, 144524, 182576, 196586, 139936, 92171, 118061, 44584, -19423, -79112, -54399, 2322, 55905, 685, 2863, 32076, -18895, -35261, 19645, -61935, -30977, -60467, -32469, 57310, 142726, 126697, 22306, 58839, 128569, 76231, 36534, 18894, -22644, -23090, -69079, -15240, 58784, 76952]
25673G6952j4767O4474n294o3480m7822l1065m1544j7173j7259L8066N2213j0735
25661a7434L363N8413P2134Q8477m9210M7447Q964p4295M340o4646r5600k1921
25649c9968M0777K7986L5615r161K3561n7643p3407J8909L3953O1615O6055L4071
25637A62363o7636r2909J0387j5369n0238l2685L0525J2283l8779j3345J2266
25626h3137k2677J5143O235j1977P45M5438O8911J3485j00705n0986J7445N8780
25614d3300P7913P6811n6095r2700l1447J25609L7516j24089k3829N7100L5312
25603C8801q1468j12901q016J32372J13375k0713p5517Q654O813n0706l3821n2475
25591a35602N8982J08746j2512n2016m0542k0108J5178o608j7398k6661N7576
$$ y = [76952, 62185, 126659, 121365, 57885, 10063, -21002, -62546, -79719, -96978, -58912, -6699, -17434, -14071, 44342, 116476, 204953, 155743, 203190, 212154, 137859, 142199, 77553, -18047, -39968, 809, 28795, 64410, 55249, 78810, 21167, -52240, -33331, 622, 62237, 128292, 162363, 94727, 1818, 12205, -3164, -53402, -86087, -55562, -43279, -82058, -95403, -83137, -105814, -90671, -84436, -96413, -95668, -50230, 18681, 32166, -68539, -119525, -102080, -43300, 34613, 111424, 55329, -37371, -68818, 56791, 94307, -29782, -53611, 3489, 38801, -42667, -155568, -163584, -31212, 82163, 61450, -14067, -5413, 1400, -49306, -83127, -135602, -76620, 32126, 19614, -32402, -72944, -93052, -77874, -84482, -101880, -128541, -70965]
25580g0965J8732K3270m5577j1257M9096J2386O1450K0780k8178R925r598M0198
25568G0262J020p044q9707L602J316M2788K256m4264r5324L0248P2376n4628n5051
25555a22150m6285K0389m883L8348R9070P3927k3192j26445M8642n4712j9300
25544a16591Q8659O1933j0422p5192n2118l9180K534J3495o4789j0229Q0853Q6133
25532c4914J513L7497J9879K8398j421N015k8678j236J13260R738o3158k9207
25520E6686L3806P6485R775q9837k9502L4369k6282l6912o4191n1137k8405j9105
25508a34250P4400k0923M8653Q9882l7396o2218k0626L267j500o0523P0643M1092
25496i499O1470N307n8836Q0990L6842q7808M625O945n7844l0655k5296M4102
$$ y = [-70965, -52233, -28963, -74540, -85797, -36701, -24315, 37135, 57915, 29737, 39662, 30064, 70262, 71282, 64238, -25469, -21867, -20551, 22237, 24493, -19771, -115095, -84847, -12471, -67099, -122150, -168435, -148046, -152929, -114581, -15511, 58416, 35224, -91221, -42579, -97291, -116591, -27932, 34001, 23579, -51613, -103731, -142911, -140377, -126882, -191671, -201900, -121047, -34914, -33401, 4096, 23975, 52373, 50952, 55967, 27289, 26053, 139313, 149051, 85893, 56686, 90492, 166977, 176752, 86915, 57413, 91782, 65500, 28588, -35603, -86740, -115145, -134250, -59850, -80773, -32120, 57762, 20366, -41852, -62478, -59211, -60711, -121234, -50591, -9499, 51971, 57278, -1558, 79432, 116274, 28466, 33091, 40036, -17808, -48463, -73759, -29657]
25484b9657M628n7564j4861J63025l1292p0127j0668k379N8971j3743R696K8420
25472C4449J0215l101J4792p9186o126m273o354J1401L1642K1647n9341r5276
25460a29511M545J8265J9451L5416O8267M6693j169K4658M1536Q0038j4775p0991
25448A22423j10055J037N1685K3697m7136q2645k5170K5794l0191j335M5963K2946
25436b987Q3967j1576k6975L308m4003j7094l8175j5092k0631N0965k0841l1311
25424i0445N8135N5378P6r3969p6734R7910J17676K8459K8378k636m83k1579l5509
25411F4657j02656K1074p52K0002K8966j09663K840M0948J3794k4429k9985J8593
25399e6611R3494J3765q927j7058o1827m9379M508j9623Q311P0176n6045m7248
$$ y = [-29657, -25029, -82593, -97454, 65571, 34279, -35848, -46516, -48895, 10076, -3667, 6029, 34449, 44664, 41563, 56355, -22831, -28957, -33230, -39584, -28183, 3459, 25106, -34235, -129511, -124966, -106701, -87250, -51834, 16433, 63126, 61957, 86615, 128151, 208189, 193414, 122423, 12368, 13405, 65090, 88787, 41651, -40994, -66164, -40370, -70561, -71896, -25933, -2987, 80980, 69404, 42429, 45737, 1734, -15360, -53535, -68627, -89258, -38293, -59134, -90445, -32310, 23068, 23144, -70825, -147559, -49649, 68027, 96486, 124864, 122228, 121745, 100166, 64657, -37999, -16925, -17677, 2325, 31291, -78372, -75532, -34584, -20790, -45219, -75204, -56611, 36883, 50648, 41721, 24663, -37164, -86543, -82035, -101658, -93347, -23171, -79216, -126464]
25387a26464J23612L0703J0731k0240j6779n706m0190Q432N3447L4366n5234m0622
25375d3944L86k8011K4992L8989J3337N3596m0928j15846j4890Q6482J5556q961
25363a9242q9727m2513J9460N9091Q8195l058J3663L9666j8040q1419k4783L5555
25351b3152k3207L6170N3027Q179J650j667l1021j5291k3513o4619J1658L8628
25339c3158n2476n4019L9388Q9747J418O4896M9773j4283K5618q262k6552n9452
25327B2638j9737k4286L1287P6656K0321j08740K7451K803l7912m4853O8307P2218
25315H6153N3781L8601q4172R069j7184M794j8166n4741q98j6139R28J6516L8609
25302E7151J5462Q2045O5971k6745l2303p5285j02008p2130l0385J03958Q4358
$$ y = [-126464, -2852, 27851, 38582, 18342, 1563, -4143, -44333, -35901, 17546, 51912, -3322, -43944, -43558, -71569, -46577, -7588, 5749, 59345, 18417, -97429, -112319, -25837, -10281, -19242, -108969, -151482, -132022, -72931, 15264, 12206, 25869, 65535, 47495, -33924, -58707, -23152, -46359, -10189, 42838, 51017, 52667, 51000, 19979, 4688, -18825, -83444, -71786, -33158, -85634, -139653, -100265, -10518, -9100, 55796, 105569, 91286, 116904, 108642, 82090, 22638, 2901, -21385, 9902, 86558, 106879, -1861, 25590, 28393, -9519, -54372, 13935, 86153, 139934, 178535, 94363, 103432, 86248, 91042, 72876, 18135, 17237, 1098, 2026, 18542, 57151, 72613, 154658, 220629, 193884, 161581, 86296, -15712, -87842, -118227, -14269, 70089]
25291G0089J8174k5010p8946M2796q477J04265k8944p7079L0947l4277r3070o3416
25279a42948k2315R5152K8006p9944l329J48425j963n0163K5339M8291p0724q2346
25267a08519J8073P4977L4341K8541p0849m7294k0378N1007k983L277K6507l727
25255a7027P7824k9791J7598J6552k1930K3023j8919q766j4279p2624j037k9913
25243g9289n5066k1660J3235j2734M6447o3134j3005N6693O5082M7471N7571r990
25231C1621Q8723l3967p634J0676m4384l2292l8363q864L1228K275O3962k9557
25219C3424q2716p0921k0406Q2138L9972J7J8990L7335P843j03601m0654L1039
25207f7540M310O0029O2325l1724o3338p2875l1315Q8036J09275K9062M0751n6204
$$ y = [70089, 88263, 63253, -15693, 27103, 18626, 122891, 93947, 16868, 47815, 13538, -79532, -142948, -165263, -70111, -42105, -122049, -125378, 23047, 21084, -29079, -3740, 44551, -26173, -108519, -90446, -15469, 18872, 47413, -23436, -70730, -91108, -40101, -43084, -39807, -13300, -17027, 60797, 31006, 48604, 65156, 43226, 66249, 47330, 38564, 24285, -48339, -49376, -79289, -134355, -156015, -142780, -155514, -109067, -172201, -185206, -128513, -63431, -15960, 41611, 31621, 120344, 86377, 78743, 89419, 45035, 12743, -25620, -34484, -3256, -981, 62981, 33424, -49292, -120213, -140619, -58481, -18509, -18492, 498, 37833, 45676, -57925, -98579, -67540, -63230, -3201, 59124, 27400, -35938, -108813, -140128, -52092, 57183, 86245, 126996, 70792]
25195G0792p9833j4759r469M7921K5402p8750j1868n7694K9798J18010J3247o399
25183D6398M004O383m5846J6202M4610o9869j28414p011k3505Q8674R2618l3125
25171h881q9350k2371K3980O7836L0386M4428o783m1349n5530k2955P593L9072
25159c3924o348q834K0288j6893l8539K063P3936N3184P426K673M6686M3122l7872
25146A06968L5112j98575o5516M8742K798L8104l2920n2243l189O6210P883O9517
25134B2891q9636k1264J03903P0293m6047k0530N52M1006l746p7218o9603P291
25122h2108k3940M8057K6158R0704k9845L6061n94j45410m7325J5031O8973M5066
25110H28j5494k3425k501p27k022Q5088j0271k1025n2321k5882l0291N6262M9075
$$ y = [70792, -9041, -23800, -33269, 14652, 40054, -38696, -50564, -108258, -78460, 39550, 52797, 46398, 50402, 56785, 10939, 27141, 71751, 1882, -126532, -133543, -157048, -68374, 24244, -8881, -98231, -120602, -96622, -28786, 1600, 46028, 39245, -2104, -57634, -80589, -72996, -33924, -40272, -49106, -28818, -45711, -84250, -82187, -8251, 44933, 52359, 55032, 101718, 144840, 106968, 142080, -56495, -122011, -73269, -70471, -32367, -65287, -117530, -120719, -54509, -46626, 22891, -66745, -88009, 15894, 86187, 40140, 19610, 20162, 61168, 57422, -19796, -89399, -82108, -106048, -57991, -31833, 58871, 29026, 65087, 64493, -80917, -128242, -113211, -44238, 828, -14666, -38091, -40592, -41319, -43341, 41747, 31476, 10451, -41870, -67752, -98043, -41781, 7294]
25097G294o129J6177N6724J4558j297o5391k4623k8895P2126K2157q7839J2960
25085a2178J8186k5107R727O7893l0618j9219Q1078o8021l7495M2806m136L968
25073B6884l4684L74o5016j09566m4860O0881K1474R108J5272l3763M1714K7671
25061h4511m6577N7885N5399J3616n6695L6356J2909K7118J5485K451L2465J1945
25049G7846m3152N9137j15776j5903J5805M7447O8894j5520n9806r0348J6452
25038e4924P0564n2427k6297Q8206M7114l1280n8499l1273m9151n95O3392K1284
25026a3886N3560k0018r1902q0871J07151J08167l1692k4916j00228l8271O226
25015a26680j7612O0173M5327N9422N5801J8105J7423R396r2101j05208p5637
$$ y = [7294, 1165, 17342, 74066, 88624, 87327, 21936, -2687, -31582, 40544, 62701, -25138, -12178, 6008, -19099, -9372, 58521, 27903, 8684, 89762, 21741, -15754, 27052, 22916, 26884, -7800, -7426, -72442, -182008, -226868, -165987, -144513, -135405, -120133, -153896, -112182, -84511, -131088, -73203, -17804, -4188, -60883, -24527, -11618, 15500, 30985, 33436, 65901, 77846, 34694, 93831, -21945, -37848, -22043, 25404, 94298, 78778, 18972, -71376, -54924, 15640, -36787, -63084, 25122, 72236, 40956, -17543, -48816, -97967, -98562, -35170, -13886, 39674, 19656, -72246, -153117, -45966, 62201, 30509, 5593, -94635, -132906, -126680, -144292, -84119, -38792, 20630, 76431, 94536, 111959, 121355, 29254, -75954, -151591]
25004a51591N166O791m2877L8812L8897o8701N7662N7879J7388q792M064N3662
24992H360m3019K4344Q7140k2253k7428l9545p3067J8944R3381R0984K1113j42380
24980c426q7321m904Q0868M3395K4392J7511m3028M397k1009J8022n1549m438
24968b7090l133m817o4114r2363K8065o665j4608J35915L4066j2926R1077l4227
24956B9180p3328J068L6014O7534Q8681p697j36025J9177j09301L6937J01700
24945E3940q9464r4245N2809K1413O7419J03921J9735o3219l7679L1136m0468
24934B5298M9872k4399o9818k9740K1508m4163n2509P8958k3592j5670K0062k6589
24922i0782Q2494n804p3592R16K9788O9093L3877q1880l8332j4397O6639M3257
$$ y = [-151591, -146425, -139634, -182511, -143699, -104802, -173503, -115841, -57962, -40574, -49366, -45302, 8360, -34659, -10315, 76825, 54572, 27144, -12401, -85468, -66524, 26857, 117841, 138954, -3426, -90747, -95651, -14783, 28612, 53004, 70515, 27487, 31884, 10875, 28897, -22652, -27090, -30223, -35040, -99154, -191517, -163452, -170117, -184725, -48810, -14744, -27670, 63407, 29180, -44148, -43080, -7066, 60468, 149149, 141452, 5427, 24604, -84697, -47760, 53940, -35524, -129769, -76960, -55547, 11872, 115793, 135528, 72309, 34630, 65766, 25298, 75170, 50771, -19047, -48787, -27279, -71442, -123951, -44993, -68585, -84255, -64193, -90782, -8288, -14092, -87684, -86768, -56980, 12113, 45990, -35890, -74222, -88619, -21980, 21277]
24910B1277l5021L1181P4766M8256M4285o9369p2962l167L8033p9235r3969J45057
24898D9132Q8286o1986l0874N701p3337q5175j0414q965R2519L1908n0648n4740
24886a08593j9611M8503Q1514l5197k1357J2126k2490q954m4651p6764N983L6768
24874a52723N8127M0428L7861l7087J2572M5588k7792J5519n9288q2198N2168
24863i6825M9283N8707k605j5798L1803k6657q517m0930o4559P7599P5958m3418
24851e959p8543j32193Q5822J25267O9683j03273n3042p692L7161j2321M1400
24840c3690m5993j7007L0705K0340N5618m2551k1273K4272l604O8414n1505j06755
24828a23029K615P6655o1396m8556K18244J38543j7410r0361j65339k4433m7673
$$ y = [21277, -13744, 17437, 92203, 140459, 184744, 115375, 42413, 39246, 77279, -1956, -95925, 49132, 137418, 75432, 44558, 50259, -23078, -108253, -118667, -127632, -35113, -3205, -53853, -108593, -128204, -79701, 1813, -33384, -54741, -42615, -65105, -74059, -118710, -195474, -189491, -152723, -94596, -54168, -16307, -53394, -40822, 4766, -23026, -7507, -66795, -148993, -96825, -47542, 11165, 8560, -7238, 24565, -2092, -10609, -51539, -116098, -38499, 37459, -5959, -84502, -216695, -130873, -5606, 64077, -39196, -92238, -99930, -62769, -75090, -33690, -79683, -96690, -65985, -45645, 9973, -32578, -53851, -29579, -33183, 35231, -16274, -123029, -120414, -43759, -105155, -153711, 64533, 203076, 185666, 95305, -70034, -94467, -142140]
24817a42140M8884M5405M551P0851K8272m4312q6843j0381o914J0823N731k4798
24805a00871M1899J3487N5659P749l9468l3574l7340j0350n9688k4487J01843
24794h5141J5172m0504j3063j863J9740M4586N6150J0063k0163P971m1331R966
24782c8417m5244L6994l6787r2648M3211J15940J8879n4426N3235O0838J6332
24771G7907J8496O6553k4523j25140p6477n8299J0228K108P6485K9445J1p149
24759a0355l6931N4223P8300m3141l6493l5463L1259J4332K2461O952J6901p3678
24747a1633j27630m7542J6170L2183P875P0369O0709N2520m1477k6767r302j1220
24735c5745k3802M9756L351n1631p0671l1083n3615M8676n250j8210J20173P4887
$$ y = [-142140, -93256, -47851, -43300, 27551, 55823, 11511, -75332, -85713, -92627, -81804, -76073, -100871, -58972, -45485, 10174, 17923, -21545, -55119, -92459, -102809, -162497, -186984, -85141, -69969, -110473, -123536, -125399, -105659, -61073, -4923, 5140, -15023, -7052, -48383, -38417, -83661, -46667, -83454, -176102, -132891, -16951, 1928, -52498, 737, 61575, 77907, 96403, 162956, 138433, 13293, -63184, -121483, -111255, -109147, -32662, -3217, -3206, -10355, -47286, 6937, 85237, 42096, 5603, -29860, 1399, 15731, 38192, 45144, 62045, -11633, -139263, -186805, -170635, -138452, -130577, -60208, 501, 53021, 11544, -15223, -24525, -35745, -59547, -9791, -6440, -58071, -128742, -159825, -213440, -164764, -170014, -188224, -68051, 6836]
24723F836n0645J7354M6323j7705O3253N5953l7082M5739J1862j0139o1274J3987
24711H4462J5611m7034L3867M712l8464K5380k1853j19027K6426Q9050k24Q60
24699E3766j23341J9586M8121K3627j8556k0937l3340k3940K4837P6800l3440
24688f817m2711l0406K415J43544L4657K2163j2957p8499j1576n270m6188n2643
24676h4288l3050k5141J34197J9080K2083N747J348q965p9935m6900k0994J24895
24664H077M3505O4520j10649o4969J4647k5083j9216N6673R9343K4508j7029q9894
24652a5567r8472J9050J6295o2166K7982N1147n5022m535o291n854P0924N2119
24640a0390J81260L2960q9790j6408J479L8969l8521L6722n1274j04703j1428
$$ y = [6836, -43809, -26455, 19868, 2163, 65416, 121369, 84287, 130026, 141888, 131749, 70475, 84462, 100073, 53039, 86906, 91618, 53154, 78534, 56681, -62346, -35920, 53130, 52906, 53766, -69575, -49989, -1868, 21759, 3203, -17734, -51074, -75014, -50177, 26623, -6817, -49528, -79934, -77519, 66025, 100682, 122845, 109888, 31389, 19813, 14543, -31645, -84288, -117338, -142479, -8282, 10798, 32881, 38628, 39976, 31011, -48924, -95824, -116818, 8077, 51582, 116102, 5453, -59516, -44869, -69952, -89168, -32495, 66848, 91356, 74327, -15567, -114039, -94989, -78694, -140860, -112878, -61731, -116753, -121288, -127579, -133433, -62509, -10390, 170870, 203830, 114040, 97632, 99111, 138080, 99559, 136281, 85007, -19696, -31124]
24629c1124Q189k3024M497J5225L0848P8147j4893l3018j6051L5662l1254l8456
24617a5252N4642M2298p1882l9268q0305R9322P2626j9990p8387m4086P5295k9494
24605c4481M4814P096l4324l808J3145j2582n0473N2971j1226l1029k9879M5085
24593d4691n145n2524L2963L8435O3611j832q8096n1000L2047O758k1170o805
24581i7449O3009n3935l0969R651N541l5439R682m142k9972P2133M4680L3605
24569a3605K6448n47M7295r983k2354o6712l5878K5848L1953l4228K6176K8507
24557B920l1818q4314n0979M3920P8371M1743Q2043l0006Q174L4562R086M1120
24545A44822K2654p5977m2565p4644r547k9839K713j0309N6017k0059j27716q9607
$$ y = [-31124, -22935, -45959, -41462, -26237, 4611, 82758, 67865, 34847, 18796, 54458, 23204, -15252, 39390, 81688, 9806, -29462, -109767, -10445, 62181, 42191, -36196, -80282, -4987, -34481, 10333, 17429, -16895, -20703, -7558, -20140, -70613, -17642, -28868, -59897, -89776, -44691, -49836, -102360, -69397, -30962, 32649, 30817, -57279, -108279, -76232, -69474, -90644, -97449, -34440, -88375, -119344, -109693, -104152, -139591, -129909, -134051, -164023, -91890, -47210, -13605, 12843, 12296, 59591, 49608, 27254, -39458, -75336, -49488, -17535, -51763, -25587, 2920, -28898, -113212, -164191, -120271, -41900, -157, 81886, 51880, 60054, 94616, 103702, 144822, 167476, 91499, 48934, -25710, -35257, -65096, -62383, -72692, -16675, -36734, -164450, -254057]
24533b54057K4951Q6399L1703L5342k0101l5370o9985J460J0965N7470J01467
24522b9756p458k7767j9010o6996j0923k8214M2917P0180M573O530r389L4795
24510d0518j8052L2287K1310j8498q3397J7866k7793N0500Q9413M215L259m2787
24498a2195l8668J563N435O7216l0723o10Q4734N2014l8909l3384m7894j4384
24486e805O877m5717k2950J4502K7889Q8044K9204k4734o0977J5554O3792m2807
24474D2872O5391L0565p9568m8363L4726O1019n8531k2814M1804J1642J3132m2507
24462D9368p6842j04763k805J12470l3641m5376O3888L2390L910K2160j20797
24451a00038l3882L4957K2093O448M1934J7647l5391N8054O7473r7414K0592n4784
$$ y = [-254057, -229106, -142707, -111004, -75662, -95763, -131133, -201118, -199658, -188693, -131223, -29756, -37214, -64981, -83991, -150987, -161910, -190124, -147207, -77027, -72454, -65924, -75313, -40518, -58570, -26283, -4973, -23471, -106868, -89002, -116795, -66295, 23118, 27333, 30592, -12195, -50863, -49300, -43865, 23351, -7372, -7982, 76752, 128766, 89857, 56473, 8579, -5805, 1072, -44645, -67595, -53093, -25204, 62840, 92044, 67310, 6333, 21887, 85679, 42872, 108263, 138828, 59260, 10897, 45623, 106642, 48111, 25297, 67101, 78743, 91875, 49368, -27474, -132237, -135042, -22572, -56213, -101589, -37701, -5311, -1401, 20759, -100038, -133920, -98963, -76870, -70422, -28488, -10841, -46232, 11822, 79295, -18119, 2473, -52311]
24439e2311l8996L3624K1864p6607m9204M3264L9557N2017N0510M8418J9476O440
24427I8052O643K626j5517M8073j0153n6485k8458J8698j8403N129o7839l4079
24415e1713K961J2720q8459O2416N9361j6538P9729j3892j9599r4698j3262L3813
24403d7161K3208K1118o3302P965J04224M3515j4583J5532K4751j6233n733J2696
24391A05997K990k6297p4094l188P37K0923P030r0432n6290k4549L3461J21266
24379A7554Q1983L17o5121Q890j5740Q677M0080R533J1177q6076k3914O1696L1911
24366H0967m2367j4287o6227R733j4084J9441R775J12335J07152j264j9420l6435
24354A45319m4760q1852n3342m6828j7265j5753O9142J09433L2892R120n3528
$$ y = [-52311, -91307, -57683, -35819, -112426, -161630, -118366, -78809, -26792, 23718, 72136, 91612, 98052, 104695, 107321, 91804, 139877, 129724, 73239, 44781, 63479, 45076, 50205, -17634, -51713, -48752, -36032, -124491, -62075, -2714, -19252, 60477, 46585, 26986, -67712, -80974, -47161, -23953, -2835, -66137, -58172, 46052, 89567, 74984, 90516, 115267, 99034, 93301, 105997, 108987, 82690, 8596, 5408, 6145, 27068, 34098, -56334, -112624, -137173, -103712, 17554, 99537, 99854, 34733, 43623, 27883, 36560, 76640, 86173, 97350, 11274, -12640, 49056, 80967, 38600, 24313, -41914, -32181, -46265, -26824, -17049, 95286, 202438, 201174, 181754, 145319, 100559, 18707, -34635, -81463, -98728, -114481, -45339, 64094, 96986, 106106, 52578]
24343E2578j56434p5447P924R2763M7915R2972L2960k166n165q2467M9465J5908
24331G0806o3008n0130M2116L2307k7344J014M0420k0779m115m039J3869n3628
24319b2511k5450j5066o9332K4790k7251O2336J27394k2377j55559j5836p348
24308a46210k7272k4000P2923L6083p45k3142L6223N9541Q169l1290j1321N8759
24296G718J6692O655n8971M7882O5990M6387n5109q7244Q830p418m6035j7818
24284g2441k6446J3090R9509m9482q4242R6918M9606N7462k0087M3729M303j3687
24272I8232l0463k278q829j11544p6242L4369J02329j08r7830M1274O5735j8308
24260c663k7253l0967K3507R7270Q716n7175k4255o4366o0107p7175K2781O1499
$$ y = [52578, -103856, -179303, -171379, -78616, -30701, 62271, 95231, 93065, 87900, 5433, 54898, 70806, 7798, -42332, -216, 32091, 4747, 5761, 46181, 25402, 21287, 17248, 31117, -22511, -47961, -63027, -132359, -107569, -134820, -72484, 54910, 32533, -123026, -138862, -146210, -173482, -197482, -124559, -88476, -89221, -112363, -76140, -16599, -8430, -39720, -51041, 7718, 24410, 31065, -27906, 19976, 85966, 132353, 77244, -10000, -1170, -8588, -54623, -72441, -98887, -85797, 13712, -35770, -120012, -23094, 26512, 83974, 63887, 107616, 111919, 98232, 67769, 65491, 56662, -54882, -131124, -96755, 5574, 5466, -92364, -51090, 14645, -3663, -30916, -61883, -38376, 58894, 67610, 10435, -13820, -78186, -138293, -215468, -192687, -131188]
24248a31188N5465j6451L225q6095L2840M6288M9841R7573l21j3181p0041k3863
24236e5908K7120N4715K1400O2545n3952m0149L0237l7135j2692Q104j3728n720
24224a5163q0610k8567k4530j7502K9009M4830P9740L0510n2467m8697Q3232o4484
24212f4699m7286J7509O1043N6304P4427M6571m6979k2020j1736L6259N8276q0111
24200G7558L6682J3090p4107l2621k4916n442O670q0424Q270P7079P9603L7694
24188A19136l9222J6368n192o4254j03574K6083R2768N8487q99k3084j31464p1238
24176a26085q3523P8784J11131n7852J09518N557j2042j5235o2209k9101L4719
24165d6338Q6203j4114J9242k6616p8204j4514J6784k8500J35400n2045j56459
$$ y = [-131188, -75723, -92174, -88949, -175044, -142204, -95916, -46075, 51498, 51177, 37996, -32045, -55908, -28788, 25927, 47327, 109872, 55920, 15771, 46008, 8873, -3819, 4285, -9443, -15163, -95773, -124340, -148870, -166372, -137363, -92533, -12793, 17717, -34750, -83447, -215, -64699, -111985, -94476, -33433, 22871, 97298, 143869, 96890, 74870, 63134, 99393, 157669, 77558, 114240, 127330, 53223, 20602, -4314, -9756, -3086, -83510, -75240, 1839, 81442, 119136, 79914, 96282, 91090, 26836, -76738, -50655, 42113, 100600, 99701, 76617, -54847, -126085, -209608, -130824, -19693, -77545, 31973, 37530, 25488, 10253, -51956, -81057, -46338, 39865, 25751, 44993, 18377, -59827, -74341, -57557, -86057, 49343, -2702, -159161]
24154a59161K0780Q3540O9491R4854p4001k006r835K6455m1708n021K7052j6222
24142A4218N931J1177p6086l9921o1207L1486N9279j6779P0177j7640J01841L4914
24130A17390l8520l5653K2190l5620l968m4588L2195J7099K1091O1334k123J8555
24118A29382k6563p3106k7241n1445K3400J6928K9191N8060J6938j19160n1719
24107g5335K2258O2183j3062m6650m1174J13959P8877R870m9656o2649q657M923
24095e113l6041P6768k9758N8922j8102m2581j9301K0376l3991n7698q4858Q8345
24083h3032R7970K8198j51815n8582M6357J12604J24133K9554K4663j6071k6090
24072A27889n7134n2897J1945j1603m8896q7694k0295M3603j4121L43N5208j8503
$$ y = [-159161, -138381, -54841, 14650, 109504, 35503, 33497, 23662, 50117, 8409, 3388, 30440, 14218, 20149, 31326, -44760, -84681, -145888, -114402, -55123, -71902, -1725, -19365, 82476, 117390, 78870, 43217, 65407, 29787, 25819, -18769, 13426, 30525, 51616, 112950, 110827, 129382, 102819, 29713, 2472, -48973, -25573, -8645, 20546, 78606, 95544, -23616, -75335, -53077, 9106, -3956, -50606, -91780, 22179, 101056, 110926, 61270, -1379, -10036, -5113, -41154, 35614, 5856, 64778, 46676, 4095, -15206, 5170, -28821, -86519, -171377, -83032, 14938, 43136, -108679, -167261, -120904, -8300, 115833, 145387, 170050, 153979, 127889, 70755, 17858, 29803, 18200, -30696, -118390, -138685, -95082, -109203, -108860, -53652, -72155]
24060g2155K402m1107j2571L3993K3833J2065L646j9482r8455N3154J52250p788
24048B9785o0495Q9742l8404j00534Q1543K5022j5346n911j23r019p765r927K818
24035a8614M1116o9903l1963O4631O0797K243o2855j5891J3835n4865L493j5171
24023h3147J9127N7867j9337k7009L2758K5753j5773M1476j4046N6918o2273j1040
24011A274M0809j04763L5799L362m1210O3706p256M381p1828n0960L4547n437
23999i7576j8864P6456K0814k8282j6193l7331J7858J45098M8514m1987o6749
23988A758j34317J7305P6482N9585M4637Q78m3505o5970l7476M5343K9150K4590
23976A8460k6227O5193P5717J2206n8559J5325O9414m8750m1292O68J8568j5866
$$ y = [-72155, -69753, -110860, -123431, -89438, -65605, -53540, -49894, -69376, -167831, -114677, 37573, 29785, -30710, 59032, 20628, -79906, 1637, 26659, 11313, 5402, 5279, -3740, -11505, -21432, -18614, 22502, -47401, -79364, -14733, 46064, 48307, -14548, -30439, -16604, -71469, -67976, -83147, -64020, -6153, -25490, -52499, -19741, 6012, -9761, 31715, 17669, 74587, 12314, 1274, 42083, -62680, -26881, -23519, -64729, -1023, -8279, -3898, -75726, -126686, -92139, -97576, -116440, -39984, -19170, -47452, -63645, -100976, -83118, 61980, 110494, 68507, 1758, -132559, -115254, -38772, 20813, 65450, 66328, 22823, -43147, -80623, -35280, -6130, 18460, -7767, 57426, 133143, 145349, 86790, 102115, 171529, 122779, 81487, 82155, 100723, 84857]
23964H4857j13484L438P9180L4474j9709l6897l2167L2614K6280k8270J9893L4841
23952H5050O0907K7313r1527J5112J5761r1734m6300L471l9752R9717K8113J0119
23940G6250l1874P713p8184l0803J7927k848l4480m4156o996Q6703q2099J140
23928a21707N5275K7849N2464r592O83L5592l8741L9318N204q7909r60j7476k303
23915f2303P2127M1162J0454J7952n8319M5286L392n5951l3330r942K1450L7544
23903B9522j0374q7502j3920M0758j6129J367m7467q2377j3891M7494Q3066L0958
23891c8495p2555j6557P4872P264J4045J552l9590M4089K4631K4907Q086K5069
23879E7318k1990m5067J7084Q062p577J7611k5205J6008m126l6857r0503n0013
$$ y = [84857, -28627, -25189, 53991, 88465, 68756, 31859, -308, 32306, 58586, 30316, 50209, 85050, 145957, 173270, 81743, 96855, 112616, 20882, -25418, -21947, -61699, 38018, 66131, 76250, 44376, 52089, -26095, -56898, -38971, -41819, -76299, -120455, -127451, -40748, -122847, -121707, -66432, -38583, 13881, 4289, 4972, 40564, 1823, 41141, 46345, -41564, -42524, -60000, -62303, 9824, 50986, 61440, 79392, 21073, 66359, 69751, 13800, -19530, -29472, -8022, 29522, 19148, -68354, -82274, -41516, -57645, -56278, -103745, -186122, -200013, -152519, -69453, -38495, -111050, -127607, -52735, -45471, -31426, -29874, -69464, -25375, -744, 24163, 32249, 57318, 35328, -9739, 7345, 15407, 7830, 25441, 236, 16244, 12118, -24739, -115242, -165255]
23867a65255M4181K6919N053L5940M9201P447K9510l8441j1074Q1376L7712R222
23855A11791o3809r2356P5261l6323j11006M3153Q4447k6286k3448J8455n8811
23844g8932Q46J1431l8244J9999L1371K9581l685M3471O1362k7098J3726m110
23832E9718J1398k7994p9030k2855m7545j8337k886J13784K930j31K3498j8553
23820f003o8675M0317L0738L0906p761L3173k4125J14477j1q1860j6504j36707
23808i2035q098J2670J8861M4567n796J4723P096L4196m95n1775j4237o8069n060
23795a13452J2178J1076L8260L9399N7502O0050j3924p3583k3116Q591r022p8609
23783h4650M7110K1484L7771o0718l6542O9238r899J4681M0331l8426J5959L5335
$$ y = [-165255, -121074, -94155, -89102, -53162, -3961, 3486, 32996, -5445, -16519, 64857, 102569, 111791, 47982, -44374, 30887, -5436, -116442, -73289, 11158, -15128, -38576, -20121, -78932, -78086, -66655, -104899, -84900, -53529, -23948, -27633, 15838, 77200, 50102, 63828, 59718, 71116, 43122, -35908, -58763, -106308, -124645, -127531, -13747, -10817, -10948, 12550, -6003, -74678, -34361, -3623, 27283, 19522, 52695, 28570, 143047, 143036, 61176, 44672, -92035, -100133, -87463, -68602, -24035, -29831, -15108, -8012, 26184, 25689, -26086, -40323, -108392, -113452, -101274, -90198, -51938, -12539, 44963, 105013, 91089, 17506, -5610, 2981, -6041, -84650, -37540, -16056, 21715, -39003, -75545, -6307, -16206, -1525, 38806, 380, 16339, 51674]
23771E1674j07971m2226P7580J6737m7318m0880K1364K2796N9800R8775L809P980
23759A22120k7248K924m7189k9987L5296Q508M2156m2204n2564o6092k3503J3250
23747f4533M1014K8763K826J7080l2434k0848k0240L7004M4745K6819l4210j8188
23735G798J1748K0688K0862J0383M1621K4820n9009p1914l7808o3711L7212K7272
23723c0038J9617k6924k1429M527J762N2406J1690M8616K5416l4902Q007q2297
23711b3549m4121K0083Q3762M833J2156M5583k3914j2969M5943L7366K2168N707
23699A73048o6764k8214Q175l8314J324k9176N3245R521j16887K2623l2414K8389
23687a5444Q648K9533n3256k7994J2824J08384P3538m8351q3028o2066N5830o233
$$ y = [51674, -56297, -98523, -20943, -4206, -51524, -92404, -71040, -48244, 11556, 110331, 114140, 122120, 94872, 97796, 50607, 20620, 55916, 64424, 106580, 64376, 11812, -54280, -77783, -64533, -23519, 5244, 8070, 25150, -7284, -28132, -48372, -11368, 33377, 60196, 25986, 7798, 19546, 40234, 61096, 71479, 113100, 137920, 78911, 6997, -30811, -94522, -57310, -30038, -10421, -37345, -58774, -54247, -52485, -79, 11611, 60227, 85643, 50741, 58748, -23549, -67670, -47587, 36175, 41008, 53164, 98747, 74833, 61864, 107807, 145173, 167341, 173048, 106284, 78070, 86245, 47931, 49255, 20079, 73324, 82845, -34042, -11419, -43833, -15444, -6796, 22737, -30519, -58513, -45689, 62695, 136233, 87882, 4854, -57212, -1382, -7615]
23675g615j5884J1483J1497O2509l5307q849m5043J2182P542n1076R285q1323
23663a30599L7631J01205N9506J3459J14734j0705K3684m9863p8620j943j08863
23652c0374o802M361k3473J9039J5315R2063k2476r586J1960m8185r3177j6132
23640a07467L5969O9550M6986L1093q8862M3171p03o0033R116m1337J2312O9760
23628A9555L878m4944j6090M4753M2586l571j0916J4842l9311N9769L0976n5328
23616D6199m7449l1671L3097K9359n776m0085L5480k7549j13033L9410J31433
23605D9415J10639k2711j01924r8165p06Q5863q118J7205K6397O0246p3496j5574
23593B9071j4930n169o2517m7011L6569L9273p713o467l5359O134j8065n345N2641
$$ y = [-7615, -23499, -12016, -519, 61990, 26683, 17834, -27209, -15027, -7485, -58561, -49276, -130599, -92968, 8237, 67743, 81202, 195936, 185231, 208915, 159052, 80432, 78489, -30374, -37176, -32815, -56288, -37249, -21934, 70129, 47653, 38067, 50027, 1842, -91335, -107467, -71498, -1948, 45038, 76131, -12731, 30440, 29737, -30296, -21180, -62517, -50205, 19555, 23433, -21511, -37601, 7152, 49738, 46167, 35251, 50093, 10782, 70551, 101527, 46199, -1250, -32921, 176, 29535, 23759, -16326, 19154, -8395, -121428, -82018, 49415, 160054, 137343, 35419, -62746, -63452, 22411, 14293, 31498, 57895, 118141, 44645, 29071, 14141, 8972, -53545, -100556, -63987, -24714, -32427, -38894, -74253, -68119, -86184, -91529, -38888]
23580c8888J2081J7491m9956o3811J0953J02313K5865K3376m0102l6853k9708
23569f7239K7840J0167j5731M6520K3302P4783O1167j31243m3632Q1763j3625
23558E4072j44195k9096M4147J18390L8452n0482j0813m1338n2362n5888p6466
23547b05579Q829R8081J07395k7364q4430p0190k6420P7483O0228L6106o6973
23536i2834m2366O6337N6588L7054R3719J7304k9454l8127j04551K9493R1588
23525H4751J0564k2208L5154R410k511j14521l0963J5981L027k4840L1500K228
23513b428n1282J0110L5226J9626j6965k0991J4565j9204J1165l6279M0983Q5231
23501F9757K0282J4282r8574j07618L8407o1770m0924P175N5698L5293m1985k0037
$$ y = [-38888, -26807, -9316, -59272, -123083, -112130, -9817, 16048, 39424, -678, -37531, -67239, -39399, -29232, -44963, 1557, 24859, 99642, 160809, 29566, -14066, 67697, 54072, -90123, -119219, -75072, 43318, 81770, 31288, 20475, -20863, -73225, -129113, -205579, -196750, -98669, 8726, -18638, -103068, -173258, -199678, -122195, -61967, -25861, -92834, -135200, -68863, -12275, 24779, 118498, 135802, 106348, 68221, -36330, -6837, 84751, 95315, 73107, 108261, 117671, 115160, 639, -30324, -14343, -11316, -36156, -4656, -2428, -53710, -43600, -8374, 11252, -5713, -26704, -12139, -31343, -20178, -56457, -15474, 69757, 90039, 104321, 5747, -101871, -63464, -125234, -166158, -158983, -103285, -67992, -109977, -130014]
23489a30014P7061O2427r088L6189N3199J5440p9093n7797j616N348m5502R6932
23477B3486K5851J4022M4791l6341p3049q4109n6224l7213O714O4931P004j4637
23465a14774M5290L3399o8886L5345K0447Q1243J6494p4576j8505k0353K471p883
23453g0288o85P9742Q233L1212J4415o3117k893L152j2563j01276o6796J3349
23441a67515O242K9349l8720Q0680Q1663n0153l1516P1686M263J4511R4715O1349
23429A56554k8326j21596k940K0303n0878m3990k1893P8906P0900j4729K3690
23418F6001l9277l1789l589R827M0684n1764j05657J1962K27m0467o5143O0850
23406a48135M9873O8108K0270Q5546O9057J4529n9134n1132p4813p1178M9879
$$ y = [-130014, -52953, 9474, 386, 36575, 89774, 105214, 26121, -31676, -33292, -27944, -73446, 23486, 49337, 63359, 108150, 71809, -1240, -85349, -141573, -178786, -172072, -107141, -100137, -114774, -69484, -36085, -104971, -69626, -49179, 32064, 48558, -26018, -44523, -64876, -62405, -70288, -70973, 8769, 17002, 48214, 62629, -488, -3381, -229, -12792, -114068, -180864, -167515, -161273, -131924, -170644, -89964, -8301, -58454, -89970, -18284, -14021, 490, 95205, 156554, 128228, 6632, 3692, 23995, -26883, -70873, -92766, -13860, 57040, 42311, 66001, 26724, -5065, -8654, 1173, 41857, -9907, -115564, -103602, -103375, -143842, -208985, -148135, -98262, -30154, -9884, 75662, 144719, 159248, 100114, 48982, -25831, -97009, -47130]
23395d7130J13475M5947k1804r3713l5810M9533P2906l0114J2434P8324j03345
23384D0703p379J3954K9979j5008M0971j9590k0318l7593p225J3366M8716N6536
23372A37112k7121l0357P9845O9785o4777j0288m6140p1546n3385k1821k2343
23361f1036k7327j2765O5065J01938L9050J6266j368N5002m3941j29661k9769
23350b8546q552k3418l4182O7895l2195k5583K6870j0205P672L6433k0362l0212
23338g4385O6428J01459m2947o7613K2957R89J2328Q0654k7995Q331j9476k3153
23326C7577M3645q422p2891j8742m8686N3870J09732J7857m0308K4707L8198J8452
23314A54989j036k2393N1743o6567j5943j6138l6857j0600m0765l1750L827Q8138
$$ y = [-47130, 66345, 112292, 90488, -3225, -39035, 10498, 83404, 53290, 65724, 144048, 40703, 33324, 47278, 77257, 62249, 103220, 83630, 63312, 25719, 18494, 31860, 80576, 137112, 109991, 79634, 159479, 229264, 164487, 154199, 108059, 36513, -16872, -38693, -61036, -88363, -101128, -36063, 65875, 104925, 121191, 119823, 174825, 130884, 1223, -28546, -37098, -60516, -94698, -26803, -58998, -84581, -57711, -67916, -60244, -23811, -44173, -74385, -7957, 93502, 50555, -17058, 5899, 6888, 19216, 99870, 71875, 80206, 60730, 37577, 81222, 72800, -91, -18833, -67519, -13649, 96083, 113940, 73632, 98339, 136537, 154989, 153953, 131560, 183303, 116736, 100793, 84655, 47798, 37198, -3567, -35317, -31490, 56648]
23302E6648L1139m0179o5206m0385K9862k07N8509J06351P9774j26639j26819
23291c7152m2137l61L9533J31509n3760K4473O1962l3769p6113q0654P9825J67696
23279A81052k132n6279n6715m5573l9702p287P3640l216P6513J5821n0122M9928
23267A35928p897L678M323J7199j7818K9036j0518m0715K2967K1728l6532n5021
23255F6358n127j9500P320K1588o0313J7050O1118P8169N33K2971K1912J2520
23243B24599o957q1801k4271N2567q0637K4021M9117q633J2096R2001J16802n0645
23231C18259o3167J5445K37875J60991J40759K44838J58553K4019r5636k5711
23221A116225j00356k94585k78138j49452k9149l4278l1675j3919K4129p400o1589
$$ y = [56648, 87787, 47608, -17598, -57983, -28121, -28328, 30181, 136532, 216306, 89667, -37152, -79289, -79650, -40117, 91392, 37632, 62105, 124067, 90298, 14185, -66469, 13356, 181052, 178920, 122641, 65926, 20353, -19349, -26636, 47004, 43788, 120301, 136122, 86000, 135928, 128031, 131709, 136032, 153231, 135413, 164449, 153931, 113216, 136183, 157911, 121379, 66358, 61231, 41731, 49051, 70639, 10326, 27376, 88494, 166663, 167196, 190167, 212079, 224599, 217642, 135841, 111570, 164137, 83500, 107521, 156638, 148005, 160101, 252102, 368904, 318259, 255092, 270537, 508412, 669403, 810162, 1055000, 1213553, 1237572, 1141936, 1116225, 1015869, 721284, 443146, 293694, 264545, 230267, 198592, 184673, 208802, 201402, 139813]
23210A39813n7915J9071J01364o796p4295l6556M956q0629q782M8298O7566o9394
23198D6701j46110k2161K4087P2793O7565J01716J2365k7082O505J186R497n8450
23186H8612n2341k2187k6758O2825L4689k7197l2876K0670J05227L8974K4423
23175B14061p1712r8018o2487O6299R0464L1331j65843J4558J32274k1284m0043
23164H9600R128M9336j4499j9333n0234L3739K0417N35p4465k326Q7943J19004
23152B48845m5734n0352K8068L9928K1009k1303k5325j49755m3853n902k9589
23141c3963N3805Q803J9453N6532N0209r2128L246N523J6543q663m7105j9649
23129A2606p997m6377Q1370K3257n0077N384l009j6031p56J13582L024k58k2218
$$ y = [139813, 81898, 100969, 202333, 195537, 121242, 84686, 89642, 9013, 231, 48529, 116095, 46701, -99409, -121570, -97483, -24690, 42875, 144591, 156956, 129874, 136379, 137565, 147062, 88612, 36271, 14084, -12674, 50151, 84840, 57643, 24767, 45437, 150664, 189638, 214061, 142349, 44331, -18156, 48143, 138607, 169938, 4095, 18653, 150927, 129643, 89600, 98728, 148064, 133565, 114232, 63998, 97737, 118154, 118689, 44224, 41898, 129841, 248845, 203111, 152759, 180827, 220755, 241764, 220461, 195136, 45381, 1528, -4374, -33963, 19842, 28645, 48098, 104630, 154839, 62711, 65957, 71480, 88023, 79360, 32255, 12606, 4609, -41768, 39602, 62859, 12782, 18166, 15157, -874, -1630, 111952, 114976, 114718, 92500]
23116I2500l8963j0325K8064N601m7095J2782M0314P6802q957j6758K3186k1540
23104A35611J1323j2402l2715L1392o5494p3258j0148J04162J08975k9200l9886
23093A28360M9969K9044r8687k6571J0313j2462L1461o517K1193m36L7476l6151
23081A26992o3361J931j1744J6198n6386m5192k381P547J6207J26461N7584k0781
23069A53075l2776M7689n671m1076K6404j9220l7794N9566l4125K448L7023L6153
23057A91696J8505j4419m0840R3013L1486k2772n9963m3645K8803k2373n0399
23046A09092n1304o3808j09978o7162L4411J57712J8941n0973K9024K8087L2994
23035F7036m789N9249M1290J388j0510j34436R63O9804P7155j3716m0699l6709
$$ y = [92500, 53537, 43212, 71276, 76877, 29782, 42564, 82878, 159680, 150723, 133965, 157151, 135611, 146934, 134532, 101817, 133209, 67715, -5543, -15691, 88471, 197446, 168246, 128360, 178329, 207373, 108686, 82115, 92428, 79966, 111427, 104910, 126103, 125667, 163143, 126992, 63631, 65562, 53818, 70016, 13630, -31562, -33943, -26396, -10189, 116272, 173856, 153075, 120299, 167988, 162317, 121241, 147645, 128425, 90631, 150197, 116072, 118520, 155543, 191696, 210201, 195782, 154942, 247955, 279441, 256669, 196706, 153061, 181864, 159491, 109092, 57788, -6020, -115998, -183160, -148749, 8963, 27904, -23069, 5955, 34042, 67036, 62247, 121496, 162786, 164174, 153664, 19228, 20191, 89995, 167150, 153434, 112735, 76026]
23023G6026l7023p592P1444J09730J5033q2033o041J2883l3445N2442Q6731l5849
23011B22306J1828k7388l9195k1150j06571j1014L9532P433l4971j06027l9480
23000a04697L6658J00719P4021J6134P3098M5105p2464o9386L9189l550j06052
22989B8775J3420l4423o7556J01773J691L8805o0315P0542j3947p0K0923Q381
22977A07999k741o5982j8276J04396P1525K5065M9971k7261J0233j09876k2865
22966A22188l1339Q6601M7571l4521j3664R510j8008j114j0951K9242k5892j3091
22954A46532l4351k6572M2514R944k8884M2882l0938n9091M0531k6118q644M9078
22942A16883Q1852L2769L243p2283j19642j1033J7501O1724L6971O7375J4963
$$ y = [76026, 39003, 31411, 102855, 212585, 227618, 145585, 139544, 152427, 118982, 171424, 258155, 222306, 234134, 206746, 167551, 146401, 39830, 28816, 68348, 75781, 40810, -65217, -104697, -68039, 32680, 106701, 122835, 195933, 241038, 168574, 99188, 138377, 134827, 28775, 42195, 7772, -59784, 41989, 43680, 82485, 22170, 92712, 78765, 78695, 99618, 107999, 105258, 39276, 21000, 125396, 196921, 221986, 271957, 244696, 254929, 145053, 122188, 90849, 177450, 225021, 190500, 176836, 186346, 168338, 167224, 156273, 185515, 159623, 146532, 112181, 85609, 128123, 138067, 109183, 152065, 121127, 62036, 102567, 76449, 67805, 116883, 198735, 231504, 234747, 162464, 42822, 31789, 49290, 111014, 147985, 215360, 230323]
22931B30323L3875k0468k0103J1709J9007J03926l0034j10537l7967N1360k5060
22920B06031k1135n3165M8850K0699l0006Q2816N4705q799r0552m5685Q375l1557
22908A40577j6056J5563J6335J5617M9567j495K9866q997j529J0162R715L738
22896B63063p7682O0557k5874j65786n9367P1151Q2441n8153n6800R8527J8995
22885A51072o9032J07226P7510J7917q6752l9324O1091l8774r0176O6835K6713
22874A84306p2753r0038N1964R0859O0292k0840n6257K8099q2918R069Q4696J1125
22862A97604M2430p353q301J2053q9027k2394K6232L4901p486j9142k1667J2329
22850A50179J21323K2366q2082q6410M36n1335j01622K7972L672Q84J9912N4030
$$ y = [230323, 264198, 243730, 223627, 235336, 254343, 358269, 328235, 217698, 179731, 231091, 206031, 184896, 131731, 180581, 201280, 171274, 254090, 308795, 299996, 209444, 163759, 172134, 140577, 124521, 140084, 156419, 172036, 221603, 220108, 249974, 240977, 239448, 249610, 259325, 263063, 185381, 245938, 220064, 54278, -5089, 66062, 148503, 90350, 33550, 132077, 151072, 82040, 189266, 266776, 284693, 197941, 158617, 219708, 180934, 90758, 157593, 184306, 111553, 21515, 73479, 164338, 224630, 203790, 147533, 175632, 92714, 101783, 186479, 197604, 240034, 232681, 224380, 236433, 147406, 125012, 151244, 186145, 178659, 159517, 137850, 150179, 271502, 293868, 211786, 125376, 125812, 74477, -27145, 827, 4499, 5383, 25295, 79325]
22838G9325L0725L2009l4981l4080P8639N9634R877J9909M7409l3680p4738k4161
22826A55887J4901J4127j3840m2796L6608N4256K6358J9167k1741k6689L1859
22815B48097R3801O3541J22940O6068p7093K4245K5872J07943M8024m2768k9906
22804F50764L9259m5041p3528q4459j19746j03967j0540m6995q7071N3112o960
22793A64828J8733O1852L4750j0772O7251L2793k2216M1984p4707p4123P923L1349
22781B79645J9349K1525R1435l3596n4684p0363P1042J40580J3377n7002m5624
22770C75684o782k9780O103K9188N118P8445K0155J3168L4890M7601l842O6504
22758F36452J04510K5761N5624J32680K07282L36900L33404J56419J0887l6978
$$ y = [79325, 110050, 142059, 107078, 72998, 151637, 211271, 221148, 241057, 288466, 254786, 180048, 155887, 170788, 184915, 171075, 128279, 164887, 219143, 245501, 264668, 242927, 216238, 248097, 341898, 405439, 528379, 594447, 517354, 541599, 567471, 675414, 723438, 680670, 650764, 690023, 644982, 571454, 486995, 367249, 263282, 252742, 205747, 118676, 171788, 164828, 183561, 245413, 280163, 269391, 336642, 369435, 347219, 389203, 314496, 240373, 248296, 279645, 298994, 320519, 411954, 378358, 323674, 253311, 324353, 464933, 478310, 421308, 375684, 368902, 339122, 345225, 374413, 379531, 457976, 478131, 491299, 526189, 573790, 569948, 636452, 740962, 766723, 822347, 955027, 1162309, 1499209, 1832613, 1989032, 1999919, 1962941]
22748A962941j18341j87940k95152k05115j87425j93963k5146p8178m8124J7235
22738F40792L4232J39385K24521J08723K6882K6323k6364p9552j32673r8206k7060
22727H37003j2944R329J44494J65294J24706K08696J53027J74749K6434j8162
22717A812626J5229r7711j49204o5212j40167j31078N2602K69723J64925L82188
22707B113921L67200L31193K86574J90446R5664Q9197J25256J12319J10785L33331
22697D155886N00211O18809O89430P68944Q52146J025118J159687J420056J945639
22688A3135926K488567L233779M134696N133198O295784P844327J0239811J4141177
22680F6647265K1017988L1933398M2854015M5259429L1541473N715603j0401571
$$ y = [1962941, 1844600, 1656660, 1361508, 1156393, 968968, 775005, 749859, 671681, 623557, 640792, 675024, 814409, 1038930, 1147653, 1174535, 1200858, 1174494, 1094942, 962269, 864063, 837003, 824059, 833388, 977882, 1143176, 1267882, 1476578, 1629605, 1804354, 1830788, 1812626, 1827855, 1730144, 1580940, 1515728, 1375561, 1244483, 1297085, 1566808, 1731733, 2113921, 2481121, 2812314, 3098888, 3289334, 3384998, 3474195, 3599451, 3711770, 3822555, 4155886, 4656097, 5274906, 5964336, 6733280, 7585426, 8610544, 9770231, 11190287, 13135926, 15624493, 18858272, 22992968, 28126166, 34421950, 42266277, 52506088, 66647265, 87665253, 119598651, 162452666, 207712095, 239253568, 244969171, 234567600]
22673B34567600j5567503l2903596n2432198m7967598k9675008j6694426j0105122
22666B9222149o734760m863668l542488k623473k002811j495194j156460r73009
22658E830286q04118o95102n10686l55754j94779j44491k07127k15117k91543
22649B411569k07419k36754k99922k86229k16089m9331J74045K69398K07544J17740
22639A884552k6884r3167k23017l35085k37639k49920r4221l2945N3456O3403
22629G08533K90533M76031M07547L14024J38904j12033l06899m03233m53619l38638
22619G21150l48779k36726O12o3246n4997J4777R6817J74000R7731k1456J350
22608C81233J3755O6172k5760l5404L1866P4521J81527K38322K44893K00040N2549
$$ y = [234567600, 219000097, 186096501, 133664303, 85696705, 56021697, 39327271, 29222149, 22487389, 17623721, 14081233, 11457760, 9454949, 7959755, 6803295, 5830286, 5026168, 4331066, 3820380, 3464626, 3269847, 3125356, 2918229, 2703112, 2411569, 2204150, 1967396, 1667474, 1381245, 1165156, 1115825, 1289870, 1559268, 1766812, 1884552, 1857668, 1764501, 1541484, 1206399, 968760, 718840, 624619, 591674, 645130, 708533, 999066, 1475097, 1882644, 2196668, 2335572, 2223539, 1916640, 1513407, 1059788, 721150, 372371, 135645, 136257, 73011, 18014, 32791, 129608, 303608, 401339, 379883, 381233, 394988, 461160, 435400, 399996, 431862, 506383, 687910, 926232, 1171125, 1371165, 1423714]
22597A423714n1392m5736j05159k75594l25751l20139r1474p0292R188r585k1094
22586A16686p148j821n7169R1227R6882j3713p3695p3112n1184R001L1167k2311
22574D4810q554l5822Q1086N2462k6202R328M2651n3831N2000k763J1601o0215
22562A06551o1427k6597N3407O7904L676L6330Q0328M376o1086N167L4814m5433
22550A98010r3156r8855q0009r4791l7083P7044o946j39346o9594L4078K2036
22539b88612J6034j7171M1357N5515O3797K2955M5600L8377L1472J1192J728n9692
22527c7448q9682p3970j9755K7691M0384n8361o0836J28732J37854q763k5652
22516c9806J7837N9081M6430N6400l2066j14137l3362N342p4272N7717m1353Q9615
$$ y = [1423714, 1372322, 1326586, 1221427, 945833, 620082, 299943, 208469, 138177, 147365, 137780, 116686, 109538, 107717, 50548, 141775, 238657, 224944, 151249, 78137, 26953, 35954, 67121, 44810, 36256, 434, 81520, 133982, 107780, 117108, 159759, 105928, 157928, 155165, 166766, 106551, 45124, 18527, 71934, 139838, 143514, 179844, 260172, 264548, 203462, 208629, 243443, 198010, 104854, 5999, -74010, -168801, -205884, -128840, -135786, -275132, -344726, -310648, -288612, -272578, -289749, -248392, -192877, -129080, -106125, -60525, -22148, 9324, 20516, 22244, -37448, -127130, -201100, -220855, -193164, -152780, -211141, -271977, -143245, -5391, -14154, -39806, -21969, 37112, 83542, 139942, 107876, -6261, -39623, -34281, -108553, -50836, -92189, -2574]
22504b574L6006l3332R2246k5766j0478l8454r8132N0618M4070m6660p0355M5070
22492e7741J59018Q9066P8022p9752j10461j56976L0745m4226j07867R351K3248
22481a67573l999j7406J7470N2786L3023M8305j02176k1486O8263J085k9835o7684
22469a89227j55697j50876N5569M4315J17679J14014P2535K6016n4438M7320l0671
22458a03461J4247q321n0420o5329J5185k71o5037k187O8041K4920O3331m4591
22446a53893l9919K7262P1625K3679m2209K3049R649M7294m7834j09275j4951
22435b05523N6527m5241q2363O0276J04004R9919o2560o1474L3175M588l6495
22424a35167L6325N0544j0567l6507k2339k7610P0940N0046p278Q791K7378K8731
$$ y = [-2574, 33432, 100, 92346, 66580, 56102, 17648, -80484, -29866, 14204, -32456, -102811, -57741, 101277, 190343, 268365, 188613, 78152, -78824, -48079, -92305, -200172, -190821, -167573, -171572, -188978, -171508, -118722, -85699, -37394, -139570, -161056, -92793, -91708, -121543, -189227, -344924, -495800, -440231, -395916, -278237, -164223, -91688, -65672, -120110, -72790, -103461, -89214, -97535, -147955, -213284, -198099, -198370, -263407, -265594, -197553, -172633, -109302, -153893, -193812, -166550, -94925, -71246, -113455, -90406, -80757, -33463, -81297, -190572, -205523, -148996, -194237, -276600, -216324, -112320, -12401, -74961, -136435, -103260, -98672, -135167, -98842, -48298, -58865, -95372, -117711, -145321, -74381, -24335, -31613, -22822, 4556, 33287]
22412C3287K2682K2865o3280r6086K6981Q5546O2839k6016q8729n5166o0013K2073
22400a13017R6154P7903o6329k6070l4320n3185j2914m2101K6747N4032j4266
22389a07366k185K4082j5534n6923M8945Q8987N3010n6081j8269k4096K2155l2774
22377g6049L6453N5074j5972o23N140p0648l2562M3912K483o5382O705L8118j7458
22364i0809j9829l5989N1394J033q8157N8679k9762J69J22866O5445m4593n4224
22352f3777j34750N347Q7559k7880k0252K2895J21338N8024R3293m771n6061n3846
22340B7119P081K3423J1475J3428M674m8810n1975l8825l1605J5762M099o950
22328g1104K2540j7955K0018N536k6217l8056j0761L5313L9825l9766P4010O8408
$$ y = [33287, 55969, 78834, 15554, -80532, -53551, 31995, 94834, 68818, -19911, -75077, -135090, -113017, -16863, 61040, -5289, -31359, -65679, -118864, -131778, -173879, -147132, -93100, -107366, -109551, -85469, -101003, -157926, -108981, -19994, 33016, -23065, -41334, -65430, -43275, -76049, -39596, 15478, -494, -1117, 4023, -66625, -99187, -55275, -52792, -118174, -111469, -73351, -90809, -110638, -146627, -95233, -94200, -182357, -123678, -153440, -153271, -30405, 35040, -9553, -63777, -198527, -193180, -105621, -133501, -153753, -130858, -9520, 48504, 141797, 137026, 80965, 27119, 34200, 57623, 69098, 82526, 87200, 38390, -13585, -52410, -84015, -68253, -64154, -71104, -48564, -66519, -46501, -40965, -67182, -105238, -115999, -80686, -40861, -80627, -6617, 61791]
22316F1791j7892K1105L5567o0675J3785J7553J1988m8943N4537l0124O9124j3950
22304A13866o1580k6993J8222j8651k0084N8664J089o4344j087O9886n022m4807
22292A9159m209J0828p0510O683n647q5763l254M6239P3256M2327o9047k4806
22280f4744P987o2989J9068j10l6074M2333M0130p8429Q2672J12837K5233p4733
22268A3181p9211k6799P7008L9085n7234P960O7240Q2162P965j2408K079j6557
22256A04471J976m7242r4575K0840L7573k2487p9720k2080J9096k1914L4303K9290
22244d0469L25j5392M8820K2234O960k9222j3767m4484n469J8638p4280O018Q4518
22231c5570P8357M9109L3035l1397p4306j1587l6134l9556M9388j6585N0479K9431
$$ y = [61791, 43899, 65004, 100571, 39896, 53681, 71234, 83222, 34279, 88816, 58692, 127816, 113866, 52286, 25293, 43515, 24864, 4780, 63444, 64533, 189, -898, 68988, 63966, 19159, 14950, 25778, -44732, -38049, -43696, -129459, -132713, -86474, -13218, 29109, -39938, -64744, -56757, -119746, -100678, -100788, -136862, -94529, -54399, -132828, -50156, 62681, 87914, 13181, -66030, -92829, -15821, 23264, -33970, -26010, 41230, 123392, 131357, 118949, 121028, 104471, 106447, 59205, -35370, -14530, 23043, 556, -79164, -101244, -82148, -104062, -69759, -40469, -40144, -55536, -6716, 15518, 22478, -6744, -20511, -64995, -70464, -51826, -126106, -120088, -35570, 42787, 91896, 124931, 93534, 19228, 7641, -28493, -68049, -18661, -35246, 15233, 44664]
22219D4664j35815o2291N3625O8746P3466m9998p1531J4333N906Q0800N8729m7073
22207C3561M9464n8229m7314J4314o4518m1415M0639L8429K0493N907M3463J1436
22195D6230r6027M4924L9374j0236M4640k9338k313m8301m1510n6410k9839J11347
22183b7459K6133k1560p2983K1192n1840J2541N660M9040l2909P876J6146N5715
22171a2448n2501r8701J1889O6750N2674k7735j9576k1349M3911M4565o0007J902
22159g0626O4522J659M0412J5023p2529n1765P1442J23035k0362J0687p3625m4611
22147f738M5045K4750j9577j8571L823k3314L6213J3741n2806o1578L6213J1489
22135a1310n2129O0195M3442k5672K3756j7865M3334K1404J05034N1643J7945
$$ y = [44664, -91151, -153442, -99817, -31071, 42395, -7603, -79134, -64801, -58895, 21905, 80634, 33561, 83025, 24796, -22518, -8204, -72722, -114137, -73498, -35069, -14576, -8669, 34794, 46230, -49797, -4873, 34501, 24265, 68905, 39567, 37254, -11047, -52557, -108967, -138806, -27459, -1326, -22886, -95869, -74677, -126517, -113976, -108316, -59276, -92185, -84309, -68163, -12448, -64949, -163650, -151761, -85011, -32337, -60072, -79648, -100997, -57086, -12521, -72528, -70626, -6104, -4445, 35967, 50990, -21539, -73304, -1862, 121173, 100811, 111498, 37873, -6738, 38307, 63057, 43480, 24909, 28732, 5418, 41631, 55372, 2566, -59012, -22799, -11310, -63439, -3244, 40198, 14526, 38282, 20417, 63751, 85155, 190189, 241832, 259777]
22124B59777k4209Q6788J33268K01101J72318J06055J45306J16734N2668m5832
22114A203974j58888k50778k91607j93896m2995L540l1019o7545j00851l8694
22104C1241J9149L459r7091j46782M5057L3418j2588L3512j7550K3905K1912o113
22092f8471J3213M2832l7556n6398q347N2525O8945K7394n2942o7653R381N2534
22080b4543M4439N6041m5704K738N99J7365Q2648O1910P32p9028l0184m4506l7477
22067E030K5350p4447m4981L6864k159L4847l8552m4996J3210J0049l0752J099
22055a09438K4588M8633p2013k8213o237J6361P1563K0547l2895k751M0580O2153
22043C2878m4033n9725q806M1532j8170M5785l3204m0448K2118J06077L1926m1733
$$ y = [259777, 235568, 322356, 455624, 656725, 829043, 935098, 1080404, 1197138, 1249806, 1203974, 1045086, 794308, 502701, 308805, 265810, 269350, 238331, 170786, 69935, 31241, 50390, 53849, -43242, -190024, -144967, -111549, -124137, -90625, -108175, -84270, -62358, -68471, -55258, -12426, -49982, -106380, -114727, -62202, 6743, 34137, -18805, -86458, -77077, -24543, 19896, 75937, 30233, 32971, 33570, 50935, 133583, 195493, 196225, 117197, 87013, 42507, 5030, 30380, -44067, -89048, -52184, -54343, -19496, -58048, -103044, -89834, -79785, -110537, -109438, -84850, -36217, -108230, -136443, -142680, -126319, -54756, -34209, -67104, -69855, -29275, 32878, -11155, -70880, -79686, -38154, -56324, -10539, -43743, -84191, -62073, 44004, 75930, 34197]
22031C4197q6707o3004L549N5571J4841P0214K7201P2464R0781k1882j94554q0415
22019g7744O2093O0188r6942r4730k1690K7999L3372L6456n699L4326J9423M162
22007a8786K6310j77J6364l3279K8490L884n4147M2709o5625l875K0384K3336
21995a4412o015J2087R447m819N1339k5963J15425L6103o5680j6138l4195o629
21983E0550N857K407J0023M3058L3588l0218j11247l1284R990r262O006m0248
21971f0780l2092j1769k138P11K9480j1899O4023M6704p6250K934J14712J8943
21959H2579j4488l1541l1918n2566J07305P7632K318J2113o6614n7357l5793K2460
21947A4130k3039o646l118l7797l0124k8885o3311Q5635K0416k6153J7946l5415
$$ y = [34197, -52510, -115514, -111965, -56394, -41553, 28661, 55862, 128326, 219107, 197225, 2671, -77744, -15651, 44537, -52405, -147135, -168825, -140826, -107454, -70998, -76697, -42371, -22948, -18786, 7524, 7347, 23711, -9568, 18922, 22806, -31341, 11368, -54257, -58132, -37748, -14412, -20427, -8340, 1107, -3712, 47627, 21664, 137089, 173192, 107512, 91374, 57179, 50550, 56407, 58814, 68837, 111895, 145483, 115265, 4018, -27266, -17276, -26538, -20532, -60780, -92872, -104641, -106779, -106068, -76588, -88487, -24464, 22240, -54010, -51076, 63636, 82579, 68091, 36550, 4632, -47934, 59371, 137003, 139321, 151434, 84820, 27463, -8330, 14130, -8909, -15555, -18673, -56470, -86594, -115479, -178790, -93155, -72739, -98892, -80946, -116361]
21935a16361l2720k7091N1653J24567j3715M3048J02724J8997j2999K2654j4377
21924A46380K4165p5090p8470l4237J2323N1649O4758R1009k9284j86605j38138
21913a51540P2326l2075m6403N2289J9960l9904J6684m1579R6378L2017o4973
21902h6820o1480M1710L7278J3911J8941J8177J0105P6225J8919m1100l2193l8542
21890b4869K1149K0620k8523j25879k6891L9683J26287k3444n9260n9697M0109
21879a00715k6642P2042M9147k2856m6405q4850l579J42215N7962n0300K54J15391
21867A01664L8334p3450j8028K5149O7416n1438q6250j10803m021J0992L6632
21856f3803M1911O8991j1364r6454q9365o5263N2936J9934J01920O0461p8460
$$ y = [-116361, -149081, -176172, -124519, 48, -13667, 29381, 132105, 151102, 138103, 160757, 146380, 170545, 95455, 16985, -17252, -4929, 46720, 111478, 202487, 173203, -13402, -151540, -79214, -111289, -157692, -105403, -85443, -125347, -108663, -150242, -53864, -21847, -86820, -148300, -106590, -69312, -55401, -36460, -18283, -8178, 68047, 86966, 45866, 13673, -24869, -3720, 16900, -11623, -137502, -164393, -124710, 1577, -21867, -81127, -140824, -100715, -127357, -55315, -6168, -29024, -75429, -160279, -163858, -21643, 36319, -13981, -13727, 101664, 139998, 66548, 48520, 73669, 141085, 89647, 3397, -107406, -111427, -100435, -63803, -21892, 47099, 35735, -60719, -150084, -215347, -162411, -142477, -40557, 19904, -58556]
21845e8556J2776K8123K8262p393n2469K9108L7866J7377L5810k3532K6067m5978
21833B7461j12659n5644L5550O5353J5836N985m6668m2661O302J2609K1491K0464
21821d6581j10340p597J08916L996p9582R333P6848m3108N3039O2678M921r107
21809B3416K9103n9569o8399O3912L9296P8382J1311o9044q0144o7378N3742L6593
21797h779K2255J5607j02509m8873L6531N5170m8109k1374O7801R8737o3795r2164
21785h9502J01974L0964N514j19982N4877N1798j9133K1711O7803M4501M2049
21774A92574K9007m8460j04814M2897m751l7290l5458r2602n0729K2839P2715
21763a4072O5105k5660n9972k9928K5639J2797L69k0153l8516N5061J7470r2951
$$ y = [-58556, -45780, -17657, 10605, 3212, -49257, -20149, 17717, 35094, 70904, 47372, 73439, 27461, -85198, -140842, -105292, -39939, -24103, -18118, -64786, -107447, -101145, -88536, -67045, -46581, -156921, -164518, -55602, -51606, -131188, -121855, -45007, -88115, -35076, 27602, 32523, 23416, 52519, -7050, -75449, -11537, 27759, 106141, 117452, 48408, -31736, -99114, -45372, -8779, 13476, 29083, -73426, -122299, -85768, -30598, -78707, -100081, -32280, 66457, 2662, -89502, 12472, 43436, 48950, -71032, -16155, 35643, 16510, 38221, 106024, 150525, 192574, 221581, 173121, 68307, 111204, 106453, 69163, 33705, -58897, -109626, -86787, -14072, 51033, 25373, -34599, -64527, -38888, -26091, -25722, -45875, -84391, -29330, -11860, -104811]
21751a04811k1815L3447R7418l1151m6548L5532M4338P472k5793P941R0859M0764
21739A27653q9994j08338M7454L2409l6702j9838M1961K050j1590j7415N1039
21728A8689J03438m4297n8237k6208O9029M3893O1895L9784k0913n5171o5831
21717F6071m0928m9141L5703n5780j2171m5894K5013M148M5193j7699Q6314j6815
21705B4014r3030l4545M3164N1111J7895J0016n1306n8321O8388J02831M4276
21694A24493l4218l3512l4621o5660r399Q5669J7082N0936k606k4958o3688n5103
21682d5585n1960P1484M4439O2988l0504k5704l0452J8728l9034p2522R001j627
21670i0748L1008r113j1041m162N5905Q4771M052L2616J4131m2200j2556R9754
$$ y = [-104811, -126626, -93179, 4239, -26912, -73460, -37928, 6410, 13882, -11911, -3970, 86889, 127653, 37659, -70679, -23225, 9184, -27518, -47356, -5395, -3345, -14935, -32350, 18689, 122127, 77830, 19593, -6615, 62414, 106307, 168202, 207986, 187073, 131902, 66071, 25143, -23998, 11705, -44075, -56246, -102140, -77127, -72979, -27786, -45485, 40829, 24014, -69016, -103561, -60397, -9286, 8609, 18625, -32681, -91002, -22614, 80217, 124493, 90275, 56763, 22142, -43518, -52917, 32752, 49834, 100770, 98164, 73206, 9518, -45585, -97545, -26061, 18378, 81366, 50862, 25158, -5294, 13434, -25600, -98122, -89121, -90748, -59740, -68853, -79894, -84056, -28151, 56620, 60672, 93288, 107419, 65219, 52663, 152417]
21658A52417l8968j54113p4020J7639J33447J32952M9889n5312m1000m1018l8031
21647D3882L082l2421j03328j2003J8452n468j9301m9630N2488M9890J0947o1371
21635a04781N0305J8392j5151j6712l1418p507M1844L8177q0637j6764L2154N8807
21623c3291Q023K3578j8979n4285P8905M0182j1115l020L1202k3333K8507j17199
21611e0825q1744p333O9298N6004R514l0874k9875P2802O0305j8012j21990q650
21599h1380K2894M3480J7935K9770j0960K8888O949J5622n469j8837n6421K5156
21587A7627l4589j08703K9144N5141R5569j0209k3796j3415n6714M2366J8185
21576A0606M9261O1033j1387n52M0234K1548n0265r5042k4747j61l0500l5972
$$ y = [152417, 113449, -40664, -114684, -97045, 36402, 169354, 219243, 163931, 122931, 81913, 43882, 46964, 14543, -88785, -100788, -82336, -87804, -107105, -156735, -104247, -54357, -43410, -104781, -54476, -36084, -51235, -67947, -99365, -106872, -65028, -26851, -107488, -124252, -92098, -33291, -25268, -1690, -20669, -74954, 3951, 44133, 33018, 29998, 61200, 37867, 66374, -50825, -132569, -139902, -70604, -14600, -5086, -35960, -65835, 6967, 67272, 49260, -72730, -81380, -58486, -15006, 2929, 32699, 21739, 50627, 57576, 73198, 67729, 48892, -7529, 17627, -16962, -125665, -96521, -41380, 54189, 43980, 20184, 6769, -49945, -7579, 10606, 59867, 120900, 109513, 108961, 149195, 170743, 120478, 25436, 689, 528, -29972, -65944]
21564f5944L4758O8764q5308j1020R6810J0317N828K6364j1615R057j965k4162
21552E1884M3290n4054k3129K3427Q745m8224m11Q6485J1181j5890m3813k0459
21540A9032K3876M6134m9277k0681L2386M0131p7845o3110j1802j3901J27309
21529E2252L7572J6168O642q7039n9194O4972K8975o9901m3334q064N093K9644
21517b6214M5939m316Q892q676M7123K0061R7201o5290P245P2014Q431k3658k5980
21504A52772o7696P968M1091J8687j7623n9210J4486k192K8876j23840o682K0473
21492G110j1801R761q013l1402o4735m7186P849M3168K3286k340L3675N7109l1690
21479a5209J5294L5319k2095O8630J5794K0615l0485o8088n4373j8071L3285M5495
$$ y = [-65944, -31186, 37578, -47730, -58750, 38060, 48377, 54205, 80569, 68954, 78011, 76046, 51884, 95174, 41120, 17991, 41418, 50163, 1939, 1528, 88013, 99194, 83304, 39491, 19032, 42908, 89042, 39765, 19084, 51470, 91601, 13756, -49354, -61156, -75057, 52252, 89824, 105992, 112634, 25595, -33599, 31373, 60348, -9553, -52887, -60951, -55858, -26214, 19725, 15409, 24301, 15625, 62748, 82809, 180010, 114720, 121965, 193979, 202410, 178752, 152772, 85076, 93044, 134135, 152822, 135199, 75989, 90475, 88283, 117159, -6681, -13363, 7110, -4691, 5070, -2943, -34345, -99080, -146266, -138417, -95249, -71963, -74303, -40628, 16481, -15209, 85, 35404, 13309, 81939, 97733, 118348, 87863, 19775, -34598, -52669, -19384, 26111]
21467B6111K1569m4617L5929Q4733q2688j35665L684Q4563k5455M8219o6932q617
21455e9166O9154K3493K5144K5301J288l5585l9938p818p014m3043k7391J879
21443g3696J7802N1938N4364j0995R696L7848J7189j22273p6422k1371M9460Q6192
21431A9732Q4940j0645n315m7183k7055R3023K754R272n7418k7773p2610k0518
21419e8796Q3650J01548R0N890l0889p9496j9094j2661k1389J154j32572m2493
21407b05058O4674J26739P3908m1004R862n1516l7248L8224J05320J1489O6018
21396A61408O913m8708l8649p8403q132K6073P7926K8861J9605m9106j92K7858
21384A25454q406j647o9651n2493R811M2259k0223P4394P2365p2430q8882O7399
$$ y = [26111, 47680, 3063, 38992, 123725, 41037, -94628, -90944, -6381, -31836, 16383, -50549, -59166, 9988, 33481, 58625, 83926, 85214, 49629, 9691, 1873, -5141, -48184, -75575, -73696, -55894, -3956, 50408, 39413, 49109, 86957, 104146, -18127, -94549, -115920, -66460, 19732, 104672, 94027, 88712, 41529, 14474, 107497, 110251, 119523, 62105, 34332, -38278, -58796, 24854, 126402, 126492, 132382, 101493, 21997, 2903, -9758, -31147, -29993, -162565, -205058, -140384, -13645, 60263, 19259, 29121, -22395, -59643, -21419, 83901, 95390, 161408, 168321, 119613, 80964, 2561, -5571, 20502, 98428, 127289, 146894, 97788, 97596, 125454, 117048, 115401, 45750, -6743, 3068, 45327, 25104, 99498, 171863, 99433, 10551, 77950]
21372G7950P252m1214J3572Q9637m3531j29116p9671O8472R9790M778n7638m1160
21360c0879K0008j2486k9109M6377j926k1870Q2906l0982p026L5863K4607N238
21348H0721j262Q2714l886J5866P0214J2011K2215j06419p2672k345O1433R7797
21336B56387K7268j9822P381M9571M3290L6608k7958o2548P4073l9907o0633N6810
21324C40520M9312Q7377Q0814M2422P8630O0899L1802q8086j61344q3715Q256
21313D46887j6893J2959j1900l7595L9143p0395j30614o7915k732N5467j50j07747
21301A08515n0887J9688L9389j0408J6038j35802j8770J17318J00317M8569n5140
21290A78827l4033m9254q6069M9537M7594N6422J8321p1749n7660K2413K5652
$$ y = [77950, 85202, 43988, 57560, 147197, 103666, -25450, -105121, -36649, 63141, 67919, 10281, -30879, -10871, -23357, -52466, -6089, -8015, -29885, 53021, 22039, 15013, 50876, 75483, 80721, 79459, 162173, 158287, 174153, 244367, 256378, 278593, 172174, 99502, 97157, 158590, 256387, 283655, 263833, 271214, 320785, 364075, 400683, 372725, 310177, 384250, 344343, 283710, 340520, 389832, 477209, 558023, 600445, 679075, 739974, 771776, 683690, 522346, 438631, 446887, 429994, 442953, 431053, 393458, 432601, 362206, 231592, 163677, 160945, 216412, 216262, 108515, 57628, 77316, 116705, 106297, 122335, -13467, -32237, 85081, 185398, 233967, 178827, 144794, 95540, 9471, 59008, 106602, 163024, 181345, 109596, 51936, 74349, 100001]
21279A00001K918n4780p1436k3821J32863Q7700p3165M5630R4258Q90p1446l0723
21267A38889K4301O5550J4144o0351r7945p9144N2470J17527j3618l2024K3641
21256A53440m5806m9865l2427L6970P1305L8455k9022m8391n6993k4163O0296
21245G3799R4101l5879n0901k2705n4913l402M8799K9572j6726j9710M9411o126
21233H5320j2021M4911M1320J17730R0699K21906J11967R6098P9370p0380j96501
21222F10419j64260r6190j9078p4617j6391J6655K4808Q1515J09556J25410L1030
21211F28857R4708J37173Q7420j0018j17368k22542p2477K8646m9050j18966q119
21200C78264M6237K1631P0950J72758P9633J04649L7939j71572k38470j55710
$$ y = [100001, 102919, 48139, -23297, -47118, 85745, 173445, 100280, 145910, 240168, 241058, 169612, 138889, 163190, 228740, 242884, 182533, 84588, 5444, 57914, 175441, 161823, 129799, 153440, 107634, 57769, 25342, 62312, 133617, 172072, 143050, 94659, 37666, 13503, 73799, 167900, 132021, 81120, 58415, 3502, 100, 48899, 78471, 61745, 42035, 91446, 85320, 73299, 118210, 159530, 277260, 367959, 589865, 701832, 797930, 877300, 806920, 610419, 446159, 349969, 330891, 256274, 239883, 256538, 281346, 362861, 472417, 597827, 628857, 723565, 860738, 948158, 938140, 820772, 598230, 525753, 554399, 505349, 386383, 378264, 424501, 446132, 517082, 689840, 769473, 874122, 912061, 740489, 502019, 346309]
21190C46309r6611j4503M0088L6966j2365k9620K2727J39889Q9111m472Q3771
21179F01290J59935J42824r3950k13991k19777o0922N7485l4407q5645m7977j0529
21168A94336k3306L1976m3927J6830J0311m0586K4343J6455k1646O91k1793K9459
21156A73143r306N5564k6591j6256K6752L0344l587m6672n6680j337J07513N6110
21144B88997l2128P087M534q1472n1823O6364L7292j2581n6897n5452J3314j2209
21132A15026l2871q08M2243J74022k2212j08548j7940K7378L1972m4521n1902
21121A11839l329m019p4464m4949L5443O0412j14006n4565Q3613k472O0128J11776
21109A65407l8284o2743J7403P1113M8177L9211l0908K7674j11084j13262K808
$$ y = [346309, 249698, 235195, 275283, 312249, 299884, 270264, 292991, 432880, 521991, 517519, 601290, 761225, 904049, 810099, 596108, 376331, 315409, 372894, 338487, 252842, 204865, 194336, 171030, 203006, 159079, 175909, 186220, 145634, 169977, 186432, 164786, 165477, 143684, 173143, 163837, 219401, 192810, 176554, 203306, 233650, 230063, 183391, 126711, 125374, 232887, 288997, 256869, 263956, 268490, 187018, 135195, 201559, 238851, 226270, 169373, 113921, 127235, 115026, 82155, 81347, 123590, 297612, 275400, 166852, 148912, 176290, 208262, 163741, 111839, 108510, 104491, 30027, -14922, 20521, 80933, -33073, -87638, -4025, -6497, 53631, 165407, 127123, 64380, 81783, 152896, 201073, 240284, 209376, 237050, 125966, 12704, 15512]
21098A5512O5260J0969N1145J9145k2245m9224K7625j20568q9608R3498K07077
21087B08586M0226n3672J681Q453J2768j5156L141m0188J2960J890j4795L2085
21075A97979K7400M5136N0758n1085j40934k778k2950K1802M006P081J712J4900
21063A53027l2332o7406M7975K2045P6016K0086r1573o8946j5293R5657J7924
21052A57180l0400K4586K0881N7924O2273P042M4547K4266j9384o0151q8700J8269
21040B18333J6492J3118O026J8483N2820j9958j6182n8250k9093k014J7060N788
21028B22623o2992r8958k7492N6479M6499Q9501K9036P8505l6981j00171j3121
21017A82928O5617J39044n208p9649r543m744k3390l6694l6501m5588l1627N3576
$$ y = [15512, 80772, 91741, 142886, 162031, 139786, 90562, 118187, -2381, -91989, 1509, 208586, 248812, 195140, 196821, 205274, 218042, 202886, 206027, 165839, 178799, 180689, 165894, 197979, 225379, 270515, 321273, 270188, 129254, 126476, 103526, 125328, 129334, 136415, 138127, 153027, 120695, 53289, 101264, 123309, 199325, 219411, 127838, 58892, 43599, 139256, 157180, 126780, 151366, 172247, 230171, 292444, 299486, 344033, 368299, 348915, 288764, 200064, 218333, 234825, 247943, 253969, 272452, 325272, 305314, 289132, 230882, 201789, 199775, 216835, 222623, 159631, 60673, 33181, 89660, 136159, 225660, 254696, 333201, 296220, 196049, 182928, 248545, 387589, 382381, 302732, 293189, 288445, 265055, 228361, 191860, 146272, 114645, 168221]
21005A68221P0068J1325j6893J2793K1868J5484J6607k4487j02554n8473k6513
20994H7446P3574Q9473r199M2547j4770j6560J01246J50197M3043O1673n9384
20983E49286j30907q431j2007Q6573K5101P0140n4049k59L6790k2832J5229j4646
20971E39988o2239Q067K2502m7444J23542P6200K6632p6248j31928K4042K3918
20960E27032p0373j03512O3766N6644M5266M7477N9548l6731j57555k8111j0313
20949C93138o604n5758l792J48935R2445l8963k4994J4553Q757Q7106q75P0786
20937F84734N0005K0520j9053P642m7713M5736M2265M6109m4406m1472M2651k2209
20925G64809o9206K9336p622j13736r1354J007P9001j7221p8764m2958j4873N3849
$$ y = [168221, 238289, 249614, 232721, 245514, 267382, 282866, 299473, 274986, 172432, 113959, 87446, 161020, 250493, 241294, 283841, 269071, 252511, 353757, 503954, 546997, 608670, 549286, 418379, 409948, 397941, 484514, 509615, 579755, 525706, 525447, 562237, 539405, 554634, 539988, 477749, 485816, 508318, 460874, 584416, 660616, 687248, 611000, 479072, 503114, 527032, 456659, 353147, 416913, 473557, 518823, 566300, 625848, 589117, 431562, 403451, 393138, 386534, 330776, 326984, 475919, 568364, 529401, 504407, 518960, 527717, 614823, 613948, 684734, 734739, 755259, 736206, 743848, 696135, 741871, 784136, 830245, 785839, 744367, 787018, 764809, 695603, 724939, 717317, 603581, 512227, 513234, 592235, 575014, 496250, 453292, 438419, 492268]
20913D92268l2751m7451l4654L1102J1668L4677N7437Q4965l1742n3895L7103
20902E48727Q9252j0140j02579r61L2104R3175K5143m0807q576k2849J3294l8264
20890E77519j744M9396M0270k549n9734n1510K6220Q1275L8899Q8209j0272l759
20878G72220P4916J9817m3733n3380P0946J6120o4547J2635l5549j5906J30026
20867H83565J24740J16257M0989m5197j9236q0093M808K6439l3253J44450Q7201
20856A250670K6331M2890L9024O566M0327N9412N0128J03933P7810N2830J29250
20845A879171J01242J01624J53733J41874L23532M78493M55888M50820L78386
20836D464763K76324J97060K36159K08508M23644O22185R41984J332124J580214
$$ y = [492268, 459517, 412066, 377412, 408514, 420182, 454859, 512296, 597261, 565519, 511624, 548727, 637979, 627839, 525260, 524299, 556403, 649578, 674721, 633914, 625338, 602489, 615783, 577519, 575775, 625171, 665441, 662892, 603158, 551648, 577868, 659143, 698042, 786251, 775979, 772220, 847136, 866953, 823220, 769840, 840786, 856906, 792359, 804994, 769445, 753539, 883565, 1008305, 1124562, 1165551, 1120354, 1101118, 1021025, 1025833, 1052272, 1019019, 1163469, 1250670, 1277001, 1319891, 1358915, 1365481, 1405808, 1465220, 1515348, 1619281, 1697091, 1749921, 1879171, 1980413, 2082037, 2235770, 2377644, 2701176, 3179669, 3635557, 4086377, 4464763, 4741087, 4938147, 5174306, 5382814, 5806458, 6428643, 7370627, 8702751, 10282965]
20827A0282965J759721K043304K452681L179680M442465O568121R263433J0996126
20819E0988496J0139843N777064J302993J077450Q0024m819272o033393j44537
20811E8368668P653377J4878285J8996138J6939702P414523k308155m312903o900247
20803A10729388j6571932k1052373j4227043m819486K594039O654468O567896
20796F9874957J593797m187075m436721n126109j0591545j3523130j0097985o026008
20788A7480181l596024k364497j671599j310026j037659p87348o07710m86337
20780E618981m61001l72479k57942l11171k57201l85489l04570k55155l28429
20771B685544k60587k94219l03361k48221j46925j5243N6240o663p8971p393l425
$$ y = [10282965, 12042686, 14085990, 16538671, 19718351, 24160816, 30728937, 39992370, 50988496, 61128339, 66905403, 68208396, 69285846, 69365870, 64546598, 58513205, 58368668, 66022045, 80900330, 99896468, 116836170, 124250693, 121942538, 117629635, 110729388, 94157456, 73105083, 58878040, 54058554, 56652593, 63307061, 69874957, 71468754, 67281679, 62844958, 57718849, 47127304, 33604174, 23506189, 17480181, 13884157, 11519660, 9848061, 8538035, 7500376, 6713028, 6105318, 5618981, 5157980, 4785501, 4527559, 4216388, 3959187, 3573698, 3269128, 3013973, 2685544, 2424957, 2130738, 1827377, 1579156, 1432231, 1416988, 1473228, 1466565, 1387594, 1380201, 1376776]
20760A376776k4971j08826q7941j11277k4539K3993J5969N629K9888n468N5593
20749A144826J21886M0236J8292l5681k8488n8638q9094o8775j15685o2847j52308
20738G13724j51635q096Q4976J3510J14194J33541O8018L8683p2342o8776r8630
20727G67167l5959r1154p3848j6641J16846K12289J94572J99355Q9434j6785p7315
20716A267961j32007r5851j25370L923M8668M1367J29965R4015J03002J01658
20706A437331J03162O5403k1426j2245m0282p3940l7572q6540j1633J21070Q7390
20695A530718J55554J24304K27106K78914K96709J02560l456j0073N4169L9019
20685B795524r8285j7607l908K49472O11933P49726P38755M97703P4248J13004
$$ y = [1376776, 1351805, 1242979, 1155038, 1043761, 1019222, 1043215, 1059184, 1064813, 1094701, 1089233, 1144826, 1266712, 1306948, 1325240, 1289559, 1261071, 1202433, 1113339, 1044564, 928879, 866032, 713724, 562089, 553993, 638969, 652479, 766673, 900214, 968232, 1006915, 934573, 865797, 767167, 731208, 640054, 566206, 549565, 666411, 878700, 1073272, 1272627, 1362061, 1345276, 1267961, 1135954, 1040103, 914733, 918656, 967324, 1008691, 1138656, 1232671, 1335673, 1437331, 1540493, 1605896, 1584470, 1572225, 1531943, 1458003, 1420431, 1333891, 1322258, 1443328, 1530718, 1686272, 1810576, 2037682, 2316596, 2613305, 2715865, 2712409, 2702336, 2756505, 2795524, 2697239, 2679632, 2675724, 2925196, 3537129, 4286855, 5025610, 5523313, 5597561, 5710565]
20675E710565K40979K31546J48164J71008L33694L03111K53862K53827L44375
20666G991131N12451P19710Q54219J061249J428607J818211K295510K883562L678925
20657B3243575M582107N484710O640281Q022937J0264081J4215536K0909766L1329068
20649A24692061M6091895N7434102M8064520J0754986n0347992p4011990n3679176
20642A08998406l1972893j9015304j1942488p993570n751464m304462l140477
20635B4877748k073019j234504p39739l09376K02738R17609J656884K643708L751640
20626B9693689M784680N776998P198686Q893078J1404238J5652379K2556021L3990036
20618A39949805M9700727N7654568M1940824m167617o3934365p3339840m9236424
$$ y = [5710565, 5951544, 6183090, 6331254, 6502262, 6835956, 7139067, 7392929, 7646756, 7991131, 8503582, 9223292, 10077511, 11138760, 12567367, 14385578, 16681088, 19564650, 23243575, 27825682, 33310392, 39950673, 47973610, 58237691, 72453227, 93362993, 124692061, 170783956, 228218058, 276282578, 287037564, 236689572, 162677582, 108998406, 77025513, 58010209, 46067721, 38074151, 32322687, 28018225, 24877748, 22804729, 21570225, 20830486, 20521110, 20723848, 21641457, 23298341, 25942049, 29693689, 34478369, 40255367, 47454053, 56347131, 67751369, 83403748, 105959769, 139949805, 189650532, 247305100, 289245924, 285078307, 221143942, 147804102, 98567678]
20611I8567678k9293809j8017448j1777114q228928n958390m421046l325302k555396
20603A4990245j857256j453362j259606j123572q06681o35225l84143k43578p3130
20594G153692n5997p6625n6047k35414m65889o47300o82067n85654l21014j4257
20584D013428J54282L12836J14074k27333m82236n13798n53219n30063m07557
20575A880414l17470k35900j05101J7652Q8950R1397R6375R5024n61o4128o2313
20564A484339j36633p6154r7120n2770r5983j37983r2541j7360K3324J08681P6901
20553I86701L1058L0232P5794O8225n0616J9483n5941o1045j26664j24560k7195
20542G65472j9503R01P2504J00207O0420j9753j25150j6253r702K9530j5345q971
$$ y = [98567678, 69273869, 51256421, 39479307, 31250379, 25291989, 20870943, 17545641, 14990245, 13132989, 11679627, 10420021, 9296449, 8489768, 7854543, 7470400, 7226822, 7153692, 7097695, 7021070, 6965023, 6729609, 6263720, 5616420, 4934353, 4348699, 4027685, 4013428, 4167710, 4480546, 4594620, 4367287, 3885051, 3371253, 2818034, 2287971, 1880414, 1562944, 1327044, 1221943, 1239595, 1328545, 1419942, 1516317, 1611341, 1610780, 1546652, 1484339, 1347706, 1271552, 1174432, 1121662, 1025679, 887696, 795155, 777795, 801119, 909800, 986701, 1017759, 1047991, 1123785, 1192010, 1141394, 1160877, 1104936, 1043891, 917227, 792667, 765472, 745969, 746870, 819374, 919581, 980001, 960248, 835098, 818845, 809143, 838673, 823328, 814357]
20530H14357j3358M8143Q4271J3824L7038k4029J03256l3139q0365j04989r9168
20519G45841l2752q350m7686l4597m0607N0879J09317p520P5556K2692o4075k6265
20507G42433J01680J09019J22941M6793L3771P8026L0481n4619k7331J61236J64711
20496A509141K44340K64504J5399Q0884J18786J46369J32446P6155R0342J27019
20486B805385K35331L80859N57451N94302O13151P21584J019332J167008J457254
20477I551657K063131K949805M270969O480155Q784921Q950604N342452l111496
20469D5282198q197605m793046o697M333107Q401960J0006030Q135577J318208
20461F4479732l548968k807546n400775j0702191q949454l903392K87194L903987
$$ y = [814357, 800999, 849142, 933413, 947237, 984275, 960246, 1063502, 1030363, 949998, 845009, 745841, 713089, 704739, 657053, 622456, 581849, 632728, 742045, 734525, 810081, 832773, 768698, 742433, 844113, 953132, 1076073, 1122866, 1156637, 1234663, 1265144, 1210525, 1183194, 1344430, 1509141, 1753481, 2017985, 2033384, 2114268, 2233054, 2379423, 2511869, 2588024, 2678366, 2805385, 3040716, 3421575, 3979026, 4573328, 5186479, 5908063, 6927395, 8094403, 9551657, 11614788, 14564593, 18835562, 25315717, 34100638, 43051242, 48393694, 45282198, 37084593, 32291547, 32284850, 36617957, 45019917, 55025947, 63161524, 64479732, 60930764, 58123218, 52722443, 42020252, 33070798, 29167406, 29454600, 33358587]
20453C3358587N907390M198366k260706j0354304r933720n880596l394721k208548
20445I431748j441239r32906o18399m18879m05615j94875p1638M118J13398L35986
20435E801699M66679M47809L76338N22044P54112J144460J486454J876654K612775
20426A5489024L822233N848696Q499558R753517P353690k41261q310492o705580
20418C5509385j312482L319193P474581R899380R076820L738796k675015k898626
20410F2132032l911134j0380784j1112798n752095q45864L167640N770056N126665
20402D4193718J26588q890289j1579421p654445m410067k784991j859060j278640
20394E863393r25862p40434l98719j91485j11854j92619l58878m35179l32924
$$ y = [33358587, 39265977, 43464343, 41203637, 30849333, 20915613, 15035017, 11640296, 9431748, 7990509, 7057603, 6439204, 6020325, 5614710, 5419835, 5348197, 5352315, 5465713, 5801699, 6268378, 6716187, 7092525, 7614569, 8368681, 9513141, 10999595, 12876249, 15489024, 19311257, 25159953, 33659511, 43413028, 50766718, 50525457, 42214965, 35509385, 34196903, 37516096, 44990677, 54890057, 63966877, 67705673, 65030658, 62132032, 58220898, 47840114, 36727316, 30975221, 30129357, 33296997, 39067053, 44193718, 44320306, 35430017, 23850596, 16196151, 11786084, 9001093, 7142033, 5863393, 4937531, 4197097, 3798378, 3606893, 3495039, 3302420, 2943542, 2508363, 2175439]
20385B175439k78155k20017j38486j30677p3985Q5797O8363o097l8644r3893p9250
20374A270395k46181j57207j62251k7539M7678j7284J28672l5020l9590j04456
20364F57217r2473j5921j6306r6613n8479j2891j6160M6116M0845K587m2995L5392
20352D30319P0126n4582k0020j12867l5149J568k3937m0368k4381j9765l366m8279
20340A19299N3848J15002L8824j5025j35134j07056p8460m9336o45O8613l9842
20329b9912j95Q0503m1107l3836J1832J04296J15762j252o6743K0441m3902k7263
20317H8624P7245k7027j2214N0762k5632j5283k3769J8416k8682J7424J05600
20306B25464J82973O5375L6336p1284o0695L4172R9467J44521Q337p2013L9019
$$ y = [2175439, 1897284, 1677267, 1538781, 1408104, 1334119, 1419916, 1488279, 1482182, 1443538, 1349645, 1270395, 1024214, 867007, 704756, 677217, 724895, 707611, 836283, 801263, 761673, 657217, 564744, 548823, 532517, 435904, 377425, 364534, 348374, 394490, 435335, 437922, 394927, 430319, 500445, 445863, 425843, 312976, 277827, 279395, 255458, 215090, 190709, 170944, 167578, 119299, 173147, 288149, 326973, 311948, 176814, 69758, -8702, -58038, -58683, 9930, -29912, -30107, 50396, 9289, -24547, -12715, 91581, 207343, 206091, 139348, 159789, 115887, 88624, 165869, 138842, 126628, 177390, 151758, 136475, 112706, 131122, 102440, 119864, 225464, 408437, 473812, 510148, 438864, 378169, 412341, 511808, 656329, 664666, 592653, 631672]
20295F31672p3522j17282K3419k230k3463R6092Q0526M7969j10687l1221L9105
20284E60378j19402j42528n6941R4189J1224k5230k8178N7253p0105o6815Q247
20273B22092p4578j14457j27774O5709O2311m48l3410L8441j3561j4764O399R62
20261A6922k0818k2522L5265l1978j4458O4597L8265J6877o2700m5746p4650K1029
20249g9917J7700l8500P7879l4436L4745l6584K6174M391j9025j3410K3192O0449
20237B2658J04089l1753m4854L051k2360o3478J560j3347o4404L3518L1356j151
20225d5115p9441l3491O9793P1920j3408j28050j02052L2602K3236J6338k1783
20214b09451O9199J14285n027p2240L0459K3520N1576N454K5322r4746q8054n7773
$$ y = [631672, 558150, 440868, 464287, 462057, 438594, 534686, 615212, 663181, 552494, 521273, 560378, 440976, 298448, 241507, 335696, 346920, 321690, 293512, 350765, 280660, 213845, 222092, 147514, 33057, -94717, -29008, 33303, 32855, -555, 37886, 24325, 9561, 15960, 16922, -3896, -26418, 8847, -23131, -37589, 27008, 65273, 82150, 19450, -26296, -100946, -79917, -62217, -100717, -22838, -57274, -22529, -59113, -32939, -28548, -47573, -60983, -37791, 22658, 126747, 94994, 50140, 53191, 30831, -32647, -31087, -44434, -108838, -75320, -43964, -45115, -124556, -158047, -88254, -16334, -29742, -157792, -259844, -227242, -204006, -187668, -209451, -140252, -25967, -30994, -103234, -72775, -49255, 2321, 7775, 33097, -61649, -149703, -207476]
20202b07476r3651P6674P3740m8892l4908N328j9191L3541M3823R3690k1455l3082
20190a31859Q753m1894M8330P4125J45365k2194j30695r6749J8406P0616K81P8709
20178B1194Q5929m0814j9186k315k5788P7791p225p7227K826l2077N5457m6315
20166g750o714K1913K780M7357R4985J599m5506q5362M6167J1350l8599j70332
20154a28112K2360M4798J5009O9445N1209J9975q5104p1181j4052n9680O1675
20143g3658L8986L8805l543O9463n2722k1696K1981k4938m4140K4276j9550j5069
20131f1805j826n5309k7829K527J4724m902L6807J08255K3693j8872p563J03624
20119A11524L6138l4650o1063m630L1623l7239j10581M1450O7390n3286J4652
$$ y = [-207476, -301127, -224453, -150713, -199605, -234513, -229185, -248376, -214835, -171012, -77322, -98777, -131859, -123106, -165000, -116670, -42545, 102820, 80626, -50069, -146818, -128412, -57796, -57515, 21194, 107123, 66309, 47123, 44808, 19020, 96811, 89586, 12359, 15185, -16892, 38565, -7750, -14464, 7449, 10229, 57586, 152571, 154170, 108664, 23302, 69469, 80819, 42220, -128112, -105752, -60954, -45945, 23500, 74709, 94684, 9580, -61601, -75653, -135333, -73658, -34672, 4133, 590, 70053, 17331, -4365, 17616, -7322, -51462, -27186, -46736, -61805, -63631, -118940, -146769, -144242, -129518, -134420, -97613, 10642, 34335, 15463, 7900, 111524, 147662, 113012, 51949, 47319, 78942, 41703, -68878, -27428, 39962, -13324, 1328]
20108A328n41k1453n1013M3560R523R6956J17534N4945p6618n7407q0110L6724
20096G3428L7526l0404k1831l9341M6134l9586n5219J9809J9323K4917j8070n754
20084A0932O2673J209L117O9469J51888J20991J19734J57273O1739M5920k03073
20073F01872k60699j38095j0093P0283n2155k6607P4816K7068m8234P3276J22412
20062D33844J49662J24248M4759n4319j34551j64130r9887q1502l9857o3591L1633
20051A46309J9710J29788J05631J05203R3654J30348K6287j72368k73888r0894
20041B19780m9511J1535L1608k8710L1423M5365J1162Q7123M6926O9937J72889
20030F49527J91899O8712j02475k01753j61027k16851j65105j619K7196R053Q340
$$ y = [1328, 787, -20666, -71679, -28119, -18596, 78360, 195894, 250839, 174221, 116814, 36704, 73428, 110954, 80550, 58719, 19378, 65512, 25926, -29293, -9484, 9839, 34756, 16686, 10932, 73605, 74814, 77931, 147400, 299288, 420279, 540013, 697286, 759025, 804945, 601872, 341173, 203078, 192985, 263268, 211113, 184506, 259322, 286390, 238156, 311432, 433844, 583506, 707754, 752513, 698194, 563643, 399513, 299626, 218124, 178267, 114676, 146309, 166019, 295807, 401438, 506641, 600295, 730643, 756930, 584562, 310674, 219780, 170269, 181804, 213412, 184702, 216125, 261490, 272652, 359775, 406701, 476638, 649527, 841426, 910138, 807663, 605910, 444883, 228032, 62927, 61308, 88504, 97557, 105897]
20019A05897o0797m1774n0136n7393L9089O0240o631K5256l8290n2557L3639J3790
20007b9667R1450L6069Q553m142n07j16927n0398j4457J8877P2346n7362m751
19995e0916p6408p3676Q1571J42668O5452j5301q7238k8162l1151K4269k7321
19984g6213m4088n0342L3778N9463P0031l9701M905L6417l3029k4963l8021O6277
19972c5486m108J1955L3558J9378M7623L0553J483n4999k9548Q4425J01773P089
19960B13696K649j04486j07855L2473K027L4289O2890Q1699J1565m149M6496L6078
19948C07372j26103r2098R5735J37325J05419k7846k9112N047q5412j22935K732
19937A70124K0278M0284N1240l2760o1073l3139m1161l1299j11266j5682k3764
$$ y = [105897, 45100, 3326, -46810, -104203, -65114, -4874, -11505, 13751, -24539, -77096, -43457, -29667, 61783, 97852, 106405, 102263, 101756, -15171, -65569, -80026, -61149, 11197, -46165, -50916, -127324, -201000, -119429, 23239, 88691, 73390, -13848, -42010, -73161, -48892, -76213, -120301, -170643, -136865, -77402, -7371, -47072, -42167, -5750, -38779, -63742, -101763, -35486, -39594, -27639, 5919, 25297, 72920, 103473, 104956, 49957, 20409, 104834, 206607, 213696, 216345, 111859, 4004, 36477, 38504, 72793, 135683, 217382, 228947, 224798, 271294, 307372, 181269, 89171, 184906, 322231, 427650, 399804, 370692, 375739, 290327, 167392, 170124, 190402, 230686, 281926, 249166, 188093, 154954, 113793, 82494, -28772, -44454, -68218]
19926f8218m4827j0823M6410l073K0293J11546M3829k7620R110r021m8042M115
19914B3679K3869N1330p9412j4537K4158K4180K4549O650N6516o3023L3671P2246
19902A83876L7432j07274l2067J225P4742M1321l6397M1123J18507K5583r4898
19891B53173J4304k2267o8196L1376M4336j2738Q653n2955l2790K6758J4895r6135
19879A08414J1012Q8203m6690m8805k2142P5926J04663K3894n0450j6107j07043
19868A20875Q026M1089P7259n062K9956j1550n0286p2400n1385K4976O095J9099
19856A36692Q4190l707n6629o9287p4805j20056M648K7965J4342L0582M8529q237
19844A4227j1718K9283N7000N629j9123k8352K073j547J6308K5550O1809P7447
$$ y = [-68218, -113045, -123868, -77458, -80531, -60238, 51308, 95137, 67517, 76627, 67606, 19564, 23679, 47548, 98878, 19466, 4929, 29087, 53267, 77816, 84466, 140982, 77959, 111630, 183876, 221308, 114034, 81967, 83192, 157934, 199255, 162858, 203981, 322488, 348071, 253173, 267477, 245210, 177014, 208390, 252726, 239988, 248641, 195686, 162896, 189654, 204549, 108414, 119426, 207629, 160939, 112134, 89992, 165918, 270581, 294475, 244025, 227918, 120875, 128901, 169990, 247249, 242187, 272143, 260593, 210307, 137907, 86522, 111498, 117593, 136692, 220882, 217175, 160546, 91259, 16454, -103602, -98954, -70989, -56647, -26065, 22464, 14227, 2509, 31792, 88792, 94421, 75298, 46946, 49019, 47472, 63780, 89330, 151139, 228586]
19832B28586l8059r0979O19K8751K2184P4614L948l515J9587r334J1056M9740
19820B97198P20K519R1481L5159k2488J1052j34451j04925n5912l0504l8010L0242
19808H2081J12794Q9575n5693r8890K181m4949p6612l574M7014K612k2398o5040
19796c0899k5826N4320j8345k4210K772j0898M3779K9029j1451L8183k0893p5607
19784e0046l3868M1624l5212k901q784O603k8055l8428K6114Q2158j302o8681
19772a10778r1798R115R2485o8126K9261P7105m8634K6541p365J514j3275m0980
19760a44935j4100j1849J33404R0238J5233k5099n0017o490M0179M079k1244j20
19748I279Q7947j8817j04632m2471n5716n8161J2918J5546R1599M7334m0937J4867
$$ y = [228586, 190527, 99548, 100167, 128918, 151102, 225716, 229664, 226149, 245736, 236402, 247458, 297198, 297918, 300437, 391918, 427077, 404589, 415641, 281190, 176265, 120353, 89849, 51839, 82081, 194875, 284450, 228757, 129867, 132048, 87099, 10487, 6913, 53927, 56539, 34141, -30899, -56725, -2405, -20750, -44960, -42188, -53086, -9307, 19722, 8271, 46454, 25561, -50046, -83914, -42290, -77502, -80403, -89187, -82584, -110639, -149067, -122953, -40795, -42097, -110778, -202576, -193461, -100976, -169102, -139841, -62736, -111370, -84829, -92194, -90680, -103955, -144935, -159035, -170884, -37480, 52758, 67991, 42892, -7125, -13615, 26564, 30643, 9399, 9279, 97226, 78409, -26223, -68694, -124410, -182571, -169653, -154107, -62508, -15174, -56111, -41244]
19736d1244N9003J1626J5660K1169N5913k1154k110q002j0267q1915j8705m955
19724b4981K7885j05803N0131L9853O5097l978m273n793k0446k604M803n9059
19712c9168L815k9470P0995J07724Q459q6172p4719L5812K2707j7427Q359M3995
19700E4910J3432q6153l8136M6233l239P844O6332j400q7271L5068N7738J3488
19688G8846n6565L6104k680J2110o260q4442j24062L4326N7977o1110L4708j2919
19676i3967m504J2056l452P2070N4098j6987M4726j5240R078J936J5046p02O035
19663H0193K7928N8491l5385j34934p0893Q734M675q564N2117J0998r1774O9667
19651b8747R0752L3951p8240o0528l4378m6458P6952J4301J8104o7045n7666N5904
$$ y = [-41244, 17759, 29385, 45045, 66214, 122127, 100973, 98863, 90861, 80594, -1321, -20026, -24981, 2904, -102899, -52768, -12915, 52182, 48204, 43931, 38138, 17692, 15088, 19891, -39168, -35353, -64823, 6172, 113896, 122355, 36183, -38536, -2724, 19983, 2556, 10915, 54910, 68342, -17811, -55947, -9714, -12953, -5109, 61223, 59823, -27448, 7620, 65358, 78846, 22281, 58385, 55705, 67815, 61555, -22887, -146949, -112623, -54646, -115756, -81048, -93967, -98471, -86415, -89867, -17797, 36301, 19314, 64040, 48800, 57878, 59814, 74860, 74158, 80193, 108121, 166612, 131227, -3707, -74600, -65866, -61191, -69755, -17638, -6640, -98414, -28747, 62005, 95956, 17716, -42812, -77190, -123648, -46696, -32395, -14291, -81336, -139002, -83098]
19639h3098L8381M1763J7367r9466q6012k5398Q4937J05217Q2333O2244k6268
19628A12000o3378L2462Q3932l4869o141J7604p9080j2831J1340M5718M0398q0335
19616F6820r2861j8072L1156L7831J18739k1981R352j516n2551N696q0162R818
19604A2269P6276p5541m6910M5840m5919m1216l5412Q490J19913N2821j5774J0007
19592F4844K2501j37972p1436M2335R2646j421k1156L9016n8785M7202J44132
19581A61906q0982j59549k8354O0892O2860Q9896Q5143j00182m1022Q3992J5P291
19569A41906n153L266K5097j2004l3499K2751J4796n3206o5282R1709J1384p9157
19557F2608j30034j02286O7935M4420M5127L7759k457J2580k909m0119K650P1706
$$ y = [-83098, -44717, -2954, 14413, -85053, -171065, -196463, -111526, -6309, 76024, 138268, 112000, 48622, 81084, 165016, 130147, 124006, 141610, 62530, 49699, 61039, 106757, 147155, 66820, -26041, -44113, -12957, 24874, 143613, 121632, 130984, 129468, 76917, 82613, 2451, 12269, 88545, 13004, -33906, 11934, -33985, -75201, -110613, -102123, 17790, 70611, 54837, 64844, 87345, -50627, -122063, -79728, 12918, 11497, -9659, 29357, -29428, 17774, 161906, 80924, -78625, -106979, -46087, 16773, 106669, 191812, 91630, 50608, 134600, 134615, 141906, 136753, 140019, 165116, 153112, 119613, 142364, 157160, 103954, 38672, 130381, 141765, 62608, -67426, -169712, -101777, -57357, -12230, 25529, 23072, 35652, 32743, -7376, -4726, 66980]
19545F6980J3493p930J492j5917k7269L5558J02012P24p4245m0359R6084Q3878
19533B34501J426p4485P0431Q9952J43236N9654l9569L1425M5025o8628m7181
19522D45787m726o1461Q7657J26927J82335O5276L8419N6061k2314j55296r1312
19511F67353q5512l2240L6254n9068k709P1489j1273m7403n7819K4077R167l3860
19499D78456r1705n0314K6922j6163q2641l4843j9490P0524K6897J0747O0962
19488C79352q1257n4478m7162q275o5239r4571j909o231l2010K1818J30482P6476
19476B16996k7196q4902n6219l2364Q930L9492j3989j9772n8315K8214n6087k6551
19464h1763R0417J7423l8725L2730J9351N7022r8772q2239Q7700J9916K2188O8248
$$ y = [66980, 80473, 72543, 74035, 58118, 30849, 66407, 168419, 169143, 94898, 54539, 150623, 234501, 235927, 161442, 231873, 321825, 465061, 524715, 485146, 516571, 561596, 492968, 445787, 441061, 379600, 467257, 594184, 776519, 841795, 880214, 936275, 913961, 758665, 667353, 581841, 549601, 585855, 526787, 524078, 595567, 584294, 536891, 479072, 503149, 512316, 478456, 386751, 336437, 363359, 347196, 264555, 229712, 210222, 280746, 307643, 318390, 379352, 298095, 243617, 196455, 188180, 122941, 28370, 26461, 20230, -11780, 10038, 140520, 216996, 189800, 104898, 48679, 16315, 25245, 64737, 50748, 30976, -27339, 875, -55212, -81763, 8654, 26077, -12648, 20082, 39433, 96455, -2317, -84556, 3144, 23060, 45248, 113496]
19452A13496M2894j2410N9216M0305l1968n6452O1197N0606Q330L3505j509n7804
19440B49406L8585l5250J8539M4922l7082j2117m2824M567P160K3583l2172m853
19428B22464o7893M4973K9034J0860M0846N1373l6186n408N1683K5367k9957O655
19416C43811k0336J4595K6298M8529l3842k64K5812q4643o6775P4002P0697N1954
19404D49838m611k836O146L8436J27495l2128K7263J22389Q5124r4051n6271O3830
19392G30624R1506Q9490J18883J24788J17318J35758J25317J67392K10940J48386
19382B060402J56668J81564K62151L21035M01830M56996N22849N73639O06840
19373E543974Q58235J051038J401551J842844K583775L917613N805256P684037
$$ y = [113496, 156390, 143980, 203196, 243501, 211533, 155081, 216278, 266884, 275214, 308719, 307210, 249406, 287991, 252741, 271280, 316202, 279120, 267003, 224179, 228746, 235906, 259489, 227317, 222464, 154571, 199544, 228578, 239438, 280284, 331657, 295471, 290063, 341746, 367113, 337156, 343811, 323475, 338070, 364368, 412897, 379055, 378791, 404603, 319960, 253185, 327187, 397884, 449838, 445227, 442391, 448537, 486973, 614468, 582340, 609603, 731992, 817116, 723065, 666794, 730624, 822130, 911620, 1030503, 1155291, 1272609, 1408367, 1533684, 1701076, 1912016, 2060402, 2217070, 2398634, 2660785, 2981820, 3383650, 3840646, 4363495, 4937134, 5543974, 6402209, 7453247, 8854798, 10697642, 13281417, 17199030, 23004286, 30688323]
19365C0688323P971155M727187j638127n753902m304226k34581M006873P678137
19357D3140839R619507Q511018L231471k413418o114372r386539r858382o200538
19349C0529586j577609K263435M613266M260979j15685o642688r321182p148155
19341A6861947m257475k392618j573987j173246o60569m79874l00461j91363m2052
19332E790302K11698K07420K08011J99233K65021L76754O70022R40023J182621
19323A0051105J292786J824736K681896L983232O047753Q461228R743609P530642
19315E1616987P90436o058250o730915k331788K859602P453517J0644483J0836960
19307F9081032O542076j56785n271860r960483j2529929r471095m008087Q32467
$$ y = [30688323, 38659478, 43386665, 41748538, 35994636, 31690410, 31455829, 35462702, 43140839, 52760346, 61271364, 64502835, 62089417, 55975045, 46588506, 36730124, 30529586, 28951977, 31215412, 35828678, 40089657, 39973972, 33331284, 24010102, 16861947, 12604472, 10211854, 8637867, 7464621, 6804052, 6324178, 6023717, 5832354, 5790302, 6002000, 6209420, 6417431, 6616664, 6881685, 7258439, 7928461, 8868484, 10051105, 11343891, 13168627, 15850523, 19833755, 25881508, 34342736, 44086345, 51616987, 52407423, 46349173, 39618258, 37286470, 40146072, 47599589, 58244072, 69081032, 75623108, 75466323, 70194463, 60233980, 47704051, 38232956, 34224869, 35057336]
19299C5057336M462310N270206J905750n166608j0647586r699821o072916l673333
19291A1435338k403567j644968j142691q11025o75020n33564l00155k40048l22180
19282C362120k64543k05485k26949k67400l22978k39955j85019o7128p4184o042
19272A502437j6019r8163o9033j07555j21345j15563n4855Q04J0985N022P8702
19261A015417j8883J0330L6357R872n2961o7171q4711r1698r822q2245r9083m784
19249E60618p0909o0829m5124k4122n5811k3968M2333Q6994K9898Q7993q1700
19238D45373J6391m5109l2165j4677l4273l0776q5442M3241P4679m8333J6904
19227C05813j0026j01394j4592J5763m6911M2274N257n5209L3108k1053o6817
$$ y = [35057336, 39519646, 44789852, 46695602, 41528994, 30881408, 21181587, 15108671, 11435338, 9031771, 7386803, 6244112, 5433087, 4758067, 4224503, 3924348, 3684300, 3362120, 3097577, 2892092, 2665143, 2397743, 2074765, 1834810, 1649791, 1582663, 1508479, 1502437, 1486418, 1388255, 1319222, 1211667, 1090322, 974759, 919904, 920708, 931693, 936715, 1015417, 996534, 1006864, 1043221, 1053093, 1000132, 932961, 848250, 756552, 746730, 664485, 565402, 560618, 489709, 428880, 383756, 359634, 303823, 279855, 322188, 409182, 439080, 527073, 445373, 461764, 416655, 384490, 369813, 335540, 304764, 219322, 262563, 337242, 288909, 305813, 295787, 194393, 179801, 195564, 148653, 190927, 196184, 140975, 174083, 153030, 86213]
19216H6213N2416N4449K6926K7881M1083L8230l6570K5934Q6627l6289r0227N0386
19204C27059L3581K2882o0267j10945j8451Q38K0354j00661m0737o5238J935R3846
19192A04196O5838P8804r768N1867K6182L6557P257l375r62J892n2280p8337N6967
19179B84838J14937N3366N1343J096m8222M265P6115r136M5879M8373O478L9977
19167F69309m9502j635m0873p5884o8793p4916K1464O7745m0553j4070J55975
19156E48267m071q4465j23278j36947L950L8743O4552l7068m3679N3875L2496
19145C12375K5938o3814j56253m5908K8428M0184K9695O9595J43542J1232p0693
19134C24321P3329N2020L9031J32005J22260o573m7614m9176k0421q4414K6885
$$ y = [86213, 138629, 193078, 220004, 247885, 288968, 327198, 290628, 316562, 403189, 366900, 276673, 327059, 360640, 383522, 323255, 212310, 193859, 194697, 215051, 114390, 73653, 8415, 10350, 104196, 170034, 248838, 239070, 290937, 317119, 353676, 360933, 357558, 356596, 358488, 306208, 227871, 284838, 399775, 453141, 504484, 505580, 457358, 461623, 537738, 528602, 574481, 622854, 629332, 669309, 619807, 618172, 577299, 501415, 432622, 357706, 379170, 446915, 406362, 392292, 548267, 544196, 459731, 336453, 199506, 203456, 242199, 306751, 269683, 226004, 279879, 312375, 338313, 274499, 118246, 72338, 100766, 140950, 170645, 240240, 383782, 395014, 324321, 397650, 449670, 488701, 620706, 742966, 736393, 688779, 639603, 619182, 534768, 561653]
19123E61653K4252Q2958J29297J23883N9860j14609j69491j02179j18247o2274
19113D15103n42k2428o984R01K5807R6630J18943j6676k00679j80848p0437M5655
19101B04445Q5477J5742m1348j7088K6939P0443j9301J5174o6048p0055n9741
19090A44639n8545l5042o685K8514L3629J996N3976M3311J6486L5382n346p0330
19078A81985n5356l3259j6629K1571J2934J6554J5450L8718k324K0878p8948n0866
19066G0708Q471j9796P8285O6830M0733k2523m256J3468l993m4072o3835r833
19054A10187k8502j9891O4743N3032o013L132N8435m2368m8491p854J0915q9813
19042E7512J2000O3837M5843l9397N8272n6676l5081L6615O8200J3798n315o615
$$ y = [561653, 585905, 668863, 798160, 922043, 981903, 867294, 697803, 595624, 477377, 415103, 414561, 392133, 385149, 386050, 411857, 508487, 627430, 610754, 410075, 229227, 158790, 204445, 289922, 305664, 264316, 247228, 274167, 344610, 325309, 340483, 274435, 204380, 144639, 86094, 51052, 44367, 72881, 106510, 108506, 162482, 205793, 222279, 257661, 252315, 181985, 126629, 93370, 76741, 98312, 111246, 127800, 143250, 181968, 179644, 200522, 121574, 70708, 79179, 59383, 137668, 204498, 245231, 222708, 218452, 231920, 227927, 183855, 120020, 110187, 81685, 61794, 126537, 179569, 173556, 176688, 235123, 192755, 144264, 136410, 147325, 57512, 69512, 133349, 179192, 139795, 198067, 141391, 106310, 142925, 211125, 224923, 219608, 212993]
19030B12993K089n8258l7083L4639L723n733M5608k8647p4757K1439J15692m8756
19018A82949K5594R724l2681l7089k5636M7026m488j0516k7089K4402N4484N6425
19006B63105P5274K8334j4892M7823K7453L7187p004j0032q8782m9119k3474J2999
18994B98872j6901k2267n5000p2246q0729L7628O6175J05658M2651o7331j40k6926
18982B09444m9627N826M7238J3589q9648P0197J08203k2926K7796M0463j05667
18971B54888m0430L8857k361m0554m0564k9941L0715r917l2537M8209J38886K9138
18959C44389j32473r3148j3727K4915J8337J5386k8885N158n8390n2387O7722
18948I6897K1040j8954l0566l202O2988O3765K7227N1483m8577n4453J5301K8788
$$ y = [212993, 215082, 156824, 119741, 154380, 158103, 152370, 197978, 169331, 94574, 116013, 231705, 182949, 208543, 218267, 185586, 148497, 122861, 169887, 165399, 154883, 127794, 152196, 206680, 263105, 338379, 366713, 351821, 399644, 427097, 464284, 457280, 447248, 358466, 309347, 285873, 298872, 281971, 259704, 204704, 132458, 51729, 89357, 155532, 261190, 303841, 236510, 236370, 209444, 159817, 165643, 212881, 226470, 136822, 207019, 315222, 292296, 320092, 360555, 254888, 214458, 253315, 250954, 210400, 169836, 139895, 170610, 160693, 128156, 176365, 315251, 344389, 211916, 118768, 105041, 129956, 148293, 163679, 134794, 139952, 81562, 29175, 96897, 117937, 98983, 68417, 65215, 128203, 191968, 219195, 270678, 222101, 167648, 182949, 211737]
18936B11737J5224N9335N0996k78j25031p5745O8583O8602n660K6966m2861m660
18924B47208k4129r7177j22771J8709M5509j13089K5087J16256N0631k3135l534
18913A19565l380q2997K4584J1303l9044p663M381L1647P1529J00325j08120k1122
18901A01008J8024k9264j6254M2869N4250k3549o2418l600j754L6117L8319L4638
18889A88386O4169r394j2536L0509N346n8240L3611l1918K6989Q365L2023m9761
18877B27549j06705l6890m6081O3832N2300r8164q2158O8463m574m4002k6912
18866c3342M7533O7300M9072L9809j1495r167k8280J8117O7782J960M3662K3857
18854B76808j8544O6921K2714m3109m3893M4785N2482J44135J41434L84L174j1676
$$ y = [211737, 226961, 286296, 337292, 337014, 211983, 136238, 204821, 273423, 267763, 294729, 251868, 247208, 223079, 125902, 3131, 21840, 67349, -45740, -20653, 95603, 146234, 123099, 119565, 116185, 33188, 57772, 69075, 30031, 22368, 26749, 58396, 129925, 230250, 122130, 101008, 119032, 89768, 73514, 116383, 170633, 147084, 84666, 81066, 79312, 115429, 153748, 188386, 252555, 243161, 230625, 261134, 266480, 208240, 241851, 209933, 236922, 245287, 277310, 227549, 120844, 83954, 37873, 101705, 154005, 55841, -26317, 42146, 37572, -6430, -33342, 14191, 81491, 130563, 170372, 158877, 149710, 121430, 139547, 207329, 209289, 252951, 276808, 258264, 325185, 347899, 304790, 260897, 305682, 358164, 502299, 643733, 644117, 647291, 635615]
18842F35615J0466J9863O4719k3602R3263P9322L3670L0345N7810J19690R4793
18831A215954J47201J31005O8977N3584J7756M2893J60125J03920P3839J04318
18821B119572M9925J20454J49666K68911K90918M41312M77562P34316R36408J132734
18811F721778J432190J905194K542152L252061M524629O495442P932883Q266755
18803D3073084O677700M888500M765988K341453n281132q673790o397712o620086
18795C4774005q928822p475594m705051k999917k076286j476885r99709o51477
18787E460264l28005k21078j95322j72036l1844p43Q3827R5352N4013P1252P1809
18776D887489J69331P3141k1389K7798q2177J8092K27834L88262P39382R56442
$$ y = [635615, 646081, 665944, 730663, 707061, 800324, 879646, 913316, 943661, 1001471, 1121161, 1215954, 1363155, 1494160, 1563137, 1616721, 1634477, 1677370, 1837495, 1941415, 2015254, 2119572, 2169497, 2289951, 2439617, 2708528, 2999446, 3440758, 3918320, 4652636, 5589044, 6721778, 8153968, 10059162, 12601314, 15853375, 20378004, 26873446, 34806329, 43073084, 49750784, 54639284, 59405272, 61746725, 56465593, 47791803, 41394091, 34774005, 25845183, 18369589, 13664538, 10664621, 8588335, 7111450, 6111741, 5460264, 5132259, 4911181, 4715859, 4543823, 4511979, 4511236, 4595063, 4690415, 4744428, 4815680, 4887489, 5056820, 5129961, 5108572, 5136370, 5054193, 5072285, 5300119, 5688381, 6427763, 7384205]
18766G384205J028940R50375J280367J875252K502577L381202M407630O195176
18758B9005724Q807974J2007643J4190510J4003577J1235973Q874188P549644
18751A05675233J030379j0225850j4450568j1858002j2857394j5022518j2474975
18744B9816305q007990n056588l479166k327090j648540j201541r17941p60440
18736F417009n63640m85194l18252j18777j670r7121j33699q6317p6888k0115
18726D515336j79886k51044k14161j96344j18960r2404l0632K66776L56022M37148
18716D491851M94676O42566R31535J132318J567288K046555K812811M100688N788881
18707B4009169O625067O377698M664480L779181L438031p4071o211374o636440
$$ y = [7384205, 8413145, 9363520, 10643887, 12519139, 15021716, 18402918, 22810548, 29005724, 37813698, 49821341, 64011851, 78015428, 89251401, 98125589, 105675233, 106705612, 96479762, 82029194, 70171192, 57313798, 42291280, 29816305, 21808315, 16751727, 13272561, 10945471, 9296931, 8095390, 7177449, 6417009, 5853369, 5368175, 5049923, 4931146, 4929476, 4832355, 4698656, 4612339, 4535451, 4515336, 4335450, 4084406, 3870245, 3673901, 3554941, 3462537, 3431905, 3698681, 4054703, 4491851, 4986527, 5629093, 6560628, 7692946, 9260234, 11306789, 14119600, 18220288, 24009169, 30634236, 37011934, 41676414, 45455595, 48893626, 48819555, 42608181, 35971741]
18699C5971741m878662o085213p231088n351410l267784k030163j292516r05787
18691D929118p77543m88266l08976l30065l55196k41400j52252j28106K6627n98
18681B173343q9338j5697J33132m903j97515k74276k26872k40456j38917j78636
18671I39865n0252P7627m6341m0395j7617m421K8146o2086k143k7381q4304k8138
18659F82560L8403q5791l6706M8493O124J6619O4241J27136J01162N4645J05345
18648A122231P2338k8480j12650j75632j79732j10303O756l7373l1755k3980l0662
18637D70758j1828p8155k0639P4160N5505O8302L8659o047j9642j8925j00927
18626D51221p743L3515M645l0706q9644l6776L7583O3907J36649P6389o6018j17004
$$ y = [35971741, 31093079, 25007866, 17776778, 12425368, 9157584, 7127421, 5834905, 4929118, 4151575, 3663309, 3354333, 3024268, 2669072, 2427672, 2275420, 2147314, 2173941, 2173343, 2084005, 2068308, 2201440, 2196537, 1999022, 1724746, 1497874, 1257418, 1118501, 939865, 889613, 967240, 920899, 880504, 862887, 858466, 886612, 824526, 822383, 795002, 710698, 682560, 720963, 635172, 598466, 646959, 653083, 669702, 733943, 861079, 962241, 1016886, 1122231, 1194569, 1166089, 1053439, 877807, 698075, 587772, 594528, 557155, 525400, 501420, 470758, 458930, 380775, 360136, 434296, 489801, 558103, 596762, 590715, 571073, 552148, 451221, 443478, 476993, 481638, 450932, 361288, 324512, 362095, 426002, 562651, 639040, 573022, 456018]
18614D56018j48446j24326L6577R257r211m7687K5089J60748P0062l9791p6395
18603C11895k9907J2300O728N7954M1500r1634k2712J6198Q1812M3320l2223m8065
18591C47166M8759N6376l4614q7452j5920O3537N1534p1851J4643Q6399K7519
18580D86096K7498p2765j44200k3120J62029n477r2867p0735N2420M9828j9950
18569C48757n9473l2423j18266N30M6860J26373J26508K1512K2065M6120O8950
18558E97513n6684j4932l8624j40586r1719k0205J1387J1660n548K8872K1528
18547C02662M9012k736K0860P5419O7778o2788r1690o6521k592K4738M2081O544
18535C62767p3818l8257j4389N650M9165J6367k7397n5535l5139p54N8289l7660
$$ y = [456018, 307572, 183246, 219823, 229080, 219869, 172182, 197271, 358019, 428081, 388290, 311895, 281988, 294288, 301016, 358970, 400470, 308836, 286124, 302322, 384134, 427454, 395231, 347166, 395925, 452301, 417687, 330235, 314315, 377852, 429386, 357535, 372178, 458577, 486096, 513594, 440829, 296629, 273509, 435538, 430061, 337194, 266459, 318879, 368707, 348757, 289284, 256861, 138595, 139125, 185985, 312358, 438866, 460378, 482443, 528563, 597513, 540829, 525897, 487273, 346687, 254968, 234763, 246150, 257810, 252262, 281134, 302662, 351674, 348938, 369798, 445217, 512995, 450207, 358517, 291996, 289404, 314142, 356223, 362767, 288949, 250692, 236303, 241953, 291118, 307485, 280088, 224553, 189414, 188660, 246949, 209289]
18523B09289l9256P138J09129K9635K4113N3138n6464j11248n7295l6205N2513
18512A84487P4556J2793j1837O712k2307J9113P6246N8055O8334n3611m4428J3419
18500C81532k7369R63l8664J4483K9416K7773P075O2091j5079n5306q6007m3158
18488B57750o2638n4716L0392L1023P0198O7664p8236p5905Q2593L5318j8225
18477B85218J7090J6808k5440k8501O8873R8384l8065n3684K1956p0857k7650
18466B64132Q8059l624N6809l5208q6328P4854K7813p4607j15045l3668P7186
18455B40373K4564K6137J4225J10165K5568p2835j18184j6897k8307j712j1656
18444A91441j8071l7775N7718L1297M7908O7311n2767p9416l2511L2905n45J19706
$$ y = [209289, 170033, 177171, 286300, 315935, 340048, 393186, 336722, 225474, 168179, 131974, 184487, 259043, 271836, 259999, 266711, 244404, 263517, 339763, 397818, 466152, 412541, 368113, 381532, 354163, 355126, 316462, 330945, 360361, 388134, 395209, 457300, 442221, 386915, 300908, 257750, 195112, 140396, 170788, 201811, 272009, 339673, 261437, 185532, 268125, 303443, 285218, 302308, 319116, 293676, 265175, 334048, 432432, 394367, 340683, 362639, 291782, 264132, 352191, 348567, 405376, 370168, 283840, 358694, 386507, 311900, 196855, 163187, 240373, 264937, 291074, 305299, 415464, 441032, 368197, 250013, 233116, 204809, 203097, 191441, 173370, 135595, 193313, 224610, 272518, 339829, 287062, 207646, 175135, 208040, 207495, 327201]
18432C27201N1572n891j6443q2361k0691P5032q741o6851O2916K7702K7845O1670
18420D32960k8336m0000r6141l505J7709O5946K5997n4k5751N9547j2181n548
18408C90643q2235l9277l6729M235o4246j6463m2939O9666K2082m5155J23407
18397B82989O9554l3762Q691o4303k3150L4024M7768l588l7559o1643k4817M0598
18385B34802Q5303l0933m7026m970P5333m2339K7717L8762Q819J02387K3627p9612
18373C91870m5800q1994k8784j6450L1925O660N1895p1290n7632J9186n702K8075
18361B21959M4009L6422l0640N3214P0867k9774L4966k4806m4300j55884m0981
18350A35052J1155k5061N6267M5909J9805Q3628p7217j5078M8731P088n2422l1546
$$ y = [327201, 378773, 372882, 356439, 274078, 253387, 328419, 319678, 252827, 315743, 343445, 371290, 432960, 404624, 364624, 268483, 264978, 282687, 348633, 374630, 374576, 348825, 408372, 396191, 390643, 308408, 269131, 232402, 236637, 172391, 155928, 112989, 182655, 204737, 159582, 282989, 352543, 318781, 327472, 263169, 240019, 274043, 321811, 318223, 280664, 219021, 194204, 234802, 320105, 289172, 242146, 237176, 312509, 270170, 297887, 336649, 345468, 447855, 471482, 391870, 346070, 264076, 235292, 218842, 250767, 257427, 309322, 238032, 180400, 199586, 193884, 221959, 265968, 302390, 271750, 324964, 395831, 366057, 401023, 376217, 331917, 176033, 135052, 146207, 121146, 177413, 223322, 243127, 326755, 249538, 234460, 283191, 290279, 237857, 206311]
18338B06311m08k2526L2910P738P7927j7707l6507j8940J5105k1607N061L4375
18326B61732L3720J6639k3863l3292J9452K7175m4376j7988k5771o037k4369N9160
18314B42182R7785K4949P850K7537q5325q6226l8614J6143j9678o1104q4261m3292
18302b054Q2781L6242l4836n3929l5175Q5129Q1218J7325L9817l43L2324j7612
18290B30887L479J075L0359O8388L9782O8531p174L2050J3667K9111L1896K1272
18278E63323m2687m1039j27097r9446r0577k7562O484O6325O2695K1747k1566
18267B70600p51R0744l4979n2314l4425j2068o065r5521l781M5790k7073k7456
18255A12701L8973J9091M6572Q3601N8815J00181O2597N9440j4448j07483K2268
$$ y = [206311, 205903, 183377, 216287, 224025, 301952, 284245, 247738, 228798, 243903, 222296, 227357, 261732, 295452, 312091, 288228, 254936, 274388, 301563, 257187, 239199, 213428, 207391, 183022, 242182, 339967, 364916, 372766, 400303, 314978, 228752, 190138, 206281, 186603, 125499, 41238, -2054, 80727, 116969, 82133, 28204, -6971, 78158, 159376, 176701, 216518, 216175, 248499, 230887, 234366, 235441, 265800, 334188, 373970, 442501, 435327, 467377, 481044, 510155, 542051, 563323, 520636, 479597, 352500, 253054, 162477, 134915, 141399, 207724, 270419, 292166, 270600, 269849, 360593, 325614, 273300, 238875, 226807, 220742, 125221, 121440, 167230, 140157, 112701, 151674, 170765, 217337, 300938, 359753, 459934, 522531, 581971, 567523, 460040, 482308]
18244D82308P8393m0308K4682M226J17643O4316K159L2250K0399N0265O109o2533
18232G79909j7669p6504j58469j01767K0472m3535j28269m7474Q1002m5785m2469
18221B19442L0274R8479K6988k5903K8334m6552j09986p8903m7405k2089J03275
18210A75954J00326K6345P0469L0733p7839M1392o2372q9922P289L8234O4010
18199C24619M156o2166L9108K8953O0370J6004O2730J59908J00872J3092L8707
18188G86353N2427k297n7866m1815K8393o962Q569J50439J00753P6105N6392K7233
18176A177724l4342p572R473n2764Q0789J22589J08197J42985K20051K08652L14821
18165B290603K23712K16086K97344M34293N55340P45313R74990J207362J581938
$$ y = [482308, 560701, 520393, 545075, 549301, 666944, 731260, 733419, 765669, 786068, 836333, 842442, 779909, 762240, 685736, 527267, 425500, 445972, 402437, 274168, 226694, 307696, 261911, 219442, 249716, 348195, 375183, 349280, 377614, 331062, 221076, 142173, 94768, 72679, 175954, 276280, 302625, 373094, 403827, 325988, 367380, 305008, 215086, 222375, 260609, 324619, 328775, 266609, 305717, 334670, 395040, 411044, 473774, 633682, 734554, 747646, 786353, 838780, 836483, 778617, 736802, 765195, 758233, 766802, 917241, 1017994, 1094099, 1150491, 1177724, 1143382, 1135810, 1145283, 1092519, 1173308, 1295897, 1404094, 1547079, 1767130, 1975782, 2290603, 2514315, 2730401, 3027745, 3462038, 4017378, 4762691, 5737681, 6945043, 8526981]
18156H526981J851938K118188K607393L510623N412975Q620727J3360252J7434576
18148F3443653J5806130M904890j4553639k3009416j6488007r200608n066320
18141A5836683k844089j763123j101208o88750n38981k39295j37885j02175P5492
18132H496669L82186P50921J154473J704513K264522K852857L431297M120199
18124B5157637M782064N953771Q467835J2883762K0266576L0017365L6076136
18117A43605146K9349748L628878l0729238l5556263j7847293Q8546J7389849
18110A09929373L4146502L4804718J7207973l5764243o0123444l7227011j9344448
18103D3629420j0881222o672450m462147l063582k074926j123171k56221M22535
$$ y = [8526981, 10378919, 12497107, 15104500, 18615123, 24028098, 32648825, 46009077, 63443653, 79249783, 84154673, 69601034, 46591618, 30103611, 20903003, 15836683, 12992594, 11229471, 10128263, 9439513, 8900532, 8661237, 8523352, 8421177, 8496669, 8878855, 9629776, 10784249, 12488762, 14753284, 17606141, 21037438, 25157637, 29939701, 35893472, 44361307, 57245069, 77511645, 107529010, 143605146, 172954894, 176583772, 145854534, 110298271, 92450978, 92539524, 109929373, 144075875, 178880593, 196088566, 160324323, 100200879, 62973868, 43629420, 32748198, 26075748, 21613601, 18550019, 16475093, 15351922, 15095701, 15518236]
18095A5518236P57825J041748J428999K161316L628853N972599R589577J4463546
18087E4562699J6222441J0666658m818546k0486565j9632130j1876112o840426
18080A7798019m309877k895601k058320j298375p50689m58590m03248n22891o06400
18071D494028n62013m51433m08427k40774j53811j36522p9870p7956j05025j41148
18061B137049j88977j00523j58360j36752q1939j30202j00278M3920P3891O3182
18051A421011o7108q2780r8555j20976p1384k0930J2389p0060j34975k739L57
18040G64250K6721N8610L986K5713l723j373n3739p9627n2834O9121M246j0667
18028G50684K4879j07126k1263R0478j8000k3087p8984q6255j3572J06939K6716
$$ y = [15518236, 16276061, 17317809, 18746808, 20908124, 24536977, 30509576, 40099153, 54562699, 70785140, 81451798, 76633252, 56146687, 36514557, 24638445, 17798019, 13488142, 10592541, 8534221, 7235846, 6485157, 6026567, 5623319, 5100428, 4494028, 3932015, 3480582, 3072155, 2831381, 2677570, 2541048, 2461178, 2383222, 2278197, 2137049, 1948072, 1847549, 1689189, 1552437, 1470498, 1340296, 1240018, 1283938, 1357829, 1421011, 1353903, 1271123, 1172568, 1051592, 980208, 959278, 971667, 901607, 766632, 763893, 764250, 790971, 849581, 853567, 879280, 875557, 874184, 820445, 740818, 687984, 757105, 761351, 750684, 775563, 668437, 647174, 737652, 719652, 696565, 617581, 531326, 517754, 624693, 651409]
18017F51409j12061j01025K8413m3204N2231M2059q2402J4311Q08j09862R4166
18006D34843J63727K1657j24453m1793O2847M9164j0405m7547j8501R476J05512
17995F04527J09496j8882j19227p5359k543M2822O8247K8085q2059j43528o7045
17984C44534j26562n0848J9891L2458l667n3098l1830o113P1172l300k7078P3620
17972B39179L4228l0719M8506k2704l0677N3854P8688k4015l0650M5945J6961
17961C78596j1510j9275m004n3574k404j6292n1976j3647j1365K3337L1198j765
17949B47319J1142N7432P9982K3224q1436m8480N728p5960j30459p6968j2110
17938e86M8669Q1472N1323R4701M6685l0216K886l1689J5974j481n6416o0419
$$ y = [651409, 539348, 438323, 466736, 423532, 475763, 517822, 435420, 449731, 450539, 340677, 434843, 598570, 620227, 495774, 453981, 516828, 565992, 555587, 508040, 489539, 499015, 604527, 714023, 695141, 575914, 500555, 498012, 540834, 609081, 637166, 555107, 411579, 344534, 217972, 167124, 187015, 219473, 215806, 162708, 130878, 124765, 195937, 192637, 165559, 239179, 273407, 242688, 291194, 268490, 237813, 291667, 370355, 346340, 315690, 361635, 378596, 367086, 347811, 343807, 290233, 287829, 271537, 219561, 205914, 194549, 217886, 249084, 247319, 258461, 315893, 395875, 419099, 337663, 289183, 294911, 218951, 88492, 11524, -586, 48083, 129555, 180878, 275579, 322264, 292048, 294934, 263245, 279219, 277738, 221322, 160903]
17926A60903n9285o1009J1475P3005J3303L9200j861M0903N6200L2016M367j7431
17914B91786q5825q9416m9434Q6609L6965n9657m8005R3341L9237q9335l5526
17903I0740j0767P2754n7716L0636L8031K4625L2631k1048l8010j2160R906l1807
17891A27815o7626l0995N9064J2260J7337l7196L6726O3447L5252k6678j65226
17880B4180j2623m908q691N2262n621J4228O6479J06723Q77K6093L7754j33818
17868A62935k5028k3897L6466r2935k0566N7011p814o4449K1968M930j2847J07491
17856A43265K5374l155l0894o4593k5828k2126K7814M6257m357J2513J4255j36102
17844a7577P879j9k744k1368n2710R6310P1885L4894p2220o3306q78P9187M0986
$$ y = [160903, 101618, 40609, 52084, 125089, 138392, 177592, 175731, 216634, 272834, 304850, 309217, 291786, 205961, 116545, 67111, 153720, 190685, 131028, 83023, 176364, 215601, 126266, 90740, 79973, 152727, 95011, 125647, 163678, 188303, 220934, 199886, 161876, 149716, 159622, 127815, 60189, 29194, 88258, 100518, 117855, 80659, 117385, 180832, 216084, 189406, 24180, 11557, 6649, -2042, 50220, 44599, 58827, 125306, 232029, 232906, 258999, 296753, 162935, 137907, 114010, 150476, 57541, 36975, 93986, 86172, 21723, 43691, 48621, 35774, 143265, 168639, 165484, 134590, 69997, 44169, 22043, 49857, 96114, 91757, 104270, 118525, -17577, -9698, -9717, -12461, -33829, -86539, 9771, 81656, 116550, 44330, -18976, -19854, 59333, 100319]
17831A00319k0492n7644m9621L3231L3623R0326J1320J1434j9631N610l7385J511
17819A02601m0395m6504L6514J2270J8652N8118N4085j7n1589l3385K7021k4954
17807A12417k7066n5922K6527Q0345m013j57105n6919M5398P2997J5514K8032
17796H0205o799q1432L0506K8913L0975J5070l0997k0833M4352M1544l1310J7453
17784A17647M4703o4353q3149k268K7704j9205J2878K512Q4401R293p8356o6166
17772a4359p160J22486n0993j4655P3399R516p8410P15l292K4856J2712j9560
17760E5255N757m3148l0718K7635J1475l2217l0669r575l8904k754N5743Q3913
17748E1793n1536j2423O8098L8837M4921m5826O9581n708n6357K7078q2522j22866
$$ y = [100319, 79827, 22183, -27438, 5793, 39416, 129742, 141062, 152496, 132865, 138475, 101090, 102601, 62206, 15702, 52216, 64486, 83138, 141256, 195341, 195324, 143735, 110350, 137371, 112417, 85351, 29429, 55956, 136301, 132288, -24817, -81736, -36338, 36659, 52173, 80205, 73406, -8026, 22480, 51393, 82368, 97438, 66441, 45608, 89960, 131504, 100194, 117647, 162350, 97997, 14848, 12580, 40284, 21079, 33957, 36469, 120870, 130163, 51807, -14359, -21519, 100967, 49974, 35319, 108718, 118234, 39824, 40539, 37247, 62103, 74815, 55255, 61012, 17864, -12854, 14781, 26256, -5961, -36630, -46205, -85109, -87863, -32120, 51793, 257, -12166, 55932, 94769, 139690, 93864, 163445, 157737, 101380, 128458, 45936, -76930]
17736g6930k753J02539L7211L9252o2067m5271J9665K7846Q0098p9187K3344L6748
17724A00495P077P7019k7001k1996L4683l8227k2395L4345m048k9121j6561j9310
17712G4960J5208J02125m5237j14012l6665O0066L8884n6250J9700j8039p6672
17701c5932k6739L8292M4968O2378Q907K3084m084R5813l2113j48520R185N7830
17689I3069j2205l7654L7945N4136M51m7669Q167J01577N4601K0823j5477j12339
17677A45425r3141o4851K2920P073P8448r813q2012l0607K6856k672P8412r930
17665F6108l6804J9135K1992P976K2352q102L0840k2618o6037l2651o7936R991
17653e5754P874n1636K3768n9899L604j746j41p041K8779N6236k0299j169J5825
$$ y = [-76930, -79683, 22856, 60067, 99319, 37252, -8019, 11646, 39492, 119590, 40403, 63747, 100495, 107572, 184591, 157590, 135594, 170277, 132050, 109655, 144000, 139952, 110831, 94270, 74960, 90168, 192293, 147056, 33044, -3621, 56445, 95329, 39079, 58779, 40740, -35932, -62671, -24379, 20589, 82967, 91874, 114958, 110874, 206687, 174574, 26054, 35239, 93069, 80864, 43210, 81155, 135291, 135742, 88073, 96240, 197817, 252418, 273241, 257764, 145425, 52284, -12567, 10353, 17426, 95874, 86061, 4049, -26558, 298, -2374, 76038, 66108, 29304, 48439, 70431, 78407, 100759, 92657, 123497, 100879, 34842, 2191, -65745, -55754, -47880, -99516, -75748, -135647, -132043, -133789, -133930, -140971, -112192, -55956, -76255, -77424, -61599]
17640f1599M5756M0447M802m4378j535J0971J1102p3475l4288N0064R6858k6764
17628A7961j00173k6266K5968K2781J8339j9627n1243q763m2920P7670J63523
17617G7250M9032L3153O9978j06569o4941N5011M3758P5811J39133k0345j16289
17606B34982j77892j00367K892q4527k4677J9099J083N7736N9481l8625P4783
17595B3968Q4233l9599r1798m0791k6428l6037r668N2898J50231P5911k1148Q2575
17583B04347Q3975P8928J13571J17448J28370J0779j50068k13385j79357j46917
17573D7691p7258o7694l0060j6705R6374J67233M1752k1058O862J9922k845p6597
17561H7617o0545N3435M0713J9215J6276j112n2449m9888M4776Q0740J27509R1251
$$ y = [-61599, -15843, 24604, 29406, -14972, -16507, -5536, 5566, -67909, -102197, -52133, 44725, 17961, -82212, -108478, -82510, -59729, -41390, -61017, -112260, -121023, -163943, -86273, 77250, 126282, 159435, 229413, 122844, 57903, 112914, 156672, 232483, 371616, 351271, 234982, 57090, -43277, -40385, -124912, -149589, -130490, -129407, -71671, -12190, -50815, 23968, 108201, 68602, -23196, -63987, -90415, -126452, -136120, -83222, 67009, 142920, 121772, 204347, 288322, 367250, 480821, 598269, 726639, 737418, 587350, 373965, 194608, 47691, -29567, -97261, -127321, -144026, -47652, 119581, 161333, 140275, 147137, 167059, 164214, 87617, 27072, 80507, 121220, 140435, 156711, 155599, 103150, 53262, 98038, 178778, 306287, 397538]
17549C97538L1997L8551q6761l5244q2585n9623o8272q7907n4259J8217J1569
17538B3221J19964K5630k5983j36126n1128k7264K7094k0741q0624Q7225O139
17527e2593O5704M4699p5423p0915J0690L4602k8813j225K1244k8040n7205r32
17515a38207O2968r552m244m2638j0289J6748l801N5941Q0173N4257L4880j8204
17503G8032l7579J1167L9846r9540o9411J4419O0306M0491o4361O966K9210K9237
17491C8783L4424Q5253l3812q2533p3980o8226J9539J0133J13781K9552m2873
17480C0041n8597p515n070l9700K4935j2069O2220l8459p625M0885J23419O4738
17468A77203p1309k7346K8687K1109j3238o213o7188m3122K4024l0417m2917l1018
$$ y = [397538, 429535, 468086, 381325, 346081, 263496, 203873, 135601, 47694, -6565, 11652, 23221, 143185, 168815, 142832, 6706, -44422, -71686, -44592, -65333, -145957, -58732, -52593, 13111, 57810, -17613, -88528, -77838, -43236, -72049, -73274, -52030, -80070, -137275, -138207, -75239, -84791, -89035, -131673, -141962, -125214, -129015, -73074, 7099, 61356, 96236, 78032, 40453, 51620, 91466, -8074, -77485, -63066, -2760, 37731, -26630, -19664, 9546, 38783, 73207, 158460, 124648, 42115, -31865, -100091, -80552, -70419, 43362, 72914, 30041, -28556, -36071, -41141, -80841, -55906, -67975, -5755, -44214, -51839, -10954, 112465, 177203, 105894, 78548, 107235, 128344, 115106, 108893, 41705, -1417, 22607, -7810, -50727, -81745]
17456h1745L925N2691R1451O6249O0996M8385M2939m0261p3441P3289J31149J37725
17444E13352J58901K51206J49379k0271k64421k54109k08374p9438r9004o188
17434A41033L5636l0164j3609J4264L762J9569j05725q2142K2653M6829k564p1581
17422b2039M967K2639o2303K0789K1147Q5752N9359n3577l1259R868k9103k2629
17410C611m7685r7361l913O7424J0119L5749O8177p0435K5986k0300j330l8469
17398f8427O7619J02902O0702K8751n7831p9436M7704m3714p7837k2555O2067
17387A9945J401P564L0393m908K8092l0436m6826q9356Q1696Q5298K3438l8975
17375F7326k8403L3569L9757K304k8604J180j0761l7169k2993l9616k2624N9466
$$ y = [-81745, -77820, -25129, 66322, 132571, 193567, 241952, 284891, 244630, 171189, 244478, 375627, 513352, 672253, 923459, 1072838, 1052567, 788146, 534037, 325663, 246225, 147221, 141033, 176669, 146505, 132896, 147160, 150922, 170491, 64766, -17376, 5277, 52106, 49542, -22039, -17072, 5567, -56736, -35947, -14800, 70952, 130311, 76734, 45475, 55343, 26240, 3611, -44074, -141435, -145348, -77924, -67805, -32056, 36121, -34314, -8328, -28628, -29958, -68427, -808, 102094, 162796, 191547, 133716, 54280, 101984, 58270, -19567, -42122, 19945, 21346, 28910, 59303, 54395, 82487, 52051, 5225, -84131, -2435, 82863, 106301, 67326, 38923, 72492, 112249, 114553, 85949, 87129, 76368, 39199, 16206, -23410, -46034, 13432]
17363A3432k2844n0010M817p1540l5478M3157j1734L2206O8995O7880l1929q6464
$$ y = [13432, -9412, -59422, -54605, -126145, -161623, -118466, -130200, -97994, -28999, 38881, 6952, -79512]
$$ [...]
##END NTUPLES=NMR SPECTRUM
##END=
