##TITLE=Analysis number 324868
Compound Code cc 56646
Book Reference 508/28
Project Code adrs
Chemist Name antons
##JCAMPDX= 6.0         $$ Bruker NMR JCAMP-DX V2.0
##DATA TYPE= NMR SPECTRUM
##DATA CLASS= NTUPLES
##ORIGIN= Bruker BioSpin GmbH
##OWNER= nmr
$$ XWIN-NMR		Version 3.5
$$ Mon Dec  4 11:00:44 2006 GMT Standard Time (UT+0h)  MAYBRIDGE\nmr@NMR_250MHZ
##.OBSERVE FREQUENCY= 250.131544655141
##.OBSERVE NUCLEUS= ^1H
##.ACQUISITION MODE= SIMULTANEOUS (DQD)
##.ACQUISITION SCHEME= undefined
##.AVERAGES= 16
##.DIGITISER RES= 18
##SPECTROMETER/DATA SYSTEM= dpx250
##.PULSE SEQUENCE= zg30
##.SOLVENT NAME= CDCl3
##.SHIFT REFERENCE= (INTERNAL, CDCl3, 0, 16.522)
##AUDIT TRAIL= $$ (NUMBER, WHEN, WHO, WHERE, WHAT)
$$ ##TITLE= Audit trail, XWIN-NMR		Version 3.5
$$ ##JCAMPDX= 5.01
$$ ##ORIGIN= Bruker BioSpin GmbH
$$ ##OWNER= nmr
$$ C:\u/data/dgb/nmr/ADRS/150/pdata/1/auditp.txt
$$ ##AUDIT TRAIL=  $$ (NUMBER, WHEN, WHO, WHERE, WHAT)
(   1,<2006-12-04 11:00:20.11 +000>,<MAYBRIDGE\nmr>,<NMR_250MHZ>,
      <created by zg, POWCHK disabled, PULCHK disabled
       configuration hash MD5:
       49 4B E0 1D 92 C2 6B 37 9F E6 65 BC 52 41 86 1D
       data hash MD5: 64K
       0C 1C AF 7C FB 79 4C 87 77 4D 18 08 E7 36 5B 09>)
(   2,<2006-12-04 11:00:35.71 +000>,<MAYBRIDGE\nmr>,<NMR_250MHZ>,
      <Start of raw data processing
       ef LB = 0.3 FT_mod = 6 PKNL = 1 SI = 32K 
       data hash MD5: 32K
       CB A1 F2 5A 4D DF 5E 3E 6F 5B E3 1E 5C B7 BF C9>)
(   3,<2006-12-04 11:00:37.31 +000>,<MAYBRIDGE\nmr>,<NMR_250MHZ>,
      <apk 
       data hash MD5: 32K
       EF CF B6 2D AF B1 3B 61 D7 12 F9 AA BA 9A 1B B1>)
(   4,<2006-12-04 11:00:38.03 +000>,<MAYBRIDGE\nmr>,<NMR_250MHZ>,
      <abs ABSG = 5 
       data hash MD5: 32K
       CD CC 84 5A C3 AD 4F 02 80 AF A6 E0 63 B5 3F 8A>)
$$ ##END=
$$ 
$$ hash MD5
$$ B5 34 6E 87 D9 72 A9 F7 EF 8E 09 4B 7F 7A 61 51
##$RELAX= 
##$RELAX= 
##$RELAX= 
##$RELAX= 
##$RELAX= 
##$RELAX= 
##$RELAX= 
$$ Bruker specific parameters
$$ --------------------------
##$DU= <C:\u>
##$EXPNO= 150
##$NAME= <ADRS>
##$PROCNO= 1
##$TYPE= <nmr>
##$USER= <dgb>
##$AMP= (0..31)
100 100 100 100 100 100 100 100 100 100 100 100 100 100 100 100 100 100 
100 100 100 100 100 100 100 100 100 100 100 100 100 100 
##$AQSEQ= 0
##$AQ_mod= 3
##$AUNM= <au_zg>
##$AUTOPOS= <10 >
##$BF1= 250.13
##$BF2= 250.13
##$BF3= 250.13
##$BF4= 250.13
##$BF5= 500.13
##$BF6= 500.13
##$BF7= 500.13
##$BF8= 500.13
##$BYTORDA= 1
##$CFDGTYP= 0
##$CFRGTYP= 5
##$CHEMSTR= <none>
##$CNST= (0..31)
1 1 145 1 1 1 1 1 1 1 1 1 1 1 1 1 1 1 1 1 1 1 1 1 1 1 1 1 1 1 1 1 
##$CPDPRG= <>
##$CPDPRG1= <>
##$CPDPRG2= <>
##$CPDPRG3= <>
##$CPDPRG4= <mlev>
##$CPDPRG5= <mlev>
##$CPDPRG6= <mlev>
##$CPDPRG7= <mlev>
##$CPDPRG8= <mlev>
##$CPDPRGB= <>
##$CPDPRGT= <>
##$D= (0..31)
0 1 0 0 0 0 0 0 0 0.06 0 0 0 0 0 0 0.0002 0 0 0 0 0 0 0 0 0 0 0 0 0 0 
0 
##$DATE= 1165230018
##$DBL= (0..7)
120 120 120 120 120 120 120 120 
##$DBP= (0..7)
150 150 150 150 150 150 150 150 
##$DBP07= 0
##$DBPNAM0= <>
##$DBPNAM1= <>
$$ [...]
##$SUBNAM7= <"">
##$SUBNAM8= <"">
##$SUBNAM9= <"">
##$SW= 20.6930455092707
##$SWIBOX= (0..15)
0 0 3 0 0 0 0 0 0 0 0 0 0 0 0 0 
##$SW_h= 5175.983436853
##$TD= 65536
##$TD0= 1
##$TE= 294.16
##$TE2= 300
##$TE3= 300
##$TEG= 300
##$TL= (0..7)
0 120 120 120 120 120 120 120 
##$TP= (0..7)
150 150 150 150 150 150 150 150 
##$TP07= 0
##$TPNAME0= <>
##$TPNAME1= <>
##$TPNAME2= <>
##$TPNAME3= <>
##$TPNAME4= <>
##$TPNAME5= <>
##$TPNAME6= <>
##$TPNAME7= <>
##$TPOAL= (0..7)
0.5 0.5 0.5 0.5 0.5 0.5 0.5 0.5 
##$TPOFFS= (0..7)
0 0 0 0 0 0 0 0 
##$TUNHIN= 0
##$TUNHOUT= 0
##$TUNXOUT= 0
##$USERA1= <user>
##$USERA2= <user>
##$USERA3= <user>
##$USERA4= <user>
##$USERA5= <user>
##$V9= 5
##$VALIST= <valist>
##$VCLIST= <CCCCCCCCCCCCCCC>
##$VD= 0
##$VDLIST= <DDDDDDDDDDDDDDD>
##$VPLIST= <PPPPPPPPPPPPPPP>
##$VTLIST= <TTTTTTTTTTTTTTT>
##$WBST= 1024
##$WBSW= 4
##$XGAIN= (0..3)
0 0 0 0 
##$XL= 0
##$YL= 0
##$YMAX_a= 604691
##$YMIN_a= -743760
##$ZGOPTNS= <>
##$ZL1= 120
##$ZL2= 120
##$ZL3= 120
##$ZL4= 120
##$ABSF1= 16.522
##$ABSF2= -4.171173
##$ABSG= 5
##$ABSL= 3
##$ALPHA= 0
##$AQORDER= 0
##$ASSFAC= 0
##$ASSFACI= 0
##$ASSFACX= 0
##$ASSWID= 0
##$AUNMP= <proc_1d>
##$AZFE= 0.1
##$AZFW= 0.1
##$BCFW= 0
##$BC_mod= 0
##$BYTORDP= 0
##$COROFFS= 0
##$CY= 12.5
##$DATMOD= 1
##$DC= 0
##$DFILT= <>
##$DTYPP= 0
##$F1P= 14.0000005364418
##$F2P= -0.99999901652339
##$FCOR= 0.5
##$FTSIZE= 32768
##$FT_mod= 6
##$GAMMA= 0
##$GB= 0
##$INTBC= 1
##$INTSCL= 1
##$ISEN= 128
##$LB= 0.3
##$LEV0= 0
##$LPBIN= 0
##$MAXI= 10000
##$MC2= 0
##$MEAN= 0
##$ME_mod= 0
##$MI= 0
##$NCOEF= 0
##$NC_proc= -2
##$NLEV= 6
##$NOISF1= 0
##$NOISF2= 0
##$NSP= 0
##$NTH_PI= 0
##$NZP= 0
##$OFFSET= 16.522
##$PC= 1
##$PHC0= 225.9122
##$PHC1= 4.144747
##$PH_mod= 1
##$PKNL= yes
##$PPARMOD= 0
##$PSCAL= 4
##$PSIGN= 0
##$REVERSE= no
##$SF= 250.13
##$SI= 32768
##$SIGF1= 0
##$SIGF2= 0
##$SINO= 400
##$SIOLD= 32768
##$SREGLST= <1H.CDCl3>
##$SSB= 0
##$STSI= 32768
##$STSR= 0
##$SW_p= 5175.98343685301
##$SYMM= 0
##$S_DEV= 0
##$TDeff= 65536
##$TDoff= 0
##$TI= <Analysis number 999999
Compound Code 99
Book Reference 9
Project Code 9>
##$TILT= no
##$TM1= 0
##$TM2= 0
##$TOPLEV= 0
##$USERP1= <user>
##$USERP2= <user>
##$USERP3= <user>
##$USERP4= <user>
##$USERP5= <user>
##$WDW= 1
##$XDIM= 32768
##$YMAX_p= 580189322
##$YMIN_p= -154602
$$ End of Bruker specific parameters
$$ ---------------------------------
##NTUPLES= NMR SPECTRUM
##VAR_NAME=  FREQUENCY,     SPECTRUM/REAL,   SPECTRUM/IMAG
##SYMBOL=    X,             R,               I
##VAR_TYPE=  INDEPENDENT,   DEPENDENT,       DEPENDENT
##VAR_FORM=  AFFN,          ASDF,            ASDF
##VAR_DIM=   32768,         32768,           32768
##UNITS=     HZ,            ARBITRARY UNITS, ARBITRARY UNITS
##FACTOR=    0.157963299565203, 1,           1
##FIRST=     4132.6476996994, 0,             0
##LAST=      -1043.33573715361, 0,           0
##MIN=       -1043.33573715361, -154602,     0
##MAX=       4132.6476996994, 580189322,     0
$$ Real data points
##PAGE= N=1
##DATA TABLE= (X++(R..R)), XYDATA
$$ [...]
21650 -5936 -8159 -9132 -8104 -10937 -15532 -13526 -682 3033 1907 -1289 -4940 -11957 -8913 -26 4605
21635 4605 3196 474 1792 93 -3544 -2040 1211 -230 2375 -825 -6364 -2827 2481 -155 -1047
21620 -1047 -5374 -2520 -2707 -3715 -499 4665 7668 7588 5187 -5780 -14683 -15794 -11074 -3659 -928
21605 -928 3074 5252 5276 4544 -5803 -10702 -4361 -1991 -6267 -3621 -5941 -3571 317 944 1758 -205
21589 -205 -5563 -2865 -5374 -8151 -9544 -9631 -3161 573 -3784 -4901 -9386 -7216 -5616 -3266 -593
21574 -593 -5552 -9648 -10589 -12308 -9011 -9960 -9567 -8362 -11087 -11417 156 3285 630 -7390 -6578 -7376
21558 -7376 -2501 -3554 -10660 -11013 -12051 -11919 -11533 -10814 -6550 -13832 -14688 -14956 -11814 -1487 3328 -9181
21542 -9181 -10939 -13724 -11672 168 5845 1658 -3319 -3076 -2153 1251 3285 1449 3008 1300 3437
21527 3437 6497 2854 -3125 -5675 -7441 -6032 3119 3874 -1834 -6871 -5382 -6799 -8304 -9745 -4154
21512 -4154 -7050 -11096 -8105 32 2401 471 1448 3592 4536 1188 -1014 -2152 -3607 -5590 -7823
21497 -7823 -2100 -896 -4534 -736 3931 661 -5678 -5833 156 503 89 6065 5503 -1884 -8491 -1319
21481 -1319 -686 -3656 -644 9512 9452 10747 13428 10478 783 -2549 -2961 -193 -4397 -7221 -6013
21466 -6013 -5035 -5366 -15281 -16770 -13085 -11814 -2861 7154 7519 4574 2567 -1877 -4108 -2412 -5427
21451 -5427 -14887 -17089 -16044 -12622 -4791 -2558 -7017 -9174 -7982 -4785 -7431 -3353 -5036 -4513 499
21436 499 -3416 -3935 1188 -716 -233 -1799 -1991 -4750 -4168 -1784 -3127 -6925 -6814 -4463 -1420 2131
21420 2131 -1530 -7957 -3995 3197 9098 5206 129 -1471 -6029 -2361 -2102 -9845 -9584 -15647 -16209
21405 -16209 -7819 -6935 -12479 -6184 -1470 1916 4463 5084 4413 5484 5725 -273 -1875 3491 2848 1878
21389 1878 4591 2789 -2446 -9155 -12706 -9242 -4950 657 -1544 -3430 -7668 -12829 -9536 -262 5843
21374 5843 2471 6455 4896 951 -5858 -7184 -11421 -6614 -2881 -2038 -3992 -12593 -19404 -13358 -16354
21359 -16354 -13814 -9617 -7735 -6188 -5867 -7305 -10912 -16630 -15933 -9411 -7365 -7218 -6228 -4334 -3643 -11219
21343 -11219 -14939 -10430 -6861 -7551 -5122 -4431 -659 12630 14789 6454 3567 8474 9542 5038 -919
21328 -919 -270 -2140 377 -806 -6607 -9148 -5383 -5378 -5087 -5237 -2590 815 -2238 -4487 -4501 -581 -3928
21311 -3928 151 -4041 -6406 -4053 661 -5568 -10358 -13250 -9561 -10665 -7077 -3974 -9078 -9182 -482
21296 -482 6183 8942 3464 -1622 1596 -1896 -745 -1958 -6541 -7645 -4196 283 1324 -312 2816
21281 2816 -6592 -11127 -9507 -5296 -3698 -1455 -1896 -1220 -180 -48 2052 2925 7720 7343 -3 -2270
21265 -2270 577 -1368 358 4973 7046 2041 -3515 -7409 -7529 -7553 -10434 -9451 -10020 -10728 -6469 -6876
21249 -6876 -7139 -1636 146 802 5689 10509 11111 2979 1895 3434 4911 2009 659 5647 9483
21234 9483 12428 11507 6187 -411 3229 2420 5807 11444 7414 5075 6951 8146 8811 13929 11508
21219 11508 2643 -2052 -2842 -3249 -4183 -3656 -2467 -994 3001 2294 120 1419 2049 -1326 -2331 -2263
21203 -2263 1312 1075 -4726 1597 9481 6922 -1106 -5221 3005 13238 7422 -1196 2444 395 -6734
21188 -6734 -11273 -5250 -305 1638 -3091 -6186 933 2936 2000 744 1932 -1169 3204 8146 7809
21173 7809 4707 -3031 -3650 -6353 -3508 -3321 2848 7811 8369 11700 9292 501 -5494 -7365 -7778 -6697
21157 -6697 -5390 -7038 -9918 -3234 4846 4878 -4770 -8759 -12701 -5658 -8920 -4409 -2474 -5616 -6544
21142 -6544 -6540 -5668 1395 1996 -744 -2033 -1852 877 285 -10992 -12819 -13410 -4048 -1393 -450 -670 -418
21125 -418 1432 2714 2612 5829 3761 1016 -203 -4057 -9999 -6419 -5705 -8709 -8107 -4074 -4792 -7876
21109 -7876 -7748 -8239 -7032 -5586 -9990 -10195 -1854 7910 7690 3101 3107 -3688 -3551 2689 6440 7631 8011
21092 8011 3945 8876 6329 2374 -2460 -7142 -3263 2167 5227 455 4771 10363 10526 3927 -2585
21077 -2585 -8945 -6243 -5480 -654 767 -1487 842 189 -6497 -10683 -13877 -15238 -10044 1351 7133
21062 7133 7942 9573 12682 7835 2181 939 3837 -935 -3871 -4101 -2475 -3318 -3657 -6005 -4523 3398
21046 3398 8014 2331 -4643 -9979 -12160 -8202 -4832 -3676 -3147 463 2562 10053 9759 7529 2008
21031 2008 5012 8005 14796 13522 10076 15693 9919 3599 1998 2290 2533 2630 -2751 -413 5234 4476
21015 4476 616 -8114 -13461 346 10873 9282 245 -1852 3235 1906 3099 4879 -2195 -7674
21001 -7674 -10888 -10213 -4987 -8218 -11366 -11541 -9317 -3972 1411 1612 3510 7460 1903 1865 -2185 -1702
20985 -1702 -5018 -10781 -11851 -9228 -2563 6533 11317 6529 913 -2512 -2096 453 -5305 -5378 -1062
20970 -1062 -710 -3519 1246 1742 4280 1880 -847 779 473 1045 -821 4420 8346 2662 -517 4693
20954 4693 9635 6786 5410 -2730 -7847 -10567 -3275 715 4483 3048 438 -3851 -5163 -4568 -10467
20939 -10467 -11887 -8422 -6162 -3440 -9364 -7654 -1586 -1979 -2385 -3634 -4408 1202 471 -3609 -1182
20924 -1182 -591 -5642 -3272 340 5093 5978 2862 2221 4663 2116 -1888 -1715 5521 8897 6439 257
20908 257 -1783 1384 -1970 -7790 -5201 -1966 -5569 -6022 -5002 -7310 -7509 -5984 -3745 -2018 988
20893 988 -8263 -11681 -5400 -553 -6024 -1790 1266 9819 1523 -8937 -11792 -4795 312 1373 -3120
20878 -3120 -5816 -6074 -4726 -6958 -10055 -10640 -6082 -5363 -10282 -8908 -5787 698 4848 2653 4804
20863 4804 10124 5360 706 2573 4765 956 -86 -1263 -5034 393 7884 6034 2866 2421 -1765
20848 -1765 2303 5938 9833 5861 7563 9345 2436 -1844 3032 43 -3566 -4959 -9619 -7625 -5624
20833 -5624 -3163 1645 2906 968 -1840 510 1934 5574 -2807 -10277 -6044 -1831 4794 4482 1890
20818 1890 4920 3675 716 -2833 -5223 -4238 -895 -5418 -18412 -20202 -10941 -3847 -3197 -3853 -6255
20803 -6255 -8830 -1777 -442 1739 4103 5304 2128 -8551 -14659 -11957 -9914 -8159 544 2216
20789 2216 4672 5882 1224 -855 -455 -2546 628 1092 -7238 -7139 -3357 -2103 -4322 -6490 -4590 -2416
20773 -2416 1937 1012 5360 3498 3873 119 -1194 -1630 942 -1633 -6182 -4042 -8041 -5627 -12399
20758 -12399 -11945 -8639 -3363 -7287 -10375 -3952 3841 -989 -1283 -4475 -3201 12862 11915 8416 4521
20743 4521 5730 2404 158 -4170 -6379 -4027 -169 3555 2619 2021 3959 5947 6165 186 -4248
20728 -4248 -12949 -16654 -12709 -11146 -15369 -7982 589 -347 -1126 -9733 -12039 -8358 -6244 -5974 -5657 -13774
20712 -13774 -16854 -14246 -12323 -14105 -6952 -2145 -8085 -12573 -9786 -6990 -3251 1721 1485 -316 -447
20697 -447 5539 6427 3486 1732 3696 824 -7752 -12158 -12427 -10795 -8137 -5652 -1869 2898 -5003
20682 -5003 -14288 -16159 -14446 -7240 -3076 -5487 -12891 -11769 -9974 -8787 -9245 -2931 -594 -1681 1956
20667 1956 7495 10758 7801 1942 -5644 -9971 -10351 -11811 -9184 -7175 -5179 2989 12753 15211 5404
20652 5404 -1561 -1746 -5548 -8492 -5065 -5609 -6799 -793 -3697 -3967 -3725 -8086 -6387 -4012 -8466 -6105
20636 -6105 1356 7838 5117 -4027 -9970 -14172 -14061 -10250 -10625 -12519 -1883 3707 2648 457 12
20621 12 -1110 -7535 -7341 -2524 -3290 -7429 -8946 -5097 -3350 -1857 565 2393 4238 2306 -965 58
20605 58 3946 4967 5710 2412 2794 2945 6827 5234 226 -6535 -8309 -4695 -1042 -3561 -6318 -1827
20589 -1827 -2857 -2619 -4548 -3973 -2709 1019 2450 -2103 2544 5937 8374 10456 5429 -1483 -3299
20574 -3299 -4393 -6596 -752 3494 452 -6276 -4933 -1979 -1576 1375 648 -2774 -4695 -4096 -8923
20559 -8923 -7118 -8137 -6576 3197 12026 12017 6037 4027 -275 -5855 -8559 -5435 -4850 -3686 -2552 -3586
20543 -3586 4069 9407 5365 2815 -169 2899 2263 -2537 -1379 -4666 -6347 -3681 -4343 -3034 -9729
20528 -9729 -6926 -315 -2475 -2952 -2906 718 -2750 3271 3958 1085 2403 7643 -1263 -5563 -2241 1823
20512 1823 4580 8561 12443 14228 8636 2785 7145 3923 5747 10057 6361 739 -3910 -1699 1658
20497 1658 6648 -2550 -12544 -10555 -5276 -1922 -116 -6287 -8316 -5184 -3093 4827 3925 3639 -3088
20482 -3088 -3802 -7111 -8422 -3886 -11069 -10775 -7059 -6341 -2931 -3915 -8603 -9201 -8637 -7069 -1441 -1655
20466 -1655 -4691 -2960 1094 3069 352 -7112 -15047 -10838 -3405 2200 5406 7683 6077 3099 -1255
20451 -1255 -4537 -3645 -2588 -8149 -3829 -7285 -8134 -6732 -3493 -8387 -14360 -11192 -1511 743 -1503
20436 -1503 -4996 -5642 -9764 -5997 -4206 -1996 5355 7582 2131 2942 -2886 -2264 6440 6073 -4629
20421 -4629 -9393 -5769 -1884 76 4382 4079 4882 -547 -5625 -5915 -4942 -3709 2208 1772 -6909 -7049
20405 -7049 -5441 -10515 -9739 -2400 -2047 960 5515 51 -3296 1363 993 -491 -5259 -4968 -5373 1515
20389 1515 -4005 -6687 -8648 -4770 1778 1129 -4410 -1258 3692 1849 -3140 -7723 -10072 -13369 -6376
20374 -6376 -1693 -636 -2215 -184 2645 -43 456 -2534 -7001 -5093 -8385 -8756 1150 2685 70
20359 70 -3960 -7765 -7326 -8938 -8003 -9832 -6077 257 124 1000 361 3447 7860 4062 6174 6953 7690
20342 7690 5756 1420 -2047 -1781 1418 -1193 -7157 -3954 3334 6490 3509 4828 10244 11674 14374
20327 14374 4423 -1732 184 1633 -5385 -3668 3868 908 -2401 3306 7209 7852 8497 9457 7590
20312 7590 3659 -8447 -19169 -12312 -7991 -7767 -5030 -9451 -12931 -14507 -14883 -16691 -17010 -16192 -10282
20297 -10282 -5651 -6980 -2189 77 9283 12396 10249 11462 5334 -5773 -7453 -5075 -6156 -7957
20283 -7957 -5748 -2951 2018 3536 359 -2393 -574 183 7033 7885 -2178 -588 4145 4524 1077
20268 1077 -6800 -1062 8186 12695 11722 6331 4798 -300 -28 685 6200 4982 -7677 -12969 -12523
20253 -12523 -7988 -3168 2664 8364 11398 10478 770 -6777 -10118 -11718 -4854 3323 3089 -576 -571 -970
20237 -970 -5212 -8595 -6963 -1439 -1515 -4389 640 -1404 -3097 108 7916 11702 7005 961 -2276
20222 -2276 -2837 -1772 -5284 -8789 -6213 -1931 5993 7657 662 -1478 1696 995 -1454 -4860 -91
20207 -91 8099 898 -1092 -26 1855 -2968 -5754 -3534 1647 1550 5626 3800 -296 -456 1013 880
20191 880 -1723 1510 7444 10508 4907 2219 4414 -788 -5627 -5511 603 5764 744 59 3134
20176 3134 -1778 816 1398 4765 8605 8645 3995 7501 5362 -1412 -504 870 -2974 3377 8248 6835
20160 6835 5859 4654 6004 4794 -1530 -5208 1501 5801 6956 2567 1344 -3125 -778 -3562 -2077
20145 -2077 2886 106 -3340 -4535 -2067 -4260 -4474 -7020 -3495 -1922 1473 5718 6158 -2894 -3392
20130 -3392 -266 -1708 -1495 561 3969 4030 -1844 -5596 -4601 6486 8209 -366 -5290 -5901 -10456 -12608
20114 -12608 -14052 -13096 -11888 -15932 -10882 -6293 -5722 -7794 -4716 -4619 -6002 -7481 -11587 -6177 -10075
20099 -10075 -11257 -12374 -16858 -16385 -17832 -18002 -12617 -4531 3258 9400 4773 -4303 -8227 -8611 -11834
20084 -11834 -11659 -8585 -4936 -3402 -7801 -7403 -6656 -4825 -828 -670 2154 -1561 -3405 2874 3087 -122
20068 -122 -5798 -5975 -2398 91 -3081 -11274 -8373 -4221 -4654 -7878 -6366 1296 -10503 -11675 -2008
20053 -2008 -1963 1354 -2145 -647 3160 6896 -1227 -2559 255 3752 2969 415 4923 5301 1473 -2606
20037 -2606 -678 2030 -352 -1023 -6417 -8971 1055 2246 5843 7432 6876 5079 5204 4547 626
20022 626 1605 -5372 -11307 -13858 -10638 -9126 -5878 -3590 -1759 -5406 -10 -4591 -11101 -8833 -7049
20007 -7049 -1851 -5066 -8333 -3850 -1275 -5124 -1332 -3473 -8573 -6926 -1798 -1964 -5962 -10303 -6397
19992 -6397 -1190 -5981 -10268 -4721 -7317 -5992 -5636 -5931 -10361 -4257 2013 257 -5890 -16770 -16212
19977 -16212 -14764 -17400 -18550 -14233 -10252 -4908 575 6905 6338 5257 -5219 -11055 -5153 1624
19963 1624 7635 1807 -7371 -12941 -6263 -3080 -3548 -5082 -4735 -6487 -6850 -1421 -4133 -415 -2407
19948 -2407 -4640 -4942 3397 8072 1989 998 -3663 -4608 -10399 -7711 -3261 -5958 -8825 -9152 -1736 1792
19932 1792 -3848 -9163 -3757 -2255 -907 5096 8324 9420 6435 -884 -2956 -2941 1 2844 4258
19917 4258 5959 8465 8653 2932 -7193 -9915 -11060 -7143 -3061 -2091 692 5148 4131 1240 1254
19902 1254 -2597 680 -3291 -9429 -11397 -9084 -11583 -10358 -7833 -5835 -4311 -9054 -5502 4582
19888 4582 4561 4869 7961 6630 2134 -4547 -5827 -3612 -46 2636 2440 -1928 -1591 -3870 -4036 -2287
19872 -2287 3191 4549 -1048 -7300 -8014 -9524 -9908 -10613 -10384 -10165 -13575 -14303 -14811 -9631 -7071 -10635
19856 -10635 -12611 -10133 -6966 -2040 -1572 -3931 -3967 1183 6265 5295 4172 5657 4331 5664 10840
19841 10840 3800 -2455 -7180 -3347 3892 5856 2712 3375 -1212 -3691 -3226 -6687 -9627 -7808 -6312
19826 -6312 -779 -592 5049 7990 -811 -4812 2157 3038 -71 -814 -1454 2068 6127 1615 -17 214
19810 214 -2147 -11581 -9348 -2516 -2381 -1050 3147 8421 8612 12317 2955 -2326 558 1023 79 6199
19794 6199 8597 3532 -14260 -13052 -15375 -14394 -6738 -605 626 1281 2892 -2742 227 9349 11164
19779 11164 6281 1135 -1429 2087 4959 5301 5994 -2448 -8386 -5501 -4195 351 -1607 1869 7437
19764 7437 327 -5234 -2962 5640 128 -4553 -7045 -14574 -17554 -9763 -3973 -6807 -10001 -3286 1945
19749 1945 6119 -1698 3085 10508 3803 -5770 -11103 -10455 -6715 -6963 1511 3785 -4297 -2345 4410
19734 4410 740 2015 -531 -2475 -2277 -139 -2011 -2876 -176 9487 10995 10710 18566 20224 16503
19719 16503 7678 3909 3381 2960 6637 6216 7599 7850 11653 18067 18814 13527 12092 3295 745 4521
19703 4521 7711 15426 20679 16737 8181 6150 6982 4127 3659 1246 776 5746 12093 11373 10725 5083
19687 5083 1566 4022 4839 10875 7833 2975 -927 -1205 547 2154 -1935 -6446 -10464 -12487 -9018
19672 -9018 -4285 -6067 -12695 -15030 -9601 1211 3866 -269 -5543 -1233 78 930 252 424 396 3199
19656 3199 4709 -4126 -8737 -13380 -15129 -9436 -9368 -3433 -3020 -2965 2282 3449 127 -1613 1287 4888
19640 4888 8242 296 -4664 -364 6799 1856 -2410 2395 2715 2755 3444 2868 -992 -7041 -5684 -4643
19624 -4643 -6975 -2504 -452 4460 9191 11927 11836 4761 4546 5044 1595 1735 8688 10643 133 -3011
19608 -3011 -5372 -6743 -5003 547 2846 -1091 -5282 -10037 -6421 -1738 825 1046 2973 4973 5101
19593 5101 3305 -901 -8292 -18308 -15842 -815 10732 9261 10613 7752 5571 -1355 -2378 -9600
19579 -9600 -17724 -19678 -23360 -24411 -19722 -15707 -5156 402 3974 2092 657 -3152 -8208 -1189
19565 -1189 2374 6035 8607 7959 2096 -2646 -1391 -4992 -362 -1150 -1708 2178 677 1113 -2245 -6165
19549 -6165 -10950 -9248 3906 7819 492 -6962 -3990 -6131 69 6489 9907 11483 15362 15520 9725
19534 9725 9538 7698 10188 4285 3589 1700 11283 15929 9593 7675 8051 6695 4281 4751 3490 2627
19518 2627 1160 4295 11893 13261 13137 14562 10158 3074 5953 7669 9616 7912 939 3342 16568
19503 16568 21737 9668 2125 5870 10638 13016 15905 11441 11153 8095 5800 4791 4079 5801 6473
19488 6473 6536 9991 8760 7300 11401 19569 14308 6648 -203 -4863 -10236 -17796 -14606 -8544 -6250
19473 -6250 -3674 -1248 1443 3289 1391 2929 297 -3535 -7631 -8132 -11591 -9720 -7552 -9239 -3072
19458 -3072 -351 -1882 3347 6886 -3854 -11500 -15647 -11574 -5338 -5169 -10145 -6343 -2250 784 5573
19443 5573 2441 5024 3517 -2624 -6434 -9540 -6358 443 -239 -5661 -7452 -10491 -11990 -12558 -5794
19428 -5794 -4321 -7006 -11537 -8161 -7349 -6434 -7375 -1295 7462 10866 10619 8316 6562 3364 3940 2178
19412 2178 -1771 -1338 1570 -3617 -7466 -1332 2793 7013 8691 2777 219 -5777 1764 7065 2238
19397 2238 -1167 -9001 -11735 -10362 -1635 6559 7145 2685 -1914 -1362 -1670 1521 655 3606 693 2279
19381 2279 4511 -1935 1388 8215 12649 19874 15665 7567 932 -4449 -6410 -3068 3601 6861 6268
19366 6268 10004 14699 9535 3369 -1840 -3113 1148 1575 -5059 -9410 -542 2547 7143 5813 -1274
19351 -1274 -7106 -8741 -1507 -2206 -3403 -9073 -8598 -12071 -11051 -5140 -4507 -6676 -8461 -4673 -4247 -10382
19335 -10382 -12509 -6557 406 7366 4242 660 -6488 -6723 -6594 -3894 -6726 -5177 -63 1900 -240
19320 -240 -5139 -6932 -2543 -2805 3589 2116 1492 5192 3708 -1574 -4845 -6314 -6879 -718 -1980 -7679
19304 -7679 -4994 2048 4993 1706 -2780 -1397 2498 8523 2585 -2950 -2764 -2018 5473 4717 5622 6875
19288 6875 7643 -292 -6320 1953 4514 6326 7918 11322 4702 1162 -734 761 -844 -27 2497
19273 2497 7095 6244 5067 6710 6635 3821 -4175 -829 1165 -2149 1001 -517 -10137 -10817 -7902 -3187
19257 -3187 -4687 236 -4701 -6053 -4578 3846 7566 3123 -3772 -8281 -11623 -12742 -7446 -6323 -6508
19242 -6508 -3360 -3514 955 5313 -2235 -1290 -6197 -8372 -8294 -10774 -5967 -6387 -5104 -1649 148 1827
19226 1827 4389 4263 5349 -999 -563 4769 2344 2213 461 4703 1792 -2063 -5327 -7005 -3214
19211 -3214 3638 2207 -1003 433 4129 1794 -4809 -7205 -6015 -9036 -7228 -3356 1970 -9802
19197 -9802 -13852 -9273 -3746 1073 1839 6670 3423 1711 4061 2305 -4795 -6163 -2546 -1829 -135
19182 -135 12353 18538 17024 15725 22376 21124 18760 20651 24815 27008 21560 11863 10622 4581 -791
19167 -791 2646 11025 17865 23705 27185 23263 18279 12789 10263 15573 17608 21431 21952 17722 7994
19152 7994 5392 4696 4309 -216 482 2705 3533 6234 1688 -7812 -14873 -17184 -12580 -6609 -4707 -2284
19136 -2284 -3496 -12342 -7756 -8469 -15419 -12331 -5180 -3014 -4473 -6100 -3060 -1330 -1748 -3673 -3633 317
19120 317 -11465 -16329 -10099 -4396 456 3836 5064 6380 -424 -4829 -4566 -9142 -17353 -8709 -2787
19105 -2787 1334 1571 -8285 -5435 -1956 -1312 1285 4546 5924 3280 2941 -2218 2290 2983 1514 210
19089 210 1596 3544 7888 4272 2054 -6175 -13211 -14166 -9545 -1692 -2715 -1911 1035 695 3064 3584
19073 3584 7838 9106 4313 -414 -1773 -2682 939 8993 8607 8608 5395 -6416 -4548 -463 458 -7728
19057 -7728 -17603 -27326 -18459 -17467 -20894 -20080 -14444 -6690 -7263 -5802 -1869 1101 -4463 -5772 -6351 -4401
19041 -4401 -118 4223 1447 -981 -3483 -3609 2505 -549 -6423 -3688 813 -349 -891 8632 6684
19026 6684 7880 7270 3627 1391 -2623 -3395 -5412 -3729 463 -1147 -2000 -1696 -2761 -8692 -6936 -3085
19010 -3085 5637 11409 5554 -2585 -2751 1076 9115 10457 3382 4645 99 -3466 -7012 -3026 -803
18995 -803 3073 -2492 -9908 -8798 3412 2780 1111 -4328 -4179 634 4765 10567 13292 11313 6552
18980 6552 1594 4493 8318 11420 8611 3091 1441 -958 4617 4891 3017 4378 -901 980 1564
18965 1564 -79 10044 13441 13680 8541 -955 -561 -699 -3354 -2073 -348 3659 2242 -3767 -10000
18950 -10000 -5712 5718 3651 932 6633 9917 6054 1229 4469 4264 2377 680 7468 13832
18936 13832 9161 7256 6490 -102 -3204 -7832 359 6408 5076 1893 7825 7963 3325 -7360 -13522
18921 -13522 -9976 2288 10335 15485 11676 8974 11782 13950 10024 10500 10830 6811 -553 1068 4447
18906 4447 5137 5898 6166 6823 3420 5987 798 6849 11101 12608 4739 922 5285 -4542 548 8707
18890 8707 12228 14075 14631 9302 5731 6779 6961 4358 -674 -5891 -7871 -9769 -12371 -7300 -155
18875 -155 2220 -453 -7941 -20128 -13010 -5868 -5749 -35 4021 2001 3765 3823 -1155 -1495 3834 1636
18859 1636 -2384 -4461 -2527 1144 -1493 1432 3388 -232 2592 2032 2379 4647 13810 12818 11058
18844 11058 6716 -1969 4230 6565 10723 11324 10774 15153 14585 12156 14583 12714 2270 501 -638
18829 -638 -1286 225 -1444 -2897 -4409 2646 9323 6673 2765 2848 4665 1596 4955 9909 7589 8553
18813 8553 8244 6967 891 -2766 -3173 -2575 6626 9680 8793 14348 8167 991 -2032 197 -4425 175
18797 175 2428 269 5406 8109 4661 7513 9780 8786 422 -5843 -5312 1385 -912 -3793 3568
18782 3568 11217 11221 6173 -679 -5636 690 11204 18462 20048 11664 12117 26667 43236 66287 93340
18767 93340 83405 62935 39752 24939 9442 480 173 413 -1065 1669 4114 1046 2354 3139
18753 3139 3258 5444 4505 5436 5995 2952 5457 3753 2135 -185 -611 -5620 -9074 -8157 -4765 -2117
18737 -2117 335 4477 10349 16160 19234 12579 3705 2451 7076 13031 12017 8506 12174 12720 134
18722 134 -2530 5278 6570 7892 1574 906 3926 11351 12917 16302 17813 13881 5292 3642 3698 948
18706 948 2807 2175 -204 3726 4830 5356 4159 5497 6499 1235 -3303 4272 8758 14283 20847
18691 20847 24312 15524 11984 8558 4035 5242 6604 13810 10286 11683 14376 11620 4708 1745
18677 1745 4145 7584 16811 21503 19379 18153 17483 20608 24492 22407 21259 22867 24871 19493 18444
18662 18444 22369 23093 16822 10329 8242 9728 7859 12694 18905 21095 23087 26646 30132 43602
18648 43602 54054 66577 78412 91182 119132 162960 230244 307771 379765 438619 460657 424838
18636 424838 351538 268318 186578 125665 87104 64215 52473 50724 58245 50099 45501 37665
18624 37665 29892 30556 32805 34733 28527 21908 22814 25247 27754 31507 35887 51906 63682 75313
18610 75313 86136 106865 139724 200323 283441 367067 442763 494964 471539 406264 328550 246349
18598 246349 173299 117805 85759 73598 58950 41105 32287 24810 25489 27453 24280 24645 24012
18585 24012 18434 16857 12920 11730 13280 13819 16865 22166 23878 16775 14570 12748 10625 12106 16912
18570 16912 18511 9952 10513 12040 16415 21955 20193 17765 16849 14480 9792 10805 8871 7685 4398
18555 4398 6251 14002 9944 3098 1482 2367 6669 14484 10443 10792 16106 18946 12722 3860 4959
18540 4959 10715 14075 15488 14599 11045 8748 6610 9314 11413 7245 6254 8669 1410 -855 2501
18525 2501 6574 9253 9068 7847 6314 10802 6487 1121 -2060 -5429 -7476 -2845 -31 -741 -553
18510 -553 1095 3602 6935 5251 6156 7663 7024 13981 19848 19713 23962 24644 18554 12266 10372 10934
18494 10934 11906 8312 3280 4590 9771 9834 7904 3163 6024 12534 10159 2159 -2247 3441 2237
18479 2237 1301 -540 5419 724 -4942 -3797 -2893 -1197 5503 9762 13344 18389 21520 21718 20022
18464 20022 17438 14313 7611 4338 1769 8466 12918 5472 6363 3510 2909 9436 18018 20716 24065
18449 24065 27009 21614 16543 12878 16010 20584 20928 18057 21700 25911 30468 27406 21305 20913 22513
18434 22513 20069 20442 21685 21473 20076 13901 7946 1104 5047 5278 7132 11721 8596 8659 7744 9113
18418 9113 18169 16285 11730 6392 1726 4072 10835 6719 5335 10045 6389 4030 820 2044 5352
18403 5352 13322 13547 12456 14987 18725 18104 14937 21014 23425 20252 17747 11171 9549 11296 9773
18388 9773 17702 20576 17517 6035 1587 8588 10984 14112 20592 18044 16669 15103 18600 20082
18374 20082 18333 26396 35530 38611 37670 34388 25524 20866 13498 14636 21622 26155 31831 32669 29078
18359 29078 21822 22628 24017 22158 16301 14651 19668 25334 23731 17994 12392 6043 3413 8776 7025
18344 7025 7668 12725 14623 10708 22022 31729 41321 38173 27985 22689 18001 9669 11190 13699
18330 13699 18959 21195 21216 24324 29708 33590 34509 33832 36289 47141 48290 42776 38222 27107 26173
18315 26173 25530 21324 16042 19085 26791 30994 28948 32950 34470 32585 31968 23919 25453 30964 29494
18300 29494 34615 43509 43205 46147 51053 56538 52938 52877 55242 44809 39717 36730 33149 34198 36651
18285 36651 32833 28598 26842 29648 29070 34987 49506 56232 57589 69492 80986 81144 76440 75383
18271 75383 72848 74506 74777 63448 60851 63190 65309 55444 56045 59956 54317 56033 61823 60992 57376
18256 57376 59066 55483 51692 42252 39397 30809 31086 34564 31062 29268 32575 35930 40571 40643 35716
18241 35716 41561 41336 49228 60099 69356 72683 72293 64101 60322 58981 49305 35981 29258 29981 32560
18226 32560 32617 30643 32594 34195 30540 31998 37950 45733 43650 49592 54482 55936 60205 65547 58226
18211 58226 53944 55204 53175 54169 52805 49816 49426 50694 53209 53214 62289 69586 70291 70960 67896 57791
18195 57791 52303 53655 56940 57121 63785 72081 75145 70475 65468 68079 72921 71459 77653 80142 90231
18180 90231 103351 113274 135480 156558 173183 175322 177671 180318 182464 192596 203148 203204 205115
18167 205115 199458 197817 189079 181795 172296 150470 131332 118019 112480 118351 118120 122509 134273
18154 134273 151713 170975 183650 209291 233633 256074 291728 331914 380619 418515 467895
18143 467895 557064 681555 805006 919090 953456 911749 817817 692919 597420 540176 489883
18132 489883 460967 441382 435734 458584 500055 574128 691783 851496 1042237 1231484 1402502
18121 1402502 1556592 1662337 1761311 1890227 2067688 2307072 2673998 3298381 4429748
18112 4429748 6451001 9696742 14275489 17136189 14458267 9529927 5615672 3560086
18104 3560086 2464148 1821704 1417885 1163749 1004554 913232 860417 832522 828364 858898
18094 858898 948644 1107728 1328024 1575783 1821296 1947958 1901549 1684718 1380589 1089275
18084 1089275 872504 742659 684803 665313 678276 718343 776283 859975 958969 1064683 1168189
18073 1168189 1255021 1325876 1381587 1440511 1502171 1538707 1573722 1626678 1719910 1877671 2125884
18062 2125884 2490853 2990249 3674510 4585530 5750799 7217655 9069354 11442539 14698701
18053 14698701 19503008 26854403 37848706 51970642 64722587 75560241 78904932
18046 78904932 71382088 58588687 43426301 29643640 19383310 13287940 9871604
18039 9871604 7858506 6612725 5800391 5251050 4853895 4544224 4243031 3959547 3731343
18030 3731343 3592168 3585962 3733134 4033921 4502825 5155423 6023364 7151450 8568399
18021 8568399 10331243 12523086 15418757 19624418 26138640 36279732 51025147 67295045
18013 67295045 80919416 91038234 88393644 76488652 59895595 42608914 28088093
18006 28088093 18270679 12613285 9311006 7249581 5898879 4979729 4303915 3792529
17998 3792529 3354584 2967125 2628382 2343319 2124710 1988229 1918147 1885075 1870715 1843424
17988 1843424 1793501 1717838 1624531 1485973 1310180 1140178 970067 829975 726194 651307
17978 651307 625126 611893 600268 589471 567214 543026 531194 529859 513882 489295 458510 427001
17966 427001 411019 406681 397355 390251 376195 355444 334208 330975 327876 320950 303622 283735 278063
17953 278063 275931 272093 261668 252451 236518 229836 230446 233310 231186 232051 224568 210807 189149 175775
17939 175775 172481 176267 173699 164774 156713 150447 145743 139477 133878 132549 126438 114174 103098 93792
17925 93792 86142 72056 63048 58405 60012 64005 69719 77701 87470 95921 101642 107197 102743 93908
17911 93908 90769 94306 90804 92746 90119 102239 112168 116028 120021 122862 121180 123275 131463 146097
17897 146097 148584 146549 143928 150756 166548 186466 214974 261656 327959 384964 398985 407261
17885 407261 460789 569458 710470 797439 814255 807633 791428 794842 824501 862478 918879
17874 918879 917330 821071 721320 694521 747250 791258 754020 681919 650024 699716 789508 807005
17862 807005 768429 725215 685690 678079 696519 720213 748818 699830 578442 461350 400146
17851 400146 392488 393712 354523 290577 228847 178786 154255 136394 132515 128728 123244 115349 105614
17838 105614 106951 113323 121574 120621 111408 103798 94184 94155 91330 89960 78818 76344 80994 90071 103967
17823 103967 120295 142957 157711 168364 185167 179615 167701 162035 162949 171565 180799 188641 191039
17810 191039 182256 160597 147531 126393 104904 98960 90080 88612 95332 92638 81536 76633 78890
17797 78890 85679 93502 97188 94915 96108 106386 122774 133894 142552 153568 150608 142950 123350
17784 123350 114446 117045 124737 143346 166637 169502 156977 146203 137696 135545 151114 165882 178741
17771 178741 197131 222198 259790 322592 422314 564061 739579 894333 1020108 1036442 957506
17760 957506 850204 761797 730772 770567 842798 913429 913664 817809 681224 529637 392671
17749 392671 293594 232674 199791 185353 174523 169303 168779 171243 190864 216942 243477 275031
17737 275031 314386 384129 507977 662400 805919 938612 1008804 993428 950041 902068 876457
17726 876457 888945 910854 928975 905703 799617 660596 520079 402564 320085 279663 262551
17715 262551 253526 243700 235404 222372 207539 197244 178551 161735 142774 125991 116377 108066
17703 108066 105070 98683 97352 102768 103053 114142 138033 168962 202451 242358 280824 313933 313128
17690 313128 288062 260667 233869 209847 195600 182686 170916 176106 196490 213897 221087 220192
17678 220192 213589 217207 225246 227779 223514 216599 205502 178446 156163 145122 134056 124458 126657
17665 126657 141126 156255 166616 167105 165783 163543 159505 151236 140916 136967 137568 140978 150592 157317
17651 157317 170799 183041 191569 192098 195663 198535 193458 200085 206456 204561 207332 211975 222106 236178
17637 236178 264779 285107 316248 367431 441654 538608 636656 725887 774569 753280 700376
17626 700376 612135 535976 494036 487451 492692 512798 547973 582106 612480 656921 710511 784127
17614 784127 886624 1029399 1219103 1455075 1710521 1965265 2156184 2333467 2506296 2679858
17604 2679858 2880935 3134994 3439941 3906216 4619098 5678193 7141957 9048803 11463513
17595 11463513 14508492 18649526 24794401 34283944 48541834 66125732 81612312 93048269
17587 93048269 91040657 78630901 60366478 42021584 27491963 18133421 12791928
17580 12791928 9612821 7598130 6286617 5446814 4937249 4656270 4549537 4551770 4580614
17571 4580614 4631445 4621246 4545508 4441384 4359488 4398282 4662333 5219160 6120687 7396774
17561 7396774 9066180 11190529 14004659 18087703 24412012 34241956 48299828 63057225
17553 63057225 75480184 81324859 74820989 61516905 44969875 30353168 19782978
17546 19782978 13479400 9781174 7430034 5828332 4719240 3948054 3400559 3038969
17538 3038969 2814979 2693584 2632798 2574135 2451004 2224023 1926003 1623767 1366787 1171883
17528 1171883 1029897 926508 844158 782307 725646 674480 621791 586045 568956 561841 556498
17517 556498 554574 577950 605392 643963 701376 754390 788016 758818 678379 570172 465339
17506 465339 386619 324762 285509 261806 251368 251230 247445 245193 236703 227108 214138 201238 191507
17493 191507 189445 195006 192068 195285 192482 181994 175312 173948 165915 161134 154055 150337 137231 126670
17479 126670 131993 134631 135879 137895 140307 134136 128511 131656 137537 139968 138038 132949 120174 94813
17465 94813 69013 56473 54604 47951 44494 48573 59204 79280 100776 117409 132045 141712 152255
17452 152255 173940 198259 238004 311429 408894 521565 624300 707134 717021 659582 556716
17441 556716 422181 302573 225555 174790 149803 128482 114848 105589 93227 72670 51442
17430 51442 21024 7773 -2631 -11808 -11427 -5803 5628 13842 32296 60697 80322 86743 96775
17417 96775 106176 109484 121660 151038 184806 245849 308602 356269 375423 355103 305602 231016
17405 231016 158256 109342 86390 62212 46799 45477 44757 41891 42679 42997 37488 42115 40246 31579
17391 31579 35458 28779 24695 24710 28134 31112 27691 27355 30286 35543 35894 36146 34869 34538 29344 26714
17375 26714 26754 24640 20122 21618 27913 31450 22958 18263 21513 15721 19280 18666 20350 26607 31693
17360 31693 27514 27954 32752 31437 30540 29154 22689 16878 17518 20697 26038 21414 18990 17094 12152
17345 12152 2546 -375 5584 11531 13205 11295 8932 6688 8537 9820 10217 7357 475 -7578 -3421
17330 -3421 3824 9722 7181 9262 9130 7604 10575 9087 6823 5153 3856 2833 9170 7674 10299
17315 10299 9871 3024 3438 2558 5981 17212 15028 9901 14257 12693 6033 8035 14977 16682 19321
17300 19321 25421 28371 28998 30718 26173 24601 23207 19630 15626 11089 15429 22366 22383 20331 18725
17285 18725 21012 23760 23219 21120 17574 11804 11943 4435 2280 5850 -1768 -5325 1234 -404 -271
17270 -271 5246 9972 15790 17120 18376 24621 15918 9531 3327 360 -346 -1162 4367 7600 7030 13585
17254 13585 15885 14287 8888 10361 9455 11591 13931 4237 1374 -2566 2525 -1858 -5856 -5426 -7933
17239 -7933 -7647 -917 3747 3539 -1173 -9961 -1849 3 -2768 8037 17414 7962 -1169 8693 14923
17224 14923 10063 -714 -3475 1217 -2557 2171 9062 11881 4338 2144 -1112 667 4375 3143
17210 3143 4489 -2700 -2078 509 1534 231 -1357 -1329 -11854 -9555 3846 12415 18184 15040 6384
17195 6384 3251 647 -8351 -11107 -9698 -5441 -3373 -5055 -2608 -4272 -5584 -3538 -4231 -7111 -11126
17180 -11126 -10813 -5720 -2748 -2678 450 4684 3885 -1044 -6343 -6839 -7903 -4467 328 1225 8450 10373
17164 10373 6425 7529 7762 9722 9613 8674 10044 5438 4271 6024 2847 4219 -839 -2891 -3740
17149 -3740 -730 -3291 -6271 -750 8144 12473 16986 16041 12955 2585 -5151 -2022 7354 11603 1915
17134 1915 -8053 -9480 -4452 2189 3405 5398 -230 -3429 -5579 774 5210 13331 13609 3603 -2319
17119 -2319 -17642 -23005 -16213 -14934 -13921 -9963 -3698 1984 10591 12482 6520 5440 -372 -7757
17105 -7757 -9223 -7335 -4130 -3 -3604 -5912 -8038 -7030 -6637 -8559 -11170 949 6994 4410 5321
17090 5321 7370 5458 9076 7317 4715 7601 10200 10951 14546 16937 14619 8284 9128 6881 -792
17075 -792 2956 13588 18754 16978 11891 8530 11728 11495 17042 16809 14012 11383 12915 20664 29328
17060 29328 40799 58470 71789 87717 123279 180928 253892 340939 412646 467419 464463 401869
17048 401869 313553 227126 147089 97700 66527 49549 41601 31822 18698 10983 15752 18438
17036 18438 15790 13484 17702 23090 25509 27870 28151 26701 25933 28181 36479 43056 51649 59604 74337
17021 74337 101423 138677 185336 264011 343852 417049 443913 399794 325465 242271 163567 106640
17009 106640 73961 52766 40353 28942 25411 23935 17573 11230 10476 8091 7112 9177 3895 -1065
16995 -1065 -3447 -7035 -11144 -9984 -2955 1841 -1286 -9032 -13111 -17801 -14529 -5750 -3910 940 2355
16980 2355 -10182 -13074 -7316 -8546 -10721 -9469 -9255 -752 6710 4250 -4720 -2641 -4764 -7510 -4265
16965 -4265 -10743 -18515 -21159 -14721 -8359 -1361 3995 4816 111 -7233 -7579 -14039 -14799 -9652 -2397
16950 -2397 -2204 -5424 -6673 -6077 -1756 -5913 -13294 -21049 -19361 -19760 -18455 -20017 -17436 -11423 -1525
16935 -1525 -2820 818 930 -3289 -5521 -3549 -13817 -25341 -22331 -16023 -9293 -11581 -15698 -4780
16921 -4780 206 1001 2660 -198 -1282 1214 -241 160 3032 5443 4387 1454 -3101 -4226 -1558
16906 -1558 -9085 -3675 -994 -8966 -9798 -2349 3087 1294 -5250 -6752 -1519 -7928 -10247 -6288 22
16891 22 6818 10264 8894 11065 16298 19258 15337 5559 -4757 -8164 -9984 -6348 -5386 -3398 -9825
16876 -9825 -11245 -5121 1659 2298 -1496 -8135 -11363 -4382 -253 -2618 -2509 -3808 -3496 -8026 -9556
16861 -9556 -10333 -14595 -18830 -16811 -7353 -9699 -11539 -8435 -1472 -1227 -1736 -430 -3539 -2247 -3380
16846 -3380 -7212 -5608 -9249 -8416 -7257 -3325 -5004 -9839 -10401 -16056 -13070 -10503 -9854 -2249 2127
16831 2127 -1808 -2568 -7387 -9631 -5446 -4116 -6441 -14478 -14052 -11329 -13786 -14964 -9700 -8230 -8414
16816 -8414 -10440 -11197 -5082 871 1337 -398 -7128 -5287 -2565 86 -8097 -8059 -9 3022 1441 -4680
16800 -4680 -7681 -9657 -16175 -17697 -15935 -15770 -18189 -13936 -7426 -11635 -11364 -10997 -7893 -5442 -4181
16785 -4181 -4627 -8012 -10523 -10085 -9169 -6432 -7461 -2275 -4154 -4563 2963 4652 -277 -373 -2532 -7715
16769 -7715 -8756 -3288 5317 7953 404 2139 2498 -6482 -7419 -7233 -13595 -15787 -9392 -9639 -13461 -8640
16753 -8640 -7879 -13430 -10095 -10870 -12187 -14393 -7782 -2554 35 -2146 -8351 -13628 -10162 -4531 -807
16738 -807 -4234 -9146 -8775 -11312 -6663 -2300 -5023 367 -1065 -7108 -8965 -2005 -1203 -1679 -4830 -7227
16722 -7227 -9658 -10671 -7869 -4783 -8810 -9810 -13380 -13353 -15651 -14835 -8842 -7070 -11254 -11811 -10593 -12446
16706 -12446 -2451 -644 -10201 -18988 -18072 -12559 -14136 -16674 -10996 -7298 -6730 -8411 -5451 -8343 -11288
16691 -11288 -9839 -14664 -19578 -20217 -16432 -20347 -20886 -16642 -11594 -6656 -3800 -8264 -10324 -15202 -13337
16676 -13337 -7694 -9423 -10859 -6698 -1813 -7105 -7937 -5048 -1882 -2441 -6201 -5016 -429 -2837 -10441
16661 -10441 -10388 -9624 -8645 -9062 -7433 -5647 2316 -2085 -2675 -2628 -5021 -8001 -5255 -38 3647 828
16645 828 -5286 -7895 -12093 -13548 -11618 -3366 -5734 -8317 -4550 -4818 -6416 -7942 -1514 961 -682
16630 -682 1870 9975 8440 590 -1255 1616 -5428 -8070 -6264 -1754 -7393 -13510 -15679 -17643 -18359
16615 -18359 -11335 -12219 -16777 -12095 -10872 -19458 -13424 -5121 -1301 -1594 -1334 -3103 -7699 -6104 -4439
16600 -4439 -7429 -8354 -9612 -7650 -6946 -3385 -2930 -10649 -12497 -13047 -6876 -2859 -5372 -5142 -2980 -12753
16584 -12753 -14270 -8991 -4964 -4082 -5413 -5959 -3595 -1753 -8136 -13864 -7381 -274 -4203 -9484 -8826
16569 -8826 -5594 -5558 -7437 -12444 -18685 -19081 -11713 -8031 -7199 28 3361 -8244 -10382 -6653 -3773
16554 -3773 -781 -1672 343 3073 4877 1512 -270 -2436 -6766 -6957 -17687 -26208 -24376 -13987 -9230
16539 -9230 -4795 5340 15227 11309 6512 -2348 -5929 -5063 -6303 -4433 -5005 -4514 -6301 -9128 -12308
16524 -12308 -10859 -7006 -8466 -6304 -5128 -1273 584 3777 3052 -3456 -7464 -5903 -8996 -11928 -18010
16509 -18010 -19773 -10896 -1791 -1887 -7614 -10272 -10906 -8872 -3044 -435 -1283 5208 5759 -965 949 2864
16493 2864 -1350 -828 1124 -682 -3954 -5053 236 2858 -4526 -5877 -7855 -10210 -11894 -5677 299
16478 299 1573 -3486 -4430 -3197 -5912 -3491 -7250 -2541 3144 3488 4868 -790 -3122 -4240 -5073 -1753
16462 -1753 -2726 -6268 -823 3232 -555 -4201 -7820 -9791 -7043 -3866 -9122 -5840 -6048 629 -4119
16447 -4119 -5729 -1636 -8285 -4612 -6979 -8191 -6826 -10370 -11094 -5484 -4258 -5188 -1834 3949 2711
16432 2711 -4538 -9136 -11653 -7496 -9594 -4766 -4487 -3654 -2623 -11047 -7944 -4123 -9735 -992 2087
16417 2087 -3423 -8119 -12050 -19004 -18832 -12283 -9198 -8670 -3575 4044 1809 3406 -3905 -7811 -5994
16402 -5994 -4977 -3241 -5145 -14524 -15896 -8820 2117 5913 5930 3667 2921 -273 -9271 -11745 -7969
16387 -7969 -12666 -11809 -3210 -3945 -6053 -4890 -10310 -14508 -20453 -19219 -8556 -188 652 -2466 -2603
16372 -2603 -4173 -5711 -9597 -10319 962 -1536 -6723 -2563 -2951 -10885 -14484 -7437 -1055 -6702 -4942
16357 -4942 -2812 -5247 -1411 -3875 -2091 -3469 -771 2010 4382 7747 5854 1845 -6161 -8953 -6867
16342 -6867 -13549 -13193 -6660 -3853 -5895 -9078 -6789 -6944 -11971 -13472 -11308 -6529 -5625 -12390 -14929
16327 -14929 -13754 -8926 -5919 -839 -7362 -10305 -9569 -12478 -5030 -3824 -7405 -8980 -4700 -2555 -6116
16312 -6116 -13494 -6319 3683 2749 2110 -2015 239 988 3604 2798 -1806 -2090 -1337 2460 4814 5435
16296 5435 2098 1308 -8241 -11569 -6810 2653 3159 4861 3111 -326 -3418 -8746 -8093 833 -1271
16281 -1271 -2230 -4727 -4813 -3356 -5465 -6708 -4088 -6394 -2845 -296 -564 -4821 -14714 -12496 -12076 -12564
16265 -12564 -10620 -8694 -8581 -8568 -7038 323 9448 5369 -854 -4454 -792 3097 -596 -34 1078
16250 1078 1523 5389 2605 1038 -4813 -10436 -11000 -6527 -10075 -13259 -15521 -9123 -9928 -10754 -6764 -6318
16234 -6318 -10714 -14086 -9467 -2620 3621 2251 3597 3183 3487 4262 5161 2197 -2307 -3774 -4139 -7616
16218 -7616 -4960 -8263 -12782 -13366 -6811 -4686 -5159 -3518 -3422 2286 467 -8504 -9334 3783 5893 744
16202 744 -1263 -3211 -9733 -15960 -17962 -20676 -20692 -17673 -9104 -7385 -10498 -7833 -2657 -1833 2438 -3341
16186 -3341 -9556 -5151 -1201 -5443 -4295 -7661 -5685 -1999 -3656 -7403 -9716 -5367 319 -1913 -6977
16171 -6977 -9060 -13342 -9576 -7541 -5963 -8151 -10045 -6149 1753 -123 -4327 -1591 2887 444 -8567
16156 -8567 -10232 -6371 -2278 -9050 -16174 -20046 -16984 -14119 -10272 -5807 1023 -5803 -11135 -10778 -10907
16141 -10907 -11002 -12750 -15112 -13265 -15185 -20292 -16225 -13258 -4277 -3424 -8536 -8869 -11152 -10703 -13517 -12351
16125 -12351 -5005 -4759 -4326 -4445 -1162 -7916 -12324 -9945 -5690 -5850 -4406 -6021 -3202 2376 6136
16110 6136 11203 10406 1540 -2558 5561 5926 -1715 -6345 -9138 -13889 -12323 -8819 -5996 -5902 -4211 -6467
16094 -6467 -14934 -12251 -6968 -7060 -12344 -15737 -13474 -4546 -3065 -4751 -434 8223 11880 9257 10163
16079 10163 11406 6287 -652 -5071 -12012 -9580 -10956 -11519 -13013 -9795 -7931 -6232 -2444 -1813 -1101
16064 -1101 1474 -2116 -5337 -5466 -9137 -2638 6272 13770 14145 10116 1500 -1281 51 -473 3513
16049 3513 5261 5577 1269 2369 1416 -346 -5580 -4068 -2179 4970 891 -5120 -7694 -5948 -3759
16034 -3759 -8371 -4900 -8953 -8905 -8765 -8374 -8588 -10199 -11517 -8445 4063 6186 210 -706 2996 3369
16018 3369 -2978 -9902 -8581 -2079 4134 9703 10712 6431 1147 1947 -1386 -9168 -6368 -1164 -1282
16003 -1282 6020 1530 -2984 -3088 -1180 407 4874 5775 5033 3085 -6318 -5677 -4738 -6432 2817 8467
15987 8467 7494 6829 1004 -4786 -8472 -10451 -15099 -18679 -9364 -5489 -7986 -154 1901 -3750 -2499
15972 -2499 -3492 941 3707 -6785 -11082 -8015 -11460 -12747 -6705 -9379 -14669 -10813 -160 -580 -2425
15957 -2425 2930 3633 -457 -5259 -7509 -2772 3573 1706 -2056 -10784 -12419 -14698 -12191 -6213 -796
15942 -796 -4874 -9491 -10344 -9077 -7579 3091 1530 -6274 -9940 -11775 -11311 -11442 -6240 -1086 2422
15927 2422 4418 1299 -4470 1925 6988 4688 2433 7054 7343 11123 12457 13176 8400 -4674 -8147
15912 -8147 -5171 -2909 -5337 -29 4225 4460 -845 953 -3320 -1321 4242 2238 3889 2137 -1433
15897 -1433 2902 8633 10879 13150 4946 -5331 -5275 -4315 -1463 -2504 -5432 -7742 -3200 -4724 -1988
15882 -1988 751 -5898 -11260 -13089 -6098 -5952 -9025 -10402 -9909 -3474 -2577 -2265 -4653 -3719 -1500 -7817
15866 -7817 -19350 -22445 -19793 -21387 -16715 -8286 -6992 -11371 -9715 -4264 -893 -784 3462 10101 4941
15851 4941 -3272 -11377 -10810 -6772 -2165 667 6016 3306 -4037 -6203 -5171 -6997 -5358 -1973 359
15836 359 3531 -835 -7104 -13438 -18205 -14770 -8581 -12952 -18577 -13534 -13349 -10269 -6393 -2905 -1451
15821 -1451 5875 7130 -3854 -13955 -15827 -9611 -6126 -8910 -3611 -922 488 -5337 -12864 -9128
15807 -9128 -7555 -9677 -7536 -2466 -4125 -8984 -7286 -1980 -415 -3592 -3695 -6551 -5695 -11140 -12021
15792 -12021 -14552 -14657 -9242 -5687 -7248 -9718 -2759 2775 306 -1967 -6717 -11053 -8246 -8206 -10592
15777 -10592 -11805 -10401 -10481 -6647 -2156 -1589 -9464 -10810 -9983 -6630 1139 12447 15143 11883 4137
15762 4137 1420 1875 -4174 -5591 -5188 4220 6369 -954 -8840 -3758 -644 -52 -3654 -5730 -7271
15747 -7271 -13004 -16616 -12524 -7357 -4735 -2860 -8704 -5021 5490 2368 -7099 -8296 -5009 -4357 -9158
15732 -9158 -5468 -7090 -5679 -1366 -1793 -4113 -45 -559 -2894 -4026 -9632 -10874 -12070 -3572 -3802
15717 -3802 -10635 -13696 -11072 -5321 -3654 -7597 -2947 1707 345 -8280 -1392 -2077 559 1029 1840
15702 1840 -3850 -5328 -11285 -15695 -14585 -8222 614 4366 6937 1600 -3392 -7336 -8599 -7488 -10993
15687 -10993 -11416 -4480 -2775 -1726 3424 765 -9039 -4971 -1970 -738 -5497 -9481 -10771 -12024 -12945
15672 -12945 -6872 -798 -6803 -11199 -15486 -11799 -6197 -4538 -6488 -5689 -13298 -17073 -16309 -10523 -6711
15657 -6711 -5867 392 2938 -6687 -14013 -10964 -2973 -1310 -9830 -8006 -1534 -7917 -16469 -15438 -5466
15642 -5466 -1247 257 -4443 -9512 -12333 -11494 -5809 -5974 -5635 -808 -1367 -266 -13611 -14809 -3581
15627 -3581 -6601 -17634 -14076 -12479 -9448 -1971 505 -5426 -15051 -11351 -5952 -8252 -9025 -7614 -9228
15612 -9228 -7258 -2035 176 8400 10456 7922 5588 -197 -1022 -3926 -6945 -174 5492 1355 3697
15597 3697 1363 -16877 -18819 -16265 -11277 -11215 -6955 -981 3679 -1904 -2777 1123 3105 5213 3061
15582 3061 6286 -20 -12154 -10441 -9565 -3626 -2456 -3416 -4207 -1581 1885 4136 7677 11722 6497
15567 6497 -257 -5352 -1945 -1158 -7973 -10931 1509 4839 2951 2595 2462 4310 6254 -664 -1436
15552 -1436 -2398 -1771 -1430 -1824 -5398 -8642 -8290 -10112 -10816 -7869 -13320 -13333 -7346 -3532 -10195 -12001 -15093
15535 -15093 -15027 -17009 -22162 -19347 -10890 -7314 -2662 1540 4857 -3153 -9646 -13747 -10950 -2854 -941
15520 -941 -2811 -6544 -6541 -8320 -12167 -11870 -6366 -11996 -16653 -6216 -1687 -5839 -6197 -3178 -4416 -663
15504 -663 1943 5083 -2765 -7224 -8945 -5236 1601 4443 -4922 -4081 -4503 -462 4031 6515 4809
15489 4809 49 246 4991 6116 5873 4099 604 -93 -2519 -2061 -2958 -2258 -3586 1239 8005 11621
15473 11621 6617 -15 -2597 -393 4624 4010 3498 2037 1658 -3765 -7094 -2393 -3741 -8168 -10917
15458 -10917 -8703 -6907 -10686 -12723 -7705 -4634 -3894 1146 553 -2282 -5029 -3602 -2384 -11107 -17940
15443 -17940 -16313 -16457 -17311 -18225 -12188 -10569 -7437 -3935 -6825 -17954 -20879 -15078 -5487 1576 6487
15428 6487 7587 -493 -9296 -5646 6818 7953 2536 -2019 -5400 -9323 -1958 128 -4410 -5536
15414 -5536 -4263 1693 187 -8921 -11578 -11901 -7474 -10105 -7061 -6919 -2809 -4292 4802 8428 2536
15399 2536 -3716 -10743 -18569 -19272 -15502 -14509 -10923 -6610 -3269 2156 13 1339 -869 1534 4002
15384 4002 1529 -2614 -12134 -17587 -16402 -15190 -9220 -7279 -7607 -3898 -3249 -9682 -6199 -1398 -5115
15369 -5115 -3782 -4083 -1338 -5261 1028 8425 11273 13722 14870 11783 4603 -1381 2981 3406 4735
15354 4735 430 -6296 -12317 -16171 -11755 -13861 -7051 -395 4941 3573 4337 -1682 -3132 1148 -847
15339 -847 -886 3282 1154 -5856 -5799 -2615 -4310 -1375 5903 5847 -5305 -10178 -5893 -1117 6041 6166
15323 6166 1188 -6168 -372 2294 -1206 -6158 -11115 -7001 -5008 -1129 -1011 -1222 -3528 465 -124
15308 -124 -449 -683 -3023 -1754 -3616 -6713 -8318 -9133 -3233 388 -5784 -8010 -7804 -4716 -7786 -2145
15292 -2145 8414 8159 4349 9443 2160 -317 -2699 -4232 -5495 -8926 -3641 -170 -6327 -3187 -4710
15277 -4710 -7670 -7625 -5447 -794 573 1018 5160 -1370 -7978 539 7298 1908 -3206 -10750 -12233
15262 -12233 -7935 -6181 -4563 -4237 -6747 -8127 -6313 -1300 -7655 -6306 -8263 -17344 -20520 -17147 -4263
15247 -4263 -6402 -21290 -25838 -15689 -9214 -9127 -8971 -6096 -1029 -4481 -6831 -5422 -6435 -10735 -13929
15232 -13929 -8093 -5781 -5763 -885 2403 4035 2493 -321 -5159 2441 6730 659 -2324 -4318 -6478
15217 -6478 -7753 -8744 -1991 4167 4100 2621 -2041 -3588 -7792 -12049 -12519 -13111 -12382 -12796 -8604 -6685
15201 -6685 -11777 -15382 -7301 -5701 -2192 3963 4636 3362 4121 2090 -5939 -9549 -6487 -5387 -4031
15186 -4031 -9536 -13747 -5154 504 4730 9591 1750 -6022 -2477 -2159 -3203 -1753 -3840 -1748 -7854
15171 -7854 -9743 -4040 76 -530 1769 5632 845 635 -3448 -8538 -8792 -4569 120 -4550 -5997
15156 -5997 -2414 4887 1015 -1674 4401 16365 17020 14439 5677 9925 8124 -1962 -6301 -10721
15142 -10721 -8108 -5996 -2049 -549 2173 -321 -1161 -1842 1945 -3134 -5959 -3715 -1795 1669 7170
15127 7170 752 -3327 -8418 -11159 -15261 -15340 -7825 -4402 -7707 -11100 -8979 -7871 -12220 -11059 -6168
15112 -6168 -10581 -12288 -10383 -7698 -8271 -3061 1150 -4121 -3571 -3082 -4959 -3111 897 1179 -3256 -8337
15096 -8337 -4611 -6385 -950 -775 -9389 -8218 -914 -539 -12987 -14441 -10236 -8707 -6154 -5527 -6550
15081 -6550 1166 6622 5760 3998 3534 -4191 -8490 -10187 -12383 -14740 -7464 -3689 -4057 -1709 -522
15066 -522 67 -4191 -5784 -8754 -11212 -17079 -15442 -12330 -3339 1032 -1758 -12777 -13966 -3011 4246
15051 4246 4286 646 -5278 -4099 -4161 -4085 -7385 -3466 -1216 -1041 2255 2154 -4754 -5359 -5989 -6448 -7239 -3238
15033 -3238 2166 -307 -1715 -856 -3759 -7179 -10082 -3977 -370 5610 7374 6014 12 -9514 -11881
15018 -11881 -16920 -18437 -12532 -4479 2401 -2649 -2044 -1908 -2049 -4326 -8589 -6380 -2387 -74 3783
15003 3783 -874 -1456 -3509 -7550 -8371 -7968 -7355 -1733 -10655 -4943 5764 10313 -1028 -3148 249
14988 249 -3972 -9026 -10812 -8757 -13286 -11704 -4773 -3086 -1833 -2428 5841 9403 3426 3039 1694
14973 1694 2427 857 -3836 -5503 -2650 -7424 -14554 -13002 -5265 -4452 -7642 -8282 -4364 -2075 -14
14958 -14 -2458 -10241 -6786 -4710 -5917 -6500 -7929 -6244 -2030 -876 -8780 -9440 -3343 3677 3812 89
14942 89 -1063 -4556 -4908 -4872 -6637 -5574 -7692 -5889 -353 -457 3919 6017 11103 11887 2387 -703
14926 -703 -7880 -5334 -2540 461 -2309 1742 3526 -3516 -8255 -6529 -1064 3679 9588 5480 -7186
14911 -7186 -9994 -75 906 -552 246 -90 -2996 -11699 -5111 -1750 -9568 -14653 -14794 -12861 -4119 -8071
14895 -8071 -5378 -1012 392 598 -4572 -5540 -8501 -10075 -8449 -8112 -3625 -853 -1629 -3701 -6897 -4080
14879 -4080 1153 -1278 -9047 -13954 -13580 -9076 -6010 -7507 -1766 496 -2653 -417 -2708 -3621 -3324
14864 -3324 -2982 -5105 -11818 -19433 -18685 -10359 -5231 -8075 -9344 -10506 -8956 -6803 -2143 6983 10726
14849 10726 11776 13742 15441 6446 -1752 -7322 -9931 -5422 -2043 1531 -4865 -3214 594 1054 2826
14834 2826 -4535 -14487 -20739 -20726 -13346 -3240 -1275 717 2150 3326 439 1427 806 -2714 -4484
14819 -4484 2538 -2241 -9947 -16033 -8428 -7583 -9975 -5764 -7254 -5708 -2011 -1303 -8065 -10951 -3751
14804 -3751 8993 9127 143 -8080 -14664 -20044 -14960 -11098 -13267 -13731 -16890 -8578 -6119 -6023 -7788
14789 -7788 -5103 -3377 -2106 -4101 -7134 -4664 3032 5548 4440 1493 -8410 -11541 -9455 -9602 -9930
14774 -9930 -7923 -11118 -2638 -5520 -5912 -2494 2176 5705 -877 -1806 5225 11693 15394 7857 3025
14759 3025 -2558 1760 3692 13716 14543 11636 5510 -6040 -4438 -2697 -2061 -11610 -15464 -9251 -2769
14744 -2769 -5091 -3551 1986 7088 4372 230 -4160 -843 4514 3956 -3618 -8179 -7312 4947 10187
14729 10187 5918 5750 7235 5167 2665 2462 -2639 446 -1419 -6485 -2573 -3460 -5107 -3031 -658
14714 -658 -2243 -1040 -5857 -9178 -12144 -18498 -15744 -12146 -8984 -4433 1011 818 -4227 1606 1841
14699 1841 -7202 -7162 -4204 -4360 -6195 -3352 -2153 -4476 -12861 -17941 -12449 -12375 -14744 -14427 -10832 -6642
14683 -6642 -4208 -1658 -2138 177 4446 7727 5187 1353 5953 11456 9683 8099 1374 -5655 -8145
14668 -8145 -14254 -22087 -19327 -10627 -676 550 -6360 -4283 841 -3686 -8657 -10704 571 306 -8959
14653 -8959 -2177 2924 3967 -7466 -5704 -2876 -2467 3815 5254 -2930 -6303 -11590 -9979 -8048 -8357
14638 -8357 -1062 -2907 609 1176 -1703 2315 2172 -311 -5514 -8228 -9143 -10117 -7125 -10702 -19669 -15609
14622 -15609 -5253 -2457 925 1963 -1131 -611 -483 -3136 897 4736 -951 -3357 525 -836 -9581
14607 -9581 -16342 -10596 -11271 -12627 -6867 -4500 -7495 1509 1363 -5491 -13619 -14741 -12888 -6877 -4778
14592 -4778 -5183 -583 1956 3342 -2102 -1677 -425 -1187 -2068 -230 -2215 -6630 -988 5122 6512 2846
14576 2846 4041 7537 6561 207 -7335 -2482 -4293 -5292 -9387 -9966 -5907 786 3567 -4120 -14150
14561 -14150 -6817 3363 3806 8990 11194 7622 572 -11071 -14494 -11534 -10194 -12051 -9238 -5759
14547 -5759 -1938 4530 4125 7303 12885 7960 9058 11431 395 -3341 -6654 -9596 -10167 -12860 -14216
14532 -14216 -10755 -3682 5376 2008 -3105 -1960 -394 -5976 777 10467 9692 12964 16849 11615 9120
14517 9120 7762 2644 -685 559 -147 -464 -358 -457 -1160 -7997 -8203 -7073 -1315 -258 -1351 -5726
14501 -5726 -7860 -5211 -7025 -11231 -6645 952 467 -3848 -6084 -6721 -12671 -12696 -8191 -2315 5231 4426
14485 4426 -3822 -2476 2981 3391 6790 12471 7381 4517 3771 1353 4885 9357 7537 2590 1054
14470 1054 1221 5184 4689 11423 8629 5780 2563 -2286 854 4294 4521 393 1916 1287 -25 -1091
14454 -1091 -7276 -8336 -3601 268 1237 3780 6732 -94 -4042 2783 4422 1611 1180 201 -4404
14439 -4404 -6853 -4252 3401 431 743 -8334 -5785 -509 2515 3340 609 5502 5580 3201 1815 4133
14423 4133 5641 3606 -556 -2838 -5202 -7725 -11268 -9162 -8514 -7985 -9546 -11404 -12780 -3793 5122
14408 5122 5521 -6663 -6550 3385 356 -3343 -1469 3151 636 9714 13407 4125 -2654 -6573 -8032
14393 -8032 -1537 3008 3899 3544 74 -4786 -9231 -12793 -7830 -2911 -5964 -4600 -5541 -9350 -10103 -10549
14377 -10549 -9479 -11490 -12370 -10832 207 2919 4092 3774 -1425 627 4152 2123 1903 5200 9891
14362 9891 15668 13982 6234 -1743 -5647 807 2491 3553 3698 192 -1735 -2512 2871 1999 -1847
14347 -1847 -1933 -3122 -6394 -6992 -5635 -5290 -4088 -1244 -45 -171 -7336 -18869 -16974 -11140 -6793 -6537
14331 -6537 -4669 -2123 180 -4926 -7277 1336 3135 2206 -5752 -6140 -3416 -4037 -3779 -2302 -10040 -10071
14315 -10071 -1814 6670 3993 -4907 193 -1361 -6624 -11801 -7266 -7051 -7134 -12442 952 8248 11073
14300 11073 5821 -4039 -6387 -68 -1907 4342 3954 -3730 410 5442 5042 4703 6388 2222 -2859
14285 -2859 -10461 -10094 -4982 -4523 -10825 -8010 -8894 -9326 -5072 -2768 -2774 -2777 -8353 -11661 -5293 1286 -2159
14268 -2159 -87 4176 -623 -5658 513 2785 8213 6834 -1107 -706 -3740 1533 1213 -1159 5152
14253 5152 13211 13429 6022 872 8581 14583 13095 8031 6806 15973 17461 13424 10064 7019 -2570
14238 -2570 -3359 -3624 -5844 -3536 -1207 -4817 -8158 -4254 3817 5083 4395 -3213 -3199 -1388 3543 8052
14222 8052 1920 -1401 923 4055 408 -10334 -15115 -15747 -6192 2670 5354 5063 2549 2536 2986 5309
14206 5309 6511 4594 2122 8118 4234 2634 3319 617 -4001 -3551 -916 682 6032 10306 7455
14191 7455 1642 -7668 -5793 2937 4028 -3193 -7356 -12631 -17723 -15887 -14667 -8658 -4838 -7399 -9196
14176 -9196 -9668 -4610 -3085 -10836 -6627 -4232 -6570 -9988 -9995 -11503 -5994 -1015 -3220 -546 3393 3220
14160 3220 -2084 -8914 -9238 -6493 -2346 1511 4164 72 -7892 -8072 -8175 -6983 -6486 -4998 -8279 -11778
14144 -11778 -10055 -10920 -5247 1164 7709 9430 5714 1550 1536 624 -5786 -5931 -8754 -9613 -7882 -8020
14128 -8020 -6791 -7162 -7627 -1330 5106 6885 9558 10693 7410 15611 15533 4280 -4002 -5333 -7776
14113 -7776 -7225 -5299 -3083 -2111 702 -392 3880 4544 3358 -2663 -3292 -93 2698 634 -1789 6162
14097 6162 12907 11668 11780 10909 9026 6067 1379 1760 3451 10532 14377 11347 15348 16254 10048 -783
14081 -783 -2821 2201 -2097 -880 4264 3612 2561 3359 6563 6458 1378 -918 6502 9374 4163 -3282
14065 -3282 -596 931 -12 1511 1672 5066 9976 15698 16826 14761 15707 16630 14435 7520 4496 4832
14049 4832 4787 1311 -6711 -6168 1139 1299 2268 3680 5471 5556 5964 4752 5715 9105 6051 6607 6050
14032 6050 5253 3706 2796 10485 7818 2419 4159 3710 1619 3299 2572 -1402 -6571 -15931 -19477 -18371
14016 -18371 -6439 874 6163 6202 11188 10089 3094 -636 -7842 -12940 -8480 -1619 -1152 -416 -3132
14001 -3132 -5198 -3645 -5657 2336 5380 1408 -5950 -7997 -9749 -6455 -3349 -5893 -459 1252 892
13986 892 3510 3259 6109 2458 -1538 3466 3376 1567 5749 2369 1031 2271 -1023 -1957 275 2692
13970 2692 6524 8250 14783 13357 16974 14695 23313 32225 37395 48097 59649 69842 92695 124819
13956 124819 168773 229557 300160 368760 440516 481489 490529 487859 471807 461434 451914 418959
13944 418959 362950 286894 215822 155529 105765 82533 59622 41916 42598 43262 36043 30257 22283
13931 22283 17003 15785 23218 25114 26855 20933 17144 18568 19582 16763 11887 5348 4020 7403
13917 7403 8766 6704 9868 8895 4260 -2757 -1595 420 7531 5994 1669 -1848 -9985 3066 11634
13902 11634 6051 -3018 -4133 -515 -4387 -6698 -5558 -4089 -55 -64 -5548 -5220 -733 3256 -2415
13887 -2415 -2656 6361 4688 271 4758 7964 3927 409 985 -5486 -6385 -211 -5344 -4555 5633
13872 5633 15262 10945 -1817 799 524 3544 1997 1853 706 -502 5616 5256 5116 3799 4505 6096
13856 6096 8955 5840 5918 5357 5379 4349 9595 13685 13863 5821 3174 -290 -1635 -420 10714 13947
13840 13947 10952 6997 13174 12688 9172 12580 15221 15212 16541 10275 10877 16517 11400 16803 23036 29544
13824 29544 32742 24776 26336 36565 45154 51449 65865 85124 101212 122234 148089 190995 258481
13811 258481 355170 493792 643271 768883 866047 853201 751998 610989 443800 293947
13801 293947 196392 138692 105919 85899 71814 58358 44825 39724 33013 31897 35193 33677
13789 33677 37569 43586 36477 32154 29579 30097 28795 24487 18433 16311 12786 11635 17163 12311 6229
13774 6229 -1421 -767 4577 10293 12196 15447 9985 11689 8098 5337 6491 2716 -465 2814 5029
13759 5029 7776 8781 6855 2617 3159 5044 6808 9611 9869 12242 13222 10820 11055 12595 10764 10933
13743 10933 12875 8969 7250 16708 24448 22707 17811 10244 9600 8278 4440 8067 13913 7114 4472
13728 4472 7291 13818 12655 6702 5726 12167 20755 27205 32501 25884 19507 18497 22655 28235 25825
13713 25825 20635 18562 16039 11084 9041 6113 9775 19927 18063 18769 18368 19432 21832 25892 22872
13698 22872 18505 19879 14952 12699 19835 23803 15056 7666 12880 12015 1539 -3840 -4069 -2484 3417
13683 3417 8718 9288 5913 6599 18630 15785 7376 1950 1598 4201 9123 5934 6018 9801 8956 4010
13667 4010 7553 12118 16845 15948 2622 -2724 -1841 2 -3290 3 623 7935 11857 13457 11768
13652 11768 12791 17705 28748 24918 16370 5603 9665 14651 14145 12696 11897 11691 10752 18550 27195
13637 27195 19578 13277 13863 19082 19360 16563 7896 14255 21186 22308 22443 27687 34511 37822 42203
13622 42203 53735 70113 85555 95302 110240 114984 110977 108668 103655 112594 124461 139251 154555
13609 154555 161653 150392 127576 96555 74001 49015 34590 25139 29172 36929 34419 21776
13597 21776 19669 19103 21260 20613 20872 20696 16317 6122 3362 11914 20408 24709 19728 19992 22391
13582 22391 25377 13717 8020 8758 19187 22031 18171 19111 14610 13087 11089 14151 15608 10674
13568 10674 15724 13408 10387 15053 21327 19710 18193 18653 17578 17017 20310 24379 21737 19764 13726
13553 13726 12014 11101 9425 11640 14613 17446 19010 19408 20252 20407 17943 12475 12227 7933 5383 3788
13537 3788 9098 11204 13255 15710 13135 7333 3545 2299 9128 19564 14087 3607 160 4084
13523 4084 8894 6939 6997 17899 20474 12448 17787 26153 20542 19011 14812 6640 3804 6777 6251
13508 6251 6297 12888 11148 4925 72 6548 5650 1003 2790 10493 11452 15365 23761 20323 17739 14035
13492 14035 15925 17129 15452 18013 14820 9321 6952 10616 9799 9701 16179 12080 7963 12692 11181
13477 11181 6627 2340 3456 8808 16651 21007 20624 21696 17740 12005 6157 10974 25467 20933
13463 20933 17315 22234 25401 20723 21900 22697 24044 27134 22807 18238 16046 12434 11637 10015 12126
13448 12126 13487 12016 5932 1919 8371 16013 15697 17045 18166 16307 12639 12256 11565 16312 21455
13433 21455 18740 9846 7295 11698 13331 7188 5350 19270 20521 19800 17145 12669 12764 19264 19577
13418 19577 20140 17828 12841 16500 16769 10532 11549 16357 18025 17575 11728 7590 10222 12547 9366
13403 9366 7503 5665 6900 6417 8320 18278 19266 18220 16827 10844 11835 14686 16183 16601 18608 12847
13387 12847 10403 13822 13378 15397 19172 18651 17007 10796 8721 11103 9313 7830 10049 10081 9047
13372 9047 9709 16055 17944 15665 16064 13973 7709 9027 11004 8396 5200 8535 9638 7694 7287
13357 7287 9930 13310 20411 20039 16338 19002 20164 13074 11644 11604 8713 6143 12136 20209 25519
13342 25519 26380 22738 19997 19034 15843 8257 6595 11243 15173 13255 12267 18166 24121 27807 30412
13327 30412 30081 20051 16112 11265 7197 12685 8168 5669 4839 9448 18145 20978 26121 20623 15051
13312 15051 14503 12311 16443 16378 18873 20927 16000 5686 7261 18293 18434 19625 21425 15925 11268
13297 11268 14227 16176 11884 13409 16316 12642 13479 25491 25579 26245 33693 34306 29921 29422 27416 28364
13281 28364 28580 25725 26808 20440 16067 12184 18252 11635 13754 19761 20745 19158 21368 21579 15999
13266 15999 16794 17995 13896 15951 17101 12273 7317 7285 6734 6785 11328 13510 10772 11340 12818 14116
13250 14116 15873 16283 13894 10398 8150 10210 18222 19951 20282 20058 23135 27181 20062 16934 21322
13235 21322 18393 15709 19541 16535 10688 4706 8794 21097 27524 30064 27613 24260 23263 16193
13221 16193 14206 11155 12948 18793 16263 15897 12597 12681 14114 17836 13877 16066 17067 14116 16926
13206 16926 16021 14192 10469 11572 13879 15094 15088 14828 11950 13553 17957 18208 16166 12538 11865 17460
13190 17460 18527 19469 11543 3941 11216 11133 9823 11744 9580 12733 14047 16435 19465 19857 22184
13175 22184 25728 20790 14364 19657 17518 15620 17057 11728 10855 10394 10733 8389 6338 13101 17154
13160 17154 18473 11716 10771 12482 10268 7113 14493 21656 25314 21750 17370 20686 28422 31382 32990
13145 32990 30785 25965 18714 15220 12977 15941 22909 19120 12103 19728 17432 16460 22740 26608 21235
13130 21235 15290 17685 25365 28092 32665 25899 22736 20317 21853 22897 19323 19234 17003 16899 17318
13115 17318 22715 22799 16623 18028 24952 28752 18772 12362 18048 15438 15729 14888 12958 16756 16781 16285
13099 16285 16779 18243 17948 23729 32857 29673 23107 19151 18434 21691 16561 13262 14699 9410 1357
13084 1357 3600 5415 5968 9529 7617 12488 15238 19129 18189 20921 26635 29788 29601 23993 13379
13069 13379 17662 23860 28902 26797 21285 13582 15635 20600 23040 26067 23921 23251 25348 20244 21494
13054 21494 21879 25139 24909 19783 23337 23079 20254 13706 13201 14701 13676 12788 24376 32367 35030
13039 35030 31624 25101 29475 33289 36698 33736 26352 20762 21853 19480 23739 23048 25337 30011 30202
13024 30202 31304 27899 22407 22339 23039 31565 39684 42270 40393 29264 30009 36465 33410 32479 24329
13009 24329 23850 25130 32985 38770 42337 37948 36397 34164 31183 29808 32332 26527 24314 22126 21148
12994 21148 26075 28704 22192 19232 10339 16091 25606 27486 31897 37324 36381 37333 32852 31548 33215
12979 33215 36663 42970 47539 50466 56167 54488 48383 45082 41214 38540 41756 44439 35714 32757
12965 32757 34232 34376 30267 33961 42544 47495 50076 39575 31397 30922 33137 38727 41662 42851 44171
12950 44171 37266 36781 38233 38359 31122 26912 27117 30802 32390 34126 36720 35547 36141 38033 40331
12935 40331 37722 33831 32118 32003 36645 43793 37827 31520 22479 13381 16393 16117 12679 6098 6110
12920 6110 6041 6738 5359 10019 14721 23537 25991 19831 13946 8931 10059 8580 7836 10587 24940
12905 24940 42074 51090 51036 53772 60310 72483 78569 79391 75183 78610 78412 76324 79145 80794 81377
12890 81377 84819 93345 102800 105924 111315 118594 121051 142476 164642 190188 227556 271636 331638
12877 331638 415183 536142 704433 937241 1226265 1485036 1666317 1706513 1581436 1347545
12867 1347545 1060819 776519 545390 389454 293623 238051 202191 183687 168857 156896
12857 156896 145743 134523 124738 106616 94587 89255 82484 79591 76889 72823 72657 72785 76297 78277
12843 78277 77397 76343 83188 83851 79247 76427 75437 73976 72448 67340 63821 60859 56192 57915 61546
12828 61546 59534 53113 46777 51189 42257 36315 27974 31524 29646 29598 28308 34589 34287 32876 40861
12813 40861 46704 50134 45304 40751 47453 45558 41572 43296 44922 40772 45063 48356 45460 45300 44215
12798 44215 39325 31329 37431 45440 51049 51962 52196 59065 59090 56697 50330 45211 39524 43626 43176 48567
12782 48567 48567 41568 42739 44608 43901 39817 43126 55238 62167 56268 59752 64102 64699 59216 62728
12767 62728 56630 56527 58309 59099 60099 63995 71662 80746 90950 91283 97705 98443 84135 73691 62703
12752 62703 44595 23817 13029 10482 13387 24922 33336 34108 31015 35696 44422 50824 53115 56993
12738 56993 51794 42968 39024 36076 35647 37509 32154 30830 39840 36040 38340 40552 46058 56854
12724 56854 55647 53294 59099 63570 70727 76724 84598 89942 91078 92493 99850 112298 122440 146103
12710 146103 180481 210037 225890 231279 240926 246434 253979 259665 265582 266260 253451 232747 214385
12697 214385 206200 202028 194389 197448 200257 204337 199306 190497 172253 162092 158024 143036 119556
12684 119556 106325 95805 80959 79397 79950 72766 65837 74460 76828 84880 92511 95511 94319 92056
12670 92056 92486 95303 96261 95865 91281 86475 76312 79828 88063 88108 92042 94612 90223 85378 86867
12655 86867 85263 85429 91566 95360 100413 107009 114803 127634 131807 133299 123038 100149 85794 81577
12641 81577 76273 68815 69601 83629 88641 86633 81643 84513 99144 101863 106912 112907 109028 103830
12627 103830 96590 90770 89055 93984 98899 96580 92946 93038 100130 105517 113190 110693 109863 109178 111428
12612 111428 120520 137034 154324 168439 170195 173182 175263 182308 188107 180056 173508 173132 178896 186528
12598 186528 203465 212733 211882 210616 207259 202365 198377 200694 197723 203447 211899 212182 209953 215546
12584 215546 233895 263342 287979 305272 308759 314872 326258 349912 383755 434478 498163 576612
12572 576612 643316 696479 741188 769360 784552 799395 820696 843805 881055 957097 1092389
12561 1092389 1322111 1687949 2203722 2795700 3356153 3811237 4065606 4150215 4160856 4109105
12551 4109105 4017176 3837263 3464575 2945894 2351981 1783281 1325845 1019063 839558 723541
12541 723541 647374 592395 556279 527523 494496 467785 446501 442042 438538 428275 415891 402077
12529 402077 398380 405620 404568 401409 404003 400327 402675 403187 405583 411459 417837 425923 433428 444350
12515 444350 457868 469158 477323 487529 498623 507990 517391 530074 551339 566668 581847 592700
12503 592700 609117 623637 628418 638107 657267 677170 702309 728389 756106 787121 817160 836085
12491 836085 856796 883087 910288 951848 996160 1048957 1102930 1161504 1228073 1317840 1417489
12480 1417489 1535704 1670584 1820719 1982384 2151458 2311742 2486091 2687677 2922467
12471 2922467 3219064 3595091 4064709 4646811 5381440 6282201 7332292 8522252 9858729
12462 9858729 11335312 12976987 14802901 16822805 19075970 21765776 25178161 29681858
12454 29681858 35673614 43664063 54491429 69762460 92195909 125152796 170253625
12447 170253625 221749689 267679324 299089354 304711176 281110321 237319520 183407708
12440 183407708 130884959 89106990 61250234 44234116 33756145 27090328 22761392
12433 22761392 19919836 18038700 16693807 15572480 14493715 13322958 12029226 10686384
12425 10686384 9338128 8037339 6874283 5892723 5102347 4490874 4016643 3632036 3310188
12416 3310188 3024195 2765799 2536858 2349549 2186559 2044117 1922006 1816082 1718772 1628599
12406 1628599 1544274 1450723 1367856 1300081 1236225 1164306 1093827 1030605 969692 910009 852810
12395 852810 814893 782712 750435 717733 690159 660522 626111 596016 568802 539764 517166
12384 517166 493921 468792 456280 450732 443608 433090 413007 395010 387779 381572 367902 354589
12372 354589 345467 334453 332006 317826 309841 302030 281596 265273 262104 258692 244563 232855 226674
12359 226674 226984 222969 224870 224991 223519 221054 214720 212334 204648 194639 188969 182591 180674 175711
12345 175711 177262 182416 181061 178751 185897 193802 190063 192640 191773 192990 200177 213939 212842 205990
12331 205990 204897 207944 201547 189136 183357 165837 129452 84783 33667 -9747 -43270 -56297
12319 -56297 -63916 -60374 -46194 -25285 7420 48831 89760 122203 135530 139124 126620 100379
12307 100379 80990 78893 77605 75245 68855 61106 62078 57755 51455 47376 46840 42701 38696 33930
12293 33930 27621 26980 26173 20023 20900 20626 17235 17916 21157 19065 15112 8065 12013 24598 29116
12278 29116 39982 56671 68714 76359 76232 77035 81355 80989 79275 72971 73549 77769 78231 77255 77900
12263 77900 70861 58147 43313 35459 27734 31678 45550 49986 52867 57512 62195 61994 64772 67144
12249 67144 60303 54408 46147 34901 28236 16844 9616 8916 13644 10067 13943 15543 16324 16162 26372
12234 26372 34414 31229 38241 39166 36923 37560 31653 26517 25788 25534 15557 11875 14277 11726 10916 18032
12218 18032 20629 18156 24543 32228 29763 35617 35986 33289 37830 46177 47683 42059 42209 42684 43830
12203 43830 40668 38712 30897 24852 26324 23356 14113 7925 5361 2890 7818 13316 16892 20670
12189 20670 24081 22193 25368 31151 32727 23938 16296 9823 14414 18898 18362 16768 18674 12133 14427
12174 14427 17635 19706 19750 15010 12773 14699 26806 33552 34738 28903 28357 30652 40512 49164 49733
12159 49733 57350 71444 78431 74319 68927 57245 53994 56366 56418 58908 58593 67120 74701 93074
12145 93074 117869 133415 126639 106649 94839 95232 91018 82263 72594 73176 86071 92663 88976 72287
12131 72287 48004 35559 35418 40081 44595 44167 47081 46290 43635 44003 42558 41384 38398 33634 26104
12116 26104 22001 25430 23276 23334 22007 9398 11742 7848 3864 12639 20391 16238 26031 33926 37413
12101 37413 46680 57476 60734 53646 52620 39267 38583 50021 56487 63305 66535 64917 57370 49497
12087 49497 50311 40993 36562 46389 42931 33259 26534 30137 25389 23086 17024 17282 27869 38237
12073 38237 28079 24908 31007 33611 38756 41566 39051 45900 66575 84342 95387 106048 118479
12060 118479 133763 145087 141377 131381 114597 107337 98944 88330 78833 72500 63126 59947 56044
12047 56044 52086 52376 50829 46906 42992 47621 47553 33109 30142 39259 50507 49371 45166 55188
12033 55188 56508 53885 62051 71407 81277 90630 105717 123303 135210 159380 189892 231704 279724
12020 279724 335444 416221 519522 662577 860327 1106503 1365235 1582635 1699754 1654007
12010 1654007 1458822 1181036 880775 617435 425974 296177 223694 177133 147529 129473
12000 129473 113243 102654 97560 90557 85026 76344 66555 53989 42445 36959 29768 35689 26687
11987 26687 30762 35153 45449 53439 59688 76559 97499 115641 128382 131289 130727 137344 140837
11974 140837 147382 165302 188657 218119 254112 298797 371533 486467 634662 830139 1051388
11963 1051388 1261648 1427542 1502293 1472316 1342523 1134837 901551 678097 492475 344520
11953 344520 242080 186563 153068 128767 113567 105543 93467 84541 79691 74363 72475 65770
11941 65770 54047 45530 40592 29422 22975 23556 19278 8539 13531 17883 12421 5403 3969 8384
11927 8384 5821 11081 18344 14196 10974 8478 9811 7736 11109 16670 13863 12735 8654 4596 5918
11912 5918 8611 16646 22348 20278 13955 4024 1146 766 -1042 -450 3193 6065 3773 4479 5209 146
11896 146 -3894 -5684 -8053 2025 15061 17258 17384 16415 12141 13157 14269 14620 12542 13667 10868
11881 10868 8144 -162 -1044 1730 4006 473 -3112 4230 4517 2786 855 4222 2755 -1464 3569
11866 3569 5880 8540 3888 5970 5246 8095 14130 13728 16787 13659 9019 12540 8724 2195 5898
11851 5898 8264 10083 11922 10628 12266 6420 1591 -1784 -8905 -4955 1531 2766 7692 11231 4067
11836 4067 -877 2060 1321 -18 -5832 -9972 -3653 -2786 -2215 954 7791 5694 3022 8634 9532 11929
11820 11929 11595 1498 733 -2451 331 7828 10622 10065 4984 4695 5234 2212 -2252 -549 5063
11805 5063 1437 -364 -2282 -949 618 -318 -2633 -3148 -6878 -1183 -1136 -1523 -2573 -6481 -7254 -5952
11789 -5952 -9166 -5606 -4919 -7180 -4083 5420 4553 -5899 -8687 -4978 -2611 4758 8248 9965 7393
11774 7393 6651 9171 3517 -1452 -4985 -4212 -352 13 1344 4269 -43 -2864 -6006 -6366 -3876 -2459
11758 -2459 -2571 -1969 -5148 -5507 -1552 4854 13165 13831 12278 14754 10968 16046 16376 18261 18409 19037
11742 19037 22332 20731 15003 6456 8699 11086 16707 12831 7301 4175 3429 2573 7877 11616 15240
11727 15240 14212 10358 -1356 -1985 5926 10746 2490 -2122 1029 1507 11298 13762 5317 7468 8170
11712 8170 7291 4285 3831 9236 18129 18231 15189 16082 15697 15410 12429 6232 1687 -1108 -4511 -5287
11696 -5287 -3922 3407 9814 5187 4483 8615 7993 9946 9238 7796 8170 5872 5859 5395 5841 13318 13692
11679 13692 16753 18325 17960 20315 19562 18530 12677 17904 22936 18511 4996 3203 10349 11172 13785
11664 13785 14871 8717 -590 2475 4094 -177 7344 11481 12004 16257 15434 10281 8968 13300 17181
11649 17181 14195 18599 21193 18362 9994 3572 2471 -277 757 136 1522 6653 8502 14441 10440
11634 10440 12306 11362 11483 12141 13315 19692 25741 23166 15373 14234 12174 19340 22791 22981 19752
11619 19752 13172 12504 11571 11205 3324 1174 8006 10483 9291 5680 8474 14373 9805 12440 7616
11604 7616 3463 1857 9333 12341 12693 13729 15194 16742 16146 19420 18400 15717 12447 11561 16133
11589 16133 11386 6629 4608 11585 8788 7263 2298 6121 10912 13883 17677 16217 11323 9237
11575 9237 8065 8056 6568 7628 4569 6261 10272 13382 12781 10859 15502 12785 11692 11520 11650 9948
11559 9948 9998 11554 14080 15745 15750 12816 15564 8505 183 4922 4949 7711 14814 6371 1473 4112
11543 4112 10442 14744 13482 15878 13690 11303 13907 17238 20185 24411 22047 20020 13716 12837 9827
11528 9827 9683 10446 14921 17278 15714 11046 13913 18271 14102 16681 24297 25834 22417 32646 57750
11513 57750 84909 101547 95470 73707 50205 33738 20470 15409 13968 12682 19381 17484 7041
11500 7041 614 2253 546 -1998 1855 2364 6461 8847 15842 7451 7428 8416 14305 15932 16255 11950
11484 11950 15095 21337 15561 15746 13143 12750 16669 23496 20301 17982 17278 14473 13090 13553 11998
11469 11998 9585 9536 12957 11764 10483 13674 13326 15676 10622 6742 6164 6624 7212 10657 7578 1963
11453 1963 7191 12971 15608 12580 4661 1642 4144 13491 20002 21610 22031 22007 22643 18060 15882 19559
11437 19559 21562 16921 9005 4418 2921 3127 6501 11850 15181 12262 12979 9895 2293 4250 11651
11422 11651 13202 7897 4969 7980 13294 14580 13013 5561 -4554 931 10776 12800 7339 11867
11408 11867 16377 10560 5333 -1113 -2245 115 2053 11612 10749 8106 7798 7046 9744 10641 18031
11393 18031 17977 8660 3050 3460 6179 8848 11054 10714 14101 23342 24535 17479 15731 10523 13537
11378 13537 24707 21385 23337 21618 20921 18318 18715 18170 19107 20151 20225 20392 13580 6937 5856 8654
11362 8654 5540 6260 8703 15276 16439 14115 16918 23457 20327 18574 12385 9764 15327 12166 6954
11347 6954 6462 5953 4524 449 2724 7451 17339 23409 18689 18741 20020 13167 9138 9554 9475 3451
11331 3451 5471 15997 18013 20573 23580 19358 23425 20315 17864 20288 20438 19006 15157 11628 13688
11316 13688 23304 28239 25921 17783 15312 16911 18422 14225 17102 18248 17297 14099 12965 9895 13115
11301 13115 10120 9161 20649 23273 18263 20898 18149 23128 22030 13155 10089 10215 11688 17513 30509
11286 30509 28347 24572 22126 18365 13153 8035 12094 15173 23165 27497 30471 33011 32984 27552 27984
11271 27984 25985 18479 15582 12346 21109 23803 24122 19515 13206 10660 7903 15339 21102 17413 22261
11256 22261 24152 15187 11146 10569 9925 14582 19968 20850 19757 15587 11835 14938 18812 23649 29396
11241 29396 37231 29310 22900 22259 22193 22507 29753 27169 19998 17525 17353 19238 16447 21546 20888 19538
11225 19538 26944 26279 19541 20431 24759 23540 23453 28890 37913 36641 28696 24350 30587 33207 31943
11210 31943 29515 27245 25228 29224 30884 31570 31162 32833 28129 35054 34416 26880 22298 23577 24618
11195 24618 29719 33964 37005 34076 31558 26695 27262 26650 28134 25209 24881 21108 20346 23717 30126
11180 30126 32086 30351 28986 33408 33562 37285 37834 35213 37085 37863 33848 31054 36461 27987 20743
11165 20743 25993 28923 28646 25728 33655 33915 26034 27524 33925 43412 45216 38576 30623 23684 23224
11150 23224 28819 30553 25777 25805 21728 24232 32524 37207 35061 32882 34637 42954 42961 40153 35832 35610
11134 35610 42148 43796 44861 47068 45421 36529 31494 39899 38122 35869 35566 35658 40407 43578 47785
11119 47785 56951 65081 59453 56271 59040 61369 62575 62950 65280 64476 56063 47346 48202 48180 46913 45607
11103 45607 40241 41349 44511 46637 49789 43614 38178 44290 47150 45150 48393 48806 46335 44461 41894
11088 41894 46873 58007 65598 72320 80194 89287 85177 80494 77053 85529 91450 87839 83550 79529
11074 79529 69764 59484 54294 53696 50031 43683 45912 46405 45820 42907 43878 44417 50464 50692 46709 46374
11058 46374 50919 62035 60815 59274 63053 73024 83339 84563 84259 82822 78924 76621 78897 77938
11044 77938 66173 59253 54863 43878 43212 46164 43991 41218 44636 49294 48493 36867 35838 42541
11030 42541 46623 43876 36630 33370 28507 30090 25906 28623 27209 27907 31476 41262 46586 51611 44747
11015 44747 42277 44744 46639 42940 41076 41149 40031 35424 35281 40704 44674 48319 54698 60556 61938
11000 61938 63740 66923 69843 65932 60953 61993 56794 52884 55289 51703 54034 53610 53662 52853 45037
10985 45037 41785 47116 47852 49920 42134 38210 42647 47666 48821 43364 41393 40792 41438 40749 50233
10970 50233 54439 53300 44894 44634 52348 54381 48045 47440 47994 53107 54033 51052 51156 56151 58957 64435
10954 64435 66423 63848 62761 65669 60363 54659 52729 48097 48937 53064 56645 55065 48365 42909 49001
10939 49001 59876 61613 51293 40010 43780 54283 51122 44079 39417 37741 38049 31701 26980 19239
10925 19239 6415 7366 11460 18162 25219 31969 29910 34390 34874 28606 16070 17472 17336 9657 5524
10910 5524 12196 29834 53681 85909 120645 152222 161770 158880 153780 138008 121401 111606 112937
10897 112937 111734 109272 103646 97213 87795 85020 84398 78070 77843 82000 92565 99632 97975 97739 107272
10882 107272 122217 138965 149668 154447 169492 198981 231183 277060 345706 424876 510881 634804
10870 634804 803548 1066353 1479311 2087071 2813267 3296034 3111323 2402002 1621179 1061936
10860 1061936 720815 521273 395786 315622 263931 233013 203170 180293 167289 163461 159311
10849 159311 157899 157999 158482 148708 131402 117875 109016 108206 105954 97438 91415 92968 93513 91599 87195
10834 87195 89425 87845 83491 84489 79937 73139 76679 76695 76701 76893 81645 84610 81910 80200 73344 66909
10818 66909 59753 61318 63214 61851 64452 67367 66430 63573 69044 68588 65983 72971 76972 67814 64244
10803 64244 66908 66165 63095 62025 56869 61196 68894 68735 75479 77764 77713 78071 69758 70052 81693 85209
10787 85209 86863 89872 84577 76200 82941 96070 92820 89313 89251 84818 78643 84965 86949 80783 73927
10772 73927 70118 75226 79998 82146 82194 85242 95505 102596 101523 111942 120954 123305 121639 127823
10758 127823 131688 140728 147014 127671 86559 40884 19579 9924 8759 17164 28070 39979 50990
10745 50990 59133 56587 54369 65941 77214 68273 66847 63956 49268 44334 52280 54575 63655 67898
10731 67898 68731 72028 81329 86248 84559 85388 88686 88978 91564 101608 115920 129196 131681 134467
10717 134467 141986 145208 147444 162031 172532 174404 181254 189839 210179 228760 258778 290924 303482
10704 303482 304907 296181 280001 264712 266771 265797 259603 271904 285650 303467 319896 322441 312060
10691 312060 288044 253097 225854 205538 188290 164319 143239 123599 113199 111765 111915 112565
10679 112565 116169 122298 120572 118827 122688 121642 127406 149569 159957 155637 151612 150871 136158 127760
10665 127760 125257 125155 121908 123743 133266 139325 137260 137743 130990 136943 149765 169405 184369 189103
10651 189103 194353 193638 195858 206937 205813 189371 161436 136371 122828 114145 122603 128267 127084
10638 127084 124795 130479 145589 160100 169157 175462 186984 194132 188209 170815 155280 146182 143377
10625 143377 142429 147486 155211 164395 166687 164031 167727 168099 163982 167179 174929 178223 193781 233281
10611 233281 274679 293425 289350 279273 278112 278812 277999 281382 288984 287156 279701 292934 314191
10598 314191 310492 301621 284422 272525 270493 272132 274392 280485 282311 281249 272423 277108 304599
10585 304599 347250 382016 399867 425494 431167 421986 419189 427760 454286 552348 718724 840831
10573 840831 876138 855905 826880 816295 810909 773878 680164 542507 423553 356652 332505
10562 332505 333126 332535 327252 314666 307514 300727 299420 315076 329042 342170 350972 354096 360352 385140
10548 385140 420022 443954 455813 462328 465279 470132 468306 468442 465415 464067 467157 471731 479140 496273
10534 496273 515153 525264 534586 550646 570686 581437 592323 609635 618639 624355 634459 652515
10522 652515 667777 682205 708228 738345 753808 776627 809134 840746 864307 881839 898876
10511 898876 930265 975379 1019511 1075513 1133225 1177172 1217264 1261145 1301955 1339820 1381050
10500 1381050 1433073 1509167 1632989 1809789 2054115 2345225 2651292 2978832 3407937 4032237
10490 4032237 5044930 6683145 9111957 12062737 13794843 12556322 9558252 6832817
10482 6832817 5239813 4473741 4129813 4029493 4080041 4202727 4355128 4548061 4814303
10473 4814303 5138433 5498371 5916987 6464358 7190792 8105250 9224708 10612372 12264603
10464 12264603 13910011 15166504 16217868 17648559 19952068 23407304 28353406 35347274
10456 35347274 44821663 56793284 71043389 87854440 109283336 140202568 188678337
10449 188678337 264177533 371415978 496512020 580189322 553786249 435615775 296134624
10442 296134624 191938986 128892682 91312939 67741795 52181378 41442811 33822748
10435 33822748 28256011 24004674 20668249 18072376 16140828 14822732 14028976 13516931
10427 13516931 12732109 11362644 9736152 8300986 7233476 6486856 5907977 5401530 4949623
10418 4949623 4540771 4151189 3781875 3448819 3185015 3005375 2868679 2743101 2632838
10409 2632838 2532480 2432352 2316433 2174638 2045079 1931780 1843662 1749757 1642462 1535576
10399 1535576 1445203 1359914 1281255 1217426 1176383 1142183 1089439 1025612 959191 906628 859404
10388 859404 827084 789570 747352 716168 698172 692894 681948 652156 621872 590743 563819 553466
10376 553466 543608 528166 509101 491841 483905 468942 454871 446391 427774 401939 384358 377999
10364 377999 362966 351696 347339 345946 341689 332077 325943 325277 328602 319442 312046 297730 278058
10351 278058 262416 247851 237109 229086 224525 224009 234454 248039 264539 277505 283909 275094 269807
10338 269807 276828 287327 290034 284131 286753 297025 287460 277847 283151 298914 296098 258377 178094
10325 178094 65537 -46587 -119207 -141432 -154602 -149592 -124931 -105051 -83960 -8597 112791
10314 112791 199814 220721 181454 147081 116437 100799 95519 94711 105630 110774 109693 102924 91568
10301 91568 77303 65239 54331 52936 46673 37057 27061 17439 9709 11285 25655 36298 28636
10288 28636 19417 13029 14794 10125 10270 13696 10892 9822 31131 67438 92378 109721 111511 100627
10274 100627 91968 82952 79717 79573 78481 91459 97820 94382 90762 84323 72335 68825 56439 35403
10260 35403 32342 45901 56442 69179 81825 89299 91412 95729 99329 98484 91184 88331 75124
10247 75124 53144 28288 5992 -6287 -521 8875 19871 21491 22918 30914 44767 60963 68139
10234 68139 64488 61783 66654 70947 81599 93496 103237 113932 137180 173978 223900 308672 423035
10221 423035 485158 429755 321481 227300 168076 132919 103886 87979 77526 75351 77660 76703
10209 76703 77615 71349 64147 51397 37302 32507 27413 26524 24531 23028 23765 30423 33256 35494 33013
10194 33013 39351 42491 31801 29680 33922 37542 44299 52972 61473 62204 57192 57223 56393 51274 52030
10179 52030 56947 62757 67527 79434 92186 103882 117442 139177 169349 195918 221625 240783
10167 240783 265377 304467 362011 443218 549343 676895 828141 1016442 1270511 1651087
10157 1651087 2239853 3118333 4291167 5439649 6022247 5610961 4445051 3115731 2068927
10148 2068927 1394305 986754 736928 574820 467704 398189 361723 338026 301745 259027
10138 259027 211030 162075 125134 111223 92992 80616 66870 52510 53869 57423 55768 59418
10126 59418 64332 67172 72902 74103 81616 88416 86768 77026 60708 47991 41077 40194 41529 38938
10112 38938 41962 42101 35499 28646 31025 40208 37007 29116 30009 23910 16416 16293 22076 18281 21149
10097 21149 25486 29556 37058 41281 38861 36597 24801 20363 27751 28349 28846 29760 33811 33826 32916 27438
10081 27438 26320 20080 20574 28756 37708 43851 51398 58635 51722 44587 41626 34732 30750 36242 40235
10066 40235 33102 33792 41383 58565 72270 72676 55084 31096 20180 15091 12937 13593 8427 2446
10052 2446 5655 6586 11808 9756 14903 20092 22829 22904 27662 35497 45201 49743 51504 61496 70957
10037 70957 83942 95075 102081 113033 131494 162264 201236 254358 322856 398057 499595 652949
10025 652949 880468 1235083 1776952 2510097 3230650 3452311 2950270 2109623 1382713 924779
10015 924779 655273 486413 372972 295079 237085 189814 156027 133166 111684 93759 77225
10004 77225 74904 71083 69021 56439 41639 29731 19429 8646 743 -5189 -13225 -21046 -27879
9991 -27879 -32667 -29734 -21529 -8574 -3810 5677 12623 26241 42076 54663 63917 59519 57090 47083
9977 47083 40795 32823 25680 23996 15605 15441 25660 31990 41168 46254 38899 35324 30417 26662 17229
9962 17229 5193 -1856 -6 -3238 -356 165 -1130 614 -3150 -1151 3929 10759 12709 14635 6453
9947 6453 -207 -3081 3807 6079 -1571 -3094 1946 -7106 -16889 -20067 -15249 -609 7631 6175 12192
9932 12192 18368 17070 14436 8181 16673 24658 31494 34628 25473 27274 24987 16503 12403 15564 11033
9917 11033 9270 11772 12487 6836 3139 -1787 -6278 -4322 3006 258 -268 1176 -6732 -8214 -9320
9902 -9320 -10152 -9347 -4460 -2720 -7969 -9776 -17887 -22352 -17804 -15613 -4446 4286 10164 9469 5020
9887 5020 534 2286 3975 -2200 -3489 -201 -2101 -6063 -8740 -6147 -7723 -8238 -3821 -1967 1166
9872 1166 4155 6836 -161 -5642 -2525 -1233 -1617 -3676 -225 -4432 -7854 -6013 -752 392 -1971
9857 -1971 -6001 -13235 -7366 -5025 -7866 -6714 -4529 -5802 1043 477 517 4849 5202 5218 -4905 -5015
9841 -5015 -1704 -4375 -9127 -17412 -19064 -7758 -4046 -12917 -13302 -3556 1109 -2725 -10863 -10600 -10765
9826 -10765 -7194 -2318 -2260 930 3241 -2553 -1937 -3792 -587 -5319 -9006 -6859 2060 599 4736
9811 4736 6474 4443 -446 -499 1852 1986 7696 8527 9094 11029 12045 15721 17773 17110 11256 6008
9795 6008 7666 9239 14246 9877 1955 7592 6446 1388 -5669 -7084 -12233 -6864 -4224 -8133 -5812
9780 -5812 -8993 -5382 -1290 -4017 1644 2788 1217 -921 1051 2187 4907 1328 6241 8779 -1494
9765 -1494 -4173 -7411 -8515 -4422 -5710 -10139 -17483 -21781 -15425 -10778 -5956 -1711 3806 4048 3400
9750 3400 3877 8784 7739 8417 10712 3154 -3642 -10046 -8014 -5653 342 3250 1453 5654 15459
9735 15459 23773 23799 23632 17404 16684 22439 18712 15585 20255 18089 15422 10591 7751 7137 5168 6982
9719 6982 9942 5307 5884 7227 5925 6761 5855 9813 12254 14319 17960 15269 11345 6707 7114 10402
9703 10402 12398 3074 -3973 -5052 -2128 -2691 -6307 3116 6665 1613 8163 11604 9983 14874 16956
9688 16956 17392 15016 13740 7788 5499 8913 7897 6926 5896 4540 5863 -299 -7682 -4051 -1105
9673 -1105 -4233 -4613 -1828 -977 -894 -3895 -5426 -3834 1518 3825 -2619 -5752 -5663 -1907 4176 7091
9657 7091 8241 7110 13761 8707 3580 4180 5068 5541 8577 5014 7173 18782 18822 12836 10675 10033
9641 10033 10488 10127 16235 15643 12092 9486 7147 5455 7766 10474 12409 11121 16353 14030 13716 15812
9625 15812 10319 1651 684 2907 7669 18213 22129 15788 6538 -3665 -6150 3540 897 -1728
9611 -1728 -5585 -2073 8040 13188 14183 11820 11449 10884 9451 6411 2333 -1755 170 5522 9316
9596 9316 4258 7126 1810 3955 8944 11638 14759 12510 11260 14936 12971 3782 272 3628 3576
9581 3576 10114 10011 8340 7483 12933 20244 18531 24699 13571 12234 21480 28558 35857 36133 30493
9566 30493 24354 18976 13220 12982 9634 5432 10069 12215 12582 3627 6346 12191 10828 14402 11140
9551 11140 2158 4002 13457 20315 17517 15205 17455 15661 11105 12379 10413 8653 10254 13446 16267
9536 16267 17162 17210 12652 14378 14664 14064 13504 4850 -2939 -8858 -5840 -1183 1797 8025 10066 12609
9520 12609 14982 15641 15637 15304 14554 12567 10723 11599 13423 11448 7341 12400 15082 10858 12523 14137
9504 14137 12910 14902 12813 16484 17251 18403 22397 18305 12028 8259 11929 12355 17380 16841 14626
9489 14626 14345 12464 16738 15647 19851 25390 25338 27924 29127 26688 27100 26425 20282 19213 17316 14459
9473 14459 5440 11594 16202 17658 17692 15096 17817 17782 18984 28593 25825 26248 29755 24913 19428 12968
9457 12968 11094 18390 20635 17887 18719 18551 19056 23609 24211 22435 14222 11119 10388 6438 10647 15473
9441 15473 14800 14810 10155 9970 15115 17717 13164 17838 24253 29934 26694 20942 15121 6543 10053 10728
9425 10728 13451 20705 18678 22915 30048 29607 25069 26115 25433 27226 27625 21785 24302 29036 23867
9410 23867 26613 30913 32187 30406 30861 29622 26138 17839 18457 26812 26908 23242 21382 28539 27623 26289
9394 26289 22980 28780 31346 35612 34413 30175 36516 41360 43639 36141 30632 27310 23910 26848 24464
9379 24464 26183 19841 19029 24968 29015 35238 40341 39430 29139 25828 26308 31836 32829 29804 33821
9364 33821 29650 25987 27735 26433 26935 26685 15181 20514 20135 26780 35506 34052 33115 26443 23054
9349 23054 25249 25955 20698 22610 22803 19869 19926 23214 22134 25727 27900 36004 38287 36555 33190 32968
9333 32968 32569 27017 26983 32454 42009 46035 35362 28478 28554 33129 43590 50787 46799 42190 38236
9318 38236 34382 38921 42846 44181 37337 33286 34901 32145 34424 38604 35434 29136 28593 29356 25373
9303 25373 29436 33546 35449 38277 42433 51428 47012 37784 36180 31237 34699 44442 47362 46724 48514
9288 48514 46215 45939 47858 46277 37156 36519 40667 51497 51417 46357 42893 37857 34165 32068 38749
9273 38749 44836 47961 50450 49870 46949 41630 45450 46954 45997 45201 44892 40660 37551 36050 33375 35582
9257 35582 36109 38440 39375 39437 41926 46433 54687 61288 66051 63730 62043 58361 59850 63353 65739 60873
9241 60873 63031 65610 61898 64228 66238 67198 69235 73268 74137 66114 56804 51757 57166 57601 54140
9226 54140 52467 58767 62088 65676 68626 70002 66940 66773 71473 78429 73343 68940 73558 67689 59279
9211 59279 63161 67864 69065 66550 62592 59848 60936 65665 73574 82723 83903 87252 86371 77746 74728
9196 74728 68656 67840 70301 76964 77517 74608 70943 70258 67045 69969 72062 74570 84239 92207 81721
9181 81721 71890 70798 72715 77895 78296 82926 75124 70731 68807 69736 70619 72346 73767 76514 82330
9166 82330 75093 70193 71943 75329 76940 80055 75685 70748 67272 61894 66110 73381 82340 85877 84216
9151 84216 85281 83786 86350 90450 88574 80030 73077 73797 75379 82070 88149 89362 87300 91839 94822
9136 94822 102598 112124 112237 108291 98580 92060 85979 83719 85532 81621 81820 79750 78075 79906 80306
9121 80306 84278 93505 100708 106325 100910 91790 94615 99238 99131 93771 93974 98856 105490 103658 102198
9106 102198 103928 99870 100390 103550 105179 108352 108046 107638 111670 114239 114476 113136 110525 115168 119751
9091 119751 123691 121637 123296 125218 124867 125956 126732 121548 116303 120902 134290 135929 133598 127000 120310
9076 120310 118462 126145 128431 125654 119664 122081 120095 120799 125056 125586 122727 125974 123677 118590 122538
9061 122538 127143 128659 136639 137502 130355 127500 122735 127264 140549 144559 141081 138658 141380 151299
9047 151299 151439 145420 140414 136287 136207 131861 132380 134285 136780 136149 135196 127501 122011 125953 126920 132828
9031 132828 141762 144528 141477 142291 138916 128633 128034 136983 136872 138434 141973 145725 144285 145892 155622
9016 155622 156387 158574 156671 145756 149989 154350 151786 152251 153297 159156 160954 160006 155273 152414 161259
9001 161259 165244 158299 152135 157122 166021 167710 160560 148642 146345 146519 152131 157069 160291 162316
8987 162316 159591 158424 163532 167733 174816 174934 176300 179806 179274 178161 181072 185098 189205 190832 188612
8972 188612 181655 181193 186282 183126 181893 186043 184915 180846 183268 194270 201059 202617 201074 198930
8958 198930 195888 193269 191703 191305 197219 201538 201131 206331 208423 208809 210105 210369 213866 219582 222849
8943 222849 222518 220345 221942 223982 220797 220408 217260 220245 226679 232399 236832 232932 232046 230629 230451
8928 230451 230002 238992 252746 257242 257462 251235 251988 258242 262867 262963 258669 254413 253108 260082 265871
8913 265871 268594 267892 269035 272430 279627 280771 284536 288708 293811 304944 312312 315603 315886 311061 305430
8898 305430 311321 312982 319463 322856 321646 325655 326546 328599 331014 335231 338618 338600 339709 345803 345224
8883 345224 347052 352871 360663 365438 366064 372881 375680 373150 378655 390477 397531 401570 407908 406078
8869 406078 399385 408500 412562 409287 403105 408571 414833 414621 415607 420523 427725 434952 438471 444271 452726
8854 452726 452560 453177 460592 465269 476992 477013 472327 478550 482817 489487 495609 501371 502084 505367 507893
8839 507893 505953 513533 521209 528271 528412 535085 538716 541779 548927 553244 556841 560260 562606 566181 578193
8824 578193 590684 601467 608882 621244 625393 627953 629513 636368 644180 651761 656574 668005 676464
8811 676464 682476 693146 701573 710659 722637 732415 738428 748761 762891 771361 780355 787933 798138
8798 798138 816230 820927 826666 840787 848889 860706 865243 879040 888510 893881 899537 910619 922566
8785 922566 931189 939692 953053 967245 985611 1001057 1017382 1032148 1046539 1061150 1078500 1094536
8773 1094536 1103754 1115334 1124503 1143368 1166038 1186842 1205083 1222789 1237678 1251726 1272369 1293694
8761 1293694 1318971 1341397 1359983 1379908 1400067 1417904 1438507 1457774 1483964 1514678 1539328
8750 1539328 1564113 1596114 1618192 1640014 1675503 1706730 1734666 1762426 1793892 1824655 1844373
8739 1844373 1869850 1906546 1945929 1978860 2019470 2066818 2107512 2136950 2177735 2227993 2271610
8728 2271610 2310143 2360693 2410859 2464267 2516565 2565191 2620201 2679297 2739221 2800427 2858533
8717 2858533 2915740 2976563 3047126 3125504 3198864 3274216 3354703 3425996 3514163 3610192 3697255
8706 3697255 3784940 3879626 3976813 4081256 4187290 4299957 4412636 4529502 4643474 4763245
8696 4763245 4894415 5031265 5171229 5322658 5475865 5640917 5806271 5977816 6156525 6339612
8686 6339612 6529774 6728395 6931005 7143752 7365582 7592197 7828150 8067923 8319599 8584939
8676 8584939 8853543 9134180 9431236 9733506 10036322 10349578 10667913 10998626 11338607 11678219
8666 11678219 12014208 12359969 12719596 13083272 13438858 13798653 14160369 14520452 14872918
8657 14872918 15206890 15538017 15860391 16165832 16460382 16732829 16979729 17204298 17394131
8648 17394131 17570627 17717875 17831816 17916844 17962972 17973320 17946875 17894064 17809963 17680634
8638 17680634 17523532 17336397 17122111 16891517 16638965 16362202 16074689 15771333 15455365
8629 15455365 15134502 14811537 14476711 14132296 13798652 13472020 13149713 12816202 12451987
8620 12451987 12058309 11659750 11274178 10915538 10568292 10236878 9924320 9620263 9323100
8611 9323100 9033605 8748718 8480955 8228313 7969115 7720016 7479757 7249068 7033562 6817347
8601 6817347 6608796 6411890 6225527 6049338 5877786 5706176 5539490 5376415 5220993 5076527
8591 5076527 4939952 4805188 4672491 4545688 4427514 4308952 4189840 4074517 3970755 3876044
8581 3876044 3777883 3680086 3587319 3506003 3417335 3331562 3256882 3177143 3091389 3024023 2959687
8570 2959687 2893025 2825160 2759547 2690346 2624523 2565324 2515211 2460645 2402511 2350448 2304295
8559 2304295 2255220 2208942 2167271 2128347 2083687 2046135 2007635 1963046 1916608 1874737 1841575
8548 1841575 1804378 1765088 1728027 1695814 1670988 1646262 1610556 1581352 1551149 1526162 1498829
8537 1498829 1478017 1461285 1433895 1406485 1380238 1354129 1327754 1310447 1290343 1269526 1246438
8526 1246438 1227969 1214235 1195904 1170986 1150089 1137714 1121874 1107765 1099377 1088701 1074439 1062630
8514 1062630 1064209 1078762 1099534 1119172 1105440 1058638 1000340 954405 917043 892549 873903 859988
8502 859988 846884 835401 819381 811409 802484 781531 762498 759288 756848 749916 733814 723337 721210
8489 721210 717033 702704 694473 691775 686979 673599 666044 666259 654322 639581 641428 651876 658316
8476 658316 657430 665952 680482 707397 731476 715184 672269 623454 586196 559389 542767 535055
8464 535055 527644 521599 510197 510645 516791 515186 506390 498384 492633 492505 488328 476528 472207 471363 481255
8449 481255 481571 472013 466600 453825 437180 419923 407047 405105 403559 399628 394655 390213 389713 393733
8435 393733 392032 388073 389657 391915 383997 371655 372370 367680 355209 358261 365167 365939 358838 354967
8421 354967 353983 357213 360834 353619 348700 341475 338576 327658 322648 321267 313343 304726 301294 303147
8407 303147 302891 301827 300905 298021 296051 294605 293128 288955 282228 279404 273315 269035 275823 270793 264096
8392 264096 260738 264410 261903 256384 246763 241320 242283 241646 242888 248002 249501 245862 242076 241810 230236
8377 230236 223944 228484 230446 230855 223045 221557 222909 217803 218212 225071 218856 214154 212705 209926 207037
8362 207037 206751 204395 200597 201732 209768 212856 209980 205661 201308 195125 198397 200423 198600 196666 191806
8347 191806 185334 179291 175785 177232 181412 177736 175899 174039 175154 178453 175447 167230 170114 169629 169321
8332 169321 168167 164383 166931 171983 167209 158345 159471 160931 160832 163265 164840 158989 164159 163540 153966
8317 153966 149134 151199 157365 159663 154639 150430 146364 145624 144607 136997 134680 135860 141706 134000 127415
8302 127415 129239 140800 147719 152584 156377 165776 172307 176475 193581 213824 230190 223682 204566
8289 204566 188393 160906 142336 136854 126092 120852 113841 130352 139792 135876 132214 124648 123093
8276 123093 117410 115790 114365 111749 113020 117706 111413 113023 117678 111836 118302 118918 118412 119175 117704
8261 117704 117925 119026 111186 113001 122663 124597 128773 134356 151470 171063 190784 203110 190304
8248 190304 164663 143560 124138 115745 109615 101702 92847 81813 80108 85052 83461 88292 91156
8235 91156 90829 93310 91394 83573 79309 79502 85212 86165 86548 83776 91485 92385 89719 86429 83904 89025
8219 89025 90094 84692 88671 90276 88758 83359 80717 81473 86405 82149 77682 75385 72672 78841 84246
8204 84246 79844 75076 80904 83823 75553 75175 78000 75496 74245 75570 73837 74421 77006 73324 70001
8189 70001 68470 66243 69173 71444 67200 58191 52851 59412 68026 71601 77808 73654 68460 68191 70361
8174 70361 70891 70866 72425 70599 71551 69931 71207 73522 71820 70631 65325 66140 66504 67823 68972 69165
8158 69165 68937 61861 57846 52382 49832 49789 50371 49722 56157 52747 50639 52433 60386 64312 63062 60939
8142 60939 59054 62310 58998 57270 54899 52969 56092 63678 70680 71048 72371 65193 64336 61571 58928
8127 58928 54690 46664 47097 53374 58550 61040 52111 41734 42460 46412 55109 60110 53728 43366 42111
8112 42111 49696 49973 48137 47954 55401 50624 38908 35008 43360 46872 51353 42554 36960 32868 30542
8097 30542 28317 30484 33199 38095 47628 59350 59643 64412 74929 73580 73856 77770 81119 86448 88232
8082 88232 92187 97521 101235 99336 104354 105854 98936 93059 88364 83943 72623 65606 60794 51045
8068 51045 56917 57703 51658 49003 45576 46720 52285 52453 44382 47044 51603 49517 51094 54794 55586
8053 55586 55042 54311 56077 58593 61171 64054 74499 82543 85060 92395 97913 104361 110587 114799 111758
8038 111758 111486 112294 116075 123631 133809 150058 164114 164698 158943 137009 116661 104919 88426
8025 88426 76761 75804 71857 67251 64598 58600 52582 51940 51755 52218 57579 64257 80985 87771 87738 83188
8009 83188 75199 66762 65527 62837 61519 64492 62611 64820 71623 78677 79569 79633 85047 86953 88650
7994 88650 84412 83988 79722 79930 84647 80722 77458 85862 92338 91944 88230 90199 89798 80694 66685
7979 66685 64620 61154 49763 44991 45363 40765 40271 39399 42719 43051 46586 47806 42224 46382 53681
7964 53681 53625 55635 56798 58647 53029 38925 36221 38745 34073 34533 39061 49329 51408 47899 51319
7949 51319 47467 41862 38645 40259 44508 50349 49510 43521 44653 38996 35585 34898 29578 23508 27471
7934 27471 29157 28951 27012 20649 24916 28586 30759 27473 24844 25841 18140 14251 18685 24221 26433
7919 26433 26694 23865 19750 15419 12316 13063 11912 9303 9909 9922 13665 18299 17544 17895 13587 19457
7903 19457 21853 14694 19836 24851 31824 31699 28549 28753 29859 21627 26906 26296 21454 13801 11826
7888 11826 16051 15180 19349 30468 28786 19130 9156 16061 23135 21762 23676 24282 26792 21354 13074
7873 13074 10547 9481 10662 11338 10889 8555 6157 6345 12141 8805 6829 9372 11226 16250 16065 11492
7857 11492 8145 8924 8366 8113 7007 10643 12311 18131 19269 19777 12132 10543 20141 24730 24000 19087
7841 19087 14559 11958 9306 774 5869 14993 12888 8269 13040 9983 7895 11179 6834 6081 5264
7826 5264 3278 6255 10892 15622 20055 12182 7553 11589 13316 6992 7558 8289 4055 602 -989
7811 -989 2251 7327 10444 10269 7045 34 -490 5176 9523 -2388 -5722 -272 1208 522 3085 11801
7795 11801 9849 1122 5245 6007 8133 10481 8568 3319 5963 3750 5613 8418 6952 10009 4484
7780 4484 -623 -1010 6679 9740 4995 1928 3367 6538 5736 6733 -438 -3661 -1100 6508 7389 4076
7764 4076 8994 12739 14120 11475 11926 15027 14486 11678 12703 13475 8851 5868 5077 1207 2695 4206
7748 4206 1279 4485 8368 7551 2922 -1737 79 1175 -2444 -1257 5870 9946 5681 -4225 -2287
7733 -2287 3255 10125 8188 10814 12579 9245 14086 19588 19437 9693 1324 4494 12215 12929 12281 16690
7717 16690 13202 13399 7760 -78 -2335 2982 5660 6226 7941 5811 800 3862 7778 5831 6722
7702 6722 10034 10838 4432 4879 6229 3648 3952 4260 10821 9583 3265 -1956 -92 1798 264 -4927
7686 -4927 -1726 2576 4885 7714 3460 -56 -1742 1091 7403 9615 9245 7485 13728 12333 4926
7671 4926 6315 8448 -1361 2300 3585 -1446 6114 7768 2791 -1735 1525 5089 218 -1775 -5401
7656 -5401 -1215 3301 -2545 -7697 -6526 -6858 -10419 -9329 -8481 -3822 -2862 -2974 -4311 -2762 -1019 -253
7640 -253 -6556 -7252 -1925 -723 2243 -133 1861 6716 8875 3338 -6337 -17892 -14286 -10779 -2162
7625 -2162 3827 7879 2645 2691 4509 8204 9300 6299 1395 -675 3121 11050 4985 2194 4168
7610 4168 -2254 -4147 1326 -2412 4123 6955 6137 -4132 -7359 -9929 -7960 -14416 -7087 -2394 1565
7595 1565 7031 -3287 -9904 -6734 -10130 -13998 -5095 1409 -3671 -565 6538 10771 -1448 -8651
7581 -8651 -14394 -19105 -10904 -3021 1289 282 -1286 -4965 -4694 -5883 -7934 -6998 -1026 1663 3340
7566 3340 5507 1718 -3114 356 324 -6118 -8935 1985 2549 -5725 -5330 829 9033 11262 6777 9132
7550 9132 3037 -5249 -3500 -1208 -10044 -8940 -3681 -972 5695 695 1696 6907 7332 9445 5097
7535 5097 1262 3620 8524 13957 11345 5779 902 2372 3144 2231 5955 5207 299 -3845 -4442 -10075
7519 -10075 -12601 -17226 -14597 -9289 -3019 -5967 -8935 -8237 -6394 -5711 -334 -456 730 -5163 -12975
7504 -12975 -16458 -12697 -4820 6734 5759 360 -2401 -15937 -14663 -6823 -3576 -2151 -2070 -5008 -2859
7489 -2859 -3239 233 -3382 -5537 -7681 -7173 818 7192 7454 3723 -1765 -6670 -10326 -8451 -8121 -12232
7473 -12232 -9471 -8650 -1997 -2135 -4980 -1609 -1843 -5173 -6733 -9913 -10273 -5528 -5233 -9169 -5579 -6895
7457 -6895 -10412 -8430 -11480 -10127 -16009 -9807 -1500 705 -949 4932 4761 -3747 -8213 -5705 2922
7442 2922 3303 4137 -5175 -11602 -12166 -11770 -5329 -6405 -7197 -9305 -3488 1825 -3324 -11151 -10361 -5718
7426 -5718 -2403 1064 -1070 1031 5027 -995 -2312 -6818 -2020 6650 -689 -1257 -1873 -4296 -9331
7411 -9331 -9275 -5643 -7623 -11828 -10176 -8710 -7132 -415 -2 -4259 -7611 -14690 -13579 -11042 -10409 -4594
7395 -4594 -8917 -12459 -9526 -1066 4492 1281 2047 2660 2860 5962 1950 -1240 -5874 -8014 -5255 3978
7379 3978 3371 2385 3021 1482 -2460 -1506 2052 1650 3662 3964 6990 12545 6794 7041 7321 3362 2882
7362 2882 -3377 -1954 683 -1289 -1133 -4551 -4283 -10487 -11929 3765 2242 -773 -4319 -3515 -612
7347 -612 -3021 -6647 -10672 -20097 -26091 -26524 -16533 -4227 -2625 -6721 -3387 -6018 -10366 -15171 -10863
7332 -10863 -6735 1400 3392 4603 3362 -5363 -4283 -4406 -121 4428 -3230 -9638 -10614 -6019 -4865
7317 -4865 -3259 -9973 -7656 -6024 -12878 -14716 -11592 -7916 -8380 -4530 -464 -3667 -5275 -4075 -6257
7302 -6257 -8526 -15581 -22502 -15456 -12836 -6344 -1141 2887 2876 -3607 -3752 1145 4211 3442 7421 6332
7286 6332 -3313 -6084 -2540 -4883 -1582 -552 -4206 -6876 -6936 -6311 2514 11595 10365 10241 7170 3812
7270 3812 1148 3332 229 3345 -2342 374 3899 5627 4172 4720 2763 3771 9810 5526 -3859
7255 -3859 -189 3802 4397 1497 -4312 -11024 -5692 -3545 -4728 -2389 -545 3931 1161 -7738 -8729
7240 -8729 -8915 -8129 277 3004 1019 5617 7763 690 176 2072 -650 1813 877 2443 2552 -4734
7224 -4734 -1109 -124 4781 5450 5400 3908 1720 -6191 -9593 -4508 -4841 -7005 -1022 -194 -4050 -8538
7208 -8538 -4969 -6440 -9334 -12411 -2793 -2789 -7643 -10426 -11112 -13231 -19637 -18549 -15907 -13325 -9577 -8501
7192 -8501 -7027 -7963 -4856 100 -1099 -5044 -382 -845 -4685 -9917 -17628 -11012 -7538 -11959 -16106
7177 -16106 -20829 -8493 -165 -2472 -9503 -16317 -18074 -16231 -14614 -17109 -13396 -6468 -10169 -15743
7163 -15743 -14159 -14711 -11619 -2532 -87 -4530 -6704 -6488 344 3456 -460 -2429 -4051 -5739 -7083
7148 -7083 -9256 -3129 2197 3323 -7347 -13270 -11650 -10529 -12593 -7894 -2472 -8480 -11274 -10278 -7530
7133 -7530 -6957 -11205 -9297 -9173 -8430 -5590 -9190 -13056 -13760 -8768 -15697 -18786 -12820 -9219 -10211 -11958
7117 -11958 -11871 -8865 -11769 -5471 -6937 -6487 -4851 -10795 -10006 -8338 -16455 -20348 -18223 -17566 -21051 -7119
7101 -7119 -4955 -6267 -3451 -2617 -1189 -2274 -4972 -8477 -15471 -11865 -5704 -1185 3828 731 655 -6397
7085 -6397 -13696 -13354 -13653 -13588 -13290 -17396 -9150 214 3400 -2632 -1552 -23 2041 -770 -201 -820 -4110
7068 -4110 -13145 -18767 -18026 -16708 -14451 -14586 -6889 -7393 -9284 -10438 -15196 -13757 -5262 -7414 -8441 -8237
7052 -8237 -7114 -4654 -6338 -6312 -3143 -9277 -10111 -3460 -4527 -5301 -6403 -2431 -1149 -2047 -4285 -7094
7036 -7094 -8160 -7856 -14871 -15838 -15492 -11196 -2522 2217 -1830 -15202 -18238 -12203 -7310 -4466 -6736
7021 -6736 -4928 -7713 -7019 -3084 -5003 -3217 -3019 -5344 -9553 -6185 -1945 -7227 -5290 1429 -1624
7006 -1624 -7279 -6309 -9363 -10276 -8037 -5684 -7562 -8103 -5088 -2806 30 -6651 -9758 -11531 -7701 -8909
6990 -8909 -15864 -19197 -12549 -6227 -8282 -7696 -6375 -5813 -6654 -7884 -6955 -1869 -7224 -16136 -5230 -1769
6974 -1769 -2826 2646 -1946 -10475 -15887 -12451 -5808 -1768 -3047 -5166 -8805 -7460 -3220 4177 11344
6959 11344 8561 -1996 -6704 -10300 -9613 -4671 -2277 -3441 -4618 -3485 -5070 -2009 -4583 -6485 -4964
6944 -4964 -5165 -3539 -5853 -8496 -5713 -10614 -15113 -12221 -2077 72 -10641 -17364 -14288 -9586 -3995
6929 -3995 956 -1249 -6387 -10870 -3629 -3428 -10333 -2911 -1749 -6538 -10039 -8868 -10152 -13798 -13794 -3552
6913 -3552 777 1562 -440 -3936 -6927 -10108 -6192 -6110 -11121 -10875 -2510 5049 2722 1827 4882 2388
6897 2388 -73 -6514 -17409 -14925 -10460 -12067 -15561 -14977 -3650 3907 -2155 -5806 -5996 -13451 -12523
6882 -12523 -8540 -8308 -8140 -8102 -10447 -10708 -9569 -5559 701 319 -1412 -6801 -11389 -10027 -7278 -4503
6866 -4503 -4012 -1829 -10288 -18595 -14178 -4308 -4993 -5522 -3810 -4139 -2015 -4308 -7490 -2363 -3217 -8922
6850 -8922 -11693 -10038 -2625 -1736 5359 1386 -3259 -2208 -8714 -12638 -20497 -9269 7582 7600 -575
6835 -575 -5020 -8931 -7209 -1788 -295 129 -2948 -4610 -6669 1955 4465 -497 -1208 -3368 -5035 -4293
6819 -4293 -2735 -6616 -12388 -11466 -8089 -11727 -13448 -13097 -13279 -14045 -8838 -6220 -5840 -9437 -13436 -10009
6803 -10009 -9275 -3347 -2879 -3568 1238 2837 144 -384 547 3123 936 -4211 -10404 -12098 -4268 5668
6787 5668 7555 2002 -2849 -5284 -7147 -8807 -7800 -3011 425 -1034 -3672 -7934 -6000 -8534 -10377
6772 -10377 -8094 -7906 -11274 -6952 -6950 -8770 -15780 -15450 -6004 -6561 -6050 -10691 -4738 -2781 -6379 -7996
6756 -7996 1820 4370 -2452 -5148 -1088 -1066 -8513 -13671 -17662 -17538 -16209 -13713 -6772 -9284 -4817 878
6740 878 -1119 -8356 -14067 -12324 -2800 351 411 -833 -4081 -4275 -3794 -600 -1197 -1244 -1765 141 212 -4431
6722 -4431 -2214 -531 1108 5491 12631 14402 12291 10351 -74 -6124 -1281 -4 -802 3601 2411
6707 2411 2182 6212 4127 -692 -2804 -5614 -14898 -13663 -16597 -16053 -12251 -4667 -11136 -11651 -8316 -9774
6691 -9774 -9936 -3053 -7677 -9696 -3802 -2956 -6972 -7396 -8325 -8211 -7939 -4006 -3792 986 2197 -1438 861
6674 861 2319 3296 252 -9377 -21097 -18386 -6715 -1 -171 1682 -2471 -11238 -16567 -22068 -20560
6659 -20560 -11768 -750 1334 5517 6067 5724 2929 -5066 -10971 -10942 -7360 -1596 -243 -6290 -12185
6644 -12185 -9026 -7848 -5677 -3440 -7738 -2734 4080 6616 5243 414 -2601 -1958 10520 16409 10213
6629 10213 2441 -4704 -9913 -12317 -10030 -10554 -1470 2785 4800 2465 -11869 -12783 -12738 -9508 -6419
6614 -6419 -2612 -2915 -3076 -10579 -14743 -14613 -8477 -5238 -10044 -5477 288 -954 -6432 -9871 -9180 -6355
6598 -6355 -10680 -8301 -3519 2005 3911 8114 1552 3455 2000 -1215 -357 -685 1475 -1164 -4958
6583 -4958 -3917 -4944 -3130 2178 -1523 298 -2546 -2588 -7052 -6322 -8867 -6255 -3529 3699 5951 5052
6567 5052 3871 3588 -3639 -5691 -6188 -7700 -11242 -3000 -2422 -5071 -5787 -6286 -5031 -4467 1084 3923
6551 3923 -2881 -674 1862 1157 -6873 -9461 -10027 -7723 -6598 -4826 104 -1897 -7624 -16946 -15957 -18005
6535 -18005 -18340 -12029 -2043 -503 -3072 -745 174 -7516 -10081 -8467 -5538 -9275 -14431 -15576 -15055
6520 -15055 -11336 -4691 -3021 397 4462 6552 1632 -2899 -12127 -15148 -12060 -14947 -10475 -8155 -7175
6505 -7175 98 -4106 -5700 -5087 -5974 -1115 823 3256 1585 -5459 -8272 -6693 -8191 -14842 -16221
6490 -16221 -13938 -18036 -14436 -7087 -10186 -9177 -11389 -11354 -9223 -9036 -10766 -10572 -8479 -13777 -7288 493
6474 493 1724 65 -8076 -9933 -13885 -12636 -10370 -5190 -5463 -3972 -9760 -10521 -11384 -5673 200 8968
6458 8968 10295 1736 -8526 -5757 5964 2166 -12566 -15783 -13998 -15701 -14273 -16287 -7265 -2548
6444 -2548 -3003 -1968 -6847 -691 911 -2987 -6046 -8114 -9887 -2352 2315 135 -5854 -4932 -2992
6429 -2992 -3069 -6800 -3764 -5020 -11176 -10549 -3253 -110 -3916 -8021 -9563 -4628 1405 3342 4209 3537
6413 3537 1746 2376 3004 -6166 -5461 -2923 2291 -852 -4694 -7401 -8081 -10275 -12418 -5941 -3742 -4693
6397 -4693 -4326 -3850 -9141 -7042 -2020 1320 4674 2126 2977 2234 -4263 -3407 -4763 -1247 -2677 -10741
6381 -10741 -10215 -4198 -2401 -6151 -6455 -8252 -9642 -11980 -9673 -11259 -9761 -8647 572 4947 3550
6366 3550 2249 -4878 -14092 -11115 -1445 3463 4018 5289 4052 -1099 -1767 2694 2891 5537 5127 -888
6350 -888 -8090 -8431 -9107 -10715 -7164 -362 595 7797 5705 2218 -1183 -6295 -7501 -4924 -2811 -5278
6334 -5278 -12072 -10027 -8162 -9963 -6222 -12214 -9613 -7240 -13548 -12310 -6315 -7790 -16626 -15468 -9626
6319 -9626 -4111 -1272 -2174 -5576 -1353 6081 9045 3812 6903 9690 8598 -831 -3925 -3240 3827
6304 3827 1790 -4365 -2371 -412 -419 -3627 -831 2492 8216 -1011 -6071 -9521 -9093 -14175 -7058 -2486
6288 -2486 5416 10862 260 -7196 -9722 -10905 -6542 6462 6613 2373 -3490 -8180 -4787 -3187 -6610
6273 -6610 -7960 -8555 -10363 -12762 -2686 4860 3047 -10387 -10031 -10295 -7171 -7048 -8375 -1918 1467
6258 1467 -1983 -1089 -1191 -5758 -15975 -13967 -13670 -17249 -11424 -5919 -6548 -5774 -6745 -3977 -7714 -11052
6242 -11052 -9576 -11898 -13562 -15787 -12863 -8709 -6463 -11607 -10254 -14609 -11643 -6413 1444 -1804 -6086
6227 -6086 -9117 -9814 -4659 -5020 -7880 -11772 -7120 -3969 -3165 -10694 -11837 156 1424 27 -809 -10345
6211 -10345 -12235 -11863 -9331 -1868 1633 4583 1841 -845 1097 -852 870 -2191 -446 -1882 -4950
6196 -4950 -5830 2344 -2068 -8244 -11991 -14806 -11809 -1061 3308 -2658 -6722 -8662 -10295 -7520 -2399
6181 -2399 1345 1565 -4692 -2072 4137 10420 5614 3019 -462 -8501 -15960 -7882 -4180 -1994 -1698
6166 -1698 782 -2410 755 -667 -2800 -1462 -4368 -2868 -4611 -7133 -5478 -5252 -5615 -7370 -10289
6151 -10289 -10212 -517 -3633 -3994 -889 1351 -1895 1717 4516 1881 7151 1178 -9762 -10073 -4281
6136 -4281 -6646 -10963 -9781 215 -1199 -1121 -1070 -1691 -5704 771 6469 9510 5042 -4512 -8864 -4843
6120 -4843 1421 -1758 472 1343 328 1251 -1722 -4638 -1857 722 -6268 -9425 -10223 -9929 -5383 -5961
6104 -5961 -3154 -3000 60 1788 97 -3188 -7979 -9363 -2810 -172 36 1467 1286 2008 -726 3648
6088 3648 9771 16593 13563 13706 15545 8774 -722 -5087 -8023 -5505 -3742 -294 -2749 -8413 -9226
6073 -9226 -10066 -4859 -344 1069 3091 4306 -695 -9740 -5123 -7490 -4845 -1662 -4357 -11886 -6518
6058 -6518 4125 3632 7248 6633 1677 -558 -5106 -6438 -14507 -16138 -9110 -4533 -805 -3896 -7666
6043 -7666 -14474 -17395 -12555 443 8334 12851 9033 -844 -8255 -7069 -4263 4261 11099 4141 -41
6028 -41 -2078 -592 2705 6765 2824 -2287 -875 -2215 -5461 -2897 -1026 -4876 -9132 -13406 -10201
6013 -10201 -6032 -4285 1468 -1361 -1481 1383 1600 -6403 -10674 -14317 -11550 -8891 -7404 -9804 -1
5998 -1 2846 -1205 -7404 -3414 -6156 -7358 -7577 -7455 -10716 -10295 -1967 -4688 -7146 -8528 -10590 -12472
5982 -12472 -12018 -14542 -8500 -9281 -6245 -3510 -11476 -18971 -20350 -22073 -17308 -12086 -10469 -13950 -12296
5967 -12296 -12468 -11694 -5741 -639 -6130 -13388 -14517 -13635 -5786 -8269 -8691 -4560 -729 -1364 -450 -2468
5951 -2468 3846 2747 -2468 342 -343 2337 5566 1187 3667 5741 6707 5957 5365 5179 3278 1841
5935 1841 -6318 -3617 -194 412 8559 15363 19760 11799 5293 2845 1214 1523 -5024 -13689 -19660
5920 -19660 -21251 -21478 -13918 -8224 -4629 -7670 -12554 -13792 -15193 -15044 -3032 -951 50 4652 -726
5905 -726 -9368 -10824 -9112 -5250 -3282 -5260 -6994 -8541 -18799 -15658 -8091 -965 -6077 -4585 -3755
5890 -3755 -2361 -5992 -14526 -13886 -9356 -9029 -13901 -8010 -3613 -3708 -6334 -4894 920 8149 3984 -8250
5874 -8250 -11983 -11638 -7932 -9831 -11142 -6504 2320 -3942 -3740 -1909 3313 2483 -1869 -1354 -384 -540
5858 -540 855 -3445 -6315 -2803 1741 4971 4754 5316 4006 2854 -3341 -3450 6198 1891 -5580 -3916
5842 -3916 -4692 -9272 -12300 -16024 -11465 -5769 -4004 -11925 -5737 -1042 -1119 1099 -1987 -3310 -7066 -7303
5826 -7303 -6077 -6601 -4951 2199 11418 15057 11302 4890 -4447 -6669 1066 -2496 -3219 -1436 -2135 -1403
5810 -1403 -6694 -6373 2335 -1573 -5920 -6817 -965 7459 11792 7938 5011 -4782 -8324 -6301 -4610
5795 -4610 808 1438 5453 3620 1580 -1997 -9161 -10509 -2746 -6563 -6121 -1963 1081 9016 10333
5780 10333 2420 -9696 -10831 -3375 1221 -592 -4891 -11501 -7207 -6060 -1426 2168 4397 1886
5766 1886 3046 -1687 -3642 -9793 -10940 -2006 -5955 -3825 800 -848 -2161 -3640 -8712 -9938 -2421
5751 -2421 -640 -11339 -19279 -12328 -6942 601 4953 2554 -1145 -329 -2085 -4581 -4727 -6920 -3093
5736 -3093 -10375 -15361 -16468 -7516 -8110 -12269 -1896 3016 -3810 -3879 1675 587 -1073 1578 3370
5721 3370 1688 14 -837 -245 2234 5066 183 -6949 -8779 -5711 5686 9823 3864 9201 8501
5706 8501 -1931 -11227 -9108 -3796 3011 7230 6136 2257 2808 174 -2322 -4892 -8367 -10865 -15528
5691 -15528 -12283 -5916 -2439 840 -5548 -9683 -4348 -3609 -1643 -3097 -3112 118 47 -6036 -6617 -5836
5675 -5836 -2345 447 -4192 -12176 -15473 -10222 -8837 -10186 -10588 -1481 4738 499 278 -3608 -4630
5660 -4630 1746 1641 -2098 -9773 -11001 -7070 -428 3404 6427 2358 4559 15515 8575 -6934 -15496
5645 -15496 -12984 -5443 -4171 -8211 -10121 -12840 -8348 -15967 -16601 -13639 -4877 -1333 -10670 -13797 -13851
5630 -13851 -12663 -13444 -5205 -817 5019 4153 2174 -479 -1779 -60 -856 -566 1629 6757 7845 6874
5614 6874 5861 2010 -1343 -8260 -6045 -3861 -5275 -3315 1499 7438 3611 5203 7684 5560 1842
5599 1842 -3075 -10638 -9310 -7715 -3321 1026 1375 -3963 -7736 -9813 -12848 -9022 -3897 -4925 -4723
5584 -4723 -6246 64 -1689 -8249 -7639 -4183 -6841 -7925 2300 6598 -1401 -477 4371 779 -3492
5569 -3492 -1139 -658 -2086 53 -4189 -5445 -5003 -6075 -11552 -12984 -18235 -17112 -12939 -2746 1274
5554 1274 531 3963 1680 1619 -3974 -4161 -5397 -5775 -8394 -5003 -5214 -2677 2964 11492 17711 13891
5538 13891 9998 9632 2883 -3129 -3334 -1312 -6853 -2528 -3324 -6253 -18516 -18238 -14279 -11591 -7347
5523 -7347 -5047 -227 899 -172 -1832 -109 -6422 -6881 -8943 -12137 -8725 -8028 -7939 -9090 -1072 -1687
5507 -1687 -3592 -7733 -8260 -3193 4241 10718 12921 12872 5903 -1558 -3493 -3737 -1042 1943 496 1843
5491 1843 2977 1859 -1772 4561 8423 6011 1692 -1182 -888 4592 786 429 -1684 -3092 -5185
5476 -5185 -18510 -10641 -1866 -7461 -6178 -7625 -11769 -9547 -6851 -8659 -12779 -10311 -11787 -13608 -13931
5461 -13931 -9369 -2808 -4482 -6969 -9849 -14562 -14794 -11090 -8237 -8330 -8420 -15036 -13665 -7359 -7207 -3921
5445 -3921 -7373 -10699 -3567 -2392 -1617 -3168 -2488 -2680 -1661 -5813 -7699 -5662 1388 8612 3025 -4781
5429 -4781 -13232 -5295 -1141 1325 -2808 -9598 -4691 -4821 -8392 -5918 1915 1157 -3171 -10688 -8515
5414 -8515 -6442 838 5426 7548 3883 6659 6087 3612 132 -5546 -7393 -9283 -9615 -11224 -11849 -10431
5398 -10431 -12605 -10364 -6985 -4254 -632 830 4267 5979 9372 9790 10593 9798 9338 3229 5088 10097
5382 10097 4765 2223 62 -929 -5344 -3347 1600 769 1457 1574 6041 11262 2689 -6970 -16579 -14295
5366 -14295 -6357 1923 379 -2957 -3595 -4889 -9214 -9925 -8466 -5633 -1539 -4795 -4761 2065 2960 137
5350 137 -3385 -9465 -13350 -10321 -8074 -2145 -1135 -5975 -7785 -5427 488 -823 -2328 1129 963
5335 963 1015 -6495 -7788 -3918 1027 3094 3969 56 -4655 -4101 -2139 2763 1835 2849 -5744 -11741
5319 -11741 -16149 -11327 -7837 -6129 -8736 -13537 -11442 -6198 -9917 -8992 -9936 -13118 -5660 736 4205
5304 4205 1337 -231 4287 4081 -2399 -12845 -17647 -6759 771 -636 1047 300 2547 -962 1724
5289 1724 -1185 -2909 -2293 -6561 -6959 -11101 -8153 -3340 -1076 -2983 -4880 -2422 -6820 -13933 -11060
5274 -11060 -8835 -11244 -4430 1011 -2284 -1232 1289 -443 -7456 -5155 -2232 -8556 -15039 -12995 -17285
5259 -17285 -12483 -3056 5803 942 -3692 -3471 -3767 -2644 -5740 -11008 -14229 -11378 -4980 2880 3702
5244 3702 -3756 -2108 417 1534 787 -6298 -14885 -15493 -7777 -6232 -5528 -7460 -2055 5018 4160 3122
5228 3122 6783 5578 7028 3449 -1986 -4732 -7675 -15916 -16013 -4667 -1683 1967 7107 4581 4427
5213 4427 -1587 -4761 -2560 -2389 -2523 -5765 -7194 -11688 -8376 -4379 -6615 -4412 240 -2859 -3903
5198 -3903 -918 -6649 -9565 -9439 -2843 -1892 5575 4002 -2408 -6807 -9776 -4275 -4927 813 -460 -11360
5182 -11360 -15438 -11221 -5242 -4593 -4495 -4178 -1252 -1956 -3997 -1480 -3461 -13188 -16670 -17075 -18316 -8819
5166 -8819 -7328 -7176 -3651 -3020 -3119 442 2033 1211 442 137 -1728 -3919 -2836 -9439 -10036 -8394 -886
5149 -886 -2073 5055 3263 -1054 -486 2541 2296 4901 359 -4206 635 5498 6133 8413 15885 17750
5133 17750 8019 3698 9059 6682 5468 -2357 -1103 4082 1595 1934 -353 -1482 -2229 -2726 -3249 -452
5117 -452 -1221 -5812 -1891 3791 4529 4810 9584 6563 1666 -5669 -4382 2670 2792 3670 4313 -3387 -11314
5100 -11314 -16811 -13539 -11909 -12704 -11174 -4439 7514 10329 6030 2467 6556 4801 12071 14416 10508
5085 10508 8278 1462 -2023 -6516 -5325 -6578 1161 3115 -6720 -9295 -604 5088 8141 6726 1443
5070 1443 -3100 -6800 -2819 -1526 -3177 -7131 -7334 -3766 1307 4693 2981 -104 -1620 -999 826
5055 826 5129 -51 1042 1036 -3374 1892 4014 -2801 -6737 -8387 -4492 5929 5886 -339 -5968 -10402
5039 -10402 -5644 -2398 -2455 -8362 -18848 -19840 -12246 -10833 -12624 -9848 -11756 -12870 -7530 -2506 -2010
5024 -2010 -1509 2474 3406 -1134 -3536 -1744 2493 3404 1331 951 5331 3037 -3305 1271 6590 2035
5008 2035 490 -4826 -2912 -476 -840 9432 12267 6432 2936 -1508 -7526 -15260 -9842 -7443 -10774
4993 -10774 -2777 7825 8128 3021 1318 910 -3356 -4639 -4155 -4360 -3461 -5698 -1267 2382 -833 -12229
4977 -12229 -15842 -9063 -7618 -2185 3639 11572 11420 10748 6404 -450 -3662 967 1793 2613 5978 7035
4961 7035 9353 9364 6844 3471 5868 7255 5539 -5254 -7469 -5909 -2185 2930 -1378 -4692 -5599
4946 -5599 -2862 3157 -869 -5097 -6963 -7641 -10376 -16188 -16111 -10747 -4737 -55 4491 12178 16988 12682
4930 12682 7540 4159 2278 4327 1475 835 -698 -4317 -1150 4559 5799 -2045 -14814 -17815 -11029
4915 -11029 -2662 -1616 -4672 -10134 -7579 -4778 -793 1480 6406 7705 360 -2442 -3438 -864 12350
4900 12350 14403 -2899 -12061 -9068 -8245 -13647 -16945 -16982 -14610 -12125 -8374 -10544 -10537 -3154 516 7299
4884 7299 12047 6513 5663 12773 13646 9011 7736 6372 5441 5764 527 -8454 -11363 -13080 -12235 -5809
4868 -5809 -5559 -2425 3781 -275 -2614 -5602 754 -4352 -10147 -6247 -6085 -3241 -6484 -6512 1255 230
4852 230 -968 -1090 -1833 -4393 -2051 -3333 -6643 -8463 -14573 -9156 -2172 1146 3352 -3497 -7462 -7162
4836 -7162 -8184 -5285 -6231 803 2799 -4664 -684 7171 10714 10046 7800 1015 3110 9495 12035
4821 12035 13449 5120 -731 1246 2878 4341 5107 6060 4224 823 -2740 -12537 -17651 -13803 -10698
4806 -10698 -5408 -681 2560 -959 3911 6735 1395 -4021 730 -2816 -4418 -568 -2864 -5828 -1555
4791 -1555 -3113 -6863 -7506 -5447 -3997 -11324 -9838 -4862 -4968 -911 -2468 -6157 -1916 -557 -7651
4776 -7651 -4680 -7464 -13483 -10052 -6709 -10309 -8922 -383 3452 6483 2305 -3155 -4384 -6291 -8694
4761 -8694 -8002 -6509 -3281 -9825 -13096 -6925 4040 3037 -3393 -4523 -8523 -7316 -3583 -2239 -1385
4746 -1385 -5139 -6410 2363 12721 5833 -5449 -45 2425 6183 12813 15714 15485 14473 9436 11441
4731 11441 6774 -655 -2716 -2080 -3050 -3712 -1424 2077 4606 8354 9788 10169 2635 12 1965 4786
4715 4786 5334 -961 -6911 -15827 -9883 -5095 -1748 232 5079 13878 11010 2901 4513 5772 2850
4700 2850 -3559 -2181 1074 -4503 -7422 -1592 -25 -3082 -2912 -7177 -6919 3660 8076 10143 9218
4685 9218 6729 0 -3313 -5072 1416 1696 3252 7676 3702 -3340 -907 -2891 700 558 988 -6579
4669 -6579 -8909 -8439 -5655 -10096 -9986 -2999 2108 5943 6098 2414 1877 1365 7926 2943 3575 1853
4653 1853 1962 2818 -3296 -7367 -6087 -11512 -8893 -2258 -144 -5536 -10533 189 7095 3001 2987 2439
4637 2439 -1761 -4911 -9283 -8156 -6442 -5925 -5647 -7010 2653 5734 -355 919 6960 9307 489
4622 489 -5405 -5751 -6418 -9058 -7777 -3189 -4799 -5846 -8677 -3372 -5196 -5161 -3536 -6124 -2564 5547
4606 5547 3722 -1937 -3683 -2370 -5921 -6757 -1621 3556 5942 7144 2075 1534 -1041 2131 6797
4591 6797 11766 12904 17210 18182 16802 10645 3294 -4764 2278 479 -10023 -6515 184 4207 -3609
4576 -3609 -2792 -1717 -6172 -5056 -2217 -400 4526 7615 -195 -5822 -12791 -11511 -12189 -11479 -3326 3192
4560 3192 -225 -1663 -1273 4141 4705 6803 11085 11696 9928 -1995 -5442 -1811 -6208 -3766 -8349
4545 -8349 -8287 -1577 3398 6986 4129 6854 6964 5206 3552 2430 -4443 -5759 -9595 -5157 -4647 -3489
4529 -3489 941 -4403 -4436 -5390 -9063 -10947 -6029 -1802 -4209 -6403 -1927 5089 3233 4678 -869 -5060
4513 -5060 5395 8508 6645 2843 2504 4093 -3520 -4931 -8112 -7260 -4434 -5586 -8514 -8835 1193
4498 1193 9070 8142 12497 1650 -5951 -3112 -1294 471 452 -4704 -1156 -2002 -1805 -174 -25 -4058
4482 -4058 -8422 -7552 -14340 -15517 -9015 -9538 -14787 -15197 -8519 -11761 -9032 -5988 -7090 -3463 -2913 -3728
4466 -3728 -3550 -3584 685 -3769 -8818 -13536 -6309 -1892 -2897 3266 3718 -546 -3469 -2929 -6844 -261
4450 -261 788 2595 8182 3592 -3985 -4620 -2321 3684 4214 -151 -951 1556 -1496 4204 828 -3681
4434 -3681 -954 -4664 -3248 -2734 -2733 5872 14831 14348 12123 9837 10943 13725 8276 7755 6229 -1274
4418 -1274 -1372 -6571 -6376 1420 6609 -1394 -3875 -960 -4053 305 2633 -1131 -5568 62 8295 5848
4402 5848 3747 9799 9119 2957 3938 7066 632 -5849 -8225 -3810 -234 2374 -13381 -19562 -7270
4387 -7270 -6407 -7852 -7038 -8532 -8750 -6971 -4008 -1354 5784 4140 -4444 -1728 4605 4771 3246 4923
4371 4923 5171 2067 1260 382 -1803 -5496 -10343 -7124 -7406 -2162 2556 2353 3195 6384 4936 4308 1536
4354 1536 600 8337 13754 -446 -3316 -5424 727 1508 3523 12834 10189 7851 3429 2387 -4174
4339 -4174 -8947 -12211 -9304 -7703 -10005 -10072 -4710 228 2223 2494 -121 -2169 -3253 -313 3780 6233
4323 6233 11093 6571 4742 7901 5595 -787 -8132 -4163 -305 3771 5822 5345 11662 9667 6254
4308 6254 8640 10095 8146 8468 13303 16506 13614 6565 -1453 4019 1669 1039 -2460 -5674 124
4293 124 2783 5469 5890 1591 -5390 -1823 -2177 -2630 -1824 305 6953 14113 10206 4168 2971 3866
4277 3866 2447 1639 -3346 -3444 -1287 -1645 3969 3736 5549 9126 12158 14326 14623 11600 4174 -6934
4261 -6934 -7967 -7331 -4444 -157 2480 -5294 -6579 -3869 -2895 3574 7662 10473 8007 7932 9164 -1455
4245 -1455 -4799 -4472 -1251 -2391 -1022 -5553 -8365 -2506 8452 11035 8519 11147 17418 15055 7189
4230 7189 1994 -2509 -3007 653 2997 796 -2107 50 2020 272 2375 -4780 -15604 -10253 -3255
4215 -3255 -6828 -2680 -2234 -5597 641 2530 -3881 -4261 -3393 3079 5770 4851 2786 3803 -2721 -9854
4199 -9854 -19681 -18628 -8500 -3827 1371 5259 4134 -2076 -14681 -14014 -4602 -765 -4558 -5196 -12023
4184 -12023 -15033 -10749 -1269 1271 -1685 -5209 -4406 -3454 825 2113 -3005 -1412 2465 1532 -1858
4169 -1858 -4960 -335 3837 5327 710 -4081 -6135 -2537 5036 5758 1905 2080 -105 3228 10837
4154 10837 2987 -2479 4765 2605 3249 11653 14604 13435 7303 5733 304 -9827 -10647 -8092 -5394
4139 -5394 6048 7351 3346 -5205 -8905 -5716 -3599 -5458 -2431 -143 4633 9358 5431 900 -926
4124 -926 -1249 4937 6422 3938 5294 1605 3195 3786 1037 -77 -647 -3413 5945 8598 16106 10624
4108 10624 4464 5181 3508 2662 7268 9149 5749 1708 1260 -328 1247 6909 8483 4658 -1749
4093 -1749 -4304 503 5855 4420 -1769 -6197 -7640 -7379 -5856 -560 842 1087 2763 2903 -989 -1758
4077 -1758 797 -2119 -1464 812 362 -3602 -11385 -12719 -10418 -12233 -4647 1044 5035 6890 9169
4062 9169 6400 4607 10124 9580 7516 2509 -387 -7957 -8197 7060 6498 2548 2528 4384 4882 -1029
4046 -1029 -5696 -4195 -575 6311 4381 -2841 -5021 279 12739 16997 18038 18735 15302 11406 14062
4031 14062 11777 5618 1834 2774 2774 -3558 -117 -2065 -6383 760 3565 -4851 -5714 -941 -1980 -4153
4015 -4153 4357 4322 113 1001 -1738 -3048 -1576 5019 9997 13318 12655 5898 -7125 -9014 489 651
3999 651 -3228 -2904 -2366 -917 -85 3541 4505 -1709 -3335 1616 7203 5986 4806 896 1254 4986
3983 4986 2605 2095 -687 -3153 827 6965 7271 3771 -4653 -11107 -8794 -5935 -3746 -2497 -3658
3968 -3658 -4397 -2501 144 -4142 154 2502 -4320 -210 4278 4689 2786 -528 1641 88 209 3017
3952 3017 656 -1088 -3589 2179 4078 939 -4688 3287 13240 8565 2773 2247 7044 13684 16492
3937 16492 16177 15997 9345 3324 -2268 1511 2492 -1514 -1359 7605 8365 7240 7135 516 4393 4997
3921 4997 5962 1853 5082 4523 4414 4652 6740 7444 9041 8708 6882 9186 10580 11230 15621 8362 2003
3904 2003 1808 4850 2747 3280 4795 -1114 342 -292 9644 13426 12344 5512 139 -2086 -2089 -3497
3888 -3497 805 5126 5080 6580 9048 11090 8719 8850 7915 7181 9302 17135 13787 5031 7263 2064
3872 2064 -2529 -2930 -2229 -2850 -8440 -9893 -4724 -6715 -8078 -10265 -8700 -13805 -11931 -8509 -363 -2759
3856 -2759 -10253 -10024 -1549 -1190 -978 -2631 -4100 -1815 -596 -3848 -1754 -795 -7086 -7222 -488 -805
3840 -805 -4566 -3161 5417 1002 -11892 -9177 -5542 -8825 -13594 -13581 -4359 -4826 -10844 -5865 -2276 -5320
3824 -5320 -9423 -9586 -8051 -6789 -6569 -8885 -9807 -14151 -10934 -5837 -2026 -1319 -10049 -13062 -5279 -9177
3808 -9177 -10595 -8557 -8597 -4320 6129 7846 4851 -400 -3043 -4985 -3326 -1542 1072 138 859 -3393
3792 -3393 -4366 -5746 -4260 -4390 -7762 -14081 -16730 -15457 -14838 -4663 -1261 -4131 -7842 -4897 -4028 -14809
3776 -14809 -18973 -10704 80 -3658 1069 5213 9398 3894 666 2618 7005 7050 3374 9612 15342
3761 15342 15198 6992 3759 3181 9018 16318 19898 23397 18434 13683 11951 8729 7765 9492 8133
3746 8133 -148 2459 3736 -3746 -6023 -5456 2343 3830 -4545 -4958 -2343 -5823 -4298 -804 1561
3731 1561 1702 4438 6769 9067 5985 2321 9819 7373 -3154 -7622 -3072 10493 9584 8974 -3098
3716 -3098 -9008 -3957 -4766 -5389 -4150 5315 6754 535 -1849 -1918 2827 -89 -1931 -9894 -9611 -6863
3700 -6863 -12881 -14717 -4083 -1146 4591 9277 10560 9881 4382 3708 908 -1231 -1960 -4930 -4558 -10638
3684 -10638 -6587 902 -790 786 4522 10247 14007 6488 -107 5288 8629 2483 -8909 -6085
3670 -6085 -215 2382 2798 -1690 -6529 -4663 -3209 -4965 -6945 -3922 -4248 -523 4273 -2761 -8974
3655 -8974 -8416 988 -38 -4105 -1879 720 6324 6109 -3007 -5116 -8388 -1018 5447 5047 7105 1529
3639 1529 -1065 1797 1173 -987 3863 3450 6500 2149 873 2595 -1600 -7550 -9664 -10280 -9114 -6394
3623 -6394 -4382 -8389 -3294 2253 4568 -361 -753 4308 8775 10526 13949 15646 8221 5744 7754
3608 7754 7142 7870 8095 7769 3633 -3941 -1900 -5179 -318 12169 19627 18964 13405 7837 204 -6386
3592 -6386 -8188 -8549 -1126 3403 2130 -3647 -4694 -4871 2096 -837 -4206 -461 -1384 -4860 -5126 -5048
3576 -5048 -1618 1121 6593 3118 943 -2643 -2511 -4585 -1590 2980 -3166 -7793 -7800 -4452 -7721 -7521
3560 -7521 411 7745 7733 5038 5203 1872 -4296 -8485 -2691 -1582 2100 3645 5696 7169 5819 1565
3544 1565 -3082 -1727 5229 6592 9685 10968 6707 -4442 -10452 -11167 -9102 -13589 -18361 -9342 -345
3529 -345 114 -9728 -10730 -8677 -7681 4976 923 -3581 -3907 -3681 1260 -6937 -8480 -12324 -14198 -9397
3513 -9397 -4430 -1162 3362 3934 1381 -3009 -461 10879 10486 11759 9551 10549 12806 7760 -323
3498 -323 -5642 -7736 -9011 -3340 3899 5808 8082 11223 6940 7506 7292 95 -2207 2271 20 -5350
3482 -5350 -3823 5732 7734 9582 10978 8200 556 -6865 -5293 -1244 1604 -468 -2502 -9232 -5357
3467 -5357 -3493 3210 4903 3428 11173 11913 9684 5035 4500 2252 -3504 -4119 -6291 -1049 -1170 -6435
3451 -6435 -4006 -4260 -699 -259 199 -1851 2868 4800 8148 4833 -779 -731 526 -5775 -8300 465
3435 465 3202 -6556 -3649 -1534 -5996 -9120 -4028 -3977 6239 13364 11688 8791 7662 -2394 -4498
3420 -4498 -259 1004 -5169 -5733 -6019 521 6605 8069 -1722 -4716 -887 2831 1395 1229 4923 336
3404 336 1041 -490 -8654 -11384 -10285 -9837 -10071 -2474 1707 3486 851 -8469 -8304 -10002 -13393 -16977
3388 -16977 -12899 -7122 -1226 6059 5204 5901 9478 5841 7435 9419 4445 -198 -9029 -9367 -1774
3373 -1774 2791 4222 6711 4570 636 -902 -3177 -134 -5936 -5792 -1398 716 -1746 -6576 -8717
3358 -8717 -6751 -1351 6354 4639 4193 8221 8127 6482 -4362 -8534 3362 6935 5348 3426 -164
3343 -164 3198 11180 14775 21049 16084 12600 5859 -1238 -3130 2417 6753 3440 4809 4297 1367
3328 1367 -7719 -3118 2937 1527 422 -1256 -1562 -4062 -4270 -11468 -9742 -2472 5770 4647 6700
3313 6700 13371 14777 18343 19782 17942 9541 8629 12802 17537 23182 12239 706 -1360 2327 8074
3298 8074 10708 1391 -1260 21 4388 5230 4953 11401 12919 10113 8481 8775 9436 -687 -2735 -5342
3282 -5342 2469 8232 -1744 -2712 7178 4648 8397 11406 9088 6061 8963 7200 4788 1021 5157
3267 5157 9663 4658 89 8394 4558 4034 9134 6979 6103 6010 5580 9459 15596 10797 5515 1378
3251 1378 -3404 -306 -5536 -7356 567 -2624 -5208 -1825 7431 12715 1866 1851 -1573 -3548 1392
3236 1392 10433 15333 13838 12671 9678 8031 5909 3777 8140 11774 13612 15088 11160 3696 955
3221 955 -4146 -9234 -7392 -769 4796 4545 5005 -1708 -9160 -11374 -8920 -12543 -11289 -2154 6426 15194
3205 15194 15330 9639 1256 -3759 -2194 -2825 -5807 -374 9409 13308 12596 7300 -1635 -7906 -11887
3190 -11887 -5741 7304 12223 5736 -1939 -4274 -2589 1270 422 1513 2287 4155 10302 6854 4526
3175 4526 450 -1578 3084 4693 1761 446 2822 3266 3598 2315 -338 0 776 1750 4917 3212
3159 3212 -60 -158 3656 5983 8449 2476 -4467 -2538 -663 334 2791 2770 6822 1138 2082 4492
3143 4492 7868 8737 8816 11323 19426 13108 11241 5545 7236 10250 12371 10162 6350 1480 -957 -4201
3127 -4201 -4425 293 4222 1691 670 -728 -2202 -5137 -260 2830 573 4064 6563 5789 3115
3112 3115 4143 3844 979 3691 1862 -2666 -3910 -307 6100 8655 14439 13599 -182 -5916 -6449
3097 -6449 -2480 3099 4578 9953 14178 15478 13260 10039 8529 3843 -2761 -534 1755 3120 3266
3082 3266 2355 4425 1750 6288 7393 2306 -1069 -8748 -898 616 1095 12063 8433 5643 10592
3067 10592 10309 6942 3825 742 5216 10407 7176 5952 1233 11392 8732 6293 3518 3723 5117
3052 5117 7334 10542 4818 1141 4939 7189 332 2214 6122 -7480 -12095 -5754 3280 5996 4734
3037 4734 -3592 4982 10830 10713 12457 9790 6294 4982 2253 2038 -1269 1695 -1302 919 3894
3022 3894 6598 8953 12295 14516 6711 3638 891 1311 -1728 -4947 -4865 369 4348 2044 -3633 -2297
3006 -2297 472 547 2502 -729 -3474 -7043 -6423 -3347 1756 4429 7455 9388 11723 17455 7329
2991 7329 7240 5929 5313 10644 13201 10413 1882 -4139 -6243 -8253 -1782 2011 1242 2938 340 -4441
2975 -4441 -11998 -8215 -8292 -10903 -10924 -2991 -894 -10634 -13388 -11527 -7769 -7283 -4235 -976 5815 1914
2959 1914 -5484 -1350 587 -5146 -8557 -141 2342 -1058 1423 1386 2502 5027 4003 253 -3216
2944 -3216 -4349 -3064 -685 -1547 -1385 1887 6366 4521 -2923 158 3129 4490 6014 5914 10728 7963
2928 7963 1049 -150 1575 472 4180 12361 10431 5528 6867 6708 4669 3414 6792 3826 1130
2913 1130 582 1829 658 3675 8789 6703 6880 5738 2827 1924 2981 1512 7 1532 -1204 -6489
2897 -6489 -8788 -6349 -2760 -3438 -7093 -5763 -3602 -8156 -15784 -7949 1705 734 -8727 -14903 -13584
2882 -13584 -2034 13000 16960 14283 5763 -3309 -5272 -2615 -5227 -6155 -1584 4077 616 -2579
2868 -2579 -3411 -2179 -1794 -3524 -4640 -2966 2427 1658 -5391 -4199 -8955 -8683 -2762 -6799 -9458 -2235
2852 -2235 5771 4099 3654 5522 4290 -3208 -3120 628 7867 4233 366 -8241 -8438 -808 5515 8938
2836 8938 6393 3487 1324 2558 5542 2477 2840 9427 9759 2777 7 -3265 -2095 7330 7625 5634
2820 5634 1793 103 2534 5065 263 2963 -824 -628 2722 4645 5693 8212 5744 7260 154
2805 154 -2772 -2676 20 3315 -1523 -6624 1751 13626 18135 12700 6530 6155 10668 6829 573 -5201
2789 -5201 -7383 -7659 -8794 -6950 -683 12827 16095 18468 21322 18796 12417 10249 8235 -587 -1262
2774 -1262 -5366 -9714 -4886 -2827 2955 3279 -4787 -2316 -4615 -7337 -1707 3530 36 -8657 -10622
2759 -10622 -7833 -1594 1247 646 4000 2831 395 -4780 -5923 -9410 -5634 -4500 3806 6209 8300
2744 8300 5865 8438 6620 -513 3521 10200 14262 14944 8344 4128 1069 5036 5424 4597 6751 1887
2728 1887 4644 4603 1837 401 -847 -8398 -5483 -5541 -7693 -7731 -3550 2850 7816 6978 -1324 1447 3335
2711 3335 -2780 -4759 -2607 -5195 -10595 -10442 -6102 -7321 -5802 -10710 -3632 -2809 -51 -4177 1096
2696 1096 5905 11798 12906 13866 12840 14372 10261 498 -5120 -7069 -8355 -8972 -2731 -3107 -9943 -5647
2680 -5647 -3668 3377 10394 10115 6849 3904 6533 11385 10512 11552 8811 38 -2298 -427 -1869
2665 -1869 -1463 3924 6797 4579 -1922 -2402 -11343 -11738 -5037 -6097 -3220 1642 5040 2244 -5218 -10141
2649 -10141 -7647 -11743 -11493 -6147 -3248 426 -636 -2416 1333 -2104 -3129 2134 72 4607 9171
2634 9171 2348 3419 5332 4007 4255 7700 10260 6913 4470 2997 4140 -1393 -863 3854 6739
2619 6739 12288 19655 19806 11696 5093 1995 998 3514 -591 316 5303 5625 6481 41 -6108 -5729
2603 -5729 -3347 6749 3380 7043 9837 4629 189 3317 3633 661 -1955 -2648 -2700 -6370 -3761 4641
2587 4641 4765 6706 829 -2718 -10342 -8945 920 7850 3790 -1314 -4799 -1205 2967 11653 18990
2572 18990 14795 6538 2435 3024 -653 -6598 -2659 7004 1165 -1309 -1590 -2430 3030 3309 -9737
2557 -9737 -10651 -7958 -3561 -3935 -4802 -2425 1642 1894 -2268 -768 -241 -1408 1274 2117 -100 -3516
2541 -3516 1600 -4330 -6662 -9890 -8890 -2292 2416 8583 6864 4220 9914 13489 7996 3388 4276
2526 4276 7645 12608 11179 2214 -3931 -837 -3296 -1521 -65 4655 5628 -407 -2389 -6649 -3907
2511 -3907 2813 5908 2889 4669 301 -4586 -9493 -9544 -10777 -10067 -10010 -1359 396 -341 -2266 -6416
2495 -6416 3312 10553 6497 3015 8561 17625 17408 8923 -2402 -5496 -4840 -1057 432 -2762 -2552
2480 -2552 30 1336 660 -3217 -2794 1079 2967 5405 5917 6825 1455 -10202 -15580 -9721 -4875 -2142
2464 -2142 631 -794 3985 9797 4078 250 627 -927 1622 3595 -1192 -7984 -11145 -11887 -10195
2449 -10195 -10071 -8231 -15192 -11138 -6408 -11048 -9743 -9022 -7972 -10350 -8995 -8700 -10374 -7431 -3776
2434 -3776 2526 2522 2202 -3226 3233 3336 6045 9890 1594 -4823 134 1999 906 -2706 -1841 -1883 650
2417 650 6726 3559 6126 7551 5249 4299 582 -2777 -5515 212 2094 -4689 -6445 -5162 94
2402 94 -1936 -437 -1182 -2135 -1021 -1438 -3919 -593 6060 4444 -2839 -8390 -13529 -14589 -7046 -3393
2386 -3393 -4696 -3570 -7159 -11642 -8221 -2938 2055 6560 5073 1877 -2149 -401 -1599 3350 6994
2371 6994 6030 4503 700 9891 13358 9015 11259 15908 8431 7675 4339 -2568 -2163 -6731 -6689 -4506
2355 -4506 3395 5589 424 -6560 -10469 -11611 -13782 -12654 -11384 -16629 -9955 -7056 -8355 -5610 -3146
2340 -3146 2702 6537 2495 7049 6446 7257 4038 5643 2881 3354 6333 4166 1808 -5874 -3498 -6816
2324 -6816 -11718 -5455 707 1826 874 -1395 2303 6227 3698 -11684 -17061 -16014 -11687 -2598 5246
2309 5246 7185 3421 537 1747 1903 -1016 -4074 -5887 -3744 -1654 5118 6590 3130 -1193 -2362
2294 -2362 -5992 -1278 -5302 -3481 4456 8627 8602 7898 3906 1473 285 711 -7609 -7523 -824 2529
2278 2529 5415 76 4423 5729 5973 5560 2643 -941 -5622 -7627 3 843 -2591 -7789 3182
2263 3182 10771 5839 1916 4719 8223 5227 4343 6185 9718 10781 6379 5109 625 4366 3825
2248 3825 5088 -1369 -7535 -3256 -9469 -11453 -8973 1084 9160 10650 11660 -478 -4193 -467
2234 -467 3641 1015 -4702 -3248 -3928 -2435 -2425 89 -2086 -1796 -3976 -3816 -3039 -3356 -1393 -1705 -10494
2217 -10494 -13191 -14589 -7218 -1102 -592 -2307 425 -2365 -5645 2371 8081 4786 1936 73 5583
2202 5583 9051 1091 -2882 1976 447 1418 5118 3269 497 5767 14128 10651 1088 -1700 5377
2187 5377 13312 11894 22 -4140 -1761 -6748 -11271 -14322 -7147 -5599 -2951 4276 8058 2194 -2438
2172 -2438 -3213 -7954 -9815 -9024 -3225 -3171 -1732 -795 3747 -1101 -4561 8020 13037 10091 3426 2798
2156 2798 231 367 26 -2016 -3963 -3162 -3177 -3473 -812 3500 4461 8799 7255 703 -1000 -2647 -2524
2139 -2524 -2464 -6700 -3532 5353 4885 -4771 -9638 -10205 -11213 -13061 -6834 -4240 -2518 1542 3405 3577
2123 3577 3160 2112 7338 4668 26 -856 2637 258 2274 -336 -102 624 5055 9279 8423 9917
2107 9917 16469 7628 82 -5568 -11089 -2231 2588 -1914 -3478 -576 -4794 -4595 -209 -2422 -3073
2092 -3073 3370 6442 5968 5700 5465 4072 4171 868 -2524 -11297 -6985 3447 1422 4170 3559 -699
2076 -699 -1230 -1666 -3413 1044 3020 -1287 -5931 -6484 -5663 -8147 -1085 2570 5027 3609 4998 5983
2060 5983 2708 9221 9258 9135 10632 13816 13023 13860 4779 1287 1299 4661 3361 3141 4693 120 1753
2043 1753 6069 5429 4028 -2657 -4500 -2202 -751 -3277 -5010 -3127 -986 2672 2237 -5298 -1152
2028 -1152 7251 11948 9870 2326 -779 -1806 137 487 -6366 -8816 -4588 -2381 -297 2936 3985
2013 3985 572 -977 372 5740 -1942 -941 1644 4971 10773 12667 3476 -9108 -14841 -14618 -7987
1998 -7987 4813 5258 -3158 -6921 -7858 -3516 33 -845 4195 6558 4511 -3739 -3773 -3 -1529 -1828
1982 -1828 1622 7288 8205 4887 -498 -2646 1673 4473 5861 1241 -1205 -3133 -1351 4910 3024
1967 3024 967 8079 5931 3077 2441 4706 3445 -5607 -7283 -8573 -9682 -5779 -5630 -3718 -859
1952 -859 7526 13095 8913 3216 -1257 -4 -2957 -78 -2834 1355 152 -7038 -7337 -10665 -14026
1937 -14026 -13783 -15127 -14307 -8546 -8166 -10627 -7812 -2229 -1079 -7977 -7489 -6614 -8375 -6452 -15015 -16533
1921 -16533 -10896 -12683 -14314 -5914 -1667 -1231 1495 -968 -291 118 -669 -3014 322 -3136 -4544 -16
1905 -16 -1415 -10719 -9952 -9680 -12061 -10274 -2321 -2536 -1427 -7823 -12228 -2273 2992 2548 -654 -1395 -5351
1888 -5351 -4743 748 2781 -2131 -9601 -8732 -7726 3545 3969 251 -485 2081 15 2470 8708 4826
1872 4826 5276 -2888 -2666 2225 -379 -3802 -1175 -1933 -5328 2289 6337 10856 9568 6769 8121 8035
1856 8035 3341 3585 11718 6972 5333 10984 10292 5481 1710 -913 -4751 2186 6054 4518 887
1841 887 -1828 -1450 1271 1130 3744 8479 8845 2516 4429 6380 9140 7358 4109 1867 1787 4755
1825 4755 5480 4438 3772 534 189 -7115 -6555 -3764 3296 11910 9654 1620 4904 4527 -564 161
1809 161 8208 11420 15813 17090 9414 4369 7513 4166 5843 2934 2575 2772 3968 7987 9286 12468
1793 12468 13532 9808 2195 3748 7542 3898 2221 6080 3089 6245 11294 9465 1479 1178 7558
1778 7558 6920 7896 5430 2463 -1903 -2615 -1752 -6132 -403 3056 -2263 -2142 1455 4588 1067 -1675
1762 -1675 765 2560 880 2848 3332 8780 4483 -2981 -4943 -5410 -8304 -9332 -693 206 -4956 -7168
1746 -7168 -2097 4793 8455 4952 505 -6196 -2783 985 -1677 3494 6145 4199 6816 6190 5987
1731 5987 9431 10018 10036 4118 -4733 -10583 -8450 -2752 -3062 -4457 1544 5309 1549 1124 151 1921
1715 1921 3314 -853 -3513 -3180 -2277 -6796 -739 -1382 2479 7684 12283 8872 7954 9715 16970 17233
1699 17233 6634 -4931 -7245 47 2050 -3124 -1022 -3009 -3107 169 7440 7441 5232 282 -1240
1684 -1240 -2930 8523 7537 5238 -639 -7073 -4671 4046 5056 -303 2684 7161 393 -7821 -15469
1669 -15469 -10677 1629 -2485 -7340 -4139 771 268 1674 14040 21780 25182 15860 7209 7408 8286
1654 8286 8467 10728 14101 9761 2644 4699 4807 6638 3854 -760 -4091 -1578 -2556 -2359 -2629 -2301
1638 -2301 -5707 -6860 -4319 -1584 6414 9490 6668 6339 8624 3239 52 1660 -4600 -5319 354
1623 354 2474 4311 5736 619 -5266 -13013 -5402 2089 3764 -5862 -14497 -18718 -15939 -15109 -17708
1608 -17708 -13831 -5256 5487 4863 8314 12687 10092 8292 14704 15877 13642 3805 1030 4960 5433
1593 5433 -6804 -8449 -4780 5046 4133 7434 7344 3853 2382 1098 -2736 -7155 -10839 -13668 -9677
1578 -9677 -8518 -7432 -6225 -7028 -8202 -4730 -3417 -7191 -4622 -9861 -13047 -9079 -8621 -7802 -193 5581
1562 5581 2309 -3649 -7129 -2522 2450 2438 -975 -4228 -994 -5819 -9611 -8150 -2660 -2755 -307 3386
1546 3386 5440 2254 1732 3544 -321 3749 4858 10600 17183 15229 14385 11941 11462 8644 10640 2441
1530 2441 -4558 -524 7361 6689 3118 3979 1735 -3228 -9062 -9832 -8386 -6582 -3345 3922 1056 -3634
1514 -3634 1575 4668 6348 5470 12030 17912 13737 7555 2124 1712 2820 819 -695 1150 267 -5234
1498 -5234 -7037 -10117 -8821 -7658 -5541 7974 9328 3052 3610 2020 3697 696 1826 3076 2579
1483 2579 2537 3517 1344 732 2987 5374 3494 3682 8474 4797 -4120 -26 1978 1861 5276 8214
1467 8214 7096 3520 7990 5986 3944 448 -1738 151 -2053 -2669 1759 5449 394 -9280 -11119
1452 -11119 -7137 -237 -6179 -12776 -7908 705 -712 804 -1680 215 -1149 1033 3955 6836 11064
1437 11064 12044 7108 4438 7424 9377 6840 9284 6917 5799 13625 13260 10423 9432 -1369 -6502
1422 -6502 1088 7307 6017 5900 3362 1371 2563 13205 13037 7441 -2663 -3077 1032 7131 11233
1407 11233 15500 11881 7853 1178 -5297 -2397 4070 8344 6050 3709 2163 5072 9150 7127 2890
1392 2890 8710 12052 11277 4269 1696 6107 7249 -2645 -8068 -11105 -11368 -8481 -5099 -1949 2459
1377 2459 2883 1847 5128 4735 -2112 -4514 -6149 -3854 3094 1437 -509 2965 748 -6037 -7627
1362 -7627 -961 -1902 -2655 -6286 -7664 -4970 -860 1054 3810 4442 4570 5370 8111 7106 2941 -5708
1346 -5708 -6055 -293 6359 2857 -2066 -9275 -11398 -1106 1146 6503 8405 6892 2535 6297 1202
1331 1202 -8431 -6900 -2666 3239 5440 5403 6277 4876 3876 3930 1396 754 559 -2457 754 3049 5386
1314 5386 9809 10507 5544 4070 2577 4460 1408 -5264 -1928 4579 3401 -2351 1022 6679 4871
1299 4871 4540 7568 6382 7307 9826 13592 12551 11779 9282 3372 1398 -245 -8694 -4840 -6337 -9600
1283 -9600 -6360 -1548 2724 -8064 -14181 -12990 -13673 -7242 -1414 -2931 -2614 3776 7840 13082 14808
1268 14808 8361 7345 6940 7732 4404 -4419 -4284 1543 -1257 -3905 4530 8359 9858 7699 5487
1253 5487 -2612 -5373 -1989 4943 1117 -591 -1111 668 3984 4081 3412 451 -1919 -4781 -2089 2481
1237 2481 4322 -1330 -4545 -12150 -15711 -8025 -1887 2842 4045 -2218 -16487 -20395 -22426 -16962 -14240
1222 -14240 -11522 -7318 2203 3858 8204 12619 8570 3218 2493 -1539 3761 9887 6661 3330 3648
1207 3648 2767 9889 11177 10995 4300 -2178 -3876 -1066 1169 3208 -3458 -5544 790 14314 9598
1192 9598 7113 7785 9365 8919 842 -168 4366 6445 3734 3100 11381 14508 8301 5972 8443 16931
1176 16931 18577 10891 4757 5186 5562 6920 14543 13182 7429 8035 10963 8082 2964 746 7201
1161 7201 5728 3751 -2984 3913 6584 1450 -2288 1504 1546 -203 3612 6212 4107 8473 12789
1146 12789 7825 -2861 -9280 -11886 -12006 -9019 -4194 907 1082 -5931 -3725 4888 4719 8541 8205
1131 8205 7312 10327 12299 14132 9500 10821 15600 12764 2110 3621 7339 7021 7322 11800 15426
1116 15426 17680 13327 13311 14465 13525 10628 6973 5297 -2590 -3316 118 4555 7584 5646 3513 4764
1100 4764 4069 -1633 110 4910 3933 7554 5160 -330 -3743 -4043 -3546 -147 -2733 -7859 -6247 -6190
1084 -6190 -6225 -201 -266 -4110 -3472 -2541 643 1338 3402 -3319 1257 1866 -2721 -7917 -6329 -4391 -6464
1067 -6464 -4455 -4136 202 3583 -2913 -1163 6890 4323 3874 2867 1804 2416 1689 -6057 -2668 2733
1051 2733 9244 7277 4908 3804 -8400 -1759 1476 1539 1970 5316 4088 -1574 -3900 -5491 2740
1036 2740 4916 -768 -5774 -2762 -1133 2735 5335 3470 3739 3968 36 4353 7032 9152 9581 8206
1020 8206 5199 4605 8648 9691 3833 2105 1983 7660 9540 12752 9495 2669 -1851 4694 1523
1005 1523 -6166 -3846 -2908 -2649 -3643 -3532 1500 3502 8585 2429 -9495 -8145 -5979 -9325 -12869 -11265
989 -11265 -8664 -8258 -1699 1355 -5878 -8368 -3974 -11999 -15267 -8683 -14111 -11544 -11128 -6421 -719
974 -719 -6829 -11745 -12034 -6924 -10380 -13661 -12293 -10334 -6618 -6147 -2093 1899 4859 6555 4301 1043
958 1043 -2065 193 -3814 -3614 -4814 -3844 -3886 -2709 -5550 -12584 -13738 -7440 2651 7621 10133 10506
942 10506 5560 4377 8111 8082 1710 -1142 -1 -5778 -8295 -6387 -10865 -13323 -12470 -18092 -19650 -12177
926 -12177 -10859 -4922 5900 -1799 -12080 -19160 -17313 -13490 -7951 -3301 -1189 -31 -323 -2805 -7133
911 -7133 -10323 -17442 -16718 -12718 -5925 -1999 -2309 253 1156 2863 4433 5741 5602 6480 9078 7071
895 7071 236 -2218 -3636 2323 3022 6475 15302 9666 4131 1263 951 1044 -9236 -10984 -8442 -8406
879 -8406 -5498 -8998 -13166 -11486 -13227 -9664 -2713 1928 10598 12042 6044 375 -10873 -16354 -9386
864 -9386 -1457 3620 4233 2339 4724 4057 2697 524 -6677 -912 -454 -2505 -9525 -8605 -8873 -6813
848 -6813 -155 -3940 -5030 -5877 -8306 -9216 3753 9852 12059 14429 10537 5679 -69 -1754 -4188
833 -4188 180 8166 12366 7818 -875 -9044 -8363 -2437 53 2408 6051 5737 4177 6477 6818 6081
817 6081 3258 2848 567 3407 8950 9918 4145 -647 -4298 -3616 -7470 -8416 -11593 -10318 -5600 -8378
801 -8378 -11535 -8599 -3144 1713 -2722 -4512 1957 6166 9670 11998 6733 4262 3602 7796 14567
786 14567 18393 12661 9272 9385 14472 6764 -3769 -8870 -4207 -1802 3088 6056 3230 -4982 -6565
771 -6565 -7959 -3564 1889 -818 -5116 -10798 -20535 -20933 -15229 -15177 -12279 -7110 -4227 -4492 4897 9060
755 9060 11348 9996 11932 6343 -3070 3087 4401 4070 1678 765 -366 4948 12517 10431 1770 -3591
739 -3591 -7599 -5170 -3560 -846 2383 8007 -393 -9549 -5811 -6836 -4117 -3809 -270 2953 373
724 373 4095 12102 9853 438 -1897 -3600 2397 6773 8330 12280 9387 6983 12659 5410 2492
709 2492 6412 6785 923 -2975 -2261 -525 2746 -317 -4068 -5883 -10160 -2909 -4287 1129 -207 -1138
693 -1138 1149 5945 244 -2369 -640 -5277 -12422 -4216 5190 7772 9341 5017 3253 981 6016
678 6016 11382 8270 4909 2191 1280 964 3672 6310 5865 8427 8319 8388 10318 4306 5466 10706 13585
661 13585 11196 5896 626 -2829 -1516 5634 3430 -1316 -2458 -1272 -2595 225 4198 687 -7427
646 -7427 -4933 -4149 -6247 -2328 2147 3535 -4602 -7556 -9520 -6793 -2484 -5967 -11943 -8773 -3230
631 -3230 3779 3370 -1234 -6598 -13867 -12115 -7164 -9053 -2877 3436 8518 4749 5441 411 -10346
616 -10346 -19157 -14458 -9454 -7992 -6617 -5030 -3214 -3041 1967 -1992 -5645 -7587 -6163 -3031 1237
601 1237 211 -2387 3091 3135 -708 -7413 -9884 -8353 -4263 2033 931 4316 4386 5879 9339 12734
585 12734 10900 4510 -421 -2884 -680 2288 -2282 -10248 -15604 -11139 -4903 -9341 -9213 -3649 -7021
570 -7021 -6800 -7418 -4565 -1986 2843 1503 1543 5760 1669 4901 16157 14662 7774 5577 1537 -36
554 -36 1149 3202 7190 7563 6324 6825 9555 5422 3891 5341 5106 605 -9439 -15176 -5950 -353
538 -353 -2544 -7354 -4874 -2316 -4462 -1046 -449 -2087 -7584 -8886 -6446 -2842 -1278 -2245 -3933 -2850
522 -2850 -1769 9711 13164 6074 -304 -1995 2027 3554 -1984 -2028 138 3220 12684 10531 4270
507 4270 4649 -159 2004 6565 2495 -7722 -10080 -10795 -11197 -8055 -2882 6114 15772 14810 15481 18425
491 18425 16459 11023 3751 1111 796 4661 9307 11400 6587 2533 1162 -1197 1507 4473 2130
476 2130 2075 4964 1037 -8404 1097 12088 9042 -2974 -6010 -2603 3416 2090 -2475 -3877 -4898
461 -4898 -3926 -1819 -2019 -10952 -17204 -11345 -9226 -3154 -1853 -360 1408 289 3047 2559 -537 1285
445 1285 974 -5251 -6384 -1370 2003 5112 9695 12458 13548 19342 14379 3924 -1766 -571 6271
430 6271 4272 2278 9712 12681 15337 9527 -269 -5069 -4767 -1014 4201 2010 -766 -800 -2054 -2734
414 -2734 -2099 -6739 -9316 -6699 -4233 -4698 -1332 27 -5455 -1039 -3840 -12634 -9989 -2951 -6707 -3224
398 -3224 -2708 400 6610 -1933 -7192 -1584 2739 3568 -1606 -3810 -8108 -9391 -7318 -5575 -2371 -5055
382 -5055 -7790 -4991 -2863 3168 3417 4514 1682 -6882 -6995 -4056 2539 6975 6114 3186 6048 6862
366 6862 4643 1177 309 -2215 -613 1982 1966 3545 7110 6745 816 -792 -83 -5791 -7508 -6866 -3988
349 -3988 -3808 -1308 -4602 -3985 -904 -2642 -5949 -4176 -4523 -4336 -3856 80 6970 8829 3665 -6058
333 -6058 -3804 -355 2579 3212 6491 12030 17402 10893 11641 11564 10868 7715 10470 7852 1155 -3796
317 -3796 -7093 -6939 -4013 -2889 -3377 -6515 -4551 -7310 -10591 -9300 -1215 1219 -3213 -1617 -1167 2865
301 2865 7629 9947 10010 10151 4757 -4134 -5903 -11048 -6193 -1477 3225 5909 3842 3584 1465 -2451
285 -2451 -8323 -4316 2208 149 -4776 -426 -1222 -4606 -4866 -5461 -4562 -3984 -4037 -4532 -12672 -10979 -1759
268 -1759 4153 7367 5104 8469 11163 6058 2507 1779 -1638 -2039 -4743 -8822 -12647 -8476 -3334 -2090
252 -2090 -1084 443 408 2250 6867 13152 13318 11745 6190 322 -4637 -2975 439 -2538 -10716 -9738
236 -9738 -8235 -9044 -4392 -63 -2402 -4567 -3236 -172 -170 607 1560 -2257 -3950 -6556 -9444 -9825 -4295
219 -4295 -6825 -3686 -566 -752 -2237 -8528 -10932 -13304 -14975 -7395 -6446 -7501 -6084 2077 868 -866
203 -866 -4270 -3204 -1525 -2649 -813 -1513 -920 477 1620 986 -2234 -2333 917 -2227 -1636 -3879 -889
186 -889 3400 2927 4693 -815 -7007 -4740 -6281 -3565 -5771 -5870 -2988 1592 5082 -45 -4116 -772
170 -772 3168 -618 -4519 -3621 -429 4184 6750 6487 6246 8478 6469 5064 4830 -2287 -9680 -7115
154 -7115 -3237 935 1695 516 -528 906 -751 -3099 -2044 -735 -536 -2831 -524 -4016 -3706 -3153
138 -3153 -156 5299 4821 8022 5996 4026 -531 -1368 -1964 -2660 -5727 -6296 -5760 -4202 -1514 114 -2018
121 -2018 -4995 -5093 -644 2583 3987 2240 8629 5710 1042 235 1825 2464 5682 5262 3226 -199
105 -199 -3748 -2356 -4960 -4057 100 3460 4522 3800 1190 3627 3455 -2545 -9452 -10653 -7578 -4544
89 -4544 -4249 -5776 -4373 -1007 299 1300 4241 26 -750 3673 8271 7348 3781 3847 1708 3479 1579
72 1579 445 -3801 -7552 -8936 -6171 -2003 504 -2487 -2148 1133 -654 -659 3472 3495 -874 1424 2827
55 2827 -909 -5246 -1672 -5102 -4748 -1309 -3319 -3019 -1292 1476 5994 5478 5769 1686 148 4641
39 4641 2056 2260 3154 -5107 -4968 52 1104 -1919 -5355 -5090 -6772 -979 -1370 -6832 -8304 -4972 -3545
22 -3545 -97 -1631 -388 -768 1388 177 993 2549 364 1942 2059 -2288 -5921 -9244 -9593 -4601
6 -4601 -1959 -3858 -6708 -9712 -1789 1727
0 1727
$$ Imaginary data points
##PAGE= N=2
##DATA TABLE= (X++(I..I)), XYDATA
32767 40488 38873 47797 50607 48914 48018 52056 54202 53529 58491 61407 59743 55013 57227 57292 56893 54908
32751 54908 57138 58298 55224 53377 56620 58388 56991 59640 62773 61289 57185 58241 61945 67444
32737 67444 73495 71126 63552 62885 67520 67507 68041 69429 71993 71992 71214 69310 71011 75425 78709 75849
32721 75849 73556 72327 72430 70512 67537 72501 79235 81705 83205 83557 82498 80781 84351 88903 83298
32706 83298 82138 85648 82571 79540 81844 87371 85718 84884 84965 82638 87362 89064 90990 86741 91596
32691 91596 97562 99973 98468 94818 89797 92978 93751 92357 90066 93571 100198 108036 111642 107789 105080
32676 105080 98946 93326 93560 98254 98837 97784 97075 103605 109103 112466 112429 109292 109041 112291 116714 121402
32660 121402 120662 117013 116587 118881 121110 122175 119383 118691 117099 114289 116768 120153 117807 116723 121223
32645 121223 119387 119227 117617 117738 118944 118677 117345 122315 123107 122865 126797 123796 127675 129210 129477 126967
32629 126967 130944 139026 138897 134437 138307 139199 138880 140833 140672 135821 135592 129861 128776 136173 138799
32614 138799 141187 142889 145970 144826 146439 143704 143917 147722 152058 153720 154194 152115 149818 141691 139762
32599 139762 141623 140231 139684 136387 142407 148067 148073 150783 147669 146037 150786 151733 144386 144796 149282 148674
32583 148674 148996 152963 148498 150083 149319 150776 154747 157247 155567 152647 153049 150660 153070 153026 155760
32568 155760 154126 155948 153578 152750 157223 159569 160134 164357 164211 161305 168438 170146 168640 169756 167479
32553 167479 172110 173955 172322 171491 173570 176958 175734 174243 172592 167715 162559 167211 163731 161183
32539 161183 165003 166243 165265 164317 166850 172363 179762 181897 175210 174955 177373 175812 177409 178242 176617
32524 176617 177025 176195 179441 182005 176399 174177 172891 169321 171276 172218 172754 179983 184562 180060 186153
32509 186153 187731 184864 183876 185509 186383 183074 182467 183209 183957 178374 178892 183755 189463 189161 193022 193208
32493 193208 193290 197659 195586 194305 194974 191881 188915 189025 189439 189907 188282 187900 194089 197186 201503 200844
32477 200844 199104 197848 194726 191727 199220 202600 198382 198582 198286 196618 197405 195533 192467 189999 188493
32462 188493 188548 188754 193866 193943 193979 202278 206259 203045 204380 202968 196465 194096 196052 196030 192612 195248
32446 195248 190545 193300 198580 198417 203180 206863 216380 215226 210923 213620 215842 216528 215942 211522 208012
32431 208012 212283 219909 218517 211109 207354 209771 209971 216872 223876 222095 220807 223021 222035 221645 222078
32416 222078 217851 216529 217351 214558 217896 212761 206673 207293 204812 206218 201511 201325 209179 212021 210091
32401 210091 206987 209168 208627 211814 213084 214596 219656 222068 218423 217597 222214 227809 228623 228529 229151 218084
32385 218084 212646 219972 220316 216573 219954 223235 228655 227634 225364 223398 225005 232404 233173 234330 231415
32370 231415 230551 225167 221973 227398 229510 228481 228528 228093 227263 222467 225681 225708 225878 226402 223935 227815
32354 227815 226858 223452 220507 229581 232598 235688 231505 228002 229797 232537 231938 235022 237283 231900 233910
32339 233910 235649 234936 232639 233745 233574 229920 232834 234317 232708 233986 232335 232423 234455 239932 239606
32324 239606 237884 237031 234988 231722 230774 229307 233373 234309 234791 234143 234016 229423 228636 228850 241658 246439
32308 246439 243281 233503 229288 233774 238879 247148 251197 247142 239834 234803 231936 233271 225566 232471
32294 232471 231647 228963 230520 235639 237656 235349 232703 233474 243896 248734 246912 240526 244932 246079
32280 246079 244009 239756 237092 237657 232504 232334 237317 235821 237078 234327 235945 239096 243512 239913 245775
32265 245775 245696 242080 240183 239221 235849 238668 237227 236392 241144 248902 244180 238143 241141 247477 248776
32250 248776 243071 236457 237509 237948 234183 235504 236814 242060 245777 248207 246907 238453 231041 234684
32236 234684 238973 241073 247129 247597 242148 244895 248963 243640 236649 240824 241502 247099 246993 250559 246137
32221 246137 243062 245966 245369 244114 245059 248507 250775 250092 245493 249997 246441 238401 235805 237131 237074
32206 237074 235721 241862 248415 240488 239739 241045 242774 242557 244597 246427 252161 252193 249044 249395 250611
32191 250611 254409 249825 244855 246342 242834 237005 234610 240829 250107 251136 246180 245764 241940 237329
32177 237329 232851 234638 244703 251607 253650 257284 256527 256401 255836 252931 243630 241775 244968 248093 255072
32162 255072 249790 246473 245985 249820 250517 248042 251301 258424 252576 245427 243650 237714 242548 248972 254053
32147 254053 249184 244091 246113 249673 246875 247241 245795 244560 248461 249277 246024 253069 251235 249488 253747
32132 253747 260160 257469 256028 261498 256879 256049 253334 249517 246765 244903 250586 248805 251372 245253
32118 245253 244031 249394 255219 252978 247648 247650 244669 244376 242443 246220 257349 257200 252957 251262 252138
32103 252138 253174 254339 252591 249706 243377 245838 247546 245829 234895 233134 235376 235650 236965 233294
32089 233294 234984 240530 240850 248118 244967 245709 248941 252837 252763 247006 241879 242248 241680 246552 250831 251245
32073 251245 246668 246029 247298 246481 247699 251211 256457 257645 254260 250848 248443 246034 241701 233212 233719
32058 233719 249191 252412 250275 251032 252291 251827 257102 256938 250049 250248 244934 245099 246395 253711 253086
32043 253086 253833 251902 239417 232847 236092 241641 245052 243945 246995 246698 248528 247634 252168 252747 250786
32028 250786 254120 247278 243931 245935 242986 243520 251120 252382 251671 257375 252142 247798 247850 249980 250296
32013 250296 254150 260317 262719 259096 259591 257914 252953 255792 255454 249967 249963 258687 258630 248601 246582 250679
31997 250679 254187 252585 248225 249995 254519 256523 255886 251795 246596 246659 248358 249826 247830 245960 252332
31982 252332 258226 257473 249539 253747 248021 245884 254024 260187 257714 254152 257815 258435 258670 253707 252257
31967 252257 247834 251575 250673 254636 253595 245544 241823 246917 254422 256744 254401 248819 251184 252123 256364
31952 256364 257710 252085 242790 241424 243859 249102 249251 248953 248447 261056 261581 257644 253444 254304 248689
31937 248689 253406 250762 243260 242663 243834 247619 257998 263542 267468 259612 255055 255381 257311 254935
31923 254935 250310 254537 262669 266864 262508 253888 252134 254744 254946 249461 247434 252656 256470 255314
31909 255314 255105 255535 258303 256184 256832 257677 257331 256578 258245 257338 247612 250882 254374 259220 257341 256416
31893 256416 264968 268775 261945 259425 249943 251288 254267 255758 256068 254067 260727 264982 261464 258772
31879 258772 253918 255092 255278 252762 250878 246021 245381 251625 254704 257079 259916 257253 252244 248402 249692
31864 249692 252770 258177 259785 261509 263149 259850 263704 260493 263881 270704 264635 260961 258290 257079
31850 257079 262701 262205 255004 250969 238034 242307 243787 243347 244867 249406 243842 242790 240085 242514
31836 242514 250416 260213 261328 255351 253019 251035 246675 251206 249017 249274 247222 249680 251607 246471
31822 246471 248200 257273 256049 248587 246673 255231 261874 262300 263269 267238 262600 264264 264488 258506 253794
31807 253794 250628 250939 242400 240721 246720 249503 253282 252957 252745 248102 253928 263121 261927 258218 256864
31792 256864 260613 271250 265916 259812 260118 260912 263451 260661 257985 260145 256322 251524 252960 260448
31778 260448 264716 261775 256184 255834 256190 255974 260908 264856 270056 268989 265788 259031 254849 255216 256974
31763 256974 254479 249013 250002 251926 256348 256865 259152 264721 260488 259283 247820 247921 251538 260930 261093
31748 261093 258896 258971 262000 261763 265488 260392 254426 250820 243421 244521 246051 249758 257286 261673 266482
31733 266482 262416 261768 259298 260175 258726 255447 261665 261016 253720 252098 252420 252065 260860 262753 265293
31718 265293 264846 265292 267943 271008 270154 266592 260887 260877 259944 256556 257806 259787 263995 260838 259087 255506
31702 255506 252893 254220 261468 269208 264626 258534 262611 264636 267222 264364 258781 269738 271941 269575
31688 269575 259200 251955 249739 241323 242845 239317 236756 242987 253035 252154 246604 246936 245292 245332 250552
31673 250552 253753 256456 255382 256613 254771 256175 252340 250118 255671 255292 256850 252956 250296 250518 251372
31658 251372 252974 244895 244675 249802 255368 259652 261904 261085 252593 251212 260824 255230 251295 256989 261997
31643 261997 263149 259422 255634 252700 245682 242283 245894 252815 259910 264737 263941 253570 244725 244787 253083
31628 253083 257859 263513 263866 261625 259341 257773 252702 252897 252368 252369 256439 257266 258092 261678 266287 263063
31612 263063 261235 261227 261216 261578 261466 257223 255011 258201 254997 251843 253791 258756 262430 259307 265410 263500
31596 263500 262989 258719 254263 253489 246940 251642 257811 258728 253943 251181 247486 242663 246435 251622 259817
31581 259817 260838 255073 257655 258870 252091 252596 259508 260477 254023 251870 256666 262182 263089 256730 256639
31566 256639 256575 254543 254779 254951 254774 257077 261010 257121 260314 259038 254747 255434 260988 260882 263430 262078
$$ [...]
##END NTUPLES=NMR SPECTRUM
##END=
