##TITLE=Analysis number 325045
Compound Code cc 57839
Book Reference 449/170
Project Code adrs
Chemist Name davee
##JCAMPDX= 6.0         $$ Bruker NMR JCAMP-DX V2.0
##DATA TYPE= NMR SPECTRUM
##DATA CLASS= NTUPLES
##ORIGIN= Bruker BioSpin GmbH
##OWNER= nmr
$$ XWIN-NMR		Version 3.5
$$ Thu Dec  7 14:57:30 2006 GMT Standard Time (UT+0h)  MAYBRIDGE\nmr@NMR_250MHZ
##.OBSERVE FREQUENCY= 250.131544655141
##.OBSERVE NUCLEUS= ^1H
##.ACQUISITION MODE= SIMULTANEOUS (DQD)
##.ACQUISITION SCHEME= undefined
##.AVERAGES= 16
##.DIGITISER RES= 18
##SPECTROMETER/DATA SYSTEM= dpx250
##.PULSE SEQUENCE= zg30
##.SOLVENT NAME= CDCl3
##.SHIFT REFERENCE= (INTERNAL, CDCl3, 0, 16.522)
##AUDIT TRAIL= $$ (NUMBER, WHEN, WHO, WHERE, WHAT)
$$ ##TITLE= Audit trail, XWIN-NMR		Version 3.5
$$ ##JCAMPDX= 5.01
$$ ##ORIGIN= Bruker BioSpin GmbH
$$ ##OWNER= nmr
$$ C:\u/data/dgb/nmr/ADRS/520/pdata/1/auditp.txt
$$ ##AUDIT TRAIL=  $$ (NUMBER, WHEN, WHO, WHERE, WHAT)
(   1,<2006-12-07 14:57:11.14 +000>,<MAYBRIDGE\nmr>,<NMR_250MHZ>,
      <created by zg, POWCHK disabled, PULCHK disabled
       configuration hash MD5:
       49 4B E0 1D 92 C2 6B 37 9F E6 65 BC 52 41 86 1D
       data hash MD5: 64K
       61 62 CA 08 23 E0 D1 4B 21 92 FA A3 80 F2 2F 20>)
(   2,<2006-12-07 14:57:21.97 +000>,<MAYBRIDGE\nmr>,<NMR_250MHZ>,
      <Start of raw data processing
       ef LB = 0.3 FT_mod = 6 PKNL = 1 SI = 32K 
       data hash MD5: 32K
       B7 5B 5F 6B 5A E1 6B BD 8F AF 9E D0 BE 7A 7C B4>)
(   3,<2006-12-07 14:57:23.53 +000>,<MAYBRIDGE\nmr>,<NMR_250MHZ>,
      <apk 
       data hash MD5: 32K
       77 85 0C 3C 26 7B 06 7D FD 6F C2 3A D0 BC 69 91>)
(   4,<2006-12-07 14:57:24.25 +000>,<MAYBRIDGE\nmr>,<NMR_250MHZ>,
      <abs ABSG = 5 
       data hash MD5: 32K
       5D 9E 39 A5 DC BD 8A 4F 11 70 37 23 72 5F 38 52>)
$$ ##END=
$$ 
$$ hash MD5
$$ 6A 18 9C 86 33 2A 77 6F 46 5D 27 A6 27 52 8C FB
##$RELAX= 
##$RELAX= 
##$RELAX= 
##$RELAX= 
##$RELAX= 
##$RELAX= 
##$RELAX= 
$$ Bruker specific parameters
$$ --------------------------
##$DU= <C:\u>
##$EXPNO= 520
##$NAME= <ADRS>
##$PROCNO= 1
##$TYPE= <nmr>
##$USER= <dgb>
##$AMP= (0..31)
100 100 100 100 100 100 100 100 100 100 100 100 100 100 100 100 100 100 
100 100 100 100 100 100 100 100 100 100 100 100 100 100 
##$AQSEQ= 0
##$AQ_mod= 3
##$AUNM= <au_zg>
##$AUTOPOS= <30 >
##$BF1= 250.13
##$BF2= 250.13
##$BF3= 250.13
##$BF4= 250.13
##$BF5= 500.13
##$BF6= 500.13
##$BF7= 500.13
##$BF8= 500.13
##$BYTORDA= 1
##$CFDGTYP= 0
##$CFRGTYP= 5
##$CHEMSTR= <none>
##$CNST= (0..31)
1 1 145 1 1 1 1 1 1 1 1 1 1 1 1 1 1 1 1 1 1 1 1 1 1 1 1 1 1 1 1 1 
##$CPDPRG= <>
##$CPDPRG1= <>
##$CPDPRG2= <>
##$CPDPRG3= <>
##$CPDPRG4= <mlev>
##$CPDPRG5= <mlev>
##$CPDPRG6= <mlev>
##$CPDPRG7= <mlev>
##$CPDPRG8= <mlev>
##$CPDPRGB= <>
##$CPDPRGT= <>
##$D= (0..31)
0 1 0 0 0 0 0 0 0 0.06 0 0 0 0 0 0 0.0002 0 0 0 0 0 0 0 0 0 0 0 0 0 0 
0 
##$DATE= 1165503430
##$DBL= (0..7)
120 120 120 120 120 120 120 120 
##$DBP= (0..7)
150 150 150 150 150 150 150 150 
##$DBP07= 0
##$DBPNAM0= <>
##$DBPNAM1= <>
$$ [...]
##$SUBNAM7= <"">
##$SUBNAM8= <"">
##$SUBNAM9= <"">
##$SW= 20.6930455092707
##$SWIBOX= (0..15)
0 0 3 0 0 0 0 0 0 0 0 0 0 0 0 0 
##$SW_h= 5175.983436853
##$TD= 65536
##$TD0= 1
##$TE= 295.16
##$TE2= 300
##$TE3= 300
##$TEG= 300
##$TL= (0..7)
0 120 120 120 120 120 120 120 
##$TP= (0..7)
150 150 150 150 150 150 150 150 
##$TP07= 0
##$TPNAME0= <>
##$TPNAME1= <>
##$TPNAME2= <>
##$TPNAME3= <>
##$TPNAME4= <>
##$TPNAME5= <>
##$TPNAME6= <>
##$TPNAME7= <>
##$TPOAL= (0..7)
0.5 0.5 0.5 0.5 0.5 0.5 0.5 0.5 
##$TPOFFS= (0..7)
0 0 0 0 0 0 0 0 
##$TUNHIN= 0
##$TUNHOUT= 0
##$TUNXOUT= 0
##$USERA1= <user>
##$USERA2= <user>
##$USERA3= <user>
##$USERA4= <user>
##$USERA5= <user>
##$V9= 5
##$VALIST= <valist>
##$VCLIST= <CCCCCCCCCCCCCCC>
##$VD= 0
##$VDLIST= <DDDDDDDDDDDDDDD>
##$VPLIST= <PPPPPPPPPPPPPPP>
##$VTLIST= <TTTTTTTTTTTTTTT>
##$WBST= 1024
##$WBSW= 4
##$XGAIN= (0..3)
0 0 0 0 
##$XL= 0
##$YL= 0
##$YMAX_a= 379083
##$YMIN_a= -397619
##$ZGOPTNS= <>
##$ZL1= 120
##$ZL2= 120
##$ZL3= 120
##$ZL4= 120
##$ABSF1= 16.522
##$ABSF2= -4.171173
##$ABSG= 5
##$ABSL= 3
##$ALPHA= 0
##$AQORDER= 0
##$ASSFAC= 0
##$ASSFACI= 0
##$ASSFACX= 0
##$ASSWID= 0
##$AUNMP= <proc_1d>
##$AZFE= 0.1
##$AZFW= 0.1
##$BCFW= 0
##$BC_mod= 0
##$BYTORDP= 0
##$COROFFS= 0
##$CY= 12.5
##$DATMOD= 1
##$DC= 0
##$DFILT= <>
##$DTYPP= 0
##$F1P= 14.0000005364418
##$F2P= -0.99999901652339
##$FCOR= 0.5
##$FTSIZE= 32768
##$FT_mod= 6
##$GAMMA= 0
##$GB= 0
##$INTBC= 1
##$INTSCL= 1
##$ISEN= 128
##$LB= 0.3
##$LEV0= 0
##$LPBIN= 0
##$MAXI= 10000
##$MC2= 0
##$MEAN= 0
##$ME_mod= 0
##$MI= 0
##$NCOEF= 0
##$NC_proc= -2
##$NLEV= 6
##$NOISF1= 0
##$NOISF2= 0
##$NSP= 0
##$NTH_PI= 0
##$NZP= 0
##$OFFSET= 16.522
##$PC= 1
##$PHC0= 224.0604
##$PHC1= 6.451045
##$PH_mod= 1
##$PKNL= yes
##$PPARMOD= 0
##$PSCAL= 4
##$PSIGN= 0
##$REVERSE= no
##$SF= 250.13
##$SI= 32768
##$SIGF1= 0
##$SIGF2= 0
##$SINO= 400
##$SIOLD= 32768
##$SREGLST= <1H.CDCl3>
##$SSB= 0
##$STSI= 32768
##$STSR= 0
##$SW_p= 5175.98343685301
##$SYMM= 0
##$S_DEV= 0
##$TDeff= 65536
##$TDoff= 0
##$TI= <Analysis number 999999
Compound Code 99
Book Reference 9
Project Code 9>
##$TILT= no
##$TM1= 0
##$TM2= 0
##$TOPLEV= 0
##$USERP1= <user>
##$USERP2= <user>
##$USERP3= <user>
##$USERP4= <user>
##$USERP5= <user>
##$WDW= 1
##$XDIM= 32768
##$YMAX_p= 417570193
##$YMIN_p= -38805
$$ End of Bruker specific parameters
$$ ---------------------------------
##NTUPLES= NMR SPECTRUM
##VAR_NAME=  FREQUENCY,     SPECTRUM/REAL,   SPECTRUM/IMAG
##SYMBOL=    X,             R,               I
##VAR_TYPE=  INDEPENDENT,   DEPENDENT,       DEPENDENT
##VAR_FORM=  AFFN,          ASDF,            ASDF
##VAR_DIM=   32768,         32768,           32768
##UNITS=     HZ,            ARBITRARY UNITS, ARBITRARY UNITS
##FACTOR=    0.157963299565203, 1,           1
##FIRST=     4132.6476996994, 0,             0
##LAST=      -1043.33573715361, 0,           0
##MIN=       -1043.33573715361, -38805,      0
##MAX=       4132.6476996994, 417570193,     0
$$ Real data points
##PAGE= N=1
##DATA TABLE= (X++(R..R)), XYDATA
$$ [...]
15364g975M768m447N96m54M039L194l813m885J759O622p884l817N427p084r40
15349a4894Q817r71N969K958m129O032P027J0234k229m528o149o66o24K86l584
15334C549j2591o115L249N694N172P623l252o686J406j2236k578N412K369P643
15320a341l951k016r102N42m924J256P585R449n584n152o640N993R784j52j0657
15305a4910P017J3536l326n699K732r786L994P763m620N074o747N069j471j694
15291c068n22J047j746j631O939J750j130o030O47M358K899J913o917n533o980
15276a4004M500J503J471k076k874Q754J4130M42j4807p297j850N202O338O983
15262F415K02l814p00m534P42L790j902j194K716R147j793j4668o498l293n015
$$ y = [-7975, -3207, -7654, -7058, -7512, -3473, -279, -4092, -8977, -7218, -596, -8480, -12297, -6870, -13954, -14894, -6077, -7048, -1079, 1879, -2250, 3782, 10809, 21043, 18814, 14286, 8137, 7471, 6847, 7133, 3549, -9042, -15157, -11908, -6214, -1042, 6581, 3329, -3357, -1951, -14187, -16765, -11353, -8984, -1341, -5292, -7308, -16410, -15868, -20792, -19536, -11951, -2502, -8086, -13238, -19878, -13885, -4101, -4253, -14910, -7893, 5643, 2317, -3382, -650, -10436, -6442, 1321, -3299, 1775, -4972, 97, -1374, -3068, -3590, -2543, -4289, -5920, 1019, 2769, 1639, -4391, -3744, 614, 3513, 5426, -1491, -7024, -14004, -9504, -8001, -6530, -8606, -11480, -2726, 11404, 11846, -2961, -10258, -12108, -6906, -568, 6415, 6617, 2803, 2103, -2431, -1689, 2101, 199, -995, 1721, 10868, 9075, -5593, -12091, -15384, -20399]
15247b0399R545l55m081L421p57N226j533J623J4075N402K975m778j075l329l373
15232B587J69n105n926J5098R902j276l217l279j0622j8208K824o12q282M959
15218b0988N103q56R0J1800L069l57K652p914l426r13N374j83K873p67M257o466
15202f652k989J1216r971r620N624L291R562P818k135k942k954l800j1786k978
15188a8316K483l852K688P016L617J4444L179m072j510m36K063o379K985O723
15174A0633p51r426p097q323n960Q776J1662m744k511j774Q772n968l334K9K233
15159g783M587l732J122l726L53L853j711L455R2j438K184J465J0004R446N72
15144A8743q095N446q19k729o44P586q810j3802n05k978M637l095j1882M93l41
$$ y = [-20399, -10854, -11209, -15290, -11869, -12626, -7400, -8933, -7310, 6765, 12167, 15142, 10364, 9289, 5960, 2587, 2756, -2349, -8275, 6823, 16725, 15449, 12232, 8953, -1669, -19877, -17053, -17665, -25947, -20988, -15885, -16741, -16651, -4851, -1782, -2139, 513, -7401, -10827, -11740, -6366, -6549, -3676, -4443, -186, -6652, -9641, 1575, -8396, -18016, -12392, -9101, 461, 8279, 6144, 3202, 248, -3552, -15338, -18316, -15833, -19685, -16997, -9981, -6364, 8080, 11259, 7187, 5677, 5241, 7304, 925, 3910, 10633, 9882, 456, -6641, -14964, -20924, -12148, -486, -5230, -7741, -9515, -743, -6711, -10045, -10016, -7783, -3196, -6928, -5806, -9532, -9179, -5326, -7037, -3582, -3490, -4928, -2744, -1279, 8725, 18171, 18743, 10648, 16094, 15275, 12546, 11902, 19488, 10678, -3124, -3629, -6607, -1970, -5065, -16947, -16454, -16795]
15129a6795m402j441Q030J2041M19p245O546J600q331r454j859J1716P720K413
15115I58m712p368k846Q842L648K280L363M257j658o84m506l431K074Q936J474
15100A0627m628o343L928j983l887L17J976O105k23N340o737j6300J018J5380
15086D590j514K34M694m679p199N777j89j0241N696l314l269O24m844P923P190
15071A479J471l932R62p743n424M400J1199p361o161m133l820N715J2499K602
15057A753n857k200r50K163N773J587l534N519O498o819j823J2855j877j3895
15043h07q519K330j88J488P958p451O436j14r046O868O329O707R538k051j3535
15028E943m967j3875p338M598O522J717J204J301r28o132k999J0158q6l738M962
$$ y = [-16795, -21197, -22638, -14608, -2567, -2148, -9393, -2847, -1247, -9578, -19032, -20891, -9175, -1455, 958, -3754, -11122, -13968, -5126, -1478, 802, 4165, 8422, 6764, 6080, 1574, -1857, 217, 9153, 10627, 5999, -344, 3584, 1601, -2286, -1969, 7, 6112, 5889, 11229, 4492, -11808, -10790, 4590, 3076, 3310, 8004, 3325, -3874, 1903, 1714, -8527, -2831, -6145, -9414, -8790, -13634, -5711, 1479, 2950, -982, -20, -7763, -13187, -8787, 2412, -4949, -11110, -15243, -19063, -13348, -849, 1753, -4104, -6304, -7254, -5091, 682, 2269, -1265, 4254, 10752, 3933, 2110, 14965, 13088, -807, -9326, -6996, -7184, -5696, 2262, -5189, 1247, 1133, -7913, -1045, 5284, 11991, 21529, 19478, 5943, 976, -12899, -20237, -15639, -9117, -7400, -6196, -4895, -5823, -11955, -14954, -4796, -4882, -8620, -3658]
15013c658m98N008K730m503k212K30N380k666J0q2J937P131n588o707n930j276
14997a0694o840L993P645m96L604K320k193J066l757k969J2735R484l593m184
14983F121J94J479k725L117L220J63l060K85j265p81j744m119m060m584l269l772
14967a4800j306m953K148P130m631M152Q113l719J266J494q165N087j49o53J64
14952h822P819K987q592k78J143p22O779M288k817l414r8N1o60J5908L114r694
14936F992M617K672r674q085l990p90M476k732r625L276O853J0884N106J537o395
14921E122o557k306k418K939j209k092O422J067j46R10l20K68l121j0016l591
14906a5048L435k886o383J039N628K278J0588L039j442K038j61m24j345J722Q815
$$ y = [-3658, -4156, 852, 3582, -921, -3133, -2903, 2477, -189, -179, -261, 1676, 8807, 3219, -3488, -9418, -10694, -17534, -13541, -5896, -6392, -2788, -468, -2661, -1595, -5352, -8321, 4414, 13898, 10305, 6121, 6315, 7794, 5069, 8186, 11406, 11569, 8509, 8794, 7529, 6748, 5004, 885, -3175, -7759, -11028, -14800, -16106, -21059, -18911, -11781, -16412, -12260, -4147, -7866, -6600, -5106, -13271, -8184, -8333, -8986, -8822, -1003, 1984, -6608, -6886, -5743, -6465, 314, 4602, 1785, -1629, -1727, -1676, -2336, 13572, 16686, 6992, 11609, 14281, 4607, -3478, -7468, -8258, -3782, -6514, -16139, -12863, -6010, 4874, 9980, 11517, 5122, -1435, -3741, -6159, -3220, -4429, -6521, -99, 968, 822, 1732, 1412, 1680, -1441, -11457, -15048, -11613, -14499, -20882, -19843, -14215, -11937, -1349, 1690, 248, 2286, 2125, 1701, 356, 2078, 10893]
14891A0893N900m034n481p270K468N151R42J129j1795n616m241L824m234m365
14877a6729J297K854k134l274P267J234l224P874L084l687n999j61L349m187K762
14862i674O51M84K500J1554J180j0910k227j218n070m016m62L205N210R286O47
14847A140M745K170n702p99m065o071N565O499P48q470j117N797J2503K933m598
14832A1278k338P888j3209j1385p15K772p23q372o091O795J039N656n914K190
14818a1129j448O863K850n118k465O971R12k486o781j18O443Q089K561q142m747
14803g745k004j119m979J595J067L736M371k896O846o420p746J0976j52n893K058
14788h305O051j562K978K014j0203J469K942K60n44P1p237p44m177P051K642P987
$$ y = [10893, 16793, 12759, 7278, 8, 2476, 7627, 8569, 9698, -2097, -7713, -11954, -8130, -12364, -16729, -15432, -12578, -14712, -17986, -10719, -9485, -12709, -4835, -1751, -5438, -11437, -11598, -8249, -12436, -9674, -9023, -8539, -6039, 5515, 6695, -4215, -6442, -7660, -12730, -16746, -17208, -14003, -8793, 493, 1140, 5885, 8055, 2353, 1554, -2511, -8582, -3017, 3482, 4230, -4240, -5357, 440, 12943, 15876, 11278, 8940, 16828, 3619, -7766, -8481, -5709, -6432, -14804, -20895, -14100, -13061, -7405, -13319, -11129, -12577, -5714, -2864, -7982, -10447, -3476, -2564, -5050, -11831, -11949, -5506, 2583, 5144, -2998, -7745, -9749, -10868, -15847, -14252, -13185, -9449, -5078, -7974, -1128, -7548, -15294, -4318, -4470, -10363, -8305, -2254, -3816, -838, 1176, -9027, -7558, -4616, -4356, -4900, -4829, -12066, -12810, -16987, -9936, -7294, 693]
14772F93l345K245O214q731k942M923m606R537m62j332m0o386r003L420P608P247
14756E040R680j745k978J0278n042o211J048j713m958o914n611L540p186M515
14742h257L389j335K340Q69j0222n218P727K188J122P417L987O995n045m126M293
14727F124k835p143j891m079k37M630M85O665L804n266r13o380q231N896l982
14712a3353P721L501j014n881J754L338M348M056K959M362K605j4433n279j1064
14698a6380q960O547j595J428P471J0650P009o516p339o114p580m379J609J9785
14684d364M32k961n416l96Q729l618m15M759O772m911r45m648J628j487N333J0793
14668I285Q60k368J221M013j2433o730M438k172l010M055k552J0769Q756o951
$$ y = [693, -2652, -407, 5807, -2924, -5866, -943, -5549, 3988, 3526, 2194, 2154, -4232, -13235, -9815, -2207, 5040, 14720, 12975, 9997, 20275, 15233, 9022, 10070, 8357, 3399, -3515, -9126, -5586, -12772, -8257, -4868, -6203, -3863, -2994, -13216, -18434, -10707, -8519, -7397, 20, 4007, 11002, 5957, 1831, 6124, 3289, -3854, -5745, -9824, -10061, -5431, -4946, 1719, 5523, 257, -656, -7036, -15267, -9371, -13353, -5632, -2131, -3145, -9026, -7272, -3934, 414, 4470, 7429, 11791, 14396, -37, -5316, -16380, -25340, -18793, -20388, -18960, -11489, -839, 6170, -346, -7685, -13799, -21379, -25758, -24149, -4364, -3932, -6893, -12309, -12705, -3976, -7594, -8009, -3250, 3522, -1389, -2334, -6982, -5354, -6841, -1508, 9285, 10145, 7777, 8998, 13011, 578, -6152, -1714, -3886, -6896, -2841, -5393, 5376, 14132, 7181]
14654G181J53p663r169K707O605l498k844M62R824N142M521p003m250J343p22
14639B789j965m526k381O920J110q849n862K679O446k670J943m389l454o87p474
14624b0370n256J2468K532J120P433J102p215j0354L10j522K166N891Q053K180
14610a462j843L731L292o672k535O282q860m244P223L858o268L96R190o506o506
14595a0924J910K143j352p06K251p088l901J1092R527O984L046o246L10n803p244
14580f001P041j214j2089L177K0021J1591n028j2648o019K693Q952n58j1997q566
14566a0645K307R826J2269K415J4035l505o104p822J019N591m133l160o906m531
14552F56Q871N468o301r351j1492n122R255P025j13o165j379k678J1741M503J233
$$ y = [7181, 7334, -329, -9498, -6791, -186, -3684, -6528, -6066, 3758, 8900, 13421, 6418, 2168, 3511, 2789, 824, -3702, -6083, 837, 1947, -6902, -12764, -10085, -3639, -6309, -4366, -8755, -12209, -12896, -20370, -25626, -13158, -10626, -9506, -2073, -971, -8186, -18540, -18230, -19752, -17586, -11695, -3642, -1462, -3305, 426, 3718, -2954, -5489, 793, -8067, -12311, -5088, -1230, -7498, -7102, 2088, -4418, -10924, -9014, -6871, -8223, -8929, -6678, -13766, -17667, -6575, 2952, 9936, 12982, 6736, 7046, 1243, -6001, 1040, -174, -12263, -9086, 10935, 22526, 17498, 4850, -1169, 1524, 10476, 9918, -2079, -10645, -8338, 1488, 13757, 16172, 30207, 26702, 20598, 12776, 13795, 19386, 15253, 12093, 5187, 656, 9527, 14995, 8694, -657, -12149, -17271, -8016, -991, -1104, -7269, -8648, -11326, 415, 4918, 6151]
14537F151j2505O506O02p82o10q435m39N038O495k486Q13N155j088q901m490O51
14521h325N50p32O941P679l036Q012p222j705J755k274R126M796L325K8j4794
14506D124p394k714P251O269J274q655j0491l125q61M76o121K329L905M506N678
14491c549p83K33l774j0253L352O892M023L66p45p417K969R393o556O245l315
14476b919O112J318P65P40n284P408r37k06m728m035m945p757K147M576J810m808
14460a0743j749j518L720M952l056l959P109K189J749o110L557o532OK075J063
14445g247k885n347l428R220K722M054O642J647j330o984r002k588J1734n219
14431h011j82M613Q052Q302k25j836r103l272o7p132J0593J20j3616M936R533
$$ y = [6151, -6354, 152, 754, -28, -638, -9073, -9512, -4474, 2021, -465, 348, 5503, 4415, -4486, -8976, -8325, -7775, -8507, -1566, 6113, 3077, 11089, 3867, 2162, 3917, 1643, 10769, 15565, 18890, 18918, 4124, -3270, -5984, 1267, 7536, 8810, 155, -10336, -13461, -14322, -13846, -19967, -17638, -13733, -9227, -3549, -4332, -4099, -7873, -18126, -14774, -7882, -3859, -3493, -4238, -11655, -8686, 707, -5849, 396, -2919, 3193, 4511, 5276, 6016, 732, 8140, 7203, 6997, 2269, -1766, -6711, -14468, -12321, -7745, -5935, -10743, -12492, -14010, -10290, -5338, -8394, -12353, -5244, -3055, -1306, -7416, -3859, -10391, -10385, -8310, -7247, -10132, -15479, -18907, -9687, -6965, -2911, 3731, 5378, 4048, -2936, -11938, -14526, -2792, -8011, -8193, -3580, 4472, 12774, 12549, 10713, 1610, -1662, -1729, -8861, 1732, 1852, -11764, -6828, 2705]
14416B705m336p383M863N602o33j265M647K92l141N991m011r091M513k372k021
14401e640m743o166L493K73j874K770N9k712Q028L703O05R29o182n934j0742J986
14385b2147J3955J2175q601j0033J78N841N983M066J3109P241o771o472m236M23
14371D711m538q609j642j8790q643R728L867N400J0825l385n203j542P234N82
14357a0005J1631k159l470J60J922l848l867Q768N500K480J273p034p111k364
14343h124q409J1295K562L824Q196J386n445m014N494J838m710o469O246k924
14329G46j0127j748J2467J4841k941q38K081k436r015L251m340n819N346M775
14315F243m654q26p355p805J4595J0972j0150j921N595j612R47K011L137L13p969
$$ y = [2705, -1631, -9014, -4151, 1451, 818, -447, 4200, 4492, 1351, 7342, 3331, -5760, -1247, -3619, -5640, -10383, -16549, -13056, -12783, -14657, -11887, -11828, -14540, -6512, -2809, -2204, -1275, -7457, -13391, -24133, -22147, -8192, 3983, -4618, -14651, -14473, -8632, -2649, 1417, 14526, 21767, 14996, 8524, 4288, 4711, 173, -8436, -10078, -28868, -37511, -27783, -23916, -18516, -7691, -11076, -16279, -17821, -10587, -10005, 1626, -533, -4003, -3843, -1921, -5769, -9636, -868, 4632, 7112, 8385, 1351, -5760, -8124, -16533, -5238, -2676, 1148, 9344, 10730, 5285, 1271, 6765, 8603, 3893, -2576, 3670, 746, -9381, -11129, 1338, 16179, 13238, 12400, 14481, 12045, 3030, 6281, 1941, -3878, 1468, 6243, 1589, 763, -6592, -14397, 198, 11170, 1020, -901, 4694, 3082, 4029, 6040, 9177, 9490, 1521]
14300A521j41M21R11r781k854O23J289M177P636o357L91R967l757j735Q413N002
14284A5726q105p885r605n041L369M922j337J260J715N255J999m686J788l899
14270d524o796j518j925R227Q486P701m572j1123O025Q881M33l648J022n03j1008
14255c842K26P164k249k822n747J0300M677P16n8j5168m67N298O981O790j326
14240A0473L451N990N822o109o556j0090K672m593J659r98k258r507m639N342
14226i341L279P908P008j493n209p113O703Q287J883r921j406R913M758r108o683
14211e35J890l41k284L716j157K741r282n168P808P425J1049l231n803o1o108
14196F59l592m456k890P416O121L776n448J380p224m215M448m3j211M460P61L82
$$ y = [1521, 1380, 1801, 2712, -7069, -9923, -9300, -8011, -3834, 3802, -2555, -2164, 7803, 4046, 2311, 10724, 15726, 7621, -264, -9869, -14910, -11541, -6619, -7956, -6696, -4981, 274, 2273, -2413, -625, -4524, -11320, -12838, -14763, -5536, 2950, 10651, 6079, -5044, 981, 9862, 10295, 6647, 7669, 7166, -3842, -3616, 3548, 1299, -1523, -7270, 3030, 7707, 8423, 8365, -6803, -7270, -1972, 5009, 11799, 10473, 13924, 19914, 25736, 19627, 13071, 2981, 5653, 1060, 2719, 1721, -537, -10044, -14683, -9341, -6062, 1846, 8854, 7361, 2152, -4961, 1742, 10029, 11912, 1991, 585, 10498, 15256, 6148, -535, 1355, 1014, -1270, 2446, 1289, 4030, -5252, -10420, -2612, 4813, 15862, 12631, 6828, 6767, 659, -2933, -7389, -10279, -2863, 3258, 7034, 1586, 2966, -4258, -8473, -4025, -4068, -5279, -819, -58, 324]
14180C24J0691Q95k42l897r88m258m305j997N355N456P46r556l828J775O666O445
14164I282o096m691O456n68q281N169J0444R83J992J02o366m99p325q671j1778
14149a9847J18M528L872J2118L88o796l545N503J843O662N313m024R559R55q29
14134A5818m752j1225p113M001p46k016M202R802n747p388N790O383k217k119
14120B673m736J1526M440J48k585n321m155q002k476K295k94J0622L434K288j1340
14105a483q961R66p27m876M002J0957K736j99q491J503O104R95r94o084m454K561
14089f445J0097K145j395K137q86j043L106N735K813o650o02p848M05J0603j711
14074A0461m464r867Q57P331L719p52j6556r620O54J0149N478R278K254K831n590
$$ y = [324, 11015, 11910, 11668, 7771, 6783, 2525, -1780, -3777, 1578, 7034, 7780, -1776, -5604, -3829, 2837, 9282, 3186, -1505, 4951, 4383, -3898, 1271, 11715, 12698, 14690, 14792, 8426, 7927, 602, -8069, -19847, -19729, -15201, -11329, 789, 1177, -5619, -9164, -3661, -1818, 4844, 10157, 6133, 15692, 16647, 15818, 11066, -159, -7272, -3271, -4017, -6033, -1831, 7971, 2224, -5164, 626, 7009, 4792, 2673, -2063, 9463, 13903, 14051, 11466, 6145, 1990, -6012, -8488, -6193, -6487, 4135, 7569, 9857, -1483, -10444, -9478, -10205, -15081, -11079, -122, 2614, 2415, -6076, -4573, 1531, 2526, 1532, -4552, -9006, -6445, 3652, 5797, 4402, 6539, 5653, 4610, 7716, 13451, 16264, 9614, 9012, 1164, 1569, 12172, 10461, 5997, -3870, -3013, 4318, 8037, 7285, -9271, -18891, -18237, -8088, -2610, 6668, 8922, 11753, 6163]
14059F163r910o732o372O384P012R016J0383j920q671n996k096K419J298O643
14045G621l361K079j484K209O392l996P26L419l931r355j2769n487J584Q765K847
14030d741r608Q333Q90m126l095K047L919L50K821r12j001J448N900J507j997
14015A735M505J950j477J693r097m862L37M178J0795Q594p742n735L36J1173m645
14000A1738j0344l708L703k799J314O788o607l6k186O942J388k200m742K740n041
13985c050j860r84M857M583j219j0922n96M041N78l913p98J10R080M96O165J788
13969H356o910o222r81m127N857K66M361J59L261J0295m404p682J0415K33j4219
13954a342p158L158J1062R67j3821J816M936l638q123q55N257J278L362L128j11
$$ y = [6163, -3747, -10479, -16851, -10467, -3455, 5561, 15944, 14024, 5353, -643, -2739, -320, 978, 7621, 4260, 6339, 4855, 7064, 13456, 9460, 10186, 13605, 9674, 319, -12450, -17937, -16353, -7588, -4741, -14349, -6016, -5126, -9252, -12347, -10300, -6381, -6031, -3210, -4122, -5123, -3675, 2225, 3732, 1735, 6240, 8190, 6713, 8406, -691, -5553, -5216, -1038, 9757, 18351, 10609, 4874, 5210, 16383, 11738, 1394, -2314, 1389, -1410, -96, 6692, 85, 49, -2137, 4805, 6193, 3993, -749, 1991, -3050, -4910, -5894, -1037, 3546, 2327, -8595, -9191, -5150, -4572, -8485, -9283, -9173, -93, 403, 6568, 8356, 1446, -4776, -5757, -9884, -4027, -3761, 600, 759, 4020, 14315, 9911, 2229, 12644, 12877, -1342, -8500, -5342, 5720, 6687, -7134, -5318, -382, -4020, -12143, -12998, -7741, -6463, -3101, 27, -84]
13939h4O038j676j2372l942J4369L530O515m647p880m736K241L870m4r900M195
13924d523N255q597K684R872K864K804N331k392j0523O81j706L320J454o573j275
13909a324k473j2717k245J0202O752m513k361O860K640k810p548K968M317P018
13895D766K28l57p228k723L870K165k147M882N707K584p392j4077r269N853j89
13880a3327n103J3139Q533n958L260n665j415n091N362l396o51Q678J2641j0506
13866E01j1336k560K639K215o176K588J0858N115l979n959l066J331K576N710
13852D57k983j1653o77R106J43k470O803j45N985l69p167j0841m035Q569O497
13837b780m601l181P983j484P87O969K403n314q814k032m64O589M763J7928l267
$$ y = [-84, 5954, 4278, -8094, -12036, 2333, 5863, 12378, 7731, -149, -4885, -2644, 1226, 1182, -8718, -4523, 732, -7865, -5181, 4691, 7555, 10359, 15690, 13298, 2775, 3456, 1750, 5070, 6524, -49, -1324, -3797, -16514, -18759, -8557, -1805, -6318, -8679, -1819, 821, -1989, -9537, -6569, -2252, 4766, 4994, 4637, -2591, -5314, -1444, 721, -1426, 3456, 9163, 11747, 4355, -9722, -18991, -13138, -13327, -18430, -5291, 3242, -2716, 544, -5121, -6536, -11627, -6265, -9661, -10312, -1634, 11007, 501, -10835, -13395, -10756, -8541, -14717, -12129, -1271, 3844, -135, -6094, -9160, -7829, -5253, 457, -2526, -14179, -14856, -5750, -5607, -8077, -1274, -1419, 4566, 4197, -2970, -13811, -17846, -9277, -2780, -7381, -10562, -2579, -4063, -3276, 3693, 6096, 782, -8032, -10064, -10528, -3939, 824, 18752, 15485]
13822A5485p645q892p316J473N671J0941O577j2266q607k834N268k085K881M812
13808C463l638j0164l705m397J11M424P769O163m262j625J874m818J408N716L2
13793a649q145m100K073P408M1Po018m974M716M252J0401K357J746j0084q698
13778a0667j275Q06O512O747j716R14n588l727J011R710N720p216n531L147j592
13763b745q770N352j588K416M352K772O585L70r835j0915N836J0376P001j628
13749I579k233k901K595j633q588L049p159m925J3127P056k981o036n441J1018
13735D527O707m859N967Q56q703R33l796o344m217K086m204O636N927k627P04
13720d07p359o470R552P045j598O097M244l815j917k646j187o81K054r980o662
$$ y = [15485, 7840, -1052, -8368, -6895, -1224, 9717, 16294, 4028, -4579, -7413, -2145, -4230, -1349, 3463, -175, -10339, -14044, -18441, -18330, -13906, -6137, 26, -4236, -5861, -3987, -8805, -7397, -1681, -1649, -9794, -13894, -11821, -4413, -4372, -4365, -10383, -15357, -10641, -6389, 4012, 6369, 8115, -1969, -10667, -11942, -11136, -4624, 2123, 407, 1321, -4267, -7994, -6983, 2727, 8447, 1231, -4300, -1153, -2745, -11515, -6163, -7751, -5335, -983, 1789, 8374, 8744, -1091, -12006, -6170, 4206, 11207, 9579, 7346, 4445, 7040, 5407, -3181, -132, -7291, -12216, 911, 7967, 4986, -1050, -6491, 4527, 11234, 6375, 12342, 13198, 4495, 5428, 1632, -4712, -8929, -6843, -11047, -4411, 1516, -1111, -407, -7766, -14236, -4684, 2361, 763, 6860, 11104, 7289, 5372, 2726, 1539, 858, 2912, -7068, -13730]
13705a3730M739J0437O597M086K078N778q807j1401o035K585J0370K615p369m621
13691b678p694l564J1642K996M725K69q515k529o842K917R178N867j023n195J654
13676A208N135M504M524K825K708o502p396j4642K947J1131L922n174o749Q291
13662F732N820r340l225R523K079o00l659q88P949K64o618k545L843m906k967
13647A462L850j1332k31J343K010n086j384J1475P034O764j059l624j2560m319
13633e657K470R629O585k473q97P21M359j0968n994j1545m589N609N59L729m184
13618a2646Q675J689K900N74l164l302q136L93P147P502M242N1j3585K498J2976
13603G814K742r34k130j053k131L883r005m658M590j086n64N552L685p25j1196
$$ y = [-13730, -8991, 1446, 8043, 12129, 14207, 19985, 11178, -223, -6258, -3673, 6697, 9312, 1943, -2678, -10372, -13936, -2294, 702, 5427, 5696, -2819, -5348, -12190, -9273, -95, 5772, 4749, -446, 1208, 6343, 10847, 15371, 18196, 20904, 14402, 7006, -7636, -4689, 6442, 10364, 5190, -1559, 6732, 12552, 3212, -13, 9510, 11589, 10989, 7330, 6442, 14391, 14655, 8037, 5492, 9335, 4429, 1462, 5312, -6020, -6251, -4908, -2898, -7984, -9368, 2107, 9141, 15905, 14846, 11222, -1338, -5657, -3187, 6442, 13027, 10554, 9657, 10378, 14737, 3769, -2225, -13770, -18359, -12750, -12191, -8462, -12646, -3971, -2282, 618, 1192, -1972, -5274, -13410, -13017, -5870, 1632, 5874, 5925, -7660, -5162, 7814, 10556, 9622, 7492, 6439, 4308, 8191, -814, -5472, -882, -1968, -2532, 3020, 6705, 5980, -5216]
13588e216r970j401j036k728L576P438O768r758m46K67P767k124O572o367j5031
13573b1689P103J6386M864r453j0245r20R496M574Q484N015j316p312j6985p870
13559a9868J1731J9225P27o430l560m997O15L927K28o640o280L846O214n00K035
13544B73M968m891L671j478o068j902K208Q495J189j925j93J132o226n363J0744
13529D634J0151L640o45N206o468l369o201o300K849n414p436k305K90P656K313
13514a399l699J4111R951o437q103k753o684m058Q8J215o632L916J742L285n61
13499f018L454N943l138j3139q585J0092p63K364K58J77L1R73N050P502Q654K699
13483A5554l294j412j0020r803L796N228L198O701k040N546M369n652q861k745
$$ y = [-5216, -15186, -16587, -17623, -20351, -16775, -9337, -2569, -12327, -12773, -12506, -4739, -6863, -291, -6658, -21689, -14586, 1800, 6664, -2789, -13034, -13954, -4458, 116, 8600, 13615, 12299, 4987, -11998, -19868, -8137, 11088, 11815, 5385, 1825, -3172, -2557, 1370, 1598, -5042, -11322, -7476, -1262, -1762, 273, 5241, 350, 4021, 2543, -3525, -5427, -3219, 5276, 6465, 4540, 4347, 5479, -747, -6110, 4634, 14785, 18425, 17780, 22986, 16518, 13149, 6948, 648, 3497, -1917, -9353, -11658, -11368, -3712, -1399, -5098, 9013, 18964, 12527, 4424, 1671, -5013, -9071, -8983, -7768, -14400, -10484, -8742, -5457, -6018, -2564, 3379, 241, -12898, -21483, -11391, -12154, -9790, -9532, -9355, -9324, -8351, -3301, 4201, 12855, 15554, 12260, 10848, 828, -8975, -5179, 49, 3247, 9948, 7908, 13454, 17823, 12171, 3310, 565]
13469E65o235m211P422j289j339K250O061L386J081r849j837J127J0550k448K298
13454G532Q066J346m007L871m319o279J28j56M072n460K163L084p425R40o136
13439b580n367L548P664n81q016n691L968L355m364l259L649J3555P703r768n153
13424a337L974J4759J06j0144j159j26o571j0192k758J090l819O540N047M171
13410d19K93K475j657n880O302j262N520m74m139L910J1653m42n308j4397r84
13395d809Q922K058j7694l846K461M211J87j4m373n737K716L987m452L767n041
13380a7657k469K062J1424J1524n229l35p669L008J4033M998k36N149M747O75
13366B4025n034m445r213o996L319N519o633j802K09J334l459O388n314j804k164
$$ y = [565, -5670, -9881, -2459, -3748, -5087, -2837, 3224, 6610, 7691, -2158, -3995, -2868, 7682, 5234, 7532, 15598, 16944, 12937, 16808, 12489, 6210, 6338, 6182, 10254, 4794, 6957, 10041, 2616, 3556, -2580, -7947, -4399, 3265, 2684, -5332, -11023, -7055, -3700, -8064, -11323, -7674, 5881, 13584, 3816, -1337, 2637, 17396, 17502, 7358, 6199, 6073, -498, -10690, -13448, -12358, -16177, -9637, -4590, -419, -126, 2349, 692, -5188, 1114, -148, 5372, 4898, 759, 4669, 16322, 15880, 10572, -3825, -4809, 4113, 6171, -11523, -15369, -12908, -8697, -8510, -8524, -12897, -18634, -15918, -11931, -16383, -12616, -17657, -20126, -18064, -6640, 4884, -345, -680, -8349, -5341, 8692, 13690, 13454, 18603, 23350, 24025, 18991, 14546, 5333, -1663, 1656, 7175, 542, -1260, -1051, 283, -3176, 3212, -2102, -3906, -6070]
13351f070l707K563M374O728p548Q32K630K552r82R946n314q957Q935O857m339
13336H500j0551r56K688P85N002M436j361k269K240M36j184m509o620O606K72
13321C515n624M620N400j442k3j3325O788O10o174N02o04J0560n511l258k917
13306f883J2091O256q647m485P078Q479q971m306O517R178j68m205n635K077j29
13291H247j133L728j223O22r07j607L371K956k943l238l371P816P594K221n802
13276A6331L593k733r725j119J2293L012K606P20j427P897m808n694k763M496
13262B2679K479O339J1167J2348Q364J5880R355L482J5473J0168q924j4349j9434
13249G5027n397m197l583J291j150L444P424J489O430R65P40M797Q464N612p602
$$ y = [-6070, -9777, -7214, -2840, 3888, -3660, -2828, -198, 2354, 1372, 11318, 6004, -2953, 5982, 12839, 8500, -2051, -3007, -319, 466, 5468, 9904, 8543, 6274, 8514, 8950, 7766, 3257, -3363, 3243, 3515, -2109, 2511, 7911, 6469, 6446, -6879, -91, 519, -5655, -5153, -5757, 4803, -708, -3966, -6883, 5208, 11464, 2817, -1668, 5410, 13889, 4918, 612, 7129, 16307, 16139, 11934, 6299, 8376, 8247, 7114, 10842, 9619, 10241, 9334, 7727, 11098, 14054, 11111, 7873, 4502, 12318, 19912, 22133, 16331, 19924, 17191, 7466, 6347, 18640, 21652, 24258, 24978, 23551, 31448, 26640, 20946, 18183, 22679, 25158, 31497, 42664, 55012, 63376, 79256, 88611, 92093, 107566, 117734, 108810, 94461, 75027, 69630, 65433, 61850, 63141, 61991, 65435, 72859, 74348, 80778, 81743, 82483, 87280, 95744, 101356, 93754]
13234I3754m894J860j832M049J2473J6998J403j558J3117J1963J131q86l746k1560
13220A22272j5764q315j693J907q751l422J66n404K864j670M073K145j2522k178
13206G3708k40N61L718L992R018M852K280Q624M353J2478L688L705j1400m506
13192A14831l292j2087j6093k0411j1301r147j1146K992J161p11p922j1662M99
13179A5711M862N733j4598j2281J1165J3174j4907j0777p237j267J5903P595n739
13166G337K571K996R38r19j2498n995j54l144P41J4882M088O578L755o657l611
13151A0908p012j1092K309J2723J2579N902j0105l640K318K035l599q345K680
13138G661J1055K588J193K683K921p949j0229o998O496M380Jp322K228K361l047
$$ y = [93754, 88860, 90720, 88888, 92937, 105410, 122408, 123811, 122253, 135370, 147333, 148464, 147578, 143832, 122272, 106508, 98193, 96500, 98407, 89656, 86234, 86400, 80996, 83860, 82190, 86263, 88408, 75886, 73708, 73468, 74029, 77747, 81739, 90757, 95609, 97889, 106513, 110866, 123344, 127032, 130737, 119337, 114831, 111539, 99452, 83359, 62948, 51647, 42500, 31354, 34346, 35507, 34796, 26874, 15212, 15711, 20573, 26306, 11708, -573, 10592, 23766, 8859, -1918, -9155, -10422, 5481, 13076, 7337, 9908, 12904, 13842, 12923, 425, -5570, -5724, -8868, -8127, 6755, 10843, 17421, 21176, 14519, 10908, 3896, -7196, -4887, 7836, 20415, 26317, 16212, 12572, 14890, 16925, 13326, 4981, 7661, 18716, 21304, 22497, 25180, 28101, 20152, 9923, 2925, 9421, 13801, 13802, 6480, 8708, 11069, 8022]
13123H022N902M407J517m242J911l417K141P76P457j339r610m221P13j295K191
13108A0913P838L901J985r59j1293n85R506j650p371N783N370N77j6311k89J0298
13093A7713O400p454m627p18L025k43p468Q18l858m283J17j654N499N086O656
13078A5009J503o252L295N32j942k578l471j025O340r900N23P628J2387P871k762
13063B7158j2916K49L391m586l271l141k866N010L537L066m447k3p949L624J1883
13048A8719M955p6o326j0827j1688k698J3665M621L109M712J757M698m18J3850
13034C8053J852j0457m095j070j719j1756K797O487O721J936n931j0117o098J2226
13020A8829P559n401K007k833n632p396Q164M337q701k106L189J849N55K462N613
$$ y = [8022, 13924, 18331, 19848, 15606, 17517, 14100, 16241, 17017, 24474, 23135, 13525, 9304, 10017, 8722, 10913, 18751, 22652, 24637, 23678, 12385, 11800, 21306, 19656, 12285, 18068, 23438, 24015, 7704, 7415, 17713, 24113, 16659, 12032, 11314, 14339, 14096, 6628, 7446, 3588, -695, -578, -2232, 3267, 8353, 15009, 16512, 10260, 13555, 14087, 12145, 9567, 6096, 5071, 11411, 1511, 2034, 9662, 22049, 29920, 27158, 14242, 14491, 17882, 13296, 10025, 6884, 4018, 9028, 12565, 15631, 11184, 11161, 3212, 6836, 18719, 23674, 23598, 17272, 6445, -5243, -7941, 5724, 10345, 13454, 18166, 19923, 24621, 24203, 38053, 39905, 29448, 25353, 24283, 22564, 10808, 13605, 20092, 26813, 28749, 22818, 12701, 6603, 18829, 26388, 20987, 22994, 20161, 14529, 7133, 15297, 19634, 10933, 8827, 12016, 13865, 14420, 16882, 22495]
13005B2495n61l461J3589q75l932l768j529k215j034J425k288R968j9p062n785
12990A4948k704j0744j223k746k64Q842j627j283j654L182m625j359k692N593
12976A644N680O84M818K925p35l46j2051l200P120K640k593J511J374L193q187
12961D477O31J4842L225j1753l595l95N435k012N08K810j63j449J2453M924o415
12946B3523q237o110J680J476J6890L525k227k369o58N637M899J0375J701k52
12932D9853O275j305M304q08K022M101Q577L995o203M543J3846N137k696J0521
12918A02162N952j6184o743L186l265j1357q983oj220L302n9o98N771M757k743
12903G3872J630r94N303L47J502M510p2m832l342l947O607M515k64J734K239N574
$$ y = [22495, 21934, 18473, 32062, 31187, 27255, 23487, 21958, 19743, 18709, 20134, 17846, 27814, 27795, 20733, 14948, 12244, 1500, 277, -2469, -2733, 6109, 4482, 3199, 1545, 4727, 102, -1257, -3949, 1644, 7324, 8008, 12826, 15751, 15016, 14670, 2619, -581, 6539, 9179, 6586, 8097, 9471, 12664, 4477, 5108, 19950, 23175, 11422, 7827, 7432, 12867, 10855, 11363, 14173, 14010, 12561, 25014, 29938, 23523, 15286, 9176, 10856, 12332, 29222, 32747, 30520, 28151, 27493, 33130, 38029, 48404, 50105, 49853, 56128, 54823, 59127, 58319, 60341, 64442, 73019, 77014, 70811, 75354, 89200, 94337, 91641, 102162, 108114, 91930, 85187, 88373, 85108, 73751, 64768, 64762, 63542, 66844, 66785, 66087, 71858, 76615, 73872, 75502, 74508, 79811, 80158, 81660, 86170, 86098, 81266, 77924, 73977, 80584, 85099, 84835, 86569, 88808, 94382]
12887I4382l588r367K06m44K823j367M630n662j181O176K627N821O954K410J175
12872A05595k480J0327N339j359O085O475M455n815J3090J0096k958p112L213
12859A44951L224j688n758n052R756K4140J6129K749P137R246J0434J3618J8168
12846B47054J788R215J6425J8949P894J0046K0332R915R441N23J2545J5809J9818
12833C99754J5834L0610M5723M3577L4011L1763N1524N5037O0109Q3459R5035
12822I46436R1123J08204J43604J61462J79104K13216K47126L02740L80077M94707
12812C267799O37030Q37494J103262J444098J869174K362238K857214L237781
12804A7616090L243702K577538J121115o96966k143990k801403k741687k310223
$$ y = [94382, 90794, 81427, 81633, 81189, 84012, 82645, 87275, 81613, 80432, 86608, 89235, 95056, 102010, 104420, 105595, 103115, 113442, 118781, 117422, 123507, 129982, 134437, 128622, 141712, 151808, 148850, 141738, 144951, 148175, 146487, 140729, 135677, 145433, 169573, 185702, 188451, 195588, 204834, 215268, 228886, 247054, 248842, 258057, 274482, 293431, 301325, 311371, 331703, 341618, 351059, 351582, 364127, 379936, 399754, 415588, 446198, 491921, 535498, 569509, 601272, 652796, 707833, 767942, 851401, 946436, 1037559, 1145763, 1289367, 1450829, 1629933, 1843149, 2090275, 2393015, 2773092, 3267799, 3904829, 4742323, 5845585, 7289683, 9158857, 11521095, 14378309, 17616090, 20859792, 23437330, 24558445, 23861479, 21717489, 18916086, 16174399, 13864176]
12796A3864176j747418j177800o67969k33066J56398M76834P14688Q58385Q96908
12787A3141136Q71684Q00646P27181O66193O02097N60093N88754P24478R60089
12778A9642351J244670J481152J558608J381282Q73582Q1952p75189j402349j664021
12769B2422038j604034j359708j030818p05390m35890k86925k35804k62231l53380
12760A6147858m83002o18778p29350q08388q23798p31910n29862k08559K00091
12751A1414302P07358J274923J895266K517261K973811L046631K432073J012197
12743B7273822r15016k630795l542216l609499l173812k592025k046751j592939
12735G170769j231390r55894p36265n70004m50307l72353l11363k61056k24361
$$ y = [13864176, 12116758, 10938958, 10270989, 10037923, 10194321, 10671155, 11385843, 12244228, 13141136, 14012820, 14813466, 15540647, 16206840, 16808937, 17369030, 17957784, 18682262, 19642351, 20887021, 22368173, 23926781, 25308063, 26181645, 26263597, 25488408, 24086059, 22422038, 20818004, 19458296, 18427478, 17722088, 17286198, 16999273, 16763469, 16501238, 16147858, 15664856, 15046078, 14316728, 13508340, 12684542, 11952632, 11422770, 11214211, 11414302, 12121660, 13396583, 15291849, 17809110, 20782921, 23829552, 26261625, 27273822, 26358806, 23728011, 20185795, 16576296, 13402484, 10810459, 8763708, 7170769, 5939379, 4983485, 4247220, 3677216, 3226909, 2854556, 2543193, 2282137, 2057776]
12726B057776k16152j90197j53976j27908j18758j04502j00141q3046p5434o1627
12716H26035n3712n3581l3985l6197m2092m2649k6867k0799k9122k2963k1510
12705D42558k5072k8015k4652j2995j3086r424r691j2390o835k943K75j092p289
12692B89349k0852q193j2036j9348r905l309n126p528j1958q770R377M987j9010
12679A77678j3834q273j3203o617K674K343n021O06M617J100O034n569q900k16
12665A33419K724n562o644o16k608m574n135o422k046r249J42J0283L326K272
12651A09310k762o926p381o746L739M77k864l686J2960J2343L404R528N95O13
12637A22604j665j1953N590J1491N164Q381P342Q150J9081O474j983O11m905j1523
$$ y = [2057776, 1841624, 1651427, 1497451, 1369543, 1250785, 1146283, 1046142, 963096, 887662, 826035, 772323, 718742, 684757, 648560, 606468, 563819, 536952, 516153, 487031, 464068, 442558, 417486, 389471, 364819, 351824, 338738, 329314, 319623, 307233, 300398, 297455, 297730, 296638, 289349, 268497, 260304, 248268, 228920, 219015, 215706, 210580, 203052, 191094, 182324, 191701, 196688, 177678, 163844, 155571, 142368, 135751, 138425, 140768, 135747, 136353, 140970, 142070, 148104, 142535, 133635, 133419, 136143, 130581, 123937, 123321, 120713, 116139, 111004, 104582, 102536, 93287, 93429, 103712, 107038, 109310, 106548, 99622, 92241, 85495, 89234, 89711, 86847, 83161, 96121, 108464, 111868, 121396, 121991, 122604, 120939, 108986, 114576, 126067, 131231, 139612, 146954, 155104, 174185, 180659, 178676, 179287, 174382, 162859]
12623A62859k6610j9166r411q627p074p190j0386n16J4118P479j162k292p98Q736
12609I9960j625j0620j2512o921O366j581o543n349l319O180M94q24M650k494
12595F5862L645o652k631k483Q38J315k117j1721o200M489k842P796L329m691
12581D7937P06j0089q538Q8P642M204l798n591R633J0391k001P32N226j732l012
12566E1798p28q669k991q757o044j098O593M662o08K497l55J089L695K483k624
12551D0943J800L766O481l120N905j562J19j213n216J860k27n011m700J541n498
12536C5868j367Q512N76L160O753J087q728m842j573k629K523K569P571l26N147
12521E4301P37p065L983k420r197L340M286m714k509m863J414o445J821L453K410
$$ y = [162859, 136249, 117083, 107672, 99045, 91971, 84781, 74395, 73879, 87997, 95476, 94314, 92022, 91224, 99960, 98335, 87715, 75203, 68282, 74648, 73067, 66524, 61175, 57856, 64036, 64530, 63706, 68356, 65862, 69507, 62855, 60224, 57741, 58579, 59894, 57777, 46056, 39856, 44345, 41503, 49299, 52628, 47937, 48643, 38554, 30016, 30104, 37746, 41950, 38152, 32561, 42194, 52585, 50584, 51316, 56542, 54810, 51798, 51070, 42401, 39410, 30653, 24609, 23511, 30104, 34766, 34158, 36655, 36300, 37389, 41084, 43567, 40943, 42743, 46509, 52990, 49870, 55775, 54213, 54332, 53119, 47903, 49763, 49536, 44525, 39825, 41366, 35868, 34501, 43013, 43589, 46749, 53502, 54589, 45861, 41019, 39446, 36817, 39340, 41909, 49480, 49154, 54301, 55038, 47973, 51956, 49536, 40339, 43679, 47965, 43251, 40742, 35879, 37293, 30848, 32669, 36122, 38532]
12506C8532q653J742M375J667Q36L127R435K630n812m411J140K033N682j484n542
12491D5297r474r456K426M935o600q897o907p836k42N456J3423J2284n637J316
12477C0088q710o833K520Q07Q8k605L218l788k255r781K414n172l174k333J950
12462c566%o378J244J0032K282j369l31n390p355M831N235J2602M003o642J369
12447A0567R91K346j314m868J821m262o742N041J614P693N307r637p073o334J908
12432b942P304O541o322o658J453L674J285o83J1018K443l223q41M151K584m809
12417A4975q05L717p212m457p53O870J5285K796j6737j09m594q156M86k068M965
12402D203p510l188m22p19k23O333m309j2107p38j002Q528J6793J3250o07n062
$$ y = [38532, 29879, 31621, 35996, 37663, 38499, 41626, 51061, 53691, 47879, 43468, 44608, 46641, 52323, 50839, 45297, 35823, 26367, 28793, 33728, 27128, 18231, 11324, 3488, 3246, 8702, 22125, 34409, 28772, 30088, 21378, 14545, 17065, 17872, 17960, 15355, 18573, 14785, 12530, 2749, 5163, -9, -3183, -5516, -3566, -3566, -9944, -8700, 1332, 3614, 2245, 1914, -3476, -10831, -6000, -765, 11837, 15840, 9198, 10567, 11558, 13904, 12590, 7722, 9543, 5281, -1461, 3580, 5194, 12887, 18194, 8557, 1484, -4850, -2942, 4362, 10903, 4581, -2077, -624, 3050, 4335, 3652, 14670, 17113, 13890, 13049, 17200, 19784, 14975, 14170, 17887, 10675, 6218, 5465, 12335, 27620, 30416, 13679, 13570, 8976, 820, 1306, -762, 4203, -3307, -6495, -6917, -7636, -7859, -1526, -5835, -17942, -18680, -19682, -11154, 5639, 18889, 18282, 13220]
12387A3220o042L588p194l171j051N129L607l621n882J3270k004k972q82p815
12373a820m829M786l204N727k677L337j846l098M368K019J1872N853Q79r053p852
12358D462P985P973L448J627O849N608N085J3084O652N296J0524R279J0250L330
12344A01452m862N750N897p216j1679l917j283q826o773n43K671m012m13k148
12330F4098J130P485M442J0224O892o32L466M749O809J625J778Q843Q973J2231
12316A42113N846n568j5446r452q708J245o732j0143K859n937m124Q524M975n112
12302I4340n041p810k313m169k849j655R25l233k324P658J0211Q752J2560J9870
12288A24922P421O871L967r664j6701k0555j6438j9322j3438n126q01n351j524
$$ y = [13220, 7178, 10766, 3572, 401, -650, 4479, 8086, 4465, -1417, 11853, 9849, 6877, 5995, -1820, -6649, -1863, -5067, 660, -2017, 1320, -526, -3624, 744, 2763, 14635, 20488, 21367, 12314, 4462, 12447, 20420, 23868, 25495, 32344, 37952, 43037, 56121, 62773, 68069, 78593, 87872, 98122, 101452, 96590, 102340, 108237, 101021, 89342, 85425, 84142, 75316, 68543, 68000, 70671, 66659, 66246, 64098, 65228, 72713, 77155, 87379, 94271, 93639, 97105, 101854, 108663, 110288, 112066, 120909, 129882, 142113, 147959, 142391, 126945, 117493, 108785, 110030, 103298, 93155, 96014, 90077, 85953, 94477, 99452, 94340, 89299, 81489, 79176, 75007, 72158, 70503, 71428, 68195, 65871, 73529, 83740, 92492, 105052, 124922, 132343, 139214, 143181, 133517, 116816, 96261, 79823, 60501, 47063, 41937, 41136, 35785, 34261]
12275C4261m147o988O16k725M291o64m914R228N507j5679p794l00N839L259p292
12260A2498K588J993l784m533j1376k217j320m896Q562L959O492k94n844q51J2212
12245A3189J0514k88j6516j3825R095L237O91j206l470j012O755J757j441J484
12231H964Q483P019L664j077j0142k090m93p073k672L313N300M159j3720m528
12217h93K162N698M780M920J307n524P81n382n040O785N429K977l604o385m683
12202C328p740J489O434J519L98o141o800J929P562p52K987K498L523j879j764
12187F591n613m881n443N338Q422L883Q75K257n065m488K628N114M919j7q289
12172F231q202J83j693l378J723l522j361J1630p77L185N161r17q45j2280J502
$$ y = [34261, 30114, 23126, 23742, 21017, 25308, 24644, 19730, 28958, 34465, 18786, 10992, 10692, 16531, 19790, 12498, 15086, 17079, 13295, 8762, -2614, -4831, -6151, -11047, -2485, 1474, 7966, 7672, 1828, 977, 13189, 23703, 23415, 6899, -6926, 2169, 5406, 6097, 4891, 1421, 409, 7164, 8921, 7480, 8964, 17447, 24466, 28130, 27053, 16911, 14821, 14328, 7255, 4583, 7896, 13196, 17355, 3635, -893, 1269, 6967, 11747, 16667, 17974, 12450, 13231, 7849, 2809, 9594, 15023, 18000, 14396, 8011, 3328, -4412, -2923, 3511, 5030, 5428, -713, -7513, -5584, 1978, 1226, 4213, 6711, 10234, 8355, 6591, 978, -3903, -9346, -4008, 4414, 8297, 9172, 11429, 6364, 1876, 4504, 9618, 14537, 14520, 6231, -1971, -1788, -3481, -6859, -5136, -8658, -10019, 1611, 834, 4019, 9180, 8263, 7418, -4862, -3360]
12157c360l063n523J901J714r48M869J728J511J660n460j589M456M045l160l616
12142d835j160O333L017j081N44l215N7K128L614n196R4o345Q852Q987P346j1481
12126G659p438j819j856r354J0747O445N442K434l295N67R55o245m511n259n556
12111a1084L724M10l671N215l77J631J0285K875J722J194R70o415J21k496j0400
12096f296L815K723R838N635l460J440l224q007o171M644O912k611j826N958M244
12081A3614m587p965j590j346L768l646m967j817K060j650N616O986qr142k384
12066g058j068J1818P921l005l532J921M4q616N521R648n272q559l944m731J4259
12051E347k099j866O421P560j133o45j987n641R54k701J0894L433k674K836K795
$$ y = [-3360, -6423, -11946, -10045, -8331, -9279, -4410, -2682, -1171, 489, -4971, -6560, -2104, 1941, -1219, -4835, -5995, 338, 3355, 2274, 2818, -397, -340, 1788, 5402, 206, 300, -6045, 2807, 11794, 19140, 7659, 221, -1598, -3454, -12808, -2061, 4384, 9826, 12260, 8965, 9532, 10487, 4242, -269, -5528, -11084, -7360, -6950, -10621, -5406, -5783, -4152, 6133, 9008, 10730, 11924, 12894, 6479, 6600, 4104, -6296, -2481, 242, 10080, 15715, 12255, 13695, 10471, 2464, -3707, 937, 7849, 5238, 3412, 9370, 13614, 9027, 1062, -528, -1874, 1894, -1752, -6719, -8536, -6476, -8126, -2510, 4476, 4468, -4674, -7058, -8126, 3692, 11613, 8608, 5076, 6997, 7041, -1575, 3946, 13594, 8322, -237, -4181, -8912, 5347, 3248, 1382, 7803, 15363, 14230, 13585, 11598, 5957, 6911, 4210, 15104, 18537, 15863, 18699, 21494]
12036B1494n404k147m503k049m792N091M96p367K637J5332Q240N959N525m255
12022C4257l23O503J4207Q374J2172J9862R097J0021O017O799J289p557J758q847
12008A13629r929J99j4490j5921o671Q162N657q269J151n90K499M426m953Q37
11994G5737j67Q356J791N747J8041J586R64k462O569N263r85L301N707N371n304
11979A29515j3624j1051Q77k711J820j6787p242j2391o400l71N20N960K992p842
11965F3265m998P755R168P846L981K136Q86K584N479Q020J2899j1022j0843m359
11951I2797j0281q291j1704j6677o166J232j1081j1152Q60l379M575m729j1709
11938D295R75J2837J4546j158q710R37n972j344K371m214l833L802l487J78K67
$$ y = [21494, 16090, 13943, 9440, 7391, 2599, 7690, 8186, 819, 3456, 18788, 27028, 32987, 38512, 34257, 33934, 40437, 54644, 63018, 75190, 95052, 104149, 114170, 120187, 126986, 128275, 120718, 122476, 113629, 103700, 103899, 89409, 73488, 66817, 74979, 80636, 72367, 73518, 72928, 75427, 79853, 74900, 75737, 75570, 83926, 85717, 91464, 109505, 111091, 112055, 109593, 116162, 121425, 120440, 123741, 129448, 134819, 129515, 115891, 104840, 105717, 103006, 104826, 88039, 80797, 68406, 62006, 61635, 62155, 68115, 71107, 63265, 58267, 66022, 75190, 83036, 87017, 89153, 90039, 92623, 98102, 106122, 119021, 107999, 97156, 92797, 82516, 74225, 62521, 45844, 39678, 40910, 29829, 18677, 19537, 16158, 20733, 16004, 4295, 5270, 18107, 32653, 31495, 22785, 23722, 17750, 16406, 18777, 14563, 10730, 14532, 11045, 11223, 11490]
11923A1490l929Q42m759L509M709j37L162N205M959O655k401o135r531j329l054
11908I256J083k46M200J584K111J083L497j903p409P396n252N24Q795p580m925
11893A2214O351J474m478K311j07J390o611j0040n514O379O322m903M322R446
11879A8556j06r267j462K225q307P745J3362J765j22k376p92J846j668j6529o825
11864a955M012M522K476J504K07m977l14p20K593l950k810O086M742n869M976
11849A0523K366k493K280K834j800l827M570P628l428o164K344j97l123j510p86
11834I217N578M144L562J822p454q248J5o947M057k099O058N95R27K030j322L896
11818A5831L501o457q308k302R514N071L757n82k180J508j0071Q384N754j3464
$$ y = [11490, 7561, 8403, 3644, 7153, 11862, 11725, 14887, 20092, 25051, 31706, 29305, 23170, 13639, 12310, 9256, 10339, 10093, 14293, 15877, 17988, 19071, 22568, 20665, 13256, 20652, 15400, 15924, 24719, 17139, 12214, 18565, 20039, 15561, 17872, 17765, 19155, 12544, 2504, -3010, 3369, 9691, 4788, 9110, 18556, 18450, 9183, 7721, 9946, 1639, 9384, 22746, 24511, 24389, 22013, 21221, 23067, 21399, 4870, -1955, 2057, 6579, 9055, 10559, 10766, 5789, 5475, 4755, 7348, 3398, 588, 6674, 11416, 5547, 10523, 12889, 10396, 12676, 15510, 13710, 9883, 14453, 22081, 18653, 12489, 14833, 14636, 11513, 10003, 9217, 14795, 18939, 22501, 24323, 16869, 8621, 8636, 1689, 5746, 3647, 9705, 10300, 11227, 13257, 11935, 15831, 19332, 12875, 4567, 2265, 11779, 16850, 20607, 20025, 17845, 19353, 9282, 17666, 23420, 9956]
11804I956O86M700j130j3500n411N633N870J458l903n575m034O004J0545J474
11790A2773m292j451R357L715o827j5297k662Q37M632m712K714J2977J4033K384
11776B8181p191o547q15p67L069K012j354j1165k408P826K424j344j2218L960
11762C663N33k828K183J1867M251m913o191m183N504j38o828p62m917Q405M90
11747F136O79J63K179k278M703K159J300L990L378n12k685R07q470k538J1439
11732B0550J7095m927r968J671M017P349J196m237n994j984M837q916J213P107
11718B9009J0714J1678J6966J4176O51J782k322p16J158P821R270O927J844M790
11704A13748P719j051o75K516r525j2878n452N952q796q508q662n667K172J48
$$ y = [9956, 10642, 15342, 14212, 712, -4699, 934, 6804, 8262, 4359, -1216, -5250, 754, 11299, 12773, 8481, 7030, 16387, 20102, 13275, -2022, -4684, -3847, 785, -3927, -1213, 11764, 25797, 28181, 20990, 14443, 13628, 12861, 15930, 17942, 16588, 5423, 3015, 10841, 13265, 11921, -297, 3663, 4196, 1368, 3551, 15418, 19669, 14756, 8565, 4382, 9886, 9748, 2920, 2158, -2759, 5646, 6136, 6815, 6978, 9157, 6879, 11582, 13741, 15041, 19031, 22409, 21897, 19212, 20119, 11649, 9111, 20550, 37645, 32718, 22750, 24421, 28438, 35787, 36983, 32746, 26752, 24768, 29605, 20689, 21902, 29009, 39723, 51401, 68367, 82543, 83194, 84976, 82654, 81938, 83096, 90917, 100187, 107114, 108958, 113748, 121467, 120416, 119741, 122257, 112732, 99854, 94402, 100354, 91558, 83050, 74388, 68721, 70893, 71041]
11690G1041K107R032L911N836O379L150j799l157q312o162p150N760J0901R251
11676A00788j3563k997N9K899J498O006p563j459L298M22P411Q319K053m485N997
11661A08683O62J0639L688J94k92O571J2779J1577k762j0648L590k615J291J4815
11647A58172R031l720J236k066j947K125l990O805J1045J0279P394Q962P858P29
11633B11913O095J2293Q625J7495J8830J7168O410P865J2198K2442J9255J9865
11621C80454L1063K9086K8053K8347L1443L4769M3550M9535L9047N1882N7362
11610H04591O8015Q4052J06701J24725J51332J81313K06543K38294K86188L58834
11600B610588M53191N60851P17736R32634J220383J578222K019497K499573K953578
$$ y = [71041, 73148, 82180, 86091, 91927, 98306, 101456, 99657, 96500, 88188, 82026, 74876, 80636, 91537, 100788, 87225, 84228, 84287, 87186, 88684, 94690, 87127, 85668, 88966, 89388, 96799, 105118, 107171, 102686, 108683, 109345, 119984, 123672, 123866, 123574, 130145, 142924, 154501, 151739, 141091, 144681, 142066, 143357, 158172, 167203, 163483, 164719, 162653, 160706, 162831, 158841, 165646, 176691, 186970, 194364, 203326, 211184, 211913, 218008, 230301, 238926, 256421, 275251, 292419, 298829, 306694, 318892, 341334, 360589, 380454, 411517, 440603, 468656, 497003, 528446, 563215, 606765, 656300, 695347, 747229, 804591, 872606, 956658, 1063359, 1188084, 1339416, 1520729, 1727272, 1965566, 2251754, 2610588, 3063779, 3624630, 4342366, 5275000, 6495383, 8073605, 10093102, 12592675, 15546253]
11591A5546253L219391L085642K358424J102898l69349j634895k400064k589464
11583A8318836k388255j961592j424996q63323l49630J06085M74972O92467P50361
11574A3354925O91357N88409N04192M21136L06451J71854O7565Q6561K79174O49466
11564A7121090J134836J657155K064045K198537J919786J207136J77729q68571
11556B6611743j652995j979271j912592j555438j119764p36878m88571l92421
11548A6773813m23120n11741o11343o81907p38016q20259q47793p95892n91537
11539A0752205k80624J04253N60065J029207J510878J935979K231358K292469
11531B0135790J941537J111685j09636j416665k432502k897077k852818k504183
$$ y = [15546253, 18765644, 21851286, 24209710, 25312608, 24943259, 23308364, 20908300, 18318836, 15930581, 13968989, 12543993, 11680670, 11331040, 11437125, 11912097, 12604564, 13354925, 14046282, 14634691, 15138883, 15560019, 15866470, 16038324, 16105889, 16192450, 16471624, 17121090, 18255926, 19913081, 21977126, 24175663, 26095449, 27302585, 27480314, 26611743, 24958748, 22979477, 21066885, 19511447, 18391683, 17654805, 17166234, 16773813, 16350693, 15838952, 15227609, 14545702, 13807686, 12987427, 12139634, 11343742, 10752205, 10471581, 10575834, 11135899, 12165106, 13675984, 15611963, 17843321, 20135790, 22077327, 23189012, 23079376, 21662711, 19230209, 16333132, 13480314, 10976131]
11523A0976131k048663j623852j254252r66507p56550o03685m77188l90230l39097
11514B516107k84464k45032k07772j68130j53219j42532j25281r0674q5793p2825
11504I40385o3118o2298m2356m2233m9579m6450l3799k7451k9851k7877k6828
11493D88545l6719k5130j5200k4977j1443J847k6427k9376j4210K768l517q480
11481B97681j767j2979j5620j2785j0593j0321l978j1065p460J968m280l665m363
11468B00773n990L06r312j0350M397k82r854j4880q001n438o180L519m572k715
11454A31421N932Q338j843m755q672o987p119J1462n190M890Q114j2812l151m035
11440A15593j2023m721J5391M954j853L391k070L01q453j0964K49o053P249J1933
$$ y = [10976131, 8927468, 7303616, 6049364, 5082857, 4326307, 3722622, 3245434, 2855204, 2516107, 2231643, 1986611, 1778839, 1610709, 1457490, 1314958, 1189677, 1099003, 1013210, 940385, 877267, 814969, 772613, 730380, 680801, 634351, 600552, 573101, 543250, 515373, 488545, 451826, 426696, 411496, 386519, 375076, 376923, 350496, 321120, 306910, 309678, 306161, 297681, 295914, 282935, 267315, 254530, 243937, 233616, 229638, 218573, 211113, 213081, 208801, 205136, 200773, 194783, 195089, 185777, 175427, 179824, 179542, 169688, 154808, 146807, 141369, 135189, 138708, 134136, 131421, 137353, 145691, 143848, 139093, 130421, 123434, 116315, 127777, 122587, 127477, 135591, 122779, 119628, 115593, 103570, 98849, 114240, 119194, 117341, 120732, 118662, 118963, 110510, 99546, 99795, 93742, 100991, 112924]
11426A12924l992k999q410j138J4220N21K666Q038n375j01Q579O354P108j959
11412A36436L242l938j3095j55J230o677k54M285j3659j3533K813O584L183o175
11398A00287N00j164q722o176Q54j026j2741l447M809m68j159K61Q349k966O304
11383H3495P781m353l796n445l033Q17k516R44J836l462K03k227M388J049p215
11368F8466O18J745J984j6229r9j216K019O818R752Q321o379j4293n397j348K859
11353E7621J843m145r1J037J0072L282J423q002k105O531J3807Q438n279o922
11339G7510J172o984o507j449O24j840m352p403j0156n311L712l440j172o222
11325B8182p943n778Q580J2583K75l470N27L52J0274L784m177o077j0598o412
$$ y = [112924, 108932, 105933, 97523, 96385, 110605, 111126, 113792, 121830, 116455, 116354, 124933, 131287, 138395, 136436, 139678, 135740, 122645, 122490, 123720, 117043, 116789, 121074, 107415, 93882, 96695, 103279, 106462, 100287, 100787, 99623, 90901, 84725, 85579, 84553, 71812, 68365, 73174, 72706, 71547, 71808, 80157, 77191, 83495, 91276, 86923, 83127, 77682, 74649, 75466, 72950, 73894, 75730, 72268, 72471, 70244, 74632, 75681, 68466, 69084, 70829, 72813, 56584, 56485, 55269, 57288, 64106, 73858, 82179, 75800, 61507, 56110, 54762, 57621, 59464, 55319, 55228, 56265, 66337, 69619, 71042, 63040, 60935, 67466, 81273, 89711, 84432, 77510, 78682, 71698, 65191, 63742, 64366, 62526, 58174, 50771, 40615, 35304, 39016, 35576, 34404, 28182, 20239, 14461, 23041, 35624, 35899, 32429, 32956, 33308, 43582, 47366, 43189, 37112, 26514, 20102]
11311B0102J383K249M311J5979j741p751n710k505R98J2561K522k95k298m282
11297C5523L210j480q52j990O384l151l491K777M50n695j800K82O597M311m455
11282C6620j13l751l474J0532N506j8438K705O574p352M507K40o273o662r744
11268A0877N470J014J91M920L748m332k932j2450o812N218P49k62J0743M280Q971
11253B9393o733j1756O53Q208j345k201j105n09L82p378k019o414q92O175Q575
11238A3034O939j0841j1214J451J2318n26M492J981m868q910P896j819J281q494
11224B720k68O77K729P836k734j3549o087M319M353J077J267P653P205l218M870
11209A8850l282j700J456k287k403K150N883j705r263n779Q98k159n70M393N769
$$ y = [20102, 21485, 23734, 28045, 44024, 42283, 34532, 28822, 26317, 27315, 39876, 42398, 42103, 39805, 35523, 38733, 37253, 36401, 34411, 40795, 37644, 34153, 36930, 37380, 31685, 29885, 30167, 36764, 41075, 36620, 36507, 32756, 29282, 39814, 45320, 26882, 29587, 36161, 28809, 33316, 33556, 27283, 20621, 10877, 16347, 17361, 17552, 22472, 26220, 21888, 18956, 6506, -306, 4912, 5661, 5399, 16142, 20422, 29393, 22660, 10904, 11557, 19765, 18420, 16219, 15114, 14605, 14987, 7609, 5590, -824, -1716, 4459, 13034, 19973, 9132, -2082, -631, 11687, 11161, 15653, 17634, 12766, 3856, 11752, 9933, 11214, 2720, 2452, 3129, 5858, 13694, 10960, -2589, -8676, -4357, -4, 1073, 2340, 9993, 17198, 13980, 18850, 15568, 13868, 15324, 13037, 10634, 12784, 18667, 16962, 7699, 1920, 2818, 659, 89, 4482, 10251]
11194A0251l707o300q196P092L928N253R077l236m180L104M22M018J1805L766
11180C3097k919J635j138j471q154k860l448P471J1822L388j4575m723J2828N505
11166C6458J0463P126j108M007R788J5258J3753J2452J5125Q430j904r803j842
11153A18203n419m988p082n736j533r406o117o304R889M842L073M454J177P247
11139A02300l844k456N961K419j821l247L825p71R011J9694O631p324k948J0951
11125A38381M882q424j8064k332o220q817N973M046r905R09M053r0n123m319n484
11110H9466p620m439r41l401K104L661j590L355O469J6931R429l497L774L335
11096A17036j0503j1193k3446k4066q600P501J1382j2787j1828p296o505j522
$$ y = [10251, 6544, 244, -7952, -860, 3068, 8321, 17398, 14162, 9982, 13086, 13508, 17526, 29331, 33097, 30178, 31813, 30675, 29204, 21050, 18190, 14742, 22213, 34035, 37423, 22848, 18125, 30953, 36458, 46921, 54047, 52939, 56946, 66734, 81992, 95745, 108197, 123322, 131752, 129848, 120045, 118203, 112784, 107796, 100714, 94978, 93445, 84039, 77922, 71618, 81507, 86349, 89422, 93876, 95053, 102300, 98456, 96000, 101961, 104380, 102559, 99312, 103137, 102366, 111377, 131071, 137702, 130378, 127430, 138381, 143263, 134839, 116775, 114443, 108223, 99406, 105379, 109425, 99520, 100429, 104482, 104392, 99269, 94950, 89466, 81846, 77407, 76466, 73065, 75169, 78830, 77240, 80595, 87064, 103995, 113424, 109927, 113701, 117036, 106533, 95340, 71894, 47828, 39228, 46729, 58111, 45324, 33496, 26200, 19695, 18173]
11084A8173k772M870N10l937k076k066j740N674O448L854j608m041K948N42m76
11069B4303q206j1799J608N851J45K13p344J249M176l407K534l689l464n733K165
11054a398p92R64O922O409j000q730j466k912J367j983m644K945K212n222J179
11039f149J6461O934k201j5041j0043J2554P586J1285Q44l730n09L133j2400m342
11025D382O80j17l207J837l679l902P859J409o230O432K439m231m171M701n876
11010a674N024j058k480L889L239P93j363j15o337J2041O512j0344Q02K911j921
10995I919o125L476J918k698l996j011L626M054l770l457J983p303k144j71k955
10980h654K580J861L502k185l674J773J2243K381L786m338q011N449j996l627
$$ y = [18173, 15401, 20271, 20781, 16844, 14768, 12702, 10962, 16636, 23084, 26938, 25330, 21289, 24237, 24779, 24303, 16097, 4298, 5906, 11757, 11902, 12115, 4771, 6020, 10196, 6789, 9323, 5634, 2170, -3563, -1398, -2190, -1226, 5696, 12105, 11105, 2375, 909, -2003, -636, -2619, -7263, -4318, -2106, -7328, -6149, 10312, 17246, 15045, 4, -10039, 2515, 10101, 21386, 22230, 18500, 17991, 21124, 8724, 4382, 5062, 4945, 1738, 3575, -104, -4006, 3853, 5262, -968, 5464, 7903, 3672, -499, 4202, -1674, 3350, 2292, -188, 3701, 6940, 7733, 6370, 6255, -82, 11959, 18471, 8127, 8929, 11840, 9919, 3794, 7270, 9188, 6490, 2494, 1483, 5109, 9163, 5393, 1936, 3919, -3384, -5528, -5699, -8654, -6074, -4213, -711, -2896, -6570, -4797, 7446, 9827, 13613, 9275, 1264, 6713, 4717, 1090]
10966A090L985K009o967l745p19o482n918K251N988J0352M052k678l371J1730
10952A1577N228m96n66j6817q550O79L199j411K400P417j018O240n376m021L380
10937A865N519q832p211K697Q375Q46p243n584P424L745m226l10j935l572Q81
10922g561K799n11Q07Q52l005L403L20P658L453J997k06j52j851q490o022l135
10906i644p452L551Q361k788n467n465l73N695J0611Q694k92M141m243n423n165
10891e259M322N762J847j688l643j61J670J0100o051j1818j0624q267P921J018
10877a4871N602m67k03K006R265L812L584L796m027j689N66q015r138K932M335
10862b512k740l127J1996K579o53k207K259K936K83K459l836p458n031n422L299
$$ y = [1090, 5075, 7084, 117, -3628, -4347, -10829, -16747, -14496, -8508, 1844, 5896, 3218, -153, 11577, 16805, 16309, 15743, -1074, -9624, -8945, -5746, -7157, -4757, 2660, 1642, 7882, 2506, -1515, 1865, 7384, -1448, -8659, -5962, 2413, 3259, -3984, -9568, -2144, 1601, -2625, -2935, -4870, -8442, -7561, -4762, -5273, -4466, -3614, -6619, -3216, -2896, 4762, 8215, 10212, 10006, 9854, 8003, -487, -6509, -9644, -17096, -13545, -5184, -7972, -13439, -18904, -19277, -13582, -2971, 5723, 5431, 9572, 5329, -94, -5259, -937, 4825, 6672, 4984, 1341, 1180, 2850, 12950, 6899, -4919, -15543, -23810, -15889, -14871, -9269, -9736, -9939, -7933, 1332, 5144, 8728, 12524, 8497, 6808, 7374, -641, -9779, -6847, -2512, -5252, -8379, 3617, 6196, 5543, 3336, 5595, 8531, 8814, 11273, 7437, -21, -5052, -10474, -7175]
10847g175L001M719m514J203L211j0074l079P466Q764L81K016N636o375j921N946
10832I205J84n221j1671q140L044J192k913j54J0590N279K312K837O304L558q714
10817G692l401L709K350r592q204J0979O255k586n539l913j33O179N880p85j9283
10802a0392j9186P440N731o64O165R597K65j2173k396L353j273o036L296Q661
10788g612Q092M912L238J664k119m216L067Q32M418o5m121k87r047n518Q604M181
10772F023j202J010K992r835j4273N903J1359N839N728j0308k0243m824R618J2211
10758bj635j1232l32O522J036K356O473O116M977l012o782m813K445lo292N010
10742H32K040J324j093m859n672N267M497l302Q88P346M70K396l251q876m145
$$ y = [-7175, -4174, 545, -3969, -2766, 445, -9629, -12708, -5242, 3522, 3903, 5919, 11555, 5180, 3259, 9205, 9389, 4168, -7503, -15643, -12599, -11407, -14320, -14474, -3884, 1395, 3707, 6544, 12848, 16406, 7692, 4291, 8000, 10350, 758, -7446, 3533, 9788, 7202, 1663, -2250, -2383, 3796, 9676, 8891, -10392, -29578, -22138, -16407, -17071, -10906, -1309, -1044, -13217, -15613, -12260, -13533, -19569, -16273, -7612, 480, 5392, 8630, 10294, 8175, 3959, 7026, 7858, 12276, 12211, 8090, 7803, -1244, -6762, 1842, 6023, 4821, 5831, 8823, -1012, -15285, -9382, 1977, 7816, 13544, 3236, -17007, -21831, -12213, -2, -1637, -12869, -13201, -6679, -5643, -3287, 3186, 9302, 14279, 11267, 4485, -328, 2117, 2114, -4178, 832, 2872, 4196, 3103, -1756, -7428, -2161, 2336, -966, -78, 7268, 7738, 10134, 6883, -1993, -6138]
10727f138J086L632l626j807l139j539m88M062Q317J463j63k659l597N564L632
10712D600j0730r00J047j1308p552k22m483Q8R543O701O825m076q13K621K44n631
10696a4046o264n483N322J1149J143L060O085N180o78j931J497n113r2m067P411
10681C173O01J023L148N743l668k650L897M435q744P91L556m997o213J449P786
10666I330j855J1355j455j9477K142Q720M330j543l240l385O333k390j798l626
10652C441r603J737J1089l215m64m74k410N343J1333O742m815j2232j0299O61
10638c166r54L247K671o711j978O268qL88r899j626M111k62J399J4819L036j4274
10622b939q02J968m473l849J307L297J654J006o841J3326J4607q427j1192j857
$$ y = [-6138, -5052, -1420, -5046, -6853, -9992, -11531, -12019, -7957, 360, 1823, 1660, -999, -4596, 968, 4600, -6130, -7030, -5983, -17291, -24843, -25065, -29548, -29460, -19917, -13216, -6391, -10467, -11280, -8659, -8415, -14046, -20310, -25793, -20471, -9322, -8179, -5119, 966, 6146, 5468, 3537, 5034, -79, -171, -4238, 3173, 3774, 4797, 7945, 13688, 10020, 7370, 11267, 15702, 6958, 7749, 11305, 6308, 95, 1544, 9330, 7475, 18830, 17375, -2102, 40, 8760, 13090, 11547, 8307, 4922, 11255, 8865, 7067, 3441, -6162, -4425, 6664, 3449, 2985, 2511, 101, 5444, 16777, 23519, 18704, 6472, -3827, -3166, -4120, -873, 1798, -4913, -6891, -623, -631, -243, -10142, -11768, -7657, -7919, -6520, 8299, 11335, -2939, -3741, -1773, -6246, -10095, -8788, -5491, -3837, -2831, -9672, 3654, 18261, 9834, -1358, -3215]
10608c215k346r91L27K529m090o96L946k282P167o715l803L443K830j654L326
10593b224K401P29m710j4642M680R515L1n102L28L409M492r68k710n496m28P041
10577c654k185k813k390J807N119q052l898R483p51J575J088Q22m399j772m51
10562a0471l813O07J1924Q321m58m251L036K80P24k071n945j817o461o148k999
10547a9542K863Q862P719L583J256l642l047j719o155q317J6227K179o558J147
10533e144l343k618J208O55m399o205q061M412K014j440R18O883J2099J362l112
10518d771k566M60j11N181M539n558m381j848l538J3266j799n122k94l829j760
10503a2131Q259J303m068K251m154r561j352R637J3243M27j214q632K378M568
$$ y = [-3215, -5561, -6552, -6225, -3696, -7786, -8482, -4536, -6818, 349, -6366, -10169, -6726, -3896, -5550, -2224, 177, 906, -3804, -18446, -13766, -4251, -4220, -9322, -8994, -5585, -1093, -2061, -4771, -10267, -10695, -3654, -5839, -8652, -11042, -9235, -4116, -12168, -16066, -6583, -7334, -5759, -4671, -3849, -8248, -10020, -10471, -14284, -13677, -1753, 6568, 6110, 1859, 4895, 5175, 5899, 3828, -2117, -3934, -10395, -16543, -19542, -16679, -7817, -98, 3485, 4741, 1099, -1948, -3667, -9822, -18139, -1912, 267, -6291, -5144, -8487, -11105, -9897, -9242, -13641, -19846, -27907, -23495, -21481, -22921, -22003, -15120, -3021, -1659, -4771, -7337, -6877, -6988, -1807, 2732, -2826, -7207, -9055, -12593, 673, -1126, -6248, -6542, -10371, -12131, -3872, -2569, -6637, -4386, -8540, -18101, -19453, -9816, 3427, 3854, 2640, -5992, -3614, 954]
10489I54o425o807m66O972k698Q68M739K955n438O7M610K072L20J838n407n874
10473g720J858j409l512o925k210K142L201m740P184J691k202q953L20R473M991
10458f811m235j483O843P027P602q845r419P120N892n327m69L996l241k054l802
10443g206p25M698R696J907k840p139o082J114k737j192K429J356O56r33o94l885
10427a1577Q270N336o590l657j1247J946J1187R424K15l539j499l269J226O100
10413B326K850j483q017J500J324j197j656N475K277n235K2L42l881k418J57P215
10397c99k311l134N96J536k791K930O542j784L36J1530J349m606J129K383j0426
10382B880j2473m898O826l777P99p91l176Q796J1902l733k679r89M927K491O391
$$ y = [954, -5471, -12278, -12744, -5772, -8470, -7602, -2863, 92, -5346, -5279, -669, 1403, 1723, 3561, -1846, -7720, -5862, -7271, -10783, -17708, -19918, -17776, -14575, -19315, -12131, -10440, -12642, -21595, -21275, -11802, -6811, -11046, -12529, -5686, 1341, 8943, 98, -9321, -2201, 3691, -1636, -2105, 1891, -1350, -3404, -7206, -7931, -3233, 6463, 8370, 5530, -1609, -7691, -6577, -9314, -10506, -8077, -6721, -6065, -6998, -7692, -11577, -3307, 2029, -4561, -8218, -19465, -17519, -6332, 3092, 3307, -232, -1731, -5000, -3774, 2326, 5176, 3693, -4324, -2824, -1500, -2697, -4353, 1122, 3399, -1836, -1814, -1472, -5353, -7771, -7614, -399, -2710, -5844, -5248, -3712, -6503, -3573, 2969, 1185, 1521, 13051, 14400, 9794, 10923, 13306, 2880, -9593, -14491, -7665, -11442, -10643, -11434, -14610, -5814, 6088, 2355, -324, -1313, 3614, 6105, 12496]
10367A2496L10j3419k413l090L144M742j814k28L384L434q660l879J915M230J382
10352A534K341L011j348p03n189K114K165l876j1085n272m317K839O937J0914
10338F5J502n27J646O571K04k253o293j705m32N418O616r11n190l596J112M117
10322F344m839p379m900O316M963O94R817P552j767j158n96j1109p808l942L997
10307c815J3197N846j1574j2521m879M520l409n199L369Q435J705N733L166l859
10293G15j30o90M72O438L583n359j4181n973N113Q319J3044q449k661k569l181
10278e509K323K028k060k574q662k538K286J231k343Oj739P866R983J057m746
10263c391j150P768N769n976p671n332M095Q260p85K854k827n486q923M507M481
$$ y = [12496, 12806, -613, -3026, -6116, -2972, 1770, -44, -272, 3112, 6546, -2114, -5993, -4078, 152, 1534, 3875, 6886, 5538, 4835, -354, 1760, 3925, 49, -11036, -16308, -20625, -17786, -10849, 65, 1567, 1040, 2686, 9257, 9461, 7208, 915, -790, -1222, 4196, 10812, 9901, 4711, 1115, 2227, 6344, 1505, -5874, -10774, -4458, 505, 1199, 11016, 18568, 16801, 15643, 15047, 3938, -3870, -7812, -3815, 9382, 15228, 3654, -8867, -13746, -9226, -12635, -17834, -14465, -6030, -4325, 1408, 4574, 715, 585, -105, 367, 6805, 10388, 5029, -9152, -15125, -10012, -1693, 11351, 2902, 241, -2328, -5509, -3186, -1158, -3218, -5792, -14454, -16992, -14706, -13475, -15818, -15812, -17551, -9685, 298, 1355, -3391, -4541, 3227, 8996, 3020, -4651, -9983, -5888, 2372, 1587, 4441, 1614, -3872, -12795, -8288, -3807]
10248c807J0696K209L779J040o500m544N87m29q692J770Q560L05l250k978O551
10233E297m96q647l449j907k92M334l206M005N399K67K080k486K284P836m411
10218F608n936j0911p489m591J3073J0427k795q811j1118J0591K1670N543q716
10205G545o576j990M853K811j968p75r003k226J0659l989M48N679l179p419k824
10190g954q88q823K537L430L739L19J1100N680p304j252o269o246l015J059k091
10175a5978n112O281M804N005R749R200Q800l340j9625j2853K443J0438L219j0108
10161g077m199M704N048P392m62K87o298j519j949j078O154M647L214j1034o467
10146h637L028j400j0560l64M594m977l692O554Q029O313n357j900l712k971L563
$$ y = [-3807, 6889, 9098, 12877, 13917, 7417, 2873, 3460, 3031, -5661, -3891, 4669, 4974, 1724, -1254, 5297, 4801, -3846, -7295, -9202, -9494, -5160, -8366, -4361, 1038, 1305, 3385, 899, 3183, 11019, 6608, 672, -10239, -17728, -22319, -9246, 1181, -1614, -10425, -21543, -10952, 10718, 16261, 7545, 969, -1021, 3832, 6643, 4675, 3900, -5103, -7329, 3330, -659, -211, 5468, 2289, -5130, -7954, -8842, -17665, -15128, -11698, -7959, -7640, 3460, 9140, 1836, 584, -5685, -11931, -14946, -13887, -15978, -21090, -14809, -10005, -5000, 4749, 13949, 22749, 19409, -216, -13069, -10626, -188, 3031, -7077, -11276, -6572, -1524, 5868, 5406, 5693, -605, -2124, -4073, -5151, 1003, 5650, 8864, -2170, -8637, -5609, -7009, -17569, -17933, -13339, -18316, -22008, -15454, -7425, -1112, -6469, -8369, -12081, -15052, -11489]
10131a1489k608q248J451K168l362N977k533K925Q759j180j1179J330O872L795
10117g322L548r67R65K092O799o777p491J142N495m956j2448p595J15J05J396
10102b5899K997R50Q014L609p22Q088Q35M559R521n052O390O73J79l343j0876
10087g7j0275K854J4856L452m247p561J436q951q020m902L105J400O208J5399
10073D677J1091n744j0163n65N958Q351o230k982q850r778M625L969J335J805
10059b501j160j733L562o806J0084K996N63k928j0100m896n25O528L062p871m989
10044a6714m034Q523J3022P357m033n079L18p951K307Q57K213q89K09Q926j977
10029C055q711O867K798J937J942n264M068N474L210p781k101l216M301R70q547
$$ y = [-11489, -14097, -22345, -20894, -18726, -22088, -16111, -18644, -15719, -6960, -8140, -19319, -17989, -11117, -7322, -3774, -4741, -3776, -1684, 5115, -1662, -9153, -8011, -2516, -7472, -19920, -27515, -27400, -27295, -25899, -22902, -21952, -13938, -10329, -11051, -2963, -2128, 2431, 11952, 6900, 13290, 13963, 14142, 10799, -77, -10352, -7498, 7358, 10810, 6563, -998, 438, -8513, -16533, -21435, -18330, -16930, -10722, 4677, 15768, 10024, -139, -704, 5254, 13605, 7375, 4393, -4457, -14235, -9610, -5641, -4306, -2501, -3661, -5394, -1832, -8638, 1446, 4442, 5005, 2077, -8023, -12919, -13444, -6916, -3854, -11725, -16714, -20748, -12225, 797, 8154, 4121, -958, -640, -8591, -6284, -5427, -3214, -4103, -3894, 5032, 3055, -5656, 1211, 4009, 5946, 7888, 2624, 6692, 12166, 15376, 7595, 5494, 2278, 6579, 7549, -998]
10014i98q283p874O213K831P8M139K244j162l166K522j766j099L815O78o617j770
9998a0215J4342L848n543j0108m658m996m021J762Q320R37P348j763J302K16M125
9983H96j726j6780l079J4888N088l787N894O414N879j039k047j1212k473M553
9969A469J329j3839P676J5539M270j3491n86R96M57Q94p6q620r254l085N545J0397
9953c79l153m487L15N814p142P375J8182k786o906j0396M582Q911l18p062m140
9938a590O892N474n39j988o58k139P657l810p79p27m146l181j2674j36J3646R34
9922B236Q71M712j032o556K139J367n25J467M715k813r333P998O982j0883j4699
9907a3354l603L644O925P806N927j057j1031j53j475N560L046J326l870J092j714
$$ y = [-998, -9281, -17155, -10942, -8111, -8033, -3894, -1650, -2812, -5978, -3456, -5222, -6321, -2506, -1828, -8445, -10215, 4127, 7975, 2432, -7676, -12334, -17330, -21351, -19589, -11269, -10332, -2984, -4747, -3445, -3229, 896, -830, -17610, -20689, -5801, -713, -4500, 1394, 7808, 13687, 12648, 10601, -611, -3084, 1469, 2798, -11041, -3365, 12174, 16444, 2953, 2367, 3363, 3820, 4714, 4638, -3982, -13236, -16321, -10776, -379, -3532, -8019, -7704, -1890, -9032, -1657, 16525, 13739, 6833, -3563, 1019, 9930, 9612, 2550, -1590, 5302, 10776, 10237, 8249, 7591, 5452, 13109, 9299, 8520, 7793, 3647, 466, -12208, -12344, 1302, 2236, 3107, 7819, 6787, 231, 2370, 3737, 3212, 4679, 9394, 6581, -2752, 5246, 12228, 1345, -13354, -16957, -13313, -6388, 1418, 7345, 6288, -4743, -4896, -6371, -811, 2235, 3561, -309, 783, -931]
9892i31m756r5J783m437j025j309o76j245Q438O229q98q718m985N520M270m311
9876g146N345Q239m876n112r33P775N749O42o309j1070o024K255L626j3340k251
9861b3430J2599J1054l978o570L976n957p726N834J482k301K444K553J580p401
9847a5841R575J2253J452j438j2006j2921r879K62M797J0687N389K188J719M242
9833D79J1085Q904q022n345o795m155n852J736N409o575m955L999R158M25q319
9818h823k494N576L815j544q719n140P65r79J1857K150n186p324j0340L997O656
9803a5733O045L793j805L465N743J1282J4p831l11R50M749j108q199K485N318
9788H857m389J358L804J386J644n5N971r120o438n071Q97l61m509J2496M368m675
$$ y = [-931, -5687, -5782, -3999, -8436, -9461, -10770, -11446, -12691, -4253, 1976, 1078, -7640, -12625, -7105, -2835, -7146, -1801, 6438, 1562, -3550, -4483, 3292, 9041, 9683, 3374, -7696, -13720, -11465, -7839, -21179, -23430, -10831, 223, -3755, -10325, -6349, -12306, -20032, -14198, -12716, -15017, -12573, -10020, -8440, -15841, -6266, 5987, 7439, 6001, -6005, -18926, -28805, -28543, -23746, -13059, -7670, -5482, -3763, 479, 11564, 20468, 12446, 7101, 306, -3849, -9701, -7965, -2556, -9131, -14086, -10087, -929, -504, -8823, -11317, -5741, -1926, -3470, -12189, -17329, -16564, -17543, -5686, -3536, -8722, -16046, -26386, -22389, -15733, -9688, -5895, -7700, -4235, 1508, 12790, 12804, 4973, 4662, 5612, 10361, 9253, 1054, 3539, 8857, 4468, 5826, 9630, 11016, 12660, 12605, 18576, 9456, 3018, -2053, -1156, -1517, -6026, 6470, 10838, 6163]
9772F163p275k190o034L735L823P354p270L955L591j66l115k854j032N24R119
9757H328P46l447J177l825Q34K523l049j493j6832q84R598m259l524Q174J0793
9742D860K739n671l381n316n053P179O021K626r88l74K674o984l748p570p981
9727b0967R421J4464L464n190n014M602M537k62L668o810J402r49K088k825m988
9712c359N252j025j2113j226J0786L06J213k833p361Q740n197J965K850J534k184
9697b652q69l899O509P515o829q084l818J0122Q808J063j267o426j0761P0Q735
9682a783m465Q00K478r72O950O519P238n755r792m031p152k994J2793P602m305
9667C131K300J4947J3474J4904J7244K1442M976j7884l3278l035o761j4696j2151
$$ y = [6163, -1112, -3302, -9336, -5601, -1778, 5576, -1694, 2261, 5852, 5686, 2571, -283, -1315, -791, 8328, 9074, 5627, 6804, 2979, 3813, 6336, 3287, 1794, -15038, -15922, -6324, -10583, -14107, -5933, 4860, 7599, 1928, -1453, -6769, -11822, -4643, 1378, 4004, 3016, 2642, 5316, -1668, -5416, -12986, -20967, -11546, 2918, 6382, 1192, -3822, 780, 5317, 5055, 8723, 1913, 3315, 2366, 4454, 1629, -3359, 1893, 868, -11245, -12471, -1685, -1379, -166, -2999, -10360, -1620, -6817, -4852, -2002, -468, -2652, -3521, -7420, -911, 6604, -225, -8309, -12127, -2005, 6803, 7866, 6599, 173, -10588, -10518, -1783, -6248, -5448, -2970, -3942, 3008, 9527, 16765, 11010, 1218, -2813, -9965, -12959, -166, 7436, 3131, 5431, 20378, 33852, 48756, 66000, 87442, 92418, 74534, 41256, 38221, 31460, 16764, 4613]
9654D613j3115K627M049O581J556m517l93q017K05K778q298J159Q109M18q029
9639a0274p141n448k194P431J6177M700o371n450j195P592J6371l069j1768K786
9625B147K023K054p796k212j20p544n279n38J4036M308n279R289p074n028O357
9610f56l900q61N408M30K679p384L907O107n442l529N251j34q16P302K69j3454
9594d823L823l08M388J800l179r22L604l069l955j0062k158L401L429m057N450
9579f638J552j634J980K167j747q810L509N367J619M510J1915J2575K228j2801
9565A5792j5642k60j791K140K993p844M21N999M273k179M10K162N879K282N523
9550B0158j1947k339J928o330k990m841o154k106J0102k957P378Q441m873j5887
$$ y = [4613, -8502, -5875, -1826, 4755, 6311, 1794, 1401, -6616, -6411, -3633, -11931, -10772, -2663, -2245, -10274, -17415, -22863, -25057, -17626, -1449, 3251, -3120, -8570, -9765, -2173, 14198, 11129, -639, 2147, 4170, 6224, -1572, -3784, -3904, -11448, -16727, -17265, -3229, 1079, -4200, 5089, -1985, -7013, -656, -4556, -5417, -9, 421, 3100, -4284, -377, 5730, 288, -3241, 2010, 1876, 1060, 8362, 8631, -4823, -1000, -1308, 3080, 4880, 1701, 779, 4383, 1314, -2641, -12703, -14861, -11460, -8031, -12088, -6638, -5086, -6720, -4740, -2573, -4320, -13130, -9621, -4254, -2635, 1875, 13790, 26365, 28593, 15792, 150, -110, -1901, 239, 3232, -4612, -4191, 1808, 6081, 3902, 4312, 6474, 12353, 14635, 20158, 8211, 5872, 7800, 1470, -1520, -6361, -12515, -14621, -4519, -7476, -98, 8343, 3470, -12417]
9536a2417k137Q091Q988J0888J319J505l155j720L74j1477p222m269j3732k757
9522b7721L704J1986J1458P654L180j2129m481k80o350J3253K416p118J0425P950
9508A3947n63J017k107j211L993n63L610o496o577M758J393k423K240K655r598
9493D075l058n02q03N113M722J22n451k132O328j018k332k906n133O422J258r222
9477d517k31j115j510Q96K580J1975N164n911k330N007O87k562l070m024l986
9462b947n402L834l748r64K265J811R582K943P542M152J753m662l951j266K130
9447A3072o155k660P174o469q481J3828J3770q674q511K42L329M72L345r58r663
9432C661p461K907K142n031J0843N673K07j0909j781m446j154J949M441Q870J0719
$$ y = [-12417, -14554, -6463, 2525, 13413, 14732, 16237, 13082, 11362, 11736, 259, -6963, -11232, -24964, -27721, -24017, -12031, -573, 7081, 10261, -1868, -6349, -6629, -12979, 274, 2690, -4428, 5997, 13947, 13384, 14401, 12294, 11083, 15076, 14513, 18123, 11627, 5050, 9808, 11201, 8778, 11018, 13673, 4075, 1017, 515, -288, 4825, 9547, 9669, 4218, 2086, 8414, 7396, 5064, 2158, -2975, 3447, 4705, -4517, -4748, -5863, -7373, -6477, -3897, 8078, 13242, 7331, 5001, 10008, 10695, 8133, 5063, 1039, -2947, -8349, -4515, -8263, -9227, -6962, -5151, 4431, 7374, 14916, 19068, 20821, 16159, 12208, 10942, 13072, 6917, 4257, 11431, 4962, -3519, 10309, 24079, 15405, 6894, 7136, 10465, 10937, 14282, 13324, 3661, -3800, -893, 1249, -3782, 7061, 12734, 12941, 2032, 251, -4195, -5349, -3400, 1041, 9911, 20630]
9417B0630O457N0j683p744q64o231n507J034n115k788M54Q855R014J609o730K80
9401A1721M253P2Q8m32N83K914o367n137m50K821q106k985K714Q513j3779p490
9385a1067l200L876R380R030K057J778l518P32L785k329o338j12k440M723L87
9370F744M773k508j792j356J953N726K438q554p293r790L613K189n031k191J587
9355i492J3614N748j2209m212l530K42Q591K692N130M805K74q457r202M368j873
9340c511M025K17K44j866N321K083j3384J1774J1235p548o650P052o35j871L694
9325A0180P83J0332L044r537K843L521L60r923K30J354q338P119l368n622n373
9310b395J2947Q173q016j927k395p85J915o850p616Q301j650J858J2838L399L395
$$ y = [20630, 27087, 27137, 25454, 17710, 16846, 10615, 5108, 6142, 1027, -1761, -1307, 7548, 16562, 18171, 11441, 11721, 15974, 16046, 16134, 15702, 16285, 19199, 12832, 7695, 7245, 10066, 1960, -1025, 1689, 10202, -3577, -11067, -14267, -10391, -1011, 8019, 10076, 11854, 8336, 9068, 12853, 10524, 4186, 4074, 1634, 6357, 6744, 11517, 9009, 7217, 5861, 7814, 13540, 15978, 7424, 131, -9659, -6046, -3857, -8888, -11079, -9492, 4122, 9870, -2339, -6551, -10081, -9839, -1248, 1444, 6574, 11379, 11653, 3196, -6006, -1638, -3511, 514, 731, 975, -891, 4430, 6513, -6871, 4903, 16138, 8590, 1940, 8992, 8357, 6486, 10180, 10963, 21295, 24339, 14802, 17645, 21166, 21526, 11603, 11833, 13187, 4849, 11968, 8600, 2978, -2395, 10552, 18725, 10709, 8782, 6387, 5602, 7517, 667, -6949, 1352, -298, 1560, 14398, 17797, 21192]
9295B1192K961m690O557O519K563M451K332j1859p000m54k432O336j39M31q076
9280A8692r389J475J0119M720k622o980Q62O879J8O348m822j0095M83l030k653
9265A0005k418N487p472J993O300K158j592q385L838Q323j915j2204l274J0641
9251A1485k396J589K114j744Q027m744p074M45P182J253j958L825j793n050j678
9236I483k390m417P039O121R252P34L49o647K827J356l883P78M751n254q434j0738
9220I27j6155m801O461L688J4544p978j3818J965M599O711K968j657P162O789
9206A1405k589K810m953O98j19J0094R450P66J374M876o549p953R205K352m779
9191B6088r12M124L365k572K293J145l753n927m99O611R849O121M463J0627J1069
$$ y = [21192, 24153, 19463, 26020, 32539, 35102, 39553, 41885, 30026, 23026, 22572, 20140, 26476, 26337, 26768, 18692, 9303, 10778, 20897, 25617, 22995, 16015, 16877, 23756, 23774, 30122, 25300, 15205, 15688, 12658, 10005, 7587, 13074, 5602, 7595, 13895, 16053, 14461, 6076, 9914, 18237, 16322, 4118, 844, 11485, 9089, 10678, 12792, 11048, 19075, 14331, 7257, 7702, 14884, 16137, 14179, 18004, 16211, 11161, 9483, 7093, 2676, 9715, 15836, 25088, 25822, 26171, 19524, 22351, 23707, 19824, 20602, 25353, 20099, 11665, 927, -15228, -20029, -13568, -9880, 4664, -3314, -17132, -15167, -10568, -3857, -889, -2546, 4616, 11405, 8816, 11626, 6673, 7371, 7252, 17346, 26796, 27562, 28936, 33812, 27263, 19310, 28515, 30867, 26088, 25176, 29300, 32665, 30093, 32386, 33531, 29778, 23851, 23352, 29963, 39812, 45933, 50396, 61023, 72092]
9176G2092J0792J3862O675o919J4990J6661J1428J0661J7512K5164L2289N0834
9164B76041O2201Q1836R9321J31305J51001J64424J70513J53004J21396N8368
9154A469410J508o4409j15734j61322j71725j56838j42341j16481q8601p7782
9144C75685n4081m0940l2875l3375l0874k2462j6070l318M224J0278J3335J0631
9132A80158J2157J3001J6980K2550M0149M9630P5574R4420J36311K04234L28924
9121A174088N01074O98671P67759M58339k18759p34510q04480n78057l53953k22183
9111F87989j34879r9899p8768n4123l4588l7844l0325k0760k4846j8140j5336
9100A38481j4472n683m145J419l5m735j3050k408O356N474j373k92q267O635N670
$$ y = [72092, 82884, 96746, 103421, 96502, 111492, 128153, 139581, 150242, 167754, 192918, 225207, 276041, 338242, 420078, 519399, 650704, 801705, 966129, 1136642, 1289646, 1411042, 1469410, 1470918, 1406509, 1290775, 1129453, 957728, 800890, 658549, 542068, 453467, 375685, 321604, 280664, 247789, 214414, 183540, 161078, 145008, 141690, 145914, 156192, 169527, 180158, 192315, 205316, 222296, 244846, 284995, 334625, 410199, 504619, 640930, 845164, 1174088, 1675162, 2373833, 3141592, 3599931, 3381172, 2646662, 1842182, 1264125, 910172, 687989, 553110, 453211, 374443, 320320, 285732, 247888, 217563, 196803, 171957, 153817, 138481, 124009, 118326, 114181, 115600, 115565, 110830, 97780, 95372, 101728, 107202, 105829, 105537, 97270, 103905, 109575]
9085A09575q144n266k579N572P510J1254o036p675N028M402j324J088R899M128
9071A27432J3115K0825l33m428j2277l4089n3022n9378k8358P493J7445J4455
9059H880r557j9706p606M349k08p537M287N021M625J9763J0751R774N46j4757
9045H625j0481j2371j1108K268P31M816J2206P854L661m535K940J0031o2m562
9031A0013R472P071m613J211P024N000J3658J7760J7442J7953R217N596J3762
9018A30566O466M698J7419R558j6943k3975j9601q804j200J4045K2130Q207r456
9005A33110m575L978p940j6131j1399j2397j0606q591o489q187q37o504q435r085
8991B5912q189r431o047J468P527P341n856m988j0573n996L550K221R536J4877
$$ y = [109575, 101431, 96165, 93586, 99158, 106668, 117922, 111886, 104211, 109239, 113641, 112317, 113405, 123304, 127432, 140547, 161372, 161039, 156611, 144334, 110245, 57223, -2155, -30513, -23020, -5575, 8880, -677, -20383, -27989, -23640, -23848, -31385, -27098, -22077, -17452, 2311, 13062, 22836, 23382, 8625, -1856, -14227, -25335, -23067, -22336, -17520, -5314, 2540, 6201, 1666, 4606, 14637, 14575, 10013, 19485, 26556, 21943, 23154, 30178, 35178, 48836, 66596, 84038, 101991, 111208, 116804, 130566, 137032, 141730, 159149, 168707, 151764, 127789, 108188, 99384, 98184, 112229, 134359, 142566, 133110, 128535, 132513, 124573, 108442, 97043, 84646, 74040, 65449, 58960, 50773, 49936, 43432, 34997, 25912, 17723, 8292, 2245, 3713, 11240, 18581, 12725, 7737, -2836, -8832, -5282, -3061, 6475, 21352]
8977B1352M873p370k031J30n136J169J779n305o264O766k411j0088l298R352P419
8962A0937N711K0930J5846J5484k380j0668j1201j1616p992m701N885P014k380
8949C0869k69R290Q749L338q911J641J5190L599j0951k450P399J2250J1053o014
8935G4783k136q860L324l289J48j1685j6271p007m687J2611J7152J2198M369L877
8921G4527N102M480Q619M751J117M517K488Q128J3781k110j6202k4015k1061r762
8907E4360M565P996N4M79n633j0724j8084n143J0932P504m705q79j856k870J0738
8892D6734J2691K4038M7659O2680N6013M7186M0093O0345R8445R4260k0144j17964
8880D52036j34751j04309n9698m909M5793O5500N1267K1252p752K023K363J0547
$$ y = [21352, 26225, 18855, 16824, 16954, 11818, 12987, 14766, 9461, 3197, 9963, 7552, -2536, -5834, 3518, 10937, 16648, 37578, 53424, 68908, 66528, 55860, 44659, 33043, 25051, 20350, 26235, 33249, 30869, 30600, 39890, 48639, 51977, 43066, 44707, 59897, 63496, 52545, 50095, 57494, 69744, 80797, 74783, 72647, 63787, 67111, 63822, 63970, 52285, 36014, 29007, 24320, 36931, 54083, 66281, 70650, 74527, 79629, 84109, 92728, 97479, 98596, 103113, 105601, 113729, 127510, 125400, 109198, 85183, 64122, 54360, 58925, 66921, 66975, 67454, 61821, 51097, 33013, 27870, 38802, 46306, 41601, 40722, 38866, 35996, 46734, 59425, 83463, 131122, 193802, 249815, 297001, 337094, 397439, 495884, 590144, 570000, 452036, 317285, 212976, 153278, 148369, 194162, 259662, 310929, 332181, 324429, 326452, 328815, 339362]
8868C39362K1972L6545l10l1557m0113k3411l710P880m213P723P364J0154K5164
8855C52850O532m662l260j368J49Q069P691J911j780M928o315j3815n665n525
8841C39740j2405q662L352J7695K0156J7966K8344P936J8004K1245K1703K5979
8829E01053J6316J0766J6231J1383J5266K1771L0759J7629K5346K8768L6515L2526
8817G64329K5205J6774J2991Q628L771K5569K4845J9669J6566K5979L1969M3610
8805A019905P1478Q9924Q8549P6995P0091P7146O6786N2413N9918O2472P4193
8794A809870R5985J21220J49830J66304J81072J89978K29394K70993K91311L32103
8784C838060L73282L97090M01115M08996M48328N62319P11519Q76495J058647
$$ y = [339362, 361334, 397879, 397569, 366012, 325899, 302488, 298778, 306658, 302445, 310168, 317532, 327686, 352850, 359382, 354720, 351460, 350092, 350241, 358310, 366001, 367912, 366132, 371060, 364745, 350930, 345265, 339740, 327335, 318673, 322025, 339720, 359876, 377842, 406186, 414122, 432126, 453371, 475074, 501053, 517369, 528135, 544366, 555749, 571015, 592786, 623545, 641174, 666520, 695288, 731803, 764329, 789534, 806308, 819299, 827927, 831698, 857267, 882112, 901781, 918347, 944326, 976295, 1019905, 1091383, 1181307, 1269856, 1346851, 1416942, 1494088, 1560874, 1613287, 1673205, 1735677, 1809870, 1905855, 2027075, 2176905, 2343209, 2524281, 2714259, 2943653, 3214646, 3505957, 3838060, 4211342, 4608432, 5009547, 5418543, 5866871, 6429190, 7140709, 8017204, 9075851]
8775I075851J257256J520819J839886K234998K738342L284060L765378M200726
8767B9917316M838067O094770Q422402J2115102J7506703K5536547L7851240N5864907
8759A98147054P6384472Q4663212N8375455o436994o9157743q9626937p3627535
8752A78720984m9585305l1796360k0942674j4395548j0193442p419563n688283
8745C8699809m666647l964783l392313l059798k933952k721307k341983j910511
8737A3708515j554709j277428j096539r78587q71973p48681o34650n04234m02222
8728E639492l42420l32201l07626k77569k59428k39800k02997j87729j89748j90527
8718C109447j94808j78515j61796j49682j37840j13069q8569r1267q8069o1739
$$ y = [9075851, 10333107, 11853926, 13693812, 15928810, 18667152, 21951212, 25716590, 29917316, 34755383, 40850153, 49272555, 61387657, 78894360, 104430907, 142282147, 198147054, 274531526, 359194738, 417570193, 411133199, 341975456, 252348519, 178720984, 129135679, 97339319, 76396645, 62001097, 51807655, 44388092, 38699809, 34033162, 30068379, 26676066, 23616268, 20682316, 17961009, 15619026, 13708515, 12153806, 10876378, 9779839, 8801252, 7929279, 7180598, 6545948, 6041714, 5639492, 5297072, 4964871, 4657245, 4379676, 4120248, 3880448, 3677451, 3489722, 3299974, 3109447, 2914639, 2736124, 2574328, 2424646, 2286806, 2173737, 2085168, 1993901, 1905832, 1844093]
8708A844093l8993m0832o7692o7029p2663o7634o4171n0443o1568o2029n9586
8697A191453n9914m4063k4557j1503k0724l1833k3683k1860k3720k8863k8069
8686H72664k5257k9740j5779n710k545o904j5629j8667j4682o640o280j0976j8588
8673F95267k2225k8088k6472l0817k6069l0657j7287p999j2486j1121q279j6529
8661D57238j7606j0288r383j0352r864J5178J6932K737n565l088N119o606k1557
8648D02895j2333j1606o021K822m239o766k2930l0466j6592K3423O4929P8700
8636D61816O6768M0467l3406j03085j30156q3561m315O0561J01497P6032L5643
8625D88261M1545K8566J0453J0953L406O396K678P541K359R769L6410O9020Q5449
$$ y = [1844093, 1805100, 1764268, 1696576, 1629547, 1556884, 1489250, 1425079, 1374636, 1313068, 1251039, 1191453, 1131539, 1087476, 1062919, 1051416, 1030692, 998859, 975176, 953316, 929596, 900733, 872664, 847407, 817667, 801888, 796178, 793633, 786729, 771100, 752433, 737751, 731111, 724831, 713855, 695267, 673042, 644954, 618482, 587665, 561596, 530939, 513652, 505653, 493167, 482046, 473767, 457238, 439632, 429344, 419961, 409609, 399745, 414923, 431855, 434592, 429027, 425939, 431058, 424452, 402895, 390562, 378956, 372935, 375757, 371518, 364752, 341822, 311356, 294764, 318187, 383116, 461816, 528584, 569051, 535645, 432560, 302404, 218843, 214528, 275089, 376586, 452618, 488261, 529806, 558372, 568825, 579778, 583184, 589580, 592258, 599799, 602158, 611927, 648337, 717357, 802806]
8612H02806P2084r204j00778j23507q0704m1413k5090k6789l0607m7642m0774
8601C48382j6605m461J830P548r045q933j331k858j3021r570o374m504j72Q531
8587B89417J1959l324j2663o249j1341O207j251J3063L4102P1163Q5125J50806
8575F27014J71846P1590j11880j93546j50141q3229l9598k3432k3050j6174j158
8564B28242m644m664Q243J3577o491j7022j9350j3702q934r473m966O199J1727
8551A78742q69J2576J2291J831k64l419J313l239q597q412j704J858q928m944
8537A68235Q380L734M356M036n962N51K182o297j4119j6666r44Q036l154q2l805
8522A48481J015j732j2105n215m527o142N439J0064J5296K0002R131m31r852m562
$$ y = [802806, 874890, 865686, 764908, 641401, 560697, 519284, 494194, 467405, 436798, 389156, 348382, 331777, 327316, 329146, 336694, 327649, 318716, 317385, 314527, 301506, 291936, 285562, 281058, 280886, 289417, 301376, 298052, 285389, 279140, 267799, 274006, 272755, 285818, 319920, 391083, 476208, 627014, 798860, 870450, 758570, 565024, 414883, 331654, 292056, 268624, 245574, 229400, 228242, 223598, 218934, 227177, 240754, 234263, 217241, 197891, 184189, 175255, 165782, 160816, 167015, 178742, 177873, 190449, 202740, 204571, 204307, 200888, 202201, 198962, 190365, 181953, 180249, 182107, 173179, 168235, 176615, 180349, 184705, 188741, 182779, 183330, 185512, 179215, 165096, 148430, 147486, 155522, 152368, 152286, 148481, 149496, 147764, 135659, 130444, 125917, 119775, 125214, 135278, 150574, 170576, 179707, 179276, 169424, 164862]
8508A64862M670K725l769j084j097L167m079j0797j897L742K18K86n269m294l722
8493A43662q722j9144j1292N067J838M622l731j792N542K205k978M132J3911Q753
8479A42073o675J769j0355m089l505q55N161J2387P234k857o084k0000m012n220
8465A04972o355m854J3026J1323Q346N284R652N787k336j0994q944j5906P415
8452A16416R178N250J004k8274m0125m4800l9763j7379l12J2736J1912J575k402
8439a4984m692l283J187M096J2382J3552O982J2483j982r638m430O910J5735J1530
8425D5848N911K55L005q300j3613j364k590l503l340j540J457L275N877J0151
8411D1529M44j898O476K339o354o221m621J250N027K900j224l671j905r60L813
$$ y = [164862, 169532, 172257, 168488, 167404, 166307, 169474, 165395, 154598, 152701, 156443, 156661, 156947, 151678, 147384, 143662, 134940, 115796, 104504, 109571, 111409, 116031, 112300, 110508, 116050, 118255, 115277, 119409, 133320, 142073, 135398, 137167, 126812, 122723, 119218, 118363, 123524, 135911, 143145, 140288, 134204, 114204, 110192, 104972, 98617, 93763, 106789, 118112, 126458, 131742, 141394, 147181, 144845, 133851, 124907, 109001, 116416, 125594, 130844, 131848, 103574, 63449, 18649, -21114, -38493, -38805, -26069, -14157, -12582, -14984, -19676, -22959, -21772, -17676, -5294, 8258, 15240, 27723, 25741, 16103, 11673, 18583, 34318, 45848, 51759, 52014, 55019, 46719, 33106, 31742, 29152, 25649, 22309, 20769, 22226, 25501, 31378, 41529, 41973, 40075, 46551, 48890, 42536, 36315, 31694, 32944, 37971, 40871, 39647, 35976, 34071, 33111, 36924]
8396C6924r607p841J3372J4545K624J378Q759J523L208j533k95P413L432Q371
8382H2273R498q091N083N722O222J05Q731P533O153R549j082n413M186O023J0504
8367A46996J1434L0011K5750L4442N1500P0220Q4116R9680J17966J57958J75050
8356A005123J77409J44128J01151M0561j1066q6934j39846j66276j82390j45246
8346G36614j20478j14171q8516n9769m5623l8934k3400j9868k4650j9878k1281
8335A60046j4038j5964k1215j4710q455j001p149j0385n897l435p110o574j0647
8322C3466L060Q668J347P482L184l687J314j0819r546K016O386M678K165N139
8308E4853N400l070j0805K035m445Q28M314J293J013P780M882p337O680K3865
$$ y = [36924, 27317, 19476, 32848, 47393, 50017, 51395, 60154, 61677, 64885, 63352, 63057, 70470, 73902, 82273, 91771, 83680, 88763, 94485, 100707, 100812, 109543, 117076, 123229, 132778, 131696, 126283, 130469, 136492, 146996, 158430, 188441, 214191, 248633, 300133, 370353, 454469, 554149, 672115, 830073, 1005123, 1182532, 1326660, 1427811, 1468372, 1457306, 1370372, 1230526, 1064250, 881860, 736614, 616136, 501965, 413449, 353680, 308057, 269123, 245723, 225855, 201205, 181327, 160046, 146008, 130044, 108829, 94119, 85664, 84663, 77514, 67129, 61232, 57797, 50687, 44113, 33466, 36526, 45194, 46541, 54023, 57207, 53520, 54834, 44015, 34469, 36485, 42871, 47549, 49714, 54853, 60253, 57183, 46378, 48413, 43968, 44796, 49110, 50403, 51416, 59196, 64078, 56741, 63421, 87286]
8294H7286K730j3379j6100n622p005j0802l425q529m907L685m277L984Q651l147
8280B9143q818L195P857n897o899J1724K900Q61J019l28k358l65J2456O924r789
8265D1625l854j1042k0264j344K092O218m26J1607K365k35k804k249p686O565
8251B0568r55J816m420j3562M376J308M700Q710P15J822J2412K799r472p861L031
8236B5987r50o222n290p932o214J751j372j615P304M491l878k86N624N443m321
8221A2520o09n071N296M415k752K999K606K121L768R096Q300o143j802R871k03
8206D4412n901o394o459q089k484K358k466j903K724R304o608o429P172r566l102
8191F569L318J732M388l357N376K042L402j381j1218k929M345Q486J4728n85l486
$$ y = [87286, 90016, 76637, 60537, 54915, 47910, 37108, 33683, 25154, 20247, 23932, 19655, 23639, 32290, 29143, 20325, 23520, 31377, 25480, 18581, 30305, 33205, 34066, 35085, 34757, 32399, 32034, 44490, 51414, 41625, 37771, 26729, 6465, 5121, 7213, 13431, 13005, 24612, 26977, 26742, 23938, 21689, 14003, 20568, 19613, 21429, 17009, 3447, 7823, 9131, 13831, 22541, 23256, 25078, 37490, 40289, 30817, 22956, 25987, 25037, 18815, 13525, 5593, -621, 1130, -242, -1857, 5447, 9938, 6060, 5774, 11398, 16841, 12520, 11911, 6840, 12136, 16551, 13799, 16798, 19404, 21525, 25293, 34389, 42689, 36546, 34744, 44615, 44412, 38511, 32117, 25658, 17569, 15085, 17443, 14977, 13074, 15798, 25102, 18494, 12065, 19237, 9671, 6569, 9887, 11619, 16007, 12650, 18026, 20068, 23470, 22089, 10871, 7942, 12287, 20773, 35501, 34916, 31430]
8176C1430j061m300M552J997K08o879k869l761L250N785n945m449Q594O508O694
8161C9754J785J1256J8095n413j5786j9340o274J124o699l283O400N713k834n943
8147A8555r42l739o42k558Q471J0225L939o96O70q092P502N775n811q265p563
8132A6829j558N259J1817J4356l944o638K091m175L260q029l232P675L243J2214
8118D9168M665p29q972p229j1142j7495M194J2306J317p786Q59j0040L016L250
8104A5382l41P40l704j157P525N905n650k156n274L49O254M098O333L644K266
8089C4214m44k809p219m610l20n267J762P070K496q101J297l67q077k728K592
8074I489j79L538L636J19R694Q984J3608m5j3024m841k860p048J337K3444O728
$$ y = [31430, 30369, 26069, 30621, 32618, 32826, 25947, 23078, 19317, 22567, 28352, 22407, 17958, 26552, 33060, 39754, 41539, 52795, 70890, 65477, 49691, 30351, 24077, 25201, 18502, 15219, 21619, 27332, 24498, 18555, 17613, 13874, 13232, 10674, 19145, 29370, 33309, 32613, 33283, 25191, 32693, 38468, 32657, 24392, 16829, 15271, 20530, 32347, 46703, 42759, 36121, 38212, 34037, 37297, 29268, 26036, 33711, 36954, 49168, 53833, 53104, 44132, 36903, 25761, 8266, 12460, 24766, 26083, 18297, 19156, 9116, 12132, 15382, 15041, 15781, 12077, 10920, 18445, 24350, 18700, 16544, 11270, 11619, 17873, 21971, 28304, 31948, 34214, 33770, 30961, 23742, 19132, 18812, 13545, 15307, 22377, 24873, 16772, 18069, 17702, 9625, 6897, 9489, 9310, 12848, 16484, 16603, 26297, 35281, 48889, 48844, 35820, 30979, 28119, 21071, 22408, 45852, 52580]
8059E2580m896K92P32L458R111P794k964M522K653N556K655K778K197Q65n097
8044H2236K121N971j163J041P497q284r186q07N728n524j530l360l785p096r498
8029E4361O111p057P87J2989l30n200p666m934m513m802J965P949J5059Q183J5256
8014H8158J6484K2489K3930L1097M0074M4545L5370O406l1200n1231m4349k3934
8002A57839j7509j4074o753J0146L1113L4612K9772J2845j6799l9310m4636l0131
7990A07115j5105j1805j6771j6243j730O501N038K011l033j1413Q5M555L996J5294
7976F8495J0037N473J407p923j263M420N666P535J3969K7570L0690J8869J9021
7963B03966k236L233r070k4053k1933j823O304J6931K6204J4834O155k6004l8479
$$ y = [52580, 47684, 47976, 48708, 52166, 61277, 69071, 66107, 70629, 73282, 78838, 81493, 84271, 86468, 87333, 82236, 84357, 90328, 89165, 90206, 97703, 89419, 80233, 79426, 85154, 79630, 78100, 74740, 70955, 63859, 54361, 60472, 53415, 54202, 67191, 66861, 61661, 53995, 49061, 44548, 39746, 41711, 49660, 64719, 72902, 88158, 104642, 127131, 151061, 182158, 222232, 266777, 302147, 308553, 277353, 226122, 181773, 157839, 140330, 126256, 119503, 129649, 160762, 195374, 225146, 237991, 221192, 181882, 137246, 107115, 92010, 80205, 63434, 47191, 45461, 51962, 57000, 59011, 55978, 44565, 44650, 49205, 53201, 68495, 78532, 84005, 85412, 77489, 76226, 80646, 86312, 93847, 107816, 135386, 166076, 184945, 203966, 201730, 204963, 195893, 171840, 149907, 148084, 154388, 171319, 197523, 212357, 218512, 192508, 154029]
7950A54029l9674k5590j4717p123n441o135R46m426m753n249j3960j246m022l177
7936A9462J1551N907j033P835o507j0979n649J0444M661J005Q97J3420J7320N944
7922G4278K238J37o322k469j1093J787o800p351N65N788K019q012n565L302n323
7907C7179j2929k181L017j3150l930K859Q35n755j85k549M947Q050M7p930M413
7892A2738L981o294l664p710o644k464M084P856k672k821K77J3296J4175l356
7878B0782J175l974j456K683n576o450J655r046n75O7k459Q379n456N74K681j24
7862B880J24o347K712J0175J22J5924O141p186j1346k809n976K416P612j597L154
7847A5999N793R07r723r544r973O120M167L696k46M752K867Q715M92l806o766
$$ y = [154029, 114355, 88765, 74048, 66925, 61484, 55349, 56295, 51869, 47116, 41867, 27907, 26661, 22639, 19462, 31013, 36920, 35887, 43722, 37215, 26236, 20587, 31031, 35692, 36697, 37594, 51014, 68334, 74278, 76516, 76653, 70331, 67862, 56769, 58556, 51756, 44405, 44970, 50758, 52777, 44765, 39200, 42502, 37179, 24250, 22069, 25086, 11936, 8006, 10865, 11700, 5945, 5760, 3211, 8158, 16208, 16255, 8325, 12738, 16719, 10425, 6761, -949, -7593, -10057, -5973, 1883, -789, -3610, -3333, 9963, 24138, 20782, 21957, 17983, 16527, 19210, 13634, 7184, 8839, -207, -782, -715, -3174, 5205, -251, 323, 3004, 2880, 3004, -3343, -631, 9544, 9666, 25590, 31731, 24545, 13199, 10390, 4414, 6830, 14442, 12845, 15999, 21792, 22699, 12976, 3432, -6541, -421, 3746, 7442, 7196, 11948, 14815, 23530, 24022, 20216, 13450]
7832A3450m405K828M553m420m093j199N488M125l159o364M581J2002m348n932
7818A3107M553n059n968p052L050J1637k888j0426j587j711k774M605J3109J875
7804A4471L436j244r757k917M307L414n182q535Q034K172J772R62q720K133j976
7789B370j3497r326K629Q385P941O371J2795P933m742k192p542j2085q931L768
7775f123J1890R764K272o618o048k8q429K774N640M630k774j295J391l925n345
7760b224l415N258L551L378K72r62M3n211k866K823N811q3j1855J631L232K534
7744A917J746O409O898m271m833J0534K245p688J724l569m611j398L008J081N186
7729A4378n308J273n087l984P03K236n098L347L716j183M5m731L481K915j1516
$$ y = [13450, 9045, 11873, 16426, 12006, 7913, 6714, 12202, 16327, 13168, 6804, 11385, 23387, 19039, 13107, 17660, 12601, 6633, -419, 2631, 14268, 11380, 954, -633, -2344, -5118, -513, 12596, 14471, 17907, 16663, 6906, 3989, 8296, 11710, 6528, -2007, 6027, 8199, 9971, 10933, 2213, 4346, 2370, -11127, -20453, -17824, -9439, -1498, 4873, 17668, 25601, 20859, 18667, 11125, -960, -9891, -6123, 5767, 15531, 17803, 11185, 5137, 5109, -3320, -546, 5094, 9724, 6950, 5655, 7046, 3121, -2224, -5639, -381, 3170, 6548, 6820, 5858, 5901, 690, -2176, 647, 6458, 6375, -5480, -3849, -617, 1917, 3663, 10072, 16970, 12699, 7866, 18400, 20645, 12957, 14681, 11112, 6501, 5103, 8111, 9192, 14378, 9070, 10343, 5256, 1272, 1975, 4211, -887, 2460, 6176, 4993, 5038, 307, 3788, 6703, -4813]
7714d813p595J0361M210j405O929L529J918J39m432L890J3444o755n251j335p650
7699E184j518M994n577m79p599n87R266M552K897n213j804N39j335o74j294M078
7683E430l031m805N892O10L523P906p937r293M701J5186K232r978P681q01q800
7668H516r513j618J01j046k609J0543J1416n116j3303r200M949P615L889K307
7654F931o565r64M633K665j2783L573P19l307J089J0106O202m043j195K327m368
7639E020p941k034R21L095J0169R833j52n077p026m776r135r767Q117J2530l393
7624C84j222P661M692M996o246j157R529L930k710k516o947p912m500L386j07
7609A261R892J0597l092j845P894m134k1998m738J0011l32n043k069l919M929
$$ y = [-4813, -12408, -2047, 2163, 758, 7687, 11216, 13134, 13273, 8841, 12731, 26175, 19420, 14169, 12834, 5184, 3666, 8660, 3083, 2604, -4995, -5582, 3684, 8236, 11133, 5920, 4116, 4655, 3320, 2646, 1352, 5430, 2399, -2406, 3486, 4096, 7619, 15525, 7588, -1705, 2996, 18182, 20414, 10436, 18117, 17316, 8516, -997, -2615, -2514, -3560, -6169, 4374, 15790, 10674, -2629, -11829, -6880, 735, 4624, 6931, 366, -598, 4035, 6700, -6083, -2510, -1791, -5098, -4009, 6097, 12299, 8256, 7061, 9388, 5020, -2921, -4955, -4034, -939, 9230, 19063, 18911, 13834, 6808, 2032, -7103, -16870, -8753, 3777, 384, -838, 6823, 11515, 16511, 10265, 9108, 18637, 22567, 19857, 17341, 10394, 2482, -2018, 1368, 1261, 11153, 21750, 18658, 16813, 24707, 20573, -1425, -6163, 3848, 3516, -1527, -3596, -7515, -2586]
7595b586J7977R059k323j0698K763M53q338o125l588K200J1242k155r089R48J040
7580G80O006o720j989O856k182k624J64R922J827m201o185K996k82p026p113K377
7564g394L1Q791O77n085Q999O79M712M264r590r032N929M922K467L725r095J283
7548F283r253O249O528n243M304N576r203L537O5m323m008j38Q673K488o253j1338
7532f056k254J0306M58n197j473N066j947L407L450n132P22K364j009N700j323
7517G082k802k186J1317j119j1830R33J0796m189m362M448L199m908p006j859
7503b486K814R400l771j136K408o101r822J759j96L588K200p574K914J1195R907
7488A5099K299r018m174q377m857R187N351p62K554R634L250N333n804o589k803
$$ y = [-2586, 15391, 24450, 22127, 11429, 14192, 14645, 6307, 182, -3406, -1206, 10036, 7881, -1208, -260, 780, 6786, 66, -1923, 4933, 2751, 127, 291, 10213, 12040, 7839, 1654, 4650, 4368, -2658, -9771, -7394, -7363, 1428, 2105, -2980, 6019, 6698, 11410, 15674, 6084, -2948, 2981, 7903, 10370, 14095, 5000, 6283, -2970, 3279, 9807, 4564, 8868, 14444, 5241, 8778, 8843, 4520, 512, 374, 9047, 11535, 5282, -6056, -8310, 1996, 2454, -2743, -4216, 850, -1097, 2310, 5760, 628, 1350, 3714, 2705, 8405, 7082, 4280, 2094, 13411, 12292, 462, 1395, 12191, 8002, 3640, 8088, 11287, 6379, -627, -2486, 328, 9728, 5957, 4821, 7229, 1128, -8694, -6935, -7131, -3543, -1343, -8917, -6003, 5192, 15099, 17398, 8380, 4206, -4171, -9028, 159, 5510, 4748, 7302, 16936, 20186, 25519, 19715, 13126, 10323]
7473A0323N540J395n840p382L58M947J943K765N412j2682o609Q906n188r100M551
7458f61O317n37O905l818j0800m366P511P842N623n769j102r708k604M582l073
7443c658O819l97J444M468J8O922k979N725j422k517m306l282p238q894j72J1167
7427A698J3108O956j4652l244k983k224P251k408n286k555M125J53k736o741L002
7412f536O724K820j981N147J697l815p679P243K660O04k436N45j785P328m48p402
7396B686L655l700n844L336O849k2k538j661o714l129J692N785J071K613o476
7381b397O665l28n8l48o311m414P5M453J139Q443K737M330m182K637J740N838
7365B0019l990q534J209l266l943N634P89j329L399K687k38q932J629k264N587
$$ y = [10323, 15863, 17258, 11418, 4036, 4394, 9341, 11284, 14049, 19461, 6779, 170, 9076, 3888, -5212, -661, 5656, 5119, 12024, 8206, -2594, -6960, 551, 8393, 14016, 8247, 7145, -2563, -5167, -585, -3658, 3161, 2764, 4208, 8676, 8694, 15616, 12637, 18362, 16940, 14423, 10117, 6835, -403, -9297, -9469, 1698, 14806, 21762, 7110, 3866, 883, -1341, 5910, 3502, -1784, -4339, -214, -61, -2797, -9538, -6536, 188, 3008, 1027, 6174, 7871, 4056, -3623, 3620, 6280, 6884, 4448, 4993, 3208, 10536, 10088, 2686, 6341, 2641, -3203, 133, 6982, 6960, 4422, 2761, -3953, -7082, -5390, 395, 1466, 4079, -2397, 4268, 3940, 3882, 3534, -2777, -7191, -7116, -2663, -1524, 6919, 9656, 13986, 9804, 12441, 14181, 20019, 16029, 7495, 8704, 5438, 1495, 7129, 7918, 6589, 9988, 12675, 12437, 3505, 5134, 2870, 8457]
7350H457j894j3044O414O905P857o16l281n478m97L110o141N032l662j2268p066
7335a6172N382J1482Q895o533n380l64N023l113m564k234O031J208m278P828K603
7320E814L010k357N47r27j442p473J27n217q17J2348N863J770j918n47j3051L88
7304c882O641L010O93l972m002N887L572p470J627O962j025o746N351p39l562
7289B345j353L7k021J250J487J0453J2487q917j1945n04k284o493l223l210J865
7274a0026K079N389O965r05J0402K183j3074r561n37K906n1q059P58R215J0234
7259G918L480p752k186Q10K747N879j963m454L570o461r71M992N866j1520n072
7244e117L036M352J00k912r47l558m498O327K519L83k289K936M480j332O850N72
$$ y = [8457, 6563, -6481, -67, 6838, 14695, 14079, 10798, 5320, 4823, 7933, 1792, 6824, 3162, -9106, -16172, -10790, 692, 9587, 3054, -2326, -2690, 2333, -780, -5344, -7578, -1547, -339, -4617, 3211, 5814, 8824, 6467, 7014, 6087, 4645, -2828, -2701, -7918, -8735, 3613, 9476, 11246, 9328, 8781, -4270, -3882, 2759, 5769, 6462, 2490, -1512, 4375, 7947, 477, 2104, 9066, 8041, 1295, 6646, 5907, 2345, 992, 1029, -992, 258, 1745, 12198, 24685, 15768, 3823, 3319, 1035, -5458, -8681, -11891, -10026, -7947, -2558, 4407, 3502, 13904, 16087, 3013, -6548, -7085, -4179, -4230, -12289, -11531, -2316, 7918, 11398, 3646, 1460, 2270, 5017, 10896, 8933, 4479, 8049, 1588, 617, 5609, 11475, -45, -5117, -2081, 2271, 2371, -541, -1488, -5046, -9544, -3217, -698, -315, -2604, 332, 4812, 3480, 10330, 10902]
7228A0902j927p293r040P84L284L748O887L845J903J628L791p362l025P81q609
7213B97L430J900o082k814Q518R986N021j5530j4005m439m294k450M273J0444
7199e745Q289J791l726p544M220R241M406j295J551l50n866o258L085K825l515
7184A109n962N244P862M333r304q999O454L104M088q05j0244j2945J031J9598
7170D564J7624M497j4088o149M168J968p519Q14n415j167R60l928p46l269j683
7155i369J9j67K277O160M23q263o222R822N186L645o622o172l660l078J0071N567
7139c83R633j06k518l024r439L861J0304q824j97R714L264M046n267j1541p514
7124g991k903K860J2146R445o304m241o709J515K769j238q32l443p768P868P48
$$ y = [10902, 8975, 1682, -7358, -6574, -3290, 458, 7345, 11190, 13093, 14721, 18512, 11150, 8125, 8906, 297, 3727, 5627, -455, -3269, 5249, 15235, 20256, 4726, -9279, -13718, -18012, -20462, -16189, -5745, 2544, 4335, 609, -6935, -2715, 6526, 10932, 9637, 11188, 10838, 4972, -1286, 1799, 4624, 1109, -4853, 391, 8253, 12586, 3282, -5717, 737, 3841, 7929, 7124, -3120, -16065, -15034, 4564, 22188, 26685, 12597, 6448, 10616, 12584, 5065, 5879, 464, -703, 257, -3671, -4417, -7686, -9369, -9350, -9517, -7240, -1080, -657, -8920, -15142, -5320, -134, 3511, -3111, -9283, -12943, -16021, -5950, -383, 9250, 9144, 6626, 3602, -5837, -1976, 8328, -496, -693, 9021, 12285, 16331, 11064, -477, -7991, -10894, -8034, 4112, 13557, 7253, 3012, -3697, -2182, 587, -651, -1483, -4926, -12694, -4826, -4078]
7109d078P841N282j4556j893J7230J1907p508k980r823j0961R787J0361j832k188
7095F589Q884M743P57m671j2752N138J123r358q381K103P145q99o096Q79r47L549
7079b194M55k061j941O720N781p44j061n081N311N273L460n216L235N645m489
7064A3093k445J622J1824p356r945k089o9P850M809l351l518j261N357J147n561
7049A0107O700l496j0223j4225m526J917M419N711J1640K596M00m450o580J555
7035A545n777l505Q074J4225k7m704j699K881N506k375J20o20j437j624j540O306
7019A5349L819r439k057j997L412L282j2041K767j07q737K781Q503k059j3366
7005i890L479l708M17J585J0050K591o968p834O165J3667Q38n528m819n520n662
$$ y = [-4078, 3763, 9045, -5511, -7404, 9826, 21733, 14225, 11245, 1422, -9539, 248, 10609, 8777, 6589, 15473, 20216, 20973, 16302, 3550, 8688, 9811, 453, -7928, -5825, 1320, 421, -5675, -4796, -5743, -2194, -1739, -3800, -5741, 979, 6760, 6016, 4955, -126, 5185, 10458, 13918, 8702, 11937, 17582, 13093, 10648, 12270, 24094, 16738, 6793, 4704, 4635, 12485, 17294, 13943, 10425, 9164, 14521, 15668, 10107, 16807, 13311, 3088, -11137, -15663, -13746, -9327, -3616, 8024, 10620, 11020, 6570, -10, 1545, -4232, -7737, 337, 14562, 14535, 9831, 8132, 11013, 16519, 14144, 14264, 13644, 12207, 10583, 9043, 15349, 19168, 9729, 7672, 5675, 9087, 12369, 328, 3095, 2988, -5749, -2968, 5535, 3476, -9890, -6411, -10119, -9702, -8117, 1933, 4524, -2444, -10278, -4113, 9554, 10392, 4864, 45, -5475, -11137]
6990a1137N933J6405J1973j208m508q192r06o079j2337j0262k226O262Q268O133
6976a881M090m076k695N427M952l424k528k639P718n592n210N487j195R66k032
6961b632j739n618R625K128M252L136l822o774j530K645M033n629M838J2116j765
6946A3264o68l449r466n905M227J2185k486m841Q852k432j3983j556L781O21M47
6931a409k208q277j776Q757m279K856J1860l589ON424n29P025j773r874m639p493
6915i918o486J0841Q114M445K972n975o93J794r514p361k951J3215P9p180O801
6900a817J0294p904o238L486O194l738q320J996l88J580K953P677J1453L907p312
6885A3823j058j847m249O22l497p101k533K396n528J927J1445J0592l683j965
$$ y = [-11137, -5204, 11201, 23174, 21966, 17458, 9266, 8360, 2281, -10056, -20318, -22544, -16282, -8014, -1881, 2209, -1867, -4562, 865, 5817, 2393, -135, -2774, 4944, -648, -5858, -371, -1566, -600, -2632, -4371, -9989, -364, 1764, 6016, 9152, 5330, -1444, -2974, -329, 3704, -1925, 2913, 15029, 13264, 12596, 9147, -319, -6224, -1997, 10188, 7702, 2861, 11713, 9281, -4702, -6258, -2477, -1856, -1409, -3617, -11894, -13670, -4913, -9192, -6336, 5524, 1935, 1941, 7365, 6836, 13861, 12088, 2214, -2425, -9918, -16404, -5563, 2551, 6996, 9968, 3993, 3300, 5094, -4420, -11781, -14732, -1517, -1438, -8618, -1817, 8477, 573, -5665, -2179, 4015, 277, -8043, -6047, -6435, -4855, -1902, 5775, 17228, 21135, 13823, 12765, 10918, 6669, 7291, 3794, -3307, -5840, -3444, -8972, -7045, 4400, 14992, 11309, 9344]
6871I344l892q099j88q445K6J008J0629N568R15m921l041j130M46k949K422l591
6855e898k889m37k251J8m552n698M101O982L103R029O999l171k179j97p857O056
6839A159l908q036P841J0601k197p422N823K570j304k45L4k657M938j868L294
6824H623M206o878k363l801j878m877l781n407j901J791R420m11J094j601N001
6809b763L292K884n122o85m465J870j414l63r200L978L228l920K703L017K527
6794d433o14k093J381N072j254J443L196n206L177J882k683M402j150n315N118
6779B923J2830j211m924q287p541L433M774p66N85l321j1442K115q846Q01M798
6764a4079M295O667M408j102j137O320l320r073r673o378M713O405R13Q037J3177
$$ y = [9344, 5452, -2647, -2835, -11280, -11254, -10246, 383, 5951, 6866, 1945, -1096, -2226, -1780, -4729, -2307, -5898, -8787, -9224, -11475, -11457, -16009, -21707, -17606, -10624, -7521, 1508, 8507, 5336, 3157, 2960, -4897, 1159, -2749, -10785, -2944, 7657, 5460, -1962, 3861, 6431, 5127, 4882, 4916, 2259, 7197, 5329, 8623, 12829, 5951, 3588, -213, -2091, -6968, -10749, -16156, -18057, -16266, -6846, -7257, -6163, -7764, -2763, 529, 3413, -1709, -2394, -6859, -4989, -6403, -6766, -15966, -11988, -8760, -12680, -9977, -6960, -4433, -5047, -7140, -5759, -687, -1941, -498, 2698, -2508, 669, 2551, -132, 4270, 3120, -2195, 2923, 15753, 14542, 9618, 1331, -6210, -2777, 1997, 1231, 1816, -1505, -12947, -10832, -19678, -18877, -14079, -9784, -3117, 1291, 189, -948, 5372, 2052, -7021, -16694, -23072, -18359, -11954, -11041, -3004, 10173]
6749A0173p839m929m559p38J859L741Q625J178l028J63o68j543m820n43J55M809
6733B036j414j370o839m055Q638P926O366k684N920J253l708j312N020l711j1048
6718A018j404K405J294O780o02l392M498n702j680l992o284o207N607J374m984
6703a1271n975O492Q449J0651K812J1n121k266k701L677J3619P538p242j6659
6689B014j0069n059L368k802j84o281Q819J2514P934J0954L659j1571p824O875
6675A2347m313q305j1007J359n273q540J1963K1466L442l610j929p797p4k550
6661b821o104P805j21j1606K151J685K352o072n141L215m32N81J1238j202n440
6646i912m78j728j925l431O337J1688J0260N86r829J404n491m552O680K254m116
$$ y = [10173, 2334, -2595, -7154, -7892, -6033, -2292, 6333, 7511, 4483, 4646, 3978, 2435, -2385, -2928, -2773, 2036, 622, -748, -7587, -11642, -3004, 4922, 11288, 8604, 14524, 15777, 12069, 10757, 15777, 12066, 1018, -386, 2019, 3313, 10093, 9491, 6099, 10597, 4895, 3215, -777, -7061, -13268, -7661, -6287, -11271, -17246, -10754, -2305, 8346, 11158, 11169, 6048, 3782, 1081, 4758, 18377, 25915, 18673, 2014, -8055, -13114, -9746, -12548, -12732, -19013, -10194, 2320, 10254, 21208, 24867, 13296, 5472, 12347, 8034, -271, -11278, -9919, -15192, -23732, -11769, 9697, 13139, 9529, 7600, -197, -271, -2821, -8925, -1120, -1241, -12847, -10696, -9011, -6659, -12731, -17872, -14657, -15089, -14508, -3270, -4472, -9912, -10390, -12118, -14043, -17474, -11137, 551, 10811, 11397, 1568, 2972, -2519, -7071, -391, 1863, -2253]
6631b253j0649L52l564J033R859J3808J837m561j947K02M909N984J678r247j0706
6616c265r674j785J812J3664j252n145j193L388J111n77j1969o060J8611J3012
6602A0678o229r129M060L179M199K095o251K173k197j781l003j060L153j365K132
6587F54J116j1255l21J0780K883k708q564o191K826M214P741L345K895k093J462
6572F784k286l973k789L288J905l636K494M843l268n536l820J294K634p33l007
6557e806q63N673N13k579j335K027k734k769L821N058r305j908J1588l060n458
6542g137k0M225k456q82J3320J320n537J619j846m273O268O624l533o135J292
6527B849k904l374l93l454j472m708n316K221k18K558Q635R462M451L191j888
$$ y = [-2253, -12902, -12550, -16114, -15081, -5222, 8586, 10423, 5862, 3915, 4117, 9026, 15010, 16688, 7441, -3265, -12939, -14724, -12912, 752, -500, -5645, -6838, -3450, -2339, -2916, -14885, -20945, -2334, 10678, 4449, -4680, -620, 2559, 6758, 8853, 2602, 4775, 2578, 797, -2206, -3266, -113, -1478, 654, 1770, -9485, -9806, 974, 3857, 1149, -7415, -13606, -10780, -6566, 1175, 4520, 7415, 5322, 6784, 4498, 525, -2264, 1024, 2929, -707, 1787, 6630, 3362, -2174, -5994, -4700, -2066, -2799, -5806, -6669, -996, -483, -3062, -4397, -2370, -5104, -7873, -4052, 1006, -8299, -10207, 1381, -1679, -7137, -7157, -2932, -5388, -6270, 7050, 8370, 2833, 4452, 2606, -1667, 4601, 11225, 7692, 1557, 2849, -55, -3429, -3822, -7276, -8748, -13456, -18772, -16551, -16769, -14211, -5576, 3886, 8337, 11528, 9640]
6512I640j5569j1569J2095J0263L796j1739j4154P14P204M349L916k458l757P46
6498f523N419n800k67N331j993J1365J726j408j025P23K002o81K514l281j991
6483F111r272m673M553O388l335K087l81k01j090j737N026j0327M0P470m720p682
6467a1743M997L219J336N32N218n897m805L770n42l34k951o69K500P111k414j943
6451b615o276j030l365l035r49N158J149J459M324N596N245Q32o059o792L490
6436b868K434n054j2708l629l33N314J3102L356l258J029R177L577o429j11K02
6421C801l397J000J1655O0p666j0967N577L686R771j344q499k382k442J1833j457
6406I229k803j256J803L088O577n744o643j622k753n082m175k131m87n02P584
$$ y = [9640, -5929, -17498, -5403, 4860, 8656, -3083, -17237, -16523, -9319, -4970, -1054, -3512, -7269, -6523, -1104, -6904, -7171, -1840, -3833, 7532, 9258, 7850, 6825, 7548, 9550, 8869, 11383, 8102, 6111, -3161, -7834, -3281, 3107, -228, 1859, 1478, 1277, 187, -1550, 3476, -6851, -6811, 659, -4061, -11743, -6746, -3527, -2191, -1659, 3559, -2338, -7143, -3373, -3915, -4249, -7200, -7869, -5369, 1742, -672, -2615, -8891, -9921, -13286, -16321, -17270, -12112, -10963, -9504, -5180, 416, 5661, 6493, 434, -6358, -2868, -434, -5488, -18196, -21825, -22158, -16844, -3742, -386, -3644, -2615, 6562, 10139, 3710, 3599, 3801, 404, 1404, 13059, 13119, 5453, -5514, 63, 3749, 13520, 12176, 3677, 1295, -1147, 10686, 9229, 6426, 5170, 6973, 10061, 16638, 10894, 4251, 2629, -124, -5206, -9381, -11512, -11999, -12501, -4917]
6391d917K552m521r443Q551J902l024P477K195n643r507k813J4087N844j228p134
6376e622l626m076J7348J1754q252j5370K149Q38n043k364J535P419M027m51j988
6361a722k967N079M195k163K496J780Q086K437l594k433J47n246p741l32J378
6346f00L011L923k904p214O37L784L514P132j195l874p797l422m189k721J0978
6331i37j709n065P895j270M378J647J357m729P97l714m899N454N155R33O113R82
6315A2388N07j215q959q769l119l696M121N651M384N697n622p849o68K368J858
6300b923M765M174j723l755p699o805K422N927L02K414o950P959Q957l739o959
6285c633O85j4183N100L861n81O905M023K92p883j0676o501K069j876L384Q609
$$ y = [-4917, -2365, -6886, -16329, -7778, -5876, -8900, -1423, 772, -4871, -14378, -17191, -3104, 2740, 1512, -5622, -9248, -13324, 4024, 15778, 7526, -7844, -5695, -4857, -9900, -12264, -10729, -3310, 717, 266, -1722, -4689, 390, 4585, 2422, 4918, 6698, 14784, 17221, 13627, 11194, 11341, 6095, -1646, -1978, -600, 2411, 6334, 3430, -3784, -3147, 637, 4151, 11283, 10088, 6214, -1583, -5005, -9194, -11915, -937, -2646, -7711, 184, -1086, 3292, 4939, 6296, 1567, 2364, -1350, -6249, -795, 4360, 5293, 11406, 12388, 12895, 11680, 2721, -6048, -9167, -12863, -8742, -3091, 1293, 6990, 1368, -6481, -7149, -4781, -2923, 1842, 6016, 4293, 538, -7161, -13966, -11544, -5617, -5315, -2901, -9851, -1892, 7065, 3326, -3633, -2948, -17131, -12031, -8170, -8751, -1846, 2177, 2469, -5414, -16090, -22591, -20522, -22398, -19014, -10405]
6270a0405J342M703Q491q76m717n255j541R05O846m397n66N842j345L441j056
6255A412k026r947o424N214k285O611L222q119R750K574l501O47P378n87L656
6240G575n921j2674p348Q083K326j1101Q972N488l706M751L177K518j046M094
6226E188m822q131O667N530l392j7149M674J575J766R536J444m172r847M086K239
6211d808M791l590P73j743M02k680n141K475P246N627q553l520O066m205M999
6196a861L383R526O029j182k691p00J131m434m815Q077k968L282l175P555N118
6181B2275m894k821M38o632K650N51q701j1107m258n426K668O108M608N701j60
6166A000k390O905L026m880L161N619p523M251P431j0330j2282N442J384m453
$$ y = [-10405, -9063, -4360, 4131, 3255, -1462, -6717, -8258, -7353, -507, -4904, -5470, 372, -973, 2468, 1412, -614, -10561, -16985, -11771, -14056, -7445, -4223, -12342, -2592, -18, -3519, -2872, 4506, 3919, 7575, 1654, -11020, -18368, -10285, -7959, -19060, -10088, -4600, -8306, -3555, -378, 2140, 1094, 5188, 366, -7765, -1098, 4432, 1040, -16109, -11435, -9860, -8094, 1442, 2886, -1286, -11133, -7047, -4808, -17, -3607, -2834, -4577, -4175, -6855, -11996, -9521, -2275, 3352, -5201, -8721, -2655, -6860, -1861, 1522, 11048, 17077, 15895, 13204, 12504, 13635, 9201, 4386, 12463, 9495, 12777, 9602, 17157, 22275, 17381, 14560, 14998, 8366, 11016, 11567, 2866, -8241, -12499, -17925, -15257, -9149, -4541, 1160, 1000, -1390, 5515, 8541, 3661, 6822, 12441, 4918, 9169, 16600, 6270, -6012, -570, 814, -3639]
6152c639l277L655R618O383K978j5120M121n93m635L402l971J743k498N370K932
6137F469j164O744n724n555K325j615L132r31l619p255j117J636N088o597q00
6122h983N795J164M44j0834k870J1088N820l471p031j320O110N375p83R66p018
6107e548o519M185L810M083J2913m3j3067j1235j612O288Q251O895L998q793j2117
6092h511o63j98N181k626m851L197N946j656p644l594O443L969n437j933R880
6077b497J57K967j0238o08p60P069Q223n80K107N123n925l557Q32n041o720j3054
6061b2502J098M806p4m111P986J3942M713o049k579P310j1177r084Q762N901o57
6046a715J39M28o787q776J518k760M625L89k072O382N063J500N275n10r060o81
$$ y = [-3639, -6916, -3261, 6357, 12740, 15718, 598, 4719, 4126, -509, 2893, -1078, 665, -1833, 3537, 6469, 5305, 12049, 6325, 770, 3095, 1480, 4612, 3681, 62, -7193, -8310, -6674, -1586, -8183, -8983, -3188, -2024, -1580, -12414, -15284, -4196, 1624, -1847, -8878, -10198, -4088, 1287, 504, 1470, -5548, -12067, -7882, -4072, 11, 12924, 12881, -186, -11421, -13033, -6745, 1506, 8401, 12399, 3606, -8511, -9174, -9372, -4191, -6817, -11668, -8471, -2525, -4181, -11825, -15419, -8976, -5007, -10444, -12377, -2497, -2340, 627, -9611, -10219, -10979, -3910, 4313, 3733, 5840, 10963, 5038, 1481, 2313, -2728, -9448, -22502, -21404, -16598, -16672, -20783, -12797, 1145, 5858, -191, -2770, 4540, -6637, -15721, -6959, -1058, -1715, -1576, -1148, -7935, -16711, -15193, -17953, -13328, -12939, -15011, -8629, -3566, -2066, 3209, 2699, -6361, -7042]
6030g042N113N768M154N35O632j912r068j5004k038R465J089N85N455R897m930
6015H699m729l680n028J212K574K470L383j848k887o472N707j310l904K38J8982
6000A3407K140m571r329o360k69N95p008L926Q870m651p29k239j0773l282J7344
5985b929K120r92J2849R87o087l947k723j456k687l766n136k549J3450P493Q759
5970A3386m172o134n20k713O876l965j40L102l510j690j439j1030j7764O268J6923
5955f522L867q89j908k445K040j607R763L411M229M426J087q04P95l194m617q473
5939h41k914L034J711j0292p79K372N169j41j2609L13K901J2902O983L407j2009
5924g93p291k907l005K268J785n91k502J570Q634M16P94J386q859p094m456m422
$$ y = [-7042, -1929, 3839, 7993, 8528, 15160, 13248, 4180, -10824, -12862, -3397, -2308, -1723, 3732, 13629, 8699, 3970, 290, -4738, -3526, -952, 1518, 4901, 3053, 166, -6306, -599, -1909, -5813, -5575, 13407, 15547, 10976, 1647, -4713, -4982, -4387, -11395, -7469, 1401, -3250, -3979, -6218, -16991, -20273, -2929, -809, -1801, 11048, 12035, 5948, 2001, -722, -2178, -4865, -8631, -13767, -16316, -2866, 4627, 13386, 9214, 3080, 2560, -153, 6723, 2758, 2618, 5720, 2210, 520, -919, -11949, -29713, -23445, -6522, -2655, -3544, -5452, -7897, -5857, -7464, 2299, 5710, 9939, 14365, 15452, 14648, 15443, 12249, 7632, -841, -3755, -721, 990, -9302, -10081, -7709, -2540, -2681, -15290, -14977, -12076, 826, 7809, 11216, -793, -8084, -10991, -13996, -11728, -9943, -10534, -13036, -11466, -2832, -2416, -1622, -236, -9095, -16189, -20645, -25067]
5908b5067N025K669K176K76O265R176N579j2165R73m482j265O855P369o20O604
5893I368M947p996k2368m062M467J1708o76j251Q710J2370M137j1634q717l509
5879d506K706j800n2m569M151Q124k74K376M043P445n235q010r364q548M044J767
5863g702M048O577O513K143q94l527j2926m655R723j458M31j736m752j1804M044
5848a5975P136M192J0653O952n267l182p609l218P662J2727j380p837m687N751
5834E918K18p322k992Q87j522N214Q022J582L125r04l151o029o637L287O026O349
5818A2071q25J457R523J235j1110q228j1227j149k698M847L66n291k12K063m725
5803a3903j990N083J0138J536j098j986O496o066m915j767J1241K581k9j625L026
$$ y = [-25067, -20042, -17373, -15197, -14921, -8656, 520, 6099, -6066, -5093, -9575, -10840, -3985, 3384, 2764, 9368, 14315, 6319, -16049, -20111, -15644, -3936, -4612, -5863, 2847, 15217, 19354, 7720, -997, -4506, -1800, -3600, -3652, -8221, -4070, 4054, 3780, 6156, 10199, 17644, 12409, 4399, -4965, -13513, -9469, -7702, -3654, 2923, 9436, 11579, 10685, 7158, -5768, -10423, -700, -2158, -1727, -3463, -8215, -20019, -15975, -8839, -4647, 6006, 12958, 7691, 4509, -3100, -6318, 1344, 14071, 12691, 4854, 167, 5918, 6136, -1186, -4178, -3291, -4813, 401, 8423, 10005, 13130, 12226, 9075, 3046, -3591, -304, 5722, 12071, 11246, 12703, 22226, 23461, 12351, 4123, -7104, -8253, -10951, -6104, -5738, -11029, -11241, -9178, -13903, -15893, -10810, -672, 864, -234, -2220, 4276, -1790, -6705, -8472, 2769, 5350, 5321, 3696, 6722]
5788F722r87P156m819r438k68j020R458L373j6047j6782R812p62m801l278N165
5773a6516M130K531N655Q428N994p603k924K243m37j772q649j786l140L859N612
5758d375N278L550o279m673p151K208j809k543O354j230m23k733J842M583L76
5743g025P363P431M869j554L533j1981q949j829j825P185K531k55J0587K61j245
5728I097J768k777p856L676K611q190N899Q552l873O77K047k043p002K651J504
5713F741J927Q852P42j2295j2964l228l206M966m104j1162o961J0780J0485L087
5699f340l434M407L232O1j443J657km030n298M536K888k294j198J1794J827k202
5683D161l396r957l1O365R15m865N678J404O26O985Q922k838j6232r050J0631
$$ y = [6722, 5735, 12891, 8072, -1366, -1634, -2654, 6804, 10177, -5870, -22652, -12840, -13602, -18403, -21681, -16516, -12386, -9855, -4200, 4228, 10222, 2619, -305, 1938, 1501, -271, -8920, -10706, -13846, -9987, -4375, 903, 4453, -1826, -6499, -13650, -11442, -13251, -15794, -9440, -10670, -11093, -13826, -11984, -7401, -7025, 338, 7769, 12638, 11084, 14617, 2636, -6313, -8142, -9967, -2782, -251, -506, 10081, 10342, 9097, 10865, 8088, 232, 3908, 6519, -1671, 4228, 12780, 8907, 9584, 11631, 9588, 2586, 5237, 6741, 8668, 17520, 18262, 5967, -6997, -10225, -13431, -8465, -12569, -23731, -30692, -19912, -9427, -6340, -9774, -5367, -2135, -2074, -3517, -1860, -1862, -5892, -11190, -6654, -3766, -6060, -7258, 4536, 6363, 4161, 765, -9192, -9223, -2858, -1943, -6808, -1130, 274, 900, 7885, 16807, 13969, -2263, -11313, -682]
5668f82J4616M064l131n323l498o454o947k265P774K713l82P684K318m715k101
5653C671l772l158J613n014N228O97M439J692l479k330p690K348P500Q635j831
5638H549M395J549n912q914o879R80L416J883k948m64l508J166N776N912j018
5623C983j505n283k839l704K442k732R74O463N428N428j173k41N641k789o11N746
5607A5228J984L076j900j1246m557P538j382L03O759o999k836m285l537n14k325
5592d693J092O887L99o41r371n219O059P223p730r664l944L386L753L767Q257
5577d39K765n508K478L144m641J632K76q24J5306q124j5210p403J220j567Q94
5562a6001P731K058Q828J887Q602P958j4770j1321M298j333o493J49M345J2184
$$ y = [-682, 13934, 17998, 14867, 9544, 6046, -408, -7355, -9620, -1846, 867, 485, 8169, 10487, 5772, 3671, -101, -3259, -1646, -6660, -1432, -735, 3704, 5396, 1917, -413, -8103, -5755, 1745, 10380, 8549, 12944, 14493, 8581, -333, -7212, -6232, -2816, -933, -3881, -4345, -7853, -6687, -911, 5001, 3983, 2478, -2805, -5644, -9348, -6906, -9638, -8664, -2201, 3227, 8655, 7482, 7241, 12882, 10093, 9482, 15228, 17212, 20288, 18388, 7142, 2585, 10123, 8741, 9044, 15803, 8804, 5968, 1683, -1854, -2368, -4693, -3601, 3286, 3685, 3044, -6327, -11546, -5487, 1736, -5994, -15658, -19602, -16216, -12463, -8696, -439, 2326, -3182, -704, 2440, -2201, -569, -293, -1117, 14189, 6065, -9145, -16548, -15328, -16895, -16001, -8270, -6212, 2616, 4503, 13105, 21063, 6293, -5028, -730, -2063, -8556, -8407, -4062, 8122]
5548H122J432l724K347n96m098n469l553K398O721J978j2219p091q451L275L753
5533a5175n958r69O66M405k683J2711J0323n781j2704m390L001J0546J194Q6P946
5518C218l715m135k40n777L715J0586M589l131M426j775j083N552O00L548j3297
5503C081r500N527M57J391J404J097J016j2275J373j720K215J76M82K845J269
5488a162j621p070N265Q174L851q24l655l156L590j750J314k572j2669j2722K976
5473b2031J970l435K248J0918J5001M536j250q603o519J0201R387q665k289Q509
5459I978J0027q671j1280M679O426k328k217r128Q302j052L26n598k254m26M96
5444b720J86l040L372Q97L311j70m362l357m867p144J060j121P91k200L074N941
$$ y = [8122, 9554, 5830, 8177, 7581, 3483, -1986, -5539, -3141, 3580, 5558, -6661, -13752, -22203, -18928, -15175, -21133, -22102, -21436, -17031, -19714, -7003, 3320, -2461, -15165, -19555, -16554, -6008, -4814, -4728, 3218, -497, -4632, -4872, -10649, -6934, 3652, 8241, 5110, 9536, 7761, 6678, 12230, 12830, 16378, 3081, -6419, -892, -435, 956, 2360, 3457, 4473, -7802, -6429, -8149, -5934, -5758, -5276, -2431, -1162, -2783, -9853, -4588, 3586, 7437, 6613, 2958, -198, 3392, 1642, 2956, 384, -12285, -25007, -22031, -20061, -23496, -21248, -10330, 4671, 9207, 7957, -646, -7165, 3036, 12423, 3758, 1469, 9978, 20005, 11334, 54, 4733, 11159, 8831, 6614, -2514, 5788, 4736, 5062, -536, -2790, -3216, -2720, -2534, -5574, -2202, -1305, 2006, 1836, -2526, -5883, -10750, -17894, -16834, -17955, -17164, -19364, -16290, -10349]
5428a0349M537k508q91o61j256l34k858o384J824J597P290O374N21Q93O263j571
5412B487O05N80p570r88k137p931M375O214l132O53Q73N764n725j0270J024j338
5396a6516K933J690K277L850J7541j1j0422o160p706j1528K66J0503j432N323
5382i392P477K377l435L28m29O371M779P71q082k199J841j00m849J05M352O505
5366F420j528J631P33n239j0461n079L070K901K444J1393j2j154L68K448k883
5351E052k320j756J320m432j231M15l362k762j232l002J544N390j02K549j153
5336e082m922o867O357J4232k141K219j0241n792J026O748K375n307M977L460
5322A042P96P859L146o835r931q934j077m99J2757N630J457L75m964k447P18K68
$$ y = [-10349, -5812, -8320, -9211, -9872, -11128, -11462, -14320, -20704, -18880, -17283, -9993, -3619, -3098, -2205, 4058, 2487, 3092, 3672, -3898, -4886, -7023, -14954, -10579, -4365, -7497, -6844, -5971, -207, -5932, -16202, -15178, -16516, -13583, -11893, -9616, -5766, 11775, 11764, 1342, -4818, -12524, -24052, -23786, -13283, -14715, -9392, -1915, 462, -2973, -2645, -3074, 3297, 8076, 8847, 765, -1434, 407, 307, -4542, -4437, -85, 6420, 4892, 6523, 7256, 2017, -8444, -13523, -10453, -7552, -5108, 6285, 6273, 5119, 5487, 7935, 5052, 2732, 976, 2296, -2136, -3367, -2952, -6314, -9076, -10308, -13310, -11766, -6376, -6478, -3929, -5082, -10004, -16871, -10514, 3718, 1577, 3796, -6445, -12237, -11211, -4463, -2088, -7395, -2418, 1042, 1838, 9697, 12843, 6008, -3923, -12857, -13934, -14433, -1676, 3954, 5411, 5786, 822, -1625, -907, -639]
5306f39J2661m927p909Q163m157r811P22o789j60J2010L153m538k816l461J17
5291h381n201k364j386M666J3033K426m052j956M048m099k141M591O67M148M851
5276H850L303j0198q858k941L99m033P15r14Q94O914K366q552k998J0076J198
5261c779P791P904J731j826m636k893j759p455l6m113M516k704r423R01O764J6106
5245G089j20j2867M979K048o556K551O573p450l8j745L979J2805M780j88q936
5230F904l593o550O797J2330k344o643j2040L544j647j754J1856n679m801L967
5216C47m033m002K01j823K446M647R066N395k41p089J091q903O91j88L599N082
5200F286k454J381R423k791l799k516L486O567L943o912K867l970m382N295M777
$$ y = [-639, 12022, 7095, -814, 7349, 3192, -6619, -5897, -12686, -12846, -836, 2317, -2221, -5037, -8498, -8381, -13582, -15946, -17332, -12666, 367, 2793, -1259, -3215, 833, -3266, -5407, -816, -149, 3999, 8850, 12153, 1955, -6903, -9844, -9445, -13478, -12763, -13677, -12783, -5869, -3503, -12055, -15053, -4977, -3779, 4012, 11916, 13647, 11821, 7185, 4292, 2533, -4922, -4958, -9071, -4555, -7259, -16682, -15781, -9017, 7089, 6969, -5898, -919, 1129, -5427, -2876, 3697, -3753, -3791, -5536, -1557, 11248, 16028, 15840, 6904, 3311, -3239, 3558, 15888, 13544, 6901, -5139, -1595, -3242, -4996, 6860, 1181, -3620, 347, -3686, -7688, -7487, -9310, -6864, -2217, 6849, 12244, 12003, 4914, 6005, -2898, -2207, -2395, 1204, 6286, 3832, 5213, 14636, 11845, 8046, 5530, 9016, 15583, 19526, 12614, 15481, 11511, 7129, 12424, 17201]
5185A7201J729j3616O78k120m191N040K03J110J183N731K93j0810j1467o866P86
5170a5116Q968N533K454N642P82M571O14l636q197n540M622O958j8j208n820j587
5154i78L969J2971J231n180O345k60o389r032j3536L764J1912Q428o082n71j0763
5139d171o577L400L937Q845j408n00n84J707L895j675R29k637j3921L50J3130
5124D720J6201k929j4388k746r381m518Q305l68m447o595P658J4093P385q915
5110D075J51Q848j693n678j1247l813m592P095p64l434N976l837p154J956N322
5095h789Q402J1726o990l110r932m289J817J3803O966n522N775p152n601Q091
5081E195p340j386J310p105L558R420l839k504O38J301J041q864J284J675j784
$$ y = [17201, 18930, 5314, 5992, 3872, -319, 4721, 4924, 6034, 7217, 12948, 13241, 2431, -9036, -15902, -15116, -6148, -615, 1839, 7481, 8263, 12834, 13448, 9812, 1615, -3925, 697, 7655, 7637, 6429, 609, -978, 2991, 15962, 17193, 12013, 18358, 18098, 11709, 2677, -10859, -7095, 4817, 13245, 7163, 6592, -4171, -10748, -7348, -3411, 5434, 4026, 3526, 2942, 4649, 8544, 6869, 7798, 5161, -8760, -8410, 4720, 20921, 17992, 3604, 858, -8523, -13041, -4736, -5104, -9551, -16146, -8488, 5605, 12990, 4075, 4226, 13074, 11381, 5703, -5544, -9357, -13949, -6854, -7618, -11052, -5076, -8913, -16067, -14111, -8789, -387, 11339, 4349, 1239, -8693, -12982, -11165, 2638, 9604, 4082, 9857, 2705, -2896, 5195, -2145, -3531, -2221, -9326, -5768, 3652, -187, -2691, -2053, -752, 289, -8575, -7291, -5616, -7400]
5066g400L064j491L146p986K801O025o358o690J265J3463O939m21M781O69r212
5051B595J228L837j924m687P04Q600M906q08j7221o071R132n449l522N784J722
5036a174N935R713k206q530j2347J168J0276R211p931o697O415O015q98j544k556
5021D850p852n918j15M115L938j945l516n620j17j0128Q741K380j741O192J0278
5006C542L72M176K582L856Q112O987j152j841q845j3025j315P999K906j816n713
4991F825p38J0165O43q360q736p692p966N282K893q14M729N020k951L516J244
4976C060m325L780M066o38n452o857q294o40Q45N097M994k360m978O522M207M88
4960d85j482R5M065M652j984q656k347p70J285J196l099O967j88q042R550J849
$$ y = [-7400, -4336, -5827, -2681, -10667, -7866, -1841, -8199, -14889, -13624, -161, 6778, 6357, 11138, 11807, 2595, 3823, 7660, 5736, 1049, 1753, 10353, 15259, 14451, -2770, -8841, 291, -5158, -8680, -2896, -1174, 4761, 14474, 12268, 3738, -8609, -7441, 2835, 12046, 4115, -2582, 3833, 9848, 8950, 7406, 4850, -3002, -8920, -9035, -4920, -982, -2927, -6443, -12063, -12180, -22308, -13567, -11187, -12928, -6736, 3542, 3914, 8090, 10672, 14528, 22640, 29627, 28475, 26634, 17789, 4764, 3449, 11448, 14354, 12538, 6825, 6087, 16252, 16895, 8535, -201, -7893, -15859, -10577, -7684, -8498, -3769, 1251, -1700, 1816, 3060, -1265, 2515, 6581, 5943, 491, -6366, -14660, -15300, -14455, -9358, -4364, -6724, -11702, -5180, -973, -485, -1967, -1872, 2193, 6845, 4861, -3795, -6142, -6912, -5627, -4431, -7530, -563, -751, -8793, 757, 2606]
4944B606r530r593M999M111K647K649n122K036k52M040K553j302k457m347J862
4929e100N460k705o919N854M627j794l490N696P186j097j2702n997n301l666P247
4914a2701N722P638J15m689p012j380l298p619Q816R225l140m451l801L991J1989
4899e95n145o149O88L625J87r31Q73O469k506l30L832k574j276m542l04Q30M855
4882b993j128n301k503L908k09l7k953J940P071M92M055P854j900q780j691J874
4866c01O108r4p233O34j835K551k369O349L983m994q781r285o577J167P572P334
4850e771q01K658k611l429n397k818L254P267k51Q03J1002J4436K527o61m92o307
4834A3409l238M818o80o656l668o14O75l032M271l51j301N648J782k805j675K114
$$ y = [2606, -6924, -16517, -11518, -7407, -4760, -2111, -7233, -5197, -5449, -1409, 1144, -158, -2615, -6962, -5100, 360, -2345, -9264, -3410, 1217, -577, -4067, 1629, 8815, 7718, -4984, -10981, -16282, -19948, -12701, -6979, 659, 774, -3915, -10927, -12307, -15605, -23224, -14408, -5183, -8323, -12774, -16575, -12584, -595, -5740, -11889, -11201, -7576, -7389, -8320, -7447, -978, -3484, -3814, 18, -2556, -3832, -8374, -8678, -7848, -2993, -4121, -9422, -11925, -8017, -8226, -8263, -11216, -9276, -2205, -1713, 2342, 10196, 8296, -484, -2175, -301, 5807, 5713, -1520, -886, -2721, -170, -2539, 3810, 7793, 2799, -5982, -15267, -21844, -20677, -13105, -5771, -6572, -3914, -6525, -9954, -15351, -18169, -14915, -7648, -7899, -7096, 3906, 18342, 20869, 20208, 19716, 13409, 10171, 14989, 14309, 7653, 3985, 3371, 4046, 1014, 5285, 4934, 3633, 9281, 11063, 8258, 6583, 8697]
4818H697J1617k010q691n182p124o95K495j036n039M707K384L001L25q417l343
4803h311R00k077o886m972Q380K954L983P31L913J0829N534j130L322j412j6207
4788d49k753J59k3R164P735O930l199o597l956q509j464O627j479j184K458P404
4772A0864l844Q001J2081o918j1923j1432L33N414o808n91P497j502m213r480
4758a2521J574N181K111q230J825M0K861J753j094N801j533l310K22K394j917
4743d843j650k440j08J3927J2423k394k1284r838J74J629J0372J95n681j143O033
4728d628K952j895o392l162K361P327m22K705J436l79P1J524O07l596K866Q964
4712A0339j765m279m832j890N916J041o551j0371n781R47J654O674P531M025K226
$$ y = [8697, 20314, 18304, 9613, 4431, -2693, -3388, -893, -1929, -6968, -2261, 123, 3124, 3449, -4968, -8311, -7411, -9488, -16374, -21346, -12966, -10012, -6029, -5298, -1385, 9444, 14978, 13848, 17170, 15758, -449, -3202, -3043, -3066, 6098, 13833, 20763, 17564, 10967, 7011, -1498, -2962, 3665, 2186, 1002, 3460, 10864, 7020, 15021, 27102, 20184, 8261, -3171, -2838, 2576, -4232, -4823, 2674, 1172, -3041, -12521, -10947, -5766, -3655, -11885, -10060, -10020, -7159, -5406, -6500, -699, -2232, -5542, -5320, -2926, -4843, -6493, -8933, -9041, 4886, 17309, 14915, -6369, -16207, -16033, -14404, -4032, -3837, -9518, -10661, -4628, -1676, -3571, -9963, -13125, -10764, -3437, -3859, -1154, 282, -97, -26, 1498, 2105, -1491, 1375, 10339, 8574, 4295, -537, -2427, 3489, 4530, -2021, -12392, -18173, -17226, -15572, -8898, -1367, 2658, 4884]
4697D884J065n48J029M625r492N159J2896o270j0709M809o041q299K759j157j78
4682e468R28k730J416Q954l041q976l824L211l83P183p96j731l534J643m75j3619
4666b1242K652O491N766L79m045m762n13R075M294Q557R244p107K938m577o050
4651A100m086K523j701m118r62m428Q046J3265O166O39q372l050m221l155J289
4636a065M118m202L010k796l044o074O809J8838P416r367o654p175l04L999L119
4621F628L34P120M20p611q133K723J282J138q492k591o009O973O640L082k93M359
4605G570R59k681M53m272k235K307n633n243m076NQ775j951p845K785R054J475
4589e53K960J233m090k436o486M13R593J4473O266l010j2889j0131j596N089K388
$$ y = [4884, 5949, 5401, 6430, 11055, 1563, 6722, 19618, 13348, 2639, 7448, 1407, -6892, -4133, -5290, -5468, -4540, -7270, -5854, 3100, 59, -8917, -12741, -9530, -9913, -2730, -3526, -5257, -8791, -7148, -7623, -21242, -18590, -12099, -6333, -5954, -9999, -14761, -15274, -6199, -1905, 6652, 15896, 8789, 11727, 7150, 1100, -2986, -463, -2164, -6282, -7244, -11672, -3626, 9639, 15805, 16444, 8072, 5022, 801, -2354, -1065, 3053, -1149, 1861, -935, -3979, -10053, -3244, 15594, 23010, 13643, 6989, -186, -490, 3509, 6628, 6962, 14082, 14502, 6891, -1242, 1481, 2763, 3901, -4591, -7182, -13191, -6218, 422, 3504, 3211, 7570, 8529, 5848, 6301, 2029, -206, 2101, -3532, -8775, -12851, -12846, -4071, -6022, -13867, -11082, -2028, -553, 2407, 3640, -450, -2886, -9372, -8959, 634, 15107, 21373, 18363, 5474, -4657, -6253, -1164, 1224]
4574A224k953O981l420j194O0J759k064J468n484J2250q17j6003j767K506l120
4559a0574K272N626O276l592M458J0392r978j3645j922k074J747R204k598J20
4545d288p617L137J332M393Q738j985l755N21K483o775l918K025M339M277M00
4530C307o628J689J09n180O47N995L315n07M994l319q265m360J2591l416o87j428
4514a143K714R79o75p485q831o45J7087L703j613M410j358k762R36p767m088J4571
4498H033q991j6446L517J2873Q023Q75j999j3373j5318P813J6106J3237j869n850
4484F631l352K505O632n338q671L624o950L551J337J357l723o486N027M099P357
4469G600j569m842K039L235P480J367L265K636n981l428j286n189l939k656p689
$$ y = [1224, -1729, 5252, 1832, 638, 698, 2457, 393, 1861, -3623, 8627, 7810, -8193, -9960, -7454, -10574, -8302, -2676, 3600, 8, 4466, 14858, 4880, -8765, -10687, -12761, -11014, -1810, -4408, -4288, -11905, -8768, -7436, -3043, 5695, 3710, -45, 476, 2959, -3816, -7734, -5709, -1370, 2907, 3307, -3321, -1632, -1523, -6703, -6056, -61, 3254, 2747, 7741, 4422, -3843, -8203, 4388, 972, 285, -1143, 1571, 2550, 1875, -5610, -14441, -15086, 2001, 5704, 4091, 8501, 7143, 4381, 5317, -2450, -6538, 8033, -958, -17404, -13887, -1014, 7009, 7884, 5885, -7488, -22806, -14993, 1113, 14350, 12481, 6631, 3279, 5784, 12416, 7078, -1593, 2031, -4919, -1368, -31, 1326, -2397, -8883, -3856, 243, 7600, 6031, 1189, 3228, 6463, 13943, 15310, 18575, 21211, 15230, 11802, 10516, 5327, 1388, -1268, -8957]
4454h957J198j245L424j00j168M344L363K21l734o58O889N981k863P244L509r090
4438H358l153K287R598P435j3890j2440O151m173N893k142o378j536J386M214
4424A610R40j557r150p459k307J113J1301O231n505q029j84K548l212k125O910
4409h875k792J85J018L546J4274L401p947J79M07J081o546q947N913O671Q256
4394I824o844j2555n749N351M660O786Q707j981l033m463o842j735r87K792j0007
4379a6076K731J823n63J0902L11L547Q192Q696n568j2579j255j63l685k986O700
4364B7M105l006o333j2195q790L173J4890R064n325n40L317n226m438l345j934
4349a6556o279L296K074K113L551q359P173Q966K992j674J2340k3K177j4809j1337
$$ y = [-8957, -7759, -9004, -5580, -5680, -6848, -2504, 859, 1080, -2654, -3312, 3577, 9558, 6695, 13939, 17448, 8358, 5205, 7492, 17090, 24525, 10635, -1805, 4346, 173, 6066, 3924, -2454, -3990, -2604, 1610, 2550, 993, -8157, -15616, -17923, -16810, -5509, 722, -4783, -12812, -12996, -10448, -13660, -15785, -8875, -11667, -11482, -10464, -6918, 7356, 10757, 2810, 2989, 3396, 4477, -2069, -11016, -5103, 1568, 9824, 2980, -9575, -15324, -9973, -5313, 1473, 10180, 8199, 5166, 703, -6139, -7874, -8861, -6069, -16076, -13345, -11522, -12085, -1183, -872, 2675, 10867, 19563, 13995, 1416, 161, -2, -3687, -6673, 27, 4132, 1126, -5207, -17402, -26192, -23019, -8129, 935, -4390, -4930, -1613, -6839, -11277, -14622, -16556, -22835, -19539, -17465, -15352, -11801, -20160, -12987, -4021, -1029, -2703, 9637, 9614, 11791, -3018, -14355]
4334a4355p446O017R985Q324k643o409J563k644l639J489O047M444J109o986L361
4319a783M042M678L987l839q669j0586r720M08J0387Q040J3736R69j5221n642
4305i213l226N979Q295k357n804Q963O445J96p562o148R543q575j1463L605J1359
4290C7O867j578l105l048j984o66j348P194O798j2029n660m000n928k255R331
4275a1374Q123M028q258j575J5849R378m109o361n318K726q792J795L180j824
4261b532K6j588m805j706j424P03L915M248K707q282K955N700k669P684N598l664
4245F866J084j010o517l352P288j462j405m510o370j192J4342J670k660j7801
4231a5029p993M742J1906O736N070l34o95j2094j2291j613K412j13P814J0228
$$ y = [-14355, -21801, -15784, -5799, 2525, -118, -6527, -4964, -7608, -11247, -9758, -3711, 733, 1842, -5144, -1783, 2259, 6937, 10924, 7085, -1584, -12170, -21890, -21482, -11095, -3055, 10681, 11650, -3571, -9213, -12439, -6460, 1835, -522, -6326, 2637, 9082, 9278, 1716, -4432, 5111, -3464, -14927, -11322, 37, 6904, 5326, 2221, -827, -2811, -3477, -4825, 2369, 9167, -2862, -8522, -12522, -18450, -20705, -11374, -3251, 777, -7481, -9056, 6793, 16171, 12062, 5701, 383, 3109, -5683, -3888, -708, -2532, -2506, -4094, -8899, -10605, -12029, -11326, -7411, -3163, -456, -8738, -5783, -83, -2752, 4932, 10530, 6866, 7950, 6940, 423, -2929, 4359, 2897, 1492, -3018, -9388, -10580, 3762, 5432, 2772, -15029, -23022, -18280, -6374, 362, 5432, 5098, 4403, -7691, -19982, -21595, -19183, -19296, -11482, -1254]
4217a254J0942N283K598j3230q117m657n177j635P220J690O167M100Q67q313l165
4202f681K182j946M105P284K4N692j377L42Q21r740m744r870M304K892j471q41
4186i024O296P017l505l981l591l190Q188J0008J141j2270k525O847m959m266
4172g814r323o420L653J2875R283j1238n543K240P592k176j012O36N590J6183
4158A4526M636m472j1315j7095j1112M556J7267O375l654m282J772O248k282l167
4144a999M950k496r580q257k399J5721J0855n750j450Q710J505n2r953j2943O528
4129f610J1023k067j6625m122R938O526l889j1407k737N939R111q79l929K749
4115f979Q059N629j2141r017Q872P075j908J069o102j1040R930M710R32M333M052
$$ y = [-1254, 9688, 14971, 17569, 4339, -3778, -8435, -13612, -15247, -8027, -6337, -170, 3930, 4797, -3516, -6681, -4499, -6445, -2340, 4944, 4968, 10660, 9283, 9625, 10446, 706, -4038, -13908, -9604, -6712, -8183, -9024, -2728, 4289, 784, -3197, -6788, -9978, -1790, 8218, 9359, -2911, -5436, 1411, -3548, -7814, -17137, -23557, -19904, -7029, 2254, -8984, -14527, -12287, -4695, -6871, -7883, -7247, -1657, 14526, 19162, 14690, 3375, -13720, -24832, -20276, -3009, 3366, -288, -4570, -2798, 3450, 1168, -1999, 2951, 455, -9125, -17382, -19781, -4060, 6795, 1045, -405, 8305, 9810, 9758, -195, -13138, -6610, 4413, 2346, -14279, -18401, -8463, -1937, -5826, -17233, -19970, -14031, -4920, -5799, -9728, -6979, 1080, 6709, -5432, -14449, -5577, 1498, -410, 659, -5443, -16483, -6553, -1843, -911, 3422, 7474]
4100G474J720m106K034J94q680k10N359L114n504j4249R77J87Q077k718K134n705
4084i902k001l707K624J0732k929l337r306O541J8272R30Q30j684j629k279O085
4069I240K615k161q945r514M598j508k937P00k555L441M807L684J521M235o868
4054C53r780R090J199Q156P78q397j454l243k042N964j782l611o752l662j017
4039a6200j1842m109P866P200M280j568K959O444K509J589M960q29O54p508n516
4024i111j868R030O382q196q470O165R515L536m580J372O906l947q140O271N524
4009A0389j0142l555P457m916L562o258m074m61p635P9M052M309L682K080j672
3994c103m525m289Q049Q375p310j437J59L354j5464K70J1537J9514J510k282j4181
$$ y = [7474, 9194, 5088, 7122, 7316, -1364, -1574, 3785, 6899, 1395, -12854, -11877, -11690, -3613, -6331, -4197, -9902, -11903, -15610, -12986, -2254, -5183, -8520, -17826, -11285, 6987, 7917, 8747, 7063, 5434, 3155, 9240, 11855, 9694, 749, -8765, -4167, -5675, -8612, -7912, -10467, -7026, -2219, 1465, 2986, 7221, 353, -9427, -337, 862, 9018, 9796, 1399, -55, -3298, -5340, 624, -1158, -4769, -11521, -15183, -16200, -28042, -32151, -24285, -17085, -12805, -14373, -11414, -4970, -2461, -872, 4088, 3259, 3913, -3595, -9111, -10979, -1949, 4433, -3763, -12233, -6068, 3447, 6983, 2403, 3775, 10681, 6734, -1406, 4865, 10389, 247, -3308, 4149, -767, 2795, -3463, -7537, -7998, -15633, -15554, -11502, -7193, -3511, -1431, -3103, -7628, -11917, -3868, 4507, -2803, -4240, -4081, -727, -16191, -15921, -4384, 15130, 16640, 14358, 177]
3979A77q728N148J0980J257k537k046M709K755n119j015O191K17P321K944p127
3964A5127m767q771o386O216k64j2920M505N738J7444p64j0388l226k96L48n224
3949c628n474m512O625Q060p31j2693j2295Q84R056n42P006P679L751j349k623
3934g86J263R408j813l604K545j1251m876J633k539L934m321K797J782k286n040
3919a3154q11p03l642K05J1096L637l189R779m74K928k423k49q60M502J625o570
3903A697k624K581l816P28N57K064n836R85n804K985M719K922k449N6o369j6082
3887b3686j159R241J2268J968Q89j047l268R920P428j593n074O894n011j0496
3873b726m417l243M856R254k440r312M202L909o77k883J190J626M6K837L14m280
$$ y = [177, -8551, -3403, 7577, 8834, 6297, 4251, 8960, 11715, 6596, 5581, 11772, 11989, 19310, 22254, 15127, 10360, 1589, -4797, 1419, 1155, -11765, -7260, -1522, 15922, 15158, 4770, 1544, 1248, 1596, -3628, -9102, -13614, -6989, 1071, 340, -12353, -24648, -23764, -14708, -15250, -8244, -565, 3186, 1837, -786, 477, 9885, 8072, 4468, 7013, -4238, -9114, -7481, -10020, -6086, -10407, -7610, -5828, -8114, -13154, -13965, -14668, -18310, -18105, -7009, -3372, -6561, 3218, 2744, 5672, 3249, 3000, 2140, 6642, 8267, 1697, -927, 1654, -2162, -1434, -877, 1187, -4649, -3664, -9468, -6483, -1764, 1158, -1291, -1235, -7604, -23686, -24845, -15604, -3336, -1368, -479, -1526, -4794, 5126, 12554, 10961, 5887, 12781, 7770, -2726, -7143, -10386, -5530, 3724, 1284, -8028, -3826, 83, -594, -3477, -2287, -661, -615, 2222, 2536, -1744]
3857a744p739p2L361J222K827L624K337k308q104r465o245J2582Q283K087O479
3842G125k925j822L747q324L998M561N136L11L283j3289m511k037K34M623m221
3827d111n080Q159J745l879J550J488L607M306l64k48K988K368l144m650k188
3812B547K172j0421j609O672N325r572M288j055l71k308k536j601M448L49k205
3797e877K12J965k762Q291J857j378p893k22K929Q304m684o265K361l001o275
3782a2438k833L340P307P412K949k121J438J964O43k575k005M100o416m967L630
3767e72J798j853n314k494m291J789M726M472P177j751k630m101k819l223N16
3752h570J4901J2152o542j3035K635j477R679j759o642k666M253L389k231K39
$$ y = [-1744, -9483, -9555, -6194, -4972, -2145, 1479, 3816, 1508, -6596, -16061, -22306, -9724, -1441, 646, 7125, 4200, 2378, 6125, -2199, 1799, 6360, 11496, 11807, 15090, 1801, -2710, -4747, -4513, 110, -4111, -9191, -1032, 713, -3166, -1616, -128, 3479, 7785, 7421, 7173, 10161, 12529, 9385, 4735, 2547, 4719, -5702, -7311, -639, 4686, -4886, -598, -1653, -2024, -4332, -6868, -8469, -4021, -3672, -5877, -5665, -3700, -6462, 1829, 3686, 2308, -5585, -5807, -2878, 5426, 742, -5523, -3162, -6163, -12438, -15271, -11931, -4624, 2788, 5737, 3616, 5054, 7018, 7661, 5086, 3081, 7181, 765, -4202, -572, 1226, -627, -5941, -8435, -12726, -10937, -6211, -1739, 5438, 3687, 1057, -3044, -5863, -9086, -8570, 6331, 18483, 11941, -1094, 1541, 64, 9743, 7984, 1342, -1324, 2929, 6318, 4087, 4326]
3738D326o448n14Q613J060j4984q412L418J2187m41K19p332q358O815Q806L015
3723A970j879n798K589m47r964K625j153o338K617N19Q32J128N545K855j015M152
3707a762M222J1992l302q664m069L837J058l847J980k26o866l130n343N609J823
3692f688k627M346j434l395O428P909M482m005m897j0083k771O667J932P885l49
3677C400K40o450r189n883O075Q483J2965o138q507O849J1433k979k839r911n415
3662g866P421K358m44n70N26p734r644l372P084K172K319Q850q027Q68J522m242
3646h779o31O821N715o23p574K570q196o100O890N605l543k99J0455k983q15k517
3630d004J728l82M758k721j1429O1q1O807n189j0434J2988Q544p417O008P116
$$ y = [4326, -2122, -2636, 5977, 7037, -7947, -16359, -12941, -754, -1195, -976, -8308, -16666, -9851, -1045, 1970, 91, -5707, -3118, -3565, -13529, -10904, -12057, -18395, -15778, -15259, -14427, -13299, -7754, -4899, -5914, -1762, 2460, 14452, 11150, 2486, -1583, 2254, 3312, -535, 1445, 1219, -5647, -8777, -14120, -8511, -6688, -9315, -4969, -6403, -9798, -3370, 4539, 9021, 5016, 119, -9964, -12735, -6068, -4136, 3749, 3400, 3640, -2810, -11999, -17882, -11807, -3324, 9641, 3503, -5004, 1845, 13278, 10299, 7460, -2451, -7866, -445, 1913, 1469, 899, 1425, -6309, -15953, -19325, -12241, -10069, -7750, 1100, -6927, -6059, -4537, -8779, -9410, -2589, 3126, 2503, -5071, -2501, -10697, -16797, -9907, -4302, -7845, -8144, 2311, -672, -1487, -4004, -2276, -2658, 2100, -621, -12050, -11989, -12070, -5263, -10452, -20886, -7898, 646, -6771, -763, 6353]
3615F353O03n375j0734l248P800N250k521L037N457p616K26N090Q44k135P950
3600A0981m068k202J1213R020k538j7528j3587k263N204K787k776J540J892N756
3586C431K137K678l813k119j424l809N301P414o05L769j742l195j777j523k791
3571A932l691J1824N54r321j1316Q84m4P825L757K082nL607j698L640O713r471
3555G272o601J770P37k733n069j0367J24P415m522L528M018K660N79J02N336P002
3539A1251m401j812K071M193j309j1264m581q859j832m011N550Q954N607P418
3525F975m466j6926j827J3114P687k807r238j557j967O961P239J943K17m078p544
3510f274n31M573k419l747P771K680r62l063r205Q514R913n501m631j26m566k679
$$ y = [6353, 6956, 1581, -9153, -12401, -4601, 649, -1872, 1165, 6622, -994, -768, 4322, 5166, 3031, 10981, 6913, 4711, 15924, 24944, 22406, 4878, -8709, -10972, -5768, -2981, -5757, -4217, -2325, 3431, 5568, 8246, 4433, 2314, 890, -2919, 2382, 9796, 9191, 12960, 11218, 8023, 6246, 4723, 1932, -1759, 10065, 10619, 1298, -10018, -9134, -9178, -1353, 2404, 4486, 4481, 8088, 6390, 10030, 16743, 7272, 671, 2441, 3178, 445, -4624, -14991, -14867, -7452, -11974, -8446, -4428, -1768, -1189, -1087, 4249, 11251, 6850, 5038, 7109, 11302, 9993, -1271, -5852, -14711, -16543, -20554, -15004, -6050, -443, 6975, 2509, -14417, -16244, -3130, 4557, 1750, -7488, -9045, -11012, -4051, 3188, 5131, 5348, 1270, -6274, -6805, -2232, -4651, -8398, -627, 2053, 1091, -1972, -11177, -2663, 7250, 1749, -2882, -3008, -7574, -10253]
3494a0253J726P365R74L28p756k432J744P431J4138l042o453Q035L050o003l076
3479E776J477K282m26j2933j504p850p35K621J073l324O653k318O171K057m227
3464e207J286J4182R22j0886l362L673Q936L287p998p716N603M265L447L939l83
3449A3988K222l581l031k327l699o12L268j694j619p723j3566M406Q603O620m253
3434b998P698J0242j4846m533M493l326k343n57j556k42k648r37Q62l199j766
3419a5656Q24j489P26P92M453P733M029p650Q572J0854N33o565j2201L689J143
3404b13J589K523L913M48k524m696q066o781M684M844l609n825m36Q246P347J2319
3388A3763l079j2099L188P076L109l201q318o504o622j18P528K755P133m626l739
$$ y = [-10253, -8527, -1162, -188, 140, -7616, -10048, -8304, -873, 13265, 10223, 3770, 11805, 14855, 8852, 5776, 7253, 9535, 9109, -3824, -5328, -13178, -13913, -11292, -10219, -13543, -6890, -9208, -3037, -980, -5207, -3921, 10261, 11183, 297, -3065, 608, 9544, 12831, 4833, -2883, 2720, 6985, 10432, 14371, 13988, 16210, 12629, 9598, 7271, 3572, 2960, 6228, 4534, 2915, -4808, -18374, -13968, -5365, 1255, -2998, 4700, 14942, 96, -4437, 56, -3270, -5613, -6170, -7726, -7968, -10616, -11553, -10691, -13890, -15656, -14832, -16321, -15595, -14803, -10350, -2617, 1412, -6238, 2334, 13188, 13721, 7156, -5045, -1356, -213, 1376, 3899, 7812, 8260, 5736, 1040, -7026, -13807, -9123, -4279, -7888, -13713, -14149, -5903, 1444, 13763, 10684, -1415, 1773, 8849, 11958, 8757, 439, -6065, -12687, -12805, -5277, -2522, 4611, -15, -3754]
3373c754Q903k75L386k025N509q009J934m28j9503P986J506Q834P85n126o273
3358f550K289j114o731m603J1278J0463k182j976J979O315K12j076j4288n779
3344a1763M953M732j733m362M748M648R897j0193j7068P241P268r275J582L109
3330f216J0919L52n797q543n05J974J1780J438N558l131o197m587O18p397L655
3315f079q386l145R803P807J920m41o6j0787r00O593K818o541J49L706J1518N150
3299A3119l883k779p150n284R70L590r062n538m868k83O862L100r07p50k102L325
3283a1640O902L747o063l82J308o167k133J0223O109j661l223P698M111L334j8
3268A2145l252r768J713J761K291p27j290j0501r071p325K177R052O769l508Q630
$$ y = [-3754, 5149, 4874, 8260, 6235, 11744, 3735, 5669, 5241, -14262, -6276, -4770, 4064, 4849, -277, -6550, -4261, -5375, -12106, -16709, -5431, 5032, 2850, 874, 2853, 9168, 9380, 8304, -5984, -11763, -6810, -2078, -3811, -8173, -3425, 1223, 11120, 927, -16141, -8900, -1632, -10907, -9325, -6216, 4703, 5055, -742, -9285, -9790, -7816, 3964, 5402, 10960, 7829, 1632, -2955, -2337, -9734, -6079, -14465, -17610, -7807, 0, 1920, 1479, 1413, -9374, -10274, -3681, -863, -7404, -7255, -3549, 7969, 13119, 9236, 6457, -693, -5977, -5007, -1417, -10479, -16017, -20885, -21168, -14306, -11206, -12113, -12863, -14965, -11640, -4738, -991, -7054, -7436, -6128, -12295, -14428, -4205, 1904, 243, -2980, 4718, 8829, 12163, 12145, 8893, -875, 838, 2599, 4890, 4163, 2873, -7628, -16699, -24024, -21847, -12795, -6026, -9534, -904]
3253i04L141j800o543o6L01p47N888L678k51J220M550p550k956J128J221j689
3237a379l676n342N993P99l489M121L624k313M663K786r758j0333o42J1580N792
3222B426j0158l166M709J1120R582p088q026M271K900K633m108n326m324O331
3208A776M861j0009m806p138J1281J3895M444n479n156L315k481l859l530M988
3194B102K282n561l715J1519j909n134k314P327L221m621r3L139l010K851Q081
3179A4165J954o613j1253K322J53K27Q284L309j782J490P164m207r903K694j149
3164F855q998l736m715P14R877J3423L084k180m830L746j1334j163Q844P26J436
3149A1749M276l886o723m015n428K69O746K740j0592p442M793O164r554J3100
$$ y = [-904, 2237, 437, -6106, -6172, -5871, -6618, -730, 2948, 2697, 3917, 8467, 917, -2039, -911, 310, -1379, -5055, -10397, -4404, -3605, -7094, -2973, 651, -1662, 3001, 5787, -3971, -14304, -14946, -3366, 2426, -7732, -10898, -6189, 4931, 14513, 7425, -601, 3670, 6570, 9203, 5095, -231, -4555, 1776, 6637, -3372, -8178, -15316, -4035, 9860, 14304, 8825, 3669, 6984, 4503, 644, -2886, 2102, 4384, -1177, -4892, 6627, 4718, -416, -2730, 4597, 7818, 3197, 3104, 6243, 3233, 6084, 14165, 16119, 9506, -1747, 575, 728, 955, 9239, 12548, 10766, 12256, 19420, 15213, 5310, 8004, 6855, -2143, -5879, -10594, -9880, -3, 13420, 16504, 14324, 9494, 13240, 1906, 743, 9587, 10313, 11749, 16025, 12139, 5416, 1401, -4027, -3758, 2988, 5728, -4864, -12306, -7513, -1349, -10903, 2197]
3135B197N676j0071q86M685n246r033p358q040M693P802O215k005k199Q975O131
3120A536O851j094j549j321R376o363q828J800l308L076m140N255Q533k561K116
3105I379l746K570j988K90j666K323k655P662q269k567R06M526l554P102o961
3090C352k942Q005m849p673l366q83q043L164J3073k091L821m254q260k072m820
3075a7838o677P375K883k545M251K430l904j004O289M587L463K245L12j518k731
3060b382N371o78o169m172j525J126Q216R443M459q437n179k477O83J419p355
3045g657j590O90J2109m866O371L916j4100n72l388L559o458k808J514P305q94
3030f869P285K882J2686O005m838L884J882l866r530q193o490O058J0497r92R63
$$ y = [2197, 7873, -2198, -3084, 1601, -3645, -12678, -20036, -28076, -23383, -15581, -9366, -11371, -13570, -4595, 1536, 8387, 7293, 5744, 4423, 13799, 7436, -1392, 408, -2900, 176, -3964, 1291, 9824, 7263, 9379, 5633, 8203, 6215, 6505, 4839, 7162, 4507, 12169, 3900, 1333, 2239, 6765, 3211, 10313, 3352, 410, 8415, 3566, -4107, -7473, -8356, -16399, -13235, -162, -2253, 1568, -2686, -10946, -13018, -17838, -24515, -17140, -14257, -16802, -12551, -10121, -14025, -15029, -8740, -4153, -690, 1555, 1867, 349, -2382, 2989, 2311, -3858, -8030, -9555, -8429, -213, 9230, 13689, 5252, 73, -2404, -1721, -302, -7657, -9247, -8557, 3552, -1314, 5057, 8973, -5127, -5699, -9087, -5528, -11986, -14794, -13280, -5975, -6869, 416, 3298, 15984, 21989, 17151, 21035, 22917, 19051, 9521, 1328, -5162, 896, 11393, 10401, 11364]
3015A1364Q667p876j0594l992l736m563k451Q933R396j0522k910M174J009n591
3001h692j588p223J573J3475k857j249J1254n347k1068J377J1778N76J603J889
2987d499k216K837l360j5949J1283R651m353N935k206O400n529K633M194L69j8841
2972a3651o670J1311P954k650l478N613K689l252l152L299O869N560J383l165
2958H660k15l487n368J531L623l250j670q154r574P3M903N097N150j949m806J0927
2942A491O881j3056J140N86J053o436N654L777k179M811J217M2m463N871M685
2927A1074J356j0821l707K947M510M081l453r746L885J0142n827j2572k394J927
2913h598l214K989Q474p789j1993j587J1485L628M942J894P9L061o933M463m758
$$ y = [11364, 20031, 12155, 1561, -2431, -6167, -10730, -13181, -4248, 5148, -5374, -8284, -4110, -3101, -8692, -10280, -17503, -15930, -2455, -5312, -6561, 4693, -654, -21722, -20345, -8567, -7991, -6388, -4499, -6715, -3878, -7238, -23187, -11904, -2253, -6606, -671, -2877, 3523, -2006, 627, 4821, 5190, -13651, -20321, -9010, -1056, -3706, -7184, -1571, 1118, -2134, -5286, -1987, 4882, 10442, 11825, 8660, 8445, 4958, -410, 1121, 4744, 1494, -176, -8330, -17904, -17831, -12928, -7831, -2681, -4630, -9436, 1491, 8372, -4684, -3544, -2958, -1905, -8341, -2687, 1090, -1089, 3722, 4939, 4981, 518, 6389, 11074, 12430, 1609, -2098, 849, 5359, 9440, 5987, -3759, 126, 10268, 4441, -8131, -10525, -8598, -11812, -8823, -349, -8138, -20131, -21718, -10233, -6605, -1663, 231, 310, 3371, -3562, 901, -3857]
2898c857q852n736P02J6495P845M256m166q828J386N263K372K620O51p088n089
2883b026j3986J886J4584L700l462M730j991p818K094P434j142L287K760o161
2869C889r605L262L04M502P239j612p563q566L293R90k136p217k36k210P975J4292
2853F601K885j079j1430j0692l685K642O417J1612M190l471j946K384k914j387
2839A27k62k624r37j469R4j14j92q97K012L765J2069N353o939m716j455r384m693
2822a0262J855k057N075P070r70k789j918p628j1712R469L430J212M392J882K408
2807e43J474M210L558k575n874m372Q392Q270j587o588o271j194L616j690l704
2792d878k887L953P259L743P81k277J558r440m985r781m748k723J5292k032k106
$$ y = [-3857, -12709, -18445, -17743, -1248, 6597, 10853, 6687, -2141, -755, 4508, 6880, 9500, 10151, 3063, -2026, -16012, -14126, 458, 4158, 696, 5426, 3435, -4383, -2289, 5145, 4003, 7290, 10050, 3889, -5716, -2454, -2150, 2352, 9591, 7979, 416, -8150, -4857, -3867, -6003, -13220, -13456, -15666, -7691, 6601, 9486, 8407, -3023, -13715, -17400, -14758, -8341, 3271, 7461, 3990, 2044, 4428, 1514, 127, -135, -2759, -3696, -5165, -5071, -5185, -5377, -6274, -4262, -497, 11572, 16925, 9986, 5270, 3815, -5569, -10262, -8407, -10464, -5389, 1681, 711, -2078, -3996, -11624, -23336, -13867, -10437, -9225, -4833, -2951, -543, 931, 5141, 8699, 6124, 250, -4122, 4270, 12540, 10953, 4365, -1906, -3100, 516, -1174, -4878, -7765, -3812, 3447, 7190, 7971, 5694, 7252, -2188, -7173, -16954, -21702, -24425, -9133, -11165, -13271]
2777a3271Q167L143l759J0585k535o120k72J0451l253r500K057J804j167O589
2763B919J2122l990j4703L857J071o055j3053Q219J0490M103j219J058L464J929
2749A0212l148o831o836r958R442j396K474L281o081M964P88p534l764M678j167
2734a0876R321J943J200M395q728j708J678q38n858o02o43N051R259Q790R275
2719B1659n704m098J216j185j0772l169P844l690J598l382k505P265O808N373
2705A7258p796p64L85j1128k786N830N173m876q314m173N958R877M191L481l454
2690H862j853j482p328q49m614L170l93K695m770R80l79O438m31p965O685N725
2674D491M658j3165j091M889j602R936j602o558k608j282N082O291l782k574q79
$$ y = [-13271, -5104, -1961, -5720, 4865, 2330, -3790, -4062, 6389, 3136, -6364, -4307, -2503, -3670, 2919, 15041, 11051, -3652, 205, 1276, -4779, -17832, -9613, 877, 4980, 3761, 4819, 8283, 10212, 7064, 233, -6603, -16561, -7119, -8515, -6041, -2760, -8841, -3877, -3089, -10623, -14387, -9709, -10876, -1555, 388, 1588, 5983, -2745, -4453, -2775, -3613, -9471, -10073, -10716, -5665, 3594, 12384, 21659, 15955, 11857, 13073, 11888, 1116, -2053, 5791, 2101, 3699, 317, -2188, 5077, 11885, 17258, 9462, 8698, 9083, -2045, -4831, 999, 6172, 1296, -7018, -11191, -5233, 4644, 8835, 12316, 8862, 7009, 5527, -1801, -2650, -7264, -4094, -4487, -1792, -6562, -5582, -5961, 477, 46, -7919, -1234, 4491, 9149, -4016, -5107, -218, -1820, 8116, 6514, -44, -2652, -3934, 1148, 7439, 3657, 1083, 204]
2659B04J612j183k915k783J467Q661l770n138M18j725J278j786n139N338k816
2644h277j934m229N038Q800R74O01R86P12O529j0244j1360m817R031J0060K090
2629C960j249P639m99L264P453q417J30k100j2011j021O473n16j869Q106L121
2614A2464r87m552R42r77j422J059J0513L927l710p093m988n760R62Q33L485N471
2598A0167P516q892q643l3R881J510k899j600J42K71J721n19l374j984J590J850
2582F704p10k739k792j720J383J388k875O025j53K779o627j0698L277P95l478
2567i441O702Q711Q639R657o028o253N482k724o969P08M649l892k167j0798L729
2552EN113n232n040l130n38R174Q326l872j145K845k168n066n405P758J0002l909
$$ y = [204, 1816, 633, -2282, -5065, -3598, 5063, 1293, -3845, -3427, -5152, -3874, -5660, -10799, -5461, -8277, -10211, -14440, -9402, -602, 372, 973, 1959, 2671, 9200, -1044, -12404, -17221, -8190, 1870, 3960, 2711, 10350, 9851, 13115, 20568, 12151, 12281, 10181, -1830, -2851, 3622, 3106, 1237, 9343, 12464, 11477, 6925, 7867, 6890, 5468, 6527, 17040, 20967, 17257, 10164, 5176, -584, 378, 1211, 4696, 10167, 17683, 8791, 148, 115, 9996, 11506, 8607, 7007, 7149, 7420, 9141, 8622, 5248, 3264, 4854, 6704, 5994, 3255, 463, -1257, 126, 1514, -1361, 4664, 4511, 7290, 663, -10035, -6758, -5963, -9441, -2739, 5972, 14611, 24268, 18240, 11987, 17469, 14745, 7776, 8484, 13133, 9241, 7074, -3724, 5, 5118, -114, -5154, -8284, -8822, 352, 8678, 4806, 3661, 6506, 4338, -728, -6133, 1625, 11627, 7718]
2536G718j2659J665R887J029r76L124n17O36k58l738K435j665q575J918L234p167
2520c909j913L312P990P381K381l17q189l742q736M727R361L116j0459o991l602
2505i590p18K261K033k831K607J163k465k203N200J126k637J760Q248O093l881
2490F166M760L045r520p688M004Q17j887l00k629j1922k23j971k212Q037P843
2475c680m588j760O028P434l173m602j477k163m81L952P65J432Q621J4599r513
2460A1394l933j0537p747N731K487L132P797k359j5391n143P877N884m665K89
2446e184Q650l222o671j751K186N055M963n616l277k703M482J584j725m992l58
2431h579L969o97o441M869K784R50L353l316j618j766m191k213N130L98k458n971
$$ y = [7718, -4941, -3276, 6611, 7640, 6664, 9788, 9271, 9907, 9649, 5911, 8346, 6681, -1894, 24, 3258, -3909, -5822, -2510, 5480, 12861, 15242, 14925, 6736, 2994, -5742, -1015, 8346, 11462, 1003, -5988, -9590, -10308, -8047, -6014, -8845, -6238, -5075, -7540, -9743, -4543, -3417, -6054, -4294, 3954, 10047, 6166, 10926, 13971, 4451, -3237, 767, 1584, -303, -603, -3232, -15154, -15377, -17348, -19560, -11523, -3680, -8268, -10028, -4000, 3434, 261, -4341, -5818, -7981, -8462, -4510, -3745, -2313, 6308, 20907, 11394, 7461, -3076, -10823, -5092, -2605, 527, 8324, 5965, -9426, -14569, -6692, -808, -5473, -5184, 3466, 244, -6427, -8178, -5992, -937, 4026, -1590, -4867, -7570, -3088, -1504, -3229, -8221, -8579, -4610, -5307, -11748, -6879, -4095, -3145, 208, -3108, -4726, -6492, -10683, -12896, -7766, -7368, -9826, -15797]
2415a5797l314l008P183L529j208k999J6216P792m957l904J631P085l354J669
2401F564M944q473q103Q677L742L437m266o008l529n02K014R760m60K952q440
2386B309p623j0869M851P191J050m637q37P418j113p03M982j754k366k068O518
2371B349M372j200n208m336l34k848P081n540j257j17j070M374J3589o483m23
2356B949L941o677r388J178J6151N040L794O482M267J480j0529p018q335j0891
2342g556P040Q093O588l932o678m475J0761j98j825p07l78m553O176r220l934
2327d798N025J305q131j1737M124N674m735o063J694M577N195M327R25N902J8957
2312B2241N428m064p113p115j647L86J139j134n136J0815O212j0570n637M227
$$ y = [-15797, -19111, -22119, -14936, -11407, -12615, -15614, 602, 8394, 3437, -467, 1164, 8249, 4895, 6564, 11508, 3035, -5068, 3609, 7351, 10788, 6522, 514, -3015, -3517, -1503, 8257, 7797, 10749, 2309, -5314, -16183, -11332, -4141, -3091, -7728, -8565, -1147, -2260, -2963, 2019, 265, -2101, -4169, 2349, 6721, 5521, 313, -4023, -4357, -7205, -124, -5664, -6921, -7038, -8108, -3734, 9855, 3372, 2949, 6890, 213, -9175, -7997, 8154, 13194, 16988, 23470, 27737, 29217, 18688, 11670, 3335, -7556, -516, 7577, 14165, 10233, 3555, -920, 9841, 9643, 7818, 7111, 6733, 2180, 8356, -864, -4798, 227, 1532, -6599, -18336, -14212, -8538, -13273, -19336, -17642, -13065, -7870, -3543, -2618, 3284, 22241, 27669, 23605, 16492, 9377, 7730, 8116, 9255, 8121, 2985, 13800, 20012, 9442, 3805, 8032]
2298H032L172o258M263J5442M148r485o34K283r847j3498M448N868O862m968j3962
2283d134j0940k954K100M831K177Q978q34m51n34j63o635O181M819N538J0837
2268A8816j006m786k310k246j338k095K08o58j726n81R95p0L867L7j11J107M114
2251A2217n739p165O798Q055k095j0044M498l309l413m674p945q320M147J4127
2237b862L935n667R302P014M030J0075k582p766r569m518n32K067N667q310l108
2222b824n356m020O724j078O407N316O167l445L164o3Q21k074l694O637o761j3188
2206g267P75J4423K884k262o256K101o285j798l275j596K237M394m103j759m9
2191g836R72K594K257r99k400Q002J361P264J849N17p552q029j063P681m895n702
$$ y = [8032, 11204, 4946, 9209, 24651, 28799, 19314, 18680, 20963, 11116, -2382, 2066, 7934, 14796, 9828, -4134, -15074, -18028, -15928, -11097, -8920, 58, -776, -1227, -1761, -1924, -8559, -2378, 2441, 7979, 18816, 17810, 13024, 10714, 8468, 7130, 5035, 5243, 4585, 2859, 2278, 3273, 3203, 7070, 7107, 6996, 8103, 12217, 6478, -687, 6111, 14166, 12071, 2027, 6525, 3216, -197, -4871, -12816, -21136, -16989, -2862, 1073, -4594, 4708, 11722, 15752, 25827, 23245, 15479, 5910, 1392, 860, 2927, 8594, 284, -2824, -8180, -12200, -5476, -6554, -147, 5169, 11336, 7891, 11055, 10992, 11813, 9739, 6045, 12682, 5921, -7267, -6492, 7931, 10815, 8553, 2297, 4398, -1887, -3685, -6960, -8556, -6319, -1925, -6028, -7787, -7836, -6864, -4270, -2013, -3012, -5412, 2590, 3951, 11215, 13064, 13581, 6029, -2000, -3063, 4618, -277, -5979]
2175e979m665J096N59N406J1793M356l005n718M277k487q798k253p348m99m62
2160a3727n166p49J0469Q306O157N241J355M595m82j990o078n940q400J999K252
2145b158k070J903J612K605r95J0502K801P294l959p759k275m540m747n12l267
2130e565L074o553J286m869j138k88M064J775N067J2111j155n627j462m484j883
2115e647M31j9945k538J5874R956L772k298L807Q438k640p658N461p106j5589
2101a5682m168M36P28J4218N571q893j678J14K095n539r828J453N242Q858K632
2086d441M423O717k221K56M77J699n679m155K113K008J2675k59q214n967o577
2071g145n440k621K002J0674K080l623N507R422l486n940m6j178M273K459J296
$$ y = [-5979, -10644, -9548, -8989, -3583, 8210, 12566, 9561, 3843, 8120, 5633, -3165, -5418, -12766, -13265, -13727, -18893, -19642, -9173, -867, 5290, 10531, 11886, 16481, 15999, 14009, 7931, 1991, -6409, -4410, -2158, -4228, -2325, -713, 1892, 897, 11399, 14200, 21494, 17535, 9776, 7501, 2961, -1786, -2298, -5565, -2491, -9044, -7758, -12627, -13765, -14053, -9989, -8214, -3147, 8964, 7809, 2182, 720, -3764, -5647, -5216, -25161, -27699, -11825, -1869, 1903, -395, 3412, 11850, 9210, 1552, 7013, -93, -15682, -19850, -19414, -18686, -4468, 1103, -7790, -9468, -9354, -7259, -12798, -22626, -21173, -15931, -7073, -4441, -18, 6699, 4478, 4734, 5211, 6910, 1231, -2924, -811, 1197, 13872, 13613, 5399, -568, -7145, -12585, -15206, -13204, -2530, -450, -4073, 1434, 10856, 7370, 1430, 1384, 206, 4479, 6938, 8234]
2056H234K623L558k269q222P87m018j1017r950L389L836n93P883J7489O364K599
2041B0693m47L030K975l848j6126j5558j864J1776l135n610j168R812O729O321
2027A3580n463k637L569N223N431l796q334k494J4761j353j7842r613n37J550
2013g955l658J832n028J0389J1251L312n704j5175j258L197O445j339k336j466
1999g493N247N108k423J487K618l809r832m252J0287q06Q69M771p672K335o887
1984a0452O966J1267N258j267n821J142M19n647o794n536k350r68P360K118K815
1969a490n27l442K298O015m200L858n010k792J3684L577M3m419p006o690P03L996
1953a402j2261n741K827R509R921l777m45K668J1916j1222l296R750O953N267
$$ y = [8234, 10857, 14415, 12146, 3924, 4711, 693, -10324, -20274, -16885, -13049, -13642, -5759, 11730, 18094, 20693, 20246, 23276, 26251, 22403, 6277, -9281, -11145, 631, -2504, -8114, -9282, 530, 7259, 13580, 8117, 5480, 9049, 14272, 19703, 15907, 7573, 5079, 19840, 18487, 645, -8968, -9505, -7955, -11613, -9781, -14809, -4420, 6831, 10143, 4439, -10736, -11994, -8797, -2352, -3691, -6027, -7493, -2246, 2862, 439, 1926, 4544, 735, -9097, -13349, -3062, -3868, -2999, 1772, -5900, -3565, -10452, -3486, 7781, 13039, 11772, 5951, 7093, 7512, 1865, -4929, -10465, -12815, -13783, -6423, -4305, -1490, -2017, -5459, -3161, 2854, -1346, 2512, -2498, -5290, 8394, 11971, 12014, 7595, 589, -6101, -5398, -1402, -13663, -19404, -16577, -7068, 2853, -924, -1369, 1299, 13215, 1993, -1303, 8447, 15400, 20667]
1939B0667n680n998N25r79L387o027n011k521Q434p87j1666k397N701M803J996
1924D447j1428m245L54q686o272L043J2021L838P489m113j427r814J2551R208
1910F966P44O85q335p447N511p387j3810K514P447k297L929M085L888r360j3270
1895b6137o095N580J1508J0918l938L637P125L760K06l034M944l02j3940j585
1881g353L733R900L148n919j967k935j0543J612M5K42N292l291O715P784L283
$$ y = [20667, 14987, 8989, 9514, 8535, 11922, 5895, 884, -1637, 6797, 6010, -5656, -8053, -2352, 2451, 4447, -6981, -11226, -10872, -19558, -25830, -22787, -10766, -6928, 561, -3552, -4979, -14793, -2242, 6966, 7710, 8395, 60, -7387, -1876, -9263, -23073, -20559, -13112, -15409, -11480, -7395, -3507, -12867, -26137, -32232, -26652, -15144, -4226, -8164, -4527, 2598, 6358, 6564, 3530, 8474, 8172, -5768, -7353, -3620, 6280, 9428, 3509, 1542, -1393, -11936, -10324, -10279, -10037, -4745, -8036, -1321, 6463, 9746]
$$ [...]
##END NTUPLES=NMR SPECTRUM
##END=
