##TITLE=Analysis number 324870
Compound Code cc 60601
Book Reference 486/84
Project Code adrs
Chemist Name simons
##JCAMPDX= 6.0         $$ Bruker NMR JCAMP-DX V2.0
##DATA TYPE= NMR SPECTRUM
##DATA CLASS= NTUPLES
##ORIGIN= Bruker BioSpin GmbH
##OWNER= nmr
$$ XWIN-NMR		Version 3.5
$$ Mon Dec  4 12:39:14 2006 GMT Standard Time (UT+0h)  MAYBRIDGE\nmr@NMR_250MHZ
##.OBSERVE FREQUENCY= 250.131544655141
##.OBSERVE NUCLEUS= ^1H
##.ACQUISITION MODE= SIMULTANEOUS (DQD)
##.ACQUISITION SCHEME= undefined
##.AVERAGES= 16
##.DIGITISER RES= 18
##SPECTROMETER/DATA SYSTEM= dpx250
##.PULSE SEQUENCE= zg30
##.SOLVENT NAME= DMSO
##.SHIFT REFERENCE= (INTERNAL, DMSO, 0, 16.522)
##AUDIT TRAIL= $$ (NUMBER, WHEN, WHO, WHERE, WHAT)
$$ ##TITLE= Audit trail, XWIN-NMR		Version 3.5
$$ ##JCAMPDX= 5.01
$$ ##ORIGIN= Bruker BioSpin GmbH
$$ ##OWNER= nmr
$$ C:\u/data/dgb/nmr/ADRS/170/pdata/1/auditp.txt
$$ ##AUDIT TRAIL=  $$ (NUMBER, WHEN, WHO, WHERE, WHAT)
(   1,<2006-12-04 12:38:41.50 +000>,<MAYBRIDGE\nmr>,<NMR_250MHZ>,
      <created by zg, POWCHK disabled, PULCHK disabled
       configuration hash MD5:
       49 4B E0 1D 92 C2 6B 37 9F E6 65 BC 52 41 86 1D
       data hash MD5: 64K
       DA C1 0F 30 A0 63 73 1C 3A 4B D4 D8 8B C9 7A A9>)
(   2,<2006-12-04 12:38:56.26 +000>,<MAYBRIDGE\nmr>,<NMR_250MHZ>,
      <Start of raw data processing
       ef LB = 0.3 FT_mod = 6 PKNL = 1 SI = 32K 
       data hash MD5: 32K
       5E 11 40 86 EB 97 8B B9 1F 89 F6 03 18 40 A2 38>)
(   3,<2006-12-04 12:39:00.59 +000>,<MAYBRIDGE\nmr>,<NMR_250MHZ>,
      <apk 
       data hash MD5: 32K
       87 8F 38 D2 ED 49 FF A5 E1 3D E9 E3 44 05 E3 69>)
(   4,<2006-12-04 12:39:02.12 +000>,<MAYBRIDGE\nmr>,<NMR_250MHZ>,
      <abs ABSG = 5 
       data hash MD5: 32K
       93 2E 2D 79 79 7E 7A F8 B5 E4 32 56 E4 98 E2 E2>)
$$ ##END=
$$ 
$$ hash MD5
$$ 45 CF 8B 6E 02 91 92 88 A1 EE CB A7 04 DD BC F7
##$RELAX= 
##$RELAX= 
##$RELAX= 
##$RELAX= 
##$RELAX= 
##$RELAX= 
##$RELAX= 
$$ Bruker specific parameters
$$ --------------------------
##$DU= <C:\u>
##$EXPNO= 170
##$NAME= <ADRS>
##$PROCNO= 1
##$TYPE= <nmr>
##$USER= <dgb>
##$AMP= (0..31)
100 100 100 100 100 100 100 100 100 100 100 100 100 100 100 100 100 100 
100 100 100 100 100 100 100 100 100 100 100 100 100 100 
##$AQSEQ= 0
##$AQ_mod= 3
##$AUNM= <au_zg>
##$AUTOPOS= <25 >
##$BF1= 250.13
##$BF2= 250.13
##$BF3= 250.13
##$BF4= 250.13
##$BF5= 500.13
##$BF6= 500.13
##$BF7= 500.13
##$BF8= 500.13
##$BYTORDA= 1
##$CFDGTYP= 0
##$CFRGTYP= 5
##$CHEMSTR= <none>
##$CNST= (0..31)
1 1 145 1 1 1 1 1 1 1 1 1 1 1 1 1 1 1 1 1 1 1 1 1 1 1 1 1 1 1 1 1 
##$CPDPRG= <>
##$CPDPRG1= <>
##$CPDPRG2= <>
##$CPDPRG3= <>
##$CPDPRG4= <mlev>
##$CPDPRG5= <mlev>
##$CPDPRG6= <mlev>
##$CPDPRG7= <mlev>
##$CPDPRG8= <mlev>
##$CPDPRGB= <>
##$CPDPRGT= <>
##$D= (0..31)
0 1 0 0 0 0 0 0 0 0.06 0 0 0 0 0 0 0.0002 0 0 0 0 0 0 0 0 0 0 0 0 0 0 
0 
##$DATE= 1165235920
##$DBL= (0..7)
120 120 120 120 120 120 120 120 
##$DBP= (0..7)
150 150 150 150 150 150 150 150 
##$DBP07= 0
##$DBPNAM0= <>
##$DBPNAM1= <>
$$ [...]
##$SUBNAM7= <"">
##$SUBNAM8= <"">
##$SUBNAM9= <"">
##$SW= 20.6930455092707
##$SWIBOX= (0..15)
0 0 3 0 0 0 0 0 0 0 0 0 0 0 0 0 
##$SW_h= 5175.983436853
##$TD= 65536
##$TD0= 1
##$TE= 294.16
##$TE2= 300
##$TE3= 300
##$TEG= 300
##$TL= (0..7)
0 120 120 120 120 120 120 120 
##$TP= (0..7)
150 150 150 150 150 150 150 150 
##$TP07= 0
##$TPNAME0= <>
##$TPNAME1= <>
##$TPNAME2= <>
##$TPNAME3= <>
##$TPNAME4= <>
##$TPNAME5= <>
##$TPNAME6= <>
##$TPNAME7= <>
##$TPOAL= (0..7)
0.5 0.5 0.5 0.5 0.5 0.5 0.5 0.5 
##$TPOFFS= (0..7)
0 0 0 0 0 0 0 0 
##$TUNHIN= 0
##$TUNHOUT= 0
##$TUNXOUT= 0
##$USERA1= <user>
##$USERA2= <user>
##$USERA3= <user>
##$USERA4= <user>
##$USERA5= <user>
##$V9= 5
##$VALIST= <valist>
##$VCLIST= <CCCCCCCCCCCCCCC>
##$VD= 0
##$VDLIST= <DDDDDDDDDDDDDDD>
##$VPLIST= <PPPPPPPPPPPPPPP>
##$VTLIST= <TTTTTTTTTTTTTTT>
##$WBST= 1024
##$WBSW= 4
##$XGAIN= (0..3)
0 0 0 0 
##$XL= 0
##$YL= 0
##$YMAX_a= 313795
##$YMIN_a= -413728
##$ZGOPTNS= <>
##$ZL1= 120
##$ZL2= 120
##$ZL3= 120
##$ZL4= 120
##$ABSF1= 16.522
##$ABSF2= -4.171173
##$ABSG= 5
##$ABSL= 3
##$ALPHA= 0
##$AQORDER= 0
##$ASSFAC= 0
##$ASSFACI= 0
##$ASSFACX= 0
##$ASSWID= 0
##$AUNMP= <proc_1d>
##$AZFE= 0.1
##$AZFW= 0.1
##$BCFW= 0
##$BC_mod= 0
##$BYTORDP= 0
##$COROFFS= 0
##$CY= 12.5
##$DATMOD= 1
##$DC= 0
##$DFILT= <>
##$DTYPP= 0
##$F1P= 14.0000005364418
##$F2P= -0.99999901652339
##$FCOR= 0.5
##$FTSIZE= 32768
##$FT_mod= 6
##$GAMMA= 0
##$GB= 0
##$INTBC= 1
##$INTSCL= 1
##$ISEN= 128
##$LB= 0.3
##$LEV0= 0
##$LPBIN= 0
##$MAXI= 10000
##$MC2= 0
##$MEAN= 0
##$ME_mod= 0
##$MI= 0
##$NCOEF= 0
##$NC_proc= -3
##$NLEV= 6
##$NOISF1= 0
##$NOISF2= 0
##$NSP= 0
##$NTH_PI= 0
##$NZP= 0
##$OFFSET= 16.522
##$PC= 1
##$PHC0= 212.5846
##$PHC1= 5.782504
##$PH_mod= 1
##$PKNL= yes
##$PPARMOD= 0
##$PSCAL= 4
##$PSIGN= 0
##$REVERSE= no
##$SF= 250.13
##$SI= 32768
##$SIGF1= 0
##$SIGF2= 0
##$SINO= 400
##$SIOLD= 32768
##$SREGLST= <1H.DMSO>
##$SSB= 0
##$STSI= 32768
##$STSR= 0
##$SW_p= 5175.98343685301
##$SYMM= 0
##$S_DEV= 0
##$TDeff= 65536
##$TDoff= 0
##$TI= <Analysis number 999999
Compound Code 99
Book Reference 9
Project Code 9>
##$TILT= no
##$TM1= 0
##$TM2= 0
##$TOPLEV= 0
##$USERP1= <user>
##$USERP2= <user>
##$USERP3= <user>
##$USERP4= <user>
##$USERP5= <user>
##$WDW= 1
##$XDIM= 32768
##$YMAX_p= 315180064
##$YMIN_p= -110894
$$ End of Bruker specific parameters
$$ ---------------------------------
##NTUPLES= NMR SPECTRUM
##VAR_NAME=  FREQUENCY,     SPECTRUM/REAL,   SPECTRUM/IMAG
##SYMBOL=    X,             R,               I
##VAR_TYPE=  INDEPENDENT,   DEPENDENT,       DEPENDENT
##VAR_FORM=  AFFN,          ASDF,            ASDF
##VAR_DIM=   32768,         32768,           32768
##UNITS=     HZ,            ARBITRARY UNITS, ARBITRARY UNITS
##FACTOR=    0.157963299565203, 1,           1
##FIRST=     4132.6476996994, 0,             0
##LAST=      -1043.33573715361, 0,           0
##MIN=       -1043.33573715361, -110894,     0
##MAX=       4132.6476996994, 315180064,     0
$$ Real data points
##PAGE= N=1
##DATA TABLE= (X++(R..R)), XYDATA
$$ [...]
18772C49427K1634j8362k2892j9979j9648K460L004k5457l5999o6497n9359O241
18760A14573L45Q011J0593k5303k4065L5499j3658k5857N818R302j2001R199N139
18747I7595M288j1766j7464k734K6710o044k3041o565k341K7549K0508j5722j387
18734H9586R527J4407J292q271j618J9629J9424L6618L532J5429J9770R802L5436
18721B64563Q571p592j1839m761r390O416k1273j8746j3066j2651m956J81r85
18708A74472k6023m9534l7345j3753J596j1689j3997K927k915J7981L7903J0403
18696I0026j8014l2107K1306P815o346J6387J5714r95J7177L5927J4015k513j2764
18683A45628k017k2230k2637o475Q002K7541L6031K796N643j9757K723P412m059
$$ y = [349427, 371061, 352699, 329807, 309828, 290180, 292640, 295644, 270187, 234188, 167691, 108332, 114573, 114918, 122929, 133522, 108219, 84154, 119653, 105995, 80138, 85956, 95258, 83257, 92456, 97595, 101883, 90117, 72653, 69919, 96629, 90585, 67544, 60979, 58638, 86187, 106695, 90973, 89586, 99113, 113520, 114812, 106541, 104923, 124552, 143976, 180594, 184126, 199555, 219325, 229127, 264563, 273134, 265542, 253703, 248942, 239552, 245968, 224695, 205949, 192883, 180232, 175276, 175457, 174472, 148449, 98915, 61570, 47817, 49413, 37724, 23727, 26654, 23739, 41720, 79623, 90026, 72012, 39905, 61211, 69026, 62680, 79067, 94781, 93786, 110963, 146890, 160905, 158392, 145628, 143611, 121381, 98744, 92269, 100271, 127812, 163843, 166639, 172282, 152525, 155248, 162660, 158601]
18670A58601M120J7546J3553k1125j1116K2302N426k3424j2829J8856q392l3558
18658A29960l3410K078L68j7056k5448j4731j8674j4785L4059M2662J6274j9911
18646H1386j6445L2375O5355m337k8303K2407n24l831J3034J3294k0275k6561
18634A27575J4409J1086K2264J7340n327J4779j9692J4051M3598N405j0076L1617
18622B67029N2059J4982m912k411r961L0415K6998K8188N8722K5346M0072M8367
18610E74894O0113N9100Q0486J02763O8440K4297K0336M5185N7767K5625M9727
18599A168733R9895J45979J82068K42641L25932M29921O19183Q65617J126919
18590E206888J429890J775771K078620K371801K548005K793392L234391L708271
$$ y = [158601, 162721, 180267, 193820, 172695, 161579, 183881, 189307, 165883, 153054, 171910, 163518, 129960, 96550, 98628, 98996, 81940, 56492, 41761, 23087, 8302, 42361, 85023, 101297, 81386, 64941, 97316, 162671, 158334, 130031, 152438, 151914, 148083, 161117, 174411, 154136, 127575, 141984, 153070, 175334, 192674, 187347, 202126, 182434, 196485, 240083, 245488, 235412, 267029, 319088, 334070, 329158, 326747, 316786, 347201, 374199, 402387, 461109, 486455, 526527, 574894, 635007, 694107, 774593, 877356, 945796, 970093, 990429, 1035614, 1093381, 1119006, 1168733, 1268628, 1414607, 1596675, 1839316, 2165248, 2595169, 3214352, 4079969, 5206888, 6636778, 8412549, 10491169, 12862970, 15410975, 18204367, 21438758, 25147029]
18582B5147029L618091J914126q94082j924435k062724l768160n320823m743720
18574A1965302l290607k117058j414666r68434o35181m93008l67494k70469j85863
18565B222522j28635q8921k2526L2531L3501O9445J20201J48756J13558M3934
18555B544366Q109K8960M0798K787J8739R7003J93361K80353L51283N25820P38503
18544D830082J004271J359624J852449K429870L033747L620872M013111M316161
18536B6460187M808521N611884O419330O355118L307129j764229l409331l355799
18528D4432810o524885r657198q453636n688476l610933k360862j589525j121538
18520E425757p99744n82125m45700l24545k52091j89721j46705j07333n1481L149
$$ y = [25147029, 28765120, 30679246, 29785164, 27860729, 25798005, 22029845, 16709022, 11965302, 8674695, 6557637, 5142971, 4174537, 3539356, 3046348, 2678854, 2408385, 2222522, 2093887, 2004966, 1982440, 2014971, 2048472, 2117917, 2238118, 2386874, 2500432, 2544366, 2552475, 2581435, 2622233, 2625020, 2643759, 2740762, 2934123, 3214476, 3565759, 4091579, 4830082, 5834353, 7193977, 9046426, 11476296, 14510043, 18130915, 22144026, 26460187, 31268708, 36880592, 43299922, 49655040, 52962169, 51197940, 47788609, 44432810, 37907925, 28250727, 19797091, 14108615, 10497682, 8136820, 6547295, 5425757, 4626013, 4043888, 3598188, 3273643, 3021552, 2831831, 2685126, 2577793, 2526312, 2529461]
18510B529461L4371k9908n1787j42367j14989o9404r0051j09752r9414l5329L5959
18499A856790J11890J55870K18864K44811K98876N14458P84848J044997J296127
18490F527531J559308J759684J894671K080824K446285K779622K683952J285437
18482B3017314q70620j453472j457106l007771m352151l670212k392302j526503
18474D287177j008784o58389m63078l33549k46439j93400j71957j33128p7169
18465A001284q2708q6809n5002K335l257k3027m017j2097m9229n4578o0271p8972
18453D93652p9121o3491p8620m3019j3237j0144n810k3189j4255l70L6349R387
18441B08132l8816l4414J1968M887J2615K0918J2728q928j3697r024k588j6362
$$ y = [2529461, 2563832, 2533924, 2482137, 2339770, 2224781, 2155377, 2065326, 1955574, 1856160, 1820831, 1856790, 1968680, 2124550, 2343414, 2588225, 2887101, 3401559, 4186407, 5231404, 6527531, 8086839, 9846523, 11741194, 13822018, 16268303, 19047925, 21731877, 23017314, 22146694, 20693222, 19236116, 16228345, 11876194, 8205982, 5813680, 4287177, 3278393, 2620004, 2156926, 1823377, 1576938, 1383538, 1211581, 1078453, 1001284, 918576, 831767, 776765, 779100, 775843, 752816, 748799, 736702, 687473, 632895, 572624, 493652, 414531, 351040, 272420, 229401, 216164, 206020, 200210, 177021, 162766, 162396, 198745, 208132, 169316, 134902, 146870, 151757, 164372, 185290, 198018, 189090, 175393, 166369, 163781, 147419]
18429A47419k9976J505O687j8703k2691P4J0205J0105K2245J0681j3603l8109
18417H5839J428L6125R493N100k555k4178J4864M2085O033k0890k5429k5794J0275
18404A12396O439k464j8837l2232k8342K6970L0615J9303J495k8644k1513J319
18392F6505j1027l005j0615k297L7585J1588P98j1512q007l345k5946k2787J6048
18379C3983J0620q779j6832l571l277m698o231J3980J5540J9461J295L509L2381
18366H7381N998J9728K6261K955j9208k4648l122Q661P808k4686K412j8692j7894
18353E2954k9627P29N905J5502N921p464K8078M740J8487Q664R184L8115K598
18340A53786J9420J620K978K8480L983K476r863K60M760k4244k491k5714m806
$$ y = [147419, 117443, 118948, 125635, 106932, 84241, 84315, 94520, 104625, 126870, 137551, 123948, 85839, 87267, 123392, 132885, 137985, 135430, 111252, 126116, 168201, 174234, 153344, 127915, 102121, 112396, 118835, 116371, 97534, 65302, 36960, 63930, 94545, 113848, 115343, 86699, 65186, 66505, 55478, 52473, 41858, 39561, 77146, 88734, 89532, 78020, 70013, 66668, 40722, 17935, 33983, 44603, 35824, 18992, 15421, 12144, 7446, 1215, 15195, 30735, 50196, 51491, 55000, 87381, 93379, 113107, 139368, 142323, 123115, 98467, 95345, 104006, 111814, 87128, 89540, 70848, 52954, 23327, 24056, 29961, 45463, 51384, 43920, 71998, 76738, 95225, 103889, 113073, 151188, 153786, 173206, 174826, 177804, 206284, 210267, 212743, 202880, 203140, 207900, 183656, 181165, 155451, 150645]
18327A50645L6924L9586K2464k047p888j2082j1221K4631J1147k4377l4220m9336
18315A44226k4826j0321R966j5679j0797l0346j0019k145j4186n920K3826M261
18303E8040L680k023J388r996k1212j8311m253j441K2905K4341n131p151j6770
18290B4066m0479k2653J5623K7068j0722l4759j3352L0912L6660M3611k3359k6473
18278F143m792J0268p147j8914J6575r330j0886j930R493L1584J3737J0387Q693
18265E3881L881j4196j0951n384J1287j0121j6599j4136L939K908m422j6331J3614
18252b630J9718J1664r199k3859j3798N107K7193k546p134O880K6593M305k9287
18239A3007l7030n422K0711j2488j2152j2368J4699J724J9655J9367j3759j0841
$$ y = [150645, 187569, 227155, 249619, 247572, 239684, 227602, 216381, 241012, 252159, 227782, 193562, 144226, 119400, 109079, 119045, 103366, 92569, 62223, 52204, 50059, 35873, 29953, 53779, 58040, 61720, 59697, 61085, 51089, 29877, 11566, 7313, 5872, 28777, 53118, 47987, 40836, 24066, -16413, -39066, -23443, 3625, -7097, -41856, -55208, -24296, 12364, 55975, 32616, 6143, 1351, 11619, 4472, -14442, 2133, -7197, -18083, -20013, -10520, 21064, 34801, 45188, 53881, 57762, 43566, 32615, 27231, 38518, 28397, 11798, -2338, 1601, 4509, 87, -16244, -2630, 17088, 28752, 19553, -4306, -18104, -12997, 14196, 11650, 4516, 11396, 37989, 42294, 13007, -24023, -29445, -8734, -21222, -33374, -45742, -31043, -29319, -9664, 9703, -4056, -14897]
18227a4897j1317K1013j8828k6402Q834K8084O162J0629j9382K702K0551P449
18215A4598K153j6135j5703j891J1407P331j76l0528M730K9137K325m868j4683
18202a2303j0822r335K0796K0739O624K102r921k0063J981J5236j2052K3733L008
18189A9723p095l334J152j2438j729J567j8855k1526K8548J3987q47r08R810j9387
18175a1332M850L1384q121J1315k0637j8976p999j2510J0992J2321r610k6201
18163d4524R959J666K8823J53j7234K4300P180J3059j4790k952Q797j9942J8373
18150A2868K3468R001j8590k0000N656m1669j9832J4769M1485L0334p413L36j5355
18137A5058q573j7471j3933K5817K6761J7110J550L144j802j8595L1053l062l2861
$$ y = [-14897, -26214, -5201, -24029, -50431, -41597, -13513, -7351, 3278, -16104, -13402, 7149, 14598, 16751, 616, -15087, -16978, -5571, 1760, 1584, -28944, -24214, 4923, 7248, 2380, -12303, -23125, -32460, -11664, 9075, 15699, 17801, 7880, -12183, -10202, 5034, -7018, 16715, 19723, 12628, 9294, 10446, -1992, -3721, -2154, -21009, -42535, -13987, 0, -847, -1755, 8055, -11332, -6482, 24902, 16781, 28096, 7459, -11517, -19516, -32026, -21034, -8713, -18323, -44524, -34565, -32899, -4076, -3923, -21157, 3143, 10323, 23382, 8592, 5640, 14437, -5505, 12868, 36336, 45337, 26747, 6747, 12403, -29266, -49098, -34329, 7156, 37490, 30077, 30413, 15058, 6485, -10986, -24919, 898, 27659, 44769, 46319, 49463, 47661, 29066, 60119, 57057, 24196]
18124B4196j0722k4452Q760L1814J5054l0484k4287r360o410L1134L9495L088
18112D7826k4162l6787j168J3068P497k2969R831L3008P41J3550j1526j0078O44
18099A9475L728Q18J8145l696M386j3039j2760l058J4388J9608k8086k4166k062
18086f319L2414L9618R418o248j2572r998o122j736k5326r482R459K3839J7671
18073E4616Q407l734p419K6259p555l1282K8074Q654J3314Q869j8720p441k756
18060F9286j287M689q643j2315o325k6167r139J6298j0318j5283J5460j3717k1535
18047a8996J9643J3282J5431M484k3300L849r413J5995K6121M161N728k2960l1834
18034B191J4492N396k2930J8196R728j032L584J4768j394J4929K6782l395J0988
$$ y = [24196, 13474, -10978, -2218, 29596, 44650, 14166, -10121, -19481, -25891, 5243, 44738, 47826, 23664, -13123, -14291, -1223, 6274, -16695, -6864, 26144, 26885, 40435, 28909, 18831, 19475, 23203, 24021, 42166, 38470, 42856, 29817, 17057, 13999, 28387, 47995, 19909, -4257, -6319, 26095, 65713, 75131, 68883, 56311, 46313, 40191, 38455, 13129, 3647, 13106, 36945, 54616, 63023, 59289, 51870, 78129, 70574, 39292, 67366, 76020, 89334, 98203, 79483, 72042, 69286, 67999, 72688, 64045, 51730, 45405, 19238, 10099, 26397, 16079, 796, 16256, 2539, -18996, 647, 13929, 29360, 33844, 10544, 14393, 4980, 20975, 47096, 51257, 56985, 34025, 2191, 16683, 22079, -851, 17345, 27073, 26041, 29625, 44393, 42999, 57928, 84710, 81315, 92303]
18021I2303K9045L1273J5842q63p925K9263J3425j00k3480l0554l7581k1825j7748
18008G1075k4942q396J1894j5307k8963q743K3401N356P595J538J642o568M047
17995C3629l0409k803K8805R781m4453k1541P494N779K6878J4950l95l694J5309
17982C9330K2333r722j6614j0662K3474k1193k8999J0721L016j734J5205J3576
17970C8731K7251J4703J3553j887l7800j5509j1702l960j7972K8156K9694k8086
17958C5172l701j560p683j6191k10J3542M500N07o243K8322j6437J818J8767l2670
17944A7933n988J0481J3778n707j4632j4737k665R329j8162J3194J9211O912J0931
17931C9878q70J5k8220m257J8046k073k4595Q204K8044j6019j4600Q102j1955
$$ y = [92303, 121348, 152621, 168463, 167600, 159675, 188938, 202363, 202263, 178783, 148229, 110648, 88823, 71075, 46133, 37737, 49631, 34324, 5361, -3382, 20019, 25375, 32970, 34508, 36150, 29582, 33629, 3220, 417, 29222, 39003, -5450, -26991, -19497, -13718, 13160, 28110, 27715, 24021, 39330, 61663, 51941, 35327, 24665, 48139, 26946, -2053, 8668, 11684, 9950, 25155, 38731, 65982, 80685, 94238, 92351, 54551, 39042, 27340, 23380, 5408, 33564, 63258, 35172, 31471, 29911, 22228, 6037, 5827, 19369, 23869, 24376, 18133, 46455, 30018, 31836, 50603, 17933, 11945, 22426, 36204, 30497, 15865, 1128, -1537, 7792, -10370, 2824, 22035, 28947, 39878, 39008, 39023, 10803, 6546, 24592, 22519, -2076, 6128, 34172, 18153, 3553, 11655, -300]
17918c00j2086J02k992J1844J6882K3830K4298J2093n547l7544K2572K5049J4908
17905I3109K4546R136K9966J9835l115K4529N9395L3861j6437q616m4044k0961
17893B01204n922J9522l177m6498k8763K7853M6209K7211M0517L8260N533k1247
17881C00702m8037p7317n7506j4560j4384O742P971p271k8474j5587K6716Q566
17869H7561k4201j6823j3964m188p52k8729M456J1538Q413J1341m572r523j1280
17856I277Q029L2977k0688j9762r64j5856j1427k1835K3846L0092r326j4197O460
17843c374J2253R159j0276r347q015k4882P302M3045L1511k6996j4402K462M349
17830A2789L793l3190J8928K9884O683Q142K284k7917j7426J4456p098j4860L479
$$ y = [-300, -12386, -12284, -15276, -3432, 13450, 37280, 61578, 73671, 68124, 30580, 53152, 78201, 93109, 117655, 126791, 156757, 176592, 173477, 198006, 257401, 291262, 274825, 266209, 222165, 201204, 195282, 214804, 211627, 165129, 136366, 164219, 210428, 237639, 278156, 316416, 321949, 300702, 252665, 175348, 117842, 103282, 88898, 95640, 103611, 96340, 67866, 52279, 78995, 87561, 63360, 46537, 32573, 28385, 27633, -1096, 3360, 14898, 23311, 34652, 30080, 20557, 9277, 17306, 50283, 29595, 9833, 8869, -6987, -18414, -40249, -16403, 13689, 4363, -9834, -3374, 8879, 18038, 7762, -1585, -9600, -34482, -27180, 15865, 47376, 20380, 5978, 8440, 12789, 16582, -16608, 2320, 32204, 38887, 47029, 49313, 21396, 3970, 18426, 11328, -3532, -53]
17817e3J9697J1505j5091J914K7837O347l485l3305J327J4884P479k6019j7835
17804d798Q427K9106R97j2050j1560k646K989j0649J3788J0329j2851K7831J822
17791D0735L957j788k8322p798m447P153k928j0982k3817N518L2488k008r47J176
17777G990K8908N953k6052j2673K9466J5791k1650k7872M187J2058M424j973M932
17764B3489j5838n711k7272k1116J6541J0791m039q030j2856M912j0624n345M1089
17751a4009R697R315K4684J038K196k1668j3185K0817N348k3728k5332J8608r30
17738g149o051j7529j0147k605J9885R686j9300q887J2092J0292k460j8316J0369
17725c0120j3612j5250Q597J426J1215K5378L8253j4014k1563k213q555O67K5645
$$ y = [-53, 19644, 31149, 16058, 17972, 45809, 52156, 48671, 15366, 16693, 31577, 39056, 13037, -4798, 3629, 32735, 33732, 21682, 10122, 7476, 10465, -184, 13604, 23933, 11082, 38913, 40735, 44692, 42904, 14582, 6784, 2337, 9490, 6562, -4420, -28237, -22719, 9769, 7761, 6814, 7990, 36898, 42851, 16799, 4126, 33592, 49383, 27733, -139, 4048, 16106, 20530, 18557, 23489, 7651, 1940, -25332, -46448, -29907, -19116, -23155, -31185, -44041, -39129, -49753, -55098, -14009, -4312, 5003, 29687, 30725, 32921, 11253, -1932, 18885, 24233, 505, -24827, -6219, -7149, -13200, -30729, -40876, -43481, -23596, -13910, -33210, -42097, -30005, -19713, -22173, -40489, -30120, -43732, -58982, -50385, -48959, -37744, -12366, 25887, 11873, -9690, -11903, -20458, -19791, 5854]
17712E854N48J5396j0220j4432j2179k6308O995N855P770K1619K0198n503k3001
17699g408j7244l994j4155j2348J3563k855K081K511J4895O896j5738J2826J0201
17686a0769J1090J2169J0828k3149j4985l304J0462N493j5983Q987K336J846K8766
17673B3787K0922K422o099P606J1042l6105j6762k9706n155l160J1846J7209j8639
17660b0792j1355J8296N297j2576J854K3019K5593M541K0116j2005j9314m547
17648A8127j4467R331k2471o942J4323k1409J3704r537k0756J7398K2807K7162
17636B7270L6375j978k6211j7916J1593m699k1375L618Q338K842o679K318n949
17623G547j1673l194j2285n307J1572N775K1896J2679J9742J8086j2209k5687
$$ y = [5854, 6402, 21798, 11578, -2854, -15033, -41341, -34346, -28491, -20721, 898, 21096, 15593, -7408, -24652, -28646, -42801, -55149, -41586, -44441, -42360, -39849, -24954, -18058, -33796, -20970, -10769, 321, 12490, 23318, 169, -14816, -18120, -7658, -2165, -18148, -9161, -6825, -4979, 23787, 44709, 47131, 41032, 48638, 59680, 23575, 6813, -22893, -28048, -31208, -19362, -2153, -20792, -32147, -13851, -8554, -21130, -19276, 3743, 29336, 33877, 53993, 41988, 22674, 18127, 3660, 12991, -9480, -16422, -2099, -23508, -9804, -19341, -40097, -22699, 108, 27270, 63645, 61667, 35456, 17540, 29133, 24434, 3059, 6677, 15015, 17857, 11178, 13496, 7547, -4126, -7320, -19605, -24912, -13340, -7565, 14331, 27010, 46752, 64838, 52629, 26942]
17611B6942k8761K995j2076R220K1281r028Q735K6896j3758j1359J1098j6980
17599A5205O276m149j6906n54K6385J438r128Q298J9386O992J4217j4378q636
17586D4446l5p578o195p398J706n146k4980k5701J2817R622p311m383J0827P41
17572h568J3390L3857k8634l2558m936L6928K8595n370k2469j9314K0473J6639
17560B8033K369k7272K4536L6288L6310N893j5178j7137k4215k7901M127j2050
17548A3803l4540M035L6619m081P28K3623K1560k2808l379n544m384J6069n957
17535C5744n04j3205M7J7812J0301J4349j2232n354j0233n044J867j9538K4130
17522C8140K6926k2544j5596j6191K3433j3139j8613K0998q585R901n18K2280
$$ y = [26942, -1819, 1176, -10900, -1680, 19601, 10573, 19308, 46204, 32446, 21087, 32185, 15205, 21481, 17332, 426, -128, 26257, 27695, 18567, 26865, 46251, 53243, 67460, 53082, 44446, 44411, 36833, 30638, 23240, 24946, 19800, -5180, -30881, -18064, -8442, -15753, -20136, -9309, -8568, 4822, 38679, 10045, -22513, -27449, 9479, 38074, 32704, 10235, -9079, 11394, 28033, 30402, 3130, 27666, 63954, 100264, 106157, 90979, 73842, 49627, 21726, 25853, 13803, -20737, -16702, 19917, 15836, 16564, 40187, 61747, 38939, 35560, 30016, 25632, 41701, 35744, 35240, 22035, 22082, 39894, 50195, 64544, 52312, 46958, 36725, 31681, 33548, 14010, 38140, 65066, 42522, 26926, 10735, 34168, 21029, 2416, 23414, 14829, 24730, 24212, 46492]
17510D6492j2411M490O459P780j5528j2456j3511Q142J2381n645j5415m134m35
17497F209j7366J6169J5529L3859J5028l1916k5827q186m07K6765L8959N6004
17485A24820K022k1876j3790P899J6011M804j8107k151p82K645R431j8565k4206
17472F8155j1634q26l5930m4841j0940m557J7857N1230J5725K4299K8056Q461
17460A05055j3390r214J2921j5820l3187n9314p2962j8939o044K8974K9083O1727
17448H890M8158L111o272j3837j0720L0676J1610l4567M399K3111J821j6626j554
17435D8200L8856J0117p472K6627q394n417j9498N07J2792J4676j1837k2392j360
17422G5405J9767M156K8624K9261Q306j0366j6485J3983l762J5310K5703O325
$$ y = [46492, 34081, 38571, 45030, 52810, 37282, 24826, 11315, 19457, 31838, 26193, 10778, 6644, 6209, -11157, 5012, 20541, 54400, 69428, 37512, 11685, 3499, 3092, 29857, 68816, 124820, 126842, 104966, 91176, 99075, 115086, 119890, 101783, 99632, 98850, 101495, 110926, 92361, 68155, 56521, 55695, 19765, -25076, -36016, -40573, -22716, 28514, 44239, 68538, 96594, 105055, 91665, 82451, 95372, 79552, 46365, -12949, -85911, -104850, -110894, -81920, -52837, 8890, 57048, 60159, 53887, 40050, 29330, 60006, 71616, 37049, 41448, 64559, 66380, 49754, 48200, 87056, 97173, 89701, 116328, 107934, 102517, 83019, 83526, 96318, 110994, 99157, 76765, 75405, 95172, 99328, 127952, 157213, 165519, 155153, 138668, 152651, 148889, 164199, 189902, 196227]
17410A96227J3603J8904O595p558J968k1279j4958R242L1419J8451o781k406M34
17397B43861Q603L6248M0846l675j8754j233L1315L9101J6658o72P920L9718J5055
17384D54991L1227K4483K7828J4213L7155P3472K8992L6587M8802Q4803J05666
17373I68219J07481J01240O7123Q4354Q4675J15174J53567J63730J90748J92115
17363B228426J67732K30022L54169M43438N59350P43734R58345J270180J798405
17354H753801K479970L294815M196970N065432N416338N222083N116737O192262
17346D5738408Q628763J0750690Q195393m318947j6169993j4862168q473604l465642
17338B6022900j23953K063021L404284L892741L969729M581001O505090R063374
$$ y = [196227, 209830, 228734, 235329, 227771, 229739, 208460, 193502, 202744, 234163, 252614, 245833, 243427, 243861, 252464, 288712, 329558, 325883, 307129, 305896, 337211, 376312, 392970, 392298, 400218, 439936, 454991, 486218, 510701, 538529, 552742, 589897, 663369, 692361, 728948, 777750, 862553, 968219, 1075700, 1176940, 1244063, 1328417, 1413092, 1528266, 1681833, 1845563, 2036311, 2228426, 2396158, 2626180, 2980349, 3423787, 3983137, 4726871, 5685216, 6955396, 8753801, 11233771, 14528586, 18725556, 23790988, 29207326, 34429409, 39546146, 45738408, 54367171, 65117861, 73313254, 68994307, 52824314, 37962146, 29488542, 26022900, 25898947, 27961968, 31366252, 35258993, 39228722, 43809723, 50314813, 59378187]
17330E9378187R424579J263872j3543286j8131938j3121055p942327m800491l031173
17322I496368k010485j382171r41171o75997n05454m00603l14421k59633k26505
17313B779928k05190k27107k64564k44862k01431j45506j38849j15651q2814r0769
17303A063185o0633l2568k0372n3322l7986m4576r0154q1073p9703l9174l0518
17292D93106n0548k8688n249j5396j8186l7864j6815J6958j0157j9282j997o089
17280B99793n998l1693R3j7564l7130j8530J418j1191M005k418m609k8809J541
17267A48908J532J6194l66K8348m40q785L405k2082l6060j8632o355k1372q030
17254G6265k2893k611J7793K3912J533J0031j3927o733L1000L5286J5374o505
$$ y = [59378187, 68802766, 70066638, 56523352, 38391414, 25270359, 17328032, 12527541, 9496368, 7485883, 6103712, 5162541, 4486544, 3981090, 3580487, 3266066, 3006433, 2779928, 2574738, 2347631, 2083067, 1838205, 1636774, 1491268, 1352419, 1236768, 1153954, 1063185, 1002552, 969984, 949612, 896290, 858304, 813728, 723574, 642501, 562798, 523624, 493106, 442558, 413870, 408621, 393225, 375039, 337175, 320360, 337318, 327161, 307879, 305882, 299793, 293795, 262102, 262195, 244631, 207501, 188971, 190389, 179198, 183203, 180785, 176176, 147367, 148908, 150440, 166634, 166268, 194616, 194176, 185391, 188796, 166714, 130654, 112022, 105667, 84295, 76265, 53372, 50761, 68554, 92466, 93999, 104030, 90103, 83370, 114370, 149656, 165030, 158525]
17242A58525R587k2861k9423j1033l4585j2040j3445l0873k4769J0070L5672K2332
17230E7157L0301J2816J9669K855p20M0038J825j8481m263J5261K0117j9260n8544
17217I8771l6183m3455j0010N6612K3763k639j5802J0386M5440M4699J3837k0174
17205A65245l4560m6373m2502o4338n0660p578j5933J8344P3523O6302K3330j2093
17193G2707k2001j1424l2724J5789J5404J2703K145P45J347n682n959J0178j1844
17180D1384k416R689l51n725l577K6459j0280k6979j2113J6518Q337l4553J0942
17167A7335J7522q078q754j392J7241J3274j1856r603L167J1346n131j0056j4593
17154A0422L133J4131k124P827P465L148l2080k2119M731n655j521L2016K8782
$$ y = [158525, 168112, 145251, 115828, 104795, 70210, 58170, 44725, 13852, -10917, -847, 34825, 57157, 87458, 100274, 119943, 122798, 122078, 162116, 163941, 145460, 141197, 156458, 176575, 157315, 98771, 62588, 19133, 9123, 65735, 89498, 86859, 71057, 81443, 126883, 171582, 185419, 165245, 130685, 84312, 41810, -22528, -73188, -80766, -96699, -78355, -4832, 61470, 84800, 72707, 50706, 39282, 6558, 22347, 37751, 50454, 52599, 53344, 54691, 49009, 43050, 53228, 41384, 38968, 48657, 48306, 42581, 39004, 65463, 55183, 28204, 16091, 32609, 40946, 6393, 17335, 34857, 26779, 18025, 16633, 33874, 47148, 35292, 25689, 28856, 40202, 35071, 25015, 10422, 13555, 27686, 25562, 33389, 40854, 44002, 11922, -10197, -5466, -11121, -12642, 19374, 48156]
17141D8156q047l4770j4740k1932N964j7492Q402K5173K1265K3380r091K557j9077
17128I748j9227k0641K5811J3213o750o203K4285J019k2256j2484M530L4830J3083
17115C8958J498k5229m1253P362K1385P837j0177j6806o906j2489m298M772j823
17102c7169k010N147k2925J1966L6172K8646m342r304n276P021j3316N873P809
17089H292P692Q767L075o059j1073r517k255j7704K2038k2248j9452j4259P38
17076e1965L8356L3815k573j6119k050K7802n635j2247j3119R400Q109J9635j0085
17063B3324l7180o035K1313L0655o464l7050j1053r075o286N295k011M861K1828
17050g878K078j4609o094j5027j7888M15p088P617l725N795J0674K4825R895O269
$$ y = [48156, 40109, 5339, -9401, -31333, -25369, -42861, -34459, -9286, 11979, 35359, 26268, 28825, 9748, -9479, -30120, -4309, 8904, 2154, -4049, 20236, 21255, -1001, -13485, -8955, 25875, 38958, 40456, 15227, -26026, -18664, 2721, 10558, 381, -16425, -23331, -35820, -40118, -35346, -37169, -39179, -34032, -56957, -44991, -8819, 19827, 15485, 6181, 905, 7926, -5390, 483, 8292, 15984, 24751, 27826, 21767, 10694, 1177, -1078, -18782, 3256, -18992, -38444, -52703, -51965, -13609, 20206, 17633, 1514, -536, 27266, 21631, 9384, -3735, 5665, 13774, 33409, 23324, -13856, -19891, 1422, 32077, 25613, -11437, -22490, -31565, -37851, -32556, -34567, -29706, -7878, -5800, -20409, -26503, -41530, -59418, -59003, -66091, -58474, -62199, -56404, -45730, -20905, -11010, -4741]
17036d741j9668j8143L5658M7117p197j4040m330M969J3039P893o045k9581l5651
17023c0720j9580K0987L8349K2100q688k9684j3534j924J1698M271J5644k0169
17011a1250J526L4770l402j0236j8797l2453J043R203o008J2156J3194K2024R547
16998B1317m8698k6194J128K5759J5265K610J2811J9898m584K4525J5726M86m789
16985E5260k5321k6306j0015j5254N922L1236J0647K911K176J14Q667r267P751
16972C8521k4975m1499L815L2508M0464j8028l132M054q465j2195l714j5416k272
16959a0334N29J4925K4671q192M844J2769k3420j3387J1884J1823j7910o909j942
16946f49l160j7430K699J7454n232j907j1364K3713J106j2622k6698k1845J8956
$$ y = [-4741, -24409, -42552, -6894, 40223, 33026, 18986, 14656, 19625, 32664, 40557, 34512, 4931, -30720, -50300, -29313, 9036, 31136, 22448, -7236, -20770, -22694, -10996, -6725, 8919, -11250, -9724, 25046, 21644, 11408, -7389, -39842, -38799, -29596, -35604, -23448, -10254, 11770, 21317, -27381, -53575, -52447, -26688, -11423, -8813, 3998, 23896, 19312, 43837, 59563, 60049, 55260, 29939, 3633, -6382, -21636, -15714, 15522, 26169, 29080, 31256, 31370, 40037, 30770, 38521, 13546, -27953, -24138, 8370, 48834, 30806, 27674, 31728, 23263, 11068, 7354, -8062, -10334, -9805, 5120, 29791, 21599, 26443, 39212, 15792, 2405, 14289, 26112, 8202, 1293, -649, -3809, -21239, -18540, -1086, -6318, -8225, -19589, 4124, 5230, -7392, -34090, -55935, -36979]
16933c6979J7248l001L367J0294K764j5150k3817M035J2124J0048j3286k1691
16921e4044K1469L689K3087J6211L6286J5020O708J8549K3692K3192K2678L033
16909A59570J9127M5860O0792O1817k8810r6441n8821k8633j5365J5418j536q036
16897A24942K4300O5111N8270K2211p0772q0193m7653k9881l344j7409k3804o06
16885B1172J3668j2768j1309j8650M555n075j4849J8489Q327j2405R810K8287
16873B9252k713j3375K313k1035j4583J8640L3660J451j6593j9424j7404J0102
16861i709N422j4756j2808j3065n842J0534k102Q608J2709N894J3181j3591o845
16848b2370K6733K2145j445J2930k2908k526l0087l5027j4044L9500K2686k0207
$$ y = [-36979, -19731, -22732, -19365, -9071, -6307, -21457, -45274, -41239, -29115, -19067, -32353, -54044, -32575, -28886, -5799, 10412, 46698, 61718, 68426, 86975, 110667, 133859, 156537, 159570, 178697, 224557, 285349, 347166, 318356, 221915, 163094, 134461, 119096, 134514, 132978, 124942, 149242, 214353, 272623, 294834, 224062, 143869, 96216, 66335, 62991, 45582, 21778, 21172, 34840, 22072, 10763, -7887, -3332, -8407, -23256, -4767, 3560, -8845, 965, 29252, 26539, 13164, 15477, -5558, -20141, -1501, 32159, 33610, 17017, -2407, -19811, -9709, -4287, -19043, -31851, -44916, -50758, -40224, -42326, -33718, -21009, -15115, -1934, -15525, -22370, 4363, 26508, 25063, 37993, 15085, 12559, -17528, -52555, -66599, -27099, -4413, -24620]
16836b4620j5951M48r978K47k695J3471L8534K8989p407n8731k7349K3386K2402
16823a9254N022j2508k6924p13K5241J8144J6027J9994J8847J6089J062k0700
16811D0327k700J2561j2057k577j4454l5802l6669J8768J3425k6804K1548N1239
16799B6805r375N825J8530J0913K693K6588N708L0767L6897J0309J5968M3669
16787B25297O962K3870k816M675K284l6367m1449l3594m622M170j3755J1430L3227
16774A79312J1616K4592l360L3653K7806M312m8957m3850m2192k3630o969m4621
16762F7712l4434j6268p058J3499j4695k5761j1669P819J5294K2213O979l4115
16750a0484l2865k3968Q913L3500J2940k9754J1023L0584l582m168Q182r012K235
$$ y = [-24620, -40571, -40123, -50101, -49854, -52549, -39078, -544, 28445, 21038, -37693, -65042, -41656, -19254, -14232, -26740, -53664, -54377, -29136, -10992, 5035, 25029, 43876, 59965, 61027, 40327, 37627, 50188, 38131, 35554, 21100, -14702, -51371, -32603, -19178, -45982, -24434, 26805, 17430, 23255, 41785, 52698, 55391, 81979, 87687, 118454, 155351, 165660, 181628, 225297, 232259, 256129, 253313, 257988, 260272, 223905, 182456, 148862, 144240, 148410, 134655, 146085, 179312, 190928, 215520, 212160, 245813, 273619, 277931, 228974, 185124, 142932, 119302, 112333, 67712, 33278, 17010, 9952, 23451, 8756, -17005, -28674, -20855, -5561, 16652, 23631, -10484, -43349, -67317, -58404, -24904, -11964, -41718, -30695, -111, -3693, -7861, 321, -8691, -6456]
16737f456J4117r69N138m277r206l328R596K251J3436k223m5886l9189j2695K7369
16723e2322j7J6072J8209K3905J6011j2622j6582j355J5872L730j7757j0136j207
16710a8199J3842L1353O108J2586R076j6902j1836j4159n05j1991k2073J0039
16698a2661K5976M0266k965j5089k6488N724L895K4864K230k8430j5190Q970K426
16685A3528J8720J3868j3537l2561j2911J302L72K4638J6542J829J4717m855j7997
16672B3655N439o260K206P8l9554j9815K4967J5310k3400K0944q650Q320J3719
16659A6959l098r921k8391q5K7066j7905j4470O105j6907j340J9253J7158O554
16646I78J470j4792j1661j911Q295q920J5499q258k2364P944J1586j0823k002
$$ y = [-6456, 7661, 6692, 11830, 7553, -1653, -4981, 4615, 6866, 20302, 18079, -27807, -66996, -79691, -52322, -52339, -36267, -18058, 5847, 21858, 9236, -7346, -8701, 7171, 10901, -6856, -16992, -18199, -4357, 26996, 33104, 45690, 54766, 37864, 26028, 11869, 11364, -627, -22700, -12661, 13315, 53581, 50616, 35527, 9039, 14763, 18658, 43522, 45752, 17322, 2132, 11102, 13528, 32248, 46116, 32579, 18, -12893, -11591, -11219, 13419, 29961, 31790, 46507, 41652, 23655, 29094, 22834, 25040, 25118, -14436, -34251, -9284, 6026, -17374, 3570, -5080, 3240, 16959, 13861, 3940, -24451, -24536, 2530, -15375, -29845, -23740, -40647, -41987, -22734, -5576, 978, 2448, -12344, -24005, -25916, -17621, -26541, -11042, -19300, -41664, -33720, -22134, -32957, -34959]
16633c4959J1959K7595M307k893n846K976r256k8877N592j6217k2469K1878K7375
16620a8835L0145O010o493j8938m0319q96J2753m843m775M150K3212K3916j2244
16607g157r020p914L22J0047M72Q463L5364k5662l7388K39j1165R747L9780K4732
16593C0860j7335k0940J0733j8775k0294j145M772K2704J3922P18p08J6475J2854
16580C3841K596M187k2837m213O458r680K264J0216J7579k6305j8938l548R35
16567g445J8663K1621l362k8938j7567J8412K7721P373m4792j4567k1448J5589
16555b8740K6691j4744J7030j7365l087k17J1010k8360j3404J9876l025n155M967
16542c4523J94K5672M5293m795m3904j5723j0569p908J2358P731j2852j5678Q037
$$ y = [-34959, -23000, 4595, 8902, 6009, 163, 3139, -6117, -34994, -29402, -45619, -68088, -46210, -18835, 11310, 17320, 10827, -8111, -48430, -49326, -36573, -41416, -46191, -42041, -18829, 5087, -7157, -16177, -24091, -23769, -13722, -13250, -4787, 30577, 4915, -32473, -32234, -43399, -33652, 6128, 30860, 13525, -7415, 3318, -15457, -35751, -36896, -32124, -9420, 4502, 5220, 4512, 20987, 33841, 36437, 40624, 17787, 13574, 20032, 10352, 12616, 22832, 40411, 14106, -4832, -8380, -7445, 11218, 32839, 29477, 539, -17028, 1384, 29105, 36478, -8314, -22881, -44329, -28740, -2049, -16793, 237, -17128, -20215, -20432, -9422, -37782, -51186, -31310, -34335, -39490, -34523, -34329, -8657, 36636, 31841, -12063, -27786, -38355, -46263, -33905, -26174, -39026, -54704, -46667]
16529d6667K6318K9419J1860L700j3264j9558L191P239J4568J0386J0200m9251
16517a1859n113M6029Q19j6725j4117m3607q373L5648Q283k055L100R946n643
16504c667K2297N668n968k1246m0050j228o374K4397L6768J0054q31l7082K2084
16491D822J2617j0559j4084k3551m312l930q949K268q62K0839J5395P63j5521
16478b5064P72J2897k0115J1064J3452p654k3765K323j063K5212J5122j6564p747
16465b1130j2704o499j1201O528K979j0488J5246j2661J574K8754O798L0344k174
16452A5366p129J1297J4082k407M988j9450l2167p653K7675J0540r299P473M390
16439A7706k2952j7686L520k8005O409J5922L568J6174K7898J8907O072r952k7482
$$ y = [-46667, -20349, 9070, 20930, 24630, 11366, -8192, -5001, 2238, 16806, 27192, 37392, -11859, -16972, 29057, 29876, 13151, -966, -44573, -52946, -17298, -9015, -11070, -7970, 1976, -3667, 18630, 24298, 18330, -2916, -42966, -44194, -50568, -26171, 10597, 20651, 19820, -17262, 4822, 17439, 6880, -7204, -30755, -35067, -38997, -47946, -45678, -46540, -25701, -10306, -9543, -25064, -24292, -11395, -31510, -20446, -6994, -14648, -38413, -36090, -37153, -11941, 3181, -13383, -21130, -33834, -40333, -51534, -45006, -42027, -52515, -37269, -49930, -48356, -19602, -12804, 17540, 15366, 8237, 19534, 33616, 31209, 36197, 16747, -15420, -23073, 4602, 15142, 5843, 13316, 17706, -5246, -22932, -19412, -47417, -41008, -25086, -21518, -5344, 22554, 41461, 47533, 37581, 10099]
16426A0099j7681m183J4050N722j6449n696P523j0562k196o770k585j7834j0894
16413e7456k315J2005K3646j505J9350O679l021p264j3318K7464p407J4395K3028
16400C4281J9497q062k6930j8485M097L504j1158k0209n611J8325J8117k4267
16388a6901O993j1546j7633J2672n441j1178r347k8112K6592R367N101K1014K745
16375a5674L776K7642k1609J3490j6068r018J1253j8340j5259P937O027L652K6719
16362D528N224k351k2044k5071R614J2511k356J3263O337j8220J4286K3960J7993
16349C7674l5889k9276n567J7305M137k50j4654Q840q313K285k631k385p356l736
16335c9816J8426L1333j9824k3102J0449Q844L344K5619K142L958o083l358J8105
$$ y = [10099, -7582, -11765, 2285, 8007, -8442, -14138, -6615, -17177, -19373, -26143, -28728, -46562, -57456, -59771, -47766, -24120, -25625, -6275, 404, -2617, -9881, -23199, 4265, -3142, 11253, 34281, 53778, 45716, 18786, 301, 4398, 7902, -3256, -23465, -29076, -10751, 7366, -16901, -9908, -21454, -39087, -26415, -31856, -43034, -52381, -80493, -53901, -44534, -39433, -18419, -15674, -11898, 15744, -5865, 7625, -8443, -17461, -6208, -24548, -39807, -31870, -25843, -22191, 4528, 9752, 7401, -14643, -39714, -30100, -17589, -19945, -6682, -345, -18565, -4279, 19681, 37674, 1785, -27491, -33058, -15753, -11616, -11866, -26520, -17680, -25993, -23708, -26339, -28724, -36080, -39816, -21390, 9943, -9881, -32983, -22534, -13690, -10346, 15273, 17415, 21373, 15290, 11932, 30037]
16322C0037K196P396k782O378k7299j9499J9j0748l6400k533P027K0718L0821
16309E331K220N453j5220J568j2846Q343J2679j3272j2688J718J5166M1856j8270
16296B2038l3408j4636j4744J3434P965k333J2836Q096j0571L314N11j5173j5883
16283c8554J5744L79j429J7917J3369O576l615r711l6298j0143j8042j1366K2220
16270e2953L3287J0665j9313p680j780J8081j0071j2148Q045r705l95P773m224
16257d0418J1445J8680K1934j1999o899J2559R123j9168j7504M572K5891j3072
16245d856L62J0177K0038p90j3280m501m1089k1653J2139L8517M323R138l8438
16232b9913j6196J9237J8206R780j3962k581j4814k391J0377k0273j965K5464
$$ y = [30037, 32233, 39629, 36847, 43225, 15926, -3573, -3554, -14302, -50702, -53235, -46208, -25490, 5331, 7551, 13004, -2216, -648, -13494, -5151, 7528, -5744, -18432, -16714, -1548, 40308, 22038, -11370, -26006, -40750, -27316, -19351, -21684, -8848, -752, -11323, -8009, -7498, -22671, -38554, -22810, -22431, -23860, -5943, 7426, 14002, 10387, 676, -35622, -45765, -63807, -75173, -52953, -19666, -9001, -28314, -35994, -37774, -19693, -29764, -41912, -33867, -43572, -43967, -36194, -40418, -28973, -10293, 11641, -358, -7257, 5302, 14425, -4743, -22247, -17675, 8216, -4856, -4494, 5683, 25721, 24931, 11651, 7150, -33939, -55592, -43453, -4936, -613, 8525, -29913, -46109, -26872, -8666, 1114, -12848, -15429, -30243, -32634, -22257, -42530, -44495, -19031]
16220a9031j0220N002N081J3119K570J299J9901l601j3286L292j1819r966J4073
16207c586R223p840p444j7020k0531l654J2068J6801L124Q770J0872P466r943
16194a694J595N955j4066k2581j4040M528j261j76J1935m177j0312P311K1190
16181a5793j2474j7110J258p901l7023J8593K8386l478j1548L7926K9126j479
16169H483j0947K059J1103J1534N633p380q578k4522j1341l487J5103Q859J0284
16156F803l528Q301k4966j4434J0836J6796N300j2968m732p55o199j519J970J4454
16142d641L276O772k7029j7816J1730j5736q207L7249j1584m076N381Q448J1634
16129d599k9269j1517J1894N779p8J5810K1740q588l546J1605J95j834k4612j4120
$$ y = [-19031, -29251, -24249, -19168, -6049, -3479, -2180, 17721, 14120, 834, 4126, -7693, -17659, -3586, 5637, -2203, -9647, -26667, -47198, -50852, -38784, -21983, -18859, -10089, 783, 8249, -1694, -99, 5856, -8210, -30791, -44831, -40303, -41564, -41740, -29805, -33982, -44294, -36983, -15793, -28267, -45377, -44119, -52020, -89043, -70450, -42064, -45542, -57090, -19164, 9962, 8483, -2464, -405, 10698, 22232, 27865, 20485, 11907, -12615, -23956, -27443, -12340, -3481, 6803, 3275, 11576, -13390, -27824, -16988, -192, 5108, -7860, -12592, -13347, -19546, -21065, -19095, -4641, -1365, 5407, -21622, -39438, -27708, -43444, -51651, -14402, -25986, -30062, -24681, -16233, -4599, -33868, -45385, -33491, -27712, -27790, -11980, 9760, 1172, -2374, 9231, 9426, 7592, -17020, -31140]
16115c1140l052J2911O164M368q543k4928K4029J7518K6921k0490l4609q456L019
16102c6288k9938j1612K9123L0845O745O322L2593j0650j6635O120m596l45j0363
16089h679N937J3617J7007J4522k3578K3623R594k69l9129p393M702J4949L747
16076B8650j2886l0940l74j1317J1561K2439K4141J2645k3717j2586m880o117
16064c381q929o494N183R004J0393J1523j3599j8008J359Q597j176J1225r723
16051d026o190J0740L789l3823p139J3920k985l0128M794J8254K0806M2750n915
16038B4847l1852J8189M4046J373l2697J3022K211l6748k4786J694k0605j3187
16026e4493K0008Q085P602K3197L4260N942k3951j8527L582L6906j6520r531j0339
$$ y = [-31140, -34192, -21281, -15117, -10749, -19292, -44220, -20191, -2673, 24248, 3758, -30851, -39307, -36288, -66226, -77838, -48715, -17870, -11125, -4803, 27790, 17140, 505, 6625, 2029, 1684, -8679, -2742, 10875, 27882, 42404, 18826, 42449, 52043, 51774, 12645, 5252, 9954, 24903, 28650, 15764, -15176, -15550, -26867, -15306, 7133, 31274, 43919, 20202, 7616, 2736, -3381, -12310, -18804, -13621, -4617, 5776, 17299, 3700, -14308, -12949, -4352, -5528, 5697, -4026, -10216, 524, 4313, -29510, -36649, -22729, -25714, -55842, -51048, -32794, -11988, 30762, 24847, -7005, 11184, 55230, 56603, 23906, 36928, 39139, 2391, -22395, -20701, -41306, -54493, -34485, -26400, -18798, 4399, 38659, 44601, 20650, 2123, 5705, 42611, 26091, 16560, 6221]
16013F221j4770j8321O20o766j0073l385p272o559o067J0127O893Q708K478K5995
15999a2171n593j2250j1460J3999L8344N551K0571R782l7999k5885j6952K818
15987c1245J808l605j0711p027j5440K3654j6538j046J0226M2431Q486K895Q572
15974A2460J2726l241j4217K0731q484j2102J4186j4284j0793k9543K7239L6018
15962C0696j5788n457j6220j1212l402K8622L1216j659k1769j1609K0692J2920
15950C7030m6567j6167J6954o269J796N050N603J8722J0692l3375k016J2879j2301
15937g969O462o620M154O947j4433k1054J0757J4385J301j0801J662J174m329
15924a8364j4051j146j272K1219K8074r452m6455o300K7958M0332K0279k613p003
$$ y = [6221, -8549, -26870, -26250, -33016, -43089, -46474, -53746, -60305, -66372, -56245, -49352, -40644, -38166, -12171, -17764, -30014, -41474, -27475, 10869, 16420, 36991, 46773, 8774, -17111, -34063, -31245, -29437, -33042, -43753, -50780, -66220, -42566, -59104, -60150, -49924, -7493, 993, 3888, 12460, 25186, 21945, 7728, 28459, 19975, 7873, 22059, 7775, -3018, -32561, -5322, 30696, 14908, 9451, -6769, -17981, -21383, 7239, 38455, 36796, 15027, 3418, 24110, 37030, -9537, -25704, -8750, -15019, -13223, -8173, -2570, 16152, 26844, -6531, -8547, 4332, -7969, -1507, -8127, -3973, 2974, -11459, -32513, -21756, -7371, -6070, -16871, -15209, -14035, -18364, -32415, -33561, -34833, -13614, 14460, 5008, -41447, -47747, -19789, 20543, 40822, 38209, 31206]
15911C1206j5512m616J275j8110j9351L2373K4041l410l5377l2203K0039L430
15899a6215k1487j1753P716n544j5032J9053R867J9173J5152M403J9906r73l7425
15886a3159j1474J6383l788L552Q314J910k3918j6719J6091J1761o939j7133n081
15873d0200n970J79J2988J5180Q559J2039p202J2216K1667J576j0447J7185J5753
15860E3523j8571j5438j4196k8966k940K3019P776j5536r35L0320p083N357R494
15847B5824j3574j8756m723j8077m970P278r251J270o142J4526J6808j3762j1139
15834c4688J3763j4213R002p826j1513j8643J5308J1816j6893j5464m55L0200
15822c9606J3839K2951L2789q775k8378k2991J7512P986J310Q51J67J6291m399
$$ y = [31206, 15694, 11078, 12353, -5757, -25108, 7265, 31306, 27896, -7481, -39684, -19645, -16215, -37702, -49455, -41739, -47283, -62315, -43262, -33395, -14222, 930, 5333, 25239, 24266, -13159, -24633, -8250, -12038, -8486, -172, 1738, -22180, -38899, -22808, -11047, -17986, -35119, -40200, -46170, -45991, -33003, -17823, -9264, 2775, -4427, 7789, 29456, 31032, 20585, 37770, 53523, 34952, 19514, 5318, -23648, -26588, -3569, 4207, -11329, -12264, 18056, 10973, 16330, 25824, 12250, -6506, -11229, -29306, -34276, -26998, -36249, -34979, -41121, -26595, -9787, -23549, -34688, -20925, -35138, -26136, -33962, -45475, -64118, -48810, -36994, -53887, -69351, -69806, -39606, -25767, -2816, 29973, 21198, -7180, -30171, -12659, -4673, -3363, -2512, -2345, 13946, 9547]
15809I547k0060L864m109l220J2492j4774q10J144k359j8643K173J4639K754j6781
15795c4143k3523J5892O034M997M19r799J2048J5216J5808J5018j7368R634J1485
15782B1718j1787r314L303M720K119N021J692q15K1089j0246J0048K857q573l379
15768B8453j3820L870J2467N815M719j7900k7181Q990J3812P44r07n525o883P557
15754A4211k1677N439K3123O740j3358o531j2235J377j0563n957J8471o303l981
15741a1244K1495K201J1006r22p828j0496o224P445k215l319P767l812k1975j9193
15727c7314J9137l450q157J4880J9657p173k0049K5596o036P87l4769j0835J3039
15714c4687R646P231J3332n977r847j3850k0502J0022P818P837J31p962J5902
$$ y = [9547, -10513, -6649, -10758, -13978, -1486, -16260, -17070, -15926, -18285, -36928, -34755, -20116, -17362, -34143, -57666, -41774, -35740, -30743, -30324, -40123, -28075, -12859, 2949, 17967, 599, 10233, 21718, 9931, 617, 3920, 8640, 10759, 15780, 17472, 16657, 37746, 27500, 37548, 40405, 31832, 28453, 14633, 18503, 30970, 36785, 41504, 23604, -3577, 5413, 19225, 19969, 19062, 13537, 6654, 14211, -7466, -2027, 21096, 27836, 14478, 7947, -4288, -2911, -13474, -19431, -960, -7263, -11244, 10251, 12452, 23458, 22536, 14708, 4212, -2012, 5433, 3218, -101, 7666, 3854, -18121, -37314, -18177, -21627, -29784, -14904, 4753, -2420, -22469, 3127, -2909, -2122, -36891, -47726, -34687, -25041, -17810, -4478, -10455, -20302, -34152, -54654, -44632, -36814, -28977, -28846, -36808, -20906]
15701b0906K8486J2169J7462Q83M384l705j4770n297k4315j9580j8798J3734k687
15688c2940L2591J5854k5099K3757l576k1029O17J941m472J5844J5052k6700q0
15675h240m866Q772q747o102l927j5243R428l717N702K374J3374L233l034J4100
15661C107Q046k3638k56n961n272r239p375m28L2018J2171o608j0731l2178j1240
15647e7584O54p425K4637J3604K4836M311j1348J2746q12k4160j7060K0016L4401
15634A6816Q863j1370R593j0913j7536k1291p953J0411M454o263J8531p295r060
15621b3013J9863O607r140J5179n912m656k1488m639k5758m0r435J7230j633K777
15607d4058r114J5524J0046J3372j7068k3855m990O672J2597m327m919j2499k0863
$$ y = [-20906, 7580, 19749, 37211, 38094, 42478, 38773, 24003, 18706, -5609, -25189, -43987, -30253, -32940, -349, 15505, -9594, 14163, 10587, -10442, -9825, -7884, -12356, 3488, 18540, -8160, -8240, -13106, -4334, -13081, -19183, -23110, -38353, -28925, -32642, -26940, -24566, -11192, -7959, -10993, 3107, 11153, -12485, -12741, -18702, -23974, -33213, -40588, -41016, -8998, 3173, -3435, -14166, -46344, -57584, -56930, -64355, -39718, -26114, -1278, 3033, -8315, 4431, 3619, -20541, -37601, -17585, 16816, 25679, 14309, 23902, 12989, -4547, -25838, -33791, -23380, -18926, -25189, -6658, -13953, -23013, -3150, 3457, -5683, 9496, 3584, -1072, -22560, -27199, -52957, -52997, -62432, -45202, -46835, -44058, -53172, -37648, -27602, -14230, -31298, -55153, -60143, -53471, -40874, -45201, -50120, -62619, -83482]
15594h3482J8404R513J402J3060Q540R367J5005J0931M647k490r966l956N222
15581c803j0568m988p049p276K2014J4249j5827j6278o914O853qK0347K9915k918
15567A7749J6616j7231l2938o520o019K826r25l6882J6593L1677L0865n03l2944
15554a7636q989J6993J1513j8207M223J882L0413K4351j9432j2276q463j8608
15542a4236L894k334r840K346J1556K0667L171j1108m614p282m568k7407N856
15529c3899K1407j903n357j1489r681r05L264j2857p448K5196K6834J0006j914
15516A254j0041l111o259J2117J5502l530k6673R210J0705P096K4889l466K8938
15503E6631K5297k5418l4167j0418j944J94m3j9173j7263j7100K9658K7366j859
$$ y = [-83482, -65078, -55565, -54163, -41103, -32563, -23196, -8191, 2740, 7387, 4897, -5069, -9025, -3803, -14371, -19359, -26408, -33684, -11670, 2579, -13248, -29526, -36440, -29587, -29595, -9248, 20667, 17749, 34365, 17134, -15804, -22324, -28343, -25517, -26442, -63324, -46731, -15054, 15811, 15308, -17636, -26625, -9632, 1881, -16326, -12103, -10221, 20192, 44543, 25111, 12835, 4372, -14236, -10342, -12676, -22516, -20170, -8614, 12053, 15224, 4116, -498, -7780, -12348, -39755, -33899, -12492, -14395, -19752, -31241, -40922, -41827, -38563, -51420, -58868, -33672, -6838, 3168, 1254, -8787, -11898, -18157, -6040, 9462, 5932, -20741, -11531, -826, 6270, 31159, 27693, 56631, 81928, 56510, 22343, 11925, 9981, 10175, 10132, -9041, -26304, -43404, -13746, 13620, 11761]
15490A1761R242j8082R465N421j5572j0197M41J9632J3588o77p886L472Q650k9788
15476e30m8318o043J8846K2954l980k6394J1702m31L0270L324j6849r189J5566
15463i072j3832n831r582r307M454L081L7917L3499K2485k2722k5702k6578m642
15450b5832K4474l354J2566J5189J3981j4328N920l57k3774J7403J4365K259Q283
15437D6795j9580m30j6974l4307j8928M082j255P627K178o238k1098R659K4123
15424b4346j7209M54Q904k922J9825r684j5500K7693J1423l0417L011L006m790
15411c0552j980K6781L4015q288l928n240k7061q909J2907P286n010N65O831n923
15397h506j3426l697p575m631J4712K671Q692K6102J4742j4356k1794k1851J0873
$$ y = [11761, 21003, 2921, 12386, 17807, 2235, -7962, -7521, 12111, 25699, 25022, 17136, 20608, 29258, -530, -48848, -54891, -36045, -13091, -17071, -43465, -31763, -32194, -1924, 1400, -15449, -24638, -9072, -22904, -28735, -38317, -47624, -43170, -40089, -2172, 31327, 53812, 31090, 5388, -21190, -25832, -1358, -4712, 7854, 23043, 37024, 22696, 28616, 28259, 4485, 21888, 36253, 38512, 46795, 27215, 26785, 9811, -24496, -43424, -39342, -40597, -32970, -30792, -37030, -58128, -48469, -24346, -41555, -41101, -32197, -35119, -15294, -24978, -40478, -12785, -1362, -31779, -28768, -25762, -30552, -32532, -5751, 28264, 19976, 16048, 10808, -16253, -25162, -12255, -4969, -9979, -9414, -2583, -8506, -21932, -25629, -33204, -37835, -23123, -20452, -11760, 14342, 29084, 14728, -7066, -28917, -18044]
15384a8044J6951k0099K820Q174n993Q59l684j2832n45L8697K5813Q105k3866
15371A6356k9705j1850K4894r58J15N0046K8624l6605l7654l1006j2990J4867
15359b5866K5036K4616M485m46J2179j9998l637J685k1351l6812k2858J2936k4800
15346g4831K1345J7613P616P87j464J2827Q295q344j3380Q674J2718K1767o4l68
15332A3191n35j2993k508o924O927j4423o441J7709Q553K8627j937J652M2l3960
15318c020j2012J2917J5121M359K734j3293l1784l4097J6850J7918j1797O085
15306c0019J1656p793k3363L3281M2455o269k3169J302j040m760j9820Q590O075
15293a2874j74J0521P619K671j9892q313M9854Q890L05j2865j9849k5984J3311
$$ y = [-18044, -1093, -21192, -18372, -10198, -16191, -15332, -19016, -31848, -32393, 6304, 32117, 40222, 16356, -13349, -25199, -305, -1263, -1148, 48898, 77522, 40917, 3263, -27743, -40733, -25866, -830, 23786, 28271, 27825, 40004, 20006, 16369, 18054, -3297, -40109, -62967, -50031, -74831, -53486, -35873, -28257, -27470, -28934, -16107, -7812, -16156, -29536, -20862, -8144, 13623, 13559, 13191, 12656, -337, -2845, -9769, -2842, -17265, -23706, -5997, 2556, 31183, 29246, 30898, 30940, -3020, -15032, -2115, 13006, 17365, 20099, 6806, -24978, -59075, -42225, -24307, -36104, -30019, -18363, -26156, -49519, -16238, 26217, 19948, -3221, -1919, -2959, -7719, -27539, -18949, -12874, -13048, -2527, 5092, 7763, -12129, -20442, 29412, 38302, 38607, 25742, 5893, -20091, -6780]
15280f780J5399K45l2510n873L9292K4700K141k5225l664R757j4498j2492k0517
15267c0025k8972Q37m314J3928L0990K3670k0899J15L2804K968j6218j1031j5685
15254b1832J9320q602Q00r124J1899J5755k5897j6488J3159J1476O254j2595J7182
15241A307J8302j8763q698k7325K0632J1760P38k4324k2732j037K1039o11j5156
15228d4868J7159J3226J8257K2893k130p450P235o636J1045q071r739K05o587
15215D539m955J849k0623R081J738k7353Q446R371l495o394J3186l0548N760M4198
15201D800J5187k0779O834N806J3161r459J1670k0825L942o870N993K502j9654
15188g692N490J4762p157n68j6645l5150p685L6472k730k310p532J2110J3501
$$ y = [-6780, 8619, 8864, -23646, -29519, 9773, 34473, 36614, 11389, 7725, 17482, 2984, -9508, -30025, -58997, -58160, -62474, -48546, -17556, 6114, -14785, -14670, 18134, 21102, 4884, -6147, -21832, -2512, -11114, -10314, -19438, -7539, 8216, -17681, -34169, -21010, -9534, -3280, -15875, 1307, 19609, 846, -7852, -35177, -14545, -2785, -2047, -26371, -49103, -50140, -29101, -29712, -44868, -27709, -14483, 3774, 26667, 24537, 17087, 24322, 17686, 28731, 20660, 10921, 11126, 4539, -416, 1433, -19190, -10109, -8371, -35724, -27278, -17907, -21402, -27796, -14610, -45158, -39398, 4800, 19987, -792, 6042, 11848, 25009, 15550, 27220, 6395, 10337, 3467, 9460, 11962, -7692, -2202, 12560, 5403, 4835, -11810, -46960, -54645, -18173, -20903, -23213, -30745, -18635, -5134]
15175e134Q033j3136j6685k0318j394J6576N876j1214J9673L3228j3090n965l811
15162g361K6094k6266j6304q527L792K1763p186L579J8352Q37j2208l423j2369
15149a9227N480l8306K0006K8833o677k1544l153K2725m593J4953J6394k0517
15137e626q959j0013O755p787L0522L686l1232k4126l857R588L0354K4681k720
15124A1266n437n719j9980J7093J0677j3879P104O589l0940k4397K8070J4941
15112d612q693k075q698m918L1007j3069r65q695J3050O016q261J0274M418Q876
15098A3655m962j0132M515j8597J385K5112M446k2724k8169J0890K2277J098J8893
15085A7687L673j7600J4691N924l9646k0051J9719n010P713J1184J4608j1458
$$ y = [-5134, 2899, -10237, -26922, -47240, -48634, -32058, -26182, -37396, -17723, 15505, 2415, -3550, -7361, 18733, -7533, -23837, -32364, -28572, -6809, -13995, -10416, 7936, 8773, -3435, -6858, -19227, -13747, -52053, -32047, -3214, -9891, -31435, -34588, -11863, -16456, -1503, 14891, -5626, -14585, -24598, -17843, -25630, 4892, 8578, -22654, -46780, -50637, -41049, -10695, 13986, 11266, 5829, 110, -19870, -2777, 7900, -5979, 1125, 7714, -23226, -47623, -19553, -4612, -13305, -15380, -24078, -28996, 2011, -11058, -12023, -20718, -7668, -1652, -9913, 361, 4779, 13655, 8693, -1439, 3076, -15521, -14136, 10976, 15422, -7302, -35471, -24581, -2304, -1206, 17687, 21360, 3760, 18451, 24375, -15271, -35322, -15603, -20613, -12900, -1716, 12892, 1434]
15073A434j7110L373p869q180K4825K4838p641j6522k6408j476J3138k799P400
15060a2997j9681J4291j99j7851J1513K2529j5779k7114K6521J1292j0670l805
15048b1950n627j3221J7298N501j1123j4461k6761J2445M2909J3654k4554J0826
15036a5064l356k0925J8512J0870O021Q617n387J4874K1847J4401m896k8171o137
15023A1206M834n236j7515j3014N103N182N845P613k5831Q085N206M411j1374
15010a5485L0222K309K164J0587j1916M116J9737q003k0918j7676j1470o431J4905
14997g859l928l4427q251J3723K6375J0505l223k5679O480K9948m611j7665P942
14984a0670J1043J9076P269k4580Q50K3962P629K705j6659k3114k490K0742Q168
$$ y = [1434, -15676, -12303, -20172, -28352, -3527, 21311, 13670, -2852, -29260, -30736, -17598, -20397, -12997, -32678, -18387, -18586, -36437, -24924, -2395, -18174, -45288, -18767, -7475, -18145, -21950, -27577, -40798, -23500, -17999, -29122, -43583, -70344, -57899, -14990, -1336, -25890, -15064, -18420, -39345, -20833, -9963, -3942, 4675, -712, 14162, 36009, 50410, 45514, 17343, 11206, 16040, 10804, -6711, -19725, -14622, -9440, -3595, 4018, -21813, -13728, -8522, -4111, -15485, 14737, 17046, 19210, 29797, 17881, 21997, 41734, 33731, 12813, -4863, -16333, -22764, -7859, -11787, -46214, -54465, -40742, -14367, -3862, -7085, -32764, -26284, 3664, -947, -18612, -10670, 373, 19449, 26718, 2138, 2988, 26950, 34579, 37284, 20625, -2489, -4979, 15763, 23931]
14971B3931q294J555J8121P831k9516j2917k368R907L2540j876k4654m2580j5039
14958d3359J9423J9800K3239r990R205M375J7141J0321r148l3777j6452n520n592
14945b0334K2907K1520k8244j2562J0226o249N505M948o618l977M715M876j0595
14932a3882r322N732J8582K2226M490p814j5703K725p242j2557Q653J9622l1482
14919a5972l5869L975J1662J2799J091K8682K8352O473m2003p159J5033j699j4876
14906i511l6935p761M9541L1686L723n826j7089J0766p412k9181j9J5125P894
14893E001j5461J1998j2450k3143R832J5309p35j1725k305m050j2622J9022O836
14880a4493J8027o905l3589j4575M1242P778k5801j0997O822N349k599K8661L8653
$$ y = [23931, 15637, 17192, 35313, 43144, 13628, 711, -1657, 8250, 40790, 38914, 14260, -28320, -43359, -23936, -4136, 19103, 9113, 18318, 22693, 39834, 50155, 41007, 7230, -9222, -14742, -20334, 2573, 24093, -4151, -16713, -6487, -12736, -7231, -2283, -8901, -12878, -8163, -3287, -13882, -23204, -17472, 1110, 23336, 27826, 20012, 4309, 7034, -208, -12765, -4112, 15510, -15972, -51841, -47866, -36204, -23405, -22314, 6368, 34720, 41193, -810, -7969, 7064, 5365, -9511, -46446, -54207, -4666, 27020, 30743, 24917, 7828, 18594, 11182, -17999, -18018, -2893, 5001, -10460, 1538, -10912, -34055, -24223, -8914, -9649, -21374, -23679, -27729, -40351, -21329, -14493, 3534, -3371, -36960, -51535, -10293, -2515, -28316, -39313, -32491, -27142, -29741, -1080, 37573]
14867C7573J4436l3558k6930J7829m592j4746J6378M57k0123R624J9102J6707
14855C2157k6165k6971j1577N252k724n132J1060J1571J2470m987l3029j1265
14843d9340R658J3604j920R00K3578l5205j6016o838J1127K4289R729j6223k770
14830c5427R443R968K8366q318j4252j6479J9420K1855N101j1398K5333M387j7676
14817B0323k8348n646R793J7667j3770k8142K7580m598L6688o534J345L1427K2822
14804H0607m779j0248l2231j1204J993O547j7573j9513K369J3468M637J3567k9265
14791a625j2461P792k88L286k3847r91K1522r537o6K8599m3153j7204K1350J752
14777b4871J3680k9599N637J1436L2423J130N186q518k2023k945N245p456N762
$$ y = [37573, 52009, 18451, -8479, 9350, 4758, -9988, 6390, 6847, -13276, -3652, 15450, 32157, 5992, -20979, -32556, -27304, -30028, -35160, -24100, -12529, -59, -5046, -38075, -49340, -39682, -26078, -27998, -27098, -3520, -38725, -54741, -61579, -50452, -26163, -16434, -32657, -35427, -25984, -16016, 12350, 4032, -10220, -26699, -7279, 14576, 19677, 8279, 33612, 37999, 20323, -8025, -13671, -3878, 13789, 19, -28123, -543, -5141, 31547, 25013, 26358, 57785, 80607, 75828, 65580, 33349, 22145, 24138, 30685, 13112, -6401, -4032, 9436, 14073, 27640, -1625, -14086, -6294, -6582, -3296, -27143, -28134, -6612, -16149, -16215, 12384, -30769, -47973, -26623, -24871, -11191, -40790, -35153, -23717, 8706, 9836, 15022, 6504, -15519, -18464, -13219, -20675, -14913]
14764a4913r758l687M2324J7175m472k8864l4745n002j760J8733J4672J6010K6442
14751C2155J1218j3523j1665j4482n618k017J612K2369j3546k6870P754J4089
14739A476J1996m857N909N225q373j4431J625K1807J2178m8764j1321M7291r188
14726A0573r3M964L198R097r412k0290j8780j5003k1067j482K3206K2277M1372
14713B8560J6919o554j0474k3822L160k8155k312l580J8158L8261j7484q845J6509
14700B0341L2524L1966k2868j7510k8567p912k8147Q147K1213m990N219K787q377
14687C826J1108P56o367K1732J31j3630k8607p358Q816j265l642R770J3830m909
14673D191j2500j3453n023J4664J536L733K6107p400p514N670l2357l4606p596
$$ y = [-14913, -24671, -28358, 13966, 31141, 26669, -2195, -36940, -41942, -43702, -24969, -10297, 5713, 32155, 43373, 29850, 18185, 3703, -1915, -3932, -2320, 20049, 6503, -20367, -12613, 1476, 13472, 8615, 14524, 19749, 11376, -3055, -1430, 20377, 32555, -16209, -27530, 19761, 10573, 10480, 15444, 18642, 27739, 18327, -1963, -20743, -35746, -56813, -58295, -35089, -12812, 28560, 45479, 38925, 28451, 4629, 7789, -20366, -22678, -26258, -8100, 30161, 12677, 3832, 20341, 52865, 84831, 61963, 44453, 15886, 7974, -20173, -12026, 9187, 4197, 9416, 12203, 3826, 14934, 15690, 9323, 31055, 31186, 17556, -11051, -18409, -9593, -10858, -14500, -4730, 9100, 4191, -8309, -21762, -26785, -12121, -10585, -6852, 19255, 11855, 4341, 10011, -22346, -56952, -64548]
14660f4548J420J2030j969R225K7243K7290p629j9437k162K5181k4881m716N435
14647a7518j8033J445J106M2008q136P290J0916j6230k0565j8253R835J0085n755
14634b1805R182j981R406J2215j2816R438L0370q464k9946l377M304K248J5857
14621A4631J9197o963k3769J2207J7131Q568l0195p301J2147J6534k3759k8608
14609b0180J0899J9358j3732k687K0312L736L0110Q980O879k5138j0043k0374
14597H120p747J3247J9061J9739m617l3590l8751j7898K1732J1408r777o554J3371
14584a2256j958K742L1061n173j4742j34J5982p646j8463p361J3896L471M783
14571D202r209k3092n111K2160K1683K3204j2905l8670L132J3038m260m760N769
$$ y = [-64548, -63128, -51098, -53067, -43842, -16599, 10691, 3062, -16375, -18537, 6644, -18237, -22953, -17518, -35551, -34106, -33000, 9008, 872, 8162, 19078, 2848, -17717, -35970, -26135, -16050, -21805, -12623, -14604, -5198, 7017, -5799, 3639, 34009, 25545, -4401, -7778, -3474, -1226, 14631, 33828, 26865, 3096, 15303, 32434, 41002, 10807, 3506, 15653, 32187, 8428, -20180, -9281, 10077, -3655, -6342, 13970, 17706, 47816, 56796, 63675, 38537, 28494, 8120, 373, 13620, 32681, 52420, 47803, 14213, -24538, -42436, -20704, -9296, -19073, -25627, -12256, -14214, -11472, 19589, 14416, -326, -460, 15522, 7876, -10587, -17948, -4052, -581, 4202, -5007, -28099, -33210, -11050, 10633, 33837, 20932, -17738, -14606, -1568, -5828, -10588, -4819]
14558d819k323R66j7804q397Q592p45K0453L1101l723J824j092k6019O836L611
14544H461p047L231l378K482k9508K1555K0828j8580j5270J9475R53m960l308
14531e066o126Q687K6977k397j7867q293n329p170k4875J8065J8597J4234P287
14518A6724Q111M246J37L165k2695j9523j08O747p322p937R455L515q367j3715
14504b7567Q168L03M913j0322l313P953J1229L898j7223p81j6157J1735J6291
14491a0873J2133r673J7647K4605Q058M088j8172k890J229q778R137Q544j1150
14478B3905j1800N633J8001j9917j9114J463j1744k023J3713J3263O778l8081
14466a9923M951l955Q118J4948J1749J6739K6673k7659l6769m3195J9705J9127
$$ y = [-4819, -7142, -6176, -23980, -32377, -23785, -24530, -4077, 27024, 23301, 25125, 24033, -1986, 4850, 8461, 1414, 4645, 1267, 3749, -25759, -4204, 16624, -1956, -17226, 2249, 3202, -1758, -5066, -11192, -2505, 24472, 22075, 4208, -4085, -9414, -16584, -41459, -23394, -4797, 9437, 16724, 24835, 29081, 29218, 32383, 9688, -9835, -9943, -3196, -10518, -18455, -9000, -5485, -13852, -27567, -19399, -19096, -14183, -24505, -27818, -19865, -8636, -4738, -21961, -22742, -38899, -27164, -10873, 1260, -8413, 9234, 33839, 41897, 45985, 27813, 24923, 26152, 17374, 26511, 35055, 23905, 12105, 17738, 35739, 15822, -3292, -1829, -13573, -15596, -1883, 11380, 18158, -19923, -14972, -18927, -10809, 4139, 15888, 32627, 59300, 31641, -5128, -48323, -28618, -9491]
14454i491K1116J3539L417j8440j507k5816j5033n744J9670m339j0761R419K8638
14441D668J0614m215J2945P462R99k8242k3814J6875J1965R258J1909r594k1137
14428c07N054M498j245P935j6309m412j9093k4870M2488K9046m022l1J435Q522
14414B8689n287M524J859L2629k509j6930O891o943m4559Q98j2749L0730K3867
14401D1110j7496l4584j9009k130K9846O814j3118k9191n131L0449j4334j6576
14389d3350l248K516J4642R361J9296K1802K490J9263n948K419m106j4247j5598
14376E292m6024k2812J517K3971J4314J5839J6752j7496N22q358J1949J7807M440
14363A7713O277k4806Q149j8355j6515K6972K5743K4152m1769k2399j133J8643
$$ y = [-9491, 11625, 25164, 28581, 10141, 8634, -17182, -32215, -37959, -18289, -22628, -33389, -23970, 4668, 15282, 11067, 24012, 31474, 32473, 4231, -19583, -2708, 9257, 18515, 30424, 20830, -307, 4747, 9245, 8000, 15935, -374, -4786, -23879, -48749, -6261, 22785, 18763, 18732, 20167, 28689, 23402, 27926, 29785, 62414, 59905, 42975, 49866, 42923, -1636, -738, -13487, 17243, 41110, 23614, -10970, -29979, -32109, -2263, 4551, -8567, -37758, -42889, -12440, -26774, -43350, -46598, -44082, -29440, -20079, -783, 21019, 23509, 42772, 36824, 39243, 35137, 20890, 5292, -40732, -63544, -62027, -38056, -23742, -7903, 8849, -8647, -8125, -16483, -4534, 13273, 17713, 23990, -816, 7333, -11022, -27537, -565, 25178, 49330, 7561, -14838, -15971, 2672]
14351B672j3269r836J5735K448K2450J2980J823M929O682M58M95J32j2849j7557
14337A7293l9206k644K7222J1835M553K691L6288Q402m2751k2966m147j189L825
14324g94Q909R500O540k6765j5033K5570J8953K4431O062k4564k9282m811j7277
14311a8561M583K2039P726K2250O206j8415j9013j6030J906J5409K3480k859J4244
14298D2965J877J3973j6360m585J5589k5480j8712Q103k480M201K3149J0903j6434
14285C6709o846J0157J4160n332l8497k3027k985J0367m646o938K1309m109j5190
14272a4868k6721j8404J103l184J4207J7210j7750K896M908j905K4188J3013J085
14259d222J1276o052k7394q335J3690P785l2807m2112L0413M5566J1123k2776
$$ y = [2672, -10597, -20433, -4698, -2250, 20200, 33180, 35003, 39932, 46614, 47072, 47567, 47699, 34850, 17293, -21913, -24557, 2665, 14500, 19053, 21744, 58032, 66434, 23683, 717, -3430, -4619, -794, 8115, 17615, 24155, -2610, -17643, 7927, 26880, 51311, 57373, 32809, 3527, -1284, -18561, -13978, 8061, 15787, 38037, 44243, 25828, 6815, -9215, -7309, 8100, 31580, 28721, 42965, 44842, 58815, 42455, 37870, 53459, 27979, 9267, 17370, 14890, 19091, 42240, 53143, 36709, 29863, 40020, 54180, 48848, 10351, -12676, -15661, -5294, -9940, -16878, 4431, 322, -14868, -41589, -59993, -58890, -62074, -47867, -30657, -48407, -45511, -40603, -42508, -18320, -5307, -4222, 7054, 1002, -26392, -34727, -21037, -13252, -46059, -88171, -57758, -12192, -1069, -23845]
14247b3845j1151P309j2054J0123O393J3189N89l662J6288o660j6257K642J3865
14234c231K2271J5910l297l3953j9953j0086K6139L446J1877L006J654K0826j9338
14221A5271K2653J6803j1321j9087j247j6999r080j1381q399j9712k2105K9697
14209c4907K0949R911J2405J6545j217P127l1417M727Q619j2847j9213K2599K4563
14196B7844k1441j0624J9064M589K2345p130k9180J965l440j6908m839o458K3223
14183i90L3420j7115j2704l0832k6658J2422M2350L749p094K5018L2613j0204
14171D3975l2097j3182j9280K3512J5635O521O690l9411l226J778K0408Q660j801
14158A8182k7775J0773K5753j28j6859j2778l8688P268L5211K0453L7459k5337
$$ y = [-23845, -34996, -27687, -39741, -29618, -23225, -10036, -9447, -13109, 3179, -3481, -19738, -17096, -3231, 19040, 34950, 31653, -2300, -22253, -32339, -6200, -2754, 9123, 12129, 13783, 34609, 15271, 37924, 54727, 43406, 24319, 23072, 6073, -3007, -14388, -22787, -42499, -64604, -34907, -13958, -4047, 8358, 24903, 23686, 30813, -604, 4123, 12742, -105, -19318, 3281, 27844, 6403, -4221, 14843, 19432, 41777, 34647, 5467, 7432, 3992, -12916, -17755, -24213, -990, 32430, 15315, 2611, -28221, -54879, -42457, -107, 3642, -3452, 21566, 54179, 43975, 11878, -1304, -20584, 2928, 18563, 25084, 31774, -7637, -10863, -9085, 11323, 19983, 18182, -9593, 1180, 26933, 26805, 9946, -2832, -41520, -34252, 959, 21412, 58871, 33534]
14146C3534k7138P067n059J9263m2912j0280j3080K2663K176o492j3408j9782
14134e3448J0417K2252K0077L2472O896r33O751p547j2620j1329q390p330l2660
14121c5392k7079M2585K1065J1283J5236J6241R748j1157K5104j1680k1328m3207
14109h581j6537P466j0077K136L025J7580N98K3837o721j3583J4193r169J8124
14096B2291K9862J5679j8134j1908o658k2684n363O235J3368K1865k443j2894
14084B9216J1686m160j3195l0528l2648k7916P120R563J5744J3433l763L240L1247
14071I039J9845j1270k0941K2232K8746k9395n643l094o603K3991J3371k9479
14059A0799n024J3333R601p848Q820J973J4385p785m078l5539l3078K3294p14
$$ y = [33534, 6396, 13463, 8404, 27667, -15245, -25525, -38605, -15942, -13766, -20258, -33666, -53448, -43031, -20779, -702, 31770, 38666, 37733, 44484, 36937, 24317, 12988, 4598, -2732, -35392, -62471, -19886, 1179, 12462, 27698, 43939, 53687, 42530, 67634, 55954, 34626, -8581, -25118, -17652, -27729, -25593, -22568, -4988, -4390, 19447, 12726, -857, 13336, 4167, 22291, 52153, 67832, 49698, 37790, 31132, 8448, 3085, 9320, 22688, 44553, 42110, 29216, 40902, 36742, 23547, -6981, -39629, -67545, -60425, -50862, -35118, -21685, -25448, -22208, 9039, 28884, 17614, -3327, 18905, 47651, 18256, 12613, 9519, 2916, 26907, 40278, 10799, 5775, 19108, 28709, 20861, 29681, 31654, 46039, 38254, 34176, -1363, -34441, -11147, -11861]
14046a1861J1293L0210k1000l0300O390J4083j2122K782K3534j225J1492o573
14034A6703k0890M765l2J7860J7790k2191j0215J8376K7953o420r663j6607j7091
14021C38q820M7137j0673k8192K82k3726l362L0388m007P459j8501n2K6305J1118
14007B5694j0567K050P708J5760N795Q740n244j6746j7501J2460j3940k8979J9506
13994D736L5721O860J2510k017k791p771j0675k1469j7524J87L9854J3892l1136
13981B0377n412j3296l42P951L512n52P917j1614j0413O040Q985j2469p873j2809
13967a9998q098n45J0593K3408J3910P324l6217j5179j589J1006P516K747P194
13954B072j112l1209K1167Q068l5114J398K4870J9967l034j9803k7564L511L8346
$$ y = [-11861, -568, 29642, 8642, -21658, -15268, -1185, -13307, -10525, 13009, 11784, 23276, 16703, -4187, 578, 546, 18406, 36196, 14005, 3790, 22166, 50119, 43699, 34036, 17429, 338, -8482, 38655, 27982, -210, 72, -23654, -27016, 3372, -635, 6824, -11677, -11729, 14576, 25694, 15127, 17177, 24885, 40645, 46440, 55180, 49936, 33190, 15689, 28149, 14209, -14770, 4736, 40457, 47317, 59827, 57810, 55019, 47248, 36573, 15104, -2420, -2233, 37621, 51513, 20377, 14965, 1669, 1327, 9278, 12790, 12238, 20155, 8541, -1872, 4168, 13153, 684, -7189, -19998, -28096, -28641, -18048, 5360, 19270, 26594, -9623, -24802, -26391, -15385, -7869, -5122, 2072, 960, -30249, -9082, -1014, -36128, -34730, -9860, 10107, 7073, -12730, -40294, -36783, 1563]
13941A563L2975K2217p346l348q808j7064m13J3105k7989l2729K338K6900K3161
13928B4562J2371m777p899j0511R951l027J1788J0847J0087m9712m4316K3837
13916a6799J8800j853k7280K4700J7413M901l659j6247J159J536j0047j1098j397
13903a9871k262K2100J5149k2762l895k956K0795K5699K3835p721m7824k7907
13891b7620l329K482J3307l08j79J1353P258j6155j9952J0540N200o113J034k0390
13877d2872p905J0006M2684K3717K3654k1447r305J048r00k306j6480p093m180
13864a1379R270J6587j9440l29K2861K393J45q150r239L534M959J0818J891l837
13850B0084j227J2735k6785j9637J3011m508k5245J4427M3125O658k3724j2840
$$ y = [1563, 34538, 56755, 49409, 46061, 37253, 20189, 19776, 32881, 4892, -27837, -25499, 1401, 24562, 36933, 32156, 24257, 13746, 23697, 20670, 32458, 43305, 53392, 3680, -40636, -16799, 2001, 148, -27132, -2432, 14981, 19882, 16223, -24, 1135, 2671, -7376, -18474, -19871, -22133, -33, 15116, -7646, -11541, -14497, 6298, 31997, 55832, 48111, 287, -27620, -30949, -28467, -15160, -15468, -15647, -4294, 2964, -13191, -33143, -22603, -17403, -23516, -22482, -42872, -50777, -40771, 1913, 25630, 49284, 27837, 18532, 19580, 18680, 16374, -106, -7199, -11379, -2109, 14478, -4962, -5291, 17570, 19963, 20108, 11958, 2719, 6253, 11212, 22030, 23921, 20084, 18857, 31592, 4807, -14830, -1819, -6327, -31572, -17145, 25980, 32638, 8914, -3926]
13838c926p651j1770J0077L551M355l866Q852q141j6962P017K1245J6927j4891
13825D817J9094p120l249P151m8046r02J8903J7690j1874r751M138k2416J5443
13812a6122M6032l606L571M672n680N317K066K461k8786j4064L147K0863L1659
13799E1530K655j0063j4904k1211N977J9563k0511K077j562K109j3490J3080O744
13786B1994P321K0639o197j0122J4067o606q465N723M473m159j3278j5062J1201
13773B1529N890J7480r61j6929j0942K4855O222j6626j0030j0494k6348j577j6886
13760c4817O530o600J7604J4373m827l36L7206P006j4019o37M692M264o158k253
13746B2028l998M930J4065O455l5735j9827L234R233o536j93j7931k4066J0174
$$ y = [-3926, -11577, -23347, -13270, -9719, -5364, -9230, -378, -8519, -25481, -18464, 2781, 19708, 4817, 23911, 16791, 13542, 20693, -27353, -28255, -9352, 8338, -3536, -13287, -9149, -31565, -16122, 29910, 26304, 29875, 34547, 28867, 34184, 36250, 38711, 9925, -4139, -992, 19871, 51530, 54185, 44122, 29218, 8007, 13984, 33547, 13036, 15113, 13551, 15660, 2170, 15250, 21994, 29315, 49954, 43757, 33635, 47702, 41096, 32631, 38354, 42827, 38668, 25390, 10328, 21529, 27419, 44899, 43938, 27009, 16067, 40922, 47144, 30518, 20488, 9994, -16354, -17931, -34817, -28287, -34887, -17283, -2910, -7737, -8073, 29133, 36139, 22120, 21483, 26175, 30439, 24281, 22028, 18030, 22960, 37025, 43480, 7745, -12082, -8848, 385, -6151, -6344, -24275, -48341, -38167]
13733c8167K8173K4630K1206m406j4878K295O092O672J04l426J45j3827k6849
13720a2236J1314J863j2649Q355J1555J2308J5980p340j4914P430K1202k5215
13708A7653j9651K1358m113K601L19J4684j1281k0764K2266J2404q495J2782J2533
13695E2296o185K615j8131j7400J5437K5969R560j3266j657K3186l6472l2687
13683C265j6638M682J2147p236j1587K318Q363J6911J5882J5818J0451J206k5426
13670C0156N860o955m589l951K5155J3515r050Q658k2866j4245J5671O877j4808
13657B9428q306o491n15N664Q970J9624J9470j6077j180k0081k7960J8177P200
13644B7923j9831M371J6398q978n899q2q053K0666L416N149Q285Q841k5956k1110
$$ y = [-38167, -9994, 14636, 35842, 31436, 16558, 18853, 24945, 31617, 31721, 28295, 28440, 14613, -12236, -922, 941, -11708, -3353, 8202, 20510, 36490, 29150, 14236, 21666, 42868, 17653, -1998, 19360, 15247, 17848, 18167, 32851, 21570, 806, 23072, 35476, 26981, 39763, 52296, 46111, 48726, 30595, 13195, 28632, 54601, 64161, 50895, 49238, 72424, 35952, 3265, -13373, -8691, 3456, -3780, -15367, -13049, -4686, 12225, 28107, 43925, 54376, 55582, 30156, 36016, 29061, 24472, 20521, 45676, 59191, 50141, 58799, 35933, 21688, 37359, 44236, 29428, 21122, 14631, 14116, 19780, 28750, 48374, 67844, 51767, 50587, 30506, 2546, 20723, 27923, 8092, 12463, 28861, 19883, 13984, 13902, 5849, 26515, 29931, 35080, 43365, 52206, 26250, 5140]
13630E140j9098j7747K0860m935l134j333m265J0861P776K4945M052l18K0806
13617D3610J8485K3488J7014j1534m6191m6179L189k4002j9380J8407K3914K0558
13605B1379K1887j476m253j8381k3723J5626K1779K4270K8104k7638k3148p9K3133
13592E7480n635j0002J8783K1485J1319n0463m165j416j4211K80l7275P74k642
13579a5688J8445J4822J1631O152j9596J8074J3584j9170j3349l30l783N414k1205
13566d999m490J5680M1220j3542j6164j1985J2086p836J3282R972o239Q902Q61
13553C6748q113m008R234l4526q212J4951Q892k4017j477R567j4481J3703K8795
13540B7056K4580K1426L314j4616k5385j4444J703N347K500r023n550p748o94
$$ y = [5140, -13958, -31705, -10845, -15780, -18914, -20247, -24512, -13651, -5875, 19070, 23122, 22804, 43610, 62095, 85583, 102597, 91063, 44872, -1307, 1882, -22120, -41500, -23093, 821, 21379, 43266, 41790, 37537, 19156, -4567, 11059, 32838, 57108, 85212, 57574, 34426, 34347, 57480, 51845, 41843, 60626, 82111, 93430, 42967, 38802, 37386, 23175, 23455, -13820, -13046, -15688, 2757, 17579, 29210, 35362, 15766, 33840, 47424, 28254, 14905, 14575, 10792, 16206, -4999, -9489, 6191, 47411, 33869, 17705, 5720, 17806, 9970, 23252, 33224, 26985, 35887, 36748, 28635, 24627, 33861, -665, -8877, 6074, 14966, -9051, -10528, -961, -15442, -1739, 27056, 51636, 73062, 76376, 61760, 36375, 21931, 23634, 28981, 31481, 22458, 16908, 9160, 8466]
13527H466J1501J5520l136Q842j279n768J3413j4577m6723j7080J2171J6107K9772
13514B7229J1492n431j4806N260q901K163O967k7284j0170L4565O494J0044j9537
13501A8085r706K0822J8264J0234p231q973k3687K801L1157j8327m3778q319J9572
13488I14j215R03JL1184r410N111J9516L775p859j0046j3909l0262l9177L681
13474d6793K0038K5073R793J2841Q443L891J5420P358J2097m624q181j2405j2516
13461C0435j8380J0547N477J0461P184N767M336Q307M971O051J622l0795q255
13448C7728o79r316r643L707P885r206K7403K5003k211j9252p511Q551j0074k7586
13434A4799K2230J160m664P238l0862K9543M3451r564r139j1908m1390k5758J8475
$$ y = [8466, 19967, 35487, 32351, 41193, 39914, 34146, 47559, 32982, -13741, -30821, -18650, -2543, 27229, 38721, 33290, 18484, 23744, 14843, 17006, 23973, -3311, -13481, 21084, 27578, 37622, 18085, 8379, 29201, 47465, 57699, 50468, 41495, 17808, 20609, 51766, 33439, -10339, -18658, 914, -301, 602, 603, 31787, 22377, 27488, 47004, 50779, 42920, 32874, 18965, -11297, -50474, -46793, -26755, -1682, 8111, 20952, 29395, 33286, 48706, 56064, 68161, 63537, 55356, 42951, 30435, 12055, 22602, 28079, 38540, 45724, 51491, 55827, 64134, 69105, 75156, 76778, 45983, 37728, 37049, 27733, 18090, 21797, 29682, 20476, 47879, 72882, 70671, 51419, 43908, 52459, 42385, 14799, 37029, 38189, 33525, 40763, 9901, 39444, 82895, 73331, 64192, 52284, 10894, -14864, 3611]
13421C611L9894k982k4565o672J5268K3397j4072r171o303j228K5642Q700l923
13408D7596K91o172O082J6409J7064l4143l2093J7119K6449L391k0585L717N912
13395E1037O415J0861L951k4306k9655K9720K9254k8277j5833J9882K9583n921
13383G6711m2070m6240k4186K19K8458L3099J3367j1528k0979J3197K9090J1103
13371F0241j0959J3174J748r767j7695k5499L1337J8979j085k6855o778l29o850
13358A9662J2161L854J818k964L858R837k0149j265J6039r069N228Q253j3389
13345C3874j2852l683J6739K8861L211j3381N459j6344l2458k2097J3225J3501
13333A4055J105K1565J9341k1617k3254k158j9659j212L2901L2769J2886q530
$$ y = [3611, 43505, 40523, 15958, 9286, 24554, 47951, 33879, 24708, 18405, 17177, 42819, 51519, 47596, 47887, 41715, 47797, 64206, 81270, 47127, 15034, 32153, 58602, 61993, 41408, 45125, 51037, 57452, 68313, 72264, 47958, 18303, 48023, 77277, 49000, 33167, 53049, 82632, 76711, 34641, -11599, -35785, -35566, -7108, 25991, 39358, 27830, 6851, 20048, 49138, 60241, 49282, 62456, 64204, 54437, 36742, 11243, 42580, 61559, 60474, 33619, 26841, 26512, 19662, 31823, 35677, 37495, 34531, 38389, 48226, 28077, 26812, 42851, 33782, 39010, 47263, 33874, 21022, 17339, 34078, 62939, 66150, 52769, 58228, 41884, 9426, -12671, 554, 14055, 15160, 36725, 56066, 34449, 11195, 9037, -10622, -11834, 21067, 53836, 66722, 58192]
13321E8192j169k386j647j5230q751q143o942R243L658K0846K7541M810Q78J6069
13307I6969R658k8280l7314j1254l432o413j8471J0164L6780K2374J4416k3885
13295F1312j0952J5099r744L033J8083j9909j8061o066O894M0404N484j4415O110
13282G7272J6161p837j8725k13J700J0516l791j1376K78n187j0570Q673L4710
13269I1611J6172J4310R952j0182k1176l1610N986L1954K0751J0808K0591J6532
13257A75699K2944J8309N2503N2843P0103R6046J20386J04778J30944J21482Q9023
13246A055060J09097J49703J42564R3410k2569j38579k31016k64472j79546j44798
13236E68854j23209r6819p5393m1829l6166Q573j9022l0023j1312M278k3894k0560
$$ y = [58192, 57023, 54637, 52990, 37760, 29009, 20866, 13924, 23167, 26825, 47671, 75212, 80022, 80900, 96969, 106627, 78347, 41033, 29779, 26347, 19934, 1463, 11627, 48407, 70781, 85197, 61312, 50360, 65459, 55715, 58748, 76831, 56922, 38861, 32795, 39689, 80093, 85577, 71162, 77272, 93433, 85596, 66871, 66658, 68358, 78874, 75083, 63707, 63985, 58798, 48228, 56901, 91611, 107783, 122093, 132045, 121863, 100687, 69077, 75063, 107017, 127768, 138576, 159167, 175699, 198643, 216952, 269455, 322298, 392401, 488447, 608833, 713611, 844555, 966037, 1055060, 1164157, 1313860, 1456424, 1549834, 1527265, 1388686, 1157670, 893198, 713652, 568854, 445645, 348826, 273433, 231604, 195438, 204011, 184989, 154966, 143654, 147932, 124038, 103478]
13224A03478j6386n43m840n851P92N91p097J1266R464j8829l48K850M575R464
13210H8586K2J0973K3687J3957l0750l37p259j8366j1048l031K452j4393j8213
13197C6280j3444K5562J0970J0870j2528l1844K6950M907j3763J0959j7353o107
13185C1459k081l694J4336o720o289K6768O219K8735J8235j4644k3612j4012j150
13172E3550M612L1928l071j7578j8031n644n321L19L5608J8790J2278l350m201
13159I9889j1719j5797j314J0886L81p043K0793K683l6019j2187R494j613l258
13146E5176j7914m531o905j071N37M178L340j5365M033M2850J8103j7089J217
13133F6559m0748M002L4245r826j9041N138K50J3585O898k6599K5294L551r590
$$ y = [103478, 87092, 86549, 81709, 75858, 76650, 77241, 70144, 81410, 90874, 72045, 71697, 74547, 79122, 88586, 88608, 99581, 123268, 137225, 106475, 106138, 98879, 80513, 69465, 66434, 68886, 54493, 36280, 22836, 48398, 59368, 70238, 57710, 25866, 52816, 57723, 43960, 54919, 37566, 31459, 29378, 25684, 40020, 33300, 27011, 53779, 59998, 88733, 106968, 92324, 68712, 54700, 53550, 58162, 90090, 87019, 69441, 51410, 45766, 40445, 40764, 76372, 95162, 107440, 104090, 99889, 88170, 72373, 71059, 81945, 82326, 75283, 96076, 98759, 62740, 50553, 60047, 58434, 55176, 37262, 32731, 25826, 24755, 25292, 29470, 32810, 17445, 21478, 64328, 82431, 65342, 66559, 25811, 29813, 64058, 54232, 35191, 40329, 40579, 54164, 61062, 34463, 59757, 63308, 53718]
13120E3718o131P34J73j615O477J3591o935J572J2810J2505j0796K7444M801L6955
13106A45303J1905Q162j4396j0883k095q558P531K198q865l7703J632J7953L889
13093A16073K073N613R529j2489k4545l114K49j8933J2882n046j2565J7313M4024
13080A31064K9136O338Q49K387J3043L4021M3697L5330M8359M4879J2986O7808
13068D69897R1742N9070l0312p9827p2847o9128m6222n406r046l746j2714k0281
13056B71180p12r923m639j6195j1570k4588k6440m4427p708M9711J14j0118j8474
13043A46211r428k182o336J116K0703L2222J2927P422K657J3064J2410L1121N3330
13030C15237R7258R1801P3073Q8084P4403J29649J36864J61845R2870k8350j92986
$$ y = [53718, 47587, 48321, 48494, 46879, 53356, 66947, 60012, 61584, 74394, 86899, 76103, 103547, 108348, 145303, 157208, 165370, 150974, 140091, 137996, 129438, 136969, 139167, 130302, 92599, 94231, 112184, 116073, 118146, 123759, 133288, 120799, 96254, 93140, 93389, 74456, 87338, 82292, 69727, 87040, 131064, 160200, 166538, 167387, 169774, 182817, 216838, 260535, 295865, 344224, 389103, 402089, 469897, 561639, 620709, 590397, 510570, 437723, 368595, 322373, 316967, 307921, 304175, 291461, 271180, 270468, 260545, 255906, 239711, 228141, 203553, 177113, 132686, 124978, 174689, 174803, 164685, 146211, 136783, 134601, 128265, 129381, 150084, 182306, 195233, 202655, 205312, 218376, 230786, 261907, 315237, 412495, 504296, 577369, 665453, 739856, 869505, 1006369, 1168214, 1261084, 1232734, 1039748]
13019A039748k60521j94458j54086q2095m8256l3592k1500l6933l7957Q773L866
13008A82989P451j7055N739J5693L5087K7975N965q325J9644p134k6990l2727
12996B08312L842K9841r656o7277o328J9341K1540Q611J0131N2364Q5839P0349
12984D26909O4668P4675R5828R6249J06459J39790J44825J28965q037j76101k84034
12973H10196k23751j39927r2853l4510k4521j3018M792m90l0792k1363n171L889
12961B32481J0091p780O32K438L110Q207q771k911j2413J8756L2676k5136R22
12948B52302J4498j558Q855K3085K5967O2852N8017M2242Q1921J08873N7304L9933
12936G74291L2485M6665N6885P305j7360o8077j51535k27156k34930j69737j19921
$$ y = [1039748, 779227, 584769, 430683, 348588, 300332, 266740, 245240, 208307, 170350, 179123, 182989, 190440, 173385, 179124, 194817, 229904, 257879, 263844, 255519, 275163, 268029, 241039, 208312, 212154, 241995, 232339, 165062, 158734, 178075, 199615, 208226, 218357, 270721, 356560, 426909, 491577, 566252, 662080, 758329, 864788, 1004578, 1149403, 1278368, 1270331, 1094230, 810196, 586445, 446518, 353665, 319155, 294634, 281616, 286408, 285918, 255126, 233763, 228592, 232481, 242572, 234792, 235424, 237862, 240972, 249179, 240408, 237497, 225084, 243840, 276516, 251380, 252302, 266800, 265242, 274097, 297182, 323149, 386001, 444018, 486260, 568181, 677054, 734358, 774291, 806776, 853441, 910326, 917631, 900271, 832194, 680659, 453503, 218573, 48836, -71085]
12925g1085l5285L0596Q4676P6337P5896O6271K4958M966r345N380J0574K6066
12913B90005L2390O962p902J0823J5596J0542K2041J9054K628j3716P44J3055
12901D02222M2056M7892m154k5075K393J5242K3158n29j1433M873L2856N276k1201
12888E13576M956J5087L6431J9387K6913M7823J7105L1440K5059k651J4691K2014
12876G71831K7518L8030L9482K3814P607k0281Q449M0520L1275N5428P1761N0717
12864A146151N8835L1542K9588L3886M0157L9486O0856J9726K6236N1418N5136
12853A593017R3455P2020M8275N0254N8763J18442J42079Q7931R2607J10924J17196
12842B584963J11408J31436J70467J77647K14961K19693K49389K60287K91608
$$ y = [-71085, -106370, -75774, 8902, 85239, 161135, 227406, 252364, 257330, 247985, 253365, 263939, 290005, 322395, 329357, 321455, 332278, 347874, 358416, 380457, 399511, 402139, 388423, 389167, 402222, 444278, 492170, 488016, 462941, 465334, 480576, 503734, 503205, 491772, 496645, 529501, 534777, 513576, 518532, 533619, 570050, 589437, 616350, 664173, 681278, 712718, 737777, 735126, 749817, 771831, 799349, 837379, 876861, 900675, 908282, 888001, 896450, 936970, 968245, 1023673, 1095434, 1146151, 1204986, 1236528, 1266116, 1300002, 1340159, 1379645, 1440501, 1460227, 1486463, 1537881, 1593017, 1686472, 1758492, 1806767, 1857021, 1915784, 2034226, 2176305, 2264236, 2356843, 2467767, 2584963, 2696371, 2827807, 2998274, 3175921, 3390882, 3610575, 3859964, 4120251, 4411859]
12833D411859L27766L77360M02009M81015N31038N82905O84088Q00486R52633
12824I551159J103610J306066J571384J928788K384439L050306L904855N057385
12816B9857992O608567Q702335J1328632J4528614J8107754K1538942K4183069
12809A34855905K5669756K6526533K7920827L0607476L2873598K8660104Q065865
12802C15180064k0069531m1886511n6670681n2140902l7973415k5973973j7849129
12795F2615922j2627900r273267o986952n397926m264308l403835k730904k209449
12787A5721381j845462j562474j289942j101928r40009q03490o70437n64590m86324
12778F456725m86894m62710m09941m02221l40550k70142k38378k24147j79935
$$ y = [4411859, 4739625, 5116985, 5518994, 6000009, 6531047, 7113952, 7798040, 8598526, 9551159, 10654769, 11960835, 13532219, 15461007, 17845446, 20895752, 24800607, 29857992, 36466559, 45168894, 56497526, 71026140, 89133894, 110672836, 134855905, 160525661, 187052194, 214973021, 245580497, 278454095, 307114199, 315180064, 295110533, 253224022, 196553341, 144412439, 106439024, 80465051, 62615922, 49988022, 40714755, 33727803, 28329877, 24065569, 20661734, 17930830, 15721381, 13875919, 12313445, 11023503, 9921575, 8981566, 8178076, 7507639, 6943049, 6456725, 5969831, 5507121, 5097180, 4694959, 4354409, 4084267, 3845889, 3621742, 3441807]
12769C441807k02741j75857j55809j50651j55408j29531q8709j06897p7771n4075
12759B144358j5880j6416j1883K0496O1150O7172M9952O5700Q9404J55316J62009
12748B771378N3414k64368m70128l83146k52383j47194j02754p6496n9917m2221
12738A026185l7266m5215l6003m0260j2663l0347o1011m3367o116k8570n5271
12727F30096Q264K8177o340l4689l7768j0614l0436L436J4956k2098q096l945
12715E30943j8677l091j7873l7709j7625j2753p222k7961q875M760J4283J275
12703C99475j0992K608n391k1898l432K011j8315P4M4272J8845L776J5663J6990
12690D43686K0040K8400M1502K2874M0096N6523M3922N5066M1038L3461j2586
$$ y = [3441807, 3239066, 3063209, 2907400, 2756749, 2601341, 2471810, 2383101, 2276204, 2198433, 2144358, 2128478, 2112062, 2100179, 2120675, 2181825, 2248997, 2298949, 2364649, 2454053, 2609369, 2771378, 2824792, 2560424, 2090296, 1707150, 1454767, 1307573, 1204819, 1128323, 1068406, 1026185, 988919, 943704, 907701, 867441, 854778, 824431, 763420, 720053, 713937, 685367, 630096, 638360, 666537, 660197, 625508, 587740, 577126, 546690, 550126, 565082, 542984, 534888, 530943, 512266, 509175, 491302, 453593, 435968, 423215, 415993, 388032, 379157, 383917, 398200, 399475, 388483, 391091, 385700, 363802, 360370, 362381, 344066, 344140, 388412, 407257, 411033, 426696, 443686, 463726, 492126, 533628, 556502, 596598, 653121, 697043, 752109, 793147, 826608, 814022]
12679H14022n1733j23073j70895k00730j59224q6543l9340L5595N8801N1228N6221
12668A84329J5596o83M6539M9528j8049k1153o680k2704j3002R33O676o228J6664
12655B31766K2997K9558J3767j0960j024l7315k0928k0542l922j84J4495k0927
12643A96781l5916L522N762k7435J7878J4936Q475J4168M028R910k2901k7284
12631A61924k55L5757J3863j932m0975P642K3427J6680j7641k3926j5040M915
12619A64439O906j4002k734j4319j1365j6974k2608k3182j0136l825J2647Q556
12607G3403L74j3074N621M2802K2919k498r126J574J2034j3265k7333J7739R32
12594A12102j1184k5075r139n934j4518j5361K9236K7819j0272j1861L166J4491
$$ y = [814022, 762289, 639216, 468321, 267591, 108367, 21824, -17516, 18079, 76880, 128108, 184329, 199925, 199242, 245781, 295309, 277260, 256107, 249427, 226723, 213721, 214654, 221330, 215102, 231766, 254763, 284321, 298088, 287128, 286104, 248789, 227861, 207319, 203397, 203213, 217708, 196781, 160865, 164387, 170149, 142714, 160592, 175528, 184003, 198171, 202199, 212109, 189208, 161924, 161669, 197426, 211289, 209357, 168382, 176024, 199451, 216131, 198490, 174564, 159524, 164439, 171345, 157343, 154609, 140290, 128925, 111951, 89343, 66161, 56025, 52200, 64847, 73403, 73777, 60703, 66324, 109126, 132045, 129547, 120421, 121995, 134029, 120764, 93431, 111170, 112102, 100918, 75843, 66704, 60770, 46252, 30891, 60127, 87946, 77674, 65813, 68979, 83470]
12582H3470j316O575j2726K435Q611J2342J3701J2085j7333q979k6127j1191L192
12569F4739j58n555J7970J0772L346l0815o239K0034L4195j3656m7642m177K3848
12556F6662J3990j269k5309J454J1337K7596M8802J7731n437l6588J1566j0524
12544A20011l8749L807K0930j0248k8250l9863p697Q777l452J0775J1761L864
12532E1666k357k08M089M972R511q273M825J2403o002l099J8557J854N606j9831
12518G3713p77m743m070j7809r426L778p724L397K7406j0799l1363K648M394J5441
12504D4066K5703N241m8091n1592k561K1633K4923J1586K1273J3928K2944O415
12492I5468K0001k7060q523L6187O699l1562j0876J3706j257J5436k8102j1695
$$ y = [83470, 82154, 88729, 76003, 78438, 87049, 99391, 113092, 125177, 107844, 98865, 72738, 61547, 64739, 64581, 59026, 76996, 87768, 91114, 60299, 54060, 74094, 108289, 94633, 46991, 42814, 66662, 80652, 79383, 54074, 55528, 66865, 94461, 143263, 160994, 155557, 118969, 130535, 120011, 81262, 85069, 105999, 95751, 67501, 27638, 19941, 28718, 25266, 36041, 47802, 51666, 49309, 49101, 53190, 58162, 67673, 59400, 64225, 76628, 70626, 67527, 86084, 87938, 93544, 73713, 72936, 68193, 64123, 46314, 36888, 40666, 32942, 36339, 63745, 52946, 21583, 24231, 28625, 44066, 69769, 75010, 26919, -24673, -27234, -5601, 19322, 30908, 52181, 66109, 89053, 95468, 115469, 88409, 79886, 116073, 122772, 91210, 80334, 94040, 92783, 108219, 80117, 68422]
12480F8422k794O318L0713o710j5970J3103L0964k0212j3653q911j9891k967J8017
12467G6429J108m101k926L911J097j7713Q8K8954K2916k2866j7459k708r813j3428
12453D3489J2892K352m600q63M934K0946j8567n123N567K0588P235k2193N985
12440G2642K8240L340q108k9067r593K4581j4965l5979K2135M842J4654K7959
12428A00681k3893j6065P478j6623j6689O941N922o476K1709J6034L29Q294n856
12415H1786J453K358Q823L880p823J6941L293j1844p647J8044J5024j1845l1178
12402H1265j7961R932K3794Q443k335k096R525k02j0416p577j4439j5075Q118
12389G0976K0463P206K450q057K1384J7744j5452l6413l328K1906J3141k5789
$$ y = [68422, 65628, 71946, 102659, 95949, 79979, 93082, 124046, 103834, 90181, 81270, 61379, 58412, 76429, 77537, 73436, 70510, 74421, 75518, 57805, 57893, 86847, 109763, 86897, 69438, 66730, 56917, 43489, 56381, 58733, 54133, 53270, 58204, 79150, 60583, 55460, 61027, 81615, 88850, 66657, 72642, 100882, 104222, 96114, 67047, 57454, 82035, 67070, 31091, 53226, 58068, 72722, 100681, 76788, 60723, 68201, 51578, 34889, 41830, 47752, 41276, 62985, 79019, 79348, 87642, 81786, 83239, 85597, 94420, 98300, 90477, 107418, 110711, 98867, 91220, 109264, 124288, 112443, 81265, 63304, 73236, 97030, 105473, 103138, 101042, 110567, 110365, 99949, 92372, 77933, 62858, 70976, 91439, 98645, 101095, 93038, 114422, 132166, 116714, 80301, 76973, 98879, 112020, 86231]
12377H6231j0646K4583K1714K0940K2822J563L5085L8807M9619O2694M3707O5868
12365D62987Q6468J36392J42736J67125J30758J18988J26400J22232P0805j9581
12355A545310j27450k01232k56730k24835j71100p9763o3856p2313m1075j4015
12345B92941k3516k3302o4536o6374k0932k2598J8754l912J1512K4082N605o226
12333A21498m138k6682m161j8862R677q924R329j2768q577N896N764j0901K5603
12320H2754Q851k0939j7092p420K6477l769l11J6197m914J4394k0210j9050Q542
12307F3510K706O056J0533j161N206J7903r196P585R715j868k8347j1154R242
12294H0730J81J899n816J0441J3622K2139K8156k1057k7848j0471K534o078j1024
$$ y = [86231, 75585, 100168, 121882, 142822, 165644, 167207, 202292, 241099, 290718, 353412, 397119, 462987, 549455, 685847, 828583, 995708, 1126466, 1245454, 1371854, 1494086, 1564891, 1545310, 1417860, 1216628, 959898, 735063, 563963, 484200, 420344, 348031, 306956, 292941, 269425, 246123, 181587, 115213, 94281, 71683, 90437, 86525, 98037, 122119, 127724, 121498, 117360, 90678, 86517, 67655, 77332, 68408, 77737, 64969, 56392, 62288, 68052, 57151, 82754, 91605, 70666, 53574, 46154, 72631, 68862, 68551, 84748, 79834, 94228, 74018, 54968, 63510, 66216, 72272, 82805, 81644, 86850, 104753, 95557, 103142, 112857, 110989, 82642, 71488, 80730, 80911, 82810, 76994, 87435, 101057, 123196, 151352, 130295, 102447, 91976, 94510, 88432, 77408]
12281G7408J3396j0444j279P852K6956K977k6685j7486N700j7580k355J877N828
12268F6165n718J2514M0108J0105j7676j7135j277M847r883l658l0246k5550J8636
12255D1232K1374J4403J6213j1268k757J2371K184p076l2416O346j600j3389J9704
12242F5321J1959o204q466L6557K3439q867m373j0853M841J7637r364J3704N540
12229A30871l317j1402k2142J2284K7434k3607j0531J3454R830r629r066J6655
12217A20834k1763m657J7899K5712K599j0177K0613j5368J531J5680P663q306
12205A52260O841m710j3004j0691J9895L858j3695J0914j1323o852k6360j1007
12193I6126K3474K1116J2962j6943j3380k2882J705j9054K0923M7193j802P046
$$ y = [77408, 90804, 80360, 79081, 86933, 113889, 116866, 90181, 72695, 78395, 60815, 58460, 60337, 66165, 60447, 72961, 113069, 123174, 105498, 88363, 87086, 91933, 82050, 78392, 48146, 22596, 41232, 62606, 77009, 93222, 81954, 79197, 91568, 93752, 86676, 54260, 60606, 59006, 45617, 65321, 77280, 71076, 62610, 99167, 122606, 113739, 109366, 98513, 103354, 120991, 111627, 125331, 130871, 127554, 116152, 94010, 106294, 133728, 110121, 99590, 113044, 122874, 113245, 104179, 120834, 99071, 94414, 112313, 138025, 140624, 130447, 151060, 135692, 137223, 152903, 160566, 152260, 159101, 154391, 141387, 130696, 150591, 154449, 140754, 151668, 140345, 133493, 107133, 96126, 119600, 140716, 153678, 136735, 123355, 100473, 102178, 83124, 104047, 151240, 149438, 156484]
12181A56484K841l784M521l091J3876K1355J1651o134J492k5948k8208K461J7999
12168A65515j4864J3510L3500N874j3943m9264o729K4983L9046L4680k564j8691
12156B11053j2868j7399m785L2555J0282j2468n91O789J2538j1794j6990P132
12144B03454J0584R431m530Q158n312k1563P076P282N291r195K1726n112k7399
12131A99891n03L9692K732k556j0082N373M1905O378j0807n957m892R345K9615
12118C00134j2899k2521q418L2884K0929J1286P82J7156N366Q150l742J1699j4782
12105C46024L77J7777q401j5875P143K3197R516m2691j1110J6784L2793J9969
12093C95503R807j0094J2169O925j587j494o37j3235J9251J0707J9355J6696K3109
$$ y = [156484, 159325, 155541, 160062, 156971, 170847, 192202, 203853, 197719, 199211, 173263, 145055, 147516, 165515, 150651, 164161, 197661, 203535, 189592, 140328, 133599, 158582, 197628, 232308, 229744, 211053, 198185, 180786, 176001, 208556, 218838, 206370, 205779, 212568, 225106, 213312, 196322, 203454, 214038, 223469, 218939, 227097, 221785, 200222, 207298, 214580, 219871, 210676, 232402, 227290, 199891, 199388, 239080, 241812, 239256, 229174, 234547, 276452, 282830, 272023, 266066, 261174, 270519, 300134, 287235, 264714, 256296, 289180, 310109, 321395, 322177, 339333, 344699, 352849, 349107, 360806, 346024, 346401, 364178, 355777, 339902, 347045, 370242, 379758, 337067, 325957, 342741, 375534, 395503, 405310, 395216, 407385, 414310, 412723, 411229, 410592, 397357, 416608, 427315, 446670, 463366, 486475]
12080D86475m938j3552K087L202j1816L431r931R071j5019L391M2675K1458K7353
12067E43887J8564m660P066k147L4755K9925k4211k0690N459R748J2486j699L4184
12054F42667M7120M1216K722J8481l304J3010L7691R294J9074K756K8177n050
12042H53854P596L2844L0237K2041L8013K4533o604k327L2377M7074J5456J9500
12030A114594L2856K9655K0994K6735M6523N9391N1683J9983L8257M3684K9724
12019A514079L4346K2248L3465M8223N9847L8873K5792N5588O7663O1845P0911
12008B032880P9162Q3718J02746O6799P6752J09252J02956R3974R8608R5737R8420
11997C041004J14896J29489J17107J39101J67324J71713J64436J77622J69808
$$ y = [486475, 481537, 467985, 470072, 473274, 461458, 464889, 454958, 464029, 449010, 452401, 495076, 516534, 543887, 562451, 557791, 564857, 562710, 597465, 627390, 603179, 582489, 587948, 597696, 610182, 608483, 642667, 689787, 731003, 733725, 752206, 748902, 761912, 799603, 808897, 827971, 830727, 858904, 853854, 861450, 894294, 924531, 946572, 984585, 1009118, 1002514, 1000187, 1032564, 1079638, 1095094, 1114594, 1147450, 1177105, 1198099, 1224834, 1271357, 1330748, 1382431, 1402414, 1440671, 1484355, 1514079, 1548425, 1570673, 1604138, 1652361, 1712208, 1751081, 1776873, 1832461, 1900124, 1961969, 2032880, 2112042, 2195760, 2298506, 2365305, 2442057, 2551309, 2654265, 2748239, 2846847, 2942584, 3041004, 3155900, 3285389, 3402496, 3541597, 3708921, 3880634, 4045070, 4222692, 4392500]
11988D392500K13226K19930J90589K30862K46974K89880L16197L14922L66417
11979F781497L58596L67457L98352M38990N00257M88453N37912N76350O11893
11970A1059757O50231O48327O90863P49752P70173P98560Q10965P92000Q09131
11961A7779759P81222P76408P04956O51335O14983M92024L99902K90340J57608
11952B2648537L6668p2391k47196l78109m74314n79219o53742p13307p56005p98224
11942A8012698q37226q11760q13901p81647p80605p52580p32674o99382o61379
11933A1141544o18587n63905n33104n05078m83745m54405l96735m07470l61972
11924F816543l48334l04607k96302l07751k95413k37787j98521k13802k11375
$$ y = [4392500, 4605726, 4825656, 5016245, 5247107, 5494081, 5783961, 6100158, 6415080, 6781497, 7140093, 7507550, 7905902, 8344892, 8845149, 9333602, 9871514, 10447864, 11059757, 11709988, 12358315, 13049178, 13798930, 14569103, 15367663, 16178628, 16970628, 17779759, 18560981, 19337389, 20042345, 20693680, 21308663, 21800687, 22200589, 22490929, 22648537, 22685205, 22612814, 22365618, 21987509, 21513195, 20933976, 20280234, 19566927, 18810922, 18012698, 17175472, 16363712, 15549811, 14768164, 13987559, 13234979, 12502305, 11802923, 11141544, 10522957, 9959052, 9425948, 8920870, 8437125, 7982720, 7585985, 7178515, 6816543, 6468209, 6163602, 5867300, 5559549, 5264136, 5026349, 4827828, 4614026, 4402651]
11915D402651k07474j89313j72094j60651j34813j55421j34813j40057j13619
11906B994396j13409r1059p8712q9330j13312j08229o7659q4303p8197p3992n8937
11895B037257p7605l3819m5905o8217m7026m3707o2477n0992m3613m6500k8905
11884A488491m6579q4492m6281m4091l7739k8584l3943k7489M616j1861k2402
11873A109646j2241m1053n1395k0011k1515k0457l5883j6745l3275l5608j3372
11862H08091j0253N435l362q504k991j9170n85p4l2145m0107k7488j5737j3274
11849F39836k758J279M661j0774j9766k3853j2700k2438j3319N183r223k2499
11837E13629k5465m330j3659j0394k079J7303N966J0404J1094r177k2454p605
$$ y = [4402651, 4195177, 4005864, 3833770, 3673119, 3538306, 3382885, 3248072, 3108015, 2994396, 2880987, 2789928, 2711216, 2621886, 2508574, 2400345, 2332686, 2248383, 2170186, 2096194, 2037257, 1959652, 1925833, 1879928, 1811711, 1764685, 1720978, 1658501, 1607509, 1563896, 1517396, 1488491, 1441912, 1357420, 1311139, 1267048, 1229309, 1200725, 1166782, 1139293, 1143909, 1132048, 1109646, 1097405, 1056352, 1004957, 984946, 963431, 942974, 907091, 890346, 857071, 821463, 808091, 797838, 803273, 799911, 791407, 788416, 769246, 768661, 768587, 736442, 696335, 668847, 653110, 639836, 637078, 638357, 643018, 632244, 612478, 588625, 575925, 553487, 540168, 545351, 536128, 513629, 488164, 483834, 470175, 459781, 457702, 475005, 480971, 491375, 502469, 493292, 470838, 463233]
11825D63233l0795j5194J3540J8287N311j9496k2357r933k964J059j2313m63J7614
11812D05529k165M864l5432k8204O584L349p006j3901j0685J1592j5592o220L917
11799C16630k6435L969M394j1184j1934R31J9938j871n61j3128l1802J0303j2555
11786B46695N983K5768q076j1403k214j4330q316R019N745K4502m699l3216k4084
11773B11374o785o740J2243k9210k0234j2229O159L1392J8472K1362K593q19k5505
11760B02073k0330j4386k939j4504j990n177O464P246j0365J6240J2443J938Q939
11747A85652L147k1224k5253m872N576J9723j6117k3086M8875L5872k2908n0098
11735A35287j9221J8075J7976K933j4148J0709M556l4302J4129M0025l175l7190
$$ y = [463233, 432438, 417244, 430784, 449071, 454382, 434886, 412529, 402596, 399632, 400691, 388378, 387915, 405529, 403364, 408228, 372796, 344592, 351176, 354525, 347519, 333618, 322933, 334525, 318933, 312713, 316630, 290195, 294164, 298558, 287374, 275440, 276371, 296309, 294438, 293877, 280749, 248947, 259250, 246695, 252678, 278446, 270370, 258967, 256753, 242423, 234107, 243126, 248871, 273373, 268674, 235458, 211374, 204589, 197849, 210092, 180882, 160648, 148419, 154578, 185970, 204442, 225804, 228397, 227578, 202073, 181743, 167357, 164418, 149914, 147924, 142747, 149211, 156457, 146092, 162332, 174775, 176713, 185652, 188799, 167575, 142322, 137450, 143026, 162749, 146632, 123546, 172421, 208293, 185385, 135287, 116066, 134141, 152117, 155050, 140902, 151611, 156167, 121865, 135994, 176019, 172844, 135654]
11723A35654r028k7343l654J7319K2600N535p593J8057o285j4402l2363j5517
11711H2980K0336J6738r067j163o980p847O888j1307K3498M2631j0992j7538k8311
11698I9866o248J4845L1460P306j6389k9787K8756K3123j2257j0336n995J0975
11686A35319j5967l8073J0293K3321r955P234k3724m4954m345J0946M1589M3646
11674A35330k822m1059j2689R166J1377Q852J7320J6961m868k6459J0560L488
11662A25157p077j8272o85J368j6876j8579J210K3964J1680k5937j0736j073L0606
11649I4750K7631j5365j7234J1129J0605o715m971J212m9711j7240n682L706L365
11636C5480j691K700J1948J8875Q359n408k1736k1465L008J891o74J155k473N664
$$ y = [135654, 126626, 99283, 95629, 112948, 135548, 141083, 133490, 151547, 145262, 130860, 98497, 82980, 103316, 120054, 110987, 109824, 102844, 94997, 101885, 90578, 114076, 156707, 145715, 128177, 99866, 93618, 108463, 139923, 147229, 130840, 101053, 129809, 152932, 140675, 130339, 124344, 135319, 119352, 81279, 91572, 114893, 104938, 112172, 88448, 43494, 39149, 50095, 91684, 135330, 132508, 91449, 78760, 87926, 99303, 108155, 125475, 142436, 137568, 111109, 121669, 125157, 118080, 99808, 99123, 100491, 83615, 65036, 66246, 90210, 101890, 75953, 65217, 64144, 94750, 122381, 107016, 89782, 100911, 111516, 104801, 99830, 101042, 51331, 34091, 28409, 32115, 35480, 33789, 36489, 48437, 67312, 75671, 70263, 48527, 27062, 30070, 31961, 31287, 32442, 29969, 35633]
11622C5633P114L722l386R051N284J4023J1288N48O463m913j2223j4529k0002
11609C8073P358K7729K1461O196j1511k575n715mJ5564L57j682j2882r181k4261
11595D8927O061N480Q56M873J3210p249J60k0041j5814R284J0035q082o833k6358
11581A4509m299Q287J4820l444K5637L1441j8788j3450k646J2445O908j2896m674
11568E3850K0721j3997P766m051j3293j6369J3186j2995l1640N460k70q82J6690
11555B4176M0824L087m2791r795O787o40j3271j1277K2112J2391J0099M557J9889
11542F6148q527k8681N407l893J4322L345j0579k9987n90J2814r240P24J3708
11529B4971J4665R535K1870J3111p812k1486K4915R941n5014l1395o377J7946
$$ y = [35633, 42747, 46469, 43083, 52134, 57418, 71441, 82729, 83277, 89740, 84827, 72604, 58075, 38073, 45431, 73160, 94621, 100817, 89306, 86731, 81016, 81012, 96576, 96933, 95251, 82369, 73188, 48927, 54988, 60468, 61324, 66197, 79407, 72158, 72318, 52277, 36463, 45747, 55782, 47700, 40867, 14509, 10210, 18497, 33317, 29873, 55510, 86951, 68163, 54713, 52067, 64512, 71420, 58524, 53850, 74571, 60574, 68340, 64289, 50996, 34627, 47813, 34818, 3178, 8638, 8368, 7486, 24176, 65000, 68087, 25296, 15501, 22288, 21648, 8377, -2900, 19212, 31603, 41702, 46259, 66148, 57621, 28940, 34347, 30454, 44776, 48121, 37542, 7555, 6965, 19779, 10539, 11263, 24971, 39636, 49171, 71041, 84152, 76340, 54854, 79769, 89710, 34696, 3301, -3076, 14870]
11517A4870K5477r880o077p708P131j6275j4953J4468J6270Q263J3844J9317j175
11504F3572k2958L12K041k3179J7357J5102j3691k2765k6187L93J3328m460K179
11491A044r491j3724L907J7685P716r734M273j85p270J3246M063J97j3504l881
11477e658L6996p100r911N198J3187n443j9632J7179L4943j270l619j3618k5039
11464A6213j2209J0535K3513j0142k0152q896r454M811K5789M8386Q883j7361
11452E9916m1780l525J3162j0546j9298K7661J3800j0695k7475k4635K6403J5873
11440A8861j6416m334K9075J1513Q366k359j4577j7243o140K7755J243K972m637
11427C4079K5292l0499q798K6666j2572l5482m481K2125j1458N6J5257J2240o643
$$ y = [14870, 40347, 30467, 24390, 16682, 23813, 7538, -7415, 7053, 23323, 31586, 45430, 64747, 63572, 40614, 40926, 42967, 19788, 37145, 52247, 38556, 15791, -10396, -10003, 3325, -1135, 1044, -8447, -22171, -18264, -579, 7137, -2597, 1676, 1491, -5779, 7467, 11530, 11727, -1777, -5658, 31338, 24238, 14327, 19525, 32712, 27269, 7637, 24816, 59759, 58489, 54870, 41252, 16213, 4004, 14539, 38052, 27910, 7758, -1138, -10592, -5781, 20008, 68394, 77277, 59916, 18136, 14611, 27773, 17227, -2071, 25590, 39390, 28695, 1220, -23415, 2988, 18861, 2445, -1889, 27186, 38699, 47065, 44706, 30129, 12886, 6746, 34501, 35744, 38716, 34079, 59371, 28872, 20074, 46740, 34168, -1314, -5795, 16330, 4872, 4928, 20185, 32425, 25782]
11414B5782r686j2719J4421K5942J1192j0363j5186j7311l2629k7927L801J2872
11402c1811M6664K1817M352n455j4068J75K382K702k330j6193o89Q885J4220j6734
11388A3917r914P433M367j2745l5370n150K2688K3123K3697m926j6217k2289r480
11375b0866l716N826K8372j036L877j4123M7960N887j5860k7976q205K887J0483
11362A3510J7511n368j4433N89Q190J6608j2497p467o044J6896K5532l649j3171
11349C6207k177p820k8515K1444J83K613L828j5686j6993K637j4346K1704K4907
11336B7986J4392l5606r674L499M760J0011K3221P915L842q100k1288q024r56
11323A1978m363K458k291J1523J7604M672o002Q014P578j9075l1574Q183O202
$$ y = [25782, 16096, 3377, 17798, 43740, 54932, 44569, 29383, 12072, -20557, -48484, -44683, -31811, 14853, 36670, 41022, 35567, 21499, 21674, 24056, 26758, 24428, 8235, 7546, 16431, 30651, 13917, 4003, 11436, 15803, 3058, -32312, -37462, -14774, 8349, 32046, 27120, 10903, -11386, -20866, -24582, -18756, 9616, 8580, 12457, -1666, 46294, 52181, 36321, 8345, 140, 3027, 13510, 31021, 25653, 11220, 11809, 19999, 36607, 24110, 16643, 10599, 27495, 53027, 49378, 36207, 34030, 26210, -2305, 19139, 19322, 21935, 25763, 10077, -6916, -4279, -18625, 3079, 27986, 42378, 6772, -2902, 597, 5357, 15368, 38589, 46504, 50346, 42246, 20958, 12934, 11978, 7615, 10073, 7782, 19305, 36909, 41581, 35579, 43593, 51171, 32096, 522, 8705, 14907]
11310A4907k8580J0346J539o753k58K2388J4477j8029q286J4607k353Q505N647
11297B8157l955j5705j0833m405p518R722p576N122L0857J82j7218J1517l230
11284A5117J421J2j4421J3819R89O656k5342j7143q399k147n973J1428K3834j3617
11270a3766l955K6140R667N454j191Q607J4950j3833Q270k1587j2592J4895q472
11257A2587J065j1172K1364L416P879M44k6170r736J0900n542j0923J0064J4877
11244A9053J0147P759j3719l1405j5212K253J1559L7330J6512j1360k9638m1457
11232c8178j85J6145L2851J8707j3182j7241p098K1556Q446j5191J356j6051J8189
11219A0124j3347Q15J8718K2193j3992k4627k0137J6258K3689q883k2438j6236
$$ y = [14907, -13673, -3327, -1788, -8541, -8799, 13589, 28066, 10037, 1751, 16358, 14005, 22510, 28157, 24202, 8497, -2336, -6741, -14259, -4537, -12113, -6991, 23866, 24048, 6830, 18347, 15117, 16538, 16550, 2129, 15948, 16937, 23593, -1749, -18892, -27291, -29438, -35411, -23983, -149, -13766, -17721, 8419, 18086, 23540, 22349, 30956, 45906, 32073, 40343, 18756, 6164, 21059, 12587, 13652, 2480, 23844, 27260, 35139, 35583, 9413, -323, 10577, 5035, -5888, 4176, 19053, 29200, 36959, 23240, -8165, -23377, -21124, -9565, 27765, 44277, 32917, 3279, -38178, -38363, -22218, 10633, 29340, 16158, -1083, -8181, 13375, 21821, 6630, 7986, -8065, 10124, -3223, -2408, 16310, 38503, 24511, -116, -20253, -3995, 19694, 10811, -11627, -27863]
11207b7863l00j0403O017K8527R238m137J193o161J4750J1915k4825j8765J5392
11194e422j1112j9168Q759K0773n322J6895L1319j9049l5938l4385q526K3613
11182c7563J1015j3958L1203N906L1526Q112R639j5800j6039M367K4109R416k1968
11169B9965k6061l677P277M3950J6251k8122k6830j5588L0708R246k5377j7770
11157f028K4465J4870J7247j1555p868J9177l039k2771P953J3715j142o617j1597
11144B6810q566J1378j8772k7262k6679P332M4764J4603o246l428k7601n970L953
11131a5684J6297J7192O378l544k3784j9479J3466J0543J3502N156K3355j5758
11119B7640l1378j5523L2905M768k1720l4519l968O729K0109L9912j6430k1538
$$ y = [-27863, -28163, -38566, -32549, -4022, 5216, 1079, 2272, -3889, 10861, 22776, -2049, -20814, -5422, -16534, -35702, -26943, -6170, -11492, 5403, 36722, 17673, -18265, -52650, -61176, -37563, -26548, -40506, -9303, -3397, 28129, 36241, 45880, 30080, 14041, 18408, 42517, 51933, 29965, 3904, 227, 7504, 51454, 67705, 39583, 12753, -2835, 27873, 37119, 11742, -6028, 18437, 33307, 50554, 38999, 31131, 50308, 47269, 24498, 32451, 46166, 45024, 38407, 26810, 18244, 29622, 10850, -16412, -43091, -35759, 9005, 23608, 17362, 13934, -13667, -19637, -15684, 613, 17805, 24183, 20639, -3145, -22624, -9158, 1385, 14887, 20043, 43398, 27640, -3738, -19261, 13644, 18412, -3308, -37827, -41795, -35066, -14957, 24955, 8525, -13013]
11107a3013k9099J0682K4941J4883k73j8298k8178q08O739K6813Q851q092P808
11094B956K2424J5856j1815K9345j8971j0875p221p905p808j714j3376O373o106
11081h837l84J0208n374J0340m098m564n766K5720J9777j211n713j0733j8710
11068F55M556k521j9142J0171p354l6692J4615N3158J5067r902j2145j0747J90
11055i1n906J4050J2372J7012J2588k964M536J0803L0541J5064j1118J1354j474
11042A06767k1988k0333k3957M890J9673L2931p688p43J0399M6574J7559p215
11030A56869l960o275l738N275J5453J1870O817K916j1586J836Q573L900p074
11017A80876j1380k7475j7372J8777J0757k2796J6077l319j3101K2749M909m0967
$$ y = [-13013, -42112, -31430, -6489, 8394, 8121, -10177, -38355, -39163, -32424, -5611, 3240, -4852, 2956, 25380, 41236, 29421, 58766, 39795, 28920, 21699, 13794, 5986, 4272, -9104, -2731, -8837, -9221, 987, -4387, 5953, 1855, -2709, -8475, 17245, 37022, 35811, 30098, 19365, 655, 5211, 2690, -16452, -6281, -13635, -50327, -35712, 17446, 32513, 22611, 10466, -281, -91, -5997, 8053, 20425, 37437, 50025, 47061, 51597, 62400, 92941, 108005, 96887, 108241, 106767, 84779, 64446, 40489, 45379, 65052, 97983, 90295, 89552, 99951, 146525, 164084, 156869, 152909, 146634, 142896, 148171, 163624, 175494, 182311, 185227, 173641, 175477, 184050, 187950, 180876, 169496, 142021, 124649, 143426, 154183, 131387, 147464, 144145, 131044, 153793, 158702, 117735]
11005A17735j1496l235l1787j490R083o756k807l671Q346j7805k2446j9174o160
10992H337q381q110j9423J0417J7057Q946o174k4858J1752K1687j0655j1441J1124
10979B78K2820J9292J3178N126k8386l3030j535N601l664K4593O646j6318p569
10966G032M924J9286M105k1714P307P535J4095J8688m186r529l4489k5510n513
10953a7969j149L492J0642M604N042k4480P693O69p478r152J8874J7171j513K8936
10939C5382J9497O615l8236m2929j7232J8124K3322r873M590J3218j3925k2044
10927b3491K803J4056J4436m229n010M160N483j59l340j7036j2946J8879J2082
10914E688k4819k417L1650j753j2186j8844L715J6652K2920r219k6983l1609P77
$$ y = [117735, 106239, 103004, 71217, 69727, 78810, 72054, 69247, 65576, 73922, 56117, 33671, 14497, 8337, -44, -8154, -27577, -17160, -103, 8843, 2669, -22189, -10437, 11250, 595, -10846, 278, 23098, 42390, 55568, 60694, 32308, -722, -2257, 3344, -320, 24273, 30919, 14601, 7032, 11956, 31242, 35347, 13633, 20940, 28475, 42570, 61258, 57072, 47543, 13054, -12456, -17969, -19118, -15626, -4984, -380, 4662, -19818, -12125, -11456, -18934, -28086, -9212, 7959, 6446, 35382, 54879, 61494, 23258, -19671, -36903, -18779, 4543, -5330, -740, 12478, -1447, -23491, -20688, -6632, 7804, 3575, -1435, 2725, 8208, 8049, 4709, -12327, -25273, -6394, 5688, -19131, -21548, 10102, 8349, -3837, -22681, -18966, -2314, 20606, 11387, -15596, -47205, -46428]
10901d6428J6807J5927l258J2390J4202K6360J4030r418j3453o632j8953K1832
10889B3406j627k786J6457j9318J9448J1638J0413k2224j8631j507K817R930n215
10876B2801j9910k8615P039L0765r180k0240O957O664K3781J1763k461J6603j6849
10863B9118o916J1589J8090k1267r749N663l9142K1903K0597R86J7709m159R859
10850E4281p469k2J5832J1060l125m677k357k699j8552k1689J7861Q892j3134
10837C4202j0579O750j6069J8425R032K9190q344N921R249m771Q507j0416j1367
10824E9730l220l0771j745j6673q748k122N747J66k2320J8648M119J1582q301
10811F092J0479j4535J7411J0613m397k6966r278J0750Q61p609o650O643J0078
$$ y = [-46428, -29621, -13694, -16952, -4562, 9640, 36000, 50030, 40612, 27159, 20527, 1574, 23406, 21779, 18993, 35450, 16132, 35580, 47218, 57631, 35407, 16776, 15269, 18086, 28016, 22801, 2891, -25724, -18685, 12080, 2900, -17340, -10383, -3719, 20062, 31825, 29364, 45967, 29118, 22202, 33791, 51881, 30614, 20865, 26528, -12614, 9289, 29886, 30872, 48581, 44422, 54281, 46812, 46790, 62622, 73682, 70557, 65880, 63523, 60824, 42272, 20583, 38444, 47336, 34202, 23623, 30373, 14304, 32729, 41761, 70951, 62607, 68528, 77777, 73006, 81513, 71097, 59730, 56510, 25739, 23994, 7321, -1427, -3549, 2198, 2364, -19956, -1308, 2811, 14393, 6092, 16571, 2036, 19447, 30060, 25663, -1303, -10581, 169, 1030, -6579, -13229, -6586, 3492]
10798C492M490j7117J1774P917M728O096o580P991J6981j0479k6555M768N222
10785A2728L298j14K3366n573n441J5177j1114n601K2831J991k5988l9691j2555
10772b6686K2134J4169Q226j4071j966j3189N528J1130J7734J4178j2037p250
10760A7900K0687K7862j8231k6640j7893J54J1931L122J1272P21j1688J3501j1381
10747B1317O954J8495j5720j6925O113N624J6107J1858n692p715K1974j9374j9593
10734B3423L6381K4405m292L975j1064j8194J068P769p440k5674j7498M628R704
10721B7191p164J8846L0191L210j836O445j2421j6953l0567p858K8082J4526k8772
10708B2920r755J1156m764O518Q184k984l839M3707J8374k2475M965k2915k8130
$$ y = [3492, 7982, -9135, 2639, 10556, 15284, 21380, 14800, 22791, 39772, 29293, 2738, 7506, 12728, 16026, 15912, 39278, 33705, 28264, 43441, 32327, 26726, 49557, 51548, 25560, -14131, -26686, -4552, 9617, 17843, 3772, 1806, -11383, -5855, 5275, 23009, 37187, 25150, 17900, 38587, 66449, 48218, 21578, 3685, 3839, 15770, 18892, 30164, 30885, 19197, 32698, 21317, 28271, 46766, 31046, 14121, 20234, 25858, 41965, 53823, 48131, 40416, 62390, 43016, 23423, 59804, 84209, 79917, 83892, 72828, 54634, 55702, 63471, 56031, 30357, 12859, 17487, 27191, 20027, 38873, 69064, 72274, 70438, 76883, 64462, 47509, 16942, 9084, 37166, 51692, 22920, 13165, 24321, 19557, 26075, 34259, 31275, 27436, 71143, 89517, 67042, 72007, 49092, 20962]
10695B0962j5518L4727K3643n598o639O996J2181O126j2229R86J2366r174M559
10682G3388k399J2758K6284L150J920L279M893L166p434m820j860J3718L3646
10669A59689J1737l5127m728k555J8322N124j0265J4409J1266K0213J2624J2955
10657B13664J596m624O497K3858K4114m136n608J5104M415Q278L8978L0468J1388
10644C63992J2540J7643M140K5063J1689M3033M9189O0081P5968J04464Q7292
10633H55094Q3267P9376J04371J60255J86982K05189K69572L30172M68687N88644
10623C331609P11819Q07754R36275J050734J147051J229575J357288J465136J343604
10614A3380845Q95392L96313J51649K19791O19705J041491J356393J661590J991537
$$ y = [20962, 5444, 40171, 63814, 58216, 51577, 58573, 70754, 76880, 64651, 65637, 78003, 68829, 73388, 70989, 83747, 110031, 113181, 115101, 118380, 123273, 126439, 119005, 114185, 112325, 126043, 159689, 171426, 136299, 131571, 129016, 147338, 152462, 142197, 156606, 167872, 188085, 200709, 213664, 215260, 210636, 217133, 240991, 265105, 260969, 255361, 270465, 274880, 283158, 322136, 352604, 363992, 376532, 394175, 398315, 423378, 435067, 478100, 527289, 587370, 663338, 767802, 855094, 938361, 1017737, 1122108, 1282363, 1469345, 1674534, 1944106, 2274278, 2742965, 3331609, 4043428, 4851182, 5787457, 6838191, 7985242, 9214817, 10572105, 12037241, 13380845, 14276237, 14672550, 14824199, 15043990, 15663695, 16705186, 18061579, 19723169, 21714706]
10605B1714706K344875K510422K121992Q27367p15899j462694j078693k31770
10597B6030306N99802J230874J679003K090627K500569K548824J571968o06036
10589C7645937k952429l927124l343786k199188j093048l46029K00082O59049
10581B4643464R68151R13334J61113j364715k874105l335075k808302j954161
10573A4349704j232575o78240l10091j06313k1370j37537m90074j108512j623818
10564H641174j751166j549860j197787q80095o48320m81038l45409k50764j88178
10555A348557j55777j14156j18883q1634p4563o8824q0633q9814o3904l1684n2333
10544D16352j5702K411l0974k2334k9370l0719k7620q890k6343p286K523l998
$$ y = [21714706, 24059581, 26570003, 28691995, 29519362, 28803463, 27340769, 26262076, 26030306, 26630108, 27860982, 29539985, 31630612, 34131181, 36680005, 38251973, 37645937, 34693508, 30766384, 27422598, 25223410, 24130362, 23784333, 23984415, 24643464, 25611615, 26524949, 26686062, 25321347, 22447242, 19112167, 16303865, 14349704, 13117129, 12438889, 12128798, 12022485, 12001115, 11863578, 11373504, 10264992, 8641174, 6890008, 5340148, 4142361, 3262266, 2613946, 2132908, 1787499, 1536735, 1348557, 1192780, 1078624, 959741, 878107, 803544, 734720, 654087, 564273, 500369, 468685, 416352, 400650, 403061, 372087, 349753, 320383, 289664, 262044, 253154, 226811, 219525, 222048, 218050]
10532B18050j4638r56J8419q914k2949n0695k7571J9365M672O587q527k36p469
10519A25138j3405o056J8713J2296j5719j0551M994j670k1148J0076M83l3816
10507F9335J3328k0103k2502L267j6568K2800j6821j6J6171L998J5025K5878J5659
10494A09451l4305r523L82J0144J2414o364k8852Q038L2981K122j7665J6609r457
10481H5975j9356O604J3788K9369j3086l3128k1127N189K5573M647L594J4225
10469A02267q51M764O539N098l5171k5035k8966n626R197o513o686J3200N480
10456C7697L1728O021j6626j282j3976j6644j3009j352Q681k8647L799K5695J8115
10443D0200m946j737r530Q893l3729j615J9487J5274j4970j184M4974j8615M462
$$ y = [218050, 203412, 202456, 220875, 211961, 189012, 138317, 110746, 130111, 134783, 141370, 132843, 132607, 125138, 111733, 105677, 124390, 136686, 120967, 110416, 115410, 113740, 92592, 102668, 103151, 69335, 82663, 62560, 40058, 43325, 26757, 49557, 32736, 32720, 48891, 52889, 67914, 93792, 109451, 75146, 65623, 66005, 76149, 88563, 82199, 53347, 61385, 94366, 96488, 78823, 95432, 85975, 66619, 73223, 87011, 116380, 103294, 70166, 49039, 54228, 79801, 84448, 88042, 102267, 101416, 106180, 112719, 117817, 82646, 57611, 28645, 23019, 32216, 25703, 19017, 32217, 37697, 69425, 75446, 58820, 57538, 43562, 26918, 13909, 12557, 21238, -7409, -3610, 22085, 40200, 35254, 33517, 23987, 32880, -849, -2464, 17023, 32297, 17327, 16143, 61117, 42502, 46964]
10430D6964M756J2131r877j3258J661j2929j0298n944J874n835M486Q40L4455
10417D9026J7317j7759j8987k5154j4861R656K831J5677J1138J977J6187K3478
10405G0526j4053m2550j4178j9252m674K8021K1595o669k2876K435Q583m897k1603
10392a9592k6924N881L1579L458q023l4978j131J5003J1053p477j8491K8161J2672
10379h809K324j2940J4907n520J1574q274J429q99Q64J4024J9921l0710j792m932
10365h833k937J4476j6296j2741j3522L1207L1603J925j2476j8591k5784M5192
10353A3223q41j0280k7791l167l195K4304K4679j3737J5279N325R033P111j5126
10340B4817j7339r499J774m216j60k519j9257k8663M4414o05l01K7526j3614j0164
$$ y = [46964, 51720, 63851, 53974, 40716, 42377, 29448, 19150, 13206, 15080, 9245, 13731, 14571, 49026, 66343, 48584, 29597, 4443, -10418, -762, 2069, 17746, 28884, 30861, 47048, 70526, 56473, 13923, -255, -19507, -24181, 3840, 25435, 18766, -4110, -1675, 6908, 2011, -19592, -46516, -40635, -9056, -5598, -13621, -48599, -49730, -34727, -23674, -31151, -49642, -21481, -8809, -6485, -19425, -4518, -10038, 1536, -6738, -5309, -6208, -5344, 8680, 28601, -2109, -3901, -8833, -11770, 2706, -13590, -26331, -39853, -8646, 22957, 24882, 12406, -6185, -31969, 13223, 12382, 2102, -25689, -28856, -32051, -7747, 16932, 3195, 18474, 23799, 32832, 39943, 24817, 7478, -2021, -247, -4463, -4623, -7142, -26399, -55062, -10648, -11253, -11554, 15972, 2358, -7806]
10326g806j5453K589K7321n571j9984j5860J2709j658j777R003J0076R393n391
10313b409k5500j3130P213K7463j0068J1941P589q307j6548M615Q124r756j3877
10300c2650M0518K6280O882j7695j7694j7177l64P118K1298J7488J4910r309k4979
10287A4626k546m141Q977q460j9602k3175r110K1490J7860K3836j5557J2884n289
10274A1793j056J1620k52q125n190K5987M559l9908j0756K8003M1414o156j2030
10261C9903k2749j6559m83J952p69q504K6585J5957J0102j7266O160J757n831
10248C0255J7895j7407K913j9147k3998r314J4976n14J6249m388k1527r632k617
10235b6256Q072K6733L2910j4457j1294j6658K4916j872j3432j8227J0421L769
$$ y = [-7806, -23259, -20670, 6651, 1080, -18904, -34764, -22055, -23713, -25490, -16487, -6411, 2982, -2409, -27909, -41039, -33826, -6363, -16431, -4490, 3099, -5208, -21756, -17141, -9017, -18773, -32650, 7868, 34148, 41030, 23335, 5641, -11536, -11900, -4782, 16516, 34004, 48914, 39605, 14626, 12080, 7939, 16916, 8456, -11146, -34321, -43431, -21941, -4081, 19755, 4198, 17082, 11793, 10737, 22357, 22105, 13980, 8790, 34777, 39336, -572, -11328, 16675, 58089, 51933, 39903, 17154, 595, 112, 2064, 1295, -7209, 19376, 35333, 45435, 28169, 34329, 36086, 30255, 48150, 30743, 33656, 14509, -9489, -18803, -3827, -4341, 11908, 7520, -14007, -23639, -26256, -18184, 8549, 41459, 27002, 15708, -950, 23966, 22094, 8662, -9565, 856, 4625]
10223D625k6715q966J6889N586P371j6091m075r828j2270L6875o118Q194J238
10210c285J224j4740Q808l961m659K224J7603j4686O844J7097q21K7966J1062
10197E0676l7611j7559j2772P745J8051j5376J0310p923k533Q122J4467P790K4575
10184D7962J8337L0817k1301k0227J7522K0187Q237k9710j0068K5262J1580L2
10172I8630k3576l742R468J8925J025J0213K0064M209N356J2628r113K3726J9126
10159A86939L2447j3546J0301J480j938K783J070l1046m9701p621L162l260k6326
10146A04744k5046R006n328J5563J6161K2200j654m8118m329r106j2801n990n653
10133D9649r734j6260J0130O176k970Q46l993m0567l4557N0499M0611J160j2059
$$ y = [4625, -22090, -31056, -14167, -8581, -1210, -17301, -21376, -31204, -43474, -6599, -12717, -4523, -3285, -2061, -16801, -7993, -11954, -16613, -14389, 3214, -11472, -4628, 12469, 11648, 39614, 50676, 13065, -4494, -17266, -9521, 8530, -6846, 3464, -4459, -6992, 1130, 15597, 23387, 47962, 66299, 97116, 75815, 55588, 73110, 93297, 101534, 71824, 61756, 87018, 98598, 98630, 75054, 71312, 80780, 99705, 100730, 110943, 131007, 135216, 140572, 153200, 144087, 167813, 186939, 219386, 205840, 216141, 217621, 215683, 218466, 219536, 188490, 138789, 131168, 134330, 131070, 104744, 79698, 88704, 83376, 98939, 115100, 137300, 135646, 87528, 83199, 74093, 61292, 55302, 49649, 39915, 23655, 33785, 39961, 36991, 37837, 33844, -6723, -41280, 9219, 49830, 50990, 38931]
10120C8931l2443O490o02j2420j3176J0762K1823j8846k9562L307K2147J3986
10108A0397j8883j6029J477k096k5435K2580N446j6519o399l476N194k436K7115
10095a9064L389j9941J5055k4261p869m660P230J0283K2467L2457K1321J4233
10083E0640k3855j9694l102J868k0097k447J8028k155j4929q906J7577J3952o835
10070D5P072O855k262k4007p614m0369r094K3419K4194P776k741M6919J7230j6549
10056C0874O90j5275j1020L4457j3185K2721q830k1921k4888k2044j515K111Q260
10043a9565M5310J2601l130j4369k0669M198j9543N241J4418r712N606J0437K4287
10030C5110k4690r625p874J0076J1682K2210R434r734j9671l957n200q075k7347
$$ y = [38931, 6488, 12978, 12376, -44, -13220, -2458, 19365, 519, -29043, -25736, -3589, 10397, -8486, -24515, -23038, -25134, -50569, -27989, -22543, -39062, -45461, -48937, -43743, -46179, -19064, -15675, -35616, -20561, -44822, -52691, -57351, -50121, -39838, -17371, 15086, 36407, 50640, 26785, 7091, 3989, 5857, -14240, -16687, 1341, -814, -15743, -24649, -7072, 6880, 45, 7117, 13972, 11710, -12297, -19911, -60280, -69374, -45955, -21761, -13985, -16726, 30193, 47423, 30874, 31564, 16289, 5269, 39726, 26541, 49262, 40432, 18511, -6377, -28421, -29936, -27825, -19565, 25745, 38346, 35216, 20847, 178, 4376, -15167, -9926, 4492, -5220, 386, 10823, 35110, 10420, 795, -7079, 2997, 14679, 36889, 46323, 36589, 16918, 12961, 7761, -314, -27661]
10017b7661J4859L194o832P679J9608m325J4743J9701Q423J1664m1148k4237n448
10004i780l5530k0646n763m459r076J8430J9082L5299J6157J3477J9646l7368
9992e31k7382n285Q049j0387n831k570Q513O836O652J8554J6233j7748j3199O744
9978a1352m092k5124j4709L3009K7691Q392o740n946P682j6880Q145J6670m1113
9965b4367l8828K717K9910J8086K3237k0267P242j2929k4873l786j4581K0878
9953c7561J1786K2357J9791j2091j5689l8740q709J6655M9005L3144j82j5485
9941B4281J3341n41M117n574J4248N078l0598j6291l929O537l2675R806J7491
9928E291K45Q520j4087J0436n093l4311j6938O797M517k422L995O567M1805j0154
$$ y = [-27661, -12802, -9608, -16440, -8761, 10847, 6522, 21265, 40966, 49389, 61053, 19905, -4332, -9780, -45310, -65956, -71719, -76178, -85254, -66824, -47742, -12443, 3714, 17191, 36837, -531, -27913, -33198, -25149, -35536, -41367, -43937, -35424, -28588, -21936, -3382, 12851, -4897, -18096, -11352, -15444, -40568, -55277, -22268, 5423, 13815, 7075, 1129, 8811, -8069, 76, 16746, -24367, -63195, -60478, -30568, -12482, 10755, -9512, -2270, -15199, -40072, -43858, -58439, -37561, -25775, -3418, 16373, 4282, -11407, -50147, -58856, -42201, 6804, 39948, 39766, 24281, 37622, 37081, 41198, 35624, 49872, 54950, 24352, 8061, 4132, 10669, -22006, -12200, 5291, 5536, 14056, -31, 10405, 5312, -28999, -45937, -39140, -34623, -37045, -33050, -26483, 15322, 5168]
9914E168k4734O108l050K9759K0275m950k2302r265p115l38j4231J2099K8355
9901A5779M3j3213j9304P101R704J629k1385j3087p408n269m155K7655J800k4931
9887d5041n859L1851N529k1754K736N207P955p252J5733J0697J3788J5293j3816
9874A5067j4087k4472J7330n467P068J1617O02Q789J253l2999j6106j8387j6714
9861f6506J4114K2652q342N348J5503m828J6627R662p455n5l8459K5202K5646
9848I109k4555l2064l552J3703J2276K4109Q598N34q341R81r759k9200r359M791
9834d2729L1680K9647p84j4892K2126L30k1072j3903M184K6920K1543K208k3032
9821B2226l0886m9390j8116K4035L463J3341K8703K8510L361o314j5880l3566
$$ y = [5168, -19566, -13458, -16508, 13251, 33526, 28576, 6274, -2991, -10106, -10444, -24675, -12576, 15779, 15822, 2609, -16695, -9594, 110, 1739, -19646, -32733, -40141, -45410, -49565, -21910, -20110, -45041, -50900, -19049, -13520, -35274, -32538, -27331, -19376, -26628, -10895, -198, 13590, 28883, 15067, 980, -23492, -6162, -11629, -4561, 7056, 7658, 16447, 17700, -15299, -31405, -49792, -66506, -52392, -29740, -38082, -32734, -17231, -22059, -5432, 4230, -3225, -3280, -41739, -16537, 9109, -15446, -47510, -51062, -37359, -25083, -974, 7624, 8158, -183, 798, -8961, -38161, -47520, -42729, -11049, 18598, 17814, 2922, 25048, 25378, 4306, -9597, -5413, 21507, 43050, 45258, 22226, -8660, -58050, -76166, -52131, -48668, -35327, -6624, 21886, 25247, 18933, 3053, -30513]
9809c0513J0373J3004K7981j492k381J0076J4914l505o406k7677J4288K2346j2106
9796B8902M351L1428K4706R370k549j137l841M7558L3170J6844M1637R4551Q8036
9783D13026J39976K12142K73742L16690L76384L84502L55684L91792N98400Q50182
9773D312520O75832k07356j184479j322721r34207m90428k54334j66815j05727
9764C22285m0611n6328p4619l3316l2116J70O364J8825j140p846n205J9262L017
9751A18742l5563k0858r673j030K243o825o939k9261n913o388Q140k226j0411
9738e962j5968J721Q329J7166K645j5250r8K5392J1643M573J9990J6689n619k696
9724F2555j8078l6347r100N878P975J9767j2823k1248L724J5727j9733j8806j0100
$$ y = [-30513, -20140, -7136, 20845, 19353, 16972, 27048, 41962, 38457, 32051, 4374, 18662, 41008, 28902, 33253, 64681, 89387, 98757, 96208, 95071, 91230, 138788, 171958, 188802, 230439, 324990, 413026, 553002, 765144, 1038886, 1355576, 1731960, 2116462, 2472146, 2863938, 3462338, 4312520, 4988352, 4780996, 3596517, 2273796, 1339589, 849161, 594827, 428012, 322285, 281674, 225346, 150727, 117411, 85295, 85465, 91829, 110654, 109514, 101668, 96463, 115725, 118742, 83179, 62321, 52648, 51618, 53861, 47036, 40097, 10836, 4923, -1465, 6675, 4449, -5962, -21930, -20209, -11880, 5286, 7931, -7319, -7417, 17975, 29618, 34191, 54181, 70870, 65251, 62555, 44477, 8130, -970, 4908, 12883, 32650, 19827, -1421, 2303, 18030, -1703, -20509, -30609]
9711c0609R884M87Q866J6082m582M319r653j3078j8242l34j5404p438J2849J3133
9697c3720j42M4526K0906j8655j5272M98n324q484j1028J5244O471J0588L773
9684I381J6964L653p685K516j4704j3620J4583j4131J18Q740K1570J0222j7464
9671B0143j1612O711K4590L5271J115L320R734J7397Q582J01158R3551N6822P1245
9658D38027N9280J02111J38540J84898K20238K0951l35239l36663j83823j05947
9648B02373r7971l4365k0478m1162j0473K78l5939j020J9833L7956Q038m0450
9636a3380j8472J0091M371J1308P135l309k3771j96K5173r068l3912r686J3207
9623d0509N401Q767l5N892j2439n458q443O770L2773J0872K6453j6007l3038j7873
$$ y = [-30609, -20725, -20238, -11372, 4710, 128, 4447, -5206, -18284, -36526, -36860, -52264, -59702, -46853, -33720, -33862, 10664, 31570, 12915, -2357, -1859, -7183, -15667, -26695, -11451, -4980, 5608, 9381, 26345, 29998, 22313, 24829, 10125, -3495, 11088, -3043, -2925, 5815, 27385, 37607, 20143, 8531, 15242, 39832, 75103, 76218, 79538, 89272, 106669, 115251, 216409, 309960, 366782, 438027, 497307, 599418, 737958, 922856, 1143094, 1164045, 828806, 492143, 308320, 202373, 104402, 70037, 49559, 8397, -2076, -1798, -37737, -38757, -18924, 19032, 27070, -13380, -31852, -21761, -17390, -6082, 1053, -2256, -26027, -26223, -1050, -10118, -44030, -53716, -40509, -35108, -26341, -26376, -20484, -32923, -38381, -46824, -40054, -7281, 3591, 30044, 14037, -19001, -36874]
9609c6874j1932J7888R950P48K4235O532K1178J452l137j1945q297m816j7687
9596a2705p130R704L7345k9121m2335J6328J0299P344J4682J3129l6712l346l530
9583b6048J931O175j0975k478j8798k7886J2082K9270K0378J3536J1976J187p633
9570B717l979q7k991Q679j9203o609k7102J926L3040k4739j6875R114L2157n206
9556a9158k127M866j9072R670J0361r316P007J9728N608L1637q49k9118j2485
9543c248j3764j3878K992Q748o733j8687R276M3517J746r479o992m814O576J3819
9529I079J0043l4014j5813p563K0754K5002k757j365M6683P611m1004n980p720
9516B956k288M0556p682p556N451m3462k0389j7798J3142L9983J623m466K9847
$$ y = [-36874, -48806, -30918, -20968, -20220, 4015, 10547, 31725, 33177, 30040, 18095, 9798, 4982, -12705, -19835, -10131, 27214, -1907, -44242, -27914, -17615, -10271, 4411, 17540, -19172, -22518, -26048, -24117, -17942, -28917, -31395, -50193, -78079, -65997, -36727, -16349, -2813, 9163, 10350, 2717, -1262, -1349, -4340, 4339, -14864, -21473, -48575, -46649, -13609, -38348, -55223, -46109, -13952, -19158, -21285, -16419, -35491, -25821, -15460, -24776, -17769, 1959, 7567, 39204, 38355, 9237, -3248, -17012, -30890, -27898, -19150, -25883, -44570, -35294, 8223, 9969, 490, -6502, -11316, -4740, 9079, 19122, -14892, -30705, -38268, -17514, 7488, 4731, 3366, 50049, 57660, 16656, 10676, 2956, 668, 41224, 33542, 25986, 31437, -12025, -32414, -50212, -37070, 2913, 4536, 70, 29917]
9503B9917k803k7270P788N234o533j3350J0434J7152p810J9012K764l562j5474
9490A5499j8043p660J3194P652j9427Q913k27q629r577j4819K2483R002m535J650
9476d524N54N978J362R59k0647M751k0932k850K3215k695j0861Q182L958L0969
9462A7419K3596j3600j5993K488j7477j5124M552K3602k1881m7215O182L3792
9450a9659J9773j4493l1895R336K5746L0921L0533l535j0283p697j2726k1973
9438e952k5638K0389o435K113J7089j5122K2717q055j0674L232j0308j4022o935
9425c7601K7238l945j9217N797K8647K658L771l491n606P677j7945R766L2658
9412C0407K2344n950Q523j9877k2063J8141M147L947j6272R538l196m242j4460
$$ y = [29917, 27114, -156, 7632, 12866, 6333, -7017, 3417, 20569, 12759, 31771, 34535, 30973, 15499, -2544, -10204, 2990, 10642, -8785, 128, -99, -8728, -18305, -33124, -10641, -1639, -6174, -4524, -3970, 2008, 3370, 4329, -16318, -11567, -32499, -35349, -12134, -14829, -25690, -17508, -13550, 17419, 41015, 27415, 11422, 13910, -3567, -18691, -14139, 9463, -12418, -59633, -53451, -19659, 114, -14379, -46274, -36938, -11192, 19729, 50262, 46727, 36444, 28747, 16021, -5952, -31590, -11201, -17636, -15523, 1566, -13556, 9161, 1106, -9568, -6336, -16644, -30666, -37601, -10363, -14308, -33525, -27728, 919, 3577, 7348, 3857, -1749, 5928, -12017, -2251, 30407, 52751, 46801, 55324, 35447, 13384, 31525, 35672, 39619, 23347, 32885, 29689, 25447, 10987]
9399A0987j4452q379k654N110L144J4438j1566l910P636j2303p591J4845J8979
9386A4284l553k2093Q888P579k3265j2841k0853K82J119p455R152J0486J2507
9373b5763o216p192m019r00l009J7005j7438p758J0798l955J8240Q748j9540L2778
9359h221J8008k1301k9743q662k0616L3656P643q173J3062K5767L577J2692K2
9346A7711o281j0455j1937k433k0587j5783L5439J6964J8635j9914j3762k028
9334a4431r265o908L9170K5005r315k1544j8954O323K4948M83q909p390m995J512
9320d270J5362q037q777k5417l560J562l946J1827K7218j2739l2055J2330J7659
9307a2843j9307n219M914K6223J9413R570j7153j3371k764O831o641O093r457
$$ y = [10987, -3465, -11844, -14498, -9388, -6244, 8194, -3372, -7282, 354, -11949, -19540, -4695, 14284, 10731, -11362, -2474, 5105, -18160, -31001, -51854, -51572, -50453, -57908, -48756, -38270, -25763, -31979, -39171, -43190, -44090, -47099, -30094, -47532, -55290, -44492, -48447, -30207, -21459, -40999, -8221, 9787, -11514, -41257, -49919, -70535, -36879, -29236, -37409, -24347, 1420, 4997, 17689, 17711, 11430, 975, -10962, -13395, -33982, -49765, -14326, 2638, 21273, 1359, -12403, -14431, -23696, -30604, 8566, 33571, 24256, 2712, -16242, -9919, 15029, 15512, 6603, -787, -5782, -4270, 11092, 3055, -5722, -31139, -34699, -33137, -37083, -25256, 1962, -10777, -42832, -30502, -12843, -32150, -37369, -32455, -6232, 13181, 22751, 5598, -7773, -10537, -3706, -10347, -4254, -13711]
9294a3711J9445O241l1394R281J5177k508K2847J9709k4622l5773Q70J2387J6459
9281A4408P820j9352m679j3554P981k177J9754k858o369p810O315J8436l349k1997
9267g431j1108J9339J6072k7269O505j9079O857l994P588L238J2731K2181L3234
9254E8864p055k8961k6871N956j7483J776M7559K4234k731l2217l1425k1575j3638
9241d3567J2784m35r289K5424k100l0371L350P235L2420O418K4727j3723l5242
9228b2369J1877L7871j0767j8116O439J1414j1315j1824p820k1303O184L1086
9216A357M840K5765K197k2757j2621K8561J2603L213j7304n464J479r108R628
9203B2389J6727J0515j8702p628J1127k055q866J2813J1710j2828r807j8939r128
$$ y = [-13711, 5734, 11975, -19419, -10138, 5039, 2531, 25378, 45087, 20465, -15308, -14438, -2051, 14408, 22228, 2876, -1803, -15357, -7376, -9553, 10201, 7343, 974, -6836, -521, 17915, 14566, -7431, -18539, 800, 16872, -10397, -3892, -22971, -16114, -20108, -12520, -9282, 3449, 25630, 58864, 51809, 22848, -4023, 1933, -15550, -13774, 33785, 58019, 55288, 23071, -8354, -29929, -43567, -30783, -31218, -40507, -15083, -17183, -47554, -44204, -36969, -4549, 1869, 26596, 12873, -22369, -10492, 27379, 16612, -1504, 4935, 16349, 5034, -6790, -14610, -35913, -29729, 1357, 6197, 31962, 34159, 11402, -1219, 27342, 39945, 43158, 25854, 20390, 21869, 12761, 22389, 39116, 49631, 30929, 23301, 34428, 32373, 23507, 36320, 48030, 35202, 25395, 6456, -2672]
9190b672N018j4857M990O778J635K550O231n252L333J2835J7892k0665k7286n186
9176a4656p636N959j5821Q180J3688p462N755n845k7862J5419K3512K4024J6986
9163C4241K4295j3551L535k0286l9379l0014k6688P057L9355J4659R119P595K6858
9150C6796K2426K6155j5816j8404l3189j7117l5168k0892O93k902J7243J1864
9138b8311p027N314M954j3114o494q06P798L3830K4249p82l0247L785Q712k0373
9124a8512m032J6325J0377q682R079P403k0352j1353n421k1153k0515K8609J5328
9111b2899J4225k46K7352n058l1639k9435M49J5124K208Q073K1868J1673L534
9098A5229J1284j2676k9424l4654k3685K6638J6841M240O574K0960l857k3537
$$ y = [-2672, 2346, -12511, -7521, -743, 892, 3442, 9673, 4421, 7754, 20589, 38481, 17816, -9470, -14656, -22292, -16333, -32154, -23974, -10286, -17748, -11993, -17838, -45700, -30281, -6769, 17255, 34241, 58536, 44985, 48520, 28234, -11145, -41159, -67847, -60790, -21435, -6776, 2343, 9938, 36796, 59222, 85377, 69561, 51157, 17968, 851, -34317, -55209, -54516, -57418, -40175, -28311, -35338, -30024, -25070, -38184, -44678, -45484, -37686, -3856, 20393, 19611, -10636, -6851, 1861, -18512, -22544, -6219, 4158, -4524, 4555, 11958, -8394, -19747, -25168, -46321, -66836, -38227, -22899, -8674, -8920, 18432, 13374, -18265, -47700, -47251, -32127, -29919, -21846, 22, 11695, 15229, 26513, 13837, -15587, -50241, -73926, -47288, -30447, -26207, -19633, 1327, -2530, -26067]
9086b6067R590P649J6171N733l3997q090J801K7331K023L285j1086p39j5210k420
9072b4026J7687o516k101L729L851o235J9099k4186j4004J5880J3770j6466j5572
9059c5090q494K4679J8767j8706l1498M924q970k573R109J6562J5559R308R342
9046B919O463j7306k0863L931j3964p24K6504p814o114K2864J4608J3360j2291
9033A1573q729j4571m818j7238J792P025J6208P479j8265N986j5902k4857J067
9020e3250J639m598K158J462L95j2632K363K4263J1434J2237p767k782K9L893
9006b1156O222k137k1850J1828j1667J4838L579j8737j3419K3134K6046j4348
8994a7667k1052J8471L8779l323J582j7858n979J1169K729r875m981J5126j097
$$ y = [-26067, -16477, -8828, 7343, 13076, -20921, -29011, -27210, 121, 2144, 5429, -5657, -6396, -21606, -24026, -6339, -12855, -14956, -11227, -7376, -13611, 5488, -18698, -32702, -16822, -3052, -19518, -35090, -43584, -18905, -138, -18844, -50342, -45418, -54388, -56961, -47852, -31290, -15731, -6423, 2919, 9382, -7924, -28787, -24856, -38820, -39544, -13040, -20854, -26968, -4104, 10504, 23864, 11573, 2844, -11727, -16545, -33783, -31991, -24966, -8758, -1279, -19544, -13558, -29460, -54317, -53250, -51611, -56209, -54051, -52589, -52194, -64826, -62463, -38200, -26766, -14529, -22296, -25078, -25049, -21156, -14934, -17071, -38921, -27093, -38760, -23922, -20343, -39080, -52499, -29365, -3319, -17667, -38719, -20248, 18531, 15208, 16790, -1068, -7047, 4122, 6851, -3024, -8005, 7121, 6024]
8981F024J6174L27k8558k4505K4411R341k3713n75L1j0141N829J9925j19n268
8967a0817j9776p19O795J1386j804j5231j3109K4543L094k0776m450L1946J1572
8954B654k598J0618L470m989Q695J861J995p935l0187j5069L0209M2447j562l0790
8940H819j0497N438l10j722J347k7528j0170L6121j1401l6971l1289J6147M93
8927f1523o560J3810J6419M128O224j8906J7758J4602j613N370j1516N7M1097
8914A9347o810j7319J6144J6665k6729k4889J6176K9278l4503l0046Q347J0207
8902b4132k217q48J914P705Q347J7103O436j9437j4800j1353Q82K8830L4718L0843
8888F3991k8297m3270j3739o698J6384O879J688j5696j2008J3288J5148M817j3428
$$ y = [6024, 22198, 22525, -6033, -30538, -6127, 3214, -20499, -21074, -21043, -31184, -25355, -5430, -5549, -10817, -30593, -31312, -24517, -13131, -14935, -30166, -43275, -18732, -15638, -36414, -40864, -8918, 2654, 56, 10674, 14144, 9155, 17850, 19711, 21706, 13771, -16416, -31485, -1276, 41171, 39609, 8819, -1678, 3760, 3450, 1728, 3075, -24453, -34623, 1498, -9903, -46874, -78163, -62016, -61523, -68083, -54273, -37854, -33726, -27502, -46408, -28650, -14048, -15661, -10291, -21807, -21750, 19347, 12537, -4782, 11362, 28027, 1298, -23591, -7415, 21863, -12640, -42686, -34339, -24132, -26349, -27197, -25283, -17578, -9231, 7872, 14308, -5129, -19929, -31282, -30400, -1570, 33148, 63991, 35694, -7576, -21315, -28013, -11629, -4750, -3062, -18758, -30766, -17478, -2330, 2487, -10941]
8875a0941K417J2905J5929M772l3741n234K4933J0021M784l1358m288L638o391
8862a2554l961P837J3026N778j5296l0548O087K3155K3184k8481k5224n864J1019
8849c1842K0236L439N745J3968j9761j8654j5016O539L673j776k3304Q62k9447
8836h5338O551J9638Q790r087L016K3775M321n936j1054l2387J3697M3592J5016
8823e406J2276M102j918j1619k6596P51K2860Q190Q242l8450m0070K6633N2879
8810A1874J1647l6457r947K1046J688J3382J5795o911J3246L3832n492k3739k4199
8797A5765k2227l6062K15k13L834m698M880K2154j1489j2068k437J8677l430N854
8783b1245N638q635k287r64Q796m401O869l19K272K2301J5543k539k4569j5546
$$ y = [-10941, -8524, 4381, 20310, 25082, -8659, -13893, 11040, 21061, 25845, -5513, -9801, -6163, -12554, -16515, -8678, 4348, 10126, -5170, -35718, -29631, -6476, 16708, -11773, -36997, -42861, -31842, -11606, -8167, -2422, 11546, -8215, -26869, -41885, -35346, -31673, -33449, -56753, -55891, -85338, -78787, -59149, -50359, -59446, -56430, -32655, -28334, -34270, -45324, -77711, -64014, -20422, -5406, 6870, 10972, 9054, -2565, -29161, -28410, -5550, 2640, 10882, -27568, -67638, -41005, 11874, 23521, -12936, -22883, -1837, -149, 13233, 29028, 22117, 35363, 69195, 63703, 39964, 15765, -6462, -42524, -42309, -42522, -38688, -43386, -38506, -16352, -27841, -39909, -42346, -23669, -27099, -21245, -15607, -24242, -26529, -27493, -18697, -23098, -16229, -16548, -14276, 8025, 23568, 21029, -3540, -19086]
8769a9086m495q164J2364L4843J1336q49M093J6058M9r416J611j7930J872p959
8755A4327L771Q04k4638j5577o792N905j3575k8809J0679L3398J0844Q662j3725
8742a4726j4847J363J3332J9802q83n280k1316l8140J9813J7638J2996J7371J7084
8729B4207j0755j6775j0619J2873K443Q026r26k489j0537j7282m069j4416K2145
8716a8174J130J017p854j3077K6642K8453j4201K1808l0885j892J851m748l677
8703a3607M184L0024j3659l1757k0587m765J0198P138l434Q463R974j2273P75
8690b9326J4863j3372j1674L0209L618j3952J305M688k0292l961J4163K0656O008
8677B933k7057l3048P591K7631K1887k8022L009K1058J5726J0696j5923L838j784
$$ y = [-19086, -23581, -31745, -19381, 15462, 26798, 25949, 30042, 46100, 46149, 36733, 38344, 20414, 22286, 14327, 18098, 18902, -5736, -21313, -28105, -22200, -35775, -64584, -53905, -20507, -9663, -1001, -14726, -29573, -28210, -14878, 4924, 4041, -1239, -22555, -60695, -40882, -23244, -10248, 7123, 24207, 13452, -3323, -13942, -1069, 1374, 9400, 8474, 5985, -4552, -21834, -25903, -40319, -18174, -17044, -16027, -23881, -36958, -10316, 18137, 3936, 25744, -5141, -7033, -5182, -9930, -13607, -9423, 20601, 6942, -24815, -45402, -50167, -39969, -32831, -36265, -27802, -17828, -30101, -29326, -14463, -27835, -39509, -9300, -5682, -19634, -18329, -13641, -33933, -37894, -23731, -3075, 2933, -24124, -57172, -49581, -21950, -63, -28085, -25076, -4018, 11708, 22404, 6481, 10319, 8535]
8664H535K4106J568l2476k935j5601j3066L9502J0967j1620K1480j6997l8850
8652b5387k1082J7066J2851J9738j3761l1740j5578J847K8737J4204J7214M079
8640H188L53r474k1949j0741o888J5356L6769Q294L779j1532k2744R018L782r229
8626g018r708m0628P793K2278n447k6625N874n85o489O604K2301O394j9481K4029
8612b0708J407n11j1038M820M528J1582J7318j353O265r365l6037m616K1911K2370
8598F573m097k312m89r959r932j7085J6026J928p324P596K2820O674k3422k629
8584a5632j1224l297K9792J6828p792k3165M715K0213J3419J56r633r127j0324
8571e071J7230q752o420K096j0840J5698J3220j698J4000J8733j4654j4783j415
$$ y = [8535, 32641, 34209, 1733, -1202, -16803, -29869, 9633, 20600, 8980, 30460, 13463, -25387, -46469, -29403, -16552, 3186, -10575, -42315, -57893, -56046, -27309, -13105, 4109, 8188, 8541, -933, -22882, -33623, -40511, -25155, 11614, 19908, 23687, 12155, -10589, -1571, 2211, -7018, -16726, -57354, -49561, -27283, -32730, -59355, -53481, -54066, -60555, -53951, -31650, -25256, -44737, -20708, -19301, -19812, -30850, -26030, -21502, -9920, 7398, 6045, 12310, 2945, -33092, -37708, -15797, 6573, 2476, 164, -325, -10284, -20216, -37301, -21275, -19347, -26671, -19075, 3745, 10419, -13003, -15632, -26856, -30153, -361, 16467, 8675, -14490, -9775, 10438, 23857, 24013, 14380, 5253, -5071, 12159, 3407, -3013, -917, -11757, 3941, 17161, 15463, 29463, 48196, 33542, 18759, 17344]
8558A7344m777J048m644J4255l90J516Q440J188k0191l395J0082M467r750K58
8544A5451q20M391l013r839J4284J9608K7899N086L3111J7753J4908Q2885Q9677
8531C11381Q2596P5614R4933Q4922R3908J62891K11122K27246k6089l66096l51757
8520F00671k32287j29935o6303j4205j9519l1281j0985j167n583l1136k4002l3010
8508A258J4103o012M499J2021r005j7360J2143L4365N411j3108k262m48L5526
8495G1131P533J9630K4165J084N0560O3650N6473J00831J28716J58884J79520
8484H62177J70898J32347J87918L02622M06905M86157N7915p65582p66146m26282
8474F48929k24984j58290o8213k8633r06Q904l8634k8905j4766n729K5509M510
$$ y = [17344, 12567, 13615, 8971, 23226, 22836, 24352, 32792, 33980, 13789, 10394, 20476, 24943, 15193, 15451, 14631, 19022, 16009, 6170, 20454, 40062, 67961, 73047, 106158, 123911, 138819, 221704, 311381, 393977, 469591, 564524, 649446, 743354, 906245, 1117367, 1344613, 1318524, 952428, 600671, 368384, 238449, 172146, 157941, 138422, 107141, 96156, 94989, 89406, 58270, 34268, 1258, 15361, 9349, 13848, 25869, 16864, -496, 11647, 46012, 51423, 38315, 36053, 35605, 71131, 78664, 98294, 122459, 123543, 174103, 237753, 294226, 395057, 523773, 682657, 862177, 1033075, 1165422, 1353340, 1655962, 2062867, 2549024, 2606939, 1841357, 1075211, 648929, 423945, 265655, 197442, 168809, 167903, 176807, 138173, 109268, 94502, 88773, 114282, 118792]
8462A18792j0665k8537J8466J028k4020j7296J324j9851m081J6098k356P783J8212
8449G4897J9933K6049o904J7971J7216K7436L6747P5685P5915R8687R8757Q5963
8437F48352J02165J18159J53943K12252N7208l24042l91684k29795j25304q7024
8427A34230m0323q338m776o253k4783J5581P610l6767k3772n831Q368j2293J4904
8414A7557J1393j1813j8885K620j239k2666N441K3795K8901j9601k3319J5684
8402G868J3483p800j9530j6192k5016m303j648j1705K9779J5561k178l387P625
8389a7443q662K1704L4750K0005k1381L927k3270l0945l919P177J7940J963k651
8376h05k6402r571L7378J7827k801j2544j6271P812j7797m960J5413K1326j1261
$$ y = [118792, 108127, 79590, 98056, 99084, 75064, 57768, 59092, 39241, 35160, 51258, 48902, 56685, 74897, 94830, 120879, 113975, 131946, 149162, 176598, 213345, 289030, 364945, 463632, 562389, 648352, 750517, 868676, 1022619, 1234871, 1292079, 968037, 576353, 346558, 221254, 134230, 93907, 85569, 80793, 74540, 49757, 65338, 72948, 36181, 12409, 6578, 14946, 2653, 17557, 28950, 17137, -1748, 872, -367, -23033, -17592, 6203, 35104, 15503, -7816, 7868, 21351, 13551, -5979, -22171, -47187, -51490, -53138, -64843, -35064, -19503, -21681, -25068, -17443, -26105, -4401, 30349, 50354, 28973, 32900, 9630, -21315, -25234, -18057, -117, 1846, -805, -27207, -36778, 600, 18427, 15626, 3082, -13189, -5377, -23174, -28134, -12721, 8605, -2656]
8363b656k5265l26J0285j2358J9336M724J8467J0812k5320J1788K0854M030l538
8350C0833p359J7301J2560L394J628j5884r525J5718p154M0j2047J746k0832j8219
8336g800P860J1463K9191j4356j2724M020j7835J572J4016J4419l5437k1708K5215
8323b104K956k0939k2811m093M1233J2475k028J4707O394r08j9851K689j914k2677
8309a6871p284J999J561J1568J6139O478m876K6024J3155J9132K0119J0712O9852
8296A67708L7974m1571n1393n3511p500K3609j1205l7187j5636n754r775J2473
8284H232J2529n235n321Q05L9454p824k3562k5777k8623K136K5339J4153J4579
8271B0885J5862o399k8787r059L0630K6043J6842r563j7937M167K3886O720o837
$$ y = [-2656, -27921, -28247, -17962, -30320, -10984, -6260, 12207, 23019, -2301, 9487, 30341, 34371, 30833, 23474, 40775, 53335, 56729, 58357, 42473, 32948, 48666, 41512, 41552, 29505, 31251, 10419, -7800, 60, 11523, 40714, 26358, 13634, 17654, -181, 1391, 15407, 29826, -5611, -27319, -2104, 852, -20087, -42898, -46991, -5758, 6717, 4689, 19396, 25790, 24882, 5031, 7720, 5806, -16871, -24155, -22156, -20595, -9027, 7112, 13590, 8714, 34738, 47893, 67025, 87144, 97856, 167708, 205682, 164111, 112718, 59207, 51707, 75316, 64111, 26924, 11288, 5534, -4241, 8232, 20761, 15526, 10205, 11010, 50464, 42640, 19078, -6699, -35322, -33186, -7847, 6306, 20885, 36747, 30348, 1561, -7498, 23132, 49175, 66017, 56454, 38517, 42684, 66570, 73290, 66453]
8258F6453j5672m279k4268k5556O941L2003J4120j7432j0442N331j1016J3978
8246C0161j1349j0780k1273J1970N393J0240j6341N013K2219q00k0974k206L60
8233A633J875q619J2894J2183o570K3147k358m2013r994P168J2958R154j406p007
8219C045p77j8421j611M594J4564L674j1849j4789k339n12m659J0298J499J6945
8205c38p21m839Q819J3922j2649k1401J2513j1894l853N906J2252J7897J4122
8192B9736j2206o756n048p574j2195K9002L7557n446k1559k061L505Q915k8307
8179G563p180l804j5342J7118L0768J6933j1957j6501j4331j688L758J1908J829
8166A9074J1525k2516J4693J3612q285j4145j4261n471N241n624j2343j1770j4464
$$ y = [66453, 50781, 46502, 22234, -3322, 3619, 35622, 49742, 32310, 21868, 27199, 16183, 30161, 18812, 8032, -13241, -1271, 4122, 14362, -1979, 3034, 25253, 24453, 3479, 1273, 1633, 3508, -5111, 7783, 19966, 13396, 36543, 34185, -7828, -17822, -10654, 2304, 11458, 10052, 3045, 2268, -16153, -17764, -13170, 1394, 5068, -6781, -21570, -23909, -24421, -29080, -18782, -17283, -338, -1059, -5898, 2921, 16843, 4194, -17207, -4694, -16588, -20441, -14535, -2283, 15614, 29736, 17530, 10774, 5726, -1848, -14043, 14959, 52516, 47070, 25511, 23450, 26955, 35870, 7563, 383, -3421, -18763, -1645, 29123, 46056, 34099, 17598, 3267, 1579, 5337, 17245, 19074, 30599, 8083, 22776, 36388, 28103, 13958, -303, -5774, -533, -6157, -18500, -30270, -44734]
8153d4734M371L4239L4096J9J0274k02j0855j9576j3453j0937J1878L715J5132
8140A3967K1040k2973k1412p749J6107q049k8710k6357K1619K3434k5268k6267
8128g0618L2214M1738J4459l1K275l39j9672j0824Q433k467j37j7j600J3308j4071
8113g349l343J3160r410o723k634m420L996J4955K1591l5079m661R736j0168J588
8099a8761J4729J6649J8530N817J677j7274l5241J6702j6982j5027J6441j5065
8087b7805m0670K635J5314K3809K1948j616r007j281J1112N650j0933J686L1357
8074B2199N78O151K994r466K6561J2182o392j294j7905k2492j3323o284J6789
8061A0298K6894K784j7247j7099l4626K5383L9098j3842l451o14K987n341k4959
$$ y = [-44734, -40363, -6124, 27972, 27991, 38265, 38063, 27208, 7632, -5821, -16758, -4880, -1165, 13967, 35007, 12034, -9378, -17127, -1020, -9069, -37779, -64136, -42517, -19083, -44351, -70618, -38404, 3334, 17793, 17762, 20037, 19698, 26, -10798, -2365, -4832, -4969, -4986, -6586, 6722, -7349, -10692, 2468, -6942, -13665, -16299, -20719, -16723, -1768, 19823, -15256, -19917, -10181, -20349, -18761, -4032, 12617, 31147, 36964, 38641, 21367, -13874, 2828, -14154, -29181, -12740, -27805, -68475, -65840, -50526, -26717, -4769, -6385, -15392, -16673, -5561, 89, -10844, -9158, 22199, 22777, 28928, 31922, 22456, 49017, 61199, 54807, 53513, 35608, 13116, -207, -6491, 10298, 37192, 39976, 22729, 5630, -28996, -3613, 35485, 21643, 18192, 17578, 20565, 15224, -9735]
8048i735K9169J4903o08J5399K4917j4542k8099n0929j352M0879J1234j0935p759
8035A2542m525J1862k4245k4268J3333K5006j2030k1370J3232J7591O643j3678
8023I3J2325K3342J0147M099o677p130j0221k653k1656l5746r331P719K1862J0205
8009c622j5758R144n329J4912K8874L934P345L512k5199K962J1227o947J6554
7996D1609q358m521j613r804O994L2301J0110o776J088l3810k2987J5227j2080
7983G380j9433J7206J4906o037n645k6014k1330J3673O417j9241R258J2970L9483
7970B3593K46k177n91k7061k546K1938n720K1616L3380K752q368m2892j6849j455
7956d134j1473k9421k6991J8974J4399j360L678L204K607r440J8619q027L968
$$ y = [-9735, 19434, 34337, 33729, 49128, 74045, 59503, 31404, -19525, -20877, 20002, 31236, 20301, 12542, 8017, 19879, -4366, -28634, -15301, 9705, -2325, -23695, -10463, 7128, 13771, 93, 12418, 35760, 45907, 50006, 43329, 36199, 25978, 23325, 1669, -34077, -43408, -35689, -13827, -3622, -19380, -10236, -15565, -653, 28221, 32155, 39500, 43012, 17813, 20775, 32002, 25055, 41609, 33251, 28730, 27117, 17313, 24307, 56608, 66718, 59942, 61030, 27220, 4233, 19460, 7380, -12053, 5153, 20059, 14022, 8377, -17637, -38967, -25294, -18877, -38118, -28860, -15890, 23593, 23839, 21662, 21071, -5990, -8536, 13402, 7682, 29298, 62678, 65430, 57062, 14170, -2679, -4134, -15607, -45028, -72019, -53045, -38646, -40006, -36328, -33124, -30517, -39957, -21338, -29365, -25397]
7943b5397P725n21O735k1753J501K5500L3156L967j9336o169j3355q901o217j431
7929b4496P633m484j8588l083J7014K0272j4262j078N82K577j0436J5261K1470
7916H382j56r346p909J117J2138K0653N801j4746o712k2320M282r330j6013L0721
7902c438J5584r458l1946k412J4300j6963J1272J9731O428J4587k0802r640j3924
7889b6681Q987m849j2528K5176J8120r650j6641k675K5003k1080j1022k931J2768
7876a8003O43J921j113o26n621j4677J0245K672n126J483J8829L703j0103r706
7862b5479J1613j2081j0108J9148l675L0097O147k0833j1807n638K3995j1070
7850i691J315N066J7704P170M840j2007P722m50K682K334K25p98R304k4053l0499
$$ y = [-25397, -17672, -18193, -11458, -33211, -31710, -6210, 26946, 30913, 11577, 5408, -7947, -16848, -23065, -24496, -16863, -21347, -39935, -43018, -26004, -5732, -19994, -21072, -20490, -17913, -28349, -13088, 8382, 8226, -1120, -9029, -7912, 4226, 24879, 30680, 15934, 9222, -13098, -8816, -18146, -34159, -3438, 12146, 2688, -29258, -31670, -17370, -34333, -23061, -3330, 3098, 17685, -3117, -12757, -26681, -17694, -22543, -35071, -9895, 8225, -1425, -18066, -20741, 4262, -16818, -27840, -30771, -18003, -17360, -15439, -16552, -17178, -22799, -37476, -27231, -24559, -29685, -28202, -9373, -5670, -15773, -25479, -13866, -25947, -36055, -16907, -20582, 9515, 15662, -5171, -16978, -22616, 1379, -9691, -8376, -3310, 14394, 21564, 26404, 14397, 22119, 21669, 24351, 26685, 26910, 26112, 35416, 11363, -19136]
7835a9136o562j092O390J7033L2586O447j7276k5921j9910K3537J4101J6563q217
7822A8543j7072q155M02P934j2526l087J4020O382k9949q048J7246Q815k2604
7809b8099o342N349j9590j0930L8977L2766P095j3519j4813K1771M0037m09j7320
7796C4973J2199j1978n3831j3553K6071L5591K1303J2867j9458R023J3190r485
7784E6912j7945m7701j2573P256k1315N864q78l6225O442J6018n428L9904q236
7771a7905j4036r354J1073j9494j543J8256P825o819j8749j2676J4266K9338J2157
7758g661j940L826K2165K9612K2953j0687k2491k2419q275J3528j4579j3303j0134
7745a9405p890K3309J334p473J2060O221J9251R897L531n29j2026L984L832k9946
$$ y = [-19136, -25698, -26790, -20400, -3367, 29219, 35666, 18390, -7531, -27441, -3904, 10197, 26760, 18543, 1471, -6684, -6282, 1652, -10874, -13961, 59, 6441, -23508, -31556, -14310, -5495, -28099, -34441, -29092, -48682, -59612, -20635, 12131, 19226, 5707, -9106, 12665, 52702, 52293, 34973, 47172, 35194, -18637, -32190, -6119, 29472, 50775, 63642, 44184, 53207, 66397, 56912, 38967, -8734, -21307, -14051, -35366, -29502, -30380, -66605, -60163, -44145, -49573, -9669, -17905, -31941, -41295, -30222, -49716, -51259, -33003, -25178, -31997, -50746, -63422, -49156, -19818, -7661, -9601, -5775, 16390, 46002, 68955, 58268, 35777, 13358, 5083, 18611, 4032, -9271, -19405, -27295, -3986, -2652, -10125, 1935, 8156, 27407, 37304, 40835, 40306, 28280, 32264, 36096, 6150]
7731F150j5387j5387K513k1866J5O223J8888K1799l439m478M475j6111k5845Q703
7717c3747M826l1164K621J2943K0055J2026J2497K8568J622l2202m042k7534K9433
7704d098L5561o773j7482J307j6250r217J3501J2394j0646o40L1332J6991k6498
7691A9482l6704j1783J3132J5279j2098j3333k637p809K1466j3457k122K0597
7679i987Q29J2217J4487o132j3320J98K5047K0673j0828L4013j1580Q039J786
7666F5442k2969k6675k6825O577K9447M247M808o066n328j6924j6783o545m664
7653b2258K4790m516p607j1144r028J4639Q854R960K5270p385k2150q046o11m350
7639a3582j2197P068P505K5117n075Q306j2801k6275o628K9169j1736j3463q716
$$ y = [6150, -9237, -24624, -22111, -43977, -43962, -37739, -18851, 2948, -491, -4969, -494, -16605, -42450, -33747, -28921, -60085, -57464, -44521, -24466, -12440, 57, 28625, 30247, -1955, -5997, -33531, -4098, 31463, 24690, 7208, 8515, -7735, -16952, -3451, 8943, -1703, -2343, 28989, 45980, 19482, -17222, -29005, -15873, -594, -12692, -26025, -28662, -36471, -15005, -28462, -30584, -9987, -9158, 3059, 17546, 11414, -1906, -1708, 23339, 44012, 33184, 67197, 55617, 63656, 65442, 42473, 15798, -11027, -4450, 24997, 29244, 34052, 27986, 22658, 5734, -11049, -17594, -22258, 2532, -1984, -9591, -20735, -29763, -15124, -6270, 3690, 28960, 21575, -575, -8621, -9232, -13582, -25779, -18711, -11206, 13911, 8836, 17142, 4341, -21934, -28562, 607, -11129, -24592, -33308]
7626c3308j0860K4556J6846J690j5673j8664K535o437J4105j082J841J0145P729
7613f577j5207j1292L662J7729J2341M361k0978k2080Q133J7694R490O260J039
7600D575J1077k7070Q078K2680m245j4094j917K061j5678k878m84J8584J2618
7587A3307n018p448K0050m261O195R24j1725k5842j6541N214L9863J2748j8019
7574I447l7247l492L4192J5333j8371L293L3028K6168j719j8325j9191N23L074
7561B6713j0520k4272j6882m236J8915K0243K2236M110m5022J2551P059R189K1216
7548D1300k8022K4275K4354k2108r191l6531k0940J5150K988J1130M468k974l5154
7535c1255K271J3087j741Q144l852J3001O54j0300j7750P604l641o828J6361k4809
$$ y = [-33308, -44168, -19612, -2766, -1076, -16749, -35413, -32878, -39315, -25210, -26292, -24451, -14306, -6577, -21784, -33076, -29414, -11685, 656, 5017, -15961, -38041, -29908, -12214, -2724, 3536, 4575, 15652, -11418, -3340, 19340, 15095, 1001, -916, 1145, -14533, -17411, -17895, 689, 13307, 8289, 841, 20891, 16630, 22825, 23749, 12024, -13818, -30359, -25145, 14718, 27466, 9447, -27800, -31292, 2900, 18233, -138, 3155, 36183, 62351, 60632, 42307, 23116, 23639, 26713, 16193, -8079, -24961, -29197, -10282, 9961, 32197, 36307, -8715, 3836, 10895, 20084, 41300, 13278, 37553, 61907, 39799, 30608, -5923, -26863, -11713, -8725, 2405, 6873, 3899, -31255, -28984, -15897, -17638, -9494, -13346, -345, 309, -9991, -27741, -20137, -23778, -30606, -14245, -39054]
7521c9054n771K8132J5239K7663j9698j5212L072J9237p26j3953M309L142k798
7508C582j0716L720j5213n885J2727j066K5841J7437L838r223j4887j8839J871
7495f813R618J938q58m987J7890j1340j9398p689j2182k958L3423N005N336j7181
7481a0196m20K1992K582O772l1248k1608K2797m978j0209N545J7820R108k277
7468E680R526j699l968j9722k0949K3967O552j7674j3586L4950K3832k4417P735
7455A0227L265j6356j1643O66J517J5103N735J5162j10J9177K90l066k5288J343
7441A6022N309k1985l1002J2741K7767j138J0749K016m7863k9071K3680L5165
7429B390M1286K1593k5092k2279j1148j6557k0194N82L4481L4050j4222n418J6580
$$ y = [-39054, -44825, -16693, -1454, 26209, 6511, -8701, -5629, 13608, 12882, -1071, 3238, 6380, 3582, -7134, -3414, -18627, -24512, -11785, -12851, 12990, 30427, 34265, 25042, 10155, -8684, -6813, 2805, 4743, 3885, -1102, 16788, 5448, -13950, -21639, -33821, -36779, -3356, 1649, 6985, -10196, -10616, 11376, 13958, 20730, -10518, -32126, -9329, -14307, -24516, -18971, -1151, 7957, 5680, 15206, 13507, 9539, -10183, -31132, -7165, -613, -18287, -31873, 3077, 26909, 2492, 10227, 13492, -2864, -14507, -13841, -12324, 2779, 8514, 23676, 23566, 42743, 43033, 39967, 14679, 16022, 21331, -654, -31656, -18915, 8852, 7714, 18463, 20479, -27384, -56455, -32775, 2390, 43676, 65269, 40177, 17898, 6750, -9807, -30001, -29419, 5062, 39112, 24890, 19472, 36052]
7416C6052k2231l1261m627L4631M2n919J8008m39j1619l1654l2650k3741K8191
7403d7217K3596J6947K2538j3300j8695m918r780O567M542K3965K0783j1977j0167
7390B884j4597L0888j0152k8828k0197o569p728M8350J5355K924J2173N914J1849
7377D2266j3630l4593n778K3032j5740j0705k319K3853K0271j9630N861k616n325
7364D947r97J9601J0511l5076L421K741K6970M086q146J3816J2919l9572j2923
7351B298n218J791j2683n628n898j5409n970K7350K6436r844j4846k5108k4786
7338f7515J9172K062j8608J1736J6316R473J422R347O063j4838Q327K5184K0573
7325B8714m557j0138j6905n088L9417K5726j5307j9809k8714J137K7023K5706
$$ y = [36052, 13821, -17440, -22067, 12564, 12606, 6687, 24695, 24256, 12637, -19017, -51667, -75408, -47217, -23621, -6674, 15864, 2564, -16131, -21049, -30829, -24262, -19720, 4245, 25028, 13051, 2884, -11713, 19175, 9023, -19805, -40002, -46571, -54299, -5949, 9406, 12330, 24503, 30417, 42266, 28636, -5957, -11735, 11297, -4443, -15148, -17467, 6386, 26657, 7027, 12888, 10272, 4947, 3950, 23551, 34062, -1014, 2407, 5148, 32118, 36204, 28058, 41874, 54793, 15221, 2298, -2920, -1129, -13812, -19440, -25338, -40747, -46717, -19367, 7069, -2775, -17621, -42729, -67515, -48343, -46281, -64889, -53153, -36837, -27364, -25942, -16595, -10532, -25370, -17043, 8141, 28714, 24157, 14019, -2886, -7974, 31443, 57169, 41862, 22053, -6661, -5524, 21499, 47205]
7313D7205m000k6960J9511m407j6202K2055K721O608j8391n667K793j4373k3745
7300a2852K1732K1464l274j0241o342j1510J2963Q887K7962J2402l4892k311J2880
7287C6868j9036k3782J5858P650n918R243p817l1917J57l182K0627o964j7370
7274b5583q492p89K7811K0919j4807j0159o655l856K1945J2065k9464l2195m732
7261e3992K9087J4116k5783q185K0765O824K4889N43n89k1697L477Q596k331m979
7247i259J5993j4168j9277R380j1263J3943k2463n560J3920K628m666k0830j0864
7234f2486K7991L2635L0980q607O832n723j7435k8832L921J86R421O398J0197
7221E478L970l3881p991n972M09j1487J454L288J6381J1272P036J4003N41r866
$$ y = [47205, 43205, 16245, 35756, 31349, 15147, 37202, 39923, 46531, 28140, 22473, 25266, 10893, -12852, 8880, 30344, 27070, 16829, 10487, -1023, 11940, 20827, 48789, 61191, 26299, 23988, 36868, 17832, -5950, 9908, 17558, 11640, 20883, 13066, -18851, -18694, -21876, -1249, -8213, -25583, -34075, -34864, -7053, 13866, -941, -11100, -17755, -21611, 334, 12399, -17065, -49260, -53992, -24905, -10789, -36572, -44757, -23992, -17168, 7721, 8264, 7675, -14022, -10545, -1949, -4280, -9259, 6734, -7434, -26711, -17331, -28594, -14651, -37114, -42674, -28754, -26126, -30792, -51622, -62486, -34495, -1860, 29120, 20513, 27345, 21622, 4187, -24645, -20724, -20538, -11117, -4719, 5478, 9448, -24433, -32424, -38396, -37987, -49474, -48020, -44732, -28351, -17079, -10043, 3960, 4501, -5365]
7207e365p822J1501L575j0069l602p789q875J7244L1918J9907k7678j9957p525
7194a4537k886j5734N27J3110M734j769K311K9609K3344k747R084j7450j4822
7181A2774j8614n840K053j5655q361J000k2178r690k833J9677l946L733q758l847
7167f0485P234L8778K8632k3169j597J0851J7355j1184j4264j4409M74M1714j009
7154A8921k8811k6868r953J7532K3419N723J295J4678q633J8798q937J931j1995
7141G100q604J2635l415M334P828k981j6725M869j1532r480J0210k6626j9915
7128e2302J5011R114J0475l643k6285j7073J5274K996K1153J1497q205k012R055
7115a4945J7623k2304j8613J4139K5282j6987o027j0268L7157L344n065l46K0923
$$ y = [-5365, -13187, -1686, 1889, -8180, -11782, -19571, -28446, -11202, 20716, 40623, 12945, -7012, -14537, -17423, -33157, -32630, -19520, -14786, -16555, -14244, 15365, 38709, 35962, 45046, 27596, 12774, -5840, -11680, -9627, -25282, -33643, -32643, -54821, -64511, -67344, -47667, -51613, -47880, -56638, -60485, -53251, -14473, 14159, -9010, -10607, 244, 17599, 6415, -7849, -22258, -21784, 19930, 18921, -9890, -36758, -46711, -29179, -5760, -37, 1258, 15936, 7303, 26101, 17164, 19095, 7100, -1504, 11131, 7716, 12050, 19878, 16897, 172, 5041, -6491, -15971, -5761, -32387, -52302, -37291, -28177, -17702, -21345, -47630, -64703, -49429, -46433, -25280, -13783, -21988, -24000, -14945, 2678, -19626, -38239, -24100, 1182, -15805, -21832, -32100, 5057, 8401, 3336, 2990, 23913]
7102B3913J501k2857Q23j5906l0088j951K0538O28P114K636J7411L5340j3999
7089B5103k5920j5374M303N244P430r783p142k2327N213q768J2726j989J5719
7076a5565K6049q81l1701L302J1488m396J8208j168j1278K264n653l1742j2491
7063e3564Q052J8864m052L65N495n377J8213J5992k2367m6036K1953M4564R656
7050A1758q605J5913j0293l0347J8576k862Q889j3973n231k8391r765L2327L3526
7037A1522n193P745K2115N409j9159j3374O816o405k1069R205J5940J0750n633
7024A8669k6572j4876J5137K4541J2487j2751J103M414j4543r756j31L909j2063
7011a0432k8657P632J0314j0481j4158j2980K7001k322l5378J4749Q0J9015o451
$$ y = [23913, 25414, 2557, 3380, -12526, -42614, -44565, -24027, -23399, -16285, -13649, 3762, 39102, 25103, -817, -16191, -11888, -6644, 786, -8997, -16139, -38466, -33253, -42021, -29295, -31284, -15565, 10484, 9603, -22098, -18796, -7308, -11704, 6504, 5336, -5942, -3678, -9331, -41073, -53564, -45512, -26648, -30700, -30335, -24840, -30217, -12004, 3988, -18379, -64415, -42462, 2102, 11758, 3153, 19066, 8773, -21574, -2998, -5860, 3029, -10944, -16175, -44566, -54331, -22004, 11522, 6329, 14074, 36189, 41598, 22439, 9065, 15881, 9476, -11593, -2388, 13552, 24302, 18669, -7903, -22779, -7642, 16899, 29386, 16635, 17738, 22152, 7609, -2147, -2278, 1631, -10432, -39089, -31457, -21143, -31624, -45782, -58762, -31761, -34083, -69461, -54712, -54632, -35617, -42068]
6998d2068o689J8843J2131K2119j614k2677R452J9226J5734o369q616j1179j1158
6985a2865J066q949p106m191J3258J1162o928m984O430J640j3891n177J8069O207
6971f259K847k2054k5179j5719j7601K5244J1309J0493J815j6823J9869K3613
6959h445k4674J7911R356J708K848L935J1741k7803k935J2090M24J4912j464j5477
6945e873n071Q157J8829J4427k284K0150L869j3258k2200k3189k5542n28K6364
6932f149M619k3261j4205M599k6350k565K1343K4194L0138p361K8255K3991j5960
6919D1288j0578j4321J6747J3487o236k2657o294l3294k6353K383J5661j2782
6907d2949N200M1288J416l117J6605n488j6042K0068k598m266j6229j8019J1161
$$ y = [-42068, -48757, -29914, -17783, 4336, 2722, -19955, -10503, 8723, 24457, 18088, 9472, -1707, -12865, -11799, -20748, -27854, -32045, -18787, -7625, -14553, -19537, -13107, -11467, -25358, -30535, -12466, -6259, -3412, -25466, -50645, -66364, -83965, -58721, -47412, -36919, -35104, -51927, -32058, -8445, -33119, -15208, -5852, -4144, -1296, 2639, 14380, -13423, -16358, -4268, -3844, 11068, 9604, -5873, -10944, -2787, 16042, 30469, 28185, 48335, 52204, 38946, 16746, -6443, -31985, -32513, -6149, -1530, -24791, -38996, -34397, -60747, -63312, -41969, -17775, 12363, 5002, 33257, 57248, 41288, 30710, 16389, 33136, 46623, 40387, 17730, 11436, -21858, -48211, -45828, -30167, -42949, -37749, 3539, 4955, 1838, 18443, 12955, -3087, 16981, 14383, 10117, -6112, -24131, -12970]
6894a2970J2735q127n909j8235O484J5401J5681n00Q014j2809N755L6614O868
6881D9002k9616k1265l366j0326K6019Q064j481j5829j2358R395L028r512J9002
6868A0757l12p323J4124q327n577J5708k18r789j2521P015J6386j8580L559L3562
6854C8464l256j6648j3872j65q755k4741j0106M085K9369M521l020P303J1328
6841A4507j0423j3872N345L9798R426l5530j2971J990J5229p933O567K394Q666
6828B3193N369M557r25j0652k7780M920J5470P160K5578k7695k5630q099m785
6815a9319J3456R756K4979K7101m9663o5179O795M598n429K1225L0314o770j0242
6802a8378Q727j4219j6437j0549J3751K6164L9809J3295k3347n094J206j0927
$$ y = [-12970, -235, -8362, -14271, -32506, -26022, -10621, 5060, 4560, 12574, -235, 5520, 42134, 49002, 19386, -1879, -5245, -15571, 10448, 18512, 17031, 1202, -11156, -1761, 1267, -8245, 10757, 10445, 3122, 17246, 8919, 3342, 19050, 18832, 9043, -3478, 3537, 19923, 1343, 4902, 38464, 35208, 18560, 4688, 4523, -4232, -28973, -39079, -34994, -5625, -1104, -4124, 3179, 14507, 4084, -9788, -4443, 35355, 44781, 9251, -3720, -1730, 13499, 5566, 12133, 14527, 23193, 28562, 33119, 32194, 21542, -6238, -1318, 14152, 21312, 46890, 19195, -6435, -14534, -19319, -5863, 3893, 28872, 55973, 6310, -58869, -52074, -47476, -52905, -31680, -1366, -8136, -18378, -9651, -23870, -40307, -50856, -37105, -10941, 28868, 42163, 18816, 13722, 14928, 4001]
6790D001K571j059j0158J2662j7702j1516n150j4891J3047K2321N255j590m364
6777f573k127K0638q958l2814j1931L0371L898N102p146j2244L7478P578j3949
$$ y = [4001, 6572, 5513, -4645, 8017, -9685, -21201, -26351, -41242, -28195, -5874, -619, -2209, -6573, -8700, 11938, 2980, -29834, -41765, -11394, -7496, -2394, -9540, -21784, 15694, 23272, 9323]
$$ [...]
##END NTUPLES=NMR SPECTRUM
##END=
