##TITLE=Analysis number 324893
Compound Code cd 03309
Project Code adrs
Chemist Name endeavour
##JCAMPDX= 6.0         $$ Bruker NMR JCAMP-DX V2.0
##DATA TYPE= NMR SPECTRUM
##DATA CLASS= NTUPLES
##ORIGIN= Bruker BioSpin GmbH
##OWNER= nmr
$$ XWIN-NMR		Version 3.5
$$ Mon Dec  4 15:58:04 2006 GMT Standard Time (UT+0h)  MAYBRIDGE\nmr@NMR_250MHZ
##.OBSERVE FREQUENCY= 250.131544655141
##.OBSERVE NUCLEUS= ^1H
##.ACQUISITION MODE= SIMULTANEOUS (DQD)
##.ACQUISITION SCHEME= undefined
##.AVERAGES= 16
##.DIGITISER RES= 18
##SPECTROMETER/DATA SYSTEM= dpx250
##.PULSE SEQUENCE= zg30
##.SOLVENT NAME= CDCl3
##.SHIFT REFERENCE= (INTERNAL, CDCl3, 0, 16.4475)
##AUDIT TRAIL= $$ (NUMBER, WHEN, WHO, WHERE, WHAT)
$$ ##TITLE= Audit trail, XWIN-NMR		Version 3.5
$$ ##JCAMPDX= 5.01
$$ ##ORIGIN= Bruker BioSpin GmbH
$$ ##OWNER= nmr
$$ C:\u/data/dgb/nmr/ADRS/240/pdata/1/auditp.txt
$$ ##AUDIT TRAIL=  $$ (NUMBER, WHEN, WHO, WHERE, WHAT)
(   1,<2006-12-04 15:57:45.15 +000>,<MAYBRIDGE\nmr>,<NMR_250MHZ>,
      <created by zg, POWCHK disabled, PULCHK disabled
       configuration hash MD5:
       49 4B E0 1D 92 C2 6B 37 9F E6 65 BC 52 41 86 1D
       data hash MD5: 64K
       AC B4 CB A4 38 8C 25 EC CA 83 39 78 EC C6 D8 5E>)
(   2,<2006-12-04 15:57:56.21 +000>,<MAYBRIDGE\nmr>,<NMR_250MHZ>,
      <Start of raw data processing
       ef LB = 0.3 FT_mod = 6 PKNL = 1 SI = 32K 
       data hash MD5: 32K
       CA 9D ED 0C 97 14 7C 25 D3 3B D0 BB B8 E2 FD 02>)
(   3,<2006-12-04 15:57:57.98 +000>,<MAYBRIDGE\nmr>,<NMR_250MHZ>,
      <apk 
       data hash MD5: 32K
       F7 F3 3D 55 43 89 E5 DD 47 E9 44 45 04 DA 07 D4>)
(   4,<2006-12-04 15:57:58.75 +000>,<MAYBRIDGE\nmr>,<NMR_250MHZ>,
      <abs ABSG = 5 
       data hash MD5: 32K
       9D F8 C0 A2 91 B8 07 FD A0 69 1D 2C D9 59 04 0D>)
$$ ##END=
$$ 
$$ hash MD5
$$ C1 86 B8 52 9E 83 0A 37 87 E5 F7 E9 D3 0F 0F 3F
##$RELAX= 
##$RELAX= 
##$RELAX= 
##$RELAX= 
##$RELAX= 
##$RELAX= 
##$RELAX= 
$$ Bruker specific parameters
$$ --------------------------
##$DU= <C:\u>
##$EXPNO= 240
##$NAME= <ADRS>
##$PROCNO= 1
##$TYPE= <nmr>
##$USER= <dgb>
##$AMP= (0..31)
100 100 100 100 100 100 100 100 100 100 100 100 100 100 100 100 100 100 
100 100 100 100 100 100 100 100 100 100 100 100 100 100 
##$AQSEQ= 0
##$AQ_mod= 3
##$AUNM= <au_zg>
##$AUTOPOS= <51 >
##$BF1= 250.13
##$BF2= 250.13
##$BF3= 250.13
##$BF4= 250.13
##$BF5= 500.13
##$BF6= 500.13
##$BF7= 500.13
##$BF8= 500.13
##$BYTORDA= 1
##$CFDGTYP= 0
##$CFRGTYP= 5
##$CHEMSTR= <none>
##$CNST= (0..31)
1 1 145 1 1 1 1 1 1 1 1 1 1 1 1 1 1 1 1 1 1 1 1 1 1 1 1 1 1 1 1 1 
##$CPDPRG= <>
##$CPDPRG1= <>
##$CPDPRG2= <>
##$CPDPRG3= <>
##$CPDPRG4= <mlev>
##$CPDPRG5= <mlev>
##$CPDPRG6= <mlev>
##$CPDPRG7= <mlev>
##$CPDPRG8= <mlev>
##$CPDPRGB= <>
##$CPDPRGT= <>
##$D= (0..31)
0 1 0 0 0 0 0 0 0 0.06 0 0 0 0 0 0 0.0002 0 0 0 0 0 0 0 0 0 0 0 0 0 0 
0 
##$DATE= 1165247864
##$DBL= (0..7)
120 120 120 120 120 120 120 120 
##$DBP= (0..7)
150 150 150 150 150 150 150 150 
##$DBP07= 0
##$DBPNAM0= <>
##$DBPNAM1= <>
##$DBPNAM2= <>
$$ [...]
##$SUBNAM7= <"">
##$SUBNAM8= <"">
##$SUBNAM9= <"">
##$SW= 20.6930455092707
##$SWIBOX= (0..15)
0 0 3 0 0 0 0 0 0 0 0 0 0 0 0 0 
##$SW_h= 5175.983436853
##$TD= 65536
##$TD0= 1
##$TE= 294.16
##$TE2= 300
##$TE3= 300
##$TEG= 300
##$TL= (0..7)
0 120 120 120 120 120 120 120 
##$TP= (0..7)
150 150 150 150 150 150 150 150 
##$TP07= 0
##$TPNAME0= <>
##$TPNAME1= <>
##$TPNAME2= <>
##$TPNAME3= <>
##$TPNAME4= <>
##$TPNAME5= <>
##$TPNAME6= <>
##$TPNAME7= <>
##$TPOAL= (0..7)
0.5 0.5 0.5 0.5 0.5 0.5 0.5 0.5 
##$TPOFFS= (0..7)
0 0 0 0 0 0 0 0 
##$TUNHIN= 0
##$TUNHOUT= 0
##$TUNXOUT= 0
##$USERA1= <user>
##$USERA2= <user>
##$USERA3= <user>
##$USERA4= <user>
##$USERA5= <user>
##$V9= 5
##$VALIST= <valist>
##$VCLIST= <CCCCCCCCCCCCCCC>
##$VD= 0
##$VDLIST= <DDDDDDDDDDDDDDD>
##$VPLIST= <PPPPPPPPPPPPPPP>
##$VTLIST= <TTTTTTTTTTTTTTT>
##$WBST= 1024
##$WBSW= 4
##$XGAIN= (0..3)
0 0 0 0 
##$XL= 0
##$YL= 0
##$YMAX_a= 269476
##$YMIN_a= -361581
##$ZGOPTNS= <>
##$ZL1= 120
##$ZL2= 120
##$ZL3= 120
##$ZL4= 120
##$ABSF1= 16.44754
##$ABSF2= -4.245632
##$ABSG= 5
##$ABSL= 3
##$ALPHA= 0
##$AQORDER= 0
##$ASSFAC= 0
##$ASSFACI= 0
##$ASSFACX= 0
##$ASSWID= 0
##$AUNMP= <proc_1d>
##$AZFE= 0.1
##$AZFW= 0.1
##$BCFW= 0
##$BC_mod= 0
##$BYTORDP= 0
##$COROFFS= 0
##$CY= 12.5
##$DATMOD= 1
##$DC= 0
##$DFILT= <>
##$DTYPP= 0
##$F1P= 14.0000005364418
##$F2P= -0.99999901652339
##$FCOR= 0.5
##$FTSIZE= 32768
##$FT_mod= 6
##$GAMMA= 0
##$GB= 0
##$INTBC= 1
##$INTSCL= 1
##$ISEN= 128
##$LB= 0.3
##$LEV0= 0
##$LPBIN= 0
##$MAXI= 10000
##$MC2= 0
##$MEAN= 0
##$ME_mod= 0
##$MI= 0
##$NCOEF= 0
##$NC_proc= -4
##$NLEV= 6
##$NOISF1= 0
##$NOISF2= 0
##$NSP= 0
##$NTH_PI= 0
##$NZP= 0
##$OFFSET= 16.44754
##$PC= 1
##$PHC0= 227.0199
##$PHC1= 9.030266
##$PH_mod= 1
##$PKNL= yes
##$PPARMOD= 0
##$PSCAL= 4
##$PSIGN= 0
##$REVERSE= no
##$SF= 250.130018624024
##$SI= 32768
##$SIGF1= 0
##$SIGF2= 0
##$SINO= 400
##$SIOLD= 32768
##$SREGLST= <1H.CDCl3>
##$SSB= 0
##$STSI= 32768
##$STSR= 0
##$SW_p= 5175.98343685301
##$SYMM= 0
##$S_DEV= 0
##$TDeff= 65536
##$TDoff= 0
##$TI= <Analysis number 999999
Compound Code 99
Book Reference 9
Project Code 9>
##$TILT= no
##$TM1= 0
##$TM2= 0
##$TOPLEV= 0
##$USERP1= <user>
##$USERP2= <user>
##$USERP3= <user>
##$USERP4= <user>
##$USERP5= <user>
##$WDW= 1
##$XDIM= 32768
##$YMAX_p= 445565405
##$YMIN_p= -402892
$$ End of Bruker specific parameters
$$ ---------------------------------
##NTUPLES= NMR SPECTRUM
##VAR_NAME=  FREQUENCY,     SPECTRUM/REAL,   SPECTRUM/IMAG
##SYMBOL=    X,             R,               I
##VAR_TYPE=  INDEPENDENT,   DEPENDENT,       DEPENDENT
##VAR_FORM=  AFFN,          ASDF,            ASDF
##VAR_DIM=   32768,         32768,           32768
##UNITS=     HZ,            ARBITRARY UNITS, ARBITRARY UNITS
##FACTOR=    0.157963299565203, 1,           1
##FIRST=     4114.02355735698, 0,            0
##LAST=      -1061.95987949603, 0,           0
##MIN=       -1061.95987949603, -402892,     0
##MAX=       4114.02355735698, 445565405,    0
$$ Real data points
##PAGE= N=1
##DATA TABLE= (X++(R..R)), XYDATA
$$ [...]
19511B7125O1395Q576L0413J5289k4311J8773j6172j4907O246k7583m1866l9428
$$ 27125 88520 97096 127509 142798 118487 137260 121088 106181 112427 84844 42978 3550
19499C550o4Q5531j1372m3361M4091k3169K2009n7932n0717P9157K8464j2602
$$ 3550 3486 89017 77645 34284 78375 55206 77215 19283 -31434 47723 76187 63585
19487F3585l7934N358J1511k2238l5750j5525N3993l6110M6843J9155k2056K4278
$$ 63585 25651 31009 42520 20282 -15468 -30993 23000 -13110 33733 52888 30832 55110
19475E5110Q472k634j5647Q567l2453R3789J03896K086j0924n041n1475m1429
$$ 55110 63582 60948 45301 53868 21415 115204 219100 221186 210262 205221 153746 112317
19463A12317m4818K1846J1597L0533k3699m6424o167N1527J6164K2749l4406N8323
$$ 112317 67499 89345 100942 131475 107776 61352 55185 106712 122876 145625 111219 169542
19451A69542K4623j11369q3541l572M5515k1832o1309k3428L3980R9745M0980
$$ 169542 194165 82796 -745 -4317 41198 19366 -41943 -65371 -31391 68354 109334
19440A09334j8389n5861k5894l5176L7820J4083l1708L8840k1652J6720O7619
$$ 109334 90945 35084 9190 -25986 11834 25917 -5791 33049 11397 28117 95736
19429I5736L7485j0744O549J372l7413J3763m7792O37j0312n9340n7129M2003
$$ 95736 133221 122477 129026 130398 92985 106748 58956 59593 49281 -10059 -67188 -25185
19417b5185J09932j9165J9212L8178p3394p7889N3227J09776K6361J2939P7196
$$ -25185 84747 65582 84794 122972 49578 -28311 24916 134692 161053 173992 251188
19406B51188K3440o7608k4434k0913j2106l8045R4030J1142K168o7435M869j2225
$$ 251188 274628 207020 182586 161673 149567 111522 205552 216694 218862 151427 156296 144071
19394A44071k9191J9670p7354p3891O7228Q2249N6664O1712L9920p6231q243q6073
$$ 144071 114880 134550 57196 -16695 50533 132782 189446 251158 291078 214847 206604 120531
19382A20531k8292J04855k2128l0157P0860M8280j26349k6903K9463M6733l0949
$$ 120531 92239 197094 174966 144809 215669 263949 137600 110697 140160 186893 155944
19371A55944r5881K0533J894m5693K4948J5180o900K6438Q1734J12916O9654n8277
$$ 155944 60063 80596 82490 36797 61745 76925 70025 96463 178197 291113 360767 302490
19359C02490j15905n1292q5969N4757R0570K5311l8616K8982l4859l2500o3262
$$ 302490 186585 135293 49324 104081 194651 219962 181346 210328 175469 142969 79707
19348G9707j18171m454Q2368L0794j9831J43657P0486K6438j39495j51112N4419
$$ 79707 -38464 -42918 39450 70244 50413 194070 264556 290994 151499 387 54806
19337E4806L8935j530N0419J8240L5827O4482k1606L5227N3057r3543j7391j8442
$$ 54806 93741 92211 142630 160870 196697 261179 239573 274800 327857 234314 216923 198481
19325A98481J4396N4342l6850m5219Q2446J0392o259K2953J3559K5027L3475m0053
$$ 198481 212877 267219 230369 185150 267596 277988 271729 294682 308241 333268 366743 326690
19313C26690m3200j18664p0654l7787M8423R724l904O8829J23691J3544j13633
$$ 326690 283490 164826 94172 56385 104808 114532 110628 179457 303148 316692 203059
19302B03059j08209j5066K9880J3887l3951M3514L1192k4683p7228J9439R4699
$$ 203059 94850 79784 109664 123551 89600 133114 164306 139623 62395 81834 176533
19291A76533R9874k617j06172r1238Q3689Q2028m4198J8143m0969M0575J20124
$$ 176533 276407 273790 167618 76380 160069 242097 197899 216042 175073 215648 335772
19280C35772l2710l8840k6753N4281J9142Q485k3191p9103K5529R6349m034m9831
$$ 335772 303062 264222 237469 291750 310892 319377 296186 217083 242612 338961 334927 285096
19268B85096p9348j1619M1756P1848N760L7814q1491r1135r8649L4388Q0720O9699
$$ 285096 205748 194129 235885 307733 313493 351307 269816 178681 80032 114420 195140 264839
19256B64839N3878Q1498p2697m3707M3885L2691k5875J467p4424k8051J4794O164
$$ 264839 318717 400215 327518 283811 327696 360387 334512 335979 261555 233504 248298 254462
19244B54462M518l1469m5056N2786L5239P0845N6966l0599l3329m7663j27938
$$ 254462 258980 227511 182455 235241 270480 341325 398291 367692 334363 286700 158762
19233A58762q611J57286O1485l0413K3198J08217M7827m7479r587p3453m6043
$$ 158762 150151 307437 368922 338509 361707 469924 517751 470272 460685 387232 341189
19222C41189l4770l8005L9657R8903P9459j3046q2677k0922L0527k2614J6799
$$ 341189 306419 268414 308071 406974 486433 473387 390710 369788 400315 377701 394500
19211C94500J8422l3919n7204L7197Q6520k2871j407M1180q564L8234O2511M9333
$$ 394500 412922 379003 321799 358996 445516 422645 421238 462418 453854 492088 554599 603932
19199F03932j3372M6908O5209K5972j30045j34082N1532J37967p480m938J07535
$$ 603932 590560 637468 702677 728649 598604 464522 516054 654021 646541 641603 749138
19188G49138p3088p3814j2275J6251J9991n5909L2581J03898P965k234J05382
$$ 749138 676050 602236 589961 606212 626203 570294 602875 706773 714738 712504 817886
19177H17886K27286K02614R0626l5808j8062o8181q6310n0122o6548Q1010J25677
$$ 817886 1045172 1247786 1338412 1302604 1284542 1216361 1130051 1079929 1013381 1094391 1220068
19166A220068J88033Q1293P8541K02275K07497K75323L02801P5895P8659R9073
$$ 1220068 1408101 1489394 1567935 1770210 1977707 2253030 2555831 2631726 2710385 2809458
19156B809458P6499l1624j00583j40389O337J45124K27673L61802N83797P50227
$$ 2809458 2885957 2854333 2753750 2613361 2619698 2764822 2992495 3354297 3938094 4688321
19146D688321R57507J578046K611916M111709N698216N092588k89102m492451
$$ 4688321 5645828 7223874 9835790 13947499 19645715 24738303 24449201 19956750
19138A9956750m479581k619392q46159L94335J342436K308228L652961N993941
$$ 19956750 15477169 12857777 12011618 12405953 13748389 16056617 19709578 25703519
19130B5703519J0262399J7827177K9976456M6524611N6893121K6621337j6891243
$$ 25703519 35965918 53793095 83769551 130294162 187187283 213808620 196917377
19123A96917377k4721065l0838117l7900416l2081778k0942970j0922276m327791
$$ 196917377 172196312 141358195 103457779 71376001 50433031 39510755 35182964
19116C5182964O86883N637668J0788829J3704341O464450r279643j5962460j2989361
$$ 35182964 35869847 41507515 52296344 66000685 72465135 63185492 47223032 34233671
19108C4233671o872320j909875Q71384L26289k003984k591282k899198l212811
$$ 34233671 27361351 25451476 26322860 26649149 24645165 22053883 19154685 15941874
19100A5941874k543938j566731p98485l89114k5308K53596O45994J166867J336304
$$ 15941874 13397936 11831205 11032720 10643606 10618298 10871894 11517888 12684755 14021059
19091A4021059R05133N42561J244232K845984N090720Q299855J2909068J6792939
$$ 14021059 14926192 15468753 16712985 19558969 24649689 32949544 45858612 62651551
19083F2651551J2858156l106261j4091977j3479692p506585j336098L919370J0059473
$$ 62651551 75509707 72403446 58311469 44831777 37325192 35989094 39908464 49967937
19075D9967937J8512097L0617442M4698601M6455673L2265180K6908818q995182
$$ 49967937 68480034 99097476 143796077 190251750 222516930 249425748 240430566
19068B40430566n8417693o3545178m4485410k3931361j2159331o700167m533570
$$ 240430566 182012873 118467695 73982285 50050924 37891593 31191426 26657856
19061B6657856l387898k381195j053461N68488K622295N196791P073366L957355
$$ 26657856 23269958 20888763 19835302 20403790 23026085 28222876 35296242 39253597
19053C9253597k443614m587663l711803j785579k225051m748476m998270l654659
$$ 39253597 36809983 32222320 28510517 26724938 24499887 19751411 14753141 11098482
19045A1098482k290260j416259q31622m73540k40677j07355k18127j68498m2776
$$ 11098482 8808222 7391963 6560341 6086801 5846124 5738769 5520642 5352144 5309368
19036E309368L13628M18683J33262k77587n15870n32256n04514o92950p55702
$$ 5309368 5622996 6041679 6174941 5897354 5381484 4849228 4344714 3651764 2896062
19027B896062m41327k12482k05446O8506K66854K51394M00215L97084K71391L8393
$$ 2896062 2454735 2242253 2036807 2105313 2372167 2623561 3023776 3420860 3692251 3730644
19017C730644m04340p42904o07832m42305l25488r0434r8125l5518r0166o2104
$$ 3730644 3326304 2583400 1975568 1533263 1207775 1117341 1019216 983698 893532 831428
19007H31428m9787M8079J13957J44654M9617j04375p7371m0290p1147k3356m0329
$$ 831428 781641 829720 943677 1088331 1137948 1033573 956202 915912 844765 821409 781080
18996G81080m3177m1239N040J07269l0600n9167j9809k8392J10257p71p2166p8973
$$ 781080 737903 696664 701704 808973 778373 719206 699397 671005 781262 780491 708325 629352
18984F29352M79P7528K00624K49532L09773M67503N62594J99105k19856k15047
$$ 629352 629831 707359 907983 1157515 1467288 1934791 2497385 2696490 2476634 2261587
18974B261587l04008n25798m64711k31350j58061J5994J12682P3093J63801J17820
$$ 2261587 1957579 1431781 967070 735720 577659 593653 706335 779428 943229 1061049
18964A061049q7708j29480j82774j61495j7397r7874n9992J7412m809j4737J08198
$$ 1061049 973341 843861 661087 499592 482195 384321 324329 341741 336932 322195 430393
18953D30393N3411J2708J1349J7311j01104q1410K0709k475m9909N843O2761K3418
$$ 430393 483804 496512 507861 525172 424068 342658 363367 360892 310983 316826 379587 403005
18941D03005L8274n5172j5978P5650J96743J97528J88071L0137j88868j64059
$$ 403005 441279 386107 370129 445779 642522 840050 1028121 1058258 869390 705331
18931G05331p1145J0715J46432P8516J59043L38739N56067N19310L13377K97755
$$ 705331 634186 644901 791333 869849 1028892 1367631 1923698 2443008 2756385 3054140
18921C054140r5048o14657o80276m65754j73777j1753J8428J03728L5835J05771
$$ 3054140 2959092 2344435 1664159 1198405 1024628 1012875 1031303 1135031 1170866 1276637
18911A276637R629o4953j09034j42977j10371j13873j37533j07734n0217j9111
$$ 1276637 1286266 1221313 1112279 969302 858931 745058 607525 499791 449574 430463
18901D30463N7664J30769J95926J14597p638r4926r7709j01270k0702k4224M5013
$$ 430463 488127 618896 814822 929419 921781 826855 729146 627876 607174 582950 627963
18890F27963P6447j06712j10719j87785o4992j3674j7834L623m0165L672q073
$$ 627963 704410 597698 486979 299194 234202 220528 202694 206317 166152 169824 161751
18879A61751L4915K6097K533k1781p0882m8596K9257L2885l1498O8771R3729L247
$$ 161751 196666 222763 225296 203515 132633 84037 113294 146179 114681 183452 277181 280428
18867B80428k1880l755l7477n3599l0869J079m6848J9945N2132O9533R1589J25129
$$ 280428 258548 254793 217316 163717 132848 133927 87079 107024 159156 228689 320278 445407
18855D45407J36606J386k5510q1102m0400M0117J4955k3248J5943k2077m2522
$$ 445407 582013 583399 557889 476787 436387 476504 491459 468211 484154 462077 419555
18844D19555O201N8766K6576k9238r5942o5185L327n9869l4825l5433k7439m8202
$$ 419555 425756 484522 511098 481860 385918 320733 324060 264191 229366 193933 166494 118292
18832A18292j270M970N8142k9436j0195r9380J8159L6263K3116Q345K5873K8043
$$ 118292 117022 121992 180134 150698 140503 41123 59282 95545 118661 127006 152879 180922
18820A80922m3674k9328l8042J0673q6781K7353R7387J25179N5988j1096q869
$$ 180922 137248 107920 69878 80551 -6230 21123 118510 243689 299677 288581 279712
18809B79712l9466j29705K096P4653J14231k896k1993J17350Q9833J53748J05179
$$ 279712 240246 110541 112637 187290 301521 298625 276632 393982 483815 637563 742742
18798G42742K165O4505J86116O6490o1384j99111p1244k503j19487k17081j28785
$$ 742742 744907 809412 995528 1062018 1000634 801523 730279 727776 608289 391208 262423
18787B62423j32680k9869N5019R703o1565j1532k0647J3584M0780L9687K4240
$$ 262423 129743 99874 154893 164596 103031 91499 70852 84436 125216 164903 189143
18776A89143o4269j3591N9012N1992m95O9682R8624J63380L09615K88958j82960
$$ 189143 124874 111283 170295 222287 221792 291474 390098 553478 863093 1152051 969091
18765I69091l60359k16444j04896j5131m9270m7635k0183m629m7529M7986J2404
$$ 969091 608732 392288 287392 272261 222991 175356 155173 150544 103015 151001 163405
18754A63405l2485k9918m5543n0096N9791p8619j9599M5192K0907k5000o4910
$$ 163405 130920 101002 55459 5363 65154 -13465 -33064 12128 33035 8035 -56875
18743e6875j1277O7093J5059L8765J16925J7884o159m7675j04349r3507P0222
$$ -56875 -68152 -1059 14000 52765 169690 187574 181415 133740 29391 -64116 6106
18732F106R5429J6271o0950l1615n1254J6637m0421r076k1971R6032O1353O0395
$$ 6106 101535 117806 56856 25241 -26013 -9376 -49797 -58873 -80844 15188 76541 136936
18720A36936n4343o6793K127M2197L5447k1606p0512n6455L0259J0975K8689l825
$$ 136936 82593 15800 17927 60124 95571 73965 3453 -53002 -22743 -11768 16921 13096
18708A3096j07318j4228J8055J02685M7797k2252N4592N1987j1013M2417J653
$$ 13096 -94222 -108450 -90395 12290 60087 37835 92427 144414 133401 175818 177471
18697A77471J7391N087M6982o2128o3500K5343o278m6761j2387n578M3931l8017
$$ 177471 194862 199949 246931 184803 121303 146646 140368 93607 81220 75642 119573 81556
18685H1556M646J668M655M0132l3738l5756p6177l2192L9148J8954k3100K9930
$$ 81556 86202 87870 92525 132657 98919 63163 -13014 -45206 -6058 12896 -10204 19726
18673A9726M716k4084k955k3948K4177L8201Q0293J1036n4511N7486O918j9212
$$ 19726 24442 358 -2597 -26545 -2368 35833 116126 127162 72651 130137 137055 117843
18661A17843N9084n0853j4754j03421m6798O0400l6366J3163R7875J5275R0513
$$ 117843 176927 126074 111320 7899 -38899 21501 -14865 -1702 96173 111448 201961
18650B01961N1718K6264J5235K7617r4563k6451j0315n1569J6262k6485j7570
$$ 201961 253679 279943 295178 322795 228232 201781 191466 139897 156159 129674 112104
18639A12104j850L135k0676L8533J9045k9216j3114n11J8009J20922J06310k9576
$$ 112104 110254 113389 92713 131246 150291 121075 107961 107450 125459 246381 352691 323115
18627C23115p0933N097j02995o9511o4903Q1317Q2710O4021P3874R1235Q0004
$$ 323115 252182 257279 154284 84773 19870 101187 183897 247918 321792 413027 493031
18616D93031j8237q496k85M7721J32834P9260q5009p5918m4763k1251K0731Q6618
$$ 493031 474794 466298 466013 513734 646568 725828 640819 564901 520138 498887 519618 606236
18604F06236Q4688M5463J7472p3803j43509j63509k2091p059o1741K4622k824
$$ 606236 690924 736387 753859 680056 536547 373038 350947 343888 282147 306769 303945
18593C03945j6096j02569O8828L6566n4091L2689l2031K1752R5813M2726q0522
$$ 303945 287849 185280 254108 290674 236583 269272 237241 258993 354806 397532 317010
18582C17010r1030L920n2287M8236R3969r98M997j73931N2135J69792Q1504n6636
$$ 317010 225980 229900 177613 225849 319818 318820 323817 149886 202021 371813 453317 396681
18570C96681P5829J18510J04013N5358m4509l9571M7657Q5656K08707R1291j20531
$$ 396681 472510 591020 695033 750391 705882 666311 713968 799624 1008331 1099622 979091
18559I79091k47418j99152p3734k922m7252m7512J76J8513J36097K06468J51547
$$ 979091 731673 532521 458787 455865 408613 361101 361277 379790 515887 722355 873902
18548H73902J62565J01647J4296m7703k66873k82317j98781l8398j12491n706
$$ 873902 1036467 1138114 1152410 1104707 837834 555517 356736 318338 205847 200141
18538B00141M6566M9942p2894o2645J0363K593M8849k0737l828N161n2895J1429
$$ 200141 246707 296649 223755 161110 171473 174066 222915 202178 198350 203511 150616 162045
18526A62045Q0616l5412J1856P1436k7760q7965M8798l9402J5305Q6258k9077
$$ 162045 242661 207249 219105 290541 262781 174816 223614 184212 199517 285775 256698
18515B56698j48439j5952P7016P5697P3237P7372m4741K996j7603r1333j3214
$$ 256698 108259 92307 169323 245020 318257 395629 350888 353884 336281 244948 231734
18504B31734M1118P6881J36042k3702k7866q2716j8421p3819Q195O2448q1832
$$ 231734 272852 349733 485775 462073 434207 351491 333070 259251 267446 329894 248062
18493B48062r7467m1256N4904M9919N5626N735r5822l6299O9608P5901k3619Q629
$$ 248062 150595 109339 164243 214162 269788 275523 179701 143402 213010 288911 265292 273921
18481B73921l0079K173M7920p0967L9477M2074k5544L1718j4107N011m1007K6177
$$ 273921 243842 246015 293935 222968 262445 304519 278975 310693 296586 301597 260590 286767
18469B86767N6129L0562L8777j8417j4672N9267N4823j3762M2701N8627O427M2983
$$ 286767 342896 373458 412235 393818 379146 438413 493236 479474 522175 580802 587229 630212
18457F30212J9547l1876n7436O8072L6385l7912q6135r0661N5512L4008k5116
$$ 630212 649759 617883 560447 628519 664904 626992 540857 450196 505708 539716 514600
18446E14600N7861L8188K9332O5578J3894j8717m3310m0226L276l075J4268L0056
$$ 514600 572461 610649 639981 705559 719453 700736 657426 617200 620476 617401 631669 661725
18434F61725M457N2504J18368M8653n790J10541j65326k0644P8080L1946N5540
$$ 661725 666182 718686 837054 885707 879917 990458 825132 804488 882568 914514 970054
18423I70054J21322P7382J29755N0165j20263O6163K09654J97168J08843Q2540
$$ 970054 1091376 1168758 1298513 1348678 1228415 1294578 1504232 1701400 1810243 1892783
18413A892783K07726J53165Q6741J52016M60906O01757O70845M45091M11803L77476
$$ 1892783 2100509 2253674 2340415 2492431 2953337 3555094 4225939 4671030 5082833 5460309
18403E460309L54614R01280J897735L285503N082925O992181O573833p84572n723975
$$ 5460309 5814923 6716203 8613938 11899441 16982366 23974547 30548380 29763808 24039833
18394B4039833n192324k759728n87297O38697J514388K646404M239100P263998
$$ 24039833 18847509 16087781 15500484 16139181 17653569 20299973 24539073 31803071
18386C1803071J2782603K2439146L7513053N7630504O9237947K1773842k5058721
$$ 31803071 44585674 67024820 104537873 162168377 231406324 253180166 228121445
18379B28121445l1669485m5605955m6413481l4045963j9496140r299134l283337
$$ 228121445 196451960 150846005 104432524 70386561 50890421 41591287 38307950
18372C8307950J234990O208296J1597955J5005061P578585j1162608j8815851
$$ 38307950 39542940 45751236 57349191 72354252 79932837 68770229 49954378
18365D9954378j5786342r727750n524480l120907j743553p60040j36887L50911
$$ 49954378 34168036 24440286 18915806 15794899 14051346 13291306 13154419 13505330
18357A3505330R12871J439399K068648L339864L983865J361729j378210j903697
$$ 13505330 14418201 15857600 17926248 21266112 25249977 26611706 25233496 23329799
18349B3329799k645898k607295j419406N09586K040109K913030M532387P541655
$$ 23329799 20683901 18076606 16657200 17166786 19206895 22119925 26652312 34193967
18341C4193967J1773968J6265061J3979365k584348j3587748j2439402o960804
$$ 34193967 45967935 62232996 76212361 73628013 60040265 47600863 40640059
18334D0640059k007354L070846R125241J7367801K8888223M0455936L1899875
$$ 40640059 38632705 41703551 50828792 68196593 97084816 137540752 169440627
18327A69440627K0943953K4265402j3735177n4961628n3233577l4696019j8445639
$$ 169440627 190384580 214649982 200914805 145953177 92719600 58023581 39577942
18320C9577942j0107135o021732l655368k041246r70032k45939Q30259K039959
$$ 39577942 29470807 23449075 19793707 17752461 16782429 16536490 17366749 19406708
18312A9406708L770217N227305K666226m334223o681317n231000k945707j268976
$$ 19406708 23176925 28404230 31070456 26736233 20054916 14823916 11878209 10609233
18304A0609233j93963L89587R67676J615751K087226J390695Q28348R56033j226329
$$ 10609233 10415270 10804857 11772533 13388284 15475510 16866205 17694553 18650586 17424257
18295A7424257l622486l212912j844416q13223m83968l55383j90610n91051r88511
$$ 17424257 13801771 10588859 8744443 7931220 7447252 7091869 6901259 6310208 5321697
18286E321697o86644l05647J9551L41247M18171K50355j03639n52647q82553q50469
$$ 5321697 4635053 4329406 4348957 4690204 5108375 5358730 5255091 4702444 3819891 2969422
18276B969422m65583k26388j29791p7918k30135k74669j61954p7101l6140r2833
$$ 2969422 2503839 2277451 2147660 2069742 1839607 1564938 1402984 1325883 1289743 1196910
18266A196910M2673k3687P562J2550j14266o9801o0171J1838J02397K4953j00465
$$ 1196910 1239583 1215896 1223458 1236008 1121742 1051941 991770 1003608 1106005 1130958 1030493
18255A030493K1828K6493n9835m2453o3913Q010N9830r752m2576J3221N075R3323
$$ 1030493 1052321 1078814 1018979 976526 912613 920623 980453 970701 928125 941346 946421 1039744
18243A039744O3316m8514L4522R0801K3486R8479O0133k35J040P9126L6162K8819
$$ 1039744 1103060 1054546 1089068 1179869 1203355 1301834 1361967 1361732 1362772 1441898 1478060 1506879
18231A506879Q7933J30366J43276K14018J95118J21888K39898M22055L59891J80770
$$ 1506879 1594812 1725178 1868454 2082472 2277590 2399478 2639376 3061431 3421322 3602092
18221C602092J64547M16526O23768M48794M25333O45048J057082J205044J505204
$$ 3602092 3766639 4183165 4806933 5255727 5681060 6326108 7383190 8588234 10093438
18212A0093438K206450L591392N591755R059756J5084558K3682158L1592924K5352434
$$ 10093438 12299888 15891280 21483035 30542791 45627349 69309507 100902431 126254865
18204A26254865P709961Q729390K7920532M0376563O146680l6049078l5514213
$$ 126254865 133964826 142694216 170614748 210991311 217137991 181088913 145574700
18197A45574700j4092187m124288j9868404l1223385k6715717j6706320r130101
$$ 145574700 131482513 127358225 107489821 76266436 49550719 32844399 23714298
18190B3714298n361320l588191k594361j942648j312792r19323o09838m71967
$$ 23714298 18352978 14764787 12170426 10227778 8914986 7995663 7385825 6913858
18182F913858n76348o64854n46391k68249k33376l49071m00369m62327m18085
$$ 6913858 6337510 5672656 5126265 4858016 4624640 4275569 3875200 3412873 2994788
18173B994788l20830k73847l59427k75429k50101j69131j35049j86165p0702Q5292
$$ 2994788 2673958 2400111 2040684 1765255 1515154 1346023 1210974 1024809 954107 1039399
18163A039399P3075p722p3844j21659j34626r3305n0857n2675N2773j8394K5599
$$ 1039399 1112474 1104752 1030908 909249 774623 681318 630461 577786 630559 612165 637764
18152F37764k1244Q9553k2272q5694o6901J2091O7061R6874N2547M4159r520L7022
$$ 637764 616520 706073 683801 598107 531206 543297 610358 707232 759779 803938 794418 831440
18140H31440K15110Q8278m2951j9486M3131q082O4147N063K6254N4659Q2525J14600
$$ 831440 1046550 1134828 1091877 1072391 1115522 1107440 1171587 1176650 1202904 1257563 1340088 1454688
18128A454688P7985P2108K36999J93824K49701L22703L89524N18586P19724R27841
$$ 1454688 1532673 1604781 1841780 2035604 2285305 2608008 2997532 3516118 4235842 5163683
18118E163683J233564J816081K838710M321332O920814J2251918K2412197L8147938
$$ 5163683 6397247 8213328 11052038 15373370 22294184 34546102 56958299 95106237
18110I5106237N8390919N7352142k3694817o3455837n3692161k9442079j4161033
$$ 95106237 153497156 210849298 187154481 123698644 70006483 40564404 26403371
18103B6403371p548587m749083l118228k085317j516911j228881j004566p76309
$$ 26403371 18854784 14105701 10987473 8902156 7385245 6156364 5151798 4375489
18095D375489n95417m61018l35609l20290l41588k03612j25587j23341r1593j48333
$$ 4375489 3780072 3319054 2983445 2663155 2321567 2117955 1992368 1869027 1777434 1629101
18085A629101j57467o9383k3599j52149o7875p8741n501j6752j6923r357m8143
$$ 1629101 1471634 1402251 1378652 1226503 1158628 1079887 1074386 1057634 1040711 1031354 983211
18074I83211p2144n7007l3071l215p3698r8926m0964j1385k085N7021j3808j31485
$$ 983211 911067 854060 820989 817774 744076 645150 604186 592801 590716 647737 633929 502444
18062E02444r9526L9924J9788q5800o7991m9700J0044N0812J6890J6024o2997
$$ 502444 402918 442842 462630 376830 308839 259139 269183 319995 336885 352909 289912
18051B89912j03708o4102L6701k3322J0900L6305O4189O0817j4190n4460L1452
$$ 289912 186204 122102 158803 135481 146381 182686 246875 307692 293502 239042 270494
18040B70494L2522o8912k5529P8550P5399L3015k0867o8516K4215R344L1241j157
$$ 270494 303016 234104 208575 287125 362524 395539 374672 306156 330371 339715 370956 369799
18028C69799P7075J59651J17384q7J8488J08224J17376J30966K13783N12692P56069
$$ 369799 446874 606525 723909 723822 742310 850534 967910 1098876 1312659 1825351 2581420
18017B581420J299414J580837J789219J537131J299601J643456K109928J225741
$$ 2581420 3880834 5461671 7250890 8788021 10087622 11731078 13841006 15066747
18009A5066747r27180k139055j871528j378342j351230j724694j647951j174949
$$ 15066747 14139567 12000512 10128984 8750642 7399412 5674718 4026767 2851818
18001B851818p29000m38610k53218k57387j71179j40162r2183j43846q0405l3009
$$ 2851818 2122818 1684208 1430990 1173603 1002424 862262 770079 626233 545828 512819
17991E12819p6747p5913n13J21100J24917n7453j20928k5997j11196p3870K9692
$$ 512819 436072 360159 359646 480746 605663 548210 427282 401285 290089 216219 245911
17980B45911m5982p4301j38815j14543N9072O4793N9464K0503M0663Q7527m512
$$ 245911 199929 125628 -13187 -127730 -68658 -3865 55599 76102 116765 204292 199780
17969A99780m5918n9372k0723l5089J07123k2133j961L3497m5317p642J60541
$$ 199780 153862 94490 73767 38678 145801 123668 121707 155204 109887 102245 262786
17958B62786J25617J43248J09856J51366Q1794J34331K08874N5296j30928k31579
$$ 262786 388403 531651 641507 792873 874667 1008998 1217872 1273168 1142240 910661
17948I10661k05746j27052j76470j69082j71966j05400j8698K5712M3314K5479
$$ 910661 704915 577863 401393 232311 60345 -45055 -63753 -38041 5273 30752
17938C0752r252j4104M9450n5700o3806o2615R9036Q4558j02469r8571k6379l657
$$ 30752 21500 7396 56846 1146 -62660 -125275 -26239 58319 -44150 -142721 -169100 -172757
17926a72757Q1714j0171M8531O6596k3259q1635M4115Q6241M5896R170L0249r8499
$$ -172757 -91043 -101214 -52683 13913 -9346 -90981 -46866 39375 85271 94441 124690 26191
17914B6191p3574K9757N0660Q4806r780P692L3008l2927p9993L4304L3810N387
$$ 26191 -47383 -17626 33034 117840 108060 115752 148760 115833 35840 70144 103954 109341
17902A09341o1257l0926O0232l0241o1292k3846k4699n301N1413J3947j9040O1312
$$ 109341 48084 17158 77390 47149 -14143 -37989 -62688 -67989 -16576 -2629 -21669 39643
17890C9643K3679L493P600M1664K4925j622j12734o7382Q0216O4831m1025l0490
$$ 39643 63322 66815 74415 116079 141004 139382 26648 -40734 39482 104313 63288 32798
17878C2798L0758J4490m298l2150J02594Q8544k3405m1281l2303N406k4763n0169
$$ 32798 63556 78046 73748 41598 144192 232736 209331 168050 135747 141153 116390 66221
17866F6221q9943j2204J53913m921k3190P1031K04117J81109K3712l1374j06600
$$ 66221 -23722 -35926 117987 113066 89876 160907 365024 546133 569845 538471 431871
17855D31871q0368L8530J13099P2757p60j24460j10191Q8089J24226P7645q37
$$ 431871 351503 390033 503132 575889 575129 450669 340478 428567 552793 630438 629601
17844F29601n4360j57373r8858r129j25393j39489k0924L5697K9458k1285J45537
$$ 629601 575241 417868 319010 309881 184488 44999 24075 59772 89230 67945 213482
17833B13482l523N0657L6287q013l9883j42654r8836l761m8273K2976n844Q6925
$$ 213482 209959 260616 296903 288890 249007 106353 7517 3756 -44517 -21541 -27385 59540
17821E9540K7803O3504k2600m4118K2422O3637k5901o4449k4214l090J3289M7095
$$ 59540 87343 150847 128247 84129 106551 170188 144287 79838 55624 52534 65823 112918
17809A12918Q5200J07107J04296p6111n9255J20968K08368J91343r8185j68093
$$ 112918 198118 305225 409521 333410 274155 395123 603491 794834 696649 528556
17799E28556j51430j78118n9393l4308k5530J2497r906J5051N4275J97396K30099
$$ 528556 377126 199008 139615 105307 79777 92274 82368 97419 151694 349090 579189
17788E79189J48567m3866o1038j84437j30122J6655j37217p3377r621m6652j13295
$$ 579189 727756 683890 622852 438415 308293 324948 187731 114354 104733 58081 -55214
17777e5214M7262K2395o3308j7194J2171O1682N5870O6836o2426J6942Q5400M6282
$$ -55214 -7952 14443 -48865 -66059 -53888 7794 63664 130500 68074 85016 170416 216698
17765B16698r803k5126q1131o8060K0498K423l1170J0945l4479j03120p5907K6622
$$ 216698 206895 181769 100638 32578 53076 55499 24329 35274 795 -102325 -178232 -151610
17753a51610J10696M4034O4084o047j52920j17078J8284L1146p7481K3833K1565
$$ -151610 -40914 3120 67204 61157 -91763 -208841 -190557 -159411 -236892 -213059 -191494
17742a91494J6376N4830P8131l388n5638l2457p1219p0992M3531J45820P2092
$$ -191494 -175118 -120288 -42157 -45545 -101183 -133640 -204859 -275851 -232320 -86500 -14408
17731a4408q4465l9857J04897O0938p4326p7589P325P352K2592o6711J54786N8433
$$ -14408 -98873 -138730 -33833 27105 -47221 -124810 -117485 -110133 -87541 -154252 534 58967
17719E8967j2843m4648o9107o7533L2588K3573J7032J5556O5911K8806m8306p2200
$$ 58967 46124 1476 -67631 -135164 -102576 -79003 -61971 -46415 19496 48302 -4 -72204
17707g2204j05587M0706M8344k9222l9039N6035Q0220J2411n9944j2958o9115
$$ -72204 -177791 -137085 -88741 -117963 -157002 -100967 -20747 -8336 -68280 -81238 -150353
17696a50353l1978j9437K6767K4401O397J10880M592n8993Q3731N4274N340l438
$$ -150353 -182331 -201768 -175001 -150600 -144203 -33323 -28731 -87724 -3993 50281 55621 52183
17684E2183M9335p2935j6629l3666p0800N9009k4091p8137q242O2428M8322Q7300
$$ 52183 101518 28583 11954 -21712 -92512 -33503 -57594 -135731 -143973 -81545 -33223 54077
17672E4077N1723l0112q5975j28344o3795P7866N7540p3062o0970M377K0635N0867
$$ 54077 105800 75688 -10287 -138631 -202426 -124560 -67020 -140082 -201052 -196675 -176040 -125173
17660a25173K6422O0227j2609j03743L0394L7684j8587o5837j3514K5810L1612
$$ -125173 -98751 -38524 -51133 -154876 -124482 -86798 -105385 -171222 -184736 -158926 -127314
17649a27314k8753K2867J060j5271k4367k103Q209Q2837p7622J1829P9313m8083
$$ -127314 -156067 -133200 -132140 -147411 -171778 -173881 -165672 -82835 -160457 -148628 -69315 -117398
17637a17398K9088N1228O7024l5387m9853q6071J9182J0898L6124n8867m0209
$$ -117398 -88310 -37082 29942 -5445 -55298 -141369 -122187 -111289 -75165 -134032 -174241
17626a74241k5282N6238P6016j48481J4983k3995L3169O0829N2087O0655R968
$$ -174241 -199523 -143285 -67269 -215750 -200767 -224762 -191593 -130764 -78677 -18022 -8054
17615h054n0004M0726Q8744L3420p7378r3835j8770n3506J02778J41689M2064
$$ -8054 -58058 -17332 71412 104832 27454 -66381 -85151 -138657 -35879 105810 147874
17604A47874J47154J75087Q1930R5036J10633J75070J78551q0962k02243j28997
$$ 147874 295028 470115 552045 647081 757714 932784 1111335 1030373 828130 699133
17594F99133m438k8839j95509j26211r2338p5253k1743O3327M9376n1700j10513
$$ 699133 694695 665856 470347 344136 251798 176545 154802 218129 267505 215805 105292
17583A05292l7505J6692j01855o3134m8487O093O7732m314j19072m7908M8687
$$ 105292 67787 84479 -17376 -80510 -128997 -122904 -55172 -59486 -178558 -226466 -177779
17572a77779m108N565O1572O0950K4117L3401N2070j8200o0156K1592k3395k0168
$$ -177779 -181887 -176322 -114750 -53800 -29683 3718 55788 37588 -22568 -976 -24371 -44539
17560d4539P5034k1571j19203o9964M7075j0347P6137k108J0450O4916O5114M0009
$$ -44539 30495 8924 -110279 -180243 -133168 -143515 -67378 -69486 -59036 5880 70994 111003
17548A11003l3230j6009p7680l0352l4706l392k7974n0784L3020j2373J5088O3256
$$ 111003 77773 61764 -15916 -46268 -80974 -84366 -112340 -163124 -130104 -142477 -127389 -64133
17536f4133L7536K5958j4920N940K5626M9602j04719J3496J4264K5062L6866M0811
$$ -64133 -26597 -639 -15559 -9619 16007 65609 -39110 -25614 -11350 13712 50578 91389
17524I1389m8805k1686K5819q8557j41095m66J06163J5083Q829N0914j4368K4665
$$ 91389 42584 20898 46717 -41840 -182935 -183401 -77238 -62155 -53326 -2412 -16780 7885
17512G885P0420k0155o6565r34n1959R944K4574J5920M3292J23869L7648n8460
$$ 7885 78305 58150 -8415 -9349 -61308 -51364 -26790 -10870 32422 156291 193939 135479
17500A35479j49436p7099m6948k3845O426P7917k5558m3015N3765m5684J973l486
$$ 135479 -13957 -91056 -138004 -161849 -155423 -77506 -103064 -146079 -92314 -137998 -136025 -139511
17488a39511r633j4487R6636Q0502n410K196k7859o5446L4777j8055O3327j3754
$$ -139511 -149144 -163631 -66995 13507 8097 10293 -17566 -83012 -48235 -66290 -2963 -16717
17476a6717j26188j01920O8021J62890J20167j01086j39326j0881K1732P1724
$$ -16717 -142905 -244825 -176804 -13914 106253 5167 -134159 -145040 -123308 -51584
17466e1584O9142j3579o9945J2168m5268K8014J16258J25094l2229p3862n4547
$$ -51584 17558 3979 -65966 -53798 -99066 -71052 45206 170300 138071 64209 9662
17455I662j3374R924J77076K45567K31723K43765L04872L29285M78711M93078
$$ 9662 -3712 6212 183288 428855 660578 904343 1209215 1538500 2017211 2510289
17445B510289N74520K51339q2139m68813o43889o35653n64430l75698k00527p5110
$$ 2510289 3084809 3336148 3254009 2785196 2141307 1505654 941224 565526 364999 289889
17435B89889k9275k3396m7393Q086q4770m6153q7240l7783l6626j211j7741j2183
$$ 289889 260614 237218 189825 197911 113141 66988 -20252 -58035 -94661 -95872 -113613 -125796
17423a25796L4382P3719l2751j06774j900J4554K9472N3585j4785l7936J8155
$$ -125796 -91414 -17695 -50446 -157220 -159120 -144566 -115094 -61509 -76294 -114230 -96075
17412i6075j0976q7254n278K8645J40499P980M5866J6827L1675M3273o3343j38733
$$ -96075 -107051 -194305 -199583 -170938 -30439 -22459 23407 40234 71909 115182 51839 -86894
17400h6894n5702Q7844N5095N5388p8421j54619N1923P620R3145K258K2892L381
$$ -86894 -142596 -54752 343 55731 -22690 -177309 -125386 -117766 -24621 -22363 529 3910
17388C910L599L2775l6886J1406n4011p9824M5825L6326k6881l0824k1865j9267
$$ 3910 7509 40284 3398 14804 -39207 -119031 -73206 -36880 -63761 -94585 -116450 -135717
17376a35717o999n9613q598J06525Q6815J4896k7414o7754j0132n739R5418n2260
$$ -135717 -142716 -202329 -210927 -104402 -17587 -2691 -30105 -97859 -107991 -113730 -18312 -70572
17364g0572k1972P9929l0851p8322m0013L3189P8933J2797j6374o9198l6337J18165
$$ -70572 -92544 -12615 -43466 -121788 -161801 -128612 -49679 -36882 -53256 -122454 -158791 -40626
17352d0626O263L5792k405K1283j7706k9365j2810J1994O1858q337n8384J4881
$$ -40626 -34363 1429 -976 20307 2601 -26764 -39574 -27580 34278 25941 -32443 -17562
17340a7562L2270o2058r5816j9998k295k363O6160O6416l2778L5659J7959q2283
$$ -17562 14708 -47350 -143166 -163164 -165459 -167822 -101662 -35246 -68024 -32365 -14406 -96689
17328i6689k1545k4910n2876K7717K0464N8182R0523j1418m3178l5171k0344J7630
$$ -96689 -118234 -143144 -196020 -168303 -147839 -89657 866 -10552 -53730 -88901 -109245 -91615
17316i1615k6300J4274R1822m0826m3760P1669J2394O0947j1616n5104m7764o8627
$$ -91615 -117915 -103641 -11819 -52645 -96405 -24736 -12342 48605 36989 -18115 -65879 -134506
17304a34506k7400N6749N8756m2126j3271L6448O3189k9506m0468M6731J27034
$$ -134506 -161906 -105157 -46401 -88527 -101798 -65350 -2161 -31667 -72135 -25404 101630
17293A01630N0359r142n9717p9285o291k4781j7695j9782l8720p3897N2773O1312
$$ 101630 151989 142847 83130 3845 -2446 -27227 -44922 -64704 -103424 -177321 -124548 -63236
17281f3236k1743O0484L2226O8999l0661m1944k475o8181J0447J0596P615l6115
$$ -63236 -84979 -24495 7731 76730 46069 4125 1650 -66531 -56084 -45488 -37873 -73988
17269g3988j166o3620n7062N9024m663q2506l5610J67R2631R086k363O176Q631
$$ -73988 -75154 -138774 -195836 -136812 -141475 -223981 -259591 -259424 -166793 -157707 -160070 -153894 -145263
17256a45263O3680l0512p6673J4086N690M8903O4014J2911O792n1818N1637Q4562
$$ -145263 -81583 -112095 -188768 -174682 -168992 -120089 -56075 -43164 -36372 -88190 -36553 48009
17244D8009m279m841r8317L1818j9912n1966M1068L4609r1218J147j5051j8006
$$ 48009 43730 38889 -59428 -27610 -47522 -99488 -58420 -23811 -115029 -113882 -128933 -146939
17232a46939K4097J16731M901J7045n7710P7222L2634Q2120l7634j12576l3293
$$ -146939 -122842 -6111 -1210 15835 -41875 35347 67981 150101 112467 -109 -33402
17221c3402N8265Q208l0922o1691j7961K6341l958o0931o5989l4097R6940J2417
$$ -33402 24863 33071 2149 -59542 -77503 -51162 -55120 -116051 -182040 -216137 -119197 -106780
17209a06780J711O1052L3565j5432l4502L911k4379p1437l6706l5626j1677M5076
$$ -106780 -105069 -44017 -10452 -25884 -60386 -56475 -80854 -152291 -188997 -224623 -236300 -191224
17197a91224J09217L2902P1289m4510l8134r9689m0229n8803L6210L8562K3195
$$ -191224 -82007 -49105 22184 -22326 -60460 -160149 -200378 -259181 -222971 -184409 -161214
17186a61214J05439R3231P864m6370L2296J7299k9376k2689J1689m7154m575J4962
$$ -161214 -55775 37456 45320 -1050 31246 48545 19169 -3520 8169 -38985 -43560 -28598
17174b8598j5068n6433j1016m8382N5550R6739N2925j11647j2620L6484K1727
$$ -28598 -43666 -100099 -111115 -159497 -103947 -7208 45717 -65930 -78550 -42066 -20339
17163b0339m4489L6640L9196n9339k5288M320k9610j8691L4532K079Q599q5601
$$ -20339 -64828 -28188 11008 -48331 -73619 -69299 -98909 -117600 -83068 -80989 -72390 -157991
17151a57991q0244P9018K5047l851k0485M6308J5857k9440p1550q1489K5106J33810
$$ -157991 -238235 -159217 -134170 -138021 -158506 -112198 -96341 -125781 -197331 -278820 -253714 -119904
17139a19904J33719p9m6211J4355l9097n7725l2608J04862O0859o7387q2133k6283
$$ -119904 13815 13736 -32475 -18120 -57217 -114942 -147550 -42688 18171 -49216 -131349 -157632
17127a57632L4111J106J00969Q3306R217j0312l0190O6351j7245k3160o3635j45908
$$ -157632 -123521 -122415 -21446 61860 71077 60765 30575 96926 79681 56521 -7114 -153022
17115a53022r4484P8665M5665P5482J4532J242K7552L2924r001l4692K8570k1320
$$ -153022 -247506 -168841 -123176 -47694 -33162 -31920 -4368 28556 19555 -15137 13433 -7887
17103g887l1784r853N5225l9826m362K4060k0311m5593k2073K0507L1985m2853
$$ -7887 -39671 -49524 5701 -34125 -38487 -14427 -34738 -80331 -102404 -81897 -49912 -92765
17091i2765n392o5597M1609Q1530K5769n5005n2790k5124O5642k2167N7114K0717
$$ -92765 -98157 -163754 -122145 -40615 -14846 -69851 -122641 -147765 -82123 -104290 -47176 -26459
17079b6459o1937m7339J0139k4964m8308K9718J2965m7689Q059M5114O0145Q2482
$$ -26459 -88396 -135735 -125596 -150560 -198868 -169150 -156185 -203874 -195815 -150701 -90556 -8074
17067h074O623q8747j1151L6945L7883J9155m0195P966R1283o337l3311o168l5770
$$ -8074 -1451 -90198 -101349 -64404 -26521 -7366 -47561 -39595 51688 45351 12040 5872 -29898
17054b9898m6199J2673j8710K8880J8016r7237l7533Q4193J92405N0223r4015
$$ -29898 -76097 -63424 -82134 -53254 -35238 -132475 -170008 -85815 106590 156813 62798
17043F2798m7204m0354o3765m4033M8422P4420N6743m5991q4621k5457K8018N5502
$$ 62798 15594 -24760 -88525 -132558 -84136 -9716 47027 1036 -83585 -109042 -81024 -25522
17031b5522k1191N0620K5134p9319J7366P426l2074n357K4841K1761L7621L7256
$$ -25522 -46713 3907 29041 -50278 -32912 -25486 -57560 -62917 -38076 -16315 21306 58562
17019E8562o9827k3514j0772K7988k5538k7291R186M8898N3633o0434r891J5769
$$ 58562 -11265 -34779 -45551 -17563 -43101 -70392 -61206 -12308 41325 -19109 -29000 -13231
17007a3231m7029P0805l9029j763m6199r4781P820M4421J14775Q0872r363m1249
$$ -13231 -60260 10545 -28484 -30247 -76446 -171227 -163407 -118986 -4211 76661 67298 26049
16995B6049k3132k7360m763j2992J2061K2413R4360K2323j02769j36o3955K5106
$$ 26049 2917 -24443 -29206 -42198 -30137 -7724 86636 108959 6190 6054 -57901 -32795
16983c2795P3405k6790m8817K5033q160j03929m0768O4721j2448N0588R621K2585
$$ -32795 40610 13820 -34997 -9964 -18124 -122053 -162821 -98100 -110548 -59960 -50339 -27754
16971b7754l6757q2781M260J11426R6554J2310m9764j62572p664Q4915K6570n6464
$$ -27754 -64511 -147292 -143032 -31606 64948 77258 27494 -135078 -142742 -57827 -31257 -87721
16959h7721m2580l4006n6444N6234P1217R1806K5360r3023o4914L2308l4633L2847
$$ -87721 -130301 -164307 -220751 -164517 -93300 -1494 23866 -69157 -134071 -101763 -136396 -103549
16947a03549L3002L2602O410Q698k8146M9379M9532L5051J8528K9467l3927l1732
$$ -103549 -70547 -37945 -31535 -22837 -50983 -1604 47928 82979 101507 130974 97047 65315
16935F5315l111p9409k8189p3255m1323N8889Q1052J16635k6475q1176l6850K6245
$$ 65315 62204 -17205 -45394 -118649 -159972 -101083 -20031 96604 70129 -11047 -47897 -21652
16923b1652L5533j5802J8343J5729N1205O4135q835K5789R395q9960j8725j750
$$ -21652 13881 -1921 16422 32151 83356 147491 138656 164445 173840 83880 65155 63405
16911F3405K965p7624o3123J0326O3138m38q9384P4885L3041j5541M7051Q6425
$$ 63405 66370 -11254 -74377 -64051 -913 -1351 -90735 -15850 17191 1650 48701 135126
16899A35126p429n0193o7905n0470l6465k7121m100K9080R6480k6925j11952K2447
$$ 135126 127697 77504 9599 -40871 -77336 -104457 -108557 -79477 17003 -9922 -121874 -99427
16887i9427Q7910J0121m8781o0479j03274m7353o7950K4784P8964J65799J09906
$$ -99427 -11517 -1396 -50177 -110656 -213930 -261283 -329233 -304449 -225485 -59686 50220
16876E0220k2118N0000J8563q9350q9201J4k406L258p9047j6546Q5161P6953Q0834
$$ 50220 28102 78102 96665 7315 -81886 -81872 -84278 -81020 -160067 -176613 -91452 -14499 66335
16863F6335l7937O4197J4211n611L6458j58582j0081m8819M4680K3151N1811n2528
$$ 66335 28398 92595 106806 101195 137653 -20929 -31010 -79829 -35149 -11998 39813 -12715
16851a2715o5137O1868K0886J4324L9165o4945K9622L8639j18035n527Q3154J09265
$$ -12715 -77852 -15984 4902 19226 58391 -6554 23068 61707 -56328 -61855 21299 130564
16839A30564J38J8118p3185j16666L2237L0706L2242j9581r870j5563o4656n8396
$$ 130564 130702 148820 75635 -41031 -8794 21912 54154 34573 24703 9140 -55516 -113912
16827a13912J0822r57L0854K9356p6204o1836K2531M935n1100J3477R871L5534
$$ -113912 -103090 -104047 -73193 -43837 -120041 -181877 -159346 -154411 -205511 -192034 -182163 -146629
16815a46629O1265K3381j0652K2761J7999R5581K4966r770o729O96q402N8276
$$ -146629 -85364 -61983 -72635 -49874 -31875 63706 88672 78902 72173 72869 64467 122743
16803A22743l045r4949l5712N3516K1342k4175L0700n5799q0341j3839p804P8317
$$ 122743 119698 24749 -10963 42553 63895 39720 70420 14621 -65720 -79559 -87363 -9046
16791i046K8021K5511N0152n2326p3964p627R2541M6935J6512k5014L2134j0252
$$ -9046 18975 44486 94638 42312 -31652 -39279 53262 100197 116709 91695 123829 113577
16779A13577K0516n4242n2212k4275m8269o3819j2880p2466k8117J20310L8937
$$ 113577 134093 79851 27639 3364 -44905 -108724 -121604 -194070 -222187 -101877 -62940
16768f2940k2064K4287Q233L9342j6569n1309J6067J08558O0336l6326j2464K1943
$$ -62940 -85004 -60717 -52484 -13142 -29711 -81020 -64953 43605 103941 67615 55151 77094
16756G7094o324q1927N787O0697M2009n9149j00349P3415n1296p3694p3439O7087
$$ 77094 70770 -11157 -5370 55327 97336 38187 -62162 11253 -40043 -113737 -187176 -120089
16744a20089M9228N2830M5668L2624k4900p8325K5982j7138j0879J6034m496Q457
$$ -120089 -70861 -18031 27637 60261 35361 -42964 -16982 -34120 -44999 -28965 -33461 -25004
16732b5004p2954Q6752K3065M0123o497j0204k8951o9847J6247R2323n8386l6855
$$ -25004 -97958 -11206 11859 51982 45485 35281 6330 -63517 -47270 45053 -13333 -50188
16720e0188M1442n9915o2067l1012N5485R6795N0631O6821k8848m1429m3424m3272
$$ -50188 -8746 -68661 -130728 -161740 -106255 -9460 41171 107992 79144 37715 -5709 -48981
16708d8981m6523j5614p0402o7670K7802L8295J03753P0157R512J35955l1361
$$ -48981 -95504 -111118 -181520 -249190 -221388 -183093 -79340 -9183 329 136284 104923
16697A04923l6725N78o285N7156O5637o5372q5259j7081p7729K1633k805M8320
$$ 104923 68198 68776 62491 119647 185284 119912 34653 17572 -60157 -38524 -41329 6991
16685F991Q8596j2338p1341q1703l9676j5376J04642L7287n7942K5956O984j23312
$$ 6991 95587 83249 11908 -69795 -109471 -124847 -20205 17082 -40860 -14904 -7920 -131232
16673a31232l5096O5594J21077j4580m4542o4505j7033L4867k3889J01658N8595
$$ -131232 -166328 -100734 20343 5763 -38779 -103284 -120317 -85450 -109339 -7681 50914
16662E0914n5936m4242J8456l3189j02144j00388J23497L9421n5476J1723q337
$$ 50914 -5022 -49264 -30808 -63997 -166141 -266529 -143032 -103611 -159087 -147364 -155701
16651a55701l2900K3389M9730P3587O669M4948J3936n5530k0745M2246j8501L8377
$$ -155701 -188601 -165212 -115482 -41895 -35226 9722 23658 -31872 -52617 -10371 -28872 9505
16639I505q324R3056L9348q224j7072o5157k9746K7929j11781k94r424M6778j1411
$$ 9505 1181 94237 133585 125361 108289 43132 13386 41315 -70466 -70760 -80184 -33406 -44817
16626d4817l6941q3875M777L8152J15038j438k4401j6025j4174q86P1905l1559
$$ -44817 -81758 -165633 -160856 -122704 -7666 -9104 -33505 -49530 -63704 -64590 7315 -24244
16614b4244L0481N0687m3201p6407Q783j6683j2827l5566j3384N2320J2290j1273
$$ -24244 6237 56924 13723 -62684 -53901 -70584 -83411 -118977 -132361 -80041 -67751 -79024
16602g9024p205l3914J5522K2489Q438j3080M5261L2886J2621k250k1077l4538
$$ -79024 -86229 -120143 -104621 -82132 -73694 -86774 -41513 -8627 3994 1744 -19333 -53871
16590e3871K2821l5317q8973m1699L4295j769k8038K546R0659N4885n9396J2384
$$ -53871 -31050 -66367 -155340 -197039 -162744 -164513 -192551 -190005 -99346 -44461 -103857 -91473
16578i1473m154n2979O1435J01481N409o5186l8436l2185k8204j5926Q8242R9938
$$ -91473 -95627 -148606 -87171 14310 19719 -45467 -83903 -116088 -144292 -160218 -71976 27962
16566B7962k7823m7207k2843K1746P9483O2648j03500j43717k9090l180O9296
$$ 27962 139 -47068 -69911 -48165 31318 93966 -9534 -153251 -182341 -185521 -116225
16555a16225R5035L6085o3858m6952q270K4013J6200M3377j1282M7865k5885l6026
$$ -116225 -21190 14895 -48963 -95915 -104185 -80172 -63972 -20595 -31877 15988 -9897 -45923
16543d5923l3741n1427K4102L2457J8887n3943J9682N4134K1613q4284j4387k0570
$$ -45923 -79664 -131091 -106989 -74532 -55645 -109588 -89906 -35772 -14159 -98443 -112830 -133400
16531a33400J6795j2039O194L5898O5366j0751m2880K6062n1743N4471O0968N6249
$$ -133400 -116605 -128644 -122450 -86552 -21186 -31937 -74817 -48755 -100498 -46027 14941 71190
16519G1190O8514n2824N3788N9135l570j2739K849k8515n5432l5454J8095l6911
$$ 71190 139704 86880 140668 199803 196233 183494 186343 157828 102396 66942 85037 48126
16507D8126M1159k946J6735j1878j37416M0631Q2255M5936k3758j30719l0507
$$ 48126 89285 86339 103074 91196 -46220 -5589 76666 122602 98844 -31875 -62382
16496f2382l4795K6345j5368o4966N9557L0264l0698q412J02659M5437M2188N6823
$$ -62382 -97177 -70832 -86200 -151166 -91609 -61345 -92043 -100455 2204 47641 89829 146652
16484A46652P0097k7898j51767m3532k2252m4907K733M1726l2586j0537J0410
$$ 146652 216749 188851 37084 -6448 -28700 -73607 -70874 -29148 -61734 -72271 -61861
16473f1861L1788n8585K2680j9956J6245j9932o6356J04849J8329m3106J1156
$$ -61861 -30073 -88658 -65978 -85934 -69689 -89621 -155977 -51128 -32799 -75905 -64749
16462f4749K2853o17K0708L1755L0534J17995J7954o4301o1173j01159L0398M600
$$ -64749 -41896 -42513 -21805 9950 40484 158479 176433 112132 50959 -50200 -19802 -15202
16450a5202n6259j9748P4816J1931L0119k8543R545j8790K4370p496m241m4327
$$ -15202 -71461 -91209 -16393 -4462 25657 -2886 6659 -12131 12239 4743 502 -43825
16438d3825n3581P6684N2867l0498L9451L832J4574j9943p3544J1976l0344l0398
$$ -43825 -97406 -20722 32145 1647 41098 44930 59504 39561 -33983 -22007 -52351 -82749
16426h2749k716j0523l802K5778o876L3948J6799N9727k9781m5951J0672O0992
$$ -82749 -85465 -95988 -99790 -74012 -80888 -46940 -30141 29586 -195 -46146 -35474 25518
16414B5518k2482N2186O8732l3087J0218k3676l5665n2592p6373R453k757L9109
$$ 25518 3036 55222 123954 90867 101085 77409 41744 -10848 -87221 -77768 -80525 -41416
16402d1416O1804r072p7990l9372k3004L0286N2567M8627J4242j6492o9817L7445
$$ -41416 20388 11316 -66674 -106046 -129050 -98764 -46197 2430 16672 180 -69637 -32192
16390c2192K9118J3542K9887j4994J6114l6190j7343N2439J05896K8578n0671
$$ -32192 -3074 10468 40355 25361 41475 5285 -12058 40381 146277 174855 124184
16379A24184k6302J4257l3542p297j07077K0975O6765l9393k2943L712l8102m0142
$$ 124184 97882 112139 78597 71300 -35777 -14802 51963 12570 -10373 -6661 -44763 -84905
16367h4905j6617k8645M4398M0617m2449M2374K7439o9639l1785J935N0871O9601
$$ -84905 -101522 -130167 -85769 -45152 -87601 -45227 -17788 -87427 -119212 -117277 -66406 3195
16355C195K4016j0666j169j574k0743m3710N8653N0177m4034o9344J5013o4543
$$ 3195 27211 16545 15376 13802 -6941 -50651 8002 58179 14145 -55199 -40186 -104729
16343a04729K5047r1028k8050N3370N9881R8766N7651n5204R642K0480J0548o7497
$$ -104729 -79682 -170710 -198760 -145390 -85509 13257 70908 15704 25346 45826 56374 -11123
16331a1123k8167L5261o5877j5646j1001j9767j5454P6489J64038n0708l3881
$$ -11123 -39290 -4029 -69906 -85552 -96553 -116320 -131774 -55285 108753 58045 24164
16320B4164k7352n4567q6680n362O6287O6787K0752j8860j07142n5000L0614m2012
$$ 24164 -3188 -57755 -144435 -149797 -83510 -16723 4029 -14831 -121973 -176973 -146359 -188371
16308a88371l1937O2588O3046L8001p4969j06689K9489J01698O6284L1755L0855
$$ -188371 -220308 -157720 -94674 -56673 -131642 -238331 -208842 -107144 -40860 -9105 21750
16297B1750o4962M2709p0229p927J8638j3430J5226o9802L7042J767O4769O7498
$$ 21750 -43212 -503 -70732 -78659 -60021 -73451 -58225 -128027 -90985 -89218 -24449 43049
16285D3049J3442j5814n4294J2590p9127R414j4897K5837K1595n0003n3305N0451
$$ 43049 56491 40677 -13617 -1027 -80154 -70740 -85637 -59800 -38205 -88208 -141513 -91062
16273i1062L8859P3623p5827p6163J9368Q341j1387J27099O0344j5871O2999n9832
$$ -91062 -52203 21420 -54407 -130570 -111202 -102861 -114248 12851 73195 57324 120323 60491
16261F0491J8583m8517q3042j0838l6088l9440q0507j1129L1902P171r1212L8915
$$ 60491 79074 30557 -52485 -63323 -99411 -138851 -219358 -230487 -198585 -191414 -282626 -243711
16249b43711J15131R5254J6288k8020k7655j5665M2982N0075J2148j6837L6599
$$ -243711 -128580 -33326 -17038 -45058 -72713 -88378 -45396 4679 16827 -10 36589
16238C6589o1145k397O3907k5130m7001O2339M2766l3505k106n589k7198n0279
$$ 36589 -24556 -26953 36954 11824 -35177 27162 69928 36423 34317 28728 1530 -48749
16226d8749k1589j4959j3113L2290O7407j1086p6188M2009P5007J3033j8756k0726
$$ -48749 -70338 -85297 -98410 -66120 1287 -9799 -85987 -43978 31029 44062 25306 4580
16214D580K3394J7349N8061l3803n7351j17986M1427O2692L775l8947k4359k7767
$$ 4580 27974 45323 103384 69581 12230 -105756 -64329 -1637 2138 -36809 -61168 -88935
16202h8935n6591L7599N2284L6052L9539Q178o8264q2462o5438M0904R2481P1573
$$ -88935 -145526 -107927 -55643 -19591 19948 28126 -40138 -122600 -188038 -147134 -54653 16920
16190A6920K1044j48467q8373L9951N6552K4213k6570J1663J00794m980k8466
$$ 16920 37964 -110503 -198876 -158925 -102373 -78160 -104730 -93067 7727 2747 -25719
16179b5719k2655o0061K4656J27937K5653M2735n9792k7139m887O4533N517q012
$$ -25719 -48374 -108435 -83779 44158 69811 112546 52754 25615 20728 85261 90778 82766
16167H2766N1580O5288m5961j02090m8160l0451M6575K5336m9598M0761O2125
$$ 82766 134346 199634 153673 51583 3423 -27028 19547 44883 -4715 36046 98171
16156I8171m6940p0151k7289j28595J4567N6984q2996J3217J33231M4320j2561
$$ 98171 51231 -18920 -46209 -174804 -160237 -103253 -186249 -173032 -39801 4519 -8042
16145h042M6249M2982n4540m0964K9671K0376J121N08m2653l997J7749o972K3083
$$ -8042 38207 81189 26649 -14315 15356 35732 36853 37361 -5292 -9289 8460 1488 24571
16132B4571r712K8790k9641j31098j3020O6407O6540M656M8401l4447n1465l686
$$ 24571 14859 43649 14008 -117090 -130110 -63703 2837 7493 55894 21447 -30018 -33704
16120c3704P3420L4867p162q9594P932L7918j02228J1385M2849n0919n0544j1682
$$ -33704 39716 74583 67421 -22173 -14241 23677 -78551 -67166 -24317 -75236 -125780 -137462
16108a37462P0426O067j688l6176r5508l3324M9462J7971Q874q419m7301p2217
$$ -137462 -67036 -60969 -62657 -98833 -194341 -227665 -178203 -160232 -151358 -159777 -207078 -279295
16096b79295R6495M1401r730N2983O7380M781j15705n1948M0900O4091j6219N0316
$$ -279295 -182800 -141399 -151129 -98146 -30766 -25985 -141690 -193638 -152738 -88647 -104866 -54550
16084e4550P5239O3455m9168n8014k8635j9468L4221o2200k3931j1439Q9807M0731
$$ -54550 20689 84144 34976 -23038 -51673 -71141 -36920 -99120 -123051 -134490 -44683 -3952
16072c952k4800P6068j6365k150O543K0268O507p2173q6119J9943Q2267j6881
$$ -3952 -28752 47316 30951 28801 35344 55612 62119 -10054 -96173 -76230 6037 -10844
16060a0844p9403o991j5648N8160K9925k5828n0119l4440M9894j892J3346L6839
$$ -10844 -90247 -97238 -112886 -54726 -24801 -50629 -100748 -135188 -85294 -87186 -73840 -37001
16048c7001l6981L7823k3632o1245q7778n9938K0126O1517N1351Q8601P5572K8637
$$ -37001 -73982 -36159 -59791 -121036 -208814 -268752 -248626 -187109 -135758 -47157 28415 57052
16036E7052k9914l3178n5018K879M0873K8430K6024o4707M5285L8462m7221L7682
$$ 57052 27138 -6040 -61058 -58179 -17306 11124 37148 -27559 17726 56188 8967 46649
16024D6649j9064J6878l6190M1095M4391o9410n5559K4282J7319k5139O1439K1883
$$ 46649 27585 44463 8273 49368 93759 24349 -31210 -6928 10391 -14748 46691 68574
16012F8574k2516M3495N8128J5208j22427p8783k8812O3455K1904K4860j2759
$$ 68574 46058 89553 147681 162889 40462 -38321 -67133 -3678 18226 43086 30327
16001C0327K4220R331J4305P395k1976p4937k6578N1576L1022J7705j865r2714
$$ 30327 54547 63878 78183 85578 63602 -11335 -37913 13663 44685 62390 60525 -32189
15989c2189q8193J1565j1920m71R757M2896R2173r733m6539P3968M4028n4767
$$ -32189 -120382 -108817 -120737 -121208 -111451 -68555 23618 13885 -32654 41314 85342 30575
15977C0575l3565k6446M097o0797n319o976O2346J31165N2599r1381j16480k7944
$$ 30575 -2990 -29436 -25339 -86136 -91455 -98431 -36085 95080 147679 56298 -60182 -88126
15965h8126L1467j4568N4624m690o5769L0607J4222O4730J4199O8317m961p5772
$$ -88126 -56659 -71227 -16603 -21293 -87062 -56455 -42233 22497 36696 105013 100052 24280
15953B4280p7666M7547L2876K9583m1210k5688M5651P0382J07654K1495j32466
$$ 24280 -53386 -5839 27037 56620 15410 -10278 35373 105755 213409 234904 102438
15942A02438l3684R0981j1734l5698l5510q5614o8255j0924J8095Q0775M3404
$$ 102438 68754 159735 148001 112303 76793 -8821 -77076 -88000 -69905 10870 54274
15931E4274K5088m0071M6215o436r7489j30135R09L3716K178N8568M6895k1489
$$ 54274 79362 39291 85506 79070 -18419 -148554 -147645 -113929 -111751 -53183 -6288 -27777
15919b7777q2475m4328N3361P5260O7304k0098j26967K1551J4474k4830L9743
$$ -27777 -110252 -154580 -101219 -25959 41345 21247 -105720 -84169 -69695 -94525 -54782
15908e4782J29930K6350q1645N4142q028k1305M740J976r7942P4137L5405k4091
$$ -54782 75148 101498 19853 73995 65967 44662 49402 51378 -46564 27573 62978 38887
15896C8887r9896j2465M0090M636n8615j0922K8361p9596K5637J21646J4020p8958
$$ 38887 -61009 -73474 -33384 -28748 -87363 -98285 -69924 -149520 -123883 -2237 11783 -67175
15884f7175j9503p218K5080N9723o1443k4093N133n0767M5601J6227R383j9779
$$ -67175 -86678 -93896 -68816 -9093 -70536 -94629 -89496 -140263 -94662 -78435 -69052 -88831
15872h8831R5444J3750r2562j2550l5719l00J5071L4261J00167M8616l7886n0257
$$ -88831 6613 20363 -72199 -84749 -120468 -120768 -105697 -71436 28731 77347 39461 -10796
15860a0796O1487r967n6847Q146M3864l1860p667Q522o1323m1461j3105J8557
$$ -10796 50691 40724 -16123 -7977 35887 4027 -3640 4882 -56441 -97902 -111007 -92450
15848i2450M8478M786l0193L6638K5249o56j9466J6067l5045j3932k6635K2166
$$ -92450 -43972 -39186 -69379 -32741 -7492 -8148 -27614 -11547 -46592 -60524 -87159 -64993
15836f4993K9404J31310L4820j8209p0170j27100K1450L0504M7933J04554j8511
$$ -64993 -35589 95721 130541 112332 42162 -84938 -63488 -32984 14949 119503 100992
15825A00992L6391P7710k8819j1939J8520r061j11152j11417p2430j6683J01890
$$ 100992 137383 215093 186274 174335 192855 183794 72642 -38775 -111205 -127888 -25998
15814b5998J6048r5340q312O7847k049q627r5074N2066N2903O4749P4451n365
$$ -25998 -9950 -105290 -113602 -45755 -47804 -56431 -151505 -99439 -46536 18213 92664 87299
15802H7299q5913p5902l577K0501M9393M7641n672o0803n4072j1260j9181o1734
$$ 87299 1386 -74516 -78093 -57592 -8199 39442 33770 -27033 -81105 -92365 -111546 -173280
15790a73280J496K6960J5191J8923M7484Q323m9006M588L6004Q4013L2528n2701
$$ -173280 -171784 -144824 -129633 -110710 -63226 -54903 -103909 -99321 -63317 20696 53224 523
15778E23L5482m1694l1100N7164n716O3730o199j0525r9K4286J1462k7833p1834
$$ 523 36005 -5689 -36789 20375 14659 78389 72190 61665 61566 85852 97314 69481 -2353
15765b353j7340j318q161J943M2027l5000J394R8348J9413n1975N3217q584l2858
$$ -2353 -19693 -21011 -29172 -27229 14798 -20202 -18808 79540 98953 46978 100195 91611 58753
15752E8753o4403o2704L3709K1325o9840K5096L3957k5013K5000l4633l4964M7513
$$ 58753 -5650 -68354 -34645 -13320 -83160 -58064 -24107 -49120 -24120 -58753 -93717 -46204
15740d6204m0596L6655l8436o8956O3484O416M4582J3620m3100k2140P3213Q5961
$$ -46204 -86800 -50145 -88581 -157537 -94053 -87637 -43055 -29435 -72535 -94675 -21462 64499
15728F4499p6959p3165J6248J02446q8613l8359J4333n0680P1744J10626m0718
$$ 64499 -12460 -85625 -69377 33069 -55544 -93903 -79570 -130250 -58506 52120 11402
15717A1402j08108O2097N180R63Q1063l8663n9582M0199L254Q1186r671j39823
$$ 11402 -96706 -34609 -29429 -28466 52597 13934 -45648 -5449 -2195 78991 69320 -70503
15705g0503n4535p9505Q3105J08648k011n1129j2539J12381n0586n0893L5513
$$ -70503 -125038 -204543 -121438 -12790 -14801 -65930 -78469 33912 -16674 -67567 -32054
15694c2054M7786j12171l8507o8007K9344N0875M4880k956L9626J6011O8011J1780
$$ -32054 15732 -96439 -134946 -202953 -173609 -122734 -77854 -80810 -41184 -25173 42838 54618
15682E4618k010M122J1433j9181m4634n1914R534O106Q1725K6961n0871o0910
$$ 54618 52608 56730 68163 48982 4348 -47566 -38032 -31926 49799 76760 25889 -35021
15670c5021R2034J6576m4421n726M4123J7689J7272l8932n7759L5169l6531n4670
$$ -35021 57013 73589 29168 23442 67565 85254 102526 63594 5835 41004 4473 -50197
15658e0197k2797P4257K5542n9646j4720M7620j4757J5452N7043M0373k3807J3146
$$ -50197 -72994 1263 26805 -32841 -47561 59 -14698 754 57797 98170 74363 87509
15646H7509J1424k3475m2917l493J6430j5450j367N8224L8120r203j74567l6648
$$ 87509 98933 75458 32541 29048 45478 30028 28661 86885 125005 115802 -58765 -95413
15634i5413M2656l0436m9256P1586M5545m798l7004j8388l8702L4419k7975N6228
$$ -95413 -52757 -83193 -132449 -60863 -15318 -20116 -57120 -75508 -114210 -79791 -107766 -51538
15622e1538J12930J14314n1634l1838p8576q1068J5027P3005l7898o1466j9469
$$ -51538 61392 175706 124072 92234 13658 -67410 -52383 20622 -17276 -78742 -98211
15611i8211k6931O9996R5541M3283l1455p1915L8964M2769l6546k1894j6187M5392
$$ -98211 -125142 -55146 40395 83678 52223 -19692 19272 62041 25495 3601 -12586 32806
15599C2806m7126L128L3570M6110K0351q3862p8306q0244k5869J09400J30931
$$ 32806 -14320 -11192 22378 68488 88839 4977 -73329 -153573 -179442 -70042 60889
15588F0889R478m0335K0337k7663k3679L5852j2550r058N1661j4076o8616l543
$$ 60889 70367 30032 50369 22706 -973 34879 22329 13271 64932 50856 -17760 -21303
15576b1303N6155j2224l9840K6570J6608p4293P439l827q307Q2244k0248l0657
$$ -21303 34852 22628 -17212 9358 25966 -48327 -40888 -44715 -53022 29222 8974 -21683
15564b1683j2967o962l7829n606L9379J8777l60k925P2553J0955k994L901K5361
$$ -21683 -34650 -41612 -79441 -85047 -45668 -26891 -27251 -30176 42377 53332 50338 54239 79600
15551G9600Q969l7063K9494l27l2534L0510r674P4783j8464p1447k3773K560Q428
$$ 79600 88569 51506 81000 80673 48139 78649 68975 143758 125294 53847 30074 32634 41062
15538D1062L3313L0619P6777Q9421j50051r3021L0536O7551M0739n6816n3623
$$ 41062 74375 104994 181771 271192 121141 28120 58656 126207 166946 110130 56507
15527E6507j5008j1636k6696r196R707K4661o4735N3167m7777k5868k665N5848
$$ 56507 41499 29863 3167 -6029 3678 28339 -36396 16771 -31006 -56874 -59539 -3691
15515c691O5456N2563q475J7435P469j25864r7618L8439j9783J1175k1649l038
$$ -3691 61765 114328 105853 123288 130757 4893 -92725 -54286 -74069 -62894 -84543 -87581
15503h7581k1163N823J3542j0553m357L9919O0271O5834O1450k3122m5648l9283
$$ -87581 -108744 -102921 -89379 -99932 -104289 -64370 -4099 61735 123185 100063 54415 15132
15491A5132r143J8724J5213K929N0925k5201j27222L3517n7669o0019L4871P99
$$ 15132 5989 24713 39926 42855 93780 68579 -58643 -25126 -82795 -142814 -107943 -107144
15479a07144J11512k0598j7389O73K3087O1952q483P390L4046K8674k8295j9536
$$ -107144 4368 -16230 -33619 -32946 -9859 52093 43610 51000 85046 113720 85425 65889
15467F5889R585J7979M8564m9972j42292o718J9180m1615j8975o3430J65960K9257
$$ 65889 75474 93453 142017 92045 -50247 -56965 -37785 -79400 -98375 -161805 4155 33412
15455C3412j7723n7053o5999m7981Q7449J29662K0808o509l9845m6940K2702j39
$$ 33412 15689 -41364 -107363 -155344 -67895 61767 82575 76066 36221 -10719 11983 11844
15443A1844J2642j4870j05423j0414P5404J839M4611j188q9230j00878O6649J8790
$$ 11844 24486 9616 -95807 -106221 -30817 -28978 15633 14445 -74785 -175663 -109014 -90224
15431i0224O407P6748O6960L7541l7261j9236n6492j6388M9244k6797K6576L2716
$$ -90224 -83817 -7069 59891 97432 60171 40935 -15557 -31945 17299 -9498 17078 49794
15419D9794R396l6950l1258L4065o2618j40221L9190J57464J9264Q51j6328N2411
$$ 49794 59190 22240 -9018 25047 -37571 -177792 -138602 18862 38126 38977 22649 75060
15407G5060J01619m9579j60323q0222R4419J6825K3785m3000p4877j989J48961
$$ 75060 176679 127100 -33223 -113445 -19026 -2201 21584 -21416 -96293 -98282 50679
15396E0679O1963q4273k4569N1156j4651O5703L3460j13034j04813k7665R8731
$$ 50679 112642 28369 3800 54956 40305 106008 139468 26434 -78379 -106044 -7313
15385g313J2719o6131J0620K401L3876Q0665K2512k1624J4649k3098j4760n1883
$$ -7313 5406 -60725 -50105 -47704 -13828 66837 89349 67725 82374 59276 44516 -7367
15373g367r162j0730K6355L9314r110j6883O710k4198K620O44N5922K7597p5407
$$ -7367 -16529 -27259 -904 38410 29300 12417 19127 -5071 -2451 -1807 54115 81712 6305
15360F305j16475L0745K3792p2452K7403J12321M5573K2155o3898N0673M2321
$$ 6305 -110170 -79425 -55633 -128085 -100682 11639 57212 79367 15469 66142 108463
15349A08463o5454r3559k3285J1419K9896J00443J10412n4607j04386q8841L6896
$$ 108463 43009 -50550 -73835 -62416 -32520 67923 178335 123728 19342 -69499 -32603
15338c2603M9007K1411p2001K2245j9235l0094m3330Q3559J2573l4217J7801o603
$$ -32603 16404 37815 -34186 -11941 -31176 -61270 -104600 -21041 -8468 -42685 -24884 -31487
15326c1487J3749P091l1334J4137K7800n4349l601J2982J19860K1653j06021j3402
$$ -31487 -17738 -10647 -41981 -27844 -44 -54393 -57994 -45012 74848 96501 -9520 -22922
15314b2922R5101Q2201j9216j0793q7120L698l5996p6074J9283j4842q5545J9979
$$ -22922 72179 154380 135164 124371 37251 40949 4953 -71121 -51838 -66680 -152225 -132246
15302a32246Q3653J5040o7754L1417J3034j9532K5832L864M4427L7136K6192j9211
$$ -132246 -48593 -33553 -101307 -69890 -56856 -76388 -50556 -46692 -2265 34871 61063 41852
15290D1852p3649p5406J3736Q4482J43173K3231j41188K9491k9352k4544K1461
$$ 41852 -31797 -107203 -93467 -8985 134188 157419 16231 45722 16370 -8174 13287
15279A3287q323o3769O3783l516o3955o5J1447m1367J0724Q9445m3052O072J7628
$$ 13287 4964 -58805 4978 1462 -62493 -62558 -51111 -92478 -81754 7691 -35361 -29289 -11661
15266a1661L0572m4138l2244k1569j5299O0289n8310L1548O9913J0197p3870M2324
$$ -11661 18911 -25227 -57471 -79040 -94339 -34050 -92360 -60812 9101 19298 -54572 -12248
15254a2248J21314o2647r3572M9723n5771k9496L7354R9189P2425j04929q7620
$$ -12248 109066 46419 -47153 2570 -53201 -82697 -45343 53846 126271 21342 -66278
15243f6278K143l195k2483n700J45563O6725n7604n4660L0220J00111K3561r786
$$ -66278 -64135 -67330 -89813 -95513 50050 116775 59171 4511 34731 134842 158403 148617
15231A48617p9054p613L1417m0748k2526r544l0003M8319o6310j1028J506m1830
$$ 148617 69563 61950 93367 52619 30093 20549 -9454 38865 -27445 -38473 -36967 -78797
15219g8797l3821J04148P3066k7174K4554q4359k3771Q2001j0852n7894O1534
$$ -78797 -112618 -8470 64596 37422 61976 -22383 -46154 35847 24995 -32899 28635
15208B8635O7103q2973L842j9493j00133j1775O3356J02036K5240l8848J330j7072
$$ 28635 95738 12765 16607 -2886 -103019 -114794 -51438 50598 75838 36990 38320 21248
15196B1248N4879K5895M05o3422p8517J0572q796o9473L78R7662k8446q0591l4356
$$ 21248 76127 102022 102427 39005 -39512 -28940 -37736 -107209 -106831 -9169 -37615 -118206 -152562
15183a52562o518Q7719Q6689m0732j4848r3695m5291L9953R072L322L3892M5528
$$ -152562 -159080 -71361 15328 -25404 -40252 -133947 -179238 -139285 -130213 -126891 -92999 -47471
15171d7471M6818K9404P5806j3081m8348N8235p872Q5707K0537o8964p3339m6551
$$ -47471 -653 28751 104557 91476 43128 101363 93491 179198 199735 130771 57432 10881
15159A0881K7701L7978N571J7424m3807m7228M6467N43q7687L6904O0194J8248
$$ 10881 38582 76560 82131 99555 55748 8520 54987 55530 -32157 4747 64941 83189
15147H3189q5868o1921o531r7527n9617R5182N8581M9597N3025O2010p323j16470
$$ 83189 -2679 -64600 -71131 -168658 -228275 -133093 -74512 -24915 28110 90120 82797 -33673
15135c3673K470J9066j1503k6494N1842P949M8148m3850n2325l1207j7773l3607
$$ -33673 -31203 -12137 -23640 -50134 1708 9657 57805 13955 -38370 -69577 -87350 -120957
15123a20957L9788K0546N1275P9967J4678n1803j8977O1036l562j4087r0482Q839
$$ -120957 -81169 -60623 -9348 70619 85297 33494 14517 75553 71991 57904 -32578 -23739
15111b3739N412q4236p8323L0618j110O0071M6840K1130P694j3819k6898q502
$$ -23739 -18327 -102563 -180886 -150268 -151378 -91307 -44467 -23337 -15643 -29462 -56360 -64862
15099f4862J305P4110N8091o0691l9411O2083O3966p8244k968J08416m261o7532
$$ -64862 -63557 10553 68644 7953 -31458 30625 94591 16347 13379 121795 117534 50002
15087E0002p2037l6426J6744R3693M9778L6245k6894K5759J4061j7413k0491p6402
$$ 50002 -22035 -58461 -41717 51976 101754 137999 111105 136864 150925 133512 113021 36619
15075C6619K4219m8424k0479K9994K2128J04259O3921o9658o4063N0671n358p0270
$$ 36619 60838 12414 -8065 21929 44057 148316 212237 142579 78516 129187 123829 53559
15063E3559p8214k3523N8790J5925l3408m788L736J08972N0890l9594l6928l7477
$$ 53559 -24655 -48178 10612 26537 -6871 -11659 -7923 101049 151939 112345 75417 37940
15051C7940j6601M1471j2727m5877l8807p626N0496l8368p2460N485m9970o4846
$$ 37940 21339 62810 50083 4206 -34601 -42227 8269 -30099 -102559 -97074 -147044 -211890
15039b11890M8139R4236M446j2474k654N6456p8243J7007J19105N5453o8027L8802
$$ -211890 -163751 -69515 -65069 -77543 -80197 -23741 -101984 -84977 34128 89581 21554 60356
15027F0356m5685J4536M598q8643n0826m7028j7007j447r954M6092L2117k2097
$$ 60356 14671 29207 33805 -54838 -105664 -152692 -169699 -171146 -181100 -135008 -102891 -124988
15015a24988J3043O1991J9898O6132On1351Q247J6935j461l6858k4744l566l8951
$$ -124988 -111945 -49954 -30056 36076 36082 -15269 -7022 9913 8452 -28406 -53150 -56716 -95667
15002i5667l8927M256R510Q3855N979Q5312L8698n6749j1127O961J6727L4825
$$ -95667 -134594 -130338 -120828 -36973 -30994 54318 93016 36267 25140 32101 48828 83653
14990H3653m9446o1592J7284k5279j0999k700L4087K6449q3215p0935l413O1661
$$ 83653 34207 -27385 -10101 -35380 -46379 -49079 -14992 11457 -71758 -142693 -146106 -84445
14978h4445O3051j707K7560N3536J0234p8635l4963J01500L2969q9850j4723K4735
$$ -84445 -21394 -23101 4459 57995 68229 -10406 -45369 56131 89100 -750 -15473 9262
14966I262L8743Q2210j0024p1216j09515J3495N5821p849j9906k3087M466M3203
$$ 9262 48005 130215 120191 48975 -60540 -47045 8776 927 -18979 -42066 -37600 5603
14954E603L4209K2318Q6229L2374j3782l7559l9847K537j9868K2463k5820p00
$$ 5603 39812 62130 148359 180733 166951 129392 89545 92082 72214 94677 68857 68157
14942F8157J660j7640l7031M2076J34856j1502r9759k9999k7395K968M944P1976
$$ 68157 69817 52177 15146 57222 192078 180576 80817 50818 23423 26391 31335 103311
14930A03311j344m6717J3183k3848j3866K3300K826j2986j5164o1827M1842k101
$$ 103311 101967 55250 68433 44585 30719 54019 56845 43859 28695 -33132 8710 6609
14918F609m3403j5935L0215J2014m0572j0859N7687k0701k7810P8213N5867m1012
$$ 6609 -36794 -52729 -22514 -10500 -51072 -61931 -4244 -24945 -52755 25458 81325 40313
14906D0313n1119L1518k0135r587l469R0897k5745n159j3503o5940l2253P7631
$$ 40313 -10806 20712 577 -9010 -12479 78418 52673 47514 34011 -31929 -64182 13449
14894A3449J39043Q8233k4089k7531j00711n7531l8107k9327q3577n58L3536k798
$$ 13449 152492 240725 216636 189105 88394 30863 -7244 -36571 -120148 -120706 -87170 -89968
14882h9968k2769l7894O3261J4917N8502M9575P8855k5071l6292l0120k8263M78
$$ -89968 -112737 -150631 -87370 -72453 -13951 35624 114479 89408 53116 22996 -5267 -4789
14870d789J8660n0974o9938M280O8314M4574L1766q8079j15429q6066O8869J36146
$$ -4789 13871 -37103 -107041 -102761 -34447 10127 41893 -46186 -161615 -247681 -178812 -42666
14858d2666L8539J5481k6411j6201l3977l6089j5743n7143L9431Q3328Q3075m5796
$$ -42666 -4127 11354 -15057 -31258 -65235 -101324 -117067 -174210 -134779 -51451 31624 -14172
14846a4172r1972N4920j5278l0410L3521N1926r153m25k6830L993n677N6423M6461
$$ -14172 -106144 -51224 -66502 -96912 -63391 -11465 -20618 -21043 -47873 -43880 -49557 6866 53327
14833E3327q0329l9632q0746p230J099J05883J12603N9775j2901r9018q0598m9157
$$ 53327 -27002 -66634 -147380 -154610 -153511 -47628 64975 124750 111849 12831 -67767 -116924
14821a16924l5554j8429k1185M4797O0365N5443l1634L9526N0788q0210p50O4781
$$ -116924 -152478 -170907 -192092 -147295 -86930 -31487 -63121 -23595 27193 -53017 -53767 11014
14809A1014N7538J9408o0836P461J6462M5532p1603l9341j2792L4704m2586n5629
$$ 11014 68552 87960 27124 34585 51047 96579 24976 -14365 -27157 7547 -35039 -90668
14797i0668K8027P0066J8564K4359M5243m473l7563L6413Q6858m929L8545J182
$$ -90668 -62641 7425 25989 50348 95591 91118 53555 89968 176826 171897 210442 211624
14785B11624j18310p5165m0369p2R4368Q8652n4780l273k9218q0236r6135N6227
$$ 211624 93314 18149 -22220 -22292 72076 160728 105948 102675 73457 -6779 -102914 -46687
14773d6687M2026M0727l9575j10624J437L6319O0348j4961k0513m5571N2933J2407
$$ -46687 -4661 36066 -3509 -114133 -112696 -76377 -16029 -30990 -51503 -97074 -44141 -31734
14761c1734N824k1407j8562R3294l119l1702p3418k4309L2653L8945n2700j02027
$$ -31734 -25910 -47317 -65879 27415 24296 -7406 -80824 -105133 -72480 -33535 -86235 -188262
14749a88262O8380N4190R3929M0598r418o3016j3220J7777N9284j2389l190Q5298
$$ -188262 -119882 -65692 28237 68835 59417 -3599 -16819 958 60242 47853 44663 129961
14737A29961R169l9219p5982j01642M1416M7410l9471m6946N7274j2168K0450
$$ 129961 139130 99911 23929 -77713 -36297 11113 -28358 -75304 -18030 -30198 -9748
14726i748P7522L8350Q303j7846J7872K9854p4381r5880o7625J4058L6643N7645
$$ -9748 67774 106124 114427 96581 114453 144307 69926 -25954 -93579 -79521 -42878 14767
14714A4767P5885k2443N1572j6828m0337J8190j0169j6077K3967l4446K5967K9211
$$ 14767 90652 68209 119781 102953 62616 80806 70637 54560 78527 44081 70048 99259
14702I9259lp2875j25768o449l0392n6910p5254N9334J13613J16815J32n5941
$$ 99259 99256 26381 -99387 -105836 -136228 -193138 -268392 -209058 -95445 21370 21502 -34439
14690c4439p474J960n8106O5498P8615n4207p234L3100p0462P4820O2765k5979
$$ -34439 -41913 -39953 -98059 -32561 46054 -8153 -15387 17713 -52749 22071 84836 58857
14678E8857M832l977N2180J1113j14466J5941q227o905O3350j3837K5745L8422
$$ 58857 63689 59712 111892 123005 8539 24480 16253 9348 72698 58861 84606 123028
14666A23028o6850l2118o082r3961n3762J2076J6328J15178L8553o471J1867J3482
$$ 123028 56178 24060 17978 -75983 -129745 -117669 -101341 13837 52390 45919 57786 71268
14654G1268m5720j17480l2920J20523K1740k3692k6206r5871M6750J20210K8261
$$ 71268 25548 -91932 -124852 -4329 17411 -6281 -32487 -128358 -81608 38602 66863
14643F6863j9793J8834j9944n5081O5702M9244j17k4435N2082n3715o1158J299
$$ 66863 47070 65904 45960 -9121 56581 105825 105708 81273 133355 79640 18482 19781
14631A9781R591o6234m7291L1247o2716l6982R6857J21867J220L4192L9102L7837
$$ 19781 29372 -36862 -84153 -52906 -115622 -152604 -55747 66120 67340 101532 140634 178471
14619A78471J2235o3644R068O832o4980L5481k817M7736J9055O5098l3903K3359
$$ 178471 190706 127062 136130 142962 77982 113463 110646 158382 177437 242535 208632 231991
14607B31991q317k72j5711O4543J39225M7503Q8764K03570K74232N00595O57389
$$ 231991 223674 223402 207691 272234 411459 458962 547726 751296 1025528 1526123 2183512
14596B183512L46329j23782j27599J33609J59661k60383o04088n29373m33214
$$ 2183512 2529841 2406059 2278460 2412069 2571730 2311347 1707259 1177886 744672
14587G44672k74758n1892j4714q345n4312r7506m1753j7703n9985m2491k4103
$$ 744672 469914 418022 403308 394963 340651 243145 201392 183689 123704 81213 57110
14576E7110J6308L8704m8310p2952M3310p651m9119J0401J11622O3208l8548j05297
$$ 57110 73418 112122 63812 -9140 34170 26519 -22600 -12199 99423 162631 124083 18786
14564A8786J3353k4604O1238J38715K4542n2344r8880m0814j00765J1302Q3310
$$ 18786 32139 7535 68773 207488 232030 179686 80806 39992 -60773 -49471 33839
14553C3839O0711j0579l5372J8769J5022R2557j0557l5423r0969l8524L7046p650
$$ 33839 94550 83971 48599 67368 82390 174947 164390 128967 37998 -526 36520 28870
14541B8870j23982j18833M8264R0921J60330O5194o912o3952j6569j4121j07992
$$ 28870 -95112 -213945 -165681 -74760 85570 150764 143852 79900 63331 49210 -58782
14530e8782m5906K9235q616j9206O2782O5862M3900m7076m2288k8333J6382J9131
$$ -58782 -104688 -75453 -84069 -103275 -40493 25369 69269 22193 -20095 -48428 -32046 -12915
14518a2915K9134J8886K2766O8069O2194j6027M5793m1692q3984j9342M0129p2237
$$ -12915 16219 35105 57871 125940 188134 172107 217900 176208 92224 72882 113011 40774
14506D0774l4275N5612J06707l7907p7319K0555K7734m3830p7766L5657J0874
$$ 40774 6499 62111 168818 130911 53592 74147 101881 58051 -19715 15942 26816
14495B6816N3851R075k8810L3452P8609j599p2095p4368m7050K5268L3056R0484
$$ 26816 80667 89742 60932 94384 172993 171394 99299 24931 -22119 3149 36205 126689
14483A26689J10189n093j66615q0591J8990Q706n3034o7386P1362N7813J7568
$$ 126689 236878 231785 65170 -15421 3569 12275 -40759 -108145 -36783 21030 38598
14472C8598K5913J4685m3641M9133R6734k0118k533j9133L1073q360q4409j46447
$$ 38598 64511 79196 35555 84688 181422 161304 158771 139638 170711 162351 77942 -68505
14460f8505j25702j3330Q7930J04681Q1776M2659o5496l7553q158J9087M2623
$$ -68505 -194207 -207537 -119607 -14926 66850 109509 44013 6460 -1698 17389 60012
14449F0012r924j1744P5725M8654J2910q0177Q025q5993N547N8535K2746R283
$$ 60012 50088 38344 114069 162723 175633 95456 103481 17488 23035 81570 104316 113599
14437A13599L633j0222l8343l5215N8455M7459p4329q4548n9797k7016O5982J86060
$$ 113599 117232 107010 68667 33452 91907 139366 65037 -19511 -79308 -106324 -40342 145718
14425A45718K3200j05126n2825R9659P2840m0655n1165l9042Q307Q048J1073n5604
$$ 145718 168918 63792 10967 110626 183466 142811 91646 52604 60911 68959 80032 24428
14413B4428n1768J4815j462J9744Q8006P1880l5120m388l4855j6546R2215O4253
$$ 24428 -27340 -12525 -13987 5757 93763 165643 130523 126135 91280 74734 166949 231202
14401B31202P8659j33512r6794l2139J6341m2523n6076K084N7971j8981J9986
$$ 231202 309861 176349 79555 47416 63757 21234 -34842 -32758 25213 6232 26218
14390B6218O3911k182m1125K638M9223L4459L3722P0088J6106j37029k1153R0596
$$ 26218 90129 87947 46822 49460 98683 133142 166864 236952 253058 116029 94876 185472
14378A85472K2402K839P2351M1066o6821j8926m063j8373K4139k381M170J344
$$ 185472 207874 210713 283064 324130 257309 238383 234320 215947 240086 237705 241875 243219
14366B43219Q1091J03440j5429j7391p1716o5114K5309p3840m9888Q8112L096
$$ 243219 324310 427750 412321 394930 323214 258100 283409 209569 159681 247793 250889
14355B50889m1520M731J7684j8579q2615r9508m714J13944J44117M8987n1558
$$ 250889 209369 214100 231784 213205 130590 31082 26368 140312 284429 333416 281858
14344B81858j01681l6645q3472l4650J5762P4651J21804R8250k3610q9795r9434
$$ 281858 180177 143532 60060 25410 41172 115823 237627 335877 312267 222472 123038
14333A23038l4772P4044J64706L9684o2807j25248o4982K2570q183o3676J4538
$$ 123038 88266 162310 327016 366700 303893 178645 113663 136233 128050 64374 78912
14322G8912K5273L2295l7840j28424j5993j8581O9487N1004J37913J0578l1300
$$ 78912 104185 136480 98640 -29784 -45777 -64358 5129 56133 194046 204624 173324
14311A73324j6730O2684M041N7477j8705q3159l5242Q5151l4998k6892N861M4076
$$ 173324 156594 219278 223319 280796 262091 178932 143690 228841 193843 166951 172812 216888
14299B16888N7225l5004l0633n2454n8708K5951M1836L2630l2985m647N3601L2638
$$ 216888 274113 239109 208476 156022 97314 123265 165101 197731 164746 160099 213700 246338
14287B46338p0663k673L275p6692j1266l1923n6457q716M4677O8941j532m4815
$$ 246338 175675 173002 176277 99585 88319 56396 -61 -8777 35900 104841 103309 58494
14275E8494O0510M4078O6301N0394j5445j30704m0160J54762J8133m3590k68j05873
$$ 58494 119004 163082 229383 279777 264332 133628 93468 248230 266363 222773 222505 116632
14263A16632j0312L5012l1434m3974K698j8845O1569L2932j04662q932R3296Q1564
$$ 116632 106320 141332 109898 65924 68622 49777 111346 144278 39616 30684 123980 205544
14251B05544j7265M4872J40902M1124m3151J8448O5003Q332r200L6906k5186l4038
$$ 205544 188279 233151 374053 415177 372026 390474 455477 463809 454609 491515 466329 432291
14239D32291n1570q4346j35423r3859J6660R5950l9472l0538P0220P0086P05j5395
$$ 432291 380721 296375 160952 67093 83753 179703 140231 109693 179913 249999 250704 235309
14227B35309M1083l4748O774L8899m5571L57M8594M1142j29140r943q5090M7083
$$ 235309 276392 241644 248418 287317 241746 242103 290697 331839 202699 192756 107666 154749
14215A54749R9987N0333J9822l5138r5893L7807M8012m1660L9572m1346k7454
$$ 154749 254736 305069 324891 289753 193860 231667 279679 238019 277591 236245 208791
14204B08791L0917m0831R115m68P0815J51694m8026q4270r908K9041J4888M9442
$$ 208791 239708 198877 207992 207524 278339 430033 382007 297737 287829 316870 331758 381200
14192C81200M6550J8428M9982j8783p8880O4157M8610p4721O6627Q5011M9223
$$ 381200 427750 446178 496160 477377 398497 462654 511264 436543 503170 588181 637404
14181F37404N2739N801N42q2085q228Q0347L6223k0309l5628k2696O3692O9425
$$ 637404 690143 695944 696486 614401 606173 686520 722743 702434 666806 644110 707802 777227
14169G77227J5629K7495O1469R7906m1814l1750l5949O4686J8267J01174J18808
$$ 777227 792856 820351 881820 979726 937912 906162 870213 934899 953166 1054340 1173148
14158A173148Q7935O6758Q2787Q2368R035N3490J43618K17008J16400Q9537Q7926
$$ 1173148 1261083 1327841 1410628 1492996 1502031 1555521 1699139 1916147 2032547 2122084 2210010
14147B210010J33628J69926J37338J47735J15961O0377K68475L12560M15454M65863
$$ 2210010 2343638 2513564 2650902 2798637 2914598 2974975 3243450 3556010 3971464 4437327
14137D437327P53398R14851J144389J629311K060668J971585J521827J361049
$$ 4437327 5190725 6105576 7249965 8879276 10939944 12911529 14433356 15794405
14129A5794405K041517L187861L694174M520313O596265J0230326J6560442K8489783
$$ 15794405 17835922 21023783 24717957 29238270 35834535 46064861 62625303 91115086
14121I1115086M9054664P9412472J14193437J06710969k76618m9091051j1527914
$$ 91115086 140169750 219582222 333775659 440486628 440210010 391118959 379591045
14114C79591045M7368149J8606211r0976352j18428504q9285303n0502920k7313930
$$ 379591045 426959194 445565405 354589053 236160549 146875246 96372326 69058396
14107F9058396j5992051j0202589o972602m913870l694013l146184k809496k104748
$$ 69058396 53066345 42863756 35891154 30977284 27283271 24137087 21327591 19222843
14099A9222843j675895j541504j942378k132544j722407j358515r82970o89070
$$ 19222843 17546948 16005444 14063066 11930522 10208115 8849600 7866630 7177560
14091G177560o93898o73903n69971n12644m26742l05344l11850l60541l61980
$$ 7177560 6483662 5809759 5239788 4727144 4300402 3995058 3683208 3322667 2960687
14082B960687j95703j79933j28203j15161j74079j16300j48338j40297q1239j35669
$$ 2960687 2764984 2585051 2456848 2341687 2167608 2051308 1902970 1762673 1681434 1545765
14072A545765r1p9861l7592j7160n2307o7273m1086L2139K5534n0882j33759j39785
$$ 1545765 1545674 1465813 1428221 1411061 1358754 1291481 1250395 1282534 1308068 1257186 1123427 983642
14060I83642j9144J0897o3302q5715q8891r6721j1529l731M5115j9936J5308l1946
$$ 983642 964498 975395 912093 826378 737487 640766 629237 625506 670621 650685 665993 634047
14048F34047j01652p1839K5181J06505M4465m5618r519N5784R241p3589o1383
$$ 634047 532395 460556 485737 592242 636707 591089 581570 637354 646595 573006 511623
14037E11623n0277O556j540J1445N318K1937k2578k8903O985P2931M5940l6399
$$ 511623 461346 467902 466362 477807 483125 505062 482484 453581 460566 533497 579437 543038
14025E43038l5163n4571O1951R4510Q9020J27263J57203n0458j25206j7310j7788
$$ 543038 507875 453304 515255 609765 698785 826048 983251 932793 807587 790277 772489
14014G72489Q6024Q5289k8177j23730j09557p5980m7586p8116p0743n8020o0973
$$ 772489 858513 943802 915625 791895 682338 606358 558772 480656 409913 351893 290920
14003B90920K2441m8162Q6591J2725j5986k9679R0713Q1089k8056j2878l9083
$$ 290920 313361 265199 351790 364515 348529 318850 409563 490652 462596 449718 410635
13992D10635p1841K9475J9666m2187m6581m9607J7740n5888M410j3783r4525K2492
$$ 410635 338794 368269 387935 345748 299167 249560 267300 211412 215822 202039 107514 130006
13980A30006k6138M2614N8892K2404k3334J4281J6062J4173j5524P1278o2776
$$ 130006 103868 146482 205374 227778 204444 218725 234787 248960 233436 304714 241938
13969B41938Q160K498q03m4239j6531J4648m1752O463q6674j36355M6133K4898
$$ 241938 250098 252596 251793 207554 191023 205671 163919 170382 83708 -52647 -6514 18384
13957A8384N0424R4326r944k949j4789P388n2426J1657K6150J1759m8527k1833
$$ 18384 68808 163134 153190 150241 135452 142840 90414 102071 128221 139980 91453 69620
13945F9620j2670m3726K3463N9934J43259Q7448N7212K0839L0043n033P094p899
$$ 69620 56950 13224 36687 96621 239880 327328 384540 405379 435422 430389 437483 429584
13933D29584J8979J4536r220j76295j01194r8464n6033M9859L7205J4166p3196
$$ 429584 448563 463099 453879 277584 176390 77926 21893 71752 108957 123123 49927
13922D9927k599P7317k2874j08892k2283l2584l7976Q307J0461R6576o480j904
$$ 49927 47328 124645 101771 -7121 -29404 -61988 -99964 -91657 -81196 15380 8900 6996
13910F996J0256k7613k4425L2556m4341j8634P3292N9215K5637o1450p3260r8
$$ 6996 17252 -10361 -34786 -2230 -46571 -65205 8087 67302 92939 31489 -41771 -41869
13898d1869o3779L1758O6278K7244L527J0245j088L1894N7967K06P5731n3008
$$ -41869 -105648 -73890 -7612 19632 23159 33404 32316 64210 122177 122383 198114 145106
13886A45106p620P3779k059j41495l3068L8842o4640M3514O5197M468k335o6514
$$ 145106 137486 211265 209206 67711 34643 73485 8845 52359 117556 122024 119689 53175
13874E3175K9176P551P3864P0911m0599k1449J770j7503L5610o1380o4113M2399
$$ 53175 82351 89902 163766 234677 194078 172629 174399 156896 192506 131126 67013 109412
13862A09412J1296m8005n3100p8629m1336O2081N7055k513L1229M1862j2517K1009
$$ 109412 120708 72703 19603 -59026 -100362 -38281 18774 16261 47490 89352 76835 97844
13850I7844n3671k6921j7335p077P9427j1677m9889j29890m7752P5124J5172o4529
$$ 97844 44173 17252 -83 -7160 72267 60590 10701 -119189 -166941 -91817 -76645 -141174
13838a41174M431Q73N4725J304r707O0169O6464p1309o9164N0650O6002L504Q8747
$$ -141174 -136743 -135870 -81145 -79841 -89548 -29379 37085 -34224 -103388 -52738 13264 16768 105515
13825A05515J3495K85K2575J5084l0896l4732l357k2777r1460n615o4023j35671
$$ 105515 119010 119295 141870 156954 126058 91326 87969 65192 -26268 -31883 -95906 -231577
13813b31577K4915J95190Q915p3757L2760K0109j8803K4253r5131k0707k044l7509
$$ -231577 -206662 -11472 -2557 -76314 -43554 -23445 -42248 -17995 -113126 -133833 -135877 -173386
13801a73386n8974n3466P757R2072J20403R3865O0686k2546m4948p357l9427p157
$$ -173386 -232360 -285826 -278069 -185997 -65594 28271 88957 66411 21463 14106 -25321 -32478
13789c2478l9148j5956L0989J53573L5199l2661k2465n8885r0485m831q995K8355
$$ -32478 -71626 -87582 -56593 96980 132179 99518 77053 18168 -72317 -77148 -86143 -57788
13777e7788L7109L9951m0982m5104p7799M2227N4013l6308k5116K5583m43J17244
$$ -57788 -20679 19272 -21710 -66814 -144613 -102386 -48373 -84681 -109797 -84214 -84657 32587
13765C2587O5278n0409j7056j0578k6307L2104M2669l7521P0690m5551r785j523
$$ 32587 97865 47456 30400 19822 -6485 25619 68288 30767 101457 55906 46121 44598
13753D4598J2063m0284P2309q8876k7800J162K428J8724p120M6521Q8534K4440
$$ 44598 56661 16377 88686 -190 -27990 -26828 -24400 -5676 -12796 33725 122259 146699
13741A46699M380L5406L2577K3648j9466r6434j23064N0081J8008n9998K1929
$$ 146699 151079 186485 219062 242710 223244 126810 3746 53827 71835 11837 33766
13730C3766j06457j7878O9298J6104l5700o4029K5185Q3834Q6438L7664O1450
$$ 33766 -72691 -90569 -21271 -5167 -40867 -104896 -79711 4123 90561 128225 189675
13719A89675o8614k2290p1114N2602L5237n7363p202m9510k9342m4408K695M0871
$$ 189675 121061 98771 27657 80259 115496 58133 50931 1421 -27921 -72329 -69634 -28763
13707b8763O0641M8062Q4046j5567p3314K7929O8561j3339O6821N7508J76902
$$ -28763 31878 79940 163986 148419 75105 103034 171595 158256 225077 282585 459487
13696D59487J41199n2942j4385k0054L4468R055j55768q6631l0908K3972m8548
$$ 459487 600686 547744 533359 513305 547773 556828 401060 314429 283521 307493 258945
13685B58945p2870K8647m3823k1913J8721m2463j39309l0384j075o8640j7138
$$ 258945 186075 214722 170899 148986 167707 125244 -14065 -44449 -45524 -114164 -131302
13674a31302N6050N652n7736j7847M2295M5467Q6409N012n455l630J7869p4740
$$ -131302 -75252 -69600 -127336 -145183 -102888 -57421 28988 34000 28545 24915 42784 -31956
13662c1956j5880J21476J1714r8557m6787J25474K8527j4970l7852j34733k321
$$ -31956 -47836 73640 85354 -13203 -59990 65484 94011 79041 41189 -93544 -95865
13651i5865P5615N5570P2801q545j25132j0327P0556O3414J00707M9020M6595
$$ -95865 -20250 35320 108121 99576 -25556 -35883 34673 98087 198794 247814 294409
13640B94409K6725N2301M5724P4728K15658K99131M82255O06586L19633k17795
$$ 294409 321134 373435 419159 493887 709545 1008676 1490931 2097517 2417150 2199355
13630B199355j49613J30004J36913j42678o10860o03485l44007k62984j64738
$$ 2199355 2049742 2179746 2316659 2173981 1563121 959636 615629 352645 187907
13621A87907m5771L2837l8860j05516m1519J4138p6821L3483J24354M3125L1437
$$ 187907 142136 174973 136113 30597 -10922 3216 -73605 -40122 84232 127357 158794
13610A58794n6948k2418J4925R394r317l6226k8374n3310j1629N0075K5158K5103
$$ 158794 101846 79428 94353 103747 94430 58204 29830 -23480 -35109 14966 40124 65227
13598F5227j7029N8071N4576j6225m7443p7117l1242O1730M8048q1724m611O1139
$$ 65227 48198 106269 160845 144620 97177 20060 -11182 50548 98596 16872 12261 73400
13586G3400j1656J5753p5317J9727j3238K3978J8752j2532q6062R529Q8070k9573
$$ 73400 61744 77497 2180 21907 8669 32647 51399 38867 -47195 -37666 50404 20831
13574B0831j6503J05867n3016K1884J2061P7154m377q4628o2863q4632l6835j2992
$$ 20831 4328 110195 57179 79063 91124 168278 163901 79273 16410 -68222 -105057 -118049
13562a18049N961Q628L6839m0974k2124Q6136k0848J9093m5802k894J343k4063
$$ -118049 -112088 -103460 -66621 -107595 -129719 -43583 -64431 -45338 -91140 -94034 -92691 -116754
13550a16754K2363J04649N7051m1657j7188m2115j1262M9325j6818j7339l087
$$ -116754 -94391 10258 67309 25652 8464 -33651 -44913 4412 -12406 -29745 -32832
13539c2832m3148J919P9078j02791K3816O9520J97M544n5750o2469j3204R5085
$$ -32832 -75980 -74061 5017 -97774 -73958 -4438 -4241 303 -55447 -117916 -131120 -36035
13527c6035N6933P2469Q5721L8658q9635o0343K2660K0115R58J6035k3846m1260
$$ -36035 20898 93367 179088 217746 128111 67768 90428 110543 111501 127536 103690 62430
13515F2430M8603j684k6078j32767n4047K7348j2781J1445j6408J0129J16574
$$ 62430 111033 109349 83271 -49496 -103543 -76195 -88976 -77531 -93939 -83810 32764
13504C2764J5326o1477J09505r5874m4276N4459m2164l7288M6846J04010L2912
$$ 32764 48090 -13387 96118 244 -44032 10427 -31737 -69025 -22179 81831 114743
13493A14743o5700M1053P4301j3685K2156j5657k3594L3349j6108p3597j5303
$$ 114743 49043 90096 164397 150712 172868 157211 133617 166966 150858 77261 61958
13482F1958N4197j8736o3758l904R027m0045R5172m834n5627j7323j3918k8407
$$ 61958 116155 97419 33661 29757 38784 -1261 93911 89077 33450 16127 2209 -26198
13470b6198k4955N8501L1349j6090Q7092n4903m0304n7810k3863J9344n4415m0394
$$ -26198 -51153 7348 38697 22607 109699 54796 14492 -43318 -67181 -47837 -102252 -142646
13458a42646K6584K747R4330Q7261P0007n7781o7533k9173N4959O445J2313L9903
$$ -142646 -116062 -113315 -18985 68276 138283 80502 12969 -16204 38755 45200 57513 97416
13446I7416j1439o4379q2237J1294R8692n796k3060j7362k0807k3811J7450N0222
$$ 97416 85977 21598 -60639 -49345 49347 43551 20491 3129 -17678 -41489 -24039 26183
13434B6183K0188l7204l2784k1533k4188J23972L8587r003l9211K8902K823m9569
$$ 26183 46371 9167 -23617 -45150 -69338 54634 93221 84218 45007 73909 76732 27163
13422B7163K8699J0054m7191r6672K1996N7009Q8736k351J9788M7700K8540J0043
$$ 27163 55862 65916 18725 -77947 -55951 1058 89794 87443 107231 154931 183471 193514
13410A93514N5660p7852p4657J9394l0344p4620o0202j4228P1556Q7499n193p5757
$$ 193514 249174 171322 96665 116059 85715 11095 -49107 -63335 8221 95720 90527 14770
13398A4770K1497l1347m0839Q5120Q0445l1914k05r9110n6111o3445K4062J29664
$$ 14770 36267 4920 -35919 49201 129646 97732 97527 -1583 -57694 -121139 -97077 32587
13386C2587Q5733j6800L5370M183q5772Q796l5741k7338L0484N3173O0450m0689
$$ 32587 118320 101520 136890 141073 55301 64097 28356 1018 31502 84675 145125 104436
13374A04436J6232p9136q5156p7116L3623P4354M0150n9846K3182O0884k8920
$$ 104436 120668 41532 -43624 -120740 -87117 -12763 27387 -32459 -9277 51607 22687
13363B2687Q691Q5184N0237m4490l8240P6573L1166m8163n1154o3850r5894l6784
$$ 22687 31378 116562 166799 122309 84069 160642 191808 143645 92491 28641 -67253 -104037
13351a04037J52315J5935o3280K544j9416k6662O0797M556k781P5413L5846n1268
$$ -104037 48278 64213 933 3477 -15939 -42601 18196 22752 19971 95384 131230 79962
13339G9962m7141k1075L448k5670j0398J18082J83324q7228j18611q1609Q9263
$$ 79962 32821 11746 15194 -10476 -20874 97208 280532 193304 74693 -6916 82347
13328H2347J08279O4238J9634k7329n990p5231L0371O4708J2420o3266j2570m515
$$ 82347 190626 254864 274498 247169 241179 165948 196319 261027 273447 210181 197611 193096
13316A93096j9864K6427j68482P037J31874L9323q2330j645O3803k6973l7868
$$ 193096 173232 199659 31177 38214 170088 209411 127081 125436 189239 162266 124398
13305A24398M870N5349N7608l1092l3296L1638l0225j01595p3982Q961l445l486
$$ 124398 129268 184617 242225 211133 177837 209475 179250 77655 3673 12634 9189 5703
13293E703n5355m0381L5787J40981Q3472K2185r4489o4279o4126M9009k5899J07121
$$ 5703 -49652 -90033 -54246 86735 170207 192392 97903 33624 -30502 18507 -7392 99729
13281I9729K0810m2910P5776K3303J00408j9614k5724j4550N4633P2130k6079
$$ 99729 120539 77629 153405 176708 277116 257502 231778 217228 271861 343991 317912
13270C17912K4842J8260q3001o0905L9374m7944n8012J5034n2305r3953R862P6577
$$ 317912 342754 361014 278013 217108 256482 208538 150526 165560 113255 19302 29164 105741
13258A05741K6985Q8127n4677n4101k8671m2674l0214R080J0766L8194K221j24818
$$ 105741 132726 220853 166176 112075 83404 40730 10516 19596 30362 68556 70777 -54041
13246e4041O8813O6214l1030m5506O7494Q392k258m3966Q5396j7798j5529j09461
$$ -54041 14772 80986 49956 4450 71944 80336 78078 34112 119508 101710 86181 -23280
13234b3280L3117j020M9525n294J6081P8087l7629q2067l0895M3036J25956m5258
$$ -23280 9837 8817 58342 53048 69129 147216 109587 27520 -3375 39661 165617 120359
13222A20359j13277J8747O1836o3243n3861q415K0989q4282J2491M3140j1884
$$ 120359 7082 25829 87665 24422 -29439 -37854 -16865 -101147 -88656 -45516 -57400
13211e7400k4076L7116R4289r572J4429k5043k7058m0774K601J0383P6685N2458
$$ -57400 -81476 -44360 49929 40357 54786 29743 2685 -38089 -35488 -25105 51580 104038
13199A04038J6934M5578J6286j6059m7039k9803k5845L6426P7707l1542R263k2723
$$ 104038 120972 166550 182836 166777 119738 89935 64090 100516 178223 146681 155944 133221
13187A33221R153M3641O3939R6772q8009r3054K6899k3329k2167R3301O2788K7866
$$ 133221 142374 186015 249954 346726 258717 165663 192562 169233 147066 240367 303155 331021
13175C31021N8169M8442n7411q4494m1177j26645p1907k7487K3170l17p3726J1898
$$ 331021 389190 437632 380221 295727 254550 127905 55998 28511 51681 51364 -22362 -10464
13163a0464O4065N8460o727M985L588n6435J8691M5985k0220n2730K876J2340
$$ -10464 53601 112061 105334 110319 113907 57472 76163 122148 101928 49198 52074 64414
13151F4414N5395J5882J48K9082K2223L5282l4561l3994l1383j651k3640k0991
$$ 64414 119809 135691 135839 164921 187144 222426 187865 153871 122488 120837 97197 76206
13139G6206J1794n6139j9724K121n1366J17468K3090l3372o0576n220J0790r4423
$$ 76206 88000 31861 12137 14258 -37108 80360 103450 70078 9502 4282 15072 -79351
13127g9351K039J14609L8315p3084n595J3682M7707O4991L087j8719n1928k4457
$$ -79351 -77312 37297 75612 2528 -3067 10615 58322 123313 126400 107681 55753 31296
13115C1296m9339L9085j1079j3923N7825J25467M0791j09968j20045o2487K7035
$$ 31296 -18043 21042 9963 -3960 53865 179332 220123 110155 -9890 -72377 -45342
13104d5342M7823K6773m7764J526n0218J10767K3189o1266l3690N4057P4248Q3846
$$ -45342 2481 29254 -18510 -16984 -67202 43565 66754 5488 -28202 25855 100103 183949
13092A83949L6783l8217r48M5687o9615j03466K9455q653o7271L9788m3401l0682
$$ 183949 220732 182515 181567 227254 157639 54173 83628 74975 7704 47492 4091 -26591
13080b6591P5272J57453Q7702K4544L9104M8878l9396j11821q1919R027O436q2625
$$ -26591 48681 206134 293836 318380 357484 406362 366966 255145 173226 182253 188689 106064
13068A06064Q0246j3881r547L1043N4390N0717L9132M134l0608J00019N3576k6810
$$ 106064 186310 172429 162882 193925 248315 299032 338164 342298 311690 411709 465285 438475
13056D38475J9123N8307J14970J80405J14076K39691N29768O64983P77852P22534
$$ 438475 457598 515905 630875 811280 925356 1165047 1694815 2359798 3137650 3860184
13046C860184K71299M4193O3420j6327m94574p48713p64506o13912n25426k37274
$$ 3860184 4131483 4175676 4239096 4222769 3728195 2979482 2214976 1601064 1075638 838364
13036H38364q8870p4207j19277r5419K7819J1215o5321k2197k3259q2557j08700
$$ 838364 749494 675287 556010 460591 488410 499625 434304 412107 388848 306291 197591
13025A97591M5218j7528m4559P65N6805Q2177J55478n0863p8023m7595n6396q908
$$ 197591 242809 225281 180722 181487 238292 320469 475947 425084 347061 299466 243070 234162
13013B34162J1309j08084r4709j5769O90j1410M9294K9855J8187P8991L5712r638
$$ 234162 245471 137387 42678 26909 27599 16189 65483 95338 113525 192516 228228 218590
13001B18590M3780p8789r1610o605o5060j2010O2977N6318j6535k7927J5883M2105
$$ 218590 262370 183581 91971 85366 20306 8296 71273 127591 111056 83129 99012 141117
12989A41117O5734O4186N1426J3170k2016J0577j20063m9543J8034p1261m0963
$$ 141117 206851 271037 322463 335633 313617 324194 204131 154588 172622 101361 60398
12978F0398j6227Q15j2360j6213j6379R819J0508j5784P3183M8724k3539k1375
$$ 60398 44171 44986 32626 16413 34 9853 20361 4577 77760 126484 102945 81570
12966H1570p7026n9909M4954L0357k157l5203M7776Q0273Q8045M2123j5628O891
$$ 81570 4544 -55365 -10411 19946 17789 -17414 30362 110635 198680 240803 225175 232066
12954B32066q7740p5826N7328k3327k7668m2787o8818N51M9167J6297J7607l8104
$$ 232066 144326 68500 125828 102501 74833 32046 -36772 -36221 12946 29243 46850 8746
12942H746K3294N0989j1719j07559J4711R6633m4621k321K8557j4517J2356M163
$$ 8746 32040 83029 71310 -36249 -21538 75095 30474 28153 56710 42193 54549 58712
12930E8712N72n0113n7563J1110O5449M8215J1566j8282n0460K6821J34527P0119
$$ 58712 59284 9171 -48392 -37282 28167 76382 87948 69666 19206 46027 180554 250673
12918B50673o3101r3411k5444M1739j102k815M466P1847K8536k3104k3169k9443
$$ 250673 187572 94161 68717 110456 109354 106539 111005 182852 211388 188284 165115 135672
12906A35672q4531n835J4138J53665l179p810J23663J17652m220o2695m7047o0122
$$ 135672 51141 45306 59444 213109 209930 202120 325783 443435 439215 376520 329473 269351
12894B69351k3609m080K4947P8311J11384L6808J3148N6150J23229l6807L354
$$ 269351 245742 241662 266609 344920 456304 493112 506260 562410 685639 648832 652186
12883F52186J12060J85631K14222K38637J53819J11433J66376K22201L48161M92167
$$ 652186 764246 949877 1164099 1402736 1556555 1667988 1834364 2056565 2404726 2896893
12873B896893N93105P75252J182224J913178K932560M192979N082007M637626
$$ 2896893 3489998 4265250 5447474 7360652 10293212 14486191 19568198 24205824
12865B4205824K006643l17630k10016L58655r97531l766682n068954m605994l161991
$$ 24205824 26212467 25894837 25684821 26043476 25045945 21279263 16210309 11604315 8442324
12856H442324k079008j440175q97587o33213m95955l90578k48373j71359j51721
$$ 8442324 6363316 4923141 4025554 3392341 2896386 2505808 2257435 2086076 1934355
12847A934355j65189j46792j84210p7302j67018k37335j19097o920r8463j04358
$$ 1934355 1769166 1622374 1438164 1360862 1193844 956509 837412 830492 732029 627671
12837F27671j01476K4593J0735j3535l049q5047k4617k302r5375J6343k890n1307
$$ 627671 526195 550788 561523 547988 544939 459892 435275 432973 337598 353941 351051 299744
12825B99744M7499l1739n738O9220p236m5307K6087K692m004N1788n6770n0181
$$ 299744 347243 315504 309766 378986 371750 326443 352530 355222 351218 403006 346236 296055
12813B96055m3351L0744p1933j49539j3061j12013r246J13948M3272K4129L8229
$$ 296055 252704 283448 211515 61976 48915 -63098 -72344 41604 84876 109005 147234
12802A47234J6751o5385j593K7967N1166n5155J2485N1313k43p2436j12077k4475
$$ 147234 163985 98600 97007 124974 176140 120985 133470 184783 184540 112104 27 -24448
12790b4448Q296R0183M1769K2410m6462J4885Q3256L1954K9088P7453Q3671l1304
$$ -24448 -16152 74031 115800 138210 91748 106633 189889 221843 250931 328384 412055 380751
12778C80751J7294J55639J8055q2474k6709m3945p9950q6547j290j03442k4817
$$ 380751 398045 553684 571739 489265 462556 418611 338661 252114 250824 147382 122565
12767A22565J8510j4457j323M8371o1441m2548N9372o655J3277n8968m5491K8561
$$ 122565 141075 126618 125295 173666 112225 69677 129049 122394 135671 76703 31212 59773
12755E9773P7254M5939L2207l3159l8629m4080P5463J13864N5175k0823j19566
$$ 59773 137027 182966 215173 182014 143385 99305 174768 288632 343807 322984 203418
12744B03418o8980R1783k4144l8582n3629p8971m1134N19L8966M3053M5050O6315
$$ 203418 134438 226221 202077 163495 109866 30895 -10239 -9720 29246 72299 117349 183664
12732A83664j0419j3843l023Q4964L6580p3505O80l491L3648j41p352J12750o084
$$ 183664 173245 159402 156379 241343 277923 204418 205098 201607 235255 235114 227762 340512 334428
12719C34428r2592Q9728R6189K13464J36683K99442L60377L83741M42418K75044
$$ 334428 241836 331564 427753 641217 777900 1077342 1437719 1821460 2263878 2538922
12709B538922q4018j62181p9902j58034k62593l54389m63948j99305m2769j55839
$$ 2538922 2454904 2292723 2212821 2054787 1792194 1437805 973857 774552 731783 575944
12699E75944r4072j17548L891m6231q9562M0050l5925j09091r8826N78J3205o1872
$$ 575944 481872 364324 368215 321984 232422 272472 236547 127456 28630 29208 42413 -19459
12687a9459J3725M9135N1854K2669J3838k7567M1784M2904q9714q4558j11561
$$ -19459 -5734 43401 95255 117924 131762 104195 145979 188883 99169 14611 -96950
12676i6950j9324Q0716P9157N6458N4267j8371q8678j4883k3132j8720j0146n314
$$ -96950 -116274 -35558 43599 100057 154324 135953 47275 32392 9260 -9460 -19606 -24920
12664b4920O6071N0992j7609j2889M231l2706q6054l7374l3364k1418J10000P4991
$$ -24920 41151 92143 74534 61645 65876 33170 -52884 -90258 -123622 -145040 -35040 39951
12652C9951n2823M0788N3548K3722k1122K5342M6379k2599j14590J6968L2418
$$ 39951 -12872 27916 81464 105186 84064 109406 155785 133186 18596 35564 67982
12641F7982O2817M5135R175k1728J1466o0160k0883J4603J27881J7791q9081o6607
$$ 67982 130799 175934 185109 163381 174847 114687 93804 108407 236288 254079 164998 98391
12629I8391j4642j18220r802L807J6890J7551l2859M4116N8216r547k6101M791
$$ 98391 83749 -34471 -44273 -40466 -23576 -6025 -38884 5232 63448 53901 27800 32591
12617C2591L8535N6790m6743m9847p4991l6952R0357k7932N8031L3299Q3025n3854
$$ 32591 71126 127916 81173 31326 -43665 -80617 9740 -18192 39839 73138 156163 102309
12605A02309j8714K7998m6171j43314M83Q6101N3917L795n205P5954n070m785
$$ 102309 83595 111593 65422 -77892 -77409 8692 62609 66404 61199 137153 132083 127298
12593A27298k9040o0202N070O4514K4634J8888k5809m8607m5017m813r8088j9404
$$ 127298 98258 38056 43126 107640 132274 151162 125353 76746 31729 26916 -71172 -90576
12581i0576R3130j0383l606j0488n6414L6172j347J107K1251Q0512l3691K0884
$$ -90576 2554 -7829 -11435 -21923 -78337 -42165 -43512 -42405 -21154 59358 25667 46551
12569D6551L456l2859L2446K7595k2292P1328K3606k0261j4905q9514j6253q912
$$ 46551 50007 17148 49594 77189 54897 126225 149831 129570 114665 25151 8898 -14
12557a4M0566P8777m8441k4573l976j4063r739J653L7887O5253r679l2407O9372
$$ -14 40552 119329 70888 46315 42339 28276 18537 20190 58077 123330 113651 81244 150616
12544A50616j4659k3808O620O7756m9391j28620k1289J0746J6562k269O2723j4100
$$ 150616 135957 112149 118769 186525 137134 8514 -12775 -2029 14533 12264 74987 60887
12532F0887K5740M4960M6615k0788r9869j3983L5706K6687K223k1580O3177J00110
$$ 60887 86627 131587 178202 157414 57545 43562 79268 105955 108178 86598 149775 249885
12520B49885p5541j7948P8136k3142k5623m0101j24054r7672q503J4448K5199
$$ 249885 174344 156396 234532 211390 185767 145666 21612 -76060 -84563 -70115 -44916
12509d4916N0266K7697N9567K4748J0485k2555j5627p3054j04426L2157Q0080
$$ -44916 5350 33047 92614 117362 127847 105292 89665 16611 -87815 -55658 24422
12498B4422N0367o8578M231R4893J3740l0435L135l6501O2258J6753j8746r6153
$$ 24422 74789 6211 10442 105335 119075 88640 91775 55274 117532 134285 115539 19386
12486A9386o9121M7686J3769K5423Q9228k0688K8567M7237l9667j07666K1684
$$ 19386 -49735 -2049 11720 37143 126371 105683 134250 181487 141820 34154 55838
12475E5838K2956k3729j8864o879m5727q1484q1354P996M9721K1738l8332m0503
$$ 55838 78794 55065 36201 29322 -16405 -97889 -179243 -171247 -121526 -99788 -138120 -178623
12463a78623O5153K2012O717K3036N3515P05o5858L4998O056O3881O1913M5910
$$ -178623 -113470 -91458 -84741 -61705 -8190 -7485 -73343 -38345 -32289 31592 93505 139415
12451A39415l1738l6706J15952Q971M8518N4937K7553j03196k1523r6688p7878
$$ 139415 107677 70971 186923 195894 244412 299349 326902 223706 202183 105495 27617
12440B7617K9650L7250k3328J3224k9919j03312J2061L4288M1440P6047o1607
$$ 27617 57267 94517 71189 84413 54494 -48818 -36757 -2469 38971 115018 53411
12429E3411r9580N7973J07987R577j7908M5885L0671m1146m9211j1892K8128L9128
$$ 53411 -46169 11804 119791 129368 111460 157345 188016 146870 97659 85767 113895 153023
12417A53023Q1198R6535j15992m86j3575m582J3555j3352k7332r823L0586K7546
$$ 153023 234221 330756 214764 214278 200703 196121 209676 196324 168992 159169 189755 217301
12405B17301J06363K6499L0553M8898J7621j05157j62837j04181J2568k0647K1731
$$ 217301 323664 350163 380716 429614 447235 342078 179241 75060 87628 66981 88712
12394H8712L9048o3669r9801l2004L6101K9639N6406k6726m826P6137L2617N6569
$$ 88712 127760 64091 -35710 -67714 -31613 -1974 54432 27706 22880 99017 131634 188203
12382A88203K058q6819K7010Q4600j7131q3787j5004j5531L487l9066N2220J04598
$$ 188203 190261 103442 130452 215052 197921 114134 99130 83599 87086 48020 100240 204838
12370B04838l5040m7075j0746K8046L5406J2753L956J2470L7517m7314J03378
$$ 204838 169798 122723 111977 140023 175429 188182 192138 204608 242125 194811 298189
12359B98189O4811p0349o1175L4723n2823j42745L770k0505K2412j5215p2728
$$ 298189 363000 292651 231476 266199 213376 70631 74401 53896 76308 61093 -11635
12348a1635J4251J23246j21571n7125p9342j6560O4822N8001k2041k4971K1018
$$ -11635 2616 125862 4291 -52834 -132176 -148736 -83914 -25913 -47954 -72925 -51907
12337e1907M0816Q9614M3049M435l5483n8384n4566n6179J8784M0814Q423r4834
$$ -51907 -11091 78523 121572 126007 90524 32140 -22426 -78605 -59821 -19007 -10584 -105418
12325a05418o0611J09119P4893P2712Q5875n036k1637o1661m3763p7985Q683M5635
$$ -105418 -166029 -56910 17983 90695 176570 171534 149897 88236 44473 -33512 -24829 20806
12313B0806k7288q8K1569o485k0365o842n222L4888R3384l9884m9046L3380k3662
$$ 20806 -6482 -6570 14999 8514 -11851 -18693 -23915 10973 104357 64473 15427 48807 25145
12300B5145j7707n097P8009k2148J916Q94k5651O4377P7116P8861j6714p5233
$$ 25145 7438 2341 80350 58202 60118 61012 35361 99738 176854 255715 239001 163768
12288A63768m1339r2029k2827K2958P2185J4840j43213J0296J7653m3226l5420
$$ 163768 122429 30400 7573 30531 102716 117556 -25657 -15361 2292 -40934 -76354
12277g6354R3980N6289k7625o975P306l1441Q5267k0159j1015L7468q696j8395
$$ -76354 17626 73915 46290 39315 46621 15180 100447 80288 69273 106741 98045 79650
12265G9650p321n8166L608q0506R4237P3544o3843j7339j0537j9772l2782M001
$$ 79650 72329 14163 17771 -62735 31502 105046 41203 23864 13327 -6445 -39227 -35226
12253c5226N2288k631O4158M4735J1850L3242k8961N4922j4904M5363K1242j7833
$$ -35226 17062 14431 78589 123324 135174 168416 139455 194377 179473 224836 246078 228245
12241B28245m8672K79J06356p0972p9780L6000n4808K1894j3853p1784N626K3501
$$ 228245 179573 179852 286208 215236 135456 171456 116648 138542 124689 52905 58531 82032
12229H2032L1704L1206P1617L4943n8290k7015K9942l509p9890K2973L5302m3103
$$ 82032 113736 144942 216559 251502 193212 166197 196139 192630 112740 135713 171015 127912
12217A27912k9711R395m8961M9588n6948J7511N3576q7516n3363M0057j8990m6765
$$ 127912 98201 107596 58635 108223 51275 68786 122362 34846 -18517 21540 2550 -44215
12205d4215K8483n72P7044Q0201Q233L6585o7292m0668L9363L9416k7079m7305
$$ -44215 -15732 -16304 60740 140941 149174 185759 118467 77799 117162 156578 129499 82194
12193H2194k7007M309j1592n3359J6173k5836O6510R3760k5547L1712N0908M898
$$ 82194 55187 59496 47904 -5455 10718 -15118 51392 145152 119605 151317 202225 207123
12181B07123m2838n0435m5599L7279J2999R4312J0275k3223J23929J9440m477
$$ 207123 164285 113850 68251 105530 118529 212841 223116 199893 323822 343262 338785
12170C38785Q3979P6525J30291N8997J44247K66886J90101J59701L78235M67696
$$ 338785 422764 499289 629580 688577 832824 1099710 1289811 1449512 1827747 2295443
12160B295443N79660N58869O63409O70785M83280L91047Q4844k91277n44098o37698
$$ 2295443 2875103 3433972 4097381 4768166 5251446 5642493 5727337 5436060 4891962 4254264
12150D254264o15533m07487m33958l94374k69972j94378j59336j18786l3255l5848
$$ 4254264 3638731 3231244 2797286 2402912 2132940 1938562 1779226 1660440 1627185 1591337
12140A591337l2457K6727l1971L1609L2236Q2672J34847Q6406N4902J95016K47583
$$ 1591337 1558880 1585607 1553636 1585245 1617481 1700153 1835000 1921406 1976308 2171324 2418907
12129B418907L21306M04830L91292M79583N37296L87084K26065N4348j32223l64651
$$ 2418907 2740213 3145043 3536335 4015918 4553214 4940298 5166363 5220711 5088488 4723837
12119D723837n92536o92395o43240o06418m63476l00771j87361j95148k02319
$$ 4723837 4131301 3438906 2795666 2189248 1725772 1425001 1237640 1042492 840173
12110H40173j22359k2496J5693j32380r6410M3693k8469o3121M6747O6817q6524
$$ 840173 717814 695318 711011 578631 482221 525914 497445 434324 481071 547888 461364
12099D61364q0456n0402M0657N5106Q8386Q6409R8185J85094K08501M00863M81449
$$ 461364 380908 330506 371163 426269 514655 601064 699249 884343 1092844 1493707 1975156
12088A975156N52866N77604K1927m91902o75200n10434l84492k60825k22645q9352
$$ 1975156 2528022 3105626 3127553 2635651 1960451 1450017 1065525 804700 582055 492703
12078D92703j19825j31185P1319l407l1749m161l8739k0126L7794P0410j2130
$$ 492703 372878 241693 313012 309605 277856 273695 234956 214830 252624 323034 310904
12067C10904m7075r3559j42031m3691L5187L654J9265M3215M4706L1135J4591
$$ 310904 263829 170270 28239 -15452 19735 23389 42654 85869 130575 161710 176301
12056A76301k8128j6256k3198K2416N9680n5732p2985P232P074p755q5583n244
$$ 176301 148173 131917 108719 131135 190815 135083 62098 69330 76404 68649 -16934 -22178
12044b2178M727k0015L6508J9681m5528k4089k0368l6438K3305k1419J500Q8281
$$ -22178 -17451 -37466 -958 18723 -26805 -50894 -71262 -107700 -84395 -105814 -104314 -16033
12032a6033N220l1252N2347L5424J05784p2843q7112l7363k752J35844L6252l8743
$$ -16033 -10813 -42065 10282 45706 151490 78647 -8465 -45828 -48580 87264 123516 84773
12020H4773J0649l7604m9305q9254J4768N0204q284k6509J8046J0643P8509p016
$$ 84773 95422 57818 8513 -80741 -65973 -15769 -24053 -50562 -32516 -21873 56636 49620
12008D9620J7869J6634j04103j1102J1188J3738J1854l5975m6664l988K2649m1311
$$ 49620 67489 84123 -19980 -31082 -19894 -6156 5698 -30277 -76941 -80929 -58280 -99591
11996i9591M9652M0135L9646n4620o252n4246M4274O9643l5252k8025j3873P4193
$$ -99591 -49939 -9804 29842 -24778 -31030 -85276 -41002 28641 -6611 -34636 -48509 25684
11984B5684K8644O665M1944p0372j9373L7712k9016O1655J6807q228O6798J7742
$$ 25684 54328 60993 102937 32565 13192 50904 21888 83543 100350 92122 158920 176662
11972A76662j30985j16899m3133J6820K7404J4163l8790l5930J1101j6564M2032
$$ 176662 45677 -71222 -114355 -97535 -70131 -55968 -94758 -130688 -119587 -136151 -94119
11961i4119L1883J9882j3200l7677O7057O2353J05582m6055q5839n3798R059R016
$$ -94119 -62236 -42354 -55554 -93231 -26174 36179 141761 95706 9867 -43931 -34872 -25856
11949b5856m7129K3600N6237j5148L482O0169K8435j0919j3190k3186O7984O3764
$$ -25856 -72985 -49385 6852 -8296 -4814 55355 83790 72871 59681 36495 104479 168243
11937A68243m9101j9521O2361l6991j10432k8098o137K5766n0969l1962l1418
$$ 168243 119142 99621 161982 124991 14559 -13539 -19676 6090 -44879 -76841 -108259
11926a08259M6612N6220J00487l7195l2291k7459l3162k6174l0277N7676N5390
$$ -108259 -61647 -5427 95060 57865 25574 -1885 -35047 -61221 -91498 -33822 21568
11915B1568l1061K4891p631k3849K4305L1265k3266p9757p648L7063j2938o7727
$$ 21568 -9493 15398 7767 -16082 8223 39488 16222 -63535 -71183 -34120 -47058 -114785
11903a14785Q2580N4159M1714L4111n0809m8760r7695R77N385m0691K4240J1819
$$ -114785 -32205 21954 63668 97779 46970 -1790 -99485 -98508 -93123 -133814 -109574 -97755
11891i7755n206K9617m960J01600J02399K964m3365o7187o253R6019P5763k0916
$$ -97755 -102961 -73344 -78304 23296 125695 128659 85294 18107 11854 107873 183636 162720
11879A62720k7686m0155J8498k8003n8155j2002n6389J9762r867n4778n3649P3449
$$ 162720 135034 94879 113377 85374 27219 15217 -41172 -21410 -31277 -86055 -139704 -66255
11867f6255K4505m8560K3413N8711P0240K239j18707Q654n4664M8618j6457l9584
$$ -66255 -41750 -90310 -66897 -8186 62054 64293 -54414 -45760 -100424 -51806 -68263 -107847
11855a07847L9304O4503Q387L7687p2789l5362l0662M6168M5167L5223o6154o401
$$ -107847 -68543 -4040 4347 42034 -30755 -66117 -96779 -50611 -5444 29779 -36375 -42776
11843d2776j8017K7619K2394P551k2506N0206l3778j31663M6561L6947j302P2032
$$ -42776 -60793 -33174 -10780 -3229 -25735 24471 -9307 -140970 -94409 -57462 -58764 13268
11831A3268o43K7059L7313M259p0604P9112k630q1998O23n4776P3448N951m2796
$$ 13268 12625 39684 76997 81256 10652 89764 87134 5136 5759 -49017 24431 30382 -12414
11818a2414j2110k4242K3579O5915R0267j0585o5479j37274m2140O7204M3357
$$ -12414 -24524 -48766 -25187 40728 130995 120410 54931 -82343 -124483 -57279 -13922
11807a3922M8094M6207l0455p4412j1078l7063l011j3793J6306O872J4170l4569
$$ -13922 34172 80379 49924 -24488 -35566 -72629 -75640 -89433 -73127 -66255 -52085 -86654
11795h6654j1851P3736P7274k9892n1M491n8307m9848j9991m2972r0136j1186
$$ -86654 -98505 -24769 52505 22613 22562 27053 -31254 -81102 -101093 -144065 -234201 -245387
11783b45387J58396J17050l7206L2665j543LK1940l8257j0790n8509j01007m1060
$$ -245387 -86991 30059 -7147 25518 23975 23978 45918 7661 -3129 -61638 -162645 -203705
11771b03705K3181k6266l9572L2874J14346J6764M0336Q5689N5643k1180L2510
$$ -203705 -180524 -206790 -246362 -213488 -99142 -82378 -42042 43647 99290 78110 110620
11760A10620k1772j19925J5929o7j8045m3425q058M8183J1934J1320k5630M4251
$$ 110620 88848 -31077 -15148 -15215 -33260 -76685 -84743 -36560 -24626 -13306 -38936 5315
11748E315J3885K5178q429o1315n3092K0048P7913K2064J9573J04034L979l0522
$$ 5315 19200 44378 35949 -25366 -78458 -58410 19503 41567 61140 165174 169153 138631
11736A38631j22230j05352k5808P7196P2175n1241p6934M6779P7595m2027k2216
$$ 138631 16401 -88951 -114759 -37563 34612 -16629 -93563 -46784 30811 -11216 -33432
11725c3432l4726P919J5000M7899M6764l7439r144K0606O0883k4708j07106R70
$$ -33432 -68158 -60239 -45239 2660 49424 11985 2841 23447 84330 59622 -47484 -46514
11713d6514J24849J0101l0341K5050n878n4510K9522L5914k2948p2995l0578J6398
$$ -46514 78335 88436 58095 83145 77267 22757 52279 88193 65245 -7750 -38328 -21930
11701b1930k2554o4691m0109N4912K6983M1116O4820L7382n936r6473l5844q455
$$ -21930 -44484 -109175 -149284 -94372 -67389 -26273 38547 75929 69993 -26480 -62324 -70779
11689g0779N3253O3783J00920J9958q0268j14248L2133O882m977O0618k1807k0792
$$ -70779 -17526 46257 147177 167135 86867 -27381 4752 11634 6657 67275 45468 24676
11677B4676O4116j3226l9378k1235m5498L1541k1562J0143q81O20P7494L5955
$$ 24676 88792 75566 36188 14953 -30545 996 -20566 -10423 -11304 -10684 66810 102765
11665A02765j26390l0152J28936N4950R550p9421m7878m1803J0498K772P1545
$$ 102765 -23625 -53777 75159 130109 139659 60238 12360 -29443 -18945 -16173 55372
11654E5372K2977j43465q3598l2685j511J11506L1133p294J4029L8877J14125
$$ 55372 78349 -65116 -148714 -181399 -182910 -71404 -40271 -47565 -33536 5341 119466
11643A19466J0060n7426o6967N2085P8468j5305p1468k2362L8441O0190O1355
$$ 119466 129526 72100 5133 57218 135686 120381 48913 26551 64992 125182 186537
11632A86537p625j1858m3521r2922o9573L2337K5722r0920m1085Q9164J01582
$$ 186537 178912 167054 123533 30611 -38962 -6625 19097 -71823 -112908 -23744 77838
11621G7838j6975l6415j1979O5209l1931m3457L1868j442k1993J0162L2340M2446
$$ 77838 60863 24448 12469 77678 45747 2290 34158 32716 10723 20885 53225 95671
11609I5671j3307m1152o1130l7292L8516k5789Q5054P6667m3080j7217j0624J9032
$$ 95671 82364 41212 -19918 -57210 -18694 -44483 40571 117238 74158 56941 46317 65349
11597F5349L263o8643o6247P5259O8853l6426m5624L3731m147q716p1982l6328
$$ 65349 68612 -31 -66278 8981 77834 41408 -4216 29515 25368 16652 -55330 -91658
11585i1658j8697m4733R8963M2578r04j184l9802j3380M3220K7319m5801M221
$$ -91658 -110355 -155088 -56125 -13547 -14451 -15635 -55437 -68817 -25597 1722 -44079 -39858
11573c9858K3036M1861l6952j6191k1363o1404l6054J9927M7380M0350M5055j1432
$$ -39858 -16822 25039 -11913 -28104 -49467 -110871 -146925 -126998 -79618 -39268 5787 -5645
11561e645j4017p5611o4271k2932R2224M3125J3506m3843k3149p7357m5610J15214
$$ -5645 -19662 -95273 -159544 -182476 -90252 -47127 -33621 -77464 -100613 -177970 -223580 -108366
11549a08366M3696r4916Q288J00370K2438j3467q4316r622K6489J20182J00370
$$ -108366 -64670 -159586 -151298 -50928 -28490 -41957 -126273 -135895 -109406 10776 111146
11538A11146m9319J2188p5361j774k1M6408N713o448L0011K4473p0918N748m0347
$$ 111146 61827 74015 -1346 -3120 -3141 43267 48980 42532 72543 97016 26098 31846 -8501
11525h501L4802M4661k8790p7J6198O209K4657L6848M8069q3009l9590J5077n0425
$$ -8501 26301 70962 42172 42095 58293 64502 89159 126007 174076 91067 51477 66554 16129
11512A6129n8852j8853k3486p2713P4478r989p898N9024K6091m5909r019K9843
$$ 16129 -42723 -61576 -85062 -157775 -83297 -93286 -101184 -42160 -16069 -61978 -70997 -41154
11500d1154k4202k1265Q9923M5861m0062J1786J6535K3303p4229j0441p164j1674
$$ -41154 -65356 -86621 3302 49163 9101 20887 37422 60725 -13504 -23945 -31109 -42783
11488d2783K3521Q231L1133R96j9419q3682o3836k8978R0321J15910n3106j6756
$$ -42783 -19262 -11031 20102 21098 1679 -82003 -145839 -174817 -84496 31414 -21692 -38448
11476c8448J10673J09505N883q8910N6531o78o8452r1021q0411O656k945R178
$$ -38448 72225 181730 187613 98703 155234 154556 86104 -4917 -85328 -78672 -81617 -72439
11464g2439l7580l2542K0755J03803j2436p0996M4032K6884l635l6752m0074J4426
$$ -72439 -110019 -142561 -121806 -18003 -30439 -101435 -57403 -30519 -34154 -70906 -110980 -96554
11452i6554m254O4507N3800j0943O0831N5479k9523p3862o6831m7720M3098P0995
$$ -96554 -100808 -36301 17499 6556 67387 122866 93343 19481 -47350 -95070 -51972 19023
11440A9023O3108L2193j1856j14374q5899R0686K8360j5255K3603K7106L5416
$$ 19023 82131 114324 102468 -11906 -97805 -7119 21241 5986 29589 56695 92111
11429I2111k0902m6749m1957L506j4508O575O6476N306j8311j9613o716L4633
$$ 92111 71209 24460 -17497 -13991 -28499 -21924 44552 49858 31547 11934 5218 39851
11417C9851j0406m5316o214N249o581L0563J23335j104r0m3097J3418k1965o2407
$$ 39851 29445 -15871 -22085 -16836 -23417 7146 130481 129377 129287 86190 99608 77643 15236
11404A5236O0309m6095o9411n0142O436L249L1914J9284k488L2365q0080J9346
$$ 15236 75545 29450 -39961 -90103 -83667 -80418 -48504 -29220 -31708 657 -79423 -60077
11392f0077N0763P1321K629k8763R964J0282n8657n9383O7862N6708O1884l5918
$$ -60077 -9314 62007 64636 35873 45837 56119 -2538 -61921 5941 62649 124533 88615
11380H8615j17123m7542M0548M404l3528n6822l8711K4861R5591M6748n8996l1574
$$ 88615 -28508 -76050 -35502 -31098 -64626 -121448 -160159 -135298 -39707 7041 -51955 -83529
11368h3529Q562J5941m4278N4127M0208j11202o2335N2852O3842n921J5377m4207
$$ -83529 -74967 -59026 -103304 -49177 -8969 -120171 -182506 -129654 -65812 -71733 -56356 -100563
11356a00563J5058J02920k3294j2486m3070j2227j4280L7027L5234j08257r846
$$ -100563 -85505 17415 -5879 -18365 -61435 -73662 -87942 -50915 -15681 -123938 -133784
11345a33784J27248N1075q7663N0006M700N965o8107l3423P7491n4638o9767o2454
$$ -133784 -6536 44539 -43124 6882 11582 17547 -50560 -83983 -6492 -61130 -130897 -193351
11333a93351n8927Q8305O5672O4311j1810l619P2443K092J550o3644q0500J5428
$$ -193351 -252278 -163973 -98301 -33990 -45800 -49419 23024 25116 26666 -36978 -117478 -102050
11321a02050m8071J17990J02821Q962j70576p2711Q5498R315k4829l783M4637
$$ -102050 -150121 -32131 70690 79652 -90924 -163635 -78137 -68822 -93651 -97434 -52797
11310e2797j504j7064M8837J6281r0899n3437J01892L7644n4536r251j610q8245
$$ -52797 -54301 -71365 -22528 -6247 -97146 -150583 -48691 -11047 -65583 -74834 -76444 -164689
11298a64689J1040l7023l3082k9487L055N9281P5322J3107O70N2685O393m3922
$$ -164689 -153649 -190672 -223754 -253241 -250186 -190905 -115583 -102476 -101806 -49121 -42728 -86650
11286h6650n6794j3284P388j7415M3603N2880n1532j38n5793J10853K7255L0300
$$ -86650 -143444 -156728 -149340 -166755 -123152 -70272 -121804 -121942 -177735 -66882 -39627 -9327
11274i327P548n0007P5338p6895o7285R298P3711K2129J6792q9883j8952J7362
$$ -9327 -1779 -51786 23552 -53343 -120628 -111330 -37619 -15490 1302 -88581 -107533 -90171
11262i0171J7195O0345M3010P0699k973j01393p1490o3515r736O70Q72O7465J8939
$$ -90171 -72976 -12631 30379 101078 98105 -3288 -74778 -138293 -148029 -147359 -146487 -79022 -60083
11249f0083m7214r574Q235K9899l2113L044n378N3795N7513j2232k1631n2627
$$ -60083 -107297 -116871 -108636 -78737 -110850 -107806 -113184 -59389 -1876 -14108 -35739 -88366
11237h8366O0011O9693l4050o2492l7466j9j6545N0316l7194l1235Q040J9563
$$ -88366 -28355 41338 7288 -55204 -92670 -92689 -109234 -58918 -96112 -127347 -119307 -99744
11225i9744J19948N4236M133p538j9702j3436m4981n7886K7397k8403o0532N5922
$$ -99744 20204 74440 78573 71035 51333 37897 -7084 -64970 -37573 -65976 -126508 -70586
11213g0586J7800l95J6220M7492M2234l2022j18548k738L9414N659q0315l6879
$$ -70586 -52786 -53181 -36961 10531 52765 20743 -97805 -100543 -61129 -55470 -135785 -172664
11201a72664O8671K9133M6612O9401J8897k5986O4854j26956p6365O602n1892
$$ -172664 -103993 -74860 -28248 41153 60050 34064 98918 -28038 -104403 -97801 -149693
11190a49693J1866O2019m4543L745K4206J7095l7047o9394R3833M6407n5624M4151
$$ -149693 -137827 -75808 -120351 -116606 -92400 -75305 -112352 -181746 -87913 -41506 -97130 -52979
11178e2979j7990J356Q7895N1431l4800k7723O577K835L1722J01147N4020p4822
$$ -52979 -70969 -69613 18282 69713 34913 7190 13767 16602 48324 149471 203491 128669
11166A28669j30440j12593P4066J35325K8736r2419r7678N3493O0063r7589m3565
$$ 128669 -1771 -114364 -40298 95027 123763 31344 -66334 -12841 47222 -50367 -93932
11155i3932J5641K7218K9360J0130O639k9558L5867N0955n4929r0193L868L0693
$$ -93932 -78291 -51073 -21713 -11583 -4944 -34502 1365 52320 -2609 -92802 -88934 -58241
11143e8241J7702M6323m118k4058m9001k7563L0652R8560J9998P1012p474r277
$$ -58241 -40539 5784 1666 -22392 -71393 -98956 -68304 30256 50254 121266 113792 104515
11131A04515k0643j7449K6337k3535j1320m0562J2990K7444k5965l0952k3927
$$ 104515 83872 66423 92760 69225 57905 17343 30333 57777 31812 860 -23067
11120b3067k3161o3121M520K5873R7552J3755m5038j11856k1107j3363J9877P8784
$$ -23067 -46228 -109349 -104829 -78956 18596 32351 -12687 -124543 -145650 -159013 -139136 -60352
11108f0352K0606l6026o408J7005N5965N2282p0845k672L5301R827K655O0848
$$ -60352 -39746 -75772 -82180 -65175 -9210 43072 -27773 -30445 4856 14683 17338 78186
11096G8186K7764n552j6714M306K8672l913p4407p7792o3683j7868J1689N0454
$$ 78186 105950 100398 83684 87990 116662 112749 38342 -39450 -103133 -121001 -109312 -58858
11084e8858Q1268O8348J1426r9662j5131J5982m2246M517n80l225Q2072K6785
$$ -58858 22410 90758 102184 2522 -12609 3373 -38873 -34356 -34936 -38161 43911 70696
11072G0696p417m1964J6443l9300n4183O213O2573L3345m2408l4035j3824n3197
$$ 70696 63279 21315 37758 -1542 -55725 -49512 13061 46406 3998 -30037 -43861 -97058
11060i7058j8198O2315J5206R873L4043R326N3417M6177l1593R762k4153j1213
$$ -97058 -115256 -52941 -37735 -27862 6181 15507 68924 115101 83508 93270 69117 57904
11048E7904l6947j84514m4449J33895N0543N4440l2167P4588l2330l2778k0101
$$ 57904 20957 -163557 -208006 -74111 -23568 30872 -1295 73293 40963 8185 -11916
11037a1916p453p4298l4379L3416M5510N3207L3809N876R841j6365m4197L5l9462
$$ -11916 -19369 -93667 -128046 -94630 -49120 4087 37896 43772 53613 37248 -6949 -6914 -46376
11024d6376l765m906l5115j7810o022K3633j0336m0108K0372L5076j2721m8396
$$ -46376 -50141 -55047 -90162 -107972 -113994 -90361 -100697 -140805 -120433 -85357 -98078 -146474
11012a46474o6120k455P0582L4777L4186k1662o396l8143M2307J1966j576J3506
$$ -146474 -212594 -215049 -144467 -109690 -75504 -97166 -103562 -141705 -99398 -87432 -89008 -75502
11000g5502J0198J9820l0645L9824L960J1576j0529l9349M6737k1040n0918j7502
$$ -75502 -65304 -45484 -76129 -36305 -32345 -20769 -31298 -70647 -23910 -44950 -95868 -113370
10988a13370J7616o1054J8329P0334j7379m6159O8993M306o6723P3788Q0778J7955
$$ -113370 -95754 -156808 -138479 -68145 -85524 -131683 -62690 -58384 -125107 -51319 29459 47414
10976D7414O7873l6665k5148K3002r2413j05324l482N8681L9722l4454j1352M0815
$$ 47414 115287 78622 53474 76476 -15937 -121261 -124743 -66062 -26340 -60794 -72146 -31331
10964c1331J1937N3616K7609n101M7820o1673j143j08591J5965O9564l466q719
$$ -31331 -19394 34222 61831 56730 104550 42877 41734 -66857 -50892 18672 15206 6487
10952F487N695J6221p6368n0400L8536P807Q9678O1944l9115k8978j8181o4573
$$ 6487 12182 28403 -47965 -98365 -59829 -52022 37656 99600 60485 31507 13326 -51247
10940e1247m1156J13326N6362J553L6521k2886j05832m1548j6543O1453j3394
$$ -51247 -92403 20923 77285 78838 115359 92473 -13359 -54907 -71450 -9997 -23391
10929b3391N9404k1564m6892K7577j2508j3786J13991Q3941L1617J74l2424l5479
$$ -23391 36013 14449 -32443 -4866 -17374 -31160 82831 166772 198389 198563 166139 130660
10917A30660o5042n1917p5946k0897q4488M9185J2288N4909J60637P5658N7024
$$ 130660 65618 13701 -62245 -83142 -167630 -118445 -106157 -51248 109389 185047 242071
10906B42071j482n0451l3021q7320L6011j15995o4868K9684k0761K5072R777o0177
$$ 242071 240589 190138 157117 69797 105808 -10187 -75055 -45371 -66132 -41060 -31283 -91460
10894i1460k9015K26k3635q2745K0817Q6885L579J8363K2916P4199J01408n8617
$$ -91460 -120475 -120249 -143884 -226629 -205812 -118927 -115348 -96985 -74069 130 101538 42921
10882D2921j09531m1719R2162N6443O594p2492j4336m146K3467n2907k6245J46295
$$ 42921 -66610 -108329 -16167 40276 46870 -25622 -39958 -44104 -20637 -73544 -99789 46506
10870D6506R5793j3233p6228k8565p828j8327j3037p602Q946m633k2661L3776
$$ 46506 142299 129066 52838 24273 16445 -1882 -14919 -22521 -13575 -18208 -40869 -7093
10858g093J352J9733M50p588P722M3749j9587k4225j5240M6987o7078l3002q2186
$$ -7093 -5741 13992 14442 6854 14576 58325 38738 14513 -727 46260 -20818 -53820 -136006
10845a36006o2654L8098J2112j3245O9935K7852j404m4307L060j9712N9010n8630
$$ -136006 -198660 -160562 -148450 -161695 -91760 -63908 -65312 -109619 -106559 -126271 -67261 -125891
10833a25891k7531q803M6795R2056R7049N5038l9475m2090l1840j106N7006K1305
$$ -125891 -153422 -162225 -115430 -23374 73675 128713 89238 47148 15308 14202 71208 92513
10821I2513J3574l3087l6667n7571l1588j9735K2820l6361N189J32540l5642o1902
$$ 92513 106087 73000 36333 -21238 -52826 -72561 -49741 -86102 -80913 51627 15985 -45917
10809d5917K5761l0454K6951K441o8135J03814O3447j0193l596q774K3295j4819
$$ -45917 -20156 -50610 -23659 -21218 -89353 14461 77908 67715 64119 55345 78640 63821
10797F3821J0378L7217K247l7843p7595j39912k2429O1156J7869K4164J4347l011
$$ 63821 74199 111416 113663 75820 -1775 -141687 -164116 -102960 -85091 -60927 -46580 -49591
10785d9591L9262P6391q180r7473n696O7933k2896l5219J6276m251k2295p2098
$$ -49591 -10329 66062 57882 -39591 -45287 22646 -250 -35469 -19193 -23444 -45739 -117837
10773a17837N9592N1802J2139J2721K4432K6551o3683o319K7316j7809O0483k2897
$$ -117837 -58245 -6443 5696 18417 42849 69400 5717 -602 26714 8905 69388 46491
10761D6491k0084L285J1770N6688j855n6804K188o6870p491k4918n7079O6043
$$ 46491 26407 29692 41462 98150 96295 39491 41679 -25191 -32682 -57600 -114679 -48636
10749d8636J00292m8251j890j128q345j9023K5921o1753l1257R4972m7126n3594
$$ -48636 51656 3405 1515 387 -7958 -26981 -1060 -62813 -94070 902 -46224 -99818
10737i9818M8119k6737l317J3494l9571r0990K2231Q5978K8046o6409l4718L9458
$$ -99818 -51699 -78436 -81753 -68259 -107830 -198820 -176589 -90611 -62565 -128974 -163692 -124234
10725a24234q73k3457L3045J4897j9274J0750J02767R7870m5183j23613N378O2016
$$ -124234 -125107 -148564 -115519 -100622 -119896 -109146 -6379 91491 46308 -77305 -71927 -9911
10713i911j1582O0960O441q699k2078o0065m0704J438O456Q797n862q5279j12219
$$ -9911 -21493 39467 45908 37209 15131 -44934 -85638 -84200 -77744 -68947 -74809 -160088 -272307
10700b72307J0098J6445J11250Q9062J8964j2524K2465M0742n0898q8757o2322
$$ -272307 -262209 -245764 -134514 -45452 -26488 -39012 -16547 24195 -26703 -115460 -177782
10689a77782M2112M542L9622Q2589J06763j37842l8732J00945l0819m549N2118
$$ -177782 -135670 -131128 -91506 -8917 97846 -39996 -78728 22217 -8602 -13151 38967
10678C8967n5345j3906N4935M6157p835j9669J00735j23482K4426N458k6308N799
$$ 38967 -16378 -30284 24651 70808 62973 43304 144039 20557 44983 50441 24133 29932
10666B9932r1519k1437l3331j1452O1266N8654k374j8811j9321M0094p0257p1720
$$ 29932 -61587 -83024 -116355 -127807 -66541 -7887 -10261 -29072 -48393 -8299 -78556 -150276
10654a50276J7559L5079K6866O9937n9488q1266O9073P4203O3905o7569K044J7935
$$ -150276 -132717 -97638 -70772 -835 -60323 -141589 -72516 1687 65592 -1977 67 18002
10642A8002q46o0193o5297J4683j084M3394Q9744J7642m9166o0353K3265P4876
$$ 18002 17156 -43037 -108334 -93651 -94735 -51341 38403 56045 6879 -53474 -30209 44667
10630D4667j9235L8913J1020J392j3068k9396n1616r0247n0123l187J445N4763
$$ 44667 25432 64345 75365 76757 63689 34293 -17323 -107570 -157693 -160880 -159435 -104672
10618a04672R3897P7829K3586p0877n4555R987J03k516K6095R610r6691M8863
$$ -104672 -10775 67054 90640 19763 -34792 -24805 -24702 -27218 -1123 8487 -88204 -39341
10606c9341j4811J0513O7576O281p0715N5239M5177J398l4142k2176K1696M0259
$$ -39341 -54152 -43639 23937 30218 -40497 14742 59919 61317 27175 4999 26695 66954
10594F6954r5613k6130j1879P1501j4645l2349k0405Q795M0746Q623P7895r4967
$$ 66954 -28659 -54789 -66668 4833 -9812 -42161 -62566 -53771 -13025 -4402 73493 -21474
10582b1474l9073R82k2499J5508r416n178j2370K2145O4953J29j7433M2586N1998
$$ -21474 -60547 -59565 -82064 -66556 -75972 -81150 -93520 -71375 -6422 -6293 -23726 18860 70858
10569G0858N7950o0470j04356p5925k4773L6196P0650j9677M3637J00871n8605
$$ 70858 128808 68338 -36018 -111943 -136716 -100520 -29870 -49547 -5910 94961 36356
10558C6356n0697r1999j11636J09721O7041n7791o7394j9841N6479N6561m3366
$$ 36356 -14341 -106340 -217976 -108255 -41214 -99005 -166399 -186240 -129761 -73200 -116566
10547a16566J7218J2686L004J5906L3290K1948p417m2350n4410J1641K3354k2563
$$ -116566 -99348 -86662 -83658 -67752 -34462 -12514 -19931 -62281 -116691 -105050 -81696 -104259
10535a04259k0933q456J6110J869N5613k5968N519J01819M3914n850n8736L3795
$$ -104259 -125192 -133648 -117538 -115669 -60056 -86024 -80505 21314 65228 59378 642 34437
10523C4437m3177j00430J1371l9461k4749N6913R2210J9277l9003J6853p0275
$$ 34437 -8740 -109170 -97799 -137260 -162009 -105096 -12886 6391 -32612 -15759 -86034
10512h6034l1246N0025M4252o2872l8111K0726L7543k3599P3104L0476l7681j2565
$$ -86034 -117280 -67255 -23003 -85875 -123986 -103260 -65717 -89316 -16212 14264 -23417 -35982
10500c5982M0965Q2438m1136L5872j7473J9577L777j4626Q299K4766l2623m6820
$$ -35982 4983 87421 46285 82157 64684 84261 88038 73412 81711 106477 73854 27034
10488B7034o354J5474L8697n4004q4084l7662n4791O2385K0355O6327M1057m8224
$$ 27034 20680 36154 74851 20847 -63237 -100899 -155690 -93305 -72950 -6623 34434 -13790
10476a3790k377r3603L5257M7752O1324p433k6451m2509J0452m3865o1373q321
$$ -13790 -16167 -109770 -74513 -26761 34563 27130 679 -41830 -31378 -75243 -136616 -144937
10464a44937J3528Q4740L7390J787K8671m0956j5068J7413P8556K4670K3472l0502
$$ -144937 -131409 -46669 -9279 -7492 21179 -19777 -34845 -17432 61124 85794 109266 78764
10452G8764o8367m8180P1791q9490K0698k6899n9306r619J04481O4020L9427k2172
$$ 78764 10397 -37783 34008 -55482 -34784 -61683 -120989 -130608 -26127 37893 77320 55148
10440E5148K2542o7195l7033j02397N5913N1685J1371k3306K0303n2704J3084
$$ 55148 77690 10495 -26538 -128935 -73022 -21337 -9966 -33272 -12969 -65673 -52589
10429e2589j2296Q2516P1364n3128j08338J8706P5976M17l4921j5189p281m5181
$$ -52589 -64885 17631 88995 35867 -72471 -53765 22211 22628 -12293 -27482 -34763 -79944
10417g9944k9807J1851O1568J511R692Q294j25728o3753N1418O8812O2202P2339
$$ -79944 -109751 -97900 -36332 -34821 -25129 -16835 -142563 -206316 -154898 -86086 -23884 48455
10405D8455J3141k0662K4782j6940k6073q8076K1100j5955m57j4606j0297k2593
$$ 48455 61596 40934 65716 48776 22703 -65373 -44273 -60228 -60685 -75291 -85588 -108181
10393a08181N0335K6994J9775j2896n1604r6360L4847M9039o8382J0652Q0331
$$ -108181 -57846 -30852 -11077 -23973 -75577 -171937 -137090 -88051 -156433 -145781 -65450
10382f5450N8043L8622m3475l8673O497M6136n3078L8396J30779R913l1238O9505
$$ -65450 -7407 31215 -12260 -50933 -44436 1700 -51378 -12982 117797 127710 96472 165977
10370A65977k4260j08629r8067m9714p8675M0377K7774o184L0033N0398M1629
$$ 165977 141717 33088 -64979 -114693 -193368 -152991 -125217 -131401 -101368 -50970 -9341
10359i341M9089j4770q825J6643L7143j1818N0407R463J6884R687J2374p2491
$$ -9341 39748 24978 16153 32796 69939 58121 108528 117991 134875 144562 156936 84445
10347H4445l5466k5557L1811J05547K3884m3505Q6217m3539r0269J0288k0539
$$ 84445 48979 23422 55233 160780 184664 141159 227376 183837 93568 103856 83317
10336H3317o3381J8844J02489J4553o4648o2331m5294j1834O7671J5127o0990
$$ 83317 19936 38780 141269 155822 91174 28843 -16451 -28285 39386 54513 -6477
10325f477l1413N463l0018k1952Q7123k009p3210l7348n500J6683n1307o4805
$$ -6477 -37890 -32427 -62445 -84397 2726 717 -72493 -109841 -115341 -98658 -149965 -214770
10313b14770J425J15414R7808K6501J289n2620p4774J8041L8276L8341M0720Q8225
$$ -214770 -213345 -97931 -123 26378 27667 -24953 -99727 -81686 -43410 -5069 35651 123876
10301A23876J0002o5324o7012m9159Q221Q9634M8826j6987q9900n1363p764J8263
$$ 123876 133878 68554 1542 -47617 -39396 50238 99064 82077 -7823 -59186 -66950 -48687
10289d8687P5078K021N4166N3562L3638j26075M2080L489p6568n2698m3998j4569
$$ -48687 26391 28412 82578 136140 169778 43703 85783 89272 12704 -39994 -83992 -98561
10277i8561P7910Q4304L0050L6558j31809m247Q856p731J8818J6030N3847j3430
$$ -98561 -20651 63653 93703 130261 -1548 -5795 3061 -4670 14148 30178 84025 70595
10265G0595k0374o8522Q67Q8307k6259j4334J4484n8167R116K1025M4569P8185
$$ 70595 50221 -18301 -17434 70873 44614 30280 44764 -13403 -4287 16738 61307 139492
10253A39492P3220P0541J50121J19432p5016o4118j06959p1218n9467k1540l0872
$$ 139492 212712 283253 433374 552806 477790 413672 306713 235495 176028 154488 123616
10242A23616O9240L8139K7576P4778N0247O5145p252n5258R975M9883K4762R2443
$$ 123616 192856 230995 258571 333349 383596 448741 441489 386231 396206 446089 470851 563294
10230E63294J37318K29330L59554O30210R55656J431498K104802K724843J866918
$$ 563294 700612 929942 1289496 1919706 2875362 4306860 6411662 9136505 11003423
10221A1003423j163516k757452k595086j613151q89896m96215l98019l13840j03663
$$ 11003423 9839907 7082455 4487369 2874218 1984322 1488107 1090088 776248 672585
10212F72585j8711j10946j09640m7582j26413j20924k7634L1082m1646o0732M328
$$ 672585 653874 542928 433288 385706 259293 138369 110735 141817 100171 39439 43767
10201D3767O61k5712q8321k376N9388n9537k1339K3844M544L4095M4702p6687
$$ 43767 44428 18716 -69605 -71981 -12593 -72130 -93469 -69625 -65081 -30986 13716 -62971
10189f2971M3603J7221M6688k8289l5481K8447L8183K6179K2476K6547l376J4115
$$ -62971 -19368 -2147 44541 16252 -19229 9218 47401 73580 96056 122603 119227 133342
10177A33342K8529m6498j1433n144M447n699O7870P3734N59p0003o1024l2923
$$ 133342 161871 115373 103940 98796 103243 97544 165414 239148 239707 169704 108680 75757
10165G5757k6970m2772m1363J11556j8960q2065L741P2152K0219L0195o9747j75962
$$ 75757 48787 6015 -35348 76208 57248 -24817 -21076 51076 71295 101490 31743 -144219
10153a44219K5706Q9651Q2116j086m1215k827k5028L3716P0524M4944L5131J6435
$$ -144219 -118513 -28862 53254 52168 10953 8126 -16902 16814 87338 132282 167413 183848
10141A83848l7335j9537M1275o3532j1279l7902L3383J6590J3083Q9135M004m330
$$ 183848 146513 126976 168251 104719 93440 55538 88921 105511 118594 207729 211733 207403
10129B07403o2616M5315l1814r3145j8545Q327J8424k8999l8149K6920J12434
$$ 207403 144787 190102 158288 65143 46598 54925 73349 44350 6201 33121 145555
10118A45555O2901m1544r0647n0168o9827J4665R8197j4845j2051L6761J2426
$$ 145555 208456 166912 76265 26097 -43730 -29065 69132 54287 42236 78997 91423
10107I1423Q8749k1906o5796l3277k0742q4491l7085J2860k7321k3524P0449J8972
$$ 91423 180172 158266 92470 59193 38451 -46040 -83125 -70265 -97586 -121110 -50661 -31689
10095c1689n0777n5288l838p987N5372M7211J7066J2262K0054j16675p4561R0098
$$ -31689 -82466 -137754 -141592 -149579 -94207 -46996 -29930 -17668 2386 -114289 -188850 -98752
10083i8752K8211N0806P4541M8242j6589j9985J9164q0379p0164O1300m7276k246
$$ -98752 -70541 -19735 54806 103048 86459 66474 85638 5259 -64905 -3605 -50881 -53127
10071e3127N4242L1491o639k3925k0063J7888K9089M2861N1977J2004j91511j3012
$$ -53127 1115 32606 25967 2042 -18021 -133 28956 71817 123794 135798 -55713 -68725
10059f8725K3756m0772k4347K4444L3821J48575K51068P8402j81393j13597q5945
$$ -68725 -44969 -85741 -110088 -85644 -51823 96752 347820 426222 244829 131232 45287
10048D5287j10595p86J01381J00860j5961l3460k3279Q091o0177l8650N8489J34207
$$ 45287 -65308 -66094 35287 136147 120186 86726 63447 71538 11361 -27289 31200 165407
10036A65407p1642j65716k4202L5866N8448J11454N6055r197m2495r5718O964
$$ 165407 93765 -71951 -96153 -60287 -1839 109615 165670 156473 113978 18260 25224
10025B5224L3115p5639m4286R4695J9302M462J0731R6868J41735Q0205M4069n6120
$$ 25224 58339 -17300 -61586 33109 52411 56873 67604 164472 306207 386412 430481 374361
10013C74361j40290j18401j30001p5831L9784M7531n7439m8085Q0792K5174l2405
$$ 374361 234071 115670 -14331 -90162 -50378 -2847 -60286 -108371 -27579 -2405 -34810
10002c4810k0240o2779n1031Q0387P1753j2799r3982r7470n1833k2139K4426R1654
$$ -34810 -55050 -117829 -168860 -88473 -16720 -29519 -123501 -220971 -272804 -294943 -270517 -178863
9990a78863P6834J1503K8799n987n3861O7969L5017J31334P925j22142m2317J6417
$$ -178863 -102029 -90526 -61727 -67714 -121575 -53606 -18589 112745 120670 -1472 -43789 -27372
9978b7372M5335n4453n2641M972J0448r3941j1657P3036J5024K3856O9040N361
$$ -27372 17963 -36490 -89131 -84159 -73711 -167652 -179309 -106273 -91249 -67393 1647 7008
9966G008O87k2467N9760O7325J2770M464p4191o6008M7010N4276J3971p8436k7097
$$ 7008 7695 -14772 44988 112313 125083 129547 55356 -10652 36358 90634 104605 26169 -928
9953i28m1987P446N5411p0324p3507j5377R7922K0199K8396J1743r099l0534p9912
$$ -928 -42915 -35469 19942 -50382 -123889 -139266 -41344 -21145 7251 18994 9895 -20639 -100551
9940a00551R4261n361o6177M2336M0509j1076O470l5589p8167Q5966N8058l3974
$$ -100551 -6290 -11651 -77828 -35492 5017 -6059 411 -35178 -113345 -27379 30679 -3295
9928c295r6632K3391M4190Q4678J1407o8945M0696M4459k9138l8570n1979J9158
$$ -3295 -99927 -76536 -32346 52332 63739 -5206 35490 79949 50811 12241 -39738 -20580
9916b0580J8067p1394m5831M9489K5101O6986Q1869l0767n7572m3657J16725J484
$$ -20580 -2513 -73907 -119738 -70249 -45148 21838 103707 72940 15368 -28289 88436 89920
9904H9920r9510j116L8117j708n8741n6864R2368N4181l1740l3378m3381K5547
$$ 89920 -9590 -10706 27411 25703 -33038 -89902 2466 56647 24907 -8471 -51852 -26305
9892b6305j2417l4999n4429J7586N6289N4915K0792m9694k7288k3280R824P4160
$$ -26305 -38722 -73721 -128150 -110564 -54275 640 21432 -28262 -55550 -78830 -69006 5154
9880E154m463q7441L0883K4055l4014K214l6652J4946o806k5236k6370P7308P5067
$$ 5154 691 -86750 -55867 -31812 -65826 -63612 -100264 -85318 -92124 -117360 -143730 -66422 8645
9867H645P8317M0814N0199j41523j29689K442Q1210O8302K5601O161K5448n323
$$ 8645 86962 127776 177975 36452 -93237 -90795 -9585 58717 84318 90479 115927 110604
9855A10604M899k2388j17821k6197n59J8198L3128j35144k7405J5257l9107N2181
$$ 110604 115503 93115 -24706 -50903 -51462 -33264 -136 -135280 -162685 -147428 -186535 -134354
9843a34354k6725R2779Q6381j6301l047L2460J328r5803l6462l0439J621M6669
$$ -134354 -161079 -68300 18081 1780 -1267 31193 32521 -63282 -99744 -130183 -128562 -81893
9831h1893P2203K417R493l594k7008K0459k4241j8193N2910n7926L6608M5843
$$ -81893 -9690 -7273 2220 -1374 -28382 -7923 -32164 -50357 2553 -55373 -18765 27078
9819B7078j2703l7112R882M1648L3898J3791o0782J1871o8720o3134N0052R4094
$$ 27078 14375 -22737 -12855 28793 62691 76482 15700 27571 -41149 -104283 -54231 39863
9807C9863K7423j2337O760Q935q3112n0261O8010M0908n3583q492K3355P8530
$$ 39863 67286 54949 61709 70644 -12468 -62729 5281 46189 -7394 -15886 7469 85999
9795H5999j4768j33051l213N4896j0898o7286j6272N3355J1528J0948J8772R5470
$$ 85999 71231 -61820 -65033 -10137 -21035 -88321 -104593 -51238 -39710 -28762 -9990 85480
9783H5480M4097l4466m2060j8402L1653N0490q0138N574M2577J1338K5171o9336
$$ 85480 129577 95111 53051 34649 66302 116792 36654 42228 84805 96143 121314 51978
9771E1978p9345J777j0879J5174k9681J1838N241n2766P793q6608l6464P5158
$$ 51978 -27367 -25590 -36469 -21295 -50976 -39138 -33897 -86663 -78870 -165478 -201942 -126784
9759a26784L4602K7326M1273N6973j22970n1689m274J4387J6687P8935m4681o5981
$$ -126784 -92182 -64856 -23583 33390 -89580 -141269 -145543 -131156 -114469 -35534 -80215 -146196
9747a46196j4461N7189j7352j6533L1542O0508J0046m5149K0065Q2378K1081n7858
$$ -146196 -160657 -103468 -120820 -137353 -105811 -45303 -35257 -80406 -60341 22037 43118 -14740
9735a4740n9410P216L6680K6683N733K1507N5714J1000q4162o3408N9378l9688
$$ -14740 -74150 -66934 -30254 -3571 2162 23669 79383 90383 6221 -57187 2191 -37497
9723c7497m6030q01k1804N2859K5211O3047n1182j4909m6260K2206M1562m694
$$ -37497 -83527 -84328 -106132 -53273 -28062 34985 -16197 -31106 -77366 -55160 -13598 -18292
9711a8292N9620l3361R204M131O060l4217l6344q2766n6248N4261N557O0715P8351
$$ -18292 41328 7967 17171 21302 27362 -6855 -43199 -125965 -182213 -127952 -122395 -61680 16671
9698A6671l9446L2625j302J8313L4557J8074J3258o7495K8083O8064r1093j21668
$$ 16671 -22775 9850 8548 26861 61418 79492 92750 25255 53338 121402 30309 -91359
9686i1359n7018N907K4374J2175Q4270L0952j8925k6152M1317l5503J1629k494
$$ -91359 -148377 -142470 -118096 -105921 -21651 9301 -9624 -35776 5541 -29962 -18333 -20827
9674b0827l7625l3821P5076J5639k4335O0893k2579k0244N5933N4331m1744j36256
$$ -20827 -58452 -92273 -17197 -1558 -25893 35000 12421 -7823 48110 102441 60697 -75559
9662g5559q1895Q4023O1548K0050r8044M930l6776k8021Q2693M4764K3756k6203
$$ -75559 -157454 -73431 -11883 8167 -89877 -84947 -121723 -149744 -67051 -22287 1469 -24734
9650b4734m1747j52416m8304P1207J23687J0015J28726M1770n2645l7628p7574
$$ -24734 -66481 -218897 -267201 -195994 -72307 -62292 66434 108204 55559 17931 -59643
9639e9643J5732n1780l4682l33J3438l8539J08195P9842k4382N1580j0576m9331
$$ -59643 -43911 -95691 -130373 -130706 -117268 -155807 -47612 32230 7848 59428 48852 -479
9627d79K46n9596n6743M4571M3222O7216l2199p8874K1747L3013M8528j435M6866
$$ -479 -233 -59829 -116572 -72001 -28779 38437 6238 -72636 -50889 -17876 30652 29217 76083
9614G6083M591M8218q3652j6497o077m0154o443l8226m3326L6445L4711J06421
$$ 76083 80674 128892 45240 28743 22666 -17488 -23931 -62157 -105483 -69038 -34327 72094
9602G2094n682n6180P914N1662M3801J15593o555m2906m3298q1913l6309L3307
$$ 72094 66412 10232 18146 69808 113609 229202 222647 179741 136443 54530 18221 51528
9590E1528K7477l8853k0336j7452L064l5796K7129P1035j4472p8101r235L5938
$$ 51528 79005 40152 19816 2364 5428 -30368 -3239 67796 53324 -24777 -34012 1926
9578A926N8475L5925q263l793n1224J6094k3731k3053j06077m0803j8242J02508
$$ 1926 60401 96326 88063 84270 33046 49140 25409 2356 -103721 -144524 -162766 -60258
9566f0258P5612q0826j3229M2273N6990K212p7441n044p6269p9193O1957N7652
$$ -60258 15354 -65472 -78701 -36428 20562 22774 -54667 -59711 -135980 -215173 -153216 -95564
9554i5564o5521N8372p2617n7278O3039R6376J9558j74005j0238N1897J00176
$$ -95564 -161085 -102713 -175330 -232608 -169569 -73193 -53635 -227640 -237878 -185981 -85805
9543h5805M8524l3853r3912O9226N781K0120q1265O8279R8343l9656m8990M5191
$$ -85805 -37281 -71134 -165046 -95820 -90039 -69919 -151184 -82905 15438 -24218 -73208 -28017
9531b8017L0549q7454l5213Q4860K7854p7928k1983O4833O6039q30l4566n4197
$$ -28017 2532 -84922 -120135 -35275 -7421 -85349 -107332 -42499 23540 22710 -11856 -66053
9519f6053n2184P7247Q3477Q871k3526J4845l5413p3343M718Q9763K0078j2105
$$ -66053 -118237 -40990 42487 51358 27832 42677 7264 -66079 -61361 28402 48480 36375
9507C6375l6176m7182j3494l43R5512O1475k5232m020n0818j21639k6500J9461
$$ 36375 199 -46983 -60477 -60820 34692 96167 70935 66915 16097 -105542 -132042 -112581
9495a12581m7121L4226J09959N6306Q2753k6537j9125R892o5384L7706N111r3010
$$ -112581 -159702 -125476 -15517 40789 123542 97005 77880 87772 22388 60094 65205 -27805
9483b7805o696L5981J8798Q4589J5007p4111n0756j1193K1421L0137k636j2099
$$ -27805 -34501 1480 20278 104867 119874 45763 -4993 -16186 5235 35372 32736 20637
9471B0637m7036J2528M1757R353o5271m9880M0468O3839n6076R170p0155P8518
$$ 20637 -26399 -13871 27886 37239 -28032 -77912 -37444 26395 -29681 -20511 -90666 -12148
9459a2148K6228k7548r0017n5562L948O5543L8639R17O1738M2705l2846p318J1329
$$ -12148 14080 -13468 -103485 -159047 -155099 -89556 -50917 -50000 11738 54443 21597 14279 25608
9446B5608k7474o079O1471k4455j4994n7875K4253L3110J1874m5877m9330l6753
$$ 25608 -1866 -7945 53526 29071 14077 -43798 -19545 13565 25439 -20438 -69768 -106521
9434a06521j0156m2950r097L280m3816p552O2928R1969L7810L4761M0992K2466
$$ -106521 -116677 -159627 -168724 -165444 -209260 -216812 -153884 -61915 -24105 10656 51648 74114
9422G4114L5649p5713n4515J816m6328L1349l3116l3159L3578r159J0067K8797
$$ 74114 109763 34050 -20465 -18649 -64977 -33628 -66744 -99903 -66325 -75484 -65417 -36620
9410c6620M683m2931j12710p0839L797R6153J34681Q991m4269K2314Q3831k2969
$$ -36620 -31937 -74868 -187578 -258417 -254620 -158467 -23786 -14795 -59064 -36750 47081 24112
9398B4112J966p5803L92M2580P3532p106N0903N2879q0143r2844n4058p961O49
$$ 24112 26078 -49725 -49333 -6753 66779 59673 110576 163455 83312 -9532 -63590 -71551 -70902
9385g0902O0075M1856N1791j02283n0224L0477J1261R717K6993n2296l2548L9801
$$ -70902 -10827 31029 82820 -19463 -69687 -39210 -27949 -18232 8761 -43535 -76083 -36282
9373c6282Q614N1772P4594m5925J4859m8090k980K6021P2027K5442m3452m5180
$$ -36282 -27668 24104 98698 52773 67632 19542 16562 42583 114610 140052 96600 51420
9361E1420q0435O2070K5075k3836L5019k6321L0370p811J9058M1112j8831M8463
$$ 51420 -29015 33055 58130 34294 69313 42992 73362 65551 84609 125721 106890 155353
9349A55353l0844n7416J5991m4601q0892K7734o816k6795N3591M5984r5660q4233
$$ 155353 124509 67093 83084 38483 -42409 -14675 -21491 -48286 5305 51289 -44371 -128604
9337a28604M5137j1567j00638k5996O6016O6184P9983r523L8738J345l8142j9601
$$ -128604 -83467 -95034 -195672 -221668 -155652 -89468 -9485 -19008 19730 21075 -17067 -36668
9325c6668R170O971n0957J8899j2674L1758L4657K5936N6478L2041o2949j9474
$$ -36668 -27498 -20527 -71484 -52585 -65259 -33501 1156 27092 83570 115611 52662 33188
9313C3188p0530j9036K6806L1614Q9124k4736r2013l9059P2085l7128j6114n1542
$$ 33188 -37342 -56378 -29572 2042 91166 66430 -25583 -64642 7443 -29685 -45799 -97341
9301i7341K3238Q5429q0217o1931j0240L8547L9017j9218K9270R384j05799P4601
$$ -97341 -74103 11326 -68891 -130822 -141062 -102515 -63498 -82716 -53446 -44062 -149861 -75260
9289g5260J54711L7932J5381p7362m9292R265m9124j2146M6977L9003J8009N2384
$$ -75260 79451 117383 132764 55402 6110 15375 -33749 -45895 1082 40085 58094 110478
9277A10478n3177n4631K9942r493o3386j7341M1804k8702j0974J06831O8036k2701
$$ 110478 57301 2670 32612 23119 -40267 -57608 -15804 -44506 -55480 51351 119387 96686
9265I6686j13601O1565M5576r573N0627J539n1314o2337r690p035n1886K4125
$$ 96686 -16915 44650 90226 80653 131280 132819 81505 19168 9478 2443 -49443 -25318
9253b5318K3204M6001n9872O608K8740l7979J6976M7926Q2762k7059o8403M8421
$$ -25318 -2114 43887 -15985 -9377 19363 -18616 -1640 46286 129048 101989 33586 82007
9241H2007R0576m2787q4740j9961m4095m5189l9733J6674R4209L3478J2858J4815
$$ 82007 172583 129796 45056 25095 -19000 -64189 -103922 -87248 6961 40439 53297 68112
9229F8112l1822l7181J3418L2983J18931m969m9204k7830L0623n3467J5900k8774
$$ 68112 36290 -891 12527 45510 164441 159472 110268 82438 113061 59594 75494 46720
9217D6720N2260K097j2065l8153L7762M8290J29755o2077k21820q1260P7883P1639
$$ 46720 98980 101077 89012 50859 88621 136911 266666 204589 -17231 -98491 -20608 51031
9205E1031L419R9404M1408o2604M783J5520L4024r62M6061j9951m9404L4887p5199
$$ 51031 54450 153854 195262 132658 137441 152961 186985 186023 232084 212133 162729 197616 122417
9192A22417p8529n825O9434P5430P591N6351O7903k3711m2138J9960j5485l0231
$$ 122417 43888 38063 107497 182927 190518 246869 314772 291061 248923 268883 253398 223167
9180B23167J9384o291J7995J6950o3975N7618J3075J2184n0044k9301k5926K4515
$$ 223167 242551 236260 254255 271205 207230 264848 277923 290107 240063 210762 184836 209351
9168B09351J48788N8739K253J18277J04387K6798M0166k1882k8520J697j0708
$$ 209351 358139 416878 419131 537408 641795 668593 708759 686877 658357 660054 649346
9157F49346O0404P4730J8699J43598K24965K44561J81095J44182J51114K37289
$$ 649346 709750 784480 803179 946777 1171742 1416303 1597398 1741580 1892694 2129983
9147B129983L80520M20845M59934O55823R61400J226787J769005K622822L813148
$$ 2129983 2510503 2931348 3391282 4047105 5008505 6235292 8004297 10627119 14440267
9138A4440267N742105R209670J4729463K2227830K8714050K1944488p195797k7545674
$$ 14440267 20182372 29392042 44121505 66349335 95063385 117007873 109812076 82266402
9130H2266402k7578666j8715752j1059695o758983m275159k912629k004837j461528
$$ 82266402 54687736 35971984 24912289 18153306 13878147 10965518 8960681 7499153
9122G499153j101077p91155p40204o15703n63379n48280l46718k53267j87349
$$ 7499153 6398076 5606921 4866717 4251014 3687635 3139355 2792637 2539370 2352021
9113B352021j79712j37321j52667j99643r7733j49406o8726l2497j00991j97942
$$ 2352021 2172309 2034988 1882321 1682678 1584945 1435539 1366813 1334316 1233325 1035383
9103A035383j22298m7492j6181p0107l5277m5871N6632q274m4718j14872l4334
$$ 1035383 913085 865593 849412 779305 744028 698157 754789 746515 701797 586925 552591
9092E52591k876o495n8111q696m1840j8173l3889L4479K4193k3138n3234L3733
$$ 552591 549715 543220 485109 476413 434573 416400 382511 416990 441183 418045 364811 398544
9080C98544R056p6960j06324O572o8418m2790N7673P97N664o4650n9458N8393
$$ 398544 407600 330640 224316 230888 162470 119680 177353 178150 183814 119164 59706 118099
9068A18099K2593J8268M8691J07548K0852n0676k0497l3521p2037j03232r365
$$ 118099 140692 158960 207651 315199 336051 285375 264878 231357 159320 56088 46723
9057D6723J1000M0178L7278K7432o8059O6685J9765j4537M4391P1086P388n7731
$$ 46723 57723 97901 135179 162611 94552 161237 181002 166465 210856 281942 289330 231599
9045B31599m8594j2684R8856k4317l0398K136L2570M9935j07991m2722j0606J8967
$$ 231599 183005 170321 269177 244860 214462 216598 249168 299103 191112 148390 137784 156751
9033A56751k9615m133j397O2002O5579R126j9443m2642L4886m3172M6338o3602
$$ 156751 127136 123003 121606 183608 249187 258313 238870 196228 231114 187942 234280 170678
9021A70678j13183l3862L0138m3897k4451M422J18439J15492q524m4650j10327
$$ 170678 57495 23633 53771 9874 -14577 -10155 108284 223776 215252 170602 60275
9010F0275o7848K914j3698O0251l6393p6502O1061N4044P2696J8620n2048n2508
$$ 60275 -7573 -4659 -18357 41894 5501 -71001 -9940 44104 116800 135420 83372 30864
8998C0864o1214j1023m125M030L3113J4143k0546j2427r44N0490Q7318O6411j39085
$$ 30864 -30350 -41373 -45498 -41468 -8355 5788 -14758 -27185 -28129 22361 109679 176090 37005
8985C7005k1579P2121M9160p0232l1702l3336P3899m3829o5564K7287K4469L9436
$$ 37005 15426 87547 136707 66475 34773 1437 75336 31507 -34057 -6770 17699 57135
8973E7135K9733J642m6329l7737j453m8961M6321K3326R217M7483r230p9004J7350
$$ 57135 86868 88510 42181 4444 2991 -45970 351 23677 32894 80377 71147 -7857 9493
8960I493O5788M541M2216j3385j40847n1326J17535M3311j08335l9900J1385l3230
$$ 9493 75281 79822 122038 108653 -32194 -83520 34015 77326 -31009 -70909 -59524 -92754
8948i2754M5933P828M1834K1727j4501J907p6093m1136Q6083M0841q7068J2202
$$ -92754 -46821 -38993 2841 24568 10067 11974 -64119 -105255 -19172 21669 -65399 -53197
8936e3197P3408M0006n5687P997O2999m7912J9036M3328k8945m4242J4127l8863
$$ -53197 20211 60217 4530 12527 75526 27614 46650 89978 61033 16791 30918 -7945
8924g945R0039m9110k8674j0696J5058K4264j9157j6256M2331M1490K338L6018
$$ -7945 82094 32984 4310 -6386 8672 32936 13779 -2477 39854 81344 83682 119700
8912A19700k6945m1450p72N7134P5716p3477j47236j18176n837M8434o5399P6701
$$ 119700 92755 51305 50533 107667 183383 109906 -37330 -155506 -161343 -112909 -178308 -101607
8900a01607J07703J0345k2812j7464o4662K0102O6101L4600K1648j6003q8253
$$ -101607 6096 16441 -6371 -23835 -88497 -68395 -2294 32306 53954 37951 -50302
8889e0302L2912R5975N8944j03550n3597M5964K5131j265L5414O045m4079o396
$$ -50302 -17390 78585 137529 33979 -19618 26346 51477 50212 85626 91671 47592 41196
8877D1196L5552J8327n5363P412N8313N5100Q267m169k5141K1431j5177j04711
$$ 41196 76748 95075 39712 47124 105437 160537 168804 164635 139494 160925 145748 41037
8865D1037l2344k6249Q7252Q7312m7255o6834M916O1618L0397m2658l9964J1172
$$ 41037 8693 -17556 69696 157008 109753 42919 47835 109453 139850 97192 57228 68400
8853F8400j2263k7394o0859o5010j4816J5798M9056M5372l4563J31027N3526n7214
$$ 68400 56137 28743 -32116 -97126 -111942 -96144 -47088 -1716 -36279 94748 148274 91060
8841I1060j16333l9393j7245m6054o126L042N1358j0482k7176R9459J16775N633
$$ 91060 -25273 -64666 -81911 -127965 -134091 -131049 -79691 -90173 -117349 -17890 98885 104518
8829A04518l8997Q112K4438j3975m2022l659M6876j1123M577R4059m5253l6637
$$ 104518 65521 73633 98071 84096 42074 38415 85291 74168 78745 172804 127551 90914
8817I0914j190l6294p681K3775q082l5796m2529k6305J5969j4690L4176k8294
$$ 90914 89724 53430 45749 69524 61442 25646 -16883 -43188 -27219 -41909 -7733 -36027
8805c6027N1591k6683j57508j742K4490L0151O2835J14081M5495J6048Kj53733
$$ -36027 15564 -11119 -168627 -170369 -145879 -115728 -52893 61188 106683 122731 122733 -31000
8793c1000j20616l9797l917Q4057J09226J8706M5030M8391n8203m4353m8145k1992
$$ -31000 -151616 -191413 -195330 -111273 -2047 16659 61689 110080 51877 7524 -40621 -62613
8781f2613O1781P1576L1605k8358o3463K0124J2p202M5924k537l524L994j02657
$$ -62613 -832 70744 102349 73991 10528 30652 30664 23462 69386 66849 63325 67319 -35338
8768c5338M3692M1509m4891l5517R1891l7618o1197J22539N6267o4379k0817K399
$$ -35338 8354 49863 4972 -30545 61346 23728 -37469 85070 141337 76958 56141 58540
8756E8540o6335n987N6131R0338n0472p3473l0910r179J48n092L9270l559l8221
$$ 58540 -7795 -13782 42349 132687 82215 8742 -22168 -31347 -31199 -36291 2979 -580 -38801
8743c8801j3981P4832J4612k9217K2743l328M7571J039J1769l538r8653n8359
$$ -38801 -52782 22050 36662 7445 30188 26860 74431 75470 87239 83701 -14952 -73311
8731g3311q1401J31118R1457j4154p5751Q644l0293j4238k5569O1556O8812l587
$$ -73311 -154712 -23594 67863 53709 -22042 -13398 -43691 -57929 -83498 -21942 46870 43283
8719D3283J1342l7947m6778K5343O2711j9297p0586K0612l497P361N2972N4408
$$ 43283 54625 16678 -30100 -4757 57954 38657 -31929 -11317 -14814 -7453 45519 99927
8707I9927O7551M3085k5825L6953K7266j02518M9046M2806P7056O3056l2174j24106
$$ 99927 167478 210563 184738 221691 248957 146439 195485 238291 315347 378403 346229 222123
8695B22123n6186l6495n1302R707O6788M414n4779K2405m3717j10923j4230J4934
$$ 222123 165937 129442 78140 87847 154635 159049 104270 126675 82958 -27965 -42195 -27261
8683b7261p8483J3372M6808P3838J6405L4076M449N8942N2533Q539n2629q9744
$$ -27261 -105744 -92372 -45564 28274 44679 78755 83204 142146 194679 203218 150589 60845
8671F0845m1449m4419j5504L7175M5314O2815L5226k3308k0900J9575l8302O2048
$$ 60845 19396 -25023 -40527 -3352 41962 104777 140003 116695 95795 115370 77068 139116
8659A39116Q900m045R2795J85653J99964J41895o3444k19235j57983j35132j57709
$$ 139116 148016 143971 236766 422419 622383 764278 700834 481599 323616 188484 30775
8648C0775o2646J27325R815j6449l1657l120J6095l5563M3803P9894R163n5561
$$ 30775 -31871 95454 105269 88820 57163 54043 70138 34575 78378 158272 167435 111874
8636A11874K619l5599n4532m2546L2675M7362J7869l0948J2991N9787k3438o3513
$$ 111874 114493 78894 24362 -18184 14491 61853 79722 48774 61765 121552 98114 34601
8624C4601O3761J37445k6387r8579j06165J844P5947K887o3894o40K4683j3805
$$ 34601 98362 235807 209420 110841 4676 6520 82467 85354 21460 20820 45503 31698
8612C1698P3903J60492J76736j7996j48884j06189o4583p2993O1606J05050o0271
$$ 31698 105601 266093 442829 424833 275949 169760 105177 32184 93790 198840 138569
8601A38569r2526l0662J5226j8084j5965K3801J00610J14751O6706o2718k7765
$$ 138569 46043 15381 30607 12523 -3442 20359 120969 235720 302426 239708 211943
8590B11943l8841l4021q095L0694K1034n688k7763l1072k7662m9095N9717K5895
$$ 211943 173102 139081 130986 161680 182714 177026 149263 118191 90529 41434 101151 127046
8578A27046J8759Q0915n3016j02557j24582p2567L1200P4435Q506P1146P9496
$$ 127046 145805 226720 173704 71147 -53435 -126002 -94802 -20367 -11861 59285 138781
8567A38781J26978J40J8560M8658r0804n6718p0743o2248J0073M8937O541L0623
$$ 138781 265759 265899 284459 333117 242313 185595 114852 52604 62677 111614 118155 148778
8555A48778o0337o8003r5629L849R9564M4570P7542M8399r9275o0331P7944p4278
$$ 148778 88441 20438 -75191 -71342 28222 72792 150334 198733 99458 39127 117071 42793
8543D2793m2937J11337P9595l2835l3831k9748o3250j3362L0360k2387o6639N8277
$$ 42793 -144 111193 190788 157953 124122 94374 31124 17762 48122 25735 -40904 17373
8531A7373N0834L1302n6766K0456j5514m6496N8073Q3819m1665k2533k5266L8499
$$ 17373 68207 99509 42743 63199 47685 1189 59262 143081 101416 78883 53617 92116
8519I2116q430r3817r4955N4778R2423K6090L460M0012j01616l1339M7979k2128
$$ 92116 83686 -10131 -105086 -50308 42115 68205 71665 111677 10061 -21278 26701 4573
$$ [...]
##END NTUPLES=NMR SPECTRUM
##END=
