##TITLE=Analysis number 324791
Compound Code mo 00854
Project Code adrs
Chemist Name endeavour
##JCAMPDX= 6.0         $$ Bruker NMR JCAMP-DX V2.0
##DATA TYPE= NMR SPECTRUM
##DATA CLASS= NTUPLES
##ORIGIN= Bruker BioSpin GmbH
##OWNER= nmr
$$ XWIN-NMR		Version 3.5
$$ Fri Dec  1 09:44:29 2006 GMT Standard Time (UT+0h)  MAYBRIDGE\nmr@NMR_250MHZ
##.OBSERVE FREQUENCY= 250.131544655141
##.OBSERVE NUCLEUS= ^1H
##.ACQUISITION MODE= SIMULTANEOUS (DQD)
##.ACQUISITION SCHEME= undefined
##.AVERAGES= 16
##.DIGITISER RES= 18
##SPECTROMETER/DATA SYSTEM= dpx250
##.PULSE SEQUENCE= zg30
##.SOLVENT NAME= CDCl3
##.SHIFT REFERENCE= (INTERNAL, CDCl3, 0, 16.4488)
##AUDIT TRAIL= $$ (NUMBER, WHEN, WHO, WHERE, WHAT)
$$ ##TITLE= Audit trail, XWIN-NMR		Version 3.5
$$ ##JCAMPDX= 5.01
$$ ##ORIGIN= Bruker BioSpin GmbH
$$ ##OWNER= nmr
$$ C:\u/data/dgb/nmr/ADRS/10/pdata/1/auditp.txt
$$ ##AUDIT TRAIL=  $$ (NUMBER, WHEN, WHO, WHERE, WHAT)
(   1,<2006-12-01 09:44:09.10 +000>,<MAYBRIDGE\nmr>,<NMR_250MHZ>,
      <created by zg, POWCHK disabled, PULCHK disabled
       configuration hash MD5:
       49 4B E0 1D 92 C2 6B 37 9F E6 65 BC 52 41 86 1D
       data hash MD5: 64K
       1D CB E7 0B AF 31 FC 5B 06 D7 77 A7 16 D6 03 E4>)
(   2,<2006-12-01 09:44:20.85 +000>,<MAYBRIDGE\nmr>,<NMR_250MHZ>,
      <Start of raw data processing
       ef LB = 0.3 FT_mod = 6 PKNL = 1 SI = 32K 
       data hash MD5: 32K
       5D 70 02 7F 76 54 EA 40 82 50 A4 58 3A 01 16 1C>)
(   3,<2006-12-01 09:44:22.52 +000>,<MAYBRIDGE\nmr>,<NMR_250MHZ>,
      <apk 
       data hash MD5: 32K
       2A 86 79 DB E0 6F 0F 77 2A EE 7F A2 A4 EB FB 07>)
(   4,<2006-12-01 09:44:23.25 +000>,<MAYBRIDGE\nmr>,<NMR_250MHZ>,
      <abs ABSG = 5 
       data hash MD5: 32K
       4F 9C AA 94 3F 0E 06 97 78 6F C0 CF 9B FC 64 7C>)
$$ ##END=
$$ 
$$ hash MD5
$$ DD 9F 2E 25 88 DF 32 E9 67 6B 60 F5 BA 2A B0 93
##$RELAX= 
##$RELAX= 
##$RELAX= 
##$RELAX= 
##$RELAX= 
##$RELAX= 
##$RELAX= 
$$ Bruker specific parameters
$$ --------------------------
##$DU= <C:\u>
##$EXPNO= 10
##$NAME= <ADRS>
##$PROCNO= 1
##$TYPE= <nmr>
##$USER= <dgb>
##$AMP= (0..31)
100 100 100 100 100 100 100 100 100 100 100 100 100 100 100 100 100 100 
100 100 100 100 100 100 100 100 100 100 100 100 100 100 
##$AQSEQ= 0
##$AQ_mod= 3
##$AUNM= <au_zg>
##$AUTOPOS= <7 >
##$BF1= 250.13
##$BF2= 250.13
##$BF3= 250.13
##$BF4= 250.13
##$BF5= 500.13
##$BF6= 500.13
##$BF7= 500.13
##$BF8= 500.13
##$BYTORDA= 1
##$CFDGTYP= 0
##$CFRGTYP= 5
##$CHEMSTR= <none>
##$CNST= (0..31)
1 1 145 1 1 1 1 1 1 1 1 1 1 1 1 1 1 1 1 1 1 1 1 1 1 1 1 1 1 1 1 1 
##$CPDPRG= <>
##$CPDPRG1= <>
##$CPDPRG2= <>
##$CPDPRG3= <>
##$CPDPRG4= <mlev>
##$CPDPRG5= <mlev>
##$CPDPRG6= <mlev>
##$CPDPRG7= <mlev>
##$CPDPRG8= <mlev>
##$CPDPRGB= <>
##$CPDPRGT= <>
##$D= (0..31)
0 1 0 0 0 0 0 0 0 0.06 0 0 0 0 0 0 0.0002 0 0 0 0 0 0 0 0 0 0 0 0 0 0 
0 
##$DATE= 1164966248
##$DBL= (0..7)
120 120 120 120 120 120 120 120 
##$DBP= (0..7)
150 150 150 150 150 150 150 150 
##$DBP07= 0
##$DBPNAM0= <>
##$DBPNAM1= <>
##$DBPNAM2= <>
$$ [...]
##$SUBNAM7= <"">
##$SUBNAM8= <"">
##$SUBNAM9= <"">
##$SW= 20.6930455092707
##$SWIBOX= (0..15)
0 0 3 0 0 0 0 0 0 0 0 0 0 0 0 0 
##$SW_h= 5175.983436853
##$TD= 65536
##$TD0= 1
##$TE= 295.16
##$TE2= 300
##$TE3= 300
##$TEG= 300
##$TL= (0..7)
0 120 120 120 120 120 120 120 
##$TP= (0..7)
150 150 150 150 150 150 150 150 
##$TP07= 0
##$TPNAME0= <>
##$TPNAME1= <>
##$TPNAME2= <>
##$TPNAME3= <>
##$TPNAME4= <>
##$TPNAME5= <>
##$TPNAME6= <>
##$TPNAME7= <>
##$TPOAL= (0..7)
0.5 0.5 0.5 0.5 0.5 0.5 0.5 0.5 
##$TPOFFS= (0..7)
0 0 0 0 0 0 0 0 
##$TUNHIN= 0
##$TUNHOUT= 0
##$TUNXOUT= 0
##$USERA1= <user>
##$USERA2= <user>
##$USERA3= <user>
##$USERA4= <user>
##$USERA5= <user>
##$V9= 5
##$VALIST= <valist>
##$VCLIST= <CCCCCCCCCCCCCCC>
##$VD= 0
##$VDLIST= <DDDDDDDDDDDDDDD>
##$VPLIST= <PPPPPPPPPPPPPPP>
##$VTLIST= <TTTTTTTTTTTTTTT>
##$WBST= 1024
##$WBSW= 4
##$XGAIN= (0..3)
0 0 0 0 
##$XL= 0
##$YL= 0
##$YMAX_a= 222892
##$YMIN_a= -263480
##$ZGOPTNS= <>
##$ZL1= 120
##$ZL2= 120
##$ZL3= 120
##$ZL4= 120
##$ABSF1= 16.44881
##$ABSF2= -4.244362
##$ABSG= 5
##$ABSL= 3
##$ALPHA= 0
##$AQORDER= 0
##$ASSFAC= 0
##$ASSFACI= 0
##$ASSFACX= 0
##$ASSWID= 0
##$AUNMP= <proc_1d>
##$AZFE= 0.1
##$AZFW= 0.1
##$BCFW= 0
##$BC_mod= 0
##$BYTORDP= 0
##$COROFFS= 0
##$CY= 12.5
##$DATMOD= 1
##$DC= 0
##$DFILT= <>
##$DTYPP= 0
##$F1P= 14.0000005364418
##$F2P= -0.99999901652339
##$FCOR= 0.5
##$FTSIZE= 32768
##$FT_mod= 6
##$GAMMA= 0
##$GB= 0
##$INTBC= 1
##$INTSCL= 1
##$ISEN= 128
##$LB= 0.3
##$LEV0= 0
##$LPBIN= 0
##$MAXI= 10000
##$MC2= 0
##$MEAN= 0
##$ME_mod= 0
##$MI= 0
##$NCOEF= 0
##$NC_proc= -4
##$NLEV= 6
##$NOISF1= 0
##$NOISF2= 0
##$NSP= 0
##$NTH_PI= 0
##$NZP= 0
##$OFFSET= 16.44881
##$PC= 1
##$PHC0= 219.2218
##$PHC1= 9.710778
##$PH_mod= 1
##$PKNL= yes
##$PPARMOD= 0
##$PSCAL= 4
##$PSIGN= 0
##$REVERSE= no
##$SF= 250.130018305639
##$SI= 32768
##$SIGF1= 0
##$SIGF2= 0
##$SINO= 400
##$SIOLD= 32768
##$SREGLST= <1H.CDCl3>
##$SSB= 0
##$STSI= 32768
##$STSR= 0
##$SW_p= 5175.98343685301
##$SYMM= 0
##$S_DEV= 0
##$TDeff= 65536
##$TDoff= 0
##$TI= <Analysis number 999999
Compound Code 99
Book Reference 9
Project Code 9>
##$TILT= no
##$TM1= 0
##$TM2= 0
##$TOPLEV= 0
##$USERP1= <user>
##$USERP2= <user>
##$USERP3= <user>
##$USERP4= <user>
##$USERP5= <user>
##$WDW= 1
##$XDIM= 32768
##$YMAX_p= 535039495
##$YMIN_p= -273077
$$ End of Bruker specific parameters
$$ ---------------------------------
##NTUPLES= NMR SPECTRUM
##VAR_NAME=  FREQUENCY,     SPECTRUM/REAL,   SPECTRUM/IMAG
##SYMBOL=    X,             R,               I
##VAR_TYPE=  INDEPENDENT,   DEPENDENT,       DEPENDENT
##VAR_FORM=  AFFN,          ASDF,            ASDF
##VAR_DIM=   32768,         32768,           32768
##UNITS=     HZ,            ARBITRARY UNITS, ARBITRARY UNITS
##FACTOR=    0.157963299565203, 1,           1
##FIRST=     4114.34129082919, 0,            0
##LAST=      -1061.64214602382, 0,           0
##MIN=       -1061.64214602382, -273077,     0
##MAX=       4114.34129082919, 535039495,    0
$$ Real data points
##PAGE= N=1
##DATA TABLE= (X++(R..R)), XYDATA
$$ [...]
16151a35488P3960N7956P115o9913M2028K4793k9358L7330o4153j4820K079N8427
16139a0044j2757o38o5104K5898j2100J4865K5790L2092k4397l3629k9838p468
16127i7330j2703j5400J1226k107j9751l2040O7628Q3683M311N493J7185l4778
16115b4583m4947n725J7152N7609J9204j6663J7215K1221L830M280R498N214K6057
16102H9362k9302k9819j8686m4856k6418m9669L4097j3912k44R981O573m2601
16090a15494k8507J6212R1568m5252q0473p581M2231M9162n9003n8079j5422M2109
16078a68529R556J5855N2378N6630J9132K5632O7051k2190m7219j3405K4449O318
16066B5658m2743l0607M178N6448J1624L929j6107o1438p2856j984M9319M4738
$$ plain form
16151 -135488 -61528 -3572 3543 -66370 -24342 451 -28907 8423 -55730 -70550 -68471 -10044
16139 -10044 -22801 -23439 -88543 -62645 -74745 -59880 -34090 -1998 -26395 -60024 -89862 -97330
16127 -97330 -110033 -125433 -114207 -116314 -136065 -168105 -100477 -16794 -12483 -6990 10195 -24583
16115 -24583 -69530 -75255 -58103 -494 18710 2047 19262 40483 44313 48593 58091 63305 89362
16102 89362 60060 30241 11555 -33301 -59719 -109388 -75291 -89203 -89447 -79466 -72893 -115494
16090 -115494 -144001 -127789 -36221 -81473 -161946 -169527 -127296 -78134 -137137 -195216 -210638 -168529
16078 -168529 -158973 -143118 -90740 -34110 -14978 10654 77705 55515 8296 -5109 19340 25658
16066 25658 -17085 -47692 -43514 12934 24558 28487 12380 -49058 -121914 -123898 -74579 -29841
16054b9841L9521P0748N120j29387o8602J0569K9296K1135l3493Q78O3411K8251
16042G606N9100n346m1701N070r1571K0561j8241J5024P339o2752r1697M6682
16030a49926O6443L5701L022m9607P723K5422n6915n8567N6120R438r55M5690
16018f6411J7830J3514p3114L8686M7995L15m2060n086R5228O3820n3977p6412
16006c9672N645Q3538L3371p5354k0045K5192l8607l1144K2729q903r170N214
15994d7206K2491N7456k6095K625K9345p1603m4262K0882L7098R0627m429j6997
15982D9932n9367l8052k4879k8402n9057J1363L6519L5242J7793o2140L5318N857
15970g9873j01990M2707P3733M4883K3092n2854K3515M9038M949k7989K8829l0659
$$ plain form
16054 -29841 9680 80428 85548 -43839 -112441 -101872 -72576 -51441 -84934 -84056 -20645 7606
16042 7606 66706 61360 19659 24729 -66842 -46281 -64522 -49498 -42159 -104911 -196608 -149926
16030 -149926 -83483 -47782 -44760 -94367 -86644 -61222 -118137 -176704 -120584 -111146 -112101 -66411
16018 -66411 -48581 -35067 -108181 -69495 -21500 -21185 -63245 -68331 26897 90717 36740 -39672
16006 -39672 -34027 49511 82882 7528 -12517 12675 -25932 -57076 -34347 -43250 -52420 -47206
15994 -47206 -24715 32741 6646 9271 38616 -32987 -77249 -56367 -19269 71358 66929 49932
15982 49932 -9435 -47487 -72366 -100768 -159825 -148462 -111943 -76701 -58908 -121048 -85730 -79873
15970 -79873 -181863 -139156 -65423 -20540 2552 -50302 -26787 22251 27200 -789 28040 -2619
15958b619K8599J9837j8183o4325o9707N5269O1204Q331j1n3287m9232L6721N2578
15945E175Q763o190k9551R07M2906J4813J0916J2280Q011j5831q752j48105o2470
15932a67128R9449L6789J0780m3491K2873L9691J11073m6047k0212j0298K66l8000
15920d255J1642q981n8283L9173R7608j5912M3590q643L839K3460k6648o6801
15908B9789o0253l054l1039k6839K2089N0598K7244j3372r213l3613q437L7084
15896a9016o711J6751O6551O5830k4408n4391m0117N0079M3597n6537o0767l3403
15884e2542k9532K5097K7046n4627r52m330m2190K2905L8524J03421M007m420
15872C2407J8414o5089l0577m764K9730J5036j380J3297L0779K4252q008j4679
$$ plain form
15958 -2619 25980 45817 27634 -36691 -106398 -51129 10075 18406 18395 -34892 -84124 -47403 5175
15945 5175 13938 7748 -21803 -20896 22010 36823 47739 60019 68030 52199 43447 -104658 -167128
15932 -167128 -67679 -30890 -20110 -63601 -40728 -1037 110036 63989 43777 33479 33745 -4255
15920 -4255 7387 -1594 -59877 -20704 76904 60992 104582 95939 99778 123238 96590 29789
15908 29789 -30464 -33518 -64557 -91396 -69307 -18709 8535 -4837 -14050 -47663 -56100 -19016
15896 -19016 -25727 -8976 57575 123405 98997 44606 4489 54568 98165 41628 -19139 -52542
15884 -52542 -82074 -56977 -29931 -84558 -85510 -89840 -132030 -109125 -70601 32820 36827 32407
15872 32407 50821 -14268 -44845 -49609 -19879 -4843 -6223 7074 37853 62105 54097 39418
15860C9418m9729m3987J3517L5779j8494o4415K5165K9720M7363N8475j6086K5737
15848H2463k8108r2847j1609L2314M542K5637L3189L5643N796m9863m3236J391
15836d688N9569l7815r0742K2071j6214l5944o806K1537O0889O0143K1107k0926
15824C2181k5867l8991j4308O117M1194N2441o6043n1299p555K329J4269l1843
15812h7375j5621K676M2335L2502q818J51801P8254q1683n7570k8984L07O460
15800C4284k8731P092K53j16586m2966N7508P5384L7478L9366m7129j05015J8793
15788g0269O1050k6794J8774L039J0235l4097L2478Q752l2570m0583k3999N1093
15776d2891n001K1270J0388L5817k6137K4002L7296m7196l5733l2889M9505L4527
$$ plain form
15860 39418 -10311 -54298 -40781 -5002 -23496 -87911 -62746 -33026 14337 72812 56726 82463
15848 82463 54355 -38492 -50101 -17787 -13245 12392 45581 81224 87020 37157 -6079 -4688
15836 -4688 54881 17066 -73676 -51605 -67819 -103763 -110569 -89032 -28143 32000 53107 32181
15824 32181 6314 -32677 -46985 -40868 326 52767 -13276 -64575 -72130 -69801 -55532 -87375
15812 -87375 -102996 -100320 -57985 -25483 -34301 117500 195754 114071 56501 27517 27824 34284
15800 34284 5553 12645 12898 -103688 -146654 -89146 -13762 23716 63082 15953 -89062 -70269
15788 -70269 -9219 -36013 -17239 -14200 -3965 -38062 -5584 3168 -29402 -69985 -93984 -42891
15776 -42891 -47892 -26622 -16234 19583 -6554 17448 54744 7548 -28185 -61074 -11569 22958
15764B2958N2922K2499l2503o8902r4409m2051L4526M7110J0371m7509o279L0678
15752g0589J4298J051J2762K7051L114n562j9592O412M2517o423n8815l0503j6683
15739a00962J4684L7705J1120O5854J4959m8469n6822J0075M597J2792M1582P184
15727A4299l0353m019L4223K8079l4513R913P7375M2938q3568j19952r197K5507
15715d9268Q5549L1001l8490j4828r5097P343l4616J2788P4062k6016l1380M887
15703g4065K7531o003L2484L0155m8168J9880M9062j0706j5664r722L192j9437
15691b1461j850l626j4966l8111k3769M3928K5969K6666L8415l3794n8351L3379
15679b7571j9066m3378n0408k6582N7190P1969J7191Q3152m2545n422l1371m4005
$$ plain form
15764 22958 75880 98379 65876 -3026 -97435 -139486 -104960 -57850 -47479 -94988 -101267 -70589
15752 -70589 -56291 -55240 -42478 -15427 -12313 -17875 -37467 -31055 11462 5039 -53776 -84279 -100962
15739 -100962 -86278 -48573 -37453 28401 43360 -5109 -61931 -51856 -47259 -34467 7115 14299
15727 14299 -16054 -20073 14150 42229 7716 17629 95004 137942 54374 -65578 -74775 -49268
15715 -49268 36281 67282 28792 13964 -81133 -73790 -108406 -95618 -21556 -47572 -78952 -74065
15703 -74065 -46534 -52537 -20053 10102 -38066 -18186 30876 20170 4506 -5216 -2024 -21461
15691 -21461 -23311 -26937 -41903 -80014 -103783 -59855 -33886 -7220 31195 -2599 -60950 -27571
15679 -27571 -46637 -90015 -140423 -167005 -109815 -37846 -20655 62497 19952 14530 -16841 -60846
15667f0846L744j1791L5521J5661N2977n2913l3434R2056m48j14246p9518L5766
15655a17471M8050J7302l4686Q053K4522l4352k8020N0205Q838k2940k274K1996
15643f0777J8891J1152O4261J8858j12159p3534Q509k035O9292J06707J2646j03835
15631d2024j311J9419K5074j2615L2827O0413k8091p0523p2711k9737P0888Q3635
15619C5244o3331L3397L841J9493P853j7042l829l504l4435l1920k3260j0688
15607h8181n3903K0086M6150J1076M7649L7466J7144j586p8075J2694K1748O8338
15595F0606M2344K0878m4351P554o8727k9382O7130p366q2384J1502M8964n6929
15583c0161k2275O8881J7030L8142m0334m1477q1073m6695L2453o0496Q726J2707
$$ plain form
15667 -60846 -57102 -68893 -33372 -17711 35266 -17647 -51081 40975 40527 -73719 -153237 -117471
15655 -117471 -69421 -52119 -86805 -78752 -54230 -88582 -116602 -66397 -57559 -80499 -82773 -60777
15643 -60777 -41886 -30734 33527 52385 -59774 -133308 -124799 -126834 -57542 49165 61811 -42024
15631 -42024 -43335 -23916 1158 -11457 21370 81783 53692 -16831 -89542 -119279 -48391 35244
15619 35244 -28087 5310 9151 28644 36497 19455 15626 12122 -22313 -54233 -77493 -88181
15607 -88181 -142084 -121998 -75848 -64772 -17123 20343 37487 35901 -42174 -29480 -7732 60606
15595 60606 102950 123828 79477 87031 18304 -11078 56052 48686 -33698 -22196 26768 -30161
15583 -30161 -52436 16445 33475 71617 31283 -10194 -91267 -137962 -105509 -166005 -157279 -144572
15571a44572M7502L0675m091n842j2832N0840N6996m706q0296o4775k9788O4340
15559i6549R7103N0742J3624p373l212m2439J800J0204M0030q091m4252p3665
15547f2078j0214J6324P9406O474K96q520L3679K4108k6057n5452J6993l1926
15535a6967L7656K9232P999m6331N3703p293n6568m7571J7563J7981J0706N6458
15523E6568M045j15514m9936M9671Q0616J5042K7510L6584n8939k3154K1821m5041
15511g27n851o0574m3348L4969M7181l3273l8155k7457M7048L5312K1443m1509
15499f4941o2580K9298M0502J3373Q456l3596O172j3024N9109M3047j2200J1744
15487B5360n5730J0048M2986n4425K182J2034K0015j5873l2809p9320J103J15189
$$ plain form
15571 -144572 -97070 -66395 -70486 -76328 -89160 -38320 18676 13970 -66326 -131101 -160889 -96549
15559 -96549 554 51296 64920 57547 54335 11896 13696 23900 63930 55839 11587 -62078
15547 -62078 -72292 -55968 23438 29912 30208 21688 55367 79475 53418 -2034 14959 -16967
15535 -16967 20689 49921 57920 11589 65292 57999 1431 -46140 -28577 -10596 110 56568
15523 56568 60613 -54901 -104837 -55166 25450 40492 68002 104586 45647 22493 44314 -727
15511 -727 -6578 -67152 -110500 -75531 -28350 -61623 -99778 -127235 -80187 -44875 -23432 -64941
15499 -64941 -127521 -98223 -57721 -44348 -35892 -69488 -63316 -76340 -17231 25816 13616 25360
15487 25360 -30370 -20322 22664 -31761 -29579 -17545 2470 -13403 -46212 -125532 -124429 -9240
15475i240K3493m1180m7409p146J9696j3737J5826l2023M272P4794K1133L4669
15463D3148k9959J7980M2699N368J3604l9464k5706m4960n740j1372l2780p641
15451g4823R512Q918R877P9033O4724M1178j407j01818m1676o4968K4764R1379
15439D4693J9610m0329l6787j9661M9853m2847k6923K0470j8254K1551n42M0419
15427A1253j5202m3104K2767J9870N0250M830O3575k2844j23844l9195L0782M727
15415c6135l4129n935O778N7838J3675l3672j4109L6095J6185o6523R1851k9312
15403B607k7526J6380j0964R148j1968Q011M0791o3542j1862Q6210Q4899n8417
15391F3767o8801j5686Q1543L8027q4142n2487J0462M0213l7629l2635k0339p841
$$ plain form
15475 -9240 14253 -26927 -74336 -81482 -61786 -75523 -59697 -91720 -87448 -12654 8479 43148
15463 43148 13189 31169 73868 79236 92840 53376 27670 -17290 -23030 -34402 -67182 -74823
15451 -74823 -65311 -56393 -46516 32517 97241 138419 137012 35194 -6482 -71450 -46686 44693
15439 44693 64303 23974 -12813 -32474 17379 -25468 -52391 -31921 -50175 -28624 -29166 11253
15427 11253 -3949 -47053 -24286 -4416 45834 50664 114239 91395 -32449 -71644 -40862 -36135
15415 -36135 -70264 -76199 -69421 -11583 2092 -31580 -45689 -9594 6591 -59932 31919 2607
15403 2607 -24919 -8539 -19503 -10355 -22323 -14312 26479 -37063 -48925 37285 122184 63767
15391 63767 -5034 -20720 60823 98850 14708 -37779 -27317 12896 -24733 -57368 -77707 -85548
15379h5548O4180J6192j03882K9762N6511M6227L7155K4684Q786l5964N210k5853
15367C7460j0841m758o020m5460m1126Q209J06034N1428j20508l3306J2460m893
15355e1321k6955N0544L4977k4209M163j4680M8525R8012j5491q3726p0191j15366
15343a65718j6936Q0988P8290N3771K5493K8998m3171m8931R9681O8518j5430
15332A45553j10276K6045m8299j7667q768j4856M1715K6978j7925k4176N7845
15321E6169n5622k9426M2258k9517J2955R142k6326k2824j0292J4222K5246k1088
15309c5103k5593j7684N6060n987J069K6816j6872Q4544L8504l0026j9785O4574
15297A20517k0795j30339m5200J2703P0429m7475p82L6342J922N6554o341q533
$$ plain form
15379 -85548 -21368 -5176 -109058 -79296 -22785 23442 60597 85281 94067 58103 63313 37460
15367 37460 26619 21861 15841 -29619 -70745 -62536 43498 94926 -25582 -58888 -46428 -51321
15355 -51321 -78276 -27732 7245 -16964 -12801 -27481 21044 119056 103565 19839 -50352 -165718
15343 -165718 -182654 -101666 -23376 30395 55888 84886 41715 -7216 92465 160983 145553
15332 145553 35277 61322 13023 -4644 -13412 -28268 13447 40425 22500 -1676 56169
15321 56169 547 -28879 13379 -16138 -3183 5959 -20367 -43191 -53483 -39261 -14015 -35103
15309 -35103 -60696 -78380 -22320 -28307 -27238 -422 -17294 67250 105754 75728 55943 120517
15297 120517 99722 -30617 -75817 -63114 7315 -40160 -40942 -4600 -2678 53876 47535 39002
15285C9002J4371j6361r0750o02M296m60l8978N8430O6835O667N2699L4491N5421
15272A85061M0405o3364o5319o7534m9319l9595N4535N9088q954R724l5333Q782
15260B8177j5357N2881k8326j2325M3019k1863L1464L4749j472k1480M17l9762
15248E0122L3255j7185J9999m061m2165q7760k9227N6736R0064P533n3260m5438
15236b1387N3701M1968k0672k8861O2661K6804N2801J14405L7649r1188p7152
15225A50729O4989N5409q241K245Q7253K25348M28173N78999P08388Q70621Q39588
15214D003501O86679L07762j55041n94422q10246q22643p32332n89306l43919
15205I50033l01333k14854o3625j3924j3481n1662j264j4596j1522m5005J7944
$$ plain form
15285 39002 53373 37012 -53738 -54340 -50044 -50504 -89482 -31052 35783 42450 95149 129640 185061
15272 185061 225466 162102 96783 29249 -20070 -59665 -5130 53958 45004 54728 19395 28177
15260 28177 12820 65701 37375 25050 68069 46206 77670 112419 110947 89467 89884 50122
15248 50122 83377 66192 86191 82130 39965 -47795 -77022 -20286 69778 77311 24051 -21387
15236 -21387 32314 74282 53610 24749 87410 114214 167015 281420 319069 227881 150729
15225 150729 215718 271127 262886 265131 352384 577732 1005905 1584904 2293292 3163913 4003501
15214 4003501 4690180 4997942 4842901 4248479 3438233 2615590 1883258 1293952 950033
15205 950033 648700 433846 370221 356297 342816 291154 289890 275294 263772 218767 236711
15194B36711r260j8818l4825l4974P6734N2223r2845n0466M250L524p933J1214
15182A35535K4018L6078o894l2516n0994n5526J8456P579k2859j8200L556J7059
15170E5292L0724P938k2139l1537Q073M58M0300J09925J9119j2879J855J040M101
15157B12270J8580n6112m9718k1691j3274n5450k7048n4929j0879J5488J4971
15146b7792J8182O200J6458q104l9845k9074q7411J212L91M3308N5319n8577M2047
15133f7686N4535K4141J2J2095M0106m8501j0599k0916p0996K3412L8546J9264
15121f587L996M4838L7723m0744q177K7559J4726O1243n410j07532o291j5494
15109a50N2438m1964o8479J7765O0055Q331K3625j5564N2816j9733p0858k7985
$$ plain form
15194 236711 227451 208633 173808 138834 215568 267791 174946 124480 128730 132254 124321 135535
15182 135535 159553 195631 188737 156221 105227 49701 68157 75736 52877 34677 38233 55292
15170 55292 86016 93954 71815 40278 48351 48809 89109 199034 218153 205274 207129 208169 212270
15157 212270 230850 174738 125020 103329 90055 34605 7557 -47372 -58251 -42763 -27792
15146 -27792 -9610 -3410 13048 4944 -34901 -63975 -151386 -150174 -149783 -106475 -51156 -109733 -67686
15133 -67686 -13151 10990 11002 23097 63203 14702 4103 -16813 -87809 -64397 -25851 -6587
15121 -6587 -2591 42247 79970 39226 31049 58608 73334 134577 129167 21635 15344 -150
15109 -150 52288 10324 -58155 -40390 19665 27996 51621 36057 88873 69140 -1718 -29703
15097b9703M3766R8534J224k7821k8232n206J3106j1208j888J2504k4108N075
15085D6043l3472o2946r990q186P4109N1508o3798N89J6203l4731n135l8450q3181
15072a51437K4369O0105J8355M331j88M3972J12460l0841k8296P9790n4880q7277
15060i537l4139M8655k4679j104L8847L7480K0520j8441o8280Q386O0080j5297
15048D2491K6431o2762q0864J7804J9712N4572M1597n081j8240l167j0762K1628
15036D3359L5728J835n2327o8646M9398M4550k5047l9701j1679J4718Q582J802
15024B572P473R31M5887K2595k3077k1167o692O271o944j641K7278M0318J6310
15011A10114j5981k9759j8712J4941K0095k4407p3015l991N5332M4838k9499n9033
$$ plain form
15097 -29703 14063 112597 113821 86000 57768 52562 65668 54460 52572 65076 40968 46043
15085 46043 12571 -50375 -60365 -68551 5558 57066 -6732 -6143 10060 -24671 -29806 -68256 -151437
15072 -151437 -127068 -66963 -48608 -44277 -44465 -493 111967 81126 52830 132620 77740 -9537
15060 -9537 -43676 4979 -19700 -20804 18043 55523 76043 57602 -10678 -2292 57788 42491
15048 42491 68922 6160 -74704 -56900 -37188 17384 58981 53900 35660 32493 21731 43359
15036 43359 79087 80922 28595 -40051 9347 53897 28850 -10851 -22530 -7812 770 2572
15024 2572 10045 10976 56863 79458 56381 35214 28522 34793 27849 26208 53486 93804 110114
15011 110114 94133 64374 45662 60603 80698 56291 -16724 -20715 34617 79455 49956 -9077
14999i077O2947j3444o9249k2480M323P5480L7639m8579m297L5703J8830n1849
14987A5947k9109K3641K6965M8091r0695k5879j9150M3380R249l9225L3693O6104
14975F3012O9715m0370q1091o292n5449J640l3539J1110Q5947k9168m8823O4012
14963G04L1082n3582M913K3258K775j0953O0543Q7476J3210K9912n6378k2182
14951A10778n6628l6946M5071M4122m0331m6887l6964k2352P971K5445J1124o9093
14939f4690L0550P7162l7185q925k7291l3432j8518R6097P745q5730K8285N6645
14927B0713j7525o0258q712L754K8041N7533L544p6901q2185K2678O8086Q1808
14915D0576K6904M0350L3571j4322L50l2257l6365j330k2037q869J3427j6986
$$ plain form
14999 -9077 53870 40426 -28823 -51303 -46980 28500 66139 17560 13263 48966 67796 15947
14987 15947 -13162 10479 37444 85535 -5160 -31039 -50189 -6809 2440 -36785 -3092 63012
14975 63012 132727 92357 11266 4974 -50475 -48835 -82374 -71264 14683 -14485 -63308 704
14963 704 31786 -21796 -16883 6375 9150 -1803 58740 146216 159426 189338 132960 110778
14951 110778 54150 17204 62275 106397 66066 19179 -17785 -40137 -32166 -6721 4403 -64690
14939 -64690 -34140 43022 5837 -3088 -30379 -63811 -82329 13768 21513 -64217 -35932 20713
14927 20713 3188 -57070 -65782 -62028 -33987 23546 27090 -49811 -131996 -109318 -41232 40576
14915 40576 67480 107830 141401 127079 127429 95172 58807 57477 35440 26571 39998 23012
14903B3012q1884J6103K399k5267k5119P5730J11660R6939P583n381O985m0675
14891A62085o9524l4120r1039l9991m723P5562k9279l7673L8581J10249O948p5552
14879A1524l5635m390L2986p0665p939O0096P0180k323p0423J4384m5000R732
14867c7473N1590R7944L557n8544q0219j1663l1937N768Q1984k492O0603k3742
14855E5376l5045N5480K1404l7700l3484k799m3746J4778J5777K4822r2861n2290
14843a10288l610K5371N7447M9982J7513J275o329q7079j07647K7005L9504k0978
14831a17834j5209K4946O0964l661K9818j4760k8941L983m2210J3947O7463L6582
14819A5088J0857q9479o3169J7818J0988L1578o472K2323J2791J2280k079m2184
$$ plain form
14903 23012 -58872 -42769 -40370 -65637 -90756 -15026 96634 193573 201156 195775 202760 162085
14891 162085 92561 58441 -32598 -72589 -77312 -1750 -31029 -68702 -30121 80128 87076 11524
14879 11524 -24111 -28501 4485 -66180 -74119 -14023 56157 53834 -16589 -2205 -47205 -37473
14867 -37473 14117 112061 115618 57074 -23145 -34808 -66745 -60977 21007 18515 79118 55376
14855 55376 20331 75811 97215 59515 26031 23232 -20514 -5736 10041 34863 -57998 -110288
14843 -110288 -113898 -88527 -31080 18902 36415 37690 31361 -55718 -163365 -136360 -96856 -117834
14831 -117834 -133043 -108097 -47133 -50794 -20976 -35736 -64677 -60694 -102904 -88957 -21494 15088
14819 15088 25945 -63534 -126703 -108885 -97897 -66319 -72791 -50468 -37677 -25397 -27476 -69660
14807f9660O0144L0262k1962J068J795n7530J9403j5201J273L5295K4443p6757
14795f7427N1166L222j4931q5591K4384Q3673P4021k0539o5401n4574k4061n0123
14783a46181O9333K0383O5912P1971k1168l1217n8549n2489m4401K476K1794m658
14771a06794o5050M1727N5346N630O8237K804l1793M7144m201J7338R134J7601
14759E7123O823L0507K9115n4192K0255j1560K5968m127n1847P039K214l1376
14747B5942l744r726m1065o8965j8468j0372p557J4800j0708O3344P3971O1109
14735F8561L0013n4561p8550N32R2878Q0539j9095m2713k9948K8641l2053l3099
14723A1145n5648o157N1574k7372O0536k2263L706j611M7075m6028l3334L7686
$$ plain form
14807 -69660 -9516 20746 -1216 -148 1647 -55883 -36480 -51681 -50408 -15113 9330 -67427
14795 -67427 -16261 -13039 -27970 -113561 -89177 -5504 68517 47978 -17423 -71997 -96058 -146181
14783 -146181 -76848 -56465 9447 81418 60250 29033 -29516 -82005 -126406 -123930 -102136 -106794
14771 -106794 -171844 -130117 -74771 -69141 -904 1900 -29893 17251 13050 30388 39522 57123
14759 57123 63946 94453 123568 69376 89631 78071 104039 99912 48065 55104 57318 25942
14747 25942 22198 12472 -28593 -97558 -116026 -126398 -133955 -119155 -129863 -66519 7452 68561
14735 68561 98574 44013 -34537 -34005 58873 139412 120317 77604 47656 76297 44244 11145
14723 11145 -44503 -50660 914 -26458 34078 11815 15521 13910 60985 14957 -18377 19309
14711A9309N286P259J1601j5489m6554K3107K5701o952K2214k1045J8138L5437
14699G8012P814L4550O6290n4177p6732m1353k7743N1362l5196j3187o7441j5973
14687i3774O386M0903J6448M5116N5579K5148N1172l6220O030N0871p5334k0258
14675G2067Q611K3069m1704p1015K4151P578k2566N6089J4320R902L4544j8879
14663I6167l3387l0041l1405k8940l100M2302K2544J7671K1995j09504n8244K4972
14651f8970P4420N335k6903n9092n3011J9769O1962K6359o2647K9264O7721j1926
14639B281n3617K4338Q312L843l543O203K8389k0229N890J7161J6651j595J8288
14626E2372o1839p2089J6815K582N7229j8698k1948j18M0941M2762n027L5327
$$ plain form
14711 19309 24595 31854 43455 27966 -18588 4519 30220 23268 45482 24437 42575 78012
14699 78012 85826 120376 186666 132489 55757 14404 -13339 38023 2827 -10360 -77801 -93774
14687 -93774 -87388 -46485 -30037 15079 70658 95806 146978 110758 116788 167659 92325 72067
14675 72067 80678 103747 62043 -8972 15179 22757 191 56280 70600 80502 115046 96167
14663 96167 62780 32739 1334 -27606 -30706 11596 34140 51811 73806 -35698 -93942 -68970
14651 -68970 5450 10785 -16118 -75210 -128221 -108452 -46490 -20131 -82778 -53514 14207 2281
14639 2281 -51336 -26998 -18686 -14843 -18386 -12183 16206 -4023 1867 19028 35679 34084 52372
14626 52372 -9467 -81556 -64741 -62159 -4930 -23628 -45576 -45694 -4753 38009 32982 68309
14614F8309l0007l0259L7199M2501l0379L976o4496N7296N9208j5327k6743r5421
14602b4143L0427N1039K9345K3219k3787l4443o4840P7113P1685m4976k6828K5677
14590H9488m937o9760M0551K6148O266J917L7110L9954P8632Q4518J44717J80455
14578F55059K21832L04931K93257J17474P632q1938j98499l02672k36908j97990
14568E82178j80703q5638k085m8352k1517j2227n8708m2755q8489m7173M6975
14557D1506N8308Q5078P5591j4306l2386m1301n3624l6344k415K4907l6248o3644
14545E122K4748M2372K7835l8592q1484j4229j6344N5752n8643N662K4479j9977
14533d3299k6044M0271Q5836L587M4136l070j8082L6080Q871q988k4369k9335
$$ plain form
14614 68309 38302 8043 45242 87743 57364 61340 -3156 54140 113348 98021 71278 -24143
14602 -24143 6284 57323 86668 109887 86100 51657 -13183 63930 135615 90639 63811 89488
14590 89488 84551 14791 55342 81490 87756 89673 126783 166737 245369 329887 474604 655059
14578 655059 876891 1181822 1475079 1592553 1600185 1518247 1319748 1017076 780168 582178
14568 582178 401475 315837 313752 265400 243883 231656 172948 130193 41704 -5469 41506
14557 41506 99814 184892 260483 246177 213791 172490 118866 82522 80107 105014 68766 5122
14545 5122 29870 72242 100077 61485 -19999 -34228 -50572 5180 -53463 -47801 -23322 -43299
14533 -43299 -69343 -29072 56764 60351 104487 101417 83335 119415 128286 119298 94929 65594
14521F5594k5132l8344L6068l93k055k972L4356N5335r226q4276l8209J9508l95
14508I859K5845K2118l3189m6417n9769J2403K0622N0470k8682m0396N4155O360
14496f621J5790N220j4349J7759n723J5529l3875l8915K3201L7609P6245L1793
14484A23663k6914J4283K1499m0424o6379n056N81R61k0521l471J9679K6863K0288
14471F5052n115m8427K2202l5215l8805J4158J505P018L8514M2721P834Q2143
14459A53585k003r229n2980p3127Q5608O9346K911n2736q3327L3671N0825Q7442
14447B09986m2506j7178j08l4130n9728j7233r130P4088N5798j1102J2619M9191
14435B10567J0149l2133m9079o9984J4050K9820k506p444j2592j3577J2225K5563
$$ plain form
14521 65594 40462 2118 38186 37793 35738 32766 67122 122457 113231 28955 -9254 10254 9859
14508 9859 35704 57822 24633 -21784 -81553 -69150 -48528 1942 -26740 -67136 -12981 -6621
14496 -6621 9169 14389 40 17799 12076 27605 -6270 -45185 -21984 15625 91870 123663
14484 123663 96749 111032 132531 92107 25728 20672 21253 22214 1693 -1778 17901 44764 65052
14471 65052 59937 11510 33712 -1503 -40308 -26150 -24645 -17627 20887 63608 71442 153585
14459 153585 151582 142353 89373 16246 101854 171200 174111 121375 38048 71719 122544 209986
14447 209986 167480 150302 150194 116064 56336 39103 29973 104061 159859 148757 161376 210567
14435 210567 220716 188583 139504 69520 83570 113390 110884 103440 90848 77271 89496 115059
14423A15059M4463J7252j5418K4388Q00j15052r7128M450R1149J24689m1329n5904
14411I7419n8675k9263P6900K8101j2786N8240j582q3958m5059m4445N330J2794
14399C016P444P831l3284j0175M1565K3213o7835k4886N2278j3022O0302M3912
14387I0359o4071k2499P4955K6093j0212J4112M1549j3280p4315q958L5747J5576
14375A05056L1985J4449l7640J1949k6243J8920M8068J110p0172L1627q6214m2411
14363D84L6636L2455P901L2067l9473l9154M1079O4490l175k5317M4988L2843
14351A85824K8645p0889o9438P792L9948L2443j9957L5514P5742J4209L7636j94
14339B97275L710P4965m3432j7507j055o6548l5446k9952k0271L0403P432j1509
$$ plain form
14423 115059 159522 176774 161356 185744 186544 71492 -25636 -21186 69963 194652 153323 97419
14411 97419 38744 9481 86381 114482 101696 159936 158354 74396 29337 -15108 -9778 3016
14399 3016 10460 18291 -14993 -25168 16397 39610 -28225 -53111 -833 -13855 46447 90359
14387 90359 26288 3789 78744 104837 94625 108737 150286 137006 62691 53733 89480 105056
14375 105056 137041 151490 113850 125799 99556 118476 166544 167654 97482 129109 42895 484
14363 484 37120 69575 77476 109543 70070 30916 71995 136485 133310 107993 152981 185824
14351 185824 214469 143580 74142 81934 121882 154325 134368 169882 245624 259833 297469 297275
14339 297275 300985 375950 332518 315011 313956 247408 211962 182010 161739 192142 199574 188065
14327A88065K9392k6634N0255O2288J2291m5567j12996l0191M6449P6804Q8009
14316C38165N880J077m1325M6689J46383R4777J30936K73738L00715L78621N76068
14305B251724O89040Q00177O87764L39979k4477j52537m94348p72066o65787n99273
14295B060196n03350l22916k02788j05095o4617j10619j22301p5730m1716o315
14285E04749M7345l5655q3958j04251r0090J7572J8185l3581k3454L7583k6843
14274B27602o0459m4679L5204M6689j4477q73l2061l204m2220Q695L3887k0938
14262A33166k9172O7875K6005K1063j0459K6060p510N7269K3232j2659m0888Q2972
14250C36954k0661o2041O5729M4967k7385p213q611k6262J3644l5865l0529m3034
$$ plain form
14327 188065 217457 190823 241078 303366 315657 270090 157094 126903 173352 250156 338165
14316 338165 344045 345122 303797 350486 496869 591646 722582 996320 1297035 1675656 2251724
14305 2251724 2940764 3740941 4428705 4768684 4744207 4591670 4097322 3325256 2659469 2060196
14295 2060196 1556846 1233930 1031142 926047 861430 750811 628510 552780 511064 504749
14285 504749 552094 516439 432481 328230 238140 255712 273897 240316 216862 254445 227602
14274 227602 167143 122464 157668 204357 189880 189007 156946 153742 111522 120217 154104 133166
14262 133166 103994 171869 197874 218937 208478 234538 227028 284297 307529 294870 253982 336954
14250 336954 316293 254252 319981 364948 337563 330350 321739 295477 309121 273256 242727 199693
14238A99693M9630O5355Q0139J4987P7657N1272m0066j2355M6424N1261R495L9773
14226F33265O3882M7637P2651J43206K52816L65101N83072P48987J084542J561450
14216E556609J806781J704052Q95977q7156r82742j745373j691815j471931j144572
14207B839830p01255l64698j78563j77119k27812j05859p4899j15671j19249n8330
14197G16375l7266J0858p3513p0286J4676q401n2315L1379M7128J6016K9027j11260
14185E12418l5697n240J1418P734m5965j4623M4287K3104l6039n6144Q466o1585
14173C52134K8533J32261J53475K4013p4846l7227m2313k6761L156O7557M7180
14162F27162J1778k0268k0063j3401L6779M8599L4477j8139k3476m838Q9143J01354
$$ plain form
14238 199693 249323 314678 394817 409804 487461 538733 498667 486312 532736 583997 593492 633265
14226 633265 697147 744784 817435 960641 1213457 1578558 2161630 2910617 3995159 5556609
14216 5556609 7363390 9067442 9963419 9876263 8893521 7148148 5456333 3984402 2839830
14207 2839830 2138575 1773877 1595314 1418195 1190383 1084524 1009625 893954 774705 716375
14197 716375 679109 689967 616454 546168 560844 552443 500128 531507 578635 594651 623678 512418
14185 512418 476721 471481 482899 490633 444668 430045 474332 497436 461397 405253 413719 352134
14173 352134 380667 512928 666403 690416 615570 578343 536030 509269 512425 579982 627162
14162 627162 638940 618672 598609 585208 621987 670586 705063 686924 663448 658610 747753 849107
14150H49107N4520k2704P927J0578O5533J8179K6438R147M8187L5714J12031J84738
14138A399395K69902L18895M26223N03581N21818L85449K18167P8292o2922k03251
14128C855549l63554l16578l15160j40030p8945j35907p2853J9380R4915R4067
14118B640884R5199O6130O0446J61132J44087J36591K08855K22448K16836L41474
14108D294082L53140L43872M09419M95845O43182Q30536R84604J084441J401045
14099A0840166J693071J894337K067948K306200K798196L671601N322249Q085369
14091C8679137J2484640J9228127K9199238M2382113N5329728O0713384N0832037
14084C08848404J9167666j5166149m6574934o2151391n6568120m3066182k9032020
$$ plain form
14150 849107 903627 880923 888850 899428 964961 983140 1009578 1018725 1066912 1102626 1214657 1399395
14138 1399395 1669297 1988192 2414415 2917996 3439814 3825263 4043430 4121722 4058800 3855549
14128 3855549 3491995 3175417 2860257 2720227 2641282 2505375 2432522 2451902 2546817 2640884
14118 2640884 2736083 2802213 2862659 3023791 3167878 3304469 3513324 3735772 3952608 4294082
14108 4294082 4647222 4991094 5400513 5896358 6539540 7370076 8354680 9439121 10840166
14099 10840166 12533237 14427574 16495522 18801722 21599918 25271519 30593768 38679137
14091 38679137 51163777 70391904 99591142 141973255 197302983 258016367 308848404
14084 308848404 328016070 312849921 266274987 204123596 147555476 104489294 75457274
14077G5457274j8832303j2448876q559668n983431m322235l226368k575938k278716
14069A7229739k188386k041911j841114j562619j252404r87372q41732p06626
14061E807575n91478n03411m90247m47120l22066k57600k88110k09918k45274
14052B452351k00260j35116j44868j29820o9702j47185o2696l4138n9146k2261
14042A447159m3672k1031Q524r1895r8320Q553m8272J0798J300o1447q0244p7812
14030I53641p2894l2165m4423o2019l8543m6438K4973P043p4226o2311o0797k2851
14018D68990P5124k5953j1134l0473J3741j7108j4408J9582j48413k4368J9395
14007C24975L7088J2070J3577L662k0638n6277L4p146m0889k0729m0703L904J3345
$$ plain form
14077 75457274 56624971 44176095 35616427 29632996 25310761 22084393 19508455 17229739
14069 17229739 15041353 12999442 11158328 9595709 8343305 7355933 6514201 5807575
14061 5807575 5216097 4712686 4222439 3775319 3453253 3195653 2907543 2697625 2452351
14052 2452351 2252091 2116975 1972107 1842287 1772585 1625400 1562704 1528566 1469420 1447159
14042 1447159 1403487 1382456 1390980 1299085 1200765 1209318 1161046 1171844 1173144 1111697 1031453 953641
14030 953641 880747 848582 804159 742140 703597 657159 682132 689175 614949 552638 491841 468990
14018 468990 544114 518161 507027 476554 490295 473187 458779 478361 329948 305580 324975
14007 324975 362063 374133 387710 391372 370734 314457 314491 307345 266456 245727 205024 208928 222273
13994B22273M955M0787M8572K9659L637l3821j3689M397P8050N1615P4083J80210
13982F90728K02346J37809J12332m640j2760n8785l3395j35118j90984k45059
13972D62474p7214j8964k8876n4339l9615L6726o5007q9285o9468o4841J3115
13961D706J53424K08189Q5729J0210k0808j032k7682p762o0518m3731l1433l4964
13949B34328L0673J3822n6033J4127K4059m5403j02735m266M0427k405J721l7626
13937A10689O0857L457j2912p2807o2397L9521L3993m4069K7132K9460j6616N9747
13925A56055O3329o6151j9455n2258O950k3864k5371J8552L3410K3375P48K3477
13913A38797j9031M158J04938M2531n8766l3654k8919k8807j6201j4699k5643
$$ plain form
13994 222273 227228 268015 316587 346246 349883 316062 302373 306770 384820 436435 510518 690728
13982 690728 893074 1030883 1143215 1138575 1125815 1067030 1033635 898517 707533 462474
13972 462474 385260 366296 337420 283081 243466 280192 215185 125900 56432 -8409 4706
13961 4706 158130 366319 452048 462258 441450 440418 412736 404974 344456 300725 269292 234328
13949 234328 265001 278823 222790 236917 260976 215573 112838 108572 148999 146594 148315 110689
13937 110689 171546 175003 162091 89284 26887 66408 100401 56332 83464 112924 96308 156055
13925 156055 219384 153233 133778 81520 88470 64606 39235 57787 91197 114572 115320 138797
13913 138797 119766 123924 228862 271393 212627 178973 150054 121247 105046 90347 64704
13902F4704O9803P820n2187l0925P3396k6521j08690J795j7670M6868L4257j7566
13890D5084J5552L9260J518j314j0890o8624m2479N2747l455m278j7598L6839
13878D2362k0688m1728J7004j5153Q6055L1459J868k3081m3880j8418j0701R998
13866A5097k6311J1488K9784N6581J8696p3125O295L8494j2236j1837K6N8865
13854A11817k5158j3782m1250m4883n3867j5366N6128Q798j4067O6897K4342l1329
13842B8280K6781J965l2202k4172k769m1710j1983L1768N3562M0880P037n7011
13830B0426N024p6777Q118k1741l4663K6063O6984N3161P421l4286K2665K0063
13818F2458j856k3281o3262j3053j3208K2042L6134N1926k6451o7864o5582L9987
$$ plain form
13902 64704 134507 142327 90140 59215 132611 106090 -2600 -805 -18475 28393 62650 45084
13890 45084 60636 99896 101414 100100 89210 20586 -21893 30854 27399 23121 5523 42362
13878 42362 21674 -20054 -3050 -18203 67852 99311 101179 78098 34218 15800 5099 15097
13866 15097 -11214 274 30058 86639 105335 32210 38505 76999 64763 52926 52952 111817
13854 111817 86659 72877 31627 -13256 -67123 -82489 -26361 -17563 -31630 35267 59609 28280
13842 28280 55061 57026 24824 652 -2117 -43827 -55810 -24042 29520 70400 77437 20426
13830 20426 25450 -51327 -43209 -64950 -99613 -73550 -6566 46595 54016 19730 42395 62458
13818 62458 60602 37321 -25941 -38994 -52202 -30160 5974 57900 31449 -36415 -101997 -62010
13806f2010M1016k1119L423k5613Q073k6970J2541N3097J0200j5319q391N3438
13794B2366K3527m1494n2929K558K5577M750P0068j2712k3890m0457l2644J0504
13782d4776K4548j8676K7456K4994N0334n8394k5557N5125k2459o7549O0873M1419
13770D7338j3493m3887k3380j8406n3241k5943l3628M2910l7351R822K8625N9542
13758f1092K1333K1058j7180M030K7993N6805L8046p567l990l8367K139J5382
13746E8590n785j5858N278N8986m8976q951M9832n818l6618j4547K6354n5908
13734F579j8970J30520O516q377l651M210n7174l1854l5291L8620M6747q530n2308
13721A7037j0870L0109n5625N651J073m7219l4130P2172N6030M2081j419m5872
$$ plain form
13806 -62010 -20994 -42113 -38690 -64303 -56230 -83200 -70659 -17562 -7362 -22681 -31072 22366
13794 22366 45893 4399 -48530 -45972 -20395 -15645 54423 41711 17821 -22636 -55280 -44776
13782 -44776 -20228 -38904 -11448 13546 63880 5486 -20071 35054 12595 -54954 5919 47338
13770 47338 33845 -10042 -33422 -51828 -105069 -131012 -164640 -121730 -159081 -149259 -120634 -61092
13758 -61092 -39759 -18701 -35881 -31851 -3858 52947 90993 83426 79436 41069 43208 58590
13746 58590 52805 36947 42225 101211 52235 43284 93116 87298 50680 36133 62487 6579
13734 6579 -12391 118129 124645 116268 112617 116827 59653 27799 -7492 31128 77875 69345 17037
13721 17037 6167 36276 -19349 -13698 -12625 -59844 -93974 -21802 34228 76309 74890 29018
13709B9018K2222J5429j482m7916j7971N7223j3973N4373l694k0127k7050J3368
13697E9420n2455l522R041o521o29O832l1372M1345j6295l6241k170K9420L6556
13684C3409J8526J1606n7016o141M8220N4896K9523n1046m9256Q6494j1128l5696
13672G2391K6320J869q6431j2185L5264M9351L1751o871m5918p5555J4712J2453
13660A7151O3165L7693M5726m2142n1610n8248m5829L5807M3868K7205p2462p6031
13648g5707K3466O2820O1305J3094L5106o4866m2451O1037O590J3604o8608m2951
13636a7561O240j6108L0196P134q1633k1917J5869M9471M5229q871l908K061K9733
13623C5935K7765K6914J5821k9074k1169l2230r2766K6474N0818P6145j4493n3350
$$ plain form
13709 29018 51240 66669 65187 17271 -700 56523 42550 96923 93229 73102 46052 59420
13697 59420 6965 3443 12484 5963 5334 12166 -19206 22139 5844 -30397 -32567 -3147 33409
13684 33409 51935 63541 6525 384 48604 103500 133023 81977 32721 119215 108087 72391
13672 72391 98711 100580 14149 1964 37228 86579 118330 111459 65541 -10014 4698 17151
13660 17151 80316 118009 163735 121593 69983 11735 -34094 1713 45581 72786 324 -75707
13648 -75707 -52241 10579 71884 84978 120084 55218 12767 73804 80394 93998 25390 -17561
13636 -17561 -11321 -27429 2767 9901 -71732 -93649 -77780 -28309 16920 8049 4141 6202 35935
13623 35935 63700 90614 106435 77361 56192 23962 -68804 -42330 8488 84633 70140 16790
13611A6790K3735J1M0727J6469l9945L4574N8535j5997J1639N7096M2677L2447
13599B78758l8672K7209l4516n5568K0541M5200J22340J20488J23880J70124K23569
13588A003353L69912K47513J1281j16181j81003l02197l15375k48377j49712m0908
13578B78306K1409j8747o0230L733k8114q931l645m4600J2142l1608k319k0370
13566I7026M041k1119Q28p727K3884k6533m432p3418k1881O7636Q7498K9954p4425
13553H1332O308m2757j7790j1323L9799K9888q2025K1751N1332J9875M6851M88
13541A43729l8761n3249j0678K6224N2400q4122j04208m9915J48414J04630l7493
13530I6971q5n285m8717k4834Q705P328l4011P9500L5082k0553l4942o5070j6424
$$ plain form
13611 16790 40525 40536 81263 97732 57787 92361 150896 134899 146538 203634 246311 278758
13599 278758 240086 267295 232779 177211 197752 242952 365292 485780 609660 779784 1003353
13588 1003353 1373265 1620778 1632059 1515878 1334875 1032678 717303 468926 319214 278306
13578 278306 299715 280968 220738 224471 196357 187426 183781 139181 151323 119715 117396 97026
13566 97026 101067 79948 80776 73049 96933 70400 65968 -7450 -29331 38305 125803 155757 81332
13553 81332 87640 44883 27093 15770 55569 85457 3432 25183 76515 96390 143241 143729
13541 143729 104968 51719 41041 67265 119665 35543 -68665 -118580 29834 134464 96971
13530 96971 96886 91601 42884 18050 26755 34083 72 79572 114654 94101 59159 -5911 -22335
13517b2335Q0313O1486M6216k1881L169m4510o6895n048j32r919n6821j3055L8455
13504a0957J6041J01674N3186J6003q490n6299r0879j5069K2532J8993k682P6115
13492A20168N5282l7515o9734K1491m0074o047j7068k0962J8930j1007o2035k4610
13480g3181O431j2242m6379j6659J21672J04725O4129m3903p1659p6330N122M2720
13468D446J500P8948j450l788p9880o6339J9952J4407J9125J508k9044m641n363
13455e0619l6544M8304L3786J1381k4174M5922L5330k7615k1934q617n1498L6024
13443a0254O9849p823k0551p7757R255O7639p8497p7135M0137O6448Q6456K6646
13431I4413m0371J2033k52l3593l5790N5692j4642l5263l3415n575N7765Q4305
$$ plain form
13517 -22335 57978 119464 165680 143799 146968 102458 35563 30515 30383 20464 -36357 -49412 -10957
13504 -10957 5084 106758 159944 175947 167457 111158 20279 5210 27742 46735 44053 120168
13492 120168 175450 137935 68201 89692 49618 43571 26503 5541 24471 13464 -48571 -73181
13480 -73181 -66750 -78992 -125371 -142030 -20358 84367 148496 104593 32934 -43396 -38274 4446
13468 4446 5946 84894 83444 79656 -224 -66563 -46611 -32204 -13079 -11571 -40615 -45256 -50619
13455 -50619 -87163 -38859 -5073 6308 -17866 28056 63386 35771 13837 5220 -46278 -10254
13443 -10254 59595 51772 31221 -46536 -37281 30358 -48139 -125274 -85137 -18689 67767 94413
13431 94413 54042 66075 65823 32230 -3560 52132 37490 2227 -31188 -36763 21002 105307
13419A05307k3683n3788n1163l1245j4420Q5996M2743o8386j005J2245J7857m1862
13407b1404l5907N3621P1014L4899n4986K0175M7400M1767o726l7854j0079P77
13395A02697K373o2392k9188k579k2229J9802P259l9712K3188L4074L6072K8588
13383I7953L3584q7848J161L4697m1393N995l7053m2381J8831L1042J8712J7588
13371E0888K6754o8339M636l5842o553R448K3861R517J2979O395k800L5615L1625
13358I8184j7911j3620M235K1100P4483N9239J8880m2525m1554k6154J7739p7384
13346G4712m1696l690n5100n378R0958N6350k0443r507n125J9206l062P1958J0245
13333A79428j17506r8827P3893N0621m8751J8113J7690N0209o2300K7410M4298
$$ plain form
13419 105307 81624 27836 -23327 -54572 -68992 17004 59747 -8639 -9644 2601 20458 -21404
13407 -21404 -57311 -3690 67324 102223 47237 67412 114812 156579 149853 111999 101920 102697
13395 102697 105070 42678 13490 10911 -11318 8484 15743 -23969 -781 33293 69365 97953
13383 97953 131537 43689 44850 79547 38154 44149 7096 -35285 -16454 14588 33300 50888
13371 50888 77642 9303 13939 -21903 -28456 -19008 4853 14370 27349 33744 30944 66559 98184
13358 98184 80273 66653 70888 91988 166471 225710 244590 202065 160511 134357 152096 74712
13346 74712 33016 29326 -25774 -31152 59806 116156 95713 86206 81081 100287 97225 169183 179428
13333 179428 61922 -36905 36988 87609 38858 56971 74661 124870 62570 89980 134278
13322A34278Q676M9038l1208o7716O226k6581o891l0383O201N6127K4882M3782
13310A66431k3834l8779j2473L0619N3604N6730j01626o5770j8738J4494O3907
13299A24565K0382N409l5933J4044R159N8734N8646O7015P6345J74766J36715
13288G09847J95648L35402N62804N75072L32649J4684l18001n91907o07057l74723
13278H34418j92405j00562j09627l2877m8274l3638M6738L1384p4381m0932p9565
13267B00279j3982m2233o850K5077K9409L8504R601J11090O9994M406L8187q283
13255D55199K750o2333J4665J31780J09343P5717Q7518P3605J83205J72541K77893
13244A521883M73108P64957J175074J755439J899776J083817j24288j355589k035208
$$ plain form
13322 134278 142954 191992 160784 93068 99294 72713 65822 35439 41640 97767 122649 166431
13310 166431 142597 103818 91345 121964 175568 232298 130672 64902 46164 60658 124565
13299 124565 144947 150356 114423 128467 137626 196360 255006 322021 398366 573132 709847
13288 709847 905495 1240897 1803701 2378773 2711422 2726106 2408105 1816198 1209141 834418
13278 834418 642013 541451 431824 398947 350673 317035 363773 395157 320776 279844 200279
13267 200279 186297 144064 137214 162291 191700 230204 239805 350895 420889 425295 463482 455199
13255 455199 457949 395616 410281 542061 651404 727121 814639 888244 1071449 1243990 1521883
13244 1521883 1994991 2759948 3935022 5690461 7590237 8674054 8549766 7194177 5158969
13235E158969j562194r83439n40210k43685J8079J69844L79481N65829N16408
13226C479082J9030m00321p11877o72315m19329k76006j65503j30113j6854n4166
13216F51628p9346k0350J8872Q25J6258j1948k3383l0896k5461J18088R7444Q2328
13204G94059J25630J95558J76120K02642L14950M95369Q57149J364734J899803
13195F426014K125318J139162n55892j916986k063656j293392p00015k66130J37969
13186C032392M65232R79838J508802J925646J607846J5021j741300k349642j681725
13177C762110j006127n94425l33101j80452j73332j97993k50529j26418q8863
13168H10870k1630l973j4465o1796q2111p1384n4062O0497J53833N8633N8776
$$ plain form
13235 5158969 3596775 2613336 2073126 1829441 1847520 2017364 2396845 2962674 3479082
13226 3479082 3498112 3097791 2385914 1713599 1294270 1018264 852761 722648 705794 651628
13216 651628 572282 551932 570804 571629 587887 575939 552556 521660 496199 614287 711731 794059
13204 794059 919689 1115247 1291367 1494009 1808959 2304328 3161477 4526211 6426014
13195 6426014 8551332 9690494 9134602 7217616 5153960 3860568 3160553 2894423 3032392
13186 3032392 3497624 4477462 5986264 7911910 9519756 9534777 7793477 5443835 3762110
13177 3762110 2755983 2161558 1828457 1648005 1474673 1276680 1026151 899733 810870
13168 810870 789240 785267 770802 709006 626895 555511 501449 561946 715779 774412 833188
13157H33188L6971M5395J01019J65431K52221M55223P78658Q21999L57646m57960
13147C389791p19132n09431k25559p7402J26601M74302P56366J170143J725286
13138F110965K158850J664476m58945k364793k266799j331841q06647n66724l81230
13129A757312k71711k48577j76576r5482l5435p6427j57176o1547k5282l2139
13119E76960Q532q134J1603k5541n9805k470m3829j5560L8671j8558j7778j09668
13107C34423l6862K1165K5842K8541K3862l5437J1142J36108R9384R6753J45734
13096H50655L31985N06411O93482P93772M48805m38292r03154o89729l32156k17169
13086A044610r7593j12388j40152j8266K3580j8380n6226j04839l9606n6484n4622
$$ plain form
13157 833188 870159 915554 1016573 1182004 1434225 1889448 2668106 3490105 3847751 3389791
13147 3389791 2670659 2161228 1935669 1858267 1984868 2459170 3215536 4385679 6110965
13138 6110965 8269815 9934291 9475346 7110553 4843754 3511913 2705266 2138542 1757312
13129 1757312 1485601 1237024 1060448 964966 929531 853104 695928 634381 609099 576960
13119 576960 585492 577358 588961 563420 503615 501145 457316 441756 480427 461869 444091 334423
13107 334423 297561 318726 344568 373109 396971 361534 372676 508784 608168 704921 850655
13096 850655 1182640 1689051 2382533 3176305 3625110 3186818 2283664 1593935 1261779 1044610
13086 1044610 947017 834629 694477 676211 699791 681411 625185 520346 480740 424256 369634
13075C69634L7666L7400n5569n5754M2297L9866k5030m1786m260m7142m5024J2173
13063B64471O066J8284J6261q0490n166Q005N518j5514k2658P0154j756q3130
13051A80045Q201K5444K64n5390N734J4624k2677k3780Q522N2266n101m3048O6153
13038B11257P3688O507k706N572N243k3862l8757J9624P2904N275p8584k5539
13026B30622M8413J0403j4064n7063J344R927j4235k9998K7312l4230k1502j8132
13014A38797M0949M5791K2801L4589j7757k1562p3450m8173j3137J8585L8956
13003A66389l8055k6192M019L2537O0512K2181q2319L888m0530J313O3678N2581
12991B20002j1913J7877o8407l3200N4284R91L2414l9391o8954j8512M7248L9437
$$ plain form
13075 369634 407300 444700 389131 333377 375674 415540 390510 348724 344464 297322 252298 264471
13063 264471 270537 288821 305082 224592 219426 227431 232949 217435 194777 264931 263175 180045
13051 180045 188246 213690 213954 158564 164298 178922 156245 132465 140987 193253 188152 145104 211257
13038 211257 284945 291452 288746 294318 299561 275699 236942 256566 329470 334745 256161 230622
13026 230622 279035 289438 275374 218311 219655 229582 215347 185349 212661 178431 156929 138797
13014 138797 179746 225537 248338 282927 265170 243608 170158 121985 108848 127433 166389
13003 166389 128334 102142 106161 138698 199210 221391 139072 142960 102430 103743 167421 220002
12991 220002 208089 225966 157559 124359 178643 179634 212048 172657 103703 85191 132439 171876
12979A71876J6443j2258m3451J0180L1982K1770L7467j6128m8968M835J2755q3743
12967A02760o6838k3877K9996L3017L8213P4405J6891j3618M869l8241q5397q7611
12955a5431q3849J004O8339O5545P2641q3577J0972L5046m003L2602k2303j4939
12943F2047o614l2478l0111m890Q770j3651P9897K0011o9167L3416N0207l4973
12931F2464j05047O3242K2398M6343k5310j8083j1866J5764P0354j8778o4104
12920C7377m7167n5801L2550O3729N5126M3168k7432l3284K7340j2540l9680j1483
12908C1903L2408o8932k8740P3641P3699N6248Q344n8669K3345J9770Q623K7838
12896A99478j5583l2442o7928q2573k5126Q1495j3039l7212K0297Q1895K3942
$$ plain form
12979 171876 188319 176061 132610 142790 174772 196542 234009 217881 168913 173748 186503 102760
12967 102760 35922 12045 42041 75058 113271 187676 204567 190949 195818 157577 72180 -15431
12955 -15431 -99280 -98276 -29937 35608 108249 24672 35644 70690 66687 99289 76986 62047
12943 62047 55433 22955 -7156 -12046 -3276 -16927 62970 82981 13814 47230 97437 62464
12931 62464 -42583 20659 43057 89400 64090 46007 34141 49905 120259 101481 37377
12920 37377 -9790 -65591 -33041 30688 85814 128982 101550 68266 95606 83066 43386 31903
12908 31903 64311 -4621 -33361 40280 113979 170227 178571 119902 143247 163017 171640 199478
12896 199478 183895 151453 83525 952 -24174 57321 44282 7070 27367 109262 133204
12885A33204k348P213n0508N1793L3450K9235J5358n8371n3823P275J7343r0163
12873C9658j02726K8086N6062j567N113O4837N1998m4060p6728m7797M6960n4444
12861c4608l8438J1728L7744P2648M7568k089J5933k1031j2764p2432p9803M8620
12849b6924M7912N2778m419k138q91L5729J7560n7745j18086j3879P8742L7869
12837D6508K1489J2795J3322J4839M353p9094m4295m5516L0561j8269O15P7349
12825C4657K9441N955j9630J4J6879M0589M5489K8587J1756j5085l5074k6822
12813A16756J7277l8209p2407r865L6337o5373k0071Q8447K1385m5997M3199k146
12801F9333N759j7684k0319k4099o6250n5992p1961M6383Q0116P9068j3218l9911
$$ plain form
12885 133204 130856 138069 87561 139354 172804 202039 217397 159026 105203 112478 129821 39658
12873 39658 -63068 -34982 21080 19513 24626 89463 141461 97401 20673 -27124 19836 -34608
12861 -34608 -73046 -61318 -23574 49074 96642 94553 110486 89455 76691 4259 -75544 -26924
12849 -26924 20988 73766 69347 67209 66318 102047 119607 61862 -56224 -70103 8639 46508
12837 46508 67997 80792 94114 108953 113306 34212 -10083 -55599 -25038 -43307 -42692 34657
12825 34657 64098 70053 50423 50437 67316 107905 153394 181981 193737 178652 143578 116756
12813 116756 134033 95824 23417 13552 49889 -15484 -35555 52892 74277 28280 71479 69333
12801 69333 75092 57408 37089 12990 -53260 -109252 -181213 -134830 -54714 24354 11136 -28775
12789b8775K6029N649m1407M9537R6242J3027p9616k4253J2687K7902N7826M2195
12777A57043o5322m063J04755l3192q4975j6301M4317N927K3491J7789n448j9325
12765A24696M5091J9994p2755n6895m1288l606p652O7481j7175j3996j3385m618
12753B5892R1075L5116P834k9834n2287j8099m5657m6597P0488P7223j60k0985
12741I4009M3665K4508L25K5911K0910p9468l4414m5848j8860j5463L2717J8164
12729F6156m0574K4251L371l6462M106N040J7484m6074o6657k7794K9478l541
12717g1216M4842O1307L6854L3049l8749o6921m2625M1978K9060j8848P907j808
12705A4830m2361N9520j9865m3149J0567J6428l6768O5701N3641M8902J5112m5196
$$ plain form
12789 -28775 -2746 2903 -38504 11033 107275 120302 40686 16433 29120 57022 114848 157043
12777 157043 91721 87658 192413 159221 74246 57945 102262 108189 131680 149469 144021 124696
12765 124696 169787 189781 117026 60131 18843 15237 7585 75066 57891 43895 30510 25892
12753 25892 116967 152083 159917 130083 77796 59697 14040 -32557 37931 115154 114994 94009
12741 94009 137674 162182 162507 188418 209328 129860 95446 49598 30738 15275 47992 66156
12729 66156 25582 49833 53204 16742 20848 25888 43372 -2702 -69359 -97153 -67675 -71216
12717 -71216 -26374 34933 71787 104836 66087 -834 -43459 -1481 27579 8731 16638 14830
12705 14830 -27531 31989 12124 -31025 -20458 -4030 -40798 24903 78544 127446 142558 97362
12693I7362K1798j8059j3945m9628n8128N4290J1390j6703Q4346l2536q4869m0714
12681d5396p797p5972R8085K4759M658K2099K352J4673J8091m726l9733J8217
12669B9310N713L6880k6307k7963O7041Q6563L8936m0539o2925n6310m5411j9199
12657a4211J2102k523L4635K7825J7305j0816L385K4474K0947j2400l1610K297
12645G1410J5348l278L5168K3694n131p3727j0223N4958K7083K6585M951J7577
12633A84415N8662N3663n098m2712q1097q3362R791K6873N8348P7250n5635r2110
12621A08988M5868P3539L0074p5669j2996J9637K4569k0429m536O1323r430m0972
12609A99966J8488j5542l2573j2124k8473k0397l6331l7753N9478M5622P219l2902
$$ plain form
12693 97362 119160 101101 87156 37528 -20600 33690 45080 28377 112723 80187 -4682 -45396
12681 -45396 -53193 -129165 -31080 -6321 -1663 20436 22788 37461 55552 50826 11093 29310
12669 29310 35023 71903 45596 17633 84674 171237 210173 169634 106709 50399 4988 -14211
12657 -14211 -2109 -4632 30003 57828 75133 64317 67702 92176 113123 100723 69113 71410
12645 71410 86758 83480 118648 142342 137211 63484 53261 108219 135302 161887 166838 184415
12633 184415 243077 296740 291642 248930 167833 84471 94262 121135 179483 256733 201098 108988
12621 108988 154856 228395 258469 182800 169804 189441 214010 193581 189045 250368 240938 199966
12609 199966 218454 202912 170339 158215 129742 109345 73014 35261 94739 140361 147580 114678
12597A14678J1396n3753l8298K0372O555m4688J4362J2988l4387m009n162N7706
12585E7760L5071j0580q8350j792R9019j912n4122q230Q4927R000o9648J9608
12573G0751M5867n994l5085o6608k7614n22R293o678J19472P6936L2693r226p8221
12560A25064p8065j9642o329p5194J7935j5571N3691N8106K1138j9676J7657K4234
12548A03348p717k3088L6921M2526l3764m1066k7878J6823k227O5720L5543p0903
12536I4238K2415l9930M574O1140N5878m3551r487R2955L8283M3277m4704j12434
12524A62654j19066q6355O940J5725J3250N0811K894m4293J3956L1059M0405N2752
12512A40732o438l7758j9410l463O393Q8572o052k5510q5499n7696O350L8107
$$ plain form
12597 114678 126074 72321 34023 54395 60950 16262 30624 43612 9225 5216 54 57760
12585 57760 92831 82251 -6099 -7891 91128 89216 35094 26864 111791 120791 51143 70751
12573 70751 116618 110624 75539 8931 -18683 -19205 -9912 -16590 102882 179818 212511 203285 125064
12560 125064 46999 27357 21028 -54166 -36231 -51802 1889 59995 81133 61457 79114 103348
12548 103348 95631 72543 109464 151990 118226 77160 49282 66105 63878 129598 165141 94238
12536 94238 116653 76723 81297 142437 198315 154764 145277 238232 276515 319792 275088 162654
12524 162654 43588 -42767 -35827 -20102 -6852 43959 46853 2560 16516 47575 87980 140732
12512 140732 134294 96536 77126 73663 80056 168628 162576 137066 51567 -6129 221 38328
12500C8328P7017K0710q37J042Q523j1342o0981m0645N8087L0177l6570k4418
12488E9091O3461P7243M6056n977M7093M6709m2322o9723r3026r0555j342J950
12476C8658J0452o2088J5947J3890K0478n987K7266J3201l2627k177k7833l8086
12464b8906O305L3077L9179k1778o806K0109J1429l399O4746K72j03489j5733
12452d994Q3042m3055k9589J37q915Q034P726n931L2822N9953k82l0917N9383
12439A27414K4800j1892l8247k9445p0357o6849L4656R2169l4712k2751q920K7802
12427B3668m672K3824J7446j6678L6934n1407M75m011J4071J9635l9618J2510
12415C2177m0027o0124m5465P939N0749O3899J6108P639Q392l2139o4461K2152
$$ plain form
12500 38328 115345 136055 135218 136260 144783 133441 72460 31815 89902 120079 83509 59091
12488 59091 122552 199795 245851 239874 286967 333676 291354 221631 128605 38050 36708 38658
12476 38658 49110 -12978 2969 16859 37337 31350 58616 71817 39190 37013 9180 -28906
12464 -28906 -22601 10476 49655 27877 21071 41180 52609 49210 113956 114228 10739 -4994
12452 -4994 78048 34993 5404 5541 -3374 4660 12386 6455 39277 99230 98948 68031 127414
12439 127414 152214 140322 102075 72630 2273 -64576 -29920 62249 27537 4786 -4134 23668
12427 23668 18996 42820 60266 43588 80522 29115 29590 25579 39650 59285 19667 32177
12415 32177 -7850 -67974 -113439 -105500 -54751 9148 25256 32895 41287 9148 -55313 -33161
12403c3161L7904r082j030o9561K2347j4936K8097L0390J6149j6577n2125M8731
12391a2854M5847l0426o970L6427R0810J7489P318j7615n2183l4268P096p428
12379D3243p071n8971o4441j0072l010N7665J18313J03444K8242q5846k0880K717
12367A03333K4778J1155M7836L6866l7217j1092l4513p6568k4817L8415q362o5271
12355D543k9208L9971j3349k5233L2542M3608o7444K1345M7318P045k7117m8634
12343a4613k3649N365j3777m3566J4992L3427Q435Q150O8975J0387l160R229l3239
12330B6956l9317l0044L8984J62405J22624P8262P4421J18339N6753r3065k03844
12319C12474j66755p1188l7459J710K0350n2179N557Q7206K6894J5423q4198j7912
$$ plain form
12403 -33161 4743 -4339 -5369 -74930 -52583 -67519 -39422 -9032 7117 -9460 -61585 -12854
12391 -12854 32993 2567 -4403 32024 122834 140323 147641 130026 77843 43575 50671 43243
12379 43243 36172 -22799 -87240 -97312 -100322 -42657 75656 179100 207342 121496 100616 103333
12367 103333 128111 139266 187102 223968 186751 175659 141146 64578 39761 78176 69814 4543
12355 4543 -24665 15306 1957 -23276 9266 52874 -14570 6775 54093 61138 34021 -14613
12343 -14613 -38262 -32897 -46674 -90240 -75248 -41821 -33386 -25236 43739 54126 50966 60195 26956
12330 26956 -12361 -42405 -3421 158984 281608 359870 434291 552630 609383 516318 312474
12319 312474 145719 74531 37072 38782 59132 6953 12510 99716 126610 142033 57835 39923
12307C9923m7902j3679j622n113j2969L4644K1907n5096m0302k3206k189K2141
12295h3463K2986N6920J4533J1283j1820K3573n5655j8730O2563q307K3613M0023
12283G7519J5481L6613J07962J53147J14909R3317n9249k04443q8580l4280n9816
12272A52580j02252K7830j5165q7896n018j0500L7558R6477M7537j1180n5732
12261G4239o57K565k3752q6914p86K3784m614M918O3140L1319n9531J7453Q179
12248D9343k4463l7445n836j8087K054n695p1394J9133J10202J05731L9183m2256
12236A20470k6601K5620N8776k455j07854j8245L3260o4105q227L5521k1994l8503
12224a4337k7255J05133K5455m4505K5803n9920m4873k9926R0743J9590j4863
$$ plain form
12307 39923 -7979 -21658 -23280 -28393 -41362 -6718 15189 -39907 -80209 -103415 -105604 -83463
12295 -83463 -60477 -3557 10976 22259 10439 34012 -21643 -40373 22190 13883 37496 77519
12283 77519 93000 129613 237575 390722 505631 598948 539699 335256 246676 212396 152580
12272 152580 50328 78158 62993 -24903 -29921 -40421 -2863 93614 141151 129971 74239
12261 74239 73582 76147 52395 -34519 -35305 -11521 -16135 -11217 51923 83242 23711 41164 49343
12248 49343 24880 -12565 -18401 -36488 -34434 -40129 -111523 -92390 17812 123543 162726 120470
12236 120470 93869 119489 178265 175810 67956 49711 82971 18866 10639 46160 24166 -14337
12224 -14337 -41592 63541 88996 44491 70294 10374 -34499 -64425 26318 45908 31045
12213C1045j0820l1875k9379J8377J3395L7689k0384K4290J3880J3117l6463m4308
12201b1436Q062j4724J2894L0323n960m0240k6292N6770M8454M2781m1069l1463
12189A8100m6791n5668l3877M2385K5409N131K3929L1118l1563j697L7229J8912
12177C2617r939k167m915j5221M755k0500m2729j8162k4438K8550n0848L2466
12165i0531N1751Q2256L0879K7641m1377j6449P3094J2428l6316l3581j3490p294
12153C9011m398J2986J3614J4099m2771Q3917R528o8521p5287K1963K3175n1843
12141b4527J9172M9699m6367OP7579j3803p0017R191M0205m608o1976j9783l7094
12128h2323K1046l3048J3144O7315O3893l770l6125j650k488J3550j6212m4586
$$ plain form
12213 31045 20225 -11650 -41029 -22652 -9257 28432 8048 32338 46218 59335 22872 -21436
12201 -21436 -13374 -28098 -15204 15119 9159 -31081 -57373 -603 47851 90632 49563 18100
12189 18100 -28691 -84359 -118236 -75851 -50442 -45311 -21382 9736 -21827 -23524 13705 32617
12177 32617 22678 20511 15596 375 5130 -15370 -58099 -76261 -100699 -72149 -122997 -90531
12165 -90531 -38780 43476 74355 101996 60619 44170 117264 129692 93376 59795 46305 39011
12153 39011 34613 47599 61213 75312 32541 116458 125986 57465 -17822 4141 27316 -24527
12141 -24527 -5355 44344 -2023 -2017 75562 61759 -8258 933 41138 36530 -25446 -45229 -82323
12128 -82323 -61277 -94325 -81181 -13866 50027 46257 10132 8482 5994 19544 3332 -41254
12116d1254j910N5510n399M5171k0371n6724K0851M0644L6479j08296r3259M4815
12104h3743R1983M1191p197Q839l5506m0022o1088m9567K544K5565O2411O7780
12092B3190J9101m426K919j636k0955n8289k3614P5202m6391m3587P2308K8950
12080B2772n8218j09791N998K9399K4977O9964K4423O2568J6875p1480J752O406
12068B5645J1341k7427n347j2243k0913m9994m7482J4926K3188K0762K4780j7782
12056f0546k3067l1463m3525R1134L9123j5953l439l1414L4836O5679j859q6110
12044f6604j3354J28k5462J0516J5155M0421M8657o374q4455K3210J3660L1919
12032a2583m7762J6524L8952K2948M2087k9695k6456m3443l6802n206O5108M576
$$ plain form
12116 -41254 -43164 12346 6947 52118 31747 -24977 -4126 36518 72997 -35299 -128558 -83743
12104 -83743 8240 49431 42234 51073 15567 -24455 -85543 -135110 -132566 -107001 -44590 23190
12092 23190 42291 37865 40784 39148 18193 -40096 -63710 11492 -34899 -78486 -6178 22772
12080 22772 -35446 -145237 -139239 -109840 -84863 -14899 9524 72092 88967 17487 19239 25645
12068 25645 36986 9559 4212 -8031 -28944 -78938 -126420 -111494 -88306 -67544 -42764 -60546
12056 -60546 -83613 -115076 -158601 -67467 -28344 -44297 -47736 -79150 -44314 21365 19506 -66604
12044 -66604 -79958 -79830 -105292 -94776 -79621 -39200 9457 3083 -81372 -58162 -44502 -12583
12032 -12583 -60345 -43821 -4869 18079 60166 30471 4015 -39428 -76230 -81436 -16328 -11752
12020a1752l248J6271K7022J7473k8428n5592K0627L1118n6397m7466K7118N3659
12008i595J3226N2499J9418R954l0203m2042k0650l1186K5976J4475j3974m8919
11996f1021J9260M8842L2732l3015L8295K3108N6227k0359q6377l1454L0927m2296
11984b5131M913k317L6194L3723L6282j2801p2800n7383j6980M7961K9072m3669
11972d2936p915p2354j1631L3204p044l452L6998M7308j7752m5812n871j8746
11960a16003k4163L6932L6123r352k5323M3475K6126J9341K1897j1085m0338p838
11948e0208l5855j5110J5036k3833L6088K7113o55Q1400N9352J7078L5936r721
11936A36621J888n7053R635k7937J4911j117l8637k2829L4658k5491K014k3039
$$ plain form
12020 -11752 -15000 1271 28293 45766 17338 -38254 -17627 13491 -42906 -90372 -63254 -9595
12008 -9595 3631 56130 75548 85502 55299 13257 -7393 -38579 -12603 1872 -12102 -61021
11996 -61021 -41761 7081 39813 6798 45093 68201 124428 104069 17692 -13762 17165 -25131
11984 -25131 -20218 -22535 13659 47382 83664 70863 -1937 -59320 -76300 -28339 733 -42936
11972 -42936 -50851 -123205 -134836 -101632 -108676 -112128 -75130 -27822 -45574 -91386 -97257 -116003
11960 -116003 -140166 -103234 -67111 -76463 -101786 -58311 -32185 -12844 9053 -2032 -42370 -50208
11948 -50208 -86063 -101173 -86137 -109970 -73882 -46769 -47424 33976 93328 110406 146342 136621
11936 136621 138509 81456 91091 63154 78065 76948 38311 15482 50140 24649 26663 3624
11924C624k0152J1603N3360L0762m1113m9226l32R03k0043R847R056j0195N6975
11911C5069J9073M5981n5685l8977Q830k223J7877l2798Q021J880M1143R6911
11899A45102L42p1813p2812k6769k0118J0731o0021n1069P0834R4915L3318k6609
11887B6031m4379K6770P4071L5831m2281m6913R248J7043K745J2795l8894k3923
11875H144N555P712N889Q3609k0749j51068l6016l7588N0398J201O1064P786K3707
11862I644J4954p639J1073j8588n5391K8042J22852K782k9789l938k5140M406
11850E3268K1521j0038n7905j3865o829n2615M2111j5818j6247N7353M1861l3670
11838I127k4399m7270j9874M1282m109p262K0156M4388L4594L2765j5243p1840
$$ plain form
11924 3624 -16528 -4925 48435 79197 38084 -11142 -11474 -10571 -30614 -20767 -11711 -21906 35069
11911 35069 54142 100123 44438 5461 14291 12068 29945 -2853 5168 7048 48191 145102
11899 145102 145444 73631 819 -25950 -46068 -35337 -95358 -146427 -75593 19322 52640 26031
11887 26031 -18348 8422 82493 118324 76043 29130 38378 55421 58166 70961 32067 8144
11875 8144 13699 21411 27300 110909 90160 -60908 -96924 -134512 -84114 -82913 -21849 -14063 9644
11862 9644 24598 16959 28032 9444 -45947 -17905 104947 107729 77940 74002 48862 53268
11850 53268 74789 64751 6846 -7019 -13848 -66463 -24352 -40170 -56417 936 42797 9127
11838 9127 -15272 -62542 -82416 -41134 -45243 -52505 -32349 12039 46633 79398 64155 -7685
11826g685M2639q152j4806q6489r3697K5057L5860M9405n291K5166M9563N47J7795
11813B9912M314l8678m1921K9690L7906L683m2846k8155q307k2151J6861L3361
11801b6331J5520K2622j1040k3788j7458M7771j4232K884j1329l475n5451m364
11789g8671M2294j4247m7324K2844M8107R360j5077N1273J6733J0110p1522m9203
11777g5323K3821n1458L1307P0284N6307l9194N7M6746j7397K6884R061k2823
11765E8272J953J1528o8942j04883r20R4293J8835m2874O060M537m2787j1812
11753g6740m5583L1313L8357R265n5202L4796R8086L750o9766p2700n7673O0351
11741a01746M2462M495k9092J7402N5117L0061m036k730M1281q16K535L9680J034
$$ plain form
11826 -7685 34954 26802 11996 -74493 -168190 -143133 -107273 -57868 -63159 -37993 11570 12117 29912
11813 29912 34226 -4452 -46373 -16683 21223 24906 -17940 -46095 -54402 -76553 -59692 -26331
11801 -26331 -10811 11811 771 -23017 -40475 7296 -6936 -4052 -15381 -18856 -74307 -78671
11789 -78671 -36377 -50624 -97948 -75104 -26997 -17637 -32714 18559 35292 45402 -26120 -75323
11777 -75323 -51502 -102960 -71653 -1369 54938 15744 15801 62547 45150 72034 81095 58272
11765 58272 60225 71753 2811 -102072 -102992 -8699 10136 -32738 -26678 -22141 -64928 -76740
11753 -76740 -122323 -91010 -52653 -43388 -98590 -63794 34292 38042 -31724 -104424 -162097 -101746
11741 -101746 -59284 -54789 -83881 -66479 -11362 18699 14663 11933 53214 52398 54933 94613 95647
11728I5647j43148p2211K3245N6479J3180l5363O0300L5552r092j1712r2510L0031
11716d9602N8228K7716J2043J41k2290J8k3184n565P369j848j21447o293k0703
11703a45417L2617K0190J2443m302J8081K5195K9608J991M8937P3633r6624n4911
11691c8559L0578l0180j4680J0902J9280K7256j2050L7762J9835K4361j8254o1750
11679e499O2076o406m8273m2966J211P2469R755k1648m7597k6175j3620L188L6951
11666b6534K6206K421L2358P924l9741Q11m5781n2993M8391j0938l340P543O5825
11653A2152K9066M271o2982l8544L8208O725k1886j7119L5246j581k4286m2164
11641h2894O0305J2519o8135L549R5583J426k4722J2610n6466J2528J26502j2907
$$ plain form
11728 95647 -47501 -119712 -96467 -39988 -26808 -62171 -1871 33681 24589 12877 -79633 -49602
11716 -49602 8626 36342 48385 48526 26236 26254 3070 -2495 4874 3026 -118421 -124714 -145417
11703 -145417 -112800 -92610 -80167 -84469 -66388 -41193 -11585 -9594 39343 112976 16352 -38559
11691 -38559 -7981 -38161 -52841 -41939 -22659 4597 -7453 30309 50144 74505 56251 -5499
11679 -5499 56577 50171 1898 -41068 -39857 32612 42367 20719 -26878 -53053 -66673 -63485 -26534
11666 -26534 -328 2093 34451 42375 2634 3445 -42336 -95329 -46938 -57876 -61216 -53673 12152
11653 12152 41218 45489 -17493 -56037 -17829 -11104 -32990 -50109 -14863 -16444 -40730 -82894
11641 -82894 -22589 -10070 -78205 -74656 20927 22353 -2369 10241 -46225 -33697 92805 79898
11629G9898m2122k7321l0016M8700N7356K2466M4618j9910o5909j0678r903n7053
11617i874k0442K8279L3112q6316p9804Q0118L815j1158Q5K4821Q0514j9211m5862
11604b1923n4875j3816O6529N8655m020n8275p659M3917J6266n5555K8384k3764
11592b6136K1152j0555Q942m4375m2760J5003k305L7275P5415j8716j6030k0188
11580b3278q906N961l6900J4403j6200N743M0956j5463o6822N3586M3911k4727
11568b7736j6289p4242k6778N2510R6118j0883l6632M225n7524N5758l9541j9643
11556a00657L3293L4514k5090p131N4231K6864p089J8576o7079m0146p6200L0859
11544a25055N0726O1270m7943o9789l7554N2614P2982J0554k7691N806J00346
$$ plain form
11629 79898 37776 10455 -19561 29139 86495 108961 153579 133669 67760 57082 47179 -9874
11617 -9874 -30316 -2037 31075 -55241 -135045 -54927 -51112 -62270 -62185 -37364 43150 23939 -21923
11604 -21923 -76798 -90614 -24085 34570 30550 -27725 -35384 8533 24799 -30756 -2372 -26136
11592 -26136 -4984 -15539 -6597 -50972 -93732 -78729 -81034 -43759 31656 12940 -3090 -23278
11580 -23278 -32184 -26223 -63123 -48720 -64920 -59177 -18221 -33684 -100506 -46920 -3009 -27736
11568 -27736 -44025 -118267 -145045 -92535 3583 -7300 -43932 -39707 -97231 -41473 -81014 -100657
11556 -100657 -67364 -32850 -57940 -65071 -10840 16024 8935 27511 -39568 -79714 -155914 -125055
11544 -125055 -74329 -13059 -61002 -130791 -168345 -115731 -42749 -32195 -59886 -54080 46266
11533D6266M63n7100n6296m8669Q3253j5288p2425M999O9317L1516j2037M8557
11521B2556R6408k7404n7602j4203j1565o7685J9976k4714J5595J8850J5519J4501
11509B32K8650R339j2283r3425n8266j549k354O0573j9331J60L5288M0106j162
11496a4022l8047n5090M3666M3427l7410O6783K3447k2606M4605J523k1769M9239
11484H3746K0330m9004j9664K486q1503j04929j2575O0893M4183l0442K7448j1127
11472g0158M1882J8151l5867o868J11479L1680k5922m1498k0096l7558N7098N5359
11460G7682n0403N161l7259n7419K7545P8413M3092J1017n7243j913l980k7140
11448G553M1633m462j3095K7937j6055n5303r351M3490k8263q1785k5256k6817
$$ plain form
11533 46266 46729 -10371 -66667 -115336 -32083 -47371 -119796 -114797 -45480 -13964 -26001 22556
11521 22556 118964 91560 33958 19755 8190 -59495 -39519 -64233 -48638 -29788 -14269 232
11509 232 28882 38221 25938 -67487 -125753 -127302 -129656 -69083 -88414 -88254 -52966 -12860 -14022
11496 -14022 -52069 -107159 -63493 -20066 -57476 9307 32754 10148 54753 56276 34507 83746
11484 83746 104076 55072 35408 37894 -43609 -148538 -161113 -100220 -56037 -86479 -59031 -70158
11472 -70158 -28276 -10125 -45992 -52860 58619 90299 64377 22879 2783 -34775 22323 77682
11460 77682 27279 32440 -4819 -62238 -34693 43720 86812 97829 40586 38673 34693 7553
11448 7553 49186 44724 31629 59566 43511 -11792 -21143 22347 -5916 -87701 -112957 -139774
11436a39774n52N3381O8821k791k2796O7308L5715k8481R209j17696k78J55836
11424G7902j1231j16321o3125J5422K4920K0353j5666o532J4787K5294K9276M9076
11412D4155J5711k1596n6947k8451O9094L0829m6336K7109L4334R955j5854m9728
11400A2275k8722k651O9996J8563L4018n4947m8360j815n728q49k8055R901j8424
11387d4798n098n321M449R2734J8384M699m4600l2427K1933J8880J5014q8212
11375d4363m6403L2266k411M1395N9794L687J3408J5682n6929j0063Q228K1622
11363C5913m6304j7734q41m955R4993j9569n1682N5580K8222l7655j8861J9499
11351C6606j0363k0656K9659m2015l9921K0253M7541O4080J1444k4075k0714j9553
$$ plain form
11436 -139774 -140326 -86945 -18124 -20915 -43711 23597 59312 30831 40040 -77656 -77934 77902
11424 77902 66671 -49650 -112775 -97353 -72433 -52080 -67746 -74278 -59491 -34197 -4921 44155
11412 44155 59866 38270 -18677 -47128 21966 52795 6459 33568 67902 77857 62003 12275
11400 12275 -16447 -19098 50898 69461 103479 48532 172 -1643 -7371 -8220 -36275 -26374 -44798
11387 -44798 -49896 -55217 -50768 41966 60350 65049 20449 -11978 9955 28835 43849 -44363
11375 -44363 -90766 -58500 -60911 -19516 40278 43965 57373 73055 16126 6063 14291 35913
11363 35913 -10391 -28125 -28966 -33921 61072 41503 -10179 45401 73623 35968 17107 36606
11351 36606 26243 5587 35246 -6769 -46690 -26437 21104 85184 96628 72553 51839 32286
11339C2286O6879K3688k8809J5365r6757p4544L2292M7944P4951K7304k3982m1524
11327E5093q9044k8057K1917r112O8618l3642K6111N4476O2610n7626j8844k6682
11315B5818m7740n887q095O077j8080K5155k792j8k4394j2417K2641O1259L6600
11302E8127o3159J027O7631N9587M894k3935m3312l6993n7327N5039O7905L3565
11290A23049m891k1980p0629k2540j6853M2040J5979j8413J1854m9348j9084o0827
11278i1643K251Q8948N333n2125o1391k904L148J3713l6144k2895k472j8138N2696
11265a21623Q143l2600K31R2310M4662l3414o5871j5417K0833P0481k2638n4759
11253a09662J221L0665N6134P0958k2279l0368q8817Q1565Q1253l2150m7161J9806
$$ plain form
11339 32286 99165 122853 94044 109409 12652 -61892 -29600 18344 93295 120599 96617 55093
11327 55093 -33951 -62008 -40091 -49203 19415 -14227 11884 66360 128970 71344 52500 25818
11315 25818 -21922 -27809 -35904 -29827 -47907 -22752 -25544 -25562 -49956 -62373 -39732 21527 58127
11302 58127 -5032 -4005 63626 123213 128107 104172 60860 23867 -33460 21579 89484 123049
11290 123049 118158 96178 25549 3009 -13844 28196 44175 25762 37616 -11732 -30816 -91643
11278 -91643 -89392 -444 4889 -47236 -108627 -111531 -108383 -94670 -130814 -153709 -156181 -174319 -121623
11265 -121623 -113480 -146080 -145849 -53539 -8877 -42291 -108162 -123579 -102746 -32265 -54903 -109662
11253 -109662 -108441 -77776 -21642 49316 27037 -3331 -92148 -10583 70670 38520 -8641 11165
11241A1165K1361m8804r7587M217J3248r078j7900j8573M8645K7402M5571K3325
11229B992N7469l0687l0058k3132k532n8054j0797L0624N6806M6265k376J7569
11217E4089l1779J8560j5536k6481j1982N7561p7965J0532P8223l1273l8422M0402
11205B5929q080r639L9915O697m0716n2004j774j7650N2495k0436n2767L8840
11193c9190M0693L7504K2536m1763k9853o939k489r875k1146j7109k272Q5514
11181A5611J1745k578J0669N889q692o8516K8890j969j5628O774J2957l3502J7304
11168b1046k3832j1520J3658J7056m241L1324Q0341p744n4769k576k0304m9308
11156e2961O6765Q3433O170m1539k4484P751l1040j25468K2856Q262l8101m0031
$$ plain form
11241 11165 32526 -16278 -113865 -109648 -96400 -105478 -123378 -141951 -93306 -65904 -20333 2992
11229 2992 60461 29774 -284 -23416 -25948 -84002 -94799 -64175 -7369 38896 36520 54089
11217 54089 22310 40870 25334 -1147 -13129 44432 -33533 -23001 55222 23949 -14473 25929
11205 25929 17849 8210 48125 54822 14106 -37898 -39672 -57322 -4827 -25263 -78030 -39190
11193 -39190 1503 39007 61543 19780 -10073 -17012 -19501 -29376 -50522 -67631 -69903 15611
11181 15611 27356 24778 35447 41336 32644 -35872 -6982 -8951 -24579 -17805 -4848 -38350 -21046
11168 -21046 -44878 -56398 -42740 -25684 -29925 1399 81740 73996 19227 16651 -3653 -52961
11156 -52961 13804 97237 103407 61868 37384 45135 14095 -111373 -88517 -80255 -118356 -158387
11144a58387Q9944J3863n733o4603K7848R039J8077J1705N9511o4461r6757k5508
11132a85462Q7495P4309M904K133m8348l9834L6379L8477P2216l7151M2496L3452
11120H1066l2099k1756m8448M40k2462M149K4536j8880r954K3303Q074J3386l0458
11107b9103j7485L7241j9829K5491K0205j28062l4747N9501L9485K5362M9236
11096B7295N0463j5923L3283p833k7725J6652n0149j0845M8255j3024o2609J8712
11084F552M5784P3275j2271l9437m9938J8074P9858k5917k0971J5261j3570l5193
11072D1507J0807J9516r7370r5094M4088J28373Q5481Q2475j2946j6843J0604
11061B00598p0393l6389O3963o983m4014J8171j16134j08457L5055j89J7304O566
$$ plain form
11144 -158387 -68443 -54580 -60313 -124916 -97068 -88029 -69952 -58247 1264 -63197 -159954 -185462
11132 -185462 -97967 -23658 -18754 -16621 -64969 -104803 -68424 -29947 42269 5118 47614 81066
11120 81066 48967 27211 -21237 -20797 -43259 -39110 -14574 -33454 -43408 -20105 -12031 1355 -29103
11107 -29103 -46588 -9347 -29176 -3685 16520 -111542 -146289 -86788 -47303 -21941 27295
11096 27295 77758 61835 95118 87285 59560 76212 26063 15218 63473 50449 -12160 6552
11084 6552 52336 125611 113340 73903 23965 42039 121897 95980 75009 90270 76700 41507
11072 41507 52314 71830 -25540 -120634 -76546 51827 137308 219783 206837 189994 200598
11061 200598 130205 93816 157779 150796 106782 124953 8819 -99638 -64583 -64772 -47468 -40902
11049d0902P340M5066L6757P3322J17101O4574J5570p6711r9887q2252p734n3377
11037a133j2731j4596j3625k5952Q6303O1136l0577L1989l4653r038J2086J1327
11025F0536M1660q883n1180p1790N9903j3919K0911L0065p1998j0156N0745k7248
11013H646q2986j2539Q1302O1296L9452K6037J401k7862j879N8837J4592j7017
11001A49280j0182o4150K0463L1926p509q5319q9854n0948j4053M4927K087o719
10989h0051k5207R3846J04195K4286l8630J8249m9178k7051k4788N027J8513l8398
10977a9187k4777K3165n332l6446N3323M9182l2944j9314m7962p0021K4278P4695
10965c1340L1089R9302n38N702J9227m6361m0491l9245M427R5546N9842J4725
$$ plain form
11049 -40902 -33562 11504 48261 121583 238684 303258 318828 242117 142230 59978 52244 -1133
11037 -1133 -13864 -28460 -42085 -68037 18266 79402 48825 80814 46161 37123 49209 60536
11025 60536 102196 93313 42133 -29657 30246 16327 37238 67303 -4695 -14851 35894 8646
11013 8646 -74340 -86879 -5577 55719 95171 121208 122609 94747 92868 151705 166297 149280
11001 149280 139098 74948 95411 127337 119828 34509 -55345 -106293 -120346 -75419 -73332 -80051
10989 -80051 -105258 -11412 92783 117069 78439 96688 47510 20459 -4329 698 19211 -19187
10977 -19187 -43964 -20799 -26131 -62577 -9254 39928 6984 -12330 -60292 -130313 -106035 -31340
10965 -31340 -251 99051 98513 104215 123442 77081 36590 -2655 1772 97318 157160 171885
10953A71885p6235J1196N6195P5932P142n582K1175O2941k8878p5102k7275J18756
10941C12150J04316J13504J90837L58877M83458N53775N38498K67946k26287n47912
10931B149162o05654m15116l02217k55625j29446m7685o9868r4894J179j6726
10921B13110l6485J0043O758P310M5696q7068r9825o6872j5719J7564K1836R909
10909B6257N911K6770m1143p5723j0326K5758P6676J5562N6133N4745J4261J0503
10897A85384q3121l3882o5403o6518P5254O6515n862q7186n1667P1509J8049Q282
10885C1354j9063o2643N2780L1365J1397K2707m539l9996p0987O0850J5036j3023
10873A5238o1664m0608K4521L2614J6198K4317N3874k5813J3400L1521l2435k343
$$ plain form
10953 171885 95650 106846 163041 238973 246115 240533 261708 324649 295771 220669 193394 312150
10941 312150 416466 529970 720807 1079684 1563142 2116917 2655415 2923361 2697074 2149162
10931 2149162 1543508 1128392 826175 570550 441104 393419 323551 228657 229836 213110
10921 213110 176625 186668 193426 200736 246432 159364 59539 -7333 -23052 -5488 16348 26257
10909 26257 32168 58938 17795 -57928 -68254 -42496 34180 49742 105875 160620 174881 185384
10897 185384 102263 68381 2978 -63540 11714 78229 72367 -14819 -66486 5023 23072 31354
10885 31354 12291 -50352 2428 33793 45190 67897 63358 23362 -47625 13225 28261 15238
10873 15238 -46426 -87034 -62513 -29899 -13701 10616 64490 38677 52077 83598 51163 48820
10861D8820L2078j2211m9964j8570l5610q864o529P3535J01869M470n188o2345
10849F1491N494k9904m0377L5133P146k5836k4105n1332r9728M5417O8814P0493
10837B2706O2049O2977n2250o4056N3047L4059j5218n6606o2243Q3488L4283M0604
10825A42840L9212j07054r368O8758L5557j0205k9975j06716O503M1181P952P983
10813H6668N2082Ql5716J6233J6233l1305p7134K5577M690n2740Q821J9298j8647
10800A4068l7950P162K5112L477K8172l5387J6133K2139Q7627j2109K2803j9633
10788A21614n2140P22O2046R4577P5055R200l190K6120k0817n7512m4091j7931
10776A93653N1915k7978J08818l2398m8264n3226n2546M1582M3578j2158K0793
$$ plain form
10861 48820 80898 68687 18723 153 -35457 -44321 -50850 22685 124554 129024 123836 61491
10849 61491 66985 37081 -3296 31837 38983 13147 -10958 -62290 -162018 -116601 -47787 22706
10837 22706 84755 147732 95482 31426 84473 118532 103314 46708 -15535 67953 102236 142840
10825 142840 182052 74998 65630 134388 169945 159740 129765 23049 29552 70733 78685 86668
10813 86668 138750 138758 103042 119275 135508 104203 27069 52646 57336 4596 13417 32715 14068
10800 14068 -23882 -16720 8392 11869 40041 4654 20787 42926 130553 118444 141247 121614
10788 121614 69474 70196 132242 226819 301874 311074 307884 334004 313187 255675 211584 193653
10776 193653 245568 217590 326408 294010 245746 192520 139974 181556 225134 212976 233769
10765B33769m1321m7265k9676M0182P109q6669p2092P9303O4848P4603m7326o9066
10753A06399j160P5284k8896l8357m1492j2541K9442K6990N5490j1895o9107J275
10741I1432L2328P3866R277l3216N5415P7981j6198q2763j2971K387o1565l7196
10729I8777j2357j188j857L8138L1631K1078l4989m6687k6331j0709L1546L3197
10717A20249R27l32n6122J6736M1867k1704j2181j1160j6267K5515q68J6842R011
10704A12513p9507n21P6764L6661J4940L5434q915m8463O2492Q0300l0458l7262
10692B13978L8829m5393j734J8860L1654M2308M2237J1760m7544n4683j21002
10681A29270o0654O2801J4349L5827M4736J9859j7631p1190k4222O7467O8766
$$ plain form
10765 233769 192448 145183 115507 155689 162798 76129 4037 83340 148188 222791 175465 106399
10753 106399 105239 180523 151627 113270 71778 59237 88679 115669 171159 159264 90157 91432
10741 91432 123760 197626 206903 173687 229102 307083 290885 208122 195151 197538 135973 98777
10729 98777 86420 85232 83375 121513 153144 174222 139233 92546 66215 55506 87052 120249
10717 120249 121176 120844 64722 81458 123325 101621 89440 78280 62013 87528 86660 103502 112513
10704 112513 33006 32485 109249 145910 160850 196284 187369 138906 201398 281698 251240 213978
10692 213978 252807 207414 205680 224540 256194 298502 340739 352499 304955 250272 129270
10681 129270 68616 131417 145766 181593 226329 246188 228557 157367 133145 200612 269378
10670B69378Q164m494p821M3462K6477K0579K1090L9618M9402o5714j78243j34525
10658H7373j36199r1097M1067K00383J77697J92609J20269P6j3610j7481q0573
10647D80514j0594j58N8192Q3849j6037o6077j5707k7723l2671J1744J9354m471
10635D80215N4273P5460M524L5543Q046M1990P5231L1309J3781N6065o0699j05852
10623G09886l2103J4060M5325N1546j1749k782l5890j3599K2722P2356N0475k2255
10611H47992j4107J5605L3581N6691j1853O6411l6018k0297M2456P8303P429O7277
10599A133470Q0621M7778J66439J16367P2649J66862J21001J97454L31562L96778
10589B830981L88240N40217Q24107J285133J971592K811381L150525K526775J116138
$$ plain form
10670 269378 277542 273048 265227 308689 335166 355745 376835 416453 465855 400141 221898 87373
10658 87373 -48826 -139923 -98856 101527 279224 471833 592102 592178 578568 561087 480514
10647 480514 469920 469762 527954 611803 595766 529689 513982 486259 453588 465332 484686 480215
10635 480215 534488 609948 614472 650015 658061 700051 775282 806591 820372 876437 815738 709886
10623 709886 677783 691843 737168 788714 776965 774183 738293 724694 747416 819772 870247 847992
10611 847992 833885 849490 883071 939762 927909 994320 958302 938005 980461 1058764 1066193 1133470
10599 1133470 1214091 1261869 1428308 1544675 1617324 1784186 1905187 2102641 2434203 2830981
10589 2830981 3219221 3759438 4583545 5868678 7840270 10651651 13802176 16328951 17445089
10580A7445089j657895k858574l010458k493245j531026q79239m97681k98866
10572D218105k11950k48026j57630j37566L913O8164Q0190K01693J63533J44942
10562D125368J33906J85534K93180L32089K89259M02059N17630P49800R30912
10553G959737J092251J101291J001289P14903N67052P57901J221021J804553K265426
10544A8485424K621990K885287L271166M289694O193799R175958J3931270K1635155
10536H2489743L4031686N2936192P8898404J05157527J07250619P4275324l669179
10529E31370316q6062986j08748968r9638827o9028487m2039068k4677675j4950594
10522H6223711j0475380j0271622j0718288r513646p770353n873750m763620l878739
$$ plain form
10580 17445089 15787194 12928620 9918162 7424917 5893891 5014652 4516971 4218105
10572 4218105 4006155 3758129 3600499 3462933 3466846 3535010 3615200 3816893 3980426 4125368
10562 4125368 4259274 4444808 4737988 5070077 5359336 5761395 6279025 7028825 7959737
10553 7959737 9051988 10153279 11154568 11869471 12436523 13194424 14415445 16219998 18485424
10544 18485424 21107414 23992701 27263867 31553561 37747360 46923318 60854588 82489743
10536 82489743 116521429 169457621 248356025 353513552 460764171 535039495 531370316
10529 531370316 445307330 336558362 236919535 167891048 125851980 101174305 86223711
10522 86223711 75748331 65476709 54758421 45244775 37474422 31600672 26837052 22958313
10514B2958313l044337k314091j688536j188591q84469p76287j144026j334028
10506A0583948j334899j175629q83163o08934n82143n26114l74449k73445l27805
10497D497367k78386k38475k29737k84269j11171l6515j27462j12560j25700n3060
10487B900032j02372r2232M959K029n559l4698j89043j51652q3693j19486l9460
10476B088825l7685o5817p4125j20995n9267j07845n7445q6562r2723j6703R094
10465A378752L5418N1575M0521N4802m0986k041n4229L6656R0337K2498K9490
10454A642793l9522O3K3094p0923p9941o5226m4355p5910l2602j21546l7528m931
10442A093466k7768n1902l7702m8788K054o9108l5263n0740J8819r307p7994l2262
$$ plain form
10514 22958313 19913976 17599885 15911349 14722758 13838289 13062002 11917976 10583948
10506 10583948 9249049 8073420 7190257 6581323 5999180 5473066 5098617 4825172 4497367
10497 4497367 4218981 3980506 3750769 3466500 3355329 3318814 3191352 3078792 2953092 2900032
10487 2900032 2797660 2705428 2710387 2712416 2706857 2672159 2483116 2331464 2247771 2128285 2088825
10476 2088825 2051140 1985323 1911198 1790203 1730936 1623091 1565646 1479084 1386361 1369658 1378752
10465 1378752 1414170 1465745 1506266 1561068 1520082 1518041 1463812 1500468 1590805 1613303 1642793
10454 1642793 1603271 1603334 1626428 1555505 1475564 1410338 1365983 1290073 1257471 1135925 1098397 1093466
10442 1093466 1065698 1013796 976094 927306 929360 860252 824989 774249 793068 783761 705767 673505
10430F73505j859O665M3631M6428k7542l3818J2678K7049M8614O2427M8209K3179
10418I29166K6419J8490o5652j29579p3988l5349M9313O869J8914N6700J00743
10407I02046J25008N4876N8357J12120K2678n4622j30387q2693l9493k0346J884
10396I49428m1330k2316K3620K7146j8249j5663q2641j04521l7621l221K6492
10385G01124P1070n6747l2218r806M8699j2028k0484k204j3538j5197M6401J8817
10373G23889n0783r3820N4920J00132M9525J6071J614m1479K2671K1792o9419
10362G35113n0585r0687j9811j0167M0031p994m2160Q718L3899K5779l5974M8430
10350F34592n119r737M9237j5930K136n2744O845N4020P7203K595o0099P510O221
$$ plain form
10430 673505 671646 678311 721942 768370 740828 707010 719688 746737 795351 857778 905987 929166
10418 929166 955585 974075 908423 778844 704856 669507 718820 725689 744603 801303 902046
10407 902046 1027054 1081930 1140287 1252407 1275085 1220463 1090076 1007383 967890 947544 949428
10396 949428 908098 885782 909402 936548 918299 902636 819995 715474 677853 674632 701124
10385 701124 772194 715447 683229 673423 722122 710094 689610 687406 673868 658671 705072 723889
10373 723889 673106 579286 634206 734338 783863 799934 801548 760069 782740 804532 735113
10362 735113 684528 593841 574030 563863 603894 595900 553740 562458 596357 622136 586162 634592
10350 634592 629473 619736 668973 653043 655179 602435 609280 663300 740503 743098 682999 690509 696730
10337F96730p862q9948o1093l4801l3326k5950p8682n5853J3656K5952r921K3021
10325C61923J8413J27613K7172J8866p9143p7524J0436k0851j7701o4565j1184
10314B93455r5676K7782N4187l4766N02m703l0965r715N3590l3053n7283o851
10302A56504J8180j6244J1581j8562m0222M3002K0696N0638M232k3360j9591m783
10290A82071O7264q193l6165J2091N0669K8882j3963n1475o5942m8984J0875L5793
10278A62923O059L8268N7379j8090l3084J20854K5012o0892R904M5859M6458m7633
10266C53017n7641j153M1618p326j8028j1184l3175K2861L5157j03042n7551m8241
10254A15312o1352r085N2774O738J9207N0704j536l0419k0537J9795M326l2447
$$ plain form
10337 696730 688868 598920 537827 503026 469700 443750 365068 309215 322871 348823 338902 361923
10325 361923 380336 507949 535121 553987 474844 397320 407756 386905 369204 304639 293455
10314 293455 197779 225561 279748 244982 245484 240781 209816 200101 253691 220638 163355 156504
10302 156504 174684 158440 170021 151459 111237 154239 174935 225573 229805 206445 186854 182071
10290 182071 249335 241142 204977 217068 267737 296619 282656 231181 165239 116255 127130 162923
10278 162923 168982 207250 264629 246539 213455 334309 359321 298429 308333 354192 400650 353017
10266 353017 295376 294223 335841 328515 310487 299303 266128 288989 324146 221104 163553 115312
10254 115312 53960 44875 97649 104387 123594 174298 172762 142343 121806 141601 145927 113480
10242A13480n7633o554O5555K6218j2264j1173L5539J5749j0575j0530J4541o4358
10230I7995J4217l4972j7474J15058J1180o2295l0789M1976K6226k3064j6672
10219A21386j3528O8153J556l1515o450P119m5505k9020K2486O7446P4744o378
10207B30494J8086j03804j7905J0941l4005n0470n8261k023M3727K2275P0178
10196A29233K5146k1570K1242K5609n6929j8567O8914m0478j1819J0219K8383
10185A59383m9033L907k1636m2566J9259k8980m6471L2727N5526J9424M2722N7358
10173B01620m0912j9624M702k652l3252j1153K7189K0355O171m3990K2269M6231
10161A76954p2416j3724Q1886r220J3268L8341L291m9711l932L2259p3664q6300
$$ plain form
10242 113480 55847 49293 114848 141066 128802 117629 153168 168917 158342 147812 162353 97995
10230 97995 112212 77240 59766 174824 186004 123709 92920 134896 161122 138058 121386
10219 121386 107858 176011 177567 146052 139602 146721 101216 72196 94682 162128 236872 230494
10207 230494 248580 144776 126871 137812 103807 53337 -4924 -6947 36780 59055 129233
10196 129233 154379 132809 154051 179660 122731 104164 173078 132600 120781 131000 159383
10185 159383 110350 114257 92621 50055 69314 40334 -6137 26590 82116 101540 144262 201620
10173 201620 160708 141084 145786 143134 109882 98729 125918 146273 152444 108454 130723 176954
10161 176954 104538 90814 172700 163480 176748 215089 218380 168669 164737 196996 123332 37032
10149C7032N741M3948m32j6092K9619M9281O9660K6192J3854n9868r3749k8542
10137G6644P1942k5528q299R247m7555M2406Q0110J40688J21638L2488J55717
10126F49498K61961L83637N56986O36919M22806k072l91235n66036n59743l63005
10116A029716j70273r9210j8238j44493j46520o0580m1058n7193q0993q104M8394
10105B51448J6420j6207m4628q4281q493j0182l841p867J8995J4761p5813J7275
10093F7587L9208N0411R058p978n9589n0247J12J6458J4086k5536l0376L7846
10081F1040K583j0728K1838O9229L9147l396r465j24351N130J489N2622O2212
10069A67350j4396m3647m285q917j9987J9798n1735m6324L8461j6396k7289O3406
$$ plain form
10149 37032 42773 86721 86289 70197 99816 149097 218757 244949 258803 198935 105186 76644
10137 76644 148586 123058 114759 124006 76451 118857 198967 339655 461293 493781 649498
10126 649498 911459 1295096 1852082 2489001 2911807 2909735 2518500 1952464 1392721 1029716
10116 1029716 859443 760233 741995 597502 450982 390402 349344 292151 211158 203054 251448
10105 251448 267868 251661 207033 122752 114259 104077 100236 92369 111364 126125 50312 67587
10093 67587 106795 157206 166264 158286 98697 48450 48562 65020 79106 53570 23194 61040
10081 61040 63623 52895 74733 143962 183109 179713 170248 45897 51027 52516 105138 167350
10069 167350 152954 109307 105022 96105 76118 95916 44181 -2143 36318 19922 -7367 56039
10057E6039M5540k6336J6890j9454M5724J16952N4475k3248j09192j1624L3388
10046A79154k0711j16856K565m5990o2690K6343O4164N721l213o3295J7267o4696
10034h2237L5834P944N1164O0621J5242k1559p8193j4673K0824j2549l440N7441
10022C6419K5464j0535j6610K4068j551M5199L9785p1914p8431q716N0438n3567
10010a9951j1324K3189K8898K5463Q84k5860j7800N6687L7035k1803q10K649K2013
9997I9270R608k9762n116k55O4341J3631n8814l8441l6494n4613j2704J18588
9985F9239J08601J7388M2592m0624n0525n807k8844m6770l3025K8906L6920n8913
9973C9138q7978m647L6335P8658k950Q4351L0468K772p6410k1018O0503M5356
$$ plain form
10057 56039 101579 75243 92133 72679 118403 235355 289830 266582 157390 145766 179154
10046 179154 158443 41587 44152 -1838 -64528 -38185 25979 31700 28487 -34808 -17541 -82237
10034 -82237 -46403 -38459 12705 73326 88568 67009 -11184 -25857 -5033 -17582 -21022 36419
10022 36419 61883 51348 34738 58806 57255 102454 142239 70325 -8106 -16822 33616 -19951
10010 -19951 -31275 -8086 20812 46275 47159 21299 3499 60186 97221 75418 74608 77257 99270
9997 99270 108878 79116 74000 73745 138086 151717 92903 54462 17968 -36645 -49349 69239
9985 69239 177840 195228 237820 197196 146671 140864 112020 65250 32225 61131 98051 39138
9973 39138 -48840 -53487 -17152 61506 58556 142907 173375 176147 99737 78719 139222 184578
9961A84578q5172p0535M6267L2206J9710k071J2660o9522l9163M7742M3790P869
9949A28359j8819n8958r2705J0296N0760N6854K0264K5789N819K1003n151L7355
9937A80866k5506m6080j2116o672K2791N353p001q1485o1399K7825L0512K7468
9925E4556L2827Q8963N1486p086n5049n2353o0054m4924m8373M0677P8941k7582
9913E2029n2307j7017O3503m4355n5827R942J8918l7477M6471K2653L5235J6677
9901E8445k8578O316q727k6350N9731M1033l4558l906j5177n4069l5303J1874
9889b9269M2343k177O218P779R8251m7304l1177K1663L5182l2160m1373j2769
9877A5207r104J7638o139l6235l2100Q2141Q3276l5813r2385k9659J3125K5091
$$ plain form
9961 184578 99406 28871 75138 107344 127054 124983 137643 68121 28958 76700 120490 128359
9949 128359 109540 50582 -42123 -31827 18933 75787 96051 121840 127659 148662 143511 180866
9937 180866 155360 109280 97164 90492 113283 118636 111635 30150 -31249 -3424 27088 54556
9925 54556 87383 176346 227832 220746 165697 113344 53290 8366 -40007 670 79611 52029
9913 52029 -278 -17295 46208 1853 -53974 -44032 -25114 -62591 -16120 6533 41768 58445
9901 58445 29867 36183 27456 1106 60837 101870 67312 63406 48229 -5840 -41143 -29269
9889 -29269 13074 10897 17115 24894 123145 75841 44664 66327 101509 69349 27976 15207
9877 15207 6103 23741 17602 -18633 -50733 31408 114684 78871 -13514 -43173 -30048 -4957
9865d957O5334J1559K3348L884r078J1817L0441m6091M276J3309J6840J52955
9853B73637R6334J41290J55168K5462q8702j61047j59032j20242p4782k6749k9384
9842C1953r242M3715N5049J7148l9178j4504j3423k9110M1857K3178J7404r860
9830A14987o7207N7871k818o722j1622k6952p5083L0457J7254r95j688j4368M2043
9817E5157N3630k7421l902k7244J538L145R3729J4226j5067l1426p5521k538Q9800
9804A28106L2990n664l370N823J0429j5812k3876K3152L3085L0258o7924o7126
9792H0071j9110L0678L4381q353K6497k303K5932K5777M8799m8513k7651P512
9780A73717n9504J5623k6488m0792l3522N0790K9629K6906Q211k4478o278K1073
$$ plain form
9865 -4957 60377 71936 95284 99168 90090 101907 132348 86257 90533 103842 120682 273637
9853 273637 369971 511261 666429 691891 603189 442142 283110 162868 88086 61337 31953
9842 31953 22711 66426 121475 138623 99445 84941 71518 42408 84265 107443 124847 114987
9830 114987 47780 105651 102833 96111 84489 57537 -17546 12911 30165 29170 27482 13114 55157
9817 55157 108787 81366 77464 50220 51758 54903 148632 162858 147791 116365 40844 38306 128106
9804 128106 161096 155432 152062 157885 168314 152502 128626 151778 184863 215121 147197 80071
9792 80071 60961 91639 126020 117667 144164 141861 167793 193570 242369 193856 166205 173717
9780 173717 114213 129836 103348 62556 29034 79824 109453 136359 144570 120092 113814 134887
9768A34887K0775J6768k5296j5194j7051q3875K9466N6252O871L6483k2002j5645
9756A22439m9110l7868Q049K1646j8451J0768J4736k7951M959k2584Q8854k918
9744A12569r442k2836k8399m6402O5514L0637k9288J6333l5385P32P461j0729
9732E0765j2639M0712J4298J3324r7234j4976J4271N3387M0133R316n0232K1435
9720H2560M2193J0898j6120P314L4806N71O7179l1186o4949k1148q291j672k4055
9707G8100k8146O646K3521Q3935m1563K804M8586P1025L7224o4466o3122m7981
9695A06563o155L204L0874l6736r810N844O0376J6233M597K313J3267j4764j9710
9682A56096k3656M1268O2842j3153l3242O310l9753k4231L1122q000M0835M6408
$$ plain form
9768 134887 155662 172430 147134 131940 114889 31014 60480 116732 123603 160086 138084 122439
9756 122439 73329 35461 43510 65156 46705 57473 72209 44258 49217 26633 115487 112569
9744 112569 103127 80291 51892 5490 71004 101641 72353 88686 53301 54033 61494 50765
9732 50765 38126 78838 93136 106460 9226 -5750 8521 61908 102041 111357 61125 82560
9720 82560 124753 135651 119531 126845 161651 162222 229401 198215 133266 112118 103827 102155 78100
9707 78100 49954 56600 80121 164056 122493 125297 173883 244908 282132 217666 154544 106563
9695 106563 100408 103612 134486 97750 87940 93784 154160 170393 174990 177303 190570 175806 156096
9682 156096 132440 173708 236550 223397 190155 196465 156712 132481 163603 155603 196438 242846
9670B42846n7356k316R557J7315R1596l1564o2435j1049o867n0213k7436N6063
9658A68141N2532M6971o0732m3778J68r724K6911L5835L5220k6729p2886M2951
9646A94880P7247J0263n2160k4412K1876M1379L6390L7142L3420r7770l9167Q462
9634B47550O4073k3510K0761L7480K9128l6793J3742J7626n8752o0228j8119R5296
9622C28254K6348q7279l7433K1088L6433Q457n5847m7438k9938N2274j9437k212
9610A93270P1985K6986m867j1320Q77m3839j7827L3137n4864L663J1299O9338
9598B77838M3580L1019l6196K0001L0387L8606l1126r8223k6107P5768J9452k3974
9586C21025p0829k7776N8568J3377k0184Q5146K5638n2458m9453R624l3724j3820
$$ plain form
9670 242846 185490 183174 192731 210046 301642 270078 207643 196594 189727 139514 112078 168141
9658 168141 220673 267644 206912 163134 163302 153578 180489 216324 251544 224815 151929 194880
9646 194880 272127 282390 230230 205818 227694 269073 305463 342605 376025 278255 239088 247550
9634 247550 311623 288113 308874 346354 375482 338689 352431 370057 311305 251077 232958 328254
9622 328254 354602 267323 229890 250978 287411 295868 240021 192583 162645 214919 195482 193270
9610 193270 265255 292241 287374 276054 276931 233092 215265 248402 193538 197201 208500 277838
9598 277838 321418 352437 316241 336242 366629 405235 374109 275886 249779 325547 344999 321025
9586 321025 250196 222420 280988 294365 274181 359327 384965 332507 283054 292678 258954 245134
9574B45134L8666N441K3153K4705K9844j6064K653K2911R043L8211j2834k2150
9562C88713o3597j5163L5790P211P3691j4423j6499o4409O615O5592L8838O336
9550D48695K3114k0807l8227J4450p778O2254k3786Q392O6482Q4848M0309q2441
9538E75505k4597k8518n491j5911R1875l8353n5607Q004N5229M1057m0028o407
9526E56758m1349J3893M3699Q5903J0096l553P8468r6835o8204M1213J2955r754
9514F23290j5233L9309l3439N2706J0150K6158L5694M0087j1430K6665P6994Q3878
9502I54829k1600K4982P527l0125p204j5877l6749M8968O3842j1938K4432N9371
9490A060458J1249J8752P4132q744j6707m983R0940L7207p6665J5261O0175J49191
$$ plain form
9574 245134 283800 289241 312394 337099 366943 350879 353532 376443 385486 423697 410863 388713
9562 388713 325116 309953 345743 352954 426645 412222 395723 331314 337929 403521 442359 448695
9550 448695 471809 451002 412775 427225 419447 481701 457915 466307 532789 617637 657946 575505
9538 575505 550908 522390 516899 500988 592863 554510 498903 506907 562136 603193 563165 556758
9526 556758 515409 529302 573001 658904 669000 665447 743915 647080 578876 620089 633044 623290
9514 623290 608057 647366 613927 666633 676783 702941 738635 778722 767292 793957 870951 954829
9502 954829 933229 958211 965738 935613 928409 912532 875783 924751 988593 976655 1001087 1060458
9490 1060458 1071707 1090459 1164591 1155847 1139140 1134157 1225097 1262304 1185639 1200900 1261075 1410266
9478A410266J0750n5904r597J8497j544l2355J306K0802J00263L2504j5058k0644
9466A459286K774k239M327N1211J01694O5372M3060J5085k5707P6544P5893J6337
9454A883637N7614N5429R1406L3186p305K3034O6910L4673P5857J6081J8201P2255
9442B420978J09077N0157O9461P6174k9974K842M7479R3241J01324J06693J9487
9431C066939L7261J24049J35197J42543J03359O2217O9709M1878Q9253J46249
9421D018654P7778R0377J37663J43364P6161Q4227J12753J50610J78206K28676
9411E298469J36597J43713J47537J47765J20518J46507K38933K92666K18205K03432
9401G094342K43507K21231J36648J75792K51814K78563K80241J92995K91072L73545
$$ plain form
9478 1410266 1421016 1365112 1355515 1374012 1372468 1340113 1341419 1362221 1462484 1494988 1479930 1459286
9466 1459286 1462060 1459821 1464148 1515359 1617053 1682425 1725485 1740570 1714863 1791407 1867300 1883637
9454 1883637 1941251 1996680 2088086 2121272 2113967 2137001 2203911 2238584 2314441 2330522 2348723 2420978
9442 2420978 2530055 2580212 2649673 2725847 2695873 2698715 2746194 2839435 2940759 3047452 3066939
9431 3066939 3104200 3228249 3363446 3505989 3609348 3671565 3741274 3783152 3872405 4018654
9421 4018654 4096432 4186809 4324472 4467836 4543997 4628224 4740977 4891587 5069793 5298469
9411 5298469 5435066 5578779 5726316 5874081 5994599 6141106 6380039 6672705 6890910 7094342
9401 7094342 7337849 7559080 7695728 7871520 8123334 8401897 8682138 8875133 9166205 9539750
9391I539750K67609K81967L15478K62107K30974L09129L19735M04292L94496K99259
9381A2624796K91082K94839K59397M02780L51837K84513K92258L51564K70426
9372A5423492K19348K14748J98266J76529J98574J45682J60817P5190K4438m1416
9362A6795668j07912j43826r1459j8219j18579j81699k17931j88495j95678k53878
9352A5277992k87161k74450l11466k91119l65226l47412k97271l44920l23863
9343A2435104l22841l28529l15357l66350k82293l09064k79731l24314l06131
9334I600494k71955k83544k18667l47138k94920k22886j87001k01209k07936j99011
9324G166227k14612j99919j86786j40590j68041j84412j22635k07998j88208k10689
$$ plain form
9391 9539750 9807359 10089326 10404804 10666911 10897885 11207014 11526749 11931041 12325537 12624796
9381 12624796 12915878 13210717 13470114 13872894 14224731 14509244 14801502 15153066 15423492
9372 15423492 15642840 15857588 16055854 16232383 16430957 16576639 16737456 16812646 16837084 16795668
9362 16795668 16687756 16543930 16452471 16434252 16315673 16133974 15916043 15727548 15531870 15277992
9352 15277992 14990831 14716381 14404915 14113796 13748570 13401158 13103887 12758967 12435104
9343 12435104 12112263 11783734 11468377 11102027 10819734 10510670 10230939 9906625 9600494
9334 9600494 9328539 9044995 8826328 8479190 8184270 7961384 7774383 7573174 7365238 7166227
9324 7166227 6951615 6751696 6564910 6424320 6256279 6071867 5949232 5741234 5553026 5342337
9314E342337q2632j46913k18333k04830q0158n5596j05373j35210r0911j07863
9304D114518j45098j36645j77174q9352j438o7421k6374q3880p0509o4697n8791
9293C193139n5536p0641p4520j17879r2351p1538m9216k5025o1622l4054j00522
9282B440235q3302j7082q8156q5620k480j32p4611p5296m6109q6883k8120K6638
9270A879082m5663l6117l691j0626m2642m1262J0599k8155m6665n2605o1432M3077
9258A563900l694m5751m6869n9073p3143l9863n177J5995l7671l6539L0232L976
9246A266323m154L1553j539n7644o5850n9042Q08j9882k1318p6650n8895K0705
9234I54415Q9748j4527k4362K3393l9101o1875k6567P0545N0397j9559n9601j7010
$$ plain form
9314 5342337 5259705 5112792 4894459 4689629 4609471 4553875 4448502 4313292 4222381 4114518
9304 4114518 3969420 3832775 3655601 3566249 3564811 3497390 3471016 3387136 3316627 3251930 3193139
9293 3193139 3137603 3066962 2992442 2874563 2782212 2710674 2661458 2636433 2574811 2540757 2440235
9282 2440235 2356933 2339851 2251695 2166075 2163595 2163463 2088852 2013556 1967447 1880564 1852444 1879082
9270 1879082 1833419 1797302 1793611 1782985 1740343 1699081 1709680 1681525 1634860 1582255 1520823 1563900
9258 1563900 1560206 1514455 1467586 1408513 1335370 1295507 1290330 1306325 1268654 1232115 1262347 1266323
9246 1266323 1262169 1293722 1292183 1234539 1168689 1109647 1110455 1090573 1069255 992605 933710 954415
9234 954415 1044163 1029636 1005274 1028667 989566 927691 901124 971669 1022066 1002507 942906 925896
9222I25896M9789J5052O2484j3894m5330m4207o1741r287M5846n2793l5439m1419
9210G94957K2549j1314J8590o5343o0155l0183O551M4234l0561J7628o3549M204
9198F47608Q3512l4164m1681o6271j3496K0789K5039K8572o1699j21148l4663
9187D32398N8686N4209N706o1349k254k1571P586j4122R3945Q2466J16308O8302
9175H20310n5814o2939j26845k8873k3307o5543K0335j0780J4124l1081M4417
9164D94004l808K5347n0751j10750K5908P7199K3249o7k5455J5632N6032J9447
9152E45987o8875j03P397l505l9109o0971K3327k581j054j5322n3257k0939J8411
9139C29406N6028J5520N1257l0013l9176J0057L5402J0296l1806J4776K6290o7368
$$ plain form
9222 925896 975685 990737 1053221 1039327 993997 949790 888049 878762 924608 871815 836376 794957
9210 794957 817506 806192 824782 759439 699284 669101 675652 719886 689325 706953 643404 647608
9198 647608 731120 696956 655275 589004 575508 596297 621336 649908 588209 467061 432398
9187 432398 491084 545293 550999 489650 487396 465825 473411 459289 553234 635700 752008 820310
9175 820310 764496 701557 574712 545839 522532 456989 477324 466544 480668 449587 494004
9164 494004 490196 515543 464792 354042 379950 457149 480398 480331 454876 470508 526540 545987
9152 545987 477112 477009 484406 480901 441792 380821 404148 401567 400513 385191 331934 310995 329406
9139 329406 385434 400954 452211 422198 383022 393079 428481 438777 406971 421747 448037 380669
9127C80669n2950k5228k1096j9173J6695J6321k7314m5272l6303l500J02753N5441
9115C41043p1032N5042K1268l3399N361n599M4147L408l9921j2129m236k1210
9103B82743j8419L28J1083l7772Q0014J7232k0275n1500l498m157K456j4541P7232
9090C20926M5609l3411l708l8447K149j3036q4766J9487J13224p927m2290l1647
9078B46163m406K9726L211q2844k0932J6394k1395J9198k8864P71J12272N6783
9066C26077o9322k1349N415k8878k6017K2480N1026j7141O6231K5312N4412l5316
9054C52930m4627m7716r8962L0584J2428M3812M1543j07285j3744O6856M1603
9043B77422m5124L3364M5182j00842p3475J5244O5185M8815J6181R622k1255p9621
$$ plain form
9127 380669 327719 302491 281395 262222 278917 295238 267924 222652 186349 182849 285602 341043
9115 341043 270011 325053 346321 312922 318283 312684 356831 360239 320318 308189 303953 282743
9103 282743 264324 264652 275735 237963 317977 335209 314934 263434 259936 255779 258235 243694 320926
9090 320926 366535 333124 329416 290969 293118 280082 195316 214803 328027 320100 277810 246163
9078 246163 241757 271483 274694 191850 170918 187312 165917 185115 156251 157022 269294 326077
9066 326077 256755 235406 240821 211943 185926 208406 259432 242291 308522 333834 388246 352930
9054 352930 308303 260587 161625 192209 204637 248449 289992 182707 168963 235819 277422
9043 277422 232298 265662 310844 210002 136527 151771 216956 265771 281952 291574 270319 190698
9031A90698j05275J99P2061K6053M0461n076j875j9745J1205j4429k2636j9616
9019A52025K4108N7695q642n0356j8654j1127O1959K0142j1534J3648l5536l9592
9007A54136N7978K0482l5482J8726m4620j2643K5871k3622l225J1065j7731j3439
8995A37496M7552j0415o8687k4693Q8151P4029L5425o1810o3894j4118O6150m0577
8983A64609k320j8965k9950K6932J15827L9002r7299l9589J9254L5288J0014j4086
8971B08717n0255n347j0583k8950P3220O0856o3940l376J1644k1862k4415N3984
8959A99693M0820K3455J6779n5887m3117n3599p1472J1676J3927J28389K4654
8948B35318p3619p6440o9247l6164O5407J13524j6664o587M405O6705m374K3106
$$ plain form
9031 190698 85423 85622 157683 183736 224197 219121 217246 197501 208706 194277 171641 152025
9019 152025 176133 233828 225186 174830 156176 145049 207008 227150 215616 229264 193728 154136
9007 154136 212114 232596 197114 215840 171220 158577 184448 160826 157601 168666 150935 137496
8995 137496 185048 174633 105946 81253 169404 243433 278858 217048 153154 139036 205186 164609
8983 164609 162289 143324 113374 140306 256133 295135 197836 158247 177501 212789 222803 208717
8971 208717 158462 153115 142532 113582 186802 247658 183718 180342 191986 170124 145709 199693
8959 199693 240513 263968 280747 224860 181743 128144 56672 68348 82275 210664 235318
8948 235318 161699 85259 16012 -20152 45255 158779 142115 135528 139933 206638 202264 225370
8936B25370K1418k7149l2134J262j5727M810K9852j8782j116K6278k4101k9749
8924A60232k263M569l1822N3085L4172k1036l5973K4388p0268q72N2396M9536
8912B16144k1599M114K8565M3900o4149l6104k61M6273k6316J5364j555m2361
8900A62015p48K313M2999j4137l1597M9666o0511r4408L4983Q2679J1294M3892
8888B28440P3675J8710o7110q3391n8766L5860J6631M2056Q9538k3752m2446j6030
8876B13415n5008K4439J0205l6622O0674J3242n8927o961Q134M8223P367J0664
8864B38845Q3692k0758o4873l4811Q399L6211N385K2625O1079o7095l3356P3464
8852C08807j1735J4528M9679k7686k3108m7796J1559o357K1941N1440O958P8791
$$ plain form
8936 225370 246788 219639 187505 188767 173040 177850 207702 188920 187804 214082 189981 160232
8924 160232 157969 162538 130716 183801 217973 196937 160964 185352 115084 114212 166608 216144
8912 216144 194545 198659 227224 271124 206975 170871 170610 216883 190567 205931 204376 162015
8900 162015 161267 163580 206579 192442 160845 210511 150000 55592 90575 173254 184548 228440
8888 228440 302115 320825 253715 170324 111558 147418 164049 206105 295643 271891 229445 213415
8876 213415 158407 182846 193051 156429 217103 230345 171418 164457 172591 220814 228181 238845
8864 238845 322537 301779 236906 202095 210494 246705 252090 274715 335794 268699 235343 308807
8852 308807 297072 311600 361279 333593 310485 262689 274248 267891 289832 341272 348230 427021
8840D27021P7794K8571L0144P3023Q0258K7811N0250J03515J17203J95947J40817
8829A352354K39870M12894O68420R99884J547692K295008L398753L683784K684653
8820A7283312O96505k127138l342153l628965k758471j779799j105158o64974
8812B573159m39465l08040j74171j26626j32202j04786j24535p5993j689k5142
8802A060510j27895n1535n2812j1414Q0234J12790J0292l92J7933J9586J12587
8791A169884J35889R5448J53845K21155J73495L02286L82793N20944Q64826J372295
8781E392860K043164L295076N251997P186816O974393M685293j14251n197476
8773B9517872p069010p100760m800056k893433j766492j224783q44622n99682
$$ plain form
8840 427021 504815 533386 563530 636553 716811 744622 794872 898387 1015590 1211537 1352354
8829 1352354 1592224 2005118 2673538 3673422 5221114 7516122 10914875 14598659 17283312
8820 17283312 17979817 15852679 12510526 8881561 6123090 4343291 3238133 2573159
8812 2573159 2133694 1825654 1651483 1524857 1392655 1287869 1163334 1087341 1085652 1060510
8802 1060510 932615 881080 828268 816854 897088 1009878 1020170 1019778 1037711 1057297 1169884
8791 1169884 1305773 1401221 1555066 1776221 1949716 2252002 2634795 3155739 4020565 5392860
8781 5392860 7436024 10731100 15983097 23169913 30144306 34829599 34715348 29517872
8773 29517872 22448862 15348102 10548046 7654613 5888121 4663338 3818716 3219034
8765C219034m38025l90728k24016j14023q0726j11697q9910o8954j54775j07983
8755A438197r3346m1943j7244K5220O3660l2219r6906j6400J06065P0000J3369
8744A418453L1814P7033J00525J35409L11664L65671N03462O83476J077090J738992
8734F443589K689674L553126L134155J854726o31422k817689l582692l286334
8726G357133k165978j313402q68631n40318l49415k70372j97176j38210j51278
8717A362353o0068q0134j07371l2608J6526j0820n3945l7231k1983M0315K8997
8706A044031o439K2429p9073j1627k2556Q60K9665o896L4778L7715l0916l8769
8694I73202J19250P7194p2043l5218p0024m6181m7225j09335p3840j385k6741
$$ plain form
8765 3219034 2781009 2390281 2166265 2052242 1971516 1859819 1769909 1700955 1546180 1438197
8755 1438197 1344851 1302908 1285664 1310884 1374544 1342325 1245419 1229019 1335084 1405084 1418453
8744 1418453 1450267 1527300 1627825 1763234 2074898 2440569 2944031 3627507 4704597 6443589
8734 6443589 9133263 12686389 15820544 17675270 17043848 14226159 10643467 7357133
8726 7357133 5191155 3877753 3009122 2468804 2119389 1849017 1651841 1513631 1362353
8717 1362353 1302285 1222151 1114780 1082172 1098698 1087878 1033933 996702 974719 1015034 1044031
8706 1044031 1037592 1060021 980948 969321 946765 947625 977290 970394 1005172 1042887 1011971 973202
8694 973202 1092452 1169646 1097603 1062385 992361 946180 898955 789620 715780 714395 687654
8683F87654q6354n4792M4441m1147q1366k9444L1092P6808J6138m9797q2855J0700
8671D41078J2023J2717j002J3605k6319j9578j6640J9517P6375M5431K4775K5136
8659F07118M2002M6696O2287R3309J83391J52397R300m2954r9441J3756m0866
8648A026995j29232q4926q7294j17441K5988O0798o2751q3682o0612j5356m716
8637D67771j8738J809j3638k4361k3698m7999l1429K4827J1184j3022o116P9224
8625D05814J52469K2270L2715q8931m8613k1464l7921J8381m1671N4705R6746
8614E44500O5574J49992J40777K29836K90082K55148j39837l35506k32263r4663
8604H73640m8798p2298j10527l2870k315l1795p9277j3603J623J0834m6267J6122
$$ plain form
8683 687654 601300 546508 590949 549802 468436 438992 470084 546892 563030 513233 430378 441078
8671 441078 453101 465818 464816 478421 452102 432524 415884 435401 511776 557207 581982 607118
8659 607118 649120 695816 758103 851412 1034803 1187200 1196500 1153546 1054105 1067861 1026995
8648 1026995 897763 812837 725543 608102 634090 694888 632137 548455 487843 472487 467771
8637 467771 449033 450842 437204 412843 389145 341146 309717 334544 345728 332706 326590 405814
8625 405814 558283 580553 613268 524337 475724 454260 416339 434720 393049 447754 544500
8614 544500 610074 760066 900843 1130679 1420761 1675909 1536072 1200566 968303 873640
8604 873640 824842 752544 642017 609147 606832 575037 495760 482157 483780 494614 448347 464469
8592D64469M5118j1649j01182q5406J8745P6252l8444N5983O5534L9085N941K6975
8580E61421K9600J16851J9522j25166j13789j40930k8147J2936j4801M7771O4526
8569D29794J1596K9980J53880J13948J42019K3538j99137j78689p4722K4758J4585
8558D91550k9829l4810j3322n2152j8241l593L152r601l1280q0894m4515k2613
8546A53852k4034k8300R5688N3365Q216n1875k9806j4658L7394L2498N4967J05016
8534C92323K3465m9746n0656r9660q0699l6219J0242M4817L2621p2300l4716J3354
8522I2826J3730P2064K7848p137p1164p5882J3353R062N1965q586J7249j2828
8510A22500l1383J7278O665K8950K6050n481M5563L7442K7894o947o7573n4220
$$ plain form
8592 464469 509587 497938 396756 311350 330095 406347 367903 423886 489420 528505 534446 561421
8580 561421 591021 707872 727394 602228 488439 347509 319362 332298 317497 365268 429794
8569 429794 441390 471370 625250 739198 881217 904755 705618 526929 452207 476965 491550
8558 491550 461721 426911 413589 361437 343196 339603 342755 333154 301874 220980 176465 153852
8546 153852 129818 101518 197206 250571 258787 206912 177106 162448 199842 232340 287307 392323
8534 392323 415788 366042 315386 215726 135027 98808 109050 153867 186488 114188 79472 92826
8522 92826 106556 178620 206468 199331 128167 52285 65638 74700 126665 118079 135328 122500
8510 122500 91117 108395 115060 144010 170060 164579 210142 247584 275478 268531 200958 146738
8498A46738j1901J3288L7105K585N5436l7107o7632j5730k1257N473M6120L3467
8486A86585o853n9526K6517O6951l1212o5912r253J6943O0300q4699k0925L7716
8474A16632K9291q6433j7354L7762M9391r493k2288Q678J2080k3173k7909O387
8462G3571Q195k4107j2275K1876N6591o9190j5055O9796k5762k3761J5981J1832
8450H7692K76l9720l5852O0591M4511L2535O8937n926o9784j3849M2980j6789
8438A55602n4983l1750q2333n9443N1645M7185L6405K7165j1353p3514m2756L3847
8426d283J623q904m3673r3610J0238L1623L3569P402k462O6164O4656L7240J7062
8413A16645L4769K5177j0005j8548o1337n8929k7545M4862Q5028K9511m8316m1378
$$ plain form
8498 146738 134837 148125 185230 187815 243251 206144 138512 122782 101525 106998 153118 186585
8486 186585 179732 120206 146723 213674 182462 116550 107297 124240 184540 99841 78916 116632
8474 116632 145923 59490 42136 79898 129289 119796 97508 106186 118266 95093 67184 73571
8462 73571 81766 57659 45384 67260 123851 54661 39606 109402 83640 59879 75860 87692
8450 87692 87968 48248 12396 72987 117498 150033 218970 213044 143260 129411 172391 155602
8438 155602 100619 68869 -13464 -72907 -21262 25923 62328 89493 78140 4626 -38130 -4283
8426 -4283 -2660 -11564 -55237 -148847 -138609 -106986 -73417 -66015 -68477 -2313 62343 99583 116645
8413 116645 151414 176591 166586 148038 86701 27772 227 45089 130117 159628 111312 69934
8401F9934l4059l0632K0848m5963M4703O6221K6354l1349l577J9315J5773j8165
8389I9403o276k8220K1477J544p86L0418j9412J6296L4993K1007m2221j7639N9035
8376A69619r105N0204n208m8803M5963J9635N4901L1859n8769r7680n6886J058
8364I6788n6576N428L1930q724o3916Q614R333O0107M9859L6511l8677n4905J9454
8351I5226K2514R146j7576k7568j7843Q577P410J9612K4509L9666p4516p7056
8339A2101k5898N5465O1537J3319L14j7211p5147P70N483m073K1992L2335J8388
8326I9375k5282K6451K5863j0699j0499m2845q9238J0058Q5391K6621K1322j2740
8314A03778l7061n5855P674J7124Q0530j6559L3473J5740K2780k1397Q692K6611
$$ plain form
8401 69934 35875 5243 26091 -19872 24831 91052 117406 86057 82480 101795 117568 99403
8389 99403 93127 64907 86384 87928 87142 117560 98148 114444 149437 170444 128223 110584 169619
8376 169619 160514 210718 205510 156707 202670 222305 277206 309065 250296 152616 95730 96788
8364 96788 40212 45640 77570 68846 4930 13544 22877 82984 132843 169354 130677 75772 95226
8351 95226 117740 126886 109310 81742 63899 72476 79886 99498 124007 163673 89157 12101
8339 12101 -13797 41668 103205 116524 116838 99627 24480 25250 30733 26660 48652 80987 99375
8326 99375 74093 100544 126407 115708 105209 62364 -26874 -16816 68575 95196 116518 103778
8314 103778 66717 10862 18536 35660 116190 99631 133104 148844 171624 150227 158919 185530
8302A85530q3985j10382j0789K7351P3739K0634m7174J4236j1131j6057j0663
8291C1309l1148l070l5383o67j5256M6048M1935M1151l9627n5463l1688j4673
8279f6532K1331j3607L3872M258k7538k2988j7725M1588J7626K1623K0194Q2192
8267I4294L1616J6586m9856l3017k9007m2427j202O1707k1143J3813r978N1533
8255H2919L2478n2915j6266l0460m3231m3308P139J04426J8178j2786L9701K9042
8243A14917n683m9617k5956R138L9422k1742m888K1411J0845J787m6893L2742
8231G5483K3454j7706M0255K9149O4433j20449n3462J0155N3129m9583m8160p2483
8219f5785j2974J0066O9485Q030m9889J1303N3878j6102o5137k8003K6168N79
$$ plain form
8302 185530 101545 -8837 -19626 7725 81464 102098 54924 69160 58029 41972 31309
8291 31309 161 -2909 -38292 -38959 -54215 -8167 33768 74919 35292 -20171 -51859 -66532
8279 -66532 -45201 -58808 -24936 -20678 -48216 -71204 -88929 -47341 -29715 -8092 12102 94294
8267 94294 125910 142496 92640 59623 30616 -11811 -13013 48694 27551 41364 31386 82919
8255 82919 115397 62482 46216 15756 -27475 -70783 -63644 40782 58960 46174 85875 114917
8243 114917 109234 59617 33661 42799 82221 60479 55591 77002 87847 89634 42741 75483
8231 75483 98937 81231 121486 150635 215068 94619 41157 51312 104441 54858 6698 -65785
8219 -65785 -78759 -68693 792 8822 -41067 -29764 24114 8012 -57125 -85128 -58960 -58381
8207e8381Q850N328J398M8511M7296p9762j3459O8576J322K5267M4110p0514j3534
8194A5008p4674m6484J7831O7625R6598m889n3917O933l0545k2406p583P107L309
8181b6087M243L1501m4421M9871L2013k0099m8292n0560L8990L0622K3731l476
8169A8036l0711J6337K7867J4346L8853P959q534N7951m7348m2139l0494n0069
8157b7946K5718J3069O3898k3066o1867N678M3106J3147l6195K1405K5823j0382
8145E2388J5034J4748o3427l5737m5993o2708M2847N9418j8615M4600p650O1488
8133E6393R3344l3840l3593m8014k444j6259j1294q940m020J4529J1685p6920
8121e9373m3317J4074l1398L71R56J08403J4424L404j1085j309M440l4000l836
$$ plain form
8207 -58381 -49531 -44203 -42805 5706 53002 -26760 -40219 28357 29679 54946 99056 28542 15008
8194 15008 -59666 -106150 -88319 -20694 75904 71015 17098 24031 -6514 -28920 -36503 -29396 -26087
8181 -26087 -21844 9657 -34764 15107 47120 27021 -21271 -71831 -32841 -2219 21512 18036
8169 18036 -12675 3662 31529 45875 84728 92687 84153 142104 94756 52617 22123 -27946
8157 -27946 -2228 10841 74739 51673 -10194 -4516 38590 51737 15542 36947 62770 52388
8145 52388 67422 82170 18743 -16994 -62987 -125695 -82848 -23430 -42045 2555 -5095 56393
8133 56393 149737 115897 82304 34290 31846 15587 4293 -4647 -8667 5862 17547 -59373
8121 -59373 -102690 -88616 -120014 -119643 -118687 -10284 4140 7544 -3541 -4850 -410 -34410 -38246
8108c8246j4584J6285q2473k0427M8993K8425j1601k8335L6759Q0875n5650j4668
8096e4647P9814K5316K2382K7473K3166j1284r0846o6018j2248M0988P690N8045
8084D9831k8220m8917j1987n5554R361O9788J01931N974j5595q9576p9584K4226
8072f8322O2748Q554j8015R091M7171N7485J8853j0813P332R034o2382q5556j07615
8059a32435K1806O4651o943k5842j4825L2825j7036j15083L738R8108Q1202k4743
8047c4577k0362l5895m1395k2392l8078N2260L0775N8030j6378L071K7306J9790
8035a7845K7783O5057j1112L089l5698l186k9431r079j1302m3835K5119J6672
8023b3768N098L2980l4012j4455L3883N8420N5561j6116k8342J5202k549k2485
$$ plain form
8108 -38246 -52830 -36545 -119018 -139445 -90452 -62027 -73628 -101963 -65204 15671 -39979 -54647
8096 -54647 25167 50483 72865 100338 123504 112220 21374 -44644 -56892 -15904 -8214 49831
8084 49831 21611 -27306 -39293 -94847 -85486 -15698 86233 92207 76612 -12964 -92548 -68322
8072 -68322 -5574 2980 -15035 -5944 41227 98712 117565 106752 114084 123118 60736 -24820 -132435
8059 -132435 -110629 -45978 -52921 -78763 -93588 -60763 -77799 -192882 -189144 -91036 -9834 -34577
8047 -34577 -54939 -90834 -132229 -154621 -192699 -140439 -109664 -51634 -68012 -64941 -37635 -17845
8035 -17845 9938 74995 63883 66972 31274 28088 -1343 -10422 -21724 -65559 -40440 -23768
8023 -23768 -18670 14310 -19702 -34157 -274 58146 113707 97591 69249 84451 81902 59417
8011E9417L7566O8899J8956r814r603n6563p9639l5823J7664j2908M8970L5714
7999H2836R500k4553n8634J5860Q2500r129n9211m9124K531l6279k8453J2989
7987e9167P7144J01350N1015n7672q7239m0934O9075M6231k3775l2299p0138p692
7975c4101O0571N8422J4713r773l9512R407o683J7597j9081o4226j4190J9708
7963g148m7997j700Q244Q078J671Q459N0709Q896p539m8095K549L3533M3268m1445
7949A1483k5415j2197o1599m4234K5116P1575M153J443M1777J3820R498m8680
7937a3260J0707m516K0558M0023j7147m7494K0178k1873j09727r624P4268N1878
7925f029L7177m5718m269N8365K3845N2336J2468n057k0486m6652K0747k3248
$$ plain form
8011 59417 96983 165882 184838 175024 165421 108858 29219 -6604 11060 -1848 47122 82836
7999 82836 92336 67783 9149 25009 107509 98380 39169 -9955 -7424 -43703 -72156 -59167
7987 -59167 17977 119327 170342 112670 25431 -15503 53572 99803 76028 43729 -26409 -34101
7975 -34101 26470 84892 99605 89832 50320 59727 53044 70641 51560 -12666 -26856 -7148
7963 -7148 -55145 -56845 -48601 -40523 -38852 -30393 20316 29212 21673 -26422 -23873 9660 52928 11483
7949 11483 -13932 -26129 -87728 -131962 -106846 -35271 -31118 -29675 12102 25922 35420 -13260
7937 -13260 -2553 -7069 13489 53512 36365 -11129 9049 -12824 -122551 -132175 -57907 -6029
7925 -6029 31148 -14570 -18839 39526 63371 115707 128175 123118 102632 55980 76727 53479
7913E3479j4424n694k3097k2545M3186N2299j6078k0158j9021L8126O6227r203
7901A23097l3005O133J8023l1847q0077j9878L8021J884p5142O109K200K9829
7889a4653L9862N1449l622N0788q284n0707J9975L7879p0122p4136K8786M5113
7877E2328M3081J7386L9182p9081m6620j1608j7574k0088q826N5752J3921j2262
7865B5591M3577l07q7798n1491P8516K1035n2733k6710J1243N182m5670l4848
7853a14413l087O8291R2671r862n504j2615k9061k067L556j4267K8861L9780j1452
7840C0831q7443q487K2877k8625k2061K3898M3614J1277P921l0519l9941M252
7828g2406l7298J7459k4987j3932K5693J1148m6973J06450J2170m392k3830J5364
$$ plain form
7913 53479 39055 33361 10264 -12281 30905 83204 67126 46968 27947 66073 132300 123097
7901 123097 90092 96225 114248 82401 2324 -17554 20467 22351 -52791 -46682 -44482 -14653
7889 -14653 25209 76658 73036 123824 115540 64833 84808 122687 52565 -21571 7215 52328
7877 52328 95409 112795 151977 72896 26276 14668 -2906 -22994 -31820 23932 37853 25591
7865 25591 69168 68861 -18937 -70428 8088 29123 -23610 -50320 -39077 -33895 -79565 -114413
7853 -114413 -117500 -49209 43462 33600 28096 15481 -13580 -15647 -12091 -26358 2503 42283 30831
7840 30831 -56612 -65099 -42222 -70847 -92908 -69010 -25396 -14119 -6198 -36717 -76658 -72406
7828 -72406 -109704 -92245 -117232 -131164 -105471 -94323 -141296 -34846 -22676 -27068 -50898 -35534
7816c5534L9108R687q2227M653M2316M0247j1728m9215l9554N3661j7613m3100
7804h9299j5445R03O0115K2000N340j2696K8247R312J2128J4128J11j8905Q522
7791B4461O891m4633k2484K549L7664N9423o429k4251L7101j4027k5866j2690
7779A7709L1583m8531l0587p995L3649J2744Q8002o2500j06949k1072P1011k0167
7767d3103J2531l6947M5877J25491L214m4168K434o599o3340J3727K4331j0186
7755B3262m3193R465O2565k1251j5537j4471r69L969j77k7911k1772K9928L9429
7742B3337K9090n9000r601J1615j5977J2632P1412M3302M5231n952k4584k8883
7730I2622n6205M6287j8064m3813j13411j20243O167M1083N4362L2125k8559M4381
$$ plain form
7816 -35534 3574 13261 -68966 -64313 -21997 18250 6522 -42693 -82247 -28586 -46199 -89299
7804 -89299 -104744 -103841 -43726 -21726 -16386 -29082 -835 8477 20605 34733 34844 15939 24461
7791 24461 31352 -13281 -35765 -33216 4448 63871 57442 33191 70292 56265 30399 17709
7779 17709 49292 761 -29826 -37821 -4172 8572 96574 34074 -72875 -93947 -22936 -43103
7767 -43103 -30572 -67519 -21642 103849 107063 62895 65329 58730 -4610 9117 33448 23262
7755 23262 -19931 -10466 52099 30848 15311 840 -129 3840 3663 -24248 -46020 -16092 23337
7742 23337 52427 -6573 -16174 -4559 -20536 -7904 63508 106810 152041 146089 121505 92622
7730 92622 36417 82704 64640 20827 -92584 -212827 -206660 -165577 -111215 -79090 -107649 -63268
7718f3268j0794j6051K8570m1401n85L6419L2187K5605J2330m0381k6294j11887
7706a75550J8559R8445L6126K5015l6582k0151L8093K6991m1497L6442J2774l7213
7694a8548P77q8890k400M7999M6245j3677p6533L3755M3885k9600O4399m6620
7682c9208r782O9743k2879p2277O5938K7783k9833K9761L0840l5064n5668l0704
7670g1350j9034L7248n685j9268J7458O7053L8071l0318k11J1189J7358l6526
7658E985j06419L5928l6490n9779q350K3820N1434K472L4616R1520N9622n0740
7646D3619o1568l9146n9228k3228Q0002L6521J1611J6434o9771n1681O0906k545
7634e8074j0271K6799O1925r377l9193j2112n8485J6296L0408q5949P253J07757
$$ plain form
7718 -63268 -74062 -90113 -61543 -102944 -103529 -67110 -34923 -9318 3012 -37369 -63663 -175550
7706 -175550 -156991 -58546 -22420 2595 -33987 -54138 -16045 10946 -30551 5891 18665 -18548
7694 -18548 -17771 -106661 -109061 -61062 -14817 -28494 -105027 -71272 -27387 -56987 7412 -39208
7682 -39208 -48990 20753 -2126 -74403 -8465 19318 -10515 19246 50086 15022 -40646 -71350
7670 -71350 -90384 -53136 -58821 -78089 -60631 6422 44493 14175 13964 25153 42511 5985
7658 5985 -100434 -64506 -100996 -160775 -169125 -145305 -93871 -91399 -56783 34737 94359 43619
7646 43619 -17949 -57095 -116323 -139551 -59549 -23028 -11417 5017 -64754 -116435 -55529 -58074
7634 -58074 -68345 -41546 20379 11002 -28191 -40303 -98788 -82492 -52084 -138033 -130780 -23023
7622b3023M4621J6192L5022p2753n8269k4573m9522m3834m235N2048R5005L6674
7610C353m9006q04J854K553K7310k5270o5756r466J5745K0832L0270j2484N1375
7597i494l201j5157N4583J1365r8701r1437K626j9732m2358R1709R8204J1870
7585i723k90L571m1794P1531O1861q3603K155o049n6410j350l5860J4334K3305
7572e8322M3356N4828r188M9500k9024p9005r8150j1820J4092M1873O0346M5484
7560B3970o5156q0809m0689O7553L8761q6305j0220N4394N7725j6046o9902J3530
7548a13194Q1435O164O9358M3388r434L1726p228O2077k8427n7087N093K1446
7536A05317M17n2037n2001k4932K2219K3983k7905k9206q016J2226o90n8408o536
$$ plain form
7622 -23023 21598 37790 72812 59 -58210 -82783 -132305 -176139 -180374 -128326 -33321 3353
7610 3353 -45653 -46457 -44603 -42050 -14740 -40010 -105766 -115232 -99487 -78655 -48385 -60869 -9494
7597 -9494 -12695 -27852 26731 38096 -60605 -152042 -149416 -169148 -211506 -119797 -21593 -9723
7585 -9723 -10013 -6442 -48236 23295 85156 1553 3708 -2341 -58751 -60101 -95961 -81627 -58322
7572 -58322 -14966 39862 30674 80174 51150 -27855 -126005 -137825 -123733 -81860 -21514 23970
7560 23970 -41186 -121995 -162684 -95131 -56370 -142675 -152895 -98501 -40776 -56822 -126724 -113194
7548 -113194 -31759 -25595 43763 87151 77717 109443 102215 164292 135865 78778 83871 105317
7536 105317 105734 53697 1696 -23236 -1017 22966 -4939 -34145 -42161 -29935 -30625 -89033 -95569
7523i5569O3506m2617O88M7751K0221J01121q8650q7325k531L7330n694M1089
7511a0680J5485P051m1240l2980O964k3293K7527N0981K9222J7073m8256p6075
7499g8221q392L9821J5108L8503r965k6045K0747k4430m3594P5345O0889K4539
7487H4305n3792p3256M348k9588l0580K9266M131j3888L38j4382l3697k4594j7374
7474a68763P030j2681k2930L453J627J62233Q9359O5454l6459j2997p3150n3238
7462e1062J7138O904k0890L3835P4688L4336k4035l2919m3533k4137M1545J1671
7450B3541Q681K143p1519j9446N0488L4326k2238j30412J5900L9991J8882j1596
7438f1259L2595q332l5380k7356j4597K5417o6993j3316j2603j4816P8359N5849
$$ plain form
7523 -95569 -32063 -74680 -73992 -26241 -6020 95101 6451 -80874 -83405 -46075 -51769 -10680
7511 -10680 4805 11856 -29384 -62364 -55400 -78693 -51166 -185 29037 46110 -2146 -78221
7499 -78221 -86613 -46792 -31684 6819 -3146 -29191 -8444 -32874 -76468 -1123 59766 84305
7487 84305 30513 -42743 -38395 -67983 -98563 -69297 -65166 -79054 -78716 -93098 -126795 -151389 -168763
7474 -168763 -161733 -174414 -197344 -193891 -192264 -30031 59328 124782 88323 75326 2176 -51062
7462 -51062 -33924 -27020 -47910 -14075 60613 94949 70914 37995 -5538 -29675 11870 23541
7450 23541 32222 34365 -37154 -56600 -6112 28214 5976 -124436 -108536 -68545 -49663 -61259
7438 -61259 -28664 -36996 -72376 -99732 -114329 -88912 -155905 -169221 -181824 -196640 -118281 -62432
7426f2432O0605J620K797m8530k3441J3917k5851k5887M0744Q2936N979r5206
7414g2749l355K6962K1835Q795o76L9m2295J8506k3692K046j2748K8578O686j6229
7400e8297n794p137l6177M7314o885J3098L6225m350p0077p47N0769J04711R4171
7387A56824o5535p9678J0406j5597J8896j2986n9791L1059O413l7051k432M1674
7375g798n598K5144K6263l1534k6238M9808J4895k0937n3729OJ1745j4244k6374
7362e8591k7948j194J1730J1810K2151k1723N9471o31M8253k726m0934O6234R054
7349G4956J9127K365n3606n0900p3870k2030k735N1253J2709Q2488j3191r6198
7337f9632m5790J17657N2951k4129n0223k0873n0336k5262l8592j390K4191M738
$$ plain form
7426 -62432 -1827 -207 2590 -45940 -69381 -55464 -81315 -107202 -66458 16478 22457 -72749
7414 -72749 -76104 -49142 -27307 -18512 -19188 -19149 -61444 -42938 -66630 -64584 -77332 -48754 -42068 -58297
7400 -58297 -64091 -71228 -107405 -60091 -66976 -53878 -17653 -22003 -92080 -92827 -42058 62653 156824
7387 156824 91289 11611 22017 6420 25316 12330 -47461 -16402 -9989 -47040 -49472 -7798
7375 -7798 -13396 11748 38011 6477 -19761 30047 44942 24005 -29724 -29718 -17973 -32217 -58591
7362 -58591 -86539 -87733 -76003 -64193 -42042 -63765 -4294 -4925 43328 40602 -332 65902 74956
7349 74956 94083 96448 42842 -8058 -81928 -103958 -106693 -55440 -42731 39757 26566 -69632
7337 -69632 -115422 2235 55186 31057 -19166 -40039 -90375 -115637 -154229 -155619 -131428 -126690
7325a26690N7354P7672o4326p6493j7099M5751M6999j054J8270k4924o283P671
7313f3152o6334P307K3523M0939L0491q382K6152m9676p494J6823k3660m44J1286
7300f2621M6589l3591L778J2513J2567j0915j1177l9313J9485L4717p839j2469
7288d8276l7989K1563l0737N1237N5133k6206l6171m8457l812J3366L5100J4204
7276d1045J6459M1376J6359k5146m4814K4994M7304J0557L5230p8734q183M9862
7264D4219K1963l5243k8279o342N769L910j6441l8901l4830n231l3357L6532O9422
7251a6809L710l7753L1386o8106o6093K386M7595K8664l341M1183L7849M4554
7239D5225p367j7066n6390j2964J3135M4933O0843m3145r087k0734L5076o1137
$$ plain form
7325 -126690 -69336 8336 -55990 -132483 -149582 -103831 -56832 -57886 -39616 -64540 -70823 -63152
7313 -63152 -129486 -122179 -98656 -57717 -27226 -35608 -9456 -59132 -66626 -49803 -73463 -73907 -62621
7300 -62621 -16032 -49623 -45845 -33332 -20765 -31680 -42857 -82170 -62685 -27968 -35807 -48276
7288 -48276 -86265 -64702 -95439 -44202 10931 -15275 -51446 -99903 -103715 -90349 -55249 -41045
7276 -41045 -24586 16790 33149 8003 -36811 -11817 35487 46044 81274 2540 -5643 44219
7264 44219 66182 30939 2660 -3682 2087 5997 -10444 -49345 -84175 -89406 -122763 -86231 -16809
7251 -16809 -13099 -50852 -19466 -87572 -153665 -151279 -103684 -75020 -78361 -37178 671 45225
7239 45225 37858 20792 -35598 -48562 -35427 9506 70349 27204 18117 -2617 32459 -28678
7227b8678k0491l2430l4669j5991j1531N7831M6591p841Q5190L31O074q810l609
7214C1967O29J678n5295l7894L4371M6178m7004l0629M9653J228m6696L8284O3477
7201D9947j1485n7141M4217l841m4662L2588K8926j3707k8218M5260K0903L033
7189F5820Q042J7775K2993l4585j32704j3091Q0221J450m5526l7842l9980o3617
7177a71044l216L4636Q7337J35380j2235l5085K354l689n0182J8580k3265p05
7165b1134m3683r389L4486M1764n2613m848K6373K1843k3846K3366Q0024k2593
7153D9750q9009j06830P3552Q1128j6861n8492J9578k1760j0428K8672J2912R533
7141b8255k7859M8170M6145j6150k3558K5633n5241l4267k933L4704M4558k8801
$$ plain form
7227 -28678 -49169 -81599 -116268 -132259 -143790 -85959 -39368 -47209 37981 38312 44386 35576 31967
7214 31967 32596 34274 -21021 -58915 -24544 21634 -25370 -55999 -6346 -5118 -51814 -13530 49947
7201 49947 38462 -18679 25538 21697 -22965 9623 38549 24842 -3376 41884 62787 65820
7189 65820 73862 91637 114630 80045 -52659 -65750 14471 15921 -29605 -67447 -107427 -171044
7177 -171044 -174260 -139624 -52287 83093 70858 35773 38127 34438 -15744 2836 -20429 -21134
7165 -21134 -64817 -74206 -39720 2044 -50569 -55417 -29044 -7201 -31047 -7681 72343 49750
7153 49750 -39259 -146089 -72537 8591 -8270 -66762 -47184 -68944 -79372 -50700 -37788 -28255
7141 -28255 -56114 -7944 38201 22051 -1507 24126 -31115 -65382 -68315 -33611 10947 -17854
7129a7854m1350N40M6615N5322r414m7167q7832o5134R2736M6390k0347O552k4007
7116f4950l9257k1271L6865L6699O415K5495k5480J2426K8319k1250j5143k9210
7104g0342M0977j4761J6113j3432J5500n9820n9168K6547L2808J8468Q657M5992
7092a2461k9496m489L1258q534n4980R537O1058M4384l590l6702J6262k7840m3938
7079e9531p886J3073K284J9168n47K8924M0516p5553l8130n4711j041R9113L7732
7066C411m4055k4638N2694Q0272P5205j9778q9726p525K6400m5972l1062Q695
7054a6079J5883m8872j7044l4453L9832O2188J1083m4048k6831O6863N3789l1187
7042C1124N3433l6113p624M6277m1556q7059m622J6918j4966j2244m523j5737
$$ plain form
7129 -17854 -59204 -58664 -12049 43273 33859 -13308 -101140 -166274 -73538 -27148 -47495 -40943 -64950
7116 -64950 -104207 -125478 -88613 -51914 -45499 -20004 -45484 -33058 -4739 -25989 -41132 -70342
7104 -70342 -29365 -44126 -28013 -41445 -25945 -85765 -144933 -118386 -85578 -67110 -58453 -12461
7092 -12461 -41957 -46446 -15188 -23722 -78702 -69165 -8107 36277 32687 -4015 12247 -15593 -59531
7079 -59531 -67417 -54344 -52060 -32892 -33439 -4515 36001 -39552 -77682 -132393 -133434 -34321 3411
7066 3411 -40644 -65282 -12588 67684 142889 123111 33385 25860 52260 6288 -24774 -16079
7054 -16079 -196 -49068 -66112 -100565 -60733 1455 12538 -31510 -58341 8522 62311 31124
7042 31124 84557 48444 40820 87097 45541 -41518 -46140 -29222 -44188 -56432 -60955 -76692
7030g6692J1902m535n619K8823J4256p374j1312M8609L5200K1172l4720j1871
7018G839M425L114k0995j1634J9333q343m5339M3318l958n648k943K4962l5894
7005c1763j295k3786l651O928k0650l6456m5598j9585p714L8189O9338L1930j8294
6992f2407p5870l5698K3773Q653M0864l8400K0194O1266L7875Q8330K1454k7872
6980F2162N9505N0256j589k5840l5935p7971n5814j06433j2328Q4811L5989J060
6968b2127o3484m2515P8899L8565l8128j8853L6733j6524k9557K4662N499k8459
6956g5289Q9850k8127M530J3041n0655k8842k0211j410K3268J7706J951K4O3490
6943I326J9666m4628k8079l6005j0460P683k2283N1774K1438J0827L6818J698
$$ plain form
7030 -76692 -64790 -69325 -74944 -46121 -31865 -39239 -50551 -1942 33258 54430 19710 7839
7018 7839 12264 15378 -5617 -17251 2082 -6261 -51600 -8282 -12240 -17888 -20831 4131 -31763
7005 -31763 -33058 -56844 -60495 -53567 -74217 -110673 -156271 -175856 -183570 -145381 -76043 -44113 -62407
6992 -62407 -138277 -173975 -150202 -141549 -100685 -139085 -118891 -57625 -19750 68580 90034 62162
6980 62162 121667 171923 170334 144494 108559 30588 -25226 -131659 -143987 -59176 -23187 -22127
6968 -22127 -85611 -128126 -49227 -10662 -48790 -67643 -30910 -47434 -76991 -52329 -46830 -75289
6956 -75289 14561 -13566 -9036 4005 -46650 -75492 -95703 -97113 -73845 -56139 -54188 -54164 9326
6943 9326 28992 -15636 -43715 -79720 -90180 -82497 -104780 -53006 -31568 -20741 16077 17775
6931A7775p2283k6186k4314N5936P7679L1551k4914j1249K3014M804L9612N4672
6919A46097k5676k3966n0475l7600J1632l0270l8236M0178L899l2126J6771J7940
6907a832O3856j9366n2237J9504l6179k0725P291J0127L6935K0002K2301R415
6895E9092l2828l4171K7998m224j13654p4391K2406j7363L0830M8426r882n6934
6883a54695O176J5266L2424K9136q960n042J9142M0732L9495j7737K6676K3684
6871D6297k2356N876o7343k7710J8864P467l64L7339J10416M0351k8779o7660
6859E2398n8734K8704p719M7024j9477k6737N8802l4932n8647k3414m1643n4872
6847a39247O6252M0611P20l3839m59m3170l13L9431L9291Q3284j9879k1183l6354
$$ plain form
6931 17775 -54508 -80694 -105008 -49072 28607 60158 35244 23995 47009 51813 91425 146097
6919 146097 120421 96455 45980 8380 20012 -10258 -48494 -8316 -4417 -36543 -19772 -1832
6907 -1832 62024 42658 -9579 9925 -26254 -46979 -39688 -29561 7374 27376 49677 59092
6895 59092 26264 -7907 20091 15867 -97787 -172178 -149772 -167135 -136305 -87879 -97761 -154695
6883 -154695 -148519 -133253 -100829 -71693 -80653 -85695 -66553 -25821 13674 -4063 22613 46297
6871 46297 23941 29817 -37526 -65236 -46372 -38905 -39269 -1930 108486 148837 120058 52398
6859 52398 -6336 22368 14649 61673 42196 15459 74261 39329 -19318 -42732 -84375 -139247
6847 -139247 -72995 -32384 -31664 -65503 -65962 -109132 -109445 -70014 -30723 52561 32682 11499 -24855
6834b4855l6967j0933O556n432j5864m9686K0089M0332R458N8990k7839m2104
6822g8255q448J6386J4844K8357k319m3241k507M4116J0506j0629P2425J4934
6810E6169l1930L623k4742O738J1978k8379l52K0362m0377p6072K6146Q5107K596
6797A0867m244k1302M0672J7569q7337k4659J0618j0119j475n1714m423R7570
6785b7977O606m5635p06K0117j5330N0734J05369m3938j04716R921O7541Q9316
6773A11302p9221r3890M909Q196K8859o0030N1181P5001o284n3233q8939N2214
6761d9935L3380O311o9826K0859M8157p5297Q69P1057K9892m6348k4933M3473
6749a2341O3554r712R1269N5472J1430m3089m5859n6985p7050j6165n610L2570
$$ plain form
6834 -24855 -61822 -72755 -66199 -71631 -87495 -137181 -117092 -76760 -67302 -8312 -36151 -78255
6822 -78255 -86703 -70317 -55473 -27116 -29435 -72676 -75183 -31067 -20561 -31190 41235 56169
6810 56169 24239 27862 3120 9858 21836 -6543 -6895 13467 -26910 -102982 -76836 8271 10867
6797 10867 6623 -14679 25993 43562 -43775 -68434 -57816 -67935 -69410 -121124 -125547 -27977
6785 -27977 -21371 -67006 -67712 -47595 -62925 -12191 93178 49240 -55476 -45555 21986 111302
6773 111302 32081 -61809 -56900 -48704 -19845 -79875 -28694 46307 40023 -13210 -102149 -49935
6761 -49935 -16555 -10244 -80070 -59211 -11054 -86351 -85482 -14425 15467 -30881 -55814 -12341
6749 -12341 51213 41501 132770 188242 199672 156583 110724 53739 -23311 -39476 -45086 -12516
6737a2516K6781K5695k3875m0920K5834J7298l9293j5370J43182J19545N9976
6726B86337O0343J31372J62853K73963L13921J75367j90913l87195l31839k28750
6716B65459r6243l571n5778n6351l7361o8687l6154Q0562M2817j3064m9843k2055
6704e0269J3644l2946J3394m939n1511R4778J26143M3197o4849q6306k9887j9609
6692d9160J6425O7466j5572j3512K4225K0806l3386k455m223n1705n0761M6208
6680d5644O8317L844m4148P3068m8016j3717O7349K478k3517M948l8467l7665
6668c1170j0551K8222q4993p5579r087N8276K7520k6880O1730M9227l0793k9409
6656g3487K5516m59N1937K589m3810m5263K5459Q710P391R912k1901k4360J3467
$$ plain form
6737 -12516 14265 39960 16085 -24835 999 18297 -20996 -36366 106816 226361 286337
6726 286337 346680 478052 640905 914868 1228789 1404156 1213243 826048 494209 265459
6716 265459 169216 165645 109867 53516 16155 -52532 -88686 -8124 34693 21629 -28214 -50269
6704 -50269 -36625 -69571 -56177 -61116 -112627 -17849 108294 151491 86642 336 -29551 -49160
6692 -49160 -32735 34731 19159 5647 29872 50678 17292 14837 10614 -41091 -91852 -45644
6680 -45644 22673 26517 -17631 55437 7421 -6296 61053 63531 40014 44962 6495 -31170
6668 -31170 -41721 -13499 -98492 -174071 -183158 -124882 -97362 -124242 -62512 -13285 -44078 -73487
6656 -73487 -47971 -48430 3507 6096 -37714 -82977 -57518 -48808 -41417 -31505 -53406 -77766 -64299
6643f4299j1043n2912p676L3030l9013p1663j3762R2256J48581J206j8206o1432
6631f4933m0071j827K6311r9j4391q0472j3925m002N5219O9603Q579O366M1741
6618a1901O0840J6299k2323n225L531l4606l932k8544m08J6184k2080o1916n0462
6605a44543K7549L9950J6372n5121L8677O8525k062N6860j3936Q423m964j8988
6593A6742K7778J135j0909k2772l7493o9354M0294M6731j266r705K3298O559m7840
6580c6802j8895J2905M81k0369N4448M4502O251l3411N0634J7104m8968j08606
6568h0726K2848p087K0041K6908l1101k4043J8947Q682K6213r142K2001J283L10
6555d866P774J823K4430P1571M6654p1980n8936q4775j7864M8352P1693p6243
$$ plain form
6643 -64299 -75342 -128254 -135930 -102900 -141913 -213576 -227338 -135082 13499 14705 -3501 -64933
6631 -64933 -105004 -106831 -80520 -80619 -95010 -175482 -189407 -193409 -138190 -68587 -60008 -53642 -11901
6618 -11901 48939 65238 42915 37690 41221 6615 2683 -25861 -26269 -10085 -32165 -94081 -144543
6605 -144543 -116994 -77044 -60672 -115793 -77116 -8591 -10653 46207 32271 40694 35730 16742
6593 16742 44520 45655 34746 11974 -25519 -94873 -54579 -7848 -9114 -18819 4479 11038 -36802
6580 -36802 -55697 -42792 -42311 -62680 -8232 36270 42521 9110 59744 76848 27880 -80726
6568 -80726 -57878 -64965 -44924 -18016 -49117 -73160 -54213 -45531 -19318 -28460 -6459 -5176 -4866
6555 -4866 2908 4731 29161 100732 147386 75406 16470 -68305 -86169 -37817 33876 -42367
6543d2367j26208k388N2677M0996O349o963L2918R1553M1393o5587p2385j360
6531e1372O8623L5182k8026k5889K4620Q207P254l2220J6284O924j3157k7588
6519a1158N425N5190k3032m1232r687m3146l7601j7959l028J4634J3363O7206
6507c1025O1489N5136O284k8965l9157n9169q5552J7462o418K9322O3069m2203
6495e9727o5965L1815O0533n957J1567L695m1230p4660N4776O2901l2226M9Q1095
6482B6666r868J3574K4029l6789m292K0219n5050q640j3152j1533p251l6649O2060
6469c6676K7678m0886K7528J829M2221l0808j2040K0824N829k221l9748j1058
6457d7528r031n2362m9540O596N0605L9109O1892O2614j8479j0473K4351M1556
$$ plain form
6543 -42367 -168575 -170963 -118286 -77290 -70941 -77904 -44986 46567 87960 22373 -50012 -51372
6531 -51372 17251 52433 24407 -1482 23138 31345 38599 6379 22663 29587 16430 -11158
6519 -11158 -5733 49457 26425 -14807 -24494 -67640 -105241 -123200 -126228 -111594 -98231 -31025
6507 -31025 30464 85600 91884 62919 23762 -35407 -120959 -103497 -109915 -80593 -17524 -59727
6495 -59727 -125692 -93877 -33344 -39301 -27734 -24039 -65269 -139929 -85153 -22252 -54478 -54429 26666
6482 26666 16798 30372 54401 17612 13320 33539 -21511 -30151 -43303 -54836 -62087 -98736 -36676
6469 -36676 -8998 -49884 -22356 -20527 21694 -9114 -21154 -330 5499 3278 -36470 -47528
6457 -47528 -56559 -108921 -158461 -151865 -101260 -62151 -259 62355 43876 33403 57754 99310
6445I9310k3794n3686k3811j9949l2077k56J7039L7466n1537R09l9648n729J6479
6432g9284O6799R9480l4800k2227N893n7293r929k9421m6738m9801M7450J00322
6420i549L1212J6063r6828m6723O5119L6618l5175m9684l236O0943P427j5046
6408c8859Q105n1253o8987K0598N0206p55j7887N3249K5756l3236p024N4659L1688
6395B6260J3172j960k6076k3375j9602L1881M1946j6046r816Q480N0368L7906
6383A13138k0990q4425m4892q4588j68K5217k068P290o048l1587J51O8081O7729
6370F840K6553r7587k3148O2300N4558l3256P831J3692P2366J5867o5069j7022
6358B3925k7995M4326K0612j06822J3915L1657L2530K4711L4163J2213l0216K5445
$$ plain form
6445 99310 75516 21830 -1981 -21930 -54007 -54263 -37224 242 -51295 -50386 -90034 -95763 -79284
6432 -79284 -12485 86995 52195 29968 35861 -21432 -31361 -60782 -107520 -157321 -109871 -9549
6420 -9549 21663 37726 -59102 -105825 -40706 -4088 -39263 -88947 -92183 -31240 -23813 -38859
6408 -38859 -30754 -82007 -150994 -130396 -80190 -80945 -98832 -45583 -19827 -53063 -60087 -5428 26260
6395 26260 39432 37472 11396 -11979 -31581 300 42246 26200 16384 24864 75232 113138
6383 113138 92148 7723 -37169 -121757 -121925 -96708 -98776 -91486 -97534 -129121 -128970 -60889 6840
6370 6840 33393 -64194 -87342 -25042 29516 -3740 4091 17783 90149 106016 40947 23925
6358 23925 -4070 40256 60868 -45954 -32039 -382 32148 56859 91022 103235 73019 98464
6346I8464k7380j01359k4854J07710l620p9048P956p131p0728K1706J4610J8628
6334d5046N7128M546k5556k2495o329o1440J4044j9965N914l9938L4690n565J8278
6321i1734R4715o057m9400K3898o8309k0084M0020L9997q203J0167K5952j6379
6309b5417L5680O0825j8609m7044J2968j1010o702j6005j9517K2661L9637J2680
6297D0147O403k8336Q795j6049l3295K0248n248j4893N884M0478k4179K9528J9171
6284D8654n2426r421k1210n5270K5942M8398P9290K4003M2642K1249o1497o5207
6272B5147q118o816k8457l2527k4451k0463M4368P9625J9814n7927m3689J3956
6260c9538k4364Q3277K107r5483k8769L6942Q0438K9477n3027k8240K229k1635
$$ plain form
6346 98464 71084 -30275 -55129 52581 48961 -30087 -22131 -29262 -99990 -78284 -63674 -45046
6334 -45046 12082 16628 -8928 -31423 -37752 -99192 -85148 -105113 -99199 -139137 -104447 -110012 -91734
6321 -91734 2981 -3076 -52476 -28578 -96887 -116971 -76951 -36954 -45157 -34990 -9038 -25417
6309 -25417 10263 71088 52479 5435 18403 7393 691 -15314 -34831 -12170 27467 40147
6297 40147 46550 18214 27009 10960 -22335 -2087 -7335 -22228 -16344 24134 -45 29483 48654
6284 48654 -3772 -13193 -34403 -89673 -63731 -15333 63957 87960 130602 151851 90354 25147
6272 25147 17029 10213 -18244 -50771 -75222 -95685 -51317 28308 48122 -9805 -53494 -39538
6260 -39538 -63902 19375 21482 -74001 -102770 -65828 14610 44087 -8940 -37180 -34951 -56586
6248e6586N198m4306o2114K027J664J11851P2823k7296K3052K9036k5266n3029
6236b2946j1968j8182j7524N374L0632O9814o969p3409J9997q6136l5954J13300
6224c3971Q746l4654j5765K4398N5170j6763j08957o562L6895Q647k1241O912
6212i7145k2274j2597K7137L2121P5838L686k2226q34n7062L6305Q0631K0188
6200F3768k5240j0950L4819J8667j3453k9799O633o4555j403K2264o589k1899
6188b7737N7626K559o0995j2299L0749J56j1707K0033k1512l8300l675M9471J4377
6175a254J8071j4057M8059l8719j05061J1903K1948K4835K2436j2476J9361j7505
6163b2459l4730L2487j5366P45k2250j6081M60L9428j5141N0093M3689o754p5968
$$ plain form
6248 -56586 -51388 -95694 -157808 -155781 -154117 -42266 30557 3261 26313 55349 30083 -22946
6236 -22946 -34914 -53096 -70620 -65246 -34614 35200 28231 -45178 -25181 -111317 -147271 -33971
6224 -33971 -25225 -59879 -75644 -51246 3924 -12839 -121796 -128358 -91463 -82816 -104057 -97145
6212 -97145 -119419 -132016 -104879 -72758 3080 6766 -15460 -16294 -73356 -37051 43580 63768
6200 63768 38528 27578 62397 81064 67611 37812 44445 -20110 -21513 751 -5838 -27737
6188 -27737 29889 32448 -28547 -40846 -10097 -9941 -21648 -1615 -23127 -61427 -65102 -15631 -1254
6175 -1254 16817 2760 50819 12100 -92961 -81058 -59110 -34275 -11839 -24315 -4954 -22459
6163 -22459 -57189 -24702 -40068 -39323 -61573 -77654 -77194 -37766 -52907 -2814 40875 34121 -41847
6150d1847p4478j3883R9984L6511J9996k7148o2753p8193n0384N3769O3441L0085
6138d4900J2480N9756m9205N880L8772K7648k3984L4881l414K3887J5404p442
6126H9763q505m6759l1988K5091m7893L0752O2265O0944L355o1400j4618l1837
6114B9170o4118k0255L9797P9136R0865m1304r6269k6206K3621j4524q810M1933
6102C3036k4441r377M3649J5564J2366r899K6967k0949l7218k6251m8833O5800
6090B0414N5261M437K477k5629k8266n9310j04206L0008P7775Q6198k8244r4295
6078f3380p153j6604L4415k7964j3752L8927m4437j4559O5283N4410J4431j2451
6066G166M0762l2175k3886l2526L0002j7426J4819N0894k4811k5363K7543O6303
$$ plain form
6150 -41847 -116325 -130208 -30224 6287 26283 -865 -63618 -141811 -192195 -138426 -74985 -44900
6138 -44900 -32420 27336 -21869 -15989 22783 50431 26447 61328 57914 81801 97205 89763
6126 89763 81258 34499 2511 27602 -20291 10461 72726 133670 137025 75625 61007 29170
6114 29170 -34948 -55203 -15406 63730 154595 113291 17022 -9184 14437 -87 -8897 33036
6102 33036 8595 -782 42867 58431 70797 60898 87865 66916 29698 3447 -45386 20414
6090 20414 75675 80112 82589 56960 28694 -30616 -134822 -104814 -27039 59159 30915 -63380
6078 -63380 -70533 -87137 -52722 -80686 -94438 -55511 -99948 -114507 -49224 5186 19617 7166
6066 7166 47928 15753 -8133 -40659 -10657 -28083 -13264 37630 12819 -12544 14999 81302
6054H1302Q0107o2286n2913j5354J4225O7877K4866j01341j47779j12796O438
6043b17654P0639K7590L3534O543J8995J3432n7749L433M0611m2035J7405q311
6031i3567L2152N7865M3676L9868j3301k6348q6808m4188J9768O4867K6234K3483
6019D3701J04668L7622p7449k8308k2594n953p3127k07k0769n6530j3289J0938
6007a01297J2992L2410L2793J3055K1960M4419k5555m3108m4680k4383K0923L0651
5995b9820K8603K2455J5961N388k8642l3403K041n4420N9417r367r715l0297j4983
5982g6782k3935N6794P92N1232N3429N6639k1463l3576L6263l238p0868k887M2657
5969F5057J767K8339R205n3156k9415K3868R533l3641l1296K1428L6126r720k5175
$$ plain form
6054 81302 161409 99123 46210 30856 45081 112958 137824 36483 -111296 -224092 -217654
6043 -217654 -147015 -119425 -85891 -79348 -60353 -46921 -104670 -101237 -60626 -102661 -85256 -93567
6031 -93567 -61415 -3550 40126 79994 66693 40345 -46463 -90651 -70883 -6016 20218 43701
6019 43701 148369 185991 108542 80234 57640 51687 -21440 -21647 -42416 -98946 -112235 -101297
6007 -101297 -88305 -55895 -23102 -10047 11913 56332 30777 -12331 -57011 -81394 -60471 -29820
5995 -29820 -1217 21238 37199 42587 13945 -19458 -17417 -71837 -12420 -21787 -31502 -61799 -76782
5982 -76782 -100717 -43923 -43131 8101 61530 118169 96706 63130 99393 96155 25287 22400 65057
5969 65057 66824 95163 104368 51212 21797 45665 55198 21557 -9739 11689 47815 38095 12920
5956A2920j8592L8129j7680m0860J4020n688M3375l9073J0145L9887q1673J8240
5944b6850K3859k8953P6123L0605k8410o9688k8223K8896p1941P0861o713K6192
5932d242N6813j1957q5935l3421k0784J3967N4845j5771J0306P7851J1774j326
5920E2120n4343Q71P5924O4017n8380j01588J2422o8486q0784R2179R8959o2875
5908b9964o2415K589L0674q794N0101M334j352K9158M7476o428k8087o1352n0660
5895h4720k5599O1104L2019o1589N4411J02814l1161j25654r5926O7671M1807
5884f4823k0947k3559O9036N3589k1271J9244p662N0770M0359k9793q967M6532
5872A02508m1977m8781l294m6107L4137R953l1786n4362m6426M7384q930L5751
$$ plain form
5956 12920 -5672 32457 14777 -26083 -12063 -17751 25624 -13449 -3304 36583 -45090 -26850
5944 -26850 -2991 -31944 44179 74784 46374 -23314 -51537 -22641 -94582 -23721 -30434 -4242
5932 -4242 52571 40614 -45321 -78742 -99526 -85559 -30714 -46485 -36179 41672 53446 52120
5920 52120 -2223 -1352 74572 138589 80209 -21379 -8957 -77443 -158227 -66048 32911 -29964
5908 -29964 -92379 -89790 -59116 -67910 -17809 -13475 -14827 14331 61807 55379 27292 -34060 -84720
5895 -84720 -110319 -49215 -17196 -78785 -24374 78440 47279 -78375 -174301 -106630 -64823
5884 -64823 -85770 -109329 -40293 13296 -7975 11269 3607 54377 94736 64943 55976 102508
5872 102508 60531 11750 8456 -37651 -3514 6439 -25347 -79709 -126135 -78751 -87681 -51930
5860e1930O0224j8511p668K0167M2525K6645Q653j5036j183m6877l1908O909l5810
5847d3800K7269o443M7929N8949l2194J5311l1412P862O767j9102o0836m3294
5835g2994m474m4910J3538R2818L2878J0233J6878k386k1180J1156K3034L2743
5823H7334J6404p7556Q777L442p3086l6103m7584J8478L5437K4286m4902j05017
5811a90090J2960J9658K4404L362M1287L4594N6577l0061l1650N578k8520o394
5799h8295J8897j0407m303J4366O0449N0742K556j6801K7146j8865p2603k8168
5787f5286k0236J7113q733k3979n3247j8757J11819O7526J2340l7436j9512O099
5775c2289J0212Q056r701p792n0614J4247j6880M833L9229K8496L8921O6017j9947
$$ plain form
5860 -51930 8294 -10217 -17885 2282 44807 71452 80105 65069 63886 17009 -14899 -7990 -43800
5847 -43800 -16531 -22974 24955 83904 51710 67021 35609 43471 50238 31136 -29700 -72994
5835 -72994 -77468 -122378 -108840 -16022 16856 27089 43967 41581 20401 31557 54591 87334
5823 87334 103738 26182 34959 38401 -34685 -70788 -118372 -99894 -64457 -40171 -85073 -190090
5811 -190090 -177130 -157472 -133068 -129706 -88419 -53825 2752 -27309 -58959 -53381 -81901 -88295
5799 -88295 -69398 -79805 -84108 -69742 -9293 41449 44005 27204 54350 35485 -37118 -65286
5787 -65286 -85522 -68409 -77142 -101121 -154368 -173125 -61306 6220 18560 -18876 -38388 -32289
5775 -32289 -22077 -14021 -23722 -31514 -82128 -67881 -84761 -79928 -40699 -12203 26718 92735 72788
5762G2788q8285j3986K993k8749l0571N9685J2498M3066n285o5713K2508Q120
5750a0931l5773O425l5042l1179N0406N2276P2944L389p2108L8166K6261J6824
5738H1658j6279K226L565n960M7145m0750k208K1239R899n618J968O786o9120
5725C4551q9312J657R782J1556O7680J4271p2264K6099M1632l2406m3425M7143
5713A6964M9110m8143k2426l8156o2392N547K5290O7767N7218L7619j0303l9518
5701C8577q9307m3511N6681M3857K2005j4219k3191N1644K4493L6763m1782k5527
5689C6483o7015l6195j7919L4537P1547P2379N2990n3101o3405M4871j4573J0787
5677G1386k033o0866K6093k5061o4453n6642J0753P2290K9278O0181m2516q2515
$$ plain form
5762 72788 -15497 -29483 -26490 -55239 -85810 -26125 -13627 29439 24154 -41559 -19051 -10931
5750 -10931 -46704 -40279 -75321 -106500 -56094 -3818 69126 72515 407 38573 64834 81658
5738 81658 65379 67605 71170 65210 112355 71605 69397 90636 100535 94917 96885 103671 34551
5725 34551 -54761 -53104 -43322 -31766 35914 50185 -22079 4020 45652 13246 -30179 16964
5713 16964 66074 17931 -4495 -42651 -105043 -99496 -74206 -6439 50779 88398 78095 38577
5701 38577 -50730 -94241 -37560 6297 28302 14083 -9108 42536 67029 103792 62010 36483
5689 36483 -30532 -66727 -84646 -50109 21438 93817 146807 93706 30301 75172 60599 71386
5677 71386 69353 8487 34580 9519 -54934 -111576 -100823 -28533 745 60926 18410 -64105
5665f4105j0173k154K5820N3341K9198%Q555O661L1240j759n6896j7704j0707
5652h683p6419l841L9220Q2987j219j3646k1932m8526k7122M8007J5684j1817
5640b7307l1886M2448L4523o4064p449M3903K5902J0515o4202n5620Q2473Q0182
5628F9418q5642j15879J0908Q5072O9669J9354K6355l0722k8781O4371K3998p8245
5616B9876n8947P794j1957o6406O8971Q3738L3293l6308k9623k1484p9286j4578
5604i4917P8029L5181l8652l9823N2966J29069J3904m2274M5209l5267q6724l212
5592A3489j6867K5660j5977n8811K9585N9251k087p7253r6038j9920N3399k9697
5580a35266M7025K2894o104J883k4465K0203l796N3506N4556J065k8179n3858
$$ plain form
5665 -64105 -74278 -76432 -50612 2729 31927 31927 40482 47143 78383 76624 19728 2024 -8683
5652 -8683 -85102 -88943 -49723 33264 32045 18399 -3533 -52059 -79181 -31174 -15490 -27307
5640 -27307 -59193 -16745 17778 -46286 -53735 -9832 16070 26585 -37617 -93237 -10764 69418
5628 69418 -16224 -132103 -121195 -36123 33546 52900 79255 48533 19752 84123 108121 29876
5616 29876 -29071 -21277 -33234 -99640 -30669 53069 86362 50054 20431 -1053 -80339 -94917
5604 -94917 -16888 18293 -20359 -60182 -7216 121853 135757 93483 138692 103425 16701 13489
5592 13489 -3378 22282 6305 -52506 -22921 36330 34243 -43010 -139048 -158968 -105569 -135266
5580 -135266 -88241 -65347 -71451 -69568 -94033 -73830 -77626 -24120 30436 31501 3322 -50536
5568e0536l3195k9800K9832Q4403J2310k0828q124K3772M4194J5966k3251l9533
5556E210n0284q097K2473P3161K7612n8940J4358P1232L6147m979p8201k1741
5544B7951j29827q9632N7647P1196Q1368k5542M372k3496q9039o221j8019J1928
5532a27314K8421J3722R055M4828l0349N149O2464m0958J9685L4035L5509R725
5520F3972k9211l921r054m5263k406k8396L2931N7474M7616J4753o8016m5913
5508a5434k343O5479R844o9790k3715J6650O1953r3824j234M9067N2967J8889
5496F8509j450n3452l8105m8212l62J7794k6670j2743J4629L5163l1878J0162
5484f6615M9115Q431J2152k5087r684Q4368K9675R443l2424j9596q3819q4757
$$ plain form
5568 -50536 -83731 -113531 -83699 704 13014 -7814 -15938 7834 52028 67994 44743 5210
5556 5210 -45074 -53171 -30698 42463 70075 11135 25493 96725 132872 127893 49692 27951
5544 27951 -101876 -191508 -133861 -62665 18703 -6839 -2467 -25963 -115002 -121223 -139242 -127314
5532 -127314 -98893 -85171 -76116 -31288 -61637 -56488 5976 -34982 -15297 18738 54247 63972
5520 63972 34761 30840 21786 -23477 -25883 -54279 -21348 36126 83742 98495 30479 -15434
5508 -15434 -17777 47702 57546 -12244 -35959 -19309 42644 -51180 -52414 -3347 49620 68509
5496 68509 67059 13607 -24498 -72710 -73072 -55278 -81948 -94691 -80062 -44899 -76777 -66615
5484 -66615 -17500 -9069 3083 -22004 -31688 52680 82355 91798 59374 39778 -44041 -128798
5472a28798j2851K453R0263P5527o229j7565p0859M1488N9504M2441O1497k2454
5460A14417o1028j30445m0340O8890K2425M3051M7107m1563n9675j0755J5428
5449c2488l996k2831j5417L5990j4148Q756K657n5898j469L5717O1277J7568K4182
5436C9900l9124l4898J4964m6383n9391O5230K8809L0347K9600L3751m7021n7896
5424d2112J351M8648K0583K0751j7054k4336L4803o8360l5797K4928K0289L7329
5412B1023L035N260N2875m474m0149j066k5174K9164N976L7829K4844K0229n3139
5399G6233p8918L1772K9217j8661l8241p3937m1155j8403K6271O1986n174J3312
5387c5698J9055l81J3844N6882J3337J6173k3685K2313r0869o809L0292M7365
$$ plain form
5472 -128798 -141649 -139196 -48933 26594 20365 2800 -68059 -26571 32933 75374 136871 114417
5460 114417 53389 -77056 -117396 -48506 -26081 16970 64077 22514 -37161 -47916 -32488
5449 -32488 -36484 -59315 -74732 -38742 -52890 -44134 -41477 -97375 -98844 -63127 -1850 15718 39900
5436 39900 776 -34122 -19158 -65541 -124932 -59702 -30893 -546 29054 62805 15784 -42112
5424 -42112 -40761 7887 28470 49221 32167 7831 42634 -25726 -61523 -36595 -16306 21023
5412 21023 24058 29318 82193 77719 37570 36504 11330 40494 46470 84299 109143 129372 76233
5399 76233 -2685 29087 58304 39643 1402 -72535 -113690 -132093 -105822 -43836 -49010 -35698
5387 -35698 -16643 -17024 -3180 53702 67039 83212 59527 81840 -9029 -15838 14454 61819
5375F1819o0511n4111Q745m2598L0729m5547L2188N7202O1628M9202o7934j4975
5363A5837Q0591N9516k2961l7302j18676j06521J6731n681K2549J28379J7804
5352E0266j7656m4851J7671K8389K2670r894J3487m3560K3265l7876n9029J2848
5340d4270q389L6452n5452l0151L5019P7133O7218j301n4867L0688l737n6071
5328g728o1708o386j3397N2195Q1343M9664o7541j15366k1003N8630L3508J517
5316a6272L3864M812K022L1864o0036o1464j9095Q8735L8852M2313J0935l8099
5304E8431q0011O843J6025n9291R59o856J4139L7879k4686l712k6496k3910Q2721
5291g965L2591k4983n4653j7726J1150k3076N4215M8187l6959k3046Q902N4009
$$ plain form
5375 61819 1308 -52803 -44058 -86656 -55927 -101474 -69286 -12084 49544 98746 30812 15837
5363 15837 96428 155944 132983 95681 -22995 -129516 -112785 -118466 -95917 32462 50266
5352 50266 32610 -12241 5430 33819 56489 46595 60082 16522 39787 1911 -57118 -44270
5340 -44270 -52659 -16207 -71659 -101810 -66791 10342 77560 76259 21392 52080 48343 -7728
5328 -7728 -69436 -75822 -89219 -37024 44319 93983 26442 -88924 -109927 -51297 -17789 -16272
5316 -16272 17592 22404 24426 56290 -3746 -65210 -84305 4430 43282 85595 96530 58431
5304 58431 -21580 -14737 1288 -58003 -57044 -63900 -49761 -11882 -36568 -40280 -66776 -90686 -7965
5291 -7965 24626 -357 -55010 -72736 -61586 -84662 -30447 17740 -19219 -42265 -33363 20646
5279B0646J9816K9332j9366L9584n8462r402p0310m1867Q168M118P911J4188N0284
5266e360l3468m1838J0942R340M6068J1227l7304m0237j7961N1364p142N1560
5254b809P9367M712J1102J798n1253J3704O0632K8563r8637l2351L5154k9939
5242B0043j25180J711N0709K834J8541m2740n8974K9421P6702k9632O9718n5875
5230d2722p4834N6623P8044p861k8165j3096J4267k4372k3842m9761p729O1188
5218f2260P863l9092r398K0727M0574K9951J0363N7246P102k1416p6992l2805
5206f8137J8332N1599J4656K2389o9291q76k0400J2537R5631P2844l0j0518o2287
5193E6449l4891L2207j2719k0285j5332k0916l0816j178j1199L2427J02642o323
$$ plain form
5279 20646 40462 69794 50428 90012 31550 22148 -48162 -90029 -81861 -77743 -69832 -55644 -5360
5266 -5360 -38828 -80666 -69724 -60384 -14316 -3089 -40393 -80630 -98591 -47227 -54369 -2809
5254 -2809 76558 81270 92372 94170 42917 56621 117253 145816 47179 14828 49982 20043
5242 20043 -105137 -103426 -52717 -49883 -31342 -74082 -133056 -103635 -26933 -56565 13153 -42722
5230 -42722 -117556 -60933 17111 9250 -18915 -32011 -17744 -42116 -65958 -115719 -123448 -62260
5218 -62260 -54397 -93489 -102887 -82160 -41586 -11635 -1272 55974 63076 41660 -35332 -68137
5206 -68137 -49805 1794 16450 38839 -30452 -31328 -51728 -39191 56440 129284 129254 118736 56449
5193 56449 21558 53765 41046 20761 5429 -15487 -46303 -47481 -58680 -26253 76389 70066
5181G0066p579p54J5331J63L1065k3127n8030J162L0479j100J3015L7090l417
5168A04364k4731o8434k5985l118J06L917L0620p431k4574J1622k8314l6171K3122
5155d5007K7411m3573J1898M0672L2126L7838L0492m1265n7263k5016j5646O427
5143d0906N0164j0362K5825j0492j9513J4726m4418n445k0063j8498Q505J47136
5131G6659Q76o1299O5775Q48l6806L8624o3171q9485j4441J1292K2666N4706J0913
5118A7157L6496j6950q9672n675L6416L542J0935j4774j6218l4662O9334P4801
5106G0730K6486n0399M3932k5122m9561l5425m5718J2992K9546R8820N549q4867
5094c037J7942O584l0728m0933k2119r32J4874L3737Q3304L5923K846o1944l2144
$$ plain form
5181 70066 62487 61733 77064 77227 108292 85165 27135 28297 58776 57676 70691 107781 104364
5168 104364 79633 11199 -14786 -17904 -17798 -13881 16739 9308 -15266 -3644 -31958 -68129 -45007
5155 -45007 -17596 -61169 -49271 -8599 23527 61365 91857 50592 -6671 -31687 -47333 -40906
5143 -40906 9258 -1104 24721 14229 -5284 9442 -34976 -40421 -60484 -78982 -70477 76659
5131 76659 77535 16236 82011 82859 46053 84677 21506 -67979 -82420 -71128 -48462 6244 17157
5118 17157 53653 36703 -52969 -58644 -22228 -18686 -7751 -22525 -38743 -73405 -4071 70730
5106 70730 97216 46817 90749 65627 16066 -19359 -65077 -52085 -22539 76281 81830 -3037
5094 -3037 14905 21489 -9239 -50172 -72291 -73223 -58349 -24612 58692 94615 97461 35517 3373
5081C373K1228N013k9366O007J1683j0147k610n1251J974N6962O2506j9480n8832
5068b940J321J0817M3838k7918o650J4955p5603N9163M4135K070l2399j2915N2748
5055G0622M3831P1246p1248p262N034k5267m0761k9265m11R727j2057n2022o8539
5042a06372K7169K4164m4114q608J6688O0199O3725l1438n0435J053K3501m0430
5030f4898k613M9974J6856p6733j3878N8076Q447L8346K0555o241j8176K0939
5018C0654K4131n125k0373N795n4501k3669l218j2347l8425P5020J16964l7212
5006E7694j4183j8845n6792K848L7758l8841K118J530n5736M4147J5193n3002
4994g6111Q563J00286r370l3506k1893n7644m602J1942K2276R9040N0742K8820
$$ plain form
5081 3373 24601 29614 248 6255 17938 7791 5181 -46070 -44096 12866 75372 55892 -2940
5068 -2940 -1619 9198 53036 25118 18468 33423 -42180 16983 61118 63188 30789 17874 70622
5055 70622 114453 185699 114451 107189 112223 86956 46195 16930 16519 26246 14189 -37833 -106372
5042 -106372 -79203 -55039 -99153 -107761 -91073 -30874 32851 1413 -49022 -47969 -24468 -64898
5030 -64898 -67511 -17537 -681 -77414 -91292 -33216 -24769 13577 34132 27891 9715 30654
5018 30654 54785 49660 29287 35082 -19419 -43088 -46306 -58653 -97078 -22058 94906 57694
5006 57694 43511 24666 -32126 -29278 8480 -30361 -28243 -26713 -82449 -38302 -23109 -76111
4994 -76111 -67548 32738 23368 -10138 -32031 -89675 -94277 -82335 -60059 38981 89723 118543
4982A18543k2661n5897K7844M5690o616L3685o187m8713j03645M963J5548L2563
4970C5117N8384q326p5842l4034k0829O254O4476k2253l1392l906K4334R9200
4958I1183J6814o8757m535O7552L7064J1669Q491k5482j8530j6289j7504n5098
4946B6578l9684m1962q5965M0772N6262M3134o023M8008k776K2394J2671k6619
4934D6790k3100Q048j9120k9962J3439J670j489k5614K611R362j9055N629o45
4921c1436J6647N2352M8709k5161r0734K6961j6365J5320j8320M6856p492K235
4909A9572R5283j5602j23241N515O6173L6509l7759k8671o5704q4960J9665Q1221
4897c1999M1091L4603L6591l0921J7155K0279m2464j2856K1605l8721o210l7444
$$ plain form
4982 118543 95882 39985 67829 113519 106903 140588 134401 85688 -17957 -12994 2554 35117
4970 35117 93501 85175 9333 -24701 -45530 -39276 25200 2947 -28445 -32351 -8017 91183
4958 91183 107997 39240 34705 102257 139321 150990 159481 133999 115469 99180 81676 26578
4946 26578 -13106 -55068 -141033 -100261 -43999 -865 -6888 41120 38344 60738 73409 46790
4934 46790 23690 31738 12618 -17344 -3905 -2235 -3724 -29338 -26727 -17365 -36420 -30791 -31436
4921 -31436 -14789 37563 86272 61111 -29623 -2662 -19027 -3707 -22027 24829 17337 19572
4909 19572 114855 99253 -23988 -18473 47700 84209 46450 17779 -47925 -132885 -113220 -31999
4897 -31999 9092 43695 80286 49365 66520 86799 44335 31479 53084 14363 8153 -29291
4885b9291J1671n1791j2133M8936q57L1425O6774j334l2329l301m4431o009L6458
4872A3788p1199n41l685p2264M8877J07762J1380k4154l9664L9080o2312L447
4860d9485M5917j1412j3680k0246K4832n7493q264K2693j4410j215K7428l5285
4848i0620k056N5663l166m0618M4057M3219k3330j2884j5036p342n9219J1573
4836i9759l9808K2156J04621L7196j3302m2244m9559K2238M0985N6600J0677p9348
$$ plain form
4885 -29291 -17620 -69411 -81544 -32608 -33465 -2040 64734 63400 31071 27770 -16661 -22670 13788
4872 13788 -57411 -57952 -61637 -133901 -85024 22738 34118 9964 -29700 9380 -52932 -49485
4860 -49485 -3568 -14980 -28660 -48906 -24074 -81567 -89831 -67138 -81548 -82763 -55335 -90620
4848 -90620 -92676 -37013 -40179 -80797 -36740 6479 -16851 -29735 -44771 -52113 -111332 -99759
4836 -99759 -139567 -117411 -12790 24406 11104 -31140 -80699 -58461 -17476 39124 49801 -29547
$$ [...]
##END NTUPLES=NMR SPECTRUM
##END=
