##TITLE=Analysis number 325359
Compound Code mo 01152
Project Code adrs
Chemist Name fudan
##JCAMPDX= 6.0         $$ Bruker NMR JCAMP-DX V2.0
##DATA TYPE= NMR SPECTRUM
##DATA CLASS= NTUPLES
##ORIGIN= Bruker BioSpin GmbH
##OWNER= nmr
$$ XWIN-NMR		Version 3.5
$$ Thu Dec 21 10:24:12 2006 GMT Standard Time (UT+0h)  MAYBRIDGE\nmr@NMR_250MHZ
##.OBSERVE FREQUENCY= 250.131544655141
##.OBSERVE NUCLEUS= ^1H
##.ACQUISITION MODE= SIMULTANEOUS (DQD)
##.ACQUISITION SCHEME= undefined
##.AVERAGES= 16
##.DIGITISER RES= 18
##SPECTROMETER/DATA SYSTEM= dpx250
##.PULSE SEQUENCE= zg30
##.SOLVENT NAME= DMSO
##.SHIFT REFERENCE= (INTERNAL, DMSO, 0, 16.522)
##AUDIT TRAIL= $$ (NUMBER, WHEN, WHO, WHERE, WHAT)
$$ ##TITLE= Audit trail, XWIN-NMR		Version 3.5
$$ ##JCAMPDX= 5.01
$$ ##ORIGIN= Bruker BioSpin GmbH
$$ ##OWNER= nmr
$$ C:\u/data/dgb/nmr/ADRS/1960/pdata/1/auditp.txt
$$ ##AUDIT TRAIL=  $$ (NUMBER, WHEN, WHO, WHERE, WHAT)
(   1,<2006-12-21 10:23:50.42 +000>,<MAYBRIDGE\nmr>,<NMR_250MHZ>,
      <created by zg, POWCHK disabled, PULCHK disabled
       configuration hash MD5:
       49 4B E0 1D 92 C2 6B 37 9F E6 65 BC 52 41 86 1D
       data hash MD5: 64K
       69 3F 8D 0C 90 41 23 A5 29 D2 CE 67 E3 11 6C 81>)
(   2,<2006-12-21 10:24:03.48 +000>,<MAYBRIDGE\nmr>,<NMR_250MHZ>,
      <Start of raw data processing
       ef LB = 0.3 FT_mod = 6 PKNL = 1 SI = 32K 
       data hash MD5: 32K
       38 F7 23 35 71 AB EB 15 7B C6 FA C4 E2 47 5E 84>)
(   3,<2006-12-21 10:24:05.18 +000>,<MAYBRIDGE\nmr>,<NMR_250MHZ>,
      <apk 
       data hash MD5: 32K
       56 A6 89 EB 1E 64 F3 0F 94 8D 56 C0 EA 34 8F 6D>)
(   4,<2006-12-21 10:24:06.00 +000>,<MAYBRIDGE\nmr>,<NMR_250MHZ>,
      <abs ABSG = 5 
       data hash MD5: 32K
       27 50 D7 12 11 41 12 FB 62 28 F9 3C D8 DD A8 FB>)
$$ ##END=
$$ 
$$ hash MD5
$$ A9 17 F6 67 2D 47 DC 9C 76 9B 5D 95 A4 2C FD 87
##$RELAX= 
##$RELAX= 
##$RELAX= 
##$RELAX= 
##$RELAX= 
##$RELAX= 
##$RELAX= 
$$ Bruker specific parameters
$$ --------------------------
##$DU= <C:\u>
##$EXPNO= 1960
##$NAME= <ADRS>
##$PROCNO= 1
##$TYPE= <nmr>
##$USER= <dgb>
##$AMP= (0..31)
100 100 100 100 100 100 100 100 100 100 100 100 100 100 100 100 100 100 
100 100 100 100 100 100 100 100 100 100 100 100 100 100 
##$AQSEQ= 0
##$AQ_mod= 3
##$AUNM= <au_zg>
##$AUTOPOS= <31 >
##$BF1= 250.13
##$BF2= 250.13
##$BF3= 250.13
##$BF4= 250.13
##$BF5= 500.13
##$BF6= 500.13
##$BF7= 500.13
##$BF8= 500.13
##$BYTORDA= 1
##$CFDGTYP= 0
##$CFRGTYP= 5
##$CHEMSTR= <none>
##$CNST= (0..31)
1 1 145 1 1 1 1 1 1 1 1 1 1 1 1 1 1 1 1 1 1 1 1 1 1 1 1 1 1 1 1 1 
##$CPDPRG= <>
##$CPDPRG1= <>
##$CPDPRG2= <>
##$CPDPRG3= <>
##$CPDPRG4= <mlev>
##$CPDPRG5= <mlev>
##$CPDPRG6= <mlev>
##$CPDPRG7= <mlev>
##$CPDPRG8= <mlev>
##$CPDPRGB= <>
##$CPDPRGT= <>
##$D= (0..31)
0 1 0 0 0 0 0 0 0 0.06 0 0 0 0 0 0 0.0002 0 0 0 0 0 0 0 0 0 0 0 0 0 0 
0 
##$DATE= 1166696629
##$DBL= (0..7)
120 120 120 120 120 120 120 120 
##$DBP= (0..7)
150 150 150 150 150 150 150 150 
##$DBP07= 0
##$DBPNAM0= <>
##$DBPNAM1= <>
##$DBPNAM2= <>
##$DBPNAM3= <>
$$ [...]
##$SUBNAM6= <"">
##$SUBNAM7= <"">
##$SUBNAM8= <"">
##$SUBNAM9= <"">
##$SW= 20.6930455092707
##$SWIBOX= (0..15)
0 0 3 0 0 0 0 0 0 0 0 0 0 0 0 0 
##$SW_h= 5175.983436853
##$TD= 65536
##$TD0= 1
##$TE= 294.16
##$TE2= 300
##$TE3= 300
##$TEG= 300
##$TL= (0..7)
0 120 120 120 120 120 120 120 
##$TP= (0..7)
150 150 150 150 150 150 150 150 
##$TP07= 0
##$TPNAME0= <>
##$TPNAME1= <>
##$TPNAME2= <>
##$TPNAME3= <>
##$TPNAME4= <>
##$TPNAME5= <>
##$TPNAME6= <>
##$TPNAME7= <>
##$TPOAL= (0..7)
0.5 0.5 0.5 0.5 0.5 0.5 0.5 0.5 
##$TPOFFS= (0..7)
0 0 0 0 0 0 0 0 
##$TUNHIN= 0
##$TUNHOUT= 0
##$TUNXOUT= 0
##$USERA1= <user>
##$USERA2= <user>
##$USERA3= <user>
##$USERA4= <user>
##$USERA5= <user>
##$V9= 5
##$VALIST= <valist>
##$VCLIST= <CCCCCCCCCCCCCCC>
##$VD= 0
##$VDLIST= <DDDDDDDDDDDDDDD>
##$VPLIST= <PPPPPPPPPPPPPPP>
##$VTLIST= <TTTTTTTTTTTTTTT>
##$WBST= 1024
##$WBSW= 4
##$XGAIN= (0..3)
0 0 0 0 
##$XL= 0
##$YL= 0
##$YMAX_a= 342351
##$YMIN_a= -393678
##$ZGOPTNS= <>
##$ZL1= 120
##$ZL2= 120
##$ZL3= 120
##$ZL4= 120
##$ABSF1= 16.522
##$ABSF2= -4.171173
##$ABSG= 5
##$ABSL= 3
##$ALPHA= 0
##$AQORDER= 0
##$ASSFAC= 0
##$ASSFACI= 0
##$ASSFACX= 0
##$ASSWID= 0
##$AUNMP= <proc_1d>
##$AZFE= 0.1
##$AZFW= 0.1
##$BCFW= 0
##$BC_mod= 0
##$BYTORDP= 0
##$COROFFS= 0
##$CY= 12.5
##$DATMOD= 1
##$DC= 0
##$DFILT= <>
##$DTYPP= 0
##$F1P= 14.0000005364418
##$F2P= -0.99999901652339
##$FCOR= 0.5
##$FTSIZE= 32768
##$FT_mod= 6
##$GAMMA= 0
##$GB= 0
##$INTBC= 1
##$INTSCL= 1
##$ISEN= 128
##$LB= 0.3
##$LEV0= 0
##$LPBIN= 0
##$MAXI= 10000
##$MC2= 0
##$MEAN= 0
##$ME_mod= 0
##$MI= 0
##$NCOEF= 0
##$NC_proc= -3
##$NLEV= 6
##$NOISF1= 0
##$NOISF2= 0
##$NSP= 0
##$NTH_PI= 0
##$NZP= 0
##$OFFSET= 16.522
##$PC= 1
##$PHC0= 214.5028
##$PHC1= 9.461994
##$PH_mod= 1
##$PKNL= yes
##$PPARMOD= 0
##$PSCAL= 4
##$PSIGN= 0
##$REVERSE= no
##$SF= 250.13
##$SI= 32768
##$SIGF1= 0
##$SIGF2= 0
##$SINO= 400
##$SIOLD= 32768
##$SREGLST= <1H.DMSO>
##$SSB= 0
##$STSI= 32768
##$STSR= 0
##$SW_p= 5175.98343685301
##$SYMM= 0
##$S_DEV= 0
##$TDeff= 65536
##$TDoff= 0
##$TI= <Analysis number 999999
Compound Code 99
Book Reference 9
Project Code 9>
##$TILT= no
##$TM1= 0
##$TM2= 0
##$TOPLEV= 0
##$USERP1= <user>
##$USERP2= <user>
##$USERP3= <user>
##$USERP4= <user>
##$USERP5= <user>
##$WDW= 1
##$XDIM= 32768
##$YMAX_p= 479818726
##$YMIN_p= -84550
$$ End of Bruker specific parameters
$$ ---------------------------------
##NTUPLES= NMR SPECTRUM
##VAR_NAME=  FREQUENCY,     SPECTRUM/REAL,   SPECTRUM/IMAG
##SYMBOL=    X,             R,               I
##VAR_TYPE=  INDEPENDENT,   DEPENDENT,       DEPENDENT
##VAR_FORM=  AFFN,          ASDF,            ASDF
##VAR_DIM=   32768,         32768,           32768
##UNITS=     HZ,            ARBITRARY UNITS, ARBITRARY UNITS
##FACTOR=    0.157963299565203, 1,           1
##FIRST=     4132.6476996994, 0,             0
##LAST=      -1043.33573715361, 0,           0
##MIN=       -1043.33573715361, -84550,      0
##MAX=       4132.6476996994, 479818726,     0
$$ Real data points
##PAGE= N=1
##DATA TABLE= (X++(R..R)), XYDATA
$$ [...]
$$ plain form
13668 -374 -7314 8879 23232 27905 29464 12455 235 11432 30933 18124 -560 -1361 6956
13655 6956 19146 29904 7801 -4170 -11238 1707 5682 6110 18362 34213 34108 37701 40019
13642 40019 49143 35052 30398 18341 15429 38804 52914 38674 41919 46236 42909 30900 24170
13629 24170 38541 40767 34009 16359 24416 21689 21951 44822 45108 13182 10601 13935 15070 8792
13615 8792 -2103 -9061 -16371 -26499 -21651 -13091 -15281 -8692 2348 -2589 -183 15762 15873 -109
13601 -109 11916 5586 -1579 9756 22597 21666 23329 21246 32396 24558 -3487 -8284 -10498 -4064
13587 -4064 21061 33909 46961 40453 33747 31761 42315 49000 37054 24800 7291 -17487 -39580
13574 -39580 -21852 3737 3174 -5037 -24332 -14477 -7705 -262 868 2800 -4009 -13004 -26745 -15247
$$ packed form
13668c74o940J6193J4353M673J559j7009j2220J1197J9501j2809j8684q01Q317
13655F956J2190J0758k2103j1971p068J2945L975M28J2252J5851j05L593K318
13642D0019R124j4091m654j2057k912K3375J4110j4240L245M317l327j2009o730
13629B4170J4371K226o758j7650Q057k727K62K2871K86l1926k581L334J135o278
13615H792j0895o958p310j0128M848Q560k190O589J1040m937K406J5945J11j5982
13601a09J2025o330p165J1335J2841r31J663k083J1150p838k8045m797k214O434
13587d064K5125J2848J3052o508o706j986J0554O685j1946j2254j7509k4778k2093
13574c9580J7728K5589n63q211j9295R855O772P443J130J932o809q995j3741J1498
$$ plain form
13560 -15247 16573 29219 5087 190 -20818 -28103 -26924 -25218 -14933 -3732 -5068 -7130 2544
13547 2544 14640 14885 19081 14486 11402 -2706 -5377 -23230 -15217 15465 35959 35278 24269 24935
13533 24935 26490 18450 25559 1746 -9451 -17779 -21432 -11351 1479 4365 9481 14110 24146
13520 24146 24328 10367 17810 20378 23011 14443 12219 12817 12699 8588 7143 -14546 -18281 -6041
13506 -6041 -18760 -23989 16117 27754 30097 35018 14980 6536 12536 -6132 -4504 1338 -12026
13493 -12026 -19610 -15861 -2463 -12461 -1552 13223 -17220 -37510 -31819 -25641 1072 -2198 -5434
13480 -5434 5805 400 -3964 -4273 645 22193 38503 31472 38686 44327 41266 48338 39216 27301
13466 27301 44002 46687 20358 26980 23077 18329 22849 37972 58323 47824 44569 30466 25451
$$ packed form
13560a5247L1820J2646k4132m897k1008p285J179J706J0285J1201j336k062R674
13547B544J2096K45M196m595l084j4108k671j7853Q013L0682K0494o81j1009O66
13533B4935J555q040P109k3813j1197q328l653J0081J2830K886N116M629J0036
13520B4146J82j3961P443K568K633q568k224N98j18m111j445k1689l735J2240
13506f041j2719n229M0106J1637K343M921k0038q444O000j8668J628N842j3364
13493a2026p584L749J3398r998J0909J4775l0443k0290N691O178K6713l270l236
13480e434J1239n405m364l09M918K1548J6310p031P214N641l061P072r122j1915
13466B7301J6701K685k6329O622l903m748M520J5123K0351j0499l255j4103n015
$$ plain form
13453 25451 25109 10834 -6650 -11105 -1044 30563 29150 43911 32924 18420 16429 30408 36259
13440 36259 27260 16626 25593 35048 37171 29881 9761 -1825 8061 -4772 -16976 -10314 -29300
13427 -29300 -31822 -23595 -15292 -5366 -5900 1524 6991 11032 22911 16904 11281 3927 14593 11305
13413 11305 -3137 -7414 -24504 -26682 -21370 -15338 -1709 2213 -2180 3962 8562 4961 904 4390
13399 4390 -809 -18259 -28375 -9165 -1920 5913 11512 16047 33372 38101 46099 42466 43169 29305
13385 29305 13106 21522 18748 22129 33076 33734 22132 20313 15829 30660 13195 13182 15718 20428
13371 20428 48479 63799 36973 15760 -18548 -29380 -14642 -15004 -26543 -1323 22376 13954
13359 13954 8524 11756 23540 38048 54340 36172 26635 16366 10819 -1179 545 6884 -2117
$$ packed form
13453B5451l42j4275j7484m455J0061L1607j413J4761j0987j4504j991J3979N851
13440C6259q999j0634Q967R455K123p290k0120j1586R886j2833j2204O662j8986
13427b9300k522Q227Q303R926n34P424N467M041J1879o007n623p354J0666l288
13413A1305j4442m277j7090k178N312O032J3629L922m393O142M600l601m057L486
13399D390n199j7450j0116J9210P245P833N599M535J7325M729P998l633P03j3864
13385B9305j6199Q416k774L381J0947O58j1602j819m484J4831j7465j3K536M710
13371B0428K8051J5320k6826k1213l4308j0832J4738l62j1539K5220K3699q422
13359A3954n430L232J1784J4508J6292j8168r537j0269n547j1998J724O339r001
$$ plain form
13346 -2117 -16797 -17347 -24843 -24074 -15399 -7962 -17393 -15631 -16437 -15846 -18924 -14450 2251 4419 2238
13331 2238 -1694 -10339 5075 11830 10279 12283 11775 30091 45274 38148 18396 18988 22249 9156
13317 9156 20848 24186 18145 23026 33756 57905 61268 54422 51778 11442 -11463 -965 -5082
13304 -5082 3214 16795 19964 13723 11932 9303 2854 -9221 -2318 -14758 -11681 -15004 -14576 -23793
13290 -23793 -23154 -4753 8515 14924 31670 59361 61047 37639 13745 8655 16457 23369 4621
13277 4621 8658 31660 34997 13668 8173 10086 22860 33391 35980 21017 8396 -13572 -18190
13264 -18190 -7607 -4342 -12228 -4111 7498 12736 15650 24783 38126 48871 36343 41382 25918
13251 25918 8687 13019 10195 5197 8393 14824 31343 38824 42482 32202 9029 7391 15482
$$ packed form
13346b117j4680n50p496P69Q675P437r431J762q06N91l078M474J6701K168k181
13331B238l932q645J5414O755j551K004n08J8316J5183p126j9752N92L261j3093
13317I156J1692L338o041M881J0730K4149L363o846k644m0336k2905J0498m117
13304e082Q296J3581L169o241j791k629o449j2075O903j2440L077l323M28r217
13290b3793O39J8401J3268O409J6746K7691J686k3408k3894n090P802O912j8748
13277D621M037K3002L337k1329n495J913J2774J0531K589j4963j2621k1968m618
13264a8190J0583L265p886Q117J1609N238K914R133J3343J0745j2528N039j5464
13251B5918j7231M332k824m998L196O431J6519P481L658j0280k3173j638Q091
$$ plain form
13238 15482 14244 12540 -482 5091 5060 7972 19688 27373 34988 22167 18895 32466 24906 2990
13224 2990 -2864 -1123 60 29574 17565 -6008 -10165 -9095 -9012 -25 24842 23791 22829 19793
13210 19793 8420 15460 15395 17619 27505 32709 24350 17143 27590 33365 37719 36132 35692 26082 18824
13195 18824 14087 22778 47123 64368 62752 35542 25395 34171 40070 29936 16214 3580 31287
13182 31287 16795 9395 11099 22675 21937 11835 811 -9330 -14754 -2415 3064 -6176 -16189
13169 -16189 -5613 9187 19893 6339 10734 19073 24967 17272 -4037 3297 16290 12900 13820
13156 13820 24625 22503 36798 30062 4930 -7694 -4147 -3675 -8494 6505 17857 23441 29458
13143 29458 25721 23878 37834 13902 -2387 -1102 9042 21026 28387 29192 14848 12481 17280
$$ packed form
13238A5482j238j704j3022N573l1K912J1716P685P615j2821l272J3571p560k1916
13224B990n854J741J183K9514j2009k3573m157J070Q3Q987K4867j051r62l036
13210A9793j1373P040o5K224R886N204q359p207J0447N775M354j587m40r610p258
13195A8824m737Q691K4345J7245j616k7210j0147Q776N899j0134j3722j2634K7707
13182C1287j4492p400J704J1576p38j0102j1024j0141n424J2339N479r240j0013
13169a6189J0576J4800J0706j3554M395Q339N894p695k1309P334J2993l390R20
13156A3820J0805k122J4295o736k5132j2624L547M72m819J4999J1352N584O017
13143B9458l737j843J3956k3932j6289J285J0144J1984P361Q05j4344k367M799
$$ plain form
13130 17280 13767 15230 16275 26290 19462 11089 15772 31882 35256 65503 61657 34960 30181
13117 30181 32928 42055 49913 44867 10334 7041 18935 5711 17577 32714 37607 42881 39646
13104 39646 43421 38818 19673 5407 6202 6609 10357 22907 28221 20349 -11580 -9730 5758 10352
13090 10352 -2179 -8802 -14191 2446 24184 32781 29293 31639 17541 24188 22035 15963 14519
13077 14519 8676 4204 7903 17701 5526 9224 21325 8300 4921 7744 20159 29549 16745
13064 16745 -15216 -11081 -6684 -10049 4705 23721 33693 41880 44866 43928 21488 15819 21491 27087
13050 27087 32554 51190 60669 44002 25425 33997 31746 30561 45905 45754 45337 39816 30560 33462
13036 33462 33321 16566 11585 18822 22188 -1661 -7979 4553 6906 -5076 -3056 16486 20881
$$ packed form
13130A7280l513J463J045J0015o828q373M683J6110L374L0247l846k6697m779
13117C0181K747R127P858n046l4533l293J1894j3224J1866J5137M893N274l235
13104C9646L775m603j9145j4266P95M07L748J2550N314p872l1929J850J5488M594
13090A0352j2531o623n389J6637K1738Q597l488K346j4098O647k153o072j444
13077A4519n843m472L699R798j2175L698J2101j3025l379K823J2415R390j2804
13064A6745l1961M135M397l365J4754J9016R972Q187K986r38k2440n669N672N596
13050B7087N467J8636R479j6667j8577Q572k251j185J5344j51m17n521r256K902
13036C3462j41j6755m981P237L366k3849o318J2532K353j1982K020J9542M395
$$ plain form
13023 20881 16638 23096 38801 32479 23268 40864 50091 27106 30928 26546 30637 32731 31462 34552
13009 34552 41448 20322 12640 5682 19020 16906 19029 33936 38207 38705 56648 61334 53989 54706
12995 54706 49000 17393 -11015 -25046 -16433 -20455 -30423 -10150 8945 13195 16059 17252 11372
12982 11372 9378 26066 26901 3687 16077 20893 9911 21596 9983 -10040 -5462 16191 41622
12969 41622 33508 35397 21636 18547 21261 21789 30937 33805 44464 39430 21369 23800 18668 5198
12955 5198 4934 25781 37396 18548 16157 15476 11383 22139 17805 -2246 -15979 -9959 8847
12942 8847 17164 16327 9512 24459 14091 591 3232 12434 3483 -594 5584 23888 33311 23703
12928 23703 1303 8020 29179 20375 14185 3573 13 -338 16257 20549 29884 53904 42283
$$ packed form
13023B0881m243O458J5705o322r211J7596R227k2985L822m382M091K094j269L090
13009C4552O896k1126p682o958J3338k114K123J4907M271M98J7943M686p345P17
12995E4706n706l1607k8408j4031Q613m022r968K0273J9095M250K864J193n880
12982A1372j994J6688Q35k3214J2390M816j0982J1685j1613k0023M578K1653K5431
12969D1622q114J889j3761l089K714N28R148K868J0659n034j8061K431n132j3470
12955E198k64K0847J1615j8848k391o81m093J0756m334k0051j3733O020J8806
12942H847Q317q37o815J4947j0368j3500K641R202q951m077O178J8304R423r608
12928B3703k2400O717K1159q804o190j0612l560l51J6595M292R335K4020j1621
$$ plain form
12915 42283 32554 26705 29959 32598 38545 28342 19550 14414 12318 7030 5894 2528 7545 3249
12901 3249 13756 27731 25440 17450 17890 25118 32066 29168 41955 61470 67817 78805 64478
12888 64478 61477 62820 60812 53919 29321 12578 38541 54511 50989 49550 53044 59489 55980
12875 55980 49663 49220 38793 41175 44021 25034 8400 14212 19434 16817 16421 24512 30165 45279
12861 45279 18328 -4410 -12650 -1009 25315 28463 24461 13061 7109 -1778 14789 28370 21378
12848 21378 23278 46391 77967 67930 47884 37445 42210 33989 15604 13216 25380 11466
12836 11466 23048 23015 18519 28210 32087 36171 38373 36814 28765 29501 45211 51398 39737 26144
12822 26144 33705 56024 43943 14351 14061 29652 30012 27310 32594 23284 39526 54676 47279
$$ packed form
12915D2283r729n849L254K639N947j0203q792n136k096n288j136l366N017m296
12901C249J0507J3975k291p990M40P228O948k898J2787J9515O347J0988j4327
12888F4478l001J343k008o893k4598j6743K5963J5970l522j439L494O445l509
12875E5980o317m43j0427K382K846j8987j6634N812N222k617l96Q091N653J5114
12861D5279k6951k2738q240J1641K6324L148m002j1400n952q887J6567J3581o992
12848B1378J900K3113L1576j0037k0046j0439M765q221j8385k388J2164j3914
12836A1466J1582l3m496R691L877M084K202j559q049P36J5710O187j1661j3593
12822B6144P561K2319j2081k9592k90J5591L60k702N284r310J6242J5150p397
$$ plain form
12809 47279 21238 4001 24114 48223 52438 42019 39830 49185 52745 41085 27602 46057
12797 46057 41547 54045 58680 65121 58903 43140 32253 19760 25971 37049 48689 61461 64259
12784 64259 61579 58439 54110 71350 64326 63060 55760 47275 52312 74237 67273 49519 64881
12771 64881 78194 67709 65690 55323 57511 45384 24406 34271 39525 55606 83610 99273
12759 99273 85846 60158 62605 71825 70458 44631 39236 37644 46307 65839 58836 40524 36572
12746 36572 32643 25118 21672 37618 57865 54768 39632 38689 45994 61399 69740 51840 52854
12733 52854 65297 58614 79746 78039 63907 62052 56406 73993 79355 53568 24943 50017 60822
12720 60822 82687 90119 90427 76524 62541 61940 65021 74765 88016 86498 86116 90804 82131 66685
$$ packed form
12809D7279k6041j7237K0113K4109M215j0419k189R355L560j1660j3483J8455
12797D6057m510J2498M635O441o218j5763j0887j2493O211J1078J1640J2772K798
12784F4259k680l140m329J7240p024j266p300q485N037K1925o964j7754J5362
12771F4881J3313j0485k019j0367K188j2127k0978R865N254J6081K8004J5663
12759I9273j3427k5688K447R220j367k5827n395j592Q663J9532p003j8312l952
12746C6572l929p525l446J5946K0247l097j5136r43P305J5405Q341j7900J014
12733E2854J2443o683K1132j707j4132j855n646J7587N362k5787k8625K5074J0805
12720F0822K1865P432L08j3903j3983o01L081R744J3251j518l82M688q673j5446
$$ plain form
12706 66685 53076 51280 62451 65688 57137 51626 52282 68250 73784 70987 62184 53453 56927 57358
12692 57358 59303 80130 96719 100503 95099 83977 56906 48660 57864 75668 75463 57772 44178
12679 44178 56982 69519 80948 89426 90996 103281 97287 77657 76859 81515 106848 116526 103058
12666 103058 99890 104013 95544 92134 105297 103197 99911 89636 101531 96778 98351 111735 120948
12653 120948 114394 105637 107337 95479 78242 74144 78339 93455 118658 127036 112675 111350 109470
12640 109470 109602 111076 110943 113918 116790 123544 105160 125452 134748 137450 143533 120046 111239 123658
12626 123658 133364 112098 106933 115012 133080 121092 109505 107598 116702 111467 129547 157446 172098
12613 172098 159612 139992 126077 121881 109933 95225 87262 96272 101920 97659 97277 98674 103222
$$ packed form
12706F6685j3609j796J1171L237q551n511O56J5968N534k797q803q731L474M31
12692E7358J945K0827J6589L784n404j1122k7071q246R204J7804k05j7691j3594
12679D4178J2804J2537J1429Q478J570J2285n994j9630p98M656K5333R678j3468
12666A03058l168M123q469l410J3163k100l286j0275J1895m753J573J3384R213
12653A20948o554q757J700j1858j7237m098M195J5116K5203Q378j4361j325j880
12640A09470J32J474j33K975K872O754j8384K0292R296K702O083k3487q807J2419
12626A23658R706k1266n165Q079J8068j1988j1587j907R104n235J8080K7899J4652
12613A72098j2486j9620j3915m196j1948j4708p963R010N648m261l82J397M548
$$ plain form
12600 103222 105359 107532 113674 116693 111310 123161 146093 135829 137719 130031 139279 155019 151750
12587 151750 154480 155166 174253 166194 176007 182821 188614 189268 189155 189395 166939 141040 151199 160501
12573 160501 179810 192370 190204 192916 160589 152572 175258 193381 190352 179278 188411 182064 188209
12560 188209 198262 205790 205828 195885 194892 191411 180559 184051 195523 202001 205441 218201 215186 211929
12546 211929 227413 248252 257643 235713 224002 215994 223793 224041 225349 256943 264496 245536 251688
12533 251688 280664 280461 276532 258772 261833 277926 292273 308449 304370 279802 287606 316274 323510
12520 323510 330277 333589 330858 343026 339175 347055 374635 381943 363475 357728 376424 376863 393969
12507 393969 417339 426917 427095 439344 462407 436941 439695 452704 464503 462911 457880 473857 498531
$$ packed form
12600A03222K137K173O142L019n383J1851K2932j0264J890p688R248J5740l269
12587A51750K730O86J9087q059R813O814N793O54j13K40k2456k5899J0159R302
12573A60501J9309J2560k166K712l2327q017K2686J8123l029j1074R133o347O145
12560A88209J0053P528L8r943r93l481j0852L492J1472O478L440J2760l015l257
12546B11929J5484K0839R391k1930j1711q008P799K48J308L1594P553j8960O152
12533B51688K8976k03l929j7760L061J6093J4347J6176m079k4568P804K8668P236
12520C23510O767L312k731J2168l851P880K7580P308j8468n747J8696M39J7106
12507C93969K3370R578J78J2249K3063k5466K754J3009J1799j592n031J5977K4674
$$ plain form
12494 498531 516247 528335 547305 548802 547241 552284 553596 574100 578385 589765 590589 587582 596633
12481 596633 612125 638049 668119 678272 702497 724739 722965 740078 764719 792514 813787 816569
12469 816569 826424 826486 872849 909921 946533 976452 982757 993566 1014978 1024610 1021548 1054701 1088347
12456 1088347 1108590 1127064 1163609 1196663 1226272 1254950 1287924 1343706 1397401 1431413 1469277
12445 1469277 1516113 1570043 1621541 1662799 1715191 1775398 1860581 1921521 1973010 2029609 2095928
12434 2095928 2182346 2276747 2362119 2445909 2547534 2667043 2775106 2885430 3015729 3148500
12424 3148500 3280575 3438364 3610762 3781393 3965549 4181288 4391720 4627677 4889793
12415 4889793 5144947 5445581 5756083 6098341 6480204 6866381 7264701 7705406 8207122
$$ packed form
12494D98531J7716J2088J8970J497j561N043J312K0504M285J1380Q24l007R051
12481E96633J5492K5924L0070J0153K4225K2242j774J7113K4641K7795K1273K782
12469H16569R855O2M6363L7072L6612K9919O305J0809K1412R632l062L3153L3646
12456A088347K0243J8474L6545L3054K9609K8678L2974N5782N3695L4012L7864
12445A469277M6836N3930N1498M1258N2392O0207Q5183O0940N1489N6599O6319
12434B095928Q6418R4401Q5372Q3790J01625J19509J08063J10324J30299J32771
12424C148500J32075J57789J72398J70631J84156K15739K10432K35957K62116
12415D889793K55154L00634L10502L42258L81863L86177L98320M40705N01716
$$ plain form
12406 8207122 8784840 9400720 10035458 10726246 11475529 12270340 13145354 14069036 15058820
12397 15058820 16125830 17239358 18384447 19543695 20715609 21853210 22944599 23961866
12389 23961866 24845749 25555524 26091954 26413302 26485576 26312274 25914777 25322257 24554603
12380 24554603 23629638 22593296 21486454 20357522 19207915 18070907 16982767 15911612
12372 15911612 14889095 13931781 13054799 12234091 11445976 10725760 10056399 9428522 8852871
12363 8852871 8328765 7841261 7381972 6956186 6569962 6201920 5848463 5532706 5245458
12354 5245458 4975446 4736702 4514347 4295760 4097907 3892709 3727236 3549471 3379156
12345 3379156 3222685 3062155 2920722 2806714 2708308 2603342 2505682 2398400 2323187 2234362
$$ packed form
12406H207122N77718O15880O34738O90788P49283P94811Q75014R23682R89784
12397A5058820J067010J113528J145089J159248J171914J137601J091389J017267
12389B3961866Q83883P09775N36430L21348P2274j73302l97497n92520p67654
12380B4554603r24965j036342j106842j128932j149607j137008j088140j071155
12372A5911612j022517r57314q76982q20708p88115p20216o69361o27877n75651
12363H852871n24106m87504m59289m25786l86224l68042l53457l15757k87248
12354E245458k70012k38744k22355k18587j97853k05198j65473j77765j70315
12345C379156j56471j60530j41433j14008r8406j04966r7660j07282p5213q8825
$$ plain form
12335 2234362 2135349 2041342 1979487 1910861 1841545 1769863 1706998 1661202 1599583 1537991 1501024
12324 1501024 1463934 1409037 1372936 1333061 1299755 1258118 1232705 1202880 1163211 1121199 1085207
12313 1085207 1068266 1039983 1012935 985325 959055 944990 915642 906654 895270 867882 850737
12302 850737 845013 829117 782360 752813 737560 726289 724859 709750 692702 677096 660907 655243
12290 655243 644935 635939 614710 607556 605776 603289 591614 580019 565629 577240 570412 565387 555020
12277 555020 534859 514389 511016 497665 478672 458691 457401 444888 445346 441933 450190 454830 458527
12264 458527 445481 429718 417940 417751 407782 387977 388198 395349 398063 396229 400821 408735 402835 379022
12250 379022 369220 376536 381620 368682 350217 336330 334591 351679 347115 321583 321692 307688 299937
$$ packed form
12335B234362r9013r4007o1855o8626o9316p1682o2865m5796o1619o1592l6967
12324A501024l7090n4897l6101l9875l3306m1637k5413k9825l9669m2012l5992
12313A085207j6941k8283k7048k7610k6270j4065k9348q988j1384k7388j7145
12302H50737n724j5896m6757k9547j5253j1271j430j5109j7048j5606j6189n664
12290F55243j0308q996k1229p154j780k487j1675j1595j4390J1611o828n025j0367
12277E55020k0161k0470l373j3351j8993j9981j290j2513M58l413Q257M640L697
12264D58527j3046j5763j1778j89r969j9805K21P151K714j834M592P914n900k3813
12250C79022r802P316N084j2938j8465j3887j739J7088m564k5532J09j4004p751
$$ plain form
12237 299937 312384 321970 307793 298615 299086 288451 296587 304406 294097 279574 271115 285295 295049
12224 295049 300771 298017 298044 298485 300067 284785 276186 274384 271431 266791 270466 283952 293925 298057
12210 298057 300167 294814 274472 277277 281730 266273 229339 221782 234479 244132 225402 206557 221990
12197 221990 249142 253938 235442 212649 220732 227426 210992 221815 238183 229581 227963 217938
12185 217938 197600 169538 159874 167694 171756 174266 186849 195673 187342 195576 206874 180222 154135
12172 154135 144401 145403 157640 152241 129200 134080 146603 154854 133032 128058 117135 113511 125096
12159 125096 128288 130577 138221 148136 149293 122793 123705 118346 130367 143926 135235 125513 126839 133094
12145 133094 143491 143293 138253 132281 115777 95574 96193 112499 112186 100426 110307 128324 145519
$$ packed form
12237B99937J2447R586j4177r178M71j0635Q136P819j0309j4523q459J4180R754
12224B95049N722k754K7M41J582j5282q599j802k953m640L675J3486R973M132
12210B98057K110n353k0342K805M453j5457l6934p557J2697R653j8730j8845J5433
12197B21990K7152M796j8496k2793Q083O694j6434J0823J6368q602j618j0025
12185B17938k0338k8062r664P820M062K510J2583Q824q331Q234J1298k6652k6087
12172A54135r734J002J2237n399k3041M880J2523Q251k1822m974j0923l624J1585
12159A25096L192K289P644R915J157k6500R12n359J2021J3559q691r722J326O255
12145A33094J0397j98n040n972j6504k0203O19J6306l13j1760R881J8017J7195
$$ plain form
12132 145519 160560 158618 152058 146864 145304 153994 153734 141405 139479 142522 143738 146334 149128 147817
12118 147817 138430 132707 123518 118704 145213 153919 134648 132098 141117 151763 142207 144968 135997
12105 135997 135299 154921 145613 144421 147917 142378 133892 115873 125056 139582 134142 121791 113298
12092 113298 111282 124173 113396 111735 108063 101601 94194 100931 108519 107285 91207 79891 93909
12079 93909 113004 113394 105008 104986 100851 105870 113106 142415 138855 112477 98674 95516 95373 97630
12065 97630 93639 93743 94764 96445 108908 103237 96323 111154 110337 110168 111422 114855 120018 125513 119014
12050 119014 106095 100280 99881 99677 124352 132618 117335 101381 114786 129644 130766 121724 123914
12037 123914 108317 112466 136991 133062 132998 142127 132045 121561 117122 141142 134114 122451 124072
$$ packed form
12132A45519J5041j942o560n194j560Q690k60j2329j926L043J216K596K794j311
12118A47817r387n723r189m814K6509Q706j9271k550R019J0646r556K761q971
12105A35997o98J9622r308j192L496n539q486j8019R183J4526n440j2351q493
12092A13298k016J2891j0777j661l672o462p407O737P588j234j6078j1316J4018
12079I3909J9095L90q386k2m135N019P236K9309l560k6378j3803l158j43K257
12065I7630l991J04J021J681J2463n671o914J4831q17j69J254L433N163N495o499
12050A19014j2919n815l99k04K4675Q266j5283j5954J3405J4858J122r042K190
12037A23914j5597M149K4525l929o4R129j0082j0484m439K4020p028j1663J621
$$ plain form
12024 124072 138150 129276 116860 121911 134522 119610 96632 94684 82990 73092 74241 101916
12012 101916 108146 103688 109482 120811 131156 127696 93177 65457 93095 122298 122407 115713 111518
11999 111518 92306 87343 94635 86979 99183 106291 96366 104777 97096 82559 111377 139671 183773
11986 183773 257867 296868 273655 212124 137311 105771 102361 103390 92680 84530 88293 74729
11974 74729 81474 80462 101198 76987 70291 65636 70797 73606 66732 82693 88269 92537 99896 108040
11960 108040 113621 116503 106749 89881 81051 75177 91938 103593 113717 112899 110090 104621 96596
11947 96596 97264 94585 86247 84576 80278 72853 73818 92042 102822 88390 79686 72021 86809 87799
11933 87799 96115 104299 107606 115374 107945 107626 120019 124402 124681 108483 91002 96076 102606 111720
$$ packed form
12024A24072J4078q874j2416N051J2611j4912k2978j948j1694r898J149K7675
12012A01916O230m458N794J1329J0345l460l4519k7720K7638K9203J09o694m195
11999A11518j9212m963P292p656J2204P108r925Q411p681j4537K8818K8294M4102
11986A83773P4094L9001k3213o1531p4813l1540l410J029j0710q150L763j3564
11974G4729O745j012K0736k4211o696m655N161K809o874J5961N576M268P359Q144
11960A08040N581K882r754j6868q830n874J6761J1655J0124q18k809n469q025
11947I6596O68k679q338j671m298p425R65J8224J0780j4432q704p665J4788R90
11933H7799Q316Q184L307P768p429l19J2393M383K79j6198j7481N074O530R114
$$ plain form
11919 111720 126597 145778 153509 159449 154248 124114 127735 127099 136046 131441 134620 137561 137681 144082
11905 144082 147804 153006 145680 137280 134095 152161 167823 168285 163663 161947 170793 197489 199021 190007
11891 190007 192279 205360 199914 221851 230233 243301 266662 285034 280577 300224 314961 325031
11879 325031 365522 394601 408651 438689 455635 487842 535265 582295 641348 720638 796078
11868 796078 868753 952465 1044978 1161683 1293796 1429094 1578905 1725079 1860435 2007871
11858 2007871 2177413 2367692 2578714 2797209 3028520 3260640 3501274 3767639 4044585
11849 4044585 4340126 4639801 4932527 5233985 5538286 5809094 6080971 6378595 6684523
11840 6684523 6981043 7274482 7548780 7816187 8074046 8306700 8527321 8744143 8930885
$$ packed form
11919A11720J4877J9181P731N940n201l0134L621o36Q947m605L179K941J20O401
11905A44082L722N202p326q400l185J8066J5662M62m622j716Q846K6696J532r014
11891A90007K272J3081n446K1937Q382J3068K3361J8372m457J9647J4737J0070
11879C25031M0491K9079J4050L0038J6946L2207M7423M7030N9053P9290P5440
11868G96078P2675Q3712R2513J16705J32113J35298J49811J46174J35356J47436
11858B007871J69542J90279K11022K18495K31311K32120K40634K66365K76946
11849D044585K95541K99675K92726L01458L04301K70808K71877K97624L05928
11840F684523K96520K93439K74298K67407K57859K32654K20621K16822J86742
$$ plain form
11831 8930885 9094974 9261186 9411502 9550141 9689550 9843228 9975751 10080780 10169033 10208794
11821 10208794 10195749 10162244 10091094 10000075 9876338 9736648 9596361 9482902 9341301 9206010
11811 9206010 9076997 8956089 8825992 8659446 8464058 8248636 8033774 7784854 7511727
11802 7511727 7242307 6957670 6692212 6443747 6211569 5980033 5750603 5520418 5295746
11793 5295746 5085081 4911147 4741699 4581036 4461026 4368612 4298479 4246526 4226696 4222902
11783 4222902 4228115 4255382 4320359 4388054 4454091 4547653 4671229 4810669 4968547 5159910 5399060
11772 5399060 5627221 5869154 6157698 6447265 6719810 7017205 7323640 7638603 7966381
11763 7966381 8282561 8614783 8951239 9279728 9605256 9895351 10132293 10347437 10547291
$$ packed form
11831H930885J64089J66212J50316J38639J39409J53678J32523J05029Q8253L9761
11821A0208794j3045l3505p1150r1019j23737j39690j40287j13459j41601j35291
11811I206010j29013j20908j30097j66546j95388k15422k14862k48920k73127
11802G511727k69420k84637k65458k48465k32178k31536k29430k30185k24672
11793E295746k10665j73934j69448j60663j20010r2414p0133n1953j9830l794
11783D222902N213K7267O4977O7695O6037R3562J23576J39440J57878J91363K39150
11772E399060K28161K41933K88544K89567K72545K97395L06435L14963L27778
11763G966381L16180L32222L36456L28489L25528K90095K36942K15144J99854
$$ plain form
11754 10547291 10719716 10875626 11031027 11178543 11344488 11523095 11701392 11873706 12012162
11745 12012162 12132912 12227166 12264451 12248537 12187400 12068708 11904832 11732969 11532817 11320682
11735 11320682 11151131 10980608 10796383 10639580 10458487 10247146 10027131 9768665 9467332
11726 9467332 9155920 8814906 8484204 8180556 7865606 7540368 7224652 6919108 6602440
11717 6602440 6277067 5932048 5598396 5254933 4923252 4581465 4234678 3958648 3706742
11708 3706742 3438858 3194146 2987381 2773817 2573090 2392545 2202714 2022417 1847491
11699 1847491 1692616 1521711 1373068 1243443 1145703 1059782 961431 876454 823750 751041
11689 751041 695461 644771 583635 533539 483903 462927 439099 435083 427359 396942 373578 363812
$$ packed form
11754A0547291J72425J55910J55401J47516J65945J78607J78297J72314J38456
11745A2012162J20750R4254L7285j5914o1137j18692j63876j71863k00152k12135
11735A1320682j69551j70523j84225j56803j81093k11341k20015k58466l01333
11726I467332l11412l41014l30702l03648l14950l25238l15716l05544l16668
11717F602440l25373l45019l33652l43463l31681l41787l46787k76030k51906
11708C706742k67884k44712k06765k13564k00727j80545j89831j80297j74926
11699A847491j54875j70905j48643j29625r7740q5921r8351q4977n2704p2709
11689G51041n5580n0690o1136n0096m9636k0976k3828m016p724l0417k3364r766
$$ plain form
11677 363812 352000 326240 304748 297304 271712 261128 247296 250440 258664 225556 204454 197678
11665 197678 212004 208305 200288 193672 185780 157001 151895 168560 174912 162970 140760 127587 111678
11652 111678 106362 107252 113052 115077 114915 123565 126941 120160 116604 119547 107708 81094 61172 66848
11638 66848 76457 87671 88125 94399 109786 114705 100033 87915 84316 83176 90147 91291 101763
11625 101763 100029 98937 117001 102619 77018 89699 106185 107376 92521 85481 89665 92899 97327
11612 97327 108271 104124 90776 71634 74018 65616 75950 78897 65542 62044 64056 59429 55660
11599 55660 34933 41003 54910 73719 73887 76743 77134 76932 59111 54044 48248 51265 52907 44985
11585 44985 26617 38969 61702 67029 54763 70469 67574 53072 25093 33765 46260 37808
$$ packed form
11677C63812j1812k5760k1492p444k5592j0584j3832L144Q224l3108k1102o776
11665A97678J4326l699q017o616p892k8779n106J6665O352j1942k2210j3173j5909
11652A11678n316Q90N800K025j62Q650L376o781l556K943j1839k6614j9922N676
11638F6848R609J1214M54O274J5387M919j4672j2118l599j140O971J144J0472
11625A01763j734j092J8064j4382k5601J2681J6486J191j4855p040M184L234M428
11612I7327J0944m147j3348j9142K384q402J0334K947j3355l498K012m627l769
11599E5660k0727O070J3907J8809J68K856L91k02j7821n067n796L017J642p922
11585D4985j8368J2352K2733N327j2266J5706k895j4502k7979Q672J2495q452
$$ plain form
11573 37808 31565 32825 47805 62239 78803 53061 30977 27684 51415 64599 63689 68844 75019
11560 75019 55315 45177 30006 12853 37396 57748 52272 49233 45059 37695 23696 31976 31744
11547 31744 44886 67950 61646 47682 36942 34132 23565 35162 23254 26000 28793 43285
11535 43285 51390 55088 57562 64667 59902 45375 50778 57066 52030 51725 52715 53450 51274 33092 36395
11520 36395 30238 37716 40528 21175 24149 38570 31030 33800 25747 37657 37255 33690 34400 35566
11506 35566 47245 48717 52260 51508 40328 53328 71773 64745 46235 33293 15315 -2565 13344
11493 13344 21917 38555 38711 34416 45010 70257 90325 93698 79425 60340 79165 89229 85365
11480 85365 91379 95621 94054 96266 97733 93787 95401 98955 87488 69235 69521 82103 103288 99775
$$ packed form
11573C7808o243J260J4980J4434J6564k5742k2084l293K3731J3184r10N155O175
11560G5019j9704j0138j5171j7153K4543K0352n476l039m174p364j3999Q280k32
11547C1744J3142K3064o304j3964j0740k810j0567J1597j1908K746K793J4492
11535D3285Q105L698K474P105m765j4527N403O288n036l05R90P35k176j8182L303
11520C6395o157P478K812j9353K974J4421p540K770q053J1910m02l565P10J166
11506C5566J1679J472L543p52j1180J3000J8445p028j8510j2942j7978j7880J5909
11493A3344Q573J6638J56m295J0594K5247K0068L373j4273j9085J8825J0064l864
11480H5365O014M242j567K212J467l946J614L554j1467j8253K86J2582K1185l513
$$ plain form
11466 99775 73560 63758 66801 66507 67291 78903 84944 64258 51090 63729 56018 40221 46114
11453 46114 52559 67034 90703 98937 92311 78189 76457 82258 89634 77179 70337 65666 44453
11440 44453 33258 39684 38764 48527 51994 52598 38433 39249 36179 24285 20893 23456 28745 35381
11426 35381 44056 64408 77797 83425 90305 93963 97003 98037 113791 82242 55114 71988 84909
11413 84909 85142 76297 71620 60693 75406 75524 63794 53291 72164 78206 62588 28567 46798
11400 46798 71412 80161 73873 80833 98074 119251 132508 147763 147977 130822 102373 104305 122279
11387 122279 147857 171704 158851 148170 143819 138231 132255 118955 114232 137263 160983 159879
11375 159879 160654 165812 153772 138064 140300 153935 156400 167104 153406 123241 109730 98923
$$ packed form
11466I9775k6215r802L043k94P84J1612O041k0686j3168J2639p711j5797N893
11453D6114O445J4475K3669Q234o626j4122j732N801P376j2455o842m671k1213
11440D4453j1195O426r20R763L467O04j4165Q16l070j1894l392K563N289O636
11426C5381Q675K0352J3389N628O880L658L040J034J5754l1549k7128J6874J2921
11413H4909K33q845m677j0927J4713J18j1730j0503J8873O042j5618l4021J8231
11400D6798K4614Q749o288O960J7241K1177J3257J5255K14j7155k8449J932J7974
11387A22279K5578K3847j2853j0681m351n588n976j3300m723K3031K3720j104
11375A59879P75N158j2040j5708K236J3635K465J0704j3698l0165j3511j0807
$$ plain form
11363 98923 113635 122691 117953 106981 106220 97301 99563 98842 103921 106802 106014 108511 109704 106692 90842
11348 90842 81461 67391 71973 90344 103997 103460 127620 158924 159979 141209 129904 115058 95412
11335 95412 92126 90174 96177 105291 116833 103300 73178 77584 68929 47474 44475 66073 88397
11322 88397 88583 95667 110223 112504 104439 89858 85482 96536 85075 67812 70600 90909 109452
11309 109452 107748 105602 97387 109254 101520 82639 85195 94973 106264 111151 103331 104107 117559
11296 117559 132306 126330 121781 132670 137950 123033 105919 104874 114131 119577 93735 87722 88150
11283 88150 85462 94258 87259 77077 85965 99012 87338 77415 99559 83969 71104 82452 105901
11270 105901 92816 70237 66626 78128 66000 63969 71350 94954 95442 89667 72810 75367 102799
$$ packed form
11363I8923J4712R056m738j0972p61q919K262p21N079K881p88K497J193l012j5850
11348I0842r381j4070M582J8371J3653n37K4160L1304J055j8770j1305j4846j9646
11335I5412l286j952O003R114J1542j3533l0122M406q655k1455k999K1598K2324
11322H8397J86P084J4556K281q065j4581m376J1054j1461j7263K788K0309J8543
11309A09452j704k146q215J1867p734j8881K556R778J1291M887p820P76J3452
11296A17559J4747n976m549J0889N280j4917j7114j045R257N446k5842o013M28
11283H8150k688Q796o999j0182Q888J3047j1674r923K2144j5590j2865J1348K3449
11270A05901j3085k2579l611J1502j2128k031P381K3604M88n775j6857K557K7432
$$ plain form
11257 102799 68309 48501 37615 46300 35653 26839 17776 19766 20505 22228 38113 22088 17609
11244 17609 32752 35709 42241 59041 52104 51996 56701 38080 39308 39470 40989 55649 64278 54817
11230 54817 44421 53864 59144 51044 53331 55032 67515 72123 76620 75360 50686 36120 40159
11217 40159 48537 53524 64034 47723 45129 54320 56663 54299 31639 30786 22659 16849 31176 65262
11203 65262 80010 87707 73917 60100 54628 49444 48324 64288 77354 66080 49506 48585 65723
11190 65723 101548 110516 82987 91260 91572 91972 93041 94115 100371 91786 92109 105180 105827 107375 85213
11175 85213 74044 71982 67264 79462 60179 41588 65842 107875 128832 124293 116295 113746 127871
11162 127871 129553 135156 130101 125886 136677 136115 140931 154422 166954 176609 159967 153137 149407
$$ packed form
11257A02799l4490j9808j0886Q685j0647q814r063J990P39J723J5885j6025m479
11244A7609J5143K957O532J6800o937j08M705j8621J228J62J519J4660Q629r461
11230E4817j0396R443N280q100K287J701J2483M608M497j260k4674j4566M039
11217D0159Q378M987J0510j6311k594R191K343k364k2660q53q127n810J4327L4086
11203F5262J4748P697j3790j3817n472n184j120J5964J3066j1274j6574r21J7138
11190F5723L5825Q968k7529Q273L12M00J069J074O256q585L23J3071O47J548k2162
11175H5213j1169k062m718J2198j9283j8591K4254M2033K0957m539p998k549J4125
11162A27871J682N603n055m215J0791n62M816J3491J2532R655j6642o830l730
$$ plain form
11149 149407 154000 156261 173285 196424 212090 198944 222599 232880 241247 251408 244789 259757
11137 259757 285682 305927 344708 410823 454716 466862 483418 523335 572550 620616 696570
11126 696570 772269 833402 912387 1001765 1110635 1215135 1322106 1463056 1604803 1735704
11116 1735704 1842997 1967272 2102367 2217452 2301991 2385633 2455819 2529657 2610776 2709833
11106 2709833 2811437 2954713 3118384 3272983 3425767 3567702 3699671 3809690 3903482 3932561
11096 3932561 3931845 3910906 3843032 3748325 3649142 3561823 3468944 3389375 3298269 3237474 3199182 3160741
11084 3160741 3130286 3094111 3049528 3000611 2914291 2812267 2692890 2552828 2420900 2289427
11074 2289427 2148909 2016533 1899979 1782695 1706800 1647121 1597974 1537158 1492289 1454434
$$ packed form
11149A49407M593K261J7024K3139J5666j3146K3655J0281Q367J0161o619J4968
11137B59757K5925K0245L8781O6115M3893J2146J6556L9917M9215M8066P5954
11126F96570P5699O1133P8985Q9378J08870J04500J06971J40950J41747J30901
11116A735704J07293J24275J35095J15085Q4539Q3642P0186P3838Q1119R9057
11106B709833J01604J43276J63671J54599J52784J41935J31969J10019R3792K9079
11096C932561p16k0939o7874r4707r9183q7319r2879p9569r1106o0795l8292l8441
11084C160741l0455l6175m4583m8917q6320j02024j19377j40062j31928j31473
11074B289427j40518j32376j16554j17284p5895n9679m9147o0816m4869l7855
$$ plain form
11064 1454434 1425308 1427604 1447931 1470248 1506532 1564324 1640077 1723472 1817232 1920261 2030684
11053 2030684 2160951 2314922 2495555 2702887 2929459 3182107 3444398 3709732 4016689
11044 4016689 4310797 4593625 4881747 5172420 5457411 5766978 6087105 6408643 6733771
11035 6733771 7027868 7330916 7644337 7924729 8199906 8448478 8672450 8878425 9072222
11026 9072222 9241625 9390660 9552020 9734368 9890736 10033879 10126832 10170408 10154721 10100477
11016 10100477 9975977 9811348 9610253 9380883 9139808 8880171 8604647 8315171 8025465
11007 8025465 7726753 7453673 7233750 7009658 6800185 6616997 6408090 6172026 5917175
10998 5917175 5631960 5310700 4988673 4664935 4350440 4040499 3763236 3515796 3296689
$$ packed form
11064A454434k9126K296K0327K2317L6284N7792P5753Q3395R3760J03029J10423
11053B030684J30267J53971J80633K07332K26572K52648K62291K65334L06957
11044D016689K94108K82828K88122K90673K84991L09567L20127L21538L25128
11035F733771K94097L03048L13421K80392K75177K48572K23972K05975J93797
11026I072222J69403J49035J61360J82348J56368J43143R2953M3576j5687n4244
11016A0100477j24500j64629k01095k29370k41075k59637k75524k89476k89706
11007H025465k98712k73080k19923k24092k09473j83188k08907k36064k54851
10998E917175k85215l21260l22027l23738l14495l09941k77263k47440k19107
$$ plain form
10989 3296689 3100244 2939512 2796536 2682280 2609028 2556124 2507104 2474793 2474295 2494019 2544467
10978 2544467 2615217 2731454 2859893 3001783 3180577 3375777 3599247 3862650 4119115 4367783
10968 4367783 4646941 4936416 5209893 5464367 5696248 5884762 6067071 6251139 6435724
10959 6435724 6644088 6858628 7094133 7334879 7605416 7914070 8198960 8472439 8736465
10950 8736465 8990424 9215579 9370896 9468811 9513629 9523301 9459872 9348299 9198206 9046826
10940 9046826 8905289 8776790 8639373 8502845 8353167 8193302 8050438 7882499 7668678
10931 7668678 7410528 7144540 6860190 6559612 6274156 5990954 5705373 5415202 5127694
10922 5127694 4836594 4565958 4328626 4082721 3802327 3523464 3278818 3039615 2785730
$$ packed form
10989C296689j96445j60732j42976j14256p3252n2904m9020l2311m98J9724N0448
10978B544467P0750J16237J28439J41890J78794J95200K23470K63403K56465K48668
10968D367783K79158K89475K73477K54474K31881J88514J82309J84068J84585
10959F435724K08364K14540K35505K40746K70537L08654K84890K73479K64026
10950H736465K53959K25155J55317R7915M4818R672o3429j11573j50093j51380
10940I046826j41537j28499j37417j36528j49678j59865j42864j67939k13821
10931G668678k58150k65988k84350l00578k85456k83202k85581k90171k87508
10922E127694k91100k70636k37332k45905k80394k78863k44646k39203k53885
$$ plain form
10913 2785730 2546980 2345734 2184927 2052726 1932835 1814054 1681387 1576807 1510075 1464552
10903 1464552 1431688 1394663 1369532 1366068 1367442 1379471 1419210 1461542 1507502 1566672 1637661 1706786
10891 1706786 1799940 1896450 1981922 2069142 2165079 2244766 2337888 2424917 2489733 2547554 2569706
10880 2569706 2562096 2582016 2627223 2664512 2723728 2798689 2878104 2975411 3084025 3177647 3279432
10869 3279432 3358282 3412307 3436357 3416867 3340178 3260948 3151307 3023864 2886638 2759674
10859 2759674 2649865 2558035 2460101 2387937 2341302 2313623 2267963 2227617 2186960 2111472 2032299
10848 2032299 1938582 1816090 1683804 1576345 1465896 1347152 1228313 1086775 974765 894068
10838 894068 825071 748643 682117 612929 564496 523569 463013 409896 369071 325328 308005
$$ packed form
10913B785730k38750k01246j60807j32201j19891j18781j32667j04580o6732m5523
10903A464552l2864l7025k5131l464J374J2029L9739M2332M5960N9170P0989O9125
10891A706786R3154R6510Q5472Q7220R5937P9687R3122Q7029O4816N7821K2152
10880B569706p610J9920M5207L7289N9216P4961P9415R7307J08614R3622J01785
10869C279432P8850N4025K4050j9490p6689p9230j09641j27443j37226j26964
10859B759674j09809r1830r7934p2164m6635k7679m5660m0346m0657p5488p9173
10848B032299r3717j22492j32286j07459j10449j18744j18839j41538j12010q0697
10838H94068o8997p6428o6526o9188m8433m0927o0556n3117m0825m3743j7323
$$ plain form
10827 308005 280539 261570 261034 257719 263453 248390 224870 198518 168646 154368 161238 183296
10815 183296 203734 195885 179124 154818 140302 145069 146666 118993 95623 101495 111061 111830 105801
10802 105801 84638 70759 68689 86015 104521 120784 117953 118088 118310 104130 83225 67627 58893
10789 58893 58032 72373 62128 51337 45686 59918 78473 90244 74411 65568 74079 87013 106177
10776 106177 125340 131594 98391 68796 60874 67819 64927 58463 67336 70323 76601 62318 58761
10763 58761 54020 58279 52761 47713 44152 50308 34711 29988 47051 44556 44919 48540 45241 57302
10749 57302 69669 54189 49517 59964 54779 53719 57992 59574 62172 65278 62343 36046 30672
10736 30672 32161 42295 31380 19321 15633 12986 414 3419 8695 9180 8818 32966 52838
$$ packed form
10827C08005k7466j8969n36l315N734j5063k3520k6352k9872j4278O870K2058
10815A83296K0438p849j6761k4306j4516M767J597k7673k3370N872R566P69o029
10802A05801k1163j3879k070J7326J8506J6263k831J35K22j4180k0905j5598q734
10789E8893q61J4341j0245j0791n651J4232J8555J1771j5833q843Q511J2934J9164
10776A06177J9163O254l3203k9595p922O945k892o464Q873K987O278j4283l557
10763E8761m741M259n518n048l561O156j5597m723J7063k495L63L621l299J2061
10749E7302J2367j5480m672J0447n185j060M273J582K598L106k935k6297n374
10736C0672J489J0134j0915j2059l688k647j2572L005N276M85l62K4148J9872
$$ plain form
10723 52838 36200 34113 41376 38284 32334 42354 72274 103371 99140 106600 99572 95775 104362
10710 104362 105943 83541 67340 55301 57367 62647 68059 73131 74062 61017 57885 64207 68518
10697 68518 69824 57522 57405 82414 105222 112862 112197 112268 100160 108447 102223 81852 76647 82272
10683 82272 95035 101150 97800 104392 99478 97418 80874 75015 120157 122264 102242 97944 111218
10670 111218 104698 95388 94617 93084 101391 98135 111126 117731 111575 95907 104707 111141 104992 135960
10656 135960 157450 177410 214988 248214 262497 266768 278235 317169 346036 308988 272718 263804
10644 263804 264287 279014 274507 296120 300627 312228 331989 366689 416193 476352 549249 601447
10632 601447 661776 740413 800992 834362 896932 972846 1080034 1250904 1456515 1740392 2144478
$$ packed form
10723E2838j6638k087P263l092n950J0020K9920L1097m231P460p028l797Q587
10710A04362J581k2402j6201j2039K066N280N412N072R31j3045l132O322M311
10697F8518J306j2302j17K5009K2808P640o65P1j2108Q287o224k0371n205N625
10683H2272J2763O115l350O592m914k060j6544n859M5142K107k0022m298J3274
10670A11218o520r310p71j533Q307l256J2991O605o156j5668Q800O434o149L0968
10656A35960K1490J9960L7578L3226J4283M271J1467L8934K8867l7048l6270q914
10644B63804M83J4727m507K1613M507J1601J9761L4700M9504O0159P2897N2198
10632F01447O0329P8637O0579L3370O2570P5914J07188J70870K05611K83877M04086
$$ plain form
10621 2144478 2701384 3468912 4513704 5878430 7562852 9355340 10818621 11489674 11307509
10612 11307509 10654854 10029423 9759866 10019374 10942218 12646443 15263129 18692506 22406606
10603 22406606 25099602 25564496 23897098 21323782 19070090 17730148 17494022 18422609
10595 18422609 20634097 24153853 28688970 33221977 35894640 35111042 31345378 26625025
10587 26625025 22568936 19749792 18246721 17930781 18735900 20529684 22982370 25291679
10579 25291679 26109193 24557930 21225833 17485371 14386380 12243475 10968634 10421884
10571 10421884 10442102 10869502 11518516 11986227 11800993 10713133 8998357 7182119 5601662
10562 5601662 4387851 3501022 2848511 2368826 2009804 1727188 1499483 1317465 1182750
$$ packed form
10621B144478N56906P67528J044792J364726J684422J792488J463281O71053j82165
10612A1307509o52655o25431k69557K59508R22844J704225K616686L429377L714100
10603B2406606K692996M64894j667398k573316k253692j339942k36126R28587
10595A8422609K211488L519756M535117M533007K672663p83598l765664m720353
10587B6625025m056089k819144j503071l15940Q05119J793784K452686K309309
10579B5291679Q17514j551263l332097l740462l098991k142905j274841n46750
10571A0421884K0218M27400O49014M67711j85234j087860j714776j816238j580457
10562E601662j213811q86829o52511m79685l59022k82616k27705j82018j34715
$$ plain form
10553 1182750 1069873 958956 867837 796287 731851 675048 614581 556849 514904 478682 435010
10542 435010 413390 379514 338031 307356 286486 266731 233572 218546 220445 214739 204653 187594
10530 187594 177169 171053 162163 165002 146304 140283 144582 157090 160259 152657 124239 120924 125869
10517 125869 133659 138162 139220 132738 111292 109410 114167 101572 99269 100817 102364 113258 121550
10504 121550 125516 113943 95062 85989 99254 97040 93309 95162 91320 89781 94152 99689 86686
10491 86686 51713 66151 76322 69447 75169 91985 82967 67970 75439 89246 74959 81955 85826
10478 85826 65012 49752 54155 69003 73809 66632 43560 44012 42208 48274 39290 51868 60449
10465 60449 85845 96222 96494 80351 73888 70470 72896 84693 113630 109526 75571 52497 48994
$$ packed form
10553A182750j12877j10917r1119p1550o4436n6803o0467n7732m1945l6222m3672
10542D35010k1620l3876m1483l0675k0870j9755l3159j5026J899n706j0086j7059
10530A87594j0425o116q890K839j8698o021M299J2508L169p602k8418l315M945
10517A25869P790M503J058o482k1446j882M757j2595k303J548J547J0894Q292
10504A21550L966j1573j8881r073J3265k214l731J853l842j539M371N537j3003
10491H6686l4973J4438J0171o875N722J6816r018j4997P469J3807j4287O996L871
10478H5826k0814j5260M403J4848M806p177k3072M52j804O066q984J2578Q581
10465F0449K5396J0377K72j6143o463l418K426J1797K8937m104l3955k3074l503
$$ plain form
10452 48994 67137 80025 74524 80703 83918 84856 92477 78486 78059 68198 45432 37330 48367 76974
10438 76974 71373 67581 68879 62592 66022 69735 77698 70449 48669 46982 40453 30903 38773 48903
10424 48903 54010 62914 72083 79194 61219 39948 34508 44248 38984 49776 78801 78466 54271
10411 54271 54845 56134 37674 33111 27460 22661 34007 35218 34528 24997 11158 -1952 7536 5631
10397 5631 10939 25070 22306 32841 41648 54661 50860 39542 37163 32700 24112 3045 11254
10384 11254 20495 9717 19824 36968 32466 34354 60713 45244 25676 43909 62265 70842
10372 70842 59949 50146 55645 48738 51686 39756 33425 17496 23823 39947 63475 59496 46437
10359 46437 45152 46985 46125 39882 36463 50631 70259 80302 76615 65814 35211 6678 -8743
$$ packed form
10452D8994J8143J2888n501O179L215R38P621j3991m27r861k2766q102J1037K8607
10438G6974n601l792J298o287L430L713P963p249k1780j687o529r550P870J0130
10424D8903N107Q904R169P111j7975k1271n440R740n264J0792K9025l35k4195
10411E4271N74J289j8460m563n651m799J1346J211o90r531j3839j3110R488j905
10397E631N308J4131k764J0535Q807J3013l801j1318k379m463q588k1067Q209
10384A1254R241j0778J0107J7144m502J888K6359j5469j9568J8233J8356Q577
10372G0842j0893r803N499o907K948j1930o331j5929O327J6124K3528l979j3059
10359D6437j285J833q60o243l419J4168J9628J0043l687j0801l0603k8533j5421
$$ plain form
10346 -8743 -14751 5119 20793 33106 32332 30116 15528 4271 33030 49446 37002 23871 21012
10333 21012 31194 24237 26682 21015 12167 9 -4997 -8866 -5227 -3195 25697 38898 30732
10320 30732 23214 19234 12295 12594 10742 21145 27166 22451 9417 14629 25592 34641 27211 19283
10306 19283 33090 44625 10539 -8703 -18908 -25526 -6292 -6414 499 14844 25492 38060
10294 38060 50473 56855 36232 19935 -4682 -13404 -2634 7838 9174 15036 16580 24218 13383
10281 13383 -14358 2314 14396 25177 17500 8295 7730 12615 12756 7452 2573 22243 16234 19312
10267 19312 9859 18394 20220 20310 29504 31331 29405 -39 2692 5668 3061 -8693 2431 10504
10253 10504 21367 16276 9332 8836 288 -5440 -5329 -4449 5362 17155 22916 19145 5182 -18276
$$ packed form
10346h743o008J9870J5674J2313p74k216j4588j1257K8759J6416j2444j3131k859
10333B1012J0182o957K445n667q848j2158n006l869L639K032K8892J3201q166
10320C0732p518l980o939K99j852J0403O021m715j3034N212J0963R049p430p928
10306A9283J3807J1535l4086j9242j0205o618J9234j22O913J4345J0648J2568
10294C8060J2413O382k0623j6297k4617q722J0770J0472J336N862J544P638j0835
10281A3383k7741J6672J2082J0781p677r205n65M885J41n304m879J9670o009L078
10267A9312r453Q535J826R0R194J827j926k9444K731K976k607j1754J1124Q073
10253A0504J0863n091o944m96q548n728J11Q80R811J1793N761l771j3963k3458
$$ plain form
10239 -18276 -23956 -15973 2629 8229 4942 -3468 -2869 -13380 5020 27906 41032 24901 20559
10226 20559 25522 11702 -3871 11749 13143 10760 -3399 -15664 -15011 -23509 -18535 -11426 -6558
10213 -6558 22298 24692 12875 -12579 -20853 -20451 -25512 -23033 -9243 -11329 -17662 -20007 -7105 -12513
10199 -12513 -20538 -14667 -1927 -21420 -27203 -13012 -1758 -11444 -7288 -530 13911 6281 9227
10186 9227 6675 6426 23225 46765 44443 48514 79372 90019 72726 71189 89550 83071 62877
10173 62877 63352 78448 93401 95163 115185 130975 135897 130569 136310 134019 129782 138062 126584
10160 126584 88853 83167 112278 149751 172589 204030 221101 199136 159348 127709 107201 95642
10148 95642 94392 109777 114295 140717 155298 138510 138668 135223 120814 97759 68257 52098 49297
$$ packed form
10239a8276n680P983J8602N600l287q410N99j0511J8400K2886J3126j6131m342
10226B0559M963j3820j5573J5620J394k383j4159j2265O53q498M974P109M868
10213f558K8856K394j1817k5454q274M02n061K479J3790k086o333k345J2902n408
10199a2513q025N871J2740j9493n783J4191J1254r686M156O758J4441p630K946
10186I227k552k49J6799K3540k322M071L0858J0647j7293j537J8361o479k0194
10173F2877M75J5096J4953J762K0022J5790M922n328N741k291m237Q280j1478
10160A26584l7731n686K9111L7473K2838L1441J7071k1965l9788l1639k0508j1559
10148I5642j250J5385M518K6422J4581j6788J58l445j4409k3055k9502j6159k801
$$ plain form
10135 49297 44423 62796 93524 92697 84319 82901 55464 24926 13182 7589 11090 26289 23498
10122 23498 -12841 -30202 -14900 -29963 -41948 -17627 6162 4865 2117 5014 5961 4310 401
10109 401 -5969 -12214 -1656 6237 5753 -13401 -14179 -5629 -17425 -15903 1369 -4287 -2825 20190
10095 20190 17433 21758 10742 6523 8933 26298 23082 20966 17549 7492 25600 20567 20927 41962
10081 41962 34651 19088 4559 -1100 167 10569 6378 4446 18983 12233 11801 15770 28210
10068 28210 42180 30340 19421 6525 518 -14710 -14116 -330 11611 20450 19579 8614 -29032
10055 -29032 -53824 -35133 -20085 -12785 -23252 -27589 -15657 -612 3801 1234 15784 18788 11104
10042 11104 -7793 -16738 -18088 -17969 -14113 -20483 -40272 -45238 -32609 -22220 -15856 4425 16449
$$ packed form
10135D9297m874J8373L0728q27q378j418k7437l0538j1744n593L501J5199k791
10122B3498l6339j7361J5302j5063j1985K4321K3789j297k748K897R47j651l909
10109D01o370o245J0558P893m84j9154p78Q550j1796J522J7272n656J462K3015
10095B0190k757M325j1016m219K410J7365l216k116l417j0057J8108n033L60K1035
10081D1962p311j5563j4529n659J267J0402m191j932J4537o750m32L969J2440
10068B8210J3970j1840j0919j2896o007j5228N94J3786J1941Q839q71j0965l7646
10055b9032k4792J8691J5048P300j0467m337J1932J5045M413k567J4550L004p684
10042A1104j8897q945j350J19L856o370j9789m966J2629J0389O364K0281J2024
$$ plain form
10029 16449 10255 6113 6158 8121 5444 -6590 -6366 -15537 -4667 -5500 -4004 -5838 3062 18505 8080
10014 8080 -3383 -11208 -35778 -31806 -22916 -24194 -23092 5502 24405 25557 7801 -14478 -26591
10001 -26591 -38993 -39713 -2506 10500 5172 -563 -10415 -25100 -12377 -6843 -16760 -26674 -19964
9988 -19964 -28920 -49882 -33824 -19624 -19790 -22280 -26518 -29045 -16323 -13340 -4921 -13932 -41705 -40340
9974 -40340 -30810 -20353 -1210 19877 16629 9692 -1159 -17887 -21989 -2760 -5999 -5646 5395
9961 5395 12703 13258 14450 5818 -4822 7460 18676 -5204 -23069 -36840 -42047 -41175 -38872 -46213
9947 -46213 -19018 -15117 -35234 -34666 -30026 -27125 -2120 11291 6688 8335 -3228 11574 24287
9934 24287 7684 5551 19316 33214 31844 13050 -3971 75 9534 13079 2806 -19782 -35589
$$ packed form
10029A6449o194m142M5J963k677j2034K24r171J0870q33J496j834Q900J5443j0425
10014H080j1463p825k4570L972Q890j278J102K8594J8903J152j7756k2279j2113
10001b6591j2402p20L7207J3006n328n735r852j4685J2723N534r917r914O710
9988a9964q956k0962J6058J4200j66k490m238k527J2722K983Q419r011k7773J365
9974d0340R530J0457J9143K1087l248o937j0851j6728m102J9229l239L53J1041
9961E395P308N55J192q632j0640J2282J1216k3880j7865j3771n207Q72K303p341
9947d6213K7195L901k0117N68M640K901K5005J3411m603J647j1563J4802J2713
9934B4287j6603k133J3765J3898j370j8794j7021M046R459L545j0273k2588j5807
$$ plain form
9921 -35589 -34465 -12054 -277 16803 19279 14172 6926 2773 3770 5476 17996 19860 -2115 -19276
9907 -19276 -15091 -21985 -21808 -18782 10179 16332 21829 13630 -18858 -14813 -17154 -23749 -17322 2979
9893 2979 -1539 -13326 -33577 -46356 -39690 -29364 -35111 -25982 -5529 13873 13853 -5687 5285
9880 5285 27939 43703 38992 34915 31461 29617 30672 29826 24483 17033 6652 14595 9743 10680 5005
9865 5005 5057 -784 13994 21635 39448 40176 32164 6913 5236 14025 19614 29562 34753 19457 17046
9850 17046 25913 34097 35991 39184 48175 55584 56121 65337 77475 71473 62876 55487 43965 38399
9836 38399 35067 32893 34146 19561 33847 49057 38879 18404 13964 23721 25042 36174 46826
9823 46826 40038 10845 -4554 -3591 6802 20716 36107 39820 18594 28422 27182 32612 27902
$$ packed form
9921c5589J124K2411J1777J7080K476n107p246m153R97J706J2520J864k1975j7161
9907a9276M185o894J77L026K8961O153N497q199l2488M045k341o595O427K0301
9893B979m518j1787k0251j2779O666J0326n747R129K0453J9402k0j9540J0972
9880E285K2654J5764m711m077l454j844J055q46n343p450j0381P943m852R37n675
9865E005N2n841J4778P641J7813P28q012k5251j677Q789N589R948N191j5296k411
9850A7046Q867Q184J894L193Q991P409N37R216J2138o002q597p389j1522n566
9836C8399l332k174J253j4585J4286J5210j0178k0475m440R757J321J1132J0652
9823D6826o788k9193j5399R63J0393J3914J5391L713k1226R828j240N430m710
$$ plain form
9810 27902 29290 30728 33909 39368 42777 38253 48153 35359 16857 19830 22363 24476 38238 38043
9796 38043 45583 61801 67687 62709 61488 35639 28264 41521 40638 37186 31345 43695 39255 16082
9782 16082 -2170 17558 25542 42246 54146 27905 6267 27110 46868 19966 8620 49770
9770 49770 54307 41593 32662 24465 31325 35121 37443 65766 70081 66814 69472 74247 70926 71413
9756 71413 61244 56406 75245 101828 104845 99106 105086 131418 146292 183210 249007 337771 397599
9743 397599 427488 425994 403819 356951 282826 195712 130011 113728 108629 100063 88079 72861
9731 72861 60206 64982 52748 53285 45869 37789 40616 44915 49411 48576 49523 39034 39473 54005 50461
9716 50461 39985 32387 36691 56821 66747 51646 47212 45709 45845 50109 50107 46041 43711 24762 21379
$$ packed form
9810B7902J388J438L181N459L409m524R900j2794j8502K973K533K113J3762j95
9796C8043P540J6218N886m978j221k5849p375J3257q83l452n841J2350m440k3173
9782A6082j8252J9728P984J6704J1900k6241k1638K0843J9758k6902j1346M1150
9770D9770M537j2714q931q197O860L796K322K8323M315l267K658M775l321M87
9756G1413j0169m838J8839K6583L017n739N980K6332J4874L6918O5797Q8764N9828
9743C97599K9889j494k2175m6868p4125q7114o5701j6283n099q566j1984j5218
9731G2861j2655M776j2234N37p416q080K827M299M496q35R47j0489M39J4532l544
9716E0461j0476p598M304K0130R926j5101m434j503J36M264km066k330j8949l383
$$ plain form
9701 21379 22304 37357 40452 25894 17017 504 6742 9795 5912 16785 15063 13855 15474 21149
9687 21149 24702 24156 13342 11899 6958 13736 39323 49262 41722 51215 50608 29872 36793 30758
9673 30758 19734 16901 47400 70547 48015 21616 1626 20813 47332 68196 64642 46881
9661 46881 46087 28147 11650 15835 25145 24325 45179 73032 75525 71380 91716 147928 182298
9648 182298 144590 94475 66150 48221 34664 10677 -7934 -3814 -853 12048 19242 12433
9636 12433 13381 3970 -5601 8093 12930 31086 48865 41113 38664 39007 40677 44495 42774 29919
9622 29919 24441 29733 43988 35910 17187 11484 17975 34638 21611 15488 34410 44671 55087
9609 55087 67230 67936 59726 40964 36437 46460 52542 46941 53318 41707 48375 50167 47134 57681
$$ packed form
9701B1379R25J5053L095j4558q877j6513O238L053l883J0873j722j208J619N675
9687B1149L553n46j0814j443m941O778K5587R939p540R493o07k0736O921o035
9673C0758j1024k833L0499K3147k2532k6399j9990J9187K6519K0864l554j7761
9661D6881p94j7940j6497M185R310q20K0854K7853K493m145K0336N6212L4370
9648A82298l7708n0115k8325j7929j3557k3987j8611M120K961J2901P194o809
9636A2433R48r411r571J3694M837J8156J7779p752k449L43J670L818j721j2855
9622B9919n478N292J4255q078j8723n703O491J6663j3027o123J8922J0261J0416
9609E5087J2143P06q210j8762m527J0023O082n601O377j1611O668J792l033J0547
$$ plain form
9595 57681 54737 56706 66257 62416 61709 56236 46050 47948 59082 52213 32189 33899 39052 55665
9581 55665 55914 56535 50643 51207 50967 63458 47704 37430 34718 57276 76779 81970 73929 46182
9567 46182 50501 79854 68140 66533 62273 64139 68652 56648 57494 74905 74355 76604 74187 62306
9553 62306 65390 54200 67967 83544 86183 83761 86239 98093 104511 104466 106622 100990 83863 79476
9539 79476 81940 86505 79151 77725 63382 56908 66305 72348 79949 86110 98408 104861 112607 108367
9525 108367 98323 82404 98036 123516 131017 122167 120628 125365 130177 124427 124762 119548 101811
9512 101811 109225 115629 116355 135252 149373 142347 173917 181117 180251 160962 160778 178290 173386 175353
9498 175353 182277 202629 202318 212539 211273 219030 223279 241600 252736 271158 298547 315178 344160
$$ packed form
9595E7681k944J969R551l841p07n473j0186J898J1134o869k0024J710N153J6613
9581E5665K49O21n892N64k40J2491j5754j0274k712K2558J9503N191q041k7747
9567D6182M319K9353j1714j607m260J866M513j2004Q46J7411n50K249k417j1881
9553F2306L084j1190J3767J5577K639k422K478J1854O418m5K156n632j7127m387
9539G9476K464M565p354j426j4343o474R397O043P601O161J2298O453P746m240
9525A08367j0044j5919J5632K5480P501q850j539M737M812n750L35n214j7737
9512A01811P414O404P26J8897J4121p026L1570P200q66j9289j84J7512m904J967
9498A75353O924K0352l11J0221j266P757M249J8321J1136J8422K7389J6631K8982
$$ plain form
9485 344160 347292 353852 371173 404743 438847 474513 510443 539731 568211 613810 669696 731875
9473 731875 793292 871589 953344 1025082 1122476 1236899 1372971 1488671 1622090 1754694 1894087
9462 1894087 2066650 2263521 2462155 2636616 2819826 3020309 3228627 3438813 3643172 3845050
9452 3845050 4066639 4292365 4542515 4795050 5032436 5291479 5578378 5861972 6146542 6456462
9442 6456462 6753821 7023102 7282946 7539317 7784638 8004082 8194277 8384658 8546364 8694598
9432 8694598 8836016 8971352 9071725 9171471 9259317 9336340 9420949 9507558 9522510 9526365 9516403
9421 9516403 9486704 9433631 9361575 9267653 9155369 9031228 8889435 8726730 8566075 8374108
9411 8374108 8142813 7908187 7671613 7416650 7156912 6885467 6601668 6330792 6055316 5790523
$$ packed form
9485C44160L132O560J7321L3570L4104L5666L5930K9288K8480M5599N5886O2179
9473G31875O1417P8297Q1755P1738R7394J14423J36072J15700J33419J32604J39393
9462A894087J72563J96871J98634J74461J83210K00483K08318K10186K04359K01878
9452C845050K21589K25726K50150K52535K37386K59043K86899K83594K84570L09920
9442F456462K97359K69281K59844K56371K45321K19444J90195J90381J61706J48234
9432H694598J41418J35336J00373R9746Q7846P7023Q4609Q6609J4952L855r962
9421I516403k9699n3073p2056r3922j12284j24141j41793j62705j60655j91967
9411H374108k31295k34626k36574k54963k59738k71445k83799k70876k75476k64793
$$ plain form
9401 5790523 5530647 5273503 5029509 4783672 4559178 4333915 4147122 3981429 3837965 3709039
9391 3709039 3589563 3475388 3383940 3304566 3258639 3240526 3212697 3228991 3261297 3312802 3406960
9380 3406960 3535748 3664156 3793901 3971914 4173226 4382858 4607118 4832951 5081029 5363553
9370 5363553 5641739 5920155 6198905 6518406 6851333 7181965 7523037 7861252 8204413 8574727
9360 8574727 8950797 9337904 9726489 10099110 10470427 10836996 11178913 11488592 11791718 12104955
9350 12104955 12403999 12668061 12899658 13090810 13242968 13368558 13450595 13529316 13570608 13609569
9340 13609569 13626080 13605425 13542234 13460813 13338910 13180302 12991457 12771889 12509714 12202140
9330 12202140 11851334 11471089 11070929 10655979 10233167 9792243 9313806 8811599 8295751
$$ packed form
9401E790523k59876k57144k43994k45837k24494k25263j86793j65693j43464j28926
9391C709039j19476j14175r1448p9374m5927j8113k7829J6294L2306N1505R4158
9380C406960J28788J28408J29745J78013K01312K09632K24260K25833K48078K82524
9370E363553K78186K78416K78750L19501L32927L30632L41072L38215L43161L70314
9360H574727L76070L87107L88585L72621L71317L66569L41917L09679L03126L13237
9350A2104955K99044K64062K31597J91152J52158J25590Q2037P8721M1292L8961
9340A3609569J6511k0655o3191q1421j21903j58608j88845k19568k62175l07574
9330A2202140l50806l80245m00160m14950m22812m40924m78437n02207n15848
$$ plain form
9321 8295751 7782387 7288450 6810969 6350857 5923536 5509445 5128110 4776772 4426937 4104984
9311 4104984 3821837 3547947 3299711 3046365 2812597 2606692 2429681 2263739 2091353 1909566
9301 1909566 1734048 1591377 1473077 1363184 1262056 1157479 1065787 981021 909680 864578
9291 864578 816616 744905 703030 677390 647822 623797 600369 558524 522954 507103 492294 462799
9279 462799 441060 415820 412025 415847 400941 392030 379735 380574 379883 366741 338707 306730 295867
9266 295867 314167 319516 317850 286410 261984 258819 255135 254758 257558 257604 251579 230212 204890 202661
9252 202661 195479 195374 201515 189813 178589 172876 182726 178890 173827 182466 185751 187480 184611 180100
9238 180100 164810 182952 200738 177329 146598 161670 190018 193103 193316 197014 184349 185200 177263
$$ packed form
9321H295751n13364m93937m77481m60112m27321m14091l81335l51338l49835l21953
9311D104984k83147k73890k48236k53346k33768k05905j77011j65942j72386j81787
9301A909566j75518j42671j18300j09893j01128j04577r1692q4766p1341m5102
9291H64578m7962p1711m1875k5640k9568k4025k3428m1845l5570j5851j4809k9495
9279D62799k1739k5240l795L822j4906q911j2295Q39o91j3142k8034l1977j0863
9266B95867J8300N349j666l1440k4426l165l684l77K800M6o025k1367k5322k229
9252B02661p182j05O141j1702j1224n713R850l836n063Q639L285J729k869m511
9238A80100j5290J8142J7786k3409l0731J5072K8348L085K13L698j2665Q51p937
$$ plain form
9225 177263 179553 204941 215705 227968 209525 189677 189874 200284 217764 224003 217870 223424 219251
9212 219251 224090 222142 213683 204183 215219 230314 228279 209791 203766 201208 202441 194408 197214 196278
9198 196278 197463 174476 177061 197772 221069 238830 267713 273020 271767 253733 242626 230619
9186 230619 217109 213367 209326 213650 221918 211600 189218 177537 161977 152624 144972 151108 170334
9173 170334 174104 138542 135098 167024 166010 152116 135802 112022 118308 129026 136244 118262 108817
9160 108817 109790 104659 95734 108491 113686 119042 104666 95516 94030 94977 100196 110640 110894 97410
9146 97410 70451 79204 95447 96423 114001 115304 110893 103683 112321 111899 103034 88163 82795 87518
9132 87518 101350 112992 109176 110645 100785 127423 132950 142502 132903 101798 77688 81254 78117
$$ packed form
9225A77263K290K5388J0764J2263j8443j9848J97J0410J7480O239o133N554m173
9212B19251M839j948q459r500J1036J5095k035j8488o025k558J233q033K806r36
9198A96278J185k2987K585K0711K3297J7761K8883N307j253j8034j1107j2007
9186B30619j3510l742m041M324Q268j0318k2382j1681j5560r353p652O136J9226
9173A70334L770l5562l444L1926j014j3894j6314k3780O286J0718P218j7982r445
9160A08817R73n131q925J2757N195N356j4376r150j486R47N219J0444K54j3484
9146I7410k6959Q753J6243R76J7578J303m411p210Q638m22q865j4871n368M723
9132H7518J3832J1642l816J469r860K6638N527R552r599l1105k4110L566l137
$$ plain form
9119 78117 121893 148293 148163 142859 129338 135206 137488 125514 105314 108649 95845 74524 109691
9106 109691 129995 128293 118585 121737 128465 118629 94607 95492 78628 83701 89469 70027 46688
9093 46688 59258 100825 111352 105187 97817 89872 84419 77955 88147 91830 82801 58436 52150
9080 52150 53789 45093 56515 62069 59019 86709 96026 84090 78975 81592 73466 72935 85412 82077
9066 82077 84448 90279 100872 108162 89781 75650 74953 80072 74672 75034 77672 75968 69871 85659
9052 85659 81557 75468 89836 95012 108232 124113 137595 141925 137682 134783 131822 132579 147897 155719
9038 155719 151448 153302 149250 135999 119047 113924 140538 155749 164209 160486 183500 189605 193615
9025 193615 200718 197184 190058 188002 195569 185019 204582 236252 241190 251090 263091 280034 291990
$$ packed form
9119G8117M3776K6400j30n304j3521N868K282j1974k0200L335j2804k1321L5167
9106A09691K0304j702r708L152O728r836k4022Q85j6864N073N768j9442k3339
9093D6688J2570M1567J0527o165p370p945n453o464J0192L683r029k4365o286
9080E2150J639q696J1422N554l050K7690R317j1936n115K617q126n31J2477l335
9066H2077K371N831J0593P290j8381j4131o97N119n400L62K638j704o097J5788
9052H5659m102o089J4368N176J3220J5881J3482M330m243k899k961P57J5318P822
9038A55719m271J854m052j3251j6952n123K6614J5211Q460l723K3014O105M010
9025A93615P103l534p126k056P567j0550J9563L1670M938R900J2001J6943J1956
$$ plain form
9012 291990 325393 349028 356766 360111 377919 400186 440532 490635 535809 567777 626499 686942
9000 686942 756596 831804 940186 1081949 1228478 1377356 1550337 1751313 1973560 2207043
8990 2207043 2497240 2757276 3006597 3233635 3403921 3486594 3488497 3406556 3237877 3042143
8980 3042143 2859115 2670258 2457732 2301222 2193070 2105270 2037515 1993436 1990737 2035110 2096029
8969 2096029 2200227 2322778 2506621 2731954 2915552 3099673 3294885 3448364 3574181 3624191
8959 3624191 3605607 3531679 3377405 3200575 3006257 2796945 2591530 2383321 2203177 2041836
8949 2041836 1889766 1742827 1580212 1467695 1374184 1316715 1250323 1180092 1130690 1097959 1098325
8938 1098325 1110576 1093765 1071459 1099769 1112859 1124938 1152678 1207267 1253797 1315821 1392481
$$ packed form
9012B91990L3403K3635P738L345J7808K2267M0346N0103M5174L1968N8722O0443
9000F86942O9654P5208J08382J41763J46529J48878J72981K00976K22247K33483
8990B207043K90197K60036K49321K27038J70286Q2673J903q1941j68679j95734
8980C042143j83028j88857k12526j56510j08152q7800o7755m4079k699M4373O0919
8969B096029J04198J22551J83843K25333J83598J84121J95212J53479J25817N0010
8959C624191j8584p3928j54274j76830j94318k09312k05415k08209j80144j61341
8949B041836j52070j46939j62615j12517r3511n7469o6392p0231m9402l2731L66
8938A098325J2251j6811k2306K8310J3090J2079K7740N4589M6530O2024P6660
$$ plain form
8927 1392481 1478046 1585121 1723473 1866778 2047279 2262934 2511268 2826464 3170471 3584461
8917 3584461 4062873 4620206 5231911 5863836 6477688 7020629 7454509 7729863 7871662 7908156
8907 7908156 7872643 7841894 7772329 7673588 7536273 7373413 7195582 7009789 6844140 6694800
8897 6694800 6567166 6500075 6491167 6576402 6722359 6906122 7156722 7466220 7789626 8118323
8887 8118323 8418520 8640664 8734821 8717945 8581513 8364218 8120594 7844177 7560960 7283152
8877 7283152 6987598 6677129 6359131 6024177 5733974 5439091 5150943 4875260 4606907 4342728
8867 4342728 4085920 3833977 3599381 3392856 3200494 2995169 2795458 2590818 2434574 2309111
8857 2309111 2154033 2024216 1937930 1889099 1849401 1822578 1807527 1800966 1803539 1819866 1858382
$$ packed form
8927A392481Q5565J07075J38352J43305J80501K15655K48334L15196L44007M13990
8917C584461M78412N57333O11705O31925O13852N42941M33880K75354J41799L6494
8907G908156l5513l0749o9565r8741j37315j62860j77831j85793j65649j49340
8897F694800j27634o7091q908Q5235J45957J83763K50600L09498L23406L28697
8887H118323L00197K22144R4157j6876j36432k17295k43624k76417k83217k77808
8877G283152k95554l10469l17998l34954k90203k94883k88148k75683k68353k64179
8867D342728k56808k51943k34596k06525j92362k05325j99711k04640j56244j25463
8857B309111j55078j29817q6286m8831l9698k6823j5051o561K573J6327L8516
$$ plain form
8846 1858382 1940576 2039906 2154832 2282365 2439019 2632619 2863994 3133637 3448438 3790634
8836 3790634 4188975 4663991 5175292 5750549 6391330 7058292 7746574 8447862 9057944 9507452
8826 9507452 9785313 9866143 9765382 9543719 9216301 8828871 8424540 8021365 7646341 7318068
8816 7318068 7009699 6761773 6610575 6533489 6561453 6650046 6843940 7132290 7502167 7958832
8806 7958832 8452508 8982787 9491280 9914810 10206917 10279926 10141943 9794708 9306168 8739291
8796 8739291 8147314 7548550 6957952 6366001 5822326 5326772 4850733 4413351 4029899 3702806
8786 3702806 3401539 3134389 2918861 2743534 2558708 2364594 2181521 2030802 1919277 1817413
8776 1817413 1742205 1653665 1572908 1503508 1454881 1418091 1384245 1366434 1354120 1357474 1358183 1359402
$$ packed form
8846A858382Q2194R9330J14926J27533J56654J93600K31375K69643L14801L42196
8836C790634L98341M75016N11301N75257O40781O66962O88282P01288O10082M49508
8826I507452K77861Q0830j00761k21663l27418l87430m04331m03175l75024l28273
8816G318068l08369k47926j51198p7086K7964Q8593J93894K88350L69877M56665
8806G958832M93676N30279N08493M23530K92107P3009j37983l47235m88540n66877
8796H739291n91977n98764n90598n91951n43675m95554m76039m37382l83452l27093
8786C702806l01267k67150k15528j75327j84826j94114j83073j50719j11525j01864
8776A817413p5208q8540q0757o9400m8627l6790l3846j7811j2314L354P09J219
$$ plain form
8764 1359402 1371773 1396057 1427527 1456851 1512378 1600512 1722960 1838888 1959326 2097065 2266663
8753 2266663 2469940 2723025 3016936 3317219 3649152 3988839 4328193 4637913 4879136 5025466
8743 5025466 5087850 5050324 4918234 4671926 4381636 4089406 3838005 3606862 3409851 3247614
8733 3247614 3130559 3105597 3113269 3185502 3321056 3484966 3670174 3899240 4156564 4420621
8723 4420621 4685186 4906822 5069579 5155390 5150139 5022680 4807805 4517577 4169035 3811642
8713 3811642 3464948 3166412 2908555 2704016 2578834 2500344 2458453 2462439 2497933 2570483 2674853
8702 2674853 2850937 3080728 3345830 3665200 4023132 4417232 4761548 5043734 5241344 5377735
8692 5377735 5426025 5406497 5346708 5280849 5233966 5275308 5419125 5678795 6073926 6619952 7278849
$$ packed form
8764A359402J2371K4284L1470K9324N5527Q8134J22448J15928J20438J37739J69598
8753B266663K03277K53085K93911L00283L31933L39687L39354L09720K41223J46330
8743E025466O2384l7526j32090k46308k90290k92230k51401k31143j97011j62237
8733C247614j17055k4962P672P2233J35554J63910J85208K29066K57324K64057
8723D420621K64565K21636J62757Q5811n251j27459k14875k90228l48542l57393
8713C811642l46694k98536k57857k04539j25182p8490m1891L986L5494P2550J04370
8702B674853J76084K29791K65102L19370L57932L94100L44316K82186J97610J36391
8692E377735M8290j9528n9789o5859m6883M1342J43817K59670L95131N46026O58897
$$ plain form
8681 7278849 7990261 8641377 9076228 9178258 8927114 8370644 7638851 6862921 6146736 5538230
8671 5538230 5035744 4649651 4391586 4264632 4259466 4340173 4519325 4733534 4937834 5089260
8661 5089260 5084870 4876408 4492415 4025899 3558865 3138735 2777994 2486114 2266764 2075618
8651 2075618 1919599 1795081 1686808 1596799 1549465 1516281 1475713 1452832 1433796 1424148 1449603
8640 1449603 1496270 1526599 1537232 1570854 1598058 1634610 1658801 1705320 1778590 1860902 1944823
8629 1944823 2049753 2202381 2376811 2572872 2771126 2977189 3170631 3350747 3485761 3565286
8619 3565286 3602451 3613231 3600564 3587812 3621542 3698937 3817005 3983171 4213192 4519454 4920329
8608 4920329 5385857 5895874 6401309 6835641 7111315 7164752 6987349 6667521 6224070 5733483
$$ packed form
8681G278849P11412O51116M34851J02030k51144n56470p31793p75930p16185o08506
8671E538230n02486l86093k58065j26954n166Q0707J79152K14209K04300J51426
8661E089260m390k08462l83993m66516m67034m20130l60741k91880k19350j91146
8651B075618j56019j24518j08273r0009m7334l3184m0568k2881j9036r648K5455
8640A449603M6667L0329J0633L3622K7204L6552K4191M6519P3270Q2312Q3921
8629A944823J04930J52628J74430J96061J98254K06063J93442J80116J35014P9525
8619C565286L7165J0780j2667j2752L3730P7395J18068J66166K30021L06262M00875
8608D920329M65528N10017N05435M34332K75674N3437j77403l19828m43451m90587
$$ plain form
8598 5733483 5265042 4869613 4540167 4294797 4128454 4000934 3924372 3896151 3904752 3937956
8588 3937956 3960304 3944616 3886719 3803827 3665967 3454013 3224950 3027410 2842038 2642436
8578 2642436 2441129 2223852 2020959 1829905 1639456 1501904 1379630 1254286 1144263 1050907
8568 1050907 982679 908995 861306 823217 806299 763805 727772 746467 731669 713067 733789
8557 733789 764809 808101 856034 908555 1009588 1125976 1243358 1386915 1519308 1617615 1622113
8546 1622113 1561378 1473972 1377967 1275881 1211522 1185326 1172318 1182846 1234793 1309488 1419462
8535 1419462 1572114 1752968 1971216 2218948 2451181 2599709 2651573 2606399 2425220 2181852
8525 2181852 1928445 1725630 1530330 1369559 1258928 1185877 1112600 1087005 1094176 1119490 1149956
$$ packed form
8598E733483m68441l95429l29446k45370j66343j27520p6562k8221Q601L3204
8588C937956K2348j5688n7897q2892j37860k11954k29063j97540j85372j99602
8578B642436k01307k17277k02893j91054j90449j37552j22274j25344j10023r3356
8568A050907o8228p3684m7689l8089j6918m2494l6033J8695j4798j8602K0722
8557G33789L1020M3292M7933N2521J01033J16388J17382J43557J32393R8307M498
8546A622113o0735q7406r6005j02086o4359k6196j3008J0528N1947P4695J09974
8535A419462J52652J80854K18248K47732K32233J48528N1864m5174j81179k43368
8525B181852k53407k02815j95300j60771j10631p3051p3277k5595P171K5314L0466
$$ plain form
8514 1149956 1199590 1261700 1330493 1372849 1366984 1308585 1219323 1095415 984496 883696 788656
8503 788656 689167 591479 513040 457426 419778 383216 356032 320138 303508 298321 263885 239623
8491 239623 224318 209814 206274 218290 230793 236323 222938 221829 202591 179962 172067 161763
8479 161763 162103 135411 126368 143288 150792 150635 128202 120368 125797 111662 100425 119433 132505
8466 132505 146650 154879 152652 154915 146343 133986 127068 133585 136742 129648 129311 140234 144621 154864
8452 154864 141241 131448 137997 132781 144452 146115 131234 119042 103727 92128 97217 95359 102891
8439 102891 105878 118945 125600 112356 93105 89116 88137 77072 72837 65924 60708 61669 62004 60930
8425 60930 75007 77539 89982 97386 107359 106631 97257 102813 98992 79014 66269 59046 62907 75091
$$ packed form
8514A149956M9634O2110O8793M2356n865n8399q9262j23908j10919j00800r5040
8503G88656r9489r7688p8439n5614l7648l6562k7184l5894j6630n187l4436k4262
8491B39623j5305j4504l540J2016J2503N530j3385j109j9238k2629p895j0304
8479A61763L40k6692r043J6920P504j57k2433p834N429j4135j1237J9008J3072
8466A32505J4145Q229k227K263q572j2357o918O517L157p094l37J0923M387J0243
8452A54864j3623r793O549n216J1671J663j4881j2192j5315j1599N089j858P532
8439A02891K987J3067O655j3244j9251l989r79j1065m235o913n216R61L35j074
8425F0930J4077K532J2443P404R973p28r374N556l821j9978j2745p223L861J2184
$$ plain form
8411 75091 53328 25110 -12698 -19473 10936 23356 34272 42264 51494 52970 42557 40824 46549
8398 46549 51114 51509 70931 84798 88531 100863 97404 105603 122323 100612 102096 122160 129706
8385 129706 128788 129732 153850 154056 116560 75775 73776 81838 75889 62373 67645 76454 89422 111855
8371 111855 126120 111710 126084 116160 105127 92794 100711 103857 106594 112594 114188 131098 148694
8358 148694 160738 148416 151498 190210 211820 226820 251315 285982 327103 364433 414081 501860
8346 501860 608925 736621 893371 1076352 1273278 1458618 1613232 1706191 1733908 1702319
8336 1702319 1593797 1448754 1259433 1069228 893808 757094 649545 553623 484574 416589
8326 416589 354609 322506 309798 274261 222172 207443 192545 200518 190522 168682 152587 137671
$$ packed form
8411G5091k1763k8218l7808o775L0409J2420J0916P992R230J476j0413j733N725
8398D6549M565L95J9422J3867L733J2332l459Q199J6720k1711J484K0064P546
8385A29706r18R44K4118K06l7496m0785j999Q062n949j3516N272Q809J2968K2433
8371A11855J4265j4410J4374r924j1033j2333P917L146K737O000J594J6910J7596
8358A48694J2044j2322L082L8712K1610J5000K4495L4667M1121L7330M9648Q7779
8346E01860J07065J27696J56750J82981J96926J85340J54614R2959K7717l1589
8336A702319j08522j45043j89321j90205j75420j36714j07549r5922o9049o7985
8326D16589o1980l2103j2708l5537n2089j4729j4898P973r996k1840j6095j4916
$$ plain form
8314 137671 135579 152033 158734 135998 121633 102251 96415 100307 101919 116867 110831 124430 137113
8301 137113 123864 120708 113895 113129 110139 106863 121963 124392 122956 134879 142250 121238 116497 109678
8287 109678 101005 85691 86060 86953 90713 80068 59262 55352 65145 66957 69399 58345 57348 57634
8273 57634 50751 38192 42663 44252 51473 45964 38962 38212 40473 47047 71429 84763 88902 84357
8259 84357 56637 32445 41723 67822 83131 61397 51026 56480 52687 53339 56528 68044 82329
8246 82329 78179 80435 72072 58679 54960 65387 64949 68002 84629 88667 98781 97871 96695 97683
8232 97683 117090 123316 123461 113815 100742 94688 87163 77740 83264 103210 96938 86737 104183 111149
8218 111149 109062 124298 119034 133218 136665 113490 105483 122286 133037 137372 156853 174685 207924
$$ packed form
8314A37671k092J6454O701k2736j4365j9382n836L892J612J4948o036J3599J2683
8301A37113j3249l156o813p66k990l276J5100K429j436J1923P371k1012m741o819
8287A09678q673j5314L69Q93L760j0645k0806l910R793J812K442j1054r97K86
8273E7634o883j2559M471J589P221n509p002p50K261O574K4382J3334M139m545
8259H4357k7720k4192R278K6099J5309k1734j0371N454l793O52L189J1516J4285
8246H2329m150K256q363j3393l719J0427m38L053J6627M038J0114r10j176R88
8232I7683J9407O226J45r646j3073o054p525r423N524J9946o272j0201J7446O966
8218A11149k087J5236n264J4184L447k3175q007J6803J0751M335J9481J7832L3239
$$ plain form
8205 207924 227393 259015 328357 397322 437095 446584 401854 341234 269024 200765 168291 160384
8193 160384 153438 137134 122746 131583 144486 137208 138376 137405 151554 157095 133828 112750 102079
8180 102079 104361 97222 116129 130363 112674 113056 136783 163867 160986 146219 143963 174249 180836
8167 180836 186878 213557 226091 251770 266382 271721 267749 255922 239918 218553 192705 183844
8155 183844 177225 183396 191695 181013 164762 158660 148687 139224 127441 110299 125017 128454 134322
8142 134322 153475 186777 205383 205435 216109 223928 227744 225434 247945 247576 203262 172173 135953
8129 135953 117485 109017 89894 64357 49495 56002 53984 41737 44416 63047 70528 74001 59067
8116 59067 42299 30902 28044 57409 107208 128970 143200 168943 177758 191913 198862 210452
$$ packed form
8205B07924J9469L1622O9342O8965L9773R489m4730o0620p2210o8259l2474p907
8193A60384o946j6304j4388Q837J2903p278J168r71J4149N541k3267k1078j0671
8180A02079K282p139J8907J4234j7689L82K3727K7084k881j4767k256L0286O587
8167A80836O042K6679J2534K5679J4612N339l972j1827j6004k1365k5848q861
8155A83844o619O171Q299j0682j6251o102r973r463j1783j7142J4718L437N868
8142A34322J9153L3302J8606N2J0674P819L816k310K2511l69m4314l1089l6220
8129A35953j8468q468j9123k5537j4862O507k018j2247K679J8631P481L473j4934
8116E9067j6768j1397k858K9365M9799K1762J4230K5743Q815J4155O949J1590
$$ plain form
8104 210452 203704 186198 178376 150266 136416 141736 145011 154087 168907 174364 188441 173074 156707
8091 156707 161968 148681 116921 108200 91031 77582 71893 78279 76390 55664 45147 24868 -14112
8078 -14112 -31201 -26837 2671 72098 216363 389732 527146 595433 610033 586431 564553
8067 564553 548510 533529 544224 544568 544808 549431 547664 518096 513302 537149 568899 590576 610110
8054 610110 591249 586543 590471 579527 543510 554439 574722 587452 584734 576997 564574 564044 590270
8041 590270 611133 624604 631038 646088 666974 669430 684564 701140 702749 698382 708821 717684 733881
8028 733881 746104 767090 785836 818771 848376 863598 878740 916311 955923 972778 982503 1002290
8016 1002290 1018848 1043685 1097889 1160282 1210685 1244738 1282876 1313095 1343386 1351732 1361147 1377500
$$ packed form
8104B10452o748j7506p822k8110j3850N320L275R076J4820N457J4077j5367j6367
8091A56707N261j3287l1760q721j7169j3449n689O386j889k0726j0517k0279l8980
8078a4112j7089M364K9508O9427J44265J73369J37414O8287J4600k3602k1878
8067E64553j6043j4981J0695L44K40M623j767k9568m794K3847L1750K1677J9534
8054F10110j8861m706L928j0944l6017J0929K0283J2730k718p737j2423n30K6226
8041E90270K0863J3471O434J5050K0886K456J5134J6576J609m367J0439Q863J6197
8028G33881J2223K0986J8746L2935K9605J5222J5142L7571L9612J6855R725J9787
8016A002290J6558K4837N4204O2393N0403L4053L8138L0219L0291Q346R415J6353
$$ plain form
8004 1377500 1423494 1497937 1573345 1638887 1694813 1774832 1876913 1980401 2074907 2183130 2294725
7993 2294725 2417873 2561568 2709382 2902172 3095752 3298177 3477189 3612700 3745902 3917129
7983 3917129 4097621 4290229 4530389 4786899 5056692 5376039 5753960 6213737 6717008 7270741
7973 7270741 7914868 8655093 9529279 10538706 11729926 13196036 14952491 17026273 19478825
7964 19478825 22298968 25517606 29156832 33222158 37692581 42509373 47839996 54253080
7956 54253080 62812118 74956339 92423342 117743640 154365799 206352452 276439255
7949 276439255 360809275 440244439 479818726 456074559 383983341 299492429 227324127
7942 227324127 173465419 135068692 107856045 88453437 74500888 64422234 57095442
$$ packed form
8004A377500M5994P4443P5408O5542N5926Q0019J02081J03488R4506J08223J11595
7993B294725J23148J43695J47814J92790J93580K02425J79012J35511J33202J71227
7983C917129J80492J92608K40160K56510K69793L19347L77921M59777N03271N53733
7973G270741O44127P40225Q74186J009427J191220J466110J756455K073782K452552
7964A9478825K820143L218638L639226M065326M470423M816792N330623O413084
7956E4253080Q559038J2144221J7467003K5320298L6622159N1986653P0086803
7949B76439255Q4370020P9435164L9574287k3744167p2091218q4490912p2168302
7942B27324127n3858708l8396727k7212647j9402608j3952549j0078654p326792
$$ plain form
7935 57095442 51515261 46677427 41997062 37472602 33316551 29634812 26371097 23532905
7927 23532905 21047599 18894641 17017442 15395148 13998362 12781447 11702172 10731633
7919 10731633 9882028 9135435 8451791 7846245 7280032 6762070 6286221 5880596 5532390
7910 5532390 5219478 4938678 4666941 4417239 4166971 3950543 3743215 3529981 3333040 3173385
7900 3173385 3027036 2884771 2772933 2666716 2598928 2517423 2443605 2365396 2254194 2173364
7890 2173364 2091293 2022649 1946567 1863437 1769491 1694118 1626311 1558029 1520987 1491043 1463443
7879 1463443 1422593 1382974 1353862 1319875 1283029 1248098 1222256 1164287 1113468 1107571 1105475 1114697
7867 1114697 1091731 1045129 1015076 980121 935467 911576 912477 895143 837203 817723 820211 784810
$$ packed form
7935E7095442n580181m837834m680365m524460m156051l681739l263715k838192
7927B3532905k485306k152958j877199j622294j396786j216915j079275r70539
7919A0731633q49605p46593o83644o05546n66213n17962m75849m05625l48206
7910E532390l12912k80800k71737k49702k50268k16428k07328k13234j96941j59655
7900C173385j46349j42265j11838j06217o7788q1505p3818p8209j11202q0830
7890B173364q2071o8644p6082q3130r3946p5373o7807o8282l7042k9944k7600
7879A463443m0850l9619k9112l3987l6846l4931k5842n7969n0819n897k096R222
7867A114697k2966m6602l0053l4955m4654k3891R01j7334n7940j9480K488l5401
$$ plain form
7855 784810 755957 746092 738328 726999 706505 696128 687203 663171 624413 612276 597301 565873
7843 565873 552521 525187 494838 486610 470645 460655 468304 463668 442501 429397 411755 406886 387011
7830 387011 380222 365325 356746 335849 329811 335733 328233 356803 454642 577605 735395 868361
7818 868361 913823 874727 831327 807636 763404 740639 732872 710290 675405 637745 606952 613236
7806 613236 622408 612899 596262 576300 544781 515730 504415 509637 501518 499321 485789 479301 466176
7793 466176 450271 431949 415792 406926 375156 371843 365548 349380 346277 340581 371331 398848 409880
7780 409880 419811 430653 424626 415498 390665 372084 375916 387632 387427 386808 375721 390819 400963
7767 400963 366224 317475 320094 317524 298326 278251 218454 171278 173210 176203 190527 220496
$$ packed form
7855G84810k8853r865p764j1329k0494j0377q925k4032l8758j2137j4975l1428
7843E65873j3352k7334l0349q228j5965r990P649m636k1167j3104j7642m869j9875
7830C87011o789j4897q579k0897o038N922p500K8570R7839J22963J57790J32966
7818H68361M5462l9096m3400k3691m4232k2765p767k2582l4885l7660l0793O284
7806F13236R172r509j6637j9962l1519k9051j1315N222q119k197j3532o488j3125
7793D66176j5905j8322j6157q866l1770l313o295j6168l103n696L0750K7517J1032
7780D09880R931J0842o027r128k4833j8581L832J1716k05o19j1087J5098J0144
7767D00963l4739m8749K619k570j9198k0075n9797m7176J932K993J4324K9969
$$ plain form
7755 220496 239144 250511 271470 292511 300717 301085 299390 280982 261303 243611 237342 227906 221634
7742 221634 217593 222270 192307 178902 180100 177623 195592 199399 165656 168675 172797 157068 162185
7729 162185 160774 171492 166021 167983 169819 185086 201557 186433 186491 199009 211076 206160 190545
7716 190545 178648 171703 177477 195492 179187 167445 164168 144642 114818 114320 122393 144787 174571
7703 174571 193001 180720 183961 191583 187754 154175 177691 203560 201341 209495 204865 194006 171806
7690 171806 163328 166012 177842 175142 171885 171203 182523 173425 177931 174198 147590 162485 160287 149690
7676 149690 152576 151356 147668 150426 157184 164176 168202 165771 158561 145629 145030 133665 123963 117652
7662 117652 102369 109421 140662 144896 131608 136668 140803 147895 156912 140471 128431 133245 139594
$$ packed form
7755B20496J8648J1367K0959K1041Q206L68j695j8408j9679j7692o269r436o272
7742B21634m041M677k9963j3405J198k477J7969L807l3743L019M122j5729N117
7729A62185j411J0718n471J962J836J5267J6471j5124N8J2518J2067m916j5615
7716A90545j1897o945N774J8015j6305j1742l277j9526k9824m98Q073K2394K9784
7703A74571J8430j2281L241P622l829l3579K3516K5869k219Q154m630j0859k2200
7690A71806q478K684J1830k700l257o82J1320r098M506l733k6608J4895k198j0597
7676A49690K886j220l688K758O758O992M026k431p210j2932n99j1365r702o311
7662A17652j5283P052L1241M234j3288N060M135P092R017j6441j2040M814O349
$$ plain form
7649 139594 128467 126487 137469 142403 138770 143215 154649 144308 144380 164526 172520 159732 148826
7636 148826 144354 143021 129537 122074 113517 108217 120380 133625 113243 93609 91286 97405 117303
7623 117303 125832 107443 110582 116090 117186 119683 111135 103339 98976 106705 125748 114541 104448
7610 104448 115475 105833 101265 100943 100910 123544 129617 101141 93273 84266 95172 117186 111626 98872
7596 98872 95065 89814 104511 126054 134651 131967 126078 117036 82870 76591 96606 87576 73699
7583 73699 83374 107523 106387 94695 99265 93467 101369 115394 122787 141750 139354 127001 137435
7570 137435 171501 188013 196321 197708 187750 199495 233171 291329 348230 392612 424557 511969
7558 511969 611462 719576 860638 1038185 1227441 1423274 1610652 1764836 1820092 1794697
$$ packed form
7649A39594j1127j980J0982M934l633M445J1434j0341P2K0146P994j2788j0906
7636A48826m472j333j3484p463q557n300J2163J3245k0382j9634k323O119J9898
7623A17303Q529j8389L139N508J096K497q548p796m363P729J9043j1207j0093
7610A04448J1027r642m568l22l3K2634O073k8476p868r007J0906K2014n560j2754
7596I8872l807n251J4697K1543Q597k684n889r042l4166o279K0015r030j3877
7583G3699R675K4149j136j1692M570n798P902J4025P393J8963k396j2353J0434
7570A37435L4066J6512Q308J387r958J1745L3676N8158N6901M4382L1945Q7412
7558E11969R9493J08114J41062J77547J89256J95833J87378J54184N5256k5395
$$ plain form
7548 1794697 1682154 1521708 1345148 1166796 982640 811301 688050 607569 527663 464616
7538 464616 423101 393054 353895 312187 286967 278217 261619 234880 211512 202108 203601 185503
7526 185503 157333 138871 133066 131319 127456 125361 111566 78653 60256 68221 75507 99193 103370
7513 103370 117771 112784 92301 78238 71560 63437 42064 53703 72365 83272 87892 82739 78899
7500 78899 77253 86204 106573 106141 95706 84876 79451 80887 98504 112444 117098 123476 125310 134752
7486 134752 144269 113280 85494 71691 61169 34916 46977 39122 25996 -2674 -22091 1781
7474 1781 23554 32784 35674 46878 47388 66544 62900 38214 22251 29545 27105 31260 39319 16154
7460 16154 6390 20000 41180 38307 31899 60784 63189 26698 1862 -97 -1737 16228 30368
$$ packed form
7548A794697j12543j60446j76560j78352j84156j71339j23251q0481p9906o3047
7538D64616m1515l0047l9159m1708k5220q750j6598k6739k3368r404J493j8098
7526A85503k8170j8462n805j747l863k095j3795l2913j8397P965P286K3686M177
7513A03370J4401m987k0483j4063o678q123k1373J1639J8662J0907M620n153l840
7500G8899j646Q951K0369m32j0435j0830n425J436J7617J3940M654O378J834R442
7486A34752R517l0989k7786j3803j0522k6253J2061p855j3126k8670j9417K3872
7474A781K1773R230K890J1204N10J9156l644k4686j5963P294k440M155Q059k3165
7460A6154r764J3610K1180k873o408K8885K405l6491k4836j959j640J7965J4140
$$ plain form
7447 30368 30006 29197 11527 691 6470 9360 5662 12353 13020 26874 19885 26633 58381 53970
7433 53970 38491 41101 47086 41102 33273 29630 41627 24346 30663 48343 36395 31801 42266
7420 42266 43749 41761 35256 29044 21754 15648 26432 5717 -4874 10322 26339 20735 21297 36713
7406 36713 41176 45141 43587 54286 54321 55952 53150 47403 54989 52102 55799 55388 29257 12154 6960
7391 6960 23768 30521 31501 20772 6041 7476 35973 46459 39870 29500 18052 31138 54886
7378 54886 48740 35770 26604 31353 20216 17455 28397 15470 10586 7009 15725 18915 20255 32347
7364 32347 35869 34651 31840 21483 10682 12523 20123 33444 44231 49332 57685 38568 26169
7351 26169 29917 39540 32388 17048 33126 27970 5543 1563 10179 23585 35838 25967 12553
$$ packed form
7447C0368l62q09j7670j0836N779K890l698O691O67J3854o989O748L1748m411
7433E3970j5479K610N985n984p829l643J1997j7281O317J7680j1948m594J0465
7420D2266J483j988o505o212p290o106J0784k0715j0591J5196J6017n604N62J5416
7406C6713M463L965j554J0699L5J631k802n747P586k887L697m11k6131j7103n194
7391F960J6808O753R80j0729j4731J435K8497J0486o589j0370j1448J3086K3748
7378E4886o146j2970r166M749j1137k761J0942j2927m884l577Q716L190J340J2092
7364C2347L522j218k811j0357j0801J841P600J3321J0787N101Q353j9117j2399
7351B6169L748R623p152j5340J6078n156k2427l980Q616J3406J2253r871j3414
$$ plain form
7338 12553 19446 36501 56140 57140 38740 35865 23714 19105 8033 20988 37654 50581 48765
7325 48765 24162 2810 4279 26894 47173 42118 20116 11393 18314 42082 46902 45222 37793
7312 37793 27677 18104 27056 30103 26517 37079 41516 23085 -9274 -9649 12350 25574 35555
7299 35555 37155 34133 16960 20907 46294 59675 58192 29098 21935 43091 75344 81943 77247
7286 77247 67386 47382 29783 38466 51477 51841 39950 15324 -19890 -10903 -3048 -4277 8428
7273 8428 22817 26323 8012 14291 10069 24660 44737 33900 16711 4898 25707 47977 38003
7260 38003 26948 24097 20769 16724 33188 55497 61630 53939 27021 14497 20335 34979 32142
7247 32142 42171 41764 37554 33283 46415 40755 30321 32065 19838 3446 1267 12437 15950
$$ packed form
7338A2553O893J7055J9639J000j8400k875j2151m609j1072J2955J6666J2927j816
7325D8765k4603k1352J469K2615K0279n055k2002q723O921K3768M820j680p429
7312C7793j0116r573Q952L047l586J0562M437j8431l2359l75K1999J3224R981
7299C5555J600l022j7173L947K5387J3381j483k9094p163K1156L2253O599m696
7286G7247r861k0004j7599Q683J3011L64j1891k4626l5214Q987P855j229J2705
7273H428J4389L506j8311O279m222J4591K0077j0837j7189j1813K0809K2270r974
7260C8003j1055k851l328m045J6464K2309O133p691k6918j2524N838J4644k837
7247C2142J0029m07m210m271J3132n660j0434J744j2227j6392k179J1170L513
$$ plain form
7234 15950 28935 29241 27717 26135 29971 34058 49855 42133 55479 51262 26739 38545 37981 20394
7220 20394 10917 23690 43282 34774 25812 27546 32911 40881 35007 23431 772 5744 10226 1603
7206 1603 3647 -4009 1771 23616 26264 27609 11158 3312 7346 12472 23202 14996 14275 9336
7192 9336 4964 12133 16692 7662 -16633 -33154 -23219 -16370 -14051 -15588 -1393 21251 43268 40866
7178 40866 39251 48865 50028 30010 18353 22775 29515 28102 21928 13926 20654 28486 16806 27701
7164 27701 7986 9415 24969 8604 -8319 -6842 12188 44326 68128 52254 33324 36667
7152 36667 55595 60885 44189 53984 50449 48550 41778 43789 34919 24181 42345 52649 31976
7139 31976 16909 2561 1102 13421 26624 18375 28230 35880 50990 45200 37305 29112 26733
$$ packed form
7234A5950J2985L06j524j582L836M087J5797p722J3346m217k4523J1806n64j7587
7220B0394r477J2773J9592q508q962J734N365P970n874j1576k2659M972M482q623
7206A603K044p656N780K1845K648J345j6451p846M034N126J0730q206p21m939
7192I336m372P169M559r030k4295j6521R935O849K319j537J4195K2644K2017k402
7178D0866j615R614J163k0018j1657M422O740j413o174q002O728P832j1680J0895
7164B7701j9715J429J5554j6365j6923J477J9030L2138K3802j5874j8930L343
7152C6667J8928N290j6696R795l535j899o772K011q870j0738J8164J0304k0673
7139C1976j5067j4348j459J2319J3203q249R855P650J5110n790p895q193k379
$$ plain form
7126 26733 22470 35176 24169 27896 15595 24753 29149 27668 24606 33362 26752 20600 19023 28508
7112 28508 34034 30042 19043 5320 3264 15530 11152 13674 26598 21435 -1717 -20040 -2937
7099 -2937 4588 30245 45620 37662 28704 22640 29505 53722 50273 38578 31408 12818 9352 11676
7085 11676 35891 29666 30698 41398 35109 40691 30959 16729 21761 14206 19276 16961 4171 11712
7071 11712 18423 14865 5104 13547 33976 34428 15699 4457 -6183 6857 22955 24517 3914
7058 3914 -4097 4797 7826 3642 -901 10171 5768 10044 10734 5845 6776 21993 33762 30494 26719
7043 26719 21608 20293 14064 8546 2454 11325 11551 -1539 -1077 13967 35348 41260 30811 40959
7029 40959 46337 28119 17481 28855 18258 3601 -7291 -3643 -8017 12983 27322 26001 11438
$$ packed form
7126B6733m263J2706j1007L727j2301R158M396j481l062Q756o610o152j577R485
7112B8508N526l992j0999j3723k056J2266m378K522J2924n163k3152j8323J7103
7099b937P525K5657J5375p958q958o064O865K4217l449j1695p170j8590l466K324
7085A1676K4215o225J032J0700o289N582r732j4230N032p555N070k315j2790P541
7071A1712O711l558r761Q443K0429M52j8729j1242j0640J3040J6098J562k0603
7058C914q011Q894L029m184m543J1072m403M276O90m889R31J5217J1769l268l775
7043B6719n111j315o229n518o092Q871K26j3090M62J5044K1381N912j0449J0148
7029D0959N378j8218j0638J1374j0597j4657j0892L648m374K1000J4339j321j4563
$$ plain form
7016 11438 10767 13825 10142 12754 15610 17556 15165 17415 20808 16962 2446 -3050 -14358 -22505
7002 -22505 -14365 3545 -2393 3089 1496 -6644 -3251 13666 10170 15521 23107 8854 12523 9073
6988 9073 22618 36307 27476 12040 25080 21193 33600 35225 12833 8516 5501 -11149 -15190
6975 -15190 2748 24079 21365 439 -5611 1246 -4110 -1752 21175 27845 34362 15944 5260
6962 5260 2033 24816 49491 37010 16195 27583 33614 49037 49611 35299 9922 3518 -7319
6949 -7319 -8757 -7033 -4000 11671 39844 17086 10996 11654 13912 16681 11196 12434 14046 17010
6935 17010 17058 14960 23380 48235 51051 23902 8320 -8484 -5004 4376 640 2389 16125 29215
6921 29215 33499 38316 37322 41575 35903 18816 4669 -12863 3657 33062 43023 30837 21383
$$ packed form
7016A1438o71L058l683K612K856J946k391K250L393l846j4516n496j1308q147
7002b2505Q140J7910n938N482j593q140L393J6917l496N351P586j4253L669l450
6988I073J3545J3689q831j5436J3040l887J2407J625k2392m317l015j6650m041
6975a5190J7938K1331k714k0926o050O857n356K358K2927O670O517j8418j0684
6962E260l227K2783K4675j2481k0815J1388O031J5423N74j4312k5377o404j0837
6949g319j438J724L033J5671K8173k2758o090O58K258K769n485J238J612K964
6935A7010M8k098Q420K4855K816k7149j5582j6804L480R380l736J749J3736J3090
6921B9215M284M817r94M253n672j7087j4147j7532J6520K9405R961j2186r454
$$ plain form
6908 21383 15581 -6424 -11267 2628 -1946 130 23451 44411 54093 53568 30893 8499 22985
6895 22985 27938 22311 25392 17520 1389 -36 10225 13575 19993 4700 5992 18262 13225 19013
6881 19013 22898 23977 25308 5965 -10358 -16056 -28948 -24784 8539 11503 16358 17982 14498 15966
6867 15966 37251 27369 25711 29994 24118 28122 23434 25913 35505 23384 24602 37035 37295 14209
6853 14209 -4853 -7014 10319 8812 -6994 -6205 11107 29900 15536 15967 12821 3934 -1018 -4747
6839 -4747 -7572 -3010 19594 27590 21978 24668 24289 20590 15618 12016 18217 23413 11883 -13144
6825 -13144 -13576 4199 27969 28659 24138 42754 42927 28750 16593 23074 1644 -3772 6705 -109
6811 -109 9563 14959 29407 18302 15411 16685 -338 -4009 10465 27955 31322 15193 24054 35068
$$ packed form
6908B1383n802k2005m843J3895m574K076K3321K0960R682n25k2675k2394J4486
6895B2985M953n627L081p872j6131j425J0261L350O418j5293J292J2270n037N788
6881A9013L885J079J331j9343j6323n698j2892M164L3323K964M855J624l484J468
6867A5966K1285r882j658M283n876M004m688K479R592j2121J218J2433K60k3086
6853A4209j9062k161J7333j507j5806P89J7312J8793j4364M31l146q887m952l729
6839d747k825M562K2604P996n612K690l79l699m972l602O201N196j1530k5027
6825a3144m32J7775K3770O90m521J8616J73j4177j2157O481k1430n416J0477o814
6811a09R672N396J4448j1105k891J274j7023l671J4474J7490L367j6129Q861J1014
$$ plain form
6797 35068 33131 12787 6535 13454 22215 14779 18500 11089 -1161 931 18722 6841 -3884
6784 -3884 3597 4133 15075 35935 26991 1249 7314 8767 3244 7836 15782 24517 32830 19769
6770 19769 -746 -10364 -7088 -5609 -9177 -13508 1874 24849 27186 13934 -4650 4063 4759 -9055
6756 -9055 -16328 -5228 3889 15245 4357 -8642 -1826 7165 27987 20225 25748 37655 37990 33922
6742 33922 24509 3129 5079 29097 33317 12784 -5782 -18525 -21310 -16711 4902 13017 15005
6729 15005 15965 9943 10704 12593 9866 10031 14260 25594 34925 44723 32643 24229 10867 5247 9668
6714 9668 12736 27624 43381 34603 17468 23512 33219 21766 -1020 -12277 -9398 5734 -218
6701 -218 20831 11787 -4462 12 16271 6616 16564 23967 2775 -13636 1017 17629 2768
$$ packed form
6797C5068j937k0344o252O919Q761p436L721p411j2250K092J7791j1881j0725
6784c884P481N36J0942K0860q944k5742O065J453n523M592P946Q735Q313j3061
6770A9769k0515r618L276J479l568m331J5382K2975K337j3252j8584Q713O96j3814
6756i055p273J1100R117J1356j0888j2999O816Q991K0822p762N523J1907L35m068
6742C3922r413k1380J950K4018M220k0533j8566j2743k785M599K1613Q115J988
6729A5005R60o022P61J889k727J65M229J1334R331R798j2080q414j3362n620M421
6714I668L068J4888J5757q778j7135O044R707j1453k2786j1257K879J5132n952
6701b18K1049r044j6249M474J6259r655R948P403k1192j6411J4653J6612j4861
$$ plain form
6688 2768 3093 13930 38936 36344 18313 -3504 -18030 -11744 11782 10448 -4253 -14284 -26554
6675 -26554 -43122 -45759 -9132 7375 14282 14692 15405 17243 17608 11394 -2799 -3755 19254 21892
6661 21892 20456 19846 5194 -3769 -11965 1793 1652 -5970 -11737 -20285 -26268 -34929 -15355 -1039
6647 -1039 -14337 -2459 24198 32744 17458 -10127 -15737 -21831 -29334 -33467 -35437 -11794 948
6634 948 -6214 -7798 -15102 -11879 -11641 -15675 -11978 16192 39956 27930 -218 -5735 20812 32476
6620 32476 29756 20056 15947 22869 3641 -18122 10843 9520 -7478 -15416 -21011 -29897 -19540
6607 -19540 -6656 10690 -642 -2577 -13912 -13286 -11111 5921 19309 12887 3239 -8448 2020
6594 2020 -13667 -29202 -6675 -11701 -11743 24167 36342 21984 20289 28618 23380 18053 11997 14715
$$ packed form
6688B768L25J0837K5006k592j8031k1817j4526O286K3526j334j4701j0031j2270
6675b6554j6568k637L6627J6507O907M10P13J838L65o214j4193r56K3009K638
6661B1892j436o10j4652q963q196J3758j41p622n767q548n983q661J9574J4316
6647a039j3298J1878K6657Q546j5286k7585n610o094p503m133j970K3643J2742
6634I48p162j584p304L223K38m034L697K8170K3764j2026k8148n517K6547J1664
6620C2476k720r700m109O922j9228k1763K8965j323j6998p938n595q886J0357
6607a9540J2884J7346j1332j935j1335O26K175J7032J3388o422r648j1687J0468
6594B020j5687j5535K2527n026m2L5910J2175j4358j695Q329n238n327o056K718
$$ plain form
6580 14715 28563 31310 31928 18953 7589 -19899 -11235 -11499 -362 14815 16580 -3010 -16747
6567 -16747 -8596 -1451 -6802 -7151 -14299 -21795 -21302 -17337 -5163 -6138 -17483 -19186 -10908 -10303 -17416
6552 -17416 -6056 20713 8833 -5722 -11051 -25206 -26179 -37204 -31671 -26239 -23806 -5990 8753
6539 8753 4847 -28331 -18685 12029 11429 -20126 -31763 -38780 -53590 -46281 -9083 2975 -19658
6526 -19658 -11430 -12950 -17985 -9378 12560 -4786 -37748 -27918 4770 13958 -1842 -6387 -22524
6513 -22524 -23867 -24691 -9085 -11350 -9114 242 5715 15767 4193 -14023 -14679 1250 14602 25609
6499 25609 23808 17055 17323 8910 -17706 -2070 16036 22916 6650 5549 -5121 -11766 7049
6486 7049 9305 1555 -8698 18591 32137 6272 3952 9509 16672 4680 -19651 -12042 -5442
$$ packed form
6580A4715J3848K747O18j2975j1364k7488Q664k64J1137J5177J765j9590j3737
6567a6747Q151P145n351l49p148p496M93L965J2174r75j1345j703Q278O05p113
6552a7416J1360K6769j1880j4555n329j4155r73j1025N533N432K433J7816J4743
6539H753l906l3178R646L0714o00l1555j1637p017j4810P309L7198J2058k2633
6526a9658Q228j520n035Q607K1938j7346l2962R830L2688R188j5800m545j6137
6513b2524j343q24J5606k265K236R356N473J0052j1574j8216o56J5929J3352J1007
6499B5609j801o753K68q413k6616J5636J8106O880j6266j101j0670o645J8815
6486G049K256p750j0253K7289J3546k5865k320N557P163j1992k4331P609O600
$$ plain form
6473 -5442 -10863 1059 1094 -8939 -25804 -7479 1839 -2695 -8367 -25383 -35500 -42848 -43658 -59430
6459 -59430 -43416 -30347 -5443 10909 19258 20716 14285 -1642 14611 12624 16428 10442 873
6446 873 1792 -11624 -28475 -6217 8586 9356 17534 23881 25183 19420 2249 -9099 -22586 -14372
6432 -14372 1182 18354 29511 38334 22636 -4750 -29123 -31987 -15096 -12754 -17298 14642 39243
6419 39243 44624 46936 42191 48881 58005 39921 16833 12029 -9041 -8402 1552 9253 19602 12175
6405 12175 10665 10744 -73 24953 44776 41756 16383 -8154 -24483 -34261 -35100 -26325 4380 12376
6391 12376 11367 6906 -11085 -14024 1108 338 -6921 4693 7823 -3705 -6212 -3496 -25340 -43211
6377 -43211 -23787 -2544 -7208 -16596 -28740 -25881 -10180 -2853 -8576 -11444 -29941 -6787 17750
$$ packed form
6473e442n421J1922L5j0033j6865J8325R318m534n672j7016j0117p348q10j5772
6459e9430J6014J3069K4904J6352Q349J458o431j5927J6253j987L804n986r569
6446H73R19j3416j6851K2258J4803P70Q178O347J302n763j7171j1348j3487Q214
6432a4372J5554J7172J1157Q823j5698k7386k4373k864J6891K342m544L1940K4601
6419C9243N381K312m745O690R124j8084k3088m804k1070O39R954P701J0349p427
6405A2175j510P9j0817K5026J9823l020k5373k4537j6329r778q39Q775L0705P996
6391A2376j009m461j7991k939J5132p70p259J1614L130j1528k507K716k1844j7871
6377d3211J9424K1243m664r388j2144K859J5701P327n723k868j8497K3154K4537
$$ plain form
6364 17750 33396 23026 -4272 -3341 14774 36936 58283 47992 50554 31853 6366 3118 -9044
6351 -9044 -10515 -7638 -5242 2732 -4453 -598 6124 -6730 -1044 10921 9050 22964 36755 21797
6337 21797 1825 12924 6043 3611 -446 5131 19842 27568 25427 23591 13601 -10872 -20966
6324 -20966 -7503 974 -2641 4145 564 5563 5647 -684 -7909 -13168 -13855 -32766 -35543 -30884 -15522
6309 -15522 1755 12800 7820 15225 -7086 -14783 -14132 -14653 -18402 -4203 12352 16284 29066 28682
6295 28682 15547 24637 926 -10091 -16947 -37237 -40497 -23719 -16264 -11189 -10148 3223 11853
6282 11853 11936 6450 1462 -7843 -5031 -6831 -7482 -5859 -5160 19564 34501 30222 9113 -13270 -16930
6267 -16930 -9927 1077 -116 -12311 -35241 -33451 -14882 -27497 -16836 4034 14588 -5991
$$ packed form
6364A7750J5646j0370k7298R31J8115K2162K1347j0291K562j8701k5487l248j2162
6351i044j471K877K396P974p185L855O722j2854N686J1965j871J3914J3791j4958
6337B1797j9972J1099o881k432m057N577J4711P726k141j836r990k4473j0094
6324b0966J3463Q477l615O786l581M999Q4o331p225n259o87j8911k777M659J5362
6309a5522J7277J1045m980P405k2311p697O51n21l749J4199J6555L932J2782l84
6295B8682j3135R090k3711j1017o856k0290l260J6778P455N075J041J3371Q630
6282A1853Q3n486m988r305K812j800o51J623O99K4724J4937m279k1109k2383l660
6267a6930P003J1004j193j2195k2930J790J8569j2615J0661K0870J0554k0579
$$ plain form
6255 -5991 -30863 -40829 -7411 13005 20651 1343 -5674 -12891 -7449 -8089 -9188 -13345 -2714 -2794
6241 -2794 2100 8381 6520 -7442 -6546 -3899 12131 11288 8293 14966 -5193 -9208 8584 28067
6227 28067 18251 -1203 6064 -1342 1560 24660 31214 36146 24266 17361 -7372 -25242 -11359
6214 -11359 7632 9050 11807 20383 20630 23886 -3959 -1717 -5646 5817 21678 31833 13390
6201 13390 15095 5880 9217 8176 -18998 -24078 -22367 -17620 17791 57310 55933 52056 45750 36831
6187 36831 38132 40658 33744 13082 11944 12241 12585 14525 10094 6288 7366 1913 17925 48888
6173 48888 40049 35835 40126 27481 15427 6570 -10412 -11844 -24432 -16162 -3903 -7661 -12723
6160 -12723 -18244 -13423 -22496 -40461 -32651 -7414 -5425 3287 966 -11605 -10629 2712 11374 8428
$$ packed form
6255e991k4872r966L3418K0416P646j9308p017p217N442o40j099m157J0631q0
6241b794M894O281j861j3962Q96K647J6030q43k995O673k0159m015J7792J9483
6227B8067r816j9454P267p406K902K3100O554M932j1880o905k4733j7870J3883
6214a1359J8991J418K757Q576K47L256k7845K242l929J1463J5861J0155j8443
6201A3390J705r215L337j041k7174n080J711M747L5411L9519j377l877o306q919
6187C6831J301K526o914k0662j138K97L44J940m431l806J078n453J6012L0963
6173D8888q839m214M291j2645j2054q857j6982j432j2588Q270J2259l758n062
6160a2723n521M821r073j7965P810K5237J989Q712k321j2571R76J3341Q662k946
$$ plain form
6146 8428 4786 15119 14345 8111 -3184 -13339 -13807 -1934 -4391 -12422 -25072 -21614 1155 -29221
6132 -29221 -39076 -36967 -20151 5162 19387 14185 1195 -11033 -9294 -3520 -1830 14201 9557
6119 9557 -10568 -9704 -19520 -24314 -6970 -2566 -10716 3695 4684 -7476 -2959 -2191 204 7538 -9218
6104 -9218 -11264 4863 11380 -10325 -18156 -16832 -18782 -10325 4875 26305 32530 27393 18487 21914
6090 21914 22239 12756 -1279 -4453 8337 17463 14040 16368 -3417 -3887 -10436 -14148 -10550 -5495
6076 -5495 -4843 -1867 -9443 -10139 -1985 3194 -7811 -1217 22985 18509 -4685 -7462 -2643 7400
6062 7400 19509 25502 18926 3803 7486 13089 232 -2003 -5438 -7401 -1458 -3254 -3254 6680 14951
6047 14951 5398 -11428 -6685 -3904 -6726 -10934 -2544 4024 11033 25125 27330 -434 -15841 -11265
$$ packed form
6146H428l642J0333p74o234j1295j0155m68J1873k457q031j2650L458K2769l0376
6132b9221r855K109J6816K5313J4225n202j2990j2228J739N774J690J6031m644
6119I557k0125Q64r816m794J7344M404q150J4411R89j2160M517P68K395P334j6756
6104i218k046J6127O517k1705p831J324j950Q457J5200K1430O225n137q906L427
6090B1914L25r483j4035l174J2790R126l423K328j9785m70o549l712L598N055
6076e495O52K976p576o96Q154N179j1005O594K4202m476k3194k777M819J0043
6062G400J2109N993o576j5123L683N603j2857k235l435j963N943j796%R934Q271
6047A4951r553j6826M743K781k822m208Q390O568P009J4092K205k7764j5407M576
$$ plain form
6033 -11265 -4559 -9659 -12251 449 20315 15859 17006 22580 38341 17273 5499 6660 1240
6020 1240 -5690 -12952 -11823 16829 18619 9452 6942 -9550 -12602 -1389 604 7514 1215 -1552
6006 -1552 6046 9695 -7046 -13025 -17584 3731 7770 1533 -10756 -5520 3977 16379 25161 17411
5992 17411 11414 3996 -5379 -11888 -7829 3292 1841 27843 33121 16465 9851 16232 11028 2963
5978 2963 18758 4218 -7548 -1636 11884 16922 2665 -11381 -14888 -5654 -9135 -1939 4040
5965 4040 13972 19330 10753 2007 7340 21916 30865 23308 6080 14165 18104 30351 37867 30617
5951 30617 19875 8029 -13168 -21227 -26490 -30676 -20516 -30370 -19702 -8491 350 -1493 -7501
5938 -7501 -14173 -9174 -10628 -9861 2022 6734 4173 -15547 -6177 3859 16085 16100 -7006 -17811
$$ packed form
6033a1265O706n100k592J2700J9866m456J147N574J5761k1068j1774J161n420
6020A240o930p262J129K8652J790r167k510j6492l052J1213J993O910o299k767
6006a552P598L649j6741n979m559K1315M039o237j2289N236R497J2402Q782p750
5992A7411n997p418r375o509M059J1121j451K6002N278j6656o614O381n204q065
5978B963J5795j4540j1766N912J3520N038j4257j4046l507R234l481P196N979
5965D040R932N358q577q746N333J4576Q949p557j7228Q085L939J2247P516p250
5951C0617j0742j1846k1197q059n263m186J0160r854J0668J1211Q841j843o008
5938g501o672M999j454P67J1883M712k561j9720R370J0036J2226J5k3106j0805
$$ plain form
5924 -17811 -5358 8710 15945 2890 5758 8770 5442 27357 23792 -14574 -17907 -26609 -28403
5911 -28403 -22459 -13441 -12728 -28528 -36957 -32672 -31968 -14397 4075 6718 2399 15457 24707 38566
5897 38566 20539 14910 25756 20867 8588 -10934 -22456 -16475 2517 7363 4374 11200 8934
5884 8934 2868 -13579 -15656 -12671 -14189 -9597 -22553 -28420 -28327 -18042 -10898 -17779 -21333 -34018
5870 -34018 -37220 -20041 1784 3107 10363 15902 6496 -7412 -4377 -7190 -14615 1473 -12567
5857 -12567 -27849 -5295 8111 13825 -8999 -12561 -11258 -8863 -10561 -16726 -18438 -9137 -7800 -4445
5843 -4445 -10424 3655 1645 -7164 -957 -4661 -6115 8365 930 -563 -17241 -31581 -8976 5457
5829 5457 -13240 -32789 -29478 -25450 -28490 -8534 -2350 -5016 181 7222 12301 7191 9526 -1096
$$ packed form
5924a7811J2453J4068P235j3055K868L012l328K1915l565l8366l333q702j794
5911b8403N944R018P13j5800q429M285P04J7571J8472K643m319J3058R250J3859
5897C8566j8027n629J0846m889j2279j9522j1522N981J8992M846k989O826k266
5884H934o066j6447k077K985j518M592j2956n867R3J0285P144o881l554j2685
5870c4018l202J7179K1825J323P256N539r406j3908L035k813p425J6088j4040
5857a2567j5282K2554J3406N714k2824l562J303K395j698o165j712R301J337L355
5843d445n979J4079k010q809O207l704j454J4480p435j493j6678j4340K2605J4433
5829E457j8697j9549L311M028l040J9956O184k666N197P041N079n110K335j0622
$$ plain form
5815 -1096 -511 9875 -7205 -11448 -6749 -6763 2976 -8230 -13616 -7106 -2145 2624 -12593 -20325 -11643
5800 -11643 -24509 -37199 -45872 -42609 -23532 1578 13795 39202 29449 -1903 -22809 -20930 -35543
5787 -35543 -33919 -21813 -13801 -2448 10041 21468 27620 18113 1858 -6230 7396 21807 4616
5774 4616 14001 25811 24310 6616 -12332 -5809 -6374 -21887 -19405 -2748 5760 18496 27929 30406
5760 30406 17084 16463 4506 8275 12852 -731 -21308 -28025 -18539 -15208 -29834 -26951 -12929
5747 -12929 -836 -5980 -5316 1324 -19519 -22390 -22016 -18083 -16448 -13259 -24981 -39072 -34014 -23679
5733 -23679 -632 2981 -183 15063 27090 -4215 -11162 -10874 -5482 6488 3173 6643 15313 13617
5719 13617 17105 -2171 -2319 -9891 -8146 -7213 10250 415 3814 -6613 -22347 -17787 -16120 -3302
$$ packed form
5815a096N85J0386j7080m243M699j4R739j1206n386O510M961M769j5217p732Q682
5800a1643j2866j2690q673L263J9077K5110J2217K5407r753l1352k0906J879j4613
5787c5543J624J2106Q012J1353J2489J1427O152r507j6255q088J3626J4411j7191
5774D616R385J1810j501j7694j8948O523n65j5513K482J6657Q508J2736R433K477
5760C0406j3322o21j1957L769M577j3583k0577o717R486L331j4626K883J4022
5747a2929J2093n144O64O640k0843k871L74L933J635L189j1722j4091N058J0335
5733b3679K3047L613l164J5246J2027l1305o947K88N392J1970l315L470Q670j696
5719A3617L488j9276j48p572J745R33J7463r835L399j0427j5734M560J667J2818
$$ plain form
5705 -3302 11072 5643 14292 37614 39433 15882 4503 4128 -22531 -16314 -5538 -16726 -21732
5692 -21732 -7962 -7564 -7992 -7735 -15944 -17659 -23039 -11868 -14397 -15391 -4486 7372 5338 -11456
5678 -11456 -5644 -731 13595 3499 -13907 -5872 9897 -2207 -6622 -7305 -26268 -47651 -35968
5665 -35968 -28567 -3938 13551 -2575 -3889 9467 11934 3318 7589 -2292 -13486 -12861 -30940
5652 -30940 -23067 -1157 6599 -6504 -11157 -15096 -6186 -3618 11324 -1491 -14994 4898 10351
5639 10351 5019 -2663 -17648 -26083 -28334 -24738 -9686 9443 22978 25616 16647 -7230 -25779
5626 -25779 -22592 -19238 -26506 -29435 -21326 -14641 -7569 2186 1233 4365 -4671 -14039 -20030 -4842 -47
5611 -47 7268 19804 13911 3236 6159 -8590 -8411 -5507 -11518 -6486 -6764 -3746 -6220 2852 -13151
$$ packed form
5705c302J4374n429Q649K3322J819k3551j1379l75k6659O217J0776j1188n006
5692b1732J3770L98m28K57q209j715n380J1171k529r94J0905J1858k034j6794
5678a1456N812M913J4326j0096j7406Q035J5769j2104m415o83j8963k1383J1683
5665c5968P401K4629J7489j6126j314J3356K467q616M271r881j1194O25j8079
5652c0940P873K1910P756j3103m653l939Q910K568J4942j2815j3503J9892N453
5639A0351n332p682j4985q435k251L596J5052J9129J3535K638q969k3877j8549
5626b5779L187L354p268k929Q109O685P072R755r53L132r036r368n991J5188M795
5611d7P315J2536n893j0675K923j4749J79K904o011N032k78L018k474R072j6003
$$ plain form
5596 -13151 -28076 -25537 -24036 -15786 -24869 -15779 939 -6813 -23636 -11568 -1761 -19628 -33245
5583 -33245 -39818 -25298 -23584 -21437 -24544 -41494 -33577 -16860 -6625 -10490 -6816 -13856 -24417
5570 -24417 -15023 -35064 -34515 -33393 -23374 -1302 -1090 -3045 511 795 10194 2523 5455 12005 18927
5555 18927 28569 35720 27961 22053 3957 8377 6192 -7568 20552 12421 -4269 -3263 -4664 -3817
5541 -3817 3008 9310 8760 -1774 -18403 -3964 13281 19824 6415 5872 5511 6193 14408 13249 520
5526 520 -6913 -9280 -648 -3884 -2501 6536 10153 7606 -6413 -13595 -11156 -12237 5313 9442 18288
5511 18288 11222 -6115 -22039 -7503 22145 26042 6246 -3723 1694 -3293 -11308 -22403 -17550
5498 -17550 -15240 -24853 -16512 7159 6279 26963 31251 21699 18474 15736 1214 -5846 8313 27011
$$ packed form
5596a3151j4925K539J501Q250r083R090J6718p752j6823J2068R807j7867j3617
5583c3245o573J4520J714K147l107j6950P917J6717J0235l865L674p040j0561
5570b4417R394k0041N49J122J0019K2072K12j955L556K84R399p671K932O550O922
5555A8927R642P151p759n908j8096M420k185j3760K8120q131j6690J006j401Q47
5541c817O825O302n50j0534j6629J4439J7245O543j3409n43l61O82Q215j159j2729
5526E20p433k367Q632l236J383R037L617k547j4019p182K439j081J7550M129Q846
5511A8288p066j7337j5924J4536K9648L897j9796r969N417m987q015j1095M853
5498a7550K310r613Q341K3671q80K0684M288r552l225k738j4522p060J4159J8698
$$ plain form
5484 27011 22524 30750 29689 23863 12340 1700 -6158 -10847 -11012 -10819 -8249 -1825 -9802 -2924 15386
5469 15386 17261 11720 -2532 4424 25361 23233 -5622 -15295 -18237 -19710 -11124 -5545 590 -247
5455 -247 -28709 -23053 -30773 -32368 -23511 -17538 -8192 -14182 -8743 -1866 16004 17986 18228 7698 -10232
5440 -10232 -13882 -21430 -3546 -16012 -33965 -38269 -40945 -35982 -43685 -39506 -40447 -49548 -50383 -25618
5426 -25618 -6942 -5337 -339 -2871 -7891 8885 16161 21674 23441 1071 -10941 -603 10067
5413 10067 -1639 12411 41483 32975 4976 -13203 -15153 -8961 -13495 -16380 7328 12985 16348
5400 16348 25084 13550 -1398 -6092 -2880 -4873 2182 -2254 -5754 -11965 -21825 -6475 -406 -10917
5386 -10917 -6552 1451 -6347 -16411 -16390 -8878 -7693 583 1530 14642 13997 9675 9422 9691 27340
$$ packed form
5484B7011m487Q226j061n826j1523j0640p858m689j65J93K570O424p977O878J8310
5469A5386J875n541j4252O956K0937k128k8855r673k942j473Q586N579O135q37
5455b47k8462N656p720j595Q857N973R346n990N439O877J7870J982K42j0530j7930
5440a0232l650p548J7884j2466j7953m304k676M963p703M179r41r101q35K4765
5426b5618J8676J605M998k532n020J6776P276N513J767k2370j2012J0338J0670
5413A0067j1706J4050K9072q508k7999j8179j950O192m534k885K3708N657L363
5400A6348Q736j1534j4948m694L212j993P055m436l500o211r860J5350O069j0511
5386a0917M365Q003p798j0064K1P512J185Q276R47J3112o45m322k53K69J7649
$$ plain form
5371 27340 50870 37722 4167 -8808 -26882 -12097 28256 20532 -689 -1712 19163 31427
5359 31427 34825 39915 24366 12159 20778 14781 -3126 -5301 6908 194 -710 -810 14185 19001
5345 19001 21023 7138 1971 1141 499 -14014 -928 10617 11347 9834 11722 10392 9894 31253
5331 31253 35204 27835 15115 15079 5106 -13126 -6013 -6381 1702 8594 21546 20035 7118 -24393
5317 -24393 -23477 -5353 -3594 9789 2952 11466 26414 14347 -15980 -17952 13586 27261 11688
5304 11688 9371 21103 35683 29208 7262 -18157 -20608 -5148 4813 4919 7734 4072 -8417
5291 -8417 1295 27620 46771 25401 12205 1102 3137 -12101 -6517 612 -6944 -18793 -17003
5278 -17003 2178 -7439 -14453 -15010 -7560 -12611 -21039 -15514 12718 27336 19902 11960 841 -6654
$$ packed form
5371B7340K3530j3148l3555j2975j8074J4785M0353p724k1221j023K0875J2264
5359C1427L398N090j5549j2207Q619n997j7907k175J2209o714r04j00J4995M816
5345A9001K022j3885n167q30o42j4513J3086J1545P30j513J888j330m98K1359
5331C1253L951p369j2720l6r973j8232P113l68Q083O892J2952j511j2917l1511
5317b4393R16J8124J759J3383o837Q514J4948j2067l0327j972L1538J3675j5573
5304A1688k317J1732J4580o475k1946k5419k451J5460R961J06K815l662j2489
5291h417R712K6325J9151k1370j3196j1103K035j5238N584P129p556j1849J790
5278a7003J9181r617p014n57P450n051q428N525K8232J4618p434p942j1119p495
$$ plain form
5264 -6654 -23236 -15023 -22506 -26154 -18355 652 16828 20808 12907 11145 13132 11169 13457 11337
5250 11337 -1363 12754 12396 5265 -14305 -25502 -22510 -18932 -19711 3088 11426 2539 -1356 3245
5236 3245 -12697 -17784 8382 -983 -1478 5313 782 -11253 -825 -9579 -20595 -33113 -18969
5223 -18969 -3803 4931 -2351 -8872 334 1437 -9588 -10142 -14209 -13385 -23642 -26532 -5345 524
5209 524 4778 12458 2551 -3930 -5994 -4660 8371 -5458 -6392 -3823 -5274 2454 15683 25686
5195 25686 32030 36341 6096 -4997 -3312 -12371 -19867 -20588 8507 24579 1208 -9980 -33779
5182 -33779 -21677 13951 9947 -19630 -19475 -31204 -36228 -14866 652 14742 2919 -4550 -14524
5169 -14524 -24478 -14450 -11814 -27159 -27802 -32803 -28550 -21979 -28906 -27210 -2149 22192 8989 3517
$$ packed form
5264f654j6582Q213p483l648P799J9007J6176L980p901j762J987j963K288k120
5250A1337j2700J4117l58p131j9570j1197K992L578p79K2799Q338q887l895M601
5236C245j5942n087K6166r365m95O791m531j2035J0428q754j1016j2518J4144
5223a8969J5166Q734p282o521R206J103j1025n54m067Q24j0257k890K1187N869
5209E24M254P680r907o481k064J334J3031j3829r34K569j451P728J3229J0003
5195B5686O344M311l0245j1093J685r059p496p21K9095J6072k3371j1188k3799
5182c3779J2102L5628m004k9577J55j1729n024K1362J5518J4090j1823p469r974
5169a4524r954J0028K636j5345o43n001M253O571o927J696K5061K4341j3203n472
$$ plain form
5155 3517 -14145 -10484 8680 19372 21344 13050 5212 -2139 -5772 25510 43159 43143 40332 33002
5141 33002 22245 26047 17576 11713 -1320 -21775 -14641 8091 1807 -14433 -22029 -19609 -11668
5128 -11668 1350 9248 18786 37246 27147 -5929 -15172 -13735 -4778 7905 11080 12815 29685
5115 29685 31923 1275 -18088 -6720 3544 4915 14535 12099 -23742 -21620 -6020 -11141 -8419
5102 -8419 -16286 -31556 -30197 -20884 -27347 -20342 -6904 -4124 -10697 -15942 -37437 -42686 -41208 -18231
5088 -18231 1068 13616 16236 -13071 -11455 11663 7534 15713 39747 46629 25927 10803 27020
5075 27020 35574 20986 -11856 -33318 -23772 -17335 7122 12254 544 -9635 -17619 -10529 -15543
5062 -15543 -29665 -22587 -12491 5115 15519 14655 6319 -4184 16547 15324 2624 6380 9386
$$ packed form
5155C517j7662L661J9164J0692J972q294p838p351l633L1282J7649j6k811p330
5141C3002j0757L802q471n863j3033k0455P134K2732o284j6240p596K420P941
5128a1668J3018P898R538J8460j0099l3076r243J437Q957J2683L175J735J6870
5115B9685K238l0648j9363J1368J0264J371R620k436l5841K122J5600n121K722
5102h419p867j5270J359R313o463P005J3438K780o573n245k1495n249J478K2977
5088a8231J9299J2548K620k9307J616K3118m129Q179K4034O882k0702j5124J6217
5075B7020Q554j4588l2842k1462R546O437K4457N132j1710j0179p984P090n014
5062a5543j4122P078J0096J7606J0404q64q336j0503K0731j223j2700L756L006
$$ plain form
5049 9386 -22604 -14600 -11490 -16294 -3877 504 -11937 -15401 -9792 -15943 -5465 12607 9993 -7707
5035 -7707 -15361 -11872 -819 17121 22554 20203 16844 28671 30978 24373 115 -6187 8263 -6450
5021 -6450 -13984 -9432 -10993 -31147 -42449 -31979 -20233 -9447 -5599 -13708 5793 9453 -9885
5008 -9885 -17131 -11650 22 15425 10522 8840 5250 -2022 21588 20839 -11449 -12374 -22994 -15514
4994 -15514 -6190 -7605 -14485 -14884 -3393 -901 12904 12055 3198 -3239 5913 5758 29548 45353
4980 45353 40301 21665 410 -8633 -3032 -10562 -2111 7874 3721 6520 17090 10949 11163 -8333
4966 -8333 -9586 723 -14068 -16398 -5861 -1067 1865 1870 1118 -2541 -2426 -8431 -11360 -3493 -1449
4951 -1449 3024 2240 -6050 12573 12264 9816 10497 11586 20553 15932 3465 -14273 -15256 -9353 -20293
$$ packed form
5049I386l1990Q004L110m804J2417M381j2441l464N609o151J0478J8072k614j7700
5035g707p654L489J1053J7940N433k351l359J1827K307o605k4258o302J4450j4713
5021f450p534M552j561k0154j1302J0470J1746J0786L848q109J9501L660j9338
5008i885p246N481J1672J5403m903j682l590p272K3610p49l2288r25j0620P480
4994a5514R324j415o880l99J1491K492J3805q49q857o437R152j55K3790J5805
4980D5353n052j8636k1255r043N601p530Q451R985m153K799J0570o141K14j9496
4966h333j253J0309j4791k330J0537M794K932Np52l659J15o005k929P867K044
4951a449M473p84q290J8623l09k448O81J089Q967m621j2467j7738r83N903j0940
$$ plain form
4936 -20293 11555 13008 -17793 -13309 -1797 16587 25291 13814 -4246 -24515 -27880 3493 18234
4923 18234 11300 4094 -20469 -27094 -28487 -23199 3978 24727 25205 4708 -11985 -10200 -6750 -4587
4909 -4587 5743 10173 19558 24998 31695 25673 39879 17181 -16812 -16822 -9589 -2044 6754 -8813
4895 -8813 -7333 -5956 -14704 -32840 -23706 -1638 5568 8740 1060 -7841 -19591 -16771 -5856 -12318
4881 -12318 -8495 543 6142 -3954 -7459 -5587 -4506 -13398 -3289 17323 976 -9371 -15243
4868 -15243 -31893 -28728 -4260 -3546 -9057 -4694 -6211 -7483 -26212 -38333 -37616 -33509 -35287 -25239
4854 -25239 -21695 -21156 -17106 -4598 98 -14469 -5861 11491 28305 30845 38657 42525 15597 15638
4840 15638 38458 32237 18095 12260 -6472 -4123 467 4165 4448 -4093 -1373 -4362 -612 6588
$$ packed form
4936b0293L1848J453l0801M484J1512J8384Q704j1477j8060k0269l365L1373J4741
4923A8234o934p206k4563o625j393N288K7177K0749M78k0497j6693J785L450K163
4909d587J0330M430R385N440O697o022J4206k2698l3993j0P233P545Q798j5567
4895h813J480J377q748j8136R134K2068P206L172p680q901j1750K820J0915o462
4881a2318L823R038N599j0096l505J872J081q892J0109K0612j6347j0347n872
4868a5243j6650L165K4468P14n511M363j517j272j8729j2121P17M107j778J0048
4854b5239L544N39M050J2508M696j4567Q608J7352J6814K540P812L868k6928M1
4840A5638K2820o221j4142n835j8732K349M590L698K83q541K720k989L750P200
$$ plain form
4826 6588 255 -6599 -22183 -26713 -13104 -3805 -4602 7417 -3527 -18405 -25474 -30979 -17788 -14213
4812 -14213 -29692 -34864 -36807 -17279 3242 -8729 -18668 -13618 -7343 -10014 -6825 9100 -6798
4799 -6798 -12863 -11303 -8592 -4546 6099 5789 -9496 -14599 -18647 -23460 -29817 -17348 11983 18500
4785 18500 15666 17871 16029 21790 9730 16819 22149 13274 7864 -13313 -18613 -7614 -15414 -8212
4771 -8212 6758 5149 12262 8094 4719 -3277 -11211 -12226 -16966 -39202 -26543 -17414 -2712 -5533
4757 -5533 16027 15859 18708 27682 9514 11480 20238 39535 55761 22914 -4492 2809 2197 -16472
4743 -16472 -5173 -8261 -25604 -3780 2629 -7016 -18318 -15066 10709 13642 -171 5599 5630 10682
4729 10682 -507 6426 3222 -2110 -3744 -19929 -33917 -19794 4518 12320 15265 18476 21319
$$ packed form
4826F588o333o854j5584m530J3609R299p97J2019j0944j4878p069n505J3191L575
4812a4213j5479n172j943J9528K0521j1971r939N050O275k671L189J5925j5898
4799f798o065J560K711M046J0645l10j5285n103m048m813o357J2469K9331O517
4785A8500k834K205j842N761j2060P089N330q875n410k1177n300J0999p800P202
4771h212J4970j609P113m168l375p996p934j015m740k2236J2659R129J4702k821
4757e533K1560j68K849Q974j8168J966Q758J9297J6226l2847k7406P301o12j8669
4743a6472J1299l088j7343K1824O409r645j1302L252K5775K933j3813N770L1N052
4729A0682j1189O933l204n332j634j6185j3988J4123K4312P802K945L211K843
$$ plain form
4716 21319 11011 -17917 -7184 8816 20410 3413 -3405 3158 -3924 6629 13070 4829 3283
4703 3283 -13548 -16145 -8107 228 -7253 -12465 2552 -3205 -18400 -27728 -28322 -25430 -34485 -28126
4689 -28126 -27996 -15605 -4650 811 -6001 -13031 -3233 -3353 -15108 -22130 -18269 -26153 -32662 -27685
4675 -27685 -15846 -14902 -4873 -2975 13398 12982 20836 9378 9923 10391 -346 13190 15011 6874
4661 6874 3504 1763 -5083 -6057 -1585 4694 -4081 -138 20240 14514 4024 -9024 -23056 -38355
4647 -38355 -48151 -38933 -20503 601 -1630 3099 18796 9046 9036 -6 -26639 -26624 -23130 -20218 -21903
4632 -21903 677 3115 5274 -2767 6626 -1572 -38149 -26551 -3276 10793 8974 28346 41315
4619 41315 28317 27327 4536 -15849 -34430 -25100 -19429 -27945 -9435 -5770 -10191 -5604 25725
$$ packed form
4716B1319j0308k8928J0733J6000J1594j6997o818O563p082J0553O441q241j546
4703C283j6831k597Q038Q335p481n212J5017n757j5195r328n94K892r055O359
4689b8126J30J2391J0955N461o812p030R798j20j1755p022L861p884o509M977
4675b7685J1839R44J0029J898J6373m16P854j1458N45M68j0737J3536J821q137
4661F874l370j741o846r74M472O279q775L943K0378n726j0490j3048j4032j5299
4647c8355r796R218J8430K1104k231M729J5697r750j0r042k6633J5L494K912j685
4632b1903K2580K438K159q041R393q198l6577J1598K3275J4069j819J9372J2969
4619D1315j2998r90k2791k0385j8581R330N671q516J8510L665m421M587L1329
$$ plain form
4606 25725 36551 25102 13020 2399 14854 21007 27547 18103 9728 7959 -1217 -24213 -23199
4593 -23199 -29069 -35890 -32460 -10571 13202 14070 1533 17212 34598 9798 -1859 -10849 -2331
4580 -2331 17469 22785 -4017 -15346 13766 3403 -23886 -26999 -18878 -3660 15303 -21527 -25392
4567 -25392 -1601 3802 7760 1824 475 -6742 -19298 -5509 10021 8015 6488 -6476 -11116
4554 -11116 -9529 -9626 6135 7213 -2031 -7671 1378 6790 22964 15590 -3202 18081 36351 30962
4540 30962 9746 5700 5148 -2461 7594 16568 21108 9102 7947 7735 16059 9935 72 -12957
4526 -12957 -18657 -5698 -3865 -17624 -18656 -3070 6668 -6307 -3381 16807 17039 17194 17092 16697
4512 16697 -337 -13347 -15996 -9097 24555 32612 7432 -2096 -839 -16096 2474 24344 7517
$$ packed form
4606B5725J0826j1449j2082j0621J2455O153O540r444q375j769r176k2996J014
4593b3199n870o821L430K1889K3773Q68j2537J5679J7386k4800j1657q990Q518
4580b331J9800N316k6802j1329K9112j0363k7289l113Q121J5218J8963l6830l865
4567b5392K3791N403L958n936j349p217j2556J3789J5530k006j527j2964m640
4554a1116J587r7J5761J078r244n640R049N412J6174p374j8792K1283J8270n389
4540C0962k1216m046n52p609J0055Q974M540j2006j155k12Q324o124r863j3029
4526a2957n700J2959J833j3759j032J5586R738j2975K926K0188K32J55j02l95
4512A6697j7034j3010k649O899L3652Q057k5180r528J257j5257J8570K1870j6827
$$ plain form
4499 7517 -1915 5335 7563 16501 -642 -24417 -23593 -28574 -22911 -39823 -11521 4750 13309 7744
4485 7744 -11807 -18728 -36130 -41449 -40508 -24147 4807 13642 1832 8330 4241 -4665 5436 16061
4471 16061 18662 2884 -7506 -9722 343 -7100 -20118 -11705 -12997 -12554 -8800 13893 17603 28796
4457 28796 23386 -4038 -3782 -8986 -24533 -11362 -1970 -14874 -6062 -788 -23876 -35859 -29505
4444 -29505 -9783 14326 6333 -8876 -20362 -11170 -3111 8961 11611 19924 28304 26148 2127
4431 2127 6569 -1464 -13584 -4226 -12886 -16444 -33866 -39999 -36375 -37457 -15484 17397 31958 16874
4417 16874 13087 18870 7198 4694 6694 4687 7236 11481 8073 1882 8047 26785 6669 -13992
4403 -13992 -30177 -41553 -34777 -36081 -33944 -13839 -21598 -4106 12928 11337 7496 1936 -6376
$$ packed form
4499G517r432P250K228Q938j7143k3775Q24m981N663j6912K8302J6271Q559n565
4485G744j9551o921j7402n319R41J6361K8954Q835j1810O498m089q906J0101J0625
4471A6061K601j5778j0390k216J0065p443j3018Q413j292M43L754K2693L710J1193
4457B8796n410k7424K56n204j5547J3171R392j2904Q812N274k3088j1983O354
4444b9505J9722K4109p993j5209j1486R192Q059J2072K650Q313Q380k156k4021
4431B127M442q033j2120R358q660l558j7422o133L624j082K1973L2881J4561j5084
4417A6874l787N783j1672k504K000k007K549M245l408o191O165J8738k0116k0661
4403a3992j6185j1376O776j304K137K0105p759J7492J7034j591l841n560q312
$$ plain form
4390 -6376 -19363 -24099 -30795 -22075 -25585 -32508 -8730 8833 28977 13227 -4052 3301 -2326
4377 -2326 16317 8718 -16143 -12794 -6021 -488 8523 20609 15423 20681 15064 -2327 -22702 -23958
4363 -23958 2325 27491 33783 30105 24787 13538 28920 46182 32193 11773 12225 20094 13726
4350 13726 -6846 -25832 -12590 10781 16162 11570 -24359 -52043 -57251 -38990 -38046 -50743 -41030
4337 -41030 -26801 -18873 -28957 -38816 -33900 -26776 -9774 1184 -7868 -42221 -62504 -47353 -41131
4324 -41131 -20527 -5706 -84 1035 13031 23189 12312 13482 19610 10011 -17319 -28442 -31324
4311 -31324 -39602 -30888 -46057 -39843 -11322 -443 -11495 3851 -1736 -14527 -11512 -7627 4649
4298 4649 8869 8371 29719 19011 2676 -10740 -32438 -36112 -27630 -21068 -12404 3726 -4663 -15698
$$ packed form
4390f376j2987m736o696Q720l510o923K3778J7563K0144j5750j7279P353n627
4377b326J8643p599k4861L349O773N533R011J2086n186N258n617j7391k0375j256
4363b3958K6283K5166O292l678n318j1249J5382J7262j3989k0420M52P869o368
4350A3726k0572j8986J3242K3371N381m592l5929k7684n208J8261R44j2697R713
4337d1030J4229P928j0084r859M916P124J7002J0958r052l4353k0283J5151O222
4324d1131K0604J4821N622J119J1996J0158j0877J170O128r599k7330j1123k882
4311c1324q278Q714j5169O214K8521J0879j1052J5346n587j2791L015L885J2276
4298D649M220m98K1348j0708j6335j3416k1698l674Q482O562Q664J6130q389j1035
$$ plain form
4284 -15698 -12531 -4687 362 -14423 -18146 -10384 -3050 17828 16756 -12894 -27367 -1660 11069
4271 11069 -6732 -25993 -20347 -19182 -34029 -28586 -13604 5421 22038 13762 28655 26809 9103
4258 9103 341 -14857 -16298 7983 8926 2251 -16836 -35486 -26112 -12418 -6468 -5715 -11306 -5510
4244 -5510 -15677 -36191 -26746 -5113 1476 2913 3377 23701 28435 22021 3776 2555 -3710 -16878
4230 -16878 -7294 11724 4517 -9688 -16939 -18537 -32199 -37395 -22166 -8555 11843 28734 22077
4217 22077 14347 19900 17132 2246 -19921 -7452 2252 -2807 -8216 -3881 18086 21728 5030
4204 5030 -5621 -12082 -18512 -24330 -26491 -25968 -12178 -1441 -15130 -12273 -14668 -2040 -4975 -9364
4190 -9364 -11902 -23504 -8718 7098 28277 27894 12980 -8707 -26720 -25185 -22341 -13554 1490
$$ packed form
4284a5698L167P844N049j4785l723P762P334K0878j072k9650j4473K5707J2729
4271A1069j7801j9261N646J165j4847N443J4982J9025J6617q276J4893j846j7706
4258I103q762j5198j441K4281R43o675j9087j8650R374J3694N950P53n591N796
4244e510j0167k0514R445K1633O589J437M64K0324M734o414j8245j221o265j3168
4230a6878R584J9018p207j4205p251j598j3662n196J5229J3611K0398J6891o657
4217B2077p730N553k768j4886k2167J2469R704n059n409M335K1967L642j6698
4204E030j0651o461o430n818k161N23J3790J0737j3689K857k395J2628k935m389
4190i364k538j1602J4786J5816K1179l83j4914k1687j8013J535K844Q787J5044
$$ plain form
4177 1490 5668 16482 11107 6617 13088 3576 1119 17557 19793 -2331 -23921 -24289 -22161 -17321
4163 -17321 -11865 -14492 -18071 -34805 -40932 -30833 -29115 -4371 14564 1223 -17109 -11883 -10579
4150 -10579 -21314 -27813 -20565 -6428 6090 11789 -3481 -29653 -26903 -9561 6462 19132 11914
4137 11914 -11720 -30293 -39407 -35642 -37262 -32784 -19499 -11180 -17481 -21488 -6735 9097 19371
4124 19371 10046 -2692 -14890 -6030 -374 1304 9185 10940 -6204 -25814 -13621 -1442 -2538
4111 -2538 6109 8824 9766 581 -6167 -12511 -8958 -6148 4480 14318 -2039 -27505 -39386 -13204
4097 -13204 2147 16740 21195 20077 15515 1599 1886 15743 33716 46105 35048 16403 -1790
4084 -1790 -10481 -3972 18929 17130 21310 14311 -2909 -13331 -18464 -29949 -3416 6617 -12152
$$ packed form
4177A490M178J0814n375m490O471r512k457J6438K236k2124k1590l68K128M840
4163a7321N456k627l579j6734o127J0099J718K4744J8935j3341j8332N226J304
4150a0579j0735o499P248J4137J2518N699j5270k6172K750J7342J6023J2670p218
4137A1914k3634j8573r114L765j620M478J3285Q319o301m007J4753J5832J0274
4124A9371r325j2738j2198Q860N656J678P881J755j7144j9610J2193J2179j096
4111b538Q647K715R42r185o748o344L553K810J0628R838j6357k5466j1881K6182
4097a3204J5351J4593M455j118m562j3916K87J3857J7973J2389j1057j8645j8193
4084a790q691O509K2901j799M180o999j7220j0422n133j1485K6533J0033j8769
$$ plain form
4071 -12152 -27030 -22137 -7172 12077 22452 22825 13447 25688 11501 -10729 -12295 12520 30222
4058 30222 22348 1426 -562 9136 -2171 -3324 -3528 -7340 -24623 -28532 -19286 -17415 -8890 -7276
4044 -7276 -23478 -18967 -26327 -31542 -17692 -4527 -6835 -13329 -4763 -11059 -34720 -50028 -57505 -50987
4030 -50987 -22823 -20195 -10092 3856 4626 8256 5568 12222 10848 -7517 -5356 27351 27133 8126
4016 8126 8366 5040 -5479 -24257 -36083 -21608 -25866 -40954 -33514 -29461 -15732 3998 -8750
4003 -8750 -24216 -23093 -6490 -238 -12128 -10951 -8208 -10009 5328 3041 -6632 -5622 2272 -2998
3989 -2998 -19684 -38406 -16564 -8504 -693 11878 27116 8333 2983 4034 8867 14973 14335 3824
3975 3824 7669 2558 -9728 -16428 -503 -2494 -984 4391 1970 -12533 -32960 -25713 -26030 -40560
$$ packed form
4071a2152j4878M893J4965J9249J0375L73r378J2241j4187k2230j566K4815J7702
4058C0222p874k0922j988R698j1307j153k04l812j7283l909R246J871Q525J614
4044g276j6202M511p360n215J3850J3165k308o494Q566o296k3661j5308p477O518
4030e0987K8164K628J0103J3948P70L630k688O654j374j8365K161L2707k18j9007
4016H126K40l326j0519j8778j1826J4475m258j5088P440M053J3729J9730j2748
4003h750j5466J123J6603O252j1890J177K743j801J5337k287r673J010P894n270
3989b998j6686j8722K1842Q060P811J2571J5238j8783n350J051M833O106o38j0511
3975C824L845n111j2286o700J5925j991J510N375k421j4503k0427P247l17j4530
$$ plain form
3961 -40560 -35024 -23872 -22381 -26282 -8068 -12340 -14775 4217 9248 5189 -16603 -24658 -21084 -15317
3947 -15317 -9819 -21328 -16582 -9306 -14599 -14070 -239 -3807 1316 -11810 -17417 6086 3248 13299
3933 13299 3057 -12090 -3340 -2207 -13351 -13467 -5895 -3416 11031 22486 31640 29747 30712 18333
3919 18333 15308 3925 10902 10424 7645 8343 -73 9983 -5800 -27477 -30717 -26727 -27003 -27297 -20828
3904 -20828 -8380 -16206 -32721 -35702 -35334 -27198 -4442 -5690 -4450 -2139 -4789 -14552 -32232 -25313
3890 -25313 -5166 -5262 -14673 -15229 1969 -18070 -32343 -20570 -10093 -2786 -9342 -21071 -11592 -3554
3876 -3554 -16599 -21296 -12178 -16036 -5604 20409 25971 8870 -4534 -2014 8536 17619 28187
3863 28187 27693 23914 13098 -11636 -18046 -2532 19374 35046 31344 -11806 -25962 -23490 -33206
$$ packed form
3961d0560N536J1152J491l901J8214m272k435J8992N031m059k1792q055L574N767
3947a5317N498j1509M746P276n293N29J3831l568N123j3126n607K3503k838J0051
3933A3299j0242j5147Q750J133j1144j16P572K479J4447J1455R154j893R65j2379
3919A8333l025j1383O977m78k779O98q416J0056j5783k1677l240L990k76k94O469
3904b0828J2448p826j6515k981L68Q136K2756j248J240K311k650r763j7680O919
3890b5313K0147r6r411n56J7198k0039j4273J1773J0477P307o556j1729R479Q038
3876c554j3045m697R118l858J0432K6013N562j7101j3404K520J0550R083J0568
3863B8187m94l779j0816k4734o410J5514K1906J5672l702m3150j4156K472r716
$$ plain form
3850 -33206 -39806 -29498 -16901 -20823 -21050 -15569 -16929 -24580 -34873 -1166 20352 21681 23526 5056
3836 5056 -6529 284 -835 10131 8252 7017 -441 9190 299 -22329 -29225 -13292 -15936 -953
3822 -953 -1946 1299 12432 11898 8636 15305 15776 20564 15360 8001 4306 14010 19378 16647 20546 17525
3806 17525 30046 32309 19632 3559 1123 5771 11274 27184 21462 10599 -1691 -3501 8376
3793 8376 20468 2500 -2893 -1796 5930 -3527 -12598 -5290 -9842 -22534 -28710 -29146 -2069 16204
3779 16204 27792 16557 -1744 9019 -8280 -13944 13411 13555 -6348 -6214 12198 3126 19103
3766 19103 22975 15097 11879 13346 9255 3948 -1107 -6383 3956 8557 -8406 408 4232 -16167
3752 -16167 -32121 -50296 -41665 -34871 -22824 -26231 -39866 -34117 -34946 -14219 -9036 -17771 5294
$$ packed form
3850c3206o600J0308J2597l922k27N481j360p651j0293L3707K1518J329J845j8470
3836E056j1585O813j119J0966j879j235p458R631q891k2628o896J5933k644J4983
3822i53r93L245J1133n34l262O669M71M788n204p359l695R704N368k731L899l021
3806A7525J2521K263j2677j6073k436M648N503J5910n722j0863j2290j810J1877
3793H376J2092j7968n393J097P726r457r071P308m552j2692o176m36K7077J8273
3779A6204J1588j1235j8301J0763j7299n664K7355J44j9903J34J8412r072J5977
3766A9103L872p878l218J467m091n307n055n276J0339M601j6963Q814L824k0399
3752a6167j5954j8175Q631O794J2047l407j3635N749q29K0727N183q735K3065
$$ plain form
3739 5294 5876 8383 14788 -2424 -13241 -15721 -14536 -5050 3488 4733 -3377 3097 6140 -11436
3725 -11436 -7100 6915 -4597 -24508 -6368 1812 8461 25193 26777 10862 10642 4664 -6964
3712 -6964 -12763 -6151 -5956 -4119 -11418 -5366 15546 15094 11978 644 1829 11378 -3507 -32655
3698 -32655 -21850 -17105 -18710 -715 1225 4226 -635 -25999 -21184 -7819 -8977 -8232 -6446 -13518
3684 -13518 -888 -588 -6452 -1482 -568 -9404 -12962 -22089 -28377 -28940 -27243 -21769 -11407 -256 -3080
3669 -3080 -9491 -12898 436 18477 11118 19087 14774 261 -4601 -15057 -6380 -12888 -21837 -34264
3655 -34264 -17706 -307 8 -10337 -2833 8547 -5752 -18442 -15466 -22295 -11567 6255 3824
3642 3824 -4228 3892 1500 10433 23993 21811 2237 -220 2271 2253 -9736 -6562 9070 8645 10904
$$ packed form
3739E294N82K507O405j7212j0817k480J185R486Q538J245q110O474L043j7576
3725a1436M336J4015j1512j9911J8140Q180O649J6732J584j5915k20n978j1628
3712f964n799O612J95J837p299O052K0912m52l116j1334J185R549j4885k9148
3698c2655J0805M745j605J7995J940L001m861k5364M815J3365j158P45J786p072
3684a3518J2630L00n864M970R14q836l558r127o288n63J697N474J0362J1151k824
3669c080o411l407J3334J8041p359P969m313j4513m862j0456Q677o508q949j2427
3655c4264J6558J7399L15j0345P504J1380j4299j2690K976o829J0728J7822k431
3642C824q052Q120k392Q933J3560k182j9574k457K491j8j1989L174J5632m25K259
$$ plain form
3627 10904 -5222 -16641 -22375 -16482 -17097 -21722 -16146 -19230 -11721 5019 -16399 -19790 -30191 -24695
3613 -24695 -12199 -16592 -16113 -21402 -14507 -14717 -4536 19334 18344 255 -17833 -9988 2116 5951
3599 5951 9168 1396 -4118 -11596 -12846 47 4589 -59 4653 6502 7712 -1333 195 6639 -8604
3584 -8604 -20052 -7957 -5869 5393 15054 -5833 -12348 -17540 -12176 11683 9823 1582 10457 678
3570 678 -25177 -29890 -15561 -22431 -24364 -31640 -40416 -26591 -27880 -32611 -37381 -39882 -37616 -28329
3556 -28329 -18038 -25320 -21701 -8700 -5355 3167 -3815 -10634 -6664 -4603 2063 -2281 -6620 -2405
3542 -2405 6867 5926 -10253 -2118 17253 16543 4638 5253 26233 35242 40067 27024 -11866 -10306
3528 -10306 1365 -3236 -5856 -12638 -23470 -20948 -14047 -3888 -13579 -23531 -24435 -11840 3674 19056
$$ packed form
3627A0904j6126j1419n734N893o15m625N576l084P509J6740k1418l391j0401N496
3613b4695J2496m393M79n289O895k10J0181K3870r90j8089j8088P845J2104L835
3599E951L217p772n514p478j250J2893M542m648M712J849J210r045J528O444j5243
3584h604j1448J2095K088J1262R661k0887o515n192N364K3859j860q241Q875r779
3570F78k5855m713J4329o870j933p276q776J3825j289m731m770k501K266R287
3556b8329J0291p282L619J3001L345Q522o982o819L970K061O666m344m339M215
3542b405R272r41j6179Q135J9371p10j1905O15K0980R009M825j3043l8890J560
3528a0306J1671m601k620o782j0832K522O901J0159r691r952r04J2595J5514J5382
$$ plain form
3514 19056 21312 43859 50484 29778 9879 -11207 -27371 -37190 -34761 -14997 4503 22525 39692
3501 39692 28515 21820 -3552 -7167 14487 9648 -4957 -9720 -12560 6762 3883 -6582 -19936
3488 -19936 -18305 -22987 -20150 -22182 -8191 3944 10693 16238 19154 14458 -14449 -29704 -30156 -32637
3474 -32637 -1468 21017 15023 15676 6328 1955 -22960 -13616 -3659 -9795 -24530 -23250 -18502 -23402
3460 -23402 -2713 3945 -6171 1009 -7324 -25394 3766 19642 14393 16854 6316 3704 12257
3447 12257 2891 -24174 -24512 -22781 -26282 -3452 9147 9377 9088 -1098 -9889 -4130 -8492 5426
3433 5426 115 -12132 -12831 -216 -400 -4200 2870 2009 -16811 -21711 -17160 -16929 -26033 -28098 -22012
3418 -22012 -13473 1028 1022 -8172 -8344 3756 2490 -2875 2753 1349 9821 13614 18500 8955 19262
$$ packed form
3514A9056K256K2547O625k0706j9899k1086j6164r819K429J9764J9500J8022J7167
3501C9692j1177o695k5372l615K1654m839j4605m763k840J9322k879j0465j3354
3488a9936J631m682K837k032J3991J2135O749N545K916m696k8907j5255m52k481
3474c2637L1169K2485n994O53r348m373k4915R344R957o136j4735J280M748m900
3460b3402K0689O658j0116P180q333j8070K9160J5876n249K461j0538k612Q553
3447A2257r366k7065l38J731l501K2830J2599K30k89j0186q791N759m362J3918
3433E426n311j2247o99J2615j84l800P070q61j8820m900M551K31r104k065O086
3418b2012Q539J4501or194j72J2100j266n365N628j404Q472L793M886r545J0307
$$ plain form
3403 19262 26289 17617 8762 -5342 -10754 -23403 -26654 -31644 -20633 -6421 -21705 -6785 -2539
3390 -2539 568 1325 112 1200 -11075 -20093 -16022 333 11199 -2114 -5595 -3459 -14065 -12942
3376 -12942 -17355 -23326 -19152 -14395 5552 5923 -11910 -15473 -25370 -31393 -5030 301 -4088 -14055
3362 -14055 -4524 2303 -1735 5631 13066 846 -3123 3282 11791 7545 7526 -374 -26887 -11889
3348 -11889 -1294 -10970 -21787 -28853 -41461 -37203 -32769 -12353 -10811 -3251 -3528 -15051 -7503 1502
3334 1502 -15567 -16018 -8950 4923 16635 17664 -1023 -7653 -1871 4853 12831 8353 2653 -2188
3320 -2188 -24155 -32616 -23990 -10791 -7356 -26840 -39317 -33024 -12036 -8678 -10696 6023 -475
3307 -475 -8242 2650 21299 2369 -18722 -16300 4335 8721 -1075 -3054 2604 -864 -11526 -18969
$$ packed form
3403A9262P027q672q855j4104n412j2649l251m990J1011J4212j5284J4920M246
3390b539L107P57j213J088j2275r018M071J6355J0866j3313l481K136j0606J123
3376a2942m413n971M174M757J9947L71j7833l563r897o023K6363N331m389r967
3362a4055R531O827m038P366P435j2220l969O405Q509m246j9p900k6513J4998
3348a1889J0595r676j0817p066j2608M258M434K0416J542P560k77j1523P548R005
3334A502j7069m51P068J3873J1712J029j8687o630N782O724P978m478n700m841
3320b188k1967q461Q626J3199L435j9484j2477O293K0988L358k018J6719o498
3307d75p767J0892J8649j8930k1091K422K0635M386r796j979N658l468j0662p443
$$ plain form
3293 -18969 4296 24461 5582 -25333 -26638 -7657 -1379 11464 4347 -8950 -10016 -6618 -1854
3280 -1854 3516 20248 10992 -1453 -3588 16048 19893 16155 20602 13365 -3962 -22196 -21562 -16334
3266 -16334 120 -828 4336 -2885 17385 19039 1334 5337 8273 1239 2450 16392 19007 17052
3252 17052 8304 -2577 -15369 -18401 -21590 -24631 -21681 -13221 11046 3016 -8370 -5041 -15664
3239 -15664 -8190 -9821 -29734 -31161 -23674 -13419 13943 2438 2645 8136 3043 -2849 -24637 -31912
3225 -31912 -21159 -5938 -537 -10690 578 344 -2200 7365 6683 17517 8455 5890 -6399 -13711
3211 -13711 -16832 -13816 -20822 -32557 -30155 -27771 -14678 7539 29866 11570 -21089 -21717 -2500
3198 -2500 4756 13097 9517 -6366 -7141 -2757 16503 103 -31567 -41295 -19714 -12281 -14232 -17408
$$ packed form
3293a8969K3265K0165j8879l0915j305J8981O278J2843p117j3297j066L398M764
3280a854N370J6732r256j2445k135J9636L845l738M447p237j7327j8234O34N228
3266a6334J6454r48N164p221K0270J654j7705M003K936p034J211J3942K615j955
3252A7052q748j0881j2792l032l189l041K950Q460K4267q030j1386L329j0623
3239a5664P474j631j9913j427P487J0255K7362j1505K07N491n093n892k1788p275
3225c1912J0753J5221N401j0153J1268k34k544R565o82J0834r062k565j2289p312
3211a3711l121L016p006j1735K402K384J3093K2217K2327j8296l2659o28J9217
3198b500P256Q341l580j5883p75M384J9260j6400l1670r728K1581P433j951l176
$$ plain form
3184 -17408 -23064 -23463 -15076 -13781 23788 17532 3993 -8253 -14619 -12791 6561 6535 618 16058
3170 16058 3816 -11084 -22275 -10176 -11945 -2286 -7872 -13276 -6749 -9816 -19400 -9239 -18956
3157 -18956 -32800 -16971 -16732 -23721 -32569 -28357 -35433 -33179 -24818 -32789 -40514 -46033 -33216 -28737
3143 -28737 -35577 -37519 -39964 -40525 -27962 -18341 -11271 -28956 -31201 -39371 -31124 -20768 -18448 -19226
3129 -19226 -2086 12768 2463 16294 14930 14921 15711 26362 30368 18303 7403 4724 11429 10763
3115 10763 4475 -7539 -15314 -8538 4107 7343 1268 3425 5901 7356 -173 -6903 -8095 -6253
3101 -6253 4808 15427 16726 -801 -11142 -12710 13465 29806 31335 19411 14946 12459 7271
3088 7271 -12150 -27756 -29086 -16212 8343 3952 -19840 -16891 1564 9440 -16559 -10428 -18757
$$ packed form
3184a7408n656l99Q387J295L7569o256j3539j2246o366J828J9352k6n917J5440
3170A6058j2242j4900j1191J2099j769R659n586n404O527l067r584J0161r717
3157a8956j3844J5829K39o989q848M212p076K254Q361p971p725n519J2817M479
3143b8737o840j942k445n61J2563R621P070j7685k245q170Q247J0356K320p78
3129a9226J7140J4854j0305J3831j364rP90J0651M006j2065j0900k679O705o66
3115A0763o288j2014p775O776J2645L236o075K157K476J455p529o730j192J842
3101f253J1061J0619J299j7527j0341j568K6175J6341J529j1924m465k487n188
3088G271j9421j5606j330J2874K4555m391k3792K949J8455P876k5999O131q329
$$ plain form
3075 -18757 -15849 -8591 -6798 -5949 12323 11217 24855 31254 19821 18600 32549 9557 -12793
3062 -12793 -28130 -8261 -1391 -23665 -25133 -9660 2057 2786 11640 -6167 -13554 606 -11054
3049 -11054 -27500 -18859 -7678 -8947 18003 29559 40883 49466 25936 -3431 -14650 598
3037 598 15265 11094 3220 2161 804 -8853 -21040 -20993 -18876 12477 32986 41756 30465 21699
3023 21699 16454 9022 -1018 -9625 16736 28895 24837 20021 16182 10549 5221 -3182 7347 -5102
3009 -5102 -2812 58 -7476 -14896 -13871 -9704 -15780 -15444 2720 11321 461 -553 -1235 -7115 -9590
2994 -9590 -7164 -30153 -23739 -6386 5936 26709 31991 16997 10427 9546 15930 18841 -3082 -11717
2980 -11717 -3709 -1214 -3699 -10772 9508 3212 -2688 -10030 -19787 -20532 -29783 -42361 -50539 -46351
$$ packed form
3075a8757K908P258J793Q49J8272j106J3638O399j1433j221J3949k2992k2350
3062a2793j5337J9869O870k2274j468J5473J1717P29Q854j7807p387J4160j1660
3049a1054j6446Q641J1181j269K6950J1556J1324Q583k3530k9367j1219J5248
3037E98J4667m171p874j059j357r657j2187M7K117L1353K0509Q770j1291q766
3023B1699n245p432j0040q607K6361J2159m058m816l839n633n328q403J0529j2449
3009e102K290K870p534p420J025M167o076L36J8164Q601j0860j014o82n880k475
2994i590K426k2989O414J7353J2322K0773N282j4994o570q81O384K911k1923q635
2980a1717Q008K495k485p073K0280o296n900p342r757p45r251j2578q178M188
$$ plain form
2966 -46351 -47479 -42269 -51292 -56632 -44478 -35334 -21575 -1814 7473 2306 -1971 8448 116 2824
2952 2824 -9566 1420 11915 2365 1208 -2357 -9545 -5055 -7531 -131 5229 13827 8282 -2003
2938 -2003 -8993 -5083 -2779 -13017 -18479 -6706 -6429 -5891 11360 977 -3717 -9315 -6828 7659
2924 7659 7542 3112 13619 126 -7832 -16041 -20023 -8862 -4666 -2352 -6013 -18013 -18364 8503
2910 8503 15084 2939 -6288 7543 4725 -3836 -3769 -4251 -12167 15241 17538 15550 6902 -1587 2226
2895 2226 14993 4536 -20115 -18468 -14569 3231 12322 18437 14879 3710 1412 8460 7770 -166
2881 -166 13915 6208 4496 -12394 -5202 -5165 -11437 -10694 -13874 -19568 -13922 -9862 -12850 -20696 -20688 -14554
2865 -14554 -34521 -57839 -39448 -18555 -18906 -21399 -22938 -35565 -39820 -30156 -35947 -29703 -7552
$$ packed form
2966d6351j128N210r023n340J2154R144J3759J9761R287n167m277J0419q332K708
2952B824j2390J0986J0495r550j157l565p188M490k476P400N360Q598n545j0285
2938b003o990L910K304j0238n462J1773K77N38J7251j0383m694n598K487J4487
2924G659j17m430J0507j3493p958q209l982J1161M196K314l661j2000l51K6867
2910H503O581j2145r227J3831k818q561O7m82p916K7408K297j988q648q489L813
2895B226J2767j0457k4651J647L899J7800R091O115l558j1169k298P048o90p936
2881a66J4081p707j712j6890P192L7o272P43l180n694N646M060k988p846QO134
2865a4554j9967k3318J8391K0893l51k493j539j2627m255R664n791O244K2151
$$ plain form
2852 -7552 -15443 -14114 -17622 -17317 -12002 3053 -3831 -24347 -36994 -23712 -13780 -3772 -23668 -26578
2838 -26578 -26379 -14863 2361 -395 -4808 1442 -4631 -11737 6562 17584 10898 -1670 -4584 -9273
2824 -9273 -2011 -17000 -17676 -38712 -53400 -55615 -43282 -29006 -25325 -21152 -21245 -13111 -20332 -40453
2810 -40453 -25809 4877 26652 33379 15954 11609 8746 27312 1686 -23593 -25273 -10416 18386
2797 18386 33026 10738 -11621 -24339 -9562 -1418 4 -13623 -36382 -37097 -29012 -9897 -3351
2784 -3351 -653 2909 -2685 11367 11180 8303 -18558 -28124 -18786 -13060 -27226 -46618 -31266 -10380
2770 -10380 -17907 -5849 8060 -5377 -15273 -10332 5091 9801 -4575 -24609 -16714 -2162 -9077
2757 -9077 1582 5356 -16097 -34605 -37960 -26642 -18572 -9636 15634 14847 17675 14512 -2588 -2556
$$ packed form
2852g552p891J329l508L05N315J5055o884k0516j2647J3282R932J0008j9896k910
2838b6578J99J1516J7224k756m413O250o073p106J8299J1022o686j2568k914m689
2824i273P262j4989o76k1036j4688k215J2333J4276L681M173r3Q134p221k0121
2810d0453J4644L0686K1775O727j7425m345k863J8566k5626k5279j680J4857K8802
2797A8386J4640k2288k2359j2718J4777Q144J422j3627k2759p15Q085J9115O546
2784c351K698L562n594J4052j87k877k6861r566R338N726j4166j9392J5352K0886
2770a0380p527J2058J3909j3437r896M941J5423M710j4376k0034P895J4552o915
2757i077J0659L774k1453j8508l355J1318Q070Q936K5270p87K828l163j7100L2
$$ plain form
2743 -2556 6630 7741 -5191 1922 -9845 -16396 -24037 -20756 2335 894 5847 9206 8972 23554
2729 23554 24521 -1270 3800 14410 7247 -10873 -19600 -8496 -20 -10065 -27862 -28892 -30659
2716 -30659 -21478 -24615 -34577 -38005 -35944 -36815 -13509 1030 4980 -11438 -27571 -21494 -18367 -14690
2702 -14690 -13307 -13661 -5732 -7626 -12957 -592 -8351 -13962 -6634 -8314 -22557 -22032 -15016 -25728
2688 -25728 -33611 -24631 -12953 1603 -2350 5209 13775 1349 -4489 4421 5478 12574 4250 3484
2674 3484 -9278 -22106 -11112 -15468 4599 12467 4682 18584 6739 -9073 -9147 2815 5662
2661 5662 -3645 -8297 -17385 -12692 -2700 10884 10483 7904 9950 1246 11259 27621 10650 -2981
2647 -2981 -4084 -5638 -15589 -36321 -39463 -34088 -27274 -15140 5297 -4166 -707 8086 14547 67
$$ packed form
2743b556R186J111j2932P113j1767o551p641L281K3091j441M953L359k34J4582
2729B3554R67k5791N070J0610p163j8120q727J1104Q476j0045j7797j030j767
2716c0659R181l137r962l428K061q71K3306J4539L950j6418j6133O077L127L677
2702a4690J383l54P929j894n331J2365p759n611P328j680j4243N25P016j0712
2688b5728p883Q980J1678J4556l953P559Q566j2426n838Q910J057P096q324p66
2674C484j2762j2828J0994m356K0067P868p785J3902j1845j5812p4J1962K847
2661E662r307m652r088M693R992J3584m01k579K046q704J0013J6362j6971j3631
2647b981j103j554r951k0732l142N375O814J2134K0437r463L459Q793O461j4480
$$ plain form
2633 67 -28372 -26571 -18108 -14454 -25049 -11636 -5789 -18855 -25504 -36690 -28731 -14772 11421 24730
2619 24730 25128 3728 -12337 -27805 -28646 -29062 -13005 -16454 -32054 -32552 -21425 2492 1050 -31150
2605 -31150 -31299 -11056 724 -2728 -9431 -324 6082 15991 12380 29973 37751 15233 -412 -577
2591 -577 6666 12215 19415 24484 17632 6172 -18676 -23898 -9372 -7995 -10219 -21730 -24601 -13485
2577 -13485 -15921 -22132 -8506 1875 6444 -579 -7578 -10554 -4370 -4861 -6830 895 1756 -16715
2563 -16715 -7126 4026 10781 -914 -9014 -22772 -21375 -18483 416 7868 3119 8152 -1649 -9758
2549 -9758 -7695 4215 28934 43261 48169 30540 32013 28090 10892 11280 11382 9134 29574 41092
2535 41092 28247 14863 22457 12312 6657 -1575 -3792 7672 967 -8675 -20280 -23676 -10805
$$ packed form
2633F7k8439J801Q463L654j0595J3413N847j3066o649j1186P959J3959K6193J3309
2619B4730L98k1400j6065j5468q41m16J6057l449j5600m98J1127K3917j442l2200
2605c1150j49K0243J1780l452o703R107O406R909l611J7593P778k2518j5645j65
2591e77P243N549P200N069o852j1460k4848n222J4526J377k224j1511k871J1116
2577a3485k436o211J3626J0381M569p023o999k976O184m91j969P725Q61j8471
2563a6715R589J1152O755j1695q100j3758J397K892J8899P452m749N033r801q109
2549i758K063J1910K4719J4327M908j7629J473l923j7198L88J02k248K0440J1518
2535D1092j2845j3384P594j0145n655q232k217J1464o705r642j1605l396J2871
$$ plain form
2522 -10805 4484 -17651 -20861 -31552 -44896 -36859 -25636 -9805 6860 22567 20125 9598
2510 9598 5283 17061 180 -17271 -20570 -10672 -13690 -16780 -11468 -18528 -14608 -16870 -6011 -3736
2496 -3736 -5985 -2482 -9324 -16605 -7539 -29406 -37602 -27494 -19341 -20391 -11045 -5098 6567 10951
2482 10951 16984 14539 14110 14177 -502 -17768 -33450 -32629 -13972 -19477 -14859 -15481 -9845 -11503 -22275
2467 -22275 -12085 689 4539 20239 19040 22940 14175 2679 -3154 -2733 -5050 -7394 -5028 5482
2453 5482 26669 28288 26997 12338 9441 7665 13760 12612 13363 10813 14422 3213 -6355 -18750
2439 -18750 -1097 19302 32156 28225 18883 -2836 2198 5908 7824 3241 24342 3356 -1864
2426 -1864 21159 24258 25125 22120 15947 6515 9206 9036 10802 8724 13915 4817 6701 14665 10905
$$ packed form
2522a0805J5289k2135l210j0691j3344Q037J1223J5831J6665J5707k442j0527
2510I598m315J1778j6881j7451l299R898l018l090N312p060L920k262J0859K275
2496c736k249L503o842p281R066k1867q196J0108Q153j050R346N947J1665M384
2482A0951O033k445m29O7j4679j7266j5682Q21J8657n505M618o22N636j658j0772
2467b2275J0190J2774L850J5700j199L900q765j1496n833M21k317k344K366J0510
2453E482K1187J619j291j4659k897j776O095j148P51k550L609j1209r568j2395
2439a8750J7653K0399J2854l931r342k1719N034L710J916m583K1101k0986n220
2426a864K3023L099Q67l005o173r432K691j70J766k078N191r098J884P964l760
$$ plain form
2411 10905 445 -964 -2539 358 -461 -9948 -8009 -3857 -7484 -26462 -33020 -36575 -21385 -138
2397 -138 19946 11887 -5185 -23254 -30219 -44118 -45515 -27246 477 -12282 -18050 -178 8147
2384 8147 17650 8600 -553 -5464 -19767 -12953 8991 19661 18473 30707 35384 26127 5823 -1366
2370 -1366 13436 -1608 -11827 6323 13279 4448 -6199 -14087 -3925 -8008 -13135 -3309 12327
2357 12327 22899 26002 20478 9505 -3582 -14634 -3646 617 6029 4657 -7521 -31406 -45080
2344 -45080 -37648 -9674 -8409 -14553 -563 2088 -10437 -23239 -2330 2110 1247 4950 16332
2331 16332 5062 -3009 4706 -2633 -10783 -1738 -9888 -11259 -9328 -1178 -13872 -16546 -2502 8486
2317 8486 25185 27684 4337 -20640 -34261 -23238 -32602 -32978 -10485 5750 18705 -4236 -26308
$$ packed form
2411A0905j0460j409j575K897q19r487J939M152l627j8978o558l555J5190K1247
2397a38K0084q059j7072j8069o965j3899j397J8269K7723j2759n768J7872Q325
2384H147R503r050r153m911j4303O814K1944J0670j188J2234M677r257k0304p189
2370a366J4802j5044j0219J8150O956q831j0647p888J0162m083n127R826J5636
2357A2327J0572L103n524j0973j3087j1052J0988M263N412j372j2178k3885j3674
2344d5080P432K7974J265o144J3990K651j2525j2802K0909M440q63L703J1382
2331A6332j1270q071P715p339q150R045q150j371J931Q150j2694k674J4044J0988
2317H486J6699K499k3347k4977j3621J1023r364l76K2493J6235J2955k2941k2072
$$ plain form
2304 -26308 -38016 -43332 -30129 -35243 -58243 -46129 -35767 -39891 -38416 -39455 -24819 -28711 -19548
2291 -19548 -1598 13943 28977 20412 8734 -490 -14150 -19119 -7761 4030 4289 10285 7595
2278 7595 -2237 -14210 -7238 116 8039 6837 7982 -17103 -8429 7556 8073 -4957 -9110 -17074
2264 -17074 -26125 -10734 17725 28367 12431 -4902 -901 8633 12999 16430 4851 6156 1684
2251 1684 5769 1909 -490 15747 26757 39431 23053 14888 16496 20345 26592 29798 9175 8591
2237 8591 6001 12369 -1002 -18152 -6457 12766 24615 17355 -214 -11868 -139 -15560 -16886
2224 -16886 -11113 -5020 -311 29365 43806 26572 -302 2033 17046 26048 24171 17373 5810
2211 5810 -6407 -13404 -9158 -369 18003 24294 31728 30252 24385 9818 -1184 8846 22586
$$ packed form
2304b6308j1708n316J3203n114k3000J2114J0362m124J475j039J4636l892R163
2291a9548J7950J5541J5034q565j1678r224j3660m969J1358J1791K59N996k690
2278G595r832j1973O972P354P923j202J145k5085Q674J5985N17j3030m153p964
2264a7074r051J5391K8459J0642j5936j7333M001R534M366L431j1579J305m472
2251A684M085l860k399J6237J1010J2674j6378q165J608L849O247L206k0623n84
2237H591k590O368j3371j7150J1695J9223J1849p260j7569j1654J1729j5421j326
2224a6886N773O093M709K9676J4441j7234k6874K335J5013R002j877o798j1563
2211E810j2217o997M246Q789J8372O291P434j476n867j4567j1002J0030J3740
$$ plain form
2198 22586 18516 14691 26886 28423 26463 22940 6652 -22234 -15273 -6930 -2225 4791 11734 6818
2184 6818 -2810 -4208 5085 -8073 -2610 -896 -9515 -12831 -11179 -19060 835 22995 28191 11549
2170 11549 1327 19732 22770 19286 24659 20114 23705 -8299 -10606 -13079 -21892 -15295 -1155 20206
2156 20206 29876 42567 29692 -3883 -1144 11249 12488 -7185 -9729 3311 32751 34811 40461
2143 40461 35251 15413 -3293 8522 9601 -4639 -3099 -1017 -1059 -11834 -21082 -24885 -28889 -11507
2129 -11507 6007 7092 -3458 -12475 -6462 3318 7672 -1424 -11945 -14337 -24080 -23266 -21778 -11252
2115 -11252 -9178 -26961 -27900 -38098 -52416 -31974 -11127 -4172 -13479 14095 30880 856 -12013
2102 -12013 -7954 121 11872 11289 19632 8050 15632 22882 9457 3214 -2744 459 7714 11904
$$ packed form
2198B2586m070l825J2195J537j960l523j6288k8886O961Q343M705P016O943m916
2184F818r628j398R293j3158N463J714q619l316J652p881J9895K2160N196j6642
2170A1549j0222J8405L038l484N373m545L591l2004k307k473q813O597J4140K1361
2156B0206R670J2691j2875l3575K739J2393J239j9673k544J3040K9440K060N650
2143D0461n210j9838j8706J1815J079j4240J540K082m2j0775r248l803m004J7382
2129a1507J7514J085j0550r017O013R780M354r096j0521k392r743Q14J488J0526
2115a1252K074j7783r39j0198j4318K0442K0847O955r307K7574J6785l0024j2869
2102a2013M059Q075J1751n83Q343j1582P582P250j3425o243n958L203P255M190
$$ plain form
2088 11904 731 18131 13543 10389 16604 12447 9553 8555 -2729 -4033 -468 -8187 -19469 -12202
2074 -12202 17101 6543 -18523 -19610 605 -5551 7398 7440 6051 5197 17157 32488 28340 23675
2060 23675 13839 19961 43660 45040 23897 32776 21245 16676 21300 27672 11412 -12044 -11581 1821
2046 1821 5708 -10539 -2452 -7733 7788 7352 -4678 -12767 -1682 -3459 -11856 -6321 3867 18745
2032 18745 9816 7675 6165 15689 20281 26417 29158 19270 8167 10090 20481 20668 17267 4504
2018 4504 -1263 20854 25932 9830 7356 19796 32999 44002 50839 30566 21327 10153 -14618
2005 -14618 -25357 -15158 -12676 -22107 -13720 -13369 -22635 -25663 -16105 -29260 -22366 -2645 -8004 -14850
1991 -14850 -17413 -7061 -12109 -12933 -20184 4243 23846 50547 59190 54714 15036 10182 17771 24198
$$ packed form
2088A1904j1173J7400m588l154O215m157k894r98j1284j304L565p719j1282P267
2074a2202K9303j0558k5066j087K0215o156J2949M2j389q54J1960J5331m148m665
2060B3675r836O122K3699J380k1143Q879j1531m569M624O372j6260k3456M63J3402
2046A821L887j6247Q087n281J5521m36j2030q089J1085j777q397N535J0188J4878
2032A8745q929k141j510R524M592O136K741r888j1103J923J0391J87l401j2763
2018D504n767K2117N078j6102k474J2440J3203J1003O837k0273r239j1174k4771
2005a4618j0739J0199K482r431Q387L51r266l028R558j3155O894J9721n359o846
1991a4850k563J0352n048q24p251K4427J9603K6701Q643m476l9678m854P589O427
$$ plain form
1977 24198 20981 9310 -1504 5427 -2110 -10235 -14825 -7000 25286 25773 3107 -11190 -17263 -21613
1963 -21613 -17052 -7048 -3954 8151 14634 18605 4352 -5534 -21261 -13152 -4858 8077 9879
1950 9879 -867 150 5050 6795 17139 11738 -6938 -2903 9213 7772 10268 19173 13406 10909
1936 10909 15692 8397 10687 6513 6873 4465 10162 13259 16574 15210 25837 25861 29071 21330 13808
1921 13808 4942 24228 16345 16112 -2575 -11962 4069 9975 4712 -6815 -6266 -24626 -18073 -5517
1907 -5517 -13270 -22729 -21947 -29238 -26190 -19732 -14343 -16280 -13650 -1092 17281 22100 26405 14971
1893 14971 -17556 -26878 -21009 -9250 -959 -6819 392 -1965 -3991 420 1919 2555 4186 3593 9866
1878 9866 6605 -23031 -29176 -8421 7517 12602 2715 -7162 -1170 -6320 -2009 -7328 4650 16217
$$ packed form
1977B4198l217j1671j0814O931p537q125m590P825L2286M87k2666j4297o073m350
1963b1613M561J0004L094J2105O483L971j4253r886j5727Q109Q294J2935J802
1950I879j0746J017M900J745J0344n401j8676M035J2116j441K496Q905n767k497
1936A0909M783p295K290m174L60k408N697L097L315j364J0627K4L210p741p522
1921A3808q866J9286p883k33j8687r387J6031N906n263j1527N49j8360O553J2556
1907e517p753r459P82p291L048O458N389j937K630J2558J8373M819M305j1434
1893A4971l2527r322N869J1759Q291n860P211k357k026M411J499O36J631n93O273
1878I866l261k9636o145K0755J5938N085r887r877N992n150M311n319J1978J1567
$$ plain form
1864 16217 854 2587 14658 21264 15315 3500 -6261 -1061 5143 -1181 -364 -8024 -13057 -21035
1850 -21035 -37480 -41174 -35422 -44599 -54563 -59429 -53054 -36858 -22709 -7890 5591 -7704 -23228
1837 -23228 -13983 -18464 -19769 -2987 -8432 -5687 -19282 -15997 -19304 -5581 -5327 -17641 -20510 -2676
1823 -2676 2211 6924 1905 12167 13875 1351 -21252 -12143 8551 19606 21089 23501 28105 24593
1809 24593 24353 12544 -514 -1923 319 6780 -6617 756 16423 16630 15119 14914 16998 2268
1795 2268 -14845 -4328 10184 -4795 -7004 7609 10198 3854 -17241 -27751 -33877 -20918 8145
1782 8145 13859 12231 1833 -10800 1528 -8364 -18126 -22169 -6585 10804 21959 32215 21803
1769 21803 15548 5890 2148 26138 11303 -2715 -1440 10630 26282 32864 22900 8740 -9491
$$ packed form
1864A6217j5363J733J2071O606n949j1815r761N200O204o324Q17p660n033p978
1850b1035j6445l694N752r177r964m866O375J6196J4149J4819J3481j3295j5524
1837b3228R245m481j305J6782n445K745j3595L285l307J3723K54j2314k869J7834
1823b676M887M713n019J0262J708j2524k2603R109K0694J1055J483K412M604l512
1809B4593k40j1809j3058j409K242O461j3397P373J5667K07j511k05K084j4730
1795B268j7113J0517J4512j4979k209J4613K589o344k1095j0510o126J2959K9063
1782H145N714j628j0398j2633J2328r892r762m043J5584J7389J1155J0256j0412
1769B1803o255r658l742K3990j4835j4018J275J2070J5652O582r964j4160j8231
$$ plain form
1756 -9491 -13886 -23011 -17019 -16028 -18498 -4986 -6406 -14952 -10521 -19054 -17641 -13289 -2010 -14905
1742 -14905 -36411 -36818 -11612 -1803 13234 -3527 -9736 -6031 -15257 -15042 4204 18757 32419
1729 32419 19623 5204 11704 27599 7930 -37034 -42829 -25947 -21215 -10918 9640 20229
1717 20229 27298 17636 22781 25822 35263 33896 21296 6600 13090 17407 12190 7695 14086 35791
1703 35791 23362 9331 -1100 19387 30192 6137 -11794 8331 12619 11713 23244 11050
1691 11050 -10303 4307 12610 -1114 7003 13121 11123 1475 -9298 -22628 -12118 1957 12077
1678 12077 21356 13121 5844 -13631 -9837 2051 10006 -9673 3205 9409 -17710 -31245 -19483
1665 -19483 238 -5270 -16547 -12193 -14242 -24915 -10795 -51 -14278 -3089 8438 10252 10423
$$ packed form
1756i491m395r125N992R91k470J3512j420q546M431q533J413M352J1279j2895
1742a4905k1506m07K5206R809J5037j6761o209L705r226K15J9246J4553J3662
1729C2419j2796j4419O500J5895j9669m4964n795J6882M732J0297K0558J0589
1717B0229P069r662N145L041R441j367j2600j4696O490M317n217m495O391K1705
1703C5791j2429j4031j0431K0487J0805k4055j7931K0125M288r06J1531j2194
1691A1050k1353J4610Q303j3724Q117O118j998r648j0773j3330J0510J4075J0120
1678A2077R279q235p277j9475L794J1888P955j9679J2878O204k7119j3535J1762
1665a9483J9721n508j1277M354k049j0673J4120J0744j4227J1189J1527J814J71
$$ plain form
1652 10423 22332 17015 18019 18117 16416 19753 14857 23354 24442 12699 5124 12038 1420 13670
1638 13670 18234 9730 837 1847 4670 23250 15088 7598 226 -1953 4740 8294 -10374 -3154
1624 -3154 2421 25980 33781 26791 19706 12348 17106 18875 10964 5873 19209 10547 1487 -4077
1610 -4077 15246 9537 9636 2856 -22094 -11967 -8852 6488 11416 10502 6650 -1731 -3493 -98 1275
1595 1275 -2383 -4059 -14057 1946 14295 2464 -2195 -18976 -8517 7515 10707 -4523 -10700
1582 -10700 -5733 -9535 -27568 -36171 -43573 -34336 -34779 -17952 -11751 -1901 2862 -4851 -17697 -18986
$$ packed form
1652A0423J1909n317J004R8j701L337m896Q497J088j1743p575O914j0618J2250
1638A3670M564q504q893J010K823J8580q162p490p372k179O693L554j8668P220
1624c154N575K3559P801o990p085p358M758J769p911n091J3336q662r060n564
1610d077J9323n709R9o780k4950J0127L115J5340M928r14l852q381j762L395J373
1595A275l658j676r998J6003J2349j1831m659j6781J0459J6032L192j5230o177
1582a0700M967l802j8033q603p402R237m43J6827O201R850M763p713j2846j289
$$ [...]
##END NTUPLES=NMR SPECTRUM
##END=
