##TITLE=Analysis number 325031
Compound Code mo 01250
Project Code adrs
Chemist Name fudan
##JCAMPDX= 6.0         $$ Bruker NMR JCAMP-DX V2.0
##DATA TYPE= NMR SPECTRUM
##DATA CLASS= NTUPLES
##ORIGIN= Bruker BioSpin GmbH
##OWNER= nmr
$$ XWIN-NMR		Version 3.5
$$ Thu Dec  7 11:03:00 2006 GMT Standard Time (UT+0h)  MAYBRIDGE\nmr@NMR_250MHZ
##.OBSERVE FREQUENCY= 250.131544655141
##.OBSERVE NUCLEUS= ^1H
##.ACQUISITION MODE= SIMULTANEOUS (DQD)
##.ACQUISITION SCHEME= undefined
##.AVERAGES= 16
##.DIGITISER RES= 18
##SPECTROMETER/DATA SYSTEM= dpx250
##.PULSE SEQUENCE= zg30
##.SOLVENT NAME= DMSO
##.SHIFT REFERENCE= (INTERNAL, DMSO, 0, 16.522)
##AUDIT TRAIL= $$ (NUMBER, WHEN, WHO, WHERE, WHAT)
$$ ##TITLE= Audit trail, XWIN-NMR		Version 3.5
$$ ##JCAMPDX= 5.01
$$ ##ORIGIN= Bruker BioSpin GmbH
$$ ##OWNER= nmr
$$ C:\u/data/dgb/nmr/ADRS/510/pdata/1/auditp.txt
$$ ##AUDIT TRAIL=  $$ (NUMBER, WHEN, WHO, WHERE, WHAT)
(   1,<2006-12-07 11:02:39.05 +000>,<MAYBRIDGE\nmr>,<NMR_250MHZ>,
      <created by zg, POWCHK disabled, PULCHK disabled
       configuration hash MD5:
       49 4B E0 1D 92 C2 6B 37 9F E6 65 BC 52 41 86 1D
       data hash MD5: 64K
       77 7C 43 24 8C D7 07 7B 82 4B C0 8F 76 0F D3 B8>)
(   2,<2006-12-07 11:02:52.60 +000>,<MAYBRIDGE\nmr>,<NMR_250MHZ>,
      <Start of raw data processing
       ef LB = 0.3 FT_mod = 6 PKNL = 1 SI = 32K 
       data hash MD5: 32K
       D1 C9 73 26 8B 76 D5 99 C6 9C 3F A1 67 B6 F2 98>)
(   3,<2006-12-07 11:02:54.17 +000>,<MAYBRIDGE\nmr>,<NMR_250MHZ>,
      <apk 
       data hash MD5: 32K
       A4 5A 64 92 F1 8C CE 8D B9 E4 90 01 31 30 B6 E4>)
(   4,<2006-12-07 11:02:54.86 +000>,<MAYBRIDGE\nmr>,<NMR_250MHZ>,
      <abs ABSG = 5 
       data hash MD5: 32K
       62 9C 30 87 69 B2 B5 2F DD DF 89 B4 92 06 79 83>)
$$ ##END=
$$ 
$$ hash MD5
$$ 3B DE 23 E6 D8 12 2A 31 4B 18 17 54 2E 70 05 4D
##$RELAX= 
##$RELAX= 
##$RELAX= 
##$RELAX= 
##$RELAX= 
##$RELAX= 
##$RELAX= 
$$ Bruker specific parameters
$$ --------------------------
##$DU= <C:\u>
##$EXPNO= 510
##$NAME= <ADRS>
##$PROCNO= 1
##$TYPE= <nmr>
##$USER= <dgb>
##$AMP= (0..31)
100 100 100 100 100 100 100 100 100 100 100 100 100 100 100 100 100 100 
100 100 100 100 100 100 100 100 100 100 100 100 100 100 
##$AQSEQ= 0
##$AQ_mod= 3
##$AUNM= <au_zg>
##$AUTOPOS= <15 >
##$BF1= 250.13
##$BF2= 250.13
##$BF3= 250.13
##$BF4= 250.13
##$BF5= 500.13
##$BF6= 500.13
##$BF7= 500.13
##$BF8= 500.13
##$BYTORDA= 1
##$CFDGTYP= 0
##$CFRGTYP= 5
##$CHEMSTR= <none>
##$CNST= (0..31)
1 1 145 1 1 1 1 1 1 1 1 1 1 1 1 1 1 1 1 1 1 1 1 1 1 1 1 1 1 1 1 1 
##$CPDPRG= <>
##$CPDPRG1= <>
##$CPDPRG2= <>
##$CPDPRG3= <>
##$CPDPRG4= <mlev>
##$CPDPRG5= <mlev>
##$CPDPRG6= <mlev>
##$CPDPRG7= <mlev>
##$CPDPRG8= <mlev>
##$CPDPRGB= <>
##$CPDPRGT= <>
##$D= (0..31)
0 1 0 0 0 0 0 0 0 0.06 0 0 0 0 0 0 0.0002 0 0 0 0 0 0 0 0 0 0 0 0 0 0 
0 
##$DATE= 1165489358
##$DBL= (0..7)
120 120 120 120 120 120 120 120 
##$DBP= (0..7)
150 150 150 150 150 150 150 150 
##$DBP07= 0
##$DBPNAM0= <>
##$DBPNAM1= <>
##$DBPNAM2= <>
##$DBPNAM3= <>
$$ [...]
##$SUBNAM7= <"">
##$SUBNAM8= <"">
##$SUBNAM9= <"">
##$SW= 20.6930455092707
##$SWIBOX= (0..15)
0 0 3 0 0 0 0 0 0 0 0 0 0 0 0 0 
##$SW_h= 5175.983436853
##$TD= 65536
##$TD0= 1
##$TE= 295.16
##$TE2= 300
##$TE3= 300
##$TEG= 300
##$TL= (0..7)
0 120 120 120 120 120 120 120 
##$TP= (0..7)
150 150 150 150 150 150 150 150 
##$TP07= 0
##$TPNAME0= <>
##$TPNAME1= <>
##$TPNAME2= <>
##$TPNAME3= <>
##$TPNAME4= <>
##$TPNAME5= <>
##$TPNAME6= <>
##$TPNAME7= <>
##$TPOAL= (0..7)
0.5 0.5 0.5 0.5 0.5 0.5 0.5 0.5 
##$TPOFFS= (0..7)
0 0 0 0 0 0 0 0 
##$TUNHIN= 0
##$TUNHOUT= 0
##$TUNXOUT= 0
##$USERA1= <user>
##$USERA2= <user>
##$USERA3= <user>
##$USERA4= <user>
##$USERA5= <user>
##$V9= 5
##$VALIST= <valist>
##$VCLIST= <CCCCCCCCCCCCCCC>
##$VD= 0
##$VDLIST= <DDDDDDDDDDDDDDD>
##$VPLIST= <PPPPPPPPPPPPPPP>
##$VTLIST= <TTTTTTTTTTTTTTT>
##$WBST= 1024
##$WBSW= 4
##$XGAIN= (0..3)
0 0 0 0 
##$XL= 0
##$YL= 0
##$YMAX_a= 247292
##$YMIN_a= -382278
##$ZGOPTNS= <>
##$ZL1= 120
##$ZL2= 120
##$ZL3= 120
##$ZL4= 120
##$ABSF1= 16.522
##$ABSF2= -4.171173
##$ABSG= 5
##$ABSL= 3
##$ALPHA= 0
##$AQORDER= 0
##$ASSFAC= 0
##$ASSFACI= 0
##$ASSFACX= 0
##$ASSWID= 0
##$AUNMP= <proc_1d>
##$AZFE= 0.1
##$AZFW= 0.1
##$BCFW= 0
##$BC_mod= 0
##$BYTORDP= 0
##$COROFFS= 0
##$CY= 12.5
##$DATMOD= 1
##$DC= 0
##$DFILT= <>
##$DTYPP= 0
##$F1P= 14.0000005364418
##$F2P= -0.99999901652339
##$FCOR= 0.5
##$FTSIZE= 32768
##$FT_mod= 6
##$GAMMA= 0
##$GB= 0
##$INTBC= 1
##$INTSCL= 1
##$ISEN= 128
##$LB= 0.3
##$LEV0= 0
##$LPBIN= 0
##$MAXI= 10000
##$MC2= 0
##$MEAN= 0
##$ME_mod= 0
##$MI= 0
##$NCOEF= 0
##$NC_proc= -5
##$NLEV= 6
##$NOISF1= 0
##$NOISF2= 0
##$NSP= 0
##$NTH_PI= 0
##$NZP= 0
##$OFFSET= 16.522
##$PC= 1
##$PHC0= 223.6224
##$PHC1= -13.05166
##$PH_mod= 1
##$PKNL= yes
##$PPARMOD= 0
##$PSCAL= 4
##$PSIGN= 0
##$REVERSE= no
##$SF= 250.13
##$SI= 32768
##$SIGF1= 0
##$SIGF2= 0
##$SINO= 400
##$SIOLD= 32768
##$SREGLST= <1H.DMSO>
##$SSB= 0
##$STSI= 32768
##$STSR= 0
##$SW_p= 5175.98343685301
##$SYMM= 0
##$S_DEV= 0
##$TDeff= 65536
##$TDoff= 0
##$TI= <Analysis number 999999
Compound Code 99
Book Reference 9
Project Code 9>
##$TILT= no
##$TM1= 0
##$TM2= 0
##$TOPLEV= 0
##$USERP1= <user>
##$USERP2= <user>
##$USERP3= <user>
##$USERP4= <user>
##$USERP5= <user>
##$WDW= 1
##$XDIM= 32768
##$YMAX_p= 477523909
##$YMIN_p= -422336
$$ End of Bruker specific parameters
$$ ---------------------------------
##NTUPLES= NMR SPECTRUM
##VAR_NAME=  FREQUENCY,     SPECTRUM/REAL,   SPECTRUM/IMAG
##SYMBOL=    X,             R,               I
##VAR_TYPE=  INDEPENDENT,   DEPENDENT,       DEPENDENT
##VAR_FORM=  AFFN,          ASDF,            ASDF
##VAR_DIM=   32768,         32768,           32768
##UNITS=     HZ,            ARBITRARY UNITS, ARBITRARY UNITS
##FACTOR=    0.157963299565203, 1,           1
##FIRST=     4132.6476996994, 0,             0
##LAST=      -1043.33573715361, 0,           0
##MIN=       -1043.33573715361, -422336,     0
##MAX=       4132.6476996994, 477523909,     0
$$ Real data points
##PAGE= N=1
##DATA TABLE= (X++(R..R)), XYDATA
$$ [...]
18594B819766r454j966m2525k5298n993j1986o294N1759L7730N2292j941L2694
18582B888784L9641J6586R9431J27811O031J6245l6636M5257N0531n2365P2889
18571C274205P8655k9q5046j38450k00803j51602n9694k235p5319j84606q5874
18560B369202j43533j36912j21315j14154l7559l560j15384q712r2631p8272n1396
18549A465774m9673q5778J6695L5509O1207m7094j66396n4063M2781J4113n8463
18538A174612J6741n3438l2301N3740L9525M812o6578K2285O7843N1896p0058
18527A209079j00172p7125l3227M459K7390O7404l2043k8772K2806l3796m6248
18516I79755p479L1808nn1985M5184k0226n7461j4586j721k4436q7307k5734r480
$$ y = [2819766, 2810312, 2808346, 2765821, 2740523, 2734530, 2722544, 2716250, 2768009, 2805739, 2858031, 2856090, 2888784, 2928425, 2945011, 3044442, 3172253, 3178284, 3194529, 3157893, 3203150, 3253681, 3201316, 3274205, 3352860, 3352831, 3267785, 3129335, 2928532, 2776930, 2717236, 2715001, 2639682, 2455076, 2369202, 2225669, 2088757, 1967442, 1853288, 1815729, 1812169, 1696785, 1688073, 1595442, 1517170, 1465774, 1416101, 1330323, 1347018, 1382527, 1443734, 1396640, 1230244, 1176181, 1218962, 1233075, 1174612, 1191353, 1137915, 1105614, 1159354, 1198879, 1203691, 1137113, 1159398, 1227241, 1279137, 1209079, 1108907, 1031782, 998555, 1003014, 1030404, 1097808, 1065765, 1036993, 1059799, 1026003, 979755, 972276, 1004084, 1004079, 952094, 997278, 977052, 919591, 905005, 903284, 878848, 791541, 765807, 756327]
18503G56327Q7466K4632k7127o3006l0408l199o9648o6871N8906L2149M4491L1929
18491G75641k2850k6460k4732j1699m7255o5956J20750O3376m7989m7420N4326
18480G19732j1905j8970N7867k7967k2489l7683K9171J37153L0418q9838K5292
18469G90781m0715o1153m962o3847O011L0467J23591J23545N830j12600j23487
18458F73461L7469j259n0274j33135l174P3889n3854j2925J4063O0208M937l4608
18446E74798j7078l9745p1570j0892n009N642n1648j8982J0956L6263J8301K0373
18434D51409J939N954j8274l1795K6191P426M5468j10912k3345M5556M826r1582
18422C12861l1853O0911Q707k1268M4844m5805l3758k5373K9009P6470j3353m46
$$ y = [756327, 843793, 868425, 841298, 778292, 747884, 744685, 675037, 608166, 667072, 699221, 743712, 775641, 752791, 726331, 701599, 689900, 642645, 576689, 697439, 760815, 712826, 665406, 719732, 707827, 688857, 746724, 718757, 696268, 658585, 687756, 824909, 855327, 765489, 790781, 750066, 688913, 683951, 620104, 626115, 656582, 780173, 903718, 909548, 796948, 673461, 710930, 709671, 659397, 526262, 523088, 596977, 543123, 530198, 544261, 604469, 609406, 574798, 557720, 517975, 446405, 435513, 430504, 436146, 384498, 365516, 376472, 412735, 431036, 451409, 453348, 459302, 441028, 409233, 435424, 442850, 488318, 377406, 354061, 399617, 404443, 312861, 281008, 341919, 350626, 329358, 374202, 328397, 294639, 269266, 298275, 374745, 361392, 360946]
18410C60946q3141L0205J6304j3789J1292P9608o1562p8814k5272N0367O841J7561
18398C10546m4253k2434l2103J889L0620K6580K7100o597n4345K5902j5033l7683
18386B10189N0102n3875L689L7741R545j589K6878L4683j04028o2213L3430L0336
18374B14888J5611l0532L9439L9354n5218p8087p3683j2501l676O4520j8478n929
18362I5708J10481N132m7189n4374p010L9570J15040o1248j00509j210Q3189l4913
18350A42667r535j6779J126O7064K2549L6225k6317o4726m3106J950N359J11680
18338B28157K3805j15950l6666Q6267L2073q5027n3067K6682M3808J9267O560
18327A75909n6701O762J2249J3447o620L3476M0625l2488k8822o9839j5244j1250
$$ y = [360946, 277805, 308010, 324314, 310525, 321817, 401425, 339863, 261049, 235777, 286144, 292985, 310546, 266293, 243859, 211756, 213645, 244265, 270845, 297945, 291348, 237003, 262905, 247872, 210189, 260291, 206416, 210105, 247846, 257391, 255802, 282680, 317363, 213335, 151122, 184552, 214888, 230499, 199967, 239406, 278760, 223542, 145455, 71772, 59271, 55595, 120115, 101637, 95708, 206189, 211321, 164132, 109758, 102748, 142318, 257358, 196110, 95601, 94391, 177580, 142667, 133132, 116353, 117479, 184543, 207092, 243317, 217000, 152274, 109168, 111118, 116477, 228157, 251962, 136012, 99346, 185613, 217686, 132659, 79592, 106274, 150082, 169349, 175909, 119208, 125970, 138219, 151666, 145046, 178522, 219147, 186659, 157837, 87998, 72754, 61504]
18315F1504O6963k4612l0605k6895L5383O8485L2043J7694j5122M222j02677p3747
18303A2636M7123J05049J00552n2089k3329q0001p6019j04541Q4827j8744l6090
18292d0626J1901K7933L6952Q076L8804J6595p132J7994l9811n1133l6882M051
18280a3278L4076K3251J350m7757k8843K1907O3657R2030M0899q7235J873m6627
18268E5303K7922L0748r0367L3324k5675M350n0429M3619N3195J9895n0n160l7482
18255E9193n138R2209M837l4502p7435k3612k353N5584L369k5945K3634K0818
18243I0659k818l8697r345J4324N8059l5088m5145Q8770L9423m3074L3336L9196
18231A89600j6663l4668p5164q0807K0081N5739O1698k4795M9796M8703K0993
$$ y = [61504, 128467, 103855, 73250, 46355, 81738, 150223, 182266, 199960, 184838, 189060, 86383, 12636, 59759, 164808, 265360, 213271, 189942, 109941, 33922, -70619, 14208, -4536, -40626, -28725, -792, 36160, 44236, 83040, 99635, 92503, 110497, 70686, 19553, -17329, -13278, 20798, 44049, 45399, -2358, -31201, -9294, 54363, 146393, 187292, 100057, 101930, 55303, 83225, 113973, 23606, 56930, 31255, 35605, -14824, 28795, 81990, 101885, 101835, 96675, 59193, 54055, 146264, 151101, 116599, 39164, 15552, 13199, 68783, 72152, 46207, 69841, 90659, 87841, 49144, 39799, 54123, 112182, 77094, 31949, 120719, 160142, 117068, 150404, 189600, 172937, 138269, 63105, -17702, 2379, 58118, 119816, 95021, 144817, 193520, 214513]
18220B14513J5587j02506n050M376J2893K408j3740K4120k9748r6940n9000l6265
18208f9352j6520M1794K9099L2288J6151J624k2494o8998J5425L2287k9022m4574
18196h2292m2451j2034P993m7664k3425J0965N982k0271Q4007L4945p3667j9430
18184a77342N4331M1581j0595o5409j7344K5208L0847r306n4396Q031O5884O1269
18172d7241P0995k544p3028l9454j4289M978N3605O6643J2819o6045l5132L9374
18160b9319n334m9619j13367J3042M8546j0166j2730J3795Q0266O5305k1469q92
18148b1942l6023k4262n802o4550l7578O2996J2026j6737M8585J965m443J1621
18136g4144j9804J650P9284L3352K0458Q3335N8033k5348m8217j07411J5903M1546
$$ y = [214513, 230100, 127594, 122544, 126920, 139813, 142221, 128481, 152601, 122853, 25913, -33087, -69352, -85872, -44078, -14979, 17309, 33460, 35084, 12590, -56408, -40983, -8696, -37718, -82292, -124743, -136777, -128784, -176448, -199873, -188908, -182926, -203197, -119190, -84245, -157912, -177342, -123011, -81430, -92025, -157434, -174778, -149570, -118723, -128029, -182425, -174394, -108510, -47241, 23754, 21210, -51818, -91272, -105561, -100583, -46978, 19665, 32484, -33561, -68693, -29319, -34653, -84272, -197639, -184597, -136051, -146217, -158947, -145152, -64886, 419, -21050, -21942, -57965, -82227, -88029, -152579, -190157, -127161, -115135, -131872, -83287, -81322, -85765, -74144, -93948, -92298, -13014, 20338, 40796, 124131, 182164, 156816, 108599, 1188, 17091, 58637]
18124E8637J9774R076J8076r2777n9931k7340L1499J2882q149j3369N1912O2613
18112F2903J3526J9160J03070J09223J731o6244n348P4519N1339K6137N2502O5700
18100E08218P7584J8807r619k7428N2699Q7673m578o1942J14644J36053P0648
18089I62759K3971K4950J13582J36637O693L1729O5738k2121M2971L7547J37868
18078A562324j3499o537o4205J5504j04097j92740q0615j9730j25898j73663j54254
18067F42590j8326N4590k1314o1222l9152J7556n792J9034N8641l8645j34188
18056D73772N1526O4065L987m7170j4459J40682R1737K6990n7183M3964J15056
18045H92967J20382J10985J21446J31182J08144N8526R7637O6293J12222J29732
$$ y = [58637, 78411, 87487, 105563, 12786, -47145, -74485, -42986, -30104, -38253, -51622, 290, 62903, 76429, 95589, 198659, 307882, 309613, 243369, 238021, 312540, 363879, 390016, 442518, 508218, 585802, 604609, 594990, 567562, 620261, 707934, 703356, 641414, 756058, 892111, 962759, 986730, 1011680, 1125262, 1261899, 1268592, 1300321, 1366059, 1343938, 1386909, 1424456, 1562324, 1548825, 1542288, 1478083, 1493587, 1389490, 1196750, 1116135, 1096405, 970507, 796844, 642590, 624264, 678854, 657540, 596318, 557166, 574722, 568930, 587964, 646605, 607960, 473772, 525298, 589363, 593350, 546180, 531721, 672403, 764140, 791130, 733947, 777911, 892967, 1013349, 1124334, 1245780, 1376962, 1485106, 1543632, 1641269, 1707562, 1819784, 1949516]
18035A949516Q9903J9600O4890N3904J19677J05185P0026k0319K5527M6281L7822
18024B562012J23626J2849K659J24841J44201J52677K46902K67092J66372L21574
18014D124805L17117K49523L71740L85071M07234N29192N45390N81360O58309
18005H169741P41878O20130N91285P39631R18298J134988J332770J521725J793963
17996A7564409K091303K605676L285565M062277N212181O857360R055552J1764332
17988F2498655J5183559J9098256K2893902K5898487K6844909K5183547K1835519
17981B19436834J9004287J8376223J9818420K1149726J9467647J2949693J835694
17974C32038524j0051904j8275562k1162741k0181441j8166386j7689506j9391056
$$ y = [1949516, 2039419, 2059019, 2123909, 2177813, 2297490, 2402675, 2472701, 2452382, 2477909, 2524190, 2562012, 2685638, 2698487, 2701146, 2825987, 2970188, 3122865, 3369767, 3636859, 3803231, 4124805, 4441922, 4691445, 5063185, 5448256, 5855490, 6384682, 6930072, 7511432, 8169741, 8911619, 9531749, 10123034, 10862665, 11780963, 12915951, 14248721, 15770446, 17564409, 19655712, 22261388, 25546953, 29609230, 34821411, 41678771, 50734323, 62498655, 77682214, 96780470, 119674372, 145572859, 172417768, 197601315, 219436834, 238441121, 256817344, 276635764, 297785490, 317253137, 330202830, 332038524, 321986620, 303711058, 282548317, 262366876, 244200490, 226510984, 207119928]
17967B07119928k2411634k4582868k4659565k2476378j8969375j5371965j2186756
17960F6461387r744918p826324o224441m996123m079870l405064k930865k459465
17952B4794317k065461j844152j617140j342939j167691r87882r23758q95947
17944A3949347p60952o96827n69083o15838n91796o13203n48033m40124m27768
17935H685723l52862l61234l55339l84775l56240k48764k36780k19899j30014
17926F039816j48382j63526r2079O6228J03050P0247K05832K56321L57470M26166
17916G121143M36096L48610K98207L43480M04166L35586K89130K43898P6764j42312
17906I754768k75528l71322m81714m76820m31215m67583l94799n30012n68501
$$ y = [207119928, 184708294, 160125426, 135465861, 112989483, 94020108, 78648143, 66461387, 56716469, 48890145, 42665704, 37669581, 33589711, 30184647, 27253782, 24794317, 22728856, 20884704, 19267564, 17924625, 16756934, 15769052, 14845294, 13949347, 13188395, 12491568, 11922485, 11306647, 10714851, 10101648, 9553615, 9113491, 8685723, 8332861, 7971627, 7616288, 7231513, 6875273, 6626509, 6389729, 6169830, 6039816, 5891434, 5727908, 5635829, 5702057, 5805107, 5875354, 6081186, 6337507, 6694977, 7121143, 7557239, 7905849, 8204056, 8547536, 8951702, 9287288, 9576418, 9820316, 9897080, 9754768, 9479240, 9107918, 8626204, 8149384, 7718169, 7250586, 6855787, 6325775, 5757274]
17897E757274n37847m10656m22769l54065l14333k23208j58948j98464k15330
17888B921654j29326l9954l4081j64794r3597p7456n6981p7008p3856o7134K4339
17877B131806q4853o7257l0277n836j45417p8742n0565j295k0473o8501q5600
17866A492990j51956n2253M1113J9470l7845q7365m3986n5210J2981j408L732
17855A140263o0256q6916r912N024o6328m4455l7744P6378L1066M1185m0303n0064
17843H97938P808L1398J0697l6201n4147M1311L5799q194p4913J5341L9596l5022
17831H71411l2013L5759M6452o1761l382P7583j4939j6234l5819l1017j4466P7515
17819H99089O0366j8962l9892l6674P3622P1473J1958K1506P9840K2451M3047
$$ y = [5757274, 5219427, 4808771, 4386002, 4031937, 3717604, 3494396, 3335448, 3136984, 2921654, 2792328, 2752374, 2718293, 2553499, 2459902, 2382446, 2325465, 2248457, 2174601, 2107467, 2131806, 2046953, 1979696, 1949419, 1943583, 1798166, 1719424, 1668859, 1667564, 1647091, 1578590, 1492990, 1341034, 1288781, 1329894, 1349364, 1311519, 1224154, 1180168, 1124958, 1137939, 1136531, 1140263, 1080007, 993091, 983179, 988203, 921875, 877420, 839676, 916054, 947120, 988305, 948002, 897938, 905746, 937144, 947841, 911640, 857493, 898804, 934603, 926409, 851496, 866837, 906433, 871411, 839398, 875157, 921609, 859848, 856466, 934049, 919110, 902876, 867057, 836040, 821574, 899089, 959455, 940493, 900601, 863927, 937549, 1009022, 1020980, 1042486, 1122326, 1144777, 1187824]
17808A187824O9875Q406p205l717J42356J19821M3048J3976j8115n0108J5195
17797A521356p3773j7613j03368p7738j727m2310p8388K5157n4440o9794n1046
17786I76316l6501j26802m5333M173n3928n6800Q598j9463J1323r477L1364J5850
17774F99320M7614J4753n6008k5234m0939l5305J9749L7501R1878P7161q16Q9538
17762I19212R2505O4024K5525K2193m7237j05179q8814N7897N2114L0266l3749
17751I88757n0887n8970l4686q5729q0217j1634J8741K9633m9514k1195j6006
17740F28293L3571N954q7884l4855J5833q0642m396K1475m2331J4151N6253j0015
17728E15407p4682l10m9308P5539k8116j5697K5415K6025n604J1620l4000n9047
$$ y = [1187824, 1257699, 1266105, 1258900, 1255183, 1397539, 1517360, 1560408, 1574384, 1556269, 1506161, 1521356, 1447583, 1429970, 1326602, 1248864, 1247137, 1204827, 1126439, 1151596, 1097156, 1027362, 976316, 939815, 813013, 767680, 771853, 717925, 661125, 669723, 650260, 661583, 652106, 683470, 699320, 746934, 761687, 705679, 680445, 639506, 604201, 623950, 661451, 753329, 830490, 829674, 919212, 1011717, 1075741, 1101266, 1123459, 1076222, 971043, 882229, 940126, 992240, 1022506, 988757, 937870, 878900, 844214, 758485, 678268, 666634, 685375, 715008, 665494, 644299, 628293, 661864, 667818, 579934, 545079, 560912, 480270, 475874, 497349, 455018, 469169, 525422, 515407, 440725, 440415, 391107, 466646, 438530, 422833, 448248, 474273, 468669, 480289, 446289, 387242]
17716C87242o4537k7505j4924N097O2436R518p8810k5632N5049L0599m6836O250
17704B97947M5048N2343r161k4380m0346Q757M1303k4235l2773q057m0640L66
17692B66172P1418L0470j8084k0629l7302K8162K9596O1922L8243R190p2701p4289
17680C12168n3081j6087N4986k882n5991K511K7139M9535j105l6201q2326j557
17668A97109N4650O1447l3072L5640R0655k5445j05805j7209k3153J9508L4839
17657B89164M3207J02575L2841j22329p0128j5652o3000M4151O8518O9960j4772
17646C64535L4279k7051l3069O1405K1560l085m986q5863P256J36565P9131N7632
17634F08309j4110n1146k4538r3097q1756N2480M1823m21K9267Q1113J23086J07399
$$ y = [387242, 322705, 295200, 280276, 285373, 347809, 357327, 278517, 252885, 307934, 338533, 291697, 297947, 342995, 395338, 386177, 361797, 321451, 330208, 371511, 347276, 314503, 306446, 265806, 266172, 337590, 368060, 349976, 329347, 292045, 320207, 349803, 411725, 449968, 459158, 386457, 312168, 259087, 243000, 297986, 295104, 239113, 241624, 268763, 318298, 317193, 280992, 198666, 197109, 251759, 313206, 280134, 315774, 406429, 380984, 275179, 257970, 234817, 254325, 289164, 332371, 434946, 467787, 345458, 275330, 259678, 196678, 240829, 309347, 379307, 364535, 398814, 371763, 338694, 400099, 421659, 418574, 413588, 327725, 334981, 471546, 550677, 608309, 594199, 543053, 518515, 425418, 343662, 396142, 437965, 437544, 466811, 547924, 671010, 778409]
17622G78409M0742k6887j983J6989J4836N690P1839L6920M3932R0298l4753j53343
17610H82689n2676J5363K7534K5677L7014k677n1331o5711r1893j0523M8167M5352
17598H06985m3171j3722j6494q3426l4641N6442O6498J2929m1385K2768N1480
17587G84263K0470M9606J6211K2066O7234m1997J4458K894q173M8875M8034K256
17575A026197J33976J05693j0875P9734P1862M4674q5309L531N1446R4188M5339
17564A560456j1476R659M4704Q1390J6197l489J56145Q5067P7674J44083K06054
17553B366464J62779J36572J36472J52667K23637K90523K07029J88018J97258
17544D061419K28049J97956K21965K18532J25949J63341J82721K25633K24847
$$ y = [778409, 819151, 792264, 790281, 807270, 822106, 827796, 899635, 936555, 980487, 1070785, 1036032, 882689, 830013, 845376, 872910, 898587, 935601, 932924, 881593, 815882, 723989, 713466, 761633, 806985, 763814, 750092, 733598, 650172, 615531, 671973, 738471, 751400, 710015, 732783, 784263, 804733, 854339, 870550, 892616, 959850, 917853, 932311, 935205, 927032, 975907, 1023941, 1026197, 1160173, 1265866, 1254991, 1334725, 1406587, 1451261, 1365952, 1369483, 1420929, 1515117, 1560456, 1548980, 1558639, 1603343, 1684733, 1700930, 1697441, 1853586, 1938653, 2016327, 2160410, 2366464, 2529243, 2665815, 2802287, 2954954, 3178591, 3469114, 3676143, 3864161, 4061419, 4289468, 4487424, 4709389, 4927921, 5053870, 5217211, 5399932, 5625565, 5850412]
17535E850412J36563J83956L24046L42787L83401L24564L72369L94371M85483
17526H797952N44549N40224N12531O23982O36364O33119P33985P56932R19021
17517A4698659J053678J205563J474000J678635J797254K343435K855862L339031
17509C0446117M042518M958020N991408P323375R131439J1273033J3672926J6464538
17501A03303374J9207309K1424746K2636100K2394215K0739942J8453804J6476222
17494B44635712J5005967J3313810J0390996N968448K81482n640623j0345577
17487B73610215j3204386j4733502j6054702j7743315j9608249k0921370k0976295
17480A50368396j9745147j7624350j5155411j2813779j0735035q933368p509240
$$ y = [5850412, 5986975, 6170931, 6494977, 6837764, 7221165, 7545729, 7918098, 8312469, 8797952, 9342501, 9882725, 10395256, 11019238, 11655602, 12288721, 13022706, 13779638, 14698659, 15752337, 16957900, 18431900, 20110535, 21907789, 24251224, 27107086, 30446117, 34488635, 39446655, 45438063, 52761438, 61892877, 73165910, 86838836, 103303374, 122510683, 143935429, 166571529, 188965744, 209705686, 228159490, 244635712, 259641679, 272955489, 283346485, 289314933, 289596415, 283955792, 273610215, 260405829, 245672327, 229617625, 211874310, 192266061, 171344691, 150368396, 130623249, 112998899, 97843488, 85029709, 74294674, 65361306, 57852066]
17473E7852066o372080n487587m589364l994005l465354l023171k677068k231006
17465B6012431j861110j545099j375500j220982j119142j023967r35763r03788
17457A6027080q14168p37237p16233o74167n43582m77376n45904m83238m74748
17448A0560427l79729l48441l45262l64088k96092k52287k50734k44920j29662
17439G949212j74793k14752k81883j59794j20631j75580k60677k05929k15549
17430F139624k77500k86716k84455k96272k29374k38935k61143j78759j46599
17421C939871j03309j29180o5822j07572j30472r7867q2058j79235j55040j1246
17411B878070r389J4383k5501m6216l5977p2726j17766p9742j5354p1236Q315
$$ y = [57852066, 51479986, 45992399, 41403035, 37409030, 33943676, 30920505, 28243437, 26012431, 24151321, 22606222, 21230722, 20009740, 18890598, 17866631, 16930868, 16027080, 15212912, 14475675, 13759442, 13085275, 12541693, 12064317, 11518413, 11035175, 10560427, 10180698, 9832257, 9486995, 9122907, 8826815, 8574528, 8323794, 8078874, 7949212, 7774419, 7559667, 7277784, 7117990, 6997359, 6821779, 6561102, 6355173, 6139624, 5862124, 5575408, 5290953, 4994681, 4765307, 4526372, 4265229, 4086470, 3939871, 3836562, 3707382, 3641560, 3533988, 3403516, 3305649, 3223591, 3044356, 2889316, 2878070, 2868681, 2883064, 2857563, 2811347, 2775370, 2702644, 2584878, 2505136, 2489782, 2418546, 2426861]
17400B426861k8733r1904L4712l6460m2421p1519k6274K0940k8438P0734O67J5863
17388B244028L9586p784K8706J04759O7912P2338Q4667J05851J24317K1195O8273
17377B953848M6795K6553L4873Q743J5555o6796q3757j46865k15730j29762j35820
17366B307637j08658j26642j46759j36898q7748K8149p1187j13568m8454l8792
17356A457080l8082n7964l547O8269J3577l9009l0173k1789o6436j21134J5889
17345A176681l862J6405K7133r276O322j12822o1669L301n5730J393K3906M318
17333A016100K880j01052p6616k197K9391k0494p29n021M816P8909J1488O2407
17321I99882l65l7907k7188M787J2353n681k1517P3132J0357q2983p2797m468
$$ y = [2426861, 2398128, 2306224, 2340936, 2304476, 2262055, 2190536, 2164262, 2185202, 2156764, 2227498, 2228165, 2244028, 2283614, 2275830, 2304536, 2409295, 2477207, 2549545, 2634212, 2740063, 2864380, 2885575, 2953848, 3000643, 3027196, 3062069, 3070812, 3086367, 3019571, 2935814, 2788949, 2573219, 2443457, 2307637, 2198979, 2072337, 1925578, 1788680, 1700932, 1729081, 1657894, 1544326, 1495872, 1457080, 1418998, 1361034, 1357487, 1425756, 1439333, 1400324, 1370151, 1348362, 1281926, 1160792, 1176681, 1172819, 1189224, 1216357, 1207081, 1213403, 1100581, 1038912, 1042213, 986483, 987876, 1011782, 1016100, 1018980, 917928, 841312, 839115, 868506, 848012, 847283, 842262, 847078, 925987, 937475, 999882, 999517, 961610, 934422, 939209, 951562, 945881, 924364, 997496, 1007853, 924870, 852073, 847605]
17309H47605L790Q046L7097K40K4800k3046k8048k965K1097j7996m0273j7337
17297H13010Q2362k506n9098k548L1719J9362O565J8998o8608l8788M781p409
17285G97840J01260N1346Q101K275k1393M536k4891J8985n0812k8175o7694j3551
17273G77827Q3J7829L4144J361o0530l4625q8489l3683R543R0659k9735N077k4847
17260F64614k8121k6285K8144P638l6466j8635O256l6901O219O4075K1922q9596
17248E62864l180J7944P017O1169K208l1905l7699l0336J5630m253m809q175o043
17235E40432q9279k0255R0812N6808K4414k6078J5026L8558r5708l3436L0186
17224E31480k6200r8147J2702M9229l649K3463L0208L1963J5894K103o6880o6775
$$ y = [847605, 851395, 859441, 896538, 896778, 921578, 898532, 870484, 867519, 888616, 870620, 830347, 813010, 895372, 892866, 833768, 831220, 862939, 882301, 888866, 907864, 839256, 800468, 805249, 797840, 899100, 950446, 958547, 960822, 939429, 943965, 919074, 938059, 887247, 859072, 791378, 777827, 777910, 795739, 829883, 831244, 770714, 736089, 647600, 613917, 623460, 714119, 684384, 689461, 664614, 636493, 610208, 638352, 645990, 609524, 590889, 597145, 560244, 566463, 630538, 652460, 562864, 559684, 577628, 584645, 645814, 648022, 616117, 578418, 548082, 563712, 559459, 554650, 546475, 540432, 451153, 430898, 521710, 578518, 602932, 576854, 591880, 630438, 534730, 501294, 531480, 505280, 407133, 419835, 469064, 465415, 488878, 519086, 551049, 566943, 569046, 502166, 435391]
17212D35391J9755J8715J4068K8597M2438J7786m7018o206n2848P3166N55m9650
17200D94749j13137k9482K4036J5845O9277M1059J9903j6367j9321n1384k9131
17189D06047j18363m591R8844J0161k7330l2171J3754K1725L5158L9884M0715
17178D83833J1681p9452j25440n1388L4324K4724k342L8293K8804j7448l4636
17167C10953k9276j5548k5559P230k580R127l16J3465K8663J0328K9741r329k3258
17154C03641j7076n5699J3612O8655K7478L6427N7678q0435p0756l9446k1373
17143B22706O3750N6111R440L2240o0074L0918J8234o1582r4597O651O553n009
17131B25341j2573L2828Q4591j7057M699m724k6374M5498K1690J3144K2366M1108
$$ y = [435391, 455146, 473861, 487929, 516526, 558964, 576750, 529732, 523526, 470678, 543844, 544399, 494749, 381612, 352130, 376166, 392011, 461288, 502347, 522250, 505883, 486562, 435178, 406047, 287684, 283093, 381937, 392098, 364768, 332597, 346351, 368076, 403234, 443118, 483833, 495514, 416062, 290622, 239234, 273558, 298282, 295940, 334233, 363037, 345589, 310953, 281677, 266129, 240570, 247800, 245220, 254347, 254031, 267496, 296159, 306487, 336228, 326899, 303641, 286565, 230866, 244478, 313133, 340611, 377038, 434716, 354281, 283525, 244079, 222706, 286456, 342567, 352007, 384247, 324173, 355091, 373325, 311743, 217146, 223797, 230350, 225341, 212768, 245596, 330187, 313130, 317829, 313105, 286731, 332229, 353919, 367063, 389429, 430537]
17119D30537r1864r7712K6436J28806O8167j25660j42284M0728N2956L4234L2847
17108C57191k2486M198M4680k7689q0623r704j9145l5655M4737L8348q918J7675
17096C02609K5118o516N03l4571j07913L3023Q7035O520r3906j5602K3656k1636
17084A98320j5233j8039K6568j7669o074P0813K1255M7874M2373K6892L021k0088
17072C60013k0526m6646L8709j037n5502k5382q713R1704k9948q4416J9723O1188
17060B99167p509m2778k0807k9916J1184L3977N4460N8704k0971l3619K9519j8819
17048C12592Q4665M4435R271l1844o0763r6964J4222n035l0661k9273o6292J40
17036A44493R6087R693m5375j44095q3559k1938L9055P3507k866K6688M8118m2902
$$ y = [430537, 338673, 240961, 267397, 396203, 464370, 338710, 196426, 237154, 290110, 324344, 357191, 334705, 338903, 383583, 355894, 275271, 265567, 246422, 210767, 255504, 293852, 284934, 302609, 327727, 321211, 321714, 287143, 179230, 212253, 299288, 305808, 211902, 196300, 219956, 198320, 183087, 165048, 191616, 173947, 167873, 238686, 259941, 307815, 350188, 377080, 380101, 360013, 339487, 292841, 331550, 330513, 275011, 249629, 240916, 332620, 302672, 218256, 237979, 299167, 291658, 248880, 228073, 198157, 209341, 243318, 297778, 356482, 335511, 301892, 331411, 312592, 397257, 441692, 450963, 419119, 358356, 261392, 275614, 270579, 239918, 210645, 144353, 144493, 240580, 250273, 204898, 60803, -22756, -44694, -5639, 67868, 65002, 91690, 139808, 96906]
17024I6906M44l678m1810K8932J00377P4864m4542m8395j6360M1777P906K211
17012A98632O0358o5929j492O194L6855L2088K7530m577o2647j689O3791l9843
17000B49271m647K0456L772M2146p6355r7620p0535K8846q403r904k353J21216
16988A95890j3557r4976k9125K3652J0779L7278M7518L0295M8604o0241j51148
16977D4969l0279L4680j8746l3302m760p831L6924L3367j8971l1934O464L4009
16965D4590R0547N2975N1467k8404k4479m7676p2120J7315o369P0558M3498k4759
16953A67143K6200J3972l8966o9959O4409O1984N5667M3611p0011r5012L0885
16942A89923M0881o5958M2316M5438j349K0675m1577k1504j6326K9253L1665J0505
$$ y = [96906, 97350, 93672, 51862, 80794, 181171, 256035, 211493, 163098, 146738, 188515, 196421, 198632, 258990, 193061, 191569, 197763, 234618, 266706, 294236, 289659, 227012, 225323, 289114, 249271, 244624, 265080, 268852, 310998, 234643, 137023, 66488, 95334, 86931, 77027, 74674, 195890, 182333, 87357, 58232, 81884, 92663, 129941, 177459, 207754, 256358, 196117, 44969, 14690, 49370, 30624, -2678, -7438, -15269, 21655, 55022, 36051, 4117, 10581, 44590, 135137, 188112, 239579, 211175, 186696, 139020, 66900, 84215, 77846, 148404, 191902, 167143, 193343, 207315, 168349, 98390, 162799, 224783, 280450, 324061, 254050, 159038, 189923, 230804, 164846, 207162, 252600, 251251, 271926, 230349, 208845, 192519, 221772, 253437, 263942]
16930B63942J4216L5523R8294k498K3947N8995o2671q6074k0170n8824N1177j3330
16918C02527J5706m1936n4090R648P3176O000q0819M2172N0356O3113O3667J12756
16906E62276L2714R4286K23152Q3535N9912P7445J13642J29009Q0003L6506Q414
16895A500894j5798J15758J06532p8204j08339q3651r6683j0175j4828j21941
16885A193565j75034j15742r3037j21371j39731n2601j0071n2425j16542J7933
16875C34944m0004j5630N9283n9624p6450p248O0518N7537k2016p8089n3241M0335
16863B00315R6372j5404j6005j4552l5155N8128p2r5258o104K2286J2752K3361
16851B30664m682q2288K9145J5976r2284j5569K5532R0385M0829j4380p9237K6446
$$ y = [263942, 278158, 313681, 411975, 409477, 433424, 492419, 429748, 343674, 323504, 264680, 315857, 302527, 318233, 276297, 222207, 231855, 305031, 311031, 230212, 272384, 322740, 385853, 449520, 562276, 594990, 689276, 912428, 995963, 1055875, 1133320, 1246962, 1375971, 1455974, 1492480, 1500894, 1485096, 1600854, 1707386, 1629182, 1520843, 1437192, 1340509, 1330334, 1315506, 1193565, 1018531, 902789, 809752, 688381, 548650, 496049, 485978, 433553, 317011, 334944, 294940, 279310, 338593, 278969, 202519, 195271, 255789, 313326, 291310, 213221, 159980, 200315, 296687, 281283, 265278, 250726, 215571, 273699, 273627, 178369, 172265, 194551, 207303, 230664, 225982, 143694, 172839, 188815, 96531, 80962, 106494, 196879, 237708, 223328, 144091, 170537]
16839A70537J15810p5539m2153M9875o0807n420Q4755Q350m2284p4226m6581l4484
16827D7833l3k1038k3949J6285N4279J2575K280q9170k2150J0670K327k5628j1187
16814d6906N5079Q664o2970Q5437Q6799L035n796p8810L3864M3536k9727N8079
16802A50284l4969j7509L3460j6505K2384K7058k287j0004j4431j9429m1384n7567
16790A9101L222M6605l440Q748O3638J444K6500K3600K7732m80l5005m2850M1933
16777A80748J5014J393L3024J3248J8197n3972N5310n2170k9484m6645j8271r0684
16765B5708l5441K4220m6471o3755Q6282R0779O3201L2041j834o8012p1675k9784
16753E259p4111o369P8606R9395L5941k0591o4511j1973M0336M6701M7755o6208
$$ y = [170537, 286347, 210808, 168655, 218530, 157723, 152303, 237058, 245408, 203124, 128898, 82317, 47833, 47800, 26762, 2813, 19098, 73377, 85952, 88232, -938, -23088, -12418, -10091, -35719, -46906, 8173, 16837, -46133, 39304, 126103, 129138, 123342, 44532, 78396, 121932, 92205, 150284, 115315, 97806, 131266, 114761, 137145, 164203, 161916, 151912, 137481, 118052, 76668, 19101, 22323, 68928, 65488, 74236, 137874, 139318, 165818, 189418, 217150, 216670, 181665, 138815, 180748, 195762, 197155, 230179, 243427, 261624, 207652, 262962, 210792, 181308, 134663, 116392, 25708, -9733, 14487, -31984, -95739, -9457, 81322, 144523, 176564, 174730, 106718, 35043, 5259, -68852, -75221, 3385, 102780, 138721, 118130, 53619, 41646, 81982, 128683, 176438, 110230]
16741A10230o3171K4127p0098m2146O2402M1300M4354M4357l7456j2359k9423
16730G2117K9803q9973o1332L5005j7135L7821L9753K8076j3549p6659J4550l1867
16718c3390L221J11963q435l3079p175J7771N2298M6708O3611N0079L0281j31257
16706A62596q4498K1137L4524r1229o3872K7659O4652J05513O3524l6531p2742
16695A30733k2630J7341L692j1599k3204j353m9396m3450n9863r1772O4668N6102
16683c0731K4363O2237j7450M164O5350L2236j1085l4589j5444J7759j8803j1448
16671F6559j3448J12345m549n1606k9508m6412k6496k3416p8216j0480N1900K8942
16659b4385M7888N6503J9005o8496m5224k595K0637Q0047j214Q610K1796N1523
$$ y = [110230, 47059, 71186, 1088, -41058, 21344, 62644, 106998, 151355, 113899, 101540, 72117, 101920, 11947, -49385, -14380, -31515, 6306, 46059, 74135, 60586, -16073, -1523, -33390, -30169, 81794, 73359, 40280, 33105, 50876, 103174, 149882, 213493, 263572, 293853, 162596, 78098, 99235, 133759, 42530, -21342, 6317, 70969, 176482, 240006, 203475, 130733, 108103, 125444, 129136, 117537, 94333, 92980, 43584, 134, -59729, -151501, -86833, -30731, -6368, 55869, 38419, 42583, 107933, 140169, 129084, 94495, 79051, 96810, 78007, 66559, 53111, 165456, 160907, 109301, 79793, 33381, 6885, -16531, -94747, -105227, -53327, -24385, 23503, 80006, 99011, 30515, -14709, -17304, 3333, 83380, 82166, 90776, 112572, 164095]
16647A64095N689m7125m2215M1859N3222m7114q239j6142j2329l0710j9842m8229
16635g080K2255j4525O586O4189M0768j2320k4103o0013o069n748l0213l558M4629
16622A4798R1417n4753m540J7480K221l1856L8189n6614k650j0138K0283L6853
16610F0690j1670j1930l4210j8960k4952j4059P981l9814N7751L4253l2162M0255
16598A3173L5713n7087m3091P9920J5585J5923O5147M1108R97k3496r0116J4463
16586F8239J589j183k9902o3764J039j137o5098p7472K329P4619P4385L7059K4449
16573D5152Q305M739R575L8014l8272L6683j3393m737K4352N395o06j0074j7149
16560H7984J0320m6046n4426j500j5159K6139P4652J439O521k6312L7480j4798
$$ y = [164095, 169784, 122659, 80444, 122303, 175525, 128411, 120172, 104030, 91701, 60991, 41149, -7080, 15175, 650, 7236, 71425, 112193, 99873, 75770, 15757, 9688, 3940, -26273, -29831, 14798, 106215, 51462, 46922, 64402, 66623, 34767, 72956, 16342, 13692, 3554, 23837, 60690, 49020, 37090, 2880, -16080, -41032, -55091, -47110, -86924, -29173, 5080, -27082, 13173, 48886, -8201, -51292, 28628, 44213, 60136, 125283, 166391, 167388, 143892, 53776, 68239, 69828, 68645, 38743, -25021, -23982, -25119, -90217, -167689, -165360, -90741, -16356, 20703, 45152, 53457, 58196, 67771, 105785, 67513, 104196, 90803, 86066, 110418, 115813, 115207, 105133, 87984, 98304, 52258, -2168, -3668, -18827, 7312, 81964, 83403, 89924, 63612, 101092, 86294]
16548H6294q1131K4099k9862M309O0891r436m7102J8198J931K9040j7163k1847
16536A8221n5910j1199P5527j0548Q6161l4892p0415k2920j257O9650m2493j04320
16524a04395J0519P0550J2644k6598J5747R1979M899n8152m7816n4332K9502K8846
16512b6607K1076K5286j3070L824L7991k0086N178m9946l2383P1544P1076k1095
16500G2788L1354k429K0851r168j27542P13L4317m9067M6615K0480l9201l1402
16488c1691k5258r330O4066P2067Q8730J483p0624r1391N8291J2502K0842P9979
16476A69666K5239q789K1044q1738m3231J6908j2155j4094j7681m9285m8279l5084
16464g7479Q8584J07739m8998n7362l7234L6403L9728j5661n7850J6345O1021
$$ y = [86294, 5163, 29262, -600, 3709, 64600, 55164, 8062, 26260, 28191, 57231, 40068, 18221, -37689, -48888, 26639, 16091, 102252, 67360, -3055, -25975, -27232, 42418, -75, -104395, -93876, -23326, -10682, -37280, -21533, 70446, 75345, 17193, -30623, -84955, -55453, -26607, -5531, 19755, 6685, 10509, 48500, 28414, 33592, -16354, -48737, 22807, 93883, 72788, 104142, 101713, 122564, 113396, -14146, -13433, 20884, -28183, 18432, 38912, -289, -31691, -56949, -66279, -2213, 69854, 158584, 160067, 89443, -1948, 56343, 68845, 89687, 169666, 194905, 186116, 207160, 125422, 82191, 99099, 86944, 72850, 55169, 5884, -42395, -77479, 11105, 118844, 69846, 12484, -24750, 11653, 51381, 35720, -22130, -5785, 55236]
16453E5236r7036k8896K8867K2822J8144k5563J067m0978j6488Q4067M7193O9907
16441A18342p8653N223M6759L2376n3867j2117j4324j6706L5333n5853N2642K2231
16429H1386k7419O699N2062L4n0815j4753k7640j5217l0851l0223p0016j1720
16417a38473M7897N0533O8424j1963k5824k7181J1287R0619N007m0808j2057N7095
16405G4556j3749j00656l7195j1459K1930m6095K8166K1849J2835o6678j5723
16394a32219P6196K2461n2426l6524N0785J9987k3547L8521k2644l6940k09J5258
16382h1301k2574l8484N6483J12433L376P908k8052r040J4720K0563l7364Q4863
16370H3531K0087q2809k5697P3456L0244j25584N745N2027J2706J1474j9735N8630
$$ y = [55236, -41800, -70696, -41829, -19007, -863, -26426, -25359, -66337, -82825, 1242, 48435, 118342, 39689, 44912, 91671, 124047, 70180, 58063, 43739, 27033, 62366, 6513, 59155, 81386, 53967, 60666, 112728, 112762, 61947, 47194, 19554, 4337, -26514, -56737, -126753, -138473, -90576, -40043, 28381, 16418, -9406, -36587, -25300, 65319, 70326, 29518, 17461, 74556, 60807, -39849, -77044, -88503, -66573, -112668, -84502, -62653, -49818, -116496, -132219, -56023, -33562, -85988, -122512, -71727, -51740, -75287, -36766, -59410, -96350, -96559, -81301, -103875, -142359, -85876, 26557, 29933, 37841, 9789, 749, 15469, 36032, -1332, 83531, 103618, 20809, -4888, 68568, 98812, -26772, -21027, 31000, 43706, 55180, 35445, 94075]
16358I4075N584l1426j27312j11743J00443N6527m2580K9417O9855J9297J0048
16347G2185m2417m6315k4266O3321L6282n2466l2455p9059L0063M4355P5095k3593
16335B0730n2237Q604k7535J9011l8349j9495P9604M7423q7538p7105O5551J5579
16323d5757j6353L3125J0889P207R8746k0885o0900j0223k82k0271n8923Q5547
16311A920O8079l9610K8623J6290J0827j6194k1095n8308m8790J7489L7733o3050
16299f6086p5970k9398R5605M6719m410M059N0136j1644p882J09500J7241l3717
16287I4153r297q682n5397o708j8525j6201K0384N6252k6844l757R5983p1800
16275D9561j01607K2545J33163L6488p7284m838O4058J4086j4736j1584q492K0770
$$ y = [94075, 99659, 68233, -59079, -170822, -70379, -13852, -56432, -27015, 42840, 62137, 72185, 29768, -16547, -40813, 22508, 58790, 6324, -26131, -105190, -75127, -30772, 44323, 20730, -31507, -22903, -50438, -31427, -69776, -89271, -9667, 37756, -49782, -126887, -61336, -45757, -62110, -28985, -18096, -10889, 87857, 66972, 6072, -4151, -4433, -24704, -83627, 1920, 69999, 30389, 59012, 75302, 86129, 69935, 48840, -9468, -58258, -40769, -3036, -66086, -142056, -171454, -75849, -29130, -33540, -29481, 20655, 9011, 1129, 110629, 127870, 94153, 84856, 76174, 20777, 14069, -4456, -20657, -273, 55979, 29135, 25378, 121361, 49561, -52046, -29501, 103662, 140150, 62866, 58028, 122086, 136172, 121436, 109852, 101360, 122130]
16263A22130m2329k1159K1666M368l4813q3944m9311k1624N1403L7140l8516J0724
16251d4265m1541q550m5178N4462J8370O1142K4830j2161K018j8181L6526j3389
16239A4083L2141k9072k7307p5544m7248j1521O5852K8351R808n588M1852K2381
16227A8188k6339r1124j01614m8793J35492Q7130J1161l0536K5094L7408J8904
16216C4971K5145j6262j17918j0147M3018l3589M5123J14173N7456L150k3581
16205A21539l9053l1426m5057k4458k6232j6068J1377P5562J2965q116L1335k1130
16193D1238l2447N589K2842m874M5151P426o1024l4737l3464J992o2811M6940
16181e8179p4378q9185j7091O5758k1639O66J00150J6766o613k6353J9847M871
$$ y = [122130, 79801, 58642, 80308, 84676, 49863, -34081, -83392, -105016, -53613, -16473, -54989, -44265, -85806, -94356, -139534, -85072, -66702, -5560, 19270, 7109, 9127, -9054, 27472, 14083, 46224, 17152, -10155, -85699, -132947, -144468, -78616, -50265, -40457, -46045, -4193, 18188, -8151, -99275, -200889, -249682, -114190, -27060, -15899, -46435, -21341, 16067, 34971, 60116, 43854, -74064, -84211, -41193, -74782, -29659, 84514, 141970, 145120, 121539, 82486, 51060, 6003, -18455, -44687, -60755, -49378, 26184, 39149, 31033, 62368, 41238, 8791, 14380, 37222, 32348, 77499, 84925, 23901, -10836, -44300, -42308, -105119, -58179, -132557, -221742, -238833, -173075, -194714, -194048, -93898, -77132, -83745, -110098, -90251, -85380]
16169h5380K9475p021J0581O4676N3491p8117l2183n7816M146Q2075J27604j1895
16157I9636r2059J9270J893l9089p1007M6136R9586m0190m5493J8710k7163R9780
16145G0010K454l0882q107L2381M4278p7084J5717K0187r577j059K9454Q9919
16133A77691J06852O9236N7683O9306Q4263R5767K7007P546K7553l6211r8197
16122E88496j3333J4067P1475l4345n268J7493k643J4948j45379j25438p0622
16111C09451j16334l6028o9713j0182M2655k0143j4331k1774M599m833p0052N2095
16099D5410J5466Q577k5303L2217K6503o877k5976j9356m486L783p761m2832J2361
16086A1726r39J071j8955R81M6893O472l1753J1339L1750J3865k1904l9194j0611
$$ y = [-85380, -55905, -62926, -52345, 12331, 65822, -12295, -44478, -102294, -98148, -16073, 111531, 99636, 7577, 26847, 28740, -10349, -81356, -35220, 64366, 24176, -21317, -2607, -29770, 70010, 72464, 41582, 33475, 65856, 110134, 33050, 48767, 68954, 59377, 58318, 87772, 177691, 284543, 353779, 411462, 480768, 565031, 660798, 687805, 695351, 722904, 686693, 588496, 575163, 589230, 660705, 626360, 621092, 638585, 635942, 650890, 505511, 380073, 309451, 193117, 157089, 87376, 77194, 119849, 99706, 85375, 63601, 68200, 63367, -6685, 45410, 60876, 69453, 44150, 76367, 102870, 95993, 70017, 50661, 46175, 49958, 42197, -635, 11726, 10787, 11858, -7097, -6116, 40777, 47249, 15496, 26835, 58585, 72450, 50546, 11352, 741]
16073G41K858R5193l7205j7570m9559o7712O536Q1345N8426l2066k6047o2662
16061d7722l2183l4696p615P0281j4096M8090K6830J5996M0890K2414p0444r1059
16049g3314n0634N8497N7907M654o1640q033R776P6052O1431M0128m0718q7373
16037a3267K8582l5896j4064R822l8638R7961n3858p4524L4689Q8533K8042p5
16025E7307K8352k4894o0682j7918j870j7542L8885k0317o889k5982J5094j2794
16013d9250k0041N2479N13m3112j0414L7408l9590o7736J14641N4220n6364p209
16001c4455m2107l6498O3203o083n543L4768M9610L342m1647n3784k2049J497
15989h9746K625l6803O6403J6191J5274r166L9566Q9989Q6628l6895o6807l2691
$$ y = [741, 3599, 98792, 61587, 44017, -5542, -73254, -66718, 14627, 73053, 40987, 14940, -47722, -79905, -114601, -122216, -51935, -66031, -17941, 8889, 24885, 65775, 88189, 17745, -73314, -123948, -65451, -7544, -2890, -64530, -72563, -62787, 13265, 74696, 114824, 74106, -13267, 15315, -20581, -34645, -24823, -63461, 34500, -19358, -93882, -59193, 29340, 57382, 57307, 85659, 60765, 83, -17835, -19705, -37247, 1638, -18679, -25568, -51550, -36456, -49250, -69291, -16812, -16299, -59411, -69825, -32417, -72007, -139743, -25102, 29118, -27246, -34455, -76562, -113060, -49857, -55940, -61483, -26715, 22895, 26237, -15410, -69194, -91243, -89746, -87121, -123924, -57521, -41330, -26056, -35222, 4344, 94333, 180961, 144066, 77259, 44568]
15977D4568k0290j34926n8073L8005P5971M5018m4697N03m0727n102J7434K6006
15965e6310p990o4516j732P5302O4851p435K4875M9594q0689n1892J2078P7792
15953C3928N9288L2770k0670p9813l162n8197m2843l7049R4570J2869q8253j6555
15941a13117M8155L7440q2438k4905L8576L8673o2568N4719k9272Q915O8269L3487
15929A5934l1775m596J3323K6634j3371p634N6321L8530p3282q6934P176K8258
15917c1416L2678N2140o8509p3647L8832m0387K902K7316r1129K0916L9960L1039
15905e9305p1337L5355M0267k5372j3625J2479R694j3559k2172K1330N4904Q0500
15893D9159L2219m553j9809K4006k5760p5216n247N30K2801k9955n2515p8147
$$ y = [44568, 24278, -110648, -168721, -130716, -54745, -9727, -54424, -53921, -94648, -99750, -82316, -56310, -64300, -128816, -130548, -55246, 9605, 2170, 27045, 76639, -4050, -55942, -43864, 33928, 93216, 125986, 105316, 25503, 22341, -35856, -78699, -115748, -21178, -8309, -96562, -113117, -64962, -27522, -109960, -134865, -96289, -57616, -120184, -65465, -94737, -85822, -17553, 15934, -15841, -20437, -7114, 19520, 6149, -1485, 54836, 93366, 20084, -66850, -59674, -31416, 1262, 53402, -15107, -88754, -49922, -90309, -87407, -60091, -151220, -130304, -90344, -59305, -130642, -95287, -55020, -80392, -94017, -81538, -71844, -85403, -107575, -86245, -31341, 49159, 81378, 76825, 57016, 81022, 55262, -19954, -25201, -24671, -1870, -31825, -84340, -162487]
15881a62487j0178q103M7281L1991O323J498N1491j7898R375k8762r152k6159
15869a14780m6401J9894o6183L5741O0283l8218P9383J5063p2397j1736J6623
15858a22728R5109J1693J1007j28M2232j1260K7475k484l1718n5732q083K6401
15846a8216n986M049M4633j3332q24r587k6616l071L1628j9848j5509q61p210
15833d0750m8817o2416k0363K1723K9050M1419K4564o8755P206m264j6668N2438
15821h5633R9314L9347p8221o7394P649R1382P762p1300j3052L7885K8955O2746
15809E9440L1141q4404N791J6110k4445m3054l9307M4431J3519k7076K0987R2775
15797F5908N6574o5918l8142l6105J6832L2709P855m7848o6992o449O6900M0449
$$ y = [-162487, -172665, -180768, -133487, -101496, -95173, -93675, -42184, -60082, -50707, -79469, -88621, -114780, -161181, -141287, -207470, -171729, -111446, -149664, -70281, -55218, -127615, -139351, -122728, -27619, -15926, -4919, -5047, 37185, 25925, 53400, 50916, 19198, -36534, -44617, -18216, -24202, -20153, 24480, 11148, 10324, 737, -25879, -28950, 2678, -17170, -32679, -33540, -40750, -89567, -151983, -172346, -150623, -121573, -80154, -55590, -124345, -117139, -121403, -138071, -85633, 13681, 53028, -25193, -92587, -84938, 6444, 14206, -57094, -70146, -32261, -3306, 59440, 90581, 6177, 11968, 28078, 3633, -39421, -78728, -34297, -20778, -47854, -26867, 65908, 122482, 56564, 18422, -17683, -851, 31858, 39713, -8135, -75127, -81576, -14676, 25773]
15785B5773l9809P467m7125j8032M1708J7200l9344j1810O5559p5933k9048k2075
15773a25469K9314K9660K4281L643K4397M752n3529n1050j3997j7382L0541J19720
15761D881j6379J2356J6559n0806p061k652j8774q3773l3525O2150J3742J38371
15749C5089M397j34050m2351J3841K1088j5003j3857K2294N8985n3630o267K433
15737a07031O0033J3486j3707m8913k0801K7336l2528m490j8233K677P1249J8442
15725e2480q8245n0057N0685P3376L765m5965n5649P1664q647n944O4264K6507
15713a6726l391p6063k091R2438l9733j18588N7819M3649k469n6388k385k913
15701a26841n1589N0509j2430k8245P1926N632o1554L4816m082k6298N6136P9645
$$ y = [25773, -14036, -6569, -53694, -71726, -30018, -12818, -52162, -63972, 1587, -74346, -103394, -125469, -96155, -66495, -42214, -38571, -14174, -9422, -62951, -114001, -127998, -145380, -114839, 4881, -11498, 858, 17417, -33389, -40450, -43102, -61876, -145649, -179174, -117024, -103282, 35089, 39486, -94564, -136915, -123074, -101986, -116989, -130846, -108552, -49567, -103197, -109464, -107031, -46998, -33512, -47219, -96132, -116933, -89597, -122125, -126615, -144848, -142171, -70922, -52480, -140725, -190782, -140097, -66721, -62956, -108921, -164570, -92906, -101553, -107497, -43233, -16726, -20117, -96180, -98271, -5833, -45566, -164154, -106335, -62686, -65155, -121543, -123928, -126841, -178430, -127921, -140351, -168596, -96670, -91038, -152592, -117776, -121858, -148156, -92020, -12375]
15689a2375P1795M0725n5312n9262j91519l8786J37324P0689M7875J4465n1160
15678b5541p8267r3045N2640j7806o8122N2126N6224L4388J5516m8399q1196k3854
15666b25336Q6311P7606K6603m7076k0366J9732N2104K2556q1523n3107n1446
15655a93942M7145J07306M1054m7155J0612N8689M6446j0038J7948j02467k0335
15644d4737L5919L8075k2142L3260j868q6464j0073K5623J3189p7388o1729M1135
15632a17200N4406M6456L4443k7348K4976j0929q439k921j09518o6121K8569J73686
15620B0060J06522p6787o9613k186j1723N4657L1719n6803R654k3028N598J8970
15608G040m50l1637l5991K3572p562N1993M6780r257l3162n4110j8535r240j7961
$$ y = [-12375, 59420, 100145, 44833, -14429, -205948, -244734, -107410, -36721, 11154, 25619, -25541, -103808, -196853, -144213, -162019, -230141, -178015, -121791, -87403, -71887, -120286, -201482, -225336, -139025, -61419, -34816, -81892, -102258, -82526, -30422, -7866, -89389, -142496, -193942, -146797, -39491, 1563, -45592, -34980, 23709, 70155, 60117, 78065, -24402, -44737, -8818, 29257, 7115, 40375, 38507, -47957, -58030, -32407, -19218, -96606, -158335, -117200, -62794, -16338, 18105, -9243, 15733, 4804, -3635, -6556, -116074, -182195, -153626, 20060, 126582, 49795, -19818, -22004, -33727, 20930, 52649, -4154, 5500, -17528, -11930, 7040, 6590, -25047, -61038, -37466, -45028, 6965, 53745, 44488, 11326, -42784, -61319, -70559, -88520]
15595h8520n7475j0975J37832k2013j1717L9516j5900o1561N014M2443M9516j3194
15583g034p5413J2158M2386o5645K0885J8258K4765j4628m4899L460O3240N0836
15571B8369m0836N6799m972p243L3735q9360p708j98j5983j2993N7432l768j07068
15558a13794j0760k8191j4550N8200K7003R7582O427r8852m5648Q4628O0602J8398
15546D1045q3722q0205l2139n0696L1787J09733J9003p8987m0518j8399j6255
15535a99353N811Q9199O5073k8421j0577J100L5324J526R7769P840k1680l7112
15523F499j3921n30O9657Q5452o8799j16290r1190j8951m9713M3941N3978Q841
15511i1026K4093k9466J2817N5874O4790Q49m3183L1499L1187O405M3072j6836
$$ y = [-88520, -145995, -156970, -19138, -41151, -52868, -13352, -29252, -90813, -85799, -43356, 6160, -7034, -82447, -70289, -27903, -93548, -72663, -54405, -29640, -44268, -89167, -85707, -22467, 28369, -12467, 44332, 39360, 32117, 65852, -23508, -31216, -31414, -47397, -60390, -2958, -6726, -113794, -124554, -152745, -167295, -109095, -82092, 15490, 21917, -76935, -122583, -37955, 22647, 41045, -42677, -122882, -155021, -205717, -173930, -64197, -45194, -124181, -164699, -183098, -199353, -193542, -104343, -39270, -67691, -78268, -77168, -41844, -40318, 57451, 65291, 43611, 6499, -7422, -7952, 61705, 147157, 78358, -37932, -129122, -148073, -197786, -153845, -99867, -91026, -66933, -96399, -83582, -27708, 37082, 37931, -5252, 26247, 57434, 63839, 106911, 90075]
15499I0075k6071j1719q4240p791N7578J4897j7083q2070n1123J865l8488N4133
15487a00037N7958N7885l5675l2838k8050L2692Q3p4126K7859l0537O113j6992
15475a35665J2835O5349j2746K0961j5652k8750o4218O7859K5433k4821N963q241
15463i1693P5721J3546k2487J1709k0970q1602J1469K0413j0985M1557K3238p1948
15451a02032n0406L4416M9466J8151J151m3535o022O5054l3334L5149L5391K3317
15439B6766l2408j0603Q383M7071o585l0295o988o3747m0727L4112Q1792K1228
15427B7999m0026j9938M3505J533k949m3089q492k6791N2517k5897m1528n188
15415h8344j0650L7328k7812j3947M5006m5713J7370O3869R7007o467j6943m2477
$$ y = [90075, 64004, 52285, -31955, -39746, 17832, 32729, 15646, -66424, -117547, -115682, -154170, -100037, -42079, 15806, -19869, -52707, -80757, -48065, -47982, -122108, -94249, -124786, -118673, -135665, -122830, -57481, -70227, -49266, -64918, -93668, -157886, -90027, -64594, -89415, -83452, -91693, -15972, -2426, -24913, -13204, -34174, -115776, -104307, -83894, -94879, -53322, -30084, -102032, -152438, -118022, -68556, -50405, -49254, -92789, -98811, -33757, -67091, -31942, 3449, 26766, -5642, -16245, -7862, 39209, 32624, 2329, -4659, -68406, -109133, -75021, 6771, 27999, -12027, -31965, 11540, 13073, 10124, -32965, -41457, -68248, -15731, -41628, -83156, -88344, -98994, -61666, -89478, -103425, -58419, -104132, -86762, -22893, 74114, 67647, 50704, 8227]
15403H227o4196Q6225M9817P8454O0211p8745o0968J749O8718P2842M3704N3129
15391C19167M5376P8694J50280M3914m800N954m0957r7055j2399J10449k5036
15380E73587j4920K1624Q823q5604j10888k9313k7080o673m3615R8134o6456r9189
15368B18430o2300m5288J7000J2988n7337k1678L7636P995r4300l5571j4061Q3732
15356D7246J2280q2434o5246k3227R7640Q5586M0864o1586n3861n0168O1416O0098
15344F8608j6005L7688M5972o4109n9926j7441p6737L4388K8765n0619L4511K7031
15332g874k8511k0087k0286m605j6930L5948M3278K3233J2910j3730K3393m450
15320B2289k1897K07m1948j9369k7828M0632N5091J8882n4491l4425j0743l2226
$$ y = [8227, -55969, 30256, 80073, 158527, 218738, 139993, 79025, 80774, 149492, 222334, 266038, 319167, 364543, 443237, 593517, 637431, 632631, 638585, 597628, 500573, 488174, 598623, 573587, 558667, 580291, 589114, 503510, 392622, 363309, 336229, 329556, 285941, 384075, 317619, 218430, 156130, 110842, 127842, 140830, 83493, 61815, 99451, 107446, 13146, -22425, -36486, 47246, 59526, -22908, -88154, -111381, -13741, 71845, 112709, 51123, -2738, -52906, 8510, 68608, 52603, 90291, 136263, 72154, 12228, -5213, -81950, -47562, -18797, -69416, -34905, -7874, -36385, -56472, -76758, -81363, -98293, -62345, -19067, 4166, 17076, 3346, 26739, 22289, 392, 599, -41349, -60718, -88546, -47914, 7177, 26059, -28432, -62857, -73600, -105826]
15308a05826j6297j2726m0654M6463J8824K4907M5781O0332m3243O5504P4011
15297A17076k8098n4743m3646K4492L4155k4660q0001O984N225j3286j778L2893
15285b5387O9676o0086J6194K7724l4971p8270L56m4768Q7222M5429q1197j8781
15273i6859O6113R064o8027l5055K8678p4479m5574N5746M6891L4154J08273K413
15261C1338q3576k2673m3576k8495k637J12L3228J8825p3223n8246K2874R1793
15249a14256O935k3183J2097J5179n2295L7370j4372K241K4780J8400k7675N522
15237a09257K1498n750q61M042L1132R1773L2493o6577o3592K2468p5811k4059
15225a42501J8727N3345o04k1169L4512K3699m4175L209L4171N7152J4562j1635
$$ y = [-105826, -122123, -134849, -175503, -129040, -110216, -85309, -39528, 20804, -22439, 43065, 117076, 88978, 34235, -9411, 15081, 49236, 24576, -55425, -48441, -43216, -56502, -58280, -25387, 44289, -15797, 397, 28121, -6850, -85120, -84764, -129532, -42310, 3119, -78078, -96859, -30746, -21682, -89709, -124764, -96086, -170565, -216139, -160393, -113502, -79348, 28925, 31338, -52238, -74911, -118487, -146982, -149619, -149507, -116279, -97454, -170677, -228923, -206049, -114256, -107321, -130504, -118407, -103228, -155523, -118153, -132525, -130284, -105504, -87104, -114779, -109257, -87759, -93509, -94370, -90328, -59196, 32577, 65070, -1507, -65099, -42631, -118442, -142501, -123774, -70429, -71033, -92202, -57690, -33991, -78166, -74957, -40786, 16366, 30928, 19293]
15213A9293L2064M1291r948o4466k6421J1316k1357m255l2049k0785K8778L5561
15201a0978m6904o2511l9541L8378M1333N3495l0832M9169K0642q3531j2922K5461
15189e8741K1314J9522k071m495k7283m3513O6166P3457m6381n1846j5035j6251
15177h5157j3028j5297O0879N2090Q469o0244p7128N4522k369l9774Q5795P7973
15165D6731L0191l041m8393l9594j6992L5629k0730q0634j6330J5741N0882J9225
15153b7315K7370n0459j468J8722l2148l0321J9536M1930o2290q904l2257J2449
15141a25155K7775O993K4870L6270M9259J5922l5706k2369L5700J5559j6253o8388
15129e5523o985N6915j420j6391o626m7588K0983J5048J6356O6093r3973p2645
$$ y = [19293, 51357, 92648, 82700, 18234, -8187, 3129, -18228, -22483, -54532, -75317, -46539, -10978, -57882, -120393, -159934, -121556, -80223, -26728, -57560, -8391, 12251, -71280, -84202, -58741, -37427, -17905, -19976, -24471, -51754, -95267, -29101, 44356, -2025, -53871, -68906, -85157, -98185, -113482, -52603, -513, 7956, -52288, -129416, -74894, -77263, -117037, -31242, 46731, 76922, 73881, 25488, -14106, -31098, 4531, -16199, -96833, -113163, -97422, -46540, -27315, 55, -50404, -51872, -33150, -65298, -95619, -76083, -34153, -96443, -105347, -137604, -125155, -97380, -90387, -65517, -29247, 20012, 35934, 228, -22141, 13559, 29118, 12865, -55523, -62508, -5593, -7013, -23404, -30030, -77618, -56635, -41587, -25231, 40862, -53111, -125756]
15117a25756N8315p650n769K5269K7044L5267k1912l0000J9595N2551J4719N506
15105D7179m4220p4524Q727R049Q1702O8054M3600m5859n8187m3546j6310K9185
15093D850k0659M368p4540q9268K6513N8329K7741M5007P1309L4777K1192j26205
15081a6586k4510L3056j5108q6648R719J1132L1401K3207m9632m3995K0946N0385
15069e6633L7238j4956K9429K8994n1634l3834L2878M4911r7772p9271P9299m3137
15057a24488m8287M4330l2279N5911P7785J8711r6826l3933N4923J4806k243J06744
15045C5154K5022o3606o7538l6740N8864L7496J0287n7688q5714L9131M5579P1924
15033A2171k0061q1988K753J22034P3813r1047j67588n5153J5943K4458J05373
$$ y = [-125756, -67441, -75091, -80860, -55591, -28547, 6720, -15192, -45192, -25597, 26954, 41673, 47179, 2959, -71565, -62838, -53789, 27913, 95967, 139567, 93708, 35521, -8025, -24335, 4850, -15809, -11441, -85981, -175249, -148736, -90407, -62666, -17659, 53650, 88427, 109619, -16586, -41096, -8040, -23148, -109796, -100077, -88945, -57544, -34337, -83969, -127964, -107018, -56633, -19395, -34351, -4922, 24072, -27562, -61396, -28518, 16393, -81379, -160650, -81351, -124488, -172775, -128445, -160724, -104813, -27028, -8317, -105143, -139076, -84153, -69347, -71590, 35154, 60176, -3430, -70968, -107708, -48844, -11348, -1061, -58749, -144463, -105332, -59753, 12171, -7890, -89878, -87125, 34909, 108722, 17675, -149913, -205066, -189123, -164665, -59292]
15022e9292P6287K6393l7124L6235j7913k0082n8656l8140j4908O793n9334K5476
15010a34265L2863K1645L315J0781K9636k3696l6477M191Q5395M5433o2963r2887
14998a17029k5293L8093l2593M273K6896J4821L8015J4904L2087p557m6395l9956
14986i9734L551N0853J7526n1101q4098j8960J5799j0816N9607R0592Q7894q8907
14974b7794l38o056p9145K7713k3120K6326N308r2509m7508J2181J8828J8214
14962a67900M2005Q3396M0776k7643p7438L9480k5077l5213j7229j1919P9234
14951g7528P212K1739M8083l8115L0975j5502k4117N6336N0539p8763k8463Q6292
14939C8688L601J9402O2696k9363k4727L120n7883o6987j636P7447k4309M8736
$$ y = [-59292, 16995, 43388, 6264, 42499, 24586, 4504, -54152, -92292, -107200, -100407, -159741, -134265, -101402, -79757, -76442, -65661, -36025, -59721, -96198, -92007, -6612, 38821, -24142, -117029, -142322, -104229, -136822, -132549, -105653, -90832, -52817, -37913, -5826, -13383, -59778, -99734, -96183, -45330, -27804, -78905, -163003, -181963, -166164, -176980, -117373, -26781, 61113, -27794, -28132, -34188, -113333, -85620, -108740, -82414, -77106, -169615, -217123, -204942, -186114, -167900, -125895, -42499, -1723, -29366, -106804, -67324, -92401, -127614, -144843, -156762, -77528, -70316, -48577, -494, -38609, -7634, -23136, -47253, 9083, 59622, -19141, -47604, 38688, 42289, 61691, 124387, 95024, 70297, 73417, 15534, -51453, -53089, 24358, 49, 48785]
14927D8785L933j7435R154O1510o7699j02050J5703K0857q1891m8589M3878O3030
14915e0814j2760j6953J9879P542K2759M40J6981P0340K2509k6544l8638N3671
14903F8412J0107j10641j03735l655k1664M0639O8382k8474o5129J4417K2944
14892a08397J4367J3805K7951O2616M434l3810m7512k1110L2459K1233R3872J5070
14880G4978N952J3881o1272l1929k685J6643O234N3758L7726o7817o7029l7355
14868e8915p515J6199J07832N7168j33458r0955Q1182N4669l3702q1804M2908
14857d6391M1958O3066Q6738N7068o0140r8370L0631K6756R591j9425N246k6171
14845G0557k8696r405L1678M8554o3056n7808j598K7962j56m4532j01690k0829
$$ y = [48785, 52718, 35283, 44437, 105947, 38248, -63802, -48099, -27242, -109133, -157722, -113844, -50814, -63574, -80527, -60648, -53106, -30347, -29907, -12926, 57414, 79923, 53379, 14741, 68412, 78519, -32122, -135857, -139512, -161176, -120537, -52155, -80629, -145758, -131341, -108397, -94030, -80225, -52274, 10342, 14776, -19034, -66546, -87656, -55197, -33964, 59908, 74978, 80930, 94811, 33539, 1610, -1075, 15568, 21802, 75560, 113286, 45469, -21560, -58915, -66430, -50231, 57601, 114769, -18689, -109644, -28462, 26207, -7495, -89299, -46391, -4433, 58633, 145371, 202439, 142299, 43929, 74560, 101316, 110907, 91482, 96728, 70557, 41861, 32456, 64134, 112688, 49632, -8176, -9774, 18188, 18032, -26500, -128190, -149019]
14833a49019l5349N2524Q0486Q231L5014k832J1990k338O294N365m6392m4755
14821h0781L4744N1519K7606n6383j21475j3837j6379j4483l6607M0234J07807
14810g8035K3004K0416l8881J3182Q1777n4666m0985k6950J2567m0542m0611O1823
14798a07901N9938Q1823K9171N9756O7002l6398n8158k9906M701j4892m9558l3459
14786b7881j10723r0946J8640K7156N4641M0961N5808J4956J6589m0289K7208
14775a3880L4786k4923l1502M7256j8622J3033q043L9249r450k4874R830O21m4184
14762c0703n3914J2046Q8849M2966n4438M678O0154k982n530q2871l5319j6286
14750g3350R4M5379J6065J3063K1490K366k2061K9836m379M3510k7292R370K2856
$$ y = [-149019, -184368, -131844, -51358, -43127, -8113, -10945, 1045, -1293, 5001, 10366, -36026, -80781, -46037, 5482, 33088, -23295, -144770, -158607, -174986, -189469, -226076, -185842, -78035, -55031, -34615, -73496, -60314, 21463, -33203, -74188, -101138, -88571, -129113, -169724, -107901, -47963, 33860, 63031, 122787, 189789, 153391, 95233, 65327, 70028, 55136, 5578, -27881, -138604, -229550, -210910, -183754, -129113, -88152, -32344, -17388, -799, -41088, -13880, 20906, -4017, -35519, 11737, -6885, 6148, -1895, 37354, 27904, 3030, 12860, 13481, -30703, -84617, -72571, 16278, 59244, 4806, 9484, 69638, 66656, 61126, -21745, -57064, -73350, -73256, -27877, -11812, 1251, 22741, 25107, 3046, 32882, 28503, 72013, 44721, 54091, 76947]
14737G6947n9748q1500K632Q8675L9790n7477p7211J8178j413l5629j3604l1951
14725a32311K9406R7833M7529j03137j9683L0315l5592o3888q126O5941p1233
14714a62946O2660N4071j1288M0132K3339m9132R297P4887P964o6733R774p781
14702a5756n7376m9939m6099J601l9919Q2859P1285j7221j9890O9169J7482q1391
14690h5195q2627J5049M0702P276l616L2067N8334j3918K8576O830l1659l3081
14678f1262Q642O725l322k1788o5223j2833J5862L8311j7986m0907K9858k3359
14666a47282j253k2168j3186J6053L7357K8596R370J3552R3823o5566n4998J578
14654a04124K5510P8971O8640l5028r767O2430l2376j9503p266k8333r2281l2560
$$ y = [76947, 17199, -64301, -61669, 27006, 66796, 9319, -67892, -49714, -51127, -86756, -100360, -132311, -102905, -5072, 42457, -60680, -80363, -50048, -85640, -149528, -157654, -91713, -162946, -100286, -46215, -57503, -17371, 5968, -43164, -33867, 41020, 48984, -17749, -7975, -15756, -73132, -123071, -169170, -167569, -207488, -124629, -53344, -70565, -90455, -21286, -3804, -85195, -167822, -152773, -112071, -104795, -108411, -76344, -18010, -31928, -3352, 3478, -28181, -61262, -52620, -45895, -49217, -71005, -136228, -149061, -133199, -94888, -112874, -153781, -123923, -147282, -148535, -170703, -183889, -167836, -130479, -101883, -92513, -78961, 14862, -50704, -105702, -104124, -78614, 357, 68997, 33969, 24202, 86632, 54256, 34753, 27487, -846, -93127, -125687]
14642a25687P1624L6471Q8J6323n1375R8765J35502M395p0742p8750k4696m751
14630G167j1080l3871n231m0191m3985j3970Q8922O2762N2986P3335k1809q7476
14618B7559o9144l0377K9328K9673l3644k8701O1646k963k0414R3058l3009o2345
14606c9333j2151J8316j973M1808n8491l1186O148L4850M9738j302l6201K3843
14594e934N8325M84p4822L516N3306J9455l0720L9891k8081p4901m7659K0190
14582f6950N5794n7510n5558J890l8698n631M9966J30917n114r740Q5981M4243
14570A29590j5837m1452l2995k6816k8716o874j0403j3409m4637N8884P3379K462
14558D3176j6969j0626j7247p802m1481j2130m7480L3257M7797K8945o230q465
$$ y = [-125687, -54063, -17592, -17504, -1181, -52556, 46209, 181711, 186106, 115364, 36614, 11918, 7167, -3913, -37784, -43015, -83206, -127191, -141161, -52239, 10523, 63509, 136844, 115035, 27559, -41585, -71962, -42634, -12961, -46605, -75306, -13660, -16623, -37037, 56021, 23012, -39333, -51484, -33168, -35141, 6667, -51824, -83010, -76862, -42012, 7726, 6424, -29777, -5934, 52391, 52875, -21947, -18431, 34875, 54330, 23610, 63501, 35420, -39481, -87140, -66950, -11156, -68666, -124224, -122334, -161032, -166663, -116697, 14220, 9106, -634, 85347, 129590, 113753, 72301, 39306, 12490, -16226, -23100, -33503, -46912, -91549, -32665, 40714, 43176, 26207, 15581, -1666, -9468, -50949, -63079, -110559, -77302, -29505, -560, -6790, -15255]
14546a5255O820K0369p309K4084k9046k7875J7809J8714L6216n8443j3843L7623
14534I864j6224k7897k7879k419K9422j0563j7999L4993m1073k7078K643o4877
14522a59087k9831O4194R2471L523o0645J3721M2086n304k2803o878k1507L1874
14510e8186j6130m301Q9360m4872j1928k2201N514k9022j8701M5982K2713N612
14498c6160K8622J2367N9528j8733l5779L8635K028m2771j7824J0124J02714m807
14486I7944n3477p0173k2302N9716L0700n4187M024k0276j1259O1768n540m0844
14474b3906l9474n9106N6904O0657J153M4005L844k6346j4481K5439n939J6781
14462C9531m0838M960k2889K876p3464J432K5685L341O0465L8401J0810j5434
$$ y = [-15255, -8435, 11934, 4625, 28709, -337, -28212, -10403, 8311, 44527, -13916, -27759, 9864, -6360, -34257, -62136, -64555, -35133, -45696, -63695, -28702, -69775, -96853, -94210, -159087, -188918, -124724, -32253, -28730, -89375, -75654, -33568, -38872, -61675, -68553, -90060, -58186, -74316, -78617, 10743, -34129, -46057, -68258, -62744, -91766, -110467, -64485, -41772, -36160, -7538, 4829, 64357, 45624, 9845, 48480, 50508, 7737, -10087, 37, 102751, 97944, 44467, -25706, -48008, 11708, 42408, -11779, -7755, -28031, -39290, 22478, 16938, -23906, -63380, -122486, -65582, -4925, -3772, 40233, 44077, 17731, 3250, 28689, 22750, 39531, -1307, 3653, -19236, -16360, -89824, -88392, -62707, -59366, 1099, 39500, 50310, 34876]
14450C4876m1624p2363K5211L6719j6645R994j0991L1980O2376M4662O9606m0420
14438A33381n9556r3760j21562Q3388M2665L3936P7117p5652m9030J0425K6294
14427G646P1734m2105n2247K6230K5679K037m0787M5509K7200J7667l3332q623
14415D6608l0992J0349L1563l8327l2780J4030K2493j5480J1013J3704j8504M497
14403A8174K2384L6041l7722r792l3746l0024M0731j3477o2695J3332M6863L4449
14391B4518P633m5939o9792L0862n8244O347Q1377N6381j2375l8610k2328j3407
14379e3577k9183j0981L022L5034K9089N295K7617J1563k6129m6731K8467M7089
14367B0575K7536O3857L3074q5847P420J6431o0209m4533k9097K6331P255Q307
$$ y = [34876, -6748, -79111, -53900, -17181, -33826, -23832, -34823, -2843, 59533, 104195, 173801, 133381, 73825, -19935, -141497, -58109, -15444, 18492, 95609, 19957, -29073, -18648, 7646, 79380, 37275, -14972, 11258, 36937, 38974, -1813, 43696, 70896, 88563, 55231, 46608, 15616, 25965, 57528, 19201, -13579, 451, 22944, 7464, 18477, 32181, 13677, 18174, 40558, 76599, 38877, 29085, -4661, -34685, 6046, -7431, -70126, -56794, -9931, 24518, 32151, -13788, -83580, -52718, -110962, -104615, -23238, 33143, 20768, -17842, -40170, -53577, -82760, -93741, -90719, -55685, -26596, -21301, 6316, 17879, -8250, -54981, -26514, 20575, 48111, 111968, 145042, 59195, 66615, 83046, 22837, -21696, -50793, -24462, -17207, -8900]
14355h900k4515n0463J3957L1511J5116J7604j0705j0158k7651P268M6296J3594
14343A2954J6280K4217J298m9933K8427m2283j2781M1078J5449l2167q7294r716
14331i4471j543j5375L0794L8759j0583m1402R5013P9141o0127n0687N724n3236
14319g7993J2298N5782q226k5694n780L0129O1493l9721n6742J643L7765J10368
14307I5322o4582o5334k7362J00916N6489k9916j07391l2432J4611M5282P1909
14296E7512M678m8039l2508J310o205M4370M465k442L6837P1354l6572L7551l7135
14283I5176q3693j24988m7201M3196P0214L5772M0931k321L8224J156k9970Q978
14271D5474K3738j9774r7284N5404l7047j0271J6040R028j0374L9283L8705m2867
$$ y = [-8900, -33415, -83878, -69921, -38410, -23294, -5690, -16395, -26553, -54204, -46936, -640, 12954, 29234, 53451, 54749, 4816, 33243, -9040, -21821, 19257, 34706, 2539, -84755, -94471, -96014, -111389, -80595, -41836, -52419, -93821, 1192, 80333, 20206, -30481, -24757, -77993, -65695, -9913, -18139, -43833, -49613, -19484, 42009, 2288, -54454, -52811, -15046, 95322, 30740, -34594, -61956, 38960, 95449, 65533, -41858, -74290, -59679, -14397, 57512, 62190, 14151, -18357, -17047, -23252, 21118, 25583, 23141, 59978, 131332, 94760, 132311, 95176, 11483, -113505, -160706, -117510, -47296, -11524, 29407, 27086, 65310, 66466, 36496, 45474, 69212, 49438, -47846, 7558, -29489, -39760, -23720, -14692, -25066, 14217, 52922, 10055]
14259A0055m0794M3993P5753L9031k0939r7936P919N525R528m8568o2449j099
14247g9981M8827O5278L7797o0780P118N2412m6540q5752k1088J03323N5482K8892
14235A04988m544l4557M817k5722m8822n8942m838m1298m6468K6838J3760R7266
14223a7522J1223p890j4640O8206l1951j14489j3218O1034J14202n230M1459k71
14211I0913o4374j1985m5291K6796J5598N9691k432n1612l6953K0260m5990K6035
14199a9344J775j8066k0980L0532K0760N4537P0424j1444q8450j03755j9734J6051
14187h7694O8387l6804Q23K8627J0006J1199J0184l2982k391P026M0052K1187
14175C7620m8653j3851j5426K6972M1914J0720l1177J7940l9005K8031l2288p2094
$$ y = [10055, -30739, 13254, 89007, 128038, 107099, 9163, 17082, 22607, 32135, -16433, -78882, -79981, -31154, 34124, 71921, 11141, 18259, 70671, 24131, -61621, -82709, 20614, 76096, 104988, 100444, 65887, 70704, 44982, -3840, -62782, -67620, -108918, -155386, -128548, -114788, -17522, -6299, -14189, -28829, 39377, 7426, -107063, -120281, -59247, 54955, 49725, 91184, 90913, 26539, 14554, -30737, -3941, 11657, 71348, 68916, 17304, -19649, 611, -45379, -19344, -17569, -35635, -56615, -26083, -5323, 49214, 119638, 108194, 19744, -84011, -103745, -87694, -19307, -56111, -55288, -26661, -16655, -5456, 4728, -28254, -30645, -23619, 16433, 37620, -11033, -24884, -40310, -13338, 28576, 39296, 8119, 26059, -12946, 15085, -17203, -89297]
14163h9297l4750P9144Q3748O630r829j0590L4749K6544r1825k9646K1345n1880
14151f5657k15R443J9890j3994J6540k2692J3329O7893J5639n2779j3986P646
14139a8943O4576Q6739o0103K7038L6052m1965M670K0404J1589Q344n3577j5204
14127F9620j5539p815J6156j5641m2333m3590j1598N1534J16984N6641m5152n2321
14115G6946m4521j19381j9300N2984J6871K5051k5315N5593K9100j2748k1218
14104A4062L801o3588L5196L6609P157K1725k2326M634Q2284Q0488l391p0537
14092A26114n0831M3809M7546j5570j17526m7923M7590L2648N128M0110l8497
14081G2598J0775k290J6053m8066l3154m2113l2648n3430O838R6225M1718m0769
$$ y = [-89297, -124047, -44903, 38845, 45475, 35646, 25056, 59805, 86349, -5476, -35122, -13777, -65657, -65872, -56429, -36539, -50533, -33993, -56685, -43356, 24537, 40176, -12603, -26589, -18943, 45633, 132372, 72269, 99307, 135359, 93394, 98064, 118468, 130057, 138401, 84824, 69620, 54081, 46266, 62422, 46781, 4448, -39142, -50740, 794, 117778, 174419, 129267, 76946, 32425, -86956, -106256, -53272, -36401, -11350, -36665, 18928, 48028, 35280, 14062, 17863, -45725, -10529, 26080, 33237, 54962, 32636, 37270, 119554, 200042, 196651, 126114, 75283, 119092, 166638, 151068, 33542, -14381, 33209, 65857, 70985, 111095, 72598, 83373, 81083, 97136, 49070, 15916, -26197, -58845, -112275, -105437, -9212, 32506, -8263]
14069h263m9225P8477M0939j181j2961L9900j6463l235k0904p2182l3491P3218
14057A4629K6700m6572j6860L9419J6166k7292O5819J5248M4288O7119p2697m0742
14045H5225j631j3856k2079j39347P339P0451L7770R626J3888j4756M6465N388
14033H4483K8263J0319k666l7586n2457n7115O6136q093j3543n8110q1964j033
14021a23366M48K6709M6062K2783L262n7848K16J12576J15329K0351r6713m8527
14009B1282k5128J7244j5988P380J0126q36k6233J1428J02029k2944j1590O523
13997G3293k7765k0917l8227R509O4236n374J5011j8073l8564j8638p4347L4620
13985d5236P7300N50j1491m4063Q443J3213K7252j6700q3946J0506N2215j544
$$ y = [-8263, -57488, 20989, 61928, 60747, 47786, 87686, 71223, 67988, 47084, -25098, -58589, 14629, 41329, -5243, -22103, 17316, 33482, 6190, 72009, 87257, 131545, 198664, 125967, 85225, 83594, 69738, 47659, -91688, -84349, -13898, 23872, 33498, 47386, 32630, 79095, 84483, 112746, 123065, 120399, 82813, 30356, -26759, 39377, 31284, 17741, -40369, -122333, -123366, -122918, -96209, -50147, -27364, -24102, -81950, -81734, 30842, 146171, 166522, 69809, 21282, -3846, 13398, -2590, 4790, 14916, 14080, -12153, -725, 101304, 78360, 66770, 73293, 45528, 24611, -13616, -4107, 60129, 54755, 69766, 51693, 13129, -5509, -79856, -45236, 32064, 32614, 21123, -22940, -14497, -1284, 25968, 9268, -74678, -64172, -11957, -13501]
13973a3501K4868J2177k977J4475p5n5023l4214L283J5180O9652P6596n4704J413
13960E7150m2501o7815l1778N7071Q0844J0264o067O8009J5133j0719j4354K051
13948A17288L0481j6640L2894J1269o0391Q801K0034N3186j148q2982n8697p1342
13936a7247p5855N2689J10295O0935m6665l1605Q2457L5012N636m433o0297l8782
13924G2140P558N4156L487J8172j2051K040n8513j3141K2075R646q155L0603k989
13911A25028m7180m717Q914K2558M4613l1352q6664n9906N0865O9770N6660l4122
13899A14467n2291l1671n7252k9527j6523n1558R768L3699K4217P2163Q6291l3426
13887F8357l0323K1659Q9149K8496m9895o409j7900K0658O2090K9844m3467q0138
$$ y = [-13501, 11367, 23544, 20567, 35042, 34967, -20056, -54270, -50987, -35807, 33845, 110441, 55737, 57150, 14649, -53166, -84944, -27873, 52971, 63235, 57168, 125177, 140310, 129591, 115237, 117288, 147769, 131129, 164023, 175292, 114901, 123702, 143736, 196922, 195774, 112792, 54095, -17247, -93102, -40413, 69882, 130817, 84152, 52547, 135004, 170016, 175652, 171219, 110922, 72140, 79698, 133854, 137341, 155513, 143462, 145502, 86989, 73848, 95923, 105569, 97414, 128017, 125028, 77848, 73131, 82045, 104603, 149216, 117864, 31200, -28706, 22159, 91929, 148589, 114467, 62176, 30505, -26747, -56274, -72797, -124355, -114587, -80888, -56671, 15492, 101783, 68357, 38034, 59693, 148842, 177338, 127443, 121034, 103134, 123792, 185882, 215726, 172259, 92121]
13875I2121n6335K6669J4008n48R731K2084l0022q4706n3914l991P4596L836L2097
13862D5626P3535K1073j9552m2734k1562N079m1886N058R8788P1255r4520l8092
13850F2068P6643O419N434K8576k459n5815L0716o0099J6072M2239J089l113n9089
13837H8681J8375m1232j2962J4315J6184J3282l2372k0280L106m8076P3106L8592
13825A10719l3831l9931l1993k1518j5433L5016K6063J1796o7544l9929R2411
13814B5826R7432p9948n9924J2819N5585p763m6183m9681L2885L8540N2955J9945
13802I2488l0667j07601m8821J9408n782N4546J2734n8175J2902N6403L545M2983
13790D3963M2255L193m2662J5464l7259j9824K9739Q5003L1445J6962l4857M500
$$ y = [92121, 35786, 62455, 76463, 75915, 85646, 107730, 77708, -6998, -60912, -64903, 9693, 13529, 45626, 119161, 140234, 120682, 77948, 56386, 61465, 19579, 24637, 123425, 194680, 100160, 62068, 138711, 145130, 150564, 179140, 176681, 120866, 151582, 91483, 107555, 149794, 150883, 147770, 88681, 107056, 65824, 52862, 67177, 83361, 96643, 64271, 43991, 47097, -979, 72127, 110719, 76888, 36957, 4964, -16554, -31987, 3029, 29092, 40888, -26656, -66585, 25826, 123258, 43310, -16614, -3795, 51790, 44027, -2156, -51837, -18952, 19588, 72543, 92488, 61821, -45780, -94601, -75193, -80975, -26429, -13695, -71870, -58968, -2565, 980, 43963, 86218, 89411, 46749, 62213, 24954, 5130, 34869, 119872, 151317, 168279, 133422, 137922]
13778A37922J4127J2543p4258k0217O638M3717M8511J5373n2910J9363P5900n1333
13766A75376o3516K0436P7440J5515m3161M6144L4358q4701J3991J6387m564n3320
13754A50385n019L079J4256o1688k5440k4641j5585K496L7520l0803l3069M0943
13742E2434M9948N4365O01l9421L1771K2023N0307q075q683j6454l0606l7086
13730A21124j9414P05L7770K1710M2854j0046j5499Q78K4416P2608L9492J7406
13718C34004q8549n2468m1873L7837L1689p125L1975O5263l9570j11436m6376
13707A13371P8509K9505N611M0461K1192j5853m8154L2442k0401O2589L4345J27437
13695D61054L8722l8921R1078J55735J32192Q5155P2248J01011O4798l1763l2408
$$ y = [137922, 152049, 164592, 90334, 70117, 76755, 120472, 168983, 184356, 131446, 150809, 226709, 175376, 111860, 132296, 209736, 225251, 182090, 228234, 262592, 177891, 191882, 208269, 203705, 150385, 145366, 148445, 162701, 101013, 75573, 50932, 35347, 37843, 75363, 44560, 11491, 52434, 102382, 156747, 157348, 117927, 149698, 171721, 222028, 213953, 205270, 188816, 158210, 121124, 101710, 102415, 140185, 161895, 204749, 194703, 179204, 180082, 204498, 277106, 316598, 334004, 245455, 192987, 151114, 188951, 220640, 213515, 245490, 310753, 271183, 159747, 113371, 191880, 221385, 226996, 267457, 288649, 272796, 224642, 257084, 236683, 299272, 333617, 461054, 499776, 460855, 551933, 707668, 839860, 925015, 997263, 1098274, 1163072, 1131309, 1098901]
13684A098901j8046j26490p5889r7379n6176j1959q5722j3849l5837l9992m5654
13673D91908o2535J7561N8607o5351q4170M0533K359L3843N6753N458k7805N3866
13661E21027N921M341K0134K9774P4277L8118R8488N9659O1786O3310M8348P0725
13649A095908J63476K99268K00691J48145J83055J64478P0523l7124j42065k78646
13639A867709j94646j27303k57073k09400r2877j05075o0234n1165m4289k9901
13629F95746k4477j8591r8087j7547k6877k4261N5489K7184j01140k3076J3979
13618D58342N7302M7387K664m2670n1140j7308K769J37239L8298n2579J6244Q5682
13606F82230Q4091J67589J13458R2697J7282R4172K2796L3799l8656p6529k04947
$$ y = [1098901, 1080855, 954365, 878476, 781097, 724921, 712962, 627240, 613391, 577554, 537562, 491908, 429373, 446934, 505541, 440190, 356020, 396553, 398912, 432755, 489508, 494966, 467161, 521027, 526948, 531289, 551423, 581197, 655474, 693592, 792080, 851739, 913525, 976835, 1025183, 1095908, 1259384, 1558652, 1759343, 1907488, 2090543, 2255021, 2325544, 2288420, 2146355, 1867709, 1673063, 1545760, 1288687, 1079287, 986410, 881335, 821101, 769936, 725647, 695746, 671269, 652678, 554591, 537044, 510167, 485906, 541395, 568579, 467439, 444363, 458342, 515644, 563031, 565695, 523025, 471885, 454577, 457346, 594585, 632883, 580304, 596548, 682230, 766321, 933910, 1047368, 1140065, 1157347, 1251519, 1274315, 1308114, 1269458, 1192929, 987982]
13595I87982j05289q5917n6943o288o4477n0227m9165j20472n3426K4581N3779
13584D74138L4804k0297K1606q6946q9373o7993l7152R4721L8296p2898o142r238
13572B73526p479P454j8084J2833P55p638J1453k2223L4843L2086K760K7838K3297
13559C71421M866j5158J439J66651M3917n4457m569j5095q3796n0494j08602n5006
13547B01117K4737K0206j5188n0358J3278N7068M6912Q3236j5412n413J1724M9341
13535D21248k0027N8332J0072M204J9017L8540o9072k5501N9091j3607k9096Q705
13523D61906K8908j4608j4840j4552n0124K1602O3121K4638j4785o001J7554M7619
13511E50438l1230J6793R939P2225M5451J25172P7583J9982j2119l3386O757P6177
$$ y = [987982, 882693, 796776, 739833, 733545, 669068, 618841, 569676, 449204, 395778, 420359, 474138, 508942, 488645, 510251, 423305, 333932, 265939, 228787, 323508, 361804, 288906, 282764, 273526, 266047, 273501, 255417, 268250, 269005, 261367, 272820, 250597, 285440, 317526, 320286, 348124, 371421, 376287, 361129, 362568, 529219, 573136, 518679, 514110, 499015, 415219, 364725, 256123, 201117, 225854, 246060, 230872, 180514, 193792, 250860, 297772, 381008, 365596, 360183, 371907, 421248, 401221, 459553, 469625, 473829, 492846, 531386, 462314, 436813, 495904, 482297, 453201, 461906, 490814, 476206, 461366, 446814, 396690, 418292, 481413, 506051, 491266, 485265, 502819, 550438, 519208, 536001, 545940, 618165, 663616, 788788, 866371, 886353, 874234, 840848, 847605, 923782]
13499I23782J1666j9021M3899M9649M9849K3804N9917O7739L8572j1285p256n405
13487A225910K5001L2350p157o7817n2245j594L2705l7128l1293j7120J9295k8557
13475A092350q7639p5448R6468Q1261K6716j2230p0032q412K1634M8214m7878
13464A065004n224M7044M8262J46020J22766J37116O783M1531Q1599J7907j1921
13453A696887J22380M0200n861O2965O7760K906J5458j5969o8288K6002j9077
13442A925363q5870r0687p9830k2377L469q5018j5225j5690m9881p851m741q4888
13430A386774k9682k1643p2641m3249m4533j7817J2831K376O0020k6709k0959
13419A184768K562j4083L8836M6287J5688K2740l471L4467P0436L8911J2379K2134
$$ y = [923782, 935448, 916427, 960326, 1009975, 1059824, 1083628, 1143545, 1211284, 1249856, 1238571, 1231315, 1225910, 1250911, 1283261, 1276104, 1208287, 1156042, 1154448, 1187153, 1150025, 1118732, 1101612, 1120907, 1092350, 1004711, 929263, 1025731, 1106992, 1133708, 1121478, 1051446, 1043034, 1064668, 1112882, 1065004, 1059780, 1106824, 1155086, 1301106, 1423872, 1560988, 1567771, 1609302, 1690901, 1708808, 1696887, 1819267, 1859467, 1853606, 1916571, 1984331, 1987237, 2002695, 1986726, 1918438, 1944440, 1925363, 1839493, 1748806, 1668976, 1646599, 1650068, 1565050, 1549825, 1534135, 1484254, 1476403, 1471662, 1386774, 1357092, 1335449, 1262808, 1219559, 1175026, 1157209, 1170040, 1172416, 1232436, 1205727, 1184768, 1187330, 1173247, 1212083, 1258370, 1274058, 1296798, 1293327, 1327794, 1398230, 1437141, 1449520, 1471654]
13407A471654O981L5197j3537l2900m6861r0708M5553j8075P292j6525n0049j806
13395A296216M3807k9586m4522q280K8706j0678j05555m3204m8214K5316l696
13384A100310k0559p21N1128Q391j3850K6051j4408k4805P299J7096k5793j2621
13372A097518m1828m6497M3866O0643O1633R6596L0348M6505J00397K6129m2216
13361A433094L7297o0483j21398k4074M0228l5581J468L7152L1212j5831O399
13350A329483Q4153L7315j6819k6328J070N03l9434L5480N5381M4326k8576j9401
13338A457153M6133m6333o9332J41070P5546N259P7047J00080J08612m599M7320
13327A937956Q1128J46465J51518J85746J56759J14215J09031N0071L3401p4857
$$ y = [1471654, 1478635, 1513832, 1500295, 1467395, 1420534, 1329826, 1375379, 1357304, 1364596, 1348071, 1298022, 1296216, 1340023, 1310437, 1265915, 1257635, 1286341, 1275663, 1170108, 1126904, 1078690, 1104006, 1100310, 1079751, 1079030, 1130158, 1138549, 1124699, 1150750, 1136342, 1111537, 1118836, 1135932, 1110139, 1097518, 1055690, 1009193, 1053059, 1113702, 1175335, 1271931, 1302279, 1348784, 1449181, 1475310, 1433094, 1470391, 1409908, 1288510, 1264436, 1304664, 1269083, 1270551, 1307703, 1338915, 1323084, 1329483, 1413636, 1450951, 1434132, 1407804, 1408874, 1409377, 1369943, 1405423, 1460804, 1505130, 1476554, 1457153, 1503286, 1456953, 1387621, 1528691, 1604237, 1609496, 1686543, 1786623, 1895235, 1890636, 1937956, 2019084, 2165549, 2317067, 2502813, 2659572, 2773787, 2882818, 2932889, 2966290, 2891433]
13317B891433j11442r0624j84L2534j9675j7382J7407m157q042R247L5923O259
13305B741297L88L9580J51565J61565N3293J33796J88850J20242J33699P8536
13295C802811R7914J96014L15183K27003J31774K10658J21441J96734J37136L9894
13285E476562M3665R3266N9038J24656J98349K89253K18763K56125J76897J31654
13275G068228R3598J30977K53843J69833K30031L23558K78376L86020M64166N65724
13265I964354O04174O95701Q19886R44089J163583J383989J643195J864739K114465
13256B1198175K535115L030660L480077M061236M813916N855993P318915R229687
13248F1523774J1690650J5008998J8694836K2166076K4681332K4655677K0662897
$$ y = [2891433, 2779991, 2689367, 2689183, 2721717, 2702042, 2684660, 2702067, 2697910, 2689868, 2699115, 2735038, 2741297, 2741685, 2781265, 2932830, 3094395, 3147688, 3281484, 3470334, 3590576, 3724275, 3802811, 3900725, 4096739, 4411922, 4638925, 4770699, 4981357, 5102798, 5299532, 5436668, 5476562, 5520227, 5613493, 5672531, 5797187, 5995536, 6284789, 6503552, 6759677, 6936574, 7068228, 7161826, 7292803, 7546646, 7716479, 7946510, 8270068, 8548444, 8934464, 9398630, 9964354, 10568528, 11264229, 12084115, 13028204, 14191787, 15575776, 17218971, 19083710, 21198175, 23733290, 26763950, 30244027, 34305263, 39119179, 44975172, 52294087, 61523774, 73214424, 88223422, 106918258, 129084334, 153765666, 178421343, 199084240]
13241A99084240J2164694O53645j0816324j9138182k2907654k2696644k0156937
13234A16186838j6792753j3558305j0664691q466353o648771n287925m411563
13227E0356477l525358k746131k186447j709576j248205p72162l99269J19375
13219C7888704O10798J112776J632838K216971K898104L611411M417577N237950
13211E9627129O268403P412212Q876555J0816870J3371917J7035821K1948208
13204A45357115K8390643L6585927M5757514N4494094N9578854N6203240M0026313
13197D66393700J1130209k2759999m9752190o2129363o0897922n2008060m1388804
13190A88587571l1819423k4324300j8615738j4476971j1557416r473122p846588
$$ y = [199084240, 211248934, 211902579, 201086255, 181948073, 159040419, 136343775, 116186838, 99394085, 85835780, 75171089, 66704736, 60055965, 54768040, 50356477, 46831119, 44084988, 41898541, 40188965, 38940760, 38168598, 37769329, 37888704, 38499502, 39612278, 41245116, 43462087, 46360191, 49971602, 54389179, 59627129, 65895532, 73307744, 82184299, 93001169, 106373086, 123408907, 145357115, 173747758, 210333685, 256091199, 310585293, 370164147, 426367387, 466393700, 477523909, 454763910, 405011720, 342882357, 281984435, 229976375, 188587571, 156768148, 132443848, 113828110, 99351139, 87793723, 78320601, 70474013]
13183G0474013o680627n808537m989865m099910l372920k610465j937621j450014
13175C9524054r97438m43827O2258N16833J044549J597142K190140K780031L422631
13166D9696373M122715N212007O620876Q480782J0932037J3898092J7383374K1010784
13158A37357040K4097268K5115910K2434590J5060542L618137r160206j9620120
13151A98903161k5457203k6618018k4474587k0806129j7015937j3581950j0695726
13144F0253611q414926o805765n674719m834642m200252l573328l111846k675707
13136B0962426k310929j941090j726523j491326j318126j149299r48526q28114
13128I248493p58816p09555o26500n74653n02165m14804l64392l23433l45499
$$ y = [70474013, 63793386, 57984849, 52994984, 48895074, 45522154, 42911689, 40974068, 39524054, 38526616, 38082789, 38145047, 38661880, 39706429, 41303571, 43493711, 46273742, 49696373, 53819088, 59031095, 65651971, 74132753, 85064790, 98962882, 116346256, 137357040, 161454308, 186570218, 209004808, 224065350, 227683487, 218523281, 198903161, 173445958, 146827940, 122353353, 101547224, 84531287, 70949337, 60253611, 51838685, 45032920, 39358201, 34523559, 30323307, 26749979, 23638133, 20962426, 18651497, 16710407, 14983884, 13492558, 12174432, 11025133, 10076607, 9248493, 8489677, 7780122, 7153622, 6578969, 6076804, 5662000, 5297608, 4974175, 4628676]
13119D628676k93333k01936j22937j36444j07696q5899j54380j71710j85856j28147
13109C040338q1014j03713p6154k02219j73208j74273r1434J2056o6000j22550
13099A961829p0099p5608n6034o3739l9088r3110l6675n2835l1818j5244N425
13088A433004l0855l6606j8503r5997m505k2038o1939k2130L3471n8453m2765
13077A072684j01006o9706q4596k8780J6017J43821J63566J03645K21650L06987
13067A744282J09773j28492j28489k23266j33494o0875M7004m4486q2787M2902
13057A142072O4999P8517N0836J6004M4873J09171J86588K32590J43975J07349
13047B176974J68171J96084J70462J36702M7444L3344o2449o0367q4016m6202
$$ y = [4628676, 4335343, 4133407, 4010470, 3874026, 3766330, 3680431, 3526051, 3354341, 3168485, 3040338, 2959324, 2855611, 2779457, 2577238, 2404030, 2229757, 2138323, 2150379, 2084379, 1961829, 1891730, 1816122, 1760088, 1696349, 1657261, 1564151, 1527476, 1474641, 1442823, 1427579, 1433004, 1402149, 1365543, 1347040, 1251043, 1246538, 1224500, 1162561, 1140431, 1173902, 1115449, 1072684, 971678, 901972, 817376, 788596, 804613, 948434, 1112000, 1215645, 1437295, 1744282, 1854055, 1725563, 1597074, 1373808, 1240314, 1179439, 1226443, 1181957, 1099170, 1142072, 1207071, 1285588, 1336424, 1352428, 1397301, 1506472, 1693060, 1925650, 2069625, 2176974, 2345145, 2541229, 2711691, 2848393, 2895837, 2929181, 2866732, 2806365, 2722349, 2676147]
13037B676147n8728j79225j84839r9510j79913j31750k36722j95685J5443J01355
13027A526573O0411M8693J25580L3714Q5045Q0727j36940j67088j06012n1063
13017A499640O3833N564l7234L7792P8403P9333L4265J69470K36677J42886J40260
13006B450889Q8746J53050J38050p3940q8559o9194o7505j31510j57077k06621
12996B036329j45764j52257j77225j09100j16135j22536q3096n532m0918j5273
12986A068493p4852q9171j31451j3153o804q0954Q7859R1108K1976l9552m7465
12975G86034p4564o6147j6413N5614l7191O314J8854J0523j2125k394J0413P1281
12963G50199Q1620R9344J17041R6497N3174R0809P0919N6874K5468J249n8771
$$ y = [2676147, 2617419, 2438194, 2253355, 2153845, 1973932, 1842182, 1605460, 1409775, 1425218, 1526573, 1586984, 1635677, 1761257, 1794971, 1880016, 1960743, 1823803, 1656715, 1550703, 1499640, 1563473, 1569037, 1531803, 1569595, 1647998, 1727331, 1761596, 1931066, 2167743, 2310629, 2450889, 2539635, 2692685, 2830735, 2756795, 2668236, 2599042, 2531537, 2400027, 2242950, 2036329, 1890565, 1738308, 1561083, 1451983, 1335848, 1213312, 1130216, 1124684, 1083766, 1068493, 993641, 904470, 773019, 759866, 753062, 672108, 759967, 851075, 873051, 833499, 786034, 711470, 645323, 628910, 684524, 647333, 653647, 672501, 683024, 670899, 668505, 678918, 750199, 831819, 931163, 1048204, 1144701, 1197875, 1288684, 1359603, 1416477, 1441945, 1443194, 1384423]
12952A384423j30316p3821o1045p4580m2713j53280j54274k0390r3645j10170
12942D70189k7454L8595K6123p3136Q728J10885J2654m4149l5434k0494K1613
12931D88120K1793k3375j2552Q5727J49522j5795r1259L3236J85869J71949O9815
12920A063050P6426N8513J72216P2068o4597q7090j08337j72318j51252r5505
12910G63174n5696j57068q3657J4542M6948k4684q0274n6441j9367l6243n4805
12899B56429M660m0211m5662l9033m2313j6792Q044k1354p5828j6983O999L3334
12887A1290J4245p7595j7148N4635R1743J579J1471K2534m7881k9803O8431M4144
12875A47645o6138m4809k3073q3591k1277L8839K7008Q809O276L6944J16691K2862
$$ y = [1384423, 1254107, 1180286, 1119241, 1044661, 1001948, 848668, 694394, 674004, 580359, 470189, 442735, 481330, 507453, 434317, 443045, 553930, 566584, 522435, 487001, 466507, 488120, 509913, 486538, 473986, 559713, 709235, 693440, 602181, 635417, 821286, 993235, 1063050, 1139476, 1197989, 1370205, 1442273, 1377676, 1290586, 1182249, 1009931, 858679, 763174, 707478, 550410, 466753, 481295, 528243, 503559, 423285, 366844, 347477, 311234, 256429, 261089, 220878, 175216, 136183, 93870, 77078, 85122, 63768, -12060, -29043, -22044, 11290, 25535, -52060, -69208, -14573, 77170, 78749, 90220, 112754, 64873, 35070, 103501, 147645, 81507, 36698, 13625, -69966, -91243, -52404, -25396, -16587, -10311, 26633, 143324, 166186]
12863A66186j4194n8013m326m5789k1522M0148K9288k8180L1488M9099O5561L5914
12851B45660q8479j18348q0805L3645K4214L7233n8551j3101P1880k0353k6338
12840F657j0724Q087j1919n0852J3386j1818J1364N1182j3845k7803P3138R8765
12828A35618O1577m8924k2256k7358l5257l797P671l7630k0132L3184j2671J4443
12816D4468M5356L4871m9879N0800l8478O04N4312o2820l0163O927N8378K5423
12804A39799j5130P7230M3235l1186K6378L3279L562L4367N5176R4471L3136J13779
12792F08096L2724J8934J28952J04400J5142L8209k0164p716r5573j46043j60855
12781E16106j22423J1118M155n4283l6422N6720J7102n5988l2373n5749p30R6580
$$ y = [166186, 151992, 93979, 89653, 43864, 22342, 62490, 91778, 63598, 95086, 144185, 209746, 245660, 157181, 38833, -41972, -8327, 15887, 53120, -5431, -18532, 53348, 32995, 6657, -4067, 4020, -7899, -58751, -45365, -57183, -45819, 5363, -8482, -36285, 36853, 135618, 197195, 148271, 126015, 98657, 63400, 59603, 67274, 29644, 9512, 42696, 30025, 44468, 89824, 124695, 74816, 125616, 87138, 87742, 142054, 79234, 49071, 55998, 114376, 139799, 124669, 201899, 245134, 213948, 240326, 273605, 277167, 311534, 366710, 461181, 494317, 608096, 640820, 659754, 788706, 893106, 908248, 946457, 926293, 918577, 823004, 676961, 516106, 393683, 404801, 408956, 354673, 318251, 374971, 392073, 336085, 303712, 247963, 247233, 343813]
12769C43813K7640n7749n5026K8053L3430K0988k2307R860J8073n5692K7019M7876
12757C65978M8593K0936Q7536J18236P7219R4794O6086J54534K52385L18552K75744
12746A880593K14106J45635l94j08512k36956k48070l14242k31098j35572j73030
12736G92460q6430q6699j26508r9548q4442L183J8343l9475k8883j9443p7370
12725A65188K2830N4801K9357m4784N3354L2014n7989l7337q1862k794M9104m665
12713A77217K5477M4467Q9290J63380J39355M5447l4763J4790J36307J31070O9466
12702A001503N965m5365J005n1936j04870r2384r1904o5354r9603o9137J168m4806
12690C44282q9939j8569M381j1539M0894k8244j00148j16817o2138P9960J34116
$$ y = [343813, 371453, 313704, 258678, 286731, 320161, 341149, 318842, 328702, 346775, 291083, 318102, 365978, 414571, 435507, 523043, 641279, 718498, 813292, 879378, 1033912, 1286297, 1604849, 1880593, 2094699, 2240334, 2239940, 2131428, 1894472, 1646402, 1332160, 1101062, 965490, 792460, 706030, 619331, 492823, 393275, 308833, 312016, 330359, 290884, 262001, 242558, 165188, 188018, 242819, 272176, 227392, 280746, 312760, 254771, 217434, 135572, 132778, 181882, 177217, 202694, 247161, 336451, 499831, 639186, 684633, 649870, 664660, 800967, 932037, 1001503, 1007468, 962103, 963108, 911172, 806302, 713918, 622014, 556660, 457057, 387920, 389088, 344282, 254343, 235774, 240155, 228616, 269510, 241266, 141118, 24301, -37837, 42123, 176239]
12679A76239m3017l2909k0030K3303o043J0346n8769m7378l4862o8536l6473k4308
12667a62437K1541R3671M3528L2879j293L2884N7725l0693j4771k8537l5252K7866
12655C7111L2708J1449q8620o6980Q8021m123j23080L7853P1902M7146K7107l7962
12643C2532m5679n1744r570K8153N1349l7410l5473n513j2369M6480J15734r85
12631G5505k9298p5449k1668L5311N5216m627m1854j6941R000K4361m9319L7124
12619b639L5659J6301k7106k1179N7329j2884p4607m8445M1314J8740R6037J2801
12607I1321p3604k205Q5096L5726R5981j7070N0902q7428l4535j792R0218r629
12595B22981l5004p4913p5155j4104n5832J9892O2344k9921p143K7143l3499N5770
$$ y = [176239, 133222, 100313, 80283, 103586, 97543, 107889, 49120, 1742, -33120, -101656, -138129, -162437, -140896, -47225, -3697, 29182, 27889, 60773, 118498, 87805, 73034, 44497, 9245, 37111, 69819, 81268, -7352, -74332, 13689, 9566, -113514, -75661, -3759, 43387, 70494, 32532, -13147, -64891, -74461, -46308, 5041, -32369, -67842, -73355, -85724, -39244, 76490, 75505, 46207, -29242, -50910, -15599, 39617, 34990, -6864, -23805, -14805, 9556, -39763, -2639, 33020, 49321, 22215, 1036, 58365, 45481, -29126, -77571, -36257, -17517, 78520, 91321, 17717, 15512, 100608, 136334, 232315, 215245, 266147, 178719, 144184, 142392, 232610, 222981, 187977, 113064, 37909, 23805, -32027, -12135, 50209, 20288, 13145, 40288, 6789, 62559]
12583F2559k0812l1260M485P796k3250N042J8179j3229k896k0967o3785K9116
12571d9022J3136j6684K3730L7554K0799m7390J4292J2003k1323J8960k3032k6534
12559d3511k823k8350P01m0003J3172K691p3853j3170J01130J08703l6332l3024
12547d4669J9179L8756J1335j7526J1185Q865p4703l5241N892O9674k3606o798
12535c7657O2158P3029m9279q5947l0553P1994N319m4177k004K5270O2219J3937
12523F4309k9929m8501l425L8933k0403l2773k783k7713J1172L4956J8197K2259
12511B4299j3273m7359l6430N1129O465n6530L9791J1054l9335K0267M8854K8924
12499C7856n659o5756j4688L0594M9735l690m1395l9762K0301Q1415j0393k3081
$$ y = [62559, 41747, 10487, 14972, 22768, -482, 4560, 22739, 9510, 6614, -14353, -78138, -49022, -35886, -52570, -28840, 8714, 29513, -17877, -3585, 8418, -12905, 6055, -16977, -43511, -46334, -74684, -73983, -113986, -100814, -98123, -171976, -185146, -84016, 24687, -11645, -44669, -25490, 13266, 24601, 7075, 18260, 27125, -47578, -82819, -76927, -7253, -30859, -37657, 24501, 97530, 48251, -37696, -68249, 3745, 9064, -35113, -37117, -11847, 50372, 64309, 34380, -14121, -17546, 21387, 984, -31789, -34572, -62285, -51113, -16157, 2040, 24299, 11026, -36333, -72763, -21634, -15169, -71699, -31908, -20854, -60189, -39922, 8932, 37856, 32197, -33559, -48247, -17653, 32082, 28392, -13003, -52765, -32464, 48951, 38558, 15477]
12487A5477N383K7509M4687j1148j11618r6288k7324k4329O0092P7785N1203M5109
12475E6538N315j1443k4628p917J5636p2838J3018J0304n1695p573R3553L7147
12463E5417M509l0647M3210M6197J0850L971l1518r4459q640L6114P5765n4458
12451E6311q2595l3827m2972k1331N0108P3721k9736k9430L8916l6898r993k0267
12439h7993n543M3666J7777o9814M6346J61636o8633m2185j1966L287Q7957L0819
12427A05354k9795m9895j2013J5154L7322J278J6754q433l8997m1156Q1678k6223
12415E1028m0497M7642q4072j3176M6349p8497J3847n2118j8342k5190P2963K3720
12403e6343K1518p5406j5383j3620R9423J33311Q6500P8594K6814m5008o2875
$$ y = [15477, 20860, 48369, 93056, 81908, -29710, -125998, -153322, -177651, -117559, -39774, 11429, 56538, 61853, 50410, 25782, 17865, 33501, -39337, -26319, -16015, -67710, -75283, 18270, 55417, 59926, 29279, 72489, 118686, 129536, 133507, 101989, 7530, -1110, 35004, 110769, 56311, -26284, -60111, -103083, -124414, -74306, -585, -30321, -59751, -20835, -57733, -67726, -87993, -93536, -49870, -32093, -101907, -55561, 106075, 37442, -4743, -16709, -13422, 74535, 105354, 75559, 25664, 13651, 28805, 66127, 67405, 84159, 75726, 36729, -4427, 77251, 51028, 10531, 58173, -25899, -39075, 7274, -71223, -57376, -109494, -127836, -153026, -80063, -56343, -34825, -110231, -125614, -139234, -39811, 93500, 180000, 258594, 285408, 240400, 177525]
12392A77525k4447j9842m4123L8629J5170o5071m6952L7562L7429L8783N3019
12381A97682p1380j5166K1466K6800K6481n2j9892j0421j890o0756n7750m3112
12369g990l4095O2033k0900r655L5751K8395O981j9238m643L5902L9931k3453
12357H9019m9331R292m6787N8167M8931q1941N0586O5774n1483j3868p3571M2979
12345D7767M6942q556m412K3839Q8985R698M1372J12485R3366Q1507n3264n0743
12333D28986n3132j14784m4849j2409O2045L607r2063j09688j17218P3006n385
12322A8116J4548P6266J5097p4370k9362K8727L8563j8993O877L1000J7917o0470
12310F3916l6634N4525j9552n5419K810M009l505m5333P94J6134N7048O3386Q3238
$$ y = [177525, 153078, 133236, 89113, 127742, 142912, 77841, 30889, 68451, 105880, 144663, 197682, 126302, 111136, 132602, 159402, 185883, 185831, 165939, 155518, 153628, 92872, 35122, -7990, -42085, 19948, -952, -10607, 25144, 53539, 60520, 41282, 36639, 72541, 112472, 89019, 39688, 48980, 2193, 60360, 109291, 27350, 77936, 143710, 92227, 78359, 4788, 47767, 94709, 86153, 81741, 105580, 194565, 204263, 245635, 358120, 451486, 532993, 479729, 428986, 375854, 261070, 216221, 203812, 265857, 269464, 177401, 67713, -49505, 23501, 18116, 32664, 108930, 124027, 49657, 20295, 49022, 87585, 68592, 75469, 106469, 124386, 63916, 27282, 81807, 62255, 6836, 9646, 13655, 10150, -35183, -34389, -18255, 38793, 102179, 185417]
12297A85417M6530P9340N7423K2711M2495m5530j04794r8553k1433o2861k7819
12286G2926N005j7456J9980k8380O630J891n3075K6770Q647m1656j1819k5848
12274c6385O8967O4694J4953j46828P1454K9688K1712o1942l1450J448j9851J4410
12262i130k151M422K513K792N120k2690P4705k7848o8672L9663L5282j6255M4733
12249F2484R9683R6492j4514q7001j8483m3220o2758m895K1409j5135O311k4046
12237A6327p0938M4100J8930k0417J8171P303K896L6502M3231q360n7209m4843
12225a4307j3870K7071P2577P5988j3660j01124j9141N6815j0861l5907M935k8405
12213A11J3628M0086R0944p042k4792L9495m8768m2795J2244k2212o6267l8927
$$ y = [185417, 231947, 311287, 368710, 391421, 433916, 388386, 283592, 185039, 163606, 100745, 72926, 77931, 60475, 80455, 52075, 58705, 60596, 7521, 34291, 42938, 1282, -10537, -36385, 32582, 97276, 112229, -34599, 36855, 66543, 88255, 26313, -5137, -3689, -23540, -9130, -11281, -6859, -4346, -1554, 3566, -19124, 55581, 27733, -40939, -1276, 34006, 17751, 62484, 162167, 258659, 244145, 157144, 138661, 95441, 32683, 27788, 49197, 34062, 40373, 16327, -54611, -10511, 8419, -11998, 6173, 13476, 16372, 52874, 96105, 87745, 30536, -14307, -28177, -1106, 71471, 147459, 133799, 32675, 13534, 70349, 59488, 23581, 28516, 111, 13739, 53825, 144769, 137727, 112935, 152430, 103662, 60867, 73111, 50899, -15368, -54295]
12201e4295O6779J21444L1163q8342k0090K3202J05513P5402n9863l9718J6031
12190A77226n3730J4900k2757l5384l2922o6405N382o385j6820L7872L8567K3643
12178F3187k8383j2311M4964l105p111K5009Q643j524k4074J4218Q9150n0162
12166A18501o9537p5371L5600J1728j09O4004J4298M4292O8438K7121Q865k8654
12154B19176J2924Q348J3922Q3087R4326L1933J09840K06206O0939k01639k40720
12143C98342r6621m9998p7789M2557K5823k1367m3892m3625m8517l2185P5496
12132A28224L2090n018n9252l1350J7907K229P2463J0750l4733R321L9390l7081
12120A44940Q451p9399l857K4103L0934L5596O6872k1851K0208r3429k0806K361
$$ y = [-54295, 12484, 133928, 165091, 76749, 56659, 79861, 185374, 260776, 200913, 161195, 177226, 123496, 138396, 115639, 80255, 47333, -19072, -13690, -20075, -36895, 977, 39544, 63187, 34804, 22493, 67457, 64352, 57241, 82250, 90893, 89369, 65295, 79513, 168663, 118501, 48964, -26407, 9193, 20921, 20812, 84816, 99114, 143406, 211844, 238965, 247830, 219176, 232100, 240448, 254370, 337457, 431783, 463716, 573556, 779762, 840701, 639062, 398342, 301721, 251723, 173934, 216491, 242314, 220947, 177055, 133430, 84913, 52728, 128224, 160314, 155296, 96044, 64694, 82601, 84830, 157293, 168043, 133310, 142631, 182021, 144940, 153391, 73992, 70135, 94238, 125172, 160768, 227640, 205789, 225997, 132568, 111762, 114123]
12108A14123N1189R2545J45832L23351N10765O26539M84077k92984q57277n44115
12098F54045k20757n2557q3696l1170k2852j9369N827q4211r4216M5934M8798
12087A45776n4664l5721L1121J9343O3916J6788P305L442o8269Q460M5573K2248
12075B05318l0920L247K482L8572n0271l9522P2171M4816N4193R004r1634R5767
12063C13223J06609J26542J99368L90550O66557N87327J0169q99511o74943k09544
12053F16347j38884j06567M5688j38182o5688m6802L6535Q253L413l0770n3574
12042A29769n699m9940p0836P3283J27603R877q003K7690P9849L1200p613l6525
12030C00655m5770k7477L8563j6537n1118Q619M1878q19Q4660O648p5125k1139
$$ y = [114123, 165312, 257857, 403689, 727040, 1237805, 1864344, 2348421, 2055437, 1198160, 654045, 433288, 380731, 297035, 265865, 243013, 223644, 229471, 145260, 51044, 96978, 145776, 91112, 55391, 86512, 105855, 169771, 186559, 193864, 197306, 129037, 137497, 183070, 205318, 174398, 177645, 180127, 218699, 168428, 128906, 201077, 245893, 300086, 309090, 217456, 313223, 419832, 546374, 745742, 1136292, 1802849, 2390176, 2400345, 1500834, 825891, 616347, 477463, 370896, 416584, 278402, 212714, 165912, 202447, 210700, 214113, 183343, 129769, 124070, 74130, 3294, 76577, 204180, 214057, 206054, 233744, 313593, 344793, 337180, 300655, 254885, 227408, 265971, 249434, 198316, 206935, 248813, 247994, 332654, 339302, 264177, 243038]
12018B43038K9170Q8075J13631K08252K73892K2493l04236k03507o0869j1166
12008C98773j0750N0662J21226J98015L51440M18235N32899J9594o87246n20927
11998H71921k90882j88348k1239m5078r055k9215l5769j8602K7014J20364K9403
11987D10514p2293m8813K168L4309k9492J1665k4708q9574o028L5820o0666k4114
11975A38788K5796q104O96l2755R025N7571m1831q799o372R4806K7362n8382m1969
11962A55832K6997m2092m8216N241M6854M5836Q5114m3764n6373k7931l6506K5570
11950A36562J4669M0166j4141l8306L1701J2178m0475M0492Q006o0180n8507m9541
11938B2624n3699j4709K2274R5409O5058K8443K6766l3968k0591k2150k6906j0448
$$ y = [243038, 272208, 360283, 473914, 682166, 956058, 978551, 674315, 470808, 409939, 398773, 388023, 438685, 559911, 757926, 1109366, 1527601, 2060500, 2080094, 1392848, 871921, 581039, 392691, 371452, 326374, 317319, 288104, 252335, 233733, 260747, 381111, 410514, 338221, 289408, 291576, 325885, 296393, 308058, 283350, 193776, 187748, 223568, 162902, 138788, 164584, 156480, 157176, 124421, 133446, 191017, 149186, 140387, 134015, 228821, 256183, 197801, 155832, 182829, 140737, 92521, 97762, 144616, 190452, 275566, 231802, 175429, 147498, 110992, 136562, 151231, 191397, 177256, 138950, 170651, 182829, 142354, 182846, 190852, 130672, 72165, 22624, -31075, -45784, -23510, 71899, 136957, 165400, 192166, 158198, 137607, 115457, 88551, 78103]
11926G8103O6299j4710q6031M0553N4012K4182L3282p0381n5513M8948K266k1
11914A20989L8794J7242J5156q004o677m4416l9732M0587o1583j19759O0075K6041
11902C8713Q2947J3930J5829m7402q4787j0683Q1839M3011m6876K8876M5118L9528
11890B00043K6282K8896n0699l7242o4O0703p9149m7626Q799k3362K5412j9637
11878I2356L149J02779M4068j3084m3175n7645l3661L6176l3509R873J8058l514
11866A21871M8620N121j4504M4716n860l9598j9256L9201J4454m3355N2154M986
11854B08550j9725J026q605j980P2341J2860q445K1089J2841n5834K4731p027
11842B51822o372l4867j01073l6111l7543j1269R9228J5266r1023J554P3925K6970
$$ y = [78103, 144402, 129692, 43661, 84214, 138226, 162408, 195690, 125309, 69796, 118744, 121010, 120989, 159783, 177025, 192181, 184177, 177500, 133084, 93352, 133939, 72356, -47403, 12672, 38713, 121660, 135590, 151419, 104017, 19230, 8547, 90386, 133397, 86521, 115397, 160515, 200043, 226325, 255221, 204522, 167280, 167216, 227919, 148770, 101144, 109943, 86581, 111993, 92356, 95505, 198284, 242352, 229268, 186093, 128448, 94787, 130963, 97454, 107327, 125385, 121871, 170491, 175612, 161108, 205824, 199964, 160366, 141110, 180311, 194765, 151410, 203564, 208550, 188825, 189851, 181246, 179266, 251607, 264467, 256022, 277111, 289952, 234118, 258849, 251822, 245450, 210583, 109510, 73399, 35856, 24587, 123815, 139081, 48058, 49612, 123537, 150507]
11830A50507q633k1106L8919K2194J4506n337j4248j04735l8640L8379M7032p1057
11818D7781m9118K6330O9912Q2340J4442n9985q2481N2622N9922l757k383n30
11806A55095o4989J4711K0969k4367l9353L7260M3943J7261J1150o52J29053O187
11794C06268j760l1059n9371q519n081l3140M5733J3887n2010j07277J1633K4070
11782A03374l175M8904L6137J9998R398o4478J0542Q3440m795m4022K4769J1279
11770B31371J6437j9313R98M1700L8840o164l0740R707o9171p2255J2390l4212
11758A19588J8722M2176K9732k6638m8369p5354l397l4655j3849L1575L3246J8711
11746I1488R601L1156P5694L757l293m2733j6629l4445j8280M4728J247Q165n2432
$$ y = [150507, 141874, 120768, 159687, 181881, 196387, 191050, 176802, 72067, 33427, 71806, 118838, 47781, -1337, 24993, 94905, 177245, 191687, 131702, 49221, 101843, 161765, 158008, 155625, 155095, 90106, 104817, 125786, 101419, 62066, 99326, 143269, 160530, 171680, 171028, 300081, 306268, 304508, 273449, 214078, 205559, 200478, 167338, 213071, 226958, 174948, 67671, 79304, 103374, 100199, 149103, 185240, 205238, 214636, 150158, 160700, 244140, 239345, 195323, 220092, 231371, 247808, 228495, 229493, 271193, 310033, 303869, 273129, 282836, 213665, 141410, 153800, 119588, 138310, 180486, 210218, 183580, 135211, 59857, 56460, 21805, 7956, 39531, 72777, 91488, 101089, 132245, 207939, 211696, 208403, 165670, 149041, 114596, 96316, 141044, 142291, 150456, 98024]
11733I8024l139Q4015K0456M3497R068n541r4839q971k4134q7109O1299M9964
11721A42590k7576K7527L7866Q8290L1794m4369k2385k6901M0042K6108j4745
11710B58241k7091o7387n8005M3081J12980n3358r0864R226l7141P6134k6147
11699A39669j5630L2483K305q487K1229p6228Q132L5925N7943q589o0435M2765
11687A71082M5397l121j7224q2714k2647k7565P40L7974M8569J7714N4116r658
11675B12663r0913O815P144M5591m320l1638m2255J9046M0646M3615k772j1450
11663A92172p498M110K7128R6368l0606m5789n7635P061k1456O7597o0015n1859
11651A19578N8153J0304r340Q0482L1406m5911r0159l0886R9483j3561l0580Q6279
$$ y = [98024, 94885, 178900, 199356, 242853, 251921, 246380, 151541, 142570, 118436, 31327, 92626, 142590, 115014, 142541, 180407, 268697, 300491, 256122, 233737, 206836, 246878, 272986, 258241, 231150, 163763, 105758, 148839, 261819, 208461, 117597, 126823, 89682, 165816, 139669, 124039, 156522, 158827, 150340, 171569, 95341, 103473, 139398, 197341, 188752, 128317, 171082, 216479, 213358, 196134, 113420, 90773, 63208, 63948, 101922, 150491, 168205, 222321, 212663, 121750, 128565, 135709, 181300, 176980, 145342, 103087, 122133, 162779, 206394, 203622, 192172, 184674, 188784, 215912, 312280, 281674, 235885, 178250, 185311, 163855, 231452, 171437, 119578, 177731, 188035, 178695, 259177, 290583, 244672, 154513, 123627, 223110, 209549, 178969, 265248]
11639B65248M0158O8808O8973l8463o0659m3078o8961l5054o6499k9516M1333
11628A42290R3666K6140m6514L2706j1169N9379J0959j09818r1330K7546J5197
11617A49052J2110O9402m0517n9357L4806M9271l2249o4100M5957R4870J7603
11606B76848p4689J6167L8311o2379L3041k7301J5699O1046K9933r8067r4433
11595A14176O298Q0812n8159p6L1913K4672l6326J8480k9137o829m5388N2526
11583A52962O3857M1719M1761J1123m858q946k6654J7745L6785m6676k1103l998
11571B53717l8627J0467l390j0260J9703K2612M4095L5621k0842k2688J2926j6137
11559B87197j3484O9633k0817K4935n2987J080n413o4629k3347p6381p3129j1813
$$ y = [265248, 305406, 374214, 443187, 404724, 344065, 300987, 232026, 196972, 130473, 100957, 142290, 235956, 262096, 215582, 248288, 237119, 296498, 307457, 197639, 106309, 133855, 149052, 161162, 230564, 190047, 130690, 165496, 214767, 182518, 118418, 164375, 259245, 276848, 202159, 218326, 256637, 194258, 227299, 199998, 215697, 276743, 306676, 208609, 114176, 120474, 201286, 143127, 143051, 174964, 199636, 163310, 181790, 152653, 145824, 100436, 152962, 216819, 258538, 300299, 311422, 306564, 297618, 270964, 288709, 325494, 278818, 257715, 253717, 215090, 225557, 222167, 211907, 231610, 254222, 298317, 333938, 313096, 290408, 303334, 287197, 273713, 343346, 322529, 347464, 294477, 295557, 290144, 225515, 202168, 125787, 52658, 40845]
11547D0845R0828J0298j0033j0823K1596P0067O2882K4782J4850m7043m1798n0252
11535A76199L1922L4242l3221K3871n997K0201J7072j9125n2225J5275J4822K355
11523B25391j7237j2751N2178O6579Q0252M9056q262J537m6610N339l180k7471
11511C64821k8280o1567L0214O679l9650o6582P3330O0884j6873j39400N4139
11500B37715P6748M2913j6918j24235L828O6364J6660M6184K1823J2011j02356
11489B80737r606k1604J8158k3720L9562K5096m1851l4842J0977R2543j231J6523
11477C50742k7540l1037K8006L3252L7244J03811m6940n1237m1975J7115J4964
11466C86405k9292n8434L5400l6427l7752J2338K2978P9030M5680L4678p3788
$$ y = [40845, 131673, 141971, 131938, 121115, 142711, 212778, 275660, 300442, 315292, 268249, 226451, 176199, 208121, 242363, 209142, 233013, 227016, 247217, 264289, 245164, 192939, 208214, 223036, 225391, 208154, 195403, 247581, 314160, 394412, 443468, 435206, 436743, 390133, 395472, 392292, 364821, 336541, 274974, 305188, 311867, 272217, 205635, 278965, 339849, 322976, 183576, 237715, 314463, 357376, 340458, 216223, 220051, 286415, 303075, 349259, 371082, 383093, 280737, 271131, 249527, 267685, 243965, 283527, 308623, 266772, 231930, 242907, 335450, 334219, 350742, 323202, 292165, 320171, 353423, 390667, 494478, 447538, 396301, 354326, 371441, 386405, 357113, 298679, 334079, 297652, 259900, 272238, 295216, 374246, 419926, 454604, 380816]
11455C80816o2909K892L4795k3299N67J5141k9251J9158P4650J3597n4539m587
11443C67031J6713K1227M1100L6465n504M4353J6017k1154o2492l015k973l2881
11431D14887r4454K4414l3096k1734j7420m1580m2245P6031M2969L808K9302N9852
11419D00734O4961o4616k8834J3316J9527M3368J3335o6670J3950r031j2510k1110
11407C66420n4451q99L8601j159N6650N2756n2247n5552J3592Q2106j10J1421
11395D57128K760J8266L0391L7671j1323o3560J0506L8017j9778l4792L3831K3425
11383E22542J1990K2705K66j27421q7117p151Q5343K2912l3586M3820j5810j5068
11371D23425m5382m0450P6673J02979j8620n911N746l155K1599l4548n3872n746
$$ y = [380816, 317907, 320799, 355594, 332295, 332862, 348003, 318752, 337910, 412560, 426157, 371618, 367031, 383744, 404971, 446071, 482536, 477032, 521385, 537402, 516248, 453756, 450741, 447768, 414887, 320433, 344847, 311751, 290017, 272597, 231017, 188772, 264803, 307772, 311580, 340882, 400734, 465695, 401079, 372245, 385561, 405088, 448456, 461791, 395121, 409071, 400040, 387530, 366420, 311969, 311070, 349671, 348512, 405162, 457918, 405671, 350119, 363711, 445817, 445707, 457128, 459888, 478154, 508545, 546216, 534893, 471333, 481839, 519856, 500078, 465286, 499117, 522542, 534532, 557237, 557503, 430082, 342965, 335814, 421157, 444069, 410483, 454303, 438493, 423425, 378043, 337593, 414266, 517245, 498625, 492714, 498460, 495305, 516904, 482356, 428484, 422738]
11359D22738K4875J1021R011k2380N3014J7775r448m776o8224n0008M5031Q7887
11347E16516R0995L1420l7379r887k514O2273M3007l106l1391k7996J0927M6421
11335F89286J21458K1353J2154N0272O4092M0256R2331K0427l8504j4561M8872
11324A107436J9204M0825J08527J19822Q5284P0859O8181o0476k8800p5097r8026
11313A357739j15262r4713r6925m7984J3716J055q5729j8130N171n9712m5056
11302H14170j1986L8210K7506m7561j8548k5115K1374J867J1915K6572M317l995
11290H38726L0255L3718O9393J01907N4057J17123J25678N9611N0597L0413K02306
11279A713784K50946K66025J76371P5527j9352M055q7026j58199j59489k27156
$$ y = [422738, 447613, 458634, 467645, 445265, 498279, 516054, 506606, 501830, 433606, 383598, 428629, 516516, 607511, 638931, 601552, 591665, 589151, 651424, 694431, 691325, 659934, 631938, 642865, 689286, 810744, 832097, 844251, 894523, 958615, 998871, 1091202, 1111629, 1073125, 1058564, 1107436, 1126640, 1167465, 1275992, 1395814, 1481098, 1551957, 1620138, 1559662, 1530862, 1455765, 1357739, 1242477, 1147764, 1050839, 1002855, 1016571, 1017626, 931897, 913767, 918938, 859226, 814170, 802184, 840394, 867900, 820339, 801791, 776676, 798050, 799917, 811832, 838404, 842721, 838726, 868981, 902699, 972092, 1073999, 1128056, 1245179, 1370857, 1430468, 1481065, 1511478, 1713784, 1964730, 2230755, 2407126, 2482653, 2463301, 2467356, 2380330, 2222131, 2062642, 1835486]
11269A835486j82549j09732j20981j11101j12554J2707K4778j27839p3168m2371
11259I92676j8905N637q303k9612n8261p2410J6150M0264P5743K0788j7447L7998
11247I84318K209K4938J5320n244l155L4745P3739M5834O4705R1230L7591Q8405
11235A454635K5270j122M77P0253J9933l3120r2228r0970l4911o4746q5839q4456
11223A083176j9006j7377l7191o3739j6044K9138o303j9523J0976j6434K1174
11212I48847l9859k794q2411r2534k8633M289J7334L00M2975J10792J0571p6260
11200H12617Q443o510J5383k2999R937j426j5396N21P2646j9632j15331j05594
11188F32659O497P4125J00363Q5374M3379j8703o5254O7066l399k6859o3000N7001
$$ y = [1835486, 1652937, 1543205, 1422224, 1311123, 1198569, 1211276, 1236054, 1108215, 1035047, 992676, 973771, 979408, 971105, 941493, 883232, 810822, 826972, 867236, 942979, 963767, 946320, 984318, 986527, 1011465, 1026785, 1021541, 1018386, 1053131, 1126870, 1172704, 1237409, 1328639, 1366230, 1454635, 1479905, 1478783, 1479260, 1549513, 1569446, 1536326, 1444098, 1353128, 1318217, 1253471, 1167632, 1083176, 1064170, 1046793, 1009602, 945863, 929819, 958957, 952654, 933131, 944107, 927673, 948847, 908988, 906194, 823783, 731249, 702616, 706905, 724239, 724539, 767514, 878306, 888877, 812617, 821060, 814550, 829933, 806934, 816871, 815445, 800049, 800570, 873216, 853584, 738253, 632659, 639156, 713281, 813644, 899018, 942397, 923694, 858440, 925506, 922107, 895248, 832248, 889249]
11176H89249K3306l4997J6767J2782j3634p205N2496p9237K6090J0355N1199k0945
11164I26226K7169j3667j0024M6886p607L1629K0241P3401j1826j02339j0876
11153I69213M3789J2015Q238R3278j4289j10461q6536K7158N6531K7326J8783
11142A045045L4943Q5905P7691M6600J1249O6377M7571J29954R0754p1892j07651
11131A456546n4861K0385K5037o5564q0869n6511j2272R9723j2167n7765j5643
11120A246039M5197O3596M3001l6024j4518o3831k3340m9511k0262N9221N2959
11109A302527k4909P0201l2615j0027L4603L2474m0083m5510L9136R6672M1948
11098A464417L996M9956M8662O6242O1822K33999J80941l0073k4532p8904j47476
$$ y = [889249, 912555, 877558, 894325, 907107, 893473, 886268, 938764, 859527, 885617, 895972, 947171, 926226, 953395, 939728, 929704, 976590, 968983, 1000612, 1020853, 1094254, 1082428, 980089, 969213, 1013002, 1025017, 1033255, 1126533, 1112244, 1001783, 915247, 942405, 998936, 1026262, 1045045, 1079988, 1165893, 1243584, 1290184, 1301433, 1367810, 1415381, 1545335, 1636089, 1564197, 1456546, 1401685, 1422070, 1447107, 1381543, 1300674, 1244163, 1231891, 1331614, 1319447, 1261682, 1246039, 1291236, 1354832, 1397833, 1361809, 1347291, 1283460, 1260120, 1210609, 1190347, 1249568, 1302527, 1277618, 1347819, 1315204, 1305177, 1339780, 1372254, 1332171, 1286661, 1325797, 1422469, 1464417, 1468413, 1518369, 1567031, 1633273, 1695095, 1929094, 2110035, 2079962, 2055430, 1976526, 1829050]
11087A829050j52266m5455K2595J9842m2961o5230O2794m7807k0294K8094m9641
11076A538721m6302p3947J4997J41682Q1713l1850K9834R5081P1545k6976j31009
11065A663489M396N9768k3755k6170o168J6697O2975Q3424K1639R4134l0902l0727
11053A888800j262J06437K09135J24915R774O219K6084l5656l5804Q210J1923
11042B318775n7081p892M5221J13641J13093J38922Q9290J10669L2606r3740p4739
11031B728765J3421l5784l1441P2854K1657M2145M5145P0101J17941Q5539n8586
11020C071757p5925K0757O0391N2978J120J0866J28257M9202N9890P3412j6767
11009C435938l1746j3698J14402J1711o094P8219Q2767J51528J39712J15937P2350
$$ y = [1829050, 1676784, 1631329, 1653924, 1673766, 1630805, 1565575, 1628369, 1580562, 1560268, 1588362, 1538721, 1492419, 1418472, 1433469, 1575151, 1656864, 1625014, 1654848, 1749929, 1821474, 1794498, 1663489, 1667885, 1727653, 1703898, 1677728, 1671560, 1688257, 1751232, 1834656, 1856295, 1950429, 1919527, 1888800, 1887538, 1993975, 2203110, 2328025, 2337799, 2344018, 2370102, 2334446, 2298642, 2306852, 2318775, 2261694, 2253802, 2299023, 2412664, 2525757, 2664679, 2753969, 2864638, 2897244, 2803504, 2728765, 2742186, 2706402, 2674961, 2747815, 2769472, 2811617, 2856762, 2926863, 3044804, 3130343, 3071757, 2995832, 3016589, 3076980, 3129958, 3131078, 3141944, 3270201, 3319403, 3379293, 3452705, 3435938, 3404192, 3390494, 3504896, 3516607, 3510513, 3588732, 3671499, 3823027, 3962739, 4078676, 4151026]
10998D151026R6511O2731J42302M3886R3313K0968M1568J6996l4752L4585N2499
10987D721633N2641J2926m6482O6241J05374P1473O4574k4684R7312Q3962K652
10976E207622N4587J50195J04109J17432R9556J40103Q5262J12025J64618J54933
10966F390442Q7986J92215K31735K59801K73688K47971K29429L37635K80691L18810
10956H850403K69259K08188K41992L04215L40152K97528L45981L11461L35326
10947A1504505M36787M29729L68856L22458M65860O23074O78541N97337P78326
10938A6205473Q53116R17516J065607J238354J290215J326544J581919J779632
10930B6258376J944999K238823K590894L039604L639191M490601N397703O498606
$$ y = [4151026, 4247537, 4310268, 4452570, 4496456, 4589769, 4610737, 4652305, 4669301, 4634549, 4669134, 4721633, 4774274, 4787200, 4740718, 4806959, 4912333, 4983806, 5048380, 5023696, 5121008, 5204970, 5207622, 5262209, 5412404, 5516513, 5633945, 5733501, 5873604, 5958866, 6070891, 6235509, 6390442, 6478428, 6670643, 6902378, 7162179, 7435867, 7683838, 7913267, 8250902, 8531593, 8850403, 9119662, 9327850, 9569842, 9874057, 10214209, 10511737, 10857718, 11169179, 11504505, 11941292, 12371021, 12739877, 13062335, 13528195, 14151269, 14829810, 15427147, 16205473, 17058589, 17976105, 19041712, 20280066, 21570281, 22896825, 24478744, 26258376, 28203375, 30442198, 33033092, 36072696, 39711887, 44202488, 49600191, 56098797]
10922E6098797Q079758J0062245J2299318J5112100J8131435K0872480K2605433
10915A63261566K2177943J7950360R529320j619907j2099845j9019996k1482100
10908A58697341k0754839j8335481j5447965j2738457j0317252q272458o688227
10901F6142662n406692m169418l245309k554526j845450j217542o93876j88357
10893D6821492K89338O34655R86973J251803J514769J900437K411648L079560
10885E8890675L771300M712343N941680P190057Q888225J1152563J4119200J7790184
10877A32456227K2441681K8193248L5180528M2555949M8598059N0270735M3096721
10870D02793148K4264763l050031k9071533m5129674m9845755m6811441m0358144
$$ y = [56098797, 64178555, 74240800, 86540118, 101652218, 119783653, 140656133, 163261566, 185439509, 203389869, 212919189, 211299282, 199199437, 180179441, 158697341, 137942502, 119607021, 104159056, 91420599, 81103347, 72830889, 66142662, 60735970, 56566552, 53321243, 50766717, 48921267, 47703725, 47009849, 46821492, 47110830, 47745485, 48732458, 49984261, 51499030, 53399467, 55811115, 58890675, 62661975, 67374318, 73315998, 80506055, 89394280, 100546843, 114666043, 132456227, 154897908, 183091156, 218271684, 260827633, 309425692, 359696427, 402793148, 427057911, 424007880, 394936347, 349806673, 299960918, 253149477, 212791333]
10863B12791333l3430545k7116699k1861452j7567946j4222448j1499413r331828
10856G7761002p493807o109180n118042m193026l351489k647593k113938j669671
10848D5064256j349208j044894o93411l28176o7377K83699P51376J331523J936631
10839D5884419K716294L566415M576096N865636P590506R571770J1702103J4274280
10831A05747519J6903212J8969843J9529075J7326236J1371107K150993q194424
10824A83803561j6611370k0930718k1401399j9584821j6761500j3923305j1417242
10817F3173206r243341p457093o125389n015844m133591l466486k974248k490225
10809B2266989k127445j908670j726798j425698j186297j087690j072379r97196
$$ y = [212791333, 179360788, 152244089, 130382637, 112814691, 98592243, 87092830, 77761002, 70267195, 64158015, 59039973, 54846947, 51495458, 48847865, 46733927, 45064256, 43715048, 42670154, 41976743, 41648567, 41581190, 41864889, 42616265, 43947788, 45884419, 48600713, 52167128, 56743224, 62608860, 70199366, 79771136, 91473239, 105747519, 122650731, 141620574, 161149649, 178475885, 189846992, 191997985, 183803561, 167192191, 146261473, 124860074, 105275253, 88513753, 74590448, 63173206, 53929865, 46472772, 40347383, 35331539, 31197948, 27731462, 24757214, 22266989, 20139544, 18230874, 16504076, 15078378, 13892081, 12804391, 11732012, 10734816]
10801A0734816r71091r14788p21610o49983o64959n83215m94599m28956m44750
10792D860865l29293k95012j98765j58882j36239j47133k39884k53282j93150
10783B909225k06994j32974n2591r7218j79901j00711m7830j33128j24959l7656
10773A795263k6716o4685q0043j15333m0314p7070r3486r1523m1170k3847o0092
10762A080984n2704n6546j2115k5525j19320M4286Q014j34703p8143q5007n9496
10751E09725p650P034l7020j2472j7058o9983m9227j7759O455Q1092K2021k6821
10739C88337J8739L4038R1313N5207o2417m2570q367O5175J8795M3260n8497k2523
10727E20490j6846j28259p4862m329q572J8694p8932k1623P4606M6997R546L4782
$$ y = [10734816, 9763725, 8848937, 8127327, 7477344, 6812385, 6229170, 5734571, 5305615, 4860865, 4531572, 4236560, 4037795, 3878913, 3742674, 3595541, 3355657, 3102375, 2909225, 2702231, 2569257, 2516666, 2419448, 2239547, 2138836, 2091006, 1957878, 1832919, 1795263, 1768547, 1703862, 1623819, 1508486, 1468172, 1391102, 1297616, 1206093, 1164923, 1141076, 1080984, 1028280, 971734, 959619, 934094, 814774, 859060, 867074, 732371, 654228, 569221, 509725, 502075, 509109, 472089, 459617, 442559, 372576, 323349, 305590, 312045, 393137, 415158, 388337, 407076, 441114, 532427, 587634, 525217, 482647, 474280, 539455, 558250, 601510, 543013, 520490, 503644, 375385, 300523, 296194, 287622, 306316, 227384, 205761, 280367, 327364, 336910, 371692]
10715C71692J0207m8741k2637K4492P0177j1016o9917Q818L2888l1837N5770J9237
10703D09133J8374j30644J5116M2607M0609j7617k3254N1605Q7392L7675l0277
10692E00719m9474P7304M2791n9861j03665k4487K0423j270k3938P0275l6598
10681D12219p844O9547N7819J8004n4206o3769j897Q6461J15707M4116o5886r638
10669F00633L9496J9286l365l3879N7616N6501k5362o7711j4301M0499J09769
10658G79182J49809K6039K9158Q1237J8554L7658Q337K8865M3542r744N2963P1340
10646A316940K472l1068m630L8623Q3942J51442J23601J07472J28059J56656K02175
10635B275684K89872K45887K23344K25481J96331J99575L66496M40751N05380
$$ y = [371692, 381899, 333158, 310521, 335013, 405190, 394174, 324257, 333075, 365963, 334126, 389896, 409133, 427507, 296863, 311979, 354586, 395195, 377578, 354324, 405929, 493321, 530996, 500719, 451245, 528549, 571340, 511479, 407814, 383327, 403750, 402480, 378542, 448817, 412219, 404375, 473922, 531741, 549745, 495539, 431770, 429873, 516334, 632041, 676157, 610271, 600633, 640129, 659415, 656050, 622171, 679787, 736288, 710926, 643215, 628914, 669413, 779182, 928991, 955030, 984188, 1065425, 1083979, 1121637, 1129974, 1158839, 1202381, 1192637, 1245600, 1316940, 1319412, 1288344, 1283714, 1322337, 1406279, 1557721, 1681322, 1788794, 1916853, 2073509, 2275684, 2565556, 2811443, 3034787, 3260268, 3456599, 3656174, 4022670, 4463421, 4968801]
10626D968801O52299R50060J189125J589252K284081L016772M050494N098116
10618B3799000N899312N775022L685995M09857j861396k364899j511337J24151
10610C3955705K098726M491939P356621J0143816J2105524J1145228N403102l032631
10602H3668030q497184q735267n865875k130231J625755N453619R502990J3339709
10594H8361546J5276163J2671934L196167r301602j6213793j5400335j1359097
10587F7230983o778708k633253J012355M439831P208889Q240526N614723j300619
10579H3034727r347268j3011643j1774902q581551n270599k694218p14465Q98874
10571C2538955J878530J998997N90861k186428n085815o210187n725318m622365
$$ y = [4968801, 5621100, 6571160, 7760285, 9349537, 11633618, 14650390, 18700884, 23799000, 29698312, 35473334, 39159329, 39569186, 37707790, 35342891, 33831554, 33955705, 36054431, 40546370, 47902991, 58046807, 70152331, 81297559, 86700661, 83668030, 75170846, 66435579, 60569704, 58439473, 60065228, 65518847, 75021837, 88361546, 103637709, 116309643, 119505810, 110204208, 93990415, 78590080, 67230983, 60452275, 57819022, 58831377, 63271208, 70480097, 78720623, 84335346, 83034727, 73687459, 60675816, 48900914, 40319363, 35048764, 32354546, 31640081, 32538955, 34417485, 36416482, 37007343, 34820915, 29735100, 23524913, 17799595, 13177230]
10563A3177230l287710k271600j713163j314939r59595p70161n72352l90781k84783
10554A612146k45042k87491k58045j61532p9620q5787j80128j28026j03359m5115
10544C8001j2891l5264j1110J6315k2084n7053j37442q0011k73O3539J3559o0129
10532b84843m2407j6662M8705K3348n6248q917P7614j7655l6924K6902O612K9669
10520b50806n425O1458K2778K871n796j7907O2872M6317Q605L1867O4071R8806
10508A19711Q6404M6178J06535J21251O3685l8682p854o6996m5672j21552L7192
10497C00200O848j12584n4970n736N331l549O126j3292k4562L616J6734N5969
10485A80131K916P6412K2032l0771p7567M9822M3184J3547J990O4004L6221N576
$$ y = [13177230, 9889520, 7617920, 5904757, 4589818, 3630223, 2860062, 2287710, 1896929, 1612146, 1367104, 1079613, 821568, 660036, 580416, 494629, 314501, 186475, 83116, 38001, 25110, -10154, -21264, -4949, -27033, -84086, -221528, -301539, -301812, -238273, -224714, -284843, -327250, -343912, -295207, -271859, -328107, -337024, -259410, -277065, -313989, -287087, -280475, -250806, -256231, -194773, -171995, -169124, -174920, -192827, -129955, -83638, -75033, -43166, 20905, 119711, 206115, 252293, 358828, 480079, 543764, 505082, 497228, 430232, 384560, 263008, 300200, 307048, 194464, 139494, 133758, 139089, 135540, 141666, 128374, 103812, 107428, 124162, 180131, 183047, 259459, 281491, 250720, 173153, 222975, 266159, 279706, 281696, 345700, 381921, 387497]
10473C87497n447P7919J0228M4337M9368n558J09486J85476J16358K71852L38865
10462A580381K77429J74778J01838q932o1363j04721k00207k23567j55445k32356
10452A147835j08065j14758l0749p7209l1243O4503k6821J0548l055q8395q2555
10441F60036p6243n3535q1764O211L4766l0458l4054L4819j5197J0073J4127l2796
10429D35985q2524n100Q4018K4360P2594J40227J50702O4785J28810J49384J61414
10418A324655J47592J18426q065o1613p6840j02680j27151j37462j54626k27838
10408F94398j80815j21686r4635k2107K4780j2364m3763q4632J3669j4106q0655
10397G8084j21229K3225P9138j1642Q909J6642Q0530P3563J2880N4607M3065r8672
$$ y = [387497, 382050, 459969, 470197, 514534, 563902, 558344, 667830, 853306, 969664, 1241516, 1580381, 1857810, 2032588, 2134426, 2125494, 2064131, 1959410, 1759203, 1535636, 1380191, 1147835, 1039770, 925012, 894263, 817054, 785811, 850314, 823493, 834041, 830986, 742591, 660036, 583793, 530258, 448494, 454705, 489471, 459013, 424959, 459778, 444581, 454654, 468781, 435985, 353461, 348361, 432379, 456739, 529333, 669560, 820262, 885047, 1013857, 1163241, 1324655, 1472247, 1590673, 1582608, 1520995, 1444155, 1341475, 1214324, 1076862, 922236, 694398, 513583, 391897, 297262, 275155, 299935, 287571, 243808, 159176, 172845, 158739, 78084, -43145, -19920, 59218, 47576, 56485, 73127, 153657, 227220, 240100, 294707, 337772, 239100]
10385B39100j9844N6020K652n0410J4131N9399M2663k6598m6929q7340l7985j1477
10373A33382j2200k2533J1987j7798j03624j76324r8790L0184O4781R7968j100
10362i4067p1094l0053k9499q890K1699J1805j4556J6765m5183k3561K9585L7906
10350a99143L2912P5606P078m64K9392k3301l6549k2925L2621L5692L0439l4778
10338g3420k565K6913M3357L4674J12736O4678R4808J01700m3884j43958m7317
10327A67722k827m0168j41143q0946k5585K5824l605J7264K4906k2232K3011P9
10315e7700O9607K5164m5677p0851l3733k5946l724l047M5030m5804J2634J2982
10303a21065m0811n972n4408j154l3109J9970J29899M9779l880l6652N3998J11292
$$ y = [239100, 219256, 275276, 277928, 227518, 241649, 301048, 343711, 317113, 270184, 182844, 144859, 133382, 121182, 98649, 110636, 92838, -10786, -187110, -285900, -255716, -190935, -92967, -94067, -165161, -195214, -224713, -233603, -211904, -200099, -214655, -197890, -243073, -266634, -237049, -199143, -166231, -90625, -83547, -84011, -54619, -77920, -114469, -137394, -104773, -69081, -38642, -73420, -75985, -49072, -5715, 28959, 141695, 206373, 301181, 402881, 358997, 215039, 167722, 164895, 124727, -16416, -97362, -122947, -97123, -100728, -83464, -58558, -80790, -57779, -57700, 11907, 37071, -8606, -79457, -113190, -139136, -142860, -145907, -100877, -146681, -134047, -121065, -161876, -167848, -222256, -223410, -256519, -236549, -106650, -56871, -60751, -97403, -43405, 67887]
10291F7887L7504o404O261m0166j9873k8357o7138L4391p9474o5161p2424P1044
10279a61910J24009L794N4067Q285M3680J6687L6976M9404R6120R2514O7408Q4122
10267E15156J34838K86694J97682N0304p3335j79047j47485k96213j27656r513
10257C51425m3939q8015O110m1762m8036k8316K4230j2308n012k033j9658L0325
10245A23011K5207K7200k9041P8015K587L9606J20625L2801o2138q6403l6051
10234B35419L9767O4613O4753J32506R9662M2815J52013J02756N8651O8208J06434
10223A167597J50458J63692J87103K57927K30410K26145K15556K16715J76143
10214B991746J4558j0966j4503k5098j28060j65029r7694j09374k07262j83510
$$ y = [67887, 105391, 98987, 105248, 65082, 45209, 16852, -50286, -15895, -95369, -160530, -232954, -161910, -37901, -34107, 19960, 28245, 71925, 88612, 125588, 174992, 271112, 363626, 431034, 515156, 649994, 936688, 1134370, 1184674, 1111339, 932292, 784807, 488594, 360938, 351425, 307486, 219471, 225581, 183819, 135783, 107467, 131697, 119389, 114377, 112344, 92686, 123011, 148218, 175418, 146377, 224392, 226979, 266585, 387210, 420011, 357873, 271470, 235419, 275186, 339799, 404552, 537058, 636720, 679535, 831548, 934304, 992955, 1061163, 1167597, 1318055, 1481747, 1668850, 1926777, 2157187, 2383332, 2598888, 2815603, 2991746, 3006304, 2995338, 2980835, 2955737, 2827677, 2662648, 2564954, 2455580, 2248318, 2064808]
10204B064808j13256n0650j04340r4775j73036j32901k3192o1271n3638k6396
10194A231353l0710M2298j5900N1340Q4546O2002J01408p917P6267R2405R4869
10183A781961J5343Q0884L06583K31521J82426J78119K51618L24282K21900K32014
10173C806651K98878L10905L63650M22425M38480L77123K70941L2345n3375j81643
10163F086380k34868o9360j55700k53200k18139k10837j79067k56421k90288k89149
10153C929351l05892l29465l55190k42238j62424l4261p4935p5847m0224j04322
10143B204553j66683j10575j32574j49211o1810l0384M8132o1113m4876J40607
10133A636066O6392N4873K5931M4509L3618M3117O6371J58178K47675K21817K07821
$$ y = [2064808, 1951552, 1900902, 1796562, 1701787, 1528751, 1395850, 1372658, 1311387, 1257749, 1231353, 1200643, 1242941, 1227041, 1278381, 1362927, 1424929, 1526337, 1518420, 1594687, 1687092, 1781961, 1797304, 1878188, 2184771, 2416292, 2598718, 2776837, 3028455, 3352737, 3574637, 3806651, 4105529, 4416434, 4780084, 5202509, 5640989, 6018112, 6289053, 6321398, 6268023, 6086380, 5851512, 5782152, 5626452, 5373252, 5155113, 4944276, 4765209, 4508788, 4218500, 3929351, 3623459, 3293994, 2938804, 2696566, 2534142, 2499881, 2424946, 2349099, 2308875, 2204553, 2037870, 1927295, 1794721, 1645510, 1583700, 1553316, 1601448, 1540335, 1495459, 1636066, 1702458, 1757331, 1783262, 1827771, 1861389, 1904506, 1970877, 2129055, 2376730, 2598547, 2806368]
10122B806368K77170K37039J98711J70665J68884Q3080K4615j01891j79288k02578
10112C482775j82784j85482j84510j96461k15120k39576k06257j44074p4443j04449
10102A749619j82674k26402j42988q2405j4436m7654m9611k6355n2283r4537r7767
10091G32507l8906j6891j31371o741Q4078j6167n4692L8311l4256k0490n222J9253
10079E49413r078j22128j09341j8248l57n6519l79j1142L0585R1207p4714J8849
10067B88148K9363j0151j1432o071j2268Q5309o2264j05205R762N6980N0890K3974
10055C37035M2213L8678p050n7663K5468M6770L172M953l801O1855J91143K18003
10043I00776J61320j3903j26663j11857o4880n7106j25263n2599k2807j9701r1303
$$ y = [2806368, 3083538, 3320577, 3519288, 3689953, 3858837, 3941917, 3966532, 3864641, 3685353, 3482775, 3299991, 3114509, 2929999, 2733538, 2518418, 2278842, 2072585, 1928511, 1854068, 1749619, 1566945, 1340543, 1197555, 1115150, 1100714, 1053060, 1003449, 977094, 924811, 830274, 732507, 693601, 676710, 545339, 538598, 622676, 606509, 551817, 590128, 555872, 535382, 530160, 549413, 540335, 418207, 308866, 290618, 290261, 233742, 233363, 222221, 252806, 344013, 269299, 288148, 317511, 307360, 295928, 289857, 277589, 362898, 300634, 195429, 205191, 262171, 313061, 337035, 379248, 417926, 410876, 353213, 378681, 425451, 428623, 433576, 429775, 491630, 682773, 900776, 1062096, 1048193, 921530, 809673, 744793, 687687, 562424, 509825, 487018, 467317, 376014]
10032C76014p9412n9773p4640p8915Q767J4718k9716m7399o9409p9724K0580J30229
10020C1320O0505j49645n4645q333J6622L1082J6609L4291m1187L7322k7761Q460
10008d5360m918k3016r857L5506l8482j6704K2966M0637N2309q3736p7210N613
9996a42252p1908K2722M8644J5144q080l8060J6051n9093j6792J06390L7949j5017
9984a04302J1290P0523M0631m0632p8895j1235P3358K5827j2266n5414l3147l0434
9972a44696m781Q609L763p089j8175M280p679k2940l8096K1631N9931M9670r351
9959a04923L6095j6540o2692m8980o334m5452m0910L2705K4216k3555Q586j3943
9947b61727M7771R2763N4792j13591K2355o822N354l408L9607N5646q7053j08941
$$ y = [376014, 296602, 236829, 162189, 83274, 92041, 106759, 77043, 29644, -39765, -119489, -98909, 31320, 91825, -57820, -112465, -120798, -104176, -73094, -56485, -22194, -63381, -26059, -53820, -45360, -50278, -73294, -83151, -47645, -86127, -102831, -79865, -39228, 13081, -70655, -147865, -142252, -214160, -191438, -142794, -127650, -135730, -173790, -157739, -216832, -233624, -127234, -89285, -104302, -93012, -22489, 18142, -22490, -101385, -112620, -39262, -13435, -25701, -81115, -114262, -144696, -149477, -140868, -137105, -144194, -162369, -158089, -165768, -188708, -226804, -205173, -145242, -95572, -104923, -68828, -85368, -148060, -197040, -203374, -248826, -289736, -257031, -232815, -256370, -247784, -261727, -213956, -121193, -66401, -179992, -157637, -164459, -159105, -162513, -122906, -67260, -154313, -263254]
9935b63254o2446P0345M998P0882O9815q720p8544k0336n303n5229K7348J1278
9923b39166J6455L3777j5411J2031l6271N271q720J8678J4896K3357o2040L4176
9911b02967J4710r003o9345o1513J4993J7118P598J30012N0886K2528l643N008
9899h3618k0928k4336m0951j1858J958K4369l6233K4168N0386q812j8800J7467
9887a27188K2438l275j0629L8847O819K7797O0447j612n5583K020J41862J63096
9875B65039J19007J04550J5844l4092j4738k1306n1465L6581k2142j17417j08254
9864A71607K7667n0556j20576j01890l1049j4520R1694Q92p7355o1912r889O239
9852a69648P8062J0957k5191j4910M7312p8161l7131o019k8270k2150M2074M5535
$$ y = [-263254, -325700, -255355, -250357, -179475, -109660, -118380, -196924, -217260, -222563, -277792, -250444, -239166, -222711, -188934, -204345, -192314, -228585, -223314, -232034, -213356, -198460, -175103, -237143, -202967, -188257, -197260, -266605, -328118, -313125, -296007, -288409, -158397, -107511, -84983, -88626, -83618, -104546, -128882, -169833, -181691, -179733, -155364, -191597, -167429, -117043, -125855, -144655, -127188, -104750, -108025, -118654, -79807, -72988, -45191, 15256, 13644, -41939, -39919, 101943, 265039, 384046, 488596, 504440, 470348, 455610, 434304, 382839, 419420, 397278, 279861, 171607, 199274, 148718, 28142, -73748, -104797, -119317, -27623, -26731, -104086, -165998, -175887, -169648, -91586, -80629, -105820, -120730, -73418, -151579, -188710, -194729, -222999, -245149, -203075, -157540]
9840a57540q38J4425N3948L0604N3911L563k780r7808k6315O4703J1821N0586
9828a720M5113o0290n1209l6992L3907k6010l9626M6270O4496k2502o7225l8403
9816a54191n382n1693L1322J7028n8539K3995Q69j644o831Q4101M1385J2829O424
9803f0327j05029j2167K2218k4619N4026M6906L2000M8116N256k43M4791k2818
9791B8110j8176l8557r8017n2512k02P838K9512L5071J2043j4950j00198r138
9779b19176Q3713J04946k4775J5370m536k890L2020k6436k0552K2109J6792M2991
9767A9576N1999q242L8438M6321L7688n9724q6912k3042j6107N963J5206j12192
9755i1028l4771O2082n0658K9311K9682j3754L9584m0344k8417M5130L7825p5371
$$ y = [-157540, -158378, -143953, -90005, -59401, -5490, -1927, -4707, -102515, -128830, -64127, -52306, -1720, 43393, -16897, -68106, -105098, -71191, -97201, -136827, -90557, -26061, -48563, -115788, -154191, -159573, -211266, -179944, -162916, -221455, -197460, -196591, -198235, -205066, -120965, -79580, -66751, -60327, -165356, -177523, -155305, -179924, -125898, -78992, -46992, 1124, 6380, 6137, 50928, 28110, 9934, -28623, -126640, -179152, -179354, -171516, -142004, -106933, -94890, -109840, -210038, -219176, -135463, -30517, -55292, -39922, -44458, -47348, -15328, -41764, -62316, -40207, -23415, 19576, 71575, 63333, 101771, 148092, 185780, 126056, 39144, 16102, -5, 5958, 21164, -91028, -125799, -63717, -114375, -85064, -55382, -69136, -29552, -69896, -98313, -53183, -15358, -90729]
9743i0729r2428N583J16237J25808O5763m4485n0531O8457m8905J1942P4589p879
9731A33422L0229l9970j4429l1550j5847j0951J5078l3297j3751O9562J4912J1295
9719A14703O664l8757k9229Q3520L0412m1518L3201o0582j9898P5767P5520m4888
9707A84915l88K0677n0217l8031L6576k4611K9783K4913J04166L5p5981K4989
9695B36826K5776n280k4415L1427k2312L2673J04104P3059L463j7275o3507J4121
9683C88660N5616L0879N4244J6434O0955N4120p231K5726L5080L7103P0921P2909
9671H95416O7946M1194M3933N5546J38758J88951K04161J03237P9020K69033K82619
9660B369814K57834K22140P5310N0741J64263K92669M02032M98828O82193Q97076
$$ y = [-90729, -183157, -177574, -61337, 64471, 130234, 85749, 35218, 103675, 54770, 66712, 141301, 133422, 163651, 123681, 109252, 77702, 61855, 50904, 65982, 32685, 18934, 88496, 103408, 114703, 121367, 82610, 53381, 136901, 167313, 125795, 158996, 98414, 78516, 154283, 229803, 184915, 184527, 205204, 154987, 116956, 153532, 128921, 158704, 183617, 287783, 287818, 211837, 236826, 262602, 257322, 232907, 264334, 242022, 274695, 378799, 451858, 455321, 438046, 374539, 388660, 444276, 475155, 529399, 545833, 606788, 660908, 653677, 679403, 714483, 751586, 822507, 895416, 963362, 1004556, 1048489, 1104035, 1242793, 1431744, 1635905, 1739142, 1818162, 2087195, 2369814, 2627648, 2849788, 2925098, 2975839, 3140102, 3432771, 3834803, 4333631, 5015824, 5912900]
9650E912900J097560J487898K099561K891223M243569O478843J0191473J5783570
9642E0186597K2617885K7840963K1611302q591825l3055324k8477373j7515309
9635C4616916j0462950o557031m321660l033578k169193j679685j291789r72666
9627D128364p48668n25434l83471l64480k85374j55088j17571n4400j00605r9398
9617A293875j91945k49411j45695j77648j19359j37381j19821n1337l2048q0642
9607a1412q5955K1583M5597o686j5634m1540R400p5030l0155O2809L8324l8335
9595a27034J5588L7809k749k3922k6540n2433j1874J0476n0821j1477R020L8109
9583a95848M1557N5741l8547J9839J6278m9085p2675M7110k7401m7795q0851K8258
$$ y = [5912900, 7010460, 8498358, 10597919, 13489142, 17732711, 24211554, 34403027, 50186597, 72804482, 100645445, 122256747, 113664922, 80609598, 52132225, 34616916, 24153966, 17596935, 13275275, 10241697, 8072504, 6392819, 5101030, 4128364, 3379696, 2854262, 2470791, 2106311, 1820937, 1665849, 1548278, 1493878, 1393273, 1293875, 1101930, 852519, 706824, 529176, 409817, 272436, 152615, 101278, 69230, -11412, -97367, -75784, -30187, -36873, -52507, -94047, -84647, -159677, -189832, -127023, -88699, -127034, -111446, -73637, -76386, -100308, -126848, -179281, -191155, -180679, -231500, -242977, -233957, -195848, -154291, -98550, -137097, -117258, -100980, -150065, -222740, -175630, -203031, -250826, -331677, -303419]
9571c03419N8348j4515J8618J198k6806M0188k7784q1845J1074O5899P2357m2193
9559b28880j2485J411k0146l7808j9095N2859M650L9360j7766j8586K6120j3320
9547b43686l5315l6078K5464P9221K1147o5273j15141O2531J28403M1020k0529
9536a58236j3553l7445K0674O186j3441O7687J4940o5651n214J6325l2185k4244
9524b24157N0963L9999o1448j4907j6143k4j9148l4292O496o770J07657L2904
9512a38870l0875K0315M5013L5532n1910k5483n3734m7867L3638p59K7773O544
9500a80683l6866q9058J758Q8920R4631j6853o9981P2873n2r7955K2359l7412
9488b48319K1053N851n938K0426k9680N64k3759n702P241L3403M8558Q3732j1573
$$ y = [-303419, -245071, -259586, -240968, -239770, -266576, -226388, -254172, -336017, -324943, -259044, -186687, -228880, -241365, -239954, -260100, -297908, -317003, -264144, -259494, -220134, -237900, -256486, -230366, -243686, -279001, -315079, -289615, -210394, -189247, -254520, -369661, -307130, -178727, -137707, -158236, -171789, -209234, -188560, -182374, -195815, -128128, -113188, -178839, -184053, -167728, -199913, -224157, -173194, -133195, -194643, -209550, -225693, -225717, -244865, -279157, -272661, -279431, -171774, -138870, -169745, -149430, -104417, -68885, -120795, -146278, -200012, -247879, -214241, -215000, -187227, -180683, -217549, -306607, -304849, -215929, -121298, -138151, -208132, -135259, -135311, -233266, -210907, -248319, -227266, -221415, -227353, -206927, -236607, -236043, -259802, -265504, -258263, -224860, -176302, -92570, -104143]
9475a04143q8456q6799j517P7815J5175L9349O2822j979m5363k4818J7687J6179
9463a24048p2336j0291J6258j8054M8439O668j9404J5476N8434j4144o8522J0746
9451a70778l3631j9089M1568Q0394J759m8616R072N3111j3383q3263j5355R3870
9439a04341k21p147J4645K819m854n0867j3128K5571K554L3805N3398j6274q0763
9426a44803m0003P4095J7377l7654j0966q217K5131j1043l1700K0572P1483o4226
9414a39954o1159O2262M1614j06P9741n5079q317N7171K0148r988m0058k500k4446
9401h0671o8812J9716K7839l0793J3164Q478j3327P421Q0528k6366k2056N587
9389g9292j6720m440n589J5746k6182O0791L2249J2339N1327k5024m1122j7482
$$ y = [-104143, -192599, -279398, -280915, -203100, -187925, -148576, -85754, -87733, -133096, -157914, -140227, -124048, -196384, -206675, -190417, -208471, -160032, -153364, -172768, -157292, -98858, -113002, -181524, -170778, -204409, -223498, -181930, -101536, -99777, -148393, -139321, -86210, -99593, -182856, -198211, -104341, -104562, -111709, -97064, -94245, -99099, -149966, -163094, -137523, -134969, -101164, -47766, -64040, -144803, -184806, -110711, -93334, -130988, -141954, -150171, -125040, -136083, -167783, -147211, -75728, -139954, -201113, -138851, -97237, -97343, -17602, -72681, -80998, -23827, -3679, -13667, -53725, -56225, -80671, -149483, -129767, -101928, -132721, -119557, -111079, -124406, -116985, -36457, -62823, -84879, -79292, -96012, -100452, -106041, -90295, -116477, -55686, -23437, -11098, 40229, 15205, -25917, -43399]
9377d3399j4780l9008J1994J3500k359Q851l1959m2604P7n1658N676P2038K3699
9364h9932k9148p246J4429l1617m2070o9233M9445L9814N1744Q4042j6375j8528
9352f4675m0975k5362k0979L4241Q3616K7355J0395J5829K6199q9919J7905l6932
9340f3302k0436k5487M844N3474J7104k3214n4658k1304K6193j2602m941K8213
9328i6116O2465n1444o2144L8102J2734n1442P7298Q8470j06567n3557N6931P2668
9316a2602M4755r251q211L0447L9356k987j0930j0487l6042o1921j0752R5476
9304D6851P0619J4080j0031J7986j6051L8038k2161k9463k9940K4388L7475p5398
9292F6393q7293P0945L9377L1341O8296L1804n4865j8597R2711k6413r7400J3654
$$ y = [-43399, -58179, -97187, -85193, -71693, -74052, -65201, -97160, -139764, -139687, -191345, -185669, -113631, -89932, -119080, -126326, -111897, -143514, -185584, -254817, -205372, -165558, -113814, -29772, -46147, -64675, -105650, -131012, -151991, -117750, -34134, -6779, 3616, 19445, 45644, -44275, -26370, -63302, -83738, -109225, -104381, -50907, -33803, -57017, -111675, -132979, -106786, -119388, -124329, -96116, -33651, -85095, -147239, -109137, -96403, -147845, -70547, 17923, -88644, -142201, -85270, -12602, 32153, 22902, 14691, 45138, 84494, 81507, 70577, 60090, 24048, -37873, -48625, 46851, 117470, 131550, 121519, 139505, 123454, 161492, 139331, 109868, 79928, 104316, 141791, 66393, -20900, 50045, 89422, 120763, 189059, 220863, 165998, 147401, 240112, 213699, 116299, 129953]
9280A29953J18755q17m3241j6013l8836j4175k6138n80N1028O2487n548k3132
9268A93743N3502N1273k8880L2783O4981N5987J6707N8238j2440O026l9868J6230
9256D68282N061k2798m088N4744J1911k165n3989q9999J2236L2365N440O2393
9244D79393R0672K1409L9662K6988o044L6307K8733P0767J05070J55015J74863
9233A222835R4793K14034K04940m9204j51638q5219O500M3300J68020J42454N3755
9222A864570J04313M6033k367P5002R3293j7515j75757j61205j16243n5104m4549
9211A610471M2493r6694j26691p6439o3321j5798N1489o0651j7138k4000l3403
9200A190318j7896O4035N6859O4924K7127K7807k717O7744J30310R4414J0163
$$ y = [129953, 248708, 247891, 204650, 188637, 149801, 135626, 109488, 108908, 159936, 222423, 216875, 193743, 247245, 298518, 269638, 302421, 367402, 423389, 440096, 498334, 485894, 491920, 452052, 468282, 473343, 450545, 446457, 501201, 513112, 510947, 456958, 366959, 379195, 411560, 417000, 479393, 570065, 591474, 631136, 658124, 652080, 688387, 717120, 787887, 892957, 1047972, 1222835, 1317628, 1531662, 1736602, 1687398, 1535760, 1450541, 1457041, 1500341, 1668361, 1810815, 1864570, 1968883, 2014916, 2012549, 2087551, 2180844, 2163329, 1987572, 1826367, 1710124, 1655020, 1610471, 1652964, 1556270, 1429579, 1353140, 1289819, 1274021, 1325510, 1264859, 1247721, 1223721, 1190318, 1172422, 1236457, 1293316, 1358240, 1385367, 1413174, 1410457, 1478201, 1608511, 1702925, 1713088]
9189A713088O3603O7007J27394J18392P5274J49190K50782J54538J77877K03293
9179C100438K38670K39264L29293K77852K75595J52639L4895J01621M5048r2538
9169D702777j38647k17853k01782j53412k06585l42178k78858k40869k28414j10151
9159B584028n3031k6460r2182j88114j20635n1192j00348q4728m5952k988j34529
9148A683869n5547K039P2060K4903K1728K2168K5497J19234P6516N7063M1071
9137B090601J34011M2400J26599J90069J53199K37799K83631K31926J73248J32583
9127C796066P7464J09540M3581L413k5080o2895j97049j88051k52312k35232j30686
9116B938759j27533k67147k27550j23412n9342j24876j14704p4568q7426p5496
$$ y = [1713088, 1776691, 1843698, 1971092, 2089484, 2164758, 2313948, 2564730, 2719268, 2897145, 3100438, 3339108, 3578372, 3907665, 4185517, 4461112, 4613751, 4648646, 4750267, 4795315, 4702777, 4564130, 4346277, 4144495, 3991083, 3784498, 3442320, 3163462, 2922593, 2694179, 2584028, 2530997, 2504537, 2412355, 2224241, 2103606, 2052414, 1952066, 1867338, 1821386, 1818398, 1683869, 1628322, 1630361, 1702421, 1727324, 1749052, 1771220, 1796717, 1915951, 1992467, 2049530, 2090601, 2224612, 2267012, 2393611, 2583680, 2736879, 2974678, 3258309, 3490235, 3663483, 3796066, 3873530, 3983070, 4026651, 4030064, 4004984, 3942089, 3745040, 3556989, 3304677, 3069445, 2938759, 2811226, 2544079, 2316529, 2193117, 2133775, 2008899, 1894195, 1819627, 1732201, 1656705]
9106A656705j08169r5428q3954j27519n8319j6077p2582k8267o8034j11534n8039
9095H28783L1244R673n1195J3697P56o1719j3891R0413Q3315J21366L8424J5458
9083A106324P7105P1509N995P7302L1761R4402m644m3051l654j06946j16711r7374
9071A092018j8470l9583q6654j46549m8851j1968j09752n2527q2981l2288n7185
9060D05210l3n4786j9372m1788n2466j07133j4502P003j1895P0826P7231L2802
9048B91097r1550p8870K1532o6617n0724q063J3109K830N9702k7628k5674L519
9036D2663J4981O4307J6264k1952m6993o7053m7300J9703O335o2751K0642j5456
9024g6610l8716n5212L744M7801K6146L6605J4271m7502k7127m301J8150k6044
$$ y = [1656705, 1548536, 1453108, 1369154, 1241635, 1183316, 1167239, 1094657, 1066390, 998356, 886822, 828783, 860027, 869700, 818505, 832202, 832958, 771239, 757348, 847761, 931076, 1052442, 1090866, 1106324, 1183429, 1254938, 1260933, 1338235, 1369996, 1464398, 1459754, 1416703, 1413049, 1306103, 1189392, 1092018, 1073548, 1033965, 947311, 800762, 751911, 739943, 630191, 577664, 494683, 462395, 405210, 405177, 350391, 331019, 289231, 236765, 129632, 115130, 122133, 110238, 181064, 258295, 291097, 199547, 120677, 142209, 75592, 24868, 16805, 29914, 32744, 92446, 64818, 39144, 42663, 57644, 121951, 138215, 116263, 69270, 2217, -45083, -25380, -19045, -81796, -61154, -76610, -115326, -170538, -166794, -118993, -92847, -56242, -41971, -89473, -116600, -120901, -102751, -128795]
9012a28795L2274P4856Q928k9141M6166L8580O008j9050k7335J3070n6115o2484
9000a03038m9436P5823m773J2225N7103R0497l7159n1265n0163m9314K6236Q402
8988g4862L0301l7258l7453j3062M5064p78O1939J5879j0899N87j01575j6726
8976a38843L7867O3981J7330n9161L9412k5312j9502K0786K5440k848L8778k9292
8964c1364N8512j7062m1472o0845m2127M8132P8308J2748o2240q0875K4978m663
8952a17970j0836L0666k0587Q967k2476O5825M6642m9711k9096l289M7846L9808
8940a4211o1561o1360K8092J3182j4056q4899p4402K7155P8354L5880k767m3141
8928a73734n159O4197M0326J925l9564K9816J507j1997k2814q7978L0106q717
$$ y = [-128795, -96521, -21665, -12737, -41878, 4288, 42868, 48876, 29826, 2491, 15561, -40554, -103038, -152474, -76651, -81424, -69199, -12096, 78401, 41242, -10023, -60186, -109500, -83264, -74862, -44561, -81819, -119272, -132334, -87270, -88048, -26109, -10230, -21129, -20542, -122117, -138843, -100976, -36995, -19665, -78826, -39414, -64726, -84228, -63442, -38002, -40850, -2072, -31364, 27148, 10086, -31386, -92231, -134358, -86226, -7918, 4830, -57410, -138285, -113307, -117970, -128806, -98140, -118727, -109760, -132236, -66411, -19769, -69480, -98576, -101865, -54019, -14211, -75772, -137132, -109040, -95858, -109914, -194813, -269215, -242060, -163706, -127826, -130593, -173734, -178893, -114696, -74370, -72445, -112009, -82193, -80686, -92683, -115497, -203475, -173369, -182086]
8916a82086R5329N2873J138J387O093l7420Q92P1474O469K3634k2422L0632j0811
8903C7182p8888q450M5981k7949k6116k3978K3549K3181j8148o192k1014m5427
8891a26269L4203n7414J7453J6297j6916l1199l4694N140O2303J04501l8242o3877
8879a28714m2564k777m3004k5045Q138O0667L2875k6708k1476Q3457P1316M393
8867b9442l7263p7678J4006L5220J721K3480l3953j3485k5463L006o337M1530
8855a04658l5285l5114R474J1199J3215N7755o4090l4444Q3651L2780j2145k1242
8843i8904K2744J6446J5192l6890o5461j8767L2802L1705M5526O047l8042k4249
8831a11851K9009j3655k2642l6250L234J01952J9603k2625n9846K1173J4612j4058
$$ y = [-182086, -86757, -33884, -32746, -31359, -25266, -62686, -61794, 9680, 16149, 39783, 17361, 47993, 37182, -41706, -50156, -4175, -32124, -58240, -82218, -58669, -35488, -53636, -59828, -80842, -126269, -92066, -149480, -132027, -115730, -132646, -163845, -198539, -193399, -131096, -26595, -64837, -128714, -171278, -174055, -217059, -242104, -233966, -173299, -140424, -167132, -188608, -105151, -33835, -29442, -66705, -144383, -130377, -95157, -93436, -69956, -103909, -117394, -142857, -139851, -146188, -104658, -139943, -175057, -165583, -154384, -141169, -83414, -147504, -181948, -98297, -65517, -77662, -98904, -76160, -59714, -44522, -81412, -146873, -165640, -132838, -101133, -55607, -49560, -87602, -111851, -82842, -96497, -119139, -155389, -152155, -50203, -30600, -53225, -113071, -91898, -77286, -91344]
8819i1344n8485j5975k0622j17622L6500J00206K8434R2994K4616o4222N6027
8808b9493L5025L4363M812K101k4994l2129J5380o3o8697l7505p208j5662m424
8795a28494q117l7544l5943Q2380O7707n200p6493j1191n2996O2983L2444K627
8783a07837o5417K4751L3318L0182K0744K8883J5854L1763m7409o0696M666K5016
8771f6182P3332l1180r0720l0274Q8292N8294K2953n3368m1953j11541j3562O9667
8759a26242K9171K6884L1279P540l2145p20J65276n2650l9917o750J2419m383
8747I762l7152k166j9186P213M871J512M8619M3963l1967l0681k0026p869m023
8734c7130K8942M3001k9545o4643k7400Q8307L2453k6653m8548L738o8247n984
$$ y = [-91344, -149829, -165804, -186426, -304048, -267548, -167342, -138908, -45914, -21298, -85520, -29493, 5532, 39895, 44707, 46808, 21814, -10315, 5065, 5002, -63695, -101200, -108408, -124070, -128494, -136611, -174155, -210098, -127718, -60011, -65211, -141704, -152895, -205891, -142908, -110464, -107837, -173254, -148503, -115185, -85003, -64259, -35376, -19522, 12241, -35168, -95864, -91198, -66182, 7150, -24030, -114750, -145024, -56732, 1562, 24515, -28853, -70806, -182347, -195909, -126242, -97071, -70187, -38908, -31368, -63513, -64233, 101043, 48393, 8476, 1726, 14145, 9762, -27390, -29556, -48742, -41529, -36658, -35146, 13473, 57436, 25469, -5212, -25238, -33107, -37130, -8188, 34813, 5268, -59375, -86775, 1532, 33985, 7332, -41216, -37478, -105725, -111709]
8722a11709N0408o4849K5885J06524j3474j4018o4812J1k159J7803q6022k9620
8710a86032K7765P5649R6030L8162m4137n3020m1363n8469P3365k3520n7196j9255
8698a72021P0201K9542l7580n4680J2408L9953N7791M6924J4877m9307p6903J5694
8686a03101l6048k581J3050n747M7062Q050j32557j1549J3197n244O2295O7098
8674h6075Q216n0405j13932l08L4511L2273j4317N8011j4468n6517K2474N8793
8662a21744m3159m2866L189O9802K9255J6919Q8172k0858j3179q771m005M6877
8650c68j8828n2086K3472O0273p9849k8585M5388O0039P570p2210j8292L2845
8638d0631k3888j7250m5750M879J2255P6452l3811j3233j9360j6518k1642q718
$$ y = [-111709, -61301, -126150, -100265, 6259, -7215, -21233, -86045, -86034, -88193, -70390, -156412, -186032, -158267, -82618, 13412, 51574, 7437, -45583, -86946, -145415, -72050, -95570, -152766, -172021, -101820, -72278, -109858, -164538, -152130, -112177, -54386, -7462, 7415, -41892, -118795, -103101, -139149, -141730, -128680, -134427, -87365, -79315, -211872, -223421, -210224, -215468, -153173, -86075, -77859, -128264, -242196, -242504, -207993, -175720, -190037, -132026, -146494, -203011, -180537, -121744, -164903, -207769, -204580, -134778, -105523, -88604, -432, -21290, -34469, -43240, -47245, -368, -19196, -71282, -47810, 12463, -67386, -95971, -50583, 9456, 17026, -55184, -73476, -40631, -64519, -81769, -127519, -122640, -110385, -33933, -67744, -80977, -100337, -116855, -138497, -147215]
8626a47215L4705Q0309l86m2218m7601K9733p225O9753l6304k3487n93J7876N4293
8613a8360R100m9705k7449J2379k1428J1512O8837j672l9015q6694M130M7166
8601i1199R0916k069p2038J8789k3749m3241L7744J51072L9815l574J6587k2512
8589I6541R305J21403Q2588K0290k0521l9173o037l792m6448m0650k8065k0045
8577A25396O364l5078r771j9219K930l9185l6950k4447O9774M376o0232j13368
8565a29410m2861L3410o090M8291j6508M8146M1777m2622l5665N4062k5653k1062
8553i4185M553M946n5265m9504K1974j137M2027J3572m44L8308m7519J2720R1832
8540a8122L6121M5770m8437p6273K2700m6470l6257m4658r184M2244M349l9487
$$ y = [-147215, -112510, -32201, -32587, -74805, -122406, -92673, -99898, -30145, -66449, -89936, -90529, -72653, -18360, -9260, -58965, -86414, -74035, -95463, -83951, -15114, -16786, -55801, -142495, -138365, -91199, -283, -2352, -74390, -55601, -79350, -122591, -84847, 66225, 106040, 102466, 119053, 96541, 105846, 227249, 309837, 330127, 309606, 270433, 264396, 260604, 214156, 173506, 145441, 125396, 131760, 96682, 86911, 67692, 70622, 31437, -5513, -29960, 39814, 44190, -16042, -129410, -172271, -138861, -144951, -96660, -113168, -65022, -23245, -65867, -101532, -47470, -73123, -94185, -89632, -84686, -139951, -189455, -167481, -168618, -126591, -113019, -113463, -75155, -122674, -109954, -18122, 17999, 63769, 15332, -60941, -38241, -84711, -120968, -165626, -174810, -132566, -128217, -167704]
8528a67704N9128Q991j9813K1842j9398k5705k132P780O3277L5151O0694K5053
8516D7164p8550R742o9379n940P3155K5745n6278j8770N5028J609k7652K7716
8504a6410N7817m0273P3051O6937R5010J21648J47894K09916J59874R1612j29702
8493H37374k48359k04931j18102q3084p8615q3681j1136J8407M0946N3415o0165
8482F2069j29340m3515J9666J2610k9046j6181M3854O0447r0572r3853J27253
8471g6608Q3768n8305J0420R7106P9127O4138J0678o9673p7492K395p5096j5181
8459b4723J62666L5440K1820P6321R1290J39113K01738L69157M84690K68880l31158
8448A495234n32641m03893k28432n1024n2201q9509p6445o3184l3641j3078Q3260
$$ y = [-167704, -108576, -99585, -119398, -97556, -116954, -142659, -144791, -137011, -73734, -38583, 22111, 47164, -31386, -21644, -91023, -96963, -23808, 1937, -54341, -73111, -18083, -16474, -44126, -16410, 41407, 1134, 74185, 141122, 236132, 357780, 505674, 715590, 875464, 967076, 837374, 589015, 384084, 265982, 182898, 104283, 20602, 9466, 27873, 68819, 122234, 62069, -67271, -110786, -91120, -78510, -107556, -123737, -79883, -19436, -110008, -203861, -76608, 7160, -51145, -40725, 56381, 135508, 199646, 210324, 140651, 63159, 65554, -9542, -24723, 137943, 173383, 195203, 271524, 362814, 501927, 703665, 1072822, 1557512, 1826392, 1495234, 962593, 558700, 330268, 279244, 227043, 137534, 61089, -2095, -35736, -48814, 34446]
8437C4446n228r6734l8430Q488k2900j2317q9260K2662N1998R4930L1792Q354
8425a2199j0344j6424O7287J01446J646p0262q2961L6008m2272j3763L6406J3128
8413G696K1860K9404k0935k3034J29069J53957J06078J92536P8222j60197k40787
8402B73869j58986k9617n4846j11429j3919m3101p7557k1835K5160P8958O4907
8391f8396l0807M5646K4192k4697p74O8845k7135K9368P0539J3689m2425l6638
8379B1407o2672J9736N3405j8693k5297J275K7253l5198k1946M2691M5733j0144
8367C7550o880o7747j4879J9481q735j3860m661K3720q389j9394O878Q437K699
8354d5780M062K7758J06390J12896P2088J90176L36366M51139O28448N30752l96524
$$ y = [34446, 29218, -67516, -105946, -97458, -120358, -132675, -221935, -199273, -147275, -52345, -20553, -12199, -22543, -38967, 28320, 129766, 131412, 61150, -21811, 14197, -28075, -41838, -5432, 7696, 29556, 58960, 38025, 14991, 144060, 298017, 404095, 596631, 674853, 514656, 273869, 114883, 85266, 30420, -81009, -94928, -138029, -215586, -237421, -212261, -133303, -68396, -99203, -53557, -29365, -54062, -54836, 14009, -13126, 16242, 86781, 100470, 58045, 21407, -41265, -21529, 31876, 13183, -12114, -10839, 16414, -18784, -40730, 1961, 47694, 37550, 30670, -37077, -51956, -32475, -41210, -55070, -59731, -36011, -44400, -63794, -56916, -48479, -45780, -41718, -13960, 92430, 205326, 277414, 467590, 803956, 1255095, 1883543, 2414295, 2017771]
8343B017771p97569n77828k60155m5721k6871l0240M0866L8937r9624j30898k8077
8332A00591k3619j04108p75K9785R960n9625o1778N11P896K6996R4611N4512m1809
8319C3148L0730O1137m9334o267L4857Q7946p3361k0109J9554O4968R6193N9717
8307C39179R989J97846L15494N07244Q23809J252830J387963m16699j839394j245836
8297A332425n50812j54467j61594n0001l9150k9664q4491j33678j27861r6172
8287i5465o708J4479q4229J03393Q3627n6953K6458p1054O6912j0690M8496n3269
8275c5003n1477k2843K7044P635j8076l1032K3044L5192p170L7608O9257J08009
8263A42188J73305R5707J4674J18625K90412N23771O60566J33596p28734o20755
$$ y = [2017771, 1220202, 642374, 382219, 336498, 309627, 279387, 320253, 359190, 259566, 128668, 100591, 76972, -27136, -27911, 1874, 11834, -47791, -109569, -109058, -101162, -74166, 20445, 74957, 33148, 63878, 125015, 75681, 69414, 104271, 192217, 118856, 98747, 118301, 183269, 279462, 339179, 349168, 547014, 862508, 1369752, 2193561, 3446391, 4834354, 4417655, 2578261, 1332425, 781613, 627146, 465552, 415551, 376401, 346737, 262246, 128568, 707, -95465, -102173, -87694, -171923, -68530, 15097, -41856, -15398, -86452, -19540, -30230, 18266, -35003, -86480, -109323, -82279, -74644, -92720, -123752, -100708, -65516, -72686, -35078, 34179, 142188, 315493, 411200, 425874, 544499, 834911, 1358682, 2019248, 2152844, 1424110, 803355]
8253H03355l66261k35906j65665p5707o0518L4941L8783j10387j5421J9460P406
8242a25920O9873O9457k4353n9984l1023k8051l5224J1693O8175P1333o9054n4871
8230a37949R578K0250q3686o9048m1863R8560k2910M0444N7508K769p2258m847
8218b03452j460l7444M6990n5495N6997J8858J4472K1605P3782K685M8183Q3027
8206F8748K7119p6389q898p2691n6722o8965J3103k0140K743M7074J0920Q720
8194a25378j6599l7901O0708O9475j3651L3287P790m135N681k786J383K1192q91
8181a825K5804J8241j23616m1054J2652n6211p90P5294J948k2461p390P8006J2269
8168b9133m5464k5235K4463l5702k3228N3050k7748O2278R464o2354j04594r896
$$ y = [803355, 437094, 201188, 35523, -40184, -100702, -65761, -26978, -137365, -152786, -133326, -125920, -56047, 13410, -10943, -70927, -101950, -130001, -165225, -153532, -85357, -14024, -83078, -137949, -128371, -108121, -191807, -260855, -302718, -204158, -227068, -186624, -129116, -126347, -198605, -203452, -204912, -242356, -195366, -250861, -193864, -175006, -160534, -138929, -65147, -62462, -14279, 68748, 95867, 19478, 10580, -62111, -118833, -187798, -174695, -194835, -192092, -145018, -134098, -125378, -141977, -179878, -119170, -49695, -63346, -30059, -22269, -26404, -20723, -23509, -22126, -934, -1825, 23979, 42220, -81396, -122450, -109798, -166009, -166799, -91505, -89557, -112018, -119408, -41402, -29133, -74597, -99832, -75369, -111071, -134299, -81249, -108997, -46719, -37255, -99609, -204203, -214099]
8156b14099n083L5557L2650l3224j8743m4405N6475J73473l8559r3621n4255j285
8144b05119J5238L1982j8391M5092Q0502P5893l6783l9064o6858P490l0654L6916
8132a03756J5889P4862L695k3283j4119K0474N6600Q675o205k3272k0768q2090
8120i3298n2114p5884N0871k0854l1430J512N6592J08983J6407q1894n5691P615
8108a69185J23539L387n9109p5058m5964j6862O4353J0016J12501J6975n8012
8097i3419o3272m7404p6597M5127J10686J05159k3752K0633j1475q0374q7217
8086b01905N8889J12460J8898j0394L580n1954o9421l2541L1825M5960m4970k0102
8074a59675J7611m5879k412R0775l6355o6203r1101R6955J12836m9974o8572J10224
$$ y = [-214099, -219182, -183625, -150975, -184199, -202942, -247347, -190872, -17399, -55958, -149579, -203834, -205119, -189881, -157899, -176290, -131198, -50696, 25197, -11586, -50650, -117508, -110018, -140672, -103756, -87867, -13005, -9310, -32593, -46712, -26238, 30362, 39037, 32832, 9560, -11208, -93298, -145412, -221296, -170425, -191279, -222709, -221197, -164605, -55622, -39215, -121109, -176800, -169185, -45646, -42259, -101368, -176426, -222390, -239252, -174899, -164883, -52382, -35407, -93419, -156691, -204095, -280692, -235565, -124879, -19720, -43472, -22839, -34314, -114688, -201905, -143016, -30556, -11658, -22052, -18472, -70426, -139847, -172388, -140563, -94603, -139573, -159675, -142064, -187943, -190355, -99580, -135935, -202138, -293239, -196284, -83448, -133422, -201994, -91770]
8062i1770O2618o8146q3542K7393J6737J9255L2502J2883j2119m3285j3132m2842
8050a83448k3L0461Q3177m127o2633p316j2105j4250K1071l2867J6696M7761M4227
8037g3376L2766M9330m9496k0821l3575n5189K5960K1779L9071n4015o855L0281
8025i4140k928n6566k4054j1262j15262L6862o827P5230M6372J4224P3499m8297
8013a13149J1503R7219K8629J2790n4037p5473J6231L6146M0420K1237J9468N208
8001D6192n7615p1331j9350j4949j7783r397m3232M7950L1450k509q1268N3929
7989a37913r118K1211R6602J08226K7412k9576k1107p6980j1231M5256L219j9578
7977c577K710J9373L5969J6533j0699k6425L0580j7882o1790k0518J0354k0931
$$ y = [-91770, -29152, -97298, -180840, -153447, -136710, -117455, -84953, -72070, -84189, -127474, -140606, -183448, -183471, -153010, -69833, -73960, -136593, -143909, -156014, -170264, -149193, -182060, -165364, -117603, -73376, -40610, 8720, -40776, -61597, -95172, -150361, -124401, -102622, -63551, -117566, -124421, -94140, -97068, -153634, -177688, -188950, -304212, -267350, -274177, -198947, -152575, -138351, -64852, -113149, -101646, -4427, 24202, 36992, -17045, -92518, -76287, -40141, 279, 21516, 40984, 46192, -11423, -82754, -102104, -117053, -134836, -144233, -187465, -139515, -108065, -110574, -191842, -137913, -147031, -125820, -29218, 79008, 106420, 76844, 55737, -21243, -32474, 12782, 16001, -3577, -867, 18506, 54475, 71008, 60309, 33884, 64464, 46582, -15208, -35726, -25372, -46303]
7965d6303k1794j2966j544L6883N1309K7141O712l2919j7003J2943K1571J1313
7953C5343k5019l4009J4114o7076l1996j8230R218P4845k808m7790K6005K5193
7941d2210j4417k4079k2597P0838O0711m688j9565j5545p1574J065K6075l3971
7929h9957o4511K375M3365L2208M0681m6543r2744L2478J141M6189L4930k596
7917f2984k2865l3317N4934J3466m913j4703o0693j908J2492J2716J7621k7796
7905a17950M225M8602K4001L8753O0402n0326m2972K8623o800l9512L9024l7267
$$ y = [-46303, -68097, -81063, -82607, -45724, 5585, 32726, 39438, 6519, -10484, 2459, 24030, 35343, 10324, -23685, -9571, -76647, -108643, -126873, -117655, -42810, -45618, -93408, -67403, -42210, -56627, -80706, -103303, -32465, 28246, 23558, 3993, -11552, -83126, -82061, -55986, -89957, -154468, -152093, -108728, -76520, -35839, -82382, -175126, -142648, -141507, -95318, -60388, -62984, -85849, -119166, -64232, -50766, -55679, -70382, -131075, -132983, -120491, -107775, -90154, -117950, -113725, -65123, -41122, -2369, 58033, 7707, -35265, -6642, -13442, -52954, -13930, -51197]
$$ [...]
##END NTUPLES=NMR SPECTRUM
##END=
