##TITLE=Analysis number 325110
Compound Code mo 07033
Project Code adrs
Chemist Name spectrum
##JCAMPDX= 6.0         $$ Bruker NMR JCAMP-DX V2.0
##DATA TYPE= NMR SPECTRUM
##DATA CLASS= NTUPLES
##ORIGIN= Bruker BioSpin GmbH
##OWNER= nmr
$$ XWIN-NMR		Version 3.5
$$ Tue Dec 12 09:43:54 2006 GMT Standard Time (UT+0h)  MAYBRIDGE\nmr@NMR_250MHZ
##.OBSERVE FREQUENCY= 250.131544655141
##.OBSERVE NUCLEUS= ^1H
##.ACQUISITION MODE= SIMULTANEOUS (DQD)
##.ACQUISITION SCHEME= undefined
##.AVERAGES= 16
##.DIGITISER RES= 18
##SPECTROMETER/DATA SYSTEM= dpx250
##.PULSE SEQUENCE= zg30
##.SOLVENT NAME= CDCl3
##.SHIFT REFERENCE= (INTERNAL, CDCl3, 0, 16.5202)
##AUDIT TRAIL= $$ (NUMBER, WHEN, WHO, WHERE, WHAT)
$$ ##TITLE= Audit trail, XWIN-NMR		Version 3.5
$$ ##JCAMPDX= 5.01
$$ ##ORIGIN= Bruker BioSpin GmbH
$$ ##OWNER= nmr
$$ C:\u/data/dgb/nmr/ADRS/730/pdata/1/auditp.txt
$$ ##AUDIT TRAIL=  $$ (NUMBER, WHEN, WHO, WHERE, WHAT)
(   1,<2006-12-12 09:43:31.22 +000>,<MAYBRIDGE\nmr>,<NMR_250MHZ>,
      <created by zg, POWCHK disabled, PULCHK disabled
       configuration hash MD5:
       49 4B E0 1D 92 C2 6B 37 9F E6 65 BC 52 41 86 1D
       data hash MD5: 64K
       DE 92 89 38 85 C7 2D AB 3E B2 08 C3 CC 95 54 E8>)
(   2,<2006-12-12 09:43:45.05 +000>,<MAYBRIDGE\nmr>,<NMR_250MHZ>,
      <Start of raw data processing
       ef LB = 0.3 FT_mod = 6 PKNL = 1 SI = 32K 
       data hash MD5: 32K
       7C A9 2D DD 37 02 05 AA 4C B8 ED 0B 06 3B 4B 9A>)
(   3,<2006-12-12 09:43:46.83 +000>,<MAYBRIDGE\nmr>,<NMR_250MHZ>,
      <apk 
       data hash MD5: 32K
       AA 5B 91 6D C1 71 E3 BB 7A 3C 9E C4 E0 C1 38 54>)
(   4,<2006-12-12 09:43:47.55 +000>,<MAYBRIDGE\nmr>,<NMR_250MHZ>,
      <abs ABSG = 5 
       data hash MD5: 32K
       98 53 D6 82 B3 4F AC 58 A2 82 42 B8 02 EE 18 3A>)
$$ ##END=
$$ 
$$ hash MD5
$$ 47 A0 02 57 3F 2C DD B6 51 55 A1 7A 30 00 00 E0
##$RELAX= 
##$RELAX= 
##$RELAX= 
##$RELAX= 
##$RELAX= 
##$RELAX= 
##$RELAX= 
$$ Bruker specific parameters
$$ --------------------------
##$DU= <C:\u>
##$EXPNO= 730
##$NAME= <ADRS>
##$PROCNO= 1
##$TYPE= <nmr>
##$USER= <dgb>
##$AMP= (0..31)
100 100 100 100 100 100 100 100 100 100 100 100 100 100 100 100 100 100 
100 100 100 100 100 100 100 100 100 100 100 100 100 100 
##$AQSEQ= 0
##$AQ_mod= 3
##$AUNM= <au_zg>
##$AUTOPOS= <20 >
##$BF1= 250.13
##$BF2= 250.13
##$BF3= 250.13
##$BF4= 250.13
##$BF5= 500.13
##$BF6= 500.13
##$BF7= 500.13
##$BF8= 500.13
##$BYTORDA= 1
##$CFDGTYP= 0
##$CFRGTYP= 5
##$CHEMSTR= <none>
##$CNST= (0..31)
1 1 145 1 1 1 1 1 1 1 1 1 1 1 1 1 1 1 1 1 1 1 1 1 1 1 1 1 1 1 1 1 
##$CPDPRG= <>
##$CPDPRG1= <>
##$CPDPRG2= <>
##$CPDPRG3= <>
##$CPDPRG4= <mlev>
##$CPDPRG5= <mlev>
##$CPDPRG6= <mlev>
##$CPDPRG7= <mlev>
##$CPDPRG8= <mlev>
##$CPDPRGB= <>
##$CPDPRGT= <>
##$D= (0..31)
0 1 0 0 0 0 0 0 0 0.06 0 0 0 0 0 0 0.0002 0 0 0 0 0 0 0 0 0 0 0 0 0 0 
0 
##$DATE= 1165916610
##$DBL= (0..7)
120 120 120 120 120 120 120 120 
##$DBP= (0..7)
150 150 150 150 150 150 150 150 
##$DBP07= 0
##$DBPNAM0= <>
##$DBPNAM1= <>
##$DBPNAM2= <>
$$ [...]
##$SUBNAM7= <"">
##$SUBNAM8= <"">
##$SUBNAM9= <"">
##$SW= 20.6930455092707
##$SWIBOX= (0..15)
0 0 3 0 0 0 0 0 0 0 0 0 0 0 0 0 
##$SW_h= 5175.983436853
##$TD= 65536
##$TD0= 1
##$TE= 295.16
##$TE2= 300
##$TE3= 300
##$TEG= 300
##$TL= (0..7)
0 120 120 120 120 120 120 120 
##$TP= (0..7)
150 150 150 150 150 150 150 150 
##$TP07= 0
##$TPNAME0= <>
##$TPNAME1= <>
##$TPNAME2= <>
##$TPNAME3= <>
##$TPNAME4= <>
##$TPNAME5= <>
##$TPNAME6= <>
##$TPNAME7= <>
##$TPOAL= (0..7)
0.5 0.5 0.5 0.5 0.5 0.5 0.5 0.5 
##$TPOFFS= (0..7)
0 0 0 0 0 0 0 0 
##$TUNHIN= 0
##$TUNHOUT= 0
##$TUNXOUT= 0
##$USERA1= <user>
##$USERA2= <user>
##$USERA3= <user>
##$USERA4= <user>
##$USERA5= <user>
##$V9= 5
##$VALIST= <valist>
##$VCLIST= <CCCCCCCCCCCCCCC>
##$VD= 0
##$VDLIST= <DDDDDDDDDDDDDDD>
##$VPLIST= <PPPPPPPPPPPPPPP>
##$VTLIST= <TTTTTTTTTTTTTTT>
##$WBST= 1024
##$WBSW= 4
##$XGAIN= (0..3)
0 0 0 0 
##$XL= 0
##$YL= 0
##$YMAX_a= 223735
##$YMIN_a= -287293
##$ZGOPTNS= <>
##$ZL1= 120
##$ZL2= 120
##$ZL3= 120
##$ZL4= 120
##$ABSF1= 16.52022
##$ABSF2= -4.172953
##$ABSG= 5
##$ABSL= 3
##$ALPHA= 0
##$AQORDER= 0
##$ASSFAC= 0
##$ASSFACI= 0
##$ASSFACX= 0
##$ASSWID= 0
##$AUNMP= <proc_1d>
##$AZFE= 0.1
##$AZFW= 0.1
##$BCFW= 0
##$BC_mod= 0
##$BYTORDP= 0
##$COROFFS= 0
##$CY= 12.5
##$DATMOD= 1
##$DC= 0
##$DFILT= <>
##$DTYPP= 0
##$F1P= 14.0000005364418
##$F2P= -0.99999901652339
##$FCOR= 0.5
##$FTSIZE= 32768
##$FT_mod= 6
##$GAMMA= 0
##$GB= 0
##$INTBC= 1
##$INTSCL= 1
##$ISEN= 128
##$LB= 0.3
##$LEV0= 0
##$LPBIN= 0
##$MAXI= 10000
##$MC2= 0
##$MEAN= 0
##$ME_mod= 0
##$MI= 0
##$NCOEF= 0
##$NC_proc= -5
##$NLEV= 6
##$NOISF1= 0
##$NOISF2= 0
##$NSP= 0
##$NTH_PI= 0
##$NZP= 0
##$OFFSET= 16.52022
##$PC= 1
##$PHC0= 230.0387
##$PHC1= 6.976781
##$PH_mod= 1
##$PKNL= yes
##$PPARMOD= 0
##$PSCAL= 4
##$PSIGN= 0
##$REVERSE= no
##$SF= 250.130000444916
##$SI= 32768
##$SIGF1= 0
##$SIGF2= 0
##$SINO= 400
##$SIOLD= 32768
##$SREGLST= <1H.CDCl3>
##$SSB= 0
##$STSI= 32768
##$STSR= 0
##$SW_p= 5175.98343685301
##$SYMM= 0
##$S_DEV= 0
##$TDeff= 65536
##$TDoff= 0
##$TI= <Analysis number 999999
Compound Code 99
Book Reference 9
Project Code 9>
##$TILT= no
##$TM1= 0
##$TM2= 0
##$TOPLEV= 0
##$USERP1= <user>
##$USERP2= <user>
##$USERP3= <user>
##$USERP4= <user>
##$USERP5= <user>
##$WDW= 1
##$XDIM= 32768
##$YMAX_p= 573596127
##$YMIN_p= -847462
$$ End of Bruker specific parameters
$$ ---------------------------------
##NTUPLES= NMR SPECTRUM
##VAR_NAME=  FREQUENCY,     SPECTRUM/REAL,   SPECTRUM/IMAG
##SYMBOL=    X,             R,               I
##VAR_TYPE=  INDEPENDENT,   DEPENDENT,       DEPENDENT
##VAR_FORM=  AFFN,          ASDF,            ASDF
##VAR_DIM=   32768,         32768,           32768
##UNITS=     HZ,            ARBITRARY UNITS, ARBITRARY UNITS
##FACTOR=    0.157963299565203, 1,           1
##FIRST=     4132.20258663859, 0,            0
##LAST=      -1043.78085021442, 0,           0
##MIN=       -1043.78085021442, -847462,     0
##MAX=       4132.20258663859, 573596127,    0
$$ Real data points
##PAGE= N=1
##DATA TABLE= (X++(R..R)), XYDATA
$$ [...]
23130b35880J92785J9593N8763j1644P7696j8236j31134l8030O421o2579J64373
$$ -235880 -43095 -23502 35261 23617 101313 83077 -48057 -86087 -79666 -142245 22128
23119B2128q3178j68431j4860o4990q9605J95049J15054M939O9601Q9695o1203
$$ 22128 -61050 -229481 -244341 -309331 -398936 -203887 -88833 -83894 -14293 75402 14199
23108A4199j73736j29062J15894L01886J64000j47650j23553r9851r3849p6083
$$ 14199 -159537 -288599 -172705 129181 293181 145531 21978 -77873 -171722 -247805
23098b47805N3104J8698k00909J32417P0633J09984N1918j65800N8888J22821
$$ -247805 -194701 -176003 -376912 -244495 -173862 -63878 -11960 -177760 -118872 3949
23088C949J54046J06706j36002o6723n9891j90287j95843k6475J57503l8865O722
$$ 3949 157995 264701 128699 61976 2085 -188202 -384045 -410520 -253017 -291882 -285160
23077b85160O2804J58041J10586K41155J85650j24485k05472j24393N6958o8834
$$ -285160 -222356 -64315 46271 287426 473076 348591 143119 18726 75684 6850
23067F850J00119J11307O6126k450j19352L8441J99577m4727l16051J01047J95886
$$ 6850 106969 218276 284402 281952 162600 201041 400618 355891 39840 140887 336773
23056C36773l1449j93903n4117r9204j6342J18943k41863j96739Q354J24415j71211
$$ 336773 305324 111421 57304 -41900 -58242 60701 -181162 -377901 -369547 -245132 -416343
23045d16343m1884J940r7938Q1351K01292J71416j87720l13768J30652Q9275m5431
$$ -416343 -458227 -456287 -554225 -472874 -271582 -100166 -287886 -601654 -471002 -381727 -427158
23034d27158r614n429J37130J62664K80586P2829o884k39450J39916J45164k45365
$$ -427158 -436772 -442201 -305071 -142407 138179 211008 204124 -35326 104590 249754 4389
23023D389M4615j71413j15083L3769M9902q5823j40465J5295Q2843M9244P758
$$ 4389 49004 -122409 -237492 -203723 -153821 -239644 -380109 -364814 -281971 -232727 -224969
23012b24969P9877J51678K48999k19388j71772m6727j14243Q0585K18436Q6471
$$ -224969 -145092 6586 255585 36197 -135575 -182302 -296545 -215960 2476 88947
23002H8947J5849Q0470r6226j02094N7856q7053j07115j26508K5986K25408L4316
$$ 88947 104796 185266 89040 -13054 44802 -42251 -149366 -275874 -249888 -24480 9836
22991I836q1652J23751J18370O48l5699m7955J03754P0544n8356l6123m6598k24974
$$ 9836 -71816 51935 170305 170953 135254 87299 191053 261597 203241 167118 120520 -104454
22979a04454j43307j6801j65476O8788K52807m3274l7420j9206n6699P8990j54138
$$ -104454 -247761 -264562 -430038 -361250 -108443 -151717 -189137 -208343 -265042 -186052 -340190
22968c40190J27715K8462K2142J76374O6392K5862O2843L0947j5016j9146j11686
$$ -340190 -212475 -184013 -161871 14503 80895 106757 169600 200547 185531 166385 54699
22957E4699K0403J37595r2426r3906j56497j85959K7114J23638K51677K27266
$$ 54699 75102 212697 120271 26365 -130132 -316091 -288977 -165339 86338 313604
22947C13604k4309r5806j50417J1617q9086r4710O366j52276j14680J08250N1283
$$ 313604 289295 193489 43072 54689 -34397 -129107 -122741 -275017 -389697 -281447 -230164
22936b30164J85102R0854j4170j04826k3204j9937q444j19742J9523P6361N6276
$$ -230164 -45062 45792 31622 -73204 -96408 -116345 -124789 -244531 -225008 -148647 -92371
22925i2371O8110P1668J69837k3351q4992l7784j13259J47059o0191k64580n5769
$$ -92371 -24261 47407 217244 193893 108901 71117 -42142 104917 44726 -219854 -275623
22914b75623m5077J4987K01335J31762J7910j31611J09723K79345k7978j49516
$$ -275623 -320700 -305713 -104378 27384 45294 -86317 23406 302751 274773 125257
22904A25257m437r3215m7220O924R1934K6761N6945o7535j90924O966P6449M499
$$ 125257 120820 27605 -19615 -12691 79243 106004 162949 95414 -95510 -88544 -12095 -7596
22892g596L4773r9611k02190l2642q9153l32611l727L79170K73279J17692Q266
$$ -7596 27177 -72434 -274624 -307266 -396419 -729030 -732757 -353587 -80308 37384 45650
22881D5650P422k16895R600N688O2132K82027L6494k27970j15008R0290j44839
$$ 45650 53072 -163823 -154223 -148535 -86403 195624 232118 4148 -110860 -20570 -165409
22870a65409k36126L5128q2768M2579L60J98568J66113J69343M607M3443P5594
$$ -165409 -401535 -366407 -449175 -406596 -406236 -207668 -41555 127788 132395 175838 251432
22859B51432K5201q1542k6976j76893L1492J21269L8487k94032k25245k8956J52833
$$ 251432 276633 195091 168115 -8778 22714 143983 182470 -111562 -336807 -365763 -212930
22848b12930K47737N0197j07559K8314L9236o0062N8706j51700J33830K57254
$$ -212930 34807 85004 -22555 5759 44995 -15067 43639 -108061 25769 283023
22838B83023j79683p4126J45135L1005j71278o322K3803N6158m4432j31652Q2658
$$ 283023 103340 29214 174349 205354 34076 27754 51557 107715 63283 -68369 14289
22827A4289J21733p3670N9483O6099J25965q7676p2535P2303l4423L1626o7820
$$ 14289 136022 62352 121835 187934 313899 226223 153688 225991 191568 223194 155374
22816A55374k69455j47320K32518L2881j06223k9916J83630P5089l29124j91616
$$ 155374 -114081 -261401 -28883 3998 -102225 -132141 51489 126578 -202546 -394162
22806c94162J12342R1305l755L4162j53602k7297M6225l0967K21421J71644j05495
$$ -394162 -281820 -190515 -194270 -160108 -313710 -341007 -294782 -325749 -104328 67316 -38179
22795c8179k15253l42098L231K96439J53606J73547J24260p7083j09378J40532
$$ -38179 -253432 -595530 -592299 -295860 -142254 31293 155553 78470 -30908 109624
22785A09624Q8337k5916m6732r2483k38144p8141M5228N8390J34999N7305q1052
$$ 109624 197961 172045 125313 32830 -205314 -283455 -238227 -179837 -44838 12467 -68585
22774f8585j44257P4461J09211K09446j8452Q5693J21048j22869k61989q4396
$$ -68585 -212842 -138381 -29170 180276 161824 247517 368565 245696 -16293 -100689
22764a00689J3229k32549j95400K56280M6406P3402K15005L7443m5162O3534m7144
$$ -100689 -87460 -320009 -515409 -259129 -212723 -139321 75684 113127 67965 131499 84355
22753H4355j19058k4415R0357P6811q5295N4244J37094j12249R5645o6054j45140
$$ 84355 -34703 -59118 31239 108050 22755 76999 214093 101844 197489 131435 -13705
22742a3705l7917k0589j23894n6314M170L4891J29268J17253L5419j3556Q35P0656
$$ -13705 -51622 -72211 -196105 -252419 -248249 -213358 -84090 33163 68582 55026 55861 126517
22730A26517J73436j59596P6752R4919p1790p200K7301r8034J62638K6232K333
$$ 126517 299953 140357 217109 312028 240238 233038 260339 162305 324943 351175 353508
22719C53508k01017j38909P2362J03171m9346k53631o9609R3043K50588J67786
$$ 353508 152491 13582 85944 189115 139769 -113862 -183471 -90428 160160 327946
22709C27946j00853K0916k9551j21136n1519r7879j84036J01562m4058n2061j60688
$$ 327946 227093 248009 218458 97322 45803 -52076 -236112 -134550 -178608 -230669 -391357
22698c91357Q3319K52187M3888j22712N9374J00836L276J10899Q2300Q7566J56312
$$ -391357 -308038 -55851 -11963 -134675 -75301 25535 28811 139710 222010 309576 465888
22687D65888j79557j12387k23407j50387j40177K19102K64934K231J2927j5448
$$ 465888 286331 173944 -49463 -199850 -340027 -120925 144009 146240 159167 143719
22677A43719O3655P0140r634j08042j36617q5038Q9051j22745r0802m8309k4885
$$ 143719 207374 277514 267880 159838 23221 -61817 27234 -95511 -186313 -234622 -259507
22666b59507p8940J38346J54175l9982J69176j2639j438J44236J95082o333r3772
$$ -259507 -338447 -200101 -45926 -85908 83268 70629 69191 213427 408509 402176 308404
22655C08404q0115k15752j89670k6086P7224M8274K60100J08634k97576k27285
$$ 308404 228289 12537 -177133 -203219 -125995 -77721 182379 291013 -6563 -233848
22645b33848j17308l9934l092Q8515M3689J86761K19889L0224l5064J21264L0754
$$ -233848 -351156 -391090 -394182 -305667 -261978 -75217 144672 174896 139832 261096 291850
22634B91850j32906M0247O6358J6013M811O3099j11819j31601j90922q9044L3485
$$ 291850 158944 199191 265549 281562 286373 349472 237653 106052 -84870 -173914 -140429
22623a40429j3519j40629Q3844J74005J1617O8620O9060J9593j08167k064M3575
$$ -140429 -153948 -294577 -210733 -36728 -25111 43509 112569 132162 23995 21931 65506
22612F5506L0370k92j35156j77206K8647L3079M7057o9735J97144Q6076j25729
$$ 65506 95876 95584 -39572 -216778 -188131 -155052 -107995 -177730 19414 105490 -20239
22601b0239k33087k8531M8843K3471J60931m3236K4033J28424P5494m657j32349
$$ -20239 -253326 -281857 -233014 -209543 -48612 -91848 -67815 60609 136103 131446 -903
22590i03J21156k5982L7000o1454j0862P5578j29656o0732J81526K49040q9651
$$ -903 120253 94271 131271 69817 58955 134533 4877 -55855 125671 374711 285060
22579B85060k11409k58840R3775K47502K10924J06746j06157j32557k59016j40710
$$ 285060 73651 -185189 -91414 156088 367012 473758 367601 235044 -23972 -164682
22569a64682o8036J67121J1393R6861m5305j54200k19203J53210J88587p1957
$$ -164682 -232718 -65597 -54204 42657 -2648 -156848 -376051 -222841 -34254 -106211
22559a06211N2907J14257q7980P053J04338j35351k2439j72785o6913N6070j33082
$$ -106211 -53304 60953 -27027 -19974 84364 -50987 -73426 -246211 -313124 -257054 -390136
22548c90136O9472M28212K21118j58171j27957j721r6491P7222r0557p1139r703
$$ -390136 -320664 107548 328666 170495 42538 40817 -55674 21548 -69009 -140148 -149851
22537a49851K7355j1482p5915l5418J19739J03215J53042J12318j4254j16076
$$ -149851 -122496 -133978 -209893 -245311 -125572 -22357 130685 243003 228749 112673
22527A12673j78362r2277Q6982j01812m7917o8985j41713n158M4461R0605P1219
$$ 112673 -65689 -157966 -70984 -172796 -220713 -289698 -431411 -436569 -392108 -301503 -230284
22516b30284O6454q2912J67783J76014j7844p01P7083j81183r6847J3397j37624
$$ -230284 -163830 -246742 -78959 97055 79211 78510 155593 -25590 -122437 -109040 -246664
22505b46664J56084L01483M6775l5688j23955r8354P2763J12450j07891K317l6859
$$ -246664 -90580 210903 257678 221990 98035 -319 72444 184894 77003 79320 42461
22494D2461k41921J08005K7290R9386R753j58683O0134j42829N8572Q2919l8185
$$ 42461 -199460 -91455 -64165 35221 44974 -113709 -53575 -196404 -137832 -54913 -93098
22483i3098J00857P5034j98823K7823M0722O3941k33185j51474m2207J08237J35254
$$ -93098 7759 82793 -116030 -88207 -47485 16456 -216729 -368203 -410410 -302173 -166919
22472a66919M7024j26323l8288K53813M8554j48706M0186j07231l0291n7929j21982
$$ -166919 -119895 -246218 -284506 -30693 17861 -130845 -90659 -197890 -228181 -286110 -408092
22461d08092K03236O5211p7941K1531J51782J41310o1852Q0948P2805J21383o0384
$$ -408092 -204856 -139645 -217586 -196055 -44273 97037 35185 116133 188938 310321 249937
22450B49937j05989Q9901J97921j36434K8879P1755k58313j89674q1104J49446
$$ 249937 143948 233849 431770 295336 324215 395970 137657 -52017 -133121 16325
22440A6325R8570J01552k9922j45656o4198k38807j42100J02774J0249K24121
$$ 16325 114895 216447 186525 40869 -23329 -262136 -404236 -301462 -291213 -67092
22430f7092J6151k9647o107J80978K22855j17002j04789n1034n8777J20117j07597
$$ -67092 -50941 -80588 -86695 94283 317138 200136 95347 44313 -14464 105653 -1944
22419a944q9077r4129K04767n4312N0998Q9683L5666j25989Q3390j01291k90787
$$ -1944 -91021 -185150 19617 -34695 16303 105986 141652 15663 99053 -2238 -293025
22408b93025l16646R2231J41744j22813j39942n209L9360J73428L22781L1129
$$ -293025 -609671 -517440 -375696 -498509 -638451 -643660 -604300 -430872 -108091 -76962
22398g6962J23828m6683j97284r151r084J3571J38511O2206l0687j77951m2044
$$ -76962 46866 183 -197101 -206252 -215336 -201765 -63254 -1048 -31735 -209686 -251730
22387b51730J88102j8222l1303K63776P4654o5178p0935j73294k31739P3266N400
$$ -251730 -63628 -81850 -113153 150623 225277 160099 89164 -84130 -315869 -242603 -237203
22376b37203l2534K95630R5124j21728j41556M199n9845J35297M1290r5642Q6351
$$ -237203 -269737 25893 121017 -711 -142267 -138068 -197913 -62616 -21326 -116968 -30617
22365c0617J02620r5788j88412L5296j16317k2935K8749J84352R647r0340O8906
$$ -30617 72003 -23785 -212197 -176901 -293218 -316153 -287404 -103052 -93405 -183745 -114839
22354a14839M041N0723l7689r7564j24080j07304q174K23164J70740O9502j48941
$$ -114839 -110798 -60075 -97764 -195328 -319408 -426712 -434886 -211722 -40982 28520 -120421
22343a20421o777j13231k60611r1994L05647K33662J8886o9131J99928J05863
$$ -120421 -127198 -240429 -501040 -593034 -287387 -53725 -34839 -103970 95958 201821
22333B01821p5040n1447j25753O7250J31075k06138m6262M8358k14087j07312
$$ 201821 126781 75334 -50419 16831 147906 -58232 -104494 -56136 -270223 -377535
22323c77535l9900M18721K73516k02815J6108P9999J82692r5832p5890n8551n4161
$$ -377535 -417435 1286 274802 71987 88095 168094 350786 254954 179064 120513 66352
22312F6352o9895N6248j0092k39754j10650K9992p6060R5529Op3328P8282J99294
$$ 66352 -3543 52705 42613 -197141 -307791 -277799 -353859 -258330 -258324 -331652 -253370 -54076
22300e4076J82648j03585k62828o331N0939m1220P2674k4770J56818P4600k37395
$$ -54076 128572 24987 -237841 -244172 -193233 -234453 -161779 -186549 -29731 44869 -192526
22289a92526k3824O884j07292j73588Q5637K70314J48905k42215J07472J82475
$$ -192526 -216350 -209466 -316758 -490346 -404709 -134395 14510 -227705 -120233 62242
22279F2242Q1246L6364K5683l7235J22848o9129j09458M3046N4212l849j68500
$$ 62242 143488 179852 205535 168300 291148 222019 112561 155607 209819 205970 37470
22268C7470j73989n718J29957J57101K761j17423Q3360L3365j88842j28345p2311
$$ 37470 -136519 -142237 -12280 144821 147582 30159 113519 146884 -41958 -170303 -242614
22257b42614M194J19229K6504p796O1581k0810p5003o5605J60431K8548J19522
$$ -242614 -238420 -119191 -92687 -100483 -38902 -59712 -134715 -200320 -39889 -11341 108181
22246A08181p4475k6663J13004P1490j4884n9794q9676n3860M3046j03848N888
$$ 108181 33706 7043 120047 191537 176653 116859 27183 -26677 16369 -87479 -81591
22235h1591J60874p9998q8184j54519K5571J24516P9018j33161j11765J03945
$$ -81591 79283 -715 -88899 -243418 -217847 -93331 -14313 -147474 -259239 -155294
22225a55294Q6092M3230P5586J15900J15149j26235k07833O7627O7640Q5612k7322
$$ -155294 -69202 -25972 49614 165514 280663 154428 -53405 14222 81862 167474 140152
22214A40152j30938k74783n4651J94167j01178L3773L43805n954j77131r5377
$$ 140152 9214 -265569 -320220 -126053 -227231 -193458 150347 144393 -32738 -128115
22204a28115k4206J06902O743M5704N6255L9754o4939J24882J00828q3206O1012
$$ -128115 -152321 -45419 -38676 7028 63283 103037 38098 162980 263808 180602 241614
22193B41614J21504j05368k46654k30451l2257K11648K14498j52727l3791m2849
$$ 241614 363118 257750 11096 -219355 -251612 -39964 174534 21807 -11984 -54833
22183e4833j26632r9259J66992K47503M1934J456j10468J63074J59384k48285
$$ -54833 -181465 -280724 -113732 133771 175705 177161 66693 229767 389151 140866
22173A40866k28845M6978j2882N0672O9303J11107j58487k45122j2876R0240O8873
$$ 140866 -87979 -41001 -53883 -3211 66092 177199 18712 -226410 -239286 -149046 -80173
22162h0173n5744N9343J38503P9157j87772j97422k4836j6635Q4931J92097K5633
$$ -80173 -135917 -76574 61929 141086 -46686 -244108 -268944 -285579 -200648 -8551 17082
22151A7082k6263R0343m8070J33824J43726M5687k26680k01603r6694O2440J64907
$$ 17082 -9181 81162 33092 166916 310642 356329 129649 -71954 -168648 -106208 58699
22140E8699K7577l4879K1649j97044P8417o4480k30609J6212J05904Q8473R7118
$$ 58699 86276 51397 73046 -123998 -45581 -110061 -340670 -324458 -218554 -130081 -32963
22129c2963J10202l9066m706j37444J58968M3244r1967m542j42812o61M7464k8822
$$ -32963 77239 38173 33467 -103977 54991 98235 6268 1726 -141086 -141747 -94283 -123105
22117a23105K16129P5959p8204O078M5059k23618o7303J18809j15539q5544j31871
$$ -123105 93024 168983 90779 96857 141916 -81702 -149005 -30196 -145735 -231279 -363150
22106c63150J49186K96320M1616Q6205j02994j84903l4788r4942n7357J58806
$$ -363150 -213964 82356 123972 210177 107183 -77720 -112508 -207450 -264807 -106001
22096a06001l2690J27365q4237j94113R7794J9913J50450j01366N2686J03723
$$ -106001 -138691 -11326 -95563 -289676 -191882 -171969 -21519 -122885 -70199 33524
22086C3524J64467M6898K1738J32692M082j88536j50181O5721j0615k10580K9609
$$ 33524 197991 244889 266627 399319 403401 214865 64684 130405 119790 -90790 -61181
22075f1181J52195j02461j71276j36210p422L361p2732j2385M3506j74945o755
$$ -61181 91014 -11447 -182723 -318933 -326355 -322994 -395726 -408111 -364605 -539550 -546305
22064e46305J53790j00247J17671M74916P1381j71533j6852P7953j8823m2234
$$ -546305 -392515 -492762 -375091 99825 171206 -327 -17179 60774 41951 -283
22054b83j99361j67818p6885J16234K4518J58074O9445P9212j09934l2036J22189
$$ -283 -199644 -367462 -444347 -328113 -303595 -145521 -76076 3136 -106798 -138834 -16645
22043a6645K50122J5630r9533j70367p1609j38242J31694J55098k4520j45804
$$ -16645 233477 249107 149574 -20793 -92402 -230644 -98950 56148 31628 -114176
22033a14176J68830J27216p1372o3943J5007J09096J21273o7673j93374m834l6432
$$ -114176 54654 181870 110498 46555 61562 170658 291931 224258 30884 26050 -10382
22022a0382O343k5655j4366j46065J94094J5138P8302L0970l4395J19481n1841
$$ -10382 -4039 -29694 -44060 -190125 3969 19107 97409 128379 93984 213465 161624
22011A61624k09154k35422L01172J22117j93960j28398J23479K44643P9470j65248
$$ 161624 -47530 -282952 18220 140337 -53623 -182021 -58542 186101 265571 100323
22001A00323O690j05539j53257m6779O8354J26286J36932n0085M5298p4684J09539
$$ 100323 107013 1474 -151783 -198562 -130208 -3922 133010 82925 128223 53539 163078
21990A63078r7347M085m4200L7314k2038n8613j7582J81147j86172m3290p2835
$$ 163078 65731 69816 25616 62930 40892 -17721 -35303 145844 -40328 -83618 -156453
21979a56453O3496l3010m0732N0489j20211K9741n5732p0653N7082K9374P7605
$$ -156453 -92957 -125967 -166699 -116210 -236421 -206680 -262412 -333065 -275983 -246609 -169004
21968a69004J26462p7377M5376M9774m0516K1911K7231r0923O4724j0804q4908
$$ -169004 -42542 -119919 -74543 -24769 -65285 -43374 -16143 -107066 -42342 -53146 -138054
21957a38054N9125q2750J40184J7717J4126K42518J20629j26393J04467j13051
$$ -138054 -78929 -161679 -21495 -3778 10348 252866 373495 247102 351569 238518
21947B38518m3451l5214j43080k78822L2085Q8663J75138l4124p3042J28804N8376
$$ 238518 195067 159853 16773 -262049 -229964 -141301 33837 -287 -73329 55475 113851
21936A13851j83114j63145j3346J16530P4682J08183j0354n0451m0945N8642K23196
$$ 113851 -69263 -232408 -245754 -129224 -54542 53641 43287 -7164 -48109 10533 233729
21925B33729J55735j30168j81503q0842q5291r8233k8345p8678J19625K84234
$$ 233729 389464 259296 77793 -3049 -88340 -186573 -214918 -293596 -173971 110263
21915A10263O2883r4780O5114R4492m7142J990n90j45302j67127j10142l946q4699
$$ 110263 173146 78366 143480 237972 190830 192820 192230 46928 -120199 -230341 -234287 -318986
21903c18986O8752K67542K70564O6095n3907k3883q1502l7773Q323j2306l3961
$$ -318986 -250234 17308 287872 353967 300060 276177 194675 156902 165225 152919 118958
21892A18958n4478O0799K03026p863J09614r4017q8616p2504K2718K8535Q450
$$ 118958 64480 125279 328305 320442 430056 336039 247423 174919 197637 226172 234622
21881B34622q2099k45036L4143M3525k01987L289q4131M4070j9286o8679K29585
$$ 234622 152523 -92513 -58370 -14845 -216832 -213543 -297674 -253604 -272890 -341569 -111984
21870a11984K13641j37211r6430Q1980Q1504j42699o7551o6555J22033n588J27115
$$ -111984 101657 -35554 -131984 -50004 31500 -111199 -178750 -245305 -123272 -128860 -1745
21859a745r4121j36754j44016K8094J66483J90755n8695j09042j02314j4598o8905
$$ -1745 -95866 -232620 -376636 -348542 -182059 8696 -49999 -159041 -261355 -275953 -344858
21848c44858o0272R9410J26126R1540J26365j21499o1392k9642K9111p479m1731
$$ -344858 -405130 -305720 -179594 -88054 38311 -83188 -144580 -174222 -145111 -152590 -194321
21837a94321M04931n1907k7053j45409l0376j7792r293p0459J4540Q5869J37640
$$ -194321 210610 158703 131650 -13759 -44135 -61927 -71220 -141679 -127139 -41270 96370
21826I6370o16j06495j40086R1434j5059J09783K10182J8542J07467r7909r3139
$$ 96370 95754 -10741 -150827 -59393 -74452 35331 245513 264055 371522 273613 180474
21815A80474P8432k2312q2338L8733M5704O154p8889j26300k61904J73682J23015
$$ 180474 258906 236594 154256 192989 238693 244847 165958 39658 -222246 -48564 74451
21804G4451l37256q9673l3302N8248m8786j1962J97428N9019p0492k5224N0146
$$ 74451 -262805 -352478 -385780 -327532 -376318 -388280 -190852 -131833 -202325 -227549 -177403
21793a77403o3512J4717J36623J98485J36166K06880n5237k21402j03141j31629
$$ -177403 -240915 -226198 -89575 108910 245076 451956 396719 175317 72176 -59453
21783e9453j385j1416K5413j92840M2141j03239l0945J31591N6666J4220j6919
$$ -59453 -60838 -72254 -46841 -239681 -197540 -300779 -331724 -200133 -143467 -129247 -146166
21772a46166N5671O1126R8587J27673J32040L7016k62284k35981k6168R3553k4883
$$ -146166 -90495 -29369 69218 196891 328931 365947 103663 -132318 -158486 -64933 -89816
21761h9816K96772L1897K9507r4454j97963j11184o1580j8486q0795j02088J34881
$$ -89816 206956 238853 268360 173906 -24057 -135241 -196821 -215307 -296102 -398190 -263309
21750b63309J41797K12970j3406J7615K5022j09504M8178J4408k1423K1295O03
$$ -263309 -121512 91458 78052 95667 120689 11185 59363 73771 52348 73643 74246
21739G4246J38915q2255o491o8802N5168m0757j0614r7638j68200o7399R4492
$$ 74246 213161 130906 124415 55613 110781 70024 59410 -38228 -206428 -273827 -179335
21728a79335J31928K175J35682n141l8809j26809J2373j7134K4301k7521J15923
$$ -179335 -47407 -45232 90450 85309 46500 -80309 -67936 -85070 -60769 -88290 27633
21717B7633J68381p7502Q1863M7017q9655k81151J11560K26481J13563k87856
$$ 27633 196014 118512 200375 247392 157737 -123414 -11854 214627 328190 40334
21707D0334k11033N5645j6010O0823J10390k7675j6923K7091J60782m0052q4047
$$ 40334 -170699 -115054 -131064 -70241 40149 12474 -4449 22642 183424 143372 59325
21696E9325l4199J08600J01940N5275N5805l6804l30656k00247N0420L0401P4339
$$ 59325 25126 133726 235666 290941 346746 309942 -20714 -220961 -170541 -140140 -65801
21685f5801j14701J1815J00418J11655P3285M4106k693k87448q23K07010J07644
$$ -65801 -180502 -168687 -68269 43386 116671 160777 158084 -129364 -130187 76823 184467
21674A84467j36565m2639r4526j03189l1613K23228j443j26332K22946K14017
$$ 184467 47902 5263 -89263 -192452 -224065 -837 -2280 -128612 94334 308351
21664C08351j50101j44343K4681R7848M1507J50518N5068j46983r4586k5559P6957
$$ 308351 158250 13907 38588 136436 177943 328461 383529 236546 141960 116401 193358
21653A93358K854R6406j1724j61494L0755P7421n8273j19926J3400K22940J17621
$$ 193358 196212 292618 280894 119400 150155 227576 169303 49377 62777 285717 403338
21642D03338k3008p1016J8730j10600j96587m8794J08150l9279j38685O2704J88634
$$ 403338 380330 309314 328044 217444 20857 -27937 80213 40934 -97751 -35047 153587
21631A53587J18527J0452o191L2240p7954J4461J06189k80671J47043J50408p7938
$$ 153587 272114 282566 276375 308615 230661 245122 351311 70640 217683 368091 290153
21620B90153j98422j29161j86160K8774K92954l5313o0521M7720O4829Q9444J89241
$$ 290153 91731 -37430 -223590 -194816 98138 62825 2304 50024 114853 204297 393538
21609C93538K34215q3k47539L0847k0626k00267j31257m4778O0060J60949M4376
$$ 393538 627753 627670 380131 410978 390352 190085 58828 14050 74110 235059 279435
21598B79435j66543k0990J59270J20404j5134M2626j92453j77308r4928J4323
$$ 279435 112892 91902 251172 371576 356442 399068 206615 29307 -65621 -51298
21588e1298r7897l1215Q7832O2817J40288n6071j12199j7876m6517J6606J3849
$$ -51298 -149195 -180410 -92578 -29761 110527 54456 -57743 -75619 -122136 -105530 -91681
21577i1681J00030n3751j6765l6727K09951J94813N2755r1025j34325J04582Q1311
$$ -91681 8349 -45402 -62167 -98894 111057 305870 358625 267600 133275 237857 319168
21566C19168j08215m0405K1643O1541j16139n9578j51424M0643J74569k03079
$$ 319168 210953 170548 192191 253732 137593 78015 -73409 -32766 141803 -61276
21556f1276o2688K7929J70152K18286J19823j01357j57821k37510J5126N3404
$$ -61276 -123964 -96035 74117 292403 412226 310869 153048 -84462 -69336 -15932
21546a5932p1696J83186J63628J27995o5923k41327j79434P1367P679j30625M5122
$$ -15932 -87628 95558 259186 387181 321258 79931 -99503 -28136 -20457 -151082 -105960
21535a05960K96704l5493l21071P1744L6851j76623j19091O9920J97548K88421
$$ -105960 190744 155251 -165820 -94076 -57225 -233848 -352939 -283019 -85471 202950
21525B02950l7263o3406q2542l22791q280J56321L2121j6435J28p1236K5522J03799
$$ 202950 165687 102281 19739 -303052 -311332 -155011 -122890 -139325 -139197 -210433 -184911 -81112
21513h1112M6922k8166O455P2665M3559p3958m295J09099Q8425j27682m019j45801
$$ -81112 -34190 -62356 -55901 16764 60323 -13635 -17930 91169 179594 51912 47893 -97908
21501i7908j10581J07933N1294P428R844N8071J21520J26425k43214m4709K49960
$$ -97908 -208489 -100556 -49262 -41834 -31990 26081 147601 274026 30812 -13897 236063
21490B36063j19767r3915r0700Q9665J46739J51549p6833l4030J91791J14134
$$ 236063 116296 22381 -68319 21346 168085 319634 242801 208771 400562 514696
21480E14696j14542p2970k64137j44974M9842J43323J98338j22608j61375J10603
$$ 514696 400154 327184 63047 -81927 -32085 111238 309576 186968 25593 136196
21470A36196K3936j20552J92834K2676q6137l016K32824k18594P1639J39514q628
$$ 136196 160132 39580 232414 255090 168953 165937 398761 180167 251806 391320 382692
21459C82692Q3288L4050j17919R8160j64317j14609j12008L0184R0804L2721j52789
$$ 382692 465980 500030 382111 480271 315954 201345 89337 119521 210325 243046 90257
21448I0257j00054J12513Q4339j62636k95824l6773q071K23980J84487j50013
$$ 90257 -9797 102716 187055 24419 -271405 -308178 -316249 -92269 92218 -57795
21438e7795m573j09275O0395J80511M8673j89188k08900J96855J88535k6761j21803
$$ -57795 -62368 -171643 -111248 69263 117936 -71252 -280152 -83297 105238 78477 -43326
21427d3326J91364O3051k38892q2774l1586l4733j3697j0503k3630n6629J02534
$$ -43326 148038 211089 -27803 -110577 -142163 -176896 -190593 -201096 -224726 -281355 -178821
21416a78821K07626K71242O1458l6562P7059j72957n5435k88174K1268J21894
$$ -178821 28805 300047 361505 324943 402002 229045 173610 -114564 -93296 28598
21406B8598p2272k24026J17921j04355j07305m8259k1303J36912J07163J4374
$$ 28598 -43674 -267700 -149779 -254134 -361439 -409698 -431001 -294089 -186926 -172552
21396a72552R8401M5732l1323L2752M238j94084j8857N2773K4693J95514n4714
$$ -172552 -74151 -28419 -59742 -26990 -22752 -216836 -235693 -182920 -158227 37287 -17427
21385a7427j00552J51371J5564j39835N7830J43223j19986o9799J87876l6773
$$ -17427 -117979 33392 48956 -90879 -33049 110174 -9812 -79611 108265 71492
21375G1492j42346J3526j0559n3994M695L1187N5652n1671N2725J14000L5217
$$ 71492 -70854 -57328 -67887 -121881 -117186 -85999 -30347 -82018 -29293 84707 119924
21364A19924Q556j28520j02551n407N8060J79827n6449k25453r9983J04311J86607
$$ 119924 128480 -40 -102591 -107998 -49938 129889 73440 -152013 -251996 -147685 38922
21353C8922O6105J31243j65041k00250p828O3525R5801j6537q2609p8026R2652
$$ 38922 105027 236270 71229 -129021 -136849 -73324 22477 5940 -76669 -154695 -62043
21342f2043n5784j26903P2378L3671J56389K08270j5727m3173J1689O5059J54219
$$ -62043 -117827 -244730 -172352 -138681 17708 225978 210251 167078 178767 243826 398045
21331C98045j95830o6957J03634r230M0972R0481P177j9255J53024j0689j97573
$$ 398045 202215 135258 238892 229662 270634 361115 368292 349037 502061 491372 293799
21320B93799O2973R1923k12263j1461j19587r7329l2109m9965K03460J41280j29336
$$ 293799 356772 448695 236432 224971 105384 8055 -24054 -74019 129441 270721 141385
21309A41385k05911M5303Q3107k166p7020R3450k9687r53n6742j04653r630J20752
$$ 141385 -64526 -19223 63884 61718 -15302 78148 48461 47508 -9234 -113887 -123517 -2765
21297b765M8981K03635R7292j01331j41776J1766O5129j98727j42771j37282K9848
$$ -2765 46216 249851 347143 245812 104036 115802 180931 -17796 -160567 -297849 -268001
21286b68001N532j2811N8851J04633k1146L9433q9790k51514J77739J96155n7359
$$ -268001 -262469 -275280 -216429 -111796 -132942 -93509 -183299 -434813 -257074 -60919 -118278
21275a18278J53060J65609r6346K5539J14522M4436L0174j83408k807k5948o9868
$$ -118278 34782 200391 104045 129584 244106 288542 318716 135308 132501 106553 36685
21264C6685q2886K16777K9181o0250o3626o3792R766m3020O2360m220P0758J59784
$$ 36685 -46201 170576 199757 139507 75881 12089 21855 -21165 41195 36975 107733 267517
21252B67517O1779J32473L82758L55973J62850K44201O6870n7930l06943k48648
$$ 267517 329296 461769 844527 1200500 1363350 1607551 1674421 1616491 1309548 1060900
21242A060900j78482k24187k86385l8005L8976J24987O4922J4715J09825n1571
$$ 1060900 882418 658231 371846 333841 372817 497804 562726 577441 687266 635695
21232F35695j65779O3328O4393L6674k08971j40587r1129p2469j11942L5332M0379
$$ 635695 469916 533244 597637 634311 425340 284753 193624 121155 9213 44545 84924
21221H4924l9017m7197l8440r012K18311j40382j04380Q1657R1964m0734j18119
$$ 84924 45907 -1290 -39730 -48742 169569 29187 -75193 6464 98428 57694 -60425
21210f0425l7176Q9122J81066j78209j20749L02693J34462j63364k57046J05884
$$ -60425 -97601 -8479 172587 -5622 -126371 176322 310784 147420 -109626 -3742
21200c742K11886L7986j72231j65117J17327M6228L9242k17943r6213l3509J85945
$$ -3742 208144 246130 73899 -91218 26109 72337 111579 -106364 -202577 -236086 -50141
21189e0141J06062J92801Q8420P2858O6041j98235p4121p9246K0141j30945k16207
$$ -50141 55921 248722 337142 410000 476041 277806 203685 124439 144580 13635 -202572
21178b02572N7212Q0764j36765J4543k529p6797N2658P3447k42119j64947P3178
$$ -202572 -145360 -64596 -201361 -186818 -189347 -266144 -213486 -140039 -382158 -547105 -473927
21167d73927J91691L88462l86k7034K3413J06788o0571k78721r4066J92966J90897
$$ -473927 -282236 106226 105840 78806 102219 209007 148436 -130285 -224351 -31385 159512
21156A59512m7753J07116K04389n7638q1703l9964n3545q4614k55165k16096K4325
$$ 159512 111759 218875 423264 365626 283923 243959 190414 105800 -149365 -365461 -341136
21145c41136K85116J98073j01333j2824K5127P9480r7590j1007q5255j91458k0661
$$ -341136 -56020 142053 40720 27896 53023 132503 34913 23906 -61349 -252807 -273468
21134b73468K8523O8026K39063P646r5779J7737k3180k62324R5321N6938J09884
$$ -273468 -244945 -176919 62144 69790 -25989 -8252 -31432 -293756 -198435 -141497 -31613
21123c1613M5304J2808l4590m205K3145O1243o949n4245k8424L5487j16932J1484
$$ -31613 13691 26499 -8091 -12296 10849 72092 65143 10898 -17526 17961 -98971 -87487
21111h7487J41744Q5909n9807j50173J03229K6429j17460J60503o8893k6133o1951
$$ -87487 54257 140166 80359 -69814 33415 59844 -57616 102887 33994 7861 -54090
21100e4090m7778k0517j44673j9710M9790J35350l601N9130R3559J50972k1661
$$ -54090 -101868 -122385 -267058 -286768 -236978 -101628 -105229 -46099 47460 198432 176771
21089A76771l6788j70836m3583m5031K0376L9257L4212p3781m6717m0833J10603
$$ 176771 139983 -30853 -74436 -119467 -99091 -59834 -25622 -99403 -146120 -186953 -76350
21078g6350O1538J72083R1404q4400R2009N1450j21937Q438q0655k205j40413
$$ -76350 -14812 157271 248675 164275 256284 307734 185797 194235 113580 111375 -29038
21067b9038M5326Q6642J50024J91151l26762l71548R5574K97163K54620j87590
$$ -29038 16288 102930 252954 444105 117343 -254205 -158631 138532 393152 205562
21057B05562l53767N9153L00497P1468o0639l2126Q5858l7356r6270l8114j9015
$$ 205562 -148205 -89052 211445 282913 222274 190148 276006 238650 142380 104266 85251
21046H5251L1469J78064k14282k73435K7824K22233J05674j41164j31345P245
$$ 85251 116720 294784 80502 -192933 -165109 57124 162798 21634 -109711 -102466
21036a02466j82905M5558M4862j902L7767Q7410p2374k154l8999P0937J15408
$$ -102466 -285371 -239813 -194951 -196853 -159086 -71676 -144050 -146204 -185203 -114266 1142
21025A142L55758K63086K16038n3941k94892k60254q7136r4946r2614J05152K659
$$ 1142 356900 619986 836024 782083 487191 226937 139801 44855 -47759 57393 60052
21014F0052j66663n5827N4294J16842l8025Q6070R9833r0750o7825M863o7890
$$ 60052 -106611 -162438 -108144 8698 -29327 56743 156576 65826 -1999 2864 -65026
21003f5026K0551j92264L245M635J30669o1267K51329J62033j70875q1829J7909
$$ -65026 -44475 -236739 -233494 -228859 -98190 -159457 91872 253905 83030 1201 19110
20992A9110m8026k41421j11856N9513J06191j28892q3407L7261K97845K84636
$$ 19110 -28916 -270337 -382193 -322680 -216489 -345381 -428788 -391527 -93682 190954
20982A90954J04866O8676o6664j43882j03031J58198J30167L1908O8102p1937
$$ 190954 295820 364496 297832 153950 50919 209117 339284 371192 439294 367357
20972C67357k364j63499l26159m2948K09319J12700J50883m2414l00865k3937
$$ 367357 364993 201494 -124665 -167613 41706 154406 305289 262875 -37990 -61927
20962f1927J54032M4062P2163j61250j16980k31202L1765K72149J20518j57573
$$ -61927 92105 136167 208330 47080 -69900 -301102 -269337 2812 123330 -34243
20952c4243j25991L8226o7069N2749J40960j15251K5822l6850m4811J79657N2131
$$ -34243 -160234 -122008 -189077 -136328 4632 -110619 -84797 -121647 -166458 13199 65330
20941F5330j69816l9084N8212k8957p2208Q5993j16110j36200l4680M2723O0400
$$ 65330 -104486 -143570 -85358 -114315 -186523 -100530 -216640 -352840 -387520 -344797 -284397
20930b84397J04485L4211l7203J38562J74064k2264j68738j41571o2077j9242
$$ -284397 -179912 -145701 -182904 -44342 129722 107458 -61280 -202851 -264928 -284170
20920b84170J90084J28945o692j17612l5578K82849L37139R5596r484M8739K6647
$$ -284170 -94086 34859 28167 -89445 -125023 157826 494965 590561 581077 629816 656463
20909F56463j47072j26180j4685o887k1209m6819o4653j54975N0689q3061r487
$$ 656463 509391 383211 368526 361639 340430 293611 228958 73983 124672 41611 32124
20898C2124j49537q2926o8985K82289J98149n2852q2207k05725K6749K6410j44637
$$ 32124 -117413 -200339 -269324 12965 211114 158262 76055 -129670 -102921 -76511 -221148
20887b21148k1515p9235N8931R1698n1210j81654r1761J31403K11079P4097o0237
$$ -221148 -242663 -321898 -262967 -171269 -222479 -404133 -495894 -364491 -153412 -79315 -139552
20876a39552R7018k3495J4429O2704j71500k1657P2774N4356n3989J14947L9740
$$ -139552 -42534 -66029 -51600 11104 -160396 -182053 -109279 -54923 -108912 6035 45775
20865D5775j60600j55656R863J47317J19045Q8870J56721j02580l00683k675L9152
$$ 45775 -114825 -270481 -260618 -113301 5744 94614 251335 148755 -151928 -154603 -115451
20854a15451P2956J00908J43984p4296j17451P8016M4308J17863m6054k165J3126
$$ -115451 -42495 58413 202397 128101 10650 88666 132974 250837 204783 202618 215744
20843B15744K0849j45988J38536l1951j31583k0735M1635o8744O2081J01225p4828
$$ 215744 236593 90605 229141 197190 65607 44872 86507 17763 79844 181069 106241
20832A06241J5302m4203n9580J42967k05858j68459l18100J05415j3619O7244
$$ 106241 121543 77340 17760 160727 -45131 -213590 -531690 -426275 -439894 -372650
20822c72650j5209J46396K71789L2533r4961J76281j38933j30221q055K498J35823
$$ -372650 -387859 -241463 30326 62859 -32102 144179 5246 -124975 -133030 -130532 5291
20811E291K2156j3072J48198Q604j42608r024Q2112J03349j0464j82227M6322
$$ 5291 27447 14375 162573 171177 28569 19545 101657 205006 194542 12315 58637
20800E8637L0014j32985O5402n5559L0029j3586M0044k3649k7605Q2464Q4764
$$ 58637 88651 -44334 21068 -34491 -4462 -18048 21996 -1653 -29258 53206 137970
20789A37970j2334o902R184j57703k4616O8068L2715J49789L4248M8143j32120
$$ 137970 125636 118734 127918 -29785 -54401 13667 46382 196171 230419 278562 146442
20778A46442j45540J66956k1891K39434J45769J2018q7407j00937o5018p080j7460
$$ 146442 902 167858 145967 385401 531170 543188 455781 354844 289826 282746 265286
20767B65286j26663j21027M4258J77643n6772p4208k7082n1326L5176K1889J76978
$$ 265286 138623 17596 61854 239497 182725 108517 81435 30109 65285 87174 264152
20756B64152J39317p4499j19382O0560P7019p5384k65k3086P137j42214J10999
$$ 264152 403469 328970 209588 270148 347167 271783 271518 248432 255569 113355 224354
20745B24354J54708J7511m951Q0861o3766K1652k0290J7242j14491J05810r9312
$$ 224354 379062 396573 391622 472483 408717 430369 410079 427321 312830 418640 319328
20734C19328J4968K7217m2625r8662k39187p4051J17688J3453M7011J39126R6668
$$ 319328 334296 361513 318888 220226 -18961 -93012 24676 38129 85140 224266 320934
20723C20934j1226J54237J54722l2121k06131o6237L1623k30116Q8061J92984
$$ 320934 309708 463945 618667 586546 380415 314178 345801 115685 203746 396730
20713C96730L62130J69060l1012k02638j83979q9129k27352J6558J88515Q8059
$$ 396730 758860 927920 896908 694270 510291 421162 193810 210368 398883 486942
20703D86942m7989p0506n9521K59643j35554j09348j61265j38034Q5399K30441
$$ 486942 438953 368447 308926 568569 433015 323667 162402 24368 109767 340208
20693C40208R7195J04508K2607L9745m2860j08499J68060K7759j04944p2386j38067
$$ 340208 437403 541911 564518 604263 561403 452904 620964 648723 543779 471393 333326
20682C33326J49899K3573L2064J02436J38726k52958j85080Q0042K63964j8211
$$ 333326 483225 506798 538862 641298 780024 527066 341986 422028 685992 667781
20672F67781n8073o5364L4614P8342M6660O3530k02932j09706J7701p505J45166
$$ 667781 609708 544344 578958 657300 703960 767490 564558 454852 472553 465048 610214
20661F10214K14870K5241j07502k33144Q8005j9708N5206J16697N460P1925O0114
$$ 610214 825084 850325 742823 509679 597684 577976 633182 749879 755339 827264 887378
20650H87378L571J32647K11011P5247K8381k9532r5765J07495K25628j1422N0979
$$ 887378 890949 1023596 1234607 1309854 1338235 1308703 1212938 1320433 1546061 1534639 1585618
20639A585618o9927M3452k0908K35560L63673l0390K97436M89230O03076K81413
$$ 1585618 1515691 1559143 1538235 1773795 2137468 2107078 2404514 2893744 3496820 3778233
20629C778233L5221l9153j0636J66894N99018P04366R04728N69251j21862p48781
$$ 3778233 3813454 3774301 3763665 3930559 4529577 5233943 6138671 6707922 6586060 5837279
20619E837279o97763o00728l88155j39541J12137J02586j162N6861K52891J84432
$$ 5837279 5139516 4538788 4150633 4011092 4123229 4225815 4224653 4281514 4534405 4718837
20609D718837J93955L83078N82106N49066N74387P13754J024056R46073Q50131
$$ 4718837 4912792 5295870 5877976 6427042 7001429 7715183 8739239 9685312 10535443
20600A0535443J046475J412148J686282J934135K718225L267624L934431M994778
$$ 10535443 11581918 12994066 14680348 16614483 19332708 22600332 26534763 31529541
20592C1529541O729490R242033J3303105J8839519K7892831M1807097N9758566
$$ 31529541 38259031 47501064 60804169 79643688 107536519 149343616 209102182
20585B09102182P6459310P6929558L9959921k6801939p4878345q0338566o1625601
$$ 209102182 285561492 362491050 402450971 375649032 300770687 220432121 158806520
20578A58806520m2016373k8232108j9320301j4105287j0671666p861610n666359
$$ 158806520 116790147 88558039 69237738 55132451 44460785 36599175 30932816
20571C0932816m460812l687748l149662k704650k005002j516265j409504j113441
$$ 30932816 26472004 22784256 19634594 16929944 14924942 13408677 11999173 10885732
20563A0885732q49539r03881r03772q75665n10630l21892l33140m77536m20602
$$ 10885732 10036193 9132312 8228540 7352875 6842245 6520353 6187213 5709677 5289075
20554E289075l06740l01285k85409j35509P1839J89670L71374L90394O00940P56925
$$ 5289075 4982335 4681050 4395641 4260132 4331971 4521641 4893015 5283409 5884349 6641274
20544F641274K96634l18207q53319q79417q00545n65394l83617j66882L61928
$$ 6641274 6937908 6619701 5766382 4886965 4086420 3521026 3137409 2970527 3332455
20535C332455K03749J01313l33432n42574m02934l27131j31181r1055j54983l78703
$$ 3332455 3536204 3637517 3304085 2761511 2358577 2031446 1900265 1809210 1654227 1275524
20525A275524o1690n8752j50710k27568J02187J30347r5329p0420N9480K50963
$$ 1275524 1213834 1155082 1004372 776804 878991 1009338 914009 843589 903069 1154032
20515A154032P8681k72196j42302n515O4108J2386J24580q067l9127j43652m3332
$$ 1154032 1232713 960517 818215 812700 876808 889194 1013774 1005707 966580 822928 779596
20504G79596P8251j2155P4989k5548q2780n0459j72563j00268k03526K31932J20725
$$ 779596 857847 845692 920681 895133 812353 761894 589331 489063 285537 517469 638194
20493F38194o679m51495j85449N9873J03163J83506J0310j19121K35459M1710
$$ 638194 631515 180020 -5429 54444 157607 341113 351423 232302 467761 509471
20483E09471k53599r1219Q1190j25867M9482J16667j50984Q2297R606r3401p9003
$$ 509471 255872 164653 245843 119976 169458 286125 135141 217438 227044 133643 54640
20472E4640L8060R396j03910o9469P4759L8184j6966J50521R1697O0625P4665
$$ 54640 92700 102096 -1814 -71283 3476 41660 24694 175215 266912 327537 402202
20461D02202k2027p0778P8402O1599k54914k5353J4322o1909q9745j66158J8720
$$ 402202 380175 309397 387799 449398 194484 169131 183453 121544 31799 -134359 -115639
20450a15639K95524J28339j58296N7720J9421j9775m4586O5864j61721j66954
$$ -115639 179885 308224 149928 207648 227069 207294 162708 228572 66851 -100103
20440a00103p1142K2659K47170J20313j503J0439j71078k66393k2882J91652P2014
$$ -100103 -171245 -148586 98584 218897 217394 227833 56755 -209638 -232520 -40868 31146
20429C1146m1431j91225l09189O3785J51005j13444o2424R3374L63222J15431
$$ 31146 -10285 -201510 -510699 -446914 -295909 -409353 -471777 -378403 -15181 100250
20419A00250l3053j70360m9821L8353j39248k2221O0446p1900J85374P3468M2999
$$ 100250 67197 -103163 -152984 -114631 -253879 -276100 -215654 -287554 -102180 -28712 14287
20408A4287J92982K09308j70761p8241k7547N3067m190p2053j26303J37863l8513
$$ 14287 207269 416577 245816 167575 140028 193095 188905 116852 -9451 128412 89899
20397H9899k5072j32790r6394m1391J74317J86471L19535J48173p7485l34470
$$ 89899 64827 -67963 -164357 -205748 -31431 155040 474575 622748 545263 210793
20387B10793j35596J20416K09407L1850q5983n0883J37792J45515M7466L7735
$$ 210793 75197 195613 405020 436870 350887 300004 437796 583311 630777 668512
20377F68512p9037j91852k33721j28029k1594J48491K01416P1071k12218j96259
$$ 668512 589475 397623 163902 35873 14279 162770 364186 435257 223039 26780
20367B6780M4009j5244j01746J20158Q1162R02J0288Q7448J57996J9134j63413
$$ 26780 70789 55545 -46201 73957 155119 156021 166309 253757 411753 430887 267474
20356B67474P1694N6768j97388p9940Q9523j55341P9189O7364j62950k6628N1033
$$ 267474 339168 395936 198548 118608 208131 52790 131979 199343 36393 9765 60798
20345F0798N2547P3733j18131K7866q65n8611j02248j10341m5016n7283M830O6227
$$ 60798 113345 187078 68947 96813 95948 37337 -64911 -175252 -220268 -277551 -272721 -206494
20333b06494j531L8947J93223J3199j61507k64003J29436L69413J05414K03463
$$ -206494 -208025 -169078 24145 37344 -124163 -388166 -258730 110683 216097 419560
20323D19560n0813k60840J3926J11838L8837m3508j33072J3920J69609l2295n0471
$$ 419560 368747 107907 121833 233671 272508 229000 95928 109848 279457 247162 196691
20312A96691j77006m8527P1349N0472L8320m1863j60331L183j59548j60685P6184
$$ 196691 19685 -28842 42507 92979 131299 89436 -70895 -67712 -227260 -387945 -311761
20301c11761J98512J10214M6053J23392R0813Q708j32667J50715o3270r1557L4421
$$ -311761 -113249 -3035 43018 166410 257223 265931 133264 283979 220709 129152 163573
20290A63573o8692j91807J3896J34886j7024m1446M4573k8163m9144j5114k9453
$$ 163573 94881 -96926 -83030 51856 34832 -6614 37959 9796 -39348 -54462 -83915
20279h3915n767k2118r9270j2297Q892r9964J40038J33332P5424Q0744q791j91925
$$ -83915 -89682 -111800 -211070 -223367 -214475 -314439 -174401 -41069 34355 115099 106308 -85617
20267h5617M4615M7666N8395P1570j53815p4845Q8556M8882j36971n7212J72746
$$ -85617 -41002 6664 65059 136629 -17186 -92031 -3475 45407 -91564 -148776 23970
20256B3970m2397j20003J10195J26310R8129J51256R860r7334m9921J59800j91553
$$ 23970 -18427 -138430 -28235 98075 196204 347460 357320 259986 210065 369865 178312
20245A78312j87825N0846l7598J637k891L062j33474O7639m7445j06604j33884
$$ 178312 -9513 41333 3735 5372 2481 5543 -127931 -60292 -107737 -214341 -348225
20234c48225J34334Q6148J55412j38986j79526n1025J0309M4001J31373r6730
$$ -348225 -213891 -127743 27669 -111317 -290843 -341868 -331559 -287558 -156185 -252915
20224b52915L9049J4974K7399j3048l7050o4189K5095j9028P8125J35079Q6808
$$ -252915 -213866 -198892 -171493 -184541 -221591 -285780 -260685 -279713 -201588 -66509 20299
20213B0299o4517q604M3639J18977J00833q4543j18439l7800R1686K6112q6027
$$ 20299 -44218 -52822 -9183 109794 210627 126084 7645 -30155 61531 87643 1616
20202A616M3797O615J0362P1153j17930p0548l3323l7476J77464J86095p0082
$$ 1616 45413 52028 62390 133543 15613 -54935 -88258 -125734 51730 237825 167743
20191A67743Q6822l3325k89785j12548J74107Q7687n6664j3693j03820J21960
$$ 167743 254565 221240 -68545 -181093 -6986 80701 24037 10344 -93476 28484
20181B8484k2710k48162j62161r9019K95953K75164l1320R9532k27280M268J35125
$$ 28484 5774 -242388 -404549 -503568 -207615 67549 36229 135761 -91519 -87251 47874
20170D7874j8391q4350Q334j3356j8972j706K3190L3307o2749r6665L9162o9470
$$ 47874 29483 -54867 -46533 -59889 -78861 -80567 -57377 -24070 -86819 -183484 -144322 -213792
20158b13792k7937K54075K34893p7562r4116p2212J36912k3674q689k9679j66540
$$ -213792 -241729 12346 247239 169677 75561 3349 140261 116587 107898 78219 -88321
20147h8321J75472K70036m1339k28226k44907Q2493j405n0688J00667N6185n6993
$$ -88321 87151 357187 315848 87622 -157285 -74792 -76197 -126885 -26218 29967 -27026
20136b7026L7965j34479j45566N4804l921K37774J01393L3990q659j82666j33353
$$ -27026 10939 -123540 -269106 -214302 -218223 19551 120944 154934 146275 -36391 -169744
20125a69744o3392p2899J90561J25309k06935j86894K6880J12408R5434j45003
$$ -169744 -233136 -306035 -115474 9835 -197100 -383994 -357114 -244706 -149272 -294275
20115b94275J9347L87071O1125p2655M4382j00008j40535r8693j52384k4339N5902
$$ -294275 -274928 112143 173268 100613 144995 44987 -95548 -194241 -346625 -370964 -315062
20104c15062J03779M051N6107P6871J86849j05147j18032j00444k69588q0832
$$ -315062 -211283 -207232 -151125 -74254 112595 7448 -110584 -211028 -480616 -561448
20094e61448j34246j8962J40019O9202n8542K41402J32403J55924K1638j13115
$$ -561448 -695694 -714656 -574637 -505435 -563977 -322575 -190172 -34248 -12610 -125725
20084a25725J3716J00599n5787M7798J33248j96935j39915K6532M4902J0098q310
$$ -125725 -112009 -11410 -67197 -19399 113849 -83086 -223001 -196469 -151567 -141469 -149779
20073a49779J43941K5610J17766J91049J36333O2775j26844j23953j2263o5395
$$ -149779 -5838 19772 137538 328587 464920 527695 400851 276898 264635 199240
20063A99240k29192j67500O3288J98478j07857j31572P0892K03307J48429j6874
$$ 199240 -29952 -197452 -134164 64314 -43543 -175115 -104223 99084 247513 230639
20053B30639j72659o8411J78384J14236k53113l24608M2282J67440Q1382J58284
$$ 230639 57980 -10431 167953 282189 29076 -295532 -253250 -85810 -4428 153856
20043A53856J2674l9236j80523j11342J03575q6174L521Q1668k52553l8783J14349
$$ 153856 166530 127294 -53229 -164571 -60996 -147170 -143649 -61981 -314534 -353317 -238968
20032b38968K04530L618L5016J6109O5532r3900o4819J21528K11557j17888k1872
$$ -238968 -34438 -30820 4196 20305 85837 -8063 -72882 48646 260203 142315 120443
20021A20443K0331p9527K7017L0496o4986j73165O3143q7961N3005j2643l5192
$$ 120443 140774 61247 88264 118760 53774 -119391 -56248 -144209 -91204 -103847 -139039
20010a39039O2486O0113l4884j59374J69419K43625M2100q1880j0965j26650K44078
$$ -139039 -76553 -16440 -51324 -210698 -41279 202346 244446 162566 151601 24951 269029
19999B69029m0661k45921n8891j42753N4361L39344J27310j75688j9801J62159
$$ 269029 228368 -17553 -76444 -219197 -164836 174508 301818 126130 106329 268488
19989B68488J33427J9903j06059k34564k3207P0769L3721Q095l55364m6417J65431
$$ 268488 401915 421818 315759 81195 57988 128757 162478 170573 -184791 -231208 -65777
19978f5777q0898l8637J32319J7393P9344O7775k4531J4248j13082j22762N0747
$$ -65777 -146675 -185312 -52993 -35600 43744 111519 86988 101236 -11846 -134608 -83861
19967h3861O8421M3427j10584j11073m1850p4338L2150l6027J13594K08128k978
$$ -83861 -15440 27987 -82597 -193670 -235520 -309858 -277708 -313735 -200141 7987 5009
19956E009O1919k76693j19544L4640K06317J53476m1698J068j91813j91418P172
$$ 5009 66928 -209765 -329309 -294669 -88352 65124 23426 24494 -167319 -358737 -351565
19945c51565J78946Q1775j7742p5337q2967Q450m8362L01468J0964n2966j42713
$$ -351565 -172619 -90844 -108586 -183923 -266890 -258440 -306802 -5334 5630 -47336 -190049
19934a90049j42950j8653M784K91223J41232k50329L8418j10891K59738K06433
$$ -190049 -332999 -351652 -346868 -55645 85587 -164742 -126324 -237215 22523 228956
19924B28956K4244k00335j1817J6545K55117J79525K72662N87442N51711M67945
$$ 228956 253200 52865 41048 57593 312710 492235 764897 1352339 1904050 2371995
19914B371995R6767k47799k51870k27931n57130l29720o0504k07419k28490k80685
$$ 2371995 2468762 2220963 1969093 1741162 1184032 854312 793808 586389 357899 77214
19904G7214J9191Q3241k1864M1618k2275j28248K20966l329K0074q2619l87061
$$ 77214 96405 179646 157782 199400 177125 48877 269843 266514 286588 203969 -183092
19893a83092j75231J33974J33261J95108l2315N158K18439j28387p7206j23583
$$ -183092 -358323 -224349 -91088 104020 71705 76863 295302 166915 89709 -33874
19883c3874j11193P0946k4808N3293N4678n4680j13227k59995k6798K3349K11642
$$ -33874 -145067 -74121 -98929 -45636 9042 -45638 -158865 -418860 -445658 -422309 -210667
19872b10667l0887k6988K66705m4794R8638o8604m5964J48722o798o8604J09053
$$ -210667 -241554 -268542 -1837 -46631 52007 -16597 -62561 86161 79363 10759 119812
19861A19812n2295l6772L5249m7954Q6037j5303k34378J29636L6876J82483M5213
$$ 119812 67517 30745 65994 18040 104077 88774 -145604 -15968 20908 203391 248604
19850B48604L6606q8075k81551j10986J44671l2648M8279L0649N9278R187J06638
$$ 248604 285210 197135 -84416 -195402 -50731 -83379 -35100 -4451 54827 64014 170652
19839A70652Q4467k2877j30923j2290j05207N0204J2911k7369J04800N1419j8511
$$ 170652 255119 232242 101319 89029 -16178 34026 46937 19568 124368 175787 157276
19828A57276j36116L2780J72569j34996j85997n9006k44397j31987L07675J8951
$$ 157276 21160 53940 226509 91513 -94484 -153490 -397887 -529874 -222199 -203248
19818b03248j21054K4070N7684Q5637J18174o7409k24408K7321J04213K65811
$$ -203248 -324302 -300232 -242548 -156911 -38737 -106146 -330554 -303233 -199020 66791
19808F6791j38470K748K74126r8556j52894J48112K41347n0242j13846r3336j61295
$$ 66791 -71679 -68931 205195 106639 -46255 101857 343204 292962 179116 85780 -75515
19797g5515J21018L821J15995O9886L417J42174O6211m4071k48497j6926M3962
$$ -75515 45503 49324 165319 235205 238622 380796 447007 402936 154439 137513 181475
19786A81475k08939r8657R2090R1978K4093N3606J52868j12839j83911L4374O7282
$$ 181475 -27464 -126121 -34031 57947 82040 135646 288514 175675 -8236 26138 93420
19775I3420j32331l02127m979J46694K4279J0476J03929J16461Q2014P6989j23242
$$ 93420 -38911 -341038 -346017 -199323 -175044 -164568 -60639 55822 137836 214825 91583
19764I1583j96893n3636K21552N5524k05452M0600n1607M076L178k8554j52239
$$ 91583 -105310 -158946 62606 118130 -87322 -46722 -98329 -94253 -91075 -119629 -271868
19753b71868K01066j4593k7293r1748j10195J10845J75520J65497J07438L7471
$$ -271868 -70802 -85395 -112688 -204436 -314631 -203786 -28266 137231 244669 282140
19743B82140o55m6997K252j63597K9555K5274j00315J3229R1515O2490J15282
$$ 282140 281485 234488 236740 73143 102698 127972 27657 40886 132401 194891 310173
19732C10173p272q4067j96879p0328J09632j89603K01437J46951k9577p7066m0749
$$ 310173 302901 218834 21955 -48373 61259 -128344 73093 220044 190467 113401 72652
19721G2652j91900j5807p8399l9176J29438L22903J81738R7998j7765j16069j20311
$$ 72652 -119248 -135055 -213454 -252630 -123192 199711 381449 479447 461682 345613 225302
19710B25302J9359q7390J27890K4672R251n0860k78340j98811j5521J57941J49888
$$ 225302 244661 157271 285161 309833 319084 268224 -10116 -208927 -224448 -66507 83381
19699H3381J50302P7774l710n2781j63712j37346n8106J08545R6235j1576R9233
$$ 83381 233683 311457 307747 254966 91254 -46092 -104198 4347 100582 89006 188239
19688A88239j20730l713J78756l2966J40291p1918k806q2203m6575L1963j04507
$$ 188239 67509 63796 242552 209586 349877 277959 275153 192950 146375 178338 73831
19677G3831j53300Q9519K35363J02077k12912J5829j58574j82629q1166O4314
$$ 73831 -79469 10050 245413 347490 134578 150407 -8167 -190796 -271962 -207648
19667b07648J59712O1728j41456m6491j47414p9444J71545J87193J25000o9944
$$ -207648 -47936 13792 -127664 -174155 -321569 -401013 -229468 -42275 82725 12781
19657A2781k7438J04023j63775j25282J3856J6138R8390j20947j87055K90569
$$ 12781 -14657 89366 -74409 -199691 -185835 -169697 -71307 -192254 -379309 -88740
19647h8740J54866J30789n2516l7256P5770P3109r689l32484k38819j78933J00024
$$ -88740 66126 196915 144399 107143 182913 256022 246333 -86151 -324970 -503903 -403879
19636d03879R3228m650j03683K05827K28095j67900r2593m531m4791J56209L8757
$$ -403879 -310651 -315301 -418984 -213157 14938 -152962 -245555 -250086 -294877 -138668 -99911
19625i9911R8070M4121K38984l9242p4750R131j09247j49593j59150Q596K2278
$$ -99911 -1841 42280 281264 242022 167272 176403 67156 -82437 -241587 -232991 -210713
19614b10713J95008J08795Q6435P7890p3552j74001j84166L7536J67340r9162
$$ -210713 -15705 93090 179525 257415 183863 9862 -174304 -136768 30572 -68590
19604f8590q2513j4680M6393Q1992j32574N9685j49219r6487l8502M347J83975
$$ -68590 -151103 -165783 -119390 -37398 -169972 -110287 -259506 -355993 -394495 -390148 -206173
19593b06173J03379q6252p5890J36612N9642k63485J35499J50271L5761l6202
$$ -206173 -102794 -189046 -264936 -128324 -68682 -332167 -196668 -46397 -10636 -46838
19583d6838n1752K1840j2613k2542j07350J95022J04521N7147p2647j82849j14112
$$ -46838 -98590 -76750 -89363 -111905 -219255 -24233 80288 137435 64788 -118061 -232173
19572b32173M7891K2143J59131O0871K3764P1981l1580j59935J16827l2056j29190
$$ -232173 -184282 -162139 -3008 57863 81627 153608 122028 -37907 78920 46864 -82326
19561h2326Q1987J31494p8321k2284R7561J6954j05758j52600j05886M4733j02460
$$ -82326 -339 131155 52834 30550 128111 145065 39307 -113293 -219179 -174446 -276906
19550b76906Q7026q848k6519J0785r624o1678P3249J16257K22004J87983J06503
$$ -276906 -189880 -198728 -225247 -214462 -224086 -285764 -212515 -96258 125746 313729 420232
19539D20232o7957l38414k10114j13644m1179J07240q8596J2799K51427J75292
$$ 420232 352275 13861 -196253 -309897 -351076 -243836 -332432 -319633 -68206 107086
19529A07086n9612j53182m9582J70529J71952J58513j30748k33134J33891J70986
$$ 107086 47474 -105708 -155290 15239 187191 345704 214956 -18178 115713 286699
19519B86699l1886l07172o1803L94592J21980l38575j28016J52893J9861K15857
$$ 286699 254813 -52359 -114162 280430 402410 63835 -64181 88712 108573 324430
19509C24430O956j30846k149k15640j57751j42918o8K2718j01447J0290J58943
$$ 324430 331386 200540 198391 -17249 -175000 -317918 -317986 -295268 -396715 -386425 -227482
19498b27482J41863J84894j9275K6682q9910J23832k43655n5413K62525J87088
$$ -227482 -85619 99275 80000 106682 16772 140604 -103051 -158464 104061 291149
19488B91149r0522j75966J58511J03727j36169Q1509J13287o4213k06239k00000
$$ 291149 200627 24661 183172 286899 150730 232239 345526 281313 75074 -124926
19478a24926j28939O6840J17792P6666J38398n9588l1410N9080k08069O3493K06883
$$ -124926 -253865 -187025 -69233 7433 145831 86243 54833 113913 -94156 -30663 176220
19467A76220K26603K17959m9429k44366J31302J59335K43165J32451k60548j61226
$$ 176220 402823 620782 571353 326987 458289 617624 860789 993240 732692 571466
19457E71466l55089j43165J26506J32097j5721j8735j62265O9293J41423J35978
$$ 571466 216377 73212 199718 331815 316094 297359 135094 204387 345810 481788
19447D81788p5110O1502o7899m5159k6727k3956r5036j06950l7908L7979M1095
$$ 481788 406678 468180 400281 355122 328395 304439 209403 102453 64545 102524 143619
19436A43619J90425k6160N6726k949Q468j99255q9985K30070J36215n1752j59497
$$ 143619 334044 307884 364610 361661 370129 170874 80889 310959 447174 395422 235925
19425B35925L6873j40358j55521M2075J35612M6747o2798k06695N8273J03758
$$ 235925 272798 132440 -23081 18994 154606 201353 138555 -68140 -9867 93891
19415I3891K34554m2384p0693k9718J04495K9660J34289q3296Q0030M8445l7661
$$ 93891 328445 286061 215368 185650 290145 319805 454094 370798 450828 499273 461612
19404D61612j55639j3670P7510j11386O080N4845q647K8760R1423r3524j58962
$$ 461612 305973 292303 369813 258427 264507 319352 310705 339465 430888 337364 178402
19393A78402K24873J89270J5304j08264k16198J6818J99782r725n9304J15812
$$ 178402 403275 592545 607849 499585 283387 300205 499987 490262 430958 546770
19383E46770j04520R1028J60652n7029J80687r9550j87151O3412K024r472J03090
$$ 546770 442250 533278 693930 636901 817588 718038 530887 594299 596323 586851 689941
19372F89941J09898q2455Q5964p5419l33067l41520P5909J43188J57544Q7818
$$ 689941 799839 717384 803348 727929 394862 53342 129251 272439 429983 517801
19362E17801J0568K05210q2219o9196l9566L45p9528l6670N6262r4365o3962p4198
$$ 517801 528369 733579 651360 582164 542598 542943 463415 426745 483007 388642 324680 250482
19350B50482k07536L8417K44954J16084J77846K578K24012J43850k31517m35042
$$ 250482 42946 81363 326317 442401 620247 622825 846837 990687 759170 324128
19340C24128N0544K48213K1305p226o3051J3991J08236R0955J12471J42644k7811
$$ 324128 374672 622885 644190 636964 573913 587904 696140 787095 899566 1042210 1014399
19329A014399k62224q3440Q0751j18413l06332k23813j37955L6428K92524K50589
$$ 1014399 752175 668735 749486 631073 324741 100928 -37027 -599 291925 542514
19319E42514j09657j60534j659O7486J8353J95214m5416l05728L4110o3539J9430
$$ 542514 432857 272323 270664 338150 356503 551717 506301 200573 234683 171144 190574
19308A90574K7623n8135m8787j8902J28613J56326j06375j0081o30L4210M9054
$$ 190574 218197 160062 111275 92373 220986 377312 270937 260856 260226 294436 343490
19297C43490K51285n0316L1893j10065j02974m3665Q274j36323n025Q8251k20232
$$ 343490 594775 544459 576352 466287 363313 319648 327922 191599 186574 274825 54593
19286E4593j09122J54819J64052O1162J5254j06062r7394M8849p3992n230j25472
$$ 54593 -54529 100290 264342 325504 340758 234696 137302 186151 112159 106929 -18543
19275a8543J00232K3654R708L0516q4633K79914J00420j77221J44628p4160j80563
$$ -18543 81689 105343 115051 145567 60934 340848 441268 264047 408675 334515 153952
19264A53952R4886J87326Q241J06215k08258j27216R760K290o1411K0341J49491
$$ 153952 248838 436164 444405 550620 342362 215146 224906 227196 165785 186126 335617
19253C35617M4845k01625m3711J39058Q1969K90980k8939j36930J70404J82702
$$ 335617 380462 178837 135126 274184 356153 647133 618194 481264 651668 834370
19243H34370j24682l58066j31922J3350N0906j1913O9652J31936R9866R6036J32895
$$ 834370 709688 351622 219700 233050 283956 272043 341695 473631 573497 669533 802428
19232H02428q5568j7751J2536L1439p9146j05209j96389K66548J59898j43082
$$ 802428 716860 699109 711645 743084 663938 558729 362340 628888 788786 645704
19222F45704J20935J53146k17263k23335L7038P5137p4404m23950k55287K51027
$$ 645704 766639 919785 702522 479187 516225 591362 516958 93008 -162279 88748
19212H8748L24633J21593M3551K5931p1733l1131J61017n2147k08463k31862J21600
$$ 88748 413381 534974 578525 604456 532723 501592 662609 610462 401999 170137 291737
19201B91737M8808j18321j26856M723j86491m0352K92941K29105j19714j32579
$$ 291737 340545 222224 95368 100091 -86400 -126752 166189 395294 275580 143001
19191A43001J82638K27511K37469J94459J58407J40186L05630P84445O40153J87402
$$ 143001 325639 553150 790619 985078 1143485 1283671 1589301 2373746 3013899 3201301
19181C201301n16634p45116o02120l25418j97223r9327k35941k62729j36020J36084
$$ 3201301 2684667 1939551 1337431 1012013 814790 715463 479522 216793 80773 216857
19171B16857J44546N4015k18958j10171Q4045P7111p5312N0610j2570j50790o3678
$$ 216857 361403 415418 196460 86289 170334 247445 172133 222743 210173 59383 -4295
19160d295m6003p7791M9597l8329j18355k4448J44102L17727J53970J30694J11960
$$ -4295 -50298 -128089 -78492 -116821 -235176 -259624 -115522 202205 356175 486869 598829
19149E98829k44955l80974N204K13111J87030M4902j5977j70758k58294O4161
$$ 598829 353874 -27100 -21896 191215 378245 423147 407170 236412 -21882 42279
19139D2279r6092j3075L05465L76788K2028j48014k10173R2319L09544j7239p5258
$$ 42279 -53813 -66888 238577 615365 637393 489379 279206 371525 681069 663830 588572
19128E88572n0086j91434j20183L9407P2063Q3864K6113j99374k01021p1345J98737
$$ 588572 538486 347052 226869 266276 338339 422203 448316 248942 47921 -23424 175313
19117A75313J48465q0444k2780K89026o6301r3865j287N8984j10795j50108n0504
$$ 175313 323778 243334 220554 509580 443279 349414 348127 407111 296316 146208 95704
19106I5704n0726J13697J85898Q0120j38017M7460o7741K12169Q9237p8576j1805
$$ 95704 44978 158675 344573 424693 286676 334136 266395 478564 567801 489225 477420
19095D77420r941j19442j01657Q1748K57685j16623j88343k1265O2015j08455
$$ 477420 467479 348037 246380 328128 585813 469190 280847 259582 321597 213142
19085B13142o2194K30465M0983k35123n6184m6642J16132K11268K4327j34991
$$ 213142 150948 381413 422396 187273 131089 84447 200579 411847 436174 301183
19075C01183r7897j98653m536K5646j73381j49303j14990J38005K03223N4957
$$ 301183 203286 4633 97 25743 -147638 -296941 -411931 -273926 -70703 -15746
19065a5746J89232j8453p7111J65868R2228p477J12795R2331j44536p5710L9022
$$ -15746 173486 155033 77922 243790 336018 328541 441336 533667 389131 313421 352443
19054C52443J57242Q3539P6464j18380O2225K9665M506K3632j26873j98654p7931
$$ 352443 509685 593224 669688 551308 613533 643198 647704 671336 544463 345809 267878
19043B67878l1568Q7321J81444j73356O9815J60105j7881j32925N1631K25387
$$ 267878 236310 323631 505075 331719 401534 561639 543758 410833 462464 687851
19033F87851l9327Q8518J53754L824J63563k8652r1428j81478n8542m6753J2827
$$ 687851 648524 737042 890796 894620 1058183 1029531 938103 756625 698083 651330 664157
19022F64157j04519k69134J63376P3158L00428J54464M4909J38160J31238Q9034
$$ 664157 559638 290504 453880 527038 827466 981930 1026839 1164999 1296237 1385271
19012A385271L1734J00804l4863j80263j48850j88565N9775q0003j93638k545
$$ 1385271 1417005 1517809 1482946 1302683 1153833 965268 1025043 945040 751402 748857
19002G48857J31379J15406Q7191K7124n6292k1287k4318m644J32587r7595p707
$$ 748857 880236 995642 1082833 1109957 1053665 1032378 1008060 1003416 1136003 1038408 1030701
18991A030701K14798J10877K37041J54795M203p9348j59421j62689J7966M4155
$$ 1030701 1245499 1356376 1593417 1748212 1752415 1673067 1513646 1350957 1368923 1413078
18981A413078J63516J74798L53984K78007N3468K9257n8154j6315l38359m09635
$$ 1413078 1576594 1751392 2105376 2383383 2436851 2466108 2407954 2391639 2053280 1643645
18971A643645m2162J06855O9553J17171J74983n538j78961J1384R0634P0389j04125
$$ 1643645 1601483 1708338 1777891 1895062 2070045 2064507 1885546 1896930 1987564 2057953 1953828
18960A953828k12540l41510O0843K2699J56343L49780M2692R7619J99230j7164
$$ 1953828 1741288 1399778 1460621 1483320 1639663 1989443 2032135 2129754 2328984 2311820
18950B311820n3333N75381M81781Q2153k56832k96366k87838p0105j85690m6178
$$ 2311820 2258487 2833868 3315649 3397802 3140970 2844604 2556766 2486661 2300971 2254793
18940B254793J07821J43922m0300J24881N2781L48747M02576O62611P32585L88227
$$ 2254793 2362614 2506536 2466236 2591117 2643898 2992645 3395221 4057832 4790417 5178644
18930E178644M06525K31433J33498j79285k29268j08063J52496M19795L37874
$$ 5178644 5585169 5816602 5950100 5770815 5541547 5433484 5585980 6005775 6343649
18921F343649Q2727K66755N33611N96321Q40329J015127J335140J593664J875938
$$ 6343649 6426376 6693131 7226742 7823063 8663392 9678519 11013659 12607323 14483261
18912A4483261K797534M538396O263445O507867L597061j69213n91031L099831
$$ 14483261 17280795 21819191 28082636 34590503 38187564 38018351 37427320 40527151
18904D0527151R470464J8765901K9781477L7618095K8038879j824667k3407510
$$ 40527151 49997615 68763516 98544993 136163088 164201967 162377300 138969790
18897A38969790k5292852k0561042j4477182o214176K318536R314297J3182880
$$ 138969790 113676938 93115896 78638714 72424538 74743074 84057371 97240251
18890I7240251J5400093J7239118J2266722r36616j1718404r915833k520039j818134
$$ 97240251 112640344 129879462 142146184 141209568 129491164 119575331 117055292 115237158
18882A15237158j0212601j8407837j7662990j0883720l503751K264725O070560
$$ 115237158 105024557 86616720 68953730 58070010 54566259 56830984 62901544
18875F2901544O093944n60018q508278j0474463p799436m244416j231403J912103
$$ 62901544 68995488 68435470 59927192 49452729 41653293 37408877 36177474 38089577
18867C8089577N540178R522892J2174465R831148J590603k241611K049463Q025465
$$ 38089577 43629755 53152647 65327112 75158260 76748863 74507252 76556715 84582180
18859H4582180P833492L366549p29158j710771K814465P242365O576281P249345
$$ 84582180 92415672 95782221 95053063 93342292 96156757 103399122 109975403 117224748
18851A17224748J7142264L3065565L9725007J2857530k9599341m5198063l3215288
$$ 117224748 134367012 167432577 207157584 220015114 190415773 145217710 112002422
18844A12002422j4628067J754040J7291023L3055466M1753988K5744463j7006300
$$ 112002422 97374355 99128395 116419418 149474884 191228872 216973335 199967035
18837A99967035m6966615m6790977l2223970j9360878j2094341q306169o086595
$$ 199967035 153000420 106209443 73985473 54624595 42530254 34224085 28137490
18830B8137490m250217l038191j878004j272791l63349M54232J090185J870798
$$ 28137490 23887273 20849082 18971078 17698287 17334938 17789170 18879355 20750153
18822B0750153K471563K626658J151382k123139l771204l617009l078009k441841
$$ 20750153 23221716 25848374 26999756 24876617 21105413 17488404 14410395 11968554
18814A1968554j680060j053470j104803p83900o43687m69959m46887m64920j93381
$$ 11968554 10288494 9235024 8130221 7346321 6702634 6232675 5785788 5320868 5127487
18805E127487P687J4235J17512J73144J04182J05665j43942j97829o27154n52856
$$ 5127487 5135174 5149409 5266921 5440065 5544247 5649912 5505970 5308141 4680987 4128131
18795D128131l10676j39553o2212P1599K38850M64772M52231J87580M2411j65113
$$ 4128131 3817455 3677902 3615690 3687289 3926139 4390911 4843142 5030722 5073133 4908020
18785D908020j76038m6126l37315m09318n42752m01890k81739j39444j10450k74030
$$ 4908020 4731982 4685856 4348541 3939223 3396471 2994581 2712842 2573398 2462948 2188918
18775B188918Q572O6308k01269j15186J10862J76945Q8678O66335O11852M16829
$$ 2188918 2197490 2263798 2062529 1947343 2058205 2235150 2323828 2990163 3602015 4018844
18765D018844p4337l15881l22046n38081l93366Q6907p415Q598j26963k67876
$$ 4018844 3944507 3628626 3306580 2768499 2375133 2462040 2454625 2463223 2336260 2068384
18755B068384O3511j24589j10999n2684j37234R7001k93564p0889L12083J96952
$$ 2068384 2131895 2007306 1896307 1843623 1706389 1803390 1509826 1438937 1751020 1947972
18745A947972m4235r3141j29359l320k25341k41500K3468l0180o880n3403O6388
$$ 1947972 1903737 1810596 1681237 1677917 1452576 1211076 1234544 1204364 1197484 1144081 1210469
18734A210469J37296J92740K88495N90n07561j80686r7372J59253K66797N9931
$$ 1210469 1347765 1540505 1829000 1829590 1322029 1141343 1043971 1203224 1470021 1529952
18724A529952p1324j60016k2232K47692J20615K7581k6171J0712J09410J95946
$$ 1529952 1458628 1298612 1276380 1524072 1644687 1672268 1646097 1656809 1766219 1962165
18714A962165j8764M0441R7227O1065j90732m3358P7353J14243P858J23364o3900
$$ 1962165 1943401 1983842 2081069 2142134 1951402 1908044 1985397 2099640 2107498 2230862 2166962
18703B166962j59393o6059o5497j15307l6740o4683j2317J74106P864L0915n9281
$$ 2166962 2007569 1941510 1876013 1760706 1723966 1659283 1646966 1821072 1828936 1859851 1800570
18692A800570o4284p5465L9599J12691K24727p6620k08663Q7369L8891M4928m5410
$$ 1800570 1736286 1660821 1700420 1813111 2037838 1961218 1752555 1839924 1878815 1923743 1878333
18681A878333j23862j86885R6585M31126P965Q5938L24250L51793Q5484j77233
$$ 1878333 1754471 1567586 1664171 2095297 2103262 2189200 2513450 2865243 2950727 2773494
18671B773494Q1828J10217R0116K18263K46144P84886Q77625J351754P10796m99558
$$ 2773494 2855322 2965539 3055655 3273918 3520062 4304948 5182573 6534327 7245123 6745565
18661F745565o99411o02235l03353R8901K21136L05806O11479O72585R87397J136098
$$ 6745565 6046154 5443919 5140566 5239467 5460603 5766409 6377888 7050473 8037870 9173968
18651I173968J996149K608486K725451K379518K239401K164767K824440M088938
$$ 9173968 11170117 13778603 16504054 18883572 21122973 23287740 26112180 30201118
18643C0201118N786360Q447247J2812001K1263862L8509482O9834233J14683687
$$ 30201118 35987478 44434725 57246726 78510588 117020070 186854303 301537990
18636C01537990J52943257J19114880l1286708j54384742j49869182r0277106
$$ 301537990 454481247 573596127 542309419 387924677 238055495 147778389
18630A47778389m7387410k6118138j6301950j1444859q016760n713193m862655
$$ 147778389 100390979 74272841 57970891 46526032 38509272 32796079 27933424
18623B7933424l921120k656145j839847j750962j626283j373459j614411j754969
$$ 27933424 24012304 21356159 19516312 17765350 16139067 14765608 13151197 11396228
18615A1396228j565560j358674j026430m04241m57033j11381K4178K67527O14954
$$ 11396228 9830668 8471994 7445564 7041323 6584290 6472909 6497087 6764614 7379568
18606G379568J38464p56096j232328r45986n09450n43022l69229j26816k4736
$$ 7379568 7518032 6761936 5529608 4583622 4074172 3531150 3161921 3035105 3010369
18597C010369k06235q2866j83661j48956q4755M781m6178j61278j91920M0999
$$ 3010369 2804134 2721268 2537607 2388651 2303896 2308677 2262499 2101221 1909301 1950300
18587A950300j7300J49114l2707m1110l1528J7944L3564J50604L20475L44330
$$ 1950300 1933000 2082114 2049407 2008297 1976769 1994713 2028277 2178881 2499356 2843686
18577B843686L35926M01666j34719o35553m94373j52375l9379K09051M84706L21208
$$ 2843686 3179612 3581278 3446559 2811006 2316633 2164258 2124879 2333930 2818636 3139844
18567C139844J41115M8183l01364l01528J09822J33385M4431m251J25369j77795
$$ 3139844 3280959 3329142 3027778 2726250 2836072 2969457 3013888 3009637 3135006 2957211
18557B957211k63061J48260J16364L9955J50863L21591L81368J87972L96709N73878
$$ 2957211 2694150 2842410 2958774 2998729 3149592 3471183 3852551 4040523 4437232 5011110
18547E011110N85423O70289P76063J462657K134553L587400O118996R318083J0722205
$$ 5011110 5596533 6266822 7042885 8505542 10640095 14227495 20346491 29664574 40386779
18538D0386779O324612l181026r247638q912900n820272l150023j021435R44821
$$ 40386779 46711391 43530365 34282727 25369827 19549555 16399532 15378097 16322918
18530A6322918K915887M567968M625869J389371k797925k578879L63297L435642
$$ 16322918 19238805 23806773 28432642 29822013 27024088 24445209 24808506 28244148
18522B8244148M779184L508625L679528O783007R782673N191965o824056j3077939
$$ 28244148 33023332 36531957 40211485 46994492 56777165 61969130 55145074 42067135
18514D2067135j0381988n940881k951829o42953J212816L169361N224134O146566
$$ 42067135 31685147 25744266 22792437 22149484 23362300 26531661 31755795 37902361
18506C7902361L240261k017511l119946o91065O47770j338347l916095l448607
$$ 37902361 41142622 39125111 36005165 35314100 35961870 34623523 30707428 27258821
18498B7258821j457818J21607R68465J555466J235696P68006J890040N025878
$$ 27258821 25801003 25922610 26891075 28446541 29682237 30450243 32340283 37366161
18490C7366161R237065J5307480K3845586L3584846L7713841K4759092M016310
$$ 37366161 46603226 61910706 85756292 119341138 157054979 181814071 185830381
18483A85830381j726532P668007J1000262l165860j9129470k6599998k5473355
$$ 185830381 184103849 191771856 202772118 199606258 180476788 153876790 128403435
18476A28403435k2561794j6440390p414672J914382Q109794P132121l125567j3069063
$$ 128403435 105841641 89401251 81986579 83900961 92010755 99142876 96017309 82948246
18468H2948246j3787702r749328p774573p345300n212720k396721j56662K588509
$$ 82948246 69160544 59411216 51636643 44291343 39078623 36681902 36525240 39113749
18460C9113749N315449P705443Q169284L071142k598568j616352M410286J2086548
$$ 39113749 44429198 52134641 60303925 63375067 60776499 59160147 63570433 75656981
18452G5656981K0316520K5616630K2335236J0908147K401471m564220j3514652
$$ 75656981 95973501 121590131 143925367 154833514 157234985 152670765 139156113
18445A39156113j4783876n391410Q235251K1653665K9337588K7846585K8464342
$$ 139156113 124372237 118980827 127216078 148869743 178207331 206053916 234518258
18438B34518258M0200472M8513315L3645001j668699l5546535n3713180n9365256
$$ 234518258 274718730 323232045 356877046 355208347 319661812 265948632 206583376
18431B06583376n0187275l2053380j5177443k062246P061034P698856n224045
$$ 206583376 156396101 124342721 109165278 107103032 114164066 121862922 116638877
18424A16638877j9534509k0443475j2169178l514325K530861M164051M43252n220284
$$ 116638877 97104368 76660893 64491715 60977390 63508251 67672302 68115554 62895270
18416F2895270q629045r983112q884328o364699l792879k150040o80417N40754
$$ 62895270 54266225 44283113 35398785 29034086 25241207 23091167 22410750 22951504
18408B2951504J613892L349352O015578R127779J0595601P615737J090814n733934
$$ 22951504 24565396 27914748 33930326 43058105 53653706 61269443 62360257 56626323
18400E6626323r821552r123687n240353o37727L320107O396865P082637K060816
$$ 56626323 46804771 37681084 32440731 31803004 35123111 41519976 48602613 50663429
18392E0663429n702594r543511q047486m940187k428894j591662k044291k163490
$$ 50663429 44960835 35417324 27369838 22429651 20000757 18409095 16364804 14201314
18384A4201314k083424j401860j043378o55444m83473o23721q15099p45337m86086
$$ 14201314 12117890 10716030 9672652 9017208 8533735 7910014 7094915 6349578 5863492
18375E863492m53699j28664J6862j09911J14378J21439K73611M67677J032462
$$ 5863492 5409793 5281129 5297991 5188080 5302458 5423897 5697508 6165185 7197647
18366G197647J609703K212576K236253J650585J168561K05672j575771k617908
$$ 7197647 8807350 11019926 13256179 14906764 16075325 16280997 14705226 12087318
18358A2087318k344414j572763k88095Q65138J731428K779656L207590J570448
$$ 12087318 9742904 8170141 7882046 8747184 10478612 13258268 16465858 18036306
18350A8036306j718813l388736k877734j894960j001819j16072O05656O68671
$$ 18036306 16317493 12928757 10051023 8156063 7154244 7038172 7643828 8312499
18342H312499P5678j034363j459852j154496q39012m41802j80438j31536m5336
$$ 8312499 8388177 7353814 5893962 4739466 3900454 3458652 3278214 3146678 3101342
18333C101342l57828l71739l18411l46790o5955J17596N3203M5806k25880r1034
$$ 3101342 2743514 2371775 2053364 1706574 1640619 1758215 1811418 1857224 1631344 1540310
18323A540310J59704k176j36006P6022L01294J03861J98725j16514k58423j43860
$$ 1540310 1700014 1697838 1561832 1637854 1939148 2043009 2241734 2125220 1866797 1722937
18313A722937k28378r3481j94970n3788j18173r3105J806M4478j45565j90505
$$ 1722937 1494559 1401078 1206108 1152320 1034147 941042 942848 987326 841761 651256
18303F51256j39947J45982J23305N8668k05100P303J82815O1378k4895N2278o1889
$$ 651256 511309 657291 780596 839264 634164 641467 824282 885660 860765 913043 851154
18292H51154j74443q3017Q4350M8062k23343J0661O9663M3224j05525Q7504k3077
$$ 851154 676711 593694 678044 726106 502763 513424 583087 626311 520786 608290 585213
18281E85213j58539L9087K9666J3450M0470K77968K04451l8672j28800o6317o3382
$$ 585213 426674 465761 495427 508877 549347 827315 1031766 993094 864294 797977 734595
18270G34595j53350m3555k8774n1161J1741l3582P571O1975J42517M8553q5075
$$ 734595 581245 537690 508916 457755 469496 435914 443485 505460 647977 696530 611455
18259F11455P5634J90596P8045k80414j63656M4059j83926o2210j15692o8896
$$ 611455 687089 877685 955730 675316 511660 555719 371793 309583 193891 124995
18249A24995J37683L7311R8488R2990R5151n088J1025K34191O3454j41222n1784
$$ 124995 262678 299989 398477 491467 586618 581530 592555 826746 890200 748978 697194
18238F97194j98207L01709N1356j92097L7781j06884K4231J89750N7696j35889
$$ 697194 498987 800696 852052 659955 697736 590852 615083 804833 862529 726640
18228G26640j25298O943k31566j24628J25626J13121K073p277r7753K4426J34914
$$ 726640 601342 608285 376719 252091 377717 490838 492911 485634 387881 412307 547221
18217E47221N3526k01011n0130M615q339P2253j09314j3571p4945j6755J28275
$$ 547221 600747 399736 349606 354221 345882 418135 308821 295250 220305 203550 331825
18206C31825p6713j23988n1269J85069J46638j93258K5327k5637M9728j00739
$$ 331825 255112 131124 79855 264924 411562 218304 243631 217994 267722 166983
18196A66983k45633L1869p2976L6696J04658R2071j5027J63646p5966O3525K02504
$$ 166983 -78650 -46781 -119757 -83061 21597 113668 98641 262287 186321 249846 452350
18185D52350L6969m5142l0762j18719o9654J43020J68701j29432l3930j97993
$$ 452350 489319 444177 413415 294696 225042 368062 536763 407331 373401 175408
18175A75408J3360J22415k3823O6184K92300P6531j48189j63952l5705K4307m9079
$$ 175408 188768 311183 287360 353544 645844 722375 574186 410234 374529 398836 349757
18164C49757K065L9932J64619p9363j22084J47925K66839j98934j89510J16620
$$ 349757 351822 391754 556373 477010 354926 502851 769690 570756 381246 497866
18154D97866K23741K47571R981k49314l4296N5665O6125n183N3397l0070J74856
$$ 497866 721607 969178 979159 729845 695549 751214 817339 812156 865553 835483 1010339
18143A010339L12614M2881p7635q4082J49143J0471j1669J55494J67454N9471
$$ 1010339 1322953 1365834 1288199 1204117 1353260 1363731 1352062 1507556 1675010 1734481
18133A734481K19268L17056l2983J48406J31294K75181M42377M03952M25097P58455
$$ 1734481 1953749 2270805 2237822 2386228 2517522 2792703 3235080 3639032 4064129 4822584
18123D822584J050604Q17004O46600J068784J754927J939176K644069M066885
$$ 4822584 5873188 6690192 7336792 8405576 10160503 12099679 14743748 18810633
18115A8810633N750414Q599772J4643312K6883639M9924525Q2844982J14417486
$$ 18810633 24561047 33160819 47804131 74687770 124612295 207457277 321874763
18108C21874763P9475155o3616995j25528242q9758390m5188458k3619202j3900014
$$ 321874763 401349918 337732923 212204681 122446291 77257833 53638631 39738617
18101C9738617r254755o523754m502810l483464k514568k119795j813060j288083
$$ 39738617 30483862 23960108 19457298 15973834 13459266 11339471 9526411 8238328
18093H238328q10440p93897o23033m66507l42847p63262m26993j68648J78298
$$ 8238328 7427888 6633991 6010958 5544451 5201604 4438342 4011349 3842701 4020999
18084D020999L96340K38357O3410P213l43303p93589o17206m57235m55396k77158
$$ 4020999 4417339 4655696 4719106 4726319 4383016 3589427 2972221 2514986 2059590 1782432
18074A782432j43527j34652l37310l67490n0438m9848n4336N8980r5629j12557
$$ 1782432 1638905 1504253 1166943 799453 749015 699167 644831 703811 608182 495625
18064D95625J52840j07247J20096k5525p4299p294O7256R3651j2609j98998j72880
$$ 495625 648465 541218 661314 635789 561490 554196 621452 715103 702494 503496 330616
18053C30616M9337Q2208l6643N9513J31683j53007m3387J00468j14439M4670J51087
$$ 330616 379953 462161 425518 485031 616714 463707 420320 520788 406349 451019 602106
18042F02106J7385P3594p1447l76864o9834j23581l7430K0403n0256J62680J95370
$$ 602106 619491 693085 621638 244774 174940 51359 13929 34332 -15924 146756 342126
18031C42126J63938J12077P4198k04848r7906l27685Q8963J00754J38542m3962
$$ 342126 506064 618141 692339 487491 389585 61900 150863 251617 390159 346197
18021C46197p305L3365j67587J1661N1885j76966J96838J1171J90498J57976M0597
$$ 346197 338892 372257 204670 216331 268216 91250 288088 299259 489757 647733 688330
18010F88330j33890j56501j11632j59173r5742L11017j9903r2282m0647J1458
$$ 688330 554440 397939 286307 127134 31392 342409 322506 230224 189577 201035
18000B01035J03680r8634j20699j37194k09448J19073L23531P7308j57333K15601
$$ 201035 304715 206081 85382 -51812 -261260 -142187 181344 258652 101319 316920
17990C16920K00714q7936j8582N7940J06087j24191r9564J26110j61438j13657
$$ 316920 517634 429698 411116 469056 575143 450952 351388 477498 316060 202403
17980B02403q7346n125J86484K05283Q3064k69598j82288K43847Q0056M1128m1086
$$ 202403 115057 109932 296416 501699 584763 315165 132877 376724 456780 497908 456822
17969D56822k1929M7375j04808J26700J16593j13084j38683j3685K56516J90628
$$ 456822 434893 482268 377460 504160 620753 507669 368986 355301 611817 802445
17959H02445J6352j15013k04929j762J38767K4612k73289k07417K15783J74687
$$ 802445 818797 703784 498855 497093 635860 660472 387183 179766 395549 570236
17949E70236J86403k4570j32202l8168J70921k06768j38910l2229j0318N2977
$$ 570236 756639 732069 599867 561699 732620 525852 386942 354713 344395 397372
17939C97372J40523p9616k43329p4503j26212J00925L4133L8790J07538j23264
$$ 397372 537895 458279 214950 140447 14235 115160 149293 188083 295621 172357
17929A72357N2501J76188n0872m3388R1505K14915j5672k45344m2200j78106N5757
$$ 172357 224858 401046 350174 306786 398291 613206 597534 352190 309990 131884 187641
17918A87641R3069P8012M4427j0703k64284j16424j09102j5369K57358J97450
$$ 187641 280710 358722 403149 392446 128162 11738 -97364 -112733 144625 342075
17908C42075Q5436M8279M7622P1922L36082p1965k89132k97278j38082M2488J909
$$ 342075 427511 475790 523412 595334 931416 859451 570319 273041 134959 177447 179356
17897A79356K25643K55639O6863Q8049j31628l30566l16997q3867K94120J65622
$$ 179356 404999 660638 727501 815550 683922 353356 36359 -47508 246612 412234
17887D12234o8182j45266j85542m1263j13108j3744L4891J83090l4806O398N8383
$$ 412234 344052 198786 13244 -28019 -141127 -154871 -119980 63110 28304 34702 93085
17876I3085K50235R7995k29733k37206j70776R5441J73371J63389Q3458k44923
$$ 93085 343320 441315 211582 -25624 -196400 -100959 72412 235801 319259 74336
17866G4336M4688j14761K4582M2829l3190q1153l0911J15420J1214r5267o2355
$$ 74336 119024 4263 28845 71674 38484 -42669 -73580 41840 53054 -42213 -104568
17855a04568O6083J70569J88140q5070N7588P9331N6708m8536P8834j35735j9104
$$ -104568 -38485 132084 320224 235154 292742 372073 428781 380245 459079 323344 304240
17844C04240j30982J9620J65080o7841j74270j17954k07590j58968J1144J57121
$$ 304240 173258 192878 357958 290117 115847 -2107 -209697 -368665 -357521 -200400
17834b00400P8730J72662k4459r651K1116l7776p7653k07446k4797P3549J69908
$$ -200400 -121670 50992 26533 16882 37998 222 -77431 -284877 -309674 -236125 -66217
17823f6217n891O5699k1596O4691M7298j48324j70330J03526J21285R7421P5832
$$ -66217 -72108 -6409 -28005 36686 83984 -64340 -234670 -131144 -9859 87562 163394
17812A63394Q295j20503j16063Q29N4574J142j37899r1593j33290k27173K5507
$$ 163394 171689 51186 -64877 -64048 -9474 -8332 -146231 -237824 -371114 -598287 -572780
17801e72780Q6147J24082K48909Q7328N2363m8970K07235l03410j43904J60050
$$ -572780 -486633 -362551 -113642 -26314 26049 -22921 184314 -119096 -263000 -102950
17791a02950K14656K89L6566M6610j2550N8101j90861q1935Q055N1842r642J59257
$$ -102950 111706 111995 148561 195171 182621 240722 49861 -32074 -24019 27823 18181 177438
17779A77438O1942k27439p5655m3774K9907j7394j48338k370J92559N2641K7210
$$ 177438 239380 11941 -63714 -107488 -77581 -94975 -243313 -245683 -53124 -483 26727
17768B6727O6489O8918k15684j55090J80756j4158p9703n6985k95J84339r4336
$$ 26727 93216 162134 -53550 -208640 -27884 -42042 -121745 -178730 -179025 5314 -89022
17757h9022M9128J46072L3038n6207p2253j19255p1894J38068M7856R833l6617
$$ -89022 -39894 106178 139216 83009 10756 -108499 -180393 -42325 5531 15364 -21253
17746b1253K7434j9679j25815Q4091J05832j6439l4254J38041r7653l64218j25266
$$ -21253 6181 -13498 -139313 -55222 50610 34171 -83 137958 40305 -323913 -449179
17735d49179J93970L597J05133K21690O3140k29349k54181j72817K36859J57962
$$ -449179 -255209 -251612 -146479 75211 138351 -90998 -345179 -517996 -281137 -123175
17725a23175r6374r7997L6436K70998J76902j16944p8630j58416L8016J25743
$$ -123175 -219549 -317546 -281110 -10112 166790 49846 -28784 -187200 -149184 -23441
17715b3441J15075O0222j74672J67302L0386j48499j77660K1967j82503l1015
$$ -23441 91634 151856 -22816 144486 174872 26373 -151287 -129320 -311823 -342838
17705c42838L1931R2506J2321r6991O0506J30615P8570j04358k5729M1776K54250
$$ -342838 -310907 -218401 -206080 -303071 -242565 -111950 -33380 -137738 -163467 -121691 132559
17694A32559j0481j93337O60J5972R5287J7389p4160r8363R1177n5840j08447
$$ 132559 122078 -71259 -70599 -54627 40660 58049 -16111 -114474 -23297 -79137 -187584
17683a87584p2747r0370K8547L58421l7959l5121Q343j39882r8153n393J57074
$$ -187584 -260331 -350701 -322154 36267 -1692 -36813 -28470 -168352 -266505 -271898 -114824
17672a14824l109l9101q5917K59082K47785r2950k19688j54165k9407L536L10522
$$ -114824 -117933 -157034 -242951 16131 263916 170966 -48722 -202887 -232294 -228758 81764
17661H1764J93696j8516j60318P9333K6482R7248J7912P0822M5029j18826j45778
$$ 81764 275460 256944 96626 175959 202441 299689 317601 388423 433452 314626 168848
17650A68848j34075L0418P8893o7502N1166n9513n7204j87405n6836j28340K7925
$$ 168848 34773 65191 144084 76582 127748 68235 11031 -176374 -233210 -361550 -333625
17639c33625J62706K6386K4250K6991J3271j74418k16830l9944K31556M477M9294
$$ -333625 -170919 -144533 -120283 -93292 -80021 -254439 -471269 -511213 -279657 -275180 -225886
17628b25886Q4697l300P9095M8297l3988m2084K112J08466J57511M915k821p6359
$$ -225886 -141189 -144489 -65394 -17097 -51085 -93169 -91057 17409 174920 179835 177014 100655
17616A00655J5769R8492j55774J3971J65251k10949o6518J32216p8062L3788j3325
$$ 100655 116424 214916 59142 73113 238364 27415 -39103 93113 15051 48839 35514
17605C5514P475j43868J05939J83036q4485k03863n7957o1515m1024l2580J0647
$$ 35514 42989 -100879 5060 188096 103611 -100252 -158209 -219724 -260748 -293328 -282681
17594b82681P0914M5095o8756m3283j5593l6321J295J11537J41666N7824k4889
$$ -282681 -211767 -166672 -235428 -278711 -294304 -330625 -329330 -217793 -76127 -18303 -43192
17583d3192J90018k6101O2750J67556o7988j25999j26510J12325j27230j14839
$$ -43192 146826 120725 183475 351031 283043 157044 30534 142859 15629 -99210
17573i9210r9079Q0035O9236m6547o3484M4045j05430J53647Q1355k42106m4425
$$ -99210 -198289 -118254 -49018 -95565 -159049 -115004 -220434 -66787 14568 -227538 -271963
17562b71963J93550k6287m841O1461j30825R5729m3489L6519L0575L1917j3878
$$ -271963 -78413 -104700 -109541 -48080 -178905 -83176 -126665 -90146 -59571 -27654 -41532
17551d1532p4809k065K19600J4499j37045K859l4293R5620J63148n5j28828n4468
$$ -41532 -116341 -118406 101194 115693 -21352 -18493 -52786 42834 205982 205927 77099 22631
17539B2631j46395M2918j03988j92854N8485M9215j8155J61905J75193O1324j29551
$$ 22631 -123764 -80846 -184834 -377688 -319203 -269988 -288143 -126238 48955 110279 -19272
17528a9272Q750J56829m5024j47868J06857j42091j22748o7149J95475m0384m1854
$$ -19272 -10522 146307 101283 -46585 60272 -81819 -204567 -271716 -76241 -116625 -158479
17517a58479M7492J49797L7689K3143J64581j44003k52401n6599R2600J60520
$$ -158479 -110987 38810 76499 99642 264223 120220 -132181 -188780 -96180 64340
17507F4340R0228k37167k60235k90437K6247N3444R3957J70645J92517K27721
$$ 64340 154568 -82599 -342834 -633271 -607024 -553580 -459623 -288978 -96461 131260
17497A31260Q1472k15559j35312R039k0837j5588J682R5494L6227N7494Q1685
$$ 131260 212732 -2827 -138139 -129100 -149937 -165525 -163843 -68349 -32122 25372 107057
17486A07057k24609O14R6281l0692O047Q606J8114q3665r3856j9947L11451P8983
$$ 107057 -117552 -116938 -20657 -51349 -45302 -36696 -18582 -102247 -196103 -216050 95401 174384
17474A74384j72143j71877M9340R1449L9841j46286Q0581M7355j27628m1474L7506
$$ 174384 2241 -169636 -120296 -28847 10994 -135292 -54711 -7356 -134984 -176458 -138952
17463a38952j00152l7495m9855k3256L7220K1573j7188m2839P4213K98260J11983
$$ -138952 -239104 -276599 -326454 -349710 -312490 -290917 -308105 -350944 -276731 21529 133512
17452A33512j65961j87256J58988P5447j95297j32895J66704L37459M87016O27127
$$ 133512 -32449 -219705 -60717 14730 -180567 -313462 -146758 190701 677717 1304844
17442A304844M45795n1920p03957n16112j80417j75215j61157J04152J99777j1063
$$ 1304844 1750639 1698719 994762 478650 298233 123018 -38139 66013 265790 254727
17432B54727k16420m6313L3661l8435M0463m8586j2519Q5310Q3859K25078J42861
$$ 254727 38307 -8006 25655 -12780 27683 -20903 -33422 51888 135747 360825 503686
17421E03686l37913l33074K959J24122r2259L0659o6676Q822J22233J08137l0766
$$ 503686 165773 -167301 -164342 -40220 -132479 -101820 -168496 -159674 -37441 70696 39930
17410C9930m6726J3200o5613o5843J50835J08448q2073J08251Q0859J07650m5499
$$ 39930 -6796 6404 -59209 -125052 25783 134231 52158 160409 241268 348918 303419
17399C03419j18107j56406j48640R8771j002R911n0507j3412M6970j16056j9425
$$ 303419 185312 28906 -119734 -20963 -21965 -12054 -62561 -75973 -29003 -145059 -164484
17388a64484P3172j26596j48597k0674O2986n4015K27117K25313L9926l1920J446
$$ -164484 -91312 -217908 -366505 -387179 -324193 -378208 -151091 74222 114148 82228 83674
17377H3674q7453m0136R4407K20378P1849l9834k39391j15251J41166n6308j0195
$$ 83674 -3779 -43915 50492 270870 342719 302885 63494 -51757 89409 33101 22906
17366B2906J23829K02482n442k58556k9904J71663k5710j80613j36071l2253l1135
$$ 22906 146735 349217 343775 85219 55315 226978 201268 20655 -115416 -147669 -178804
17355a78804J09884K18847j18440j63973p3528j59996j26626l6489J83728J40934
$$ -178804 -68920 149927 31487 -132486 -206014 -366010 -492636 -529125 -345397 -204463
17345b04463J70523Q9110P7624j01915k25299J14523K36556J04307j34842j57441
$$ -204463 -33940 55170 132794 30879 -194420 -79897 156659 260966 126124 -31317
17335c1317j81618L272j1096L8665K98220J87646o4227p3279j42633K5431N7497
$$ -31317 -212935 -209663 -220759 -182094 116126 303772 239545 166266 23633 49064 106561
17324A06561j70368k24486J56939l1343p7276q2701N42L02417J6305j52699M1958
$$ 106561 -63807 -288293 -131354 -162697 -239973 -322674 -322132 -19715 -3410 -156109 -114151
17313a14151J22894J74066k41636j77300j06226J02667j3597J43755K04651k14706
$$ -114151 8743 182809 -58827 -236127 -342353 -239686 -253283 -109528 95123 -119583
17303a19583j35399J05065J37403j67408l9529M1487L6286J26425M4281m4412
$$ -119583 -254982 -149917 -12514 -179922 -219451 -177964 -141678 -15253 29028 -15384
17293a5384l2249R4331Q1926k18501k00182R7057l7944m3716M8824J31302L1876
$$ -15384 -47633 46698 128624 -89877 -290059 -193002 -230946 -274662 -225838 -94536 -62660
17282f2660N7311J48378o054j53184j07183p8099j2405J41218P1967O0310n0903
$$ -62660 -5349 143029 136975 -16209 -123392 -201491 -213896 -72678 -711 59599 8696
17271H696L8446J3369q5262j64032k22302J27249K67389R2524L8616r6521j12680
$$ 8696 47142 60511 -24751 -188783 -411085 -283836 -16447 76077 114693 18172 -94508
17260i4508J39987j27857N5901n017J3019l3473j55717M2076M2642J8564j0879
$$ -94508 45479 -82378 -26477 -31494 -18475 -51948 -207665 -165589 -122947 -104383 -115262
17249a15262j5989k3396M199J21406J49933P5O4685p4077N4176j59738r1123j67983
$$ -115262 -131251 -154647 -150448 -29042 120891 120966 185651 111574 165750 6012 -85111 -253094
17237b53094k33252J43742J36810o5309J14321J08212K3049P1421K63953j16559
$$ -253094 -486346 -342604 -205794 -271103 -156782 -48570 -25521 45900 309853 193294
17227A93294j24176N7177O0270K5807N3393j05584k08367q5131J92153O2455R8493
$$ 193294 69118 126295 186565 212372 265765 160181 -48186 -133317 58836 121291 219784
17216B19784J37378j29158j13646N3479k00242m327Q9802q2964N5364j2844j79105
$$ 219784 357162 228004 114358 167837 -32405 -36732 53070 -29894 25470 12626 -166479
17205a66479j24868q5809J22143M3719j61573k19366M4535K28178L5075o0561
$$ -166479 -291347 -377156 -255013 -211294 -372867 -592233 -547698 -319520 -284445 -345006
17195c45006J17279J61595m9032p876J09795J38008p4270n6139p3970L8612M2644
$$ -345006 -227727 -66132 -115164 -123040 -13245 124763 50493 -5646 -79616 -41004 1640
17184A640l841o6700K33541J55148J29671k8868o379j30037m4809m7492L4857
$$ 1640 -2201 -68901 164640 319788 449459 420591 414212 284175 239366 191874 226731
17173B26731j6789j30593j60909j45918j23751K6498j83020q3391J60403L08075
$$ 226731 209942 79349 -81560 -227478 -351229 -324731 -507751 -591142 -430739 -122664
17163a22664K82842L6622p7918o3686O8941o2217O2194O9678l2325p196k00318
$$ -122664 160178 196800 118882 55196 124137 61920 124114 193792 161467 154271 -46047
17152d6047j28086j44900K82311K15919q7720m1634M3875l097j51961r8398R3074
$$ -46047 -174133 -319033 -36722 179197 91477 49843 93718 90621 -61340 -159738 -66664
17141f6664J42914P99p0155k72196j89825N2320J55764J91826q2221J9971K43156
$$ -66664 76250 77049 6894 -265302 -455127 -402807 -247043 -55217 -137438 -117467 125689
17130A25689J01137k4215j18103j41833J61073J46900j97783l6801J80344L1471
$$ 125689 226826 202611 84508 -57325 103748 250648 52865 16064 196408 227879
17120B27879j39710n0074Q7570p8913K1900J80885M8839k17593r3543O7318P2329
$$ 227879 88169 38095 125665 46752 68652 249537 298376 80783 -12760 54558 126887
17109A26887o2261p6107r2073j51191n8984J32736J16641K18700J95681q9264
$$ 126887 64626 -11481 -103554 -254745 -313729 -180993 -64352 154348 350029 260765
17099B60765q4660p2115k63382L397J30971J87909P5446k87039k51608J34413
$$ 260765 176105 103990 -159392 -155995 -25024 162885 238331 -48708 -300316 -165903
17089a65903J57013J20678j96006n4501J18191j30371j71824J45586j7043p4298
$$ -165903 -8890 111788 -84218 -138719 -20528 -150899 -322723 -177137 -194180 -268478
17079b68478J5593K24869J07896N9542j57163k05979K64722R0264j93537k06736
$$ -268478 -252885 -28016 79880 139422 -17741 -223720 41002 131266 -62271 -269007
17069b69007l15425K07468K70019J05688R8456m0948K6038p0056L8728J61103
$$ -269007 -584432 -376964 -106945 -1257 97199 56251 82289 12233 50961 212064
17059B12064J2791j47072Q9206J4090m9185K7961j72349P2107n0358J18195j42177
$$ 212064 224855 77783 166989 181079 131894 159855 -12494 59613 9255 127450 -14727
17048a4727L4175J60891J8934J103q9134o431j42775l6230Q605o0128J31078k7626
$$ -14727 19448 180339 199273 200376 111242 104811 -37964 -74194 -65589 -125717 5361 -22265
17036b2265P4387r6821l3470J67315L9763j43278J88357J17376j85313k8833J48494
$$ -22265 52122 -44699 -78169 89146 128909 -14369 173988 291364 106051 77218 225712
17025B25712j7471J06319q1088k8512k309o7375l01625j34392m6198k21978j8913
$$ 225712 208241 314560 233472 204960 202651 135276 -166349 -300741 -346939 -568917 -587830
17014e87830J79038J027R625J18860n4232j8257K8563L6986J06837p1624J44346
$$ -587830 -408792 -407765 -398140 -279280 -333512 -351769 -323206 -286220 -179383 -251007 -106661
17003a06661K01948j55626p4777K35268J05510j206j18035m7128K6831M1174R2147
$$ -106661 95287 -60339 -135116 100152 205662 204456 86421 39293 66124 107298 199445
16992A99445k38901J49225J59855j09833j09532r8880q9384R3942J92949o105
$$ 199445 -39456 109769 269624 159791 50259 -48621 -138005 -44063 148886 142781
16982A42781Q488P2598j0574j31705j58084m1915q9638m9897J8977J17247J82351
$$ 142781 151269 223867 213293 81588 -76496 -118411 -208049 -257946 -238969 -121722 60629
16971F0629j43272k17992r0753J13157J81071j36033m7135l9424j67053K67326
$$ 60629 -82643 -300635 -391388 -278231 -97160 -233193 -280328 -319752 -486805 -219479
16961b19479J60126n158r2690j2928p1516r1523L45J4482J57610J26549m7434
$$ -219479 -59353 -64511 -157201 -170129 -241645 -333168 -332823 -318341 -160731 -34182 -81616
16950h1616k69307j21259J05558O0533O9712j0066L0993J587K13305K09717m6768
$$ -81616 -350923 -472182 -366624 -306091 -236379 -246445 -215452 -213865 -560 209157 162389
16939A62389j14324l51047k79765J66951J07411J21626J19063p8535j3302K16275
$$ 162389 48065 -302982 -582747 -415796 -308385 -186759 -67696 -146231 -159533 56742
16929E6742O3619j79179m7739N9140J92678J7305J219j99706O5800J00584l7750
$$ 56742 120361 -58818 -106557 -47417 145261 162566 163785 -35921 29879 130463 92713
16918I2713j91564J11377J08627K40366J16711o7910j82192j11391j62831n8926
$$ 92713 -98851 12526 121153 361519 478230 410320 228128 116737 -46094 -105020
16908a05020Q9474J15872J77983p4568j78190N6497J2224M324j41657r3724m5072
$$ -105020 -15546 100326 278309 203741 25551 82048 94272 98596 -43061 -136785 -181857
16897a81857p7488l9242q1190N6266L28295K52802j0046j29430O8875N9739p6318
$$ -181857 -259345 -298587 -379777 -323511 4784 257586 247540 118110 186985 246724 170406
16886A70406o4468Q1937K2629q2886j08072N7560P6390J28177j3626k84052q3688
$$ 170406 105938 187875 210504 127618 19546 77106 153496 281673 268047 -16005 -99693
16875i9693p4060N9226j20633q1588l179M0005m2324R9719J95016q9650J4653
$$ -99693 -173753 -114527 -235160 -316748 -319927 -279922 -322246 -222527 -27511 -117161 -102508
16864a02508J08316J93210K20757J24697J78518O2616k02865m70532r7455l0553
$$ -102508 5808 199018 419775 544472 722990 785606 582741 112209 14754 -15799
16854a5799k0946N2934J51137P5813O4933j9092j04040j85695j45395j63576N3493
$$ -15799 -36745 16189 167326 243139 308072 288980 184940 -755 -146150 -309726 -256233
16843b56233J13240K5258k6529q4384j5760m7097K49447Q5906r4337l4515j10552
$$ -256233 -142993 -117735 -144264 -228648 -244408 -291505 -42058 43848 -50489 -85004 -195556
16832a95556q4836o673J42216L6957N7681J84708Q0247m6034j39229j40030n4382
$$ -195556 -280392 -287065 -144849 -107892 -50211 134497 214744 168710 29481 -110549 -164931
16821a64931p9213J01096J91367P0412m482l37439n9474m4952P6870J58562p224
$$ -164931 -244144 -143048 48319 118731 114249 -223190 -282664 -327616 -250746 -92184 -99408
16810i9408L666K23823o0047L2891q3586j2376Q4876k89635o8967O0278J5480
$$ -99408 -95742 128081 68034 100925 17339 4963 89839 -199796 -268763 -208485 -193005
16799a93005Q6971R3530j074j19890j26841J95469O4387L5763m0397M9190J02823
$$ -193005 -106034 -12504 -13578 -133468 -260309 -64840 -453 35310 -5087 44103 146926
16788A46926J32261j80040L3372R3386j35494k9008p0842j82751k5249P9668j7153
$$ 146926 279187 99147 132519 225905 90411 61403 -9439 -192190 -217439 -137771 -154924
16777a54924j41260j21553J38159K7506j10674J09858J32778J43899K00184P8264
$$ -154924 -296184 -417737 -279578 -252072 -362746 -252888 -120110 23789 223973 302237
16767C02237q3100k04455j94801J05289J43204L4754L4304r1325j15140j37978
$$ 302237 219137 14682 -180119 -74830 68374 103128 137432 46107 -69033 -207011
16757b07011j35276q262M973J63961J54203L9335o9915p3350K32100M0356k79846
$$ -207011 -342287 -350549 -345576 -181615 -27412 11923 -57992 -131342 100758 141114 -138732
16746a38732r5606j63815j09961K5655L0198M7540K81768J52316k61089o8235
$$ -138732 -234338 -398153 -508114 -482459 -452261 -404721 -122953 29363 -231726 -299961
16736b99961J31801j78214j8415R8403P8871J74144K43910J10964k0012r8959
$$ -299961 -168160 -346374 -364789 -266386 -187515 -13371 230539 341503 321491 222532
16726B22532P8082j0976j14385k13283o2044J20885J8026L1600k3362j73920q7595
$$ 222532 300614 289638 175253 -38030 -100074 20811 38837 70437 47075 -126845 -214440
16715b14440K859Q0814M1025j82389j62237O9329J04599K34400Q5273j71560J53397
$$ -214440 -211581 -130767 -89742 -272131 -434368 -365039 -260440 -26040 59233 -112327 41070
16704D1070R6755p9552r0709j9483J67602L1977j23564j77888R3062J48233J82117
$$ 41070 137825 58273 -32436 -51919 115683 147660 24096 -153792 -60730 87503 269620
16693B69620q0276l92829j83678P3439J36015L85287J48780n6495q5723j68945
$$ 269620 189344 -203485 -387163 -313724 -177709 207578 356358 299863 214140 45195
16683D5195j74276L1171p572J02507j5456k76253o8704O25K53074J56996K00J68434
$$ 45195 -129081 -97910 -105482 -2975 -18431 -294684 -363388 -362763 -109689 47307 47507 215941
16671B15941P7478j41330j11227n6643r3340J41641M7784r7071M4613K89020K70294
$$ 215941 293419 152089 40862 -15781 -109121 32520 80304 -16767 27846 316866 587160
16660E87160J3753j71530k13001M682O6733k0318K8473j64958M1636q489k4761
$$ 587160 600913 429383 216382 221064 287797 267479 295952 130994 172630 164141 139380
16649A39380J08101K3714j45871j4559q7043j99951k02860Q5698R6734Q692o7789
$$ 139380 247481 271195 125324 110765 23722 -176229 -379089 -293391 -196657 -187965 -255754
16638b55754O1410o8183r7795n8013Q8109J28942M9048M3908M29n4125R287J69600
$$ -255754 -194344 -262527 -360322 -418335 -330226 -201284 -152236 -108328 -107899 -162024 -152737 16863
16626A6863J09013R4368N5497q0816j97210j72745n7349J48373L7121K5126N9120
$$ 16863 125876 220244 275741 194925 -2285 -175030 -232379 -84006 -46885 -21759 37361
16615C7361p1109r2027J57012k12130j32103j7468M0567n5191K54781M0525k83038
$$ 37361 -33748 -125775 31237 -180893 -312996 -330464 -289897 -345088 -90307 -49782 -332820
16604c32820k03310J12541J68691r5026R5727K66150J16644p7656k08802K55161
$$ -332820 -536130 -423589 -254898 -349924 -254197 11953 128597 50941 -157861 97300
16594I7300M4511j21656r1605O8593R7807J235n1772k78037R0510l4706k28619
$$ 97300 141811 20155 -71450 -2857 94950 96185 44413 -233624 -143114 -177820 -406439
16583d06439p6137K13664K35305m7261J18089P0236J3274k68059j27240J31818
$$ -406439 -482576 -268912 -33607 -80868 37221 107457 120731 -147328 -274568 -142750
16573a42750J13092J176O4328L9796j58710p1886K3021p7832K0478R0265N6787
$$ -142750 -29658 -28482 35846 75642 -83068 -154954 -131933 -209765 -189287 -99022 -42235
16562d2235m0669L5314j33564j3463J15932r450k06269l7471J30621p4307N2760
$$ -42235 -82904 -47590 -181154 -194617 -78685 -88135 -294404 -331875 -201254 -275561 -222801
16551b22801J87775o6026k28492J76797Q5813Q4359j95862j5411o9050j21623
$$ -222801 -35026 -101052 -329544 -152747 -66934 17425 -178437 -193848 -262898 -384521
16541c84521l992r029J96412K45110K050j41332k64516J18005K24500J51125l2140
$$ -384521 -388513 -397542 -201130 43980 46030 -95302 -359818 -241813 -17313 133812 101672
16530A01672j44391k72607j58275M8526P1160Q8692L63330J01987k44283k40789
$$ 101672 -42719 -315326 -473601 -425075 -353915 -265223 98107 200094 -44189 -284978
16520b84978K00363Q7109K5256o6798K5383K2553J64446p134j54021j11139m4839
$$ -284978 -84615 2494 27750 -39048 -13665 8888 173334 166200 12179 -98960 -143799
16509a43799J3316J21431J51621n5545k5775L3815M8977j29546k83606k06415
$$ -143799 -130483 -9052 142569 87024 61249 95064 144041 14495 -269111 -475526
16499d75526K33505J48949K107j63130p4599k4457r3064J02145J05436K58534
$$ -475526 -242021 -93072 -90965 -254095 -328694 -353151 -446215 -344070 -238634 19900
16489A9900K61925n861M6270j07799j04359J5502p0548J04572k7928j49226J04123
$$ 19900 281825 275964 322234 214435 110076 125578 55030 159602 131674 -17552 86571
16478H6571N34p8139R2382p9855k44407P7142J55375M0983J11998j01547M2674
$$ 86571 87105 8966 101348 21493 -222914 -145772 9603 50586 162584 61037 103711
16467A03711O7255j6536j57067j39728R0622J84893o9003l5466j76458k16875
$$ 103711 170966 154430 -2637 -142365 -51743 133150 64147 28681 -147777 -364652
16457c64652O0201K38074N3125J1187M371k06444n9962Q1847j434r1587J45469
$$ -364652 -304451 -66377 -13252 -2065 2306 -204138 -264100 -182253 -183687 -275274 -129805
16446a29805J03972m7257m3131J23893L426k16588j47797J07269N3643R3672Q8896
$$ -129805 -25833 -73090 -116221 7672 11098 -205490 -353287 -246018 -192375 -98703 -9807
16435i807j64515p8596J82743q6410j9095r2397J19803K34310J61221n7609j33349
$$ -9807 -174322 -252918 -70175 -156585 -175680 -268077 -148274 86036 247257 189648 56299
16424E6299m6768j31515M7745L2398q6055O7236K9661q1797p6619n623J1820J36295
$$ 56299 9531 -121984 -74239 -41841 -127896 -60660 -30999 -112796 -189415 -195038 -183218 -46923
16412d6923l2991K09324J50621o8917o0417q4326q0792k70566r0093n0541M5729
$$ -46923 -79914 129410 280031 211114 150697 66371 -14421 -284987 -375080 -425621 -379892
16401c79892N519j31475M697P8821n5005j63652J81865J85828O1253J8854q7265
$$ -379892 -374373 -505848 -501151 -422330 -477335 -640987 -459122 -273294 -212041 -193187 -280452
16390b80452K1832q3843m148P9988k1554P060k0804q6192k5022L530L5014O8067
$$ -280452 -258620 -342463 -346611 -266623 -288177 -281117 -301921 -388113 -413135 -409605 -374591 -306524
16378c06524J65197q7225J16716J57472O6091J01746o5170q1646O6418j2962r330
$$ -306524 -141327 -228552 -111836 45636 111727 213473 148303 66657 133075 120113 110783
16367A10783k09294j87756j37894J30349Q7599J09753o3155o591o7729k91424
$$ 110783 -98511 -286267 -424161 -293812 -206213 -96460 -159615 -166206 -233935 -525359
16357e25359J19942J79763J93697q823p9539J85982R2061j45301r9390J20309
$$ -525359 -405417 -225654 -31957 -40780 -120319 65663 157724 12423 -86967 33342
16347C3342J41726k6256j60740M4257n9123n5613J55546J97288p1797k30365R465
$$ 33342 175068 148812 -11928 32329 -26794 -82407 73139 270427 198630 -31735 -22270
16336b2270m297L6694j00848j51940J51482J65108J4544q8399j0324r2901p0577
$$ -22270 -26567 10127 -90721 -242661 -91179 73929 88473 74 -10250 -103151 -173728
16325a73728j51121O9473m5070o4969N7049p8285K7384K14696J51526l1667k03823
$$ -173728 -324849 -255376 -300446 -365415 -308366 -386651 -359267 -144571 6955 -24712 -228535
16314b28535J33554K13183K10118n3150o9351J05129k04417k25926j0363J56479
$$ -228535 -94981 118202 328320 275170 205819 310948 106531 -119395 -129758 26721
16304B6721p102p9464K3852M571N0549Q4358P3788J4579k10303j47181j50063
$$ 26721 19619 -59845 -35993 -31422 19127 103485 177273 191852 -18451 -165632 -315695
16293c15695Q7405j15712k3868K05957J71476k45999l9661K48572K04389J5560
$$ -315695 -228290 -344002 -367870 -161913 9563 -236436 -276097 -27525 176864 192424
16283A92424k16228m2749o9843N1839K14001J9435j02958J8031P0252K25913R1948
$$ 192424 -23804 -66553 -136396 -84557 129444 148879 45921 63952 134204 360117 452065
16272D52065Q7005p6450l20703j50637N9064K1563m0562J05865L0940k61844q3523
$$ 452065 539070 462620 141917 -8720 50344 71907 31345 137210 168150 -93694 -177217
16261a77217K11056R4613Q0177l7278j14647p6932K35391k1551j71137o2904j13701
$$ -177217 33839 128452 208629 171351 56704 -20228 215163 193612 22475 -40429 -154130
16250a54130O8178J02606J35733J04710J57864j63907j74379j40706k61181O6841
$$ -154130 -85952 16654 152387 257097 414961 251054 76675 -64031 -325212 -258371
16240b58371L05958O7034Q412r266q8750j52704P9964M1773j22939j0109J37587
$$ -258371 47587 114621 123033 113767 25017 -127687 -47723 -5950 -128889 -138998 -1411
16229a411m4166p6459J36588K68280j62524K5660l046j52038J42312j0537o4674
$$ -1411 -45577 -122036 14552 282832 120308 145968 142922 -9116 133196 122659 57985
16218E7985J8174j7378R4019n3879J0039k41050k88340p5494J49862m0200k071
$$ 57985 76159 58781 152800 98921 108960 -132090 -420430 -495924 -346062 -386262 -388333
16207c88333J84462J54966Q8942K63581q6377k04359Q9131L3459J6340K8489K28137
$$ -388333 -203871 -48905 40037 303618 217241 12882 102013 135472 151812 180301 408438
16196D08438J65260l20499l2340k9073j49841O7065L2584J427o014M9361j37406
$$ 408438 573698 253199 220859 191786 41945 109010 141594 143021 137007 186368 48962
16185D8962o2366n6318l5171p486J47081R4377j77224j22125k5827J62499L0848
$$ 48962 -13404 -69722 -104893 -112379 34702 129079 -48145 -170270 -196097 -33598 -2750
16174b750J7375J76117J26126o1169j95401o6003N5037K3347n1249j9062Q5671
$$ -2750 14625 190742 316868 255699 60298 -5705 49332 72679 21430 2368 88039
16163H8039q050k06744L08509L46666k85353j62396j00929j12136J13712p9878
$$ 88039 79989 -126755 181754 528420 243067 80671 -20258 -132394 -18682 -98560
16153i8560q1802K61649o450l16933o5714N8360r5242j2425K6629K30966K34406
$$ -98560 -180362 81287 74837 -242096 -307810 -249450 -344692 -357117 -330488 -99522 134884
16142A34884k56168j54705N4688J19333o7808l4216L3221j41742j78460M138L18431
$$ 134884 -121284 -275989 -221301 -101968 -169776 -203992 -170771 -312513 -490973 -486835 -168404
16131a68404J39498l6645j3481K1745p9649J33795n2928j93796n7147P8913K0432
$$ -168404 -28906 -65551 -79032 -57287 -136936 -3141 -56069 -249865 -307012 -228099 -207667
16120b07667O0961J10811l8014k18865k4395J4473R1243m8526K0205j03189J09883
$$ -207667 -146706 -35895 -73909 -292774 -317169 -302696 -211453 -259979 -239774 -342963 -233080
16109b33080j1160p5734J10099j20190P3951K2065n7548k0516J47420O3255N2751
$$ -233080 -244240 -319974 -209875 -330065 -256114 -234049 -291597 -312113 -164693 -101438 -48687
16098d8687P969M849J54349l9484J02532m3887j80965l03415K05463J83212J4679
$$ -48687 -40718 -35869 118480 78996 181528 137641 -43324 -346739 -141276 41936 56615
16087E6615R4104J15298r847j0456n3748j08535m2096J56429j75591r7740k03074
$$ 56615 150719 266017 256170 245714 191966 83431 41335 197764 22173 -75567 -278641
16076b78641j6502K03630J2297j00207j34310o995K90543J86506j66190j70383
$$ -278641 -295143 -91513 -79216 -179423 -313733 -320728 -30185 156321 -9869 -180252
16066a80252j21871K7614K41671O7110j62850j44328J89495K30097k7842j04256
$$ -180252 -302123 -274509 -32838 34272 -128578 -272906 -83411 146686 118844 14588
16056A4588o3581k1617o927n9353K21960L01163j12213l68481j38352J83186J1219
$$ 14588 -48993 -70610 -77537 -136890 85070 386233 274020 -94461 -232813 -49627 -38408
16045c8408J60183J14679j19586j62070K6663o8490m3136o4033K6194K6463J9629
$$ -38408 121775 236454 116868 -45202 -18539 -87029 -130165 -194198 -168004 -141541 -121912
16034a21912m9265Q822L6257K37951p586Q8338L8352M1585j64032j61543n606
$$ -121912 -171177 -162355 -126098 111853 104267 192605 230957 272542 108510 -53033 -58639
16023e8639N4884n5159j46963K70222k3766j27023o0821R5784q5799k3543q4113
$$ -58639 -3755 -58914 -205877 64345 40579 -86444 -147265 -51481 -137280 -160823 -244936
16012b44936M9185Q1384P6425O5979J9994m966j55366J71187J64584j81379q1365
$$ -244936 -195751 -114367 -37942 28037 48031 43065 -112301 58886 223470 42091 -39274
16001c9274j09119p6859J23669J09035R8283l1231q9978j31043J9831N4780L5181
$$ -39274 -148393 -225252 -101583 7452 105735 74504 -15474 -146517 -126686 -71906 -36725
15990c6725O2266R5454n9121n6351J36879o9374m5978O264P8030Q8199j99323
$$ -36725 25541 120995 61874 5523 142402 73028 27050 33314 111344 199543 220
15979B20l95697L6981J24818J52220m875Q2249k1951Q1860K53079l1048j02493
$$ 220 -395477 -358496 -233678 -81458 -86333 -4084 -26035 55825 308904 277856 175363
15968A75363m0060o3839j0460j41732k43262r7997q9423P0306L13233K65758R1376
$$ 175363 135303 71464 61004 -80728 -323990 -421987 -511410 -441104 -127871 137887 229263
15957B29263j12943q3441Q7684j1004n7793j36212K0678L6068l3797k10330j84789
$$ 229263 116320 32879 120563 109559 51766 -84446 -63768 -27700 -61497 -271827 -456616
15946d56616P1903J40659k8457n2773l5418J50828k38891k05971J01285J98323
$$ -456616 -384713 -244054 -272511 -325284 -360702 -209874 -448765 -654736 -553451 -355128
15936c55128K77591o1721j15027j8519J75186K46625J24709J0606M1580O262j79856
$$ -355128 -77537 -139258 -254285 -272804 -97618 149007 273716 284322 325902 332164 152308
15925A52308j29502k2299o9253l4119J94397K34497j11735l16196j61352m4572
$$ 152308 22806 507 -68746 -102865 91532 326029 214294 -101902 -263254 -307826
15915c07826J07203K4691l334j18053n8243J44903r3378L451j9639J8259Q1021
$$ -307826 -200623 -175932 -179266 -297319 -355562 -210659 -304037 -300586 -320225 -301966 -220945
15904b20945q3591J35787K12360j11388j12087r888K83344J02125j09096p4327
$$ -220945 -304536 -168749 43611 -67777 -179864 -189752 93592 195717 86621 12294
15894A2294J3159K2599o4576m4129J26918J24709N764J15202L7773J2748k11550
$$ 12294 25453 48052 -16524 -60653 66265 190974 196738 311940 349713 362461 150911
15883A50911k9128q1877r0080j27851l3754J90582R0344M8983p5145q919M9210
$$ 150911 121783 39906 -50174 -178025 -211779 -21197 69147 118130 42985 34066 83276
15872H3276J17277M8050j38244K0348J30333o4725j84442k9458J6102j47344J43707
$$ 83276 200553 248603 110359 130707 261040 196315 11873 -17585 -1483 -148827 -5120
15861e120K48791j00643j78318j65479Q9950K39837J5643r8104j48207N7494L910
$$ -5120 243671 143028 -35290 -200769 -110819 129018 144661 46557 -101650 -44156 -40246
15850d0246o3470L720q438M1105l5062n691J16924o6143P766J07575J12523K7161
$$ -40246 -103716 -99996 -108434 -67329 -102391 -108082 8842 -57301 -49535 58040 170563 197724
15838A97724j09542n7876R1070m1625j98386O6911j05475Q5470J55963q8202J55748
$$ 197724 88182 30306 121376 79751 -118635 -51724 -157199 -71729 84234 -3968 151780
15827A51780m3836m2031K6732L35392p9347k10994j31590k70920k38281o9929
$$ 151780 107944 65913 92645 428037 348690 137696 6106 -264814 -503095 -573024
15817e73024N3360L9346K03918n4099j0232K07476J76911J17159p6460O7205k04
$$ -573024 -519664 -480318 -276400 -330499 -340731 -133255 43656 160815 84355 151560 151356
15806A51356q8194R7759O2312O1236J19710n928k54568m0820o2809j14232m4482
$$ 151356 63162 160921 223233 284469 404179 398251 143683 102863 40054 -74178 -118660
15795a18660q7566L08640K61367j66193o9274j83808k31662l5191J72546o4251
$$ -118660 -206226 102414 363781 197588 128314 -55494 -287156 -322347 -149801 -214052
15785b14052N0208O4246J2119J20686K7375K6637o6390Q174j41146Q4406J83331
$$ -214052 -163844 -99598 -87479 33207 60582 87219 20829 29003 -112143 -27737 155594
15774A55594K2715k00792p7270J20664K5225j27522o9921R7255l5320J8660P4483
$$ 155594 178309 -22483 -99753 20911 46136 -81386 -151307 -54052 -89372 -70712 3771
15763C771j33548M1275R5390L9785O0529l2425p993r0220j94300p3434J23174
$$ 3771 -129777 -88502 6888 46673 107202 74777 66784 -23436 -217736 -291170 -167996
15752a67996J3729N9281O9398o6730k7393J40775J32588m1566r95O5504j21654
$$ -167996 -154267 -94986 -25588 -92318 -119711 21064 153652 112086 111091 176595 54941
15741E4941k37058J25988J36858O325j87711Q4662P2102J11240m444r1072M7075
$$ 54941 -182117 -56129 80729 87054 -100657 -15995 56107 167347 162903 71831 118906
15730A18906Q2259q7871m5373j57593P6509M13383j19574j94436R7967r3916L3540
$$ 118906 201165 113294 67921 -89672 -13163 400220 280646 86210 184177 90261 123801
15719A23801l8045M4612m7067q4411j3953J22393N1980J18087o3370j22112N519
$$ 123801 85756 130368 83301 -1110 -15063 107330 159310 277397 214027 91915 97434
15708I7434K8042j61492K7739J90921k3295J1897j67428n5472O3099k7073K4627
$$ 97434 125476 -36016 -8277 182644 159349 171246 3818 -51654 11445 -15628 8999
15697H999Q634P4663J41451j8729j2748r9376r687k57033k58184R0900J79220
$$ 8999 17633 92296 233747 215018 202270 102894 93207 -163826 -422010 -331110 -151890
15686a51890K9679J18676J14597J01630J06377k14306j90649N6032J786J39716
$$ -151890 -122211 -3535 111062 212692 319069 104763 -85886 -29854 -28068 111648
15676A11648J67743q8045J20111J11956m1286l55131o7878n033J11557k3257j23247
$$ 111648 279391 191346 311457 423413 382127 26996 -40882 -45915 65642 42385 -80862
15665h0862j50674j29400Q8748K6758n0160n4707K04784K40172M8110j06816Q1295
$$ -80862 -231536 -360936 -272188 -245430 -295590 -350297 -145513 94659 142769 35953 117248
15654A17248k29908n6961q4303r4154p6341n884K4497k39505k02151K570K24193
$$ 117248 -112660 -169621 -253924 -348078 -424419 -430303 -405806 -645311 -847462 -844892 -620699
15643f20699J39496J94461m0483k15231K05545J76129m083j7764Q7552j56907
$$ -620699 -481203 -286742 -327225 -542456 -336911 -160782 -164865 -182629 -95077 -251984
15633b51984m024P1999p1622J7162N6517N6276J52795o6109o9170j2857J1259
$$ -251984 -256008 -184009 -255631 -238469 -181952 -125676 27119 -38990 -108160 -121017 -109758
15622a09758J60125J06360m9887P7408j09774J08945K79876q5507j77994j80981
$$ -109758 50367 156727 106840 184248 74474 183419 463295 377788 199794 18813
15612A8813p4178K88467J4146r4378j53907k0509J00759M3444J74383j29709l20985
$$ 18813 -55365 233102 247248 152870 -1037 -21546 79213 122657 297040 167331 -153654
15601a53654j48157p1943J78479L8068j36834n6281q005p921J56009P4966K1917
$$ -153654 -301811 -373754 -195275 -157207 -294041 -350322 -358327 -366248 -210239 -135273 -113356
15590a13356J33366r3420j9540L4760M3114O9750q5347l2388j166M9116J85279
$$ -113356 20010 -73410 -92950 -58190 -15076 54674 -30673 -63061 -64227 -15111 170168
15579A70168j27752j30011J8256j39866m0857L786J10697L5836o9289J32009L06779
$$ 170168 42416 -87595 -69339 -209205 -250062 -246276 -135579 -99743 -169032 -37023 269756
15568B69756N9402j74369k00417n6390K5042Q4469K11732R5876j64199j93118
$$ 269756 329158 154789 -45628 -102018 -76976 7493 219225 315101 150902 -42216
15558d2216o8342m63J3330k934O8693k8007p5340n211J7747l2571n2476k2575
$$ -42216 -110558 -111021 -97691 -100625 -31932 -59939 -135279 -140490 -122743 -155314 -207790 -230365
15546b30365K57756J34627J05144j04016Q3445o1077k52174k04548O240R6632
$$ -230365 27391 162018 267162 163146 246591 185514 -66660 -271208 -264968 -168336
15536a68336P5324K79126l3359j56341j00501J43878m2363l02507k25792N0477
$$ -168336 -93012 186114 152755 -3586 -104087 39791 -2572 -305079 -530871 -480394
15526d80394J82175L5327L9209j36814r4710K1008J61121j07902M6485J8098J63847
$$ -480394 -298219 -262892 -223683 -360497 -455207 -434199 -273078 -380980 -334495 -316397 -152550
15515a52550J49918P74p0275O6637p7230j72684j35833J73221J79659J9489p8155
$$ -152550 -2632 -1858 -72133 -5496 -82726 -255410 -391243 -218022 -38363 -18874 -97029
15504i7029m0480j67880j03954O490r2105M8977J93780K31097J92643K23362j20193
$$ -97029 -137509 -305389 -409343 -402853 -494958 -445981 -252201 -21104 171539 394901 274708
15493B74708j93579J04687L326r0670j16229o3724J10477M3018J4759J0083j62081
$$ 274708 81129 185816 189142 98472 -17757 -81481 28996 72014 86773 96856 -65225
15482f5225j77631O9427J63443L15667J28160J27330q7511J404q8704j65484j6797
$$ -65225 -242856 -173429 -9986 305681 433841 561171 473660 475064 386360 220876 204079
15471B04079j06879m5972J2845J9443J4410L13889n5814k33972k5294R8248J30808
$$ 204079 97200 51228 64073 83516 97926 411815 356001 122029 96735 194983 325791
15460C25791j19729o1172r4756j12799Q46m3732L3411p4488J7668K58425k07042
$$ 325791 206062 144890 50134 -62665 -61819 -105551 -72140 -146628 -128960 129465 -77577
15449g7577q0863J69896Q003l1282o6460r577J3976p4879j35608l1243n9890K16662
$$ -77577 -158440 11456 19459 -11823 -78283 -87860 -73884 -148763 -284371 -315614 -375504 -158842
15437a58842R9506L5246j23783M2079q00j00943J01460K13470K08102P0992j55333
$$ -158842 -59336 -24090 -147873 -105794 -106594 -207537 -106077 107393 315495 386487 231154
15426B31154j06245j76519l3983K426J40898J05791j43803J06904J10178j47108
$$ 231154 124909 -51610 -85593 -83167 57731 163522 19719 126623 236801 89693
15416H9693m8576p6765l1539J50209k5715o23K38342J71248J1488l13771j8535
$$ 89693 41117 -35648 -67187 83022 57307 56684 295026 466274 477762 163991 145456
15405A45456n2136j4673n2922k29286N9177J59571Q4473O6866m5086j87492k07530
$$ 145456 93320 78647 25725 -203561 -144384 15187 99660 166526 121440 -66052 -273582
15394b73582L626P7085o1003N4471K17281J26356k11801j13835J5619k4418J09626
$$ -273582 -269956 -192871 -253874 -199403 17878 144234 -67567 -181402 -165783 -190201 -80575
15383h0575k2974m8782J27613K63413R1575k53381r640K9244n607J4366Q7770
$$ -80575 -103549 -152331 -24718 238695 330270 76889 67249 96493 90886 105252 193022
15372A93022M8955j37743l32042p1692K423Q5747j8604J93207M5711o5414J02368
$$ 193022 241977 104234 -227808 -299500 -297077 -211330 -229934 -36727 8984 -56430 45938
15361D5938R738K08658k69643m3141N5501j8355j5508J10107K03316j06760j23560
$$ 45938 55676 264334 -5309 -48450 7051 -11304 -26812 83295 286611 179851 56291
15350E6291m73l9564q5925L7719K64151j0495j59595K6923l5809K9576J1822p7790
$$ 56291 55818 16254 -69671 -31952 232199 221704 62109 89032 53223 82799 94621 16831
15338A6831j49781j0547J2151J3896O5819q7909j7512j1274q6351N6526m8939
$$ 16831 -132950 -143497 -131346 -117450 -51631 -139540 -157052 -168326 -254677 -198151 -247090
15327b47090J32259J53329J20419k5840R9823j34296j93891K54492l8792q1720
$$ -247090 -114831 38498 158917 133077 232900 98604 -95287 159205 120413 38693
15317C8693j58955J92219J64963q7189j74567l4200k8667K6166K8267K03930j2047
$$ 38693 -120262 71957 236920 149731 -24836 -59036 -87703 -61537 -33270 170660 158613
15306A58613k2249L7069N5200j11724n6993r6536j14469M6167J11864J94702J18888
$$ 158613 136364 173433 228633 116909 59916 -36620 -151089 -104922 6942 201644 320532
15295C20532Q5453J8516j04998k70186k38604L7322J1126Q9186k0367J2074N2413
$$ 320532 405985 424501 319503 49317 -189287 -151965 -140839 -51653 -72020 -59946 -7533
15284g533J24946J83160L9415J6870p7936j79371j449j752k71239j11408K28733
$$ -7533 117413 300573 339988 356858 278922 99551 98102 96350 -174889 -286297 -57564
15273e7564J2817j61499q5202k9473K8807J25422K8450K25848J00108p1567J12095
$$ -57564 -44747 -206246 -291448 -320921 -292114 -166692 -138242 87606 187714 116147 228242
15262B28242P0393k1135M9257K9031j93182o7340J78803N1330l53030j38682L32067
$$ 228242 298635 277500 326757 355788 162606 95266 274069 325399 -27631 -166313 165754
15251A65754M4918q064n5615j0454J42203L331k52706k69896L3087R3118K07148
$$ 165754 210672 202608 146993 136539 278742 282073 29367 -240529 -207442 -114324 92824
15240I2824j63519r3470p3643K2124K79765M5328p9001j27287J7135J78215L8079
$$ 92824 -70695 -164165 -237808 -215684 64081 109409 30408 -96879 -79744 98471 136550
15229A36550J42434K8312j36406j90548n7474J02080r0729r201o0125P2113R1952
$$ 136550 278984 307296 170890 -19658 -77132 24948 -65781 -74982 -135107 -62994 28958
15218B8958j50987o0483K27753N0768k26976k77588J76057o0584P964J88119K63574
$$ 28958 -122029 -182512 45241 96009 -130967 -408555 -232498 -293082 -285118 -96999 166575
15207A66575J08004O48j6632N0068l1570J62712r2864k7740j07628j52691j80186
$$ 166575 274579 275227 258595 308663 277093 439805 346941 319201 211573 58882 -121304
15196a21304J921J45474j06360j29630Q1875J84950K7466j29271M8843j075n8477
$$ -121304 -119383 26091 -80269 -209899 -128024 56926 84392 -44879 3964 2889 -55588
15185e5588P748P9129j52118Q317K6931O321J34701R6574n6370j05639n3105J54827
$$ -55588 -47840 31289 -120829 -112512 -85581 -79260 55441 152015 95645 -9994 -63099 91728
15173I1728J07486n0359l50514l8507L7292O8655Q5645J11142R7532k77780n3670
$$ 91728 199214 148855 -201659 -240166 -202874 -134219 -48574 62568 160100 -117680 -171350
15162a71350l814j01404N8370O0490J06858M9492n513L90019L5181k48637j23443
$$ -171350 -175164 -276568 -218198 -157708 -50850 -1358 -6871 383148 418329 169692 46249
15151D6249j98915L0394J11879O1278Q9567k7462K35476M5329j69056n7180q836
$$ 46249 -152666 -122272 -10393 50885 140452 112990 348466 393795 224739 167559 158723
15140A58723q2880J41646O6209k58176j23610j55137N2792N1161J7179J08582
$$ 158723 75843 217489 283698 25522 -98088 -253225 -200433 -149272 -132093 -23511
15130b3511k2611K02327p3507J9158j39305M0312K88116j68152O1470J17141j15597
$$ -23511 -46122 156205 82698 101856 -37449 2863 290979 122827 184297 301438 185841
15119A85841j49518Q3905J4645J3591N5200N9666K0006M5283j05345p2285j31803
$$ 185841 36323 120228 134873 148464 203664 263330 283336 328619 223274 150989 19186
15108A9186M6788j2557r8052M7026j93883R2480J31785l086k1193K2437L1917
$$ 19186 65974 53417 -44635 2391 -191492 -99012 32773 29687 8494 30931 62848
15097F2848k7395j56032J28368J13179r9466l4920J18876J15187M0165o3184J27845
$$ 62848 35453 -120579 7789 120968 21502 -13418 105458 220645 260810 197626 325471
15086C25471j0148j36657m0068O5981k4032r1408Q9985J21591k92434j17652K88921
$$ 325471 315323 178666 138598 204579 180547 89139 179124 300715 8281 -109371 179550
15075A79550J11933J3525J07896K8729k24075j48835j06124O2019j0846L9814
$$ 179550 291483 305008 412904 441633 217558 68723 -37401 24618 13772 53586
15065E3586q4790q6469J97992J54495K9963r8443j84995J3332J40355j04586j82472
$$ 53586 -31204 -117673 80319 234814 264777 166334 -18661 -5329 135026 30440 -152032
15054a52032r6947J67604J737l5243L45336R7273n3932m4350j14528J42849Q5467
$$ -152032 -248979 -81375 -79638 -114881 230455 327728 273796 229446 114918 257767 343234
15043C43234k3086n9758j8229j64326j82441K03541j40157r1819M9253J01123
$$ 343234 320148 260390 242161 77835 -104606 98935 -41222 -133041 -83788 17335
15033A7335J42218J39147m5861j81160k406o455j5995L4202J36699j68516L7771
$$ 17335 159553 298700 252839 71679 69273 62818 46823 81025 217724 49208 86979
15022H6979j08858o6220j19198j03234k8J08579O2317J0333j15512j48090l4610
$$ 86979 -21879 -88099 -207297 -310531 -310559 -201980 -139663 -129330 -244842 -392932 -427542
15011d27542J52599L19632r4140J03611K11853o1299r3363p2727k21431r469O1832
$$ -427542 -274943 44689 -49451 54160 266013 204714 111351 38624 -182807 -192276 -130444
15000a30444j53723J4180J42854N8920O3625K03805r0185j51452M0616R4214o6899
$$ -130444 -284167 -269987 -127133 -68213 -4588 199217 109032 -42420 -1804 92410 25511
14989B5511j87207J574L9660K4102N6790M3008J2252o711m1585Q8232J18865O659
$$ 25511 -161696 -160122 -120462 -96360 -39570 3438 15690 8979 -32606 55626 174491 181150
14977A81150j3494p7097J0631J69223k26260k84923J13818J44218o0994J2720
$$ 181150 167656 90559 101190 270413 44153 -240770 -126952 17266 -43728 -31008
14967c1008k0616Q3164P0479l5940j05012n6770K6242M3732o5687p7845N0558
$$ -31008 -51624 31540 102019 66079 -38933 -95703 -69461 -25729 -91416 -169261 -118703
14956a18703k1457Q3087J67305O8953q5090l9373k2238N0138j19513o9900K539
$$ -118703 -140160 -57073 110232 179185 94095 54722 32484 82622 -36891 -106791 -104252
14945a04252j73891j4137J8748R7172N3175k2528R5173Q8525J73282j9470K2372
$$ -104252 -278143 -292280 -273532 -176360 -123185 -145713 -50540 37985 211267 191797 214169
14934B14169r5974q6486j64114r3204p3456j0314J39636L0066R7396N8652m2321
$$ 214169 118195 31709 -132405 -225609 -299065 -309379 -169743 -139677 -42281 16371 -25950
14923b5950J85587j14115j64811O3027J30366J1961o5644K3202N7085O4390r3375
$$ -25950 159637 45522 -119289 -56262 74104 86065 20421 43623 100708 165098 71723
14912G1723L0769j7850j87737j8583o4609Q7281J05212j8709R627n3712M9095
$$ 71723 102492 84642 -103095 -121678 -186287 -99006 6206 -12503 -2876 -56588 -7493
14901g493R1025j56250n8726q874J4663m5686Q8234J41328J26067k52868l11560
$$ -7493 83532 -72718 -131444 -140318 -125655 -171341 -83107 58221 184288 -68580 -380140
14890c80140K72838J60037N8511J24682j02369l24161R3761O6981j07869N5948
$$ -380140 -107302 52735 111246 235928 133559 -190602 -96841 -29860 -137729 -81781
14880h1781J14871j29087k40346k74725n1160K91923K55218P6180J62378O7041
$$ -81781 33090 -95997 -336343 -611068 -662228 -370305 -115087 -38907 123471 190512
14870A90512j86166K40665J40983k10568k65431j04616J08911J54799j07586N6664
$$ 190512 4346 245011 385994 175426 -90005 -194621 -85710 69089 -38497 18167
14860A8167J59018j11702k04138k7467P3587R791m5596M7919P2732p791L6627
$$ 18167 177185 65483 -138655 -166122 -92535 -82744 -128340 -80421 -7689 -15480 21147
14849B1147J92057k5811j66581j41236Q8325m1416M5283R2561j45307K3872J0044
$$ 21147 213204 187393 20812 -120424 -32099 -73515 -28232 64329 -80978 -57106 -47062
14838d7062N8214J78892J6869l0420j06050J28918Q4184j9402l4574K4618K5430
$$ -47062 11152 190044 206913 176493 70443 199361 283545 264143 229569 254187 279617
14827B79617J39339j56821j57036J8833j43886l7125p2841Q995K2699Q541n7743
$$ 279617 418956 262135 105099 123932 -19954 -57079 -129920 -120925 -98226 -89685 -147428
14816a47428j13515J61859J08910j40766J29446J42625K8895R3861N5974j28930
$$ -147428 -260943 -99084 9826 -130940 -1494 141131 170026 263887 319861 190931
14806A90931m24j54961p7957l1067J53234P3311R4296o8070m2928Q6160J43665
$$ 190931 190507 35546 -42411 -73478 79756 153067 247363 179293 136365 222525 366190
14795C66190j00291k20513n9924n5619m4440j35262j41680O8555K03797R5699
$$ 366190 265899 45386 -14538 -70157 -114597 -249859 -391539 -322984 -119187 -23488
14785b3488Q9852j65346k1922j60837J31746K08887l9859K6282L1128k1267L6408
$$ -23488 66364 -98982 -120904 -281741 -149995 58892 19033 45315 76443 55176 91584
14774I1584j32694j56547N2405J3330K07714J339p4066J633n451j01656K27957
$$ 91584 -41110 -197657 -145252 -131922 75792 77131 3065 4698 -753 -102409 125548
14763A25548J05679L9596P0321M0064k40416m6452K56465J48172j51563k04115
$$ 125548 231227 270823 341144 381208 140792 94340 350805 498977 347414 143299
14753A43299l6158p3503R3216K37534p7694o4518J5940O3107O7016N7213k06312
$$ 143299 107141 33638 126854 364388 286694 222176 238116 301223 368239 425452 219140
14742B19140j73322J39958R808J33083q6988j79889r3984O6357J79887K97369
$$ 219140 45818 185776 195584 328667 241679 61790 -32194 34163 214050 511419
14732E11419J9388j23187k06457j97455j91006K154J55268j65155k40730n6552
$$ 511419 530807 407620 201163 3708 -187298 -185144 -29876 -195031 -435761 -492313
14722d92313J57070J34337J7953J45984n9756j23824q3934o1914J22109J27298
$$ -492313 -335243 -200906 -182953 -36969 -96725 -220549 -304483 -366397 -244288 -116990
14712a16990P7167J28384R172j46249j8952J01316N7970K954R6709j4945m49925
$$ -116990 -39823 88561 97733 -48516 -67468 33848 91818 94772 191481 176536 -273389
14701b73389p0345J60588j0159J24917J14437K2598r0644p4901k78112l4161J24490
$$ -273389 -343734 -183146 -193305 -68388 46049 68647 -21997 -96898 -375010 -409171 -284681
14690b84681J07404J02538J64945j28086k34075N7601J31741K64012J00721q7942
$$ -284681 -177277 -74739 90206 -37880 -271955 -214354 -82613 181399 282120 194178
14680A94178k8076j66457j61127k2521K9363J667m1303R8212J53539J2703k8772
$$ 194178 166102 -355 -161482 -184003 -154640 -152973 -194276 -96064 57475 70178 41406
14669D1406O0655J06382o6459j5352J79900J68072j06404j47349p4408k40439
$$ 41406 102061 208443 141984 126632 306532 474604 368200 220851 146443 -93996
14659i3996m1075n037l6890N5968q1440j632L1015P1192O4238J34435j2805k77536
$$ -93996 -135071 -140108 -176998 -121030 -202470 -204102 -173087 -101895 -37657 96778 83973 -193563
14647a93563p9815m9746O1592J73453K04305R0246l2947J54394M8745O2317j14492
$$ -193563 -273378 -323124 -261532 -88079 116226 206472 173525 327919 376664 438981 324489
14636C24489j89294j42575j81259J83318P4899K3042M8404K0897L4051k2455j98885
$$ 324489 135195 -7380 -188639 -5321 69578 92620 141024 161921 195972 173517 -25368
14625b5368O8914J39029M9205n44j29461N7772K99781J12742l2277m596K7126
$$ -25368 43546 182575 231780 231236 101775 159547 459328 572070 539793 535197 562323
14614E62323M9854k22092N1487K4200J9840K9406o0984p841j9232m8188j49701
$$ 562323 612177 390085 441572 465772 485612 515018 454034 446193 426961 378773 229072
14603B29072P848J2204M27r462j01977k66209k42466n0317N2710K14497o3585
$$ 229072 236920 249124 249551 240089 138112 -128097 -370563 -420880 -368170 -153673 -217258
14592b17258q5592j33187J20314J83989j37562k8139L9602M7451Q9974P8713J02745
$$ -217258 -302850 -436037 -315723 -131734 -269296 -297435 -257833 -210382 -120408 -41695 61050
14581F1050N5680J27890J18585J97090j07527k55320n6281j03800l6830k59538
$$ 61050 116730 244620 363205 560295 452768 197448 141167 37367 537 -259001
14571b59001l8330K19672J78154k1502J09203k4087r5696j1951O0259j58648L4935
$$ -259001 -297331 -77659 100495 78993 188196 164109 68413 56462 116721 -41927 -6992
14560f992J5242k10264L29447J24366j00087l06942N951J25450M8354K41846J35283
$$ -6992 8250 -202014 127433 251799 151712 -155230 -149279 -23829 24525 266371 401654
14549D01654j70852j20792j76129j59086J99477K2873N2060L0190l4669q4857
$$ 401654 230802 110010 -66119 -225205 -25728 -2855 49205 79395 44726 -40131
14539d0131o1097L9144p3716J29785j76746j59523L2139J0457J12497J54905j11179
$$ -40131 -101228 -62084 -135800 -6015 -182761 -342284 -310145 -299688 -187191 -32286 -143465
14528a43465p5147o2869K6500J37960N4006O2741q0810K34991R0408m364j09906
$$ -143465 -218612 -281481 -254981 -117021 -63015 -274 -81084 153907 244315 239951 130045
14517A30045j84760k88387M4761J15252K7003J43894K73606J36860j43662k54245
$$ 130045 -54715 -343102 -298341 -183089 -156086 -12192 261414 398274 254612 367
14507C67k1449J27297Q0343K3515j00776K6296j80735j00817j54329l7238k6714
$$ 367 -21082 106215 186558 210073 109297 135593 -45142 -145959 -300288 -337526 -364240
14496c64240j20407J57863K04217J95282R0650k8747K9694j34846l351K03416
$$ -364240 -484647 -326784 -122567 72715 163365 134618 164312 29466 26115 229531
14486B29531j204k14212L5339J77932m7225K1951j94288k86128j61038R9284J79739
$$ 229531 228327 14115 49454 227386 180161 202112 7824 -278304 -439342 -340058 -160319
14475a60319L33116J42577j25097p5560m1781K6644r273j68784j01285K9304J02642
$$ -160319 172797 315374 190277 114717 72936 99580 90307 -78477 -179762 -150458 -47816
14464d7816j8382J05886k513M3113j04203Q9442J27731j99310j76712j06286L6402
$$ -47816 -66198 39688 37175 80288 -23915 65527 193258 -6052 -182764 -289050 -252648
14453b52648J66632J11726J25417j35431j9360K3048j77226R6312L29544n6875
$$ -252648 -86016 25710 151127 15696 -3664 19384 -157842 -61530 268014 211139
14443B11139r0163J32200J23218m5475j40683n6541j08993k29163k53276L16849
$$ 211139 120976 253176 376394 330919 190236 133695 24702 -204461 -457737 -140888
14433a40888N0191l6101J67420n0091k36700J51763J04359J43400q8006j37786
$$ -140888 -90697 -126798 40622 -9469 -246169 -94406 9953 153353 65347 -72439
14423g2439L051J55354P0719O7029L0837J80174J6037j87670q8638J3119k49213
$$ -72439 -69388 85966 156685 223714 254551 434725 450762 263092 174454 187573 -61640
14412f1640k26799Q0245J56296O2295k0182K2611K11027J06976j41663j52855
$$ -61640 -288439 -208194 -51898 10397 -9785 12826 223853 330829 189166 36311
14402C6311Q276J00937P6170P0810J20603j73740j56951J9036l8060Q7482l3166
$$ 36311 44587 145524 221694 292504 413107 239367 82416 101452 63392 150874 117708
14391A17708j49163j8616L1335M71M5466j6766N0705J77626l536j08808j89668
$$ 117708 -31455 -50071 -18736 -18265 27201 10435 61140 238766 235230 126422 -63246
14380f3246k33270Q940K42333O9630Q1962j14800p0076j36765j00784J81766L5229
$$ -63246 -296516 -287576 -45243 24387 106349 -8451 -78527 -215292 -316076 -134310 -99081
14369i9081j90437J5136K01770n8411n9467J53695P7669P9921J80885q0402n0122
$$ -99081 -289518 -274382 -72612 -131023 -190490 -36795 40874 120795 301680 221278 171156
14358A71156l05864L8176O9690n4395K5028P9795j2862K7743O6779r9743L0432
$$ 171156 -134708 -96532 -26842 -81237 -56209 23586 10724 38467 105246 5503 35935
14347C5935J51984R9441m4676m701L6940k64676j42233m8484J60296j0221k3184
$$ 35935 187919 287360 242684 237983 274923 10247 -131986 -180470 -20174 -30395 -53579
14336e3579O4156J11159j0025k27592o7731K09887L24761n7500j5868K5347p2582
$$ -53579 10577 121736 111711 -115881 -183612 26275 351036 293536 277668 303015 230433
14325B30433j63085m6717k8572n5524M9007R7236j80463n2619J50197n5043j6002
$$ 230433 67348 20631 -7941 -63465 -14458 82778 -97685 -150304 -107 -55150 -71152
14314g1152M3135N9216j20018K25606j41457j22649M8709r8142m4888K4178k5896
$$ -71152 -28017 31199 -88819 136787 -4670 -127319 -78610 -176752 -221640 -197462 -223358
14303b23358n0419P6589J44291O2956M355K05578o8523q0605k1777J64326K46168
$$ -223358 -273777 -197188 -52897 10059 14414 219992 151469 70864 49087 213413 459581
14292D59581J00415j67569k03572M0226J31843j50388j39548J74460K2294j01450
$$ 459581 559996 392427 188855 229081 360924 210536 70988 245448 267742 166292
14282A66292j18137p5385L6442K79249j6789p9369j20582J91816J44099k90939
$$ 166292 48155 -27230 9212 288461 271672 192303 71721 263537 407636 116697
14272A16697l7947J31617m4028q9802j23894J61721q812m3310K9748j16504j93156
$$ 116697 78750 210367 166339 76537 -47357 114364 105552 62242 91990 -24514 -217670
14261b17670Q1905J67678J89750K1157j23633k05208j61756j7915Q4068Q2679
$$ -217670 -135765 31913 221663 242820 119187 -86021 -247777 -265692 -181624 -98945
14251i8945r3061J3525r131J79157R0655P5366L9823Q8342l5367K8691P45l5016
$$ -98945 -192006 -178481 -187612 -8455 82200 157566 197389 285731 250364 279055 279800 244784
14239B44784P7128p6789j71036M1021J20723k4469J46180K5050j8757J11963J67824
$$ 244784 321912 245123 74087 115108 235831 211362 357542 382592 363835 475798 643622
14228F43622j06694k88316l2877j99744r0980J3580n7337P3855j73227o4960K72736
$$ 643622 536928 248612 215735 15991 -74989 -61409 -118746 -44891 -218118 -283078 -10342
14217a0342K55901M6791R948J65832M0554l07628n05973L4948J69025L3969M6518
$$ -10342 245559 292350 302298 468130 508684 201056 -304917 -269969 -100944 -66975 -20457
14206b0457r8428n9639J16382q739k37719O4023K2704R6866K51026N6921l12090
$$ -20457 -118885 -178524 -62142 -70881 -308600 -244577 -221873 -125007 126019 182940 -129150
14195a29150j39425j8010l7594K24492J11169J2689K3078M7269j25152L5301L8762
$$ -129150 -268575 -286585 -324179 -99687 11482 24171 47249 94518 -30634 4667 43429
14184D3429M2957J8544l2706j1798j7291j19171J12183O6674n1017K1380k9564
$$ 43429 86386 104930 72224 60426 43135 -76036 36147 102821 51804 73184 43620
14173D3620q6771K4656p6071N5362R4214Q7653j48434q7969j23476k305Q9627
$$ 43620 -43151 -18495 -94566 -39204 55010 142663 -5771 -93740 -217216 -219521 -129894
14162a29894K81231J84826P1613Q5474j51139l72076l540k03240r1012L764p2113
$$ -129894 151337 336163 407776 493250 342111 -29965 -33505 -236745 -327757 -323993 -396106
14151c96106L1316O8342q98k986K29n2512K42434J60755k815l4371j38368m0376
$$ -396106 -364790 -296448 -297346 -300332 -300103 -352615 -110181 50574 47759 13388 -124980 -165356
14139a65356j50492J14091k1659j10028K09143J61750J32171J54674j41356l00599
$$ -165356 -315848 -201757 -223416 -333444 -124301 37449 169620 324294 182938 -117661
14129a17661j98701j1261J41661J22247N1432j41656j30152m0807Q0428K06Q5648
$$ -117661 -316362 -327623 -185962 -63715 -12283 -153939 -284091 -324898 -244470 -244264 -158616
14118a58616q3633Q8294j9925j1905N1950M9747Q0903j10163n0084j14612P6849
$$ -158616 -242249 -153955 -173880 -185785 -133835 -84088 -3185 -113348 -163432 -278044 -201195
14107b01195J06558p1426n4867K16951J29917j22931l9007l5701j702J5923l4698
$$ -201195 -94637 -166063 -220930 -3979 125938 3007 -36000 -71701 -73403 -57480 -92178
14096i2178J0139M7208j20628N6027r0255N6430J70699J60449M5046j41012N1387
$$ -92178 -82039 -34831 -155459 -99432 -189687 -133257 37442 197891 242937 101925 153312
14085A53312J99846j18698j99140j35074j2752N7495K1037j05193J4634n4048
$$ 153312 353158 234460 35320 -99754 -112506 -55011 -33974 -139167 -124533 -178581
14075a78581l6236J74632Q4922j61109J31523N1129k18805j93482j31752M5033
$$ -178581 -214817 -40185 44737 -116372 15151 66280 -152525 -346007 -477759 -432726
14065d32726J29257L09897J36364P0596k29130K2263n7605Q0646K34286l80108
$$ -432726 -303469 6428 142792 213388 -15742 6521 -51084 29562 263848 -116260
14055a16260k64119r743L4708n5745k399j5625K76693L7619q7116j00901q5007
$$ -116260 -380379 -390122 -355414 -411159 -413558 -429183 -152490 -114871 -201987 -302888 -387895
14044c87895K56529J7865k00423R2751j2342p3820J04872J22481q1495K15065
$$ -387895 -131366 -113501 -313924 -221173 -233515 -307335 -202463 -79982 -161477 53588
14034E3588K6485N8342j5007k06032r2208J62872K54223J793k20690k33354k9365
$$ 53588 80073 138415 123408 -82624 -174832 -11960 242263 244056 23366 -209988 -239353
14023b39353M3365K16685J86762l03617j28386R2290q7706j38266p6507J9013
$$ -239353 -195988 20697 207459 -96158 -224544 -132254 -219960 -358226 -434733 -415720
14013d15720J59121J96447o7048O0515K11305J45163m1790n0107q6600n8507L7731
$$ -415720 -256599 -60152 -127200 -66685 144620 289783 247993 197886 111286 52779 90510
14002I0510l2371J14591j76137j61545Q6275k5064k07427j14258K37400K50564
$$ 90510 58139 172730 -3407 -164952 -78677 -103741 -311168 -425426 -188026 62538
13992F2538K12958J8667k1588P4270k20802j65165j98190l0323L61859J58686
$$ 62538 275496 294163 272575 346845 126043 -39122 -237312 -267635 94224 252910
13982B52910r3327j20070r9005p5148O5134j20530j89622j408K86729N6787L4738
$$ 252910 159583 39513 -59492 -134640 -69506 -190036 -379658 -381066 -94337 -37550 -2812
13971b812P340K4817n3936j67595P7551J41088K29208R3594p0204n3929k8540
$$ -2812 4528 29345 -24591 -192186 -114635 26453 255661 349255 279051 225122 196582
13960A96582k76722O086J27475j5185J78757r4648p0973m3687K58328k06230r2694
$$ 196582 -80140 -74054 53421 38236 216993 122345 51372 7685 266013 59783 -32911
13949c2911J13225M3505q5626P0156J59553k2516j00884M8201P2618l745o3324
$$ -32911 80314 123819 38193 108349 267902 245386 144502 192703 265321 261576 198252
13938A98252k0380Q5268k26035n5552J39417J76610O9899o1887j65803p612J32366
$$ 198252 177872 263140 37105 -18447 120970 297580 367479 305592 139789 132177 264543
13927B64543j83777q6511L681Q31J9774P8553K32699O92j96383p6880L9602j55402
$$ 264543 80766 -5745 -2064 -1233 18541 97094 329793 330485 134102 57222 96824 -58578
13915e8578J75180J57407l6231l7588M0261j61330M8906J88565k6305k19266p0005
$$ -58578 116602 274009 237778 200190 240451 79121 128027 316592 290287 71021 1016
13904A016J83065J15870j84165j55259p5434R6598J26974j08554J24681K4719
$$ 1016 184081 299951 115786 -39473 -114907 -18309 108665 111 124792 149511
13894A49511K3111J81332K41850l3088j90136k33447j53448O718K2540j02323
$$ 149511 172622 353954 595804 562716 372580 139133 -14315 -7597 14943 -87380
13884h7380K1830j09138J816p571K5024K15257K52415j04866j79355J33840k9844
$$ -87380 -65550 -174688 -172872 -180443 -155419 59838 312253 207387 28032 161872 132028
13873A32028o4454j48374O9932P0309q3494j09250L7885j79146J48794n4490J99194
$$ 132028 67574 -80800 -10868 59441 -24053 -133303 -95418 -274564 -125770 -180260 18934
13862A8934M6896K0052r6227J60555o129n90k30197J41339J81041N5864j60306
$$ 18934 65830 85882 -10345 150210 144081 143491 -86706 54633 235674 291538 131232
13851A31232P8140O4023j6820l4694L5997r3001j52214m2008M2624J22881N8218
$$ 131232 209372 273395 256575 221881 257878 164877 12663 -29345 13279 136160 194378
13840A94378K14945k5749j94557l7647j49974j68358L8245j01311J86148M8682
$$ 194378 409323 383574 189017 151370 1396 -166962 -128717 -230028 -43880 4802
13830D802M8230j99192j40441O2218K04907K4911j34280r7567J86959n0609n5329
$$ 4802 53032 -146160 -286601 -224383 -19476 5435 -128845 -226412 -39453 -90062 -145391
13819a45391l2965j40948m2056P0169J87712K80488K2945r6935N0244l7791o8293
$$ -145391 -178356 -319304 -361360 -291191 -103479 177009 199954 103019 153263 115472 47179
13808D7179j63476o9233J08611K83359J25048j28760j59963m1259M5935l51218
$$ 47179 -116297 -185530 -76919 206440 331488 202728 42765 1506 47441 -303777
13798c03777n4296K36188N951J10542K14844K08707r6273j43682p1268K87437
$$ -303777 -358073 -121885 -115934 -5392 209452 418159 321886 178204 106936 394373
13788C94373K2975j45585r9651Q1654j71277j5297J13472k44497j25555K3790
$$ 394373 417348 271763 172112 253766 82489 67192 180664 -63833 -189388 -165598
13778a65598K4367N1211J29434J37110J63772J77627L4517l50853j13031J76682
$$ -165598 -141231 -90020 39414 176524 340296 517923 552440 201587 88556 265238
13768B65238r8922O229l4237J28186O8869k27149k22372O8029K97909k5636j46361
$$ 265238 166316 172545 138308 266494 335363 108214 -114158 -46129 251780 226144 79783
13757G9783k25141p9236K48372K12044q3470J16237K72214k09355m15841r7868
$$ 79783 -145358 -224594 23778 235822 152352 268589 540803 331448 -84393 -182261
13747a82261q0245J26873J13046j1201k9462r6095J44212m5853j4386J14371L3030
$$ -182261 -262506 -135633 -22587 -33788 -63250 -159345 -15133 -60986 -75372 38999 72029
13736G2029p2430m0592m7550k2758p4478o0854J10331O8876K9445m3166J15201
$$ 72029 -401 -40993 -88543 -111301 -185779 -246633 -136302 -67426 -37981 -81147 34054
13725C4054l9312J69619n1991k57623p4326K71305J09124j31156L0834j6079q2958
$$ 34054 -5258 164361 112370 -145253 -219579 51726 160850 29694 60528 44449 -38509
13714c8509O8263J86262J66983m3217l47474q3111J15990P3610j30642N6809j13627
$$ -38509 29754 216016 382999 339782 -7692 -90803 25187 98797 -31845 24964 -88663
13703h8663o4052J1506M6333R0784Q1727j62025L7704K4832J25415K76231p7970
$$ -88663 -152715 -141209 -94876 -4092 77635 -84390 -46686 -21854 103561 379792 301822
13692C01822j59861k69065k4072N2599L3052R6113N7912n3579j02697k6492j28230
$$ 301822 141961 -127104 -151176 -98577 -65525 30588 88500 34921 -67776 -94268 -222498
13681b22498J95808J38540j10094O2934l0851j00839o0878j8905J15158J91294
$$ -222498 -26690 111850 1756 64690 33839 -67000 -127878 -146783 -31625 159669
13671A59669Q6468K69421r0668k95540n0777R1194J38061j45850l2671L7676M7979
$$ 159669 246137 515558 424890 129350 78573 169767 307828 161978 129307 166983 214962
13660B14962n2373J32546j155j1054j10523q5633n0129M3672p3880j5892k7863
$$ 214962 162589 295135 293980 282926 172403 86770 36641 80313 6433 -9459 -37322
13649c7322j420J64629r2320j08167N8597k8776n3614M7712N4818P8518m2337
$$ -37322 -38742 125887 33567 -74600 -16003 -44779 -98393 -50681 4137 82655 40318
13638D0318R80L6619P4506O0991o2539m6972p3936J8624J92745J68603K1548o8014
$$ 40318 41298 77917 152423 213414 150875 103903 29967 48591 241336 409939 431487 363473
13626C63473j04098j72946j0918P5321J13550K2694J5765k39247m2228J45960
$$ 363473 259375 86429 75511 150832 264382 287076 302841 63594 21366 167326
13616A67326k28522k71542J02814J13661o5424N7221K12639q6184k9124j50588
$$ 167326 -61196 -332738 -229924 -116263 -181687 -124466 88173 1989 -27135 -177723
13606a77723r8464N4052P7031K6273J55777J03525j5229J4271J62260O9495j19885
$$ -177723 -276187 -222135 -145104 -118831 36946 140471 125242 139513 301773 371268 251383
13595B51383k01628P7754J3178J17174l2378p1905j18350q2933j3220o8953J04122
$$ 251383 49755 127509 140687 257861 225483 153578 35228 -47705 -60925 -129878 -25756
13584b5756K52211p9122n2014j0658j70253j45939q7379J10117n0942q1455N2118
$$ -25756 226455 147333 95319 84661 -85592 -231531 -318910 -208793 -259735 -341190 -289072
13573b89072Q4416J32621R3024o3607K0474j02166j32338k8925M9615K03641J19189
$$ -289072 -204656 -72035 20989 -42618 -22144 -124310 -256648 -285573 -235958 -32317 86872
13562H6872j29786j6089M0903P6857O2083R3465J00357m8159Q5887j07889n2422
$$ 86872 -42914 -59003 -18100 58757 120840 214305 314662 266503 352390 244501 192079
13551A92079J11434J48560m1256k9012n6114L0719j9519j49326l43775j61254
$$ 192079 303513 452073 410817 381805 325691 356410 336891 187565 -156210 -317464
13541c17464L9437L45284R0744j87876k24339J61573K21421j07527q3202J20618
$$ -317464 -278027 67257 158001 -29875 -254214 -92641 128780 21253 -61949 58669
13531E8669J3435o8410q1392k1255R0096J62260j08402J3724Q4818j9981k0260
$$ 58669 72104 3694 -77698 -98953 -8857 153403 45001 58725 143543 123562 103302
13520A03302j36273l5649j0980k02267J15692N354K283M1180L8004p5736K7776
$$ 103302 -32971 -68620 -79600 -281867 -166175 -160821 -158538 -117358 -79354 -155090 -127314
13509a27314N3637J8743m6744O7460j4467J15013J79517P262K4968j18072j15349
$$ -127314 -73677 -54934 -101678 -34218 -48685 66328 245845 253107 278075 160003 44654
13498D4654j76121j66857l486l6194O7525Q7600J51702O7098m3364L2122K0295
$$ 44654 -131467 -298324 -301810 -338004 -270479 -182879 -31177 35921 -7443 24679 44974
13487D4974K26714j64021o5199R4595j87585p7800j05611J59722R9609k30881
$$ 44974 271688 107667 42468 137063 -50522 -128322 -233933 -74211 25398 -205483
13477b05483j86136O5799N5410m3182L34021N2118j85630R5615J04065j64701
$$ -205483 -391619 -325820 -270410 -313592 20429 72547 -113083 -17468 86597 -78104
13467g8104j61341n0875K04484J61053l7737k99666K5735J44918M6661J62450
$$ -78104 -239445 -290320 -85836 75217 37480 -262186 -236451 -91533 -44872 117578
13457A17578M7228J42478j96178j17665j12486J53781o8845J15267M75k20568
$$ 117578 164806 307284 111106 -6559 -119045 34736 -34109 81158 81633 -138935
13447a38935L2006J95836N7432j48081R979K00678q1973k91785j11502k8945O3041
$$ -138935 -106929 88907 146339 -1742 8237 208915 126942 -164843 -276345 -305290 -242249
13436b42249J79874K1493j39324k9213J32121n5623m5741J23294K41869J64622
$$ -242249 -62375 -40882 -180206 -209419 -77298 -132921 -178662 -55368 186501 351123
13426C51123j29972k08033J1803J48891J01822Q2903r1267j28504m2877k19847
$$ 351123 221151 13118 24921 173812 275634 358537 267270 138766 95889 -123958
13416a23958r2428O8104M2900J0894L8576O6733n719J09894M8751m9675k09639
$$ -123958 -216386 -148282 -105382 -94488 -55912 10821 5102 114996 163747 114072 -95567
13405i5567P1835M0590l53947J22089L23612K42533j26609l7922m8200k16266
$$ -95567 -23732 16858 -337089 -215000 108612 351145 224536 186614 138414 -77852
13395g7852q529O8032j29234j3736K7480J26212r9378o3909P2824l8732j70878
$$ -77852 -86381 -18349 -147583 -161319 -133839 -7627 -107005 -170914 -98090 -136822 -307700
13384c07700L4194K51027O7695r6977K72115m3784j56374M1343N4899r8046j82465
$$ -307700 -273506 -22479 45216 -51761 220354 176570 20196 61539 116438 18392 -164073
13373a64073L9100K19855L3825J8396n1127j59076p4267n5841L2330K3509l85
$$ -164073 -124973 94882 128707 147103 95976 -63100 -137367 -193208 -160878 -137369 -137754
13362a37754l0813N6370N5722L3173r2560k7263P4184J28131p232k3681N062l3382
$$ -137754 -168567 -112197 -56475 -23302 -115862 -143125 -68941 59190 51958 28277 33339 -43
13350d3j87511m3029J9820J45828J25585k5699m2480M3997k1332n8694k56491
$$ -43 -187554 -230583 -210763 -64935 60650 34951 -7529 36468 15136 -43558 -300049
13339c00049J0166K01460J3692M2080J23412j38444j6460J71636Q8075J10549
$$ -300049 -289883 -88423 -74731 -32651 90761 -47683 -64143 107493 195568 306117
13329C06117j5283j28140k50623j33923j52414J33852K03314Q6873N6274L4214
$$ 306117 290834 162694 -87929 -221852 -374266 -240414 -37100 49773 106047 140261
13319A40261k57600j09374J83896L3019j53864j7908L8023K74543j4107m2929
$$ 140261 -117339 -226713 -42817 -9798 -163662 -181570 -143547 130996 116889 73960
13309G3960P1200N0967k18823K7817K32985L5865k94703k65787N4461J81046K68129
$$ 73960 145160 196127 -22696 5121 238106 273971 -20732 -286519 -232058 -51012 217117
13298B17117P7151j41411L9672m7317q6425m5787J926k0356k9367j07395j18808
$$ 217117 294268 152857 192529 145212 58787 13000 14926 -5430 -34797 -142192 -261000
13287b61000p1627O8813Q8686n4757J20169J37839j14063R5867J96458M2180j52895
$$ -261000 -332627 -263814 -175128 -229885 -109716 28123 -85940 9927 206385 248565 95670
13276I5670j87867j30773K20818J34376q6513m8915K9261R1197j24303j92765
$$ 95670 -92197 -222970 -2152 132224 45711 -3204 26057 117254 -7049 -199814
13266a99814k0854P0014J01744M9400j28326j6856j3517q9737p4460j24914J81220
$$ -199814 -220668 -150654 -48910 490 -127836 -144692 -158209 -247946 -322406 -447320 -266100
13255b66100J43458J08999k0142j7300r7048K4008j47538J2696L2903K60924j6900
$$ -266100 -122642 -13643 -33785 -51085 -148133 -124125 -271663 -258967 -226064 34860 17960
13244A7960j55692m0754l52791Q8555M59808J98443o6944p2892j08474j10616
$$ 17960 -137732 -178486 -531277 -442722 17086 215529 148585 75693 -32781 -143397
13234a43397l4496p8237j0000K16817J55705J97216K08576j25838m7751p7133
$$ -143397 -177893 -256130 -266130 -49313 106392 303608 512184 386346 338595 261462
13224B61462O3271J26185k11134j88296j20988o2576L0716J02723J77256n124
$$ 261462 324733 450918 239784 51488 -69500 -132076 -101360 1363 178619 173495
13214A73495j75388R389r610j4391M7479r0933l3117J20841k4020r628J96008
$$ 173495 -1893 7496 -2114 -16505 30974 -59959 -93076 27765 3745 -5883 190125
13203A90125n0709j81958l4215o3151j31478K7137L37226L2241j25836N5173P3301
$$ 190125 139416 -42542 -76757 -139908 -271386 -244249 92977 125218 -618 54555 127856
13192A27856Q829M9638j64632j57422o6691R7562J06412J90797K47650r7436j5126
$$ 127856 136685 186323 21691 -135731 -202422 -104860 1552 192349 439999 342563 327437
13181C27437K04172j3649j43229j27772J2150J24253L4084J1099j08175q5543
$$ 327437 531609 517960 374731 246959 259109 383362 417446 428545 320370 234827
13171B34827j15835j81705j18779J52433L23132j48760k20665m0616l6713l1919
$$ 234827 118992 -62713 -181492 -29059 294073 145313 -75352 -115968 -152681 -184600
13161a84600R1368J89743K2241m3836j78630j8452J4791K0691K54319L5326J06944
$$ -184600 -93232 96511 118752 74916 -103714 -122166 -107375 -86684 167635 202961 309905
13150C09905J7214n1647l08163j48724j26399J18618J99597J34240L5328j00880
$$ 309905 327119 275472 -32691 -181415 -307814 -189196 10401 144641 179969 79089
13140G9089M3392m3798j06666p1642r9554j18796K7382J89493J20535r1051Q5009
$$ 79089 122481 78683 -27983 -99625 -199179 -317975 -290593 -101100 19435 -71616 13393
13129A3393P5246K1307J12581R4075k01506q9126o1145O6560j55085M6398M21200
$$ 13393 88639 109946 222527 316602 115096 25970 -35175 31385 -123700 -77302 343898
13118C43898P4224r3965j4543j44547k53549n9645Q1243j32202j8828J78369J4744
$$ 343898 418122 324157 309614 165067 -88482 -148127 -66884 -199086 -217914 -39545 -24801
13107b4801J34665J39745M0666r9182q3157k4133j51956q4441K31323J19284K3015
$$ -24801 109864 249609 290275 191093 107936 83803 -68153 -152594 78729 198013 221028
13096B21028K1073r6377N5804r155j54883N0219P3029r0319k02247o913K43257
$$ 221028 242101 145724 201528 192373 37490 87709 160738 70419 -131828 -138741 104516
13085A04516q8741j52661o4044J45748L0165j32061j90483J25979M9606k7397
$$ 104516 15775 -136886 -200930 -55182 -25017 -157078 -347561 -221582 -171976 -199373
13075a99373J07748J15087m7458q2253l2338J28747M6947Q262R4834K71529j46537
$$ -199373 -91625 23462 -23996 -106249 -138587 -9840 37107 45369 140203 411732 265195
13064B65195j08092o3996p1541j74302J2977K61218n8947j8566O1185q3843j48743
$$ 265195 157103 93107 21566 -152736 -139759 121459 62512 43946 105131 21288 -127455
13053a27455L8620p989J60544K79807j13656j23710J21722J1363k34278K4774
$$ -127455 -88835 -96824 63720 343527 229871 106161 227883 239246 4968 29742
13043B9742J50366M3881j21985J29520k03736j43240J35268K83028K2870j28614
$$ 29742 180108 223989 102004 231524 27788 -115452 19816 302844 325714 197100
13033A97100R3213o6185r6021J12184p0455j74940O7112K00089p7059l7881j2349
$$ 197100 290313 224128 128107 240291 169836 -5104 62008 262097 185038 147157 134808
13022A34808p597K932p0555n8515K4733r7791K1984l4727o3673J15558J07144
$$ 134808 127211 130143 59588 1073 25806 -71985 -50001 -84728 -148401 -32843 74301
13011G4301j16112M3695Q2967q2M9335N2379J76248j30459l15610l1501R8401
$$ 74301 -41811 1884 84851 84769 134104 186483 362731 232272 -83338 -114839 -16438
13000a6438L7174O6574L5383J70129p2760J37870p2249j6701O0281Q8298j88262
$$ -16438 20736 87310 122693 292822 220062 357932 285683 268982 329263 417561 229299
12989B29299j10095n095P7260j19607L3137j01526q2200P0064M9627N0110m7836
$$ 229299 119204 114109 191369 71762 104899 3373 -78827 -8763 40864 90974 43138
12978D3138p1455K58323J01250j37671l8530k6896r636R3913R8428j72001k61046
$$ 43138 -28317 230006 331256 193585 155055 128159 118523 212436 310864 138863 -122183
12967a22183j96802L7885K51531K96217R4559j14636p1102j77444J8661J79422
$$ -122183 -318985 -281100 -29569 266648 361207 246571 175469 -1975 16686 196108
12957A96108R4735J59498j30436j02537K4056O8094j45249j0177J15148j13114
$$ 196108 290843 450341 319905 217368 241424 309518 164269 154092 269240 156126
12947A56126k88176l14676O6714J98084J39833J02237P0816q8546Q6636M9304
$$ 156126 -132050 -446726 -380012 -181928 -42095 60142 130958 42412 129048 178352
12937A78352p3088J54706p3716k9325k2282j48434N7572j82669k9259K80398J04819
$$ 178352 105264 259970 186254 156929 134647 -13787 43785 -138884 -168143 112255 217074
12926B17074j36908n1493J54024k073n3599J47594k60p8649r7949j55032j07691
$$ 217074 80166 28673 182697 180624 127025 274619 274359 195710 97761 -57271 -164962
12915a64962J09325k4334j10142J47958Q5183l01308r9733k6191k9079M03093
$$ -164962 -55637 -79971 -190113 -42155 43028 -258280 -358013 -384204 -413283 -10190
12905a0190L00282L4328J88208k5082k63542k17007K6685J41081L1666O8408J68895
$$ -10190 290092 324420 512628 487546 224004 6997 33682 174763 206429 274837 443732
12894D43732J46551q9083l63327j23155Q2731P3765j20323k27228j05976O4025
$$ 443732 590283 501200 137873 14718 97449 171214 50891 -176337 -282313 -218288
$$ [...]
##END NTUPLES=NMR SPECTRUM
##END=
