##TITLE=Analysis number 325358
Compound Code mo 07249
Project Code adrs
Chemist Name fudan
##JCAMPDX= 6.0         $$ Bruker NMR JCAMP-DX V2.0
##DATA TYPE= NMR SPECTRUM
##DATA CLASS= NTUPLES
##ORIGIN= Bruker BioSpin GmbH
##OWNER= nmr
$$ XWIN-NMR		Version 3.5
$$ Thu Dec 21 10:16:47 2006 GMT Standard Time (UT+0h)  MAYBRIDGE\nmr@NMR_250MHZ
##.OBSERVE FREQUENCY= 250.131544655141
##.OBSERVE NUCLEUS= ^1H
##.ACQUISITION MODE= SIMULTANEOUS (DQD)
##.ACQUISITION SCHEME= undefined
##.AVERAGES= 16
##.DIGITISER RES= 18
##SPECTROMETER/DATA SYSTEM= dpx250
##.PULSE SEQUENCE= zg30
##.SOLVENT NAME= DMSO
##.SHIFT REFERENCE= (INTERNAL, DMSO, 0, 16.5152)
##AUDIT TRAIL= $$ (NUMBER, WHEN, WHO, WHERE, WHAT)
$$ ##TITLE= Audit trail, XWIN-NMR		Version 3.5
$$ ##JCAMPDX= 5.01
$$ ##ORIGIN= Bruker BioSpin GmbH
$$ ##OWNER= nmr
$$ C:\u/data/dgb/nmr/ADRS/1950/pdata/1/auditp.txt
$$ ##AUDIT TRAIL=  $$ (NUMBER, WHEN, WHO, WHERE, WHAT)
(   1,<2006-12-21 10:16:29.34 +000>,<MAYBRIDGE\nmr>,<NMR_250MHZ>,
      <created by zg, POWCHK disabled, PULCHK disabled
       configuration hash MD5:
       49 4B E0 1D 92 C2 6B 37 9F E6 65 BC 52 41 86 1D
       data hash MD5: 64K
       E4 9C FF 4F B6 6A 61 EE 3A 09 D5 B9 3A 34 05 47>)
(   2,<2006-12-21 10:16:40.39 +000>,<MAYBRIDGE\nmr>,<NMR_250MHZ>,
      <Start of raw data processing
       ef LB = 0.3 FT_mod = 6 PKNL = 1 SI = 32K 
       data hash MD5: 32K
       D7 9B E5 56 1B 9F BF 4C BC D5 59 05 53 36 52 03>)
(   3,<2006-12-21 10:16:42.09 +000>,<MAYBRIDGE\nmr>,<NMR_250MHZ>,
      <apk 
       data hash MD5: 32K
       F0 71 93 CE 75 32 78 D9 05 B3 28 C3 43 81 C9 B0>)
(   4,<2006-12-21 10:16:42.79 +000>,<MAYBRIDGE\nmr>,<NMR_250MHZ>,
      <abs ABSG = 5 
       data hash MD5: 32K
       EA 89 EE C6 B0 7E 70 CF 2D 41 4D 2A DC 3A 5E 01>)
$$ ##END=
$$ 
$$ hash MD5
$$ 37 95 36 D5 B0 D7 2B F6 63 2A 41 2A 79 52 86 3F
##$RELAX= 
##$RELAX= 
##$RELAX= 
##$RELAX= 
##$RELAX= 
##$RELAX= 
##$RELAX= 
$$ Bruker specific parameters
$$ --------------------------
##$DU= <C:\u>
##$EXPNO= 1950
##$NAME= <ADRS>
##$PROCNO= 1
##$TYPE= <nmr>
##$USER= <dgb>
##$AMP= (0..31)
100 100 100 100 100 100 100 100 100 100 100 100 100 100 100 100 100 100 
100 100 100 100 100 100 100 100 100 100 100 100 100 100 
##$AQSEQ= 0
##$AQ_mod= 3
##$AUNM= <au_zg>
##$AUTOPOS= <30 >
##$BF1= 250.13
##$BF2= 250.13
##$BF3= 250.13
##$BF4= 250.13
##$BF5= 500.13
##$BF6= 500.13
##$BF7= 500.13
##$BF8= 500.13
##$BYTORDA= 1
##$CFDGTYP= 0
##$CFRGTYP= 5
##$CHEMSTR= <none>
##$CNST= (0..31)
1 1 145 1 1 1 1 1 1 1 1 1 1 1 1 1 1 1 1 1 1 1 1 1 1 1 1 1 1 1 1 1 
##$CPDPRG= <>
##$CPDPRG1= <>
##$CPDPRG2= <>
##$CPDPRG3= <>
##$CPDPRG4= <mlev>
##$CPDPRG5= <mlev>
##$CPDPRG6= <mlev>
##$CPDPRG7= <mlev>
##$CPDPRG8= <mlev>
##$CPDPRGB= <>
##$CPDPRGT= <>
##$D= (0..31)
0 1 0 0 0 0 0 0 0 0.06 0 0 0 0 0 0 0.0002 0 0 0 0 0 0 0 0 0 0 0 0 0 0 
0 
##$DATE= 1166696188
##$DBL= (0..7)
120 120 120 120 120 120 120 120 
##$DBP= (0..7)
150 150 150 150 150 150 150 150 
##$DBP07= 0
##$DBPNAM0= <>
##$DBPNAM1= <>
##$DBPNAM2= <>
##$DBPNAM3= <>
$$ [...]
##$SUBNAM7= <"">
##$SUBNAM8= <"">
##$SUBNAM9= <"">
##$SW= 20.6930455092707
##$SWIBOX= (0..15)
0 0 3 0 0 0 0 0 0 0 0 0 0 0 0 0 
##$SW_h= 5175.983436853
##$TD= 65536
##$TD0= 1
##$TE= 294.16
##$TE2= 300
##$TE3= 300
##$TEG= 300
##$TL= (0..7)
0 120 120 120 120 120 120 120 
##$TP= (0..7)
150 150 150 150 150 150 150 150 
##$TP07= 0
##$TPNAME0= <>
##$TPNAME1= <>
##$TPNAME2= <>
##$TPNAME3= <>
##$TPNAME4= <>
##$TPNAME5= <>
##$TPNAME6= <>
##$TPNAME7= <>
##$TPOAL= (0..7)
0.5 0.5 0.5 0.5 0.5 0.5 0.5 0.5 
##$TPOFFS= (0..7)
0 0 0 0 0 0 0 0 
##$TUNHIN= 0
##$TUNHOUT= 0
##$TUNXOUT= 0
##$USERA1= <user>
##$USERA2= <user>
##$USERA3= <user>
##$USERA4= <user>
##$USERA5= <user>
##$V9= 5
##$VALIST= <valist>
##$VCLIST= <CCCCCCCCCCCCCCC>
##$VD= 0
##$VDLIST= <DDDDDDDDDDDDDDD>
##$VPLIST= <PPPPPPPPPPPPPPP>
##$VTLIST= <TTTTTTTTTTTTTTT>
##$WBST= 1024
##$WBSW= 4
##$XGAIN= (0..3)
0 0 0 0 
##$XL= 0
##$YL= 0
##$YMAX_a= 208903
##$YMIN_a= -425638
##$ZGOPTNS= <>
##$ZL1= 120
##$ZL2= 120
##$ZL3= 120
##$ZL4= 120
##$ABSF1= 16.51516
##$ABSF2= -4.178013
##$ABSG= 5
##$ABSL= 3
##$ALPHA= 0
##$AQORDER= 0
##$ASSFAC= 0
##$ASSFACI= 0
##$ASSFACX= 0
##$ASSWID= 0
##$AUNMP= <proc_1d>
##$AZFE= 0.1
##$AZFW= 0.1
##$BCFW= 0
##$BC_mod= 0
##$BYTORDP= 0
##$COROFFS= 0
##$CY= 12.5
##$DATMOD= 1
##$DC= 0
##$DFILT= <>
##$DTYPP= 0
##$F1P= 14.0000005364418
##$F2P= -0.99999901652339
##$FCOR= 0.5
##$FTSIZE= 32768
##$FT_mod= 6
##$GAMMA= 0
##$GB= 0
##$INTBC= 1
##$INTSCL= 1
##$ISEN= 128
##$LB= 0.3
##$LEV0= 0
##$LPBIN= 0
##$MAXI= 10000
##$MC2= 0
##$MEAN= 0
##$ME_mod= 0
##$MI= 0
##$NCOEF= 0
##$NC_proc= -4
##$NLEV= 6
##$NOISF1= 0
##$NOISF2= 0
##$NSP= 0
##$NTH_PI= 0
##$NZP= 0
##$OFFSET= 16.51516
##$PC= 1
##$PHC0= 207.6361
##$PHC1= 23.1204
##$PH_mod= 1
##$PKNL= yes
##$PPARMOD= 0
##$PSCAL= 4
##$PSIGN= 0
##$REVERSE= no
##$SF= 250.130001709509
##$SI= 32768
##$SIGF1= 0
##$SIGF2= 0
##$SINO= 400
##$SIOLD= 32768
##$SREGLST= <1H.DMSO>
##$SSB= 0
##$STSI= 32768
##$STSR= 0
##$SW_p= 5175.98343685301
##$SYMM= 0
##$S_DEV= 0
##$TDeff= 65536
##$TDoff= 0
##$TI= <Analysis number 999999
Compound Code 99
Book Reference 9
Project Code 9>
##$TILT= no
##$TM1= 0
##$TM2= 0
##$TOPLEV= 0
##$USERP1= <user>
##$USERP2= <user>
##$USERP3= <user>
##$USERP4= <user>
##$USERP5= <user>
##$WDW= 1
##$XDIM= 32768
##$YMAX_p= 328897189
##$YMIN_p= -369164
$$ End of Bruker specific parameters
$$ ---------------------------------
##NTUPLES= NMR SPECTRUM
##VAR_NAME=  FREQUENCY,     SPECTRUM/REAL,   SPECTRUM/IMAG
##SYMBOL=    X,             R,               I
##VAR_TYPE=  INDEPENDENT,   DEPENDENT,       DEPENDENT
##VAR_FORM=  AFFN,          ASDF,            ASDF
##VAR_DIM=   32768,         32768,           32768
##UNITS=     HZ,            ARBITRARY UNITS, ARBITRARY UNITS
##FACTOR=    0.157963299565203, 1,           1
##FIRST=     4130.93690071511, 0,            0
##LAST=      -1045.0465361379, 0,            0
##MIN=       -1045.0465361379, -369164,      0
##MAX=       4130.93690071511, 328897189,    0
$$ Real data points
##PAGE= N=1
##DATA TABLE= (X++(R..R)), XYDATA
$$ [...]
25513B9360M2826l5674j4524N8838j8148n923K1435J6097j1265Q077J4987l3274
25501G2812j4178j803k6409k6020J6169L9691M704N274q3635K165L1763k5495
25489d962l8110J9536L4559M4542m6512k1822m2807R078M757j8838L8393N7855
25477C5669M114k6255n0119o7917j3334J1123L9500P883J7761M2917J1819m636
25465H525k2459K1496M0895k9087m2646p314O080L9987k0905o36j3006k4975O136
25452c7909J0631L4211N1246m4099Q2595N305m3965n2391m5637L7502M1928M542
25440D3959o8155p976n564J4396L7557k7851j6055M0114L1002J2233k4708n6046
25428b7094q808m995K0006k4395j5297K6509L3292m72N9183J4072k0590k9964
$$ y = [29360, 72186, 36512, 21988, 80826, 62678, 56755, 78190, 94287, 83022, 91099, 106086, 72812, 58634, 56831, 30422, 4402, 20571, 60262, 64966, 70240, -13395, -11230, 20533, -4962, -43072, -23536, 11023, 55565, 9053, -12769, -55576, -46498, -41741, -60579, -22186, 35669, 39783, 13528, -36591, -104508, -117842, -106719, -67219, -59336, -41575, 1342, 13161, 8525, -13934, 7562, 48457, 19370, -23276, -30590, -24510, 15477, -5428, -6064, -19070, -44045, -37909, -27278, 6933, 58179, 14080, 96675, 101980, 58015, 5624, -40013, -2511, 39417, 43959, -24196, -32172, -37736, -23340, 14217, -13634, -29689, 10425, 41427, 53660, 28952, -27094, -35902, -40897, -20891, -45286, -60583, -34074, -782, -1254, 57929, 72001, 51411, 21447]
25416B1447o392L1851j3391l1926L3783L4439l0635l9468J2810j4583J8013O0860
25404G6808r914j9875O44N909P124j7460n1706k125J8289L040R437j7135O19M9271
25390E2926J0470n2638m0883k4436m150k6734O6817L0862J6950m2301k9767M261
25378c8623K8196K9513J0191o434O199k6417J8038j9155n2082Q489K6980J0165
25366d940K4166J612j1396m8315J9213K9852N417n4857J9165M1567R765N3803
25354H5052K2043p0868m4912m8358J0982J2275l4767N0860L2490J8631m351k7987
25342A090k6065l078J2564k2813q774m4063J9043j6095n364N6171K7724P672j9501
25329b1489N8399J4897n8248L700N6500L7111o731j4398M747m881j9405P718j3281
$$ y = [21447, 15055, 46906, 33515, 1589, 35372, 69811, 39176, -292, 12518, -2065, 15948, 76808, 66894, 47019, 47663, 53572, 60696, 43236, -8470, -10595, 7694, 10734, 20171, 3036, 3655, 52926, 63396, 10758, -30125, -54561, -58711, -85445, -18628, 12234, 29184, -13117, -42884, -38623, -10427, 19086, 29277, 22843, 29042, 2625, 20663, 1508, -50574, -42085, -15105, -4940, 19226, 20838, 9442, -38873, -19660, 10192, 15609, -39248, -20083, 21484, 31249, 85052, 107095, 36227, -8685, -57043, -46061, -33786, -68553, -17693, 14797, 33428, 29077, 1090, -24975, -28053, -15489, -38302, -47076, -91139, -72096, -88191, -93555, -37384, -9660, -1988, -21489, 36910, 51807, -6441, -2741, 53759, 90870, 84139, 69741, 74488, 69607, 50202, 57920, 44639]
25316D4639k4098j0913L9793j1984L656n5616o3699p3090o403M8971M021p204
25304a11927Q070L2146M1423r565q0245L628K6952K9752m9781r991L9252K2908
25292e7378L0236m1439p6091m839O3813P3268Q881o715K4990l263J2731p2591
25280d8397j612k897j8984P588M0042K2505j919l6860k5906P3829N2884k1226
25268C9047k8750K1831j0718j9503J6684k8721l9482l0415M7259M2833l8922Q311
25256b0546J6740k3051j0961l767n878R007k3194m0791L0415M1971K5851J2814
25244H610j5913m9200k7128k605K1182M8082M8382J0529R327q0089l9622L11N3505
25231a4629k6808o0386M0280N3085K2268J723K6466K2541k0551m4300n1355r718
$$ y = [44639, 20541, 9628, 49421, 37437, 41093, -14523, -78222, -151312, -157715, -108744, -104723, -111927, -103857, -71711, -30288, -39853, -120098, -116470, -89518, -59766, -109547, -119538, -80286, -57378, -27142, -68581, -144672, -149511, -85698, -12430, -3549, -10264, 14726, 11463, 24194, -48397, -50009, -52906, -71890, -64302, -24260, -1755, -3674, -40534, -66440, 7389, 60273, 39047, 10297, 32128, 21410, 1907, 18591, -10130, -49612, -80027, -32768, 10065, -28857, -20546, -3806, -26857, -37818, -41585, -47463, -38456, -61650, -102441, -72026, -30055, -4204, 8610, -7303, -56503, -83631, -86236, -65054, -16972, 31410, 41939, 51266, -28823, -68445, -68134, -14629, -41437, -101823, -61543, -8458, 13810, 15533, 41999, 64540, 43989, -311, -51666, -61384]
25219f1384l917M9789n270k0193j74L3527M9283k1731k0612k5940m791j680j4655
25206d7748j3149k5490l9611L2718J7391K9374O7429P2239M4605k9309j03535
25195D914p0358R884O563J2736p068n0390k4001k3001K1948P6045j5616k0980
25183g9324J0957J2798q546j8146j3882j4760M8042K2066m3287J7599K8685l7918
25171g5716k5868J0441L9438J3222K8691j2605q727J1926K9383k5907o2620j4142
25159i2484L9224j8301j6838K7792j6963L4290r969o597k4063k1556j8283m4157
25147a67905N4484M1567K0115j4545l0843J5212m9507M3781N7684K7708r730p80
25135a2759j0415j8538n1950L4072j9235n7967N7069J3766k8884l552Q934J07574
$$ y = [-61384, -65301, -15512, -20782, -40975, -41149, -7622, 41661, 19930, -682, -26622, -31413, -33093, -47748, -60897, -86387, -125998, -93280, -75889, -46515, 20914, 93153, 137758, 108449, 4914, -65444, -55560, -48997, -36261, -43329, -93719, -117720, -140721, -118773, -42728, -58344, -79324, -68367, -55569, -64115, -82261, -96143, -110903, -62861, -40795, -84082, -66483, -37798, -75716, -101584, -91143, -51705, -38483, -9792, -22397, -31124, -19198, 10185, -15722, -78342, -92484, -53260, -71561, -88399, -60607, -77570, -43280, -53249, -59846, -83909, -105465, -123748, -167905, -113421, -71854, -51739, -66284, -97127, -81915, -131422, -87641, -29957, -2249, -11979, -12759, -23174, -41712, -93662, -59590, -78825, -136792, -79723, -65957, -94841, -98393, -89459, 18115]
25123A8115J6133j6583L06P804J6141k045N7522j7654j07727n0635L3079K2574
25111b2970J8649q9j9090L2541Q159q851l9410J544J9204J3006o627k5617j0614
25098d0165Q782M815J6911k3619j5860P1326K7576J1935m4695r8329k8275K0103
25086h9495L8959Q532P2363K1613K1135m1884j6033j4756o1262k1457O9186O9018
25074E5919o2610k0642j1106k5878m7935m2971L1387M4543K1470M8876O3389Q277
25062F2719k8923L7640l9090k8672j6864m2566K8991K7655K6490L2975n0083l8031
25050b7759K6930p693J181m607K7494J0022n8644j2098N5831K5147L3616J2063
25038H1483p8024m4537J6271j8490L751L4187O5383l4832l5685J4238l1953j5140
$$ y = [18115, 34248, 17665, 17971, 25775, 41916, 39871, 97393, 79739, -27988, -78623, -45544, -22970, -4321, -4410, -23500, 9041, 17200, 8349, -31061, -29517, -10313, 2693, -3934, -29551, -40165, -31383, -26568, -9657, -33276, -49136, 22190, 49766, 61701, 17006, -81323, -109598, -89495, -50536, -42004, 30359, 51972, 73107, 31223, 15190, 434, -60828, -82285, -13099, 55919, -6691, -27333, -38439, -64317, -112252, -155223, -123836, -79293, -57823, -8947, 54442, 62719, 33796, 71436, 32346, 3674, -13190, -55756, -26765, 890, 27380, 60355, 10272, -27759, -829, -8522, -7341, -11948, 15546, 25568, -33076, -45174, 10657, 35804, 69420, 81483, 3459, -41078, -24807, -43297, -39546, -5359, 60024, 25192, -10493, 3745, -28208, -43348]
25026d3348L6546J4000K5858j7731k8089n6119R472M2073j7634J195J207L7182
25014D612l6335j7837j1843m3114O7721P3283L4046K8246K345r655k6806M042
25002F8705O917N618o6649l6901r168l2552L086L7783O420K0234L529l8029m6880
24989g7887N657J5012K237K2272L7572k3702n0571m5839K1567K0879L9095k8552
24977f2260K86J7278j1089m6730P3789J0081k4773M9594K8531q938L1858O730
24965F4357n0802j60n464l1892J8212M8492J5016k7416n9006m4135M6954P304
24953a8540K1298L031K2830j2046n8754q546N0816j7744l3229L5486L5135P124
24941B6861n1373O591j731p6642P755R4376K1068k3426K2075k6593n4961l3050
$$ y = [-43348, -6802, 7198, 33056, 15325, -12764, -68883, -59411, -17338, -34972, -33777, -32570, 4612, -31723, -49560, -61403, -104517, -36796, 36487, 70533, 98779, 101124, 91469, 64663, 68705, 75622, 81240, 14591, -22310, -31478, -64030, -60944, -23161, -16741, 3493, 7022, -31007, -77887, -72230, -57218, -54981, -32709, 4863, -18839, -69410, -115249, -93682, -72803, -33708, -62260, -61974, -44696, -55785, -102515, -28726, -18645, -43418, 6176, 34707, 25769, 57627, 64357, 13555, 13395, 7931, -23961, -5749, 42743, 57759, 30343, -28663, -72798, -25844, -18540, 2758, 5789, 28619, 16573, -42181, -50727, 89, -17655, -50884, -15398, 19737, 26861, -24512, -17921, -19652, -96294, -88539, 5837, 26905, 3479, 25554, -1039, -56000, -89050]
24929h9050M822r162k1221K8792K202k4107L5900N3541q975J5970L1648j1547
24917H813m3440o058k678L4635k7504l3666K9969J3992K8710n14M2n6795j5308
24904f9802M6576j7631K804M2883J9906j9968k9542j5807k7021M494O2728N1840
24892E1460q463j1353q2676J0747M539q215L304L4514l2J06q695j8307o2601k4809
24878a20481M0104M5010j9425M9795N0138m1114j6776Q427M5494J3416j5359K0747
24866E9976J9329L0047j6770p6822m0185J2602p074j2339P473l1545j760j282
24854e8350j2401K8464O1502J3398K0039J0932j1792k6331m7482l7182l0453K8414
24842f1242L5925m6r857r389n467O459J0886L3422q275j2267m0659K1112O7722
$$ y = [-89050, -84228, -93390, -114611, -85819, -83617, -107724, -71824, -18283, -27258, -11288, 20360, 8813, -34627, -40685, -43363, -8728, -36232, -69898, -39929, -25937, 2773, 2259, 2301, -54494, -69802, -23226, -40857, -38053, 4830, 24736, 4768, -24774, -40581, -67602, -63108, -380, 51460, 42997, 31644, -51032, -40285, -35746, -43961, -40657, -6143, -6175, -6069, -14764, -33071, -95672, -120481, -80377, -35367, -54792, -4997, 45141, 4027, -12749, -4322, 41172, 54588, 39229, 59976, 79305, 109352, 92582, 15760, -24425, -11823, -18897, -31236, -23763, -55308, -57068, -58350, -70751, -42287, 19215, 32613, 52652, 63584, 51792, 25461, -22021, -59203, -89656, -61242, -25317, -25363, -35220, -44609, -50076, -43617, -32731, 691, -7584, -19851, -60510, -39398, 28324]
24829B8324J4867m907K1975k3604k6786l7844r377k9343l1466M2266L322l2316
24817h4889M6050Q1628K0456k7844m4094k45k0272n0368L5890N8866J7789k5288
24805G679l5291o86N8637q608j0376k2687k2608k7037N713k982j3152J2279L9085
24792b0034L5949j7159L1440L7517m3309n3400K5001N2770j040J320k9885p8590
24780e9420j2403N4136o042m620K4941M5971l4603o9066o720M4631j095J1941
24768a2349M5839j8377m7139P658N4998L7878J0365q5293n2304J9113J06616L7720
24756A04725l924l7047n140N564l7586O418J3378J8582j571l8034O811L6071J3860
24743H2107j1648l6K0951o655o3106n704K3244M1560p537m7629m2316j1581r599
$$ y = [28324, 43191, 38284, 60259, 36655, 9869, -27975, -37352, -66695, -98161, -55895, -52573, -84889, -38839, 42789, 63245, 35401, -8693, -8938, -29210, -79578, -43688, 15178, 32967, 7679, -27612, -28298, 30339, 21731, 11355, -11332, -33940, -60977, -55264, -58246, -71398, -59119, -20034, 15915, -1244, 30196, 67713, 24404, -28996, -3995, 48775, 47735, 49055, 19170, -59420, -71823, -17687, -23729, -28349, -3408, 42563, 7960, -61106, -67826, -23195, -24290, -12349, 33490, 15113, -32026, -24368, 30630, 68508, 78873, -6420, -58724, -39611, 67005, 104725, 100801, 63754, 58614, 64178, 26592, 33010, 46388, 64970, 63399, 25365, 32176, 68247, 82107, 70459, 70423, 91374, 84719, 21613, 15909, 39153, 80713, 73176, 25547, -16769, -28350, -37949]
24730c7949k3233L8895L8757l293J5710l534j007r663l7395k2703p759O0368O9210
24717G6404j3267o6158l5951j828M7559J1518j5319m729p695j028m8233k4604
24705h3331L4346N2720l469L060J1977k5218p68L9209n4476k5212j1923K2447
24693d0638K8681R420k6839J3946O8300Q755R924j7203l4678Q991K2498k3090
24681B8067j2520L9951j236j0447K7525k884L4560N1820m0277o9401p276M2583
24669H0465L8659m9542r1421j2471L2002M6929Q876J3226n6619n0661K8354L2415
24657B0212n0806m4498L828K5035M245P009J6970l2081l215n043J5383K1680j0222
24644c1503p919N6426L6354o4179M3477M2653J1641j2212J1158n4357n2056k4881
$$ y = [-37949, -61182, -22287, 16470, 13177, 28887, 25353, 24346, 14683, -22712, -45415, -53174, 7194, 76404, 63137, -3021, -38972, -40800, 6759, 18277, 2958, -1771, -9466, -10494, -58727, -83331, -48985, 3735, 266, 3326, 15303, -9915, -10683, 28526, -25950, -51162, -63085, -40638, -11957, -2537, -29376, -15430, 52870, 61625, 71549, 54346, 19668, 28659, 51157, 28067, 15547, 55498, 54262, 43815, 71340, 68456, 103016, 154836, 114559, 45158, 37882, 80465, 119124, 69582, -21839, -34310, -2308, 44621, 53497, 66723, 10104, -40557, -12203, 20212, -30594, -75092, -71264, -46229, -41984, -34975, -18005, -50086, -53301, -58344, -42961, -21281, -31503, -39422, 17004, 53358, -10821, 32656, 75309, 86950, 74738, 85896, 31539, -20517, -45398]
24632d5398J1949j910j4595K3581m706K9028J7891j0492j7885L9205n0681n8559
24620h2572M9940L0137r149Q400J9088j2693r58k0956J9350j591j3105Q335k6440
24607c2214l6635L8109J7816J0925j6525j3691j6298o906j6750K2696M7429L8581
24595C6537J533o727r2295k8195K2514m002O367j5713J0467J1392M8186J3705
24583C769j6658K8408m4684j5380N4329L5826J7238Q246K5616R517l0504q8719
24571a2996J2269o817n1721J0237K3098k8739k8351p634J7229K8560L59k2239
24559f6745O3035M7696j6614j4282j3691J0891l49q445L199O9684q928o2112l3
24546C306n30M1662q953J9765J5184K5229n095p7656j5533Q21K2106k4074k4225
$$ y = [-45398, -33449, -35359, -49954, -26373, -31079, -2051, 15840, 5348, -12537, 26668, -24013, -82572, -32632, -2495, -11644, -3244, 15844, 3151, 2193, -18763, 587, -1004, -14109, -5774, -32214, -68849, -30740, -12924, -1999, -18524, -32215, -48513, -55419, -72169, -49473, -2044, 36537, 38070, 31343, -60952, -89147, -66633, -70635, -64268, -79981, -69514, -58122, -9936, 3769, -12889, 15519, -29165, -44545, 9784, 45610, 62848, 71094, 96710, 106227, 75723, -12996, -727, -7544, -59265, -49028, -25930, -54669, -83020, -90654, -73425, -44865, -44506, -66745, -3710, 43986, 27372, 13090, -601, 10290, 9941, 1496, 4695, 74379, 65451, 3339, 3306, 2776, 44438, 35485, 55250, 70434, 95663, 90568, 12912, -2621, -1800, 20306, -3768, -27993]
24533b7993o747J1086N7418l4597p078K5666M702n897O3143l3163p7084l5698
24521f6242K9011q854k5627J0731J3863P355l5250m124j8211j2926J0645N4774
24509d4855Q314r783O078P195j1654J5848j460J0873M0440J0713n408j6862K7180
24496C6619J2842l3518n791K4679k7753n3123k4235J9114O2471L0963o585k2375
24484A3308j0773K3271k530m8301k4676K3552l1601P096N549j2144n9582J9095
24472i7736L9866L1943K8877K7643M3332K981L2789K3734p281k0377l7817n4233
24460A3721p2604n0652N2659O5027N6111j1095k7741j6362J434m4990m9567R951
24448g4108L6329K6638m523m6757k4050P3723K2952j1421j4942k9876l420M4362
$$ y = [-27993, -34740, -23654, 33764, -833, -7911, 17755, 22457, 16560, 79703, 46540, -30544, -66242, -37231, -46085, -71712, -60981, -47118, -39763, -75013, -79137, -97348, -110274, -99629, -44855, -36541, -46324, -40246, -33051, -44705, -28857, -30317, -19444, 20996, 31709, 26301, 9439, 36619, 49461, 15943, 10152, 34831, 7078, -46045, -70280, -51166, 11305, 42268, 35683, 13308, 2535, 25806, 23276, -25025, -49701, -26149, -57750, -50654, -45105, -57249, -116831, -97736, -57870, -25927, 2950, 30593, 73925, 76906, 109695, 133429, 126148, 105771, 67954, 13721, -58883, -109535, -56876, 8151, 64262, 53167, 25426, 9064, 10498, -34492, -84059, -74108, -37779, -11141, -15664, -62421, -86471, -12748, 10204, -1217, -16159, -46035, -49455, -5093]
24436e093L6480K9679k5840j03880M2071k8618p7620r379k2852L2202J05951K1456
24424e443k8237K8573K359m7450k0426k887J420o7049j6348N3562M3252O4185
24412E511N1634j9299j3337q691N248k9203l3127l670J7457J0872j8433L119j4356
24399d6275j1788K0578m671K2744l154J0963j6713l6887q0786K102K6344J4047
24387a03496K2907L05K7226J6020q586O390J8579L544n394l0339j1729K8705j9448
24374e5316K4764K923Q2678K6932l9680j8520k6731q513L0740J1556k5188k0787
24362a5142m7419M357j0861j69j7665J1833m2156K7230P03M3634l56l924M4602
24349e333L3426r725j3261j0963m888m6951n1935k2172j2568M1209q880M6049
$$ y = [-5093, 31387, 61066, 35226, -68654, -26583, -55201, -132821, -142200, -165052, -132850, -26899, -5443, -33680, -5107, -2748, -50198, -70624, -73511, -72091, -139140, -155488, -101926, -58674, 5511, 57145, 37846, 24509, 15818, 21066, -8137, -41264, -44934, -27477, -16605, -35038, -31919, -46275, -58063, -37485, -42156, -19412, -22566, -11603, -28316, -65203, -145989, -143887, -117543, -103496, -80589, -80284, -53058, -37038, -45624, -39234, -20655, -17111, -22505, -52844, -64573, -35868, -55316, -30552, -27629, 55049, 81981, 42301, 23781, -2950, -11463, 19277, 30833, 5645, -15142, -62561, -58204, -69065, -69234, -86899, -75066, -117222, -89992, -89289, -45655, -46011, -49935, -5333, 28093, 18368, 5107, -5856, -10744, -57695, -109630, -131802, -144370, -103161, -112041, -65992]
24337f5992M8957J3432j4578j7163l2217L9774j1663J2204K1837k5977q780P947
24325c2219k9022j8886J13440J0645k9142K1478O1409L6432m9543m2573n3981
24314a1962m7893m3975q354l816k974L281J7592M7740p213K5266K1122K2080J0854
24301B1748k5300k8224l2408N0538L5335m1815J5221L5143R879r9062n3331K9371
24289h2905Q434N0254L2508J3235K1047J454j7074j2835Q834k634O293l2706L1837
24276B5742l9374o2815m316R622N9491K9046k2972k5735K7157J6578o111j0556
24264d243l4896l5862K2404L0255J4656j4982Q857j9487k712N0836J3075n7811
24252b9910m2572j4778L6205K3939n2295n601N6359j1670r488k3869J4572M2667
$$ y = [-65992, -17035, -3603, -18181, -35344, -67561, -27787, -39450, -27246, -5409, -31386, -40166, -32219, -61241, -80127, 33313, 43958, 14816, 36294, 97703, 134135, 84592, 42019, -11962, -59855, -103830, -112184, -116000, -118974, -115693, -98101, -50361, -57574, -32308, -11186, 10894, 21748, -3552, -31776, -64184, -13646, 21689, -20126, -4905, 30238, 40117, -58945, -112276, -82905, -74471, -24217, 8291, 21526, 42573, 44027, 26953, 14118, 22952, 20318, 26611, -6095, 25742, -13632, -76447, -80763, -71141, -11650, 17396, -5576, -31311, -4154, 12424, 6313, -4243, -39139, -75001, -52597, -22342, -7686, -22668, -13811, -33298, -36010, 14826, 27901, -29910, -72482, -87260, -51055, -27116, -79411, -85012, -28653, -40323, -49811, -73680, -59108, -16441]
24240a6441j0381l7358k2836k0814m8524R588j1433P5099J3927L10J4360J6124
24228c8379K1979l3062n783O642P472l9919p409L1324l2680J2166j8648J2522
24216h3775K3450J0799M5012J1857r867l0068k8688p979r957o966o57J4171j3524
24203h6192J27O1653J3777k0043m8239r843j5636p771M3462K6734P093K9638j8815
24190b4055L9240j1224m6672J0342O6173M9207L0060j8621j5905M190p6482m9322
24178d3069o285k2747J8936P6700M0878n1412k8208J2949j9922j9017n908M6050
24166a055L2865o9311k9470j4867K9634k2167j3319K5889r503q1340o226L6472
24154a22398J06936L0036K4924K1239o009R375l4326l8739n7367p584K6277j2394
$$ y = [-16441, -26822, -64180, -87016, -107830, -156354, -146766, -158199, -83100, -69173, -68863, -54503, -38379, -16400, -49462, -55245, -48603, -41131, -81050, -88459, -57135, -89815, -77649, -96297, -83775, -60325, -49526, -4514, 7343, -2524, -32592, -61280, -69259, -79216, -86182, -86839, -72668, -86192, -86065, -24412, -10635, -30678, -78917, -88760, -104396, -112167, -68705, -41971, -34878, -5240, -24055, 15185, 3961, -42711, -32369, 33804, 83011, 113071, 94450, 78545, 82735, 6253, -43069, -49354, -72101, -53165, 23535, 64413, 13001, -15207, -2258, -22180, -41197, -47105, -1055, 31810, -37501, -66971, -81838, -52204, -74371, -87690, -61801, -71304, -152644, -158870, -122398, -15462, 14574, 39498, 60737, 54728, 64103, 29777, -8962, -66329, -73913, -47636, -60030]
24142f0030J0346J7403J5627l8478O2099M9567j7618q1939m898J06691M1312o7517
24130C2565j0564K4720N3291J8538r9266j30468j879K1356L3033J591m7896l0643
24118a35622L7228O5166L4039o0922j3218O330j4904J5741L5569j4551L221j3401
24106e5324j1273N521M7163M1027J0227l897l9544K1016q143j03256j783K7056
24094g1210k9938k1892J8260l589M1064K6057Q862K6055k584k5962R9m422L4107
24081e093R663J9751L575k8929n4021J6240L7541L613m7441L6799l8533r6427
24069a43262J7160N2247N821L0299L6683k8739k2398J5719R0735J3434K0402l2814
24057E5287p8743j6564l0197K3193k2628j7018J9264J4146k7848j1352J5008p789
$$ y = [-60030, -49684, -32281, -16654, -55132, 6967, 56534, 38916, -43023, -47921, 58770, 100082, 32565, 22001, 46721, 100012, 118550, 19284, -111184, -113063, -91707, -58674, -57083, -104979, -135622, -98394, -33228, 811, -60111, -73329, -66999, -81903, -66162, -30593, -45144, -41923, -55324, -66597, -61076, -13913, 27114, 37341, 33444, -6100, 14916, 6773, -96483, -98266, -71210, -101148, -123040, -104780, -108369, -67305, -41248, -32386, -6331, -8915, -34877, -34778, -39200, -5093, 4570, 24321, 27896, -1033, -55054, -38814, -1273, 2340, -45101, -8302, -46835, -143262, -126102, -73855, -68034, -37735, -1052, -29791, -52189, -36470, 54265, 67699, 88101, 55287, -23456, -40020, -70217, -47024, -69652, -86670, -67406, -53260, -81108, -92460, -77452, -85241]
24045h5241N0875J4717p6643j9434j7509N5790N7505O1345l0322k3503K5263J3973
24033B6816J6129o4021k6594K1840l9508l4050J3949N8768J6654n8318l664O0642
24021a1357J4584k2503K2454j3586P285k0276l4789j4438k9424k7036J3633M5206
24009g0247N9698n195m3631j3619J2722M6700k195p690k0450l6129j6064R238
23997h6862O564L9482k5339m9319l0768m008O7278L146L8744M762M51L0013l6456
23984d2312k8031K3444K2307M2526J7206k4574n4772l4405k3048N7751P4393N111
23972C5596m7775k4885O26M1931l7791q2583k8669M7864Q8751K4847L0128L1694
23960G9734k4635m6976m2915l4999k5413M98k3128Q3827N0771l4380M4742j7635
$$ y = [-85241, -34366, -19649, -96292, -115726, -133235, -77445, -19940, 41405, 11083, -12420, 12843, 26816, 42945, -21076, -47670, -25830, -65338, -99388, -85439, -26671, -10017, -68335, -71999, -11357, 3227, -19276, 3178, -10408, -3123, -23399, -58188, -72626, -102050, -129086, -115453, -70247, -10549, -15744, -59375, -72994, -60272, -13572, -15767, -23457, -43907, -80036, -96100, -86862, -80298, -40816, -66155, -115474, -146242, -150250, -82972, -79826, -41082, -36320, -35869, -5856, -42312, -70343, -46899, -24592, 17934, 35140, 10566, -44206, -78611, -101659, -43908, 30485, 35596, -12179, -37064, -36438, 5493, -32298, -114881, -143550, -95686, -6935, 17912, 48040, 79734, 55099, 8123, -34792, -69791, -95204, -94706, -117834, -34007, 16764, -17616, 27126, 9491]
23948I491j4726l7087r917j6873n1164L5446J4515m8832l6509K2326N6987K2312
23936e4031J6208K7002k8897L300N4266M9066K8258m2163j0205k7371m5695k7169
23924e7431J7307K6604l5130n1532R122K1719j4951m7317k321K4130M4806P586
23912e7408M5635N4248K7072J8531R259r168m156n7270m1363o6642k7697K7567
23900h1392N0560k196L752j614m3121l1565M63L1354K7518k1953J0207J673K741
23887e3573N304N0022k7747l2950K8264n0202p9200N3482P9000L5288M096K2444
23875C4228j132m7762p1860m1070J9177P2255J2047M517K2742l5153l0562m206
23863f6779K9206j7799K915K1796J3573L7219l9586n7396k5586M53k503J1679
$$ y = [9491, -5235, -42322, -52239, -69112, -120276, -84830, -70315, -119147, -155656, -133330, -76343, -54031, -37823, -10821, -39718, -36418, 17848, 66914, 95172, 53009, 42804, 15433, -30262, -57431, -40124, -13520, -48650, -100182, -91060, -69341, -84292, -131609, -133930, -109800, -64994, -57408, -11773, 42475, 69547, 88078, 97337, 88169, 84013, 26743, -14620, -81262, -108959, -81392, -30832, -33028, -29276, -30890, -74011, -105576, -105113, -73759, -46241, -68194, -57987, -56314, -53573, -48269, 1753, -25994, -58944, -30680, -80882, -160082, -106600, -27600, 7688, 11784, 34228, 33096, -14666, -86526, -127596, -108419, -36164, -24117, -19600, 3142, -32011, -62573, -66779, -37573, -55372, -52457, -30661, -17088, 20131, -19455, -76851, -102437, -101984, -104487, -92808]
23851i2808k1622k1094Q2364O2819J4097J2059K314l5490m8393J3988j7828n5433
23839a05027L0924j2875O855M4255j378L6296O385k2953J809P0646j6911j3627
23827B4399l937J9766n1418m9466j7016O3632k4974k4596j0777n2003N0026Q0813
23815D449J905p395n4491K9321M8797o880k2494p03K335p3650l5978j331M9198
23802f6917L4054L1730J2160N923J1152J0223m1935j4009j5233M922l6765l1072
23790i5767O2396K3892m6278M3242J7163j4597n3358j7406k1625K6372M1756o9828
23778a04038L189M4722J3419m26p1210l5480K4878N3222K3667R070L1953J6123
23766I089j2274K9818o7824K5143Q755l8790J709j7246j8846j5190K3069M2070
$$ y = [-92808, -114430, -135524, -53160, 9659, 23756, 35815, 38129, 2639, -45754, -31766, -49594, -105027, -74103, -86978, -80123, -35868, -37246, -950, 5435, -17518, -15709, 54937, 38026, 24399, 20462, 40228, -11190, -60656, -77672, -14040, -39014, -63610, -74387, -126390, -76364, 4449, 6354, -1041, -55532, -26211, 22586, 15706, -6788, -7491, -5156, -78806, -114784, -116115, -66917, -32863, -1133, 11027, 16950, 28102, 38325, -3610, -17619, -32852, -27930, -64695, -95767, -33371, -9479, -55757, -12515, 4648, -9949, -63307, -80713, -102338, -75966, -34210, -104038, -100849, -56127, -42708, -43134, -114344, -149824, -124946, -71724, -48057, -38987, -7034, 9089, -3185, 26633, -41191, -16048, -7293, -46083, -44374, -61620, -80466, -95656, -72587, -30517]
23754c0517J6037j1781k029p833l4120M387N6146K3246k9570n0114q678l9282
23742a14108J9237k672r8862N823M6816P6284P462j8861K4624M9467M7382P875
23730E0467n0550k142m2968k9689l6770M4965l392l6908K9588M6447n7631o5317
23718a53900j4290P5992L8521L0922J1625k6656j5805J7981M100p665P16k6918
23706f5377L2419L74M0775j3404l9521M740m5586N302O644q892N2755K1742m0836
23693d8865j858l2385p988L4477K2355j9488M4716J3455j3506l0113M2122l8637
23681c5715n6279j9007P811K4598J4551R36o6386L7263N6960J2988L8798o008
23669A0510k8473m9750N603M5764K2167k3842N035O0819J52j8046r996k1225k5056
$$ y = [-30517, -14480, -26261, -28290, -36123, -70243, -65856, -9710, 13536, -16034, -66148, -74826, -114108, -94871, -97543, -196405, -190582, -143766, -67482, -60020, -78881, -54257, -4790, 42592, 50467, -83, -2225, -45193, -74882, -111652, -66687, -70079, -106987, -77399, -30952, -88583, -153900, -168190, -92198, -53677, -22755, -11130, -37786, -53591, -35610, -31510, -39175, -38459, -65377, -32958, -32584, 8191, -5213, -44734, -39994, -85580, -80278, -73634, -82526, -29771, -8029, -48865, -50723, -83108, -91096, -56619, -34264, -53752, -9036, 4419, -9087, -39200, 2922, -35715, -91994, -111001, -103190, -78592, -64041, -63105, -129491, -92228, -35268, -22280, 16518, 10510, -17963, -67713, -62110, -16346, 5821, -18021, -12986, 47833, 47985, 29939, 19943, -1282, -26338]
23656b6338o4856L3573K8418l2950J020K8858L8379k0915j1091o814N891j4283
23644d1108n3413J505n656K2998K1249n8268L0235M1662N5104r289N0303K1847
23632G7169k8023k2477l798j6683N5195n5140m6908K8945N402m8765L499L7509
23620a4075j4152m3963n886m8052J0405P8963P273j0132K0794o2598n6733P067
23608a31089P570P884J2033K6940O8365K5653o3327K0101M9135q503N5470N122
23596G5354k6544m8310l2371j2700m0224m4424n5741k175P0425M9156M9147K246
23584a6161k0014Q14q656K3309M5998j2437N687l7620J8628k0286J6437l3802
23572c8103k1790M1520j9607L909M0411L2543j6272N8069k4376j696j2660o5925
$$ y = [-26338, -91194, -57621, -29203, -62153, -61133, -32275, 6104, -14811, -25902, -32716, -26825, -41108, -94521, -93016, -98672, -75674, -54425, -112693, -82458, -40796, 14308, 5019, 55322, 77169, 49146, 26669, 22871, 6188, 61383, 6243, -40665, -11720, -6318, -55083, -51584, -14075, -28227, -72190, -78076, -126128, -115723, -36760, -29487, -39619, -18825, -81423, -138156, -131089, -123519, -115635, -103602, -76662, -8297, 17356, -45971, -25870, 23265, 14762, 70232, 75354, 48810, 500, -31871, -44571, -84795, -129219, -184960, -187135, -116710, -67554, -18407, -16161, -36175, -35361, -44017, -20708, 25290, 12853, 18540, -19080, -452, -20738, -4301, -38103, -59893, -18373, -37980, -34071, 6340, 38883, 22611, 80680, 56304, 54608, 41948, -23977]
23560b3977j4491l0708K8567k056k1204L107Q143n3040P965K4653J1166N2436
23548i439k93l3986l0850k7293l0128L7757N7237M5816o3576n671J2521k1374
23536f9279m6001m097J02963j116j0264M5589L2649k3421k9356J0577J2222l6592
23524a6126k8886l1898q516n7683j9265K7014N4037J4462P6069J8655l9460p28
23512a2325o5085k3363K4787K7312q829L7652j0256J5782N257l484R381o9042
23500g2213J9887L9228q751n6385J7992j471J0323j6339k5133L067l1501o63j4175
23487a36134J733l735J9940K9488J9054p750P373k4375l1415Q796K3767M2852
23475e0406j0751L1554k389o7157j9889J649Q633K4640N335P2733N4297J9429
$$ y = [-23977, -38468, -69176, -40609, -42665, -63869, -60762, -52619, -105659, -97694, -73041, -61875, -9439, -9732, -43718, -74568, -101861, -131989, -94232, -36995, 8821, -54755, -60426, -47905, -69279, -115280, -119377, -16414, -17530, -27794, 17795, 50444, 27023, -2333, 8244, 20466, -16126, -45012, -76910, -85426, -143109, -162374, -135360, -81323, -66861, 9208, 27863, -11597, -12325, -77410, -100773, -75986, -48674, -57503, -19851, -30107, -14325, -9068, -12552, -3171, -72213, -52326, -13098, -21849, -78234, -60242, -61713, -51390, -67729, -92862, -89795, -121296, -121959, -136134, -134401, -138136, -118196, -88708, -69654, -77404, -70031, -94406, -125821, -117025, -93258, -50406, -61157, -29603, -31992, -99149, -119038, -117389, -108756, -84116, -78781, -6048, 48249, 67678]
23463F7678K200l5069m6213r6777q520J1842K2765N1753L5074k9899k6023j2397
23451f3586K6809K4777J4249j876O281J4033J2089k2169m1543j525J1318l5513
23439e6656n5923r691J8008K1483j055R2665K2272K0224n1743l7482k7598j4906
23427h0402J9145L5435j4026k6408m97j8428j8902j5683l3431k2907K8929R365
23415a37810J5615K6833M0087l5262o5874l2936J7675N8524J7170o5080l4334
23404a95392L9214P5204M945k6704K0913p040j3131P526J0823n129N421l662O4679
23391b2333O6345l1631r9435j952K2869K1907q484J5105r78L654Q876J7728k7495
23378c5824L0325M812j8358l2225K1079K4987k1487j8197L1785K4195J8933k4812
$$ y = [67678, 69878, 34809, -11404, -108181, -116701, -104859, -82094, -30341, 4733, -25166, -51189, -63586, -36777, -12000, 2249, 373, 6654, 20687, 32776, 10607, -30936, -32461, -21143, -56656, -112579, -122270, -104262, -82779, -83834, 8831, 31103, 51327, -416, -37898, -65496, -80402, -61257, -25822, -39848, -66256, -66753, -85181, -104083, -119766, -153197, -176104, -147175, -137810, -122195, -95362, -55275, -90537, -156411, -189347, -171672, -113148, -95978, -161058, -195392, -156178, -80974, -76029, -102733, -81820, -88860, -101991, -94465, -83642, -88771, -83350, -87012, -22333, 44012, 12381, -87054, -89006, -66137, -44230, -52714, -37609, -38587, -34933, -26057, -8329, -35824, -5499, -687, -19045, -51270, -30191, -5204, -26691, -44888, -13103, 11092, 30025, 5213]
23366E213l8429n528o2943m505L3275O4618k0010o8252k7239L1375O281k8878
23354a15022K0305J7112K8747J5984o6828j6671L6832N8391m188k6376q929j0483
23342g1126o461r761q624L4494P8014M060o0092n470j5333j0230K1117L54J0436
23329c8622M776M887J3871m1571p7480L0235O1912O5304k7440m5561K518J1923
23317c5248l1882j5254l4638L3151L6222l5334M609o417j8558L710M0059M1730
23305a7850J1800q705j7460o0818k1683J2076L2651J3142K6799M26k0853j9917
23293g0392p306L0108k9157j4219N083p303K7670M0418P074l2999l4177J562k4183
23280a07821M250N8690k968l0393Q964J9423j2409k2511N5213k0796l7165k6543
$$ y = [5213, -33216, -38744, -101687, -106192, -72917, -8299, -28309, -96561, -123800, -92425, -86144, -115022, -94717, -77605, -48858, -32874, -99702, -116373, -79541, -21150, -25338, -51714, -60643, -71126, -77587, -87348, -95972, -61478, 16536, 20596, -39496, -44966, -60299, -70529, -49412, -49058, -38622, -33846, -28959, -15088, -56659, -134139, -103904, -41992, 23312, -4128, -49689, -47171, -35248, -67130, -82384, -117022, -83871, -47649, -82983, -78374, -84791, -103349, -99639, -59580, -17850, -6050, -14755, -32215, -93033, -114716, -102640, -69989, -56847, -30048, -29622, -50475, -70392, -77698, -47590, -76747, -90966, -85883, -93186, -65516, -25098, -18024, -51023, -85200, -83638, -107821, -103571, -44881, -47849, -78242, -69278, -49855, -62264, -84775, -29562, -50358, -87523, -114066]
23268a14066N680L3507K0473K8412L1934m2657K586l129J301J0040k3173J4254
23256c4838J745k8624r930O891Q1470L5455k1916K3817j0092L395j540l4283J002
23243A2552N2823N6790l1258n4347K4226k830j8868o404j2017L369k5810j5769
23231a7543M2637k1332k8768J844M30o0036j4521O823L7343N5624K2477P809m2118
23218i331m5411k2762n118J1865j6811j2795L3978K4294K2711K826j7727j1830
23206d6111k7339k7953L5413L0812j6312K4862J5964l8643l8276M7931L4634n5557
23194f0575j1243J0989O1K2487J9158N6847J8467J8172k6917k2163q5548m2547
23182a02812R546J0523K0715K2392m0729R008K4154k372L2709j8517l0272j3270
$$ y = [-114066, -108386, -74879, -54406, -25994, 5940, -36717, -34131, -37260, -35959, -25919, -49092, -34838, -33093, -61717, -71647, -64756, 16714, 52169, 30253, 54070, 43978, 47373, 45833, 11550, 12552, 65375, 122165, 90907, 36560, 60786, 57956, 39088, 32684, 20667, 24036, -1774, -17543, 25094, 3762, -25006, -23162, -22732, -82768, -97289, -90466, -53123, 2501, 24978, 32787, -9331, -54742, -77504, -82622, -70757, -87568, -100363, -66385, -42091, -19380, -16554, -34281, -46111, -73450, -101403, -65990, -35178, -51490, -26628, -10664, -49307, -87583, -39652, -5018, -60575, -71818, -60829, -60768, -38281, -19123, 37724, 56191, 74363, 47446, 25283, -60265, -102812, -93266, -82743, -62028, -39636, -80365, -71357, -47203, -49575, -16866, -35383, -65655, -78925]
23170g8925K885Q64Q931K067p8741j1038M4436K3184j6320k3578L5486N8121L9212
23157F584L0251j0504m142l565m316L9935j4274m1299o1842m7169n3170Q553N5020
23144i9938N7197L4573j9095o901K8961m21N9223J01l9366n4885n28J0945k0316
23131e0450Q1300K2081q5009p252K0964J5835l3962m064L5651K5411m4705J6039
23119h161j8673J3071L605n0364l0470L6155m71q9736P8611O0445l4071j2631
23107e2690J1687j3988j0465M3590K2932k1997L4760m3125j324K0267J4567M890
23095I104K2642K8795m5544p939j6748O364l0050m5004l4023n424N4943Q1478
23083A8594J90k5968j0811k8426K9950r538J1554p1004q336J7661L4091M4471
$$ y = [-78925, -76040, -75176, -66245, -64178, -142919, -153957, -109521, -86337, -102657, -126235, -90749, -32628, 6584, 36835, 26331, 22189, 18624, 14308, 54243, 39969, -1330, -63172, -110341, -163511, -154958, -99938, -42741, -8168, -27263, -34164, -5203, -5624, 53599, 53700, 14334, -40551, -41079, -30134, -50450, 30850, 52931, -32078, -39330, -18366, -2531, -36493, -40557, -4906, 20505, -24200, -8161, -26834, -13763, -10158, -60522, -90992, -54837, -55308, -145044, -66433, -5988, -40059, -52690, -41003, -54991, -65456, -21866, 1066, -20931, 13829, -29296, -30620, -10353, 4214, 9104, 31746, 60541, 14997, 7058, -9690, -3326, -33376, -78380, -112403, -117827, -62884, 18594, 18784, -7184, -17995, -46421, -16471, -26009, -14455, -85459, -93795, -76134, -42043, 2428]
23071B428K4848k205k3803J0267l5822k3568L1833J1994k2338m165O500o8672
23059i2703n8751N6465j6629K6241N5283L3217j584k7670k4062r090k1963l6293
23047a17539J1240N0960p814J7432p147j2844k2275L4832M5365Q616J6073L2255
23035D9154J8917n511K9685o4909m9878l6878K1438o125O5427p768n5583n3232
23023i5263K227P3910j3082k3268K8432L1458P261n8644j3043N6743M6060L2606
23011G5397l4856j8849K559p362l4757J3282K5638J2435l1704n9744J5510L1160
22999a1291L9607Q74q123j0013k0722k7069J1377L2487K8357l1377l6984l1932
22987f4809k2330R632k0400j8792R370J9391Q371j2229N6894K9075Q273L9399
$$ y = [2428, 27276, 25071, 1268, 11535, -24287, -47855, -16022, -4028, -26366, -30531, -24031, -92703, -151454, -94989, -111618, -85377, -30094, 3123, 1539, -26131, -50193, -59283, -81246, -117539, -106299, -55339, -63153, -45721, -52868, -65712, -87987, -53155, -7790, 826, 16899, 49154, 68071, 62560, 92245, 27336, -22542, -59420, -37982, -44107, 21320, 13552, -42031, -95263, -93036, -19126, -32208, -55476, -27044, 4414, 11675, -46969, -60012, -3269, 42791, 75397, 40541, 21692, 24251, 16889, -17868, -4586, 21052, 33487, 1783, -57961, -42451, -11291, 28316, 29190, 21067, 11054, -9668, -36737, -25360, 7127, 35484, 4107, -32877, -64809, -87139, -77507, -97907, -116699, -107329, -87938, -79567, -91796, -34902, -5827, 2446, 41845]
22975D1845M390k9556K264J593K2227j8978M710M4335r886m3199l4003p520q03
22962b2581J3341k8389j223O0755j5720p9538j8662K2370j0975L5292j2419n884
22950f3633o305P3873J606l4993M4737L3480N862q504l7233J0049J4134N576R42
22937C9591j6166p8427l9674l297N2521P2410M3804n3487j2622Q93n573l4049
22925c4076L230J6724j4836j9131N0806P327j548l9031k4724O777O3689O9492
22913H4699M855o8040n3596k6101q124k8964O533K6038l064M2441L5758k1536
22901i101j9845l879j0376J8233K2448M8108J3464K1797k8259m7907l4323K1874
22889g766P357k2127Q122K7890m1024p603J5026J0523L0498L0275K56o3706L684
$$ y = [41845, 46235, 16679, 18943, 20536, 42763, 23785, 28495, 72830, 62944, 19745, -14258, -21778, -22581, -9240, -37629, -38852, 21903, 6183, -73355, -92017, -69647, -80622, -45330, -57749, -63633, -69938, 3935, 5541, -29452, 15285, 48765, 54627, 46123, 8890, 18939, 33073, 38649, 39591, 23425, -55002, -94676, -97973, -45452, 26958, 70762, 17275, 4653, 5546, -27, -34076, -30846, -14122, -28958, -48089, 2717, 10044, 8496, -30535, -55259, -48482, 15207, 84699, 89554, 21514, -32082, -58183, -66307, -95271, -88738, -62700, -65764, -23323, 12435, -9101, -28946, -32825, -43201, -24968, -2520, 45588, 59052, 80849, 52590, 4683, -29640, -7766, -409, -22536, -14414, 13476, -27548, -35151, -20125, -9602, 20896, 51171, 51427, -12279, -8595]
22876h595M9548K5456L3153m6534l4593q053K9244r721q7842l3187p251K9888
22864f8487N6410P1406L7343J5469J6236k1700l1145J5267n6456m4141k0479J6811
22852a3466N5792K2471q03j5601l9431l8001j7393J4812k942L1190M8071K3246
22840F7945K6986R590o718K358K6830J4415K157m1952m9063J103P622K8439m2910
22827D6802J3996Q624J1226J2764j3719n4834p3474N674M6009M5666L5710j59
22815H4285j0246L2877M389R974k7122q8683j5804J1804L9564N377j7990K782
22803C1207M9789J1264M4134K8204j5392n4398k9794J9741m9735k2615m4079j7375
22791d9049M9904o283o6141L2887K7178n2361l965J6418j1667l9745J5819P4796
$$ y = [-8595, 40953, 66409, 99562, 53028, 18435, 10382, 39626, 29905, -57937, -91124, -98375, -68487, -12077, 59329, 96672, 112141, 128377, 106677, 75532, 90799, 34343, -9798, -30277, -13466, 42326, 64797, 63994, 48393, 8962, -29039, -46432, -31620, -34562, -3372, 44699, 67945, 94931, 104521, 97803, 100161, 126991, 141406, 143563, 101611, 52548, 53651, 61273, 89712, 46802, 60798, 69422, 80648, 93412, 79693, 24859, -48615, -42941, 3068, 48734, 84444, 84285, 74039, 106916, 111305, 121279, 94157, 5474, -10330, 1474, 41038, 46415, 28425, 31207, 80996, 92260, 136394, 164598, 149206, 94808, 65014, 84755, 35020, 12405, -31674, -49049, 855, -5428, -71569, -38682, -11504, -63865, -67830, -51412, -63079, -102824, -87005, -12209]
22779a2209P4425N7612m0503p8430j4047L5943N0968l5319l3132k4682R015K0542
22767A0183k8291K5470N4980J268p228K1318k8424l6103j1010j9186j7457k520
22755c7000Q741q222J9763J1993J6054L577K1303j9500q0277J5706N7400L706
22743A3244k6345L9408m6035n3586K1747j1835K2306N451l4242L888m912J9538
22731e1373j7815L5689N9051l747o929l5720p415m4611K2320K1614K2765l4263
22719d0434k4557n4265k4932K0180M9123R687N7656q917j37229k6261P6177N9461
22707d4311L0098l9230O586J8170J6799l4014j2518K715J7703N2871K7029l9269
22695B629M395l8771O1231R292l1628k4369j137m844J660q455J403K0209N974
$$ y = [-12209, 62216, 119828, 79325, 895, -13152, 22791, 73759, 38440, 5308, -19374, -10359, 10183, -18108, 7362, 62342, 63610, 56382, 77700, 49276, 13173, 2163, -17023, -34480, -37000, -28259, -36481, -16718, -4725, 11329, 14906, 36209, 16709, -63568, -47862, 9538, 13244, -13101, 26307, -19728, -73314, -51567, -63402, -41096, -35645, -69887, -65999, -70911, -51373, -69188, -33499, 25552, 21805, 14876, -20844, -28259, -72870, -50550, -28936, -6171, -40434, -64991, -119256, -144188, -124008, -74885, -65198, -7542, -16459, -153688, -179949, -103772, -44311, -14213, -53443, -46857, -28687, -11888, -45902, -58420, -55705, -38002, 14869, 41898, 2629, 7024, -31747, 29484, 38776, 7148, -17221, -18358, -23202, -21542, -29997, -28594, -8385, -2411]
22682b411O199j2554L6572N371l5814j3356k9619m8722l6349k941K1279K7674
22670h4671K8477Q765J7525K3220J962p1865n0775M7012Q274o084K3402P110j7493
22657f5141n3096j9122P013q695J4342N0468K4806O3K6718l464Q06O72j0850k8090
22643f3570o6891J7850P938M8707K7360J4694p529J0456J1300N2673k7597o2208
22631c6817l3938O0988L3611n3333n731k7530J9410K7289L4624K9969m4497k8899
22619b4854j5357o5283j4669M9948M589L5354q999m3120l5872j3945j650K5630
22607a08228Q0044M6132K9958l2490R812j9701J2730k8490j331l5916J2480N1121
22595A6121P28L8119j496J5556o9313j9699K2899J034K4820O439o875J8888Q885
$$ y = [-2411, 3788, -8766, 27806, 33177, -2637, -15993, -45612, -94334, -130683, -133624, -112345, -84671, -56194, -47429, -29904, -6684, -4722, -76587, -127362, -80350, -72076, -78160, -54758, -47648, -65141, -118237, -137359, -130346, -139041, -124699, -74231, -49425, -49362, -22644, -26108, -25302, -24630, -35480, -63570, -130461, -112611, -104673, -55966, -28606, -13912, -21441, -10985, 315, 52988, 25391, -36817, -70755, -9767, 23844, -29489, -35220, -62750, -43340, -16051, 18573, 48542, 4045, -24854, -40211, -105494, -120163, -70215, -65626, -30272, -39271, -82391, -118263, -132208, -133858, -108228, -28184, 17948, 47906, 15416, 25228, 5527, 18257, -10233, -11564, -47480, -35000, 16121, 16849, 54968, 53472, 69028, -285, -19984, 2915, 3949, 28769, 35208, 28333, 47221, 56106]
22582E6106o944j2002j5518p153k6644m2700k8438k006Q887l7538K0174N2184
22570d1592K6136J7599k4218k6572L606p295J9774K1828Q611o065k3926j8945
22558e1059K217l1812n0941J4659M1302M1719N1460L0158j6119l1514K0077j0254
22546I893K2755J4266L324l3975m2666j3705J3860L7288m8461k3766K8855k484
22534c4816j0931M7285k9075k6924K6849Q144M0862r944o9077n9056l2216J0113
22522a38786N5728Q0879j267l5334j3017J5466J3529p0594l1775K6916N3212O350
22510c8693l1937l4931m2992K6607M4109L6610N9388K1882m708m6106n774K1781
22498E236r755n940j4333l7345l0594K9984M1476O9954P3271m9262o9737k4899
$$ y = [56106, 49162, 37160, 21642, 14489, -12155, -54855, -83293, -85299, -76412, -113950, -93776, -41592, -15456, 2143, -22075, -48647, -45041, -52336, -32562, -10734, -2123, -8188, -32114, -51059, -48842, -80654, -131595, -116936, -75634, -33915, 17545, 47703, 31584, 70, 20147, 9893, 32648, 46914, 50238, 16263, -26403, -40108, -26248, 11040, -37421, -61187, -32332, -34816, -45747, 1538, -27537, -54461, -27612, -19468, 21394, 11450, -57627, -116683, -148899, -138786, -83058, -2179, -3446, -38780, -51797, -36331, -22802, -93396, -125171, -98255, -45043, -38693, -70630, -105561, -148553, -121946, -77837, -41227, 18161, 40043, 35335, -10771, -16545, 5236, -4519, -10459, -24792, -62137, -92731, -62747, -21271, 48683, 121954, 72692, 2955, -21944]
22486b1944j4144J2051l5528j4913R3229K400m2888J1014j9031j7587j7097J9105
22474d5333M5857J5525o9608K8950K3301M0999P557l1714l6142K2660j0242k5620
22462c3810K8225n4067k0016P11l8036j0499l889l708r545P3387L8131Q0M352
22449b8684J2205n3824J1101k6668L6650j90n224o268l5425N711K4128J4132J8699
22436c3657Q978j4398j1592M4234K5384j9592k3794o351j7149j5041l189J1169
22424e4998K1104L5200j569k1013q740K9804j9211m7344N226l5968M2223N2157
22412c129L939l4164l2487O334M4959N0216k0516r1396n155m9110j5383M5976
22400i9916O9157J4027l0526l8639j2268J6807K8722l0263l7397L746M0973K8220
$$ y = [-21944, -36088, -24037, -59565, -74478, 18751, 21151, -21737, -10723, -29754, -47341, -64438, -45333, 524, 16049, -53559, -24609, -1308, 39691, 47248, 15534, -20608, 2052, -8190, -33810, -5585, -59652, -79668, -78957, -116993, -127492, -131381, -135089, -144634, -71247, -33116, -33036, -28684, -16479, -70303, -59202, -85870, -49220, -49410, -54634, -60902, -96327, -90616, -66488, -52356, -33657, -24679, -39077, -50669, -6435, 18949, -643, -24437, -30788, -47937, -62978, -66167, -54998, -33894, 1306, -263, -21276, -30016, -212, -19423, -66767, -61541, -97509, -55286, -3129, 810, -33354, -65841, -59507, -14548, 35668, 15152, -76244, -81399, -130509, -145892, -99916, -30759, -16732, -47258, -85897, -98165, -81358, -52636, -82899, -120296, -116550, -75577, -47357]
22388d7357N4331J7503j366M760m7951l2396k3464L3238r56j2413l9356k9584
22376a25011j4399M8906P8973K0892o4452r0284L696P3586j3660J1177m3678m2821
22364a57075j9424J996j1341K4067O7325R714J7734K843l3414J6052O82K9590
22352e1251l7164j2743M6678j4801j5578J4074P467K6425j8334k4861m8390K1038
22340a07440j2186O9275M8256K1038l2403l7975K7785m04M7279K4551m4309q8456
22328h4989k2948K6469J6542L448L4843Q1888R587o6724R44k4904n0668p289O6934
22315a6867L4057k3239M6887J1962l9523j0704m1842j1297K2459K8049O218o6090
22303e9930o6338L1856L7788K8605L3093N124o707K5250M633j2605n8240l7770
$$ y = [-47357, 6974, 24477, 23111, 27871, -20080, -52476, -75940, -42702, -43658, -56071, -95427, -125011, -139410, -90504, -11531, 9361, -55091, -145375, -141679, -68093, -81753, -70576, -114254, -157075, -176499, -174503, -185844, -161777, -94452, -84738, -67004, -64161, -97575, -81523, -80841, -51251, -88415, -101158, -54480, -69281, -84859, -70785, -63318, -36893, -55227, -80088, -128478, -107440, -119626, -50351, -2095, 18943, -13460, -51435, -23650, -24054, 23225, 47776, 3467, -84989, -107937, -81468, -64926, -61478, -26635, 55253, 64840, -1884, -940, -25844, -76512, -83801, -16867, 17190, -6049, 40838, 52800, 13277, 2573, -39269, -50566, -28107, -58, 6160, -59930, -126268, -94412, -56624, -28019, 5074, 10198, 3491, 28741, 33374, 20769, -37471, -75241]
22291g5241K6494R180q36N7003L501l6813j046j8130m8124M882N276l768p324
22278h4946K3634Q313O0839j3097r2738K5922L3065k1776j9260m0678k7360O1550
22266h6532M3124l1150m4149M1022M2305l2142j1942j9692O6634L8115j6115l9581
22254e0103m1125L4192J2569n6209l7195o499M8608J8884p354j3117J6494O976
22242g3879j801L145k5057l5400K4328N9815J0892N46j9874O839J1228M4252m1074
22229c6040q67K1069M065m1576M2733K2337m5718m7619J341k6358J9445M9289
22217c7899M6327O0822Q685o1995k3647p802J3790M960K1667n9113n0924q863
22205i3992L8246J3633o5067k713M0015Q851J1789J5767K8444J280j9929j1688
$$ y = [-75241, -48747, -39567, -40403, 16600, 20101, -16712, -17758, -35888, -84012, -79130, -73854, -77622, -84946, -61312, -52999, 7840, -5257, -97995, -72073, -39008, -60784, -80044, -120722, -148082, -86532, -43408, -74558, -118707, -77685, -35380, -67522, -79464, -99156, -32522, 5593, -10522, -50103, -91228, -57036, -44467, -100676, -137871, -144370, -95762, -76878, -84232, -97349, -80855, -73879, -75680, -72535, -97592, -132992, -108664, -48849, -37957, -37411, -57285, -50446, -39218, 5034, -36040, -36907, -15838, -11773, -53349, -10616, 11721, -33997, -81616, -80275, -106633, -87188, -37899, 8428, 69250, 77935, 15940, -7707, -15509, -1719, 3241, 24908, -34205, -85129, -93992, -55746, -42113, -107180, -109893, -69878, -61027, -49238, -33471, -5027, -3747, -23676, -35364]
22193c5364K6107L0502J1520l0359k8506j9797L3330O023o0655N1985M2016n0223
22181b3421k117L7334l2519l4347n4137m4662L8862K4342q494M194M6193K0774
22169b7998M0092P233p229m5729P640K1830K9387J431k7931J5792l596l8270P430
22156a9918N2054Q554J695m1704m0326k2303K0986K4646L7107l5583Q201K1954
22144A5363l6760o8956o178K6329J4252L1346P391m7697k3230o369Q109r486k9879
22131a25765Q90L7549J4984j1677l2136Q123j1341l1593J0320L6436M2493L2728
22119b8989k1819K553k8170j4205K8545N632J9955j605l9004J9493m917K6878
22107c5653J9560k8675P015N1290k453k2169p038r2299o9466K5189L3504n952
$$ y = [-35364, -9257, 21245, 32765, 2406, -26100, -45897, -12567, -6544, -67199, -15214, 26802, -23421, -25538, 11796, -20723, -55070, -109207, -153869, -115007, -90665, -99159, -94965, -48772, -27998, 12094, 19327, 12098, -33631, -25991, -4161, 25226, 26657, -1274, 14518, 10922, -27348, -19918, 32136, 40690, 42385, 681, -39645, -61948, -40962, -16316, 20791, -14792, -6591, 15363, -21397, -90353, -96531, -70202, -55950, -24604, -17213, -64910, -88140, -94509, -86400, -95886, -125765, -124875, -87326, -72342, -84019, -116155, -108032, -119373, -150966, -140646, -104210, -61717, -28989, -50808, -48255, -76425, -90630, -62085, -56453, -36498, -38103, -77107, -57614, -62531, -35653, -16093, -44768, -37753, 13537, 11084, -11085, -18123, -110422, -179888, -154699, -121195, -127147]
22095a27147m309O6570N9279Jk0871p5112l181N5074l2954Q423K5131K073J8832
22082b8191n0743m8184M7125O6880k0374J7736K0561j180m1783o6571j2192K3879
22070i3037P4636m518j5035k082n8225J9509M0755j7584K054P915q320K3576J8659
22057a1697k0217N932n331K7775o404K4266K0023l179m6036L2943J8144l863r090
22044B3266l4694K3277L6020J7199j2708k5039M004l7776J5877L1074j9925n0952
22032c0377o59K0573m489m869n5693r485J6652J4798r924l4849K5105j2401M5124
22019d0494O1902j5071J1252n2039j3988P8434k7251m9916M023N7439M5476J9477
22007G9244k4014k9540j6072l2624l2122j023K961k7549K4031R0329K1869p3154
$$ y = [-127147, -131456, -64886, -5607, -5606, -26477, -101589, -104770, -49696, -82650, -74227, -49096, -47023, -28191, -78934, -127118, -79993, -13113, -33487, -15751, 4810, 3630, -38153, -104724, -116916, -93037, -18401, -22919, -37954, -40036, -98261, -78752, -37997, -55581, -53527, -45612, -53932, -30356, -11697, -31914, -25982, -31313, -3538, -9942, 14324, 34347, 31168, -14868, 18075, 36219, 32356, 23266, -11428, 11849, 47869, 65068, 52360, 27321, 31325, -6451, 9426, 40500, 20575, -30377, -31036, -10463, -14952, -19821, -75514, -84999, -68347, -53549, -63473, -98322, -73217, -85618, -40494, 21408, 6337, 17589, -34450, -48438, 29996, 2745, -47171, -43148, 14291, 59767, 79244, 55230, 25690, 9618, -23006, -55128, -56151, -53190, -80739, -56708, 33621, 55490, -17664]
21995a7664j0601N8774m613p4447l5093J7896J7230O4589R5432L5186m9084n4222
21983D3383k3403O6773k3099n2276M101M1282j0665j3153K7966L2719K6443k0378
21971I9693L506n1324l2721n516L5432n446J53l0632j4946R518m3395j5255j3383
21958f4316M4036K7066q059J8092j4708J1674N3387J1580l5187n0070k9656L2052
21946d109J3993k061P308n6082K1690N6239O534K024n4073J0208L2102k7311J5986
21933B2448O1914J5464j3338l4496k4180o028j9589k1294L5119K853k8712L0197
21921B0358r097Q004J295k67j3804J0724O577j6873j8225L0900K1910l204j2778
21908B5520n6934O343L7187l6915J4660M340K3915J0788j146k5726j5229m9052
$$ y = [-17664, -28265, 30509, 25896, -48551, -83644, -65748, -48518, 16071, 111503, 146689, 97605, 43383, 19980, 86753, 63654, 11378, 15479, 56761, 46096, 32943, 60909, 93628, 120071, 99693, 103199, 51875, 19154, 13638, 49070, 43624, 43777, 13145, -1801, 7717, -35678, -50933, -64316, -20280, 6786, -1273, 16819, 2111, 13785, 67172, 78752, 43565, -6505, -36161, -4109, 9884, 7823, 15131, -40951, -19261, 36978, 43512, 45536, -8537, 1671, 33773, 6462, 22448, 84362, 99826, 86488, 51992, 27812, 21784, 2195, -19099, 16020, 18873, -9839, 20358, 11261, 19265, 20560, 20293, 6489, 17213, 23790, 6917, -11308, 19592, 41502, 38298, 25520, -31414, -25071, 12116, -24799, -10139, -5799, 18116, 28904, 27758, 2032, -13197, -62249]
21896f2249p986L7705m2949j8186N8522L1773K5564l572k1119J9742L5477P999
21884F0721o437K5058l0129n3816j3421L2908l0094J5322M0869Q417J7516l3298
21872C3616k4212k6211O262l1935p9603j7301N4457K2708l179J2784L2803M4081
21860B4270j8784k1021l611l111K2792K7837j877L8421n2365L594o237J5622J2027
21847C7557m9842O7189l0587m7391o3190j1037M0069k898J968L3685Q1443K292
21835E9258m9713l3906K6758K0887k7361l3811k0733N9830K7829n26j0069m3053
21823b4610n6863l7168R999N9930M6228K6316k4213k3346M4134J2403P148k0920
21811A9038n5935l3563O9736J6212m8554j8430Q231J0007k6372J4798L5047j1804
$$ y = [-62249, -70235, -32530, -75479, -93665, -35143, -3370, 22194, 18622, -2497, 17245, 52722, 60721, 54284, 79342, 49213, -4603, -18024, 14884, -15210, 112, 40981, 49398, 66914, 33616, 9404, -16807, -10545, -42480, -122083, -139384, -84927, -62219, -65398, -52614, -19811, 24270, 5486, -15535, -19146, -22257, 535, 28372, 26495, 64916, 12551, 16145, 9908, 25530, 37557, -12285, 54904, 24317, -23074, -86264, -97301, -57232, -60130, -58162, -24477, 56966, 59258, 9545, -24361, 2397, 23284, -4077, -37888, -58621, 1209, 29038, 28512, 18443, -24610, -81473, -118641, -108642, -48712, -2484, 23832, -381, -23727, 20407, 32810, 39958, 19038, -36897, -70460, -724, 15488, -33066, -51496, -43265, -33258, -59630, -44832, -9785, -21589]
21799b1589q178j9300k2771N4576j9941o110n0844K3232P5323j1197l3964j8483
21787e9246J7302m985N1737l7326J0612O8282R668m4435m8445j009J1932m2354
21775f8267k6981j4875k7912O208O0955K9120j1617M231J4367J4345n782J8712
21763g496l1491Q401K5954Q308M7284k491J5082J3888k6102j353n1299m8058j5405
21750f4778K8876L8571P253j9687k9803K5583L0924m439P865M294k1662P444Q681
21737A9122m170k1981J8926j3832n8379J806R8249K5964k0355o0229m6504r312
21725g0695k0575Q0091j1435j7408J1718L2386j3766k5080K3834M5071o661k2809
21713D671L1315k3895M7258M490L032j3157l8494L2347J4188L4621k215n4795
$$ y = [-21589, -29767, -49067, -71838, -17262, -37203, -43313, -94157, -70925, 4398, -6799, -40763, -59246, -41944, -46929, 4808, -32518, -21906, 46376, 56044, 11609, -36836, -37845, -25913, -68267, -95248, -110123, -138035, -131827, -70872, -41752, -53369, -49138, -34771, -20426, -26208, -7496, -38987, -30586, -4632, 3676, 50960, 48469, 63551, 77439, 51337, 49984, -1315, -49373, -64778, -35902, 2669, 9922, -9765, -39568, -13985, 16939, 12500, 20365, 24659, 2997, 10441, 19122, 14952, -7029, 11897, -1935, -60314, -58508, 39741, 65705, 45350, -14879, -61383, -70695, -91270, -11179, -22614, -40022, -28304, 4082, -9684, -34764, -10930, 34141, 27480, 4671, 35986, 12091, 59349, 63839, 66871, 53714, 15220, 47567, 61755, 96376, 94161, 39366]
21701C9366j7081R139K8655L3552m9055j1638k2395J4504K0154q138l8089j2862
21689a3888J0027M6956J1021L5677O7579P118j4229o7967j7798q405j8521J6305
21677E3875j515M8833L8442j4324j6227K1452J902m7696o5278J2948O4015J7083
21665A13510j300L2035K147n6334k9662J5194M6497L0741M3370n2881m6948n4160
21653D2209l5005O1460J6253k1437L3500L4251K8014m5056m7550m8941M4285J6220
21641G8203J1114M538L7206r245j1991R125j2848m8676j699O4449L6439k2739
21629A33876o1770k5352J4465K9886J6587l0219n346q495O817J3716L2328J7788
21617A34281n0802K016k0669n5509K9718J9141j0312M8607q571o7612K93L5934
$$ y = [39366, 22285, 31424, 60079, 93631, 44576, 32938, 10543, 25047, 45201, 37063, -1026, -13888, -3861, 43095, 54116, 89793, 157372, 164490, 150261, 82294, 64496, 56091, 37570, 53875, 52360, 101193, 139635, 125311, 109084, 130536, 132438, 84742, 19464, 32412, 96427, 113510, 112210, 144245, 146392, 90058, 60396, 75590, 122087, 152828, 196198, 143317, 96369, 42209, 7204, 68664, 84917, 63480, 96980, 131231, 159245, 114189, 66639, 17698, 61983, 78203, 89317, 93855, 131061, 121816, 109825, 118950, 106102, 57426, 55727, 120176, 156615, 133876, 72106, 46754, 61219, 91105, 107692, 77473, 72127, 63632, 70449, 84165, 116493, 134281, 83479, 85495, 64826, 9317, 39035, 58176, 47864, 96471, 87900, 20288, 20581, 56515]
21605E6515j5816J5335L6812O1010n7282o6202l9209N6319L0072j7272k2908m3417
21593f043J2629j5107O3128O698r2419J2466P0359K3832k8929l2363O323J2262
21581C2836K5347j3186j0774j9959J1771Q453J2026J262m0074o7602k5819P1008
21569a4711O6469N592k7116J6252m9896j6104O298R904L6607J2793j2947m6778
21557a3637K5868K3200K6677j4221l658l6371n942O224J7296K5680j4176k5562
21545A1378J3894n0841K3617M0264j8881m3284k2515N6777j6255q008N18L9870
21533B6534L4467N5093l7253n3680j1358j7688J9564j1622M7815J5137j2957J3795
21521F7847l1269M7337m1654j1293L1123J3029q170J7591l9369J2112K9265N01
$$ y = [56515, 40699, 56034, 92846, 153856, 96574, 30372, -8837, 47482, 77554, 60282, 37374, -6043, 6586, -8521, 54607, 61305, -31114, -18648, 51711, 75543, 46614, 14251, 20574, 32836, 58183, 44997, 34223, 14264, 26035, 34488, 46514, 47776, 7702, -59900, -85719, -14711, 51758, 57350, 30234, 46486, -3410, -19514, -13216, -3312, 33295, 46088, 33141, -13637, 12231, 35431, 62108, 47887, 44229, 7858, 1916, 8140, 25436, 51116, 36940, 11378, 25272, -25569, -1952, 38312, 19431, -23853, -46368, 10409, -5846, -13854, -13336, 26534, 61001, 116094, 78841, 25161, 13803, -3885, 15679, 4057, 51872, 67009, 54052, 67847, 36578, 83915, 42261, 30968, 62091, 75120, 66950, 84541, 45172, 57284, 86549, 87050]
21509H7050l0880k0853k5292k7390K8142K0544l6087P092M6176Q8503j4391L819
21497A26433J7955j2513J3577j9663N475J3090m1226K0020K3414k1321k1339n321
21485I8581o5689L6839J7528N2736M9435k4817n1966j8013m1809K9849o567R48
21473G7055j1562J3596J3168m275l4484q3750j1676N3487J1490P430m855n7053
21461c1429m9133O2859O7870l9917l03J0439m5072J3683J1027O429J0101J6896
21449C3450n481N0087j2062j7751l8233P961K2608n1443M4390N3561J9081O0098
21437A66266Q418o0O154k2239m6201J1639j0454q8917p80O1428K0594L951J0617
21424A20416L520J5277p615L8952l6801J594n3819J2735J1007j6857L9193M8663
$$ y = [87050, 56170, 35317, 10025, -17365, 10777, 31321, -4766, 2326, 48502, 137005, 122614, 126433, 144388, 131875, 145452, 125789, 131264, 144354, 103128, 123148, 146562, 125241, 103902, 98581, 32892, 69731, 87259, 139995, 189430, 164613, 112647, 94634, 52825, 82674, 76107, 77055, 65493, 79089, 92257, 87982, 53498, -30252, -41928, 11559, 23049, 30479, 25624, -31429, -80562, -17703, 50167, 10250, 9947, 20386, -24686, -11003, 24, 6453, 16554, 33450, 27969, 78056, 65994, 48243, 10010, 17971, 40579, -10864, 33526, 87087, 106168, 166266, 174684, 174624, 180778, 158539, 112338, 123977, 113523, 24606, 23826, 85254, 105848, 109799, 120416, 123936, 139213, 131598, 170550, 133749, 135343, 81524, 94259, 105266, 88409, 127602, 176265]
21412A76265k0810m2642j2617k9937L290J2104M7369N688M821l2606q679j4159
21400H8087o0642K8973K8911o184N821l7666j6112O098J0371j0288J7103Q3730
21388A38202K2820q0981R330L1347L0510j0751K7942m3816k1749N527j3278K7384
21376A22487N57n1710J5595R449J8314M4951J2951J9970m6871k7115J3083M5922
21364A77583j0949q386m175K5046M7146m9091l9998K7866K5906K2152j3952K2784
21352B21932l4785l4813n5253j1577O5463j4978N639N9528M5618j381l3733k6613
21340A85047k9820j2527m821l6383K2947Q0240N6721M0915k6680l8192k9539k8355
21328A79553m0377j981M0804k776J7711l19n411R667N2070Q2805l3393m281N3243
$$ y = [176265, 155455, 112813, 100196, 70259, 73549, 85653, 133022, 138710, 143531, 110925, 102246, 88087, 27445, 56418, 85329, 79145, 84966, 47300, 31188, 37286, 47657, 37369, 54472, 138202, 161022, 80041, 89371, 120718, 151228, 140477, 168419, 124603, 102854, 108381, 95103, 122487, 123044, 71334, 86929, 96378, 114692, 159643, 172594, 192564, 145693, 118578, 131661, 177583, 166634, 158248, 154073, 179119, 226265, 177174, 137176, 165042, 190948, 213100, 199148, 221932, 187147, 152334, 97081, 85504, 150967, 135989, 141628, 201156, 246774, 245393, 211660, 185047, 155227, 142700, 137879, 101496, 124443, 204683, 261404, 302319, 275639, 237447, 207908, 179553, 139176, 137195, 177999, 175223, 192934, 192615, 187204, 196871, 248941, 331746, 298353, 294072, 347315]
21315C47315K9845J1163j4266j5992N55o739M826K829M1408M3627M5624j7361
21303D72834K9191m690l1870L9215J9673k7110l6508m8216j6035L645o578N0309
21291D43860N0159r595k5237k8745M8154N4240n858o3968l6789l2287r0k1789
21279C72055L4326L6473r1033r2072j7883L3936n907j1666m1972J8241M3757n766
21267B72489N177M772M562n4327k8077l1854l6963n291L306o694M448L5997N3533
21254B21078l0474p1870n378O143j1699J7953K7523j52j7473m9113k168K6307
21242A10677J1178r809k0852M8672l262L391M6664k0227m1739k5323l7703N7813
21230A19480M2470M041m76k0798J2592K875K8991l190o6541o137r924R747M8894
$$ y = [347315, 377160, 388323, 374057, 358065, 358620, 351881, 356707, 359536, 400944, 444571, 490195, 472834, 502025, 497335, 465465, 504680, 524353, 497243, 460735, 412519, 396484, 400129, 393551, 443860, 494019, 484424, 459187, 430442, 478596, 532836, 526978, 463010, 426221, 393934, 393844, 372055, 406381, 442854, 351821, 259749, 241866, 275802, 269895, 258229, 216257, 234498, 278255, 272489, 277666, 282438, 287000, 232673, 204596, 172742, 135779, 130488, 133794, 127100, 131548, 167545, 221078, 190604, 118734, 113356, 119499, 107800, 125753, 153276, 153124, 135651, 86538, 84370, 110677, 121855, 112046, 91194, 139866, 136604, 139995, 186659, 166432, 124693, 99370, 61667, 119480, 161950, 165991, 165515, 144717, 157309, 160184, 189175, 185985, 119444, 113307, 103383, 113130, 162024]
21217A62024N5482K7659j274k9716J1156P595L0313r580Q142M7481k4232o6733
21205B18317n8244k0583r587j8550k686M387K1782M7624m3736q0037q556m928
21193D5203L1881p893l0051N048M9549O417R33J0421j1669J2902n808k3762m2186
21180D0985O453N4823J7183J6861K0046n7043l1439L9226M0716R104l5094l7912
21168H3909m3375q116M1511J8953K9590J3655l8808l389K5263O3098j3167Q939
21156A78063j889j6744n469j968k1635p945L9217j4196q780n3487M4784J4287
21144A44238n5831K125L3441o3591M17M7632j2272K4628Q31J866p396n052k918
21131A08118k4608r544j5124L9034O846j4353L565r220l3512R195L229J4636n0561
$$ y = [162024, 217506, 245165, 243891, 214175, 225331, 232926, 263239, 253659, 261801, 309282, 285050, 218317, 160073, 139490, 129903, 111353, 108667, 113054, 134836, 182460, 138724, 58687, 50131, 45203, 77084, 69191, 39140, 44188, 93737, 100154, 101087, 111508, 99839, 112741, 106933, 83171, 40985, 47438, 102261, 119444, 136305, 156351, 99308, 67869, 107095, 147811, 156915, 121821, 83909, 40534, 32418, 73929, 92882, 122472, 136127, 97319, 93930, 119193, 182291, 169124, 178063, 176174, 159430, 153961, 151993, 130358, 122413, 161630, 147434, 138654, 85167, 129951, 144238, 88407, 90532, 123973, 60382, 60799, 108431, 96159, 120787, 121618, 123484, 116088, 111036, 108118, 83510, 73966, 58842, 97876, 104722, 90369, 93934, 84714, 51202, 60397, 63626, 78262, 27701]
21118B7701k8948N7617M2153r941k387M127J7439K8489L44j5920j5950l0356m9863
21105B4505p477J9633o266J3269K8674J2731N279j0427k0630o7976j625N4543
21093D4233K0858K6732L243o262q538l041l261K2733M7105l0502j2795M9054N722
21080A55281j3574J491K2972j7242o1399J4925M6522l7321m7607k7048K8551N0927
21068A16478L6292n4036n8545O4869J0305J0852l0824p649j8334j3283K2926N5521
21056A34572J208p0034j1854k1017J8118L0140O535L236l5576n038J6515M0896
21044A07701j4660m3814L573M1490L7445r69o437P546j3378r864J6549j7251n544
21031A02387k5184J1420R379q978J5543j7489r837L1076j3444K481j2410J9514
$$ y = [27701, -1247, 56370, 98523, 88582, 86195, 90322, 107761, 136250, 136594, 120674, 104724, 74368, 24505, 17028, 36661, 30395, 43664, 72338, 85069, 90348, 79921, 59291, -8685, -10310, 44233, 65091, 91823, 95066, 88804, 80266, 77225, 73964, 96697, 143802, 113300, 100505, 149559, 155281, 141707, 143198, 166170, 148928, 87529, 102454, 148976, 111655, 64048, 37000, 65551, 116478, 152770, 98734, 40189, 105058, 115363, 126215, 95391, 87742, 69408, 56125, 79051, 134572, 135780, 65746, 53892, 32875, 50993, 81133, 87668, 90904, 55328, 50290, 66805, 107701, 93041, 49227, 52800, 94290, 131735, 130766, 124329, 131875, 118497, 108633, 125182, 107931, 102387, 77203, 88623, 98002, 89024, 104567, 87078, 77241, 108317, 94873, 97354, 84944, 104458]
21019A04458K6566n9480n2277p737L9202J9261K0519j9679o15k3468m6537j4756
21007a4543M6114M6740j2388n837N6946j7020p4507j7930K1766j7981n3579N5945
20995A3726M6462L4930j5315j0977j4908r035j1374k6642J2490j4493K1840M7987
20983G4691L8971l3757m1951L8397P6412K0761n1717m0942O0782R219K809j9004
20971A34671J4214k0494O147K3031N6107K8189p5345j05847m7878O469M3799k180
20959F0883m3916J0285K6190m8789j7650N3397r944J8580N910k2807K1435M7182
20947A00756K5626j850k4763k2135j4812q318N242m3989j2984l4563M2355M3346
20935E3911J4189j8093k6407J8512j6003K1352r572k5890L352L5171m806k5109
$$ y = [104458, 131024, 71544, 19267, 11530, 50732, 69993, 90512, 70833, 70218, 46750, 213, -14543, 31571, 78311, 65923, 60086, 117032, 100012, 25505, 7575, 29341, 11360, -42219, 13726, 60188, 95118, 79803, 68826, 53918, 44883, 33509, 6867, 19357, 4864, 26704, 74691, 113662, 79905, 37954, 76351, 152763, 173524, 121807, 80865, 141647, 150866, 153675, 134671, 148885, 128391, 134538, 157569, 213676, 241865, 166520, 60673, 12795, 19264, 63063, 60883, 16967, 27252, 53442, 4653, -12997, 40400, 30456, 49036, 54946, 32139, 53574, 100756, 126382, 124532, 99769, 77634, 62822, 54504, 59746, 15757, 2773, -31790, 10565, 53911, 68100, 50007, 23600, 42112, 26109, 47461, 37889, 11999, 15351, 50522, 45716, 20607]
20923B0607m295Q200N4888Q456O4818l7332n3763K8795P381k296J4747J9047N837
20910A35090j3719n6779k1072l1425L8447M1150k2640k6716j1357k1579j1447
20899b047O0955J2675r184K1966L5016k0211k586r33l8319k331n1692O8177P0618
20886A42104j0232l7071n0497m7794n7096j1206K5560N6496J6121K8224J1142
20875F5751o5322K8778l1959O994M657J8045J6118n33M3787m2944k1252K2054
20863D4174L9927n399j0501K084K887q685o6059j1515K5623K8439j6879J5167
20851C9263K6745R977J4875m0608l5405j3895j4717K7035j3663m8590L2995L1142
20839A5154k8422K1928L919M25j1366l7736l0198k6412J0476M6627J03177K9048
$$ y = [20607, 16312, 24512, 79400, 87856, 152674, 115342, 61579, 90374, 97755, 95459, 110206, 129253, 135090, 121371, 64592, 43520, 12095, 50542, 91692, 69052, 42336, 30979, 9400, -2047, 58908, 71583, 62399, 84365, 119381, 99170, 96584, 95651, 57332, 55001, 3309, 71486, 142104, 131872, 94801, 44304, -3490, -60586, -71792, -46232, 10264, 26385, 54609, 65751, 429, 29207, -2752, 4242, 8899, 26944, 43062, 42529, 86316, 43372, 22120, 44174, 84101, 78702, 68201, 70285, 73172, 64487, -1572, -13087, 12536, 40975, 24096, 39263, 66008, 75985, 90860, 50252, 14847, 952, -13765, 13270, -393, -48983, -15988, 15154, -13268, 8660, 12579, 13004, 1638, -36098, -66296, -92708, -82232, -35605, 67572, 96620]
20827I6620k4666J3869j4978n438K11k2779r100l2027o3106R944O7452N0996k3021
20814D3977j5207O3925N925m6749l8220p052j2303K7257J02708O0136K8604J25090
20802C38091Q4370l4201r1823j01213o3153q2033o3705K4643R0639K8690P840
20791A38145k6302K5542m0958N818K1907l6116j194L7142L5677l768l6811l6209
20779H2873j1980k6829l525r277l0380l2536J1196l1608L870J3582K3381o214
20767a7447l238M4664m473m3994k4446M6728k221J7273k2285K8549L207m7770
20755b5453M8603J5678k0283K2059J2438l0445J7219N0990j7943j2467o9517l7288
20743d6409N2004J1578K4560K5204j8684m1551k4363n1653p911l0287O014M7597
$$ y = [96620, 71954, 85823, 70845, 65407, 65618, 42839, 33739, 1712, -61394, -51450, 16002, 66998, 43977, 28770, 92695, 98620, 51871, 13651, 6599, -5704, 21553, 124261, 184397, 213001, 338091, 422461, 388260, 296437, 195224, 132071, 50038, -13667, 10976, 101615, 130305, 138145, 111843, 137385, 96427, 102245, 124152, 88036, 86842, 123984, 159661, 155893, 119082, 82873, 70893, 44064, 40539, 31262, 882, -31654, -20458, -52066, -48196, -34614, -11233, -17447, -20685, 23979, 19506, -24488, -48934, -2206, -4427, 12846, -9439, 19110, 22317, -25453, 23150, 38828, 18545, 40604, 53042, 22597, 39816, 90806, 72863, 60396, -9121, -46409, 5595, 17173, 41733, 66937, 48253, 6702, -17661, -69314, -77225, -107512, -101498, -53901]
20731e3901P826L1927L1990j8789o947m134L5746P0548m2031q4746j2292J9277
20719b5526n1682J8829M222K9353J257L8433n167L3830l718l2324m6101m4522
20707h3116Q26N9565J795q522K7126N28l0973k8602L9641K0031N6355m947K5604
20694G5311M7977k5644l4980m4116j2347L4293O2765l6434m8234M9839L8762o487
20682A00705j0570M2352m4781k829j2112p3177Q88R551L2299R178P3J6116n7N0264
20668A17900L9887k3812n8058m5730j0229P3507K2572p943k2849k6363j4760k7783
20656A6339J7199L320J8570L1677L5314N4107o846n969k3670M74p420j3130K5950
20643A45915o702m3819m3502M6261p831m976J5984n07J2635j7423j6699l2415
$$ y = [-53901, -46075, -14148, 17842, -947, -7894, -12028, 23718, 94266, 52235, -32511, -44803, -25526, -77208, -58379, -54157, -24804, -23547, 14886, 9719, 43549, 39831, 7507, -38594, -83116, -82290, -22725, -20930, -29452, -2326, -1798, -32771, -61373, -21732, -1701, 54654, 49707, 75311, 123288, 97644, 62664, 18548, 6201, 40494, 103259, 66825, 18591, 68430, 107192, 100705, 90135, 132487, 87706, 84877, 72765, -412, 476, 10027, 42326, 51504, 51577, 67693, 67636, 117900, 157787, 133975, 75917, 30187, 19958, 93465, 116037, 108094, 85245, 58882, 44122, 16339, 33538, 36858, 55428, 87105, 122419, 176526, 169680, 163711, 140041, 140515, 133095, 119965, 145915, 139213, 95394, 51892, 98153, 90322, 85346, 101330, 100823, 113458, 96035, 79336, 46921]
20631D6921l045k1418K4220J6676J1875n630j7033n6065L9987M3431l2641m9322
20619b044J577k3859K3238M2642j1967j7739l1081N0883L8858l0394k6087K5815
20607C9842o47K71M8453P116m5615l4138m3107m563p424K0442M388O8228O786
20594F0032M701k5223j3715k3751K2555L6968M7910l6794o2776q511J1725M9859
20582F2980j7948o307J7492N4735j4570j3230N4058k2507k129k2019r901N3464
20570A34118K4029L933l681J3372j0525j9221k2838N5974J5556j3228J282l6442
20558A42329k7242o4867o6546M6976M3987J9124N86K2632m6989k9464J1479n067
20546D6938K5524M6962K3028j2298l816J1560j0147O683M2017J3346K62l2408
$$ y = [46921, 43876, 22458, 46678, 63354, 75229, 69599, 52566, -3499, 36488, 79919, 47278, -2044, -467, -24326, -1088, 41554, 29587, 11848, -19233, 31650, 70508, 40114, 14027, 39842, 39195, 39466, 87919, 95035, 49420, 15282, -27825, -32388, -39812, -19370, -14982, 53246, 60032, 64733, 39510, 25795, 2044, 24599, 61567, 109477, 72683, 9907, 1396, 13121, 62980, 45032, 38725, 56217, 110952, 96382, 83152, 137210, 114703, 112574, 90555, 80654, 134118, 158147, 162080, 158399, 171771, 161246, 142025, 119187, 175161, 190717, 177489, 178771, 142329, 115087, 50220, -16326, 30650, 74637, 93761, 94347, 116979, 69990, 40526, 52005, 46938, 72462, 119424, 142452, 130154, 126338, 137898, 127751, 134434, 176451, 189797, 190059, 157651]
20534A57651K723J9546R6366J63782J86514K07972K78863L39627M31514K35859
20524B120417r2327l63938l92581l60028k79603k16871j74589n3865l0504k7147
20514A28964k5381k9614k2746O4457N6655l9461m1825K6054p038l2385m1193k8067
20502H420L3482k0971n055M8325N3592J5403n6334n1676j1209L0239j0375k7020
20490F821J1591l4042J9418N6747q888r847l9871l796J6918N0887R134n400k0053
20477D9619l2620J5570M8588J3679m3258o2173R018J2730N3541N8993m114q2001
20465C7572o8313M5591J3736L9808K409k2098k2958l5191k2042L0574L6694l6912
20453a130l0950M6734j656O451J7139K2637J5193m5498q124l1990l3707O665L0387
$$ y = [157651, 160374, 179920, 276286, 440068, 626582, 834554, 1113417, 1453044, 1884558, 2120417, 2028090, 1664152, 1271571, 911543, 631940, 415069, 240480, 186615, 156111, 128964, 103583, 73969, 51223, 115680, 172335, 132874, 91049, 117103, 110065, 77680, 36487, 8420, 41902, 20931, 15876, 64201, 117793, 133196, 76862, 25186, 13977, 44216, 33841, 6821, 18412, -15630, 3788, 60535, 51647, 41800, 1929, -1867, 15051, 65938, 75072, 69672, 49619, 16999, 32569, 81157, 94836, 51578, -10595, -1577, 11153, 64694, 123687, 119573, 37572, -30741, 14850, 28586, 68394, 70803, 48705, 25747, -9444, -31486, -912, 35782, -1130, -32080, 14654, 12998, 19449, 36588, 59225, 74418, 28920, 20796, -11194, -44901, -38236, -7849]
20440g849M3814j545J3350n8812n4369r415M1275L3541R585j2274n821p4833j3005
20427i6358N0363K9489J7642R635l5810j1220K3425L4986k9512m5119J6775M112
20415c1592N3027M3941l0804L7673L5642n9165o5659P520R665J1740K3139k1194
20403A3933n2087J6598K1625L7111n0185k2149L1706L214K1775N8274R592m2881
20391D6526k6408l0003K2902M6157L5709o793K868r030n3974n802J4281k7931
20379H502M4174J8964j1466K642Q42m5156M0884M8362k5605J3031k7863j7535
20367D9776K2123O048K3360k0370p571M4235M0245M9651J9697J6946J7608j7100
20355B44648p5667o2691m1464m8116K4730K5693k7995P023M0949k3008r839L0817
$$ y = [-7849, 35965, 34420, 47770, -11042, -65411, -74826, -33551, -10, 9575, -2699, -8520, -83353, -96358, -45995, -16506, 1136, 10771, -25039, -36259, -12834, 22152, -7360, -52479, -35704, -31592, 21435, 65376, 34572, 72245, 107887, 48722, -16937, -9417, 248, 11988, 35127, 13933, -38154, -21556, 69, 37180, -13005, -35154, -3448, -234, 21541, 79815, 89407, 46526, 20118, -9885, 13017, 59174, 94883, 88090, 90958, 81928, 27954, 22152, 36433, 8502, 52676, 71640, 60174, 62816, 63658, 18502, 59386, 107748, 82143, 95174, 67311, 49776, 71899, 77947, 101307, 80937, 73366, 117601, 157846, 207497, 227194, 244140, 261748, 244648, 168981, 106290, 64826, 16710, 41440, 67133, 39138, 46161, 87110, 64102, 54263, 85080]
20343H5080K1187l3584k7693R523L7802l1002J3306K0578l5537j2179N9350P731
20331A14562q107N996N0099N5713N4227J7288n5206l7298k8939m8420k3784N5827
20319A51958k2632k6403p6129q604L0080m2043L800j0633p281k2772J5090O5831
20307E0262K103J1372K646j7882M577M0594M8901j5919O351j5309o579J6934j541
20294A26510p6695n6095l4395l6568j0822J7803M6581N9794l0158J3510L8049
20283E7514L1202K4196Q89q2060m6365j1074j1575n453O9249J6887k6242J128
20271A8296M4083M3485j3617J5795L8912K4662O2458L0896l3698q5273J411L7977
20259A85387L071o0124o130l2205q312R053K5355O387J7406l3797J7546K0416
$$ y = [85080, 106267, 72683, 44990, 54513, 92315, 61313, 74619, 95197, 59660, 47481, 106831, 114562, 106455, 112451, 162550, 218263, 272490, 289778, 234572, 197274, 168335, 119915, 96131, 151958, 129326, 102923, 26794, 18190, 48270, 6227, 10027, -606, -7887, -30659, -15569, 50262, 52365, 63737, 66383, 48501, 53078, 93672, 142573, 126654, 133005, 117696, 111117, 128051, 126510, 49815, -6280, -40675, -77243, -88065, -70262, -23681, 36113, 5955, 19465, 57514, 88716, 112912, 113801, 31741, -14624, -25698, -37273, -42726, 26523, 43410, 17168, 18296, 62379, 105864, 92247, 108042, 146954, 171616, 234074, 264970, 231272, 145999, 147410, 185387, 188458, 128334, 122204, 89999, 81687, 90740, 116095, 122482, 139888, 106091, 123637, 144053]
20247A44053k2361q784j0225j8052J3924L2184P5617q699l3254M8718j7545p4745
20235A20831k2607k4105k660J6029j6076k497M3349N7684K2193l1695J0660N4676
20223B25782o752j9095l4040j068O9811O3484L438k8013k341K7884K5786J9417
20211C44293l9959l4940m7608k4492O659L338k7472j1872N179q002m5327J0869
20199A30666M592O5652K7550o1219M151J3244O6368N2340K0254M2815K6626j687
20187C91352n9125l2030k1920n9239o2848l3809k6985M5695K0908n4206n9234
20176D8559L7103P3709K2078l1287l4079n4058m2340j2746j4718k6599M3522Q0901
20164I0045Q466p246N5882N4041j4989j1054l192Q390n4658k2275K5020J0824
$$ y = [144053, 121692, 112908, 102683, 84631, 98555, 130739, 206356, 197657, 164403, 213121, 195576, 120831, 98224, 74119, 71459, 87488, 71412, 68915, 112264, 169948, 192141, 160446, 171106, 225782, 219030, 199935, 165895, 164827, 234638, 298122, 301560, 273547, 271206, 299090, 324876, 344293, 304334, 269394, 221786, 197294, 203953, 207291, 179819, 167947, 173126, 165124, 119797, 130666, 135258, 200910, 228460, 167241, 171392, 184636, 251004, 303344, 323598, 366413, 393039, 391352, 332227, 300197, 278277, 219038, 156190, 122381, 95396, 141091, 161999, 107793, 48559, 85662, 159371, 181449, 150162, 116083, 62025, 19685, 6939, -7779, -34378, 9144, 90045, 98511, 91265, 147147, 201188, 186199, 175145, 171953, 180343, 125685, 103410, 128430, 139254]
20152A39254k2107L1267j9492J2511Q0797P7884Q8376Q7764J59446J92907J19951
20141I48558M7072j84231k60508k44728j18945J6210L1865r790m1826k4044j7066
20130A42567p966J090j9689j1726k3239k7204j8983k0847K2022R5716O3705k2736
20118A72710l2103J4112k5417m2351j6363J6867K6526J2449m557M3057O9904l2164
20106B02670r3804n8500l0019O173L2787j1377l9732k3173K5529N9101l885O480
20094G2250j8730M1948L7915N20K2588k0020n7009L0247N4478M838l3364K6288
20082A61949M275j9579M6032q4974l3000N3193P294l490o964l5413M6793L0267
20070A66383r037n0101p5329j0436N919N0818l915M6716K739l4885m7063k7832
$$ y = [139254, 117147, 148414, 128922, 141433, 222230, 300114, 388490, 476254, 635700, 828607, 948558, 995630, 811399, 550891, 306163, 187218, 203428, 235293, 225503, 183677, 159633, 142567, 134601, 135691, 116002, 104276, 81037, 53833, 34850, 14003, 36025, 131741, 195446, 172710, 140607, 154719, 129302, 86951, 70588, 87455, 113981, 126430, 121873, 164930, 234834, 202670, 108866, 50366, 20347, 26520, 59307, 47930, 8198, -14975, 10554, 69655, 65770, 72250, 53520, 95468, 133383, 133903, 156491, 136471, 79462, 109709, 164187, 169025, 135661, 161949, 166224, 146645, 192677, 107703, 74703, 127896, 135190, 131700, 124736, 89323, 136116, 166383, 157346, 107245, 31916, 21480, 27399, 78217, 74302, 121018, 123757, 88872, 41809, 13977]
20058A3977K8132K7288M5243K4834N6440M3946r405m2693m1860J373M818K3065
20046A75158Q6966O8700O8411k7472n9073r2123n2130r437K0998j07K3621P5795
20034B79307N7479Q0683J8211K8554n7349l6942K5532Q1480J03982r673n3623
20023E17641m3427m7549q7399j02069n795n287K5040n584n8743l6314m4537L9240
20011A45217M4825k2535l8989L0766K0333J9728n3609p0844k2118L6432N2637
20000A41843K8624j6178m736K3599p598j981J5200k1234J568M5609J3981p7585
19988A41112o5095k3215k454k3806L5059j4338k8795k8225K3630M9169N948K7703
19976I6693L3884M6571N967r155j555j6586M4803L5939q910K8599L2813J9646
$$ y = [13977, 42109, 69397, 114640, 139474, 195914, 239860, 230455, 187762, 145902, 147275, 152093, 175158, 262124, 330824, 399235, 371763, 312690, 220567, 168437, 159000, 179998, 179891, 203512, 279307, 336786, 417469, 435680, 464234, 406885, 369943, 395475, 476955, 580937, 571264, 517641, 474214, 426665, 339266, 237197, 231402, 226115, 251155, 245571, 186828, 150514, 105977, 145217, 190042, 167507, 128518, 159284, 179617, 199345, 145736, 74892, 52774, 89206, 141843, 170467, 154289, 149553, 173152, 165554, 163573, 178773, 157539, 159107, 204716, 218697, 141112, 76017, 52802, 50348, 26542, 61601, 47263, 18468, -9757, 13873, 63042, 68990, 96693, 130577, 177148, 183115, 173960, 172405, 155819, 200622, 236561, 227651, 256250, 289063, 308709]
19964C08709j4827k4486j6318n417P6775L8927p537o9713p7223j7322o5113k1429
19952A05026M3364N9637m234l7472J964J8794q762K6447k9920k7921K5935L9291
19940B12149R961P551L1464M2605J6386J2575L2649l2644n4476k6095j7252J5882
19928B50755J7236K3765o1559J758o019N3969K564J9368j9857R4206P9423P0200
19916E25809N0992Q0867K3735r9943q2253J7499o897k1885O6057o366j1235p7728
19904D58652n6483L3295j5108k4201O8229N7122k0702j4741J3529L6178k0000
19893E15770m253j887J5332k3041j6406L047O2734j9688k1126K9613n90l4147
19881E05358P213N0294K7484J3538j4734Q967J3123j8472l9515N5110O530k5053
$$ y = [308709, 293882, 269396, 253078, 247661, 324436, 363363, 355826, 286113, 208890, 191568, 126455, 105026, 148390, 208027, 203793, 166321, 168285, 187079, 178317, 204764, 174844, 146923, 172858, 212149, 222110, 229661, 261125, 303730, 320116, 332691, 365340, 332696, 278220, 252125, 234873, 250755, 267991, 291756, 230197, 231955, 225936, 279905, 282469, 301837, 281980, 376186, 455609, 525809, 576801, 657668, 681403, 581460, 499207, 516706, 509809, 487924, 553981, 547615, 536380, 458652, 402169, 435464, 420356, 396155, 464384, 521506, 500804, 486063, 499592, 535770, 515770, 511517, 509630, 524962, 501921, 485515, 488562, 551296, 531608, 510482, 540095, 539505, 505358, 512571, 562865, 590349, 603887, 589153, 598120, 611243, 592771, 553256, 608366, 614896, 589843]
19869E89843k206L2184M7783k4022K2521L9686K6187j4333L533M474J9061P1262
19857H15973J8233o4624K9973N8478K1035J6537L3479K4652p577J1083M9432L2018
19845A038692N7414M6354M1764N0653N6633Q8157L5236N7370R4506R5813J13777
19834A776369K29537K55592K41799J54609J34446K12249L75400L71381K50105
19825D001487O9089j3961Q4280K23715J97421k7391l06731l78011k65767j03784
19815C480347k3491J37162K41687K57471L49186N54010O70944Q14204J016161
19806G497681J078786J015059R05256R33603J219314J785149K653918L859782
19798B0948548O071794R971738J7105253K9268568M7385309O7908804P6440276
$$ y = [589843, 587637, 619821, 667604, 643582, 666103, 705789, 731976, 717643, 721176, 725650, 744711, 815973, 834206, 769582, 799555, 858033, 879068, 895605, 929084, 953736, 946159, 957242, 1006674, 1038692, 1096106, 1142460, 1184224, 1234877, 1291510, 1379667, 1414903, 1472273, 1566779, 1662592, 1776369, 2005906, 2261498, 2503297, 2657906, 2792352, 3004601, 3380001, 3751382, 4001487, 4070576, 4056615, 4140895, 4364610, 4562031, 4534640, 4227909, 3849898, 3584131, 3480347, 3456856, 3594018, 3835705, 4093176, 4442362, 4996372, 5667316, 6481520, 7497681, 8576467, 9591526, 10496782, 11430385, 12649699, 14434848, 17088766, 20948548, 27020342, 36992080, 54097333, 83365901, 130751210, 198660014, 275100290]
19791B75100290N3211911N84988n3853585q1198291p2380598m6232014k5263446
19784D9969255j4839168r347146n880815l865234k599381j809709j219491r05678
19776I502633q54777j049558j148974j075152q59022o39185n05610m59650l36691
19767B574014k75805k52738j83221L7340J79792K33864J39408j57525m63322n59703
19757A272104m76757k74473j83958j78010p9167k8743L6556J12462R2435J34870
19747D27319J20807k9844j44171j93050k04084j29316o5186j7289O8998N7708
19737a08108M2173n8504J544k4161J406k9554o6464j9717p933O8942K7856j8198
19725a90718n4092l3235q443J8107k6919m7290P982N4660L4170q13O791k7480
$$ y = [275100290, 328312201, 328897189, 275043604, 193845313, 121464715, 75232701, 49969255, 35130087, 25782941, 19902126, 16036892, 13437511, 11627802, 10408311, 9502633, 8647856, 7598298, 6449324, 5374172, 4515150, 3875965, 3370355, 2910705, 2574014, 2298209, 2045471, 1862250, 1899590, 2079382, 2313246, 2452654, 2295129, 1831807, 1272104, 795347, 520874, 336916, 158906, 79739, 50996, 87552, 200014, 292449, 427319, 548126, 518282, 374111, 181061, -23023, -152339, -217525, -234814, -165816, -108108, -65935, -124439, -122895, -147056, -145650, -175204, -241668, -261385, -269318, -200376, -172520, -190718, -244810, -278045, -286488, -268381, -295300, -342590, -334608, -279948, -245778, -246591, -239800, -267280]
19713b67280k1106l8749j2726k9303L4292L0357L5723K6230j4680k3752j6980
19702b97974N9709m3980k3102K9289j7561j6694j5648k5878J3382p566J6706M3243
19690b86074J3520L9705m5501n7860J1525K4540L4196j3243l2594J1271J0735
19679b89780O859M9390j6719l5137l4589q827J7489M3423j3725n3130p808M4095
19667b98459N4820O9627P3229J15113L0086m4219m0068K7794K5931j635P138M2125
19655F1482J0578m802l4143K4427N9255M215l9839j0656k3868k2262Q094N4492
19643H6973j477J2294l3200J2646N7563l511N925K1910r059o8193o0257j9293
19631B321K8673L421K4016j2892M8935k0749J9895k5058m0797K5972l5487o8715
$$ y = [-267280, -288386, -327135, -339861, -369164, -334872, -304515, -268792, -242562, -257242, -280994, -297974, -238265, -282245, -305347, -276058, -293619, -310313, -325961, -351839, -338457, -346023, -329317, -286074, -272554, -232849, -278350, -336210, -324685, -300145, -265949, -279192, -311786, -300515, -289780, -282921, -233531, -250250, -285387, -319976, -328803, -311314, -267891, -281616, -334746, -342554, -298459, -243639, -174012, -100783, 14330, 44416, 197, -39871, -12077, 13854, 12219, 19357, 61482, 72060, 67258, 33115, 57542, 116797, 121012, 81173, 70517, 46649, 24387, 32481, 86973, 85496, 97790, 64590, 77236, 134799, 131288, 137213, 159123, 150064, 81871, 21614, 2321, 30994, 34415, 58431, 45539, 94474, 73725, 93620, 68562, 27765, 53737, 18250, -50465]
19619e0465n0528r738j7917M024M3586L8157J8908M294J952J3481o5436j5696
19607h5378N6165K7894K8507K2524j6422k7507j9753k2609L8775M9371j1520k6072
19595A3975J9863m8163K3787j2236p0621j1913k224m7632m53J2278m3462L6616
19583a30185K9944r858L7947j9378j5188l1818J8151K6756L7873P803J0059j5498
19571e3392n0802k4676l5120n0491R138M2518N0722l019l5170j9509J1905n6139
19559b14035P01J7766K9774p039l661m2215K0085L9834N8497p947n5174L5611
19547a27803j8449K2278q596m8440M4953O2107M4506p14k4788k5563m4483R544
19535a15448M7944l433l3805R420N1188j5896p1555m8714J0843K0553N8681j6970
$$ y = [-50465, -100993, -110731, -128648, -124624, -81038, -42881, -23973, -19679, -17727, -4246, -69682, -85378, -29213, -1319, 27188, 49712, 33290, 5783, -13970, -36579, 2196, 51567, 40047, 13975, 33838, -14325, 9462, -2774, -73395, -85308, -87532, -135164, -135617, -123339, -166801, -130185, -100241, -110099, -72152, -91530, -106718, -138536, -120385, -93629, -55756, -47953, -37894, -53392, -104194, -128870, -163990, -214481, -205343, -162825, -112103, -115122, -150292, -169801, -157896, -214035, -213334, -195568, -165794, -172833, -176494, -218709, -198624, -158790, -100293, -108240, -163414, -127803, -146252, -123974, -132570, -181010, -136057, -73950, -29444, -30158, -54946, -80509, -124992, -115448, -67504, -70937, -104742, -95322, -44134, -60030, -131585, -180299, -169456, -148903, -90222, -107192]
19523a07192j4546L542L7318k4764m8973K6881P5805M345j9578J7473l0573K476
19511g7786M4693K4619l1714p8525l4475j3150k2085j1628O6169K3639N3212Q135
19499d8896j6229l4160K6350K7349L2483j0807n015M0852M439Q6156J29603J31701
19487C63826O4463m6984j53179j22673m7324L5171K0195m016o3122n5238m6340
19476e5221n2240K7373L1391N7074O6825j4731M3264j9632q974K3359k784N1847
19464A47551K3621j9000k3340J9802P0914R3542J36922K06579K74457J42251P8661
19453A151960M826j23509j95211j54969k11783j19641K4411N3365P5942J23096
19443F28487J26277J61502J54439P8289n7319j24626j55863j88749j36477p3660
$$ y = [-107192, -121738, -118196, -80878, -105642, -154615, -127734, -51929, -47584, -67162, -49689, -80262, -77786, -33093, -8474, -40188, -118713, -153188, -166338, -188423, -200051, -133882, -110243, -57031, -48896, -65125, -99285, -72935, -45586, -13103, -23910, -28925, 11927, 16366, 102522, 232125, 363826, 428289, 381305, 228126, 105453, 58129, 93300, 113495, 109479, 46357, -8881, -55221, -107461, -80088, -48697, 8377, 75202, 60471, 103735, 84103, 75129, 98488, 95704, 147551, 171172, 152172, 128832, 148634, 219548, 313090, 450012, 656591, 931048, 1073299, 1151960, 1156786, 1033277, 838066, 683097, 471314, 351673, 376084, 429449, 505391, 628487, 754764, 916266, 1070705, 1148994, 1091675, 967049, 811186, 622437, 485960, 412300]
19433D12300o2828o0948n2176n3794o6188j7195K0931k4077M4774L2154L7112
19422B10065K3175L6027n8254m6369L3893L1969K604R198L1264j2116m2561p6677
19410A42218j8875J6963L8152o1157r2719k1005n773J4626L7003o097k1572j905
19398A9859Q8170K3308p5822p0515p5529K3098J2715m0590n8943N2081p065o693
19386a15926j180L3262m129J3662K6050j894j9791k4496l9109K4135L5797l5170
19374a08789q068M5883M5737L2181m3406j9443N7735K9831N1111K3685J37m3516
19362F3078j0476L6606l9256j7407J8341N3063P8367j248p995Q840K1048n668
19350A97293k8028k5177o0213p4541l3731j5058m3281J6773O729p45k6324J3642
$$ y = [412300, 349472, 288524, 236348, 182554, 116366, 99171, 120102, 96025, 140799, 172953, 210065, 233240, 269267, 211013, 164644, 198537, 230506, 233110, 242308, 273572, 261456, 218895, 142218, 123343, 140306, 178458, 117301, 24582, 3577, -2196, 12430, 49433, 43336, 21764, 19859, 108029, 131337, 55515, -15000, -90529, -67431, -54716, -95306, -154249, -102168, -109233, -115926, -117106, -83844, -87973, -74311, -48261, -50155, -69946, -94442, -133551, -109416, -73619, -108789, -116857, -70974, -25237, 6944, -36462, -55905, 1830, 31661, 82772, 106457, 106594, 63078, 52602, 89208, 49952, 32545, 50886, 103949, 182316, 181068, 173073, 181913, 202961, 197293, 169265, 144088, 83875, 9334, -24397, -39455, -82736, -65963, -59234, -59979, -86303, -72661]
19338g2661L3944K4711K0860m1k2273m4755O5252K8372P224N03m3188O309m9682
19325d5425l4636L0838K122J315l7231m8249N293j9585l0355j6404j3793M0028
19313a66082L6735P259L5903J552j6332l6281J6768K9607J5526J8729L934P2448
19301A9766O3836k9321l6441K0696o2392j2436m2245l9678J875L2602M2994J7146
19289b3598J2400q082p7378K2176j68l1646q89L76J5939l1198m251O9514j9748
19276g6553m3035J6427n415m8646M0499K0081j0857N1633m3478m4008P330M4849
19264i1173L2899j7486L0123J7072J3319K0568k7090m3366r609j8027J657k7034
19252a18147K0071R2777j4843j9457n4443l0722M1713J2276k9869q4J9975N4438
$$ y = [-72661, -38717, -14006, 6854, 6813, -15460, -60215, 5037, 33409, 40633, 41136, -2052, 4257, -45425, -80061, -49223, -47101, -45786, -83017, -131266, -125973, -145558, -175913, -192317, -206110, -166082, -129347, -122088, -86185, -84633, -100965, -137246, -120478, -90871, -75345, -56616, -52682, 19766, 83602, 54281, 17840, 38536, -23856, -36292, -78537, -118215, -116340, -83738, -40744, -23598, -11198, -19280, -96658, -74482, -74650, -106296, -107185, -106809, -90870, -122068, -126319, -56805, -76553, -119588, -103161, -108576, -157222, -116723, -96642, -107499, -55866, -99344, -143352, -136022, -91173, -58274, -75760, -45637, -28565, -15246, 5322, -21768, -65134, -74743, -92770, -91113, -118147, -98076, -5299, -20142, -39599, -94042, -124764, -83051, -70775, -100644, -100728, -80753, -26315]
19240b6315O954j8382L8035k4472j3149j4044K6353l4364m6956J9639q703K2429
19228g2975J964l8100l46j4764L0815J8359J1152j0801J8451k3367L5928O085
19216c7599K3527J3922R893Q754J1888k1003j5136K67L151k8489L7872M3046k0596
19203B9497k8958j2824m9361l1435K8233N1579j2762K2818L0280k968n1777n2273
19191g9951j7751K9245K3430K7373M7424K488j2584k2638o780j7632j5254l1434
19179g4064q13O2578M2368J6139K4022l1947k6976R735K3407O615l3886r752R087
19166A6513n8517K8259N413L6815m5812p8957M155O4875M1936M8082O074r4436
19154b5600q161M4322q48M013N104q277j241j273j9410M1363O990k2830q883J8427
$$ y = [-26315, -19361, -37743, 292, -24180, -37329, -51373, -25020, -59384, -106340, -86701, -95404, -72975, -71011, -109111, -109457, -124221, -93406, -75047, -63895, -74696, -56245, -79612, -43684, -37599, -14072, -150, 9743, 18497, 30385, 9382, -5754, -5487, -2336, -30825, 7047, 50093, 29497, 539, -12285, -61646, -93081, -64848, -13269, -26031, -3213, 27067, 24099, -27678, -79951, -97702, -68457, -45027, -17654, 29770, 32258, 19674, -2964, -9744, -27376, -42630, -74064, -74877, -12299, 30069, 46208, 70230, 38283, 11307, 21042, 44449, 51064, 17178, 7426, 16513, -42004, -13745, -8332, 28483, -17329, -96286, -92131, -27256, 14680, 62762, 68836, -25600, -33761, 10561, 9713, 13726, 18830, 10553, 9312, 8039, -11371, 29992, 36982, 14152, 5269, 23696]
19140B3696J7814J5142k5777j8325J1560M4070n730l7731n7406k1599k1253J2384
19128f3155P2011K809J4981k1347k1348M8284L2788K4189P62o6196m3181j1974
19116c1377o378K7671L7016J8567J7624R90m0715K2850O3060J3334j8739M6462
19104A50365M674o4089O467K5698J4631K2377J4225j8823k4563J5129P132l0116
19092A23107J7344j8364j1812j5820J3580P3110j2180k0341K2505j268l4249k98
19080A35314J6334m8271m6269N965K80l2782q075L2209L3200N6303M2448L8636
19068B25292m541j7579m4298k0315P9595j9313q5783l3096M9590K7540Q343J7017
19056A82452Q4255N5409P7107J69892O2562J61168K91763L60617L57207K78127
$$ y = [23696, 41510, 56652, 30875, 12550, 24110, 68180, 62450, 24719, -32687, -54286, -75539, -63155, 8856, 11665, 26646, 5299, -16049, 32235, 65023, 89212, 89974, 23778, -19403, -31377, -37755, -10084, 26932, 45499, 63123, 64113, 23398, 46248, 109308, 122642, 103903, 150365, 155039, 90950, 97417, 123115, 137746, 160123, 174348, 155525, 130962, 146091, 153223, 123107, 140451, 122087, 110275, 94455, 108035, 181145, 168965, 148624, 171129, 169861, 135612, 135314, 151648, 103377, 57108, 63073, 63353, 30571, 22496, 54705, 87905, 144208, 186656, 225292, 220751, 203172, 158874, 138559, 218154, 198841, 113058, 79962, 129552, 157092, 165435, 182452, 266707, 322116, 399223, 569115, 631677, 792845, 1084608, 1445225, 1802432, 2080559]
19046B080559K4919k88543l82795m22506k87912j76173j04730o8707n3543m8630
19036B71939m0409j3677k7768l2763j7029m1055j6503q059Q443p902J5157K6422
19024A16796m8371N709l2448q828K4488l1184j619N7035j6921J5170J6432J3880
19012A10139l1744r64j9057p739k2845M4637j0456j945K6240K4971k1501j1396
19000G8340m1591m3094K2695J0586m9886j2762L3226L1325M7767O4553l398l5028
18988A02733j6539O138p859k5788j7503j5705L0661J5090j7890O7892J1549m5778
18976H7001n6846m4760M0238K4779k7910N802L2374K5168O0152L2001J3146n9554
18964A31591q7278N123O328k0193J6220r846j6630K3124N8788j6255k1362K883
$$ y = [2080559, 2105478, 1816935, 1434140, 1011634, 723722, 547549, 442819, 374112, 320569, 271939, 231530, 217853, 190085, 157322, 140293, 99238, 82735, 74676, 83119, 75217, 90374, 116796, 68425, 74134, 41686, 32858, 57346, 26162, 24543, 81578, 64657, 79827, 96259, 110139, 78395, 77431, 58374, 50635, 27790, 72427, 61971, 60026, 86266, 111237, 89736, 78340, 36749, -6345, 16350, 26936, -22950, -35712, -2486, 28839, 76606, 141159, 137761, 102733, 86194, 92332, 84473, 58685, 41182, 25477, 56138, 71228, 53338, 121230, 132779, 87001, 30155, -14605, 25633, 50412, 22502, 28304, 60678, 85846, 145998, 177999, 191145, 131591, 44313, 49436, 55764, 35571, 51791, 41945, 25315, 48439, 107227, 90972, 69610, 72493]
18952G2493J5067J5622j6001L880M546N6295k1905K0677j6922k0422k3592l357
18940H6381L1348Q397L1314P7345j4043J0673l7142m1176l0217k0422p532Q759
18928A03685J0500Q473J7327k2903l3291L3274Q9007j426q5723n9045l6463M221
18916B7636K5795N6152K4442l1645j2021K6453J9017l955N8Q595K7624P9781L4841
18903B82773K755m3090p9826K1570K5616n2054j6412L6885O5632N103L4641k6574
18891B57019k3295n181K4595l2762m6684M4293O0909N7525l2274J8234M5648N8248
18879D26275K1528J040j0944o1861n0384k7938m0524J8119M6457K0222k7251k3202
18867B91537m3056l5778N7462O1512N0008k8005k9147N8079R386l432k2571K4950
$$ y = [72493, 87560, 103182, 87181, 91061, 95607, 151902, 129997, 150674, 133752, 113330, 89738, 86381, 117729, 126126, 157440, 234785, 220742, 231415, 194273, 153097, 122880, 102458, 94926, 103685, 114185, 122658, 139985, 117082, 83791, 117065, 206072, 204646, 118923, 59878, 23415, 27636, 53431, 109583, 134025, 102380, 90359, 116812, 135829, 131874, 131932, 140527, 168151, 247932, 282773, 285528, 242438, 162612, 184182, 209798, 157744, 141332, 178217, 243849, 248952, 283593, 257019, 233724, 228543, 253138, 220376, 173692, 217985, 278894, 336419, 304145, 322379, 368027, 426275, 447803, 448843, 437899, 376038, 325654, 297716, 257192, 275311, 321768, 341990, 314739, 291537, 248481, 212703, 270165, 331677, 381685, 353680, 324533, 382612, 391998, 388566, 365995, 390945]
18855C90945J20824J18242J22186J55824J66692J39945M6537j0201j07328j91769
18845I51897j81452j87020j48999l3310k7596n8809l1872m2975o881k1653l5888
18834A75442j7560m697m0146j3047Q5902N8274l5481Q8095L0344l2426l2409q807
18822B53484Q680n6844N479n2330l0446n907r046J6426m664N0797L0108P555m5898
18809A67394j7151K8051K271l6394M5717J777R031J03311Q3300P9143J05461K04860
18797G76771J63176N8760R0411R535p7282j68861j74032j46912j57900j05033
18787B68633j3915J052l8014k3596j7850n7011m8467k6009K7050L5915K7141j4964
18775A19965M1941M8352J9008m4397k4300L212m0951k7428N6945R2950n6508r2526
$$ y = [390945, 511769, 630011, 752197, 908021, 1074713, 1214658, 1261195, 1250994, 1143666, 951897, 770445, 583425, 434426, 401116, 373520, 314711, 282839, 239864, 232983, 211330, 175442, 157882, 153185, 113039, 99992, 185894, 244168, 208687, 296782, 327126, 294700, 262291, 253484, 262164, 205320, 210799, 158469, 128023, 122116, 113070, 129496, 124832, 175629, 205737, 213292, 167394, 150243, 178294, 180565, 144171, 189888, 191665, 200696, 304007, 387307, 466450, 571911, 776771, 939947, 998707, 1089118, 1098653, 1021371, 852510, 678478, 531566, 373666, 268633, 254718, 255770, 217756, 194160, 176310, 119299, 70832, 44823, 71873, 107788, 134929, 119965, 161906, 210258, 229266, 184869, 160569, 163781, 122830, 95402, 152347, 245297, 188789, 96263]
18763I6263L3727n886j9972k2727K3618L7964N3155K2788k313L4748L8588Q16
18751B90769r853j2507j2785l6212p041l048J9277j3019m8998j8809O723L0311
18739A84808l5281r936M1129L0556q233J0293K227l0858j4759j0593p978l5879
18727A15496k860o475j020O9260l0199o5360p848J7239K9680j0179K5330q202
18715A24862J5991R824l6296j0155L9687Q292J874N7754O7229Q5411R6150M9069
18703E09692m0652o1143l76o2871p9621j2621K8342j278k3076q1122m6588p480
18691A21206j2441j2664K8766l1479o718K8292K7715j3572p108N7416j460n6098
18679A21855r732L1263j393k0607L597k8266q7084o6778q668R10L8368K7767l982
$$ y = [96263, 129990, 124104, 104132, 81405, 105023, 142987, 196142, 218930, 216617, 251365, 289953, 290769, 280916, 268409, 255624, 219412, 212371, 209323, 228600, 215581, 166583, 147774, 154497, 184808, 149527, 139591, 180720, 211276, 203043, 213336, 215563, 184705, 169946, 159353, 151375, 115496, 112636, 106161, 105141, 174401, 144202, 78842, 70994, 88233, 117913, 107734, 133064, 124862, 140853, 150677, 114381, 104226, 143913, 152205, 154079, 211833, 279062, 364473, 460623, 509692, 469040, 407897, 407521, 344650, 265029, 252408, 280750, 279472, 256396, 175274, 128686, 121206, 108765, 96101, 124867, 93388, 86670, 114962, 142677, 129105, 121997, 179413, 177953, 121855, 112123, 143386, 141993, 121386, 124983, 96717, 9633, -57145, -65813, -64903, -26535, 1232, -2750]
18666b750J5371N9589O8832o753n868K436k7777K071J3338J4868O4006j5322L5516
18653B17557J17679L5941M4339L6566K9855k3187l1038m3074j08383p7652j5885
18642A82718n7892n3214j2587N301j442m4082j9109j5383L5701L7013M4518N0811
18630A52353n9218j6361L8103n122k8434j9948r513J5275K4867k5675n124M7087
18618A08290j4254r9323j9526J7086J1918K0365M6365L6796K4109O598m3048o1184
18606C4192n7642L9542Q8332M1257n5907j5117K4378L1238n0M377K9089O1280
18594B24969M0302K1809J1838K1471l4885n1911M978l2584p2838k8265k0589l6701
18582D7594n70O363p035J2171K4110J955j6689k035P047n6035m4213K9880M7460
$$ y = [-2750, 12621, 72210, 141042, 134289, 128421, 130857, 103080, 105151, 118489, 133357, 197363, 182041, 217557, 335236, 371177, 415516, 452082, 481937, 458750, 427712, 384638, 276255, 198603, 182718, 124826, 71612, 59025, 64326, 62884, 18802, -307, -15690, 20011, 57024, 101542, 152353, 93135, 76774, 114877, 109755, 81321, 61373, 51860, 67135, 92002, 66327, 61203, 108290, 94036, -5287, -24813, -7727, 4191, 24556, 70921, 107717, 131826, 138424, 95376, 34192, -23450, 16092, 104424, 145681, 89774, 74657, 99035, 130273, 130223, 134600, 163689, 224969, 265271, 287080, 298918, 320389, 285504, 233593, 238571, 205987, 133149, 104884, 84295, 47594, 47024, 53387, 46352, 58523, 82633, 84588, 67899, 65864, 72911, 16876, -27337, 2543, 50003]
18569E0003J6290k0490o37l7748n134M2217r491R560J714j4889K6600L6545M7306
18556A41846l6122k4989j2325k0872o516m0043L1285J0035M5031O9299J7561J7389
18544A91579K8528L9884K4138P9706O8365M562m3394k0738J6852L7517p4138p8237
18532B74624l1986o0062j05758k1387O926m84K009O0421j8267j3941k924l9516
18520D9655M8420J6692P674j3706J5958J0206N8378K3324K3037L1413J0683l0841
18508B50893m3624j8406k6300l8687p1095k6613L8585J23864J4922m2399k5600
18497A35540k9762N4161j7133L990K7739M0816J3895J717L1575L3328r5857k0602
18485A79407J6809J5773R316n8776j8391N4083K0681K845j7334l1009k3922J812
$$ y = [50003, 66293, 45803, 45166, 7418, 2284, 44501, 35010, 44570, 46284, 31395, 57995, 94540, 141846, 105724, 80735, 68410, 47538, 41022, 979, 32264, 42299, 87330, 156629, 174190, 191579, 220107, 259991, 284129, 363835, 432200, 436762, 393368, 372630, 389482, 426999, 352861, 274624, 242638, 182576, 76818, 55431, 62357, 61873, 63882, 124303, 106036, 92095, 89171, 49655, 98075, 114767, 122441, 108735, 124693, 134899, 193277, 216601, 239638, 271051, 281734, 250893, 207269, 188863, 162563, 123876, 52781, 26168, 64753, 188617, 203539, 161140, 135540, 105778, 159939, 142806, 146796, 174535, 215351, 229246, 230963, 262538, 295866, 200009, 179407, 196216, 211989, 221305, 162529, 144138, 198221, 218902, 221747, 204413, 173404, 149482, 151294]
18473A51294k5811o8795N464N0229K3125J0444O2631N3830O0220N7701K7399j0673
18461C97058k4046l5694l0385L76j0142n438K408j2321m8969N1948j6680K2793
18449B90908L5390j59n1112m3311J1101J13985O4127m2739m1019q38M4813J9584
18437D00730N1486J1119K6459L9306K802J2904Q9200N7344J0458K0608Q3990J77624
18425I84030K10926K53641K10524R7387Q0552K1972o3163l2266M526l8693n6972
18414A672464j03662j82425j89951j32192o5233p7845o6093o0150m2351O7706
18404H20268L6095K3004K386k4825J384j7637j8182m0664j9862N1931Q0308J7311
18392I11517p460k5799O5665P738N8767P1763L8163K0547L783P0273P4585J4701
$$ y = [151294, 125483, 56688, 62152, 112381, 135506, 145950, 208581, 262411, 322631, 380332, 407731, 397058, 373012, 337318, 306933, 307309, 297167, 291729, 294137, 281816, 232847, 284795, 268115, 290908, 326298, 326139, 275027, 231716, 242817, 356802, 420929, 378190, 337171, 336333, 381146, 400730, 452216, 463335, 489794, 529100, 531902, 544806, 634006, 691350, 701808, 722416, 806406, 984030, 1194956, 1448597, 1659121, 1756508, 1837060, 1859032, 1795869, 1763603, 1768129, 1729436, 1672464, 1568802, 1386377, 1196426, 1064234, 999001, 921156, 855063, 794913, 752562, 820268, 856363, 879367, 881753, 856928, 858312, 840675, 822493, 781829, 761967, 813898, 894206, 911517, 904057, 878258, 943923, 951661, 1010428, 1082191, 1120354, 1140901, 1144684, 1214957, 1289542, 1304243]
18380A304243J8071O2558N8413N3795J24071J16374J81777K74061L70037O04518
18370C167918P01037O56575M98432K01621J6682j63476k31715j56303k36652j90965
18360D263154J0155K2804K7546L042J44918K77513M55177O39477Q72824J096196
18350G812806J463911K033300L051410M808790P986196J3574999K2340060L3630196
18342I6701668M1454154L0099518J8413619M547466j1385165k4257986l3420602
18335A22152672l9794763l2128048j7873105r594437n858495l790139k519440
18328A0594245j752272j225085q96945o69720m81440m50738k88372k52279j62234
18319D415160q8694Q7256L21804M99807O26526M57041K71411M5582k41612n31514
$$ y = [1304243, 1322314, 1384872, 1443285, 1497080, 1621151, 1737525, 1919302, 2193363, 2563400, 3167918, 3868955, 4525530, 5023962, 5225583, 5242265, 5078789, 4847074, 4690771, 4454119, 4263154, 4273309, 4296113, 4323659, 4326701, 4471619, 4749132, 5204309, 5843786, 6716610, 7812806, 9276717, 11310017, 14361427, 19170217, 27156413, 40731412, 63071472, 96701668, 138155822, 168255340, 186668959, 191216425, 179831260, 155573274, 122152672, 82357909, 50229861, 32356756, 22762319, 16903824, 13113685, 10594245, 8841973, 7616888, 6719943, 6050223, 5568783, 5118045, 4829673, 4577394, 4415160, 4326466, 4413722, 4735526, 5235333, 5861859, 6318900, 6590311, 6635893, 6394281, 5862767]
18309E862767o90267o07361n07705k43304o4367J10838K55844L16936M21228N96608
18299E451217O77768Q86858J166258J582332K273069L424839N479767R208888
18291C0150996J5649234K5556961L8020842M5079052L1272495J8819196L471801
18284B08020577j4626978k6923293l7924587m3691481l3730833j8317986r878392
18277B2927027n973596l850704k590846j877030j366462j013264p68789o58353
18269D827983o15387m77036l56646l35312k82457j42720R543J96530K42282J68407
18259C235187M6865j24697k91674m39382m86334m85879m65838k91186j81699j41110
18249C74253j60072o1218m3685m5016m6375n252l0446K0680l7662l3838p775k335
$$ y = [5862767, 5172500, 4565139, 4057434, 3814130, 3749763, 3860601, 4116445, 4433381, 4854609, 5451217, 6128985, 7015843, 8182101, 9764433, 12037502, 15462341, 20942108, 30150996, 45800230, 71357191, 109378033, 154457085, 185729580, 204548776, 208020577, 193393599, 166470306, 128545719, 84854238, 51123405, 32805419, 22927027, 16953431, 13102727, 10511881, 8634851, 7268389, 6255125, 5486336, 4827983, 4212596, 3735560, 3378914, 3043602, 2761145, 2618425, 2627968, 2824498, 3066780, 3235187, 3282052, 3157355, 2865681, 2426299, 1939965, 1454086, 988248, 697062, 515363, 374253, 214181, 152963, 109278, 64262, 17887, 12635, -17811, 2869, -34793, -68631, -76406, -78741]
18237g8741n5592j9591J6883J8915j8904M6602o896j9864M4738k4535n5489L912
18225a48562l9339p937m4356L576J7063K7257m407m8027n5457r573N4462N9869
18213a95431M0925K6785L353j054r636L50J9803M3837k3961j2910k7925k2729
18201a58593n017k9752J2429l1842p9752J1373J7723l0733l4405P4271P9284J3027
18189a61987n2525k6604j5029O558l5929J1826R4201L5316r585K1627J949k2957
18177a53139m0403k095j4581k6969j7983O611L3136n50m2596k820k3521Q226M2435
18164b34249m7309N031M3380P8943O2846k6531p31N9144M6774J4849K9455k0948
18152A0654R929P7565l868l2438n9755k6355q368m397M870J8430o9133n6421J3392
$$ y = [-78741, -134333, -153924, -137041, -118126, -137030, -90428, -97324, -117188, -72450, -96985, -152474, -148562, -187901, -195838, -240194, -236618, -219555, -192298, -196705, -244732, -300189, -309762, -255300, -195431, -154506, -127721, -124368, -125422, -135058, -134708, -114905, -71068, -95029, -107939, -135864, -158593, -163610, -193362, -180933, -212775, -292527, -281154, -263431, -294164, -328569, -254298, -175014, -161987, -214512, -241116, -256145, -249587, -285516, -273690, -179489, -144173, -153758, -132131, -130182, -153139, -193542, -195637, -210218, -237187, -255170, -248559, -215423, -215973, -258569, -261389, -284910, -276684, -234249, -281558, -276527, -233147, -154204, -91358, -117889, -118620, -59476, -12702, 2147, 31602, 10654, 20583, 98148, 94280, 61842, 2087, -24268, -32636, -37033, -32163, -13733, -82866, -139287, -125895]
18139a25895J9753L281o658Q3138Q182o5262O362M7248K6148k0019K6166j206
18127A238l2461L4208l2771k6013J6921L8684j1955n7487p348K9768k2817J7273
18115e2760K5052k5740k262k8247J2552M91K1396Q957O28P141k1188j4424K7065
18102d1339N679n3411p22J3521N8149o468l856L301K8868N0999k312Q367J7127
18089G7903J1496o872m0153o1871j7203n610k334P461L6785K7334L0409K730l403
18076E6672K8293o4663m4401p89J4557l5571j7389K2640L7924k7593L1958N6325
18064E7963o827j2747p6119m4498L8433q571j1563L7137m5177r5580J3768R8377
18052e5404J08617N4814N128k9781j02945n5033J2385Q698j8153L5220K5237m7536
$$ y = [-125895, -106142, -102861, -109519, -26381, -18199, -83461, -77099, -29851, -3703, -23722, 2444, 1238, -31223, 2985, -29786, -55799, -38878, -194, -12149, -69636, -76984, -47216, -70033, -52760, -27708, -53448, -55710, -83957, -71405, -70914, -49518, -40561, -39933, -32792, -53980, -68404, -41339, -35660, -89071, -89793, -76272, -18123, -24591, -28447, -25146, 3722, 54721, 52409, 60776, 77903, 89399, 82527, 42374, -19497, -36700, -42310, -44644, -37183, -398, 26936, 57345, 60075, 56672, 84965, 20302, -24099, -24888, -10331, -45902, -63291, -40651, -2727, -30320, 1638, 57963, 51136, 38389, -37730, -82228, -43795, -52366, -63929, -26792, -71969, -167549, -153781, -55404, 53213, 108027, 113155, 83374, -19571, -74604, -62219, -53521, -71674, -36454, -11217, -58753]
18040e8753K4328L2941q739P634K7911J5221n349J5951p792N467j4718k373j7964
18027A3765l7734M6860o7235j1960o263k1890o04N5473J4922n1977Q263K1663
18015c6717m0934j7814k2736j1986L6044O2346j1583p32J2767k4554N886p033
18003e7046J2554N8034O5667J9878m7738k1862J3630n8335p6526N8811K114q7918
17991a18737J639j5326J1348P8753P8884P02K3864O103l703J511l7595k4964J3987
17978A6466j383J2116j2623j6014M9020l0460l5197J0049m1114j6342N33M141
17966f0808J2812M6496P720l4139k5425m0807l5472R529M2833N409M214L4373
17954c3265j3542j4790J2381J321p7424k8991k8432l1759M9497R6269O1969n09
$$ y = [-58753, -34425, -1484, -10223, -2589, 25322, 40543, 35194, 51145, 43353, 48820, 34102, 31729, 13765, -23969, 22891, -44344, -56304, -62567, -84457, -85061, -29588, -14666, -66643, -58380, -36717, -77651, -95465, -118201, -130187, -94143, -31797, -43380, -44112, -31345, -55899, -50013, -57046, -44492, 13542, 79209, 99087, 51349, 29487, 43117, -15218, -91744, -32933, -30819, -118737, -117098, -132424, -121076, -42323, 36561, 37263, 61127, 67230, 63527, 65038, 27443, 2479, 16466, 15083, 27199, 14576, -1438, 47582, 17122, -18075, -8026, -49140, -65482, -64949, -60808, -47996, -1500, 6220, -27919, -53344, -94151, -129623, -120094, -77261, -71852, -67638, -33265, -46807, -61597, -49216, -47895, -125319, -154310, -182742, -214501, -165004, -68735, -6766, -7275]
17942g275L087l6730k110l1455k5212k328J7546P105O0977L1753J7513K4017K8178
17929H5066q854m7899J6374L5825k9256j1362M4061R3159p153j6996N3252n7580
17917A48637n2431K1814m5391P095J3062L7477Q1855L3308J996J2706k6135m837
17905B29156K208k664l6499k19Q7143J33082O4296m3772j15688p8244R967J5960
17893B64726Q04L3516O9975K7859k4795L1933J2659J2800Q7372M4500K8178J37956
17881G27483J20842J48037J03130L0666N1726n4100k08863j90200j23905l9759
17871E65057K4078M6625R8784J74062J99910M8772n5476o7102j25852k43900j99757
17860D65201j18036n3627N3901N970m3631p8170l2194n3008k1380L3936K0730
$$ y = [-7275, -4188, -40918, -43028, -74483, -99695, -102023, -84477, -77372, -16395, 15358, 32871, 56888, 85066, 76212, 28313, 44687, 80512, 51256, 39894, 83955, 177114, 169961, 152965, 206217, 148637, 96206, 118020, 72629, 79724, 92786, 130263, 212118, 245426, 247422, 260128, 233993, 229156, 231364, 228700, 192201, 191982, 279125, 412207, 476503, 432731, 317043, 238799, 248766, 264726, 265530, 299046, 369021, 396880, 372085, 404018, 416677, 429477, 516849, 561349, 589527, 727483, 848325, 996362, 1099492, 1130158, 1181884, 1127784, 918921, 728721, 604816, 565057, 589135, 635760, 734544, 908606, 1108516, 1157288, 1101812, 1034710, 908858, 664958, 465201, 347165, 293538, 347439, 353409, 309778, 231608, 199414, 146406, 125026, 158962, 179692]
17849A79692N327K0773M2496M8947Q935j4814N219o4687j17630n0455K6591j5532
17837G4862m3054M3883P7371J9644l490N7632J24756J70083N2238J8669P8168
17826F70762J18880P9531L1604m1580j31923j20650j88918j65132j56067o0906
17816C5601k5239k6191j5653K3423O032L689j6467j9645k6104j1601N7787o423
17804b0791J7190N405k551P672j2501j0194K4060L1462J5505l3616M9537j1006
17792F0172l4608Q161O55M146J6539J2608o160J2768M105O87p585N773j931M4184
17778A19514K9742O6416J58020J30777J56074J68800J25914Q9175K686r3693r1987
17767H61438j24214j78571k14778j49662m2633n0208K6458O6265p428m1408q7126
$$ y = [179692, 185019, 205792, 248288, 297235, 306170, 291356, 296575, 231888, 114258, 63803, 90394, 74862, 31808, 75691, 153062, 172706, 169216, 226848, 351604, 521687, 573925, 592594, 670762, 789642, 869173, 900777, 859197, 727274, 606624, 417706, 252574, 96507, 35601, 10362, -15829, -31482, -8059, -2027, 1662, -14805, -34450, -60554, -72155, -14368, -20791, -3601, 1804, -747, 6925, -5576, -15770, 8290, 39752, 55257, 21641, 71178, 60172, 25564, 33725, 34380, 38526, 55065, 67673, 61513, 74281, 78386, 79073, 71488, 77261, 75330, 119514, 149256, 215672, 373692, 504469, 660543, 829343, 955257, 1044432, 1047118, 953425, 861438, 737224, 558653, 343875, 194213, 151580, 101372, 127830, 194095, 186667, 145259, 58133]
17756E8133k4052K8580L3255P565P356M052m2177l7617L8266R1458O25j1274r316
17743A44854l3373N105m8581p9265n6322J2594J4965P6496Q3225L0360j3241m7476
17731H9341l6043Q0098M1239J1437K0307J853j7643K663p0579n4267j842n1693
17719A4871J6383J9184N014l6179k2045P670r706p787j6694J6431J7429O4153
17707F8724J8729M81L1376k5003o4922j2412l7451j9072Q908J2171j2898N4751
17695B3382M8723J3179j257m0282m857M4754J4302N5030J3356k0294l2934K5979
17683A39081J5596l4819m8994K4186K3032R208R558N7429K2916M3427o92j9032
17671B40896o4567k4864k709L1903j3790k1235j4516l3110J3029M7557J24158
$$ y = [58133, 34081, 62661, 95916, 103481, 110837, 114889, 72712, 35095, 73361, 164819, 165444, 154170, 144854, 111481, 116586, 68005, -11260, -67582, -54988, -40023, 36473, 119698, 150058, 136817, 89341, 53298, 133396, 174635, 186072, 206379, 208232, 190589, 193252, 122673, 68406, 66564, 14871, 31254, 50438, 55452, 19273, -2772, 4898, -4808, -12595, -29289, -12858, 4571, 68724, 87453, 87934, 119310, 94307, 29385, 16973, -20478, -39550, -30642, -18471, -31369, 23382, 72105, 85284, 84027, 43745, 38888, 83642, 97944, 152974, 166330, 146036, 113102, 139081, 154677, 119858, 70864, 95050, 118082, 127290, 136848, 194277, 217193, 260620, 259928, 240896, 176329, 151465, 148756, 180659, 166869, 145634, 131118, 98008, 111037, 158594, 282752]
17660B82752K04541J43842M5562n29j32360j48765r3819q871k451o492k5282j843
17648B56285O8567J12298J38776J41598Q590j16756j02478j43706o2999l9347
17638B60828o7962j1826K657o4687k4650M0895R583K6847j2785J5947M6826M0352
17626B62025k2900q4095l0384J8615N5660L9510K3498k5960j7233l0828l953L2654
17614B16609L6447K7164L6757K9955Q1837J01259N3072L896P1172R9453O7055
17603H24676l3667j75689j15638n0645j34935r0784J6209N7922R5138J8929J20607
17592E32123J88925P0141n0573j19408j19523j30551p6881k3830k7652q812K8221
17581B62180l6573J1394K521L0431J6239k818n0862L0692j7372l7677k3741m2972
$$ y = [282752, 487293, 631135, 676697, 676168, 543808, 395043, 301224, 292353, 289902, 283410, 258128, 256285, 324852, 437150, 575926, 717524, 726114, 609358, 506880, 363174, 300175, 260828, 192866, 181040, 183697, 119010, 94360, 135255, 144838, 171685, 158900, 174847, 221673, 262025, 239125, 155030, 124646, 143261, 198921, 238431, 261929, 235969, 218736, 187908, 183955, 216609, 253056, 280220, 316977, 346932, 428769, 530028, 583100, 586996, 658168, 757621, 824676, 791009, 615320, 499682, 449037, 314102, 223318, 239527, 297449, 392587, 411516, 532123, 721048, 791189, 740616, 621208, 501685, 371134, 294253, 270423, 242771, 233959, 262180, 225607, 237001, 239522, 269953, 286192, 283374, 232512, 263204, 245832, 208155, 184414, 141442]
17569A41442k3683j5615K1476N0970N98n1641l0188L8805R0286J8744m0582l4019
17557A66593J3813l9885Q954J2640l5619j236j3940J6900p33R726J485K0970K4170
17544A83838O7465k0689o1671K4009K3090O927j0544J7673k1977K538J9891N5758
17532B86308p225l459L6525L5354N6588J2481L2194j9668k52k1427k7762O19l081
17519C77195M5822J4322m258j4654L0365Q1053L9014O0748M7980P1300R9774J01418
17507I50079R8957P8645L5988l8208k0292K8601L0844o4943j20330j50531o3765
17496G65045l6698m9695j9164N9538J33933J9199N427Q4127R908m5896j05623
17485H20101j29682r7079p0514K0544J04934J39342J31431K8755P7386J31469
$$ y = [141442, 117759, 102144, 123620, 174590, 175188, 123547, 93359, 132164, 222450, 241194, 200612, 166593, 180406, 140521, 149475, 162115, 126496, 125260, 111320, 128220, 127487, 137213, 138698, 159668, 183838, 251303, 230614, 168943, 192952, 216042, 222969, 212425, 230098, 208121, 210659, 230550, 286308, 279083, 275624, 312149, 347503, 404091, 416572, 448766, 429098, 428846, 407419, 379657, 380276, 377195, 423017, 437339, 433081, 418427, 448792, 529845, 568859, 629607, 677587, 748887, 848661, 950079, 1049036, 1127681, 1163669, 1125461, 1105169, 1133770, 1164614, 1099671, 979341, 828810, 765045, 728347, 678652, 659488, 719026, 852959, 872158, 877585, 961712, 971620, 925724, 820101, 690419, 593340, 522826, 543370, 648304, 787646, 919077, 947832, 1025218, 1156687]
17475A156687K9997j1528j09737r9750m9261q9480p4050m8363l0958L2525l7476
17464F68606n739J3057k3871k9866K5352O8334K0357l1509K919j9720J4794j7977
17452F84737k2311K084J7808L2172j4243k1019l697K4703m1253L5823N8661K6377
17440G79842k0756m5997m9831J966L0546N0474N9644P410l4007J5747N0853j6199
17428H29692m3398K1625N2788K0066R50J0675K1719J8721L8102Q971J8150N965
17416A004026L0248L2980N290O4456K8345k9385j2727j4425Q5173O9529Q8534
17405A352044O3319L7608N4430J30896P2039R9711N7463J05185P0018J21746O1818
17394B226277Q7127J12155Q9495J64378K11362K03781K61948L98209N43522O20865
$$ y = [1156687, 1186684, 1175156, 1065419, 965669, 916408, 826928, 752878, 704515, 673557, 706082, 668606, 662867, 675924, 652053, 622187, 647539, 715873, 736230, 704721, 707640, 687920, 702714, 684737, 662426, 664510, 682318, 714490, 700247, 679228, 675531, 700234, 658981, 694804, 753465, 779842, 759086, 713089, 663258, 665224, 695770, 746244, 805888, 813298, 779291, 795038, 845891, 829692, 786294, 807919, 860707, 880773, 881723, 892398, 914117, 932838, 970940, 979911, 998061, 1004026, 1034274, 1067254, 1072544, 1137000, 1165345, 1135960, 1123233, 1108808, 1193981, 1263510, 1352044, 1415363, 1452971, 1507401, 1638297, 1710336, 1810047, 1867510, 1972695, 2042713, 2164459, 2226277, 2313404, 2425559, 2515054, 2679432, 2890794, 3094575, 3356523, 3754732, 4298254, 4919119]
17384D919119P49452O97615O22579N77136N67442O94895P67037J035249J550934
17375A2181458K226515L310309N128303Q181884J3495815K2461173L4757982M5919204
17367A47662643L8497806P038067m538272M148086j7163573m6935906m2167348
17360H6541503k0084580m325677P071918K0166682L6046819N0399379M2502894
17353B18318938K680866j4212776l253391k1079841n2452811n0122171k9031965
17346E0846849j5045685q801911n602053l621037k701996k194077j464332r54127
17338A0461631j059377j102936q27924o55310q01661q23296p64470o52381n33960
17329C240316m59233l81900l03607k13541j93041j38753o3882j08697j81376j25974
$$ y = [4919119, 5668571, 6366186, 6988765, 7565901, 8133343, 8828238, 9595275, 10630524, 12181458, 14407973, 17718282, 22846585, 31028469, 44524284, 66985457, 101743439, 147662643, 186160449, 193198516, 188660244, 192808330, 175644757, 128708851, 86541503, 66456923, 62131246, 69203164, 89369846, 125416665, 175816044, 218318938, 220999804, 206787028, 203533637, 182453796, 130000985, 79878814, 50846849, 35801164, 26999253, 21397200, 17776163, 15074167, 12880090, 11415758, 10461631, 9402254, 8299318, 7471394, 6816084, 6014423, 5191127, 4426657, 3774276, 3240316, 2781083, 2399183, 2095576, 1882035, 1688994, 1550241, 1486359, 1377662, 1196286, 1070312]
17319A070312j45206j14615n9209k0293l0308m7222r950m2793n5406k2508j9501
17308E03301m0549l4178k64l5388k2322l324l6962k0113N4593O0052J8981m588
17296D39239m0654j9391n4852j5723l021M986J4546K8481M75K94J2258O5298O4743
17283D96679k3733n13j3072m7237m1281j2406o6506l3152k909L3388J1600L1026
17271C31884O8273L9395M044l747K1330O9393J56566J27968J74268J95278J25692
17260A310344Q0684m2430r1273o9232j40321j68676j47015j4344M0874K8112P2271
17249H58994J10166J64371Q5250J4101J6172n4943j07100q0566j02221j39174
17239G65050j08359l3573j2454J7197J9829j8481J7783Q2160Q5599M7420n903
$$ y = [1070312, 925106, 810491, 751282, 730989, 700681, 653459, 643509, 600716, 545310, 522802, 503301, 462752, 428574, 428310, 392922, 370600, 367276, 330314, 310201, 364794, 424846, 443827, 439239, 398585, 379194, 324342, 308619, 305598, 310584, 325130, 353611, 354086, 354380, 366638, 431936, 496679, 472946, 472433, 459361, 412124, 370843, 358437, 291931, 258779, 255870, 289258, 300858, 331884, 400157, 439552, 443596, 439849, 461179, 530572, 687138, 815106, 989374, 1184652, 1310344, 1391028, 1348598, 1257325, 1188093, 1047772, 879096, 732081, 717737, 758611, 786723, 858994, 969160, 1133531, 1218781, 1232882, 1249054, 1194111, 1087011, 1006445, 904224, 765050, 656691, 623118, 610664, 627861, 647690, 629209, 646992, 729152, 814751, 862171, 856268]
17228H56268K3168L6401o0524j1687M8888P117j1539r6027m3579j020R1192J09306
17216I47964N0714Q0822N0022J2379P6523O1585N7226L5180m1159o3900m0124
17205A227232j00132r8475j6237O2853M0936J8033p894o862N3894J03427J92994
17194A469769K87107K65273K30416M0303j18187j21138j02029n0282P3814J18990
17184B094036K21810L76831N21300M94225M37164K98421l2429k84324j60054Q0500
17174D047480K48806M28943N89400P17007R62763J284469J763643K417778L571329
17165A6031618N650250R752967J7123594K7975849L9797199M0249404R882446
17158A66463327l1713389m6261373l3149771j6630600p720444k695588J384563
$$ y = [856268, 879436, 915837, 855313, 843626, 892514, 899631, 888092, 792065, 748486, 747466, 838658, 947964, 998678, 1079500, 1129522, 1141901, 1218424, 1280009, 1337235, 1372415, 1331256, 1267356, 1227232, 1127100, 1028625, 1012388, 1075241, 1116177, 1134210, 1126316, 1119454, 1173348, 1276775, 1469769, 1756876, 2022149, 2252565, 2292868, 2174681, 2053543, 1951514, 1901232, 1975046, 2094036, 2315846, 2692677, 3213977, 3708202, 4145366, 4443787, 4411358, 4127034, 3966980, 4047480, 4296286, 4725229, 5314629, 6031636, 6994399, 8278868, 10042511, 12460289, 16031618, 21681868, 31434835, 48558429, 76534278, 116331477, 156580881, 166463327, 134749938, 88488565, 55338794, 38708194, 30987750, 28292162, 29676725]
17151B9676725O167553J3121436K2750115L3041733L3952683Q310362k7784839
17144A19235768m1696563l0807020j6292133q597994m988872l244094k354229
17137A1254863j848795j511240j149463p96642n00466l26423j61864J07756L38303
17128E406029N89365L87973L390k90516n75101n84080l53879j02396Q2711K16137
17118D779633M44535P41105R92799J322774J647865K126256L092357N194666R209080
17109B9551070J6141180K6260948L6819551L4969128N441582l1533083m1577503
17102G6072873k8444134j4072022o420036k037686J707261O229682J2893256K2132975
17094F8062169L1898943L1284791M882240k9228833l9303959k7517586j4165329
$$ y = [29676725, 35844278, 48965714, 71715829, 104757562, 138710245, 147020607, 119235768, 77539205, 46732185, 30440052, 21842058, 16853186, 13609092, 11254863, 9406068, 7894828, 6745365, 5948723, 5448257, 5121834, 4959970, 5067726, 5406029, 5995394, 6383367, 6386757, 6096241, 5521140, 4937060, 4583181, 4480785, 4563496, 4779633, 5224168, 5965273, 6958072, 8280846, 9928711, 12054967, 15147324, 20341990, 29551070, 45692250, 71953198, 108772749, 143741877, 149183459, 117650376, 76072873, 47628739, 33556717, 27136681, 25098995, 26806256, 33035938, 45929194, 68062169, 99961112, 131245903, 136128143, 106899310, 67595351, 40077765, 25912436]
17087B5912436p588312m577418l070392k243406j619018j096718q30288o21477
17079D265407m65875l36330k33199p9732O6608J21595j66351m63642m96008m01654
17069A810819l00012k38394k03801j31790n9033J1110L8625J71485J40216k2186
17059A217039k00788k44296j99876j17408p4025q3510m5883k058j1756k5076l682
17048B08681j7860n9026k8037P9144N7201o6395J398K4147M028j8797n1346k4008
17036A09130K1547l423l6310n4923J7645P1981J4576m5385n5344J9400K0480N428
17024H4802o766k696l8351j533K1581K4826k7357l0881J9479j5645J9862J9715
17012F7036l3477K596N5605J0158k8137N375K1030m2798j493j1997k6241L497
$$ y = [25912436, 18324124, 13746706, 10676314, 8432908, 6813890, 5717172, 4886884, 4265407, 3799532, 3463202, 3230003, 3150271, 3216879, 3338474, 3172123, 2708481, 2212473, 1810819, 1510807, 1272413, 1068612, 936822, 877789, 888899, 927524, 1099009, 1239225, 1217039, 1016251, 771955, 572079, 454671, 380646, 297136, 251253, 249195, 237439, 212363, 208681, 190821, 131795, 103758, 182902, 240103, 173708, 175106, 199253, 203281, 184484, 133138, 109130, 130677, 127254, 90944, 36021, 53666, 125647, 140223, 94838, 39494, 58894, 79374, 84802, 78036, 75340, 36989, 35456, 57037, 81863, 54506, 23625, 43104, 27459, 47321, 67036, 33559, 36155, 91760, 101918, 73781, 79156, 100186, 57388, 55895, 43898, 17657, 21154]
17000B1154n368l0564l8991R273M953L2582M0448K3025K5618l0090k2319K4602
16988E4323p290m9452O6776K8971m0833l8093p483P691M1087N6868o994j8315
16976H7256j1856m9883j9435j0142M2665L6634K1496K9557J7348N7592K6392L0391
16964B58015M943j0778N047l63L7130J04592L5432j7766k004j11701m9666K2507
16952B75388O963J4873l7744r309l4595r521k0505k5617Q90r726p849J9344M7677
16939B10269N8467N8009J03900Q350j9993o8328o4028l9942l382j1648m315n147
16927B22212m096j4356m4713m8643j7768M094Q8146O383l4463K0516Q649K5138
16915B11099K1003P375j6066M8766Q2424P8588N5582O0985K3642L6073Q113l9788
$$ y = [21154, 15786, -14778, -53769, -44496, -39543, -6961, 33487, 56512, 82130, 52040, 29721, 54323, 47033, -2419, 64357, 93328, 52495, 14402, 6919, 14610, 55697, 112565, 105571, 87256, 75400, 25517, 6082, -4060, 38605, 75239, 96735, 126292, 143640, 201232, 227624, 258015, 262958, 252180, 257227, 256864, 293994, 398586, 434018, 416252, 414248, 302547, 252881, 275388, 282351, 297224, 259480, 250171, 215576, 206055, 185550, 159933, 160823, 151097, 143248, 162592, 210269, 268736, 326745, 430645, 438995, 419002, 350674, 286646, 246704, 243322, 231674, 227359, 222212, 218116, 203760, 159047, 110404, 92636, 96730, 184876, 191259, 156796, 177312, 185961, 211099, 232102, 239477, 223411, 272177, 354601, 433189, 488771, 549756, 573398, 609471, 617584, 577796]
16903E77796r9603o5015q1376j10734n6584Q2863N5621r048q7871j05008L9135
16892A40176O1992N4226K0225J7249p773N59N3275O0569R337j13589j43059p1206
16880H1981q8475k1290J9988O577N8450L8451K0420k1049k6439j6940k6855j8577
16868F242l7751Q023Q7283J2173n9471J4955m3742j5032L8565N0366k0333J6825
16856E8103J21040M2808j3829N1060J25707K17051K11288J48399M4944k5693k0842
16845I60036j26967j85990j08615n1704j5358N4039Q3458J17578J73818R3528
16835I93823k2979P627j4011j81244k23757j78348j19974p9178k1763l6693o0500
16824F3003l774n0314n6318L9345L05l747k4669q097j1516L1861P206K6177J6103
$$ y = [577796, 478193, 413178, 331802, 221068, 164484, 247347, 302968, 293920, 206049, 101041, 140176, 202168, 256394, 276619, 293868, 286095, 286654, 339929, 400498, 409835, 296246, 153187, 81981, -6494, -27784, -7796, -1219, 57231, 95682, 116102, 95053, 68614, 51674, 24819, 6242, -31509, -23486, 63797, 75970, 16499, 31454, -12288, -27320, 11245, 61611, 41278, 58103, 179143, 221951, 208122, 259182, 384889, 601940, 813228, 961627, 1006571, 980878, 960036, 833069, 647079, 538464, 486760, 471402, 525441, 608899, 726477, 900295, 993823, 970844, 978471, 964460, 783216, 559459, 381111, 261137, 181959, 160196, 123503, 63003, 59229, 8915, -47403, -8058, -7753, -11500, -36169, -44266, -55782, -23921, -16715, 9462, 25565]
16811B5565M975p468O0170j3211j6062J6150l8665q2635l222O351L6104j0002
16799b1950l5427r764J3992J7461k1472M4585K349n1326j8642K7210n669J7961
16787d0692k1820R827O2K6783L0759j3389n577o5792k5035M0673Q5738m0567l9015
16774e8045j2091l135K7503k1516o856k8937j6690K1486q02p296j6478J0556P6249
16761c6052l3300n2366K3240J9582m6662o468O4032l3106k1539N1156O1727l0297
16749d0053r9519K2131O4588j4530L5732K6450n961k7562o6988K2020L7642l921
16737d9971m7641l9508M0028K1766k6338K7082o741l3127l758N9530N0959K0607
16725A2888Q61J4823M4795m5309p8737n2410m048M1659L169j7573L381K5166o775
$$ y = [25565, 30540, 23072, 83242, 70031, 53969, 70119, 31454, -51181, -54403, -48052, -11948, -21950, -57377, -67141, -53149, -35688, -57160, -12575, -10226, -61552, -80194, -52984, -58653, -40692, -62512, -52685, -52623, -25840, 4919, -8470, -14047, -79839, -104874, -64201, 21537, -19030, -58045, -70136, -73271, -45768, -67284, -74140, -103077, -119767, -98281, -99083, -106379, -122857, -112301, -36052, -69352, -121718, -98478, -78896, -125558, -132026, -67994, -101100, -122639, -71483, -9756, -40053, -139572, -117441, -52853, -67383, -31651, -5201, -11162, -38724, -105712, -83692, -46050, -49971, -97612, -137120, -97092, -75326, -101664, -74582, -81323, -114450, -118208, -58678, -7719, 12888, 13749, 28572, 73367, 28058, -50679, -103089, -107137, -65478, -62309, -79882, -76501, -51335, -58110]
16712e8110K2772L1983J7957L976m4052J2768N1677R836L1479j953j1510j45L0529
16699I7207k6538k8041l2643k492j031K699P2415M0744q0314j1170K3968K0404
16687G5208K9528J9948K5238l2219j2366q737K0674j1050q7649r681P998j911
16675A4981K9755m4238k7728L3330O0295K9402L0566Q2228J09513J97549J36286
16664F51939k7552j21294j11128l9081J299O5130J76959J35640N2489q5396j44068
16653E54937j16641p3492k2874p9029J8997L2885N202N0627J60657J57018K7411
16642G15698j13749j47382j03562j09191m6460l0548o2474m1809L4757r234m1097
16631D4949K3200n7034m5102M2583O2010j8129j7025j2921m7130r481j2982J661
$$ y = [-58110, -35338, -3355, 14602, 18578, -25474, -12706, 38971, 48807, 80286, 78333, 66823, 66678, 97207, 70669, 42628, 9985, 7493, 6462, 9161, 81576, 122320, 42006, 30836, 54804, 75208, 104736, 124684, 149922, 117703, 105337, 96600, 117274, 106224, 18575, 8894, 16892, 14981, 44736, 498, -27230, 6100, 66395, 95797, 126363, 208591, 318104, 515653, 651939, 624387, 503093, 391965, 352884, 354183, 419313, 596272, 731912, 784401, 699005, 554937, 438296, 364804, 341930, 262901, 281898, 314783, 319985, 370612, 531269, 688287, 715698, 601949, 454567, 351005, 241814, 195354, 164806, 102332, 60523, 95280, 86046, 44949, 68149, 11115, -33987, 8596, 70606, 52477, 35452, 22531, -24599, -34080, -47062, -45401]
16619d5401m5044J5433Q7246J35833J46309J26859O2968m8847j39706j18609j9761
16608A57280j70l8349O7578P8582J11926J54266M6730o7656j10928j15342m8031
16597B35886k8427J7298M9216M4530J4128R0126J64584J12080N8093q5051j74284
16586D98179j41921j08395n1761m0790o9804m8359l298l2799M983m4069L2092
16575e942r718k2174N063L0001k0110r758l632R010l7732j12929j6628O9645j148
16562a26052M1324L3342k0402k5115L0043K1024r084n8900j9075J8112K4346M0296
16550e0141L2013L8191J7482l0697o7191n6730J8102J3456L2686k4970n9658k1337
16538a58794M8611j2676M0341L1143L2143m2991j7912M2300l480n2519P219M9991
$$ y = [-45401, -90445, -75012, 12234, 148067, 294376, 421235, 484203, 435356, 295650, 177041, 157280, 157110, 118761, 186339, 264921, 376847, 531113, 577843, 510187, 399259, 283917, 235886, 207459, 224757, 273973, 318503, 332631, 422757, 587341, 699421, 757514, 672463, 498179, 356258, 247863, 196102, 155312, 85508, 37149, 33851, 1052, 6035, -38034, -5942, -15660, -37834, -32771, -2770, -22880, -32638, -36270, -27260, -64992, -177921, -194549, -124904, -126052, -84728, -51386, -71788, -96903, -66860, -45836, -54920, -113820, -132895, -114783, -90437, -50141, -18128, 20063, 37545, 6848, -60343, -117073, -98971, -85515, -52829, -77799, -137457, -158794, -110183, -122859, -82518, -51375, -19232, -62223, -80135, -37835, -41315, -93834, -86615, -36624]
16526c6624K805R419L1342J1711l5076n4976L895O614J4504k2320j8219j2625
16514i9550k9120K6553M4284j2913l5199J7242l1338k1081M5790O8258K8543O316
16502G785J2788L8614K9761Q668P635k9523m3575r6899j00008k5014J15J4780
16490a74873M6916O1768J5801K6798K7699j826m5131k739j3159K7331R303J1972
16478a0140O8424R975k6532k3854j9790j1567k9823r2791P408P1739l964q3864
16466a44779k4752l4305M1624J2966K2853O1736M1211k9448l9545j3023o3340
16455a68802j6178K8508M8901m3051n5997L8515k4444M4737N2871P987k7024l40
16443a14317Q691r366j151o8452l8562k2358k7244k5234Q4947N4656l4313K0548
$$ y = [-36624, -33819, -24400, 6942, 18653, -16423, -71399, -67504, -60890, -46386, -68706, -86925, -99550, -128670, -102117, -57833, -70746, -105945, -88703, -120041, -141122, -95332, -27074, 1469, 7785, 20573, 59187, 88948, 97616, 105251, 75728, 32153, -64746, -164754, -189768, -189653, -174873, -127957, -66189, -50388, -23590, 4109, 2283, -42848, -45587, -58746, -31415, -22112, -10140, 58284, 68259, 41727, 17873, -1917, -13484, -43307, -136098, -128690, -56951, -60915, -144779, -169531, -203836, -162212, -149246, -126393, -64657, -23446, -52894, -92439, -105462, -168802, -184980, -156472, -107571, -150622, -206619, -168104, -192548, -147811, -94940, -86953, -113977, -114317, -105626, -114992, -116143, -184595, -223157, -245515, -272759, -297993, -213046, -158390, -192703, -172155]
16431a72155L6415M6406j1976L602M4188N5744M5570L1983N0271R162k8475j7776
16419I2959o1109j1868r652l1377J5601m269J9948o5935J1706K6403J0883J6400
16407I690J467l4442J8816M3220J76P790J5530M8650M6208l1535o4778J4839K0499
16394I6130M6583J6684l5705n3208O238M0328J0100J6562L8863m1089l6957k108
16382A02421N5448L020M881N5510m488M9839K0344N8591K674o8556j2190L5155
16370C02649l0313l9773m9010p397J7202r717l0541R159N0951O8781R2044P8149
16358D52184N3486L5348k6921j3925p633K1639O1130J2192R4723J67695K44713
16347A094631J92275P4578o4946k07845k57803k28068r1117j8243O6041k940P6368
$$ y = [-172155, -135740, -89334, -101310, -97708, -53520, 2224, 47794, 79777, 130048, 139210, 110735, 92959, 31850, 19982, 10330, -21047, -5446, -9715, 10233, -55702, -43996, -17593, -6710, 9690, 11157, -23285, -4469, 38751, 38927, 46717, 62247, 110897, 157105, 125570, 60792, 75631, 96130, 142713, 159397, 123692, 70484, 76722, 117050, 127150, 143712, 182575, 141486, 104529, 102421, 157869, 160889, 165770, 221280, 216792, 266631, 286975, 345566, 348240, 279684, 267494, 302649, 272336, 232563, 183553, 176156, 193358, 183641, 153100, 162259, 213210, 281991, 374035, 452184, 505670, 541018, 514097, 500172, 492539, 514178, 575308, 587500, 682223, 849918, 1094631, 1286906, 1361484, 1296538, 1088693, 830890, 602822, 511705, 493462, 559503, 556563, 632931]
16336F32931R7974R9340R4257J33928K90139K10776j5267k46369k84676k55677
16326G57356k02687j59262l4013M2318k0041m4324l9864k5183k7987J0283j4646
16315B41950R821K0831M6242l9675J1797n32k9729k358l3200K2587j900P960O4702
16302C18496K9391Q601L1735P2466M0409K1454k4624l2001K7509N0623q555O5857
16290F01361P7314N9367K051j2133o368o8425n0440n5082m3591j9410Q169J3490
16278E06303J1531J753N7420J02187Q9302N9420K8460L4650j7214m6968K5940
16267H52784R4193K6696j00502j09802m9469p3384m4786q2170n7145j9824o705
16256D29886j3103J726R427M9567R0081J8344N5948M3488o8656j31074m7329l9182
$$ y = [632931, 730905, 830245, 924502, 1058430, 1348569, 1559345, 1544078, 1297709, 1013033, 757356, 554669, 395407, 361394, 403712, 383671, 339347, 299483, 274300, 246313, 256596, 241950, 251771, 272602, 318844, 279169, 290966, 290434, 260705, 258347, 225147, 247734, 245834, 253794, 318496, 347887, 356488, 388223, 460689, 501098, 522552, 497928, 465927, 493436, 544059, 535504, 601361, 678675, 738042, 740093, 727960, 721592, 653167, 602727, 547645, 504054, 484644, 492813, 506303, 517834, 519587, 577007, 679194, 768496, 827916, 856376, 891026, 873812, 826844, 852784, 946977, 973673, 873171, 763369, 713900, 640516, 595730, 513560, 456415, 436591, 429886, 416783, 418509, 427936, 477503, 567584, 585928, 641876, 685364, 616708, 485634, 438305, 399123]
16244C99123q5050o5053m1034L8181N9796J15104Q7736J15494P999m3021q1078
16233E08197j08145o9362n4918k0754j5868J6243O642N5705J8390N2286J66669
16222E55085J52584P4446p0587j24283q9076j52738q2264P7579L0807o4423q0480
16211B26650m1047J8752K8017m5529m9820R962L8436K6044M7546Q1723R945o4100
16199B86579k6200l3394L3212O9827l9063j0194l5402m6111m2517M5729L7944
16188B40410N544j9526n1817o697J6663O021q827J9245K9414M2623N0478k4131
16176B99400k4750O1663N2339r407M8965p25o1544n3907J0782N7790O4590K9398
16164D74594P582K5336N9033P99K6650q4513p5296j3536j0172K0543J9168R171
$$ y = [399123, 314073, 249020, 207986, 246167, 305963, 421067, 508803, 624297, 632296, 589275, 508197, 400052, 330690, 275772, 255018, 239150, 255393, 262035, 317740, 336130, 388416, 555085, 707669, 782115, 711528, 587245, 498169, 345431, 263167, 340746, 371553, 307130, 226650, 185603, 204355, 232372, 186843, 137023, 146985, 185421, 211465, 259011, 340734, 350679, 286579, 260379, 226985, 260197, 330024, 290961, 280767, 245365, 199254, 156737, 202466, 240410, 245954, 226428, 174611, 167914, 184577, 190598, 181771, 201016, 230430, 273053, 323531, 299400, 274650, 336313, 388652, 379245, 428210, 427485, 365941, 312034, 322816, 380606, 445196, 474594, 482176, 507512, 566545, 567344, 593994, 509481, 434185, 420649, 410477, 431020, 450188, 459359]
16152D59359J2634k6434j3838J9345M5416N6849J03474J19811J03019j3734r7555
16141G68346k2393J9835M3419R8691R6489K6790K0260O0905R6112P0697n8468
16130A220683j36887j80120j00913k3775J5321P303P832o627l155L9022L1294
16119H69978L4561N0554j6225n7862j03986j18583o5949q0344L7330L6550O739
16108E92763O797l029k4096k5459j3531j06654r4939l4166L5685M8833K1464M3729
16096D47397L4915L6166J09662P4357J3719p524r284l6463m5098K387K5594L0553
16084F76381N2213k0135L8397J42085Q7009J630k5705m1420m8921n8534m4542
16073G58458o0779j4576m25J0975j9564j4266m2304L3605J01011N3038k5560o9025
$$ y = [459359, 471993, 445559, 431721, 451066, 496482, 553331, 656805, 776616, 879635, 865901, 768346, 745953, 765788, 809207, 907898, 1004387, 1031177, 1051437, 1112342, 1208454, 1279151, 1220683, 1083796, 903676, 802763, 778988, 794309, 801612, 809444, 802817, 799662, 838684, 869978, 904539, 955093, 938868, 881006, 777020, 658437, 592488, 512144, 549474, 586024, 592763, 599560, 596531, 572435, 546976, 533445, 426791, 331852, 297686, 333371, 382204, 403668, 447397, 482312, 518478, 628140, 702497, 716216, 708692, 699408, 662945, 617847, 620234, 645828, 676381, 728594, 708459, 746856, 888941, 975950, 977580, 951875, 910455, 861534, 803000, 758458, 697679, 683103, 682678, 693653, 674089, 659823, 617519, 651124, 752135, 805173, 779613, 710588]
16061G10588j37338j61315j24423k4591j6185K1511J2795m1895k1558j737K90
16050B16142q8990j8233l4922K1998N770o4635j0256K4821j4579L919J8041l782
16038E5294j2794k2487M3846p580o6451j7037j3626k4624l5902j511N9175R276
16026c4421O875M2530j1433M2649j503r4339l5586L6345K6973M8110K7313K6525
16014H0038R613j7773O482K0810n4544k4731k5496K5967M9669l4425M373m463
16002C5520l7879k8361j4736N209K1508J6200N8266j1509J0883n7336j20650L5667
15990h7218N1494r56m7492J7395J3787k0541k6543q515Q2980R937m7775p304M3204
15977b7547k2172n2281J3217P7938k115m0686k9341l0768j3749k8121J8801J5133
$$ y = [710588, 573250, 411935, 287512, 262921, 246736, 268247, 281042, 239147, 217589, 215852, 216142, 127152, 108919, 73997, 95995, 101765, 37130, 26874, 51695, 37116, 41035, 59076, 55294, 42500, 20013, 63859, 56279, -10172, -27209, -40835, -65459, -101361, -102872, -43697, -34421, -27546, 14984, 3551, 46200, 44697, -49642, -85228, -48883, -21910, 26200, 53513, 80038, 89651, 71878, 78360, 99170, 44626, 19895, -5601, 20366, 70035, 35610, 39983, 35520, -2359, -30720, -45456, -40247, -18739, -2539, 55727, 44218, 55101, -2235, -122885, -87218, -35724, -36680, -84172, -66777, -52990, -73531, -100074, -108589, -25609, -15672, -63447, -70751, -27547, -49719, -102000, -88783, -10845, -12960, -53646, -82987, -113755, -127504, -155625, -136824, -121691]
15965a21691k3545n2623K9964O0280M8149M211q2793j3879K6589j7683J4672J8107
15953a10242K1810R79J7876L322j2537p479M2630J38159J08271m6290j36703r2252
15941g2456p085j1499j5056o806K9599j4597K7320J3039R6493P6884L5758N9635
15929B11229J1825o1809r2609o378k2073j19394o0080M563M5196Q3499n5492k9758
15917i1281J0525L4504k4607k9892j1095k5065K803M5631n3545J6991P0416K490
15905e2125J3962L8809l6284r420K1815j0986K6262R038k8498L2840N5412N6952
15893A17777L5308o8914p6291k0444k5548k9127p0915J1993K3336J4373O0386
15882b8066L2528O2939O1831N2049M2057l8965q6206j31675k3318n0489K708m3005
$$ y = [-121691, -145236, -197859, -167895, -107615, -59466, -55255, -138048, -151927, -125338, -143021, -128349, -110242, -88432, -87453, -69577, -66255, -78792, -86271, -43641, 94518, 202789, 156499, 19796, -72456, -79541, -91040, -106096, -112902, -83303, -97900, -70580, -57541, 38952, 115836, 151594, 211229, 223054, 161245, 68636, 62258, 40185, -79209, -139289, -134726, -89530, -6031, -61523, -91281, -80756, -46252, -70859, -100751, -111846, -136911, -134108, -88477, -142022, -125031, -54615, -52125, -38163, 646, -35638, -45058, -23243, -34229, -7967, 1071, -27427, 5413, 60825, 117777, 153085, 84171, 7880, -12564, -38112, -67239, -138154, -126161, -102825, -88452, -28066, 4462, 67401, 129232, 181281, 223338, 184373, 98167, -33508, -56826, -107315, -104607, -147612]
15870a47612O951N7193L6928N8636l765j9814J6840m969k6227j8058P869k2582
15858e8610M9445l873J9521k1713l3359j6647L8047j0848m0141R026J5178L7993
15846a5981m4795k5034N5237l0880n8988k0732J0759n865j5414l1657L6034J4323
15834a32993O4806K6903p736j0796m9873o0724J1392L8781K0597L9989N1567m4684
15822e2771j1961P1835L6515J2298o0681k4522J0525k6343K3139m3811m6276K2153
15810h9900k6017o1563J7401N3939K6338N962Q857m1387l0149Q0712K4686j830
15798c2951N2167o546j5569k7702l4256K2138l5682K1052k843P720k468m83l888
15785e9311O2769J5464n5465l692L5641l9475o2401M696K1006K1024k791l8784
$$ y = [-147612, -140661, -83468, -46540, 12096, 8331, -11483, 5357, 388, -25839, -43897, -36028, -58610, -9165, -13038, 6483, -15230, -48589, -65236, -27189, -38037, -78178, -69152, -53974, -15981, -60776, -85810, -30573, -61453, -120441, -141173, -130414, -136279, -151693, -183350, -147316, -132993, -68187, -41284, -49020, -59816, -109689, -170413, -159021, -120240, -99643, -59654, -8087, -52771, -64732, 7103, 43618, 55916, -4765, -29287, -18762, -45105, -21966, -65777, -112053, -89900, -115917, -177480, -160079, -106140, -79802, -73840, -64983, -106370, -136519, -55807, -31121, -32951, 19216, 12670, -2899, -30601, -64857, -42719, -78401, -57349, -60192, -52472, -54940, -55423, -59311, 3458, 18922, -36543, -40235, -4594, -44069, -106470, -101774, -80768, -59744, -62535, -101319]
15773a01319k9309K770R397r334L4450J4190K0322K2712l3809M056j4525O5902
15761a4497K1450m9842J0518J7291o671Q142J3470M946k5505k3190M0219n3866
15749e7535m6246P1381j0921m3915O4158L3838j5650L2700R355q611l7487l0588
15737c9521J2401N2290M6406K9128n2228j3742J5735j9139o4510k2945O040L6445
15725a3640l6750k2499J2041j7534m2102l58O4079K9933r383J514k5039l373K8295
15712c4816K8715l0210l746J8792k3963M037k402K8446K5624P778j0306l496m8849
15699d4396m2433L1250Q9382Q958n8496L158o144M9568j2297k4377M1256m339
15687C1090m5173q777J6426K7031K9260K6242m0171l5056q9620m5288O468K6625
$$ y = [-101319, -130628, -127858, -118461, -127795, -93345, -79155, -58833, -36121, -69930, -65874, -80399, -14497, 6953, -42889, -32371, -15080, -21751, -13609, -139, 4807, -20698, -43888, -3669, -57535, -103781, -32400, -43321, -87236, -23078, 10760, -4890, 27810, 37165, 28554, -8933, -39521, -27120, 25170, 71576, 100704, 48476, 34734, 50469, 31330, -33180, -56125, -50085, -13640, -50390, -72889, -60848, -78382, -120484, -120842, -56763, -26830, -36213, -34699, -59738, -63111, -34816, -6101, -36311, -40057, -21265, -45228, -41191, -43593, -15147, 10477, 18255, 7949, 4453, -44396, -86829, -55579, 33803, 42761, -15735, -12577, -18721, 30847, 18550, -5827, 35429, 31090, -14083, -22860, -6434, 20597, 49857, 76099, 35928, 872, -88748, -134036, -127568, -100943]
15675a00943J20912M636l7735J7241l1523L7770o105j713j9558K1407L5649l7449
15663B589l4825J9652r194l3008K0644N6331L3137o415L9432L236p830m0945k4922
15650A7882P333l5639m8945K1803N9865M6320N4715K4371n4394o0990P675N572
15638D5568L3931k1462l0673P310K5846L0967O11j2811L180j126P761K2474L0630
15625A42206r285J0646K3755k1838o5150n5057R389M5049O7084N9472o8161r0794
15613D7316m0662K7811M1820k1039j8328J2931j51L190P2192L5144k3419m6205
15601I0600J7237K9480o434R895R728P4058j0460o2106J6940O0263j6239n6084
15589A56878J2715N2347m5889o5005j3413K0180j0475l047l1431k0256j3580j0659
$$ y = [-100943, 19969, 24605, -13130, 4111, -27412, 10358, 4253, 2540, -17018, 4389, 40038, 2589, -32236, -12584, -21778, -54786, -34142, 22189, 55326, 48911, 88343, 91579, 83749, 42804, 17882, 25215, -10424, -59369, -37566, 22299, 68619, 123334, 147705, 93311, 32321, 39996, 45568, 79499, 58037, 27364, 34674, 60520, 91487, 92098, 79287, 82467, 81341, 89102, 111576, 142206, 132921, 143567, 167322, 145484, 80334, 25277, 34666, 79715, 146799, 206271, 138110, 47316, 6654, 34465, 76285, 55246, 36918, 49849, 49698, 52888, 125080, 160224, 136805, 90600, 107837, 137317, 130883, 140778, 150506, 224564, 214104, 151998, 168938, 229201, 212962, 156878, 169593, 221940, 176051, 111046, 97633, 117813, 107338, 104291, 72860, 52604, 39024, 28365]
15577B8365J6232K1782N2165O1550L3025n7787R129m0630j2418Q161p437j0622
15565A01515r517M9059L3307R268m900p314O5J5730j0045n9634k7661k6609l681
15552E9583K7828K5787n0192N5130O2569K6300k3752k8657O503J248k8461L7988
15540A71874K0965k5143J2506J9170J9883J0640J0186n2716n5801J8065N6446
15529B06075R0723L8157o8023k9175k6739K1765No686P918L6225j0753m6950M00
15516B12942J4928l3799J612K5231K3781K2643K3721J8807K3573J6207k1029p5154
15504B53463m0430l3507P8735M8968m4497L1083M1005l149k5118L1433L0509j2694
15492C55801k935L537K536l5972j6371K5875j1066M2013p281n3506n893k976K7515
$$ y = [28365, 44597, 66379, 118544, 180094, 213119, 155332, 164461, 123831, 111413, 119574, 112137, 101515, 91998, 141057, 174364, 183632, 178732, 171418, 171483, 187213, 177168, 117534, 89873, 63264, 59583, 87411, 113198, 63006, 118136, 180705, 207005, 183253, 154596, 161099, 162347, 133886, 171874, 192839, 167696, 180202, 199372, 219255, 229895, 240081, 187365, 131564, 149629, 206075, 296798, 334955, 266932, 237757, 211018, 232783, 232788, 226102, 234020, 270245, 259492, 212542, 212942, 227870, 194071, 195683, 220914, 244695, 267338, 291059, 309866, 333439, 349646, 328617, 253463, 213033, 179526, 258261, 307229, 262732, 293815, 334820, 331671, 306553, 337986, 368495, 355801, 352866, 356403, 358939, 322967, 306596, 332471, 321405, 363418, 356137, 302631, 296738, 293762, 321277]
15479C21277K6757L7363n138m0316l7049n6480m5520Q4186J2868L1764L4535n3466
15467C10781m0739L2105l5694n0262M0965M6081N2863j1922N648J9934J618Q5241
15455D56619N8257M8580L6672M7464L2855o7478q4980l9702K6942k7295l1157
15444D56777j0756o110L3010P5535l7857q491k9850p0896l298N2531M6512K7201
15432E24308k13J8487P2943j8292k4372R870j4206m6925M9745Q2858L9289o7269
15420F26223l6789J7124k5703L1567p523j9624L8706J9007Q096Q403n7514j2209
15408E89764K5507M1948M3358l0396l5586J5451M8550N8078L8576K4143m6000
15397G73393p8695M5263N0655J651m0494J6518P752M0178O7559m0419n3447m0124
$$ y = [321277, 348034, 385397, 380259, 339943, 302894, 246414, 200894, 285080, 297948, 329712, 364247, 310781, 270042, 302147, 266453, 216191, 257156, 303237, 356100, 344178, 349826, 369760, 371378, 456619, 514876, 563456, 600128, 647592, 680447, 612969, 527989, 488287, 515229, 487934, 456777, 446021, 439911, 472921, 548456, 510599, 502108, 472258, 401362, 398064, 450595, 497107, 524308, 524095, 542582, 615525, 597233, 572861, 582731, 568525, 521600, 571345, 654203, 693492, 626223, 589434, 606558, 580855, 612422, 604899, 585275, 623981, 642988, 651084, 659487, 601973, 589764, 615271, 657219, 700577, 670181, 634595, 650046, 698596, 756674, 795250, 819393, 773393, 694698, 739961, 790616, 792267, 751773, 768291, 776043, 816221, 883780, 843361, 789914, 749790]
15385G49790K8823L7349N2853j3261m516R462J1460J8556M1528K0257j3570j9402
15373I19329J9505N154M2213N1298m483k2760K0878O3395L9160l8449k2784k8118
15361A044338K5081P23l7870j3916K3460R1875K6965M160k0932K292k5961J1535
15349A131750j5439O0374R399O1963J5268Q744k5951L4317m576N243p41k5788
15337A254563q904K3997J6891k0743M5697K6086J4419K5830m003o753k6194J745
15325A342631M696K478N1j6419L208P5213M7696L1006M799p7776J3691J09094
15313A540368N9165K0309k218k940J3218L2312n3456J0565O3720m606K0399M4401
15301A741237N3004J3896j5878M6983M8575k2731J8936J5203J2439Q1597L0400
$$ y = [749790, 778613, 815962, 868815, 855554, 851038, 860500, 871960, 890516, 932044, 952301, 938731, 919329, 938834, 943988, 986201, 1037499, 1033016, 1010256, 1031134, 1094529, 1133689, 1095240, 1072456, 1044338, 1069419, 1070142, 1032272, 1018356, 1041816, 1133691, 1160656, 1164816, 1143884, 1146176, 1120215, 1131750, 1116311, 1176685, 1186084, 1248047, 1263315, 1272059, 1246108, 1280425, 1275849, 1281092, 1280351, 1254563, 1245659, 1269656, 1286547, 1265804, 1311501, 1337587, 1352006, 1377836, 1373833, 1367080, 1340886, 1342631, 1347327, 1349805, 1349856, 1333437, 1336645, 1411858, 1459554, 1490560, 1495359, 1417583, 1431274, 1540368, 1599533, 1619842, 1617624, 1614684, 1627902, 1660214, 1606758, 1617323, 1681043, 1676437, 1696836, 1741237, 1794241, 1808137, 1792259, 1839242, 1887817, 1865086, 1884022, 1899225, 1911664, 1993261, 2023661]
15290B023661k4007p435p108Q6585L1179j7445K5422J4200M4741R6146O1775Q907
15278B336621K1237N3979Q2821N3129L1301j9095j9853j5415M0120l0388K1865
15267B556322J50013P9262O6838J4832O1722J6036l1865N1766M0125j6768R5375
15256C083658O5244N2628N5896L1831J0916P4729Q1188P0450N9704N4470L9316
15245C680030Q9598O6446Q9279R3781Q9448M2055J37822J09108M1932N9828J6651
15234D515978J6238J07024O5530M9692M5331J42463J29000O4845O1942N6754K7288
15223E282085J02042J02109J54526P8507J20799N3255J15303P7165R5469J24367
15213F305627Q7719J11908J92374J36261J12469J58792R9806P8418J15293J16344
$$ y = [2023661, 1999654, 1992219, 1985111, 2071696, 2102875, 2085430, 2110852, 2125052, 2169793, 2265939, 2327714, 2336621, 2357858, 2411837, 2494658, 2547787, 2579088, 2559993, 2540140, 2524725, 2564845, 2534457, 2556322, 2706335, 2785597, 2852435, 2867267, 2928989, 2945025, 2913160, 2964926, 3005051, 2988283, 3083658, 3148902, 3201530, 3257426, 3289257, 3300173, 3374902, 3456090, 3526540, 3586244, 3640714, 3680030, 3769628, 3836074, 3925353, 4019134, 4108582, 4150637, 4288459, 4397567, 4439499, 4499327, 4515978, 4532216, 4639240, 4704770, 4754462, 4799793, 4942256, 5071256, 5136101, 5198043, 5254797, 5282085, 5384127, 5486236, 5640762, 5719269, 5840068, 5893323, 6008626, 6085791, 6181260, 6305627, 6393346, 6505254, 6697628, 6833889, 6946358, 7105150, 7204956, 7283374, 7398667, 7515011]
15203G515011J65117J57167J87905J85542J25265J46636J71768J65373J85871
15194I005655J99784J84346J60375K39287K47009K52018K41422J54975K16010
15185A0900881L02767K52638L43412K87693L34561L46219K81401K82481L84551
15176A3716604L77941K76907L28655M34129M16823L69927L81378M93225M92385
15167A7287974M59997N14823M57873N45522N56842N72133N91590O07097O48070
15158B2241921O75739P24620P57658Q03427P65444Q03842Q95204R20939R34643
15149B9523437R69194J025195R89293J044700J104886J146929J198572J270618
15141C8272824J290706J305315J381985J465859J447185J446079J494455J578614
$$ y = [7515011, 7680128, 7837295, 8025200, 8210742, 8336007, 8482643, 8654411, 8819784, 9005655, 9205439, 9389785, 9550160, 9789447, 10036456, 10288474, 10529896, 10684871, 10900881, 11203648, 11456286, 11799698, 12087391, 12421952, 12768171, 13049572, 13332053, 13716604, 14094545, 14371452, 14700107, 15134236, 15551059, 15920986, 16302364, 16795589, 17287974, 17747971, 18262794, 18720667, 19266189, 19823031, 20395164, 20986754, 21593851, 22241921, 22917660, 23642280, 24399938, 25203365, 25968809, 26772651, 27667855, 28588794, 29523437, 30492631, 31517826, 32507119, 33551819, 34656705, 35803634, 37002206, 38272824, 39563530, 40868845, 42250830, 43716689, 45163874, 46609953, 48104408, 49683022]
15133D9683022J659416J697136J657197J692561J753179J797874J784290J744364
15125F3469039J734333J782707J782000J744907J713670J657877J592058J481933
15117G6958524J355570J287152J155257R12536Q35268P11085N64210L96150J82895
15108H4358647j4714k18115l15405m77323p04150p76806r56709j120758j261779
15099G8512888j309458j428719j500962j533472j644243j662124j669083j765604
15091F5999223j807765j714896j704059j718867j762083j729222j634321j663999
15083E2264011j639684j568447j477426j464016j395208j398369j410662j361692
15075D0548507j260323j206795j185191j209216j114953j027342j022296r77935
$$ y = [49683022, 51342438, 53039574, 54696771, 56389332, 58142511, 59940385, 61724675, 63469039, 65203372, 66986079, 68768079, 70512986, 72226656, 73884533, 75476591, 76958524, 78314094, 79601246, 80756503, 81669039, 82504307, 83215392, 83779602, 84175752, 84358647, 84343933, 84125818, 83810413, 83333090, 82628940, 81852134, 80895425, 79774667, 78512888, 77203430, 75774711, 74273749, 72740277, 71096034, 69433910, 67764827, 65999223, 64191458, 62476562, 60772503, 59053636, 57291553, 55562331, 53928010, 52264011, 50624327, 49055880, 47578454, 46114438, 44719230, 43320861, 41910199, 40548507, 39288184, 38081389, 36896198, 35686982, 34572029, 33544687, 32522391, 31544456]
15067C1544456r57079r74591q63168q44698q84604q02497p63392p44369p20417
15058B3989641p00536o98093o47604n51125n31539n56452n82079n19039n22633
15049A8680541m70835m30542m62475m43390m03729m01631l32270k79866l95022
15040A5060781m25414m01570l30832l19208l35419l48177l22553l49348k71503
15031A1956757k04738k41313k22328k21555k88786k42001j35531j58236k20961
15022A0021308k24594k45678k29275k45641j78622j33385j43831k10510j74004
15013H235768q3454j08253j45769k09170j81513j12985j46773j29218j03086j01865
15003F913682q5659o1479j43995o6060q6252j47853j23103j07903j21866r7838
$$ y = [31544456, 30587377, 29612786, 28749618, 27904920, 27020316, 26217819, 25454427, 24710058, 23989641, 23289105, 22591012, 21943408, 21392283, 20860744, 20304292, 19722213, 19203174, 18680541, 18209706, 17779164, 17316689, 16873299, 16469570, 16067939, 15735669, 15455803, 15060781, 14635367, 14233797, 13902965, 13583757, 13248338, 12900161, 12577608, 12228260, 11956757, 11752019, 11510706, 11288378, 11066823, 10778037, 10536036, 10400505, 10242269, 10021308, 9796714, 9551036, 9321761, 9076120, 8897498, 8764113, 8620282, 8409772, 8235768, 8152314, 8044061, 7898292, 7689122, 7507609, 7394624, 7247851, 7118633, 7015547, 6913682, 6828023, 6766544, 6622549, 6556489, 6470237, 6322384, 6199281, 6091378, 5969512, 5871674]
14993E871674j29091o5097j10129j16749m7891m2980r2985j17535j91061j10664
14983D847492j650j7304j17720q3895k3522k1647m7979r657o4216q3540j07015
14972D269347m3280m6027j18208j13109q9443k0603nj5556j3852k2638r1978j9489
14960C675159l487j02405n0579J1270q9194n0190L728l5152l9466l2142n2763
14949C234779k5233M624o7822k9970q3723q2020J0696p319K663M681n2942n6487
14937B851927n9672K1776M082l3532m1302n6236k9682k0994M534k9513J423o8071
14925B544740o6721O090J5297m8170M3n2275p6549l1351l5358n2133J9627M3017
14913B266257p822o4337j8099j9545j7774l838n1696j8906k425K836p909Q772
$$ y = [5871674, 5742583, 5677486, 5567357, 5450608, 5402717, 5359737, 5266752, 5149217, 4958156, 4847492, 4845842, 4828538, 4710818, 4626923, 4603401, 4581754, 4533775, 4524118, 4459902, 4376362, 4269347, 4226067, 4180040, 4061832, 3948723, 3859280, 3838677, 3838672, 3823116, 3809264, 3786626, 3694648, 3675159, 3671672, 3569267, 3518688, 3529958, 3440764, 3390574, 3394302, 3359150, 3319684, 3287542, 3234779, 3209546, 3214170, 3146348, 3116378, 3032655, 2950635, 2961331, 2954012, 2956675, 2961356, 2908414, 2851927, 2792255, 2814031, 2818113, 2784581, 2743279, 2687043, 2657361, 2636367, 2640901, 2611388, 2612811, 2544740, 2478019, 2484109, 2499406, 2451236, 2451279, 2399004, 2322455, 2291104, 2255746, 2203613, 2223240, 2266257, 2258435, 2194098, 2175999, 2156454, 2138680, 2134842, 2083146, 2064240, 2061815, 2064651, 2056742, 2065514]
14901B065514m4501k3638j4421Q98m6127l6728j3850L462k5646m0571l9620n490
14889A779282K802J6444K8666j4665M4p9062m6935N13K1815j3956kk9049m1815
14876A624082r116J221M5002O3866L252k8156k5265m2978m984k1312l8367l4222
14864A533023l0128k2109J7998k9650K815j587j9479R072N6989K5951J4220k2978
14852A534137l4192p6225o8183L9975O2422J9375Q547q2247j9537J4964j3367
14841A385669k0158J4395P467O0850m8864k3777J4627K4629j5511n4980o6027
14830A278320m4075n7847k5634N3316l7874j4597l118J0979J5308m3492k1437
14819A109849K000m4085l0793L3806J9789J9918j1485j9060q3751n9389K6765
$$ y = [2065514, 2021013, 1997375, 1982954, 1983852, 1937725, 1900997, 1887147, 1890609, 1864963, 1824392, 1784772, 1779282, 1782084, 1798528, 1827194, 1812529, 1812573, 1733511, 1686576, 1687089, 1708904, 1694948, 1694946, 1665897, 1624082, 1614966, 1616187, 1661189, 1725055, 1728307, 1700151, 1674886, 1631908, 1626924, 1605612, 1567245, 1533023, 1502895, 1480786, 1498784, 1469134, 1471949, 1470362, 1450883, 1459955, 1516944, 1542895, 1557115, 1534137, 1499945, 1423720, 1355537, 1395512, 1457934, 1477309, 1485856, 1403609, 1384072, 1399036, 1385669, 1365511, 1379906, 1387373, 1448223, 1399359, 1375582, 1390209, 1414838, 1399327, 1344347, 1278320, 1234245, 1176398, 1150764, 1204080, 1166206, 1151609, 1148491, 1159470, 1174778, 1131286, 1109849, 1111849, 1067764, 1036971, 1070777, 1090566, 1110484, 1098999, 1079939, 996188, 936799, 963564]
14808I63564N461j8709l0692j5150K8644m3625K634K552k4982k8351K3559j1679
14796H53226l726J253l1063M002K0717m4121j5458N241P859j4306L5455P3365
14784H92444k4681m8836j0282l2790r902n325K8255k696J6968K8564P240q1034
14772G57925m3700J6351M0992n4033k7416N6913p865J5260J1942p1340o7227k2247
14760F05555P2267M965j7203l7241j0950K5937J0706k1383J6431J2467m0695k4905
14748E95951j5272k2049J5908n2759L6797K7708K78j1188N8143L6162L1562K4042
14736G25283o756P390J1816q1863p2633n9342j635M9007J2862L019K874l1557
14724E58465k4400M3429L8020O748n8479j7772k0026k1156n4599l5795P7601M0348
$$ y = [963564, 969025, 950316, 919624, 904474, 933118, 889493, 892127, 894679, 869697, 841346, 864905, 853226, 849500, 850753, 819690, 823692, 844409, 800288, 784830, 790071, 797930, 783624, 819079, 892444, 867763, 818927, 808645, 775855, 765953, 760628, 788883, 786187, 803155, 831719, 838959, 757925, 714225, 730576, 771568, 717535, 690119, 747032, 739167, 754427, 766369, 695029, 627802, 605555, 677822, 682787, 665584, 628343, 617393, 643330, 654036, 632653, 649084, 661551, 620856, 595951, 580679, 558630, 574538, 521779, 558576, 586284, 586562, 575374, 633517, 669679, 701241, 725283, 718527, 725917, 737733, 655870, 583237, 523895, 522260, 571267, 584129, 587148, 590022, 558465, 534065, 577494, 615514, 622262, 563783, 546011, 525985, 504829, 450230, 414435, 492036, 532384]
14712E32384N364j1708m4909m265r057l3128M2294k4836j941p28N2585L7411r89
14699E38477K4831j8174p2109j264K4541j7010N0n9227l0170J8340P8086K950
14687D89321J4369o898o9073m6804R68M0581J6347n1618R047P6333o859L4429
14675E00143L165m4361p6551J4425N9613j897L5222j7819j4300J728p42N745m9272
14662D15099n0139L1791K0926p923K2195j6869K4015m615j4483n5391l0097r639
14650C24870j1087J595j5109M2954M7518N1883j2793j08818j8411K9429j0324
14639C21707k7299L166M8050N7181K7613K7912k9692n5885k6389M2754j317j426
14627C86375p618l554l8584l9598l558J8518L5646j7910P229J2360o022m3361
$$ y = [532384, 537748, 526040, 481131, 476866, 467809, 434681, 476975, 452139, 450198, 449470, 502055, 539466, 538477, 563308, 545134, 473025, 471761, 496302, 479292, 479342, 420115, 389945, 408285, 486371, 489321, 503690, 496792, 427719, 380915, 381883, 422464, 438811, 387193, 396240, 472573, 465714, 500143, 503308, 458947, 382396, 396821, 456434, 454537, 489759, 471940, 457640, 459368, 458626, 464371, 415099, 364960, 396751, 417677, 409754, 431949, 415080, 439095, 434480, 419997, 364606, 334509, 324870, 313783, 315378, 300269, 343223, 390741, 442624, 429831, 321013, 302602, 332031, 321707, 294408, 297574, 345624, 402805, 430418, 458330, 428638, 372753, 346364, 389118, 387801, 386375, 378757, 375203, 336619, 297021, 293463, 311981, 347627, 329717, 336946, 349306, 343284, 299923]
14615B99923K0356Q60Q347o417p259j2005K5143L9149o873l0966o1468K1903N0412
14602C41105M5708l0372L8035K0251k1630l5453l2900j9749J8436J4099O296m44
14590C43382K6861L806o1278k0551K8121L8903K1457k0590j9762p507J0821K7468
14578C71131Q699m1148m4388M986K7804m6826r379K2411N8564L5672J1989J9806
14566D19321o50j0288l5224l7969j1395m0001J7962P648k3691L6527k8171o4328
14554B29741L6877k8226j77J732J0492k357k0137k734L6812l795j4053j0419j1484
14541B22272m0278L0143M0119k6255K1790L4253J8904n878K734p3724l8087L5958
14529B21951J0164L1668j2815K7768k934j1742l425k8620j9977K2128J4602O8952
$$ y = [299923, 320279, 321139, 329486, 323069, 315810, 303805, 328948, 368097, 361224, 330258, 268790, 290693, 341105, 386813, 356441, 394476, 414727, 393097, 357644, 324744, 304995, 323431, 337530, 343826, 343382, 370243, 374049, 312771, 292220, 320341, 359244, 380701, 360111, 340349, 332842, 343663, 371131, 379830, 338682, 294294, 299280, 327084, 280258, 270879, 293290, 351854, 387526, 399515, 419321, 418671, 408383, 373159, 335190, 323795, 283794, 301756, 309404, 285713, 322240, 294069, 229741, 266618, 238392, 238215, 239947, 250439, 248082, 227945, 225211, 262023, 258228, 244175, 233756, 222272, 181994, 212137, 252256, 226001, 247791, 282044, 300948, 295070, 297804, 224080, 185993, 221951, 232115, 263783, 250968, 278736, 275802, 264060, 260635, 232015, 212038, 234166, 248768, 317720]
14517C17720L311j6592K737k6140K1413l6042r5252j2535K6894Q7563K9102k4607
14505B77572L9541o9489l7179K541J4407m012k6637l6612M4592k718K7067L4042
14493B63115o321k0208k8870j9992k8894K2433M4702J3679M0258J6843N7313k0401
14481C33657q0096R420K307J3978l6928o208N3457k1470l6189L6868M0968j0182
14469B99582n6834k5085j228O4705L6791o0702k2275J8072J2798j08409n6020
14458A01395m802n6707L1844N1233K0231L9173N6912k8999R336N5181j8147K6912
14446B83562J2387m996J2363N45k9134l3828j5206p0277l4423K7288N9003j7198
14434A90086J5211M8126k2278K8414l4773r2781l2295N8197N0536K8599L7717
$$ y = [317720, 321031, 304439, 307176, 281036, 302449, 266407, 171155, 158620, 185514, 273077, 302179, 277572, 317113, 247624, 210445, 212986, 227393, 223381, 196744, 160132, 204724, 202006, 229073, 263115, 256794, 236586, 207716, 187724, 158830, 181263, 225965, 239644, 279902, 296745, 354058, 333657, 253561, 262981, 265288, 279266, 242338, 236130, 289587, 268117, 231928, 268796, 309764, 299582, 242748, 217663, 216435, 281140, 317931, 257229, 234954, 253026, 265824, 157415, 101395, 96593, 39886, 71730, 122963, 143194, 182367, 239279, 210280, 219616, 274797, 256650, 283562, 295949, 290953, 303316, 303861, 274727, 240899, 225693, 155416, 120993, 148281, 207284, 190086, 205297, 253423, 231145, 259559, 224786, 132005, 99710, 157907, 208443, 237042, 274759]
14423B74759K9668j4227k4399K976O917j1166L7635J4566j6079r2620r1805M5366
14411A61591P6102J1017K2893j6682n283k1334J871M4698j1435p9779k6523L2301
$$ y = [274759, 304427, 290200, 265801, 268777, 275694, 264528, 302163, 316729, 300650, 208030, 116225, 161591, 237693, 248710, 271603, 254921, 249638, 228304, 230175, 274873, 263438, 183659, 157136, 189437]
$$ [...]
##END NTUPLES=NMR SPECTRUM
##END=
