##TITLE=Analysis number 324617
Compound Code mo 07830
Book Reference 451/187
Project Code adrs
Chemist Name evam
##JCAMPDX= 6.0         $$ Bruker NMR JCAMP-DX V2.0
##DATA TYPE= NMR SPECTRUM
##DATA CLASS= NTUPLES
##ORIGIN= Bruker BioSpin GmbH
##OWNER= nmr
$$ XWIN-NMR		Version 3.5
$$ Tue Nov 28 11:14:58 2006 GMT Standard Time (UT+0h)  MAYBRIDGE\nmr@NMR_250MHZ
##.OBSERVE FREQUENCY= 250.131544655141
##.OBSERVE NUCLEUS= ^1H
##.ACQUISITION MODE= SIMULTANEOUS (DQD)
##.ACQUISITION SCHEME= undefined
##.AVERAGES= 16
##.DIGITISER RES= 18
##SPECTROMETER/DATA SYSTEM= dpx250
##.PULSE SEQUENCE= zg30
##.SOLVENT NAME= CDCl3
##.SHIFT REFERENCE= (INTERNAL, CDCl3, 0, 16.522)
##AUDIT TRAIL= $$ (NUMBER, WHEN, WHO, WHERE, WHAT)
$$ ##TITLE= Audit trail, XWIN-NMR		Version 3.5
$$ ##JCAMPDX= 5.01
$$ ##ORIGIN= Bruker BioSpin GmbH
$$ ##OWNER= nmr
$$ C:\u/data/dgb/nmr/ADRS/1290/pdata/1/auditp.txt
$$ ##AUDIT TRAIL=  $$ (NUMBER, WHEN, WHO, WHERE, WHAT)
(   1,<2006-11-28 11:14:09.18 +000>,<MAYBRIDGE\nmr>,<NMR_250MHZ>,
      <created by zg, POWCHK disabled, PULCHK disabled
       configuration hash MD5:
       49 4B E0 1D 92 C2 6B 37 9F E6 65 BC 52 41 86 1D
       data hash MD5: 64K
       4E 66 AC 77 A3 86 C4 47 16 DB 20 84 55 1B 8D 2A>)
(   2,<2006-11-28 11:14:33.88 +000>,<MAYBRIDGE\nmr>,<NMR_250MHZ>,
      <Start of raw data processing
       ef LB = 0.3 FT_mod = 6 PKNL = 1 SI = 32K 
       data hash MD5: 32K
       4E 0C C0 D6 D1 73 E4 3D 79 C7 B8 E3 B2 EC 1A B7>)
(   3,<2006-11-28 11:14:38.04 +000>,<MAYBRIDGE\nmr>,<NMR_250MHZ>,
      <apk 
       data hash MD5: 32K
       A8 6E AA A1 AD F1 67 3B E5 25 02 2A BC 8F 5C AF>)
(   4,<2006-11-28 11:14:43.54 +000>,<MAYBRIDGE\nmr>,<NMR_250MHZ>,
      <abs ABSG = 5 
       data hash MD5: 32K
       D4 85 74 6D AD 10 BC CA 35 1E AB D3 87 91 2B 3E>)
$$ ##END=
$$ 
$$ hash MD5
$$ BF FE DA 1F 36 FE 37 33 C1 77 20 FF 42 FF D3 15
##$RELAX= 
##$RELAX= 
##$RELAX= 
##$RELAX= 
##$RELAX= 
##$RELAX= 
##$RELAX= 
$$ Bruker specific parameters
$$ --------------------------
##$DU= <C:\u>
##$EXPNO= 1290
##$NAME= <ADRS>
##$PROCNO= 1
##$TYPE= <nmr>
##$USER= <dgb>
##$AMP= (0..31)
100 100 100 100 100 100 100 100 100 100 100 100 100 100 100 100 100 100 
100 100 100 100 100 100 100 100 100 100 100 100 100 100 
##$AQSEQ= 0
##$AQ_mod= 3
##$AUNM= <au_zg>
##$AUTOPOS= <26 >
##$BF1= 250.13
##$BF2= 250.13
##$BF3= 250.13
##$BF4= 250.13
##$BF5= 500.13
##$BF6= 500.13
##$BF7= 500.13
##$BF8= 500.13
##$BYTORDA= 1
##$CFDGTYP= 0
##$CFRGTYP= 5
##$CHEMSTR= <none>
##$CNST= (0..31)
1 1 145 1 1 1 1 1 1 1 1 1 1 1 1 1 1 1 1 1 1 1 1 1 1 1 1 1 1 1 1 1 
##$CPDPRG= <>
##$CPDPRG1= <>
##$CPDPRG2= <>
##$CPDPRG3= <>
##$CPDPRG4= <mlev>
##$CPDPRG5= <mlev>
##$CPDPRG6= <mlev>
##$CPDPRG7= <mlev>
##$CPDPRG8= <mlev>
##$CPDPRGB= <>
##$CPDPRGT= <>
##$D= (0..31)
0 1 0 0 0 0 0 0 0 0.06 0 0 0 0 0 0 0.0002 0 0 0 0 0 0 0 0 0 0 0 0 0 0 
0 
##$DATE= 1164712447
##$DBL= (0..7)
120 120 120 120 120 120 120 120 
##$DBP= (0..7)
150 150 150 150 150 150 150 150 
##$DBP07= 0
##$DBPNAM0= <>
##$DBPNAM1= <>
$$ [...]
##$SUBNAM7= <"">
##$SUBNAM8= <"">
##$SUBNAM9= <"">
##$SW= 20.6930455092707
##$SWIBOX= (0..15)
0 0 3 0 0 0 0 0 0 0 0 0 0 0 0 0 
##$SW_h= 5175.983436853
##$TD= 65536
##$TD0= 1
##$TE= 294.16
##$TE2= 300
##$TE3= 300
##$TEG= 300
##$TL= (0..7)
0 120 120 120 120 120 120 120 
##$TP= (0..7)
150 150 150 150 150 150 150 150 
##$TP07= 0
##$TPNAME0= <>
##$TPNAME1= <>
##$TPNAME2= <>
##$TPNAME3= <>
##$TPNAME4= <>
##$TPNAME5= <>
##$TPNAME6= <>
##$TPNAME7= <>
##$TPOAL= (0..7)
0.5 0.5 0.5 0.5 0.5 0.5 0.5 0.5 
##$TPOFFS= (0..7)
0 0 0 0 0 0 0 0 
##$TUNHIN= 0
##$TUNHOUT= 0
##$TUNXOUT= 0
##$USERA1= <user>
##$USERA2= <user>
##$USERA3= <user>
##$USERA4= <user>
##$USERA5= <user>
##$V9= 5
##$VALIST= <valist>
##$VCLIST= <CCCCCCCCCCCCCCC>
##$VD= 0
##$VDLIST= <DDDDDDDDDDDDDDD>
##$VPLIST= <PPPPPPPPPPPPPPP>
##$VTLIST= <TTTTTTTTTTTTTTT>
##$WBST= 1024
##$WBSW= 4
##$XGAIN= (0..3)
0 0 0 0 
##$XL= 0
##$YL= 0
##$YMAX_a= 342550
##$YMIN_a= -429475
##$ZGOPTNS= <>
##$ZL1= 120
##$ZL2= 120
##$ZL3= 120
##$ZL4= 120
##$ABSF1= 16.522
##$ABSF2= -4.171173
##$ABSG= 5
##$ABSL= 3
##$ALPHA= 0
##$AQORDER= 0
##$ASSFAC= 0
##$ASSFACI= 0
##$ASSFACX= 0
##$ASSWID= 0
##$AUNMP= <proc_1d>
##$AZFE= 0.1
##$AZFW= 0.1
##$BCFW= 0
##$BC_mod= 0
##$BYTORDP= 0
##$COROFFS= 0
##$CY= 12.5
##$DATMOD= 1
##$DC= 0
##$DFILT= <>
##$DTYPP= 0
##$F1P= 14.0000005364418
##$F2P= -0.99999901652339
##$FCOR= 0.5
##$FTSIZE= 32768
##$FT_mod= 6
##$GAMMA= 0
##$GB= 0
##$INTBC= 1
##$INTSCL= 1
##$ISEN= 128
##$LB= 0.3
##$LEV0= 0
##$LPBIN= 0
##$MAXI= 10000
##$MC2= 0
##$MEAN= 0
##$ME_mod= 0
##$MI= 0
##$NCOEF= 0
##$NC_proc= -3
##$NLEV= 6
##$NOISF1= 0
##$NOISF2= 0
##$NSP= 0
##$NTH_PI= 0
##$NZP= 0
##$OFFSET= 16.522
##$PC= 1
##$PHC0= 220.4471
##$PHC1= 7.190239
##$PH_mod= 1
##$PKNL= yes
##$PPARMOD= 0
##$PSCAL= 4
##$PSIGN= 0
##$REVERSE= no
##$SF= 250.13
##$SI= 32768
##$SIGF1= 0
##$SIGF2= 0
##$SINO= 400
##$SIOLD= 32768
##$SREGLST= <1H.CDCl3>
##$SSB= 0
##$STSI= 32768
##$STSR= 0
##$SW_p= 5175.98343685301
##$SYMM= 0
##$S_DEV= 0
##$TDeff= 65536
##$TDoff= 0
##$TI= <Analysis number 999999
Compound Code 99
Book Reference 9
Project Code 9>
##$TILT= no
##$TM1= 0
##$TM2= 0
##$TOPLEV= 0
##$USERP1= <user>
##$USERP2= <user>
##$USERP3= <user>
##$USERP4= <user>
##$USERP5= <user>
##$WDW= 1
##$XDIM= 32768
##$YMAX_p= 346021152
##$YMIN_p= -52124
$$ End of Bruker specific parameters
$$ ---------------------------------
##NTUPLES= NMR SPECTRUM
##VAR_NAME=  FREQUENCY,     SPECTRUM/REAL,   SPECTRUM/IMAG
##SYMBOL=    X,             R,               I
##VAR_TYPE=  INDEPENDENT,   DEPENDENT,       DEPENDENT
##VAR_FORM=  AFFN,          ASDF,            ASDF
##VAR_DIM=   32768,         32768,           32768
##UNITS=     HZ,            ARBITRARY UNITS, ARBITRARY UNITS
##FACTOR=    0.157963299565203, 1,           1
##FIRST=     4132.6476996994, 0,             0
##LAST=      -1043.33573715361, 0,           0
##MIN=       -1043.33573715361, -52124,      0
##MAX=       4132.6476996994, 346021152,     0
$$ Real data points
##PAGE= N=1
##DATA TABLE= (X++(R..R)), XYDATA
$$ [...]
20464A5344J922k48q139q484N976K925J869r011J205O041M617k916Q42l659o200
20449B084k044K859O598n644j1859j1205O663J0591p275J64l541J3170K3691q886
20435A5366j3754L296L25r580J551j2698L972J1841J0954l676l236n661K442J5001
20421A6143O924K637r411j8212j0816Q053P797J326m758Q175L203o846K172R682
20407A6069n47M939j5536r547Q394J2645k109j5116r200o895o972K212Q697l080
20393a6046l662m77r06J0091L425m98j3004O223K1000J069j774n486j8157J2342
20379e860j176R233J4487j42j4101r522N385P377O062p371j5547K978J4583r974
20365c588M723J2695K363N709N826j1348p364q06o141l606j453K408N840k719
$$ plain form
20464 15344 17266 17018 8879 395 6371 9296 11165 2154 3359 9400 14017 11101 11943 8284 2084
20449 2084 40 2899 9497 3853 -8006 -19211 -12548 -1957 -9232 -9068 -12609 561 24252 15366
20435 15366 1612 4908 5233 -4347 -2796 -15494 -11522 319 11273 7597 4361 -1300 1142 16143
20421 16143 23067 25704 16293 -1919 -12735 -4682 3115 4441 -317 7858 11061 4215 6387 16069
20407 16069 15522 20461 4925 -4622 3772 16417 14308 -808 -10008 -16903 -23875 -21663 -12966 -16046
20393 -16046 -19708 -20185 -21091 -11000 -7575 -8073 -21077 -14854 6146 7215 5441 -45 -18202 -5860
20379 -5860 -7036 2197 16684 16542 2441 -7081 -1696 5681 11743 4372 -11175 -8197 6386 -3588
20365 -3588 1135 13830 16193 21902 27728 16380 9016 8210 2069 -1537 -2990 -582 5258 2539
20351B539M416J4463R639q759j2716j7684O751o316k935J8237J0840j047M53l043
20337A4838k55N200K083J462j9636j2519J885N371K57o621m60r841L661n6q833
20322b3464m606K2089K7883p320j3252K009J4522j205j0754k0030m088R311j106
20309a0011MJ3592K673p485o113r696o56R333P995L692o604J543j3982P868K4284
20294A6437P981p314j2873j3562M167N776M252k051m077l997j186M809J031m027
20280d634r404j5290J819J5108J737P549r13o163N308n99j871K902n274K757R079
20265B111J6139J0709Q808m913l86j1500j8055q062Q920j452p589p225K920N495
20251d080L908k250j397L538L355rk709J166r68j0570l631M392M952m053j282
$$ plain form
20351 2539 6955 21418 31057 22298 9582 -8102 -1351 -7667 -10602 7635 18475 17428 17881 14838
20337 14838 14583 19783 21866 23328 3692 -8827 -6942 -1571 -1314 -7935 -8395 -18236 -14575 -14631 -23464
20322 -23464 -28070 -5981 21902 14582 1330 3339 17861 16656 5902 -14128 -18216 -8905 -10011
20309 -10011 -10007 3585 6258 -1227 -7340 -17036 -17692 -8359 -364 3328 -3276 -1733 -15715 -7847 16437
20294 16437 24418 17104 4231 -9331 -5164 612 4864 2813 -1264 -5261 -6447 -1638 -607 -4634
20280 -4634 -14038 -29328 -27509 -12401 -10664 -3115 -4028 -10191 -4883 -5482 -7353 -4451 -9725 -6968 2111
20265 2111 18250 28959 37767 32854 32468 20968 2913 -5149 3771 2319 -5270 -12495 -9575 -4080
20251 -4080 -172 -2422 -3819 -281 3074 3065 356 1522 554 -10016 -13647 -9255 -4303 -8356 -9638
20236i638j4264o461J0163O926J5430J3385m335r930M312j5483R495N084m687
20223cj1623q136R525J2508O253L042q69L796O876j4798K172R911j380O533N794
20208B9601j0858j1578k079q552n962L88K106n914Q234J1348J0697J1554p18K118
20194C0385j0613q045q180Q52o355O762J9354L975j0603j6610r153K0507O134
20181A8410k4157r254m2N394K558j514J5810N264j6890j4668j449K4040Q276j0992
20167G86K317m909L971j026j7045O603P707k376J938k230n705l578j772J0533
20153d786R12N220P352j2735k790R230j282o40L947j281L218J1885L327l251O542
20138B4868j5920j3451K210K923N807l903o663o673m478j909l839N608P964N725
$$ plain form
20236 -9638 -23902 -30363 -20200 -13274 2156 15541 11206 1276 5588 -9895 -400 4684 -3
20223 -3 -11626 -19762 -10237 2271 8524 11566 10697 14493 21369 6571 8743 18654 17274 23807 29601
20208 29601 18743 7165 5086 -3466 -9428 -9040 -6934 -12848 -4614 6734 17431 28985 28267 30385
20194 30385 19772 11727 3547 4399 -1956 4806 24160 28135 17532 922 -8231 12276 18410
20181 18410 -5747 -15001 -15043 -9649 -7091 -8605 7205 12469 -4421 -19089 -20538 3502 11778 786
20167 786 3103 -1806 2165 1139 -15906 -9303 -1596 -3972 -2034 -4264 -9969 -13547 -15319 -4786
20153 -4786 -3874 1346 8698 -4037 -6827 2403 1121 481 4428 3147 6365 18250 21577 18326 24868
20138 24868 8948 -4503 -2293 630 6437 2534 -4129 -10802 -15280 -17189 -21028 -15420 -7456 -1731
20124a731m582M436N287n33o489j7366n580o205k11J1236j77J4046K923n4j506
20109f506r582M622O372r342J54J1598M105k1L205J452p82L859m356m299k674
20094b195j1160J1980Q989J418j5298j4402p260q08J1337J6246L991J774J1441
20081A6053m605J434j5907n47k817p095K582Q810k316r466M320J4953K091q81
20067F609k132p880j9452k983m78J4630K6034L281r066j0362q573o184L122J4093
20053F59j439M572q988N652Q977M031M494J5690m608j5653J196Q12n357r214R125
20038I949J2688j2787m445M875q63m782q839K491J1819J4494p093M992j3957r083
20024e41j963q726P638J0665m41n732L584P693K137n203m238p723L631N760j036
$$ plain form
20124 -1731 -6313 -1877 3410 2877 -3612 -20978 -26558 -32763 -32974 -21738 -21915 -7869 -4946 -5000 -6506
20109 -6506 -16088 -11466 -5094 -14436 -14282 -2684 1421 1400 4605 6057 5275 9134 4778 479 -2195
20094 -2195 -13355 -1375 7614 9032 -6266 -20668 -27928 -28736 -17399 -1153 2838 4612 16053
20081 16053 11448 12882 -3025 -3572 -6389 -13484 -10902 -2092 -4408 -13874 -9554 5399 7490 6609
20067 6609 4477 -3403 -22855 -25838 -26316 -11686 14348 17629 8563 -1799 -10372 -16556 -13434 659
20053 659 -780 3792 -5196 456 9433 13464 17958 33648 29040 13387 14583 15395 10038 824 9949
20038 9949 22637 9850 5405 10280 9417 4635 -4204 -1713 10106 24600 17507 22499 8542 -541
20024 -541 -2504 -11230 -3592 7073 6632 900 4484 12177 14314 9111 4873 -2850 781 6541 5505
20009E505k764j0413N401O393J039n771o708o8R561P333j277R763J8952j5691
19995B1255M313k853k4071k207j1199O390P795J670j054R255j887j2288j7050
19982b1931k185O798R174p02m732L392P701K0953O152m526q405k88m991M323j651
19967I082J134OJ0014j489j3555j485n701k980J7951J45r921P942k895j0927m324
19952g003k277o980j1192N082J3726J8581l65j2165m695N030K0154j0012j6214
19939h330l814p477J366R983L291j836l006Q682P541J2890q097j554J490p693
19925C436J823R215r80m778o524K598q364k303k689J034j0275Q463R542R051j112
19910H137r449q539o107M180N526J0895n99J1864P359m810n463r534N105K65q683
$$ plain form
20009 5505 2741 -7672 -2271 4122 5161 -610 -7318 -7386 2175 9508 8231 17994 36946 21255
19995 21255 25568 22715 -1356 -3563 -14762 -8372 -577 1093 39 9294 7407 -4881 -21931
19982 -21931 -24116 -17318 -8144 -8846 -13578 -10186 -2485 18468 24620 20094 11689 11401 6410 10733 9082
19967 9082 10216 10222 20236 18747 5192 3707 -1994 -4974 12977 13122 3201 11143 8248 -2679 -7003
19952 -7003 -9280 -16260 -27452 -22370 -8644 9937 9572 -2593 -7288 -2258 17896 7884 -8330
19939 -8330 -12144 -19621 -18255 -8272 -4981 -6817 -9823 -1141 6400 19290 11193 9639 11129 3436
19925 3436 5259 14474 13494 8716 2192 4790 -3574 -5877 -8566 -7532 -17807 -9344 198 9249 8137
19910 8137 -1312 -9851 -15958 -11778 -6252 4643 4044 15908 23267 18457 12994 3460 8565 8830 147
19895A47n626J7515K2577o747j0402n616q317J013J665m453L364j1210L020M275
19881A205J7843K820j0206O270p50L961M461J891M585j6677m923J524l363j1254
19867b613q431P45k932q271J1864J4168m561J32j5325Q750R000o452k002l260
19853i188o414q160J4979J2470K04O484k652j3986K604J1948M791p333m861M193
19839E079J1841l747k966J0698n154k5780k1122m85O377J6219k997k072n552J0945
19825h716M541R63K311R79P589n470j0912J090J0784J1805L895o595M50r790n469
19810b545m436r143N171N016J4442m66l317o687n051r903m370O510N095K663O837
19795a84J6327r015j5422O214R488l904k340n537m685Q9O241m145J415J2211q951
$$ plain form
19895 147 -5479 12036 34613 27866 17464 11848 3531 4544 6209 1756 5120 -6090 -3070 1205
19881 1205 19048 21868 11662 17932 17182 21143 25604 27495 32080 15403 10480 12004 8641 -2613
19867 -2613 -11044 -10299 -13231 -21502 -9638 4530 -31 101 -15224 -6474 2526 -3926 -5928 -9188
19853 -9188 -15602 -23762 -8783 3687 3891 10375 7723 -6263 -3659 8289 13080 5747 886 5079
19839 5079 16920 13173 10207 20905 15751 -10029 -31151 -31636 -25259 -9040 -12037 -14109 -19661 -8716
19825 -8716 -4175 -3212 -901 78 7667 2197 -8715 -7625 3159 14964 18859 12264 12714 2924 -2545
19810 -2545 -6981 -16124 -10953 -5937 8505 8039 4722 -1965 -7016 -16919 -21289 -14779 -9684 -7021 -184
19795 -184 16143 7128 -8294 -2080 7408 3504 1164 -4373 -9058 -8969 -2728 -6873 -5458 6753 -2198
19780b198M057J5595n605P80p30p670j2429o158P881r59J1204J475p421j1777
19766a3955P452R907k527J041J1779n047k2467Q788R862j611J4337N212j3631
19753I140j3686p186M580R950j8319K024J1127M243N342j071Q02o588J5698N374
19739B1430p401r284o146j08o665j1179q242J3629J831M636N616K805K3939Q436
19725C3297k726j5989j5178j6125L957J6890m675j995Q018k645k267J260O292
19712H114q70m457J188k543O366k391O569M13n678K959p52j631O226P660O969
19697B8142Q382j7415j1784n764Q831N383j0106q359m48J2414J4575M087J069
19684B9007L843L205j0401j8305K871j744l300q036r521R168J4286J0596j761
$$ plain form
19780 -2198 1859 17454 11849 12629 11899 4229 -8200 -14358 -6477 -7436 3768 5243 -2178 -13955
19766 -13955 -6503 3404 877 1918 13697 8650 -13817 -5029 4833 3222 17559 22771 9140
19753 9140 -4546 -11732 -7152 2798 -15521 -13497 -2370 1873 7215 6144 6946 358 16056 21430
19739 21430 14029 4745 -1401 -1509 -8174 -19353 -27595 -13966 -12135 -7499 -1883 922 24861 33297
19725 33297 30571 14582 -596 -16721 -12764 4126 -549 -2544 5474 2829 562 1822 8114
19712 8114 7244 2787 3975 1432 7798 5407 11976 12389 6711 9670 8918 7287 13513 21173 28142
19697 28142 36524 19109 7325 1561 10392 15775 5669 -2690 -3138 9276 23851 27938 29007
19684 29007 32850 36055 25654 7349 10220 8476 5176 -2860 -12381 -3213 11073 21669 19908
19671A9908l629M471O372j637m927M331j826n201p839M247o17m137j3462j988
19657e934P412l947M97O183N988Q067j6333p21l67j4856r795k05M978J3845j3127
19642a8315j2174J5391J0662q797j4862K648J5769J7595j0124p180J510J832m584
19629a0629J1636J238J0967K499j2445p586P19J712J3256J6503O421P175j2065
19616B9401j4319j0733K263n980J672N210l461J776o713q566J890Q786K413K24
19602C863K039L217L731M939j501m057o067K909L153J2021o895p504r260N961
19588F549R699O511m809n678l443J256j0511m655L871O704o960j1449l206J3980
19574b141N661M430J5155L708j4605j5826n062p5J311P594R744L75n274r557k79
$$ plain form
19671 19908 16279 20750 27122 25485 20558 24889 23063 17862 10023 14270 13653 9516 -3946 -5934
19657 -5934 1478 -2469 -1972 4211 10199 18266 1933 1212 845 -14011 -23806 -24011 -19033 -5188 -18315
19642 -18315 -30489 -15098 -4436 -13233 -28095 -25447 -9678 7917 -2207 -9387 -7877 -6045 -10629
19629 -10629 1007 2245 13212 15711 3266 -4320 -3601 -1889 11367 27870 34291 41466 29401
19616 29401 15082 4349 6612 632 2304 7514 4053 5829 -884 -9450 -7560 1226 3639 3863
19602 3863 5902 9119 12850 17789 16288 12231 6164 9073 12226 24247 17352 9848 588 6549
19588 6549 16248 22759 17950 12272 8829 10085 -426 -5081 -1210 5494 -1466 -12915 -16121 -2141
19574 -2141 3520 7950 23105 26813 12208 -3618 -8680 -8755 -7444 150 9894 10269 4995 -4562 -4841
19559d841K678j317j7720J6878J7604R714M800r962n825j045l371J2371Q951j3086
19545A5829l518j1378M05J1145j689q353J1318j613j8031O110M940j677J0703
19532A4191l120n785j501N564L966r820j0581J934j757J929O555O44L368m516
19518A071M24k730k0573K3k663J6725J0780N038q507J445k976n41J0371m910J2942
19503A5919L90q975M349j5026Q828J9654L540r665n105J3545p173j5948l289J4377
19489A5421N72j9374j0057m852O740J4471K4801J8988J3705k977k2162k2189j9829
19476f742n852K4533J7262J7289r619j8668p894J0775J996n027N270N079l843
19463B4559l262l724N441J097p081l880J0350m183m611n063J0155O649m296L78
$$ plain form
19559 -4841 -2163 -3480 -21200 -4322 13282 22996 27796 17834 12009 10964 7593 19964 28915 15829
19545 15829 12311 933 1338 12483 10794 2441 13759 12146 -5885 225 5165 3488 14191
19532 14191 11071 5286 3785 9349 13315 3495 -7086 -5152 -6909 -4980 1575 2219 5587 1071
19518 1071 1495 -1235 -21808 -21785 -24448 -7723 3057 8095 -412 1033 -1943 -2484 7887 2977 15919
19503 15919 16309 7334 11683 -3343 5485 25139 28679 19014 13909 27454 20281 4333 1044 15421
19489 15421 15993 -3381 -13438 -18290 -11550 2921 27722 46710 60415 57438 35276 13087 -6742
19476 -6742 -12594 11939 29201 46490 36871 18203 10309 21084 23080 18053 23323 28402 24559
19463 24559 21297 17573 23014 24111 17030 13150 23500 19317 14706 9643 19798 26447 22151 22529
19449B2529o279p769K129j4444l993J171M716L702j642L063Q041m433j0619n044
19435h872N29M220J1706O081M833j1659n909J3734q29q217J2242K177m604J0666
19421B6098J5833Q346m980p684j9059j4507j02k560o171o473j0771J2942K6868
19408A7780O515O865q971j7880k535L686J3445J2430o598k0253p984M307N521
19395F328Q389J0295k585r016L95P171l732m6j812j729r71q922J783J5982j066
19380B0464p048j1003k647M106P297J0096o61r184r855l075K631J742k59L846
19366F450J714l719Q01q615M445K0080P946l1681m842J4779l385o871j2437J2758
19352b577J2220p968p277J5706K260M103N296J446R043j1168q415m553J366R434
$$ plain form
19449 22529 16250 8481 10610 -3834 -7827 -6656 -1940 1762 120 3183 11224 6791 -3828 -8872
19435 -8872 -8343 -4123 7583 13664 18497 6838 929 14663 13834 5617 17859 20036 15432 26098
19421 26098 41931 50277 45297 37613 18554 4047 3945 1385 -4786 -11259 -22030 -9088 17780
19408 17780 24295 31160 22189 4309 1774 5460 18905 31335 24737 4484 -3500 807 6328
19395 6328 14717 25012 22427 13411 13806 20977 17245 17199 15387 13658 12687 3765 5548 21530 20464
19380 20464 13416 2413 -234 3872 11169 21265 20604 11420 1565 -1510 1121 2863 2604 6450
19366 6450 8164 4445 5246 -3369 1076 21156 29102 -2579 -7421 7358 3973 -2898 -15335 -2577
19352 -2577 9643 1675 -5602 10104 12364 16467 21763 23209 32252 21084 12669 8116 9482 18916
19338A8916r243j102m337m565j3661J7592K7001N473n910Lj2869j8071J0946O724
19324A6897k34N675j9145J405P259L571l130p315j1328N077j0096N986j351P186
19310D57L512m619N996j073n01Q24L770J1837j786k244J630M039k40n794j1012
19295D796o921j919m71o523J2122J2306j605r453l927n523o770J455P654J1562
19281F783m66l071j891P154N227J7643l638j201p641k0305j151K83p869J2042
19267A899K0892J5418j114j929j2789m26k279M81q513K203N562o375K951R965
19253B5946j1820R38M733J521l965o341j055m063Q316R487N187j0258j707j87
19239A6732l194r853N45J5856R538p803M372j0907k757K261m227l213r837K408
$$ plain form
19338 18916 9673 8571 4234 -331 -13992 3600 30601 36074 30164 30167 17298 -773 10173 16897
19324 16897 16663 22338 3193 4598 11857 15428 12298 4983 -6345 -1268 -11364 -5378 -6729 457
19310 457 3969 -650 5346 4273 3772 4596 8366 20203 18417 16173 17803 21842 21602 15808 4796
19295 4796 -2125 -4044 -4515 -11038 1084 13390 11785 2332 -1595 -7118 -13888 -12433 -4779 6783
19281 6783 6317 3246 1355 8509 13736 31379 27741 26540 18899 -1406 -2557 -2274 -10143 1899
19267 1899 22791 38209 37095 35166 22377 21951 19672 20153 11640 13843 19405 13030 15981 25946
19253 25946 14126 15064 19797 21318 17353 11012 9957 5894 14210 23697 28884 18626 16919 16732
19239 16732 13538 3685 4230 20086 29624 21821 26193 15286 12529 14790 10563 7350 -2487 -79
19225g9M93n417j194p334P533J0406K13n763J0479O428L613P48k823q858M819
19210A3264J7117J625q489r096p718o244M998Q015R591j1977k728N293J976j758
19196A3869K227J0979R044l257j0427J0070J8774n268j0962K86L347p271j2330
19183A9081j2881Q13M023Q313Q238j6567q927p136P015O656j1776M924J7070J8130
19169C6976m68j9857J958N390j3101o835p26p527J1302J4826m348m913l543K76
19155I410J3795p81O155N556P251p039j9068Q591J319q949j230J1283J093n13
19141B6873l832J3156Q980K483j0265m681j7852j0946j595J849J609O609j760
19128A0628j4903p70J5071J389R088K100J1789O426l057o338P608k59j2352p528
$$ plain form
19225 -79 414 -5003 -6197 -13531 -5998 4408 4621 -1142 9337 15765 19378 20126 17303 8445 13264
19210 13264 30381 32006 23517 14421 6703 459 5457 13472 23063 11086 8358 13651 15627 13869
19196 13869 16096 27075 36119 32862 22435 32505 51279 46011 35049 35335 38682 31411 19081
19183 19081 6200 7013 11036 19349 27587 11020 2093 -5043 1972 8628 -3148 1776 18846 36976
19169 36976 36508 16651 18609 23999 10898 4063 3337 -4190 7112 21938 17590 12677 9134 9410
19155 9410 23205 22424 28579 34135 41386 34347 15279 23870 25189 16240 15010 26293 27386 26873
19141 26873 23041 36197 45177 47660 37395 32714 14862 3916 2321 4170 5779 12388 10628
19128 10628 -4275 -5045 10026 11415 20503 22603 34392 40818 37761 31423 39031 38772 26420 18892
19114A8892J267O411j534Q021o289n501j0295k23J1916O776K163P934K180k6014
19100A5704j2900P382L237n111O310L076Q488m789j819P37m536k460J2980L952
19086C0251o979j1022R580Q820j1231k4916O181J0163R072m817o567K123J129
19073A1787J3938K853m792Q013j200j18k0991j4100K768N516J5254J4702l315
19060C0315o862j417Q004k1800m482L417M543p922J579k146p251M211l530O166
19046B825J1533J6123K869p157j0543L416J931L375M453N447L008q786K510r593
19032B1411Q663k424n644J977j7330q355p15o11J4352k445O610O072r894k601
19018I066J5980O577j4979m212r394Q588J3044q195P787P401j3177P54P658k497
$$ plain form
19114 18892 20159 26570 25036 33057 26768 21267 10972 10749 22665 29441 31604 39538 41718 15704
19100 15704 2804 10186 13423 8312 14622 17698 26186 21397 19578 20315 15779 13319 26299 30251
19086 30251 23272 12250 21830 30650 19419 -5497 684 10847 19919 15102 8535 10658 11787
19073 11787 25725 28578 23786 31799 30599 30481 9490 -4610 -1842 3674 18928 33630 30315
19060 30315 23453 22036 30040 8240 3758 7175 11718 3796 5375 3229 -4022 189 -3341 2825
19046 2825 14358 30481 33350 26193 15650 19066 20997 24372 28825 34272 37280 28494 31004 21411
19032 21411 30074 27650 22006 23983 6653 -1702 -2417 -3028 11324 8879 15489 21561 11667 9066
19018 9066 25046 31623 16644 12432 3038 11626 24670 16475 24262 31663 18486 19240 26898 24401
19004B4401R271K917m232J6414J5001l429n622j4218n882O214J029M89L382P18
18990D6453k828m835O713J1315J0712J3965O295K7357J7313n466L728J797j1534
18977A20985j0035j9713k1863j361m761O685M636j0620k193r257j0778p772m035
18964B9918l698P955O340N21P272K306P782k345j3530j7600P742K4560J6462o72
18950G3013J0024K7718K899R82l116j353J3599J6563l364k607j4261m924Q427
18937A23600P198K5144J9122O222K7885J9595J0061M139L272j5070l9765j9498
18925A71905j9568k1305k8848j3329j8623j1702J9261J4272j3178l377j33n854
18913F9521J042o323l901N911n312K98P376M101J2472N974r471K2952K3151J2522
$$ plain form
19004 24401 33672 36589 32357 48771 63772 60343 54721 40503 34621 40835 41864 42353 45735 46453
18990 46453 43625 38790 45503 56818 67530 81495 87790 115147 132460 126994 130722 132519 120985
18977 120985 110950 91237 69374 68013 63252 69937 74573 63953 61760 52503 41725 33953 29918
18964 29918 26220 34175 40515 41036 48308 50614 58396 56051 42521 24921 32663 57223 73685 73013
18950 73013 83037 110755 113654 114636 111520 110167 123766 140329 136965 134358 120097 115173 123600
18937 123600 130798 155942 175064 181286 209171 228766 238827 242966 246238 231168 191403 171905
18925 171905 152337 131032 102184 88855 70232 58530 77791 92063 78885 75508 75375 69521
18913 69521 70563 64240 60339 66250 60938 61236 68612 72713 85185 91159 81688 104640 127791 140313
18899A40313J4446J4903K5368J3972J5937Q87J215M975r614l3687j6934o16m548
18886A66617k208q199j1187m832K0683R907K675j3342j079J15l5365l2313k2868
18873F8604j0577J1626K451n330j0694O37J3472n101n366n429o586M020l61P04
18859E2070l241J2903P281n588j650J5872l543j517J5611R805J6505J9989L802
18846A38299J185L214L086J0881O694m953k5410j9701j4468n732j2323o585L07
18833G4494M852L765j663j6840K876P683l814j2374j6232m285M999o591R159n813
18819D0216o386M944r164r019J4298J7087n745j566M647n311K234L169N07m746
18805D5165j246N323p99N300j750r420j3538K813Q861K0360J117q363p972l508
$$ plain form
18899 140313 154759 169662 195030 209002 224939 225826 227041 232016 222402 188715 171781 171165 166617
18886 166617 164409 156210 145023 140191 160874 170781 173456 160114 159035 159150 123785 91472 68604
18873 68604 58027 69653 72104 66774 56080 56717 70189 65088 59722 54293 47707 51727 51366 52070
18859 52070 48829 61732 69013 63425 61775 77647 74104 72587 88198 98003 114508 134497 138299
18846 138299 139484 142698 145784 156665 163359 158406 132996 113295 98827 93095 80772 74187 74494
18833 74494 79346 83111 81448 64608 67484 75167 71353 58979 42747 38462 43461 36870 46029 40216
18819 40216 33830 38774 29610 20591 34889 51976 46231 44665 49312 44001 46235 49404 49911 45165
18805 45165 43919 49242 48443 53743 51993 42573 29035 31848 40709 61069 62186 53823 45851 42343
18791D2343J4165R556k515l948o259l099l488r783M414L694R303N557J139m970
18777E6109R951Q99R671J2254l954P026J9114K0557R432N948K3043J4905j5613
18764A69342j7184k2502k7771j7930j100j0530K542L626q150n610L230r597M101
18751F2467M848j3338q183m4M068K710K862K313m779Q821J756k2475J4060J8667
18737G3753j3187j002n107j2220r93L620R499P094M363J1658N986N414Q525K752
18723A00155n419O77m900j1301j1951K924J9731J6717q185j5758k1276j6152O397
18710E1659J6250Q764m242K568J7000n125j8326O943P676p416r59R55m107M40
18696G2080J1612r90L640J051Q735J5261K0756P239Q051J8040L6874K3606J08
$$ plain form
18791 42343 56508 66064 63549 59601 53342 50243 46755 36972 41386 45080 54383 59940 61079 56109
18777 56109 66060 66959 76630 88884 84930 91956 111070 131627 141059 147007 170050 184955 169342
18764 169342 152158 129656 101885 83955 82855 72325 74867 78493 70343 64733 67963 58366 62467
18751 62467 67315 53977 45794 45750 49818 52528 55390 57703 52924 61745 63501 41026 55086 73753
18737 73753 60566 59564 54457 42237 41244 44864 54363 61457 65820 77478 83464 88878 97403 100155
18723 100155 94736 95413 90513 79212 67261 70185 89916 106633 98448 82690 61414 45262 51659
18710 51659 67909 76673 72431 74999 91999 86874 68548 75491 83167 75751 74792 75747 71640 72080
18696 72080 83692 82702 86342 87393 96128 111389 132145 139384 147435 165475 202349 225955 226063
18683B26063R543R359J1394J9616M805N424J0532J4945m563j2112p853q458j3715
18670B64980j5162M583J162n919j8070j4299j4848j1160k3863j4459j5356j7925
18658A19664j292o847k141k083L548k654Q848Q464o048J362j909J822J8086N097
18644A43917P140O33M796J8506L3076J8564K2894K9379M0616K7512J5427O917
18632C69377Q067R521O558K0060K1833p30l696o053k5974k5830l640o867j9561
18619C43065j6481j7031j8872k1511j6916k5994k5887j1108j4435q296K1675J1132
18607A99341K936M344J2755J7247J3856J7989P969Q135K3736K6174L47j3781j0121
18594C10927J1554K1322K6017K0920J0728J4816J3785J504j1749j5355p009n703
$$ plain form
18683 226063 235606 244965 256359 275975 280780 286204 296736 311681 307118 295006 287153 278695 264980
18670 264980 249818 254401 255563 249644 231574 217275 202427 191267 167404 152945 137589 119664
18658 119664 118372 111525 109384 107301 110849 108195 117043 125507 119459 120821 118912 120734 138820 143917
18644 143917 151057 151690 156486 174992 208068 226632 249526 278905 319521 347033 362460 369377
18632 369377 377444 386965 393523 413583 435416 434686 430990 424937 398963 373133 369493 362626 343065
18619 343065 326584 309553 290681 269170 252254 226260 200373 189265 174830 166534 188209 199341
18607 199341 202277 206621 219376 236623 250479 268468 276437 284572 308308 334482 334829 321048 310927
18594 310927 322481 343803 369820 390740 401468 416284 430069 431573 419824 404469 397460 391757
18582C91757m861l023j6191L86M856j5265j7663Q189l950L390l587j4298j7703
18569C12037l6233l9258j4076q972l303l371q159l667n258Q226P706J645R122
18556B16439M838r419o080j848J8456K3039K4243M2601L7496K3599M2637L4426
18544D50427K7971K5228M063J0425K372k524q79J566K1101L9251J2679J1265J5951
18531F18896R906j2100j934K0934j993j3106j6873k8483k0320M134N703m994J1225
18518E70995J6366L377j2842l3549l6081j9534q54j7592o494j877J1451J7247
18506D90613K2934L7676L4208K7730L3824L9660M2829K6904K3128K8549J7877
18495H25932L4608P3778Q1831Q9648J00419J08141N2621m1697p1455n6161k3878
$$ plain form
18582 391757 386896 383873 367682 368068 372924 357659 339996 348185 344235 347625 344038 329740 312037
18569 312037 275804 236546 222470 213498 210195 206824 198665 194998 189740 197966 205672 207317 216439
18556 216439 221277 211858 205778 203930 222386 245425 269668 312269 349765 373364 416001 450427
18544 450427 478398 503626 507689 518114 520486 517962 517083 518649 539750 579001 591680 602945 618896
18531 618896 628802 616702 614768 635702 633709 620603 603730 575247 554927 559061 564764 559770 570995
18518 570995 587361 590738 577896 544347 508266 488732 487878 470286 463792 461915 473366 490613
18506 490613 513547 551223 585431 613161 646985 686645 729474 756378 779506 808055 825932
18495 825932 860540 934318 1016149 1105797 1206216 1314357 1366978 1325281 1253826 1197665 1173787
18484A173787J8231N7601R2165J21848J46977K11334L18824M79952P29844J057145
18474D407708J358369J585666J774756J895819J702059R25280K5412l81629k46165
18465A3047275q0181n20280j470185k025294j968664j565494j075670o82685m31692
18456C227130k72917j46545n0257J5043N5254N7107j2293j02775j23460p7208
18446B569079j0275O7082J35470K37651L87153N76269Q15639J104617J420123
18437G302808J600564J625965J740518J763266J289948M43932j7387J11462O62965
18428A6524041R82807P69292O75815J182868K091864L041358L516101L083701
18420C1867847J930965P78413j10364l12919n44933j600300l242604m630139m987491
$$ plain form
18484 1173787 1192018 1249619 1341784 1463632 1610609 1821943 2140767 2620719 3350563 4407708
18474 4407708 5766077 7351743 9126499 11022318 12724377 13649657 13675069 13293440 13047275
18465 13047275 12967094 12446814 10976629 8951335 6982671 5417177 4341507 3658822 3227130
18456 3227130 2954213 2807668 2757411 2772454 2827708 2884815 2872522 2769747 2646287 2569079
18446 2569079 2558804 2625886 2761356 2999007 3386160 3962429 4778068 5882685 7302808
18437 7302808 8903372 10529337 12269855 14033121 15323069 15767001 15749614 15861076 16524041
18428 16524041 17506848 18276140 18951955 20134823 22226687 25268045 28784146 31867847
18420 31867847 33798812 34577225 34466861 34153942 33609009 32008709 28766105 24135966 19148475
18411A9148475m390366l342255k327130j572654j078755p27534m68922k63619
18403D977240p8307O3910J43899K18946K77939J82679k102m345R8023K36459M73167
18392F587508Q69495J418280K127861K881145L557921M099532M431991M164460
18384C0138193K851981J108427j23780l17621K47938M13648q57829k596904l157784
18375B7706269k439930j032184M03331J237970J144717J83306n51482o07276k51442
18366B5793279m89348j835512l335115l840311l445518k660808j934551j362728
18358F889388r88031p13025m58834k67967j23684p052L2617L9352Q095o8270j25975
18347D216614j29379p7796O8396K57311N44626R33524J416314J907674K323944
$$ plain form
18411 19148475 14758109 11415854 9088724 7516070 6437315 5709781 5240859 4977240
18403 4977240 4898933 4962843 5106742 5325688 5603627 5786306 5784204 5779859 5877882 6114341 6587508
18392 6587508 7457003 8875283 11003144 13884289 17442210 21541742 25973733 30138193
18384 30138193 32990174 34098601 33974821 33657200 33905138 34318786 33460957 30864053 27706269
18375 27706269 25266339 24234155 24637486 25875456 27020173 27203479 26651997 26044721 25793279
18366 25793279 25303931 23468419 20133304 16292993 12847475 10186667 8252116 6889388
18358 6889388 5901357 5188332 4729498 4461531 4337847 4330795 4363412 4402764 4410859 4342589 4216614
18347 4216614 4087235 4009439 4077835 4335146 4879772 5813296 7229610 9137284 11461228
18338A1461228K668643K865772K718316J940451P16102k3797j39210K27383J81905
18329B2616793j027963k818367l709768l583578k823469j975467j253868p76534
18321D647779m60211k37235q7665k6748l1959r0240k40409l92165m38393m24334
18311B218420l48937k68727j89897j27527o4575l3455m0804l3983l5199m4930
18301A030386l1090j7547k4565n1264l9944l9232l5981k6306k9069m6407m6026
18290F42955k8897j8279J802j3680j4290j5908j1531o339j2091j786k616j4944
18278E04396p679P193p997j90O742k788j1400j6507o096q563L560r012Q697j04
18264D60252q164J751J0128n229k674K014n25p169j0078q150n450l314J2897M359
$$ plain form
18338 11461228 14129871 16995643 19713959 21654410 22370512 22346715 22207505 22434888 22616793
18329 22616793 21588830 18770463 15060695 11477117 8653648 6678181 5424313 4647779
18321 4647779 4187568 3950333 3862668 3835920 3803961 3713721 3473312 3081147 2642754 2218420
18311 2218420 1869483 1600756 1410859 1283332 1218757 1185302 1144498 1110515 1075316 1030386
18301 1030386 999296 981749 957184 905920 865976 826744 790763 764457 735388 688981 642955
18290 642955 614058 595779 597581 583901 569611 553703 542172 535833 523742 521956 519340 504396
18278 504396 496717 503910 495913 495723 502465 499677 488277 471770 465674 457111 460671 451659 460356 460252
18264 460252 452088 453839 463967 458738 456064 458078 457553 450384 440306 432156 426706 423392 436289 440648
18250D40648j0733J0497k462j582p840n877Q390J3457J3496J4833Q836R910J0662
18237E02235l660L875K138J3039R376j317K069O071P680J2844K0891l199j0508
18224E61534n888o71J0292J1448J3292L1389K4922J5086L546J9947J7292P340
18212G09529J6682K2124J9311K0351K1832J3902K5000K1607K5624L6063L6317
18201I68342M9935P3295Q7597P5778O6326P4750R1356Q6423R4958R3843J00523
18190A863126J13076J35787J44944J70129J83431K02208K25139K41063K43358
18181C522261K85431L83443N03645O92900J000813J446459J959976K540668L225224
18172A5560820L916849M114509L570641L723358L397480J776643K105550K895749
$$ plain form
18250 440648 429915 440412 437950 436368 428528 422651 431041 444498 457994 472827 481663 491573 502235
18237 502235 498575 502450 504588 517627 527003 525686 527755 533826 541506 554350 575241 572042 561534
18224 561534 555646 554975 565267 576715 590007 621396 646318 661404 664950 684897 702189 709529
18212 709529 726211 748335 767646 787997 809829 823731 848731 870338 895962 932025 968342
18201 968342 1018277 1091572 1179169 1254947 1321273 1396023 1487379 1573802 1668760 1762603 1863126
18190 1863126 1976202 2111989 2256933 2427062 2610493 2812701 3037840 3278903 3522261
18181 3522261 3807692 4191135 4694780 5387680 6388493 7834952 9794928 12335596 15560820
18172 15560820 19477669 23592178 27162819 30886177 34283657 36060300 38165850 41061599
18164D1061599L009006L180664L919221L811990J207411N5577k71752k708617
18156E3265099l118258j859064j525002j662283j467942j284647l619390n110257
18148C3618256m962992n477646m975742l828765k828991j933200j317497r14517
18140G378906o25955m39742l05717k24403j69065j33554q9167j5695L6366J50675
18130E562649L05903M96770P53930J104683J483927J916884K417107K768981K543689
18121A9354523K395599K534056J593499J242223K047265K429144K949862M355051
18113C8901222N885572N465053M315938M261124M287365N57445o068236o451827
18105E1153656o297255n213749l149582k895952m124324l853621l800722l728692
$$ plain form
18164 41061599 44070605 47251269 51170490 54982480 56189891 56245468 55973716 53265099
18156 53265099 50146841 48287777 46762775 45100492 43632550 42347903 38728513 33618256
18148 33618256 28655264 23177618 18201876 14373111 11544120 9610920 8293423 7378906
18140 7378906 6752951 6313209 6007492 5783089 5614024 5480470 5391303 5375608 5411974 5562649
18130 5562649 5868552 6365322 7119252 8223935 9707862 11624746 14041853 16810834 19354523
18121 19354523 21750122 24284178 25877677 27119900 29167165 31596309 34546171 38901222
18113 38901222 44786794 50251847 54567785 58828909 63116274 63673719 57605483 51153656
18105 51153656 44856401 39642652 36493070 33597118 29472794 25619173 21818451 18089759
18097A8089759k821241j875236r62569j66799L99539P58467J053760J262061J273026
18088A7010767J424504J181244Q40587Q62101J99038k12175J53233M44939J240749
18079B3144987K259108L342265M275339M225350L974895L782280K100512J473450
18071D8578186J604829J466364K594916L042490L007904K881711J257862o73664
18063F3760598k001139l147678k569033k498980k741925l402464n539967o264517
18055C5594895o153810n318060l874923k505636j445514q59252o19112p34012
18047A4084576q30670p68706n64151k97220j88906j96338l49199l95612l24385
18038A0169389o9335L19672O55499R17586J167324J275497J350907J409879J112829
$$ plain form
18097 18089759 15268518 13393282 12430713 12263914 12663453 13421920 14475680 15737741 17010767
18088 17010767 18435271 19616515 20457102 21319203 21518241 21306066 21459299 21904238 23144987
18079 23144987 25404095 28746360 33021699 37247049 41221944 45004224 47104736 48578186
18071 48578186 50183015 51649379 54244295 57286785 60294689 63176400 64434262 63760598
18063 63760598 61759459 58611781 56042748 53543768 50801843 47399379 41859412 35594895
18055 35594895 29441085 24123025 20248102 17742466 16296952 15437700 14818588 14084576
18047 14084576 13253906 12485200 11921049 11623829 11434923 11238585 10889386 10493774 10169389
18038 10169389 10100054 10419726 11075225 11992811 13160135 14435632 15786539 17196418 18309247
18029A8309247J076867R24895K97623M89777R50737J634543K825293M192149N727583
18020C6428714O708328O899745P464831O818691N155259M782032L273902K320393
18012G9851895K156952J078965j22980r44543j851505k518628l421761l646876
18004G0581519m092174n499563n755726n779981n840530m751488m222877l833835
17996C0805345l109328k376194j777993j473795j438304j822779k054985k094476
17988A4657491j929754j710473j541292j320397j125639q89463o67515m96016
17980D976942l67961k87167k31290j83923j44533j14398l7260J9938J27354K26130
17970C983832L65458N95268R23187J298664J703865K063752K372590K377303J998667
$$ plain form
18029 18309247 19386114 20311009 20608632 21098409 22049146 23683689 26508982 30701131 36428714
18020 36428714 43137042 50036787 57501618 64320309 69475568 74257600 77531502 79851895
18012 79851895 82008847 83087812 82964832 82020289 80168784 77650156 74228395 70581519
18004 70581519 66489345 60989782 55234056 49454075 43613545 38862057 34639180 30805345
17996 30805345 27696017 25319823 23541830 22068035 20629731 18806952 16751967 14657491
17988 14657491 12727737 11017264 9475972 8155575 7029936 6140473 5472958 4976942
17980 4976942 4608981 4321814 4090524 3906601 3762068 3647670 3610410 3630348 3757702 3983832
17970 3983832 4349290 4944558 5867745 7166409 8870274 10934026 13306616 15683919 17682586
17961A7682586J203384q397n33639o35185j42642K75928J93952m95845j574965
17952A5965177j992742j924256j221798m06170K90490O89539P04721M62493j40656
17943A2426798n11183n80157l39662n5506m3091l73523j062666j486907j632975
17934F341128j409128j046438p33507n03949l50398k81839k28852j90351j46896
17925A449770j18795j02196r6744q2831o9433m9157n5658m6089l9504k8661k0314
17914G40388k9065k9333k3551k7725k3709j4630k0185k7620j4599m338K61Q003
17902E33897J2745J1403k573r968j7368j0762M468K514L252M240p067K067r677
17889E17171j7749k7109k1181n244p3m6J6474M797k2977j3560k5761l7258l5881
$$ plain form
17961 17682586 18885970 18877573 18343934 17708749 17566107 17842035 18035987 17540142 15965177
17952 15965177 13972435 12048179 10826381 10420211 10710701 11400240 12104961 12567454 12426798
17943 12426798 11915615 11335458 10995796 10940290 10897199 10523676 9461010 7974103 6341128
17934 6341128 4932000 3885562 3152055 2648106 2297708 2015869 1787017 1596666 1449770
17925 1449770 1330975 1228779 1132035 1049204 979771 930614 874956 828867 789363 760702 740388
17914 740388 711323 681990 658439 630714 607005 592375 572190 544570 529971 525633 525894 533897
17902 533897 546642 558045 555472 545504 528136 517374 521842 524356 527608 531848 524781 526848 517171
17889 517171 499422 472313 451132 445888 445815 445769 462243 467040 444063 430503 404742 367484 331603
17876C31603l0990k0646j8060k817L173j004j098j0763j9117J554m647o662P844
17863B28370l489N391J4724K1091O191p697N942R679K064J0091J3206P026Q185
17850C20774j287n582j7035k37j435o269l330j3696k5126j5859L742r338J65p880
17836B17607M576Q282p312r142j6811j5749r800k1515j3176q687R164J751m631
17823A34557k831j899j4756mp840q291k123J3891J3963K582o540j1156k378m353
17809A02822j88J565k286M77J4373J1779O387O859j839p089m041J668o629m816
17795A19042J1670j3742k3990p138L877Q316n355q820r025n282j3804o708m6J1700
17781F0695J1364J8495K0463j8335k9057J96M198O323j2024k833J0903r499l458
$$ plain form
17876 331603 300613 279967 261907 259090 262263 261259 260161 249398 230281 231835 227188 220526 228370
17863 228370 224881 230272 244996 266087 272278 264581 270523 280202 282266 292357 305563 312589 320774
17850 320774 319487 313905 296870 296633 295198 288929 285599 271903 246777 230918 234660 225322 225487 217607
17836 217607 222183 230465 223153 214011 197200 181451 171651 150136 136960 128273 137437 139188 134557
17823 134557 131726 129827 115071 115067 107227 98936 96813 110704 124667 127249 120709 109553 107175 102822
17809 102822 102634 104199 101913 102390 116763 128542 134929 141788 139949 132860 128819 130487 123858 119042
17795 119042 130712 116970 92980 85842 89719 98035 92680 83860 74835 69553 55749 49041 48995 60695
17781 60695 72059 90554 111017 92682 63625 63821 68019 74342 62318 59485 70388 60889 57431
17768E7431L577J1165K035j527r61P708j2261j972K286k723J347O873r987j0219
17754E2772k591L169O519Q564L858l403M560j6943j1850k869k505J032O660K199
17740D9172p352J4078R127j0457O46j3912n11k808l116J4763l055J1926P909p341
17726E9069j321j638j3459j7516k775r265L353J3030J1555M225Q448O874k133
17713E8447J977p677k5918n152L768R197r633j5182k47J0711K0095M529j0233
17700C4682p088k964l870J6784P768j0084j310j06J032j4555K008P341J522k204
17686B8956J141K774p056K090L00J3584N388n307j929P11O332N575j691N225k360
17671E3733n567N575l701j466J3391N842j0249j4589M353M803j3048n97O443K1650
$$ plain form
17768 57431 61008 72173 74208 72681 71720 79428 67167 65195 67481 64758 66105 72978 62991 52772
17754 52772 50181 53350 59869 68433 72291 68888 73448 56505 44655 41786 39281 40313 46973 49172
17740 49172 41820 55898 65025 54568 55214 41302 40791 37983 34867 49630 46575 58501 66410 59069
17726 59069 57748 56110 42651 25135 22360 13095 16448 29478 41033 45258 53706 60580 58447
17713 58447 60424 52747 26829 21677 25445 34642 25009 9827 9580 20291 40386 44915 34682
17700 34682 27594 24630 20760 37544 45312 35228 33918 33812 34844 20289 22297 29638 31160 28956
17686 28956 30097 32871 25815 27905 28205 41789 47177 41870 39941 40652 46984 52559 50868 56093 53733
17671 53733 48166 53741 50040 48574 61965 67807 57558 42969 47322 52125 39077 38480 44923 66573
17657F6573K7838K0063J5356K7727L3979K3697j3554p276J6618K2091J5204K9534
17645B77850J1487j0166L607l39j3520k6055o198k515j1518k7247j9978p695p489
17632A60224j1882j6152j1211l2291j9657J46j0534r846n774N473R776m650p252
17619D6370r303j3982l753o433O333l434k637J5562L2959O510O132J7356J8434
17606A10114K4840K1326k128J1960J6662K0060k596k704J8765J3878Q864M366
17594B43407j924m412N372n932j8206r026L532j5696j0272l1179l0906k6747k8428
17581F9583j1958L372j730M65m689P805J4305O63j5723J0949K7899K8863J7674
17568A47478K0660l039j6057M135J9j6406j2144P50J8139J7074L858N727N321
$$ plain form
17657 66573 94411 114474 129830 157557 191536 215233 201679 194403 211021 233112 248316 277850
17645 277850 289337 279171 282778 282439 268919 242864 236666 234151 222633 195386 175408 167713 160224
17632 160224 148342 132190 120979 88688 69031 69177 58643 48797 43023 48496 58272 53622 46370
17619 46370 37067 23085 19332 12899 19232 15798 13161 28723 61682 68192 74324 91680 110114
17606 110114 134954 156280 154152 166112 182774 202834 200238 197534 216299 230177 239041 243407
17594 243407 241483 237071 242443 236511 218305 209279 212811 197115 186843 155664 124758 98011 69583
17581 69583 57625 60997 59267 59732 55043 62848 77153 77816 62093 73042 100941 129804 147478
17568 147478 168138 165099 149042 153177 153196 136790 124646 125396 143535 160609 164467 170194 175515
17555A75515M190L617J9022J2483M49r41j0882J849Q211j688Q389R494P593J0267
17541B47568N019j640j0905j4607k5837k1013k4147k2639j9195l802R799R287
17529A27888M052j0975j48L996J0686R863P592j550k9304j5172j1570o479p842
17516H1037P670J2073J0149J0354L2942J4305J0251M844m485J389j0303k1438
17504A48788j4348O789J4138J0139K0608L1476K5635L5569K9964J9123K6116K232
17492C56229k777j6637j4914o770o255J3858K903R87r791j6365k6931j2114r416
17479B52007R775o168J818k638r588j2721r986O64n140p802j8188l2653l2257
17466A27123j1646p992m0436k6411m42K635j0253j3757p394O001J3604J2030J0824
$$ plain form
17555 175515 179705 183322 202344 214827 215276 214335 203453 205302 213513 211825 220214 229708 237301 247568
17541 247568 252587 250947 240042 225435 199598 178585 154438 131799 112604 108802 118601 127888
17529 127888 131940 120965 120817 124813 135499 145362 152954 151404 122100 106928 95358 88879 81037
17516 81037 88707 100780 110929 121283 154225 168530 178781 183625 179140 180529 170226 148788
17504 148788 134440 141229 155367 165506 186114 217590 243225 278794 308758 327881 353997 356229
17492 356229 353452 336815 321901 315131 308876 322734 325637 326624 316833 300468 273537 261423 252007
17479 252007 261782 255614 257432 254794 245206 232485 222499 223163 218023 210221 192033 159380 127123
17466 127123 115477 107485 67049 40638 40196 42831 32578 18821 11427 17428 31032 43062 53886
17453E3886k019j570o829O95L021K1345K0279J5073L832L6705K5756M1113N136
17440B16423j8075k6594k4331l0888j0744m158M381J8324m827j5409M334j6830
17428I1606q905J0198L699j2138K67J5083o472r558M797p649l976R585p779j4434
17414F4324j1610q112j0528j1976j9388j5422p848O683j82J3686P168j0090K975
17401c20j499k896J544j701K254j84J0987M8N83R066j6716m052J0018m346m524
17386a738J3540M326j0736j8046m688L649J4010Q95m723j0543k098O313J1859
17373B020l258k318J2697J0204m188N21j124j8704j241P56P173l548N621j412
17359C199o604J054l388n828j362k219k727Q068J0329L709n821l512k690l527
$$ plain form
17453 53886 51867 50297 43468 44163 47184 68529 88808 103881 107713 144418 170174 211287 216423
17440 216423 198348 171754 147423 116535 105791 101633 106014 124338 119511 104102 108436 91606
17428 91606 82701 92899 96598 84460 84727 99810 93338 83780 88577 80928 76952 86537 78758 64324
17414 64324 52714 44602 34074 22098 2710 -12712 -20560 -13877 -14059 -373 6795 -3295 -320
17401 -320 -1819 -4715 -3171 -4872 -2618 -2802 8185 8233 8816 17882 1166 -2886 7132 2786 -1738
17386 -1738 11802 16128 5392 -12654 -17342 -13693 317 1212 -3511 -14054 -16152 -9839 2020
17373 2020 -1238 -3556 9141 19345 15157 15678 14554 -4150 -5391 -4635 2538 -1010 4611 3199
17359 3199 -3405 -2351 -5739 -11567 -12929 -15148 -17875 -9807 522 4231 -1590 -5102 -7792 -11319
17345a1319l916k181K852J5208J9347K898j7875p988j166M957J3187j4756r95
17332a747j226J164n589P582J0552q035p393N069n060q146M055J4082j469k299
17318A540M882l485r157j555p136J1043J966L941n840j6495l02L066j058J2749
17304e841M475j431L889k71r775J0160M161l982j6999R975K337r971L146K213
17290g914p690l776J3535K186r989o666m31m52J2488l681l986L290K6282L179
17276A6375k3173j6141r666j688K1651N493J965n803J291P776R376Q923l344q217
17262D818L082j0314k1444O520n960O9M100J7288P665j476j9999q162L813k131
17248b2131O792P505M119j418j096q685J0467l849l250J9775M366j2179j3219
$$ plain form
17345 -11319 -15235 -17416 -14564 644 19991 22889 5014 -2974 -4140 817 14004 -752 -1747
17332 -1747 -2973 -1809 -7398 184 10736 2701 -4692 377 -4683 -12829 -8774 5308 3839 1540
17318 1540 6422 2937 -6220 -7775 -14911 -3868 -1902 2039 -3801 -20296 -20598 -17532 -18590 -5841
17304 -5841 -1366 -2797 1092 821 -8954 1206 5367 1385 -15614 -5639 -3302 -13273 -10127 -7914
17290 -7914 -15604 -19380 -5845 -3659 -13648 -20314 -20745 -21197 -8709 -12390 -16376 -13086 13196 16375
17276 16375 -6798 -22939 -32605 -34293 -12642 -7149 -5184 -10987 -9696 -1920 7456 16379 13035 4818
17262 4818 7900 -2414 -23858 -17338 -23298 -23229 -19129 -1841 5824 4348 -15651 -23813 -20000 -22131
17248 -22131 -15339 -7834 -3715 -5133 -6229 -14914 -4447 -8296 -11546 8229 12595 416 -12803
17235a2803j2984N058P459J102M987J3295J5045j583k4575j0242J2134K0565j0424
17222G034k1085j3063J49J0056J0184M470r18r59n867Q685n824j3906m410O281
17208a9173K832R222n906p206L209J8750o900j0687l893J0500O621j620j1115
17195a5366j3964Q145J5819J8797n765R763k185j4527j350l720M569q59r034l039
17181a2716J2821J982P874M958R3o030n776j633p537q80M137k622J416k759p036
17166a3708P663J1613J922k22l931j302J857j229r758j433M524N600j5757J2335
17152a826k75j3493N488M015m223J762o840j5305J7813J9599Q810R389j122J276
17138B5068j0590j9356j5235R299O200Q613K407K936J4649r263k0748N864J2886
$$ plain form
17235 -12803 -25787 -20729 -13270 -12168 -7181 6114 21159 19576 -4999 -15241 -3107 17458 7034
17222 7034 -14051 -27114 -26965 -16909 -6725 -2255 -3173 -4132 -9999 -1314 -7138 -21044 -25454 -19173
17208 -19173 -16341 -7119 -13025 -20231 -17022 1728 -5172 -15859 -19752 -9252 -2631 -4251 -15366
17195 -15366 -29330 -21185 -5366 13431 7666 17429 15244 717 -633 -4353 216 -643 -9677 -12716
17181 -12716 105 2087 9961 14919 15012 8982 3206 1573 -5964 -6844 -2707 -5329 -3913 -6672 -13708
17166 -13708 -6045 5568 7490 7268 3337 2035 3892 2663 -7095 -8528 -4004 1596 -14161 -1826
17152 -1826 -2101 -15594 -10106 -6091 -10314 -8552 -15392 -30697 -12884 6715 15525 24914 23792 25068
17138 25068 14478 -4878 -20113 -10814 -4614 3999 6406 9342 23991 14728 -6020 -156 12730
17125A2730R112J1598n930q128o436l617p633o062j045k164P083O403P872n90
17111A3193j6522j6454q263J0499L724N884J9397m012p324r712Q86K938p321o047
17097a9134J9087J1047q497r962J0114J1127q602o746m308l725n456j918k956
17084a9929j302j657j856M650J629J5625L97m439o636j336O114L2P050m348k08
17069f214j1072O91J0270p249j6436L999M783J8037R168j2175J1114n11m658j3045
17055a3298j2019j984L475Q577J0976m84r178j0187l477Q191K4866J1551N341
17042B2350L191j7530j2635N86l753P56J6746k431q183m582L290q816l981K999
17028a1993J1905K344J963p710j0333Q204L36k745k042R570J2805n12k467L047
$$ plain form
17125 12730 21842 33440 27510 19382 12946 9329 1696 -4366 -5411 -7575 -492 5911 13783 13193
17111 13193 -3329 -19783 -28046 -17547 -13823 -7939 11458 7446 122 -9590 -8704 -5766 -13087 -19134
17097 -19134 -47 11000 2503 -7459 2655 13782 5180 -1566 -5874 -9599 -15055 -16973 -19929
17084 -19929 -21231 -22888 -24744 -20094 -18465 -2840 -2443 -6882 -13518 -14854 -8740 -8708 -1658 -6006 -6214
17069 -6214 -17286 -16595 -6325 -13574 -30010 -26011 -21228 -3191 5977 -6198 4916 4405 -253 -13298
17055 -13298 -25317 -27301 -23826 -15249 -4273 -4757 -13935 -24122 -27599 -19408 5458 17009 22350
17042 22350 25541 8011 -4624 -4038 -7791 -7035 9711 7280 -903 -5485 -2195 -11011 -14992 -11993
17028 -11993 -88 2256 4219 -3491 -13824 -5620 -5284 -8029 -10071 -501 12304 11792 9325 12372
17014A2372j3738j8861N346M704k444K626M94J1884J1660l609j3092j2802K23
17001a5237J313q308R084P744j155Q207m095m293l248J0183J411p477n62R128
16987B695J249N895p416m916N597k128M18M988n221k87M195m397r237p352M691
16972a1226K641j701J8421P181p900j3880j022Q890P30J0931p21j5855k533o644
16958a2688R920J320j0050J933P603N323m076o142O131j2169j3739o806O6P032
16944b6342M240O496N793K0890N699j6033j6950O762K198L56m429l178O15j3649
16930b7532N594M124j5871J0589J2732J0053n656o335N500K559k327p239J0689
16917c120O42J317K722m191n491m820P087J4041J19j0229j0488M626K668j0730
$$ plain form
17014 12372 -1366 -20227 -14881 -10177 -12621 -9995 -9501 2383 14043 10434 -2658 -15460 -15237
17001 -15237 -13924 -22232 -13148 -5404 -6559 1648 -2447 -6740 -9988 195 1606 -5871 -6433 2695
16987 2695 3944 9839 2423 -2493 3104 976 1394 6382 1161 874 5069 672 -8565 -15917 -11226
16972 -11226 -8585 -10286 8135 15316 7416 -6464 -7486 1404 2134 13065 12344 -3511 -6044 -12688
16958 -12688 -2768 -1448 -11498 -9565 -1962 3361 -715 -6857 -726 -12895 -26634 -33440 -33374 -26342
16944 -26342 -22102 -15606 -9813 11077 16776 743 -16207 -9445 -7247 -6891 -11320 -14498 -13883 -27532
16930 -27532 -21938 -17814 -33685 -23096 -10364 -311 -5967 -12302 -6802 -4243 -6570 -13809 -3120
16917 -3120 -2478 -1161 1561 -2630 -8121 -12941 -5854 8187 8306 -1923 -12411 -7785 -5117 -15847
16903a5847J19L872M610j2632K418N208J6732J753o475q848q912L567n868P206
16889a3097q90m677J1955j3955q687r300K111O29m606J4007J2919J9633l412J1213
16875A3843J0895k425j8459j5098L563K264O766M227j0111N610M923q330L207
16862H75J3132P08K769P046j5467k8522J89K1078n22q524r954j2631p990J0476
16848b7337J8298O963M010j171n689j905N729l626j0644M586N073j2750l931K286
16834b0108N310J5328O053o597J3203M633j8337l844R478n800J990j940N466N196
16820A0031K794j0987j4652O569N960k776m913R533R748q749n213O783N249M684
16806A4061j235j4639j0581j652j0900J4958J0747m902M036r846m505P449K510
$$ plain form
16903 -15847 -15728 -11856 -7246 -19878 -17460 -12252 4480 6233 -242 -9090 -18002 -14435 -20303 -13097
16889 -13097 -13987 -18664 -6709 -20664 -29351 -38651 -36540 -35911 -40517 -26510 -13591 6042 2630 13843
16875 13843 24738 22313 3854 -11244 -7681 -5417 1349 5576 -4535 1075 5998 -2332 875
16862 875 14007 14715 17484 24530 9063 -19459 -19270 1808 1286 -7238 -17192 -29823 -37813 -27337
16848 -27337 -9039 -2076 1934 763 -4926 -6831 -1102 -4728 -15372 -10786 -5713 -18463 -22394 -20108
16834 -20108 -14798 530 6583 -14 13189 17822 -515 -4359 5119 -681 1309 -631 4835 10031
16820 10031 12825 1838 -12814 -6245 -285 -3061 -7974 1559 11307 2558 -2655 4128 9377 14061
16806 14061 12826 -1813 -12394 -14046 -24946 -9988 759 -4143 -107 -9953 -14458 -7009 -4499
16793d499p495l411p442K786P964O427k136m644l227k0m329k483m8O958J3145
16778b454J403R623o179J899J2867j5887j7797l944r774J4521n756k583P212J0913
16764e936O308q871m683j371J2757N745N334m915n804N41q514N112Q978N427J851
16749A1959O096o070j6069j4567N355J38q75j3545J3571J0602J0858j5926j0204
16736a8677p334j7328N832N718L819Q500J6780r859J181K820o923M052l83j0994
16722b2796M341l397j282J8411k326L557o500m350K8237M294o688o461o21J1372
16708A5791J0324j1183j2060m425Q57k143n52R223P040n891j3074o712L393J3134
16694C722J097p235P37j20M832K6499r264k3039q977l615O389n272J094R312M354
$$ plain form
16793 -4499 -11994 -15405 -22847 -20061 -12097 -5670 -7806 -12450 -15677 -15697 -20026 -22509 -22557 -15599 -2454
16778 -2454 -1051 8572 2393 4292 17159 1272 -16525 -20469 -30243 -15722 -21478 -24061 -16849 -5936
16764 -5936 372 -8499 -13182 -14553 -1796 3949 9283 4368 -1436 -895 -9409 -4297 4681 10108 11959
16749 11959 18055 11985 -4084 -18651 -13296 -13158 -14033 -27578 -14007 -3405 7453 -8473 -18677
16736 -18677 -26011 -43339 -37507 -31789 -27970 -19470 -2690 -12549 -11368 -8548 -15471 -11419 -11802 -22796
16722 -22796 -18455 -21852 -23134 -4723 -7049 -3492 -9992 -14342 13895 18189 11501 5040 4419 15791
16708 15791 26115 14932 2872 -1553 -696 -2839 -3391 5832 12872 6981 -6093 -12805 -9412 3722
16694 3722 4819 -2416 -1679 -1799 3033 29532 20268 -2771 -11748 -15363 -8974 -14246 -13152 -3840 514
16679E14L798P106M271l013j169m744q514j382L794j12n557p039J2049P276m300
16664B978n827o475j3629M632O488j542N999J1355j0007r601l684Q132J1692J726
16650B237p393P340N101K177o010q962K3416L859j2068j0642j995P814M687p424
16636B137j1113k931N879J4775J504q875n629j2525j953M43J0845J4366K151J2672
16622B1746L412l544k133o147j1361j6584n346n651n639Q486j777O932j81o907
16608b4694L548j1009J2903J3648m271n785O994q15j435R414k325o250M256m036
16594i857k007J8559J0971l60n988M408J4340M079j5292j6763J436Q552p447j6242
16580a1611J2096M992j0599k84N817k957q441k052n54j422K721N54J0804P838
$$ plain form
16679 514 4312 11418 15689 12676 11507 6763 -1751 -3133 661 549 -5008 -12047 2 7278 2978
16664 2978 -2849 -9324 -22953 -18321 -11833 -13375 -7376 3979 -6028 -15629 -19313 -11181 511 2237
16650 2237 -5156 2184 7285 9462 3452 -5510 17906 21765 9697 -945 -2940 4874 9561 2137
16636 2137 -8976 -11907 -6028 8747 10251 1376 -4253 -16778 -18731 -18288 -7443 6923 9074 21746
16622 21746 25158 21614 19481 13334 1973 -14611 -19957 -25608 -31247 -22761 -24538 -17606 -17787 -24694
16608 -24694 -21146 -32155 -19252 -5604 -9875 -15660 -8666 -9481 -10916 -1502 -3827 -10077 -5821 -9857
16594 -9857 -11864 6695 17666 17306 11318 15726 30066 34145 18853 2090 3526 12078 4631 -11611
16580 -11611 485 5477 -5122 -5406 411 -2546 -10987 -13039 -13593 -15015 -12294 -11740 -936 6902
16566F902n898j1613Q43k130l02k187O087r668l856J5452O119M727l390m984j5298
16551a9196K796N707l737J4215L908N715r342q379k682o810K516J2056o298r727
16537a9258l19M375K585J051m741R068p767L336J9786M151n071P281R885j0293
16523A4069p169j6884p902J1035L367n63P507Q735K497j6033k513J1841j5670
16510g683N976M698j865l099J1881R544n02p318r642p708k367J805J659N031l403
16495b993r07q341p654Q279J0991R863j1886l91l886M220R068k50J0648M929r882
16480A1808M362P264j708j5496j1273m870m858M280J389n897K330j320q12J307
16466a3494o851K906J0069J004o33j406l408j5903J0595O881J763m269j0053L079
$$ plain form
16566 6902 1004 -10609 -9766 -11896 -12198 -14385 -8298 -17966 -21822 -6370 -251 4476 1086 -3898 -19196
16551 -19196 -16400 -10693 -14430 -215 3693 9408 66 -8313 -10995 -17805 -15289 -3233 -9531 -19258
16537 -19258 -19577 -15202 -12617 -11566 -16307 -7239 -15006 -11670 8116 12267 7196 14477 24362 14069
16523 14069 6900 -9984 -17886 -6851 -3484 -4047 3460 12195 14692 -1341 -3854 7987 -7683
16510 -7683 -1707 2991 1126 -1973 9908 19452 18950 11632 1990 -5718 -8085 -6280 -4621 410 -2993
16495 -2993 -3900 -12241 -19895 -11616 -625 9238 -2648 -3039 -6925 -2705 6363 6113 16761 21690 11808
16480 11808 16170 23434 21726 6230 -5043 -9913 -14771 -10491 -9102 -14999 -12669 -13989 -14801 -13494
16466 -13494 -20345 -17439 -7370 -6366 -6999 -8405 -11813 -27716 -17121 -10240 -8477 -12746 -22799 -19720
16452a9720J0992J0617q820J0745M766o823m424j4309n908K620Q124J4935R926
16439A2721O569k2148j4493o433M929N199n193J0321j964n032p469k645Q865J2841
16425c932k315n520J4644P371j1167j8151q130n247J0916O983J8586J0079j9906
16412e789k85p452L225P606P347J184N342P09r848n228m526P712M337M529M421
16397A3284j0788j820K146l022o769N27o84m8p581K1191K288m962m308o2r681
16382a0289M045L491l666o14N46N620J0100N402L672p974l775q897P774J188m802
16367A821P191l351l291l654j0228k842J9204J1530O59k460m478n607P815J7205
16353B9514n225l505o238m06m753q308m512R371J654k002j241j0180N025O6N151
$$ plain form
16452 -19720 -8728 1889 -6931 3814 8580 1757 -2667 -16976 -22884 -20264 -12140 2795 12721
16439 12721 19290 -2858 -17351 -23784 -18855 -13656 -18849 -8528 -10492 -15524 -22993 -25638 -16773 -3932
16425 -3932 -6247 -11767 2877 10248 -919 -19070 -27200 -32447 -21531 -14548 4038 14117 -5789
16412 -5789 -6074 -13526 -10301 -2695 4652 5836 11178 11887 2039 -3189 -7715 -3 4334 8863 13284
16397 13284 2496 676 2822 -200 -6969 -6442 -7126 -7174 -14755 6436 8724 3762 -546 -608 -10289
16382 -10289 -6244 -2753 -6419 -7033 -6487 -867 9233 14635 18307 10333 6558 -2339 5435 6623 1821
16367 1821 9012 5661 2370 -1284 -11512 -14354 4850 16380 17039 14579 10101 4494 12309 29514
16353 29514 24289 20784 14546 14140 9387 1079 -3433 5938 7592 5590 4349 -5831 -806 -740 4411
16338D411P921m256p463k553L772n917j978J240O66k220J1610J0839r924k022
16324D126o88j7658L79M919N122L707o134o415L566M70j1547j2414p690J1107
16310b9150O080M353J333J0022l341q77m042Q269o894k1729O745R847J2210J433
16296e741j035O470j5426p158k784j1072J674P796P363O826j642p491J0477K0176
16282H433J8303j639j8608j1470Q026N524J2355J100m555q58J073M37q348o688
16268C085P837J997j7922l258J4667K267q171l237J5819N675l039k51j7945j8701
16254b1177J0968r253l522l482J2778O298L418p881J3630J5659J797J2154K873
16241C4260l832j4043j5022m963L648N829k804j1231o575j64k049j969J2977K045
$$ plain form
16338 4411 12332 8076 613 -1940 1832 -4085 -6063 -4823 -4157 -6377 5233 16072 6148 4126
16324 4126 3438 -14220 -13841 -8922 -3800 -93 -6227 -12642 -9076 -8606 -20153 -32567 -40257 -29150
16310 -29150 -23070 -18717 -17384 -7362 -10703 -11580 -15622 -7353 -14247 -35976 -29231 -19384 -7174 -5741
16296 -5741 -6776 -306 -15732 -22890 -25674 -36746 -35072 -27276 -19913 -13087 -14729 -22220 -11743 8433
16282 8433 26736 25097 6489 -4981 3045 8569 20924 22024 17469 16611 17684 18121 9773 3085
16268 3085 10922 12919 -5003 -8261 6406 8673 502 -2735 13084 18759 15720 15469 -2476 -21177
16254 -21177 -10209 -19462 -22984 -26466 -13688 -7390 -3972 -11853 1777 17436 19233 31387 34260
16241 34260 30428 16385 1363 -3600 48 5877 3073 -8158 -14733 -14897 -16946 -18915 -5938 -3893
16227c893q531j0970j4646L863J6056N973M097j996K279J7958r847j4827L8J2622
16213a824M648r606j0524P691J5657j173K146j593r20m712K658j0816o203L197
16199a1374R555q840n512j979q895J588O303L305k145L765L766J1812J0723j117
16185A0955r233j947m423j0072J1541P998Q756K0286P83o975j2727k8409L66R555
16171c546q40J6030J3496N888k5235j8969P346Q719J6820O943j5889N833J1027
16158B7623j9009o157j710l38R157l998r621j853l490J0725R270M77r382j2964
16144a1270k501l41m068M194K122J0248k202l19L712K371q157j796O685L69j81
16129a134m622J263j6123p717J0892n105J0745J1164K720J534L754j4929j643
$$ plain form
16227 -3893 -12424 -23394 -38040 -34177 -18121 -12148 -8051 -10047 -7768 10190 343 -14484 -14446 -1824
16213 -1824 2824 -6782 -17306 -9615 6042 4869 7015 5422 4502 -210 2448 -8368 -14571 -11374
16199 -11374 -1819 -10659 -16171 -18150 -27045 -25457 -19154 -15849 -17994 -14229 -10463 1349 12072 10955
16185 10955 1722 -225 -4648 -14720 -3179 4819 13575 33861 34644 27669 14942 -13467 -13101 -3546
16171 -3546 -4386 11644 25140 31028 5793 -13176 -5830 2889 19709 26652 10763 16596 27623
16158 27623 8614 2457 747 409 9566 5568 -4053 -5906 -9396 1329 10599 11076 1694 -11270
16144 -11270 -13771 -14112 -18180 -13986 -11864 -1616 -3818 -4137 -425 1946 -6211 -8007 -1322 -953 -1134
16129 -1134 -5756 -4493 -20616 -28333 -17441 -22546 -11801 -637 2083 3617 7371 -7558 -9201
16116i201M162J493k1037m910k895O774J0114J3583N295j7105k1158O357J1647
16103a6881J3130J2112o615m109O356l409R681L08l451n737o158k643K356L738
16089a322k775k519J4891j410k4931l327J9717J8320j1695k6732M53K103R799
16076i428K0511j838p172L751l745j5073J900J0705J890k367J5586J4251j0826
16063A8145k0807q781n425M141J3848J3913K567p620m258L14N060m597j3080k6213
16049c2793J0570K4441N986O590l898p77m172N564J2420p947k911P3Q07O412q903
16034A1462R59N178j2045j9858m997J4910J0634l536m668K235Q159p733k253J9582
16020A8029q4p283k823n54l023m843k91p348R23J1086K3956J6593p170j3581r451
$$ plain form
16116 -9201 -5039 -3546 -24583 -29493 -32388 -25614 -15500 -1917 3378 -13727 -34885 -28528 -16881
16103 -16881 -3751 8361 1746 -2363 3993 584 10265 10573 7122 1385 -4773 -7416 -5060 -1322
16089 -1322 -4097 -6616 8275 6865 -18066 -21393 -1676 16644 4949 -21783 -21330 -19227 -9428
16076 -9428 11083 9245 2073 5824 2079 -12994 -11094 -389 1501 -866 14720 28971 18145
16063 18145 -2662 -11443 -16868 -12727 1121 15034 17601 9981 5723 6037 11097 6500 -6580 -32793
16049 -32793 -22223 2218 8204 14794 10896 10119 5947 11511 23931 15984 13073 13146 13953 20365 11462
16034 11462 12421 17599 5554 -14304 -19301 -4391 6243 2707 -1961 274 8433 700 -1553 18029
16020 18029 17945 10662 7839 7285 4262 -581 -872 -8220 -7297 3789 27745 44338 37168 23587 14136
16005A4136K953r821l707K624q967M69N733n924j308n721j5975j60L588N41J0081
15990a1458O184N973N599O680j2190l776J1340J5056j602j6172J5134k155k189
15977A6424Nj1952j7429q618J621N260J3960J0085q605p566R232J8383m208j3083
15963C509P439N603o651j4567k180K650O162J1138M150L893o866j4234l421M928
15949A553N553N365J1363J0344j5321j2062j9609K945J0819K952Q467n938j9680
15936a3249l791L618J0151k356J442O7K77o419j278l444n206R136R864J2165k2
15921A0955L088o529k526p480p233r621J0916J6325J7432r500n296M08l893k1529
15907a4483p036J0708J1063Q630J3994J0626o516j3518j507m236n772Q35R12q64
$$ plain form
16005 14136 17089 7268 3561 6185 -2782 -2313 3420 -2504 -3812 -9533 -25508 -25668 -22080 -21539 -11458
15990 -11458 -5274 699 6298 12978 788 -2988 8352 23408 21806 5634 20768 18613 16424
15977 16424 16429 4477 -12952 -21570 -19949 -14689 -729 9356 751 -6815 2417 20800 16592 3509
15963 3509 10948 16551 9900 -4667 -6847 -4197 1965 13103 17253 21146 14280 46 -3375 1553
15949 1553 7106 12471 23834 34178 18857 6795 -12814 -9869 950 3902 12369 6431 -13249
15936 -13249 -17040 -13422 -3271 -5627 -4185 -4118 -3841 -10260 -11538 -14982 -20188 -11052 -1188 10977 10955
15921 10955 14043 7514 4988 -2492 -9725 -19346 -8430 7895 25327 15827 10531 10939 7046 -14483
15907 -14483 -21519 -10811 252 8882 22876 33502 26986 13468 11961 7725 1953 2788 3700 2836
15893B836O395o966l331l476l464J0317N782p73o864l222Q765R699q638q921n118
15878f979k14q4n097j0384m864K2551O840j1468O112P706m029m336M951J0806
15864A1511L218J532p724O059O839m474k764k557j0553L015l412L972O80l507
15850A835K924n404j785j301p41K042M041K857K762j2091n995J8809k780r835
15836d662N25m781j1151l776r88P813Q856J3447K713Q570Q241l970r417k375N181
15821A4226j055p509N857J1746Q692n663j0751J810j1209Q26q70M457k139J585
15807A0003j1467J927J5182L075P988q003n201m947m901N636J0980R08K249j1932
15793A1497j5013p617M884J2806o606j8868L498k32p288R103K375q555N862Q006
$$ plain form
15893 2836 9231 2265 -1066 -4542 -8006 2311 8093 7320 456 -2766 5999 15698 7060 -1861 -6979
15878 -6979 -7193 -7277 -12374 -22758 -27622 -5071 1769 -9699 -3587 4119 90 -4246 705 11511
15864 11511 14729 16261 8537 14596 21435 16961 14197 11640 1087 4102 690 4662 5342 1835
15850 1835 4759 -645 -2430 -3731 -4472 -2430 1611 4468 7230 -4861 -10856 7953 5173 -4662
15836 -4662 -4137 -8918 -20069 -23845 -24833 -17020 -8164 5283 7996 16566 24807 20837 11420 9045 14226
15821 14226 13171 5662 11519 23265 31957 26294 15543 17353 6144 6970 6100 10557 8418 10003
15807 10003 -1464 463 15645 18720 26708 18705 13504 8557 3656 9292 20272 21180 23429 11497
15793 11497 -3516 -11133 -6249 6557 -49 -18917 -15419 -15651 -22939 -13836 -11461 -20016 -14154 -6148
15779f148j553P845m161O470Q84j3886j9447P408J7842J8534K265o096j346o500
15765B111O758j477j7714k00R791Q788j3253m529J7217j786m862O1J2203N834
15751A8942J606N530l876j526N702n357j6297o095l371m656L445N718O872k918
15737C719n618o858j3047q262K1118N458P899Q614j208L846M534j4636n117L328
15723C770J0942N507K999j1305p124p152k083K131p360J184N197J2390K1497r54
15709B9639j7516m629K960n690N337K756J990M600r897r759O698N660j4649n945
15695h445J133L323q339r32o363R327r209P77J2512K60k855m330R785n31M246
15680C59Q255q988j321j93P297m814L351k28o257m374l165j1131J9450J3888O46
$$ plain form
15779 -6148 -7701 144 -4017 2453 3337 -10549 -29996 -22588 -4746 13788 16053 9957 8611 2111
15765 2111 8869 7392 -10322 -10522 -731 8057 -5196 -9725 7492 5706 844 905 13108 18942
15751 18942 20548 26078 22202 20676 26378 21021 4724 -1371 -4742 -9398 -5953 -235 6637 3719
15737 3719 -1899 -8757 -21804 -30066 -8948 -3490 4409 13023 11815 15661 20195 5559 442 3770
15723 3770 14712 20219 23218 11913 4789 -2363 -4446 -2315 -9675 -8491 -3294 9096 30593 29639
15709 29639 12123 7494 10454 4764 10101 12857 14847 19447 9550 -209 6489 12149 -2500 -8445
15695 -8445 -7312 -3989 -12328 -13260 -19623 -10296 -19505 -18728 -6216 -5956 -8811 -13141 -3356 -3887 359
15680 359 8614 -374 -1695 -1888 5409 595 3946 3718 -2539 -6913 -10078 -21209 -1759 12129 12775
15665A2775J416K13j5891P175n468j2826p587K0564K3676n321j3125O724O845
15652A9170k325j1042r736j0602K435J2029J152o858n469N540O940n849m178J136
15638g657j529r987k965l775J2994O104O875P837N680l364j1098L758J6849K199
15624B1921m342j3018J754j5367o012J577o878l452R183L211j182J4079K557K263
15610F294m895m732n219J1458J1842k68j1896J645Q881q967q516Q39r11m43o245
15595a1133J036J1488p087n626J1476r72n668j17L935J230o773o992J1510K3417
15581A9724J0006r221m30K09p337L906N53n78J3331L010o800M833J881p828q219
15566A7040j1762p42j07p200k7493n650J0028J7905N953Q246L636k0730q871J1161
$$ plain form
15665 12775 14191 14404 -1487 5688 220 -12606 -20193 371 24047 18726 5601 12325 19170
15652 19170 16845 5803 -3933 -14535 -12100 -71 1081 -5777 -11246 -5706 1234 -4615 -8793 -7657
15638 -7657 -9186 -19173 -22138 -25913 -12919 -6815 60 7897 13577 10213 -885 2873 19722 21921
15624 21921 17579 4561 6315 -9052 -15064 -13487 -20365 -23817 -14634 -11423 -12605 1474 4031 6294
15610 6294 1399 -3333 -8552 2906 14748 14480 2584 4229 13110 4143 -4373 -3534 -4445 -4888 -11133
15595 -11133 -10097 1391 -5696 -11322 154 -818 -6486 -6603 -2668 -1438 -8211 -15203 -3693 19724
15581 19724 29730 20509 20079 20288 12951 16857 17410 16832 30163 33173 26373 31206 33087 25259 17040
15566 17040 5278 4536 4429 -2771 -30264 -35914 -25886 -7981 -2028 6218 9854 -10876 -19747 -8586
15552h586K6193R949r511j7347j4522p223P214L951K462Q511O843j457K629P950
15538A7056R002R652j7287p131p263p535K33k262n581R366J2614n477j6676j348
15524a2637R196q083J5851Q470q265j3492j0844J1232M815J442R443p420J142
15511H50l865m30K468P877N659K76o324K418j2480L99K768N774K30J901M088p911
15495C698J903M321M076k540m816j5908m585k442J01J5947R739j586m820p148
15481d060J8172R53j6370r420N68Q362N541p682o376p2K518K0758L289L23J006
15466A7510o392m624p003j238p449k878K0236J3330l319n474l956n525L560L458
15452A0236J3239r536j5648n090l401J576m96n752M784o009k42M496n68J4625
$$ plain form
15552 -8586 17607 27556 18045 698 -13824 -21047 -13833 -9882 -7420 1091 7934 6477 9106 17056
15538 17056 26058 35710 18423 11292 4029 -3506 -3273 -5535 -11116 -1750 10864 5387 -11289 -12637
15524 -12637 -3441 -11524 4327 12797 4532 -8960 -19804 -8572 -3757 -2315 7128 -292 850
15511 850 -3015 -3445 -977 6900 12559 12835 6511 8929 -3551 -3152 -384 5390 5620 7521 11609 3698
15495 3698 5601 9922 13998 11458 6642 -9266 -13851 -16293 -16192 -245 9494 7908 3088 -4060
15481 -4060 14112 15065 -1305 -10725 -10157 -1795 3746 -3936 -10312 -10384 -7866 12892 16181 16504 17510
15466 17510 11118 6494 -509 -1747 -9196 -12074 8162 21492 18173 12699 8743 3218 6778 10236
15452 10236 23475 13939 -1709 -6799 -10200 -8624 -9120 -14872 -10088 -16097 -16339 -11843 -12411 2214
15438B214k290k712Q2J847r50j608j266L723P30J8115R526p690j5789l146j1929
15423a1143p726K210P603Q933N442n755R578J540R381J0669l877r372q208L966
15409A3241l635P237j66r844k757K216M058m317j6708k43M809L018N801J923j626
15394C007O29j960J78L950j1206j1889k522P704J8615R045l647p330j898R234
15380A1910K2297J869j1543j8100o973P890o826r943n415N377Q133L623N94J3277
15366A6170j2982n562O45r41Q23q700J4895M193k334O082p931q105O57L546m744
15351d288o179k819l91k456J1016J4677L301q266q388j0233K6J8742J471K962
15337I175O988m13k409N549j939p127P864n676k1697L292N037j0869j494q01J2289
$$ plain form
15438 2214 -76 -2788 -2706 -859 -1809 -3417 -4683 -960 -230 17885 27411 19721 3932 786 -11143
15423 -11143 -18869 -16659 -9056 -123 5319 -436 9142 10682 20063 30732 26855 17483 9275 13241
15409 13241 9606 16843 16677 6833 4076 6292 10350 6033 -10675 -10918 -6109 -3091 2710 4633 3007
15394 3007 3636 1676 1854 5804 -5402 -17291 -19813 -12109 6506 15551 11904 4574 2676 11910
15380 11910 34207 36076 24533 6433 -540 7350 524 -9419 -14834 -9457 -1324 2299 2893 16170
15366 16170 3188 -2374 -1729 -2670 -1847 -10547 4348 8541 6207 12289 4358 -3747 -3090 456 -4288
15351 -4288 -10467 -13286 -13677 -16133 -5117 9560 12861 4595 -3793 -14026 -14000 4742 6213 9175
15337 9175 16163 15750 13341 18890 16951 9824 17688 12012 -9685 -6393 -1356 -12225 -13719 -14520 -2231
15322b231J3832J1783j715j5770l801R729j975J565K763o371J115j023n350J8035
15308B0586J4036K638k386R29j0326M899j3674k5377J874M045O805n993N65R802
15294H423Rm082q522o639J4615p589j0374Q299o057N853J0696J655m564j6845
15280a5122K191R575K2553n890p557Q565J2704M4N473q587j1235j469m482p176
15266d13N926j2231j7905K804L151J6951m257k879j0094M082N461J9834k266j6172
15252h008K009Q197p670N825J5083N513L812o304K595q609o69N576j5677j995
15238c22M106Q779m126k717P719J86j135j4629p134q354L727J3622J0890k648
15224G964o534q27J1040j3004L504O726Q994j2429k271J7220J1709q379q784j1964
$$ plain form
15322 -2231 11601 23384 21669 5899 2098 11827 9852 11417 14180 7809 8924 7901 2551 20586
15308 20586 34622 37260 34874 35803 25477 30376 16702 -8675 -6801 -2756 4049 -1944 -1379 8423
15294 8423 8432 4350 -4172 -10811 3804 -3785 -14159 -5860 -11917 -6064 4632 6287 1723 -15122
15280 -15122 -12931 -3356 19197 13307 5750 14315 27019 27063 32536 23949 12714 11245 6763 -413
15266 -413 5513 -6718 -24623 -21819 -18668 -1717 -5974 -8853 -18947 -14865 -9404 10430 8164 -8008
15252 -8008 -5999 2198 -5472 353 15436 20949 24761 18457 21052 12443 11774 17350 1673 -322
15238 -322 3784 12563 8437 5720 13439 13625 12490 -2139 -9273 -17627 -13900 -278 10612 7964
15224 7964 1430 603 11643 -1361 2143 8869 17863 5434 3163 20383 32092 23713 14929 2965
15210B965p962j840L427P45L127R498R127J0160j4317j4287J107p10n86M171M473
15195I098q145R89K1539J1348O491r297r026n349m788m622r531M131J7869M166
15181B4873J49J294p412L999N0M005r255J4593Q822J783j3533j3640p829p273
15167F26J1499m035p999K368J432Q783J1783j3726m459K0877M997o259j8105j1579
15153c797J552p11J3165L37r660m68O164O811j990j2839j1572J4012J194J4751
15139A6949J1060n876K408j086p162p966n535R24j586L927N492j2921p17R407
15125G318K928L906Q037q728o741j211L022r86m62j032l27j3875L028n745l04
15110a1172J3337J1316Q946k387j2154m623j1354n697J0439p060L996R993P682
$$ plain form
15210 2965 -4997 -6837 -3410 -2665 462 9960 19087 29247 14930 643 1750 1040 454 4625 9098
15195 9098 953 1942 23481 34829 41320 32023 22997 17648 12860 8238 -1293 2838 20707 24873
15181 24873 25022 26316 18904 22903 22953 26958 17703 32296 41118 42901 29368 15728 7899 626
15167 626 12125 8090 91 2459 3891 12674 24457 10731 6272 27149 32146 25887 7782 -3797
15153 -3797 -2245 -2956 10209 10546 886 418 6582 13393 11403 -1436 -13008 1004 2198 16949
15139 16949 28009 22133 24541 23455 16293 8327 2792 3716 2130 6057 11549 -1372 -2089 7318
15125 7318 10246 14152 22189 13461 6720 5509 8531 7545 7083 6051 5724 -8151 -5123 -10868 -11172
15110 -11172 2165 13481 22427 20040 7886 3263 -8091 -13788 -3349 -10409 -6413 3580 11262
15097A1262J7825M329j0865j345q604P847J049j0854o787q105O182P181J604N89
15083A1308o785j7468L423N937p378R248J0111o411L675K89M217P626m811L772
15069A6753N915m617R505N822O114k193j3671j051p186r103N372K529r668M774
15055I295L440R063j0676L826L155R567M361j2333q453N148J6111J4536M833j6053
15041C5820k4820r248J5535J0386k485J285R04m423j264J1076M323M34n268j8999
15027A3256J093L399l522p88M767l75J561J1133N301o034q402j3274m95J1741
15013A9361k702o569p57J528o113J1638O316O621N294q647j2771K42L14J291R941
14998B4987j0648j1342J2798K444O59J069K884l497n562m503J3245o143q043J4689
$$ plain form
15097 11262 29087 33416 22551 21206 12602 20449 21498 10644 3857 -4248 1934 9115 10719 11308
15083 11308 4523 -12945 -9522 -3585 -10963 -1715 8396 1985 5660 5949 10166 17792 12981 16753
15069 16753 22668 18051 27556 33378 39492 37299 23628 22577 15391 6288 11660 14189 4521 9295
15055 9295 12735 21798 11122 14948 18103 27670 32031 19698 11245 16393 32504 47040 51873 35820
15041 35820 11000 1752 17287 27673 25188 26473 27377 22954 21690 32766 37089 37523 32255 13256
15027 13256 14349 17748 14226 13438 18205 17830 19391 30524 35825 29791 21389 8115 7620 19361
15013 19361 16659 10090 9333 10861 4748 16386 22702 29323 34617 25970 13199 13441 13755 15046 24987
14998 24987 14339 2997 15795 18239 18898 19967 22851 19354 13792 9289 22534 16391 8348 23037
14984B3037Q698J11o961j3014j1783M54p309O597J7988J954n621k0336N736o36
14970a085R448O888m603O587j550L559p644k222n115p236O079K777q295j25J4567
14955A2030J5274J2659j2594L740j2456j6888r944J4593K1884P426Q886j6567
14943B8043l124J7876K063k3241j6752j2827j852J025Q919J5435K1489J344P00
14930C9098K971J148j7677j0555J899J1833k838r725n091j653J3280j527l334
14917A7829j2631n155K437n892j213Q362J0301m354J0037L290k505k215O991P60
14903B6042n166q989n064O086K5830M642o61j9818j2351P255j22j793L85K431
14889A8707L492P643P876l132m859J139l470p554k307Q149Q9K323L112l030j0294
$$ plain form
14984 23037 31735 31846 24885 11871 88 542 -6767 -170 17818 19772 14151 -6185 -449 -1085
14970 -1085 8363 15251 10648 17235 15685 19244 11600 9378 4263 -2973 3106 5883 -2412 -2537 12030
14955 12030 27304 39963 27369 31109 18653 1765 -8179 6414 28298 35724 44610 28043
14943 28043 24919 42795 44858 21617 4865 -7962 -9814 -8789 130 15565 37054 38398 39098
14930 39098 42069 43217 25540 14985 16884 28717 25879 16154 11063 9410 22690 21163 17829
14917 17829 5198 43 2480 -3412 -4625 3737 14038 9684 19721 23011 20506 18291 25282 26042
14903 26042 20876 11887 6823 12909 38739 43381 42720 22902 10551 17806 17684 15891 16276 18707
14889 18707 22199 29842 37718 34586 29727 30866 27396 19842 17535 25684 25773 28096 31208 28178 17884
14874A7884L262J5598P156j2367j0294k535J9089L649k1000k733O278R938O04
14861C4529j7222o325N044J7224Q240j8626L90l823K603J8202K139j331M341j0388
14847C4997K322j2551J558k762J332K634K60K128o571j053p06N434k595j1262
14833A3165N723N211j0017r773R183Q000m338P257n168m405k708J2863N560O304
14819C6857r869M834L194p575j2660j356Q239m065J427k563J3246J0999q583j3268
14805A8857o08N254K295P062m849q20M55p048o289m334P341N017m682j731J1337
14790B7257k541K517J0708J100p69j2030J261j478l034L071N271j983l590M422
14776C0182q919L437J7396K0915K4628J0894N675J3543O118m522p834L368L1273
$$ plain form
14874 17884 21146 36744 43900 31533 21239 18704 37793 41442 20442 17709 23987 33925 34529
14861 34529 17307 10982 16026 33250 41490 22864 23254 19431 22034 40236 42375 41044 45385 34997
14847 34997 37319 24768 26326 23564 24896 27530 27790 29918 23347 22294 21588 27022 24427 13165
14833 13165 18888 24099 14082 4309 13492 21492 17154 24411 19243 14838 12130 24993 30553 36857
14819 36857 26988 31822 35016 27441 14781 13425 21664 17599 19026 16463 29709 40708 32125 18857
14805 18857 18249 23503 25798 32860 28011 27191 27646 20598 14309 9975 17316 22333 17651 15920 27257
14790 27257 24716 27233 37941 39041 38272 26242 27503 26025 22991 26062 31333 29350 25760 30182
14776 30182 21263 24700 42096 63011 87639 98533 104208 117751 123869 119347 111513 114881 146154
14763A46154K2517L22O775J9257L4413M0519L5923Q4528J19102J40857J83095
14752H33462K42696K49628K43500J97405J07050J756j00302j88837k51558k63683
14742A071117k44505k02935j51926j19145p8383l9293l4087k2640j5435r54Q852
14731A70666n259j5124j6040j0425j6485P353N915j2070r836j4203k3817j2624
14719D8051m025O44J540j18K098J3071M817P978k176M06k37L27j0269j2686o156
14704D3265J4027l02L396n649P540L117o271l763K208N165j5133m512J0354K571
14690E6013K236J5702J674p164j582n221p378k543n514m099k042K856P421J1686
14676F2045Q411J740R96j179l660j3785j037Q294r908q657P582K856r63n321J4936
$$ plain form
14763 146154 168671 168993 175768 195025 229438 269957 305880 390408 509510 650367 833462
14752 833462 1076158 1325786 1569286 1766691 1873741 1875497 1775195 1586358 1334800 1071117
14742 1071117 826612 623677 471751 352606 274223 234930 200843 178203 162768 161814 170666
14731 170666 165407 150283 134243 123818 107333 114686 120601 108531 98695 84492 60675 48051
14719 48051 44026 44670 46210 46092 48190 61261 66078 74056 71880 72286 72049 72376 62107 49421 43265
14704 43265 57292 56990 60386 54737 62277 65394 59123 55360 57568 62733 47600 43088 53442 56013
14690 56013 58249 73951 75625 68461 66879 61658 54280 51737 46223 42124 40082 42938 50359 62045
14676 62045 70456 72196 73192 72013 68353 54568 53531 61825 51917 43260 50842 53698 52735 47414 62350
14661F2350j538J170J8987j3314q689k103q863m719Q951R345J806K134n117K315
14647F2715J2266l269N876m835r193j080L737p936k0007o988j5629P532K16k357
14633B1048J2380O0N563M450J013q492k23R713J240j2329r851q741K03k74r675
14618F085j7605n852o510K3883J5986q111L095J0085J4118M353q268J1447N305
14605D8011O88k159N34l678L052N833k560o354J6912J9299R216J0796O519O240
14591A12349q36l460q253K003j131j1198j5320j1620m543J8752J4534J0178J351
14578A02806j2145k946M278J5778N433P730J0188J647r540q17p35M698J7566P597
14564A51538O275l077K2564K4159J4251K0705K3782K4937J8452K0674J5007O317
$$ plain form
14661 62350 60812 61982 80969 67655 58966 56863 48000 43281 52232 61577 63383 65517 60400 62715
14647 62715 74981 71712 77588 72753 63560 62480 66217 58281 38274 31286 15657 23189 23405 21048
14633 21048 33428 33488 39051 43501 44514 36022 35799 45512 46752 34423 24572 15831 16034 15760 6085
14618 6085 -11520 -17372 -23882 1 15987 7876 10971 21056 35174 39527 31259 42706 48011
14605 48011 48699 46540 47074 43396 46448 52281 49721 43367 60279 79578 88794 99590 106109 112349
14591 112349 111513 108053 99800 101803 100672 89474 74154 62534 57991 76743 91277 101455 102806
14578 102806 90661 87715 91993 107771 113204 120934 131122 132769 123229 122412 121677 126375 143941 151538
14564 151538 157813 154736 177300 201459 215710 236415 260197 285134 303586 324260 339267 345584
14552C45584Q883k1837l7328k8236l0671k4767k8869j7820r877o057q011j3562
14540A27432l343K99N489L235N474J276o30n802o14m937j4382R30o622N696Q536
14525A22037L118j1760L354M941l705J519J0352R828J3528J2400P481n421K397
14512A70069m088r099j4632m352j1650m601m004O027P150J0072R19j5467j2974
14499A13370J2615m68k160K623j1851l203O719O356j512K710M225l898p023m047
14485A14456J1659o44Q468L675k684j5414P364J0304O665m596r42M429J2650J1232
14471A66622J516J4498J5696L0282K1163K5109M5466L8702J3986K0161J7278j4039
14459C96440k8620l4468l3799n1362m9632l4503k2569j7708N113K2586J4375K6348
$$ plain form
14552 345584 354467 332630 295302 267066 236395 211628 182759 164939 155062 149005 140994 127432
14540 127432 124089 124388 129877 133112 138586 139862 139232 133430 132816 127879 113497 114427 107805 113501 122037
14525 122037 125155 113395 116749 121690 117985 119504 129856 139684 153212 165612 173093 167672 170069
14512 170069 165981 156882 142250 137898 126248 121647 117643 123670 130820 140892 141811 126344 113370
14499 113370 125985 125517 123357 125980 114129 110926 117645 124001 122489 125199 129424 125526 118503 114456
14485 114456 126115 125471 133939 137614 134930 119516 126880 137184 143849 139253 138311 142740 155390 166622
14471 166622 168138 182636 198332 228614 249777 274886 320352 359054 373040 393201 410479 396440
14459 396440 367820 333352 299553 248191 198559 164056 141487 123779 128892 151478 165853 192201
14447A92201J9583j678J6522J5038J0638p935M915L889k618M427J2909K5409J5686
14434C08986J9273K8228O8425O1058N8718O8504P6621P5365N7297O0252K6553
14423I09280j731k3709m0068p7505p7132p5065o3749n8547m8815k5798j9929j2273
14411C84959j4540j0757R994j107q350l846m763l994P163N275J3591j585K2630
14398C94670K3527L476n214o284K0007K9256J4429N847N830M068j1713m964q148
14385D64787j1583q334J3941K0461M184K684L5497K6393j2422p477J4839K3112
14373E66082O459K489J8530L2911K3934J5697K4850L7778L9093M6414L3599J8786
14361H66622J1324J2551J9173L2120J4375q124J2490K8261M4935L8965L1295M2157
$$ plain form
14447 192201 211784 210106 226628 241666 252304 244369 249284 253173 250555 254982 267891 293300 308986
14434 308986 328259 356487 424912 485970 544688 613192 689813 765178 822475 882727 909280
14423 909280 907549 883840 843772 766267 689135 614070 550321 491774 442959 417161 397232 384959
14411 384959 370419 359662 369656 368549 360199 356353 351590 347596 354759 360034 373625 372040 394670
14398 394670 418197 421673 416459 410175 430182 459438 473867 479714 485544 489612 477899 472935 464787
14385 464787 453204 444870 458811 479272 483456 486140 521637 548030 535608 528131 542970 566082
14373 566082 572541 575030 593560 626471 650405 666102 690952 728730 767823 814237 847836 866622
14361 866622 877946 890497 909670 941790 956165 948041 960531 988792 1033727 1072692 1103987 1146144
14349A146144N0198N6893N7663P1317P2674O3048N8698P0217R0622R7826J12507
14338A947807J26450J32639J46461J56646J56433J78430J82233K08688K28624
14329C464411K14513K40754K94693L39779M17380N04485O14970P70021R55314
14320G816320J156887J375443J559034J702200J779671J772200J758931J829204
14312B0749890K101376K739442L968101O074976R377554J4167950K0553740K8201901
14304A07934930L6550566M4132785M8060529M6324647L7760031K2375000K882664
14297C46021152j7500001l5234712m6400037m9753062m6728520l9128183k9340638
14290H1935999k0377177j3597838q942486n973454m142140k989755k290782j957964
$$ plain form
14349 1146144 1196342 1253235 1310898 1382215 1454889 1517937 1576635 1646852 1737474 1835300 1947807
14338 1947807 2074257 2206896 2353357 2510003 2666436 2844866 3027099 3235787 3464411
14329 3464411 3678924 3919678 4214371 4554150 4971530 5476015 6090985 6861006 7816320
14320 7816320 8973207 10348650 11907684 13609884 15389555 17161755 18920686 20749890
14312 20749890 22851266 25590708 29558809 35633785 45011339 59179289 79733029 107934930
14304 107934930 144485496 188618281 236678810 283003457 320763488 343138488 346021152
14297 346021152 328521151 293286439 246886402 197133340 150404820 111276637 81935999
14290 81935999 61558822 47960984 39018498 33045044 28902904 25913149 23622367 21664403
14282B1664403j862635j887083j926668j907003j806067j636288j382031j105729
14274H150899q94215p48479o13629n13433m31632l83668l48931l06376k70305
14265C640231k50400k22676j89246j60557j36602j16482j18465j25836r6824q9871
14255B133272o9291q2010q4847q6241p3406q1609p9894o6717m0191n0238n0712
14244A368116m9482m8328m0791o3771n3416n1339n0381m8066m0514m4079k4770
14233H53179l866r689k0333o82m997k4128j2204k2343k8221j0321r157j5333l4726
14220F57179j9956k583p483j3336q459j2719k8310j1746j2930l0022k3151k4881
14208D61603k2681o128j3j6204m472p709j1495o713M86j7059j8006j3710k1197
$$ plain form
14282 21664403 19801768 17914685 15988017 14081014 12274947 10638659 9256628 8150899
14274 8150899 7256684 6508205 5894576 5381143 4949511 4565843 4216912 3910536 3640231
14265 3640231 3389831 3167155 2977909 2817352 2680750 2564268 2445803 2319967 2223143 2133272
14255 2133272 2063981 1981971 1897124 1810883 1737477 1655868 1575974 1509257 1469066 1418828 1368116
14244 1368116 1318634 1270306 1229515 1165744 1112328 1060989 1010608 962542 922028 877949 853179
14233 853179 849313 839624 819291 818609 813612 789484 777280 754937 726716 716395 707238 691905 657179
14220 657179 637223 634640 627157 613821 605362 592643 564333 552587 539657 509635 486484 461603
14208 461603 438922 432794 432781 416577 412105 404396 392901 386188 386674 369615 351609 337899 316702
14195C16702k682o674l353J0939q162K329P087J376j0245p729p494o950n888p047
14181B72209n587r533L640J2468J0184N865o035j0674l5933m0393k1956j8178
14169A56077j5015p241L197L4533J7624j727j3140J0239M763L813J2847k606j828
14156B01536J787j1876j6132j4078J49M027J2605O551J4804L7183K3563L773R086
14143B72978P363j3729r769p653k4579k6503j5216N152L139J532k056j8676l627
14130A68356k387k026J6927p416j2456j7226J722O080J479M98m226j2662j1186
14117A25477P455k138n631R778o438n100Q123K929J0232p03m807j2121j483K290
14103A27863j621Q085L664j8078p140k231q302M75N009j051n343j0029j7883K190
$$ plain form
14195 316702 314020 307346 303993 314932 306770 309099 316186 317562 307317 299588 292094 285144 279256 272209
14181 272209 266622 257089 260729 273197 283381 289246 283211 272537 236604 196211 174255 156077
14169 156077 141062 133821 137018 171551 189175 187448 174308 184547 189310 193123 205970 203364 201536
14156 201536 203323 191447 175315 161237 161386 165413 178018 184569 199373 236556 260119 263892 272978
14143 272978 280341 266612 256843 249190 224611 198108 182892 188044 191183 192715 190659 171983 168356
14130 168356 165969 163943 180870 173454 160998 143772 145494 151574 153053 153551 149325 136663 125477
14117 125477 132932 130794 125163 134941 128503 123403 131526 134455 144687 143984 139177 127056 125573 127863
14103 127863 126242 134327 137991 119913 112773 110542 102240 102715 107724 106673 101330 91301 73418 75608
14089G5608K977j7111p873k2808m332o77J0704Q241k093q767k544P435J4894J8807
14075G2461J1556Q392P457K259q234p184o924J789k1487k2880k689q007P424J5619
14061D9552m453k82J6747N063o359r150J091P047J7164K3864j1907K6J4646M921
14047A07970p67r294j1700P253j465L235r43j5498j5859j6989j3599k878l961
14034B5505j772J7632K1877K087P49L790j2364j2100o979N911j281P668J0024
14021F0747r512O06k492n043k753j0945j248J0492O997k608k285j755J0557Q379
14007E9137L491O046j7104k6462M963J4707J385J464N085P340M128j0151R784
13994F3813J0258P239J3780O334p806o426k256p22J617M603n978Q824O216J2375
$$ plain form
14089 75608 78585 61474 53601 30793 26461 25784 36488 44729 42636 33869 31325 38760 53654 72461
14075 72461 84017 92409 99866 102125 93891 86707 79783 81572 60085 37205 34516 26509 33933 49552
14061 49552 45099 44817 61564 66627 60268 51118 52209 59256 76420 100284 88377 88403 103049 107970
14047 107970 107203 97909 86209 93462 91997 95232 94289 78791 62932 45943 32344 29466 25505
14034 25505 23733 41365 63242 65329 66078 69868 57504 45404 38425 44336 43055 50723 60747
14021 60747 51235 51841 49349 44306 41553 30608 29360 39852 46849 44241 41956 40201 50758 59137
14007 59137 62628 68674 51570 25108 30071 44778 46163 47627 52712 60052 64180 54029 63813
13994 63813 74071 81310 95090 101424 93618 87192 84936 84214 85831 90434 84456 93280 99496 111871
13980A11871p647j2619L637q090J396J7361k0523o824P941j0088k5408j187k260
13967D7560J612q533N471J62j2567K881J1389q237Q589l260k897J1240m920j8172
13953C0318Q294J2618n637o048j3518O111m543J036J8558o867j7475j568J3130
13940C4409o880k440O859N51Q01k68m190p700L293K2641K116k0323m139QN82J077
13924B6397j1766J986J3686J929j564R395M436q007j0924o241J0149M759n570
13911B8665O140l252o606m269J484L122j530Q273J0469J544o993K547N085n434
13897C9245p138k946L397K827m921k74N839J232Q446J0437Q41O978k815j029p394
13882E2725p437J2315j6923k2626J603P002n774J8333J8411J332p518j9020n096
$$ plain form
13980 111871 104224 91605 95242 87152 88548 105909 85386 78562 86503 76415 51007 49820 47560
13967 47560 49172 40639 46110 46272 33705 36586 47975 39738 48327 45067 42170 53410 48490 30318
13953 30318 38612 51230 45593 39545 26027 32138 27595 28631 47189 40322 22847 21279 34409
13940 34409 27529 25089 31948 32499 33300 33032 28842 21142 24435 47076 49192 28869 24730 24738 25320 26397
13924 26397 14631 16617 30303 32232 30668 40063 44499 36492 25568 19327 29476 34235 28665
13911 28665 34805 31553 24947 20678 22162 25284 23754 32027 42496 44040 37047 39594 44679 39245
13897 39245 32107 29161 32558 35385 30464 30190 36029 37261 45707 56144 56985 63963 61148 60119 52725
13882 52725 45288 57603 40680 18054 19657 26659 20885 39218 57629 58961 51443 32423 27327
13869B7327r306J6512P615R157j145M296J2994K3539J2736O634M246O291J2479
13856A33375K741J9728K6335M6297P0290J05303J48379J55082K08851K68306K64734
13845A449421K27501J51336O2752n7654j55824k46015k66305k50194k20923j74651
13835E19444j22656p8951n4447m4460m5168k7385k1900k1113p724J634k778R53
13823I5449n220j4136r164n89O363j538r568r470R534M214L87N237p436q146L74
13808E6291p365j241k693J4L295l767r528p245p957K798j829o595m963K874K713
13793A4802k450J2182J3298l766n96O9j864P940r488o444o204P968R879k936l155
13778B9235Q526r537q959L981J1702M812j5429k0364j24P506l790Q778lM591O521
$$ plain form
13869 27327 18021 34533 42148 51305 50160 54456 67450 90989 103725 110359 114605 120896 133375
13856 133375 136116 155844 182179 228476 298766 404069 552448 707530 916381 1184687 1449421
13845 1449421 1676922 1828258 1891010 1833356 1677532 1431517 1165212 915018 694095 519444
13835 519444 396788 317837 263390 218930 173762 146377 124477 103364 95640 97274 94496 95449
13823 95449 90229 76093 66929 66340 72703 71165 61597 52127 61661 65875 66262 71499 64063 55917 56291
13808 56291 48926 47685 44992 45006 48301 44534 35006 27761 19804 22602 20773 14178 9215 12089 14802
13793 14802 12352 24534 37832 34066 33470 33539 31675 39615 30127 23683 17479 25447 35326 32390 29235
13778 29235 37761 28224 19265 23246 34948 39760 24331 3967 3843 11349 7559 16337 16334 20925 27446
13763B7446J9628k897k775r991m093J853j748o805p36K0246Q765j0264r781j2216
13749A6632L053o671O894m882p973j2029k193J387Q127r977j3832M936J7375P478
13735H325J559n051N737J1320l081J6666j828q190j9011l928j1886q836M096J2334
13721a774K8k080R286J2832r72Q63Q601n708l006j6240q634Q601L21Q261K2o923
13705C478o602o804P545k46j2166O120R372O161J984j123J395q39n253j3128K484
13690g622N883J6659m277k854M275j5024n569K0316j3317O816m058p507J256N475
13676D52j314K199k157K014r676R449k080r903j619J4922J8209J1784P992J188
13662D1460o726j8791j273j438N380L535r218q169P339j69j363j231n704j802
$$ plain form
13763 27446 47074 44177 41402 31411 27318 29171 27423 20618 19882 40128 48893 38629 28848 16632
13749 16632 19685 13014 19908 15026 7053 -4976 -7169 -5782 2345 -7632 -21464 -16528 847 8325
13735 8325 9884 4833 10570 21890 18809 35475 33647 25457 6446 2518 -9368 -18204 -14108 -1774
13721 -1774 -1746 -3826 5460 18292 17320 18183 26784 21076 18070 1830 -6804 1797 2118 10379 10401 3478
13705 3478 -3124 -9928 -2383 -2629 -14795 -8675 697 6858 8842 7719 9114 8275 3022 -10106 -7622
13690 -7622 -1739 14920 10643 7789 12064 -2960 -8529 11787 -1530 5286 1228 -6279 -5023 452
13676 452 -862 1337 -820 1194 -8482 967 -1113 -11016 -12635 2287 20496 32280 40272 41460
13662 41460 34734 15943 14670 13232 18612 22147 12929 4760 12099 11930 10567 9336 3632 1830
13648A830o356j887J2099J3613l203k227K191K226j1981j0327Q60J3175J2155
13635B2168J084r560M28R06K370L213n108j6482n506o945N42J2488J758N102Q944
13620A5402J059J56N536N100n360o012j423p936O139J893J119K376P887R61j6663
13605A0234m515R059K1614k956j5861j0697j574L643J5021J580O350L393J140
13592C6431j5430j2159J278J948j5389n810n37M50J566j848L265J4952J0922n512
13578A4127K755M431j317j317J961K849P12j4964n951Q24M408j360n951n522o276
13563a0591L85m412k269O132R418n97O652Q809m277j1107J5242J0760q34j511
13549B1800J825o313m589r967j941J2622n821k2923J0782J4848o484j784J674
$$ plain form
13648 1830 -4526 -6413 5686 19299 16096 13869 16060 18286 6305 -4022 -3162 10013 22168
13635 22168 23252 13692 14120 15026 17396 20609 15501 -981 -6487 -13432 -12890 -402 1356 6458 15402
13620 15402 16461 16617 22153 27253 21893 15881 14458 6522 12661 14554 15673 18049 25936 26897 10234
13605 10234 5719 14778 36392 33436 17575 6878 5304 8947 23968 25548 31898 35291 36431
13592 36431 21001 8842 10120 12068 -3321 -9131 -9668 -9218 -7652 -9500 -6235 8717 19639 14127
13578 14127 16882 21313 19996 18679 20640 23489 24201 9237 3286 4110 8518 7158 1207 -4315 -10591
13563 -10591 -10206 -14618 -16887 -10755 -1337 -1934 4718 13527 9250 -1857 13385 24145 23311 21800
13549 21800 23625 17312 12723 2756 815 13437 7616 -15307 -4525 10323 3839 2055 3729
13536C729n418J5139M475j55J561m737j0726m788K947j985r093N648K883P475
13522F955n79Q791N292j1279p549J68O28M09R049N675Q161O40k294p426J431L811
13506B1883n212P011j859Q741J0549K9455L5679K8624M3881M1308L3872L5779
13494B89711J8457k87k4879m8008n0435l6310l0923m7477m0070j9598L577K1977
13482C5735M558J492n028K049m157o739j2620O235Q580m916m402n152p474n988
13468B173q407n885R073J9609N415p289O315K81j7169r965N941M962P69l845P25
13453B703J6627R049j3584j4526P59o585J608P2J199P132O809J2344P285M238
13439C5130m281j0330l279J211r065n11K523J1821N721k934r105L871l794o377
$$ plain form
13536 3729 -1689 13450 17925 17770 19331 14594 3868 -920 2027 42 -9051 -3403 -520 6955
13522 6955 6376 15167 20459 9180 1631 1799 2427 2836 11885 17560 25721 26361 24067 16641 18072 21883
13506 21883 16671 23682 21823 30564 41113 70568 106247 134871 178752 220060 253932 289711
13494 289711 308168 307881 283002 234994 184559 148249 117326 69849 29779 10181 13758 35735
13482 35735 40293 41785 36757 38806 34649 27910 15290 21525 30105 25189 20787 15635 8161 2173
13468 2173 -6234 -12119 -3046 16563 21978 14689 21004 21285 4116 -5849 92 5054 5823 1978 2703
13453 2703 19330 28379 14795 269 1028 -5557 -3949 -3877 -2678 4454 11263 23607 30892 35130
13439 35130 30849 20519 17240 18451 9386 8875 11398 23219 28940 26006 16901 20772 16978 10601
13425A0601l715p338m419J839r95J5572M5J2025l296m245j5735r332Q350J9953
13411A9310J1313j1686K372n187p549n792Q435K5603j7l702L372q66q963j9291
13397G352j2050j611R058L046o488k211M005j0535q899K4169O0p177r179P680
13383b780R57K839m74l416n794j140J3207R455J6544o666n340P201j0661j1774
13369B158r191l298o640r232J6167L471q891N269R632Q760r751K00p322J743j380
13354h305Q87M795J5180M32L367m911r214j5502j775Q553O299k08k375k33K604
13339d06N86J957q320n065R379O992N495n812j3360J0392K156k32j097J6018M445
13324B3128j3067j1878K583J1378j0312p843J4383J0100p308p349O626n394L223
$$ plain form
13425 10601 6886 -452 -4871 -3032 -4027 11545 11590 23615 20319 16074 339 -8993 -643 19310
13411 19310 30623 18937 21309 16122 8573 2781 11216 36819 36802 33100 36472 35606 26643 7352
13397 7352 -4698 -6309 2749 5795 -693 -2904 1101 -9434 -18333 5836 5896 -1281 -10460 -2780
13383 -2780 -1823 1016 542 -2874 -8668 -9808 3399 12854 29398 22732 17392 24593 13932 2158
13369 2158 -7033 -10331 -16971 -26203 -10036 -6565 -15456 -10187 -555 8205 -1546 -1346 -8668 -6925 -8305
13354 -8305 -7418 -2623 12557 12989 16356 11445 2231 -13271 -15046 -6493 -194 -402 -2777 -3010 -406
13339 -406 180 2137 -6183 -11248 -1869 5123 10618 4806 -8554 1838 3994 3762 2665 18683 23128
13324 23128 10061 -1817 766 12144 1832 -6011 8372 18472 11164 3815 10441 5047 8270
13311H270R491K422j0265M468N472q339j2741j6451R664J3978k21r042k706o956
13297a2956L737K258P522L365j0409J473K576j6349L801q411O716J417l334r31
13283a9525J6365J4371K894j887m598j4879j2223o875m589q97L58P386J3567N336
13269e196n667j352q965l900Q987J0339J0727K925k331n325n984O810L874L557
13255H499j0122Q310M635k515l820q17M391P18j2566O146Q003J3876j1989r723
13241C026N532L612r722p689k241O676O078M412l800j5268n963K160P372P983
13227B168J0245o404N68O810P95j8192J364p014p835O264R847L473k265N2R615
13212I491m289J043M847Q678j725q476J0451K382M727k118n26l2087j2201K0295
$$ plain form
13311 8270 17761 20183 9918 14386 19858 11519 -1222 -17673 -8009 5969 5748 -3294 -6000 -12956
13297 -12956 -9219 -6961 561 3926 -6483 -5010 -2434 -18783 -14982 -23393 -16677 -15260 -18594 -19525
13283 -19525 -3160 11211 14105 12218 7620 -7259 -19482 -26357 -30946 -31843 -31485 -24099 -10532 -5196
13269 -5196 -10863 -12215 -21180 -25080 -16093 -5754 4973 7898 5567 242 -5742 1068 4942 8499
13255 8499 -1623 6687 11322 8807 4987 4170 8561 9279 -3287 2859 10862 24738 12749 3026
13241 3026 8558 12170 2448 -5241 -7482 -806 5272 9684 5884 -9384 -15347 -13187 -5815 2168
13227 2168 12413 6009 6577 13387 14182 -4010 -2646 -9660 -17495 -11231 -1384 2089 -176 -124 9491
13212 9491 5202 6245 11092 19770 18045 9569 20020 22402 27129 25011 24485 -7602 -19803 492
13198D92J8982n51J196j639k777j0444l585j1647L102N527n54P666p420k69M740
13183B819J0371k509j1744l872J1313l241L797K889R317J478n756j0326j901J7
13169B652l080K967J4394j2803K52J3421N109j046m040p095r542m871j467N358
13155B09Q982O753P34j0635p296j0417N013l387J1662M585l45N861O041j6696
13141A064j479P026Q161L835j177m659q131k127P286L504R60m50p552k021l243
13126I97J062P117m332k2593j147O406L557J2867l107M281J6121j0529r672L13
13112A341P505n933O46N944L843q983j3840J933R659j1483j8848Q573J7113K271
13098b59o321M328O299O524q28k743j1749q406m95k310K005M314Q077Q660K419
$$ plain form
13198 492 19474 18923 20119 18480 15703 5259 1674 -9973 -6871 -1344 -1898 5768 -1652 -1921 2819
13183 2819 13190 10681 -1063 -4935 6378 3137 6934 9823 19140 20618 14862 4536 2635 2652
13169 2652 -428 2539 16933 4130 4382 17803 22912 21866 17826 10731 1189 -3682 -5149 209
13155 209 9191 15944 16678 6043 -1253 -11670 -6657 -10044 1618 6203 5858 11719 17760 1064
13141 1064 -415 6611 14772 18607 17430 12771 4640 2513 9799 13303 14263 13813 6261 4240 997
13126 997 2059 9176 4844 -17749 -18896 -12490 -8933 3934 827 5108 21229 10700 1028 1341
13112 1341 8846 2913 3559 9503 13346 4363 -9477 -7544 2115 -9368 -28216 -19643 -2530 -259
13098 -259 -6580 -2252 4047 10571 9743 7000 -4749 -13155 -13650 -15960 -13955 -9641 -1564 7096 9515
13083I515j281J3937j110m472j6244J315J7382j0956o945R459R083j0744r30P233
13069A5242n607M793L188M275J2995j2087o186n203Q232J416j9176P66M793m237
13055C204j428M568R596n749l911o977q724J0107R175R66J590k128q861L529k879
13040B078o23j081r475K863J3846J706p29J0846P157k790R02m652j7603o663M406
13025A88J662Q564n6M055M609j5191r780o881P332J4901J702L793Q064m135j0123
13010H704j8674P489Q349P040J49n452j1188n204P189R474m382R323l906m025
12996D886N479n519J4479R622r324k7623j472J2361l772j6988k79M230J2500M733
12982C313J744k725p334L13j033N707J1903j774o782m167R822l260J276q450J216
$$ plain form
13083 9515 8234 22171 21061 16589 345 1660 19042 8086 1141 10600 19683 8939 8009 15242
13069 15242 9635 14428 17616 21891 34886 22799 16613 11410 19642 21058 1882 2648 7441 3204
13055 3204 1776 6344 15940 10191 6280 -697 -9421 686 9861 10827 12417 10289 1428 4957 2078
13040 2078 1455 374 -9101 -6238 7608 9314 8585 19431 26588 23798 24700 20048 2445 -4218 188
13025 188 1850 10414 10358 14413 19022 3831 -5949 -12830 -5498 9403 11105 14898 22962 18827 8704
13010 8704 -9970 -2481 5868 12908 13057 7605 -3583 -8787 -1598 7876 3494 12817 8911 4886
12996 4886 10365 4846 19325 28947 19623 -8000 -9472 2889 -883 -17871 -18150 -13920 -1420 3313
12982 3313 5057 2332 -5002 -4689 -5722 -15 11888 10114 3332 -835 8987 5727 7003 -1447 -231
12967b31O221j1044L441j514j308J1635O591P303j1359m289m251J9213J5082j6017
12953A9473j9890j6159k025k630N002P405J3608Q787j053L127q834J040J058k467
12939F442o778j712J377O253N813m944j349p733m363j022k386n901L952k654J3848
12924a157L686l306l836q57K014Q57P058J0290Q150M108o688K940J385L268j7180
12909A0732j1105L444l106o33m656N418M389j068k935n706o885J9025K854Q07
12895A0575j038m09r057j4906P04L450K7975j447m501r236j6096k541Q453J1325
12881C251p837j220L637j935Q460m416k0901m679J9848K1178K050J9620r46p137
12867B8973K919n262k1219j5321J559J089J2796k242j2725L999R355l710j5693
$$ plain form
12967 -231 5990 -5054 -1613 -3127 -4435 7200 13791 21094 9735 5446 1195 20408 35490 19473
12953 19473 -417 -16576 -18601 -21231 -16229 -8824 4784 13571 12518 15645 6811 7851 8909 6442
12939 6442 -336 -2048 -671 5582 11395 6451 5102 -2631 -6994 -8016 -10402 -16303 -12351 -15005 -1157
12924 -1157 2529 -777 -4613 -5470 -3456 -2599 4459 14749 22899 27007 20319 23259 24644 27912 10732
12909 10732 -373 3071 -35 -668 -5324 94 4483 3415 480 -5226 -12111 6914 9768 10575
12895 10575 9537 9128 71 -14835 -14131 -10681 17294 15847 11346 2110 -13986 -16527 -8074 3251
12881 3251 -4586 -5806 -2169 -4104 4356 -60 -20961 -25640 -5792 15386 17436 37056 36110 28973
12867 28973 31892 26630 5411 -9910 -8351 -7262 5534 3292 -9433 -5434 3921 211 -15482
12854a5482O916J0258L061O575k349m164J556M695J0068Q150n404j080n73k2128
12840I9j0743R464Q368J2243J125p27l035L03o482n839k057P741L237m500j637
12825G560m513j023r148q080n042J7083J7438o477r52L060n568K890o209q07L086
12810C298j1222O485L933l578L508Q65Q56j0143M570L309j5024R61J861N784J4191
12795I654J0694l002j3256j4428J573K320o603m251J1001Q428N430m977n077O290
12781C796j007M368R835J3167q489q555p385m324j1843p07J371J1372J0690M148
12767A6437J1197j1375n303K176j1006n777J222L880K784Q883m233q877r55O32
12753c15K79k215K583p060M520O851N608j2259n804J877J9235J499K140k990l754
$$ plain form
12854 -15482 -8566 1692 4753 11328 8979 4815 6371 11066 21134 29284 23880 22800 22227 99
12840 99 -10644 -1180 7188 19431 20556 19829 16794 17097 10615 4776 2719 10460 13697 9197 7560
12825 7560 3047 2024 -7124 -15204 -20246 -3163 14275 7798 6846 9906 4338 7228 1019 212 3298
12810 3298 -7924 -1439 2494 -1084 2424 3289 4145 -5998 -1428 1881 -13143 -12182 -10321 -4537 9654
12795 9654 20348 17346 4090 -10338 -8765 -6445 -13048 -17299 -6298 2130 7560 2583 -2494 3796
12781 3796 2789 7157 16992 30159 21670 13115 5730 1406 -10437 -11144 -9773 1599 12289 16437
12767 16437 27634 16259 10956 13132 2126 -3651 -2429 1451 4235 13118 8885 8 -947 -315
12753 -315 -36 -2251 332 -6728 -2208 4643 10251 -2008 -7812 -5935 13300 14799 16939 13949 10195
12738A0195j171J120j1065m83O07j3112l781M138J724N026J1355R264p159K145
12724H803M930k4713J931J4422J2198n503J938p940n742P466j0779J597o29k287
12710d308k190n126r210o770J4331O644p967r544L888J1041m409K733J0035l056
12696c908r483q901R997R241K310j547l669o873J9547k723n913m558M796N659
12682C975K729P010N551l994j16q183J216M479K884j1462j3911j2948R824K0379
12668G433Q197K777j812n854M565O758o926l228J096m747l887M26l489p30R993
12653A0572l712O999J5789R670L116q660R291K1564K8925N6838Q6407R8485R0855
12640D26139J08053J12907k2686j45393j26817j19970p7985n4502l1921j1304
$$ plain form
12738 10195 9024 10144 -921 -1404 -797 -13909 -17690 -13552 -11828 -6802 4553 13817 6658 8803
12724 8803 13733 -10980 -9049 5373 17571 12068 14006 6066 324 7790 -2989 -1392 -2021 -4308
12710 -4308 -6498 -11624 -20834 -27604 -13273 -6629 -14596 -24140 -20252 -9211 -13620 -10887 -852 -3908
12696 -3908 -13391 -22292 -12295 -3054 -744 -2291 -5960 -12833 6714 3991 -1922 -6480 -1684 3975
12682 3975 6704 13714 19265 15271 15155 6972 8188 12667 15551 4089 -9822 -22770 -12946 7433
12668 7433 15630 18407 16595 10741 15306 22064 15138 11910 13006 8259 4372 4798 1309 579 10572
12653 10572 6860 13859 29648 39318 42434 33774 43065 64629 93554 150392 236799 335284 426139
12640 426139 534192 647099 624413 479020 352203 232233 154248 99746 67825 56521
12630E6521q960k902j3437k520n724m066N716K310k2952j1066P288o233O83J0240
12616D898K331K4933L534j7567j500p581j8272p817J1267Q221O735J802o264L376
12602H096J528O571j8723n756J1019J972P551K716m580J0105j01r064j4063j962
12588d691R703j118K035k070j5788j0575L693J6421J404j1120Q194Q922o89N82
12574D903J0422p170Q200j1304m413J5174j7696j436O129J172J1798J6734j3898
12561A8615j1431q410r482L053J9042n883O995P628r242j3462o938P405L272n249
12547d087k179N506P26o687j500J1708J292J28n322q06j1553J3068M854j722M238
12532G664J9137o107k0386j4627J4059N620j5869r761O870J2329M611N777J0851
$$ plain form
12630 56521 47561 44659 31222 28702 22978 18912 24628 26938 3986 -7080 208 -6025 -5342 4898
12616 4898 7229 32162 35696 18129 16629 9048 -9224 -17041 -5774 2447 9182 10984 4720 8096
12602 8096 9624 16195 -2528 -8284 2735 4707 12258 14974 10394 20499 20398 11334 -2729 -4691
12588 -4691 5012 3894 5929 3859 -11929 -22504 -18811 -2390 -986 -12106 -3912 5010 4321 4903
12574 4903 15325 8155 16355 5051 638 15812 -1884 -3320 2809 3981 15779 32513 18615
12561 18615 7184 -1226 -10708 -7655 11387 5504 12499 20127 10885 -2577 -9515 -2110 1162 -4087
12547 -4087 -6266 -760 -34 -6721 -8221 3487 4779 4907 -415 -1221 -12774 294 5148 3426 7664
12532 7664 26801 20694 308 -14319 -260 5360 -10509 -20270 -13400 -1071 3540 9317 20168
12519B0168r3n839n282j2516k999P625J2635k303j3260n650O84j65O138r346j5066
12504b5269p97J3737J058l406J3672J2728m376j0154J2753j794R1j911M606J1599
12490B2537m979j7608j3529K914J0727L723o101k1J650L580O849J2560q069j2476
12476A757J2131j611r177L778O212M746R390o600q327k520j0732R841J4254L856
12462B6998r022j8139j1092K103k027N661J073j3498J1880o699n609l643l43l867
12448b6224J665R767O642K2771J4314j9186k560n30O17r166k347m415N572J3440
12434A0360p98k538o095O308J2140j2487n281r27n224n600Q650Q46J3759M676
12420A7789R828o732m993J026m051J310l943L147j046j3602m119o303O914J746
$$ plain form
12519 20168 20075 14236 8954 -3562 -6561 1064 13699 11396 -1864 -7514 -6830 -6995 -857 -10203 -25269
12504 -25269 -26066 -12329 -11271 -14677 -1005 11723 7347 -2807 9946 8152 8243 6332 10938 22537
12490 22537 17558 -50 -13579 -10665 62 3785 -2316 -2337 -687 2893 9742 22302 14233 1757
12476 1757 13888 12277 3100 6878 13090 17836 27226 20626 12299 9779 -953 8888 23142 26998
12462 26998 17976 -163 -11255 -9152 -11179 -5518 -4445 -17943 -6063 -12762 -18371 -22014 -22357 -26224
12448 -26224 -24559 -14792 -8150 14621 28935 9749 7189 6659 7276 -1890 -4237 -8652 -3080 10360
12434 10360 9562 7024 929 7237 19377 6890 1609 682 -4542 -10142 -1492 -646 13113 17789
12420 17789 27617 20885 15892 16918 12867 14177 10234 13381 12335 -1267 -5386 -11689 -4775 -3029
12406c029p74K096O428J3812R26j0005j1433l396J4906N749r758m245K157K954
12392F388m279p441P606L784m706j1746j868r85m166J1202J950J5029R067j7498
12378B337n347n069n401M631o054k636j083r38Q781J6817K023m578J0761q242
12364F002p413j984M512q203m925r57M03R327K660o365J0264J427j9499j3837
12350b8588j349L905K2220J9220m037j5810j2471K787O49n09M756M157r025j1214
12336b5309n39o058P153K153J0269J0190K355P579j285J5866j4052k947O461l723
12322H113j2781J4495K2365k783j5831j8804j0662n424K947J9014J0998J07K761
12309A4515j1623j0967N798L036L196J7091Q811p409j015j3135M23m783o124n694
$$ plain form
12406 -3029 -3803 -1707 4721 18533 19459 9454 -1979 -5375 9531 15280 5522 1277 3434 6388
12392 6388 2109 -5332 2274 6058 1352 -10394 -12262 -13247 -17413 -6211 -4261 10768 19835 2337
12378 2337 -3010 -8079 -13480 -8849 -14903 -17539 -18622 -19560 -10779 6038 8061 3483 14244 6002
12364 6002 -1411 -3395 1117 -7086 -12011 -12968 -12565 -3238 -578 -6943 3321 4748 -14751 -28588
12350 -28588 -29937 -26032 -3812 15408 11371 -4439 -16910 -14123 -13474 -13983 -9227 -5070 -14095 -25309
12336 -25309 -25848 -31906 -24753 -22600 -12331 -2141 214 7793 6508 22374 8322 5375 11836 8113
12322 8113 -4668 9827 32192 29409 13578 -5226 -15888 -21312 -18365 649 11647 11754 14515
12309 14515 2892 -8075 -2277 759 3955 21046 29857 22448 21433 8298 8721 3938 -2186 -7880
12295g880l241O626j0774j8776J1500J7564J0711Q315j4095k0053l42O570J54
12282a3721m001N05J1844L405J315j1555P29O85o835J3794J2029j378o191N733
12268F358R243k786K14j1570q759R355l340n697J1506k955J0320O330q154j5963
12254e898o342m095M055K898k890Q532K481q346O361J0951K0643o926L324j4510
12240A0238j8925K254J048o321j2497n160P117Q827J6888L616J791n558n53p293
12226d528n765N70L697q883o180P867P004R329m369j1528l322O922J1013R219
12212A1046J52l00j097O631J3454j1730j2423O778M059j7489k830J8165l845l943
12198F628m819o138n645J3235K215r657q730N28J1052l595j197j4291o860Q589
$$ plain form
12295 -7880 -11121 -4495 -15269 -34045 -22545 -4981 5730 14045 -50 -20103 -20445 -13875 -13721
12282 -13721 -17722 -17217 -5373 -1968 -653 -12208 -11479 -10794 -17629 -3835 8194 6816 625 6358
12268 6358 15601 12815 13029 1459 -7300 2055 -1285 -6982 4524 1569 11889 18219 10065 -5898
12254 -5898 -12240 -16335 -12280 -9382 -12272 -3740 -1259 -9605 -3244 7707 28350 21424 24748 10238
12240 10238 -8687 -6433 -5385 -11706 -24203 -29363 -22246 -13419 3469 7085 8876 3318 2765 -4528
12226 -4528 -10293 -9723 -6026 -14909 -21089 -13222 -6218 3111 -1258 -12786 -16108 -9186 1827 11046
12212 11046 11198 10898 9801 16432 29886 18156 5733 12511 16570 -919 -3749 14416 10571 6628
12198 6628 1809 -4329 -9974 3261 5476 -4181 -12911 -12383 -1331 -4926 -6123 -20414 -27274 -18685
12184a8685J8734N236r987r062k117J7222J5831J7091l468o817j3630j4463M83
12171c632K741N510O465L844p786j6861J3247k15m959j4923q291K0109M297o649
12157g103J799J6297M201j6928j8087P881K868p35J0538J4016o089j0716p426
12144i484k571p875Q123L710Q537J173m938l851q170j2916L752l097R858R341
12130h408m767N181J058K274L811k476R35o5j1884q060M279N502J4870r300K100
12115d950J0356O148j3008j2210M755N379J2635m821p169p1k813p45O133k122
12101b503J4213J109j4417J2279Q221r079j373m242k741N693L714J0380j6467
12088D787j8615k708L959M769P967P218j4565o826l435p979Q654J5251p642K758
$$ plain form
12184 -18685 49 5285 -4702 -13764 -15881 1341 17172 34263 30795 23978 10348 -4115 -3632
12171 -3632 -891 4619 11084 14928 7142 -9719 3528 3313 -1646 -16569 -24860 -4751 -454 -7103
12157 -7103 -5304 10993 15194 -1734 -19821 -11940 -9072 -9807 731 14747 8658 -2058 -9484
12144 -9484 -12055 -19930 -11807 -8097 440 1613 -3325 -7176 -15346 -28262 -24510 -27607 -17749 -8408
12130 -8408 -13175 -7994 -6936 -4662 -851 -3327 -2392 -2457 -14341 -22401 -18122 -12620 2250 -7050 -4950
12115 -4950 5406 11554 -1454 -13664 -8909 -3530 9105 4284 -2885 -2956 -5769 -6514 -381 -2503
12101 -2503 11710 12819 -1598 10681 18902 9823 8450 4208 1467 7160 10874 21254 4787
12088 4787 -13828 -16536 -12577 -7808 159 7377 -7188 -14014 -17449 -25428 -16774 -1523 -9165 -6407
12074f407P034m993j9041J289Q219P559m86N802K457k415o872K191L521l245J0286
12059D899N433M0o514j116r769n948m794J5049P053k895K84L043K191m674o986
12044d704k75J3282J2982O49L840P261k3407m118O568J995m501m331n602j0967
12030a1328J5687k741j3541Q653l15r15M346l83j2596J905J0164J5618j4517q245
12016h208J0242r093o097N845N466j7254M539J8943L508j0751q126j504k656q81
12002a6027J2744k506l974R143O141j714L077J4177K83n083K985r379o539M347
11988G675k307o317n925j6557n041J7590O897K423L99j0819J5174J0266j1183
11975B275j5982n373O477n097n134j874J6460o923j6877N159N844p98j802J5104
$$ plain form
12074 -6407 627 -4366 -23407 -22118 -13899 -6340 -6826 -1024 1433 -982 -7854 -5663 -2142 -5387 4899
12059 4899 10332 10372 3858 2742 -7027 -12975 -17769 -2720 4333 1438 1722 4765 6956 2282 -4704
12044 -4704 -4979 8303 21285 21934 25774 33035 9628 5510 12078 14073 9572 5241 -361 -11328
12030 -11328 4359 1618 -11923 -3270 -3585 -4500 -154 -537 -13133 -11228 -1064 14554 37 -8208
12016 -8208 2034 -7059 -13156 -7311 -1845 -19099 -14560 4383 7891 -2860 -10986 -12490 -15146 -16027
12002 -16027 -3283 -5789 -9763 -620 5521 3807 6884 21061 21344 16261 19246 9867 3328 7675
11988 7675 5368 -949 -6874 -23431 -28472 -10882 -3985 -1562 -1163 -11982 3192 13458 2275
11975 2275 -13707 -19080 -12603 -17700 -22834 -24708 -8248 -15171 -32048 -26889 -21045 -21843 -23645 -8541
11961h541K1J376J1362l682m459R040l268o572m206O258K824k137j265n593k373
11946a1215P451J3890M963O845o595j3654J92J062k410n876K661L451j027n096
11932e358o386p828L928k85p758k068L612n824O207J1179M54O839J1697O138o172
11917H375q428J149Q919k726J1669j722l140q010j1392l028J1814P184m122o622
11903h0R90M080M278K356J0198Q667k1369j4231R495k224l926m397K510l25j2189
11888a6167K284J2425l3J195j194M403l911n749N849J1011p18j3308l791l229
11874a0933O89M450N761L026j0581k099J0624j4220N02J3745j6032j4520K376
11861b7212K964Q845J0492M670l01R10N196k092l370k569O667l587j4611l420
$$ plain form
11961 -8541 -8520 -7144 4218 536 -3923 5117 1849 -4723 -8929 -2671 153 -1984 -3249 -8842 -11215
11946 -11215 -3764 10126 15089 21934 15339 1685 1877 2939 529 -5347 -2686 765 -262 -5358
11932 -5358 -11744 -19572 -15644 -15929 -23687 -25755 -22143 -27967 -21760 -10581 -10127 -3288 8409 14547 8375
11917 8375 -53 1096 10015 7289 18958 17236 14096 6086 -5306 -8334 3480 10664 6542 -80
11903 -80 910 4990 9268 11624 21822 30489 9120 -5111 4384 2160 -1766 -6163 -3653 -3978 -16167
11888 -16167 -13883 -1458 -1491 -296 -1490 2913 -998 -6747 -898 10113 9395 -3913 -7704 -10933
11874 -10933 -10244 -5794 -33 2993 -7588 -9687 937 -13283 -12781 964 -15068 -29588 -27212
11861 -27212 -24248 -15403 -4911 -241 -542 368 5564 3472 102 -2467 4200 613 -13998 -17418
11847a7418N042K17M660L645o88O412K637P858r883n367o086P137J4800r503L69
11832C832n695o932J2138l802o1K386j730j0480K310j0498J58L62N842O478J4008
11817H316J0343k512k998J606q94j1277o175p402l42l986k79r58K841M559J366
11802g792N187M614O262K428q959o918P874M614L446j0096k1684p466J2623J0541
11788e326L642q463N357j0446J102p170k4158n227J4267J3787O828Q753M716j4055
11774a6393l301J1080P752k778j2148l654J1296K975K725J0688O162k151j8678
11761f425j1784j066o808M116M122P771K5m681m625Q879M470M92j323J76J790
11746d871Q40j720j1960o921l443R902O238J1249o818K801N869q605j1789K763
$$ plain form
11847 -17418 -12376 -12159 -7499 -3854 -4542 1870 4507 12365 2482 -2885 -8971 -1834 12966 3463 3832
11832 3832 -1863 -8795 3343 -459 -520 1866 136 -10344 -8034 -18532 -18374 -18012 -12170 -5692 8316
11817 8316 18659 16147 13149 14755 13861 2584 -3591 -10993 -11335 -15321 -15600 -16558 -13717 -9158 -7792
11802 -7792 -2605 2009 8271 10699 1740 -5178 2696 7310 10756 660 -21024 -28490 -15867 -5326
11788 -5326 -1684 -10147 -4790 -15236 -14134 -21304 -45462 -50689 -36422 -22635 -15807 -7054 -2338 -16393
11774 -16393 -19694 -8614 -862 -3640 -15788 -19442 -8146 -5171 -2446 8242 14404 12253 -6425
11761 -6425 -18209 -19275 -26083 -21967 -17845 -10074 -10049 -14730 -19355 -10476 -6006 -5514 -6837 -6661 -4871
11746 -4871 -4031 -5751 -17711 -24632 -28075 -18173 -11935 -686 -7504 -4703 1166 -7439 -19228 -16465
11732a6465Q275O142R793J868j77J1356m254L443j024J76j790r525j4622j876
11718h680J30J0832L454j467K814R574J495j49J107J109j9425o391m490J602p546
11703a6031L024J4418m543m41r391N983J7112J6341j0490j4933m563j924o979
11690a2417K919R843J2761j2062J316J5699p340k3816r028M988r17M66O72J9848
11676B932O586J194J0208o469j7567j0720J3104J5360P756J1925O224n021j1794
11663B3718k5579q080J2192J2846n734q088p782R076j8970j929j173O910j193
11650a3786N632P65k304J088m759J9090J5265j1160j2214R626J0078p110J099
11637A1310J4145k596j3488n730L545J2158J963j5137j0047q119J3509R828K329
$$ plain form
11732 -16465 -8190 -2048 7745 9613 9436 20792 16538 19981 18957 19133 17343 7818 -6804 -8680
11718 -8680 -8550 2282 5736 4269 7083 16657 18152 18003 19110 20219 794 -5597 -10087 -8485 -16031
11703 -16031 -13007 1411 -3132 -3573 -12964 -6981 10131 26472 15982 1049 -3514 -5438 -12417
11690 -12417 -9498 345 13106 1044 2360 18059 10719 -13097 -22125 -17137 -18054 -17588 -16916 2932
11676 2932 9518 10712 20920 14451 -3116 -13836 -732 14628 22384 34309 40533 35512 23718
11663 23718 -1861 -9941 2251 15097 9363 1275 -6507 2569 -16401 -18330 -19503 -12593 -13786
11650 -13786 -8154 -7389 -9693 -8605 -13364 5726 20991 9831 -2383 7243 17321 10211 11310
11637 11310 25455 22859 9371 3641 7186 19344 21307 6170 -3877 -11996 1513 11341 13670
11624A3670j3457J703o564k235m957L834J03L476q553q091j0693K4784J419j2391
11610a7952J0630k435J1238N72l059J545M480q04j812q511r071j870J2146o69
11596e572m110j0187J3481R995R730m797k477j065k969m923n853l24k821Q979
11582b913J0200K569m481K08K281K434O253O607j6679j1544J0151O902R390O447
11568B7825k207j136k0407j2300j5143j484Q065J3607K364J4977M146K340k2777
11555b130L579M679N078M539K395p278q645j0709l358M505J2599J0616m35j124
11541A4311o048j3689m005j0888R908J3764O784N395p890o484j149l563j762J0338
11527E022J377J950j642k612M153N973m876j1865q49J859K475J2570R7J0870p073
$$ plain form
11624 13670 213 1916 -4648 -6883 -11840 -8006 -7903 -4427 -12980 -21071 -31764 -6980 -5561 -17952
11610 -17952 -7322 -9757 1481 2053 -1006 539 5019 4215 2403 -6108 -15179 -17049 -4903 -5572
11596 -5572 -9682 -19869 -6388 3607 13337 8540 6063 4998 2029 -2894 -8747 -9071 -11892 -2913
11582 -2913 7287 9856 5375 5583 7864 10298 16551 23158 6479 -5065 5086 11988 21378 27825
11568 27825 25618 24482 4075 -8225 -23368 -24852 -16787 -3180 -816 14161 18307 20647 -2130
11555 -2130 1449 6128 11206 15745 18140 10862 2217 -8492 -11850 -7345 5254 15870 15435 14311
11541 14311 8263 -5426 -9431 -20319 -10411 3353 10137 15532 7642 1158 9 -3554 -5316 5022
11527 5022 6399 8349 6707 4095 8248 14221 9345 -2520 -3369 -1510 965 13535 13632 24502 17429
11512A7429j1376n646o700O831L637m787n185k69J0535N692m405p087M914J302
11498D885Q91j5319P825J511P120K006M753l523q523n53N48k030L225Q036N95
11483A1447j6156j4262L398J5828J6524J885m175m099n500k268r763j1016L461
11470a4696J7278K6831j4870j8910j2033O802j694o837O174j2923j0790O935J2649
11457a6084J7793J502j1427l015L580J3286J3743K795o817J0090r380j1947j0576
11444f457j2632m876N214K771O52q429N566L168n048m738l986J686j3897k226
11430d3232J3277L508P706k821M430L082J3401J5984O527j1823n434O826j2358
11417i27K585Q113p366j081l659q637l577Q748Q381J4248K308k943p163j935N963
$$ plain form
11512 17429 6053 407 -6293 538 4175 -612 -5797 -6066 4469 10161 5756 -1331 3583 4885
11498 4885 5776 -9543 -1718 -207 6913 8919 13672 10149 1626 1073 1621 -409 2816 10852 11447
11483 11447 -4709 -18971 -15573 255 16779 18664 14489 10390 4890 2622 -7141 -18157 -14696
11470 -14696 2582 29413 14543 -4367 -16400 -9598 -11292 -18129 -11955 -24878 -35668 -28733 -16084
11457 -16084 1709 3211 -8216 -11231 -7651 5635 19378 22173 15356 25446 16066 4119 -6457
11444 -6457 -19089 -23965 -18751 -15980 -15328 -23757 -18191 -15023 -20071 -24809 -28795 -27109 -41006 -43232
11430 -43232 -29955 -26447 -18741 -21562 -17132 -14050 -649 15335 21862 10039 4605 11431 -927
11417 -927 1658 9771 2405 1324 -2335 -10972 -14549 -5801 2580 16828 19136 16193 9030 7095 13058
11402A3058M173Q585n646m074n163l088j915o420R83J3778j593l474k1102j3111
11388b5009Q42J7314p296M501q282k907m609J6455r742L810j8R126l576r1J3881
11373D399K075j2345k593O247m663O655L106M48N425M6L037M69r714o355J0104
11358F341Q23j2156L68P477j016m740L082n155k552j109k378M250N885JJ9177
11343A8298J7194j8899j9321O763N965o471K212O040q10l331l212m627j026J0564
11329I339l09k238k716q873m233M387J0262M424o585k586P392m468j0130o104
11315a2438j5776j1047Q828K0242R656J636j4074J455J1403R28o414q934L259
11302a1276n513J539R712K106q673N80L071O304N102M246P987m299j1665M262
$$ plain form
11402 13058 17231 25816 20170 16096 10933 7845 5930 -490 493 14271 12678 9204 -11898 -25009
11388 -25009 -24167 -6853 -14149 -9648 -17930 -20837 -25446 -8991 -18733 -14923 -14941 -5815 -9391 -9482 4399
11373 4399 6474 -5871 -8464 -2217 -6880 -225 2881 3329 8754 8800 11837 12306 2592 -3763 6341
11358 6341 7164 -4992 -4624 2853 1837 -2903 179 -4976 -7528 -8637 -11015 -6765 -880 -879 18298
11343 18298 35492 16593 -2728 4035 10000 3529 5741 11781 10971 7640 4428 -199 -1225 9339
11329 9339 9030 6792 4076 -4797 -9030 -4643 5619 10043 3458 872 8264 3796 -6334 -12438
11315 -12438 -28214 -39261 -30433 -10191 -535 1101 -12973 -11518 -115 813 -5601 -14535 -11276
11302 -11276 -16789 -15250 -5538 -3432 -12105 -11525 -8454 -2150 2952 7198 15185 10886 -779 3483
11288C483l869j2481j5219N350O624k406o786j0511o190Q333J1899n637j669J4804
11274a4275O901k067m547r449J674J9022O901j135M346l404o996p578M420J180
11260e007J974N66N377q533j5719j995J1824J2031p432m864l623J260K710O44
11246a0787p33J9335m525p027m756l033m145k437N009R061J7219P421j4479n612
11232E11r780p195j3598K214M593l483n038K4149N958j3128P34l729J2861j0725
11218a5656Q555J974m081n11J0971J0522k319l114L823J985Q471r007l00J982
11204A3295J2404o781n314l716M550M549p143N260m128j7323J131n989J0865m28
11190A232j0940Q261J1526r884L26J4261N351q440J291J2034K432q965k1068q301
$$ plain form
11288 3483 -386 -12867 -28086 -22736 -16112 -18518 -25304 -35815 -42005 -33672 -21773 -27410 -29079 -14275
11274 -14275 -7374 -9441 -13988 -23437 -21763 -2741 4160 3025 7371 3967 -3029 -10607 -6187 -5007
11260 -5007 -3033 -2467 2910 -5623 -21342 -23337 -11513 518 -6914 -11778 -15401 -14141 -11431 -10787
11246 -10787 -11520 7815 3290 -3737 -8493 -11526 -15671 -18108 -13099 -4038 13181 20602 6123 511
11232 511 -9269 -16464 -30062 -27848 -23255 -26738 -31776 -7627 -1669 -14797 -14063 -17792 -4931 -15656
11218 -15656 -7101 -5127 -9208 -9719 1252 11774 9455 6341 10164 12149 20620 11613 11313 13295
11204 13295 25699 18918 13604 9888 14438 18987 11844 17104 12976 -4347 -3216 -9205 1660 1232
11190 1232 -9708 -1447 10079 195 521 14782 20133 11693 12984 25018 27450 18485 -2583 -10884
11176a0884j915k065Q542J7200J8370j8908j9468m422r769N808R117j2883n663
11163b6940q427R007P006J1179L762O380M429m21p456N2p58p378J04J1522K396
11148D457O52J603R527Q57n427N412m505L793j9695q989J4755J4864j3183O896
11134A1017n920K552R076N31j2876j776Q422K589J0096l929n484j6216k970R692
11120D804J4540N897j3019j2927j2537j5215M702n024J1664J7886J6078K903j2578
11107G174l044r595k857K1018J0988N480j8864k1257j1326P504Q638N044P421
11094F324n734j4593J584J9451R596L804j4143j0176O857M446Q17n329j1908M572
11080d432J2665n488p348J352n661n539m588n461J0988J3685O48j688Q223Q518
$$ plain form
11176 -10884 -12799 -14864 -6322 10878 29248 10340 -9128 -13550 -23319 -17511 -8394 -21277 -26940
11163 -26940 -35367 -26360 -19354 -8175 -4413 1967 6396 5975 -1481 -1429 -2187 -9565 -9461 2061 4457
11148 4457 5109 6712 16239 17096 11669 17081 12576 16369 -3326 -12315 2440 17304 4121 11017
11134 11017 5097 7649 16725 17256 4380 2604 11026 13615 23711 19782 14298 -1918 -4888 4804
11120 4804 19344 25241 12222 -705 -13242 -28457 -23755 -28779 -17115 771 16849 19752 7174
11107 7174 4130 -5465 -8322 12696 23684 29164 10300 -10957 -22283 -14779 -6141 -1097 6324
11094 6324 590 -14003 -12419 7032 16628 20432 6289 -3887 2970 7416 8233 2904 -9004 -4432
11080 -4432 8233 2745 -4603 -3251 -8912 -14451 -19039 -24500 -13512 173 821 -867 7356 15874
11066A5874j1444j4555O197J0919J7324O946j5469p345p054J432M603l480o270
11053b322o033J30j3625l887J0553L943M799n509P797k39K007j167l641m979o265
11038a8438J2414J244K793J2556q092l427M220q149K794J1856j3246j3930n135
11025b2540k490J2260O783J6256l40n776j286j1354J2699R562m936o258l454k16
11011a090N541K179p459j2293M660n649Q237l317K278R241j2990j2543k329N632
10997a9902M907J2024M649K963Q76R020j2564j7872L68k230O099j0753l214M903
10983b0726K0210M790l435O310Q064j769Q296K850j5900j7526J2853P837k041
10970I813N056L237l660m898j2299r08O31J2976O486k2288j4449j673J0928P646
$$ plain form
11066 15874 4430 -10125 -3928 6991 24315 31261 15792 8447 1393 2825 7428 3948 -2322
11053 -2322 -8355 -8225 -21850 -25737 -15184 -11241 -6442 -11951 -4154 -4393 -2386 -3553 -7194 -12173 -18438
11038 -18438 -6024 -4780 -1987 10569 2477 -950 3270 -4879 -2085 9771 -3475 -17405 -22540
11025 -22540 -25030 -12770 -5987 10269 9929 4153 2867 -8487 4212 13774 8838 2580 -874 -1090
11011 -1090 4451 6630 -829 -13122 -8462 -14111 -5874 -9191 -6913 2328 -10662 -23205 -25534 -19902
10997 -19902 -14995 -2971 1678 4641 5517 14537 1973 -15899 -15531 -17761 -11662 -22415 -25629 -20726
10983 -20726 -516 4274 839 7149 15213 13444 21740 24590 8690 -8836 4017 11854 9813
10970 9813 14869 18106 14446 9548 -2751 -3659 -3028 9948 16434 -5854 -20303 -21976 -11048 -3402
10956c402K573J2921j1203K477R681n966k0478o130P933j995o494J8271R500j285
10942F403P488L376j534l99o43k318j0423j1603M9K1197L439k053j814k359q408
10927C98j8687j4728N605P080o630N372m639N260J0884k596r816p131M661N439
10913a9528J8147n615n437Q604k193j1706j4086K738J531K19J4663R917J628m58
10899a576Q302J0054N911j6510n248q504n626P477J683n567K762P555j1112j7930
10885b8329J0234O702M627m74Q478j07j4651M418k88o997p424m735K013N844J9225
10870a464P382r48k866L667K059l152m87k59m545p382j0938q427o68K000J4880
10855a1148J3015L506m143o079j8597j9239L311K2574N267J644J0674O667L245
$$ plain form
10956 -3402 -829 12092 889 3366 13047 7081 -13397 -19527 -11594 -13589 -20083 -1812 7688 6403
10942 6403 13891 17267 15733 15334 14691 12373 1950 -9653 -9604 11593 15032 12979 11165 8806 398
10927 398 -18289 -33017 -27412 -20332 -26962 -21590 -26229 -20969 -10085 -12681 -22497 -29628 -24967 -19528
10913 -19528 -1381 -6996 -12433 -3829 -6022 -17728 -31814 -29076 -27545 -27326 -12663 -2746 -1118 -1576
10899 -1576 6726 16780 22691 6181 933 -7571 -13197 -5720 -4037 -9604 -6842 713 -10399 -28329
10885 -28329 -18095 -11393 -6766 -7240 1238 1131 -13520 -9102 -9390 -16387 -23811 -28546 -26533 -20689 -1464
10870 -1464 5918 4970 2104 5771 7830 4678 4191 3932 -613 -7995 -18933 -27360 -28028 -26028 -11148
10855 -11148 1867 5373 1230 -4849 -23446 -42685 -39374 -16800 -11533 -9889 785 7452 10697
10842A0697K862o365p63m471m481m971J398j87n407K522n067n922l565L590J7974
10827b156n919M4J8357P607o948j6531o675Q586K004K283l484k194n789o253N856
10812a1212n291m062m9J7032M298n565k567j6782j2430Q925J0158K343k224K1890
10798D464K563l373j066M639n659l216m648m181Q512M590K581P65M523l106j6300
10783h912o504k578k182j7579J2775R034J7099N945Q461Q012q073j3874j0200
10770h576j2695J0578R476k422l992K592O774J6667P251j3782p152L57p256l806
10756e986J2703k003q187o19o757k275L097N033l023o499O332P11p800R43J3357
10741i73n19l082p79j7346l320o178R832L035m22L445J3423R421R576q69j3913
$$ plain form
10842 10697 13559 7194 6431 1960 -2521 -7492 -6094 -6281 -11688 -9166 -14233 -20155 -23720 -20130 -2156
10827 -2156 -8075 -8031 10326 17933 10985 -5546 -12221 -3635 -1631 652 -2832 -5026 -10815 -17068 -11212
10812 -11212 -16503 -20565 -20614 -3582 716 -4849 -7416 -24198 -36628 -27703 -17545 -15202 -17426 4464
10798 4464 7027 3654 2588 7227 1568 -1648 -6296 -10477 -1965 2625 5206 5971 10494 7388 -8912
10783 -8912 -15416 -17994 -20176 -37755 -24980 -15946 1153 7098 15559 23571 15498 1624 -8576
10770 -8576 -21271 -10693 -1217 -3639 -7631 -5039 1735 18402 25653 11871 4719 5076 -2180 -5986
10756 -5986 6717 4714 -3473 -4092 -10849 -13124 -10027 -4994 -8017 -14516 -8184 -7473 -15273 -14330 -973
10741 -973 -1492 -4574 -5353 -22699 -26019 -32197 -22365 -19330 -19752 -16307 -2884 6537 16113 15244 1331
10726A331j5686k870j0494Q613J2339J3926O738j2301r061L678J3761k139q111
10713b76j0498j1510l106m3N059Q853J5127J8m415p047N092J9511P621o734l535
10698A4117n826k3031j514K671J0094M225k116p169l972R342J0099J1426l586
10685A4760o930j1366k2529L137J6273k120J0837k00r802J3641P379r947q434
10672e301J183m0J193m247K4262j02j2996j0477k497O160R648J0387m657j2046
10658D70k997Q860O712L68j314j0780l653P892n587j4417K225J1899O601O297
10644A2576o96r818n617o27N969K350q372M087R160N441M786n247q20j7814j6124
10629b0766R260O999O866K267p158k080p163m675Q359j0213r760N624R379J2843
$$ plain form
10726 1331 -14355 -17225 -27719 -19106 -6767 7159 13897 1596 -7465 -3787 9974 7835 -276
10713 -276 -10774 -22284 -25390 -25433 -20374 -11521 3606 3624 -791 -7838 -2746 16765 24386 17652 14117
10698 14117 8291 -14740 -16254 -13583 -3489 736 -1380 -8549 -12521 -3179 6920 18346 14760
10685 14760 7830 -3536 -26065 -22928 -6655 -8775 2062 1862 -7940 5701 13080 3133 -5301
10672 -5301 -4118 -4158 -2965 -7212 17050 16948 3952 -6525 -9022 -2862 6786 17173 12516 470
10658 470 -2527 6333 13045 13413 12099 1319 -2334 5558 -29 -14446 -12221 -322 6279 12576
10644 12576 11880 2062 -3555 -4182 1787 4137 -4235 -148 9012 14453 19239 13992 13172 -4642 -20766
10629 -20766 -11506 -4507 2359 4626 -2532 -4612 -11775 -16450 -8091 -18304 -28064 -22440 -13061 -218
10615b18m135l444m410J2645l114j6788j2021R354Q728J3959Q433p692M89N149
10601F935j106k91j334r455j4712L190N287J6225K8419o29o627j498j981j0388
10587A2035l742Q833k290p932J5728q55j3593j2697j4682k204N768J3392k084
10574d323j5168O056J2479K318k936j2547L544n095M585J0491J5094J2402j995
10561B4905j3430j7109M598J0540N250j5181n609p260j0199K418R230R594k479
10548d732L393L8k089L632j2085K58R977Q223m478Q750Q424r967o455N789M670
10533A3348P501l81k465o727o200j4302p263J0853J0841k003k675q91m722n571
10519a0657L366M853L073m630p688j198L663N486O685K479o787r172m830p225
$$ plain form
10615 -218 -4353 -7797 -12207 438 -2676 -19464 -31485 -22131 -13403 556 8989 1297 1786 6935
10601 6935 5829 5538 4204 -5251 -19963 -16773 -11486 4739 33158 32529 25902 24404 22423 12035
10587 12035 8293 17126 14836 6904 22632 21777 8184 -4513 -19195 -21399 -15631 -2239 -4323
10574 -4323 -19491 -13435 -956 1362 -1574 -14121 -10577 -15672 -11087 -596 14498 26900 24905
10561 24905 11475 -5634 -1036 9504 14754 -427 -6036 -13296 -23495 -21077 -11847 -2253 -4732
10548 -4732 -1339 -1301 -3390 242 -11843 -11585 -1608 6615 2137 10887 19311 9344 2889 8678 13348
10533 13348 20849 20468 18003 11276 5076 -9226 -16489 -5636 5205 3202 527 -364 -5086 -10657
10519 -10657 -7291 -2438 635 -3995 -11683 -12881 -9218 -3732 2953 5432 -1355 -10527 -15357 -22582
10505b2582L769J1406J1566M578n588J694j765r696k143k587O491j200j1769K393
10491a5433N866K230P513K86J4661J5214N9j1803j7590r694N247p848l434j56
10477a4882k232L108j834o015O095O064k420k222o508M04J0288O442p828p326
10463a8866N016R402J3475n702J0380q611j0866j0271j146m786p743m19N740J1390
10449a3007J0031k220j47M241J1534k544j608J4087m617J4275O046j6752o415
10436A2904J1149J838q701m273l03j8037R912R335j3613o962j3239L815J5000
10423a175q296n439k032J176M106N194R170j764k0472J655J8829J042l057j1278
10409a2341P288J4875J6073j499N734J586k5191j7623k0745j3899K350N224M521
$$ plain form
10505 -22582 -18813 -7407 4159 8737 3149 4843 3078 -6618 -8761 -11348 -4857 -6057 -17826 -15433
10491 -15433 -9567 -7337 176 462 15123 30337 30396 18593 1003 -8691 -3444 -11292 -14726 -14882
10477 -14882 -17114 -14006 -15840 -21855 -15760 -9696 -12116 -14338 -20846 -20442 -10154 -3712 -11540 -18866
10463 -18866 -13850 -4448 9027 3325 13705 5094 -5772 -16043 -17189 -21975 -29718 -30137 -24397 -13007
10449 -13007 -2976 -5196 -5343 -1102 10432 7888 6280 20367 15750 30025 36071 19319 12904
10436 12904 24053 25891 17190 12917 12614 -5423 4489 13824 211 -6751 -19990 -16175 -1175
10423 -1175 -9471 -14910 -16942 -15766 -11660 -6466 2704 940 -19532 -17877 952 1994 -1063 -12341
10409 -12341 -5053 9822 25895 24396 30130 31716 6525 -11098 -31843 -45742 -43392 -38168 -33647
10396c3647J7822P415o705l008J22o024J0002J5064O752p784o61J1413l790k1653
10382a4682L093n88j2763O5J6963J7460O183j2706j2821j8525P608R445R192O81
10368a395J1555J4462n288n608q677j0976k0604j1269J2041k025K085K625R919
10355a3155l045N12J2166O437r973q842n848j4070j6306J4936J7889P734J972
10342i593R613N782o357q767R205J3476K065k0921j5348N035M040M438r899j4096
10328c1327J0643J6669K655j5012L300J896N135p82K09p570n24K874K448m096
10314a3482n67N176J700o464j777K2372k371m264J949K821m311k910O885j3262
10300h505j9529p533O800Q688O803n78n002k258R823Q152J599j1204J0219K6879
$$ plain form
10396 -33647 -15825 -8410 -15115 -18123 -18001 -24025 -14023 1041 7793 9 -652 10761 6971 -14682
10382 -14682 -11589 -12177 -24940 -24875 -7912 9548 15731 3025 -9796 -28321 -20713 -11268 -2076 -1395
10368 -1395 10160 24622 19334 13726 5049 -5927 -26531 -37800 -25759 -27784 -25699 -23074 -13155
10355 -13155 -16200 -15688 -3522 2915 -7058 -15900 -21748 -35818 -52124 -37188 -19299 -11565 -9593
10342 -9593 20 5802 -555 -9322 -117 13359 15424 -5497 -20845 -15810 -11770 -7332 -17231 -31327
10328 -31327 -20684 -4015 -1360 -16372 -13072 -11176 -6041 -6823 -6614 -14184 -14708 -11834 -9386 -13482
10314 -13482 -14049 -8873 -7173 -13637 -15414 6958 4587 323 2272 5093 782 -2128 4757 -8505
10300 -8505 -28034 -35567 -28767 -20079 -13276 -13854 -18856 -21114 -11291 -3139 -1540 -12744 -2525 24354
10286B4354j4148j9267q157K205J47M780O66R85l927Q925J9102j073r801q349
10272c558K829j5801P44N456m252n268o793O264J477J0079O679r250j130N750
10258f774m696o664O223J4803J4561J587q45l762J87P603q406r091j0095j706
10244g075M606o213o690O758l776j0815j215J1223J1023q353M0l443N755P164
10230a011q546j04J8344O251J946j530R29k910o718R539R171r410j3161k476Q384
10215H698O21q343p907j658M838J910P18P225R82j272l369l680K613j944M947
10200D379J3864k863Q884O854j3313o604L621k4420j6743m284N028j691J450K0338
10186e500k457q770N857r66K4734R793N317n400j4500j5906Q185K741M12j899
$$ plain form
10286 24354 10206 -9061 -17218 -15013 -14866 -10086 -9420 -8435 -12362 -3437 15665 14592 4791 -3558
10272 -3558 -729 -16530 -15786 -10330 -14582 -19850 -26643 -20379 -18902 -8823 -2144 -11394 -12524 -6774
10258 -6774 -11470 -18134 -11911 2892 17453 19040 18195 14433 14620 22223 13817 4726 -5369 -7075
10244 -7075 -2469 -8682 -15372 -8614 -12390 -23205 -24420 -13197 -2174 -10527 -10487 -13930 -8175 -1011
10230 -1011 -9557 -9661 8683 14934 16880 15350 16279 13369 6651 16190 25361 15951 2790 314 8698
10215 8698 9319 976 -6931 -8589 -3751 -1841 -1123 6102 7084 5812 2443 -1237 1376 -568 4379
10200 4379 18243 15380 24264 31118 17805 11201 14822 -9598 -26341 -30625 -25597 -27288 -25838 -5500
10186 -5500 -7957 -16727 -10870 -11836 12898 22691 28008 22608 8108 -7798 387 3128 3540 1641
10172A641l502p164K593Q144M959n704m021l003M578j162j3926J0715J4804P07
10158I659l770j0001j0259M113O275O761n72j0760r115L630j669J5528J9289k103
10144A7006j0297J96P759p780O587l566j1283K016N495j697J167j370o628L265
10130H70K091M164q971L103k579l155N479Q887O53r925r259j3447o6L117k558
10115b1596n839J2083J0430M176q366r641m839J168M204L533N248K3452j0673
10102C340j3384K889K422L625J972M562l273Q537J145J319k734o603p319K885
10088f17o985M137l788n255J3303m181O935P804K013l901j413n035m452J2569
10074A1134J2538o051p467q830q588p648o062L796L582j0828O200Q976R577N497
$$ plain form
10172 1641 -1861 -9025 -6432 1712 6671 967 -3054 -6057 -1479 -2641 -16567 -5852 8952 9659
10158 9659 5889 -4112 -14371 -10258 -3983 2778 2206 -8554 -17669 -14039 -15708 -180 19109 17006
10144 17006 6709 6905 14664 6884 13471 9905 -1378 638 6133 4436 5603 4233 -2395 870
10130 870 2961 7125 -1846 1257 -1322 -4477 1002 9889 10542 617 -8642 -22089 -22155 -19038 -21596
10115 -21596 -27435 -15352 -4922 -746 -9112 -18753 -23592 -22424 -18220 -14687 -9439 14013 3340
10102 3340 -10044 -7155 -4733 -1108 864 5426 2153 10690 11835 13154 10420 3817 -3502 -617
10088 -617 -7602 -3465 -7253 -12508 795 -3386 3549 11353 13366 9465 8052 3017 -1435 11134
10074 11134 23672 17621 10154 1324 -7264 -14912 -20974 -17178 -13596 -24424 -18224 -9248 329 5826
10060E826l88J0412O459j4235O98j0981j2304O678o541R329P165r845M753K141
10046h33k0644n560n09J6076J0451k942p831P168j3640m472J1523m290J1443n05
10032d565K866O719J9002j673j5165j8634j8469j2393J7356J1506K166K200P255
10019a829L129j3662j4373J736M346o664J0145P676J0666O826m836m225j3006
10006a4071K934K2079M007q290K99o885o659n513m923P402q500j3059N885J6418
9992h876J755J653j0464j262j112k350R045J414L558m689j4066K052J6108k361
9978i595k756J0065l506J0565o63p564Q795N785m257M571l885l820o829J383Q381
9963F670N190o984m667q423m835N353j109L064J1045N883j7839Q97O586l98J1271
$$ plain form
10060 5826 5438 15850 22309 8074 8772 -2209 -14513 -7835 -14376 -5047 2118 -7727 -2974 -833
10046 -833 -21477 -27037 -27546 -11470 -1019 -3961 -11792 -4624 -18264 -22736 -11213 -15503 -4060 -4565
10032 -4565 -1699 5020 24022 22349 7184 -11450 -29919 -42312 -24956 -13450 -11284 -9084 -1829
10019 -1829 1300 -12362 -26735 -24999 -20653 -27317 -17172 -9496 1170 7996 3160 -1065 -14071
10006 -14071 -11137 10942 14949 6659 6958 73 -6586 -12099 -17022 -9620 -18120 -31179 -25294 -8876
9992 -8876 -7121 -5468 -15932 -17194 -18306 -20656 -11611 -10197 -6639 -11328 -25394 -23342 -7234 -9595
9978 -9595 -12351 -2286 -5792 4773 4110 -3454 5341 11126 6869 11440 7555 3735 -3094 -1711 6670
9963 6670 11860 4876 209 -8214 -13049 -7696 -8805 -5741 5304 11187 -6652 -5755 831 433 11704
9948A1704O919j0975j48J489P386r060n636Q723J1108j207M773L101j7043j8951
9934g817k142O947m77P480l24j111k63n506l725K246j699M249r258p651p804k202
9918b9057N764J1142J0102J186N925R115O464q979o264j5567j117m119M181Q838
9904b386L996M431q304J005J408N239j1243j2495J676R283Q238L428j868L478
9890E886J0208J718J667j1721q215o711P885k201j0272k534n11M676o861l491
9876b0477O223N459Q689j8282q86P131J5179M437l871P702O249J0432k0052k9330
9862b1397J170L222O868N583J207n994M10J0912j4584M76J2148r995j1739j7249
9848c8962r931J1563J684J4949K811J0147J2076J5464Q99m402M154j820k695j3491
$$ plain form
9948 11704 18623 7648 7500 8989 16375 7315 1679 10402 21510 20303 25076 28177 11134 -7817
9934 -7817 -9959 -3012 -3489 3991 3667 2556 2293 -3213 -6938 -4692 -6391 -2142 -11400 -19051 -26855 -29057
9918 -29057 -23293 -12151 -2049 -863 5062 14177 20641 11662 5398 -10169 -11286 -15405 -11224 -2386
9904 -2386 1610 6041 -2263 -1258 150 5389 -5854 -18349 -16673 -7390 848 4276 2408 5886
9890 5886 16094 17812 19479 7758 -457 -7168 717 -1484 -11756 -14290 -14801 -10125 -16986 -20477
9876 -20477 -14254 -8795 -106 -18388 -19274 -12143 3036 7473 3602 11304 17553 27985 7933 -21397
9862 -21397 -20227 -17005 -10137 -4554 -3347 -9341 -8931 1981 -12603 -12127 21 -9974 -21713 -38962
9848 -38962 -48893 -37330 -35646 -20697 -17886 -7739 4337 19801 20700 16298 20452 18632 15937 2446
9834B446K399P810m824r946Q763k087o143M550J3922j2011j7255n814K247J5226
9820g17Q45N346K538j5769j0980j546n876M324N201L999l27j918J812J1294J0039
9805H265J205l754p143n158K66L392j9654l481N070j9q72L196r35J3703Q399l930
9789a450k616L266K638o047l814M563M896l755j3716J652L991r760P621J0013
9775b518Q015n050j249j0711K036o0J0916O135r415k3695Q711O357M888N177L554
9760C091J31l368k681j707k853N12L86p452m886o782J2616J6202K956q111k176
9745d122N169l804Q005J495K199R828j5637r202J215N321N280j2476j070J2328
9731D529j2427r967o552J0496R717R694k234lj3974m243K141O30M878j0790r273
$$ plain form
9834 2446 4845 12655 7831 -2115 6648 4561 -1582 2968 16890 4879 -12376 -18190 -15943 -717
9820 -717 128 5474 8012 -7757 -18737 -20283 -26159 -21835 -16634 -12635 -12962 -14880 -13068 -1774 8265
9805 8265 9470 5716 -1427 -6585 -6319 -2927 -22581 -26062 -20992 -21011 -21883 -18687 -19622 -5919 2480 -1450
9789 -1450 -4066 -800 1838 -4209 -8023 -3460 1436 -2319 -16035 -14383 -10392 -20152 -12531 -2518
9775 -2518 5497 447 -802 -11513 -9477 -9537 1379 7514 -1901 -25596 -16885 -10528 -5640 -463 3091
9760 3091 3222 -146 -2827 -4534 -7387 -6875 -6489 -13941 -18827 -25609 -12993 3209 6165 -1946 -4122
9745 -4122 1047 -2757 5248 6743 8942 18770 3133 -6069 -4854 467 5747 -6729 -7799 4529
9731 4529 -7898 -17865 -24417 -13921 -4204 5490 3256 3253 -10721 -14964 -12823 -12193 -7315 -18105 -27378
9716b7378J3362J8878L075j372N48q63P829j57j3187j3325m364m161q2M098J819
9701a5280j260n742k894l652O58J0921M309k225J1800N683j1149o439K3456K499
9687A0685j3894j5773L894J0826K247L613p668r384J253M159P574M030J455j2893
9673i876k957l29l485J76n96J4684J6079k101j2955L244k545L443R662M611p523
9658I532q5p938p249j1766O396O581j521O813M78M268j0921r781m728J025O239
9643a2657K099O183r87o378M044Q489o299M459R286P406O1o828j2139K737j0689
9628a1213q575n364m193M809P560L214K988P597M356k291j2677j310M338O778
9614c983M007l792j3471o391P435M59m812J4017M299J843L830l486l759k621J2074
$$ plain form
9716 -27378 -14016 4862 7937 6565 7113 6250 14079 13922 735 -12590 -16954 -21115 -21197 -17099 -15280
9701 -15280 -16540 -22282 -25176 -28828 -28170 -17249 -12940 -15165 -3365 2318 -8831 -15270 8186 10685
9687 10685 -3209 -18982 -15088 -4262 -2015 1598 -6070 -15454 -14201 -10042 -2468 1562 3017 -9876
9673 -9876 -12833 -13162 -16647 -16471 -17067 -2383 13696 11595 -1360 1884 -661 2782 12444 17055 9532
9658 9532 9447 1509 -5740 -17506 -11110 -4529 -6050 763 1241 5509 -5412 -15193 -19921 -18896 -12657
9643 -12657 -10558 -4375 -5362 -11740 -7696 793 -5506 -1047 8239 15645 15706 8878 -3261 -524 -11213
9628 -11213 -19788 -25152 -29345 -24536 -16976 -13762 -10774 -3177 1179 -1112 -13789 -15099 -10761 -3983
9614 -3983 24 -3768 -17239 -23630 -16195 -15736 -20548 -6531 -2232 -389 3441 -45 -3804 -6425 5649
9599E649J4658J640j1813j3312j2289j2093J2490O241j998N442L710j1986R595
9586d066J402k154o440r99Q283K550p553O855J3294N507N722q505j025J804k558
9571A2117n728N317j808j0985P404N989p858N662M179j0897l254j6326r599K239
9557b3548J2690L130j7242j0235n96Q859K2108J0610O518O974q250l255j7820
9544a0057q554Q58l00M208N074l008l059R904J206j6103p316k99N578K875R594
9529i399o008l027Q796L318J5907Q99M268k951N258R741J3274q137j425j6153
9515A4361J03j3844m641l252K030n759m287P567p510r333O862N539L309J6590
9501G735J719j6004r912J980J0927q536j798M929K721p787J203P942L333m220
$$ plain form
9599 5649 20307 21947 10134 -3178 -15467 -27560 -15070 -8829 -10827 -5385 -1675 -13661 -4066
9586 -4066 -2664 -4818 -11258 -12257 -3974 -1424 -8977 -2122 11172 16679 22401 13896 12871 14675 12117
9571 12117 6389 11706 9898 -1087 6317 12306 4448 10110 14289 3392 138 -16188 -25787 -23548
9557 -23548 -10858 -7728 -24970 -35205 -35801 -26942 -4834 5776 12294 19268 11018 7763 -10057
9544 -10057 -18611 -17753 -18053 -13845 -8771 -11779 -14838 -4934 -3728 -19831 -27147 -27446 -21868 -18993 -9399
9529 -9399 -15407 -18434 -9638 -6320 9587 10486 14754 11803 17061 26802 40076 31939 30514 14361
9515 14361 14464 620 -4021 -7273 -5243 -11002 -15289 -7722 -15232 -24565 -17703 -12164 -8855 7735
9501 7735 9454 -6550 -16462 -14482 -3555 -12091 -13889 -8960 -6239 -14026 -12823 -4881 -1548 -5768
9487e768J2594J108r757o532k131O419P316l654j282N296j2469j5394J1891N234
9473g129L408Q041r935J159K120l572q010l392Q122J560o058m164P941O514m232
9458g627o581j843O66L383P447P559M734R2J315N430L667k1542n989J0029p133
9443f393m599J0251N232j1635P772J0227k1128K731K2260J6654P847j2797j1235
9430A5187k475n025l474p498J124J3727Q106j7583k569k792Q518q263O62J804
9416e51j1195J029J5539P160m566j857n853j166K0612N547j1279n599r40j6964
9402a0083O02J0214L400j127m0l686o712l65J965j0195L22K758O31P930P54Q817
9386E185R01j737P3j5755j0329M980N063J845K692K677J1392j2816k453N553k304
$$ plain form
9487 -5768 6826 7934 -1823 -8355 -10486 -4067 3249 -405 -1687 3609 -8860 -24254 -12363 -7129
9473 -7129 -3721 4320 -5615 -4456 -2336 -5908 -13918 -17310 -9188 -7628 -13686 -17850 -9909 -3395 -7627
9458 -7627 -14208 -16051 -15385 -12002 -4555 3004 7738 7830 9145 14575 18242 -3300 -9289 740 -6393
9443 -6393 -10992 -741 4491 -7144 628 10855 -10273 -7542 14718 31372 39219 26422 15187
9430 15187 12712 7687 4213 -3285 -2161 11566 19672 2089 -480 -3272 5246 -3017 -2355 -551
9416 -551 -11746 -10717 4822 11982 7416 5559 -294 -1460 19152 24699 13420 7821 6881 -10083
9402 -10083 -9481 733 4133 3006 2966 -720 -7432 -7797 -5832 -16027 -15705 -12947 -12316 -4386 -3632 5185
9386 5185 6086 4349 4422 -11333 -21662 -16682 -11619 -9774 -7082 -4405 6987 -5829 -8282 -2729 -5033
9371e033q79N909L158K137r76l832n4P937j7671j0889N726P143J2046n006j5402
9356a5686j0305n615Q341O017J2153j475J47M868n144m861K0510k13j1797j405
9342d465m840j9320K988J3245O36J429J1938J9809J1634P154o773r121j1038M586
9328A7862P760r647k4213j1057K146K3659k536p384j4627K286K990M897O943Q588
9314G667J148q047J95M129N819Q023N245l070p640n169K411L434L024O70J187
9299A9026j6028L514m230L859J172J2135L977P284j0341o916o623J519N68M32
9285I348q408j4493M296J6315J4669J0255j223j3169K093J4402l389p369n852
9272A7475m250m757m456M922J547J92J750l920R682n357L511l69L384n81L26q495
$$ plain form
9371 -5033 -5912 -3 3155 5292 4316 484 430 8367 -9304 -20193 -14467 -7324 4722 -284 -15686
9356 -15686 -25991 -31606 -23265 -17248 -5095 -6570 -6423 -1555 -6699 -11560 8950 8737 -3060 -4465
9342 -4465 -9305 -28625 -25637 -12392 -11756 -10327 1611 21420 33054 40208 33435 24314 13276 17862
9328 17862 25622 15975 -8238 -19295 -17149 6510 3974 -3410 -18037 -15751 -12761 -7864 -921 7667
9314 7667 8815 768 963 5092 10911 18934 24179 21109 13469 8300 10711 14145 17169 17839 19026
9299 19026 2998 6512 2282 6141 7313 19448 23425 30709 20368 13452 6829 8348 8916 9348
9285 9348 940 -13553 -9257 7058 21727 31982 30759 17590 19683 34085 30696 23327 17475
9272 17475 13225 8468 4012 8934 10481 10673 12423 8503 18185 12828 16339 15970 19354 18773 19099 10604
9256A0604q354J4260J1336M236N639k712j6557n131p892j0139j126P448J1354
9243A2966m661m642N263Q913m786J529P77K687q649R33M310N789q529j9444l890
9228a1434R274R01Q76K837R261M160j691J6785p206k6883o782J6884J5712m532
9214A8162r19L044p678j0427N685p624o312L64Q59J6912J0966M977k0656K726
9200A0079K165N004O517j5520k080o731m927J370P654R584M971p275j0789j8300
9186a8278L189J0550R54K73R963J3511p176P23l370p181K840n083P524O135q116
9171F458o383Q949j070o814J2812O641m273J3885J7791L979l067m096J0263m753
9157E0322j0342m691q383j5730R647M862L571J0318m058L290J3615P533q814Q607
$$ plain form
9256 10604 2250 16510 27846 32082 37721 35009 18452 13321 5429 -4710 -5836 1612 12966
9243 12966 8305 3663 8926 17839 13053 14582 15359 18046 9397 10330 14640 20429 11900 -7544 -11434
9228 -11434 -2160 -1259 -383 2454 11715 15875 14184 30969 23763 -3120 -9902 6982 22694 18162
9214 18162 17243 20287 12609 2182 7867 243 -6069 -5705 -4846 12066 23032 28009 7353 10079
9200 10079 12244 17248 23765 8245 6165 -566 -5493 -4123 3531 13115 18086 10811 22 -18278
9186 -18278 -15089 -4539 -3585 -3312 6651 20162 12986 13709 10339 3158 5998 915 8439 14574 6458
9171 6458 75 9024 7954 1140 13952 20593 16320 30205 47996 51975 48908 44812 55075 50322
9157 50322 39980 35289 26906 11176 20823 25685 29256 39574 35516 38806 52421 59954 51140 59747
9143E9747J9519L044q047P144m577l435l343n912R326K4925J0027o20o215J4445
9129A16028J1536m911Q014L3483K6362N036K3525J5002K5042K3750L4366K9384
9117C46617L0002M6111M7382N4448O9967R6612J21383J56985K11089K98017L98259
9106A876872N62572P78568R97584J176974J250653J221876J048874N24525m57747
9097H980751j285333j590568j495672j143003q01270n67561m20611l02741k27124
9088A146868j78283j43314j07996o7585n7064p6177p0087m5746k7672k6472l7944
9077C08528j8855k7515l4174j1093k068l1237k1649o005J0676j3124j9854n564
9065A28066k0128m308M15n389p854K506Q889r59j2955o493k333P37O41m11J2573
$$ plain form
9143 59747 79266 82310 74263 81407 76830 73395 70052 64140 73466 98391 108418 107798 101583 116028
9129 116028 127564 122653 130667 164150 190512 195548 219073 234075 259117 282867 317233 346617
9117 346617 376619 422730 470112 524560 594527 691139 812522 969507 1180596 1478613 1876872
9106 1876872 2439444 3218012 4215596 5392570 6643223 7865099 8913973 9438498 8980751
9097 8980751 7695418 6104850 4609178 3466175 2664905 2097344 1676733 1373992 1146868
9088 1146868 968585 825271 717275 649690 592626 516449 446362 400616 372944 346472 308528
9077 308528 289673 262158 227984 216891 214823 183586 161937 155932 166608 153484 133630 128066
9065 128066 107938 103630 104045 98656 90802 93308 102197 101238 88283 81790 79457 80194 80835 80424 92997
9050I2997l193j0124l448m113q294J557r418n701j5716q705l574R371J2328O005
9036D9972j0514O261o299j4531l71M840J78P582k703p817j2642r33o318K352Q369
9021A7426N378q335K874N448p639J7539O697P466N096o834n612j1977Q552P474
9007D3553K106j3884j0842l175P699P042k528J918J0143K136m812j6676J0011
8994C2691o856n268p851J2309O965j2875o291Q53R923K302J318J016p926L297
8980B3607O61O984j284q668N99O420j744j4785j8662o00K2076O717m510K155n722
8965A3244q656l994k570o61J2976J131k680j0751r293M820P224j956Q288J0068
8951A7190k476J870r111p363J29k330K383J0928J2975J3979O941l417q55J957
$$ plain form
9050 92997 89804 79680 76232 72119 63825 65382 55964 50263 34547 25842 22268 31639 43967 49972
9036 49972 39458 45719 39420 24889 24518 29358 29536 37118 34415 26598 13956 13023 6705 9057 17426
9021 17426 22804 14469 17343 22791 15152 32691 39388 46854 51950 45116 39504 27527 36079 43553
9007 43553 45659 31775 20933 17758 25457 32499 29971 31889 42032 44168 39356 22680 32691
8994 32691 25835 20567 12716 25025 31990 19115 12824 13677 23600 25902 27220 28236 20310 23607
8980 23607 24268 31252 29968 21300 21899 28319 26575 11790 -6872 -7472 14604 21321 16811 18966 13244
8965 13244 4588 594 -1976 -2637 10339 11470 8790 -1961 -11254 -6434 790 -1166 7122 17190
8951 17190 14714 16584 7473 110 239 -2091 292 11220 24195 38174 45115 41698 40843 42800
8937D2800K454K148j3364j2081P994J936j4099R368P858N231J1844k524j3359
8924C6206J670k660r819P593J1486k293j2751P512J2422R958L676k0076N866N175
8910E3965n983Q306o077J7348J0871R284r856n864P969J2635k114J0018J4021
8897A14523P917J5635J5112N527L2223J2439L404J9783J8707J4989M1354M4751
8885C46364L9776M6322N5843R1063J26302J28423J83918K65688M04195N97393
8875B285287Q37539J030487J126352J095215J064315O39807n32671j355371j465906
8866D725054j281546r29845o09243m09413k90884k12422j55660j17903q0434o6716
8856E70988o8258p0193m9863m7154o0323k6918q760j3951j8823j0812j7824j6312
$$ plain form
8937 42800 45254 47402 34038 21957 29951 31887 17788 27156 35014 40245 52089 49565 36206
8924 36206 37876 35216 25397 32990 44476 42183 29432 36944 49366 59324 63000 42924 48790 53965
8910 53965 47982 56288 50211 67559 78430 87714 77858 71994 79963 92598 90484 100502 114523
8897 114523 122440 138075 153187 158714 190937 203376 206780 226563 245270 260259 301613 346364
8885 346364 386140 432462 488305 579368 705670 834093 1018011 1283699 1687894 2285287
8875 2285287 3122826 4153313 5279665 6374880 7439195 8079002 7546331 6190960 4725054
8866 4725054 3443508 2513663 1904420 1495007 1204123 991701 836041 718138 637704 570988
8856 570988 502730 432537 382674 335520 275197 248279 239519 225568 206745 195933 178109 161797
8844A61797j3334q465j1885o380j0098o90j4004r995n094Q84N142j923o190m502
8830G5263M969j085o928j5787Q580o365n741Q89l015O123j655j6921j427M175
8816D1075M948L471l892j7226M916L14L05j7047K435R66j429J1718Q675j1733
8802B7496j0481J599n512m989M545K199n172R268O321P088j2185j5119R738L146
8788A7942P718P451j0298M550J245j693N520K106r816l638L130M832n132N101
8774B9018M461m505k0115k1071P294J0203N805k493J747J469q440q813J164N525
8760A249j691P116J4326l777m564o665Q261p876p412r50n767R718J2316R20k842
8745A2362r09J405m483l6958j5997K1084K4766J1674O534K558o347j3173k144
$$ plain form
8844 161797 148463 139998 128113 121733 111635 110945 96941 86946 81852 82736 87878 85955 79765 75263
8830 75263 80232 79147 72219 56432 65012 58647 52906 53795 50780 56903 55248 38327 36900 41075
8816 41075 46023 49494 45602 28376 33292 33606 33911 16864 19299 20265 18836 30554 39229 27496
8802 27496 17015 18614 13102 8113 12658 14857 9685 18953 25274 32362 20177 5058 14796 17942
8788 17942 25660 33111 22813 27363 28608 26915 32435 34541 24725 21087 24217 29049 23917 29018
8774 29018 33479 28974 8859 -12212 -4918 5285 11090 8597 10344 11813 3373 -5440 -4276 1249
8760 1249 -442 6674 21000 17223 12659 5994 14255 6379 -1033 -1983 -7750 1968 14284 15204 12362
8745 12362 11453 12858 8375 -28583 -44580 -23496 1270 12944 19478 22036 15689 2516 372
8732C72L155k53j206n688J3147P703q043K062M887j0647R01l605L628N176j1370
8717B19l440m390M598J2322j241k0396K200J0102L990K374J147Q436O657K040
8703B4618q865p488j609n73O167J912m724j3135k710j0726J721N4j114R565J6802
8688I895J175J5Q064q435r904R925R895m096m522q583L421R756L450M907R453
8673C4416Q480k0028j30K963j4402q041K41J46j5590j7186J1228R455l561r818
8659b1827j2080K39K6075J3987P616m692Q301K687n094J2223j724j1235l179M150
8645A5447j81K647j1327j2100P932P122l292o299j2039m640K508j564Q551J7660
8631A0425J1908j1148r124J0208J2848q977m280k193l114n000j1304J79N398k263
$$ plain form
8732 372 3527 3274 2068 -3620 9527 17230 9187 11249 16136 5489 6390 2785 6413 11589 219
8717 219 -3221 -7611 -3013 9309 8068 -12328 -10128 -26 3964 6338 7485 15921 22578 24618
8703 24618 15753 8265 6656 6083 12250 14162 9438 -3697 -6407 -17133 -15412 -15358 -16472 -6907 9895
8688 9895 11070 11085 19149 10714 810 10735 20630 16534 12012 3429 6850 16606 20056 24963 34416
8673 34416 42896 22868 22738 25701 11299 3258 3499 3645 -11945 -29131 -17903 -8448 -12009 -21827
8659 -21827 -33907 -33668 -7593 6394 14010 9318 17619 20306 15212 27435 25711 14476 11297 15447
8645 15447 15266 17913 6586 -5514 2418 9540 6248 -51 -12090 -16730 -14222 -15786 -7235 10425
8631 10425 22333 11185 2061 12269 25117 16140 11860 9667 6553 1553 -9751 -9572 -4174 -6437
8617f437O355j698O648J0250R127p577K423n593r610j210O03L431K689K5N865
8602A5291K0015K331j0614j1852p809j958J303k73K066J981M156J05q257L973
8588A0458P965R90r177n793r172r628R753P803J028l955R463L229m095P880j3355
8573C394r0O250q016n533K554N796R245O021j0916j3483L383j133R566Q361r766
8558E633n79p719k996Q666J9544J0495J2637P932j511J7154K4426P803j8938k9838
8544E2709k5654o863J481p611N614P599P032k953j0676O917p163q433O077P408
8530B5484n895o433J326O326K34P031q54j4148M425K211k621Q91q18k23L529K944
8514B3409R747Q420J1290J2199P244K0221K0079k399k6373m0766l7493j8780l872
$$ plain form
8617 -6437 -82 -1780 4868 15118 24245 16668 19091 13498 3888 2678 3281 6712 9401 9426 15291
8602 15291 35306 37637 27023 15171 7362 5404 6707 6434 8500 10481 14637 14742 6485 10458
8588 10458 18423 19413 10236 4443 -4729 -14357 -4604 3199 4227 272 9735 12964 8869 16749 3394
8573 3394 3304 9554 1538 -3995 -1441 4355 13600 19621 8705 -4778 -1395 -2528 7038 15399 5633
8558 5633 5054 -2665 -5661 3005 22549 33044 45681 53613 52102 69256 93682 101485 82547 52709
8544 52709 27055 20192 21673 14062 19676 27275 34307 31354 20678 27595 20432 11999 18076 25484
8530 25484 19589 13156 14482 20808 21042 28073 27219 13071 17496 19707 17086 17977 17159 16936 20465 23409
8514 23409 33156 41576 52866 65065 72309 92530 112609 110210 83837 43071 5578 -13202 -17074
8501a7074O577J9438L479O355j459o694o979J3568J7225j3492j0320k901j0184
8488b461M213P997R690m781p609O983J2104J383p434M710l7J92j7857r930Q871
8473F034M533J0565J1726j1772l108k195m511l403O690P060O556M129m296P05
8459B8713j1252n439l606J818P53n792j809L333M057q806r061M532k605m562J8877
8444I151o512J174J989n218j9438o46J9206L724p817M700N30J2773k013m380j0203
8429b980k269n500L685M117J6029M143r199j5302l64p756j7268k752N203P69O583
8414b2861P755R143L317K865j1463L744J4264J4856J4891J716j6817j4279l289
8401C842m595l948L834J3635k830o385N607K237j339N958k973N116L449q973O32
$$ plain form
8501 -17074 -10497 8941 12420 18775 17316 10622 3643 17211 34436 20944 10624 7723 -2461
8488 -2461 1752 9749 19439 14658 7049 14032 26136 27519 20085 24795 24758 24950 7093 -2837 6034
8473 6034 10567 21132 32858 21086 17978 15783 11272 7869 14559 21619 28175 32304 28008 28713
8459 28713 17461 12022 8416 10234 10987 5195 3386 6719 10776 1970 -7091 -2559 -5164 -9726 9151
8444 9151 2639 3813 5802 584 -18854 -19500 -294 3430 -4387 313 843 13616 11603 7223 -2980
8429 -2980 -5249 -10749 -7064 -2947 13082 17225 8026 -7276 -7640 -15396 -32664 -35416 -30213 -29444 -22861
8414 -22861 -15106 -5963 -2646 219 -11244 -7500 6764 21620 36511 38227 21410 7131 3842
8401 3842 -753 -4701 -867 12768 9938 3553 9160 11397 10058 16016 13043 18159 21608 12635 13267
8386A3267k537q406L95J1205J1579r231j2280J768m991j48j54q649r157J1285
8372f054R671R462r494N058J173o284J1703O411p864j539n236R297k752j9395
8358e843m802J789p158N563N479P487N930L422n299p973L729M783K0458m22r902
8343A7241N674m861j0958P36J1371L296r046m221q691j1308j5251P767J8112n784
8329e923o671J375m159j48O903R503j104j0753k32J3893N848j0264j4958j8726
8315c5416R972J1818N619L844J388k129J3881J4511l177m179l269J6452j4845
8302A4470j1929J9077j860q005r474r94P661q621j066J8544p418q110j1516o525
8288a5766j66O315K316p591J859N535j1174m814j166R424J3961L498N561R458
$$ plain form
8386 13267 10730 2324 2719 13924 25503 16272 3992 5760 769 621 467 -8182 -17339 -6054
8372 -6054 3617 13079 3585 8643 9816 3532 15235 21646 13782 12243 7007 16304 13552 -5843
8358 -5843 -10645 -8856 -16014 -10451 -4972 2515 8445 11867 6568 -1405 2324 7107 27565 27143 17241
8343 17241 22915 18054 7096 7832 19203 22499 13453 9232 541 -10767 -26018 -18251 -139 -5923
8329 -5923 -12594 -11219 -15378 -15526 -8623 880 -224 -10977 -11209 2684 8532 -1732 -16690 -35416
8315 -35416 -25444 -13626 -8007 -4163 -2775 -4904 8977 23488 20311 16132 12863 29315 14470
8302 14470 2541 21618 19758 11753 2279 1285 8946 325 -741 17803 10385 2275 -9241 -15766
8288 -15766 -15932 -9617 -7301 -14892 -13033 -7498 -18672 -23486 -24652 -15228 -1267 2231 7792 17250
8274A7250k611K17M050r178n925l953L73L421p578q752K933j91k845J1353J8691
8259A7255m802n609J4235m185L535K539j282o962j6560n220P963m077N752J1558
8245A4140O393o241p873p930L539p740k272N816p373m223J4639J0196J445L905
8231A6421J259J518N452N316k2259j1084r037j311Q483P186q254m859K456q873
8217a7586l557O424K081R489o675q17k874M400Q367P847o862n863J613l565P800
8202B22Q755M219p176K647np124m174j0560J8032J0977n566N86k967K418J1400
8187B1684k042p572j2225j5966n962J1698J3115k860p935k0j385m382J757N758
8173f337P224o284q913q14P588Q48J653J4543O93k549j8111L412J0217J0029j3462
$$ plain form
8274 17250 14639 14856 18906 9728 3803 -150 223 3644 -3934 -12686 -9753 -9944 -12789 -1436 17255
8259 17255 12453 6844 21079 16894 20429 22968 21686 14724 -1836 -7056 907 -3170 2582 14140
8245 14140 20533 14292 6419 -1511 2028 -5712 -7984 -2168 -9541 -13764 875 11071 12516 16421
8231 16421 17680 19198 24650 29966 7707 -3377 -12414 -13725 -5242 1944 -6310 -11169 -8713 -17586
8217 -17586 -21143 -14719 -12638 -3149 -9824 -10641 -13515 -9115 -748 7099 237 -5626 -4013 -7578 222
8202 222 8977 13196 6020 8667 8662 1538 -2636 -13196 4836 15813 10247 10833 7866 10284 21684
8187 21684 19642 12070 -155 -16121 -22083 -10385 2730 -130 -8065 -8085 -9470 -13852 -12095 -6337
8173 -6337 887 -5397 -14310 -15124 -7536 -6688 -5035 9508 10201 7652 -10459 -7047 3170 13199 -263
8158b63p113q49o080J0408J1699K864o87M703P187P13o377j285J3663j0639q415
8143I529o911J2966o373k093j39q250O830r534J96R129o690j0118J6601J5699
8129B0842o956j2033j2077L383J3610Q88p924j782R471J3995M349j1157q654M383
8115A0338k643J6187r39q919j1181k4139L713J8265P987j5868k118R611J154J2403
8101A3851P921m708k031O614O17l223L935l659l648o979O164l260k317l767p147
8086a637j4570L328J4247J218p812M48j2851J575J9249P440J589O131n949p676
8072D730q40j4204L502p449l999N870Q019r24k555R649n282r105P759J4345K080
8057A1596J240J0803J0808j6769r180J1162L908n867l162q784j2100j594O511
$$ plain form
8158 -263 -7376 -8225 -14305 -3897 7802 10666 9979 14682 21869 22582 16205 14920 28583 17944 9529
8143 9529 2618 15584 9211 7118 6979 -1271 5559 -3975 -3779 5350 -1340 -11458 5143 20842
8129 20842 13886 1853 -10224 -6841 6769 7657 -267 -2049 7422 21417 25766 14609 5955 10338
8115 10338 7695 23882 22943 14024 2843 -21296 -17583 682 8669 -7199 -9317 294 1448 13851
8101 13851 21772 17064 15033 21647 22264 19041 22976 19317 15669 8690 14854 11594 9277 5510 -1637
8086 -1637 -16207 -12879 1368 2586 -5226 -4778 -17629 -16054 3195 10635 12224 18355 12406 4730
8072 4730 3890 -10314 -6812 -14261 -18260 -12390 -4371 -5295 -7850 1799 -3483 -12588 -4829 9516 11596
8057 11596 12836 23639 34447 17678 8498 19660 23568 17701 14539 5755 -6345 -7939 -1428
8044a428j365o979q934J913J582Q162P119j677K193n128O152n443n299J2431j223
8029B076J759P217l266J7269Q38O43j0132O547P24m706j6222j1727l025O487N448
8014g0L342r100J389L58r8k195j0180n859n001N807M888P082n556Q310K959J3991
7998A0067P984m465j1890r697P79J0481n280q72L308j900J4156N421q327j0162
7984c97k577J6893P011m75p81o62j1925q71o675L444J7450k625r315q572n176
7969e253j2514L653P270l771o880O54M00K732P786k505q049q933M992O23R508
7954a0287k091p789P861P156M162J0601J9873J4121J500j5041j4819o844n220
7941C183k471q127N210N139M336l475m36m145j2733r117J0840N798l679N680q79
$$ plain form
8044 -1428 -2793 -9772 -18706 -16793 -15211 -7049 70 -1607 586 -4542 1610 -3833 -9132 3299 2076
8029 2076 3835 11052 7786 25055 25893 26536 16404 22951 23675 18969 2747 -8980 -12005 -5518 -70
8014 -70 3272 -5828 -4439 -4081 -4179 -6374 -16554 -22413 -27414 -21607 -16719 -9637 -15193 -6883 -3924 10067
7998 10067 18051 13586 1696 -8001 -7222 3259 -2021 -2893 415 -1485 12671 18092 9765 -397
7984 -397 -2974 13919 20930 20455 19674 19012 7087 6216 -459 2985 20435 17810 8495 -77 -5253
7969 -5253 -17767 -14114 -6844 -10615 -17495 -16841 -16441 -13709 -5923 -8428 -16477 -25410 -20418 -19795 -10287
7954 -10287 -12378 -20167 -12306 -5150 -988 9613 29486 43607 45107 30066 15247 8403 3183
7941 3183 712 -7415 -2205 2934 7270 3795 3359 -786 -13519 -22636 -11796 -5998 -9677 -3997 -4876
7926d876L50J0837J425L251o349j901l13J3172k923K475j0155j4402l861J3639
7912C69o403m38R514N834J1204M54p61p702o48K659j1916j5549l840O448n757
7897a6532j0455J1445J1389R43J3211l225j5924r484J430q983J0821J0385j288
7884f267o988r441N831L668k938Q969P714r091j1456O453L435k157m873R810j1769
7869a9100Q827P434K89Q704n672k937K566L417n66m422q97J486o853Q311J8709
7854A9296K714j3962j2005j0674o357K271M736j218Q327J2724R327j03p1o7k985
7839A1953j6755J2200m413m292N598l080p358Q700k821j0094K185P067k782J645
7825b247n091Q875J2507j0791p201m054k31J563o241p446P451O340M734j294o694
$$ plain form
7926 -4876 -4526 6311 7736 10987 4638 2737 2424 15596 12673 15148 4993 -9409 -13270 369
7912 369 -6034 -6472 3042 8876 20080 20534 19773 12071 11423 14082 2166 -13383 -17223 -10775 -16532
7897 -16532 -26987 -15542 -4153 -3210 10001 6776 -9148 -18632 -17202 -26185 -15364 -4979 -6267
7884 -6267 -13255 -22696 -16865 -13197 -16135 -7166 548 -8543 -19999 -13546 -10111 -12268 -17141 -7331 -19100
7869 -19100 -10273 -2839 -2550 6154 482 -2455 111 3528 2962 -1460 -2357 -871 -7724 587 19296
7854 19296 22010 8048 -3957 -14631 -20988 -18717 -13981 -15199 -6872 5852 15179 15076 15005 14938 11953
7839 11953 -4802 7398 2985 -1307 4291 1211 -6147 2553 -268 -10362 -8177 -1110 -3892 -2247
7825 -2247 -7338 1537 14044 3253 -3948 -8002 -8233 -6670 -12911 -20357 -12906 -6566 -1832 -3126 -9820
7810i820K69o180r310J3488L102k126P822J0021k2090j1879L035N774J4278P919
7796D303J622L633r038l939j1370m312O897J3278k159r370l976J0597J050n780
7782h564q043j34P58J14k631oJ386j5645R697J2901p608k9917P042K0970J6118
7767c562m856M648l117j416m667r770l747Q201J0235K1561L529j7736j7079N158
7753a2618O88R110K314Q343M08L903N512L561p985k1768o995M929O541N215j214
$$ plain form
7810 -9820 -9551 -15731 -25041 -11553 -8451 -10577 -2755 7266 -14824 -26703 -23668 -17894 -3616 4303
7796 4303 5925 9558 520 -3419 -14789 -19101 -12204 1074 -1085 -10455 -14431 -3834 -2784 -8564
7782 -8564 -16607 -16741 -15983 -15869 -18500 -18506 -17120 -32765 -23068 -10167 -17775 -47692 -40650 -19680 -3562
7767 -3562 -8418 -3770 -6887 -8303 -12970 -22740 -26487 -18286 -8051 13510 17039 -697 -17776 -12618
7753 -12618 -11930 -2820 -506 7837 8245 12148 17660 21221 13236 -8532 -15527 -10598 -4057 1158 -56
$$ [...]
##END NTUPLES=NMR SPECTRUM
##END=
