##TITLE=Analysis number 324800
Compound Code mo 07919
Book Reference 499/162/7
Project Code adrs
Chemist Name stuartg
##JCAMPDX= 6.0         $$ Bruker NMR JCAMP-DX V2.0
##DATA TYPE= NMR SPECTRUM
##DATA CLASS= NTUPLES
##ORIGIN= Bruker BioSpin GmbH
##OWNER= nmr
$$ XWIN-NMR		Version 3.5
$$ Fri Dec  1 10:06:37 2006 GMT Standard Time (UT+0h)  MAYBRIDGE\nmr@NMR_250MHZ
##.OBSERVE FREQUENCY= 250.131544655141
##.OBSERVE NUCLEUS= ^1H
##.ACQUISITION MODE= SIMULTANEOUS (DQD)
##.ACQUISITION SCHEME= undefined
##.AVERAGES= 16
##.DIGITISER RES= 18
##SPECTROMETER/DATA SYSTEM= dpx250
##.PULSE SEQUENCE= zg30
##.SOLVENT NAME= DMSO
##.SHIFT REFERENCE= (INTERNAL, DMSO, 0, 16.522)
##AUDIT TRAIL= $$ (NUMBER, WHEN, WHO, WHERE, WHAT)
$$ ##TITLE= Audit trail, XWIN-NMR		Version 3.5
$$ ##JCAMPDX= 5.01
$$ ##ORIGIN= Bruker BioSpin GmbH
$$ ##OWNER= nmr
$$ C:\u/data/dgb/nmr/ADRS/40/pdata/1/auditp.txt
$$ ##AUDIT TRAIL=  $$ (NUMBER, WHEN, WHO, WHERE, WHAT)
(   1,<2006-12-01 10:06:14.66 +000>,<MAYBRIDGE\nmr>,<NMR_250MHZ>,
      <created by zg, POWCHK disabled, PULCHK disabled
       configuration hash MD5:
       49 4B E0 1D 92 C2 6B 37 9F E6 65 BC 52 41 86 1D
       data hash MD5: 64K
       AA B9 7C 9C A8 30 4D 57 15 60 07 0C F7 C5 1F F9>)
(   2,<2006-12-01 10:06:27.71 +000>,<MAYBRIDGE\nmr>,<NMR_250MHZ>,
      <Start of raw data processing
       ef LB = 0.3 FT_mod = 6 PKNL = 1 SI = 32K 
       data hash MD5: 32K
       F2 93 C1 6A 18 9E 87 8D 94 C2 04 9C 86 E6 4F FC>)
(   3,<2006-12-01 10:06:30.11 +000>,<MAYBRIDGE\nmr>,<NMR_250MHZ>,
      <apk 
       data hash MD5: 32K
       18 1E 77 8F 17 1C 02 F9 F0 09 B8 36 E3 58 17 35>)
(   4,<2006-12-01 10:06:30.94 +000>,<MAYBRIDGE\nmr>,<NMR_250MHZ>,
      <abs ABSG = 5 
       data hash MD5: 32K
       EA 2A 5C 27 A2 CE 02 89 B1 FF 30 AD 5F 9D 1E 34>)
$$ ##END=
$$ 
$$ hash MD5
$$ 4C F0 A7 B4 B4 F0 36 38 35 CE 45 13 85 24 8B 21
##$RELAX= 
##$RELAX= 
##$RELAX= 
##$RELAX= 
##$RELAX= 
##$RELAX= 
##$RELAX= 
$$ Bruker specific parameters
$$ --------------------------
##$DU= <C:\u>
##$EXPNO= 40
##$NAME= <ADRS>
##$PROCNO= 1
##$TYPE= <nmr>
##$USER= <dgb>
##$AMP= (0..31)
100 100 100 100 100 100 100 100 100 100 100 100 100 100 100 100 100 100 
100 100 100 100 100 100 100 100 100 100 100 100 100 100 
##$AQSEQ= 0
##$AQ_mod= 3
##$AUNM= <au_zg>
##$AUTOPOS= <10 >
##$BF1= 250.13
##$BF2= 250.13
##$BF3= 250.13
##$BF4= 250.13
##$BF5= 500.13
##$BF6= 500.13
##$BF7= 500.13
##$BF8= 500.13
##$BYTORDA= 1
##$CFDGTYP= 0
##$CFRGTYP= 5
##$CHEMSTR= <none>
##$CNST= (0..31)
1 1 145 1 1 1 1 1 1 1 1 1 1 1 1 1 1 1 1 1 1 1 1 1 1 1 1 1 1 1 1 1 
##$CPDPRG= <>
##$CPDPRG1= <>
##$CPDPRG2= <>
##$CPDPRG3= <>
##$CPDPRG4= <mlev>
##$CPDPRG5= <mlev>
##$CPDPRG6= <mlev>
##$CPDPRG7= <mlev>
##$CPDPRG8= <mlev>
##$CPDPRGB= <>
##$CPDPRGT= <>
##$D= (0..31)
0 1 0 0 0 0 0 0 0 0.06 0 0 0 0 0 0 0.0002 0 0 0 0 0 0 0 0 0 0 0 0 0 0 
0 
##$DATE= 1164967573
##$DBL= (0..7)
120 120 120 120 120 120 120 120 
##$DBP= (0..7)
150 150 150 150 150 150 150 150 
##$DBP07= 0
##$DBPNAM0= <>
##$DBPNAM1= <>
$$ [...]
##$SUBNAM6= <"">
##$SUBNAM7= <"">
##$SUBNAM8= <"">
##$SUBNAM9= <"">
##$SW= 20.6930455092707
##$SWIBOX= (0..15)
0 0 3 0 0 0 0 0 0 0 0 0 0 0 0 0 
##$SW_h= 5175.983436853
##$TD= 65536
##$TD0= 1
##$TE= 295.16
##$TE2= 300
##$TE3= 300
##$TEG= 300
##$TL= (0..7)
0 120 120 120 120 120 120 120 
##$TP= (0..7)
150 150 150 150 150 150 150 150 
##$TP07= 0
##$TPNAME0= <>
##$TPNAME1= <>
##$TPNAME2= <>
##$TPNAME3= <>
##$TPNAME4= <>
##$TPNAME5= <>
##$TPNAME6= <>
##$TPNAME7= <>
##$TPOAL= (0..7)
0.5 0.5 0.5 0.5 0.5 0.5 0.5 0.5 
##$TPOFFS= (0..7)
0 0 0 0 0 0 0 0 
##$TUNHIN= 0
##$TUNHOUT= 0
##$TUNXOUT= 0
##$USERA1= <user>
##$USERA2= <user>
##$USERA3= <user>
##$USERA4= <user>
##$USERA5= <user>
##$V9= 5
##$VALIST= <valist>
##$VCLIST= <CCCCCCCCCCCCCCC>
##$VD= 0
##$VDLIST= <DDDDDDDDDDDDDDD>
##$VPLIST= <PPPPPPPPPPPPPPP>
##$VTLIST= <TTTTTTTTTTTTTTT>
##$WBST= 1024
##$WBSW= 4
##$XGAIN= (0..3)
0 0 0 0 
##$XL= 0
##$YL= 0
##$YMAX_a= 189842
##$YMIN_a= -291072
##$ZGOPTNS= <>
##$ZL1= 120
##$ZL2= 120
##$ZL3= 120
##$ZL4= 120
##$ABSF1= 16.522
##$ABSF2= -4.171173
##$ABSG= 5
##$ABSL= 3
##$ALPHA= 0
##$AQORDER= 0
##$ASSFAC= 0
##$ASSFACI= 0
##$ASSFACX= 0
##$ASSWID= 0
##$AUNMP= <proc_1d>
##$AZFE= 0.1
##$AZFW= 0.1
##$BCFW= 0
##$BC_mod= 0
##$BYTORDP= 0
##$COROFFS= 0
##$CY= 12.5
##$DATMOD= 1
##$DC= 0
##$DFILT= <>
##$DTYPP= 0
##$F1P= 14.0000005364418
##$F2P= -0.99999901652339
##$FCOR= 0.5
##$FTSIZE= 32768
##$FT_mod= 6
##$GAMMA= 0
##$GB= 0
##$INTBC= 1
##$INTSCL= 1
##$ISEN= 128
##$LB= 0.3
##$LEV0= 0
##$LPBIN= 0
##$MAXI= 10000
##$MC2= 0
##$MEAN= 0
##$ME_mod= 0
##$MI= 0
##$NCOEF= 0
##$NC_proc= -5
##$NLEV= 6
##$NOISF1= 0
##$NOISF2= 0
##$NSP= 0
##$NTH_PI= 0
##$NZP= 0
##$OFFSET= 16.522
##$PC= 1
##$PHC0= 200.5805
##$PHC1= 20.6067
##$PH_mod= 1
##$PKNL= yes
##$PPARMOD= 0
##$PSCAL= 4
##$PSIGN= 0
##$REVERSE= no
##$SF= 250.13
##$SI= 32768
##$SIGF1= 0
##$SIGF2= 0
##$SINO= 400
##$SIOLD= 32768
##$SREGLST= <1H.DMSO>
##$SSB= 0
##$STSI= 32768
##$STSR= 0
##$SW_p= 5175.98343685301
##$SYMM= 0
##$S_DEV= 0
##$TDeff= 65536
##$TDoff= 0
##$TI= <Analysis number 999999
Compound Code 99
Book Reference 9
Project Code 9>
##$TILT= no
##$TM1= 0
##$TM2= 0
##$TOPLEV= 0
##$USERP1= <user>
##$USERP2= <user>
##$USERP3= <user>
##$USERP4= <user>
##$USERP5= <user>
##$WDW= 1
##$XDIM= 32768
##$YMAX_p= 402490172
##$YMIN_p= -644357
$$ End of Bruker specific parameters
$$ ---------------------------------
##NTUPLES= NMR SPECTRUM
##VAR_NAME=  FREQUENCY,     SPECTRUM/REAL,   SPECTRUM/IMAG
##SYMBOL=    X,             R,               I
##VAR_TYPE=  INDEPENDENT,   DEPENDENT,       DEPENDENT
##VAR_FORM=  AFFN,          ASDF,            ASDF
##VAR_DIM=   32768,         32768,           32768
##UNITS=     HZ,            ARBITRARY UNITS, ARBITRARY UNITS
##FACTOR=    0.157963299565203, 1,           1
##FIRST=     4132.6476996994, 0,             0
##LAST=      -1043.33573715361, 0,           0
##MIN=       -1043.33573715361, -644357,     0
##MAX=       4132.6476996994, 402490172,     0
$$ Real data points
##PAGE= N=1
##DATA TABLE= (X++(R..R)), XYDATA
$$ [...]
22780a3228J8845m0672J02865J21216k9948k627O6504P21j39536r6775K9121k5442
22768h956q5734r2195L7955M0290P5561L3075J25632M1026J1412o4083r9562J1451
22756B5872M1005J22130P3444L8559j85355p5644p9398j7004N9791M2656r6996
22745e0940o8178O044J8689Q3589Q2950M8624M5748o2086j50802q4338J0004R1827
22733b8869J63909K3073j32542R6136k9440r1186O6577L698j2548k2838j276o3389
22721b8695n0723l0348L6535O1831P3068p9031j4037Q1666J22661Q174j65996
22710A5105K9058K9710l6562j72560o9223J38996o136q7158j6314J11718R8393
22699C5027o2406n3840N983M6947J9736r5190j5209p8654J23870P5256L9394R4627
$$ plain form
22780 -13228 5617 -35055 67810 189026 159078 156451 222955 223676 84140 -12635 16486 -8956
22768 -8956 -94690 -186885 -148930 -108640 -33079 -4 125628 166654 178066 113983 14421 25872
22756 25872 66877 189007 262451 301010 115655 40011 -39387 -56391 3400 46056 -50940
22745 -50940 -119118 -113074 -94385 -10796 72154 120778 166526 104440 -46362 -130700 -120696 -28869
22733 -28869 135040 158113 25571 121707 92267 1081 67658 71356 58808 35970 34694 -28695
22721 -28695 -79418 -109766 -73231 -11400 61668 -17363 -31400 50266 172927 181101 15105
22710 15105 44163 73873 37311 -135249 -204472 -65476 -71612 -158770 -175084 -63366 35027
22699 35027 -27379 -81219 -75236 -28289 -8553 -103743 -118952 -197606 -73736 1520 40914 135541
22687A35541M04k1941n1692j08952o2753Q4122J15352j9628k6652m2796M5088
22676D6093k8692M9041j5759n5334j37430P9569K7163m296Q7941J354n1078j4776
22664a6204J2352M1328Q9771p7699n2973k3817R3485L4119K1407q6078j11661
22653g5970M1292O767k5869L1841J63748L5454m1353O3755m2599j41783L4287
22642D9570J01165m0776j15354q360O3035L3774m223L2019M194k4121O0630j51483
22630G0j28664J4940k7524K6648J12352O252J2765M5978N7203M551J7640j5984
22618A26227j6540j2862L9782N6538m2837j58144J9953J08437M0073J9609J31776
22607C12012J7575m1900j73974j32606K4665P0430j44868J3689n5019K1541L4459
$$ plain form
22687 135541 135945 114004 62312 -46640 -109393 -25271 90081 70453 43801 1005 46093
22676 46093 17401 66442 50683 -4651 -142081 -62512 -35349 -39645 48296 49650 -1428 -16204
22664 -16204 -3852 37476 127247 49548 -3425 -27242 66243 100362 121769 35691 -75970
22653 -75970 -34678 -27911 -53780 -21939 141809 177263 135910 199665 157066 15283 49570
22642 49570 150735 109959 -5395 -13755 49280 83054 78831 110850 115044 90923 151553 70
22630 70 -128594 -113654 -141178 -114530 -2178 4074 16839 62817 120020 124571 142211 126227
22618 126227 109687 96825 136607 193145 150308 -7836 12117 120554 160627 180236 312012
22607 312012 329587 287687 113713 -18893 5772 76202 -68666 -54977 -109996 -88455 -53996
22596e3996M4054L2378K0857j2649j06416m3118n4319J05638N2642Q922l9975
22585d5982j3310N8178P8732l2270q4923k03R6339j0772o4462l2869P2190M044
22573B4692N7351M9141l8515j9238j31299n6635j0398J66302M4987j64208J21566
22562D3746Q0931l3774j01255k2859O6071L976l9429N410o4149N6451K0975p0544
22550e4450m0540O011Q5961J52155L7322k2510k6139n4607m1313k6460R398m1272
22538a6444m4252K3Q8724o0234j3881K4927m6576J3345r4788J453L7598k682o6880
22525a79667Q312N6498L7005k8146j10448O1523J66507m3323j10640L957Q310
22514a30112J39021Q0238k625j03759j0977M7334K09031N0755r3033k8443m9497
$$ plain form
22596 -53996 -9942 22436 43293 30644 -75772 -118890 -173209 -67571 -14929 -6007 -45982
22585 -45982 -59292 -1114 77618 45348 -39575 -39778 56561 45789 -18673 -51542 20648 24692
22573 24692 82043 131184 92669 73431 -57868 -114503 -124901 41401 86388 -77820 43746
22562 43746 124677 90903 -10352 -33211 32860 36836 -2593 2817 -61332 -4881 16094 -54450
22550 -54450 -94990 -88979 -3018 149137 186459 163949 137810 83203 41890 15430 24828 -16444
22538 -16444 -60696 -60673 28051 -32183 -46064 -21137 -67713 -54368 -149156 -147703 -110105 -112787 -179667
22525 -179667 -171355 -114857 -77852 -105998 -216446 -154923 11584 -31739 -142379 -138422 -130112
22514 -130112 8909 89147 86522 -17237 -28214 19120 228151 278906 185873 157430 107933
22503A07933l2738j26899j19207L3527o783M3289M3837J6524l7960O0114l5555
22492e3918k1412O8505j8324M334j11943p268J19735J6863O7559L7511j03674
22481b032q4000K9198L1836J23980J10092R1017j06571j25746j4713m3683O2497
22470G1875k431M7255p4465q9564R7807N9797J35852M5183j16804j44060j04670
22459g4225r847J9802L4340k0031K2348J4395j36778p9533J06957J14070m6316
22448e4818l0134o5267O6557J1378N9551P1789N660K7948K9626J27327j9455k0791
22436B09371r3541j83692l1095R3945P6165m7051m0597o5556K546l4995Q683O8009
22424c7808K2689J7052n9931o3160L5618n3109j8092J34933p9185p6332O1557
$$ plain form
22503 107933 75195 -51704 -170911 -137384 -144167 -100878 -57041 -40517 -78477 -18363 -53918
22492 -53918 -75330 -6825 -25149 -20815 -132758 -140026 -20291 -3428 64131 101642 -2032
22481 -2032 -86032 -56834 -24998 98982 209074 300091 193520 67774 53061 9378 71875
22470 71875 69444 116699 42234 -47330 50477 110274 246126 291309 174505 30445 -74225
22459 -74225 -84072 -64270 -29930 -49961 -27613 -13218 -149996 -229529 -122572 -8502 -54818
22448 -54818 -84952 -150219 -83662 -72284 -12733 59056 64716 92664 122290 249617 230162 209371
22436 209371 115830 -67862 -98957 -5012 71153 24102 -16495 -82051 -79505 -114500 -105817 -37808
22424 -37808 -15119 1933 -57998 -121158 -85540 -138649 -156741 -21808 -100993 -177325 -115768
22413a15768j309p0578m5236J55019J14010l599m8585N1957M7700M5000j03432
22402B5179q6799m6072m693J90575L1957j6745J03886N5098j464n3488p3104j8929
22390A05401r8312o5311r2918j8824P3673J01365l4219n5030r6230M8861K6501
22379a05043k1020j7485q304J724L617M1895l1266j74264K5934J33067N518N2505
22367i3122l0472P488Q2359L3939N6434N6143m0956j41250L3703j2047M458J6245
22355b7078l3351q0954j58345r5681J56617N9249j4347J8639M6759J1730R0345
22344b6417l1882J2008q5256j5776P1009j3227J60090M0516j95l3958j28743N4519
22332B688O4708k0330l0630j30342l7994M2785K7889L6483N1069R1792K7801m9027
$$ plain form
22413 -115768 -117077 -187655 -232891 -77872 36138 32539 -16046 35911 83611 128611 25179
22402 25179 -61620 -107692 -112385 78190 110147 93402 197288 252386 250922 197434 124330 105401
22390 105401 7089 -58222 -151140 -169964 -96291 5074 -29145 -84175 -180405 -131544 -105043
22379 -105043 -126063 -143548 -151852 -150128 -146511 -104616 -135882 -310146 -284212 -151145 -145627 -93122
22367 -93122 -123594 -116106 -33747 192 56626 112769 71813 -69437 -35734 -47781 -43323 -27078
22355 -27078 -60429 -141383 -299728 -395409 -238792 -179543 -193890 -175251 -128492 -116762 -26417
22344 -26417 -58299 -46291 -131547 -147323 -76314 -89541 70549 111065 110870 76912 -51831 2688
22332 2688 67396 47066 16436 -113906 -151900 -109115 -81226 -44743 6326 98118 125919 76892
22320G6892j0534q3213m5393J1529J08678J5153o261j27200M2767L8678m0977
22309a9881q8134j6357k7158q2295R7610P7045O1593O3772l3343n8289k6397J5840
22297c5994M9604J29395p0276j77379o6657O8633Q3712L8297m5742n9446N1421
22286c4432L189M7867o724j9021l8606N8649j4983R217J5253M3270J03501o1212
22274A05968j20959l4850m1521R7342m9407q4885k5280N4175k2734j2352k1354
22263a55857L0329N9178R0819P9369j62134j07700M7586k4822O7099O8488n6351
22252f3996j6808J12415L1436m3929p6499k1523L840J7740r196M1837R2773P075
22240G5165l3203n6764j73640J1611O5674J31007Q228m7356k8271q0741J03862
$$ plain form
22320 76892 66358 -16855 -62248 -50719 57959 73112 66851 -60349 -17582 21096 -19881
22309 -19881 -108015 -124372 -151530 -233825 -136215 -59170 2423 66195 32852 -25437 -51834 -35994
22297 -35994 13610 143005 72729 -104650 -171307 -102674 -18962 19335 -26407 -85853 -34432
22286 -34432 -31243 16624 9900 -9121 -47727 10922 -4061 5156 20409 63679 167180 105968
22274 105968 -14991 -49841 -91362 5980 -43427 -128312 -153592 -99417 -122151 -134503 -155857
22263 -155857 -125528 -66350 24469 103838 -58296 -165996 -118410 -143232 -76133 -7645 -63996
22252 -63996 -80804 31611 63047 19118 -57381 -78904 -75064 -57324 -66520 -24683 68090 75165
22240 75165 41962 -14802 -188442 -176831 -111157 19850 28078 -19278 -47549 -128290 -24428
22229b4428K8297l0435q918L772n9736j3433M7144N6367N1012j6323l9765k2538
22217b8984M6472q6099q3380m3241J31981N0530m5449m347J04649k8906k1941
22206h715o5095K2162P6328K4043o9968k0062R2790M3144o5069o1427J590O9202
22194C8923J56598N7308j40835q8389j38298Q7216R5628p3407l3077l2614l616
22183g4563L8425L6111Q479n6370l5822o976o5920k6144J03621P6893q4807K0569
22171f6504N9418m3739o7914n2900K6210L3583P5563J3831n7070o5098m2353K8252
22159a58721J13770j3708j06528l6655J69531Q3534l8564l2980j9954O6575k6688
22148c88n7251j36965K944J29546N8792k5879k1772K6790J7090n2495o2511K479
$$ plain form
22229 -24428 3869 -26566 -35484 -31712 -91448 -104881 -57737 -1370 49642 33319 -6446 -28984
22217 -28984 17488 -68611 -151991 -195232 -63251 -12721 -58170 -62517 42132 13226 -8715
22206 -8715 -73810 -51648 24680 48723 -21245 -41307 51483 94627 29558 -31869 -30279 38923
22194 38923 195521 252829 111994 23605 -114693 -27477 68151 -5256 -38333 -70947 -74563
22183 -74563 -36138 -27 8452 -47918 -83740 -90716 -156636 -182780 -79159 -2266 -87073 -66504
22171 -66504 -7086 -50825 -118739 -171639 -145429 -111846 -36283 -22452 -79522 -144620 -186973 -158721
22159 -158721 -44951 -58659 -165187 -201842 -32311 51223 12659 -20321 -40275 26300 -388
22148 -388 -57639 -194604 -191660 -62114 -3322 -29201 -50973 -24183 -7093 -59588 -122099 -119620
22136a19620Q5804R881P324O9198r713l4450K7502m4418l7753n6969l5345Q8567
22124d9992L9671o5564K380O5393q031n4288n7283o719P83J3299P5664Q4866M3016
22111H3195p6137j2089m3637o9531Q8743L3168n2093j7544N0655O2565m3254J70951
22099A74992m4733j40704Q5115L0218o787l3577j12928n5606j5558j17891J6038
22088b21421K07748N5733m222m7813j04021j03147k3191l9778J24771K20060o8971
22077d252l4205p9553l521O7984j1283n8931J2268R6050n5123j16665K9868J04787
22065e2576P7702M5092j40396o6835j176l8269L7040m4077K426r8262O319r560
22053b82572l3041Q6831J56115K4602O5116Q2713M0695m3679j20617R822K3395
$$ plain form
22136 -119620 -33816 -23935 -16611 52587 42874 8424 35926 -8492 -46245 -103214 -138559 -49992
22124 -49992 -10321 -75885 -73505 -8112 -16143 -70431 -127714 -134433 -133650 -120351 -44687 40179 83195
22111 83195 7058 -5031 -48668 -118199 -29456 3712 -48381 -65925 -15270 47295 4041 174992
22099 174992 130259 -10445 74670 104888 98101 64524 -48404 -104010 -119568 -237459 -221421
22088 -221421 -13673 42060 37838 -9975 -113996 -217143 -240334 -280112 -155341 64719 -4252
22077 -4252 -38457 -118010 -121531 -53547 -64830 -123761 -111493 -15443 -70566 -187231 -157363 -52576
22065 -52576 25126 70218 -70178 -137013 -138189 -176458 -139418 -183495 -181069 -279331 -273012 -282572
22053 -282572 -315613 -228782 -72667 -48065 17051 99764 140459 96780 -23837 -14015 9380
22042I380M8174P1005n9869j77481m0614p1781M6826J6806J2052j5401m1074o4495
22030b66472L6585M6308N5021o8022m3106P0864P4775p4129n7960N5091L1125
22019a39920J34939n0908J7057m0847q3151P6096N6473R084J8260p4224m4683
22008a21824l9789q211Q2798O1511j84926o0221o607K4046Q9245J08798L8079
21997a7101J2132K9641j48957O3985k5425j04698L4882J1132N0654n2088r6076
21986b41919N1588M8344r7847J4151N7092p5712j5467L6150O1212l6793n4614
21975b53815M6125J06161J74779L1304J2461j23626K0506O8977J1283l8430o5459
21964i734n0527n6651P9549K2250k0900j7705L367Q325q490j38610j09148K2097
$$ plain form
22042 9380 57554 128559 68690 -108791 -149405 -221186 -174360 -157554 -145502 -160903 -201977 -266472
22030 -266472 -229887 -183579 -128558 -196580 -239686 -168822 -94047 -168176 -226136 -171045 -139920
22019 -139920 -4981 -55889 -38832 -79679 -162830 -86734 -30261 -21177 -2917 -77141 -121824
22008 -121824 -161613 -169824 -87026 -25515 -210441 -270662 -277269 -253223 -163978 -55180 -17101
21997 -17101 -4969 24672 -124285 -60300 -85725 -190423 -155541 -144409 -93755 -145843 -241919
21986 -241919 -190331 -141987 -239834 -225683 -168591 -244303 -259770 -223620 -162408 -199201 -253815
21975 -253815 -207690 -101529 73250 104554 117015 -6611 13895 82872 94155 55725 -9734
21964 -9734 -60261 -116912 -37363 -15113 -36013 -53718 -50351 -42026 -50516 -189126 -298274 -276177
21952b76177J14550Q6795m5884o4230P6132p4991k7348Q6239M7708R0850m2738
21941b9094j63674l3934L6371j3257P1055J10185N0462M3292r767l4681j27155
21930a00197l9329J2193L5059P0192j5250L4865J5715o6505n6472J8K4311l2614
21918a18014l015O037j7423r3819k8381Q1838k64k6546M5385l6946j7591p7234
21906b85973L0359K63734P6018q743l3468q1818K3457J264O0643K014m6444m0909
21894c9866N6203M3886L2530j3090Q299l0748M9982o652j2296n8047Q269j8036
21882B0434K1242j20423j03051K1770l3673j943J29174j31218o862R0150K4215
21871i0185M7769p402j8272o2333P3l7996J1707L2638Q9308K2676K5997q8926
$$ plain form
21952 -276177 -161627 -74832 -120716 -184946 -108814 -183805 -211153 -124914 -77206 13644 -29094
21941 -29094 -192768 -226702 -190331 -203588 -132533 -22348 28114 71406 61639 26958 -100197
21930 -100197 -139526 -127333 -92274 -22082 -37332 -2467 13248 -53257 -109729 -109711 -85400 -118014
21918 -118014 -121029 -114992 -132415 -226234 -254615 -172777 -173041 -199587 -154202 -191148 -208739 -285973
21906 -285973 -255614 8120 84138 75395 41927 -39891 -16434 -15170 45473 47487 1043 -39866
21894 -39866 16337 60223 92753 79663 87962 57214 107196 100544 88248 30201 38470 20434
21882 20434 41676 -78747 -181798 -160028 -193701 -195644 -66470 -197688 -204550 -114400 -90185
21871 -90185 -42416 -49818 -68090 -130423 -130350 -168346 -156639 -124001 -34693 -12017 13980 -74946
21859g4946M8055m6172m1386R0308J245N9110k782l4896j98196N1102Q6087Q7768
21847B5297M2565l4456J4361q7634r5870l7772l1039O9425O541J5395N8858n6327
21835a10656J9848n9371L0223J8523j8220q3802k8961M1808j03349m3774J05072
21824b32659J01848m5984j12600O2765J76979J4601j52845m5514J44857K9566
21814e8986o8861L2398R8017q5538l1334L1944L4614k2536P4723N3655k7981j43900
21802a13785J06097k870M4995l5644r8833j9922N231N7243k3326k8070M3388P7774
21790A2278r1884m9256L6985N2344P5570j13557p6343L3417J50534m0625l0738
21779d1275m1869Q022j65564r9864J02800N4538J3675P2880M3257J32489J4148
$$ plain form
21859 -74946 -26891 -73063 -114449 -24141 -22896 36214 33432 -1464 -199660 -148558 -62471 25297
21847 25297 67862 33406 47767 -39867 -135737 -173509 -204548 -135123 -128582 -113187 -54329 -110656
21835 -110656 -90808 -150179 -119956 -101433 -119653 -203455 -232416 -190608 -293957 -337731 -232659
21824 -232659 -130811 -176795 -289395 -226630 -49651 -35050 -187895 -233409 -88552 -58986
21814 -58986 -127847 -95449 2568 -82970 -114304 -82360 -47746 -70282 4441 58096 30115 -113785
21802 -113785 -7688 -10558 34437 -1207 -100040 -119962 -114731 -57488 -80814 -108884 -65496 12278
21790 12278 -79606 -128862 -91877 -39533 36037 -77520 -153863 -120446 30088 -10537 -41275
21779 -41275 -83144 -75122 -240686 -340550 -237750 -183212 -169537 -96657 -53400 79089 93237
21768I3237K5032q5046l2580j45684l6581m3153O53Q2854K9530r3890p4803L5883
21756b44548M9255Q5167N1339p9428k6017l7455R8961k9763l4095N1496J5123
21745i9965M3491o565M4538q9460j28099Q6848O6136o8171N8138j9493R89m253
21733a15866J31511M5565K461r8655L3498O0446j9469j11609m9897k6895J733
21722a47177L7241Q184M5319m3646o1752K1269Q0395Q241q1472j06791L6007M1556
21710a62626O4604N7761J02725R5524k9886j36780k4594R9971p8843j16694j12474
21699b41312j20858n383Q2744O1853k9130J2629J07864j11754j2750K5384L3748
21688a96965p166m2837m2830J2859N1274J02659K6182l5822l3314R0267l4923
$$ plain form
21768 93237 118269 33223 643 -145041 -181622 -224775 -224122 -141268 -111738 -205628 -280431 -244548
21756 -244548 -195293 -110126 -58787 -138215 -164232 -201687 -102726 -132489 -166584 -115088 -99965
21745 -99965 -56474 -63039 -18501 -107961 -236060 -149212 -83076 -151247 -93109 -112602 -111613 -115866
21733 -115866 15645 61210 63671 -34984 -1486 58960 39491 -72118 -122015 -148910 -147177
21722 -147177 -109936 -101752 -56433 -100079 -161831 -140562 -60167 -51926 -133398 -240189 -204182 -162626
21710 -162626 -98022 -40261 62464 157988 128102 -8678 -33272 66699 -12144 -128838 -241312
21699 -241312 -362170 -367553 -284809 -222956 -252086 -239457 -131593 -243347 -256097 -230713 -196965
21688 -196965 -204131 -246968 -289798 -276939 -225665 -123006 -96824 -132646 -165960 -75693 -110616
21677a10616n1737R0945j02892l4155R0490O2291r458q7286J3209J17992k4580
21666d5797m2615K4188M1650N9057r782n4199m8045o5272L5542J2510Q046j9509
21654a04226k2434r8816j00139J10875J07719L7311K5976Q1838P8806r0816p7868
21643e1774l3401K735M4005K0677L1136j8069j25326k1826J34936L6423O713J2782
21631C9011M4527L3977p8206p8256k930l6455N153k2683M3299O6656k914j25815
21619a14636l0198j4129Q2487M8086j8548m6833k7503p2770j20023j59357l7831
21608e11255J18096O5685M2493J08863R8588Q328o3446K1065K5065L2369J3823
21597d0326o3216N4144o4005n6039O9540p8234k1009K5789n9761j9914M6341m2042
$$ plain form
21677 -110616 -162353 -71408 -174300 -208455 -117965 -55674 -65132 -152418 -139209 -21217 -45797
21666 -45797 -88412 -64224 -22574 36483 26701 -27498 -75543 -140815 -105273 -92763 -84717 -104226
21654 -104226 -126660 -225476 -325615 -214740 -107021 -69710 -43734 38104 116910 26094 -51774
21643 -51774 -85175 -82440 -38435 -17758 13378 -4691 -130017 -151843 -16907 19516 26229 39011
21631 39011 83538 117515 39309 -38947 -41877 -78332 -73179 -95862 -52563 14093 11179 -114636
21619 -114636 -144834 -158963 -76476 -28390 -46938 -93771 -121274 -194044 -314067 -473424 -511255
21608 -511255 -393159 -327474 -284981 -176118 -77530 -69202 -132648 -111583 -86518 -54149 -40326
21597 -40326 -103542 -49398 -113403 -169442 -99902 -178136 -199145 -173356 -233117 -253031 -206690 -248732
21585b48732N5588j6697N5952l2132o913R1749m0083j21069j62287P7277J6679
21574c30668J43180M89l8717R5765J37609J5462j49624j54589l3496J22520J25728
21563f6341P6268J51909R6025j26585j57676l7581K105j29135q203j0314m9142
21552b58670P0903L2470j0155Q0832q3j14344m6969j192M6356K6931R5701J32950
21540E4730j40596j66504q1621p2582k4699J47698J9080k8776M3959M557m8642
21529b93396r253O4527K7932J0219P7767j8876r3687J2660L0362K3345q1432m7158
21517b96990L2904N4176L4581n2843L555k5573l8282P938k0027P1101N1190O4703
21505a13567M1869O5258o8908j30166r121J6406L0318l065k9594k6113j46580
$$ plain form
21585 -248732 -193144 -209841 -153889 -186021 -192934 -101185 -141268 -262337 -424624 -347347 -330668
21574 -330668 -187488 -186999 -225716 -129951 7658 23120 -126504 -281093 -314589 -192069 -66341
21563 -66341 9927 161836 257861 131276 -26400 -63981 -61876 -191011 -199214 -209528 -258670
21552 -258670 -187767 -155297 -165452 -84620 -84703 -199047 -246016 -247208 -200852 -173921 -78220 54730
21540 54730 -85866 -252370 -333991 -406573 -431272 -283574 -264494 -293270 -249311 -244754 -293396
21529 -293396 -302649 -238122 -210190 -199971 -122204 -141080 -234767 -222107 -191745 -168400 -249832 -296990
21517 -296990 -264086 -209910 -175329 -228172 -224617 -250190 -288472 -280534 -300561 -229460 -178270 -113567
21505 -113567 -71698 -6440 -75348 -205514 -214635 -198229 -167911 -170976 -200570 -226683 -373263
21494c73263j10452M3518P4931J33318Q3159P1288L2899P8506Q8317o6612j08511
21483e2902m2566j27063p4579k972R4821P9661Q0172J5473q0414m387K24795n330
21471A04709r1038J23010K9778n8086l0805r599k6401m2554j35664r9872J28794
21460a07728N1237K6809J7062q487k8913M996j3328o8305J0831k5509n6753j10690
21448c08778j1199k2177N3824J24576J06154R9488l1860r3397m2048k7055k310
21437a54782l7109Q8550L7413j28346K6122K1916j09717m9194K5414O6918J89826
21426b2989J5093j01532J5327l3513j31789l3823Q1872l0635q1350J10986M357
21415b07996p5439N122O7967j6487J685P3013r7081n4165J4231L7542m0539n9552
$$ plain form
21494 -373263 -483715 -440197 -365266 -231948 -148789 -77501 -44602 33904 122221 55609 -52902
21483 -52902 -95468 -222531 -297110 -300082 -205261 -125600 -45428 -29955 -110369 -114756 110039 104709
21471 104709 13671 136681 166459 108373 77568 67969 41568 -986 -136650 -236522 -107728
21460 -107728 -56491 -29682 -12620 -21107 -50020 -45024 -58352 -126657 -115826 -141335 -198088 -308778
21448 -308778 -319977 -342154 -288330 -163754 -57600 41888 10028 -83369 -125417 -152472 -154782
21437 -154782 -191891 -103341 -65928 -194274 -168152 -146236 -255953 -305147 -279733 -212815 -22989
21426 -22989 -7896 -109428 -94101 -127614 -259403 -293226 -211354 -241989 -323339 -212353 -207996
21415 -207996 -283435 -278313 -210346 -226833 -225148 -152135 -249216 -303381 -289150 -251608 -292147 -351699
21403c51699J72801J08364n9111o9742K2371M0984M68l4600o1136o7795J26572
21392a72523j5941O925O7265M8689O0876j41049n8025K1011n4321M7496m3238
21381b32835N1255K739k2893J35599j9268j8850K6342q2755o575l2909n9650J41815
21369a17985P4847J3962j21213j74669O897L3957J4592N9694j0974o9982J44138
21358a46736L6780k5063Q7616J02713K9670l0764p2220j1140q2843m0259k0583
21347a72829q9529O078P959o6487L9782R2466L1195P1380n3918k3802j2736P2557
21335i7884n5105l2542q4097r2124m6750R532J20114R4018l0470m7753n0957n7500
21323c71518k5673J23867J89180m4164m9263o678J533o090J68144l4363j34125
$$ plain form
21403 -351699 -178898 -70534 -129645 -199387 -177016 -136032 -135564 -170164 -231300 -299095 -172523
21392 -172523 -188464 -181539 -114274 -65585 -4709 -145758 -203783 -182772 -237093 -189597 -232835
21381 -232835 -181580 -178841 -201734 -66135 -85403 -104253 -77911 -160666 -167241 -200150 -259800 -117985
21369 -117985 -43138 -29176 -150389 -325058 -318161 -284204 -269612 -209918 -220892 -290874 -146736
21358 -146736 -109956 -135019 -47403 55310 84980 54216 -18004 -29144 -111987 -152246 -172829
21347 -172829 -262358 -256280 -248321 -314808 -275026 -182560 -151365 -79985 -133903 -157705 -170441 -97884
21335 -97884 -152989 -185531 -269628 -361752 -408502 -398970 -278856 -184838 -215308 -263061 -314018 -371518
21323 -371518 -397191 -273324 -84144 -128308 -177571 -184249 -182716 -188806 -20662 -55025 -189150
21312a89150M7025J34645n682q3854M5884P6173K982o5559l1781o5375N5641n6990
21300a36041r0566P7910P5162p2162m4140J14714l3275n4649M7987K5047j09665
21289a99678P9792J09220o4708L171n6262m0715r2423n7731k4020J3650R0920
21278b38784J00194p8081o745O386K0407O8217M3175q458p4087k2468p4272O7296
21266a97220M9691j9853K2150k0316q3805n2798P8999k3330K6003K6255N1296
21255a42928o9496k5279k4350n3236p1534J24478P8369J09089J1796k5931l3018
21244a22040o5846m8763o4337J8778R6461M891N7803Q3044Q0749O0550j17157
21233a5867n5850M6494J20648j4645n5053j17842m603M4409N0206j16449J0632
$$ plain form
21312 -189150 -142125 -7480 -13162 -97016 -51132 25041 28023 -37536 -69317 -134692 -79051 -136041
21300 -136041 -226607 -148697 -73535 -145697 -189837 -75123 -108398 -163047 -115060 -90013 -199678
21289 -199678 -119886 -10666 -75374 -72203 -128465 -169180 -261603 -319334 -343354 -329704 -238784
21278 -238784 -138590 -216671 -223416 -217030 -196623 -128406 -85231 -93689 -167776 -190244 -264516 -197220
21266 -197220 -147529 -167382 -145232 -165548 -249353 -302151 -223152 -246482 -220479 -194224 -142928
21255 -142928 -212424 -237703 -262053 -315289 -386823 -262345 -183976 -74887 -63091 -89022 -122040
21244 -122040 -187886 -236649 -300986 -282208 -185747 -180856 -123053 -40009 40740 101290 -15867
21233 -15867 -71717 -25223 95425 80780 25727 -92115 -96718 -52309 -2103 -118552 -107920
21222a07920k0898n5473o4426J6991R6271K4343j27898o2696j0573J3247J57176
21211a41856J07811L1840j34563j0006K0786M5005q7779q7477r5340j9194L927
21200c66846O3455R2763J14578J3253l8265J9474k888N6360j4384r1166M9509
21189a04157K3148K3367l9643k4012m354R2156O4472m9290K6076o2786r2920m6899
21177a94842R5746M7521j0003Q954k2354M1556O145n4938J0328L8678j00840L6808
21165i7241q9006n9394P9277J1604j5J2472k657m1968m8718J00246J61624l6841
21153a0617p7490L9425J4451M7956N2018j17574j95058m4385M68O063P0738J40067
21141g3938n8138j08763N6260L8550J5873k4239R454J08718k3035j86924K6519
$$ plain form
21222 -107920 -128818 -184291 -248717 -231726 -135455 -111112 -239010 -301706 -312279 -299032 -141856
21211 -141856 -34045 -2205 -136768 -146774 -125988 -80983 -168762 -256239 -351579 -370773 -366846
21200 -366846 -303391 -210628 -96050 -82797 -121062 -101588 -104476 -48116 -62500 -153666 -104157
21189 -104157 -81009 -57642 -97285 -121297 -125651 -33495 30977 -18313 7763 -55023 -147943 -194842
21177 -194842 -99096 -51575 -61578 -52624 -74978 -33422 -27277 -82215 -71887 -33209 -134049 -97241
21165 -97241 -186247 -245641 -166364 -154760 -154775 -142303 -144960 -186928 -235646 -135400 26224 -10617
21153 -10617 -88107 -48682 -34231 13725 65743 -51831 -246889 -291274 -290806 -284743 -214005 -73938
21141 -73938 -132076 -240839 -184579 -146029 -130156 -154395 -144941 -36223 -59258 -246182 -219663
21130b19663K5107l76J17418R7496j16849o0939J14232K9686o8619j7372O0621
21119c9258j28302p9175J7603p8564K0823m264J5612O5881J27729M4555l9197
21108g6557k4029R1319O5214n287j11075n5925p0764m1960j61931j0365M3239
21097c58121l785J6106R0543M6512k2901P9954J06428L7289o1775j5443o9972
21086a55165j5803J01206m6816k7615N2310J40617j6547j09358P9207o8053l8015
21075a04032J17623O1616m7202N124O6024q5114j06862n7733K738L4012K5676
21064h8130k5095O5482j8169k6386L6482n2406K8039M733j7766M6408Q7573L2538
21052G3303j0233q2116k5253k1209M0550L4323n6303j38040M6223J36400O1146
$$ plain form
21130 -219663 -194556 -194932 -77514 19982 -96867 -157806 -43574 -13888 -82507 -99879 -39258
21119 -39258 -167560 -246735 -229132 -307696 -286873 -291137 -275525 -209644 -81915 -37360 -76557
21108 -76557 -100586 -9267 55947 50660 -60415 -116340 -187104 -229064 -390995 -401360 -358121
21097 -358121 -361906 -345800 -255257 -208745 -231646 -151692 -45264 -7975 -69750 -85193 -155165
21086 -155165 -170968 -69762 -116578 -144193 -91883 48734 32187 -77171 2036 -66017 -104032
21075 -104032 13591 75207 28005 33129 99153 14039 -92823 -150556 -147818 -113806 -88130
21064 -88130 -113225 -47743 -65912 -92298 -55816 -108222 -80183 -75450 -93216 -46808 40765 73303
21052 73303 63070 -19046 -44299 -65508 -24958 9365 -46938 -184978 -138755 -2355 58791
21041E8791J19454m05j06618m8609m7776m4959m0485l598j9402l5657J9834L6752
21029a12678p4116o4172n1093J18864P6635k3830o734j1370J06626n6345r7888
21018a96101n210k1209j31012q3212k3034J23059K6407n4781O5641J00651P564
21007a91237O0460j3532J0371p4519R0609L39q7415L9253J75830j33784m3572
20996a67197J04844j310k5667r0898j15072M7773J38898O3578k9065N3330r6520
20985a17306o4400L1360Q3859j41276j29283M1427J04773j2170q035R2165M3250
20974g5636P1836J09416p3783j15716q5974p2221J01453J31354M775o1750J687
20963f4559O131r7366M1336m7873j16358m1893J07531m6882l2415K067Q6047J3752
$$ plain form
21041 58791 178245 177840 71222 22613 -25163 -70122 -110607 -114205 -133607 -169264 -149430 -112678
21029 -112678 -186794 -250966 -302059 -183195 -106560 -130390 -137124 -148494 -41868 -98213 -196101
21018 -196101 -201311 -222520 -353532 -436744 -459778 -336719 -310312 -365093 -299452 -198801 -191237
21007 -191237 -130777 -144309 -133938 -208457 -117848 -117509 -204924 -165671 10159 -123625 -167197
20996 -167197 -62353 -63663 -89330 -180228 -295300 -247527 -108629 -45051 -74116 -20786 -117306
20985 -117306 -181706 -150346 -66487 -207763 -337046 -295619 -190846 -203016 -211051 -118886 -75636
20974 -75636 -3800 105616 31833 -83883 -169857 -242078 -140625 -9271 -4496 -66246 -64559
20963 -64559 -58428 -155794 -114458 -162331 -278689 -320582 -213051 -259933 -292348 -290281 -204234 -190482
20951a90482K3363L1049p6929R2262L8175o9802j3049O6757j09640p1102K27284
20940e2114O309j01112j63672j25464J28096J19398P7j23007J9394J29893Q2032
20929h0170l2864j1290K823N0733J29616o958j68471L428L902L9992J13509q6406
20917d2156r6428k076p614k134j58154K8628O4816K1374j2988M5482K6463J45340
20905A0553j7163m7469n1279k5824J69562P3028j16880j20718o2878O91n6135
20894b44512n337K4057P1504M7626j30468q2731J3136M0854L2776J5193J04018
20883a13884O6757J24641J19100o4926p7391j7493o0687Q0957k9438m1866q6743
20872a00973o6294N2394Q5060P797k9405m2423m6243N149O0509l9022r3821M4816
$$ plain form
20951 -190482 -167119 -136070 -212999 -120737 -82562 -152364 -165413 -98656 -208296 -279398 -52114
20940 -52114 -45805 -146917 -310589 -436053 -307957 -188559 -188482 -311489 -292095 -162202 -80170
20929 -80170 -113034 -124324 -121501 -70768 58848 51890 -116581 -113153 -109251 -69259 44250 -42156
20917 -42156 -138584 -140660 -148274 -150408 -308562 -279934 -215118 -193744 -206732 -161250 -134787 10553
20905 10553 -6610 -54079 -105358 -131182 38380 111408 -5472 -126190 -189068 -188377 -244512
20894 -244512 -249849 -225792 -154288 -106662 -237130 -319861 -306725 -265871 -233095 -217902 -113884
20883 -113884 -47127 77514 196614 131688 54297 36804 -23883 57074 27636 -14230 -100973
20872 -100973 -167267 -114873 -29813 -22016 -51421 -93844 -140087 -134938 -74429 -113451 -207272 -162456
20860a62456J12056K5328k3161M3935J08309N0293r6795j32941K1033r064J04656
20849D1193m9519k9835j4536M7212o7935l2966j20699k1211L4756l8564j14178
20838c66282n7850J14103J10232L4723k9558R142j4781l0944q075N99N126j3299
20826b46864l6050P7141N1902k6150j9238L1j5831M6689M4128J42581L6535n3837
20814A037m3076n5941m5689j07157j9185M7017p3174J37602R591p3962o32J7088
20802b06481j651J09544N1244p1158L3595K0737k9001q2166J1618n4643J31155
20791h7207P9758P7278l8382j87657P7815N1896m6852j75869k93K34351m4635
20780e9797j09709p154l1671L4974L285l6771J7146P4541N4384J73393k7098j07403
$$ plain form
20860 -162456 -50400 -25072 -48233 -4298 104011 154304 57509 -75432 -54399 -63463 41193
20849 41193 -8326 -38161 -52697 -5485 -73420 -106386 -227085 -248296 -213540 -252104 -366282
20838 -366282 -424132 -310029 -199797 -165074 -194632 -185490 -200271 -231215 -239290 -238691 -233565 -246864
20826 -246864 -282914 -205773 -153871 -180021 -199259 -199228 -215059 -168370 -124242 18339 54874 1037
20814 1037 -42039 -97980 -143669 -250826 -270011 -222994 -296168 -158566 -148975 -222937 -223569 -206481
20802 -206481 -208132 -98588 -47344 -118502 -84907 -64170 -93171 -175337 -163719 -218362 -87207
20791 -87207 -7449 69829 31447 -156210 -78395 -26499 -73351 -249220 -249513 -15162 -59797
20780 -59797 -169506 -176660 -208331 -173357 -170072 -206843 -189697 -115156 -60772 112621 85523 -21880
20768b1880N9559L0694j09528n8796k7327j01278j4259P4696P7074Q2045r7013
20757a06013j36537l1489K6083m0887l6423J28779J22767j00671j09303O8939
20747b14755J10424J8176q28k2291J2401o1676j83256J8434P5413q6182n0806
20736c84946o132J45068M7991l9403j36569j7103Q6948p8333q222J05302j3031
20725b98430J86813J3333k0022K7118j8301l0484m8149j15500j3030M5217J52176
20714a19259O5380n8411j8707k1870J14255R6545o1990m0974K073J6254J3310
20703a3394R0358p3425r9617n6377O0099j03796j13120Q6861K64346K7683j56642
20692h7024r1810Q3611J7246J1609M1974o9527j90114P22L055P3774J52558k6037
$$ plain form
20768 -21880 37679 68373 -41155 -99951 -127278 -228556 -242815 -168119 -91045 -9000 -106013
20757 -106013 -242550 -274039 -247956 -288843 -325266 -196487 -73720 -174391 -283694 -214755
20747 -214755 -104331 -86155 -86983 -109274 -96873 -158549 -341805 -323371 -247958 -334140 -384946
20736 -384946 -391078 -246010 -198019 -237422 -373991 -391094 -304146 -382479 -390701 -285399 -298430
20725 -298430 -111617 -98284 -118306 -91188 -109489 -139973 -188122 -303622 -316652 -271435 -119259
20714 -119259 -53879 -112290 -130997 -152867 -38612 57933 -4057 -45031 -42958 -26704 -13394
20703 -13394 76964 3539 -96078 -152455 -92356 -196152 -309272 -222411 41935 69618 -87024
20692 -87024 -178834 -95223 -77977 -66368 -24394 -93921 -284035 -283313 -280258 -206484 -53926 -79963
20680g9963q7271o4326L0965R3217Q5589P1930r9871m8344k764M7064J18786j0350
20668E4662m3276k0357l8779J0714o8567j04040j9485Q2038J50017o9293j27809
20657a94175J1564Q3981O9183O6422j06635p2887j63422k1804J8145J76362R8413
20646c4853L7354K3071j5199l1085m8821j50923n0911r7424J3527J7371N1951
20635b85942K9442K0834M5849R726Q4137m9184j8298j2367j12169K9519M0312
20624b18141M3560R9074j07839m4196j368N827P1920q1423o5256n2017k8453J38580
20612b39732J22764Q8452K7482l0604j040j1587P6165R5033K7413o0308q2488
20601A1550j894k387k4513k3759M0618j20279j38017L2948J21273J24386j06000
$$ plain form
20680 -79963 -167234 -231560 -200595 -107378 -21789 50141 -49730 -98074 -100838 -53774 65012 54662
20668 54662 11386 -8971 -47750 -37036 -105603 -209643 -229128 -147090 2927 -66366 -194175
20657 -194175 -182611 -98630 -29447 36975 -69660 -142547 -305969 -327773 -309628 -133266 -34853
20646 -34853 2501 25572 10373 -20712 -69533 -220456 -271367 -368791 -355264 -337893 -285942
20635 -285942 -256500 -235666 -189817 -180091 -95954 -145138 -163436 -175803 -287972 -258453 -218141
20624 -218141 -174581 -75507 -183346 -227542 -228910 -223083 -151163 -232586 -297842 -349859 -378312 -239732
20612 -239732 -116968 -28516 -1034 -31638 -32678 -44265 31900 126933 154346 94038 11550
20601 11550 9656 7269 -17244 -41003 -385 -120664 -258681 -225733 -104460 19926 -86074
20590h6074j49677o8007N9883K8474k656L8720o2204J00093L3900p9986r7656
20579b85190L7938R6544Q8768M666K6086m8318m6102k5567J4632M4955o4806j95350
20567c51744J555J02153M8045K3322M3798k510l2210P0358P9594j73433j01372
20556b92444K3462J07488J85706K2161j02471q6953j88391J6796J68407P8464
20546f7775Q100m8315o8833j24722j10302k4379Q4309R4656Q5966N6819O5132
20535d9344J8982o8770q8389K0911J25136l8740m3866O9288M5646M3448q0241
20524d5939j29264m0586P3709J68370O5695O521J1953m6756p5162j60235n1097
20513b22791K7973l8201l2426J14193J07313m863m2840M1359j36740p1434R6544
$$ plain form
20590 -86074 -235751 -303758 -243875 -215401 -218057 -179337 -241541 -141448 -107548 -187534 -285190
20579 -285190 -247252 -150708 -61940 -57274 -31188 -79506 -125608 -151175 -136543 -91588 -156394 -351744
20567 -351744 -350189 -248036 -199991 -176669 -132871 -135381 -167591 -97233 -17639 -191072 -292444
20556 -292444 -268982 -161494 24212 46373 -56098 -143051 -331442 -314646 -146239 -67775
20546 -67775 -59675 -107990 -176823 -301545 -411847 -436226 -351917 -257261 -171295 -114476 -49344
20535 -49344 -30362 -99132 -187521 -166610 -41474 -80214 -124080 -54792 -9146 34302 -45939
20524 -45939 -175203 -215789 -142080 26290 91985 98506 110459 63703 -11459 -171694 -222791
20513 -222791 -194818 -233019 -265445 -151252 -43939 -48802 -91642 -50283 -187023 -258457 -161913
20502a61913O1098r8796m8321J05855J09439R7943m521j30878o8253n9091N8048
20491a39390j4250j8880L8780N9170j08453r895Q6294Q9921q1J9000q1520j43199
20479b22503m9782K6710J0485j9148J3360k8658o4811j5233J89034J05953q2848
20468a37441p2395K699J02481J51223K972Q8186o6675m8725l105j1979j43989
20457a36748l4255M8075M1633J43667n5960p8649m9192Q1007l8089k9609J4954
20446i3166j09341q0071J04250M4721r817O5412N1377J8745M2529q8081j06936
20435a60378n34m2999L0220j7674J03993N5045j6636k8758K43J04845m6832n5268
20423g4733r8642N0007J69522J8008q9995j27827N080K9710n7069j5673r4933
$$ plain form
20502 -161913 -100815 -199611 -247932 -142077 -32638 65305 60784 -70094 -138347 -197438 -139390
20491 -139390 -153640 -172520 -133740 -74570 -183023 -192918 -106624 -16703 -16784 2216 -79304 -222503
20479 -222503 -272285 -245575 -235090 -254238 -240878 -269536 -334347 -349580 -160546 -54593 -137441
20468 -137441 -209836 -207137 -104656 46567 49539 137725 71050 22325 19220 7241 -136748
20457 -136748 -171003 -122928 -81295 62372 6412 -72237 -121429 -40422 -78511 -108120 -93166
20446 -93166 -202507 -282578 -178328 -133607 -143424 -78012 -26635 -7890 34639 -53442 -160378
20435 -160378 -160912 -203911 -173691 -191365 -87372 -32327 -48963 -77721 -77478 27367 -19465 -74733
20423 -74733 -173375 -123368 46154 64162 -25833 -153660 -148580 -118870 -175939 -191612 -286545
20412b86545m1950L2414Q0750J05825N469k5870P2996O8309q1718p3794L2368
20401a11746J74907N1536k18059j24484n9828q5108J09267J04179M1095k2758
20391a40999j9689Q0144P9668j88126j04302P0429P2712q2492M0764J10624J9237
20380f2030l7245q6108J8044j4448j9379m5168K2230L6295o8228P0584J8104l3388
20368b00737P0430Q183j8828P0940K2881j33682Q827n0525q9812n8908j11895
20357d83126L8830K45159J15651n6748p1870M9561o791j37089l5313R5441J78258
20346f8037J2850m3958p511p1216J31766O2789k4007n6003j29100Q1317N6310
20335e4800j59419L1800K0557l3322J2586L2206j22828o6905K06707Q2436q3602
$$ plain form
20412 -286545 -328495 -296081 -215331 -109506 -104037 -129907 -56911 11398 -70320 -144114 -111746
20401 -111746 63161 114697 -103362 -227846 -287674 -372782 -263515 -159336 -118241 -140999
20391 -140999 -160688 -80544 -876 -189002 -293304 -222875 -150163 -232655 -191891 -81267 -62030
20380 -62030 -99275 -185383 -167339 -181787 -201166 -246334 -224104 -187809 -256037 -185453 -167349 -200737
20368 -200737 -130307 -122124 -140952 -70012 -47131 -180813 -171986 -222511 -312323 -371231 -483126
20357 -483126 -444296 -199137 -83486 -140234 -212104 -162543 -169334 -306423 -341736 -246295 -68037
20346 -68037 -55187 -99145 -106656 -177872 -46106 16683 -7324 -63327 -192427 -111110 -54800
20335 -54800 -214219 -182419 -161862 -195184 -182598 -150392 -273220 -340125 -133418 -50982 -134584
20324a34584p6474Q2751P3971p0620k8853J75221m8981n8412l2714M5807J27301
20313E4413p2119j70654l8328J19106l052N765l7378l6844p6808L50J84091J08804
20301C7346R918j6505J6063o4240Q2535k1706j91484q1063j0426o4961O9661J13765
20289a21097o473o6629j30619N305M8799j3280J00715K2868m2295N0084J210k6042
20277a77454L1958P0652J5703p892j4340n1436J10299J4408r3812J3379q000L2384
20265f4151r4594n4274K7308K1737K0993N5592j01692o3702R6297N5046L1725
20254f9715p821n8712q9332l2251L291j19235L245N8224K01864J3258K3438R937
20242f3809j9537j9233K4349j5527p3215m2098p322M0485p794P9451N4806M2101
$$ plain form
20324 -134584 -211058 -128307 -54336 -124956 -153809 21412 -27569 -85981 -118695 -72888 54413
20313 54413 -17706 -188360 -226688 -107582 -110634 -104869 -142247 -179091 -255899 -255549 -71458 37346
20301 37346 47264 30759 46822 -17418 65117 43411 -148073 -229136 -239562 -304523 -234862 -121097
20289 -121097 -127570 -194199 -324818 -319513 -270714 -283994 -183279 -160411 -202706 -152622 -151412 -177454
20277 -177454 -145496 -74844 -59141 -67033 -81373 -132809 -22510 -8102 -101914 -88535 -96535 -64151
20265 -64151 -158745 -213019 -185711 -163974 -142981 -87389 -189081 -252783 -156486 -101440 -69715
20254 -69715 -77536 -136248 -225580 -257831 -254540 -373775 -370530 -312306 -110442 -97184 -73746 -63809
20242 -63809 -83346 -102579 -78230 -93757 -166972 -209070 -216392 -175907 -183701 -104250 -49444 -7343
20230g343N94n1557j22401l2886O6589K2374O1653J5927M4333O3193j36924k00233
20218b76681k7822P9728Q1632J35814P5169o3286j09228j08494r2866M8845j2058
20207b69247r0968l0282L6993J05211J07576J6492P2805J40605k0945p2303k6178
20196c0241n4135R007n5170L2554J02565j72052q5158M4462J22379m2030q4458
20185b12277J52261K27519K1669j21395k49572P566Q2491J9802P1808q7098K4097
20174f3129J00474j19666j9222N3566q785L7347k8160M0738m535K1272N6542l2842
20162C3600j13134o5592L0680L7837n8273r1669K3032L414k8911k2851o3625P4443
20150b41049K0708O4501k9080j12082N612N0038L1224k767j4591l3497l715m3496
$$ plain form
20230 -7343 -6749 -58306 -180707 -213593 -147004 -124630 -62977 -47050 -2717 60476 -76448 -276681
20218 -276681 -304503 -224775 -143143 -7329 67840 4554 -104674 -213168 -306034 -257189 -269247
20207 -269247 -360215 -390497 -353504 -248293 -140717 -124225 -51420 89185 68240 -4063 -30241
20196 -30241 -84376 -75369 -130539 -97985 4580 -167472 -252630 -208168 -85789 -127819 -212277
20185 -212277 -60016 167503 189172 67777 -181795 -174229 -91738 -71936 -128 -87226 -63129
20174 -63129 37345 -82321 -101543 -47977 -56762 -19415 -47575 -6837 -11372 9900 66442 33600
20162 33600 -79534 -145126 -114446 -76609 -134882 -226551 -203519 -200105 -229016 -251867 -315492 -241049
20150 -241049 -220341 -155840 -184920 -297002 -291390 -241352 -210128 -212895 -227486 -260983 -264698 -308194
20138c08194J9688Q3298Q8098N2892Q0370P6931o3654j07336k0948M4190l3269
20127h7934j40227L1579N7252K7111R4703k9803o9524p4969k5567K696N354O4098
20115a45231P6600n123m2550m2695Q6415J02833j04958j02788R6056O869L2273
20104d2299M0141K0229q9167r2169P2062J38890j03190k17798n8041J27081P235
20093a97026m3667p441O6469L2293r198N4126k9681j68721l5635P0992J36518
20082a30971k3872j5687R4619M607K5302P6525j0592L6871n693j06772k15775
20071b71438N9145Q465j2044q2167r7075j129J41300J20445P652N5598J4430P8664
20059B1846k2372p086p2079j28761K3492M5943M8235J0684k9642r0436J27383
$$ plain form
20138 -308194 -288506 -205208 -117110 -64218 16152 93083 29429 -77907 -98855 -54665 -87934
20127 -87934 -228161 -196582 -139330 -112219 -17516 -47319 -116843 -191812 -217379 -214683 -209329 -145231
20115 -145231 -68631 -73754 -116304 -158999 -72584 30249 -74709 -177497 -81441 -74572 -42299
20104 -42299 -2158 18071 -71096 -163265 -91203 47687 -55503 -273301 -331342 -204261 -197026
20093 -197026 -240693 -248134 -181665 -149372 -158570 -104444 -134125 -302846 -338481 -267489 -130971
20082 -130971 -154843 -170530 -75911 -71304 -46002 30523 19931 56802 51109 -55663 -271438
20071 -271438 -212293 -203828 -215872 -298039 -395114 -396243 -254943 -134498 -126846 -71248 -56818 21846
20059 21846 -526 -7612 -79691 -208452 -184960 -139017 -90782 -80098 -109740 -200176 -72793
20048g2793R0894j7274j1911r9681o3044p8786L9320P2649r550M9346J02466q015
20036f379p0264n4208J78199Q4626j27367j47121K8666Q3267k4765n1120m2553
20025a49019n4926n0630O3885N5232k8409j6708j4630J00749J57739J1954j3245
20014F1992M4638p2460k1454q0930L5862k9510j49831R9330O0993q225n7567P8975
20002c8187o9207p4706N3437q7528p8256N1689l4730l2315Q9705K89791K9053
19991I8746o1770l0024m7328N9887N00O0155M1069j83835j52194R2548K1378m5015
19979a45883m2582K2284J4020q989K8643k1391R1741O5968N042K5494n5696j7292
19967c8641j8862Q5877j25910m8104L9754l1925r4042o4946J39848P3024j4665
$$ plain form
20048 -72793 18101 827 -11084 -110765 -173809 -252595 -213275 -140626 -150176 -100830 1636 -6379
20036 -6379 -76643 -130851 47348 131974 4607 -142514 -113848 -30581 -55346 -106466 -149019
20025 -149019 -203945 -254575 -190690 -135458 -163867 -180575 -195205 -94456 63283 75237 61992
20014 61992 106630 34170 12716 -68214 -32352 -61862 -211693 -112363 -51370 -59595 -117162 -38187
20002 -38187 -107394 -182100 -128663 -216191 -294447 -242758 -277488 -309803 -220098 69693 98746
19991 98746 36976 6952 -40376 19511 20011 80166 121235 -62600 -214794 -122246 -100868 -145883
19979 -145883 -188465 -166181 -152161 -161150 -132507 -153898 -62157 3811 8853 34347 -21349 -38641
19967 -38641 -57503 28374 -97536 -145640 -105886 -137811 -231853 -296799 -156951 -83927 -98592
19956i8592j24792j28208j1811J3694N8225q1152l6837j1788J56457J7266j4023
19945b61561K202l1070N5580R1437M8443k5552L2436k3279o5790j7864R6894Q8281
19933i843j6644o5952J7763K3828J50391J0381q6028J1099M027r9798Q101J8184
19921c4491k2607O3713j29640q6149R4131J21077k4126m6633k3752N3921J06576
19910G2020k4512n342j4085j69589j17424J8715J45368P3389j13012J48721n8633
19899d4384j33400J3142M8679P3048N9364O0670p7254l7976k005N359o1951N5282
19887d1426K7550j38173m1195n3920J34782J46690K8962l5884n9067j08650o8909
19876b09240J1847Q9449M9648J08856k220j53027r1135n7302j526L7064L9539
$$ plain form
19956 -98592 -223384 -351592 -363403 -349709 -291484 -372636 -409473 -421261 -264804 -247538 -261561
19945 -261561 -259359 -290429 -234849 -143412 -94969 -120521 -88085 -111364 -177154 -195018 -98124 -9843
19933 -9843 -26487 -92439 -74676 -50848 99543 109924 23896 34995 39022 -60776 -52675 -34491
19921 -34491 -57098 6615 -123025 -209174 -115043 6034 -18092 -64725 -88477 -34556 72020
19910 72020 47508 42166 28081 -141508 -258932 -240217 -94849 -21460 -134472 14249 -44384
19899 -44384 -177784 -164642 -115963 -42915 16449 77119 -135 -38111 -40116 -34757 -96708 -41426
19887 -41426 -13876 -152049 -193244 -247164 -112382 34308 63270 27386 -31681 -140331 -209240
19876 -209240 -197393 -107944 -58296 50560 48340 -104687 -195822 -253124 -254650 -217586 -178047
19865a78047O6571P8765L5195j7402r4044L5351O3548j47847l2221J34541q7725
19854a43315k5393l3538N8523N8755K4241J02816j10989j23045J13126p9634k3438
19843a81891q3820O17J68154o213n5918L6843K9942O8975O0627M8884m8282q5174
19831d7256j3492J84782j4991j61620k3433Q6404n6589J0073L3202K5203L507
19820B5790J375j08843q433J0357j59376k7443K3118J9121j1023Q5943J02483
19809d6931J0439n0178j26767j29530M2419M5983j5651J0404j4243k3563J6854
19798b80764K8366M0958l123m0195o1186J8165k2509M0913R2135P9578j2490n1605
19786a71757j30388R5405R9112J1562k2294P484O3616l284k2132M6657J53q3311
$$ plain form
19865 -178047 -111476 -32711 2484 -14918 -108962 -73611 -10063 -157910 -190131 -55590 -143315
19854 -143315 -168708 -202246 -143723 -84968 -60727 42089 -68900 -191945 -78819 -158453 -181891
19843 -181891 -265711 -265094 -96940 -103153 -159071 -122228 -92286 -23311 37316 86200 37918 -47256
19831 -47256 -60748 124034 109043 -52577 -76010 10394 -46195 -36122 -2920 22283 25790
19820 25790 27165 -81678 -90111 -79754 -239130 -266573 -243455 -224334 -235357 -149414 -46931
19809 -46931 -36492 -86670 -213437 -342967 -300548 -254565 -270216 -259812 -274055 -297618 -280764
19798 -280764 -252398 -211440 -214563 -254758 -315944 -297779 -320288 -279375 -187240 -107662 -120152 -171757
19786 -171757 -302145 -206740 -107628 -96066 -118360 -110876 -47260 -50544 -72676 -26019 -25866 -109177
19774a09177l7339J23395m067J14061J5327j75792k6789L064Q3412O2724J1069
19763E9888j16440l7454m832Q8125R7388r8804n549l821j50902p1839P0436P7392
19751i6412o1831J25551j7406p7352O2177N5265o0237j41558L4223O9913J09960
19740B293J7741q2007j11330K5578j77377k2995j7111K5621O4931J90724J07655
19729B3723O1584l8988j47122J0520r04j5472j808j07411N2262N7745K0036J4715
19717g1120P130k1916n2769K0935R2177o389n2160N2817J1303L3843N8463o0465
19705A1849j96852m9347R7616Q7929K4819j22722p8995K7145l2483J45694k8189
19694a13536j7767j2430m0350P6691Q4804m7225m4610o8915j17982l8149J3070
$$ plain form
19774 -109177 -146516 -23121 -27188 86873 102200 -73592 -100381 -97317 -13905 48819 59888
19763 59888 -56552 -94006 -98838 -10713 86675 -12129 -17678 -21499 -172401 -244240 -173804 -96412
19751 -96412 -158243 -32692 -50098 -127450 -65273 -10008 -70245 -211803 -177580 -107667 2293
19740 2293 20034 -61973 -173303 -147725 -325102 -348097 -365208 -339587 -274656 -83932 23723
19729 23723 85307 46319 -100803 -90283 -91187 -106659 -108467 -215878 -163616 -105871 -85835 -71120
19717 -71120 -63990 -85906 -138675 -117740 -25563 -31952 -84112 -31295 -19992 13851 72314 11849
19705 11849 -185003 -234350 -136734 -48805 -23986 -146708 -225703 -198558 -231041 -85347 -113536
19694 -113536 -131303 -143733 -184083 -107392 -22588 -69813 -114423 -183338 -301320 -339469 -326399
19683c26399j24R0918J86678O0938L9186j41635j46997r1807L093Q6815P6063
19672a63271l1105p6359m3932M9376L8829J8450l547m2093M5469R1087l9985O542
19660a50539L5351L9768J00142L8821m5922k9998l6976M6669j9421N1957O2970
19649I2822q1722m5443j59855q024j16026L3561J76344O4447o2796k9141R745
19638a26088J6770o3938k458n179p4466M2716O6057p9921n7118Q5788l0169K66
19626b27740j6084j18288J26631P1998n0258P61M9687J34496M0361l4250q2324
19615a05010R376K2541P1870N22o6509R6266M6755r1126p861J09259k0237K0855
19603H6701n9876K6574m3257q7925J05674k4836j8785n7863p1870J0516N2608
$$ plain form
19683 -326399 -326523 -235605 -48927 12011 51197 -90438 -237435 -329242 -326149 -239334 -163271
19672 -163271 -194376 -270735 -314667 -265291 -226462 -208012 -211559 -253652 -208183 -117096 -157081 -150539
19660 -150539 -115188 -75420 24722 63543 17621 -12377 -49353 -2684 -22105 29852 92822
19649 92822 11100 -34343 -194198 -202222 -318248 -284687 -108343 -43896 -106692 -135833 -126088
19638 -126088 -109318 -173256 -175714 -180893 -255359 -212643 -146586 -226507 -283625 -197837 -228006 -227740
19626 -227740 -243824 -362112 -235481 -163483 -213741 -212980 -163293 -28797 11564 -22686 -105010
19615 -105010 -95634 -73093 -1223 -701 -67210 29056 75811 -15315 -23176 86083 65846 86701
19603 86701 26825 53399 10142 -77783 27891 3055 -15730 -73593 -145463 -134947 -82339
19592h2339P5564n5731j3317P8547M4696l361j7528o3876l0298m6974k7917l6656
19580a79190l7446K5442P7518M0700n0989J1530N3562L9170r051k0921K7275r9991
19568a22391j00912M622M8990o9327q3318J12273J31004K6933j09798O6022P0818
19557b5084m4954l8400m877k9191o940p1785q62J42149K8377j236O0657q9022
19545h1168l0249M129P8375M8684Q993l6112K579k4770n9798J4176k0264k5189
19533a20614M9159k8755P9941R5254K3919j12705o4364r8139m3825Q2501P3055
19522f4573j3910K918n0967j0731M4121J17571L3119L7635l576q0443q6291J3326
19510f1801Q1940j585m1615p2349m1274j05149k0465R9822J9592K5533N731L2601
$$ plain form
19592 -82339 -6775 -62506 -75823 2724 47420 44059 26531 -37345 -67643 -114617 -142534 -179190
19580 -179190 -216636 -191194 -113676 -72976 -123965 -112435 -58873 -19703 -28754 -49675 -22400 -122391
19568 -122391 -223303 -218681 -169691 -239018 -322336 -210063 -79059 -52126 -161924 -95902 -25084
19557 -25084 -70038 -108438 -113315 -142506 -149446 -221231 -222093 -79944 -51567 -52803 7854 -81168
19545 -81168 -111417 -107288 -28913 19771 28764 -7348 -4769 -29539 -89337 -75161 -95425 -120614
19533 -120614 -71455 -100210 -20269 74985 98904 -13801 -78165 -176304 -220129 -137628 -64573
19522 -64573 -78483 -75565 -126532 -137263 -93142 24429 57548 95183 91607 11164 -75127 -61801
19510 -61801 20139 18554 -23061 -95410 -136684 -241833 -262298 -162476 -142884 -117351 -111620 -79019
19498g9019k4607L6877J04071K9382j08630j80236K2883L9366K3994K2445J01053
19487a2421P8289N2276J7038j00170j70130j13009R576J0375o0K7904K8640K7085
19475a44607J02800J01962L4026k7674j46505Q0292R7470m0372L5509J34167N7430
19464B84498q1676j26855j10646L3187j66135k2395J40045j7792o1997Q8630J60863
19453A19727K9304r1999j19334j24225r7726r8803O6538J10726J48134j7604r8622
19442a73884R132j1838l5024M2084J25055O6626P5384R8732o3371j35352o7706
19431g0162m8907m6694L943M256L9155P2245n3582O03l9666J3629P4099J0440
19419d0641j11553n1596N2176R0933J797q6185o6784J05709P2379M5547q982p2124
$$ plain form
19498 -79019 -103626 -66749 37322 66704 -41926 -222162 -199279 -159913 -135919 -113474 -12421
19487 -12421 65868 118144 135182 35012 -135118 -248127 -238551 -228176 -228236 -200332 -171692 -144607
19475 -144607 -41807 60155 94181 66507 -79998 294 97764 57392 92901 227068 284498
19464 284498 202822 75967 -34679 -1492 -167627 -190022 -49977 -67769 -129766 -41136 119727
19453 119727 149031 57032 -62302 -186527 -284253 -383056 -316518 -205792 -57658 -75262 -173884
19442 -173884 -164752 -176590 -211614 -169530 -44475 22151 97535 196267 132896 -2456 -70162
19431 -70162 -119069 -165763 -161820 -157564 -118409 -46164 -99746 -99143 -138809 -125180 -51081 -40641
19419 -40641 -152194 -203790 -151614 -60681 -58884 -145069 -211853 -106144 -33765 11782 2800 -69324
19407f9324q0336M6072O2770K9516M492J00262O5296r7073j29823l9435M4712
19396f2871l4377M7807q832R7590N4817k8220n5621K8178J192j36830o6174Q4950
19384g8391K4826K0863o3438p0385O5616J07852N667r6365M9404J40729j05939
19373D39q8030R9453M1090Q6094o7483j38366n6715n980m8947q21n6313P8640
19361a56939L6996J7181Q8928J3589O7133r1259l4632L7886J14018J8291j6292
19350I4900o4153J997O6617q138k926L174j23046Q335q3099O2915K4632R020k4096
19337c3868k0799o1811J7195J70401L7623K9653j46706j35942L5068J03132N7501
19326E1447r5426m4254M4413m4542l7796m9479k3436J13761K8377P9738M979j8406
$$ plain form
19407 -69324 -149660 -103588 -40818 -11302 -6810 93452 158748 61675 -68148 -107583 -62871
19396 -62871 -97248 -49441 -58273 39317 94134 65914 10293 38471 39663 -97167 -163341 -78391
19384 -78391 -53565 -32702 -96140 -166525 -100909 6943 12610 -83755 -34351 106378 439
19373 439 -87591 11862 52952 139046 71563 -66803 -123518 -129498 -178445 -179266 -235579 -156939
19361 -156939 -119943 -102762 -13834 -245 66888 -24371 -59003 -21117 92901 111192 94900
19350 94900 30747 32744 99361 91223 88297 91471 -31575 -23240 -106339 -43424 -18792 -9772 -33868
19337 -33868 -54667 -116478 -99283 71118 108741 138394 -8312 -144254 -109186 -6054 51447
19326 51447 -43979 -88233 -43820 -88362 -126158 -175637 -199073 -85312 -56935 22803 27782 9376
19314I376n6354m0223k4432J4573J633R0995p842l8725m8734p537m7788N2325
19302a02733k4685n3437J5176J39315J0096j30726M2825N9228P1057R3277m021
19291A15372N0670q9862q9133k0032j17724p2440P2424O4960j08501k4510N135
19280b13641L8949P9852Q8462L8619m9871q3079J8131J13517J4289o1040j5211
19269c1023L9002Q4704n1132j24370r571k2146M4120N5563o0649k2074O6292p0747
19257a02031j3699N8294J0591p546j39118J6455J67941J29811J1949j18078j42938
19246a28369j3369Q5371M290m4558N9721J6527j9518J13P8737K4939N5117o9136
19234D9865m6906n9106K1631J18643n5304j18923J5772J4922J3172L0320j01125
$$ plain form
19314 9376 -46978 -87201 -111633 -97060 -95427 -4432 -12274 -50999 -99733 -107270 -155058 -102733
19302 -102733 -127418 -180855 -165679 -26364 -16268 -146994 -104169 -44941 26116 119393 115372
19291 115372 166042 76180 -12953 -32985 -150709 -223149 -150725 -85765 -194266 -218776 -213641
19280 -213641 -174692 -94840 -6378 32241 -17630 -100709 -82578 30939 45228 -15812 -31023
19269 -31023 7979 92683 41551 -82819 -92390 -114536 -70416 -14853 -75502 -97576 -31284 -102031
19257 -102031 -115730 -57436 -46845 -54391 -193509 -177054 -9113 120698 132647 14569 -128369
19246 -128369 -141738 -56367 -52077 -96635 -36914 -20387 -39905 -39792 38945 63884 119001 49865
19234 49865 2959 -56147 -34516 84127 28823 -90100 -74328 -59406 -46234 -15914 -117039
19223a17039l1856l727J6227P0430K9190l0484j8370L3262P9191M7418N3997J3568
19211A41807j38572p4695j7680p8220P0249P2019O4350J01081r7410j601j2760
19200B8568L7799L1103K3058k0709n8699m0456Q6934M4000j00092m8954m4900
19189f2348M1572J43181R423j56398j01295k8816K2622Q0519m3087J31631j00754
19178f3750Q0735J3972n1770j34572j06595M9903N7511J07375P9489O0990Q4680
19167A77968L6824K230L5820j31145k04080k0656K804L0223L2157L8000N5063
19156E5208P4677k7662j1654R258p6101j2292K683p8784o6387n6811J0395Q204
19144a69266J05944J37034J38859q8259j98483j0430J03922p6495K6957n1854
$$ plain form
19223 -117039 -148895 -152622 -136395 -65965 -36775 -67259 -85629 -52367 26824 74242 128239 141807
19211 141807 3235 -71460 -89140 -167360 -97111 -25092 39258 140339 42929 41328 28568
19200 28568 66367 97470 120528 99819 41120 664 87598 131598 31506 -17448 -62348
19189 -62348 -20776 122405 131828 -24570 -125865 -154681 -132059 -51540 -94627 37004 -63750
19178 -63750 16985 30957 -20813 -155385 -261980 -212077 -154566 -47191 32298 93288 177968
19167 177968 214792 217022 252842 121697 -82383 -103039 -100235 -70012 -37855 145 55208
19156 55208 129885 102223 90569 99827 23726 11434 14117 -64667 -131054 -187865 -177470 -169266
19144 -169266 -63322 73712 212571 124312 -74171 -84601 19321 -57174 -30217 -82071
19134h2071P1652J5550J99835q837j52731q8369J2565K196l4128k5897P3646J04526
19122H7937L4896J1117k3454m0367j04422n0629k2086k9523l0092J7740J07352
19111d1531k6993q6052j41239J8164N9644J14049J12445O073R4227k0194j2923
19100G5670n8847j51304o8792m9247J25062J89575P7648o5257r7212n6147m9474
19089a28325L8460K3628m778p386K3679J7820J3725j5685l460N0808J2040M2853
19077F3379m7467r5813n6734O8973J30247l9051r9003o3802p0014M3719J52824
19066a2742N8911l9153k1843l5384Q4666K6776j7513j8701n579K8789q9201m2378
19054h3352L6039J84J2351N0118J01478P8425k2676o5006r6405j86456j10332
$$ plain form
19134 -82071 -10419 5131 204966 196129 43398 -44971 -32406 -30210 -64338 -90235 -16589 87937
19122 87937 122833 133950 110496 70129 -34293 -84922 -107008 -136531 -166623 -148883 -41531
19111 -41531 -68524 -154576 -295815 -277651 -218007 -103958 8487 14560 108787 88593 75670
19100 75670 16823 -134481 -203273 -252520 -127458 62117 139765 74508 -22704 -78851 -128325
19089 -128325 -89865 -66237 -71015 -78401 -54722 -36902 -23177 -38862 -42322 8486 20526 63379
19077 63379 15912 -79901 -136635 -67662 62585 23534 -75469 -139271 -209285 -165566 -12742
19066 -12742 46169 7016 -14827 -50211 34455 61231 43718 25017 19438 48227 -40974 -83352
19054 -83352 -47313 -47129 -34778 15340 116818 195243 172567 107561 11156 -175300 -285632
19043b85632P8087P9327J33946q874m2981j08836k7276K8480J22188j2439O3953
19032A9943L2237N1764m4034j06959j1336k7016Q3217K0023k8350j31736k2248
19021a64495N5967M0397R7639Q1507o095j39274j54796J35159J40806M8288M2611
19010A77714p6979n8057m2232k0929j5983j8427l3470J5751M5274M1093O2135
18999G5890j25441J7001N5475M3363l4230l511m3078J0338Q940n3552m5606m8753
18987a43164P3659L0546J26107j0231O5297n7822M1495O9597r1017r3017N2579
18976F4029r514K628o5595m3353M8346L4212R5980n5968j3322K895j16635o7612
18964a23909M8685l8033L2940k2326J63853m7838R5198J06637R024j20706r8311
$$ plain form
19043 -285632 -207545 -128218 5728 -3146 -46127 -154963 -182239 -153759 -31571 -44010 19943
19032 19943 52180 103944 59910 -47049 -58385 -85401 -2184 17839 -10511 -142247 -164495
19021 -164495 -108528 -68131 29508 111015 104920 -34354 -189150 -53991 86815 135103 177714
19010 177714 100735 42678 446 -20483 -36466 -54893 -88363 -72612 -27338 13755 75890
18999 75890 -49551 -32550 22925 66288 32058 28547 -14531 -4193 4747 -48805 -94411 -143164
18987 -143164 -69505 -38959 87148 76917 142214 84392 125887 195484 104467 11450 64029
18976 64029 54515 57143 -8452 -51805 -3459 30753 126733 70765 57443 60338 -56297 -123909
18964 -123909 -75224 -113257 -80317 -102643 61210 13372 108570 215207 224231 103525 5214
18953E214n9609j3710P8816P0716J8066Q9116j16565J2104o1876o9329M2639M6051
18941D1633o629q2813j72263J3964L2313O4200J05513j22957p8130J7109J00854
18930h7206O3111K5181m4063n8343K7809N3607P7653O3799K3125r1099P5748P2549
18918B01871m6713Q1247O3121k8159P7608l9760k7960J136K4949p5014j78054
18907E4272p2463L4693O3323k8804j29589N959O6011k3804L6337M635p7066r1865
18895a58361M884J29224J23923J37210p4592k13329J4618J35709M9086k9722l4784
18884H3866j3414O5858m6519m3955l2699j3736P200J26923L4588P1608p8058o3557
18872I8105l4179k3755J30934j6497r2524P7443L1773j08056k2492j8748J3615
$$ plain form
18953 5214 -54395 -68105 10711 81427 99493 188609 72044 84148 22272 -47057 -4418 41633
18941 41633 35004 -47809 -220072 -206108 -173795 -109595 -4082 -127039 -205169 -188060 -87206
18930 -87206 -24095 1086 -42977 -101320 -73511 -19904 57749 121548 144673 53574 129322 201871
18918 201871 155158 236405 299526 271367 348975 309215 281255 282391 307340 232326 54272
18907 54272 -18191 16502 79825 51021 -78568 -72609 -6598 -30402 5935 10570 -66496 -158361
18895 -158361 -153477 -24253 99670 236880 162288 -51041 -36423 99286 148372 118650 83866
18884 83866 70452 136310 89791 45836 13137 -599 6601 133524 168112 239720 161662 98105
18872 98105 63926 40171 171105 154608 62084 139527 171300 63244 40752 22004 35619
18861C5619Q5830l8486r2093j9816L5013O2064l7181m5359k0817J40571J9963
18850A25308j02834K0894m9573j44722Q8893J02398R366o5606m6604L3088J34694
18839A05302M1058M7130m0452q0729J8610O6982O1386j65818j02003J7225N9065
18828B7756q086O9345J6620J09278K3954p6065o999O5739j04012q5809Q5280M2573
18816A59574m8143p7677N4326o7961j21018O1637Q0613L2212Q3794K4748N093
18805A87198R1998l1135j03270M9195N2776o4285j04964j32997l185Q7700o6844
18794c7813N0471J6982k3339M9702L0612l3275k7776Q1002J60539o3089j48086
18783E5930P123O1851O0120k0313n1853K6485Q1273j43401o6886l664J12760J38591
$$ plain form
18861 35619 121449 82963 -9130 -28946 6067 68131 30950 -14409 -35226 105345 125308
18850 125308 22474 43368 -6205 -150927 -62034 40364 49730 -15876 -62480 -29392 105302
18839 105302 146360 193490 153038 72309 90919 157901 219287 53469 -48534 -31309 27756
18828 27756 19670 89015 105635 214913 238867 162802 155803 221542 117530 31721 117001 159574
18816 159574 111431 33754 88080 20119 -100899 -39262 41351 73563 157357 182105 187198
18805 187198 279196 248061 144791 193986 246762 182477 77513 -55484 -58669 29031 -37813
18794 -37813 12658 29640 6301 56003 86615 53340 25564 106566 267105 204016 55930
18783 55930 63053 124904 185024 164711 112858 139343 220616 77215 10329 6665 119425 258016
18771B58016L0798j04044k2280j9042p1666l3452N305O8485j158K6204O6304j4212
18759A89258j79178m7019J12968P1615q2249q2210j19350R7404r666l210K0624
18748c1013P5464Q1392p9119p7667M4861p602P7990J03157Q2862o1951N9810j4652
18736B53532j05105j92166q5752O7598j9234J57227J18069j02019k5854L0916
18726I7212O7080O588P4487J12166M5638j67542j52599r5125j6481K4548M2215
18715C8187j3672p9698J1054o9365k5858J18903Q8410m0667M7023O1989q4117
18704E2189P9684q34p3309J8848p1953j07524r3805P7568M7675P6506J46400P524
18692A58969q2547p2776N2258o9666M7573L7105n4452j11647L8343J56195l7095
$$ plain form
18771 258016 288814 184770 162490 143448 71782 38330 43635 112120 110962 137166 203470 189258
18759 189258 10080 -36939 76029 147644 65395 -16815 -136165 -38761 -48427 -51637 -31013
18748 -31013 44451 125843 46724 -30943 13918 6316 84306 187463 270325 208374 268184 253532
18736 253532 148427 -43739 -129491 -61893 -81127 76100 194169 92150 66296 97212
18726 97212 164292 170880 245367 357533 403171 235629 83030 -12095 -28576 -4028 38187
18715 38187 24515 -55183 -44129 -113494 -139352 -20449 67961 27294 74317 136306 52189
18704 52189 131873 131039 57730 76578 4625 -102899 -196704 -119136 -71461 5045 151445 158969
18692 158969 76422 3646 55904 -13762 33811 70916 16464 -95183 -56840 99355 62260
18681F2260n7373L334J52959M4992l407P9333j20438j37638m460O5510m6578P4352
18669A12846R8145J29515m5381o9686J03107P8509K2281j20192j41058k6723K5245
18658A66608p5655L1391P7177m5827M2638m3000Q9617j02556j47728k5675o1150
18647i4160L3134q0868O5064K05622J31543n794j66422n8143N1256K6051o3790
18636D3493M7408k2979P2911j9441J2270P9028k8378p0632m9941L8077j2567J9643
18624A08892O1601Q256n450j3403o6291n0967o4115O1432J44978M0032j27110
18613I7855r1130P4454r3931L4358M6929J9001k63M3355L712P1039q5481j7318
18601A02580R3693K4097m9568L3579L3817m5629q5710m2376J476p7573J4339J17018
$$ plain form
18681 62260 4887 8221 161180 206172 202765 282098 161660 24022 19562 85072 38494 112846
18669 112846 210991 340506 295125 225439 328546 407055 429336 309144 168086 141363 166608
18658 166608 90953 122344 199521 153694 196332 153332 242949 140393 -7335 -33010 -94160
18647 -94160 -61026 -141894 -76830 128792 260335 254541 88119 29976 81232 107283 43493
18636 43493 90901 67922 140833 121392 133662 212690 184312 113680 63739 101816 89249 108892
18624 108892 170493 178749 173299 159896 93605 42638 -21477 39955 184933 224965 97855
18613 97855 6725 81179 -12752 21606 68535 87536 87273 130628 134340 205379 119898 102580
18601 102580 196273 220370 170802 204381 238198 192569 106859 64483 65959 -11614 2725 119743
18589A19743N2671k9716J449M5759K9293o8995j44632m1492o2028L3977J67514
18578A03543R0975j39828q0539J29706O9852k175J05082q325r9566J2844M0046
18567B21615J0520N0626R2687q477p1974l955N4496j5570J7908M7686K8402K0962
18555D44926P8346K40089K08272K15322K05234J54405J80611J12906J45533O1554
18545B047198m8763l09893m36092l23716j63679j33795o5303N9132L3898j33973
18535E25014j1465J10924n6597j46299j4049R6236j5594m9836j17201j02564j06287
18524A12282R706j3700L5230Q8649l2707J36010j3824j2465o4518J44167L7789
18513D26619L9107J30114J50419J1082J31043K62244L05748L42334J88636J3225
$$ plain form
18589 119743 172414 142698 144147 189906 219199 150204 5572 -35920 -97948 -63971 103543
18578 103543 194518 54690 -25849 103857 173709 171534 276616 268291 168725 181569 221615
18567 221615 232135 282761 375448 366971 294997 291042 345538 329968 347876 395562 423964 444926
18555 444926 523272 763361 971633 1186955 1392189 1546594 1727205 1840111 1985644 2047198
18545 2047198 1998435 1688542 1252450 928734 765055 631260 565957 625089 658987 525014
18535 525014 513549 624473 567876 421577 407528 503764 488170 438334 321133 218569 112282
18524 112282 121988 108288 143518 232167 199460 335470 321646 309181 244663 388830 426619
18513 426619 465726 595840 746259 757341 888384 1150628 1456376 1798710 1987346 2000571
18503B000571l8743n8491r6569m16035l36696j40684j42706j36461k47090j36680
18493B50416j18568M180J21143O5654K7613p1561n649j8730L8688j12004J2506
18482A93688L1845l6270M4759K6556k7100q6348R673J0076K0864m7520j02829
18471C7394L9194N5216J74423J04945Q2855j35656j24074L5533J91225k8617n6827
18460C75611P0409M0707k8467K5529O6131j5087p5290J6941M1754l4607q971J26861
18448F01521R6063L1981J83735K77802L83452O78739P56279M78710n3892j87048
18438C247342P7717j65750p20546p42298n02397l39247l03561j14751l1269K294
18428D07534Q0228L719l6922K7619O3051l8448J4640O0380J7285n7579R0052J15029
$$ plain form
18503 2000571 1961828 1903337 1806768 1390733 1054037 913353 770647 634186 387096 250416
18493 250416 131848 136028 257171 322825 350438 278877 273228 254498 293186 181182 193688
18482 193688 225533 189263 234022 260578 233478 147130 156803 166879 187743 140223 37394
18471 37394 76588 131804 306227 411172 494027 358371 234297 269830 461055 432438 375611
18460 375611 446020 486727 458260 483789 549920 534833 459543 476484 518238 483631 474660 601521
18448 601521 697584 729565 913300 1191102 1574554 2253293 3009572 3488282 3434390 3247342
18438 3247342 3325059 3159309 2438763 1696465 1194068 854821 551260 436509 405240 407534
18428 407534 487762 491481 454559 482178 545229 506781 521421 581801 599086 541507 631559 746588
18416G46588q2685j54230m5129q5936j5227J09793M8059j08137o3075Q4903J42191
18405E77115Q1893M1581L9194K25895K30278M27017N41395O35273P40525K48043
18395C788209j89069M7185j67349o83851q97566o49021k97841j00497K0413j74606
18385F96007k27439q7589p350n3386N6332N7968n2390p3271l5936j8668M328k4896
18373B33710K3054l5743J25248R0719J3181p9567N6756P5324j58448j11387L7527
18362B70374K5768N0680r0200j18485n6603J59736J36389R4182K913J8662k1688
18351D71728m6732j05034J19921m249M4048j1211r0806j32233K3262J0320n4665
18340B24349J9695Q9357R335q6899n1583r1847J07096J05763J42k2854n5262j28185
$$ plain form
18416 746588 663903 509673 464544 378608 363381 473174 521233 413096 350021 434924 577115
18405 577115 659008 700589 739783 965678 1195956 1622973 2164368 2799641 3540166 3788209
18395 3788209 3599140 3646325 3478976 2795125 1897559 1248538 950697 850200 870613 696007
18385 696007 468568 380979 373629 320243 376575 434543 382153 308882 272946 254278 258606 233710
18373 233710 256764 221021 346269 436988 450169 370602 427358 502682 344234 232847 270374
18362 270374 296142 346822 256622 138137 81534 241270 377659 471841 474754 493416 471728
18351 471728 424996 319962 439883 435634 479682 468471 377665 245432 268694 279014 224349
18340 224349 244044 333401 342736 255837 204254 112407 219503 325266 325408 302554 247292 119107
18328A19107k5850l2150J28774J45744n1168Q7086R3781M300o287j0895R5150
18317E47592j6472j64441j05815R8172M4972J34332J6822J0698K8271m8979r3989
18306D51163n0024J35399l2118j53440n5K7119l039q620l2517j17911J02782N50
18294C19289k7085n9441o0156K7247K9811R7228N0717P6367P5050K8440j03882
18283D53585k6440m0746N624K646J33612j29744j28046m850N0456J04022J6122
18272D36241Q0855Q4711j8801n76J8120M6902m8490m4430M8717n2309n3077j17758
18260C80105n1050r6130q291J47892J19384P158p4342n2642o3769J28282J49633
18249E86230p0535m5493P6559j71038j2522M8324K5636r9638j5875J88813Q8949
$$ plain form
18328 119107 93257 61107 189881 335625 284457 371543 465324 469624 463337 452442 547592
18317 547592 531120 366679 260864 359036 404008 538340 555162 565860 594131 545152 451163
18306 451163 401139 536538 504420 350980 350925 378044 375005 366385 333868 215957 318739 319289
18294 319289 292204 232763 172607 199854 229665 326893 377610 453977 529027 557467 453585
18283 453585 427145 386399 392023 394669 528281 398537 270491 265641 316097 420119 436241
18272 436241 517096 601807 583006 582430 600550 647452 598962 554532 603249 550940 497863 380105
18260 380105 329055 232925 224634 372526 491910 499068 424726 372084 308315 436597 586230
18249 586230 515695 470202 546761 375723 363201 411525 437161 337523 321648 510461 599410
18238E99410K433n387Q5596J04889j0522K9054n8757M9868P6083M4363P6756O828
18226A000614k8456j01532k06930l4622K9134K8792N6181K619l9980q6849o6864
18215E52107P6063L8896p9909q831m9433N5319R1049O3424J83j08287p042K4717
18203F48256k199R2040l9925q3257K9733O6598J2716k5777Q150M6874k8825M6256
18191G70640J204N9822J99007R2007K554n0863r8786J3767J9083p5929j18382
18180H14124j9947J42366K4864j67520j10857q0775Q3520j1518M113k749p068
18169F68553n886q463P5966M198l6487k1241R952J2318M2605L0437O842j5889
18157G62905L2460L0680K5650O799K8024k3104L7727k3862j31989k9421n5399
$$ plain form
18238 599410 601843 596456 682052 786941 776419 805473 746716 796584 872667 917030 993786 1000614
18226 1000614 972158 870626 663696 629074 658208 687000 743181 745800 705820 618971 552107
18215 552107 628170 667066 587157 578326 528893 584212 675261 738685 738868 630581 623539 648256
18203 648256 646057 738097 698172 614915 644648 711246 723962 698185 706335 753209 724384 770640
18191 770640 771844 831666 1030673 1122680 1125234 1074371 975585 989352 1008435 932506 814124
18180 814124 794177 936543 961407 793887 683030 602255 685775 674257 678370 675621 668553
18169 668553 662667 654204 730170 734368 697881 676640 686592 698910 741515 771952 778794 762905
18157 762905 795365 826045 851695 858494 886518 863414 901141 877279 745290 715869 660470
18146F60470K9240M4328J46325O7175K0840k348n8416r6375l3171J04295P2387
18135I54750N8658O7626r6856p7009l4016M1611J9873r5295r3530q9505J2129
18124F68436J6779O8598j0233O5471J04601k359Q255j23142J711J63058K7314
18113I88489l9929m6302p153J41631J18458n3217M2841J53150R0342L8751J6192
18102A443253M6382M7872O1643J6866J14460k1595j14546l1731M2944k3505j16335
18091A465708j46868m8188O9450O8329n144q8379P3675l617M1536P8380J1405
18080A516287n0173j4640k2181o9744k7091J29962J94690q930j25539r92k6135
18069A495514O8620J85083R2969J28726J17880J86445K87618K65147K23069L29396
$$ plain form
18146 660470 689710 734038 880363 947538 968378 966030 907614 811239 778068 882363 954750
18135 954750 1013408 1081034 984178 907169 873153 914764 934637 839342 745812 656307 668436
18124 668436 685215 753813 743580 809051 913652 911293 919548 796406 798117 961175 988489
18113 988489 948560 902258 895105 1036736 1155194 1101977 1144818 1297968 1388310 1427061 1443253
18102 1443253 1489635 1537507 1599150 1616016 1730476 1708881 1594335 1562604 1605548 1582043 1465708
18091 1465708 1318840 1270652 1340102 1408431 1403287 1314908 1388583 1384966 1426502 1504882 1516287
18080 1516287 1466114 1451474 1429293 1359549 1332458 1462420 1657110 1648180 1522641 1521649 1495514
18069 1495514 1564134 1749217 1842186 1970912 2088792 2275237 2562855 2828002 3051071 3380467
18059C380467L52074K40491J12330J6223k15814l56823k16783k9514J97855L00357
18049C780863L56091Q1543j6943r617j31963k70411l28907m60042k01732L2663
18039B831545o3985q7000m662L3079N3789J5028n7009N9595K3508J08974Q2114
18028B994976J31086N8519P5915M167L5347L2119J25045K48919K55426K38260
18018D199779K74141K96040M89974N20334L70252Q3797k8999R0854l3507j03162
18008F159503j67066L4826K73824L74265K49450L77267M89230O42514Q01422P27901
17998I963136N80274M37275O44459O53586M80263N59873R08227J136570J644984
17989A7008647K038186K436396K913302L532380M177488N337262P261667J0323511
$$ plain form
18059 3380467 3732541 3973032 4085362 4101585 3885771 3528948 3312165 3282651 3480506 3780863
18049 3780863 4136954 4218497 4201554 4191937 4059974 3789563 3460656 3000614 2798882 2831545
18039 2831545 2767560 2680560 2675898 2708977 2762766 2777794 2720785 2780380 2803888 2912862 2994976
18028 2994976 3126062 3184581 3260496 3264663 3300010 3332129 3457174 3706093 3961519 4199779
18018 4199779 4473920 4769960 5259934 5780268 6150520 6234317 6205318 6296172 6262665 6159503
18008 6159503 5992437 6027263 6301087 6675352 6924802 7302069 7791299 8433813 9235235 9963136
17998 9963136 10543410 10980685 11625144 12278730 12758993 13318866 14227093 15363663 17008647
17989 17008647 19046833 21483229 24396531 27928911 32106399 37443661 44705328 55028839
17981E5028839J5067137K2652135L5352825N3439995P0970217O6408568K3526155
17974C42445871p767870k155820j7498090o4129644p7309717n5115510l3304398
17967H5164822k0922539j3813070r230627o532540m715239l344210k604195k100241
17959B1902161j396164r30764o82502n24057m19379j03844L15356K10706J52527
17950A8524040R8933N16252R44290J192948J372329J807990K735955L403017M338806
17941C4934560N650323P650679J0967186J5794436K3669390L6819234N6272423
17934A91758231P5471952P3353997K9209266q179712l368774j5885273o6838856
17927B75520831q5660053o2730391l7953137k3573999j5483699j0357197p276774
$$ plain form
17981 55028839 70095976 92748111 128100936 181540931 252511148 318919716 342445871
17974 342445871 334678001 332522181 315024091 250894447 173584730 118469220 85164822
17967 85164822 64242283 50429213 41198586 34666046 29950807 26606597 24002402 21902161
17959 21902161 20505997 19575233 18892731 18368674 17949295 17845451 18160807 18371513 18524040
17950 18524040 18622973 19139225 20083515 21276463 22648792 24456782 27192737 30595754 34934560
17941 34934560 40584883 48235562 59202748 74997184 98666574 135485808 191758231
17934 191758231 267230183 340584180 369793446 361613734 358244960 342359687 275520831
17927 275520831 189860778 127130387 89177250 65603251 50119552 39762355 32485581
17920C2485581n274830m131133l380739k826657k218624j876478j693014j390447
17912I693659j084123o66206l36424k90351l92292o36293m86847l69061n92591
17903D839471p95755m98394l72228j79842j01627o3945l6485K19164L63689J27279
17893C501327p3018m6912j83357l04424m68426m35902l07010k13780k93568j99128
17883I75802j41987p8341j21349n8819j21877N6504o6619J7920R589j94392l2434
17872B43997j6014O9100m933l2466n4326o2528n167p1124N277L8482m0211j04607
17860c4520L0418K9214j1028O9233k4213j30346J9143P1666M8421m2284j17736
17849i2032l0593m5666Q8744O5813l834n485K1643m9433j56147M5590J10620o8295
$$ plain form
17920 32485581 27210751 23079618 19698879 16872222 14653598 12777120 11084106 9693659
17912 9693659 8609536 7943330 7606906 7316555 6924263 6287970 5801123 5432062 4839471
17903 4839471 4043716 3545322 3173094 2993252 2891625 2827680 2791195 3010359 3374048 3501327
17893 3501327 3428309 3381397 3198040 2893616 2425190 1989288 1682278 1468498 1174930 975802
17883 975802 833815 755474 634125 575306 453429 509933 443314 461234 470823 276431 243997
17872 243997 227983 297083 292150 259684 205358 142830 137663 66539 71816 110298 70087 -34520
17860 -34520 -4102 25112 14084 83317 59104 -71242 -52099 19567 67988 25704 -92032
17849 -92032 -122625 -168291 -79547 -13734 -17568 -23053 -1410 -50843 -206990 -161400 -50780 -119075
17837a19075K4016J20065J5999k5284O5294m4272q3337j14445l78Q8941R9370
17826B6894R774P6437m59m744o2677j26457o789j4090j09176l4488o1925Q6375
17814b21325J88932J11482R4898q8708q1556J13555M1321L2814J4415k6846l690
17803A75292j1619o6970l4997L4809Q6746K3251j5568j26208n4491M2304l3138
17792A9411j4495r715M9323J96286m713o2017L7031N1848M2665r0112m4382n5043
17780A16087P2427J42818l9985o1125o681K1357J48005m7297L0626m07J1118J09968
17768D96911j06913j81771k0278J17623J83110M5910p2962k6988p8453O1509r870
17757D07828q4148l9420O6649K9167l9382j70965m7393J2856M3195O3504l4454
$$ plain form
17837 -119075 -95059 25006 41005 15721 81015 36743 -46594 -161039 -161417 -72476 26894
17826 26894 36668 113105 112646 107902 45225 -81232 -88021 -102111 -211287 -245775 -307700 -221325
17814 -221325 -32393 79089 173987 85279 3723 117278 158599 191413 205828 178982 175292
17803 175292 163673 96703 61706 96515 183261 206512 190944 64736 10245 52549 19411
17792 19411 4916 -4799 44524 240810 236097 174080 211111 262959 305624 215512 171130 116087
17780 116087 188514 331332 291347 230222 223541 244898 392903 345606 376232 375825 386943 496911
17768 496911 389998 208227 187949 305572 488682 534592 461630 434642 356189 417698 407828
17757 407828 323680 284260 350909 380076 340694 169729 122336 135192 178387 241891 207437
17746B07437l2435r2371q5443J681J7119Q5235J74072j0604r4178Q640o2285L6841
17734A53709P1701N293l5992M6068j0122p2584O8000J68883N9832n7863j21184
17723B75741M9398K2433o7919K9288p5520O2163L0475l665Q9458K9938q268k7434
17711D06088j49511N9423J07170q6863j62903o2134q296K3106J2156J37149P4480
17700C49865m4537n1222O5187J31556o7873m2513m1322r2631P0976K10482J39880
17689F27848P2326j08883j28168m6824n2145p4802R6697P6877m2207p2894J59632
17678E07457J77063j212P9694l0320m8715j51131n1795N9392J93472K5086r1434
17667F67557m2159m9985n5020N3023l9408o8241J3905Q1649J974N0091P2180m2309
$$ plain form
17746 207437 175002 82631 -2812 -1131 15988 101223 275295 264691 170513 179153 116868 153709
17734 153709 225410 230703 194711 240779 230657 158073 226073 394956 454788 396925 275741
17723 275741 325139 347572 279653 308941 233421 295584 326059 322394 411852 441790 433522 406088
17711 406088 256577 316000 423170 336307 173404 111270 102974 126080 138236 275385 349865
17700 349865 305328 254106 319293 450849 382976 340463 299141 206510 277486 487968 627848
17689 627848 700174 591291 463123 416299 364154 289352 386049 462926 420719 347825 507457
17678 507457 684520 683308 763002 732682 683967 532836 481041 540433 733905 758991 667557
17667 667557 625398 575413 520393 573416 534008 465767 479672 561321 563295 613386 685566 643257
17655F43257k9811n7455R6336L7301L6914R7386N5494K7344K2624R9053J61221
17644A189664r7956o4243J3272j08428M0132O9101L1334J83514J02823q926q0832
17633A269455o1700p8682j9273m1755J3454n7148K0373O817k6278N8537J2191
17622A095991J9544J3126J70241P8099m2813p3179j33058j50207R4686J82167
17612A254597Q6039K7926m6133j03066l2501j2356M4143O3508L077J50579Q5126
17601A520939p000p9440m8970J772J63348P4724q2767J17957J65191J48608j6575
17590A957787j85183n6501l3052N1087P0651N2004J8475q3688J3082K56877J82092
17579B243631J51726K38496R0785L3750L8677m6193n6313K2380L9347J19968J72009
$$ plain form
17655 643257 613446 555991 652327 689628 726542 823928 879422 906766 929390 1028443 1189664
17644 1189664 1091708 1027465 1040737 932309 972441 1041542 1072876 1256390 1359213 1350287 1269455
17633 1269455 1207755 1129073 1109800 1068045 1081499 1024351 1044724 1051541 1025263 1083800 1095991
17622 1095991 1115535 1128661 1298902 1377001 1334188 1261009 1127951 977744 1072430 1254597
17612 1254597 1340636 1368562 1322429 1219363 1186862 1174506 1218649 1282157 1285234 1435813 1520939
17601 1520939 1513939 1434499 1385529 1387301 1550649 1625373 1542606 1660563 1825754 1974362 1957787
17590 1957787 1772604 1716103 1683051 1734138 1804789 1856793 1875268 1791580 1804662 2061539 2243631
17579 2243631 2395357 2633853 2724638 2758388 2797065 2750872 2694559 2716939 2756286 2876254 3048263
17568C048263J71885O8784J22753J56748P7657O0717k722R1852K7467R8761J36370
17557D058535J81584K55427K60275K22370K76460K68579L53229K73668L56705
17548F506832K44487L54918L58940O02943O99343Q67553Q66089Q34736P63131
17539A2098972Q51552R48556R65828R92989J441317J848280K355503L027061L372583
17530B7902641L654837M267925N663889P655738J0155322J5104489K4409231L9631599
17522A38445671O1090997Q1623239P4819817K5460811j292269Q504793k0361788
17515C68291271p3094710o6624135k4510660J4652119M8982764P4429315O0364208
17508D02490172m1158k2323349j1194076m4675252q9228409q0411948m9796353
$$ plain form
17568 3048263 3220148 3288932 3411685 3568433 3646090 3706807 3704085 3795937 3823404 3922165 4058535
17557 4058535 4240119 4495546 4755821 4978191 5254651 5523230 5876459 6150127 6506832
17548 6506832 6751319 7106237 7465177 8068120 8767463 9635016 10501105 11335841 12098972
17539 12098972 12950524 13899080 14864908 15857897 17299214 19147494 21502997 24530058 27902641
17530 27902641 31557478 35825403 41489292 49145030 59300352 74404841 98814072 138445671
17522 138445671 199536668 281159907 355979724 381440535 380148266 388653059 368291271
17515 368291271 295196561 228572426 204061766 218713885 267696649 342125964 402490172
17508 402490172 402449014 380125665 368931589 324256337 235027928 154615980 104819627
17501A04819627k9123482j8127128j1782834q021539n836169m428260l761194
17494B3739021l122612k669153k641521k307700j626840j083556q83040q40159
17486H564440p52682o70796p11270q99435p01198n32081m87880m02242k65632
17477C141224j78522k05554l22347l11272l03592k33482j3217l5023p2241p8485
17467A387489q3408L4189L2272K12698J85845Q2583j96876k80600k10327k76180
17457H87685k33091j61040r1741J27522J27232R1981J79651o1509k63651k25867
17447C77172k09405j24082j07340k0412L6796m4574L1279q6061q1328p0387o3187
17436c61529l2834M5997M6496P5244M5168L5760l4541n7200l8432J24027j4112
$$ plain form
17501 104819627 75696145 57569017 45786183 37764644 31928475 27500215 23739021
17494 23739021 20616409 17947256 15305735 12998035 11371195 10287639 9404599 8564440
17486 8564440 7811758 7140962 6429692 5530257 4829059 4296978 3809098 3406856 3141224
17477 3141224 2962702 2757148 2434801 2123529 1819937 1586455 1573238 1538215 1465974 1387489
17467 1387489 1304081 1338270 1370542 1583240 1769085 1851668 1654792 1374192 1163865 887685
17457 887685 654594 493554 401813 529335 656567 748548 928199 866690 603039 377172
17447 377172 167767 43685 -63655 -84067 -47271 -91845 -60566 -146627 -227955 -298342 -361529
17436 -361529 -394363 -348366 -301870 -226626 -181458 -145698 -180239 -237439 -275871 -151844 -165956
17425a65956j30896m5329k9227R5999N3222N2049O713J9867K2288j43280o2532
17414c27082K30078R4828p3384j20449j9725O4946q0867j2940n1097P3176J63843
17403e8673Q3919m3263P4838Q2694J91334K56271M55179K29021J8121n7879m6792
17392A184770l9743j43689m24088m52088j92671q6921l4322j11507p1023R5553
17382b75729l2404J55748J71564p199j43790J3270j09525P3336l1369Q5610J40449
17371C9961j4770r0007k5890P3995N9632J40591r9045o7839j3368P6549M3053
17360A22862J4541K4750M826L0319J53141L92702M04444K55320J32575o7363n4815
17349A413302r4130l09509l56714l54531k64660q7236N872k30423N0640J01554
$$ plain form
17425 -165956 -296852 -342181 -371408 -275409 -222187 -170138 -163425 -143558 -121270 -264550 -327082
17414 -327082 -97004 -2176 -75560 -196009 -215734 -150788 -231655 -244595 -295692 -222516 -58673
17403 -58673 25246 -18017 56821 139515 330849 587120 1042299 1271320 1289441 1231562 1184770
17392 1184770 1145027 1001338 577250 125162 -67509 -154430 -188752 -300259 -371282 -275729
17382 -275729 -308133 -152385 19179 11980 -131810 -118540 -228065 -154729 -186098 -100488 39961
17371 39961 25191 -64816 -90706 -16711 42921 183512 84467 16628 3260 79809 122862
17360 122862 137403 162153 166979 197298 350439 743141 1147585 1402905 1535480 1468117 1413302
17349 1413302 1319172 1009663 652949 298418 33758 -53478 -47606 -278029 -227389 -125835
17339a25835n7383j1068J3876J16316N3590p7152J4782J6647j7120l8576Q748
17328a03175o6028J3818k0710N425O1467K4101q475k6691n6114N6799j2068l4532
17316a66183l1528K6344J05444O5j8428r871j41280L5531j09070k2123M7675N6708
17304b26716M191J8587j36804j4016J21113R0632p8909O903J06361K26998l0227
17293H8113j32827k51022o4484J16761J10359J10110j00036n4114J12151l4873
17283i9862o3101j07917j20370Q8806O9601J7014o725P1956L3365o4004l3821
17272b15058L6871J4660l2908p9472m9763J40731P9841m6356L5083M3857o4559
17261a37073j46881m155j67n6859K10160J34427r1186k7355N4992N3737j45032
$$ plain form
17339 -125835 -183218 -194286 -180410 -64094 -10504 -87656 -72874 -56227 -73347 -111923 -103175
17328 -103175 -169203 -155385 -176095 -170670 -109203 -85102 -93577 -120268 -176382 -119583 -131651 -166183
17316 -166183 -197711 -171367 -65923 -65858 -84286 -94157 -235437 -199906 -308976 -331099 -283424 -226716
17304 -226716 -222525 -203938 -340742 -354758 -233645 -143013 -221922 -215019 -108658 118340 88113
17293 88113 -44714 -295736 -360220 -243459 -133100 -22990 -123026 -177140 -64989 -99862
17283 -99862 -162963 -270880 -391250 -302444 -232843 -215829 -222554 -150598 -117233 -181237 -215058
17272 -215058 -178187 -163527 -196435 -275907 -325670 -184939 -105098 -151454 -116371 -72514 -137073
17261 -137073 -283954 -288109 -288276 -345135 -134975 -548 -91734 -119089 -64097 -10360 -155392
17250a55392k6905J70113L7234K645M7901o6737n8284l5236J09532k1185j73561
17239a69875Q775Q3467q053K8599n457K022N9118j4763j2161J25n7735l8163j02930
17226b27031p1989L6576J7022L9556J10817n483P3690n426j11316q7224n2276
17215b83084K1025Q8181N040L7599N692m9561O0338R5626Q1731O3157L6154J36593
17203B98491R3369o0692K2566O127j33406j01944O4866J18263R4511J33516j55253
17192C80414j22172p4631O1758O1406j43524n4978N0467p9535r1061M0479M2562
17181G1185o6683j4660J00316L6955M5913m3515m0086m7581N9829M2212p9479
17170F4406k4085k6611K9527R087L4472R671J16297O8533J2059J10130l2172K0322
$$ plain form
17250 -155392 -182297 -12184 25050 27695 75596 8859 -49425 -84661 24871 3686 -169875
17239 -169875 -161100 -77633 -85686 -57087 -62544 -60522 -1404 -16167 -28328 -28203 -85938 -124101 -227031
17226 -227031 -299020 -262444 -245422 -205866 -95049 -100532 -26842 -32268 -143584 -230808 -283084
17215 -283084 -262059 -173878 -168838 -131239 -125547 -175108 -114770 -19144 62587 125744 161898 298491
17203 298491 391860 331168 353734 359861 226455 124511 189377 307640 402151 535667 380414
17192 380414 258242 183611 245369 306775 163251 108273 158740 79205 -11856 28623 71185
17181 71185 4502 -10158 90158 127113 173026 129511 89425 41844 101673 143885 64406
17170 64406 40321 13710 43237 52324 86796 96467 212764 281297 293356 403486 371314 391636
17158C91636j72849j31915M1490J988m8600P0588k3050m7054P2333M7411o6173
17147A35805J6274M4726j11521K7143o9223J7700R6994M6162r387J7435K8158
17136B40266k4794J9331N4996n4416o5944n2462P658K3137J23595p389o933N2786
17124C09831K2138Q837j6867r6770l3552L5998L8661L6060k300k4892M2862Q9310
17112D09316m5567r1482r3717J1173N8446l0439j17920r660N0033J43509j5197
17101B68495k4219K5872l9023R250R9377R2106J30398r0748l4325p2650k9388
17090C35145n1469o7830j4632n4276P8687J56027J02535J3225k993O4101J05953
17079F64473J03172K8757M9009J45790J74940p5285k26198k68J39771Q7825k0426
$$ plain form
17158 391636 218787 86872 128362 130350 81750 152338 129288 82234 154567 201978 135805
17147 135805 152079 196805 85284 112427 43204 60904 157898 204060 194673 212108 240266
17136 240266 215472 234803 289799 235383 169439 116977 124635 147772 271367 263978 257045 309831
17124 309831 331969 340806 323939 227169 193617 229615 268276 304336 302036 277144 320006 409316
17112 409316 363749 272267 178550 189723 248169 217730 99810 90150 140183 283692 268495
17101 268495 244276 270148 231125 240375 339752 431858 562256 471508 437183 364533 335145
17090 335145 283676 215846 201214 146938 225625 381652 484187 497412 494419 558520 664473
17079 664473 767645 796402 845411 991201 1166141 1090856 864658 864390 1004161 1091986 1071560
17068A071560j23342M1837K4551p222P1860j32554K8680j6347k3849m3519j46647
17057G45008j03424L6856J6419j02669J32303L5160P503P25l3187M3238L9238
17046H17170M8869L5783J08822n5497p7552p8896j52386J0871L8197J38739P3232
17035I07352n1651R5532N9088j4413n322J04380K0034R3905K2232j14263K1126
17024A138000P7117K4810N6518o1686J12609M8719j20866L2678K30678N5199q1538
17013A512238m2315J62257J01980L6457j42264Q8451M5851M3738o4162j1120L4648
17002A765759J92513J47436Q4798n8693j3706K12381J31509J54411R6362k9162
16992B683608L8804R9855O0302P2193J97592J59291J05084J41239J89196J44566
$$ plain form
17068 1071560 948218 990055 1014606 1007384 1079244 946690 975370 959023 935174 891655 745008
17057 745008 641584 678440 694859 592190 724493 759653 767156 767881 734694 777932 817170
17046 817170 866039 901822 1010644 955147 877595 798699 646313 657184 695381 834120 907352
17035 907352 855701 951233 1010321 995908 990586 1094966 1115000 1208905 1231137 1116874 1138000
17024 1138000 1215117 1239927 1296445 1234759 1347368 1396087 1275221 1307899 1538577 1593776 1512238
17013 1512238 1469923 1632180 1734160 1770617 1628353 1716804 1762655 1806393 1742231 1731111 1765759
17002 1765759 1958272 2105708 2190506 2131813 2118107 2330488 2461997 2616408 2712770 2683608
16992 2683608 2722412 2822267 2882569 2954762 3152354 3311645 3416729 3557968 3747164 3891730
16982C891730J21493K07699L63800L89672L21263M81912O51032O61047N31812
16973G621460L85284N76408O02011N91302N26272P68418J005288R69090J111703
16964A4157236J363303J529483J759629J982507K160409K439705L281322M557308
16956C3230902O510039R837835J5026680K3720312L7656878N5128996O4234652
16949B45346294L7331076k9533488o5662029n1479586k7914993j1102506J712870
16942I8697638J5066723L1286325M8470289N4288626K1542266m1691466o7575130
16935A60085271n1182634l1129902j9266163j2372335q210235n534310m096207
16928B8293485l046203k128574j376282q51004o58548m71260k85145o223N39956
$$ plain form
16982 3891730 4013223 4220922 4584722 4974394 5295657 5777569 6428601 7089648 7621460
16973 7621460 8006744 8583152 9185163 9776465 10302737 11071155 12076443 13045533 14157236
16964 14157236 15520539 17050022 18809651 20792158 22952567 25392272 28673594 33230902
16956 33230902 39740941 49578776 64605456 88325768 125982646 181111642 245346294
16949 245346294 282677370 253143882 187481853 136002267 108087274 96984768 98697638
16942 98697638 113764361 145050686 193520975 247809601 269351867 227660401 160085271
16935 160085271 108902637 77772735 58506572 46134237 37924002 32389692 28293485
16928 28293485 25247282 23118708 21742426 20891422 20232874 19761614 19476469 19470246 20010202
16919B0010202R86777J323147J477135J799155K715288M035315N742408Q472761
16911D6562188J3153589K0980298L3369322M9307485N8895914L7455942k3364879
16904B36359859o0615220m9472822k7284488j1457718Q97416J3051705K7636215
16897A29114947M4219397N2056304K4813091l6538873o5188662n0240932l0410746
16890F7824526j8538812j1824661p628320n387861m307922l365043k591433j830037
16882A2350437j448297j198070j043693q56742p19262o54996o99480o54529o05792
16873D469576n28360l81770l73994l92351k79088j45369j25915j62348k01284
16864A879097j27522j90811r1123m9841P6185J10739K72429N50419P69790N90352
$$ plain form
16919 20010202 20996979 22320126 23797261 25596416 28311704 32347019 38089427 46562188
16911 46562188 59715777 80696075 114065397 163372882 222268796 259724738 236359859
16904 236359859 175744639 126271817 98987329 87529611 88427027 101478732 129114947
16897 129114947 173334344 225390648 250203739 213664866 148476204 98235272 67824526
16890 67824526 49285714 37461053 29832733 24444872 20136950 16771907 14180474 12350437
16882 12350437 10902140 9704070 8660377 7803635 7084373 6429377 5729897 5075368 4469576
16873 4469576 3941216 3559446 3185452 2793101 2514013 2368644 2242729 2080381 1879097
16864 1879097 1751575 1560764 1469641 1419800 1495985 1606724 1879153 2429572 3199362 3789714
16854C789714J74714j07844j0543j66999o58334p99845p33350l00777J2824J70057
16844A369617M53787O99129Q80876N47757j31978j87112K1284m82668j037185
16835B133507q12502m64408l56975j40703j03204l6598j53509n5321Q2301r0817
16825A771j97272K3441K556j47329k2800N8279J37258N7024q0511p1867M923p1105
16813c05632K6506r1723j08104Q6126J33049k6733R9827L0625J5275L2338j11127
16802b19573j71098j03922L3601L5278J4277K3049l0170J271Q2628Q7549n4588
16791c01698m5021L1391N5523k5291j59689j09491o683k4880P5041M8591j3316
16780d75523q6133q2701O7993R4836M5501M2108n3031j1993M1877j5856O1090
$$ plain form
16854 3789714 3964428 3856584 3846041 3679042 3020708 2220863 1487513 1186736 1199560 1369617
16844 1369617 1823404 2522533 3403409 3951166 3819188 3632076 3653360 3170692 2133507
16835 2133507 1321005 856597 499622 358919 255715 219117 65608 10287 92588 1771
16825 1771 -195501 -172060 -169504 -316833 -339633 -281354 -144096 -87072 -167583 -239450 -234527 -305632
16813 -305632 -279126 -370849 -478953 -392827 -259778 -286511 -186684 -156059 -140784 -108446 -219573
16802 -219573 -390671 -494593 -460992 -425714 -411437 -388388 -418558 -417287 -334659 -247110 -301698
16791 -301698 -346719 -315328 -259805 -285096 -444785 -554276 -560959 -585839 -510798 -462207 -475523
16780 -475523 -561656 -644357 -576364 -481528 -436027 -393919 -446950 -458943 -417066 -432922 -371832
16769c71832k8938k9318R0146J25964p6161q5736l7804j10528k3381O4851J04124
16758c78613j01225M1832J00593q8800k3638R9514Q8804m4149r0989p1332J2901
16747d55102J37742M2312r3604j2769o1035Q7192L3916L2625m7522o9379m56o249
16735d12329p9092R4928K0369l0235J6498p8450J0125m0324R9292J74418N6234
16724a68566j4645j32339j49275M4774R9940j8665r8234n309R809N5328J7423
16713c59759L6211Q632J5731j27432k5849l1514J296r183M7692J12830L9691j313
16701b92967r0773l9511N3918J2103j49404N7179Q1269N1911N1698M834k2776
16690b82519R0552P4488m8618J9113L4078p7479j16404j9630o9949R8259J46745
$$ plain form
16769 -371832 -400770 -430088 -339942 -213978 -290139 -375875 -413679 -524207 -547588 -482737 -378613
16758 -378613 -479838 -438006 -337413 -426213 -449851 -350337 -261533 -305682 -396671 -468003 -455102
16747 -455102 -317360 -275048 -368652 -381421 -442456 -355264 -321348 -288723 -336245 -405624 -406080 -412329
16735 -412329 -491421 -396493 -376124 -406359 -389861 -468311 -458186 -498510 -399218 -224800 -168566
16724 -168566 -183211 -315550 -464825 -420051 -320111 -338776 -437010 -442319 -432510 -377182 -359759
16713 -359759 -323548 -314916 -299185 -426617 -452466 -483980 -482684 -491867 -444175 -331345 -291654 -292967
16701 -292967 -383740 -423251 -369333 -357230 -506634 -449455 -368186 -316275 -264577 -259743 -282519
16690 -282519 -191967 -117479 -166097 -146984 -112906 -190385 -306789 -326419 -396368 -298109 -151364
16679a51364k3019j45899m5784N8147r4578J5270l7660q661Q8272o964n7411J32182
16667b77469O934q4240J23982j0637j17670J9217n1132L0782R9659J2106J376
16656b47092O7312k8999j01635j0441o4477K7165M6611J11871K2893m9403P9030
16645a47165q6879j29921m116J3212J9649N3231N7164L6203L8403P148M7334j53488
16633b49225j35086L4467J98892J9013l6081q5495j31297P0291q8421P4929J32311
16622a95702q834n6626j58713M5723R6433N6758J4941O2152k5303O3086q3360
16611a89445j4488k1172m684N8164m7891o5345j4896o4072r3970M9088O6364L4597
16599c07750L4442J88391k2919J17777R3055N3740R5703N1272K16630M25038O03738
$$ plain form
16679 -151364 -174383 -320282 -366066 -307919 -402497 -387227 -424887 -433548 -345276 -352240 -409651 -277469
16667 -277469 -270535 -354775 -230793 -241430 -359100 -339883 -391015 -360233 -260574 -248468 -247092
16656 -247092 -179780 -208779 -310414 -320855 -385332 -358167 -311556 -199685 -176792 -226195 -147165
16645 -147165 -234044 -363965 -368081 -354869 -335220 -281989 -224825 -188622 -150219 -143071 -95737 -249225
16633 -249225 -384311 -349844 -150952 -131939 -168020 -253515 -384812 -314521 -402942 -328013 -195702
16622 -195702 -204536 -261162 -419875 -374152 -277719 -220961 -206020 -143868 -169171 -106085 -189445
16611 -189445 -203933 -225105 -229789 -171625 -219516 -284861 -299757 -363829 -457799 -408711 -342347 -307750
16599 -307750 -273308 -84917 -107836 9941 102996 156736 252439 303711 520341 945379 1549117
16588A549117P08825K79704m21185p01935n19480k44353l08850j47566J2754J36082
16578C43113J97070L52823L00421M89380N39207j05019o48757o12011l92423j84354
16568B79450j29404p4081q8912q9600k9233J8766o86J35404L1342m1984l7311
16557b6249L0021l5965j28297o2354R0691J71772J06304J16551O5109k2424J19361
16546D24520L26208N72034O39032M55090k08545o13331o56106m51319r8620l9331
16536C49632j03991N4112J23509R0433M50949M81568M76001J85723m43274n78968
16526A085694n28214k40768j30045q9386K2234j31417j56583j24921k482K04664
16516i1224p622n9899p0233j23239k8765N0449R3496j8242k7735J2085r5097M562
$$ plain form
16588 1549117 2257942 2537646 2116461 1414526 895046 650693 341843 194277 207031 343113
16578 343113 540183 893006 1193427 1682807 2222014 2116995 1468238 856227 463804 279450
16568 279450 150046 75965 -12947 -102547 -131780 -113014 -113700 21704 53046 11062 -26249
16557 -26249 3772 -32193 -160490 -222844 -132153 39619 145923 262474 327583 305159 424520
16546 424520 750728 1322762 1961794 2416884 2208339 1595008 938902 487583 388963 349632
16536 349632 245641 299753 423262 513695 964644 1446212 1922213 2107936 1664662 1085694
16526 1085694 557480 316712 186667 97281 119515 -11902 -168485 -293406 -295888 -91224
16516 -91224 -98846 -158745 -228978 -352217 -380982 -330533 -237037 -255279 -283014 -270929 -366026 -361464
16504c61464J3326J16199J12484n5959o9302r5512o6830J36620J08935r6998k922
16493b61423L2858O4172J8123J2542l492n9854p8277L875O5302J21302l9705m7731
16481a72308L3494k3058k6308k3426n5929p266J14016L6657j82294j93551P9131
16470d20842N5538P7418j20656m7584R3758K1090k1847P0803O4042o1347R6779
16459a92848O180j44607M864N3192N5775m1538L3395j810n7874l1033P3180J41805
16447a01319R5135j65369m1316J2650L8319l8388J5763l1100L1812K3238L3006
16436a27569m7086Q7082p5873j0439N0118l4347r7530o259R4138n6566n0121r8868
16424c73320O1166P2618P2182L9603J6471k9664n4424J58246K6093j13203K9113
$$ plain form
16504 -361464 -348138 -231939 -119455 -175414 -244716 -340228 -407058 -270438 -161503 -258501 -261423
16493 -261423 -228565 -164393 -146270 -133728 -137220 -197074 -275351 -271476 -206174 -84872 -124577 -172308
16481 -172308 -138814 -161872 -188180 -211606 -267535 -274801 -160785 -124128 -306422 -499973 -420842
16470 -420842 -365304 -287886 -408542 -456126 -362368 -341278 -363125 -292322 -228280 -289627 -192848
16459 -192848 -186668 -331275 -326411 -273219 -217444 -258982 -225587 -227397 -285271 -316304 -243124 -101319
16447 -101319 -6184 -171553 -212869 -200219 -161900 -200288 -184525 -215625 -183813 -160575 -127569
16436 -127569 -174655 -87573 -163446 -173885 -123767 -158114 -255644 -261903 -167765 -224331 -274452 -373320
16424 -373320 -312154 -239536 -167354 -127751 -111280 -140944 -195368 -37122 -11029 -124232 -95119
16413i5119k5404n7876L868m3511P4732P4804L4808m2901K9558M7274j01308L577
16401i7498L2629J07923K1158m3393N1503k8701o8530l1826J58427J12067J03148
16390C16907K11798L60266K53290j31414k0760j31312k66081p7803q2361N1083
16380D83613J87636J90007K29364k1759j17486j89137k39097k05637r8183o4278
16370A55043k3366K7709p8613r7123p0696J0464N7942p6872l195M2100j29010
16359a85617m8728J3561J51044K5709j1681J246J43938O5228p1015m1839J09904
16348A51750J50198J53758K79775K19955O6069j14092j63862j62373j16779k2311
16338D42088o9296j7866J46209J83573P3949O4575q5412j13750j67644j31922
$$ plain form
16413 -95119 -120523 -178399 -174531 -218042 -143310 -68506 -33698 -76599 -47041 233 -101075 -97498
16401 -97498 -64869 43054 64212 20819 72322 43621 -24909 -56735 101692 213759 316907
16390 316907 528705 888971 1142261 1010847 990087 858775 592694 514891 432530 483613
16380 483613 671249 861256 1090620 1068861 951375 762238 523141 317504 219321 155043
16370 155043 131677 159386 80773 -16350 -87046 -76582 -18640 -95512 -98707 -56607 -185617
16359 -185617 -234345 -220784 -69740 -44031 -55712 -54466 89472 154700 83685 41846 151750
16348 151750 301948 455706 735481 955436 1021505 907413 743551 581178 464399 442088
16338 442088 372792 354926 501135 684708 758657 823232 737820 624070 456426 324504
16328C24504r7970r5795r0027k8886o9961l8566Q1621J39893K3445q4471o3261
16317E26K4449j49166o6334M4371j6046K5356P1261R7681O1071M9895r3118o1766
16305a1820o4590q5977O7334J0994M2928P1425L2809j25743n055J7310p3156K2833
16293a00708J22933j00320j14327k7557K0881O4230O1406o0198O266q7888p0791
16282b86073O4032Q9801K267R9100Q8775m5359o3325p363k9696k6809k8151n1634
16270a94435L1118J35953J45096j38708j08981n6793m4410R7513k6066m573L9266
16259a25020r821l5909o8839O6524M8737J02736O573j4576j33810M9846J23562
16248A0003K3892n9451r9261O7800m1746k3760m4826K130R1102O6051K3504l4606
$$ plain form
16328 324504 226534 130739 40712 11826 -58135 -96701 -15080 124813 148258 63787 526
16317 526 24975 -124191 -190525 -146154 -162200 -136844 -65583 32098 93169 143064 49946 -11820
16305 -11820 -76410 -162387 -95053 -84059 -41131 30294 63103 -62640 -67695 -50385 -123541 -100708
16293 -100708 22225 -78095 -192422 -219979 -199098 -134868 -73462 -133660 -127394 -215282 -286073
16282 -286073 -222041 -132240 -129973 -30873 57902 12543 -50782 -58145 -87841 -114650 -142801 -194435
16270 -194435 -163317 -27364 117732 -20976 -129957 -186750 -231160 -133647 -159713 -164286 -125020
16259 -125020 -134841 -170750 -239589 -173065 -124328 -21592 -15019 -29595 -163405 -113559 10003
16248 10003 33895 -25556 -124817 -57017 -98763 -122523 -167349 -165219 -74117 -8066 15438 -19168
16236a9168M5468l0995M3553N4325N9556q6716m1531m5566p4151N8775M0626K3862
16224B8038L8940k8636p1457q5722o4895N6586J14088k9935k2446j9012j659q1702
16212a67812j8456n0611j129J01068L5661j6616O9263P5067q76p6752N395j31860
16200a77658N1516M6228j10911j7114O0369O2031l8277M3589N9222M057k9860
16189d6808l4384K2416l2046J9165N337k22321n6313Q7235K7516n5075Q7407M0516
16177a57355R9739k1509p8637Q5897M9540K3975M0340k9176m9026j4730l7624
16166h8566L3184k1885r1587P0640n0256r6189R2409K3707N5505K8355Q746r8099
16154a34036L7879J55323P639m5502k8018Q030J05839J33134r5159l6076m0440
$$ plain form
16236 -19168 26300 -4695 38858 93183 152739 66023 24492 -21074 -95225 -36450 4176 28038
16224 28038 66978 38342 -33115 -118837 -183732 -127146 -13058 -42993 -65439 -84451 -86110 -167812
16212 -167812 -186268 -236879 -238008 -136940 -101279 -117895 -48632 26435 25559 -51193 -45798 -177658
16200 -177658 -126142 -79914 -190825 -207939 -147570 -85539 -123816 -80227 -21005 -16948 -46808
16189 -46808 -81192 -58776 -90822 -71657 -66320 -288641 -344954 -257719 -230203 -285278 -197871 -157355
16177 -157355 -57616 -79125 -157762 -71865 -22325 1650 41990 12814 -36212 -50942 -88566
16166 -88566 -55382 -77267 -168854 -98214 -148470 -244659 -152250 -128543 -73038 -44683 -35937 -134036
16154 -134036 -96157 59166 66805 21303 -6715 1315 107154 240288 145129 109053 68613
16143F8613o1118p046m8909j6329L4432j0967p9435l7073K5187N6306n6752l6236
16131a69327r856J34104M6217M0889j60393j2524n8638k66J14405L6164o2235
16120a01460N1012M7135l5971k1993r8250p4116O7055M6529L8079N2771J17595
16109H8386j63917k7482K3980J8549M5950J7978m6132P2792k5735m888K1118R263
16097B9862Q5415M8189O9381j86608j93316l6937M1114J07861O9802J4600k538
16086D6825l1112m4778m4076O9417L8117Q9548k4700p0359o5346p6043N7609J18187
16074F3289j346l4303J3865p887r1607J35502k4002r4685k4851J18815k4636o1059
16062c2905K7320J7622Q5620J3585j9625j00331J5027m4806J02966O9522m3537
$$ plain form
16143 68613 7495 449 -48460 -64789 -30357 -41324 -120759 -157832 -132645 -76339 -133091 -169327
16131 -169327 -179183 -45079 1138 42027 -118366 -130890 -189528 -189794 -75389 -39225 -101460
16120 -101460 -50448 -3313 -39284 -61277 -159527 -233643 -166588 -120059 -81980 -29209 88386
16109 88386 -75531 -103013 -79033 -60484 -14534 3444 -42688 30104 4369 -519 20599 29862
16097 29862 115277 163466 232847 46239 -147077 -184014 -142900 -35039 34763 49363 46825
16086 46825 15713 -29065 -73141 -3724 34393 123941 99241 28882 -36464 -112507 -54898 63289
16074 63289 61943 27640 41505 33618 -57989 77513 53511 -41174 -66025 52790 28154 -32905
16062 -32905 -5585 12037 97657 111242 91617 -8714 6313 -38493 64473 133995 90458
16051I0458P3189k6150j12237j28080m130J1859M8463K2840j02929j35332o951
16040b69000K03117O2599n8286n8600q0498K7961q9852J0617p773J20726K4399
16029a14590j11924J3151J04523P4893O0328J0068N1830J22314L1126k9377k0209
16018A92133j74629n6083l913o4344M3768O5122P5440J3310K737o2859r7954j08321
16006a75593Q8984M5882m0457R7553K3735q7893N8138j7410L0236J11912R4307
15995B29394m4894p7922n5459m7428L0969k7781j06953j5216j42176J6463J25779
15984a15224J18725O1304M454N3185n0294j23231K4586Q7521l6515l3830k5762
15973c5081l979j29417O638J33673l710L0952O1541r0517o2013M1653P0301p8706
$$ plain form
16051 90458 163647 137497 25260 -102820 -106950 -95091 -46628 -23788 -126717 -262049 -269000
16040 -269000 -65883 -3284 -61570 -120170 -200668 -172707 -262559 -251942 -259715 -138989 -114590
16029 -114590 -226514 -213363 -108840 -33947 26381 36449 88279 210593 241719 212342 192133
16018 192133 17504 -38579 -42492 -106836 -63068 2054 77494 90804 93541 30682 -67272 -175593
16006 -175593 -86609 -40727 -81184 16369 40104 -47789 10349 -7061 23175 135087 229394
15995 229394 184500 106578 51119 3691 34660 6879 -100074 -115290 -257466 -241003 -115224
15984 -115224 3501 64805 69259 122444 72150 -51081 -26495 61026 24511 -9319 -35081
15973 -35081 -39060 -168477 -161839 -28166 -31876 -924 60617 -29900 -91913 -50260 20041 -58665
15961e8665P1836O6673k9260j12269M9872j0406o622j07840j206L6956M4727Q938
15949d7266J549P1062k4963o0319R6273O161M3121Q1864L0339k6562J5797M5792
15937B32848q4059j33453Q7176m9457m7123J2919N9419Q615j15858n432N0395
15926A5990m1890q4277j0737N2226O4472J1920j00954J4767M3964p6657J5285
15915i5891Q1284Q0366O6432j5095j20153k9544k3535K1360M7332P8224J03083
15904A93863n0080p9764J0985J7232Q8876M3842j5804l3846J5166j8905q3255
15893H8310r7018n161p9433J10236N3516L2268L3262J21628p3560j16999L973
15882G1022K8468R960r3638J32504J15820j21857k07519q4024J04282N7576J6407
$$ plain form
15961 -58665 13171 79844 50584 -61685 -11813 -22219 -28841 -136681 -137887 -100931 -56204 -47266
15949 -47266 -45717 25345 382 -59937 36336 42497 85618 167482 197821 171259 187056 232848
15937 232848 148789 15336 102512 53055 5932 18851 78270 86885 -28973 -34405 15990
15926 15990 -25900 -110177 -120914 -68688 -4216 7704 -93250 -78483 -34519 -111176 -95891
15915 -95891 -14607 65759 132191 117096 -3057 -32601 -56136 -34776 12556 90780 193863
15904 193863 143783 64019 75004 92236 181112 224954 209150 175304 190470 171565 88310
15893 88310 -8708 -13869 -93302 16934 70450 102718 135980 257608 184048 67049 71022
15882 71022 99490 109450 15812 148316 264136 142279 -65240 -149264 -44982 12594 29001
15871B9001r205K9595K8518j0467m7417M612O1951o378j6868o2469M5767l6391
15859A0249M664L7105M5203j2297M8358Q133l5591m2866P0218l0404j3143O1320
15847A50949M3160l1364o0894j1036l890J7336j07498L9267K2683J725k5695K8981
15835F3724p4454r2828O88K1725P8209N1873Q5671n0387Q7116m7204l2885n5903
15823C5345J2868L240n9563o0769N9320L4163L6706k5959q2604j1856J04869O8794
15811A14554N0509j27549n9876R6354J13205k0869m1307n3273o7915M7443N8958
15800A10234o9112j04134m9377q2566l5852O6197J31489N1759J29069L1443k592
15789A76558N176r207n3585j0524J64967J5111o3325r4058N7741O2163j3718j5483
$$ plain form
15871 29001 19796 49391 77909 67442 20025 24637 86588 80210 63342 873 46640 10249
15859 10249 14913 52018 97221 84924 133282 141415 105824 62958 133176 102772 89629 150949
15847 150949 194109 162745 101851 90815 86925 104261 -3237 36030 58713 60438 34743 63724
15835 63724 -10730 -103558 -102870 -81145 -2936 48937 134608 84221 171337 124133 91248 35345
15823 35345 48213 51453 -8110 -68879 -9559 24604 61310 35351 -47253 -59109 45760 114554
15811 114554 165063 37514 -22362 73992 187197 166328 125021 71748 3833 51276 110234
15800 110234 41122 -63012 -112389 -194955 -230807 -164610 -33121 18638 147707 179150 176558
15789 176558 181734 172527 118942 108418 273385 288496 225171 131113 188854 251017 237299 221816
15777B21816j42456J1008P8681j4846M8437J20648J8478M266l2799j01606n160
15766B06467q5901M2049O5680m4010L2957p7305j39892l6464M1414M168N7449
15755F6612J07834K7510o2486j17232J58159L6271k11J8816j73717j02471n3661
15744i4576j5841J6809J1118j1699K7444J62711P5746n4272l1150P841L9531n4494
15732G9168j21858N2788R8185N1171q6753o032N61q844j1934o2886O8417K2600
15720G4583K2773K1462K9124O3242K1346l316k3754q4040o317n7466j9281O0858
15708I9214J2856O362K5035p2161l796R3997M0191k5143J6030J0446k6961n5761
15696A20309o3195M3932L056P3089j44261m0219R381j4609M8630J15383n4367
$$ plain form
15777 221816 79360 90368 169049 154203 202640 323288 341766 346032 313233 211627 206467
15766 206467 120566 162615 228295 184285 217242 139937 45 -36419 4995 9163 66612
15755 66612 174446 201956 139470 22238 180397 216668 216457 235273 61556 -40915 -94576
15744 -94576 -110417 -93608 -82490 -94189 -66745 95966 171712 117440 86290 94131 133662 79168
15732 79168 -42690 10098 108283 159454 72701 66669 67230 58386 46452 -16434 51983 74583
15720 74583 97356 118818 147942 211184 232530 229214 205460 121420 115103 57637 38356 99214
15708 99214 112070 118432 143467 71306 67510 161507 201698 176555 192585 203031 176070 120309
15696 120309 57114 101046 104102 177191 32930 -7289 2092 -12517 36113 151496 97129
15685I7129J41327N7868l7100K6409P876o1243j24139j03404o7051K624J28752
15674F9048j6704l7414K1382p5731j6802K6392J0592l6907P8740N8118O621p4759
15662A2576m6897k6141J04811j6346J32197N985J8419j8407j20473K0628P3203
15651A39555k4407J16121O6081N4803J38590o270j82975n372J13771j64109j39612
15640A06176l8658J30612Q1608r1116n5153J37535J03397K6072j69633p6111M1988
15629A96717J7127q0626j05303o9898L2958M8935k4289o399M3678n569Q7426N6839
15617A91596l0654K9284j16351P8425R3515N9914j4664p8612j1158M1138J4102
15606B56535J38582o8263j69096j61099n078M4888N927j30726R4609J58119J34886
$$ plain form
15685 97129 238456 296324 259224 285633 293509 232266 108127 4723 -62328 -59704 69048
15674 69048 52344 14930 36312 -39419 -56221 -29829 -19237 -56144 22596 80714 87335 12576
15662 12576 -34321 -60462 44349 28003 160200 166185 184604 166197 45724 66352 139555
15651 139555 115148 231269 297350 352153 490743 484473 301498 296126 409897 245788 106176
15640 106176 67518 198130 279738 188622 133469 271004 374401 400473 230840 154729 196717
15629 196717 213844 133218 27915 -41983 -9025 39910 15621 9222 52900 47331 134757 191596
15617 191596 160942 190226 73875 152300 245815 305729 291065 212453 201295 242433 256535
15606 256535 395117 326854 157758 -3341 -8419 36469 42396 -88330 6279 164398 299284
15595B99284l5717q7088l1334o706J64215j2654o4125L1418n4492R5269N4872
15584C52942K2942K744l198q9886m9770J2274k0223o6438P160L5823j18341N1558
15572A37587J69769J38908O5547j0667k64157j54060Q0571p3445n0567J08351
15562A47837J00021J35358k9815m4919K7248J8533R3419p6867j88114J0541Q7553
15551B80795n6018j18155M175J9866M2633j1510J0833j9372J9744L2769J01149
15540C06909J83274J18752j71r81J2291m3175j13335j20060m9755J24186J3764
15529D31699m4286o3397O818j7634l2596M7470k8752q5649R5623J52151R77m0295
15517D22129l9453q7157P3234O1027j61143k09643K2745L2591p8462P4586O2279
$$ plain form
15595 299284 263567 176479 145145 138439 302654 290000 225875 257293 202801 298070 352942
15584 352942 375884 378628 375430 285544 235774 248048 227825 161387 168547 204370 86029 137587
15572 137587 307356 446264 511811 501144 236987 82927 163498 90053 39486 147837
15562 147837 247858 383216 353401 308482 335730 354263 447682 370815 182701 193242 280795
15551 280795 224777 106622 110797 130663 173296 161786 172619 153247 172991 205760 306909
15540 306909 490183 608935 608764 607783 620074 576899 463564 343504 293749 417935 431699
15529 431699 387413 324016 330834 313200 280604 328074 299322 213673 309296 461447 462424 422129
15517 422129 382676 295519 368753 429780 268637 58994 81739 114330 35868 110454 172733
15506A72733p949J30493j4827J2394N563J03073k3986j10731L359K7185k6764
15495B70543m6537J0831O6978K02505l5244k02020r9140J10218l0704p6156o524
15484A64750J39358p4241m5130N9008k450j9471Q1564N9256m3145K1861o953p2572
15472B61835m4894q9414o9073O9968J60405J6276J900j04426L2439K8091k4818
15461B38289J03384o4790j07485m2808j6359j7485J05470q560m5947P8701o821
15450B15589N8937j10963k7900j2807J06579K3708m3454r1320j4554J29722J56956
15439C90493q620r9194J4170O9054q1474j25212N4960J9631q333j0550K3116j33543
15427A04498m8508m545l4657R7385L3132K7651K5338M4825p370N4085N6330Q2279
$$ plain form
15506 172733 164784 295277 280450 292844 298407 401480 377494 266763 270122 297307 270543
15495 270543 224006 234837 301815 504320 469076 267056 167916 278134 247430 171274 164750
15484 164750 304108 229867 184737 243745 241295 221824 303388 362644 319499 341360 334407 261835
15472 261835 216941 127527 58454 128422 288827 305103 307003 202577 235016 263107 238289
15461 238289 341673 276883 169398 126590 110231 92746 198216 189656 143709 222410 215589
15450 215589 274526 163563 135663 122856 229435 253143 209689 118369 103815 233537 390493
15439 390493 381873 282679 296849 365903 284429 159217 214177 233808 225475 214925 238041 104498
15427 104498 55990 51445 16788 114173 147305 174956 200294 245119 237749 291834 348164 430443
15415D30443J0441q2998j29707J28989M4805J4353J9962J9717m4092n2871M83
15404C59525m8004l7738M0186q1557M1677l5805m760M3912p3582J2430J50338
15393C66622M0295K6827P287K4351j02645K1883J3228r0824L9385j9690N7222
15382C83941M0480j6898J9860J19868n3475o0738j03528J1272o46m330P7101j109
15370D11798o7326P6392J11996q5783j6930Q5420J01540q3997m7629n3297o3907
15359C68277r3400Q81O7464J85946o108n0533j46867R042K8518K3279m7526j07513
15347B31460r0070J39836K00627J17749j38056j85217q9106R3919P6965R6664
15337D54771J5278q3797n4458j3778J03252r8877j32622j07344J21771j0853J7575
$$ plain form
15415 430443 440884 357886 228179 357168 401973 416326 436288 456005 411913 359042 359525
15404 359525 311521 273783 313969 232412 274089 238284 233524 277436 203854 216284 366622
15393 366622 406917 433744 441031 465382 362737 384620 397848 307024 346409 326719 383941
15382 383941 424421 407523 427383 547251 493776 433038 329510 340782 340136 335806 412907 411798
15370 411798 344472 420864 532860 447077 430147 515567 617107 533110 485481 432184 368277
15359 368277 274877 275758 343222 529168 523060 472527 325660 334702 363220 386499 338973 231460
15347 231460 141390 281226 481853 599602 461546 276329 187223 281142 358107 454771
15337 454771 470049 386252 331794 318016 421268 322391 189769 82425 204196 193343 210918
15326B10918P2829M3960l9612k7885J31116R2704o0807l0033J6111j15298n8915
15315B35088p393L7089L4032J4814l7691N6155n5119N8377k0021n5067J17123
15304C77387J20676k0056r5094L5211J615n6851j0784K095L9688j4927p3234L7821
15292C43547J24134M0458j26599j82691j6338O7944J28860j944j23561o3729R5137
15281B85218J9136O463K5062j9921Q0715P3220j22426Q199M4279k9775k717P2563
15269D40016n0251q4381j58141k5217O5647j41559l3904J53316J67312Q9129k2733
15258C99234j277n1938p7914k0930K6139p0621J40874J4342j9873L3898J0489
15247C82423N2340J17067n9117j9050M2587l5167j17596J0549O3921M247l3063
$$ plain form
15326 210918 283747 327707 288095 260210 391326 484030 423223 393190 409301 294003 235088
15315 235088 227695 264784 298816 313630 275939 332094 276975 335352 315331 260264 377387
15304 377387 498063 478007 382913 418124 419739 362888 352104 354199 393887 378960 305726 343547
15292 343547 467681 508139 381540 198849 182511 250455 379315 377371 253810 190081 285218
15281 285218 304354 310817 335879 315958 396673 469893 347467 355666 399945 370170 367453 440016
15269 440016 389765 305384 147243 122026 187673 46114 12210 165526 332838 421967 399234
15258 399234 397957 346019 268105 247175 273314 202693 343567 357909 338036 371934 382423
15247 382423 434763 551830 492713 473663 516250 481083 363487 374036 437957 442204 409141
15236D09141r7533j5440J85970R2154L6024R2846P128n2623m0611K2196n0100
15225E89152o9383j7493K3714J8323j11064o5413J19755L0883r2489P8178j62545
15214C41618J9794O4009K4247j980K2549j18356Q7218J4011Q8048J11901j0204
15203F42855j06077k5930P0382m6735j0179l528n5044R9387P0531j06199l5693
15192D93770J19965m0485j70337M4152M4845m7058k5391M7041J21945L2312n8234
15181E62525m8962k8102k02j9060k6057k5514K1213O9632l222K468Q5907J7165
15169F07791j17386j52407n8546J9962l9626K2710J19496J16858J7201o3492J1949
15158D84510M6035O9715P303j13992r5618q0183P3153J0652r1325j2682J2387
$$ plain form
15236 409141 311608 296168 482138 574292 610316 703162 710290 657667 617056 639252 589152
15225 589152 519769 502276 525990 544313 433249 367836 487591 518474 425985 504163 341618
15214 341618 361412 425421 449668 447688 470237 351881 439099 453110 541158 653059 642855
15203 642855 536778 510848 581230 534495 524316 520788 465744 565131 635662 529463 493770
15192 493770 613735 573250 402913 447065 491910 444852 419461 466502 588447 620759 562525
15181 562525 513563 485461 485259 466199 440142 414628 435841 505473 502251 504719 590626 607791
15169 607791 490405 337998 279452 299414 259788 282498 401994 518852 536053 472561 484510
15158 484510 530545 600260 607563 493571 397953 317770 390923 401575 310250 297568 309955
15147C09955m6128k5284N2847J30250P0481q165J9457M3130K311j1289j00492
15136D37073q1561j12353K6404J10796k4993L9992K3025M3210L9944M1880R7757
15125F41174M5584j07878j08452M5736j7866j4411m7710k8841k4110J33366N2774
15114E69366k2895M2557K8762Q1887k8094n5149j03748k08057J3270R2901O5066
15103D75866J06784M5987o0846k0527p6103p9565j0599J20548K2252j2028l1641
15092D80128Q6404J02336k8087j65467o6531m2727M5398R1685R1638L066n8183
15081E39660K5539N5848l1185O6485r439l7263l2069o7063r2338l1842R9892k5948
15069D60277n0541n3092q4325J8607J37008P4193L8611k8252j30756k5405r5767
$$ plain form
15147 309955 263827 238543 291390 421640 492121 483956 503413 546543 548854 537565 437073
15136 437073 355512 243159 269563 380359 355366 395358 418383 461593 501537 543417 641174
15125 641174 686758 578880 470428 516164 498298 483887 436177 407336 383226 516592 569366
15114 569366 546471 589028 617790 699677 671583 616434 512686 304629 317899 410800 475866
15103 475866 582650 628637 567791 547264 471161 391596 380997 501545 523797 511769 480128
15092 480128 566532 668868 640781 475314 408783 366056 411454 503139 594777 597843 539660
15081 539660 565199 621047 589862 656347 646908 609645 577576 510513 418175 386333 486225 460277
15069 460277 409736 356644 272319 290926 427934 502127 540738 512486 381730 356325 260558
15058B60558o5349J02140N5211J82613K9491m1842n8360N5835o2349P3527L9196
15047E70671l2116n4237k9263L881J01781Q6314n9717n6849j0101m0239l584K0247
15035D96788L6267K0097j4284k9179L1972O4295m3189r3044J695J28381J13594
15024G13393J7645O0889O3640j51088p400m2872n9461q1694n3708p854N248R6092
15012E52830J50343j0928o0607K3191m0201j97394o8972Q1003R1005L5154L349
15001E58773J5827L2300N5907k8922m5467q9500j3467N358j01301J10486J34295
14990F34289L5949K341k2765k6204O9024r3971o5843Q3138J35046M4001m9520
14979G45485K7777o1851k5229P0404M9154J06452r5380j39462j17539k0139j7844
$$ plain form
15058 260558 195209 297349 352560 535173 564664 522822 464462 520297 457948 531475 570671
15047 570671 538555 484318 455055 458936 560717 647031 587314 530465 520364 480125 476541 496788
15035 496788 533055 553152 538868 509689 541661 605956 562767 469723 471418 599799 713393
15024 713393 731038 791927 855567 704479 697079 654207 594746 513052 459344 451490 456738 552830
15012 552830 703173 692245 631638 654829 614628 417234 348262 429265 520270 555424 558773
15001 558773 574600 606900 662807 633885 588418 498918 485451 490809 389508 499994 634289
14990 634289 670238 672579 649814 623610 692634 598663 532820 615958 751004 795005 745485
14979 745485 773262 711411 686182 756586 805740 912192 816812 677350 559811 539672 521828
14968E21828L9821Q0667M7286L1751J06523o084j16000p9691l5142O594J8157
14957F15710K5456p1460j24629l96j153r8938K5322J32685P4650M0212o2847R922
14945E64534O2720J37703j7576n6228j9592J13184R2244p0204j36499j15366j13144
14934D41776O4900p2747m3217m8260j2853J88081J25209M7098k207l16O5614j1827
14922G41251j03709l5117j446j08096k2569J01426J29858R9655J7691M2472L1653
14911H93069j45732r0610K1440O210p067n8334n9724O6253L6708K7755q8896R4835
14899F95907M9308M8653J21224j3638p5492j29405K6119o092j5552p2955j10070
14888E18007N5203N131m8389k9872p8070J3986K2328P4313J8561K2796M2407k2791
$$ plain form
14968 521828 561649 642316 689602 721353 827876 821792 705792 626101 590959 597553 615710
14957 615710 641166 569706 445077 444681 443528 344590 369912 502597 577247 617459 554612 564534
14945 564534 627254 764957 747381 691153 671561 784745 876989 806785 670286 554920 441776
14934 441776 506676 433929 390712 342452 329599 517680 642889 689987 687780 687464 753078 741251
14922 741251 637542 602425 600979 492883 470314 571740 701598 801253 818944 861416 893069
14911 893069 747337 656727 678167 684377 677310 618976 559252 625505 662213 689968 601072 695907
14899 695907 745215 793868 915092 901454 825962 696557 722676 716584 701032 628077 518007
14888 518007 573210 578341 529952 500080 422010 435996 458324 532637 551198 573994 616401 593610
14876E93610l879R112L5073Q1094J08191o4871j95690L282L1894j64435j2600
14865D20781Q5213P8597j4758M3194O1692J876l0021K4498P4693o2969q7141J26690
14853G22345J39570k5237j01705l2652R2178k535j17855m3897K9083O8790n1351
14842F76734q0467j0626K5065J70612K2917j16036O0410p0559j9613m5091R0477
14831G03823n2421n6112K9378J09486l6958k5464j04790L015k1481L7608J36426
14820G22510m0403N4850O538M5430O0896k027l2054r4596j00485j381n4741Q3583
14808F48120J46818j9437n0609L0092j7350j5361j4307Q4589j2852O723p2540
14797G13886p675J11999O5529n5825j14590K3478q092j1868O7958j2651N8680
$$ plain form
14876 593610 589731 598843 633916 715010 823201 758330 562640 565922 597816 433381 420781
14865 420781 505994 584591 569833 613027 674719 676595 646574 671072 745765 682796 595655 722345
14853 722345 861915 836678 734973 702321 794499 791964 674109 630212 659295 728085 676734
14842 676734 596267 585641 610706 781318 804235 688199 748609 678050 658437 613346 703823
14831 703823 651402 595290 624668 734154 697196 671732 566942 569957 548476 586084 722510
14820 722510 682107 736957 743495 788925 849821 847794 815740 721144 620659 619278 564537 648120
14808 648120 794938 775501 724892 754984 737634 722273 707966 792555 779703 786426 713886
14797 713886 706211 818210 883739 827914 713324 736802 728710 716842 784800 772149 830829
14786H30829n5073m4564J31332J41646j54640j64696j14677J10022J07692l9007
14776G48864L9452P2231l0259o105J36259N854k0155n886j28098p7956M2542R9995
14764H76738p8801Q4409J38859o3113k31322m8768j17511o6749j3037j3603J05720
14753E72822R0320L1147N880k9666l5312P8906O7496J04369R4922j26959j7339
14742H36586j41611K0137Q1976R3496L005j23898m3671M9945m1674P816m4013
14731F98094O2892Q0731r0267p6302q7706j1023J45386k9279K8074M3505P3489
14720H37594M8252k9820q7576Q4107P794N474L6902L0559m2227k13975P2119M7921
14708G97124J01566k8612l6129n4890p8467O3538J38900l9112o1526M2249o7882
$$ plain form
14786 830829 775756 731192 862524 1004170 849530 684834 570157 680179 787871 748864
14776 748864 788316 860547 830288 824183 960442 966296 946141 940255 812157 734201 776743 876738
14764 876738 797937 882346 1021205 958092 726770 678002 560491 493742 480705 467102 572822
14753 572822 663142 694289 700169 670503 635191 714097 781593 885962 980884 853925 836586
14742 836586 694975 715112 797088 890584 893589 769691 726020 775965 734291 742107 698094
14731 698094 760986 841717 751450 675148 587442 576419 721805 692526 720600 764105 837594
14720 837594 885846 856026 768450 852557 860351 865825 902727 933286 891059 677084 749203 797124
14708 797124 898690 870078 833949 779059 700592 764130 903030 863918 802392 844641 776759
14697G76759k5502L2494J08069j04688o9748k7789R5912o9976n2149Q3029J2525
14686G58936P188k8161L6075M9757P7065Q6027q1036j81183j44137p8306O1735
14675E63960P7055j7020p4034J79601J22933j08300N191n1914O3138P0494L139
14664H34243n5318R6737L5456J23865J8894j02846j11897j36203O1859R0361j6747
14653H38404n6320j10538L2333L2876R7649l6938K2751Q5268J08320n7528o0108
14642H96169J5054R9350M023m1941M1827p5258p0408K6233j0567n19K9007n302
14630I07668O0118m324M9389p4648J2158j03715l8407J12760J06515N9662j06256
14619I80920j6174N9391O2044j07628j89666k4790Q4937J8643J1807o4647n8031
$$ plain form
14697 776759 751257 783751 891820 787132 717384 689595 785507 715531 663382 746411 758936
14686 758936 766124 737963 774038 823795 900860 986887 905851 724668 580531 502225 563960
14675 563960 641015 623995 549961 729562 852495 744195 749386 697472 760610 831104 834243
14664 834243 778925 875662 911118 1034983 1053877 951031 839134 702931 764790 855151 838404
14653 838404 782084 671546 703879 736755 834404 797466 820217 905485 1013805 956277 896169
14642 896169 911223 1010573 1014596 972655 1014482 939224 868816 895049 884482 883963 912970 907668
14630 907668 967786 963462 1012851 938203 950361 846646 808239 920999 1027514 1087176 980920
14619 980920 964746 1024137 1086181 978553 788887 764097 849034 867677 879484 814837 756806
14608G56806J6320K671o781L3757l4020n7953P522J24258L8658j19716q4912J82571
14596H59181P7340m9077K553o2956k7719j42660O3259R7340N5331M2200K5155
14585I39947K5913J9431L3776L1728n8883n7571j2923J5320n2083p7135k7890
14574G79630j27789Q2451K8612k6194J15164J15938l2761q6937L7488R5910j00114
14563H81398o9966j1791m9651M7690M209N106K0704M6045j0614j04324m4298N113
14551G19621O5346M5611R9401K2298K0144O013j03122K0719J18202P5275l5811
14540A053697j02615j25389P9309l3055j0626q4584r9101n5470O0966Q5765J00826
14529H69723P6134l2769o4896M9078R3762j16322k911J18275N2513m7726K1560
$$ plain form
14608 756806 773126 775797 769016 802773 768753 710800 718322 842580 881238 761522 676610 859181
14596 859181 936521 887444 889997 827041 799322 656662 719921 817261 872592 914792 939947
14585 939947 965860 985291 1019067 1050795 991912 934341 921418 936738 884655 807520 779630
14574 779630 651841 734292 762904 736710 851874 967812 935051 848114 885602 981512 881398
14563 881398 811432 799641 749990 797680 801889 806995 827699 873744 863130 758806 714508 719621
14551 719621 784967 830578 929979 952277 972421 978434 875312 896031 1014233 1089508 1053697
14540 1053697 951082 825693 905002 871947 861321 776737 677636 622166 683132 768897 869723
14529 869723 945857 913088 848192 897270 991032 874710 871799 990074 1042587 994861 1016421
14518A016421Q5467J9333J9203r0593o4047p7828l3166J18996Q0493J6256K9466
14507A120001j41174M9748N5039j2909l4648J82291J41799L91j30310j24901j15493
14496I89834n9573M0385M0777r243l8117P0079j6170J07986p072j36239k7462
14485I55185J7889j2487K1955J27007J00879n7419k5828Q6386p9977j34686j43798
14474H55106o9719l9627J6912J02685L0875L8374k1585j2565q0331R5134O4076
14463I79335j86907l4596N9976r998J67810J18083N2732M1125l1475J7051k8504
14452A144632j09490J2977o2199k8327k644N3389J73249q846K4799r6825p5959
14441A024756N9885m4804O5704n1923q4478l7736M4670P0783l3713L3655j6635
$$ plain form
14518 1016421 1101888 1121221 1140424 1049831 985784 907956 874790 993786 1074279 1090535 1120001
14507 1120001 978827 1028575 1083614 1070705 1036057 1218348 1360147 1360538 1230228 1105327 989834
14496 989834 930261 970646 1011423 1002180 964063 1034142 1017972 1125958 1118886 982647 955185
14485 955185 973074 960587 982542 1109549 1210428 1153009 1127181 1213567 1133590 998904 855106
14474 855106 785387 745760 762672 865357 896232 934606 913021 900456 820125 915259 979335
14463 979335 792428 757832 817808 807810 975620 1093703 1146435 1187560 1156085 1173136 1144632
14452 1144632 1035142 1048119 985920 957593 954949 1008338 1181587 1172741 1197540 1100715 1024756
14441 1024756 1084641 1039837 1105541 1053618 969140 931404 976074 1046857 1013144 1046799 1030164
14430A030164R6178r7294j5223p0479K2241R1697M6439j15316q9836Q6344O9653
14419A054568L8593L7294q638N6827l3619q5390L1997L5977N5155P3989j06375
14408A150378j63061K8000P3898M2378J5444R834j15463m3919j3802R7867j1586
14397A069968J1618K8481K267O1596J3635k1447O1653R1353L0706q0811L2424
14386A301443j16877r2009L6109k6391L9895Q2396J05754q3611N2282n0832r8726
14375A149433o1016R8618M2796j00908p8215q1758k3003Q5968k4832p1258J52550
14364A088375K2942q3612o2609J5963N0040o870l1944l3814k3546P5837N3219
14353A063981n9500r240M8221Q4726K9318r6788j97853l29o058O4841N7993J13059
$$ plain form
14430 1030164 1126342 1029048 1013825 943346 965587 1057284 1103723 988407 898571 984915 1054568
14419 1054568 1093161 1130455 1121817 1178644 1145025 1059635 1091632 1127609 1182764 1256753 1150378
14408 1150378 987317 1015317 1089215 1131593 1147037 1156871 1041408 997489 983687 1081554 1069968
14397 1069968 1081586 1110067 1112334 1173930 1187565 1166118 1227771 1319124 1349830 1269019 1301443
14386 1301443 1184566 1092557 1128666 1102275 1142170 1224566 1330320 1246709 1298991 1248159 1149433
14375 1149433 1088417 1187035 1229831 1128923 1050708 968950 945947 1031915 1007083 935825 1088375
14364 1088375 1111317 1027705 965096 981059 1031099 1024229 992285 958471 934925 1010762 1063981
14353 1063981 1004481 995241 1043462 1128188 1157506 1060718 862865 862536 856478 921319 979312 1092371
14341A092371L3777k9393J384O637j15246j49963K1779J95567J7040J6408Q0487
14330A170848N8337p207k7078j21839k8895m6634J05226J17092N0795p1611j12804
14319A086230K986K32J04231n5013j30440J7656K4375J02255l0275j62989L0938
14308I90186R1508k3311j2039N8618J28243q6156J998N3125P6089m0854k01196
14297A036211j05180M9258o2810o3691M8165R135l8268k0616Q3668j7454L7311
14286I55729P1234J786J31324N069j0360N0331k3065o183Q7080J5987j77736j05322
14274I95874K7648q7527M6097J81295Q2249K1101l5190m3159K7641L4404l6640
14263A213793p5804j2823J68380n899m7451Q5297j31724j11723L1917L828J13046
$$ plain form
14341 1092371 1126148 1096755 1098139 1104776 989530 839567 861346 1056913 1073953 1090361 1170848
14330 1170848 1229185 1221978 1194900 1073061 1044166 997532 1102758 1219850 1270645 1199034 1086230
14319 1086230 1089216 1089448 1193679 1138666 1008226 1025882 1050257 1152512 1122237 959248 990186
14308 990186 1081694 1058383 1046344 1104962 1233205 1147049 1149047 1202172 1278261 1237407 1036211
14297 1036211 931031 980289 917479 853788 901953 911088 872820 852204 935872 918418 955729
14286 955729 1026963 1028749 1160073 1165142 1154782 1205113 1182048 1175865 1262945 1278932 1101196 995874
14274 995874 1023522 935995 982092 1163387 1245636 1266737 1231547 1188388 1216029 1250433 1213793
14263 1213793 1137989 1125166 1293546 1287647 1240196 1325493 1193769 1082046 1113963 1117791 1230837
14252A230837J26826k5167j14851o440M5018J2022p1365J2600p5122r6327N9081
14241A097112M7933J850l054n9264o7574l8983J1299P6616l9058J158o392j01403
14229I20240K9838Q894K416O4381L4829P5623J15487j5175j67201q7215M6842
14218A028959M2250J07582O4022k9865j02467m354N2677m8557j716o8866P7986
14207A117651K5773P36p0571r6021K2470J01158n2003Q2763m5409J41964Q5132
14196A313643n6600o3466o0846J6957l8284O9910J05165L9379J5383L4504k2388
14185A353357l1984r5825j6034O2553K8859j142o506p8928r2928r222l1536P3428
14173A154092J61307n5160J3150k7977l8913N6298k156k8845q6781l3399O939
$$ plain form
14252 1230837 1357663 1332496 1217645 1211205 1256223 1268245 1196880 1209480 1134358 1038031 1097112
14241 1097112 1145045 1146895 1143841 1084577 1017003 978020 989319 1065935 1026877 1028035 1021643 920240
14229 920240 950078 958972 961388 1025769 1060598 1136221 1251708 1236533 1069332 982117 1028959
14218 1028959 1071209 1178791 1242813 1212948 1110481 1106127 1158804 1110247 1108531 1039665 1117651
14207 1117651 1143424 1144160 1073589 977568 1000038 1101196 1049193 1131956 1086547 1228511 1313643
14196 1313643 1257043 1193577 1132731 1149688 1111404 1181314 1286479 1325858 1341241 1375745 1353357
14185 1353357 1321373 1225548 1209514 1272067 1300926 1299784 1293278 1214350 1121422 1112200 1080664 1154092
14173 1154092 1315399 1260239 1273389 1245412 1206499 1262797 1260641 1231796 1145015 1111616 1118555
14162A118555J14484L1810r4245l5519P6176l9499K5432j28325N0223k4834J9616
14151A113874j2774J24757r854n094P3736p4327q9739l0547N5843l9916k6269
14140A079690j26842q5968j6413k8643N8264J11201J17230Q0122M4429M545J48795
14129A386410Q7713q9517j25192N0381j3919j2186L7000j937k7213R243k4999
14118A275784q4227K5364o4683q9413K8977R9362p1950r2870L4619J56379L1576
14107A248918k7299J03349L5722j64727q3286o3069J4865P8445J02872K0422n5897
14096A210315n1484J01625m9123l4782j11049m2665J08816M2330j6108M3070p8617
14085A122328k8432r4055r6347K8702P5979L9384L1875J34423J01948j0652p6005
$$ plain form
14162 1118555 1233039 1264849 1170604 1135085 1211261 1171762 1197194 1068869 1119092 1094258 1113874
14151 1113874 1101100 1225857 1216003 1210909 1284645 1210318 1120579 1090032 1145875 1105959 1079690
14140 1079690 952848 866880 850467 821824 880088 991289 1108519 1188641 1233070 1237615 1386410
14129 1386410 1474123 1384606 1259414 1309795 1295876 1283690 1320690 1318753 1291540 1300783 1275784
14118 1275784 1191557 1216921 1152238 1062825 1091802 1191164 1119214 1026344 1060963 1217342 1248918
14107 1248918 1221619 1324968 1360690 1195963 1112677 1049608 1064473 1142918 1245790 1266212 1210315
14096 1210315 1158831 1260456 1211333 1176551 1065502 1022837 1131653 1173983 1157875 1200945 1122328
14085 1122328 1093896 999841 903494 932196 1008175 1047559 1079434 1213857 1315805 1305153 1229148
14074A229148o5614j17679P68J19651j4769L3346j21652n3885J57402m2359r8282
14063A026075J11145j2821J9550J21941K5891j06624p7444k3949L6603L99j0539
14052A110227m7P4257J80270J58127o5217j37261o3128m3817r6232m0728q3450
14041I93001Q9887O6569J22957K1742L3072n5163r9127l4212l4107l4396L9397
14030A109620P4962j5706j7156n868p3570K2825J78430L9942o4039q8687L2150
14019A192903o245j9297N9379l951m7093l1927O760p8466m6060J27857K6452K6453
14007A206765J16415k696k4628j04354l6649J58076J5034R334M429j5920l5978
13996A289828l6229m6479j0283L6769l3994o1631J27529J09292j59577n2618L7447
$$ plain form
14074 1229148 1163534 1045855 1046623 1166274 1151505 1184851 1063199 1009314 1166716 1124357 1026075
14063 1026075 1137220 1124399 1143949 1265890 1291781 1185157 1107713 1083764 1120367 1120766 1110227
14052 1110227 1110180 1184437 1364707 1522834 1457617 1320356 1257228 1213411 1117179 1076451 993001
14041 993001 1082888 1149457 1272414 1294156 1327228 1272065 1172938 1138726 1104619 1070223 1109620
14030 1109620 1184582 1168876 1151720 1145852 1072282 1095107 1273537 1313479 1249440 1160753 1192903
14019 1192903 1186658 1167361 1226740 1222789 1175696 1143769 1150529 1072063 1026003 1153860 1180312 1206765
14007 1206765 1323180 1320484 1295856 1191502 1154853 1312929 1327963 1337297 1341726 1325806 1289828
13996 1289828 1253599 1207120 1196837 1233606 1199612 1137981 1265510 1374802 1215225 1162607 1200054
13985A200054J3847l9004N3224P8558l6716O118k8693k391j51521m6670J79808
13974A226614Q9010o0728l7995Q7449Q6047L836o4093j11871l8583N6271J11440
13963A347397k3127K8543q7163j79372k0536n5857p9781K7675J16962J44117K466
13952A221324J0748o799o7901p693R8802R2012l217q2158O813r5192q6961K1628
13940A101406J2935P1887q529j8203M4977O8648m6266r1369J1921Q96K1187l0925
13928A138565p0598L5015k2970N7706n8819r0140J7786J40183J14295J21344K387
13917A384754o1176K9047r9087Q3535q0005k3429L7947o10P0138o3975r9198M0925
13905A218866r325q53J0207K9844P387k4527j0394j08377k0587R1475o1143j60340
$$ plain form
13985 1200054 1213901 1174897 1228121 1306679 1269963 1276081 1247388 1244997 1093476 1046806 1226614
13974 1226614 1315624 1254896 1216901 1304350 1390397 1394233 1330140 1218269 1179686 1235957 1347397
13963 1347397 1324270 1352813 1265650 1086278 1065742 1009885 930104 957779 1074741 1218858 1221324
13952 1221324 1232072 1225273 1157372 1149679 1248481 1340493 1337276 1255118 1261931 1166739 1079778 1101406
13940 1101406 1114341 1186228 1177699 1159496 1204473 1273121 1226855 1135486 1147407 1148303 1169490 1138565
13928 1138565 1067967 1102982 1080012 1137718 1078899 988759 1006545 1146728 1261023 1382367 1384754
13917 1384754 1323578 1352625 1253538 1337073 1257068 1233639 1271586 1270976 1341114 1277139 1177941 1218866
13905 1218866 1209541 1208688 1218895 1248739 1256126 1231599 1221205 1112828 1092241 1183716 1122573 962233
13893I62233o003K226j1359R1943L3960O4933l2730n689k4285l0232L8749J19560
13881A203306K407J1970K2545p8937k8036o1374p9801q143J67390J9584m5332
13870A125579q4665K7658K0406P811J49418J33236r4861l6244k2188L5157j1563
13859A249744k9983N3485n7413r928K8456k1850m010n6532O9603J1546N3404j42233
13847A144289k5398P9872K4174l305j6672p0443J03740R2793m0717n7979q899
13836A221455k6498L5922m3084k5509K395K2491M720M6268n4835O6366o4921J3760
13824A198530J18914N8915k36503j01496R300L1908O7450M0728k1925k1407o362
13813A138052L0458p336M871N6171O0013K9037J43731j45965j59869L7765J18037
$$ plain form
13893 962233 956230 958456 947097 1039040 1073000 1137933 1105203 1099514 1075229 1044997 1083746 1203306
13881 1203306 1205713 1217683 1240228 1161291 1133255 1071881 992080 983937 1151327 1170911 1125579
13870 1125579 1040914 1068572 1088978 1096789 1246207 1379443 1284582 1248338 1226150 1261307 1249744
13859 1249744 1219761 1273246 1215833 1205905 1234361 1212511 1208501 1151969 1221572 1233118 1286522 1144289
13847 1144289 1118891 1198763 1222937 1219632 1202960 1132517 1236257 1329050 1288333 1230354 1221455
13836 1221455 1194957 1230879 1187795 1162286 1164681 1187172 1191892 1238160 1183325 1249691 1184770 1198530
13824 1198530 1317444 1376359 1139856 1038360 1047660 1079568 1147018 1187746 1165821 1144414 1138052
13813 1138052 1168510 1161174 1166045 1222216 1282229 1311266 1454997 1309032 1149163 1186928 1304965
13802A304965m5512j07024j07703J9599J01114p9618q4262M6964Q3576J04810
13792A236909n194l4512K174l283l1257K1769j12037m2836M4469K8486R8196k7380
13780A175504k0222j0100J1679l1363K6497R3271Q3198j8439r003N0395N8585
13769A410002m4192r5552j35140j29575K7221J05129Q4467P9219J18751J1654
13759A431984j36348r3954n0032R5437p1147j59716j5629k0245J1465Q5652M4623
13748A122090k2695J8345P0433L4892m2499l8174q121Q181N601J33772J848n8571
13736A225102k11375o7489J44177J91623O8702J0282j85266M511j06346m4933
13726A028988M7901R4489P2598K7870q9141J4435q7823r5657L3541J6453m2265
$$ plain form
13802 1304965 1259453 1152429 1044726 1064325 1165439 1085821 1001559 1048523 1132099 1236909
13792 1236909 1231715 1197203 1199377 1196094 1164837 1186606 1074569 1031733 1076202 1104688 1202884 1175504
13780 1175504 1155282 1145182 1156861 1125498 1151995 1245266 1328464 1310025 1301022 1351417 1410002
13769 1410002 1365810 1270258 1135118 1005543 1032764 1137893 1222360 1301579 1420330 1431984
13759 1431984 1295636 1201682 1151650 1247087 1175940 1016224 1000595 980350 991815 1077467 1122090
13748 1122090 1099395 1117740 1188173 1223065 1180566 1142392 1134271 1142452 1148053 1281825 1283673 1225102
13736 1225102 1013727 946238 1090415 1282038 1350740 1361022 1175756 1180267 1073921 1028988
13726 1028988 1076889 1171378 1243976 1271846 1182705 1197140 1109317 1013660 1047201 1063654 1021389
13715A021389J25085O7929J7298m9601q5807p1473L3173M9514N2605j02216Q0310
13704A138206J62085m0824j36586m23L5958O1420K9191n8072L6066j05155n7859
13693A064007J26970O6421m3653q655l3702J76l4537k2173J3793j5745n9352O4366
13681A117916M9789j26558m1495M3674Q1927m9892J1913P6174L2118k3409P1545
13670A243702Q422r6910o6802K9995N4693r4093o9646m4428j24507r5996L9848
13659G84278O1032J33131P3703K6893J6754k5389J5860O2655P961n4852K6150
13648A128176Q8875J5543p6163q4935K7285J8558m476k9927M0325J06545M6456
13637A276262K3686j07613k3347n3858N7137j23799j10528n128K9479J68061J54393
$$ plain form
13715 1021389 1146474 1214403 1231701 1182100 1096293 1024820 1057993 1107507 1160112 1057896 1138206
13704 1138206 1300291 1259467 1122881 1122458 1158416 1219836 1249027 1190955 1227021 1121866 1064007
13693 1064007 1190977 1257398 1213745 1205090 1171388 1171564 1137027 1114854 1128647 1112902 1053550 1117916
13681 1117916 1167705 1041147 999652 1043326 1125253 1075361 1087274 1163448 1195566 1172157 1243702
13670 1243702 1252124 1155214 1088412 1118407 1173100 1079007 1009361 964933 840426 744430 784278
13659 784278 845310 978441 1052144 1079037 1095791 1070402 1086262 1148917 1156878 1102026 1128176
13648 1128176 1217051 1232594 1156431 1071496 1098781 1117339 1112863 1082936 1123261 1229806 1276262
13637 1276262 1299948 1192335 1168988 1115130 1172267 1048468 937940 932812 962291 1130352 1284745
13626A284745j05045q2219N0110J16273J19260k7954j53962j94029q2126L9655
13616I64708K7570j4098R005o7637K948m960l2310M6187P6196M5358M5405K6760
13604A125132k8319n3567N3072j5753k1348L8016J62157J90916j39515k2586m1731
13593A246474m2677L2929Q2319j24380q2736j38063K8426M3223r0294j71550p0484
13582G13187P8443J39490m7486K4167J45515J76159M3262o9679l5188j6963o9628
13571A081279O6050l1458m1728m1913m3212j30323N9125P2756M0961J17788K4384
13560A173709J4000n0727l9086p147n6114P6661J16176l8792j17092l6934o684
13549A027970j34580r1342J10736R7042q0169n8746P1023k5383m7424n1917J2848
$$ plain form
13626 1284745 1179700 1097481 1147591 1263864 1383124 1355170 1201208 1007179 925053 964708
13616 964708 992278 978180 987185 919548 922496 917536 885226 931413 1007609 1052967 1098372 1125132
13604 1125132 1096813 1043246 1096318 1080565 1059217 1097233 1259390 1450306 1310791 1288205 1246474
13593 1246474 1203797 1236726 1319045 1194665 1111929 973866 1002292 1045515 955221 783671 713187
13582 713187 791630 931120 883634 907801 1053316 1229475 1272737 1203058 1167870 1150907 1081279
13571 1081279 1147329 1115871 1074143 1032230 989018 858695 917820 990576 1031537 1149325 1173709
13560 1173709 1187709 1136982 1097896 1090749 1034635 1111296 1227472 1188680 1071588 1034654 1027970
13549 1027970 893390 802048 912784 1009826 929657 870911 941934 916551 869127 817210 830058
13538H30058J62716J3186m5920K2934J32989K0443N682K2633o1928o2838O873
13527A046828K7900m4425J3437o7727o8930M2181L9493P3100P5704J3384o7318
13516A083627k1229o9842L4702P6903k6945n72j6017M6343J1738L6247K0927k6366
13504A149516j95907O580J14387J16622n7797J2199j7655j61921j90669j9066
13494G56289l516J15090O8826O395M4073Q5781o9256j20607L7078l2477O4419
13483I52095P0076q8209M2017k891n6926M0114n1048N7394J06125l4346j18174
13472I16227q0933k6194J07318J0419K0256m0485P8045O5531o4606j7008j22426
13461H46144L8602M0654l40n3069k1096N6651j2699n2474m7702P4274K8923n7526
$$ plain form
13538 830058 992774 1005960 960040 982974 1115963 1136406 1142088 1164721 1102793 1039955 1046828
13527 1046828 1074728 1030303 1043740 976013 907083 949264 988757 1061857 1137561 1150945 1083627
13516 1083627 1062398 992556 1027258 1104161 1077216 1076644 1060627 1106970 1118708 1154955 1175882 1149516
13504 1149516 953609 960189 1074576 1191198 1133401 1145600 1127945 966024 775355 756289
13494 756289 752773 867863 936689 943084 987157 1072938 1003682 883075 920153 887676 952095
13483 952095 1022171 933962 975979 973088 916162 956276 905228 962622 1068747 1034401 916227
13472 916227 835294 809100 916418 926837 947093 906608 984653 1050184 985578 968570 846144
13461 846144 884746 925400 925060 871991 850895 907546 894847 842373 794671 868945 897868 840342
13449H40342J16630R6413m0949p4260j18741J2012J68894J48357l9145J20j9740
13438A089933J7635Q247M898j55229j51404K091R9571J23372N1637n8636m8J8074
13426A050141o9140P9928p013L1661j0232m6461K1475M1370m3828J2275j13151
13415I47025l767J17901l8334l8717p5307n489R66q871k1285L1215P7850j2599
13403I70588j7958n7862k0048l7016Q002R0734J745L0078Q9836n6537j01700p4150
13391H25712L5801J4045M581J90502M008p1135j38r043K2014n0912n942j04075
13379H55418p4692M5306P3266j8446r9713k8271J8006Q5204M9755j29743Q2307
13368H58397n4989O9485J29812L5030l7061p5681q853k1896J09824J22l2437J07926
$$ plain form
13449 840342 956972 1053385 1012436 938176 819435 831447 1000341 1148698 1109553 1109673 1089933
13438 1089933 1107568 1115815 1120713 965484 814080 816171 915742 1039114 1090751 1032115 1032067 1050141
13426 1050141 981001 1060929 1053916 1085577 1075345 1028884 1050359 1091729 1047901 1060176 947025
13415 947025 943258 1061159 1022825 984108 908801 903312 904278 895407 874122 905337 983187 970588
13403 970588 952630 894768 874720 837704 845706 936440 938185 968263 1058099 1001562 899862 825712
13391 825712 861513 875558 880139 1070641 1074649 1003514 1003376 994333 1016347 965435 959493 855418
13379 855418 780726 826032 899298 880852 781139 752868 770874 856078 905833 776090 858397
13368 858397 803408 872893 1002705 1037735 1000674 924993 916140 894244 1004068 1004190 971753 1079679
13356A079679l5028k16801m6490J24994K6648j16232k2263J3591O8765n6295j15868
13345G04700k779K4416O2940N8008J4359j09938j2949J15729O4129J15772p3805
13334I60582j24841O5821O6201K9392J3361k4281M1929k4061P263j81904n1773
13323G77689Q1782Q0405n5885k509L088j21249L0301P7330J0976J3659M6539J5854
13311I57980o6983j8000p1847p5432N2255Q2392O448p4008j06070n1149J31482
13300G67068K8247r7804M2445L3251K5144l7799m9402M8519o5134o5153N2048
13289F81430l004N1509M1501M3745O8337q2765o6750k5687J4282J17424J09435
13278I49457k6308k4565j11742n5899K7825M0666O8990Q0863k3131q9703o0053
$$ plain form
13356 1079679 1044651 827850 781360 906354 933002 816770 794507 808098 876863 820568 704700
13345 704700 701921 726337 789277 847285 861644 751706 738757 854486 918615 1034387 960582
13334 960582 835741 901562 967763 997155 1010516 986235 1028164 1004103 1011366 829462 777689
13323 777689 859471 939876 883991 881482 884570 763321 793622 870952 881928 895587 942126 957980
13311 957980 890997 872997 801150 725718 777973 860365 866813 792805 686735 635586 767068
13300 767068 795315 697511 739956 773207 798351 760552 711150 759669 694535 629382 681430
13289 681430 678426 729935 771436 815181 883518 800753 734003 708316 722598 840022 949457
13278 949457 923149 898584 786842 730943 758768 799434 868424 949287 926156 836453 776400
13267G76400R612M0275K3144l9265P6635r4526m2766N7093J06089j03236j24502
13256F84953N0097J9486j6570j00501m742k2480J7832j00243o5510q7594O2092
13245D36820J30734J27022M3335n029N4224P5293n7439n7026j6074q3613K249
13234F50496J65057M1458J00083l7662n7897M3055M2649N5421j50374q7087K3626
13223G88825o941N0082P2077J2288J6952j60634j21322O4325N1373l8509j11129
13212F17387K7951J15388P7491j3742k6066j0362q0032n4547k7871l4490O2876
13201F53983J49460L0676R4434N8902q4277j46326n8055R2261j2225O476p9950
13190G05359l1834n2114r8747L5295L4569k0781Q491k5299j6552Q0493O2800K2676
$$ plain form
13267 776400 786012 826287 849431 810166 886801 792275 749509 806602 912691 809455 684953
13256 684953 735050 754536 737966 637465 632723 610243 628075 527832 462322 374728 436820
13245 436820 567554 694576 737911 732882 787106 862399 804960 747934 731860 648247 650496
13234 650496 815553 857011 957094 919432 861535 904590 947239 1002660 852286 765199 788825
13223 788825 781884 831966 904043 916331 933283 772649 651327 715652 767025 728516 617387
13212 617387 645338 760726 838217 824475 798409 788047 708015 653468 625597 591107 653983
13201 653983 803443 834119 928553 987455 903178 756852 698797 791058 778833 785309 705359
13190 705359 673525 621411 522664 557959 592528 571747 580238 554939 538387 618880 681680 704356
13178G04356R7006k2583N2067r704j87884r3161J02625J88727j2092J753N1606
13167H72716N7619j48445l922K5104m610P6303k8497j10230o8537R5936N4064
13156H17501R5297J7427j15803j13636j41776J0257J63312Q5063l980j0232o1868
13145G41562n441m7636J7765R6620r7446q8017M0850j08475p0765p8385K4632
13134D25264Q8543M6302R3924J03362r0304n0614o948l3199q544o3866J3592R4538
13122F12050M3243k7687J44121M3019q5653r8414p3466J8253o5660L1784L6235
13111E77825Q1290J6791k8774j1N2347J7324j1684J1435K5872Q674L72j14868
13099F36593p4075j57234L9418M8071R6287o7358m7347M0785P8706L8148p0598
$$ plain form
13178 704356 801362 778779 830846 821142 633258 540097 642722 831449 819357 821110 872716
13167 872716 930335 781890 777968 803072 798462 874765 846268 736038 667501 763437 817501
13156 817501 912798 930225 814422 700786 559010 569267 732579 817642 813662 803430 741562
13145 741562 736121 688485 706250 802870 705424 617407 658257 549782 479017 400632 425264
13134 425264 513807 560109 654033 757395 667091 616477 609529 576330 567786 503920 517512 612050
13122 612050 655293 627606 771727 814746 729093 630679 557213 575466 509806 541590 577825
13111 577825 659115 675906 647132 647121 699468 716792 705108 716543 742415 751089 751461 636593
13099 636593 562518 405284 444702 492773 589060 521702 474355 515140 593846 631994 561396
13088E61396j08974J9747J31532N0764j2069k8847M6549j5601P9618O5732k4122
13077G65725o1510j4952m162Q2996J84017J3803P0869L6988j20332j39532o8122
13066G45788R751m0334J5185M866O6640L6836p547j40699j48403l0223M9522J5051
13054E76433j915m6909m288O3794k9770j10531J16871J96950N0169j24793k8997
13043F57014O1229j32177n5828M5874K692m3739L0814M9375L5318N8185Q022m2234
13031F74545J5476L3930J75939L12309L37380J75855Q5306j62784k91198k59846
13021A096912r9173j50070q1968R7934n26n4046l5173p2021J08416P8303j52282
13010G36306j25304J7965J12342l1067m6335o398j14917m5449L6565Q819K6616
$$ plain form
13088 561396 452422 472169 603701 654465 642396 613549 660098 644497 724115 789847 765725
13077 765725 704215 689263 685101 768097 952114 965917 1036786 1073774 953442 813910 745788
13066 745788 755539 715205 730390 735256 801896 838732 831185 690486 542083 511860 561382 576433
13054 576433 574518 527609 523321 587115 557345 446814 563685 760635 810804 686011 657014
13043 657014 718243 586066 530238 576112 578804 535065 565879 615254 650572 708757 716779 674545
13031 674545 690021 723951 899890 1212199 1549579 1725434 1810740 1647956 1356758 1096912
13021 1096912 997739 847669 765701 863635 863109 809063 773890 701869 810285 888588 736306
13010 736306 611002 628967 741309 710242 663907 657509 542592 497143 533708 542527 569143
12999E69143o8449m2190P1485j5627O1568P2631l8368J5499j3625k0352J4251
12988F05966J9121r4180P776J58121K49271J81600K93165K82895J20904j12689
12978A711950l28337k60237j21120p0662J0783p8353m623q8336l3868j59773R761
12967E87185J33255J00531k10818r6655l5083O431j9326L6422q8828o0678R0099
12956D42535R8626j6382j0225j01003q2686J13400j6170N0435J24449J37829j9034
12945G21774j12833K5834q7147p8694k94O4901J20940P5934M4299R3666N593m0741
12933H33232j2250o4376k2461n958o5932L7267J9425r3609p7393j11572r0521
12922C45852Q1158K20892j11198r9949j07133P9581J44491J81364p7063j19075
$$ plain form
12999 569143 500694 458504 529989 514362 575930 648561 610193 625692 612067 591715 605966
12988 605966 625087 530907 538683 696804 946075 1127675 1420840 1703735 1824639 1711950
12978 1711950 1383613 1123376 1002256 931594 942377 864024 859401 771065 737197 577424 587185
12967 587185 720440 820971 610153 513498 478415 484846 465520 501942 413114 352436 442535
12956 442535 541161 524779 514554 413551 330865 444265 428095 478530 602979 740808 721774
12945 721774 608941 634775 547628 468934 468640 533541 654481 730415 774714 868380 873973 833232
12933 833232 820982 756606 734145 728187 662255 699522 718947 625338 547945 436373 345852
12922 345852 427010 647902 536704 436755 329622 409203 553694 735058 657995 538920
12912E38920J4472N1454p5229j01471R5376Q812j06687m9606K9885R1889Q1054
12901E78869L3436p5610q6672m0686R0574J50424n3190j51764j6457N6804L5328
12890E21056J12184K8888m8433J39476Q8991j44826j28001O9310P1642j3079j03000
12879E94208j43091m9638O930M3147L0123M2549M2270O5985P7082q4590j37145
12868D87830P3650n7812R5316q288l2129o9890n8571p6481j12848m3041Q2771
12857B80507r238P3378P4693M201m31J9918n1537J19822J21994N0780j76993K676
12845E09770n3870J142L6755r5099j30542J05789N7681P3486M6480R7641m0970
12834F08263j05141l3073N4217K0529m938j06128P9114q4370q352l3166J5789
$$ plain form
12912 538920 553392 604846 529617 428146 523522 532334 425647 376041 405926 497815 578869
12901 578869 612305 536695 450023 409337 499911 650335 597145 445381 428924 485728 521056
12890 521056 633240 662128 613695 753171 842162 697336 569335 638645 710287 697208 594208
12879 594208 451117 401479 408409 451556 481679 524228 566498 632483 709565 624975 487830
12868 487830 561480 503668 598984 590696 558567 488677 430106 353625 240777 197736 280507
12857 280507 271269 344647 419340 423541 423110 443028 391491 511313 633307 684087 507094 509770
12845 509770 455900 457042 493797 398698 268156 373945 431626 505112 551592 649233 608263
12834 608263 503122 470049 524266 544795 539857 433729 512843 428473 420121 386955 402744
12823D02744P2602L2929j14860n508L6051P137J6889j10485m0853M2577l440L4535
12811C70318J1256J7804M1504N1029q5513J2200J10996J5910r3422N35k197r153
12799D41267R4304j7412M0132Q6521L3073m7547j14858m484j6320K1977J00540
12788F17193L7045n3562J4137j8736j603o3745j13828L2698Q0803K8724j12697
12777D46429j24440o351p9076M7737M3253L8206o4330j22093Q927J43298J05823
12766D37383m7376J4305m0840j01583M5192L2965O2222K4289J02711K3879j01977
12755D51170p2868J18453R2464j74436j73341Q4269P1636j11444J2028R2466j14551
12744B75846L8855P5210O4864O1301J37257J6319n3099j44128p0256O0217j3376
$$ plain form
12823 402744 475346 508275 393415 387907 423958 431095 447984 337499 296646 339223 335783 370318
12811 370318 381574 399378 440882 491911 406398 418598 529594 545504 452082 452617 450420 441267
12799 441267 535571 518159 558291 644812 677885 630338 515480 510996 494676 516653 617193
12788 617193 654238 600676 614813 596077 594474 530729 416901 449599 530402 559126 446429
12777 446429 321989 315638 236562 284299 327552 365758 301428 179335 188262 331560 437383
12766 437383 390007 404312 363472 261889 307081 340046 402268 426557 529268 553147 451170
12755 451170 378302 496755 589219 414783 241442 325711 397347 285903 297931 390397 275846
12744 275846 314701 389911 454775 516076 653333 669652 616553 472425 402169 462386 449010
12733D49010m0293k6736j762M6649O5445J34192n9297p1658L2044M5801r6682
12722D76713j46054m5293O9399O2607L4170P323m8458j8327M6443Q018j01975
12711C44566N121J14331K6983p5541R3556M7463j77508q9072J02998j3345k4055
12700C55497p7852L3891J34470J4445R4594j8544p3124p1905r5415P4609j4858
12689C55808o1513J0240O7411k220K1443o0922n3079Q2690M5548R5018Q5075M3366
12677F28865n5630j07385p5941O5500j8763J6327j1121k4600j8247Q0581L2501
12666E12087j11001l7392O8430o5747l7458k4680J41087J6066n2076J66486j6848
12655E58954K862l5586q4835j35723p7052N4445J7371R6726J829j01443m5841
$$ plain form
12733 449010 408717 381981 380219 426868 492313 626505 567208 495550 527594 573395 476713
12722 476713 330659 285366 354765 417372 451542 458865 410407 392080 438523 446541 344566
12711 344566 349687 464018 491001 415460 509016 556479 378971 289899 392897 379552 355497
12700 355497 277645 311536 446006 460451 555045 536501 463377 391472 296057 370666 355808
12689 355808 294295 304535 371946 369726 391169 330247 277168 359858 405406 500424 585499 628865
12677 628865 573235 465850 389909 455409 436646 452973 441852 417252 399005 479586 512087
12666 512087 401086 363694 432124 366377 328919 304239 445326 461392 409316 575802 558954
12655 558954 561816 526230 441395 305672 228620 283065 300436 397162 398991 297548 251707
12644B51707P8455Q8539M4078P5703J8692p8199n1332J9866K1280r7363K2877
12633C94303r3023N674J70668p5232j24175k3260J24749O5579M9306K6723j34379
12622C86933n2334N0138k8401r7223L8173J0262L8117L5028K4964o3688j73701
12611A68268J5014O3408J5537O9838O9939k098q4192k7997L061j8798O2344Q3443
12599D17767Q3459j47720r5886M8531J8434K14639M3510j26831q8203P6379o4919
12588C79160j27765J40744L0967n1718M3192N868N1745m7886L0413L1777n6904
12577D29593r3910j12497j7356j04383K4111L3068P5884N8833k2665L6474l6390
12566B70762q6322K4878N0259k8413j19463k4350O1356J71228Q6426o9314O6324
$$ plain form
12644 251707 330162 418701 462779 538482 557174 478975 427643 447509 468789 371426 394303
12633 394303 301280 306954 477622 402390 278215 254955 379704 445283 494589 521312 386933
12622 386933 334599 384737 356336 259113 297286 307548 345665 380693 405657 341969 168268
12611 168268 183282 246690 262227 332065 402004 399906 315714 287717 290778 271980 334324 417767
12599 417767 501226 353506 257620 306151 324585 539224 582734 455903 367700 444079 379160
12588 379160 251395 392139 423106 371388 414580 420448 472193 424307 454720 486497 429593
12577 429593 335683 223186 205830 101447 125558 158626 234510 293343 270678 307152 270762
12566 270762 184440 209318 259577 231164 111701 87351 148707 319935 406361 337047 403371
12555D03371J0402j03910J19397M0330p563K2178p7236j21944p6182N0054N7825
12544C16722J2446k2139j5337j19484n4189J34174Q0693n8143j34376M8663J10198
12533B99228o2849R633j7407o9389P5989M1441M4745j0168j5068j7578N7335p8358
12521B57554j5644R2823J43562m89J1701o6503K5160P4552p9683o9328Q5573o6443
12509C92835j56337L1072J83133j1141o0814K4467n5985k6506p3902O3354m7132
12498B63044k4609J07N5212M1897o5290o5592n6237L7295L4078N4620P5809R254
12486C59588o6258k493K937N0003L2842q5601m1654J7979L8482Q7891J54111p5768
12474D72059j16428o0985j8500R4558L3987o4397r3345r3699n0868N1522J26336
$$ plain form
12555 403371 413773 309863 429260 469590 462027 484205 406969 285025 208843 258897 316722
12544 316722 329168 307029 291692 172208 118019 252193 332886 274743 140367 189030 299228
12533 299228 236379 246012 228605 159216 235205 276646 321391 311223 296155 278577 335912 257554
12521 257554 241910 334733 478295 477806 489507 423004 448164 522716 443033 373705 459278 392835
12509 392835 236498 267570 450703 439562 378748 403215 347230 320724 246822 310176 263044
12498 263044 238435 238542 293754 335651 270361 204769 148532 185827 219905 274525 350334 359588
12486 359588 293330 290837 293774 343777 376619 291018 249364 267343 305825 393716 547827 472059
12474 472059 355631 294646 276146 370704 404691 340294 246949 153250 102382 153904 280240
12463B80240L2263j2357r8590r5410J44653J48906k985j14308Q213J31685J86673
12452F08983p948q4753p3038k1636m9560j53477q0767m9507l3932n0449j4846
12441a0930J28959N4144J0415j5187r4768J0309L1630J18820O2385K0947R7292
12430D14016N5607l5832j85046r8398K4524K8560J03962m8781J8630J6362O8205
12419C61809P7368K580l3717o3630K3648Q2372k2911k1739l9752m1475o6638p587
12407B50328q6486l6615Q369K97894J14529N344j13090r7400j22530o1505l0249
12396A28589J9631m0666J05597J15415o901o7680O537M9217n7056j4141j8337
12385B20205M3817N9602q3775l9059L3332j46386k4605J27741o7523m8780m7108
$$ plain form
12463 280240 312503 300146 201556 106146 250799 399705 396720 282412 290625 422310 608983
12452 608983 601035 516282 443244 421608 372048 218571 137804 88297 54365 3916 -10930
12441 -10930 118029 172173 182588 167401 72633 82942 114572 233392 295777 316724 414016
12430 414016 469623 433791 248745 150347 174871 203431 307393 258612 277242 293604 361809
12419 361809 439177 441757 408040 344410 368058 450430 427519 405780 366028 324553 257915 250328
12407 250328 163842 127227 135596 433490 548019 553363 440273 342873 220343 158838 128589
12396 128589 148220 107554 213151 328566 321665 253985 260522 309739 252683 238542 220205
12385 220205 264022 323624 239849 200790 234122 87736 63131 190872 123349 74569 27461
12374B7461J05884J7281o4632J7k2876J3773n5429K4634J00237J12061k5351o1415
12362A71645K38994P2532m9700j30326p1198p978P0095o3777Q3441N2950P892
12351C74570j9297M2005J30306J7370l4873l1432j00161j44878J05031J20322
12341D58963p8539q3611l6927M4638P2097N2708m3316j82801j13200K5342Q041
12330A23395l5641Q0741M6992J7317P2024P384k4843j9352J2177l8998j44517
12319I6679j03168J345M4047P5653R1885j04569J5128M4407q9355n3070N807L3058
12307E7847O6042Q7700l6210m136n1656M9914k04719p734J10794N8216O7025J2728
$$ plain form
12374 27461 133345 150626 85994 86011 63135 76908 21479 46113 146350 258411 233060 171645
12362 171645 410639 483171 433471 303145 231947 223969 294064 230287 313728 366678 374570
12351 374570 355273 397278 527584 544954 510081 478649 378488 233610 338641 458963
12341 458963 380424 296813 259886 304524 376621 429329 386013 203212 90012 115354 123395
12330 123395 87754 168495 215487 232804 304828 312212 287369 268017 280194 241196 96679
12319 96679 -6489 -5144 38903 114556 206441 101872 117000 161407 72052 18982 24789 57847
12307 57847 123889 211589 175379 171243 119587 169501 -35218 -42952 67842 126058 193083 205811
$$ [...]
##END NTUPLES=NMR SPECTRUM
##END=
