##TITLE=Analysis number 325236
Compound Code rf 03857
Book Reference 483/96
Project Code adrs
Chemist Name mattw
##JCAMPDX= 6.0         $$ Bruker NMR JCAMP-DX V2.0
##DATA TYPE= NMR SPECTRUM
##DATA CLASS= NTUPLES
##ORIGIN= Bruker BioSpin GmbH
##OWNER= nmr
$$ XWIN-NMR		Version 3.5
$$ Fri Dec 15 09:14:54 2006 GMT Standard Time (UT+0h)  MAYBRIDGE\nmr@NMR_250MHZ
##.OBSERVE FREQUENCY= 250.131544655141
##.OBSERVE NUCLEUS= ^1H
##.ACQUISITION MODE= SIMULTANEOUS (DQD)
##.ACQUISITION SCHEME= undefined
##.AVERAGES= 16
##.DIGITISER RES= 18
##SPECTROMETER/DATA SYSTEM= dpx250
##.PULSE SEQUENCE= zg30
##.SOLVENT NAME= CDCl3
##.SHIFT REFERENCE= (INTERNAL, CDCl3, 0, 16.5288)
##AUDIT TRAIL= $$ (NUMBER, WHEN, WHO, WHERE, WHAT)
$$ ##TITLE= Audit trail, XWIN-NMR		Version 3.5
$$ ##JCAMPDX= 5.01
$$ ##ORIGIN= Bruker BioSpin GmbH
$$ ##OWNER= nmr
$$ C:\u/data/dgb/nmr/ADRS/1700/pdata/1/auditp.txt
$$ ##AUDIT TRAIL=  $$ (NUMBER, WHEN, WHO, WHERE, WHAT)
(   1,<2006-12-15 09:14:28.32 +000>,<MAYBRIDGE\nmr>,<NMR_250MHZ>,
      <created by zg, POWCHK disabled, PULCHK disabled
       configuration hash MD5:
       49 4B E0 1D 92 C2 6B 37 9F E6 65 BC 52 41 86 1D
       data hash MD5: 64K
       F4 13 0F DB 0D BF 2D CF 89 23 0D 48 D7 ED 21 3D>)
(   2,<2006-12-15 09:14:43.72 +000>,<MAYBRIDGE\nmr>,<NMR_250MHZ>,
      <Start of raw data processing
       ef LB = 0.3 FT_mod = 6 PKNL = 1 SI = 32K 
       data hash MD5: 32K
       F4 E3 B8 EC BD 9E 39 C8 38 6B 29 1C 50 7D 29 E9>)
(   3,<2006-12-15 09:14:45.47 +000>,<MAYBRIDGE\nmr>,<NMR_250MHZ>,
      <apk 
       data hash MD5: 32K
       9D 88 23 91 46 6D 71 F7 6A D6 54 C1 7A 9C 52 08>)
(   4,<2006-12-15 09:14:46.19 +000>,<MAYBRIDGE\nmr>,<NMR_250MHZ>,
      <abs ABSG = 5 
       data hash MD5: 32K
       CF 2D 7E E4 24 A5 95 B6 49 B6 AA 03 7B 7D 4F 69>)
$$ ##END=
$$ 
$$ hash MD5
$$ 52 EA 4E 01 93 24 70 46 8D 02 48 C4 75 8D 49 50
##$RELAX= 
##$RELAX= 
##$RELAX= 
##$RELAX= 
##$RELAX= 
##$RELAX= 
##$RELAX= 
$$ Bruker specific parameters
$$ --------------------------
##$DU= <C:\u>
##$EXPNO= 1700
##$NAME= <ADRS>
##$PROCNO= 1
##$TYPE= <nmr>
##$USER= <dgb>
##$AMP= (0..31)
100 100 100 100 100 100 100 100 100 100 100 100 100 100 100 100 100 100 
100 100 100 100 100 100 100 100 100 100 100 100 100 100 
##$AQSEQ= 0
##$AQ_mod= 3
##$AUNM= <au_zg>
##$AUTOPOS= <51 >
##$BF1= 250.13
##$BF2= 250.13
##$BF3= 250.13
##$BF4= 250.13
##$BF5= 500.13
##$BF6= 500.13
##$BF7= 500.13
##$BF8= 500.13
##$BYTORDA= 1
##$CFDGTYP= 0
##$CFRGTYP= 5
##$CHEMSTR= <none>
##$CNST= (0..31)
1 1 145 1 1 1 1 1 1 1 1 1 1 1 1 1 1 1 1 1 1 1 1 1 1 1 1 1 1 1 1 1 
##$CPDPRG= <>
##$CPDPRG1= <>
##$CPDPRG2= <>
##$CPDPRG3= <>
##$CPDPRG4= <mlev>
##$CPDPRG5= <mlev>
##$CPDPRG6= <mlev>
##$CPDPRG7= <mlev>
##$CPDPRG8= <mlev>
##$CPDPRGB= <>
##$CPDPRGT= <>
##$D= (0..31)
0 1 0 0 0 0 0 0 0 0.06 0 0 0 0 0 0 0.0002 0 0 0 0 0 0 0 0 0 0 0 0 0 0 
0 
##$DATE= 1166174067
##$DBL= (0..7)
120 120 120 120 120 120 120 120 
##$DBP= (0..7)
150 150 150 150 150 150 150 150 
##$DBP07= 0
##$DBPNAM0= <>
##$DBPNAM1= <>
$$ [...]
##$SUBNAM7= <"">
##$SUBNAM8= <"">
##$SUBNAM9= <"">
##$SW= 20.6930455092707
##$SWIBOX= (0..15)
0 0 3 0 0 0 0 0 0 0 0 0 0 0 0 0 
##$SW_h= 5175.983436853
##$TD= 65536
##$TD0= 1
##$TE= 295.16
##$TE2= 300
##$TE3= 300
##$TEG= 300
##$TL= (0..7)
0 120 120 120 120 120 120 120 
##$TP= (0..7)
150 150 150 150 150 150 150 150 
##$TP07= 0
##$TPNAME0= <>
##$TPNAME1= <>
##$TPNAME2= <>
##$TPNAME3= <>
##$TPNAME4= <>
##$TPNAME5= <>
##$TPNAME6= <>
##$TPNAME7= <>
##$TPOAL= (0..7)
0.5 0.5 0.5 0.5 0.5 0.5 0.5 0.5 
##$TPOFFS= (0..7)
0 0 0 0 0 0 0 0 
##$TUNHIN= 0
##$TUNHOUT= 0
##$TUNXOUT= 0
##$USERA1= <user>
##$USERA2= <user>
##$USERA3= <user>
##$USERA4= <user>
##$USERA5= <user>
##$V9= 5
##$VALIST= <valist>
##$VCLIST= <CCCCCCCCCCCCCCC>
##$VD= 0
##$VDLIST= <DDDDDDDDDDDDDDD>
##$VPLIST= <PPPPPPPPPPPPPPP>
##$VTLIST= <TTTTTTTTTTTTTTT>
##$WBST= 1024
##$WBSW= 4
##$XGAIN= (0..3)
0 0 0 0 
##$XL= 0
##$YL= 0
##$YMAX_a= 316793
##$YMIN_a= -419798
##$ZGOPTNS= <>
##$ZL1= 120
##$ZL2= 120
##$ZL3= 120
##$ZL4= 120
##$ABSF1= 16.52877
##$ABSF2= -4.164404
##$ABSG= 5
##$ABSL= 3
##$ALPHA= 0
##$AQORDER= 0
##$ASSFAC= 0
##$ASSFACI= 0
##$ASSFACX= 0
##$ASSWID= 0
##$AUNMP= <proc_1d>
##$AZFE= 0.1
##$AZFW= 0.1
##$BCFW= 0
##$BC_mod= 0
##$BYTORDP= 0
##$COROFFS= 0
##$CY= 12.5
##$DATMOD= 1
##$DC= 0
##$DFILT= <>
##$DTYPP= 0
##$F1P= 14.0000005364418
##$F2P= -0.99999901652339
##$FCOR= 0.5
##$FTSIZE= 32768
##$FT_mod= 6
##$GAMMA= 0
##$GB= 0
##$INTBC= 1
##$INTSCL= 1
##$ISEN= 128
##$LB= 0.3
##$LEV0= 0
##$LPBIN= 0
##$MAXI= 10000
##$MC2= 0
##$MEAN= 0
##$ME_mod= 0
##$MI= 0
##$NCOEF= 0
##$NC_proc= -4
##$NLEV= 6
##$NOISF1= 0
##$NOISF2= 0
##$NSP= 0
##$NTH_PI= 0
##$NZP= 0
##$OFFSET= 16.52877
##$PC= 1
##$PHC0= 220.0315
##$PHC1= 16.40795
##$PH_mod= 1
##$PKNL= yes
##$PPARMOD= 0
##$PSCAL= 4
##$PSIGN= 0
##$REVERSE= no
##$SF= 250.129998306306
##$SI= 32768
##$SIGF1= 0
##$SIGF2= 0
##$SINO= 400
##$SIOLD= 32768
##$SREGLST= <1H.CDCl3>
##$SSB= 0
##$STSI= 32768
##$STSR= 0
##$SW_p= 5175.98343685301
##$SYMM= 0
##$S_DEV= 0
##$TDeff= 65536
##$TDoff= 0
##$TI= <Analysis number 999999
Compound Code 99
Book Reference 9
Project Code 9>
##$TILT= no
##$TM1= 0
##$TM2= 0
##$TOPLEV= 0
##$USERP1= <user>
##$USERP2= <user>
##$USERP3= <user>
##$USERP4= <user>
##$USERP5= <user>
##$WDW= 1
##$XDIM= 32768
##$YMAX_p= 314592437
##$YMIN_p= -235122
$$ End of Bruker specific parameters
$$ ---------------------------------
##NTUPLES= NMR SPECTRUM
##VAR_NAME=  FREQUENCY,     SPECTRUM/REAL,   SPECTRUM/IMAG
##SYMBOL=    X,             R,               I
##VAR_TYPE=  INDEPENDENT,   DEPENDENT,       DEPENDENT
##VAR_FORM=  AFFN,          ASDF,            ASDF
##VAR_DIM=   32768,         32768,           32768
##UNITS=     HZ,            ARBITRARY UNITS, ARBITRARY UNITS
##FACTOR=    0.157963299565203, 1,           1
##FIRST=     4134.34132385774, 0,            0
##LAST=      -1041.64211299527, 0,           0
##MIN=       -1041.64211299527, -235122,     0
##MAX=       4134.34132385774, 314592437,    0
$$ Real data points
##PAGE= N=1
##DATA TABLE= (X++(R..R)), XYDATA
$$ [...]
25381B0617l413J6752L628p6551l1700K2030J150P3140R242L0445M6508o2232
$$ 20617 17204 33956 37584 -38967 -70667 -48637 -47487 25653 34895 65340 111848 49616
25369D9616j01788j965N4412j6358K4606l788k6730K0059k6429K8780L5263L7575
$$ 49616 -52172 -54137 275 -16083 8523 4735 -21995 -1936 -28365 415 35678 73253
25357G3253R236L8577m2930l3124L1218L6255k707m6764k7434l8669J9833K7136
$$ 73253 82489 121066 78136 45012 76230 112485 109778 63014 35580 -3089 16744 43880
25345D3880o7996n5382J4650M9738N8086J4985o18k8440o3700k1248J5915L93
$$ 43880 -24116 -79498 -64848 -15110 42976 57961 57343 28903 -34797 -56045 -40130 -39737
25333c9737p625j060l3527l2661J2740l611j6825J3252n648M9815J9230K0702
$$ -39737 -47362 -48422 -81949 -114610 -101870 -105481 -122306 -109054 -114702 -64887 -45657 -24955
25321b4955k6964m144r648K2954m653n2946L3346J0301l382m8010l6635K5755
$$ -24955 -51919 -56063 -65711 -42757 -47410 -100356 -67010 -56709 -60091 -108101 -144736 -118981
25309a18981K6160M3416o847j9872P147L4833K0832J8264n9636p465O8105M6467
$$ -118981 -92821 -49405 -56252 -76124 -68977 -34144 -13312 4952 -54684 -62149 5956 52423
25297E2423O974k4435n6430l6011J7582o508J5446J7431M7379N2202L9241m9351
$$ 52423 59397 34962 -21468 -57479 -39897 -46405 -30959 -13528 33851 86053 125294 75943
25285G5943p3488J8289L8623p807m0241q4094n5939M4370R96K7705J7797M9306
$$ 75943 2455 20744 59367 51560 11319 -72775 -128714 -84344 -83348 -55643 -37846 11460
25273A1460J7558k21N1992M598n5086k9070Q391l8318M1953K9242m9384K908O7197
$$ 11460 29018 28797 80789 85387 30301 1231 9622 -28696 13257 42499 -6885 -3977 63220
25260F3220J2663l6726o0168k0807q39l292L5447K5450N0002Q090K3433l3241
$$ 63220 75883 39157 -21011 -41818 -42657 -45949 -10502 14948 64950 73040 96473 63232
25248F3232o9817J2010l2547n1382P288R024l0342n3136O7410N5312Q3998j4470
$$ 63232 -6585 5425 -27122 -78504 -71216 -62192 -92534 -145670 -78260 -22948 61050 46580
25236D6580o8512M703L6770r214m9930q5034J1407K8406O1120M9323m3070K2169
$$ 46580 -21932 -17229 19541 10327 -39603 -124637 -113230 -84824 -23704 25619 -17451 4718
25224D718N0311l1237o6899m1593L9792N3072M2772m4762o3914r079q173k454
$$ 4718 55029 23792 -43107 -84700 -44908 8164 50936 6174 -57740 -66819 -74992 -77446
25212g7446K9269P6287l3300m2618l3223p0935m991P3470L9868J9005m2240M851
$$ -77446 -48177 28110 -5190 -47808 -81031 -151966 -156957 -83487 -43619 -24614 -66854 -62003
25200f2003N8372J00938K0431o7762m6951l0180j1440K9574K7204O037k1396K9479
$$ -62003 -3631 97307 117738 49976 3025 -27155 -38595 -9021 18183 24220 2824 32303
25188C2303J936n1189k6097j5361k1688K3037K5814o1342j4116K1130K4056K8011
$$ 32303 34239 -16950 -43047 -58408 -80096 -57059 -31245 -92587 -106703 -85573 -61517 -33506
25176c3506K5567J10074L3644k5190R189m2264m1406j5020N7112k8240m8197P527
$$ -33506 -7939 102135 135779 110589 119778 77514 36108 21088 78200 49960 1763 9290
25164I290J3557L5952K8953j2727p3188L450j8836L4173K3543j5273k8967K686
$$ 9290 22847 58799 87752 75025 1837 5287 -13549 20624 44167 28894 -73 2613
25152B613m786l8020R542K9244K602M9698k2346p9457j4873L7164J7255J0871
$$ 2613 -2173 -40193 -30651 -1407 1195 50893 28547 -50910 -65783 -28619 -11364 -493
25140d93M3018n7129l9718k4079J3052L9756J3474l5796l3591O5918N2181m5121
$$ -493 42525 -14604 -54322 -78401 -65349 -25593 -12119 -47915 -81506 -15588 36593 -8528
25128h528j1533K1670j9581n755N0802J4722l805P92Q420k4734K60o059k2954
$$ -8528 -20061 1609 -17972 -23727 27075 41797 37992 38784 47204 22470 22730 16671 -6283
25115f283j7305k8262j9083K2316j589M0348K4168k3421N5176J4529j2339M5810
$$ -6283 -23588 -51850 -70933 -48617 -50206 -9858 14310 -9111 46065 60594 48255 94065
25103I4065O569m8953j8245K1709j922n7964p9702j9938M1999K0378l5686L1265
$$ 94065 100634 51681 33436 55145 53223 -4741 -84443 -104381 -62382 -42004 -77690 -46425
25091d6425J4766M703J8407N2454J3762k9904N718k9170l1977l3658j5021L6698
$$ -46425 -31659 -26956 -8549 43905 57667 27763 33481 4311 -27666 -61324 -76345 -39647
25079c9647K9414L4498j1849j8132q098L2930L3313J9179o6838q917L4174m6158
$$ -39647 -10233 24265 12416 -5716 -13814 19116 52429 71608 4770 -4147 30027 -16131
25067a6131L8698K8446K1901J8958o9760n1558J7965M092O7019j2497o0997k1226
$$ -16131 22567 51013 72914 91872 22112 -29446 -11481 -7389 59630 47133 -13864 -35090
25055c5090L3147N8556j1977k8850n2127j2434P312J8235L7583o376j1236K8436
$$ -35090 -1943 56613 44636 15786 -36341 -48775 -41463 -23228 14355 7979 -3257 25179
25043B5179o0754K5209M1913K450P0196L4821p9115l7357l3179k3914L3177P8248
$$ 25179 -35575 -10366 31547 33997 104193 139014 59899 22542 -10637 -34551 -1374 76874
25031G6874K1551k1508l5624m8127L250L6258K0215J955j2163n5297k6155K7223
$$ 76874 98425 76917 41293 -6834 -3584 32674 52889 54844 42681 -12616 -38771 -11548
25019a1548N013L254J5769L9079L699k2849j0113k763k1470L650L133l4941K171
$$ -11548 -6535 -3281 12488 51567 55266 32417 22304 19541 -1929 1721 4854 -30087 -27916
25006b7916L5813M4709j0328J203o1436K6980J8268n6536k6198J0465J6340M431
$$ -27916 7897 52606 42278 43481 -17955 9025 27293 -29243 -55441 -44976 -28636 -24205
24994b4205K5216K5696K3346J6011k1901J2679L7900L3741J463o350k6431l6263
$$ -24205 1011 26707 50053 66064 44163 56842 94742 128483 129946 123596 97165 60902
24982F0902p1940l9372O7519M2444l2621l785k2653q4326l6653O9015N7673q602
$$ 60902 -11038 -50410 17109 59553 26932 23147 494 -83832 -120485 -51470 6203 -2399
24970b399L1531k6542P2953O603k6653p372m3423J3757n533r6576M1770P0553
$$ -2399 29132 2590 75543 82146 55493 48121 4698 18455 12922 -83654 -41884 28669
24958B8669L4340J0919N2406K4754r5672l2468J7695k212j5066j11156k7802N2152
$$ 28669 63009 73928 126334 151088 55416 22948 40643 38431 23365 -87791 -115593 -63441
24946f3441P2502L236o174j6453j3838L153n214m497N30K5214j1931N6694K5197
$$ -63441 9061 12297 6123 -10330 -24168 -21015 -26229 -30726 -30196 -4982 -16913 39781 64978
24933F4978K8636j2751l9857l9667l2846k7473J7536K9026Q545K7924j138k8768
$$ 64978 93614 80863 41006 1339 -31507 -58980 -41444 -12418 -3873 24051 22913 -5855
24921e855M28j2768J8127N871n052l2155l9530k8193m2702L1563N0784L100N0807
$$ -5855 -5427 -18195 -68 5803 751 -31404 -70934 -99127 -141829 -110266 -59482 -56382 -5575
24908e575j3450n6234M7343N3378p045J8805K211k1913L786j085j5749O460L3
$$ -5575 -19025 -75259 -27916 25462 18417 37222 39433 17520 21306 20221 4472 10932 10965
24895A0965l1643l7385L9997K1146l7675M8261J5329p345k9317l917p184j71n8864
$$ 10965 -20678 -58063 -18066 3080 -34595 13666 28995 21650 -7667 -11584 -18768 -18939 -77803
24882g7803L777N5401O6537L3828m6971l7335J5660P013Q6495J3718m8985k8689
$$ -77803 -74026 -18625 47912 81740 34769 -2566 13094 20107 106602 120320 71335 42646
24870D2646p563R760q127l1090p769J9397n3391j6211n709O9594N3233n1719o2627
$$ 42646 35083 44843 36716 5626 -2143 17254 -36137 -52348 -58057 11537 64770 13051 -49576
24857d9576K2378l2168L310O8521K6154o555J7055k515R905q1436J2625j5150
$$ -49576 -27198 -59366 -56056 12465 38619 32064 49119 46604 56509 -24927 -12302 -27452
24845b7452O479J3207R758k894L0846m4083o6403J2025l7625j2378M4430M7782
$$ -27452 -20973 -7766 1992 -902 29944 -14139 -80542 -68517 -106142 -118520 -74090 -26308
24833b6308l9268K8169Q6342M1398l1301m0213L2527O8430L5242p6997n3608q8484
$$ -26308 -65576 -37407 48935 90333 59032 18819 51346 119776 155018 78021 24413 -64071
24821f4071o8369k4392R6501O3399k5973p4565K6719O4176j2335N772j9209N1426
$$ -64071 -132440 -156832 -60331 3068 -22905 -97470 -70751 -6575 -18910 -13138 -32347 19079
24809A9079O688l3945k9479K5246M9575J9155n1053k9034K3103o655L8329J5209
$$ 19079 25767 -8178 -37657 -12411 37164 56319 5266 -23768 -665 -7320 31009 46218
24797D6218k6592n3675J1346J17186J8072m2010K8335N1703K5009N239q5023m0840
$$ 46218 19626 -34049 -22703 94483 112555 70545 98880 150583 175592 180831 95808 54968
24785E4968l2571m0624L0147M317l9409l2361j113O395j1030K4835K2045l0436
$$ 54968 22397 -18227 11920 16237 -23172 -55533 -56646 -50251 -61281 -36446 -14401 -44837
24773d4837l9604M423j6544k0477J6228M3627M4506K3761m4938m8387J6595O2020
$$ -44837 -84441 -80018 -96562 -117039 -100811 -57184 -12678 11083 -33855 -82242 -65647 -3627
24761c627k8610M0757P0563N723j6579n6589L726J4483l3026m5563k0386J440
$$ -3627 -32237 8520 79083 84806 68227 11638 15364 29847 -3179 -48742 -69128 -67688
24749f7688K9404L2593M5771J1943j1922k680n7632k9126J1675M3512O8996q3217
$$ -67688 -38284 -5691 40080 52023 40101 37421 -20211 -49337 -37662 5850 74846 -8371
24737h371j5823K5670P441N33J0508j9328m7899J979L2149j4367n8105j566j570
$$ -8371 -24194 1476 8917 9450 19958 630 -47269 -45290 -13141 -27508 -85613 -87179 -88749
24724h8749l8194K881Q0578M5044j7496n6909Q45K7701J3416k1316l313M6272
$$ -88749 -126943 -124062 -43484 1560 -15936 -72845 -72000 -44299 -30883 -52199 -55512 -9240
24712i240L1940k2541l500K448n8678r6154K034K9407M6355L9069M9904K3788
$$ -9240 22700 159 -3341 -893 -59571 -155725 -153691 -124284 -77929 -38860 11044 34832
24700C4832K7924l778J9230q0593O0053M0067k4610m1220l2161K866q156k158
$$ 34832 62756 58978 78208 -2385 57668 97735 73125 31905 -256 2610 -5546 -7704
24688g704n5746M618m857l5422J6864P4835O0954l8723k4555O1518n741p0689
$$ -7704 -63450 -58832 -63689 -99111 -82247 -7412 53542 14819 -9736 51782 46041 -24648
24676b4648o6521J2845M2970R0441m762n3997p0464M7981n009m947N751k3964
$$ -24648 -91169 -78324 -35354 55087 50325 -3672 -74136 -26155 -31164 -36111 -30360 -54324
24664e4324m0406m551N2882K8103m3357N442J9172Q295l2745k4826K3468P0301
$$ -54324 -94730 -99281 -46399 -18296 -61653 -56211 -37039 -28744 -61489 -86315 -62847 7454
24652G454J8590m6219k1903l5476n6090J047M6801J4466l9894M1911l492l8260
$$ 7454 26044 -20175 -42078 -77554 -133644 -132597 -85796 -71330 -111224 -69313 -72805 -111065
24640a11065j4649M0612L0856R007P7204N4245o0280m5047J2838j1629l2806j5215
$$ -111065 -125714 -85102 -54246 -45239 31965 86210 25930 -19117 -6279 -17908 -50714 -65929
24628f5929k9884K6564N4465n0214q920O297p433L4140K9294j1233L399O6040
$$ -65929 -95813 -69249 -14784 -64998 -73918 -67621 -75054 -40914 -11620 -22853 -19454 46586
24616D6586k8177p6272m324q587q107j7864j9345M830N1777l9296R46K575K229
$$ 46586 18409 -57863 -62187 -70774 -78881 -96745 -116090 -111260 -59483 -98779 -97833 -95258 -93029
24603i3029J1334J9728R0162M7027j9991m0659n2691j1223J7332L6389j3037K7405
$$ -93029 -81695 -61967 28195 75222 55231 14572 -38119 -49342 -32010 4379 -8658 18747
24591A8747p457j2950M78O641l7339o824K2366m0839L295M893O5175L688J0916
$$ 18747 11290 -1660 -1182 5459 -31880 -38704 -16338 -57177 -53882 -48989 16186 19874 30790
24578C0790K8271J7851J5385k073l6989m5851J537j7845k4314K3883r443j9043
$$ 30790 59061 76912 92297 90224 53235 7384 8921 -8924 -33238 -9355 -18798 -37841
24566c7841n486K2957k2079l915k2215K8765M1565J1234j3727K5238O549P8L8516
$$ -37841 -43327 -20370 -42449 -46364 -68579 -39814 1751 12985 -742 24496 31045 31123 69639
24553F9639l6145R261k2556m9698L0088k565K7707R785m1200o1593M2495P8013
$$ 69639 33494 42755 20199 -29499 589 -1976 25731 35516 -5684 -67277 -24782 53231
24541E3231l3974l4667j6285l067k7687m4558j4466J7812N5635j4540L5907K248
$$ 53231 19257 -15410 -31695 -34762 -62449 -107007 -121473 -103661 -48026 -62566 -26659 -24411
24529b4411J2754M1631M9422l8461K0861J8296k0892o2802j3929N8902N6504l3013
$$ -24411 -11657 29974 79396 40935 61796 80092 59200 -3602 -17531 41371 97875 64862
24517F4862k1905k4276k4059P79p875k6993j3860J1906M6029l358J9473j9411
$$ 64862 42957 18681 -5378 -4599 -12474 -39467 -53327 -41421 4608 1250 20723 1312
24505A312j4143k431L5041J7879J9904k464n818o8153j5952j844L4428K7376p945
$$ 1312 -12831 -15262 19779 37658 57562 55098 49280 -18873 -34825 -36669 -2241 25135 17190
24492A7190k0714K0165L3502m0552k0374j428N0774P691J8668P621o590O3507
$$ 17190 -3524 16641 50143 9591 -10783 -12211 38563 46254 64922 72543 65953 129460
24480A29460L804r4003n108M439j3635l8362j4287J1614k9794m0620K9197r988
$$ 129460 133264 39261 34153 38592 24957 -13405 -27692 -16078 -45872 -86492 -57295 -67283
24468f7283m7267o0672L7833L9148P779K7704K7921L6995K9653j1810K684j9675
$$ -67283 -114550 -175222 -137389 -98241 -90462 -62758 -34837 2158 31811 20001 22685 3010
24456C010M114L0402l3393j2312J9518j9483n5245K2173R970N087m288K3301l2847
$$ 3010 7124 37526 4133 -8179 11339 -8144 -63389 -41216 -31246 -26159 -30447 -7146 -39993
24443c9993m1218j3256J8639J5724K7121j15p574Q4971M7084l0392M0207J260
$$ -39993 -81211 -94467 -75828 -60104 -32983 -33098 -40672 44299 91383 60991 101198 102458
24431A02458n2463K2673L7341o2137n5582q035K3464K7587o6961o6410o303M9649
$$ 102458 49995 72668 110009 47872 -7710 -15745 7719 35306 -31655 -98065 -104368 -54719
24419e4719N6113m072q7355J3543N0249N6826J2143o419m9393M1038j1208L612
$$ -54719 1394 -2678 -90033 -76490 -26241 30585 42728 36309 -13084 27954 16746 20358
24407B0358L0787k8312l2761m2766M0218J2425l8373m4648m1248K9285L1513j3203
$$ 20358 51145 22833 -9928 -52694 -12476 -51 -38424 -83072 -124320 -95035 -63522 -76725
24395g6725N4888M7033n947n4430j0203L0899J9792K4019j8736J634P229M685
$$ -76725 -21837 25196 19249 -35181 -45384 -14485 5307 29326 10590 12224 19453 24138
24383B4138p7224J6001M9613n7446M0828M6377O7192J8458m1172n3214R418J0067
$$ 24138 -53086 -37085 12528 -44918 -4090 42287 109479 127937 86765 33551 42969 53036
24371E3036n0215K477N6102L2174j2758p4534j9835N8762L7125m6732q3188m9707
$$ 53036 2821 5298 61400 93574 80816 6282 -13553 45209 82334 35602 -47586 -97293
24359i7293L3149l4292L4582O3115M6736J5637m5639m3543k7818K5343J1568L2563
$$ -97293 -64144 -98436 -63854 -739 45997 61634 15995 -27548 -55366 -30023 -18455 14108
24347A4108k8445k5234J4618M1195M0338j2975L6035k0389R8664O9120m2952n4041
$$ 14108 -14337 -39571 -24953 16242 56580 43605 79640 59251 157915 227035 184083 130042
24335A30042l8668n2164j5346k6620o9565q948m0800L9430J15296N8493pm0266
$$ 130042 91374 39210 23864 -2756 -72321 -81269 -122069 -82639 32657 91150 91143 50877
24323E0877J5843m506j1374j00962R859K8839l3294R698K8782k5350k6146k6292
$$ 50877 66720 62214 50840 -50122 -40263 -11424 -44718 -35020 -6238 -31588 -57734 -84026
24311h4026n879K4354k47J5486K8016K271N6477J875N5734M7181l1103m2750l7490
$$ -84026 -89905 -65551 -65798 -50312 -22296 -20025 36452 38327 94061 141242 110139 67389 29899
24298B9899k8192R124l5996l1637K535N2713O5605J6885L056M779m0774m1108
$$ 29899 1707 10831 -25165 -56802 -54267 -1554 64051 80936 83992 88771 47997 6889
24286F889j2325q596j1415K793q686k0650J7142L1682Q73N1795J2061k0469J2170
$$ 6889 -5436 -14032 -25447 -22654 -31340 -51990 -34848 -3166 -2293 49502 61563 41094 53264
24273E3264l064l5499k1193j9532p269j4144O683k9316m4921j1381M6074M9939
$$ 53264 50200 14701 -6492 -26024 -33293 -47437 -40754 -70070 -114991 -126372 -80298 -30359
24261c0359l7761j518O74j1662N1824L1814j134L1142j7057l3548J0499l608j1477
$$ -30359 -68120 -69638 -68964 -80626 -28802 3012 1878 33020 15963 -17585 -7086 -10694 -22171
24248b2171N0822l647l193n8167j708Q5568m6571m5425j202R5344N2298j4971
$$ -22171 28651 25004 21811 -36356 -38064 47504 933 -44492 -45694 49650 101948 86977
24236H6977k4665j33277n7502J7848M4977O5431K0500m7136J305j5243p416J1911
$$ 86977 62312 -70965 -128467 -110619 -65642 -211 20289 -26847 -25542 -40785 -48201 -36290
24224c6290J6330m1868m7574M2419L2953l909K5309k4615n604l6379o4185L8594
$$ -36290 -19960 -61828 -109402 -66983 -34030 -37939 -12630 -37245 -42849 -79228 -143413 -104819
24212a04819R0815n693l969N5457J2790m6629k5784L8723L5958k1214n5813n6483
$$ -104819 -14004 -19697 -23666 31791 44581 -2048 -27832 10891 46849 25635 -30178 -86661
24200h6661K2973J2932q086M3009k8117L1443k3881k1739J6556M4643k7587P260
$$ -86661 -63688 -50756 -58842 -15833 -43950 -12507 -36388 -58127 -41571 3072 -24515 -17255
24188a7255L8493j0269j6459J0830M6774K1143k3638p453m720l4504p249Q395
$$ -17255 21238 10969 -5490 5340 52114 73257 49619 42166 37446 2942 -4307 4088
24176D088N7L1504j7683l6055n1857o6047N1807p142J6457K3672k25n212P6569
$$ 4088 4145 35649 17966 -18089 -69946 -135993 -84186 -91328 -74871 -51199 -51424 -56636 19933
24163A9933K8594L7653Q656M4344l8661j14639j8295K6638l947K0622N0797n6117
$$ 19933 48527 86180 94836 139180 100519 -14120 -32415 -5777 -9724 10898 61695 5578
24151E578J6061N7455J850n226k7927m335k9410m7280R41Q225n4164o213M2588
$$ 5578 21639 79094 80944 75718 47791 43456 14046 -33234 -32293 -24068 -78232 -84445 -41857
24138d1857K7604O6173N2980j085r3288l5143k0460q3J2711K1804j850l6860j4124
$$ -41857 -14253 51920 104900 103815 10527 -24616 -45076 -45159 -32448 -10644 -12494 -49354 -63478
24125f3478K6656j0464n3337O4038N1334j9526k3527l8834k9118M5935o369P065
$$ -63478 -36822 -47286 -100623 -36585 14749 -4777 -28304 -67138 -96256 -50321 -56690 -49625
24113d9625K0620K2255J7438K8606l1346m4636k7684l315J2901R104n873K5266
$$ -49625 -29005 -6750 10688 39294 7948 -36688 -64372 -67687 -54786 -45682 -51555 -26289
24101b6289N3257K5977J3815m3058l2574l1753O0320P46k5392n115k5234K4365
$$ -26289 26968 52945 66760 23702 -8872 -40625 19695 20441 -4951 -10066 -35300 -10935
24089a0935K6488Q586n5159k5396N7490O678k5021m2976J5530N6355o452K5986
$$ -10935 15553 24139 -31020 -56416 1074 7752 -17269 -60245 -44715 11640 5188 31174
24077C1174o783j2622l2754o876M3331K8814L0059m4501n8106K0823K0243k5061
$$ 31174 24391 11769 -20985 -27861 15470 44284 74343 29842 -28264 -7441 12802 -12259
24065a2259n3453N974N7990k1840m9603K8589N1477O0789L2975L201r6195o9756
$$ -12259 -65712 -59738 -1748 -23588 -73191 -44602 6875 67664 100639 103840 7645 -62111
24053f2111n8563k0911Q5746M2671k9664N1173K9869J1309n7556p4342J5839j7758
$$ -62111 -120674 -141585 -55839 -13168 -42832 8341 38210 49519 -8037 -82379 -66540 -84298
24041h4298j0219J4388N2927M8004l3067k4750m792N3946L8966j9548r2058k517
$$ -84298 -94517 -80129 -27202 20802 -12265 -37015 -41807 12139 51105 31557 -60501 -63018
24029f3018J3867j9162M0077J4584n354L1997K1920l4958M157K425r486K4505
$$ -63018 -49151 -68313 -28236 -13652 -19006 12991 34911 -47 4110 6535 -2951 21554
24017B1554M7475j717m253M2286j0802q4237J9533j2970m8811l9997J0018J5766
$$ 21554 69029 67312 63059 105345 94543 10306 29839 16869 -31942 -71939 -61921 -46155
24005d6155L067n1901l5815L8755J0441N990k2091L0806N6024o0760j2884K5409
$$ -46155 -43088 -94989 -130804 -92049 -81608 -75618 -97709 -66903 -10879 -71639 -84523 -59114
23993e9114M0931j4793l5298m796Q8758L4429j9758j1390p4468k9149Q936K1318
$$ -59114 -18183 -32976 -68274 -73070 15688 50117 30359 18969 -55499 -84648 -75712 -54394
23981e4394P0754O362m6894R600N0144o313l4838K2187R948j4738j4757J2483
$$ -54394 16360 22722 -24172 -14572 35572 29259 -5579 16608 26556 11818 -2939 9544
23969I544R455j2567Q420n6800o5076J0903P4108L452M888j0775P92j5240K8812
$$ 9544 18999 6432 14852 -41948 -107024 -96121 -22013 -18561 -13673 -24448 -23656 -38896 -10084
23956a0084K8352K2643l0349O55l4058P175o317J4781J6135o3589K729N6877R6364
$$ -10084 18268 40911 10562 11217 -22841 -15666 -21983 -7202 8933 -54656 -51927 4950 101314
23943A01314L0590n0483k5787J7819k5998l7688L102m068J4636N0226M2750k1785
$$ 101314 131904 81421 55634 73453 47455 9767 12869 8801 23437 73663 116413 94628
23931I4628j8816k3238p637o319j8363k1419n6881J7256j0834J0532n043L7086
$$ 94628 75812 52574 44937 38618 20255 -1164 -58045 -40789 -51623 -41091 -46134 -9048
23919i048K5168n7909k2462J1628k8553O2701J0862l7657L2517K3876p200q876
$$ -9048 16120 -41789 -64251 -52623 -81176 -18475 -7613 -45270 -12753 11123 3923 -4953
23907d953J7870L0852l5965k8182m1710J0280j03l1804m3920m223p150K7987M3803
$$ -4953 12917 43769 7804 -20378 -62088 -51808 -51911 -83715 -127635 -131858 -139008 -111021 -67218
23894f7218k0805m8937L5215N5606M4433M2371m1236l8977j7103O41K4938J2951
$$ -67218 -88023 -136960 -101745 -46139 -1706 40665 -571 -39548 -56651 -56010 -31072 -18121
23882a8121j3929m053k5180l0308j0819L9840j7729m5852J9810J445M0649Q6790
$$ -18121 -32050 -36103 -61283 -91591 -102410 -62570 -80299 -126151 -106341 -104896 -64247 22543
23870B2543J197m6341r4709m3051J5632Q1441j892L2159N9830K8531q5564l3627
$$ 22543 23740 -22601 -117310 -160361 -144729 -63288 -65180 -33021 26809 55340 -30224 -63851
23858f3851J02302j097m8189m161L8799j5639M1502M4253m7935k2151p3132l2241
$$ -63851 38451 37354 -10835 -14996 23803 8164 49666 93919 45984 23833 -49299 -81540
23846h1540N197M3772n1016k164N1133L4740o8910l4049M6981j5518q78L1172
$$ -81540 -76343 -32571 -83587 -85751 -34618 122 -68788 -102837 -55856 -71374 -72252 -41080
23834d1080R0756K9158J9981k4989l1878k6881O5067K569m8695Q788N53l6905
$$ -41080 49676 78834 98815 73826 41948 15067 80134 82703 34008 42796 43349 6444
23822F444O9O0276J5326n7193k9535j5780m0828j913M1837K7537q4197j76Q731
$$ 6444 6513 66789 82115 24922 -4613 -20393 -61221 -63134 -21297 6240 -77957 -78133 -69402
23809f9402p537L6842p836j2276K7583J4739O4954M909l8159N02L6199o3855j05716
$$ -69402 -76939 -40097 -47933 -60209 -32626 -17887 47067 51976 13817 14319 50518 -13337 -119053
23796a19053L9175P8383J2982n7957q216O5818N616j2235J6170N23p5809l835
$$ -119053 -79878 -1495 11487 -46470 -54686 11132 16748 4513 20683 21206 -54603 -58438
23784e8438K5340k377l8444R285n872J0191K4051l7660n3846j3076Q1844O1240
$$ -58438 -33098 -35475 -73919 -64634 -70506 -60315 -36264 -73924 -127770 -140846 -59002 2238
23772B238o884m7175k1951k7879L8585P7861M9087j2674l5366N456N3210K1397
$$ 2238 -4646 -51821 -73772 -101651 -63066 14795 63882 51208 15842 21298 74508 95905
23760I5905n5884r333L3494j8190m1240M9498K5401l7025o7728m239K8113j624
$$ 95905 40021 30688 64182 45992 4752 54250 79651 42626 -25102 -29341 -1228 -2852
23748b852J1242o1846K0794R503m4356J5481M0881j5522m437l312L6007k8193
$$ -2852 8390 -53456 -32662 -23159 -67515 -52034 -11153 -26675 -31112 -34424 1583 -26610
23736b6610l1968k0501L9370j355M5919R380L1983K5054l1262l4489J0818O2410
$$ -26610 -58578 -79079 -39709 -41064 4855 14235 46218 71272 40010 5521 16339 78749
23724G8749k4079N770R902K4246k6527m1527l8744m5664j3099j0626k0848j306
$$ 78749 54670 60440 70342 94588 68061 26534 -12210 -57874 -70973 -81599 -102447 -103753
23712a03753L2790L1185J3567M2710k6641k534j6317J7615M0900J9407j077K0895
$$ -103753 -70963 -39778 -26211 16499 -10142 -12676 -28993 -11378 29522 48929 47852 68747
23700F8747m843k6072J1831k6103m6539K6156n3291n0046J0806J1310K3964L0538
$$ 68747 63904 37832 49663 23560 -22979 3177 -50114 -100160 -89354 -78044 -54080 -23542
23688b3542P534o362M27M8012k0291k881O5147l9721p5505N2783L4460p445m166
$$ -23542 -16008 -22370 -21943 26069 5778 2897 68044 28323 -47182 5601 40061 32616 28450
23675B8450J3166j3609l9161m4518K0811K3105L9995O3456o523p8730k4655M559
$$ 28450 41616 28007 -11154 -55672 -34861 -11756 28239 91695 85172 6442 -18213 -13654
23663a3654o4042o1580N0047L7374n9907l4853O1942J01700k9978l5221M4261
$$ -13654 -77696 -139276 -89229 -51855 -111762 -146615 -84673 17027 -12951 -48172 -3911
23652c911M7156J4509k5008l8694n3648K7964M3088j2670l9040j6701r697R773
$$ -3911 43245 57754 32746 -5948 -59596 -31632 11456 -1214 -40254 -56955 -66652 -56879
23640e6879N5986N3132l0917n8822j0444m299o122l9894K8931K6854k41k3194
$$ -56879 -893 52239 21322 -37500 -47944 -52243 -58365 -98259 -69328 -42474 -42715 -65909
23628f5909J4962N7040N8403J0633o7422p5141M1912N4287J506o7661k217M2793
$$ -65909 -50947 6093 64496 75129 7707 -67434 -25522 28765 30271 -37390 -39607 3186
23616C186j3231J0717M846m2451L4644J4199l7318k0532k3507J4799M1371k4760
$$ 3186 -10045 672 5518 -36933 -2289 11910 -25408 -45940 -69447 -54648 -13277 -38037
23604c8037p936j1354K9688M7293Q387J2150J5620j8647p2412m4301k4480L5769
$$ -38037 -45973 -57327 -27639 19654 28041 40191 55811 37164 -35248 -79549 -104029 -68260
23592f8260j4759J8018J1682l5900k1922L8318j3347j0915L1668J2917M8504O6579
$$ -68260 -83019 -65001 -53319 -89219 -111141 -72823 -86170 -97085 -65417 -52500 -3996 62583
23580F2583J4271j1837n7704P513k3449M8371L8372p869j9430q469L7123L7357
$$ 62583 76854 65017 7313 14826 -8623 39748 78120 70251 50821 42352 79475 116832
23568A16832k1414M604k317j2867K3257k0477o258p0624p0132K93O5671L1644
$$ 116832 95418 100022 97705 84838 108095 87618 81360 10736 -59396 -59103 6568 38212
23556C8212m9274j5585K0910L9833o276p5518j031j6219M3020k7848l855K6276
$$ 38212 -11062 -26647 -5737 34096 27820 -47698 -48729 -64948 -21928 -49776 -53631 -27355
23544b7355N3138J8305k2839J7088j9368j9675k4547j5841K9438P2182k2078m5896
$$ -27355 25783 44088 21249 38337 18969 -706 -25253 -41094 -11656 60526 38448 -7448
23532g448k1528P997K3833L347L9243K9562q495k9763n8075r319M4266k3354l6993
$$ -7448 -28976 -20979 2854 6201 45444 75006 66511 36748 -21327 -30646 13620 -9734 -46727
23519d6727K6700j2225N26j2625p205j8503K9231P8134o861j1003k7372O4045
$$ -46727 -20027 -32252 -31726 -44351 -51556 -70059 -40828 37306 30445 19442 -7930 56115
23507E6115m943L7555J0496k2840o7562m3797J7357m4767p1738l0751L3834L4903
$$ 56115 51172 88727 99223 76383 8821 -34976 -17619 -62386 -134124 -164875 -131041 -96138
23495i6138j733O72M9302J15388L1224j23077j9342P115L5291N5335K4545l0332
$$ -96138 -97871 -97199 -47897 67491 98715 -24362 -43704 -36589 -1298 54037 78582 48250
23483D8250n6386O655j2660k9184J7018j1310M944L9348k773n0768l1836M307
$$ 48250 -8136 -1481 -14141 -43325 -26307 -37617 -32673 6675 3902 -46866 -78702 -74395
23471g4395J898J8280k2702k4896K2567J4430P2563K7222l2374l9466J2754L2922
$$ -74395 -72497 -54217 -76919 -101815 -79248 -64818 7745 34967 2593 -36873 -24119 8803
23459H803J2986p006o0028r041L9408j4297n7432M3940M7286l696l441K8505k699
$$ 8803 21789 14783 -45245 -54286 -14878 -29175 -86607 -42667 4619 923 -2518 25987 23288
23446B3288l2826l2524o116J0729L9377j6093m1084k8145P313K0749M0266J8329
$$ 23288 -9538 -42062 -48178 -37449 1928 -14165 -55249 -83394 -76081 -55332 -15066 3263
23434C263j5930m4598L755P4741K3393j3402K162n9099m538J4847j9826o1992
$$ 3263 -12667 -57265 -53510 21231 44624 31222 33384 -25715 -30253 -15406 -35232 -97224
23422i7224k1425k5266M0904O3875J8699N3005N4878k7814n3441m1987m363j5795
$$ -97224 -118649 -143915 -103011 -39136 -20437 32568 87446 59632 6191 -35796 -40159 -55954
23410e5954p557R166P24j5463n4120K2864M6179K2685p540j555L8704o110r838
$$ -55954 -63511 -54345 -53621 -69084 -123204 -100340 -54161 -31476 -39016 -40571 -1867 -7977 -17815
23397a7815n5958M1041R3806J5321q828l2954p028j8436k5869Q126K6147r97p3864
$$ -17815 -73773 -32732 61074 76395 67567 34613 27585 9149 -16720 -8594 17553 16556 -57308
23384e7308l1029m259p042M9067k1752N786P3170o0489L866L9480J8708J3219
$$ -57308 -88337 -92596 -99638 -50571 -72323 -66537 6633 -53856 -49990 -10510 8198 21417
23372B1417n369j8690J08k3369K1767K4943l1008M4457L7405l507K0384j9295
$$ 21417 16048 -2642 -2534 -25903 -4136 20807 -10201 34256 71661 68154 88538 69243
23360F9243p5222p9056k3280K9158M0297Q3948J7669n0823l9844p8552L7136L5370
$$ 69243 -5979 -85035 -108315 -79157 -38860 45088 62757 11934 -27910 -106462 -69326 -33956
23348c3956M5755m440P387j669J3252r4033j1822O3398L4603l9843m9240O7541
$$ -33956 11799 7359 14746 13077 26329 -67704 -79526 -16128 18475 -21368 -70608 -3067
23336c067j3875M4183k108o7085Q879q033L6788k8274K061j9702R984K7914k312
$$ -3067 -16942 27241 25133 -41952 -33073 -41106 -4318 -32592 -30531 -50233 -40249 -12335 -14647
23323a4647p455J088K9080p464K2892m7992j9517J9225q548K6500R26J2907l1733
$$ -14647 -22102 -21014 8066 602 23494 -24498 -44015 -24790 -33338 -6838 -5912 6995 -24738
23310b4738K89j5780P744k1302l77O2230O7862l5005q586j6932O0062o710l8635
$$ -24738 -24449 -40229 -32485 -53787 -54164 8066 75928 40923 32337 15405 75467 68757 30122
23297C0122n0552O9718O2710O380J5586k2457j5064l0047q1268m9308M1m6353
$$ 30122 -20430 49288 111998 118378 133964 111507 96443 66396 -14872 -64180 -64139 -110492
23285a10492J6807R4181K5929k8756j4300m1851K6337P0344J1057K9660k7259
$$ -110492 -93685 496 26425 -2331 -16631 -58482 -32145 38199 49256 78916 51657
23274E1657o0907p5999K0109M3310k3394j7349j1720J9924M0115L8922J3700j3339
$$ 51657 -9250 -85249 -65140 -21830 -45224 -62573 -74293 -54369 -14254 24668 38368 25029
23262B5029k8645k3260o67J3096N5848l6614k1516J3670L2314n7526j0528Q0598
$$ 25029 -3616 -26876 -27543 -14447 41401 4787 -16729 -3059 29255 -28271 -38799 41799
23250D1799P701k3204n540L6613k705o0600M693o7571m5184M8547O5111k3661
$$ 41799 49500 26296 20756 57369 54664 -5936 -1243 -68814 -113998 -65451 -340 -24001
23238b4001M519j0834k6715J6897l0842J8042M0625j515Q995J4235J4156L6616
$$ -24001 -19482 -30316 -57031 -40134 -70976 -52934 -12309 -13824 -4829 9406 23562 60178
23226F0178k6400j3532P55J1550k2413o4643o268j876j3364P6214Q9128N001l873
$$ 60178 33778 20246 21001 32551 10138 -54505 -60773 -62649 -76013 201 89329 94330 90457
23213I0457q4182n0922L8744L3068K8478l128J948M783k7811j9411L142k7940
$$ 90457 6275 -44647 -5903 27165 55643 52515 54463 59246 31435 12024 15166 -12774
23201a2774l451O692L9788l5190o868P2835J05290N399j1078n3143m6788k355
$$ -12774 -16225 -9533 30255 -4935 -11803 61032 166322 171721 160643 107500 60712 58357
23189E8357P6755J6110o4243p1960J3481j3635M9971n277j3033p180j5219k9311
$$ 58357 135112 151222 86979 15019 28500 14865 64836 59559 46526 39346 24127 -5184
23177e184J6999j5416m5062J7610M8473j039K1845m4903J7091P4490R457K784
$$ -5184 11815 -3601 -48663 -31053 17420 16381 38226 -6677 10414 84904 94361 97145
23165I7145l1626n6424P625M0987L155k8659m9971j2540N8546O7866l3657o293
$$ 97145 65519 9095 16720 57707 60862 32203 -17768 -30308 28238 96104 62447 56154
23153E6154k1435m856K5163l1644l9630l8833K7974L0577L2130k1671o6812J8550
$$ 56154 34719 29863 55026 23382 -16248 -55081 -27107 3470 35600 13929 -52883 -34333
23141c4333K4987M5806o441J44n602L3683n2778n2050P099L0041L1136L6943K1865
$$ -34333 -9346 36460 30019 30163 24561 58244 5466 -46584 -39485 -9444 21692 58635 80500
23128H0500P786P949o1295J6488l5434o3263O930K6461O1580L1798o9315j1613
$$ 80500 88286 96235 34940 51428 15994 -47269 -40339 -13878 47702 79500 10185 -1428
23116a428j5234K4880J9945N9631j476q1896l1665M3466M2111l2918o6524n87
$$ -1428 -16662 8218 28163 87794 86318 4422 -27243 16223 58334 25416 -41108 -41695
23104d1695k0403l416M5488n1030q0981J0619K8947L5782j7363r174O7125P338
$$ -41695 -62098 -65514 -20026 -71056 -152037 -141418 -112471 -76689 -94052 -103226 -36101 -28763
23092b8763k1132m8107o5670O3459L6739n7100j023K26P1161L8159l52l2575K364
$$ -28763 -49895 -98002 -163672 -100213 -63474 -120574 -121597 -121371 -50210 -12051 -12403 -44978 -42614
23079d2614r149q572N59M9050k9531l0071M3052l0264J1722M8969k5659J2388
$$ -42614 -51763 -60335 -59776 -10726 -40257 -70328 -27276 -57540 -45818 3151 -22508 -10120
23067a0120l7350K3469N2638J6253l832K3108j2375q633k5332K0203l5592J3328
$$ -10120 -47470 -24001 28637 44890 41058 64166 51791 43158 17826 38029 2437 15765
23055A5765n2903J4339J6678j650N2332J8322n1496p445m846M1037R792l3284
$$ 15765 -37138 -22799 -6121 -7771 44561 62883 11387 3942 -904 40133 49925 16641
23043A6641J3192M8664k0128m9741m2617M179L5586m784m5563n982N9863o9752
$$ 16641 29833 78497 58369 8628 -33989 -29810 5776 992 -44571 -50553 9310 -60442
23031f0442o0313n966K8334L6975j7608N5617J8206m2169m1009j3064R207K5219
$$ -60442 -120755 -126721 -98387 -61412 -79020 -23403 -5197 -47366 -88375 -101439 -92232 -67013
23019f7013M9125j642k2239J1914j5995l1704m587K9712l2363k3454r763N3468
$$ -67013 -17888 -19530 -41769 -29855 -45850 -77554 -82141 -52429 -84792 -108246 -118009 -64541
23007f4541J5904J3428j0264k9197l0769K0602K1573j2281K2655N5347J7275l4696
$$ -64541 -48637 -35209 -45473 -74670 -105439 -84837 -63264 -75545 -52890 2457 19732 -14964
22995a4964k0699k6511k1376l4954O2054K2857R6332J4520l1419l7910j7136L885
$$ -14964 -35663 -62174 -83550 -118504 -56450 -33593 62739 77259 45840 7930 -9206 -5321
22983e321m1244m4120L3928N1668m2058L9215Q654k9524q289P534L5936j0467
$$ -5321 -46565 -90685 -56757 -5089 -47147 -7932 722 -28802 -37091 -29557 6379 -4088
22971d088P29N6721K0424k7098o3853q683J068P9555K8026K230o6278k3919l0537
$$ -4088 -3359 53362 73786 46688 -17165 -25848 -24780 54775 82801 85031 18753 -5166 -35703
22958c5703n4167Q743J2903J3503l2342O4052Q1153m7419M8972j3243R641O0071
$$ -35703 -89870 -81127 -68224 -54721 -87063 -23011 58142 10723 59695 46452 56093 116164
22946A16164Q254j7152k5136n2892j14940j5561M2501J9747l2582P8907j1952
$$ 116164 124418 107266 82130 29238 -85702 -101263 -58762 -39015 -71597 7310 -4642
22935d642K8321K0386n836k3770k1269N7806J5890M799j2529J6579j1509n2047
$$ -4642 23679 44065 38229 14459 -6810 50996 66886 71685 59156 75735 64226 12179
22923A2179J7105L2659k9374m5403n2311m3763r748O0199O5109P078K2371k8162
$$ 12179 29284 61943 32569 -12834 -65145 -108908 -118656 -58457 6652 13730 36101 7939
22911G939j969J15j9175J9507Q751P818L662m0852k2029O434N7673M4951j9973
$$ 7939 5970 6085 -13090 6417 15168 22986 26648 -14204 -36233 -29799 27874 72825 52852
22898E2852R00l8680k8969o2998N988O9670J5964Q056l0795k5286k1674K6371
$$ 52852 53752 15072 -13897 -76895 -70907 -1237 14727 22783 -8012 -33298 -54972 -28601
22886b8601P4491l029n1338N1199k9467p1664P247L1877L2902k4236K0788J21208
$$ -28601 45890 42861 -8477 42722 13255 -58409 -51162 -19285 13617 -10619 10169 131377
22874A31377K7913n6561l9274r870Q550L6379l5407p4774j9335l1582K81k8740
$$ 131377 159290 102729 63455 53585 62135 98514 63107 -11667 -31002 -62584 -62303 -91043
22862i1043N2102K0765r372l1562Q41J2229l964k433k2478M7545P202l6505J4343
$$ -91043 -38941 -18176 -27548 -59110 -58269 -46040 -50004 -52437 -74915 -27370 -20168 -56673 -42330
22849d2330L3504m8181M6470L4639j1188k8984R478l2643L903P1932k4041n0857
$$ -42330 -8826 -57007 -10537 24102 12914 -16070 -6592 -39235 -35332 36600 12559 -38298
22837c8298L6598k0187J466N696l7069J7496L0703l8660K5904K5156O907j388
$$ -38298 -1700 -21887 -20421 -14725 -51794 -34298 -3595 -42255 -16351 8805 15712 14324
22825A4324k0333K2901M9662N6249k2204m5115j4250K1406l1011K2934k962J84
$$ 14324 -6009 16892 66554 122803 100599 55484 41234 62640 31629 54563 51601 51785
22813E1785K2489l304o179O917n0252L0195k368j4865o1581m2102M2030R322k8268
$$ 51785 74274 70970 64791 71708 21456 51651 49283 34418 -27163 -69265 -27235 -17913 -46181
22800d6181n9532J8483m432o426L2621j2726L1747K0039K069l2618J666n398L9005
$$ -46181 -105713 -87230 -91662 -98088 -65467 -78193 -46446 -26407 -24338 -56956 -55290 -60688 -21683
22787b1683L4391k4897j8699M8442p79q2739M6598M6300j8094K3461k1044q5666
$$ -21683 12708 -12189 -30888 17554 16775 -65964 -19366 26934 8840 32301 11257 -74409
22775g4409J7674Q3716P816l1583n0069o115L7375L3600j7938l1795M1683Q367
$$ -74409 -56735 26981 34797 3214 -46855 -52970 -15595 18005 67 -31728 9955 18322
22763A8322r512N3886j8456l2124k1480M2181k1361o2849j5469L2243N5897n162
$$ 18322 8810 62696 44240 12116 -9364 32817 11456 -51393 -66862 -34619 21278 16116
22751A6116j5541j7890M257k9436N473J9499K4007m8151k5496J0292j0470J5355
$$ 16116 575 -17315 -13058 -42494 -37021 -17522 6485 -41666 -67162 -56870 -67340 -51985
22739e1985J6629r042J2533K3067Q666k7901L6147M507n9691p2545N1399K7824
$$ -51985 -35356 -44398 -31865 -8798 -132 -28033 8114 12621 -47070 -119615 -68216 -40392
22727d0392O5040k5311j0465m811l1495j8233m204J4100J7757K8086l7927o054
$$ -40392 24648 -663 -11128 -15939 -47434 -65667 -69871 -55771 -38014 -9928 -47855 -53909
22715e3909J2538n287l5439P4647l016o169j293m0171L0907K2222m0601P433k5047
$$ -53909 -41371 -46658 -82097 -7450 -10466 -16635 -17928 -58099 -27192 -4970 -45571 -38138 -63185
22702f3185p7035k2429O7655N9141k0073l0027J8979k4644K0984O7162M0006m4861
$$ -63185 -140220 -162649 -94994 -35853 -55926 -85953 -66974 -91618 -70634 -3472 36534 -8327
22690h327j3328m0136J708O698l4504P6370k9794O856K264j352k8321K004L7873
$$ -8327 -21655 -61791 -60083 -53385 -87889 -11519 -41313 -34457 -32193 -33545 -61866 -59862 -21989
22677b1989J930p143M200M740L275l1334m3420J2978M6939N8935n1575o4705L5098
$$ -21989 -20059 -27202 -23002 -18262 -14987 -46321 -89741 -76763 -29824 29111 -22464 -87169 -52071
22664e2071J6099j7706p21J7155k2480K789o00K5090Q114o349j7555L1660Q5022
$$ -52071 -35972 -53678 -54399 -37244 -59724 -56935 -57535 -32445 -24331 -30680 -48235 -16575 68447
22651F8447L7435j2568q3001K6359J809K4634k7727m7785R798N042Q477j0178
$$ 68447 105882 93314 10313 36672 38481 63115 35388 -12397 -2599 2443 10920 742
22639G42l792K6506k3087O71N443k1088K7549R307l7744l9600J3087J1679K8957
$$ 742 -3050 23456 369 1040 6483 -14605 12944 22251 -15493 -55093 -42006 -30327 -1370
22626a370l129O1258L4663j4108j9161m5646k0137J3371m557o437P3769k6121
$$ -1370 -4499 56759 91422 77314 58153 12507 -7630 5741 1184 -5253 68516 42395
22614D2395J7190O1758J6598K4395N299p1953l8532n8599n6333k2147N5411K6646
$$ 42395 59585 121343 137941 162336 167635 95682 57150 -1449 -57782 -79929 -24518 2128
22602B128k4158J226p0749j4412O1170N2573k943L8815m0795o8991L0793j9599
$$ 2128 -22030 -20804 -91553 -105965 -44795 7778 4835 43650 2855 -66136 -35343 -54942
22590e4942k0038K3303M5202l4107j366J909K1665K9242J1616K2213p848n0280
$$ -54942 -74980 -51677 -6475 -40582 -41948 -40039 -18374 10868 22484 44697 36849 -13431
22578a3431q893K700N7876j6429j5468P134j5730l4259j3353M1651Q784o028K1831
$$ -13431 -22324 -19624 38252 21823 6355 13489 -2241 -36500 -49853 -8202 582 -5446 16385
22565A6385r618l5248L2200N8798o083j0349n4037l1304M2552P5754m7290o937
$$ 16385 6767 -28481 3719 62517 56434 46085 -7952 -39256 3296 79050 31760 24823
22553B4823n19j1297j5902n5680m522m1733k1304J361J749O0768L1987K1476m461
$$ 24823 24304 13007 -2895 -58575 -63097 -104830 -126134 -124773 -123024 -62256 -30269 -8793 -13254
22540a3254o5582J9992N0203N3098k0147r9m5128m0633K710q933K0783k1599j2726
$$ -13254 -78836 -58844 -8641 44457 24310 24211 -20917 -61550 -58840 -67773 -46990 -68589 -81315
22527h1315O955J3095J1841L9551M2820K8038o0163j2691l8912L1781M3084L3873
$$ -81315 -74360 -61265 -49424 -9873 32947 60985 822 -11869 -50781 -19000 24084 57957
22515E7957m1878o818J5764j512j6116l6520J1599J3166M0273j5404j1024j2270
$$ 57957 16079 9261 25025 23513 7397 -29123 -17524 -4358 35915 20511 9487 -2783
22503b783m4842K0309M4010J1728n6568o046K8506M2702N0466l9173j0709k0967
$$ -2783 -47625 -27316 16694 28422 -28146 -34192 -5686 37016 87482 48309 37600 16633
22491A6633k4284M7554J9906j8772o4324j2147k1510q22K4925L0984K0899K22
$$ 16633 -7651 39903 59809 41037 -23287 -35434 -56944 -57766 -32841 -1857 19042 19264
22479A9264p5418j5926K4109n1420J0590L6158n375k1648M808l730J2767K6753
$$ 19264 -56154 -72080 -47971 -99391 -88801 -52643 -58018 -79666 -74858 -78588 -65821 -39068
22467c9068l0078P755K1908J2179k4293J1518l49l2406k9497J2912J0635m414
$$ -39068 -69146 -61391 -39483 -27304 -51597 -40079 -40428 -72834 -102331 -89419 -78784 -83198
22455h3198K45J9880M5614J1969K0428K7800k0552k9133k0397l1884O517L5956
$$ -83198 -82953 -63073 -17459 -5490 14938 42738 22186 -6947 -27344 -59228 -52711 -16755
22443a6755m7716j5931j3203J7066K0289J5143J5950n8505p2612N1481O8303K6877
$$ -16755 -64471 -80402 -93605 -76539 -56250 -41107 -25157 -83662 -156274 -104793 -36490 -9613
22431i613k3662o3334n27O2205O604m3358L2106K2871K5583J0705k7562l1380
$$ -9613 -33275 -96609 -97136 -34931 -28327 -71685 -39579 -16708 8875 19580 -7982 -39362
22419c9362j4396k52k1206m8434O1671N2997m4137R636M5576j8450K8971J8282
$$ -39362 -53758 -54010 -75216 -123650 -61979 -8982 -53119 -43483 2093 -16357 12614 30896
22407C0896p6565l4113N5985o344l9168O4697L7237j7303L3425J0407j9131r2664
$$ 30896 -45669 -79782 -23797 -30141 -69309 -4612 32625 15322 48747 59154 40023 -52641
22395e2641K5765N8789o1963R998n4137n4863l89M1220J2441r919L067j4428P7636
$$ -52641 -26876 31913 -30050 -20052 -74189 -129052 -129441 -88221 -75780 -85699 -82632 -97060 -19424
22382a9424J7141J7062M8937K8898k0006p8520l4198m3540N120N4985k1935k8724
$$ -19424 -2283 14779 63716 92614 72608 -5912 -40110 -83650 -78530 -23545 -45480 -74204
22370g4204M2798K1123j0109j4747o6381j9802L3750R3638L5855J481L5051m8717
$$ -74204 -31406 -10283 -20392 -35139 -101520 -121322 -87572 6066 41921 43402 78453 29736
22358B9736l6533N3140O4529K0822n5382j06158L0341J04777L8972j1989m6938
$$ 29736 -6797 46343 110872 131694 76312 -29846 495 105272 144244 132255 85317
22347H5317p8945k0457O6601K2966m9855R736K4549o3846l0141O7245M7519j7120
$$ 85317 6372 -14085 52516 75482 25627 35363 59912 -3934 -34075 33170 80689 63569
22335F3569K8557j9853j6433j3601l9115M1392k528j1225n8519m2219l3529J8804
$$ 63569 92126 72273 55840 42239 3124 44516 41988 30763 -27756 -69975 -103504 -84700
22323h4700L9372l7535L1103K4512O719J1566K6943M3501O839n6011j4175k687
$$ -84700 -45328 -82863 -51760 -27248 -20529 -8963 17980 61481 68320 12309 -1866 -4553
22311d553M9037k6938q625N281q0989k7119J1868M4443L0038K3206j1876J1770
$$ -4553 44484 17546 8921 14202 -66787 -93906 -82038 -37595 -7557 15649 3773 15543
22299A5543j6068J9783l5076p307Q962K3367P1129k3557o9482l4243K7859j9461
$$ 15543 -525 19258 -15818 -23125 -14163 9204 80333 56776 -12706 -46949 -19090 -38551
22287c8551M4576K4959L3621k9103k1572m4617k2574K7060M6367j2243o1744l3032
$$ -38551 6025 30984 64605 35502 13930 -30687 -53261 -26201 20166 7923 -53821 -86853
22275h6853J2297K5776r40L7052k7891l8307M561k0562m1258M9481M2631j1548
$$ -86853 -74556 -48780 -49720 -12668 -40559 -78866 -74305 -94867 -136125 -86644 -44013 -55561
22263e5561o0471K5862J1760j0640J9880L4164m802l6537k6308k7078K5704J17092
$$ -55561 -116032 -90170 -78410 -89050 -69170 -35006 -39808 -76345 -102653 -129731 -104027 13065
22251A3065N8196K0815M029J438L0650K147k5016m2726n0643n4221j3627m5400
$$ 13065 71261 92076 96105 97543 128193 130340 105324 62598 11955 -42266 -55893 -101293
22239a01293m50P9410L5290P854L7893j9415j5672N8567O2651n3813k3794L042
$$ -101293 -101743 -22333 12957 20811 58704 39289 23617 82184 144835 91022 67228 70270
22227G0270l4829J4753L1809p6450k645N8342n0824k5391o4436n8700J0350L2902
$$ 70270 35441 50194 82003 5553 2908 61250 10426 -14965 -79401 -138101 -127751 -94849
22215i4849L412O7219j4803j9177O5893K431o4281J7895J3464k9504M396O2873
$$ -94849 -91437 -24218 -39021 -58198 7695 10126 -54155 -36260 -22796 -52300 -47904 14969
22203A4969L1472J8470K2405L9731M857p7577n8939m0624L5067k563p7591M0974
$$ 14969 46441 64911 87316 127047 131904 54327 -4612 -45236 -10169 -12732 -90323 -49349
22191d9349M1214J9764L061J2970L6186L6192m9026J088n606n589L8657P615p2980
$$ -49349 -8135 11629 14690 27660 63846 100038 51012 52100 46494 40905 79562 87177 14197
22178A4197p5422j2415N2815P300k8009k9311P0382O1245m432l2256o8010j4318
$$ 14197 -61225 -73640 -20825 -13525 -41534 -70845 -463 60782 56350 24094 -43916 -58234
22166e8234p558P7314R3691m649k0062n6119n389j5172L3868l0317l7131K8149
$$ -58234 -65792 11522 105213 100564 80502 24383 18994 3822 37690 7373 -29758 -1609
22154a609p4614J1959Q2934K7751n0749n7208k2313K2417L0536k3058J1328J5664
$$ -1609 -76223 -64264 18670 46421 -4328 -61536 -83849 -61432 -30896 -53954 -42626 -26962
22142b6962j1596J1079J684K3248l0185O932P9J5543P354m2652j9323J5153L2464
$$ -26962 -38558 -27479 -25795 -2547 -32732 -25800 -25721 -10178 -2824 -45476 -64799 -49646 -17182
22129a7182O410k6798l6713J5557k6299o889J10877M0569n1514K46J2079o09K813
$$ -17182 -10772 -37570 -74283 -58726 -85025 -91914 18963 59532 8018 8264 20343 19734 22547
22116B2547P1686K706n1336p1048k6160j3735K3362O841j1243q3924l9039Q304
$$ 22547 94233 96939 45603 -25445 -51605 -65340 -41978 -35137 -46380 -130304 -169343 -161039
22104a61039P1257L7649r167O995N6751K8526p745l1296k0320K2358J4740K7361
$$ -161039 -89782 -52133 -61300 -54305 2446 30972 23227 -8069 -28389 -6031 8709 36070
22092C6070l0560n0309L1968m2968j4796K6235P0507L5050j0913m318M257l6845
$$ 36070 5510 -44799 -12831 -55799 -70595 -44360 26147 61197 50284 45966 50223 13378
22080A3378o8251K0824O8969j6165K5681P769K6371j9291m0611k0728n0063n310
$$ 13378 -54873 -34049 34920 18755 44436 52205 78576 59285 18674 -2054 -52117 -57427
22068e7427L2178m6261M311M426K9347L877O0876R528j7037J2954j6830k6841
$$ -57427 -25249 -71510 -67199 -62773 -33426 -29549 31327 40855 23818 36772 19942 -6899
22056f899n9239K8541M9342p918l9171k9336k9790L8697k2218l5515J1243K1843
$$ -6899 -66138 -37597 11745 3827 -35344 -64680 -94470 -55773 -77991 -113506 -102263 -80420
22044h0420K5256m1610m7844K2559O3287l163N609N195L6548L5943M3579N9561
$$ -80420 -55164 -96774 -144618 -122059 -58772 -61935 -56326 -51131 -14583 21360 64939 124500
22032A24500p2045p5215l0930k2409n1038N9601J00962P389j1571j0129l2358
$$ 124500 52455 -22760 -53690 -76099 -127137 -67536 33426 40815 29244 19115 -13243
22021a3243o622K417J0713l076q0388J2692K2865l3300M7595K8930L299K67L3275
$$ -13243 -19865 -17448 -6735 -9811 -90199 -77507 -54642 -87942 -40347 -11417 -8118 -7851 25424
22008B5424K9900k8378K271L5694n5443m7309o2322N643J2353J5007K3078K6618
$$ 25424 55324 26946 29217 64911 9468 -37841 -100163 -94520 -82167 -67160 -44082 -17464
21996a7464j2200K643L4488j5360o631M2491l1010J3678Q961L7343k6163k9456
$$ -17464 -29664 -27021 7467 -7893 -14524 27967 -3043 10635 19596 56939 30776 1320
21984A320k9564o2051k6695K9565R683K2644O1025P916l000Q746l1253n0162L6017
$$ 1320 -28244 -90295 -116990 -87425 -77742 -55098 5927 13843 10843 19589 -11664 -61826 -25809
21971b5809L7162K2830l7805K793J4544K0913K7688J881m460K9q807J2600J2297
$$ -25809 11353 34183 -3622 -829 13715 34628 62316 64197 59737 59766 50959 63559 75856
21958G5856m4671k7172j1189n6823j643K327p000K5219j2605K7368P914K2511
$$ 75856 31185 4013 -7176 -63999 -65642 -63315 -70315 -45096 -57701 -30333 -22419 92
21946I2J4170L4525k9389J4434K7736K5760j1795N240j2149M0187l1330k7126
$$ 92 14262 48787 19398 33832 61568 87328 75533 80773 68624 108811 77481 50355
21934E0355N7849k181p3623n0865J0810J8223K9331j094Q464J4222l2353J8450
$$ 50355 108204 106023 32400 -18465 -7655 10568 39899 38805 47269 61491 29138 47588
21922D7588M85O380K0976m3829n4361m7853L6759L9567k1062n3735j2204L556
$$ 47588 48073 54453 75429 31600 -22761 -70614 -33855 5712 -15350 -69085 -81289 -77733
21910g7733N2172k6722L8142L996K087L8434l7986k0001J4795K0344k934k372
$$ -77733 -25561 -52283 -14141 -10145 -8058 30376 -7610 -27611 -12816 7528 4594 2222
21898B222o8064n1235l6311O8708Q9086J2284L697L6452l7326l8430k7689j4068
$$ 2222 -65842 -117077 -153388 -84680 4406 16690 20387 56839 19513 -18917 -46606 -60674
21886f0674J7884o66m1618k7806R521J7530k0864o257K3278L8519J6701k1538
$$ -60674 -42790 -43456 -85074 -112880 -103359 -85829 -106693 -112950 -89672 -51153 -34452 -55990
21874e5990N5381P35n6688l1692r907O559M3590Q4636k7181m8734k847K2078K7295
$$ -55990 -609 126 -56562 -88254 -98161 -91602 -48012 36624 9443 -39291 -42138 -20060 7235
21861G235J0149o6921m6385O844j3042J7617O5861O617L47K819J877K8837N5475
$$ 7235 17384 -49537 -95922 -89078 -102120 -84503 -18642 -12025 -11678 -8859 -6982 21855 77330
21848G7330l6441j03910k9202M1039O5801J3910k606l7132L91L5976k0205m3386
$$ 77330 40889 -63021 -92223 -51184 14617 28527 25921 -11211 -10820 25156 4951 -38435
21836c8435N0134P8209J9260p9029r9269K289L4738M3969K815Q752J6115r598
$$ -38435 11699 89908 109168 30139 -69130 -66841 -32103 11866 14681 23433 39548 29950
21824B9950l5064k761k1068m464J8032j8309k7816Q8848M5195J0624q8026m2083
$$ 29950 -5114 -7875 -28943 -33407 -15375 -33684 -61500 27348 72543 83167 -4859 -46942
21812d6942L8520M6590r37l3257o8395J3606P125J7996n93k8423k0191k4917m5903
$$ -46942 -8422 38168 37231 3974 -64421 -50815 -43690 -25694 -26287 -54710 -74901 -99818 -145721
21799a45721L6855M1335L2429N4029L123k4017M3116M2163r41L772n1362p4811
$$ -145721 -108866 -67531 -35102 18927 22050 -1967 41149 83312 82371 86143 34781 -40030
21787d0030K4293P0577L0047j0494l0165l3096j7189N2014L0825j2960l7659K1229
$$ -40030 -15737 54840 84887 74393 44228 11132 -6057 45957 76782 63822 26163 47392
21775D7392n6863m1387O854O31K9885j5034O0188k6790n6765K9055J4218l1479
$$ 47392 -9471 -50858 -44004 -43373 -13488 -28522 31666 4876 -51889 -22834 -8616 -40095
21763d0095m0091j8591L3206J430J3579L609K9021l8980j0730j8609j0698O50
$$ -40095 -80186 -98777 -65571 -64141 -50562 -46953 -17932 -56912 -67642 -86251 -96949 -96299
21751i6299J6041q148j046N7045N9837L2261l1512j8599q996K5382k2511o5499
$$ -96299 -80258 -88406 -89452 -32407 27430 59691 28179 9580 584 25966 3455 -62044
21739f2044p956j1267K5523R0823N9106L699n7930m5951m7514j9400n2631R8698
$$ -62044 -70000 -81267 -55744 35079 94185 97884 39954 -5997 -53511 -72911 -125542 -26844
21727b6844K5527k8492K6247K8119k8136o2915j9139Q1809O7552J1304n9453n7764
$$ -26844 -1317 -29809 -3562 24557 -3579 -66494 -85633 -3824 63728 75032 15579 -42185
21715d2185o5029M9149N8299l9442j2325O9295M6526N1781J5504n6017j4382k9816
$$ -42185 -107214 -58065 234 -39208 -51533 17762 64288 116069 131573 75556 61174 31358
21703C1358O1898N573j5371l8031n2681m5101n914j5878M6977r143k982o6978
$$ 31358 93256 98829 83458 45427 -7254 -52355 -58269 -74147 -27170 -36313 -39295 -106273
21691a06273K959N1823P4379K8160R112j1244l7965p5458L9679L3159J4901J8217
$$ -106273 -103314 -51491 22888 51048 60160 48916 10951 -64507 -24828 8331 23232 41449
21679D1449n3485j1024K9547N0003J7295j4504p325J0003J718L3119k779q6751
$$ 41449 -12036 -23060 6487 56490 73785 59281 51956 61959 63677 96796 94017 7266
21667G266j02281O3941l2304k7242K5438L2444q677k1547P856Q8887k3415l5575
$$ 7266 -95015 -31074 -63378 -90620 -65182 -32738 -41415 -62962 -55106 33781 10366 -25209
21655b5209k3218K7919j637l3088n588N3816O4476j5855k5855n3126j2669J73
$$ -25209 -48427 -20508 -22145 -55233 -60821 -7005 57471 41616 15761 -37365 -50034 -49861
21643d9861O3316O1349P121j2750n0119l026K4500J9476l2376j4406r256m3893
$$ -49861 13455 74804 81925 69175 19056 16030 40530 60006 27630 13224 3968 -39925
21631c9925K0710Q8467K9225l0060k1767J7353n4569j02525R023k6047M3745N5971
$$ -39925 -19215 69252 98477 68417 46650 64003 9434 -93091 -84068 -110115 -66370 -10399
21619a0399k6172Q919j1904m7060M224j1762k7189R1323N4872j1560j712L55L3517
$$ -10399 -36571 -27652 -39556 -86616 -82392 -94154 -121343 -30020 24852 13292 11580 11935 45452
21606D5452R624J5259n3665k2942j7704k0990p009j4721M9465k47M0843M0240
$$ 45452 55076 70335 16670 -6272 -23976 -44966 -51975 -66696 -17231 -17478 23365 63605
21594F3605N396o478L567N768j2373m120l4023l6662k316J8853K6977n9188o0472
$$ 63605 69001 62523 66090 71858 59485 55365 21342 -15320 -17636 1217 28194 -30994 -91466
21581i1466n037J9617O2856O0524j5313j1922k1417Q922M2553r456K394k3406
$$ -91466 -96503 -76886 -14030 46494 31181 19259 -2158 6764 49317 39861 42255 18849
21569A8849r742q053M2096l1583k6385n7026m8783N1651P0463j6227J3349k860
$$ 18849 9107 1054 43150 11567 -14818 -71844 -120627 -68976 1487 -14740 -1391 -4251
21557d251J1236k7389J2945K2161m686O251L556m853j9265m1677k8764J6718M7729
$$ -4251 6985 -20404 -7459 14702 10016 16267 19823 14970 -4295 -45972 -74736 -58018 -10289
21544a0289J7655l817j4311q784M3686J8159j0228J911n9795j8800M7185O5986
$$ -10289 7366 3549 -10762 -19546 24140 42299 32071 33982 -25813 -44613 2572 68558
21532F8558J4877K6841n5340L9964o534m0071j3611o1917J2180M2723K7931j7139
$$ 68558 83435 110276 54936 94900 88366 48295 34684 -27233 -15053 27670 55601 38462
21520C8462K457R1323K50o2534m8629o8465M6999L9290n173r100K9845L0995n0069
$$ 38462 40919 132242 132492 69958 21329 -47136 -137 39153 33980 24880 54725 85720 35651
21507C5651j5814M8100l145l5310j4042J1845M1726k3645j3200L2625J8105q868
$$ 35651 19837 67937 64792 29482 15440 27285 69011 45366 32166 64791 82896 74028
21495G4028j2484k3599O6691J2732k3092k910o243k9496n6570o5412o840J5920
$$ 74028 61544 37945 104636 117368 94276 91366 85123 55627 -943 -66355 -73195 -57275
21483e7275K0211L1441k605o80O3364k75n0318k5872K7495M4442o0251j1574L5879
$$ -57275 -37064 -5623 -8228 -8908 54456 54181 3863 -22009 5486 49928 -10323 -21897 13982
21470A3982m1211L7094M4842m6208j4136j8411j7175N8415J8946k8741J7306q272
$$ 13982 -27229 9865 54707 8499 -5637 -24048 -41223 17192 36138 7397 24703 16431
21458A6431n2631k1887L0073O7000k1073k9532o285J3913j8552m5110n4534N4720
$$ 16431 -36200 -58087 -28014 38986 17913 -11619 -17904 -3991 -22543 -67653 -122187 -67467
21446f7467P8416p815j6892J1389j5335o474J8743O5917j3110p761J7729Q608
$$ -67467 10949 3134 -13758 -2369 -17704 -24178 -5435 60482 47372 39611 57340 65948
21434F5948K5620l3525n393K4322n5150K7528r379l1281l600j8107m7754l6589
$$ 65948 91568 58043 52650 76972 21822 49350 39971 8690 5090 -13017 -60771 -97360
21422i7360l4977M3489O1963J4740M9301M714m987k9195l6951j8931R0381J3685
$$ -97360 -132337 -88848 -26885 -12145 37156 41870 36883 7688 -29263 -48194 42187 55872
21410E5872j06385n2931K2291Q9396P3574L1555l9068m0242M6916r124K3801L700
$$ 55872 -50513 -103444 -81153 8243 81817 113372 74304 34062 80978 71854 95655 99355
21398I9355Q322m3334l9110L7030j2926o433m4281L1200N2537M673m51l5665K3791
$$ 99355 107677 64343 25233 62263 49337 42904 -1377 29823 82360 87033 86582 50917 74708
21385G4708L3042m5537m7667N0855L1694p1743q1374L8644O2262l0022k3880M582
$$ 74708 107750 62213 14546 65401 97095 25352 -56022 -17378 44884 14862 -9018 -4436
21373d436k2816m226N1477j4673J5215K2662J9648j2999L7408q337L2451J7848
$$ -4436 -27252 -31478 19999 5326 20541 43203 62851 49852 87260 78923 111374 129222
21361A29222k2243K145J249k6022j8742M6326J5302p003J6723l3037n973p6987
$$ 129222 106979 109124 110373 84351 65609 111935 127237 120234 136957 103920 97947 20960
21349B0960o7678m0199P9745N405k9212J9760P2065l52q163J8472R829N5841j4017
$$ 20960 -46718 -86917 -7172 -1767 -30979 -11219 60846 60494 52331 70803 80632 136473 122456
21336A22456m8514o9740q689N4438K5216k884l3887l8098l9337N30n855J6001
$$ 122456 73942 4202 -4487 49951 75167 72283 38396 298 -39039 -38509 -44364 -28363
21324b8363j6909r077N2709K5980j7002n5490l8264Q5611N6337k2608n6363m8107
$$ -28363 -45272 -54349 -1640 24340 7338 -48152 -86416 -805 55532 32924 -23439 -71546
21312g1546o373N4508P3159R75l4107o0743m1698K0472N8729L2690n313m4155
$$ -71546 -77919 -23411 49748 50723 16616 -44127 -85825 -65353 -6624 26066 20753 -23402
21300b3402R187L0682K6035L1588j4833k31J0870K4524j638j2209o5311m4719
$$ -23402 -14215 16467 42502 74090 59257 59026 69896 94420 92782 80573 15262 -29457
21288b9457M237P7444R8878N783o6708j7152L5655K2234N583q410K125l2119n9775
$$ -29457 -25220 52224 151102 156885 90177 73025 108680 130914 136497 128087 130212 98093 38318
21275C8318k1230q299K2169Q4583K7891p4353n815L2886m7245j03580M4064P245
$$ 38318 17088 8789 30958 115541 143432 69079 63264 96150 48905 -54675 -10611 -3366
21263c366K7861M3680K8420K2214j2536l1905k0235J558l6133n6560j6767J6806
$$ -3366 24495 68175 96595 118809 106273 74368 54133 55691 19558 -37002 -53769 -36963
21251c6963L3983K0416L07n514p343J9345M3474k3781m6304l4688J5236L5670
$$ -36963 -2980 17436 17743 12229 4886 24231 67705 43924 -2380 -37068 -21832 13838
21239A3838L2641l2295M956j9184j7662J891O83M5800K4936l4780L3963M980m6028
$$ 13838 46479 14184 19140 -44 -17706 -15815 -15132 30668 55604 20824 54787 59767 13739
21226A3739N7594M1186L13L436l2980Q142l0501j8473j01493j9209M0492O4926
$$ 13739 71333 112519 112832 116268 83288 91430 60929 42456 -59037 -78246 -37754 27172
21214B7172M9389l7808j4093k4702K1177M0406j25j8924l6331j5300j248n569
$$ 27172 76561 38753 24660 -42 21135 61541 61416 42492 6161 -9139 -10387 -15956
21202a5956K4568L8289j7769n2416n4335K6212M5520M70R94N3800o4936j2857
$$ -15956 8612 46901 29132 -23284 -77619 -51407 -5887 -5417 -4423 49377 -15559 -28416
21190b8416J3344k4968M8662J5179J4450L4771l8924l8467M955q5982m641O6744
$$ -28416 -15072 -40040 8622 23801 38251 73022 34098 -4369 586 -85396 -90037 -23293
21178b3293K9169o7108j142k9272M4821M6672J9451j438n0925j9381M5694L579
$$ -23293 5876 -61232 -62374 -91646 -46825 -153 19298 17860 -33065 -52446 -6752 -3173
21166c173q473j2689J0237o007J0477K846m0555m9209M6919K3037P717J2132N337
$$ -3173 -11646 -24335 -14098 -20105 -9628 -6782 -47337 -96546 -49627 -26590 -18873 -6741 -1404
21153a404M3287M1654M1925o2291k8004k1313m337J5386j779j878j4789P664J6037
$$ -1404 41883 83537 125462 63171 35167 13854 9517 24903 23124 21246 6457 14121 30158
21140C0158L019J6977R449k3971k0538m1007k6800l6126N4402R4579P074k9866
$$ 30158 33177 50154 59603 35632 15094 -25913 -52713 -88839 -34437 60142 67216 37350
21128C7350N715L861j0733q189K2279P639K8719K1136l1787n4212L661M2340L5557
$$ 37350 43065 46926 36193 28004 50283 57922 86641 107777 75990 21778 25439 67779 103336
21115A03336J3643j2711j2751j6410m7875n3574K5095M6017p172j15661k5056
$$ 103336 116979 104268 91517 75107 27232 -26342 -1247 44770 37598 -78063 -103119
21104a03119R4805M6948M4576n5990p7019j5830J4997M389J7382L9326o7279K7669
$$ -103119 -8314 38634 83210 27220 -49799 -65629 -50632 -46243 -28861 10465 -56814 -29145
21092b9145N6044j8472L1020N9634m5215n8606L2675k9052k7067L377j2145j0611
$$ -29145 26899 8427 39447 99081 53866 -4740 27935 -1117 -28184 -24807 -36952 -47563
21080d7563j5772M9630P6271m496J995m2526r0707L7537O2083J0353j6046o297
$$ -47563 -63335 -13705 62566 58070 60065 17539 -73168 -35631 26452 36805 20759 14462
21068A4462j387j7771O0701L0653K8291L4985p5937q5556k9258K7469M3338M7407
$$ 14462 13075 -4696 56005 86658 114949 149934 73997 -11559 -40817 -13348 29990 77397
21056G7397M986K9824l6428j1779K1389l1424o963K1431J1664l4054o3470n2114
$$ 77397 82383 112207 75779 64000 85389 53965 47002 68433 80097 46043 -17427 -69541
21044f9541L6476N3043J4928O609n688N7682j0755M2954L967k7175j6095L5043
$$ -69541 -33065 19978 34906 41515 35827 93509 82754 125708 129675 102500 86405 121448
21032A21448l4025m4613k3021P249l5564L3298L5991K0142j8402n2214N396L2731
$$ 121448 87423 42810 19789 27038 -8526 24772 60763 80905 62503 10289 15685 48416
21020D8416R680n542n4557k2516o1901l5005q456L4599N4343j2442m3494R738
$$ 48416 58096 52554 -2003 -24519 -86420 -121425 -129881 -95282 -40939 -53381 -96875 -87137
21008h7137J4035l117K1797N0833J2569J7043J4420l6423k1892J1968k444J4867
$$ -87137 -73102 -76219 -54422 -3589 8980 26023 40443 4020 -17872 -5904 -8348 6519
20996F519J6500L4606L0601J5325l127m6780m6990n5186J4062N0094m110n3331
$$ 6519 23019 57625 88226 103551 100424 53644 6654 -48532 -34470 15624 11514 -41817
20984d1817K8757k2257L147L7064J5963p543J5908O4717J5777p9607n0941o431
$$ -41817 -13060 -35317 -32170 4894 20857 13314 29222 93939 109716 30109 -20832 -27263
20972b7263K9348j1681m2511K5813m6228M0774R3381j2706J9138l2068k9450K5227
$$ -27263 2085 -9596 -52107 -26294 -72522 -31748 61633 48927 68065 35997 6547 31774
20960C1774K0845k9021m9549n7347Q194L350J3325M192k2553Q0784K6492o1671
$$ 31774 52619 23598 -25951 -83298 -75104 -71754 -58429 -54237 -76790 3994 30486 -31185
20948c1185J4236M2427k8348l755k1655k155L7157J3473r458n2094J8886j3415
$$ -31185 -16949 25478 -2870 -6625 -28280 -30435 6722 20195 10737 -41357 -22471 -35886
20936c5886L6196k6535N8698P5826L8100j7355q3968p7601k2324M5327P1846M2149
$$ -35886 310 -26225 32473 108299 146399 129044 45076 -32525 -54849 -9522 62324 104473
20924A04473R197j9739j22107o859L2554J8516J3852k0803p235L1886J8474K3858
$$ 104473 113670 93931 -28176 -35035 -2481 16035 29887 9084 1849 33735 52209 76067
20912G6067l4591K57k5696J945m7714p440q361j374K218M2570l7602K9018K4268
$$ 76067 41476 41733 16037 17982 -29732 -37172 -45533 -46907 -44689 -2119 -39721 -10703 13565
20899A3565J3506k3304M3108l6562K4346p312K3752J5970P5L6113k6065m179M7247
$$ 13565 27071 3767 46875 10313 34659 27347 51099 67069 67144 103257 77192 73013 120260
20886A20260m607m7412J122k6545k7246j4212K9957j9092J7398P3319k4440m548
$$ 120260 115653 68241 69363 42818 15572 1360 31317 12225 29623 102942 78502 73954
20874G3954j753n8919K4464L1538j9446m9282l4680L4544L2142O476l475j4784
$$ 73954 72201 13282 37746 69284 49838 556 -34124 420 32562 39038 35563 20779
20862B0779P137M1948J9826k6170m3081Q369L9725m2147m2481k3593m5326l1318
$$ 20779 27916 69864 89690 63520 20439 28808 68533 26386 -16095 -39688 -85014 -116332
20850a16332N1270N7105J4069N6596j1825n2183m1364j229M8784k2595R29L2774
$$ -116332 -65062 -7957 6112 62708 50883 -1300 -42664 -43893 4891 -17704 -16775 15999
20838A5999l4972k5024k1196M2994L5227j3320K9064J466n8485K5246L7405J7734
$$ 15999 -18973 -43997 -65193 -22199 13028 -292 28772 30238 -28247 -3001 34404 52138
20826E2138r895K8162l5465l0023J5335J4105j6101l1900K9406N4300P131m5751
$$ 52138 42243 70405 34940 4917 20252 34357 18256 -13644 15762 70062 77193 31442
20814C1442J6972K6761r801j7512k6085m6600M8031n0193K2836n875L0710o244
$$ 31442 48414 75175 65374 47862 21777 -24823 23208 -26985 -4149 -10024 20686 14442
20802A4442L3304Q430l0387L4963L3951k3509j3066j7697j5070o786K21r6393
$$ 14442 47746 56176 25789 60752 94703 71194 58128 40431 25361 18575 18796 -77597
20790g7597l598L0142M6042N2375J8006j3188j6962N8410L9603j0538l2634k4142
$$ -77597 -81195 -51053 -5011 47364 65370 52182 35220 93630 133233 122695 90061 65919
20778F5919k3715q479p642N1288P1584K1026j6566o2443o8080l1470P6249M5532
$$ 65919 42204 33725 26083 77371 148955 169981 153415 90972 22892 -8578 67671 113203
20766A13203L6137K9299m1822L5967q553n3566O0426L8154m5661O150k5498K9069
$$ 113203 149340 178639 136817 172784 164231 110665 171091 209245 163584 169734 144236 173305
20754A73305P4194R6663J2461q5639j070N5454M8277P827l3057k0666j590k5415
$$ 173305 247499 344162 356623 270984 269914 325368 373645 381472 348415 327749 326159 300744
20742C00744p753L0382K2016J0016M6544K0705K6851J59139J88680K56613L03970
$$ 300744 292991 323373 345389 355405 401949 422654 449505 608644 797324 1053937 1357907
20731A357907L13946L43898L90921M64859N42186M16382L48414K65019J58122
$$ 1357907 1671853 2015751 2406672 2871531 3413717 3830099 4178513 4443532 4601654
20722D601654K282k00472l21492l48006m00023n45454n88940m77630l08199k67825
$$ 4601654 4603936 4403464 4081972 3733966 3333943 2788489 2199549 1721919 1413720 1145895
20712A145895l18114j61742p4013j02052j01776M792k3994n252L0351k9252q0869
$$ 1145895 827781 666039 592026 489974 388198 392990 368996 363744 394095 364843 283974
20701B83974Q439L0485m2311j9408M2751r172j2989l8394K1717J9952o2487L498
$$ 283974 292413 322898 280587 261179 303930 294758 281769 243375 265092 285044 222557 226055
20689B26055M6870N2429R509N142M4587K7124p328M4095J5801M9411O2055R8269
$$ 226055 272925 325354 334863 340005 384592 411716 404388 448483 464284 513695 575750 674019
20677F74019K04978K13704J91326J93683K08013K85572K32194N5084p2047m1655
$$ 674019 878997 1092701 1284027 1477710 1685723 1971295 2203489 2258573 2186526 2144871
20667B144871J3639j886j31465k57851k85496j31722j21222j75252j75517j50987
$$ 2144871 2158510 2156624 2025159 1767308 1481812 1350090 1228868 1053616 878099 727112
20657G27112j22481j21035q6785j6895m4331m132L3092J5864R3779N6237P0090
$$ 727112 604631 483596 396811 379916 335585 331453 364545 380409 474188 530425 600515
20646F00515P5934J40025J37335J33237J99355K32158K83352K83539J82243L9409
$$ 600515 676449 816474 953809 1087046 1286401 1518559 1801911 2085450 2267693 2307102
20636B307102j23989m1690L8905j8438j90113k88924k84327j65621r2987k27275
$$ 2307102 2183113 2141423 2180328 2161890 1971777 1682853 1398526 1232905 1139918 912643
20626I12643k59061k13186j24917r4242n750k5847j1132J170K0486k1021k6244
$$ 912643 653582 440396 315479 221237 215487 189640 178508 179678 200164 179143 152899
20615A52899j9954n0062k0260K9865J0893j200o594J0349N2078K6882n034N7467
$$ 152899 132945 82883 62623 92488 103381 102181 95587 105936 158014 184896 179862 237329
20603B37329l4837n5979k084l2132p953j8042J987j6302M33P657R547m9558P487
$$ 237329 202492 146513 144429 112297 104344 86302 88289 71987 72420 80077 89624 40066 47553
20590D7553K0187K4433l2290n6265j9103j9684J4224O7775M980l2969R014j6972
$$ 47553 67740 92173 59883 3618 -15485 -35169 -20945 46830 51810 18841 27855 10883
20578A0883K1955J0058M4855Q686k9945l6367M4351m2627k9284K6358J4032k0445
$$ 10883 32838 42896 87751 96437 66492 30125 74476 31849 2565 28923 42955 22510
20566B2510k9667o179N101J6762n8872l5439K3026j864J6481J3256r539k5607
$$ 22510 -7157 -13336 -8235 8527 -50345 -85784 -62758 -64622 -48141 -34885 -44424 -70031
20554g0031P4314N5668k5365m8166j3843L926N0935N7684k9488m7706l6859K3182
$$ -70031 4283 59951 34586 -13580 -27423 -23497 27438 85122 55634 7928 -28931 -5749
20542e749L8140J7583n7219k9595J5702M494L1948J9482j3218o16k1821n0397
$$ -5749 32391 49974 -7245 -36840 -21138 -16644 15304 34786 21568 20952 -869 -51266
20530e1266m2173O3118J4852Q660K4289J859m5980K920L6958L8211K2455J0286
$$ -51266 -93439 -30321 -15469 -6809 17480 19339 -26641 -23721 13237 51448 73903 84189
20518H4189K5871l020L777m3859k5505j3534J756O1294k5720p0376j9073J6282
$$ 84189 110060 107040 110817 66958 41453 27919 29675 90969 65249 -5127 -24200 -7918
20506g918m5390j0753L8622L1524L5794O0284k4546l41O580n1025j2172M2066
$$ -7918 -53308 -64061 -25439 6085 41879 102163 77617 77276 83856 32831 20659 62725
20494F2725M5279j3992k0096Q703j4666m0891k9269K0566L0467k648K8338m5314
$$ 62725 108004 94012 73916 82619 67953 27062 -2207 18359 48826 46178 74516 29202
20482B9202k0052l803M2551K0557R2573M4535l8180p302q139n102J3431j3960
$$ 29202 9150 5347 47898 68455 161028 205563 167383 160081 151942 146840 160271 146311
20470A46311p8272p9039j1269k2104L4088J0293q291o7523l2569J6384P0586P3578
$$ 146311 68039 -11000 -22269 -44373 -10285 8 -8283 -75806 -108375 -91991 -21405 52173
20458E2173m1990O674K9513J5363k6121k5034L383j1746J8684k3419L2833J6514
$$ 52173 10183 16857 46370 61733 35612 10578 13961 2215 20899 -2520 30313 46827
20446D6827k614M5829r687K6660J4725m4205m0223p3385k5662O6111K4991m233
$$ 46827 44213 90042 80355 107015 121740 77535 37312 -36073 -61735 4376 29367 25134
20434B5134K0053O8890l1215n161r297J3967K1019o495j1694j5966P035p2077
$$ 25134 45187 114077 82862 77701 68404 82371 103390 96895 85201 69235 76270 4193
20422D193m4213K5243o973j7618M2979K4390n4348q33O9208O1230k4785n1620
$$ 4193 -40020 -14777 -21750 -39368 3611 28001 -26347 -27180 42028 103258 78473 26853
20410B6853p4548L9258J7230N5014J3988l5593K2999j7954j2474N675L5666J1162
$$ 26853 -47695 -8437 8793 63807 77795 42202 65201 47247 34773 40448 76114 87276
20398H7276o4247m4678J2429O1546j5433K2807L9406j0664p7123k4405N0061O6677
$$ 87276 23029 -21649 -9220 52326 36893 59700 99106 88442 11319 -13086 36975 103652
20386A03652J1466k8144m9438m5705q580k3588J9550k7496J6342M1573L4738L6427
$$ 103652 115118 86974 37536 -8169 -16749 -40337 -20787 -48283 -31941 9632 44370 80797
20374H0797j2453p2901j8106P930J4212J7591O6026l373l8516l8086O088k8910
$$ 80797 68344 -4557 -22663 -14733 -521 17070 83096 79723 41207 3121 9209 -19701
20362a9701k6443K7724L8567n9494J1007N216R4185j6688M6646m4251k7405N0714
$$ -19701 -46144 -18420 20147 -39347 -28340 -23124 71061 54373 101019 56768 29363 80077
20350H0077q863l6648o0538M5309M4189k5114k1420l595m288P768K4408K8203
$$ 80077 71214 34566 -25972 19337 63526 38412 16992 13397 9109 16877 41285 69488
20338F9488J3832J0464k585m4806p499L5387K3544l4954j9890J4901n3603q060
$$ 69488 83320 93784 91199 46393 38894 74281 97825 62871 42981 57882 4279 -3781
20326c781P4456K0989k7227n351J671N5990k8571k1880k164L4163K2773J8326
$$ -3781 70675 91664 64437 59086 60757 116747 88176 66296 64132 98295 121068 139394
20314A39394p2670J3977J0950l9849m53j1450j7159L1233M4401p3093k4219r524
$$ 139394 66724 80701 91651 51802 51349 39899 22740 53973 98374 25281 1062 -8462
20302h462K4309K2341M8442P6383J4514p3772O001O9289k2655l0670m2039m9287
$$ -8462 15847 38188 86630 163013 177527 103755 109756 179045 156390 125720 83681 34394
20290C4394J0112l5599k7187Q4942J2510k3225k1297l5766p90O7405J7587P886
$$ 34394 44506 8907 -18280 66662 79172 55947 34650 -1116 -1906 65499 83086 90972
20278I0972K3625j8901k6360L8148m5291l4979j8577j3563J3247M0421m8814r489
$$ 90972 114597 95696 69336 107484 62193 27214 8637 -4926 8321 48742 -72 -9561
20266i561M0534K3951M440l5958N204K4888J9282M5125m46R90P122q537o1485
$$ -9561 30973 54924 59364 23406 28610 53498 72780 117905 117459 118449 125571 117034 55549
20253E5549k2895o1504K3487M3270J4537j4022L0109m2961K270k5095L6613J8159
$$ 55549 32654 -28850 -5363 37907 52444 38422 68531 25570 27840 2745 39358 57517
20241E7517j5248j5047J1598J1042K6557j5368j1927P5406k550o3321o7358m1355
$$ 57517 42269 27222 38820 49862 76419 61051 49124 124530 121980 58659 -8699 -50054
20229e0054J6652N8752N7766N771J4666J9858k0791l5819J9394L2422N662l7410
$$ -50054 -33402 25350 83116 88887 103553 123411 102620 66801 86195 118617 124279 86869
20217H6869J3438N8508L4006k778K8409J7107j1713l5035n8334n1816j6406J2913
$$ 86869 100307 158815 192821 190043 218452 235559 223846 188811 130477 78661 62255 75168
20205G5168J1088M4892R570j6027M3848N5930j3277l692k3395K5707J9163J3256
$$ 75168 86256 131148 140718 124691 168539 224469 211192 207500 184105 209812 228975 242231
20193B42231P7745J27766O1748N0268R8999J62911K07398J91951J99152J42214
$$ 242231 319976 447742 509490 559758 658757 821668 1029066 1221017 1420169 1562383
20183A562383J40574N5225J907j7542q5937j16311j62589k10832k49182j68035
$$ 1562383 1702957 1758182 1760089 1742547 1656610 1540299 1377710 1166878 917696 749661
20173G49661j34203o5588q6030q6685n1692j1757n1086j14608l9411J0981K5531
$$ 749661 615458 549870 463840 377155 325463 313706 262620 148012 108601 119582 145113
20162A45113r31N4780n477K684l482J7247r4091m5633k0250N3904L0484j5883
$$ 145113 144182 198962 193485 196169 192687 209934 115843 70210 49960 103864 134348 118465
20150A18465o0717l3774k0281L9936J13381J098q072m269k000j9882J5281l869
$$ 118465 57748 23974 3693 43629 157010 158108 150036 145767 143767 123885 139166 135297
20138A35297M4597M3472l7318m9769J8152l7200j2602K203K195M0860j716l9000
$$ 135297 179894 223366 186048 136279 154431 117231 104629 106832 109027 149887 148171 109171
20126A09171L9193J574k2654k5346L991P350p277k1983K5947R392m6262O8776
$$ 109171 148364 149938 127284 101938 105929 113279 106002 84019 109966 119358 73096 141872
20114A41872J0K3458l5958r5998J4532L5072k7449q596J6581O6805N1799n686
$$ 141872 141882 165340 129382 33384 47916 82988 55539 46943 63524 130329 182128 176442
20102A76442m0975n4366k5287l3100J1550Q606J3281J192j7859N280j064J3364
$$ 176442 135467 81101 55814 22714 34264 42870 56151 57343 39484 44764 43700 57064
20090E7064m214J3659n258m8208K0234K3669J3244R418K515j7680K3680K224j0522
$$ 57064 52850 66509 61251 13043 33277 56946 70190 79608 82123 64443 88123 90347 79825
20077G9825j3819j3376O325M820K383j8654l499k949k053L656J0141j1759r005
$$ 79825 66006 52630 58955 63775 66158 47504 44005 41056 39003 42659 52800 41041 32036
20064C2036K5557J4985K7138J0265L5910r870J329k8467j9401L5880P081Q004
$$ 32036 57593 72578 99716 109981 145891 136021 137350 108883 89482 125362 132443 140447
20052A40447j8338K6578l8959j5112J2523M5321K2860J7578J097l8443K5241L1441
$$ 140447 122109 148687 109728 94616 107139 152460 175320 192898 193995 155552 180793 212234
20040B12234k6926j534P482R749l7249o2456m5079n699O5681j8281j5241J0172
$$ 212234 185308 183774 191256 201005 163756 101300 56221 50522 116203 97922 82681 92853
20028I2853l8978l1972m324M1068J5099J5234J9215l5431L0851K5922j0912j8258
$$ 92853 53875 21903 17579 58647 73746 88980 108195 72764 103615 129537 118625 100367
20016A00367n4287n5971R171N7413O3903K3438j9033J016M3416J0280J061N0521
$$ 100367 46080 -9891 -720 56693 120596 144034 125001 126017 169433 179713 180774 231295
20004B31295k1041p1887k5574J6581M193K143m3321O873L9574N2886J6078K1332
$$ 231295 210254 138367 112793 129374 133567 135710 92389 99262 138836 191722 207800 229132
19992B29132n6282n4998N8024J8819J8963m511l3301L9516J12950R0987J01682
$$ 229132 172850 117852 175876 194695 213658 209147 175846 215362 328312 419299 520981
19981E20981J10233P6375P3125M8003L6026l6720m3582j4934j3218J3080m3394
$$ 520981 631214 707589 780714 828717 864743 828023 784441 769507 756289 769369 725975
19970G25975n4442q5039m6495q4533k8328j0909j0797p729l2528n6255n8445K0569
$$ 725975 671533 586494 539999 455466 427138 416229 405432 397703 365175 308920 250475 271044
19958B71044O2526p069o114P7210M7485l0885J653J7322L2709L3825Q8730J66421
$$ 271044 333570 326501 320387 397597 445082 414197 415850 433172 465881 499706 588436 754857
19946G54857P8442j3770j696m0137L605L1492O9153k4479j07928q7180o9633r6249
$$ 754857 833299 819529 817833 777696 781301 812793 881946 857467 749539 662359 592726 496477
19934D96477j08535p636k091k1860J3270l0144k1712r4119k1813l9333m3367O1996
$$ 496477 387942 380306 378215 356355 369625 339481 317769 223650 201837 162504 119137 181133
19922A81133M3539K4705K6302m1691J1345R268j0329K0810q305r944O6403l3981
$$ 181133 224672 249377 275679 233988 245333 254601 244272 265082 256777 246833 313236 279255
19910B79255m5288j3758q50j5979l5557n8221k5659L9767N2604K1947k4849K0138
$$ 279255 233967 220209 219359 203380 167823 109602 83943 123710 176314 198261 173412 193550
19898A93550l3341j3985M0086m4427J9788M9686M6532J4682o634n4092J6269K0618
$$ 193550 160209 146224 186310 141883 161671 211357 257889 272571 265937 211845 228114 248732
19886B48732l4485j1958J5658K0607O335M4382m5992l5202J8788M7682N0306M9453
$$ 248732 214247 202289 217947 238554 244889 289271 243279 208077 226865 274547 324853 374306
19874C74306k3058M1684L1436J617O3191K4193k9929k7332o4124n5698q560K0177
$$ 374306 351248 392932 424368 425985 489176 513369 483440 456108 391984 336286 327726 347903
19862C47903o0950q5722m0787l0604Q2408P0322K1650k1123k0177m1436o0934
$$ 347903 286953 201231 160444 129840 212248 282570 304220 283097 262920 221484 160550
19851A60550l6176O2003N7873N722j6029N660j6855J2138k5019l9113l2127K1487
$$ 160550 124374 186377 244250 249972 233943 239603 222748 234886 209867 170754 138627 160114
19839A60114N4064J1649k763M8123j0655R443j8635K0163M250J0937m3857J5435
$$ 160114 214178 225827 223064 271187 260532 269975 251340 271503 275753 286690 242833 258268
19827B58268M1593p083j5202j4050K7333j6453n4782r5549o9042j7732K425J6583
$$ 258268 299861 292778 277576 263526 290859 274406 219624 124075 55033 37301 39726 56309
19815E6309K3367N2610K2518j9788O4408K4640k5593J4789l3871l2235L3625P1599
$$ 56309 79676 132286 154804 135016 199424 224064 198471 213260 179389 147154 180779 252378
19803B52378L7266j680p0789N953p252L9338j0619k1079l1271j6803P8307O7890
$$ 252378 289644 287964 217175 223128 215876 255214 244595 223516 192245 175442 253749 321639
19791C21639q14m1907L6388L3406K7845K099K8299l970J6171R284L0171N6035
$$ 321639 320825 278918 315306 348712 376557 378656 406955 402985 419156 428440 458611 514646
19779E14646o876J4312j4536n5563m7711K9613O3691L6882m6522n309l6855k587
$$ 514646 507770 522082 507546 451983 404272 433885 497576 534458 487936 482627 445772 443185
19767D43185K9090j5983n4101O9030J3141k912M2450m41r259K1267j9998n9391
$$ 443185 472275 456292 402191 471221 484362 481450 523900 523459 514200 535467 515469 456078
19755D56078q6671K6084N8525J325q603r175m1668Q778J5616J04636N1829K0359
$$ 456078 369407 395491 454016 455341 446738 437563 395895 404673 420289 524925 576754 597113
19743E97113J7584M1213K5427k4259M8306K7234L9184j9411n4647r901N7716l0239
$$ 597113 614697 655910 681337 657078 705384 732618 771802 752391 697744 687843 745559 715320
19731G15320l8731l4576n4445K9641K4067L8812k3752J6031J9906M542k6836j8068
$$ 715320 676589 642013 587568 617209 641276 680088 656336 672367 692273 696815 669979 651911
19719F51911P5063Q525k643k6180O6283P0594l1267q1171J1625P6702Q1287K5559
$$ 651911 726974 735499 732856 706676 772959 843553 812286 731115 742740 819442 900729 926288
19707I26288j4445J2549j779L9321L4448J3507o511J8538N8950O1780K5438J6459
$$ 926288 911843 924392 922613 961934 996382 1009889 1003378 1021916 1080866 1142646 1168084 1184543
19695A184543j9715J0730r08R0367J11658J3377M1434m006N7961K2936N5352M3212
$$ 1184543 1164828 1175558 1174650 1265017 1376675 1390052 1431486 1427480 1485441 1508377 1563729 1606941
19683A606941N9782P6034O2921O9344K1503K2352R5172Q2637K8997K9389J02608
$$ 1606941 1666723 1742757 1805678 1875022 1896525 1918877 2014049 2096686 2125683 2155072 2257680
19672B257680N6743Q7207N7794J26489J49591J10441J08473J43879J83582K75442
$$ 2257680 2314423 2401630 2459424 2585913 2735504 2845945 2954418 3098297 3281879 3557321
19662C557321L10059L60272M02590M73010M40614L85222M07666M06986L26132
$$ 3557321 3867380 4227652 4630242 5103252 5543866 5929088 6336754 6743740 7069872
19653G069872K68033K39749K40672K82264L73064L40713M36460N20924N87698
$$ 7069872 7337905 7577654 7818326 8100590 8473654 8814367 9250827 9771751 10359449
19644A0359449P87227Q87987R18605J062996J279257J468172J621898J869651
$$ 10359449 11146676 12034663 12953268 14016264 15295521 16763693 18385591 20255242
19636B0255242K219456K631025L329791M163276N389327P066595R430581J2689534
$$ 20255242 22474698 25105723 28435514 32598790 37988117 45054712 54485293 67174827
19628F7174827J6903018K1988335K7059925L1354029L4476508L5094461L2009428
$$ 67174827 84077845 106066180 133126105 164480134 198956642 234051103 266060531
19621B66060531K5635880J6906911N989115o614856j8351295k7045767l2800432
$$ 266060531 291696411 308603322 314592437 307977581 289626286 262580519 229780087
19614B29780087l5900590l5685580l2160559k7001557k1847226j6804122j2220093
$$ 229780087 193879497 158193917 126033358 99031801 77184575 60380453 48160360
19607D8160360q812816o489408m790768l716139k914281k363546j884564j545579
$$ 48160360 39347544 32858136 28067368 24351229 21436948 19073402 17188838 15643259
19599A5643259j402379j152272j057934r79020q99564p95779o98069o14066n09838
$$ 15643259 14240880 13088608 12030674 11051654 10152090 9356311 8658242 8044176 7534338
19590G534338m03682k63267k19721k37240j82197j95569j93235j73443k43363
$$ 7534338 7130656 6867389 6647668 6410428 6228231 6032662 5839427 5665984 5422621
19581E422621l24750l91179m22230m31603m26399l51806l27379k00775j94600
$$ 5422621 5097871 4706692 4284462 3852859 3426460 3074654 2747275 2546500 2351900
19572B351900j34971j62039j14358q3217o2893j05566j12422j48122n6514l7265
$$ 2351900 2216929 2054890 1940532 1857315 1794422 1688856 1576434 1428312 1371798 1334533
19562A334533r1794p1770k5803k0171k7164j0284P045K5088K3358j4788m0783
$$ 1334533 1242739 1170969 1145166 1124995 1097831 1087547 1094592 1119680 1143038 1128250 1087467
19551A087467r2334J0953O856J6905n3530k7386k7496p7250j2286j8066j00172
$$ 1087467 995133 1006086 1012942 1029847 976317 948931 921435 844185 831899 813833 713661
19540G13661j9928N6251m7780k8809q53l7373k6548K4759L6268L5567L094P468
$$ 713661 693733 749984 702204 673395 672542 635169 608621 633380 669648 705215 708309 715777
19528G15777l4142k2345p3288J7511N687O7406K7547J2119k566j5635J1911J09
$$ 715777 681635 659290 586002 603513 609200 676606 704153 716272 713706 698071 709982 710091
19516G10091P9589M0596J9698Q699j0212j9183q4487o7573Q636M2905j1065n8409
$$ 710091 789680 830276 849974 858673 848461 829278 744791 677218 685854 728759 717694 659285
19504F59285k7059o518l250K6486R540l1069K2718p920O1522Q5670j5356j0170
$$ 659285 632226 625708 622458 648944 658484 627415 650133 642213 703735 789405 774049 763879
19492G63879M9575J1848K1026k079M4898K9985p1573J0830K8335J0716M0141k0369
$$ 763879 813454 825302 846328 844249 889147 919132 847559 858389 886724 897440 937581 917212
19480I17212o6534q142K3408j4219P186k1504L3278M6925o6838J5987K0283L4943
$$ 917212 850678 842536 865944 851725 858911 837407 870685 917610 850772 866759 887042 921985
19468I21985O8472P3937N1047n6926J9214R859m3206K3609R7735K7719N6220j37
$$ 921985 990457 1064394 1115441 1058515 1077729 1087588 1044382 1067991 1165726 1193445 1249665 1249528
19456A249528O3132Q0397l3529m2914N3925J15919K00033Q5228l5582L4785Q7901
$$ 1249528 1312660 1393057 1359528 1316614 1370539 1486458 1686491 1771719 1736137 1770922 1858823
19445A858823R0968P9495P9824R9220J37035J44830J97298J77620K03598K98528
$$ 1858823 1949791 2029286 2109110 2208330 2345365 2490195 2687493 2865113 3068711 3367239
19435C367239K90797K02633J66515K69216K48720K65348K81575K08465K06703
$$ 3367239 3658036 3860669 4027184 4296400 4545120 4810468 5092043 5300508 5507211
19426E507211J90924K60998L19318K44907K91522K88323K93490M04450N02954
$$ 5507211 5698135 5959133 6278451 6523358 6814880 7103203 7396693 7801143 8304097
19417H304097O03987P73811J003046J180237J469647J931628K513529L426223
$$ 8304097 8908084 9681895 10684941 11865178 13334825 15266453 17779982 21206205
19409B1206205M558911N988132P573540Q801211R145685Q490601Q036506R091436
$$ 21206205 25765116 31753248 39326788 48127999 57273684 65764285 73800791 82892227
19401H2892227J1658249J3479244J0967779M401171j815467l496384k79172K596219
$$ 82892227 94550476 108029720 118997499 123398670 121583203 118086819 117807647 120403866
19393A20403866L8597o978269j3198439j4324254j0903164p388384o398867p404750
$$ 120403866 120442463 113464194 100265755 85941501 75038337 67649953 61251086 53846336
19385E3846336q130556p436869n482126l515069j916505o13856O54398J845448
$$ 53846336 45715780 38278911 32796785 29281716 27365211 26751355 27405753 29251201
19377B9251201L215347M825362O449695Q091653R066295Q752253Q063344Q464964
$$ 29251201 32466548 37291910 43741605 51833258 60899553 69651806 77715150 86180114
19369H6180114J0793229J3304847J2400585O459384p21219m142066j990678J653425
$$ 86180114 96973343 110278190 122678775 129138159 128416940 124274874 122284196 123937621
19361A23937621R56705n391882j2676393j5812200j3354159r237049p360861p987983
$$ 123937621 124894326 119502444 106826051 91013851 77659692 68422643 61061782 53073799
19353E3073799r171363r096380p508864n523209l953346k918059k140414j606276
$$ 53073799 43902436 34806056 27297192 21773983 17820637 14902578 12762164 11155888
19345A1155888j264244j043111p92090o68054n65826m66716l49221l24391k52794
$$ 11155888 9891644 8848533 8056443 7388389 6822563 6355847 6006626 5682235 5429441
19336E429441k49796j99763j75421k01239j65512j69616j71422k20177j88689
$$ 5429441 5179645 4979882 4804461 4603222 4437710 4268094 4096672 3876495 3687806
19327C687806k08189j31388j72617j89059j65133j92003k72236k13217j89438
$$ 3687806 3479617 3348229 3175612 2986553 2821420 2629417 2357181 2143964 1954526
19318A954526j65262j73953j32859j01931j44052n0568r1704n4985o5066j09715
$$ 1954526 1789264 1615311 1482452 1380521 1236469 1185901 1094197 1039212 974146 864431
19308H64431j7969o5682j057k1305L324N0708N2213m5992o8210k6813n078o146
$$ 864431 846462 780780 779723 758418 761742 812450 864663 818671 750461 723648 718570 712424
19296G12424J2345O596m4156q9083q5695k0125l547q761j2371P2390q36q6935
$$ 712424 724769 731365 687209 598126 512431 492306 488759 479998 467627 540017 539181 452246
19284D52246q5801n8255m4551L773O6652k2773l7794j3465K506L5704k1100j1041
$$ 452246 366445 308190 263639 267412 334064 311291 273497 260032 262538 298242 277142 266101
19272B66101J07657L913p3548m3451P6772N5632j4456o5112l6848J9868q565J2540
$$ 266101 373758 377671 304123 260672 337444 393076 378620 313508 276660 296528 287963 300503
19260C00503P726J322k4696O102J368r2589k2946K9205l6245n203J0379m8607
$$ 300503 308229 309551 284855 290957 292325 199736 176790 205995 169750 164547 174926 126319
19248A26319L5080J6443j5797l7351k906j73K5057L0003O343l3377J2314L3988
$$ 126319 161399 177842 162045 124694 121788 121615 146672 176675 183018 149641 161955 195943
19236A95943K6489m5106m5873k8381n6209l0055J9077O646N0808Q670k2795l9596
$$ 195943 222432 177326 131453 103072 46863 16808 35885 42531 93339 102009 79214 39618
19224C9618N9371M2932l7389m8886n217L3049L8727l3030k8016L50L6662n4267
$$ 39618 98989 141921 104532 55646 50429 83478 122205 89175 61159 61509 98171 43904
19212D3904J1715j0634q4112J084j588o3519J3265J6704m138M5149K6015n5391
$$ 43904 55619 44985 -39127 -38043 -39631 -103150 -89885 -73181 -77319 -32170 -6155 -61546
19200f1546N1886L3239r050K0819J8741q452k3515m685J488k2510m668P3637P8534
$$ -61546 -9660 23579 14529 35348 54089 45637 22122 17437 18925 -3585 -8253 65384 143918
19187A43918L2424P508o9620m3551k7244j3392m613J395q560O1996N4645Q599
$$ 143918 176342 183850 114230 70679 43435 30043 25430 26825 18265 80261 134906 143505
19175A43505n0470k4555p5793K2359l3206k5059J5945J2468J9144j2195M3978
$$ 143505 93035 68480 -7313 15046 -18160 -43219 -27274 -14806 4338 -7857 36121
19164C6121M313n515N3433n340k5820L3002K7310J164l0030j5945N273q4727p175
$$ 36121 40434 34919 88352 83012 57192 90194 117504 118668 88638 72693 77966 -6761 -13936
19151a3936P5698L200p3041r5979q761M0991J25802N0533m4236j4359o9713j4358
$$ -13936 61762 64962 -8079 -104058 -112819 -71828 53974 104507 60271 45912 -23801 -38159
19139c8159K7313Q306O1829R181j6140k0890o3959o9946J6112M0955m293j1718
$$ -38159 -10846 -2540 59289 68470 52330 31440 -32519 -102465 -86353 -45398 -49691 -61409
19127f1409K8433J8506n021l358o3415M885N3995j3372k6593K606M2813l3842
$$ -61409 -32976 -14470 -19491 -22849 -86264 -81379 -27384 -40756 -67349 -64743 -21930 -55772
19115e5772M971N7847L2309K3536N2974l8570q5970m509P184m255n486l4471K6827
$$ -55772 -50801 7046 39355 62891 115865 77295 -8675 -13184 -6000 -10255 -15741 -50212 -23385
19102b3385K6690q638N8599Q737o0140l5759j2633p474M7496J5872K3724n616
$$ -23385 3305 -5333 53266 62003 1863 -33896 -46529 -54003 -6507 9365 33089 27473
19090B7473J6915L4997N312p8273J2183Q0558R038J4192M4080p8962q0311M701
$$ 27473 44388 79385 84697 6424 18607 99165 108203 122395 166475 87513 7202 11903
19078A1903R868L2058k9053J5576M7768k176j6817p3840L460L7577J5412J4901
$$ 11903 21771 53829 24776 40352 88120 85944 69127 -4713 -1253 36324 51736 66637
19066F6637L0118R1256K8032j2115n7228O8315J69021J33468J51322J69654J91159
$$ 66637 96755 188011 216043 203928 146700 215015 384036 517504 668826 838480 1029639
19055A029639K10644J58008J71943J19090M7187m8128o9051j02714k23501j51693
$$ 1029639 1240283 1398291 1570234 1689324 1736511 1688383 1619332 1516618 1293117 1141424
19045A141424j60224j63233j33932j56477j75378j39396q2412N8672M7509k4956
$$ 1141424 981200 817967 684035 527558 352180 212784 130372 189044 236553 211597
19035B11597n6328l2044n5057o600P8795l5150J114o68k1877j1904j2235K2405
$$ 211597 155269 123225 68168 61568 140363 105213 106327 105659 83782 71878 59643 82048
19023H2048M0945k2926k3766m0069l1428Q666J9942M5312J8497Q5775k1764m1348
$$ 82048 122993 100067 76301 36232 4804 13470 33412 78724 97221 182996 161232 119884
19011A19884p8782j4202l1653k873n4253j043K2945j7794q371m058m202l2009
$$ 119884 41102 26900 -4753 -7626 -61879 -62922 -39977 -57771 -66142 -70200 -74402 -106411
18999a06411n1582L634l6307K7186K2420m2905j8115j6720L5757l740r532J1864
$$ -106411 -157993 -154359 -190666 -163480 -141060 -183965 -202080 -218800 -183043 -186783 -196315 -184451
18987a84451R8592J02975n1366m6836P6931K3879n1690o4197L0405k487j6625
$$ -184451 -85859 17116 -34250 -81086 -4155 19724 -31966 -96163 -65758 -68245 -84870
18976h4870L486j5879J9905O4002K1041n0023J7235M4587K9590M4077j3618o8018
$$ -84870 -81384 -97263 -77358 -13356 7685 -42338 -25103 19484 49074 93151 79533 11515
18964A1515J780j7437k3374L4153K1425n2968j9051P967l3168p629n277O935R94
$$ 11515 13295 -4142 -27516 6637 28062 -24906 -43957 -35990 -69158 -76787 -82064 -75129 -74135
18951g4135n1912k1839k4017K9907J05211Q1426L119k3177l6915L2153N44j4456
$$ -74135 -126047 -147886 -171903 -141996 -36785 44641 47760 24583 -12332 19821 20365 5909
18939E909o006k7229j4547m815m0891K2959M2179j7399j3782j5542M8575K9709
$$ 5909 -97 -27326 -41873 -46688 -87579 -64620 -22441 -39840 -53622 -69164 -20589 9120
18927I120r280j0576L6371O2444J1134m2365m2413N1816J6394k9698m6211m2510
$$ 9120 -160 -10736 25635 88079 99213 56848 14435 66251 82645 52947 6736 -35774
18915c5774N7295p051o8925m401K033L2252J1489M02k906K462q659K7753j0834
$$ -35774 21521 14470 -54455 -58856 -56823 -24571 -13082 -12680 -15586 -13124 -21783 5970 -4864
18902d864j5605p413J5186K048Q8046l0983l8646j0399j0707n541n0052J5766
$$ -4864 -20469 -27882 -12696 -10648 77398 46415 7769 -2630 -13337 -18878 -68930 -53164
18890e3164j7837r1532L479N385J3636L371J0276P4559M4576L9459P407l0351
$$ -53164 -71001 -162533 -159054 -153669 -140033 -136662 -126386 -51827 -7251 32208 39615 9264
18878I264n6421K0870N9834K812L0449k2092m7097J372K7638k3928j8521M5208
$$ 9264 -47157 -26287 33547 36359 66808 44716 -2381 -1009 26629 2701 -15820 29388
18866B9388N2398o4577j36524j4366j2030K6349J3137l816L6163J05741j5881
$$ 29388 81786 17209 -119315 -133681 -145711 -119362 -106225 -110041 -73878 31863 15982
18855A5982M604R522o8209n9831k3821K7333N350p204m1614M6176K2465j0291
$$ 15982 20586 30108 -38101 -97932 -121753 -94420 -89070 -96274 -137888 -91712 -69247 -79538
18843g9538j0869O3669L539l3014l2500L6557N7037k7046l1728l7492J6459j413
$$ -79538 -90407 -26738 -23199 -56213 -88713 -52156 4881 -22165 -53893 -91385 -74926 -76339
18831g6339J3339L5858N7597m6k9380L9498J6813M3896M7465J5252M7979Q8004
$$ -76339 -63000 -27142 30455 30409 1029 40527 57340 101236 148701 163953 211932 299936
18819B99936O6315k952N4684O0576O5639M2093j9411m6977q988K9868M3716k0883
$$ 299936 366251 363299 417983 478559 544198 586291 566880 519903 510915 540783 584499 563616
18807E63616m8863r0337r8347l74n3504k8701J9543l6105l1553k3113o8817n7983
$$ 563616 514753 424416 326069 325695 272191 243490 263033 226928 195375 172262 103445 45462
18795D5462L9983o252m3101K8940M8674r726N189O5042J04129N7625l0894N9467
$$ 45462 85445 79193 36092 65032 113706 103980 109169 174211 278340 335965 305071 364538
18783C64538J49990J30995L7925J6401p897m7948q355k2289l7440K6589k3959
$$ 364538 514528 645523 683448 699849 691952 644004 635649 613360 575920 602509 578550
18772E78550o0908l4224J6055J08902J0289j8272M2732q4537j80925j08225m9347
$$ 578550 517642 483418 499473 608375 618664 600392 643124 558587 377662 269437 220090
18761B20090p1100l7729K3743j8096m2774m3374P21M0997L6872M3075m1471l5549
$$ 220090 148990 111261 135004 116908 74134 30760 31481 72478 109350 152425 110954 75405
18749G5405l0228R5384O1740l0284r7695o9679J0174p3889k0107L4676N0383J1595
$$ 75405 45177 140561 202301 172017 74322 4643 14817 -59072 -79179 -44503 5880 17475
18737A7475N0602K4428k3344l4936j4835J0778l4742j6493L619O9870J9330p354
$$ 17475 68077 92505 69161 34225 19390 30168 -4574 -21067 -17448 52422 71752 64398
18725F4398j8609K416L2307p837n7401j8458L6270J0911m21M4062M9351j6513
$$ 64398 45789 48205 80512 72675 15274 -3184 33086 43997 43576 87638 136989 120476
18713A20476L038o2107m9537J1496K7086o6812k8209K1259L0526M1399Q790m0597
$$ 120476 123514 61407 11870 23366 50452 -16360 -44569 -23310 7216 48615 57405 16808
18701A6808m3723o1117L0603P8982k5764j1319K6289l5376J0363P870m1504p292
$$ 16808 -26915 -88032 -57429 21553 -4211 -15530 10759 -24617 -14254 -6384 -47888 -55180
18689e5180L9976M0151k1227J7323K2563k6821K6262J0425n4173Q705K181M6842
$$ -55180 -15204 24947 3720 21043 43606 16785 43047 53472 -701 8004 10185 57027
18677E7027O4328L9054q116M3771J7854K8080j5553M4401Q2009J01160K14987
$$ 57027 121355 160409 152293 196064 213918 241998 226445 270846 352855 454015 669002
18666F69002K16454K73743K36424K94971K94737J89402J41771J71034J20196r779
$$ 669002 885456 1159199 1395623 1690594 1985331 2174733 2316504 2487538 2607734 2597955
18656B597955j29709k63595k04899j62980k92166l20488k15702j03436r5421r8893
$$ 2597955 2468246 2204651 1999752 1836772 1544606 1224118 1008416 904980 809559 710666
18646G10666k4988L5584N8676J07033P5089J14379Q9788N3256L76N0429N6910
$$ 710666 685678 721262 779938 886971 962060 1076439 1166227 1219483 1219859 1270288 1327198
18635A327198Q2034J10719J01155J00335J32638J44173K05677K03886J38045P6309
$$ 1327198 1409232 1519951 1621106 1721441 1854079 1998252 2203929 2407815 2545860 2622169
18625B622169L6862m5332j91774j97730k08730k80212l09720k08187j86047j53260
$$ 2622169 2659031 2613699 2421925 2224195 2015465 1735253 1425533 1217346 1031299 878039
18615H78039j03606j4637k0405M4652O4404M3114K2087J1049k8021k8476J0251
$$ 878039 774433 759796 739391 784043 848447 891561 913648 924697 896676 868200 878451
18604H78451l1439r2071j57440j19005n2511q0674p0316J3164n3558n9283k3997
$$ 878451 847012 754941 597501 478496 425985 345311 274995 288159 234601 175318 151321
18593A51321l1180j0454l6396k9578j3658k541L6621L2984j5707p4803n3133M3150
$$ 151321 120141 109687 73291 43713 30055 27514 64135 97119 81412 6609 -46524 -3374
18581c374M4997n952q8984j7770Q9460M3907l2998J1542K055K1126k5933o7591
$$ -3374 41623 35671 -53313 -71083 18377 62284 29286 40828 42883 64009 38076 -29515
18569b9515o2648k2087M983L2626K7200K5028N2003Q1331O28q0249p2635l2425
$$ -29515 -92163 -114250 -109267 -76641 -49441 -24413 27590 108921 109549 29300 -43335 -75760
18557g5760j0823K0884J2788K5749Q9272L2051m4873K2486o917j9568j604J2787
$$ -75760 -86583 -65699 -52911 -27162 62110 94161 49288 71774 64857 45289 43685 56472
18545E6472l3833N770N9508j3524k4015J442K6922l3360p0723l6495N5036J9668
$$ 56472 22639 28409 87917 74393 50378 51820 78742 45382 -25341 -61836 -6800 12868
18533A2868K2681N0000j7496j2368R327o0391K0065m1603l6624O485J5812n949
$$ 12868 35549 85549 68053 55685 65012 4621 24686 -16917 -53541 -47056 -31244 -37193
18521c7193Q831O9306k3056O688M9099q1237n9819K7627M8455N4220K7400p9785
$$ -37193 -28362 40944 17888 24576 73675 -7562 -67381 -39754 8701 62921 90321 10536
18509A0536k6370K1047J4141j3680j8825J6372l6951J7834P3862j6616n0171m8079
$$ 10536 -15834 5213 19354 5674 -13151 3221 -33730 -15896 57966 41350 -8821 -56900
18497e6900k5104j0402J4308M8255l0381l3159j9637J0170P1109K5687J094K0498
$$ -56900 -82004 -92406 -78098 -29843 -60224 -93383 -113020 -102850 -31741 -6054 -4960 15538
18485A5538L260p3351j6960J1291j8732L0516J507J1665O7106k0291m2785R269
$$ 15538 18798 -54553 -71513 -60222 -78954 -48438 -46931 -35266 31840 11549 -31236 -21967
18473b1967P652k2600k3796K7594K1777j0733o387j6631K8251O083J9753L1972
$$ -21967 -14315 -36915 -60711 -33117 -11340 -22073 -28460 -45091 -16840 -10757 8996 40968
18461D0968j3880k4611K0915Q551N2985Q652R513m7342L362L9173l3074o8152
$$ 40968 27088 2477 23392 31943 84928 93580 103093 55751 59113 98286 65212 -2940
18449b940o0798P163L9773J0882J9091O9802m469n3592k6153L7504N4328N1788
$$ -2940 -63738 -56575 -16802 -5920 13171 82973 78504 24912 -1241 36263 90591 142379
18437A42379n0059o2029k6552k0373l966N7127P346R569k088L395r890N275J1994
$$ 142379 92320 30291 3739 -16634 -20600 36527 43873 53442 51354 54749 44859 50134 62128
18424F2128K5863o883N757p4032p4063m965J3974m8523l4489L1757P2375N5913
$$ 62128 87991 81108 86865 12833 -61230 -66195 -52221 -100744 -135233 -103476 -31101 24812
18412B4812L7901K312o2647Q4564M8353J89o2524l7428r132Q979J2365L3264l5315
$$ 24812 62713 65025 2378 86942 135295 135484 72960 35532 26400 35379 47744 81008 45693
18399D5693N693l5325O568l441M1810m5710j7033P394j0394M5826M497j87P957
$$ 45693 51386 16061 22629 19188 60998 15288 -1745 5649 -4745 41081 45578 45391 53348
18386E3348L674k5862n098j62P32M6114R1210L6457O197J7982L4314j3363n8401
$$ 53348 57022 31160 26062 25900 26632 72746 163956 200413 206610 224592 258906 245543 187142
18373A87142o785l8998j1331j6353n825M1818r315q0891n5299j5117K4205J12133
$$ 187142 180357 141359 130028 113675 107850 149668 140353 59462 4163 -10954 13251 125384
18361A25384M8992q6387m3706K5984M9886l5639q1220n5N0920O2620K3847J8005
$$ 125384 174376 87989 44283 70267 120153 84514 3294 3239 54159 116779 140626 158631
18349A58631M585k608l384L5708K6516l0336J4693l3789l3883N139j4033l2062
$$ 158631 163216 160608 157224 192932 219448 189112 203805 170016 136133 141272 127239 95177
18337I5177m3932J8259R973L5289m1148m2347L4502m6687N7488L5297p51n0055
$$ 95177 51245 69504 79477 114766 73618 31271 65773 19086 76574 111871 111120 61065
18325F1065n1373n941Q350L2295p390n350L240k182P217O369k4457j1204l670
$$ 61065 9692 3751 12101 44396 37006 31656 34896 32714 39931 46300 21843 10639 6969
18312F969k9865J3005K994J8799J0845M8286M0186M088J3904L215k7754p6753
$$ 6969 -22896 -9891 -6897 11902 22747 71033 111219 115307 129211 132426 104672 27919
18300B7919P817J2192n8413K4481Q0330o174p2532M5686M0273j5793P432j9347
$$ 27919 35736 47928 -10485 13996 94326 88152 15620 61306 101579 85786 93218 73871
18288G3871j1627K3956M843j6855J7186J0714M9744R923m0199R225L7459K403
$$ 73871 62244 86200 91043 74188 91374 102088 151832 161755 121556 130781 168240 170643
18276A70643j2887j2375J8959N4805M9215k4122l6309K0092p989L7383R568n7475
$$ 170643 157756 145381 164340 219145 268360 244238 207929 228021 220032 257415 266983 209508
18264B09508o4471M4741K8664K9641k9773l1918O9908J5643K5558k2396j40p872
$$ 209508 145037 189778 218442 248083 218310 186392 256300 271943 297501 275105 274965 267093
18252B67093L2110J6254m0306p2398m8558M6451M5579p078L1641M476J9487k4290
$$ 267093 299203 315457 275151 202753 154195 200646 246225 239147 270788 275264 294751 270461
18240B70461P0571M8380n8189O263Q237m8611K5845L9539l065j1141M3522K4570
$$ 270461 341032 389412 331223 337486 345723 297112 322957 362496 359431 348290 391812 416382
18228D16382K9686o357L1709Q972k6378p8554o5013J0903N941m5016j3961K3175
$$ 416382 446068 439711 471420 480392 454014 375460 310447 321350 327291 282275 268314 291489
18216B91489O995P4526M2809O4082n3246J6027N3119r697L7961M0909j473l9701
$$ 291489 298484 373010 415819 479901 426655 442682 495801 486104 524065 564974 563501 523800
18204E23800M3190J3863K7258l9682j7425j786K2366L3626J9598J4515K0492q353
$$ 523800 566990 580853 608111 568429 551004 549218 571584 605210 624808 639323 659815 651462
18192F51462K0074M8958N5634K6179P1297j0231J0622L5461M4551j5306K4118
$$ 651462 671536 720494 776128 802307 873604 863373 873995 909456 954007 938701 962819
18181I62819k3833K5802Q4721M6704N1585k3021M653J2089K8529N5999J02841
$$ 962819 938986 964788 1049509 1096213 1147798 1124777 1129430 1141519 1170048 1226047 1328888
18170A328888O0511M051R326P9300J18244K8552K9442R343J14338J57965J30479
$$ 1328888 1389399 1393450 1402776 1482076 1600320 1628872 1658314 1667657 1781995 1939960 2070439
18159B070439R4087J32559J11301J09422J64700K08868J94953K31167K61627K87087
$$ 2070439 2164526 2297085 2408386 2517808 2682508 2891376 3086329 3317496 3579123 3866210
18149C866210L29203L46305M11041M36259N33282N54956N85648O41732P06871
$$ 3866210 4195413 4541718 4952759 5389018 5922300 6477256 7062904 7704636 8411507
18140H411507Q15451J023536J181189J352271J749580K215428K819811L755469
$$ 8411507 9226958 10250494 11431683 12783954 14533534 16748962 19568773 23324242
18132B3324242N077369O936263R075853J1356333J3491027J5228445J6765185
$$ 23324242 28401611 35337874 44413727 55770060 69261087 84489532 101254717
18125A01254717J7408576J6211980J3329657R970440O250910J130458m849545
$$ 101254717 118663293 134875273 148204930 158175370 164426280 165556738 160707193
18118A60707193r383922j1977059j3670855j4623627j3563634j0302362n456706
$$ 160707193 151323271 139346212 125675357 111051730 97488096 87185734 81729028
18111H1729028Q89229Q106531J3260505J4557993m901485k9236369k4563464j3766231
$$ 81729028 82618257 90724788 103985293 118543286 113641801 84405432 59841968 46075737
18103D6075737o659961k767510l27797J686433L759854O076593Q462812J0761957
$$ 46075737 39415776 36648266 36320469 38006902 41766756 47843349 56306161 67068118
18095F7068118J2803707J4602353J5507704J5002139J2863243R700516O334902
$$ 67068118 79871825 94474178 109981882 124984021 137847264 147547780 153882682
18088A53882682J898358l906838r043639j2205514j4344865j6037640j6670346
$$ 153882682 155781040 151874202 142830563 130625049 116280184 100242544 83572198
18081H3572198j5568787j3437889j1239110r180859p136122n213615l781161k741117
$$ 83572198 68003411 54565522 43326412 34145553 27009431 21795816 18014655 15273538
18073A5273538k034243j662478j291186j068721q25874p42507p33854o70419o71024
$$ 15273538 13239295 11576817 10285631 9216910 8391036 7648529 6914675 6244256 5573232
18064E573232n52983n21547m07594l63999k53852k80715k74448k37879j90498
$$ 5573232 5020249 4498702 4091108 3727109 3473257 3192542 2918094 2680215 2489717
18055B489717j14913p2008j36647j02278o8542j25028j23575r2218q0186p0860
$$ 2489717 2374804 2302796 2166149 2063871 1995329 1870301 1746726 1654508 1574322 1503462
18045A503462l7065o6147j4174j03725q6723q875p2330k7570k3215m9533j29409
$$ 1503462 1466397 1400250 1386076 1282351 1195628 1186753 1114423 1086853 1063638 1014105 884696
18034H84696m7425p3586l7962Q464k8488m0990l2233j2506l348l3588o7419N5154
$$ 884696 837271 763685 725723 734187 705699 664709 632476 619970 616622 583034 515615 570769
18022E70769N780N394p439o8231k5056p570P237q818n3293k3045L3058k2008q0432
$$ 570769 576549 581943 574504 506273 481217 473647 480884 472066 418773 395728 428786 406778 326346
18009C26346j6459n1398n3104J5658l586j146j5641j8648P19J1349R272N6005
$$ 326346 309887 258489 205385 221043 217457 216311 200670 182022 182741 194090 203362 259367
17997B59367q647n0224P1059J5819n3434J3007L0953m5770l6802j8906O0241l837
$$ 259367 250720 200496 271555 287374 233940 246947 277900 232130 195328 176422 236663 232826
17985B32826l152k1197J5452L1897M4786j0399l3501m7390r17m5276k7050K7617
$$ 232826 229674 208477 223929 255826 300612 290213 256712 209322 208405 163129 136079 163696
17973A63696l8796l7468j0107n0751m2744O5635Q3646M0674m8084p0706M7449
$$ 163696 124900 87432 77325 26574 -16170 49465 133111 173785 125701 54995 102444
17962A02444P3976M9839r831m8873R171N5152K4632l80n6993n0510k526j5092
$$ 102444 176420 226259 216428 167555 176726 231878 256510 256130 199137 148627 146101 131009
17950A31009r033j4203o133J2914m142K3597l6390O160l371j4889L698K7152j6005
$$ 131009 121976 107773 101640 114554 110412 134009 97619 103779 100408 85519 89217 116369 100364
17937A00364J9504J7300j9057k6974k5082P337k3356j3495K2837m2349k0204R647
$$ 100364 119868 137168 118111 91137 66055 73392 50036 36541 59378 17029 -3175 6472
17925F472M3381L1336r798k3859J2373M6295j6929J6311L2561M1226l7499j1116
$$ 6472 49853 81189 71391 47532 59905 106200 89271 105582 138143 179369 141870 130754
17913A30754M726K1098n2009l1681K8588l2270K7575l8054k3055L9591k3105J0813
$$ 130754 135480 156578 104569 72888 101476 69206 96781 58727 35672 75263 52158 62971
17901F2971K3024K1580N2906j9412m4724L531m2350n0784J7759M3582P5782J1340
$$ 62971 85995 107575 160481 141069 96345 99876 57526 6742 24501 68083 143865 155205
17889A55205m0767k6143l7959q645J9923j3773k7067L3513k9731m1965L5574P479
$$ 155205 114438 88295 50336 41691 61614 47841 20774 54287 24556 -17409 18165 25644
17877B5644k5445m4620K747m7140K3292L3224l5996K1976J2103Q181L5944K3251
$$ 25644 199 -44421 -41674 -88814 -65522 -32298 -68294 -46318 -34215 -26034 9910 33161
17865C3161n3333p1589L4930P7393N1093j1207M0945J2685l1271j7071m6306L8664
$$ 33161 -20172 -91761 -56831 20562 71655 60448 101393 114078 82807 65736 19430 58094
17853E8094p38k9185k954p7215m1055j03916k2735J09181L6317J7240M0289K0272
$$ 58094 57356 28171 25217 -51998 -93053 -196969 -219704 -110523 -74206 -56966 -16677 3595
17841C595j3427P646L2594J2351j5367Q738J8564j766j5502k2386O7j0712Q208
$$ 3595 -9832 -2186 30408 42759 27392 36130 54694 52928 37426 15040 15107 4395 12603
17828A2603r515L8987k2799p4357L204k2338M4254N7934l0168j7497O2796j4101
$$ 12603 3088 42075 19276 -55081 -51877 -74215 -29961 27973 -2195 -19692 43104 29003
17816B9003P720l8219k2368N2816j7122k8294M9692M2190R743r117n1780o7382
$$ 29003 36723 -1496 -23864 28952 11830 -16464 33228 75418 85161 76044 24264 -43118
17804d3118K8191N8911L607K675J413K0542m903m4566q4097L1171M5422L0343
$$ -43118 -14927 43984 47591 50266 51679 72221 67318 22752 -61345 -30174 15248 45591
17792D5591L5492m4611j5552M8859N606j21785j0822J7315P050P685l5956K7100
$$ 45591 81083 36472 20920 69779 75385 -46400 -57222 -39907 -32857 -25172 -61128 -34028
17780c4028N0863K1983K6266K11J5290l5062o8989J7458J1954N0718K3152p0460
$$ -34028 16835 38818 65084 65295 80585 45523 -23466 -6008 5946 56664 79816 9356
17768I356J9271J9943o3151l8335J8252r395J9542J6505J8487K3056l2321l2840
$$ 9356 28627 48570 -14581 -52916 -34664 -44059 -24517 -8012 10475 33531 1210 -31630
17756c1630j2940j9102K8620J0017m2050n9109o0111j1579O8912M1346J4846l2532
$$ -31630 -44570 -63672 -35052 -25035 -67085 -126194 -186305 -197884 -128972 -87626 -72780 -105312
17744a05312j7114r269Q7411M4422q804q4319n3557r120M8463M1734R653l6869
$$ -105312 -122426 -131695 -44284 138 -8666 -92985 -146542 -155662 -107199 -65465 -55812 -92681
17732i2681j3202P1150L8719j2844O0474J7290j7018k3552n574P228j1821P970
$$ -92681 -105883 -34733 3986 -8858 51616 68906 51888 28336 22762 29990 18169 26139
17720B6139r434J086n2003M1185J9752k899K4645L1411O07L590j9202l8744j11567
$$ 26139 16705 17791 -34212 6973 26725 23826 48471 79882 80489 84079 64877 26133 -85434
17707h5434r587K0876M1849R1370J2591k5734o2014k7669J3125M6448L4101k6933
$$ -85434 -95021 -74145 -32296 59074 71665 45931 -16083 -43752 -30627 15821 49922 22989
17695B2989k2984m6138p583N1809J5874K6430r240l0744K4213j012J1528l3315
$$ 22989 5 -46133 -53716 -1907 13967 40397 31157 413 24626 23614 35142 1827
17683A827m3605N092N4895N7484m068m1333j902L0473l990m6168j04387J4725
$$ 1827 -41778 -36686 18209 75693 71625 30292 28390 58863 54873 8705 -95682 -80957
17671h0957N2671R957N875k527J7176K2048r517M1770j7203j3205j8677J9678
$$ -80957 -28286 -18329 -12454 -14981 2195 24243 14726 56496 39293 26088 7411 27089
17659B7089m2543o4525K1013M7757j3699L7156J3316j5417p236m8744p9417l2938
$$ 27089 -15454 -79979 -58966 -11209 -24908 12248 25564 10147 2911 -45833 -125250 -158188
17647a58188N3975l42k0817n580j6124k7535K4687N9607n2818l3910L9804o6750
$$ -158188 -104213 -104555 -125372 -130952 -147076 -174611 -149924 -90317 -143135 -177045 -137241 -203991
17635b03991N8391Q3786O6585L8900J1672L039o4506n6568N3722l53j4415m343
$$ -203991 -145600 -61814 4771 43671 55343 58382 -6124 -62692 -8970 -9323 -23738 -28081
17623b8081J5300l6939j18L2739n1464N106K6548L4647J4226N3675m1338k5865
$$ -28081 -12781 -49720 -49838 -17099 -68563 -63457 -36909 -2262 11964 65639 24301 -1564
17611a564m1906o1432Q700J21387Q4569N6222L2395P7656M7899O6833N2031J44765
$$ -1564 -43470 -104902 -96202 25185 109754 165976 198371 276027 323926 390759 442790 587555
17599E87555Q4667M7720O1378N6736k9332p3706q8467n3271p4498r1521o2227
$$ 587555 672222 719942 781320 838056 808724 735018 646551 593280 518782 427261 365034
17588C65034o0484m9399l5996k3579o1493j2399Q108j2787N10M5365J4911k1376
$$ 365034 304550 255151 219155 195576 134083 121684 129792 117005 117515 162880 177791 156415
17576A56415N9734N738n3684j7502K778M2252J45487J54202R5749Q4070M7940
$$ 156415 216149 221887 168203 150701 153479 195731 341218 495420 591169 675239 723179
17565G23179K7868J041K6521j9701q3867n1737q9680r8053o7594j00173o3831
$$ 723179 751047 752088 778609 758908 675041 623304 533624 435571 367977 267804 203973
17554B03973o7401m6963k1829j863J4916j7122K3255k5161k9714L7959N1671j1161
$$ 203973 136572 89609 67780 65917 80833 63711 86966 61805 32091 70050 121721 110560
17542A10560m6369p1951m2970j0680Q291j2556n7705O097O5812P641j4774j5522
$$ 110560 64191 -7760 -50730 -61410 -53119 -65675 -123380 -117283 -51471 -43830 -58604 -74126
17530g4126j6134J8191P8779M015L1168j7344k0648K4100m7920k1619J872m2816
$$ -74126 -90260 -72069 6710 10725 41893 24549 3901 28001 -19919 -41538 -39666 -82482
17518h2482K9679K0863l3487Q203M9441m1244k9277n5960m5083l1101J2132N7201
$$ -82482 -52803 -31940 -65427 -57224 -7783 -49027 -78304 -134264 -179347 -210448 -198316 -141115
17506a41115P0276L3382K9848k3686k425P344k5498k300j473j2974j1635j3764
$$ -141115 -70839 -37457 -7609 -31295 -33720 -26376 -51874 -54174 -55647 -68621 -80256 -94020
17494i4020O5663J0714L9094N567l2610l3915l1711j4707k5445n226l3637L2516
$$ -94020 -28357 -17643 21451 27018 -5592 -39507 -71218 -85925 -111370 -116596 -150233 -117717
17482a17717K4946J9164k7679L2607K3331k2819p861N750J8732K257j157K9723
$$ -117717 -92771 -73607 -101286 -68679 -45348 -68167 -76028 -70278 -51546 -49289 -50446 -20723
17470b0723J599K7949j9038k0738J8122m0767n1847M802J1420r041K9165l1648
$$ -20723 -19124 8825 -10213 -30951 -12829 -53596 -105443 -100641 -89221 -98262 -69097 -100745
17458a00745o778N2358N721q282m3650j8095M0182K2959L6030O1582L354J786
$$ -100745 -107523 -55165 -49444 -57726 -101376 -119471 -79289 -56330 -20300 41282 44636 46422
17446D6422L370L5953J19357J27360M4093N9982n5963j29979j19358q8392q5182
$$ 46422 49792 85745 205102 332462 376555 436537 380574 250595 131237 42845 -42337
17435d2337j5003J3836J0925p109k7232r463N4900N4801N7154J2613j2829j6860
$$ -42337 -57340 -43504 -32579 -39688 -66920 -76383 -21483 33318 90472 103085 90256 73396
17423G3396k7229O078J5911l0579o1455j742l2462j2447k4446l8234P3175K5425
$$ 73396 46167 52245 68156 37577 -23878 -25620 -58082 -70529 -94975 -133209 -60034 -34609
17411c4609K9763K5796M415o7306l8388N2202J2838n2428j8638Q09p541m9090
$$ -34609 -4846 20950 25365 -41941 -80329 -28127 -15289 -67717 -86355 -85546 -93087 -142177
17399a42177K3935L1657K2253O724M6996k1663j14615k6605J3128K5765L8721
$$ -142177 -118242 -86585 -64332 -57608 -10612 -32275 -146890 -173495 -160367 -134602 -95881
17388i5881K6978l6794j0175K0596J6361J0003O025o459j7278j487j0079R78k7537
$$ -95881 -68903 -105697 -115872 -95276 -78915 -68912 -62887 -69346 -86624 -88111 -98190 -97212 -124749
17375a24749o435p057j3031Q386O0790P1367n676q891o7L5660n3067l8949K5789
$$ -124749 -131184 -138241 -151272 -142886 -82096 -10729 -16405 -25296 -25363 10297 -42770 -81719 -55930
17362e5930N2268n4950m0245L3394P9746m9697m8578J6517L5439m2835k2613N362
$$ -55930 -3662 -58612 -98857 -65463 14283 -35414 -83992 -67475 -32036 -74871 -97484 -92122
17350i2122Q595j581k453l8037m0616Q1319L569l943m783N96N2416L4008j4232
$$ -92122 -83527 -85108 -87561 -125598 -166214 -84895 -81326 -85269 -90052 -89456 -37040 -3032 -17264
17337a7264m9121n7815L0884J4161J721k8491l2300k0124K3220K1888L7273Q352
$$ -17264 -66385 -124200 -93316 -79155 -77434 -105925 -138225 -158349 -135129 -113241 -75968 -67616
17325f7616o0051K1628N6433Q4036J556m7203j8046l4772j34K1869M0819l848
$$ -67616 -127667 -106039 -49606 34430 35986 -11217 -29263 -64035 -64169 -42300 -1481 -5329
17313e329l195k7963j61n773k4743l2015j8773J1146J9845L1894k2802l1720j8607
$$ -5329 -8524 -36487 -36648 -42421 -67164 -99179 -117952 -106806 -86961 -55067 -77869 -109589 -128196
17300a28196J0913N0589K7467O679k1890l2027k2637M970l9157l1376N2841O5547
$$ -128196 -117283 -66694 -39227 -32548 -54438 -86465 -109102 -104132 -143289 -174665 -121824 -56277
17288e6277O0300n3480l0654P2165m3806Q891L064m2802L7363m5014n1877r084
$$ -56277 4023 -49457 -80111 -7946 -51752 -42861 -39797 -82599 -45236 -90250 -142127 -151211
17276a51211K3129M8704J2378j6212n433j7895N8932O5968N9087p6911n9598J7194
$$ -151211 -128082 -79378 -67000 -83212 -88645 -106540 -47608 18360 77447 536 -59062 -41868
17264d1868k7566K3277J1550J3448n2080j9700n465j3020l7847R714M165n5854
$$ -41868 -69434 -46157 -34607 -21159 -73239 -92939 -98404 -111424 -149271 -139557 -135392 -191246
17252a91246L1032R3984L9018l2834J7550K5142J8720n021m4333J2389J3994m8177
$$ -191246 -160214 -66230 -27212 -60046 -42496 -17354 1366 -3655 -47988 -35599 -21605 -69782
17240f9782L3313K8021J1594m0772j231m2440p0024q691M1293R723K067P9600
$$ -69782 -36469 -8448 3146 -37626 -38857 -81297 -151321 -160012 -118719 -108996 -106929 -27329
17228b7329M094q6774j0133J0953k8843j6578J1041N056K9009k9372K1609n4130
$$ -27329 -23235 -110009 -120142 -109189 -138032 -154610 -143569 -138513 -109504 -138876 -117267 -171397
17216a71397J4287P7869M8464L82m4726o9452J0067L4268l7819n840p025Q858
$$ -171397 -157110 -79241 -30777 -30395 -75121 -144573 -134506 -100238 -138057 -143897 -150922 -142064
17204a42064L7376M0313r659k8061J1477j9338J5164L6703k8250k2433k932L964
$$ -142064 -104688 -64375 -74034 -102095 -90618 -109956 -94792 -58089 -86339 -108772 -111704 -107740
17192a07740l3698M0081M9732L1262M1721L6140p736n1024q254n2722l3628M5546
$$ -107740 -141438 -101357 -51625 -20363 21358 57498 49762 -1262 -9516 -62238 -95866 -50320
17180e0320Q0031J0150n6701j6377n907J099L0806n460N199j4135j3J2015n4472
$$ -50320 29711 39861 -16840 -33217 -39124 -38025 -7219 -12679 -7480 -21615 -21628 -9613 -64085
17167f4085N854J5490j4858L222L2376k74m886j0565K8325l475M2775K7822q910
$$ -64085 -58231 -42741 -57599 -54377 -22001 -22275 -27161 -37726 -9401 -12876 29899 57721 48811
17154D8811m454k5353m9238m7448O3837M1046J2551n4401o6741j7427K0876N8433
$$ 48811 44357 19004 -30234 -77682 -13845 27201 39752 -14649 -81390 -98817 -77941 -19508
17142a9508O1198K0397R971o2349n8255q6004k821M8498J8712j1669K5893Q403
$$ -19508 41690 62087 72058 9709 -48546 -134550 -137371 -88873 -70161 -81830 -55937 -47534
17130d7534L6144J0534l3687K3808p579K6679m0013J5297O1031l1572n5451k3023
$$ -47534 -11390 -856 -34543 -10735 -18314 8365 -31648 -16351 44680 13108 -42343 -65366
17118f5366j6844M6569O5390L0507j6679j321M5783m4743r0412o7176m0987K0167
$$ -65366 -82210 -35641 29749 60256 43577 42256 88039 43296 -47116 -114292 -155279 -135112
17106a35112N4066J0427o6824M8798L2628m2588r541J8147K6345m7425L0373K0389
$$ -135112 -81046 -70619 -137443 -88645 -56017 -98605 -108146 -89999 -63654 -111079 -80706 -60317
17094f0317j6680M009J5685j0929j3502J7868L7760o728K7340L3884m2443n8791
$$ -60317 -76997 -72988 -57303 -68232 -81734 -63866 -26106 -32834 -5494 28390 -14053 -72844
17082g2844j1858l1679J506M1488J0716K7789k8840k2955k690j0749J9603Q8432
$$ -72844 -84702 -116381 -114875 -73387 -62671 -34882 -63722 -86677 -89367 -100116 -80513 7919
17070G919K207n6547k861O859m2500K4442K0803j4316j3781l3623o2790O0851
$$ 7919 10126 -46421 -49282 -42423 -84923 -60481 -39678 -53994 -67775 -101398 -164188 -103337
17058a03337N0530N9664o0655j00603J5483M1798j8362l0166K5768K7640l5857
$$ -103337 -52807 6857 -53798 -154401 -138918 -97120 -115482 -145648 -119880 -92240 -128097
17047a28097N4653Q6300l0754l8040K3580J6135K7618l1599J7039L5891j6208
$$ -128097 -73444 12856 -17898 -55938 -32358 -16223 11395 -20204 -3165 32726 16518
17036A6518k4377p0695m2450j2648n617K1528Q137K7843R3978J8715k7354n8834
$$ 16518 -7859 -78554 -121004 -133652 -139269 -117741 -109604 -81761 12217 30932 3578 -55256
17024e5256n6970J7869k7724J1760K7254k1611N2445P5506K8018k6535m4929o2493
$$ -55256 -112226 -94357 -122081 -110321 -83067 -104678 -52233 23273 51291 24756 -20173 -82666
17012h2666m0719L9422N7871l0741l4184J7339O342o074M586N6409n121J5440
$$ -82666 -123385 -83963 -26092 -56833 -91017 -73678 -67336 -73410 -68824 -12415 -17536 -2096
17000b096p0417p760K2247L0178K2460k2840J2782K9513j2674L9716K7513o2703
$$ -2096 -72513 -80273 -58026 -27848 -5388 -28228 -15446 14067 1393 41109 68622 5919
16988E919r3549l7720P139m3442l7562N497L4581R2157K3349Q684M7578j278k3063
$$ 5919 -87630 -125350 -118211 -161653 -199215 -193718 -159137 -66980 -43631 -34947 12631 11353 -11710
16975a1710m5106n8999k9200N853K9968O1980M3000k5059j7616j8797m096k0878
$$ -11710 -56816 -115815 -145015 -139162 -109194 -47214 -4214 -29273 -46889 -65686 -69782 -90660
16963i0660k539J448J0613R785k6663K8050o5166J1967N7798K4343p7771p534
$$ -90660 -93199 -91751 -81138 -71353 -98016 -69966 -135132 -123165 -65367 -41024 -118795 -126329
16951a26329O9105K9374M1927k4766l6823m6413J4010K0164k6399Q747p67n3792
$$ -126329 -57224 -27850 14077 -10689 -47512 -93925 -79915 -59751 -86150 -77403 -78170 -131962
16939a31962M5464O7202P558j0222j4275j9305P700L5984N9428l642l8431L9337
$$ -131962 -86498 -19296 -11738 -21960 -36235 -55540 -47840 -11856 47572 43930 5499 44836
16927D4836q70J530o515n8135j956K2888m0288k2675R474p435n4630l0391L8819
$$ 44836 43966 45496 38981 -19154 -21110 1778 -38510 -61185 -51711 -59146 -113776 -144167 -105348
16914a05348r0L2701J4713q8398M841R1438J7070m1684j1084l297N9412j4029
$$ -105348 -105438 -72737 -58024 -146422 -141581 -50143 -33073 -74757 -85841 -89138 -29726 -43755
16902d3755j1368L8250J8945j9812n7366l8728K3902L194k8760M2581M2075L8074
$$ -43755 -55123 -16873 2072 -17740 -75106 -113834 -89932 -86738 -115498 -72917 -30842 7232
16890G232N8767q114k5263M1968J0295J3860j0536r855p2508o0118m7126Q351
$$ 7232 65999 57885 32622 74590 84885 98745 88209 78354 5846 -54272 -101398 -93047
16878i3047j5162M9997J05976l1214o6135o8391L2450J7967k929M9213m0883n7187
$$ -93047 -108209 -58212 47764 16550 -49585 -117976 -85526 -67559 -70488 -21275 -62158 -119345
16866a19345k2626N073P5096R4711o551m3692J0841n159k9910j5929p619j329
$$ -119345 -141971 -136898 -61802 32909 26358 -17334 -6493 -11652 -41562 -57491 -65110 -66439
16854f6439l0321L7342K7795j8124O9908q592L0040n483k5041L6978J9324n2518
$$ -66439 -96760 -59418 -31623 -49747 20161 11569 41609 36126 11085 48063 67387 14869
16842A4869p0239n3546J6665J8380O476J5748M4210J5570r8345j6285M1875J4470
$$ 14869 -55370 -108916 -92251 -73871 -67395 -51647 -7437 8133 -90212 -106497 -64622 -50152
16830e0152k7300p586N023K4472K7880J8739K1086o228k3402m2854L3051p0627
$$ -50152 -77452 -85038 -80015 -55543 -27663 -8924 12162 5934 -17468 -60322 -27271 -97898
16818i7898j8600N6137K3795n9697l964N6814P4329J8033M422m1545k5738M4288
$$ -97898 -116498 -60361 -36566 -96263 -100227 -43413 30916 48949 53371 11826 -13912 30376
16806C0376j9067l2075O2418K0059q558J8425o1865l3693K3264l1343j0087K3811
$$ 30376 11309 -20766 41652 61711 53153 71578 9713 -23980 -716 -32059 -42146 -18335
16794a8335M419j1311q54R363k232k2014L650p3712j0741N9224k7439m4771J0097
$$ -18335 -13916 -25227 -26081 -16718 -18950 -40964 -37314 -111026 -121767 -62543 -89982 -134753 -124656
16781a24656J5894K4259M1561K4244j6457p431k1178J1759k1791l8707q977k3684
$$ -124656 -108762 -84503 -42942 -18698 -35155 -42586 -63764 -52005 -73796 -112503 -121480 -145164
16769a45164K3407L2481M8880M1770m597o638K4130m3875l1033k0454M877J9470
$$ -145164 -121757 -89276 -40396 1374 -3223 -9861 14269 -29606 -60639 -81093 -76216 -56746
16757e6746J4174L4388L4238M2054l2730l0974j2075J2897m416O2257m778p0083
$$ -56746 -42572 -8184 26054 68108 35378 4404 -7671 5226 810 63067 58289 -11794
16745a1794j1748l917j1014J3292J7421j405n9313l0216N463j2691O643K8796
$$ -11794 -23542 -27459 -38473 -25181 -7760 -9165 -68478 -98694 -93231 -105922 -99279 -70483
16733g0483J5865n0122l2647j6122L8661K9046k7311J4167M1357L706m4495K0362
$$ -70483 -54618 -104740 -137387 -153509 -114848 -85802 -113113 -98946 -57589 -53883 -98378 -78016
16721g8016P15L0082O3431Q1647j2537n1147l337n4036j5683j6761k9546J4045
$$ -78016 -77301 -47219 16212 97859 85322 34175 30838 -23198 -38881 -55642 -85188 -71143
16709g1143K7787L2427m82J1078J3357J9713j357l192L3693j7885p010k1646m287
$$ -71143 -43356 -10929 -11411 -333 13024 32737 31380 28188 61881 43996 36986 15340 11053
16696A1053J4457R932Q352l0199j1673j2843l7146N7806O391j5267l14m9333j2897
$$ 11053 25510 35442 43794 13595 1922 -10921 -48067 9739 16130 863 549 -48784 -61681
16683f1681q04L757l2323m8627L9923M9337K7958l0616J5845N4539R1264l2048
$$ -61681 -62485 -58728 -91051 -139678 -99755 -50418 -22460 -53076 -37231 17308 108572 76524
16671G6524k7326m3540j1272O4785L540k7064p7157j4196O8516n140K0243K4319
$$ 76524 49198 5658 -5614 59171 62711 35647 -41510 -55706 12810 7670 27913 52232
16659E2232M0944L2755p2063q1053j21296m2020R3880R9171o7476k1771p519L8475
$$ 52232 93176 125931 53868 -27185 -148481 -190501 -96621 2550 -64926 -86697 -94216 -55741
16647e5741K0852N8780k7294p2088n68o689M5774P588j9962m7681K3836O526J6136
$$ -55741 -34889 23891 -3403 -75491 -76059 -82748 -36974 -29386 -49348 -97029 -73193 -66667 -50531
16634e0531M1805j0445l595l3423k5317L8318j2649K3346k1328J2844k3569K4926
$$ -50531 -8726 -19171 -22766 -56189 -81506 -43188 -55837 -32491 -53819 -40975 -64544 -39618
16622c9618L1697M3512j5631L5642K7817m0159m0157l2874P611J6039N0230M6212
$$ -39618 -7921 35591 19960 55602 83419 43260 3103 -29771 -22160 -6121 44109 90321
16610I0321m9530l0727k315P5712k7749l8507l2100n7226j569j4886K2698N3488
$$ 90321 40791 10064 7749 83461 55712 17205 -14895 -72121 -73690 -88576 -65878 -12390
16598a2390Q691K0088Q900J2219P344O6241k3657l9352j6305j6652O206J1190
$$ -12390 -3699 16389 25289 37508 44852 111093 87436 48084 31779 15127 21333 32523
16586C2523K2613M497r765K0024l440l7367l2299J3124o4450J3576J14057P6978
$$ 32523 55136 59633 49868 69892 66452 29085 -3214 9910 -54540 -40964 73093 150071
16574A50071J7011m8061m7085k0164k6712L7825j0599O579l575k7335N6050l9986
$$ 150071 167082 119021 71936 51772 25060 62885 52286 58865 55290 27955 84005 44019
16562D4019P440P4032L0031k9885n2947L211k2306k2938k1277M6563j0980l3028
$$ 44019 51459 125491 155522 125637 72690 75901 53595 30657 9380 55943 44963 11935
16550A1935n8693q199R2226J1044k4804N367j0966j1170L0316N7854L707k1424
$$ 11935 -46758 -54957 37269 48313 23509 28876 17910 6740 37056 94910 98617 77193
16538G7193M3071N44k04j2412m3909j4839K1387l2501j1447j525l7739l5471O2725
$$ 77193 120264 120808 120604 108192 64283 49444 70831 38330 26883 25358 -12381 -47852 14873
16525A4873O9679m90n0204j323R3363J2877m5756J7993k6068l1140o4110o144
$$ 14873 84552 84062 33858 32535 125898 138775 93019 111012 84944 53804 -10306 -16450
16513a6450j0808o972O1697k2252N3312N1982Q4850M1932o6675k6110l1107l2292
$$ -16450 -27258 -34230 27467 5215 58527 110509 195359 237291 170616 144506 113399 81107
16501H1107k7713J3463N2876M9953j6231m8777P60j8633l2056p318M770m0811
$$ 81107 53394 66857 119733 169686 153455 104678 105438 86805 54749 47431 52201 11390
16489A1390p5944L6912k960J1699N5537L6792P4001P546k6253N6408K5299k7111
$$ 11390 -64554 -27642 -30602 -18903 36634 73426 147427 154973 128720 185128 210427 183316
16477A83316L1876M7370n3723k6366l9896K160M9716j8625o3667k780M2121O4696
$$ 183316 215192 262562 208839 182473 142577 144737 194453 175828 112161 109381 151502 216198
16465B16198N811k5103j2827m4398k4563k1989L7886K2044k1145n829L3243n2395
$$ 216198 222009 196906 184079 139681 115118 93129 131015 153059 131914 126085 159328 106933
16453A06933N1799K7755K87K3557j5849L7924L7310j8355r031N2099o3269n4138
$$ 106933 158732 186487 186774 210331 194482 232406 269716 251361 242330 294429 231160 177022
16441A77022L8691J2865J5148K4458Q14K8775L0462r536j7035j2064j7387L5326
$$ 177022 215713 228578 243726 268184 268998 297773 328235 318699 301664 289600 272213 307539
16429C07539L2944o75j5013O9398j4649r0147j25896O937J24875O5901k3567m2266
$$ 307539 340483 339808 324795 394193 379544 289397 163501 170438 295313 361214 337647 295381
16417B95381J8532L8377K0129J8275j3721L0637r425j6444j3216k7379k6573k152
$$ 295381 313913 352290 372419 390694 376973 407610 398185 381741 368525 341146 314573 312421
16405C12421O9104j7456l5091k9689M070M1025O7511P976l6805m7822K4155q428
$$ 312421 381525 364069 328978 299289 303359 344384 411895 419871 383066 335244 359399 350971
16393C50971M7273O593j6640k2621j4173m2034L7821L3215J3914N946l4128n4688
$$ 350971 398244 404837 388197 365576 351403 309369 347190 380405 394319 400265 366137 311449
16381C11449n2119M1381Q4280l6056m8962N231j1596N4867J9941l6218J5844k166
$$ 311449 259330 300711 384991 348935 299973 305204 293608 348475 368416 332198 348042 345876
16369C45876j5631J6299l8818l2350K0020j8764k4608j0313l0630l1357J566L3911
$$ 345876 330245 346544 307726 275376 295396 276632 252024 241711 211081 179724 181290 215201
16357B15201q784M9867j0463o8938j5733N4960K9084M2611O149k9712p137J1754
$$ 215201 206417 256284 245821 176883 161150 216110 245194 287805 293954 264242 257105 268859
16345B68859k3163k4757K7633O730P940M5585O496o0906l9910k8866p5734L3392
$$ 268859 245696 220939 248572 255302 263242 308827 315323 254417 214507 185641 109907 143299
16333A43299M7686K5121l1541L7952M9052o5670j8172J6898M5554L6741k3j2945
$$ 143299 190985 216106 184565 222517 271569 205899 187727 204625 250179 286920 286897 273952
16321B73952k552K6216J7041R500l2714l0913j1624l4738l682k705m0156k8629
$$ 273952 271400 297616 314657 324157 291443 260530 248906 214168 210486 207781 167625 138996
16309A38996O5678L7440N3363l674l6670j4439l6014m239M738K6976L6106O0132
$$ 138996 204674 242114 295477 291803 255133 240694 204680 200441 205179 232155 268261 328393
16297C28393n082k2425m8339m4926J0870M407m4927k5333j0415J9661K4803L2046
$$ 328393 323311 300886 252547 207621 218491 222898 177971 152638 142223 161884 186687 218733
16285B18733N2448q2358o7942j8381L7897J8625K8360Q662j4561k1024L0792k4752
$$ 218733 271181 188823 120881 102500 140397 159022 187382 196044 181483 160459 191251 166499
16273A66499O652j9475M7782J5818p538J4866K9682J2427R048k9165n6674K787
$$ 166499 173151 153676 201458 217276 209738 224604 254286 266713 275761 246596 189922 192709
16261A92709K8579N3487J415L2325J8380q1170J2068L7250K0376L3327l7486k0580
$$ 192709 221288 274775 276190 308515 326895 245725 257793 295043 315419 348746 311260 290680
16249B90680k089O1040k9911l5497L2312j1479o4355K346O5619p493o6546l9515
$$ 290680 288591 349631 319720 284223 316535 305056 240701 243047 308666 301173 234627 195112
16237A95112O3776O7838k9939J2824J2843k938M2130l363k9812m3005k4529M3756
$$ 195112 258888 326726 296787 309611 322454 319516 361646 358283 328471 285466 260937 304693
16225C04693J6154R105l4507q287j6768l4225L3150K5228N2778r249o761P6897
$$ 304693 320847 329952 295445 287158 270390 236165 269315 294543 347321 338072 331311 408208
16213D08208P1134l1344r2345l1126O3913P7578O4195N991n9977m7581m5499J0097
$$ 408208 479342 447998 355653 324527 388440 466018 530213 536204 476227 428646 383147 393244
16201C93244l7330j1875m9828J225M711m282l1907R963J1187N7422L879m658j9774
$$ 393244 355914 344039 294211 295436 300147 295865 263958 273921 285108 342530 346409 341751 321977
16188C21977o70J7177J4966l7886j5150M9024L6267L8092o1218l5833k4574O294
$$ 321977 321307 338484 353450 315564 300414 349438 385705 423797 362579 326746 302172 308466
16176C08466k8401n8521r182N8291M6999L2119N0766p0702n8051L256k0454j4089
$$ 308466 280065 221544 212362 270653 317652 349771 400537 329835 271784 275040 254586 240497
16164B40497J448n152K6703M5724l1935P720M9829k1283m3634m9556P411Q643
$$ 240497 241945 236793 263496 309220 277285 285005 334834 313551 269917 220361 227772 236415
16152B36415J2612j6633j1619p4983o026N7298j5976l7248k730K3780J1943j6455
$$ 236415 249027 232394 220775 145792 139766 197064 181088 143840 141110 164890 176833 160378
16140A60378j7484K1524N4018j7131J1324P7918L028l8623j9410M0407j0376k0455
$$ 160378 142894 164418 218436 201305 212629 290547 293575 254952 235542 275949 265573 245118
16128B45118m7860J4479P4921O97n0707m6920m4851j5136J4056M2235L1241P4438
$$ 245118 197258 211737 286658 287355 236648 189728 144877 129741 143797 186032 217273 291711
16116B91711n2959l5643m3974m1940M4260J5698k9454o470m5520p1875k4121k5436
$$ 291711 238752 203109 159135 117195 161455 177153 147699 141229 95709 23834 -287 -25723
16104b5723J4470K5769L350K1534K6701j6420l3609N4581l0595N226L9292p459
$$ -25723 -11253 14516 17866 39400 66101 49681 16072 70653 40058 45284 84576 77117
16092G7117L5245L3044m1976L047j9411r593l1879j0070l2306M0549Q7501K4673
$$ 77117 112362 145406 103430 106477 87066 77473 45594 35524 3218 43767 131268 155941
16080A55941o0109m4087p416J8275N6082J3864m5785p83M6069p5078m6101l2777
$$ 155941 95832 51745 44329 62604 118686 132550 86765 85982 132051 56973 10872 -21905
16068b1905k7183m1883L2104N9681j4999L268L0566j557l1372m4288M9371N9749
$$ -21905 -49088 -90971 -58867 814 -14185 -10917 19649 18092 -13280 -57568 -8197 51552
16056E1552M6584l0351n841K9756M906l6986L7992n939l1144m542l6584o0675
$$ 51552 98136 67785 61944 91700 96606 59620 97612 91673 60529 55987 19403 -41272
16044d1272n9005J3907Q321K3959J1584Q7206J6634j1716q651K4360k684J0769
$$ -41272 -100277 -86370 -78049 -54090 -42506 44700 61334 49618 40967 65327 62643 73412
16032G3412j9808m5988k1606M5069M4781k6845J3177l3050q704k4122l2692N3660
$$ 73412 53604 7616 -13990 31079 75860 49015 62192 29142 20438 -3684 -36376 17284
16020A7284M9533r589k801p4644n68k633J3944O1677N6828k0346p2955P1537k1111
$$ 17284 66817 57228 54427 -20217 -20785 -23418 -9474 52203 109031 88685 15730 87267 66156
16007F6156m8529k0372l6950K2216P0157M9646o8795l3211K0630L8753L1836j6810
$$ 66156 17627 -2745 -39695 -17479 52678 102324 33529 318 20948 59701 91537 74727
15995G4727j7761N811o091K0537k407l4299j2603k1297K1684M2595M2422j1238
$$ 74727 56966 62777 56686 77223 74816 40517 27914 6617 28301 70896 113318 102080
15983A02080n7939K784q0768j2048J3549O6034N3383l1397k6623j7541n2467K9946
$$ 102080 44141 46925 -33843 -45891 -32342 33692 87075 55678 29055 11514 -40953 -11007
15971a1007L0071o9072m1592K1204l9428j6188j818M6539N1843p53L7291l8047
$$ -11007 19064 -50008 -91600 -70396 -109824 -126012 -127830 -81291 -29448 -30201 7090 -30957
15959c0957n7199l105L6552k7539m4027K2455K6767K3814k8573k168k412P22P5570
$$ -30957 -88156 -91261 -54709 -82248 -126275 -103820 -77053 -53239 -81812 -83980 -86392 -85670 -10100
15946a0100L37O660M5199L9665j5803n1181n7664q930L064L1900M309N697j5956
$$ -10100 -9763 -3103 42096 81761 65958 14777 -42887 -51817 -48753 -16853 -12544 -6847 -22803
15933b2803n8412k7679k5885k7746Q022N4044J2701m618L7393M4572l939k382
$$ -22803 -81215 -108894 -134779 -162525 -154503 -100459 -87758 -92376 -54983 -10411 -14350 -16732
15921a6732o603M576L4753k7398J1959l6765j0644J5035N6806K3180p720q596
$$ -16732 -23335 -18759 15994 -11404 555 -36210 -46854 -31819 24987 48167 40447 31851
15909C1851l2507n0891m8962P434j7648j2619Q7056J01045m5497p3176J5219N6818
$$ 31851 -656 -51547 -100509 -93075 -110723 -123342 -36286 64759 19262 -53914 -38695 18123
15897A8123M304J5634n434j2132r90K2324k2144j01720j333k9003M2825J03126
$$ 18123 22427 38061 32627 20495 19505 41829 19685 -82035 -83368 -112371 -69546 33580
15885C3580K1675p0226n3271k6550o7315r104o734k2657K4688P2161P1374K1721
$$ 33580 55255 -14971 -68242 -94792 -162107 -171211 -177945 -200602 -175914 -103753 -32379 -10658
15873a0658J5842k1285k0443q873K049L790j542J1800n9535m4494N1549K6712
$$ -10658 5184 -16101 -36544 -45417 -43368 -39578 -41120 -29320 -88855 -133349 -81800 -55088
15861e5088P386K352j5377l4052L0935K6974j2703k7229m265J0631K3726m4532
$$ -55088 -47702 -45350 -60727 -94779 -63844 -36870 -49573 -76802 -81067 -70436 -46710 -91242
15849i1242J2173P6635L6474q620Q664p103j3473m9988l6067k690L7936N4397
$$ -91242 -79069 -2434 34040 25420 34084 26981 13508 -36480 -72547 -75237 -37301 17096
15837A7096L8077n6486k5165n0194K5974l4888j6939R2943O0245r078k5054j0575
$$ 17096 55173 -1313 -26478 -76672 -50698 -85586 -102525 -9582 50663 41585 16531 5956
15825E956J4475Q628k1492l2720q992o7695L7091O8642r686m8890j3183L4572
$$ 5956 20431 29059 7567 -25153 -34145 -101840 -64749 3893 -5793 -54683 -67866 -33294
15813c3294j6467J1195P1022k2325m2558K6126P4826l753l8509K0116l9645r4545
$$ -33294 -49761 -38566 32456 10131 -32427 -6301 68525 64772 26263 46379 6734 -87811
15801h7811o9748L6854J593J5824q644K058N1098m4973k7673J4573N2590K0005
$$ -87811 -157559 -120705 -119112 -103288 -111932 -109874 -58776 -103749 -131422 -116849 -64259 -44254
15789d4254P5272k4545n1580R4332j0058m8321l8712K5544j8066J0697j5831N9283
$$ -44254 31018 6473 -45107 49225 39167 -9154 -47866 -22322 -40388 -29691 -45522 13761
15777A3761j3578j3719M2193j2673l7811L026m7981J777N1562k5505m037r011
$$ 13761 183 -13536 28657 15984 -21827 -18801 -66782 -65005 -13443 -38948 -42985 -51996
15765e1996P3718M3920n1400n548j3713M3569j824j5141k0011j3274R310R465
$$ -51996 21722 65642 14242 8694 -5019 38550 36726 21585 1574 -11700 -2390 7075
15753G075K2911o972k4311k0321J981m610m3714N215L6467o525L846r942k8892
$$ 7075 29986 23014 -1297 -21618 -19637 -24247 -67961 -62746 -26279 -32804 -28958 -38900 -67792
15740f7792Q093l7904K5280R0196O2851p3005p7798m4298n691P4435K0777j0092
$$ -67792 -59699 -97603 -72323 17873 80724 7719 -70079 -114377 -120068 -45633 -24856 -34948
15728c4948N4924m785L5514j5036r533J3946L1613M2507k6336o6067m6442q062
$$ -34948 19976 15191 50705 35669 26136 40082 71695 114202 87866 21799 -24643 -32705
15716c2705m24J3424m21m4715j5874n388N3945K1939J188o8087k0313K6519j5220
$$ -32705 -33129 -19705 -20126 -64841 -80715 -86103 -32158 -10219 -9031 -77118 -97431 -70912 -86132
15703h6132Q2433J23758L836q423k6836l1250m1431q8183n6350k082N6943K9385
$$ -86132 -3699 120059 123895 115472 88636 57386 15955 -72228 -128578 -130660 -73717 -44332
15691d4332M6386M468k1095j6269M9585m8511q204O3463J3811o8320L5627O087
$$ -44332 2054 6522 -14573 -30842 18743 -29768 -37972 25491 39302 -29018 6609 12696
15679A2696j2765M1549P004j6515L148l0525J4814K3242l389L161M172p965N7490
$$ 12696 -69 41480 48484 31969 35117 4592 19406 42648 39259 42420 46592 38627 96117
15666I6117L6965q3494n7455j061O542j9222k9984k4813k0160Q237k8891J0805
$$ 96117 133082 49588 -7867 -8928 -2386 -21608 -51592 -76405 -96565 -88328 -117219 -106414
15654a06414N7373M619r118N4586M0181n300k3446m3524J9615J8111k25q7779
$$ -106414 -49041 -44422 -53540 1046 41227 35927 12481 -31043 -11428 6683 6458 -81321
15642h1321l510M2063m9976m099P1657L2755j3760l5524m2846J1174p107K5499
$$ -81321 -84831 -42768 -92744 -96843 -25186 7569 -6191 -41715 -84561 -73387 -80494 -54995
15630e4995L5092N5572n1065k8645j5794k6657m8519l0351N1134N3394J7290l0470
$$ -54995 -19903 35669 -15396 -44041 -59835 -86492 -135011 -165362 -114228 -60834 -43544 -74014
15618g4014l5414M0714Q774L9227K8745J86Q738m5741j6910j009l0096j0212n461
$$ -74014 -109428 -68714 -59940 -20713 8032 8218 16956 -28785 -45695 -46704 -76800 -87012 -92473
15605i2473j3760N6389N6402j805j5005l612l735K7243l989r108m8900m9873j299
$$ -92473 -106233 -49844 6558 4753 -10252 -13864 -17599 9644 5655 -3453 -52353 -102226 -103525
15592a03525p018n659J7675L5360N233k4258J6708K5207N0772m8482m8376J1334
$$ -103525 -110543 -116202 -98527 -63167 -57934 -82192 -65484 -40277 10495 -37987 -86363 -75029
15580g5029J8423J6891k436j3665p289N7749K4410J6893J5254n9476o002o3898
$$ -75029 -56606 -39715 -42151 -55816 -63105 -5356 19054 35947 51201 -8275 -14277 -78175
15568g8175r752Q358J6551J7920l6347L940J5675J4508J5332M8919J1745o7024
$$ -78175 -87927 -79569 -63018 -45098 -81445 -77505 -61830 -47322 -31990 16929 28674 -38350
15556c8350o2454q403P6232M5277N933m9551j974O7003j360q5909n6720K5400
$$ -38350 -100804 -109207 -32975 12302 18235 -31316 -33290 33713 32353 -53556 -110276 -84876
15544h4876N2571N5016J8447L8538o5023p1021o891L9432k2754L497K1934m1465
$$ -84876 -32305 22711 41158 79696 14673 -56348 -63239 -23807 -46561 -43064 -21130 -62595
15532f2595m0802J3082K9563R846p669L5355j4940M071m5983l8070M7093m0946
$$ -62595 -103397 -90315 -60752 -50906 -58575 -23220 -38160 -34089 -80072 -118142 -71049 -111995
15520a11995k1569P256L4802M2945j2785j3698L7502N7670L934j1606o6823m5683
$$ -111995 -133564 -126308 -91506 -48561 -61346 -75044 -37542 20128 24062 12456 -54367 -100050
15508a00050O1388R027J2570J8490j0498M557L0204Q0803J3010r8314r0093m2693
$$ -100050 -38662 -29635 -17065 1425 -9073 -4516 25688 106491 119501 21187 -68906 -111599
15496a11599L6991j5151k0680O4071L4708j4846K2392J3121K800k2272J7493n617
$$ -111599 -74608 -89759 -110439 -46368 -11660 -26506 -4114 9007 11807 -10465 7028 1411
15484A411l2633m4811Q625M5406k7721j8139j5421l0396J9289J5654O740R473
$$ 1411 -31222 -76033 -67408 -22002 -49723 -67862 -83283 -113679 -94390 -78736 -71996 -62523
15472f2523N7369r388l2920j2849K2452M8041P57p6363M5743p949k1492k657L535
$$ -62523 -5154 -14542 -47462 -60311 -37859 10182 10939 -65424 -19681 -27630 -49122 -51779 -48244
15459d8244R9308N2825k6677k2843m1971r41k1294k7345j872O3233r1329L6392
$$ -48244 51064 103889 77212 54369 12398 11457 -9837 -37182 -39054 24179 -67150 -30758
15447c0758N8653k7571n0454M887N9847l0118J8607l0626l9012j2635J5833O0127
$$ -30758 27895 324 -50130 -45243 14604 -15514 3093 -27533 -66545 -79180 -63347 -3220
15435c220O429j0495J4686l5155l0612j2795M6020O0550m6597k0183k2078k6228
$$ -3220 3209 -7286 7400 -27755 -58367 -71162 -25142 35408 -11189 -31372 -53450 -79678
15423g9678l8202L7584K719k9209O5724N5741J8230l1436k6438r1534m6115k7312
$$ -79678 -117880 -80296 -77577 -106786 -41062 14679 32909 1473 -24965 -116499 -162614 -189926
15411a89926L7215P1423J4532j6286k9169Q1853M6585o8248R658L9445L4830M1990
$$ -189926 -152711 -81288 -66756 -83042 -112211 -30358 16227 -52021 -42363 -2918 31912 73902
15399G3902M7881k5687p6787J3034L911p2295o084k9154L4155o766j7412m5492
$$ 73902 121783 96096 19309 32343 36254 -36041 -42125 -71279 -37124 -43890 -61302 -106794
15387a06794m3817l8252K5763P4807M8195L7428J6649J4273r835J134j3786M726
$$ -106794 -150611 -188863 -163100 -88293 -40098 -2670 13979 28252 18417 19551 5765 10491
15375A0491l3614K4043J2637q464m8390M4639J4612m4058P469p220J0654r2510
$$ 10491 -23123 920 13557 5093 -43297 1342 15954 -28104 -20635 -27855 -17201 -109711
15363a09711N524L6046J3894j5766K3491j4945l344N024j4863R398o925N166K4365
$$ -109711 -104187 -68141 -54247 -70013 -46522 -61467 -64811 -59787 -74650 -65252 -72177 -67011 -42646
15350d2646O7483j7698o0652j2375j0462N4034l8578m8054J1674L4424p617K5698
$$ -42646 24837 7139 -53513 -65888 -76350 -22316 -60894 -108948 -97274 -62850 -70467 -44769
15338d4769N1635K5500m709q6869J6821o609J5100J7563J4464m6282q2137j0622
$$ -44769 6866 32366 27657 -59212 -42391 -49000 -33900 -16337 -1873 -48155 -130292 -140914
15326a40914K2773O8724M1332j3878m9355m782p166M1641J7515l0969J9832m1390
$$ -140914 -118141 -49417 -8085 -21963 -71318 -76100 -83266 -41625 -24110 -55079 -35247 -76637
15314g6637L2931J4430M096j4294q560J7619M81l2809j0254J2348K0748k2537
$$ -76637 -43706 -29276 -25180 -39474 -48034 -30415 -29934 -62743 -72997 -60649 -39901 -62438
15302f2438m6526j3333N7587O0156r647m9039j4767l2778l3354M1348N2102j7089
$$ -62438 -108964 -122297 -64710 -4554 -14201 -63240 -78007 -110785 -144139 -102791 -50689 -67778
15290f7778m3048n6091P4019O8840K1929J1284j3592l222l997n0398n0210K4430
$$ -67778 -110826 -166917 -92898 -24058 -2129 9155 -4437 -7659 -11656 -62054 -112264 -87834
15278h7834q126k6367j0527M054Q2562P9850L2624p1066n1538L449M1409O0799
$$ -87834 -95960 -122327 -132854 -128800 -46238 33612 66236 -4830 -56368 -52919 -11510 49289
15266D9289k900n241r8648n3102P6060O9311L4515J8665k3363n7804M4751K9990
$$ 49289 46389 41148 -57500 -110602 -34542 34769 69284 87949 64586 6782 51533 81523
15254H1523k8362n6109L0204l608m5202k1737P60j0098N1850L748m6025M663L4043
$$ 81523 53161 -2948 27256 23648 -21554 -43291 -42531 -52629 -779 2969 -43056 -38393 -4350
15241d350K0256n9350l9589o1026j7313O1147J104o930k8102L4084O0939L927
$$ -4350 15906 -43444 -83033 -144059 -161372 -100225 -99121 -106051 -134153 -100069 -39130 -35203
15229c5203J644J7571J2193M8797m5263l5562J9422Q090M568r156L1177L1108
$$ -35203 -33559 -15988 -3795 45002 -261 -35823 -16401 -8311 -3743 -12899 18278 49386
15217D9386l0439J8681l032n0338l5142j299o5476k0373M4941L3078J4659j911
$$ 49386 18947 37628 34596 -15742 -50884 -52183 -117659 -138032 -93091 -60013 -45354 -47265
15205d7265j2781k1533K5599J3020O5258P8809j8099j7231l4963n6368j0446N1170
$$ -47265 -60046 -81579 -55980 -42960 22298 101107 83008 65777 30814 -25554 -36000 15170
15193A5170O446r7504n5410m459J03926K1968l9836j042L0774M9909m724j2175
$$ 15170 21616 -75888 -131298 -135757 -31831 -9863 -49699 -50741 -19967 29942 25218 13043
15181A3043K3858k5123J3557J4561K5534o7409m3851J427m2648N9444K3468j5562
$$ 13043 36901 11778 25335 39896 65430 -1979 -45830 -44403 -87051 -27607 -4139 -19701
15169a9701n196o6426l4226K054K382L5647j8400l422L5855N119j1989O0279O8632
$$ -19701 -24897 -91323 -125549 -123495 -121113 -85466 -103866 -107288 -71433 -66314 -78303 -18024 50608
15156E0608P488l3836l3153k4814o3065m1997p830M6639L9007k9954j9176J5722
$$ 50608 58096 24260 -8893 -33707 -96772 -138769 -146599 -99960 -60953 -90907 -110083 -94361
15144i4361N9802N3094l7373L4844K7927j9191l8775j392M9455l6668o0264l9097
$$ -94361 -34559 18535 -18838 16006 43933 24742 -14033 -15425 34030 -2638 -62902 -101999
15132a01999R098M0545j0663o2463n4778J6547L9468M9817L6047M2713l321n6007
$$ -101999 -92901 -52356 -63019 -125482 -180260 -163713 -124245 -74428 -38381 4332 1011 -54996
15120e4996r838l3612M892K2720k0873o0242P8867J09828M769n0668n711M1978
$$ -54996 -64834 -98446 -93554 -70834 -91707 -151949 -73082 36746 41515 -9153 -14864 27114
15108B7114k2445m2513o2038j2939j0015J2485K0248L4705l1626r43J2021n034
$$ 27114 4669 -37844 -99882 -112821 -122836 -110351 -90103 -55398 -87024 -87967 -75946 -80980
15096h0980k9650M4593J8178N3385J2187l8176j0844K1263J6694j3241o3296k5369
$$ -80980 -110630 -66037 -47859 5526 17713 -20463 -31307 -10044 6650 -6591 -69887 -95256
15084i5256K2828k304L1624J0114m582j5439q13L013K2100P3629j1595l1617K4487
$$ -95256 -72428 -74732 -43108 -32994 -37576 -53015 -53828 -50815 -28715 44914 33319 1702 26189
15071B6189n3697j4132J5307O8055j8032j00080K857P9680J752o7851o2844M8727
$$ 26189 -27508 -41640 -26333 41722 23690 -76390 -73533 6147 7899 -59952 -122796 -74069
15059g4069K1885K8823k931n442k253j3818q750L0055L970k626L7017k5547J2034
$$ -74069 -52184 -23361 -26292 -31734 -33987 -47805 -56555 -26500 -22530 -25156 11861 -13686 -1652
15046a652K2982j0386k4399o5829l0915P6905R8533L6210J6581q197j6183j4313
$$ -1652 21330 10944 -13455 -79284 -110199 -33294 65239 101449 118030 109833 93650 79337
15034G9337j4049k0557K2068l6835l2286K7485O2996N8419l9661q3957l4642o2625
$$ 79337 65288 44731 66799 29964 -2322 25163 88159 146578 106917 22960 -11682 -74307
15022g4307n5421O7890O5318m4422j5745M7620N8982n774p072l52m6237j1319
$$ -74307 -129728 -61838 3480 -40942 -56687 -9067 49915 44141 37069 36717 -9520 -20839
15010b0839n782k4687j4873O2783N5117k1638l6114j62j7843n0593M330K0764
$$ -20839 -26621 -51308 -66181 -3398 51719 30081 -6033 -6195 -24038 -74631 -70301 -49537
14998d9537O1275P4137m4548m8292K7491J1267j895j7019J1686n8279n8639J2525
$$ -49537 11738 85875 41327 -6965 20526 31793 29898 12879 24565 -33714 -92353 -79828
14986g9828M2865J6367L8970K1730m7649n3359K8158j2310o277N2632L2518J4898
$$ -79828 -36963 -20596 18374 40104 -7545 -60904 -32746 -45056 -51333 1299 33817 48715
14974D8715l1138l8604K4195K0439J9872L6371K9137k6066o6987n2865J7836L277
$$ 48715 17577 -21027 3168 23607 43479 79850 108987 82921 15934 -36931 -19095 -15818
14962a5818M036P0339K5316o9787K578m3205j7667K6307K0659j4492j206L9653
$$ -15818 -11782 58557 83873 14086 16664 -26541 -44208 -17901 2758 -11734 -12940 26713
14950B6713L3070L112j2927j2415n2746n0598j5729k8624L7086J6242l434j2416
$$ 26713 59783 62895 49968 37553 -15193 -65791 -81520 -110144 -73058 -56816 -60250 -72666
14938g2666j3168k3949M6511O3258L6672K2421j4408l7712k6354J2404L7271N7581
$$ -72666 -85834 -109783 -63272 -14 36658 59079 44671 6959 -19395 -6991 30280 87861
14926H7861J0566j4844j8808l5463k7737k9003j3858k0944K5694j5401L2246K1670
$$ 87861 98427 83583 64775 29312 1575 -27428 -41286 -62230 -36536 -51937 -19691 1979
14914A979j4925j796L7645K8364K2952k7564O539K9628j0597M6594J9694m7307
$$ 1979 -12946 -14742 22903 51267 74219 46655 53194 82822 72225 118819 138513 91206
14902I1206q573l1071N227o175Q238p6430k6713K5314j577N9634J392O578L9634
$$ 91206 82633 51562 56789 50614 58852 -17578 -44291 -18977 -20554 39080 40472 47050 86684
14889H6684K1543k4350j1109n5717j35566M6302Q8894j9796J6804N0784k645l7605
$$ 86684 108227 83877 72768 17051 -118515 -72213 16681 -3115 13689 64473 61828 24223
14877B4223L3311n7166n5404N769n9204M4384M558N6754L529n1214l4938O8752
$$ 24223 57534 368 -55036 -49267 -108471 -64087 -59529 -2775 754 -50460 -85398 -16646
14865a6646N9438J706J7816j9189k8376J8031L383q5751j2981O394N896j7781
$$ -16646 42792 44498 62314 43125 14749 32780 36163 -49588 -62569 -56175 -50279 -68060
14853f8060N9632K9648l7355m4394j0418n310Q106l1351L9971M6448J0542J5790
$$ -68060 -8428 21220 -16135 -60529 -70947 -76257 -68151 -99502 -59531 -13083 -2541 13249
14841A3249j610n0670k8924M9106j3538N3566O2696j8661o9674m7615K3949M4445
$$ 13249 11639 -39031 -67955 -18849 -32387 21179 83875 65214 -4460 -52075 -28126 16319
14829A6319l490p5834J3037M8353m5070n6025L7889J3224o214M0061M7244R831
$$ 16319 12829 -63005 -49968 -1615 -46685 -102710 -64821 -51597 -57811 -17750 29494 39325
14817C9325o0570J1184R762K17L3533j2003q6897M802R5536J3818k889n7060K1046
$$ 39325 -21245 -10061 -299 -82 33451 21448 -65449 -60647 34889 48707 45818 -11242 9804
14804I804l242j6944K5363k0197o432j2755n1714M5892J3778j0386m5065k1847
$$ 9804 6562 -10382 14981 -5216 -11648 -24403 -76117 -30225 -16447 -26833 -71898 -93745
14792i3745M4541K6787M0571O6460n0739j1651P682p832l7652n9224l2981K8224
$$ -93745 -49204 -22417 18154 84614 33875 22224 29906 22074 -15578 -74802 -107783 -79559
14780g9559P79J0980K1214M5248J4401m5507L6895P998m0401l1040l1105L6604
$$ -79559 -78780 -67800 -46586 -1338 13063 -32444 4451 12449 -27952 -58992 -90097 -53493
14768e3493O1098n636n0371L0611K3326m255o8428O841K9489n090l5388m0192
$$ -53493 7605 1969 -48402 -17791 5535 1280 -67148 -60307 -30818 -35908 -71296 -111488
14756a11488L6283M3977L1231J7201K8660j1820J052k0511N37k55M769L135M501
$$ -111488 -75205 -31228 3 17204 45864 34044 35096 14585 15122 14867 19636 22771 27272
14743B7272L5035j5006n7582l7877P137O8174M0332L3207o9247J2543l5644m6855
$$ 27272 62307 47301 -10281 -48158 -41021 27153 67485 100692 31445 43988 8344 -38511
14731c8511L1584K6708o1403p775J2535Q847K4672O2216J4466m897J1875p357
$$ -38511 -6927 19781 -41622 -49397 -36862 -28015 -3343 58873 73339 68442 80317 72960
14719G2960q174o6786j0950k3209M9127K4650o034L9580j1522k9829R743K1213
$$ 72960 64786 -2000 -12950 -36159 12968 37618 31584 71164 59642 29813 39556 60769
14707F0769n967m3280J9548L2723j7158J5300k296j3563P795K8130K909Q273J3105
$$ 60769 54802 11522 31070 63793 46635 61935 59639 46076 53871 82001 84910 93183 106288
14694A06288k702K3903r9317k6351J23247M1388p3471m4093j5000K4187J5489
$$ 106288 103586 127489 28172 1821 125068 166456 92985 48892 33892 58079 73568
14683G3568l6107m3698J3602l4927K1127P0720m2690J7019M242K8372R2023j7224
$$ 73568 37461 -6237 7365 -27562 -6435 64285 21595 38614 42856 71228 163251 146027
14671A46027p0386k3016p920L4179k0220J4121j0279J0562o7994N098P436m366
$$ 146027 75641 52625 44705 78884 58664 72785 62506 73068 5074 10172 17608 13242
14659A3242M3267J3867o3502l1204r39L0511q689k8448o042M8776O9465p7616
$$ 13242 56509 70376 6874 -24330 -25269 5242 -3447 -31895 -37937 10839 80304 2688
14647B688L766J4307l9764m3652O649O2426l2183K4906J0899K3813P1045j6984
$$ 2688 6454 20761 -19003 -62655 -56006 6420 -25763 -857 10042 33855 104900 87916
14635H7916k8586K1500l7151p4318J4790k6124j2965J5402J1763j388L3651j7136
$$ 87916 59330 80830 43679 -30639 -15849 -41973 -54938 -39536 -27773 -29161 4490 -12646
14623a2646k8600k5506j8844O525K3139J9873N3252P2829K5588j9130m294m0620
$$ -12646 -41246 -66752 -85596 -79071 -55932 -36059 17193 90022 115610 96480 92186 51566
14611E1566n168Q114l279j4972k0808m81Q33l8373J1540j7770M2658K6493j4148
$$ 51566 46398 54512 51233 36261 15453 14972 15805 -22568 -11028 -28798 13860 40353 26205
14598B6205j204L7212M5902K0897m3646p1283k8154O9384j8856p2276J9691M8194
$$ 26205 25001 62213 108115 129012 85366 14083 -14071 55313 36457 -35819 -16128 32066
14586C2066J3487m7832m713M1974N1448q634m1908k6429N8874J3203K920R41J8819
$$ 32066 45553 -2279 -6992 34982 86430 77796 35888 9459 68333 81536 84456 85397 104216
14573A04216K6813k9174J405m947n3034j974N0137l776K8635n60p0685o892J175
$$ 104216 131029 101855 103260 98313 45279 43305 93442 89666 118301 117741 47056 40164 41339
14560D1339j2937m0064K2267J7844P4340K2245j4505K8278k9060q4591n3936N4673
$$ 41339 28402 -11662 10605 28449 102789 125034 110529 138807 109747 25156 -28780 25893
14548B5893J968Q2267P7792R354q1648j06052l4395L3847J804r2433j696Q6172
$$ 25893 27861 110128 187920 197274 115626 9574 -24821 9026 10830 -81603 -83299 2873
14536B873p40n5777K4475Q8795j6587J5680l425j2533r8959j9383k6844J7631
$$ 2873 2133 -53644 -29169 59626 43039 58719 55294 42761 -56198 -75581 -102425 -84794
14524h4794M0731l516P5449L3410j8033k5476M3147K7989l0250p1591k4270M1691
$$ -84794 -44063 -47579 27870 61280 43247 17771 60918 88907 58657 -12934 -37204 4487
14512D487K0725J7775N5236L9919K0063n4641l3178L9527l4171k3415L1513k5759
$$ 4487 25212 42987 98223 138142 158205 103564 70386 109913 75742 52327 83840 58081
14500E8081j7706K6432K18n8318n9827l0200L4862R5606J10734L1579o1863k4795
$$ 58081 40375 66807 67025 8707 -51120 -81320 -46458 49148 159882 191461 129598 104803
14488A04803L0093j4577r2565j1409N16l1580N5858N3162J9722J2778K8612k3570
$$ 104803 134896 120319 27754 16345 16861 -14719 41139 94301 114023 126801 155413 131843
14476A31843l5152m4376q8231j388L1864Q2141L4131K4967O511m4576n3172l3629
$$ 131843 96691 52315 -35916 -37304 -5440 76701 110832 135799 142310 97734 44562 10933
14464A0933K3495k4023l2352K9945N4100N4354N914n5057J8738j3971j2905K7153
$$ 10933 34428 10405 -21947 7998 62098 116452 122366 67309 86047 72076 59171 86324
14452H6324J213l8429M3349j179k0422n2591k8918k6415l7575K3070L2459j6977
$$ 86324 87537 49108 92457 91278 70856 18265 -10653 -37068 -74643 -51573 -19114 -36091
14440c6091k506L2783Q4004Q5768L3144m1766m5627l7811r040L8919K6295m808
$$ -36091 -38597 -5814 78190 163958 197102 155336 109709 71898 62858 101777 128072 123264
14428A23264m7400o1980K0039P3510k3558l7911N7118L1110j3943q0996K3487
$$ 123264 75864 13884 33923 107433 83875 45964 103082 134192 120249 39253 62740
14417F2740J2948j0319M3173J9119m8550l6115L7019M430m1505J2655M7015k7606
$$ 62740 75688 65369 108542 127661 79111 42996 80015 84445 42940 55595 102610 75004
14405G5004j18364J2932J15767K8652n6143l0191P063M0076K7987l2607L0482
$$ 75004 -43360 -30428 85339 113991 57848 27657 34720 74796 102783 70176 100658
14394A00658p594J1319k0329M76L8275K4446J5292o672M076p2373m9562l669M648
$$ 100658 93064 104383 84054 84530 122805 147251 162543 155871 159947 87574 38012 34343 38991
14381C8991N481j164o371J0726N2655l8325m0813j5638L3351L6240J1771j4994
$$ 38991 44472 43308 36937 47663 100318 61993 21180 5542 38893 75133 86904 71910
14369G1910k31M2094O8692k4380m2995j9442Q2127q22o6343k7334n818k2281j0847
$$ 71910 71679 113773 182465 158085 115090 95648 177775 176953 110610 83276 77458 55177 44330
14356D4330l8438Q3320K9913K0951N602l4688J4019J3829k104J7421k8536J6512
$$ 44330 5892 89212 119125 140076 145678 110990 125009 138838 136734 154155 125619 142131
14344A42131k2003P333K5076J3244J2399k8272O72k1174k1221m7235j0548Q1118
$$ 142131 120128 127461 152537 165781 178180 149908 150580 129406 108185 60950 50402 131520
14332A31520M4123J7397m9829n3568m0795o106n1092K952M6746Q787m0816L0568
$$ 131520 175643 193040 143211 89643 48848 42742 -8350 -5398 41348 50135 9319 39887
14320C9887K1921k3558r530L976P6409K7243J2969J6542o5523k3244L5001J0240
$$ 39887 61808 38250 28720 32696 109105 136348 149317 165859 100336 77092 112093 122333
14308A22333o657l7009n7566K2476N5993K4311m2113q1491N8807R3592N629n3501
$$ 122333 115676 78667 21101 43577 99570 123881 81768 277 59084 152676 158305 104804
14296A04804l8958L4918O919k2752Q978n4226K6439O8324m984O717P547n3293
$$ 104804 65846 100764 107683 84931 93909 39683 66122 134446 129462 136179 143726 90433
14284I0433p5948j2706p5L6204l976J7321q694k3313J5112J2369L9101O0003M4675
$$ 90433 14485 1779 1704 37908 33932 51253 42559 19246 34358 46727 85828 145831 190506
14271A90506k5903J1075n6746q8914Q397N4489K1994M2132O270j9639j9684k9245
$$ 190506 164603 175678 118932 30018 38415 92904 114898 157030 163300 143661 123977 94732
14259I4732L8098Q116K7199q176K340p941j303l721j0138L4576k752j4793j1574
$$ 94732 132830 140946 168145 159969 162309 154368 153065 149344 139206 173782 171030 156237 144663
14246A44663j9282k59k2528O6760l814m8545N9505k691m5190J9062j2371l201
$$ 144663 125381 125122 102594 169354 165540 116995 176500 173809 128619 147681 135310 132109
14234A32109k8514j6856P2776k9310o6381L7647N0554P2303n3146j7718n920K9532
$$ 132109 103595 86739 159515 130205 63824 101471 152025 224328 171182 153464 147544 177076
14222A77076l6478m300J5443L257Q998J2388n9681q1304k7756N1012O1394L9257
$$ 177076 140598 136298 151741 154998 163996 176384 116703 35399 7643 58655 120049 159306
14210A59306J2046p354R014K3446R833m9112k6235l5593k3690L4034M3303P692
$$ 159306 171352 163998 173012 196458 206291 157179 130944 95351 71661 105695 148998 156690
14198A56690M449j0827M349m5383p2741k1262M3622N2480r834M2616N9440o5222
$$ 156690 161139 150312 154661 109278 36537 15275 58897 111377 101543 144159 203599 138377
14186A38377o5051L6213J00904j4241m0747K1931l46k9754q865p243J0779m5881
$$ 138377 73326 109539 210443 196202 155455 177386 177040 147286 138421 131178 141957 96076
14174I6076j4031O5996L9862k4993K1184M8440M3010n8545k8795n8570L8700M4928
$$ 96076 82045 148041 187903 162910 184094 232534 275544 216999 188204 129634 168334 213262
14162B13262k2528l7053N728M574j0064J8254J468K2608M5828N2488J143m9706
$$ 213262 190734 153681 159409 163983 153919 172173 173641 196249 242077 294565 295708 246002
14150B46002L438L3379k0646O5315R3425k4508r215n099m5940k3116j1029M0271
$$ 246002 249440 282819 262173 327488 420913 396405 387190 382091 336151 313035 302006 342277
14138C42277O22m8542k0864J6357l1269J3201L0536m546m0822Q696j9489k1167
$$ 342277 342899 294357 273493 289850 258581 271782 302318 297772 256950 265646 246157 224990
14126B24990k6666J9583M3405K0193N4961n4644p5998l5695M35N2523K6229j0009
$$ 224990 198324 217907 261312 281505 336466 281822 205824 170129 170564 223087 249316 239307
14114B39307j2931N595J8083l5299M4046M4943o886r142o430K5697q1811j0176
$$ 239307 226376 231971 250054 214755 258801 303744 296858 287716 281286 306983 225172 214996
14102B14996P463m8870L3830L8026K4764k6525j0457K8847M9558L8874m1156j5976
$$ 214996 222459 173589 207419 245445 270209 243684 233227 262074 311632 350506 309350 293374
14090B93374j5518l3327l5353k0928O833j5506j0078K0754K0875K3260P7410M9409
$$ 293374 277856 244529 209176 188248 195081 179575 169497 190251 211126 234386 311796 361205
14078C61205O119l1368p12j1521j2271K8226o986n0715M9056L4277O788k3442
$$ 361205 367324 335956 335244 323723 311452 339678 332692 281977 331033 365310 372098 348656
14066C48656k5088K6796J1234P1810K0791q7067m6795l3049k325l750n1888j5885
$$ 348656 323568 350364 361598 433408 454199 367132 320337 287288 284963 281213 229325 213440
14054B13440L0360O254K6114p5623l1185N5380L1378R894k3769M8986O7421O4558
$$ 213440 243800 250054 276168 200545 169360 224740 256118 266012 242243 291229 358650 423208
14042D23208k508p1335m1057k7872K7958K222k0465m1777m822R1830N9535J7110
$$ 423208 420700 349365 308308 280436 308394 310616 290151 248374 243552 335382 394917 412027
14030D12027k7453m112J8946J4364P029j8683m2628L7870j2718l544K0541M885
$$ 412027 384574 380462 399408 413772 420801 402118 359490 397360 384642 381098 401639 406524
14018D06524M1698k5259J7243L317k9924n624l5306K4483J6066K8505l7637M5
$$ 406524 448222 422963 440206 443523 413599 407975 372669 397152 413218 441723 404086 404131
14006D04131L4066k0763n0895l4155l4184K9947K8886J7197O752j655n4086n2567
$$ 404131 438197 417434 366539 332384 298200 328147 357033 374230 380982 379327 325241 272674
$$ [...]
##END NTUPLES=NMR SPECTRUM
##END=
