##TITLE=Analysis number 324940
Compound Code sb 01014
Book Reference a
Project Code adrs
Chemist Name ians
##JCAMPDX= 6.0         $$ Bruker NMR JCAMP-DX V2.0
##DATA TYPE= NMR SPECTRUM
##DATA CLASS= NTUPLES
##ORIGIN= Bruker BioSpin GmbH
##OWNER= nmr
$$ XWIN-NMR		Version 3.5
$$ Tue Dec  5 14:45:19 2006 GMT Standard Time (UT+0h)  MAYBRIDGE\nmr@NMR_250MHZ
##.OBSERVE FREQUENCY= 250.131544655141
##.OBSERVE NUCLEUS= ^1H
##.ACQUISITION MODE= SIMULTANEOUS (DQD)
##.ACQUISITION SCHEME= undefined
##.AVERAGES= 16
##.DIGITISER RES= 18
##SPECTROMETER/DATA SYSTEM= dpx250
##.PULSE SEQUENCE= zg30
##.SOLVENT NAME= CDCl3
##.SHIFT REFERENCE= (INTERNAL, CDCl3, 0, 16.4507)
##AUDIT TRAIL= $$ (NUMBER, WHEN, WHO, WHERE, WHAT)
$$ ##TITLE= Audit trail, XWIN-NMR		Version 3.5
$$ ##JCAMPDX= 5.01
$$ ##ORIGIN= Bruker BioSpin GmbH
$$ ##OWNER= nmr
$$ C:\u/data/dgb/nmr/ADRS/370/pdata/1/auditp.txt
$$ ##AUDIT TRAIL=  $$ (NUMBER, WHEN, WHO, WHERE, WHAT)
(   1,<2006-12-05 14:44:51.88 +000>,<MAYBRIDGE\nmr>,<NMR_250MHZ>,
      <created by zg, POWCHK disabled, PULCHK disabled
       configuration hash MD5:
       49 4B E0 1D 92 C2 6B 37 9F E6 65 BC 52 41 86 1D
       data hash MD5: 64K
       6B 37 9A 4A 2E B5 0E 3B AC 0B 68 C5 3B EB 75 80>)
(   2,<2006-12-05 14:45:09.36 +000>,<MAYBRIDGE\nmr>,<NMR_250MHZ>,
      <Start of raw data processing
       ef LB = 0.3 FT_mod = 6 PKNL = 1 SI = 32K 
       data hash MD5: 32K
       FF D1 92 BC 77 DB 55 1B 72 14 C2 42 89 E2 13 A1>)
(   3,<2006-12-05 14:45:11.25 +000>,<MAYBRIDGE\nmr>,<NMR_250MHZ>,
      <apk 
       data hash MD5: 32K
       DD 24 E5 F4 08 0B 17 A6 8E 5D 7A ED 96 D4 6C C9>)
(   4,<2006-12-05 14:45:11.97 +000>,<MAYBRIDGE\nmr>,<NMR_250MHZ>,
      <abs ABSG = 5 
       data hash MD5: 32K
       D8 04 4E 24 6F 2A EC ED C9 81 88 A0 01 DD 4A 02>)
$$ ##END=
$$ 
$$ hash MD5
$$ CA 8D AC 23 6B A7 65 F3 7A 0B 56 9C 5D 3C FE C0
##$RELAX= 
##$RELAX= 
##$RELAX= 
##$RELAX= 
##$RELAX= 
##$RELAX= 
##$RELAX= 
$$ Bruker specific parameters
$$ --------------------------
##$DU= <C:\u>
##$EXPNO= 370
##$NAME= <ADRS>
##$PROCNO= 1
##$TYPE= <nmr>
##$USER= <dgb>
##$AMP= (0..31)
100 100 100 100 100 100 100 100 100 100 100 100 100 100 100 100 100 100 
100 100 100 100 100 100 100 100 100 100 100 100 100 100 
##$AQSEQ= 0
##$AQ_mod= 3
##$AUNM= <au_zg>
##$AUTOPOS= <57 >
##$BF1= 250.13
##$BF2= 250.13
##$BF3= 250.13
##$BF4= 250.13
##$BF5= 500.13
##$BF6= 500.13
##$BF7= 500.13
##$BF8= 500.13
##$BYTORDA= 1
##$CFDGTYP= 0
##$CFRGTYP= 5
##$CHEMSTR= <none>
##$CNST= (0..31)
1 1 145 1 1 1 1 1 1 1 1 1 1 1 1 1 1 1 1 1 1 1 1 1 1 1 1 1 1 1 1 1 
##$CPDPRG= <>
##$CPDPRG1= <>
##$CPDPRG2= <>
##$CPDPRG3= <>
##$CPDPRG4= <mlev>
##$CPDPRG5= <mlev>
##$CPDPRG6= <mlev>
##$CPDPRG7= <mlev>
##$CPDPRG8= <mlev>
##$CPDPRGB= <>
##$CPDPRGT= <>
##$D= (0..31)
0 1 0 0 0 0 0 0 0 0.06 0 0 0 0 0 0 0.0002 0 0 0 0 0 0 0 0 0 0 0 0 0 0 
0 
##$DATE= 1165329890
##$DBL= (0..7)
120 120 120 120 120 120 120 120 
##$DBP= (0..7)
150 150 150 150 150 150 150 150 
##$DBP07= 0
##$DBPNAM0= <>
##$DBPNAM1= <>
$$ [...]
##$SUBNAM7= <"">
##$SUBNAM8= <"">
##$SUBNAM9= <"">
##$SW= 20.6930455092707
##$SWIBOX= (0..15)
0 0 3 0 0 0 0 0 0 0 0 0 0 0 0 0 
##$SW_h= 5175.983436853
##$TD= 65536
##$TD0= 1
##$TE= 294.16
##$TE2= 300
##$TE3= 300
##$TEG= 300
##$TL= (0..7)
0 120 120 120 120 120 120 120 
##$TP= (0..7)
150 150 150 150 150 150 150 150 
##$TP07= 0
##$TPNAME0= <>
##$TPNAME1= <>
##$TPNAME2= <>
##$TPNAME3= <>
##$TPNAME4= <>
##$TPNAME5= <>
##$TPNAME6= <>
##$TPNAME7= <>
##$TPOAL= (0..7)
0.5 0.5 0.5 0.5 0.5 0.5 0.5 0.5 
##$TPOFFS= (0..7)
0 0 0 0 0 0 0 0 
##$TUNHIN= 0
##$TUNHOUT= 0
##$TUNXOUT= 0
##$USERA1= <user>
##$USERA2= <user>
##$USERA3= <user>
##$USERA4= <user>
##$USERA5= <user>
##$V9= 5
##$VALIST= <valist>
##$VCLIST= <CCCCCCCCCCCCCCC>
##$VD= 0
##$VDLIST= <DDDDDDDDDDDDDDD>
##$VPLIST= <PPPPPPPPPPPPPPP>
##$VTLIST= <TTTTTTTTTTTTTTT>
##$WBST= 1024
##$WBSW= 4
##$XGAIN= (0..3)
0 0 0 0 
##$XL= 0
##$YL= 0
##$YMAX_a= 122430
##$YMIN_a= -346807
##$ZGOPTNS= <>
##$ZL1= 120
##$ZL2= 120
##$ZL3= 120
##$ZL4= 120
##$ABSF1= 16.45066
##$ABSF2= -4.242512
##$ABSG= 5
##$ABSL= 3
##$ALPHA= 0
##$AQORDER= 0
##$ASSFAC= 0
##$ASSFACI= 0
##$ASSFACX= 0
##$ASSWID= 0
##$AUNMP= <proc_1d>
##$AZFE= 0.1
##$AZFW= 0.1
##$BCFW= 0
##$BC_mod= 0
##$BYTORDP= 0
##$COROFFS= 0
##$CY= 12.5
##$DATMOD= 1
##$DC= 0
##$DFILT= <>
##$DTYPP= 0
##$F1P= 14.0000005364418
##$F2P= -0.99999901652339
##$FCOR= 0.5
##$FTSIZE= 32768
##$FT_mod= 6
##$GAMMA= 0
##$GB= 0
##$INTBC= 1
##$INTSCL= 1
##$ISEN= 128
##$LB= 0.3
##$LEV0= 0
##$LPBIN= 0
##$MAXI= 10000
##$MC2= 0
##$MEAN= 0
##$ME_mod= 0
##$MI= 0
##$NCOEF= 0
##$NC_proc= -5
##$NLEV= 6
##$NOISF1= 0
##$NOISF2= 0
##$NSP= 0
##$NTH_PI= 0
##$NZP= 0
##$OFFSET= 16.45066
##$PC= 1
##$PHC0= 225.9735
##$PHC1= 13.9272
##$PH_mod= 1
##$PKNL= yes
##$PPARMOD= 0
##$PSCAL= 4
##$PSIGN= 0
##$REVERSE= no
##$SF= 250.130017842562
##$SI= 32768
##$SIGF1= 0
##$SIGF2= 0
##$SINO= 400
##$SIOLD= 32768
##$SREGLST= <1H.CDCl3>
##$SSB= 0
##$STSI= 32768
##$STSR= 0
##$SW_p= 5175.98343685301
##$SYMM= 0
##$S_DEV= 0
##$TDeff= 65536
##$TDoff= 0
##$TI= <Analysis number 999999
Compound Code 99
Book Reference 9
Project Code 9>
##$TILT= no
##$TM1= 0
##$TM2= 0
##$TOPLEV= 0
##$USERP1= <user>
##$USERP2= <user>
##$USERP3= <user>
##$USERP4= <user>
##$USERP5= <user>
##$WDW= 1
##$XDIM= 32768
##$YMAX_p= 384213777
##$YMIN_p= -692736
$$ End of Bruker specific parameters
$$ ---------------------------------
##NTUPLES= NMR SPECTRUM
##VAR_NAME=  FREQUENCY,     SPECTRUM/REAL,   SPECTRUM/IMAG
##SYMBOL=    X,             R,               I
##VAR_TYPE=  INDEPENDENT,   DEPENDENT,       DEPENDENT
##VAR_FORM=  AFFN,          ASDF,            ASDF
##VAR_DIM=   32768,         32768,           32768
##UNITS=     HZ,            ARBITRARY UNITS, ARBITRARY UNITS
##FACTOR=    0.157963299565203, 1,           1
##FIRST=     4114.80405580526, 0,            0
##LAST=      -1061.17938104775, 0,           0
##MIN=       -1061.17938104775, -692736,     0
##MAX=       4114.80405580526, 384213777,    0
$$ Real data points
##PAGE= N=1
##DATA TABLE= (X++(R..R)), XYDATA
$$ [...]
24595A68055K6177j57181j56977M1993p8379Q812Q4284J8095N1051J03388L037
24584A12355N8915J00841j41723q4153J25794Q1726p1732l298p1828n8272k6572
24573B2053l425O0056q3491j38730n6146J31798N7459n7722J25323R1099p5828
24562G2446K9784J13224k49921k33469K09082J14634j14393P9837K65272O882
24552B93378k03117k08977l751j1712K1141j03579L8094J45561P8247K9029l2985
24541D1329j47888R7726R5901p6281n7704j0488j57146j3656Q5890M123j37765
24530b75959J0807k9417P2923K95996N2224r1989k9778M2815q4699j0679K20100
24519A72344J48461j0223j21749M1281r930o2947j45415J69874P4595j45737k5722
$$ y = [168055, 194232, 37051, -119926, -77933, -156312, -147500, -63216, -45121, 5930, 109318, 112355, 171270, 272111, 130388, 46235, 172029, 253755, 182023, 178725, 106897, 48625, 22053, 18628, 78684, -4807, -143537, -199683, -67885, -10426, -68148, 57175, 148274, 72446, 102230, 215454, -34467, -267936, -58854, 55780, -58613, 21224, 286496, 293378, 90261, -118716, -122467, -134179, -113038, -216617, -178523, -32962, 45285, 74314, 41329, -106559, -8833, 87068, 10787, -46917, -57405, -214551, -228207, -142317, -138194, -275959, -265152, -294569, -221646, 74350, 126574, 34585, 4807, 47622, -37077, -47756, 172344, 320805, 310582, 188833, 230114, 220184, 157237, 11822, 181696, 256291, 110554, 84832]
24508H4832J9530L0240J07685j27399n3o0010l3777J6256Q4219r6916l6136J13827
24496A02298J1436o1300J9236J22924L9867L8691l1109k53181j50456J07621J34395
24485H0422J92217M6093j8110l8148j09628j02804m6434j49522L5000p6363J35283
24474e1994K92354J52247J9695j02174j73684m8020L6573k7436j58319o5606N3619
24463g2745M3376j1650j13724j45525L7992N8137J79337R666M853l1427L509J50570
24451A12369l3899j76330o1751j79505J8492J31214N2935k13720m6310J56368
24441b40137J44770J84696J13745o027j3162j49017K7759j32537R7149n0490j41550
24430a64801J3720P5796M3093J55976J9963m3707L8801n8427k34882k03400K4391
$$ y = [84832, 104362, 134602, 242287, 114888, 114835, 54825, 21048, 37304, 121523, 24607, -11529, 102298, 113734, 52434, 71670, 194594, 234461, 273152, 242043, -11138, -161594, -53973, 80422, 272639, 318732, 300622, 262474, 152846, 50042, 3608, -145914, -110914, -187277, -51994, 240360, 392607, 412302, 310128, 136444, 88424, 124997, 97561, -60758, -126364, -72745, -29369, -41019, -154743, -300268, -262276, -204139, -24802, -15136, -10283, -41710, -38201, 112369, 78470, -97860, -159611, -339116, -320624, -189410, -136475, -350195, -396505, -240137, -95367, 89329, 203074, 197047, 183885, 34868, 62627, -69910, 27239, -23251, -164801, -151081, -75285, -32192, 123784, 143747, 100040, 138841, 80414, -154468, -357868, -333477]
24419c33477L24431J85425j41878j42314M930M1484O4730R0374M6576J389J05836
24408B47506p0387k99362q2262K08390O3080p0306M0893J08428j04891k06512
24398a65423j0287J37259J04969j3568l9085k40726k31247O8834J91629J17001
24388h0644n8674Q8503O8727L5579J20275m3844O974j09540j54250K2493o6780
24377a71181r7223J19291J22502Q172J54789o9506o7519M299O0671J40674Q720
24366B13689j03517N4197m1889N8186j20945o8883Q5045p7790l5096o6003P957
24355i5049J05164R0165n5934m5667l2179j16992J9081P0291o382L3975N230j57776
24343a86073O8361l2196j08703k621M1444J52953O2548l8550k4492l8667L9241
$$ y = [-333477, -9046, 176379, 34501, -107813, -102883, -61399, 3331, 93705, 140281, 141670, 247506, 177119, -122243, -204505, 3885, 66965, -3341, 37552, 145980, 41089, -165423, -175710, -38451, 66518, 52950, 13865, -226861, -458108, -389274, -197645, -80644, -139318, -50815, 17912, 53491, 173766, 129922, 136896, 27356, -126894, -104401, -171181, -268404, -149113, -26611, -18439, 136350, 66844, -675, 3624, 64295, 204969, 213689, 110172, 164369, 122480, 180666, 59721, -9162, 75883, -1907, -37003, -103006, -95049, 10115, 100280, 44346, -1321, -33500, -150492, -131411, -61120, -67502, -33527, -28297, -186073, -117712, -149908, -258611, -261232, -219788, -66835, -4287, -42837, -67329, -105996, -66755]
24332f6755J19643K42308J3995m4194k2944Q1666P292n971m0414j06764r6862
24321H1000O1567J16733n76j03991l1666L4525l0502J27204j01549k57228j9160
24310a23643Q3486j20904k881q5525j03489Q7545K32568J1231j29134J1525m3812
24299a83033l3012O3739M3808N298Q9094R779J80653k13580p7234J12335N5425
24288E3272j18749o6466P5662r8666p1212N9641N1822j42111k5296P6852J56822
24277d8429j0696n4705j5481J27320Q5261o0974k8086J05248k3136j7893N370
24266F3799j9266j2298Q4467R0901j78198k40657k7254Q0633M3956l1535k0060
24255a65512J34817l5203r8161L3740P4356P5830j51837j00972p3470J78252q6018
$$ y = [-66755, 52888, 295196, 309191, 264997, 242053, 323719, 331011, 325040, 284626, 177862, 81000, 142567, 259300, 258724, 154733, 123067, 157592, 127090, 254294, 152745, -104483, -123643, -40157, -161061, -163942, -249467, -352956, -265411, -32843, -21612, -150746, -139221, -183033, -216045, -152306, -108498, -103200, -14106, -4327, 176326, -37254, -114488, -2153, 53272, -65477, -131943, -56281, -154947, -226159, -166518, -114696, -256807, -282103, -205251, -48429, -59125, -113830, -129311, -1991, 83270, 22296, -5790, 99458, 76322, 58429, 63799, 44533, 32235, 116702, 207603, 29405, -211252, -238506, -157873, -113917, -145452, -165512, -30695, -65898, -164059, -130319, -55963, 19867, -131970, -232942, -306412, -128160, -214178]
24244b14178l6785J55045J9454O7352k76967r7205L5764p0119J9233J82534J86070
24233b9802K3364o6884k54158k84151M8260K97751N5115K9257k3614J9792K2184
24222a62886J67779Q6969J84990N4072k32409k33010j9540J41878J747p5211N5008
24211c0613R2264N0029r5366j14577p7268J31834K35870j4004J60732J95466k40147
24200B94220k60834l4467L4460L7383n5008q5124J71676J02891K8079L0823Q4629
24189C48728r1376k80580p1807J65269L7079j16867M2672J3307p0787R580J96771
24178A81989O3041r6173j90030p6403l9944l0447q054L0516R9102K98601P9896
24167C12094j07291k63009k09252j56307J54339P1482j7526N5041L7504l9097
$$ y = [-214178, -250963, -95918, -76464, -9112, -286079, -383284, -347520, -417639, -398406, -215872, -29802, -6438, -73322, -327480, -611631, -563371, -265620, -210505, -181248, -204862, -185070, -162886, 4893, 91862, 276852, 330924, 98515, -134495, -154035, -12157, -10410, -85621, -30613, 61651, 111680, 16314, -98263, -175531, -43697, 192173, 178169, 338901, 534367, 294220, 33386, -1081, 33379, 70762, 15754, -69370, 102306, 205197, 233276, 264099, 348728, 257352, -23228, -95035, 70234, 107313, -9554, 33118, 46425, -24362, -14782, 181989, 245030, 148857, -41173, -117576, -157520, -187967, -196021, -165505, -66403, 232198, 312094, 204803, -58206, -267458, -423765, -269426, -197944, -215470, -160429, -122925, -162022]
24157a62022K211N1003q4060l6264M2123r0674K12171R0332O3127l1334n703j6110
24145C4800j18577Q9640M3108q7034r4105k7602K6142m2703J55184J61733J8792
24134A59378Q9922l3872j13549J05939J07522q9396j11116j14157K9222m9767
24124a9874Q4737M6635L966R4800j04365O38J30350r1032j68881l1117J77287
24113A23144j09160j22984J23764J04292l3470n0536J53302q6576n1532M9081
24103I9325q018l7071P171K4236P7849O4601n0497j65456P1666O1716M262k08993
24091e9209P2735J14347N5815q3105J50590N98M6188p7353k23672j40244J9181
24080a24129J24730J24995l2790j6463l6664l1999o752k1591j9933P7402P5013
$$ y = [-162022, -159811, -108808, -192868, -229132, -187009, -277683, -65512, 24820, 87947, 56613, 50910, 34800, -83777, 5863, 48971, -38063, -132168, -159770, -133628, -176331, -21147, 140586, 159378, 249300, 215428, 101879, 207818, 315340, 225944, 114828, 671, 29893, -19874, 64863, 111498, 115464, 210264, 105899, 106537, 236887, 145855, -23026, -54143, 123144, 13984, -109000, 14764, 119056, 85586, 35050, 188352, 101776, 50244, 99325, 91307, 54236, 61407, 85643, 163492, 228093, 177596, 12140, 83806, 145522, 149784, -59209, 13526, 127873, 183688, 100583, 251173, 251771, 297959, 220606, -3066, -143310, -124129, 601, 125596, 92806, 76343, 39679, 7680, 928, -20663, -40596, 36806, 111819]
24069A11819n6197R4607j21646p9273J26206R6360j38393p7066M8144M6991j03608
24058e2056l326K5246n1460r7386Q6682j9500q7929O8989J34040k3089m2251O5818
24046C778k60930Q572J58530j42516q9964K18345K4990J30632l2402m1093J76810
24035A54752j44726L9485K2669m1690l246m7584J7425J2320J38326K25233j38459
24024B34505q8173K5924L2196P101j01462p3854j72060r4655n118o5012O8775
24013b31833J40913J41473J63069Q9957j06901k02001n4338j22065p849J33268
24003e6307o023N1103L3836R7997n3182P3918j40226m6904J20894O4656K6104
23992A65866j41629j43594l9371q9402n8326J05233K7932J39155J29651j35824
$$ y = [111819, 55622, 150229, 28583, -50690, 75516, 171876, 33483, -43583, 4561, 51552, -52056, -55382, -30136, -81596, -178982, -92300, -111800, -199729, -130740, 3300, -19789, -62040, 3778, -257152, -248580, -90050, -232566, -322530, -104185, -79195, 51437, 19035, -22058, 154752, 10026, 49511, 72180, 30490, 27244, -20340, -2915, 9405, 147731, 372964, 234505, 146332, 172256, 204452, 211553, 110091, 36237, -135823, -230478, -235596, -300608, -231833, -90920, 50553, 213622, 303579, 196678, -5323, -59661, -181726, -189575, -56307, -62330, -11227, 22609, 120606, 67424, 141342, 1116, -45788, 75106, 139762, 165866, 24237, -119357, -158728, -248130, -306456, -201223, -173291, -34136, 95515, -40309]
23982d0309l6504k08404R8423J52710l656N789j57667j85620J19507N1439M2185
23971a62107J01414J02945J5286q2090l806l5707m4900L3175l1657p3747M0687
23960a40507P0857k13440j00146J91257l2036J86480M2149p8675m491J27142J57840
23949B06430n9110j7454L8631K1590p114q5668j32389r3627l1006K3090K1819
23938a14808P6050K0419q568K8072m0398M283J06191J3001l3748k33003n9640
23927b42149J36809J56480J02077n6048J60749m5637p4457M5085J30508q7434
23917B25983q8549j8021J1660m3459j4293K8244M1984j91087j22381K29343J61028
23906B20452K0152L2801p8430q7923p2420J59742O4289m2856j57811j52350r4058
$$ y = [-40309, -76813, -285217, -186794, -34084, -37740, -31951, -189618, -375238, -255731, -204292, -162107, -60693, 42252, 57538, -24552, -28358, -64065, -108965, -75790, -107447, -181194, -140507, -69650, -283090, -383236, -191979, -224015, -37535, 4614, -74061, -78552, 48590, 206430, 147320, 129866, 168497, 190087, 182973, 97305, -35084, -128711, -159717, -136627, -114808, -38758, -18339, -26907, 1165, -39233, -34950, 71241, 84242, 50494, -182509, -242149, -105340, 51140, 153217, 97169, 257918, 212281, 137824, 182909, 313417, 225983, 137434, 119413, 131073, 87614, 73321, 101565, 143549, -47538, -169919, 59424, 220452, 240604, 273405, 194975, 107052, 34632, 194374, 258663, 215807, 57996, -94354, -188412]
23895a88412O1840q560j42676l2364P6256J10826R8799K3346O035j5599R9699
23884H9190p4719P1318P2799J06925r451k83265k80059P3705J16150J690L2812
23873h2905r2538p0374R4765M4623O2090J08276l6578k26413J1551J14290p9195
23862a52408P7123J86650O7056k1476k28342j22752Q5054J4106m2283J48127L504
23851A4359k2177n7418j32645Q1779J31679N9605k8962K8509j23095n4842Q8307
23840a4901J26044p3733O4889K5845j95374p6707M4258o694j28880j02993J93282
23829a44964K38363q0894N8310J33548n4698l5382J62106q0370j7853L177j9722
23818A61621P0160k4186q7588j52033J05573N9239q9251j36023J4759k344K798
$$ y = [-188412, -126572, -135132, -277808, -310172, -233916, -123090, -24291, -945, 5090, -10509, 89190, 14471, 85789, 158588, 265513, 256062, -27203, -307262, -233557, -117407, -115717, -82905, -175443, -245817, -151052, -106429, -44339, 63937, 27359, -199054, -187503, -73213, -152408, -75285, 111365, 178421, 156945, -71397, -194149, -109095, -94989, -137272, 10855, 14359, -7818, -65236, -197881, -116102, 15577, 75182, 46220, 74729, -48366, -103208, -14901, 111143, 37410, 102299, 128144, -67230, -143937, -99679, -106373, -235253, -338246, -144964, 93399, 12505, 70815, 204363, 149665, 114283, 276389, 196019, 178166, 181343, 161621, 231781, 207595, 120007, -32026, 73547, 132786, 43535, -92488, -77729, -80073, -77275]
23807g7275J32328J79745k9292m1046j07839k9658m2181m3498R1750n8645r6453
23796a22064j2640n6959n366J25483P4835M021k5485J44739J9448l4981j4694
23785I6337J10700o5074n3630K3931Q0343k6674J097j48045k66842j11787Q1483
23774b78161j19876J08534J20435q4598j80L07011J1526n8813J1558O6052N2963
23763A36451O7037m2382j25394q4164L111J29700R9770P1865J0423j51404n6008
23752E9005k18437j44951J73563J78745k2981R350L4559O1448j9453R4939N9967
23741B65754m05j03484j06379k25985J0147R8175K25018o3695L1557j39523q8369
23730i7189j3763q7248j31263N1161j11057L871J22635Q1468o888q5111J40758
$$ y = [-77275, 55053, 234798, 205506, 164460, 56621, 26963, -15218, -58716, 33034, -25611, -122064, -134704, -191663, -197029, -71546, 3289, 7310, -18175, 126564, 146012, 111031, 96337, 207037, 141963, 88333, 112264, 192607, 165933, 167030, 18985, -247857, -359644, -278161, -398037, -289503, -169068, -253666, -253846, 53165, 64691, 5878, 17436, 83488, 136451, 203488, 161106, 35712, -48452, -45341, 84359, 184129, 255994, 266417, 115013, 59005, -159432, -304383, -130820, 47925, 24944, 34294, 68853, 130301, 110848, 205787, 265754, 265349, 161865, 55486, -170499, -160352, -62177, 162841, 99146, 130703, -8820, -97189, -110952, -198200, -329463, -278302, -389359, -385488, -262853, -181385, -188273, -273384, -132626]
23719a32626O9035Q0564o4611k08288j44501J61478N39n971J52297M5060m3946
23708i0970J66058J62069J17798j55357k08850K4427r887j21151J02524J06055
23698I2716p6346j6225o761p409O0070p0145o7329K27571k6019j87597l102k9016
23686a09592P8046J45862P8858j8984M5744m8570o6632r7265K7603L8688j14535
23675d0777L1759o419Q9884j21380j9038O5919J4396k8884k9275N998R2168j04397
23663e0046j08454Q014m2226N1953P6385k8149j71715j31123Q9625J85531J98178
23652G7973R144o559j55996k13488K6860J13233m8018q7108O5753J54297Q1222
23641A7313n2224j1283Q2443J18043j16459j09118m8650o7872J2374L240J32637
$$ y = [-132626, -63591, 16973, -47638, -255926, -400427, -238949, -238410, -244381, -92084, -47024, -90970, 75088, 237157, 354955, 199598, -9252, 15175, 5288, -115863, -13339, 92716, 16370, 145, -6616, -14025, 46045, -24100, -91429, 136142, 110123, -77474, -80576, -109592, -31546, 114316, 193174, 174190, 219934, 171364, 104732, 7467, 35070, 73758, -40777, -9018, -15437, 74447, -46933, -65971, -52, 14344, -14540, -43815, -37817, 54351, -50046, -158500, -150486, -192712, -140759, -64374, -92523, -264238, -395361, -305736, -120205, 77973, 87117, 80558, -75438, -288926, -262066, -148833, -196851, -283959, -218206, -63909, 17313, -34911, -46194, 36249, 154292, 37833, -71285, -119935, -187807, -175433, -172193, -39556]
23630c9556J43471k23334j31621O3351n5074Q1751J64020O9626j14681r6557p099
23619a45703l7188J39805K40535P7211L151j7861q4405j73490j37459j54643N7696
23608b32351J32879r143J20055L416j7418L2723J40581j5633j86302J4449M280
23597a2464J83671n2886K9038O655j30390J5162J26952m5036j11369j62503Q9115
23586f4055o2942Q1561l0817j59296o9153J79823J09436O6612m2618l3n3986O3320
23574A7852R8862j80435j92213j296J02597J36808J70447l236r0370o9438M6622
23563C6200o0991N0415J29205M2086l7951r7905l8474j84055P0700J22594m0974
23552i150L5200Q763l4889j35442k28923r6615K03866J98214J911J22723k8303
$$ y = [-39556, 103915, -119419, -251040, -187689, -242763, -161012, 3008, 72634, -42047, -138604, -145703, -182891, -43086, 197449, 274660, 277811, 259950, 175545, 2055, -135404, -290047, -232351, -99472, -108615, 11440, 14856, -2562, 30161, 170742, 155109, -31193, -16744, -12464, 171207, 118321, 147359, 154014, 23624, 38786, 165738, 120702, 9333, -153170, -64055, -126997, -45436, -76253, -235549, -304702, -124879, -15443, 51169, 8551, 8518, -45468, 17852, 116714, -63721, -255934, -257230, -154633, -17825, 152622, 149386, 59016, -10422, 36200, -24791, 25624, 154829, 196915, 158964, 61059, 22585, -161470, -90770, 31824, -9150, 26050, 34813, -76, -135518, -364441, -461056, -257190, -58976, -57065, 65658, 37355]
23541C7355l9974L7100O6907q308j8243j44034o5800l257K9009M2088j5997k9201
23529a12355q7700K110K25824J4680j45997j54588q4025M1947o7911k458J4205
23518c56268k0296J30889L28890R8410j26017j99501j08325J06497K99488R0773
23508B44540l8408j48915O0690l5015q52k5063p2686O5149J32039P719q9440p4101
23496B5657j86432N5058J87139Q1198k5948P9342l9983m7642K2249p247k1855
23485A21536L1346j01480l9807p6964K8771k6518r6537j23863n8343Q5501l3845
23474b90203N6010K7224p8008k0635K5625K4207J52783M3502L8850N8425k9193
23463H587l9489J359K17026j64841k10444L7153n2303R8935J93463M1589m2868
$$ y = [37355, -2619, 34481, 101388, 93080, 74837, -69197, -134997, -138254, -109245, -67157, -83154, -112355, -200055, -197945, 27879, 42559, -103438, -258026, -342051, -300104, -368015, -370473, -356268, -376564, -245675, 83215, 181625, 55608, -143893, -252218, -145721, 153767, 244540, 206132, 57217, 117907, 82892, 82040, 56977, -15709, 49440, 181479, 189198, 99758, 25657, -160775, -105717, 81422, 162620, 136672, 216014, 176031, 128389, 150638, 143391, 121536, 152882, 51402, 11595, -65369, -36598, -63116, -159653, -283516, -341859, -256358, -290203, -234193, -206969, -284977, -305612, -279987, -255780, -102997, -59495, -20645, 37780, 8587, -30902, -29543, 187483, 22642, -187802, -150649, -202952, -104017, 89446, 131035, 88167]
23452H8167k2633J23026J81799R6901J3229p2391k9385j05541j40629j43227j85960
23441a96644R5210J03494j14650j07792n674K01812R1823k08791q0930N1298j26367
23430b97211m9009j6924R117j39101M4118J88809K21705J65712r1251J5848k52537
23419b00724j00455J59775J66409J57958l2171o1036j7365m5612m1332J30761
23409A16208j4332Q739m7186q9028r38r1196j14545K2877J07824L6127m6516Q7212
23397b4754o8568j21299R2489M3341j23841R1334P6585l4524O0593j47470j12370
23386b68484K3546O0602q435m9756Q1968R7105J6281j2810j88940r5328N1736
23375b92515K30081K3079O4130r288k7430L6243j29051n1070M666O7427q585j22319
$$ y = [88167, 65534, 188560, 370359, 467260, 480489, 408098, 378713, 273172, 132543, -10684, -196644, -101434, 2060, -112590, -220382, -226056, -24244, 67579, -141212, -222142, -170844, -297211, -346220, -363144, -354027, -493128, -449010, -260201, -38496, 127216, 35965, 51813, -200724, -301179, -141404, 25005, 182963, 150792, 89756, 72391, 26779, -14553, 116208, 101876, 110615, 63429, -25599, -26537, -117733, -232278, -209401, -101577, -65450, -111966, -24754, -93322, -214621, -122132, -78791, -202632, -111298, -34713, -69237, -8644, -156114, -268484, -244938, -184336, -192771, -242527, -160559, -63454, -47173, -59983, -248923, -344251, -292515, -62434, -39355, 24775, 15487, -11943, 24300, -104751, -155821, -151155, -83728, -92313, -214632]
23363b14632r2021J9045O4763J43739M6357p9294j02103K4543P308J21225J78459
23352A17389M3966o9896J42348m4694q6466l7770J79470j71575j28042p0668N3746
23341g2192P2896j899k81474j15469R4302J49024K92602J91710J24714N8690j52240
23330C60664l47985j08482j77628P8207K699O1321j35992J99407L6017n0159R6817
23319A4886K6993J5608j85978m3344N2087k585q4637L3207R5709K2288P58P9708
23307B4700M8211J9348Q1622J01780Q35j55014k12969J18240K15997J4565j72472
23296H4843k44944r7655q7248M8451K15389J7584J9684Q0370J02188l1250r8406
23285I006j34703o3925N3826P5403K376J21719O475J3356J5452M9430j689j18649
$$ y = [-214632, -306653, -287608, -222845, -79106, -32749, -112043, -214146, -189603, -182295, -61070, 117389, 161355, 91459, 233807, 189113, 102647, 64877, 244347, 72772, -55270, -125938, -72192, 704, -1195, -282669, -398138, -303836, -154812, 137790, 329500, 454214, 512904, 360664, 12679, -95803, -273431, -195224, -192525, -131204, -267196, -67789, -31772, -81931, 14886, 41879, 57487, -128491, -171835, -119748, -122333, -206970, -173763, -78054, -55766, -55008, 24700, 72911, 92259, 173881, 275661, 276496, 121482, -91487, 26753, 242750, 257315, 84843, -160101, -257756, -345004, -296553, -81164, -63580, -43896, 36474, 138662, 107412, 9006, -125697, -189622, -135796, -60393, -58017, 63702, 70177, 83533, 98985, 148415, 146726, 28077]
23273B8077O4563r6190j25815n1211k7338j13406J12586N2769L6991K36137J08637
23262B25800P89j49627Q7907r826j30135l0934M7514j46923j61254r6090J2057
23251c50722J31646J25186j27132J5789Q9722J07088j50115J69566q3142M8675
23241b3439J05122r8992j1309M4684k61279r3080L6689J23054R6979N9776K1268
23230e27j03784L1172k7302r0060p9912M5918J45345O7799p9226l2729p0724P3040
23218a20990N452L8013m2385j9738J3120o1569P9358l7371P937J8138J53577L7166
23206G0708J21046m6076k1786r4775p5999J35251k0754j20376P6438o5002j2222
23195e3547N7739J81974J09210j23310j60333j95683n8417r1274m3610P7823J50435
$$ y = [28077, 92640, -3550, -129365, -180576, -207914, -321320, -208734, -155965, -118974, 117163, 225800, 226589, 76962, 164869, 155043, 24908, -6026, 41488, -105435, -266689, -362779, -350722, -219076, -93890, -221022, -205233, -115511, -8423, -158538, 11028, -72114, -23439, 81683, -17309, -28618, 16066, -245213, -338293, -301604, -178550, -81571, -21795, -527, -104311, -73139, -100441, -190501, -270413, -224495, -79150, -11351, -90577, -123306, -194030, -120990, -115538, -77525, -119910, -139648, -126528, -188097, -108739, -146110, -138173, -120035, 33542, 70708, 191754, 145678, 123892, 29117, -46882, 88369, 67615, -52761, 23677, -41325, -53547, 4192, 186166, 295376, 172066, 11733, -183950, -242367, -333641, -377251, -299428, -148993]
23184a48993r55R4774Q8512J47303m5448j40998l6764J12599J57862l0635j78046
23173A9211j25180j20051q1907J58866J29094N1605J21554J86138n6942j96049
23163H6339j30260K6698Q7685K8678N4165j51229q4068R0225q8493p9929N9772
23152a00417N7848N4084j84369k3540K63982L1219p2038P2136J62126P9212j23623
23141B16620l21353j10845P2137J25018K02019N0174p7173N324j64278k03179
23131b05536j58379K17710K44664m312M8336n2943m8957p8429q3014K9792J48367
23120E7299r803q2104j61771k06626J87997L1115M4716Q4274J36442k5737p8492
23109b2690J02794j03521p5392P6195j14298J23772j72630M7069L9705n5809L4257
$$ y = [-148993, -149948, -55174, 33338, 180641, 135193, -5805, -42569, 70030, 227892, 197257, 19211, -105969, -226020, -307927, -149061, -19967, 31638, 153192, 339330, 282388, 86339, -43921, -17223, 70462, 99140, 153305, 2076, -81992, 8233, -80260, -160189, -100417, -42569, 11515, -172854, -196394, 67588, 98807, 26769, 98905, 261031, 340243, 216620, -104733, -215578, -143441, -18423, 183596, 233770, 156597, 161921, -2357, -205536, -363915, -146205, 98459, 94147, 142483, 89540, 40583, -37846, -120860, -91068, 57299, 47496, -34608, -196379, -403005, -215008, -183893, -139177, -54903, 81539, 55802, -22690, 80104, -23417, -98809, -22614, -136912, -13140, -185770, -138701, -98996, -154805, -120548]
23098a20548j1518K3856J08577m4755j47740k18845K57858L31493j35610q3678
23088d0910k0494k11532j06343Q2772m6920L4464n0932k43102P1297L42837P2349
23077a16514R236O9978J11225M6171j51207j75111K9576J63105P856M4225P0394
23066A08934n4099j17827j1001j38474l972J07508j26712p9476K4412J92636O0090
23055c7981p6132n3609j66749j27441O8383Q8159J317J47157q2650k4482N4186
23044b09842P0103J01156J0390K7455p7885l2370q4360L171R8488Q8946r4585
23033i9333m9756j74210J18392J36949M3924L4292j50141j6548Q8476K9578o5200
23022a03577J41373j6376K7022j12443k0665p6243J05381L9276j47023o4388j2643
$$ y = [-120548, -132066, -108210, 367, -44388, -192128, -410973, -153115, 178378, 42768, -40910, -61404, -272936, -379279, -296507, -343427, -308963, -359895, -602997, -531700, -188863, -116514, -107278, -37300, 73925, 120096, -31111, -206222, -176646, -13541, -5685, 38540, 108934, 54835, -62992, -73993, -212467, -216439, -108931, -235643, -315119, -290707, -98071, -37981, -114113, -167722, -334471, -461912, -393529, -305370, -304053, -156896, -239546, -264028, -209842, -139739, -38583, -28193, -738, -78623, -110993, -195353, -192182, -93694, -4748, -99333, -149089, -323299, -204907, -67958, -24034, 10258, -139883, -156431, -67955, -38377, -103577, 37796, 21420, 48442, -64001, -84666, -160909, -55528, -16252, -163275, -227663, -240306]
23011b40306L49453P4293q3120k8780p9275K30971Q7049p9314l04158j094K1110
23000e3171K23782K37117j91027o6872o9908k8321o9723L3441K2709o5832J9536
22989h269n3680r9129J11235J66096k427j48732j75251J05410J84584j56486l14161
22978c90810l7151Q7524J97172m9926N1988R6917Q7305j30044o2749M1983N6059
22967e1732m1671j40233p4455O0520j09718R4398J2501J39406K9321j53081l3924
22956b68668J593K6565O0623L8392J21549P0757k2307m8996J49572O4448j43086
22945E0442j07129n89R6259p7284j24560J17759J48654Q4483P3863k481j00863
22934A58554L4114q053J00296J68112o7798m56998j91556O5257L3222l3603P9449
$$ y = [-240306, 109147, 183440, 100320, 71540, -7735, 223236, 310285, 230971, -73187, -74281, -53171, 170611, 407728, 216701, 149829, 79921, 51600, -18123, 15318, 38027, -27805, -8269, -61949, -161078, -49843, 116253, 113826, -34906, -210157, -104747, 79837, -76649, -390810, -427961, -340437, -143265, -193191, -141203, -44286, 43019, -87025, -149774, -107791, -51732, -93403, -233636, -308091, -247571, -357289, -262891, -250390, -110984, -81663, -234744, -268668, -267075, -240510, -179887, -141495, -19946, 50811, 28504, -20492, 129080, 193528, 50442, -56687, -57276, 38983, -38301, -162861, -45102, 103552, 188035, 261898, 259417, 158554, 192668, 184615, 284911, 453023, 385225, -71773, -263329, -198072, -164850, -198453, -119004]
22923a19004J03326o0782J79773O3818k83867J1265o1216l776k5063J45072J89675
22912A39221J13621k15445j38106L8921L9700R6487Q9062K1906M1575r8501l7149
22901I1292o9878j00398k1533J24108J76737o514m3250j53779j35424j65804r3508
22890c97951J7982J90230N3265J72878K09664p0918K4643J27280j70784j73744
22880a7455q0027J00450L100N524L5002J3182Q42n6580j62525m6636k4471J02947
22868a26647j29741j49588j10946P3972J48225J05632R0157K16267L4226l5625
22858A15932q9019q7496l922K08056J7611j62172q593L7973l0535L1941J66929
22847A96705n3754r4348j78089j55896N495J35140J54324L4550q9921O7448J37205
$$ y = [-119004, -15678, -76460, 103313, 167131, -116736, -105471, -166687, -170463, -195526, -50454, 139221, 252842, 37397, -100709, -61788, -22088, 74399, 163461, 185367, 226942, 128441, 91292, 21414, -78984, -100517, 23591, 200328, 193814, 150564, -3215, -138639, -304443, -397951, -379969, -189739, -136474, 36404, 246068, 175150, 199793, 327073, 156289, -17455, -97482, 2968, 6068, 11592, 46594, 59776, 60618, 4038, -158487, -205123, -229594, -126647, -256388, -405976, -516922, -442950, -294725, -189093, -98936, 117331, 151557, 115932, 26913, -60583, -64505, 143551, 161162, -1010, -9603, 28370, -2165, 29776, 196705, 142951, 48603, -129486, -285382, -279887, -144747, 9577, 44127, -45794, 21654, 158859]
22836A58859m7671k36489o8534O1539J58625l4365r1028r1901n7273m3276K90629
22825h85K58732J2893j14235j0903n0313l5586J1657Q2620O9025j2807j42348
22814F7850k9547j89236n2172q7697p7883Q5373J18047Q1341k4404P1797K2354
22803a4177N4833j4217p260j23789J48755P2036o5980n628p3537M4324P330P098
22791B9788N2736k1624J7291q309j72694J34207r4752p7202n1343K9543P030J64211
22779H882r9807J6450Q246J45186k8496j99672J69509L9417N3904P855k949j28282
22767i757m1066O866m4108p9339p5494k8900J6483o1703J73394N8201L960n7424
22755a38887j15872P7074Q8371j592m1479O6333J03502J15206j86184o9513j865
$$ y = [158859, 111188, -125301, -193835, -132296, 26329, -8036, -99064, -190965, -248238, -291514, -885, 257847, 270740, 156505, 145602, 95289, 59703, 71360, 153980, 223005, 210198, 67850, 38303, -150933, -203105, -290802, -368685, -283312, -165265, -83924, -108328, -36531, -14177, 40656, 26439, 19179, -104610, 44145, 116181, 50201, 44573, -28964, 15360, 22690, 29788, 82524, 60900, 78191, 69882, -102812, 31395, -63357, -140559, -191902, -162359, -155329, 8882, -90925, -74475, -66229, 78957, 50461, -149211, 20298, 59715, 113619, 121474, 118525, -9757, -50823, -43957, -88065, -167404, -242898, -271798, -255315, -317018, -143624, -85423, -81463, -138887, -254759, -177685, -89314, -90906, -132385, -66052, 37450, 152656, -33528, -103041, -104906]
22744a04906R1454q3963m8433J6756L2129r095K6708K54340L5170j82149j0154
22733A7857q9914j12381k2764M0743M3389J06320O9151k6011k67967j08596j1817
22722c61990J44923R2470j53227J3576Q5549j03636L6297L1374n7966K9569J75382
22711f7679P3055N7345k2331P3166j10579P2097l046j13698q177l7211P3235R1490
22699G7667Q7313J9458j6820m1563j53460n4179J06026K54412K48899k02248m4082
22688B81423k6350O741k00733j4338R7410l2162Q8287J20381p8326j43112N312
22677A04533j47633j87559M3024Q6987J57126j01603m0788P0838Q089j73944L9643
22666a41287O5193r1025n7685k15831m3624J19489m9542j1221L02976J62667Q8633
$$ y = [-104906, -13452, -97415, -145848, -129092, -96963, -106058, -79350, 174990, 210160, 28011, 17857, -72057, -184438, -207202, -166459, -123070, -16750, 52401, 26390, -241577, -350173, -361990, -217067, -124597, -277824, -264248, -178699, -282335, -246038, -214664, -272630, -243061, -67679, 5376, 62721, 40390, 113556, 2977, 75074, 72028, -41670, -49847, -87058, -13823, 77667, 164980, 184438, 167618, 126055, -27405, -81584, 24442, 278854, 527753, 325505, 281423, 255073, 261814, 61081, 46743, 144153, 111991, 200278, 320659, 242333, 99221, 104533, -43100, -230659, -187635, -100648, 56478, -45125, -85913, -15075, -6986, -180930, -141287, -76094, -167119, -224804, -440635, -484259, -364770, -414312, -425533, -122557, 40110, 128743]
22655A28743N330O6253j5094M8317L2718j08621k31173j11104N3074J05176J83898
22644A57517p8651j86684j17519J8193K16362K39190j6712j22661n0941J72630
22634B30724n2981K2366r5557k20697j43455J05856L71412R3096k51184J04572
22624A64152k1031K4867M1072j32174j28751J08476J02308n3179o4642q4620R5179
22613E1657o357p5824L6009Q3461R2457l10456j49928N9920Q1351J21122J72792
22602A56204o6485r7922P2232l2856o7782q7621Q7133N7049p6466Q0685P2354
22591I6525r8418j9748K8670k45135l9737K11181L0319R017m9134J01694O9440
22580I4674p8908o7462q4605O9061o9738j27608R7661j1685J11155k5269Q1557
$$ y = [128743, 134073, 200326, 185232, 233549, 266267, 157646, -73527, -184631, -131557, -26381, 157517, 78866, -107818, -225337, -207144, 9218, 248408, 231696, 109035, 58094, 230724, 177743, 200109, 104552, -116145, -259600, -153744, 217668, 310764, 59580, 164152, 143121, 167988, 209060, 76886, -51865, 56611, 158919, 105740, 41098, -43522, 51657, 45300, -30524, 5485, 88946, 181403, -129053, -278981, -219061, -137710, -16588, 156204, 89719, -8203, 64029, 31173, -36609, -124230, -37097, 19952, -56514, 24171, 96525, -1893, -21641, 7029, -238106, -277843, -66662, -36343, -27326, -76460, 25234, 94674, 15766, -51696, -136301, -67240, -136978, -264586, -166925, -178610, -67455, -92724, -11167]
22569a1167J07303Q5505P2525r6504l11948j27839m9440N7594J11564K00479J36731
22558A74803M8833o3535l2178j19668m2860M4468J13479K32675K6895k48224j28796
22547E892K7546r164p3592j888J62391N9519j64221j61583J345Q1410M3531j2305
22535d1119k4354K7859R5774j86869q8431l7770L3412J04553Q2846J13781j10306
22524c0624P1930J06352n856P3297N1923j81823q6179J2998J33380o1347k4026
22513F0025P4886J0995n1955p913l4967j33741j24481R703p147R6525m9022O4816
22501i2276J16670k7060r8833K0146O0216j25633j06082o5253R5615J43180J4461
22490f4849L7953Q4346J18783j03061j00588m2529k5433K6909q0529j60664l9969
$$ y = [-11167, 96136, 181641, 254166, 157662, -154286, -282125, -331565, -273971, -162407, 38072, 174803, 223636, 160101, 127923, 8255, -34605, 9863, 123342, 356017, 382912, 134688, 5892, 33438, 24274, -49318, -51206, 111185, 170704, 6483, -155100, -153755, -72345, -28814, -41119, -65473, -37614, 58160, -128709, -217140, -254910, -221498, -116945, -34099, 79682, -30624, 41306, 147658, 141802, 215099, 267022, 85199, -980, 12018, 145398, 84051, 60025, 134911, 145906, 93951, 86038, 51071, -82670, -207151, -197448, -204595, -108070, -157092, -92276, 24394, -2666, -101499, -81353, -21137, -146770, -252852, -318105, -222490, -79310, -64849, -26896, 57450, 176233, 73172, -27416, -69945, -95378, -68469, -148998, -309662, -349631]
22479c49631J47998J23266o5318L9325N1031q3079m3075J90990Q2786M8907j17489
22468B5711j38842p1152N9596K17151Q8670j87926l7815M2956j14955m6531N7928
22457a05209k2942K8541p460J90022K16483m8558p4967L8406m8948r3584J77235
22446B49019J5666j45863j30343O8781r745j66257J00092K24221j6930k01586
22436a2945N1963j56748R6013L598j50629j7524o772M8800R255j1985J18663K07632
22424A79321L5003k55732q33L0701o3091J28812r277J23076J08101n9189j33109
22413H3783r3976l9203M3275j8444j9071j2739q7339L2769J34386J01125J75344
22402B99910l3457k14968k15545q3977M3076J87997o2731J03965j2688j98467
$$ y = [-349631, -201633, -78367, -143685, -104360, -53329, -136408, -179483, 11507, 94293, 143200, 25711, -113131, -184283, -124687, 92464, 181134, -6792, -44607, -1651, -116606, -163137, -105209, -128151, -99610, -107070, 82952, 299435, 250877, 175910, 214316, 165368, 71784, 249019, 264685, 118822, -11521, 57260, 47515, -118742, -18650, 205571, 188641, -12945, 39018, -117730, -21717, -18119, -168748, -186272, -193044, -144244, -134989, -146974, -28311, 179321, 214324, -41408, -42241, -11540, -74631, 54181, 44904, 167980, 276081, 216892, 83783, -10193, -49396, -6121, -24565, -43636, -56375, -143714, -110945, 23441, 124566, 299910, 266453, 51485, -164060, -248037, -204961, -16964, -79695, 24270, 11582, -186885]
22392a86885n7437j03442R4603J18320J59372R5326L8502P0373j48715k63067
22382a83050Q401l0621k1222l8536K4951N2488Q8465p7003J3807K29523J16701
22371A83904J06999n5201j21914j09551p3791R5792J25931L5508m5105J0807n9350
22360I4029J05216N3253j07802j19642j19076J14007q5774j50511J61852K52533
22350A98085M7636j38971j28805o1571Q9268j12584n0528J44914N6916o0353l3847
22339d9840j3322l9978r9780p9848J4208R5832N9375o6422K19688J62870k18425
22328a5642q6218q1808j37091N6943K75535Q8925j29238p7563J3416N1022r7473
22317a39192j8654N1283j20163N4467K47658j09014k31090k89J55404P1758K2774
$$ y = [-186885, -244322, -347764, -253161, -134841, 24531, 119857, 158359, 228732, 80017, -183050, -174649, -205270, -226492, -265028, -240077, -187589, -99124, -176127, -162320, 67203, 183904, 290903, 235702, 113788, 4237, -69554, 26238, 152169, 187677, 142572, 153379, 94029, 199245, 252498, 144696, 25054, -94022, 19985, -65789, -216300, -54448, 198085, 245721, 106750, -22055, -83626, 5642, -106942, -157470, -12556, 44360, -15993, -49840, -63162, -103140, -202920, -282768, -268560, -172728, -113353, -179775, 39913, 202783, -15642, -101860, -183668, -320759, -263816, 11719, 100644, -28594, -106157, -92741, -41719, -139192, -157846, -106563, -226726, -172259, 75399, -33615, -264705, -264994, -109590, -37832, -15058]
22306a5058l2098q8300K1350n8727Q9583O6205R6305n0499j05774J47958j41832
22295g0887j39451j47074K04374K06423j15631k4562L3552p2855O6306j3709n8325
22284a31839m7833P8118J03318Q7341l9327j21520j59828n2647J13664Q262O4344
22273i7947j6422j71778L1167L25785N9116o5531N498M761r4474k01556J24714
22262i6667R9217J07302j16267j02860q6505J79727M355m0851J13417J13381K8945
22251B03194n2595l6004r1232j23408m0463N7094J00338j0864n7728p6758j1728
22240a40154Q4096P2731K3004J57609l2596K6698j16255o769m4922k16554M6078
22229a47034K2921J14356r7808m5357J38317Q9377K9635O9669M9345m2525j57448
$$ y = [-15058, -47156, -135456, -114106, -172833, -83250, -17045, 79260, 28761, -77013, 70945, -70887, -210338, -357412, -153038, 53385, -62246, -86808, -53256, -126111, -59805, -73514, -131839, -179672, -101554, 1764, 89105, 49778, -71742, -231570, -284217, -170553, -162291, -97947, -114369, -286147, -254980, 70805, 129921, 64390, 69888, 74649, -19825, -221381, -96667, 2550, 109852, -6415, -109275, -195780, -16053, -11698, -52549, 60868, 174249, 203194, 150599, 114595, 23363, -100045, -140508, -83414, 16924, 6060, -51668, -128426, -140154, -56058, 16673, 39677, 197286, 164690, 191388, 75133, 68364, 23442, -193112, -147034, -124113, -9757, -107565, -152922, -14605, 74772, 104407, 174076, 223421, 180896, 23448]
22218B3448k13366N2481n1001j11881j5784J61817J27299L0355r0086j58555j8190
22207b63463j31230j69766P9398J35983K6046l0388J73056K8960M8760L0212K746
22196f9686N4833p9049j68533o0618K66718J83411K314j06398o8576L7392Q0622
22185G2430N9448j7106R7135k6082n2666n313m9945N6211j05701j11008j43046
22174b25643J1587J86783K28864l8826l0432j59285M0999N2463J25176m1762o5695
22163H4229j02254j37152M9822J657L1886J59946J35975o1644J1513K9397k74992
22152g1617J7625Q4105M7094N8887j07446K9164J91687m9108j61129j7127J01862
22141A23997J99851K9980j19997k10420j24800R1585k2237J2995J9260J24621
$$ y = [23448, -189918, -137437, -188438, -300319, -316103, -154286, -26987, 3368, -86718, -245273, -263463, -394693, -564459, -485061, -349078, -323032, -353420, -180364, -151404, -102644, -72432, -69686, -14853, -93902, -262435, -323053, -56335, 127076, 129390, 22992, -45584, -8192, 72430, 131878, 114772, 211907, 185825, 133159, 127846, 77901, 134112, 28411, -82597, -225643, -214056, -27273, 201591, 162765, 132333, -26952, 14047, 66510, 191686, 149924, 84229, -18025, -155177, -105355, -103698, -71812, 88134, 224109, 162465, 173978, 203375, -71617, -53992, 30113, 77207, 136094, 28648, 57812, 249499, 200391, 39262, 22135, 123997, 323848, 353828, 233831, 23411, -101389, -9804, -32041, -19046, 214, 124835]
22131A24835O0655j97164n6658K1773j22336r8804J10463N2480J6324J0499N1236
22120b6697k3850m1626l3514L2465K4910L01j25360N4905R7885K6272j50210j89882
22108c54401N3487J42436P7872K01320n9798q0264l1709j64282J39575r053k0045
22097a04862m2591N6112L0025J29894P06o5121P6580P5133m3363J14280K671j71855
22085E7609j08156J69993J9746P3969l7401j23287M5566q0305r1366j87420j01425
22074c62477L4683k2325L2937K4449O0516J03723o1261o0148m2121K3381J41792
22063a26851K40891J31031r3095q6278Q5875J5850j80950k7484J06853P5528r4452
22052D6918j71553j07697K2990J06953P6413N685M558m8960j25415j40192p2557
$$ y = [124835, 185490, -11674, -68332, -46559, -168895, -267699, -157236, -104756, -88432, -77933, -26697, -50547, -92173, -125687, -93222, -68312, -68011, -193371, -138466, -40581, -14309, -164519, -354401, -300914, -158478, -80606, 120714, 60916, -19348, -51057, -215339, -75764, -84817, -104862, -147453, -91341, -61316, 68578, 69284, 4163, 80743, 155876, 112513, 226793, 229464, 57609, -50547, 119446, 139192, 213161, 175760, 52473, 98039, 17734, -73632, -261052, -362477, -327794, -350119, -317182, -292733, -232217, -128494, -189755, -249903, -292024, -268643, -126851, 114040, 245071, 151976, 65698, 151573, 167423, -13527, -41011, 65842, 141370, 46918, -124635, -232332, -209342, -102389, -25976, -20291, -15733, -64693, -190108, -330300, -402857]
22041d02857J48729J46791J36369q0209J28988K6211j4761j10292j3267O5200
22031C0902P5204k9068r9005k6783q5968o9284L1126o095Q0652J54789k6132o8852
22019c8514j10735O5832J60175j2144O7388M6356k7636N8651j3535j16305n2807
22008B6726N383J9408K2847o4621j61257j43695M1655Q9548O3217J27389r9416
21997g2816j39505Q2176q7172O6498J77623q585m7357p6618J49420J78302j40203
21986H1763j60896j3156j47284j5690M9116J41129j21086q3566K06182J34755
21976G1267j22499M5338J41316Q4389o0113j11353k4395O2552k0686k2597j90491
21965a47272k02239l3797J84939J05224J43647J25349n1033M3966j6238r4576
$$ y = [-402857, -254128, -107337, 29032, -51177, 77811, 104022, 89261, -21031, -34298, 30902, 106106, 77038, -21967, -48750, -134718, -204002, -172876, -178971, -98319, 56470, 30338, -38514, -149249, -83417, 76758, 64614, 132002, 178358, 150722, 209373, 195838, 79533, 26726, 32109, 51517, 74364, 9743, -151514, -295209, -253554, -164006, -100789, 26600, -72816, -212321, -130145, -217317, -150819, 26804, 18219, -29138, -105756, 43664, 221966, 81763, -79133, -92289, -239573, -255263, -206147, -65018, -186104, -269670, -63488, 71267, -51232, -5894, 135422, 219811, 159698, 48345, 23950, 86502, 65816, 43219, -147272, -349511, -383308, -198369, -93145, 50502, 175851, 124818, 168784, 152546, 57970]
21955E7970j95488l4006O3587j6694R4402R6920Q3884j1141j59957j89550j33134
21944c43207K4661J27094J4286k7600R8952p2046O1654P7935m7517N6067J33514
21933A03793q3162m7285N7993m0654o4165m1724o5645r9130J37310O1329n3440
21922a34780N45j5030J49930l1544j12246J03860M4065J4636l261l2321l4664
21911e0810L3174k7402p4564Q274J46930N5326K3737j39630k0969J21745K4559
21900A00370j1788n0363j03844O3256m9038J8548J41358j60170k2512R8642J08528
21889A32987n5670J8558l7852j68188j8058L215M4205n4890j3941k8674P7735
21878a00573K75477J29091l5294j52922J196N0155p3200o955o3674J4395r9453
$$ y = [57970, -137518, -171524, -107937, -124631, -30229, 66691, 150575, 139434, -20523, -210073, -343207, -318546, -191452, -177166, -204766, -105814, -177860, -116206, -38271, -85788, -29721, 103793, 20631, -26654, 31339, -9315, -73480, -115204, -180849, -279979, -142669, -81340, -134780, -134235, -149265, 665, -30879, -143125, -39265, 4800, 19436, 16175, -16146, -50810, -17636, -45038, -119602, -111328, 35602, 90928, 114665, -24965, -45934, 75811, 100370, 88582, 38219, -65625, -2369, -51407, -32859, 108499, -51671, -74183, 24459, 132987, 77317, 95875, 58023, -110165, -128223, -125008, -80803, -135693, -149634, -178308, -100573, 174904, 303995, 268701, 115779, 116975, 167130, 93930, 86975, 23301, 37696, -61757]
21867f1757J06167O6197q3400p3843O796J26180J42073j75095j8529o051m6822
21856a8084j05642j06328O7681p0137Q1351J80074K0958N5230M6187N0399N3791
21845B55480j37639l7051o1438k00345j51374j40661J15819K00023P5144n6388
21835a38430o0629m8196P6120N8153m3207Q1030K8187J04320m1489p9634j1607
21824g5382K3116j07736p3461L2829J8839O7449k5944p76K7644J37665O0567o5642
21812A9168Q2816j9604r6722k51795l0828J27182R2061P7498O7646j78319n2942
21801a63839O3375M8000O8209j66346P6754J07623j72457j61277J61451n4516
21791a93023K1476N8848Q0717J486p7114q950J5965J66848j2722j74690K1520
$$ y = [-61757, 44410, 110607, 27207, -46636, -39840, 86340, 228413, 53318, 34789, 28738, -18084, -123726, -230054, -162373, -232510, -151159, 28915, 49873, 105103, 151290, 201689, 255480, 117841, 80790, 19352, -180993, -332367, -473028, -357209, -157186, -82042, -138430, -199059, -247255, -171135, -112982, -156189, -75159, -46972, 57348, 15859, -63775, -75382, -52266, -160002, -233463, -200634, -181795, -114346, -140290, -141066, -113422, 24243, 84810, 19168, 101984, 82380, -14342, -266137, -296965, -169783, -77722, -224, 67422, -110897, -163839, -100464, -52464, 15745, -150601, -73847, 33776, -138681, -299958, -138507, -193023, -171547, -112699, -31982, -30496, -107610, -116560, -100595, 66253, 53531, -121159, -99639]
21780i9639M6447J26172p9010m6457J06921n754j8206O7123N074L7857l3626j46471
21768c9569q9769M6904j00354r6000J65792O6040l3229J3106o0364j30416L4220
21757b23639J18464P0762j17132q0762M566J72225Q8848J52804P0468k15671j15140
21746g4207Q3149j6998j37707r3487M6450R8275J54430j3261p0082l5501Q1324
21735B2385M9144j05201j52083j32199j6065k6005J08552N9673k2001J31432k8692
21724a11060N1632J28087k0015j70657L9030k577k2095Q1481R517L2900o1520
21713d5277L9091J54765j35611j03504J7180K2433J04107P3725Q3303j59296k15228
21702a64312K9102P593j49387m0346K15262J84490r4728j13227J02556J0505k84003
$$ y = [-99639, -53192, 72980, -6030, -52487, 54434, 48680, 30474, 97597, 102671, 140528, 106902, -39569, -129338, -82434, -182788, -278788, -112996, -46956, -80185, -67079, -127443, -257859, -223639, -105175, -34413, -151545, -232307, -227741, -55516, 33332, 186136, 256604, 40933, -74207, 8942, -8056, -145763, -239250, -192800, -94525, 59905, 46644, -23438, -58939, 22385, 71529, -33672, -185755, -317954, -334019, -360024, -251472, -191799, -213800, -82368, -111060, -59428, 68659, 48644, -122013, -82983, -85560, -107655, -26174, -16657, 16243, -45277, -6186, 148579, 12968, -90536, -73356, -50923, 53184, 126909, 210212, 50916, -164312, -135210, -127617, -277004, -317350, -102088, 82402, -12326, -125553, -22997, -12492, -296495]
21691b96495P6803L0715J33038j0505R2580J43963j11794q4067r1923j1066O4517
21680f4234O2624J26093q4918l6729J3224M738k83668l5312J35328K36953O3346
21669A37445m8036j86544l7133J91003l5590j51248P448j87347k7444M1369J6496
21658b79581j82061O5918J30569K48098K6964m2305J04962Q6153l7836q1550Q4044
21647A23375m8762L0476J4534j7139r7740m1667o4691q9307R8450r482m183J00979
21635e157j56438p6248J66788J36587j03500j0760R0473J0981J11041K4531k0202
21624A68096J4360m8871j17499L4097o2514n8752R2838l9818m9017n3306J07423
21613a2963J3107o7702M5255J74672O7340r428p8128L8589J27028Q1025j09463
$$ y = [-296495, -219692, -188977, -55939, -66444, 26136, 170099, 58305, -25762, -117685, -128751, -64234, -1610, 124483, 39565, 2836, 16060, 20798, -262870, -298182, -162854, 74099, 137445, 89409, -97135, -134268, 56735, 21145, -130103, -122655, -310002, -337446, -296077, -279581, -461642, -395724, -265155, -17057, 9907, -32398, 72564, 158717, 120881, 39331, 123375, 74613, 105089, 119623, 102484, 4744, -36923, -101614, -190921, -92471, -101953, -106136, -5157, -161595, -237843, -71055, 65532, -37968, -48728, 41745, 52726, 163767, 188298, 168096, 182456, 133585, 16086, 50183, -12331, -71083, 21755, -18063, -67080, -120386, -12963, 144, -67558, -22303, 152369, 219709, 210281, 132153, 170742, 297770, 378795, 269332]
21602B69332k9590j08570m4536k7737j81572j64623n4971Q2398M1751J52947Q9143
21591B3972J02216K859k02338k9841J62516K13501j24320j18382m0168n0691J2200
21580d8476K9304L5440o8724o6530J10657P9961n1161r9922P6102J59255O7144
21569B23050j69467j94541O4931J75204j3408j51946j12948O2434n5065N6404
21559a15352M1523j06930n511R9855J13488n4645Q065L11r1555M6002j4234M2625
21547c6358O4079k6471O413J62264o4499j6118j90561P901J7905n0383k3361l5153
21535a84342K9968J49090J63691l1209j34079O3636o1596j5879o9576k32058J4689
21524c07665K07684J38736P4752J2504K8977J8390J77837J3188k74281k33960
$$ y = [269332, 239742, 131172, 86636, 58899, -122673, -287296, -342267, -259869, -218118, -65171, 23972, 126188, 129047, -73291, -103132, 59384, 272885, 148565, 30183, -9985, -60676, -48476, -19172, 16268, -52456, -118986, -8329, 71632, 20471, -79451, -3349, 155906, 223050, 53583, -140958, -76027, 99177, 85769, -66177, -179125, -116691, -171756, -115352, -73829, -180759, -186270, -86415, 27073, -27572, -19507, -19196, -110751, -64749, -78983, -36358, 27721, 1250, 7663, 169927, 105428, 89310, -101251, -93350, -75445, -125828, -149189, -184342, -154374, -5284, 158407, 127198, -6881, 56755, -4841, -20720, -90296, -322354, -307665, -99981, 38755, 113507, 126011, 154988, 173378, 351215, 364403, 90122, -143838]
21514a43838J73112L9779J68355n2009r7961R1503o0732m7622J87873J02494j245
21503C59709j45812k06550M1903k9946j39074R7125l604o4143N8150P4765R39
21492D3462O5177L2181q5428j14026L1028J13699J47108J65847q8241j87017p1755
21481E2035p8384q67J48624M7028k71158j06906o7059J09881J09763p9201p377
21470a43621J7875J53744O9131J30176r6386p5126J4539R8639j48260k93403J1198
21459b61494J94560K06210J1027K3276r3767j42981k62153R6055P5730P1848p4454
21448a56143P8105K14699K4277K6095l5574o4432j1901J51451k4325l64133j07136
21437b69017Q0985J20126M6782j24133l9208O4396R901R5936Q2570J1438k2403
$$ y = [-143838, 29274, 69053, 237408, 185399, 87438, 178941, 118209, 70587, 258460, 360954, 359709, 213897, 7347, 49250, 19304, -119770, -22645, -26249, -90392, -32242, 42523, 43462, 108639, 140820, 55392, -58634, -27606, 86093, 233201, 399048, 310807, 123790, 52035, -26349, -27216, 121408, 168436, -102722, -209628, -276687, -166806, -57043, -136244, -143621, -125746, 27998, 97129, 227305, 130919, 55793, 70332, 168971, 20711, -272692, -261494, -66934, 139276, 150303, 173579, 79812, -63169, -325322, -229267, -153537, -81689, -156143, -78038, 136661, 160938, 187033, 151459, 87027, 75126, 226577, 202252, -161881, -269017, -188032, -67906, -21124, -145257, -184465, -120069, -110168, -14232, 68338, 79776, 57373]
21426E7373k37909j2339r212K20440R6441j39044p8770L3187J13287K4808J11817
21415A80079o0760n6022J41646j706j04196N5647j49720l537N5665J69626J8813
21404B45535k4335p2995p8984j9302L8285k70889k21430N5908J55039J35499K8791
21393b8878o0046K20675j32165K6710L6049j43997p0743k04K855R6830P6589J23081
21381A46756j68626j82141j21796P2235L0454J33463l444k06195k20586J41798
21371c78082K06701L828K9632r590p1162P537R2651J70149N3827N5884P1445o8905
21359A63915j08319K8222J46480L7361q2641L8984k8827k10774j3459J90233k4325
21348A36850k41050m0096n5189P8252O1988O1256l2679J01280J5447L8369q0063
$$ y = [57373, -180536, -192875, -202087, 18353, 114794, -24250, -103020, -69833, 43454, 68262, 180079, 119319, 63297, 204943, 203237, 99041, 154688, 4968, 1431, 57096, 226722, 245535, 221200, 148205, 69221, 49919, 88204, -182685, -404115, -348207, -193168, -57669, -28878, -88924, 131751, -414, 26296, 62345, -81652, -152395, -152599, -149744, -52914, 23675, 146756, -21870, -204011, -325807, -253572, -223118, -89655, -93099, -299294, -519880, -378082, -171381, -167553, -137921, -147511, -218673, -211136, -118485, 51664, 105491, 161375, 232820, 163915, 55596, 83818, 230298, 267659, 185018, 224002, 195175, -15599, -29058, 161175, 136850, -104200, -144296, -199485, -121233, -59245, 2011, -30668, 70612, 86059, 124428, 44365]
21337D4365j95421J64625J93342k8850k18628p1170J80211J17353K8087J15776
21327C29690K5820M132j55060r0407M2822J01352k3729q3847l7233j15633n3468
21316e5561J31449o7900j828j8880r6211r8718J5632J70O9651P9637M4837j29499
21304a27221r7057Q8535Q3299K0522L4773P7262j52224j27791K21083J27964N0173
21293A99318j18406p8582L2126L9061P7581q0189j43405n2260L9281l1214p1292
21282a87981J27499J68130M4208K1893q0755j38544K9884Q0516J37102J7530j51943
21271F7539p0187k471q1124l0387l1883R3411r988o8980O2459M5883N1868j57353
21259a31213o0358R1690J6366j1205m7929M6788J61789J11388j28718j05533k4578
$$ y = [44365, -151056, 13569, 206911, 178061, -40567, -111737, 68474, 185827, 213914, 329690, 355510, 359642, 204582, 114175, 156997, 258349, 234620, 150773, 113540, -2093, -55561, 75888, 7988, 6160, -12720, -108931, -207649, -192017, -191847, -122196, -42559, 2278, -127221, -224278, -135743, -52444, -31922, 2851, 80113, -72111, -199902, 21181, 149145, 199318, 80912, 2330, 34456, 73517, 151098, 70909, -72496, -124756, -85475, -116689, -187981, -60482, 107648, 151856, 173749, 92994, -45550, -15666, 64850, 201952, 219482, 67539, -2648, -5119, -86243, -116630, -148513, -55102, -65090, -134070, -71611, -25728, 26140, -131213, -191571, -99881, -83515, -94720, -142649, -95861, 65928, 177316, 48598, -56935, -81513]
21248h1513j04389N8666m2889q3178n306J86414M212o6638Q081j6424J31248R5811
21236H4095K1428J3287L8051j29997j49167j13654Q577J28863m3774O642L9950
21225i5699J41484q9677j52316k3416J89709K56616M9898O458Q1888j09672p7784
21214A77489k081q0221j2196o8237m6274J19382J51096J19791r5598j45683K2582
21203A40050o2852o049j26527M5171R6450N785k0505N768j21547j1597q7068J20450
21191b2471R6295M9233j1325j35878p4147P6469K3485j31651L892M0859j46068
21180b31307N0581L3634J09914j01688q0800j56274O6602Q0903J75928Q5856j63888
21169a30539o6987n3818O1276J00500K6047k0322j07244K02745J6680Q4551J74287
$$ y = [-81513, -185902, -127236, -170125, -253303, -258609, -72195, -67983, -134621, -126540, -142964, -11716, 84095, 105523, 118810, 156861, 26864, -122303, -235957, -227380, -98517, -142291, -135649, -95699, 45785, -43892, -196208, -219624, -29915, 226701, 276599, 283057, 364945, 255273, 177489, 175408, 95187, 82991, 14754, -31520, 87862, 238958, 358749, 263151, 117468, 140050, 77198, 71149, -55378, -10207, 86243, 92028, 71523, 77291, -44256, -55853, -142921, -22471, 73824, 123057, 111732, -24146, -98293, -21824, 1661, -129990, -126098, -85239, -231307, -180726, -147092, -37178, -138866, -219666, -375940, -309338, -228435, -52507, 33349, -130539, -197526, -251344, -190068, -89568, -63521, -83843, -191087, 11658, 28338, 112889, 287176]
21158B87176M5679j69842j92233j59533m1712K29359m9492j9290P6712l6126j11546
21147a40848J24991R8653J5950k25358N0869K47422j60554j14755p1089k0719
21137a95438j38316M1266K50525J07901l8445j85537J9201J12723J37387k47883
21127a36616j36496q98K3492Q2878L1326J62341p7952r5869L2566R2153k33491
21116b56566k931L2855J99906K5294m6397l142M6620n1551M521K05337k8982M2002
21104A66966J52579J08863r6838j88149J05512N9216J43799o9472k84062j30514
21094c2100J9533n2978N44O9975K5118l1627j41244L8350r9466J19819Q7721Q3300
21082H6945r0661l3273K2870O6680l7622N502J4698m4394O79K25767j04160o5528
$$ y = [287176, 332855, 163013, -29220, -188753, -230465, -1106, -50598, -69888, 6824, -29302, -140848, -15857, 82796, 98746, -126612, -75743, 171679, 11125, -103630, -174719, -195438, -333754, -292488, -41963, 65938, 27493, -158044, -138843, -26120, 111267, -136616, -273112, -274010, -250518, -167640, -136314, 26027, -51925, -147794, -115228, -23075, -256566, -259497, -226642, -26736, -1442, -47839, -50981, -4361, -55912, -51391, 153946, 124964, 166966, 319545, 428408, 331570, 143421, 248933, 308149, 451948, 382476, 98414, -32100, -12567, -65545, -65001, 4974, 30092, -1535, -142779, -104429, -203895, -84076, 3645, 86945, -3716, -36989, -14119, 52561, 14939, 20441, 35139, -9255, -8576, 217191, 113031, 47503]
21070D7503j28587o5488N0392L6434m8105k9699J14285J8178J00267L13867R4365
21059E03412J38303K26744R549k17086j08041n6996j30218r3021L8608Q8980q6681
21048C13553j84466O7326N433J33940J36140L5473J83249J42769J05622j48397
21038G90642j83422q5273r0723j84170j29014k8155J5582o7427O274O6767O2884
21027A73965J8158m1557j39417M5531J07217J1876j85500l4483k7980J69551J57788
21016B55149j914j1479o3223j00882J31207J32816j06353J04875J20684k21644
21006B39236p0769o7933n5887O5315M4665p4938J833j39261l5131Q6648M2766
20995C6544j15580k11593j0994J15644N1359J35548j09671P6667O9519l9323J46052
$$ y = [47503, -81084, -146572, -96180, -59746, -107851, -137550, -23265, -5087, 95180, 409047, 503412, 641715, 868459, 878008, 660922, 552881, 495885, 365667, 272646, 311254, 400234, 313553, 129087, 196413, 201846, 335786, 471926, 507399, 690648, 833417, 939039, 790642, 607220, 521947, 431224, 247054, 118040, 89885, 105467, 38040, 44314, 111081, 173965, 192123, 150566, 11149, 56680, 163897, 175773, -9727, -44210, -72190, 97361, 255149, 253235, 241756, 178533, 77651, 208858, 341674, 235321, 340196, 460880, 239236, 168467, 100534, 44647, 109962, 154627, 79689, 81522, -57739, -92870, -6222, 36544, -79036, -290629, -301623, -185979, -134620, 928, -108743, -32076, 37443, -1880, 144172]
20984A44172j57753l6374R8334J19105J09892j3344r0757q0373M3751r0585q6400
20973d0332K0933L2417J42093l0569m8050k1030r5447k189J16281q4169o9252
20962g9314j22971k6177O2504k9977Q7439j51448j4033J81787R5004L0000M7943
20951H0757l3962J6245k6027k1519o3878q3002j8265K04120K7740O9476r2322
20940E9363j76900p267J58739K06631P9890q3338n5090j03988k43301j42j09193
20929b74596J36442L8292M1532q3208q2708P4829j13649j2562K92782J01457k10190
20918i1579j52773p72J22666l1622O8978J59649J85624j94824k86628O626M8465
20907a66190J86627P8278j5609Q0418N9209j79013k31110j4771k15655j08435
$$ y = [144172, -13581, -49955, 48379, 167484, 277376, 264032, 173275, 92902, 136653, 46068, -40332, -19399, 13018, 155111, 124542, 76492, 55462, -39985, -42174, 74107, -10062, -79314, -202285, -228462, -165958, -195935, -108496, -259944, -273977, -92190, 2814, 32814, 80757, 46795, 63040, 37013, 15494, -48384, -131386, -149651, 54469, 82209, 151685, 59363, -117537, -124804, 33935, 240566, 320456, 237118, 182028, 78040, -165261, -165403, -274596, -138154, -99862, -58330, -141538, -224246, -149417, -263066, -275628, 17154, 118611, -91579, -244352, -245124, -122458, -154080, -85102, 74547, 260171, 65347, -221281, -214655, -166190, 20437, 98715, 83106, 163524, 222733, 43720, -187390, -202161, -417816, -526251]
20897e26251J44247J91848J07693P7657K4486n5160J18788N9518M1M4570J76350
20886C63787j28177m603N7323q1769m1936R1215K8673j4837p198m6230q9236k43557
20874a16545J17242J79973O0822j9403M6070q2910P2691O2970j98074Q7713J31270
20863C41819j05214j70009O7040j1662k28983l3916R7307L2170Q5936R5278j23594
20852D6172o2998j24574m1930j6708o9065K07930J06168R8109j5651K187j28554
20841A086j59969l8931K08416J36249M9982l869q7416l5193Q748J0668O3359j00896
20829E2234k1623j010Q4002k8629j49886R097J60124j96266J4106J73675N4505
20818A50329K5642j89782j00438R233O0704P7108j41593R3841K25920J78513p3263
$$ y = [-526251, -382004, -190156, -82463, -4806, 19680, -35480, 83308, 142826, 142867, 187437, 363787, 235610, 231007, 288330, 206561, 164625, 255840, 284513, 269676, 262478, 216248, 127012, -116545, 697, 180670, 241492, 222089, 268159, 185249, 257940, 320910, 122836, 210549, 341819, 236605, 66596, 133636, 121974, -107009, -140925, -43618, -11448, 74488, 169766, 46172, -16826, -141400, -183330, -200038, -269103, -61173, 44995, 143104, 127453, 129640, 1086, -158883, -197814, 10602, 146851, 196833, 192964, 105548, 70355, 79103, 89771, 153130, 52234, 30611, 29601, 113603, 84974, -64912, -55815, 104309, -91957, -77851, 95824, 150329, 175971, -13811, -114249, -105016, -44312, 32796, -108797, -14956, 210964, 389477, 316214]
20807C16214j54141r5503r9375j18845n1539J66042Q1546j25220M6051O9333J6074
20796E0637o1231j0665P789l5742J3386m7083O7894J51028P7781J07476q1004
20785B40266j75594k13716k61699J36540K77496J85524l5070r6422j27537j2833
20775h3045J50758k7016M5640o6702L063P903J21476j8826m0684K9250R4987M9355
20763B66159j18010j60923n2771q3893l0710J09001j52217r9161J39944J9167
20753a63414L9536J9949J31141p6163m7495J91467k5782j28290R9031m1738p5795
20742g7553J15186J00986J0414k2965k50494k2086J77612K11669Q4637j23920
20732B03486K6924j48265j61446M9844q163J28547P4126k7265j54425j08372n278
$$ y = [316214, 162073, 66570, -32805, -151650, -203189, -37147, 44399, -80821, -34770, 34563, 50637, -10594, -21259, -13470, -49212, -35826, -82909, -15015, 136013, 213794, 321270, 240266, 64672, -149044, -410743, -274203, 3293, 188817, 153747, 57325, -70212, -83045, 67713, 40697, 86337, 19635, 22698, 30601, 152077, 133251, 92567, 121817, 216804, 266159, 148149, -12774, -65545, -149438, -180148, -71147, -223364, -322525, -182581, -163414, -123878, -103929, 27212, -48951, -96446, 95021, 69239, -59051, 39980, -1758, -77553, 37633, 138619, 149033, 126068, -124426, -146512, 31100, 242769, 327406, 203486, 230410, 82145, -79301, -29457, -37620, 90927, 165053, 137788, -16637, -125009, -130287]
20721a30287o5219R554K5946k7268j82506o2902j05117N1993k3087K8990M7957
20710d31946J21931K25995J3130k4098j09885j17846J48711K27420R3627j20212
20700B6827m6249J1335j28532j87949j13849Q6889J27625K44053Q0888L778j23972
20689a9156k3191j05526k166J54482P7396j45254l8662m3657J52233J7407p1485
20678d7579L5188N3851m7583o3433j0003n9690l1129J6055k8099J40467J17244
20667G5289K8047k6447r2558l4293j05652n6063m5544P0297J48354K5085P7026
20656F3541J51806n2424j52803K4789J09167m9163p0873J5372K8837l7341n5516
20645b4608R1042M2619J75820L7303j27850J4825n8412K17552O4435r1261j72177
$$ y = [-130287, -195506, -185952, -160006, -187274, -369780, -432682, -537799, -485806, -508893, -479903, -431946, -310015, -84020, -70890, -94988, -204873, -322719, -174008, 53412, 147039, 26827, -19422, -8087, -136619, -324568, -438417, -351528, -223903, 20150, 101038, 104816, -19156, -42347, -147873, -150039, 4443, 81839, -63415, -102077, -145734, 6499, 23906, -47579, -12391, 41460, -6123, -69556, -79559, -139249, -170378, -154323, -182422, -41955, 75289, 103336, 76889, -15669, -49962, -155614, -211677, -257221, -186924, -38570, -13485, 63541, 215347, 162923, 10120, 34909, 144076, 94913, 24040, 39412, 68249, 30908, -24608, 66434, 109053, 284873, 322176, 194326, 209151, 150739, 368291, 432726, 341465, 169288]
20634A69288j89635O5390M1458o075M5224P8638k27847M8635j4128r9573P3799
20623a4826j28855j7398R6102J23057L2409N5332M7193p7828Q3313k2903j79228
20612c632j30227P8694M1351q8858k2409P1576J21271o4134l9344j02167M5263
20601i2616k4067O4701J46989j40374k56697j19811Q7993J70166K42224o3237
20591A5271k0076l8269P1068J67642K566j51428J02231j18437j12820m7153m5351
20580a74756M755P3733J40517J1191n4150j85204j40290J83151M1954j44758j0753
20569b54610R182J12726M218O3630J90153J7336p6304L5709R7058j36397j44056
20558h1355j22896M3436r884j30879q3121M9172J23739O1433n1408K9834K01923
$$ y = [169288, -20347, 45043, 86501, 80426, 125650, 204288, -23559, 25076, 10948, -88625, -14826, -143681, -161079, -64977, 58080, 90489, 145821, 193014, 115186, 198499, 175596, -3632, -133859, -55165, -13814, -102672, -125081, -53505, 67766, 3632, -35712, -137879, -92616, -116683, -51982, 95007, -45367, -302064, -421875, -333882, -163716, 78508, 15271, -4805, -43074, 27994, 195636, 198202, 46774, 149005, 30568, -82252, -129405, -174756, -170001, -96268, 44249, 55440, 1290, -183914, -324204, -141053, -99099, -243857, -254610, -245428, -132702, -128484, -64854, 125299, 142635, 66331, 102040, 199098, 62701, -81355, -204251, -160815, -170699, -301578, -384699, -335527, -211788, -150355, -201763, -171929, 29994]
20547B9994J71815J23205O2066k69361k70837k3429J38238K18650J18441j45010
20537A53772j28848N3133o1521m5910m8166J18564N1261K8394K0110l1570L3168
20526A42387J38823J6756j22424k27790j82218J81637J61817R6074o0293J8330
20516A63099Q0519K2652j14595J8415p7217q6406j12224k6915J20429j7592O429
20505b3406N1935j58575Q317K2389K1765k6190k848O135r7460J0693K30926P0785
20493A14466j5482l7472j33925r9500N6802K5848j35441j92075l4686M3561P7909
20482c29995J62185L8717j39430L8341k5968M5463k9211K50493K32170r9974N093
20471A47884p2796j37328l0498R4197J38489N3992P6475p2037j56858k6143j8626
$$ y = [29994, 201809, 325014, 387080, 117719, -153118, -176547, -38309, 180341, 298782, 153772, 24924, 78057, 16536, -29374, -77540, 41024, 92285, 120679, 140789, 109219, 142387, 281210, 297966, 175542, -52248, -234466, -52829, 108988, 205062, 144769, 163099, 243618, 266270, 151675, 170090, 92873, 6467, -105757, -132672, -12243, -29835, -23406, 28529, -130046, -121729, -99340, -77575, -103765, -106613, -100478, -197938, -187245, 43681, 114466, 98984, 61512, -72413, -171913, -115111, -89263, -224704, -416779, -451465, -407904, -329995, -167810, -129093, -268523, -230182, -256150, -210687, -239898, 10595, 242765, 142791, 147884, 75088, -62240, -92738, 1459, 139948, 193940, 270415, 198378, 41520, 15377, -3249]
20460c249k0432M8617q7217k4779n2871J51510J5839K2638r400m0232q0883m9607
20448a30066J01589k6240j07465J30999j8694p0804l658J8046O5276M1291n866
20437e592p7646J19661M7586K9777j5477n7725R334l78o0915L229M4734M3398
20425G9986j38470m2872J4520j15017J40092K26154n5109M8848k4636k12919j80508
20414b59931J37507P6752q5160J55474J309j57715k02430q7691j0439R7306J52657
20403a82361J08140R1931J7427O5131k7705r2551q4921j166J42436n2512j19802
20392a35953K55902K57080n8299r3905J27602m2359l35574L4543K0883N9069k7719
20381F1270K9824J9472o9988j65207N5975J74219O7013M0471N7112Q0346J8466
$$ y = [-3249, -23681, 24936, -62281, -87060, -139931, 11579, 27418, 50056, 40656, 424, -80459, -130066, -28477, -54717, -162182, -31183, -49877, -120681, -124339, -106293, -41017, 274, -5592, -83238, 36423, 84009, 113786, 98309, 40584, 49918, 49540, -11375, -8146, 36588, 79986, -58484, -101356, -86836, -201853, -61761, 164393, 109284, 158132, 133496, -79423, -259931, -122424, -45672, -130832, 24642, 25951, -131764, -334194, -421885, -432324, -335018, -182361, -74221, 17710, 35137, 100268, 72563, -19988, -104909, -106075, 36361, -16151, -135953, 119949, 377029, 318730, 224825, 352427, 310068, -25506, 9037, 29920, 88989, 61270, 91094, 110566, 40578, -124629, -68654, 105565, 172578, 213049, 270161, 350507, 368973]
20370C68973M3356j00167n7534j20605r8242j43068q298o8334J78434J66105P9945
20359B40565k06211j03968j16471M6351R4530J92764J6106j39353J0423J56141
20349A90877N7343n7176K06831P9418k33679q4464j39425K0425L4831L2925J3259
20338A21165j49765Q2963P7094n0907k9738l0048J30749m0694n3549K2029R7553
20327A76852N6481j27598r639O1196l2728J13368p5660j96398L4770O714j19458
20316a12100p0578J42756R9430J79263q2944k42058j67286K18732J90269j4143
20306A41341p0096O7027p1421j23136j29626J51995N7917P0378j88898K6879J72305
20295A04665N6244r1549r9266j40363K6149J3604p634J10867J46987k1430L7096
$$ y = [368973, 412329, 312162, 254628, 134023, 35781, -107287, -115585, -183919, -5485, 160620, 240565, 34354, -69614, -186085, -139734, -45204, 147560, 163666, 24313, 34736, 190877, 248220, 191044, 397875, 477293, 243614, 159150, 19725, 40150, 74981, 107906, 121165, -28600, 54363, 131457, 80550, 50812, 20764, 151513, 110819, 57270, 79299, 176852, 233333, 105735, 96096, 157292, 124564, 237932, 162272, -34126, 644, 7358, -112100, -182678, -39922, 59508, 238771, 155827, -86231, -253517, -34785, 155484, 141341, 71245, 138272, 66851, -56285, -185911, -33916, 24001, 94379, -94519, -67640, 104665, 160909, 69360, -29906, -170269, -144120, -130516, -138150, -27283, 119704, 98274, 135370]
20284A35370J01673J15508L3160j82458j1875q6709P2397j6182K6309l9214p8305
20273F9674k3477K2131J07286O8351j42090l3982N2317J7287m3787O7064q2192
20262G8582q596J09288k0761j83900j0538J13201L5250Q8449r8904M0463o5966
20251G6568N7002K4671P1822O9407L0752M6417l2634j00954j91778J6809R1064
20240A59146j46710R3059J27675M8244r1423j6748j34439j42774K17013Q4790
20230A97833k6232N8666j31188j07284N4585J38643n7565K2302J36033j67356
20220A18437j41875K14156R2410M8836k52782k03394J30955N2934J9175q1843
20210b991J0663J43007n3073l5071P193P5919r5188K0889J30345M9896n3894N2389
$$ y = [135370, 237043, 352551, 385711, 203253, 191378, 104669, 177066, 160884, 187193, 147979, 69674, 46197, 68328, 175614, 243965, 101875, 67893, 120210, 137497, 93710, 160774, 78582, 69986, 179274, 158513, -25387, -35925, 77276, 112526, 200975, 102071, 142534, 76568, 133570, 158241, 230063, 299470, 330222, 376639, 344005, 243051, 51273, 68082, 159146, 12436, 105495, 233170, 281414, 189991, 173243, 38804, -103970, 113043, 197833, 171601, 230267, 99079, -8205, 46380, 185023, 127458, 149760, 285793, 118437, -23438, 190718, 283128, 331964, 79182, -124212, 6743, 59677, 78852, -2991, 7672, 150679, 97606, 62535, 69728, 145647, 50459, 71348, 201693, 251589, 197695, 250084]
20198B50084m7252k7437N4426M3162R7335j87221L6686k7809k35848J4625O3896
20187C4647j74990K7365K03196o1728p3012q2361J89863Q6874p1375P1812N1805
20176B02096J51954J14702O7704j65507k80122J09652K54159P2397k7277j35554
20166C64204Q7116N69Q4312J6773j10464j21987p2487n5039j02897J3713o2256
20155D1557M6449P5372J03683L3290j37542r9751n7150J32642N2723m3154J43831
20144B91950r3323o0985o4016J07219j11343l7243j6380R9634k2054r8748j2065
20133a7354J51512N7362K10898k5766r2410r5777m8158k01670J65606K11368K9519
20122C45130k15970r8099J6901O8083J27109J53099l3563O335M9236j04667j87918
$$ y = [250084, 202832, 175395, 229821, 272983, 370318, 183097, 219783, 191974, -43874, -29249, 34647, -140343, -112978, 90218, 28490, -44522, -126883, 62980, 149854, 78479, 150291, 202096, 354050, 468752, 536456, 370949, 90827, 200479, 454638, 527035, 499758, 364204, 451320, 451889, 536201, 552974, 442510, 320523, 248036, 192997, 90100, 103813, 41557, 88006, 163378, 267061, 300351, 162809, 63058, 5908, 138550, 191273, 148119, 291950, 198627, 137642, 73626, 180845, 69502, 32259, 15879, 115513, 93459, -5289, -17354, 134158, 191520, 402418, 376652, 284242, 188465, 140307, -61363, 104243, 315611, 345130, 129160, 31061, 47962, 116045, 243154, 396253, 362690, 369025, 418261, 313594, 125676]
20111A25676r5404N2245M5058K5909p0337p8583j17403n4817J40523j1586j35811
20100a74530J43337J53568P4350p3375m2070P8390j45814q463O6647j23863n1707
20089a03530P2940M1036K14331K59427o472k15324j68302L6399n7329K7102J0956
20078A11234n8592J7856P2061j09287J1836r6985n9147M9075J52873o4876J7067
20067D3115Q0625k3735J52923L02839O736j43495K0343P5792J01713P32o493j51476
20055D59619n2638m0250j16095j12134q8165N8082Q3139p954J2019M9937Q5157
20044C30717J19169m9607k17083K693k8402j18415J82352R9401J8103j46599p2380
20033A19949p184J66327J99320Q7231o3235k30722o7213j72461l4256Q5621K6921
$$ y = [125676, 30272, 82517, 127575, 153484, 83147, 4564, -112839, -167656, -27133, -38719, -174530, -31193, 122375, 196725, 123350, 81280, 159670, 13856, 5393, 72040, -51823, -103530, -30590, 10446, 224777, 484204, 477732, 262408, 94106, 130505, 73176, 100278, 111234, 52642, 70498, 142559, 33272, 45108, -51877, -111024, -61949, 90924, 26048, 43115, 123740, 100005, 252928, 555767, 562503, 419008, 439351, 515143, 616856, 617588, 611095, 459619, 406981, 366731, 250636, 138502, 50337, 108419, 191558, 183604, 195623, 245560, 330717, 449886, 400279, 183196, 185889, 157487, 39072, 221424, 320825, 338928, 192329, 119949, 112765, 279092, 478412, 565643, 502408, 271686, 204473, 32012, -2244, 83377, 110298]
20022A10298m6810p7723k0678J4991j5104j09725J48207J60364M433k0326J23919
20011B71846J91636m6317j62316O3337J43456L6387Q8336R5820K60117L38164
20001A280466K36488M2075k73403k24481k91414k07059J06289o030k0934J07100
19991G49097O1081J09497J52900K66882K75388r9193k38517k52740k01808l02331
19981E20256j35006L2982M1699o6661q5366l0477r0478j53437J39256R4400r4187
19970A72981j10188J58533J31608M0850P9948p9281j504l6641n2213M3936R9031
19959D47060l951n1362k54289K0023L23028K64116K49125J58767K86379M80014
19949A918910J77637k71618m19115j55574j31781j80097k98997j49859l8258o3611
$$ y = [110298, 63488, -14235, -34913, -19922, -35026, -144751, 3456, 163820, 168253, 147927, 271846, 463482, 417165, 254849, 318186, 461642, 498029, 586365, 682185, 942302, 1280466, 1516954, 1559029, 1285626, 1061145, 769731, 562672, 668961, 662931, 641997, 749097, 810178, 919675, 1072575, 1339457, 1614845, 1515652, 1277135, 1024395, 822587, 520256, 385250, 418232, 459931, 393270, 307904, 277427, 186949, 33512, 172768, 267168, 172981, 62793, 221326, 352934, 393784, 473732, 394451, 392947, 356306, 304093, 348029, 447060, 443109, 391747, 137458, 157481, 480509, 744625, 993750, 1152517, 1438896, 1918910, 2096547, 1824929, 1405814, 1250240, 1118459, 938362, 639365, 489506, 451248, 387637]
19939C87637k9908P577O2922k8133j92476K6439J2839j64745m2806J01226O8209
19928B08781L094j28288j29035K68822J90641p0701j74808j8242j3573L7103J02850
19917B76644l7779K8218m9530j3554Q0868J7675j26304M0779p1015n869K2384
19906A62517j9223J55023J17426J47709k765Q708p6530K2004j156l1400K55743
19895G38056K58813K51365K66652K97041J52351r9728k28909k53419l14625j93945
19885H73652j97749q7448p183k54374j04348J12257k305n5333o0005j31665r5163
19874i664Q8581P608Q1602j3584j65341o2898J51008J60210N7702k00384j85406
19863i0566N8856Q5334o7518o0280q2686R9211J04704k463l7013K7098r538J1830
$$ y = [387637, 357729, 365306, 428228, 400095, 207619, 234058, 246897, 82152, 39346, 140572, 208781, 211875, 83587, -45448, 223374, 414015, 343314, 168506, 150264, 136691, 173794, 276644, 238865, 267083, 217553, 203999, 284867, 302542, 176238, 217017, 146002, 140133, 162517, 143294, 298317, 415743, 563452, 560687, 569395, 492865, 514869, 513713, 482313, 738056, 996869, 1248234, 1514886, 1811927, 1964278, 1864550, 1635641, 1382222, 1067597, 873652, 675903, 588455, 581272, 326898, 222550, 334807, 332502, 277169, 217164, 85499, -9664, 78917, 86525, 168127, 154543, -10798, -73696, 77312, 237522, 295224, 94840, -90566, -31710, 53624, -13894, -74174, -156860, -57649, 47055, 44592, 7579, 34677, 25139, 36969]
19851C6969P0245J72492K03428R6881j03706o5914j51260k54835q0001J06635
19841C0934P3409k4038n1644n3571k1606j23140J9257l1675L7694j25040K5714
19830b43706J33666J94262r4100p8626K49676J71245k07234j07906O7592q1795
19820C074N128O2350J96888N7924j24670j21111J02401O660N0867R280r4790k6761
19808A27240O5753l0805k25678L2114j82861J17211J78561P092K4248O6570K4987
19797B04432l9773j9008K5661O5840R0551l4066j47649j52266M1172M7055j31627
19786d9678M0350q1063J16586J54798M4451P8823M2675o6137j15504L5781J41935
19775C43017J6454R2457K01048J81677M12228M799j68354l11449j56005l01711
$$ y = [36969, 107214, 279706, 483134, 580015, 476309, 410395, 259135, 4300, -75701, 30934, 104343, 80305, 28661, -24910, -46516, -169656, -150399, -182074, -144380, -269420, -243706, -110040, 84222, -9878, -88504, 161172, 332417, 125183, 17277, 84869, 3074, 8202, 70552, 267440, 325364, 200694, 79583, 181984, 188644, 239511, 248791, 154001, 127240, 192993, 162188, -63490, -31376, -214237, -97026, 81535, 88627, 112875, 179445, 204432, 164659, 145651, 171312, 237152, 327703, 293637, 145988, -6278, 34894, 81949, -49678, -9328, -90391, 26195, 180993, 225444, 304267, 346942, 280805, 165301, 201082, 343017, 359471, 451928, 652976, 834653, 1246881, 1251680, 1083326, 771877, 615872, 314161]
19765C14161j79983J33591J47291K9337q1060Q6246J62842J13986Q7371O0268
19755H74050j36556K8934k76544r5002r1059l2495L1551J51603m0297j33656j12890
19744A67639R128K47145N0467m4804j44135m8050K7715K5668p5733m6291P0466
19733B39215o8284j20875q1480n7807n4713L5409R2259J42369J87211N6305J00950
19722D70559N7880J4052N7060j15597p7517K02476L33718K77415j83127j96854
19712H40065k52690L4895K4362j92479O0884k4454J7667M94j02272K9825K76164
19701G12461M04663J82781j55507m58839j28387r2560Q5288R4802J0126j65018
19691D89810k20752j12183M6781k38803r8810J24147P5831J31093J60056J74532
$$ y = [314161, 134178, 267769, 415060, 444397, 363337, 449583, 612425, 726411, 813782, 874050, 737494, 766428, 489884, 394882, 303823, 271328, 302879, 454482, 414185, 280529, 167639, 176767, 423912, 474379, 429575, 285440, 237390, 265105, 290773, 215040, 168749, 239215, 170931, 50056, -31424, -89231, -143944, -108535, -16276, 126093, 313304, 369609, 470559, 528439, 542491, 599551, 483954, 406437, 608913, 942631, 1220046, 1036919, 840065, 587375, 622270, 646632, 454153, 515037, 490583, 508250, 508744, 406472, 436297, 712461, 1117124, 1299905, 1144398, 685559, 557172, 464612, 549900, 644702, 654828, 489810, 269058, 156875, 203656, -35147, -133957, -9810, 66021, 197114, 357170, 531702]
19681E31702L0983j00822n3620j0257J21024L4061O54P1638Q0664J65256n5569
19670H15714j07587k9926R8733n8928p3617j34831l9697J86749J91900j8545q4065
19659G45900l1006Q4785J03555K15011p4111j87412j47411J2966N8041j40961
19649F39357k3823k369j34459q6412J3362M1006J62923k2427L6128K06611J4359
19638H44256j11565p7450k29444j1477P9381K6391j40054J0344L0303p9723J39697
19627D80659J8624M3744m125k07612J43246J61200k4028J00032R1053R0290k7545
19616H65538J7019r6688j9878J6406J10963p7386O932j66274j30287K6777m5897
19605E07225m1172J37153L8590p7364J51575K09378j00415r9094J57396Q959n3010
$$ y = [531702, 562685, 461863, 408243, 397986, 519010, 553071, 553725, 625363, 706027, 871283, 815714, 708127, 678201, 776934, 718006, 644389, 509558, 469861, 656610, 848510, 829965, 745900, 714894, 799679, 903234, 1118245, 1044134, 856722, 709311, 722277, 780318, 639357, 615534, 613165, 478706, 392294, 405656, 446662, 609585, 587158, 623286, 829897, 844256, 732691, 655241, 425797, 414320, 493701, 520092, 380038, 390382, 420685, 340962, 480659, 499283, 543027, 538902, 331290, 474536, 635736, 611708, 711740, 802793, 893083, 865538, 882557, 785869, 765991, 782397, 893360, 815974, 822906, 656632, 526345, 553122, 507225, 466053, 603206, 641796, 564432, 716007, 925385, 824970, 725876, 883272, 892231, 839221]
19594H39221K403J11424j05304j57397j06081n5430P4972J43508o018K59J20287
19583H61844J24770q7378j33382k9325J4800K1592j21008k6235j14141m5660j10539
19572C55338L8370M9546K048j0733K5864r8195j34757K97900Q5079m1420m8819
19561E20221O5950O5099P2556k7768O2400M1121K00293O5072m5019J47262M8124
19550A215311j49632j88069k6417R5074p9067l8462j43922M4730J50720R1083
19540I71349j49465j09761J28192J23950R4127L7586j04636k07455P0945l4451
19530H20381O0565J42781q2686l2578L7176K6036O9962J37610p3803j33026k8168
19519I44250N4765J7732j07138n8394L841q9227J55797J54213p7437j58687o1866
$$ y = [839221, 841624, 953048, 847744, 690347, 584266, 528836, 603808, 747316, 741298, 741557, 861844, 986614, 899236, 765854, 736529, 751329, 772921, 651913, 625678, 511537, 465877, 355338, 393708, 443254, 445302, 434569, 460433, 362238, 227481, 525381, 610460, 569040, 520221, 586171, 651270, 723826, 696058, 758458, 799579, 999872, 1064944, 1019925, 1167187, 1215311, 1065679, 877610, 851193, 946267, 867200, 828738, 684816, 729546, 880266, 971349, 821884, 712123, 840315, 964265, 1058392, 1095978, 991342, 783887, 854832, 820381, 880946, 1023727, 941041, 908463, 945639, 971675, 1041637, 1179247, 1105444, 972418, 944250, 999015, 1016747, 909609, 851215, 855056, 765829, 921626, 1075839, 998402, 839715, 777849]
19508G77849L23274J24397J45388J14638P0836J47577L1813R1729m6489J22811
19498A903823P0646O2049L08255J62469K22901M80451O20490Q31578J228128J468027
19488G358817J512340J397289P62060o8452o39435j205789j439324j350833p31013
19479E595660n34479j09771K48694O30823R48318J201245J387430J582864J304071
19470A2254855N60797m6320q58531j391268j631902j316604q38334k34832r2595
19461F405266k01763r0114l94768l56734l10913m95643l54703L3609l2841n2523
19451D148873J50062K02302J62195L00708L96098L33170L71445O34802O94632
19442G394287Q61892Q83684O58983M20607O48085R88110J361186J784122K480819
$$ y = [777849, 1101123, 1225520, 1370908, 1485546, 1556382, 1703959, 1735772, 1827501, 1781012, 1903823, 1974469, 2036518, 2344773, 2507242, 2730143, 3210594, 3831084, 4662662, 5890790, 7358817, 8871157, 10268446, 11030506, 10962054, 10322619, 9116830, 7677506, 6326673, 5595660, 5061181, 4951410, 5200104, 5830927, 6779245, 7980490, 9367920, 10950784, 12254855, 12815652, 12769332, 11910801, 10519533, 8887631, 7571027, 6732693, 6497861, 6405266, 6203503, 6113389, 5718621, 5361887, 5050974, 4555331, 4200628, 4234237, 4201396, 4148873, 4298935, 4501237, 4663432, 4964140, 5360238, 5693408, 6064853, 6699655, 7394287, 8256179, 9139863, 9798846, 10219453, 10867538, 11855648, 13216834, 15000956, 17481775]
19433A7481775L272213M186261N217244O422629Q423319J0965788J4533383K0681816
19425I1184428L0240363M1851734N0324716N0286619L2984939O833273k2116947
19418B81589125m6844727n4759164n0526678l8229978k5949011j6483108j0454713
19411C8341746o897255m687887l409586k632041k018141j542609j370980j269307
19403A4513940j216229j171651j245325q56383o50429q05007o53042p01814n42091
19394F671969m11551j55117j48626J08906M97628M10287M02545M32091N77321
19385H385453P89720Q03569Q79456R62617R62862R60091J151670J321546J847085
19376A8064069K287183L141159M433846N385188O759972Q806990J1668757J5858370
$$ y = [17481775, 20753988, 24940249, 30157493, 36580122, 45003441, 55969229, 70502612, 91184428, 121424791, 163276525, 213601241, 263887860, 296872799, 303706072, 281589125, 234744398, 179985234, 129458556, 91228578, 65279567, 48796459, 38341746, 31444491, 26756604, 23347018, 20714977, 18696836, 17154227, 15783247, 14513940, 13297711, 12126060, 10880735, 10024352, 9373923, 8568916, 7915874, 7214060, 6671969, 6260418, 6105301, 5956675, 6065581, 6563209, 6973496, 7376041, 7808132, 8385453, 9175173, 9978742, 10858198, 11820815, 12783677, 13743768, 14895438, 16216984, 18064069, 20351252, 23492411, 27926257, 33311445, 40071417, 48878407, 60547164, 76405534]
19368G6405534K2712556L3005653M4910448N3104014N1516576L1527284L918993
19361C17101058k6989561n1185512n8032233n2551791l9187383k6057548j6428141
19354D6668889j0516137p198557n022289l454166k766214k553057k074365j641192
19346A1442912j615837j143411p30106n62110o49257n35799o23088n94916m66970
19337D521418m33694k59625r3808K56659J05255k18143j89814n2322k21207n29773
19327B884946m58510k15772j1761O4392K40957L06320J57545j17186k08381m23774
19317B218776o80684k73541k48802j56568j09785j02812r3504q8067j495J09819
19307E73337k34632j12167O1487k4983j15158o0866j48368r555J55024J69983
$$ y = [76405534, 99118090, 132123743, 177034191, 230138205, 281654781, 313182065, 317101058, 290111497, 238925985, 180893752, 128341961, 89154578, 63097030, 46668889, 36152752, 28954195, 23931906, 20477740, 17711526, 15158469, 13084104, 11442912, 9827075, 8683664, 7953558, 7391448, 6742191, 6206392, 5583304, 4988388, 4521418, 4087724, 3828099, 3734291, 3990950, 4096205, 3878062, 3688248, 3635926, 3414719, 2884946, 2426436, 2210664, 2198903, 2263295, 2504252, 2810572, 2968117, 2850931, 2642550, 2218776, 1538092, 1264551, 1015749, 859181, 749396, 646584, 553080, 465013, 463518, 573337, 338705, 226538, 288025, 263042, 147884, 87018, -61350, -70905, 84119, 254102]
19297B54102j92881k04279l2435j38667J35334K20060J97236j8641q5749J26489
19287B60569j69343j81009J35267L00414J35405j6055P324J12030L88471J72743
19277A145816J91297J82076R5857j6524m11929l53158j84187k00697k51449k2965
19267A74137l5548p9436o2309Q774R0771j12994r956J32925L9008J01419j5568
19256B31223j06878N3570k7448j54252j52727q6954J19010J48117K843k0041k267
19245D196n2144o8108p0320j35848J75473J59330J24101K12841P7013J16963J37024
19234F80521K40945J33590J94031o7703j60499p7010m02067k78836K316j754o2317
19223B01217j38393j98061J62579O1734j2842Q4336Q8074M1476j09123k01045
$$ y = [254102, 61221, -143058, -175493, -314160, -178826, 41234, 238470, 219829, 134080, 260569, 91226, -89783, 45484, 345898, 481303, 465248, 472572, 584602, 973073, 1145816, 1337113, 1519189, 1615046, 1598522, 1186593, 833435, 649248, 448551, 197102, 174137, 138589, 59153, -3156, 5618, 96389, -16605, -26561, 106364, 145372, 246791, 231223, 124345, 177915, 150467, -3785, -156512, -243466, -124456, 23661, 26504, 6463, 4196, -47948, -116056, -186376, -322224, -146751, 12579, 136680, 349521, 426534, 543497, 680521, 921466, 1055056, 1249087, 1181384, 1020885, 943875, 541808, 262972, 265288, 263534, 201217, 62824, -135237, 27342, 89076, 76234, 160570, 248644, 290120, 180997, -20048]
19213b0048j05482O2388N7748N4779K9213Q7184j51214k55118j00269j6396J75218
19202a81997J60430K564m2446J51463l687j40788N5258K5146j43035L7652K770
19191g6670K10276Q1321m0988j0137J99382J95143n4895j11174J27446J27858
19181F47562J93925K45741J51584L85996L12741k284k78747l97009l94762l74881
19171D89866j48610k5653j31386k7211n8338j02723Q504Q4799P6906j64481j45579
19160a43906J21882P446j66404q4584J18372l7275j32138l3339P0929J16416R0866
19149g1735J31225J93822j23054k51206k5640N2543Q0905j67379j07193m085Q5555
19138b06242J61838J9302P1011J4585J07842j26620P989K4949j00283n2130K20489
$$ y = [-20048, -125530, -63142, -5394, 49385, 78598, 165782, 14568, -240550, -340819, -357215, -181997, -21567, -19003, -61449, 90014, 86327, -54461, 797, 25943, -117092, -79440, -76670, 133606, 214927, 173939, 163802, 363184, 558327, 503432, 392258, 519704, 647562, 841487, 1087228, 1238812, 1624808, 1937549, 1935265, 1656518, 1259509, 864747, 489866, 341256, 315603, 184217, 157006, 98668, -4055, 4449, 89248, 166154, 1673, -143906, -22024, -14578, -180982, -265566, -147194, -184469, -316607, -349946, -279017, -162601, -71735, 59490, 253312, 130258, -120948, -146588, -94045, -13140, -180519, -287712, -291797, -206242, -44404, -25102, 45909, 60494, 168336, 41716, 49705, 74654, -25629, -77759, 142730]
19127A42730J07104j56964k4484j27999l0638J51574j44445q7696K7671J05785
19117c7362O0781R0861K02187P5007l3064o805n1444K03966R6547L69052L39776
19106A309502K52002K52679k17433l31814l00590j70873j52169m317j4880P6627
19096F98734j2911J35170K26542M18600L83984l1278j83271m21069l07684n7357
19086H49460j68093j82383p9259j29802r6151P970J426o0480m9826j41291P4886
19075B6457J43988M7085k7493n4564K4454j28673j58747j18914P4888K63968Q3082
19064A75531j3769j9023q0119l39884N8078Q8617l7225j6143l413O275P809K597
19052a70669J38491j6365K1947M2109j91108o5593J65072m9152P2736J66352N3255
$$ y = [142730, 249834, 92870, 68386, -59613, -90251, 61323, -83122, -170818, -143147, -37362, 23419, 114280, 316467, 391474, 358410, 351605, 300161, 504127, 600674, 969726, 1309502, 1561504, 1814183, 1596750, 1264936, 964346, 793473, 641304, 636987, 622107, 698734, 685823, 820993, 1047535, 1466135, 1850119, 1818841, 1635570, 1214501, 906817, 849460, 681367, 498984, 419725, 289923, 193772, 201742, 203168, 142688, 92862, -48429, 26457, 170445, 217530, 190037, 135473, 159927, 31254, -127493, -246407, -171519, 92449, 175531, 161762, 142739, 62620, -277264, -219186, -130569, -167794, -183937, -187350, -181075, -173266, -170669, -32178, -48543, -26596, 15513, -175595, -241188, -76116, -125268, -52532, 113820, 167075]
19041A67075L3800j03866m4307J47305r4705J241m3601j04693j10169M7265m2637
19030a47292p8157l30K46737J03851l7676p971j27799q483n2802r3395R8249J78502
19018G3434k5913J19635K0425P2666j02366k73557j95611K30311N7663Q6151k16944
19007a54106J5041P1428M6264P3359m3838K4914o1693j10373l6507P8879P4199
18996b2433Q8277R6461q7092l7129Q3749R8751m8850j12333j82056j06090L0751
18985a97994J6484j79712M9659J01398P310l3164J11972K2754R5591K08031J91275
18974C93604j69264j38215J16671n3184o2155J871j82984n9423J10684j4776P9165
18963B1994j02906o8109J00756N0733k11857q3961J70523P3144L9592L4348J68628
$$ y = [167075, 200875, 97009, 52702, 200007, 105302, 106543, 62942, -41751, -151920, -104655, -147292, -225449, -225779, 20958, 124809, 87133, 79162, -48637, -57120, -109922, -203317, -105068, 73434, 47521, 167156, 187581, 260247, 157881, -115676, -311287, -80976, -23313, 62838, -154106, -139065, -67637, -21373, 51986, 8148, 33062, -28631, -139004, -175511, -96632, -22433, 65844, 162305, 75213, 38084, 121833, 220584, 171734, 59401, -122655, -228745, -197994, -181510, -361222, -311563, -210165, -202855, -236019, -124047, -101293, -5702, 202329, 393604, 224340, 86125, 202796, 149612, 87457, 89328, -93656, -153079, -42395, -57171, 21994, -80912, -149021, -48265, 2468, -209389, -293350, -122827, -49683, -10091, 24257, 192885]
18952A92885J8531r8405j20665P1526J46671r513l9893l0879L741J6131n1268
18941I8862J827L0704k9875J63235o1657J5542K25810K8997r8631L0418p2072
18930C33160r1333K3524j97952j72366q4076J20648P3050p7567j75485L3130K11403
18919c864O4532j0589j95749j23809N2402K53951R2601j9634M0479J03941j49988
18908A04273j86168l5873J12674J65999n548p7333K6973l7870J21982Q8650Q9768
18897C67527P3365J08425M79217M84006N98415L79265j71847k83195o5982Q7258
18887B056454R1446J833o7957k40020l51631k68935q4400J99334K50205j88891
18877A397438k75601m52319k84630j44462j31643P919j27415k09846J40867K16101
$$ y = [192885, 211416, 113011, -7654, 63872, 210543, 201030, 161137, 130258, 133999, 150130, 98862, 100689, 131393, 101518, 264753, 203096, 218638, 444448, 473445, 374814, 405232, 333160, 241827, 265351, 67399, -104967, -189043, -68395, 4655, -72912, -248397, -215267, -3864, 60668, 50079, -145670, -269479, -217077, 36874, 129475, 109841, 150320, 254261, 104273, -81895, -117768, -5094, 160905, 155357, 78024, 104997, 67127, 189109, 277759, 367527, 440892, 549317, 1028534, 1512540, 2110955, 2490220, 2318373, 2035178, 1969196, 2056454, 2147900, 2149733, 2081776, 1841756, 1490125, 1221190, 1136790, 1336124, 1586329, 1397438, 1121837, 669518, 384888, 240426, 108783, 116702, -10713, -220559, -79692, 136409]
18867A36409M8057j05872j35571J3833j3498j22278J29359K35421N9031j17204
18857A27687j10693O7389n8715R3402J68311J2678L8586Q0226m6301j11312j12609
18846A48649n7200J61216J2686j2081J345K16879J80974J38834L29377K40773
18836A361452j57163k29174M2782K22220K57171J28239J40566l9571p9216M2035
18826A689341j11618l7498J31381k25662l64979l88023k73679k31949q9612K7778
18816A25480j29989j59843J5915P6101N2135J0268Q1495j16705J09561J48884
18806B13302K36503o8799j70312O370K88301k30373j71972J3193j19522R2518
18796H9209M402Q0268J21657J13444q2877k82603j72440Q1557J27904K1073R8756
$$ y = [136409, 184466, 78594, -56977, -43144, -56642, -178920, -49561, 185860, 244891, 127687, 16994, 84383, 25668, 119070, 287381, 300059, 338645, 418871, 372570, 261258, 148649, 91449, 252665, 265351, 253270, 254615, 471494, 652468, 791302, 1120679, 1361452, 1204289, 975115, 1017897, 1240117, 1497288, 1625527, 1766093, 1726522, 1647306, 1689341, 1577723, 1540225, 1671606, 1445944, 1080965, 692942, 419263, 187314, 97702, 125480, -4509, -164352, -148437, -72336, -20201, -9933, 71562, -45143, 64418, 213302, 449805, 381006, 210694, 217064, 505365, 274992, 103020, 116213, -3309, 89209, 93611, 173879, 295536, 408980, 326103, 43500, -128940, -47383, 80521, 101594, 200350]
18785B00350J16407j44163n0471n0997l1626o6453j31990J5187N9295K6992J1383
18774d6086R2461J18431J93323K25122Q8782K62503N25301N63298r3436n28909
18764A400790n36100l26312j41407j90640M6356j60494r4926j04938o4480o6383
18754b38534J37658J22922q3420o5913Q6867P2871J23548N8348K8869j54586k14274
18743a25644j33985O6304k3933r9442q5756K70493K42871J69720R8841j85599
18733A93870m5378j8512L4023n2331N316k8411J49435l9259j12273o2679j65775
18722a41974Q440J87762j483m4089J37209L2461k58971l3890j81722M6105q946
18711b59098j50761J80128J21402R5094J61397M4890o6064k2972Q538o085r0174
$$ y = [200350, 316757, 172594, 122123, 71126, 39500, -26953, -158943, -143756, -84461, -57469, -46086, 46375, 164806, 358129, 583251, 672033, 934536, 1459837, 2023135, 1929699, 1400790, 864690, 538378, 396971, 206331, 252687, 92193, -2733, -107671, -172151, -238534, -100876, 22046, -61374, -127287, -40420, 32451, 155999, 214347, 243216, 88630, -125644, -259629, -193325, -217258, -316700, -402456, -131963, 110908, 280628, 379469, 193870, 148492, 129980, 164003, 111672, 116988, 88577, 238012, 198753, 86480, 23801, -141974, -133534, 54228, 52745, 8656, 145865, 178326, -80645, -114535, -296257, -250152, -259098, -409859, -229731, -108329, -13235, 148162, 193052, 126988, 104016, 112554, 106469, 16295]
18700A6295p8051Q795J21120n2978M213k8692J37879p0822j14626J3219L8294
18689e354J05053N8019Q006L8639j1817j938q1437j72813j24051N7132M1860n034
18677i3735J62736p5412j16643n0879L3626M4045o3290m318p0460R1323K41912
18666I8905R0981q1909j120j7506m362j80805r2141l0321j90084L8881R7820J59462
18654a12199R0589O2291j2171j36132K3487J51222R4714L9663l2190n6499j9764
18643I3011k13239k29921J48859K42392j5234m2478p9903R5690P6977j01337k43560
18632b68743P6611J04410L992N9648J17282J36028Q2021o1179o0743j11766n6191
18621B1370j69407J63659K68616l131r4763j34315j29104j54094k9866J42724
$$ y = [16295, -61756, -52961, 68159, 15181, 19394, -9298, 128581, 57759, -56867, -43648, -5354, 99699, 157718, 165724, 204363, 192546, 190608, 109171, -63642, -187693, -130561, -88701, -93735, 69001, -6411, -123054, -173933, -140307, -96262, -159552, -163870, -234330, -143007, 98905, 189886, 107977, 106857, 89351, 84989, -95816, -187957, -218278, -408362, -369481, -271661, -112199, -21610, 40681, 28510, -107622, -84135, 67087, 161801, 201464, 169274, 112775, 93011, -120228, -350149, -201290, 41102, 25868, -16610, -96513, -823, 76154, -25183, -268743, -192132, -87722, -83730, -24082, 93200, 229228, 311249, 250070, 189327, 77561, 21370, -148037, 15622, 284238, 281107, 186344, 52029, -77075, -231169, -261035, -118311]
18611a18311J38425M0989q698R0943q732m2441k2504k7145K4921R939M3691M0932
18599A62009j69623L6187J47968J39584l7816j60283N689n5395O2067P055M2520
18588A79962J2382j49418l1645j0928o0320J02579K38089J4883j82077J94199
18578C07706K37911K31310K09817N2817J37207J93675K14715Q1274j96712l59532
18568A110188m90119L4679L29068K46183J04930J39855L4239k85152k43748k09918
18558G70205k15955k04899m295L0793n3169j20908L2281j15241J3316M1507P6285
18547B49920m777L2394m7640n0980j80986n5527N2307N2729J47208o4820n3814
18536G6014q1141m9276N6280J62675M2839P804N3459P5922O2356K79578K10779
$$ y = [-118311, 20114, 61103, 52405, 143348, 134616, 92175, 69671, 42526, 67447, 77386, 121077, 162009, -7614, 28573, 176541, 316125, 278309, 118026, 123715, 68320, 130387, 137442, 179962, 192344, 42926, 11281, 353, -59967, 42612, 280701, 295584, 113507, 307706, 545617, 776927, 986744, 1039561, 1176768, 1370443, 1585158, 1666432, 1469720, 1110188, 620069, 654748, 983816, 1229999, 1334929, 1474784, 1509023, 1223871, 980123, 770205, 554250, 349351, 345056, 375849, 322680, 201772, 234053, 118812, 132128, 173635, 249920, 245143, 277537, 229897, 178917, -2069, -57596, -5289, 47440, 194648, 129828, 76014, -5127, -54403, 1877, 164552, 207391, 215195, 268654, 344576, 406932, 686510, 897289]
18525H97289J64795K98629J66544k33501m6434k3616j29864L6527K15831n9135
18515A287065m299P8690k2323l29492k28524r4693j05676k93833p3351o8859N4452
18504A99157O6815P3769n9062p4973M672p5197l1152J28037M3659p7846j04939
18493I2940J9891Q863j30786j5712J31762J38742o7608j84655k2665l1436P3454
18482A2790K3609P6281J49390J16638r2407q0990L6569O7187p9727j7301l5445
18471A76594m1954l1846k5327J74251M7303Q4583n4341j21329L4477P0396p7525
18460B35282q6918J09204O5635n8821J47635Q811j17645k60646K2610p9919k0581
18449c5353O4177O7268J25651R2069j05881p8331q3261J18377M816J938m3193
$$ y = [897289, 1062084, 1360713, 1527257, 1293756, 1247322, 1223706, 1093842, 1130369, 1346200, 1287065, 1282766, 1361456, 1339133, 1009641, 781117, 686424, 580748, 286915, 213564, 144705, 199157, 265972, 339741, 280679, 205706, 210378, 135181, 104029, 232066, 275725, 197879, 92940, 112831, 121694, -9092, -24804, 106958, 245700, 178092, -6563, -29228, -60664, 12790, 36399, 112680, 262070, 378708, 286301, 205311, 241880, 309067, 229340, 212039, 176594, 134640, 102794, 77467, 251718, 299021, 383604, 329263, 207934, 242411, 312807, 235282, 148364, 257568, 323203, 264382, 412017, 420828, 303183, 42537, 65147, -14772, -35353, 28824, 96092, 221743, 313812, 207931, 129600, 46339, 164716, 169532, 171470, 128277]
18438A28277j72278J2716l8934Q8914j2244l6072n3848J30162R9325N5247M8872
18427B50137q1048j05952J4679M397J31005M1908J0208J61142O1998k0206l7258
18416D31010j51364n6084o7201j79606N4850K78098L471j31252q3426L3904Q6229
18405B18629K2658j22177j44772J65695O5892m2455j4006N3498j22207j55709
18395g4954J98847K27560J71590j19983q0036j10298j63814Q9912J71302J46433
18385D56559P6840j36529l6169J17906j17902j98160O6080q9361q6087n0182K9815
18374C2810j12509j12636Q0098K96592J01778j11271k807j22798j56775k3228
18364a30746J63543N6436m3992J2800L37455l9168j42591l1008J95344P482k7681
$$ y = [128277, -44001, -31285, -70219, 18695, 6451, -29621, -83469, 46693, 146018, 201265, 250137, 169089, 63137, 77816, 82213, 213218, 255126, 265334, 426476, 488474, 468268, 431010, 279646, 223562, 156361, -23245, 31605, 309703, 313174, 181922, 98496, 132400, 218629, 241287, 119110, -25662, 140033, 205925, 163470, 149464, 202962, 80755, -74954, 123893, 351453, 523043, 403060, 323024, 212726, 48912, 138824, 310126, 456559, 533399, 396870, 360701, 478607, 360705, 162545, 228625, 139264, 53177, 2995, 32810, -79699, -192335, -112237, 184355, 286133, 174862, 172055, 49257, -107518, -130746, 32797, 89233, 45241, 58041, 395496, 356328, 213737, 182729, 378073, 385555, 357874]
18353C57874R0969N3532o6260L1791m3567j33575J43521O4109k40197j07430o0
18342A50707J07968N9776J050P7217M6292l3082K5293J09626l4634m9234k30752
18331B30227p3719l8449J65902l4947J3752L5584j80597k41722o0356P8325K3247
18320h2753J06819J43137J26227q9170P0515k9938m9888N7896p8512N6972Q6347
18309C17652p0576k06410j7821J90557R8821j516Q3255q937L9514j34567N8640
18298C48612R9437J41573k282k7388p5103j42639p5290k694k5223N1940k7733
18287B63210p6404L3646J23991J83800M4672Q0542p6390p4539l3920P7133l0991
18276E14750j7884M9762m2188o1036j7105J65945P913j18447l23906o6788K74391
$$ y = [357874, 448843, 502375, 436115, 467906, 424339, 290764, 434285, 498394, 258197, 150767, 150707, 258675, 318451, 319501, 396718, 443010, 409928, 435221, 544847, 510213, 460979, 230227, 156508, 118059, 283961, 249014, 262766, 298350, 117753, -123969, -184325, -106000, -82753, 24066, 167203, 293430, 204260, 274775, 244837, 194949, 252845, 174333, 231305, 317652, 247076, 40666, 22845, 213402, 312223, 310707, 393962, 385025, 424539, 289972, 348612, 448049, 589622, 587340, 559952, 484849, 342210, 266920, 264226, 239003, 290943, 263210, 186806, 220452, 344443, 528243, 572915, 653457, 577067, 502528, 468608, 545741, 514750, 496866, 546628, 504440, 443404, 426299, 592244, 600157, 481710, 157804, 91016, 365407]
18265C65407K95584J4325J07372k7385j25589O6554j55254k60162m020R9703J07265
18254D83800Q6268O7025r7622r8902P9172J71328K5661J6918K21006J01486J1553
18243A067693l9409J01830N2617J39578K15870K09597L40696P13402R77807J079624
18233D859305J092541K21628o02322j005504j065749p74814o28711j64642j5363
18224A916369J31934n8867J04707N21534P27835R04250R45381O21490r736p33656
18214E071241j206422j140717p46425m32136k60125j67106k40812l8211P0739
18205I10026N6730K059o5195n4569p2462j7532J36302k23674J7731J53154j09332
18194G33238n3059Q5845n9889J67064J90598J36209N7656N9703m750N2697M4246
$$ y = [365407, 660991, 675316, 782688, 755303, 629714, 696268, 541014, 280852, 276832, 376535, 483800, 570068, 637093, 539471, 440569, 519741, 691069, 716730, 733648, 954654, 1056140, 1067693, 1028284, 1130114, 1182731, 1322309, 1538179, 1747776, 2088472, 2801874, 3779681, 4859305, 5951846, 6173474, 5571152, 4565648, 3499899, 2725085, 2096374, 1931732, 1916369, 2048303, 1989436, 2094143, 2615677, 3343512, 4247762, 5193143, 5814633, 5804897, 5071241, 3864819, 2724102, 1977677, 1545541, 1285416, 1118310, 877498, 839287, 910026, 966756, 968815, 903620, 849051, 776589, 759057, 895359, 671685, 689416, 842570, 733238, 680179, 766024, 706135, 873199, 1063797, 1200006, 1257662, 1317365, 1312615, 1365312, 1409558]
18183A409558K09977L75307M82365O83778R12923J104540R77040N75305l47095
18174F383698q42461j244422j023402m88956l30460m7702O3848J54416K57683
18165B882242M46555O26070P34153J096092R40463J71063p20529j149369j105728
18156C921012r94333o61289k77518k73063j20033p8179K19472O8232R3999J27952
18146B026252r567J4643j27069L1718J0118N2708J07354K80801J98362M3971j9512
18135B609779O4489L93077M01633K41309M02407J32417M16676N71801N90509P67569
18125F591666R57878J030267J169213J628126J897908K921894M001447N039775
18117B5238174O735739Q430093J0053727J2799219J9130776L1757327N6255815
$$ y = [1409558, 1619535, 1994842, 2477207, 3160985, 4073908, 5178448, 6155488, 6730793, 6383698, 5541237, 4296815, 3273413, 2784457, 2453997, 2406295, 2470143, 2624559, 2882242, 3328797, 3954867, 4689020, 5785112, 6725575, 6896638, 6176109, 5026740, 3921012, 2926679, 2265390, 1987872, 1714809, 1594776, 1516597, 1736069, 1804301, 1898300, 2026252, 2016685, 2031328, 1904259, 1935977, 1946095, 1998803, 2106157, 2386958, 2585320, 2629291, 2609779, 2674268, 3067345, 3468978, 3710287, 4112694, 4245111, 4661787, 5233588, 5824097, 6591666, 7549544, 8579811, 9749024, 11377150, 13275058, 16196952, 20198399, 25238174, 31973913, 40404006, 50457733, 63256952, 82387728, 114145055, 170400870]
18110A70400870R8748225J11491532j3429994j00818314j02806738o7507742l4477013
18103F1600826j8768083j1131156p075784m830514l317358k384624k029415j737241
18095A0326651j299637r76015j100385j195857r79172n83827m34533j91609k95089
18086C270527l31893l24268k92187j17920j80637k98698j68290k477j08229n8710
18076A387218K05K8158k08355l67965j45755o6404k32059J4162O3451N4708q4444
18065D42920q0638O2379Q2538r3102p0105k2494n5167q2209P4868J37695J64779
18054E61464O3263j22519j62750r8505J07144q1116o7036k715P7322J72999o9726
18043C77825j52980N5481J22140j3796m2971r9219M0218N6512o6610j65239j02295
$$ y = [170400870, 269149095, 380640627, 367210633, 266392319, 163585581, 96077839, 61600826, 42832743, 31701587, 24625803, 19795289, 16477931, 14093307, 12063892, 10326651, 9027014, 8050999, 6950614, 5754757, 4775585, 4191758, 3757225, 3565616, 3270527, 2938634, 2614366, 2322179, 2204259, 2023622, 1724924, 1556634, 1554157, 1445928, 1387218, 1387423, 1415581, 1207226, 839261, 693506, 627102, 395043, 409205, 472656, 527364, 442920, 362282, 424661, 507199, 414097, 343992, 321498, 266331, 184122, 258990, 396685, 561464, 624727, 502208, 339458, 240953, 348097, 266981, 199945, 197230, 274552, 447551, 377825, 224845, 280326, 402466, 388670, 345699, 246480, 286698, 343210, 276600, 111361, 9066]
18032I066j14376K40276K25355J33504j79596m2396O5084j0029p7608j22613R404
18021A36071l1304N8239R1875p9708M5079l2703k5929M411o804P2133R7089j08987
18009B19462m0493J11601q1567j72517j41105P0157J36337K013R065L283j3275
17998A02961J49918K15350j29115k13548J58683k54085J1351N9760Q2981n6942
17988A27314p8963P463J06710P311M0126o9624j26618j981K1706j5485K5830K2884
17976F6673l5359l399J81216K9537o9465p7508n2548n7102Q3434Q141j4158J23364
17964A82826J03248Q9689O0249k9087r7496J43515J8842J53664J59462O5556J37766
17953I88234J35581L00643M52507K00174j18832k56601j96443k69553l80070j38488
$$ y = [9066, -105310, 134966, 360321, 493825, 314229, 271833, 336917, 326888, 249280, 126667, 136071, 104767, 163006, 254881, 175173, 220252, 187549, 161620, 166031, 159227, 231360, 328449, 219462, 178969, 290570, 209003, 36486, -104619, -34462, 101875, 103888, 112953, 116236, 102961, 252879, 468229, 339114, 125566, 284249, 30164, 41515, 101275, 184256, 127314, 48351, 55814, 162524, 169835, 209961, 140337, 13719, 11738, 33444, 17959, 43789, 66673, 31314, 27915, 209131, 238668, 169203, 91695, 39147, -17955, 65479, 73620, 59462, 182826, 286074, 375763, 436012, 406925, 309429, 452944, 471786, 625450, 784912, 850468, 988234, 1123815, 1424458, 1876965, 2077139, 1958307, 1701706, 1505263, 1235710, 855640, 717152]
17943G17152Q6740j13076j23258L22440M86044M79724K83525j1553j25026l46342
17933A656370l96123n02612l65038n0494Q5967J28763j07347l0059r3856l56008
17923c0437p8318J16406J07837L7989J3906K8583k5313N2322j22774k2395Q5214
17912A63020j8497Q8710o3555j32403m7579L5978J26885n3628l6668J54555L5211
17901B52029o8535j14404J368K14899k5303L6330l1602r3525l8315j0765J58192
17890B80369Q2597K5701p6514l2642J25279m6474j81865q5O1638J16428k1793
17879C32639k42576Q2345J03325J38622n741j42988p6728J10514q5325r2042p3280
17868D8765L9420n6414l1052J18930J30790m228J56355N0506l64783o633O6643
$$ y = [717152, 803892, 690816, 567558, 889998, 1376042, 1855766, 2139291, 2127738, 2002712, 1656370, 1260247, 757635, 392597, 342103, 428070, 556833, 449486, 419427, 325571, -30437, -108755, 7651, 115488, 153477, 167383, 195966, 170653, 222975, 100201, 77806, 163020, 144523, 233233, 169678, 37275, -10304, 25674, 152559, 98931, 62263, 216818, 252029, 183494, 69090, 70458, 285357, 260054, 296384, 264782, 171257, 132942, 122177, 280369, 362966, 388667, 312153, 279511, 404790, 358316, 176451, 176366, 238004, 354432, 332639, 90063, 172408, 275733, 414355, 408614, 265626, 188898, 299412, 214087, 122045, 48765, 88185, 31771, 719, 119649, 250439, 246211, 402566, 453072, 88289, 81656, 148299]
17857A48299M6906J39163J3043j60770l6809L3231k7743Q204Q0537J28522p8380
17846B94203j99204k2834l317J01858O4501j10881k4418L2455P7436J10705P8895
17835C99399N2283j48721Q7780K6250J21575K1282m7106k90699j46675j21838
17825d6470J07297J91521l6915j48117l580p5953j09900N2608J50993J69132l1961
17814B18655m2274J32065J02819o1480J6268q613j1261q17Q756q90K045q4355
17802B70918l0086O272p0020q315J09294M5273m8833l6608k44780p7214L837K3441
17790e6821R6728K60974J83116N0632j62377k75926l5557o129L3548J14060N9201
17779B61449Q8069o8580l9408M4889k7411j11847J18584R9590J16010M7181p4012
$$ y = [148299, 195205, 334368, 347411, 186641, 149832, 183063, 155320, 163524, 244061, 372583, 294203, 94999, 72165, 68848, 170706, 235207, 124326, 99908, 132363, 209799, 320504, 399399, 451682, 302961, 390741, 416991, 538566, 559848, 512742, 222043, 75368, -46470, 60827, 252348, 215433, 67316, 63736, -12217, -122117, -69509, 81484, 250616, 218655, 176381, 308446, 411265, 349785, 366053, 357440, 346179, 345362, 354118, 353228, 355273, 270918, 240832, 247104, 177084, 168769, 278063, 323336, 274503, 237895, -6885, -84099, -80262, -56821, 39907, 300881, 483997, 534629, 372252, 96326, 60769, 54640, 88188, 202248, 261449, 349518, 280938, 241530, 286419, 259008, 147161, 265745, 365335, 481345, 528526, 454514]
17768D54514Q1276N4042O5844q2158p9735J08638R2630P3704o2569K1227j3691
17757G13722K58350K10472J86245P4661k72253l10552j68303j04055p9158R0395
17747E99524J27920m1600q2419k6722K26161N29505K99506q3892m12816k17058
17737I18109k36854k27643K8151P5113M4931L514j2441J8901J76766L009k2199
17726G69357r855j50645k47579J7348P0776N1415O6132j87977M5929J74748Q7772
17715F87421J28891j8994l8858K0289R0808R5845N1541j86741j6469j09081M0466
17704G45118O9340N053J09958K04913J16835m044K26028K05498m9527j38733m1257
17693A449182j05332k18569k37093j38211Q5565J46748K56123L5616R7308L29742
$$ y = [454514, 535790, 589832, 655676, 573518, 493783, 602421, 695051, 768755, 706186, 727413, 713722, 972072, 1182544, 1368789, 1443450, 1171197, 860645, 692342, 588287, 509129, 599524, 727444, 685844, 603425, 576703, 802864, 1332369, 1631875, 1547983, 1135167, 918109, 681255, 453612, 481763, 556876, 601807, 605321, 592880, 611781, 788547, 791556, 769357, 759502, 608857, 361278, 378626, 449402, 500817, 566949, 378972, 424901, 599649, 687421, 816312, 797318, 758460, 778749, 869557, 965402, 1016943, 830202, 813733, 704652, 745118, 814458, 819511, 929469, 1134382, 1251217, 1247173, 1473201, 1678699, 1629172, 1490439, 1449182, 1343850, 1125281, 888188, 749977, 835542, 982290, 1238413, 1274029, 1371337, 1701079]
17683A701079P1691j69480l23212l62437j77436k5916R3778q0839m0405m6811
17673F40012J53318J23231j34762k38737l5087q0298N1806P0862r464k2364o575
17662E11942L7911M1675m5798k1106q3179j36429P2203P0189m9779J53759J40682
17651F92070J50505r2629k5175R0446n1764p3450n7355n5972Q7409L492n3471
17640F14106l5828J75138m9117J00844j18898j07764J1054N9338P2342K1370j1245
17629G31340p1312q5498j84513P9160J06267R5173l5478n9268Q347n3583m8389
17618D82246k3645M6116j56528J91564N4343O1834L1585L524P3404R5553N53m2981
17606H17568j31016j10121n7542o561J24543K8948L1333N0369p4304J5568j19522
$$ y = [1701079, 1772770, 1603290, 1280078, 917641, 740205, 714289, 808067, 727228, 686823, 640012, 793330, 916561, 781799, 543062, 507975, 427677, 479483, 550345, 540881, 518517, 511942, 549853, 591528, 545730, 524624, 441445, 305016, 377219, 447408, 397629, 551388, 692070, 842575, 749946, 724771, 815217, 763453, 690003, 632648, 576676, 664085, 667577, 614106, 578278, 753416, 704299, 805143, 686245, 578481, 589535, 648873, 721215, 742585, 731340, 660028, 574530, 390017, 469177, 575444, 670617, 635139, 575871, 584218, 530635, 482246, 458601, 504717, 348189, 539753, 594096, 655930, 687515, 691039, 764443, 859996, 860549, 817568, 686552, 576431, 518889, 512328, 636871, 665819, 697152, 747521, 673217, 688785, 569263]
17595E69263q0189o1719m6598m5208J00520J8054l9314J83093K5530N2133J28441
17584H04006K12099K47800J86026K03489J06167J05120q2394l81770l27851j02745
17574I69947r0018r1099j7995l330J05038k30502k9406K34252N647l8797K3320
17563H37057m9943m9994L9255K5741J83592O3436J04690J61424j35306m1711J14462
17552A252703j1212j09614J7283J28005k9215j45426j55315J57759M6695k07151
17542I44512o0803k4351J64365O7703J66217J14150j30965q1544o8697O054J26509
17531A223150p2303n3770p0274N5656J67598j8794P903J65504L87793L11955R974
17520B114392k5067k47897j29210o4545j13861R1016n1499q2534j16225q9784
$$ y = [569263, 489074, 427355, 380757, 335549, 436069, 454123, 414809, 597902, 623432, 675565, 804006, 1016105, 1263905, 1449931, 1653420, 1759587, 1864707, 1782313, 1400543, 1072692, 969947, 879929, 788830, 770835, 767505, 872543, 642041, 612635, 846887, 852534, 813737, 837057, 787114, 737120, 776375, 802116, 985708, 1049144, 1153834, 1315258, 1179952, 1138241, 1252703, 1241491, 1131877, 1149160, 1277165, 1247950, 1102524, 947209, 1104968, 1151663, 944512, 883709, 859358, 1023723, 1091426, 1257643, 1371793, 1240828, 1159284, 1090587, 1096641, 1223150, 1150847, 1097077, 1026803, 1082459, 1250057, 1231263, 1239166, 1404670, 1792463, 2104418, 2114392, 2089325, 1841428, 1712218, 1647673, 1533812, 1624828, 1573329, 1490795, 1374570, 1284786]
17510A284786p557p599J48982J37636J53675k1559j56967j12899J5724j1410J71444
17499A594256J79053J6940n2154O1378L2558k08443j09397J44900R2306L9408
17489A790805J49295J52547R7202P1550J17932l7746R9000J34223N0981n4430
17479B571359J95379N3195P895r4142R989J12158J01255J07959K92836R2539J4487
17468C464909J51297J81456K32968L1127K14459J92306P8021K49484L79921K59050
17458E434998L19081N27894M55013N98446R59535R71311Q43204Q66419P78991
17449A1754892Q81967Q63961J111184J430912J652723K125770K839126K955063
17441B5615598L298242M277603N608543P659769R815628J2565140J6963954K4766395
$$ y = [1284786, 1277229, 1269630, 1418612, 1556248, 1709923, 1688364, 1531397, 1418498, 1434222, 1422812, 1594256, 1773309, 1790249, 1738095, 1799473, 1832031, 1623588, 1514191, 1659091, 1751397, 1790805, 1940100, 2092647, 2189849, 2261399, 2379331, 2341585, 2440585, 2574808, 2625789, 2571359, 2766738, 2819933, 2827828, 2733686, 2743675, 2855833, 2957088, 3065047, 3357883, 3450422, 3464909, 3616206, 3797662, 4030630, 4061757, 4276216, 4468522, 4546543, 4796027, 5175948, 5434998, 5754079, 6281973, 6736986, 7335432, 8294967, 9266278, 10109482, 10975901, 11754892, 12636859, 13500820, 14612004, 16042916, 17695639, 19821409, 22660535, 25615598, 28913840, 33191443, 38799986, 46459755, 56275383, 68840523, 85804477, 110570872]
17433A10570872L8800179O1124044P7109969M9384907J6887532j6095067o2872573
17426B74909863o9423787n2208887k8271165j0463463J377771J1949554K5329466
17419A53199352M5319768P2542235P7498057L3525317K129048m3448140q3012773
17412B57752864p9769857n8814383l5745626k1025818j3271721q956594o412081
17405C3756784n029864l993756l041400k197378j605258j306742j130435j037567
17397A4414384j170845j125574p40453o17200r51650r97013r85264o98083o34735
17388F493567p55955l89541l99231M8497J26749Q0384L31600N74183Q08890J195487
17378H114630J884410K271603J003111J59082p50156k420682k566041j990439
$$ y = [110570872, 149371051, 210495095, 287605064, 336989971, 353877503, 337782436, 274909863, 205486076, 153277189, 125006024, 114542561, 115920332, 127869886, 153199352, 198519120, 271061355, 348559412, 382084729, 384213777, 340765637, 257752864, 177983007, 119168624, 83422998, 62397180, 49125459, 40168865, 33756784, 28726920, 24733164, 21691764, 19494386, 17889128, 16582386, 15451951, 14414384, 13243539, 12117965, 11377512, 10760312, 9808662, 8811649, 7826385, 7128302, 6493567, 5737612, 5348071, 4948840, 4997337, 5124086, 5204470, 5536070, 6110253, 6919143, 8114630, 9999040, 12270643, 13273754, 13432836, 12682680, 10261998, 7695957, 5705518]
17370E705518j418565p68127l08170k53929l86384l20917j84381j65240j35778
17361A764027L6091k8912o1776J0452j93499k75294J5108n1490j17782R4900L4398
17350A226223J06793J66081k16611k82835K0422J54476K00205J49420K2207j70796
17340A375585q0946P1581N3845M0026N1319J21479O6145K2337J20548K30137J20184
17329B192240J61667J87672K37587K18273L74106O23754Q99873J669542K448966
17320I013680J701574M51766k48786j573279k276071k054954j343640q78195o67092
17311B125003n59994l01335j34598J51133J1399r5628r2659O5799k4696k3950
17301A120474q4831k23765l4304J07937j9102L1904R2556Q4093r2543O8468O3817
$$ y = [5705518, 4286953, 3518826, 3210656, 2956727, 2570343, 2249426, 2065045, 1899805, 1764027, 1800118, 1771206, 1709430, 1719882, 1526383, 1251089, 1266197, 1214707, 1096925, 1191825, 1226223, 1333016, 1499097, 1282486, 999651, 1020073, 1174549, 1374754, 1524174, 1546381, 1375585, 1294639, 1366220, 1420065, 1460091, 1511410, 1632889, 1699034, 1721371, 1841919, 2072056, 2192240, 2353907, 2541579, 2779166, 2997439, 3371545, 3995299, 4895172, 6564714, 9013680, 10715254, 11167020, 10918234, 9344955, 7068884, 5013930, 3670290, 2792095, 2125003, 1565009, 1263674, 1129076, 1280209, 1291608, 1195980, 1103321, 1169120, 1144424, 1120474, 1035643, 811878, 777574, 885511, 866409, 898313, 990869, 1074962, 982419, 1050887, 1114704]
17290A114704R0283J97501m1350l03905j08682J01914J85864K97539J00447l3765
17280A600550J5206L3058k1852k0468J42423J22768m5885q4760j16219j70788
17270A454033P477m5738L420j1641n2153j6177J40772P5978p4700j25040J07116
17259A463347K37464J27477j5045J37129R7435r4547q9983K3574J18452R6295
17249B101598r5121J10249K41265J64252J73244L6904J50054J87194M75736M50463
17239C995838N6601J16090j52968n6583K45097L37165L87814L93224L29658M85080
17229F137016P73022J028550J404570J557472J045558L31815L76283J070352K016958
17220A5741596L174505M460242N439807O510739P879451J0704419J6433784K6536537
$$ y = [1114704, 1204987, 1402488, 1361138, 1057233, 948551, 1050465, 1236329, 1533868, 1634315, 1600550, 1615756, 1648814, 1626962, 1606494, 1748917, 1871685, 1825800, 1741040, 1624821, 1454033, 1461510, 1415772, 1419192, 1407551, 1355398, 1339221, 1479993, 1555971, 1481271, 1356231, 1463347, 1700811, 1828288, 1813243, 1950372, 2047807, 1953260, 1863277, 1886851, 2005303, 2101598, 2006477, 2116726, 2357991, 2522243, 2695487, 2732391, 2882445, 3069639, 3545375, 3995838, 4052439, 4168529, 4015561, 3958978, 4204075, 4541240, 4929054, 5322278, 5651936, 6137016, 6910038, 7938588, 9343158, 10900630, 11946188, 12278003, 12654286, 13724638, 15741596, 18916101, 23376343, 28816150, 35326889, 43206340, 53910759, 70344543, 96881080]
17212I6881080M4296540O6369148M4577183l0480640n9733440n2822816l1169294
17205G7917761j4658653n781360r95075K633325P256751J4042481K4834274M3066577
17197A48316081N7271299J6141587m3366573n6258887m4267119k5666113j4329479
17190C7840796q449050n422222l708918k276755k022871j553838j036936n60936
17182A2809270j09942j47797m77694q65738p61676l91339k14552m16261k29503
17173I194768j55196L09008J064374J214142J107586N36189L4331r079K92617
17164A3588740J025503J897616L044019L963154N104050O075908P465246J0383323
17156E2547559J6112001K6109747M3655683O3103088L5266413l4126002n6554616
$$ y = [96881080, 141177620, 207546768, 252123951, 221643311, 161909871, 109087055, 77917761, 63259108, 57477748, 56482673, 59115998, 66372749, 80415230, 105249504, 148316081, 205587380, 221728967, 178362394, 122103507, 77836388, 52170275, 37840796, 29391746, 23969524, 20260606, 17983851, 15960980, 14407142, 13370206, 12809270, 12699328, 12551531, 12073837, 11208099, 10446423, 10055084, 9840532, 9424271, 9194768, 9039572, 9348580, 10412954, 11627096, 12734682, 13270871, 13305202, 13296123, 13588740, 14614243, 16511859, 19555878, 23519032, 28623082, 34698990, 42164236, 52547559, 68659560, 94769307, 138424990, 201528078, 236794491, 202668489, 146113873]
17149A46113873m7904496k7073384j2473235m715223l21571L054018P599901J4161453
17141G8441336K5187204M3458872N4486598Q135287m5127393n4087834m0851573
17134F9642497k3130048j3139562p717082m953525l259019k373992j962948j630975
17126A1475346j248037o76115j57116M5278q4528q40821j368891j283878p85349
17117E075889o53911m56992k70920k61886l4818k24440j81455J35220K54327j33139
17107C247875l49375k54408l58742k83489j06141l3867J54268j17987j35210n2721
17097A710203l5931q9103k00089l6935m1079r1760m5499J04193m3544j00665J58315
17086A288106o7467L3917J944j14925L5969N6394q6894q8188j2467q5866r0151
$$ y = [146113873, 98209377, 71135993, 58662758, 53947535, 53625964, 56679982, 64279883, 78441336, 103628540, 147087412, 201574010, 209709297, 164581904, 110494070, 69642497, 46512449, 33372887, 25655805, 20702280, 17443261, 15069269, 13106321, 11475346, 10227309, 9551194, 9394078, 9439356, 9354828, 8514007, 7145116, 5861238, 5075889, 4421978, 3964986, 3694066, 3432180, 3397362, 3172922, 2991467, 3126687, 3381014, 3247875, 2898500, 2644092, 2285350, 2001861, 1895720, 1861853, 2016121, 1898134, 1762924, 1710203, 1674272, 1585169, 1385080, 1348145, 1307066, 1215306, 1169807, 1274000, 1230456, 1129791, 1288106, 1220639, 1254556, 1256500, 1141575, 1177544, 1233938, 1147044, 1058856, 1046389, 960523, 870372]
17075H70372J07741m9144j24202J3411M6710k6867J09646J20283r4010j61078
17065H12862P2760K53710L0635N902l7016r8816j5062N3310l50M5857r1753j27267
17053I04772J30153N2161j43244N3620R7271J48172K8615j82658j92801J1937
17043I07998J10140l0432k5950K01949J97363j36093r6172q3962K0310N4030k19854
17032H99327j59467j76820m5896J51687J81502J14621n124K7274p5775r4002k3160
17021G94167p7186m4092p0029J88946O4160N4923Q545k299j5713J30657J46499
17010A178578l0088j15425j51276R6947J62292j07340o8979M3670Q0201M9411
17000A137991j26589j40755J1525K62938J36611j50173l7448J21916K21069N6047
$$ y = [870372, 978113, 928969, 804767, 818178, 864888, 838021, 947667, 1067950, 973940, 812862, 885622, 1139332, 1169967, 1175869, 1138853, 1040037, 1024975, 1078285, 1077935, 1123792, 1032039, 904772, 1034925, 1087086, 943842, 997462, 1094733, 1242905, 1271520, 1088862, 896061, 907998, 1018138, 987706, 961756, 1163705, 1361068, 1224975, 1128803, 1044841, 1065151, 1119181, 899327, 739860, 563040, 517144, 668831, 850333, 964954, 959830, 987104, 911329, 817327, 794167, 716981, 672889, 602860, 791806, 855966, 910889, 919434, 917135, 901422, 1032079, 1178578, 1148490, 1033065, 881789, 978736, 1141028, 1033688, 964709, 1008379, 1088580, 1137991, 1011402, 870647, 882172, 1145110, 1281721, 1131548, 1094100, 1216016, 1437085, 1493132]
16990A493132p4296q2892j50981L2029k62479j1174R7102r4852L2001J52910l5273
16979A095227P0379P3949j55722j26774q600k9131J22306J30010j27793j11428
16969I32423N1443J55815j24115m2085P4160p9457k15840p3207J6043K3426J5957
16958G34563K8910K4124p1726J34481J54342R4370J9834q2247k0638J73394l5547
16947A153860q4621P0589K6294l8396j88152n1878Q5555K10026O5357j08086j49784
16936I90764j23600K3005k1684M7210L3104j0977l2731M2747k6994j14079K05003
16925A011768K17965J24648j50456r9953J07459R5238n2949m418j64788r769L6346
16914A111091N3205O4869J49773J29466J69001N1335p85K36468L77107M95999
$$ y = [1493132, 1418836, 1335944, 1184963, 1216992, 954513, 943339, 1040441, 945589, 977590, 1130500, 1095227, 1165606, 1239555, 1083833, 957059, 948459, 919328, 1041634, 1171644, 1043851, 932423, 983866, 1139681, 1015566, 973481, 1047641, 968184, 752344, 679137, 695180, 718606, 734563, 763473, 787597, 715871, 850352, 1004694, 1099064, 1118898, 1036651, 1016013, 1189407, 1153860, 1069239, 1139828, 1166122, 1127726, 939574, 887696, 973251, 1183277, 1248634, 1140548, 990764, 867164, 890169, 868485, 915695, 948799, 937822, 905091, 947838, 920844, 806765, 1011768, 1229733, 1354381, 1203925, 1103972, 1211431, 1306669, 1253720, 1249302, 1084514, 1074745, 1111091, 1164296, 1229165, 1378938, 1508404, 1677405, 1728740, 1727955, 1964423, 2341530, 2837529]
16904B837529L75418N1666j18211j78922l32644l89188j10107k51405o6082O2163
16894A880217m3084Q0212L49979L90882K59633K68540j36243l15317m42005l52334
16884A940480k79316j43410j21326n7195o2880j37985Q5485p2433n6734N5844
16874A150530p9326l4626J5868j45744o7936J41444J74452N5266j47397j6828
16864A045703m0334L6272K60226J72207N9590j28910j01404L2050R606j92805
16854A152201l9050P5489l1547K730J06897K6356k6968O6040J74232J06757l1547
16843A581590O5695j70708k14765j16868o1087j076K09929P6402k5386J00060
16833A443786M92r8260j51300P3540p77J27605j6018j41155k5103M3907j30384
$$ y = [2837529, 3212947, 3264613, 3146402, 2967480, 2634836, 2245648, 2135541, 1884136, 1818054, 1880217, 1837133, 1917345, 2267324, 2658206, 2917839, 3186379, 3050136, 2734819, 2292814, 1940480, 1661164, 1517754, 1396428, 1339233, 1276353, 1138368, 1223853, 1151420, 1094686, 1150530, 1071204, 1036578, 1052446, 906702, 838766, 980210, 1154662, 1209928, 1062531, 1045703, 1005369, 1041641, 1301867, 1474074, 1533664, 1404754, 1303350, 1335400, 1345006, 1152201, 1113151, 1188640, 1157093, 1159823, 1266720, 1293076, 1266108, 1332148, 1506380, 1613137, 1581590, 1647285, 1476577, 1261812, 1144944, 1083857, 1082781, 1292710, 1369112, 1343726, 1443786, 1444278, 1346018, 1194718, 1268258, 1267481, 1395086, 1379068, 1237913, 1212810, 1256717, 1126333]
16822A126333j41599N9243J69215J01949K30675j03742O1700j15552o8846n7511
16812A261865o2528j03838j13399N0778o306r1901Q4329R2653K11989J61464l5505
16801A449601j5261j02528m1962Q6409K87065k0657j51257j62256n3460R5890
16791A371584R6881Q6128J22889K6242N3098j09454j36060j1052m1769K6316m450
16780A480353N3469J6139j16843j08651j72313J46321O7034N0554Q1614J1882
16770A509559M2305J39577K8730L6762J17395J2032j22221p9551j401N9272j47510
16759A594949j66200K75762K42734k01373n4535P3997K1032j45176n2065N8077
16749A647202Q2882q7090R8946J28281m82j22403n6481J38602J21241Q2473j63793
$$ y = [1126333, 984734, 1043977, 1213192, 1315141, 1545816, 1442074, 1503774, 1388222, 1319376, 1261865, 1199337, 1095499, 982100, 1032878, 1026572, 934671, 1019000, 1111653, 1323642, 1485106, 1449601, 1434340, 1331812, 1289850, 1376259, 1663324, 1642667, 1491410, 1329154, 1275694, 1371584, 1468465, 1554593, 1677482, 1703724, 1756822, 1647368, 1511308, 1500256, 1458487, 1484803, 1480353, 1533822, 1549961, 1433118, 1324467, 1152154, 1298475, 1365509, 1416063, 1497677, 1509559, 1551864, 1691441, 1720171, 1756933, 1874328, 1886360, 1764139, 1684588, 1683187, 1742459, 1594949, 1428749, 1704511, 1947245, 1745872, 1691337, 1765334, 1786366, 1641190, 1589125, 1647202, 1730084, 1642994, 1741940, 1870221, 1869739, 1747336, 1690855, 1829457, 1950698, 2033171, 1869378]
16738A869378J12824J07648j30222l6226J98950j44535q0760O5771N2878R1235
16728B106941K4442O8402M4528j10718q5862m4763m112N0915m6423M5177K46550
16717B295077Q0551j62686J02744K097j01663j79402m1463J77827M8935r4269
16707B127748K9395J4130K97248N7582j21221l4318m4684J32368j34019o084R4607
16696B412752K1167P9598l7097m26j9394K2785j5464p5987K2143K29355j60629
16685B478803o954J09593n6511J15111J2952j56980L8970J02593J12172J46044
16675B895793q807q8872J45641K02403j19244n9686j0901j06000N7706L05301
16665C213334K44882J39602K3104J92836M34179N8521k18748l18623k79398j03166
$$ y = [1869378, 1982202, 2089850, 1959628, 1923402, 2122352, 1977817, 1897057, 1962828, 2015706, 2106941, 2131383, 2199785, 2244313, 2133595, 2047733, 2002970, 1998858, 2049773, 2003350, 2048527, 2295077, 2375628, 2212942, 2315686, 2317783, 2216120, 2036718, 1995255, 2173082, 2222017, 2127748, 2157143, 2171273, 2468521, 2526103, 2404882, 2370564, 2325880, 2458248, 2324229, 2318145, 2412752, 2433919, 2513517, 2476420, 2475994, 2456600, 2479385, 2463921, 2387934, 2410077, 2639432, 2478803, 2471849, 2581442, 2524931, 2640042, 2652994, 2496014, 2534984, 2637577, 2749749, 2895793, 2886986, 2798114, 2943755, 3146158, 3026914, 2967228, 2956327, 2850327, 2908033, 3213334, 3458216, 3597818, 3620922, 3813758, 4247937, 4306458, 4087710, 3769087, 3489689, 3386523]
16655C386523o4172N8449j979Q8075J16656J71752K46650J74026J57930q5330
16645D248580k27424k32549j37281j29588k07592O6572J50494o4946O233M2868
16635C515367m0831P286M6845o1404J5330m492j38673k1024J19142R8575J72724
16624C708845O7624P1991l681L2806O6698O7978J01459N7391o1290l3453J31925
16613D208293J26353J1642p6461K9897N4268N8378J23771J13805J58519K70255
16603E078720K55007J62309k4990j06421l5803J19315J48395K65098J4442N0988
16593E927060J9292J17046P6447J26886J22632j63079m58970m05608K0716k4411
16583E358011j15835L3102j42099r5528M5108o8894J63256P0345n9537J00030
$$ y = [3386523, 3322351, 3380800, 3378821, 3466896, 3583552, 3755304, 4001954, 4175980, 4333910, 4248580, 4021156, 3788607, 3651326, 3521738, 3314146, 3380718, 3531212, 3466266, 3472499, 3515367, 3474536, 3481822, 3528667, 3467263, 3482593, 3478101, 3339428, 3318404, 3437546, 3536121, 3708845, 3776469, 3848460, 3844779, 3877585, 3944283, 4012261, 4113720, 4171111, 4109821, 4076368, 4208293, 4334646, 4346288, 4269827, 4299724, 4353992, 4412370, 4536141, 4649946, 4808465, 5078720, 5333727, 5496036, 5471046, 5364625, 5328822, 5448137, 5596532, 5861630, 5876072, 5927060, 5946352, 6063398, 6139845, 6266731, 6389363, 6226284, 5767314, 5361706, 5382422, 5358011, 5242176, 5275278, 5133179, 5037651, 5082759, 5013865, 5177121, 5247466, 5187929, 5287959]
16573E287959J88355j96050N8768K03553N9544Q8473j47639j56061o7603j15426
16563E203873O469L5900J58348K20926k1453J5089J95353o0516j690P1495M7002
16552E870796Q5472J56819j03169k10630q9565J27856J486J02413J63429K04588
16542F309495J66493j10022j50343k983J26492J92218R2360J64307J26127o4467
16532F849677n7488J16614L4585k1958O2647L8613R8009J34563N5091k004N6073
16521G364422J36528R7513p0237O7594J91071M5407k0446K01013J35441R1742
16511H240048L7235M776J5796m628R4399J15983j00617J25249N3028N6562J43926
16500H781757j9463J17013N7720M401R8582Q993P0671J79193K19636J12760J73880
$$ y = [5287959, 5476314, 5280264, 5339032, 5542585, 5602129, 5690602, 5542963, 5386902, 5319299, 5203873, 5210342, 5246242, 5404590, 5625516, 5604063, 5619152, 5814505, 5753989, 5752299, 5823794, 5870796, 5956268, 6113087, 6009918, 5799288, 5709723, 5837579, 5839065, 5941478, 6104907, 6309495, 6475988, 6365966, 6215623, 6212640, 6339132, 6531350, 6623710, 6788017, 6914144, 6849677, 6792189, 6908803, 6943388, 6921430, 6984077, 7022690, 7120699, 7255262, 7310353, 7308349, 7364422, 7500950, 7598463, 7528226, 7595820, 7786891, 7832298, 7811852, 8012865, 8148306, 8240048, 8277283, 8282059, 8297855, 8293227, 8387626, 8503609, 8402992, 8528241, 8581269, 8637831, 8781757, 8762294, 8879307, 8937027, 8941428, 9040010, 9049003, 9119674, 9298867, 9518503, 9631263, 9805143]
16489I805143K491Q2529J28854j23211J69278J12463J22706J02939K01354K56230
16479A0860776R8130M6870L5782q898N7374K06317J32217J39317J60091J74302
16469A1902278N8534n225K75536K31936M6214K1363Q2733J51770J24393J13974
16459A3003506J95314J43260N0338J40020J91923K34140K1989K23940P0479J7520
16449A4292429J07772J31704K61315Q4458K07719K31687J89188L3251K86825J97764
16439A6024112P2908K07344K22728K25001L04970P790J25679K24720K70917J13282
16429A7799451L4705K00662K72297K52428K80298K42034J62055J01639J49447
16420A9495016L41515L85920J78532K28767L29356J46846Q5096K75553J78899
$$ y = [9805143, 9807634, 9890163, 10019017, 9895806, 10065084, 10177547, 10300253, 10403192, 10604546, 10860776, 10958906, 11005776, 11041558, 11032660, 11090034, 11296351, 11428568, 11567885, 11727976, 11902278, 11960812, 11955587, 12231123, 12463059, 12509273, 12530636, 12613369, 12765139, 12889532, 13003506, 13198820, 13342080, 13392418, 13532438, 13724361, 13958501, 13980490, 14204430, 14274909, 14292429, 14400201, 14531905, 14793220, 14877678, 15085397, 15317084, 15506272, 15539523, 15826348, 16024112, 16097020, 16304364, 16527092, 16752093, 17057063, 17064853, 17190532, 17415252, 17686169, 17799451, 17834156, 18034818, 18307115, 18559543, 18839841, 19081875, 19243930, 19345569, 19495016, 19836531, 20222451, 20400983, 20629750, 20959106, 21105952, 21191048, 21466601, 21645500]
16411B1645500K24197M53378M21951K89970L39189K89276K20546J15248J46866
16402B4146121M56447L46350K05380M07838K77837K07446M24705M61131K54876
16393B7188131K56493K69222K21557K23206K76309M90390M41230M69774L98539
16384C0234851K41579K86127M01299M03800L41999M44739P37707M95764K33300
16375C3821165L14122M34005M18379L24152M11694N98497N40630M56549M05867
16366C7725060K98356M62363N25584M07681M76956N31170O79415M28475L06314
16357D1841374N55675M76589M23009M18243L56594L22948M15268M14440L53541
16348D5577681M98655O13825M34643L89587M20147M69479L43413N39349N53205
$$ y = [21645500, 21869697, 22323075, 22745026, 23034996, 23374185, 23663461, 23884007, 23999255, 24146121, 24602568, 24948918, 25154298, 25562136, 25839973, 26047419, 26472124, 26933255, 27188131, 27444624, 27713846, 27935403, 28158609, 28434918, 28925308, 29366538, 29836312, 30234851, 30476430, 30762557, 31163856, 31567656, 31909655, 32354394, 33092101, 33587865, 33821165, 34135287, 34569292, 34987671, 35311823, 35723517, 36322014, 36862644, 37319193, 37725060, 38023416, 38485779, 39011363, 39419044, 39896000, 40427170, 41106585, 41535060, 41841374, 42397049, 42873638, 43296647, 43714890, 44071484, 44394432, 44809700, 45224140, 45577681, 46076336, 46690161, 47124804, 47514391, 47934538, 48404017, 48747430, 49286779, 49839984]
16339D9839984M63836L43912M07966M10386N98028M59913M51953M49059L51230
16330E3776267K40530L56120L88323L05947M44129K34805J82626K26801L43521
16321E6499069M75179K11082J96030K12637J20294J18412J38829J67069O1906
16312E8200507J24768J69498N6508K0210J17937K12428Q2146k37203o1816p3413
16302E8611570l9463n4574o4928k11731j37269J00752j09773k87515k52971j19468
16292E7434630q3468j76190j96770j65297k73162m67373l23298l18953k81646
16283E5148473l43238m08444n54069m41321k26893j31565k78557n03549m07418
16274E1853419k65608k20534l85606n01530m10961n27495n30907n16639m87041
$$ y = [49839984, 50303820, 50647732, 51055698, 51466084, 52064112, 52524025, 52975978, 53425037, 53776267, 54016797, 54372917, 54761240, 55067187, 55511316, 55746121, 55928747, 56155548, 56499069, 56974248, 57185330, 57381360, 57593997, 57714291, 57832703, 57971532, 58138601, 58200507, 58325275, 58494773, 58551281, 58571491, 58689428, 58901856, 58984002, 58746799, 58684983, 58611570, 58572107, 58517533, 58452605, 58240874, 58103605, 58204357, 58094584, 57807069, 57554098, 57434630, 57351162, 57174972, 56978202, 56812905, 56539743, 56072370, 55749072, 55430119, 55148473, 54805235, 54396791, 53842722, 53401401, 53174508, 53042943, 52764386, 52260837, 51853419, 51587811, 51367277, 50981671, 50480141, 50069180, 49541685, 49010778, 48494139, 48007098]
16265D8007098m71389m27014l07713l20602m87643n66479l35850m59720o18880
16256D4011808n09997l53818l36116m23744n23414m54972m81786n00701m67683
16247C9959577k51715m85157n13385m49321n13724m78679n68701k98261k93466
16238C6107168l25551l82820l56354n54468n19974m05974m45089n21504j95973
16229C2399461k09162n59689l84870k67617l55628m50856n75078m76360l38085
16220B8782116k41012k90535l32262n36911l94739j07393k19284m17064k98756
16211B5944160k94423m29330l82410j42772j57280m45601l03302j90896l00328
16202B3297818l81461l89071l99795k40379k24624k50915j69689k11426l26462
$$ y = [48007098, 47535709, 47108695, 46800982, 46480380, 45992737, 45426258, 45090408, 44630688, 44011808, 43501811, 43147993, 42811877, 42388133, 41864719, 41409747, 40927961, 40427260, 39959577, 39707862, 39222705, 38709320, 38259999, 37746275, 37267596, 36698895, 36400634, 36107168, 35781617, 35398797, 35042443, 34487975, 33968001, 33562027, 33116938, 32595434, 32399461, 32190299, 31630610, 31245740, 30978123, 30622495, 30171639, 29596561, 29120201, 28782116, 28541104, 28250569, 27918307, 27381396, 26986657, 26879264, 26659980, 26242916, 25944160, 25649737, 25220407, 24837997, 24695225, 24537945, 24092344, 23789042, 23598146, 23297818, 22916357, 22527286, 22127491, 21887112, 21662488, 21411573, 21241884, 21030458, 20703996]
16193B0703996k09303k08830n8816k82721k91094p2383j82370k06354l70319l28160
16183A8493646l62147k44383j28377k57260k30052j32279j10843j87774n2324
16174A6788207j78947l39594k30106r05j26607j73803k75283j37593p2084k45508
16164A5007777j66919l10232l44111n4295o3531p5808k24519j19898l27833j69207
16154A3151424k17519l8933m4904k19579k66957j56844J6197M5597o7966q7932
16144A2112584j58540k36523k16933M747j31002j02567j30040r2939l7273j60517
16134A0850997k21196j54617k17262j58614l6369k6253K8276k34027k00776o3989
16124I566170k789Q7450k0603l0444k10881r4165o6412M8326L1479j14001j88541
$$ y = [20703996, 20494693, 20285863, 20227047, 19944326, 19653232, 19580849, 19398479, 19192125, 18821806, 18493646, 18131499, 17887116, 17758739, 17501479, 17271427, 17139148, 17028305, 16840531, 16788207, 16609260, 16269666, 16039560, 16038655, 15912048, 15738245, 15462962, 15325369, 15253285, 15007777, 14840858, 14530626, 14186515, 14132220, 14068689, 13992881, 13768362, 13648464, 13320631, 13151424, 12933905, 12894972, 12850068, 12630489, 12363532, 12206688, 12222885, 12268482, 12200516, 12112584, 11954044, 11717521, 11500588, 11505335, 11374333, 11271766, 11141726, 11048787, 11011514, 10850997, 10629801, 10475184, 10257922, 10099308, 10062939, 10036686, 10064962, 9830935, 9630159, 9566170, 9563381, 9650831, 9630228, 9599784, 9388903, 9294738, 9228326, 9276652, 9308131, 9194130, 9005589]
16113I005589q4012J9400j72940j27556k53495J4959n6495p891j14929j65456
16103H057174k7004L2960o6106j80942j68119r3985j7729k27540p2794k982j58523
16092G074410P6707J80813r2200n3198j15163k05901j02762r2828j20623j67932
16082F381323j48564j8575p6223R1661J41035j20726l79931j99665J38727K89372
16072F098434J21786J8473j64017k10288j3470J25102j2782j08482j47101j66938
16062E540717K0452J09470O5333j40574j39668K6680j17862m4448q5730q6948
16052E147422n5411J57113j42255j22288m8861K44907j6836j10264l2106K5259
16042E046680n4219O834M9001j05494J21275L5780j59181r0609P9642o6138L7614
$$ y = [9005589, 8921577, 8940977, 8768037, 8640481, 8386986, 8401945, 8345450, 8337559, 8222630, 8057174, 8030170, 8063130, 7997024, 7816082, 7647963, 7553978, 7536249, 7308709, 7235915, 7232933, 7074410, 7151117, 7331930, 7239730, 7186532, 7071369, 6865468, 6762706, 6669878, 6549255, 6381323, 6232759, 6214184, 6137961, 6229622, 6370657, 6249931, 5870000, 5670335, 5809062, 6098434, 6220220, 6238693, 6074676, 5864388, 5850918, 5976020, 5963238, 5854756, 5707655, 5540717, 5561169, 5670639, 5735972, 5595398, 5455730, 5482410, 5364548, 5320100, 5234370, 5147422, 5092011, 5249124, 5106869, 4984581, 4935720, 5180627, 5163791, 5053527, 5021421, 5046680, 4992461, 4999295, 5048296, 4942802, 5064077, 5099857, 4940676, 4850067, 4929709, 4863571, 4901185]
16031D901185J6880J2698j72392M4628L9864K5946j07963K408J49492J88255J75049
16020E276050N0812j36434n2169n7877j12659P1280m5538j35993j53815j26612
16010D577045j12155r5644j4328m1129j9251m3755p3407J766m8129j66221O744
15999C971536L4594P0229m9722k71121k79743R3421L1523j77250j33107m1410
15989C248950K1137j5826O209P4223L4385o6029o1257J5702r5053N9270j62690
15978C059021j21436K8079j0117Q8963k3362L5345k71714j6133J05138q2743j65676
15967B625365K849J47223K03447j23338j30670j01164k1408L5982n3375Q9252
15957B674163K55701l4448p3494j00529r5382j42139n704o866p063l2339j1285
$$ y = [4901185, 4918065, 4930763, 4758371, 4802999, 4842863, 4868809, 4760846, 4763254, 4912746, 5101001, 5276050, 5326862, 5190428, 5138259, 5080382, 4967723, 5039003, 4993465, 4857472, 4703657, 4577045, 4464890, 4369246, 4354918, 4313789, 4294538, 4250783, 4177376, 4179142, 4131013, 3964792, 3971536, 4006130, 4076359, 4026637, 3755516, 3475773, 3569194, 3600717, 3423467, 3290360, 3248950, 3270087, 3254261, 3260470, 3334693, 3369078, 3303049, 3241792, 3257494, 3162441, 3221711, 3059021, 2937585, 2965664, 2955547, 3044510, 3021148, 3056493, 2784779, 2768646, 2873784, 2791041, 2625365, 2628214, 2775437, 2978884, 2855546, 2724876, 2623712, 2602304, 2638286, 2584911, 2674163, 2929864, 2895416, 2821922, 2721393, 2626011, 2483872, 2478168, 2471302, 2464239, 2431900, 2420615]
15946B420615j59196K0926L09627P2799n0494j39913l3549J26759l489k14948
15936B349137k20887P4972j8902N2857J7122k480j23123M975J3418L6823k1964
15925B161948j9595K4009j4727j84966j39079L589O2041J06174l4580m4899k8986
15914A890929q5796j30996K53854N1864k7648J16279Q4196l941j08460j17190
15904A923091J2548j10076K2511R4857M5080j36878j59128L0264p6489Q8304L35757
15893B069841J34564Q546k7845l17457Q6897J00563J42027j74927p3456r1379
15883A857374o8547o1204J0443M439j11831q5812K5140j07124j10633N6723K28683
15872A637651N6660j43843L8704J22148R6716J38275j23875n8864p6193o7821
$$ y = [2420615, 2261419, 2282345, 2591972, 2664771, 2614277, 2474364, 2440815, 2567574, 2564085, 2349137, 2128250, 2203222, 2184320, 2237177, 2254299, 2251819, 2128696, 2133671, 2147089, 2183912, 2161948, 2142353, 2166362, 2151635, 1966669, 1827590, 1831179, 1893220, 1999394, 1964814, 1919915, 1890929, 1805133, 1674137, 1927991, 1979855, 1952207, 2068486, 2152682, 2148741, 2040281, 1923091, 1935639, 1825563, 1848074, 1942931, 1988011, 1851133, 1692005, 1722269, 1645780, 1734084, 2069841, 2204405, 2212951, 2185106, 1867649, 1954546, 2055109, 2197136, 2022209, 1948753, 1857374, 1788827, 1727623, 1738066, 1742505, 1630674, 1544862, 1570002, 1462878, 1352245, 1408968, 1637651, 1694311, 1550468, 1589172, 1711320, 1808036, 1946311, 1822436, 1763572, 1687379, 1619558]
15862A619558j34995M4685P4855m0311n7275J25413j17573j9363K0093n0390K07517
15851A672214J52466j16316n8885n0484j79435o8357P226l8988O327J62153L5159
15840A523080r3766j52606J00479J0485P4778j44865j09028K7208J37434J39073
15830A512272k04613r5350j41427j42047o0926O1136J19253L0212J97486L5026
15820A311022j26618k08405p1476J35748J38283l7109J39021j19720k7669j6783
15810A116294o4994M2788o0464r891j15232j60071J24066J38949N1139J47203
15800A209787m9688k13856k45568K2563Q3675R2890j0310n9058K04093K01055
15790A235583r1911j24355m8256O1108k5855m0732l4000l1354k4181M3005R1830
$$ y = [1619558, 1484563, 1529248, 1604103, 1563792, 1506517, 1631930, 1514357, 1494994, 1515087, 1464697, 1672214, 1824680, 1708364, 1649479, 1598995, 1419560, 1351203, 1358429, 1319441, 1325768, 1487921, 1523080, 1429314, 1276708, 1377187, 1387672, 1462450, 1317585, 1208557, 1235765, 1373199, 1512272, 1307659, 1212309, 1070882, 928835, 867909, 929045, 1048298, 1078510, 1275996, 1311022, 1184404, 975999, 904523, 1040271, 1178554, 1141445, 1280466, 1160746, 1133077, 1116294, 1051300, 1094088, 1033624, 1023733, 908501, 748430, 872496, 1011445, 1062584, 1209787, 1160099, 946243, 700675, 723238, 806913, 899803, 889493, 830435, 1034528, 1235583, 1143672, 1019317, 971061, 1032169, 1006314, 965582, 931582, 900228, 876047, 919052, 1010882]
15779A010882P2226K200J06930R4300j13958p6160j19524q850j5199J07309N6457
15768A116613R0192j37148L6139k6682p2730J08447p0187N1567j12802j59353
15758H24056K0671m7520O0720Q502J01828P2105R0496k6223J270k9481j51010
15747I25414L9290j62023o5560N4853N532N8087J04198J60071J29188j70394j24952
15736I53704j31623J49802M0645k5300r7417j62079J16790J11696m5003P7768
15726I88983J6743q1552J2320L435o0749j12379P5260K4761M390p8421q1618j45649
15714E65524j62427P2965J54551J39394R9115L3022n7117j48450j18506m3452
15704E34619j66785O5762L37562M5354j07324k6756k8787q2287m4890Q0425P408
$$ y = [1010882, 1083108, 1085308, 1192238, 1286538, 1172580, 1096420, 976896, 968046, 952847, 1060156, 1116613, 1206805, 1069657, 1105796, 1079114, 1006384, 1114831, 1044644, 1096211, 983409, 824056, 844727, 797207, 857927, 866429, 968257, 1040362, 1130858, 1104635, 1105905, 1076424, 925414, 964704, 802681, 737121, 791974, 797506, 855593, 959791, 1119862, 1249050, 1078656, 953704, 822081, 971883, 1012528, 987228, 889811, 727732, 844522, 956218, 911215, 988983, 1005726, 924174, 936494, 939929, 879180, 766801, 842061, 866822, 871212, 792791, 711173, 565524, 403097, 476062, 630613, 770007, 869122, 902144, 845027, 696577, 578071, 534619, 367834, 433596, 771158, 816512, 709188, 682432, 653645, 571358, 526468, 606893, 614301]
15693F14301J24385J22292n6429l7702R0247k2932q8536J04674J11444m6157j63680
15682G51907L132P2144J04343J3255j4028j25378J31440j2737j05802l8316m3787
15671G36173m5338j86145n0175M2910k7337j9272n3279J45463J71419J32570q1708
15660G65281j35332K4672R3634l4404j96663q923J07746J281n7108k0479N0594
15649E90299O7411J0858R9142J04397l2948j70390o769P2425j17020j80418K5050
15638D62037K6023m601M5890J71764m5861n4667k3619K6372o507j53141L0929
15627D74619R2605P6362J96975N2062j45324j50305m3946N0075j55632j52524
15617B94967k2505J0067Q2731J31831L3611j31887j66305K4789l8310r0470n375
$$ y = [614301, 738686, 860978, 804549, 766847, 857094, 834162, 745626, 850300, 961744, 915587, 751907, 755039, 827183, 931526, 944781, 930753, 805375, 936815, 924078, 818276, 779960, 736173, 690835, 504690, 454515, 497425, 470088, 450816, 397537, 543000, 714419, 846989, 765281, 629949, 654621, 748255, 713851, 517188, 508265, 616011, 617292, 560184, 539705, 590299, 657710, 668568, 767710, 872107, 839159, 668769, 662000, 734425, 617405, 436987, 462037, 488060, 483459, 529349, 701113, 655252, 600585, 576966, 603338, 596831, 443690, 474619, 567224, 643586, 840561, 892623, 747299, 596994, 553048, 603123, 447491, 294967, 272462, 282529, 365260, 497091, 530702, 398815, 232510, 257299, 218989, 128519, 123144]
15606A23144K77925J77843K6096j6299n0571J02891J96592R3172L2492m8882l00599
15595F13804j09851M1174j31110M9883j14170m5197m434k0986Q2957J18930k1524
15584D59476J42351o8110j94617o1134j09237J02952L7895O300p3801N7302J54568
15573D53945R4301j37820j34005j02540J51824O9240n6944r8007o9575J24399
15563B94818J88370j83067n3143O5423J35082R727J00744J50337k1846j47070
15553E39375k06913l9387K6721J30005K2953N0374q1592o6034p5642Q1078J19796
15542E00734N8382M107K10099k6653l57064j41861M7381m8607k13536M3941K35901
15531C12824N9474K57200J67915l98263j95581J97519R599j05299R5502r2181
$$ y = [123144, 401069, 578912, 605008, 588709, 538138, 641029, 837621, 930793, 963285, 914403, 613804, 503953, 545127, 414017, 463900, 349730, 304533, 300099, 279113, 362070, 481000, 459476, 601827, 533717, 339100, 277966, 168729, 271681, 309576, 315876, 242075, 299377, 453945, 548246, 410426, 276421, 173881, 325705, 394945, 338001, 239994, 170419, 294818, 483188, 300121, 246978, 312401, 447483, 457210, 557954, 708291, 686445, 539375, 332462, 293075, 319796, 449801, 472754, 523128, 441536, 375502, 299860, 380938, 500734, 559116, 563223, 773322, 746669, 389605, 247744, 295125, 246518, 32982, 76923, 312824, 372298, 629498, 797413, 399150, 203569, 401088, 410687, 305388, 400890, 308709]
15521C08709p905J74907K7946j42039j51041o4153M7926J95429k03877k05991
15511b0089Q6818N6633J0098J171r884J25390J2122M1126N7548j5517J14649l0829
15499D29236k0859K5389o6578j77919J6074J08624l1621j36824j23315J21883
15489A44090J83594J59703N1334j4588J4661Q7153p9728O1684n159k5448k6950
15478E50346n2998m4192k6658k4220k06348m0296J04250J98450M394L2964q3763
15467D11929k40504j0092L9935m7773J2005Q516J4615P8488N7428q5909k01698
15456C6940R5633O6867n6420K9622M3320L0832O9803J08196L9477K6650k65078
15445B25842r0219o2612K6022J04940J00321j63064o6066J84552N0520j55961
$$ y = [308709, 300804, 475711, 503657, 361618, 210577, 146424, 194350, 389779, 185902, -20089, 66729, 123362, 133460, 134631, 124747, 250137, 262259, 303385, 360933, 345416, 460065, 429236, 408377, 433766, 367188, 189269, 205343, 313967, 282346, 145522, 22207, 144090, 327684, 487387, 538721, 524133, 538794, 625947, 546219, 607903, 602744, 577296, 550346, 497348, 453156, 426498, 402278, 195930, 155634, 259884, 458334, 462728, 495692, 411929, 171425, 161333, 201268, 153495, 165500, 174016, 188631, 267119, 324547, 238638, 36940, 132573, 199440, 143020, 172642, 215962, 246794, 316597, 424793, 464270, 490920, 225842, 135623, 73011, 99033, 203973, 304294, 141230, 75164, 259716, 310236, 154275]
15435A54275O4742M0931K2518J39458l7484n7137j56394J48280l985j32397l6389
15424A46418k8744j3693j03622m9628K11898l98M66o7292J61835r0822n2019J6549
15412A30948Q6886R7720l4583p8900P2853l8275n4894Q3533k828r9407j86916
15401b3863J14514L15431J89130n2218l7875j88390j89547j01136M9517M5751
15391A21314R37j4390J40635K59994o8060j65810n7837j54807j129q4349K6434
15380B932j23800o3474J31947P5517n3563L2485j8395M1841O5338n4791j22545
15369h6508M0275J07074M0428N992L5434q5698m9648l0095P3955L13432J07169
15358D71810l9092n9743j56038k09806J26819J18232P023l6191K8191Q1854J05772
$$ y = [154275, 219017, 259948, 282466, 421924, 384440, 327303, 170909, 319189, 315204, 182807, 146418, 117674, 103981, 359, -49269, 162629, 162231, 162697, 95405, 257240, 166418, 114399, 130948, 217834, 315554, 280971, 202071, 274924, 236649, 181755, 265288, 262460, 163053, -23863, 90651, 406082, 595212, 542994, 505119, 316729, 127182, 26046, 75563, 121314, 122251, 107861, 248496, 508490, 440430, 274620, 216783, 61976, 60847, -23502, 2932, -120868, -184342, -52395, 23122, -30441, 2044, -16351, 25490, 90828, 36037, -86508, -46233, 60841, 101269, 107261, 142695, 56997, 7349, -22746, 51209, 364641, 471810, 432718, 372975, 216937, 7131, 133950, 252182, 259205, 223014, 251205, 333059, 438831]
15347D38831j33044k12602n5313k7431P8791j5762R0479Q4507p9682m4875J57253
15336B81152J66300n8438n3075k12664l5792K2148J76261N161q6546M4689j93756
15325E5440j27954o884L55280J31520r8010n3925J9444J0124o9778Q222k3674
15314A99805q9790K2907J38464J27357p617j19909n1783k9409k2117O2094N8543
15303B88545l9863N279o4003j26141l2897P9650J49816l5746j08117l4161K49095
15292C31457N9564R1473O8567j16857o6464j26174r0267Q919J4722J02962r4166
15281A83736j74563q1335J42396j00870k0492M2755Q3510J46883J64557n9288
15271C27289k3357O1119Q507o3226r7810n4143k0694j03565J11214o7183N9070
$$ y = [438831, 305787, 93185, 37872, 10441, 89232, 73470, 163949, 248456, 168774, 123899, 281152, 447452, 389014, 335939, 123275, 87483, 109631, 285892, 291053, 204507, 249196, 55440, -72514, -79398, 275882, 407402, 309392, 255467, 274911, 285035, 215257, 223479, 199805, 110015, 132922, 271386, 398743, 391126, 271217, 219434, 190025, 167908, 230002, 288545, 248682, 253961, 189958, 63817, 30920, 110570, 260386, 224640, 116523, 82362, 331457, 391021, 482494, 551061, 434204, 367740, 241566, 151299, 160218, 174940, 277902, 183736, 9173, -72162, 70234, -30636, -51128, -8373, 75137, 222020, 386577, 327289, 303932, 365051, 373558, 310332, 212522, 158379, 137685, 34120, 145334, 78151, 137221]
15260A37221j3627O0821q6825j9979k5874K8449l160m9844K8150p3021J96529
15249A78840O9185j92239K6936j35573N9756M9323N7909j02387N3318J01029J39872
15238C05969M4462m1012P562l0307Q61L4152q1949j70543p6444K7828L3344j00967
15226d7044k6751K20939J29009j83719j84526m1366O1381M5220L1029j14105M6383
15215f3550L6159J36266Q2213L53637O8147l3783q9399j56182j40661J65052K56535
15204F14434J21529j81521O4581j47855k00245j22258j36856J32212p2115j52182
15194h0276p9686J34895m2426P1161o3657O1550J94915j26867k28228J34367Q4240
15183E9988K1417p589r1364P2312j0488L5573l3805j00999P4527J90976M6347
$$ y = [137221, 123594, 184415, 97590, 77611, 51737, 80186, 77026, 27182, 55332, -17689, 178840, 248025, 55786, 82722, -52851, 6905, 56228, 114137, 11750, 65068, 166097, 305969, 350431, 309419, 316981, 286674, 287535, 321687, 239738, 69195, -7249, 20579, 53923, -47044, -73795, 147144, 276153, 92434, -92092, -133458, -72077, -26857, 4172, -109933, -63550, -27391, 108875, 191088, 544725, 612872, 579089, 489690, 333508, 192847, 357899, 614434, 735963, 554442, 619023, 471168, 270923, 148665, 11809, 144021, 71906, -80276, -159962, -25067, -67493, 3668, -59989, 1561, 196476, 69609, -158619, -24252, 59988, 81405, 73816, -17548, 54764, 44276, 79849, 46044, -54955, 19572, 210548, 256895]
15172B56895j89154m2338J44140J6437J91700N0811j9648k15171q5652j2794j8955
15161G6271n7227M1211J07365j31985j24567J67968P2054J07202j56923j76226
15151g4857J43705J12087q2028K4371J48653j22959j14016O0518K6972m6964k6364
15140D9118M5161M0684R163o6863j09N6314r203o6106L2163j6546J05112K7688
15128B06576j36266J16366p314l37860L3716K52242j38341j15332J0520J93504
15118G7811J23439m7566n3608O8400N9202n6889L1391N831m5153n2852k0954k51663
15106a62611q5028L9985R5527o818Q5464M5754P4553J79786P3147o2911m3437
15095B33411j11740q594K2589l2050J32380K9241j81960l9024q2129J18400R0666
$$ y = [256895, 67741, 25403, 169543, 185980, 377680, 428491, 408843, 193672, 108020, 95226, 76271, 19044, 60255, 167620, 35635, -88932, 79036, 151090, 258292, 101369, -74857, 68848, 180935, 98907, 123278, 271931, 148972, 34956, 95474, 122446, 75482, 49118, 94279, 134963, 144126, 77263, 77154, 133468, 124265, 58159, 90322, 73776, 178888, 206576, 70310, 186676, 179362, -158498, -124782, 127460, -10881, -126213, -115693, 77811, 201250, 153684, 100076, 168476, 227678, 170789, 202180, 208011, 162858, 110006, 89052, -162611, -247639, -207654, -112127, -118945, -33481, 12273, 86826, 266612, 339759, 276848, 233411, 121671, 113077, 135666, 103616, 235996, 265237, 83277, 44253, -37876, 80524, 171190]
15084A71190k5033j05937q4213O8972j7400j00463J38305J27289P4383j6300L7517
15073B68310P945N2321o9620q782J84215n9187k58792l1284j16864n7773J4718
15062g4793P8391m3325j2867J34928Q7944l4587p9726j51179J06534J81937J31544
15051C24801R9320j56578k58068k7660J14072P2444m6515j92377K00J05344N7627
15040I2610k39878p1882O9987j38404J62862J06183Q2034N8180j8724j71557j03831
15029a72420J19580O4205k80379L5502P9749J6286K4324j61766Q4838K40901R8111
15018A48931p4209q7995J5607Q271J38563R5284k0815p7890J34170j10894j40658
15007B8365J03438m2750j8169R0299j49550j66232q6492K32717J57781L9302P7308
$$ y = [171190, 146157, 40220, -43993, 24979, 7579, -92884, 45421, 172710, 247093, 230793, 268310, 276255, 328576, 258956, 250174, 434389, 375202, 116410, 85126, -31738, -89511, -74793, 3598, -39727, -52594, 82334, 170278, 135691, 55965, -95214, 11320, 193257, 324801, 424121, 267543, 9475, -18185, 95887, 168331, 121816, -70561, -70361, 34983, 92610, -147268, -219150, -149163, -287567, -124705, -18522, 63512, 121692, 102968, -68589, -172420, -52840, 11365, -269014, -233512, -153763, -137477, -113153, -274919, -190081, 50820, 148931, 74722, -13273, 2334, 10605, 149168, 244452, 223637, 145747, 279917, 169023, 28365, 131803, 89053, 70884, 161183, 11633, -154599, -241091, -8374, 149407, 188709, 266017]
14996B66017j2280r6060n0089l7675J5884K4639P4135O8348o162p4453M8310l9214
14984A81400M1962j56965o326M4448q3570k3679L0237J01092O8722L367N7887
14973B58575j6299N6898l3975l1025m5934P6272N1584j91560r3418o7591J34911
14962I8438j37886p918j417O915q2415N1433K40213J17148O5421L2979L0659L320
14950D16890l2914l0589j85274j40232M9281j7013J5366P6812J66925o057j61651
14939A51544q0462j56694l5696N8554l7348j35410J29540J3300J83594J57896
14929B48818q4938n9793R7985P1626Q0042j20456j66963p7732M0325n8245M8561
14918A9230N3017j05678j09170n3360J00953K01342m2218k38021P5192O8468N4036
$$ y = [266017, 253737, 157677, 107588, 69913, 85797, 110436, 184571, 252919, 246757, 172304, 220614, 181400, 223362, 66397, 60071, 104519, 20949, -2730, 27507, 128599, 197321, 200688, 258575, 242276, 299174, 265199, 234174, 188240, 264512, 316096, 124536, 31118, -36473, 98438, -39448, -47366, -48783, -41868, -124283, -72850, 167363, 284511, 349932, 382911, 413570, 416890, 383976, 353387, 168113, 27881, 77162, 60149, 75515, 152327, 319252, 313195, 151544, 71082, -85612, -121308, -62754, -100102, -235512, -105972, -92672, 90922, 248818, 163880, 104087, 202072, 273698, 353740, 233284, 66321, -11411, 28914, -29331, 19230, 72247, -33431, -142601, -195961, -95008, 106334, 64116, -173905, -98713, -30245, 23791]
14907B3791O8969M9755J5040k17652l5784L2503p4848N4204M1961P9496l9907
14896b472Q1043O6258M0793o8289J0005j2038o5387l2119p6397k7437p3845K5736
14884a34149j4405Q076J94809k4913r1743j37016k3112K32316l0870N9702k4031
14873A4664J74008L3185m061K2133J05570J09877p5133k62895m8238m8301r2353
14862g1544n7191M8062L600m3494J50336J02532j80377o873P1077J98081j1626
14851B02583k32519j60058k3390J73539N4863L7564n9750P2421M1755J54827r9281
14840A62554j08p9004o4997j20412r7150J00382M6933J00832R7607l9585k2011
14829H5041R2575r0556j66693L5535P8202J01636k0217R031J252j82444j92192
$$ y = [23791, 92760, 142515, 157555, -60097, -95881, -63378, -138226, -84022, -42061, 37435, -2472, 78571, 144829, 185622, 117333, 127338, 115300, 49913, 17794, -58603, -86040, -159885, -134149, -148554, -140478, 54331, 29418, -62325, -199341, -222453, 9863, -21007, 38695, 14664, 188672, 221857, 217796, 239929, 345499, 455376, 380243, 117348, 69110, 20809, -71544, -128735, -80673, -77073, -120567, 29769, 132301, -48076, -54949, 16128, 214209, 202583, -29936, -189994, -213384, -39845, 15018, 52582, -7168, 65253, 107008, 261835, 162554, 162446, 83442, 18445, -101967, -199117, -98735, -51802, 49030, 146637, 107052, 85041, 177616, 87060, -79633, -44098, 34104, 135740, 115523, 124554, 125806, -56638, -248830]
14818b48830P4908R5365o3194O4439J00061n3892j12416M568J45574l1571j02587
14807a27575N5750K76095n6505j79760N7222J10411O1335N9928l0998j1115J03770
14796C18558P7060j13589j42693j00360j2079J26575L4485p3043K4261N133p0652
14785G3656l0738k9871R5774K37378J55212j33515K5263l3279r3309r7281L0135
14774A99425j4098J6368O3461L4808j53881j41481p4325J72781J6094n3831j17610
14763e2289l3006r2675j6668P8408N0851r0005n2512J09935n2574q2813R5885
14752a37463K3583L8117p5412j1348J0015J2830j20760Q7220J67871j16748j25215
14741b47310L5548J72445J80643q0540j47185k0927M2394J16811J12836l7293
$$ y = [-248830, -173922, -78557, -141751, -77312, 22749, -31143, -143559, -138991, 6583, -24988, -127575, -71825, 204270, 147765, -31995, 25227, 135638, 196973, 256901, 225903, 214788, 318558, 395618, 282029, 139336, 38976, 26897, 153472, 187957, 114914, 139175, 144308, 73656, 42918, 13047, 108821, 346199, 501411, 367896, 393159, 359880, 266571, 169290, 199425, 185327, 201695, 265156, 299964, 146083, 4602, -69723, 103058, 119152, 65321, -52289, -85295, -177970, -194638, -116230, -65379, -155384, -207896, -97961, -150535, -233348, -137463, -113880, -75763, -151175, -162523, -152508, -139678, -260438, -173218, -5347, -122095, -247310, -211762, -39317, 141326, 60786, -86399, -107326, -64932, 51879, 164715, 127422]
14731A27422L8756j41813j18288K1660L2984N6815O083l0645j9J6696j13308O2167
14719d1490J13040J04988M3418k09044j59706P4297P3459J29483l9065J4958o6682
14708C7656L6357P094k8681J6982J16766j33394m9442M3470l8424N3921N5707
14697A18012r8956n9856N2483r5145P9187J67290l193o3933p5317P5618r665k6537
14685E9988o5916M1406J89558J66713o6351j06978k45252L0376r3050L8927J16384
14674F5805L6021k63429R3951R2259K5598O8186J82895L107j12042m9323J33053
14663B76081m82J850q49l6752j15049R743K21694j9023l60111j32857L6857J02662
14651a6236K0383J0096O7700L8691p0624j28339k7519j4337j12607j2915R6408
$$ y = [127422, 166178, 24365, -93923, -72263, -39279, 17536, 23619, -7026, -7045, 9651, -103657, -41490, 71550, 176538, 219956, 10912, -148794, -74497, -1038, 128445, 89380, 104338, 37656, 74013, 81107, 52426, 69408, 186174, 52780, 3338, 46808, 8384, 62305, 118012, 19056, -40800, 11683, -83462, -4275, 163015, 159822, 95889, 20572, 96190, 86525, 59988, -5928, 35478, 225036, 391749, 325398, 218420, -26832, 3544, -89506, -50579, 65805, 101826, -161603, -67652, 24607, 50205, 118391, 301286, 304393, 192351, 143028, 276081, 275599, 277449, 276600, 239848, 124799, 134542, 356236, 337213, -22898, -155755, -118898, -16236, 4147, 14243, 81943, 120634, 50010, -78329, -105848, -120185, -232792, -245707, -149299]
14640a49299J0870J12006l2392R6300M618K7572Q0081J04321r2168j00912l9299
14629B1698m0849J7776l5504q2109K8028J68967k8124k4545M9407j0717k0824
14618D3204J2824J7278m4584J10430O8113j04299n8765q8403L3642p8890J04502
14607A5052K36013q5730j60193p9497j26383l6563Q4267J35569O6222j75420n5927
14596a82590J46179J8368j3859O8065l150q4424j13023n6048m3887Q2345j9916
14585b01940J4368J46229j1208n129K5557L6802l7329N4511j61585N8684N7252
14574b3788j9850O4330J00866j9165P3650j10021M3332P1190j9739l3914N0545
14563A77436R3593K5913j11606L1174n0039l7716r6713l7259J07011p9090Q7100
$$ y = [-149299, -138429, -26423, -58815, 37485, 42103, 69675, 149756, 254077, 161909, 60997, 21698, -19151, -1375, -36879, -118988, -90960, 78007, 49883, 25338, 74745, 64028, 43204, 56028, 73306, 28722, 139152, 207265, 102966, 44201, -44202, -10560, -89450, 15052, 251065, 165335, 5142, -74355, -200738, -237301, -153034, -17465, 48757, -126663, -182590, -36411, -18043, -31902, 36163, 33013, -51411, -164434, -220482, -264369, -182024, -201940, -187572, -41343, -52551, -57680, -32123, 4679, -32650, 21861, -139724, -81040, -23788, -43638, 20692, 121558, 102393, 176043, 66022, 109354, 180544, 160805, 126891, 177436, 271029, 296942, 185336, 216510, 166471, 128755, 32042, -5217, 101794, 22704, 109804]
14552A09804J24952n5887j43680L3790M0142J4380P8048j51683j64706j1947J1927
14541a14860r058M0228N9356k3222J486L0217Q5977K301m7267q6701J172l7028
14529i7399n936j12219o7140R9548J7197q7752l6994N6651L2218q6085q106Q5129
14517b10888P3064K62482M7618O5669O4018j21843K5278r4396n1626l4666j31331
14506a06621J0922K8006r1448L7470J20371n3252j10830j02832r9807M2553K44122
14495h1346k3099n6015K06443K8316l6007K2436j0306j33481j71967L8982j0873
14484b26917r1648m2582J91682J48072m5505r8563l8073K3438L4176J01308O5446
14473B0834q022m8688J7827N035q2934J21724N514o9188q3445K12117N8568J6101
$$ y = [109804, 234756, 178869, 35189, 68979, 109121, 123501, 201549, 49866, -114840, -126787, -114860, -123918, -83690, -24334, -47556, -46070, -15853, 70124, 72425, 25158, -61543, -60371, -97399, -103335, -215554, -282694, -183146, -165949, -253701, -290695, -234044, -201826, -287911, -296017, -210888, -137824, 124658, 172276, 237945, 301963, 180120, 205398, 111002, 59376, 24710, -106621, -95699, -67693, -159141, -121671, -1300, -54552, -165382, -268214, -368021, -325468, -81346, -104445, -160460, 45983, 74299, 38292, 60728, 50422, -83059, -255026, -216044, -226917, -318565, -361147, -169465, -21393, -66898, -165461, -203534, -180096, -145920, -44612, 20834, 12812, -35876, -18049, -13014, -95948, 25776, 31290, -37898, -121343, 90774, 149342, 165443]
14461A65443J2632L1470k31626j26655m0074q0083O9317Q7473j17074n1905R5736
14450a85346J44237J38613j31265k49747J2730J30261J54604j10213J5111J60839
14440G9824o0439K4462j23901j56698M6808K4991j06252k06126Q1636Q1293J04659
14429b09743J17967Q5158p7135o8628P6390j4758j03927J49979r0744k8759R653
14418a54547r3359L7813R2509J37671J17540j52503j80613J35742p4218M1224
14408i2741M0908j6763J84636J76518j13385o3858Q3784O4746q609p6498m1059
14397A37679j27101Q1494J0744N0736n7507j56414j11867P1684L5896k8977J35270
14386D1637J5072P3414p3105j72260j21J7901k7080J77229O2842J31025K39345
$$ y = [165443, 178075, 209545, -22081, -148736, -188810, -268893, -199576, -112103, -229177, -281082, -185346, -41109, 97504, -33761, -283508, -270778, -140517, 14087, -96126, -81015, 79824, 19385, 43847, -80054, -236752, -189944, -164953, -271205, -477331, -395695, -314402, -209743, -91776, -6618, -83753, -152381, -75991, -90749, -194676, -44697, -135441, -164200, -154547, -247906, -210093, -117584, 20087, 137627, -14876, -195489, -59747, -133965, -92741, -51833, -68596, 116040, 292558, 179173, 115315, 199099, 263845, 255236, 178738, 137679, 10578, 92072, 102816, 153552, 96045, -60369, -172236, -100552, -64656, -93633, 41637, 56709, 130123, 57018, -115242, -115363, -97462, -124542, 52687, 115529, 246554, 485899]
14375D85899j04383j7112m8270j1973j10989n239o4831k0588j12145N3975M2388
14364H6732j49485j00584J1850j822N7008o2573j23952J22641J49466k2889J48005
14353A14397n9643R365P8494n1567r9546k5787l2592Q3502J4480k4637r4395L4457
$$ y = [485899, 381516, 364404, 316134, 304161, 193172, 187933, 123102, 102514, -9631, 44344, 86732, -62753, -163337, -151487, -153309, -96301, -158874, -282826, -160185, -10719, -33608, 114397, 54754, 64119, 142613, 91046, -8500, -34287, -66879, 16623, 31103, 6466, -87929, -53472]
$$ [...]
##END NTUPLES=NMR SPECTRUM
##END=
