##TITLE=Analysis number 328520
Compound Code sb 01971
Project Code adrs
Chemist Name stores
##JCAMPDX= 6.0         $$ Bruker NMR JCAMP-DX V2.0
##DATA TYPE= NMR SPECTRUM
##DATA CLASS= NTUPLES
##ORIGIN= Bruker BioSpin GmbH
##OWNER= nmr
$$ XWIN-NMR		Version 3.5
$$ Tue Jun 12 13:33:13 2007 GMT Daylight Time (UT+1h)  MAYBRIDGE\nmr@NMR_250MHZ
##.OBSERVE FREQUENCY= 250.131544655141
##.OBSERVE NUCLEUS= ^1H
##.ACQUISITION MODE= SIMULTANEOUS (DQD)
##.ACQUISITION SCHEME= undefined
##.AVERAGES= 16
##.DIGITISER RES= 18
##SPECTROMETER/DATA SYSTEM= dpx250
##.PULSE SEQUENCE= zg30
##.SOLVENT NAME= CDCl3
##.SHIFT REFERENCE= (INTERNAL, CDCl3, 0, 16.522)
##AUDIT TRAIL= $$ (NUMBER, WHEN, WHO, WHERE, WHAT)
$$ ##TITLE= Audit trail, XWIN-NMR		Version 3.5
$$ ##JCAMPDX= 5.01
$$ ##ORIGIN= Bruker BioSpin GmbH
$$ ##OWNER= nmr
$$ C:\u/data/dgb/nmr/ADRS/760/pdata/1/auditp.txt
$$ ##AUDIT TRAIL=  $$ (NUMBER, WHEN, WHO, WHERE, WHAT)
(   1,<2007-06-12 13:32:45.15 +100>,<MAYBRIDGE\nmr>,<NMR_250MHZ>,
      <created by zg, POWCHK disabled, PULCHK disabled
       configuration hash MD5:
       76 6E 9A 78 1E 09 19 81 EC 84 63 8F B0 6A 59 2D
       data hash MD5: 64K
       B3 0B FC 7E D3 32 7E ED 20 AD 38 D9 D1 BF 38 36>)
(   2,<2007-06-12 13:32:56.37 +100>,<MAYBRIDGE\nmr>,<NMR_250MHZ>,
      <Start of raw data processing
       ef LB = 0.3 FT_mod = 6 PKNL = 1 SI = 32K 
       data hash MD5: 32K
       A1 A4 B2 08 78 A4 92 75 1F B6 81 C1 44 86 CF 6B>)
(   3,<2007-06-12 13:32:58.40 +100>,<MAYBRIDGE\nmr>,<NMR_250MHZ>,
      <apk 
       data hash MD5: 32K
       CE 07 A9 E8 99 CA D0 D5 71 AD 63 A0 79 41 B3 50>)
(   4,<2007-06-12 13:32:59.07 +100>,<MAYBRIDGE\nmr>,<NMR_250MHZ>,
      <abs ABSG = 5 
       data hash MD5: 32K
       E4 8A F3 40 F7 5D EA 60 84 70 DB 99 A8 4A 39 C1>)
$$ ##END=
$$ 
$$ hash MD5
$$ 1E 67 37 B2 29 DE 49 CC 22 6D 3B 70 B7 B4 EC 3D
##$RELAX= 
##$RELAX= 
##$RELAX= 
##$RELAX= 
##$RELAX= 
##$RELAX= 
##$RELAX= 
$$ Bruker specific parameters
$$ --------------------------
##$DU= <C:\u>
##$EXPNO= 760
##$NAME= <ADRS>
##$PROCNO= 1
##$TYPE= <nmr>
##$USER= <dgb>
##$AMP= (0..31)
100 100 100 100 100 100 100 100 100 100 100 100 100 100 100 100 100 100 
100 100 100 100 100 100 100 100 100 100 100 100 100 100 
##$AQSEQ= 0
##$AQ_mod= 3
##$AUNM= <au_zg>
##$AUTOPOS= <25 >
##$BF1= 250.13
##$BF2= 250.13
##$BF3= 250.13
##$BF4= 250.13
##$BF5= 500.13
##$BF6= 500.13
##$BF7= 500.13
##$BF8= 500.13
##$BYTORDA= 1
##$CFDGTYP= 0
##$CFRGTYP= 5
##$CHEMSTR= <none>
##$CNST= (0..31)
1 1 145 1 1 1 1 1 1 1 1 1 1 1 1 1 1 1 1 1 1 1 1 1 1 1 1 1 1 1 1 1 
##$CPDPRG= <>
##$CPDPRG1= <>
##$CPDPRG2= <>
##$CPDPRG3= <>
##$CPDPRG4= <mlev>
##$CPDPRG5= <mlev>
##$CPDPRG6= <mlev>
##$CPDPRG7= <mlev>
##$CPDPRG8= <mlev>
##$CPDPRGB= <>
##$CPDPRGT= <>
##$D= (0..31)
0 1 0 0 0 0 0 0 0 0.06 0 0 0 0 0 0 0.0002 0 0 0 0 0 0 0 0 0 0 0 0 0 0 
0 
##$DATE= 1181651564
##$DBL= (0..7)
120 120 120 120 120 120 120 120 
##$DBP= (0..7)
150 150 150 150 150 150 150 150 
##$DBP07= 0
##$DBPNAM0= <>
##$DBPNAM1= <>
##$DBPNAM2= <>
##$DBPNAM3= <>
$$ [...]
##$SUBNAM7= <"">
##$SUBNAM8= <"">
##$SUBNAM9= <"">
##$SW= 20.6930455092707
##$SWIBOX= (0..15)
0 0 3 0 0 0 0 0 0 0 0 0 0 0 0 0 
##$SW_h= 5175.983436853
##$TD= 65536
##$TD0= 1
##$TE= 297.16
##$TE2= 300
##$TE3= 300
##$TEG= 300
##$TL= (0..7)
0 120 120 120 120 120 120 120 
##$TP= (0..7)
150 150 150 150 150 150 150 150 
##$TP07= 0
##$TPNAME0= <>
##$TPNAME1= <>
##$TPNAME2= <>
##$TPNAME3= <>
##$TPNAME4= <>
##$TPNAME5= <>
##$TPNAME6= <>
##$TPNAME7= <>
##$TPOAL= (0..7)
0.5 0.5 0.5 0.5 0.5 0.5 0.5 0.5 
##$TPOFFS= (0..7)
0 0 0 0 0 0 0 0 
##$TUNHIN= 0
##$TUNHOUT= 0
##$TUNXOUT= 0
##$USERA1= <user>
##$USERA2= <user>
##$USERA3= <user>
##$USERA4= <user>
##$USERA5= <user>
##$V9= 5
##$VALIST= <valist>
##$VCLIST= <CCCCCCCCCCCCCCC>
##$VD= 0
##$VDLIST= <DDDDDDDDDDDDDDD>
##$VPLIST= <PPPPPPPPPPPPPPP>
##$VTLIST= <TTTTTTTTTTTTTTT>
##$WBST= 1024
##$WBSW= 4
##$XGAIN= (0..3)
0 0 0 0 
##$XL= 0
##$YL= 0
##$YMAX_a= 501679
##$YMIN_a= -453541
##$ZGOPTNS= <>
##$ZL1= 120
##$ZL2= 120
##$ZL3= 120
##$ZL4= 120
##$ABSF1= 16.522
##$ABSF2= -4.171173
##$ABSG= 5
##$ABSL= 3
##$ALPHA= 0
##$AQORDER= 0
##$ASSFAC= 0
##$ASSFACI= 0
##$ASSFACX= 0
##$ASSWID= 0
##$AUNMP= <proc_1d>
##$AZFE= 0.1
##$AZFW= 0.1
##$BCFW= 0
##$BC_mod= 0
##$BYTORDP= 0
##$COROFFS= 0
##$CY= 12.5
##$DATMOD= 1
##$DC= 0
##$DFILT= <>
##$DTYPP= 0
##$F1P= 14.0000005364418
##$F2P= -0.99999901652339
##$FCOR= 0.5
##$FTSIZE= 32768
##$FT_mod= 6
##$GAMMA= 0
##$GB= 0
##$INTBC= 1
##$INTSCL= 1
##$ISEN= 128
##$LB= 0.3
##$LEV0= 0
##$LPBIN= 0
##$MAXI= 10000
##$MC2= 0
##$MEAN= 0
##$ME_mod= 0
##$MI= 0
##$NCOEF= 0
##$NC_proc= -3
##$NLEV= 6
##$NOISF1= 0
##$NOISF2= 0
##$NSP= 0
##$NTH_PI= 0
##$NZP= 0
##$OFFSET= 16.522
##$PC= 1
##$PHC0= -46.65156
##$PHC1= -9.83368
##$PH_mod= 1
##$PKNL= yes
##$PPARMOD= 0
##$PSCAL= 4
##$PSIGN= 0
##$REVERSE= no
##$SF= 250.13
##$SI= 32768
##$SIGF1= 0
##$SIGF2= 0
##$SINO= 400
##$SIOLD= 32768
##$SREGLST= <1H.CDCl3>
##$SSB= 0
##$STSI= 32768
##$STSR= 0
##$SW_p= 5175.98343685301
##$SYMM= 0
##$S_DEV= 0
##$TDeff= 65536
##$TDoff= 0
##$TI= <Analysis number 999999
Compound Code 99
Book Reference 9
Project Code 9>
##$TILT= no
##$TM1= 0
##$TM2= 0
##$TOPLEV= 0
##$USERP1= <user>
##$USERP2= <user>
##$USERP3= <user>
##$USERP4= <user>
##$USERP5= <user>
##$WDW= 1
##$XDIM= 32768
##$YMAX_p= 360511506
##$YMIN_p= -139441
$$ End of Bruker specific parameters
$$ ---------------------------------
##NTUPLES= NMR SPECTRUM
##VAR_NAME=  FREQUENCY,     SPECTRUM/REAL,   SPECTRUM/IMAG
##SYMBOL=    X,             R,               I
##VAR_TYPE=  INDEPENDENT,   DEPENDENT,       DEPENDENT
##VAR_FORM=  AFFN,          ASDF,            ASDF
##VAR_DIM=   32768,         32768,           32768
##UNITS=     HZ,            ARBITRARY UNITS, ARBITRARY UNITS
##FACTOR=    0.157963299565203, 1,           1
##FIRST=     4132.6476996994, 0,             0
##LAST=      -1043.33573715361, 0,           0
##MIN=       -1043.33573715361, -139441,     0
##MAX=       4132.6476996994, 360511506,     0
$$ Real data points
##PAGE= N=1
##DATA TABLE= (X++(R..R)), XYDATA
$$ [...]
$$ plain form
23979 -39678 -5477 816 -8806 -8317 35886 55276 43970 19313 20485 -7451 -26271 6740 28987
23966 28987 15640 10033 31934 22905 20325 17131 1175 -12076 -7612 -20006 -49675 -39768 -19591
23953 -19591 -5771 -3504 -25440 -9232 -8329 -1558 18818 -3212 -34601 -19006 -36158 -59343
23941 -59343 -49657 -18790 -16880 -20251 -28570 -13115 -18831 -29415 -26178 -3990 6745 -10536 -30625
23928 -30625 -59335 -65805 -33495 -13942 9419 -4124 -14181 -4751 11928 6750 24594 17503
23916 17503 -17064 -33222 -38555 -31594 -30796 -35420 -28584 -27230 -6491 -7007 -17776 -6728 8434
23903 8434 30352 9003 -9234 -7229 -15929 -9499 14974 25229 8626 19125 21365 7578 18788
23890 18788 14300 16683 -2858 12049 32547 35154 27106 24510 10911 -13468 9570 33385 9572
$$ packed form
23979c9678L4201O293r622M89M4203J9390j1306k4657J172k7936j8820L3011K2247
23966B8987j3347n607K1901r029k580l194j5956j3251M464j2394k9669R907K0177
23953a9591J3820K267k1936J6208R03O771K0376k2030l1389J5595j7152k3185
23941e9343R686L0867J910l371q319J5455n716j0584L237K2188J0735j7281k0089
23928c0625k8710o470L2310J9553K3361j3543j0057R430J6679n178J7844p091
23916A7503l4567j6158n333O961P98m624O836J354K0739n16j0769J1048J5162
23903H434K1918k1349j8237K005q700O430K4473J0255j6603J0499K240j3787J1210
23890A8788m488K383j9541J4907K0498K607q048k596j3599k4379K3038K3815k3813
$$ plain form
23877 9572 -16393 -17896 -21187 -45433 -71605 -37721 -15378 170 16587 7460 16625 -21606 -39250
23864 -39250 -23360 -4321 3325 -2687 7410 8703 -22096 3831 3005 23567 16233 10454 28357
23851 28357 14569 -20070 -27742 -12309 -8673 -10451 -27008 -31682 -25220 -428 -17921 -37728 -37649
23838 -37649 -23219 11660 25004 30878 37736 78671 86727 64940 41852 19193 14760 17358 6708
23825 6708 -18286 -35479 -40999 -29242 -40213 -8054 27427 -17916 -37990 -37140 -3675 9458
23813 9458 34783 48790 36249 22773 26156 -11587 -27670 -34720 -45089 -50359 -47494 -35953 -23456
23800 -23456 -10513 1503 -11429 -46710 -37190 -9779 -24966 -50262 -62737 -29504 -187 25495
23788 25495 26487 7650 -18612 -34964 -44402 -39972 -10647 9242 17474 33026 35958 12335 5820
$$ packed form
23877I572k5965j503l291k4246k6172L3884K2343J5548J6417r127R165l8231j7644
23864c9250J5890J9039P646o012J0097J293l0799K5927q26K0562p334n779J7903
23851B8357j3788l4639p672J5433L636j778j6557m674O462K4792j7493j9807P9
23838c7649J4430L4879J3344N874O858M0935Q056k1787k3088k2659m433K598j0650
23825F708k4994j7193n520J1757j0971L2159L5481m5343k0074Q50L3465J3133
23813I458K5325J4007j2541j3476L383l7743j6083p050j0369n270K865J1541J2497
23800b3456J2943J2016j2932l5281R520K7411j5187k5296j2475L3233K9317K5682
23788B5495R92j8837k6262j6352r438M430K9325J9889Q232J5552K932k3623o515
$$ plain form
23775 5820 11872 -631 -9481 31933 42388 24984 35590 26908 10034 22090 21718 5622 -11926
23762 -11926 -35817 -32060 -36988 -24682 -9532 -24307 -41761 -19599 -12804 -18217 2780 -22332
23750 -22332 -24889 -581 12652 -19585 -39897 -53458 -36412 -36702 -27337 -6401 2130 26020 30373
23737 30373 27709 42199 8780 1833 -6028 -47446 -71498 -65279 -22852 16445 11964 26042 35766
23724 35766 33019 12841 -7453 -26342 -15155 -20853 -10514 -10111 -2215 -6221 25922 16299 27265
23711 27265 9598 -6390 1939 6116 3724 3348 -356 -8551 15950 2198 -20133 -9670 18436
23698 18436 21820 29662 2405 -9174 -723 13957 -9478 -13529 -20832 -34247 -26164 6752 34474
23685 34474 12556 431 42107 9843 -11721 -22325 -34235 -15298 -19266 -22837 -12538 -10962
$$ packed form
23775E820O052j2503q850M1414J0455j7404J0606q682j6874J2056l72j6096j7548
23762a1926k3891L757m928J2306J5150j4775j7454K2162O795n413K0997k5112
23750b2332k557K4308J3233l2237k0312j3561J7046k90R365K0936Q531K3890M353
23737C0373k664J4490l3419o947p861m1418k4052O219M2427L9297m481J4078R724
23724C5766k747k0178k0294j8889J1187n698J0339M03P896m006L2143r623J0966
23711B7265j7667j5988Q329M177k392l76l704q195K4501j3752k2331J0463K8106
23698A8436L384P842k7257j1579Q451J4680k3435m051p303j3415Q083L2916K7722
23685C4474k1918j2125M1676l2264k1564j0604j1910J8937l968l571J0299J576
$$ plain form
23673 -10962 -10483 3349 10972 13068 2024 -7434 -53 -5419 -10731 5524 15441 26688 33927 36255
23659 36255 37230 42475 36501 25389 6604 -3083 13527 9894 4456 19939 27643 7477 -16730
23646 -16730 -24552 -35982 -22580 5134 17948 -2889 -9103 2199 -11705 -585 -683 -22582 -42581
23633 -42581 -28471 4012 -1874 1569 14715 26749 36012 38996 49802 43133 40855 42645 54046
23620 54046 33443 4848 7049 34688 43914 17584 14661 11645 -4707 1715 -4317 -26214 -14741
23607 -14741 3102 14889 5902 -12220 -26662 -7374 -3920 -10781 -7894 -2470 -15164 -8068 -8771
23594 -8771 -55432 -61093 -33353 -19141 1996 7694 13702 6542 11544 4941 18470 25929 343
23581 343 -36063 -35651 -8886 -19653 -24486 -8864 30861 37796 22159 -147 6802 36471 20031
$$ packed form
23673a0962M79J3832P623K096j1044r458P381n366n312J6255R917J1247P239K328
23659C6255R75N245n974j1112j8785r687J6610l633n438J5483P704k0166k4207
23646a6730p822j1430J3402K7714J2814k0837o214J1302j3904J1120r8k1899j9999
23633d2581J4110L2483n886L443J3146J2034R263K984J0806o669k278J790J1401
23620E4046k0603k8595K201K7639R226k6330k923l016j6352O422o032k1897J1473
23607a4741J7843J1787q987j8122j4442J9288L454o861K887N424j2694P096p03
23594h771m6661n661K7740J4212K1137N698O008p160N002o603J3529P459k5586
23581C43l6406M12K6765j0767m833J5622L9725O935j5637k2306O949K9669j6440
$$ plain form
23568 20031 -8161 -12375 -15730 -13488 7567 3606 3682 10916 7327 18639 11248 11021 -69 11307
23554 11307 3715 -15808 -14576 -9538 -12119 -9642 14068 22433 15373 13367 3494 -11142 -17821 -16523
23540 -16523 -16628 -15681 -2867 21987 17937 -11338 -17970 -24091 -3079 37280 59331 37562 43834
23527 43834 29663 6054 7557 9430 41116 41797 23889 6956 -349 -2480 -2074 29128 45409
23514 45409 35298 17498 20865 30264 20552 -8138 -27940 -34520 -18434 -20306 115 16209 23871
23501 23871 20152 11906 7829 4753 -1877 7338 -14146 -34348 -12369 -15366 -14783 -7381 -20980 -31664
23487 -31664 -11875 -15284 -6780 -12609 -5110 -12805 -57534 -23974 8410 1907 -12883 -1033 7402
23474 7402 -15899 -40034 -33408 -25527 4045 24124 -5565 -22091 -3988 9306 20139 19817 -1680
$$ packed form
23568B0031k8192m214l355K242K1055l961P6P234l589J1312p391k27j1090J1376
23554A1307p592j9523J232N038k581K477K3710Q365p060k006r873j4636o679J298
23540a6523j05R47J2814K4854m050k9275o632o121K1012M0359K2051k1769O272
23527D3834j4171k3609J503J873L1686O81j7908j6933p305k131M06L1202J6281
23514D5409j0111j7800L367R399r712k8690j9802o580J6086j872K0421J6094P662
23501B3871l719q246m077l076o630R215k1484k0202K1979k997N83P402j3599j0684
23487c1664J9789l409Q504n829P499p695m4729L3560L2384o503j4790J1850Q435
23474G402k3301k4135O626P881K9572K0079k9689j6526J8103J3294J0833l22k1497
$$ plain form
23461 -1680 11864 17784 -2258 -35046 -39783 2816 39698 53785 47990 56812 51680 -1871 -24814
23448 -24814 -11781 -11760 -12895 -34737 -20826 -14331 -6622 14145 29179 25079 4324 1742 36845
23435 36845 48999 36697 10654 -2187 -18048 -13469 -1298 16262 25656 30101 5908 9600
23423 9600 18142 2877 16478 20758 24568 15781 36289 60080 69753 76714 72262 38082 -13119
23410 -13119 -28718 -1002 -4927 -28056 -10886 18549 -23158 -50086 -49905 -33899 -43465 -61265
23398 -61265 -72257 -37356 -7372 -3898 20792 21602 -374 -13357 -13439 2050 1636 10962 7457 -6748
23384 -6748 10982 28694 26149 -17807 -21044 -7182 -26057 -23680 -25045 -26745 -23373 -19264 293
23371 293 -2153 2847 -3625 4216 23196 5749 -25183 -2611 -9062 -29149 -46748 -30543 -20270
$$ packed form
23461a680J3544N920k0042l2788m737M2599L6882J4087n795Q822n132n3551k2943
23448b4814J3033K1j135k1842J3911O495P709K0767J5034m100k0755k582L5103
23435C6845J2154j2302k6043j2841j5861M579J2171J7560R394M445k4193L692
23423I600Q542j5265J3601M280L810q787K0508K3791R673O961m452l4180n1201
23410a3119j5599K7716l925k3129J7170K9435m1707k6928J81J6006r566j7800
23398f1265j0992L4901K9984L474K4690Q10k1976j2983q2J5489m14R326l505j4205
23384f748J7730J7712k545m3956l237J3862j8875K377j365j700L372M109J9557
23371B93k446N000o472P841J8980j7447l0932K2572o451k0087j7599J6205J0273
$$ plain form
23358 -20270 -24724 -22515 -17781 -40707 -61772 -25821 -8441 -32451 -10179 -11320 3723 41037
23346 41037 39613 20574 2948 22955 10921 -1430 26346 25735 -21057 -35887 -46172 -36354
23334 -36354 -22309 1777 24935 696 -20375 -36322 -32633 -14671 -6754 20486 10730 -10544
23322 -10544 -11852 7051 33700 45405 50473 47876 23972 772 14083 28142 22789 14760 14432
23309 14432 25885 40117 34792 1182 -21760 -17040 2175 16661 30839 -9072 -7864 17573
23297 17573 6391 -9407 -14698 -15748 11183 24446 44874 62719 53308 41497 19995 -21511
23285 -21511 -46780 -26384 -22078 -61199 -55573 -54365 -35389 13126 18622 20880 21666 -9106 -53670
23272 -53670 -33848 -24507 -21554 14951 -8492 -17011 -26283 1231 11655 -5077 -6379 1911 8597
$$ packed form
23358b0270m454K209M734k2926k1065L5951J7380k4010K2272j141J5043L7314
23346D1037j424j9039j7626K0007j2034j2351K7776o11m6792j4830j0285R818
23334c6354J4045K4086K3158k4239k1071j5947L689J7962P917K7240r756k1274
23322a0544j308J8903K6649J1705N068k597k3904k3200J3311J4059n353q029l28
23309A4432J1453J4232n325l3610k2942M720J9215J4486J4178l9911J208K5437
23297A7573j1182j5798n291j050K6931J3263K0428J7845r411j1811k1502m1506
23285b1511k5269K0396M306l9121N626J208J8976M8515N496K258P86l0772m4564
23272e3670J9822R341K953L6505k3443q519r272K7514J0424j6732j302Q290O686
$$ plain form
23259 8597 3950 -4010 9688 528 771 1774 -47932 -68228 -16624 13849 14103 17442 4608 3748
23245 3748 11228 5297 9365 28670 21294 25740 34880 34535 14759 9909 14440 25815 42475 43577
23231 43577 17155 13680 20684 28985 26389 8120 -17196 -52070 -51703 -22544 -19805 -21615 -28981
23218 -28981 -11488 23260 10099 -12755 -2279 -19897 -33089 -42467 -25611 11979 12670 -28485
23206 -28485 -29235 11081 -22723 -36833 -39977 -44146 -6361 3041 7082 -16800 -16336 23283 23061 1636
23192 1636 1717 -11183 -52651 -43246 -21653 7726 42248 18532 -29072 -47271 -56509 -39636 -12362
23179 -12362 16090 17230 26923 15867 13346 6975 1842 16956 31823 17165 -4290 2319 7745
23166 7745 -1532 -10435 2051 -3215 -10940 -39516 -24492 -2853 -12753 6922 38881 9369 1656
$$ packed form
23259H597m647p960J3698r160K43J003m9706k0296N1604L0473K54L339j2834q60
23245C748P480n931M068J9305p376M446R140l45j9776m850M531J1375J6660J102
23231D3577k6422l475P004Q301k596j8269k5316l4874L67K9159K739j810p366
23218b8981J7493L4748j3161k2854J0476j7618j3192r378J6856L7590O91m1155
23206b8485p50M0316l3804j4110l144m169L7785R402M041k3882M64L9619k22k1425
23192A636Q1j2900m1468R405K1593K9379L4522k3716m7604j8199r238J6873K7274
23179a2362K8452J140R693j1056k521o371n133J5114J4867j4658k1455O609N426
23166G745r277q903J2486n266p725k8576J5024K1639r900J9675L1959k9512p713
$$ plain form
23153 1656 1762 9327 19089 38416 33442 14571 336 -12767 -13612 -5554 -2356 -9165 -22282 -28328
23139 -28328 -3553 16757 33231 58106 37133 8026 5032 8646 2508 25934 43861 39226
23127 39226 17308 9877 23304 48831 59433 62553 59223 63604 27298 7844 21653 38367
23115 38367 6051 17753 31685 23387 -1318 -15330 3044 -1004 -11485 -22022 -14909 -22416
23103 -22416 -39229 -48622 -78891 -51249 -49293 -42624 -18119 -62453 -67741 -44716 -43898 -68535 -62431
23090 -62431 -42205 -30065 -23481 1429 43151 53825 2724 -38041 -37523 -16095 8591 12663
23078 12663 21717 -2498 -1995 20802 25889 7937 29639 56546 55525 44124 583 -16177 -25112
23065 -25112 -23411 3681 21263 -10160 -21194 -17325 -20408 -12266 -17490 1778 27052 2596 -16253
$$ packed form
23153A656J06P565R762J9327m974j8871j4235j3103q45Q058L198o809j3117o046
23139b8328K4775K0310J6474K4875k0973k9107k994L614o138K3426J7927m635
23127C9226k1918p431J3427K5527J0602L120l330M381l6306j9454J3809J6714
23115C8367l2316J1702J3932q298k4705j4012J8374m048j0481j0537P113p507
23103b2416j6813r393l0269K7642J956O669K4505m4334n288K3025Q18k4637O104
23090f2431K0226J2140O584K4910M1722J0674n1101m0765N18K1428K4686M072
23078A2663R054k4215N03K2797N087j7952K1702K6907j021j1401m3541j6760q935
23065b5112J701K7092J7582l1423j1034L869l083Q142n224J9268K5274k4456j8849
$$ plain form
23052 -16253 -11074 -11172 6753 21813 15251 1622 22436 23793 3505 8764 -1810 -4113 -17233
23039 -17233 -27008 -48253 -56868 -33656 -14703 12821 41450 43903 40173 31886 31385 7650 2534
23026 2534 14612 13166 -2184 9189 8546 -10955 2044 22569 7669 -2929 -46192 -51214 -31861
23013 -31861 -25465 -42003 -35028 -3293 3643 -15803 -23525 -21983 -43267 -42295 -17874 7790 893
23000 893 -15330 17847 37264 18747 -3599 -20466 -18547 -22214 -41423 -42569 -906 15348 4925
22987 4925 24806 25736 33981 25893 -16966 -16435 -2318 2714 -15026 12143 18490 486 -6628 5512
22973 5512 2576 5872 -13357 -6397 16801 17890 26903 14221 7198 -18925 -21315 5029 39512
22960 39512 45719 26063 20884 11536 15881 -735 13089 13327 -27934 -33436 -29901 -16829 -7149
$$ packed form
23052a6253N179r8J7925J5060o562j3629K0814J357k0288N259j0574k303j3120
23039a7233r775k1245q615K3212J8953K7524K8629K453l730q287n01k3735n116
23026B534J2078j446j5350J1373o43j9501J2999K0525j4900j0598m3263n022J9353
23013c1861O396j6538O975L1735O936j9446p722J542k1284R72K4421K5664o897
23000H93j6223L3177J9417j8517k2346j6867J919l667j9209j146M1663J6254j0423
22987D925J9881R30Q245q088m2859N31J4117N032j7740K7169O347j8004p114J2140
22973E512k936L296j9229O960K3198J089R013j2682p023k6123k390K6344L4483
22960C9512O207j9656n179r348M345j6616J3824K38m1261n502L535J3072R680
$$ plain form
22947 -7149 -2742 11478 8224 15552 4395 -36368 -42973 -9366 22189 34578 10354 -6262 4001
22934 4001 4483 -22607 -43784 -47723 -41905 -26081 -52444 -67765 -44646 -12004 1553 -28679 -55446
22921 -55446 -18163 -26936 -48272 -60691 -32277 -19234 -21192 -12554 -18735 -36615 -27108 -10895 -725
22908 -725 1776 16160 4505 8596 -7941 -19281 2585 27328 37792 43929 25011 -14206 -42020
22895 -42020 -37091 -13451 -16895 -14522 -19938 -41987 -48923 -25881 -38074 -15451 12220 -3904 -17285
22882 -17285 -15375 17264 29005 13876 -23190 -52925 -38383 -28535 -15943 -25842 -2382 30938
22870 30938 42608 44663 36906 -451 -17379 -27230 -33463 -30944 -40872 -40384 -41116 -36067 -33523 -42257
22856 -42257 -37012 4447 -4754 -19923 -26967 -8034 1311 2910 -3276 -8398 -18796 -40857 -22935
$$ packed form
22947g149M407J4220l254P328j1157m0763o605L3607L1555J2389k4224j6616J0263
22934D001M82k7090k1177l939N818J5824k6363j5321K3119L2642J3557l0232k6767
22921e5446L7283q773k1336j2419K8414J3043j958Q638o181j7880R507J6213J0170
22908g25K501J4384j1655M091j6537j1340K1866K4743J0464O137j8918l9217k7814
22895d2020M929K3640l444K373n416k2049o936K3042j2193K2623K7671j6124j3381
22882a7285J910L2639J1741j5129l7066k9735J4542R848J2592r899K3460L3320
22870C0938J1670K055p757l7357j6928r851o233K519r928M88p32N049K544q734
22856d2257N245M1459r201j5169p044J8933R345J599o186n122j0398k2061J7922
$$ plain form
22843 -22935 -3486 -11513 -30068 -32473 -36041 -30650 -22932 -41814 -42538 -18517 34845 34241 22701
22830 22701 -2227 397 3809 6571 -13468 -10786 -2042 18026 18545 9032 12942 17005 15887 30101
22816 30101 15405 -24525 -41470 -36071 -45145 -46766 -26819 -20443 10460 -10925 -36703 -31057 -3154
22803 -3154 42633 32506 -771 27899 28061 10986 10114 -1601 -15123 -36149 -35346 -11583 5379
22790 5379 -12717 -13108 6735 -8617 -19503 -11819 -19568 -29186 -12639 -1808 -3833 -33437 1938
22777 1938 -1357 7650 25632 22467 9444 1389 5180 515 -2414 -15668 -40310 -64065 -73556
22764 -73556 -78069 -58569 -40725 -47445 -27708 -5293 -383 -16372 -12847 3870 30875 43429
22752 43429 22460 24668 13518 25312 17085 6113 20271 72973 60416 21764 8901 -3664
$$ packed form
22843b2935J9449q027j8555k405l568N391P718j8882p24K4021N3362o04j1540
22830B2701k4928K624L412K762k0039K682Q744K0068N19r513L910M063j118J4214
22816C0101j4696l9930j6945N399r074j621J9947O376L0903k1385k5778N646K7903
22803c154M5787j0127l3277K8670J62j7075q72j1715j3522k1026Q03K3763J6962
22790E379j8096l91J9843j5352j0886P684p749r618J6547J0831k025k9604L5375
22777A938l295R007J7982l165j3023q055L791m665k929j3254k4642k3755r491
22764g3556m513J9500J7844o720J9737K2415M910j5989L525J6717K7005J2554
22752D3429k0969K208j1150J1794q227j0972J4158N2702j2557l8652j2863j2565
$$ plain form
22740 -3664 -25315 -4332 17958 30400 13626 26834 19271 22378 24582 15349 58 -12880 -9201
22727 -9201 5806 27742 51515 52388 19651 -3337 -20373 -24857 -12395 -20686 -40494 -19804 4034
22714 4034 13912 1823 -1255 5214 -18496 -32641 -64497 -48633 13360 25667 41566 64019
22702 64019 18199 -21276 -16313 -25244 -50545 -39453 -14209 -20350 -33438 -18302 -16947 -20159 -15283
22689 -15283 5269 41130 15951 -26600 -7109 4680 11474 24799 15765 -4354 -7432 -6875 -15636
22676 -15636 -22639 -32553 -49306 -81043 -87440 -78915 -85146 -51375 -31 11355 3555 830 -1529
22663 -1529 8460 -17218 -24579 10886 31756 29785 29171 33502 9616 -20306 -10849 -5442 -4847 -14710
22649 -14710 -23986 -17365 -14162 -4172 -5294 16449 25433 10605 15898 8499 7561 28550 29308 -1476
$$ packed form
22740c664k1651K0983K2290J2442j6774J3208p563L107K204r233j5291j2938L679
22727i201J5007K1936K3773Q73l2737k2988j7036m484J2462q291j9808K0690K3838
22714D034R878j2089l078O469k3710j4145l1856J5864O1993J2307J5899K2453
22702F4019m5820l9475M963q931k5301J1092K5244o141j3088J5136J355l212M876
22689a5283K0552L5861k5179m2551J9491J1789O794J3325r034k0119l078N57q761
22676a5636p003r914j6753l1737o397Q525o231L3771N1344J1386p800k725k359
22663a529R989k5678p361L5465K0870j971o14M331k3886k9922R457N407N95r863
22649a4710r276O621L203R990j122K1743Q984j4828N293p399r38K0989P58l0784
$$ plain form
22635 -1476 5296 23839 14137 4121 -24774 -22252 10202 12274 -6828 -29901 -38285 -19819 -10895
22622 -10895 11402 3977 -43127 -61671 -52123 -31826 -20702 -35410 -23289 -21349 -2570 16132
22610 16132 22302 24186 16772 -13221 -24075 -15552 -17393 -287 17070 22921 30986 47805 50633
22597 50633 35167 13593 -6292 -22848 -24848 -8996 26537 27894 21541 32795 41565 19602
22585 19602 -5917 -6208 -14876 -23659 -17988 8027 47067 29218 -2614 -15909 11672 5713 -2757
22572 -2757 873 6092 -10143 -23769 -35115 -13735 12898 36554 34685 26592 16625 -25557 -27256
22559 -27256 -1519 -5978 15651 14623 -2548 -8031 -7816 -22731 -19330 780 3419 -1325 -24563
22546 -24563 -29097 -12658 -3011 -21714 -18533 10920 29315 28192 25441 38337 45016 36290 37175
$$ packed form
22635a476O772J8543r702j0016k8895K522L2454K072j9102k3073q384J8466Q924
22622a0895K2297p425m7104j8544R548K0297J1124j4708J2121J940J8779J8702
22610A6132O170J884p414k9993j0854Q523j841J7106J7357N851Q065J6819K828
22597E0633j5466k1574j9885j6556k000J5852L5533J357o353J1254Q770k1963
22585A9602k5519k91q668q783N671K6015L9040j7849l1832j3295K7581n959q470
22572b757L630N219j6235j3626j1346K1380K6633K3656j869q093r967m2182j699
22559b7256K5737m459K1629j028j7171n483K15j4915L401K0110K639m744k3238
22546b4563m534J6439R647j8703L181K9453J8395j123k751J2896O679q726Q85
$$ plain form
22533 37175 30361 9212 -7175 -9661 -2955 -16749 -1642 7898 688 -2208 -11302 -21515 -39704
22520 -39704 -65169 -47571 -46539 -71828 -39527 11761 14190 9135 6466 -10342 -35421 -20021
22508 -20021 20864 18744 -20965 -31222 -18605 -7386 2939 -1101 30594 53861 47321 28544
22496 28544 21247 5714 -9514 -28087 -14601 -7049 4315 25398 26407 14054 10180 35202
22484 35202 43343 40627 37510 16692 -17393 -17397 -22183 -9731 6996 18674 -5781 12228 21535
22471 21535 10236 10569 31757 44837 29814 10436 -7414 -26453 -26669 -9269 139 2778 -1460
22458 -1460 26724 33521 11396 -7813 -10847 -4331 -6161 8783 -9451 -44233 -12214 -7511 -147
22445 -147 17894 53316 15374 -3159 4211 1819 -10090 -14932 -4828 -12341 -55582 -42128 -22564
$$ packed form
22533C7175o814k1149j6387k486O706j3794J5107R540p210k896r094j0213j8189
22520c9704k5465J7598J032k5289L2301N1288K429n055k669j6808k5079J5400
22508b0021M0885k120l9709j0257J2617J1219J0325m040L1695K3267o540j8777
22496B8544p297j5533j5228j8573J3486P552J1364K1083J009j2353l874K5022
22484C5202Q141k716l117k0818l4085mm786J2452J6727J1678k4455J8009R307
22471B1535j1299L33K1188J3080j5023j9378j7850j9039k16J7400R408K639m238
22458a460K8184O797k2125j9209l034O516j830J4944j8234l4782L2019M703P364
22445a47J8041L5422l7942j8533P370k392j1909m842J0104p513m3241J3454J9564
$$ plain form
22432 -22564 -37880 -51495 -41742 -61131 -51416 -33352 -43730 -20621 -8614 -12354 17867 26337
22420 26337 -6251 -20453 -12639 -35247 -36467 -23803 -16062 -34675 -51331 -29869 -8337 1233
22408 1233 23771 20767 7126 525 -25785 -41267 -61144 -58561 -45166 -52727 -54694 -47278 -62952
22395 -62952 -60880 -52606 -21964 -17875 -19623 3241 1473 -8180 -24624 -15809 7421 10775 17489
22382 17489 41368 45179 41034 38059 10879 -16681 -1425 -9206 -13439 -20442 -50759 -37536 -25777
22369 -25777 -32958 -44655 -16666 -3349 13180 18030 15498 -15219 -41982 -47884 -40186 -22252 -19631
22356 -19631 -21194 -20005 -17478 -8573 9855 15424 5630 -19122 -6329 -8474 -15514 -23267 -32823 -28000
22342 -28000 -25352 -32050 -11846 -1490 29032 36884 31210 3313 -24264 -32462 -18497 11794 12923
$$ packed form
22432b2564j5316j3615R753j9389R715J8064j0378K3109J2007l740L0221Q470
22420B6337l2588j4202P814k2608j220J2664P741j8613j6656K1462K1532R570
22408A233K2538l004j3641o601k6310j5482j9877K583J3395p561j967P416j5674
22395f2952K072Q274L0642M089j748K2864j768r653j6444Q815K3230L354O714
22382A7489K3879L811m145k975k7180k7560J5256p781m233p003l0317J3223J1759
22369b5777p181j1697K7989J3317J6529M850k532l0717k6763n902P698J7934K621
22356a9631j563J189K527Q905J8428N569r794k4752J2793k145p040p753r556M823
22342b8000K648o698K0204J0356L0522P852n674k7897k7577q198J3965L0291J129
$$ plain form
22329 12923 895 -9919 -3869 220 7039 18159 13662 30322 69077 62024 45186 43903 31749
22316 31749 2528 -33697 -37499 -24995 -17016 -678 19010 14476 6398 31222 39985 25863 12666
22303 12666 -9599 -30054 -13489 -17104 -24278 -43614 -46896 -12160 -25624 -45866 -37313 -3892
22291 -3892 23595 41707 41219 19944 3083 -24317 -13356 22973 9025 -19504 -9886 2884
22279 2884 -9932 -18081 -38659 -14795 29646 29988 6976 -28307 -28206 -17526 -16550 -16561 3517 -10513
22265 -10513 -16493 -4438 -20669 9644 -5390 3164 -4595 -35422 -62163 -51522 -21895 -13683
22253 -13683 -29571 -43980 -41181 -39972 -31638 -9121 35041 31054 48865 39230 20072 6678 18393
22240 18393 23051 21132 11012 23713 28920 22426 26174 1727 -13477 -267 20339 14267 -1807
$$ packed form
22329A2923j2028j0814O050M089O819J1120m497J6660L8755p053j6838j283j2154
22316C1749k9221l6225l802J2504P979J6338J9688m534q078K4824Q763j4122j3197
22303A2666k2265k0455J6565l615p174j9336l282L4736j3464k0242Q553L3421
22291c892K7487J8112m88k1275j6861k7400J0961L6329j3948k8529R618J2770
22279B884j2816q149k0578K3864M4441L42k3012l5283J01J0680R76j1K0078j4030
22265a0513n980J2055j6231L0313j5034Q554p759l0827k6741J0641K9627Q212
22253a3683j5888j4409K799J209Q334K2517M4162l987J7811r635j9158j3394J1715
22240A8393M658j919j0120J2701N207o494L748k4447j5204J3210K0606o072j6074
$$ plain form
22227 -1807 14998 5469 -23024 -21441 -24469 -12544 -10019 15111 22265 9510 -39605 -11480 19951
22214 19951 -2253 574 47428 18475 -34305 -39026 -21750 -8254 -32533 -36067 -17530 -17337 -20417
22201 -20417 -25904 -34630 -43009 -47150 -35530 -36372 -51412 -39243 -37327 -31635 -42846 -54398 -48675
22188 -48675 -20174 8997 23493 24776 24521 26673 12923 12635 11741 1437 12198 -12067 -30910
22175 -30910 8513 7831 -15526 -14822 -21047 -26938 -21823 -16674 -30099 -26136 -33595 -30538 -13833 -17745
22161 -17745 -7391 11428 -12916 -269 -11660 -2911 819 5336 35882 18510 6400 9397
22149 9397 18282 38032 39489 35960 33205 39050 32130 -5882 -30305 -3975 22124 20092 29013
22136 29013 18743 -5346 -27948 -14833 13595 13616 8175 11571 -10342 5492 28052 48123 44959
$$ packed form
22227a807J6805r529k8493J583l028J1925K525K5130P154j2755m9115K8125L1431
22214A9951k2204K827M6854k8953n2780m721J7276J3496k4279l534J8537J93l080
22201b0417n487q726q379m141J1620q42j5040J2169J916N692j1211j1552N723
22188d8675K8501K9171J4496J283k55K152j3750k88q94j0304J0761k4265j8843
22175c0910L9423o82k3357P04o225n891N115N149j3425L963p459L057J6705l912
22161a7745J0354J8819k4344J2647j1391Q749L730M517L0546j7372j2110K997
22149I397Q885J9750J457l529k755N845o920l8012k4423K6330K6099k032Q921
22136B9013j0270k4089k2602J3115K8428K1n441L396k1913J5834K2560K0071l164
$$ plain form
22123 44959 51501 65304 46138 5914 -730 -12755 -27669 -40974 -76738 -62921 -40599 3889
22111 3889 33396 17840 -10705 -22465 -14734 -18473 -43223 -24128 -21225 -6208 -36817 -29983 -25740
22098 -25740 -3919 -8923 -3505 -18783 -28692 -7013 16469 25018 -1078 -5134 -34675 -40659 304
22085 304 3555 6817 -19884 -29010 -8160 15126 18610 43309 49256 57628 69359 44917 -3787
22072 -3787 -1418 33 -10170 -28986 -48555 -38894 -16949 -1276 13893 -7790 -20517 -12498 -25747
22059 -25747 -43257 -76917 -75687 -60524 -61034 -28282 -13963 -11761 -33431 -41067 -26692 -17817 -12402
22046 -12402 -5432 -19845 -17949 -24346 -35037 -23182 -17479 -54929 -59072 -36323 -11031 30966 25737
22033 25737 4139 -14014 -26757 -13756 5175 5558 -8788 -12880 -24971 8683 10826 -7546
$$ packed form
22123D4959O542J3803j9166m0224o644j2025j4914j3305l5764J3817K2322M4488
22111C889K9507j5556k8545j1760P731l739k4750J9095K903J5017l0609O834M243
22098b5740K1821n004N418j5278r909K1679K3482Q549k6096m056k9541n984M0963
22085C04L251L262k6701r126K0850K3286L484K4699N947Q372J1731k4442m8704
22072c787K369J451j0203j8816j9569R661K1945J5673J5169k1683j2727Q019j3249
22059b5747j7510l3660J230J5163n10L2752J4319K202k1670p636J4375Q875N415
22046a2402O970j4413J896o397j0691J1855N703l7450m143K2749K5292M1997n229
22033B5737k1598j8153j2743J3001J8931L83j4346m092j2091L3654K143j8372
$$ plain form
22021 -7546 -13751 2265 -22850 -50835 -62549 -56773 -29125 -28113 -59518 -41349 -17726 -18160 -17229
22008 -17229 -8598 7230 25769 17169 38346 22975 4674 22699 36500 24381 33397 15562
21996 15562 10490 27855 9261 -2142 12358 22988 30078 1638 -16162 -33642 -31476 -55028
21984 -55028 -67801 -64908 -22526 5428 6219 -45598 -67420 -88679 -81913 -80409 -70846 -58616 -45693
21971 -45693 -25606 -16773 23215 8435 -10325 -12624 -4019 -16721 -8236 -526 -3531 5098 3755
21958 3755 -12870 -20357 -35963 -30521 -14271 -14681 -27221 -31775 -32078 -11981 -18596 -26738 -6535 -13849
21944 -13849 -12747 -3396 -1366 17760 30587 48089 34234 -14644 -21085 -14321 -37536 -5572 33909
21931 33909 37123 38413 25675 -120 -19696 -31105 -19701 493 -6812 16404 52098 30453
$$ packed form
22021g546o205J6016k5115k7985j1714N776K7648J012l1405J8169K3623m34R31
22008a7229Q631J5828J8539q600K1177j5371j8301J8025J3801j2119R016j7835
21996A5562n072J7365j8594j1403J4500J0630P090k8440j7800j7480K166k3552
21984e5028j2773K893M2382K7954P91n1817k1822k1259O766J504R563J2230J2923
21971d5693K0087Q833L9988j4780j8760k299Q605j2702Q485P710l005Q629j343
21958C755j6625p487j5606N442J6250m10j2540m554l03K0097o615q142K0203p314
21944a3849J102R351K030J9126J2827J7502j3855m8878o441O764k3215L1964L9481
21931C3909L214J290j2738k5795j9576j1409J1404K0194p305K3216L5694k1645
$$ plain form
21919 30453 18033 33934 6274 -10203 4980 12715 15637 37979 40481 43664 30249 5456
21907 5456 -43304 -45451 -41308 -29699 -18322 -25356 -16743 -4419 22742 17138 12587 20752 18302
21894 18302 -4914 -9539 -29552 -40562 -73994 -71980 -58909 -63588 -56410 -38386 -7329 -19295
21882 -19295 -46407 -44172 -39434 1222 13444 -14817 -2895 31325 37949 -1313 -30749 -36619
21870 -36619 -29231 -30711 -28064 -39908 -4626 20601 8535 16697 16231 4201 -22808 -19435 3226
21857 3226 29688 31598 19960 38217 15683 7325 -2743 -12094 -18915 283 -1877 -4460 5984
21844 5984 -3930 -12688 -4668 -3226 -26950 -45675 -40508 -16761 -9945 -4261 -6147 5582 735 28287
21830 28287 57697 50734 19779 927 25618 44111 33158 -3761 -18158 -19175 -31799 -36491
$$ packed form
21919C0453j2420J5901k7660j6477J5183P735K922K2342K502L183j3415k4793
21907E456m8760k147M143J1609J1377p034Q613J2324K7161n604m551Q165k450
21894A8302k3216m625k0013j1010l3432K014J3071m679P178J8024L1057j1966
21882a9295k7112K235M738M0656J2222k8261J1922L4220O624l9262k9436n870
21870c6619P388j480K647j1844L5282K5227j2066Q162m66j2030k7009L373K2661
21857C226K6462J910j1638J8257k2534q358j0068r351o821J9198k160k583J0444
21844E984r914q758Q020J442k3724j8725N167K3747O816N684j886J1729m847K7552
21830B8287K9410o963l0955j8852K4691J8493j0953l6919j4397j017j2624m692
$$ plain form
21818 -36491 -16441 3683 -1382 14384 30630 22271 -6334 -7339 -25872 -52973 -31570 9372
21806 9372 -18973 -67329 -80406 -58352 -9844 13425 8927 1802 6944 20016 45842 39887 12959
21793 12959 10296 463 559 -13789 -24950 -32872 2548 613 -10593 -19418 -28986 -26762 -51083 -69421
21779 -69421 -55932 2588 18626 18594 -2007 -6023 4184 3723 -6015 -4467 2983 -1645 -2890 8435
21765 8435 27652 13256 312 15883 -13424 -18038 -31260 -23525 -14553 16009 -10039 -8872 11296
21752 11296 23794 4910 -3885 -7903 -21341 -2761 -3422 -11203 -29795 -22835 -21892 -13151 -30204
21739 -30204 -31232 -11042 1803 11736 9591 -10746 1646 7427 27620 34824 16488 -187 -17309
21726 -17309 -1439 1079 -15854 -22983 286 20978 9232 86 -22622 -38530 -9421 -14513
$$ packed form
21818c6491K0050K0124n065J5766J6246q359k8605j005j8533k7101K1403M0942
21806I372k8345m8356j3077K2054M8508K3269m498p125N142J3072K5826n955k6928
21793A2959k663r833R6j4348j1161p922L5420j935j1206q825r568K224k4321j8338
21779f9421J3489N8520J6038l2k0601m016J0207m61r738J548P450m628j245J1325
21765H435J9217j4396j2944J5571k9307m614j3222P735Q972L0562k6048J167K0168
21752A1296J2498j8884q795m018j3438J8580o61p781j8592O960R43Q741j7053
21739c0204j028K0190J2845R933k145k0337J2392N781K0193P204j8336j6675j7122
21726a7309J5870K518j6933p129K3269K0692j1746r146k2708j5908K9109n092
$$ plain form
21714 -14513 -30778 -66567 -35985 17966 27202 19802 63135 81326 82960 58299 30058 -1567
21702 -1567 -11494 -17824 1974 10585 -2487 -6854 -15394 -37791 -18787 -7846 -16031 -1988 17420
21689 17420 22192 11146 4914 294 -20439 -14331 -15018 -4655 21820 36000 38000 5265 -23462
21676 -23462 -16790 -12722 -9923 16557 14031 -11198 -10439 37729 44642 13191 -18967 -15310 -5641
21663 -5641 -17459 -32534 -49256 -25811 -11817 -40262 -38720 -19173 -7454 26127 26731 -1488
21651 -1488 -34567 -15805 -11459 -31268 -34631 -21499 -7291 489 23373 -72 -12405 -5833 7977
21638 7977 -14110 -17648 -11913 -9510 -54 -10275 -14535 -38364 -68189 -19140 -9411 8802 9425
21625 9425 4641 16816 -8295 14135 18274 -5991 -4574 -10588 11530 9256 -33074 -60368 -54225
$$ packed form
21714a4513j6265l5789L0582N3951R236p400M3333J8191J634k4661k8241l1625
21702a567r927o330J9798Q611j3072m367q540k2397J9004J0941q185J4043J9408
21689A7420M772j1046o232m620k0733O108o87J0363K6475J4180K000l2735k8727
21676b3462O672M068K799K6480k526k5229P59M8168O913l1451l2158L657R669
21663e641j1818j5075j6722K3445J3994k8445J542J9547J1719L3581O04k8219
21651a488l3079J8762M346j9809l363J3132J4208P780K2884k3445j2333O572J3810
21638G977k2087l538N735K403R456j0221m260k3829k9825M9049R729J8213O23
21625I425m784J2175k5111K2430M139k4265J417o014K2118k274m2330k7294O143
$$ plain form
21612 -54225 -24377 -10904 -16188 -18742 5819 27833 26141 19713 1139 33505 23458 12862
21600 12862 2874 3804 -25353 -35508 -14160 -3647 725 4393 -15351 -22789 -43633 -62950 -79862
21587 -79862 -63463 -57082 -50702 -41755 -44530 -30617 -14269 -14845 -33308 -30264 -16523 -20048 -35281
21574 -35281 -31733 -16464 -15341 -2473 4606 12242 14845 23927 54646 38769 3585 -13307 780
21561 780 16962 18593 7990 2969 12082 2039 -8770 -11089 -167 11458 4147 -5864 12441
21548 12441 27384 28756 41185 24459 64872 78954 63129 52917 52220 84860 87944 70068
21536 70068 16283 18799 31072 22091 45833 56398 34477 6591 -15800 -13870 7685 -3721
21524 -3721 18276 32339 35202 54097 25979 5487 -2144 -2226 -17166 -18434 -37388 -43970 -27154
$$ packed form
21612e4225K9848J3473n284k554K4561K2014j692o428j8574L2366j0047j0596
21600A2862r988R30k9157j0155K1348J0513M372L668j9744p438k0844j9317j6912
21587g9862J6399O381O380Q947k775J3913J6348n76j8463L044J3741l525j5233
21574c5281L548J5269J123J2868P079P636K603R082L0719j5877l5184j6892J4087
21561G80J6182J631j0603n021R113j0043j0809k319J0922J1625p311j0011J8305
21548A2441J4943J372J2429j6726M0413J4082j5825j0212o97L2640L084j7876
21536G0068n3785K516J2273q981K3742J0565k1921k7886k2391J930K1555j1406
21524c721K1997J4063K863J8895k8118k0492p631q2j4940j268j8954o582J6816
$$ plain form
21511 -27154 -26089 -24216 -15533 -30244 -12262 18440 9328 9307 -2627 -22100 -3307 39108 22327
21498 22327 -3038 11903 8646 -14698 -15208 -20437 -45647 -22911 -6979 -23291 -2630 834 -3768
21485 -3768 9455 33702 26214 27644 48845 56392 55222 43194 7171 11689 -15184 -39959 -48449
21472 -48449 -18464 15398 4774 -2499 -6306 -4634 -17500 -12878 -10258 -15309 -9654 -13321 -16642
21459 -16642 -7270 -23891 -21091 -13909 -20955 -45668 -47439 -54315 -29768 -999 11768 13080 8331
21446 8331 27894 52160 41379 18216 39990 48337 54348 29329 14099 23566 2318 -16253
21434 -16253 -40978 -24427 -352 24234 38465 21045 -10896 -23801 -4855 4132 16138 33677
21422 33677 30302 19232 23430 22203 13785 -467 23505 12556 -17753 -11867 -30896 -29169 -17662
$$ packed form
21511b7154J065J873Q683j4711J7982L0702r112k1j1934j9473J8793M2415j6781
21498B2327k5365J4941l257k3344n10n229k5210K2736J5932j6312K0661L464m602
21485c768J3223K4247p488J430K1201P547j170j2028l6023M518k6873k4775q490
21472d8449K9985L3862j0624p273l807J672j2866M622K620n051N655l667l321
21459a6642R372j6621K800P182p046k4713j771o876K4547K8769J2767J312m749
21446H331J9563K4266j0781k3163K1774Q347O011k5019j5230R467k1248j8571
21434a6253k4725J6551K4075K4586J4231j7420l1941j2905J8946Q987J2006J7539
21422C3677l375j1070M198j227q418j4252K3972j0949l0309N886j9029J727J1507
$$ plain form
21409 -17662 -25027 -19747 -16239 -21608 -6181 9241 29369 34604 24400 14596 3191 -16847 -28726
21396 -28726 -32634 -1188 15131 14101 15484 3721 -19358 -11078 -3588 10449 -3897 -23422 -43629
21383 -43629 -54248 -34593 -39439 -33861 -34549 -37726 -37763 -36428 -11823 -13967 -24873 -34703 -21796 -14418
21369 -14418 -2353 4245 3390 -20047 -43617 -29831 1589 -22086 -32446 -13012 -13163 -30674 -55979
21356 -55979 -47205 -17999 12339 27486 32485 14439 -12456 -41969 -37201 -15909 -16396 -2737 8156
21343 8156 13559 18845 11201 -21670 -27394 6141 -8267 -3139 -8768 -16729 -7452 24437 10090
21330 10090 -10040 -42512 -43088 -36643 -39668 -17357 13346 12417 20039 -6122 5900 -6459 -17204
21317 -17204 3668 2688 -7030 -30176 1580 8697 -13722 -34107 -44128 -53400 -36863 -43542 -15608
$$ packed form
21409a7662p365N280L508n369J5427J5422K0128N235j0204r804j1405k0038j1879
21396b8726l908L1446J6319j030J383j1763k3079Q280P490J4037j4346j9525k0207
21383d3629j0619J9655m846N578o88l177l7J335K4605k144j0906r830J2907P378
21369a4418J2065O598q55k3437k3570J3786L1420k3675j0360J9434j51j7511k5305
21356e5979Q774K9206L0338J5147M999j8046k6895k9513M768K1292m87J3659J0893
21343H156N403N286p644l2871n724L3535j4408N128n629p961R277L1889j4347
21330A0090k0130l2472n76O445l025K2311L0703r29P622k6161J2022j2359j0745
21317a7204K0872r80r718k3146L1756P117k2419k0385j0021r272J6537o679K7934
$$ plain form
21304 -15608 15485 11217 -5274 -19424 -15479 -7144 -25341 -4601 13541 31189 13736 9613
21292 9613 -12210 -24927 -24217 -47999 -28086 -20242 8543 32134 40524 37480 62691 56578 34115
21279 34115 28058 20583 12296 22642 28903 42359 66111 75247 36495 -9815 -28941 -15098 573
21266 573 641 2007 -9574 4442 11213 -4239 -32470 -68579 -61151 -51992 -48881 -23638 19295 33668
21252 33668 58796 62843 46260 48066 33707 11693 -23521 -19957 10101 13799 30342 39395 19111
21239 19111 2416 -18327 -27484 -32385 -43464 -18689 -71 -939 4025 15986 -10924 -34557 -8986
21226 -8986 14813 31353 34557 15715 -10201 4981 1705 -27542 -17794 -1691 -7501 -30128 -33742
21213 -33742 -21176 -9152 26985 36268 56984 47639 28536 7774 14368 6880 -5677 -670 4850
$$ packed form
21304a5608L1093m268j6491j4150L945Q335j8197K0740J8142J7648j7453m123
21292I613k1823j2717P10k3782J9913P844K8785K3591Q390l044K5211o113k2463
21279C4115o057p475q287J0346O261J3456K3752R136l8752m6310j9126J3843J5671
21266E73O8J366j1581J4016O771j5452k8231l6109P428R159L111K5243M2933J4373
21252C3668K5128M047j6583J806j4359k2014l5214L564L0058L698J6543R053k0284
21239A9111j6695k0743r157m901j1079K4775J8618q68M964J1961k6910k3633K5571
21226h986K3799J6540L204j8842k5916J5182l276k9247R748J6103n810k2627l614
21213c3742J2566J2024L6137R283K0716r345j9103k0762O594p488j2557N007N520
$$ plain form
21200 4850 17176 17328 -5855 -27998 -24570 -12888 -17220 -5510 -5469 9450 22050 -6672 -23418
21187 -23418 -8882 -27892 -40137 -49344 -43481 -30179 -28005 -14495 2652 38614 19983 16638
21175 16638 30065 20570 -13877 -23493 3914 37545 20285 11628 -7909 -16804 -492 -13434
21163 -13434 -32847 -42357 -30701 -23151 -2130 -22937 -34881 -32732 -20018 -45292 -25925 6539
21151 6539 20225 38086 27643 -15314 -14265 -26336 -42672 -42094 -50554 -52957 -18503 -14751 6980
21138 6980 5828 -3761 -40526 -52173 -19095 -19546 -21690 -17597 -15153 -20446 -35345 -51421 -28385
21125 -28385 81 -7309 -24006 -12778 2964 29835 16369 14019 677 931 -9141 -7745 4517
21112 4517 14504 -5445 -16360 743 -2779 3787 14003 19938 35353 19775 4662 39979 29424
$$ packed form
21200D850J2326J52k3183k2143L428J1682m332J1710M1J4919J2600k8722j6746
21187b3418J4536j9010j2245r207N863J3302K174J3510J7147L5962j8631l345
21175A6638J3427r495l4447r616K7407L3631j7260q657j9537q895J6312j2942
21163a3434j9413r510J1656P550K1021k0807j1944K149J2714k5274J9367L2464
21151F539J3686J7861j0443m2957J049j2071j6336N78q460k403L4454L752K1731
21138F980j152r589l6765j1647L3078m51k144M093K444n293j4899j6076K3036
21125b8385K8466p390j6697J1228J5742K6871j3466k350j3342K54j0072J396J2262
21112D517R987j9949j0915J7103l522O566J0216N935J5415j5578j5113L5317j0555
$$ plain form
21099 29424 -5980 -12911 6701 23697 21875 10455 6432 5213 -12793 -17502 -4156 15415 8633
21086 8633 -13948 -27099 -26792 16725 65521 72837 45954 24804 10762 12718 12754 16241 30417
21073 30417 -4595 -10534 6175 19202 38448 12362 -32748 -23964 -10715 9472 24889 12081
21061 12081 35876 14900 -5911 -1866 443 -30491 -28398 -19866 -21482 -8798 -2936 28136 14095
21048 14095 -14444 -3111 -13978 -20878 -1338 -18540 -29495 -16654 -7994 -20107 -15869 1856
21036 1856 20054 7183 7062 38868 53153 17325 -9281 1909 -472 -23619 -34038 -11395
21024 -11395 -36867 -30949 -9385 -5703 -1198 9545 10523 20173 -21241 -25839 -7177 -14559 -33089
21011 -33089 -80415 -90883 -76130 -80269 -49334 3359 26153 18962 9459 16988 10764 1317 2004
$$ packed form
21099B9424l5404o931J9612J6996j822j1420m023j219j8006m709J3346J9571o782
21086H633k2581j3151L07M3517M8796P316k6883k1150j4042J956L6L487J4176
21073C0417l5012n939J6709J3027J9246k6086m5110Q784J3249K0187J5417j2808
21061A2081K3795k0976k0811M045K309l0934K093Q532j616J2684N862L1072j4041
21048A4095k8539J1333j0867o900J9540j7202j0955J2841Q660j2113M238J7725
21036A856J8198j2871j21L1806J4285l5828k6606J1190k381k3147j0419K2643
21024a1395k5472N918K1564L682M505J0743R78R650m1414m598J8662p382j8530
21011c3089m7326j0468J4753m139L0935N2693K2794p191r503P529o224r447O87
$$ plain form
20998 2004 14380 46614 36637 16728 -7570 -42505 -40684 -41148 -47543 -15693 -18572 -32049 -22415
20985 -22415 12681 11840 -716 -16160 -25950 -18375 7987 5792 -12847 -26520 -27170 -23791 -6441
20972 -6441 -18361 -9858 3310 -6648 3544 15360 39694 64311 60567 11493 -11876 15007
20960 15007 18933 556 11353 -5897 -24482 -38194 -43704 -6790 1460 20899 48033 17008
20948 17008 -9397 -7546 -51895 -70376 -43448 -35801 -40370 -43461 -31869 -29608 -26983 -21416 -11604
20935 -11604 30221 27664 30443 12240 14775 9092 -26612 -46869 -31693 -40104 -44387 -21050 -20725
20922 -20725 -954 27524 -3491 -25425 -10674 23199 1986 -15811 -9066 13826 33915 44965
20910 44965 56944 60003 68825 36429 834 266 7853 7112 38392 33827 9308 25806 27145
$$ packed form
20998B004J2376L2234r977j9909k4298l4935J821m64o395L1850k879j3477R634
20985b2415L5096q41j2556j5444r790P575K6362k195j8639j3673o50L379J7350
20972f441j1920Q503J3168r958J0192J1816K4334K4617l744m9074k3369K6883
20960A5007L926j8377J0797j7250j8585j3712n510L6914Q250J9439K7134l1025
20948A7008k6405J851m4349j8481K6928P647m569l091J1592K261K625N567R812
20935a1604M1825k557K779j8203K535n683l5704k0257J5176q411m283K3337L25
20922b0725J9771K8478l1015k1934J4751L3873k1213j7797O745K2892K0089J1050
20910D4965J1979L059Q822l2396l5595n68P587p41L1280m565k4519J6498J339
$$ plain form
20897 27145 21849 13124 15649 16670 -2929 -2077 -2858 -7487 8190 24465 35104 28487 20189 -11099
20883 -11099 -20764 -23088 -28280 -47857 -38668 -53422 -48521 -40020 -14020 13117 26619 36239 14765
20870 14765 19811 7350 -20342 -46429 -31499 -23904 -24344 -39335 -44606 -21485 2690 -816 1625
20857 1625 4146 2987 15355 21588 54443 19766 -8163 -17576 -33635 -60574 -82236 -72266 -27158
20844 -27158 1159 -12435 -18258 3642 -4212 6050 4277 -5259 -14579 -18562 -29696 -44735 -42446
20831 -42446 -47567 -72829 -75151 -60561 -58079 -40113 -58628 -77486 -74617 -65119 -71389 -52848 -5037
20818 -5037 13514 751 2064 19246 -6482 -28234 2690 43680 52214 26995 14091 4110
20806 4110 -19268 -38592 -5606 2915 -8779 -25600 -47658 -15297 19515 -14084 -35831 -39558
$$ packed form
20897B7145n296q725K525J021j9599Q52p81m629J5677J6275J0639o617q298l1288
20883a1099r665k324n192j9577R189j4754M901Q501K6000K7137J3502R620k1474
20870A4765N046j2461k7692k6087J4930P595m40j4991n271K3121K4175l506K441
20857A625K521j159J2368O233L2855l4677k7929r413j6059k6939k1662R970M5108
20844b7158K8317j3594n823K1900p854J0262j773r536r320l983j1134j5039K289
20831d2446n121k5262k322J4590K482J7966j8515j8858K869R498o270J8541M7811
20818e037J8551j2763J313J7182k5728k1752L0924M0990Q534k5219j2904r981
20806D110k3378j9324L2986Q521j1694j6821k2058L2361L4812l3599k1747l727
$$ plain form
20794 -39558 -50020 16630 32000 39647 37896 5823 36 4890 -3224 13555 856 -24274 -7556
20781 -7556 25209 32394 19190 -2105 19246 38282 25134 7382 -5657 -26014 -24526 -14198
20769 -14198 -41835 -68917 -62106 -18785 -4497 -32189 -54001 -38884 -3610 12067 19704 50638
20757 50638 61028 55438 38361 40314 25015 -12080 -29855 -23394 1854 -18307 -41197 -37434
20745 -37434 -9315 5090 21019 30773 15584 26417 51293 33540 10895 -4295 4461 27710
20733 27710 27891 15331 17997 36741 13635 -891 -12625 -7577 26510 34830 30564 27431 10628
20720 10628 -1652 5512 20201 55278 43974 3209 25890 28838 19782 12182 -18472 -17342 9685
20707 9685 1503 -19426 -19434 -16021 -39126 -66126 -27445 -34316 -42981 -51768 -59230 -50424 -27665 -26878
$$ packed form
20794c9558j0462O6650J5370P647j751l2073n787M854q114J6779j2699k5130J6718
20781g556L2765P185j3204k1295K1351J9036j3148j7752j3039k0357J488J0328
20769a4198k7637k7082O811M3321J4288k7692k1812J5117L5274J5677P637L0934
20757E0638J0390n590j7077J953j5299l7095j7775O461K5248k0161k2890L763
20745c7434K8119J4405J5929R754j5189J0833K4876j7753k2645j5190Q756K3249
20733B7710J81j2560K666J8744k3106j4526j1734N048L4087Q320m266l133j6803
20720A0628j2280P164J4689L5077j1304m0765K2681K948r056p600l0654J130K7027
20707I685q182k0929qL413k3105k7000L8681o871q665q787p462Q806K2759P87
$$ plain form
20693 -26878 -28819 -34749 -50636 -18873 -13278 -5659 10031 18550 28450 6966 -27098 -24125 -358
20680 -358 -15521 -31091 -34948 -25704 -11698 -33281 -29059 -12356 -3152 -18652 -54258 -59345 -52710
20667 -52710 -43869 -355 17150 17682 -8473 -38076 -38735 -26402 -8611 28499 33733 1211 -22233
20654 -22233 -34167 -26901 -10977 1417 27669 54752 58110 17821 7261 -3613 2015 4702
20642 4702 12512 41888 43226 31683 8239 -10047 -11862 10322 5366 -7193 -26318 -14540 -259
20629 -259 -245 12932 5638 -13490 7025 1666 -3596 13704 22904 24468 24432 -3593 -25800 -33426
20615 -33426 -40571 -21951 18482 30927 11327 -7025 26930 38674 12569 -36029 -38950 -20056
20603 -20056 -33633 -26102 -8682 2301 8176 12249 25978 35105 56292 49005 28006 1167 17937
$$ packed form
20693b6878j941n930j5887L1763N595P619J5690Q519R900k1484l4064K973K3767
20680c58j5163j5570l857R244J4006k1583M222J6703R204j5500l5606n087O635
20667e2710Q841M3514J7505N32k6155k9603o59J2333J7791L7110N234l2522k3444
20654b2233j1934P266J5924J2394K6252K7083L358m0289j0560j0874N628K687
20642D702P810K9376J338j1543k3444j8286j815K2184m956j2559j9125J1778J4281
20629b59J4J3177p294j9128K0515n359n262J7300R200J564l6k8025k2207p626
20615c3426p145J8620M0433J2445j9600j8352L3955J1744k6105m8598k921J8894
20603b0056j3577P531J7420J0983N875M073J3729R127K1187p287k0999k6839J6770
$$ plain form
20590 17937 25152 4404 9518 1073 -1793 -5982 7004 44830 39102 45661 24120 -18566 -46088
20577 -46088 -52499 -34821 -18788 -2417 5630 -3104 3925 13037 3243 -13069 -17511 21412 52522
20564 52522 38970 27974 16561 -18396 -34050 -31055 -17194 -303 -1273 4829 9739 -13287 -2766
20551 -2766 21403 17012 -1729 -11772 -29530 -6255 15634 1394 -7810 11352 24767 33236
20539 33236 45672 40327 38892 49890 23429 22444 7761 4244 30305 37720 14737 15491 13233
20526 13233 15055 13410 10194 31217 36001 46710 37269 20877 22934 24064 10095 15504 -1071
20513 -1071 12194 6834 -9337 -7037 4305 19235 35378 40530 25115 7451 -1481 -32185 -25620
20500 -25620 -1932 16344 55895 29555 -2027 -18644 -23915 -32351 -31385 -22765 -10240 8028 25165
$$ packed form
20590A7937P215k0748N114q445k866m189J2986L7826n728O559k1541m2686k7522
20577d6088o411J7678J6033J6371Q047q734P029R112r794j6312m442L8923L1110
20564E2522j3552j0996j1413l4957j5654K995J3861J6891r70O102M910k3026J0521
20551b766K4169m391j8741j0043j7758K3275K1889j4240r204J9162J3415Q469
20539C3236J2436n345j435J0998k6461r85j4683l517K6061P415k2983P54k258
20526A3233J822j645l216K1023M784J0709r441j6392K057J130j3969N409j6575
20513a071J3265n360j6171K300J1342J4930J6143N152j5415j7664q932l0704O565
20500b5620K3688J8276L9551k6340l1582j6617n271q436R66Q620J2525J8268J7137
$$ plain form
20487 25165 63313 45473 35176 15760 -980 7515 853 -797 8443 -9214 -3807 5034 25638
20474 25638 24860 -1514 -41204 -50587 -8175 -3584 -2058 20141 37859 35974 37082 15284 32048
20461 32048 28953 -10162 -34913 -35539 -13503 7736 13966 9656 19023 9714 10251 11570 -2335 -25171
20447 -25171 -53816 -33079 -19926 4296 -10005 -18410 -24735 -41343 -22349 -9464 -15350 2175
20435 2175 -2943 -18133 -9969 -24197 -42447 -18968 -31779 -24037 -10541 3818 22365 29839 36750
20422 36750 28465 14905 -10391 -8209 -13763 10916 1098 -36437 -44058 -28319 15718 15247 -17198
20409 -17198 -17084 -7188 9149 19931 7390 -13911 -11029 24253 52509 40214 30619 8231 -196
20396 -196 9405 28834 58129 48077 -9144 -17704 -18399 -13534 -3797 -3490 -8402 -10406 -21425 -39546
$$ packed form
20487B5165L8148j7840j0297j9416j6740Q495o662j650R240j7657N407Q841K0604
20474B5638p78k6374l9690r383M2412M591J526K2199J7718j885J108k1798J6764
20461C2048l095l9115k4751o26K2036K1239O230m310R367r309N37J319j3905k2836
20447b5171k8645K0737J3153K4222j4301q405o325j6608J8994J2885n886J7525
20435B175n118j5190Q164j4228j8250K3479j2811P742J3496J4359J8547P474O911
20422C6750q285j3560k5296K182n554K4679r818l7535p621J5739M4037m71l2445
20409a7198J14R896J6337J0782j2541k1301K882L5282K8256j2295r595k2388q427
20396a96R601J9429K9295j0052n7221q560o95M865R737L07m912k004j1019j8121
$$ plain form
20382 -39546 -4751 6143 -5087 -22551 -30182 -34430 -15904 -3315 -5391 22493 34308 17900
20370 17900 18619 3871 -4881 -22043 5331 6988 17264 36380 26569 45680 30503 23346 44064
20357 44064 59251 23166 -28553 -42361 -13737 3995 657 2458 45 30211 47293 37320
20345 37320 32204 21578 11682 19383 23324 32697 42586 25888 12164 -7016 -24808 -11460 11549
20332 11549 -2221 7852 -7959 -19370 -4443 712 -17316 -5815 10750 9089 -14899 -11683
20320 -11683 -9719 -35559 -53325 -21581 -14307 -37711 -57961 -51345 -36119 -16041 -7 -20798
20308 -20798 -67629 -64499 -70837 -53752 -4493 11735 -6119 -10422 7563 3172 17910 44079
20296 44079 65673 39463 -2447 -9315 20892 20255 16826 13806 1957 -18615 -35362 -26084 -16223
$$ packed form
20382c9546L4795J0894j1230j7464p631m248J8526J2589k076K7884J1815j6408
20370A7900P19j4748q752j7162K7374J657J0276J9116r811J9111j5177p157K0718
20357D4064J5187l6085n1719j3808K8624J7732l338J801k413L0166J7082r973
20345C7320n116j0626r896P701L941R373R889j6698j3724j9180j7792J3348K3009
20332A1549j3770J0073j5811j1411J4927N155j8028J1501J6565j661k3988L216
20320a1683J964k5840j7766L1744P274k3404k0250O616J5226K0078J6034k0791
20308b0798m6831L130o338J7085M9259J6228j7854m303J7985m391J4738K6169
20296D4079K1594k6210m1910o868L0207o37l429l020j1849k0572j6747R278R861
$$ plain form
20283 -16223 9259 14811 39596 54399 36621 14994 -1572 -14728 -38753 -28659 -18298 -6526
20271 -6526 -6102 -2676 -29578 -44812 -20367 -28123 -32187 2533 31938 45223 49162 64416 60662
20258 60662 37646 26264 13635 27195 21521 271 996 -4408 -18798 -6295 4773 -25366
20246 -25366 -32076 -20045 9881 -24010 -31710 -24541 -9108 -9918 -8157 -1196 5753 25150 7737
20233 7737 -10098 -19038 4608 5065 15764 17079 52087 41926 37043 27620 15211 -27789 -23429
20220 -23429 23705 43300 40716 35892 33716 26376 35341 23365 13337 8208 24129 20547 20261
20207 20261 23548 7820 17999 52382 64066 62976 43818 10316 -14091 -22586 -38266 -59700
20195 -59700 -68125 -39978 -24159 7522 17566 4689 20795 30703 45340 36035 36580 20267 1224
$$ packed form
20283a6223K5482N552K4785J4803j7778k1627j6566j3156k4025J0094J0361J1772
20271f526M24L426k6902j5234K4445p756m064L4720K9405J3285L939J5254l754
20258F0662k3016j1382j2629J3560n674k1250P25n404j4390J2503J1068l0139
20246b5366o710J2031K9926l3891p700P169J5433q10J761O961O949J9397j7413
20233G737j7835q940K3646M57J0699J315L5008j0161m883r423j2409m3000M360
20220b3429M7134J9595k584m824k176p340Q965j1976j0028n129J5921l582k86
20207B0261L287j5728J0179L4383J1684j090j9158l3502k4407q495j5680k1434
20195e9700q425K8147J5819L1681J0044j2877J6106R908J4637r305N45j6313j9043
$$ plain form
20182 1224 -801 26259 68483 114208 115740 83768 51143 65423 45672 15277 7683 11333 23184
20169 23184 17720 15845 30234 -25841 -35247 21169 -1922 -14255 -9242 10674 6550 25054 -3906
20156 -3906 -34319 -14238 21864 41704 27865 20978 22457 -10399 -11629 -14478 -13575 297 1840
20143 1840 -20260 -4992 20488 -15011 2938 8402 43713 52475 38900 36702 46202 63306 48284
20130 48284 32412 64008 79869 67169 43678 22358 29847 43025 51427 52117 45832 46822 13348
20117 13348 8628 23351 30293 26000 19327 -32294 -36034 -5502 9721 2321 5016 -9438 17992
20104 17992 21822 11496 -10453 -21117 -2358 -6707 -38725 -40608 -13419 -8297 -8987 -40221 -32225
20091 -32225 -31044 -30231 -23576 -21272 -39667 -50191 -80108 -76093 -78161 -66537 -21380 -7438 -5238
$$ packed form
20182A224k025K7060M2224M5725J532l1972l2625J4280j9751l0395p594L650J1851
20169B3184n464j875J4389n6075r406N6416k3091j2333N013J9916m124J8504k8960
20156c906l0413K0081L6102J9840j3839o887J479l2856j230k849R03J3872J543
20143A840k2100J5268K5480l5499J7949N464L5311Q762j3575k198R500J7104j5022
20130D8284j5872L1596J5861j2700k3491k1320P489J3178Q402O90o285R90l3474
20117A3348m720J4723O942m293o673n1621l740L0532J5223p400K695j4454K7430
20104A7992L830j0326k1949j0664J8759m349l2018j883K7189N122o90l1234P996
20091c2225J181Q13O655K304j8395j0524k9917M015k068J1624M5157J3942K200
$$ plain form
20078 -5238 -11069 14740 30883 34227 37070 75550 87983 95901 88172 69121 68333 40959 -10870
20065 -10870 -7721 -7002 -26120 1564 28275 34719 13387 -6301 4457 18096 27124 14535 12594
20052 12594 11636 28643 23695 -20835 -16241 7561 15988 18752 -1068 -7498 1369 -12482 2112
20039 2112 31990 39144 34056 70720 98189 101328 63260 30873 8190 16319 23731 38614 18337
20026 18337 27847 68975 68522 63571 26661 12777 14868 31842 9074 -12399 -34668 -22505 4255
20013 4255 3013 6135 -2273 6754 -423 -36002 -40517 -28588 -10496 -15530 -41540 -48338 -31628
20000 -31628 -20718 -2972 -1364 20835 38207 -2775 -10751 8191 18124 35451 45485 42016
19988 42016 15272 10889 38844 33843 4760 14892 35846 26790 30498 31675 43960 43531 55813
$$ packed form
20078e238n831K5809J6143L344K843L8480J2433P918p729j9051p88k7374n1829
20065a0870L149P19j9118K7684K6711O444k1332j9688J0758J3639R028j2589j941
20052A2594r58J7007m948m4530M594K3802Q427K764j9820o430Q867j3851J4594
20039B112K9878P154n088L6664K7469L139l8068l2387k2683Q129P412J4883k0277
20026A8337R510M1128m53m951l6910j3884K091J6974k2768k1473k2269J2163K6760
20013D255j242L122q408R027p177l5579m515J1929J8092n034k6010o798J6710
20000c1628J0910J7746J608K2199J7372m0982p976J8942R933J7327J0034l469
19988D2016k6744m383K7955n001k9083J0132K0954r056L708J177J2285m29J2282
$$ plain form
19975 55813 44121 36020 26600 617 -6651 4537 37767 28673 -7783 -13693 -14163 -9734 5428
19962 5428 38350 50446 42284 35391 62449 51376 12843 1995 15320 21843 -238 -16850
19950 -16850 -6400 -30661 -59291 -44626 -24840 -15126 -188 11950 35161 53891 17043 -20585
19938 -20585 -27739 -10463 7866 7157 3226 -4188 -4642 14124 -5701 -26359 -13314 18116 10462
19925 10462 38931 39686 24475 9647 36875 47077 31572 -498 10765 38669 47603 40712
19913 40712 57752 62946 72549 68350 72172 67731 70539 63466 59746 64099 65478 39627 1797 4734
19899 4734 20445 16302 6367 7647 11902 7009 -11066 1481 135 -12181 -14950 -12522 6725
19886 6725 1544 -10019 -29464 -25349 8772 38878 50386 28713 22653 19046 21049 34775 46366
$$ packed form
19975E5813j1692q101r420k5983p268J1188L3230r094l6456n910m70M429J5162
19962E428L2922J2096q162o893K7058j1073l8533j0848J3325O523k2081j6612
19950a6850J0450k4261k8630J4665J9786R714J4938J2138K3211J8730l6848l7628
19938b0585p154J7276J8329p09l931p414m54J8766j9825k0658J3045L1430p654
19925A0462K8469P55j5211j4828K7228J0202j5505l2070J1263K7904Q934o891
19913D0712J7040N194R603m199L822m441K808p073l720M353J379k5851l7830K937
19899D734J5711m143r935J280M255m893j8075J2547j346j2316k769K428J9247
19886F725n181j1563j9445M115L4121L0106J1508k1673o060l607K003J3726J1591
$$ plain form
19873 46366 75099 96013 79784 67167 55672 15884 17170 33285 30604 31581 -7002 -20713
19861 -20713 -34545 -28921 -51194 -30342 -2685 1361 -10213 -33649 -3797 2263 10835 7612 5796
19848 5796 15416 22488 -4195 -13324 -7449 1808 -7384 -13454 -28547 -50976 -20005 -11516 -13879 -9777
19834 -9777 2763 -11414 -2048 21230 38354 27413 28814 46726 27449 10899 20636 4804
19822 4804 -8554 -6738 11321 8839 3723 13427 31266 36183 17294 -5336 -13840 1814 24038
19809 24038 24333 18883 11192 19439 26754 38806 23209 30141 39465 25982 41741 51318 37461
19796 37461 18405 12196 25938 56018 76884 45967 10096 7075 18180 30947 31461 28781 31695
19783 31695 -2583 -23551 -280 16213 20210 -7837 -16602 14495 26199 -17899 -14217 -6341
$$ packed form
19873D6366K8733K0914j6229j2617j1495l9788J286J6115k681R77l8583j3711
19861b0713j3832N624k2273K0852K7657M046j1574k3436K9852O060Q572l223j816
19848E796R620P072k6683r129N875R257r192o070j5093k2429L0971Q489k363M102
19834i777J2540j4177R366K3278J7124j0941J401J7912j9277j6550R737j5832
19822D804j3358J816J8059k482n116R704J7839M917j8889k2630q504J5654K2224
19809B4038K95n450p691Q247P315J2052j5597O932R324j3483J5759R577j3857
19796C7461j9056o209J3742L0080K0866l0917l5871l021J1105J2767N14k680K914
19783C1695l4278k0968K3271J6493L997k8047q765L1097J1704m4098L682P876
$$ plain form
19771 -6341 5348 28297 12344 -15189 -30262 18557 28825 33779 55017 49978 24014 13249
19759 13249 30888 52354 20158 16967 27802 32833 56753 23288 24798 36560 34801 55995
19747 55995 19575 -3989 -10338 -1953 -9386 -17162 14471 50315 49774 9024 -1744 27339 58571
19734 58571 48894 3656 -14513 -4385 10907 -15924 -43000 -34901 -23107 -10209 5841 21338
19722 21338 27874 20527 15322 14021 -11314 18668 43994 35294 35243 62993 68144 34723 30996 32584
19708 32584 39663 53697 54430 42685 31330 30413 23563 36346 67860 89205 85490 75309 43903
19695 43903 39197 45620 46476 21145 -780 -5192 11861 2320 -14561 -18005 -31150 -41120 -30964
19682 -30964 -7874 6094 20826 10395 -9795 -11566 9570 26235 1281 6253 -25992 -13241
$$ packed form
19771f341J1689K2949j5953k7533j5073M8819J0268M954K1238n039k5964j0765
19759A3249J7639K1466l2196l191J0835N031K3920l3465J510J1762j759K1194
19747E5995l6420k3564o349Q385p433p776L1633L5844n41m0750j0768K9083L1232
19734E8571r677m5238j8169J0128J5292k6831k7076Q099J1794J2898J6050J5497
19722B1338O536p347n205j301k5335K9982K5326q700n1K7750N151l3421l727J588
19708C2584P079J4034P33j1745j1355r17o850J2783L1514K1345l715j0181l1406
19695D3903m706O423Q56k5331k1925m412J7053r541j6881l444j3145r970J0156
19682c0964K3090J3968J4732j0431k0190j771K1136J6665k4954M972l2245J2751
$$ plain form
19670 -13241 10161 24486 36451 36905 43218 69310 67135 41778 53747 13881 9037 -4221 15430
19657 15430 10394 -10548 5802 60104 66215 59469 53612 41297 35531 42394 28005 2665 35348
19644 35348 31069 29690 38499 37428 32109 7618 -38598 -43153 -7506 20730 38689 27640 30995
19631 30995 35788 26362 14624 35567 60863 54594 27466 19693 19576 24308 41656 51080 38832
19618 38832 46181 54595 67738 51521 33483 37931 48636 53946 53622 85220 116675 107600 68708
19605 68708 32112 9372 9992 11636 7646 9648 25542 35821 39474 18055 -6026 -2110 2155
19592 2155 10143 10849 12738 34429 32386 19968 44282 59342 39965 11754 21855 67696 47610
19579 47610 30140 24752 45409 49108 33503 46445 72998 70328 40081 43377 39503 32845 39306
$$ packed form
19670a3241K3402J4325J1965M54O313K6092k175k5357J1969l9866m844j3258J9651
19657A5430n036k0942J6350N4302O111o746n857j2315n766O863j4389k5340L2683
19644C5348m279j379Q809j071n319k4491m6216m555L5647K8236J7959j1049L355
19631C0995M793r426j1738K0943K5296o269k7128p773j17M732J7348R424j2248
19618C8832P349Q414J3143j6217j8038M448J0705N310l24L1598L1455r075l8892
19605F8708l6596k2740O20J644l990K002J5894J0279L653k1419k4081L916M265
19592B155P988P06J889K1691k043j2418K4314J5060j9377k8211J0101M5841k0086
19579D7610j7470n388K0657L699j5605J2942K6553k670l0247L296l874o658O461
$$ plain form
19566 39306 37545 33401 43817 53254 43271 9977 -11081 -9970 18085 14912 8823 -1655 18582
19553 18582 34605 40194 37868 21380 3261 8711 29624 29369 29095 51004 39003 20302 45510
19540 45510 57986 14318 -1659 26178 47342 50516 51041 26671 -5263 22866 15354 -20176
19528 -20176 -946 2426 27861 27074 -6 287 12019 47979 46051 57497 32393 17166 -11371
19515 -11371 -13114 -1108 36496 63117 92199 88338 58118 36745 23052 9385 15697 19294
19503 19294 -13991 -21276 -21765 -22250 9053 31182 47297 22574 12791 24001 27490 29535 23469
19490 23469 27943 55950 65054 41914 29192 34524 60543 57933 55224 68330 67811 65193 57503
19477 57503 30675 27093 49372 57579 42030 62755 96099 81972 69672 51196 60002 22506
$$ packed form
19566C9306j761m144J0416R437r983l3294k1058J111K8055l173o089j0478K0237
19553A8582J6023N589k326j6488j8119N450K0913k55k74K1909j2001j8701K5208
19540D5510J2476m3668j5977K7837K1164L174N25k4370l1934K8129p512l5530
19528b0176J9230L372K5435p87k7080K93J1732L5960j928J1446k5104j5227k8537
19515a1371j743J2006L7604K6621K9082l861l0220k1373j3693j3667O312L597
19503A9294l3285p285m89m85L1303K2129J6115k4723r783J1210L489K045o066
19490B3469M474K8007R104k3140j2722N332K6019k610k709J3106n19k618p690
19477E7503k6828l582K2279Q207j5549K0725L3344j4127j2300j8476Q806l7496
$$ plain form
19465 22506 33753 52477 42189 46109 40038 -724 -15903 -4088 -196 16589 15630 2519 -19244
19452 -19244 -13784 -12416 2103 15138 8532 22593 36362 42782 1301 3024 32033 49462 20688
19439 20688 18142 18645 40898 69001 73294 54657 29994 9027 -11343 -14792 8378 24337 28186
19426 28186 27838 39185 59817 96124 78919 56067 43564 45013 53129 62969 29701 10889 33774
19413 33774 29999 34529 34842 33546 23719 8648 -1537 -20251 -30830 -12125 46250 75793 55773
19400 55773 53695 31324 28299 43016 44401 38002 17102 5199 31653 40109 46540 43231 36395
19387 36395 21361 9324 -12102 -12387 11347 59221 93093 57365 561 14134 2452 -22179
19375 -22179 -25040 569 20990 5516 -11123 -10655 4548 5085 22345 36377 47818 52976 55673
$$ packed form
19465B2506J1247J8724j0288L920o071m0762j5179J1815L892J6785r59j3111k1763
19452a9244N460J368J4519J3035o606J4061J3769O420m1481J723K9009J7429k8774
19439B0688k546N03K2253K8103M293j8637k4663k0967k0370l449K3170J5959L849
19426B8186l48J1347K0632L6307j7205k2852j2503J449Q116R840l3268j8812K2885
19413C3774l775M530L13j296r827j5071j0185j8714j0579J8705N8375K9543k0020
19400E5773k078k2371l025J4717J385o399k0900j1903K6454Q456O431l309o836
19387C6395j5034j2037k1426k85K3734M7874L3872l5728n6804J3573j1682k4631
19375b2179k861K5609K0421j5474j6639M68J5203N37J7260J4032J1441N158K697
$$ plain form
19362 55673 30514 45507 91338 90315 69234 55829 49312 32517 27943 25059 17651 -5631 -12161
19349 -12161 -9092 3059 28790 28198 -2909 -15665 -16364 -11108 -1583 33372 29295 13850 33933
19336 33933 30716 39398 40287 21172 -1277 -12939 4493 6799 13101 7464 3017 35715 50914
19323 50914 24146 -6033 -6539 25997 57893 45514 44395 34480 13625 -10254 12927 13743 33801
19310 33801 53475 28251 28174 35474 27613 37717 33506 21722 30141 33857 8622 -1244 21939
19297 21939 63300 84841 73971 41277 -1828 1978 -5278 12878 24181 5201 11213 26762
19285 26762 28658 37432 21971 25805 22611 27082 15255 8390 22983 48404 36714 43836 59520
19272 59520 60973 28657 17245 23108 24629 11737 -15214 -6009 -301 11536 55797 55111 51332
$$ packed form
19362E5673k5159J4993M5831j023k1081j3405o517j6795m574k884p408k3282o530
19349a2161L069J2151K5731n92l1107j2756o99N256R525L4955m077j5445K0083
19336C3933l217Q682Q89j9115k2449j1662J7432K306O302n637m447L2698J5199
19323E0914k6768l0179n06L2536L1896j2379j119r915k0855k3879K3181Q16K0058
19310C3801J9674k5224p7P300p861J0104m211j1784Q419L716k5235r866K3183
19297B1939M1361K1541j0870l2694m3105L806p256J8156J1303j8980O012J5549
19285B6762J896Q774j5461L834l194M471j1827o865J4593K5421j1690P122J5684
19272E9520J453l2316j1412N863J521j2892k6951R205N708J1837M4261o86l779
$$ plain form
19259 51332 43582 28556 53202 79217 60773 36373 29802 21286 47682 76653 40983 21173
19247 21173 2768 -291 -5153 -17430 -8418 22350 22006 42770 63240 67816 35069 19729 31540
19234 31540 43660 43548 64632 50803 42223 41999 48735 84458 54680 28234 23523 9568 5335
19221 5335 19957 33277 31129 31856 32068 50691 56181 45440 36611 30156 18172 22491 42372 20168
19207 20168 -6921 43961 39633 39434 66570 84821 67671 80441 88475 76428 54293 29785
19195 29785 33080 42638 83427 80419 19577 3284 3619 11773 6712 16559 4636 5522 4963 16222
19181 16222 35324 63417 33127 34262 47970 39491 6955 -10101 -27525 -47493 -887 28817
19169 28817 26090 11687 59850 84712 48842 43012 65873 56597 32413 33768 58434 80366
$$ packed form
19259E1332p750j5026K4646K6015j8444k4400o571q516K6396K8971l5670j9810
19247B1173j8405l059m862j2277R012L0768l44K0764K0470M576l2747j5340J1811
19234C1540J2120j12K1084j3829q580k24O736L5723k9778k6446m711j3955m233
19221E335J4622J3320k148P27K12J8623N490j0741q829o455j1984M319J9881k2204
19207B0168k7089N0882m328j99K7136J8251j7150J2770Q034j2047k2135k4508
19195B9785L295R558M0789l008o0842j6293L35Q154n061R847j1923Q86n59J1259
19181A6222J9102K8093l0290J135J3708q479l2536j7056j7424j9968M6606K9704
19169B8817k727j4403M8163K4862l5870n830K2861r276k4184J355K4666K1932
$$ plain form
19157 80366 86595 45079 34140 51298 38846 11279 -2265 5856 8902 7359 26957 57410
19145 57410 60891 64738 1508 -24834 -30312 -21374 2444 3172 -2503 8048 27 12757 19763
19132 19763 33441 56630 65738 65383 50681 31271 -1691 -3753 4663 13684 1008 23156 53915
19119 53915 74239 67300 50460 53339 76738 77998 32903 22454 19990 40443 56295 69003
19107 69003 35155 32254 47539 58405 74372 74720 33811 22637 40472 62537 86122 75342
19095 75342 63906 17024 3598 26921 24589 34766 36323 73310 92690 119016 86388 63714
19083 63714 56258 66157 47245 50672 44977 18481 2396 -14514 6198 30527 18418 43301
19071 43301 37851 23510 33731 40576 33570 42301 37389 36495 11746 3148 19518 31457 34028
$$ packed form
19157H0366O229m1516j0939J7158j2452k7567j3544Q121L046j543J9598L0453
19145E7410L481L847o3230k6342n478Q938K3818P28n675J0551q021J2730P006
19132A9763J3678K3189R108l55j4702j9410l2962k062Q416R021j2676K2148L0759
19119E3915K0324o939j6840K879K3399J260m5095j0449k464K0453J5852J2708
19107F9003l3848k901J5285J0866J5967L48m0909j1174J7835K2065K3585j0780
19095G5342j1436m6882j3426K3323k332J0177J557L6987J9380K6326l2628k2674
19083F3714p456R899j8912L427n695k6496j6085j6910K0712K4329j2109K4883
19071D3301n450j4341J0221O845p006Q731m912q94k4749q598J6370J1939K571
$$ plain form
19058 34028 22060 -1729 21285 35284 22242 6868 32380 26206 27939 28243 24014 10203 33525
19045 33525 23760 15815 10742 -23823 -34571 -34396 -22099 5434 28264 72747 95204 78078 76341
19032 76341 102367 100564 97637 92779 85457 93101 72219 50190 46180 50333 40009 55923 79297
19019 79297 84593 68134 33725 10755 51879 46721 34213 35154 22626 45809 80955 97714
19007 97714 112777 92235 91056 66683 60312 81542 61195 36756 53465 38053 28977 13150
18995 13150 21223 34009 -348 32132 40271 31352 24500 20138 16751 19666 33443 40622 42226
18982 42226 61033 34178 46104 42048 25326 15014 38358 52349 40848 59221 51207 33494
18970 33494 37859 45282 53474 61321 75012 107946 92142 33249 7668 19553 44223 64868
$$ packed form
19058C4028j1968k3789K3014J3999j3042j5374K5512o174J733L04m229j3811K3322
19045C3525r765p945n073l4565j0748J75J2297K7533K2830M4483K2457j7126j737
19032G6341K6026j803k927m858p322P644k0882k2029m010M153j0324J5914K3374
19019G9297N296j6459l4409k2970M1124n158j2508R41j2528K3183L5146J6759
19007I7714J5063k0542j179k4373o371K1230k0347k4439J6709j5412r076j5827
18995A3150Q073J2786l4357L2480Q139q919o852m362l387K915J3777P179J604
18982D2226J8807k6855J1926m056j6722j0312K3344J3991j1501J8373q014j7713
18970C3494M365P423Q192P847J3691L2934j5804n8893k5581J1885K4670K0645
$$ plain form
18958 64868 78810 78038 63611 58049 63465 58263 57206 64563 56934 32389 26462 47352 65207
18945 65207 60092 72895 68624 66927 87104 72796 46190 47970 61814 75071 49304 46373 34790
18932 34790 38064 36439 43246 61104 74051 66570 47621 26085 22467 48785 48858 41620 37745 67091
18918 67091 82152 80902 59661 58319 78834 70801 55208 53589 62670 59674 52103 43889 35476
18905 35476 16159 28508 41547 62201 63790 41083 46131 67873 58293 68261 88572 80056 43707
18892 43707 41950 43879 59588 51553 39287 45347 63228 56523 40648 31885 40338 33340 38699
18879 38699 19839 10428 -23501 -23169 13699 37846 55811 75957 88445 81720 68656 32955
18867 32955 36339 58184 71954 72306 41200 -3802 3605 32448 34377 43092 51756 51068 32037
$$ packed form
18958F4868J3942p72j4427n562N416n202j057P357p629k4545n927K0890J7855
18945F5207n115J2803m271j697K0177j4308k6606J780J3844J3257k5767k931j1583
18932C4790L274j625O807J7858J2947p481j8949k1536l618K6318P3p238l875K9346
18918F7091J5061j250k1241j342K0515q033j5593j619R081k996p571q214q413
18905C5476j9317J2349J3039K0654J589k2707N048K1742r580R968K0311q516l6349
18892D3707j757J929J5709q035j2266O060J7881o705j5875q763Q453o998N359
18879C8699j8860r411l3929L32L6868K4147J7965K0146J2488o725j3064l5701
18867C2955L384K1845J3770L52l1106m5002P407K8843J929Q715Q664o88j9031
$$ plain form
18854 32037 19296 19080 13679 28377 57150 104723 98038 84125 74293 82251 84731 98745 74659
18841 74659 62768 92564 83554 76777 81154 63235 56135 88173 95519 68092 11224 14232 15498
18828 15498 42158 71757 65618 68237 84553 62480 55130 55865 71644 72172 43235 34427 20181
18815 20181 17107 8948 14843 45878 56934 64705 58505 75341 91869 103312 106658 94223 82834
18802 82834 108085 134456 134853 112388 106855 124979 91129 62563 69403 66142 86957 77876 60594
18789 60594 36841 32760 47916 48957 33635 10638 33619 71220 80791 106628 100211 55189
18777 55189 22193 32337 67452 88802 72580 97179 110125 124125 143447 209706 300030 382155
18765 382155 359323 283322 213945 176262 145368 128764 110220 90970 73835 85386 108140
$$ packed form
18854C2037j2741k16n401J4698K8773M7573o685j3913r832P958K480J4014k4086
18841G4659j1891K9796r010o777M377j7919p100L2038P346k7427n6868L008J266
18828A5498K6660K9599o139K619J6316k2073p350P35J5779N28k8937q808j4246
18815B0181l074q159N895L1035J1056P771o200J6836J6528J1443L346j2435j1389
18802H2834K5251K6371L97k2465n533J8124l3850k8566O840l261K0815r081j7282
18789F0594k3753m081J5156J041j5322k2997K2981L7601R571K5837o417m5022
18777E5189l2996J0144L5115K1350j6222K4599J2946J4000J9322O6259R0324Q2125
18765C82155k2832p6001o9377l7683l0894j6604j8544j9250j7135J1551K2754
$$ plain form
18754 108140 109152 95002 110812 115925 124367 94085 42549 31799 45216 78608 89802 93874
18742 93874 62497 64411 65773 43595 43582 77874 61265 56858 90213 88059 64855 76397 97333
18729 97333 84029 74172 69546 58952 44534 42298 78394 69969 28017 34646 43728 49299 44466
18716 44466 46918 41863 32455 26337 24035 48599 69421 89047 74698 44369 73001 104410 109906
18703 109906 94198 36117 26706 67950 82394 85738 99215 128412 117753 95503 93618 85040
18691 85040 102770 100249 82722 66791 46354 37345 25532 48444 59612 77955 90863 93528
18679 93528 93731 95246 82424 56761 50706 79956 83229 60961 45457 92203 82209 85722 97847
18666 97847 116993 117934 134200 163489 164355 129179 107945 96159 70588 85150 80823 67741 66466
$$ packed form
18754A08140J012j4150J5810N113Q442l0282n1536j0750J3417L3392J1194M072
18742I3874l1377J914J362k2178j3L4292j6609m407L3355k154k3204J1542K0936
18729I7333j3304r857m626j0594j4418k236L6096q425m1952O629R082N571m833
18716D4466K452n055r408o118k302K4564K0822J9626j4349l0329K8632L1409N496
18703A09906j5708n8081r411M1244J4444L344J3477K9197j0659k2250j885q578
18691H5040J7730k521j7527j5931k0437r009j1813K2912J1168J8343J2908K665
18679I3528K03J515j2822k5663o055K9250L273k2268j5504M6746r994L513J2125
18666I7847J9146R41J6266K9289Q66l5176k1234j1786k5571J4562m327j3082j275
$$ plain form
18653 66466 80407 93072 108843 88942 60224 92393 110277 120277 131223 134416 105880 65449
18641 65449 49283 57082 76320 90501 110193 109211 100308 116583 97014 109715 95234 123445
18629 123445 106619 104886 90427 83396 92040 119955 123254 134039 145921 160288 188288 180281
18617 180281 163617 162414 134974 117561 112387 97101 118559 131146 140979 155207 156577 126664
18605 126664 111183 85338 84657 102915 121187 110978 90760 92896 90782 81924 97203 134043
18593 134043 123412 147766 167647 226188 318640 428512 501453 500956 412837 311360 224825
18582 224825 222065 227788 223051 196152 178438 178973 198502 205988 228114 320793 433173 553289
18570 553289 615446 567044 471420 379720 337518 324292 345288 381565 426467 536559 581828
$$ packed form
18653F6466J3941J2665J5771j9901k8718L2169J7884J0000J0946L193k8536m0431
18641F5449j6166P799J9238J4181J9692r82q903J6275j9569J2701j4481K8211
18629A23445j6826j733j4459p031Q644K7915L299J0785J1882J4367K8000q007
18617A80281j6664j203k7440j7413n174j5286K1458J2587R833J4228J370k9913
18605A26664j5481k5845o81J8258J8272j0209k0218K136k114q858J5279L6840
18593A34043j0631K4354J9881N8541R2452J09872P2941m97q8119j01477q6535
18582B24825k760N723m737k6899j7714N35J9529P486K2126R2679J12380J20116
18570E53289O2157m8402r5624r1700m2202j3226K0996L6277M4902J10092M5269
$$ plain form
18559 581828 544519 457170 353251 294960 276409 256168 240956 208933 193935 211520 215677
18548 215677 249466 285105 343868 453628 541681 577134 537965 411366 348887 297912 311477
18537 311477 316982 334773 384802 481885 652093 937914 1204741 1313410 1192636 941842
18527 941842 680449 502843 401061 338588 304773 300089 320376 359622 442186 550122 747281
18516 747281 993815 1260602 1407410 1355399 1119621 862731 640037 470283 425040 456881
18506 456881 527630 622471 682818 686603 598417 492944 413413 372675 344694 319325 330927
18495 330927 376174 412826 482968 588691 752862 964074 1156370 1275476 1223490 1031003
18485 1031003 806708 599669 476804 415266 356605 351736 351163 362135 398094 511994 657750
$$ packed form
18559E81828l7309q7349j03919n8291j8551k0241j5212l2023j4998J7585M157
18548B15677L3789L5639N8763J09760Q8053L5453l9169j26599o2479n0975J3565
18537C11477N505J7791N0029R7083J70208K85821K66827J08669j20774k50794
18527I41842k61393j77606j01782o2473l3815m684K0287L9246Q2564J07936J97159
18516G47281K46534K66787J46808n2011k35778k56890k22694j69754m5243L1841
18506D56881P0749R4841O0347L785q8186j05473p9531m0738k7981k5369J1602
18495C30927M5247L6652P0142J05723J64171K11212J92296J19106n1986j92487
18485A031003k24295k07039j22865o1538n8661m869n73J0972L5959J13900J45756
$$ plain form
18474 657750 806818 920600 898389 795082 657986 512113 411280 376030 318602 282999
18464 282999 294924 323485 286469 254344 229706 205096 161324 160640 178942 160252 166266 169307
18452 169307 211656 200808 162267 138510 167677 200037 201011 206471 192257 194000 245688 246915
18440 246915 242868 232822 204888 192957 182450 180231 188253 201699 201512 214650 223696 214381 221910
18427 221910 257310 301658 322258 305840 296314 330486 359506 407087 505409 596131 580069 499982
18415 499982 400826 387287 401559 449966 496857 546391 506509 434605 355948 295830 250284
18404 250284 224542 215031 201280 192372 176711 219182 231577 205498 213752 202335 202603 202842 190964
18391 190964 172582 170899 187436 199476 194472 183209 185006 232965 240447 227512 255448 293745
$$ packed form
18474F57750J49068J13782k2211j03307j37096j45873j00833l5250n7428l5603
18464B82999J1925K8561l7016l2125k4638k4610m3772o84J8302j8690O014L041
18452A69307M2349j0848l8541k3757K9167L2360R74N460j4214J743N1688J227
18440B46915m047j0046k7934j1931j0507k219Q022J3446j87J3138R046r315P529
18427B21910L5400M4348K0600j6418r526L4172K9020M7581R8322R0722j6062q0087
18415D99982r9156j3539J4272M8407M6891M9534l9882p1904p8657o0118m5546
18404B50284k5742r511j3751q908j5661M2471J2395k6079Q254j1417K68K39j1878
18391A90964j8382j683J6537J2040n004j1263J797M7959P482j2935K7936L8297
$$ plain form
18379 293745 329153 285605 241607 237624 232091 224106 254983 280255 304453 389410 499716 606347
18367 606347 623968 621229 564047 540773 599339 749636 1004542 1216925 1256314 1117989 978133
18356 978133 868070 757102 645095 586518 552801 502975 428389 373967 337937 335893 333143
18345 333143 318121 278101 260723 251045 268065 278827 274843 280997 265764 283161 279432 262600
18333 262600 297784 352553 376934 383997 378131 350246 326776 310053 309685 313713 347002 373112
18321 373112 349507 355108 353715 329907 298463 285965 316208 339451 354022 365082 375548 420058
18309 420058 504328 644429 790524 836218 858930 848640 911678 963950 880566 730999 626923
18298 626923 593131 592220 565028 504656 444579 452294 429042 387148 359827 371764 382904 382105
$$ packed form
18379B93745L5408m3548m3998l983n533p985L0877K5272K4198Q4957J10306J06631
18367F06347J7621k739n7182k3274N8566J50297K54906K12383L9389j38325j39856
18356I78133j10063j10968j12007n8577l3717m9826p4586n4422l6030k044k750
18345C33143j5022m0020j7378r678J7020J0762l984O154j5233J7397l729j6832
18333B62600L5184N4769K4381P063n866k7885k3470j6723l68M028L3289K6110
18321C73112k3605N601j393k3808l1444j2498L0243K3243J4571J1060J0466M4510
18309D20058Q4270J40101J46095M5694K2712j0290O3038N2272q3384j49567j04076
18298F26923l3792r11k7192o0372o0077P715k3252m1894k7321J1937J1140p99
$$ plain form
18286 382105 384418 383259 401895 433097 469296 496822 481491 428423 392151 365798 350874 347805
18274 347805 413288 485988 561394 604434 636960 686233 799961 1029535 1399836 1709170 1849529
18263 1849529 1891174 1780429 1511007 1153414 864789 689815 572080 494904 462393 430541
18253 430541 390932 368505 400509 442839 480112 480887 476726 475961 455963 471848 566479 624347
18241 624347 664175 680239 679748 684531 675073 627487 559159 530162 563928 612095 696161 812144
18229 812144 954934 1014000 983512 903217 792991 692579 631934 604816 622964 627390 628359
18218 628359 652207 716077 860893 1028219 1166430 1452327 1945065 2479290 2741294 2868776
18208 2868776 2764707 2420647 1883662 1377210 1099923 972509 910135 832248 730205 686618
$$ packed form
18286C82105K313j159J8636L1202L6199K7526j5331n3068l6272k6353j4924l069
18274C47805O5483P2700P5406M3040L2526M9273J13728K29574L70301L09334J40359
18263A849529M1645j10745k69422l57593k88625j74974j17735p7176l2511l1852
18253D30541l9609k2427L2004M2330L7273P75m161p65j9998J5885R4631N7868
18241F24347L9828J6064m91M783r458m7586o8328k8997L3766M8167Q4066J15983
18229H12144J42790N9066l0488q0295j10226j00412o0645k7118J8148M426R69
18218F28359K3848O3870J44816J67326J38211K85897M92738N34225K62004J27482
18208B868776j04069l44060n36985n06452k77287j27414o2374p7887j02043m3587
$$ plain form
18198 686618 666136 643562 630612 578672 586435 563178 545228 567715 618261 637021 667863 710334
18186 710334 717076 703941 667250 667879 691351 711354 711288 741157 772471 826461 942965 1113488
18174 1113488 1273644 1414686 1456905 1365509 1207597 1022859 942171 905134 877076 824948
18164 824948 781265 788679 827789 860083 887820 880678 857072 829261 827941 889604 968892 1009897
18152 1009897 996468 975091 1040832 1149419 1187140 1096321 965757 926751 947384 1005432 1053119
18141 1053119 1079053 1125978 1158892 1167995 1148624 1093943 1036245 1055753 1095281 1150926 1193073
18130 1193073 1226761 1223675 1212682 1271790 1407204 1571518 1704300 1826672 1874876 1932761 2061593
18119 2061593 2282384 2574714 2946434 3472794 4239075 5393251 7196879 10145676 15559958
$$ packed form
18198F86618k0482k2574j2950n1940P763k3257j7950K2487N0546J8760L0842M2471
18186G10334O742j3135l6691O29K3472K0003o6K9869L1314N3990J16504J70523
18174A113488J60156J41042M2219r1396j57912j84738q0688l7037k8058n2128
18164H24948m3683P414L9110L2294K7737p142k3606k7811j320O1663P9288M1005
18152A009897j3429k1377O5741J08587L7721r0819j30564l9006K0633N8048M7687
18141A053119K5934M6925L2914R103j9371n4681n7698J9508L9528N5645M2147
18130A193073L3688l086j0993N9108J35414J64314J32782J22372M8204N7885J28832
18119B061593K20791K92330L71720N26360P66281J154176J803628K948797N414282
$$ plain form
18110 15559958 26211494 45181011 62124193 61349864 46137611 27843331 16770310
18103 16770310 11014018 7824258 5903657 4767443 4116864 3712099 3333748 2974566 2654836
18094 2654836 2449387 2341725 2330926 2245264 2081238 1940547 1883638 1849363 1772940 1730106
18084 1730106 1742689 1794932 1871940 1924992 1968519 2041831 2188817 2416889 2645595 2717990 2702146
18073 2702146 2654744 2744331 3042060 3496733 4009036 4411756 4803128 5182195 5588090 6076031
18063 6076031 6931642 8530173 11568246 17345106 27565510 39336661 42386110 36216205
18055 36216205 25765575 18524086 14865581 13052286 11948297 11249271 11073418 11527425
18047 11527425 12906493 15445912 20245529 29725347 47108136 68467362 75443058 65214612
$$ packed form
18110A5559958J0651536J8969517J6943182p74329j5212253j8294280j1073021
18103A6770310n756292l189760j920601j136214o50579m04765l78351l59182l19730
18094B654836k05449j07662j0799q5662j64026j40691n6909l4275p6423m2834
18084A730106J2583N2243P7008N3052M3527P3312J46986K28072K28706P2395j5844
18073B702146m7402Q9587K97729M54673N12303M02720L91372L79067M05895M87941
18063F076031Q55611J598531L038073N776860J0220404J1771151L049449o169905
18055C6216205j0450630p241489l658505j813295j103989o99026j75853M54007
18047A1527425J379068K539419M799617R479818J7382789K1359226O975696j0228446
$$ plain form
18039 65214612 45475889 30317341 22230036 18455912 17042113 17487039 20409775 27565883
18031 27565883 40366776 51425308 50811932 40388626 28028219 20811244 17872424 16864623
18023 16864623 16432490 16251426 16694776 17812277 19464263 22253957 27784778 38870689
18015 38870689 58534266 79240121 82924594 70439065 51307618 38406402 32312165
18008 32312165 30640309 31405702 31608432 29689610 26850427 25230458 26054408 28976697
18000 28976697 34174355 43331557 59922479 87354730 118249369 134031708 135625735
17993 135625735 139338449 170575512 240165418 319082764 360511506 332443461 256614740
17986 256614740 175527167 118770971 87961405 73869724 71743114 80722682 95107306
$$ packed form
18039F5214612j9738723j5158548q087305l774124j413799M44926K922736P156108
18031B7565883J2800893J1058532o13376j0423306j2360407p216975k938820j007801
18023A6864623m32133j81064M43350J117501J651986K789694N530821J1085911
18015C8870689J9663577K0705855L684473j2485529j9131447j2901216o094237
18008C2312165j671856P65393K02730j918822k839183j619969Q23950K922289
18000B8976697N197658R157202J6590922K7432251L0894639J5782339J594027
17993A35625735L712714L1237063O9589906P8917346M1428742k8068045p5828721
17986B56614740q1087573n6756196l0809566j4091681k126610Q979568J4384624
$$ plain form
17979 95107306 100301103 95525735 88353469 83490678 74271964 59945327 45519288 36093975
17971 36093975 30777012 27780531 26447685 26744650 28822637 32728893 38178586 46216545
17963 46216545 60149509 86423071 131021586 178099706 191639639 172888378 145268003
17956 145268003 138988673 149958588 154439590 149941931 149357795 165907762 177479594 161927002
17948 161927002 124168293 85549317 60020007 45327396 37435041 34309801 35600348
17941 35600348 42172947 56006283 74194668 81743153 74888944 60620503 51373803 46958884
17933 46958884 40678177 31738227 22989186 17229058 13984722 12047471 10676360 9670300
17925 9670300 8977130 8660643 8426456 7958050 7275610 6690147 6319225 6108689 5941383
$$ packed form
17979I5107306N193797m775368p172266m862791r218714j4326637j4426039r425313
17971C6093975n316963k996481j332846K96965K077987L906256N449693Q037959
17963D6216545J3932964K6273562M4598515M7078120J3539933j8751261k7620375
17956A45268003o279330J0969915M481002m497659n84136J6549967J1571832j5552592
17948A61927002l7758709l8618976k5529310j4692611p892355l125240J290547
17941C5600348O572599J3833336J8188385P548485o854209j4268441r246700m414919
17933D6958884o280707q939950q749041n760128l244336j937251j371111j006060
17925I670300o93170l16487k34187m68406o82440n85463l70922k10536j67306
$$ plain form
17916 5941383 5694715 5389914 5132666 5012769 5001222 5116287 5374249 5612426 5740220 5799228
17906 5799228 5905207 6256139 6865054 7709402 8915935 10814283 14028533 19696325 28374849
17897 28374849 36103852 37980829 34124159 28704807 25963768 26608928 29988740 37032475
17889 37032475 51227479 77842583 111557898 124795348 111563295 83512765 63213660
17882 63213660 57868567 66213827 83609543 92958653 84436278 62881349 41898298 28342036
17874 28342036 20596824 16208623 13776282 12591511 12352769 13079295 15182118 18530595
17866 18530595 21269676 21512725 19047468 15587397 12741157 11230110 11232543 12791989 15106786
17857 15106786 15800402 14440174 12179939 10909162 11232609 12897847 14681252 14905214
$$ packed form
17916E941383k46668l04801k57248j19897j1547J15065K57962K38177J27794N9008
17906E799228J05979L50932O08915Q44348J206533J898348L214250N667792Q678524
17897B8374849P729003J876977l856670n419352k741039O45160L379812P043735
17889C7032475J4195004K6615104L3715315J3237450j3232053k8050530k0299105
17882F3213660n345093Q345260J7395716R349110q522375k1554929k0983051j3556262
17874B8342036p745212m388201k432341j184771k38742P26526K102823L348477
17866A8530595K739081K43049k465257l460071k846240j511047K433J559446K314797
17857A5106786O93616j360228k260235j270777L23447J665238J783405K23962
$$ plain form
17849 14905214 13492114 11357425 9690915 8766030 8530616 8737551 9273444 10210128 11695032
17840 11695032 13970621 17644276 23860076 34504539 50510017 64610252 69819866 70301137
17832 70301137 77941986 104210454 144351487 172933926 180236116 168229437 159230607
17825 159230607 149692812 127966061 95221279 63493419 43149250 32154553 26951632
17818 26951632 24972440 23249496 20243503 16368582 13079131 11056003 9862650 8864611
17810 8864611 7867529 7040087 6417749 5885530 5330816 4778673 4308984 3944231 3696033
17801 3696033 3523914 3433468 3403085 3325877 3181368 3089811 3158598 3355673 3597597 3824409
17791 3824409 3915046 3844684 3765597 3836229 4016037 4261485 4544566 5023315 5861274 7143719
$$ packed form
17849A4905214j413100k134689j666510r24885k35414K06935N35893R36684J484904
17840A1695032K275589L673655O215800J0644463J6005478J4100235N209614M81271
17832G0301137P640849K6268468M0141033K8582439P302190j2006679q998830
17825A59230607r537795k1726751l2744782l1727860k0344169j0994697n202921
17818B6951632j979192j722944l005993l874921l289451k023128j193353r98039
17810H864611r97082q27442o22338n32219n54714n52143m69689l64753k48198
17801C696033j72119r0446l0383p7208j44509r1557O8787J97075K41924K26812
17791C824409R0637p0362p9087P0632J79808K45448K83081M78749Q37959J282445
$$ plain form
17781 7143719 9013691 11896958 16803318 25611306 40881138 59809580 68799741 66604514
17773 66604514 61461528 65694252 71700843 65892845 49505835 31772854 20355103 13893015
17765 13893015 10077539 7712487 6150147 5106283 4343013 3797762 3432382 3174176 3015088
17756 3015088 2897226 2879880 2930286 3014147 3203176 3577135 3986197 3973725 3439789 2606910
17746 2606910 1911368 1464161 1189857 1024287 941943 910028 920589 984745 982371 924465 885807
17735 885807 916127 977190 949366 815715 678487 578138 519264 481362 424937 368353 334883
17724 334883 299733 289846 316963 313374 336735 330031 331369 342045 348548 323655 313064 303412 293742
17711 293742 273391 261865 248147 274146 288257 326760 341590 341113 356426 358827 315591 285282
$$ packed form
17781G143719J869972K883267M906360Q807988J5269832J8928442Q990161k195227
17773F6604514n142986M232724O006591n807998j6387010j7732981j1417751o462088
17765A3893015l815476k365052j562340j043864p63270n45251l65380k58206j59088
17756C015088j17862j7346N0406Q3861J89029L73959M09062j2472n33936q32879
17746B606910o95542m47207k74304j65570q2344l1915J0561O4156k374n7906l8658
17735H85807L0320O1063k7824j33651j37228j00349n8874l7902n6425n6584l3470
17724C34883l5150r887K7117l589K3361o704J338J0676O503k4893j0591r652r670
17711B93742k0351j1526j3718K5999J4111L8503J4830m77J5313K401m3236l0309
$$ plain form
17699 285282 263636 230249 203152 150690 122851 117210 133934 142470 157507 151045 134063 121746
17687 121746 69461 64594 90614 120826 128537 104439 75482 90401 79548 62942 63092 87714
17675 87714 74151 98180 137379 146878 118165 108160 155301 199299 234029 286316 438049 643773
17663 643773 747866 684012 508770 357861 257238 201990 190886 238707 288528 306997 265103
17652 265103 212694 155548 119232 108757 94577 76371 93297 94671 83667 68363 84545 103743
17640 103743 126696 143536 137295 98324 98383 97442 101899 104256 114985 112425 103209 92347 74453
17627 74453 82148 92452 106940 132103 164002 220125 278219 317736 331791 298673 257513 230098
17615 230098 321221 479673 695891 829844 719855 516244 348665 246823 195764 171815
$$ packed form
17699B85282k1646l3387k7097n2462k7839n641J6724Q536J5037o462j6982j2317
17687A21746n2285m867K6020L0212P711k4098k8957J4919j0853j6606J50K4622
17675H7714j3563K4029L9199R499k8713j0005M7141M3998L4730N2287J51733K05724
17663F43773J04093o3854j75242j50909j00623n5248j1104M7821M9821J8469m1894
17652B65103n2409n7146l6316j0475j4180j8206J6926J374j1004j5304J6182J9198
17640A03743K2953J6840o241l8971N9r41M457K357J0729k560r216j0862j7894
17627G4453P695J0304J4488K5163L1899N6123N8094L9517J4055l3118m1160k7415
17615B30098R1123J58452K16218J33953j09989k03611j67579j01842n1059k3949
$$ plain form
17605 171815 157220 145526 165537 214442 229716 205395 163876 109975 97281 121752 153787
17594 153787 175308 165960 130289 97824 76685 87984 111677 115134 112376 130349 119696 69689
17582 69689 29476 24300 43062 67857 88838 109037 107690 84902 87007 49553 60903 114347
17570 114347 194685 257789 285265 285951 332705 389339 340071 270853 240751 203480 185765 179420
17558 179420 145494 121904 111493 66116 58269 48000 41176 63213 59186 50983 45754 46903 82663
17545 82663 92492 44378 22090 16176 5376 10587 22681 36579 31385 51032 43445 31350 37631
17532 37631 46733 99240 155433 141877 116812 98946 121932 120075 117002 126702 128539 113241 84676
17519 84676 59867 43966 41181 59954 75269 137581 246945 373416 526181 690668 707879
$$ packed form
17605A71815j4595j1694K0011M8905J5274k4321m1519n3901j2694K4471L2035
17594A53787K1521r348l5671l2465k1139J1299K3693L457k758J7973j0653n0007
17582F9689m0213n176J8762K4795K0981K0199j347k2788K105l7454J1350N3444
17570A14347Q0338O3104K7476O86M6754N6634m9268o9218l0102l7271j7715o345
17558A79420l3926k3590j0411m5377p847j0269o824K2037m027q203n229J149L5760
17545H2663R829m8114k2288n914j0800N211J2094J3898n194J9647p587j2095O281
17532C7631R102N2507N6193j3556k5065j7866K2986j857l073R700J837j5298k8565
17519H4676k4809j5901k785J8773J5315O2312J09364J26471J52765J64487J7211
$$ plain form
17508 707879 623695 479777 361793 281506 211880 195074 157959 112156 84162 93643 92439
17497 92439 123701 183907 298452 430292 485048 408542 288631 181487 131307 141999 146168
17486 146168 203819 306237 436665 584618 628203 567651 468078 362863 264609 232082 221266
17475 221266 236164 230372 257352 290762 295144 306157 361685 463574 595413 663181 634179
17464 634179 536181 430786 322603 279640 312752 361052 446564 616726 859578 1049236
17454 1049236 1200078 1173269 980071 714387 504702 359505 280108 283162 279944 306137 392892
17443 392892 543967 733347 884216 1006123 1047651 1115860 1081982 897961 634456 432570
17433 432570 341441 275789 230741 240297 319462 402951 488020 517956 473461 354630 258594
$$ packed form
17508G07879q4184j43918j17984q0287o9626j6806l7115m5803k7994R481j204
17497I2439L1262O0206J14545J31840N4756p6506j19911j07144n0180J0692M169
17486A46168N7651J02418J30428J47953M3585o0552r9573j05215r8254l2527j0816
17475B21266J4898n792K6980L3410M382J1013N5528J01889J31839O7768k9002
17464F34179r7998j05395j08183m2963L3112M8300Q5512J70162K42852J89658
17454A049236J50842k6809j93198k65684k09685j45197p9397L054l218K6193Q6755
17443C92892J51075J89380J50869J21907M1528O8209l3878j84021k63505k01886
17433D32570r1129o5652m5048R556P9165Q3489Q5069K9936m4495j18831r6036
$$ plain form
17422 258594 215879 190685 216988 267306 302363 391826 568519 760577 890598 960313 961979
17411 961979 891318 779307 613402 457898 343973 253137 230997 216080 192901 254965 365704
17400 365704 521511 649571 738684 765250 712026 551662 388982 247802 153529 110358
17390 110358 100699 76736 47382 64429 89712 65254 23079 8499 2530 3590 14938 -3508
17378 -3508 6356 32308 35108 5258 -3334 3232 13409 -7095 -6465 35494 84438 124031 181559
17365 181559 244581 243593 235771 280003 394235 523206 533379 427308 254092 139195 123023
17354 123023 130704 114075 117171 204485 270518 317791 290592 243625 168959 58362 31924 48142
17342 48142 42181 49480 41016 33914 22359 14878 14447 -214 19838 27492 173 -4031 10703
$$ packed form
17422B58594m2715k5194K6303N0318L5057Q9463J76693J92058J30021O9715J666
17411I61979p0661j12011j65905j55504j13925r0836k2140j4917k3179O2064J10739
17400C65704J55807J28060Q9113K6566n3224j60364j62680j41180r4273m3171
17390A10358r659k3963k9354J7047K5283k4458m2175j4580n969J060J1348j8446
17378c508R864K5952K800k9850q592O566J0177k0504O30M1959M8944L9593N7528
17365A81559O3022r88p822M4232J14232J28971J0173j06071j73216j14897j6172
17354A23023P681j6629L096Q7314O6033M7273k7199m6967p4666j10597k6438J6218
17342D8142n961P299q464p102j1555p481m31j4661K0052P654k7319m204J4734
$$ plain form
17329 10703 -1271 -37583 -33240 -6792 -1360 -9599 -10209 -26331 -26866 -11203 13578 46120 89530
17316 89530 98583 120640 194081 234943 224783 199210 134544 106083 130527 152290 200535 293441
17304 293441 462302 696840 854191 863923 754108 640861 618619 670945 656344 533588
17294 533588 348274 234901 163473 105571 81848 46810 8007 -20094 -23144 267 34590
17283 34590 33193 2437 -5141 277 1382 4688 -8515 -17388 -11850 -1514 -17057 -44465 -59694
17270 -59694 -72467 -74480 -40259 -31721 -7850 -1238 -1887 -1895 -30772 -24997 -23681 -11761 -42690 -30589
17256 -30589 -11665 4197 46221 88767 112112 214491 326628 386126 368941 323464 328735
17245 328735 372736 410185 386440 299043 170847 52115 34049 34471 19080 11756 1071 -13367
$$ packed form
17329A0703j1974l6312M343K6448N432q239o10j6122n35J5663K4781L2542M3410
17316H9530R053K2057P3441M0862j0160k5573o4666k8461K4444K1763M8245R2906
17304B93441J68861K34538J57351R732j09815j13247k2242N2326j4601j22756
17294E33588j85314j13373p1428n7902k3723l5038l8803k8101l050K3411L4323
17283C4590j397l0756p578N418J105L306j3203q873N538J0336j5543k7408j5229
17270e9694j2773k013L4221Q538K3871O612o49qk8877N775J316J1920l0929J2101
17256c0589J8924J5862M2024M2546K3345J02379J12137N9498j7185m5477N271
17245C28735M4001L7449k3745q7397j28196j18732j8066M22j5391p324j0685j4438
$$ plain form
17233 -13367 -25123 -43677 -13845 4172 1361 14463 48112 35056 833 -7537 -682 4434
17221 4434 7170 9342 -9186 -47466 -42670 -9029 14253 23975 31530 25418 17762 -5589 -34301
17208 -34301 -32210 -8416 -770 9400 17693 -2693 -18126 -11513 -25084 -9490 -42062 -102781
17196 -102781 -91878 -76801 -72267 -63501 -77262 -65204 -73832 -57301 -56783 -49481 -48816 -29626 18640
17183 18640 4871 -17096 -58695 -61517 -77617 -79216 -33543 -10658 -10753 -19931 -52107 -65210 -82158
17170 -82158 -62341 -39076 -35756 -51795 -60909 -60668 -74915 -84917 -70702 -89100 -61253 -82673
17158 -82673 -68136 -66285 -60135 -61411 -23261 -23219 -35544 -49920 -52641 -46153 -21324 -7524 -18593
17145 -18593 -20906 -48734 -71351 -52261 -14346 -49097 -45644 -34396 -18235 -35512 -7416 -4646
$$ packed form
17233a3367j1756j8554K9832J8017k811J3102L3649j3056l4223q370O855N116
17221D434K736K172j8528l8280M796L3641K3282R722P555o112p656k3351k8712
17208c4301K091K3794P646J0170Q293k0386j5433O613j3571J5594l2572o0719
17196a02781J0903J5077M534Q766j3761J2058q628J6531N18P302O65J9190M8266
17183A8640j3769k1967m1599k822j6100j599M5673K2885r5r178l2176j3103j6948
17170h2158J9817K3265L320j6039r114K41j4247j0002J4215j8398K7847k1420
17158h2673J4537J851O150j276L8150M2j2325j4376k721O488K4829J3800j1069
17145a8593k313k7828k2617J9090L7915l4751L453J1248J6161j7277K8096K770
$$ plain form
17133 -4646 -16302 -5154 -26904 -9640 -7984 -39197 -53532 -17471 -12530 -40982 -47826 -35349
17121 -35349 -26015 -34275 -9375 459 -4976 -11973 -17003 -30552 -24165 -17248 10005 -6683 -18593
17108 -18593 -6493 -13028 -16437 -4193 -22499 -16168 -15502 -50057 -69613 -57851 -59583 -57721 -52623
17095 -52623 -22831 -25809 -43147 -57261 -68355 -59708 -50896 -77282 -76223 -68355 -54117 -42328 -27685
17082 -27685 -37885 -53515 -64853 -58198 -72388 -79857 -69213 -57059 -58444 -65847 -61295 -42302 -39226
17069 -39226 -50339 -61758 -54415 -66800 -46077 -31187 -32800 -17050 -9538 -42926 -67732 -49153
17057 -49153 -41136 -41784 -41433 -61544 -53422 -23086 -24759 -29677 -13639 -8024 -3791 2392 -29275 -38936
17043 -38936 -53333 -41993 -11724 6584 -11044 -14798 -15756 -27538 -36835 -38339 -58511 -56760 -78723
$$ packed form
17133d646j1656J1148k1750J7264J656l1213j4335L6061M941k8452o844J2477
17121c5349R334q260K4900R834n435o997n030j3549O387O917K7253j6688j1910
17108a8593J2100o535l409J2244j8306O331O66l4555j9556J1762j732J862N098
17095e2623K9792k978j7338j4114j1094Q647Q812k6386J059P868J4238J1789J4643
17082b7685j0200j5630j1338O655j4190p469J0644J2154j385p403M552J8993L076
17069c9226j1113j1419P343j2385K0723J4890j613J5750P512l3388k4806J8579
17057d9153Q017o48L51k0111Q122L0336j673m918J6038N615M233O183l1667r661
17043c8936j4397J1340L0269J8308j7628l754r58j1782r297j504k0172J751k1963
$$ plain form
17030 -78723 -72135 -82964 -50059 -23679 -47216 -71983 -56395 -50392 -45685 -49174 -71904 -98617
17018 -98617 -77188 -56139 -22362 -14261 -15040 -15456 2337 8315 -2862 -29523 -30367 -38019 -51120
17005 -51120 -72732 -80090 -85119 -87739 -86102 -62891 -68998 -72022 -80380 -63499 -53127 -39302 -27098
16992 -27098 -33686 -46315 -39204 -53238 -73545 -72311 -93196 -80721 -52632 -14552 -24477 -16338 -13453
16979 -13453 -34392 -26661 -23861 -41623 -28488 -28750 -46679 -52605 -46080 -42426 -64319 -83717 -59220
16966 -59220 -32964 -25978 12736 20684 18290 -8209 -21993 -58914 -75477 -71351 -71383 -72204 -58656
16953 -58656 -87899 -106396 -103694 -74920 -50564 -36820 -26394 -23264 -13939 1058 18840 -9850
16941 -9850 -31274 -28820 -13686 5801 -15343 -35983 -21182 -30625 -17733 -16569 -16832 -46308 -45910
$$ packed form
17030g8723O588j0829L2905K6380k3537k4767J5588O003M707l489k2730k6713
17018i8617K1429K1049L3777Q101p79m16J7793N978j1177k6661q44p652j3101
17005e1120k1612p358n029k620J637K3211o107l024q358J6881J0372J3825J2204
16992b7098o588j2629P111j4034k0307J234k0885J2475K8089L8080r925Q139K885
16979a3453k0939P731K800j7762J3135k62j7929n926O525L654k1893j9398K4497
16966e9220K6256O986L8714P948k394k6499j3784l6921j6563M126l2q21J3548
16953e8656k9243j8497K702K8774K4356J3744J0426L130R325J4997J7782k8690
16941i850k1424K454J5134J9487k1144k0640J4801r443J2892J164k63k9476L98
$$ plain form
16928 -45910 -31437 -45532 -89129 -63483 -27973 -4809 -25010 -32644 -19138 -8362 -17277 -50102
16916 -50102 -89722 -102063 -72993 -81703 -78181 -46389 -11782 -26491 -71573 -59304 -63677 -74257
16904 -74257 -71342 -50426 -28194 -28529 -37569 -7243 5448 -31619 -31789 -39166 -41917 -30409 -29881 -47268
16890 -47268 -33509 -18095 -16360 -30118 -34755 -20586 -19578 -21962 -1701 25967 19245 -26437 -37372
16877 -37372 -23364 -11974 -11321 -37338 -27237 -1292 3432 -2689 7452 15738 -6773 -17813 -23047
16864 -23047 -25332 -49975 -49994 -41860 -45484 -32434 14495 60445 57756 1702 -34810 -9403 5629
16851 5629 -15535 -17186 -18087 -26626 -43275 -31612 -29133 -23762 -13091 -21810 -41339 -39400 -37788 -50326
16837 -50326 -53216 -57881 -71690 -65910 -44576 -50924 -65924 -60601 -44065 -30217 -29322 -41974 -35765
$$ packed form
16928d5910J4473j4095m3597K5646L5510K3164k0201p634J3506J0776q915l2825
16916e0102l9620j2341K9070q710L522L1792L4607j4709m5082J2269m373j0580
16904g4257K915K0916K2232l35r040L0326J2691l7067j70p377k751J1508N28j7387
16890d7268J3759J5414J735j3758m637J4169J008k384K0261K7668o722m5682j0935
16877c7372J4008J1390O53k6017J0101K5945M724o121J0141Q286k2511j1040n234
16864b3047k285k4643j9Q134l624J3050M6929M5950k689n6054l6512K5407J5032
16851E629k1164j651r01q539j6649J1663K479N371J0671q719j9529J939J612j2538
16837e0326k890m665j3809N780K1334o348j5000N323J6536J3848Q95j2652O209
$$ plain form
16824 -35765 -11780 -8012 -8788 -36775 -49536 -21754 -25030 -35420 -35638 -15383 -11407 -12122 -42774
16811 -42774 -58851 -67544 -36791 -37651 -65282 -26831 -26774 -11558 3677 -18858 -12898 -20497 -39997
16798 -39997 -60312 -70525 -36062 -8656 12914 -4018 -13123 -17899 -17148 23890 38076 -16131
16786 -16131 -53169 -34283 -9981 14755 29384 8631 -3132 -3351 -20610 -12781 1973 18550
16774 18550 14634 7179 -24514 -18830 -14104 -35176 -63277 -51922 -36151 -36703 -44774 -43649 -68473
16761 -68473 -60796 -54708 -55737 -72014 -97250 -65666 -47906 -17580 26937 49466 62233 61035
16749 61035 41605 24129 12935 29668 30979 -6624 -35271 -23457 -4813 -4545 -1260 -35562
16737 -35562 -64690 -75007 -82803 -58562 -52746 -76272 -93580 -81785 -73506 -66909 -71494 -76153 -77207
$$ packed form
16824c5765K3985L768p76k7987j2761K7782l276j0390k18K0255L976p15l0652
16811d2774j6077q693L0753q60k7631L8451N7J5216J5235k2535N960p599j9500
16798c9997k0315j0213L4463K7406K1570j6932r105m776P51M1038J4186n4207
16786a6131l7038J8886K4302K4736J4629k0753j1763k19j7259P829J4754J6577
16774A8550l916p455l1693N684M726k1072k8101J1355J5771n52q071J125k4824
16761f8473P677O088j029j6277k5236L1584J7760L0326M4517K2529J2767j198
16749F1035j9430j7476j1194J6733J311l7603k8647J1814J8644K68L285l4302
16737c5562k9128j0317p796K4241N816k3526j7308J1795Q279O597m585m659j054
$$ plain form
16724 -77207 -69849 -49110 -42928 -40707 -52409 -38589 -51762 -27032 -19324 -31014 -52034 -73809
16712 -73809 -93652 -93861 -86983 -85524 -81013 -93801 -77887 -66451 -56633 -38007 -57224 -71231 -30947
16699 -30947 -30444 -58326 -37827 -16943 7840 5793 -7727 -42195 -59056 -66107 -91205 -78874
16687 -78874 -56209 -44660 -20844 -10635 -29766 -20971 -10458 -12065 -43913 -46450 -27690 -23520
16675 -23520 -42180 -56524 -59359 -76513 -69762 -61049 -75285 -57847 -57323 -42844 -45216 -21497 -17292
16662 -17292 -26741 -11614 1728 -12194 -24350 -35348 -44453 -74564 -61595 -41073 -58134 -45541
16650 -45541 -30993 -20172 -7647 -5039 3353 18993 16200 3098 -10469 -28829 -33904 -25747 -1106
16637 -1106 4983 16558 8136 -2849 3372 -20322 -50306 -33517 -33659 -16444 -10726 -35351 -6461
$$ packed form
16724g7207P358K0739O182K221j1702J3820j3173K4730P708j1690k1020k1775
16712g3809j9843k09O878J459M511j2788J5914J1436R818J8626j9217j4007M0284
16699c0947N03k7882K0499K0884K4783k047j3520l4468j6861p051k5098J2331
16687g8874K2665J1549K3816J0209j9131Q795J0513j607l1848k537J8760M170
16675b3520j8660j4344k835j7154O751Q713j4236J7438N24J4479k372K3719M205
16662a7292r449J5127J3342j3922j2156j0998r105l0111J2969K0522j7061J2593
16650d5541J4548J0821J2525K608Q392J5640k793j3102j3567j8360n075Q157K4641
16637a106O089J1575q422j0985O221k3694k9984J6789j42J7215N718k4625K8890
$$ plain form
16624 -6461 -10802 -37821 -46653 -50386 -52194 -32743 -41436 -29787 -16397 -45829 -36964 -32122 -54218
16611 -54218 -33087 -26068 -47726 -26576 -3727 10993 38324 46930 14188 -1595 14134 -24818
16599 -24818 -42933 -41943 -37588 -37943 -34435 -36726 -60272 -74130 -53553 -35333 -15950 -1035 3296
16586 3296 -6335 -5565 -10916 -7917 -22103 -32550 -54171 -66893 -66892 -60745 -61921 -67972 -81680 -101562
16572 -101562 -94947 -72081 -61732 -44371 -37038 -31326 -37912 -36556 -22928 -31191 -54728 -25946 -30193
16559 -30193 -55586 -52624 -70327 -45028 -23093 -5174 564 -35683 -60952 -65928 -68859 -71537 -57672
16546 -57672 -39647 -44123 -25886 -10381 -25378 -27559 -21095 -20667 -29267 -38646 -24187 1129 9433
16533 9433 -9151 -38556 -34532 -19610 -20261 -6499 -7680 -253 -3361 11291 35383 23870 8229
$$ packed form
16624f461m341k7019q832l733j808J9451q693J1649J3390k9432Q865M842k2096
16611e4218K1131P019k1658K1150K2849J4720K7331Q606l2742j5783J5729l8952
16599b4818j8115R90M355l55L508k291k3546j3858K0577J8220J9383J4915M331
16586C296r631P70n351K999j4186j0447k1621j2722JO147j176o051j3708j9882
16572a01562O615K2866J0349J7361P333N712o586J356J3628q263k3537K8782m247
16559c0193k5393K962j7703K5299K1935J7919N738l6247k5269m976k931k678J3865
16546e7672J8025m476J8237J5505j4997k181O464M28q600r379J4459K5316Q304
16533I433j8584k9405M024J4922o51J3762j181P427l108J4652K4092j1513j5641
$$ plain form
16520 8229 -9225 -16555 -29325 -24040 21938 8830 -9480 -36087 -16362 4063 -37234 -54055
16508 -54055 -36497 -15884 7742 2942 -4041 -10101 -4362 6975 10171 -2677 -820 -22810 -21585
16495 -21585 9064 16706 12892 10101 -1032 9174 -233 -21715 -15084 -18901 -39606 -45812 -39276
16482 -39276 -25900 -19079 -2181 -24110 -60930 -95003 -92284 -85463 -67000 -57687 -55292 -25298 -9430
16469 -9430 -11823 -42850 -65430 -44458 -52629 -65594 -68072 -43577 -38775 -50679 -31018 -20432 -36224
16456 -36224 -31347 -35423 -43719 -5200 27297 9345 -776 -3815 -29533 -50685 -70553 -68470 -54629
16443 -54629 -32404 -25010 -43246 -43180 -57168 -49564 -67523 -62359 -41677 -34638 -5169 11147 -8188
16430 -8188 -46095 -78067 -82031 -52228 11044 12482 -3263 -791 -13859 477 6726 8056 7167
$$ packed form
16520H229j7454p330j2770N285M5978j3108j8310k6607J9725K0425m1297j6821
16508e4055J7558K0613K3626m800o983o060N739J1337L196j2848J857k1990J225
16495b1585L0649P642l814k791j1133J0206r407k1482O631l817k0705o206O536
16482c9276J3376O821J6898k1929l6820l4073K719O821J8463R313K395K9994J5868
16469i430k393l1027k2580K0972q171j2965k478K4495M802j1904J9661J0586j5792
16456c6224M877m076q296L8519L2497j7952j0121l039k5718k1152j9868K083J3841
16443e4629K2225P394j8236O6j3988P604j7959N164K0682P039K9469J6316j9335
16430h188l7907l1972l964K9803O3272J438j5745K472j3068J4336O249J330q89
$$ plain form
16417 7167 23993 58259 47210 -11410 -24429 -21816 -35274 -44923 -17826 -17222 -19030 -29826 -43371
16404 -43371 -36715 -9917 -3206 -28904 -64301 -76590 -65047 -58724 -82633 -62070 -43466 -34891
16392 -34891 -20643 8132 16163 -15627 -53153 -58100 -27726 -46019 -50082 -35172 -46270 -43421
16380 -43421 -46082 -60168 -52638 -15879 -14594 -22186 -53372 -77975 -39781 -42521 -21788 7137 -25364
16367 -25364 -55154 -33932 -5744 -7870 -64607 -95079 -67167 -13212 -19439 -28242 3470 21512
16355 21512 27998 12381 -1853 445 -21815 -9315 9553 -962 5478 7643 10278 -4433 6049
16342 6049 -6671 -27610 -44557 -55205 -14092 -4626 -16115 -28622 -33260 -17467 -32709 -20101
16330 -20101 -16773 -55611 -68409 -38562 -18998 -19319 -36692 -21360 758 -23908 6907 461
$$ packed form
16417G167J6826L4266j1049n8620j3019K613j3458r649K7097O04j808j0796j3545
16404d3371O656K6798O711k5698l5397j2289J1543O323k3909K0563J8604Q575
16392c4891J4248K8775Q031l1790l7526m947L0374j8293m063J4910j1098K849
16380d3421k661j4086P530L6759J285p592l1186k4603L8194k740K0733K8925l2501
16367b5364k9790K1222K8188k126n6737l0472K7912N3955o227q803L1712J8042
16355B1512O486j5617j4234K298k2260J2500J8868j0515O440K165K635j4711J0482
16342F049j2720k0939j6947j0648M1113R466j1489j2507m638J5793j5242J2608
16330b0101L328l8838j2798K9847J9564l21j7373J5332K2118k4666L0815o446
$$ plain form
16318 461 -11961 -27289 -33484 -34716 -4809 -11118 -46950 -45443 -35251 -27385 -11122 9929 8326
16305 8326 11153 4271 -5320 -25710 -51512 -63828 -36655 -3547 5236 -15608 -26559 -11149 -12059
16292 -12059 -46046 -66728 -72567 -30729 -33302 -44421 -19327 -24536 -29405 -1924 -5750 7047 -8328
16279 -8328 -19855 -21571 -36319 -29072 -52505 -54234 -54197 -49496 -66995 -68136 -64760 -68330 -64593 -79037
16265 -79037 -69252 -39257 -18621 -9575 -22089 -8531 -30675 -63357 -68542 -46962 -15176 10105
16253 10105 5011 -6115 -13525 -20685 -9938 -11669 -33595 -14632 8886 -2914 -15740 -36169
16241 -36169 -50164 -71731 -73121 -60589 -41566 -30689 -33275 -56545 -55961 -52284 -37442 -23580 -15014
16228 -15014 -351 -468 12779 -14815 -27716 -844 1512 -27508 -51173 -40405 -21062 10790
$$ packed form
16318D61j2422j5328o195j232K9907o309l5832J507J0192P866J6263K1051j603
16305H326K827o882r591k0390k5802j2316K7173L3108Q783k0844j0951J5410r10
16292a2059l3987k0682n839M1838k573j1119K5094n209m869K7481l826J2797j5375
16279h328j1527j716j4748P247k3433j729L7M701j7499j141L376l570L737j4444
16265g9037R785K9995K0636R046j2514J3558k2144l2682n185K1580L1786K5281
16253A0105n094j1126p410p160J0747j731k1926J8963K3518j1800j2826k0429
16241c6169j3995k1567j390J2532J9023J0877k586k3270N84L677J4842J3862Q566
16228a5014J4663j17J3247k7594j2901K6872K356k9020k3665J0768J9343L1852
$$ plain form
16216 10790 26514 11357 13615 5069 870 16260 19949 -17247 -42094 1226 5500 -6693 -2085
16203 -2085 -6252 -24240 -22742 17382 7745 -42303 -48458 -41303 -23707 -24667 -45568 -37738 -17976
16190 -17976 -9670 -30718 -23410 -26101 -26065 14466 8863 12310 15969 42390 46536 18591 -9842 -5122
16176 -5122 24220 33843 11915 -1237 -19906 -51417 -60284 -31544 -13225 -7999 -13051 3791 -11910
16163 -11910 -39082 -58582 -39367 -25153 -11799 -13718 -35757 -36206 -28927 -55806 -51540 -43744 -59285
16150 -59285 -44003 -50157 -52359 -51955 -33740 -3990 -2812 6475 -24835 -25196 -40679 -38939 -49556
16137 -49556 -54827 -46179 -6228 22725 16649 -13491 -54667 -48444 -37389 -39083 -37951 -7622 13953
16124 13953 24033 11948 7206 10146 -6045 4071 33570 1096 -34017 -23140 -36906 -31495
$$ packed form
16216A0790J5724j5157K258q546m199J5390L689l7196k4847M3320M274j2193M608
16203b085m167j7988J498M0124r637n0048o155P155J7596r60k0901P830J9762
16190a7976Q306k1048P308k691L6M0531n603L447L659K6421M146k7945k8433M720
16176e122K9342R623k1928j3152j8669l1511q867K8740J8319N226n052J6842j5701
16163a1910k7172j9500J9215J4214J3354j919k2039m49P279k6879M266P796j5541
16150e9285J5282o154k202M04J8215K9750J178R287l1310l61j5483J740j0617
16137d9556n271Q648L9951K8953o076l0140m1176O223J1055j694J132L0329K1575
16124A3953J0080j2085m742K940j6191J0116K9499l2474l5113J0877j3766N411
$$ plain form
16112 -31495 -13519 -14425 -16442 -9029 -40082 -52641 -51292 -45839 -66788 -55818 -21555 1916 7541
16099 7541 14271 7119 -5732 -20655 -8720 -20742 -13806 -17626 -32159 -34999 -14458 -2973 1582
16086 1582 -10202 -37956 -16432 -7401 15361 28477 17837 -10420 -10362 -13440 -28011 -30425 -26373
16073 -26373 -53372 -72499 -59156 -52846 -73107 -86017 -73359 -48729 -25046 -5968 10210 31415
16061 31415 15916 -183 -36194 -38077 -22539 -39942 -29083 -1255 11454 -6409 -13983 -16496
16049 -16496 -21547 -25350 -30572 -42988 -19503 21135 67574 62261 42869 11747 3292 -2666 11959
16036 11959 3793 -7422 -35692 -26663 -5192 11058 -4064 2768 10050 16469 2776 -8135 -12454
16023 -12454 -5607 15020 8427 -35945 -41984 -6010 135 -4754 -9096 -8459 -26419 -17160 12046
$$ packed form
16112c1495J7976r06k017P413l1053j2559J349N453k0949J0970L4263K3471N625
16099G541O730p152j2851j4923J1935j2022O936l820j4533k840K0541J1485M555
16086A582j1784k7754K1524R031K2762J3116j0640k8257N8l078j4571k414M052
16073b6373k6999j9127J3343O310k0261j2910J2658K4630K3683J9078J6178K1205
16061C1415j5499j6099l6011j883J5538j7403J0859K7828J2709j7863p574k513
16049a6496n051l803n222j2416K3485M0638M6439n313j9392l1122q455n958J4625
16036A1959q166j1215k8270R029K1471J6250j5122O832P282O419j3693j0911m319
16023a2454O847K0627o593m4372o039L5974O145m889m342O37j7960R259K9206
$$ plain form
16010 12046 -6978 -41350 -47014 -42449 -46319 -31439 -16855 -23475 -21707 -32007 -29172 -16544 -34799
15997 -34799 -33229 -26021 -33781 -32230 -46165 -35076 -26126 -20283 -5515 1002 6812 -522 12326
15984 12326 -4328 -7828 734 8048 37198 20845 13776 27035 21678 528 -23338 -3577 16118
15971 16118 -10966 -2245 11156 27995 16729 12858 8968 -14430 -10258 -9247 -10790 -9460 -17780
15958 -17780 -5542 -54 -2374 -20640 -35886 -31995 -33288 -31772 1528 -5111 15825 15977 16154 41874
15944 41874 45448 23057 -26978 -84259 -15884 -2348 -6057 7746 18181 -84 -2023 -243
15932 -243 -23443 -34383 -11370 -10262 -20861 -32347 -17566 -18507 13746 49722 31812 6607 -3322
15919 -3322 -3000 -916 -6256 -11891 -16019 938 33030 47060 41319 21499 21384 3738 -18221 -15300
$$ packed form
16010A2046j9024l4372n664M565l870J4880J4584o620J768j0300K835J2628j8255
15997c4799J570P208p760J551j3935J1089Q950N843J4768O517N810p334J2848
15984A2326j6654l500Q562P314K9150j6353p069J3259n357k1150k3866J9761J9695
15971A6118k7084Q721J3401J6839j1266l871l890k3398M172J011j543J330q320
15958a7780J2238N488k320j8266j5246L891j293J516L3300o639K0936J52J77K5720
15944D1874L574k2391n0035n7281O8375J3536l709J3803J0435j8265j939J780
15932b43k3200j0940K3013J108j0599j1486J4781r41L2253L5976j7910k5205r929
15919c322L22K084n340n635m128J6957L2092J4030n741j9820j15j7646k1959K921
$$ plain form
15905 -15300 14251 -2010 -18943 -10444 -1770 -9281 -17450 -2108 -8125 -24643 -18538 -17431 -18781
15892 -18781 -38111 -56300 -49988 -22670 9375 14573 -2104 -9668 7329 14453 4283 -2695 13048
15879 13048 8924 -788 10832 26702 41980 76184 64010 44586 24891 4776 8125 -9513
15867 -9513 -16040 -27873 -3549 686 7660 -3445 -24561 -45346 -54222 -41400 -23286 -16689 -733
15854 -733 11749 -7798 11306 7935 -15674 -8130 9302 2429 -22455 -2216 1455 5558 25208
15841 25208 34678 10563 3479 -6915 31614 42493 29593 30531 22750 8867 13207 -11305 -29887
15828 -29887 -10644 -19938 427 13526 -18234 -25182 -34007 -43370 -22105 -1230 -15227 -23460 -15606
15815 -15606 -2721 6596 10114 16332 -596 -21829 -37334 -34392 -29217 -34699 -48732 -28768 -12564
$$ packed form
15905a5300K9551j6261j6933Q499Q674p511q169J5342o017j6518O105J107j350
15892a8781j9330j8189O312K7318L2045N198j6677p564J6997P124j0170o978J5743
15879A3048m124r712J1620J5870J5278L4204j2174j9424j9695k0115L349j7638
15867i513o527j1833K4324M235O974j1105k1116k0785q876J2822J8114O597J5956
15854g33J2482j9547J9104l371k3609P544J7432o873k4884K0239L671M103J9650
15841B5208R470k4115p084j0394L8529J0879j2900R38p781j3883M340k4512j8582
15828b9887J9243r294K0365J3099l1760o948q825r363K1265K0875j3997q233P854
15815a5606J2885R317L518O218j6928k1233j5505K942N175n482j4033J9964J6204
$$ plain form
15802 -12564 2404 4968 -1331 4617 -19621 -47842 -27340 -10195 -18474 51 -2851 -23530 -38480
15789 -38480 -21872 -12212 -9905 -21002 8052 12186 39153 31651 20610 9715 4537 -5822 29744
15776 29744 30919 23515 34477 67818 56489 28850 31557 20954 2781 19574 46726 23975
15764 23975 28475 17760 -7486 -32423 -18404 35304 64219 46301 -7452 -19139 -27340 -23833
15752 -23833 -42224 -31173 4411 738 -15350 -23082 -29248 -7307 8843 -15362 -32609 -32396 -24425
15739 -24425 -12882 7075 28041 17533 -14180 -9697 -19744 -27606 -1686 30125 20697 -3430
15727 -3430 21925 53717 42338 37863 32720 13749 16268 -9001 -3663 -9517 481 5016 -11658
15714 -11658 -22790 -12735 104 -15089 -11344 -8570 23392 17668 9687 10913 5638 -18269 -21341
$$ packed form
15802a2564J4968K564o299N948k4238k8221K0502J7145q279J8525k902k0679j4950
15789c8480J6608R660K307j1097K9054M134K6967p502j1041j0895n178j0359L5566
15776B9744J175p404J0962L3341j1329k7639K707j0603j8173J6793K7152k2751
15764B3975M500j0715k5246k4937J4019N3708K8915j7918n3753j1687q201L507
15752b3833j8391J1051L5584l673j6088p732o166K1941J6150k4205j7247K13P971
15739b4425J1543J9957K0966j0508l1713M483j0047p862K5920L1811r428k4127
15727c430K5355L1792j1379m475n143j8971K519k5269N338n854R998M535j6674
15714a1658j1132J0055J2839j5193L745K774L1962n724p981J226n275k3907l072
$$ plain form
15701 -21341 -24846 -47730 -38285 -35519 -34841 -52625 -63874 -56982 -25083 -35548 -33667 -3247 7917
15688 7917 -6595 -17374 -41990 -53855 -41927 -70948 -83646 -68608 -43014 -34791 -53215 -73835
15676 -73835 -33654 -17650 7837 11899 -1584 -11576 -34176 -28690 -45106 -38993 -17458 -16994 -12
15663 -12 17701 38705 13018 -11299 -31350 -13004 19970 28167 40684 12234 25140 59571
15651 59571 34227 9055 -5107 -14875 -34000 -19014 9657 32359 11949 -11259 -13487 -7379
15639 -7379 37446 30830 3129 -692 -1634 7320 36909 12877 -15234 -16278 -28924 -29025 -23689 -14523
15625 -14523 -21475 -41302 -57591 -46831 -48143 -34018 -29778 -18807 -695 21146 7311 -9738
15613 -9738 -10051 6249 15262 16149 -2233 -7031 -18693 655 32599 29033 -30619 -29629 -9983 -1070
$$ packed form
15701b1341l505k2884R445K766O78j7784j1249O892L1899j0465J881L0420J1164
15688G917j4512j0779k4616j1865J1928k9021j2698J5038K5594Q223j8424k0620
15676g3835M0181J6004K5487M062j3483r992k2600N486j6416O113K1535M64J6982
15663a2J7713K1004k5687k4317k0051J8346L2974Q197J2517k8450J2906L4431
15651E9571k5344k5172j4162r768j9125J4986K8671K2702k0410k3208k228O108
15639g379M4825o616k7701l821r42Q954K9589k4032k8111j044j2646j01N336R166
15625a4523o952j9827j6289J0760j312J4125M240J0971J8112K1841j3835j7049
15613i738l13J6300R013Q87j8382m798j1662J9348L1944l566n9652R90J9646Q913
$$ plain form
15599 -1070 -12318 -42118 -24004 4336 -4141 -5643 -16480 -31298 -15230 13184 19607 -12539
15587 -12539 -3153 2653 -40386 -52580 -21096 -4862 -21606 -30348 -33632 -27074 -2318 11077 5810
15574 5810 -12901 -18023 -1619 7586 -12534 -19125 -14713 -13175 8236 19168 -1806 3552 -11897
15561 -11897 -22829 -28393 -28443 -15654 -8286 5704 1829 18 -9359 -9283 8745 -13860 -25394 -27393
15547 -27393 -18856 -10500 9928 6359 -14326 7308 -1687 -20431 -19762 -16724 2924 -2822 9256
15534 9256 12842 26974 13278 -827 -30982 -31356 -48610 -31431 1534 31701 41660 37210 33542
15521 33542 -14586 -41783 -3046 7894 -1656 -6003 15325 48305 69388 19583 -18026 -21892
15509 -21892 -16819 -18826 -18090 -26174 -39115 10598 45491 61895 28964 11031 26329 -8523 -13769
$$ packed form
15599a070j1248k9800J8114K8340q477j502j0837j4818J6068K8414O423l2146
15587a2539R386N806m3039j2194L1484J6234j6744q742l284O558K4756J3395n267
15574E810j8711n122J6404R205k0120o591M412J538K1411J0932k0974N358j5449
15561a1897j0932n564n0J2789P368J3990l875j811r377P6J8028k2605j1534j999
15547b7393Q537Q356K0428l569k0685K1634q995j8744O69L038J9648n746J2078
15534I256L586J4132j3696j4105l0155l74j7254J7179L2965L0167R959m450l668
15521C3542m8128k7197L8737J0940r550m347K1328L2980K1083m9805l7609l866
15509b1892N073k007P36q084j2941M9713L4893J6404l2931j7933J5298l4852n246
$$ plain form
15496 -13769 1035 -14579 -30251 -39958 -39029 -27919 473 19312 18670 -5836 -9842 -19514 -16011
15483 -16011 -9939 -22155 -40596 -56227 -38608 -43496 -31795 -36852 -68538 -39444 -30282 -12443
15471 -12443 7111 24894 21682 -177 -23424 25120 29443 9407 27986 -8400 -26242 -28719
15459 -28719 -7549 11314 7407 21052 -6066 -28483 -29766 -24693 11440 33771 38595 17359
15447 17359 -20003 -21561 -13472 21113 31865 38473 17880 5399 -5803 1141 -14773 -40580
15435 -40580 -26502 -24462 -10591 13126 4641 -10169 -17535 7370 28875 23863 20788 -8980 -34083
15422 -34083 -22213 -18115 688 -18463 -29937 -11460 -25556 -28760 -78432 -88658 -79877 -61135
15410 -61135 -62269 -26483 -9783 -13718 -5812 1696 3111 -8988 -26133 -17441 -3388 37526 38338
$$ packed form
15496a3769J4804j5614j5672r707R29J1110K8392J8839o42k4506m006r672L503
15483a6011O072j2216j8441j5631J7619m888J1701n057l1686K9094R162J7839
15471a2443J9554J7783l212k1859k3247M8544M323k0036J8579l6386j7842k477
15459b8719K1170J8863l907J3645k7118k2417j283N073L6133K2331M824k1236
15447A7359l7362j558Q089L4585J0752O608k0593j2481j1202O944j5914k5807
15435d0580J4078K040J3871K3717q485j4810p366K4905K1505n012l075k9768k5103
15422c4083J1870M098J8803j9151j1474J8477j4096l204m9672j0226Q781J8742
15410f1135j134L5786J6700l935P906P508J415j2099j7145Q692J4053M0914Q12
$$ plain form
15397 38338 38163 17941 10381 4006 -9197 20975 30059 9664 3756 4505 25888 20379 -5277
15384 -5277 -13006 -21526 -9231 -23413 -13056 -859 8318 6267 14849 27956 16822 9869 11363
15371 11363 17471 -862 -46242 -43132 31900 51267 51806 14264 7596 6217 -19040 -39381 -43715
15358 -43715 -29445 -1851 7068 18296 21192 8041 -3400 -46160 -19363 -13541 -34150 -21675
15346 -21675 25635 26353 8296 3752 21022 31642 52568 49090 32184 22559 48093 16053 -4995
15333 -4995 -7307 7727 14260 8895 18727 8044 6061 -16431 -10158 4457 -23695 -17692 -1946
15320 -1946 -23346 -36888 -46684 -26555 14492 5081 -10375 -22046 -31730 -18395 -4741 12153
15308 12153 18199 29342 26238 -6221 -12557 -2965 29341 46802 37946 55186 54151 46055 34036
$$ packed form
15397C8338j75k0222p560o375j3203L0172R084k0395n908P49K1383n509k5656
15384e277p729q520J2295j4182J0357J2197R177k051Q582J3107j1134o953J494
15371A1363O108j8333m5380L110P5032J9367N39l7542o668j379k5257k0341m334
15358d3715J4270K7594Q919J1228K896j3151j1441m2760K6797N822k0609J2475
15346b1675M7310P18j8057m544J7270J0620K0926l478j6906r625K5534l2040k1048
15333d995k312J5034O533n365R832j0683j983k2492O273J4615k8152O003J5746
15320a946k1400j3542r796K0129M1047r411j5456j1671r684J3335J3654J6894
15308A2153O046J1143l104l2459o336R592L2306J7461q856J7240j035q096j2019
$$ plain form
15295 34036 17999 -4467 -7061 -18013 -16954 -36090 -38277 -5460 8269 -17245 -71491 -75286
15283 -75286 -31612 -13213 -10825 -25122 -19136 10322 13005 21745 25769 -292 19662 -701 -34260
15270 -34260 -55814 -42326 -38323 -17982 -5648 4361 -2590 -34736 -26534 -20987 12682 9833 -23552
15257 -23552 -35444 -20049 -27290 -41555 -30371 -23059 -40397 -50628 -58838 -59009 -27007 6520 4951
15244 4951 -23755 -26640 -15970 -5961 1673 -4669 19809 8716 -4907 -15313 -33703 -41652 -37732
15231 -37732 -13070 -1746 -14614 -45418 -39512 -26446 -16785 -30641 -42633 -37735 -12700 7954
15219 7954 488 -367 -3092 5419 7842 16638 20626 24601 20688 -6390 -12069 12025 8292 -25404
15205 -25404 -36074 -32259 -47996 -28240 -28938 -23290 -13640 -7779 -33936 -74995 -70808 -50066 -53476
$$ packed form
15295C4036j6037k2466k594j0952J059j9136k187L2817J3729k5514n4246l795
15283g5286M3674J8399K388j4297N986K9458K683Q740M024k6061J9954k0363l3559
15270c4260k1554J3488M003K0341J2334J0009o951l2146Q202N547L3669k849l3385
15257b3552j1892J5395p241j4265J1184P312j7338j0231q210j71L2002L3527j569
15244D951k8706k885J0670J0009P634o342K4478j1093j3623j0406j8390p949L920
15231c7732K4662J1324j2868l0804N906J3066R661j3856j1992M898K5035K0654
15219G954p466q55k725Q511K423Q796L988L975l913k7078n679K4094l733l3696
15205b5404j0670L815j5737J9756o98N648R650N861k6157m1059M187K0742l410
$$ plain form
15192 -53476 -49495 -45617 -26485 -19079 1718 19176 36133 22542 5725 -20678 643 30285
15180 30285 34721 30009 6611 12694 1833 -15917 -18198 3868 50659 46580 33055 5244 -31537
15167 -31537 -31278 -31505 -29462 -62490 -74996 -64980 -43895 -43167 -8477 2548 7635 -1584 20459
15154 20459 23435 12434 -21861 -45530 -25395 2371 20741 -1077 -13073 -27525 -15168 23580
15142 23580 20220 14460 13090 -1568 -24592 -49196 -52364 -29657 -19638 -9582 565 -1383 -1262
15129 -1262 15908 23094 21988 5494 11114 18966 8906 -7688 8216 1745 -23072 -31368 -23037
15116 -23037 12704 22045 -11527 -23987 -22241 3421 -3014 -15867 5505 15793 7790 42323
15104 42323 41794 19124 -28141 -40918 -8801 7444 9741 -22887 -17056 -37534 -18252 46
$$ packed form
15192e3476L981L878J9132P406K0797J7458J6957j3591j6817k6403K1321K9642
15180C0285M436m712k3398O083j0861j7750k281K2066M6791m079j3525k7811l6781
15167c1537K59k27K043l3028j2506J0016K1085P28L4690J1025N087r219K2043
15154B0459K976j1001l4295k3669K0135K7766J8370k1818j1996j4452J2357L8748
15142B3580l360n760j370j4658k3024k4604l168K2707J0019J0056J0147j948J21
15129a262J7170P186j106j6494N620P852j0060j6594J5904o471k4817q296Q331
15116b3037L5741R341l3572j2460J746K5662o435j2853K1372J0288q003L4533
15104D2323n29k2670m7265j2777L2117J6245K297l2628N831k0478J9282J8298
$$ plain form
15092 46 -750 10351 18256 12456 40468 47772 39799 21228 15483 21717 22415 40106 37530 22400
15078 22400 12308 11785 11419 9530 3892 3129 -8573 -8922 27884 39566 22269 1462 9476 14245
15064 14245 27264 14197 11814 178 11652 13064 20062 39012 35583 -11165 -32406 -54390
15052 -54390 -45311 -33955 -33351 -69703 -79699 -24531 26967 -8219 -7604 19093 1302 14536 42933
15039 42933 35892 26724 34339 50623 50300 47024 45881 52170 80702 41226 12108 20528 37694
15026 37694 17383 20112 -7557 2687 -11977 -24616 3737 -22167 -33333 -18546 -105 23454
15014 23454 36410 8164 -4286 4146 -4434 -32238 -48546 -45895 -14563 13119 15310 59049
15002 59049 84294 33793 14399 5648 -2773 8747 38828 48762 36733 27551 52267 86901
$$ packed form
15092D6p96J1101P905n800K8012P304p973j8571n745O234O98J7691k576j5130
15078B2400j0092n23l66j889n638p63j1702l49L6806J1682j7297k0807Q014M769
15064A4245J3019j3067k383j1636J1474J412O998J8950l429m6748k1241k1984
15052e4390R079J1356O04l6352r996N5168N1498l5186O15K6697j7791J3234K8397
15039D2933p041r168P615J6284l23l276j143O289K8532l9476k9118Q420J7166
15026C7694k0311K729k7669J0244j4664j2639K8353k5904j1166J4787J8441K3559
15014B3454J2956k8246j2450Q432q580k7804j6308K651L1332K7682K191M3739
15002E9049K5245n0501j9394q751q421J1520L0081R934j2029r182K4716L4634
$$ plain form
14990 86901 89118 49581 20227 5342 -282 -12474 -10896 -13673 -32747 -48863 -24263 -16961 -11359
14977 -11359 2139 -9172 826 10811 8699 -1721 -17560 -48118 -14060 9760 6761 38881
14965 38881 56464 38545 39262 27556 35101 31688 23630 -5181 -27677 -11469 -2649 10374 37661
14952 37661 15946 8183 14250 25443 28626 11409 4947 -1263 23787 20856 5514 23916 7435
14939 7435 13398 4665 27578 64140 39936 31437 42548 45783 35685 37003 42650 53272 28858
14926 28858 2520 -23411 -23380 2965 43765 46521 37071 14349 20448 -8452 -63102 -46244 -34902
14913 -34902 -9224 -12225 -13312 -7778 -13007 18265 48634 1808 7683 41116 46721 43010 -2057
14900 -2057 -32212 -53627 -45219 2159 6259 -3314 -19522 -41315 -32008 6073 -13082 -49702 -34611
$$ packed form
14990H6901K217l9537k9354j4885n624j2192J578k777j9074j6116K4600P302N602
14977a1359J3498j1311R998R985k112j0420j5839l0558L4058K3820k999L2120
14965C8881J7583j7919P17j1706P545l413q058k8811k2496J6208Q820J3023K7287
14952C7661k1715p763O067J1193L183j7217o462o210K5050k931j5342J8402j6481
14939G435N963q733K2913L6562k4204q499J1111L235j0098J318N647J0622k4414
14926B8858k6338k5931L1K6345M0800K756r450k2722O099k8900n4650J6858J1342
14913c4902K5678l001j087N534n229L1272L0369m6826N875L3433N605l711m5067
14900b057l0155k1415Q408M7378M100r573j6208k1793R307L8081j9155l6620J5091
$$ plain form
14887 -34611 -23442 -2378 18615 27020 34967 41664 53766 50161 14383 -7393 8236 20756
14875 20756 1942 -32767 -1454 10777 2393 8703 -8789 21816 59168 46670 13997 11584
14863 11584 8726 4334 9978 -1914 -15130 -15668 4440 19421 29495 35407 34225 10168 915
14850 915 16274 21260 12894 6137 29120 31668 -265 4074 -1794 -2727 -13883 -18697 -1575 1840
14836 1840 -10922 -30690 -50839 -52334 -36210 -37523 -44272 -44278 -39233 -19438 -12470 -31805 -38877 -19318
14822 -19318 -26116 -30770 -38725 3855 39495 38692 16787 39264 36355 24380 57160 65103 47552
14809 47552 11890 17009 20362 13815 2509 11866 18953 14515 14521 -31747 -44484 -29705 -12505 12211
14795 12211 31494 4751 -13495 -14824 6442 46178 41438 38344 54691 52450 56172 24007 11459
$$ packed form
14887c4611J1169K1064K0993Q405P947O697J2102l605l5778k1776J5629J2520
14875B0756j8814l4709L1313J2231q384O310j7492L0605L7352j2498l2673k413
14863A1584k858m392N644j1892j3216n38K0108J4981J0074N912j182k4057r253
14850I15J5359M986q366o757K2983K548l1933M339n868r33j1156m814J7122L415
14836A840j2762j9768k0149j495J6124j313o749oN045J9795O968j9335p072J9559
14822a9318o798m654p955M2580L5640q03k1905K2477k909j1975L2780P943j7551
14809D7552l5662N119L353o547j1306R357P087m438Om6268j2737J4779J7200K4716
14795A2211J9283k6743j8246j329K1266L9736m740l094J6347k241L722l2165j2548
$$ plain form
14782 11459 5559 11453 -21604 -52247 -63755 -58929 -50512 -44611 8774 -4549 -26978 -20938 -16260
14769 -16260 -17647 -49082 -43848 -45308 -57733 -47709 -41334 -53971 -31549 -20143 8385 47635
14757 47635 20141 -5361 -21011 -32870 -15650 -3759 9734 6122 -2512 21569 14323 3720
14745 3720 -1212 -26675 -2868 9782 13367 887 3146 7905 2979 7005 30670 46773 44740
14732 44740 37787 10108 -2738 -6769 -19759 -8924 -3279 -1825 387 18151 10698 21353 -4088
14719 -4088 -23745 -22246 17412 52072 42354 36929 30852 10995 2382 16553 -9056 -25730 -37976
14706 -37976 -53809 -56551 -46946 -39190 -50729 -59610 -53988 -31885 -24848 1129 21648 14045 5564
14693 5564 16286 11248 17795 15518 17319 16276 41502 46076 32840 25377 25724 21246 23412 19431
$$ packed form
14782A1459n900N894l3057l0643j1508M826Q417N901N3385j3323k2429O040M678
14769a6260j387l1435N234j460j2425J0024O375j2637K2422J1406K8528L9250
14757D7635k7494k5502j5650j1859J7220J1891J3493l612q634K4081p246j0603
14745C720m932k5463K3807J2650L585j2480K259M759m926M026K3665J6103k033
14732D4740o953k7679j2846m031j2990J0835N645J454K212J7764p453J0655k5441
14719d088j9657J499L9658L4660r718n425o077j9857q613J4171k5609j6674j2246
14706c7976j5833k742R605P756j1539q881N622K2103P037K5977K0519p603q481
14693E564J0722n038O547k277J801j043K5226M574j3236p463L47m478K166l981
$$ plain form
14679 19431 8255 22870 18827 -23131 -25838 -11947 455 23112 28252 28384 26665 26385 35527
14666 35527 10924 1305 -8566 -27625 -20840 -14311 1372 17638 -3601 -28625 -21621 31343 32836
14653 32836 1527 -15641 7827 -23711 -59398 -41302 -11086 20979 21936 13964 13242 22078 9695
14640 9695 4544 -2979 1187 -14904 -28189 -29409 -9019 14344 16988 24296 8925 -6339 -14337
14627 -14337 -12194 -5235 -13681 -35382 -2393 20506 26523 4029 -15311 -17663 -19761 -25759 -12787
14614 -12787 9586 -1665 14840 12230 39251 52604 39277 19730 10249 -9536 -10781 -23601
14602 -23601 -30285 -51048 -55468 -4882 -11573 -28802 -25106 -12434 -12813 2301 3952 17022 18622
14589 18622 -4899 -11235 -21127 320 22897 6610 -4430 -15863 1490 8407 -3351 -17060
$$ packed form
14679A9431j1176J4615m043m1958k707J3891J2402K2657N140J32j719k80R142
14666C5527k4603r619r871j9059O785O529J5683J6266k1239k5024P004N2964J493
14653C2836l1309j7168K3468l1538l5687J8096L0216L2065R57p972p22Q836j2383
14640I695n151p523M166j6091j3285j220K0390K3363K644P308j5371j5264p998
14627a4337K143O959q446k1701L2989K2899O017k2494j9340k352k098n998J2972
14614a2787K2373j1251J6505k610K7021J3353j3327j9547r481j9785j245j2820
14602b3601o684k0763m420N0586o691j7229L696J2672l79J5114J651J3070J600
14589A8622k3521o336r892K1447K2577j6287j1040j1433J7353O917j1758j3709
$$ plain form
14577 -17060 -24200 -23505 5252 41729 29989 25242 15810 -31704 -32827 -23523 -1047 33485 28432
14564 28432 13340 7848 3797 11808 14362 11056 671 20869 40131 26138 13858 11175 2103
14551 2103 -24166 -62703 -77144 -49556 -37133 -33295 -5126 25079 24078 -9103 -30028 -22049
14539 -22049 8895 6635 4445 18680 23665 4709 -4544 -16519 12282 12012 8928 4815 -10088
14526 -10088 2512 25395 20987 7134 -8383 -24496 -29034 -53336 -35813 -34175 -18103 -22794
14514 -22794 -7086 14484 29880 42613 9457 14043 16716 -6800 2967 19512 22933 40109
14502 40109 27396 3453 10568 -5078 2090 49683 62649 27280 -17323 -35593 -39705 -13160
14490 -13160 -2689 -3921 -6162 -18046 -19715 2842 -13364 -39736 -18496 1992 3383 3570 39056
$$ packed form
14577a7060p140O95K8757L6477j1740m747r432m7514j123R304K2476L4532n053
14564B8432j5092n492m051Q011K554l306j0385K0198J9262j3993j2280k683r072
14551B103k6269l8537j4441K7588J2423L838K8169L0205j001l3181k0925P979
14539b2049L0944k260k190J4235M985j8956r253j1975K8801k70l084m113j4903
14526a0088J2600K2883m408j3853j5517j6113m538k4302J7523J638J6072m691
14514b2794J5708K1570J5396J2733l3156M586K673k3516R767J6545L421J7176
14502D0109j2713k3943P115j5646P168M7593J2966l5369m4603j8270m112K6545
14490a3160J0471j232k241j1884j669K2557j6206k6372K1240K0488J391J87L5486
$$ plain form
14477 39056 21835 30883 24939 1937 8564 30738 46095 38042 8805 -7997 -23254 -31904 -36266
14464 -36266 -37723 -11756 -18659 -30244 -29649 -3726 -2137 5342 16075 19248 34051 9265 -20305
14451 -20305 -5079 39608 66643 62260 70522 53226 16552 22343 15661 -4729 -9141 -31129 -14115
14438 -14115 34620 52687 55405 71778 56310 18499 -14301 3480 5664 1917 -5475 -13108 -14460
14425 -14460 -14445 1518 21397 44855 20670 2770 4533 -15865 -15747 -28597 -26211 -4193 19529
14412 19529 31845 37297 42521 64797 67350 50544 33647 26252 22406 46197 31045 -9535 -7505
14399 -7505 426 -11019 -2999 -4998 -8658 -25607 -15181 13866 9141 -11194 13822 12050 768
14386 768 10781 20898 10349 7878 26290 47425 61114 46063 55788 36080 12701 -8902
$$ packed form
14477C9056j7221R048n944k3002O627K2174J5357q053k9237j6802j5257q650m362
14464c6266j457K5967o903j1585N95K5923J589P479J0733L173J4803k4786k9570
14451b0305J5226M4687K7035m383Q262j7296l6674N791o682k0390m412k1988J7014
14438a4115M8735J8067K718J6373j5468l7811l2800J7781K184l747p392p633j352
14425a4460J5J5963J9879K3458k4185j7900J763k0398J18j2850K386K2018K3722
14412A9529J2316N452N224K2276K553j6806j6897p395l846K3791j5152m0580K030
14399g505P931j1445Q020j999l660j6949J0426K9047m725k0335K5016j772j1282
14386G68J0013J0117j0549k471J8412K1135J3689j5051R725j9708k3379k1603
$$ plain form
14374 -8902 5260 2649 24203 45505 53672 64107 47069 9884 -7912 -6175 -21189 -21509 1784
14361 1784 35121 25878 16668 42468 52867 21758 19094 8724 5232 -3814 4846 45003 29337
14348 29337 25323 9632 30581 32020 28380 65 -11659 24641 42727 56323 42917 26832
14336 26832 14903 23780 29879 37238 23933 -16092 -34687 -47842 -12481 3515 19077 22684
14324 22684 26836 -19602 68 14215 -14175 -25552 6658 16381 -26263 -11934 -874 -8522
14312 -8522 -12999 -16293 33823 46325 1074 2293 27733 33268 24454 20920 29846 42730 66278
14299 66278 56047 36852 29376 44821 34713 24039 3637 -19491 -15985 -7574 -9082 7788
14287 7788 25362 43771 16196 17892 18654 25230 -1348 -822 -13977 -16899 -38512 -35922 -11392
$$ packed form
14374h902J4162k611K1554K1302Q167J0435j7038l7185j7796J737j5014l20K3293
14361A784L3337r243r210K5800J0399l1109k664j0370l492r046Q660M0157j5666
14348B9337m014j5691K0949J439l640k8315j1724L6300J8086J3596j3406j6085
14336B6832j1929Q877O099P359j3305m0025j8595j3155L5361J5996J5562L607
14324B2684M152m6438J9670J4147k8390j1377L2210R723m2644J4329J1060p648
14312h522m477l294N0116J2502m5251J219K5440N535q814l534Q926J2884K3548
14299F6278j0231j9195p476J5445j0108j0674k0402k3128L506Q411j508J6870
14287G788J7574J8409k7575J696P62O576k6578N26j3155k922k1613K590K4530
$$ plain form
14274 -11392 -18778 -27885 -9180 -17264 3504 23060 49089 55479 39911 18226 974 -17772
14262 -17772 -25878 -4175 6748 15894 8016 22579 64690 84698 49839 59515 61758 32367 9420
14249 9420 -3952 5827 36195 39316 5339 3198 -1123 23004 54184 64823 33771 39460 17973
14236 17973 -9450 -37358 -27678 -43205 -24364 33467 53382 11138 -3576 5489 3457 -20148
14224 -20148 -5598 -11049 3604 5384 6305 4057 -586 -30923 -44961 -18134 14093 10791 5240
14211 5240 17422 37554 38066 11939 -22429 -20445 -43985 -47310 -19764 -14021 -67315 -62017 -22993
14198 -22993 -8941 -18531 -16747 -6280 6134 -24878 -37509 -4375 -5340 13907 16501 29701 34770
14185 34770 22850 11543 -21764 -35040 -1979 27143 22575 30110 36321 31130 14362 14622 15734
$$ packed form
14274a1392p386r107J8705q084K0768J9556K6029O390j5568k1685j7252j8746
14262a7772q106K1703J0923R146p878J4563M2111K0008l4859R676K243k9391k2947
14249I420j3372R779L0368L121l3977k141m321K4127L1180J0639l1052N689k1487
14236A7973k7423k7908R680j5527J8841N7831J9915m2244j4714R065k032k3605
14224b0148J4550n451J4653J780R21k248m643l0337j4038K6827L2227l302n551
14211E240J2182K0132N12k6127l4368J984k3540l325K7546N743n3294N298L9024
14198b2993J4052r590J784J0467J2414l1012j2631L3134r65J9247K594J3200N069
14185C4770j1920j1307l3307j3276L3061K9122m568P535O211n191j6768K60J112
$$ plain form
14172 15734 17111 33045 27768 18055 -11328 -30137 -22434 -29186 -26874 -30821 -41775 -40456 -44745
14159 -44745 -17756 12100 38785 54016 39142 24846 8177 7873 -1618 -25534 -9964 13831
14147 13831 -1889 -47557 -36352 -4234 11543 27308 43767 47190 44540 30503 8159 -5648
14135 -5648 4961 1248 18619 8526 -14189 -15520 -21929 -28545 -28418 -34836 -25806 4719 -3781 -13705
14121 -13705 -21268 -34024 -48933 -20845 11637 16702 13681 24536 49631 43832 38522 23726 27143
14108 27143 30891 38083 49570 43211 35089 32946 9471 17402 23852 11191 29499 36052 18489
14095 18489 16588 -17830 -30925 -7711 -6337 -18817 -7284 5443 -7783 3543 -3770 12528
14083 12528 4319 -11865 -19306 6514 27808 60264 65908 51808 54420 39947 21606 -3494
$$ packed form
14172A5734J377J5934n277r713k9383j8809P703o752K312l947j0954J319m289
14159d4745K6989K9856K6685J5231j4874j4296j6669l04r491k3916J5570K3795
14147A3831j5720m5668J1205L2118J5777J5765J6459L423k650j4037k2344j3807
14135e648J0609l713J7371j0093k2715j331o409o616J27o418R030L0525q500r924
14121a3705p563j2756j4909K8088L2482N065l021J0855K5095n799n310j4796L417
14108B7143L748P192J1487o359q122k143k3475P931O450j2661J8308O553j7563
14095A8489j901l4418j3095K3214J374j2480J1533J2727j3226J1326p313J6298
14083A2528q209j6184p441K5820K1294L2456N644j4100K612j4473j8341k5100
$$ plain form
14071 -3494 13172 5402 -10543 -14940 25752 18561 8109 18168 39624 19194 4565 -7662
14059 -7662 -21650 -24271 21978 35727 -1005 -19286 -24206 -16396 -19987 -6043 -6397 21905 17433
14046 17433 28921 12958 1825 -1800 10649 6331 14360 19345 4467 -27905 -18271 -6406 8526
14033 8526 -11822 3463 17527 31788 21263 25158 36021 29942 9639 12093 -17005 -40767
14021 -40767 -58652 -46586 -46697 -47761 -31623 -10754 46776 42209 26097 -12499 -15282 -2139 20147
14008 20147 35108 29907 4025 -2157 10643 30155 750 -14869 -17205 -8819 -4802 -20109 -34302
13995 -34302 -26389 -19797 -19915 -285 28701 681 -27441 -5922 -13595 -6819 1883 -9413 -10710
13982 -10710 -10355 6761 17198 -25875 -21865 -2908 -21308 -13309 -2828 -13502 -46197 -72873
$$ packed form
14071c494J6666p770j5945m397M0692p191j0452J0059K1456k0430j4629j2227
14059g662j3988k621M6249J3749l6732j8281m920P810l591J3944l54K8302m472
14046A7433J1488j5963j1133l625J2449m318Q029M985j4878l2372R634J1865J4932
14033H526k0348J5285J4064J4261j0525L895J0863o079k0303K454k9098k3762
14021d0767j7885J2066j11j064J6138K0869N7530m567j6112l8596k783J3143K2286
14008B0147J4961n201k5882o182J2800J9512k9405j5619k336Q386M017j5307j4193
13995c4302P913O592j18J9630K8986k8020k8122K1519p673O776Q702j1296j297
13982a0710L55J7116J0437m3073M010J8957j8400P999J0481j0674l2695k6676
$$ plain form
13970 -72873 -55197 -9684 -6428 -29935 -20352 2663 24898 -4453 -16754 -6730 -8012 5933
13958 5933 15947 -16812 -45495 -54619 -8025 14247 8306 24447 5786 -41700 -17335 19572
13946 19572 18034 6135 15492 6664 555 15870 11918 263 4696 -3489 -29155 -53988 -36427
13933 -36427 -24177 -31648 -25667 -38111 -44023 2967 24222 1495 18257 62361 72765 65509
13921 65509 67621 64276 48254 31825 5325 14131 30589 35321 22107 15394 -704 27995 77329
13908 77329 92161 71493 28546 21597 19167 14669 -31854 -24236 -8873 -11401 7398 21013 -15516
13895 -15516 -41688 -39672 -23509 -36011 -5862 9124 19114 15157 21163 18608 -13739 -41375 -37503
13882 -37503 -15834 -20158 -9765 4884 10719 20168 54624 53004 27696 27471 21898 2870 -8914
$$ packed form
13970g2873J7676M5513L256k3507R583K3015K2235k9351j2301J0024j282J3945
13958E933J0014l2759k8683r124M6594K2272n941J6141j8661m7486K4365L6907
13946A9572j538j1899R357q828o109J5315l952j1655M433q185k5666k4833J7561
13933c6427J2250p471N981j2444n912M6990K1255k2727J6762M4104J0404p256
13921F5509K112l345j6022j6429k6500Q806J6458M732j3214o713j6098K8699M9334
13908G7329J4832k0668m2947o949k430m498m6523P618J5363k528J8799J3615l6529
13895a5516k6172K016J6163j2502L0149J4986R990l957O006k555l2347k7636L872
13882c7503K1669m324J0393J4649N835R449L4456j620k5308k25n573j9028j1784
$$ plain form
13869 -8914 -2223 24970 53425 41904 1291 -12965 -16251 -16153 -13384 -8058 -16960 1426 29076
13856 29076 33494 24286 11306 -10643 -6030 5906 10999 12701 11000 15873 17441 19596 4610
13843 4610 38669 30511 15474 30674 21388 27916 5506 5784 22395 31201 32703 64201 77153
13830 77153 50766 42755 17859 -5739 -24852 -18145 11137 41987 43771 10519 10017 25276 16446
13817 16446 31513 15730 12301 -6465 6510 6351 18192 32642 44019 67219 61288 43127
13805 43127 27478 16988 -7146 6085 6081 -24344 -18011 10376 15393 9510 7303 35259 19421
13792 19421 2071 4501 26063 50688 74933 75936 39080 26386 24976 27664 23615 23787 2583
13779 2583 -899 18878 36991 52778 58756 36083 -30 -3861 -8847 -21169 -5782 -7086 -9156
$$ packed form
13869h914O691K7193K8455j1521m0613j4256l286R8K769N326q902J8386K7650
13856B9076M418r208j2980k1949M613J1936N093J702j701M873J568K155j4986
13843D610L4059q158j5037J5200r286O528k2410K78J6611Q806J502L1498J2952
13830G7153k6387q011k4896k3598j9113O707K9282L0850J784l3252n02J5259q830
13817A6446J5067j5783l429j8766J2975j59J1841J4450J1377K3200n931j8161
13805D3127j5649j0490k4134J3231ml0425O333K8387N017n883k207K7956j5838
13792A9421j7350K430K1562K4625K4245J003l6856j2694j410K688m049J72k1204
13779B583l482J9777J8113J5787N978k2673l6113l831m986j2322J5387j304k070
$$ plain form
13766 -9156 7384 9578 12647 17177 4985 8702 31864 41198 33497 50157 33373 21884 1824
13753 1824 3361 -537 18092 40792 23831 -10018 -34142 -15907 17866 55425 28117 23004
13741 23004 16213 9484 13872 25521 12463 22055 20082 26678 12368 20526 20317 39445 47936 44401
13727 44401 9808 -2251 3333 10368 19075 26304 8827 -26418 -38782 -38856 -23457 2718 13372
13714 13372 14073 21668 48890 30773 23836 27295 7742 16172 20757 24864 34834 24219 -7369
13701 -7369 531 3163 -7710 -10062 -374 8231 25986 29942 16674 23222 -6921 5708 6287 19511
13687 19511 42581 23889 6517 743 -9170 -16873 -20037 -19520 -6928 -15205 -30609 -44554 -40972
13674 -40972 -36100 -45917 -28385 -14947 -20668 -21218 -19393 -15257 -25444 -15287 -13516 -12775 -31048 -16153
$$ packed form
13766i156J6540K194L069M530j2192L717K3162R334p701J6660j6784j1489k0060
13753A824J537l898J8629K2700j6961l3849k4124J8235L3773L7559k7308n113
13741B3004o791o729M388J1649j3058R592j973O596j4310Q158k09J9128Q491l535
13727D4401l4593j2059N584P035Q707P229j7477l5245j2364p4J5399K6175J0654
13714A3372P01P595K7222j8117o937L459j9553Q430M585M107R970j0615l1588
13701g369P900K632j0873k352R688Q605J7755L956j3268O548l0143J2629N79J3224
13687A9511K3070j8692j7372n774r913p703l164N17J2592q277j5404j3945L582
13674d0972M872r817J7532J3438n721n50J825M136j0187J0157J771P41j8273J4895
$$ plain form
13660 -16153 3247 64 -28545 -35034 -32212 -7511 -2633 -11237 -11520 -15961 -24367 -24946 -7453 -7088
13646 -7088 -11453 9307 41999 14225 -42213 -30833 -15481 27687 46029 41215 15157 10000
13634 10000 10917 702 8432 11813 32620 37237 50036 53498 47384 47198 7281 -4588 -19989
13621 -19989 -40230 -20367 -5819 -8613 -22516 -5300 -7748 -18956 -22215 -33879 -32843 -21015
13609 -21015 1418 21308 24436 30129 39471 24794 8708 16921 14785 9964 -19434 -18375 -3940
13596 -3940 -11930 -14093 -1959 -4379 -2662 -5011 -22178 6397 371 -1386 17266 44102 41978
13583 41978 30596 21172 -3023 -15084 7014 14352 14373 42107 31658 17372 64590 70209 37344
13570 37344 -13759 -21366 -2532 -10837 -29121 -3367 23761 1247 -33546 -17750 1576 2431
$$ packed form
13660a6153J9400l183k8609o489K822K4701M878q604k83m441q406n79J7493L65
13646g088m365K0760L2692k7774n6438J1380J5352M3168J8342m814k6058n157
13634A0000R17j0215P730L381K0807M617J2799L462o114j86l9917j1869j5401
13621a9989k0241J9863J4548k794j3903J7216k448j1208l259j1664J036J1828
13609b1015K2433J9890L128N693R342j4677j6086Q213k136m821k9398J059J4435
13596c940p990k163J2134k420J717k349j7167K8575o026j757J8652K6836k124
13583D1978j1382r424k4195j2061K2098P338K1K7734j0449j4286M7218N619l2865
13570C7344n1103p607J8834q305j8284K5754K7128k2514l4793J5796J9326Q55
$$ plain form
13558 2431 378 -12569 -28069 -58236 -15824 30538 57797 73524 73353 39519 -1591 -2054 -6373
13545 -6373 -8484 23832 54885 42060 24983 41128 10504 -7815 -9573 8463 24734 24948 22944
13532 22944 37662 38826 47433 34076 20549 28951 27990 23722 40757 41809 35855 34907 43553 43964
13518 43964 68957 64721 53517 59079 61282 35076 33332 45511 40250 51798 6409 -2233 21644
13505 21644 14821 20907 32226 53543 26542 -22863 -18760 22370 31522 31658 30956 47044 45095
13492 45095 25897 19753 1434 4265 7254 3149 25525 31583 633 -36786 -29658 -12634 19249
13479 19249 52440 62801 63557 51681 21719 21728 -6021 -24977 -7112 19930 16983 33255 40903
13466 40903 576 -16711 13515 7517 -23261 -38187 -35813 -32608 -20402 -37243 -26871 -33844
$$ packed form
13558B431k053j2947j5500l0167M2412M6362K7259J5727j71l3834m1110m63m319
13545f373k111L2316L1053j2825j7077J6145l0624j8319j758J8036J6271K14k004
13532B2944J4718J164Q607j3357j3527Q402r61m268J7035J052n954r48Q646M11
13518D3964K4993m236j1204N562K203k6206j744J2179n261J1548m5389q642K3877
13505B1644o823O086J1319K1317k7001m9405M103M1130R152J36p02J6088j949
13492D5095j9198o144j8319K831K989m105K2376O058l0950l7419P128J7024L1883
13479A9249L3191J0361P56j1876k9962Rk7749j8956J7865K7042k947J6272P648
13466D0903m0327j7287L0226n998l0778j4926K374L205J2206j6841J0372o973
$$ plain form
13454 -33844 -18445 -352 11725 -109 1216 7135 -6321 -26554 -2174 9081 22460 -15351
13442 -15351 -44398 -44357 -39006 -13802 -25110 -58556 -53085 -40357 -7197 12575 -10895 -5748 29709
13429 29709 15610 7330 -30812 -44216 3418 16396 -16710 -26895 -23479 -27668 -15912 -18353
13417 -18353 -12817 -1405 19546 -11490 -23545 -12220 3849 -4087 7343 -5315 -11811 -2087
13405 -2087 24298 20703 31609 47889 35143 -4008 4030 36026 27610 2401 4225 -3761 -7282
13392 -7282 -10556 -14417 -9324 6996 -9697 -15299 -26164 -26427 -15628 12966 -3802 3921 -2005
13379 -2005 5099 26692 43205 30444 27664 41411 16494 18094 24178 23607 23157 6356 -3659
13366 -3659 -1623 9415 4349 5976 7168 -6748 10546 46654 20649 955 -4607 -11472 -23001
$$ packed form
13454c3844J5399J8093J2077j1834J325N919j3456k0233K4380J1255J3379l7811
13442a5351k9047M1N351K5204j1308l3446N471J2728L3160J9772k3470N147L5457
13429B9709j4099q280l8142j3404M7634J2978l3106j0185L416m189J1756k441
13417a8353N536J1412K0951l1036j2055J1325J6069p936J1430j2658o496R724
13405b087K6385l595J0906J6280j2746l9151Q038L1996q416k5209J824p986l521
13392g282l274l861N093J6320j6693n602j0865k63J0799K8594j6768P723n926
13379b005P104K1593J6513j2761k780J3747k4917J600O084n71m50j6801j0015
13366c659K036J1038n066J627J192j3916J7294L6108k6005j9694n562o865j1529
$$ plain form
13353 -23001 8989 28478 -6885 2593 -15728 -13445 8917 -5167 -5000 -25873 -27092 -2187 16298
13340 16298 36954 65916 86517 53877 15666 -3368 -14267 -47771 -83434 -56564 -9116 -8838
13328 -8838 -3647 19620 17238 29482 26018 8880 4842 -15408 -6908 5603 -7725 -8108 4573
13315 4573 20947 19289 -7650 -23271 -74315 -80523 -65048 -43754 -19354 -14470 -14028 12474 20731
13302 20731 37230 35994 32302 24468 19915 32416 36179 76608 86365 70713 62975 48231 35748
13289 35748 22899 15999 39676 13273 21810 45850 28834 -39686 -38527 -12460 -15376 -6298 -14257
13276 -14257 -18903 -17924 -15028 -22723 -26618 -8089 7999 2577 -16784 -28645 -16437 -14679 -12642
13263 -12642 1638 19889 18829 -4019 -10834 16264 -16481 -40455 -50516 -43996 -14933 11667
$$ packed form
13353b3001L1990J9489l5363R478j8321K283K2362j4084J67k0873j219K4905J8485
13340A6298K0656K8962K0601l2640l8211j9034j0899l3504l5663K6870M7448K78
13328h838N191K3267k382J2244l464j7138m038k0250Q500J2511j3328l83J2681
13315D573J6374j658k6939j5621n1044o208J5475K1294K4400M884M42K6502Q257
13302B0731J6499j236l692p834m553J2501L763M0429R757j5652p738j4744j2483
13289C5748j2849o900K3677k6403Q537K4040j7016o8520J159K6067k916R078p959
13276a4257m646R79K896p695l895J8529J6088n422j9361j1861J2208J758K037
13263a2642J4280J8251j060k2848o815K7098l2745k3974j0061O520K9063K6600
$$ plain form
13251 11667 27411 7472 -12935 -26863 -26467 -20684 -14716 -5305 -28561 -24314 11910 18037 13377
13238 13377 27768 -3008 -24621 -25193 12194 6987 17372 6514 -2399 11328 44794 27912
13226 27912 3866 -8743 -20242 -22528 -36022 -21385 8500 4533 -19541 -25639 -14722 -17606
13214 -17606 -19666 -30140 6504 13188 14284 -15379 -35496 -28743 -28884 -25606 -43399 -32347 -10252
13201 -10252 -12013 -4158 9505 -1089 14697 44153 62736 70023 49559 8885 -7106 -10561
13189 -10561 -3124 20500 11405 7669 -22920 -41466 -53588 -29503 -28269 -19703 -20591 -23364 -31809
13176 -31809 1357 42113 14544 -19252 -31016 -39917 -45825 -49546 -30623 -51771 -93028 -67325
13164 -67325 -43080 -17819 -4857 8792 29736 32219 27182 780 -34792 -39757 -6114 -8343
$$ packed form
13251A1667J5744j9939k0407j3928L96N783N968R411k3256M247L6224O127m660
13238A3377J4391l0776k1613n72L7387n207J0385j0858q913J3727L3466j6882
13226B7912k4046j2609j1499k286j3494J4637K9885l967k4074o098J0917k884
13214a7606k060j0474L6644O684J096k9663k0117O753j41L278j7793J1052K2095
13201a0252j761P855J3663j0594J5786K9456J8583P287k0464m0674j5991l455
13189a0561P437K3624r095l736l0589j8546j2122K4085J234Q566q88k773q445
13176c1809L3166M0756k7569l3796j1764q901n908l721J8923k1148m1257K5703
13164f7325K4245K5261J2962J3649K0944K483n037k6402l5572m965L3643k229
$$ plain form
13152 -8343 -15464 -5834 1449 435 -8710 -8321 -639 15295 6924 15051 6802 -12090 -17271 1924
13138 1924 884 -6860 -4823 -7824 15472 23935 52727 79565 87014 64686 29411 7485 -11705
13125 -11705 -15389 -10982 -2556 5639 14778 37336 66654 91142 93860 56347 7637 -8768 23354
13112 23354 46651 20131 23939 29558 11311 3383 -2669 12264 22850 13190 10033 18382 16587
13099 16587 5792 -6543 3208 33971 34474 30278 14734 8426 3612 23360 -6910 -8975 -9684
13086 -9684 -29617 -37933 -12346 -19131 -9569 13668 7931 -7147 -17299 3506 36134 46956 38696
13073 38696 29185 46824 74662 65823 24267 -5306 -17519 -27131 -18684 16251 41719 25072
13061 25072 -3606 -15550 -17205 -5100 21156 20608 27211 33729 7731 -16418 8559 23151 9253
$$ packed form
13152h343p121R630P283j014r145L89P682J5934q371Q127q249j8892n181J9195
13138A924j040p744K037l001K3296Q463K8792K6838P449k2328l5275k1926j9190
13125a1705l684M407Q426Q195R139K2558K9318K4488K718l7513m8710j6405L2122
13112B3354K3297k6520L808N619j8247p928o052J4933J0586r660l157Q349j795
13099A6587j0795j2335R751L0763N03m196j5544o308m814J9748l0270k065p09
13086i684j9933q316K5587o785R562K3237n737j5078j0152K0805L2628J0822q260
13073C8696r511J7639K7838q839m1556k9573j2213r612Q447L4935K5468j6647
13061B5072k8678j1944j655J2105K6256n48O603O518k5998k4149K4977J4592j3898
$$ plain form
13048 9253 -4208 -11795 -14546 -20823 -11013 -8848 3608 4240 -1895 16313 15022 17432 7543 22339
13034 22339 29601 17401 24983 24158 26129 17111 32685 19742 23180 35345 23113 15699 17923
13021 17923 8632 15090 -9932 -10590 7639 -9068 -31063 -44492 -46027 -40850 -1305 1855 27289
13008 27289 42329 30521 19280 18463 24885 13671 18149 14260 15246 4083 -3062 -38697 -64211
12995 -64211 -64684 -41105 -40317 -29923 -18392 4498 15435 27426 26500 3805 -22524 -14770 2891
12982 2891 6122 10746 21801 20661 17807 34310 25096 37310 46772 55292 23461 -3144 8529
12969 8529 8385 6693 -5180 -14718 15447 13172 12743 4210 -24392 -13594 25487 19746 29290 13137
12955 13137 -16636 -31759 2268 9405 3988 7363 23104 49084 55579 51125 25124 -5703 -3538
$$ packed form
13048I253j3461p587k751o277R810K165J2456O32o135J8208j291K410r889J4796
13034B2339P262j2200P582q25J971r018J5574j2943L438J2165j2232p414K224
13021A7923r291O458k5022o58J8229j6707k1995j3429j535N177L9545L160K5434
13008B7289J5040j1808j1241q17O422j1214M478l889R86j1163p145l5635k5514
12995f4211m73K3579P88J0394J1531K2890J0937J1991r26k2695k6329P754J7661
12982B891L231M624J1055j140k854J6503r214J2214R462Q520l1831k6605J1673
12969H529j44j692j1873r538L0165k275m29q533k8602J0798L9081n741R544j6153
12955A3137k9773j5123L4027P137n417L375J5741K5980O495m454k6001l0827K165
$$ plain form
12942 -3538 18018 6673 -16592 12990 6259 -201 16790 38234 61414 62299 39450 29412 -319
12929 -319 -8101 -16950 14719 34902 15164 -22048 -9327 17709 32037 19942 -8928 -4596 11479
12916 11479 24707 48755 38780 20201 17675 -24215 -45889 -32296 -2229 -23523 -33624 -34752
12904 -34752 -40003 -12834 25650 38654 39930 67429 53909 26503 -9373 -15599 -16505 25282 75093
12891 75093 76685 48209 19662 9191 849 -17070 12757 41054 26614 9330 -9756 -47016
12879 -47016 -51645 -17472 -8103 -51823 -61320 -54112 -30050 -23412 -4906 11932 35669 47065 28342
12866 28342 14327 -4602 10148 26184 -1724 -9264 19938 38517 28241 38213 34536 -14750
12854 -14750 -17599 1326 10269 -21197 -34990 -20247 25609 28878 31575 25873 15947 25709 31269
$$ packed form
12942c538K1556j1345k3265K9582o731o460J6991K1444K3180Q85k2849j0038k9731
12929c19p782q849L1669K0183j9738l7212J2721K7036J4328j2095k8870M332J6075
12916A1479J3228K4048r975j8579k526m1890k1674J3593L0067k1294j0101j128
12904c4752n251K7169L8484J3004J276K7499j3520k7406l5876o226r06M1787M9811
12891G5093J592k8476k8547j0471q342j7919K9827K8297j4440j7284j9086l7260
12879d7016m629L4173R369m3720r497P208K4062O638J8506J6838K3737J1396j8723
12866B8342j4015j8929J4750J6036k7908p540K9202J8579j0276R972l677m9286
12854a4750k849J8925Q943l1466j3793J4743M5856L269K697n702r926R762N560
$$ plain form
12841 31269 21795 18471 21072 11210 13330 7358 -1297 -9222 -10091 7309 18575 5080 -7255 -33122
12827 -33122 -49703 -57545 -44846 -9642 3506 -11358 -1426 -963 -907 -276 3979 13021 -9571 -18219
12813 -18219 -3225 19194 56435 89757 95613 75213 64945 34907 1224 8442 9317 4156 12406
12800 12406 42376 33538 46437 29058 24208 33293 69554 50199 41455 38467 14909 9672 7611
12787 7611 6843 33801 57316 16858 -12363 -7271 -2821 9839 6847 -17201 -13682 -24955 -35450
12774 -35450 -5886 20751 34265 19156 22060 26661 36574 48183 15370 -4375 -19681 -25759
12762 -25759 -53211 -47192 -24322 -26893 -26541 -38736 -30092 -25516 -31549 2203 32245 24543 1111
12749 1111 -24391 -24640 -50307 -24513 -25171 -16643 -142 20487 11287 24209 12451 -4512 -10882
$$ packed form
12841C1269r474l324K601r862K120n972q655p925q69J7400J1266j3495j2335k5867
12827c3122j6581p842J2699L5204J3148j4864R932M63N6O31M255R042k2592q648
12813a8219J4994K2419L7241L3322N856k0400j0268l0038l3683P218Q75n161Q250
12800A2406K9970q838J2899j7379m850R085L6261j9355q744k988k3558n237k061
12787G611p68K6958K3515m0458k9221N092M450J2660k992k4048L519j1273j0495
12774c5450K9564K6637J3514j5109K904M601R913J1609l2813j9745j5306o078
12762b5759k7452O019K2870k571L52j2195Q644M576o033L3752L0042p702k3432
12749A111k5502k49k5667K5794o58Q528J6501K0629r200J2922j1758j6963o370
$$ plain form
12736 -10882 -16472 13604 28682 21645 35000 39075 57898 95859 72787 35214 44421 49379 51606
12723 51606 43277 44003 62088 64777 74642 70434 48698 15754 -2143 17535 18605 23146 34216
12710 34216 12322 1875 -12945 5663 26678 24524 22308 25032 53827 32142 7160 -9373
12698 -9373 8088 28844 17335 11086 -779 3426 -5780 -16869 -29382 -12797 -31866 -55161
12686 -55161 -29126 -399 16789 9634 6428 -2578 10543 9421 11850 27896 35970 25570 27469
12673 27469 26559 3629 4615 19997 15729 20614 34145 35447 17412 -35564 -47665 -6185 11123
12660 11123 17403 21435 18653 6768 17139 5104 1995 90 -3860 13910 -227 -5796 -1325
12647 -1325 -4836 41741 49129 714 14859 20847 -1345 -27866 -38360 -34243 -22286 590 4694
$$ packed form
12736a0882n590L0076J5078p037J3355M075J8823L7961k3072l7573R207M958K227
12723E1606q329P26J8085K689R865m208k1736l2944j7897J9678J070M541J1070
12710C4216k1894j0447j4820J8608K1015k154k216K724K8795k1685k4982j6533
12698i373J7461K0756j1509o249j1865M205r206j1089j2513J6585j9069k3295
12686e5161K6035K8727J7188p155l206r006J3121j122K429J6046Q074j0400J899
12673B7469r10k2930R86J5382m268M885J3531J302j8035n2976j2101M1480J7308
12660A1123O280M032k782j1885J0371j2035l109j905l950J7770j4137n569M471
12647a325l511M6577P388m8415J4145N988k2192k6521j0494M117J1957K2876M104
$$ plain form
12634 4694 -6402 -18401 -34020 -27087 -6218 -6751 -4788 -1151 13723 24736 33156 26987 29625
12621 29625 39180 14746 -283 21435 -23579 -27236 -1304 27715 34391 13642 3686 21490
12609 21490 4292 -13679 -34085 -13890 -5776 533 -8214 -4342 14310 6767 -4455 21906 32039
12596 32039 16861 2943 -20716 -12468 -606 1102 5389 8661 28899 54120 35564 19811
12584 19811 11435 12040 22541 -19797 -6662 14582 32819 32437 -15538 -35265 -17451 -21918 -20085
12571 -20085 -6158 -13748 -16201 -5110 -5953 -9433 -3139 -13926 -13436 -16179 11419 57034 47056 16254
12557 16254 -2347 -23878 -19374 5995 13026 11910 -9106 -16603 10562 16091 -31526 -3049 16095
12544 16095 -1092 -15262 -12588 -16176 -29806 -19367 -2214 -10591 -3852 31372 40929 30197 30434
$$ packed form
12634D694j1096j1999j5619O933K0869n33J963L637J4874J1013Q420o169K638
12621B9625R555k4434j5029K1718m5014l657K5932K9019O676k0749r956J7804
12609B1490j7198j7971k0406K0195Q114O309q747L872J8652p543j1222K6361J0133
12596C2039j5178j3918k3659Q248J1862J708M287L272K0238K5221j8556j5753
12584A9811q376O05J0501m2338J3135K1244J8237l82m7975j9727J7814m467J833
12571b0085J3927p590k453J1091q43l480O294j0787M90k743K7598M5615r978l0802
12557A6254j8601k1531M504K5369P031j116k1016p497K7165N529m7617K8477J9144
12544A6095j7187j4170K674l588j3630J0439J7153q377O739L5224R557j0732K37
$$ plain form
12531 30434 19459 15034 2043 -4708 -19906 -19280 4671 -7237 7576 8241 3169 3389 -20271
12518 -20271 -250 40164 35179 11122 -17491 -20086 9826 41158 29569 -5529 -12577 7584
12506 7584 21997 17695 832 -2538 10892 8976 26507 47943 41543 25088 11372 23512 25180
12493 25180 51339 64310 37098 22324 24973 37767 28782 -6519 13931 25157 -5717 -34265
12481 -34265 -39075 -21583 -13623 -25294 -15136 -4280 -21435 -35209 -24065 -1123 18904 19554
12469 19554 10845 -54 -27331 -14195 26705 32928 21878 12954 24894 28859 55584 71306
12457 71306 21466 -11022 -13688 -19170 -23171 -14466 -16240 -12325 747 9834 -14309 -17014 -1602
12444 -1602 7812 27667 30740 37420 23600 2064 19332 18580 17351 15915 15843 302 5709 35869
$$ packed form
12531C0434j0975m425j2991o751j5198O26K3951j1908J4813O65n072K20k3660
12518b0271K0021M0414m985k4057k8613k595K9912L1332j1589l5098p048K0161
12506G584J4413m302j6863l370J3430j916J7531K1436o400j6455j3716J2140J668
12493B5180K6159J2971k7212j4774K649J2794q985l5301K0450J1226l0874k8548
12481c4265m810J7492P960j1671J0158J0856j7155j3774J1144K2942K0027O50
12469A9554q709j0899k7277J3136M0900O223j1050q924J1940L965K6725J5722
12457G1306m9840l2488k666n482m001Q705j774L915J3072R087k4143k705J5412
12444a602R414J9855L073O680j3820k1536J7268p52j229j436p2j5541N407L0160
$$ plain form
12430 35869 23867 19035 17863 17166 92 -35634 -48902 -42102 -5552 4453 16251 18380 -8091
12417 -8091 -8949 -13075 -51874 -47364 -23145 318 7502 35346 35318 29479 29008 25299 33126 23852 43339
12402 43339 32772 10677 -12012 -20775 -7622 17948 31570 3762 7702 30793 31008 -37491
12390 -37491 -67629 -67377 -38308 1219 9287 -7926 -16224 19515 35074 18353 17004 4368 -1003
12377 -1003 -16928 -31221 -20486 -5239 -14758 12726 4987 -3329 -14636 -12004 4424 18894 28461
12364 28461 17450 6284 -4181 -5069 -8333 -20293 21624 32668 17361 1253 41478 61673
12352 61673 66344 49444 50540 68465 48028 11230 -20486 -22999 -6803 10918 30743 33826
12340 33826 10922 1400 11187 -9142 -2562 -15362 -23552 -3201 3583 14165 20617 41033 13347
$$ packed form
12430C5869j2002m832j172o97j7074l5726j3268O800L6550J0005J1798K129k6471
12417h091q58m126l8799M510K4219K3463P184K7844k8n839m71l709P827r274J9487
12402D3339j0567k2095k2689q763J3153K5570J3622k7808L940K3091K15o8499
12390c7491l0138K52K9069L9527Q068j7213q298L5739J5559j6721j349j2636n371
12377a003j5925j4293J0735J5247r519K7484p739q316j1307K632J6428J4470R567
12364B8461j1011j1166j0465q88l264j1960M1917J1044j5307j6108M0225K0195
12352F1673M671j6900J096J7925k0437l6798l1716k513J6196J7721J9825L083
12340C3826k2904r522R787k0329O580j2800q190K0351O784J0582O452K0416k7686
$$ plain form
12327 13347 -12384 -14614 -3831 3138 11929 49922 55499 1915 -2054 -1017 20652 18806 38278
12314 38278 27406 16846 53300 63636 74320 19910 -36738 -21135 -2099 28208 12587 -12849
12302 -12849 -12114 8444 19477 -2815 -917 28906 40175 15839 -5941 -8469 909 30232 42831
12289 42831 13493 3123 7461 2676 -13762 -15386 -6205 9518 9791 3196 -8608 -5632 -9488
12276 -9488 65 13309 46381 34386 25279 55586 57778 55987 47914 56122 74271 74970 64009
12263 64009 65202 36081 -389 3082 7033 4001 -5703 -32058 -569 1694 -2117 27711 32081
12250 32081 3833 6671 8502 31227 21026 11992 2620 3167 12638 22131 7083 28 -2026 18828
12236 18828 24094 8031 -13625 -26167 -44736 -43808 -36689 -11481 1598 -31889 -70548 -63288 -39038
$$ packed form
12327A3347k5731k230J0783O969Q791L7993N577n3584l969J037K1669j846J9472
12314C8278j0872j0560L6454J0336J0684n4410n6648J5603J9036L0307j5621k5436
12302a2849P35K0558J1033k2292J898K9823J1269k4336k1780k528R378K9323J2599
12289D2831k9338j0370M338m785j6438j624R181J5723K73o595j1804K976l856
12276i488R553J3244L3072j1995r107L0307K192j791q073Q208J8149O99j0961
12263F4009J193k9121l6470L471L951l032r704k6355L1489K263l811K9828M370
12250C2081k8248K838J831K2725j0201r034r372N47R471R493j5048p055k054K0854
12236A8828N266j6063k1656j2542j8569R28P119K5208J3079l3487l8659P260K4250
$$ plain form
12223 -39038 -17168 -33455 -32642 -25183 -52217 -82099 -56634 -1386 36456 26366 9158 -30014
12211 -30014 -24887 -30801 -38067 -29048 -3542 -4932 14947 -12520 7698 -8128 -17216 -11993 -19275
12198 -19275 -29066 -23486 -21307 -13031 -9767 9986 22387 2567 -10221 3542 41801 55048 39330
12185 39330 42204 19192 -6984 -8626 -16289 -20399 -32380 -32152 -38625 -35368 -45108 -55277 -41861
12172 -41861 -11565 -11814 -15247 -18965 1375 4332 -3998 5425 12862 2716 -3993 -7985 -32100 -50104
12158 -50104 -20478 22175 10053 12002 4213 -7705 -11929 -8930 15630 -943 -19045 -17307 -23868
12145 -23868 3535 19448 7641 4406 -11558 2975 10980 -330 -1203 8048 24448 19066 1827
12132 1827 10760 -16169 -37277 -44171 -52968 -39878 -12783 -18799 -28620 -15775 6669 11576 -8018
$$ packed form
12223c9038K1870j6287Q13P459k7034k9882K5465N5248L7842j0090j7208l9172
12211c0014N127n914p266R019K5506j390J9879k7467K0218j5826r088N223p282
12198a9275r791N580K179Q276L264J9753J2401j9820j2788J3763L8259J3247j5718
12185C9330K874k3012k6176j642p663m110j1981K28o473L257r740j0169J3416
12172d1861L0296k49l433l718K0340K957q330R423P437j0146o709l992k4115j8004
12158e0104K9626M2653j2122J949p789j1918m224K999K4560j6573j8102J738o561
12145b3868K7403J5913j1807l235j5964J4533Q005j1310q73R251J6400n382j7239
12132A827Q933k6929k1108o894q797J3090K7095o016r821J2845K2444M907j9594
$$ plain form
12119 -8018 -2348 22085 35345 24864 47465 48792 10644 12546 26548 26820 4124 -9940 -7737
12106 -7737 -6534 -16752 -6527 40704 79871 71032 55761 23828 43269 90630 56016 28044
12094 28044 28508 28441 -5233 -28225 -90232 -71900 -22834 -19810 -34431 -37370 -21360 3223 10609
12081 10609 40348 63967 36455 -4527 -17756 47 -4198 -17982 -32990 -22310 -1485 -129
12069 -129 5306 -21348 14805 11013 -16994 -25706 -33437 -25624 -32382 -26340 -47768 -52103 -45518 -11863
12055 -11863 970 16980 9819 -2500 -23580 -32937 -31326 -38095 -45330 -47073 -12586 -22073 -24612
12042 -24612 -50194 -50327 -33126 -17707 4818 -12465 -16933 8470 40630 28291 -4612 -1525
12030 -1525 14468 5501 -748 -5734 15050 4072 2335 -13389 -14947 12376 30160 3125 -9732
$$ packed form
12119h018N670K4433J3260j0481K2601J327l8148J902J4002K72k2696j4064K203
12106g737J203j0218J0225M7231L9167q839j5271l1933J9441M7361l4614k7972
12094B8044M64o7l3674k2992o2007J8332M9066L024j4621k939J6010K4583P386
12081A0609K9739K3619k7512m0982j3229J7803m245j3784j5008J0680K0825J356
12069a29N435k6654L6153l792k8007q712p731P813o758O042k1428m335O585L3655
12055a1863J2833J6010p161j2319k1080r357J611o769p235j743L4487r487k539
12042b4612k5582j33J7201J5419K2525j7283m468K5403L2160j2339l2903L087
12030a525J5993q967o249m986K0784j0978j737j5724j558K7323J7784k7035j2857
$$ [...]
##END NTUPLES=NMR SPECTRUM
##END=
