##TITLE=Analysis number 328346
Compound Code sp 01369
Project Code adrs
Chemist Name aci
##JCAMPDX= 6.0         $$ Bruker NMR JCAMP-DX V2.0
##DATA TYPE= NMR SPECTRUM
##DATA CLASS= NTUPLES
##ORIGIN= Bruker BioSpin GmbH
##OWNER= nmr
$$ XWIN-NMR		Version 3.5
$$ Tue May 29 13:07:21 2007 GMT Daylight Time (UT+1h)  MAYBRIDGE\nmr@NMR_250MHZ
##.OBSERVE FREQUENCY= 250.131544655141
##.OBSERVE NUCLEUS= ^1H
##.ACQUISITION MODE= SIMULTANEOUS (DQD)
##.ACQUISITION SCHEME= undefined
##.AVERAGES= 16
##.DIGITISER RES= 18
##SPECTROMETER/DATA SYSTEM= dpx250
##.PULSE SEQUENCE= zg30
##.SOLVENT NAME= CDCl3
##.SHIFT REFERENCE= (INTERNAL, CDCl3, 0, 16.4511)
##AUDIT TRAIL= $$ (NUMBER, WHEN, WHO, WHERE, WHAT)
$$ ##TITLE= Audit trail, XWIN-NMR		Version 3.5
$$ ##JCAMPDX= 5.01
$$ ##ORIGIN= Bruker BioSpin GmbH
$$ ##OWNER= nmr
$$ C:\u/data/dgb/nmr/ADRS/1640/pdata/1/auditp.txt
$$ ##AUDIT TRAIL=  $$ (NUMBER, WHEN, WHO, WHERE, WHAT)
(   1,<2007-05-29 13:06:58.71 +100>,<MAYBRIDGE\nmr>,<NMR_250MHZ>,
      <created by zg, POWCHK disabled, PULCHK disabled
       configuration hash MD5:
       76 6E 9A 78 1E 09 19 81 EC 84 63 8F B0 6A 59 2D
       data hash MD5: 64K
       36 CB C1 C6 C6 3D 7D 1C 62 05 AD 57 74 96 BC AA>)
(   2,<2007-05-29 13:07:11.40 +100>,<MAYBRIDGE\nmr>,<NMR_250MHZ>,
      <Start of raw data processing
       ef LB = 0.3 FT_mod = 6 PKNL = 1 SI = 32K 
       data hash MD5: 32K
       2F 7B 1E 82 5A 19 2D 7A 3A 8E 14 F1 B6 8E A8 94>)
(   3,<2007-05-29 13:07:13.03 +100>,<MAYBRIDGE\nmr>,<NMR_250MHZ>,
      <apk 
       data hash MD5: 32K
       61 CA 0A C9 98 C2 EB E3 DC 62 44 DD 6B C7 3A DB>)
(   4,<2007-05-29 13:07:13.71 +100>,<MAYBRIDGE\nmr>,<NMR_250MHZ>,
      <abs ABSG = 5 
       data hash MD5: 32K
       BD CB 62 C7 E6 57 96 80 DB AC B6 30 34 C1 D1 85>)
$$ ##END=
$$ 
$$ hash MD5
$$ 23 E2 70 69 36 D6 B8 00 D1 24 3B 9F 60 17 94 C9
##$RELAX= 
##$RELAX= 
##$RELAX= 
##$RELAX= 
##$RELAX= 
##$RELAX= 
##$RELAX= 
$$ Bruker specific parameters
$$ --------------------------
##$DU= <C:\u>
##$EXPNO= 1640
##$NAME= <ADRS>
##$PROCNO= 1
##$TYPE= <nmr>
##$USER= <dgb>
##$AMP= (0..31)
100 100 100 100 100 100 100 100 100 100 100 100 100 100 100 100 100 100 
100 100 100 100 100 100 100 100 100 100 100 100 100 100 
##$AQSEQ= 0
##$AQ_mod= 3
##$AUNM= <au_zg>
##$AUTOPOS= <22 >
##$BF1= 250.13
##$BF2= 250.13
##$BF3= 250.13
##$BF4= 250.13
##$BF5= 500.13
##$BF6= 500.13
##$BF7= 500.13
##$BF8= 500.13
##$BYTORDA= 1
##$CFDGTYP= 0
##$CFRGTYP= 5
##$CHEMSTR= <none>
##$CNST= (0..31)
1 1 145 1 1 1 1 1 1 1 1 1 1 1 1 1 1 1 1 1 1 1 1 1 1 1 1 1 1 1 1 1 
##$CPDPRG= <>
##$CPDPRG1= <>
##$CPDPRG2= <>
##$CPDPRG3= <>
##$CPDPRG4= <mlev>
##$CPDPRG5= <mlev>
##$CPDPRG6= <mlev>
##$CPDPRG7= <mlev>
##$CPDPRG8= <mlev>
##$CPDPRGB= <>
##$CPDPRGT= <>
##$D= (0..31)
0 1 0 0 0 0 0 0 0 0.06 0 0 0 0 0 0 0.0002 0 0 0 0 0 0 0 0 0 0 0 0 0 0 
0 
##$DATE= 1180440417
##$DBL= (0..7)
120 120 120 120 120 120 120 120 
##$DBP= (0..7)
150 150 150 150 150 150 150 150 
##$DBP07= 0
##$DBPNAM0= <>
##$DBPNAM1= <>
##$DBPNAM2= <>
##$DBPNAM3= <>
$$ [...]
##$SUBNAM7= <"">
##$SUBNAM8= <"">
##$SUBNAM9= <"">
##$SW= 20.6930455092707
##$SWIBOX= (0..15)
0 0 3 0 0 0 0 0 0 0 0 0 0 0 0 0 
##$SW_h= 5175.983436853
##$TD= 65536
##$TD0= 1
##$TE= 683.16
##$TE2= 300
##$TE3= 300
##$TEG= 300
##$TL= (0..7)
0 120 120 120 120 120 120 120 
##$TP= (0..7)
150 150 150 150 150 150 150 150 
##$TP07= 0
##$TPNAME0= <>
##$TPNAME1= <>
##$TPNAME2= <>
##$TPNAME3= <>
##$TPNAME4= <>
##$TPNAME5= <>
##$TPNAME6= <>
##$TPNAME7= <>
##$TPOAL= (0..7)
0.5 0.5 0.5 0.5 0.5 0.5 0.5 0.5 
##$TPOFFS= (0..7)
0 0 0 0 0 0 0 0 
##$TUNHIN= 0
##$TUNHOUT= 0
##$TUNXOUT= 0
##$USERA1= <user>
##$USERA2= <user>
##$USERA3= <user>
##$USERA4= <user>
##$USERA5= <user>
##$V9= 5
##$VALIST= <valist>
##$VCLIST= <CCCCCCCCCCCCCCC>
##$VD= 0
##$VDLIST= <DDDDDDDDDDDDDDD>
##$VPLIST= <PPPPPPPPPPPPPPP>
##$VTLIST= <TTTTTTTTTTTTTTT>
##$WBST= 1024
##$WBSW= 4
##$XGAIN= (0..3)
0 0 0 0 
##$XL= 0
##$YL= 0
##$YMAX_a= 226107
##$YMIN_a= -115810
##$ZGOPTNS= <>
##$ZL1= 120
##$ZL2= 120
##$ZL3= 120
##$ZL4= 120
##$ABSF1= 16.45106
##$ABSF2= -4.242113
##$ABSG= 5
##$ABSL= 3
##$ALPHA= 0
##$AQORDER= 0
##$ASSFAC= 0
##$ASSFACI= 0
##$ASSFACX= 0
##$ASSWID= 0
##$AUNMP= <proc_1d>
##$AZFE= 0.1
##$AZFW= 0.1
##$BCFW= 0
##$BC_mod= 0
##$BYTORDP= 0
##$COROFFS= 0
##$CY= 12.5
##$DATMOD= 1
##$DC= 0
##$DFILT= <>
##$DTYPP= 0
##$F1P= 14.0000005364418
##$F2P= -0.99999901652339
##$FCOR= 0.5
##$FTSIZE= 32768
##$FT_mod= 6
##$GAMMA= 0
##$GB= 0
##$INTBC= 1
##$INTSCL= 1
##$ISEN= 128
##$LB= 0.3
##$LEV0= 0
##$LPBIN= 0
##$MAXI= 10000
##$MC2= 0
##$MEAN= 0
##$ME_mod= 0
##$MI= 0
##$NCOEF= 0
##$NC_proc= -5
##$NLEV= 6
##$NOISF1= 0
##$NOISF2= 0
##$NSP= 0
##$NTH_PI= 0
##$NZP= 0
##$OFFSET= 16.45106
##$PC= 1
##$PHC0= -45.14725
##$PHC1= 6.429617
##$PH_mod= 1
##$PKNL= yes
##$PPARMOD= 0
##$PSCAL= 4
##$PSIGN= 0
##$REVERSE= no
##$SF= 250.130017742603
##$SI= 32768
##$SIGF1= 0
##$SIGF2= 0
##$SINO= 400
##$SIOLD= 32768
##$SREGLST= <1H.CDCl3>
##$SSB= 0
##$STSI= 32768
##$STSR= 0
##$SW_p= 5175.98343685301
##$SYMM= 0
##$S_DEV= 0
##$TDeff= 65536
##$TDoff= 0
##$TI= <Analysis number 999999
Compound Code 99
Book Reference 9
Project Code 9>
##$TILT= no
##$TM1= 0
##$TM2= 0
##$TOPLEV= 0
##$USERP1= <user>
##$USERP2= <user>
##$USERP3= <user>
##$USERP4= <user>
##$USERP5= <user>
##$WDW= 1
##$XDIM= 32768
##$YMAX_p= 510139318
##$YMIN_p= -700006
$$ End of Bruker specific parameters
$$ ---------------------------------
##NTUPLES= NMR SPECTRUM
##VAR_NAME=  FREQUENCY,     SPECTRUM/REAL,   SPECTRUM/IMAG
##SYMBOL=    X,             R,               I
##VAR_TYPE=  INDEPENDENT,   DEPENDENT,       DEPENDENT
##VAR_FORM=  AFFN,          ASDF,            ASDF
##VAR_DIM=   32768,         32768,           32768
##UNITS=     HZ,            ARBITRARY UNITS, ARBITRARY UNITS
##FACTOR=    0.157963299565203, 1,           1
##FIRST=     4114.90376495667, 0,            0
##LAST=      -1061.07967189634, 0,           0
##MIN=       -1061.07967189634, -700006,     0
##MAX=       4114.90376495667, 510139318,    0
$$ Real data points
##PAGE= N=1
##DATA TABLE= (X++(R..R)), XYDATA
$$ [...]
$$ plain form
24770 2028587 1924500 1751689 1744695 1839400 1904012 1779737 1544109 1586230 1631240 1597985 1550357
24759 1550357 1418941 1398588 1407567 1565769 1710635 1790314 1874748 1861841 1969642 1959683 1813753
24748 1813753 1742009 1678476 1791248 1775419 1532360 1448260 1484512 1471234 1615001 1518326 1496542
24737 1496542 1718096 1944022 1924075 1622554 1533260 1490186 1549270 1563404 1577198 1591690 1597529
24726 1597529 1724198 1709108 1478179 1404720 1406210 1240600 1205518 1174996 1098125 1311412 1547148
24715 1547148 1453965 1281803 1291838 1462606 1554268 1666955 1685110 1729474 1771271 1773894 1753079
24704 1753079 1707344 1672396 1616296 1677474 1732435 1772265 1646311 1474360 1484226 1381967 1275047
24693 1275047 1270537 1372945 1432807 1565370 1594394 1510609 1478861 1521679 1441136 1264702 1358561
$$ packed form
24770B028587j04087j72811o994R4705O4612j24275k35628M2121M5010l3255m7628
24759A550357j31416k0353Q979J58202J44866P9679Q4434j2907J07801r959j45930
24748A813753p1744o3533J12772j5829k43059q4100L6252j3278J43767r6675k1784
24737A496542K21554K25926j9947l01521q9294m3074N9084J4134J3794J4492N839
24726A597529J26669j5090k30929p3459J490j65610l5082l0522p6871K13287K35736
24715A547148r3183j72162J0035J70768R1662J12687J8155M4364M1797K623k0815
24704A753079m5735l4948n6100O1178N4961L9830j25954j71951R866j02259j06920
24693A275047m510J02408N9862J32563K9024q3785l1748M2818q0543j76434R3859
$$ plain form
24682 1358561 1485223 1465444 1426378 1474054 1235298 1199473 1191233 1223693 1262807 1216491 1072505
24671 1072505 1089636 1219782 1282193 1219746 1404913 1492847 1252066 1112575 1223460 1311635
24661 1311635 1406171 1442294 1469741 1198689 1055543 1155347 1159865 1175598 1006685 1010013 1065927
24650 1065927 1147212 1224432 1372716 1384917 1281140 1161639 1024784 998948 1087314 1070913
24640 1070913 1159091 1208519 1282070 1265601 1280286 1250055 1252944 1195995 1076711 1051135 1043831
24629 1043831 1146472 1287261 1129258 876520 790785 874581 924679 861663 901484 941109
24619 941109 1067831 1101546 1007860 1016358 888442 848201 922439 833380 1013426 1071386 753130
24608 753130 823639 995903 964254 1023643 1019439 1000106 1058658 1122205 1035803 853765 959167
$$ packed form
24682A358561J26662j9779l9066M7676k38756l5825q240L2460L9114m6316j43986
24671A072505J7131J30146O2411o2447J85167Q7934k40781j39491J10885Q8175
24661A311635R4536L6123K7447k71052j43146R9804M518J5733j68913L328N5914
24650A065927Q1285P7220J48284J2201j03777j19501j36855k5836Q8366j6401
24640A070913Q8178M9428P3551j6469J4685l0231K889n6949j19284k5576p304
24629A043831J02641J40789j58003k52738q5735Q3796N0098o3016L9821L9625
24619I41109J26722L3715r3686Q498j27916m0241P4238q9059J80046N7960l18256
24608G53130P0509J72264l1649N9389m204j9333N8552O3547q6402j82038J05402
$$ plain form
24597 959167 1043823 863057 726592 822891 868081 669539 755112 875375 989939 1003995
24587 1003995 807008 716554 725555 702363 711839 741744 855781 831903 715352 766504 931603
24576 931603 961203 857583 907352 909797 868466 875439 791545 824110 907703 880932 943414 854100
24564 854100 898674 957949 1003984 760262 780150 739815 686444 720195 657370 592186 359263
24553 359263 188608 388919 578398 574132 697144 799614 680442 539677 586205 653265
24543 653265 663382 712824 771657 685306 503756 454608 657401 704803 853123 888995 731605
24532 731605 852724 875449 847404 761639 519630 602461 721020 679272 427117 388579 610240
24521 610240 645036 717270 741487 674454 750375 710833 790875 617765 605204 686012 766129
$$ packed form
24597I59167Q4656j80766j36465R6299M5190j98542Q5573J20263J14564J4056
24587A003995j96987r0454R001k3192R476K9905J14037k3878j16551N1152J65099
24576I31603K9600j03620M9769K445m1331O973q3894L2565Q3593k6771O2482q9314
24564H54100M4574N9275M6035k43722J9888m0335n3371L3751o2825o5184k32923
24553C59263j70655K00311J89479m266J23012J02470j19172j40765M6528O7060
24543F53265J0117M9442N8833q6351j81550m9148K02793M7402J48320L5872j57390
24532G31605J21119K2725k8045q5765k42009Q2831J18559m1748k52155l8538K21661
24521F10240L4796P2234K4217o7033P5921l9542Q0042j73110j2561Q0808Q0117
$$ plain form
24510 766129 620672 579728 699172 862238 1000450 991480 882289 847976 859572 851163 949441
24499 949441 878121 798084 857107 741592 675687 812019 713604 718899 773860 686580 697347
24488 697347 662775 404478 557311 655815 582576 621431 723211 739993 747107 714030 769145
24477 769145 796120 754799 761829 713429 629420 659974 645745 652284 655408 680695 617860 631914
24465 631914 678279 545747 600172 725868 722955 681090 771419 887466 817000 670759 606443
24454 606443 594975 501062 573315 600941 463887 520287 590534 627443 691788 620801 503614
24443 503614 450736 662854 904005 965507 924867 721137 552738 536420 499561 547456 710838
24432 710838 647374 589389 525658 527716 589490 752760 791233 944712 931985 977157 932204
$$ packed form
24510G66129j45457m0944J19444J63066J38212q970j09191l4313J1596q409R8278
24499I49441p1320q0037N9023j15515o5905J36332r8415N295N4961q7280J0767
24488F97347l4572k58297J52833R8504p3239L8855J01780J6782P114l3077N5115
24477G69145K6975m1321P030m8400q4009L0554j4229O539L124K5287o2835J4054
24465F31914M6365j32532N4425J25696k913m1865R0329J16047p0466j46241o4316
24454F06443j1468r3913P2253K7626j37054N6400P0247L6909O4345p0987j17187
24443E03614n2878K12118K41151O1502m0640k03730j68399j6318l6859M7895J63382
24432G10838o3464n7985o3731K058O1774J63270L8473J53479j2727M5172m4953
$$ plain form
24421 932204 953235 1016855 791817 689191 718578 690612 459518 317877 312447 278447 278767
24410 278767 465935 395734 230629 355015 540930 551814 542082 609975 560231 640190 705068
24399 705068 648583 592884 588505 635750 564423 566341 360474 370825 429020 516496 551238 715682
24387 715682 774437 723802 606407 448223 367118 234903 231113 245927 380551 337498 355446
24376 355446 378645 514710 626369 499198 417915 311560 442827 435851 269305 331200
24366 331200 403073 466024 510447 581212 507189 395840 327720 570847 603563 525222 433083
24355 433083 523228 493731 454404 552575 614433 569217 645444 644684 482409 424315 430851 402588
24343 402588 581951 612923 675222 629620 497090 589362 544174 502645 460402 423102 498421
$$ packed form
24421I32204K1031O3620k25038j02626K9387k7966k31094j41641n430l4000L20
24410B78767J87168p0201j65105J24386J85915J0884r732O7893m9744P9959O4878
24399G05068n6485n5699m379M7245p1327J918k05867J0351N8195Q7476L4742J64444
24387G15682N8755n0635j17395j58184q1105j32215l790J4814J34624m3053J7948
24376C55446K3199J36065J11659j27171q1283j06355J31267o976j66546O1895
24366C31200P1873O2951M4423P0765p4023j11349o8120K43127L2716p8341r2139
24355D33083R0145k9497l9327R8171O1858m5216P6227p60j62275n8094O536k8263
24343D02588J79363L0972O2299m5602j32530R2272m5188m1529m2243l7300P5319
$$ plain form
24332 498421 380548 309509 415781 515005 604533 500359 337385 206628 105860 166597
24322 166597 279058 248012 310443 337809 451231 429537 479064 485993 482223 348232 285875
24311 285875 245923 302254 226304 120937 253440 204274 9296 140083 293343 382970
24301 382970 598165 625691 595235 556570 457350 407774 410321 320314 215103 214667 350817
24290 350817 402531 343774 286722 405946 347318 272250 437166 429082 509839 376125 258538
24279 258538 274786 389191 471445 406133 331340 309377 289090 313523 275998 309118 268474
24268 268474 268162 392323 459362 472045 439410 504514 465554 212574 -89955 -123732 24962
24257 24962 66077 112684 104440 86395 77707 34008 197892 167189 262048 281211 459323 632759
$$ packed form
24332D98421j17873p1039J06272R9224Q9528j04174j62974j30757j00768O0737
24322A66597J12461l1046O2431K7366J13422k1694M9527O929l770j33991o2357
24311B85875l9952N6331p5950j05367J32503m9166j94978J30787J53260Q9627
24301C82970K15195K7526l0456l8665r9220m9576K547r0007j05211m36J36150
24290C50817N1714n8757n7052J19224n8628p5068J64916q084Q0757j33714j17587
24279B58538J6248J14405Q2254o5312p4793k1963k0287K4433l7525L3120m0644
24268B68474l12J24161O7039J2683l2635O5104l8960k52980l02529l3777J48694
24257B4962M1115M6607q244j8045q688m3699J63884l0703R4859J9163J78112J73436
$$ plain form
24245 632759 571266 495424 517494 634957 606129 529928 350908 374570 292897 258616 215129
24234 215129 187696 139685 157980 158980 -7690 187984 156453 111944 239002 398608 430889
24223 430889 420887 491266 423533 322423 199525 243133 222478 57112 19629 186397 306248
24212 306248 212290 246173 299971 442030 605844 355900 102846 17502 148979 99255
24202 99255 114938 1177 48375 261080 446845 619493 551253 420503 221556 348860
24192 348860 388911 375974 245117 76228 -12305 241151 486146 389253 321773 452250
24182 452250 500919 562091 663511 465394 284155 382800 406938 408678 479176 411008 358454
24171 358454 515580 487337 447342 240766 102171 107731 121585 210918 400671 425411 327641
$$ packed form
24245F32759o1493p5842K2070J17463k8828p6201j79020K3662q1673l4281m3487
24234B15129k7433m8011J8295J000j66670J95674l1531m4509J27058J59606L2281
24223D30889j0002P0379o7733j01110j22898M3608k0655j65366l7483J66768J19851
24212C06248r3958L3883N3798J42059J63814k49944k53054q5344J31477m9724
24202I9255J5683j13761M7198K12705J85765J72648o8240j30750j98947J27304
24192C48860M0051j2937j30857j68889q8533K53456K44995r6893o7480J30477
24182D52250M8669O1172J01420j98117j81239R8645K4138J740P0498o8168n2554
24171C58454J57126k8243l9995k06576j38595N560J3854Q9333J89753K4740r7770
$$ plain form
24160 327641 313526 319800 263520 264932 368078 401795 415531 276288 216454 237560 299340
24149 299340 307793 165234 70983 13253 -66727 -199309 -232715 -154147 35907 119683 164840
24138 164840 204392 135763 117805 102132 128959 213434 219755 292586 484134 556773 453958
24127 453958 226181 130539 34093 69735 147014 207080 21791 -186868 -62321 77850
24117 77850 64037 176363 120568 119261 67935 27158 36125 106018 39059 93028 258043 330732
24105 330732 345586 170900 88660 81796 93647 376026 437192 318167 137939 -2261 40321
24094 40321 107837 268256 402420 519914 398166 226991 291876 251963 306852 256222 239602
24083 239602 94776 55940 148970 -36956 -85050 -65327 71297 146745 202858 35064 8694
$$ packed form
24160C27641j4115O274n6280J412J03146L3717J3736j39243n9834K1106O1780
24149B99340Q453j42559r4251n7730p9980j32582l3406P8568J90054Q3776M5157
24138A64840L9552o8629j7958j5673K6827Q4475O321P2831J91548P2639j02815
24127D53958k27777r5642r6446L5642P7279O0066j85289k08659J24547J40171
24117G7850j3813J12326n5795j307n1326m0777Q967O9893o6959N3969J65015P2689
24105C30732J4854j74686q2240o864J1851K82379O1166j19025j80228j40200M2582
24094D0321O7516J60419J34164J17494j21748j71175O4885l9913N4889n0630j6620
24083B39602j44826l8836R3030j85926m8094J9723J36624P5448N6113j67794k6370
$$ plain form
24072 8694 -5602 -44135 -68692 -26559 118907 165158 237085 286711 197775 95877 75374
24061 75374 -40050 -117588 -109401 -25305 -163976 -194459 -72317 46486 3477 -14784 -8738
24050 -8738 196053 306247 348909 336951 326536 444429 470478 136680 -21850 4770 -32274
24039 -32274 -55536 -7301 -9030 -31729 52216 249069 368504 316129 307401 229447 313949 368394
24027 368394 346003 162562 62581 98365 216792 126313 -10871 159908 198612 214616 220135
24016 220135 345162 308825 272365 209383 230442 220856 78067 11355 -23625 24766 157045
24005 157045 198410 208848 105266 -5104 -21235 20401 166521 370227 397958 326670 381438
23994 381438 401229 345847 5323 531 90162 165364 172195 266087 395001 453367 309483
$$ packed form
24072H694j4296l8533k4557M2133J45466M6251P1927M9626q8936j01898k0503
24061G5374j15424p7538Q187Q4096j38671l0483J22142J18803m3009j8261O046
24050h738K04791J10194M2662j1958j0415J17893K6049l33798j58530K6620l7044
24039c2274k3262M8235j729k2699Q3945J96853J19435n2375q728p7954Q4502N4445
24027C68394k2391j83441r9981L5784J18427r0479j37184J70779L8704J6004N519
24016B20135J25027l6337l6460o2982K1059r586j42789o6712l4980M8391J32279
24005A57045M1365J0438j03582j10370j6131M1636J46120K03706K7731p1288N4768
23994C81438J9791n5382l40524m792Q9631P5202O831R3892J28914N8366j43884
$$ plain form
23983 309483 301950 348178 369190 427743 462967 342262 106929 26839 166239 254688 328708
23972 328708 432862 281213 145283 41255 -75664 -19839 202489 224487 234634 170690
23962 170690 166481 207926 242111 267574 354069 306516 330206 224895 243834 277956 318970
23951 318970 455954 645148 564475 383356 260805 39572 -40501 -39103 214180 370789
23941 370789 349178 447514 409274 199981 48941 150900 213316 261158 300545 201033 134123
23930 134123 283668 280946 214459 285441 318934 176236 184321 83479 71579 214288 102247
23919 102247 79644 137990 197974 276979 248840 77787 32550 99065 71768 130367 116096
23908 116096 -21342 -205651 -315048 -142356 130478 73373 -17388 -61376 -70578 37850
$$ packed form
23983C09483p533M6228K1012N8553L5224j20705k35333q0090J39400Q8449P4020
23972C28708J04154j51649j35930j04028j16919N5825K22328K1998J0147o3944
23962A70690m209M1445L4185K5463Q6495m7553K3690j05311J8939L4122M1014
23951C18970J36984J89194q0673j81119j22551k21233q0073J398K53283J56609
23941C70789k1611R8336l8240k09293j51040J01959O2416M7842L9387r9512o6910
23930A34123J49545k722o6487P0982L3493j42698Q085j00842j1900J42709j12041
23919A02247k2603N8346N9984P9005k8139j71053m5237O6515k7297N8599j4271
23908A16096j37438j84309j09397J72692K72834n7105r0761m3988r202J08428
$$ plain form
23898 37850 28418 10427 -60235 4356 77156 -50616 -40403 -3079 13518 31956 84814 175689
23886 175689 47876 -60124 42842 188682 192284 106679 143245 180848 278650 257029 239487
23875 239487 177707 -96433 -124181 -16527 67726 -23401 -17364 236347 251554 301378 162790
23864 162790 122732 119346 86434 34863 105653 84292 2891 136708 55352 -27238 17449
23853 17449 46412 108756 171344 321342 279404 -92067 -67952 40174 67672 91978 167560
23842 167560 136270 203789 242581 268931 229606 186398 139271 41590 -116392 -271834 -182273
23831 -182273 -113676 -24714 -161049 -71123 278694 265684 168085 40272 -67075 -19845 -11905
23820 -11905 -77486 -72309 40929 128569 256152 141646 -28022 -101429 -111702 -30296 71726
$$ packed form
23898C7850r432j7991p0662O4591P2800j27772J0213L7324J6597J8438N2858R0875
23886A75689j27813j08000J02966J45840L602q5605L6566L7603R7802k1621j7542
23875B39487o1780k74140k7748J07654Q4253r1127O037K53711J5207M9824j38588
23864A62790m0058l386l2912n1571P0790k1361q1401J33817q1356q2590M4687
23853A7449K8963O2344O2588J49998m1938l71471K4115J08126K7498K4306P5582
23842A67560l1290O7519L8792K6350l9325m3208m7127r7681j57982j55442Q9561
23831a82273O8597Q8962j36335Q9926L49817j3010r7599j27813j07347M7230P940
23820a1905o5581N177J13238Q7640J27583j14506j69668p3407j0273Q1406J02022
$$ plain form
23809 71726 87115 98341 128131 82115 4560 205835 283057 251720 186110 38587 17137
23798 17137 -35307 -99803 -528 109483 56707 162630 192541 103974 102630 226208 250970
23787 250970 238999 256623 205124 204191 222775 222485 173167 -3354 -1464 201072 131562 84003
23775 84003 104475 143403 60576 -115658 -117098 -142976 11919 55827 78235 -20828 24412
23764 24412 -19186 71398 126049 81982 81953 -3828 122240 190327 102697 105539 194492 183925
23752 183925 105523 99782 167076 127640 113203 128205 215852 241809 176724 142961 19010
23741 19010 -58283 69369 191050 260838 432158 478826 374752 232801 137892 163988 179584
23730 179584 313037 270584 103510 100750 15402 -84522 -40587 10681 -29728 41430 89532
$$ packed form
23809G1726J5389J1226K9790m6016p7555K01275P7222l1337o5610j47523k1450
23798A7137n2444o4496R9275J10011n2776J05923K9911q8567j344J23578K4762
23787B50970j1971J7624n1499r33J8584k90m9318j76521J890K02536o9510m7559
23775H4003K0472L8928q2827j76234j440k5878J54895M3908K2408r9063M5240
23764B4412m3598R0584N4651m4067k9q5781J26068O8087q7630K842Q8953j0567
23752A83925p8402n741O7294l9436j4437J5002Q7647K5957o5085l3763j23951
23741A9010p7293J27652J21681O9788J71320M6668j04074j41951r4909K6096J5596
23730A79584J33453m2453j67074k760q5348r9924M3935N1268m0409P1158M8102
$$ plain form
23719 89532 26604 -68190 -45488 14371 113334 9705 -20383 19680 40577 -13662 -119688
23708 -119688 -67109 -168877 -310039 -265137 -93742 42541 -2040 35747 63885 77677 -104774
23697 -104774 -106369 -213957 -83558 -81304 70537 44864 -55276 -50871 -58749 -84421 -282585
23686 -282585 -261752 -123028 34266 342148 312686 153695 183925 255497 194610 31652
23676 31652 -20497 51405 134376 230145 60133 -2788 263852 273478 267923 311876 205839
23665 205839 162933 329102 373961 407161 479687 428206 276361 221220 230868 249426 169926
23654 169926 250135 236254 6849 -43896 -71657 14212 33158 -14453 147237 86591 -126223
23643 -126223 -175452 -156066 -12800 130681 201532 166802 68325 117380 -33628 -50796 -60205
$$ packed form
23719H9532o2928r4794K2702N9859R8963j03629l0088M0063K0897n4239j06026
23708a19688N2579j01768j41162M4902J71395J36283m4581L7787K8138J3792j82451
23697a04774j595j07588J30399K254J51841k5673j00140M405p878k5672j98164
23686b82585K0833J38724J57294L07882k9462j58991L0230P1572o0887j62958
23676C1652n2149P1902Q2971R5769j70012o2921K66640R626n555M3953j06037
23665B05839m2906J66169M4859L3200P2526n1481j51845n5141R648J8558p9500
23654A69926Q0209j3881k29405n0745k7761Q5869J8946m7611J61690o0646k12814
23643a26223m9229J9386J43266J43481P0851l4730r8477M9055j51008j7168r409
$$ plain form
23632 -60205 17648 -127401 -57701 18428 95301 364816 459409 289401 342442 359636 421475
23621 421475 293310 194347 147976 36240 -131422 -10912 4768 78510 168022 53384
23611 53384 159260 319722 400813 376689 208971 104306 158373 233447 112276 46693 65927
23600 65927 111135 112019 155304 233985 362586 421178 332669 127661 56312 208384 263573
23589 263573 144031 -5117 67902 194209 78942 -40828 -154608 -116175 -52633 132637
23579 132637 149119 165267 -31061 -136908 -121032 -192568 -166650 -134086 -102897 66413 337580
23568 337580 435529 300938 378190 404459 257446 17725 103903 126414 83519 113049 81327
23557 81327 202422 246373 48991 -92208 -137495 -142430 -150167 -110858 12750 201762 133483
$$ packed form
23632f0205P7853j45049O9700P6129P6873K69515R4593j70008N3041J7194O1839
23621D21475j28165r8963m6371j11736j67662J20510J5680P3742Q9512j14638
23611E3384J05876J60462Q1091k4124j67718j04665N4067P5074j21171o5583J9234
23600F5927M5208Q84M3285P8681J28601N8592q8509k05008p1349J52072N5189
23589B63573j19542j49148P3019J26307j15267j19770j13780L8433O3542J85270
23579A32637J6482J6148j96328j05847J5876p1536K5918L2564L1189J69310K71167
23568C37580R7949j34591P7252K6269j47013k39721Q6178K2511m2895K9530l1722
23557H1327J21095M3951j97382j41199m5287m935p737L9309J23608J89012o8279
$$ plain form
23546 133483 38734 14065 -85923 -257665 -154014 48199 30753 -57875 49516 48329 198195
23535 198195 348051 519196 480659 300657 115065 -74704 -54573 107540 71222 -43590
23525 -43590 -163648 -305004 -196355 -181675 -126744 -24147 94469 11717 -87533 61696
23515 61696 12018 -37721 -126672 37714 82853 54961 84205 144055 -12518 -1328 53694
23504 53694 -143833 -200538 5617 7426 -53575 -13528 -44842 -14954 6667 124326 163787
23493 163787 40335 -180958 -274873 -28397 158943 252030 177463 -3726 -205595 -316210
23483 -316210 -271526 13413 301645 316503 329544 303784 169734 134502 240475 279530 167026
23472 167026 162868 281137 54375 -92961 -246555 -210614 -29146 17088 -98082 -342519
$$ packed form
23546A33483r4749k4669r9988j71742J03651K02213j7446q8628J07391j187J49866
23535A98195J49856J71145l8537j80002j85592j89769K0131J62113l6318j14812
23525d3590j20058j41356J08649J4680N4931J02597J18616q2752r9250J49229
23515F1696m9678m9739q8951J64386M5139k7892K9244N9850j56573J1190N5022
23504E3694j97527n6705K06155J809o1001M0047l1314K9888K1621J17659L9461
23493A63787j23452k21293r3915K46476J87340R3087p4567j81189k01869j10615
23483c16210M4684K84939K88232J4858J3041k5760j34050l5232J05973L9055j12504
23472A67026m158J18269k26762j47336j53594L5941J81468M6234j15170k44437
$$ plain form
23462 -342519 -396608 -260800 -62750 -163632 -139743 8192 -157907 -180447 27396 148944
23452 148944 128792 96805 136998 221807 204680 231709 206576 262990 256601 145936 146911 162506
23440 162506 142528 177684 85418 -65445 -136513 -304175 -144148 118959 222111 223880 322843
23429 322843 235595 -65324 -36209 221748 354130 477342 344890 223280 257953 173700
23419 173700 157100 118030 107811 64193 5118 -24441 -85633 -98076 124962 284740 335811
23408 335811 375941 245903 212437 249730 388045 420101 129108 -32326 -105563 -31667 -18732
23397 -18732 100716 185483 137891 78363 57677 65665 55640 54339 21894 16038 -8957 -60582
23385 -60582 -75245 -24286 124207 56094 92670 129125 175037 197190 203246 170772 -36103
$$ packed form
23462c42519n4089J35808J98050j00882K3889J47935j66099k2540K07843J21548
23452A48944k0152l1987M0193Q4809j7127K7029k5133N6414o389j10665R75J5595
23440A62506j9978L5156r2266j50863p1068j67662J60027K63107J03152J769R8963
23429C22843q7248l00919K9115K57957J32382J23212j32452j21610L4673q4253
23419A73700j6600l9070j0219m3618n9075k9559o1192j2443K23038J59778N1071
23408C35811M0130j30038l3466L7293J38315L2056k90993j61434p3237P3896J2935
23397a8732J19448Q4767m7592n9528k0686P988j0025j301l2445n856k4995n1625
23385f0582j4663N0959J48493o8113L6576L6455M5912K2153O056l2474k06875
$$ plain form
23374 -36103 667 117161 162367 120540 40118 -9458 -141062 -349937 -410602 -241527 -208050
23363 -208050 -209770 -104087 -104069 -58702 103692 85402 -106191 -120030 -94343 -187538 -130005 -194099
23351 -194099 -388677 -435368 -465278 -491041 -361336 -344996 -320523 -104004 16636 59399 118034
23340 118034 85466 -94208 -81807 16739 -24645 115248 48094 -21770 -149149 26111 135266
23329 135266 146218 73311 17152 -56858 -124449 71791 152124 214550 163099 -18076 82243
23318 82243 125680 -40390 -195133 -99304 -83551 -168589 -237420 -219673 -148593 -18036 -42054
23307 -42054 -159032 -108355 -114104 -184986 -231751 -219361 -56631 91808 199495 45720 101458
23296 101458 70151 -56588 -126007 -243234 -191219 -154195 -106839 15530 39828 -73502 136032
$$ packed form
23374c6103L6770J16494M5206m1827q0422m9576j31604k08875o0665J69075L3477
23363b08050j720J05683J8M5367J62394j8290j91593j3839K5687r3195N7533o4094
23351a94099j94578m6691k9910k5763J29705J6340K4473K16519J20640M2763N8635
23340A18034l2568j79674J2401R8546m1384J39893o7154o9864j27379J75260J09155
23329A35266J0952p2907n6159p4010o7591J96240Q0333O2426n1451j81175J00319
23318H2243M3437j66070j54743R5829J5753q5038o8831J7747P1080J30557k4018
23307d2054j16978N0677n749p0882m6765J2390J62730J48439J07687j53775N5738
23296A01458l1307j26739o9419j17227N2015L7024M7356J22369K4298j13330K09534
$$ plain form
23285 136032 313818 88227 -84335 -144855 -57907 61084 -25607 -166636 -217578 -174805
23275 -174805 -123644 -32814 -116712 6379 83349 45344 63331 35709 -28758 -98761 -199544
23264 -199544 40044 168536 147857 73299 71119 -130071 -150915 -123239 -136923 -133432 -224838
23253 -224838 -239986 -82117 81974 154418 15964 -11331 -91905 -27069 114786 93100 -29219
23242 -29219 -115325 98656 252596 207353 128779 87219 129857 123159 70429 53923 67176
23231 67176 35232 -50847 -84190 -85885 -225768 -162894 18026 145833 138714 -34402 -60035
23220 -60035 29336 23206 15961 -42396 -222653 -294213 -250107 -178920 -705 84064 -19879
23209 -19879 -117469 -156046 -63089 -30191 -9299 -126016 -206413 -286592 -105770 39417 160174
$$ packed form
23285A36032J77786k25591j72562o0520Q6948J18991q6691j41029n0942M2773
23275a74805N1161R0830q3898J23091P6970l8005J7987k7622o4467p0003j00783
23264a99544K39588J28492k0679p4558k180k01190k0844K7676j3684L491r1406
23253b24838j5148J57869J64091P2444j38454k7295q0574O4836J41855k1686j22319
23242b9219q6106K13981J53940m5243p8574m1560M2638o698n2730j6506J3253
23231F7176l1944q6079l3343j695j39883O2874J80920J27807p119j73116k5633
23220f0035Q9371o130p245n8357j80257p1560M4106P1187J78215Q4769j03943
23209a9879r7590l8577R2957L2898K0892j16717q0397q0179J80822J45187J20757
$$ plain form
23198 160174 26609 -293556 -113745 68623 -22992 -84501 -23835 -99705 -237601 -449891
23188 -449891 -430828 -489044 -294992 -232303 -100483 -68534 -183191 -139949 -7419 49586 -16279
23177 -16279 -54635 10015 -137157 -55862 -29828 -4082 53731 -41874 -162624 -22639 76423
23166 76423 -33110 -128983 -149258 101764 188979 124602 72865 -19294 -19340 140064 372006
23155 372006 479840 684770 938014 1390403 1837962 2044595 1979945 1787889 1318585 904852
23145 904852 693807 620883 432878 377186 107476 131755 176564 213286 309882 303857 279731
23134 279731 396912 257071 123009 87427 -80336 -14510 55888 22888 14562 85774 42671
23123 42671 23452 -13265 -60392 14229 130915 210559 324094 226968 146705 51152 78460
$$ packed form
23198A60174j33565l20165J79811J82368r1615o1509O0666p5870j37896k12290
23188d49891J9063n8216J94052O2689J31820L1949j14657M3242J32530N7005o5865
23177a6279l8356O4650j47172Q1295K6034K5746N7813r5605j20750J39985R9062
23166G6423j09533r5873k0275K51022Q7215o4377n1737r2159m6J59404K31942
23155C72006J07834K04930K53244M52389M47559K06633o4650j92056m69304m13733
23145I04852k11045p2924j88005n5692k69710K4279M4809L6722R6596o025k4126
23134B79731J17181j39841j34062l5582j67763O5826P0398l3000q326P1212m3103
23123D2671j9219l6717m7127P4621J16686P9644J13535r7126q0263r5553K7308
$$ plain form
23112 78460 150315 98232 111516 260124 240911 228687 294164 131329 138399 202368 122475
23101 122475 124433 100265 -56100 -14556 49591 -16630 -61715 -15418 -98912 -49808 -610
23090 -610 -121786 -211275 -44271 113506 65228 -270233 -316195 -8027 131930 70436 75201
23079 75201 7345 -90097 -208118 -69517 -32671 -182557 -46475 200370 300152 147242
23069 147242 -73240 -161853 -288385 -250318 -52777 -33634 -123296 -192448 -371155 -375537 -239336
23058 -239336 -229780 -129437 11672 -130086 -156263 -98821 15291 6532 81934 9678 -204293
23047 -204293 -301675 -332392 -200466 -169112 -237959 -145026 -138341 -183247 -167443 -127761 -133831 -180382
23035 -180382 -230188 -242953 -770 138909 193273 -73037 -159507 -105436 -99703 -204352 -139643
$$ packed form
23112G8460P1855n2083J3284J48608j9213j2224O5477j62835P070O3969p9893
23101A22475J958k4168j56365M1544O4147o6221m5085M6297q3494M9104M9198
23090f10j21176q9489J67004J57777m8278l35461m5962L08168J39957o1494M765
23079G5201o7856r7442j18021J38601L6846j49886J36082K46845R9782j52910
23069A47242k20482q8613j26532L8067J97541J9143q9662o9152j78707m382J36201
23058b39336R556J00343J41109j41758k6177N7442J14112q759P5402p2256k13971
23047b04293r7382l0717J31926L1354o8847R2933O685m4906J5804L9682o070m6551
23035a80382m9806j2765K42183J39679N4364k66310q6470N4071N733j04649O4709
$$ plain form
23024 -139643 -237752 -233835 -300972 -264652 -257377 -283204 -264541 -202164 -203369 -226285 -236546 -173440
23012 -173440 -107516 -154820 -132659 -96746 -114756 -243178 -73018 30835 30643 -21208 -226791
23001 -226791 -301686 -94067 69610 160916 125491 47130 59012 -92240 -317104 -303456 -116748
22990 -116748 20028 -106670 -141750 -38801 129396 69194 -11549 72605 -9201 -77448 -40379
22979 -40379 -126363 -180757 -104411 158283 169056 145435 46172 96950 194139 175639 27643
22968 27643 -112501 -38828 27088 4834 -21009 3964 59899 -59590 -62013 -18655 113867
22957 113867 -49901 -94005 -33033 17595 39884 -78984 -205046 -267489 -218718 -92118 -69768
22946 -69768 -119001 -191380 -288428 -308286 -351356 -352570 -321061 -329151 -113793 2229 103961
$$ packed form
23024a39643r8109L917o7137L6320P275k5827J8663O2377j205k2916j0261O3106
23012a73440O5924m7304K2161L5913j8010j28422J70160J03853j92n1851k05583
23001b26791p4895K07619J63677R1306l5425p8361J1882j51252k24864J3648J86708
22990a16748J36776j26698l5080J02949J68197o0202q0743Q4154q1806o8247L7069
22979d0379q5984n4394P6346K62694J0773k3621r9263N0778R7189j8500j47996
22968B7643j40144P3673O5916k2254k5843K4973N5935j19489k423M3358J32522
22957A13867j63768m4104O0972N0628K2289j18868j26062o2443M8771J26600K2350
22946f9768m9233p2379r7048j9858m3070j214L1509q090K15358J16022J01732
$$ plain form
22935 103961 102180 -25908 -156714 -208544 -133042 -143945 -171258 -6007 130715 34152 -11740
22924 -11740 -64554 -69809 -121024 -214127 -193231 58795 196184 140469 24162 62691 -937
22913 -937 86207 215300 144476 170279 117876 159567 80357 102759 99847 157203 110605 -75708
22901 -75708 37190 192550 195207 128466 122724 -111300 -383553 -446842 -261551 -165427 -215211
22890 -215211 -309748 -267002 -360340 -373050 -237004 -30178 259482 82323 41991 154433
22880 154433 100997 -47299 -86414 -107964 86214 93500 32526 71967 -119328 -64392 31990
22869 31990 -687 76182 3968 -18970 55268 -142800 -238735 -195474 -115957 12459 -51114
22858 -51114 -101955 81895 279010 364710 340464 452751 413524 229541 85895 -57096
$$ packed form
22935A03961j781j28088j30806n1830P5502j0903k7313J65251J36722r6563m5892
22924a1740n2814n255n1215r3103K0896K52026J37389n5715j16307L8529o3628
22913i37Q7144J29093p0824K5803n2403M1691p9210K2402k912N7356m6598j86313
22901g5708J12898J55360K657o6741n742k34024k72253o3289J85291R6124m9784
22890b15211r4537M2746r3338j2710J36046K06826K89660j77159m0332J12442
22880A54433n3436j48296l9115k1550J94178P286o0974L9441j91295N4936R6382
22869C1990l2677P6869p2214k2938P4238j98068r5935M3261P9517J28416o3573
22858e1114n0841J83850J97115Q5700k4246J12287l9227j83983j43646j42991
$$ plain form
22848 -57096 -1128 66836 -2393 -186139 -330024 -127956 -9350 -71326 -290382 -358520 -264157
22837 -264157 -102414 32543 63160 34565 16153 245790 268192 174182 55390 1845 71442
22826 71442 86923 -5269 -24861 -93001 -10262 44214 59230 76962 110083 55122 -103991
22815 -103991 -185384 -105380 -75465 -177658 -186048 -283547 -478597 -571224 -409845 -171965 -38836
22804 -38836 36967 205817 277308 270871 160645 618 -14998 -102665 -112775 -121590 -94711
22793 -94711 47562 118449 93580 106867 44680 15454 57194 -23404 152802 379453 365128
22782 365128 204329 95446 110996 69165 -48434 -145345 -205943 -282558 -271202 -1156 77410
22771 77410 36075 -44092 -6962 -5132 -54344 -102146 53177 76965 150314 202251 160371 80106
$$ packed form
22848e7096N5968O7964o9229j83746j43885K02068J18606o1976k19056o8138R4363
22837b64157J61743J34957L0617k8595j8412K29637K2402r4010j18792n3545O9597
22826G1442J5481r2192j9592o8140Q2739N4476J5016J7732L3121n4961j59113
22815a03991q1393Q0004K9915j02193q390r7499j95050r2627J61379K37880J33129
22804c8836P5803J68850P1491o437j10226j60027j5616q7667j0110q815K6879
22793i4711J42273P0887k4869J3287o2187k9226M1740q0598J76206K26651j4325
22782C65128j60799j08883J5550m1831j17599r6911o0598p6615J1356K70046P8566
22771G7410m1335q0167L7130J830m9212m7802J55323K3788P3349N1937m1880q0265
$$ plain form
22759 80106 62682 -23830 -21561 75823 140065 91842 132188 225933 280951 154962 270386
22748 270386 37111 10955 -130837 53796 118730 178148 380248 371049 416265 390608 227602
22737 227602 227260 228834 323659 288436 351878 359964 363058 497666 759045 1049757 1260768 990089
22725 990089 585636 386757 287241 180756 123856 -28593 -105945 -37943 -26516 -28039 4807
22714 4807 -70108 -41138 48439 11957 70003 132628 148527 135816 75326 -10680 -51756 -11083
22702 -11083 23039 114245 234949 192271 132822 26713 9272 247564 380308 299929 256366
22691 256366 350371 302841 222954 195027 250369 355028 597452 974391 1548607 2255085
22681 2255085 2610647 2548518 1942004 1185128 694140 385535 313790 247640 255632 307107
$$ packed form
22759H0106j7424q6512K269R7384O4242m8223M0346R3745N5018j25989J15424
22748B70386k33275k6156j41792J84633O4934N9418K02100r199M5216k5657j63006
22737B27602l42J574R4825l5223O3442Q086L094J34608K61379K90712K11011k70679
22725I90089m04453j98879r9516j06485n6900j52449p7352O8002J1427j523L2846
22714D807p4915K8970Q9577l6482N8046O2625J5899j2711o0490q6006m1076M0673
22702a1083L4122R1206J20704m2678n9449j06109j7441K38292J32744q0379m3563
22691B56366R4005m7530p9887k7927N5342J04659K42424L76939N74216P06478
22681B255085L55562o2129o06514p56876m90988l08605p1745o6150P992N1475
$$ plain form
22671 307107 356388 271723 290879 230910 36080 89267 270027 326673 259081 205546 372470
22660 372470 328955 378273 531367 322894 302960 453218 584907 723463 645607 333339
22650 333339 291027 153533 172422 269274 390012 468370 525021 521959 707661 809692 947285
22639 947285 956523 1019942 1085812 1179980 1120382 1195252 1360336 1422588 1422674 1394074 1466577 1872461
22627 1872461 2239796 2510033 2787261 2993585 3262861 3654286 3874359 4141858 4673247
22618 4673247 5157006 5838281 6616467 7669289 9418052 11772828 14558426 17929940 21959356
22609 21959356 26919754 33511904 43461185 59333190 86768746 136591405 222760952
22602 222760952 348097384 467117351 510139318 456876117 335029221 210113445
$$ packed form
22671C07107M9281q4665J9156n9969j94830N3187J80760N6646o7592n3535J66924
22660C72470m3515M9318J53094k08473j9934J50258J31689J38556p7856l12268
22650C33339m2312j37494J8889R6852J20738P8358N6651l062J85702J02031J37593
22639I47285R238O3419O5870R4168n9598P4870J65084O2252Q6k8600P2503M05884
22627A872461L67335K70237K77228K06324K69276L91425K20073K67499N31389
22618D673247M83759O81275P78186J052822J748763K354776K785598L371514M029416
22609B1959356M960398O592150R949281J5872005K7435556M9822659Q6169547
22602B22760952J25336432J19019967M3021967n3263201j21846896j24915776
$$ plain form
22596 210113445 130341014 86706710 62346513 47905115 38575771 32021147 26891315
22589 26891315 22690683 19164233 16165083 13705744 11584337 9919725 8580995 7562366
22581 7562366 6716534 5962752 5373604 4788983 4429819 4012080 3632964 3474261 3181480
22572 3181480 3013215 2946636 2818243 2625207 2341679 2297537 2194031 2099771 1935886 1699712
22562 1699712 1546233 1580774 1470018 1508471 1612489 1464633 1246564 1370852 1448192 1303899
22552 1303899 1142945 976317 945878 1068609 1028754 937537 900396 854586 815891 704389
22542 704389 712547 686957 528783 635865 972958 965869 878102 691819 523992 585718 516350
22531 516350 481089 415543 491099 488558 463092 531003 721019 774259 855381 1178611 1763501
$$ packed form
22596B10113445p9772431m3634304k4360197j4441398r329344o554624n129832
22589B6891315m200632l526450k999150k459339k121407j664612j338730j018629
22581G562366q45832p53782n89148n84621l59164m17739l79116j58703k92781
22572C181480j68265o6579j28393j93036k83528m4142j03506r4260j63885k36174
22562A699712j53479L4541j10756L8453J04018j47856k18069J24288P7340j44293
22552A303899j60954j66628l0439J22731l9855r1217l7141m5810l8695j11502
22542G04389Q158k5590j58174J07082L37093p089q7767j86283j67827O1726o9368
22531E16350l5261o5546P5556k541k5466O7911J90016N3240Q1122L23230N84890
$$ plain form
22520 1763501 2486672 3046967 3201861 2926773 2145326 1494593 1009966 762974 669544 729318
22510 729318 711227 603468 574283 616238 896156 1283788 1624510 2205739 2882465 3349034
22500 3349034 3213145 2645145 1786192 1214647 908199 628788 541051 566787 630626 679745
22490 679745 493277 268805 199786 170764 30290 -79904 -126199 88185 164947 292779
22480 292779 542768 451713 341237 229749 293391 131189 30068 -66389 -125819 -226225
22470 -226225 -203345 -107738 -52017 -44415 -210623 -121082 -11038 -24988 -23399 -42066 138862
22459 138862 331507 300348 223512 27027 2047 19559 89179 188569 130545 -52671 157670
22448 157670 230428 187796 2178 15153 108347 151557 216123 183852 125147 6715 -6540
$$ packed form
22520A763501P23171N60295J54894k75088p81447o50733m84627k46992r3430N9774
22510G29318j8091j07759k9185M1955K79918L87632L40722N81229O76726M66569
22500C349034j35889n68000q58953n71545l06448k79411q7737K5736O3839M9119
22490F79745j86468k24472o9019k9022j40474j10194m6295K14384P6762J27832
22480B92779K49989r1055j10476j11488O3642j62202j01121r6457n9430j00406
22470b26225K2880R5607N5721P602j66208Q9541J10044j3950J589j8667J80928
22459A38862J92645l1159p6836j96485k4980J7512O9620R9390n8024j83216K10341
22448A57670P2758m2632j85618J2975R3194M3210O4566l2271n8705j18432j3255
$$ plain form
22437 -6540 219907 197688 84160 65636 29099 -9780 -24835 3660 -49304 -158131 -241134
22426 -241134 -213560 -158573 -177770 -63566 -65209 -25295 41052 -63536 52000 68888 151261
22415 151261 161130 -99843 -74478 -87056 45816 -57290 -118351 -164459 -213510 -303797 -151533
22404 -151533 -47872 -52747 -40440 181270 163847 -23407 6949 -89851 -37458 99561 -70714
22393 -70714 -119743 -51101 -19381 24838 -49427 -188449 -59437 147756 260054 229388 68586
22382 68586 149800 94769 43993 -16068 69315 -38577 -136648 -106102 -4204 -3423 -197359
22371 -197359 -109415 150725 205498 69387 7734 -18400 -25600 -189275 -176544 146 126632
22360 126632 36529 -24860 -145975 -98037 23779 243782 188305 210427 187814 250472 423738
$$ packed form
22437f540K26447k2219j13528j8524l6537l8879j5055K8495n2964j08827q3003
22426b41134K7574N4987j9197J14204j643L9914O6347j04588J15536J6888Q2373
22415A51261R869k60973K5365j2578J32872j03106o1061m6108m9051r0287J52264
22404a51533J03661m875J2307K21710j7423j87254L0356r6800N2393J37019j70275
22393g0714m9029O8642L1720M4219p4265j39022J29012K07193J12298l0666j60802
22382F8586Q1214n5031n0776o0061Q5383j07892r8071L0546J01898P81j93936
22371a97359Q7944K60140N4773j36111o1653k6134p200j63675J2731J76690J26486
22360A26632r0103o1389j21115M7938J21816K20003n5477K2122k2613O2658J73266
$$ plain form
22349 423738 485812 465732 519674 473151 412544 356360 261947 191194 110638 -112874 -213723
22338 -213723 -97122 51993 28785 -83422 -146614 -79007 -112626 18738 -11009 -155593
22328 -155593 30169 173305 225955 11474 -20261 72699 64795 52637 -43702 -105633 52455
22317 52455 133495 148715 120464 169390 44964 -86480 -122318 26326 106317 123287 254552
22306 254552 12344 -109784 -10639 -69472 103775 202033 36064 70187 -16957 -167222
22296 -167222 -216659 -157122 -119334 -228757 -293100 -311409 -298226 -308899 -92151 51175 29685
22285 29685 69002 122430 47029 -57393 -35955 -14094 -32901 30531 116402 124813 98750 3418
22273 3418 60798 35385 -448 -100805 877 4083 143723 316087 290658 83528 79418
$$ packed form
22349D23738O2074k0080N3942m6523o0607n6184r4413p0753q0556k23512j00849
22338b13723J16601J49115k3208j12207o3192O7607l3619J31364k9747j44584
22328a55593J85762J43136N2650k14481l1735R2960p904j2158r6339o1931J58088
22317E2455Q1040J5220k8251M8926j24426j31444l5838J48644P9991J6970J31265
22306B54552k42208j22128R9145n8833J73247R8258j65969L4123q7144j50265
22296a67222m9437N9537L7788j09423o4343j8309J3183j0673K16748J43326k1490
22285B9685L9317N3428p5401j04422K1438K1861j8807O3432Q5871Q411k6063r5332
22273C418N7380k5413l5833j00357J01682L206J39640J72364k5429k07130m110
$$ plain form
22262 79418 188426 142161 137053 136224 163221 91052 6573 2115 33145 122443 134508 -1938
22250 -1938 -307062 -336869 -174897 -30544 -32201 68160 63342 -204511 -329996 -197048 -322233
22239 -322233 -272695 -124124 -94742 -115274 -33074 -29484 -86999 -33721 -20447 151881 106166
22228 106166 106838 188285 146476 19950 2319 134805 308089 176983 20683 -43060 132261
22217 132261 165211 179345 181428 155910 270825 269138 136282 28628 -89960 -100668 4526
22206 4526 130109 90438 37350 -50885 -276294 -273630 -45505 165352 171544 118297 65156
22195 65156 -111642 -16037 87868 93368 -132398 -102713 80605 46283 -42106 -33479 -71356
22184 -71356 -129341 -97500 -23578 78929 98454 128698 216544 236527 125879 -64902 -33805
$$ packed form
22262G9418J09008m6265n108q29K6997p2169q4479m458L1030Q9298J2065j36446
22250a938l05124k9807J61972J44353j657J00361m818k67853j25485J32948j25185
22239c22233M9538J48571K9382k0532Q2200L590n7515N3278J3274J72328m5715
22228A06166O72Q1447m1809j26526j7631J32486J73284j31106j56300o3743J75321
22217A32261L2950J4134K083k5518J14915j687j32856j07654j18588j0708J05194
22206D526J25583l9671n3088q8235k25409K664K28125K10857O192n3247n3141
22195F5156j76798R5605J03905N500k25766K9685J83318l4322q8389Q627l7877
22184g1356n7985L1841P3922J02507J9525L0244Q7846J9983j10648j90781L1097
$$ plain form
22173 -33805 -58158 -164058 -268473 -144428 43076 240852 270363 80906 -3734 98641
22163 98641 195799 206355 131831 12419 -4324 53905 127448 252105 214801 266491 311268
22152 311268 313615 235873 114206 132505 66980 -34926 38584 -37700 35724 51303 57998
22141 57998 200451 298741 183595 210893 237884 49674 -62856 -41210 28178 225931 14465
22130 14465 -139790 -182133 -172715 -26919 126681 87976 31597 -22281 -36830 -130635 -229600
22119 -229600 -247416 -201880 -211755 -119539 97563 323953 240285 53897 -16795 -119019 -134678
22108 -134678 -76773 -166953 -174627 -103526 -20759 61123 122285 217344 146612 -23324 54418
22097 54418 30164 -27466 8421 -35896 -47529 -125380 -109269 -209313 -268762 -170915 78824
$$ packed form
22173c3805k4353j05900j04415J24045J87504J97776K9511j89457q4640J02375
22163I8641R7158J0556p4524j19412j6743N8229P3543J24657l7304N1690M4777
22152C11268K347p7742j21667J8299o5525j01906P3510p6284P3424J5579O695
22141E7998J42453R8290j15146K7298K6991j88210j12530K1646O9388J97753k11466
22130A4465j54255m2343R418J45796J53600l8705n6379n3878j4549r3805r8965
22119b29600j7816M5536r875R2216K17102K26390q3668j86388p0692j02224j5659
22108a34678N7905r0180p674P1101Q2767Q1882O1162R5059p0732j69936P7742
22097E4418k4254n7630L5887m4317j1633p7851J6111j00044n9449R7847K49739
$$ plain form
22086 78824 90890 -29295 -72772 46147 88598 54209 60058 15413 -109834 102591 110955
22075 110955 55720 55169 -61609 -168341 -187611 -27973 -41047 -109529 -181606 -143764 -33720
22064 -33720 17399 -41532 -226539 -460057 -481206 -410878 -270544 -227346 -109876 -640 243153
22053 243153 144109 18236 -26266 89957 228044 200188 229343 444960 868009 1248658
22043 1248658 1738938 2265584 2361165 1912060 1438633 1034541 912241 755829 517502 342054
22033 342054 161070 116343 77193 -102795 -93793 -40884 -51636 -158620 -163656 -20105 96635
22022 96635 49906 -33491 -127720 -172574 -24731 16422 -29570 52382 -30466 60632 -112538
22011 -112538 -23290 -22953 -183284 -142410 -226842 -245191 -34581 84821 65536 192815 84857
$$ packed form
22086G8824J2066j20185m3477J18919M2451l4389N849m4645j25247K12425Q364
22075A10955n5235n51j16778j06732j9270J59638j3074o8482p2077L7842J10044
22064c3720N1119n8931j85007k33518k1149P0328J40334M3198J17470J09236K43793
22053B43153r9044j25873m4502J16223J38087k7856K9155K15617M23049L80649
22043A248658M90280N26646R5581m49105m73427m04092j22300j56412k38327j75448
22033C42054j80984m4727l9150j79988R002N2909j0752j06984n036J43551J16740
22022I6635m6729q3397r4229m4854J47843M1153m5992Q1952q2848R1098j73170
22011a12538Q9248L37j60331M0874q4432j8349K10610J19402j9285J27279j07958
$$ plain form
22000 84857 -131098 -133711 -73677 -124737 -58272 -203941 -348924 -236973 -349378 -340518 -359850
21989 -359850 -417909 -278614 -325179 -311988 -284371 -238815 -65695 -52751 -37764 -14654 -137607
21978 -137607 -165152 -201005 -297302 -268007 -243027 -50097 -59983 -123683 -251310 -389608 -414501
21967 -414501 -408331 -272996 -325826 -290507 -113738 -120743 -29779 -85186 -241167 -194129 -200029
21956 -200029 -333201 -236903 -98097 -120488 -273777 -385517 -377404 -176900 -1647 161135
21946 161135 -37609 -70373 133040 -2834 -54667 110301 152166 135189 158360 -23269
21936 -23269 -354329 -327623 -198264 -35559 103858 30203 103135 1197 -22140 109600
21926 109600 112429 100047 68890 123673 120059 19991 18398 -48813 -52205 -25042 69119 218840
$$ packed form
22000H4857k15955k613O0034n1060O6465j45669j44983J11951j12405Q860j9332
21989c59850n8059J39295m6565J3191K7617M5556J73120J2944J4987K3110j22953
21978a37607k7545l5853r6297K9295K4980J92930r886o3700j27627j38298k4893
21967d14501O170J35335n2830L5319J76769p005R0964n5407j55981M7038n900
21956b00029j33172R6298J38806k2391j53289j11740Q113K00504J75253J62782
21946A61135j98744l2764K03413j35874n1833J64968M1865j6977K3171j81629
21936b3269l31060K6706J29359J62705J39417p3655P2932j01938k3337J31740
21926A09600K829j2382l1157N4783l614j00068j593o7211l392K7163R4161J49721
$$ plain form
21914 218840 152799 74904 15572 -17183 42769 65223 37369 -2918 69849 -156176 -82750
21903 -82750 -6262 -68004 -99984 -101468 -299178 -370447 -244508 -104193 -32085 178321 270968
21892 270968 222228 29710 -65026 -221932 -217081 -25439 -2530 -92858 -129697 -160663 -256203
21881 -256203 -244004 -155734 118 -129655 -74513 -110329 -147002 -85932 -288988 -464275 -631822
21870 -631822 -665283 -687018 -517240 -367597 -276304 -200178 -209479 -256428 -328229 -353340 -256053
21859 -256053 -199089 -239776 -232108 -143230 111571 96327 75777 78373 68064 115460 323938
21848 323938 459385 396932 288519 108461 -58845 -232257 -194653 -41833 50238 -9229
21838 -9229 -65388 71391 99722 236334 222028 38944 -184966 -335766 -453479 -260600
$$ packed form
21914B18840o6041p7895n9332l2755N9952K2454k7854m0287P2767k26025P3426
21903h2750P6488o1742l1980j484j97710p1269J25939J40315P2108K10406R2647
21892B70968m8740j92518r4736j56906M851J91642K2909r0328l6839l0966r5540
21881b56203J2199Q8270J55852j29773N5142l5816l6673O1070k03056j75287j67547
21870f31822l3461k1735J69778J49643R1293P6126r301m6949p1801k5111R7287
21859b56053N6964m0687P668Q8878K54801j5244k0550K596j0309M7396K08478
21848C23938J35447o2453j08413j80058j67306j73412L7604J52820R2071n9467
21838i229n6159J36779K8331J36612j4306j83084k23910j50800j17713J92879
$$ plain form
21828 -260600 -388522 -378296 -334598 -256482 -244942 -247295 -279113 -151776 -77304 -154843 -907
21817 -907 77243 121478 40563 33629 32141 -47073 -65541 -116059 -168942 -269322 -165896 129685
21805 129685 253430 79962 -136569 -240142 -156302 -14747 138197 263403 171466 57605
21795 57605 77913 -41374 -173887 -144982 96951 -12403 11358 53973 119326 101298 65517
21784 65517 -112018 -67350 58156 -265 -114322 -123421 227235 365890 283086 112556 -109316
21773 -109316 -268783 -262289 -206928 -128664 -99668 37958 102137 81742 27996 -164299 -334859
21762 -334859 -176978 -73522 -72855 -10211 -36347 -82944 -237494 -320383 -224269 -189178 -82837
21751 -82837 50793 -90489 -50258 60711 123289 16007 19729 -81493 -24817 -8696 -88130
$$ packed form
21828b60600j27922J0226M3698P8116J1540k353l1818J27337P4472p7539J53936
21817i07P8150M4235q0915o934j488p9214j8468n0518n2883j00380J03426K95581
21805A29685J23745j73468k16531j03573Q3840J41555J52944J25206r1937j13861
21795E7605K0308j19287j32513K8905K41933j09354K3761M2615O5353j8028l5781
21784F5517j77535M4668J25506n8421j14057r099L50656J38655q2804j70530k21872
21773a09316j59467O494N5361P8264K8996J37626O4179k0395n3746j92295j70560
21762c34859J57881J03456O67O2644k6136m6597j54550q2889R6114L5091J06341
21751h2837J33630j41282M0231J10969O2578j07282L722j01222N6676J6121p9434
$$ plain form
21740 -88130 -149468 17166 73517 18081 -63345 -43316 82515 140700 66487 -16547 52215
21729 52215 1350 -133068 -272902 -296253 -1040 100220 82624 -32626 -21965 -43197 -57826
21718 -57826 -76194 -168215 -349636 -356588 -275985 -136340 -93020 27926 703 58889 112963
21707 112963 54014 -40206 31779 50302 -28804 -39644 175884 33136 -152390 -188349 -18256
21696 -18256 84179 -66504 33424 -91717 -204826 -85708 47969 163420 16125 -84861
21686 -84861 40414 186573 184794 -10108 41749 -24130 -66338 -39503 -93271 -190040 -132794
21675 -132794 -218209 -76558 198975 207503 204633 -4685 -328090 -193249 -101381 -52980 -290509
21664 -290509 -339212 -274376 -190435 -166355 -200251 -240643 -41394 116285 127692 326374 366510
$$ packed form
21740h8130o1338J66634N6351n5436q1426K0029J25831N8185p4213q3034O8762
21729E2215n0865j34418j39834k3351K95213J01260j7596j15250J0661k1232j4629
21718e7826j8368r2021j81421o952Q0603J39645M3320J20946k7223N8186N4074
21707A12963n8949r4220P1985J8523p9106j0840K15528j42748j85526l5959J70093
21696a8256J02435j50683R9928j25141j13109J19118J33677J15451j47295j00986
21686h4861J25275J46159j779j94902N1857o5879m2208K6835n3768r6769N7246
21675a32794q5415J41651K75533Q528k870k09318l23405J34841R1868M8401k37529
21664b90509m8703O4836Q3941K4080l3896m0392J99249J57679J1407J98682M0136
$$ plain form
21653 366510 268086 168438 284489 232784 73604 134516 79521 -41166 -58841 3552 101539
21642 101539 96139 -4386 -64213 -54675 -11558 -29657 -127610 -194245 -308733 -179389 53525
21631 53525 28920 -96364 6181 -82360 -195089 -164450 -48299 109253 158146 109621 121135
21620 121135 141468 204451 271342 283761 175071 101794 92096 -61010 -246790 -208539 -300136
21609 -300136 -185648 -126679 -91307 -197402 -105099 -285306 -274318 -201740 -277243 -323511 -307615
21598 -307615 -367183 -277742 -160014 7871 102042 -79921 12314 -31158 -264894 -283055 -246739
21587 -246739 -134518 -150080 -112653 44814 223781 160702 -78211 -111330 -63958 -158462 -203766
21576 -203766 -212080 -24203 -105853 -139792 -90969 175953 220714 120156 -63977 -166943 -41445
$$ packed form
21653C66510r8424r9648J16051n1705j59180O0912n4995j20687j7675O2393R7987
21642A01539n400j00525n9827R538M3117j8099r7953o6635j14488J29344K32914
21631E3525k4605j25284J02545q8541j12729L0639J16151J57552M8893m8525J1514
21620A21135K0333O2983O6891J2419j08690p3277r698j53106j85780L8251r1597
21609c00136J14488N8969L5372j06095R2303j80207J0988P2578p5503m6268J5896
21598c07615n9568Q9441J17728J67885R4171j81963R2235m3472k33736j8161L6316
21587b46739J12221j5562L7427J57467J78967o3079k38913l3119M7372r4504m5304
21576b03766q314J87877q1650l3939M8823K66922M4761j00558j84133j02966J25498
$$ plain form
21565 -41445 27867 7001 -61644 -215926 -282008 -349771 -237081 45677 181685 162835 73328
21554 73328 -32762 -178797 -39467 -43216 -23026 31925 -121285 -66068 43068 -14727 94403
21543 94403 127557 70555 -24453 -264052 -406671 -291566 -78479 -171927 -244533 -95925 -70946
21532 -70946 -26182 -30319 -115925 -25682 44707 132403 197565 266959 112253 -66998 -97532
21521 -97532 -88266 93445 39692 -204475 -354649 -382102 -371006 -318318 -303974 -153483 -75220
21510 -75220 -151004 -167606 -280386 -314191 -214403 115016 206557 -7427 -218650 -53568 -38470
21499 -38470 -10765 -112809 -105328 -95739 -111391 -72264 -182802 -291152 -385027 -302482 -68380
21488 -68380 10019 -26790 77760 60320 -39594 -33150 33577 -19662 -22869 120255 55253 -214626
$$ packed form
21565d1445O9312k0866o8645j54282o6082o7763J12690K82758J36008j8850q9507
21554G3328j06090j46035J39330l749K0190N4951j53210N5217J09136n7795J09130
21543I4403L3154n7002r5008k39599j42619J15105K13087r3448p2606J48608K4979
21532g0946M4764m137q5606R0243P0389Q7696O5162O9394j54706j79251l0534
21521i7532R266J81711n3753k44167j50174k7453J1096N2688J4344J50491P8263
21510g5220p5784j6602j12780l3805R9788L29419R1541k13984k11223J65082J5098
21499c8470K7705j02044P481R589j5652L9127j10538j08350r3875Q2545K34102
21488f8380P8399l6809J04550j7440r9914O444O6727n3239l207J43124o5002k69879
$$ plain form
21476 -214626 -158880 -268424 -249490 -123012 5483 16161 -149512 -203070 -78716 -11811
21466 -11811 -10737 -60668 -137597 -82606 -57571 -186819 -137157 -32032 -32958 -27617 51986 -75094
21454 -75094 -276227 -377578 -375536 -135823 -51423 -112765 -135774 -143718 -131079 18404 62233
21443 62233 -25502 -117413 -158389 1497 62358 50972 -18157 -31143 -154115 -139885 -184192
21432 -184192 -123924 -192120 -139226 -88160 -258115 -126748 7656 144652 276057 65579
21422 65579 -18341 92021 -55222 -35149 110608 204435 18395 -180320 -112896 -202657 -440535
21411 -440535 -386824 -95685 -19284 -190675 -281052 -239215 -90341 -116345 -215720 -108377 -12621
21400 -12621 -69076 -238606 -295537 -99283 -33251 3590 -1652 -48124 -87869 -114755 -226405
$$ packed form
21476b14626N5746j09544J8934J26478J28495J0678j65673n3558J24354O6905
21466a1811J074m9931p6929N4991K5035j29248M9662J05125r26N341P9603j27080
21454g5094k01133j01351K042K39713Q4400o1342k3009p944J2639J49483M3829
21443F2233q7735r1911m0976J59886O0861j1386o9129j2986j22972J4230m4307
21432a84192O0268o8196N2894N1066j69955J31367J34404J36996J31405k10478
21422F5579q3920J10362j47243K0073J45757R3827j86040j98715O7424q9761k37878
21411d40535N3711K91139P6401j71391r0377M1837J48874k6004r9375J07343R5756
21400a2621n6455j69530n6931J96254O6032L6841n242m6472l9745k6886j11650
$$ plain form
21389 -226405 -88036 -52290 25890 -33011 -193348 -236593 -113746 32590 182840 308582
21379 308582 74021 -59093 -78390 10783 192637 217855 107752 87522 187576 21376
21369 21376 -117743 -167976 -162406 -150099 -202938 -262264 -161145 57878 74458 105819 77978
21358 77978 17996 80611 -180266 -110913 33408 -89824 -213371 -289388 -318625 -253852 -259538
21347 -259538 -360023 -525384 -533343 -385022 -319367 -165028 -179544 -215261 -320475 -373361 -217837
21336 -217837 -166342 -211003 -397136 -538189 -560004 -617725 -423582 -250649 -81317 124898
21326 124898 88154 -129023 -198726 -522673 -609550 -553860 -476056 -343350 -380675 -350235 -165088
21315 -165088 -150421 -239054 -323718 -335418 -227282 -21896 -143529 -202283 -41594 -3084 -83045
$$ packed form
21389b26405J38369L5746P8180n8901j60337m3245J22847J46336J50250J25742
21379C08582k34561j33114j9297Q9173J81854K5218j10103k0230J00054j66200
21369B1376j39119n0233N570J2307n2839n9326J01119K19023J6580L1361k7841
21358G7978n9982O2615k60877O9353J44321j23232j23547p6017k9237O4773n686
21347b59538j00485j65361p959J48321O5655J54339j4516l5717j05214n2886J55524
21336b17837N1495m4661j86133j41053k1815n7721J94143J72933J69332K06215
21326A24898l6744k17177o9703l23947q6877N5690P7804J32706l7325L0440J85147
21315a65088J4667q8633q4664j1700J08136K05386j21633n8754J60689L8510p9961
$$ plain form
21304 -83045 -125510 54636 95197 29950 3005 -53224 -102346 -151798 -175119 -517061 -581933
21293 -581933 -614882 -475672 -280661 -205748 -145186 -134350 -184436 -120319 50461 245571 337182
21282 337182 427625 283090 95080 69721 -63852 -176785 -156574 -223241 -200901 -289607 -266050
21271 -266050 -119653 13013 136302 213826 76845 -139475 -264728 -94429 -23608 -1013
21261 -1013 -80185 51630 120454 213365 35162 -165742 -361865 -382334 -304653 -290352 -410123
21250 -410123 -510980 -312929 -229605 -154092 -207547 -227845 -88873 -129209 -205864 -177008 -118526
21239 -118526 -112712 -64573 94788 182177 136441 217847 178698 169577 -18260 -74744 -180723
21228 -180723 -95937 169468 217862 223554 291407 226856 -53494 -220656 -156365 -116859 -295433
$$ packed form
21304h3045m2465J80146M0561o5247k6945n6229m9122m9452k3321l41942o4872
21293e81933l2949J39210J95011P4913O0562J0836n0086O4117J70780J95110R1611
21282C37182R0443j44535j88010k5359j33573j12933K0211o6667K2340q8706K3557
21271b66050J46397J32666J23289P7524j36981k16320j25253J70299P0821K2595
21261a013p9172J31815O8824R2911j78203k00904j96123k0469P7681J4301j19771
21250d10123j00857J98051Q3324P5513n3455k0298J38972m0336p6655K8856N8482
21239a18526N814M8139J59361Q7389m5736Q1406l9149r121j87837n6484j05979
21228a80723Q4786K65405M8394N692O7853o4551k80350j67162O4291L9506j78574
$$ plain form
21217 -295433 -358155 -295503 -162191 -112566 -135482 -155508 -321364 -282623 -153007 93908 54087
21206 54087 -3588 111858 104639 -78060 -203880 -236708 -259708 -379335 -269988 -315891 -365264
21195 -365264 -216331 -37083 -24073 -244722 -253337 -205328 -60719 -208 -97544 -131384 -100179
21184 -100179 -210942 -66574 -11094 -49343 -96430 -74715 -31869 -27482 23069 128111 175927
21173 175927 190677 21617 -17508 55186 156019 184423 -4179 -34289 -94729 57995 220557
21162 220557 296182 182929 104174 231631 328758 326455 331626 182526 7930 -34463 -127696
21151 -127696 -224817 -166645 -3114 16020 67697 2311 -55186 -287479 -354489 -273142 -339543
21140 -339543 -251279 -297080 -313833 -187506 -136163 -17611 61110 -11184 -25662 -102514 -108359
$$ packed form
21217b95433o2722O2652J33312M9625k2916k0026j65856L8741J29616K46915l9821
21206E4087n7675J15446p219j82699j25820l2828k3000j19627J09347m5903m9373
21195c65264J48933J79248J3010k20649q615M8009J44609O0511r7336l3840L1205
21184a00179j10763J44368N5480l8249m7087K1715M2846M387N0551J05042M7816
21173A75927J4750j69060l9125P2694J00833K8404j88602l0110o0440J52724J62562
21162B20557P5625j13253p8755J27457R7127k303N171j49100j74596m2393r3233
21151a27696r7121N8172J63531J9134N1677o5386n7497k32293o7010Q1347o6401
21140c39543Q8264m5801j6753J26327N1343J18552P8721p2294j4478p6852n845
$$ plain form
21129 -108359 -145636 -147920 -30646 7278 10170 -38721 -55196 -82641 56694 -90953 47102
21118 47102 245652 277372 139986 -37759 -33877 7177 23788 24622 86653 49343 -98818
21107 -98818 -179106 -186874 -157915 -145385 -129272 -78885 140415 175310 82330 -16107 199852
21096 199852 202103 167786 149375 114761 84490 204307 164902 -41132 68810 75682 -115329
21085 -115329 -179136 -186677 -117927 -75576 -127762 -286590 -311307 -434743 -560932 -455872 -332633
21074 -332633 -317934 -292938 -411250 -208843 -32904 6287 64725 90144 101466 40528 13744
21063 13744 15950 -33329 105370 230976 293992 244041 190074 -75624 -186938 -77297 -92803
21052 -92803 -245649 -296532 -143996 -148685 -53788 24284 8721 -22813 79380 52651 -166890
$$ packed form
21129a08359l7277k284J17274L7924K892m8891j6475k7445J39335j47647J38055
21118D7102J98550L1720j37386j77745L882M1054J6611Q34O2031l7310j48161
21107i8818q0288p768K8959J2530J6113N0387K19300L4895r2980r8437K15959
21096A99852K251l4317j8411l4614l0271J19817l9405k06034J09942O872j91011
21085a15329o3807p541O8750M2351n2186j58828k4717j23436j26189J05060J23239
21074c32633J4699K4996j18312K02407J75939L9191N8438K5419J1322o0938k6784
21063A3744K206m9279J38699J25606O3016m9951n3967k65698j11314J09641j5506
21052i2803j52846n0883J52536m689R4897P8072j5563l1534J02193k6729k19541
$$ plain form
21041 -166890 -210457 -71473 74881 -129424 -157177 -15508 -142151 -152035 -37144 29993
21031 29993 -73580 -191058 -283535 -200715 -97287 -149995 -63583 13338 145537 236568 329405
21020 329405 304018 78198 24267 111382 136597 234120 243124 253331 72028 78335 104708
21009 104708 -35750 -124261 -250890 -303772 -174249 64365 4986 -61195 -108347 -178059 -50369
20998 -50369 20311 12213 -69966 13423 21804 -30513 70343 83787 86043 42661 -28411 -124624
20986 -124624 -132289 4509 257534 258458 53750 9992 -136067 -171113 -212267 -385586 -392203
20975 -392203 -399278 -565427 -470739 -232024 -205291 -115592 -131411 -189164 -167183 -173620 -240113
20964 -240113 -348209 -455850 -354788 -204593 -105789 -86544 -97492 -170437 -142615 -121860 -26719
$$ packed form
21041a66890m3567J38984J46354k04305k7753J41669j26643r884J14891O7137
21031B9993j03573j17478r2477Q2820J03428n2708Q6412P6921J32199R1031R2837
21020C29405k5387k25820n3931Q7115K5215R7523R004J0207j81303O307K6373
21009A04708j40458q8511j26629n2882J29523K38614n9379o6181m7152o9712J27690
20998e0369P0680q098q2179Q3389Q381n2317J00856J3444K256m3382p1072r6213
20986a24624p665J36798K53025R24k04708m3758j46059l5046m1154j73319o617
20975c92203p075j66149R4688K38715K6733Q9699j5819n7753K1981o437o6493
20964b40113j08096j07641J01062J50195R8804J9245j0948p2945K7822K0755R5141
$$ plain form
20953 -26719 -135936 -346562 -205705 -105169 -10143 150821 133211 115317 118815 55036 27649
20942 27649 -19986 -641 -65185 3375 -90844 -244875 -245610 -222760 -9418 -109893 -26909
20931 -26909 9305 -112945 -94181 -69638 -15721 105380 82924 12216 -70264 -140430 -120986
20920 -120986 -90137 -168752 -312854 -342011 -247071 -160515 -212670 -367739 -268218 -231424 -299366
20909 -299366 -250185 -339669 -419335 -154929 71200 117579 1158 -54035 104810 233176
20899 233176 290786 213349 210253 38028 22245 185393 368427 406110 199978 70185 -16916
20888 -16916 -30941 31487 -14373 -98267 -135410 -184920 -140319 -183968 -214140 -201027 -204024 -193492
20876 -193492 -119435 -10388 24177 -56599 -44760 -218889 -212499 -214060 -289379 -134442 -186515
$$ packed form
20953b6719j09217k10626J40857J00536R5026J60964j7610j7894L498o3779k7387
20942B7649m7635J9345o4544O8560r4219j54031p35K2850K13342j00475Q2984
20931b6909L6214j22250J8764K4543N3917J21101k2456p0708q2480p0166J9444
20920a20986L0849p8615j44102k9157R4940Q6556n2155j55069R9521L6794o7942
20909b99366M9181q9484p9666K64406K26129M6379j16421n5193J58845J28366
20899B33176N7610p7437l096j72225j5783J63148J83034L7683k06132j29793q7101
20888a6916j4025O2428m5860q3894l7143m9510M4601m3649l0172J3113k997J0532
20876a93492P4057J09047L4565q0776J1839j74129O390j561p5319J54937n2073
$$ plain form
20865 -186515 -298217 -169047 -137989 -83110 -231390 -339451 -464430 -265733 -198929 -86011
20855 -86011 -83855 -22012 31218 -74345 -171146 -176153 -76699 -81886 -63442 -3512 93196 73316
20843 73316 -21645 -154333 -36866 9055 35988 22299 15427 54499 78132 146347 -40747
20832 -40747 -41541 -174144 -327500 -293302 -114660 -53343 45711 84195 12250 -122930 -158912
20821 -158912 -100659 -104418 -185289 -103735 12339 49660 146901 196789 197660 162678 171594 22618
20809 22618 -39285 -90384 -96610 -177837 -245830 -213803 102949 123260 129039 81399 -100648 -163549
20797 -163549 -255322 -215711 -18505 41257 16062 -60809 -239287 -138949 -84959 -81814 -76078
20786 -76078 -23380 -1856 -23407 -43426 -104846 -152226 -247775 -436437 -505373 -277701 -136430
$$ packed form
20865a86515j11702J29170L1058N4879j48280j08061j24979J98697O6804J12918
20855h6011K156O1843N3230j05563r6801n007R9454n187J8444N9930R6708j9880
20843G3316r4961j32688J17467M5921K6933j3689o872L9072K3633O8215j87094
20832d0747p94j32603j53356L4198J78642O1317R9054L8484p1945j35180l5982
20821a58912N8253l759q0871Q1554J16074L7321R7241M9888Q71l4982Q916j48976
20809B2618o1903n1099o226q1227o7993L2027L16752K0311N779m7640j82047o2901
20797a63549r1773L9611J97206N9762k5195p6871j78478J00338N3990L145N736
20786g6078N2698K1524k1551k0019o1420m7380r5549j88662o8936K27672J41271
$$ plain form
20775 -136430 -258098 -399911 -299141 -32554 64330 -1034 -113568 -119736 -133747 -65718 -225160
20764 -225160 -412393 -292909 -7309 -8279 -121699 -248375 -361494 -339523 -230414 -109237
20754 -109237 -221347 -200088 -78915 -109472 -7361 -100123 3458 78421 106342 220597
20744 220597 255299 219316 109258 -45967 -62152 -66524 -98882 -132865 -170624 -97920 64121
20733 64121 223553 173391 85249 23732 -134034 -116412 -357867 -503531 -465361 -346772 -84798
20722 -84798 98871 145928 -99335 -242657 -235684 -144426 22144 -35560 -150191 -151023 -205273
20711 -205273 -299587 -444207 -444587 -404144 -368006 -82305 -11899 -107270 -88584 -129187 -131828 -112063
20699 -112063 -29644 -61001 -21392 127858 37135 -35585 -36032 30779 54182 141945 -29112
$$ packed form
20775a36430j21668j41813J00770K66587R6884o5364j12534o168j4011O8029j59442
20764b25160j87233J19484K85600r70j13420j26676j13119K1971J09109J21177
20754a09237j12110K1259J21173l0557J02111r2762J03581P4963K7921J14255
20744B20597L4702l5983j10058j55225j6185m372l2358l3983l7759P2704J62041
20733F4121J59432n0162q8142o1517j57766J7622k41455j45664L8170J18589K61974
20722h4798J83669M7057k45263j43322O973R1258J66570n7704j14631q32n4250
20711b05273r4314j44620l80M0443L6138K85701P0406r5371J8686m0603k641J9765
20699a12063Q2419l1357L9609J49250r0723p2720m47O6811K3403Q7763j71057
$$ plain form
20688 -29112 -202575 -191774 18012 179156 219484 218391 152429 16421 -53641 -107339 -84116
20677 -84116 71372 -28373 -202894 -245442 -212788 -266282 -336403 -281633 -159340 -48710 -74220
20666 -74220 -53620 -67278 103025 210791 134425 -73407 -225839 -192635 -258512 -459594 -445684
20655 -445684 -297244 -101409 -112892 -233734 -270515 -154348 -158651 37976 121337 150295 147351
20644 147351 -31953 -140556 -92799 42485 -21625 -162429 -71196 -76570 -11642 -133003 -137249
20633 -137249 28426 -102091 -187071 -193200 -122374 -8083 -106618 -325565 -329276 -320441 -318578
20622 -318578 -204549 -172144 -130390 -240398 -393235 -203417 -30730 -126168 -265455 -355902
20612 -355902 -285175 -407695 -383344 -210073 -215295 -186327 -269601 -405893 -361527 -352704 -360879
$$ packed form
20688b9112j73463J0801K09786J61144M0328j093o5962j36008p0062n3698K3223
20677h4116J55488r9745j74521m2548L2654n3494p0121N4770J22293J10630k5510
20666g4220K0600j3658J70303J07766p6366k07832j52432L3204o5877k01082J3910
20655d45684J48440J95835j1483j20842l6781J16167m303J96627Q3361K8958k944
20644A47351j79304j08603M7757J35284o4110j40804R1233n374O4928j21361m246
20633a37249J65675j30517q4980o129P0826J14291r8535k18947l711Q835J863
20622c18578J14029L2405M1754j10008j52837J89818J72687r5438j39287r0447
20612c55902P0727j22520K4351J73271n222K8968q3274j36292M4366Q823q175
$$ plain form
20601 -360879 -352562 -136511 -8089 46373 -82056 -221239 -139668 -118345 -33448 -149326 -241095
20590 -241095 -195212 -187563 21884 71414 -156979 -152237 -149450 -77463 -31201 -47625 35281 101101
20578 101101 16349 -181384 -259079 -342600 -433437 -390743 -346800 -464053 -524846 -262771 -236676
20567 -236676 -299503 -361137 -368645 -245456 -294357 -288106 -175650 -138601 -65188 -152887 -101311
20556 -101311 22359 -35487 -49232 -26871 -45207 -76460 -113879 -267082 -345474 -218424 -263607
20545 -263607 -170521 -96452 -16695 -102543 -125272 -134863 -137928 4066 42799 35247 -74588 -120913
20533 -120913 -10329 -30218 6070 -29296 135337 231029 14825 18347 63749 -102066 -385859
20522 -385859 -341372 -244103 -32473 -194039 -180003 -4927 -168135 -234487 -259274 -110780
$$ packed form
20601c60879Q317K16051J28422N4462j28429j39183Q1571K1323Q4897j15878r1769
20590b41095M5883P649K09447M9530k28393M742K787P1987M6262j6424Q2906O5820
20578A01101q4752j97733p7695q3521r0837M2694M3943j17253o0793K62075K6095
20567b36676o2827o1634p508J23189m8901O251J12456L7049P3413q7699N1576
20556a01311J23670n7846j3745K2361j8336l1253l7419j53203p8392J27050m5183
20545b63607R3086P4069P9757q5848k2729r591l065J41994L8733p552j09835m6325
20533a20913J10584j9889L6288l5366J64633R5692k16204L522M5402j65815k83793
20522c85859M4487R7269K11630j61566J4036J75076j63208o6352k4787J48494
$$ plain form
20512 -110780 -65319 -4403 45727 -111201 -226941 -277764 -192577 -262399 -272861 -234379 -283179
20501 -283179 -196714 -130945 -126516 -111771 -93705 45839 274274 194963 57495 38347 -90400
20490 -90400 -177088 -120508 -64800 22105 -4924 -21928 -40423 -174946 -193123 -149910 78448
20479 78448 261565 195341 -66109 -295768 -263408 -119641 -10052 5887 436 -155141 -121186
20468 -121186 -52829 -41220 3317 -82270 -30450 42482 -11320 182768 129300 -179248 -215433
20457 -215433 -177081 -202450 -201497 -329346 -285816 -373801 -273680 -158576 -135675 -108208 -130708
20446 -130708 -65873 51827 4928 -56403 -121764 -280346 -207092 -70975 -92763 -114021 -84628
20435 -84628 -11881 -88651 -144041 -124933 2163 -101868 -199134 -179203 -187247 -290138 -271994
$$ packed form
20512a10780M5461O0916N0130j56928j15740n0823Q5187o9822j0462L8482m8800
20501b83179Q6465O5769M429J4745J8066J39544K28435p9311j37468j9148j28747
20490i0400q6688N6580N5708Q6905k7029j7004j8495j34523j8177M3213K28358
20479G8448J83117o6224k61450k29659L2360J43767J09589J5939n451j55577L3955
20468a21186O8357J1609M4537q5587N1820P2932n3802J94088n3468l08548l6185
20457b15433L8352k5369R53j27849M3530q7985J00121J15104K2901K7467k2500
20446a30708O4835J17700m6899o1331o5361j58582P3254J36117k1788k1258K9393
20435h4628P2747p6770n5390J9108J27096j04031r7266J9931q044j02891J8144
$$ plain form
20424 -271994 -36361 -100563 -148406 -112477 -82150 -2920 32938 -94140 -273680 -278693 -353986
20413 -353986 -333069 -249216 -202155 -156762 -9105 39370 -80744 -311493 -547156 -700006
20403 -700006 -501288 -421323 -406088 -445816 -413998 -400345 -402956 -167932 -126200 -40692 -4444
20392 -4444 -142487 -259361 -164117 -25996 20419 -60049 -89627 -174100 -184492 -58746 -121660
20381 -121660 -109766 -162008 -263774 -322427 -329809 -325689 -213719 -156839 -137190 -102805 -211788
20370 -211788 -354128 -226759 -44140 79375 -118040 -179803 -134417 -166194 -187194 -89726
20360 -89726 26521 -90456 -93040 -45547 -89997 -11645 3634 -54368 -95221 -81609 -43619
20349 -43619 101597 168209 161567 -45759 -222893 -359954 -396312 -246146 -152250 -100594 -151281
$$ packed form
20424b71994K35633o4202m7843L5929L0327P9230L5858j27078j79540n013p5293
20413c53986K0917Q3853M7061M5393J47657M8475j20114k30749k35663j52850
20403g00006J98718P9965J5235l9728L1818J3653k611K35024M1732Q5508L6248
20392d444j38043j16874R5244J38121M6415q0468k9578q4473j0392J25746o2914
20381a21660J1894n2242j01766n8653p382M120J11970N6880J9649L4385j08983
20370b11788j42340J27369J82619J23515j97415o1763M5386l1777k1000R7468
20360h9726J16247j16977k584M7493m4450P8352J5279n8002m0853J3612L7990
20349d3619J45216O6612o642k07326j77134j37061l6358J50166R3896N1656n0687
$$ plain form
20338 -151281 -257793 -86207 -95118 -236662 -375578 -312429 -276759 -89829 108892 -53096
20328 -53096 -269308 -284904 -254017 -253347 -194727 -285780 -430246 -483693 -426418 -263330 -325149
20317 -325149 -276642 -113787 11385 -138550 -267581 -308545 -413053 -379695 -342011 -133867
20307 -133867 -33000 -24962 179824 183622 -2061 -9412 -263921 -417807 -323183 -170733 -101380
20296 -101380 -14192 -24043 -174792 -243368 -249712 -179766 -150346 -133241 -259689 -459397 -363541
20285 -363541 -276546 -337841 -352396 -305444 -197118 -90492 -29366 2711 5198 91540 -22656
20274 -22656 30750 194647 201947 115482 -20221 -88331 -44038 -60809 -8128 129961 75579
20263 75579 5237 108710 64212 -79792 -62876 -59527 -278258 -324383 -251714 -136622 -100659
$$ packed form
20338a51281j06512J71586q911j41544j38916O3149L5670J86930J98721j61988
20328e3096k16212j5596L0887O70N8620r1053j44466n3447N7275J63088o1819
20317c25149M8507J62855J25172j49935j29031m0964j04508L3358L7684K08144
20307a33867J00867Q038K04786L798j85683p351k54509j53886R4624J52450O9353
20296a01380Q7188r851j50749o8576o344O9946K9420J7105j26448j99708R5856
20285c63541Q6995o1295j4555M6952J08326J06626O1126L2077K487Q6342j14196
20274b2656N3406J63897P300q6465j35703o8110M4293j6771N2681J38089n4382
20263G5579p0342J03473m4498j44004J6916L349k18731m6125P2669J15092L5963
$$ plain form
20252 -100659 -225876 -229895 -249692 -365664 -311141 -180427 -295758 -348209 -417970 -561040 -389482
20241 -389482 -319476 -248382 -56652 56646 213236 331063 179668 -40266 -164857 -221634
20231 -221634 -145271 -145317 -131670 -119962 -234830 -253321 -258476 -240596 -43477 -7935 154861 238923
20219 238923 -46010 -251954 -152568 -82842 -80353 -172206 -200465 -221740 -176578 -62792 21204
20208 21204 -109080 -145266 -231878 -149759 -167198 -267949 -387196 -607585 -500726 -248650
20198 -248650 -306099 -271385 -158905 -340335 -412473 -334759 -322135 -361498 -442948 -539725 -417246
20187 -417246 -219465 -199145 -272236 -370145 -263607 -217191 -107023 -39380 -96250 -35403 -65326
20176 -65326 -173893 -141295 -190376 -338587 -364608 -372369 -352892 -234259 -60888 -9573 39432
$$ packed form
20252a00659j25217m019j9797j15972N4523J30714j15331n2451o9761j43070J71558
20241c89482P0006P1094J91730J13298J56590J17827j51395k19934j24591n6777
20231b21634P6363m6J3647J1708j14868j8491n155J7880J97119L5542J62796Q4062
20219B38923k84933k05944R9386O9726K489r1853k8259k1275M5162J13786Q3996
20208B1204j30284l6186q6612Q2119j7439j00751j19247k20389J06859K52076
20198b48650n7449L4714J12480j81430p2138P7714J2624l9363q1450r6777J22479
20187d17246J97781K0320p3091r7909J06538M6416J10168O7643n6870O0847k9923
20176f5326j08567L2598m9081j48211k6021p761J9477J18633J73371N1315M9005
$$ plain form
20165 39432 113489 -34447 -80354 -278227 -213926 65026 -11866 -129206 79359 260787
20155 260787 332900 622156 949725 1240819 1518387 1761131 1765909 1572470 1199488 803981
20145 803981 422788 198858 45901 44372 251474 261629 256918 134010 -69664 -156528 -63590
20134 -63590 -142031 -62131 -32424 -139718 -133178 -200379 -159818 -83895 1623 9846 261986 393402
20122 393402 391571 448637 395323 146009 -26153 52678 131635 258623 183603 -61336 -52613
20111 -52613 21681 62560 66333 -6402 -74165 -117404 47820 -56788 -244897 -105526 -52589
20100 -52589 -30284 -25173 -341935 -445773 -324659 -156692 -40666 -56288 -53812 24297 56477
20089 56477 -60693 -89077 -108817 -106936 -26264 35243 25184 43064 -26541 -103626 -26488 -56835
$$ packed form
20165C9432P4057j47936m5907j97873O4301K78952p6892j17340K08565J81428
20155B60787P2113K89256L27569K91094K77568K42744M778j93439l72982l95507
20145H03981l81193k23930j52957j529K07102J0155m711j22908k03674q6864R2938
20134f3590p8441P9900K9707j07294O540o7201M0561P5923Q5518Q223K52140J31416
20122C93402j831N7066n3314k49314j72162P8831P8957J26988p5020k44939Q723
20111e2613P4294M0879L773p2735o7763m3239J65224j04608j88109J39371N2937
20100e2589K2305N111l16762j03838J21114J67967J16026j5622K476P8109L2180
20089E6477j17170k8384j9740J881Q0672O1507j0059J7880o9605p7085P7138l0347
$$ plain form
20077 -56835 147708 226450 66749 -10732 -92937 -93206 -15120 -42553 -127507 -267021 -315654
20066 -315654 -247422 -337347 -252589 -257564 -407043 -329805 -253669 -212513 -250813 -322116 -291894
20055 -291894 -297713 -378289 -147858 -101045 -158582 -14526 61540 76252 157408 157240 68381 -86586
20043 -86586 -116483 -104122 -62108 -203330 -221545 -409620 -373378 -242943 -115615 -6115 27702
20032 27702 36038 26279 12330 65680 129930 -20465 -12781 836 -4926 6952 120323 96434
20020 96434 41236 23432 175319 157009 -27571 -100369 30180 62842 72818 57987 -16022
20009 -16022 -35974 -29996 -132950 -191196 -187540 -118310 -270849 -266107 -270274 -203049 -95671 -53147
19997 -53147 -51165 -5342 162185 -19251 -196915 -193811 -166502 -281036 -398325 -384859 -372793
$$ packed form
20077e6835K04543P8742j59701p7481q2205k69P8086k7433q4954j39514m8633
20066c15654O8232q9925Q4758m975j49479P7238P6136M1156l8300p1303L0222
20055b91894n819q0576K30431M6813n7537J44056P6066J4712Q1156j68q8859j54967
20043h6586k9897J2361M2014j41222j8215j88075L6242J30435J27328J09500L3817
20032B7702Q336r759j3949N3350O4250j50395P684J3617n762J1878J13371k3889
20020I6434n5198j7804J51887j8310j84580p2798J30549L2662R976j4831p4009
20009a6022j9952N978j02954n8246L656O9230j52539M742m167O7225J07378M2524
19997e3147J982M5823J67527j81436j77664L104K7309j14534j17289J3466J2066
$$ plain form
19986 -372793 -339805 -263474 -207148 -239924 -280253 -262718 -259228 -351703 -333708 -377267 -304104 -334062
19974 -334062 -263352 -261313 -236824 -287210 -173631 -78063 -81103 -187032 -276694 -325481 -348105
19963 -348105 -229272 -112046 -11678 -15000 -201559 -186931 -127672 -97026 -133521 -226509 -81444
19952 -81444 46524 97083 -12619 20358 -15476 -232087 -366494 -475915 -384597 -319012 -149820
19941 -149820 -130 38687 -125880 35978 75919 55539 -50932 -215885 -242087 -314368
19931 -314368 -328732 -283547 -245769 -170685 -157386 -128866 66481 -24751 -131079 -174465 -162964
19920 -162964 -25409 113750 58087 -84160 -70386 3791 -134663 -157524 -134051 -119391 65933
19909 65933 -109893 -115593 -212348 -371067 -250564 67234 88056 -80102 -128297 -156305 -98501
$$ packed form
19986c72793L2988P6331N6326l2776m0329J7535L490r2475J7995m3559P3163k9958
19974c34062P0710K039K4489n0386J13579R5568l040j05929q9662m8787k2624
19963c48105J18833J17226J00368l322j86559J4628N9259L0646l6495r2988J45065
19952h1444J27968N0559j09702L2977l5834k16611j34407j09421R1318O5585J69192
19941a49820J49690L8817j64567J61858L9941k0380j06471j64953k6202p2281
19931c14368j4364M5185L7778P5084J3299K8520J95347r1232j06328m3386J1501
19920a62964J37555J39159n5663j42247J3774P4177j38454k2861K3473J4660J85324
19909F5933j75826n700r6755j58719J20503L17798K0822j68158m8195k8008N7804
$$ plain form
19898 -98501 -84368 -90919 -194674 -285277 -302110 -152443 -147313 -290161 -234219 -78408 -72331
19887 -72331 -190443 -114661 -4098 38447 113590 -107962 -193597 -198554 -151479 -56603 -163630
19876 -163630 -156973 -209211 -87292 -194717 -56268 151442 136134 -2383 -26360 -63064 -190008
19865 -190008 -296621 -186739 -51806 -120033 -162001 -306907 -248588 29600 148402 149966
19855 149966 44939 -80240 -59122 -36344 -76670 -126557 -125296 -165117 -260805 -242040 -145822
19844 -145822 -111893 -72170 -104123 -49669 55714 116124 -30502 -186993 -275429 -389150 -275238
19833 -275238 -78305 34115 46500 -67586 -188565 -56821 47272 54478 -6266 -70301
19823 -70301 -92708 39368 12652 -7626 -22386 49244 159715 133816 154111 32038 -11990
$$ packed form
19898i8501J4133o551j03755r0603j6833J49667N130j42848N5942J55811O077
19887g2331j18112P5782J10563M2545P5143k21552q5635m957M7075R4876j07027
19876a63630O657n2238J21919j07425J38449K07710j5308j38517k3977l6704j26944
19865a90008j06613J09882J34933o8227m1968j44906N8319K78188J18802J564
19855A49966j05027j25179K1118K2778m0326m9887J261l9821r5688J8765R6218
19844a45822L3929L9723l1953N4454J05383O0410j46626j56491q8436j13721J13912
19833b75238J96933J12420J2385j14086j20979J31744J04093P206o0744o4035
19823g0301k2407J32076k6716k0278j4760P1630J10471k5899K0295j22073m4028
$$ plain form
19812 -11990 -53067 -87566 -65970 35412 77174 93889 168990 260025 448642 452008 317357
19801 317357 147609 95663 -13813 -164967 -178733 -80762 24900 56035 -24511 3835 113078
19790 113078 76191 87562 101538 -70998 -81131 9036 104339 99973 73334 -29766 178543
19779 178543 265112 153055 -115992 -50287 114750 -123444 -306956 -306389 -34004 33422 35857
19768 35857 -8988 -48523 -231916 -239734 -149746 -129086 -140285 -62549 -142085 -158304 -165128 -60863
19756 -60863 -106473 -168987 -252584 -111979 -7270 8442 -27481 14978 33634 -58136 -2031
19745 -2031 172592 246867 220032 85720 187975 3524 -134793 -93756 -127052 -222364 -34768
19734 -34768 -71037 -316553 -362705 -204842 -83417 -130336 -228932 -169856 -271773 -397741 -272593
$$ packed form
19812a1990m1077l4499K1596J01382M1762J6715P5101R1035J88617L366j34651
19801C17357j69748n1946j09476j51154j3766R7971J05662L1135q0546K8346J09243
19790A13078l6887J1371J3976j72536j0133R0167R5303m366k6639j03100K08309
19779A78543Q6569j12057k69047O5705J65037k38194j83512N67K72385O7426K435
19768C5857m4845l9535j83393p818Q9988K0660j1199P7736p9536j6219o824J04265
19756f0863m5610o2514q3597J40605J04709J5712l5923M2459J8656r1770N6105
19745b031J74623P4275k6835j34312J02255j84451j38317M1037l3296r5312J87596
19734c4768l6269k45516m6152J57863J21425m6919r8596N9076j01917j25968J25148
$$ plain form
19723 -272593 -248652 -123963 -212989 -377850 -237178 -108417 -112499 -29234 -56546 85534 103153
19712 103153 94070 136006 -36327 -239039 -206082 -4301 12122 38866 65891 86415 41789
19701 41789 -177128 -77265 -16472 -26979 -133983 3996 162686 244251 269152 374070 344691
19690 344691 285197 497553 551481 528379 512353 632547 582252 512531 897210 1168834 1339065
19679 1339065 1351246 1282381 1156093 816726 415437 241753 239960 153732 13741 -164931
19669 -164931 -75635 -93602 -18207 26121 -47833 -235641 -326320 -317651 -71795 194144 93207
19658 93207 71792 19630 -25220 -66158 15227 -69223 -172642 -199509 -71582 32965 52412
19647 52412 -48230 -105134 -28329 -38362 28362 95913 27319 -3422 -43044 4701 50177
$$ packed form
19723b72593K3941J24689q9026j64861J40672J28761m082Q3265k7312J42080J7619
19712A03153r083M1936j72333k02712L2957K01781J6423K6744K7025K0524m4626
19701D1789k18917R9863O0793j0507j07004J37979J58690Q1565K4901J04918k9379
19690C44691n9494K12356N3928k3102j6026J20194n0295o9721L84679K71624J70231
19679A339065J2181o8865j26288l39367m01289j73684j793q6228j39991j78672
19669a64931Q9296j7967P5395M4328p3954j87808r0679Q669K45856K65939j00937
19658I3207k1415n2162m4850m0938Q1385q4450j03419k6867J27927J04547J9447
19647E2412j00642n6904P6805j0033O6724O7551o8594l0741l9622M7745M5476
$$ plain form
19636 50177 209428 222054 186123 288703 377720 224099 200163 84860 79451 47097 16150
19625 16150 -11303 39544 181675 392625 317792 280660 353559 567754 554888 546387 678701
19614 678701 602624 248090 133223 203878 261480 306283 323250 395081 439124 550683 657812
19603 657812 559951 473820 536155 487294 548362 737687 822946 830462 895416 851825 1014426
19592 1014426 1306974 1491241 1486400 1566187 1549996 1448429 1452895 1567179 1872039 2166186
19582 2166186 2783597 3135706 3744732 4640094 5497838 6205623 6588213 6821158 7246291
19573 7246291 7805617 8383598 8919747 9216253 9389118 9654408 10129656 11049306 12669335
19564 12669335 14815088 17533383 21442184 26511511 33131780 42540857 56549620 78189150
$$ packed form
19636E0177J59251J2626l5931J02580Q9017j53621k3936j15303n409l2354l0947
19625A6150k7453N0847J42131K10950p4833l7132P2899K14195j2866q501J32314
19614F78701p6077l54534j14867P0655N7602M4803J6967P1831M4043J11559J07129
19603F57812r7861q6131O2335m8861O1068J89325Q5259P516O4954m3591J62601
19592A014426K92548J84267m841P9787j6191j01567M466J14284L04860K94147
19582B166186O17411L52109O09026Q95362Q57744P07785L82590K32945M25133
19573G246291N59326N77981N36149K96506J72865K65290M75248R19650J620029
19564A2669335K145753K718295L908801N069327O620269R409077J4008763K1639530
$$ plain form
19556 78189150 112576683 167248514 248013455 345386713 420440089 434688698 382769909
19549 382769909 289213196 197635534 133693757 93789435 68717729 52483931 41573277
19542 41573277 33891077 28424289 24286318 21094254 18475464 16405127 14914475 13811347
19534 13811347 13070666 12510976 11942746 11291908 10910685 10587086 10355343 9858383 9207207
19525 9207207 8459686 7685651 6595743 5699921 5121968 4424818 3939706 3472743 3121109
19516 3121109 2776890 2745931 2557085 2325550 2239427 2086128 1844362 1759083 1885914 1882027
19506 1882027 1826451 1855931 1762779 1655265 1770011 1612245 1434320 1256679 1485275 1512394
19496 1512394 1313683 1251708 1294189 1277203 1416178 1406766 1083606 901486 909029 1011199 990013
$$ packed form
19556G8189150L4387533N4671831Q0764941R7373258P5053376J4248609n1918789
19549C82769909r3556713r1577662o3941777l9904322k5071706j6233798j0910654
19542D1573277p682200n466788m137971l192064k618790k070337j490652j103128
19534A3811347p40681n59690n68230o50838l81223l23599k31743m96960o51176
19525I207207p47521p74035j089908q95822n77953o97150m85112m66963l51634
19516C121109l44219l0959j88846k31535q6123j53299k41766q5279J26831l887
19506A882027n5576K9480r3152j07514J14746j57766j77925j77641K28596K7119
19496A512394j98711o1975M2481j6986J38975r412l23160j82120P543J02170k1186
$$ plain form
19485 990013 888069 915840 881324 1082991 1169417 1256968 1379447 1279988 1311870 1295945 1152303
19474 1152303 1097047 1039365 956813 920910 823648 813273 713484 665747 839117 821292 804401
19463 804401 894786 989090 848514 797745 865663 896047 1087423 1221974 1236708 1073623 964841
19452 964841 923596 866011 869286 794249 721494 696502 462624 303468 449249 627870 679242
19441 679242 533757 506542 498513 440428 449794 497030 524150 552427 631616 538229 440072 498542
19429 498542 712757 525052 317471 157314 86347 38511 -40983 48886 94097 124395 114174
19418 114174 164368 334431 357552 564665 934341 1054050 747102 430868 121433 95484
19408 95484 160836 103179 395138 712117 1034964 1042429 796078 735767 615599 575481 764029
$$ packed form
19485I90013j01944K7771l4516K01667Q6426Q7551J22479r9459L1882j5925j43642
19474A152303n5256n7682q2552l5903r7262j0375r9789m7737J73370j7825j6891
19463H04401R0385R4304j40576n0769O7918L0384J91376J34551J4734j63085j08782
19452I64841m1245n7585L275p5037p2755k4992k33878j59156J45781J78621N1372
19441F79242j45485k7215q029n8085R366M7236K7120K8277P9189r3387r8157N8470
19429D98542K14215j87705k07581j60157p0967m7836p9494Q9869M5211L0298j0221
19418A14174N0194J70063K3121K07113L69676J19709l06948l16234l09435k5949
19408I5484O5352n7657K91959L16979L22847P465k46351o0311j20168m0118J88548
$$ plain form
19397 764029 805098 925741 1041839 1024779 962128 711619 626864 655169 763668 1134778
19387 1134778 1235738 1089053 855052 562233 488310 401107 469766 401615 284673 163572
19377 163572 114325 142190 108206 28008 97661 285121 183156 -22347 -8279 42916 166380
19366 166380 88454 -9068 -47804 17847 101111 75736 -109183 -279360 -201866 -114109 -79164
19355 -79164 -28499 -30416 -146042 -214519 -175574 -109235 -85940 -6253 142006 184753 147168
19344 147168 175658 398747 603255 719120 586001 420576 455659 402953 547291 592749
19334 592749 658831 715111 789200 758602 703118 614763 461222 356594 293632 173639 17613
19323 17613 -36220 -62035 46404 284634 394639 421020 480807 543395 511666 575338 731841
$$ packed form
19397G64029M1069J20643J16098j7060o2651k50509q4755K8305J08499L71110
19387A134778J00960j46685k34001k92819p3923q7203O8659o8151j16942j21101
19377A63572m9247K7865l3984q0198O9653J87460j01965k05503J4068N1195J23464
19366A66380p7926r7522l8736O5651Q3264k5375j84919j70177P7494Q7757L4945
19355g9164N0665j917j15626o8477L8945O6339K3295P9687J48259M2747l7585
19344A47168K8490K23089K04508J15865j33119j65425L5083n2706J44338M5458
19334E92749O6082N6280P4089l0598n5484q8355j53541j04628o2962j19993j56026
19323A7613n3833k5815J08439K38230J10005K6381N9787O2588l1729O3672J56503
$$ plain form
19312 731841 831447 981379 829466 609436 438074 545093 596910 503774 433687 314109
19302 314109 373153 568868 612619 472114 216635 102317 144956 86603 69766 288154
19292 288154 259703 189855 122601 63270 138979 171104 137039 258212 -22442 -179616 -135588
19281 -135588 -99652 -14135 -60006 -101370 -77965 1158 43147 -124510 -67884 31150 54581
19270 54581 46387 -50957 -101519 -64749 73641 16740 -112863 -14189 157315 91357 -11771
19259 -11771 16853 103488 83594 42861 24747 85500 120876 -1335 61645 145292 53624
19248 53624 -91473 -131062 -6985 131991 223480 166149 213849 -6300 -136126 -151880 -211352
19237 -211352 -164636 -30094 123539 124218 215183 184335 53261 2415 143704 126545 22629
$$ packed form
19312G31841R9606J49932j51913k20030j71362J07019N1817r3136p0087j19578
19302C14109N9044J95715M3751j40505k55479j14318M2639n8353j6837K18388
19292B88154k8451o9848o7254n9331P5709L2125l4065J21173k80654j57174M4028
19281a35588L5936Q5517m5871m1364K3405P9123M1989j67657N6626R9034K3431
19270E4581q194r7344n0562L6770J38390n6901j29603R8674J71504o5958j03128
19259a1771K8624Q6635j9894m0733j8114O0753L5376j22211O2980Q3647r1668
19248E3624j45097l9589J24077J38976R1489n7331M7700k20149j29826j5754n9472
19237b11352M6716J34542J53633O79R0965l0848j31074n0846J41289j7159j03916
$$ plain form
19226 22629 -9743 122650 156026 181534 185553 330415 463999 297372 136264 174370 270557
19215 270557 203140 100440 -71646 -536 -65770 -46959 149003 270777 326291 344085 401842
19204 401842 453782 621473 698638 767437 751756 791378 564991 465615 477461 410644 304711
19193 304711 338340 315688 254703 272270 404651 295898 131420 -11636 7182 109843
19183 109843 245811 308445 237570 137210 138514 132770 41361 36941 73215 101077 35359 -54841
19171 -54841 23821 -127236 -80054 -25559 141814 215816 17377 -35508 6642 77936 89917
19160 89917 18521 -134532 -179293 4722 126802 134132 268819 422669 454996 351887 90022
19149 90022 6506 136667 225303 240967 429192 352098 145280 260890 302912 243803 157610
$$ packed form
19226B2629l2372J32393L3376K5508M019J44862J33584j66627j61108L8106R6187
19215B70557o7417j02700j72086P1110o5234J8811J95962J21774N5514J7794N7757
19204D01842N1940J67691P7165O8799j5681L9622k26387r9376J1846o6817j05933
19193C04711L3629k2652o0985J7567J32381j08753j64478j43056J8818J02661
19183A09843J35968O2634p0875j00360J304n744r1409m420L6274K7862o5718r0200
19171e4841P8662j51057M7182N4495J67373P4002j98439n2885M2150P1294J1981
19160H9917p1396j53053m4761J84015J22080P330J34687J53850L2327j03109k61865
19149I0022q3516J30161Q8636J5664J88225p7094k06818J15610M2022n9109q6193
$$ plain form
19138 157610 199501 190625 56479 113227 128532 274751 272161 108580 109200 232408 365097
19127 365097 463462 393625 267253 253574 207390 267457 300064 204735 110402 170048 156877
19116 156877 182505 141058 24059 14006 82865 106323 76859 34758 56559 18741 -128651
19105 -128651 -149688 4703 -22272 -80453 -141136 9947 177597 408505 434504 267550
19095 267550 236853 144184 19733 11860 289108 514028 532723 500230 571300 605609 604816
19084 604816 576289 532809 482854 404064 424737 297333 274081 265603 320022 272211 255350
19073 255350 177147 286181 513026 584356 558132 384183 405599 504272 452690 282085 268934
19062 268934 220390 143385 277999 382013 284922 285891 397406 444403 521266 405580 535951
$$ packed form
19138A57610M1891q876j34146N6748J5305J46219k590j63581O20J23208J32689
19127C65097R8365o9837j26372j3679m6184O0067L2607r5329r4333N9646j3171
19116A56877K5628m1447j16999j0053O8859K3458k9464m2101K1801l7818j47392
19105a28651k1037J54391k6975n8181o0683J51083J67650K30908K5999j66954
19095B67550l0697r2669j24451p873K77248K24920J8695l2493P1070L4309p93
19084F04816k8527m3480m9955p8790K0673j27404k3252q478N4419m7811j6861
19073B55350p8203J09034K26845P1330k6224j73949K1416R8673n1582j70605j3151
19062B68934m8544p7005J34614J04014r7091R69J11515M6997P6863j15686J30371
$$ plain form
19051 535951 832873 742837 452901 260752 188523 348874 335506 303189 449996 487909
19041 487909 445748 435619 467119 484574 612466 806653 965334 1048392 1090214 1113421 1027692
19030 1027692 1063499 1050044 871333 904180 1173913 1359447 1219093 1032132 935945 902567
19020 902567 958488 819544 790002 1032882 1018097 1092692 1122086 1025637 958950 1027387 1072476
19009 1072476 1113340 1032403 1063814 1180293 1409310 1488017 1750660 2024059 2242192 2349082
18999 2349082 2371277 2566762 2599133 2261014 2127596 2218402 2546989 2725246 2757085 2902779
18989 2902779 2987906 3045178 3280191 3583249 3774102 3841690 3888337 3977571 4063032 4286317
18979 4286317 4531255 4910795 5330133 5619691 5866685 6091524 6562459 7002416 7496436
$$ packed form
19051E35951K96922r0036k89936j92149p2229J60351j3368l2317J46807L7913
19041D87909m2161j0129L1500J7455J27892J94187J58681Q3058M1822K3207q5729
19030A027692L5807j3455j78711L2847K69733J85534j40354j86961r6187l3378
19020I02567N5921j38944k9542K42880j4785P4595K9394r6449o6687O8437M5089
19009A072476M0864q0937L1411J16479K29017P8707K62643K73399K18133J06890
18999B349082K2195J95485L2371l38119j33418R0806L28587J78257L1839J45694
18989B902779Q5127N7272K35013L03058J90853O7588M6647Q9234Q5461K23285
18979D286317K44938L79540M19338K89558K46994K24839M70935M39957M94020
$$ plain form
18970 7496436 8054213 8782459 9799189 10858892 12130626 13701123 15557148 17531738
18962 17531738 19930300 22890264 26714570 31419864 37541863 45073488 53896684 63644003
18954 63644003 72577717 79103853 82650094 83769548 83792765 84524998 86488891 89134219
18946 89134219 90224589 88037566 82386786 74476116 66126276 58718510 53147185 49463482
18938 49463482 47584511 47356384 49099891 52598498 57636448 64552442 72812414 80968123
18930 80968123 87265081 90567015 90850368 89639586 88639531 88615010 89441651 89658349 87056108
18921 87056108 80918485 72072254 62094884 52334811 43934007 37171439 31629019 27330504
18913 27330504 23803413 20892338 18420252 16538151 14955720 13447897 12085413 11169572
$$ packed form
18970G496436N57777P28246J016730J059703J271734J570497J856025J974590
18962A7531738K398562K959964L824306M705294O121999P531625Q823196R747319
18954F3644003Q933714O526136L546241J119454K3217P32233J963893K645328
18946H9134219J090370k187023n650780p910670q349840p407766n571325l683703
18938D9463482j878971k28127J743507L498607N037950O915994Q259972Q155709
18930H0968123O296958L301934K83353j210782j000055k4521Q26641K16698k602241
18921H7056108o137623q846231r977370r760073q400804o762568n542420m298515
18913B7330504l527091k911075k472086j882101j582431j507823j362484r15841
$$ plain form
18905 11169572 10396945 9539245 8674643 8240945 7842386 7300525 6830057 6355726 5859717
18896 5859717 5517924 5173079 5091326 4876082 4515241 4235443 4274144 4268733 4038571 3835726
18886 3835726 3468207 3093829 2919308 2696780 2584284 2520296 2499271 2405141 2275847 2245330
18876 2245330 2159772 1904126 1721208 1729151 1715315 1651346 1619379 1686471 1648927 1481139 1345707
18865 1345707 1300417 1297871 1305600 1144752 1070988 1161565 1223598 1298495 1102645 916595 835392
18854 835392 923232 1026810 1048538 1065124 998475 946406 866669 847136 711381 586764 649039
18843 649039 883880 976557 926509 742410 619124 617694 650207 710460 746344 604790 600802
18832 600802 828541 840385 722713 529597 398542 400717 426009 500792 471144 495732 367300
$$ packed form
18905A1169572p72627q57700q64602m33698l98559n41861m70468m74331m96009
18896E859717l41793l44845q1753k15244l60841k79798L8701n411k30162k02845
18886C835726l67519l74378j74521k22528j12496o3988k1025r4130j29294l0517
18876B245330q5558k55646j82918P943j3836o3969l1967O7092l7544j67788j35432
18865A345707m5290k546P729j60848p3764R0577O2033P4897j95850j86050q1203
18854H35392Q7840J03578K1728J6586o6649n2069p9737j9533j35755j24617O2275
18843F49039K34841R2677n0048j84099j23286j430L2513O0253L5884j41554l988
18832F00802K27739J1844j17672j93116j31055K175K5292P4783k9648K4588j28432
$$ plain form
18821 367300 365247 479954 411120 430293 474713 427502 387606 137687 56338 28510 173545
18810 173545 266943 295914 275232 352455 588253 515277 446738 466670 450990 435559 263458
18799 263458 389725 544559 479363 446135 509121 441352 443866 437256 479394 575295 682896
18788 682896 622580 382222 173407 199856 339455 465104 675511 560794 209339 86303
18778 86303 196283 232772 218518 250986 145331 70978 313931 334586 534116 970577 1305078
18767 1305078 1738499 2317629 2259132 1668857 1155662 780934 645165 486519 521129 555472
18757 555472 399129 314020 307192 400830 461566 457082 454267 492003 433666 134856 10748
18746 10748 61485 140206 286653 260699 212194 199160 130471 120630 114832 126334 139473 207195
$$ packed form
18821C67300k053J14707o8834J9173M4420m7211l9896k49919q1349k7828J45035
18810A73545R3398K8971k0682P7223K35798p2976o8539J9932j5680j5431j72101
18799B63458J26267J54834o5196l3228O2986o7769K514o610M2138R5901J07601
18788F82896o0316k40358k08815K6449J39599J25649K10407j14717l51455j23036
18778H6303J09980L6489j4254L2468j05655p4353K42953K0655J99530M36461L34501
18767A305078M33421N79130n8497n90275n13195l74728j35769j58646L4610L4343
18757E55472j56343q5109o828R3638O0736m484k815L7736n8337k98810j24108
18746A0748N0737P8721J46447k5954m8505j3034o8689r841n798J1502J3139O7722
$$ plain form
18734 207195 175924 40309 100639 188278 144352 150391 206954 144749 133562 388233 345055
18723 345055 95784 4486 68093 189916 276445 224881 157749 314375 232251 272712 201281
18712 201281 130353 143316 127847 98194 -10085 -116577 -23369 112283 170079 211350 298431
18701 298431 250506 127622 254253 213829 191096 325578 259270 66947 -9447 98864
18691 98864 87200 97545 181314 295424 65143 -89149 25003 118474 14672 -230602
18681 -230602 -383084 -507029 -393635 -342635 -242668 -186763 -113581 -10745 28395 152376
18671 152376 79524 56399 -27182 18060 17091 28041 26002 73796 356714 416720 306568 165569
18659 165569 -7419 -59572 108907 111194 65772 235880 236300 -83388 -84166 -55015 -167540
$$ packed form
18734B07195l1271j35615O0330Q7639m3926O039N6563o2205j1187K54671m3178
18723C45055k49271r1298O3607J21823Q6529n1564o7132J56626q2124M0461p1431
18712B01281p0928J2963j5469k9653j08279j06492R3208J35652N7796M1271Q7081
18701B98431m7925j22884J26631m0424k2733J34482o6308j92323p6394J08311
18691I8864j1664J0345Q3769J14110k30281j54292J14152R3471j03802k45274
18681b30602j52482j23945J13394N1000R9967N5905P3182J02836L9140J23981
18671A52376p2852k3125q3581M5242r69J0950k039M7794K82918O0006j10152j40999
18659A65569j72988n2153J68479K287m5422J70108M20l19688p78K9151j12525
$$ plain form
18648 -167540 -248214 -126860 237257 552632 382866 320717 166886 90289 154247 127150
18638 127150 138602 159075 212976 233764 324336 326584 485712 602448 711471 702347 520499
18627 520499 293994 221359 186877 180550 52959 14597 60908 18597 11476 196392 314269
18616 314269 213517 178601 249016 284029 213710 172171 212078 280061 239303 133801 190055
18605 190055 345656 310376 222006 65030 22200 76732 -6426 59710 103712 116934 154861
18594 154861 218257 130406 80755 197160 146223 -1133 104026 156378 35803 16286 55556
18583 55556 78809 64501 -24329 149861 195492 139290 133076 216134 372442 303396 337479
18572 337479 340416 258240 308109 485714 478079 299623 135851 -65953 -58428 22306 119037
$$ packed form
18648a67540q0674J21354L64117L15375j69766o2149j53831p6597O3958k7097
18638A27150J1452K0473N3901K0788R0572K248J59128J16736J09023r124j81848
18627E20499k26505p2635l4482o327j27591l8362M6311m2311p121J84916J17877
18616C14269j00752l4916P0415L5013p0319m1539L9907O7983m0758j05502N6254
18605A90055J55601l5280q8370j56976m2830N4532q3158O6136M4002J3222L7927
18594A54861O3396q7851m9651J16405n0937j47356J05159N2352j20575j9517L9270
18583E5556K3253j4308q8830J74190M5631n6202o214Q3058J56308o9046L4083
18572C37479K937q2176M9869J77605p635j78456j63772k01804P525Q0734R6731
$$ plain form
18561 119037 157474 228275 214684 294653 256792 189270 151312 275628 221527 314415 416759
18550 416759 438589 452891 281647 216319 313500 339177 324046 264411 330953 437944 561436
18539 561436 658218 697148 728387 818063 813916 737122 773251 673305 437325 395767 467302
18528 467302 442608 386947 246306 225316 214387 246484 240654 196226 369759 481054 400569
18517 400569 310111 337752 598778 763179 785414 996949 1098094 1123523 1094977 1210308
18507 1210308 1367807 1290504 1164397 1164862 1264319 1295969 1404629 1344630 1378686 1200619 1051246
18496 1051246 991581 979601 1001133 840711 644992 641351 766940 866034 1091996 1268976
18486 1268976 1546714 1770590 2029730 2411321 2424654 2507907 2817889 3095376 3093844 3175478
$$ packed form
18561A19037L8437P0801j3591P9969l7861o7522l7958J24316n4101R2888J02344
18550D16759K1830J4302j71244o5328R7181K5677j5131n9635O6542J06991J23492
18539E61436R6782L8930L1239Q9676m147p6794L6129r9946k35980m1558P1535
18528D67302k4694n5661j40641k0990j0929L2097n830m4428J73533J11295q0485
18517D00569r0458K7641K61026J64401K2235K11535J01145K5429k8546J15331
18507A210308J57499p7303j26107M65R9457L1650J08660n9999L4056j78067j49373
18496A051246n9665j1980K1532j60422j95719l641J25589R9094K25962J76980
18486A268976K77738K23876K59140L81591J3333Q3253L09982K77487j532Q1634
$$ plain form
18476 3175478 3293536 3154259 3187219 3154404 2995223 2830764 2815879 2955703 3144075 3278785
18466 3278785 3514350 3870150 4245221 4410790 4653869 5050857 5414915 5829426 6598792
18457 6598792 7855723 9241903 10985627 13343515 16547598 20956417 27717034 37825456
18449 37825456 52789735 73432659 96430844 111403767 109052680 95001165 82896287
18442 82896287 79702790 86234898 99812153 111403026 108343927 89708522 67134554
18435 67134554 49600164 38014577 30410764 25231317 21754622 19465343 17946384 16998804
18427 16998804 16323779 15920132 15883848 16551194 17726445 19326493 22005212 26233530 32493555
18418 32493555 41950970 56336914 77296937 103453169 125937779 131248119 118009962
$$ packed form
18476C175478J18058j39277L2960l2815j59181j64459j4885J39824J88372J34710
18466C278785K35565L55800L75071J65569K43079L96988L64058M14511P69366
18457F598792J256931J386180J743724K357888L204083M408819O760617J0108422
18449C7825456J4964279K0642924K2998185J4972923k351087j4051515j2104878
18442H2896287l193497O532108J3577255J1590873l059099j8635405k2573968
18435F7134554j7534390j1585587p603813n179447l476695k289279j518959r47580
18427A6998804o75025m03647l6284O67346J175251J600048K678719M228318O260025
18418C2493555R457415J4385944K0960023K6156232K2484610N310340j3238157
$$ plain form
18411 118009962 100658940 92010534 95032780 107433039 121997622 125346734 109582629
18404 109582629 83763393 60916425 44807642 33996311 26883696 21890775 18410620
18397 18410620 15677245 13514486 11987979 10911673 9889234 9004969 8266543 7541665
18389 7541665 6933210 6668542 6357481 5904849 5507440 5342925 5054119 4535576 4204692
18380 4204692 3948666 3578231 3146496 3025228 2854457 2598607 2380846 2279680 2134023
18371 2134023 2037034 2115304 2110208 1923902 1967898 1751178 1675145 1712281 1911429 1876063 1670600
18360 1670600 1609361 1728059 1805635 1634393 1266414 1062905 860818 823865 936648 814586
18350 814586 886635 927376 1089186 1068962 899302 887066 738645 773254 1005358 1105840
$$ packed form
18411A18009962j7351022q648406L022246J2400259J4564583L349112j5764105
18404A09582629k5819236k2846968j6108783j0811331p112615m992921l480155
18397A8410620k733375k162759j526507j076306j022439q84265p38426p24878
18389G541665o08455k64668l11061m52632l97409j64515k88806n18543l30884
18380D204692k56026l70435m31735j21268j70771k55850k17761j01166j45657
18371B134023r6989P8270n096j86306M3996k16720p6033L7136J99148l5366k05463
18360A670600o1239J18698P7576j71242l67979k03509k02087l6953J12783j22062
18350H14586P2049M0741J61810k0224j69660j2236j48421L4609K32104J00482
$$ plain form
18340 1105840 1042903 958834 981992 893780 753563 885194 754308 619487 677665 864000
18330 864000 920043 722633 592503 629525 748934 651081 532424 266681 322127 485843
18320 485843 574332 554412 254600 124228 181113 234015 360991 397140 411295 385480 332698
18309 332698 359884 269260 308980 407966 457679 479342 473100 539885 605369 637534 397471
18298 397471 388500 444034 642552 554572 475278 660215 714722 782759 735907 725405 633994
18287 633994 667933 705770 635773 638631 573411 511455 423564 428126 477102 392257 441489 238706
18275 238706 179733 380768 458752 602595 595542 671793 673446 547541 393645 340762 201778
18264 201778 128308 329117 502699 455958 369919 463102 627509 713112 636208 580751 647088
$$ packed form
18340A105840o2937q4069K3158q8212j40217J31631j30886j34821N8178J86335
18330H64000N6043j97410j30130L7022J19409r7853j18657k65743N5446J63716
18320D85843Q8489j9920k99812j30372N6885N2902J26976L6149J4155k5815n2782
18309C32698K7186r0624L9720R8986M9713K1663o242O6785O5484L2165k40063
18298C97471q971N5534J98518q7980p9294J84937N4507O8037m6852j0502r1411
18287F33994L3939L7837o9997K858o5220o1956q7891M562M8976q4845M9232k02783
18275B38706n8973K01035P7984J43843p053P6251J653j25905j53896n2883j38984
18264B01778p3470K00809J73582m6741q6039R3183J64407Q5603p6904n5457O6337
$$ plain form
18253 647088 677703 724468 630236 430756 431467 512968 580062 487648 330228 216569 170251
18242 170251 280731 339219 448216 505846 489668 499358 933993 1419603 1490534 1142013 934717
18231 934717 839883 763567 671073 721608 920383 811045 904237 590834 236142 317873 264209
18220 264209 86484 62811 305974 484365 430561 338691 334499 317642 358992 541451 786295
18209 786295 746585 487163 428664 382815 416205 496921 637039 820200 739158 457624 468581
18198 468581 464732 411695 416363 499022 490389 393788 388421 350203 441050 484976 426075 348707
18186 348707 367027 400568 377327 364814 550818 910459 864954 721529 558406 538603 648620
18175 648620 605722 482555 317999 192284 316839 351555 344883 354827 375341 527845 629865
$$ packed form
18253F47088L0615M6765r4232j99480P11Q1501O7094r2414j57420j13659m6318
18242A70251J10480N8488J08997N7630j6178R690M34635M85610P0931l48521k07296
18231I34717r4834p6316r2494N0535J98775j09338R3192l13403l54692Q1731n3664
18220B64209j77725k3673K43163J78391n3804r1870m192j6857M1350J82459K44844
18209G86295l9710k59422n8499m5849L3390Q0716J40118J83161q1042k81534J0957
18198D68581l849n3037M668Q2659q633r6601n367l8218R0847M3926n8901p7368
18186C48707J8320L3541k3241j2513J86004L59641m5505j43425j63123j9803J10017
18175F48620m2898j23167j64556j25715J24555L4716o672R944K0514J52504J02020
$$ plain form
18164 629865 673180 755530 878460 845408 755472 656980 604409 682804 955791 842673 793847
18153 793847 937901 1182128 1075209 726296 790802 884913 761588 725925 722634 746972 895547
18142 895547 1075426 1018222 1068382 1097901 1082652 1126093 1225622 1190365 1247195 1455871 1677937
18131 1677937 1848462 2230946 2650700 2887152 2997298 3288362 3511384 3698405 4027853
18122 4027853 4579846 5403406 6560868 7777178 8945597 10995437 14047937 18818670
18114 18818670 25902782 37135902 56754070 93428465 161267884 270335079 381181532
18107 381181532 376879599 251285779 141167643 84108462 54973457 38615085 28517976
18100 28517976 21881290 17512512 14520762 12278980 10495049 9048620 7893549 7119561
$$ packed form
18164F29865M3315Q2350J22930l3052q9936r8492n2571P8395K72987j13118m8826
18153G93847J44054K44227j06919l48913O4506R4111j23325l5663l291K4338J48575
18142H95547J79879n7204N0160K9519j5249M3441R9529l5257N6830K08676K22066
18131A677937J70525L82484M19754K36452J10146K91064K23022J87021L29448
18122D027853N51993Q23560J157462J216310J168419K049840L052500M770733
18114A8818670P084112J1233120J9618168L6674395O7839419J09067195J10846453
18107C81181532m301933j25593820j10118136n7059181k9135005j6358372j0097109
18100B8517976o636686m368778k991750k241782j783931j446429j155071p73988
$$ plain form
18092 7119561 6333780 5739339 5177662 4580477 4135680 3618736 3174701 2926621 2744544
18083 2744544 2518483 2458465 2491105 2493954 2474123 2265040 2176554 2037344 1871768 1774781 1691536
18072 1691536 1613401 1640923 1621685 1364244 1397754 1264241 1108714 955412 926509 1028327
18062 1028327 1314396 1450479 1407402 1438544 1421239 1300874 1200371 1179179 1210102 1159571
18052 1159571 1052278 1120585 1164292 1133994 951845 760320 813752 753287 678839 640370 663702
18041 663702 549980 418887 483599 682162 718654 724314 993914 1263713 1387460 1668025
18031 1668025 1754878 1911803 1838669 1640036 1393117 1263742 1247067 1410185 1582392 1737737
18021 1737737 1983894 2321552 2698924 2831658 2824933 2944632 3094146 3209907 3329299 3663903
$$ packed form
18092G119561p85781n94441n61677n97185m44797n16944m44035k48080j82077
18083B744544k26061o0018L2640K849j9831k09083q8486j39210j65576r6987q3245
18072A691536p8135K7522j9238k57441L3510j33513j55527j53302k8903J01818
18062A028327K86069J36083m3077L1142j7305j20365j00503k1192L0923n0531
18052A159571j07293O8307M3707l0298j82149j91525N3432o0465p4448l8469K3332
18041F63702j13722j31093O4712J98563L6492N660K69600K69799J23747K80565
18031A668025Q6853J56925p3134j98633k46919j29375j6675J63118J72207J55345
18021A737737K46157L37658L77372J32734o725J19699J49514J15761J19392L34604
$$ plain form
18011 3663903 4020673 4585628 5433059 6447631 7872822 9325336 11268041 14489894 19902259
18002 19902259 29370613 46242409 75300946 117550071 155354728 151514665 108290805
17995 108290805 67888749 44375662 31436055 23857395 19189190 16154357 14191026
17988 14191026 13156506 12576317 12336949 12433974 12968403 13837950 15587132 18375917 23000352
17979 23000352 31014506 45099873 68963970 105505106 144885107 154335964 121737919
17972 121737919 82475741 59822958 51724584 54840425 70113642 98924374 133243128
17965 133243128 144181715 115280532 75220234 48624266 33830025 25486451 20216950
17958 20216950 16699624 14587961 13198493 12418889 11963902 11713733 11624645 12078651 13162321
$$ packed form
18011C663903L56770N64955Q47431J014572J425191J452514J942705L221853N412365
18002A9902259R468354J6871796K9058537M2249125L7804657l840063m3223860
17995A08290805m0402056k3513087j2939607p578660m668205l034833j963331
17988A4191026j034520n80189k39368R7025N34429Q69547J749182K788785M624435
17979B3000352Q014154J4085367K3864097L6541136L9380001R450857l2598045
17972A21737919l9262178k2652783q098374L115841J5273217K8810732L4318754
17965A33243128J0938587k8901183m0060298k6595968j4794241q343574n269501
17958B0216950l517326k111663j389468p79604m54987k50169q9088M54006J083670
$$ plain form
17949 13162321 14906139 17786377 22793601 32107446 49081423 76866521 112990127 134660011
17941 134660011 116054754 76139834 47087686 30718287 21475314 16187109 13019233
17934 13019233 10800829 8970703 7557119 6495275 5643369 4950421 4451114 4187136 3855559
17925 3855559 3607102 3571239 3672682 3689231 3580615 3415021 2851549 2429468 2050150 1959394
17915 1959394 1827520 1783078 1817935 1985928 2269839 2353309 2208544 1805237 1570385 1313706
17905 1313706 1120189 1024694 1079820 1036566 906877 1034610 1072883 990303 916197 988301 917520
17894 917520 1056356 993377 783571 764031 743342 758815 645490 731425 632880 753578 757943
17883 757943 842681 945938 923580 843619 743522 774541 725776 665691 719165 777656 648863
$$ packed form
17949A3162321J743818K880238N007224R313845J6973977K7785098L6123606K1669884
17941A34660011j8605257l9914920k9052148j6369399r242973n288205l167876
17934A3019233k218404j830126j413584j061844q51906o92948m99307k63978l31577
17925C855559k48457l5863J01443J6549j08616j65594n63472m22081l79318r0756
17915A959394j31874m4442L4857J67993K83911Q3470j44765m03307k34852k56679
17905A313706j93517r5495N5126m3254j29689J27733L8273q2580p4106P2104p0781
17894I17520J38836o2979k09806j9540k0689J5473j13325Q5935r8545J20698M365
17883G57943Q4738J03257k2358p9961j00097L1019m8765o0085N3474N8491j28793
$$ plain form
17872 648863 621766 434757 165526 322911 543802 694385 663070 682325 543193 525042
17862 525042 516118 535140 489901 543530 466358 434980 497701 495722 591632 725428 833049
17851 833049 833574 952418 1092841 1231581 1325474 1250756 1216908 996784 1208404 1349519 1482518
17840 1482518 1718068 1600937 1191788 749014 580491 609376 524825 532803 401390 525725
17830 525725 579705 415991 443546 521161 529918 538036 462007 448873 437338 387538 543267
17819 543267 769652 1041961 1256943 1179685 1081744 1003653 803520 677560 655364 813282
17809 813282 1182099 1310693 1171412 931038 752427 488699 339041 381866 236488 202029
17799 202029 157392 199395 263825 279448 240070 189701 219648 401823 341180 272352 338161
$$ packed form
17872F48863k7097j87009k69231J57385K20891J50583l1315J9255j39132j8151
17862E25042q924J9022m5239N3629p7172l1378O2721j979R5910J33796J07621
17851H33049N25J18844J40423J38740R3893p4718l3848k20124K11620J41115J32999
17840A482518K35550j17131m09149m42774j68523K8885q4551P978j31413J24335
17830E25725N3980j63714K7555P7615Q757Q118p6029j3134j1535m9800J55729
17819E43267K26385K72309K14982p7258r7941p8091k00133j25960k2196J57918
17809H13282L68817J28594j39281k40374j78611k63728j49658M2825j45378l4459
17799B02029m4637M2003O4430J5623l9378n0369K9947J82175o0643o8828O5809
$$ plain form
17788 338161 306836 410231 524434 477824 433838 448115 407901 218013 60105 124418 225748
17777 225748 338247 345130 333556 361515 561767 704524 603945 411996 267680 236954
17767 236954 130469 136920 25119 73692 151607 294893 100513 48468 68496 157594 153633
17756 153633 84155 145194 69881 56537 105348 93239 13478 147178 440357 459995 293372
17745 293372 237839 222792 204056 171824 245939 274982 154793 123320 58978 62244 66987 209589
17733 209589 207949 96304 126311 88650 -3659 -38553 61234 52464 72641 82337 189014 262255
17721 262255 429932 281421 -26271 -85350 -69247 143876 147390 189625 319292 366847 390611
17710 390611 312058 262799 297055 111477 752 127333 37934 -121638 -58957 5411 72734
$$ packed form
17788C38161l1325J03395J14203m6610m3986J4277m0214j89888j57908O4313J01330
17777B25748J12499O883j1574K7959K00252J42757j00579j91949j44316l0726
17767B36954j06485O451j11801M8573P7915J43286j94380n2045K0028Q9098l961
17756A53633o9478O1039p5313j3344M8811j2109p9761J33700K93179J9638j66623
17745B93372n5533j5047j8736l2232P4115K9043j20189l1473o4342L266M743J42602
17733B09589j640j11645L0007l7661r2309l4894R9787q770K0177R696J06677P3241
17721B62255J67677j48511l07692n9079J6103K13123L514M2235J29667M7555K3764
17710C90611p8553m9259L4256j85578j10725J26581q9399j59572O2681O4368O7323
$$ plain form
17699 72734 70596 36049 45575 -45426 65246 276789 399502 325152 139672 73850 -79536
17688 -79536 -86758 -57557 -90057 -36073 5472 55901 103677 82765 134414 148173 259803 287927
17676 287927 202212 163114 30566 42436 92148 86360 154722 199421 150760 24453 17493
17665 17493 223235 277369 176833 104544 199990 309314 156081 8711 -71245 25392 183156
17654 183156 182945 155265 53088 157745 333772 374355 290531 224072 130760 100404 73642
17643 73642 126041 17756 126742 29127 -63808 -66129 183768 464330 580986 392690 281761
17632 281761 349399 310139 111833 30807 -111137 -53153 116244 176471 97571 47183 159529
17621 159529 245675 168313 59970 -2533 157710 179060 157218 104348 15505 102252 50190
$$ packed form
17699G2734k138l4547R526r1001J10672K11543J22713p4350j85480o5822j53386
17688g9536p222K9201l2500N3984M1545N0429M7776k0912N1649J3759J11630K8124
17676B87927q5715l9098j32548J1870M9712n788O8362M4699m8661j26307o960
17665A7493K05742N4134j00536p2289R5446J09324j53233j47370p9956R6637J57764
17654A83156k11k7680j02177J04657J76027M0583q3824o6459r3312l0356k6762
17643G3642N2399j08285J08986r7615r2935k321K49897K80562J16656j88296j10929
17632B81761O7638l9260j98306q1026j41944N7984J69397O0227p8900n0388J12346
17621A59529Q6146p7362j08343o2503J60243K1350k1842n2870q8843Q6747n2062
$$ plain form
17610 50190 -3109 189473 360919 223882 95012 133136 93458 14560 21380 -60522 60879
17599 60879 244991 69339 -33353 451 57103 11061 108034 280607 327884 394901 341446
17588 341446 261566 140951 242590 223256 -20749 6722 55761 220311 164747 164392 239500
17577 239500 314337 272609 94394 49762 165236 227033 198677 29182 -35643 -63740 -120080
17566 -120080 -186120 -146757 -159456 -142611 -217321 -122492 13887 -51387 -225201 -86499 63140
17555 63140 51846 118404 104767 114847 198867 78615 -85263 -13866 271810 351767 323858
17544 323858 327953 428641 345106 186468 -41141 -27231 233784 207575 104516 38345 -13512
17533 -13512 12520 32528 91888 31978 127085 91941 182245 378272 374854 262188 230433
$$ packed form
17610E0190n3299J92582J71446j37037j28870L8124l9678p8898O820q1902J21401
17599F0879J84112j75652j02692L3804N6652m6042R6973J72573M7277O7017n3455
17588C41446p9880j20615J01639j9334k44005K7471M9039J64550n5564l55P5108
17577B39500P4837m1728j78215m4632J15474O1797k8356j69495o4825k8097n6340
17566a20080o6040L9363j2699J6845p4710R4829J36379o5274j73814J38702J49639
17555F3140j1294O6558j3637J0080Q4020j20252j63878P1397K85676P9957k7909
17544C23858M095J00688q3535j58638k27609J3910K61015k6209j03059o6171n1857
17533a3512K6032K0008N9360n9910R5107l5144R0304J96027l418j12666l1755
$$ plain form
17522 230433 313355 289982 221838 283813 231176 143950 200336 240202 67494 -13396 42892
17511 42892 -9350 32858 96465 32966 131087 144432 -16413 -114480 -199885 -285350 -307537
17500 -307537 -289400 -300201 -83569 128126 116215 184028 251084 140460 112136 157647 69963
17489 69963 19900 75044 -452 44760 -54174 32986 123858 46806 -48322 41724 9889 84382
17477 84382 33064 -131539 -132905 -131623 89207 27418 -78761 -54117 -42073 -10825 -72385
17466 -72385 -58462 131891 32197 -10196 116864 300573 484156 804130 721551 492222
17456 492222 283071 133429 136393 155765 140833 111262 108689 65914 235572 255761 368743
17445 368743 654758 731074 1119028 1846254 2177309 1704719 1324106 1012865 735760 846169
$$ packed form
17522B30433Q2922k3373o8144O1975n2637q7226N6386L9866j72708q0890N6288
17511D2892n2242M2208O3607o3499R8121J3345j60845r8067q5405q5465k2187
17500c07537J8137j0801K16632K11695j1911O7813O7056j10624k8324M5511q7684
17489F9963n0063N5144p5496M5212r8934Q7160R0872p7052r5128R0046l1835P4493
17477H4382n1318j64603j366J282K20830o1789j06179K4644J2044L1248o1560
17466g2385J3923J90353r9694m2393J27060J83709J83583L19974q2579k29329
17456D92222k09151j49642K964J9372j4932k9571k573m2775J69658K0189J12982
17445C68743K86015P6316L87954P27226L31055m72590l80613l11241k77105J10409
$$ plain form
17435 846169 763910 562487 347678 244370 260828 265993 160314 241511 470299 729661
17425 729661 732023 549865 234328 168659 289846 106960 104353 113206 -1206 -79969 -119868
17414 -119868 -36663 -11765 56377 187385 353125 388699 363498 419199 248570 224939 256009
17403 256009 346650 530149 420174 202938 -101624 -117322 -32330 17851 178804 188084 156164
17392 156164 98008 164230 186672 -44046 -97350 -121786 -68358 30821 -255898 -452060 -366756
17381 -366756 -211786 -323869 -402303 -294332 -323021 -171639 -110224 -69241 -5603 7383 7002
17370 7002 155721 93065 -21472 -125957 -111595 -191369 -35741 75446 101881 177622 92099
17359 92099 65665 214667 318732 203199 144657 37278 60192 62639 84756 149531 71919
$$ packed form
17435H46169q2259k01423k14809j03308J6458N165j05679Q1197K28788K59362
17425G29661K362j82158l15537o5669J21187j82886k607Q853j14412p8763l9899
17414a19868Q3205K4898O8142J31008J65740L5574k5201N5701j70629k3631L1070
17403B56009R0641J83499j09975k17236l04562j5698Q4992N0181J60953R280l1920
17392A56164n8156O6222K2442k30718n3304k4436N3428R9179k86719j96162Q5304
17381c66756J54970j12083p8434J07971k8689J51382O1415M0983O3638J2986l81
17370G002J48719o2656j14537j04485J4362p9774J55628J11187K6435P5741q5523
17359I2099k6434J49002J04065j15533n8542j07379K2914K447K2117O4775p7612
$$ plain form
17348 71919 -135943 -249784 -214138 -147798 4428 74369 -13681 -51339 -137835 -147258 -86464
17337 -86464 -93896 -89670 -121724 -160527 -76261 -26119 -130814 -127004 -96567 -179957 -101209 -163936
17325 -163936 -235262 -325171 -352191 -249535 -296889 -291926 -141573 -124320 -139906 -123213 -223789
17314 -223789 -127109 -33525 -195362 -217202 -235254 -141113 102924 282928 331840 155349 -76781
17303 -76781 -275724 -358209 -189173 -74301 -114132 -79492 -27717 -30681 -107423 -209029 -143469
17292 -143469 -71954 -32005 -171279 -170475 -199798 -190991 -139518 -50993 19492 7794 24518 142668
17280 142668 44154 -196518 -338455 -199578 -94358 -24892 -40816 -52480 12355 -33359 -98437
17269 -98437 18459 115717 243899 146265 102933 199955 57159 -145568 -132320 -60033 -43186
$$ packed form
17348G1919k07862j13841L5646O6340J52226O9941q8050l7658q6496r423O0794
17337h6464p432M226l2054l8803Q4266N0142j04695L810L0437q3390P8748o2727
17325a63936p1326q9909k7020J02656m7354M963J50353J7253j5586J6693j00576
17314b23789R6680R3584j61837k1840j8052R4141K44037J80004M8912j76491k32130
17303g6781j98943q2485J69036J14872l9831L4640N1775k964p6742j01606O5560
17292a43469P1515L9949j39274Q04k9323Q807N1473Q8525P0485j1698J6724J18150
17280A42668r8514k40672j41937J38877J05220O9466j5924j1664O4835m5714o5078
17269i8437J16896R7258J28182r7634m3332R7022j42796k02727J3248P2287J6847
$$ plain form
17258 -43186 -62610 46529 -66087 -93960 -71510 -77796 -77629 -8651 -179049 -292018 -170695
17247 -170695 -236894 -468348 -358099 -332920 -280470 -404960 -331445 -341486 -282518 -276356 -240545
17236 -240545 -282338 -248784 -124614 -185233 -316791 -528988 -479004 -391710 -244128 -154880 -236210
17225 -236210 -108479 -110188 -204351 -112248 -124402 -227043 -286576 -320336 -384755 -306313 -185291
17214 -185291 -127320 -115513 -193943 -172938 -186181 -293044 -295133 -241548 -155456 -112739 -1828
17203 -1828 -13345 78949 59480 -108353 47819 281417 140085 50274 6752 2942 -11370
17192 -11370 -224786 -175836 -157331 -213469 -292315 -237279 -4529 85488 91815 -69351 -141014
17181 -141014 -209986 -22637 137595 4164 -257821 -376330 -362809 -176767 -127148 -180862
$$ packed form
17258d3186j9424J09139j12616k7873K2450o286J67O8978j70398j12969J21323
17247a70695o6199k31454J10249K5179N2450j24490P3515j0041N8968O162L5811
17236b40545m1793L3554J24170o0619j31558k12197M9984Q7294J47582Q9248q1330
17225b36210J27731j709r4163R2103j2154j02641n9533l3760o4419P8442J21022
17214a85291N7971J1807p8430K1005j3243j06863k089N3585Q6092M2717J10911
17203a828j1517R2294j9469j67833J56172K33598j41332q9811m3522l810j4312
17192a1370k13416M8950J8505n6138p8846N5036K32750R0017O327j61166p1663
17181a41014o8972J87349J60232j33431k61985j18509J3521J86042M9619n3714
$$ plain form
17171 -180862 -98731 11634 -54180 -278765 -262278 -141546 -85308 -87294 4701 93551 171195
17160 171195 107489 66831 159920 214672 318205 230471 226580 217667 91560 49246 24769
17149 24769 121791 255073 157028 157815 212462 81210 -22296 -21440 75200 121274 15214 -101054
17137 -101054 -111067 -91440 -15779 154553 86675 74984 118912 55428 -61556 -42061 64768
17126 64768 6462 3230 2602 -81995 -44898 -87914 89761 -5126 -53218 -131029 -139026 -112395
17114 -112395 -81474 -159332 -192805 -167945 -197248 -208072 -190299 -262005 -140502 -184336 -51091
17103 -51091 95729 54578 53843 -26396 44905 -20939 -82606 26977 -34721 -71494 21763 110064
17091 110064 59432 29307 -12438 177867 213977 292379 264214 142086 19429 -29444 -168420
$$ packed form
17171a80862Q2131J10365o5814k24585J6487J20732N6238j986R1995Q8850P7644
17160A71195o3706m0658R3089N4752J03533q7734l891q913j26107m2314k4477
17149B4769R7022J33282r8045P87N4647j31252j03506Q56R6640M6074j06060j16268
17137a01054j0013J9627P5661J70332o7878j1691M3928o3484j16984J9495J06829
17126F4768n8306l232o28q4597L7097m3016J77675r4887m8092p7811p997K6631
17114a12395L0921p7858l3473K4860k9303j0824J7773p1706J21503m3834J33245
17103e1091J46820m1151p35q0239P1301o5844o1667J09583o1698l6773R3257Q8301
17091A10064n0632l0125m1745J90305L6110P8402k8165j22128j22657m8873j38976
$$ plain form
17080 -168420 -224994 -99508 -154018 -191147 -45901 -85824 -148867 -80810 -123569 -48086 107039
17069 107039 89770 -52587 -118018 -70804 -194984 -242995 -48805 31976 -39327 -65180 73000
17058 73000 141865 78465 38875 22022 88529 68626 -105493 -203292 -324959 -191029 87021
17047 87021 75799 77086 151264 192843 275086 158237 108744 137178 36435 -75107 -212010
17036 -212010 -257718 -75251 155428 132337 24376 -92992 -273240 -215260 -167432 -163926 -108251
17025 -108251 -237803 -178677 -28067 63590 -88701 -131144 -69846 -3221 68329 138083 37728
17014 37728 4587 -98550 -225285 -182582 -213101 -215295 -248840 -289564 -201139 -71478 -40651
17003 -40651 -266824 -250612 -316376 -270855 -17716 49412 83392 160625 259546 132396 42289
$$ packed form
17080a68420n6574J25486n4510l7129J45246l9923o3043O8057m2759P5483J55125
17069A07039j7269j42357o5431M7214j24180m8011J94190Q0781p1303k5853J38180
17058G3000O8865o3400l9590j6853O6507j9903j74119r7799j21667J33930K78050
17047H7021j1222J287P4178M1579Q2243j16849m9493K8434j00743j11542j36903
17036b12010m5708J82467K30679k3091j07961j17368j80248N7980M7828L506N5675
17025a08251j29552N9126J50610R1657j52291m2443O1298O6625P1550O9754j00355
17014C7728l3141j03137j26735M2703l0519k194l3545m0724Q8425J29661L0827
17003d0651k26173J6212o5764M5521K53139O7128L3980P7233R8921j27150r0107
$$ plain form
16992 42289 27565 -49643 54945 223402 377632 642657 716781 660273 564156 238633 61970
16981 61970 258681 323007 309575 303467 213352 139588 15338 110582 458159 767911 766797
16970 766797 590879 367149 179929 220915 193058 153170 -30646 1635 130842 33042
16960 33042 -46891 -32245 61409 7699 -249690 -288304 -329722 -361672 -280634 -136406 -86894
16949 -86894 96192 200828 110193 15077 97959 216617 130924 -53363 -126829 -223388 -281086
16938 -281086 -294829 -191429 44090 146206 -1804 -58954 -46785 -74520 -190896 -320737
16928 -320737 -335085 -252001 -115993 -236348 -460572 -490009 -402179 -229049 -142632 -75922 -68009
16917 -68009 -71406 -87695 -131068 -222207 -105837 -104299 -167804 -123046 -172026 -139980 -270796 -254373
$$ packed form
16992D2289j4724p7208J04588J68457J54230K65025P4124n6508r6117l25523j76663
16981F1970J96711O4326j3432o108r0115p3764j24250R5244L47577L09752j114
16970G66797j75918k23730j87220M0986k7857l9888j83816L2281J29207r7800
16960C3042p9933J4646R3654n3710k57389l8614m1418l1950Q1038J44228M9512
16949h6894J83086J04636r0635r5116Q2882J18658q5693j84287p3466r6559n7698
16938b81086j3743J03400K35519J02116j48010n7150J2169k7735j16376j29841
16928c20737j4348Q3084J36008j20355k24224k9437Q7830J73130Q6417O6710P913
16917f8009l397j6289m3373r1139J16370J538o3505M4758m8980L2046j30816J6423
$$ plain form
16905 -254373 -217744 -33709 130286 -4991 -115593 -4710 -140750 -146761 -6056 -35659
16895 -35659 -46087 -182223 -202657 -45578 -49054 76211 -148207 -302804 -171875 -207262 -20856
16884 -20856 97123 122524 -72968 -238455 -41010 -21236 -42727 -458 66014 32367 -9266
16873 -9266 -178138 -293807 -172333 -236261 -266606 -179015 -197008 -265312 -343900 -293172 -284914
16862 -284914 -239784 -291078 -139025 53961 -34127 -144926 -136170 -188723 -346004 -311154 -118018
16851 -118018 42721 119477 38008 -89475 -63465 -26021 20340 84812 40070 14117 -16877
16840 -16877 30811 84148 42906 28984 53735 105855 174073 132010 66638 125258 129708 52382
16828 52382 64319 91196 127442 189393 258075 235728 147753 283279 329728 214171 191264
$$ packed form
16905b54373L6629J84035J63995j35277j10602J10883j36040o011J40705k9603
16895c5659j0428j36136k0434J57079l476J25265k24418j54597J30929l5387J86406
16884b0856J17979K5401j95492j65487J97445J9774k1491M2269O6472l3647m1633
16873i266j68872j15669J21474o3928l0345Q7591j7993o8304p8588N0728Q258
16862b84914M5130n1294J52053J92986q8088j10799Q756n2553j57281L4850J93136
16851a18018J60739P6756q1469j27483K6010L7444M6361O4472m4742k5953l0994
16840a6877M7688N3337m1242j3922K4751N2120O8218m2063o5372N8620M450p7326
16828E2382J1937K6877L6246O1951O8682k2347q7975J35526M6449j15557k2907
$$ plain form
16817 191264 103211 57391 -125036 -264489 -190169 -135851 -161767 -168003 -133771 -133354 -135866 -66070
16805 -66070 -79827 -38720 -60348 10887 -116137 55686 71671 13932 -642 -93325 -1172
16794 -1172 -5360 21064 -10743 -7446 12099 -36489 -123723 -272846 -330185 -176466 26617 16201
16782 16201 37183 70534 -846 -55783 5361 185207 188507 54411 9408 -5281 1695 50105
16770 50105 -6328 -81326 128288 202817 118903 203697 227956 230243 322673 325442 214206 137815
16758 137815 106872 179134 242476 169709 291458 254514 96055 122679 115408 84184 99549
16747 99549 -79171 -321335 -475433 -384000 -102073 -53879 -95339 -3260 35868 4930 104778
16736 104778 112434 131375 33975 -122431 -170168 4906 19414 -18204 49270 103021 80906
$$ packed form
16817A91264q8053m5820j82427j39453P4320N4318k5916o236L4232M17k512O9796
16805f6070j3757M1107k1628P1235j27024J71823J5985n7739j4574r2683R2153
16794a172m188K6424l1807L297J9545m8588q7234j49123n7339J53719K03083j0416
16782A6201K0982L3351p1380n4937O1144J79846L300j34096m5003j4689O976M8410
16770E0105n6433p4998K09614P4529q3914Q4794K4259K287R2430K769j11236p6391
16758A37815l0943P2262O3342p2767J21749l6944j58459K6624p271l1224J5365
16747I9549j78720k42164j54098R1433K81927M8194m1460R2079L9128l0938R9848
16736A04778P656J8941r7400j56406m7737J75074J4508l7618O7474N3751k2115
$$ plain form
16725 80906 -49419 -203120 -173247 -69110 22325 -41246 5575 -37328 -53200 23737 110303
16714 110303 171149 187496 379346 255082 54128 113279 160207 155866 -4494 -33304 -63006
16703 -63006 -21411 -130487 -136115 -102722 -203303 -173754 -269507 -333667 -348064 -95111 -88526
16692 -88526 -111530 -81585 -113544 79683 173568 -4868 -243656 -233817 -35761 20419 50460
16681 50460 50115 -81013 79999 211765 181498 104143 115120 -19198 -247909 -233852 -299069
16670 -299069 -300598 -80314 126965 144681 -89780 -230327 -239117 -415067 -553717 -484280 -268029
16659 -268029 -248505 -66803 205103 260469 208288 104893 21796 202643 192885 126013 18154
16648 18154 133344 217491 171477 -2593 -123853 -74856 -112580 -92404 -36973 40435 -41560
$$ packed form
16725H0906j30325j53701K9873J04137R1435o3571M6821m2903j5872P6937Q6566
16714A10303O0846J6347J91850j24264k00954N9151M6928m341j60360k8810k9702
16703f3006M1595j09076n628L3393j00581K9549r5753o4160j4397K52953O585
16692h8526k3004K9945l1959J93227R3885j78436k38788R839J98056N6180L0041
16681E0460l45j31128J61012J31766l0267p7355J0977j34318k28711J4057o5217
16670b99069j529K20284K07279J7716k34461j40547q790j75950j38650O9437K16251
16659b68029J9524J81702K71906N5366n2181j03395q3097J80847r758o6872j07859
16648A8154J15190Q4147m6014j74070j21260M8997l7724K0176N5431P7408q1995
$$ plain form
16637 -41560 71960 81171 -29052 -247396 -452740 -513484 -489961 -240302 -78550 -154600 -240423
16626 -240423 -56524 -4649 -170104 -125623 -150479 42865 151936 110798 -100168 -127163
16616 -127163 -76732 -64747 -150922 -71347 -89199 -204001 -147041 7850 146974 64533 42293
16605 42293 62395 -130878 -52439 93439 189706 184320 143582 100625 2259 39523 -20231
16594 -20231 -216093 -230402 -212162 -155534 -232822 -329298 -446729 -549202 -305927 36127 24656
16583 24656 -58687 481 -40159 -34140 32082 -7600 -116935 -121216 -199984 -34558 142378
16572 142378 133275 -154128 -216845 -42392 -105567 -200324 -162923 15428 87438 59656 -36306
16561 -36306 2908 83087 223163 134169 104586 116412 167189 139006 -56930 -206133 -367269
$$ packed form
16637d1560J13520R211j10223k18344k05344o0744K3523K49659J61752p6050q5823
16626b40423J83899N1875j65455M4481k4856J93344J09071m1138k10966k6995
16616a27163N0431J1985q6175P9575j7852j14802N6960J54891J39124q2441k2240
16605D2293K0102j93273P8439J45878R6267n386m0738m2957r8366L7264n9754
16594b0231j95862j4309J8240N6628p7288r6476j17431j02473K43275L42054j1471
16583B4656q3343N9168m0640O019O6222l9682j09335m281p8768J65426J76936
16572A42378r103k87403o2717J74453o3175r4757L7401J78351P2010k7782r5962
16561c6306L9214Q0179J40076q8994k9583J1826N0777k8183j95936j49203j61136
$$ plain form
16550 -367269 -389488 -364572 -163992 27099 -85213 97113 145225 127318 -12050 -284251
16540 -284251 -294925 -314019 -214626 -79773 97391 50443 -7322 49963 103555 98006 -63054
16529 -63054 -149923 -63901 87661 114658 48932 76528 16755 170384 190837 136735 -36201
16518 -36201 -258982 -226848 29314 3116 -151421 -155747 182234 334339 262374 329974 172977
16507 172977 352746 463958 218188 -8379 -87292 -44938 63117 -21865 -175685 -65958
16497 -65958 -53481 -176503 -145704 -119538 -81801 -98834 -259652 -357750 -487082 -325837 -244006
16486 -244006 -166713 -209057 -333584 -247767 -147528 -200506 -176271 101188 188085 103869 -44597
16475 -44597 -171544 -10539 141125 135670 307772 314855 316766 223655 -40454 -154667 -303479
$$ packed form
16550c67269k2219K4916K00580J91091j12312J82326M8112j7907j39368k72201
16540b84251j0674j9094R9393J34853J77164m6948n7765N7285N3592n549j61060
16529f3054q6869Q6022J51562K6997o5726K7596n9773J53629K0453n4102j72936
16518c6201k22781L2134K56162k6198j54537m326L37981J52105p1965O7600j56997
16507A72977J79769J11212k45770k26567p8913M2354J08055q4982j53820J09727
16497f5958J2477j23022L0799K6166L7737j7033j60818r8098j29332J61245Q1831
16486b44006P7293m2344j24527Q5817J00239n2978K4235K77459Q6897q4216j48466
16475d4597j26947J61005J51664n455J72102P083J911r3111k64109j14213j48812
$$ plain form
16464 -303479 -385901 -256833 -105478 -169630 -112209 -126663 -127527 -246720 -141395 -225870 -342376
16453 -342376 -244318 51278 265060 227920 -32277 764 186799 205351 182781 87467 241560
16442 241560 150691 89524 -33273 -156757 -215815 -266677 -272003 -289475 -412316 -243033 -140840
16431 -140840 -104609 50742 137879 230429 167304 33779 6371 -48847 -102780 -197248 -95349
16420 -95349 -30403 -37188 -3304 27033 72400 38566 -30353 138637 -68983 -234856 -127216
16409 -127216 -114151 -304326 -279109 -121512 -102134 14135 -2894 55302 -62671 -187476
16399 -187476 -78066 66261 257120 395250 268244 38441 -100713 -128506 -1224 111785
16389 111785 74171 -39696 -39135 -213622 -327210 -177859 -129805 -155327 -134098 2028 91915
$$ packed form
16464c03479q2422J29068J51355o4152N7421j4454q64j19193J05325q4475j16506
16453c42376R8058K95596K13782l7140k60197L3041J86035J8552k2570r5314J54093
16442B41560r0869o1167j22797j23484n9058n0862n326j7472j22841J69283J02193
16431a40840L6231J55351Q7137R2550o3125j33525k7408n5218n3933r4468J01899
16420i5349O4946o785L3884L0337M5367l3834o8919J68990k07620j65873J07640
16409a27216J3065j90175K5217J57597J9378J16269j7029N8196j17973j24805
16399a87476J09410J44327J90859J38130j27006k29803j39154k7793J27282J13009
16389A11785l7614j13867N61j74487j13588J49351M8054k5522K1229J36126Q9887
$$ plain form
16378 91915 182522 285685 144321 161747 164295 -20444 24032 -2073 -141175 -208468 -360223
16367 -360223 -252737 -53339 -101990 6610 56250 -3520 -172111 -203857 -299832 -274244 -105618
16356 -105618 15419 -50696 -56603 79655 86966 52119 169497 350195 287374 173799 -36001
16345 -36001 -181100 -232203 -182772 -207091 -219398 -92886 -9049 -31072 -16397 4997 100011
16334 100011 196717 37487 19975 11235 2219 123621 72484 -92094 107626 266101 172901
16323 172901 34117 121154 190104 79181 -99406 -69397 -121042 -300155 -377040 -391841 -345590
16312 -345590 -346613 -284004 -298321 -127242 -4169 -19007 -111446 -182768 -197747 -134039 -10153
16301 -10153 107927 97030 -34493 -36883 -111292 -176452 -147302 -82791 -39905 -26795 -246083
$$ packed form
16378I1915R0607J03163j41364J7426K548j84739M4476k6105j39102o7293j51755
16367c60223J07486J99398m8651J08600M9640n9770j68591l1746r5975K5588J68626
16356a05618J21037o6115n907J36258P311l4847J17378J80698o2821j13575k09800
16345c6001j45099n1103M9431k4319j2307J26512Q3837k2023J4675K1394R5014
16334A00011R6706j59230j7512q740r016J21402n1137j64578J99720J58475r3200
16323A72901j38784Q7037O8950j10923j78587L0009n1645j79113p6885j4801M6251
16312c45590j023O2609j4317J71079J23073j4838r2439p1322j4979O3708J23886
16301a0153J18080j0897j31523k390p4409o5160K9150O4511M2886J3110k19288
$$ plain form
16290 -246083 -229398 -105251 22410 -21113 -60091 27355 83083 110317 -19200 28369 46326
16279 46326 96300 152365 79343 -97643 -231516 -183864 -72421 55490 139395 42599 -80492
16268 -80492 -216338 -131997 16127 36573 4944 19728 -65899 -77959 -81892 -134362 -76623
16257 -76623 -66534 -11380 -15819 -121818 -55809 -61956 -163197 -98671 -119007 -255907 -187481
16246 -187481 -57960 33825 72202 55193 159 -95605 -39820 -30419 92726 32584 21491
16235 21491 -53964 -95176 -267763 -147319 -36888 -58635 39441 3748 8230 -43724 -65897
16224 -65897 -37094 -94238 527 135414 217662 80582 -95741 -191295 -230144 -132251 94911
16213 94911 68023 38899 177500 162884 74143 59802 -37357 -121818 -113493 14732 -101135
$$ packed form
16290b46083J6685J24147J27661m3523l8978Q7446N5728K7234j29517M7569J7957
16279D6326M9974N6065p3022j76986j33873M7652J11443J27911Q3905r6796j23091
16268h0492j35846Q4341J48124K0446l1629J4784q5627j2060l933n2470N7739
16257g6623J0089N5154m439j05999O6009o147j01241O4526k0336j36900O8426
16246a87481J29521R1785L8377j7009n5034r5764N5785R401J23145o0142j1093
16235B1491p5455m1212j72587J20444J10431k1747R8076l5693M482n1954k2173
16224f5897K8803n7144R4765J34887Q2248j37080j76323r5554l8849R7893K27162
16213I4911k6888k9124J38601j4616q8741j4341r7159q4461Q325J28225j15867
$$ plain form
16202 -101135 -272816 -247125 -120130 53888 -5948 7608 104707 -22225 -130406 -121278 -256725
16191 -256725 -375231 -261926 -239248 -199272 -202189 -328261 -250917 -109986 -275781 -342336 -435574
16180 -435574 -308305 -54737 100660 255412 245659 43972 -63770 54541 135578 38422
16170 38422 54152 49353 1447 -40002 99015 189274 39072 -38294 -129087 -212843 -109330
16159 -109330 138342 38291 -61376 -7758 -21332 7059 82849 171109 60608 -2057 29230
16148 29230 -42096 -73851 -102653 -20874 -1573 -139880 -188523 -119496 -19 177904 167300
16137 167300 141976 102853 -42922 -70513 -179507 -233903 -365581 -395267 -257766 -178153 -258552
16126 -258552 -406770 -431139 -216276 125149 419705 303486 276828 183232 30205 -119336
$$ packed form
16202a01135j71681K5691J26995J74018n9836J3556R7099j26932j08181R128j35447
16191b56725j18506J13305K2678L9976k917j26072P7344J40931j65795o6555r3238
16180d35574J27269K53568J55397J54752r753k01687j07742J18311Q1037r7156
16170C8422J5730m799m7906m1449J39017R0259j50202p7366r0793q3756J03513
16159a09330K47672j00051r9667N3618j3574K8391P5790Q8260j10501o2665L1287
16148B9230p1326l1755k8802Q1779J9301j38307m8643O9027J19477J77923j0604
16137A67300k5324l9123j45775k7591j08994n4396j31678k9686J37501P9613q0399
16126b58552j48218k4369K14863L41425K94556j16219k6658r3596j53027j49541
$$ plain form
16116 -119336 -208600 -176665 -140577 -95137 -21739 79098 92501 27288 93047 239878 246081
16105 246081 158373 37627 -113688 -192197 -218585 82388 226096 6606 24978 1300
16095 1300 -703 67203 91769 114200 153358 109305 25010 1586 -1567 -67091 -81498 139543
16083 139543 215696 298608 272234 183157 181476 60842 -3323 18687 -133228 -102300 83553
16072 83553 144976 20173 251739 229012 -80708 -108699 -104665 -265571 -163403 -128558 -101924
16061 -101924 57221 79339 35564 113816 65695 -68309 28382 -24779 -115418 -73327 130868
16050 130868 250318 194974 128916 94169 68384 129404 6058 -276805 -129414 28617
16040 28617 134078 130730 211103 118054 55342 89462 182471 132979 -88080 -95289 -105541 -75437
$$ packed form
16116a19336q9264L1935L6088M5440P3398J00837J3403o5213O5759J46831O203
16105B46081q7708j20746j51315p8509k6388L00973J43708k19490J8372k3678
16095A300k003O7906K4566K2431L9158m4053q4295k3424l153o5524j4407K21041
16083A39543P6153Q2912k6374q9077j681j20634o4165K2010j51915L0928J85853
16072H3553O1423j24803K31566k2727l09720k7991M034j60906J02168L4845K6634
16061a01924J59145K2118m3775P8252m8121j34004R6691n3161r0639M2091K04195
16050A30868J19450n5344o6058l4747k5785O1020j23346k82863J47391J58031
16040B8617J05461l348Q0373r3049o2712L4120R3009m9492k21059p209j0252L0104
$$ plain form
16028 -75437 -97937 -179061 -142647 -131562 -90862 -216842 -183708 -32548 10826 -100233 -148589
16017 -148589 -140296 32925 -152888 -123980 -177754 -104153 -94395 -78804 46994 151609 64831
16006 64831 52863 83529 167150 208315 325481 209441 235042 232087 203485 38211 -125368
15995 -125368 -248840 -243402 -265725 -228499 -212455 -152752 -168379 -103493 -79562 -105462 -139086
15984 -139086 -87551 -24587 -118323 -26794 15351 161416 6575 -68703 -69589 -40215 19094
15973 19094 -8760 35287 -4454 -147682 5374 -63544 -64271 -10825 -1506 -148254 -111561 -175128
15961 -175128 -252387 -204020 -110157 -96721 -186626 -121152 164616 158882 158979 173019 62143 -14376
15949 -14376 -100303 -130666 -92255 -65900 -130022 -151420 -76953 -84217 -169756 -253427 -252716 -173024
$$ packed form
16028g5437k2500q1124L6414J1085M0700j25980L3134J51160M3374j11059m8356
16017a48589Q293J73221j85813K8908n3774P3601R758J5591J25798J04615q6778
16006F4831j1968L0666Q3621M1165J17166j16040K5601k955k8602j65274j63579
15995a25368j23472N438k2323L7226J6044N9703j5627O4886K3931k5900l3624
15984a39086N1535O2964r3736R1529M2145J46065j54841p5278q86K9374N9309
15973A9094k7854M4047l9741j43228J53056o8918p27N3446R319j46748L6693o3567
15961a75128p7259M8367R3863J3436q9905O5474K85768n734R7J4040j10876p6519
15949a4376q5927l0363L8411K6355o4122k1398P4467p264q5539q3671P11P9692
$$ plain form
15937 -173024 -79266 -327367 -361979 -132567 -98562 -169406 -138995 36152 174692 179125 52218
15926 52218 -14836 15967 144951 262502 396045 388162 165929 77895 68302 85082 -12284
15915 -12284 -1215 117348 182835 170759 161025 100169 -9185 -69820 -1465 -24043 -114284
15904 -114284 -202109 -175369 -25261 89096 181988 202106 57848 23697 -29629 64063 115771
15893 115771 228329 165217 165243 210720 279459 332134 404640 244792 183594 168260 194977 90537
15881 90537 48341 25961 718 76759 134023 145620 195270 119826 237022 329459 164927
15870 164927 130751 186615 -129109 -387957 -408483 -365502 -234962 -219153 -132450 71862 108460
15859 108460 107563 214529 170500 118787 211494 242543 170434 82495 11309 -50172 -143889 -159547
$$ packed form
15937a73024R3758k48101l4612K29412L4005p0844L0411J75147J38540M433j26907
15926E2218o7054L0803J28984J17551J33543p883k22233q8034r593J6780r7366
15915a2284J1069J18563O5487j2076r734o0856j09354o0635O8355k2578r0241
15904a14284q7825K6740J50108J14357R2892K0118j44258l4151n3326R3692N1708
15893A15771J12558o3112K6M5477O8739N2675P2506j59848o1198j5334K6717j04440
15881I0537m2196k2380k5243P6041N7264J1597M9650p5444J17196R2437j64532
15870A64927l4176N5864l15724k58848k0526M2981J30540J5809Q6703K04312L6598
15859A08460q97J06966m4029n1713R2707L1049p2109q7939p1186o1481r3717j5658
$$ plain form
15847 -159547 -126115 -102902 43179 165680 24227 -125291 -106054 -43332 -81172 -78917 52396
15836 52396 178854 261731 326977 113482 -122487 -127732 -130108 -20274 84818 157397 269029
15825 269029 329022 298358 194366 98764 128275 287654 352795 247284 203886 197155 87230
15814 87230 -40097 -153848 -20324 204651 239993 162386 -25710 -13771 66936 -49151
15804 -49151 -32791 -33567 48144 119867 118378 -45549 -157223 40388 278896 140941 74968
15793 74968 102099 -35604 20665 160834 81426 -177913 -261322 -130244 -37984 -80987 -107327
15782 -107327 -87775 -103338 39842 300184 412108 299080 243160 276578 231788 242793 36191
15771 36191 -85884 -76057 -330381 -381093 -236177 -37940 159268 96062 -104280 -307492
$$ packed form
15847a59547L3432K3213J46081J22501j41453j49518J9237O2722l7840K255J31313
15836E2396J26458Q2877O5246k13495k35969n245k376J09834J05092P2579J11632
15825B69029N9993l0664j03992r5602K9511J59379O5141j05511m3398o731j09925
15814H7230j27327j13751J33524K24975L5342p7607j88096J1939Q0707j16087
15804d9151J6360p76Q1711P1723j489j63927j11674J97611K38508j37955o5973
15793G4968K7131j37703N6269J40169p9408k59339q3409J31078R2260m3003k6340
15782a07327J9552j5563J43180K60342J11924j13028n5920L3418m4790J1005k06602
15771C6191j22075R827k54324n0712J44916J98237J97208o3206k00342k03212
$$ plain form
15761 -307492 -350779 -315184 -194183 -138192 -82328 -30452 -6129 44379 -7594 -62121 103982
15750 103982 169717 68295 -80651 -34482 47029 58062 -4469 17338 22955 27493 165389
15739 165389 91009 -80241 -213778 -177196 -126226 77860 205805 73188 30718 -52379
15729 -52379 -228311 -218357 36846 135489 -41845 -101285 -237762 -184233 -169790 -65697 -54407
15718 -54407 -167157 -410718 -384716 -183145 -108408 -122009 -49463 -148758 -124491 -61144 -57607
15707 -57607 -50179 10378 91849 153616 207428 66386 -20645 97623 19170 -106684 -31585
15696 -31585 -58876 -16344 197316 303024 221735 195388 155448 190427 115261 -71765 -123907
15685 -123907 -78689 21866 -59471 -77273 -27995 12336 41511 -111719 -154632 -102102 -47057
$$ packed form
15761c07492m3287L5595J21001N5991N5864N1876K4323N0508n1973n4527J66103
15750A03982O5735j01422j48946M6169Q1511J1033o2531K1807N617M538J37896
15739A65389p4380j71250j33537L6582N0970K04086J27945j32617m2470q3097
15729e2379j75932R954K55203R8643j77334n9440j36477N3529J4443J04093J1290
15718e4407j12750k43561K6002K01571P4737j3601P2546r9295K4267O3347L537
15707e7607P428O0557Q1471O1767N3812j41042q7031J18268p8453j25854P5099
15696c1585k7291M2532K13660J05708q1289k6347l9940L4979p5166j87026n2142
15685a23907M5218J00555q1337j7802M9278M0331K9175j53230m2913N2530N5045
$$ plain form
15674 -47057 40179 136900 168300 91677 94269 25235 -55116 -131172 -198020 -47650 44209 -41473
15662 -41473 -10119 3989 -4607 -76748 22527 80097 8613 28305 108289 88321 56641 -15642
15650 -15642 -58194 -127293 -151383 -85964 -111241 -280765 -196622 -76509 33559 123949 221484
15639 221484 128089 -25048 -7699 -87965 -233962 -225044 -348786 -261941 -220634 -216376 -108819
15628 -108819 -8067 103913 64410 76779 75519 127049 136075 -25381 -111909 -219361 -217953
15617 -217953 -128965 -37892 87451 13077 -46492 -102337 7776 50065 -23443 85321 112569
15606 112569 21585 -28706 -65044 -225690 -82373 66128 126289 8477 -32132 250595
15596 250595 347282 233259 108431 306683 215571 -101150 -48994 -61925 -87518 -61658 -22301
$$ packed form
15674d7057Q7236R6721L1400p6623K592o9034q0351p6056o6848J50370R1859q5682
15662d1473L1354J4108q596p2141R9275N7570p1484J9692P9984j9968l1680p2283
15650a5642m2552o9099k4090O5419k5277j69524Q4143J20113J10068R0390R7535
15639B21484r3395j53137J7349q0266j45997Q918j23742Q6845M1307M258J07557
15628a08819J00752J11980l9503J2369j260N1530R026j61456q6528j07452J408
15617b17953Q8988R1073J25343p4374n9569n5845J10113M2289p3508J08764K7248
15606A12569r0984n0291l6338j60646J43317J48501O0161j17812m0609K82727
15596B50595R6687j14023j24828J98252r1112l16721N2156j2931k5593K5860L9357
$$ plain form
15585 -22301 -11805 7548 13595 95338 161121 69301 90130 151418 112336 -56717 -131784 -241896
15573 -241896 -178141 -261100 -346524 -151209 -98551 139440 327168 238865 142533 59483 -49048
15562 -49048 -216006 -157920 -102878 -57031 56424 99201 4285 -74536 -108208 -124027 -218052
15551 -218052 -315192 -242599 -167869 -111453 -82168 100086 259228 317278 255512 269297 278804
15540 278804 94072 221389 216319 92277 51179 166349 327081 212123 -54006 -115100
15530 -115100 -207678 -207274 -323264 -283716 -106652 -221037 -354944 -339893 -283731 -94536 -98603
15519 -98603 -173727 -131503 -41370 2239 -116782 24165 106646 52573 7351 52750 -24687
15508 -24687 -60623 -85739 -304179 -372554 -428804 -142708 -14799 197704 323104 63653
$$ packed form
15585b2301J0496J9353O047Q1743O5783r1820K0829O1288l9082j69053p5067j10112
15573b41896O3755q2959q5424J95315N2658K37991J87728q8303r6332q3050j08531
15562d9048j66958N8086N5042M5847J13455M2777r4916p8821l3672j5819r4025
15551b18052r7140P2593P4730N6416K9285J82254J59142N8050o1766J3785R507
15540B78804j84732J27317n070j24042m1098J15170J60732j14958k66129o1094
15530a15100r2578M04j15990L9548J77064j14385j33907J5051N6162J89195m067
15519i8603p5124M2224R0133M3609j19021J40947Q2481n4073m5222M5399p7437
15508b4687l5936k5116k18440o8375n6250K86096J27909K12503J25400k59451
$$ plain form
15498 63653 -90514 -116681 -205362 -271396 -305573 -217280 -172505 -77072 5079 -1182 -68045 117625
15486 117625 191773 -40655 26296 88847 136095 -10175 -75100 -145639 -328871 -377055 -389413
15475 -389413 -232007 -97326 -255817 -311860 -410527 -336282 -60892 96608 49185 176134
15465 176134 60400 -99460 -42403 66841 79720 61383 -8335 -90706 -131256 -155121 13003
15454 13003 138207 62058 49988 -22642 -169231 -113392 -83742 16497 16599 -225612 -215544
15443 -215544 -232672 -263862 -372445 -277404 -83 -62454 -158857 -265339 -126658 11525
15433 11525 -89182 -207392 -61373 177419 149910 23520 113542 192001 54331 -68523
15423 -68523 -157126 -106925 -203089 -179818 -107856 90440 110726 139395 20733 -136334 -261102
$$ packed form
15498F3653j54167k6167q8681o6034l4177Q8293M4775R5433Q2151o261o6863J85670
15486A17625P4148k32428O6951O2551M7248j46270o4925p0539j83232m8184j2358
15475c89413J57406J34681j58491n6043r8667P4245K75390J57500m7423J26949
15465A76134j15734j59860N7057J09244J2879j8337o9718q2371m0550k3865J68124
15454A3003J25204p6149j2070p2630j46589N5839K9650J00239J02k42211J0068
15443b15544j7128l1190j08583R5041K77321o2371r6403j06482J38681J38183
15433A1525j00707j18210J46019K38792k7509j26390R0022P8459j37670j22854
15423f8523q8603N0201r6164K3271P1962J98296K0286K8669j18662j57067j24768
$$ plain form
15412 -261102 -267377 -227144 -30661 -54782 97205 311895 268130 275549 86399 180234 132257
15401 132257 -201234 -287134 -146416 5972 144033 -82823 -300220 -422154 -373158 -189613
15391 -189613 -93350 -130096 -77683 -16844 9172 -83655 -195298 -395814 -180458 -2820 75422
15380 75422 72571 109264 106509 1189 22079 37711 -79523 -135648 -207040 -194891 -265792 -77740
15368 -77740 179428 140870 -56120 -86669 27359 36740 99061 137411 106262 -83346 -245145
15357 -245145 -328754 -224602 -213007 -110730 -88585 -128721 -181944 -94194 -201158 -249587 -62485
15346 -62485 130709 198981 133747 217971 385911 444815 306976 200938 329505 393428 296039
15335 296039 36700 -84009 -59093 13505 155083 98698 48283 162526 16866 -75026
$$ packed form
15412b61102o275M0233J96483k4121J51987K14690m3765P419j89150R3835m7977
15401A32257l33491q5900J40718J52388J38061k26856k17397j21934M8996J83545
15391a89613R6263l6746N2413O0839K6016r2827j11643k00516K15356J77638P8242
15380G5422k851L6693k755j05320K0890J5632j17234n6125p1392J2149p0901J88052
15368g7740K57168l8558j96990l0549J14028R381O2321L8350l1149j89608j61799
15357b45145q3609J04152J1595J02277K2145m0136n3223Q7750j06964m8429J87102
15346f2485J93194O8272o5234Q4224J67940N8904j37839j06038J28567O3923r7389
15335B96039k59339j20709K4916P2598J41578n6385n0415J14243j45660r1892
$$ plain form
15325 -75026 -39334 -57431 -64950 65468 219328 254024 197336 55158 -79819 -10027 180229
15314 180229 176381 -69813 -82177 -103214 -130105 -232088 -152473 -10442 -30029 -120632 -56639
15303 -56639 158571 191929 263804 168619 250273 152052 70257 175204 261292 148677 106703
15292 106703 42218 -46449 -124391 75450 253315 480072 466912 349776 283860 341290 369652
15281 369652 382477 342373 313017 235013 163688 74174 -122596 -227934 -248625 -6468 245778
15270 245778 247565 149940 108117 59623 -39642 -44434 -18005 -41514 -61352 -30498 -99767 -321862
15258 -321862 -288057 -390294 -370169 -212173 -40343 108603 232564 126263 33732 58889
15248 58889 95025 264590 282206 234185 201744 156999 30191 76642 147534 -41027 21801
$$ packed form
15325g5026L5692j8097p519J30418J53860L4696n6688j42178j34977O9792J90256
15314A80229l848k46194j2364k1037k6891j01983P9615J42031j9587r0603O3993
15303e6639K15210L3358P1875r5185Q1654r8221q1795J04947Q6088j12615m1974
15292A06703o4485q8667p7942J99841J77865K26757j3160j17136o5916N7430K8362
15281C69652J2825m0104k9356p8004p1325q9514j96770j05338k0691K42157K52246
15270B45778J787r7625m1823m8494r9265m792K6429k3509j9838L0854o9269k22095
15258c21862L3805j02237K0125J57996J71830J48946J23961j06301r2531K5157
15248E8889L6136J69565J7616m8021l2441m4745j26808M6451P0892j88561O2828
$$ plain form
15237 21801 -27889 -126512 -56556 -46191 -143925 -97537 8968 171500 130563 27143 -76710
15226 -76710 -9162 90917 58482 -4308 43388 118534 6419 40442 131823 151869 29890
15215 29890 35314 86440 121266 150987 168901 41271 -118487 -145960 -84720 36338 58776
15204 58776 149844 221446 292531 284980 250935 263163 128552 6881 13151 -16344 -73104 -81981
15192 -81981 36424 -85398 -32488 20577 -44821 -195004 -84559 12220 -7828 49842 58516
15181 58516 -5815 -25208 -4675 5508 -34907 -57855 -125418 6191 127287 60923 -19151
15170 -19151 -77014 -94692 -93726 -265216 -294062 -93225 -5681 -61149 -43864 -92569 -129695 -147161
15158 -147161 -246631 -370971 -222275 -47362 61301 -21480 -24745 53736 206903 308989
$$ packed form
15237B1801m9690r8623O9956J0365r7734M6388J06505J62532m0937j03420j03853
15226g6710O7548J00079l2435o2790M7696P5146j12115L4023R1381K0046j21979
15215B9890N424N1126L4826K9721J7914j27630j59758k7473O1240J21058K2438
15204E8776R1068P1602P1085p551l4045J2228j34611j21671O270k9495n6760q877
15192h1981J18405j21822N2910N3065o5398j50183J10445R6779k0048N7670Q674
15181E8516o4331j9393K0533J0183m0415k2948o7563J31609J21096o6364q0074
15170a9151n7863j7678R66j71490k8846K00837Q7544n5468J7285m8705l7126j7466
15158a47161r9470j24340J48696J74913J08663q2781l265P8481J53167J02086
$$ plain form
15148 308989 112917 -51782 6987 146898 260630 235777 74726 -429 -75027 -73472 -242810
15137 -242810 -223161 -219102 -279518 -314531 -165827 -126877 -44133 222656 108936 -18766 -22851
15126 -22851 28220 -54393 -120313 -124547 -118138 -189768 -317742 -186394 -209407 -259185 -208576 -112206
15114 -112206 -78204 -138908 -57438 41454 -76971 -74924 859 3142 27128 -68834 43691
15103 43691 180598 111722 -145280 -124886 -53380 -85512 -73893 -94160 -18868 -36543 -134240
15092 -134240 -108814 -113096 -60791 97243 160732 132458 107729 40943 52880 132381 91631
15081 91631 -29133 39192 60755 11407 3658 -78223 -68713 -32102 31589 -16048 135607 179194
15069 179194 122187 115182 38456 120459 160361 57071 140236 179951 162110 188229 224972
$$ packed form
15148C08989j96072j64699N8769J39911J13732k4853j61051p5155p4598J555j69338
15137b42810J9649M059o0416l5013J48704L8950Q2744K66789j13720j27702m085
15126b2851N1071q2613o5920m234O409p1630j27974J31348k3013m9778N0609R6370
15114a12206L4002o0704Q1470R8892j18425K047P5783K283K3986r5962J12525
15103D3691J36907o8876k57002K0394P1506l2132J1619k0267P5292j7675r7697
15092a34240K5426m282N2305J58034O3489k8274k4729o6786J1937P9501m0750
15081I1631j20764O8325K1563m9348p749q1881R510L6611O3691m7637J51655M3587
15069A79194n7007p005p6726Q2003L9902j03290Q3165L9715j7841K6119L6743
$$ plain form
15058 224972 133124 88776 -87832 -152504 -119397 -138487 -132698 -127769 -191079 -158988 -24385
15047 -24385 -36705 -153248 -62295 53729 49186 162796 31222 -25745 -111535 -13777 41991
15036 41991 -122492 -212911 -161005 -104617 -74606 -133503 -44948 100112 140309 -5777 -165525
15025 -165525 -365690 -297360 -170383 -178721 -161064 -289663 -428949 -392892 -254205 -80566
15015 -80566 131876 69298 -93431 -146101 -20743 -148371 -237432 -157188 -254789 -314350 -228873
15004 -228873 -67889 65986 -120927 -152027 -136123 -62767 -140142 -281452 -349511 -243914
14994 -243914 -90791 -173609 -299368 -309340 -353659 -386163 -317296 -418412 -408383 -201533 -23746
14983 -23746 -57663 -124645 -97990 20251 -26452 -8625 23222 -108350 -329377 -247210 -73864
$$ packed form
15058B24972r1848m4348j76608o4672L3107j9090N789M929o3310L2091J34603
15047b4385j2320j16543R0953J16024m543J13610j31574n6967q5790R7758N5768
15036D1991j64483r0419N1906N6388L0011n8897Q8555J45060M0197j46086j59748
15025a65525k00165O8330J26977q338J7657j28599j39286L6057J38687J73639
15015h0566K12442o2578j62729n2670J25358j27628q9061Q0244r7601n9561Q5477
15004b28873J60984J33875j86913l1100J5904P3356p7375j41310o8059J05597
14994b43914J53123q2818j25759r972m4319l2504O8867j01116J0029K06850J77787
14983b3746l3917o6982K6655J18241m6703J7827L1847j31572k21027Q2167J73346
$$ plain form
14972 -73864 -128139 -181777 -170828 -197016 -245461 -304693 -387874 -531667 -530948 -255833 -180506 -197231
14960 -197231 -97110 93612 -34283 -207957 -159339 -15947 65460 63357 200333 375071
14950 375071 95265 -51798 186277 317343 285661 98328 146780 122482 97943 103083 197322
14939 197322 308136 276487 262525 66392 25780 84848 113312 142567 62991 -48057 31959
14928 31959 -37481 -267111 -150132 -57171 13364 149151 227094 280737 161667 86647 115965
14917 115965 122840 57258 -69322 -191132 -117078 -95951 -148379 97965 205249 183037 257866
14906 257866 137993 -147890 -155517 -28078 20288 -9740 -135951 -210713 -148701 36703 215095
14895 215095 176298 -32159 -191878 -99288 -24209 -147816 -276949 -195228 -82836 -162421
$$ packed form
14972g3864n4275n3638J0949k6188m8445n9232q3181j43793P19K75115P5327j6725
14960a97231J00121J90722j27895j73674M8618J43392Q1407k103J36976J74738
14950C75071k79806j47063K38075J31066l1682j87333M8452k4298k4539N140R4239
14939A97322J10814l1649j3962j96133m0612N9068K8464K9255p9576j11048Q0016
14928C1959o9440k29630J16979R2961P0535J35787P7943N3643j19070p5020K9318
14917A15965O875o5582j26580j21810P4054K1127n2428K46344J07284k2212P4829
14906B57866j19873k85883p627J27439M8366l0028j26211p4762O2012J85404J78392
14895B15095l8797k08457j59719R2590P5079j23607j29133Q1721J12392p9585
$$ plain form
14885 -162421 -241211 -137108 -108728 -44197 -48800 42835 55038 43112 61973 106888 -54583
14874 -54583 -236999 -239041 -138939 -182526 -218581 -122526 -62465 -211773 -398953 -219117 -51171
14863 -51171 -154357 -192890 -98832 -220762 -220103 -204509 -190568 -193813 -260570 -169460 -104279 -56951
14851 -56951 -11130 -5365 56119 56368 -35034 -40596 -135771 -112640 45878 170010 51519 4097
14839 4097 14365 77023 100431 136481 87548 92450 -51852 -45691 17029 61825 45802 13764
14827 13764 40520 235890 224018 86604 -244037 -292853 -283408 -243378 -77327 -865 -19567
14816 -19567 -120047 -208333 -200059 -99464 -155315 -96836 -315349 -404196 -410244 -323279 -356260
14805 -356260 -311945 -170151 -105105 1191 62908 -99768 -287043 -381319 -530603 -538755 -597932
$$ packed form
14885a62421p8790J04103K8380O4531m603R1635J2203j1926J8861M4915j61471
14874e4583j82416k042J00102m3587l6055R6055O0061j49308j87180J79836J67946
14863e1171j03186l8533R4058j21930O59J5594J3941l245o6757R1110O5181M7328
14851e6951M5821N765O1484K49r1402n562r5175K3131J58518J24132j18491m7422
14839D097J0268O2658K3408L6050m8933M902j44302O161O2720M4796j6023l2038
14827A3764K6756J95370j1872j37414l30641m8816R445M0030J66051P6462j8702
14816a9567j00480q8286Q274J00595n5851N8479k18513q8847o048Q6965l2981
14805c56260M4315J41794O5046J06296O1717j62676j87275r4276j49284q152n9177
$$ plain form
14794 -597932 -507511 -338531 -296371 -257531 -246820 -353538 -267430 -167953 -333447 -344666 -191367
14783 -191367 -31258 94401 26424 -163547 -109632 59102 129435 135010 -5174 -16760 91744
14772 91744 86127 75485 262983 175821 149221 248905 168132 -109980 -70993 164474 154855
14761 154855 75960 22978 70620 84978 -56643 -55076 47618 72241 133206 333936 311262
14750 311262 185874 -30762 -75324 165181 21716 -36633 -66264 -29442 -14983 -11809 -21428
14739 -21428 -215618 -196846 -113677 -57762 102395 355207 338892 215823 212562 192592 66023
14728 66023 47399 22704 -64130 -48570 -140674 -63875 127014 133856 83737 112577 35605 48626
14716 48626 5918 -125071 -201983 -139989 35841 -89823 -130696 -147445 -226828 -240003 -151979
$$ packed form
14794e97932R0421J68980M2160L8840J0711j06718Q6108R9477j65494j1219J53299
14783a91367J60109J25659o7977j89971N3915J68734P0333N575j40184j1586J08504
14772I1744n617j0642J87498q7162k6600R9684q0773k78112L8987K35467r619
14761A54855p8895n2982M7642J4358j41621J567J02694K4623O0965K00730k2674
14750C11262j25388k16636m4562K40505j43465n8349k9631L6822J4459L174r619
14739b1428j94190J8772Q3169N5915J60157K52812j6315j23069l261j9970j26569
14728F6023j8624k4695q6834J5560r2104P6799J90889O842n0119K8840p6972J3021
14716D8626m2708j30989p6912O1994J75830j25664m0873j6749p9383j3175Q8024
$$ plain form
14705 -151979 -111103 -106473 -165217 -88855 178450 196871 90502 132859 151368 31298 110729
14694 110729 -58702 -217717 -133486 75968 20953 -77604 -52934 -28827 -72265 -22152 41592
14683 41592 68850 -43329 -161554 -111541 -101145 -235827 -157111 -146611 -142663 -124229 -55547
14672 -55547 -23862 -181304 -185143 -165905 -103353 -111626 -85427 -77736 -196632 -264773 -218293 80650
14660 80650 262978 279157 183461 15392 8279 24228 867 -140343 -180790 -201695 -172281
14649 -172281 -112555 7839 -22433 -84844 -103642 -45156 38156 23221 32016 -60732 -41218
14638 -41218 -166997 -204996 -155091 -87323 -62202 148661 264540 17524 -29218 -31843 -133482
14627 -133482 -203618 -191699 -76482 -185324 -129446 -71279 -95423 -56493 -181808 -278498 -251657
$$ packed form
14705a51979M0876M630n8744P6362K67305J8421j06369M2357J8509j20070P9431
14694A10729j69431j59015Q4231K09454n5015r8557K4670K4107m3438N0113O3744
14683D1592K7258j12179j18225N0013J0396j34682P8716J0500L948J8434O8682
14672e5547L1685j57442l839J9238O2552q273K6199P691j18896o8141M6480K98943
14660H0650J82328J6179r5696j68069p113J5949k3361j41210m0447k0905K9414
14649a72281N9726J20394l0272o2411j8798N8486Q3312j4935Q795r2748J9514
14638d1218j25779l7999M9905O7768K5121K10863J15879k47016m6742k625j01639
14627a33482p0136J1919J15217j08842N5878N8167k4144L8930j25315r6690K6841
$$ plain form
14616 -251657 -239108 -36084 46107 -123420 -66457 -215149 -248259 -305917 -197491 9069
14606 9069 -88685 -166711 -226656 -157298 13466 176807 174824 146624 -43834 -106955 -36202
14595 -36202 38537 -22499 -132385 -105948 -94717 124237 218711 89974 -81632 -62121 1294
14584 1294 -98445 -164792 -101716 -622 -180462 -169988 -99746 -50336 -116043 -231540 -252934
14573 -252934 -133543 -76454 -174567 -221379 -188229 -168653 -256093 -100484 167582 209490 31297
14562 31297 -113988 -183890 -228756 -166150 -88485 -49646 131054 157589 17630 -108552 -137820
14551 -137820 -238081 -432337 -478677 -408064 -623348 -426415 -135201 -141909 -278311 -303825
14541 -303825 -154879 -63452 -59464 10308 -22919 -95045 -58078 -111373 -201472 -272442 -108965
$$ packed form
14616b51657J2549K03024Q2191j69527N6963j48692l3110n7658J08426K06560
14606I069r7754p8026n9945O9358J70764J63341j983k8200j90458o3121P0753
14595c6202P4739o1036j09886K6437J1231K18954R4474j28737j71606J9511O3415
14584A294r9739o6347O3076J01094j79840J0474P0242M9410o5707j15497k1394
14573b52934J19391N7089r8113m6812L3150J9576q7440J55609K68066M1908j78193
14562C1297j45285o9902m4866O2606P7665L8839J80700K6535j39959j26182k9268
14551a37820j00261j94256m6340P0613k15284J96933K91214o708j36402k5514
14541c03825J48946R1427L988O9772l3227p2126L6967n3295r0099p0970J63477
$$ plain form
14530 -108965 -33230 -92126 -204250 -169296 -237290 -182632 -79327 -124637 -117110 -160788 -53660
14519 -53660 -53461 -138889 -113418 -140650 -142188 -66486 -109742 -175875 -238087 -170054 -241201 -267691
14507 -267691 -290647 -325432 -365901 -117562 106152 106208 15091 120478 43636 58012 62310 102781
14495 102781 79722 -5824 -137615 -79617 -24867 -53988 -45875 -120821 -258883 -232941 -36226
14484 -36226 41752 150151 169276 -35390 -57091 42155 103383 64897 -57887 -83827 -54311
14473 -54311 2001 56965 74574 -41139 18591 116661 53917 -38093 -141713 -97474 -153026
14462 -153026 -264513 -270530 -166358 -71121 -162311 -189492 32594 14264 50180 16770 17956
14451 17956 23517 -29793 -180015 -354199 -269886 -131490 -241537 -284720 -140682 -77059 -12906
$$ packed form
14530a08965P5735n8896j12124L4954o7994N4658J03305m5310P527m3678J07128
14519e3660J99q5428K5471k7232j538P5702m3256o6133o2212O8033p1147k6490
14507b67691k2956l4785m0469K48339K23714N6r1117J05387p6842J4376M298M0471
14495A02781k3059q5546j31791N7998N4750k9121Q113p4946j38062K5942J96715
14484c6226P7978J08399J9125k04666k1701R9246O1228l8486j22784k5940K9516
14473e4311N6312N4964J7609j15713N9730R8070o2744r2010j03620M4239n5552
14462a53026j11487o017J04172R5237r1190k7181K22086j8330L5916l3410J186
14451A7956N561n3310j50222j74184Q4313J38396j10047m3183J44038O3623O4153
$$ plain form
14440 -12906 -35442 -190536 -125118 -127008 -79010 203870 354300 442232 327986 130760 -39483
14429 -39483 -66796 70441 142914 158874 157335 82891 96733 -78398 -387064 -460899 -389498
14418 -389498 -153401 26143 86054 78141 48817 -12525 -7785 87343 26072 -60862 -42683
14407 -42683 36912 2304 -128522 -118607 -120073 -82764 -120563 -177846 -250818 -329646 -82895 30433
$$ packed form
14440a2906k2536j55094O5418j890M7998K82880J50430Q7932j14246j97226j70243
14429c9483k7313J37237P2473J5960j539p4444J3842j75131l08666p3835P1401
14418c89498K36097J79544N9911p913k9324o1342M740R5128o1271q6934J8179
14407d2683P9595l4608j30826R915j466L7309l7799n7283p2972p8828K46751J13328
$$ [...]
##END NTUPLES=NMR SPECTRUM
##END=
