##TITLE=Analysis number 328239
Compound Code tl 00220
Project Code adrs
Chemist Name fwd
##JCAMPDX= 6.0         $$ Bruker NMR JCAMP-DX V2.0
##DATA TYPE= NMR SPECTRUM
##DATA CLASS= NTUPLES
##ORIGIN= Bruker BioSpin GmbH
##OWNER= nmr
$$ XWIN-NMR		Version 3.5
$$ Thu May 17 09:32:37 2007 GMT Daylight Time (UT+1h)  MAYBRIDGE\nmr@NMR_250MHZ
##.OBSERVE FREQUENCY= 250.131544655141
##.OBSERVE NUCLEUS= ^1H
##.ACQUISITION MODE= SIMULTANEOUS (DQD)
##.ACQUISITION SCHEME= undefined
##.AVERAGES= 16
##.DIGITISER RES= 18
##SPECTROMETER/DATA SYSTEM= dpx250
##.PULSE SEQUENCE= zg30
##.SOLVENT NAME= CDCl3
##.SHIFT REFERENCE= (INTERNAL, CDCl3, 0, 16.4297)
##AUDIT TRAIL= $$ (NUMBER, WHEN, WHO, WHERE, WHAT)
$$ ##TITLE= Audit trail, XWIN-NMR		Version 3.5
$$ ##JCAMPDX= 5.01
$$ ##ORIGIN= Bruker BioSpin GmbH
$$ ##OWNER= nmr
$$ C:\u/data/dgb/nmr/ADRS/1130/pdata/1/auditp.txt
$$ ##AUDIT TRAIL=  $$ (NUMBER, WHEN, WHO, WHERE, WHAT)
(   1,<2007-05-17 09:32:08.39 +100>,<MAYBRIDGE\nmr>,<NMR_250MHZ>,
      <created by zg, POWCHK disabled, PULCHK disabled
       configuration hash MD5:
       76 6E 9A 78 1E 09 19 81 EC 84 63 8F B0 6A 59 2D
       data hash MD5: 64K
       BF 0E AF 0B 49 FB 22 AC 75 F7 48 36 72 50 A1 1F>)
(   2,<2007-05-17 09:32:25.86 +100>,<MAYBRIDGE\nmr>,<NMR_250MHZ>,
      <Start of raw data processing
       ef LB = 0.3 FT_mod = 6 PKNL = 1 SI = 32K 
       data hash MD5: 32K
       89 9F 28 8D B7 91 9A 52 15 86 74 77 2C D0 33 3B>)
(   3,<2007-05-17 09:32:27.84 +100>,<MAYBRIDGE\nmr>,<NMR_250MHZ>,
      <apk 
       data hash MD5: 32K
       B2 74 53 F2 C0 53 0F 6A E9 57 9F 36 84 7D 0D B2>)
(   4,<2007-05-17 09:32:28.58 +100>,<MAYBRIDGE\nmr>,<NMR_250MHZ>,
      <abs ABSG = 5 
       data hash MD5: 32K
       99 47 B3 1A 59 73 67 F0 8C 1D C8 F5 C0 76 7D 88>)
$$ ##END=
$$ 
$$ hash MD5
$$ B3 55 10 BB 50 C9 92 12 69 6F 2F 37 20 61 6D D6
##$RELAX= 
##$RELAX= 
##$RELAX= 
##$RELAX= 
##$RELAX= 
##$RELAX= 
##$RELAX= 
$$ Bruker specific parameters
$$ --------------------------
##$DU= <C:\u>
##$EXPNO= 1130
##$NAME= <ADRS>
##$PROCNO= 1
##$TYPE= <nmr>
##$USER= <dgb>
##$AMP= (0..31)
100 100 100 100 100 100 100 100 100 100 100 100 100 100 100 100 100 100 
100 100 100 100 100 100 100 100 100 100 100 100 100 100 
##$AQSEQ= 0
##$AQ_mod= 3
##$AUNM= <au_zg>
##$AUTOPOS= <3 >
##$BF1= 250.13
##$BF2= 250.13
##$BF3= 250.13
##$BF4= 250.13
##$BF5= 500.13
##$BF6= 500.13
##$BF7= 500.13
##$BF8= 500.13
##$BYTORDA= 1
##$CFDGTYP= 0
##$CFRGTYP= 5
##$CHEMSTR= <none>
##$CNST= (0..31)
1 1 145 1 1 1 1 1 1 1 1 1 1 1 1 1 1 1 1 1 1 1 1 1 1 1 1 1 1 1 1 1 
##$CPDPRG= <>
##$CPDPRG1= <>
##$CPDPRG2= <>
##$CPDPRG3= <>
##$CPDPRG4= <mlev>
##$CPDPRG5= <mlev>
##$CPDPRG6= <mlev>
##$CPDPRG7= <mlev>
##$CPDPRG8= <mlev>
##$CPDPRGB= <>
##$CPDPRGT= <>
##$D= (0..31)
0 1 0 0 0 0 0 0 0 0.06 0 0 0 0 0 0 0.0002 0 0 0 0 0 0 0 0 0 0 0 0 0 0 
0 
##$DATE= 1179390726
##$DBL= (0..7)
120 120 120 120 120 120 120 120 
##$DBP= (0..7)
150 150 150 150 150 150 150 150 
##$DBP07= 0
##$DBPNAM0= <>
##$DBPNAM1= <>
##$DBPNAM2= <>
##$DBPNAM3= <>
$$ [...]
##$SUBNAM7= <"">
##$SUBNAM8= <"">
##$SUBNAM9= <"">
##$SW= 20.6930455092707
##$SWIBOX= (0..15)
0 0 3 0 0 0 0 0 0 0 0 0 0 0 0 0 
##$SW_h= 5175.983436853
##$TD= 65536
##$TD0= 1
##$TE= 683.16
##$TE2= 300
##$TE3= 300
##$TEG= 300
##$TL= (0..7)
0 120 120 120 120 120 120 120 
##$TP= (0..7)
150 150 150 150 150 150 150 150 
##$TP07= 0
##$TPNAME0= <>
##$TPNAME1= <>
##$TPNAME2= <>
##$TPNAME3= <>
##$TPNAME4= <>
##$TPNAME5= <>
##$TPNAME6= <>
##$TPNAME7= <>
##$TPOAL= (0..7)
0.5 0.5 0.5 0.5 0.5 0.5 0.5 0.5 
##$TPOFFS= (0..7)
0 0 0 0 0 0 0 0 
##$TUNHIN= 0
##$TUNHOUT= 0
##$TUNXOUT= 0
##$USERA1= <user>
##$USERA2= <user>
##$USERA3= <user>
##$USERA4= <user>
##$USERA5= <user>
##$V9= 5
##$VALIST= <valist>
##$VCLIST= <CCCCCCCCCCCCCCC>
##$VD= 0
##$VDLIST= <DDDDDDDDDDDDDDD>
##$VPLIST= <PPPPPPPPPPPPPPP>
##$VTLIST= <TTTTTTTTTTTTTTT>
##$WBST= 1024
##$WBSW= 4
##$XGAIN= (0..3)
0 0 0 0 
##$XL= 0
##$YL= 0
##$YMAX_a= 817720
##$YMIN_a= -763481
##$ZGOPTNS= <>
##$ZL1= 120
##$ZL2= 120
##$ZL3= 120
##$ZL4= 120
##$ABSF1= 16.42966
##$ABSF2= -4.26351
##$ABSG= 5
##$ABSL= 3
##$ALPHA= 0
##$AQORDER= 0
##$ASSFAC= 0
##$ASSFACI= 0
##$ASSFACX= 0
##$ASSWID= 0
##$AUNMP= <proc_1d>
##$AZFE= 0.1
##$AZFW= 0.1
##$BCFW= 0
##$BC_mod= 0
##$BYTORDP= 0
##$COROFFS= 0
##$CY= 12.5
##$DATMOD= 1
##$DC= 0
##$DFILT= <>
##$DTYPP= 0
##$F1P= 14.0000005364418
##$F2P= -0.99999901652339
##$FCOR= 0.5
##$FTSIZE= 32768
##$FT_mod= 6
##$GAMMA= 0
##$GB= 0
##$INTBC= 1
##$INTSCL= 1
##$ISEN= 128
##$LB= 0.3
##$LEV0= 0
##$LPBIN= 0
##$MAXI= 10000
##$MC2= 0
##$MEAN= 0
##$ME_mod= 0
##$MI= 0
##$NCOEF= 0
##$NC_proc= -2
##$NLEV= 6
##$NOISF1= 0
##$NOISF2= 0
##$NSP= 0
##$NTH_PI= 0
##$NZP= 0
##$OFFSET= 16.42966
##$PC= 1
##$PHC0= -55.21105
##$PHC1= 4.553949
##$PH_mod= 1
##$PKNL= yes
##$PPARMOD= 0
##$PSCAL= 4
##$PSIGN= 0
##$REVERSE= no
##$SF= 250.130023096841
##$SI= 32768
##$SIGF1= 0
##$SIGF2= 0
##$SINO= 400
##$SIOLD= 32768
##$SREGLST= <1H.CDCl3>
##$SSB= 0
##$STSI= 32768
##$STSR= 0
##$SW_p= 5175.98343685301
##$SYMM= 0
##$S_DEV= 0
##$TDeff= 65536
##$TDoff= 0
##$TI= <Analysis number 999999
Compound Code 99
Book Reference 9
Project Code 9>
##$TILT= no
##$TM1= 0
##$TM2= 0
##$TOPLEV= 0
##$USERP1= <user>
##$USERP2= <user>
##$USERP3= <user>
##$USERP4= <user>
##$USERP5= <user>
##$WDW= 1
##$XDIM= 32768
##$YMAX_p= 319271551
##$YMIN_p= -226410
$$ End of Bruker specific parameters
$$ ---------------------------------
##NTUPLES= NMR SPECTRUM
##VAR_NAME=  FREQUENCY,     SPECTRUM/REAL,   SPECTRUM/IMAG
##SYMBOL=    X,             R,               I
##VAR_TYPE=  INDEPENDENT,   DEPENDENT,       DEPENDENT
##VAR_FORM=  AFFN,          ASDF,            ASDF
##VAR_DIM=   32768,         32768,           32768
##UNITS=     HZ,            ARBITRARY UNITS, ARBITRARY UNITS
##FACTOR=    0.157963299565203, 1,           1
##FIRST=     4109.55143465667, 0,            0
##LAST=      -1066.43200219634, 0,           0
##MIN=       -1066.43200219634, -226410,     0
##MAX=       4109.55143465667, 319271551,    0
$$ Real data points
##PAGE= N=1
##DATA TABLE= (X++(R..R)), XYDATA
$$ [...]
17165D738q145l600O942J583Q027K034o482l56O91J400L592n01J967N93M225P44
17149A7452m725n968n122J122K288m514k458K055o05O351j141m19j071m643r3
17134a491P445J390k702l506K374o02Q59JJ0855J767j710m847q453n618P076N860
17118H698J030m117n192k215l05L884p498L781R078N896O63o86o160k164L629
17103H322P85o082p08K575O416l289k919J487L600K073r13j866j112M953j362
17088A1960j036j904n425M015o934o111N206R88k662N657L157l510k362K560N935
17073I534k74p626k065K406K120K038J908n698o10K042q120k347N828k297j777
17058d938m464k546J984J609m584P662j760l850N425J907k64J827L530l11Q3K396
$$ y = [4738, -3407, -7007, -65, 1518, 9545, 11579, 5097, 4741, 5432, 6832, 10424, 9923, 11890, 12483, 16708, 17452, 12727, 6759, 1637, 2759, 5047, 533, -1925, 130, -475, 5876, 4735, 4316, 3245, -1398, -1491, 5954, 7344, 4642, 1136, 3510, 2908, 3767, 3768, 14623, 16390, 14680, 9833, 1380, -4238, 2838, 8698, 9728, 5611, 419, -1796, -2101, 1783, -5715, -1934, 7144, 13040, 13703, 13017, 6857, 4693, 8322, 9107, 3025, 2317, 4892, 11308, 8019, 5100, 6587, 10187, 12260, 11347, 9481, 8369, 13322, 11960, 10924, 9020, 3595, 7610, 676, -5435, -229, 759, -1903, 3754, 6911, 3401, 1039, 3599, 9534, 9260, 1634, -431, 1975, 4095, 6133, 8041, 2343, 1733, 3775, -4345, -6692, -864, -3161, -4938, -9402, -11948, -9964, -8355, -12939, -5277, -7037, -10887, -5462, -3555, -3819, -1992, 1538, 1227, 1310, 3706]
17042C706k430k248n40l29n078K678K675L861l395J739l595J83M475j532J671
17027A841O663j183l386O74K973L76l842m046O42L752j741k143m930k639K627
17012d362K134J0684N689n383o086m494R459M819m187p305j058K621l909k01j364
16997b943J343J652M86L758j196N446L79k55j0766k86l16k865N434L115n756J180
16981a590M595K564K324J477O965k695p937m701K371P197M699m651j0185l651
16967c218q81K380P79O504N226n663m196J829O382J221j915o056j031J874O438
16952I673J287k342k124m664k311k257k090n08R68N555J842J882k556J836J41
16937D332L751j558q661l311N804k464l721M70J0333J8J166P116J591n505m832
$$ y = [3706, 1276, -972, -1512, -1841, -6919, -4241, -1566, 2295, -1100, 639, -2956, -2773, 1702, 170, 1841, 8504, 7321, 3935, 4609, 7582, 7958, 4116, 70, 712, 4464, 2723, 580, -4350, -6989, -4362, -2228, 8456, 14145, 8762, 2676, -1818, 7641, 12460, 8273, 968, -90, 2531, -1378, -1579, -2943, -1600, 52, 538, 4296, 3100, 8546, 8925, 8670, -2096, -2382, -2698, -5563, -129, 2986, -2770, -1590, 3005, 5569, 7893, 9370, 16335, 13640, 5703, 1002, 3373, 10570, 15269, 10618, 433, -3218, -4099, -1719, -940, 5564, 10790, 5127, 931, 2760, 9142, 10363, 8448, 2392, 1361, 3235, 9673, 10960, 8618, 6494, 1830, -481, -2738, -4828, -5336, -4368, 1187, 3029, 4911, 2355, 4191, 4332, 8083, 6525, -2136, -5447, 357, -2107, -5828, -5358, 4975, 4993, 6159, 13275, 14866, 9361, 4529]
16922D529l487r54n59k168o8K678j666J55j526k693J392P38j811K89j965k226
16906i342O564O158l947j25K339l466m056k09M005j067J94O102l645k220n077
16891g792J359M628L663J510L367M531j667o336j213J925J592L168O40m286K216
16876G305j640M384K909k848l521l63O945M178L6j2254q791j123l52k271n042
16861a2448L65j045N894P973L925j209j69J553j872P148R798k610l828m62K713
16846A5726j170q63m880o723L777J199r68L701q457k176N178k162r525N855O840
16831E352J953k502k329o969q489O089J0799j15m543l572L165J325L968L296q689
16816a261p410k862j777O43J808N095K222M715N222j514J039k024l081J097j355
$$ y = [4529, 1042, 88, -471, -2639, -2707, -29, -1695, -1540, -3066, -5759, -4367, -3629, -5440, -5151, -7116, -9342, -2778, 3380, -567, -692, 1647, -1819, -5875, -6084, -2079, -3146, -2952, 3150, -495, -2715, -7792, -6433, -1805, 1858, 3368, 6735, 11266, 9599, 3263, 2050, 3975, 5567, 8735, 9375, 5089, 7305, 5665, 10049, 12958, 10110, 6589, 6226, 13171, 17349, 17385, 5131, -3660, -4783, -5135, -7406, -12448, -12083, -13128, -7234, 739, 4664, 3455, 3286, 4839, 2967, 10115, 19913, 17303, 13475, 13013, 15726, 14556, 13693, 8813, 2090, 5867, 7066, 6098, 9799, 1342, -834, 4344, 2182, -7343, -1488, 5352, 7305, 4803, 2474, -4495, -12984, -6895, 3904, 3789, -754, -4326, -1161, 164, 4132, 7428, -1261, -8671, -11533, -13310, -12667, -10859, -5764, -3542, 1173, 6395, 4881, 5920, 3896, 815, 1912, 557]
16801E57j907j913k142J28J863k326N67P440M681M968L771K584q849n190n325
16786a093J962L247K562L974M158J285q116p099J754L820L902l99J144k166k632
16771F303l024K686l292p20R54L230L091M981K806j008p702m961m838Pk473p043
16755a1003J240O537O416l146l696J656o51m214P720m727n359L074J04K169N821
16740A941k341k823N666L342r71l234m494j301k577m447O897J1946L768j741q484
16725A147o357l85N556P82l666M372J900j319m634K687K217n458R73O08p53J035
16709a295K847K284m172m591m960j375P052M782M73o54O659N496j929j652l283
16694E682m348k73J60n647o527k031J120m6O354M499K21J478M456N27l327q44
$$ y = [557, -1350, -3263, -5405, -5277, -3414, -5740, -5173, 2267, 6948, 11916, 15687, 18271, 9422, 4232, -1093, 869, 4116, 6678, 10652, 14810, 16095, 7979, 880, 2634, 6454, 10356, 9957, 11101, 8935, 6303, 3279, 5965, 2673, 1953, 2907, 6137, 9228, 14209, 17015, 16007, 8305, 3344, -1494, -1487, -3960, -11003, -9763, -3226, 3190, 44, -3652, -1996, -2647, -6861, 859, -3868, -9227, -6153, -6049, -3880, 1941, -400, -3223, 2443, 5785, 4814, 1580, -2914, -4215, -6792, -11239, -4342, 7604, 11372, 9631, 1147, -5210, -5595, -39, 743, -2923, 1449, 3349, 2030, -2604, 83, 2300, -3158, -2185, -1577, -2330, -1295, 1552, 3836, -336, -4927, -9887, -11262, -4210, 572, 1045, 391, 7050, 12546, 10617, 8965, 5682, 1334, 1061, 1221, -4426, -10953, -12984, -11864, -11910, -5556, -1057, -836, 642, 5098, 5625, 2298, 1454]
16678A454N052l882r485K375k559m963L655Q733Q737J162J565o031M420M804K061
16663A7098k57p06q739J097o587j720L070q36k351O032M781k904n814o783j381
16648f000l81j706N260N001J108q843J276L607j822J976J370N86M991L215n436
16633D202n03J23n641J591J638n901k12J876q72N522J278J138L392l707L830l181
16617D573k511L576J776n254J935n22j85l909J969J0316K163m162K224Q350m35
16602A9904j2799r359p19K399K034k180M760M204j419j61k486K823L070j778m435
16587C858q291J527l895n83N102k109O19O068K620M90M492n513m449J114k388
16572a338k571Q173J795k964R99R809M170k926l881k972K100J430M268r47n944
$$ y = [1454, 6506, 2624, -6861, -4486, -7045, -12008, -8353, 380, 9117, 10279, 11844, 5813, 10233, 15037, 17098, 16841, 16135, 7396, 8493, 1906, 186, 3256, 2420, 69, 6101, 10882, 7978, 2164, -4619, -6000, -6381, -8087, -2827, 2174, 3282, -5561, -4285, -678, -2500, -524, 846, 1432, 6423, 9638, 4202, 3699, 3822, -1819, -228, 1410, -4491, -4703, -2827, -3699, 1823, 3101, 4239, 7631, 3924, 7754, 4573, 2062, 5638, 7414, 2160, 4095, 3573, 3388, -521, 1448, 11764, 13927, 9765, 11989, 20339, 19904, 7105, -2254, -2973, -574, 1460, -720, 4040, 8244, 6825, 6664, 4178, 7001, 10071, 8293, 3858, -4433, -2906, -6801, -7384, -2282, -4391, -3772, 2296, 4916, 5406, 9898, 4385, -64, 1050, -1338, -3909, 4264, 6059, 3095, 4094, 13903, 18073, 15147, 11266, 8294, 10394, 11824, 16092, 15145, 9201]
16557I201n021k616k464j788J466P1L082J917P45K022l337j837l009j449k388
16542e405N346M582l242l589j046P90l250m588M081L959k680o370N585L005l475
16527f297K42M034M301N195m23j1275p132j59K252M554k135L863M772m825o950
16512i983k487P185N536n953l676M572L073L810K409N21k876J5l964P5K96l785
16496e232m015m012J0092R621L018j0275o507M817O051l119Q92K27Q25l042L322
16481B663J764l303k372p91k991L303K353M221K637J244L43K200l841l798l395
16466B37m354N8M904R62l394M090R92p355j275O24J896r50l265j928L431L652
16450a675O21J843k185l121j782r50j83J0171j283k363k19J975j173j444K641
$$ y = [9201, 4180, 1564, -900, -2688, -1222, -1151, 1931, 3848, 4593, 6615, 3278, 1441, -1568, -3017, -5405, -59, 4523, 1281, -2308, -3354, -2564, -5814, -10402, -6321, -2362, -5042, -11412, -5827, -2822, -6297, -6055, -2021, 2280, 7475, 7052, -4223, -11355, -11514, -9262, -4708, -6843, -2980, 1792, -3033, -9983, -12470, -5285, 251, -5702, -9378, -4806, -1733, 2077, 4486, 5007, 2131, 2146, -1818, -1743, -1447, -5232, -9247, -13259, -3167, 6454, 9472, -803, -7310, -2493, 3558, 439, 1331, 1558, 2383, -659, 2663, 4427, 1124, -1248, -2039, -5030, -1727, 626, 4847, 7484, 8728, 9071, 11271, 7430, 3632, 237, -4117, -4059, 845, 1807, -1587, 2503, 3495, -3860, -5135, -4511, -2615, -3565, -6830, -8758, -5327, -1675, -1054, 789, -1396, -4517, -6299, -7249, -7432, 2739, 1456, -907, -1126, 849, -324, -1768, 873]
16435H73K732k881o434L366J835j338M206N536k492l236j22O769l109J074P942
16420A4721m045m518M656L101o201n226o443J16M16L240L29K77N203J678n259
16405B045L890M440o233K199N426l91o831l732L367O40m629M689K326k962m623
16390c79N531O30p709p212K401M965k079M548Q57l135j039M757P22n139l377r89
16374f647J1K323J986N045J397L444M601k587j018r840r394K244L796J123K590
16359i26m761m596Q861M217M252m229k171l117p73L598m92j193K522L43m057j660
16343d182k34o152j544j776R619R594O285J589j1397p613J18k747jP554Q406p217
16327C02k061j332n644P78N23J525L437j35j820l153J097O84N052N954p545k9
$$ y = [873, 3605, 724, -5710, -2344, -509, -1847, 2359, 7895, 5403, 2167, 2045, 8814, 5705, 6779, 14721, 10676, 6158, 10814, 13915, 7714, 2488, -3955, -3839, -3423, -183, 146, 423, 5626, 7304, 2045, 5935, 10375, 4142, 6341, 11767, 11376, 4545, 813, 4180, 4820, 191, 4880, 7206, 4244, -379, 5152, 5782, -1927, -9139, -6738, -1773, -3852, 696, 1553, -1582, -2621, 2136, 2858, -2281, -5658, -6647, -6636, -4313, -2327, 2718, 4115, 7559, 12160, 9573, 8555, -1285, -10679, -8435, -4639, -3516, -926, -5687, -10283, -1422, 2795, 7047, 2818, 647, -2470, -3243, 355, -137, -1330, 1192, 1535, -2522, -4182, -4416, -10568, -12112, -13888, -4269, 5325, 11610, 13199, 1802, -5811, -5693, -8440, -8441, -887, 7519, 302, -1759, -3091, -8735, -7957, -7434, -5909, -2472, -2607, -4427, -7580, -6483, -5799, -747, 5207, -2338, -2367]
16311b367K604l107j029p932K602J878N502J606r693j058O722k917k245Q33M805
16296c796l023j736M631q19m266K464M395K131J492j897k842K947m643K918O714
16281D670p54O8K610j846q85l132K731M00k007k069n992k32l40N58K346N18J148
16264b208R1n068k943j792K81O812K131M862J996j830k442K006N491Q4k394m027
16248A050J225P18j468L21R572J229q211o801L987r96k801M33n67j015j868J719
16232c473P142o87j387o521N113L120R393m28m159p90K358l608j815n810J867
16217C15J869K631m274K702J761L652P48J41K185J274p34j1395k818m109p098
16202a3150J034m60M995M675P739k584L61p295N312J0553k668p618l064K89J176
$$ y = [-2367, 237, -2870, -3899, -11831, -9229, -7351, -1849, -243, -9936, -10994, -4272, -7189, -9434, -8601, -3796, -6819, -8555, -3924, -4743, -9009, -6545, -2150, -19, 1473, -424, -3266, -319, -4962, -2044, 4670, 3916, 3984, 6594, 4748, 3863, 731, 3462, 3862, 1855, -214, -6206, -6438, -6778, -6220, -3874, -3356, -2208, -2117, -7185, -10128, -11920, -11639, -4827, -2696, 2166, 4162, 2332, -110, 1896, 7387, 7471, 5077, 1050, 2275, 2993, 1525, 1846, 11418, 12647, 4436, -2365, 1622, 626, -2175, -1742, -2309, -3324, -5192, -3473, 3669, 2982, 1595, -4926, 187, 3307, 12700, 12272, 8113, 7323, 9681, 6073, 4258, -1552, 315, 2184, 4815, 541, 3243, 5004, 8656, 9404, 9545, 11730, 13004, 12270, 875, -1943, -6052, -13150, -12116, -12576, -7581, -2906, 4833, 2249, 2610, -4685, 627, 11180, 8512, 894, -2170, -1881, -705]
16187g05L490m276J668j58m787L866O12N41j88J317M57o85j338K107J149n95o653
16170d178J258M032K30J297K170K237j950l984n58k498N01M004Q185k990j503
16155F253J687j889m3P29k823j829j625n810L272Q454K682M704q30j484q598n851
16139c001o809m112j163J2696O148k5m248J351J3407q97l831m350k683J286l160
16124F09K73J237J45p50k714k920P44L841M359n784m382K673M615N639L817P38
16108A2140l057P52J805q166q531k177j542L114J578k172k361N673P999j807k11
16093C037r29K514n75j0684j827o80L658L438j683j983j611K964N981R01K408
16078D929n505J623r71J921l915n235l425o08J821j486J754J3843R054J67l941
$$ y = [-705, 2785, -1491, 177, 19, -4768, -902, -290, 251, 63, 1380, 1837, 1152, -186, 1921, 3070, 2475, -4178, -2920, 1112, 1342, 2639, 4809, 7046, 5096, 1112, 554, -1944, -1443, 2561, 10746, 7756, 6253, 7940, 6051, 6008, 6737, 3914, 2085, 460, -5350, -2078, 6376, 9058, 13762, 12932, 11448, 2850, -3001, -9810, -13922, -15085, -2389, 3759, 3734, -514, 837, 14244, 13347, 9516, 5166, 2483, 3769, 609, 882, 2119, 2264, 1514, -1200, -4120, -3376, 465, 4824, -960, -5342, -2669, 1946, 7585, 11402, 12140, 9083, 9835, 11640, 3474, -5057, -7234, -8776, -5662, -4084, -6256, -8617, -2944, 5055, 3248, 3037, 2108, 4622, 4047, -6637, -8464, -9144, -5486, -2048, -3731, -5714, -7325, -4361, 1620, 2521, 4929, -576, 1047, 76, 1997, -1918, -7153, -10578, -11186, -9365, -10851, -9097, 4746, 13800, 13967, 10026]
16063A0026l358m268P377l97m499j390l91J728L467K204m601L0K701J99K617k130
16047I315o520o924n502j557J608K94M512M491K124r72r5j55K309o523j150K160
16031b585n829J779O04L171M216K363l351j294l036q62K48k025M747K848K639
16016C633m506m071K159N69n44P237L914m905K763Q336q346j1833l821m204J849
16001a1770k31n163j301J1167M087K315q6m051K409L416m626j83O87N320N869
15986G859m820n797O18P429L346N256N0r923n558N208m371m682P12L209j7K50
15970a231n374K324P927Q140Q358n807m678j996k152k86L878J04L536K310j0278
15955D775j1020n166P75K085P586N742O504l81r793o829n15m31K530Q7J897k888
$$ y = [10026, 6668, 2400, 9777, 9380, 4881, 3491, 3100, 4828, 8295, 10499, 5898, 5928, 8629, 8828, 11445, 9315, 2795, -4129, -9631, -11188, -9580, -9286, -4774, -283, 1841, 869, 774, 619, 2928, -3595, -4745, -2585, -8414, -6635, -6031, -2860, 1356, 3719, 368, -926, -3962, -4824, -4576, -6601, -1854, 994, 3633, -873, -4944, -2785, -2216, -2760, 4477, 8391, 3486, 6249, 14585, 6239, -5594, -9415, -13619, -11770, -12001, -17164, -18465, -7298, -3211, -896, -982, -5033, -2624, 792, -3834, -4017, -3330, 1990, 7859, 3039, -2758, -2140, 5289, 8635, 13891, 13941, 4018, -1540, 3668, -703, -5385, -4673, -1464, -1481, -1231, -6605, -4281, 3646, 11786, 20144, 14337, 9659, 7663, 5511, 5225, 9103, 9207, 12743, 15053, 4775, -6245, -11411, -10636, -8551, -965, 4777, 11281, 10900, 1107, -5722, -6237, -6668, -4138, -4051, -2154, -5042]
15939e042J668L840N47J127l928k489N23l012k608L379K413J995o481l689L194
15924h563p54M155M040j493m418N574N495n450K204N502k849K802O151k422j5316
15909e342p289N628k646q03p73M125J564R29M255O222o89m175p218m969K611l654
15893a2224J032O807M798M45j913k022l473l915M670j727P65O027K161j565Jq43
15877i76j168j665J360m966O780j824l712m343p23j044q31Q725L135n375K956
15862c671R577K861K924m432m059O237j80J446L971m401n90k522L542J90o183
15847D710n419n749N590R998l532m102l803Q92L735M316p498k722m43o129L061
15832g095M834N609o701o178N574L417j096j701J193J784O153j095K03n080m49
$$ y = [-5042, -3374, 466, 1013, 2140, -1788, -4277, -3754, -6766, -9374, -5995, -3582, -1587, -8068, -11757, -8563, -9317, -5162, -1122, -2615, -7033, -1459, 4036, -1414, 790, 6292, 3443, 6245, 12396, 9974, -5342, -12631, -7003, -9649, -10452, -11225, -7100, -5536, -4607, -352, 5870, 5181, 1006, -6212, -11181, -8570, -12224, -11192, -4385, 413, 858, -1055, -3077, -6550, -10465, -5795, -7522, -6757, -730, 1431, -134, -133, -976, -2144, -3809, -2449, -7415, -635, -2459, -6171, -10514, -11237, -12281, -13112, -4387, -1252, -6627, -3671, 5906, 8767, 11691, 7259, 3200, 9437, 9257, 10703, 14674, 10273, 9683, 7161, 10703, 10893, 4710, -709, -6458, -868, 9130, 5598, 1496, -2307, -1415, 2320, 6636, -862, -3584, -4027, -10156, -7095, -2261, 3348, -3353, -9531, -3957, -540, -1636, -3337, -2144, -360, 5793, 4698, 4901, -179, -628]
15817f28Q723N052P27m085p626m442N9L560m11J574K871j362o171k393K393M888
15801B729L76N81n327k661l825Q369r63l538q232M65P545L223j290j166m021m752
15785a2487L923J090L998L672m946m200K087K168l627n365J0282M896J976k255
15771A212J376r531k957J712J757N396l398k110N046q33l184k770R983k896o309
15756g506N603K853o190M327O653J372k137o098p643N960O318l094j633m947L752
15741b410K706l717m210P64l02k243L403m771o021M49O887K737K78J695j0219
15726a4974R17j957l7O821M664m699j510J593l57N005k13m623k167K322L340L532
15710b343j23M127p363k964J119j321n19K73K598K460J467K505J037K304K579
$$ y = [-628, 8095, 13147, 13874, 9789, 2163, -2279, -2220, 1340, 929, 2503, 5374, 4012, -2159, -4552, -2159, 2729, 3105, 3686, -1641, -4302, -8127, 242, -721, -4259, -12491, -12026, -4481, -1258, -2548, -3714, -7735, -12487, -8564, -7474, -3476, 196, -4750, -8950, -6863, -4695, -8322, -13687, -3405, 1491, 3467, 1212, 2588, -6943, -9900, -8188, -6431, -1035, -4433, -6543, -1497, -2330, -5514, -8284, 1699, -1197, -7506, -1903, 950, -5240, -913, 5740, 7112, 4975, -1123, -8766, -2806, 3512, 418, -1215, -6162, -2410, 296, -3421, -7631, -6867, -7169, -9412, -6009, -10780, -16801, -16352, -9465, -6728, -6450, -4755, -14974, -14057, -16014, -16051, -9230, -4566, -9265, -10775, -9182, -9539, -4534, -4747, -9370, -11537, -9215, -5875, -2343, -2466, 1661, -5702, -8666, -7547, -8868, -9387, -9114, -6516, -4056, -2589, -84, 953, 3257, 5836]
15695E836p110Q78R407L374N646o684r849n699K921L722K254l361m57p45o430
15680f297L152N914j0233k161M701k196j345J182L623l666j409K927M075o065
15666g798L05L408N839j98l444k84l07J0981L011p190l455n12p826Q40J461k993
15650h162j963q48J1107K898j619J416J33J234l196j816j14K049m906j458L84
15635d861M812J033k863M56k784P15m076n857L670M283L137m545o828L948K072
15620g688n134K331M196l192n433N513L698L84K460k477l996k783J817J303K381
15605f620K465J198N233O470j366p686L87K708q47n09l533K644P467n686k257
15590F8o372J853k381J0759N703o83m068o254N810L255N373k435j433m71k747
$$ y = [5836, -1274, -396, 9011, 12385, 18031, 11347, 1498, -4201, -1280, 2442, 4696, 1335, 878, 133, -6297, -3145, 2769, -7464, -9625, -4924, -7120, -8465, -7283, -3660, -7326, -8735, -5808, -1733, -7798, -7493, -4085, 1754, 1556, -1888, -2172, -2479, 8502, 11513, 4323, 868, 356, -7470, -6630, -5169, -8162, -10125, -10973, 134, 3032, 1413, 2829, 2962, 4196, 1000, -816, -930, 1119, -3787, -5245, -4861, -49, 984, -1879, -1423, -4207, -3492, -7568, -13425, -9755, -5472, -2335, -6880, -13708, -9760, -7688, -12822, -10491, -6295, -9487, -14920, -9407, -5709, -5325, -2865, -5342, -9338, -12121, -10304, -9001, -6620, -4155, -2957, 2276, 8746, 7380, -306, 81, 2789, 1942, 1433, -2100, 544, 8011, 2325, 68, -6304, -4451, -6832, 3927, 9630, 8947, 4879, -1375, 4435, 7690, 13063, 10628, 9195, 8724, 5977]
15575E977r434m182L887R378K188j810L855l329k813J648m323p043n644J300L984
15560f361M098K610K44m29n559M872J591l620k621p78j399p208J933J0768M651
15545B792k646k863m910J941O78J207R60M36O87j521L318j667K075M529J750l433
15529C333n113j964Q00J416J720J069k472l45R90k025J835j745j465O253J338
15514C625N719j401k184l82l899r387l638M830N136N287K74P88j917J844M841
15499I536J063j738m457n158j484M01Q098m328j833L974Q385L118n414l645n164
15484A354R072m23n438o07p141m393R21L282Q721L82L40k731k16L290j267m022
15468A124n251j317M762L18m51k324k377Q221j792n917K57M439K23j599L730l684
$$ y = [5977, -3457, -7639, -3752, 5626, 7814, 6004, 9859, 6530, 3717, 5365, 1042, -6001, -11645, -10345, -6361, -2263, 347, 591, 162, -5397, -525, 1066, -2554, -5175, -5953, -7352, -14560, -12627, -1859, 2792, 146, -2717, -7627, -5686, -5008, -3801, -2841, -2405, -1718, -3239, 79, -1588, 487, 5016, 6766, 3333, -1780, -3744, -2944, -1528, 192, 1261, -1211, -1556, -566, -2591, -756, -2501, -3966, 2287, 3625, 9344, 7943, 5759, 5377, 1478, -7909, -11547, -6717, -1581, 3706, 3980, 4768, 2851, 4695, 9536, 10599, 8861, 4404, -754, -2238, -1837, 6261, 1933, 100, 4074, 12459, 15577, 10163, 6518, 1354, 10426, 10003, 4565, 3958, -3183, -7576, -6655, -3373, 5348, 5730, 6070, 3339, 3123, 6413, 5146, 1124, -4127, -5444, -682, -364, -815, -3139, -5516, 2705, 913, -5004, -4747, -308, -85, -1684, 2046, -1638]
15452a638j062L014L249q81P187P920l537m523m154l365j132L114K585l111n097
15437a431r955j33J2207J922n605j3q84j06K05Q81P235L68K840K066j2468l071
15421e942k95K815J761O949j043j012K392O593l25m414m238n939n034K142Q190
15406B600R376O82k03k507q636k680k818l057l356M974R77J081O003L984P535
15391A3955p81q457Q72L388J753j728M156q330p523j152K925l511O84P262m430
15376i17j714n757L306O367O46J316J46j693m957n606K001J242k383L889O884
15361B770m249r195l397O936O910j293o339P69N426L021N40j1031l2J117k610
15346a0657m774O201P881K066j598K876Q77L086n062j367J668R10J139L272L318
$$ y = [-1638, -2700, 314, 3563, 2682, 9869, 17789, 14252, 9729, 5575, 2210, 1078, 4192, 6777, 3666, -1431, -11386, -11519, 688, 2610, -2995, -3008, -3892, -3998, -3793, -2912, 4323, 4691, 7531, 9597, -2871, -5942, -6237, -3422, -1661, 5288, 4245, 3233, 5625, 12218, 11893, 7479, 3241, -2698, -7732, -5590, 2600, 11976, 12658, 12455, 9948, 1312, -1368, -4186, -7243, -10599, -5625, -4648, -3567, 2436, 6420, 13955, 13174, 4717, 5589, 8977, 10730, 9002, 13158, 4828, -2695, -3847, -922, -4433, -3749, 3513, -917, -2631, -8388, -5082, 1285, 1931, 3247, 3393, 1700, -3257, -8863, -6862, -5620, -8003, -4114, 2770, -1479, -10674, -14071, -7135, -225, -1518, -7857, -7088, -1662, 1359, 1899, -9132, -9164, -8047, -10657, -15431, -9230, -1349, 717, -881, 1995, 2872, 5958, 896, -471, 1197, 2107, 3246, 6518, 9836]
15331I836L47m144m277K201N12R07o280k041N739P302m094j866l572L63N52j761
15315b76l242m832k73M543j315M348L739m928l65N844j673L543J075o670k418
15300b900k833n10P064J115n0N81j927q902K690p48L93J1054L486j1960n281J303
15284g425P308l629l735O078P297n171l684m155Q01J954k648r176K62P80p57Q973
15268f927L204R97m85p79N713O206K276n384j0638L499L104k327m002l470R396
15253C83O020k770K124j29M039M713M669q57j823l867p337m790n126n672k907
15238a3330j565L3J792J936N069N334J94l22R1L59Q199n674m921J0771m27j50
15222G389k03o137m83k666K150Q842k442l081l384J326j100P119J88j753k399
$$ y = [9836, 10183, 6039, 1762, 3963, 4475, 5382, -898, -2939, 2800, 10102, 6008, 4142, 570, 933, 1485, -276, -3518, -8350, -8623, -4080, -5395, -1047, 2692, -2236, -2601, 3243, 1570, 5113, 6188, -482, -2900, -5733, -6243, 821, 1936, 1886, 2467, 540, -8362, -5672, -6420, -6027, 5027, 8513, -3447, -8728, -7425, -117, -3746, -7481, -1403, 5894, 723, -2961, -7116, -6315, -4361, -7009, -16185, -15923, -15143, -15900, -6927, -3723, -2726, -3211, -3990, 1723, 7929, 10205, 4821, -5817, -2318, 786, -1541, -5543, -9013, 383, 6403, 3633, 5757, 5628, 9667, 14380, 19049, 18192, 16369, 12502, 5165, 375, -4751, -10423, -13330, -14895, -14862, -13070, -11134, -6065, -731, -537, -859, -768, -409, 7790, 2116, -2805, 7966, 7539, 7389, 7186, 1049, 566, -2100, 50, 8892, 6450, 3369, -15, 1311, 211, 7330, 7518, 5765, 3366]
15207C366q537j844L355J490J553k70k987l438J985l47J634J423N920r23L213
15192E593o93l309P11l09j107O717j321m817n009O08P95L546n589M580k78o451
15176f333J763L681J338N660l587N33l084n921j40J691J687Q18p94J026J228K242
15160A808L079n72p605N125K603M480P86q153J071J70K1k875P39J41j0679k907
15144a2768N457P120K520j030l366L803J462n085k453J470L373n832J721K683
15130i25O943Q93o261j1918L419k011M326N188j599n69r04m09N911O733J22m600
15114D339L0j725J533j1822o844O868O082O097N52J562L575L062m688q599J23
15099A45N83K84M856O27K812l103m319m525l646L834K051O957l77j794n329P307
$$ y = [3366, -5171, -7015, -3660, -2170, -617, -887, -3874, -7312, -5327, -5674, -4040, -2617, 3303, 2380, 5593, 4900, 1591, 2302, 1993, 886, 7603, 6282, 1465, -3544, -2936, -2141, 1405, -4184, 396, 118, -6333, -4570, -889, 449, 6109, 2522, 3055, -29, -5950, -6090, -4399, -2712, -1894, -2688, -1662, -434, 1808, 4887, 4315, -3290, 1835, 4438, 8918, 9704, 1551, 2622, 2792, 2813, -62, 677, 818, -9861, -12768, -7311, -191, 2329, 1299, -2067, 1736, 3198, -1887, -4340, -2870, 503, -5329, -3608, -925, 6018, 6911, 650, -11268, -7849, -9860, -5534, -346, -1945, -2514, -3418, -3827, 2084, 8817, 8939, 4339, 4369, 2644, 4177, -7645, -14489, -7621, -1539, 4558, 5110, 6672, 10247, 13309, 8621, 22, 145, 728, 1012, 5868, 6495, 9307, 6204, 1885, -2640, -6286, -2452, -401, 6556, 6179, 4385, -944, 6363]
15083F363N798j90j266k143j017r357m357m06Q64J435M310K352L366m08k587l937
15067a180R2L311L851J754j1341o495l532j174k6L325N95J351l537P249M279j231
15051b709m326j647R60M706k74J77K589J690k095r75l46m699l251N33K120o29
15035h176L912L838K278K586J104J131L538l043n468p387j633j190l542l772j191
15020a7015Q327Q278O264M494j09L315k418J83r939n877j674l035o74L336L132
15005c412M761R73J601m499p386l158l524n763J768N802M622L333M542J0053k171
14990G542l468Q50p144O02r34q36q72j033r70R56N236L837q56m691m689L233j536
14973d773M672O989M487M00j392k079j096p034k605L693K762l928l01O538n449
$$ y = [6363, 12161, 11971, 10705, 8562, 7545, -1812, -6169, -6575, -5711, -4276, 34, 2386, 5752, 5344, 2757, -1180, -1088, 2223, 6074, 7828, -3513, -10008, -13540, -14714, -14740, -11415, -10820, -9469, -13006, -5757, -1478, -2709, -7035, -8682, -7722, -3016, -3290, -3113, -524, 1166, -929, -1904, -2250, -6949, -10200, -9667, -7547, -8176, -4264, -426, 1852, 4438, 5542, 6673, 10211, 7168, 1700, -5687, -7320, -8510, -12052, -15824, -17015, -8688, -410, 5854, 10348, 10239, 13554, 11136, 11319, 1380, -4497, -6171, -9206, -9880, -6544, -3412, 1349, 2322, 3923, -576, -7962, -11120, -14644, -20407, -18639, -12837, -8215, -4882, -340, 9713, 7542, 4074, 4924, -2220, -1618, -2552, -3388, -4260, -5293, -6263, -5307, -71, 3766, 2910, -1781, -6470, -3237, -4773, -101, 6888, 11375, 11775, 10383, 8304, 7208, 174, -2431, 1262, 4024, 96, -205, 6333, 884]
14958H84q816p55L441M467J279o263n208K047J105j209J948m242o12K833J0349
14943A248M71n92O269M949J219l096o077k138q36L244N365k51m888k449L772N819
14927A2029k552l486L450k367n513m871j877L811P995j495o055m716k648L858
14913d437N46m305J129m006J206k396K151R211K164j226n389l756J735K299O264
14898A190O556r1m894m141L675l462k651l280M065J611J58K192o635j464K152
14883e019K197L3N420J885o532j104N320K311J678l200l150j570p115K086R426
14868B666R4M49n255r01K210k398K175J041k370O47J0994M909n592m315K053o492
14852h5n595O9P19m89k792O094L699l615K083N770j965p065k204L567L985L767
$$ y = [884, -7932, -8687, -5246, -779, 500, -5763, -10971, -8924, -7819, -9028, -7080, -11322, -11934, -9101, 1248, 1719, 1127, 7396, 12345, 13564, 10468, 4391, 2253, 1417, 4661, 10026, 9775, 4887, 2438, 6210, 12029, 9477, 5991, 9441, 7074, 1561, -3310, -5187, -1376, 6619, 5124, -931, -5647, -8295, -4437, -3891, -8196, -7067, -11073, -9867, -12263, -10112, -901, 1263, 37, -5352, -9108, -7373, -5074, 1190, 7746, 7655, 2761, -1380, 2295, -1167, -3818, -7098, -3033, -1422, -1264, 928, -5707, -7171, -5019, -2822, -2789, 2631, 4516, -2016, -3120, 2200, 4511, 6189, 2989, -161, -1731, -8846, -6760, 2666, 2760, 3209, -2046, -2947, -737, -3135, -960, 81, -2289, -1642, 9352, 14261, 8669, 4354, 6407, -85, -5680, -5611, -4892, -5381, -8173, -2079, 1620, -1995, 88, 5858, 3893, -3172, -5376, -1809, 2176, 5943]
14836E943J12p863m95j51J453K915r838j796Q458j820l293R77K930P577O382p033
14820D458k030M199j801k919J465k25K609K883l439j382j863L84K509J95Q54K174
14804H071k359m368l767l745l877N098P434p70M668O89k556q187N33M97l907j961
14788h507J230J780J001L182P741p748k016K334K860m26M440l457l882P304K56
14773F092j107l467l546o624Q87J389m429N213Q857P756R48m336n230m091p799
14758i487J036O757j56K998J459k843k869k580P90l63n89J899l367K253L224m870
14742f708k985L589J888k026o141l934j945L989J1473O403l857l241q568J049
14728a1014Q2P96j76K32J499L652J52Q94J1098L121n983l408j502L64m295n377
$$ y = [5943, 6055, -1808, -2303, -2454, -1001, 1914, -7924, -9720, -1262, -3082, -6375, -5398, -2468, 5109, 11491, 4458, 2428, 6627, 4826, 1907, 3372, 3147, 5756, 8639, 5200, 3818, 1955, 2339, 4848, 5043, 5897, 8071, 5712, 1344, -2423, -6168, -10045, -4947, 2487, 1717, 6385, 7074, 4518, -3669, -3136, -2639, -6546, -8507, -7277, -5497, -4496, -1314, 6427, -1321, -3337, -1003, 1857, 1431, 5871, 2414, -1468, 5836, 6092, 4985, 1518, -2028, -8652, -7765, -6376, -10805, -5592, 3265, 11021, 11969, 7633, 2403, -1688, -9487, -8451, -1694, -1850, 1148, 2607, -236, -3105, -5685, -4895, -5258, -5847, -3948, -7315, -5062, -1838, -6708, -9693, -6104, -4216, -6242, -12383, -16317, -18262, -14273, -2800, 3603, -254, -3495, -12063, -11014, -10932, -10136, -10312, -10080, -8581, -4929, -4777, -3883, 7215, 10336, 4353, 945, -557, -193, -4488, -9865]
14712i865J440J0240j823k421k681K276l415m021p53r02j592o09M787P844j692
14697c187n069k255P25q079J884P172P812m056n314K995M637K466O33m859K016
14682b479O258N94k512Q31J363j132o946j1184N936O733q304k05O069K406k042
14667d614j008L396K247p929P70L433L194L070r13m32n801L008K102j288k95J180
14651A20m130K625J836l120n017J590R992R580r114j696M131J002p762m727L378
14636a312O110p77k243p08p32J503N916L296N38k979n328n277m138P559Q256J686
14620A1370r32j1102q062O151L761m280p222P150O264n79K74M357j1646q878R74
14605a2400P260L373o459K545P868N717M251j746n686p227j502O394N125n859
$$ y = [-9865, -8425, 1815, -8, -2429, -5110, -2834, -6249, -10270, -11023, -11925, -13517, -14126, -9339, -1495, -3187, -8256, -10511, -9786, -17865, -15981, -8809, -997, -5053, -10367, -7372, -2735, -269, 364, -4495, -2479, 3779, 4373, 1861, 2692, 4055, 2923, -4023, -15207, -9271, -2538, -10842, -11047, -4978, -2572, -4614, -5622, -2226, 21, -7908, -7138, -3705, -511, 2559, 1646, 1214, -4587, -1579, 523, -765, -1060, 120, -4010, -1385, 451, -2669, -7686, -6096, 3896, 13476, 4362, 2666, 6797, 7799, 37, -4690, -1312, 4798, 4021, 1778, 1070, 338, 1841, 7757, 11053, 11591, 8612, 3284, -1993, -6131, 1428, 9684, 11370, 10438, -664, -8726, -2575, 1186, -3094, -10316, -3166, 3098, 2519, 2793, 7150, -4496, -13374, -12400, -5140, -1767, -8226, -5681, 2187, 7904, 12155, 10409, 4723, -2504, -4006, 2388, 7513, 1654]
14591A654n492n796m546P66Q194J024k411p3K476K169k553m817k972N91J123M638
14575f025K649P843K661P27j105o785J792l76J97j605m039o85j149k570K499K33
14559e738l511j84J605L290J1220L470o870k671K186M840L293l628o462n718K367
14544b511j27J512N340j288j120r135m49N239q915p34O780J779M065K933P19n579
14528a491p108l302n932O985O499j845L71N567j1K949J459j365l980r621M13M532
14512e880K66L939O942j029L120k494k724j848o342m556M728J415m768K195j859
14497h895m15L809j141K832k23l440L684p41n248K047l292J968J0260K75K820
14482D300J073l792m507n233k497K725K297L516l647l658L197N411M025K716K458
$$ y = [1654, -3838, -9634, -14180, -13414, -5220, -4196, -6607, -6680, -4204, -2035, -4588, -9405, -12377, -11786, -10663, -6025, -3376, 4467, 7128, 7855, 6750, -35, 1757, 1381, 1578, -27, -4066, -4751, -5900, -8470, -5971, -5738, -9249, -9433, -7828, -4538, 6682, 10152, 3282, 611, 2797, 7637, 10930, 7302, 840, -4878, -2511, -2638, -1126, 4214, 2926, 1806, -7329, -7778, -2539, -11454, -12188, -5408, -3629, 436, 3369, 4088, -1491, -8599, -11901, -17833, -10848, -4349, -6194, -5823, -256, -267, 2682, 4141, 2776, -1204, -10825, -10412, -5880, -5614, -1675, 5267, 4238, 7358, 4864, 2140, 292, -6050, -10606, -5878, -4463, -9231, -7036, -8895, -9310, -5501, -6642, -3810, -4033, -7473, -3789, -4530, -9778, -7731, -11023, -9055, 1205, 1480, 4300, 5373, 1581, -2926, -8159, -10656, -7931, -5634, -2118, -5765, -9423, -6226, -815, 3210, 5926, 8384]
14467H384n365o388j811j998N896J727j091J072K655k956K156l316J729k196n369
14452f871o175J104K90N114M968j433k722P089P948O60p527N78J917L135R29o815
14436B189n836k893K464M843J659n521k651M154j66L335m33k753n666l642J858
14421i059J210P82j576m317K047P732o76M26q46j165j338K581Q193l45p737L680
14405d08M674j800M812m023l252L240k340M42j016J045l76k67l536M706L880l400
14389B381j777r47k172k662l056n9M337M76L65o468j81J075J032L471Q66l082
14373f401L715L974J413J916j536l890k831p72L335K371J362k346q629n17M907
14358c929K966o993o364J862M997L871K366K277L836O149l026l930n870N89O426
$$ y = [8384, 3019, -3369, -5180, -7178, -1282, 445, -646, 426, 3081, 125, 2281, -1035, 694, -1502, -6871, -13046, -11942, -11652, -6538, -1570, -3003, -5725, 1364, 9312, 9972, 2445, 3023, 4940, 8075, 9004, 2189, -3647, -6540, -4076, 767, 2426, -3095, -5746, -1592, -1758, 1577, 1144, -1609, -7275, -10917, -9059, -7849, -7067, -8643, -12960, -10913, -3181, -3857, -3431, -4277, -5442, -6780, -4199, 3994, 3649, -4088, -408, 4266, 2466, 7278, 3255, 3, 3243, 903, 1345, 329, 1374, 998, 731, -2805, 1901, 5781, 2381, 604, -343, -2515, -5177, -8233, -8292, -3955, -3479, -3114, -9582, -9763, -8688, -7656, -4185, -3319, -6401, -2686, 1288, 2701, 4617, 3081, -809, -3640, -4412, -1077, 1294, 2656, 310, -8319, -8836, -3929, -963, -7956, -14320, -12458, -7461, -3590, -1224, 1053, 4889, 11038, 8012, 4082, -1788, -1199, 5227]
14343E227k113J1844J2401J538q33l394n125q924j0492n845o675L472K798L209
14329b912K209J63k230J729k26n690L187N079q7J246n523p898M948M918k15n824
14313g126j131N81L339n670m126k067P43P0l054k235O889O997Q923L026N584J534
14297A2277l582l984m686K898l306k909M940J301m008P27k878o857n390M281O462
14282d714p23r86R36L901O190j537l911Q99M88m953K527N861K441K900j684K66
14266G901O850j997n293k483j1m272m424M396N086P44n813j615L521m54o406m011
14250h281N866O072R03J97N390L966m505l089k10j634m540j0185K095O414j770
14235c311j060L461K071l106k872J171N360K139K086j670p69K665m138n584L636
$$ y = [5227, 3114, 14958, 27359, 28897, 28064, 24670, 19545, 10621, 129, -5716, -12391, -8919, -6121, -2912, -703, -540, -2770, -1041, -1267, -6957, -3770, 1309, 1222, 2468, -3055, -10953, -6005, -1087, -1302, -7126, -8257, -7676, -4337, -10007, -14133, -16200, -15457, -15387, -18441, -20676, -13787, -6790, 2133, 5159, 10743, 12277, 8695, 4711, 25, 2923, -383, -3292, 1648, 2949, -1059, -332, -3210, -10067, -15457, -11176, -4714, -5437, -6423, -5487, -1586, 4604, 3067, -844, 55, 543, -4410, -1883, 3978, 6419, 9319, 7635, 7901, 14751, 12754, 7461, 4978, 4967, 695, -3729, 667, 5753, 6497, 684, -931, 2590, 2136, -4270, -8281, -2415, 3657, 4560, 4757, 10147, 14113, 9608, 6519, 6309, 4675, 135, -10050, -7955, -1541, -3311, -4371, -910, 1161, -1945, -4817, -3646, 1714, 3853, 5939, 4269, 3500, 6165, 2027, -3557, 79]
14220G9O85o47m083m096M412L395J096m32m86k207K247J560j275k220M217R06
14204C151L846L436j1066j0211K889Q57p91L22k336n25k80P466M817l149j438
14189c012k053o77N398N695o671K776O319J193J153k559j771K408m280M25j724
14174B620j355J496m029J355q027p79k325M437P378L705J179j0607j169M296O436
14159D611K56k876K851l69m590K407N89L950J863m245l518k110M298J876r497
14144d504m686k169N432o53o493J400Q275M407M312J560K14M40j825p974q891
14129a1155j762J4404J690o168j648K21L919L473O25l320P670M027j814p567l156
14114e61k519J0008M190j3286k517P91M65m888k349K372L813l31L183K819m192
$$ y = [79, 764, 117, -3966, -8062, -3650, -255, 841, 409, -77, -2284, -37, 1523, 248, -1972, 2245, 3151, 6997, 10433, -633, -10844, -7955, -7098, -7889, -7567, -9903, -10428, -10708, -3242, 1575, -1574, -3012, -5065, -5742, -344, 5351, -1320, 1456, 7775, 8968, 10121, 7562, 5791, 8199, 3919, 4344, 2620, 1265, 2761, -1268, 87, -7940, -8719, -11044, -6607, 771, 4476, 5655, -4952, -6121, -1825, 4611, 4867, 1991, 4842, 4473, -117, 2290, 2879, 6829, 8692, 4447, 929, -1181, 3117, 4993, -4504, -9190, -11359, -5927, -6580, -13073, -11673, -3398, 1009, 5321, 6881, 7095, 7535, 5710, -2264, -11155, -12917, 1487, 3177, -2991, -4639, -4418, -499, 2974, 3599, 279, 7949, 11976, 10162, 2595, -561, -3080, 6928, 11118, -2168, -4685, -3894, -3429, -8317, -10666, -8294, -4481, -4812, -1629, 1190, -3002]
14099c002j988j047J267n523J468K778L493j271j251o849J246Q540K904k106p57
14084b098n800L749Q915m531k311p07N972O571j731r621N2L799L896J73P93r158
14068b037j126M245k058k096l477L043K29J176K163r649k552Q990k033m656n681
14053a5519O842M455J809R69L647L405L597K702o615q051Q76r32O244O324L842
14038A3595m747n340j834k141n26l297M24J497l680N67p589j290N052q79K395
14023g793N054M791o36j186J881R045N658m433o246Q84q33l552j789O6q574k592
14007a0255j047j927P380O877K750j047l912l430O242P240r75J87j0676o402K540
13992f455O080J961l584J578O314L397J1306J4840J2388J5375J0556L96m166j3499
$$ y = [-3002, -4990, -6037, -4770, -10293, -8825, -6047, -2554, -3825, -5076, -11925, -10679, -2139, 765, -1341, -2098, -7898, -4149, 4766, 235, -2076, -2783, 3189, 9760, 8029, -1592, -1540, 2259, 6155, 6328, 7121, -2037, -3163, 1082, -976, -3072, -6549, -3506, -3277, -2101, 62, -9587, -12139, -3149, -5182, -9838, -15519, -8677, -4222, -2413, -1444, 2203, 5608, 9205, 11907, 5292, -2759, -1883, -2815, 3429, 9753, 13595, 8848, 3508, 1674, -467, -993, -4290, -3866, -2369, -6049, -5482, -13071, -14361, -9309, -10188, -7793, -2739, 2052, 1416, 230, 2111, 11156, 16814, 12381, 6135, 7019, 6186, 2634, 845, 911, -7663, -10255, -11302, -13229, -5849, 1028, 3778, 2731, -1181, -4611, 1631, 8871, 7896, 8083, -2593, -8995, -6455, -375, 1586, -1998, -420, 5894, 9291, 20597, 35437, 47825, 63200, 73756, 74152, 69986, 56487]
13978E6487j7393j3613m970o642L835j250n101m700J006l277o323p659J041O523
13964b036K195R185o59j133j696K957l337m932L913N094K304N041m413j958K593
13949A3118j75m139l627l664j537k476o033l341L035N712J382M91K444n007N83
13934c234l149k504k33j195R010K364n773M084q67k750m422j334N821L564j297
13919a915Q187K388K003K388m386J8o9j559K271J265l302Q36k031m832o467k414
13903g619N675k558L77K932Q099k43k670j567o600n12L035l759J052J669j894
13888d583N782j964P70r36k746m867o43m47l307K760M687J343N226q1m340l524
13872f870N250P056n019o341K051J7073L190m312j360j450m538O78n10o151J738
$$ y = [56487, 39094, 25481, 20511, 13869, 17704, 16454, 11353, 6653, 7659, 4382, -1941, -9600, -8559, -2036, 159, 9344, 8685, 7552, 5856, 8813, 5476, 544, 4457, 9551, 11855, 16896, 12483, 10525, 13118, 12943, 8804, 5177, 1513, -24, -2500, -8533, -11874, -8839, -3127, -1745, -1254, 1190, -3817, -3234, -6383, -8887, -9120, -10315, -1305, 1059, -4714, -630, -1497, -4247, -8669, -10003, -4182, -618, -1915, 6272, 8660, 10663, 13051, 8665, 8683, 8614, 7055, 9326, 10591, 7289, 8125, 6094, 1262, -5205, -7619, -1944, -4502, -4125, -1193, 6906, 6663, 3993, 2426, -4174, -4686, -1651, -5410, -4358, -2689, -4583, 1199, -765, 5, -931, -3677, -8544, -9187, -9634, -12941, -10181, -5494, -4151, 1075, 994, -3346, -6870, -1620, 5436, 417, -5924, -3873, 13200, 16390, 12078, 10718, 9268, 4730, 5408, 4898, -1253, 485]
13857D85l718q990l072J937Q319k571J606J2423J637k776q751n101r08K565k336
13842i251l902l969J782O263L205j74N09R883r08k469K719k520k247K644O35J106
13826C306K978j1081j3000M080L958L327k06p575m931P797N801K458K868J050
13812H30L092j3276k327J3327P105j377m045k728O909L814n265j509j564r298
13798f312N011O362j430m932k536M980O43r239j949M758R80j473m314o589M81
13783a5559Q073N708L529k684j999q64m400J486P596j706k334l970k492r11M284
13768f243q39K309L95N997k941J511o70j253K876L901q376o247n22l64J393J0829
13752A756P000N26L848q01o72J379j0717p807l26M195N1j601k127K238L235k461
$$ y = [485, -3233, -12223, -15295, -13358, -5039, -7610, -6004, 6419, 8056, 5280, -3471, -8572, -9480, -6915, -9251, -13153, -17122, -15340, -9077, -5872, -6046, -5537, 4346, 3438, 969, 3688, 1168, -1079, 1565, 2200, 3306, 6284, -4797, -17797, -13717, -9759, -6432, -6638, -14213, -19144, -11347, -5546, -3088, -220, 830, 3922, -9354, -11681, 1646, 8751, 7374, 3329, 601, 7510, 11324, 6059, 4550, 2986, -6312, -1301, 5061, 3631, -1301, -3837, 1143, 1786, -7453, -9402, -4644, -3664, -5137, -9451, -16040, -15559, -7486, -1778, 1751, -933, -2932, -3796, -8196, -6710, 886, -820, -3154, -7124, -9616, -10527, -6243, -7082, -4773, -4378, 1619, -1322, 189, -481, -1734, 1142, 5043, -3333, -9580, -10102, -10466, -9073, 1756, 8756, 9282, 13130, 12329, 11657, 13036, 2319, -5488, -5814, -1619, -1568, -3169, -5296, -3058, 177, -2284]
13736b284j505L411L90M968Q28P38m303p311l963k054M201N844P38l590L521K151
13720A780M93K647j166l592q59L290M053M890n913k964j675l724p156l784O154
13705g526Q712J714m021k676o260j143J813k166Q745J2382o097K17K336l053K24
13690C201l574l024n319N130P189j818l107l010N004J664k317j184K352k728o550
13675h091n068J330R119K531o14N878n203k432k86p46K116K797K017j076l893
13660a621P812K219k532J214J86j506k527j189l244Q287P781m831j1793l697j104
13645f545m878M352K213o212j765M159R375j185k180M518j918k606L259m172K538
13630a047Q45K075k346m069L471M160j554l311L219L888m454k046k608K442L262
$$ y = [-2284, -3789, -378, 12, 4980, 5808, 6546, 2243, -5068, -9031, -11085, -6884, -1040, -302, -3892, -371, 1780, 2273, 4920, 3754, 162, -697, 2593, 6646, 11536, 5623, 2659, 984, -2740, -9896, -13680, -7526, 1186, 2900, -1121, -3797, -10057, -11200, -9387, -11553, -2808, 9574, 3477, 3694, 6030, 2977, 3201, -373, -3397, -8716, -3586, 3603, 1785, -1322, -4332, 672, 2336, 19, -1165, 1187, -1541, -8091, -13159, -11829, -2710, -179, -793, 5085, -118, -2550, -2836, -3582, -1466, 1331, 3348, 2272, -1621, 6191, 8410, 5878, 7092, 7278, 5772, 3245, 2056, -1188, 7099, 14880, 10049, -1744, -5441, -6545, -11423, -7071, -4858, -11070, -12835, -8676, 699, -486, -2666, 1852, -66, -2672, 587, -3585, -1047, -202, 1873, -473, -4542, -1071, 3089, 1535, -1776, 1443, 5331, 877, -1169, -3777, -1335, 1927]
13615A927J657k565q31o451k592O583P523K511K544m743n790q523P322P797M044
13600A0413n471n009L138M391K111l221n200o699q050j421K213L973L075k639
13586h396k378n704K421O993M501J05p898n668J331M172M217P495k008q974j928
13571a1719J141o32N415O208l257J593M993L80J78n332j991J320l459j494J157
13556e499q2J61K323Q77n870p49Q141N560K078K027k840m862j657j345m213m807
13540a0757l844p253M570K006N616J0116L780l694m287K191K782J011l092r38
13526a793N065P80L42j007p408o059p960J447O184M320l251j231L046K156k945
13511h314O194j43K480l494j19L566l045q707k728N487P687P13k252k12P607p96
$$ y = [1927, 3584, 1019, 188, -6263, -8855, -2272, 5251, 7762, 10306, 5563, -227, -8750, -1428, 6369, 10413, 4942, -67, 3071, 7462, 9573, 6352, 1152, -5547, -13597, -15018, -12805, -8832, -5757, -8396, -10774, -16478, -14057, -7064, -2563, -2458, -10356, -16024, -14693, -10521, -6304, 1191, -817, -9791, -11719, -10578, -11210, -5795, 413, -2844, -1251, 3742, 4122, 4300, -1032, -3023, -1703, -5162, -6656, -5499, -5581, -5420, -3097, -2220, -8090, -8839, -698, 4862, 6940, 8967, 6127, 1265, -392, -1737, -5950, -10757, -14601, -21854, -17284, -15278, -9662, 454, 4234, 540, -3747, -1556, 1226, 2237, -855, -1793, 3272, 4052, 4394, 3387, -4021, -10080, -18040, -16593, -10409, -6089, -9340, -10571, -7525, -5369, -8314, -2120, -2263, 217, -3277, -3396, 170, -2875, -11582, -14310, -8823, -1136, -423, -2675, -2887, 4720, 3924]
13495C924J258o62k006M562M418k011j775m66r516o584k632N740P600M486J953
13480H289N65J129m84m838r181K711L442N383q265o208J2492L028j60J920K5k151
13464G697J461q303n472l049j658o00K268J129l064j555n297m95O656Q591K524
13449H33j533o185p433N710K088J566j141J990J134K063j083m289L316L232J439
13434A707j136m197r21j060K376j098q439j09o25K658K017K334P617J558K392
13419E074l381j136k050r7N099J56l259n824P984Q372o255o399j633L403J771
13404A825J992l760n76o072k918L599N824m55N583J744n054N17n01m01m410J897
13388a166O14l263k633j595k791L306M038J418M346M879L61p640p601J433N650
$$ y = [3924, 5182, 4520, 2514, 7076, 11494, 9483, 7708, 7242, -2274, -8858, -11490, -5750, 1850, 6336, 8289, 8854, 9983, 9499, 4661, -4520, -1809, 1633, 7016, -1249, -7457, 5035, 8063, 7903, 9823, 9848, 7697, 9158, 855, -4617, -7666, -9324, -9924, -7656, -6527, -9591, -11146, -16443, -16938, -10282, -1691, 833, -700, -6885, -14318, -8608, -6520, -4954, -6095, -4105, -2971, -908, -1991, -6280, -2964, 268, 1707, 571, -3626, -4547, -5607, -3231, -4329, -12768, -12877, -13502, -10844, -8827, -6493, 1124, 2682, 5074, 1693, 557, -1493, -1590, 3509, 3665, 406, -5418, 2566, 10938, 4683, -1716, -3349, 54, 1825, 3817, 57, -519, -6591, -9509, -5910, -86, -541, 5042, 6786, 1732, 2249, 1748, 1347, -3063, -1166, -552, -3815, -6448, -8043, -10834, -7528, -3490, -2072, 2274, 7153, 7514, -126, -7727, -6294, -644]
13373f44M368K361j120q148J155j964n40R58M890K089J068K221m950q24q15k275
13357b170j556L863N725L586j4044l080L269M370J488j137j742j636L568q27o314
13342f637N394J116J544N813l41J615j2225j864P89M875J375Q97m083o33Q349
13327E984P327M014l221o324K491k540l177o952k241J787J016Q57l609m815n667
13312a5070J76K15M569N369M444K156J652l044l647l034N31N166j166k90l927
13297e900j85L928M390k863o69q005M657J89p48K050J780k530k252j00M317M400
13281B459m406n866k031M292P943k296n129n025K57l151K004M598P337n984q211
13266a3209M622P304J35q950n591M12L788N17N540j722J553M670L559n347o726
$$ y = [-644, 3724, 6085, 4965, -3183, -2028, -3992, -4532, -3574, 1316, 3405, 4473, 6694, 1744, 920, 105, -2170, -3726, 137, 5862, 9448, -4596, -7676, -4407, -37, 1451, 314, -1428, -3064, 504, -323, -6637, -1243, -127, 1417, 7230, 6889, 8504, -3721, -5585, -4796, 79, 1454, 2351, -1732, -2365, 5984, 13311, 17325, 14104, 7780, 10271, 7731, 4554, -2398, -4639, -2852, -1836, -979, -4588, -9403, -15070, -14894, -14679, -10110, -4741, -297, 1859, 3511, 467, -3180, -6214, -5683, -517, -1683, -1973, -5900, -6085, -2157, 2233, -630, -1299, -9304, -4647, -4458, -5206, -3156, -1376, -3906, -6158, -6258, -1941, 2459, -1947, -7813, -9844, -5552, 2391, 95, -5034, -10059, -9802, -12953, -10949, -6351, 986, -4998, -13209, -8587, -1283, -1148, -10098, -15689, -15277, -11489, -10972, -5432, -7154, -5601, -931, 2628, -2719, -9445]
13251i445o530Q514K555L900O472J61n694r623M5M82L244K497l790L78Q92M838
13235a104j255k798L658o325k937N188L046N827j101r351p4K354J973M279n943
13220d563m311M384J883L764o83q030O84O750L25l389M239J394k373m096p413
13205a1435J23N433K103K98k350O396Q214k886L783m122o932r99L12l50j196k945
13189f553J990J8K038l490J218P92M502R534o42q684r497J617K019L228l410O25
13173d695J59M430J2778M046q378p068n265J954J555K950L749J664P24J13L873
13158A2589L689M021p384n852n146m945J689j58m65L821m910K335k039j975R72
13143c758K236j660r1r41N403M85L065N874q977p773L320J698M122m891j0688
$$ y = [-9445, -15975, -7461, -4906, -1006, 5466, 5627, -67, -9690, -9645, -9163, -5919, -3422, -7212, -6834, -5942, -1104, -2359, -5157, -1499, -7824, -10761, -5573, -2527, 3300, 2199, -7152, -7226, -4872, -2899, 1380, -4563, -8874, -4490, -2607, 1157, 474, -7556, -6872, -122, 203, -3186, 1053, 2447, 74, -4022, -11435, -11312, -5879, -3776, -3478, -5828, 568, 8782, 5896, 9679, 5557, -1375, -2374, -2062, -2412, -3608, -6553, -4563, -4545, -2507, -5997, -4779, -3987, 515, 10049, 9407, 723, -8774, -7157, -5138, -1910, -5320, -4695, -4536, -106, 12672, 16718, 8340, 1272, -3993, -2039, -484, 2466, 6215, 7879, 8603, 8716, 12589, 16278, 20299, 12915, 7063, 1917, -3028, -1339, -1497, -1962, 1859, -3051, -716, -2755, -4730, -3758, -1522, -3182, -3273, -4214, 1189, 1674, 4739, 10613, 1636, -6137, -2817, -1119, 3003, -1888, -12576]
13128a2576j914K942J578O675J0208j329q077k411R35j01L121n206J507N099l634
13113c183J725Q228l647o744j430J1526P939k432q911O195P577N53L610m283j2095
13098D628k779K29n64q238p791l127M354j362J553J051K514J792N614K482M513
13083D869l399m336N48k423j668k662j482N41k280p766K09P611K931J926o94l504
13067a1579l797J403Q828K185k843n508j814L606J814K399m260M653O092K189
13053C368k868j0599o191L078R123O327p985k186J520K903M908J247o674N74K383
13038a072R06j54J284N387j759o080l124m256k3J732k299O741N573J260n033j1101
13022a2018L842p24j361O772K497j95l072m755L795L236R2l074q74k287N832j866
$$ y = [-12576, -14490, -11548, -9970, -3295, 6913, 5584, -2493, -4904, -3969, -4070, -949, -6155, -4648, 451, -3183, -1458, 6770, 3123, -3621, -5051, 6475, 14414, 11982, 3071, 9266, 16843, 17396, 21006, 16723, 4628, 1849, 2078, 1514, -6724, -14515, -17642, -13288, -14650, -13097, -12046, -9532, -7740, -2126, 356, 4869, 1470, -2866, -2318, -4741, -6409, -9071, -10553, -10012, -12292, -20058, -19849, -12238, -9307, -7381, -8075, -11579, -15376, -13973, -5145, -2960, -5803, -11311, -13125, -9519, -7705, -5306, -9566, -4913, 1179, 3368, 500, -10099, -16290, -13212, -4089, 2238, -5747, -7933, -6413, -3510, 1398, 2645, -4029, -3455, -1072, -166, -320, 964, 6351, 4592, -1488, -4612, -8868, -8891, -7159, -9458, -2717, 2856, 4116, -917, -12018, -8176, -8900, -10261, -3489, -992, -1187, -4259, -9014, -5219, -1983, -1891, -4965, -5839, -8126, -2294, -4160]
13006d160q27K969p29j530m326q692K866P866R778L202j94k178k185r767K431
12991e476J0638J104Q15M639L013n650l683j224k193n311k730N003j37J962K851
12976C621p13l910l911j1554J28J3732N205K972k855l011M487J860l664m171r52
12961b736K230m127p884l455Q274O826L95l196R79J232L318j127q677j983L179
12946f752M863J948l900R99k970J133J97n016J648K227O21m500p86R666j188j789
12930c599L245O239J852l797K648m321j420j966q062k205m71K988M103Q04J215
12915b747l573j775j68j080o099M25P446k318k994O877Q19R35k515n170J701P493
12899b743O383J938L33n024j158l227L907J637r95k801L551m28K115j001j2608
$$ y = [-4160, -4987, -2018, -2747, -4277, -8603, -17295, -14429, -6563, 3215, 6417, 6223, 4045, 1860, -7907, -5476, 5162, 6266, 7081, 11720, 14733, 9083, 5400, 4176, 1983, -3328, -6058, -1055, -1192, 770, 3621, 2908, -1002, -4913, -16467, -16339, -2607, 2598, 5570, 2715, -296, 4191, 6051, 2387, -1784, -2736, -506, -4633, -12517, -15972, -7698, -872, -477, -3673, -2694, -1462, 1856, 729, -7948, -9931, -6752, -1889, 59, -3841, -2842, -5812, -4679, -4482, -9498, -7850, -5623, -5002, -9502, -10288, -622, -1810, -3599, -354, 5885, 7737, 3940, 6588, 2267, 847, -1119, -9181, -11386, -11857, -8869, -4766, -3962, -2747, -6320, -8095, -8263, -9343, -15442, -15017, -7571, -9889, -12883, -6006, -5187, -4252, -6767, -11937, -10236, -2743, 3640, 5578, 5911, 887, -271, -3498, 409, 2046, 1051, -1750, 1801, 1373, 3488, 2487, -10121]
12884a0121l756K902P952K629n22k50n762J265N260L105J820l670k847M383O638
12869I026l078j861n635n135M478K270o870p434j087P59n83M487L510L523m5k299
12853e974l856o70K480Q158j542m678L938J955l75L932J953j565j365k769m829
12838e207J034n132J44k80j070R567J377l00p63j969J53j732m23L435j007l303
12822e476L372m218n079K2M187k96r22P340K586M363k457N54N498L399M37j0041
12806C269j2446n695J315l415k704Q256M528K767n6K850K907r48j91K34J382l14
12790A739m566J301J033M87m375J514N45k332O189J0245J3890R283k522q257q219
12775A5955p299k855k86m637o619p725N94r13l661M477N218J202q923o31J1248
$$ y = [-10121, -13877, -10975, -3023, -394, -916, -1166, -6928, -5663, -403, 2702, 4522, 852, -1995, 2388, 9026, 5948, 4087, -1548, -6683, -2205, 65, -6805, -14239, -15326, -14567, -15150, -10663, -7153, -3630, -3675, -5974, -9830, -10500, -8020, 138, -1404, -6082, -2144, -189, -564, 3368, 5321, 3756, 2391, -378, -5207, -4173, -9305, -9161, -9441, -10511, -944, 433, 133, -630, -2599, -2446, -4178, -4601, -1166, -2173, -5476, -2104, -6322, -11401, -11379, -7192, -7488, -8410, -1070, 1516, 5879, 3422, 3976, 9474, 12873, 13310, 3269, -9177, -14872, -13557, -16972, -19676, -11420, -6892, -4125, -4181, -1331, 1576, 628, 437, 671, 2053, 1739, -2827, -1526, -493, -6, -4381, -2867, -2322, -4654, 1535, 11780, 25670, 34953, 32431, 24174, 15955, 8656, 5801, 5515, 878, -5741, -13466, -12872, -13785, -17446, -12969, -7751, -6549, -15472, -16103, -4855]
12760d855O289m445m716o812L242M68M448L839J277m151l004K697J916Q987L28
12745E508P73O187j2101q481K237L651J005M075j946Q381J756o382m15k767q323
12730f842j888L592j0578k884R957J582l273o180L542R028j378k811q67M30M660
12715c910O558p21o8n062l962K193J096l630n83J215J180R06N505k219M023P446
12699I967n77n284k899j533J865N235L025m171j94q923r052mK784J799M900J1184
12683H122J480l939q202l744k584m048n477P654L0K872J580j535P901O596j0937
12668d231n651r029j406L106R336K848l199r38N02M928l5n595N40N654j476K940
12652a706J739n407j427M991o69k536J873J672L818J279O41l257m185L114J66
$$ y = [-4855, 1434, -3011, -7727, -14539, -11297, -10829, -6381, -2542, -1265, -5416, -8420, -5723, -3807, 5180, 5508, 6281, 12468, 367, -8114, -5877, -2226, -1221, 2854, 908, 9289, 11045, 4663, 4248, 1481, -6842, -8730, -5138, -15716, -18600, -8643, -7061, -10334, -16514, -12972, -3944, -5322, -8133, -9000, -8570, -3910, 2648, 1927, 1859, -3203, -7165, -4972, -3876, -7506, -8089, -6874, -5694, -4788, 717, -1502, 2521, 9967, 9390, 4106, 1207, -326, 1539, 6774, 9799, 5628, 5434, -3489, -12541, -12545, -9761, -7962, -3062, 8122, 9602, 5663, -2539, -6283, -8867, -12915, -18392, -10738, -10708, -7836, -6256, -7791, 110, 6706, -4231, -9882, -18911, -20317, -17211, -7875, -5027, -8226, -9164, -8662, -3734, -3769, -9364, -8824, -3170, -4646, -1706, 33, -5374, -6801, -1810, -2479, -5015, -3142, -1470, 2348, 3627, 4268, 1011, -3174, -60, 106]
12637A06l236k721l402O64l577J498P502N142j856j694J595k193k447k286K682
12622d223O181l770o123l198L498J0471P788l69l626l888l862L533L69q31L748
12607E698J878n120J15p61j792k020p198J630M558k405l670j652r45j842R72M645
12591g909K102M158m207j615Q804J602m774k178L172P865J871m829p283L43N155
12576B277R35j970n191k153j285n852J105K56k675L1K666j700k987O610O781J524
12560a628L4P057J931l084l977J163N74J583O714J359q348o724j452N396O269
12545F867j800p299k047K088J787j2003J338N227J747k521j967Q38Q74l894J236
12530i529j450p84P110O594l806j754J810J932o61N411M256m332l128k373p111
$$ y = [106, -3130, -5851, -9253, -8589, -12166, -10668, -3166, 1976, 120, -1574, 21, -2172, -4619, -6905, -4223, 1958, -1812, -7935, -11133, -7635, 2836, 10624, 10255, 6629, 2741, -1121, 2412, 2781, 1950, 5698, 7576, 2456, 2571, 1810, 18, -2002, -9200, -7570, -3012, -5417, -9087, -10739, -11684, -13526, -12554, -7909, -5807, -1649, -5856, -7471, 1333, 2935, -1839, -4017, -845, 7020, 8891, 4062, -3221, -2878, 2277, 3212, 1242, -3949, -6102, -7387, -13239, -12134, -11878, -14553, -14522, -11856, -13556, -16543, -9933, -3152, -1628, -1594, 5463, 7394, 4310, 333, 1496, 2070, 3653, 10367, 11726, 3378, -3346, -4798, 598, 6867, 5067, -2232, -4279, -2191, -404, -12407, -11069, -5842, -4095, -6616, -8583, -7745, -6871, -10765, -9529, -10979, -11763, -4653, 1941, -1865, -3619, -1809, 123, -538, 4873, 9129, 4797, 1669, -704, -7815]
12515g815P69L857l267p7q4K007N942P81o334p278j787l346L967L581L998j511
12499f597R66k188R428O604M3J309j150q854l8R333N779m535o032K360J498o870
12483A056l286m529n329J790O373r23j979M278P697q28j549l197J950m768K866
12468c78l10l091j74j004P527m54Q88O665K861n318M030q81q52j330q066K195
12452B308O619o775o608K30L204J358k578J715Q362L086l667K601l760J044o190
12437I49j04L170K052Q66l715l014q601L750L515O249M255O469m064o764r305
12422d292j941l327k711r51M223N300M567p371L256J0061n112l342K679j700l898
12407d559p81j514P12K921K4J59L563J0751J300o250k271L063K559O01O524o741
$$ y = [-7815, -7046, -3189, -6456, -6533, -6617, -4610, 1332, 2113, -4221, -11499, -13286, -16632, -12665, -9084, -5086, -6597, -5631, -7819, 1609, 8213, 8256, 9565, 8415, -439, -477, 8856, 14635, 10100, 4068, 6428, 7926, 1056, -2230, -6759, -12088, -10298, -3925, -4848, -6827, -2549, 5148, 4320, 2771, -426, 1524, -3244, -378, -688, -3779, -3953, -4957, 2570, 2116, 3004, 9669, 12530, 7212, 11242, 10361, 9509, 8179, 113, 2308, 8927, 2152, -4456, -4226, -1022, 336, -2242, -527, 7835, 10921, 7254, 9855, 6095, 7139, 949, 845, 4015, 6067, 6933, 3218, 204, -8397, -4647, -1132, 5117, 9372, 15841, 11777, 5013, -4292, -6233, -9560, -12271, -13222, -8999, -3699, 868, -6503, -3247, 6814, 1702, -1640, 1039, -661, -4559, -5340, -6854, -6142, -3221, -3197, -3038, 525, 11276, 12576, 6326, 4055, 7118, 9677, 10278, 16802, 10061]
12391A0061q408p84N04O891N106r75j813J020k096L255O357n395M57l066n470
12376E644p703j661M94l370J138N366Q28J50k511L621K475r95L430l028N93P98
12360E269o857L510J542k228K695N675R0n661o493l149o058L560Q010K02o94k838
12344c425M915O500r469o584o397j627J357N355P492J0646N340J319k051l969
12330I402p419p510O034n756k790j723J316J203K645N626J370l821k240J107M749
12315B193J729K872p113j0634L373P718j137p81L691P587M453k454j873m363j1454
12300f193P17M469Q64k686M454L923K3K20l404m673K38L165N750N46o313O81j969
12283a88m055p399l453m240p2K303Q175M485j21n128m578L426N953Q336j146M098
$$ y = [10061, 1653, 869, 1373, 8264, 13370, 12395, 10582, 11602, 9506, 12761, 19118, 13723, 14180, 11114, 5644, -2059, -3720, -3226, -6596, -5458, -92, 736, 886, -1625, 1996, 4471, 3476, 6906, 3878, 4471, 5269, -1588, 1922, 3464, 1236, 3931, 9606, 9696, 4035, -2458, -5607, -11665, -8105, -95, 107, -587, -3425, 1490, 7990, -1479, -8063, -14460, -16087, -14730, -9375, -1883, 8763, 14103, 15422, 13371, 9402, 1983, -5527, 507, -5249, -8039, -9762, -8446, -7243, -4598, 1028, 2398, -1423, -3663, -2556, 2193, 3922, 6794, -319, -10953, -7580, 138, -999, -1780, 1911, 9498, 13951, 11497, 9624, 5261, -6193, -5476, -1007, -143, -2829, 1625, 5548, 5571, 5791, 2387, -2286, -2048, 1117, 6867, 7413, 1100, 1781, -188, -4243, -11642, -15095, -19335, -19407, -17104, -8929, -4444, -4565, -9693, -14271, -10845, -4892, 3444, 2298, 6396]
12267F396P055K624p803n769r57l812r9o304m78j417P2K064J987M151M415J362
12251C487j890l54m917L249N965m109j377O358n165j709O136q29n7k695O44Q12
12235C549k713k625j158Q26J111j129k020k636j166l37k876j05K444Q14L508n60
12219e073M321l734m435J890N759M246r114k082O990j536J960j673L776L499n024
12204b30n204K839J687P440M503m539n248o040j280N118O456k713k255N277L330
12189I141k93L211l214J642K044l91r33k836o205q63L655K895Q821N602r776o438
12173F062j687j637P645k6j059k117j682J225k677l965o57J760J610L600M37J876
12157H708m697l819L702J654p399K74L032m762J227j996l560l000M408P023K57
$$ y = [6396, 13451, 16075, 8272, 2503, 1546, -2266, -2365, -8669, -9147, -10564, -10492, -8428, -6441, -2290, 2125, 3487, 1597, 1243, -3674, -425, 5540, 1431, 54, 6412, 1247, -462, 5674, 4845, 4788, 2093, 2737, 3549, 836, -1789, -2947, -2121, -1010, -2139, -4159, -6795, -7961, -8298, -11174, -11279, -8835, -8021, -4513, -5073, -752, -4486, -8921, -7031, -1272, 2974, -6140, -8222, -1232, -2768, -808, -2481, 1295, 4794, -230, -5434, -2595, -908, 6532, 11035, 6496, 1248, -4792, -6072, -954, 5502, 2789, 534, 5811, 9141, 8848, 12059, 8845, 10487, 12531, 12140, 11207, 8371, 2166, 1303, 4958, 7853, 16674, 22276, 12500, 6062, 4375, 2738, 10383, 10357, 9298, 7181, 5499, 6724, 4047, 82, -575, 1185, 2795, 6395, 6832, 8708, 4011, 192, 3894, 5548, -1851, -1577, 1455, -3307, -2080, -4076, -7636, -10636, -6228, 795, 1052]
12142A052n447m881J525O032J795R46q86m813k773Q558M755M628N86L642l724
12127A0995p725l558n1l904l047m397j952J282N751J2075N144O44m379r394m096
12112f612K002L182N746L587K517r563l553K582m515N03N65K20L276K492j999
12097D30K330R344l982q83l840N3l274j221N56n525Q03N104m037m948j0440M82
12081a9048J4401P732j53L41R27j93p01J060j051m228N3l483n292J97K260j982
12065i160J003O243L983O5p75K43K022J3248O403n136J60N476P822o518q894j16
12049A6069o289n755j62K968j910m571l396J115k038J131N112O658l770l164N462
12034G460L372K358j61n991p413J428L466M217j012r715l258M594N52M641L234
$$ y = [1052, -4395, -9276, -7751, -1719, 76, 1022, 136, -4677, -7450, 1108, 5863, 10491, 11077, 14719, 10995, 3270, -288, -339, -4243, -7290, -11687, -13639, -12357, -6606, 5469, 10613, 11257, 6878, -2516, -6612, -4610, -1428, 4318, 7905, 10422, 859, -2694, -112, -4627, -4124, -3559, -3339, -63, 2429, 430, 2760, 12104, 8122, 7239, 3399, 3452, 178, -1043, -487, -6012, -5209, -105, -4142, -9090, -19530, -19048, -4647, 3085, 2932, 3273, 4200, 4007, 3306, 4366, 3315, -913, -860, -4343, -9635, -9438, -7178, -9160, -8157, -1914, 2069, 2134, 1359, 1602, 3624, 16872, 23275, 18139, 18299, 23775, 31597, 25079, 16185, 16069, 9780, 4025, 3863, 6831, 4921, 350, -3046, -1931, -3969, -2838, 2274, 8932, 5162, 1998, 7460, 10832, 13190, 13029, 7038, -375, 1053, 4519, 8736, 7724, -1991, -5249, -655, -103, 4538, 7772]
12019G772J400n644M628J430k405O995L833m987m634p647o673O084K773K180m147
12004I58j392k6K971P90J63m825l509l344O417J588K095j655N004M232K457o87
11988A1237m7o698l864k613o77j162N626M971p438l486J229J919J39k279N166
11973B023n76j278l49Q91j977P09P217k537l449K934q9j478o35m898K320R37L639
11956C404M044m058n791k30R90P1L868l565l180J316M550M012J921K207o372L569
11940F756R25k151j296o069o728l080M902M748O078j943m759m920R73K896R984
11925F316J015l235L48mk714k72R20j967L767L088L544l065n890P530N410L201
11909A7992O1J205o216p528n512j441N760J880l295j993J039J084m150l283Q72
$$ y = [7772, 9172, 3528, 8156, 9586, 7181, 14176, 18009, 13022, 8388, 741, -5932, 152, 2925, 5105, 958, -434, -460, 2511, 3301, 3464, -1361, -4870, -8214, -1797, -209, 1886, 231, 5235, 9467, 11924, 11237, 11190, 4492, 628, -1985, -2662, -3824, 1802, 6773, -665, -4151, -2922, -1003, -864, -3143, 2023, 1447, 169, -180, 711, -1266, -557, 6660, 4123, 674, 3608, 3519, 2041, 1406, -3492, -1172, -235, 3404, 7448, 3390, -2401, -2631, -1641, -1570, 2298, -1267, -4447, -3131, 1419, 5431, 7352, 9559, 3187, 6756, 7681, 5530, 4234, -1835, -8563, -11643, -6741, -1993, 4085, 2142, -2617, -7537, -6564, -3668, 6316, 7331, 4096, 4444, 4440, 1726, 1454, 2374, 407, 4174, 7262, 10806, 7741, 1851, 9381, 14791, 17992, 18053, 19258, 13042, 5514, 2, -1439, 4321, 6201, 2906, 913, 1952, 3036, -1114, -4397, -3525]
11894c525o23L697Q070m23J029J154k250N195M185m058j674m40j767l676P952
11879A2846M61j676J030K260K535K328m620j533O07L862q817j1503L675P171j519
11864G107p041M15O416l13l447J78M496q96p533n23J913j104n291N133O931l262
11848C179o940J978l25N798Q515M03m112l777L606l894K896N036n425q990N13
11833a539L302O072L817j45l537K138N201k960l984N846L318o366k166j820K734
11818I911j25l108k372m669j539L432M936l750m95L470m178j144O72N857N758
11803A2656L124N749p065o641M495M085l242q532m942r03N131K57J895N226J590
11788A2883Q5p680R99R19k961r5l795K267m473K752J0665l521o616J376k587l024
$$ y = [-3525, -4148, -451, 7619, 7196, 8225, 9379, 7129, 12324, 16509, 12451, 10777, 10337, 8570, 4894, 12846, 13307, 11631, 12661, 14921, 17456, 19784, 15164, 13631, 14238, 18100, 9283, -2220, 1455, 8626, 7107, 66, 481, 6897, 6584, 3137, 3315, 7811, 6915, -618, -1141, 772, -332, -5623, -490, 6441, 3179, -3761, -1783, -2108, 3690, 12205, 12608, 8496, 4719, 8325, 4431, 7327, 12363, 6938, -2052, -1539, 1763, 7835, 11652, 11507, 7970, 10108, 15309, 12349, 8365, 14211, 17529, 11163, 8997, 7177, 9911, 9786, 6678, 4306, -363, -1902, 1530, 6466, 2716, 2221, 5691, 1513, 369, 1041, 6898, 12656, 15780, 21529, 14464, 7823, 12318, 16403, 13161, 4629, -313, -1216, 3915, 4172, 6067, 11293, 12883, 12968, 5288, 6287, 7206, 4245, 4150, 355, 2622, -1851, 901, 11566, 8045, 1429, 2805, 218, -2806]
11772b806J1061P971J708l457j0024k329M700J785L632P319O003J343k197n252
11758A9457o747k715j584o945k258L129J633P188r88J526m80j0630k203m48N98
11743a467M977L953k2K239J419j273K356J094p29n341L269N333K246m911j947
11728A1196j225O09J746L970J667pk99k915n390o494j195J303M928K660n368K285
11712G471K726J750J583K876K241j24P70m648K441L769n462LM265j534J024P719
11696B6870N64m627j315p086j1195j118N556M49J058Q097o164j331K26n305o349
11681a670l231P401J0282L055j810l565K646J2229K665j388o105l730l164o091
11667G524Q657Q101k305p754j354j319m51M969Q513M125J262QM764K078l57m695
$$ y = [-2806, 8255, 16226, 17934, 14477, 4453, 2124, 6824, 8609, 12241, 19560, 25563, 26906, 24709, 19457, 12710, 9995, 8411, 1466, -792, 2337, 3970, 11158, 10170, 11696, 11216, 586, -1617, -2065, -1467, 3510, 7463, 7441, 9680, 11099, 9826, 12182, 13276, 12547, 7206, 10475, 15808, 18054, 13143, 11196, 9971, 10580, 12326, 16296, 17963, 17956, 17657, 14742, 9352, 2858, 1663, 2966, 7894, 10554, 5186, 7471, 10197, 11947, 13530, 16406, 18647, 18523, 19293, 14645, 17086, 20855, 15393, 15396, 19661, 18127, 19151, 26870, 27434, 22807, 21492, 14406, 3211, 2093, 7649, 8098, 9156, 17253, 11089, 9758, 9984, 4679, -1670, -4901, 2500, 12782, 15837, 14027, 10462, 13108, 25337, 28002, 26614, 20509, 16779, 13615, 7524, 16181, 24282, 21977, 14223, 12869, 11550, 11099, 16068, 24581, 28706, 29968, 29976, 34740, 36818, 36461, 31766]
11651C1766k608L711j43r138n05J2177Q821l859j27Q080O444M913M101J0995O589
11636H1217Q892Q909M03J0654P581J8060J7429J5605K2647K4969L0765L9413N7057
11623C43601Q6854J13547J47372K10893L09475M41216N71497N82266L45126p8186
11613C073661m40381n61241m87470l79671k72451j95763j41844j01473p0341n7199
11603C65827m1052l7330k9900l2358l0294k2546k2733j7281j1867j2639j2470
11592I5357n299m984n060m590j761l151j343m766l505N723k210K808K051l105
11578F6165m477N68J574k518K00j129j0740n570M929k424m387n911n282j874j555
11563B7569j834J482K765m979r89M118J228M263J418N136o384R96K019m914p188
$$ y = [31766, 29158, 32869, 32726, 23588, 23083, 35260, 44081, 40222, 40095, 48175, 54619, 59532, 63633, 74628, 81217, 90109, 99018, 99421, 110075, 117656, 135716, 153145, 168750, 191397, 216366, 247131, 286544, 343601, 430455, 544002, 691374, 902267, 1211742, 1652958, 2224455, 2806721, 3151847, 3073661, 2633280, 2072039, 1584569, 1204898, 932447, 736684, 594840, 493367, 423026, 365827, 324775, 287445, 257545, 225187, 194893, 172347, 149614, 132333, 120466, 107827, 95357, 90058, 85074, 80014, 75424, 73663, 70512, 69169, 64403, 60898, 66621, 64411, 67219, 69270, 66165, 61688, 62256, 63830, 61312, 61512, 60383, 49643, 44073, 49002, 46578, 42191, 36280, 30998, 29124, 27569, 25735, 27217, 29982, 25003, 24014, 28132, 29360, 33623, 35041, 40177, 33793, 34789, 36808, 31894, 24706]
11548B4706k872P32Q685K141l449m785O40J097l784k789M443J1677r39m116j384
11533C0003m995M088j77m480k608n73M489K802l002o517J0196L709j95L448M486
11518D0674Q050k014m361J742L538j658m277j453m152L925P863j442p823J829
11504D0441L294k527P699J2494k158K409j05k547J0015L963K721O932Q502M485
11490I5618J2115J3164J5455J9317J0498N421J6410L1248L1960L4372M3394O4160
11478C93132O9717R1716J29126J81292K67573L83975N14092N86243M57455P8466
11468C152787l43064n50940n40131m32342l11860k17476j46983j00351q1124o3009
11458C65507n2959m6779l2040l3391k6906k2862k2956j3607l436o376n649o803
$$ y = [24706, 21834, 22566, 31251, 33392, 29943, 25158, 25798, 26895, 23111, 20322, 24765, 36442, 35503, 31387, 30003, 25008, 29096, 28919, 24439, 21831, 21258, 25747, 28549, 25547, 19030, 29226, 32935, 32740, 36188, 40674, 48724, 46710, 42349, 44091, 47629, 45971, 41694, 40241, 36089, 40014, 47877, 46435, 38612, 40441, 43735, 41208, 48907, 61401, 59243, 61652, 61547, 59000, 69015, 72978, 75699, 82631, 91133, 95618, 107733, 120897, 136352, 155669, 166167, 171588, 187998, 219246, 251206, 285578, 328972, 393132, 462849, 554565, 683691, 864983, 1132556, 1516531, 2030623, 2616866, 3074321, 3152787, 2809723, 2258783, 1718652, 1286310, 974450, 756974, 609991, 509640, 428516, 365507, 312548, 265769, 233729, 200338, 173432, 150570, 127614, 114007, 110571, 104195, 98546, 91743]
11446I1743m580m469j0812m700j0451l318m65P51j747n573j770J637o692o266
11432C3288k713j041Q143J211q373l766J315j587M313M831P02o732n144k32m372
11417A9843L033L412m422p856j882L353l591j170n148KN956O042O020j552j64
11402B1876l723l997L215J0245J822k307M530J8098K2137K037j2856j1065j4386
11389C5626n736k697l405l281J947j375n422L375k212J131P705L117m537j110
11375B3126N415J872l675m181j607K076N043n78j546l179o603o358N04L102Q685
11360B2096J772j825L470N365o704m498n237n910P025k027l326K468J972k75K049
11345A6415k56K693Q60p016L849J035J798J381k962J51L677n000r5K668l075j980
$$ y = [91743, 87163, 82694, 71882, 67182, 56731, 53413, 52948, 53699, 51952, 46379, 44609, 46246, 39554, 33288, 30575, 29534, 37677, 38888, 30515, 26749, 28064, 26477, 30790, 35621, 36323, 29591, 24447, 24215, 19843, 22876, 26288, 21866, 14010, 12128, 15481, 11890, 10720, 5572, 5574, 11530, 17572, 23592, 22040, 21876, 18153, 14156, 17371, 27616, 29438, 27131, 31661, 49759, 71896, 73933, 61077, 50012, 35626, 29890, 27193, 23788, 20507, 22454, 21079, 15657, 19032, 16820, 17951, 25656, 28773, 24236, 23126, 28541, 30413, 26738, 22557, 20950, 23026, 28069, 27491, 25945, 22766, 16163, 9805, 10309, 13411, 22096, 23868, 22043, 25513, 30878, 24174, 19676, 14439, 8529, 15554, 13527, 10201, 12669, 14641, 14366, 16415, 16159, 18852, 19712, 12696, 16545, 17580, 19378, 20759, 17797, 17948, 21625, 16625, 16530, 19198, 16123, 14143]
11329A4143P967O465M43q650o389k265n04M84J427J853n870J375J189n729k410
11314C529j610M639o96L086N436l67p33J300J076J890n3k360N904M85J548J57
11298B3231n343p325l775O753O410K128l576m095L569K659k913J740M729l056
11284B1136K037k999j533L267J675K948M755K967m723o85J5n247j821L632l682
11269B1742o940l43L947N243L140K570J400l963j72J791L53P77K729o859L782
11254B9197k68k353j349l999k456k350k722L776L284N046N252K675J404J516K422
11239C9075n694r546n064O327J0334K210J940j055n653J938l928j786K626O734
11225C8458J880o772k566j654m900l93l123N045O373n77O179p56l672n862k290
$$ y = [14143, 22110, 28575, 29018, 20368, 13979, 11714, 11210, 11694, 13121, 14974, 9104, 10479, 11668, 5939, 3529, 1919, 6558, 5862, 8948, 14384, 14017, 13284, 14584, 15660, 17550, 17497, 15137, 21041, 21526, 23074, 23231, 17888, 10563, 6788, 13541, 19951, 22079, 18503, 14408, 17977, 20636, 17723, 19463, 24192, 21136, 23173, 20174, 18641, 21908, 23583, 26531, 31286, 34253, 29530, 28845, 28860, 23613, 21792, 25424, 21742, 14802, 14459, 18406, 23649, 26789, 29359, 30759, 26796, 26624, 28415, 28768, 29545, 32274, 25415, 29197, 28929, 26576, 25227, 21228, 18772, 16422, 13700, 17476, 20760, 25806, 31058, 33733, 35137, 36653, 39075, 33381, 23835, 18771, 25098, 35432, 37642, 39582, 38527, 32874, 34812, 30884, 29098, 31724, 38458, 40338, 33566, 31000, 29346, 24446, 24053, 20930, 25975, 32348, 31771, 37950, 37194, 33522, 27660, 25370]
11210B5370k191o439R72j371j750M020k831J042M926n264r47N158r2N057q20j965
11194B2875m37M65p308K493J686o13M918j880L181L574o53k467L16N37j889m488
11178B0310N4M348O201O598L87n181o744J961M681J064m680N406M322k720J895
11163C7902n191l990l737p663q078K489O674K439o744o978Q385Q618N136M139
11149C3401l268o696l10M447J614o342k857p17K336L269l57k139j469k921K385
11134B0376N677P26n60j641M49Q120j143n524N221N981j744n649n236l948O417
11119B7522P924R14n979p34K817o6o536q624k091N133J6376R268K473n06p492
11104D0399J108K541j189m349m011j877L866l693n608R754L222o500J626O107
$$ y = [25370, 23179, 16740, 17712, 16341, 14591, 18611, 15780, 16822, 21748, 16484, 15537, 20695, 20603, 25660, 24840, 22875, 22438, 22903, 15595, 18088, 19774, 19161, 24079, 22199, 25380, 28954, 28301, 25834, 26150, 26687, 24798, 20310, 20364, 24712, 30913, 37511, 37898, 32717, 25973, 27934, 32615, 33679, 28999, 34405, 38727, 36007, 37902, 32711, 28721, 24984, 17321, 9243, 11732, 18406, 20845, 14101, 7123, 15508, 24126, 29262, 33401, 30133, 23437, 23127, 27574, 29188, 22846, 19989, 19272, 21608, 24877, 24520, 22381, 20912, 17991, 20376, 26053, 26779, 26219, 24578, 25027, 33147, 32004, 26480, 31701, 37682, 35938, 30289, 25053, 21105, 27522, 35446, 36360, 30381, 29647, 32464, 32398, 25862, 17238, 15147, 20280, 36656, 45924, 48397, 47891, 40399, 41507, 44048, 42859, 38510, 34499, 32622, 36488, 32795, 27187, 36941, 40163, 33663, 35289, 41396]
11090D1396M833N373m572j1485j1626l144k578J1384J0634O063o41p452n243K189
11076C5131M802l780j148L832k8L652J026k886r732o778M720p82r324l751O038
11061B0992J3605P810r327n783K447k226l484j900J3R7Q041L249l262M735L880
11046C8887n703R88L509P91M169k971p787m142J076R979M033P55J885k435n365
11031C7669n101p552l795M798r70J0561J4112K739n07j91k777m529m17k27l116
11016D0697q891j200K71M152k632p851j1583J195L831N460o13Q164N556K141o605
11001C2092r25M200l94R467L915J184k594o35m962k690l41L042q41j755K734K829
10985D4326N230L063p98J153J45J581q53j833N06N049k618n532r861l493K282
$$ y = [41396, 46229, 51602, 47030, 35545, 23919, 20775, 18197, 29581, 40215, 46278, 45637, 38185, 32942, 35131, 39933, 36153, 35005, 38837, 38809, 42461, 43487, 40601, 30869, 24091, 28811, 28029, 18705, 14954, 20992, 34597, 42407, 33080, 27297, 29744, 27518, 24034, 22134, 22147, 22244, 30285, 33534, 30272, 35007, 38887, 33184, 34172, 37681, 38472, 42641, 39670, 31883, 27741, 28817, 38796, 42829, 43584, 45469, 43034, 37669, 32568, 25016, 21221, 26019, 25049, 35610, 49722, 52461, 51954, 51763, 48986, 44457, 44040, 43813, 40697, 31806, 30606, 30877, 35029, 32397, 24546, 12963, 14158, 17989, 23449, 22836, 31000, 36556, 38697, 32092, 31167, 35367, 34973, 44440, 48355, 49539, 46945, 46310, 41348, 38658, 38317, 41359, 40518, 38763, 41497, 44326, 49556, 52619, 51821, 52974, 53119, 54700, 53847, 52014, 52520, 57569, 54951, 49419, 39558, 36065, 38347]
10970C8347N452O861R116L241o294n005l49J221k636o881M077j797k019M387j0861
10955C6860n82P154N177R799K716l800p50m983k050j031j1001j1497j1214k4366
10941i568j6155j0279o870q415K359J065M213L065P402J2640J5089J2380Q203
10928A5129L744P389J0081O867Q463P006Q76J144n09j026N879N931m440o985p439
10913E2110r557k60K963k741j497M012L364O131J0528O81J952J1887J4848J0534
10899A04955K396M848R002J6247J9661R534L602J3726K1172J5667K3501M6790
10887B91101O2769Q8155J25767J76485K02175K23064K39090J99815J58017R0335
10877A856773q273r4275j39777k00227k30584k24202k04372j68301j31444r9394
$$ y = [38347, 43799, 50660, 59776, 63017, 56723, 51718, 51369, 52590, 49954, 43073, 47150, 45353, 43334, 47721, 36860, 36278, 43432, 48609, 58408, 61124, 57324, 56574, 51591, 49541, 48510, 37509, 26012, 14798, -9568, -25723, -36002, -42872, -51287, -48928, -47863, -43650, -40585, -33183, -20543, -5454, 6926, 15129, 18873, 26262, 36343, 43210, 51673, 58679, 59555, 60699, 60190, 59164, 65043, 70974, 66534, 59549, 52110, 42553, 42293, 45256, 42515, 41018, 45030, 48394, 54525, 65053, 65734, 67686, 79573, 94421, 104955, 107351, 112199, 121201, 137448, 157109, 166643, 170245, 183971, 205143, 220810, 244311, 291101, 353870, 442025, 567792, 744277, 946452, 1169516, 1408606, 1608421, 1766438, 1856773, 1848500, 1754225, 1614448, 1414221, 1183637, 959435, 755063, 586762, 455318, 355924]
10867C55924o7632m3602l3436j9049q772j3050p962k092M956j110l942J667N966
10854A67866j0981j9623j1296r410j2699j6678o201J77l262k913Q548L317j849
10841H4996m563K39K491l215l396R63O864K435k543q310m985N759O103O242p579
10826H1501p974K649L30r87q436j0740l874K266N58m36q04j0488k649L609K380
10811D6905O759Q344R74j3037j8149o579r979j8299j4809j1938j4094o865m720
10798e5487m820j4232p078Q443J609m51l153j233O832O518J6768P578j767k660
10784d3133n26M47k270j3004o783J3012J4606J5754K4595K6775K6328K6740J3972
10771I6513R326K0328J7475O910M885J05K832J1689J1258Q796M245J418L644P522
$$ y = [355924, 288292, 244690, 211254, 192205, 183433, 170383, 162421, 160329, 165285, 164175, 160233, 161900, 167866, 156885, 137262, 125966, 116556, 103857, 87179, 80978, 81155, 77893, 74980, 83528, 86845, 84996, 80433, 80672, 83163, 79948, 76552, 77515, 84379, 86814, 84271, 75961, 70976, 76735, 82838, 89080, 81501, 73527, 76176, 76506, 75519, 67083, 56343, 52469, 54735, 55293, 54857, 54053, 43565, 40916, 44525, 46905, 53664, 62008, 62982, 49945, 31796, 25217, 15238, -3061, -17870, -29808, -43902, -50767, -55487, -60307, -74539, -81617, -73174, -71565, -72016, -75169, -76402, -69570, -63052, -46284, -38706, -40473, -43133, -43659, -43212, -45482, -58486, -65269, -52257, -37651, -21897, 2698, 29473, 55801, 82541, 96513, 105839, 126167, 143642, 150552, 155437, 155542, 158374, 170063, 181321, 190117, 194362, 195780, 199424, 206946]
10757B06946M358K079j578O653P178L786J3015K7483L3113M3191N9838P0566R3996
10744E70624J04090J28874J58599J76408J91254J99045J74436J34457J02180M4304
10734A984271k3753q9863j36164j73911j95409j90230j70803j46895j16684r2017
10724F48542o3757m0429k3915j9128j9468k2989k7789l5019k5758k6105k2306
10713C21879k3081k1369j4247l294K663P816J6246K1228K5254L9725O2832Q3499
10701E19151J06837J29857J56747J66323J55093J14652Q0697J3845n1535q4109
10691A307558j35061j64982j57845j40752j22654j05500p9989n3499l5023k1759
10681B90494j7433j9440k3779j5425j2027o644l750j035m884m189M984Q68j917
$$ y = [206946, 211304, 213383, 211805, 218458, 225636, 229422, 242437, 269920, 303033, 346224, 406062, 476628, 570624, 674714, 803588, 962187, 1138595, 1329849, 1528894, 1703330, 1837787, 1939967, 1984271, 1960518, 1870655, 1734491, 1560580, 1365171, 1174941, 1004138, 857243, 740559, 648542, 584785, 544356, 520441, 501313, 481845, 458856, 431067, 396048, 370290, 344185, 321879, 298798, 277429, 263182, 259888, 262551, 270367, 286613, 307841, 333095, 372820, 435652, 519151, 625988, 755845, 912592, 1078915, 1234008, 1348660, 1429357, 1443202, 1391667, 1307558, 1172497, 1007515, 849670, 708918, 586264, 480764, 400775, 347276, 312253, 290494, 273061, 253621, 229842, 214417, 202390, 195746, 191996, 190961, 186077, 181888, 186872, 187740, 185823]
10668A85823j470j095o229Q46J3439J0740K373J0360J1555Q723r9L519K582q186
10654B32881o326l643l164J879N660J755N056l119j390q592l381k740P153J0224
10640B32253K0522K8602L5867N1470N4777O6278P3311O4004N8095N0929L3253
10629G69361J2767j3932k3469k7572l4961l9015l3353l6807l2117j0848j0734
10618E19320j912M494N629K819k914l297p760j6730j3753j3895o732R119K2108
10605D96496K8159L9754N1335M8420M6593N1992K8456R091N426j1954k3327j2921
10593G57520k3168k6934k5377k3874k1137k0261k0765j6450j4868m549j1306j2634
10581E36197j7345j3504q594l290J900J0780Q859M646Q068J3981Q224J6342K1959
$$ y = [185823, 184353, 183258, 177029, 177875, 191314, 202054, 204427, 214787, 226342, 235065, 234966, 238485, 241067, 232881, 226555, 222912, 219748, 221627, 227287, 229042, 234098, 230979, 229589, 220997, 217616, 214876, 222029, 232253, 252775, 281377, 317244, 368714, 423491, 489769, 563080, 627084, 685179, 736108, 769361, 782128, 768196, 744727, 717155, 682194, 643179, 609826, 573019, 540902, 530054, 519320, 517408, 521902, 527531, 530350, 527436, 524139, 516379, 499649, 485896, 472001, 465269, 474388, 496496, 524655, 564409, 615744, 664164, 710757, 762749, 791205, 800296, 805722, 793768, 770441, 757520, 734352, 707418, 682041, 658167, 637030, 616769, 596004, 579554, 564686, 560137, 548831, 536197, 518852, 505348, 496754, 493464, 495364, 506144, 515003, 519649, 527717, 541698, 549922, 566264, 588223]
10568E88223Q289L604O643J2157O850Q852J0478J0306J6327J5087K2009K3179
10556G32004J7084J5900M321l315p145J062P038k62K744j970J653N426Q221P564
10542G90325N551Q702O21P140K0267K7555L2339M8430M5604M7994N6538O3319
10530A154385P0193P0842O1942O9794O6721O2843P4224O2635N1607N4988N3496
10519A853670N5683N4850N2662N0153N7287P3532P7880R0097J01476J25158J50451
10508B742899J71558J97753K27757K63822L02069L48418M04988M89993N97521
10499E746778P21331Q50933J010580J153414J271361J392662J475794J528656
10491A5151509J625004J785058K042056K587037L562228N255959Q104909J2303532
$$ y = [588223, 596512, 600116, 606759, 618916, 625766, 634618, 645096, 655402, 671729, 686816, 708825, 732004, 749088, 764988, 769309, 765994, 758849, 759911, 766949, 766687, 769431, 767461, 769114, 774540, 782761, 790325, 795876, 804578, 805199, 812339, 832606, 860161, 892500, 940930, 986534, 1034528, 1091066, 1154385, 1224578, 1295420, 1357362, 1427156, 1493877, 1556720, 1630944, 1693579, 1745186, 1800174, 1853670, 1909353, 1964203, 2016865, 2067018, 2124305, 2197837, 2275717, 2365814, 2467290, 2592448, 2742899, 2914457, 3112210, 3339967, 3603789, 3905858, 4254276, 4659264, 5149257, 5746778, 6468109, 7319042, 8329622, 9483036, 10754397, 12147059, 13622853, 15151509, 16776513, 18561571, 20603627, 23190664, 26752892, 32008851, 40113760, 52417292]
10483E2417292J7592917K4614501L2211304L6369166M0383837M1405815L3363889
10476B78358721K5177374J5735456q84923j4861713k3289408l4206643l9934491
10469B06094373l8339368l6309025l1527994k4360740j8009864j2862151q806747
10462C5878484o019983m287169l277756k621441k178324j913568j683574j485596
10454A2411073j361727j205074j056999r59983q45687p22052o21188n30396m39417
10445D668550l66234k99647k46482k10444j87582j67169j51240j36415j26512
10436B776825j13787j19489j17879j13727j03533j06835j06585r8889r2086q7331
10426A716684p3200o2997n9328m1243j9392j8979k5386k0951j1139k14o26m832
$$ y = [52417292, 70010209, 94624710, 126836014, 163205180, 203589017, 244994832, 278358721, 303536095, 319271551, 318386628, 303524915, 280235507, 246028864, 206094373, 167755005, 131445980, 99917986, 75557246, 57547382, 44685231, 35878484, 29858501, 25571332, 22293576, 19672135, 17493811, 15580243, 13896669, 12411073, 11049346, 9844272, 8787273, 7827290, 6981603, 6259551, 5638363, 5107967, 4668550, 4302316, 4002669, 3756187, 3545743, 3358161, 3190992, 3039752, 2903337, 2776825, 2663038, 2543549, 2425670, 2311943, 2208410, 2101575, 1994990, 1896101, 1804015, 1716684, 1643484, 1580487, 1521159, 1479916, 1460524, 1441545, 1416159, 1395208, 1384069, 1383855, 1383229, 1378397]
10414A378397r313j352m574j1368m988m308j8881j6173j7907j3615j4642j4471
10402A246805k3168k1071n699L729J3724J4996K2368K4033L2536L9386L6162M0284
10390A424085M2709M2964M8911M8500M5007L7087L6958L9470M7798L9747M0565
10379A893801M2941M6364O5181P3795P9425J05280J23473J40049J65378J96061
10369B931748K28918K89651L36198L85526M32814M92786N58045O27832P18434
10360G001952Q00754Q90883R99371J089837J183045J265958J365609J477252J649282
10351A7723943J940262K435009L316523M840984P351234J1089356J5531062K0922472
10343H5150845K7359232L1253937L3689540L5410949L2582689K6122787J8489435
$$ y = [1378397, 1369084, 1367732, 1363158, 1351790, 1346802, 1342494, 1323613, 1307440, 1289533, 1275918, 1261276, 1246805, 1223637, 1202566, 1196867, 1200596, 1214320, 1229316, 1251684, 1275717, 1308253, 1347639, 1383801, 1424085, 1466794, 1509758, 1558669, 1607169, 1652176, 1689263, 1726221, 1765691, 1813489, 1853236, 1893801, 1936742, 1983106, 2048287, 2122082, 2201507, 2306787, 2430260, 2570309, 2735687, 2931748, 3160666, 3450317, 3786515, 4172041, 4604855, 5097641, 5655686, 6283518, 7001952, 7802706, 8693589, 9692960, 10782797, 11965842, 13231800, 14597409, 16074661, 17723943, 19664205, 22099214, 25415737, 30256721, 37607955, 48697311, 64228373, 85150845, 112510077, 143764014, 177453554, 212864503, 245447192, 271569979, 290059414]
10336B90059414R151343k378570j2905533k1304069k8567619l3685952l3960772
10329A66408242l2296207k9470679k4198461j8592702j3859029r841336o784652
10322C1365176m788147l552508k768051k267384j946400j701951j519139j368978
10314A1452618j237444j105978r91547q60374p42477o36664n36845m51235l88119
10305D501935l29452k76728k43834k20489k06781j87718j75530j64370j66026
10296B531007j56317j35440j28525j21282j12405j02023q5732o5132n9326n7713
10286A507112m1519k9118k1048k7073k0821k2218j7382k2257k9115k5535k5275
10275A225751l1206k8224k9823k4800l4506m5345m1911m1047l7962l5598k9297
$$ y = [290059414, 299210757, 296832187, 283926654, 262622585, 234054966, 200369014, 166408242, 134112035, 104641356, 80442895, 61850193, 47991164, 38149828, 31365176, 26577029, 23024521, 20256470, 17989086, 16042686, 14340735, 12821596, 11452618, 10215174, 9109196, 8117649, 7257275, 6514798, 5878134, 5341289, 4890054, 4501935, 4172483, 3895755, 3651921, 3431432, 3224651, 3036933, 2861403, 2697033, 2531007, 2374690, 2239250, 2110725, 1989443, 1877038, 1775015, 1689283, 1624151, 1564825, 1507112, 1465593, 1436475, 1415427, 1388354, 1367533, 1345315, 1327933, 1305676, 1276561, 1251026, 1225751, 1194545, 1166321, 1136498, 1111698, 1077192, 1031847, 989936, 948889, 910927, 875329, 846032]
10264H46032k6285l0821k5113j4967q110m933r082j4430j2053k0902k3058j3000
10252F43278j3173k6039k0993j7832j8315j5820j4252j7194p474r927n190j3716
10240D63353q120K627n925K994J486L629L070M560M325m326j8745q263j0959j5607
10226D14099j6033k8736j6359m131m433m251j1673M842Q140O622J0886K0276K3944
10213D03193J5529L0345K2870K1580J5049O906l460j5240j8544k8516k4268k3310
10201D02134k9919k9475l1336k5797k8996k4017j7148k7464j9116l1449l2325
10190A05092k7346l7390l8221m2647m7170n0510m1105k9601j1947n565M456J6724
10178b05230K8637M5954N9222N5842N0402M6149N0179L9369J8637K688o722k610
$$ y = [846032, 819747, 788926, 763813, 748846, 740736, 735803, 726721, 712291, 700238, 679336, 656278, 643278, 630105, 604066, 583073, 565241, 546926, 531106, 516854, 499660, 492186, 482259, 477069, 463353, 455233, 457860, 451935, 454929, 456415, 460044, 463114, 467674, 471999, 467673, 448928, 440665, 429706, 414099, 398066, 369330, 352971, 348840, 344407, 340156, 328483, 333325, 341465, 348087, 358973, 379249, 403193, 418722, 449067, 471937, 493517, 508566, 515472, 512012, 496772, 478228, 449712, 425444, 402134, 372215, 342740, 311404, 285607, 256611, 232594, 215446, 187982, 168866, 137417, 105092, 77746, 40356, 2135, -40512, -87682, -138192, -179297, -208898, -220845, -226410, -221954, -205230, -176593, -130639, -71417, -15575, 34827, 80976, 131155, 170524, 189161, 191849, 185127, 182517]
10166A82517l648o194j217p39l166m940l563q240n563j0905q096k227l783Q86
10152A21122n06K00Q375J2887R475J507K626M068J5898Q076k334k561L584Q003
10138A90420Q68J225p776L62m247j2220j3908j1049j2110n240r733L776n842l698
10124A10828n189L183l893J689R159r23K110J340L655M296o51k881n766k945m252
10109A09760R26L629N060R22k101L365%K426K63k113M708M071k37J613k642r199
10093A20451k564L830J483m522p03O631M117p70R66K319L569R740J7740R914K0174
10078A92375K2412L5111N5562O7863J11478J56477J92282K12621K42325K28032
10068A516538J78744J32558N3416n8002j27660j75935k30222k35327k15886j99271
$$ y = [182517, 178869, 172675, 171458, 170719, 167553, 162613, 159050, 150810, 145247, 134342, 126246, 124019, 120236, 121122, 120616, 120816, 129191, 142078, 151553, 153060, 155686, 159754, 175652, 183728, 181394, 178833, 182417, 190420, 191288, 192513, 184737, 185099, 180852, 168632, 154724, 143675, 131565, 126325, 116592, 120368, 114526, 110828, 105639, 108822, 104929, 106618, 115777, 114854, 116964, 118304, 121959, 126255, 125604, 122723, 116957, 114012, 109760, 110686, 114315, 119375, 120297, 118196, 121561, 121561, 123987, 124250, 122137, 126845, 130916, 130679, 132292, 129650, 120451, 117887, 121717, 123200, 118678, 117975, 124606, 128723, 127953, 128919, 131238, 134807, 144547, 162287, 172201, 192375, 214787, 249898, 305460, 373323, 484801, 641278, 833560, 1046181, 1288506, 1516538, 1695282, 1827840, 1881256, 1823254, 1695594, 1519659, 1289437, 1054110, 838224, 638953]
10058F38953j57372j11035p6935n4063m0168k8980j8530j8739r974q448n735l755
10046A05219j0476j3027K748N516n517J229Q788P780N493K2205K7977J5829J3481
10033A87245J5869R132R386L044m213k370o281o258N29M782J228q86P65O342N311
10018B23625q61L277Q694N036L958m276o205j4110k3300j4415j1571j6356j3775
10005A39721j4554q094p353j1556p574n089j190N127p74L375k386o104l44n29
9991H2676j1035n430n03N16Q9k360Q43o085k557n968j349J0208M552N449M028
9976G3074j151K279L416n563J092L348J65j424O253O341m596l734k568l849O023
9961G9106Q584L344O087R488L410n112J586O535N639q87N281R084R686O524L474
$$ y = [638953, 481581, 370546, 293611, 239548, 199380, 170400, 151870, 133131, 123157, 114709, 108974, 105219, 94743, 81716, 84464, 89980, 84463, 85692, 94480, 102260, 107753, 129958, 157935, 173764, 187245, 203114, 212246, 221632, 224676, 220463, 218093, 211812, 205554, 206083, 210865, 212093, 211207, 211972, 218314, 223625, 222764, 226041, 234735, 239771, 243729, 239453, 233248, 219138, 195838, 181423, 169852, 153496, 139721, 125167, 117073, 109720, 98164, 90590, 85501, 84311, 89438, 88664, 92039, 89653, 83549, 83205, 82676, 71641, 66211, 65708, 66224, 66313, 63953, 64796, 58711, 56154, 50186, 48837, 59045, 63597, 69046, 73074, 71923, 74202, 77618, 72055, 73147, 76495, 76660, 75236, 81489, 87830, 83234, 79500, 76932, 73083, 79106, 87690, 91034, 97121, 106609, 110019, 104907, 106493, 113028, 118667, 117780, 123061, 132145, 141831, 148355, 151829]
9946A51829J46J2292K1925J9726K9984O1796Q9979J21788J50787J69448J89366
9935A019066K00247J87923J49984J02829M3424k6126q9337j36191j71434j98408
9925A081977j92347j81773j56232j22175r5786o6477n0512m2733k1830j3429q220
9914A30463j0630j4861j3300p164l595l141k966k322J345J291m688j549P13P06
9900G0302p87L15j292j16j0782p998m349j349q783m433o551p910J215J4284P654
9885C9420L393k92K087K560L836L803P703J4310J2807J4081J2975L490N40m913
9871A15800j1472j3822o750m982j3311r023n727j167j538p913J892p21j015o397
9857C3854q870Q477P44m231p7j620j720K420k546k22m693l967j069k135j761K1
$$ y = [151829, 151975, 164267, 186192, 205918, 235902, 297698, 387677, 509465, 660252, 829700, 1019066, 1219313, 1407236, 1557220, 1660049, 1703473, 1677347, 1588010, 1451819, 1280385, 1081977, 889630, 707857, 551625, 429450, 333664, 267187, 216675, 173942, 152112, 138683, 130463, 119833, 104972, 91672, 84508, 80913, 77772, 74806, 72484, 73829, 75120, 70432, 68883, 69596, 70302, 69515, 69830, 68538, 68422, 57640, 49642, 45293, 43944, 35161, 30728, 24177, 16267, 17482, 31766, 39420, 42813, 42521, 44608, 47168, 51004, 54807, 62510, 76820, 89627, 103708, 116683, 120173, 120713, 115800, 104328, 90506, 83756, 78774, 65463, 56440, 50713, 49546, 48008, 40095, 41987, 41266, 40251, 33854, 24984, 33461, 34205, 29974, 29897, 28277, 26557, 28977, 26431, 26209, 21516, 17549, 16480, 14345, 12584, 12605]
9841A2605L859J234M517p12K14O8K512K291P82l20o147Q21K276K508l840l143
9825A9525J87O163r520n731M077l582m676L088R352l6J105m32m038K649K567l609
9809A7089q504K230R788j670l124j428J827M876j939n672r97J785J0001N374l84
9794B9252k06q339r993J579K581m31R4N445O73j729N723k989Q83J66q504q542
9778E663M72L132K638K086M655K603p72m982m818K189R03J877M777n923k482P310
9762A9328J254n347o492r498o507M816P818m792L339K537K539L41p33N417M449
9747A8469k301n100k651N494J896l821l813K859j911J26J775K823l263M453M796
9732A9831j981K487n465m632J314N187J670m767k887K792q3j164K149R50K919
$$ y = [12605, 16464, 17698, 22215, 21503, 21717, 21785, 24297, 26588, 27370, 27050, 20903, 21724, 24000, 26508, 22668, 19525, 19712, 25875, 16355, 10624, 14701, 11119, 6443, 9531, 18883, 18847, 19952, 19520, 15482, 18131, 20698, 17089, 8585, 10815, 20603, 18933, 15809, 14381, 16208, 21084, 19145, 13473, 12476, 14261, 24262, 29636, 29252, 29046, 20707, 10714, 12293, 14874, 14443, 14537, 19982, 20655, 18926, 24649, 21660, 22543, 22709, 14205, 5663, 6135, 9267, 11905, 13991, 18646, 21249, 20477, 15495, 10677, 12866, 13769, 15646, 20423, 14500, 12018, 19328, 20582, 15235, 8743, -755, -7262, -2446, 5372, 580, 3919, 6456, 8995, 9336, 8603, 14020, 18469, 16168, 11068, 8417, 13911, 15807, 11986, 8173, 11032, 9121, 9247, 11022, 13845, 10582, 15035, 19831, 17850, 20337, 14872, 10240, 11554, 16741, 18411, 13644, 10757, 13549, 13466, 12302, 14451, 15401, 18320]
9717A8320j673K701m520j017J922l645l962n296j509K70o14k277j458O582l67
9702C457r156j832j210O367J1455O863o977k552J732m432j767M993J831m69j043
9687G260j471Q10K280q78k340n244o198L999O759L169j310l480M692O240L787
9672A8075L227r23k151m837J360n579m949j853j866j049M575L981N369K222k874
9657A2728j732J819k738j872M859L651Q67K305J006J928m542k339q16M074o673
9642A2525p092j975N02n898M083L765M756M704l219j3439k085J1246N537o548
9628F862l655Q317N34j360n268n046j278J442n76q42Q2M786J23K742R09k326j0724
9611e278n991P060P961o98j184K387j95j4n76L659l459m619q370j793J30K408
$$ y = [18320, 16647, 19348, 14828, 13811, 15733, 12088, 8126, 2830, 1321, 1591, 977, -1300, -2758, 3824, 3457, -5699, -7531, -8741, -2374, 9081, 15944, 8967, 6415, 8147, 3715, 1948, 6941, 8772, 8303, 7260, 5789, 6599, 8879, 8001, 5661, 417, -5781, -1782, 4977, 8146, 6836, 3356, 8048, 14288, 18075, 21302, 20379, 18228, 13391, 14751, 9172, 4223, 2370, 504, -545, 4030, 8011, 13380, 15602, 12728, 10996, 12815, 10077, 8205, 13064, 16715, 17582, 19887, 20893, 22821, 18279, 15940, 15124, 19198, 12525, 5433, 3458, 3960, -1938, 2145, 5910, 10666, 15370, 12151, -1288, -3373, 7873, 13410, 6862, 3207, 11524, 12058, 10698, 5430, 384, -894, 548, -28, -870, -788, 3998, 4121, 6863, 7772, 5446, -5278, -11269, -4209, 3752, 3054, 1870, 4257, 4062, 4048, 3472, 7131, 3672, -947, -9317, -11110, -10980, -8572]
9595h572J948M769N884l58J976L160K639J217k019j463l787k06N59J094J303j370
9579F774J441M360M477r6l991j4682l267Q809k092k655p3j392O33J735L694M084
9563G759m217n565n219Q231R692Q89k764o553q518O409N242k340j599J692l78
9548B761N92k141j0470M82P996N319J558p136l771J996M763J841n486j698N170
9533A776K052Q7J646q29l095R70L51k591n410L19o51N044Q619L588l84j909j639
9516G944L655O264n807m001M060Q548J79o158m167l906L41N31p094q033l11K645
9500e310l729L289P765n1n711P48R170k47k605k48M171n339J144P22l403J332
9484A698J0661l000n299K597R58k854n131J943Q980j351n733l364k43m170L547
$$ y = [-8572, -6624, -1855, 4029, 3671, 5647, 8807, 11446, 12663, 10644, 9181, 5394, 5188, 5747, 6841, 8144, 6774, 8215, 12575, 17052, 16956, 12965, -1717, -4984, 3825, 1733, -922, -995, -2387, -1754, -19, 3675, 7759, 3542, -2023, -7242, 989, 10681, 11570, 8806, 2253, -6265, 144, 5386, 3046, 1447, 3139, 2761, 3353, 1212, -9258, -8776, -780, 4539, 6097, -1039, -4810, -2814, 1949, 3790, -1696, -3394, 1776, 3828, 3915, 5561, 4732, 1637, 2607, 2958, 367, -5043, -4724, -5375, -331, 8288, 11876, 11492, 9583, 7944, 11599, 17863, 12056, 8055, 12115, 20663, 20842, 14684, 10517, 6611, 6952, 7483, 389, -7644, -7955, -5310, -9039, -5750, 2015, 1964, -3747, -2999, 6171, 5924, 3319, 3071, 7242, 1903, 3047, 3769, 366, 1698, 12359, 9359, 4060, 6657, 7615, 4761, -370, 1573, 10553, 9202, 3469, 105, -138, -4308, -761]
9469g61L944L344J687j04k230k675o634J699p214m620O736J378J595M620L585
9454D350L662l147k100j96L777N370j739K873j853o803K490L668l487q667J679
9439a23L646J631l139p054m264L467J0493M561n758J805j71L821J485p097j134
9424B169N975j257J97j639Q43l550N065J088j604k994J633R19O455L138J880O95
9408A9013j900j4479p009J271O044K70J042J284M357M322O342o971o41J434m649
9393I730O52K454j0639j1684J22L885R51l782k923j081R295M558L879L998k545
9378F870K358k762k267L474m439k770K64p83L136O243N32k81m87L929k286j921
9362H810K485j003r58o080k017n552q3j77K726K690n337L028m920L965K203l17
$$ y = [-761, 3183, 6527, 8214, 8110, 5880, 3205, -3429, -1730, -8944, -13564, -6828, -5450, -3855, 765, 4350, 8012, 4865, 2765, 2569, 6346, 11716, 9977, 12850, 10997, 4194, 6684, 10352, 6865, -1802, -123, 3523, 5154, 2015, -5039, -9303, -5836, 4657, 9218, 3460, 5265, 5094, 8915, 10400, 3303, 2169, 8144, 6887, 7084, 5445, 6288, 2738, 7803, 8891, 7287, 4293, 5926, 6845, 13300, 16438, 18318, 19013, 17113, 2634, -4375, -3104, 2940, 3210, 4252, 5536, 9893, 14215, 20557, 13586, 12945, 14379, 9730, 10382, 12836, 2197, -9487, -9365, -5480, -4529, -8311, -11234, -12315, -3020, 1538, 5417, 9415, 6870, 9228, 6466, 4199, 7673, 3234, 464, 728, -55, 3081, 9324, 9856, 9575, 9088, 13017, 10731, 8810, 11295, 10292, 9334, 3254, 1237, -4315, -4398, -4575, -1849, 841, -4496, -1468, -6388, -2423, -220, -537]
9346e37K320l71n94K536n65l596m611l245P706N624p17m657N482K665p505l471
9330c536M477M557q699L15J659Q308Q226n711n070j855o710Q12K693K209L772
9315E447n6j962P2N10m945m612J961L918k249o423M376L643J196j250j476R554
9299G704J1287J964j0093j002k36N23M221j156m22q987k766L177Q07M322M235
9284A3578Q5q24q06m085J174r445l819R803j24l667J428p019k924M148N241L892
9268F636m726R38J344P68M252K554Q7j899q26k155o91K425K427m960K704l491
9252E387p951k967K055K924P9L588k09N88Q375l36O58O02k280J174N70j534n205
9235E518l811J248J466m331L494O561K690j171l422l827N449Q150P756J262l716
$$ y = [-537, 1783, 1412, 818, 3354, 2789, -807, -5418, -8663, -957, 4667, 3950, -707, 4775, 7440, -65, -3536, 941, 5498, -3201, -2886, -1227, 7081, 15307, 9596, 4526, 2671, -4039, -3227, -534, 1675, 5447, 5391, 3429, 3501, 4011, -934, -5546, -3585, 333, -1916, -8339, -3963, -320, 876, -374, -1850, 7704, 18991, 20955, 10862, 9860, 9624, 10147, 14368, 13212, 12790, 3803, 1037, 4214, 5021, 9343, 13578, 13663, 12839, 12033, 7948, 9122, -323, -4142, 5661, 5537, 1870, 3298, -3721, -6645, -2497, 2744, 6636, 1910, 2848, 4192, 4960, 9212, 11766, 11853, 9954, 9128, 6973, 6282, 8707, 11134, 6174, 8878, 5387, -2564, -5531, -3476, -552, -473, 3115, 2906, 3494, 11869, 11533, 12191, 12793, 10513, 11687, 12257, 10723, 5518, 1707, 2955, 4421, 90, 3584, 10145, 12835, 11664, 8242, 4415, 9864, 18014, 25770, 27032, 23316]
9220B3316k730j142m829k05K08j570O07J788M075m226K130P102K183j206K258
9205B7759J114J056j512N63K700J090O953j72m246n4n557l059N450o810o682Q968
9189B7561R379L048N831N109K456M384l335J672J699K281Q696Q971N601O658J450
9174I1461L751R549M326K110J0109J9696J8296J3573J6079Q786J7839L0435L9818
9161B85828M3202L4975L7386M6851P1170Q8286J12041J37492J74707K18769K58947
9150A509654L05305L34518L11838K31552Q0602j04339k60566l19873l25481k95480
9140A467730k47666j94588j68520j40826j05205p3220o2245o2194n2879m1525
9130C18862l5682l1218k4641k0566p362j3942k3606j7107j1100j2932j0433n958
$$ y = [23316, 20586, 19444, 14615, 14410, 14618, 13048, 13655, 15443, 19518, 15292, 17422, 24524, 26707, 25501, 27759, 28873, 29929, 28417, 28980, 31680, 32770, 39723, 39551, 35305, 35251, 29694, 26635, 32085, 25275, 18593, 27561, 36940, 39988, 45819, 50928, 53384, 57768, 54433, 56105, 57804, 60085, 68781, 77752, 83353, 90011, 91461, 95212, 104761, 109087, 111197, 121306, 141002, 159298, 172871, 188950, 197736, 215575, 246010, 285828, 329030, 364005, 401391, 448242, 519412, 607698, 719739, 857231, 1031938, 1250707, 1509654, 1814959, 2149477, 2461315, 2692867, 2773469, 2669130, 2408564, 2088691, 1763210, 1467730, 1220064, 1025476, 856956, 716130, 610925, 537705, 475460, 413266, 360387, 318862, 283180, 251962, 227321, 206755, 199393, 185451, 161845, 144738, 133638, 120706, 110273, 104315]
9118A04315n722n029o074q638p223R34k931n012p352m587j162n413K568j820M63
9103D7317k928p746l922m290J773k982o720k219O564J008L780j633n349j255l729
9088A7669N015M317o50n735m42J995K143K82j554k670j526n41M22L29l439m242
9072A1373l06M334L500J353M080K349j433m243n359r9l498n397Q832K748K228
9057B0462O82l896J984l947m545J07j234l82j836L544K313p153l893N562K72l768
9041D272R24N322K221m382n781m008P110R861L280J610m986N41n962n353m86L706
9025G889j775n316o297k837k279Q08m195K567M835k174l733J1742N352J507j29
9010E965k132L478p64J839l056m980j273L620P38m84j02p659q775K151Q665N134
$$ y = [104315, 98593, 93564, 87490, 78852, 71629, 72563, 69632, 64620, 57268, 52681, 51519, 46106, 48674, 46854, 47317, 44389, 36643, 32721, 28431, 30204, 27222, 20502, 18283, 24847, 25855, 29635, 28002, 22653, 21398, 17669, 22684, 27001, 26351, 20616, 20174, 22169, 24312, 24594, 23040, 20370, 18844, 18303, 18725, 19054, 15615, 11373, 11067, 15401, 18901, 20254, 24334, 26683, 25250, 21007, 15648, 15549, 12051, 6654, 15486, 18234, 20462, 21144, 17248, 19232, 15285, 10740, 10847, 9613, 9231, 7395, 10939, 13252, 6099, 2206, 7768, 8040, 4272, 5196, 10518, 12739, 8357, 2576, -1432, 5678, 15539, 18819, 20429, 15443, 15984, 10022, 4669, 4183, 7889, 6114, 798, -5499, -8336, -10615, -9807, -14002, -11435, -6600, -8774, -12507, -765, 4587, 6094, 5965, 3833, 7311, 6547, 8386, 5330, 350, -923, 2697, 3435, 2951, 2849, -4810, -13585, -11434, -2769, 2365]
8994B365J138k621k38P774k61j709o216n292j424P683K054L344j300J293Q86j822
8978E654p705l088l542N846K526k078m59P4n818m228K661L865K069J712O314M748
8962H551j777k078o199k686N294L677o819M50j572m223K764j465j57M481O060
8947D301p380k533Q00P328m232r428M513N076M355P270j668j841p272k906P679
8932D062j918j292k06J345P45j558q86n202K570O249K522J985k96n78m78l745
8916C319M01m8M304k686l638R08j235r59j168k902l048M443M300l821j0642M38
8900a2034M524R603K604o27p664p77J514L356r163j332M372N334O505k312m383
8885d80k94j191r835j679O099K614o24n034JM198K934N131n657q956J574j272
$$ y = [2365, 3503, 882, 644, 8418, 8157, 6448, 232, -5060, -6484, 1199, 3253, 6597, 5297, 6590, 7476, 5654, -2051, -5139, -8681, -2835, -309, -2387, -2846, -2772, -8590, -12818, -10157, -6292, -4223, -2511, 3803, 8551, 6774, 4696, -1503, -4189, 1105, 4782, -2037, -1587, -3159, -7382, -4618, -6083, -6240, -1759, 4301, -3079, -5612, -4812, 2516, -1716, -11144, -6631, -1555, 2800, 10070, 8402, 6561, -711, -3617, 4062, 2144, 852, 646, 1991, 2736, 1178, 292, -4910, -2340, 3909, 6431, 8416, 8120, 7542, 7064, 3319, 3720, 3672, 7976, 5290, 1652, 2560, 1325, 366, -802, -3704, -6752, -2309, 1991, -1830, -12472, -12034, -7510, 2093, 4697, 4070, -3594, -4371, -2857, 499, -8664, -9996, -5624, -290, 6215, 3903, -480, -774, -1965, -11800, -13479, -7380, -4766, -5390, -10424, -10423, -6225, -3291, 1840, -3817, -12773, -11199, -12471]
8869a2471n543L661P063O769r52L703j391L147N418Q75p290m396n371o97J666
8854e809J753N452K015k620n997l120J359N29o66R856Q094o057l317K251j698
8839B025J450P139k555n001p014j282M244L047J650J35l283l746P758J0239p466
8824G340k497r26M53J420Q348L482m877k484m807M728K817J027j917m635q621
8809a149M926m00j483K705k226J735Q554K104j1462r791R51k115M827K410k582
8794b996J287L330P158L460R7l738k783j170l778m95q75L488N302p562j665k213
8778c153L825P940k61j794J498n694r019M513l531j072o95K914O553J833O09R16
8762E382n594j234l735n51J831l464k29M957p1n83l53J633O001L364Q914m940
$$ y = [-12471, -18014, -14353, -7290, -521, -1473, 2230, 839, 3986, 9404, 10279, 2989, -1407, -6778, -7475, -5809, -4056, 1396, 3411, 791, -5206, -8326, -6967, -6438, -7104, 2752, 10846, 4789, 1472, 3723, 2025, 3475, 10614, 8059, 3058, -3956, -5238, -994, 2053, 3703, 3838, 555, -3191, 4567, 14806, 7340, 4843, 3917, 4370, 5790, 14138, 17620, 12743, 10259, 5452, 10180, 12997, 14024, 12107, 7472, -1149, 3777, 3377, 1894, 4599, 2373, 4108, 12662, 14766, 3304, -6487, -5536, -7651, -2824, -414, -2996, -1709, 1621, 8779, 12239, 12336, 8598, 5815, 4645, 867, 372, -503, 2985, 8287, 725, -940, -3153, 672, 8612, 8351, 6557, 8055, 2361, -6658, -2145, -5676, -6748, -7443, -4529, 2024, 3857, 4466, 5382, -212, -1446, -5181, -5732, -3901, -7365, -7594, -2637, -2708, -3291, -3644, -2011, 3990, 7354, 16268, 11328]
8746A1328n354L639l367O27L300m885l550L65J1836Q91k493q70q836o071J136
8731b304K86k648l974j901l995K196Q040K338j24J922N932m01O21k019l943O216
8715F242N929L22l132m030j401l26k003l595O717N773j153K793m653q109p336
8700g962j29J950K420j171P151P557J430l591K709m536j0302r31L45j467Q075
8685A548j884j85M493K311L121N141p79m574m022o509J506L12O97P975l2J576
8669A0695l613k097r81N42k561m132K156J0328K607L986J692l115l632j1139J220
8654A956K488l769p37l164k631j312m258J279Q917M98M500J369j983P88K477J686
8638H104K561l653J306M095l925M289Q327l61q21j422K033k966m076K506L174
$$ y = [11328, 5974, 9613, 6246, 6873, 10173, 5288, 1738, 2103, 13939, 14830, 12337, 11467, 2631, -3440, -2304, -2018, -4666, -8640, -10541, -14536, -12340, -4300, -1962, -2086, -164, 5768, 5367, 5988, 3969, 26, 6242, 12171, 12493, 9361, 5331, 3930, 3604, 1601, -1994, 4723, 10496, 9343, 12136, 7483, -626, -7962, -8091, -6141, -3721, -4892, 2259, 9816, 11246, 7655, 10364, 5828, -4474, -5405, -5060, -6527, 1548, -336, -521, 3972, 6283, 9404, 14545, 13766, 9192, 5170, -1339, 167, 479, 1176, 9151, 9119, 10695, 7082, 4985, 4004, 4546, 1985, -2147, 9, 10337, 12944, 16930, 18622, 15507, 11875, 736, 1956, 4444, 675, -62, -3226, -5857, -7169, -11427, -10148, -1231, -733, 3767, 5136, 3153, 3941, 6418, 8104, 10665, 7012, 8318, 12413, 8488, 12777, 21104, 20743, 19922, 18500, 20533, 17567, 13491, 15997, 19171]
8623A9171L740M104K938L405M778J118o860J317n434M866J0408k146k514n494
8609C3397q555n7l495p736J273l726k323N942J89k835q692l730K746O280l394
8594E284j70J559K301J754K721Nk557p677l245N328m49j080j806O307K757L945
8578A4977j178m038m749l680J675J814Q686L043M668j768r165r373O78L908L343
8563H841O434K072q920R289N731p891m247m112m325J797Q571q73m594l503n790
8548a520j965L850O40J448j128n332q068l788N462O003P271j183L788L89K174
8533H041L56k232j340Q961j025n221l631j783J650L811J867k141j567k677j0217
8518g148J29M598J178N46n234j26J456n180J172K552m419N816j044j890P09J999
$$ y = [19171, 22911, 27015, 29953, 33358, 38136, 39254, 32394, 33711, 28277, 33143, 43551, 41405, 38891, 33397, 24842, 24785, 21290, 13554, 14827, 11101, 8778, 14720, 14909, 12074, 3382, -348, 2398, 8678, 5284, 5114, 6673, 8974, 10728, 13449, 13454, 10897, 3220, -25, 5303, 4854, 3774, 1968, 8275, 11032, 14977, 13799, 9761, 5012, 1332, 3007, 4821, 13507, 16550, 21218, 19450, 10285, 912, 1590, 5498, 8841, 15275, 17347, 8427, 17716, 23447, 15556, 11309, 7197, 2872, 4669, 13240, 12367, 7773, 4270, -1520, -3485, 365, 1005, 2453, 1325, -4007, -12075, -15863, -10401, -4398, 2873, 1690, 5478, 5867, 8041, 8397, 6165, 4825, 13786, 12761, 7540, 3909, 2126, 3776, 7587, 9454, 7313, 5746, 3069, -7148, -7019, -2421, -1243, -697, -5931, -6057, -4601, -9781, -8609, -6057, -10476, -4660, -5704, -7594, -6885, -4886]
8502d886K210o53M85j393L252j562N71N72p690O022Q835M319M812j084j837j443
8486A0530n500o186m997k635J941L337K626K712P62L89J528L001J372q560j3338
8471a3018m439M491K393R146r6O701Q472o652n917k737J519M156r0q545j630q703
8455a4949m335J725M751K7M08j824r88L576k766j37P823J1087k154p408L889J729
8439D54l37O44M998L402N340q381r558p14k855N609K922n665L88J665J633l50
8423h05m391L242M14O42M37m246J137k01l13m554R21Q728N424r17m785l873J457
8406a683L888l400m762L432O042J075k028m568L576J843N07j699p78n084K165
8391a474N121n789p329r59M105L531L719l67r2n390j620k529Q25O82q81L558L355
$$ y = [-4886, -2676, -3329, -2844, -4237, -985, -2547, -1976, -1404, -9094, -3072, 5763, 10082, 14894, 13810, 11973, 10530, 5030, -1156, -6153, -8788, -6847, -3510, -884, 1828, 2590, 2979, 4507, 7508, 8880, 320, -13018, -17457, -12966, -10573, -1427, -1523, 5178, 13650, 6998, 1081, -1656, -137, 4019, 3929, -4616, -6246, -14949, -19284, -17559, -12808, -12781, -12373, -14197, -15185, -11609, -14375, -14512, -6689, 4398, 2244, -5164, -1275, 454, 117, 761, 5759, 9161, 14501, 6120, -3438, -4152, -7007, -1398, 1524, -4141, -3753, -2088, -455, -805, -5196, -1954, -1540, -898, -461, -4707, -3570, -3771, -4084, -8638, -7717, 1011, 6435, 5518, 733, -3140, -1683, 2205, -1195, -5957, -2525, 3517, 4592, 2564, -2004, 1572, 3415, 3922, 2223, 1445, -3639, -1474, 3647, -2142, -9471, -10430, -6325, -2794, 925, 558, 466, -4924, -6544, -9073, -8248, -7566, -8447, -4889, -1534]
8374a534L419O59j962K23L276O03J440m175l924K265p814p131J846L1O412Q560
8358B194J862k634K709l639j2175N6P391O31L349P23j722j110Q205M67L93l20
8342F380R80r10k454K925j359k014N350Q22o203l848M70l986j592Q61Q68J289
8326b421k47n284j1589L620J0662K402J411j93N24j967J21j0565M505L272r205
8311a4954M267O069J505p525r35J2402K287Q90k015o496r01K094P102K376N754
8296A1920q60j023m305o516m622o469J384M941P010Q429n867k476K129R79l934
8281G20l751q229K969J0085l329m127K066p01N2j630n600l315R29J259J754m15
8265a1263K781R880Q201l188o1n640L291o11k729m08J983R85l487j52o79L318
$$ y = [-1534, 1885, 2544, 582, 805, 4081, 4684, 6124, 1949, -1975, 290, -7524, -14655, -12809, -12778, -6366, 2194, 4056, 1422, 4131, 492, -11683, -11627, -4236, -3605, -256, 467, -1255, -2365, 5840, 6307, 6700, 6380, 7360, 6450, 3996, 6921, 5562, 3548, 8898, 9720, 3517, -331, 139, -3847, -5439, -4578, -3710, -2421, -2668, -7952, -19541, -15921, -5259, -2857, -1446, -1639, -1115, -3082, -2961, -13526, -9021, -5749, -14954, -10687, -4618, -3113, -10638, -11573, 829, 3116, 4006, 1991, -4505, -5406, -3312, 3790, 6166, 11920, 11060, 10037, 5732, -784, -5406, -11875, -10491, -5550, 1460, 9889, 4022, 1546, 3675, 4654, 720, -3031, -11260, -8291, 1794, -1535, -5662, -3596, -4297, -4245, -5875, -11475, -14790, -13861, -12602, -10848, -11263, -8482, 1398, 9599, 6411, 6350, 710, 4001, 3390, 661, 253, 2236, 3221, -266, -418, -1097, 2221]
8249B221m278l662J013M54J043L68l829N566O278K492m337J011N097Q85j004j168
8233H150N35p562n859m413J352j77R18R92k562K536p11O157K693n020O067K86
8217C382q230J220K910k084n914n815J347M838O620J878l258k864o206n747J1686
8202f237N201k290l181R413N846k156p513j4540L815o02q12Q758J0868P274n357
8187H487o078L30J579l904m666L000N361m725k860N801k596m933P430N393L17
8172G936l680r293K497J165L39j642Q62N600j316n986P41p80M707J867r114L77
8156e720P121J979j33L583N90n014K649O823j65l080m324m753M231l896m146j882
8140f137M177O678o888n677q08M489j290l610J046K428M875J641l809l555K312
$$ y = [2221, -2057, -5719, -4706, -4252, -3209, -2841, -6670, -1104, 5174, 7666, 3329, 4340, 9437, 10322, 9318, 8150, 8685, 1123, -4736, -9149, -7797, -7974, -7056, -6064, -8626, -6090, -6801, -644, 2049, -2971, 3096, 3382, -4848, -3628, -718, -2802, -8716, -14531, -13184, -8346, -1726, 152, -3106, -5970, -12176, -17923, -6237, -1036, -3326, -6507, 2906, 8752, 6596, -917, -15457, -11642, -12244, -13056, -4298, 6570, 13844, 8487, 2409, 2739, 4318, 414, -4252, -1252, 4109, -616, -3476, 2325, -271, -5204, 2226, 7619, 7936, 4256, -5037, -2540, -1375, -1036, -2678, -1816, 3784, 2468, -3518, -2777, -3557, 1150, 3017, -6097, -5720, 1401, 3380, 3247, 6830, 7420, 2406, 5055, 11878, 11713, 8633, 4309, -444, 3787, -109, -4255, -6137, -1960, 4718, -2170, -7847, -8655, -4166, -5456, -9066, -8020, -5592, -717, 924, -2885, -6440, -4128]
8125d128l132N636Q786L358j730j3933j112L639k589k113N510J386l852m67L970
8110g71K067m955J439Q60k095m151M94M82k886j887L60N058k20n450J0684J0741
8094I770K204k862m753R5M402l358k409K789m009n164k983j844R376J724m384
8079a406k56J124m374j032j97J819L43N745l828o297M675Q571N180m795n25K997
8063G744Q25l759n490K511L551M207p89l193n756j303L925l193R02L883J0789
8048A4854J102o933q06j542m41R1r40k418n133k495q435k376O304O338L452l119
8032b497k843L895N524j972l157P038K238n949M075k869J227K252L84j922J250
8017F674o932j402O94L408K02L096N015j742j971j280o63O89l324j116K923j173
$$ y = [-4128, -7260, -1624, 7162, 10520, 8790, -5143, -6255, -2616, -5205, -7318, -1808, -422, -4274, -4741, -771, 1296, -3659, -2220, -1360, -3455, -7606, -7112, -6630, -9516, -11403, -11043, -5985, -6205, -11655, -971, 9770, 11974, 9112, 4359, 4454, 8856, 5498, 3089, 5878, 1869, -3295, -6278, -8122, 1254, 2978, -1406, -1662, -538, -4912, -5944, -6141, -4322, -3979, 1766, -2062, -8359, -3684, 4887, 10067, 5272, 4747, 7744, 8569, 4810, -680, 1831, 5382, 9589, 8800, 5607, -149, -1452, 2473, -720, 182, 4065, 14854, 15956, 9023, 8217, 6675, 6234, 6325, 5385, 2967, -2166, -4661, -13096, -15472, -9168, -2830, 622, -2497, -5340, -1445, 4079, 2107, -1050, 5988, 8226, 2277, 6352, 3483, 4710, 6962, 7346, 5424, 6674, -258, -1660, -966, 2442, 2644, 5740, 10755, 9013, 7042, 5762, 5099, 5788, 2464, 1348, 4271, 3098]
8001C098k64R542P162M48l933J71k932m753l577k330P46M867m945p255l732j797
7985i484K865N072O345k63M75L927n62K280r084l702k163N464J682o614l285Q040
7969I93J1359M732n849L060L908q684j1358m741J692M685M714k199k369N457J554
7954F954N380O78K996l653k793p659m644M707N29o51P304N820K66k853o397m296
7938A688J584L443o211o034r67L519R546L18l901j982k461R4m586N403j938m367
7922f852K821P613Q00q91m572J068O376m442q00L798j72j0252l866N129M980m210
7906c472l595j14O128L664K630N150P6J950J361j2284p373o16L156K132M891l95
7890C289n316j054K523l76J954l14j656M073O493k921r338o55N933M854k430J882
$$ y = [3098, 2834, 12376, 19538, 19986, 16053, 16224, 13292, 8539, 4962, 2632, 3378, 8245, 3300, -3955, -7687, -9484, -6619, -1547, 4798, 4535, 5010, 8937, 8375, 10655, 1571, -2131, -4294, 1170, 2852, -3762, -7047, 993, 12352, 17084, 11235, 14295, 18203, 9519, -1839, -6580, -4888, -203, 4511, 2312, -57, 5400, 6954, 12334, 13012, 16008, 12355, 9562, 1903, -2741, 1966, 2495, 1844, 9148, 14968, 15234, 12381, 5984, 1688, 3272, 6715, 504, -5530, -6497, -2978, 6568, 6886, 2985, 1003, -1458, -1364, -5950, -547, -2485, -6852, -4031, 3582, 4382, 3491, -1081, -13, 6363, 1921, 1121, 4919, 4747, -5505, -9371, -4242, 738, -3472, -7067, -7181, -1053, 2611, 5241, 10391, 10467, 12417, 13778, 1494, -5879, -6495, -3339, -1207, 3684, 3289, -2027, -3081, -558, -934, 1020, 706, -950, 3123, 9616, 6695, -2643, -3298, 2635, 7489, 5059, 6941]
7874F941k259o684k673p65L292N920K095l148n837L307L851J654k154k409l284
7859b153j03m866j156M230L94M749M262n638j024K80j092o121k767M782O446N945
7843F168J691K92m366n438n414M5j000P012k276j034L629k994j0268j222P301
7828g874K695Q746L093o312j3j141j910k569j232O039N946l412M48l248j357M163
7812B062k298k012O248M444k605n535k375p43m047O749n36j281O861m91j2947
7797h506j340J479o41J741J0006J082q664m986M803J36j886n278K545M120K570
7782b819K149J45N719j268q504m723M990R475L797j694j226m116r974o769p234
7767b2052N714J0794M917K251j925k455J566n578o62L238j038p725O43k691j905
$$ y = [6941, 4682, -2002, -4675, -5440, -2148, 3772, 5867, 2719, -3118, 189, 4040, 5694, 3540, 1131, -2153, -2256, -7122, -8278, -4048, -3654, 1095, 5357, -281, -1305, -1025, -2117, -8238, -11005, -6223, 223, 6168, 7859, 8151, 3785, -1653, -7067, -7022, -8022, -1010, -3286, -4320, -691, -3685, -13953, -15175, -7874, -5179, 3567, 6660, 348, 335, -806, -2716, -5285, -6517, -478, 5468, 2056, 2504, -744, -2101, 2062, -236, -2248, 4000, 8444, 5839, 304, -2071, -2814, -6861, -112, -648, -1929, 4932, 4441, -8506, -9846, -8367, -9008, -7267, 2739, 3821, -4843, -9829, -5026, -4890, -6776, -12054, -9509, -5389, -2819, -670, -525, 5194, 3926, -4578, -9301, -4311, 5164, 8961, 7267, 6041, 1925, -8049, -14818, -22052, -16338, -5544, -627, 1624, -301, -2756, -1190, -6768, -7430, -4192, -5230, -12955, -12312, -15003, -16908]
7752a6908p05O026O927j540l833K49J102M485L497l605k975K951L964l617O110
7737B128N799p340p89Q93m925k872M763J545k526J752J797L218N012j727l620
7722C108o26l013J687j786l614o905o92j931L796r16M895L917l190N626J678k614
7706e80j545k047n000m793M854R78M702L567n886k498N120L833o083Q25L188R762
7690H397M475k701m986k550m863l219O75M336k263m538j245k161P984K377j069
7675a351M926p01K085L618l534n880k318L632l349m855J203P07k928K538m948
7660a1155l731R766M184K963N693M179P622m056m152m394n748p473j22M008k856
7645e272l922l176L436J088M909P021K7j600J069J125L764o325n396M488J124
$$ y = [-16908, -17613, -11587, -4660, -6200, -10033, -9784, -8682, -4197, -700, -4305, -7280, -4329, -365, -3982, 2128, 7927, 587, -202, 691, -4234, -7106, -2343, -798, -3324, -1572, 225, 3443, 8455, 6728, 3108, 2482, -531, 1156, -630, -4244, -11149, -11841, -13772, -9976, -10892, -5997, -2080, -5270, 356, 2034, -580, -2125, -4172, -9172, -13965, -9111, -8133, -3431, 136, -5750, -8248, -3128, 705, -5378, -4553, -1365, 8397, 12872, 10171, 5185, 2635, -2228, -5447, -4772, -436, -2699, -7237, -8482, -10643, -2659, -282, -1351, 3575, 2874, 4959, 8577, 5043, -837, -3155, 477, -2872, -7727, -6524, -5817, -8745, -6207, -11155, -14886, -5120, -936, 2027, 7720, 11899, 19521, 15465, 11313, 6919, 1171, -6302, -6424, -2416, -5272, -9194, -12370, -8934, -7846, -2937, 4084, 4111, 2511, 3580, 4705, 8469, 2144, -3252, 1236, 2360]
7630B360M273p726l766M829J888J533n58J446q92n524L9L395J477q73r49K095
7614C047q502m833q74N182J599m392K620O956L026L389L184o420R27J896n738
7599A067r197K11R271N217m069l883J198o222M512M269k053J579M43L280K659
7584H282l255q802L165m541n004P224O044q45J49L323Q011p451r072k674O814
7569A368O560k148k000L545J515m194p303m030j943K336l05J797O723J825r330
7554e584J124N3L694Q368n848k208l988n545K485O717P83K785L015l402p69j547
7538A33J79J532N241Q33j168j316j901K525P078q67o488R20k748K54N594j832
7522G969n120q34k302Q03M2K454L317l945k817k941Q22K966j763p777p2R09Q903
$$ y = [2360, 6633, -1093, -4859, -30, 1858, 3391, 2833, 4279, 3387, -2137, -2098, 1297, 2774, 1901, 952, 3047, -5455, -10288, -11162, -5980, -4381, -8773, -6153, 803, 3829, 7218, 10402, 3982, 4909, 6805, 1067, -8130, -7919, 1352, 6569, 2500, -1383, -185, -6407, -1895, 2374, 321, 1900, 2343, 5623, 8282, 5027, -3775, -610, -5151, -10155, -2931, 3113, 2268, 2417, 5740, 13751, 6300, -2772, -5446, 1368, 7928, 5780, 3780, 7325, 8840, 4646, -2657, -6687, -8630, -6294, -6599, -4802, 1921, 3746, -5584, -4460, -4407, -713, 7655, 1807, -401, -4389, -9934, -7449, -732, 51, 2836, 5851, 2449, 1680, 133, 312, 1844, 7085, 7918, 6750, 5434, 3533, 6058, 13136, 12269, 5781, 6701, 3953, 4207, 9801, 7969, 2849, 2015, -287, 516, 558, 3012, 6329, 2384, -433, -3374, -2552, 414, -1349, -9126, -9198, -8289, 614]
7505F14J553M478j07j949m759j218L929J489j363p34k540p910j519L653n8p06
7489g147J37n734K951N141j099J631n20o64L824J951o842k075N411L222L153N96
7473C936r54R26l908k211K366L795K651m341m875K11p592k665R122J840M57n796
7457g038m932K263L111o071k952N909O657J580K317r13M939k341k548K511k618
7442a26o092m461L158j862M27N23M904J52j615L200K240n145l205n93N082m124
7426g537o588o82O660M981k67K475k822p154m064pk759J444J814J194J546K132
7410i634J546l624N69J39n162J268Q489J844n315K873M393J120L695L942q907
7395b764K38J432M395O33j418K166j56k397K599j354K345k775n279O54n092l581
$$ y = [614, 2167, 6645, 6538, 4589, -170, -1388, 2541, 4030, 2667, 1933, -607, -8517, -10036, -6383, -6441, -7147, -7010, -12744, -9793, -4652, -5751, -4120, -4640, -5304, -1480, 471, -6371, -8446, -3035, 187, 3340, 3936, 2982, 3908, 0, -2211, 155, 3950, 6601, 2260, -2615, -2404, -9996, -12661, -3539, -1699, -1242, -7038, -11970, -9707, -6596, -12667, -15619, -9710, -3053, -1473, 844, -69, 4870, 2529, -19, 2492, -126, -6218, -10679, -7521, -9383, -8956, -8433, -3529, -3377, -4992, -1792, 448, -4697, -7902, -8495, -3413, -7537, -14125, -14807, -8147, -3166, -3433, -958, -3780, -10934, -14998, -15005, -17764, -16320, -14506, -13312, -11766, -9634, -8088, -11712, -11143, -11004, -16166, -14898, -6409, -4565, -9880, -7007, -2614, -1494, 2201, 6143, -2764, -2526, -1094, 3301, 3934, 2516, 4682, 4526, 2129, 4728, 3374, 5719, 2944, -2335, -1681, -6773, -10354]
7379a0354N842r650j2256k136Q033J0046N835N015J414r97j867n846Q909L343
7365E331m253l101m8k266m042j349O469Q709j553k166k607M115o594m855L073
7350e137l30k20M015J871K54R482O678n326j658L692m191o034j832J36R99j000
7334A399j979K314J293L461o172o145O43k369M632M893r741J678m0k927K615M915
7318a530K202j482R21J130p79o958l491M384L401m197q631n044r17O339N630M587
7302d435J331O921k310p032n294l26K656J1693N830n708q471o013k00K841M034
7287d483j244p555m832Q510M597K940j734J065l340j355L48L745M37o15k995M24
7271f087N847K331m777m783l662J597J468j459o78O5m54J751m00J700m75Q98m165
$$ y = [-10354, -4512, -14162, -26418, -28554, -20521, -10475, -4640, 375, 1789, 792, -1075, -6921, 1988, 5331, 1078, -2023, -2071, -4337, -8379, -9728, -3259, 5450, 3897, 1731, -876, 3239, -3355, -8210, -5137, -5467, -5687, -1672, 199, 453, 9935, 16613, 11287, 9629, 13321, 9130, 3096, 1264, 1400, 2399, 1399, -580, 1734, 3027, 6488, 316, -5829, -5186, -7555, -2923, 1970, -7771, -6093, -6133, -9060, -6445, -1530, 672, -810, 111, 1241, 462, -6496, -9987, -5603, -2202, -6399, -15030, -20074, -20991, -14652, -9022, -4435, -3104, 3817, 1507, -5525, -10819, -11145, -8489, 3204, 9034, 3326, -5145, -11158, -11358, -8517, -4483, -5727, -13282, -18114, -9604, -5007, -2067, -3801, -2736, -6076, -7431, -7083, -3338, -2901, -3516, -6511, -6087, -240, 2091, -2686, -7469, -11131, -9534, -8066, -9525, -10203, -10138, -10592, -8841, -9241, -7541, -8016, -7118, -11283]
7254a1283o042k002M279J4277M53L650m537k194J966m218j07J120J941k74o76
7239c647O457j142k895l12m358J839O118m944L317O377k589m02l618Q52J44r027
7223g830j043o252J557R499L243K050L947o469k806n814j142M146j867J113L617
7208d051j133j1454j989K249N453K673j281K102R178Q874P19l874K300R49m44
7193A0271l903j265j194Q14L083L387K61O06m158p544r075K200J066N146J464
7178A159m498j176j548l078m232P90N913L207j306M737Q971j859o739r082R151
7163D10R11p899N318Q291j167l29k309L111L114l282r04n318M890L658K973O20
7147A2088o75r165j903J157j933m030l242O328O649N098j532n32j57n696K213
$$ y = [-11283, -17325, -19327, -15048, -771, -318, 3332, -1205, -3399, -1433, -5651, -5758, -4638, -2697, -2971, -3647, 2810, 1668, -1227, -1539, -5897, -4058, 2060, -2884, 433, 6810, 4221, 3819, 201, 1053, 1197, -7830, -8873, -15125, -13568, -4069, -826, 1224, 5171, -1298, -4104, -9918, -11060, -6914, -8781, -7668, -4051, -5184, -16638, -18627, -16378, -10925, -8252, -9533, -7431, 1747, 10621, 11340, 7466, 9766, 10715, 10271, 6368, 5103, 3909, 4723, 7806, 11193, 11454, 12060, 7902, 358, -8717, -6517, -5451, -305, 1159, -3339, -4515, -6063, -9141, -13373, -12583, -6670, -3463, -4769, -32, 8939, 7080, 341, -8741, 410, 1321, -6578, -1260, 7031, 5864, 5535, 3226, 6337, 9451, 6169, 5265, -53, 4837, 8495, 11468, 12088, 11413, 2248, 345, 1502, -431, -4461, -7703, -1375, 5274, 10372, 8840, 8308, 8151, 2455, 4668]
7132D668j691r348L559r99r3R881M712q51l363j2323m883K472Q396J560j748l647
7116c698k898M033J006m91l873j355M381O255j278n130k822L193m350q34k005
7101i866K826P627J714N767k558K264j949l897n368l796j934J453K191M225Q497
7086G196k191m409Q438J058o375m937O783L214l076n198K471o88k574j36o590
7071g014k157L841l80L682k865j714L139j393K738n136M011P315L738L193n127
7056E871r08m127n255L941l960q08j312l090l235K413P874O939P63m432o274J194
7040d406L92l043k17K976N140K023M9M769o43q991o058j289l368k702P860M496
7024c012J240M697M962L555k833p033m147k27R96L687j323J330J315J328n66K173
$$ y = [4668, 2977, -6371, -2812, -3811, -3904, 5977, 10689, 9838, 6475, -5848, -10731, -8259, 137, 1697, -51, -3698, -6596, -2563, -1557, -2048, -5921, -7276, -2895, 3360, 2082, -3048, -5870, -2677, -7027, -7861, -9866, -7040, 587, 2301, 8068, 5510, 7774, 5825, 1928, -3440, -7236, -9170, -7717, -5526, -1301, 7196, 5005, 596, 9034, 10092, 3717, -1220, 5563, 8777, 5701, 503, 2974, 2286, -288, -424, -7014, -9171, -5330, -5710, -2028, -4893, -6607, -3468, -4861, -2123, -7259, -3248, 4067, 7805, 10998, 5871, 4963, 836, -4419, -478, -4438, -5246, -6558, -9648, -12883, -10470, -2596, 4343, 5106, 674, -5600, -4406, -4014, -7057, -7274, -4298, 842, 2865, 2914, 7683, 7040, -1951, -8009, -9298, -12666, -15368, -7508, -3012, -1772, 2925, 7887, 11442, 8609, 1576, -2571, -2798, -1802, 1885, 562, 1892, 3207, 4535, 3969, 6142]
7008F142L401k453l03Q03p54K830J216m805r462K520n264l234k413J276J0652
6993A52J514l662L944K640O078k584L337Q05j1339n515k025N160l365n734J188
6978i406M711O300K4N870K427j599J118M64K760p22o989q993J794K113R80L376
6962D228J781j878q017K601K277K9K62k329N504L385o627L010j542n833K15l614
6946f548l670O481N683K211n353o03m984R09m241J654N668N99l849k765j528P047
6930c289P38p860J414P639j440k879R03p69l05J798K556J852k311j33L782N389
6914G085l03J213J734m194o381P23M152J360K963R459m896j617J2479K327j0112
6899A5992j0005l784l459j863j786M980L841m34l320L680M3l778L482o429j0617
$$ y = [6142, 9543, 7090, 6787, 7590, 6836, 9666, 10882, 6077, -3385, -865, -6129, -9363, -11776, -10500, 152, 1666, -1996, 1948, 4588, 10666, 8082, 11419, 12224, 885, -4630, -6655, -1495, -4860, -10594, -9406, -4695, 1605, 1629, 7499, 9926, 8327, 9445, 9909, 12669, 11947, 4958, -4035, -2241, -128, 852, 4228, 6009, 4131, -3886, -1285, 992, 1021, 1283, -1046, 4458, 7843, 1216, 4226, 2684, -3149, -2934, -6548, -10218, -3737, 1946, 4157, -1196, -1799, -6783, -5874, -10115, -8461, -2793, -2194, -6043, -8808, -10336, -3289, -2551, -10411, -8997, -1358, -2798, -5677, -4774, -5543, -5848, -4050, -1494, 358, -1953, -2086, 1696, 7085, 6782, 7995, 9729, 5535, -846, -123, 4029, 5389, 8352, 17811, 12915, 11298, 23777, 26104, 15992, 5987, 2203, -1256, -3119, -4905, 75, 3916, 3482, 162, 3842, 3885, 107, 3589, -2840, -13457]
6884a3457P36R750J486m902j36N379P116n956j465M608l285J998K195o70k302
6869A095l226j382N183K368k730K713K954J433l252k51k806j0296j530O743O525
6854C541J42o067J097L883J169k040L933L082M663K192j317J227l984m969j428
6839E124K337O105O11l059k272n644o582m10L15L870k570j162l83J989K495J886
6823B650k012J664m012m355r31j281Q370o41j334J315k080n412N165K765N682
6808E553L4m607J063N144K158m981n779N52j149J374Q620L875j680j594m321j771
6792B491P53l253K719P377k36L012N20Q418N629Q759Q663q821j0952K208j308
6777B5979m991m511K420k037r15k211p64N723m611J127P92k061L782J1270J019
$$ y = [-13457, -12721, -2971, -1485, -6387, -6523, -1144, 5972, 16, -1449, 3159, -126, 1872, 4067, 3397, 1095, -2131, -3513, 1670, 4038, 1308, 4021, 6975, 8408, 5156, 4905, 2099, -8197, -9727, -2984, 3541, 3683, -2384, -1287, 2596, 3765, 1725, 5658, 8740, 13403, 15595, 14278, 15505, 11521, 6552, 5124, 7461, 13566, 14177, 11118, 8846, 3202, -3380, -3790, -3475, 395, -2175, -3337, -3720, -1731, 764, 2650, 638, 2302, -1710, -6065, -6996, -8277, 93, -548, -1882, -567, -2647, -8059, -2894, -129, 5553, 5587, 980, 2043, 7187, 9345, 4364, -1415, -863, -2012, -638, 7982, 11857, 10177, 8583, 4262, 2491, 3244, -9, 2710, 10087, 9851, 12863, 13383, 21801, 27430, 36189, 44852, 36031, 25079, 27287, 25979, 20988, 16477, 18897, 16860, 15945, 13734, 12970, 18693, 14082, 15209, 16001, 13940, 17722, 28992, 30011]
6762C0011O516Q994R776J7108J3044J0003O895P843R158J4631J4889L700k1510
6749A31058l5535k7601k1281j6962r642o153m277m415r219j881R105L901k581
6736D517j554j254l530M232J1159L75k865q723m115P81m096M481K208k818K044
6721H42P121j455K85L793n641j777k906j452k94j284K363J332P214K273r52p490
6705A972K895L449J646k004l734j841J727k195L146p51k041k366O683J74j3377
6690f617l165R523J623J055J46n864k519L379J61M135J107k658j330L631m307
6675a700m83M44l47K822K476N611l404m111n945n926l420K700N216K781k070j0289
6659a5645J181R363P401K336m566o545n145L140J484M110M78l044Q30j033L026
$$ y = [30011, 36527, 45521, 55297, 72405, 85449, 95452, 102347, 110190, 119348, 133979, 148868, 152568, 131058, 95523, 67922, 46641, 29679, 20037, 13884, 9607, 5192, -4027, -5908, 3197, 7098, 4517, 2963, 1709, -1821, 2411, 13570, 13945, 11080, 2357, -1758, -977, -5073, -592, 1616, -1202, 842, 7963, 6508, 6793, 10586, 4945, 3168, 262, -1190, -1484, -2768, -405, 927, 8141, 10414, 9462, 1972, 4867, 8316, 9962, 7958, 4224, 2383, 4110, 1915, 5061, 4310, 2269, -97, 6586, 6760, -6617, -9782, -259, 1364, 2419, 2565, -3299, -5818, -2439, -2278, 1857, 2964, 306, -1024, 2607, -1700, -2183, -1739, -2086, 736, 3212, 8823, 5419, 1308, -4637, -10563, -13983, -11283, -6067, -3286, -5356, -15645, -14464, -5101, 2300, 4636, 70, -6475, -11620, -8480, -6996, -2886, -2408, -5452, -4622, -5655, -2629]
6644b629p341p51L14N140j490j734o725p933N303J3251R448l127m753J865M549
6629C387L95K982m483m227K908Q09p667n757N644J999K995N81L109m008J66Q59
6613c08M26p141K29L313K700J296L16L641q52l064k740L700P95m220k472j374
6597e755J505Q174j526q566m51J057m71J867K455L233J781j742n403j746J044
6582d544q0O931M184j578R37J836k22m399J108K82p63L117p266l820J599P736
6566E058O62n611J29N785l178m598K5J677j586k979O46K356K623m75j258k290
6550c014O97K075L54N53n422j793m034J896k250L200l455M216K264M848m3l859
6534c767J475N190J867l927k230r08J104K365L849J552p580k631N961l49q430
$$ y = [-2629, -9970, -10721, -10407, -5267, -6757, -8491, -15216, -23149, -17846, -4595, 4853, 1726, -3027, -1162, 3387, 3782, 6764, 2281, -1946, 962, 1771, -5896, -11653, -6009, -4010, -1015, -434, 2675, -1333, -1167, -308, 118, -7023, -6794, -3481, -781, 515, 831, 4472, 3620, 556, -2184, 1516, 2311, -1909, -4381, -5755, -4250, 3924, 2398, -6168, -6619, -5562, -6033, -4166, -1711, 1522, 3303, 1561, -3842, -5588, -4544, -4624, 2307, 6491, 4913, 5850, 7686, 7464, 3065, 4173, 4455, 3692, 6809, -457, -4277, -2678, 5058, 5720, 109, 238, 6023, 2845, -1753, -1728, -51, -1637, -4616, -3970, -1614, 1009, 534, -724, -3014, -2317, -242, 112, 665, -4757, -6550, -10584, -8688, -10938, -7738, -11193, -6977, -4713, 135, 92, -3767, -2292, 2898, 4765, 838, -1392, -2300, -1196, 1169, 5018, 6570, -1010, -3641, 2320, 1971, -6459]
6519f459m033m79L208N018j238r13j096k160J507L567R55M09p146J063Q77j625
6503h545Q79K891n016o995j732M253R654J364o430K439K69N888N776M254L668
6488A2617j210o997k885k004o408k109J982L472l406k8q24N665R395Q59j0615
6473b496n471K344L40k118N307O609l53j301P58m6l812o285j521K851L753k226
6457c667o275j979N044J898l686k599N609L29q111k323J1626R124k48K341N894
6442A2977r50j064n822q53K070n397n237L059O566M64p682R14k851J341N814l610
6426b61J338p46l194K56P783j0157m169J510l199K392J744L723l976L042J510
6411b404M056M090m545P001m76k423k803k307m370j496O305j53R77L266N926j761
$$ y = [-6459, -10492, -10971, -7763, -2745, -3983, -4896, -5992, -8152, -6645, -3078, -2123, -1714, -8860, -7797, -6920, -8545, -7666, -4775, -9791, -16786, -18518, -14265, -4611, -3247, -9677, -7238, -6969, -1081, 4695, 8949, 12617, 11407, 4410, 1525, -479, -6887, -8996, -7014, -3542, -6948, -6976, -7800, -2135, 7260, 8119, -2496, -7967, -5623, -5283, -7401, -2094, 4515, 4162, 2861, 3619, 3573, -239, -6524, -8045, -5194, -1441, -3667, -9942, -11921, -6877, -4979, -8665, -11264, -5655, -5326, -13437, -15760, -4134, 4990, 4742, 7083, 12977, 12027, 10963, 5141, 4288, 6358, 961, -4276, -1217, 5349, 5813, -1869, -955, -3806, -2465, 3349, -261, 1077, 331, -2863, -2607, 5176, -4981, -9150, -7640, -10839, -8447, -6703, -2980, -6956, -3914, -2404, 1652, 5742, 1197, 8198, 7722, 5299, 2496, 189, -4181, -5677, 628, 475, 1452, 4718, 10644, 8883]
6395H883p606l246J196o838K728N756L052l376m640Q161K100L311n544n079N55
6380e87l276l611J709J556M498J479n624k642K733k090l465J007R6K311l191j269
6364a0366Q299J0151K776k245j0223n23P65l057l068K537q84m885m91k563K295
6349a1482J324k198m599K848P798Q812j632Q52M231l211o035n371k572J482O149
6334c604J3260k376m082j748K394j3850l763k186K779M545k469j700J1180K345
6320G25q882J66J207O728K087L312K304l890M018r77k673o063n431n37M454k036
6304e488Q45j511J468R68L323q63J262n722q398o04K692m96k887K201L894J501
6288g815O40N751j203r188m5K021k784j408M815j124M908J3010l431n582l337
$$ y = [8883, 1277, -1969, -773, -7611, -4883, 873, 3925, 549, -4091, 4070, 6170, 9481, 3937, -1142, -587, -3863, -7474, -5765, -4209, 289, 1768, -3856, -6498, -3765, -5855, -9320, -8313, -8217, -5906, -9097, -10366, -2067, 8084, 10860, 8615, -1608, -2131, -1366, -4423, -7491, -4954, -5838, -10723, -11214, -13777, -11482, -10158, -12356, -16955, -14107, -6309, 2503, 871, 1723, 5954, 2743, -3292, -8663, -11235, -9753, -3604, 9656, 7280, 3198, 1450, 3844, -10006, -13769, -15955, -13176, -8631, -11100, -12800, -1620, 725, -8157, -7991, -6784, -56, 2031, 5343, 7647, 3757, 7775, 6798, 4125, -1938, -7369, -7906, -3452, -5488, -4643, -6154, -4686, -3718, -395, -1258, 4, -5718, -14116, -14720, -12028, -12524, -15411, -13210, -9316, -7815, -7175, -1424, -2627, -11815, -11860, -9839, -12623, -14031, -9216, -10340, -5432, 7578, 4147, -1435, -4772]
6273d772m161m150k313n567M134M819J003J924l404k617K52M737O542k999n953
6258a2525m318O750N953M156j057n740l175M71L35n180j045O949l726l066J474
6243a3744K625j709o808M30J2560N660M847l116j0658l077J531J224K550M085
6229c600K110m142l727N398M045n429K604J495L52L773l134K26J002L7o2m902
6213c954Q52R707Q072j923m184J78n682n767p744l1k085K115N459j180o886k11
6197a3264L573R234M197n215l066J532O149q75k721K632n671p830K477O269q71
6182c450k874M241l12J068n599m541k888M189j857M277Q468J182K764j755k626
6167B87R52J587Q98K124L493k394j240n481L815k485l461Q37P216J116l044R27
$$ y = [-4772, -8933, -13083, -15396, -20963, -16829, -12010, -11007, -9083, -12487, -15104, -14852, -10115, -3573, -6572, -12525, -16843, -10093, -4140, 16, -1041, -6781, -9956, -9485, -9150, -14330, -15375, -8426, -12152, -15218, -13744, -11119, -12828, -19636, -19206, -6646, -986, 3861, 745, -9913, -12990, -11459, -10235, -7685, -3600, -1490, -5632, -9359, -3961, 84, -5345, -2741, -1246, -894, 2879, -255, -29, 973, 1010, 948, -3954, -3102, 6605, 14677, 12754, 8570, 8748, 3066, -2701, -10445, -10476, -12561, -10446, -4987, -6167, -13053, -13264, -9691, -457, 3740, -1475, -4541, -3009, 3140, 2265, -456, 2176, -3495, -11325, -8848, -2579, -3450, -6324, -2083, -2395, -1327, -6926, -11467, -14355, -10166, -12023, -7746, 722, 1904, 4668, 2913, 287, 1239, 2826, 3724, 5848, 9341, 6947, 5707, 226, 4041, 1556, -1905, -1068, 6148, 7264, 4220, 5147]
6151E147m575k79P071j390l783L829O13m278L320J069p19k4n25n420j0095M000
6135f039L085l434r09l688o86O315J424K263M7l584l665m300Q167P859j336K974
6119D493Q201k305L752r054o47K124N49n554k308k084n594j11J256k066J407L307
6103d634K849K754K047o038q904l677N648J0378O902J187p824Q5r51n85j385J421
6087g27K038j668M922o84m566J864M648k263M76p074K659l599M865L156n258l172
6071d383j099J591k364j952N697P344P166o70l680k369Q891K910m627j1857k398
6056a800R07q481k065J593R010N408N841m570k219n879k32N936M93p89j923l936
6040b706k437L335O163K058r6q033J303K366j345k373r36Q42N134L796N76o69
$$ y = [5147, 572, 293, 7364, 5974, 2191, 6020, 6633, 2355, 5675, 6744, 6025, 6001, 5476, 56, -10039, -6039, -2954, -6388, -7297, -10985, -11671, -5356, -3932, -1669, -1622, -5206, -8871, -13171, -5004, 2855, 1519, 4493, 12694, 10389, 14141, 5087, 4440, 6564, 7113, 1559, -749, -2833, -8427, -8538, -7282, -9348, -7941, -4634, -1785, 969, 3016, -3022, -11926, -15603, -9955, 423, 7325, 8512, 688, 773, -178, -763, -2148, -727, 1311, -357, 4565, 3881, -685, 1179, 5827, 3564, 4040, -3034, -375, -3974, 891, 4047, -1211, -4383, -5482, -3891, -6255, -8207, -2510, 4834, 12000, 11330, 7650, 5281, 14172, 17082, 12455, 598, -1800, -893, -9374, -11439, -9846, -836, 4572, 10413, 5843, 3624, -2255, -2487, 3449, 3942, 3153, 1230, -2706, -5143, -1808, 4355, 6413, 6317, -1716, -413, 1953, 608, -1765, -2701, -1859, 3275, 7071, 7647, 6978]
6024F978j291J930m286r17K003j502l960q164N57k754o95j500L77L868J431j955
6008i880L38k069J061O837N226L540K373N349k747j1803n433p515K927N360R68
5993e468P556j400n726J991L007l390J18l884N355L071l867m322k109J771N444
5978a853K043j329m680j060M689p48K215M911O51o858k057o093o75P410O432M158
5962G156J720l746K22m901o4j341k263M575L204J950j032l853p947M40M747l364
5946d497m810N551q0J790k166P682L682j198o806l201Q63m137M172k739N290P093
5930F489j728n567l852l009j096N327J026J836n0K341J173K65m39m243M394N887
5914H754q87j1952j1540n434M991R890N887P010k921M207N212m651o169N42q62
$$ y = [6978, 5687, 7617, 3331, 2414, 4417, 2915, -1045, -9209, -8652, -11406, -12101, -13601, -13224, -9356, -7925, -9880, -9542, -11611, -10550, -3713, 1513, 5053, 7426, 12775, 10028, -1775, -7208, -14723, -11796, -6436, -5468, 2088, 688, -5038, -3047, -40, -3430, -3312, -7196, -1841, 1230, -2637, -6959, -9068, -7297, -1853, 190, -1139, -5819, -6879, -2190, -2938, -723, 4188, 4839, -2019, -4076, -10169, -10844, -3434, 2998, 7156, 8876, 5130, 5352, 451, 387, -954, -3217, 1358, 4562, 6512, 5480, 1627, -6320, -5880, -1133, -4497, -9307, -3756, -3836, -2046, -4212, 3470, 7152, 5954, -852, -4053, -3190, -7327, -3155, -5894, -604, 6489, 4761, -806, -4658, -7667, -8763, -3436, -2410, -574, -624, 1717, 2890, 3155, 2716, -1527, 2867, 8754, 7867, -4085, -15625, -21059, -16068, -6178, -291, 6719, 3798, 8005, 13217, 8566, 2397, 2939, 2077]
5899B077m513k073j291L009J921O675O50m896L13K821m839m50K525L946q936l379
5883f440R206O644p311m249K956M44K47n572l829M212K065p131j89M051L406j490
5867b980j499n57k787L443P572j886p69j1700L203J2289M428m719m055J340N357
5852F680n238m969K367k305J969Q54o014l424N434K104N58M24n033o206l014L656
5836a2157P375R98q897K547J0566j019p002N472O659n70k662n905r05M575K267
5821A342J154R71L549j763m027p18P067L847j0639j0992N72l380N722O043k135
5806c387K625K211K439M83l057m786j733m487l991R188Q372j770j2844o594P250
5791a0081P680k804o34J607K720J268K096Q5L450k521j0063j989m706J553R289
$$ y = [2077, -2436, -4509, -5800, -2791, -870, 5805, 6455, 1559, 1872, 4693, -146, -596, 1929, 5875, -3061, -6440, 2766, 9410, 2099, -2150, 806, 1250, 1497, -4075, -7904, -3692, -1627, -8758, -8947, -4896, -1490, -2980, -4479, -5036, -7823, -4380, 3192, 1306, 537, -11163, -7960, 4329, 8757, 4038, -17, 1323, 6680, 1442, -3527, -1160, -3465, -1496, -642, -6656, -10080, -4646, -2542, -1984, -1560, -6593, -12799, -15813, -12157, -4782, -3784, -12681, -10134, 432, -587, -7589, -2117, 4542, 3972, 1310, -4595, -5500, -925, 1342, 2496, 3467, 7016, 5253, 1226, 508, 7575, 11422, 783, -10209, -9637, -13017, -7295, -1252, -3387, -762, 1449, 3888, 4371, 1314, -3472, -5205, -9692, -13683, -4495, 3877, 2107, -10737, -17331, -10081, -2401, -5205, -5839, -4232, -1512, -244, 1852, 1937, 5387, 2866, -7197, -9186, -13892, -12339, -3050]
5776c050J400J519K287l518m070l119J509N240O856R02k42p541m535j127K7M753
5760b709n17k080n38j905l030j993L199K720j242n607M527Q337L450N21K918N854
5744A1905q556m991l25l069M057O889l892m580P2K343n8K371j862J392m452M878
5728B122K047j837k153m296K547Q208M315k182n962k280J876L934J83O09j554
5713E577o165k798K371K870j635k916p197j186J2438M766k377J761k877k977j159
5698a504o523Q63M916M928j11R92l520q17J198J905r05R5O02l179r63l19k567
5681d909k678M146L154L093m445j466L342K270K950j829K652m845q072K947L879
5666A89k842k916m202J557n817K354P564N066P217j414o607n334O880j671j790
$$ y = [-3050, -1650, -131, 2156, -1362, -5432, -8551, -7042, -1802, 5054, 5956, 5714, -1827, -6362, -7489, -7462, -2709, -3226, -5306, -5844, -7749, -10779, -12772, -9573, -6853, -8095, -13702, -9175, -838, 2612, 3133, 6051, 11905, 3349, -1642, -1967, -5036, -979, 5910, 2018, -2562, -2490, -147, -205, 2166, 304, 1696, -2756, 2122, 4169, 2332, 179, -4117, -1570, 6638, 10953, 8771, 2809, 529, 2405, 6339, 6522, 7131, 5577, -588, -3386, -1015, 1855, 220, -2696, -9893, -11079, 1359, 6125, 3748, 5509, 2632, -345, -1504, -8027, -7164, -2248, 2680, 2569, 3561, 41, -776, 422, 2327, 1422, 1517, 2119, -1060, -2023, -2342, -4909, -7587, -3441, -287, 2806, -1639, -3105, 237, 2507, 5457, 3628, 6280, 1435, -6637, -3690, 189, -2653, -5569, -9771, -8214, -14031, -11677, -4113, 953, 8170, 6756, 149, -5185, 1695, 24, -1766]
5651a766q443m032M567J206n176N568O051J04j512j13O829J347k792P19J262K555
5635F374K45p789p848j528J628K49m05R41L457l217j721L101K31p33O958J691
5619A634O201N98m85q870k527m28J210M813L583k563J015J238J93r72J647r47
5603E340k707J158k335M090O70l46l880n359O346M08n772k672J551N099O663J12
5587H366j234p19o796m635l353K185r52J71o221L397N651O555Q536n566N77k585
5571C377m634L172o04m554r67Q78J148o72m260j713M144k205l818K141P918j891
5555b540k533m039o699P234J127J219M693O549j14r631J327M033J320L715K247
5540G908k955r932o686L55O600P61j903J953j144J927P575K568j416k67q351j789
$$ y = [-1766, -10209, -14241, -9674, -8468, -13644, -8076, -2025, -1921, -3433, -3546, 3283, 4630, 1838, 2557, 3819, 6374, 6619, -1170, -9018, -10546, -8918, -8669, -9074, -8133, -4676, -7893, -9614, -6513, -6282, -7015, -57, 1634, 7835, 8433, 7948, -922, -3449, -3877, -2667, 2146, 5729, 3166, 4181, 5419, 5612, 4640, 6287, 5340, 2633, 3791, 1456, 5546, 6216, 5870, 1990, -3369, 2977, 3385, -2387, -5059, -3508, 1591, 8254, 8366, 7132, 6413, -383, -5018, -8371, -6186, -7138, -6967, -13188, -9791, -4140, 2415, 10951, 5385, 5962, 3377, -1257, 1915, 1311, -3243, -4210, -3332, -2184, -2856, -7116, -8829, -4685, -6890, -10708, -8567, -649, -2540, -5073, -9112, -15811, -8577, -7450, -6231, -1538, 5011, 4897, -4734, -3407, 626, 1946, 5661, 7908, 4953, -4979, -11665, -11310, -4710, -3949, -5852, -3899, -5043, -3116, 4459, 7027, 5611, 5344, -3007, -4796]
5524d796P064P137o187p727m948J968l953J355L394k33j45J670j901j006R81K911
5508d416k900o110k073P791N012o180J055O025L111K398q97J298K633L413p46
5493I414o720m899L058L234J248J908K741j564j979m556r39k79K324l654p374
5478h037L749Q514k646l232m576r98j200J433k192Q854K60j0193m119k437P690
5463i130K034k838J630K548j184k72k925j335O080J1850L47J115m962P75j546
5448B187j0583M015L025R41L864L183N727M598o173n032o838O091P285j866q585
5433A839K814m92M08K50N100J529o826k090m71M7N112j648l017p966j351N851
5417i11N615Q698P4l099n172q269n031K820L98K473R548L727M279M073r407k460
$$ y = [-4796, 2268, 9405, 3218, -4509, -9457, -7489, -11442, -10087, -6693, -6926, -7071, -5401, -7302, -8308, -7327, -4416, -7316, -13426, -15499, -7708, -2696, -8876, -7821, -1796, 1315, 3713, 2816, 4114, 6747, 10160, 9414, 2694, -2205, 853, 4087, 5335, 7243, 9984, 8420, 6441, 1885, 946, 667, 2991, -663, -8037, -4288, 4226, 1580, -1652, -6228, -7226, -8426, -6993, -9185, -331, -71, -10264, -14383, -16820, -9130, -7096, -9934, -8304, -5756, -6940, -7212, -10137, -11472, -5392, 6458, 6805, 7920, 2958, 3733, 2187, -8396, -4381, -1356, -415, 3449, 6632, 12359, 16957, 10784, 5752, -1086, 5005, 12290, 10424, 1839, 4653, 4161, 4569, 4819, 9919, 11448, 4622, 2532, 2061, 2108, 7220, 5572, 2555, -5411, -6762, -911, 4704, 13402, 13476, 10377, 5205, -3064, -8095, -5275, -4877, -2404, 7144, 10871, 15150, 19223, 9816, 7356]
5401G356p640k049k312J0016m187k031o971k385l158m833K177p06l558L199J3455
5386c627M847M619n53k548m562K222r02M994l92o091j088j134J094L789m88N980
5370F160j313o853p103m856K001L928L651j0532o803J56J991J040P906O546K122
5355a959q181L481o067l523J999L952J149J790M146O607l100l961j245J537P316
5340C941N86m373l774n28M333r96n558j788M644Q676K959k254j454l266P33j932
5324e1r16L101k198L98K466J800j355o101m01n68N484L019n117o726j695M055
5308d805j833m677K363J599O91k881o70Q912J1325K230n395M82j546m531N31O43
5292B438R037p352j676M239N133R74n120l974j821J253m439j399K012l895J696
$$ y = [7356, -284, -2333, -4645, 5371, 1184, -847, -7818, -10203, -13361, -18194, -16017, -16723, -20281, -17082, -3627, 1220, 5839, 5286, 2738, -1824, 398, -504, 4490, 4098, -1993, -3081, -4215, -3121, 668, 180, 6160, 4847, -2006, -9109, -13965, -11964, -8036, -4385, -14917, -21720, -21564, -19573, -18533, -10627, -4081, -1959, -10140, -6659, -12726, -16249, -14250, -10298, -9149, -7359, -3213, 3394, 294, -3667, -4912, -3375, 3941, 4527, 154, -3620, -4148, 185, -811, -6369, -8157, -3513, 5163, 8122, 5868, 4414, 1148, 1881, -51, -967, 2134, -64, 334, 2800, 4600, 3245, -2856, -3257, -3825, 1659, 4678, -439, -7165, -8860, -4805, -6638, -11315, -8952, -7353, -6662, -9543, -10213, -1301, 10024, 12254, 6859, 7341, 5795, 1264, 1795, 2438, 11475, 4123, 2447, 6686, 11819, 12793, 7673, 3699, 1878, 3131, -1308, -2707, -695, -4590, -2894]
5277b894K293j11n222O22M427J352K724L323k555j162J07n460L886N35J78l282
5261a239J677q91l716m372k8O145P3j760M88k514j519m216J92K826K459L602J422
5244a371L349O066J187q615n911k659L532m48p621r641O334P261K230k142N323
5229c126L586L387j247j598m791O426L374k253l324q44L938J345l5n019l679L421
5213d39J924n342J884K669k711n357m466o399l443L110J229J77O646O71m817n58
5197a5222O685R506L151o663q179l510Q19l955P586L779k402k995R58j068k65
5182a1775J586R402K272L158j399m422J506J034J795j0707j613K999k197k842
5168a1203K331N649l25k327K771M729n344l01O749l757l695k551m497K379K982
$$ y = [-2894, -601, -712, -5934, -5312, -885, 467, 3191, 6514, 3959, 2797, 2904, -2556, 1330, 1865, 2043, -1239, 438, -453, -4169, -8541, -8569, -2424, -2351, -4111, -3623, -6137, -7656, -11872, -11680, -8854, -6395, -2793, -1371, 1978, 8044, 9231, 616, -5295, -7954, -4422, -4870, -12491, -22132, -15798, -8537, -6307, -8449, -3126, 460, 3847, 2600, 1002, -3789, 2637, 6011, 3758, 434, -410, 3528, 4873, 4838, -181, -3860, -439, 1485, -3857, -1973, 696, -2015, -7372, -11838, -18237, -21680, -18570, -17341, -17164, -10518, -9847, -14664, -15222, -8537, 969, 4120, -2543, -10722, -14232, -13413, -17368, -9782, -6003, -8405, -11400, -10442, -11510, -11775, -10189, -787, 1485, 4643, 3244, -1178, 328, 1362, 3157, -7550, -9163, -6164, -8361, -11203, -8872, -3223, -3548, -5875, -3104, 1625, -3719, -4020, 2729, -1028, -4723, -7274, -11771, -9392, -6410]
5153f410K22o58J519O92J904M357m104O05P184K667m420p999l083N102O118J105
5137D801M7q657l557N014j086O33J157J095N929M17j3911o416R039P077L257N53
5121E392J119k305k735n031P74k301o065M865K420l10K136N517L633J959K545
5106A1613o077n284J294J579J152p86n06p74R50L599n78l477n068N746N497J557
5090A0437o894j963N706m850j4826K474R671j71k560J760K365o17q14L309L5O626
5074I688m654n566K557J315p525l551K391J939j333M319P564L600n51j817p07
5059G669n177n402k915o555j65M886N158O191j612n601n287M467L031J476o800
5044f636L75J936K636N972J884m728K808Q655k780j2820q605N486M511O58K369
$$ y = [-6410, -6188, -6846, -5327, -4635, -2731, 1626, -2478, -1873, 5311, 7978, 3558, -4441, -7524, -2422, 3696, 4801, 4848, -3809, -7366, -2352, -3438, -2805, -1648, -553, 5376, 5793, -8118, -14534, -5495, 1582, 4839, 5392, 6511, 4206, 1471, -3560, -2786, -5087, -11152, -6287, -3867, -4177, -2041, 3476, 7109, 9068, 11613, 5536, 252, 1546, 3125, 4277, 3491, 2985, 2211, 3161, 6760, 6182, 2705, -2363, 3383, 8880, 10437, 3543, 1580, 7286, 2436, -12390, -9916, -245, -416, -2976, -1216, 1149, 532, -282, 3027, 3062, 9688, 5034, -532, 2025, 3340, -4185, -7736, -5345, -3406, -4739, -420, 7144, 10744, 10193, 8376, 7669, 2492, -2910, -5825, -12380, -12545, -7659, -2501, 3690, 2078, -3523, -8810, -4343, -1312, 164, -6636, -6261, -4325, -1689, 4283, 6167, 1439, 4247, 12902, 10122, -2698, -11303, -5817, -1306, -648, 1721]
5029A721j662K064k532o560L862N548j132p00N47L555J23n886o23K83O750j633
5013C725K96k342q20J529k205k299O239k355q026k528N45N594l99J693L464L305
4997E416l820J460M809m446p270R37L362P04k601k074j519j08J512p05P869J237
4981D763O693j625n147k920n0p511k177O147j494K828J328o27m935L300p79m88
4965b694k315k384K781l815M74O524J497l93O45J218J337p078N464l775n585M217
4949c882j873K202L498n53R99N635L972m791q95K049j606k602R27L079k18n466
4933D75J718K142r329O70J4402O567n424j136j99j94o765p428P31k271o079N53
4917a1567p64n869J0501R034K958K12L765L519N23q4p519o621J987P489l968k161
$$ y = [1721, 59, 2123, -409, -6969, -3107, 2441, 1309, 609, 1156, 4711, 4834, -1052, -1675, -1392, 5358, 3725, 4021, 1679, 859, 2388, 183, -2116, 4123, 1768, -6258, -8786, -8241, -2647, -3046, -1353, 2111, 5416, 1596, 3056, 7865, 3419, -3851, -2914, 448, 1152, -1449, -3523, -5042, -5150, -3638, -4343, 3526, 4763, 11456, 9831, 4684, 1764, 1714, -5797, -7974, -1827, -3321, -493, 835, 208, -4727, -1427, -2206, -2694, -5009, -7393, -4612, -8427, -7953, -1429, 68, -325, 320, 1538, 2875, -4203, 1261, -2514, -8099, -3882, -5755, -3553, -55, -608, 391, 6026, 9998, 5207, 4312, 6361, 4755, 2153, 3080, 6159, 5941, 475, 2193, 4335, -4994, -4324, 10078, 16645, 11221, 10085, 9886, 9692, 2927, -4501, -3770, -6041, -12120, -11567, -12331, -18200, -7699, 1335, 4293, 4505, 8270, 11789, 12312, 12228, 4709, -1912, 75, 7564, 3596, 1435]
4901A435J980j63n583k936R165J641j4537n382J0013O930j821j264M29K367l521
4886a247n287K329j476l219r158M697Q831j26o243O889k06L063j829K793k73l535
4870c997o554o244J432K619K23q33J645J131P335L633n646L205N261k503j1826
4855a1119j360J16j735N647P192j471J001J205l573K38r4N965m107r581N296L046
4839c334j439m540K157Q718P290L25r34K457l651M28m694L546J692k715l146M188
4823F348K758J688l673m307k478L895j734p938k122p173O292K151M884K653r52
4808B92n081N847J893L81o606J160Q479l391k814N738l467n283m214j096m317
4793a2479q084k395O907J2640Q145r897K534M274j436j146r46K412N739K02m119
$$ y = [1435, 3415, 3252, -2331, -5267, 3898, 5539, -8998, -14380, -4367, 2563, 742, -522, -93, 2274, -1247, -6534, -4205, -5681, -8900, -18058, -13361, -4530, -4656, -10899, -4010, -4216, -1153, -2982, -189, -462, -3997, -10551, -16795, -15363, -12744, -12521, -13354, -11709, -10578, -3243, 390, -5256, -2051, 3210, 707, -11119, -12479, -12363, -14098, -8451, -1259, -2730, -1729, -524, -4097, -3859, -3953, 2012, -2095, -11676, -6380, -3334, -4773, -9313, -7156, 1562, 8852, 9177, 8243, 10700, 7049, 7477, 2783, 6329, 8021, 5306, 2160, 6348, 9106, 10794, 7121, 2814, 336, 4231, 2497, -5441, -7563, -14736, -8444, -6293, -1409, 1244, 292, -4789, 1058, 2951, 3332, -3274, -2114, 6365, 2974, 160, 5898, 2431, -2852, -7066, -8162, -12479, -20563, -22958, -16051, -3411, 4734, -5163, -2629, 1645, 209, -937, -1883, 529, 6268, 6470, 2351]
4778B351M487n442j156k721o249K350R159M901J168J935K871p309m931p307q391
4763a4284N946M733M895M04n323n09j498k06m492M819N588N712L985l791q21J773
4747F931K532l285p393l401M819n598p231J946j593l101N258Q260K905K660m361
4732f52m097J976O287J253M44K058j782l01q37k910j49k678p19k258k339l82O058
4715a028o26l996R4N086Q33o837J102m678J893N873l36M731Q292j589p508r32
4699C74j270j305n30J577R675m905j0180n17M177l609M315J947L597J306j892
4684B760l108j707L666M775K186L28m716j160l557l144PP654k949n815K698M437
4668B355J46J944q64o84k357k892j241N153M275p184L651k66K465j574k967k752
$$ y = [2351, 6838, 1396, 240, -2481, -8730, -6380, 2779, 7680, 8848, 10783, 13654, 6345, 1414, -5893, -14284, -8338, -3605, 1290, 1694, -3629, -4138, -5636, -5842, -10334, -5515, 73, 5785, 9770, 5979, 5158, 6931, 9463, 6178, -1215, -4616, 203, -5395, -12626, -10680, -12273, -15374, -10116, -1856, 1049, 3709, -652, -4749, -2773, 3514, 4767, 5211, 7269, 5487, 5186, 4349, 1439, 1290, -1388, -2107, -4365, -6704, -7086, -1028, -1654, -5650, -5556, -470, 363, -6474, -5372, -10050, -8157, -2284, -2620, 2111, 10403, 8814, 1306, 374, -896, -2201, -2731, -1154, 8521, 3616, -6564, -7081, -2904, -6513, -2198, -251, 3346, 4652, 2760, -348, -2055, 1611, 6386, 8572, 8900, 4184, 3024, -533, -3677, -3670, 3984, 1035, -4780, -2082, 2355, 2501, 4445, 3581, 2897, 540, -2352, -3593, 1560, 5835, -1349, 2302, 2036, 4501, 2927, -40, -2792]
4652b792k3M957m409l672k030M425J026n199j101L654N686M605j268n298m65K885
4636I81P47l324k798L291J027q327n20K045L612K05m71n074Q421M607L912k577
4620E757l617K430J527Q4L586L746l452m06l204M77j915j152n059p457N062O936
4604C343L716l81k943r95q96l334M102K230k350l478q54O128p267q946j070N730
4588g265j924o716K887P480K13R03Q1Q105K654J375j063l241j269m382k160O65
4572c657Q9J644M920n336l683N024L847K455q82l000N93N974M676r075m516N329
4556D402n983p997L828l253O2Q731P498L949m020n133m430r53J53J364K109Q88
4540A215j524l093p252J475J156M451K264j3635K671Q270R20k596l117j908Q393
$$ y = [-2792, -2815, 2142, -2267, -5939, -7969, -3544, -2518, -7717, -8818, -5164, 522, 5127, 3859, -1439, -1904, 981, 1728, -1596, -4394, -1103, -76, -8403, -8923, -6878, -3266, -3061, -3532, -8606, -185, 4422, 8334, 5757, 2140, 4570, 6097, 6181, 9767, 13513, 10061, 9655, 6451, 6928, 5013, 3861, -1198, -8655, -3593, 3343, 7059, 6678, 3735, 2740, 1844, -1490, 2612, 4842, 2492, -986, -1840, 4288, -2979, -11925, -12995, -7265, -9189, -15905, -13018, -5538, -5325, -4422, -4341, 3764, 6418, 7793, 6730, 3489, 2220, -2162, -4322, -3657, -3568, -1924, 2996, -2340, -6023, -999, 2848, 5303, 4421, 1421, 2014, 7988, 12664, 3589, -927, 4402, -1581, -9578, -5750, -9003, -8941, -210, 7288, 11237, 7217, 2084, -2346, -3299, -3146, -1782, 327, 1215, -309, -3402, -10654, -9179, -8023, -3572, -1308, -14943, -12272, -4002, -3082, -5678, -8795, -10703, -2310]
4525b310M522l863L626M335L086m566l078N119j778j477j26m136p759o332K016
4510a2721N048K365J280K803L147j766K207m670q84l18J534l302L554L695j395
4495E77N579K07L870k755l498P918o918n677l382l678j13J430o26q6K355k399
4479g196J622O57m67P345K863l180k584q83M30K837j332k070O607o517m930k273
4463i071L58J640m141m841l82L944N512M526K504K060M946j868m339q206m309
4448a1667O247J399q55M01l426J004J0245l370p638j151l302p09L915J577L064
4433d266q07J324L694K940k579j528L13N40M269m035j107J630k104p57l813o748
4417a3034o80m363O83R108N663J1730l385r528K655J740K680L767n334p441L455
$$ y = [-2310, 2212, -1651, 1975, 6310, 9396, 4830, 1752, 6871, 5093, 3616, 3490, -646, -8405, -14737, -12721, -7673, -5308, -4028, -1225, 1922, 156, 2363, -2307, -3191, -3509, -1975, -5277, -1723, 1972, 577, 6156, 6363, 10233, 7478, 3980, 11898, 4980, -697, -4079, -7757, -7870, -6440, -7066, -7152, -4797, -7196, -5574, -4917, -5384, 1961, 4824, 1644, -940, -1823, -1393, 1444, 112, -1958, 4649, -1868, -6798, -9071, -8713, -7073, -11214, -16055, -16437, -12493, -6981, -2455, 49, 2109, 7055, 5187, 848, -7358, -11667, -5420, -4021, -4876, -4475, -7901, -6897, 3348, -22, -7660, -8811, -12113, -12822, -8907, -7330, -4266, -5073, -3749, -55, 2885, 306, -1222, -909, -369, 3900, -135, -1242, 388, -1716, -2473, -6286, -13034, -13714, -18077, -17394, -8286, -2623, 9107, 5722, -3806, -1151, 589, 3269, 7036, 1702, -5739, -2284]
4402b284J448o955J422J945K120K096m796O31Q27K490M4o985J718o43j015o331
4386a4268L870K778K667L254P7l037M272L765k061l961m032K723N725L760N6o99
4370D889j0382n387R41M167o45k407r3P362L040K842n36n113k262Q222J255K204
4354H097Q10p87j0348k19L855k85j746l28O366l679R59n026j219K293n764O580
4338d41K651j5201j004K351n41R34K70L346L974m667p82M614M234j134j504m05
4322c305k939J142O048N112L282k777j222L334L624L701n418j0811j08K737M969
4307G369P636m529m798L364m928m706j30L582L115n572p519m544m064P315K771
4292e638l118l093J93M175J96J443P518J815j596m74L949M788K693o156o003K370
$$ y = [-2284, -836, -7791, -6369, -4424, -2304, -208, -5004, -4373, -3546, -1056, -1012, -7997, -6279, -6922, -7937, -14268, -10398, -7620, -4953, -1699, -1622, -4659, -387, 3378, 1317, -2644, -6676, -3953, 1772, 5532, 5588, 4889, -5493, -10880, -9939, -5772, -6417, -8824, -8917, -1555, 1485, 4327, 3791, -1322, -3584, 4638, 5893, 8097, 8907, 8120, -2228, -2447, 1408, 1123, -623, -951, 5415, 1736, 2695, -2331, -3550, -1257, -7021, -441, 2210, -12991, -13995, -11644, -12185, -11251, -10981, -7635, -3661, -8328, -9110, -4496, -262, -1396, -2900, -3305, -6244, -5102, 946, 6058, 9340, 6563, 5341, 8675, 12299, 16000, 10582, -229, -337, 2400, 7369, 15005, 10476, 5678, 9042, 4114, -592, -722, 2860, 5975, 403, -7116, -11660, -15724, -8409, -5638, -8756, -11849, -11656, -7481, -7285, -5842, 1676, 3491, 1895, 1421, 5370, 10158, 12851, 6695, 692, 3062]
4276C062J172l427J073L884J822r611N205M362r771r854J534K584l65N878L114
4261F62R01M92m31N876J688J58m357j726m252P066j998p211M82P302k68l014K334
4244C704M061O018J919j0123k832K689j1439l996L740L765K687N033j820q743
4230e337k873O821j02k758k334M223J0341k081L174N911r560n230k063l226J839
4215c255M7j827N5N73k909P540K72k273n758m948P673Q244l049j211j37r178N117
4198e024O808M195J333q62K223k536L568L555m545k315o04k831M112k135O93R1
4182E726m187o329O582M560N65j0309r478J432N959k002p166K87J1096J105J446
4167g13P31m079M789l40k242O884L357p785n583m239J742M676J467k551j153j859
$$ y = [3062, 4234, 807, 1880, 5764, 7586, -2025, 3180, 7542, -2229, -12083, -10549, -7965, -8330, -2452, 662, 1563, 2055, 1624, 7500, 9188, 9346, 4989, 3263, -989, 6077, 4079, -3132, -2650, 4652, 4384, 1370, 3704, 7765, 13783, 15702, 5579, 2747, 5436, -6003, -9999, -6259, -2494, 193, 5226, 3406, -5337, -8210, -1389, -1491, -4249, -6583, -2360, 7981, 5900, 9074, 14985, 5425, 195, -1868, -5094, -3255, -3208, -5035, -4980, -4407, -7316, 224, 496, -1777, -7535, -12483, -4810, 3434, 385, -826, -963, -10141, -5024, 1784, 5979, 7312, 6450, 8673, 6137, 9705, 13260, 8715, 6400, 5796, 2965, 7077, 4942, 5635, 5726, 1539, -4790, 1792, 6352, 6917, -3392, -12870, -11438, -5479, -7481, -14647, -14360, -3264, -2159, -713, 18, -4061, 728, 388, -1854, 5030, 8387, 602, -4981, -9220, -7478, -2802, -1335, -3886, -5039, -6898]
4151f898K289j075o181M59K110L978J2154J520o146l151q338N077K021N993L068
4136F880p824J024L46k451J610j300K567p29o389N863M114k686J604L052J000
4121F681J683o15k935J894J593l524K39j337K602K358n720k095r363n776M906
4106i409J3658j348n992M33o59K558k039L045J980J157k823o02J30R2k055k661
4090d535M014N965K13k637m822m027M428k647M184Q692J150j168j790p086j2835
4075a2901L5p8Q229m21k414m248Q12Q43K890q40q8L297K247M815n811k561K811
4058c383j558n064P607P298J086K357m003l443K542K694O15K840k722q781J980
4043F5m604J1J775k570M650N024j159l151K26K49L571j718n997L651K939m00o54
$$ y = [-6898, -4609, -5684, -11865, -11406, -9296, -5318, 6836, 8356, 2210, -941, -9279, -4202, -2181, 3812, 6880, -944, 80, 426, -2025, -415, -1715, 852, 123, -6266, -403, 3711, 1025, 2629, 5681, 6681, 8364, 7749, 4814, 6708, 8301, 4777, 5016, 3679, 6281, 8639, 2919, 824, -8539, -14315, -9409, 4249, 2901, -3091, -2658, -3317, -759, -2798, 247, 2227, 3384, 561, -41, 89, 181, -1874, -4535, -521, 5444, 5657, 3020, -1802, -5829, -1401, -4048, 136, 8828, 9978, 8810, 7020, -66, -12901, -12866, -12944, -4715, -5136, -7550, -11798, -10986, -10143, -7253, -8093, -8181, -4884, -2637, 2178, -3633, -6194, -3383, -4941, -10005, -2398, 4900, 5986, 8343, 4340, 897, 3439, 6133, 6748, 9588, 6866, -1915, 65, -4539, -4528, -2753, -5323, -673, 4351, 3192, 41, 267, 516, 4087, 2369, -3628, 23, 2962, 2562, 1908]
4026A908r379j374K357Q61p16p58k277P79L321K596K746M665k396n702m707L134
4010d942N131j00k312J709L928l964l546l930l321J457N130P404N69m959O823
3995E077j970q360p47M143O257P454m768m738J187k190R93P924m50m338k900n863
3979c289j29j034n794J324l057j926M827M41M470k24l108L847L16k554J416L131
3963a343J474J425j647J636L240k660K615J043m530l133n412O697L86p681J560
3948f330P108J026k557p56j456r41n781l213K581L481q23p994j037J84M610O808
3932e090J849K66L033P759J823j685p325q177N723J2525j634l054Q83k532l855
3917E09k000O183j96l449O30q04L626O972n268m163j249L416M73m93R90J918K140
$$ y = [1908, -7471, -8845, -6488, -5627, -6343, -7101, -9378, -8599, -5278, -2682, 64, 4729, 2333, -3369, -8076, -4942, 189, 89, -2223, -514, 3414, -550, -4096, -8026, -11347, -9890, -4760, 2644, 3213, -1746, 5077, 3107, -5253, -6000, -1857, 4400, 11854, 7086, 2348, 3535, 1345, 2338, 10262, 9812, 5474, 2574, -3289, -3418, -4452, -10246, -8922, -11979, -13905, -9078, -8637, -4167, -4391, -7499, -3652, -3336, -5890, -4474, -1343, 131, 1556, -91, 1545, 4785, 2125, 4740, 5783, 1253, -1880, -7292, -595, -209, -7890, -6330, 778, 1804, -753, -1509, -2965, -3906, -9687, -12900, -10319, -6838, -7661, -15655, -16692, -16508, -11898, -5090, -3241, -2975, 58, 7817, 9640, 7955, 630, -7547, -1824, 10701, 9067, 6013, 6896, 4364, 509, -1491, 4692, 4496, 1047, 1677, 873, 4499, 11471, 6203, 2040, 791, 4207, 4680, 4187, 5177, 7095, 9235]
3900I235j970p821o026P713R585m07M71k842P13K274m5l873m321L700l983l653
3884a250K69J661r79n792m398L047O607l897l420O94J12J347L103Q201l937o310
3868d942J75J04N65K51K989L431K082l748J822J608k009n18J864l082p181K475
3852d114M535K105q40k770J329K368L597J074K923l991j960k042k341P896O48
3837H417o614m88J56l748K088K446m922j321N55O58K834r91k473L727N893j894
3821D323k628L650J603M89m037j203j710m574l146L671K817k445L254M091k087
3806B068K045J632k31L379m770o163K148J447o607J546j013N52K668k746l526
3791g571m064P928Q535L871k953p604r015j589K265O66k29M414j79M881O129l967
$$ y = [9235, 7265, -556, -6582, 1131, 10716, 10309, 10780, 7938, 8651, 10925, 10880, 7007, 2686, 6386, 2403, -1250, -981, 680, -299, -6091, -10489, -7442, -835, -4732, -8152, -7458, -7346, -5999, -2896, 5305, 1368, -4942, -4767, -4663, -4098, -3847, -858, 2573, 4655, 907, 2729, 4337, 2328, 1810, 3674, 592, -6589, -4114, 421, 2526, 1686, -1084, 245, 2613, 6210, 7284, 10207, 6216, 4256, 2214, -127, 7769, 8417, 1803, 1315, 1471, -2277, -189, 2257, -2665, -3986, -3431, -2773, 61, -930, -3403, 324, 6217, 4323, 1695, 5345, 6948, 7437, 3400, 2197, 487, -4087, -7233, -3562, -745, -3190, 64, 4155, 2068, 4113, 5745, 5514, 8893, 4123, -2040, 108, 1555, -5052, -3506, -4519, -3967, -1299, -4045, -7571, -11635, -3707, 4828, 8699, 5746, -1858, -10873, -12462, -10197, -9531, -9760, -5346, -5525, -644, 5485, 1518]
3775A518p243N79M593j397l416K48L679K87o054r552l993L590N001N79N606L247
3759b728l467j121k978K39N741M675J531Q75k193n694j456r16M58L41L343J867
3743a483j194J289j448k202J652j937n050J567L934k558P66J2775K576l712l459
3728A516N36m797p495J585J2286L904m197l855L587J485q07K11K348r821J098
3713b416J024J51m10L275l071n05K085N072j461q610n00R49K012L009L416K730
3697F750m638j929j965p01n31m2k901l115N538P987j250L11k513J092K01j723
3681E71O45L571J61j308J366L076L244L160m429l304r30k621K240J406k803r330
3665e285p272l005J659J0432Q616J036m67k682l836k827q02O804p12n552l546
$$ y = [1518, -5725, -5146, -553, -1950, -5366, -5118, -1439, -1152, -7206, -16758, -20751, -17161, -12160, -11581, -5975, -2728, -6195, -7316, -10294, -10055, -4314, 361, 1892, 2767, 574, -5120, -6576, -7492, -7034, -6693, -3350, -1483, -2677, -1388, -2836, -5038, -3386, -5323, -10373, -8806, -4872, -7430, -6664, 6111, 8687, 4975, 1516, 2052, -2745, -10240, -8655, 3631, 7535, 3338, -517, 3070, 4555, 3748, 3959, 6307, -3514, -2416, -1392, -1241, -1651, 1624, -1447, -1952, 133, 5205, 3744, -4866, -5366, -4417, -2405, 604, 4020, 6750, 2112, 183, -1782, -2483, -3014, -3056, -5957, -9072, -3534, 4453, 3203, 3514, 1001, 2093, 2294, 571, 1216, 4787, 4948, 3640, 5006, 8082, 11326, 14486, 10057, 6753, 5823, 3202, 5442, 6848, 4045, -5285, -12557, -15562, -13903, -3471, 5145, 6181, 5714, 3032, -804, -3631, -4433, 2371, 1659, -3893, -7439]
3650g439p716o61Q772J1920K426m156p733k378n04k718O321Q467K323q66j226
3635D832L643K093m590k908j223o819O192N592K495l847l56O939n668r747j056
3620d428L734J171k399p53j001M84M132n925m34O905j291k745k761p525L747L679
3604e410m118M710m87n895r043O836L386k961N117L133j69l454N340j604l659
3589h278O555L361M65J060j807q801R32R523L821M47J057k650J677K449l884r461
3573c534j122Q645l680j8M9m457O49J646N61K340J701N587k337n445j694K23J006
3556A20J078n357o441R328j296j984J642m624L632L492o786l479M565K714j357
3541d753J253J010L651J814K905M36j874K119P35j339n557k073K823M364r9j591
$$ y = [-7439, -15155, -15816, -7044, 4876, 7302, 3146, -4587, -6965, -7469, -10187, -3866, 4601, 6924, 6058, 4832, 8475, 10568, 5978, 3070, 1847, -4972, 1220, 6812, 9307, 5460, 5104, 12043, 6375, -3372, -4428, -694, 477, -1922, -2675, -3676, -3192, 940, -4985, -5419, 1486, 195, -2550, -5311, -12836, -9089, -5410, -9528, -4818, -5305, -11200, -20243, -13407, -10021, -12982, -7865, -4732, -4901, -8355, -3015, -4619, -8278, -1723, 1638, 2103, 3163, 1356, -7445, -6513, 3010, 6831, 7278, 8335, 5685, 7362, 9811, 5927, -3534, -4656, 3989, 309, 291, 340, -4117, -3468, -1822, -1261, 1079, 2780, 8367, 6030, 585, -1109, -886, 120, 1198, -4159, -10600, -1272, -2568, -4552, -2910, -7534, -3902, -410, -7196, -10675, -6110, -3396, -4753, -3500, -2490, 1161, 2975, 5880, 6316, 4442, 6561, 7296, 5957, 400, -1673, 1150, 5514, 5415, 3824]
3525C824o21m92o068j30M720j445M153k412o01N587j384j639p40n612m760j203
3509h823M070j66M353k118O86L092l365k657J953o034L762r74j540R273L721K528
3493G761l199p256m781r103m162O19J1165M790N321J252n493K515j700p73L052
3478Hj732l668n152j3o166q478R688R911J949M92l843k689N11l534m85J057N70
3461a1574R11Q155P306O731n093L09q53o115k767j555p846n324J568L114N448
3446g585L279n26M077N150m526l589J641L358m359k237l886j136P966Q330p468
3431a511n982P463L044j009l137k943j148J589m617j440K361l464q297K061K210
3416a4820J195k14m510M541K506J889M076L261L047L779m48m652o01l920K7N918
$$ y = [3824, 3203, 2711, -3357, -3487, 1233, -212, 3941, 1529, 928, 6515, 5131, 3492, 2752, -2860, -7620, -8823, -4753, -4919, -566, -2684, -1998, 1094, -2271, -4928, -2975, -9009, -5247, -6221, -7761, 1512, 5233, 7761, 4562, -2694, -7475, -16578, -20740, -20121, -8956, -4166, 1155, 2407, -3086, -571, -2271, -3044, 8, -1724, -5392, -10544, -10557, -16723, -25201, -15513, -5602, -3653, -3161, -7004, -9693, -9182, -12716, -13201, -12144, -11574, -10663, -2508, 4798, 11529, 6436, 6745, 5892, -223, -2990, -4545, -12391, -17715, -16147, -13033, -7585, -4306, -4832, -755, 4395, -131, -3720, -2079, 1279, -3080, -5317, -9203, -10339, -2373, 5957, -1511, -7493, -30, 3014, 2005, -1132, -4075, -5223, -3634, -8251, -9691, -7330, -10794, -19091, -17030, -14820, -13625, -13839, -18349, -13808, -11302, -9413, -5337, -2076, 971, 4750, 4302, -350, -951, -4871, -4844, 1074]
3400A074K888O882J301q11n775p552K764j699K455l020l2J916m609j141K513K959
3384A13q58p02l955q347k242R507O210N551N541l653l286j178o167K343K627R22
3368B426l159n316K250J442j845J517K878m921p22K431rq061O018P028M666p32
3352E891n325l074k859j232K327J0238l242o862K714R737L619r710j931l248K259
3337f98M60n53p33M046M692k473J66P83q094N28k1n650R77j768M013l17K921q53
3319b574j246j903J102k513j145j191O185M930L399l433j336k269J632J231o888
3304f019K712L099N08l674L334R570k899n902J180j34m616M545l128O64j855p56
3288c371k726k78J466K268K094l425l391k118j936K848J800j401J023J703O771
$$ y = [1074, 3962, 10844, 12145, 11334, 5559, -1993, 771, -928, 1527, -1493, -1525, 391, -4218, -5359, -2846, 113, -745, -1447, -5402, -13749, -15991, -6484, -274, 5277, 10818, 7165, 3879, 2701, -3466, -1123, 1504, 2426, -733, -6049, -3799, -2357, -4202, -2685, 193, -4728, -5450, -3019, -3028, -11089, -5071, 1957, 6623, 5891, 566, -2508, -5367, -6599, -4272, 5966, 2724, -4138, -1424, 8313, 11932, 2222, 291, -2957, -698, -238, -791, -1524, 2522, 7214, 4741, 4907, 5690, -2404, -1876, -1897, -7547, -6570, -8338, -4325, -4642, -1721, -2574, -3820, -5723, -4621, -7134, -8279, -9470, -3285, 1645, 5044, 1611, 275, -1994, -362, 869, -6019, -3307, -208, 300, -3374, -40, 9530, 6631, 729, 1909, 1775, -2841, 1704, -1424, -760, -2615, -3371, -6097, -6375, -4909, -2641, -547, -3972, -7363, -9481, -11417, -8569, -6769, -8170, -7147, -5444, 1327]
3273A327m528r851j983Q152Q83M22l13J697L676O949j462k453o37K216J615j830
3257C880k314m91j494K213m501l536O352n93J397J0958m201m415N243m964q869
$$ y = [1327, -3201, -13052, -15035, -6883, -6000, -5578, -5891, -4194, -518, 6431, 4969, 2516, 1879, 4095, 5710, 3880, 1566, 1075, -419, 1794, -2707, -6243, 109, -484, 913, 11871, 7670, 3255, 8498, 3534, -5335]
$$ [...]
##END NTUPLES=NMR SPECTRUM
##END=
