##TITLE=Analysis number 328088
Compound Code tl 00315
Book Reference 510/45
Project Code adrs
Chemist Name jimp
##JCAMPDX= 6.0         $$ Bruker NMR JCAMP-DX V2.0
##DATA TYPE= NMR SPECTRUM
##DATA CLASS= NTUPLES
##ORIGIN= Bruker BioSpin GmbH
##OWNER= nmr
$$ XWIN-NMR		Version 3.5
$$ Tue May  1 13:08:14 2007 GMT Daylight Time (UT+1h)  MAYBRIDGE\nmr@NMR_250MHZ
##.OBSERVE FREQUENCY= 250.131544655141
##.OBSERVE NUCLEUS= ^1H
##.ACQUISITION MODE= SIMULTANEOUS (DQD)
##.ACQUISITION SCHEME= undefined
##.AVERAGES= 16
##.DIGITISER RES= 18
##SPECTROMETER/DATA SYSTEM= dpx250
##.PULSE SEQUENCE= zg30
##.SOLVENT NAME= CDCl3
##.SHIFT REFERENCE= (INTERNAL, CDCl3, 0, 16.522)
##AUDIT TRAIL= $$ (NUMBER, WHEN, WHO, WHERE, WHAT)
$$ ##TITLE= Audit trail, XWIN-NMR		Version 3.5
$$ ##JCAMPDX= 5.01
$$ ##ORIGIN= Bruker BioSpin GmbH
$$ ##OWNER= nmr
$$ C:\u/data/dgb/nmr/ADRS/120/pdata/1/auditp.txt
$$ ##AUDIT TRAIL=  $$ (NUMBER, WHEN, WHO, WHERE, WHAT)
(   1,<2007-05-01 13:07:32.80 +100>,<MAYBRIDGE\nmr>,<NMR_250MHZ>,
      <created by zg, POWCHK disabled, PULCHK disabled
       configuration hash MD5:
       76 6E 9A 78 1E 09 19 81 EC 84 63 8F B0 6A 59 2D
       data hash MD5: 64K
       79 8D 26 C7 1E FA 2C A4 AD 4D 84 10 70 16 28 2D>)
(   2,<2007-05-01 13:07:50.60 +100>,<MAYBRIDGE\nmr>,<NMR_250MHZ>,
      <Start of raw data processing
       ef LB = 0.3 FT_mod = 6 PKNL = 1 SI = 32K 
       data hash MD5: 32K
       2B DA FE 55 93 13 5C 21 2B 62 D3 5F 43 49 F4 25>)
(   3,<2007-05-01 13:07:53.57 +100>,<MAYBRIDGE\nmr>,<NMR_250MHZ>,
      <apk 
       data hash MD5: 32K
       EA B8 AE 20 8E 00 51 D2 6D D3 03 2B 6E A0 74 4D>)
(   4,<2007-05-01 13:07:55.59 +100>,<MAYBRIDGE\nmr>,<NMR_250MHZ>,
      <abs ABSG = 5 
       data hash MD5: 32K
       8D 75 46 8E 0A 64 DE F8 B3 0E F7 C6 91 C6 F7 12>)
$$ ##END=
$$ 
$$ hash MD5
$$ 44 6E C1 A4 80 BD 70 56 CC D1 7A 46 AF 13 69 B0
##$RELAX= 
##$RELAX= 
##$RELAX= 
##$RELAX= 
##$RELAX= 
##$RELAX= 
##$RELAX= 
$$ Bruker specific parameters
$$ --------------------------
##$DU= <C:\u>
##$EXPNO= 120
##$NAME= <ADRS>
##$PROCNO= 1
##$TYPE= <nmr>
##$USER= <dgb>
##$AMP= (0..31)
100 100 100 100 100 100 100 100 100 100 100 100 100 100 100 100 100 100 
100 100 100 100 100 100 100 100 100 100 100 100 100 100 
##$AQSEQ= 0
##$AQ_mod= 3
##$AUNM= <au_zg>
##$AUTOPOS= <26 >
##$BF1= 250.13
##$BF2= 250.13
##$BF3= 250.13
##$BF4= 250.13
##$BF5= 500.13
##$BF6= 500.13
##$BF7= 500.13
##$BF8= 500.13
##$BYTORDA= 1
##$CFDGTYP= 0
##$CFRGTYP= 5
##$CHEMSTR= <none>
##$CNST= (0..31)
1 1 145 1 1 1 1 1 1 1 1 1 1 1 1 1 1 1 1 1 1 1 1 1 1 1 1 1 1 1 1 1 
##$CPDPRG= <>
##$CPDPRG1= <>
##$CPDPRG2= <>
##$CPDPRG3= <>
##$CPDPRG4= <mlev>
##$CPDPRG5= <mlev>
##$CPDPRG6= <mlev>
##$CPDPRG7= <mlev>
##$CPDPRG8= <mlev>
##$CPDPRGB= <>
##$CPDPRGT= <>
##$D= (0..31)
0 1 0 0 0 0 0 0 0 0.06 0 0 0 0 0 0 0.0002 0 0 0 0 0 0 0 0 0 0 0 0 0 0 
0 
##$DATE= 1178021252
##$DBL= (0..7)
120 120 120 120 120 120 120 120 
##$DBP= (0..7)
150 150 150 150 150 150 150 150 
##$DBP07= 0
##$DBPNAM0= <>
##$DBPNAM1= <>
$$ [...]
##$SUBNAM7= <"">
##$SUBNAM8= <"">
##$SUBNAM9= <"">
##$SW= 20.6930455092707
##$SWIBOX= (0..15)
0 0 3 0 0 0 0 0 0 0 0 0 0 0 0 0 
##$SW_h= 5175.983436853
##$TD= 65536
##$TD0= 1
##$TE= 683.16
##$TE2= 300
##$TE3= 300
##$TEG= 300
##$TL= (0..7)
0 120 120 120 120 120 120 120 
##$TP= (0..7)
150 150 150 150 150 150 150 150 
##$TP07= 0
##$TPNAME0= <>
##$TPNAME1= <>
##$TPNAME2= <>
##$TPNAME3= <>
##$TPNAME4= <>
##$TPNAME5= <>
##$TPNAME6= <>
##$TPNAME7= <>
##$TPOAL= (0..7)
0.5 0.5 0.5 0.5 0.5 0.5 0.5 0.5 
##$TPOFFS= (0..7)
0 0 0 0 0 0 0 0 
##$TUNHIN= 0
##$TUNHOUT= 0
##$TUNXOUT= 0
##$USERA1= <user>
##$USERA2= <user>
##$USERA3= <user>
##$USERA4= <user>
##$USERA5= <user>
##$V9= 5
##$VALIST= <valist>
##$VCLIST= <CCCCCCCCCCCCCCC>
##$VD= 0
##$VDLIST= <DDDDDDDDDDDDDDD>
##$VPLIST= <PPPPPPPPPPPPPPP>
##$VTLIST= <TTTTTTTTTTTTTTT>
##$WBST= 1024
##$WBSW= 4
##$XGAIN= (0..3)
0 0 0 0 
##$XL= 0
##$YL= 0
##$YMAX_a= 630418
##$YMIN_a= -583641
##$ZGOPTNS= <>
##$ZL1= 120
##$ZL2= 120
##$ZL3= 120
##$ZL4= 120
##$ABSF1= 16.522
##$ABSF2= -4.171173
##$ABSG= 5
##$ABSL= 3
##$ALPHA= 0
##$AQORDER= 0
##$ASSFAC= 0
##$ASSFACI= 0
##$ASSFACX= 0
##$ASSWID= 0
##$AUNMP= <proc_1d>
##$AZFE= 0.1
##$AZFW= 0.1
##$BCFW= 0
##$BC_mod= 0
##$BYTORDP= 0
##$COROFFS= 0
##$CY= 12.5
##$DATMOD= 1
##$DC= 0
##$DFILT= <>
##$DTYPP= 0
##$F1P= 14.0000005364418
##$F2P= -0.99999901652339
##$FCOR= 0.5
##$FTSIZE= 32768
##$FT_mod= 6
##$GAMMA= 0
##$GB= 0
##$INTBC= 1
##$INTSCL= 1
##$ISEN= 128
##$LB= 0.3
##$LEV0= 0
##$LPBIN= 0
##$MAXI= 10000
##$MC2= 0
##$MEAN= 0
##$ME_mod= 0
##$MI= 0
##$NCOEF= 0
##$NC_proc= -2
##$NLEV= 6
##$NOISF1= 0
##$NOISF2= 0
##$NSP= 0
##$NTH_PI= 0
##$NZP= 0
##$OFFSET= 16.522
##$PC= 1
##$PHC0= -54.47301
##$PHC1= 7.63063
##$PH_mod= 1
##$PKNL= yes
##$PPARMOD= 0
##$PSCAL= 4
##$PSIGN= 0
##$REVERSE= no
##$SF= 250.13
##$SI= 32768
##$SIGF1= 0
##$SIGF2= 0
##$SINO= 400
##$SIOLD= 32768
##$SREGLST= <1H.CDCl3>
##$SSB= 0
##$STSI= 32768
##$STSR= 0
##$SW_p= 5175.98343685301
##$SYMM= 0
##$S_DEV= 0
##$TDeff= 65536
##$TDoff= 0
##$TI= <Analysis number 999999
Compound Code 99
Book Reference 9
Project Code 9>
##$TILT= no
##$TM1= 0
##$TM2= 0
##$TOPLEV= 0
##$USERP1= <user>
##$USERP2= <user>
##$USERP3= <user>
##$USERP4= <user>
##$USERP5= <user>
##$WDW= 1
##$XDIM= 32768
##$YMAX_p= 320411092
##$YMIN_p= -32191
$$ End of Bruker specific parameters
$$ ---------------------------------
##NTUPLES= NMR SPECTRUM
##VAR_NAME=  FREQUENCY,     SPECTRUM/REAL,   SPECTRUM/IMAG
##SYMBOL=    X,             R,               I
##VAR_TYPE=  INDEPENDENT,   DEPENDENT,       DEPENDENT
##VAR_FORM=  AFFN,          ASDF,            ASDF
##VAR_DIM=   32768,         32768,           32768
##UNITS=     HZ,            ARBITRARY UNITS, ARBITRARY UNITS
##FACTOR=    0.157963299565203, 1,           1
##FIRST=     4132.6476996994, 0,             0
##LAST=      -1043.33573715361, 0,           0
##MIN=       -1043.33573715361, -32191,      0
##MAX=       4132.6476996994, 320411092,     0
$$ Real data points
##PAGE= N=1
##DATA TABLE= (X++(R..R)), XYDATA
$$ [...]
##PAGE= N=2
##DATA TABLE= (X++(I..I)), XYDATA
$$ plain form
17504 -7241288 -7234151 -7220076 -7186334 -7143683 -7102440 -7058863 -7018589 -6989478 -6980722 -6976846 -6963019 -6944013
17492 -6944013 -6915265 -6877738 -6838556 -6798418 -6774520 -6754827 -6730889 -6712659 -6695952 -6680163 -6660052
17481 -6660052 -6632740 -6595915 -6567132 -6542326 -6529326 -6513884 -6480369 -6457544 -6440626 -6420257 -6395532
17470 -6395532 -6364331 -6332480 -6309615 -6295074 -6280388 -6263177 -6241538 -6218218 -6193919 -6162256 -6137835
17459 -6137835 -6110683 -6086666 -6059819 -6035560 -6005808 -5973149 -5943738 -5924146 -5902130 -5886807 -5871581
17448 -5871581 -5856173 -5836941 -5808696 -5774964 -5738503 -5703658 -5672603 -5647580 -5624306 -5616502 -5666128
17437 -5666128 -5759518 -5819230 -5816390 -5781144 -5743413 -5698811 -5658002 -5622022 -5585895 -5545286 -5500000
17426 -5500000 -5463335 -5429001 -5418154 -5481323 -5573785 -5624431 -5609130 -5563637 -5515126 -5473122 -5433131
$$ packed form
17504g241288P137J4075L3742M2651M1243M3577M0274K9111Q756L876J3827J9006
17492f944013K8748L7527L9182M0138K3898J9693K3938J8230J6707J5789K0111
17481f660052K7312L6825K8783K4806J3000J5442L3515K2825J6918K0369K4725
17470f395532L1201L1851K2865J4541J4686J7211K1639K3320K4299L1663K4421
17459f137835K7152K4017K6847K4259K9752L2659K9411J9592K2016J5323J5226
17448e871581J5408J9232K8245L3732L6461L4845L1055K5023K3274P804m9626
17437e666128r3390n9712K840L5246L7731M4602M0809L5980L6127M0609M5286
17426e500000L6665L4334J0847o3169r2462n0646J5301M5493M8511M2004L9991
$$ plain form
17415 -5433131 -5398066 -5355176 -5307611 -5267650 -5278104 -5358144 -5449067 -5493420 -5477401 -5431980 -5386124
17404 -5386124 -5341677 -5302474 -5263230 -5226654 -5180796 -5135751 -5094696 -5073971 -5092307 -5176658 -5261431
17393 -5261431 -5284743 -5266533 -5225796 -5181488 -5139456 -5099522 -5058799 -5017861 -4991802 -5008784 -5069131
17382 -5069131 -5128146 -5139316 -5116276 -5084492 -5043759 -5006991 -4977230 -4947504 -4915708 -4879328 -4845467
17371 -4845467 -4812764 -4807274 -4837227 -4897269 -4943994 -4942416 -4916956 -4884335 -4846939 -4817079 -4788179 -4754603
17359 -4754603 -4712721 -4686628 -4685410 -4728338 -4798554 -4844347 -4837035 -4803325 -4772080 -4750293 -4723333 -4689306
17347 -4689306 -4655485 -4622795 -4591713 -4568189 -4549348 -4551134 -4600172 -4667344 -4700495 -4699076 -4681489 -4655025
17335 -4655025 -4633794 -4616707 -4598093 -4583801 -4570311 -4554919 -4536927 -4514283 -4499005 -4477500 -4461832
$$ packed form
17415e433131L5065M2890M7565L9961j0454q0040r0923m4353J6019M5421M5856
17404e386124M4447L9203L9244L6576M5858M5045M1055K0725j8336q4351q4773
17393e261431k3312J8210M0737M4308M2032L9934M0723M0938K6059j6982o0347
17382e069131n9015j1170K3040L1784M0733L6768K9761K9726L1796L6380L3861
17371d845467L2703N490k9953o0042m6725J578K5460L2621L7396K9860K8900L3576
17359d754603M1882K6093J218m2928p0216m5793P312L3710L1245K1787K6960L4027
17347d689306L3821L2690L1082K3524J8841j786m9038o7172l3151J419J7587K6464
17335d655025K1231J7087J8614J4292J3490J5392J7992K2644J5278K1505J5668
$$ plain form
17324 -4461832 -4454622 -4441641 -4421190 -4399997 -4395039 -4386567 -4371652 -4356259 -4351118 -4339386 -4326996 -4315040
17312 -4315040 -4309129 -4302767 -4297358 -4294179 -4290306 -4278785 -4271604 -4264379 -4259415 -4244555 -4227724 -4210633 -4202812
17299 -4202812 -4192691 -4180169 -4165763 -4153331 -4147914 -4142342 -4131241 -4120546 -4107979 -4098248 -4095846 -4084686
17287 -4084686 -4066221 -4057445 -4056440 -4048493 -4031121 -4018579 -4011307 -4005123 -4000383 -3989932 -3979122 -3969982 -3963376
17274 -3963376 -3953546 -3946765 -3936725 -3917148 -3906615 -3904172 -3893174 -3878693 -3867723 -3851069 -3832192 -3832796
17262 -3832796 -3828940 -3817837 -3802047 -3797014 -3786166 -3771040 -3759779 -3750314 -3734287 -3720801 -3705468 -3697339
17250 -3697339 -3693632 -3674796 -3643383 -3615668 -3579918 -3534366 -3486999 -3445568 -3453177 -3542235 -3691982
17239 -3691982 -3848774 -3945569 -3949895 -3924383 -3889519 -3851365 -3817964 -3790102 -3762550 -3742583 -3721487
$$ packed form
17324d461832P210J2981K0451K1193M958Q472J4915J5393N141J1732J2390J1956
17312d315040N911O362N409L179L873J1521P181P225M964J4860J6831J7091P821
17299d202812J0121J2522J4406J2432N417N572J1101J0695J2567R731K402J1160
17287d084686J8465Q776J005P947J7372J2542P272O184M740J0451J0810R140O606
17274c963376R830O781J0040J9577J0533K443J0998J4481J0970J6654J8877o04
17262c832796L856J1103J5790N033J0848J5126J1261R465J6027J3486J5333Q129
17250c697339L707J8836L1413K7715L5750M5552M7367M1431p609q9058j49747
17239c691982j56792r6795m326K5512L4864L8154L3401K7862K7552J9967K1096
$$ plain form
17228 -3721487 -3694563 -3673976 -3665476 -3650211 -3635503 -3626662 -3618197 -3616641 -3612789 -3609046 -3611392 -3602228 -3581450
17215 -3581450 -3574798 -3560758 -3550561 -3528179 -3509544 -3499156 -3487603 -3470627 -3454203 -3444143 -3433449
17204 -3433449 -3420041 -3411968 -3413226 -3407710 -3393516 -3376147 -3359655 -3333068 -3312113 -3282156 -3253387 -3219647
17192 -3219647 -3169101 -3117747 -3057707 -2992892 -2937504 -2964250 -3116920 -3376185 -3643159 -3831538
17182 -3831538 -3904015 -3888560 -3836939 -3779823 -3727398 -3676641 -3634949 -3607124 -3584914 -3552435 -3526125
17171 -3526125 -3502879 -3483095 -3463579 -3450340 -3436304 -3420663 -3406060 -3399797 -3403965 -3404973 -3399643 -3386486
17159 -3386486 -3372645 -3356246 -3348451 -3333521 -3320979 -3318630 -3313432 -3308395 -3300831 -3284457 -3278428 -3266636
17147 -3266636 -3249022 -3239813 -3231363 -3215384 -3201620 -3191176 -3177757 -3161322 -3144233 -3120618 -3101601 -3075385
$$ packed form
17228c721487K6924K0587Q500J5265J4708Q841Q465J556L852L743k346R164K0778
17215c581450O652J4040J0197K2382J8635J0388J1553J6976J6424J0060J0694
17204c433449J3408Q073j258N516J4194J7369J6492K6587K0955K9957K8769L3740
17192c219647N0546N1354O0040O4815N5388k6746j52670k59265k66974j88379
17182c831538p2477J5455N1621N7116N2425N0757M1692K7825K2210L2479K6310
17171c526125K3246J9784J9516J3239J4036J5641J4603O263m168j008N330J3157
17159c386486J3841J6399P795J4930J2542K349N198N037P564J6374O029J1792
17147c266636J7614R209Q450J5979J3764J0444J3419J6435J7089K3615J9017K6216
$$ plain form
17135 -3075385 -3041565 -3008800 -2980143 -2976427 -3046049 -3185435 -3328223 -3421335 -3437828 -3409344 -3375409
17124 -3375409 -3341873 -3306617 -3285615 -3268458 -3253286 -3234773 -3210960 -3193270 -3184237 -3184697 -3175790 -3166711
17112 -3166711 -3160378 -3148790 -3140817 -3143795 -3139234 -3128228 -3118149 -3113350 -3105615 -3103282 -3103331 -3097179 -3090452 -3083989
17098 -3083989 -3073479 -3055763 -3044019 -3044643 -3042729 -3037805 -3032726 -3027393 -3024965 -3022953 -3018084 -3013263 -3001330
17085 -3001330 -2989961 -2986655 -2979406 -2974036 -2973596 -2973520 -2968229 -2963446 -2953561 -2952070 -2943248 -2935255 -2933770 -2928218
17071 -2928218 -2922867 -2918467 -2917065 -2910520 -2913992 -2911363 -2906374 -2897527 -2887099 -2886768 -2886203 -2884535 -2883833 -2877642
17057 -2877642 -2875393 -2871956 -2862193 -2854926 -2847472 -2839335 -2837264 -2832854 -2831010 -2835519 -2830153 -2820980 -2814083 -2811771
17043 -2811771 -2804156 -2799909 -2796499 -2791364 -2785081 -2777276 -2770324 -2773789 -2772072 -2768556 -2766121 -2763986 -2761850 -2763615
$$ packed form
17135c075385L3820L2765K8657L716o9622j39386j42788r3112j6493K8484L3935
17124c375409L3536L5256K1002J7157J5172J8513K3813J7690R033m60Q907R079
17112c166711O333J1588P973k978M561J1006J0079M799P735K333m9O152O727O463
17098c083989J0510J7716J1744o24J914M924N079N333K428K012M869M821J1933
17085c001330J1369L306P249N370M40P6N291M783R885J491Q822P993J485N552
17071b928218N351M400J402O545l472K629M989Q847J0428L31N65J668P02O191
17057b877642K249L437R763P267P454Q137K071M410J844m509N366R173O897K312
17043b811771P615M247L410N135O283P805O952l465J717L516K435K135K136j765
$$ plain form
17029 -2763615 -2761276 -2759385 -2756217 -2754877 -2749116 -2738454 -2732085 -2729167 -2724278 -2718724 -2717442 -2720093 -2720618 -2712789
17015 -2712789 -2700326 -2689088 -2688379 -2685807 -2679251 -2673000 -2665661 -2664364 -2665659 -2668936 -2668853 -2659461 -2654509 -2650890
17001 -2650890 -2650312 -2654120 -2653111 -2651764 -2648010 -2637604 -2630753 -2629389 -2630490 -2619188 -2615396 -2613999 -2611297 -2611545
16987 -2611545 -2609756 -2606753 -2597046 -2599037 -2595327 -2587116 -2582934 -2584264 -2581550 -2574761 -2566210 -2566441 -2567470 -2557935
16973 -2557935 -2548191 -2545180 -2545794 -2541340 -2542417 -2538756 -2540457 -2534058 -2528505 -2532281 -2529421 -2520883 -2517042 -2517313
16959 -2517313 -2513158 -2510382 -2511239 -2507590 -2496164 -2489559 -2485967 -2476600 -2478021 -2484102 -2485383 -2483096 -2475016 -2460864
16945 -2460864 -2452825 -2450998 -2453911 -2458432 -2453886 -2448830 -2452947 -2456516 -2450187 -2445165 -2439816 -2433073 -2426095 -2420154
16931 -2420154 -2419654 -2423152 -2424582 -2414446 -2404662 -2399706 -2395574 -2388142 -2377533 -2367956 -2372839 -2384853 -2394983
$$ packed form
17029b763615K339J891L168J340N761J0662O369K918M889N554J282k651n25P829
17015b712789J2463J1238P09K572O556O251P339J297j295l277Q3R392M952L619
17001b650890N78l808J009J347L754J0406O851J364j101J1302L792J397K702k48
16987b611545J789L003R707j991L710Q211M182j330K714O789Q551k31j029R535
16973b557935R744L011o14M454j077L661j701O399N553l776K860Q538L841k71
16959b517313M155K776q57L649J1426O605L592R367j421o081j281K287Q080J4152
16945b460864Q039J827k913m521M546N056m117l569O329N022N349O743O978N941
16931b420154N00l498j430J0136R784M956M132P432J0609R577m883j2014j0130
$$ plain form
16918 -2394983 -2392622 -2390304 -2385675 -2389423 -2390137 -2386443 -2380175 -2376803 -2375474 -2372238 -2362403 -2356287 -2353510 -2355336
16904 -2355336 -2354114 -2349107 -2340503 -2329226 -2322975 -2321194 -2323633 -2330079 -2336189 -2341696 -2337524 -2330595 -2329956 -2327871
16890 -2327871 -2320192 -2320335 -2320376 -2310925 -2298950 -2296210 -2292294 -2285399 -2292848 -2297120 -2301046 -2300435 -2293703 -2283333
16876 -2283333 -2276956 -2274301 -2276679 -2271373 -2267278 -2258442 -2250455 -2247843 -2243292 -2240302 -2246823 -2253237 -2249245 -2237288
16862 -2237288 -2232546 -2231366 -2241934 -2244079 -2242642 -2244868 -2242239 -2227932 -2218643 -2214321 -2217850 -2217238 -2214868 -2211446
16848 -2211446 -2213076 -2215725 -2206693 -2197939 -2197751 -2202596 -2202939 -2209377 -2209300 -2204790 -2196932 -2193627 -2186814 -2180058 -2175453
16833 -2175453 -2176436 -2179245 -2178509 -2176506 -2167958 -2166070 -2172580 -2171622 -2171168 -2165638 -2154415 -2158104 -2155011 -2151049 -2141285
16818 -2141285 -2135930 -2130638 -2126741 -2127262 -2127898 -2127581 -2123220 -2120560 -2127524 -2131561 -2127789 -2116999 -2114238 -2107475
$$ packed form
16918b394983K361K318M629l748p14L694O268L372J329L236R835O116K777j826
16904b355336J222N007Q604J1277O251J781k439o446o110n507M172O929O39K085
16890b327871P679j43m1R451J1975K740L916O895p449m272l926O11O732J0370
16876b283333O377K655k378N306M095Q836P987K612M551K990o521o414L992J1957
16862b237288M742J180j0568k145J437k226K629J4307R289M322l529O12K370L422
16848b211446j630k649R032Q754J88m845l43o438P7M510P858L305O813O756M605
16833b175453r83k809P36K003Q548J888o510R58M54N530J1223l689L093L962R764
16818b141285N355N292L897n21o36L17M361K660o964m037L772J0790K761O763
$$ plain form
16804 -2107475 -2104077 -2105779 -2105621 -2100611 -2102984 -2099571 -2090776 -2086173 -2090541 -2089084 -2078314 -2070967 -2071535 -2074146
16790 -2074146 -2075171 -2070547 -2065909 -2065612 -2064286 -2063035 -2057367 -2056506 -2055953 -2059837 -2057926 -2053698 -2046274 -2037987 -2035802
16775 -2035802 -2033872 -2031032 -2029273 -2025135 -2029123 -2023879 -2017076 -2019073 -2018080 -2012328 -2007098 -2009454 -2009461 -2012572 -2015700
16760 -2015700 -2017596 -2016110 -2008298 -1999784 -1997688 -1997399 -1993626 -1990897 -1992889 -1993299 -1992679 -1985173 -1982110 -1988411 -1990999
16745 -1990999 -1996669 -1983849 -1971974 -1970493 -1965854 -1959495 -1954101 -1948277 -1944473 -1956314 -1959218 -1955577 -1957749
16732 -1957749 -1961451 -1963613 -1960289 -1960041 -1949661 -1943031 -1941865 -1936799 -1928045 -1927155 -1926645 -1922934 -1921370 -1923066
16718 -1923066 -1925246 -1923595 -1922870 -1924301 -1922658 -1919276 -1918134 -1917903 -1912751 -1912870 -1910505 -1904024 -1902216 -1902696 -1900916
16703 -1900916 -1896520 -1893402 -1893461 -1900957 -1903329 -1895963 -1885992 -1881914 -1885147 -1890074 -1879245 -1869049 -1866912 -1867174
$$ packed form
16804b107475L398j702J58N010k373L413Q795M603m368J457J0770P347n68k611
16790b074146j025M624M638K97J326J251N668Q61N53l884J911M228P424Q287K185
16775b035802J930K840J759M138l988N244O803j997R93N752N230k356pl111l128
16760b015700j896J486P812Q514K096K89L773K729j992m10O20P506L063o301k588
16745a990999n670J2820J1875J481M639O359N394N824L804j1841k904L641k172
16732a957749l702k162L324K48J0380O630J166N066Q754Q90N10L711J564j696
16718a923066k180J651P25j431J643L382J142K31N152j19K365O481J808m80J780
16703a900916M396L118n9p496k372P366R971M078l233m927J0829J0196K137k62
$$ plain form
16689 -1867174 -1867936 -1867331 -1866797 -1867045 -1869707 -1870182 -1871920 -1874251 -1870860 -1863508 -1855467 -1845475 -1833934 -1828240 -1830997
16674 -1830997 -1832604 -1833277 -1835284 -1836433 -1836078 -1835727 -1833192 -1827324 -1820953 -1818921 -1820264 -1819612 -1824178 -1823033 -1822314
16659 -1822314 -1825263 -1828565 -1825261 -1817072 -1812724 -1804803 -1802119 -1800545 -1798758 -1792037 -1786434 -1783204 -1791443 -1794842
16645 -1794842 -1796078 -1795154 -1789870 -1787118 -1790477 -1788164 -1785715 -1782557 -1778081 -1772474 -1767669 -1772001 -1767087 -1768598
16631 -1768598 -1766614 -1762379 -1764554 -1765072 -1766692 -1767269 -1764503 -1763676 -1756410 -1751377 -1746032 -1746307 -1745093 -1735648 -1732813
16616 -1732813 -1732991 -1726611 -1730066 -1734818 -1734542 -1732092 -1725739 -1726017 -1727233 -1724565 -1724003 -1719961 -1720369 -1720538 -1722777
16601 -1722777 -1713748 -1714069 -1714522 -1715941 -1714696 -1712491 -1715428 -1717038 -1717607 -1715475 -1709740 -1703498 -1702339 -1702618 -1700135
16586 -1700135 -1698999 -1705112 -1695836 -1686095 -1684083 -1688669 -1694781 -1696207 -1689184 -1683951 -1683711 -1684613 -1685449 -1678131 -1686731
$$ packed form
16689a867174p62O05N34k48k662m75j738k331L391P352Q041R992J1541N694k757
16674a830997j607o73k007j149L55L51K535N868O371K032j343O52m566J145P19
16659a822314k949l302L304Q189M348P921K684J574J787O721N603L230q239l399
16645a794842j236R24N284K752l359K313K449L158M476N607M805m332M914j511
16631a768598J984M235k175n18j620n77K766Q27P266N033N345k75J214R445K835
16616a732813j78O380l455m752K76K450O353k78j216K668N62M042m08j69k239
16601a722777R029l21m53j419J245K205k937j610n69K132N735O242J159k79K483
16586a700135J136o113R276R741K012m586o112j426P023N233K40r02q36P318q600
$$ plain form
16571 -1686731 -1682764 -1676857 -1673689 -1670706 -1669291 -1672719 -1671171 -1666830 -1667695 -1663094 -1656560 -1655802 -1654101 -1651431
16557 -1651431 -1647648 -1644964 -1642505 -1640357 -1643028 -1650327 -1651570 -1648665 -1644117 -1639004 -1632558 -1634099 -1633052 -1632784
16543 -1632784 -1630813 -1623807 -1619127 -1615143 -1617509 -1618544 -1616873 -1609064 -1609852 -1617937 -1624876 -1619900 -1618282 -1611771
16529 -1611771 -1608731 -1611854 -1610386 -1605086 -1610688 -1607717 -1606972 -1612100 -1611860 -1607132 -1602628 -1601896 -1597531 -1593199 -1596170
16514 -1596170 -1589850 -1590578 -1595805 -1588050 -1583021 -1575394 -1578465 -1580321 -1579007 -1572388 -1570022 -1568254 -1572043 -1573973
16500 -1573973 -1574272 -1571853 -1569480 -1567654 -1565853 -1564806 -1560358 -1556921 -1554953 -1559313 -1555597 -1552665 -1551928 -1556659
16486 -1556659 -1554726 -1556336 -1561663 -1556337 -1550803 -1549612 -1555786 -1557033 -1548602 -1543984 -1541297 -1538853 -1537158 -1542582
16472 -1542582 -1541545 -1540810 -1534527 -1529098 -1530011 -1526833 -1528038 -1534699 -1531137 -1530142 -1530525 -1527803 -1521776 -1512779 -1498954
$$ packed form
16571a686731L967N907L168K983J415l428J548M341q65M601O534P58J701K670
16557a651431L783K684K459K148k671p299j243K905M548N113O446j541J047K68
16543a632784J971P006M680L984k366j035J671P809p88q085o939M976J618O511
16529a611771L040l123J468N300n602K971P45n128K40M728M504P32M365M332k971
16514a596170O320p28n227P755N029P627l071j856J314O619K366J768l789j930
16500a573973k99K419K373J826J801J047M448L437J968m360L716K932P37m731
16486a556659J933j610n327N326N534J191o174j247Q431M618K687K444J695n424
16472a542582J037P35O283N429r13L178j205o661L562R95l83K722O027Q997J3825
$$ plain form
16457 -1498954 -1501738 -1508048 -1511233 -1512538 -1511670 -1516576 -1516226 -1515953 -1512560 -1509154 -1506339 -1509465 -1509748 -1513980 -1505750
16442 -1505750 -1497732 -1491061 -1486239 -1479246 -1478027 -1481996 -1483931 -1490217 -1491337 -1482121 -1479448 -1476439 -1470589 -1470190
16428 -1470190 -1476046 -1473894 -1473795 -1478264 -1480164 -1479887 -1482186 -1472662 -1469640 -1468226 -1462410 -1457836 -1458107 -1459365 -1458081
16413 -1458081 -1458309 -1461051 -1454532 -1449805 -1452083 -1452691 -1455360 -1450941 -1442824 -1441402 -1448241 -1451615 -1444782 -1438383
16399 -1438383 -1435237 -1438278 -1436542 -1430108 -1432954 -1432071 -1429024 -1441794 -1443548 -1441637 -1436654 -1435649 -1438077 -1434928
16385 -1434928 -1425540 -1422468 -1420733 -1418654 -1416668 -1418020 -1421087 -1417056 -1419492 -1421025 -1420974 -1417381 -1412464 -1409443
16371 -1409443 -1414597 -1414761 -1409387 -1399666 -1393632 -1396228 -1402272 -1406472 -1406775 -1407358 -1409278 -1409398 -1407299 -1398661 -1393120
16356 -1393120 -1391345 -1396509 -1397620 -1393196 -1387440 -1385016 -1384188 -1381400 -1375073 -1372237 -1374277 -1380673 -1379076 -1382844
$$ packed form
16457a498954k784o310l185j305Q68m906L50K73L393L406K815l126k83m232Q230
16442a505750Q018O671M822O993J219l969j935o286j120R216K673L009N850L99
16428a470190n856K152R9m469j900K77k299R524L022J414N816M574k71j258J284
16413a458081k28k742O519M727k278o08k669M419Q117J422o839l374O833O399
16399a438383L146l041J736O434k846Q83L047j2770j754J911M983J005k428L149
16385a434928R388L072J735K079J986j352l067M031k436j533N1L593M917L021
16371a409443n154j64N374R721O034k596o044m200l03n83j920j20K099Q638N541
16356a393120J775n164j111M424N756K424Q28K788O327K836k040o396J597l768
$$ plain form
16342 -1382844 -1377277 -1372600 -1369808 -1363680 -1367057 -1369613 -1377052 -1377979 -1378309 -1378547 -1376849 -1366352 -1366160 -1370575 -1371223
16327 -1371223 -1359298 -1356953 -1354725 -1356884 -1357944 -1351718 -1346666 -1346764 -1344556 -1342663 -1343500 -1346575 -1344356 -1340761
16313 -1340761 -1344060 -1346272 -1343816 -1338274 -1339237 -1337402 -1336871 -1334837 -1338169 -1335300 -1338757 -1338002 -1336820 -1335678 -1334352
16298 -1334352 -1327295 -1323155 -1319183 -1318115 -1325089 -1327937 -1327438 -1326924 -1322874 -1321174 -1316212 -1314809 -1310138 -1302471
16284 -1302471 -1304712 -1303399 -1297348 -1297029 -1302085 -1307910 -1306270 -1299125 -1292426 -1297287 -1305421 -1303376 -1299221 -1294133
16270 -1294133 -1297573 -1296321 -1293651 -1290381 -1288099 -1287592 -1288999 -1287492 -1283319 -1279739 -1274094 -1279321 -1281231 -1277243
16256 -1277243 -1280203 -1276747 -1275265 -1278733 -1280806 -1278111 -1277787 -1274354 -1277366 -1279272 -1276951 -1275650 -1272415 -1273143
16242 -1273143 -1269222 -1265851 -1266545 -1270409 -1276774 -1272948 -1268656 -1262721 -1263011 -1262954 -1261101 -1251405 -1255578 -1260109 -1259107
$$ packed form
16342a382844N567M677K792O128l377k556p439r27l30k38J698J0497J92m415o48
16327a371223J1925K345K228k159j060O226N052r8K208J893q37l075K219L595
16313a340761l299k212K456N542r63J835N31K034l332K869l457P55J182J142J326
16298a334352P057M140L972J068o974k848M99N14M050J700M962J403M671P667
16284a302471k241J313O051L19n056n825J640P145O699m861q134K045M155N088
16270a294133l440J252K670L270K282N07j407J507M173L580N645n227j910L988
16256a277243k960L456J482l468k073K695L24L433l012j906K321J301L235p28
16242a273143L921L371o94l864o365L826M292N935k90N7J853R696m173m531J002
$$ plain form
16227 -1259107 -1256245 -1252791 -1254627 -1258625 -1261406 -1258642 -1259081 -1260498 -1262185 -1265561 -1267206 -1253547 -1241802 -1235483
16213 -1235483 -1239978 -1240714 -1236342 -1234533 -1230951 -1222640 -1226573 -1234036 -1228791 -1232913 -1231661 -1228313 -1218371 -1223713
16199 -1223713 -1227823 -1230151 -1232834 -1228801 -1219717 -1218425 -1222956 -1222494 -1216376 -1219521 -1222600 -1219197 -1216013 -1208086
16185 -1208086 -1204888 -1210126 -1212990 -1217555 -1218735 -1215924 -1215829 -1213136 -1202358 -1199919 -1202963 -1206915 -1210025 -1211019
16171 -1211019 -1209310 -1205370 -1203254 -1196042 -1196580 -1195914 -1194198 -1188988 -1190986 -1187297 -1185627 -1186319 -1188862 -1185403 -1181064
16156 -1181064 -1183838 -1184496 -1184982 -1184857 -1176933 -1172409 -1170124 -1176501 -1173809 -1173839 -1175867 -1176815 -1169182 -1173722 -1175830
16141 -1175830 -1171280 -1166646 -1164327 -1167592 -1168852 -1170582 -1170319 -1171098 -1169592 -1177309 -1174323 -1168517 -1165083 -1161450
16127 -1161450 -1159534 -1157844 -1158800 -1156708 -1156175 -1152898 -1151611 -1154551 -1160459 -1157843 -1153374 -1156316 -1150159 -1146318
$$ packed form
16227a259107K862L454j836l998k781K764m39j417j687l376j645J3659J1745O319
16213a235483m495p36M372J809L582Q311l933p463N245m122J252L348R942n342
16199a223713m110k328k683M033R084J292m531M62O118l145l079L403L184P927
16185a208086L198n238k864m565j180K811R5K693J0778K439l044l952l110r94
16171a211019J709L940K116P212n38O66J716N210j998L689J670o92k543L459M339
16156a181064k774o58m86J25P924M524K285o377K692l0k028r48P633m540k108
16141a175830M550M634K319l265j260j730K63p79J506p717K986N806L434L633
16127a161450J916J690r56K092N33L277J287k940n908K616M469k942O157L841
$$ plain form
16113 -1146318 -1141623 -1136416 -1135594 -1140072 -1147166 -1148448 -1154333 -1149036 -1148879 -1143697 -1139866 -1133667 -1132614 -1128922
16099 -1128922 -1127570 -1135106 -1139639 -1145403 -1146892 -1149409 -1142225 -1132113 -1125970 -1120258 -1121781 -1124161 -1122828 -1124683
16085 -1124683 -1124251 -1116159 -1109013 -1104025 -1106601 -1113288 -1116319 -1112538 -1109004 -1109855 -1114665 -1116983 -1116405 -1113727 -1110409
16070 -1110409 -1113157 -1114779 -1115799 -1107671 -1101420 -1096009 -1097932 -1100298 -1099315 -1096277 -1091498 -1091088 -1096159 -1097004 -1098673
16055 -1098673 -1098191 -1094454 -1086625 -1089829 -1093429 -1092885 -1097137 -1098671 -1099176 -1098154 -1087412 -1086732 -1094863 -1094837 -1081766
16040 -1081766 -1074368 -1071462 -1075812 -1079006 -1078674 -1075414 -1073115 -1070828 -1074115 -1078546 -1078799 -1073560 -1066961 -1071765
16026 -1071765 -1072704 -1077693 -1076857 -1075575 -1071199 -1071931 -1073370 -1071577 -1064150 -1068045 -1066446 -1063926 -1063089 -1052726 -1051591
16011 -1051591 -1057884 -1064111 -1061660 -1051479 -1056707 -1059143 -1057151 -1049309 -1050544 -1049943 -1047372 -1043186 -1044627 -1043721
$$ packed form
16113a146318M695N207Q22m478p094j282n885N297J57N182L831O199J053L692
16099a128922J352p536m533n764j489k517P184J0112O143N712j523k380J333j855
16085a124683M32Q092P146M988k576o687l031L781L534q51m810k318N78K678L318
16070a110409k748j622j020Q128O251N411j923k366R83L038M779M10n071q45j669
16055a098673M82L737P829l204l600N44m252j534n05J022J0742O80q131K6J3071
16040a081766P398K906m350l194L32L260K299K287l287m431k53N239O599m804
16026a071765r39m989Q36J282M376p32j439J793P427l895J599K520Q37J0363J135
16011a051591o293o227K451J0181n228k436J992P842j235O01K571M186j441R06
$$ plain form
15997 -1043721 -1042339 -1041773 -1040534 -1043955 -1043177 -1037945 -1038767 -1037325 -1036618 -1034697 -1029362 -1028773 -1031106 -1033686 -1031436
15982 -1031436 -1033123 -1035618 -1038966 -1042021 -1038034 -1036521 -1036348 -1033808 -1031472 -1026443 -1014795 -1012372 -1018927 -1018605
15968 -1018605 -1012055 -1010778 -1010774 -1013427 -1019458 -1023697 -1023623 -1017723 -1014526 -1006247 -1005494 -1005421 -1000573 -1000116 -1000256 -1004187
15952 -1004187 -1006590 -1004287 -1006283 -1006715 -1008304 -1008679 -1008209 -1008068 -999836 -990669 -993324 -995162 -993270 -992769 -988969
15937 -988969 -989877 -992631 -986175 -985352 -988250 -989783 -985795 -985254 -987705 -991145 -991206 -992412 -995360 -993676 -986418
15922 -986418 -978844 -977861 -978338 -980559 -975062 -974076 -971151 -971282 -974988 -971100 -971297 -970775 -956494 -950483 -952494
15907 -952494 -961012 -967058 -967827 -963419 -958813 -959570 -961126 -960832 -953716 -948656 -943309 -936235 -934435 -926561 -920739
15892 -920739 -922082 -921540 -922023 -925401 -931419 -943888 -944887 -944062 -938277 -929424 -928228 -921934 -915310 -909651 -907335
$$ packed form
15997a043721J382N66J239l421P78N232q22J442P07J921N335N89k333k580K250
15982a031436j687k495l348l055L987J513J73K540K336N029J1648K423o555L22
15968a018605O550J277Mk653o031m239P4N900L197Q279P53P3M848M57j40l931
15952a004187k403K303j996m32j589l75M70J41Q232R167k655j838J892N01L800
15937i88969r08k754O456Q23k898j533L988N41k451l440o1j206k948J684P258
15922i86418P574R83m77k221N497R86K925j31l706L888j97N22J4281O011k011
15907i52494q518o046p69M408M606p57j556K94P116N060N347P074J800P874N822
15892i20739j343N42m83l378o018j2469r99Q25N785Q853J196O294O624N659K316
$$ plain form
15877 -907335 -904441 -898163 -888361 -884802 -874527 -871510 -864828 -861538 -859248 -860382 -846999 -834613 -826087
15864 -826087 -819934 -807876 -784679 -767834 -777994 -826731 -905247 -972899 -989124 -979664 -954825 -936026
15852 -936026 -964215 -1039847 -1106216 -1124159 -1112683 -1094120 -1081015 -1064988 -1044298 -1025051 -1016468 -1012612
15840 -1012612 -1008735 -1003509 -996736 -991424 -987213 -976428 -976149 -980981 -977775 -978349 -973091 -971028 -971158 -956838
15826 -956838 -942642 -936890 -947026 -957406 -966237 -975733 -972137 -966969 -968163 -970617 -971386 -964210 -965689 -962165
15812 -962165 -961051 -953849 -946721 -942799 -941544 -942126 -941438 -939394 -941237 -937389 -936519 -935757 -930211 -919834 -913368
15797 -913368 -909876 -908384 -904310 -902688 -902477 -903000 -902261 -903068 -906597 -903239 -900006 -890885 -889229 -899435 -895552
15782 -895552 -885156 -886234 -879313 -872661 -867305 -863835 -858993 -858138 -862632 -864505 -860525 -851182 -840955 -830853
$$ packed form
15877i07335K894O278R802L559J0275L017O682L290K290j134J3383J2386Q526
15864h26087O153J2058K3197J6845j0160m8737p8516o7652j6225R460K4839J8799
15852i36026k8189p5632o6369j7943J1476J8563J3105J6027K0690J9247Q583L856
15840a012612L877N226O773N312M211J0785K79m832L206n74N258K063j30J4320
15826i56838J4196N752j0136j0380q831r496L596N168j194k454p69P176j479L524
15812i62165J114P202P128L922J255n82O88K044j843L848Q70P62N546J0377O466
15797i13368L492J492M074J622K11n23P39q07l529L358L233R121J656j0206L883
15782h95552J0396j078O921O652N356L470M842Q55m494j873L980R343J0227J0102
$$ plain form
15768 -830853 -821514 -817990 -801306 -785181 -768555 -743460 -710505 -684407 -690911 -769164 -883634 -952566
15756 -952566 -948349 -916981 -880307 -862582 -919953 -1030185 -1114345 -1129327 -1108601 -1086312 -1063633
15745 -1063633 -1040323 -1023844 -1011404 -1008616 -997223 -990597 -985095 -981224 -975758 -972388 -964969 -949806 -939627
15732 -939627 -937731 -940120 -935798 -938039 -938478 -937278 -936014 -935436 -938834 -933575 -926547 -923456 -921762 -923523 -930202
15717 -930202 -927105 -922465 -914706 -911184 -912836 -912699 -905716 -900701 -900802 -907664 -903866 -900621 -905055 -903196 -898200
15702 -898200 -895553 -898187 -900166 -902163 -905717 -907721 -905768 -906230 -903353 -909379 -911363 -903282 -897541 -893827
15688 -893827 -895656 -890425 -890971 -888773 -890649 -887633 -882578 -881412 -890122 -892155 -889837 -887029 -884679 -882338
15674 -882338 -879899 -873430 -868947 -866553 -864403 -865935 -866053 -866933 -868574 -873970 -878614 -877276 -873126 -867602 -864432
$$ packed form
15768h30853R339L524J6684J6125J6626K5095L2955K6098o504p8253j14470o8932
15756i52566M217L1368L6674J7725n7371j10232q4160j4982K0726K2289K2679
15745a063633K3310J6479J2440K788J1393O626N502L871N466L370P419J5163J0179
15732i39627J896k389M322k241m39J200J264N78l398N259P028L091J694j761o679
15717i30202L097M640P759L522j652J37O983N015j01o862L798L245m434J859M996
15702h98200K647k634j979j997l554k004J953m62K877o026j984Q081N741L714
15688h93827j829N231n46K198j876L016N055J166q710k033K318K808K350K341
15674h82338K439O469M483K394K150j532j18q80j641n396m644J338M150N524L170
$$ plain form
15659 -864432 -857322 -853497 -856627 -852449 -851375 -854165 -857961 -858253 -848661 -849168 -848480 -849946 -851119 -853782 -855220
15644 -855220 -853471 -848913 -842572 -840996 -833705 -834128 -833075 -834029 -831015 -830897 -835952 -837858 -839401 -837378 -834241
15629 -834241 -836162 -837801 -843348 -846837 -842901 -834710 -834924 -835564 -831048 -829173 -829669 -828767 -830291 -831100 -830514 -827629
15613 -827629 -830159 -829325 -827703 -828470 -827685 -823821 -822208 -818982 -814922 -809140 -809381 -809656 -814418 -815811 -809618
15598 -809618 -809155 -812147 -819047 -820661 -820775 -821879 -820776 -820624 -820598 -818873 -816706 -815116 -815221 -817994 -809942 -810064
15582 -810064 -814812 -813753 -807468 -804596 -807939 -809153 -807304 -797786 -795854 -795557 -800437 -799886 -798199 -800442 -802045
15567 -802045 -800562 -795070 -792419 -791060 -793136 -793869 -792386 -794040 -797678 -795437 -791758 -791870 -794532 -798515 -789926
15552 -789926 -784724 -787386 -786545 -782911 -785573 -786164 -781638 -777726 -777158 -774956 -778048 -780314 -785263 -785256 -777332 -779416
$$ packed form
15659h64432P110L825l130M178J074k790l796k92R592n07O88j466j173k663j438
15644h55220J749M558O341J576P291m23J053r54L014J18n055j906j543K023L137
15629h34241j921j639n547l489L936Q191k14o40M516J875m96R02j524q09N86K885
15613h27629k530Q34J622p67P85L864J613L226M060N782k41k75m762j393O193
15598h09618M63k992o900j614j14j104J103J52K6J725K167J590j05k773Q052j22
15582h10064m748J059O285K872l343j214J849R518J932K97m880N51J687k243j603
15567h02045J483N492K651J359k076p33J483j654l638K241L679j12k662l983Q589
15552g89926N202k662Q41L634k662n91M526L912N68K202l092k266m949PP924k084
$$ plain form
15536 -779416 -779970 -775018 -779517 -783541 -778759 -775214 -775374 -779593 -770401 -773045 -766471 -760604 -761859 -769351 -773028
15521 -773028 -774686 -775723 -774587 -772938 -775248 -772589 -764711 -766827 -764955 -764085 -762290 -763601 -767471 -768190 -764568
15506 -764568 -760499 -759366 -762881 -772862 -770873 -767936 -764640 -766578 -765600 -760914 -757953 -760954 -761405 -757387 -755344
15491 -755344 -754141 -751646 -752561 -746232 -742699 -751584 -754145 -757144 -749268 -736618 -741611 -745157 -746954 -745788
15477 -745788 -743695 -747311 -751715 -758766 -754075 -746899 -748690 -748754 -744447 -741686 -739870 -742218 -743328 -744639 -744149
15462 -744149 -744504 -740998 -740599 -744853 -739712 -741241 -737587 -737556 -732214 -736554 -733221 -734255 -733056 -741406 -737945
15447 -737945 -729054 -720931 -716510 -721547 -727121 -737832 -741551 -739145 -738198 -730997 -728673 -732417 -725878 -721374
15433 -721374 -719983 -715758 -718155 -718289 -717541 -725694 -726840 -721436 -719210 -721864 -716205 -707382 -704883 -705488 -710241
$$ packed form
15536g79416n54M952m499m024M782L545j60m219R192k644O574N867j255p492l677
15521g73028j658j037J136J649k310K659P878k116J872Q70J795j311l870p19L622
15506g64568M069J133l515r981J989K937L296j938R78M686K961l001m51M018K043
15491g55344J203K495r15O329L533q885k561k999P876J2650m993l546j797J166
15477g45788K093l616m404p051M691P176j791o4M307K761J816k348j110j311M90
15462g44149l55L506L99m254N141j529L654L1N342m340L333j034J199q350L461
15447g37945Q891Q123M421n037n574j0711l719K406R47P201K324l744O539M504
15433g21374J391M225k397j34P48q153j146N404K226k654N659Q823K499o05m753
$$ plain form
15418 -710241 -721813 -718505 -713063 -712551 -714016 -712244 -712497 -709683 -708658 -706697 -713656 -711189 -710919 -712548 -714435
15403 -714435 -713554 -714742 -711209 -706127 -702615 -700817 -702230 -701320 -700269 -695862 -702168 -701217 -697754 -693116 -687529
15388 -687529 -695038 -697251 -701106 -698867 -701373 -704351 -704489 -699514 -694585 -690999 -682810 -678460 -679199 -684984 -684311
15373 -684311 -682886 -681552 -680295 -684910 -686230 -685604 -689680 -687704 -690183 -687089 -677357 -682075 -684346 -685892
15359 -685892 -684536 -686031 -680157 -680285 -685990 -682289 -681752 -678980 -676712 -678300 -676893 -671866 -670909 -674663 -671605
15344 -671605 -670378 -673695 -679526 -676279 -678574 -677155 -675252 -676213 -671417 -668785 -668510 -669987 -671245 -669774 -669301
15329 -669301 -672154 -673148 -669789 -664439 -665346 -673678 -670453 -664944 -666998 -667039 -668534 -665269 -668808 -671592 -662398
15314 -662398 -649144 -647260 -649493 -648007 -646785 -646964 -648646 -643949 -650727 -652802 -654755 -657909 -660869 -657995
$$ packed form
15418g10241j1572L308N442N12j465J772k53K814J025J961o959K467K70j629j887
15403g14435Q81j188L533N082L512J798j413R10J051M407o306R51L463M638N587
15388f87529p509k213l855K239k506k978j38M975M929L586Q189M350p39n785O73
15373f84311J425J334J257m615j320O26m076J976k479L094R732m718k271j546
15359f85892J356j495N874j28n705L701N37K772K268j588J407N027R57l754L058
15344f71605J227l317n831L247k295J419J903r61M796K632K75j477j258J471M73
15329f69301k853r94L359N350r07q332L225N509k054m1j495L265l539k784R194
15314f62398J3254J884k233J486J222j79j682M697o778k075j953l154k960K874
$$ plain form
15300 -657995 -655597 -655812 -655372 -649796 -648690 -650701 -642238 -638081 -634610 -630806 -639618 -642267 -638028 -636256 -635944
15285 -635944 -639078 -636431 -638511 -641618 -643760 -640292 -636362 -631729 -627702 -629600 -626967 -625961 -627792 -634645
15271 -634645 -635152 -632006 -632891 -631643 -628713 -624536 -612880 -614611 -623444 -634468 -637726 -634635 -631384 -630466
15257 -630466 -626093 -631232 -634660 -630338 -618180 -616569 -622160 -622618 -620705 -616146 -618552 -623027 -616840 -613992
15243 -613992 -615624 -613964 -602848 -605568 -613004 -619376 -625653 -620957 -607081 -600336 -610889 -621315 -622441
15230 -622441 -616776 -621183 -622849 -614635 -612696 -611543 -608180 -609259 -608857 -600132 -597664 -598738 -598117 -592058 -592185
15215 -592185 -600435 -598588 -590311 -582197 -578017 -582220 -584202 -581195 -581496 -585343 -587872 -589114 -582141 -581360 -581852
15200 -581852 -579677 -576316 -571898 -575745 -577634 -572114 -566278 -559627 -551895 -555705 -556732 -552211 -548095 -543254
$$ packed form
15300f57995K398k15M40N576J106k011Q463M157L471L804q812k649M239J772L12
15285f35944l134K647k080l107k142L468L930M633M027j898K633J006j831o853
15271f34645n07L146q85J248K930M177J1656j731q833j1024l258L091L251R18
15257f30466M373n139l428M322J2158J611n591m58J913M559k406m475O187K848
15243f13992j632J660J1116k720p436o372o277M696J3876O745j0553j0426j126
15230f22441N665m407j666Q214J939J153L363j079M02Q725K468j074O21O059j27
15215e92185q250J847Q277Q114M180m203j982L007l01l847k529j242O973P81m92
15200e81852K175L361M418l847j889N520N836O651P732l810j027M521M116M841
$$ plain form
15186 -543254 -534610 -523222 -517755 -510816 -499918 -494669 -479993 -456028 -447930 -465223 -510404 -583790
15174 -583790 -653022 -697845 -715538 -708649 -696140 -681779 -663827 -651846 -646321 -644399 -631961 -621550
15162 -621550 -612197 -603394 -602352 -605291 -605592 -597758 -594689 -589492 -584173 -583082 -585239 -578780 -575397 -571079
15148 -571079 -569067 -566148 -557176 -554055 -543015 -540152 -534653 -527723 -513225 -495428 -472521 -456517 -448018
15135 -448018 -453509 -496624 -572665 -645032 -692401 -711706 -710632 -696602 -687441 -669684 -651420 -643563
15123 -643563 -643100 -638635 -632937 -634735 -626835 -618501 -615368 -615207 -613076 -611673 -615867 -606576 -592786 -586706
15109 -586706 -583862 -586713 -584611 -583522 -588292 -579139 -576250 -578364 -575914 -580207 -587148 -578570 -568380 -557276
15095 -557276 -551617 -554445 -550598 -548849 -551623 -548631 -551694 -552866 -545498 -543729 -541470 -534858 -530346 -514452
$$ packed form
15186e43254Q644J1388N467O939J0898N249J4676K3965Q098j7293m5181p3386
15174e83790o9232m4823j7693O889J2509J4361J7952J1981N525J922J2438J0411
15162f21550R353Q803J042k939l01P834L069N197N319J091k157O459L383M318
15148e71079K012K919Q972L121J1040K863N499O930J4498J7797K2907J6004Q499
15135d48018n491m3115p6041p2367m7369j9305J074J4030R161J7757J8264P857
15123f43563M63M465N698j798P900Q334L133J61K131J403m194R291J3790O080
15109e86706K844k851K102J089m770R153K889k114K450m293o941Q578J0190J1104
15095e57276N659k828L847J749k774K992l063j172P368J769K259O612M512J5894
$$ plain form
15081 -514452 -498915 -481991 -473713 -475013 -494715 -529727 -587613 -636665 -651961 -655944 -648111 -640249
15069 -640249 -628182 -618988 -618112 -621268 -611899 -598013 -592207 -590206 -594369 -594984 -580374 -571579 -564413 -565818
15055 -565818 -572218 -570775 -564097 -564908 -563359 -566817 -565088 -563852 -563395 -556260 -543870 -533872 -533329 -534115 -520438
15040 -520438 -504368 -490482 -475051 -461452 -450809 -460573 -498685 -553469 -613071 -655441 -668797 -666803
15028 -666803 -659615 -646540 -637352 -625943 -616164 -609423 -605783 -601367 -598191 -591691 -581027 -578301 -579093 -579298
15014 -579298 -577339 -571051 -570106 -569532 -571437 -573423 -574431 -574281 -574888 -575582 -577145 -571548 -560619 -557437 -555614
14999 -555614 -552646 -555285 -559932 -560209 -552143 -556120 -553321 -553222 -552380 -551672 -553117 -558877 -559445 -559023 -552785 -546624
14983 -546624 -543025 -539494 -539427 -541527 -542631 -541724 -539850 -539753 -537099 -539035 -538160 -533302 -529641 -540906 -544674
$$ packed form
15081e14452J5537J6924Q278j300j9702l5012n7886m9052j5296l983P833P862
15069f40249J2067R194Q76l156R369J3886N806K001m163o15J4610Q795P166j405
15055e65818o400J443O678q11J549l458J729J236M57P135J2390R998N43p86J3677
15040e20438J6070J3886J5431J3599J0643r764l8112n4784n9602m2370j3356J994
15028f66803P188J3075R188J1409R779O741L640M416L176O500J0664K726p92k05
15014e79298J959O288R45N74j905j986j008J50o07o94j563N597J0929L182J823
14999e55614K968k639m647k77Q066l977K799R9Q42P08j445n760n68M22O238O161
14983e46624L599L531O7k100j104R07J874R7K654j936Q75M858L661j1265l768
$$ plain form
14968 -544674 -538903 -538470 -542438 -539580 -534680 -538972 -536959 -530009 -525543 -524432 -527577 -527154 -527651 -533940 -534983
14953 -534983 -534280 -527393 -530708 -537979 -531721 -530264 -528888 -528195 -523169 -517175 -513976 -516434 -510343 -510397 -509151
14938 -509151 -514399 -517328 -517452 -513264 -506290 -508921 -516597 -520084 -515870 -513928 -514909 -515727 -516813 -518375 -520418
14923 -520418 -515538 -518848 -526656 -522889 -519134 -518223 -519116 -514940 -509615 -507469 -506157 -507957 -507784 -513114 -512397
14908 -512397 -514195 -514699 -509860 -509809 -509138 -504010 -502636 -502829 -502594 -495005 -494476 -494996 -501912 -501793 -503394 -505336
14892 -505336 -503683 -504100 -501657 -505388 -505886 -502351 -494308 -490262 -487418 -489505 -492249 -491151 -498173 -501378 -502885
14877 -502885 -501588 -499811 -491800 -489635 -491802 -493344 -489172 -485883 -487238 -492260 -492736 -491128 -490540 -490628 -482301
14862 -482301 -477952 -484554 -492872 -493979 -485598 -485138 -487698 -488047 -486995 -489726 -486989 -481467 -474664 -468363 -465928
$$ packed form
14968e44674N771M33l968K858M900m292K013O950M466J111l145M23m97o289j043
14953e34983P03O887l315p271O258J457J376O93N026N994L199k458O091n4J246
14938e09151n248k929j24M188O974k631p676l487M214J942r81q18j086j562k043
14923e20418M880l310p808L767L755R11q93M176N325K146J312j800J73n330P17
14908e12397j798n04M839N1O71N128J374j93K35P589N29n20o916J19j601j942
14892e05336J653m17K443l731m98L535Q043M046K844k087k744J098p022l205j507
14877e02885J297J777Q011K165k167j542M172L289j355n022m76J608N88q8Q327
14862d82301M349o602q318j107Q381M60k560l49J052k731K737N522O803O301K435
$$ plain form
14847 -465928 -464334 -462657 -462086 -472724 -476185 -477574 -481725 -472178 -467531 -475975 -484217 -480223 -472435 -462869
14833 -462869 -463536 -464461 -460270 -465586 -471080 -470882 -472492 -476905 -471710 -469529 -469416 -468523 -470914 -467138 -468231
14818 -468231 -468509 -467335 -461985 -462952 -465981 -469776 -467601 -461489 -468179 -467203 -459042 -457028 -459412 -459299 -455795
14803 -455795 -451191 -449925 -457483 -465409 -465545 -460387 -458684 -459754 -461144 -459852 -462096 -469194 -471272 -467995
14789 -467995 -468373 -461442 -452857 -449154 -445765 -443138 -436670 -439825 -445064 -449445 -454169 -454780 -448343 -448199 -450298
14774 -450298 -450245 -450562 -448573 -446094 -442825 -435100 -436409 -440962 -443327 -439931 -438266 -431163 -433752 -434498 -435587
14759 -435587 -442720 -445794 -444359 -442633 -441723 -440271 -437240 -437945 -442529 -440390 -438915 -436751 -439166 -437487 -439288
14744 -439288 -438899 -438066 -430740 -418578 -416463 -416570 -420632 -422471 -423316 -423265 -428818 -428094 -430965 -435973 -435883 -429196
$$ packed form
14847d65928J594J677N71j0638l461j389m151R547M647q444q242L994P788R566
14833d62869o67r25M191n316n494J98j610m413N195K181J13Q93k391L776j093
14818d68231k78J174N350r67l029l795K175O112o690R76Q161K014k384J13L504
14803d55795M604J266p558p926j36N158J703j070j390J292k244p098k078L277
14789d67995l78O931Q585L703L389K627O468l155n239m381m724o11O437J44k099
14774d50298N3l17J989K479L269P725j309m553k365L396J665P103k589p46j089
14759d35587p133l074J435J726R10J452L031p05m584K139J475K164k415J679j801
14744d39288L89Q33P326J2162K115j07m062j839q45N1n553P24k871n008R0O687
$$ plain form
14728 -429196 -420119 -409657 -407298 -405414 -409665 -417999 -420134 -416379 -414030 -412029 -417821 -415679 -416865 -419072
14714 -419072 -416685 -414125 -409059 -405683 -410423 -417331 -417601 -411389 -412813 -402298 -396070 -404837 -408732 -418295
14700 -418295 -412169 -409944 -407327 -407165 -408717 -409155 -406701 -411331 -407587 -407912 -408263 -407842 -402621 -395990 -402210
14685 -402210 -408267 -405606 -403724 -400267 -405295 -407276 -405505 -406751 -411274 -407076 -402377 -407068 -409818 -407713
14671 -407713 -411673 -409343 -406828 -400650 -403737 -400575 -394820 -393541 -401160 -406064 -406824 -401478 -397379 -399821
14657 -399821 -402343 -399525 -392703 -394012 -396027 -395225 -391049 -383324 -379076 -380673 -385367 -395146 -400541 -399018
14643 -399018 -396876 -396243 -398440 -394273 -390794 -386242 -391776 -395924 -393092 -390705 -386134 -377258 -376397 -379830 -383002
14628 -383002 -382961 -383830 -387329 -382126 -379770 -384009 -383123 -383369 -381830 -377707 -374404 -373385 -373628 -379859 -384204 -383829
$$ packed form
14728d29196R077J0462K359J884m251q334k135L755K349K001n792K142j186k207
14714d19072K387K560N066L376m740o908k70O212j424J0515O228q767l895r563
14700d18295O126K225K617J62j552m38K454m630L744l25l51M21N221O631o220
14685d02210o057K661J882L457n028j981J771j246m523M198M699m691k750K105
14671d07713l960K330K515O178l087L162N755J279p619m904p60N346M099k442
14657c99821k522K818O822j309k015Q02M176P725M248j597m694r779n395J523
14643c99018K142O33k197M167L479M552n534m148K832K387M571Q876Q61l433l172
14628c83002M1q69l499N203K356m239Q86k46J539M123L303J019k43o231m345L75
$$ plain form
14612 -383829 -383090 -379177 -376185 -378824 -376421 -378978 -383185 -382127 -379651 -376414 -376107 -376836 -377913 -374043 -372246
14597 -372246 -365802 -369168 -374807 -370425 -364714 -362975 -357928 -355498 -357659 -372221 -374148 -371243 -364883 -363157
14583 -363157 -370651 -371666 -368808 -369827 -371748 -363034 -358816 -358983 -365432 -369881 -371807 -370170 -367513 -365969
14569 -365969 -363165 -365619 -362522 -351584 -352914 -353384 -353540 -356709 -357699 -363291 -363512 -359517 -356340 -357611 -359575
14554 -359575 -355796 -353423 -358524 -362360 -359193 -359642 -353233 -355549 -358655 -356432 -355476 -360058 -357049 -358013 -354890
14539 -354890 -347884 -345996 -348462 -352291 -355482 -358833 -362316 -361296 -364023 -361922 -357739 -357328 -355339 -354533 -345954
14524 -345954 -344585 -347902 -348796 -336412 -330929 -331259 -334111 -338562 -335120 -337843 -342196 -340886 -341892 -343077
14510 -343077 -346993 -344469 -339103 -340871 -343107 -339765 -342573 -341075 -344404 -352721 -349821 -346551 -345258 -340405
$$ packed form
14612c83829P39L913K992k639K403k557m207J058K476L237L07p29j077L870J797
14597c72246O444l366n639M382N711J739N047K430k161j4562j927K905O360J726
14583c63157p494j015K858j019j921Q714M218j67o449m449j926J637K657J544
14569c65969K804k454L097J0938j330m70j56l169r90n592k21L995L177j271j964
14554c59575L779K373n101l836L167m49O409k316l106K223R56m582L009r64L123
14539c54890P006J888k466l829l191l351l483J020k727K101M183M11J989Q06Q579
14524c45954J369l317q94J2384N483l30k852m451L442k723m353J310j006j185
14510c43077l916K524N366j768k236L342k808J498l329q317K900L270J293M853
$$ plain form
14496 -340405 -335910 -334524 -334580 -335185 -333504 -333406 -328753 -327080 -332498 -335635 -337349 -335561 -335206 -335180 -334263 -337259
14480 -337259 -342712 -334982 -332296 -338670 -336605 -333329 -332920 -327017 -326566 -330242 -331892 -332937 -329225 -325306 -326313
14465 -326313 -326174 -328694 -327620 -323746 -326141 -325612 -314662 -306929 -309627 -317414 -316530 -305662 -300819 -307572
14451 -307572 -308802 -309984 -308536 -306707 -309946 -310972 -306829 -306785 -305331 -304682 -298119 -293768 -289799 -292940 -295761
14436 -295761 -298780 -298413 -300199 -305111 -313484 -317330 -325855 -329207 -323569 -328092 -330173 -326395 -320336 -320705 -321989
14421 -321989 -317940 -312167 -313027 -311835 -312749 -312702 -313198 -310726 -305127 -306154 -299789 -297495 -298925 -303231 -304563
14406 -304563 -297438 -299641 -303762 -303184 -294792 -289262 -290461 -299113 -303770 -294154 -288481 -294278 -292289 -282575
14392 -282575 -286949 -295771 -302190 -299451 -293795 -292440 -286780 -276260 -272509 -272915 -282885 -292345 -294073 -280844
$$ packed form
14496c40405M495J386n6o05J681R8M653J673n418l137j714J788L55K6R17k996
14480c37259n453P730K686o374K065L276M09N903M51l676j650j045L712L919j007
14465c26313J39k520J074L874k395N29J0950P733k698p787Q84J0868M843o753
14451c07572j230j182J448J829l239j026M143M4J454O49O563M351L969l141k821
14436b95761l019L67j786m912q373l846q525l352N638m523k081L778O059l69j284
14421c21989M049N773q60J192r14M7m96K472N599j027O365K294j430m306j332
14406c04563P125k203m121N78Q392N530j199q652m657R616N673n797J989R714
14392b82575m374q822o419K739N656J355N660J0520L751m06r970r460j728J3229
$$ plain form
14378 -280844 -270601 -275601 -283955 -290866 -292774 -288809 -294205 -288266 -282318 -278418 -278173 -277232 -275835 -281108
14364 -281108 -283857 -278194 -276494 -274760 -272963 -266904 -270110 -273709 -280423 -281850 -276605 -275634 -271423 -264307
14350 -264307 -268660 -267007 -272541 -280748 -278362 -270130 -268210 -270523 -270792 -269074 -270606 -276701 -279917 -277345
14336 -277345 -271534 -267500 -260691 -257639 -260530 -261302 -266354 -269162 -265474 -263758 -269255 -268760 -263657 -263538 -268791
14321 -268791 -266128 -265605 -269618 -270450 -269419 -265276 -262449 -264603 -266421 -267904 -263161 -258493 -256598 -260051 -262762
14306 -262762 -265214 -264089 -261995 -258529 -259301 -257854 -254410 -245123 -248728 -259958 -264223 -263998 -258679 -256147
14292 -256147 -253612 -255971 -255655 -251888 -248265 -241904 -239155 -239844 -240902 -245071 -248816 -249162 -244149 -241059 -241041
14277 -241041 -246448 -249538 -249277 -248345 -247061 -245553 -242959 -241541 -240820 -245444 -251495 -252800 -240899 -231689 -235990
$$ packed form
14378b80844J0243n000q354o911j908L965n396N939N948L900K45R41J397n273
14364b81108k749N663J700J734J797O059l206l599o714j427N245R71M211P116
14350b64307m353J653n534q207K386Q232J920k313k69J718j532o095l216K572
14336b77345N811M034O809L052k891p72n052k808L688J716n497M95N103J19n253
14321b68791K663N23m013q32J031M143K827k154j818j483M743M668J895l453k711
14306b62762k452J125K094L466p72J447L444R287l605j1230m265K25N319K532
14292b56147K535k359L16L767L623O361K749o89j058m169l745l46N013L090J8
14277b41041n407l090K61R32J284J508K594J418P21m624o051j305J1901R210m301
$$ plain form
14262 -235990 -243506 -245166 -243036 -240201 -239136 -241462 -242428 -239549 -230109 -227332 -227844 -233363 -231943 -233773 -234797
14247 -234797 -236045 -246331 -245464 -238937 -235590 -228460 -225913 -231527 -236748 -233436 -228226 -227091 -235927 -238540
14233 -238540 -235963 -228753 -224757 -223676 -224968 -221155 -223123 -223243 -223182 -227966 -233709 -230838 -230039 -224898 -212780
14218 -212780 -205728 -210009 -214582 -215097 -218989 -217179 -220627 -227635 -233105 -236699 -234453 -227893 -227028 -228130 -227477
14203 -227477 -222249 -218442 -216786 -217710 -221373 -220356 -222414 -221863 -215648 -212379 -210166 -210084 -206562 -207150 -206430 -204711
14187 -204711 -203707 -207767 -203434 -197240 -201161 -199127 -199429 -204680 -198680 -195030 -202729 -203284 -202381 -203473 -198981
14172 -198981 -195520 -194427 -194620 -203592 -207040 -209819 -206454 -201178 -193177 -197899 -199364 -202356 -207736 -205276
14158 -205276 -197743 -198070 -195323 -193637 -199352 -199899 -196220 -192205 -189822 -194468 -197227 -196209 -195147 -195467 -191909
$$ packed form
14262b35990p516j660K130K835J065k326r66K879R440K777n12n519J420j830j024
14247b34797j248j0286Q67O527L347P130K547n614n221L312N210J135q836k613
14233b38540K577P210L996J081j292L813j968j20O1m784n743K871P99N141J2118
14218b12780P052m281m573n15l892J810l448p008n470l594K246O560Q65j102O53
14203b27477N228L807J656r24l663J017k058N51O215L269K213Q2L522n88P20J719
14187b04711J004m060M333O194l921K034l02n251O000L650p699n55R03j092M492
14172a98981L461J093j93q972l448k779L365N276Q001m722j465k992n380K460
14158b05276P533l27K747J686n715n47L679M015K383m646k759J018J062l20L558
$$ plain form
14143 -191909 -187242 -182985 -182730 -182118 -184898 -187389 -187212 -187028 -186817 -186722 -190885 -190753 -189357 -186309 -187104 -185096
14127 -185096 -182422 -179800 -174793 -173263 -175253 -179797 -185203 -183595 -176516 -173914 -171949 -167463 -165739 -170887
14113 -170887 -172993 -175324 -177301 -183788 -187638 -182183 -171425 -166069 -165149 -174744 -179577 -176936 -176806 -183517
14099 -183517 -177487 -163902 -158255 -163350 -168911 -171141 -170750 -165630 -165446 -168518 -169322 -161485 -163649 -165936 -168193
14084 -168193 -173855 -179098 -177689 -179527 -177431 -176651 -173841 -167232 -161795 -163512 -164333 -163545 -160196 -162497 -164999
14069 -164999 -169686 -168802 -166443 -161245 -158223 -157891 -156416 -155286 -154230 -154690 -154063 -147186 -147194 -152256 -158417 -151501
14053 -151501 -147653 -148866 -140792 -143517 -146363 -147817 -157553 -161663 -152706 -144933 -139428 -135108 -137553 -142899
14039 -142899 -141509 -141716 -139090 -133860 -134649 -139086 -145980 -146330 -140545 -142084 -142768 -141680 -144140 -137839 -135642
$$ packed form
14143a91909M667M257K55O12k780k491J77J84K11R5m163J32J396L048p95K008
14127a85096K674K622N007J530j990m544n406J608P079K602J965M486J724n148
14113a70887k106k331j977o487l850N455J0758N356R20r595m833K641J30o711
14099a83517O030J3585N647n095n561k230L91N120J84l072q04P837k164k287k257
14084a68193n662n243J409j838K096P80K810O609N437j717q21P88L349k301k502
14069a64999m687Q84K359N198L022L32J475J130J056m60O27O877qn062o161O916
14053a51501L848j213Q074k725k846j454r736m110Q957P773N505M320k445n346
14039a42899J390k07K626N230p89m437o894l50N785j539o84J088k460O301K197
$$ plain form
14024 -135642 -142618 -146745 -143058 -145965 -150128 -144525 -142740 -136147 -137843 -144406 -141053 -135835 -138434 -138049
14010 -138049 -137069 -134900 -132632 -134632 -134337 -132622 -134435 -135715 -137992 -135865 -127303 -126322 -124809 -126795 -123542
13995 -123542 -121316 -120647 -127911 -129491 -127589 -119160 -117547 -123605 -127539 -135141 -133986 -127440 -125157 -120690
13981 -120690 -119066 -118304 -116797 -117038 -121966 -123455 -125526 -121172 -119585 -117355 -116310 -116618 -112720 -113544 -115025
13966 -115025 -115606 -116279 -120890 -116429 -114418 -118100 -112703 -113508 -109234 -101693 -105904 -110683 -108326 -112001 -111717
13951 -111717 -110161 -112471 -115516 -107340 -100717 -103536 -105163 -107944 -107957 -110272 -115635 -112962 -114638 -121030 -117875
13936 -117875 -111313 -104763 -97282 -102629 -100618 -101002 -102962 -104056 -104350 -99438 -88667 -85313 -86227 -92377 -90966
13921 -90966 -87381 -86404 -82586 -79171 -83206 -84877 -84579 -90474 -89365 -76996 -74378 -75786 -78661 -85484 -87917
$$ packed form
14024a35642o976m127L687k907m163N603J785O593j696o563L353N218k599L85
14010a38049R80K169K268k000K95J715j813j280k277K127Q562R81J513j986L253
13995a23542K226O69p264j580J902Q429J613o058l934p602J155O546K283M467
13981a20690J624P62J507k41m928j489k071M354J587K230J045l08L898q24j481
13966a15025n81o73m611M461K011l682N397q05M274P541m211m779K357l675K84
13951a11717J556k310l045Q176O623k819j627k781j3k315n363K673j676o392L155
13936a17875O562O550P481n347K011l84j960j094k94M912J0771L354r14o150J411
13921i0966L585R77L818L415m035j671K98n895J109J2369K618j408k875o823k433
$$ plain form
13906 -87917 -88644 -87853 -83883 -84311 -80957 -81500 -82741 -79400 -79047 -87433 -81992 -77512 -77832 -81148 -79705 -80883
13890 -80883 -84985 -78021 -74383 -75372 -73753 -67321 -72824 -77415 -77810 -77227 -68773 -64948 -62688 -66646 -63869
13875 -63869 -62131 -65998 -74070 -80183 -79846 -79200 -75262 -68070 -59162 -64467 -68203 -63796 -63144 -62734 -55550
13860 -55550 -52312 -59219 -66592 -67520 -64910 -63794 -58291 -51944 -52636 -55859 -54205 -54106 -51890 -52149 -54651 -52951
13844 -52951 -55160 -54828 -52203 -48878 -47536 -52910 -56215 -54205 -57950 -58279 -54988 -59699 -55976 -54566 -55011
13829 -55011 -53752 -56525 -58919 -49691 -46432 -48122 -50375 -48347 -48561 -46359 -48193 -50807 -52252 -52622 -45142
13814 -45142 -42811 -43973 -44395 -48793 -48108 -43657 -39341 -41029 -36713 -33835 -33184 -32973 -37062 -38778 -38857 -43380
13798 -43380 -45501 -46700 -44005 -37546 -30453 -27127 -28253 -30825 -32703 -33293 -36066 -34089 -38789 -40046 -38176
$$ packed form
13906h7917p27P91L970m28L354n43j241L341L53q386N441M480l20l316J443j178
13890h0883m102O964L638r89J619O432n503m591l95N83Q454L825K260l958K777
13875f3869J738l867q072o113L37O46L938P192Q908n305l736M407O52M10P184
13860e5550L238o907p373r28K610J116N503O347o92l223J654R9K216k59k502J700
13844e2951k209L32K625L325J342n374l305K010l745l29L291m711L723J410m45
13829e5011J259k773k394R228L259j690k253K028k14K202j834k614j445l70P480
13814d5142K331j162m22m398O85M451M316j688M316K878O51K11m089j716p9m523
13798d3380k121j199K695O459P093L326j126k572j878n90k773J977m700j257J870
$$ plain form
13783 -38176 -42477 -39927 -34353 -32650 -32052 -35229 -32314 -35291 -26584 -34711 -37888 -33646 -31442 -28600 -22224
13768 -22224 -24008 -23895 -19741 -22908 -24270 -20965 -15814 -10526 -12359 -14250 -11706 -10877 -10853 -4483 -1399
13753 -1399 -8044 -4810 -4170 -6680 -2139 -1361 -909 -7005 -12082 -10463 -7688 -13315 -10218 -8973 -4925
13738 -4925 794 60 5269 6232 5379 3375 2418 2722 1112 6163 7921 2609 -548 3951 4740 407
13722 407 -2128 -1682 2182 4500 4603 5806 2631 622 5995 10841 15151 17702 17184 21978 22288 17119
13706 17119 13807 10265 9437 15672 17787 16404 11764 7018 19322 27219 25605 19721 18081 17553 11940
13691 11940 8417 11568 19968 24533 26037 25886 30641 28293 24980 22023 29910 30104 26273 23298 22919
13676 22919 25336 29574 29672 27510 34850 35625 41096 39672 42387 40568 36574 39080 41300 36150 30731
$$ packed form
13783c8176m301K550N574J703N98l177K915k977Q707q127l177M242K204K842O376
13768b2224j784J13M154l167j362L305N151N288j833j891K544Q29K4O370L084
13753a399o645L234O40k510M541P78M52o096n077J619K775n627L097J245M048
13738d925N719p34N209R63q53k004r57L04j610N051J758n312l157M499P89m333
13722D07k535M46L864K318J03J203l175k009N373M846M310K551n18M794L10n169
13706A7119l312l542q28O235K115j383m640m746J2304P897j614n884j640n28n613
13691A1940l523L151Q400M565J504j51M755k348l313k957P887J94l831k975l79
13676B2919K417M238R8k162P340P75N471j424K715j819l994K506K220n150n419
$$ plain form
13661 30731 29867 37109 40629 38076 40845 47306 50531 48142 44575 37258 38337 46063 49064 47476 47578
13646 47578 48291 54684 61839 63197 60011 60495 51454 46810 47370 49012 55461 56268 47267 46071 48037
13631 48037 57559 58739 56924 58244 56698 58480 57955 63515 63412 62836 67336 69940 72030 75788 74446
13616 74446 70899 70668 76192 73813 69246 66093 68472 72539 76351 65883 70897 78008 79027 79891 74360
13601 74360 69521 70513 75903 80500 77205 77999 79338 87973 94194 90568 88202 83503 80769 79356 78887
13586 78887 80800 80821 86942 92189 91357 88904 86791 80831 74406 76277 84646 90254 94961 97693 95215
13571 95215 86642 94134 96856 94422 102168 107989 104585 104003 104739 103330 104104 110481 106247 101941 101005
13556 101005 96658 103547 107006 106160 103627 106410 103786 101975 97095 105386 110374 116750 118173 120524
$$ packed form
13661C0731q64P242L520k553K769O461L225k389l567p317J079P726L001j588J02
13646D7578P13O393P155J358l186M84r041m644N60J642O449Q07r001j196J966
13631D8037R522J180j815J320j546J782n25N560j03n76M500K604K090L758j342
13616G4446l547k31N524k379m567l153K379M067L812j0468N014P111J019Q64n531
13601G4360m839R92N390M597l295P94J339Q635O221l626k366m699k734j413m69
13586G8887J913K1O121N247q32k453k113n960o425J871Q369N608M707K732k478
13571I5215q573P492K722k434P746N821l404n82P36j409P74O377m234m306r36
13556A01005m347O889L459q46k533K783k624j811m880Q291M988O376J423K351
$$ plain form
13542 120524 123380 118520 118292 117993 119145 116617 115079 116241 114325 111312 107944 113507 125098 130805
13528 130805 132578 131409 133542 130398 129612 132065 127935 124340 125676 130025 130931 131211 127474 131063 128961
13513 128961 122847 119330 121576 120207 120769 130308 136429 132500 133527 139256 147153 147954 141478 139927 139648
13498 139648 138554 141773 149696 145754 145756 148127 148924 152597 151522 147208 143276 148861 156613 151655 153575
13483 153575 154934 158645 159935 153784 153284 162128 169264 168351 163223 164895 166216 168020 166681 158305 157968
13468 157968 160584 169190 172914 170080 160893 161288 164365 168536 173185 173754 173329 176584 172349 172419 171756 175566
13452 175566 190439 190043 187520 186053 178059 184529 185285 186284 188121 188380 188830 187706 184730 183488 188787
13437 188787 192610 195299 194090 193832 190755 186005 192726 198569 202680 202061 195948 191695 190347 201085
$$ packed form
13542A20524K856m860k28k99J152k528j538J162j916l013l368N563J1591N707
13528A30805J773j169K133l144p86K453m130l595J336M349R06K80l737L589k102
13513A28961o114l517K246j369N62R539O121l929J027N729P897Q01o476j551k79
13498A39648j094L219P923l942KK371P97L673j075m314l932N585P752m958J920
13483A53575J359L711J290o151n00Q844P136r13n128J672J321J804j339q376l37
13468A57968K616Q606L724k834r187L95L077M171M649N69m25L255m235P0o63L810
13452A75566J4873l96k523j467p994O470P56R99J837K59M50j124k976j242N299
13437A88787L823K689j209k58l077m750O721N843M111o19o113m253j348J0738
$$ plain form
13423 201085 210544 214864 207220 206516 203214 201305 201425 202047 202433 206337 211093 210867 206557 209616 219156
13408 219156 222798 217679 213000 211146 211054 210874 216107 218579 221623 225398 230426 226388 216822 216194 225797
13393 225797 231389 234141 237586 242463 247363 243433 243897 245317 242601 245808 252189 249261 242692 238424
13379 238424 240615 243348 244609 248153 251788 252530 248846 242585 249590 260493 267541 268278 262977 258621
13365 258621 260039 259452 254329 257126 265214 266618 268407 270908 272733 269264 268535 266580 270096 271118 271134
13350 271134 279320 285067 285028 284012 282558 284808 287438 293835 300051 300032 298362 299062 299620 300893 299718 303562
13334 303562 300923 299546 303044 306983 304187 305105 306138 303687 299287 300179 303578 308615 307458 307776 310446
13319 310446 306587 304079 305449 309483 311128 310995 312872 313476 315417 318667 317557 310052 315754 312608 315938
$$ packed form
13423B01085R459M320p644p04l302j909J20O22L86L904M756k26m310L059R540
13408B19156L642n119m679j854r2j80N233K472L044L775N028m038r566o28R603
13393B25797N592K752L445M877M900l930M64J420k716L207O381k928o569m268
13379B38424K191K733J261L544L635P42l684o261P005J0903P048P37n301m356
13365B58621J418n87n123K797Q088J404J789K501J825l469p29j955L516J022J6
13350B71134Q186N747l9j016j454K250K630O397O216j9j670P00N58J273j175L844
13334C03562k639j377L498L939k796R18J033k451m400Q92L399N037j157L18K670
13319C10446l859k508J370M034J645j33J877O04J941L250j110p505N702l146L330
$$ plain form
13304 315938 320452 322967 329133 332248 330796 333024 334504 330445 327467 330884 329533 332045 334566 334760
13290 334760 335541 334460 343485 353232 356108 354638 350202 350618 344087 334730 333156 336797 334878 329899 323137
13275 323137 332496 344625 348346 355431 362630 372273 355988 324064 286295 265994 273462 284121 288222
13262 288222 299419 302650 299506 293528 293206 288921 286731 295798 303982 307742 309857 303583 293367 289879
13248 289879 286847 282697 290452 293022 298414 297804 299554 301866 295718 290525 291217 288503 289895 300468
13234 300468 299360 296708 303703 307077 304136 302818 298232 300054 294442 289093 285710 283254 288674 285932
13220 285932 289820 297407 292877 286732 287307 298131 299275 294572 292329 293021 294783 295246 295126 296570 295844
13205 295844 299931 302420 300937 298581 301661 301653 304094 317454 322465 322854 327671 330732 324828 319800 314220
$$ packed form
13304C15938M514K515O166L115j452K228J480m059k978L417j351K512K521J94
13290C34760P81j081R025R747K876j470m436M16o531r357j574L641j919m979o762
13275C23137R359J2129L721P085P199R643j6285l1924l7769k0301P468J0659M101
13262B88222J1197L231l144n978l22m285k190R067Q184L760K115o274j0216l488
13248B89879l032m150P755K570N392o10J750K312o148n193O92k714J392J0573
13234C00468j108k652O995L374k941j318m586J822n612n349l383k456N420k742
13220B85932L888P587m530o145N75J0824J144m703k243O92J762M63j20J444p26
13205B95844M087K489j483k356L080qK441J3360N011L89M817L061n904n028n580
$$ plain form
13190 314220 308010 308952 314132 321381 325133 324850 326300 332726 336985 338393 335824 336113 339771 345935 348715
13175 348715 344737 341502 345922 355902 359689 355971 356680 362679 367649 368999 371122 373966 380164 384758
13161 384758 390575 393083 392991 387370 388796 386864 387893 390195 395115 396454 403499 406045 412721 420166 416082
13146 416082 414626 413563 403555 393668 399653 402307 401099 400925 409191 412522 413981 412186 411081 405449
13132 405449 400762 408006 412415 410639 416876 420178 416903 426406 437573 436810 439021 450856 448118 445270
13118 445270 441462 436683 435530 442805 448399 459078 462920 462773 469024 476721 486126 491850 492993 498216
13104 498216 498393 496918 498248 503441 507861 505443 505346 510459 515748 517033 498072 463595 431273 406887
13090 406887 399501 404343 409319 418502 428573 434758 440444 444077 451396 455729 459429 468597 473908 469110
$$ packed form
13190C14220o210R42N180P249L752k83J450O426M259J408k569K89L658O164K780
13175C48715l978l235M420R980L787l718P09N999M970J350K123K844O198M594
13161C84758N817K508r2n621J426j932J029K302M920J339P045K546O676P445m084
13146D16082j456j063j0008r887N985K654j208j74Q266L331J459j795j105n632
13132D05449m687P244M409j776O237L302l275R503J1167p63K211J1835k738k848
13118D45270l808m779j153P275N594J0679L842j47O251P697R405N724J143N223
13104D98216J77j475J330N193M420k418r7N113N289J285j8961l4477l2322k4386
13090D06887p386M842M976R183J0071O185N686L633P319M333L700R168N311m798
$$ plain form
13076 469110 464390 465563 463441 458162 469061 472817 482576 492259 496067 490818 495235 503406 500561 500579
13062 500579 501208 504077 510526 505180 506751 509290 507975 513114 518114 519404 524696 525063 522342 524253 531770
13047 531770 528738 526071 529290 530167 531701 536937 540023 539622 546567 544679 536518 539471 544983 551158 546867
13032 546867 545703 550243 560478 572674 566296 559257 561800 560218 560180 558984 557170 561864 572901 584002
13018 584002 581209 577121 583136 586847 590856 593740 589530 588894 594175 600088 598555 594316 593237 591203
13004 591203 596385 599146 601550 602125 603962 611855 617160 617380 619669 627201 631916 627969 627736 634405 629269
12989 629269 630400 630599 628394 635400 641309 644636 644883 649217 654540 659835 665342 671287 670775 675398 681267
12974 681267 675650 667464 656743 658389 658647 652849 655890 669384 669829 666192 662784 664415 673527 680394
$$ packed form
13076D69110m720J173k122n279J0899L756R759R683L808n249M417Q171k845J8
13062E00579O29K869O449n346J571K539j315N139N000J290N292L67k721J911P517
13047E31770l032k667L219Q77J534N236L086m01O945j888q161K953N512O175m291
13032E46867j164M540J0235J2196o378p039K543j582l8j196j814M694J1037J1101
13018E84002k793m088O015L711M009K884m210o36N281N913j533m239j079k034
13004E91203N182K761K404N75J837P893N305K20K289P532M715l947k33O669n136
12989F29269J131J99k205P006N909L327K47M334N323N295N507N945n12M623N869
12974F81267n617q186j0721J646K58n798L041J3494M45l637l408J631R112O867
$$ plain form
12960 680394 685735 685962 686656 693753 689477 684187 691135 702178 704928 699978 701168 701692 704113 709241 708244
12945 708244 708000 715007 722833 726837 730461 729018 727442 737583 741535 740722 741030 735085 735285 742168 743553
12930 743553 744450 741102 751203 765278 767931 772113 770280 769345 768006 769130 774352 777159 783507 783933
12916 783933 781210 782891 786834 797569 796015 794144 796161 799340 801782 798910 804089 813982 822030 823162
12902 823162 822737 820004 822510 826138 831195 834496 844576 851281 854723 860441 860754 853519 841996 836184
12888 836184 835460 839640 847535 854882 862854 860612 863826 872299 878673 881993 888697 895218 895789 894328 893641
12873 893641 895988 900639 907583 921448 930579 931842 931299 933044 939788 946971 948196 957868 962086 969439
12859 969439 972293 975907 976612 976244 979187 988764 993526 1002889 1008258 1009188 1014266 1019044 1025645 1030867 1035408
$$ packed form
12960F80394N341K27O94P097m276n290O948J1043K750m950J190N24K421N128r97
12945G08244k44P007P826M004L624j443j576J0141L952q13L08n945K00O883J385
12930G43553Q97l348J0101J4075K653M182j833r35j339J124N222K807O348M26
12916G83933k723J681L943J0735j554j871K017L179K442k872N179R893Q048J132
12902H23162m25k733K506L628N057L301J0080O705L442N718L13p235j1523n812
12888H36184p24M180P895P347P972k242L214Q473O374L320O704O521N71j461o87
12873H93641K347M651O944J3865R131J263n43J745O744P183J225R672M218P353
12859I69439K854L614P05l68K943R577M762R363N369R30N078M778O601N222M541
$$ plain form
12844 1035408 1045115 1053455 1057278 1065548 1072577 1074650 1073574 1067506 1061660 1066815 1073651 1081808 1101806 1108803
12830 1108803 1116067 1124456 1123543 1133355 1142170 1154930 1166064 1174055 1196350 1210703 1222122 1229956 1237941
12817 1237941 1247188 1264786 1284015 1304290 1334449 1367134 1396989 1437641 1478688 1530547 1592539
12806 1592539 1655156 1739256 1831616 1912054 1928958 1748710 1305570 790794 491033 427523
12796 427523 468665 553520 634774 707951 776259 829794 874524 913537 942496 981257 1006400
12785 1006400 1022706 1055133 1079991 1101131 1122041 1149548 1170262 1191970 1216273 1235003 1256043
12774 1256043 1265820 1262584 1257463 1256189 1268861 1291896 1319609 1341268 1370373 1400278 1422344 1453191
12762 1453191 1486623 1525831 1570703 1609852 1658923 1721544 1787802 1870062 1966184 2065046 2153914
$$ packed form
12844A035408R707Q340L823Q270P029K073j076o068n846N155O836Q157J9998O997
12830A108803P264Q389r13R812Q815J2760J1134P991K2295J4353J1419P834P985
12817A237941R247J7598J9229K0275L0159L2685K9855M0652M1047N1859O1992
12806A592539O2617Q4100R2360Q0438J6904j80248m43140n14776k99761o3510
12796D27523M1142Q4855Q1254P3177O8308N3535M4730L9013K8959L8761K5143
12785A006400J6306L2427K4858K1140K0910K7507K0714K1708K4303J8730K1040
12774A256043R777l236n121j274J2672K3035K7713K1659K9105K9905K2066L0847
12762A453191L3432L9208M4872L9149M9071O2621O6258Q2260R6122R8862Q8868
$$ plain form
12751 2153914 2174393 2001510 1551467 1038776 740694 699903 776601 886366 997861 1093870
12741 1093870 1187020 1266575 1337669 1409010 1480361 1552266 1618256 1683661 1752523 1823761 1901260
12730 1901260 1995157 2115861 2263527 2435782 2635274 2862817 3120220 3401653 3664608 3807295
12720 3807295 3655475 3046297 1957179 630903 -551712 -1318961 -1603745 -1551284 -1337149
12711 -1337149 -1075038 -808203 -578717 -383354 -218169 -84186 28822 127234 212561 285389
12701 285389 340968 401998 451106 501172 547318 585726 631455 680710 724410 772326 820225
12690 820225 865022 907649 951761 995359 1027988 1043236 1063962 1103651 1155164 1202999 1251797
12679 1251797 1314947 1394033 1479840 1567222 1670541 1798556 1940982 2087758 2229691 2342965
$$ packed form
12751B153914K0479j72883m50043n12691k98082m0791P6698J09765J11495R6009
12741A093870R3150P9555P1094P1341P1351P1905O5990O5405O8862P1238P7499
12730A901260R3897J20704J47666J72255J99492K27543K57403K81433K62955J42687
12720C807295j51820o09178j089118j326276j182615p67249k84784N2461K14135
12711a337149K62111K66835K29486J95363J65185J33983J13008R8412Q5327P2828
12701B85389N5579O1030M9108N0066M6146L8408M5729M9255M3700M7916M7899
12690H20225M4797M2627M4112M3598L2629J5248K0726L9689N1513M7835M8798
12679A251797O3150P9086Q5807Q7382J03319J28015J42426J46776J41933J13274
$$ plain form
12669 2342965 2322725 1972440 1242767 395370 -198676 -407081 -368517 -248298 -114761 16149
12659 16149 139935 245667 334123 409591 480306 539644 591843 640710 683527 721531 746866
12648 746866 771936 811096 853046 883405 916708 946713 974999 1010985 1044577 1074683 1108860
12637 1108860 1133267 1162958 1182502 1201677 1223439 1248832 1282966 1325300 1362156 1412873 1483612
12626 1483612 1561166 1652981 1756572 1872514 2007606 2154764 2300991 2429550 2439184 2159994
12616 2159994 1488296 607290 -99960 -416202 -429152 -322958 -187064 -48377 75750 182527
12606 182527 279356 368454 439949 492625 540263 584788 626369 656554 695717 737086 769680
12595 769680 793658 797182 793728 797276 813383 831030 847366 870869 882150 878823 875776 872585 872236
$$ packed form
12669B342965k0240l50285p29673q47397n94046k08405L8564J20219J33537J30910
12659A6149J23786J05732Q8456P5468P0715N9338N2199M8867M2817L8004K5335
12648G46866K5070L9160M1950L0359L3303L0005K8286L5986L3592L0106L4177
12637A108860K4407K9691J9544J9175K1762K5393L4134M2334L6856N0717P0739
12626A483612P7554R1815J03591J15942J35092J47158J46227J28559R634k79190
12616B159994o71698q81006p07250l16242j2950J06194J35894J38687J24127J06777
12606A82527R6829Q9098P1495N2676M7638M4525M1581L0185L9163M1369L2594
12595G69680K3978L524l454L548J6107J7647J6336K3503J1281l327l047l191l49
$$ plain form
12582 872236 891660 922306 964690 1006444 1030140 1036473 1053193 1065701 1080884 1092620 1100741 1113796
12570 1113796 1136753 1150656 1160283 1168639 1178519 1195326 1202009 1210049 1219514 1222158 1221735 1218630 1217196
12557 1217196 1218715 1230920 1243353 1254439 1264238 1277140 1286782 1301242 1314572 1330109 1342190 1352519
12545 1352519 1369514 1381804 1388073 1388767 1376342 1357755 1350939 1357560 1371785 1387503 1402641 1414699
12533 1414699 1420892 1428217 1434942 1445668 1457039 1465334 1473747 1477889 1478079 1490133 1498338 1504289 1515163
12520 1515163 1530097 1531466 1542646 1554705 1564707 1571730 1580192 1581711 1586186 1596140 1598690 1611437 1624379
12507 1624379 1636818 1649481 1654971 1662321 1676741 1686598 1693739 1701611 1711291 1726089 1733230 1741594 1757497
12494 1757497 1773821 1790891 1809462 1829629 1843567 1850981 1830713 1792216 1759319 1755455 1776591 1795526
$$ packed form
12582H72236J9424L0646M2384M1754K3696O333J6720J2508J5183J1736Q121J3055
12570A113796K2957J3903R627Q356R880J6807O683Q040R465K644m23l105j434
12557A217196J519J2205J2433J1086R799J2902R642J4460J3330J5537J2081J0329
12545A352519J6995J2290O269O94j2425j8587o816O621J4225J5718J5138J2058
12533A414699O193P325O725J0726J1371Q295Q413M142J90J2054Q205N951J0874
12520A515163J4934J369J1180J2059J0002P023Q462J519M475R954K550J2747J2942
12507A624379J2439J2663N490P350J4420R857P141P872R680J4798P141Q364J5903
12494A757497J6324J7070J8571K0167J3938P414k0268l8497l2897l864K1136J8935
$$ plain form
12482 1795526 1814024 1833829 1855749 1869432 1879830 1887504 1895482 1905274 1907001 1909773 1920489 1934455
12470 1934455 1945478 1956931 1977992 1996081 2004332 2007273 2017945 2031631 2046069 2061000 2082672 2102857
12458 2102857 2119871 2133202 2143817 2160654 2176946 2197560 2220720 2233907 2248510 2256796 2274136
12447 2274136 2309736 2339218 2369385 2397925 2434073 2476002 2528497 2577786 2613786 2636753 2653451
12436 2653451 2689113 2733454 2692485 2493049 2178367 1876867 1705929 1686116 1753618 1838448
12426 1838448 1908257 1958548 1994898 2022146 2054852 2089021 2126624 2159406 2190965 2227635 2263586
12415 2263586 2290322 2311727 2329882 2345189 2364323 2383496 2404731 2418135 2432589 2458475 2476692
12404 2476692 2493719 2509291 2534206 2566068 2589902 2612575 2641206 2667733 2684124 2698860 2722077
$$ packed form
12482A795526J8498J9805K1920J3683J0398P674P978R792J727K772J0716J3966
12470A934455J1023J1453K1061J8089Q251K941J0672J3686J4438J4931K1672K0185
12458B102857J7014J3331J0615J6837J6292K0614K3160J3187J4603Q286J7340
12447B274136L5600K9482L0167K8540L6148M1929N2495M9289L6000K2967J6698
12436B653451L5662M4341m0969j99436l14682l01500j70938j9813O7502Q4830
12426A838448O9809N0291L6350K7248L2706L4169L7603L2782L1559L6670L5951
12415B263586K6736K1405J8155J5307J9134J9173K1235J3404J4454K5886J8217
12404B476692J7027J5572K4915L1862K3834K2673K8631K6527J6391J4736K3217
$$ plain form
12393 2722077 2761522 2804608 2843259 2896544 2954343 3012806 3091894 3182070 3262795 3276254 3152468
12382 3152468 2879514 2568084 2347859 2267841 2281491 2309548 2316675 2330448 2369195 2426198 2478090
12371 2478090 2525667 2562128 2596872 2632392 2670323 2702326 2727019 2759840 2789601 2813017 2833723
12360 2833723 2854713 2874811 2895949 2917662 2947907 2976522 3008533 3032814 3044602 3058595 3074728
12349 3074728 3094664 3120140 3143752 3165245 3177065 3192592 3202935 3216229 3230864 3251290 3274187
12338 3274187 3294274 3310407 3334671 3357729 3373509 3385339 3400058 3410339 3421986 3441893 3471814
12327 3471814 3505913 3533069 3549169 3561600 3573934 3594484 3626246 3640529 3657909 3662743 3666204 3680524
12315 3680524 3716053 3760701 3801423 3841776 3871598 3897586 3914847 3920067 3936970 3959220 3986370
$$ packed form
12393B722077L9445M3086L8651N3285N7799N8463P9088R0176Q0725J3459j23786
12382C152468k72954l11430k20225q0018J3650K8057P127J3773L8747N7003N1892
12371B478090M7577L6461L4744L5520L7931L2003K4693L2821K9761K3416K0706
12360B833723K0990K0098K1138K1713L0245K8615L2011K4281J1788J3993J6133
12349C074728J9936K5476K3612K1493J1820J5527J0343J3294J4635K0426K2897
12338C274187K0087J6133K4264K3058J5780J1830J4719J0281J1647J9907K9921
12327C471814L4099K7156J6100J2431J2334K0550L1762J4283J7380M834L461J4320
12315C680524L5529M4648M0722M0353K9822K5988J7261N220J6903K2250K7150
$$ plain form
12304 3986370 4024848 4061376 4094813 4124942 4161185 4188650 4211253 4226434 4250037 4282373 4316507
12293 4316507 4348236 4378875 4414020 4449634 4482891 4512230 4538398 4576687 4603754 4641785 4693435
12282 4693435 4748277 4801700 4850204 4880816 4902685 4926300 4959726 5004204 5050861 5085953 5125454
12271 5125454 5169165 5217316 5264366 5300014 5335499 5382060 5431945 5476003 5522802 5569585 5613217
12260 5613217 5658667 5716373 5789226 5851731 5903842 5956758 6017331 6079657 6134639 6165166 6173347
12249 6173347 6167893 6171188 6214042 6275747 6348450 6408182 6461273 6525704 6589668 6656950 6723485 6792589
12237 6792589 6861882 6929021 6995077 7058349 7128095 7210395 7292496 7377541 7455011 7526057 7592791
12226 7592791 7663615 7735300 7814468 7899641 7988180 8080606 8180468 8283941 8385271 8490804 8588387
$$ packed form
12304C986370L8478L6528L3437L0129L6243K7465K2603J5181K3603L2336L4134
12293D316507L1729L0639L5145L5614L3257K9339K6168L8289K7067L8031N1650
12282D693435N4842N3423M8504L0612K1869K3615L3426M4478M6657L5092L9501
12271E125454M3711M8151M7050L5648L5485M6561M9885M4058M6799M6783M3632
12260E613217M5450N7706P2853O2505N2111N2916O0573O2326N4982L0527Q181
12249F173347n454L295M2854O1705P2703N9732N3091O4431O3964O7282O6535O9104
12237F792589O9293O7139O6056O3272O9746Q2300Q2101Q5045P7470P1046O6734
12226G592791P0824P1685P9168Q5173Q8539R2426R9862J03473J01330J05533R7583
$$ plain form
12215 8588387 8680619 8772893 8873218 8970753 9070122 9173593 9286975 9420763 9550493 9679288
12205 9679288 9799893 9918823 10030021 10146867 10283384 10429996 10592040 10755738 10906895
12196 10906895 11059211 11230209 11401554 11568060 11740032 11923934 12118102 12305313 12493569
12187 12493569 12687207 12887714 13096353 13322115 13558871 13812015 14082880 14347028 14595597
12178 14595597 14843443 15100141 15388956 15710201 16051790 16414240 16793765 17196243 17607991
12169 17607991 18016039 18442051 18898548 19388510 19898410 20429947 20980550 21529734 22081441
12160 22081441 22670706 23315760 24021227 24776654 25576329 26434279 27360175 28336686 29341240
12151 29341240 30408978 31565017 32817961 34169835 35629671 37257683 39071823 41060946
$$ packed form
12215H588387R2232R2274J00325R7535R9369J03471J13382J33788J29730J28795
12205I679288J20605J18930J11198J16846J36517J46612J62044J63698J51157
12196A0906895J52316J70998J71345J66506J71972J83902J94168J87211J88256
12187A2493569J93638K00507K08639K25762K36756K53144K70865K64148K48569
12178A4595597K47846K56698K88815L21245L41589L62450L79525M02478M11748
12169A7607991M08048M26012M56497M89962N09900N31537N50603N49184N51707
12160B2081441N89265O45054P05467P55427P99675Q57950R25896R76511J004554
12151B9341240J067738J156039J252944J351874J459836J628012J814140J989123
$$ plain form
12143 41060946 43238557 45638755 48276231 51196934 54528592 58349918 62717585 67749708
12135 67749708 73632946 80608766 88919700 98791010 110521759 124527805 141000263 158441494
12127 158441494 170139850 159304176 102145372 299015 -100316474 -154701897 -164052931
12120 -164052931 -153083817 -137075354 -121760593 -108661274 -97786947 -88745801 -81155691
12113 -81155691 -74670411 -69035714 -64135414 -59875500 -56121595 -52746111 -49707470 -47020176
12105 -47020176 -44635288 -42492848 -40554781 -38794142 -37146880 -35600633 -34174242 -32877404
12097 -32877404 -31693906 -30588264 -29548821 -28605002 -27737202 -26916834 -26135021 -25385556 -24669374
12088 -24669374 -23988841 -23328290 -22690884 -22098301 -21553955 -21059417 -20603654 -20166579 -19741067
$$ packed form
12143D1060946K177611K400198K637476K920703L331658L821326M367667N032123
12135F7749708N883238O975820Q310934R871310J1730749J4006046J6472458J7441231
12127A58441494J1698356j0835674n7158804j01846357j00615489n4385423r351034
12120a64052931J0969114J6008463J5314761J3099319J0874327R041146P590110
12113h1155691O485280N634697M900300M259914L753905L375484L038641K687294
12105d7020176K384888K142440J938067J760639J647262J546247J426391J296838
12097c2877404J183498J105642J039443R43819Q67800Q20368P81813P49465P16182
12088b4669374O80533O60551O37406N92583N44346M94538M55763M37075M25512
$$ plain form
12079 -19741067 -19325419 -18921812 -18550922 -18203640 -17861917 -17531195 -17203837 -16866890 -16547280
12070 -16547280 -16245646 -15954154 -15678530 -15413799 -15160090 -14910640 -14665848 -14425705 -14185048
12061 -14185048 -13951157 -13723032 -13499328 -13295653 -13100055 -12914803 -12728779 -12543150 -12375020
12052 -12375020 -12217811 -12071006 -11930948 -11790743 -11646806 -11503380 -11355112 -11198316 -11047178
12043 -11047178 -10911397 -10794524 -10682916 -10565569 -10451546 -10342557 -10219093 -10090817 -9971467
12034 -9971467 -9857590 -9742498 -9633949 -9534455 -9444817 -9361842 -9276460 -9184912 -9100557 -9018284 -8925299
12023 -8925299 -8827837 -8739171 -8650279 -8559168 -8467681 -8383702 -8308094 -8234974 -8168882 -8101868 -8029062
12012 -8029062 -7955395 -7887134 -7819188 -7745205 -7678754 -7612352 -7540029 -7475524 -7417319 -7352827 -7283353
$$ packed form
12079a9741067M15648M03607L70890L47282L41723L30722L27358L36947L19610
12070a6547280L01634K91492K75624K64731K53709K49450K44792K40143K40657
12061a4185048K33891K28125K23704K03675J95598J85252J86024J85629J68130
12052a2375020J57209J46805J40058J40205J43937J43426J48268J56796J51138
12043a1047178J35781J16873J11608J17347J14023J08989J23464J28276J19350
12034i971467J13877J15092J08549R9494Q9638Q2975Q5382R1548Q4355Q2273R2985
12023h925299R7462Q8666Q8892R1111R1487Q3979P5608P3120O6092O7014P2806
12012h029062P3667O8261O7946P3983O6451O6402P2323O4505N8205O4492O9474
$$ plain form
12001 -7283353 -7222503 -7174044 -7145128 -7117310 -7094282 -7070863 -7039681 -7005230 -6958080 -6900264 -6849382
11990 -6849382 -6814434 -6777197 -6736704 -6689796 -6645367 -6599710 -6552208 -6509957 -6468114 -6422886 -6376066
11979 -6376066 -6326785 -6280344 -6237937 -6200964 -6170239 -6135302 -6100225 -6053109 -6004405 -5955271 -5903035
11968 -5903035 -5865511 -5841162 -5828063 -5814897 -5795421 -5764012 -5734367 -5693764 -5652827 -5614152 -5584213
11957 -5584213 -5555976 -5522102 -5491285 -5464617 -5445234 -5414561 -5378581 -5334338 -5302660 -5269386 -5239095
11946 -5239095 -5218266 -5204114 -5186092 -5168220 -5142406 -5109558 -5073385 -5024913 -4986576 -4961413 -4950724
11935 -4950724 -4945249 -4946194 -4935462 -4918548 -4893288 -4857165 -4820394 -4786150 -4766471 -4747021 -4724451 -4692251
11923 -4692251 -4658431 -4627564 -4607583 -4597178 -4586540 -4561401 -4535147 -4509093 -4484868 -4460797 -4443122
$$ packed form
12001g283353O0850M8459K8916K7818K3028K3419L1182L4451M7150N7816N0882
11990f849382L4948L7237M0493M6908M4429M5657M7502M2251M1843M5228M6820
11979f376066M9281M6441M2407L6973L0725L4937L5077M7116M8704M9134N2236
11968e903035L7524K4349J3099J3166J9476L1409K9645M0603M0937L8675K9939
11957e584213K8237L3874L0817K6668J9383L0673L5980M4243L1678L3274L0291
11946e239095K0829J4152J8022J7872K5814L2848L6173M8472L8337K5163J0689
11935d950724N475r45J0732J6914K5260L6123L6771L4244J9679J9450K2570L2200
11923d692251L3820L0867J9981J0405J0638K5139K6254K6054K4225K4071J7675
$$ plain form
11912 -4443122 -4420043 -4404357 -4395920 -4373453 -4343689 -4317552 -4299788 -4279091 -4263238 -4248034 -4229629
11901 -4229629 -4207893 -4190558 -4176455 -4172455 -4159906 -4143529 -4128759 -4112466 -4092274 -4072770 -4056691
11890 -4056691 -4045673 -4035470 -4024340 -4009925 -3991511 -3971181 -3957782 -3949282 -3937096 -3923069 -3907852
11879 -3907852 -3886782 -3865641 -3845124 -3824092 -3806134 -3809535 -3809615 -3802639 -3788354 -3768017 -3750670 -3741109
11867 -3741109 -3734071 -3731229 -3728682 -3720405 -3696828 -3685253 -3684490 -3675916 -3653702 -3644804 -3631070 -3620081 -3603880
11854 -3603880 -3596870 -3594079 -3576228 -3556911 -3535976 -3514932 -3503344 -3492605 -3484273 -3476495 -3469183 -3466634
11842 -3466634 -3452925 -3433485 -3419103 -3409912 -3402265 -3393704 -3382098 -3367110 -3358718 -3351223 -3340743 -3330522
11830 -3330522 -3316154 -3305321 -3299100 -3296548 -3305149 -3310685 -3295193 -3280676 -3266869 -3260154 -3251516 -3238677
$$ packed form
11912d443122K3079J5686Q437K2467K9764K6137J7764K0697J5853J5204J8405
11901d229629K1736J7335J4103M000J2549J6377J4770J6293K0192J9504J6079
11890d056691J1018J0203J1130J4415J8414K0330J3399Q500J2186J4027J5217
11879c907852K1070K1141K0517K1032J7958l401q0O976J4285K0337J7347R561
11867c741109P038K842K547Q277K3577J1575P63Q574K2214Q898J3734J0989J6201
11854c603880P010K791J7851J9317K0935K1044J1588J0739Q332P778P312K549
11842c466634J3709J9440J4382R191P647Q561J1606J4988Q392P495J0480J0221
11830c330522J4368J0833O221K552q601n536J5492J4517J3807O715Q638J2839
$$ plain form
11818 -3238677 -3226275 -3198822 -3177128 -3159013 -3152464 -3153766 -3157925 -3155257 -3142696 -3123034 -3117798 -3115434
11806 -3115434 -3099350 -3087258 -3075586 -3063338 -3055617 -3041361 -3032966 -3028549 -3028912 -3020706 -3003713 -2991568
11794 -2991568 -2980807 -2971055 -2971291 -2974930 -2964668 -2953803 -2948901 -2937219 -2926748 -2925750 -2925970 -2921892 -2909272
11781 -2909272 -2898943 -2888377 -2881963 -2876214 -2876826 -2864070 -2853411 -2850749 -2844660 -2836437 -2826363 -2824013 -2822973
11768 -2822973 -2818061 -2809218 -2800969 -2799360 -2790296 -2776009 -2764421 -2752880 -2742243 -2728039 -2722428 -2723566 -2726449
11755 -2726449 -2720829 -2716972 -2709960 -2699424 -2693154 -2692461 -2690627 -2681973 -2669116 -2665578 -2664055 -2652840 -2641721
11742 -2641721 -2635208 -2636116 -2638030 -2636000 -2628699 -2625103 -2615755 -2601710 -2593111 -2593700 -2592727 -2583501 -2574381 -2566497
11728 -2566497 -2556096 -2549974 -2551475 -2543645 -2535005 -2531280 -2524703 -2513529 -2505475 -2501095 -2497608 -2495032 -2489613
$$ packed form
11818c238677J2402K7453K1694J8115O549j302m159K668J2561J9662N236K364
11806c115434J6084J2092J1672J2248P721J4256Q395M417l63Q206J6993J2145
11794b991568J0761R752k36l639J0262J0865M902J1682J0471R98k20M078J2620
11781b909272J0329J0566O414N749o12J2756J0659K662O089Q223J0074K350J040
11768b822973M912Q843Q249J609R064J4287J1588J1541J0637J4204N611j138k883
11755b726449N620L857P012J0536O270O93J834Q654J2857L538J523J1215J1119
11742b641721O513r08j914K030P301L596R348J4045Q599n89R73R226R120P884
11728b566497J0401O122j501P830Q640L725O577J1174Q054M380L487K576N419
$$ plain form
11715 -2489613 -2486245 -2480228 -2475533 -2468167 -2459903 -2454573 -2445246 -2442395 -2439595 -2429488 -2427320 -2427978 -2418919 -2412648
11701 -2412648 -2408339 -2401931 -2397517 -2391726 -2393647 -2390885 -2384382 -2378899 -2376018 -2369768 -2360573 -2353542 -2348710 -2348053
11687 -2348053 -2344650 -2337235 -2322326 -2315630 -2318992 -2310760 -2300547 -2302673 -2309063 -2307524 -2306042 -2299321 -2299047 -2300127
11673 -2300127 -2291028 -2285245 -2278081 -2273664 -2278302 -2294650 -2310083 -2317817 -2317388 -2306760 -2294955 -2274918 -2262942
11660 -2262942 -2254214 -2245141 -2240334 -2233527 -2231165 -2224667 -2214329 -2204769 -2200040 -2203351 -2199757 -2198353 -2202907 -2203219
11646 -2203219 -2198546 -2184170 -2177608 -2170576 -2165203 -2163727 -2159801 -2157171 -2153335 -2150398 -2142556 -2139212 -2135475 -2133614
11632 -2133614 -2137600 -2136954 -2129250 -2121366 -2122750 -2115601 -2105090 -2104174 -2099676 -2095077 -2087765 -2085464 -2079711 -2081812
11618 -2081812 -2085159 -2088398 -2087994 -2084137 -2078528 -2068243 -2064221 -2058926 -2055497 -2059806 -2058517 -2053280 -2043463 -2031795
$$ packed form
11715b489613L368O017M695P366Q264N330R327K851K800J0107K168o58R059O271
11701b412648M309O408M414N791j921K762O503N483K881O250R195P031M832O57
11687b348053L403P415J4909O696l362Q232J0213k126o390J539J482O721K74j080
11673b300127R099N783P164M417m638j6348j5433p734M29J0628J1805K0037J1976
11660b262942Q728R073M807O807K362O498J0338R560M729l311L594J404m554l12
11646b203219M673J4376O562P032N373J476L926K630L836K937P842L344L737J861
11632b133614l986O46P704P884j384P149J0511R16M498M599P312K301N753k101
11618b081812l347l239M04L857N609J0285M022N295L429m309J289N237R817J1668
$$ plain form
11604 -2031795 -2024025 -2023962 -2025467 -2024535 -2024998 -2027021 -2014521 -2011171 -2008238 -2005255 -1998186 -1987074 -1984214 -1991572
11590 -1991572 -1992267 -1989852 -1985870 -1983718 -1976949 -1969679 -1968178 -1973173 -1974796 -1967517 -1955737 -1955093 -1949149 -1944256
11576 -1944256 -1933584 -1932069 -1931154 -1935030 -1931564 -1929874 -1923866 -1922443 -1921039 -1915392 -1911861 -1906123 -1902734 -1901067
11562 -1901067 -1899553 -1903834 -1910269 -1902522 -1897827 -1898360 -1889453 -1881325 -1876359 -1873849 -1873380 -1871830 -1864069 -1854623
11548 -1854623 -1855160 -1856175 -1849072 -1847660 -1845127 -1839724 -1837012 -1836702 -1839094 -1836959 -1835389 -1832816 -1825612 -1817621
11534 -1817621 -1819318 -1822432 -1818790 -1812623 -1805370 -1805961 -1814026 -1823077 -1822996 -1816252 -1805419 -1801113 -1796411 -1794397
11520 -1794397 -1796996 -1794416 -1791019 -1788558 -1787911 -1779755 -1763742 -1760255 -1755199 -1757790 -1760729 -1756344 -1757997 -1761677
11506 -1761677 -1762755 -1760931 -1759508 -1752262 -1743072 -1744873 -1746681 -1742682 -1731638 -1730131 -1728889 -1727171 -1725384 -1721843
$$ packed form
11604b031795P770O3j505R32m63k023J2500L350K933K983P069J1112K860p358
11590a991572o95K415L982K152O769P270J501m995j623P279J1780O44N944M893
11576a944256J0672J515R15l876L466J690O008J423J404N647L531N738L389J667
11562a901067J514m281o435P747M695n33Q907Q128M966K510M69J550P761R446
11548a854623n37j015P103J412K533N403K712L10k392K135J570K573P204P991
11534a817621j697l114L642O167P253n91q065r051Q1O744J0833M306M702K014
11520a794397k599K580L397K461O47Q156J6013L487N056k591k939M385j653l680
11506a761677j078J824J423P246R190j801j808L999J1044J507J242J718J787L541
$$ plain form
11492 -1721843 -1724113 -1727913 -1728265 -1717236 -1705502 -1695150 -1691723 -1694567 -1700223 -1702205 -1696269 -1696673 -1691380 -1696765
11478 -1696765 -1689251 -1684732 -1684792 -1684093 -1681908 -1678572 -1679788 -1685185 -1681674 -1678439 -1676331 -1677520 -1669145 -1662129 -1659123
11463 -1659123 -1659249 -1656181 -1651954 -1649652 -1652486 -1654263 -1651156 -1654556 -1649655 -1638101 -1638192 -1641856 -1635861 -1634194
11449 -1634194 -1629918 -1627299 -1618979 -1612413 -1614871 -1615175 -1619858 -1617388 -1613930 -1610846 -1608550 -1600873 -1604633 -1609118
11435 -1609118 -1611264 -1615549 -1613479 -1607832 -1603250 -1602164 -1600770 -1594242 -1590034 -1592171 -1594581 -1594393 -1595022 -1591493
11421 -1591493 -1583974 -1581637 -1576480 -1571168 -1578200 -1578538 -1579761 -1579054 -1570563 -1563224 -1565236 -1563384 -1559951 -1561112
11407 -1561112 -1555225 -1549833 -1551723 -1547674 -1536657 -1539086 -1543503 -1539109 -1541351 -1541252 -1530751 -1526354 -1528632 -1530034
11393 -1530034 -1526608 -1529498 -1528761 -1528640 -1530353 -1526249 -1522178 -1516174 -1519505 -1519059 -1516825 -1508011 -1503713 -1503577 -1501414
$$ packed form
11492a721843k270l800l52J1029J1734J0352L427k844n656j982N936m04N293n385
11478a696765P514M519o0O99K185L336j216n397L511L235K108j189Q375P016L006
11463a659123j26L068M227K302k834j777L107l400M901J1554r1l664N995J667
11449a634194M276K619Q320O566k458l04m683K470L458L084K296P677l760m485
11435a609118k146m285K070N647M582J086J394O528M208k137k410J88o29L529
11421a591493P519K337N157N312p032l38j223P07Q491P339k012J852L433j161
11407a561112N887N392j890M049J1017k429m417M394k242R9J0501M397k278j402
11393a530034L426k890P37J21j713M104M071O004l331M46K234Q814M298J36K163
$$ plain form
11378 -1501414 -1490728 -1487450 -1489545 -1493519 -1493932 -1502357 -1499231 -1486413 -1477417 -1478614 -1481752 -1480583 -1483395 -1483230
11364 -1483230 -1485865 -1485793 -1475738 -1474304 -1472198 -1468627 -1462301 -1458954 -1463311 -1467818 -1465517 -1460371 -1461206 -1462980
11350 -1462980 -1468462 -1472966 -1466009 -1460270 -1452470 -1446308 -1440151 -1441182 -1442701 -1447562 -1448553 -1447478 -1446744 -1440844
11336 -1440844 -1434422 -1432037 -1431142 -1428516 -1426070 -1425578 -1420160 -1413765 -1413236 -1410392 -1409018 -1406210 -1411562 -1420156 -1421356
11321 -1421356 -1424349 -1420478 -1412787 -1409741 -1402541 -1399481 -1399703 -1403482 -1405083 -1396934 -1394380 -1395443 -1391141 -1389701
11307 -1389701 -1385402 -1388082 -1388577 -1385715 -1381712 -1384577 -1379416 -1371984 -1370513 -1374067 -1374609 -1376103 -1376213 -1371689 -1370769
11292 -1370769 -1369022 -1372710 -1367778 -1363017 -1357870 -1353158 -1352910 -1347784 -1346573 -1347778 -1344846 -1345341 -1345285 -1344420 -1343675
11277 -1343675 -1344965 -1342838 -1342884 -1342854 -1340803 -1341781 -1342055 -1346789 -1344377 -1342921 -1336260 -1333230 -1343484 -1349538 -1345914
$$ packed form
11378a501414J0686L278k095l974m13q425L126J2818Q996j197l138J169k812J65
11364a483230k635P2J0055J434K106L571O326L347m357m507K301N146q35j774
11350a462980n482m504O957N739P800O162O157j031j519m861r91J075P34N900
11336a440844O422K385Q95K626K446M92N418O395N29K844J374K808n352q594j200
11321a421356k993L871P691L046P200L060k22l779j601Q149K554j063M302J440
11307a389701M299k680m95K862M003k865N161P432J471l554n42j494j10M524R20
11292a370769J747l688M932M761N147M712K48N126J211j205K932m95N6Q65P45
11277a343675j290K127m6L0K051r78k74m734K412J456O661L030j0254o054L624
$$ plain form
11262 -1345914 -1336357 -1333681 -1334735 -1328710 -1326419 -1327031 -1333205 -1334076 -1335234 -1337976 -1331504 -1322455 -1316599 -1308698
11248 -1308698 -1303194 -1299672 -1300707 -1298817 -1304890 -1304100 -1302772 -1302606 -1303361 -1301473 -1295364 -1287154 -1278812 -1281994 -1290838
11233 -1290838 -1289422 -1285247 -1283068 -1280180 -1268878 -1266028 -1265601 -1262619 -1272836 -1285003 -1289624 -1287912 -1290206
11220 -1290206 -1286134 -1282826 -1282231 -1284410 -1280954 -1272729 -1267589 -1271426 -1266813 -1258486 -1253731 -1246934 -1246852 -1241894 -1234965
11205 -1234965 -1229005 -1223238 -1219799 -1217082 -1216775 -1212219 -1202820 -1196270 -1205626 -1231306 -1267803 -1299909 -1321960
11192 -1321960 -1320093 -1317835 -1309901 -1297597 -1290286 -1281183 -1277638 -1274838 -1272117 -1274541 -1274319 -1265608 -1259084 -1259313
11178 -1259313 -1261962 -1269535 -1267487 -1267453 -1269338 -1272205 -1266697 -1263700 -1266178 -1260951 -1257949 -1255955 -1248603 -1247448
11164 -1247448 -1251587 -1248532 -1244687 -1247020 -1243079 -1238875 -1235653 -1234723 -1230979 -1230117 -1223937 -1216237 -1210364 -1208474
$$ packed form
11262a345914R557K676j054O025K291o12o174q71j158k742O472R049N856P901
11248a308698N504L522j035J890o073P90J328J66p55J888O109Q210Q342l182q844
11233a290838J416M175K179K888J1302K850M27K982j0217j2167m621J712k294
11220a290206M072L308N95k179L456Q225N140l837M613Q327M755O797Q2M958O929
11205a234965N960N767L439K717L07M556R399O550r356k5680l6497l2106k2051
11192a321960J867K258P934J2304P311R103L545K800K721k424K22Q711O524k29
11178a259313k649p573K048L4j885k867N508K997k478N227L002J994P352J155
11164a247448m139L055L845k333L941M204L222R30L744Q62O180P700N873J890
$$ plain form
11150 -1208474 -1209004 -1216378 -1213089 -1215116 -1211536 -1213718 -1221870 -1219804 -1214031 -1204860 -1195936 -1195135 -1190392 -1191069 -1190450
11135 -1190450 -1194015 -1194234 -1190752 -1192744 -1200659 -1196465 -1197058 -1197663 -1197619 -1194583 -1193136 -1195208 -1198267 -1194984 -1192872
11120 -1192872 -1187280 -1187944 -1187130 -1180535 -1175421 -1170837 -1167282 -1174025 -1176367 -1175832 -1175854 -1170383 -1161705 -1164995 -1175265
11105 -1175265 -1179010 -1173293 -1172549 -1173600 -1169062 -1165984 -1170092 -1174497 -1164011 -1158578 -1162177 -1161431 -1166257 -1165088
11091 -1165088 -1157145 -1151728 -1152585 -1144376 -1137220 -1137632 -1138765 -1134123 -1138811 -1144364 -1144381 -1141578 -1139165 -1134212 -1136511
11076 -1136511 -1130915 -1127469 -1134253 -1142160 -1143722 -1140012 -1141638 -1141642 -1144091 -1137940 -1134903 -1128189 -1129225 -1124859 -1119579
11061 -1119579 -1123424 -1126705 -1128774 -1130237 -1130343 -1122042 -1119344 -1114983 -1115733 -1116021 -1113113 -1107786 -1106022 -1106093 -1100552
11046 -1100552 -1096270 -1091211 -1088464 -1092824 -1097433 -1095085 -1094642 -1094151 -1090206 -1086456 -1080543 -1082958 -1083065 -1079667 -1075734
$$ packed form
11150a208474n30p374L289k027L580k182q152K066N773R171Q924Q01M743o77O19
11135a190450l565k19L482j992p915M194n93o05M4L036J447k072l059L283K112
11120a192872N592o64Q14O595N114M584L555o743k342N35k2N471Q678l290j0270
11105a175265l745N717P44j051M538L078m108m405J0486N433l599P46m826J169
11091a165088P943N417q57Q209P156m12j133M642m688n553j7K803K413M953k299
11076a136511N596L446o784p907j562L710j626mk449O151L037O714j036M366N280
11061a119579l845l281k069j463j06Q301K698M361p50k88K908N327J764p1N541
11046a100552M282N059K747m360m609K348M43M91L945L750N913k415j07L398L933
$$ plain form
11031 -1075734 -1074863 -1069357 -1059494 -1054016 -1043013 -1033584 -1038948 -1064941 -1090079 -1122339 -1144254 -1150045 -1143571
11018 -1143571 -1132037 -1119533 -1117379 -1115983 -1118123 -1112246 -1102232 -1095836 -1094642 -1094043 -1088758 -1080414 -1072950
11005 -1072950 -1077437 -1087170 -1099887 -1109954 -1111278 -1105898 -1103461 -1091622 -1083997 -1089650 -1092080 -1091306 -1090737 -1090387
10991 -1090387 -1089607 -1080516 -1075479 -1077757 -1080338 -1089311 -1085733 -1078211 -1069762 -1066180 -1059973 -1058889 -1059781 -1059508 -1052286
10976 -1052286 -1052498 -1053598 -1062987 -1064005 -1060290 -1057692 -1051429 -1049003 -1046554 -1048797 -1045152 -1035591 -1027664 -1018426
10962 -1018426 -1015061 -1012956 -1007941 -1007802 -1014580 -1039917 -1071818 -1088256 -1088863 -1086428 -1083196 -1076278 -1078400 -1081028
10948 -1081028 -1071222 -1060743 -1051065 -1052050 -1047377 -1047286 -1045079 -1034124 -1027830 -1028911 -1035436 -1031574 -1035137 -1038750
10934 -1038750 -1042621 -1034083 -1025487 -1030421 -1034403 -1033596 -1029520 -1019442 -1020907 -1020493 -1017540 -1016224 -1008655 -1009455
$$ packed form
11031a075734Q71N506R863N478J1003R429n364k5993k5138l2260k1915n791O474
11018a143571J1534J2504K154J396k140N877J0014O396J194N99N285Q344P464
11005a072950m487r733j2717j0067j324N380K437J1839P625n653k430P74N69L50
10991a090387P80R091N037k278k581q973L578P522Q449L582O207J084q92K73P222
10976a052286k12j100r389j018L715K598O263K426K449k243L645R561P927R238
10962a018426L365K105N015J39o778k5337l1901j6438o07K435L232O918k122k628
10948a081028R806J0479R678r85M673R1K207J0955O294j081o525L862l563l613
10934a038750l871Q538Q596m934l982Q07M076J0078j465M14K953J316P569q00
$$ plain form
10920 -1009455 -1005631 -1004262 -997552 -995406 -993551 -981714 -973932 -972696 -986012 -1005530 -1030363 -1056409 -1065513
10907 -1065513 -1065268 -1061981 -1053082 -1042187 -1037060 -1038047 -1040063 -1035629 -1036006 -1029635 -1018870 -1018003 -1016877 -1014461
10893 -1014461 -1021428 -1027199 -1026355 -1017577 -1014263 -1009323 -1005002 -1009520 -1008217 -1007813 -1007512 -1005943 -1002240 -994961 -992372
10878 -992372 -992275 -991062 -988258 -983071 -976102 -979437 -980452 -978001 -975257 -977932 -977477 -975402 -975945 -982427 -991980
10863 -991980 -995005 -1000751 -1005346 -1006437 -1002887 -1005768 -1000500 -999478 -997880 -1003255 -1004400 -994516 -987201 -985901
10849 -985901 -990252 -989851 -990693 -990269 -985995 -975381 -974072 -978417 -979319 -969693 -968451 -968733 -969601 -970021 -970550 -968292
10833 -968292 -968133 -962082 -966861 -961194 -955224 -951647 -949605 -945946 -953356 -953387 -954229 -955623 -954412 -948865 -939266
10818 -939266 -935817 -943333 -960894 -969823 -973422 -976466 -975760 -973999 -970552 -963677 -966612 -965182 -961020 -954943
$$ packed form
10920a009455L824J369O710K146J855J1837P782J236j3316j9518k4833k6046r104
10907a065513K45L287Q899J0895N127r87k016M434l77O371J0765Q67J126K416
10893a014461o967n771Q44Q778L314M940M321m518J303M04L01J569L703P279K589
10878i92372R7J213K804N187O969l335j015K451K744k675M55K075n43o482r553
10863i91980l025n746m595j091L550k881N268J022J598n375j145R884P315J300
10849i85901m351M01q42M24M274J0614J309m345r02R626J242k82q68m20n29K258
10833i68292J59O051m779N667N970L577K042L659p410l1q42j394J211N547R599
10818i39266L449p516j7561q929l599l044P06J761L447O875k935J430M162O077
$$ plain form
10804 -954943 -941577 -936750 -939628 -945813 -946267 -941060 -933571 -934079 -936718 -935964 -939033 -941339 -940760 -941998 -939893
10789 -939893 -938510 -933051 -928890 -926382 -924588 -921978 -924335 -925183 -923790 -921394 -919447 -912570 -906869 -906781 -906549
10774 -906549 -913044 -915370 -910153 -906185 -907851 -918224 -931906 -937621 -938613 -939926 -933981 -934160 -933071 -926967
10760 -926967 -922582 -921414 -914633 -907487 -910328 -911500 -914345 -910902 -911643 -916169 -910463 -910910 -915033 -918083 -915566
10745 -915566 -913058 -914840 -911927 -908681 -902755 -894122 -893564 -891582 -896172 -899562 -899842 -895015 -897132 -897210 -898949
10730 -898949 -898378 -894369 -894339 -894651 -896785 -890897 -890565 -889042 -898229 -906916 -908699 -904471 -893662 -887850 -887964
10715 -887964 -886839 -886000 -883389 -885199 -883082 -878369 -876868 -877986 -879783 -871737 -866499 -866185 -865271 -863592 -864497
10700 -864497 -856219 -850142 -847287 -835391 -829614 -839473 -868558 -899625 -914028 -915475 -908256 -902152 -899246
$$ packed form
10804i54943J3366M827k878o185m54N207P489n08k639P54l069k306N79j238K105
10789i39893J383N459M161K508J794K610k357q48J393K396J947O877N701Q8K32
10774i06549o495k326N217L968j666j0373j3682n715r92j313N945j79J089O104
10760i26967M385J168O781P146k841j172k845L443p41m526N706m47m123l050K517
10745i15566K508j782K913L246N926Q633N58J982m590l390k80M827k117p8j739
10730h98949N71M009L0l12k134N888L32J523r187q687j783M228J0809N812j14
10715h87964J125Q39K611j810K117M713J501j118j797Q046N238L14R14J679r05
10700h64497Q278O077K855J1896N777r859k9085l1067j4403j447P219O104K906
$$ plain form
10687 -899246 -892247 -890616 -886989 -883454 -880056 -870335 -872481 -874896 -874061 -881208 -882296 -876548 -876752 -873835 -870577
10672 -870577 -870840 -875688 -873346 -871018 -872433 -871084 -865142 -857871 -848640 -852400 -854690 -860733 -865099 -867536
10658 -867536 -874511 -876170 -869760 -863429 -862079 -858307 -859467 -853048 -844989 -840770 -842736 -848162 -852893 -861332
10644 -861332 -863116 -854244 -850564 -851333 -851620 -854729 -856193 -852254 -849999 -847903 -846516 -840916 -836378 -840688 -833365
10629 -833365 -830378 -836980 -841215 -843330 -840253 -834820 -829525 -826694 -823760 -819332 -821587 -823563 -828266 -831331
10615 -831331 -832307 -826965 -819668 -821999 -826643 -820208 -817370 -816136 -816436 -811990 -810523 -814402 -812017 -816846 -810292
10600 -810292 -807335 -812198 -820042 -824813 -819408 -812414 -816738 -823456 -818137 -811910 -814548 -818892 -820748 -819975
10586 -819975 -813015 -804809 -806687 -808184 -809976 -807136 -802888 -799875 -800001 -805995 -811478 -809396 -806498 -809788
$$ packed form
10687h99246O999J631L627L535L398R721k146k415Q35p147j088N748k04K917L258
10672h70577k63m848K342K328j415J349N942P271R231l760k290o043m366k437
10658h67536o975j659O410O331J350L772j160O419Q059M219j966n426m731q439
10644h61332j784Q872L680p69k87l109j464L939K255K096J387N600M538m310P323
10629h33365K987o602m235k115L077N433N295K831K934M428k255j976m703l065
10615h31331r76N342P297k331m644O435K838J234l00M446J467l879K385m829O554
10600h10292K957m863p844m771N405O994m324o718N319O227k638m344j856P73
10586h19975O960Q206j878j497j792K840M248L013j26n994n483K082K898l290
$$ plain form
10572 -809788 -808035 -801518 -799283 -797976 -792560 -796668 -795497 -789817 -790184 -780577 -776538 -783946 -796928 -802654
10558 -802654 -793613 -783668 -776551 -776325 -777383 -778637 -781357 -787189 -788796 -784805 -786976 -780264 -772846 -775146
10544 -775146 -773371 -776026 -778433 -777949 -770586 -764933 -764178 -757421 -749174 -749473 -754544 -753258 -751507 -745155 -735796
10529 -735796 -733941 -732304 -726069 -720939 -716118 -715056 -714046 -708740 -700219 -686667 -674470 -667551 -651734
10516 -651734 -635059 -612572 -579902 -561043 -602982 -732749 -887908 -979409 -991137 -967715 -934657
10505 -934657 -909703 -889570 -867747 -853690 -841101 -831934 -831543 -834556 -828705 -822101 -821365 -815143 -806743
10492 -806743 -808859 -810015 -807543 -798036 -789512 -780311 -773149 -773373 -773353 -778861 -779067 -781945 -788000 -790144 -783808
10477 -783808 -780002 -771833 -765246 -766594 -765989 -762577 -757051 -760860 -764214 -761634 -760121 -752943 -745534 -737538
$$ packed form
10572h09788J753O517K235J307N416m108J171N680l67R607M039p408j2982n726
10558h02654R041R945P117K26j058j254k720n832j607L991k171O712P418k300
10544g75146J775k655k407M84P363N653P55O757Q247k99n071J286J751O352R359
10529g35796J855J637O235N130M821J062J010N306Q521J3552J2197O919J5817
10516f51734J6675K2487L2670J8859m1939j29767j55159r1501j1728K3422L3058
10505i34657K4954K0133K1823J4057J2589R167L91l013N851O604P36O222Q400
10492h06743k116j156K472R507Q524R201P162k24K0n508k06k878o055k144O336
10477g83808L806Q169O587j348O05L412N526l809l354K580J513P178P409P996
$$ plain form
10463 -737538 -749728 -768335 -785016 -788835 -789845 -789482 -781165 -777001 -777456 -776596 -770950 -766766 -760512 -765154
10449 -765154 -768188 -761773 -756861 -754322 -756008 -753129 -750974 -741229 -734216 -730912 -731392 -733405 -741888 -740879
10435 -740879 -734321 -730163 -732133 -732150 -732108 -733195 -729818 -726832 -729080 -724177 -724291 -726185 -723481 -715242 -719978
10420 -719978 -726868 -728777 -731795 -738497 -745054 -743985 -739464 -740744 -737903 -736478 -734465 -730350 -732834 -730278
10406 -730278 -726543 -733073 -738430 -730814 -728969 -729750 -728763 -724950 -716143 -710674 -710758 -712622 -710301 -715436 -722216
10391 -722216 -719755 -712083 -709185 -718735 -723123 -722256 -723132 -714858 -708763 -709817 -705585 -699424 -702611 -702359 -701576
10376 -701576 -698754 -695259 -694703 -688811 -693670 -694201 -692256 -690694 -689251 -691954 -692365 -690641 -695613 -700234 -700896
10361 -700896 -696744 -694180 -691699 -684884 -681210 -678627 -676007 -673973 -672718 -670032 -668333 -668228 -668239 -670346 -669842
$$ packed form
10463g37538j2190j8607j6681l819j010L63Q317M164m55Q60N646M184O254m642
10449g65154l034O415M912K539j686K879K155R745P013L304m80k013q483J009
10435g40879O558M158j970j7M2j087L377K986k248M903j14j894K704Q239m736
10420g19978o890j909l018o702o557J069M521j280K841J425K013M115k484K556
10406g30278L735o530n357P616J845p81R87L813Q807N469q4j864K321n135o780
10391g22216K461P672K898r550m388Q67q76Q274O095j054M232O161l187K52P83
10376g01576K822L495N56N892m859n31J945J562J443k703m11J724m972m621o62
10361g00896M152K564K481O815L674K583K620K034J255K686J699J05j1k107N04
$$ plain form
10346 -669842 -668941 -667837 -665125 -663472 -665516 -670817 -675362 -676648 -681252 -680419 -677284 -670301 -665785 -663175 -663912
10331 -663912 -664447 -664238 -673127 -676465 -669785 -663784 -659298 -660185 -662095 -658814 -651558 -647998 -647862 -653798 -652436
10316 -652436 -642113 -641257 -642439 -643545 -636680 -628218 -626410 -629846 -636694 -635682 -644498 -644468 -646763 -643223 -636087
10301 -636087 -635043 -633876 -637050 -628221 -623022 -621831 -617433 -613127 -611282 -610056 -612325 -619023 -620640 -612093
10287 -612093 -604095 -607674 -607581 -602501 -597490 -595725 -594718 -594600 -597590 -590082 -587853 -589627 -588357 -593142 -591141
10272 -591141 -585148 -586012 -585889 -580310 -578988 -580604 -585191 -596424 -603146 -604008 -596759 -587796 -587427 -590459 -587982
10257 -587982 -589003 -587548 -582591 -574036 -570063 -567204 -570198 -574641 -573124 -566859 -561211 -561170 -566065 -563200 -561031
10242 -561031 -552691 -543982 -548901 -549991 -538402 -534593 -533220 -530877 -535016 -538082 -534222 -529746 -524827 -519154
$$ packed form
10346f69842R01J104K712J653k044n301m545j286m604Q33L135O983M516K610p37
10331f63912n35K09q889l338O680O001M486q87j910L281P256L560J36n936J362
10316f52436J0323Q56j182j106O865Q462J808l436o848J012q816L0k295L540P136
10301f36087J044J167l174Q829N199J191M398M306J845J226k269o698j617Q547
10287f12093P998l579R3N080N011J765J007J18k990P508K229j774J270m785K001
10272e91141N993q64J23N579J322j616m587j1233o722q62P249Q963L69l032K477
10257e87982j021J455M957Q555L973K859k994m443J517O265N648M1m895K865K169
10242e61031Q340Q709m919j090J1589L809J373K343m139l066L860M476M919N673
$$ plain form
10228 -519154 -505292 -501209 -506211 -505002 -498917 -495609 -494554 -492017 -486296 -480506 -482502 -481432 -479918 -474212
10214 -474212 -468805 -457948 -452516 -448915 -445552 -438919 -437909 -439752 -438251 -425152 -417453 -416043 -416679 -413744
10200 -413744 -404290 -398513 -390067 -385926 -387382 -380269 -371440 -365328 -357311 -342910 -327056 -318626 -309582 -296261
10186 -296261 -281165 -263091 -242847 -226186 -203447 -180668 -156300 -127918 -103388 -82972 -52183
10175 -52183 -7672 51606 119167 195941 283491 388729 519576 682037 894294 1158913 1387831
10164 1387831 1305304 620260 -609334 -1808146 -2408686 -2439739 -2219618 -1969236 -1762075
10155 -1762075 -1603122 -1476286 -1374099 -1294255 -1234485 -1180573 -1132446 -1088053 -1042889 -1011588 -990523
10144 -990523 -972817 -950043 -919877 -902820 -882883 -858378 -834982 -822307 -817421 -817109 -809865 -797626
$$ packed form
10228e19154J3862M083n002J209O085L308J055K537N721N790j996J070J514N706
10214d74212N407J0857N432L601L363O633J010j843J501J3099P699J410o36K935
10200d13744R454N777Q446M141j456P113Q829O112Q017J4401J5854Q430R044J3321
10186b96261J5096J8074K0244J6661K2739K2779K4368K8382K4530K0416L0789
10175e2183M4511N9278O7561P6774Q7550J05238J30847J62461K12257K64619K28918
10164A387831q2527o85044j229594j198812o00540l1053K20121K50382K07161
10155a762075J58953J26836J02187P9844N9770N3912M8127M4393M5164L1301K1065
10144i90523J7706K2774L0166J7057J9937K4505K3396J2675M886L12P244J2239
$$ plain form
10132 -797626 -774595 -761778 -749091 -738779 -729080 -710893 -701467 -701217 -694318 -690070 -681148 -669431 -656768
10119 -656768 -649211 -651159 -649769 -644573 -639965 -628355 -617402 -616793 -614014 -602041 -598799 -595565 -595967 -584211
10105 -584211 -572247 -568087 -569948 -570614 -562245 -554596 -544972 -538654 -532016 -521739 -512073 -508378 -503419 -490871
10091 -490871 -478775 -474030 -472225 -473213 -472022 -462615 -445421 -435561 -428910 -418875 -410184 -395809 -388729
10078 -388729 -382558 -372760 -368140 -361188 -343084 -322822 -305629 -294571 -284054 -272505 -264992 -254505
10066 -254505 -240887 -222971 -207580 -194028 -181850 -167459 -143766 -117563 -87882 -60841 -31974
10055 -31974 829 33864 59729 80186 87078 93051 110461 150319 196824 256301 323178 384366
10043 384366 432106 487757 549836 615175 696188 793547 913703 1065821 1241699 1460584 1731142
$$ packed form
10132g97626K3031J2817J2687J0312R699J8187R426K50O899M248Q922J1717J2663
10119f56768P557j948J390N196M608J1610J0953O09K779J1973L242L234m02J1756
10105e84211J1964M160j861o66Q369P649R624O318O638J0277R666L695M959J2548
10091d90871J2096M745J805r88J191R407J7194R860O651J0035Q691J4375P080
10078c88729O171R798M620O952J8104K0262J7193J1058J0517J1549P513J0487
10066b54505J3618J7916J5391J3552J2178J4391K3693K6203K9681K7041K8867
10055c1974L2803L3035K5865K0457O892N973J7410L9858M6505N9477O6877O1188
10043C84366M7740N5651O2079O5339Q1013R7359J20156J52118J75878K18885K70558
$$ plain form
10032 1731142 2065719 2473037 2990843 3644382 4311672 4559708 3683473 1278662 -1925899
10023 -1925899 -4590160 -5754438 -5703874 -5101642 -4465415 -3943071 -3542115 -3226013 -2972133
10014 -2972133 -2756509 -2578822 -2425886 -2293418 -2186536 -2092256 -2021934 -1961304 -1905434 -1848210
10004 -1848210 -1790451 -1731471 -1690613 -1649340 -1612533 -1578865 -1543631 -1512564 -1485599 -1461397 -1435842
9993 -1435842 -1408484 -1382355 -1362066 -1337650 -1316347 -1299290 -1285681 -1270720 -1250133 -1231925 -1227053 -1221637
9981 -1221637 -1213526 -1202688 -1187745 -1172631 -1153640 -1144091 -1136989 -1131423 -1118813 -1105217 -1095065 -1083131
9969 -1083131 -1066396 -1051343 -1046549 -1043436 -1046537 -1040537 -1039287 -1029003 -1021350 -1015406 -1011344 -1004699 -999631
9956 -999631 -994169 -984692 -978804 -974458 -972813 -962369 -950566 -943368 -937323 -931027 -928277 -930701 -922313 -929717
$$ packed form
10032A731142L34577M07318N17806O53539O67290K48036q76235k404811l204561
10023a925899k664261j164278N0564O02232O36227N22344M00956L16102K53880
10014b972133K15624J77687J52936J32468J06882R4280P0322O0630N5870N7224
10004a848210N7759N8980M0858M1273L6807L3668L5234L1067K6965K4202K5555
9993a435842K7358K6129K0289K4416K1303J7057J3609J4961K0587J8208M872N416
9981a221637Q111J0838J4943J5114J8991R549P102N566J2610J3596J0152J1934
9969a083131J6735J5053M794L113l101O000J250J0284P653N944M062O645N068
9956i99631N462R477N888M346J645J0444J1803P198O045O296K750k424Q388p404
$$ plain form
9942 -929717 -935230 -932452 -924195 -911384 -905324 -899658 -894263 -895052 -898550 -899697 -900096 -897455 -889386 -889432 -880851
9927 -880851 -874060 -876234 -875420 -871014 -865879 -862118 -863627 -867676 -863593 -855887 -850759 -848349 -844992 -844694 -840229
9912 -840229 -839679 -839570 -840812 -831413 -820163 -814105 -811950 -817204 -816301 -813310 -816144 -813063 -813218 -806859 -802891
9897 -802891 -799430 -799001 -795486 -793986 -787585 -782897 -781227 -793012 -800105 -800349 -801278 -791751 -778741 -772861 -770258
9882 -770258 -773516 -774063 -769663 -770925 -773783 -775240 -774529 -770798 -764962 -761344 -755581 -749878 -747366 -742553 -745089
9867 -745089 -746341 -742025 -740774 -742950 -744045 -744113 -743219 -737829 -738206 -730240 -727141 -718744 -715474 -722056 -724994
9852 -724994 -725714 -725867 -729330 -737107 -738922 -729774 -722376 -716729 -713768 -714023 -719543 -719673 -716349 -706035 -698685
9837 -698685 -692775 -691539 -694065 -689046 -683909 -681622 -680979 -683297 -688091 -687860 -686714 -682936 -683302 -683419 -683689 -685742
$$ packed form
9942i29717n513K778Q257J2811O060N666N395p89l498j147l99K641Q069m6Q581
9927h80851O791k174Q14M406N135L761j509m049M083P706N128K410L357K98M465
9912h40229N50J09j242R399J1250O058K155n254R03K991k834L081j55O359L968
9897h02891L461M29L515J500O401M688J670j1785p093k44r29R527J3010N880K603
9882g70258l258n47M400j262k858j457P11L731N836L618N763N703K512M813k536
9867g45089j252M316J251k176j095o8Q94N390l77P966L099Q397L270o582k938
9852g24994p20j53l463p777j815R148P398N647K961k55n520j30L324J0314P350
9837f98685N910J236k526N019N137K287O43k318m794K31J146L778l66j17k70k053
$$ plain form
9821 -685742 -676256 -673532 -669619 -670858 -663288 -659220 -660325 -665178 -670604 -664347 -658230 -650785 -645668 -644377
9807 -644377 -645054 -640794 -635038 -627984 -630825 -632692 -635194 -634140 -629544 -629344 -626446 -628992 -629578 -627612 -627324
9792 -627324 -627348 -632881 -638880 -630038 -618799 -622925 -625665 -619995 -615668 -613814 -613675 -623967 -625943 -619011 -609381
9777 -609381 -609900 -611286 -610880 -618230 -621733 -624197 -619075 -613914 -612030 -607671 -614160 -616443 -616497 -621921 -624360
9762 -624360 -625361 -627029 -627028 -623203 -621063 -623097 -628738 -631325 -630112 -623880 -620002 -618981 -614289 -609556 -609649 -609402
9746 -609402 -616272 -624482 -631269 -629109 -628859 -620455 -614535 -611702 -609088 -604831 -602693 -595745 -594116 -591593 -578636
9731 -578636 -567606 -562735 -553259 -548776 -549591 -542377 -526350 -516549 -501537 -486695 -474421 -464363 -452445
9718 -452445 -435566 -413335 -392594 -359589 -326780 -294497 -244341 -196486 -187791 -303856 -576211
$$ packed form
9821f85742R486K724L913j239P570M068j105m853n426O257O117P445N117J291
9807f44377o77M260N756P054k841j867k502J054M596K00K898k546n86J966K88
9792f27324k4n533n999Q842J1239m126k740N670M327J854J39j0292j976O932R630
9777f09381n19j386M06p350l503k464N122N161J884M359o489k283n4n424k439
9762f24360j001j668JL825K140k034n641k587J213O232L878J021M692M733r3K47
9746f09402o870q210o787K160K50Q404N920K833K614M257K138O948J629K523J2957
9731e78636J1030M871R476M483q15P214J6027R801J5012J4842J2274J0058J1918
9718d52445J6879K2231K0741L3005L2809L2283N0156M7855Q695j16065k72355
$$ plain form
9707 -576211 -859248 -991553 -992427 -942744 -887849 -846074 -806223 -768659 -733889 -709590 -690636 -682502
9695 -682502 -675658 -668690 -661766 -642789 -625892 -616726 -606087 -593584 -576273 -556288 -546248 -538073 -525489
9682 -525489 -513749 -501005 -486120 -474951 -462831 -448250 -442848 -424976 -401143 -378278 -361597 -344910
9670 -344910 -313252 -280247 -247885 -199509 -145542 -82913 -26358 27993 111238 217130 342080
9659 342080 408939 253328 -223750 -798007 -1151796 -1265784 -1265641 -1225150 -1194467 -1221617 -1265247
9648 -1265247 -1258578 -1210616 -1155579 -1099600 -1047719 -1006997 -971220 -940734 -911652 -877353 -846357 -823097
9636 -823097 -798686 -782782 -774542 -760355 -744335 -728556 -713314 -703157 -688600 -663378 -644539 -624380
9624 -624380 -603558 -583185 -562893 -540480 -508276 -480727 -453280 -422208 -390754 -358580 -333500 -312856
$$ packed form
9707e76211k83037j32305q74M9683N4895M1775L9851L7564L4770K4299J8954Q134
9695f82502O844O968O924J8977J6897R166J0639J2503J7311J9985J0040Q175J2584
9682e25489J1740J2744J4885J1169J2120J4581N402J7872K3833K2865J6681J6687
9670c44910L1658L3005L2362M8376N3967O2629N6555N4351Q3245J05892J24950
9659C42080O6859j55611m77078n74257l53789j13988J43M0491L0683k7150m3630
9648a265247O669M7962N5037N5979N1881M0722L5777L0486K9082L4299L0996K3260
9636h23097K4411J5904Q240J4187J6020J5779J5242J0157J4557K5222J8839K0159
9624f24380K0822K0373K0292K2413L2204K7549K7447L1072L1454L2174K5080K0644
$$ plain form
9612 -312856 -273170 -203590 -117640 -25658 42686 41329 -135915 -425334 -665580 -823098 -943987
9601 -943987 -1059863 -1227326 -1420239 -1522000 -1500418 -1426064 -1350037 -1282946 -1225133 -1175738 -1132583
9590 -1132583 -1097335 -1052254 -1016438 -999299 -980446 -958114 -929285 -911425 -901755 -911565 -935720 -948630
9578 -948630 -945072 -931878 -915747 -894730 -876899 -865729 -850530 -831161 -822309 -820301 -806388 -793226
9566 -793226 -782596 -777928 -780702 -770810 -757450 -750136 -729499 -704777 -678389 -652242 -627424 -614195
9554 -614195 -609481 -633645 -691720 -763865 -857206 -988826 -1092713 -1126338 -1109655 -1079769 -1047173
9543 -1047173 -1017258 -993685 -977572 -959863 -949577 -939870 -932186 -926237 -914333 -904325 -898779 -890682
9531 -890682 -881446 -880892 -874306 -867694 -872978 -876187 -872090 -860375 -851952 -846475 -847528 -844953 -845519 -836765 -834250
$$ packed form
9612c12856L9686O9580Q5950R1982O8344j357j77244k89419k40246j57518j20889
9601i43987j15876j67463j92913j01761K1582P4354P6027O7091N7813M9395M3155
9590a132583L5248M5081L5816J7139J8853K2332K8829J7860R670r810k4155j2910
9578i48630L558J3194J6131K1017J7831J1170J5199J9369Q852K008J3913J3162
9566g93226J0630M668k774R892J3360P314K0637K4722K6388K6147K4818J3229
9554f14195M714k4164n8075p2145r3341j31620j03887l3625J6683K9886L2596
9543a047173K9915K3573J6113J7709J0286R707P684N949J1904J0008N546Q097
9531h90682R236N54O586O612n284l209M097J1715Q423N477j053K575n66Q754K515
$$ plain form
9516 -834250 -832421 -836985 -843249 -846696 -840943 -829450 -822699 -819575 -821383 -813807 -810495 -810900 -805872 -804511
9502 -804511 -799903 -800742 -800500 -802679 -804602 -800750 -798945 -800913 -800007 -796557 -792473 -789613 -790136 -793548 -788208
9487 -788208 -784343 -783526 -781984 -778115 -772993 -772414 -767534 -761835 -768830 -767830 -764471 -770141 -765994 -760379 -763613
9472 -763613 -759898 -758126 -751420 -746268 -744497 -739801 -737115 -736853 -740694 -746694 -748053 -743878 -741681 -735747 -739687
9457 -739687 -742919 -747958 -746458 -743036 -745374 -742516 -736656 -731799 -726793 -734047 -736903 -734240 -731399 -729259
9443 -729259 -729665 -726554 -719484 -719940 -719927 -717247 -715605 -717441 -713956 -704787 -703890 -702925 -707977 -709872 -710907 -715992
9427 -715992 -716659 -705640 -702259 -709446 -710724 -701879 -709164 -714208 -706544 -701381 -704760 -701745 -699868 -700055 -698040
9412 -698040 -699320 -693763 -699485 -701361 -695361 -692416 -690687 -688693 -687643 -685849 -678328 -677616 -678201 -676442 -675306
$$ packed form
9516h34250J829m564o264l447N753J1493O751L124j808P576L312m05N028J361
9502h04511M608q39K42k179j923L852J805j968R06L450M084K860n23l412N340
9487g88208L865Q17J542L869N122N79M880N699o995J000L359n670M147N615l234
9472g63613L715J772O706N152J771M696K686K62l841o000j359M175K197N934l940
9457g39687l232n039J500L422k338K858N860M857N006p254k856K663K841K140
9443g29259m06L111P070m56J3K680J642j836L485R169Q97R65n052j895j035n085
9427g15992o67J1019L381p187j278Q845p285n044P664N163l379L015J877j87K015
9412f98040j280N557n722j876O000K945J729J994J050J794P521P12n85J759J136
$$ plain form
9397 -675306 -676084 -676967 -673250 -673881 -680891 -676300 -673516 -676266 -685564 -688057 -682452 -679066 -676453 -669702 -667294
9382 -667294 -665284 -667840 -671799 -670163 -670586 -663565 -660202 -651556 -659243 -659928 -660800 -663974 -664733 -665921 -669688
9367 -669688 -667678 -661060 -654687 -651915 -654627 -661964 -663633 -658420 -655311 -654505 -646360 -643213 -649563 -651503 -651476
9352 -651476 -657312 -656802 -655389 -657919 -651783 -652864 -657551 -658172 -657212 -651970 -648259 -647222 -650336 -652706 -650467
9337 -650467 -646950 -647591 -650177 -651070 -655086 -655806 -650404 -650887 -652899 -647792 -645444 -639818 -637373 -633377 -631255
9322 -631255 -625548 -632697 -631748 -622606 -615226 -612935 -619386 -619290 -624849 -627957 -627071 -630322 -636265 -637730 -631268
9307 -631268 -629914 -628386 -623957 -622833 -625408 -624515 -620194 -616803 -616271 -612472 -609048 -607539 -603337 -600406 -609839
9292 -609839 -614496 -614567 -612105 -616529 -622150 -618330 -608573 -605005 -605081 -607303 -611393 -614673 -604170 -594984 -598976
$$ packed form
9397f75306p78q83L717o31p010M591K784k750r298k493N605L386K613O751K408
9382f67294K010k556l959J636m23P021L363Q646p687o85q72l174p59j188l767
9367f69688K010O618O373K772k712p337j669N213L109Q06Q145L147o350j940K7
9352f51476n836N10J413k530O136j081m687o21R60N242L711J037l114k370K239
9337f50467L517o41k586q93m016p20N402m83k012N107K348N626K445L996K122
9322f31255N707p149R49R142P380K291o451R6n559l108Q86l251n943j465O462
9307f31268J354J528M429J124k575Q93M321L391N32L799L424J509M202K931r433
9292f09839m657p1K462m424n621L820R757L568p6k222m090l280J0503R186l992
$$ plain form
9277 -598976 -607773 -607840 -602059 -602040 -603924 -601958 -595317 -588287 -593244 -599222 -601357 -602404 -600904 -599371 -597275
9262 -597275 -593765 -590247 -591806 -590154 -595577 -596076 -596974 -597449 -600115 -599611 -595004 -586248 -582027 -585976 -589793
9247 -589793 -589311 -594357 -590541 -587463 -584522 -584292 -583091 -576212 -576254 -577285 -578361 -582237 -586243 -577129 -568924
9232 -568924 -569064 -573084 -567381 -566867 -564899 -562961 -565623 -565115 -560328 -559669 -570811 -577329 -577208 -571835 -562600
9217 -562600 -553663 -551802 -557874 -559847 -551582 -547820 -551080 -553238 -549721 -558225 -560420 -548678 -548529 -553959
9203 -553959 -546112 -530102 -526955 -527649 -525952 -527901 -529474 -530055 -528852 -528189 -532913 -531877 -528624 -523971 -519752
9188 -519752 -512995 -509366 -515085 -515945 -515095 -513183 -515621 -517739 -512751 -511571 -504077 -506537 -512586 -512404 -505985
9173 -505985 -494265 -486869 -494467 -496138 -493442 -487798 -482149 -477598 -477661 -469077 -467482 -468183 -469349 -466979 -466731
$$ packed form
9277e98976q797o7N781J9j884J966O641P030m957n978k135j047J500J533K096
9262e97275L510L518j559J652n423m99q98m75k666N04M607Q756M221l949l817
9247e89793M82n046L816L078K941K30J201O879m2j031j076l876m006R114Q205
9232e68924j40m020N703N14J968J938k662N08M787O59j1142o518J21N373R235
9217e62600Q937J861o072j973Q265L762l260k158L517q504k195J1742J49n430
9203e53959P847J6010L147o94J697j949j573n81J203O63m724J036L253M653M219
9188e19752O757L629n719q60Q50J912k438k118M988J180P494k460o049J82O419
9173e05985J1720P396p598j671K696N644N649M551o3Q584J595p01j166K370K48
$$ plain form
9158 -466731 -470920 -467547 -460766 -457237 -453886 -451417 -444222 -440743 -434741 -427783 -423357 -417833 -412002 -409821
9144 -409821 -407173 -406397 -402219 -398305 -394435 -380858 -371627 -367529 -360098 -364688 -366275 -359355 -351436 -342942
9130 -342942 -339941 -336568 -329864 -323587 -316268 -302603 -295843 -292555 -279809 -261947 -246050 -233294 -229198
9117 -229198 -222089 -208230 -196188 -183278 -168484 -152092 -131196 -114419 -103860 -84847 -63956 -54902
9105 -54902 -50049 -41126 -32603 -33053 -52522 -78645 -111148 -160547 -228742 -313118 -414949 -534762
9093 -534762 -653144 -764668 -870491 -958758 -1029931 -1079524 -1116708 -1138286 -1153633 -1160695 -1162870
9082 -1162870 -1157886 -1145428 -1133359 -1119618 -1103076 -1084930 -1069033 -1058376 -1049858 -1036243 -1023279 -1011452
9070 -1011452 -1002056 -996628 -983961 -967865 -953301 -946254 -935522 -924079 -917307 -910226 -897309 -885561
$$ packed form
9158d66731m189L373O781L529L351K469P195L479O002O958M426N524N831K181
9144d09821K648P76M178L914L870J3577R231M098P431m590j587O920P919Q494
9130c42942L001L373O704O277P319J3665O760L288J2746J7862J5897J2756M096
9117b29198P109J3859J2042J2910J4794J6392K0896J6777J0559J9013K0891R054
9105e4902M853Q923Q523m50j9469k6123l2503m9399o8195q4376j01831j19813
9093e34762j18382j11524j05823q8267p1173m9593l7184k1578j5347p062k175
9082a162870M984J2458J2069J3741J6542J8146J5897J0657Q518J3615J2964J1827
9070a011452R396N428J2667J6096J4564P047J0732J1443O772P081J2917J1748
$$ plain form
9058 -885561 -872905 -863352 -865493 -859710 -849167 -842256 -837976 -837857 -835607 -833237 -825106 -815998 -807155 -803210
9044 -803210 -803778 -798685 -801116 -803769 -797153 -798275 -793847 -785452 -779348 -771938 -765142 -760369 -760128 -763091 -766430
9029 -766430 -758670 -750516 -758893 -756338 -745031 -744545 -747268 -750156 -751770 -740312 -737526 -735602 -732182 -732786
9015 -732786 -730259 -735744 -730912 -721458 -720961 -722216 -720487 -715936 -709634 -706366 -701294 -697415 -698727 -697820 -695392
9000 -695392 -693041 -691742 -687076 -687220 -691478 -691913 -687514 -677464 -675107 -672349 -676450 -678161 -675839 -676242 -676471
8985 -676471 -673242 -676068 -678007 -673117 -668392 -667311 -664616 -670973 -673924 -669397 -665021 -659433 -658921 -660349 -665573
8970 -665573 -671487 -664022 -658125 -665799 -672871 -669304 -670772 -673158 -670506 -661650 -656823 -656318 -659847 -659656 -656598
8955 -656598 -651251 -651855 -650130 -648206 -650441 -651530 -650745 -652019 -649696 -656754 -655870 -651222 -654910 -659840 -662876
$$ packed form
9058h85561J2656R553k141N783J0543O911M280J19K250K370Q131R108Q843L945
9044h03210n68N093k431k653O616j122M428Q395O104P410O796M773K41k963l339
9029g66430P760Q154q377K555J1307M86k723k888j614J1458K786J924L420o04
9015g32786K527n485M832R454M97j255J729M551O302L268N072L879j312R07K428
9000f95392K351J299M666j44m258m35M399J0050K357K758m101j711K322m03k29
8985f76471L229k826j939M890M725J081K695o357k951M527M376N588N12j428n224
8970f65573n914P465N897p674p072L567j468k386K652Q856M827N05l529J91L058
8955f56598N347o04J725J924k235j089P85j274K323p058Q84M648l688m930l036
$$ plain form
8940 -662876 -652333 -638261 -633596 -637843 -637968 -636350 -637109 -637240 -639363 -638368 -635738 -633458 -629917 -629862 -633214
8925 -633214 -640126 -644509 -644091 -639988 -629247 -629748 -633759 -639386 -637278 -631297 -626781 -619656 -619828 -622692 -621619
8910 -621619 -620257 -617800 -614660 -621849 -622786 -620028 -616693 -616203 -621506 -620521 -613393 -610840 -612036 -621525 -621519 -621320
8894 -621320 -619594 -614326 -615319 -619983 -623044 -616313 -616953 -623094 -623062 -614475 -602572 -589426 -592136 -596518 -597230
8879 -597230 -600148 -603606 -601957 -602182 -597502 -591816 -593404 -599407 -597337 -594396 -597874 -597747 -593052 -590981 -591577
8864 -591577 -586161 -582128 -581112 -581781 -585750 -594232 -597786 -594217 -583639 -585144 -592724 -590917 -586127 -585099
8850 -585099 -587375 -593803 -595271 -596221 -592437 -584016 -588125 -585772 -584298 -585731 -584790 -584849 -578847 -578295 -583236 -585409
8834 -585409 -586273 -585248 -582189 -580416 -579431 -586343 -586148 -585990 -592573 -590903 -581207 -581002 -580276 -581657 -579028 -576950
$$ packed form
8940f62876J0543J4072M665m247j25J618p59j31k123R95K630K280L541N5l352
8925f33214o912m383M18M103J0741n01m011n627K108N981M516P125j72k864J073
8910f21619J362K457L140p189r37K758L335M90n303R85P128K553j196r489OJ99
8894f21320J726N268r93m664l061O731o40o141L2Q587J1903J3146k710m382p12
8879e97230k918l458J649k25M680N686j588o003K070K941l478J27M695K071n96
8864e91577N416M033J016o69l969q482l554L569J0578j505p580J807M790J028
8850e85099k276o428j468r50L784Q421m109K353J474j433R41n9O002N52m941k173
8834e85409q64J025L059J773R85o912J95J58o583J670R696K05P26j381K629K078
$$ plain form
8818 -576950 -573243 -569059 -569528 -572335 -575888 -571728 -569921 -574805 -580175 -574001 -571186 -573282 -575527 -574800 -578615
8803 -578615 -570427 -565389 -565683 -568521 -568905 -568764 -566890 -565737 -568093 -565400 -562025 -563085 -565949 -564523 -564870
8788 -564870 -564108 -563544 -564376 -566453 -566676 -567592 -568441 -567749 -568188 -559657 -560386 -570210 -569142 -563638 -556412 -549566 -546077
8771 -546077 -542851 -542641 -541028 -542639 -545380 -552198 -566706 -563509 -556973 -557335 -558921 -551454 -550471 -546174 -537916
8756 -537916 -535438 -545454 -551011 -548762 -543178 -536239 -539904 -544926 -549388 -552704 -550125 -545172 -545627 -540910
8742 -540910 -541818 -547706 -547688 -546979 -540678 -537535 -540968 -540636 -539638 -545042 -544386 -544534 -543906 -539039 -531222 -521382 -525587
8725 -525587 -528579 -535793 -535674 -537907 -534663 -532997 -529228 -530440 -525096 -522695 -515796 -514509 -517167 -520693 -519256
8710 -519256 -515705 -508508 -498004 -503274 -500895 -498413 -489563 -484368 -483538 -488619 -496302 -503384 -507507 -507549 -502547
$$ packed form
8818e76950L707M184m69k807l553M160J807m884n370O174K815k096k245P27l815
8803e78615Q188N038k94k838l84J41J874J153k356K693L375j060k864J426l47
8788e64870P62N64q32k077k23r16q49O92m39Q531p29r824J068N504P226O846L489
8771e46077L226K10J613j611k741o818j4508L197O536l62j586P467R83M297Q258
8756e37916K478j0016n557K249N584O939l665n022m462l316K579M953m55M717
8742e40910r08n888J8P09O301L143l433L32R98n404O56j48O28M867P817R840m205
8725e25587k992p214J19k233L244J666L769j212N344K401O899J287k658l526J437
8710e19256L551P197J0504n270K379K482Q850N195Q30n081p683p082m123m2N002
$$ plain form
8695 -502547 -493662 -483651 -472022 -458954 -451813 -463174 -497111 -544718 -582095 -599466 -591732 -583226
8683 -583226 -582057 -575912 -573338 -564891 -553683 -552521 -552285 -541273 -545250 -549009 -554368 -555228 -547528 -539055
8669 -539055 -536263 -531583 -526671 -524816 -521036 -523159 -528161 -518912 -508627 -504622 -494402 -482079 -472117 -465751
8655 -465751 -467694 -490064 -521988 -533391 -528055 -521513 -511840 -500362 -478552 -467191 -454832 -439584
8643 -439584 -428788 -454056 -526009 -597203 -629362 -625854 -608766 -592555 -587125 -574101 -555469 -537853
8631 -537853 -530823 -526486 -515822 -523799 -549646 -568531 -574607 -573342 -568222 -556912 -550220 -544074 -543112 -545604
8617 -545604 -548096 -545593 -550693 -553457 -549687 -542477 -530730 -527723 -532868 -543042 -548708 -548914 -551036 -548365
8603 -548365 -533266 -530206 -533062 -524712 -513189 -508795 -498396 -497254 -515648 -547014 -574068 -591533 -589859
$$ packed form
8695e02547Q885J0011J1629J3068P141j1361l3937m7607l7377j7371P734Q506
8683e83226J169O145K574Q447J1208J162K36J1012l977l759n359q60P700Q473
8669e39055K792M680M912J855L780k123n002R249J0285M005J0220J2323R962O366
8655d65751j943k2370l1924j1403N336O542R673J1478K1810J1361J2359J5248
8643d39584J0796k5268p1953p1194l2159L508J7088J6211N430J3024J8632J7616
8631e37853P030M337J0664p977k5847j8885o076J265N120J1310O692O146R62k492
8617e45604k492K503n100k764L770P210J1747L007n145j0174n666k06k122K671
8603e48365J5099L060k856Q350J1523M394J0399J142j8394l1366k7054j7465J674
$$ plain form
8590 -589859 -582145 -575041 -569714 -564978 -557623 -543686 -536495 -533440 -534929 -541368 -552031 -555538 -549351 -544846
8576 -544846 -543469 -551699 -556502 -557016 -551922 -551055 -551680 -548505 -543332 -542727 -537587 -541881 -548269 -545442 -545699 -553711
8560 -553711 -554999 -549785 -544868 -537587 -535743 -530200 -527358 -525557 -526384 -525050 -520548 -520041 -517275 -521052 -528158
8545 -528158 -527545 -522811 -514090 -514634 -513250 -513177 -514870 -516611 -510006 -508177 -502905 -496889 -496684 -492167 -495331 -499040
8529 -499040 -497922 -492652 -489049 -491820 -507788 -518937 -519612 -517519 -510657 -510436 -513619 -520085 -520669 -521243 -525145
8514 -525145 -523055 -519226 -511017 -505260 -506303 -513532 -515915 -506227 -503776 -507464 -512204 -515007 -512876 -507521
8500 -507521 -505311 -504356 -494939 -487817 -485126 -489102 -495521 -496213 -502102 -503480 -494644 -499777 -491773 -479620 -477593
8485 -477593 -485386 -489784 -487410 -483941 -488480 -494622 -502426 -502546 -504894 -499500 -494900 -500000 -506175 -499504 -500445
$$ packed form
8590e89859P714P104N327M736P355J3937P191L055j489o439j0663l507O187M505
8576e44846J377q230m803n14N094Q67o25L175N173O05N140m294o388K827k57q012
8560e53711j288N214M917P281J844N543K842J801q27J334M502N07K766l777p106
8545e28158O13M734Q721n44J384P3j693j741O605J829N272O016K05M517l164l709
8529d99040J118N270L603k771j5968j1149o75K093O862K21l183o466n84n74l902
8514e25145K090L829Q209N757j043p229k383R688K451l688m740k803K131N355
8500e07521K210R55R417P122K691l976o419o92n889j378Q836n133Q004J2153K027
8485d77593p793m398K374L469m539o142p804j20k348N394M600n100o175O671r41
$$ plain form
8470 -500445 -497181 -495021 -503421 -500001 -494223 -492960 -494220 -495215 -491438 -491216 -493186 -493380 -489662 -489761 -489111 -487479
8454 -487479 -476459 -469842 -476972 -482628 -481380 -477369 -470242 -468247 -476456 -474537 -465377 -461170 -467834 -475079
8440 -475079 -475923 -474564 -480795 -480844 -472298 -465990 -472717 -475660 -473243 -466403 -463333 -460450 -457107 -457944 -457323 -455560
8424 -455560 -453533 -457045 -458241 -462233 -462603 -460677 -451418 -449987 -452287 -454455 -443630 -440299 -437909 -434393
8410 -434393 -439835 -439875 -448831 -454039 -453304 -453512 -453465 -449811 -448032 -452207 -449199 -445823 -441690 -432788 -433759 -442517
8394 -442517 -444108 -441471 -432738 -424515 -428403 -435738 -440300 -439972 -437526 -432009 -427917 -425257 -424615 -422876 -416819
8379 -416819 -412532 -407557 -405113 -407943 -411640 -409848 -409031 -406758 -405684 -403512 -398133 -396863 -396199 -390322 -392894
8364 -392894 -399495 -400796 -401609 -397664 -394441 -390127 -388221 -394967 -396404 -389269 -385183 -379428 -378411 -378726 -370823
$$ packed form
8470e00445L264K160q400L420N778J263j260r95L777K22j970j94L718r9O50J632
8454d87479J1020O617p130n656J248M011P127J995q209J919R160M207o664p245
8440d75079q44J359o231m9Q546O308o727k943K417O840L070K883L343q37O21J763
8424d55560K027l512j196l992l70J926R259J431k300k168J0825L331K390L516
8410d34393n442m0q956n208P35k08M7L654J779m175L008L376M133Q902r71q758
8394d42517j591K637Q733Q223l888p335m562L28K446N517M092K660O42J739O057
8379d16819M287M975K444k830l697J792Q17K273J074K172N379J270O64N877k572
8364c92894o601j301q13L945L223M314J906o746j437P135M086N755J017l15P903
$$ plain form
8349 -370823 -370823 -372173 -366889 -362916 -366105 -368175 -363175 -361324 -362375 -360735 -354662 -349878 -356219 -346784 -342854
8334 -342854 -337367 -337034 -336312 -328351 -332732 -332155 -337557 -335410 -336150 -336418 -335779 -332558 -327807 -326442 -325109 -319440
8318 -319440 -309281 -302926 -297315 -291677 -284270 -279672 -278005 -275859 -275192 -275070 -273741 -274023 -278797 -291480 -292801
8303 -292801 -282335 -280853 -281296 -280551 -271403 -272069 -263903 -253867 -247701 -245260 -247874 -248295 -233881 -225342 -227191
8288 -227191 -221929 -215346 -210055 -201681 -192735 -184697 -176566 -163240 -154852 -146876 -146983 -143584 -130077 -123309
8274 -123309 -113856 -102002 -97024 -85073 -78060 -67642 -50164 -34787 -22850 -12916 -196 18662
8262 18662 30493 43675 56377 66244 89252 113835 129497 148478 174789 198082 219754 249662
8250 249662 283590 319213 349627 386565 422683 474733 533215 585101 635622 692999 756488 827325
$$ packed form
8349c70823%j350N284L973l189k070N000J851j051J640O073M784o341R435L930
8334c42854N487L33P22P961m381N77n402K147p40k68O39L221M751J365J333N669
8318c19440J0159O355N611N638P407M598J667K146O67J22J329k82m774j2683j321
8303b92801J0466J482m43P45R148o66Q166J0036O166K441k614m21J4414Q539j849
8288b27191N262O583N291Q374Q946Q038Q131J3326Q388P976j07L399J3507O768
8274a23309R453J1854M978J1951P013J0418J7478J5377J1937R934J2720J8858
8262A8662J1831J3182J2702R867K3008K4583J5662J8981K6311K3293K1672K9908
8250B49662L3928L5623L0414L6938L6118N2050N8482N1886N0521N7377O3489P0837
$$ plain form
8238 827325 899571 972601 1048929 1150965 1277191 1445722 1681166 1970869 2315603 2751508
8228 2751508 3303516 3953914 4476563 4204956 2130493 -1404514 -4312186 -5290348 -5039906
8219 -5039906 -4466335 -3914724 -3460473 -3093044 -2795697 -2556079 -2356968 -2197367 -2086772 -2005404
8209 -2005404 -1948953 -1897502 -1831886 -1761729 -1701579 -1640332 -1582912 -1528333 -1484003 -1440559 -1392765
8198 -1392765 -1352872 -1324847 -1290613 -1262345 -1234303 -1212227 -1184995 -1162560 -1146386 -1127458 -1105469
8187 -1105469 -1086032 -1068784 -1053524 -1046088 -1032198 -1018184 -1006432 -994250 -979815 -962314 -950945 -944056
8175 -944056 -932045 -923805 -915735 -910147 -905560 -896635 -887178 -870338 -866340 -860921 -860336 -850821 -845303 -839388
8161 -839388 -832326 -828331 -818355 -808209 -799718 -797966 -794715 -795529 -792412 -782359 -775967 -772991 -765982 -754826
$$ packed form
8238H27325P2246P3030P6328J02036J26226J68531K35444K89703L44734M35905
8228B751508N52008O50398N22649k71607k074463l535007k907672r78162K50442
8219e039906N73571N51611M54251L67429K97347K39618J99111J59601J10595Q1368
8209b005404N6451N1451O5616P0157O0150O1247N7420N4579M4330M3444M7794
8198a392765L9893K8025L4234K8268K8042K2076K7232K2435J6174J8928K1989
8187a105469J9437J7248J5260P436J3890J4014J1752J2182J4435J7501J1369O889
8175i44056J2011Q240Q070N588M587Q925R457J6840L998N419N85R515N518N915
8161h39388P062L995R976J0146Q491J752L251q14L117J0053O392K976P009J1156
$$ plain form
8147 -754826 -755126 -749328 -750482 -746139 -738025 -736597 -738167 -734195 -727929 -725858 -714916 -706200 -707808 -711535
8133 -711535 -710234 -704420 -698612 -694260 -691408 -686791 -691496 -686700 -681069 -674785 -662271 -655948 -655685 -647081
8119 -647081 -644015 -652907 -654312 -647747 -634984 -632332 -624294 -617192 -616821 -616844 -609276 -605539 -597628 -594860 -594752
8104 -594752 -592671 -586146 -578501 -578504 -575944 -566642 -558122 -563436 -569012 -568966 -571458 -564309 -551264 -536006 -520088
8089 -520088 -514237 -514055 -517745 -520419 -512518 -508050 -499882 -490792 -486650 -487304 -480310 -465345 -448688 -434828
8075 -434828 -418413 -395056 -378742 -346741 -312850 -271685 -220832 -147015 -63266 32300 108911 64896
8063 64896 -258851 -779555 -1163498 -1253468 -1196241 -1105333 -1014099 -935925 -879766 -846490 -821422
8052 -821422 -801888 -791943 -795749 -814441 -843817 -862506 -847775 -822688 -805776 -792179 -772901 -756332
$$ packed form
8147g54826l00N798j154M343Q114J428j570L972O266K071J0942Q716j608l727
8133g11535J301N814N808M352K852M617m705M796N631O284J2514O323K63Q604
8119f47081L066q892j405O565J2763K652Q038P102L71k3P568L737P911K768J08
8104e94752K081O525P645lK560R302Q520n314n576M6k492P149J3045J5258J5918
8089e20088N851J82l690k674P901M468Q168R090M142o54O994J4965J6657J3860
8075d34828J6415K3357J6314L2001L3891M1165N0853P3817Q3749R5566P6611m4015
8063F4896l23747n20704l83943q9970N7227R0908R1234P8174N6159L3276K5068
8052h21422J9534R945l806j8692k9376j8689J4731K5087J6912J3597J9278J6569
$$ plain form
8040 -756332 -733717 -705531 -678849 -652305 -630348 -610804 -603992 -639473 -713953 -790410 -820508 -817443
8028 -817443 -802447 -778048 -751552 -729227 -705304 -671597 -647904 -647361 -689004 -771330 -843483 -868015
8016 -868015 -850730 -826216 -806344 -799449 -792956 -781402 -764120 -754966 -749768 -745646 -747988 -745820 -746538
8003 -746538 -735853 -735876 -733248 -724981 -716485 -713421 -714134 -712227 -703772 -692649 -691366 -692616 -695837 -698799 -701500
7988 -701500 -695361 -685206 -679026 -673858 -673262 -676793 -684402 -685989 -683611 -684185 -681558 -673295 -673983 -663485 -658448
7973 -658448 -655265 -656262 -657974 -653294 -655086 -666116 -668122 -665014 -665094 -661744 -654599 -655352 -662118 -660933 -657176
7958 -657176 -663793 -668030 -665735 -654825 -652824 -649283 -648713 -648661 -654141 -655003 -647760 -645386 -642121 -631304 -634631
7943 -634631 -635233 -636260 -640825 -639771 -636036 -633412 -634791 -643827 -639560 -632547 -631300 -630240 -636833 -636190 -630592
$$ packed form
8040g56332K2615K8186K6682K6544K1957J9544O812l5481p4480p6457l0098L065
8028h17443J4996K4399K6496K2325K3923L3707K3693N43m1643q2326p2153k4532
8016h68015J7285K4514J9872O895O493J1554J7282R154N198M122k342K168p18
8003g46538J0685k3K628Q267Q496L064p13J907Q455J1123J283j250l221k962k701
7988g01500O139J0155O180N168N96l531p609j587K378n74K627Q263o88J0498N037
7973f58448L183r97j712M680j792j1030k006L108q0L350P145p53o766J185L757
7958f57176o617m237K295J0910K001L541N70N2n480q62P243K374L265J0817l327
7943f34631o02j027m565J054L735K624j379r036M267P013J247J060o593O43N598
$$ plain form
7928 -630592 -633287 -634720 -628224 -626555 -625496 -626214 -629609 -632026 -633917 -637326 -632348 -623576 -621112 -619442 -621725
7913 -621725 -629151 -630875 -622697 -623231 -624487 -624356 -623161 -624180 -628288 -624198 -621295 -621625 -614215 -610170 -608916
7898 -608916 -608133 -602693 -606783 -606968 -612253 -610109 -606102 -603264 -605836 -608945 -611794 -611873 -609005 -607177 -612820
7883 -612820 -615513 -614204 -616166 -612997 -614081 -616561 -618179 -615735 -606430 -599110 -600390 -603397 -604370 -599394 -598779
7868 -598779 -600307 -599231 -595535 -586586 -592478 -585431 -572946 -574013 -586813 -595861 -598187 -598284 -600159 -600138 -596007
7853 -596007 -594114 -596876 -596958 -596683 -590360 -589864 -596598 -597787 -600260 -595923 -591788 -582564 -577992 -579366 -586993
7838 -586993 -594317 -594769 -591969 -583213 -579142 -579876 -574398 -568031 -565746 -563351 -562427 -558471 -556371 -562174 -569103
7823 -569103 -578113 -581597 -584543 -591013 -600585 -601550 -601729 -594596 -596422 -601758 -603388 -596777 -590921 -592081 -591727
$$ packed form
7928f30592k695j433O496J669J059p18l395k417j891l409M978Q772K464J670k283
7913f21725p426j724Q178n34j256J31J195j019m108M090K903l30P410M045J254
7898f08916P83N440m090j85n285K144M007K838k572l109k849p9K868J828n643
7883f12820k693J309j962L169j084k480j618K444R305P320j280l007r73M976O15
7868e98779j528J076L696Q949n892P047J2485j067j2800r048k326r7j875K1M131
7853e96007J893k762q2K75O323M96o734j189k473M337M135R224M572j374p627
7838e86993p324m52K800Q756M071p34N478O367K285K395R24L956K100n803o929
7823e69103r010l484k946o470r572r65j79P133j826n336j630O611N856j160L54
$$ plain form
7808 -591727 -591788 -583838 -576737 -584454 -587126 -581326 -578449 -574410 -569822 -569354 -569420 -570807 -573005 -574561 -570610 -564176
7792 -564176 -569009 -573023 -579629 -580183 -575913 -571111 -567644 -574196 -577787 -570233 -563874 -561969 -559884 -555176 -555180
7777 -555180 -560116 -558844 -564962 -568134 -573403 -571049 -567091 -564791 -563744 -567696 -572253 -569305 -568272 -569358
7763 -569358 -569518 -569426 -568602 -577985 -574594 -572435 -573155 -572692 -572067 -576439 -569814 -568427 -566497 -569103 -567095 -562994
7747 -562994 -554537 -556411 -567915 -571834 -566501 -562847 -565945 -569333 -562492 -554849 -550354 -554383 -548394 -547301
7733 -547301 -556072 -560054 -561429 -561163 -556659 -558151 -564498 -559574 -555525 -557105 -554402 -557238 -556549 -556164 -556718
7718 -556718 -557510 -553987 -552190 -554487 -551577 -555089 -558598 -554884 -555188 -551239 -547353 -543091 -541145 -546925 -551784
7703 -551784 -547588 -549193 -558469 -555290 -552680 -555735 -553267 -553824 -552389 -545729 -548098 -545257 -547745 -549021 -542867
$$ packed form
7808e91727o1P950P101p717k672N800K877M039M588M68o6j387k198j556L951O434
7792e64176m833m014o606n54M270M802L467o552l591P554O359J905K085M708m
7777e55180m936J272o118l172n269K354L958K300J047l952m557K948J033j086
7763e69358j60R2Q24r383L391K159p20M63O25m372O625J387J930k606K008M101
7747e62994Q457j874j1504l919N333L654l098l388O841P643M495m029N989J093
7733e47301q771l982j375K66M504j492o347M924M049j580K703k836O89L85n54
7718e56718p92L523J797k297K910l512l509L714l04L949L886M262J946n780m859
7703e51784M196j605r276L179K610l055K468n57J435O660k369K841k488j276O154
$$ plain form
7688 -542867 -536792 -531332 -531246 -541568 -548040 -550026 -555125 -554238 -548780 -546734 -543433 -543302 -541254 -544089 -539913
7673 -539913 -541582 -549935 -550137 -546908 -546106 -543520 -536831 -537218 -538259 -545542 -548227 -546015 -545571 -544696 -547442 -549573
7657 -549573 -547389 -540538 -539037 -542760 -542664 -544510 -540439 -539532 -546074 -542750 -534316 -528681 -528881 -528557 -540985
7642 -540985 -552939 -551800 -549965 -546530 -535910 -531760 -532984 -535646 -540294 -540985 -538474 -536474 -531653 -529950
7628 -529950 -526862 -521925 -518050 -521352 -524597 -527240 -530517 -530999 -531938 -536939 -537339 -537525 -544381 -550181 -541770
7613 -541770 -536919 -530834 -532735 -536988 -537224 -537419 -535533 -533727 -534737 -535901 -530398 -529956 -527967 -524656 -523963
7598 -523963 -527872 -527928 -520313 -518735 -525750 -524654 -519425 -521827 -528780 -525801 -525820 -530251 -531022 -532794 -534181 -534053
7582 -534053 -532609 -535549 -538269 -535226 -530997 -537064 -536697 -530800 -528373 -528679 -529634 -531287 -530519 -529139 -525213
$$ packed form
7688e42867O075N460Q6j0322o472j986n099Q87N458K046L301J31K048k835M176
7673e39913j669q353k02L229Q02K586O689l87j041p283k685K212M44Q75k746k131
7657e49573K184O851J501l723R6j846M071R07o542L324Q434N635k00L24j2428
7642e40985j1954J139J835L435J0620M150j224k662m648o91K511K000M821J703
7628e29950L088M937L875l302l245k643l277m82r39n001m00j86o856n800Q411
7613e41770M851O085j901m253k36j95J886J806j010j164N503M42J989L311O93
7598e23963l909n6P615J578p015J096N229k402o953K979j9m431p71j772j387J28
7582e34053J444k940k720L043M229o067L67N897K427l06r55j653P68J380L926
$$ plain form
7567 -525213 -519735 -518978 -522169 -527402 -527354 -526059 -527091 -531709 -532558 -526260 -527952 -528723 -525186 -520668 -514459 -521015
7551 -521015 -524702 -521767 -513924 -513520 -514229 -514471 -515539 -523185 -526418 -525189 -518654 -514874 -510513 -513287 -514848
7536 -514848 -511490 -513804 -520009 -518473 -517395 -520824 -524366 -521233 -510422 -506351 -509598 -515507 -515977 -522714
7522 -522714 -523163 -518505 -517653 -516869 -509458 -503462 -509533 -519763 -518739 -512726 -512665 -514560 -515272 -518314 -516955 -519143
7506 -519143 -521272 -515980 -513188 -513778 -513440 -512981 -516458 -511556 -505834 -503742 -504803 -506989 -517969 -518113 -507469
7491 -507469 -502114 -501556 -507109 -513399 -512806 -510765 -513613 -516151 -511524 -510592 -510055 -507280 -508724 -511769 -518827
7476 -518827 -520343 -520704 -516542 -514467 -519014 -512037 -508746 -510542 -510425 -505991 -508436 -511050 -507095 -508595 -510431
7461 -510431 -505094 -505042 -505258 -502944 -499402 -498880 -501475 -501483 -503408 -505674 -510040 -507775 -507862 -508731 -514215 -519328 -512713
$$ packed form
7567e25213N478P57l191n233M8J295j032m618q49O298j692p71L537M518O209o556
7551e21015l687K935P843M04p09k42j068p646l233J229O535L780M361k774j561
7536e14848L358k314o205J536J078l429l542L133J0811M071l247n909m70o737
7522e22714m49M658Q52P84P411N996o071j0230J024O013O1j895p12l042J359k188
7506e19143k129N292K792n90L38M59l477M902N722K092j061k186j0980j44J0644
7491e07469N355N58n553o290N93K041k848k538M627R32N37K775j444l045p058
7476e18827j516l61M162K075m547O977L291j796J17M434k445k614L955j500j836
7461e10431N337N2k16K314L542N22k595qj925k266m366K265q7q69n484n113O615
$$ plain form
7444 -512713 -504300 -496698 -494461 -497351 -496537 -498623 -505675 -508953 -511597 -504487 -507208 -509778 -504810 -502067 -508924
7429 -508924 -510006 -510698 -505295 -505706 -507731 -504936 -508156 -508721 -508648 -514146 -511225 -507156 -502654 -499184 -494156 -489621
7413 -489621 -489835 -494617 -492256 -492405 -494869 -494536 -498325 -501527 -503028 -502497 -507877 -506059 -501560 -501133 -504233 -504013
7397 -504013 -503810 -509184 -506466 -505634 -502997 -499985 -496048 -493499 -490529 -489917 -492617 -499634 -498984 -493644 -496370
7382 -496370 -495284 -490931 -490946 -493777 -499574 -500108 -497704 -495665 -489518 -488901 -496119 -502282 -503873 -494815 -489051
7367 -489051 -491995 -497529 -496592 -496099 -492335 -495410 -498528 -497999 -494185 -494289 -494894 -496022 -500177 -496007 -490094 -490132
7351 -490132 -494911 -496910 -495097 -493885 -491584 -487702 -490683 -487713 -490381 -496744 -488240 -490018 -497795 -501485
7337 -501485 -498858 -496758 -493343 -495200 -500291 -496149 -494030 -496094 -487520 -489347 -490925 -488956 -488951 -491289 -492842
$$ packed form
7444e12713Q413P602K237k890Q14k086p052l278k644P110k721k570M968K743o857
7429e08924j082o92N403m11k025K795l220n65P3n498K921M069M502L470N028M535
7413d89621k14m782K361j49k464L33l789l202j501N31n380J818M499M27l100K20
7397e04013K03n374K718Q32K637L012L937K549K970O12k700p017O50N340k726
7382d96370J086M353j5k831n797n34K404K039O147O17p218o163j591R058N764
7367d89051k944n534R37M93L764l075l118N29L814j04o05j128m155M170N913l8
7351d90132m779j999J813J212K301L882k981K970k668o363Q504j778p777l690
7337e01485K627K100L415j857n091M142K119k064Q574j827j578J969Nk338j553
$$ plain form
7322 -492842 -493227 -481894 -475173 -478195 -480525 -483271 -489827 -491974 -486043 -486113 -483864 -480531 -487088 -485484 -480275
7307 -480275 -479269 -487981 -495575 -501678 -499919 -498966 -495220 -489543 -488162 -491860 -499169 -496750 -489885 -496242 -496101
7292 -496101 -492390 -486828 -481567 -486319 -483307 -474106 -478866 -486169 -485635 -481487 -483603 -481883 -478767 -482642 -484569
7277 -484569 -481764 -475845 -474989 -477923 -483641 -484324 -487067 -488154 -484106 -481384 -482269 -483053 -483551 -482123 -483820 -481983
7261 -481983 -485102 -484383 -485350 -484167 -481785 -479856 -484452 -485298 -476538 -469832 -472078 -480089 -478953 -478116 -482654
7246 -482654 -483403 -480631 -489326 -492898 -485921 -483491 -485916 -483525 -479575 -475209 -473758 -477757 -479917 -483176 -483375
7231 -483375 -475690 -477788 -475210 -470195 -471359 -473221 -473518 -472704 -467428 -466131 -463568 -468754 -470506 -468284 -468781
7216 -468781 -466586 -459047 -462198 -470837 -480419 -479019 -470906 -469356 -473381 -481114 -481956 -474832 -477718 -478166 -475579
$$ packed form
7322d92842l85J1333O721l022k330k746o556k147N931p0K249L333o557J604N209
7307d80275J006q712p594o103J759R53L746N677J381l698p309K419O865o357J41
7292d96101L711N562N261m752L012R201m760p303N34M148k116J720L116l875j927
7277d84569K805N919Q56k934n718o83k743j087M048K722q85p84m98J428j697J837
7261d81983l119P19r67J183K382J929m596q46Q760O706k246q011J136Q37m538
7246d82654p49K772q695l572O977K430k425K391L950M366J451l999k160l259j99
7231d83375P685k098K578N015j164j862k97Q14N276J297K563n186j752K222m97
7216d68781K195P539l151q639r582J400Q113J550m025p733q42P124k886m48K587
$$ plain form
7201 -475579 -479429 -488299 -489481 -491962 -494248 -495504 -493816 -490552 -483504 -482739 -486845 -493000 -488098 -480606 -480338
7186 -480338 -477748 -478707 -478484 -478621 -478371 -479364 -480974 -484647 -481567 -474562 -475713 -468112 -465376 -464064 -464160 -466386
7170 -466386 -472798 -478824 -478046 -467426 -467216 -474434 -481687 -482881 -479530 -473186 -470771 -471173 -471945 -469078 -466771
7155 -466771 -465150 -469829 -467562 -469196 -468734 -467394 -472715 -472851 -471885 -466052 -464790 -464576 -459976 -462005 -466789
7140 -466789 -470125 -470737 -474355 -470134 -462730 -465008 -464970 -468701 -467447 -463260 -464498 -470986 -473358 -480274 -481184
7125 -481184 -482183 -478583 -473969 -469325 -469667 -465448 -466702 -466609 -467544 -463909 -463733 -466268 -467402 -463664 -462644 -461694
7109 -461694 -462538 -461611 -460333 -456815 -453993 -456687 -456375 -458502 -460788 -458685 -465150 -467604 -462992 -463711 -465739
7094 -465739 -458899 -456820 -452113 -452445 -460537 -467090 -464371 -463980 -466662 -466553 -469417 -471542 -474647 -470665 -462304
$$ packed form
7201d75579l850q870j182k481k286j256J688L264P048P65m106o155M902P492K68
7186d80338K590r59K23j37K50r93j610l673L080P005j151P601K736J312r6k226
7170d66386o412o026P78J0620K10p218p253j194L351O344K415m02p72K867K307
7155d66771J621m679K267j634M62J340n321j36R66N833J262K14M600k029m784
7140d66789l336o12l618M221P404k278L8l731J254M187j238o488k372o916r10
7125d81184r99L600M614M644l42M219j254R3r35L635J76k535j134L738J020R50
7109d61694q44R27J278L518K822k694L12k127k286K103o465k454M612p19k028
7094d65739O840K079M707l32q092o553K719L91k682J09k864k125l105L982Q361
$$ plain form
7079 -462304 -458145 -452068 -452683 -456490 -453659 -454013 -456875 -460372 -458303 -460571 -461448 -459314 -455267 -456538 -452364
7064 -452364 -454194 -460506 -461679 -467152 -472964 -476076 -479355 -475249 -474011 -466175 -461726 -467468 -472544 -478415
7050 -478415 -476902 -476546 -481312 -475881 -465492 -456655 -459741 -459955 -462818 -467708 -463509 -456510 -450010 -456567 -461274
7035 -461274 -460386 -462111 -464144 -465349 -465807 -465339 -463074 -461295 -464684 -464134 -459893 -450810 -451052 -453985 -446149 -451369
7019 -451369 -456999 -457752 -458684 -463875 -463180 -461457 -465352 -462767 -452072 -447051 -446727 -451121 -451114 -447991 -451666 -460067
7003 -460067 -466467 -464874 -462547 -460934 -457350 -453975 -449037 -449917 -448703 -452958 -456881 -459233 -459313 -455866 -457860
6988 -457860 -459704 -458852 -452004 -452729 -459938 -462208 -455736 -459277 -463722 -465461 -465927 -458189 -455168 -448690 -446696
6973 -446696 -449283 -449443 -454070 -458009 -456895 -452788 -456827 -456542 -458122 -454719 -451981 -452924 -455813 -454783 -451175
$$ packed form
7079d62304M159O077o15l807K831l54k862l497K069k268q77K134M047j271M174
7064d52364j830o312j173n473n812l112l279M106J238P836M449n742n076n871
7050d78415J513L56m766N431J0389Q837l086k14k863m890M199O999O500o557m707
7035d61274Q88j725k033j205m58M68K265J779l389N50M241R083k42k933P836n220
7019d51369n630p53r32n191O95J723l895K585J0695N021L24m394PL123l675q401
7003d60067o400J593K327J613L584L375M938q80J214m255l923k352q0L447j994
6988d57860j844Q52O848p25p209k270O472l541m445j739m66P738L021O478J994
6973d46696k587j60m627l939J114M107m039K85j580L403K738r43k889J030L608
$$ plain form
6958 -451175 -447286 -454182 -458272 -460172 -449809 -452064 -458068 -459799 -456836 -453915 -454374 -454752 -452443 -449006 -447275
6943 -447275 -453081 -457419 -452863 -452908 -451280 -450854 -451191 -455197 -463275 -465696 -461189 -462325 -457178 -449881 -448246
6928 -448246 -446498 -445334 -446978 -450051 -453556 -450541 -447101 -449137 -450353 -450924 -452488 -453934 -452869 -449584 -451972
6913 -451972 -449182 -450064 -446568 -446096 -444919 -440251 -442592 -453520 -454650 -454530 -456712 -457483 -457468 -458497 -459553 -456553
6897 -456553 -454600 -443700 -449176 -452572 -446762 -446911 -447536 -446255 -446536 -450922 -454480 -452805 -454157 -457681 -455429
6882 -455429 -456628 -450379 -447166 -442559 -439872 -443450 -447811 -452866 -449791 -437739 -437077 -444636 -438895 -441734
6868 -441734 -444278 -442927 -441733 -436370 -433871 -445231 -450162 -449266 -444411 -442156 -446020 -452565 -450652 -442877
6854 -442877 -431491 -429010 -432711 -445112 -451873 -449719 -449657 -440129 -437656 -435793 -441320 -445029 -445185 -448173 -448417
$$ packed form
6958d51175L889o896m090j900J0363k255o004j731K963K921m59l78K309L437J731
6943d47275n806m338M556m5J628M26l37m006q078k421M507j136N147P297J635
6928d48246J748J164j644l073l505L015L440k036j216n71j564j446J065L285k388
6913d51972K790q82L496M72J177M668k341j0928j130J20k182p71J5j029j056L000
6897d56553J953J0900n476l396N810j49o25J281k81m386l558J675j352l524K252
6882d55429j199O249L213M607K687l578m361n055L075J2052O62p559N741k839
6868d41734k544J351J194N363K499j1360m931Q96M855K255l864o545J913P775
6854d42877J1386K481l701j2401o761K154O2R528K473J863n527l709j56k988k44
$$ plain form
6839 -448417 -448046 -447000 -441598 -444489 -446157 -450642 -443298 -435055 -436752 -441432 -443447 -447934 -449356 -445046 -441445
6824 -441445 -441932 -445152 -445556 -441867 -437513 -435554 -440352 -444150 -445108 -444032 -443678 -437166 -433441 -434296 -430104 -429822
6808 -429822 -435669 -440154 -443185 -442830 -433355 -428695 -429742 -432460 -431067 -433649 -437192 -440541 -440738 -435458 -431291
6793 -431291 -433116 -442364 -437372 -434009 -433810 -435027 -435163 -431971 -431649 -428782 -426610 -424732 -425338 -423200 -426209
6778 -426209 -427804 -430217 -431065 -431820 -427381 -417299 -418634 -423074 -419591 -416923 -419411 -424065 -432607 -437544 -435802
6763 -435802 -430070 -432782 -434150 -435301 -426388 -424612 -418849 -415440 -411719 -410513 -416022 -422018 -423991 -437009
6749 -437009 -444769 -452313 -463425 -465846 -467486 -471044 -474708 -474628 -467090 -461605 -463275 -460995 -457959 -458692 -456497
6734 -456497 -450793 -443539 -440139 -445183 -447462 -446467 -449044 -450191 -445240 -444508 -444375 -447088 -445055 -446150 -446336
$$ packed form
6839d48417L71J046N402k891j668m485P344Q243j697m680k015m487j422M310L601
6824d41445m87l220m04L689M354J959m798l798r58J076L54O512L725q55M192K82
6808d29822n847m485l031L55R475M660j047k718J393k582l543l349j97N280M167
6793d31291j825r248M992L363J99j217j36L192L22K867K172J878o06K138l009
6778d26209j595k413q48p55M439J0082j335m440L483K668k488m654q542m937J742
6763d35802N732k712j368j151Q913J776N763L409L721J206n509n996j973j3018
6749d37009p760p544j1112k421j640l558l664Q0P538N485j670K280L036p33K195
6734d56497N704P254L400n044k279R95k577j147M951P32J33k713K033j095j86
$$ plain form
6719 -446336 -434968 -435737 -442130 -449074 -449372 -443684 -430784 -430482 -434436 -435360 -444107 -444005 -441871 -439725 -431661
6704 -431661 -433174 -435392 -438489 -437653 -439847 -438586 -434898 -434355 -435328 -439776 -441321 -434583 -438337 -444402 -446824
6689 -446824 -445311 -446995 -442078 -428156 -423841 -428836 -432056 -440447 -443095 -441429 -436240 -433623 -430621 -426523
6675 -426523 -425446 -433722 -431473 -433885 -434212 -435599 -434508 -432213 -437150 -445051 -449149 -441520 -435499 -432105 -431121
6660 -431121 -435400 -441899 -435340 -432116 -432510 -441198 -449808 -447922 -446241 -445863 -444013 -437360 -439757 -438660 -436396
6645 -436396 -430841 -430756 -431363 -425561 -426557 -430706 -430803 -424654 -422034 -426362 -431203 -430962 -427907 -424957 -429826 -435762
6629 -435762 -438231 -430839 -421951 -414205 -416225 -426595 -435449 -435244 -428349 -422834 -424213 -427046 -432913 -432922 -424085
6614 -424085 -420383 -421455 -422874 -434330 -436694 -429972 -430263 -425561 -425915 -427924 -424341 -417264 -413548 -413311 -418330
$$ packed form
6719d46336J1368p69o393o944k98N688J2900L02l954r24q747J02K134K146Q064
6704d31661j513k218l097Q36k194J261L688N43r73m448j545O738l754o065k422
6689d46824J513j684M917J3922M315m995l220q391k648J666N189K617L002M098
6675d26523J077q276K249k412l27j387J091K295m937p901m098P629O021L394R84
6660d31121m279o499O559L224l94q688q610J886J681L78J850O653k397J097K264
6645d36396N555Q5o07N802r96m149r7O149K620m328m841K41L055K950m869n936
6629d35762k469P392Q888P746k020j0370q854K05O895N515j379k833n867rQ837
6614d24085L702j072j419j1456k364O722k91M702l54k009L583P077L716K37n019
$$ [...]
##END NTUPLES=NMR SPECTRUM
##END=
