##TITLE=Analysis number 328124
Compound Code tl 00421
Book Reference 510/46
Project Code adrs
Chemist Name jimp
##JCAMPDX= 6.0         $$ Bruker NMR JCAMP-DX V2.0
##DATA TYPE= NMR SPECTRUM
##DATA CLASS= NTUPLES
##ORIGIN= Bruker BioSpin GmbH
##OWNER= nmr
$$ XWIN-NMR		Version 3.5
$$ Fri May  4 13:31:20 2007 GMT Daylight Time (UT+1h)  MAYBRIDGE\nmr@NMR_250MHZ
##.OBSERVE FREQUENCY= 250.131544655141
##.OBSERVE NUCLEUS= ^1H
##.ACQUISITION MODE= SIMULTANEOUS (DQD)
##.ACQUISITION SCHEME= undefined
##.AVERAGES= 16
##.DIGITISER RES= 18
##SPECTROMETER/DATA SYSTEM= dpx250
##.PULSE SEQUENCE= zg30
##.SOLVENT NAME= CDCl3
##.SHIFT REFERENCE= (INTERNAL, CDCl3, 0, 16.522)
##AUDIT TRAIL= $$ (NUMBER, WHEN, WHO, WHERE, WHAT)
$$ ##TITLE= Audit trail, XWIN-NMR		Version 3.5
$$ ##JCAMPDX= 5.01
$$ ##ORIGIN= Bruker BioSpin GmbH
$$ ##OWNER= nmr
$$ C:\u/data/dgb/nmr/ADRS/410/pdata/1/auditp.txt
$$ ##AUDIT TRAIL=  $$ (NUMBER, WHEN, WHO, WHERE, WHAT)
(   1,<2007-05-04 13:30:58.96 +100>,<MAYBRIDGE\nmr>,<NMR_250MHZ>,
      <created by zg, POWCHK disabled, PULCHK disabled
       configuration hash MD5:
       76 6E 9A 78 1E 09 19 81 EC 84 63 8F B0 6A 59 2D
       data hash MD5: 64K
       EF A6 3B 05 CE CD A0 80 54 6B 0E 4A E1 A2 B3 AA>)
(   2,<2007-05-04 13:31:11.74 +100>,<MAYBRIDGE\nmr>,<NMR_250MHZ>,
      <Start of raw data processing
       ef LB = 0.3 FT_mod = 6 PKNL = 1 SI = 32K 
       data hash MD5: 32K
       0B 2D 71 95 03 7A 16 A3 98 DB 51 2F 8F 69 5B 91>)
(   3,<2007-05-04 13:31:13.32 +100>,<MAYBRIDGE\nmr>,<NMR_250MHZ>,
      <apk 
       data hash MD5: 32K
       B6 94 30 08 BD 06 42 70 4D D7 77 17 B9 74 87 4A>)
(   4,<2007-05-04 13:31:14.08 +100>,<MAYBRIDGE\nmr>,<NMR_250MHZ>,
      <abs ABSG = 5 
       data hash MD5: 32K
       C1 AE AA B2 DC 14 C0 3A 7E B6 69 DA 68 20 78 F1>)
$$ ##END=
$$ 
$$ hash MD5
$$ E7 55 F2 3B 98 C0 BF 81 6E B3 22 D4 0C 69 4B 49
##$RELAX= 
##$RELAX= 
##$RELAX= 
##$RELAX= 
##$RELAX= 
##$RELAX= 
##$RELAX= 
$$ Bruker specific parameters
$$ --------------------------
##$DU= <C:\u>
##$EXPNO= 410
##$NAME= <ADRS>
##$PROCNO= 1
##$TYPE= <nmr>
##$USER= <dgb>
##$AMP= (0..31)
100 100 100 100 100 100 100 100 100 100 100 100 100 100 100 100 100 100 
100 100 100 100 100 100 100 100 100 100 100 100 100 100 
##$AQSEQ= 0
##$AQ_mod= 3
##$AUNM= <au_zg>
##$AUTOPOS= <34 >
##$BF1= 250.13
##$BF2= 250.13
##$BF3= 250.13
##$BF4= 250.13
##$BF5= 500.13
##$BF6= 500.13
##$BF7= 500.13
##$BF8= 500.13
##$BYTORDA= 1
##$CFDGTYP= 0
##$CFRGTYP= 5
##$CHEMSTR= <none>
##$CNST= (0..31)
1 1 145 1 1 1 1 1 1 1 1 1 1 1 1 1 1 1 1 1 1 1 1 1 1 1 1 1 1 1 1 1 
##$CPDPRG= <>
##$CPDPRG1= <>
##$CPDPRG2= <>
##$CPDPRG3= <>
##$CPDPRG4= <mlev>
##$CPDPRG5= <mlev>
##$CPDPRG6= <mlev>
##$CPDPRG7= <mlev>
##$CPDPRG8= <mlev>
##$CPDPRGB= <>
##$CPDPRGT= <>
##$D= (0..31)
0 1 0 0 0 0 0 0 0 0.06 0 0 0 0 0 0 0.0002 0 0 0 0 0 0 0 0 0 0 0 0 0 0 
0 
##$DATE= 1178281857
##$DBL= (0..7)
120 120 120 120 120 120 120 120 
##$DBP= (0..7)
150 150 150 150 150 150 150 150 
##$DBP07= 0
##$DBPNAM0= <>
##$DBPNAM1= <>
$$ [...]
##$SUBNAM7= <"">
##$SUBNAM8= <"">
##$SUBNAM9= <"">
##$SW= 20.6930455092707
##$SWIBOX= (0..15)
0 0 3 0 0 0 0 0 0 0 0 0 0 0 0 0 
##$SW_h= 5175.983436853
##$TD= 65536
##$TD0= 1
##$TE= 683.16
##$TE2= 300
##$TE3= 300
##$TEG= 300
##$TL= (0..7)
0 120 120 120 120 120 120 120 
##$TP= (0..7)
150 150 150 150 150 150 150 150 
##$TP07= 0
##$TPNAME0= <>
##$TPNAME1= <>
##$TPNAME2= <>
##$TPNAME3= <>
##$TPNAME4= <>
##$TPNAME5= <>
##$TPNAME6= <>
##$TPNAME7= <>
##$TPOAL= (0..7)
0.5 0.5 0.5 0.5 0.5 0.5 0.5 0.5 
##$TPOFFS= (0..7)
0 0 0 0 0 0 0 0 
##$TUNHIN= 0
##$TUNHOUT= 0
##$TUNXOUT= 0
##$USERA1= <user>
##$USERA2= <user>
##$USERA3= <user>
##$USERA4= <user>
##$USERA5= <user>
##$V9= 5
##$VALIST= <valist>
##$VCLIST= <CCCCCCCCCCCCCCC>
##$VD= 0
##$VDLIST= <DDDDDDDDDDDDDDD>
##$VPLIST= <PPPPPPPPPPPPPPP>
##$VTLIST= <TTTTTTTTTTTTTTT>
##$WBST= 1024
##$WBSW= 4
##$XGAIN= (0..3)
0 0 0 0 
##$XL= 0
##$YL= 0
##$YMAX_a= 360157
##$YMIN_a= -303932
##$ZGOPTNS= <>
##$ZL1= 120
##$ZL2= 120
##$ZL3= 120
##$ZL4= 120
##$ABSF1= 16.522
##$ABSF2= -4.171173
##$ABSG= 5
##$ABSL= 3
##$ALPHA= 0
##$AQORDER= 0
##$ASSFAC= 0
##$ASSFACI= 0
##$ASSFACX= 0
##$ASSWID= 0
##$AUNMP= <proc_1d>
##$AZFE= 0.1
##$AZFW= 0.1
##$BCFW= 0
##$BC_mod= 0
##$BYTORDP= 0
##$COROFFS= 0
##$CY= 12.5
##$DATMOD= 1
##$DC= 0
##$DFILT= <>
##$DTYPP= 0
##$F1P= 14.0000005364418
##$F2P= -0.99999901652339
##$FCOR= 0.5
##$FTSIZE= 32768
##$FT_mod= 6
##$GAMMA= 0
##$GB= 0
##$INTBC= 1
##$INTSCL= 1
##$ISEN= 128
##$LB= 0.3
##$LEV0= 0
##$LPBIN= 0
##$MAXI= 10000
##$MC2= 0
##$MEAN= 0
##$ME_mod= 0
##$MI= 0
##$NCOEF= 0
##$NC_proc= -4
##$NLEV= 6
##$NOISF1= 0
##$NOISF2= 0
##$NSP= 0
##$NTH_PI= 0
##$NZP= 0
##$OFFSET= 16.522
##$PC= 1
##$PHC0= -49.72639
##$PHC1= 8.256518
##$PH_mod= 1
##$PKNL= yes
##$PPARMOD= 0
##$PSCAL= 4
##$PSIGN= 0
##$REVERSE= no
##$SF= 250.13
##$SI= 32768
##$SIGF1= 0
##$SIGF2= 0
##$SINO= 400
##$SIOLD= 32768
##$SREGLST= <1H.CDCl3>
##$SSB= 0
##$STSI= 32768
##$STSR= 0
##$SW_p= 5175.98343685301
##$SYMM= 0
##$S_DEV= 0
##$TDeff= 65536
##$TDoff= 0
##$TI= <Analysis number 999999
Compound Code 99
Book Reference 9
Project Code 9>
##$TILT= no
##$TM1= 0
##$TM2= 0
##$TOPLEV= 0
##$USERP1= <user>
##$USERP2= <user>
##$USERP3= <user>
##$USERP4= <user>
##$USERP5= <user>
##$WDW= 1
##$XDIM= 32768
##$YMAX_p= 488346624
##$YMIN_p= -347873
$$ End of Bruker specific parameters
$$ ---------------------------------
##NTUPLES= NMR SPECTRUM
##VAR_NAME=  FREQUENCY,     SPECTRUM/REAL,   SPECTRUM/IMAG
##SYMBOL=    X,             R,               I
##VAR_TYPE=  INDEPENDENT,   DEPENDENT,       DEPENDENT
##VAR_FORM=  AFFN,          ASDF,            ASDF
##VAR_DIM=   32768,         32768,           32768
##UNITS=     HZ,            ARBITRARY UNITS, ARBITRARY UNITS
##FACTOR=    0.157963299565203, 1,           1
##FIRST=     4132.6476996994, 0,             0
##LAST=      -1043.33573715361, 0,           0
##MIN=       -1043.33573715361, -347873,     0
##MAX=       4132.6476996994, 488346624,     0
$$ Real data points
##PAGE= N=1
##DATA TABLE= (X++(R..R)), XYDATA
$$ [...]
24703b6475r5067N1732N701M8968k4432J1028J2079K891p2662j4826J67873p472
24691E9338j49951N440J13203M1252j5458O6174o5890m0708j6930K8201o3042
24680c8371R405J36899K1987q4739M8232N2634l1240L7064K5906m6643q2481n6600
24668g947J9951N2324L80K6183r7680j14334P8766k8638L8122l9290l1547K4453
24656g9257N9261J9978J665J996J1007o340J06178K5251J9215l5802q8129L0243
24644F5266n405J03734L3744k2598j5936k5743L6499n468k7730l8173n396j335
24632I1459p9241k3775M7344L0188l536K5058m8346l1444k9654L5182K0230N7150
24620I0615R4598L4335j63044n6381L8041J5266k4684r9679l1304N6482j7397
$$ y = [-26475, -121542, -69810, -64109, -15141, -39573, -28545, -16466, -13575, -86237, -101063, 66810, 59338, -90613, -85173, 28030, 69282, 53824, 119998, 54108, 13400, -3530, 24671, -38371, -28966, 107933, 129920, 45181, 93413, 146047, 114807, 151871, 177777, 131134, 48653, -7947, 12004, 64328, 64708, 90891, -6789, -121123, -42357, -70995, -32873, -72163, -103710, -79257, -19996, -18, 1647, 3643, 14650, 8310, 114488, 139739, 158954, 123152, 35023, 65266, 59861, 163595, 197339, 174741, 158805, 133062, 169561, 164093, 136363, 98190, 92794, 91459, 12218, -11557, 35787, 65975, 62439, 87497, 39151, 7707, -21947, 13235, 33465, 90615, 185213, 219548, 56504, 123, 38164, 53430, 28746, -70933, -102237, -45755, -63152]
24609f3152M9140n5547n932P2606N8895M1322L6545l3023p0859o0417j2111m6994
24597h9527j5036M5449O0155p8162r1959O244O9287j1402o0304k4480J4559O0249
24585a14927N7847Q603k6690M7300L2794K9407J6707m2263L4377R220m7429m3980
24573c9034k5365N0171K194l0386N3056j5305m2470O881J4208k0792o5868J5010
24561i7700K1500J06865n4231J8840P1650j05069o2918J953Q6845O1861p2285
24550b2689l4022M4017r70J6453k7259m9389M5852R688l2028j6447m0165N5187
24538e1772N0733l2762o425K6617Q328k3572P316K045l4485m4096K0135K4263
24526e3675K9651L0205J392L8832j7075K8193L125n4064o1006p1419n0090M5709
$$ y = [-63152, -14012, -69559, -75491, -2885, 56010, 97332, 133877, 100854, 29995, -30422, -42533, -89527, -104563, -59114, 1041, -77121, -169080, -162836, -93549, -104951, -165255, -189735, -175176, -114927, -57080, -48477, -75167, -27867, 4927, 34334, 51041, 8778, 43155, 52375, 4946, -39034, -64399, -14228, -12034, -42420, 10636, -4669, -47139, -40258, -26050, -46842, -112710, -97700, -76200, 30665, -23566, -4726, 66924, -38145, -101063, -99110, -12265, 49596, -22689, -56711, -12694, -13664, 2789, -24470, -73859, -28007, -18319, -50347, -66794, -106959, -51772, -1039, -33801, -40226, -13609, -5281, -28853, -21537, -19492, -53977, -98073, -77938, -53675, -24024, 6181, 7573, 46405, 29330, 57523, 60648, 6584, -54422, -125841, -175931, -130222]
24514a30222P6500J9624R714J7233M0410k8175R846l925M5695n4641l2722o9141
24502i9804q7107l9148O5110J53222P965m3300N8389K8764M9738l6201p0730K6930
24490A3828m3999L1529l0228N4889k9624L4342P6562p0952J0375r236r1724o4939
24478a19177Q747R4057J28489k3261j8612k6519j6795o737K8071l1931l8347r5327
24466a17342k161J6509J05402J2617k8173m1648K9954k5346N9164R802K4443P2351
24454A15572k8162o3585q7703o1521j1527J3820M0713O2415N2329k5319L0527
24443C7559K2825m5613J14864m55o7811Q754M5255N0391j14873o3002k099n4579
24431f8784L7024N2593L930O3733J3801o4830o4150L5471K4336p4762J7649K4204
$$ y = [-130222, -53722, -34098, -24384, -7151, 33259, 5084, 14930, 11005, 56700, 2059, -30663, -99804, -186911, -226059, -160949, -7727, 238, -43062, 15327, 44091, 93829, 57628, -13102, 13828, -30171, 1358, -28870, 26019, -3605, 30737, 107299, 36347, 46722, 37486, -54238, -119177, -110430, -16373, 112116, 88855, 70243, 43724, 26929, 20192, 48263, 16332, -22015, -117342, -119503, -102994, 2408, 15025, -13148, -54796, -24842, -50188, 8976, 18778, 43221, 115572, 87410, 23825, -63878, -125399, -136926, -123106, -82393, -19978, 32351, 7032, 37559, 60384, 14771, 129635, 129180, 61369, 70123, 115378, 165769, 50896, -12106, -14205, -68784, -31760, 20833, 24763, 88496, 102297, 37467, -26683, 8788, 33124, -41638, -23989, 215]
24419B15L4018LJ2483o2039o9480K3123j94O9706J7202o0761K617k8060p1776
24406a32943k8940J42586L6152k5144O6008k6985n7998L0586n470n3166O8277
24395A2963j6900l2741K1123K4688m6808k2813K9605R635M3004n7497k1136J00128
24383D3251l1916r0228o3491R6732P1332k8974J0646o362P6770L501m19J070k2111
24370E9801m8144L788l9235R5217K4975k2771n9018L3725n1710r5571Q5728Q5148
24358G1933M0622n0885m7953l7433n9728R5104M8891K9881l5919n7534j2726P578
24346h169k2694j5038L9516K5876L9942j6689o435m0672O7276L8357j698p2649
24334B6923m1010L075N7489j00740n8530L1672L5823L7894k8922J98L6731n9237
$$ y = [215, 34233, 34236, 46719, -15320, -84800, -61677, -61871, 7835, 25037, -35724, -33107, -61167, -132943, -161883, -19297, 16855, -8289, 57719, 30734, -27264, 3322, -2148, -55314, 12963, -3937, -36678, -15555, 9133, -37675, -60488, -30883, -21248, 21756, -35741, -56877, 43251, 11335, -78893, -142384, -45652, 25680, -3294, 7352, 990, 77760, 81261, 80842, 81912, 59801, 11657, 15445, -23790, 71427, 96402, 73631, 14613, 48338, -3372, -98943, -13215, 71933, 112555, 61670, 13717, -23716, -83444, 11660, 60551, 90432, 54513, -3021, -15747, -8169, -30863, -45901, -6385, 19491, 59433, 42744, 36309, -4363, 62913, 101270, 99572, 26923, -14087, -11012, 46477, -54263, -112793, -81121, -45298, -7404, -36326, -36128, 603, -58634]
24322e8634J1854m2015n2393R4472Q7515M419q0590p3495k2182L4163P9003j7820
24310c5703L9864J5105K4184k487K1213L137q5192K828O2379J5840k1829n475
24298C3864N1746m6948n858m229j2309L2459J1028q161P589m8060J6765m9077
24286b1191r4343k2689L8004l509M3574j9545m5843P0015M5306J0600k5368p3110
24274i8099K2065l8108K5073m730J7129J09488N6089o8055K1670m8765k1633l8315
24262f6191M9310n756l3879P032M3597N3000Q8814k1275q5035n825K009o9670
24250d3869k4998J4101L5943N9347o1137J47j3548M7807n1499r937J2648n1613
24238h6608q858R7990P635K0411K815R04q639n4217J1160N8867L671p1633k7346
$$ y = [-58634, -46780, -88795, -141188, -46716, 40799, 45218, -35372, -108867, -131049, -96886, -17883, -35703, 4161, 19266, 43450, 40963, 62176, 65313, -19879, -17051, 45328, 61168, 39339, 33864, 85610, 38662, 32804, 28575, 16266, 48725, 59753, 51592, 59181, 11121, 27886, -21191, -115534, -138223, -100219, -103728, -60154, -79699, -125542, -55527, -10221, 379, -24989, -98099, -76034, -114142, -89069, -93799, -76670, 32818, 88907, 20852, 42522, -6243, -27876, -66191, -16881, -22637, -56516, -49484, -5887, 47113, 135927, 114652, 29617, 23792, 25801, -43869, -68867, -54766, -18823, 40524, -20613, -20466, -34014, 13793, -37706, -47643, -34995, -86608, -95466, 2524, 10159, 30570, 33385, 34289, 25650, -28567, -17407, 41460, 45131, -26502, -53848]
24225e3848P6903K21K627M5633n916L213P261j20893M2641l9383N0849L1221l2605
24212G924j1396r787M8390Q495n8702m2661r103J950J1236O2229M8226l7423j9983
24199f05N0684J1141l9370o6584K3130L8816K7590r345j5920m388K3054L9158
24187G7361j1182j857j1248M0835k1468j2844q2138o5896M3448N5737K326q427
24175D647P578J27582K7234m380q5562k5049q8038o598M7506K4007L424o5084
24163c2733q9805M823J3771L5040J00682K0493K1444M1249l6474p8993K6796J3948
24151D0241j3407n4949j0743n829L359j2474N5476J3040p3785m548M3950L6059
24139A6390K6114k7821j12276m0634m156P8749N2242K4188m5192L4612P5894P2788
$$ y = [-53848, 23055, 23276, 25903, 71536, 65620, 68833, 76094, -44799, -2158, -41541, 9308, 40529, 7924, -3472, -13259, 35131, 43626, -15076, -57737, -66840, -64890, -53654, 8575, 56801, 19378, -605, 50079, 61220, 21850, -44734, -21604, 17212, 44802, 35457, 19537, 15149, 38203, 77361, 66179, 64322, 53074, 93909, 72441, 59597, -22541, -88437, -44989, 10748, 13074, 4647, 12225, 139807, 167041, 162661, 77099, 52050, -35988, -42586, 4920, 28927, 32351, -32733, -122538, -117715, -103944, -68904, 31778, 52271, 73715, 114964, 78490, -503, 26293, 40241, 26834, -28115, -38858, -44687, -41328, -53802, 1674, 14714, -59071, -63619, -19669, 16390, 42504, 14683, -97593, -138227, -142383, -63634, -11392, 12796, -32396, 2216, 78110, 150898]
24127A50898N2876J5974J4649m0927p1453j06753o5640m2956m6216r2217Q7180
24116a44585R5597Q27k0627j4893N7502M0422k4841m1142P4852P8363l6273j18611
24104e3409J5395p140l4538M7043M5784P1587K6996J3984k360J9086K5122m4578
24092A22972P908o2938J7729P8047J0638N394j86397j21044K4798J08761L8910
24081D4778P6313k3648q1463n7060j4736l4356l529j2892M7247L3095J5209k9490
24069d0532o9460J5988K3852o7258J1769P4685K5478j4428k7576n4698o2056K8929
24057a55307N0867Q3423k8250j3477P6692P3740j0002Q303K6874l6996n3671l1780
24045i584O3247Q6479q0074p6517l7688L2571O366K1173R2236L9114m9074J6455
$$ y = [150898, 203774, 219748, 234397, 193470, 122017, 15264, -50376, -93332, -139548, -231765, -144585, -48988, -48161, -68788, -83681, -26179, 14243, -10598, -51740, 23112, 101475, 65202, -53409, -38014, -45154, -79692, -32649, 13135, 84722, 111718, 125702, 123342, 142428, 167550, 122972, 130880, 67942, 85671, 163718, 174356, 179750, -6647, -127691, -102893, 5868, 44778, 121091, 97443, 15980, -41080, -55816, -90172, -93701, -106593, -59346, -26251, -11042, -40532, -109992, -94004, -70152, -137410, -125641, -50956, -25478, -39906, -67482, -122180, -184236, -155307, -104440, -21017, -49267, -62744, 13948, 87688, 77686, 85989, 112863, 75867, 22196, -9584, 53663, 140142, 60068, -16449, -54137, -21566, -15200, 5973, 98209, 137323, 88249, 104704]
24033A04704p790K1031j8422o7337J17027P0255j12036n3704k4933J2082j04564
24022f3687j5710K7725m6107K1219r829N1429Q4992K1704o1498m4841l5338j1018
24010h0959Q9752J8226j7619k993j3587l4786j20854j5678K3407R0355M243j1881
23998g2374m0705M9394M5930m4188J4542P0606j05498o1073q3190K9842P8962
23987a17752Q2083J0674k7596M7977J853M9559m696j3826p1087o3482J42510M5047
23975H1264m7318l0383j49238k3023Q7679J9454K3183j412Q873k1247N3617L9392
23963D0841J9900r0165L8546J0415p4730J9309o301l1985l741k7827P087P4420
23951b4231j2521j1842o4538k2940J09789m830n1754l2180O1261M8558M5933l0025
$$ y = [104704, 96914, 117945, 99523, 32186, 149213, 219468, 107432, 53728, 28795, 40877, -63687, -79397, -51672, -97779, -76560, -86389, -34960, 50032, 71736, 10238, -34603, -69941, -80959, 8793, 27019, 9400, 6407, -7180, -41966, -162820, -178498, -155091, -64736, -60493, -72374, -113079, -63685, -17755, -61943, -47401, 23205, -82293, -143366, -226556, -196714, -117752, -35669, -24995, -52591, -4614, -2761, 46798, 42102, 28276, -42811, -106293, 36217, 81264, 33946, 3563, -145675, -168698, -81019, -61565, -38382, -39794, -30921, -52168, 1449, 40841, 60741, -29424, 9122, 19537, -55193, -35884, -42185, -74170, -77911, -105738, -98651, -24231, -36752, -48594, -113132, -136072, -26283, -31113, -82867, -115047, -53786, -5228, 40705, 10680]
23939A0680R558j0232m1611l252j2630M9592K5799L5161N801n190k6155p4268
23927c6747q4393N0035J769O5831M333n1411P23L1471N7657j0787N3171M9648
23915A31300m4696N4398N7475K432r4295m3467K7982o9524n2052o0456M2157K3943
23903b4803K6779K1795m7452k5885r435k3364k2940R6537J14589j8011n9150m7682
23891a9022N2770N3132k2301j6146n9839J4541j3800N5562M3857K5237m216j4848
23879I4927J8509L2335Q8505o747q9853o8724n5884K1998j0021n0129k2866l2835
23867h0785Q8189L8268R876n8062k099n548k8880J2219M9540j136l8418o6757
23855h3593o3893J9996M0109J5583J14638O7451J3036M9646r3138l6945J01351
$$ y = [10680, 20238, 10006, -31605, -34857, -47487, 2105, 27904, 63065, 68866, 63676, 37521, -36747, -121140, -71105, -69336, -3505, 828, -50583, -49860, -18389, 39268, 28481, 81652, 131300, 86604, 141002, 198477, 200909, 106614, 63147, 91129, 21605, -30447, -90903, -48746, -24803, 1976, 23771, -23681, -49566, -59001, -82365, -105305, -8768, 105821, 87810, 28660, -19022, 33748, 86880, 64579, 48433, -11406, 3135, -10665, 44897, 88754, 113991, 109775, 94927, 113436, 145771, 234276, 227529, 137676, 68952, 13068, 35066, 25045, -25084, -47950, -80785, 7404, 45672, 55548, -2514, -4613, -10161, -39041, -26822, 22718, 21582, -16836, -83593, -147486, -127490, -87381, -71798, 42840, 110291, 123327, 172973, 79835, 42890, 144241]
23844A44241K7177n3578j1154r127j5184m0122J8928O7965k0914L740M8826j24194
23832C6604n8516j4049m9113l3271N8401Q2002k1835j9142J4711k1247j3818k1369
23820f0642j7164k6866l451k9219l4001J848Q8850M8229M7448J9976Q511o5732
23808b2213M145l0991o8699k916j7352R0480N7922N1012m1527j3145K0882n019
23796B2579J4542R57l4407n3954p2681j1562L812M1142N6069N9003O880O119k6527
23783A1972o4042k355O9883n7371n0956j6797J389M1467k881R4038R9633p2798
23771E1182p0019K4644j9320O1639Q685p112j0420q5058M2781L9387m1688k8626
23759c3925L8560K3948j7015L129J9319p617p0954l8546N9143O8579k2959N3854
$$ y = [144241, 171418, 117840, 106686, 97559, 82375, 42253, 61181, 129146, 108232, 111972, 160798, 36604, -21912, -35961, -85074, -118345, -59944, 22058, 223, -18919, -4208, -25455, -39273, -60642, -77806, -104672, -108123, -137342, -171343, -169495, -80645, -32416, 15032, 35008, 43519, -22213, -18068, -49059, -117758, -120674, -138026, -47546, 10376, 61388, 19861, 6716, 27598, 22579, 37121, 38078, 3671, -50283, -122964, -134526, -130714, -89572, -33503, 25500, 32380, 38499, 11972, -52070, -54425, 15458, -41913, -92869, -109666, -108277, -66810, -69691, 24347, 123980, 51182, -18837, 5807, -13513, 48126, 56811, 49699, 39279, -45779, -2998, 36389, -5299, -33925, 4635, 28583, 11568, 14697, 34016, 26399, -44555, -83101, -23958, 44621, 21662, 75516]
23747G5516J2573m7125l4861n4294j03985J0656P2919O1979k6805N8790N0583
23736G5946O7334k3994L3329k4391k6207l8257o3698k0594p1720m9450J517J5261
23724a24924J0612M6235M9111M0860o6422n2137N7610P6221J1321n4285j08124
23713a13922K7162P1650K7932l0524J2064K2058j9287M3707m6209P0447j6622
23702D8456K964J5801j051l7154n7550L3516l189q9132K1392Q7729O096o778K0414
23689D1514J7547l5104j0922M0633k7572j50001m4274m384K0482Q516J1873P0189
23677f1503P7248J4922k7809M9756K5660M1432m8940j3518L3925L7529L6399p7477
23665H7624N201J2112m4727J6753k0212o549o5756L4406M9425p394l3166M2817
$$ y = [75516, 88089, 40964, 6103, -48191, -152176, -141520, -68601, -6622, -33427, 25363, 75946, 143280, 119286, 152615, 128224, 102017, 63760, 62, -20532, -92252, -141702, -140185, -124924, -114312, -68077, -18966, 21894, -44528, -96665, -39055, 37166, 48487, -5798, -113922, -86760, -15110, 12822, -17702, -5638, 16420, -2867, 40840, -5369, 65078, 48456, 51420, 67221, 66170, 29016, -28534, 4982, 1793, -87339, -65947, 21782, 27878, 21100, 41514, 59061, 23957, 13035, 53668, 26096, -123905, -168179, -172563, -152081, -143565, -131692, -61503, 15745, 30667, 2858, 52614, 78274, 119706, 70766, 57248, 91173, 128702, 165101, 87624, 92825, 104937, 60210, 76963, 56751, 50202, -15554, 18852, 68277, 60883, 27717, 70534]
23653G0534N411J5677p877j741j7451k3935o6965L6744L3008N1455J5107J9156
23641A29123r1234l6832p3792J1198M5194P515l2172l3915J0851q10R3764M3140
23629G2030K6171m688m7579K5023K2256k5389l5513q6830l1029q508o987Q4556
23617a6487O3828L57L8792j8015l8709M4843N6888j0025p3249p4390n1830j6859
23605i4856N0058R0792O2271m8483L278j1837K6311n9798o8313l1153j9658k6950
23593a28338J5035K1686K2140M3650m831R659L0116j2048l9255O7569N2028k2748
23581E4663j3090m5642k9728k6523j548L9915o5184L698P2744L7214l6255l5368
23569d5104k8957K1216K6738J7289P2455M6707n5352m3098J3075q32J4618Q543
$$ y = [70534, 75945, 91622, 83745, 82004, 64553, 40618, -26347, 10397, 43405, 94860, 109967, 129123, 37889, 1057, -72735, -61537, -16343, -8828, -41000, -74915, -64064, -64874, 28890, 72030, 98201, 93513, 45934, 70957, 93213, 67824, 32311, -54519, -85548, -94056, -101043, -16487, 47341, 47698, 86490, 68475, 29766, 74609, 131497, 121472, 48223, -26167, -77997, -94856, -44798, 45994, 108265, 59782, 63060, 51223, 77534, 17736, -50577, -81730, -101388, -128338, -113303, -91617, -69477, -25827, -30658, -20999, 9117, -2931, -42186, 25383, 77411, 54663, 41573, -4069, -33797, -60320, -61868, -21953, -87137, -83439, -10695, 26519, -9736, -45104, -74061, -52845, -26107, -8818, 63637, 110344, 54992, 11894, 24969, 24137, 38755, 47298]
23557D7298N5293k9556J0654Q7154p4600p2668J8743j125n8660n1556O0376O8781
23545F0134L9326M868l0939p924L1472k0601j06021m7420K94J17031R050M6868
23533I6138M2765l9911j08933p6366j34543O162J12932O1842N9698Q7931J3599
23522A21314L0823o2037j29622j6176k6583O4390j9136p1347L7891M9706K8046
23511G269K6645o806K534O8028o2765k2768m4599n0482J3177O5706j9441n9488
23499h2990j2414J11764Q1336o248P818J7466p1995l2847R974l9016J2810O6421
23487F2079J371l4425m6109p002k3666M6504J0959o752j3070n185j8359J6848
23475a6807L2683K3006O4663J7382q7543k2369m8171p4919q5346R7101k5042L1066
$$ y = [47298, 102591, 73035, 83689, 170843, 96243, 23575, 42318, 41193, -17467, -69023, -8647, 60134, 99460, 104328, 73389, 65465, 96937, 76336, -29685, -77105, -76811, 40220, 49270, 96138, 138903, 98992, -9941, -86307, -220850, -214688, -101756, -39914, 19784, 107715, 121314, 152137, 90100, -39522, -55698, -82281, -17891, -37027, -108374, -70483, -20777, 7269, 33914, 27108, 29642, 97670, 34905, 12137, -32462, -82944, -69767, -4061, -23502, -82990, -95404, 16360, 97696, 91448, 99266, 116732, 44737, 11890, 21864, -17152, -4342, 62079, 63450, 29025, -17084, -24086, -47752, -1248, 9711, 2959, -10111, -15296, -33655, -16807, 15876, 38882, 103545, 120927, 33384, 11015, -37156, -112075, -197421, -100320, -125362, -94296]
23463i4296N2872j9618K520j988l5555k611O2514l5574o7785j5379r592Q1453
23451h3039P7950l5777l2418j8735M050J9437L7665m7268n5496l4212P317M7652
23439a12874Q621O9137J600m6780n5345Q455O4471P3111N0965P439L3372O924
23427A09096j43958J4872Q1768r643K9923j2778j1403J7824o9097l7322O1178
23416C0460m7548j2156m0226K6254J4293O7916J18350k6150r2705L8584m9122
23405B7950m2914K56l4256k4709R0344P8894j19756o1274J4489L6565m0054Q4560
23393A0095N7630K4411Q587J9512R90P643n5249k392l1439r1686N3498R5060L1083
23380A27743r2403l2462k5899P6831p085J9149R229M9097n8494l6025M1862l6283
$$ y = [-94296, -41424, -61042, -58522, -60510, -96065, -98676, -36162, -71736, -139521, -154900, -164492, -83039, -5089, -40866, -73284, -92019, -87969, -68532, -30867, -78135, -133631, -167843, -160526, -112874, -104253, -35116, -33516, -80296, -135641, -127186, -62715, 10396, 61361, 68800, 102172, 109096, -34862, -19990, 61778, 52135, 82058, 69280, 57877, 75701, 6604, -30718, 30460, -17088, -29244, -69470, -43216, -28923, 38993, 157343, 131193, 38488, 77072, 27950, -14964, -14708, -48964, -73673, 16671, 95565, -24191, -85465, -70976, -34411, -74465, 10095, 67725, 92136, 100723, 120235, 121225, 128868, 73619, 71227, 39788, -51898, 1600, 96660, 127743, 35340, 2878, -23021, 53810, 46725, 65874, 75103, 124200, 65706, 29681, 71543, 35260]
23368C5260k8325j7630M6223j1628K8857Q0348j8479q005O2784K3106n0092n8780
23356H3639m5609J4479j3469J4314k0002m1088Q02k4020o9293K6219J39861l0588
23344C5245K6096j1160o9205k7153L5196J3121p4845q02o525k4739n4407L569
23332a55609P5571N4034j7817J387L5212N050n1876N7592O7390j19208m3922M6687
23320d5509J356p8580l6004J8574K4501Q489K5802O096Q3898k9629k6230m8125
23308i5361n5912k5312J37639J75954n1136r3450k3596K0796J0347k6007J8539
23297g499J8934j7481l289l2619n3004K9399Q7144K8598p9077m5917K8286M1680
23285d845K6981L8834k582k5481R15j1005k3080Q5656Q4496m0826m7573r495o8078
$$ y = [35260, 6935, -10695, 35528, 23900, 52757, 133105, 114626, 106621, 169405, 192511, 142419, 83639, 38030, 52509, 39040, 53354, 33352, -7736, -6934, -30954, -100247, -74028, 65833, 35245, 61341, 50181, -19024, -46177, -10981, 2140, -72705, -73507, -80032, -104771, -159178, -155609, -80038, -26004, -43821, -42434, -7222, -2172, -54048, 3544, 70934, -48274, -92196, -45509, -44153, -122733, -158737, -140163, -115662, -107173, -81371, -75275, 8623, -21006, -47236, -95361, -151273, -176585, -38946, 137008, 85872, -7578, -31174, -10378, -31, -26038, -7499, 11435, -6046, -9335, -41954, -94958, -65559, 21585, 50183, -28894, -74811, -46525, -4845, 22136, 60970, 58388, 32907, 33822, 22817, -263, 85393, 169889, 129063, 81490, 71995, 3917]
23272C917m0528q015M9947L7985J0261j1622o4093n3564j8157j794J145j724R2369
23259c873O1039l4450J466q6434L1346L3979o7258J5583M0953K917l4498N1422
23247A2192Q9380j37644j37600j04P0701K4873k9163P6174O9236k6513m112p2917
23235f5497j9404n2499L6877K5044K4540l9601o2384n7407J19595N3960M5865
23224I089r9351n4539Q3799J9624j6869L8847R8206J2817q8362Q632O077k4954
23212f984n1988J0751j44732q0197Q4071J07019Q234j9298L9317o3367m5148L2490
23200a29832M645m2340O5786j9945j9881R0191J51926n5990p3354l3459l8986
23189a01239O933N1783O2216m0512P342j556J8114L0090o1877k7543M7671K5364
$$ y = [3917, -36611, -44626, 5321, 43306, 53567, 41945, -22148, -75712, -93869, -95663, -94518, -96242, -3873, 57166, 22716, 24182, -62252, -30906, 3073, -64185, -48602, -7649, -4732, -39230, 12192, 101572, -36072, -173672, -173776, -103075, -78202, -107365, -31191, 38045, 11532, 7420, -65497, -84901, -137400, -100523, -75479, -50939, -90540, -152924, -210331, -90736, -36776, 9089, -90262, -144801, -61002, -41378, -58247, -19400, 78806, 91623, 3261, 11893, 17970, -6984, -58972, -48221, -192953, -273150, -189079, -82060, -73826, -93124, -53807, -117174, -162322, -129832, -125187, -167527, -101741, -121686, -141567, -51376, 100550, 44560, -28794, -62253, -101239, -94306, -42523, 19693, -20819, -13477, -15033, 3081, 33171, -28706, -56249, -8578, 16786]
23177A6786K3853R0412N4832j19699m2210J16769L760o2996j13796k9916J07842
23166D5637Q573r149j5087K9334j0222k7403M4802L5872l3264q3386l6766j8801
23154f9860K8200J0982K997M3899O8495J931N263j08953o4605k6872K2394L6499
23142d9630L3124K4525k3745k8417j4006M1701k0939m5060j9353J03179P5372
23131G6751N5584k1007m1584k1479j0942n9946K878L8798M582J8012P134m256
23119D4525L6044l6729J6521K0315r6981o8267L1872P7075k2353k2026N7438q541
23107B8893j29193l4205P6311K5995P9201l6244k8920R505P8868o977j21469M1392
23095a6843j4706Q9585L1914Q4828Q326l2458p7449n7005M4172j2058r6619K0972
$$ y = [16786, 40639, 131051, 185883, 66184, 23974, 140743, 144503, 81507, -32289, -62205, 45637, 54210, 45061, 29974, 59308, 49086, 21683, 66485, 102357, 69093, -14293, -51059, -69860, -41660, -30678, -27681, 16218, 84713, 86644, 91907, -17046, -81651, -108523, -86129, -49630, -16506, 8019, -15726, -44143, -58149, -16448, -37387, -82447, -101800, 1379, 76751, 132335, 111328, 69744, 48265, 37323, -22623, -19745, 19053, 23635, 41647, 48781, 44525, 80569, 43840, 60361, 80676, -16305, -84572, -52700, 24375, 2022, -20004, 37434, 28893, -100300, -134505, -58194, -32199, 47002, 10758, -18162, -8657, 70211, 63234, -58235, -16843, -31549, 58036, 89950, 174778, 183104, 150646, 73197, 16192, 60364, 48306, -48313, -27341]
23083b7341N0986N9895J628r218q9001m5552J9931j8525r074J900N9298L6591
23071C1518N8363J9407k2413M2176j03358q7024J7686J36199o541P097l8101K4789
23059G9798r253L2105j7426r9939l9251k1600n155J586M1575K8844p8312j5734
23047a02762N4261M9421j15872l4370P3112J19742q4543j31601J6885J04560L3966
23036a7201L9752M3400l2833L0397k0315p1775J2175R1431Q53k5322n9755n4945
23024f4138L855K9811J4753k5051n4886j03644Q1935P9716P9723R04m8729J4010
23012H259Q2723n2698J5915J03023R914j41821m6332K1384K0432j2242J2223k0997
23000b17n1545j7193N1649k5823m7683Q6889J6441k8953j1276n7142L6083L1974
$$ y = [-27341, 23645, 83540, 85168, 75950, -13051, -58603, -38672, -57197, -66271, -64371, -5073, 31518, 89881, 109288, 86875, 129051, 25693, -61331, -43645, 92554, 86013, 93110, 55009, 79798, 70545, 102650, 85224, -14715, -53966, -75566, -80721, -79135, -37560, -8716, -87028, -102762, -48501, 920, -114952, -149322, -76210, 43532, -41011, -172612, -155727, -51167, -17201, 22551, 65951, 33118, 63515, 43200, -28575, -16400, 75031, 75884, 50562, -9193, -64138, -60283, -30472, -15719, -40770, -95656, -199300, -117365, -37649, 42074, 42978, -5751, 8259, 90982, 38284, 54199, 157222, 167136, 25315, -21017, 367, 20799, 8557, 20780, -217, -51762, -68955, -17306, -43129, -90812, -3923, 12518, -16435, -27711, -84853, -48770, -16796]
22988a6796K3845L2322q922J9024J5895p9497p9638Q903K5853J01445q473m4296
22976a0335m87M3359N2984O6721m4461o9457m1663n4302J05362L8508k6533k2311
22964C7385m010J52505j02521j09829l3387L5948n0733K7561m758N1425O3304
22953F2890M4309L6078o0640n811K2125k9483p338p9139m8985m480Q1972q832
22941B666q2037j42576L8915J07363Q3290k2675j26937j5995M1259m3624K2591
22930a37760l5487j7403M6355P4059J58415J8326n7634n2849R2685o3849L2561
22919E7419N0594n8939l2316p784K6404j2204k205M0610M8682K4501l2828O091
22907A08025j759l7282n4084o8264K2519P2365j25099o8382k3128L3484P1094
$$ y = [-16796, 7049, 39371, 30449, 49473, 65368, -14129, -93767, -84864, -59011, 42434, 33961, -10335, -10822, 32537, 85521, 152242, 107781, 38324, -3339, -57641, 47721, 86229, 59696, 37385, 33375, 185880, 83359, -26470, -59857, -23909, -74642, -47081, -51839, -414, 62890, 107199, 143277, 82637, 76826, 98951, 69468, 62130, -17009, -65994, -70474, 11498, 2666, -79371, -221947, -183032, -75669, 7621, -15054, -141991, -157986, -116727, -160351, -137760, -173247, -190650, -144295, -70236, 88179, 106505, 48871, -3978, 88707, 24858, 57419, 108013, 49074, 16758, 8974, 35378, 23174, 20969, 61579, 110261, 134762, 101934, 108025, 106266, 68984, 14900, -53364, -30845, 41520, -83579, -151961, -175089, -141605, -70511]
22896g0511P6545m0286J511O0711M7372l6935m1799n3957k0308K088J05103k3258
22884F276m7454j5418N4423L5173N5943J0725q0414j0570m926J7653O5558J6819
22872A03788K7355m6925r5683J5882J5047K7060l8451o4705k122O8234R5994R4490
22860A99964m4268q8331q614J2562j176r9090m9719K296K3948J6031M7571o898
22848D276N788k8734J06221P475j36590k6828P5455k1566m0731k4991L1175K0578
22836b8472K5152r078m7008m0313J16560Q6533o9059k5276j49335o498O6391N4887
22824b5516L2403j149j6101L1823j2870p9450J0296K6447L5441n310l6244k7077
22812f7307l9330o5356P809J30800J25952R9p3195J1337P1021m2695L4903P6466
$$ y = [-70511, 6034, -34252, -32741, 27970, 75342, 38407, -3392, -57349, -77657, -75569, 29534, 6276, -41178, -56596, -2173, 33000, 88943, 99668, 19254, 8684, 3758, 21411, 86969, 103788, 131143, 84218, -11465, 4417, 19464, 46524, 8073, -56632, -58754, 9480, 105474, 199964, 155696, 67365, 58751, 71313, 70137, -28953, -78672, -76376, -52428, -36397, 11174, 4276, 10064, -18670, 87551, 95026, -41564, -68392, 7063, -14503, -55234, -80225, -49050, -28472, -3320, -12398, -59406, -99719, 16841, 103374, 34315, 9039, -140296, -146794, -80403, -25516, 6887, 5738, -10363, 21460, 8590, -70860, -60564, -34117, 1324, -3986, -40230, -67307, -106637, -171993, -164184, -33384, 92568, 92667, 19472, 30809, 101830, 59135, 94038, 170504]
22800A70504n4345r8745j23528j0298K7958m6668N6171P6971N3753l8103m0214
22789b6544j1095M647l2876N8674K5625p0594K2265L0897N4796p9837o5365j25
22777h9532r23P6597K5837o1051m330l688L6893l9898K9911M723J8964p8995O1000
22764b4492M1705r469L5280m3811n7556o3607L1647j031m513L9918l5241l2617
22752a23787O5647j0995j7690P5610J15996J2142r4613q1187J5840k6952l7464
22741a07453n1621J4764R8617m8912k9545m8710M9151O2954M5063m178L529L003
22729a3338n9296j848J80685l4727j04691k0488O9845J9942O5991R379k5684m9746
22717C6024K4244O9624m8103r2447q0700L0247L6908j058j9522j8675P161K0912
$$ y = [170504, 116159, 17414, -106114, -116412, -88454, -135122, -78951, -1980, 51773, 13670, -26544, -37639, -32992, -65868, -7194, 18431, -52163, -29898, 999, 55795, -24042, -89407, -89532, -90455, -13858, 11979, -49072, -53402, -57090, -20197, -60095, -30184, -25461, -6497, -85492, -24492, 17213, 7744, 43024, -787, -58343, -121950, -90303, -91334, -95847, -55929, -91170, -123787, -58140, -69135, -86825, -11215, 104781, 116923, 22310, -58877, -43037, -69989, -107453, -159074, -144310, -45693, -94605, -124150, -172860, -123709, -60755, -15692, -19870, -16341, -13338, -72634, -74482, 106203, 71476, -33215, -53703, 16142, 36084, 102075, 111454, 85770, 36024, 60268, 129892, 81789, -10658, -91358, -61111, -24203, -25261, -44783, -63458, -56297, -35385]
22705c5385K886p1467M18K9423M1534q1303Q149P7917n2255q7793M3047J9950
22693a04879q8725L979J36105J24686R330j07292o0715j8643L048P212L3636m2704
22681a04962P0620K5596k1995o6998j12245M1451Q4209J3134k6609K397O2776
22670c2626L5201N2780k1639J1488K425k583J4493J3476j00755k9892L200P6537
22658B2105K6714o146J573l7344l8046o438p9685P1597j123Q63l0283O0907n5893
22645g1199l8946M9001L6943m3255K2467L8388J3576O3248K3585k2296l3482K8344
22633F6374Q0127j35246q3229m0818O6610Q3151K8180K7519K9829N8724n0246
22622A30975p5739oK9700l8838j16359P1821M6247L5696q251m0075m8142M2210
$$ y = [-35385, -32499, -103966, -103548, -74125, -32591, -113894, -105745, -27828, -80083, -167876, -124829, -104879, -193604, -189625, -53520, 71166, 80496, -26796, -87511, -106154, -103106, -95894, -62258, -104962, -34342, -8746, -30741, -97739, -209984, -168533, -84324, -71190, -97799, -95402, -32626, 2575, 55355, 33716, 45204, 47629, 45046, 59539, 73015, -27740, -57632, -54432, 22105, 48819, 42673, 44246, 6902, -31144, -37582, -117267, -45670, -46793, -45930, -76213, -15306, -71199, -110145, -61144, -24201, -67456, -44989, -6601, 6975, 70223, 93808, 71512, 38030, 66374, 146501, 11255, -71974, -112792, -46182, 36969, 65149, 92668, 122497, 181221, 130975, 55236, 55230, 84930, 46092, -70267, 1554, 47801, 83497, 75246, 35171, -12971, 29239]
22610B9239m2415R2948K9898N0386n2382j24841m6555r333N1480o401J9186K4341
22598A5551o0332o1841P8458O7026R1463j8746j03936m1666M6639l1461m8784
22587f7629O5909J7208M1741k5825O492j3338L6577m2765n1613k8916J9801j2141
22575e4499j3963k5418R3719M648n6871K1428Q410L0786M0243K3197m3291m5884
22563a7495N5558L0390k7196J1515J4365P615m0586o2067m2051j6253Q0928L2564
22551B7287l771N594n5226k3528K2090P9730n8536j7084N8889M6255o9644n6007
22539d3951k1877n6922N3383L3606j8370l3023J4651p325M2144n1787J2092m627
22527h2006M6355K2431K3501K7119k2685R6379K9230K8436M8647K4914p1046l4206
$$ y = [29239, -13176, 79772, 109670, 160056, 107674, -17167, -63722, -73055, -21575, -27976, -8790, 15551, -44781, -106622, -28164, 38862, 130325, 111579, 7643, -34023, 12616, -18845, -67629, -1720, 15488, 57229, 31404, 37896, 24558, 61135, 18370, -33243, -62159, -42358, -54499, -68462, -93880, -161, 4487, -52384, -30956, -22546, 8240, 48483, 71680, 28389, -17495, 38063, 68453, 41257, 52772, 67137, 74752, 34166, -27901, -69952, -86205, -5277, 27287, 23516, 29110, -26116, -49644, -27554, 52176, -6360, -23444, 35445, 81700, 12056, -43951, -65828, -122750, -69367, -35761, -54131, -87154, -72503, -79828, -37684, -89471, -77379, -82006, -35651, -13220, 10281, 37400, 14715, 111094, 140324, 168760, 217407, 242321, 171275, 137069]
22515A37069j1100q3005K9800n493p6813k9991O8284M4801q7626o6263J7353J5549
22503d7435J02107Q5314N060m0262r6397J2501m7180O5409l6959l8071l4282N5265
22491a4930p243K1951K6191m7252k1523M7129q3953k5640J27520P8633r6448k0608
22479a6173K5604n1906L1181J1416M3200K6483p8053n8066J0555m492m3204l1572
22467a35027J6063O7005L8159L8339n3521L9497R1518O7640o5131j30273k4903
22456e0634M1278J5260n2033n7557O5339l545J8704K1451N2222j1587O7064j5402
22444I0560r4320O8045L2556m6669k4329m674J3139j4871q8061n6497R0872K1151
22432a3098Q366k5019K8712O6696j4667l8089l0999n2168k3589L7792N7156k2686
$$ y = [137069, 125969, 42964, 72764, 67271, -9542, -39533, 28751, 73552, -14074, -80337, -62984, -47435, 54672, 139986, 145046, 104784, 8387, 20888, -26292, 39117, 2158, -35913, -70195, -14930, -22173, -222, 25969, -21283, -42806, 4323, -79630, -105270, 22250, 100883, 4435, -16173, 9431, -42475, -11294, 122, 43322, 69805, -8248, -66314, -55759, -60251, -103455, -135027, -118964, -51959, -13800, 24539, -28982, 10515, 102033, 169673, 104542, -25731, -50634, -9356, 5904, -46129, -103686, -38347, -41892, -23188, -1737, 50485, 38898, 105962, 90560, -3760, 64285, 96841, 50172, 25843, 21169, 34308, 19437, -68624, -125121, -34249, -13098, -4732, -29751, -1039, 65657, 50990, 12901, -18098, -70266, -93855, -56063, 1093, -21593]
22420b1593p1545M4215N4505j9928P3819M9379R622m3561j01248J7065N3958O5234
22408A09922j5067q7278M655k256k0896l8003j2712M6376J7869R499o7079N6568
22396A598J5499j19220L1441M4618r571n0833r6511l6459j5239P1985R1141J01136
22384B9585K9847j5386j5302p4888n8525Q5927N1655Q66q5513j3180J6643m411
22372e2682q767j6809L7349M7262J4153P5229n5881j3844M2373J440j6785l8031
22360A5007M4122O2897j334j44126P999p5239m7361j4707N6979M2155P0547r816
22348G123o3990R641k4477k0645l1882Q110P3264J600M0655Q8265N443J232o3407
22335C0932n6134J7148M5657O5518p6995j04041M2576J02263l1719k2156k0042
$$ y = [-21593, -93138, -48923, 5582, -14346, 59473, 108852, 118474, 74913, -26335, -9270, 44688, 109922, 94855, 7577, 12232, 9976, -10920, -48923, -61635, -15259, 2610, 12109, -54970, 1598, 17097, -102123, -70682, -26064, -35635, -86468, -182979, -219438, -234677, -162692, -71551, 29585, 59432, 44046, 28744, -46144, -104669, -18742, 32913, 33779, -51734, -64914, -48271, -52682, -61449, -78258, -40909, 6353, 20506, 95735, 39854, 26010, 68383, 69823, 53038, 15007, 59129, 122026, 120692, -23434, -15435, -90674, -138035, -152742, -95763, -53608, 16939, 7123, -56867, -47226, -71703, -92348, -124230, -116120, -42856, -41256, -601, 87664, 93107, 94339, 30932, -25202, -8054, 37603, 103121, 26126, -77915, -35339, 66924, 35205, 13049, -6993]
22324f993n9733N6730K4420n5664M913J3126P860L2935L1708J34151K2478j47711
22312E8220j21026o6370j3133n7857J6146K9352K0685k0107r646L7926J26022
22301B12k901j30913p4698J8396M3428L9503Q4680M258j04702M4127J07539k6856
22289B073m7845O0879J2718l222m7448q0219J5354O4116k2474m2022j980l1837
22277a21907L4420R5209M7252o1650n2887J2279J38865k4666r9396n3940J0370
22266g6051J6679j3089K7056J8431k1835O4186N8186m0309r3600o8229n7466Q0524
22254a05517J05314N2560N3576n9905j03152o4262J35133O5407J0904j0972n5590
22243B3496r457k5313P692m6268j0788N3885O8864N554J6791k0793k9871k1674
$$ y = [-6993, -66726, -9996, 14424, -41240, -36327, -23201, -15341, 17594, 49302, 183453, 205931, 58220, -62806, -129176, -142309, -200166, -184020, -154668, -133983, -154090, -163736, -125810, 212, -2689, -133602, -208300, -189904, -146476, -106973, -22293, -18035, -122737, -78610, 28929, 2073, -45772, 15107, 27825, 24603, -22845, -103064, -87710, -23594, -46068, -88090, -90070, -121907, -87487, 7722, 54974, -6676, -59563, -47284, 91581, 66915, -32481, -86421, -76051, -59372, -72461, -45405, -26974, -48809, 15377, 73563, 33254, -60346, -128575, -186041, -105517, -203, 52357, 105933, 46028, -57124, -121386, 13747, 79154, 90058, 79086, 23496, 14039, -11274, -3582, -49850, -60638, -6753, 62111, 67665, 84456, 63663, 33792, 12118]
22231A2118l3132M8829m2611j3966n5061L338P0877j8368o7980p9799Q0162R1573
22219d020N9927q1806k7434P9022q7891l4098r401J1164J30080J3925o687m744
22207C8037r3887m330K6098J4807n4392L3485N064o981o1188l21K9474k954L0592
22194d6496o356n1873l3916M9737K4450q477n0360j3100O9418Q0702K8712M6868
22182H9309l5698n7628o086M350n5545p1872M2270L9568j0032Q604L4766o3698
22170h1692n3946k9815M8796o316k8524R3328O9543j6319J927n0862M1035M1756
22158B8911k4880M3467p466p9021j7682K7843M9130m50K1669J22372p871k8742
22146A27280n777n0724r7989j3092N0113L3878o8688p4177j00207K5658L8982
$$ y = [12118, -21014, 27815, -14796, -28762, -83823, -80485, -9608, -27976, -95956, -175755, -95593, -4020, 55907, -25899, -53333, 25689, -62202, -96300, -105701, -94537, 35543, 49468, 42781, 38037, -55850, -60180, -34082, -19275, -73667, -40182, -35118, -42099, -103287, -103608, -74134, -77088, -46496, -52852, -104725, -138641, -88904, -64454, -72931, -123291, -136391, -66973, 13729, 42441, 89309, 53611, -4017, -10103, -5753, -61298, -133170, -90900, -51332, -61364, -52760, -17994, -81692, -135638, -165453, -116657, -122973, -151497, -58169, 11374, -4945, -3018, -53880, -12845, 28911, 4031, 47498, 40032, -38989, -56671, -28828, 20302, 19852, 41521, 163893, 156022, 127280, 121503, 70779, -27210, -40302, 9811, 43689, -24999, -99176, -199383, -173725, -134743]
22135a34743O4635J6346K8631J11406n5657q4010L7825J52667K9164m6100p4174
22124D5990n6229o0246P4094L8694l5108p0040n7246J6706L9047J1910L8727J1727
22112a974J9226P5672n0242m8651l5064O2182L9886n2014o1794j9961M2521J08886
22100G8673R4131l2626q4209m1454L4864o9012r0137m4036j7595J0500Q4296O1952
22088a4653N1816j386r535K3385R772m3899n1423M5994k6076m9666N7304R303
22076I36p9827K5083K1511N8340O6127k8265r9855l4146l48M3328N3749L1172
22064E7805l3402L3444P4665j10793j00788L464m716M12N7449L9981L8149o485
22052D9185m4550n0107K8096Q0883N9110m9146m2402r3345M1163M7306j6878m167
$$ y = [-134743, -70108, -53762, -25131, 86275, 30618, -53392, -15567, 137100, 166264, 120164, 45990, -10239, -70485, 3609, 42303, 7195, -62845, -120091, -103385, -64338, -52428, -13701, -1974, 17252, 92924, 42682, -5969, -41033, 21149, 61035, 9021, -52773, -72734, -30213, 78673, 172804, 140178, 55969, 14515, 49379, -19633, -109770, -153806, -171401, -160901, -76605, -14653, 37163, 35777, 26242, 49627, 59399, 15500, -35923, 10071, -16005, -65671, -8367, 936, -78891, -53808, -32297, 26043, 92170, 63905, -35950, -70096, -70444, -27116, 26633, 57805, 24403, 57847, 132512, 21719, -79069, -75605, -80321, -79909, -22460, 17521, 55670, 49185, 4635, -45472, -17376, 63507, 122617, 73471, 31069, -62276, -21113, 26193, 9315, 5148]
22040E148K0061O571o7333j8930m1685L1423K558O5002O0566l6999p0699K0104
22028b4213m790l0691K8683k6150J6087m0159M2242N7979p6718q1399k7587J06093
22016f0623M8429l4557K4563N1849P77n552o9574M1214O8179L1635p3011m6710
22004b3381J9219J2670Q377K1507L3267l5042j4606j15434L2052q080L9293L971
21992b6187j11147M5882J07185L0363r8270q384R6185m2906n2045K4910K1325
21981a3089J901n5334K8383M3042N4855K6244j46662o1710K4598O147J4682O972
21969f9971J4224J8437L2716n5845o3082j9640P2977P8288l952o1277m407j5604
21957g7136K2425n758M115k0622q2435O6017N7879Q665r6254J0569O0286n880
$$ y = [5148, 25209, 31780, -35553, -54483, -96168, -64745, -62187, 2815, 63381, 26382, -44317, -24213, -29003, -59694, -31011, -57161, -41074, -81233, -38991, 18988, -57730, -139129, -166716, -60623, -12194, -46751, -22188, 29661, 30438, 24886, -44688, -3474, 64705, 96340, 23329, -23381, -4162, 8508, 16885, 38392, 71659, 36617, 22011, -93423, -61371, -69451, -30158, -26187, -137334, -91452, 15733, 46096, -52174, -60558, 35627, -7279, -59324, -34414, -13089, -11188, -66522, -38139, 4903, 59758, 86002, -60660, -122370, -97772, -91625, -76943, -69971, -55747, -37310, -4594, -60439, -123521, -143161, -70184, 8104, 4152, -57125, -61532, -77136, -54711, -60469, -56354, -76976, -159411, -93394, -35515, -26850, -123104, -112535, -52249, -58129]
21945e8129J27657L9924j6061o5359L3150L3896o6262o9450L4952O914J916n425
21933b277j5621M0579P1156m8455J7786K6212q8131n8907L9221J1587o5625j3198
21921h5673R8755L3519j784j2164J2908P6555k9238n4790K2890l6572j9024k8604
21909b3222O9290M2506j27555k1888L5509q392l9666m270k6521Q658N6445N3697
21897A4591O0989k0369o6268m536L2727n128L4404K9759m7539L1560J4158P2057
21885A46405p7745l6824j0797K2783n3217n054k0195l0233M2470Q1997L374r6157
21873c3193j1402R0891J2906o0682N818p4407r2830l3106o57N5209P4917N3073
21861a3463P250J489K0563l4144P8844J2997m2965K9297L8087K2726k6298p4488
$$ y = [-58129, 69528, 109452, 93391, 28032, 61182, 95078, 28816, -40634, -5682, 1232, 3148, -2277, -17898, 22681, 93837, 45382, 63168, 89380, 1249, -57658, -18437, -6850, -72475, -85673, 13082, 46601, 44817, 32653, 45561, 122116, 92878, 38088, 60978, 24406, 5382, -23222, 46068, 88574, -38981, -60869, -25360, -33752, -73418, -77688, -104209, -95551, -39106, 14591, 75580, 55211, -11057, -15593, 17134, 12006, 46410, 76169, 28630, 60190, 74348, 146405, 68660, 31836, 21039, 43822, -9395, -14449, -34644, -64877, -22407, 59590, 62964, -33193, -44595, 46296, 59202, -1480, 4338, -70069, -162899, -196005, -196662, -141453, -66536, -13463, -6213, -4724, 15839, -18305, 60539, 73536, 30571, 59868, 97955, 120681, 94383, 19895]
21849A9895J9558Q485P5273n0346m3279k7368l4092J6014L5978m7366q4283p966
21837a19497O6224j3758M1385O7502L8856j639j4410J894n8161l6221K7336K4357
21825B3868L3221p3999R570j4121J0172L7699r7l475R310L2468j8514o4589N7972
21812C9485k0716n9688M9680O1356O6474l2083M6666m2225j51063m5625M7770
21801c9969n2373j3466L3710J17157K4827O416j101j5637o2929j3109J1718n445
21789a0201N3052J5243j5668m3107j03252n6227Q7787j8092o0294Q458M6478J8190
21777g7633L6916p204K0722L8211J5916m2375k3719R2692L4030O628K7608j44928
21765b3136r0770R3674P3274o08j7861o6001l8694K6970Q0889m5037o533m1803
$$ y = [19895, 39453, 47938, 123211, 72865, 29586, 2218, -31874, -15860, 20118, -27248, -111531, -119497, -53273, -67031, -25646, 41856, 80712, 79073, 64663, 66557, 8396, -27825, -489, 23868, 57089, -16910, -7340, -21461, -11289, 26410, 26313, 22838, 32148, 64616, 46102, -18487, 39485, 18769, -40919, 8761, 70117, 136591, 104508, 151174, 108949, -42114, -87739, -39969, -92342, -105808, -72098, 45059, 69886, 76302, 75201, 59564, -3365, -16474, -4756, -10201, 42851, 58094, 42426, -681, -103933, -160160, -72373, -90465, -150759, -142301, -95823, -77633, -40717, -47921, -27199, 11012, 26928, -15447, -39166, 53526, 87556, 94184, 121792, -23136, -113906, -20232, 53042, 52434, 34573, -31428, -70122, -43152, 37737, -7300, -13833, -55636]
21753e5636K104M0411K5300o6615J0215M3800J7667M1195J296k0059o3719m3942
21741f7983k2493o094L0961L8729K4369k9827m7744L991Q1575l6673m0627q151
21729g9967R891m6435j7494J9310O5266P9094m6834p9765q681N7301o2828O0682
21717e0460K8566m821N3747o7228M5795m2696J7183L7556m3895j07574J3539Q3493
21705c6795J4948j014R7762L6420q3015n6726m0078L6406P6241P2828M161K4525
21693A45663o2941p7688K6998J9119J00211L4158j17716j55617k8248J22041M2544
21682D8524N127k6587K3269L473o8241j7636k0689q188N8200j3512k3857k2031
21670f2148n343Q022N48K4511Q6138J0732o5702o5457r395J2790K9248l9597r9679
$$ y = [-55636, -53532, -13121, 12179, -54436, -44221, -421, 17246, 58441, 59737, 39678, -24041, -67983, -90476, -96570, -65609, -26880, -2511, -32338, -80082, -76091, 5484, -31189, -71816, -79967, -70076, -116511, -134005, -114695, -49429, 29665, -17169, -96934, -105615, -48314, -111142, -50460, -21894, -26715, 27032, -40196, 5599, -37097, -19914, 17642, -26253, -133827, -120288, -36795, -21847, -22861, 74901, 111321, 28306, -28420, -68498, -32092, 44149, 116977, 121138, 145663, 82722, 5034, 32032, 51151, 151362, 185520, 67804, -87813, -116061, 5980, 48524, 53651, 27064, 50333, 53806, -14435, -32071, -52760, -60948, -2748, -16260, -40117, -62148, -67491, -59469, -58921, -34410, 51728, 62460, -3242, -68699, -78094, -65304, -36056, -75653, -175332]
21657a75332q86J19938O626K0107N6742N8388j02827o3018K1356j5342q2189j5526
21645a71963K1730l0988M271R3839j7611L011L3816l0709l2918K1407K0774J9698
21633f5643J00416n42n6184M564J4364J7235o7366J5156m5627J601Q862L047N6756
21620a3361j2182J9596K4502J9426M4497n6519p5707j3688l654O3868J436N5950
21608E4164j3213j47462j26276L3710Q3751Q6093J5189J1241q0095L052J25181
21597D5335Q3862m7116o4157o521K936k2661N326o761q1733l803l3005J7973J27891
21584A7566J120l0485j671L3473o165K3712L7243j679j07821m1946P349Q1486
21572A2182M5817Q855L117o0991P0706M9758J7838o4923m5181M033m3245n063
$$ y = [-175332, -176218, -56280, -49654, -29547, 27195, 85583, -17244, -80262, -58906, -74248, -156437, -171963, -150233, -181221, -176950, -83111, -100722, -97711, -63895, -94604, -127522, -106115, -85341, -65643, 34773, 34231, -21953, -17389, -3025, 14210, -53156, -38000, -83627, -82026, -73164, -70117, -13361, -25543, -5947, 18555, 37981, 82478, 25959, -49748, -63436, -67090, -3222, -1786, 54164, 40951, -106511, -232787, -199077, -115326, -29233, -14044, -2803, -82898, -79846, 45335, 129197, 82081, 17924, 11403, 14339, -8322, -2996, -9757, -91490, -95293, -128298, -110325, 17566, 18686, -11799, -13470, 20003, 13838, 37550, 74793, 73114, -34707, -76653, -69304, 12182, 57999, 66854, 69971, 8980, 79686, 129444, 147282, 82359, 37178, 41211, -2034, -7097]
21560g097N0065j4272n2271l8304L0476M8813L1351P5904p0259j5853L1148K3498
21548I3199j5541m0683N6900k6419j04480M3410O1882k8478j1325O6376n8190
21537C6651J4039o3200K3910k7968J3649j2831n5293L1609N6939K5864k6438o393
21525A0538l9751J3134J2477K4212m1743K0708L1302K1721K9968l5436l5274l7922
21513b6066n9647j0954n897m4979J4233Q2206Q4779J2579K3618J5329q0251j02562
21501i7612o8234M0725K1173l1285J13814L4366j464Q4914j9427L8607J5234p3702
21489E7109j949P5253J0521p9837q5575m257j5459k7367M200q6241q2978M2680
21477a93900L8224k8384m8670P2513J2029L0824J07244Q9999p514n5384M8867
$$ y = [-7097, 42968, 28696, -23575, -61879, -31403, 17410, 48761, 124665, 54406, 38553, 69701, 93199, 77658, 36975, 93875, 67456, -37024, 6386, 68268, 39790, 28465, 94841, 36651, 50690, -12510, 11400, -16568, -2919, -15750, -71043, -39434, 17505, 43369, 16931, 10538, -29213, -16079, -3602, 20610, -21133, -425, 30877, 52598, 82566, 47130, 11856, -26066, -85713, -96667, -102564, -147543, -133310, -51104, 33675, 46254, 69872, 85201, 4950, -97612, -165846, -125121, -103948, -135233, -21419, 12947, 11483, 96397, 76970, 115577, 130811, 57109, 55160, 130413, 140934, 61097, -24478, -28735, -44194, -71561, -67361, -153602, -236580, -193900, -155676, -184060, -232730, -160217, -148188, -117364, -10120, 79879, 72365, 16981, 65848]
21466F5848l1975m4777O2140n0603l6447R0704P7835l4008p1654J2445r2244J3697
21454c9039j9286k9038Q855P47l2270L7746L790m6504R432R198m451O8517N8467
21441B6164R1510j1532l1202j18250n2946Q8957N430J8702Q8005o3626j9119P745
21429B9838n6985j03365N8348J47343K0862k8615k9760p7862K6306q7286K2610
21418g8566O6767m6799m1185l7883j3886N2167j1843k3767J1572J21495N6187
21407E4259L2697J4632K3047l430p146o9862L745n0458l7073M2880O4705P6024
21395A44020q1767j02431r407j4886N9989j0446L8161j2722K284n2895L0086M0236
21383C0222M9735L559l2353m1043M1411P2802o1472l8286k8249j7633J00609j676
$$ y = [65848, 33873, -10904, 51236, 633, -35814, 54890, 132725, 98717, 27063, 39508, -52736, -39039, -58325, -87363, -78508, -77761, -110031, -72285, -68495, -114999, -105567, -96369, -100820, -32303, 26164, 117674, 106142, 74940, -43310, -96256, -7299, -1869, 16833, 104838, 41212, 22093, 29838, -27147, -130512, -72164, 75179, 96041, 67426, 37666, -40196, -13890, -101176, -78566, -11799, -58598, -99783, -137666, -151552, -99385, -111228, -134995, -123423, -1928, 54259, 86956, 101588, 124635, 121205, 114059, 44197, 47942, -2516, -39589, 3291, 67996, 144020, 62253, -40178, -49585, -64471, -4482, -14928, 23233, 10511, 12795, -40100, -10014, 30222, 79957, 83516, 51163, 10120, 51531, 124333, 62861, 24575, -3674, -21307, 79302, 77626]
21371G7626q1285J08917m3079n8660j4566l3647o820O7179r144l0554M1592R3553
21359A11112M5170j5433q8558j7316M6771N4734l8052j07510j3420k378k9474
21348e4354L71R2529K5411m4060l7073l5023L0545j8530l1937k97k7678O9015
21336c1081m0360J4128O5782N7553K4759o6518J1855Q268L5393K8335p9407r3877
21324f5170J1964O2832J1886p8277l9772O2421O8990M4988N0992q1189l530L4797
21312H0932j4061m4900J744k3836m4389M8270R39o0602L2M071m222N3247J18195
21299A15420M0975p7815o3168m3224M7898R0541l0649q6227m3183M8386l6875
21288c7921p3261L6844O1438L2890O627K4380J6362m2372q014n1215r4101k4223
$$ y = [77626, -3659, 105258, 62179, 3519, -11047, -44694, -51514, 15665, 6521, -24033, 17559, 111112, 156282, 140849, 52291, 34975, 81746, 136480, 98428, -9082, -22502, -24880, -54354, -53983, 38546, 63957, 19897, -17176, -52199, -21654, -40184, -72121, -72418, -100096, -31081, -71441, -57313, 8469, 66022, 90781, 24263, 36118, 44386, 79779, 108114, 28707, -65170, -53206, 9626, 21512, -56765, -96537, -34116, 34874, 79862, 130854, 49665, 46135, 80932, 66871, 21971, 23715, -121, -44510, 3760, 4699, -55903, -55871, -51800, -56022, -2775, 115420, 156395, 78580, 15412, -27812, 20086, 110627, 79978, -6249, -49432, -1046, -37921, -111182, -74338, -12900, 19990, 26617, 50997, 67359, 24987, 16973, -34242, -128343, -152566]
21276a52566J9781L172M7532O4793O1652l0045m0131M6092P902O696R576K4754
21264F9208M0632l4758p2968k6779K3313R5267m147q9641o8903R826r513J5104
21252e3359N143p2387M1323N1638l5748o7748p518J801N145M4083L1585n1631
21240a07673m3570j4298P6164P8304k0115P3764O5944M1291l6541j0385l2266
21229G0619j6386j00405p2240q3478N4405J09880R7649M7633r0453l6442N1498
21218C2280J01090m5399j43094l1429K7476L0773k0120J5984O6182l5979o5747
21207f7983M6016J8493J7278m4486k0219K9523o4110r821N1771O2332K0334Q231
21195D7359K0834j0890o7904j04199P860M9665k9165n8621K1902m8977J16919
$$ y = [-152566, -132785, -129613, -82081, -17288, 44364, 14319, -25812, 20280, 28182, 34878, 44454, 69208, 109840, 75082, 2114, -24665, -1352, 93915, 89768, 127, -68776, -58950, -68463, -53359, -48216, -120603, -79280, -27642, -63390, -131138, -138656, -136855, -131710, -87627, -56042, -107673, -151243, -165541, -89377, -11073, -31188, 42576, 108520, 149811, 113270, 102885, 70619, 54233, -46172, -118412, -201890, -147485, -37605, 60044, 107677, 17224, -19218, 32280, 133370, 87971, -55123, -86552, -59076, -28303, -48423, -32439, 33743, -2236, -67983, -21967, -3474, 13804, -30682, -50901, -21378, -85488, -95309, -43538, 18794, 39128, 47359, 68193, 57303, -10601, -114800, -106940, -57275, -86440, -145061, -123159, -172136, -55217]
21184e5217L0513L6965M6875J28601O512n6886k7615l0830o0986k8938m297k3035
21172c8338l8312q954J7517r046J7487O3434Q9334P4943o2774l0018m8135N798
21160C2936k1675j7619M8826p6893j1825K7566k1656l5111k5322r5928N2711P1793
21148g2197o53j8158m5111m7670K5954L3765R2270Q9850K6900j07843o8172j9442
21136a10507K1963M9286M8016K425N0016L7380k6536J73m2731p3314n9085J11914
21124I000l4532m8034J5740O649l5571K9380j338J1367J5911p637j2052M8228
21112b889o1716n8857J107M0440O3984k1129K4127n9468n2382K0445P3437M1331
21100H430J9253j3583O6567M2243L6634k8671o0904O5377P9347r1800o5959o18
$$ y = [-55217, -24704, 12261, 59136, 187737, 194249, 137363, 109748, 78918, 17932, -11006, -15303, -38338, -76650, -85604, -68087, -77133, -59646, 3788, 93122, 168065, 105291, 75273, 27138, 32936, 11261, -6358, 42468, -34425, -46250, -18684, -40340, -75451, -100773, -196701, -143990, -72197, -72850, -91008, -136119, -183789, -157835, -124070, -31800, 58050, 84950, -22893, -91065, -110507, -88544, -39258, 8758, 11183, 61199, 98579, 72043, 72216, 29485, -43829, -102914, 9000, -25532, -73566, -57826, -51177, -86748, -57368, -58706, -47339, -31428, -39065, -51117, -2889, -64605, -123462, -122355, -81915, -17931, -39060, -14933, -74401, -126783, -106338, -32901, 8430, 27683, 14100, 80667, 122910, 159544, 130873, 69969, 135346, 214693, 122893, 56934, 56316]
21088E6316k07K886m0093o8202l9777M1766J76318K1172o326j0843p1479j05821
21076d4290r5944M6736L543k5483p469P6359J4799o5827l4350K0391j2615r0250
21064b14400Q119P9567M3897N2544j3398k8894n395l2276L3476L963l1069J06645
21052B779M8850O0637p6065q7304m843N0490P0257j5086J4424j1630k8196K4661
21040D8974j4780K2554j8707J0856K8903j06859Q391L4899L97k3668j1897M0104
21028A9167O6139k3960L4357q1755N1687N7691l7248m8156J8290j03957O2503
21017A4758J27550j66530r6374k8229O2469J50903K107n3283o3565n6356N4664
21006e1886q005o5269J5117J6187k2731j1810k3887j731J03773Q2324o0734q4759
$$ y = [56316, 56109, 58995, 18902, -49300, -89077, -47311, 129007, 150179, 143853, 133010, 61531, -44290, -140234, -93498, -89955, -115438, -122907, -46548, -31749, -97576, -131926, -111535, -124150, -214400, -206281, -126714, -82817, -30273, -43671, -72565, -77960, -110236, -76760, -72797, -103866, 2779, 51629, 112266, 36201, -51103, -55946, -5456, 64801, 49715, 64139, 52509, 24313, 48974, 34194, 56748, 38041, 48897, 77800, -29059, -20668, 14231, 14628, -9040, -20937, 19167, 85306, 61346, 95703, 13948, 65635, 123326, 86078, 37922, 56212, -47745, 14758, 142308, -24222, -120596, -148825, -86356, 64547, 66654, 13371, -50194, -106550, -51886, -59891, -125160, -110043, -93856, -116587, -128397, -152284, -154015, -50242, 32082, -28652, -113411]
20994a13411m7315M0419R5566M4312M4471Q0356k4735m9354p7433p573l4714N0255
20982H44J24125N4191r9809q2401r832N1116J7210m2143l5251n171N5728o5884
20970c7277m4276l3119K4741J9976N9224L4526n980p4319j3995J13653N122l0183
20958A8093j6344j3364p0178Q9802N9738J00522n136j52290o9462J4369J3402
20947c0848m667J2307J009j0138M0536K8795N3382P8404p2535o3308K1866L1679
20935H6482n2765l9988K669K7775m5889p6651k1867J29731O4383k1207l243l78
20923D9052p7830q8777m5931L3680Q0285p823k0377K0946J11284n0702L154K1041
20911B8002J2668K5119K9488n182n6109K5777K7705n9923k1454M8661M1476r539
$$ y = [-113411, -160726, -120307, -24741, 19571, 64042, 144398, 119663, 70309, -7124, -14697, -49411, 844, 124969, 179160, 79351, -3050, -12882, 38234, 55444, 13301, -21950, -27121, 28607, -37277, -81553, -114672, -89931, -69955, -10731, 23795, 17815, -56504, -70499, 43154, 48276, 18093, 1749, -11615, -81793, 8009, 67747, 168269, 163133, 10843, -58619, -44250, -30848, -35515, -23208, -22199, -32337, 8199, 36994, 90376, 168780, 96245, 32937, 54803, 86482, 33717, -6271, -3602, 24173, -21716, -98367, -120234, 9497, 73880, 52673, 49430, 49052, -28778, -117555, -163486, -129806, -49521, -57344, -77721, -56775, 54509, 3807, 6961, 28002, 40670, 65789, 95277, 90095, 33986, 59763, 87468, 27545, 6091, 54752, 96228, 86689]
20899H6689P679l2415K5107k9771k3437q3260k1160l6854l1348P1113L0558n7942
20887i5041q09J158n4067M3864L9224L7668Q971J3438j8388o5124J2031J45276
20875F8201Q402m2941n625K8152r626o2200M570N2879m5396q8902L0408M8486
20863a3592m0534k9872R8257R1731k8338k8326k9431n1718j23180j7831P9412
20852i3422N8618q2868k0990Q933P1049O9584k1570n3948k2981M9817n2002m3526
20840a33306o1K1571J2379O3398J80528P6872n9739j50302J171P0118m0398j406
20828D0825J00867K4651p9917j65594M7176l197L7831J6870n3438o6122n0727
20817a50775R8356N7033J5900K04L9592Q0861n667o673K0893P820m9086J5824
$$ y = [86689, 94368, 61953, 87060, 57289, 33852, -49408, -70568, -107422, -138770, -67657, -37099, -95041, -95850, -94692, -148759, -104895, -65671, -28003, -19032, -5594, -23982, -89106, -77075, 68201, 76603, 33662, 28037, 56189, 46563, -15637, -11067, 41812, -3584, -92486, -62078, -13592, -54126, -83998, 14259, 105990, 77652, 49326, 19895, -31823, -155003, -172834, -93422, -34804, -117672, -138662, -129729, -58680, 10904, -10666, -64614, -87595, -37778, -89780, -133306, -133367, -111796, -99417, -36019, 144509, 221381, 161642, 11340, 12511, 82629, 42231, 40825, 141692, 166343, 86426, -79168, -31992, -35189, 2642, 19512, -33926, -100048, -150775, -52419, 4614, 20514, 20718, 60310, 141171, 135504, 128831, 149724, 157544, 108458, 124282]
20805A24282l7952n8770M9714J3661l8159q0814N7565J14587k2023j53910j41881
20794a73700L7342L4897R9103L7310N288L890n8911k4903O2515N2224L6602J6109
20782A27766j40964o4561J8728M4885l6513K9555k0081j6707M5699j20082j0219
20771a42494J16675O3479J6009l6429k2004j9706l9479J7844k824O670p6896L5186
20759h3969Q2081J14215M5775R816L1912o706m0981r1764m8681m549O877n4074
20747d0048K7585L925L490O3500m1322m4539q479O30K36K8219L702l3422K6475
20734a0048M3943K9336l0255J03754j9706K0599l7783p9445L5858j1755p2101
20723b7603o7895J2697Q4522M3381j9262K9265K0909k3253k8767l3960p5479O1897
$$ y = [124282, 86330, 27560, 77274, 90935, 52776, -28038, 29527, 144114, 122091, -31819, -173700, -136358, -101461, -2358, 34952, 40240, 44130, -14781, -39684, 22831, 75055, 111657, 127766, -13198, -77759, -59031, -14146, -50659, -21104, -41185, -57892, -12193, -132275, -142494, -25819, 37660, 53669, 17240, -4764, -24470, -63949, -46105, -48929, -42259, -119155, -83969, -1888, 112327, 158102, 167918, 199830, 193124, 152143, 60379, 11698, 7149, 14026, -40048, -12463, -8538, -5048, 58452, 17130, -27409, -35888, -35258, -35022, -6803, -3101, -36523, -10048, 33895, 63231, 32976, 136730, 117024, 137623, 99840, 20395, 56253, 44498, -27603, -95498, -82801, 1721, 45102, 25840, 55105, 76014, 52761, 23994, -9966, -85445, -23548]
20711b3548P4463K7972N6359l4611n4789j9183O6785n5926j38662o2424L5312
20700a28252P0483O2967n1754p8187P1006o827k2932Q68Q3708R3533K6229P2385
20688A93227M6372q0150r6141q4167m316L8080L305J7892Q1868l3316q8005j06038
20676a11389o027M4930Q9828J1032l2651L4023l9193J7205N7814L5905j7760L0598
20664A14315O4047l8128m0851R175R924m7704K32o0163K8516M6597J35052r8741
20652A22271p5616Q9127J26906m5770j11342j9275M8915L2171n2369o5662p8647
20641b9291j9295L9990K6188J1785n8910o5343L3260O3682J35249j7262m1052
20630G9001O4272l0096m3669O4850k0427l7666j09788j9056k3112L2054O7619
$$ y = [-23548, 50915, 78887, 135246, 100635, 45846, 26663, 93448, 37522, -101140, -163564, -128252, -57769, 5198, -46556, -124743, -53737, -60564, -83496, -82628, 1080, 94613, 120842, 193227, 239599, 159449, 63308, -20859, -25175, 12905, 16210, 34102, 115970, 82654, -5351, -111389, -117416, -72486, 17342, 28374, -4277, 29746, -9447, 7758, 65572, 101477, 83717, 114315, 178362, 140234, 99383, 108558, 118482, 70778, 71010, 10847, 39363, 85960, 221012, 122271, 46655, 135782, 262688, 216918, 105576, 86301, 135216, 167387, 115018, 49356, -29291, -48586, -8596, 17592, 29377, -29533, -94876, -61616, 2066, 137315, 120053, 79001, 143273, 113177, 69508, 134358, 113931, 76265, -33523, -52579, -75691, -43637, 23982]
20619B3982K361j1868N0375P2929K3910n1819r3654j2771R598k9239J5302J05950
20607A05056m9023n2041p9926L2516M9216k6600N891K9513K5695N3390j1728K5798
20595A07757o9695k6760L6831O4879r366o7188q7536J7691K199n5078j941O0034
20583b8173L2392J31388J5352j00144l6338q816L1550K7261J0727o5091l6619
20572b6511o4311j8756n27J07693J8942k736K7499j7684L4875q583j6521L77l037
20559C0720n7444k2815l5801o1152L1464n4107n082L3678K617N5318O9185r590
20547b3009k7904N7071L9287K0394l5407N7355l5266m5422q1007O5599P4599J6244
20535H2534L5277J3049k9440m2984k4021K4476k1873n9169Q6744O915q9039J5293
$$ y = [23982, 26343, 14475, 64850, 137779, 161689, 109870, 16216, 3445, 13043, -16196, -894, 105056, 56033, 3992, -75934, -43418, 5798, -20802, -14911, 14602, 40297, 93687, 81959, 107757, 38062, 11302, 48133, 113012, 103646, 36458, -51078, -33387, -31188, -86266, -88207, -28173, 4219, 135607, 150959, 50815, 14477, 5661, 37211, 64472, 75199, 10108, -26511, -90822, -109578, -110105, -2412, 16530, 13794, 41293, 23609, 58484, 49901, 33380, 33757, 30720, -26724, -49539, -85340, -146492, -115028, -169135, -174217, -140539, -137922, -82604, -13419, -23009, -50913, 6158, 45445, 65839, 30432, 87787, 52521, 7099, -73908, -8309, 66290, 82534, 117811, 130860, 101420, 58436, 34415, 58891, 37018, -22151, 64593, 71508, -17531, -2238]
20523b238N1694L3538m7324l656J19396O4394q0304j62797q8962P284Q8020J11496
20511I0541l3757K9374N3924k6312j16589j6857n496N1731j0379m6843M408N2732
20499B6477K1445j9763k8047K8096L8480N1979n0939o7700m6879o266O4481p907
20487C457l1384R725r117Q577N0308O2914J8203k2892k8136K8211J2956n8684
20475D4138J1830J605O655L9720K6019L3281n4184j17033j12799O7202M0859l2459
20463d5166l4514o5109M8430L1209K0144R1668j4996j16678k904N5839n0343j8985
20451a01405K4296K3755k3561M9526O6780J290p7576m0384m8596j7097N8180n3088
20439a37880K106K2875K2023j3660P0472K5232l0645M617L5332O3017l6061M3420
$$ y = [-2238, 49456, 82994, 35670, 32014, 151410, 215804, 135500, -27297, -116259, -108975, -20955, 90541, 56784, 86158, 140082, 113770, -2819, -19676, -25172, 26559, 16180, -30663, -26255, 26477, 47922, 28159, 112, 28208, 66688, 118667, 67728, 28, -46851, -53117, 11364, 3457, -27927, -18202, -27319, -18742, 31566, 94480, 112683, 89791, 61655, 89866, 102822, 44138, 55968, 57573, 64228, 103948, 129967, 163248, 109064, -7969, -120768, -53566, -12707, -45166, -79680, -144789, -96359, -65150, -45006, 46662, 31666, -85012, -87916, -32077, -82420, -101405, -77109, -53354, -76915, -27389, 39391, 40681, -36895, -77279, -125875, -142972, -84792, -137880, -135774, -112899, -90876, -104536, -34064, -8832, -39477, -34860, 472, 63489, 27428, 70848]
20427G0848R8588o7809j21557j02484L0165n24J6678O1252l8786J7987L2927o5277
20415f7992M3880N6221N6930k0351m2806R792m0320K019Q9313j916k3253o7707
20403f190m3000m357J9244l8184l3764K9633Q8471n039n896Q0734k9602m3042
20391I008K4998l9194o4228o2016m9270J05114K9315m719l4951k4015j46596k3055
20379b79609J22503R6218K8219o2410m4867J10811J26907k8101p9990o6819K477
20368g4661K6370K0298k9064N8127J2050N6740L6200k1661m4241J6781J5507l0850
20356D1596n785l4112p2154j2627P7577M5538o4513L5348o4660q9029K4908Q6624
20344c1289k4371M7300M6514o5817q029n2257N7795J14515k3431j2591k353k4999
$$ y = [70848, 169436, 101627, -19930, -122414, -92249, -92773, -76095, -14843, -53629, -35642, -2715, -67992, -24112, 32109, 89039, 68688, 25882, 35674, -4646, -2627, 86686, 84770, 61517, -6190, -49190, -53547, -34303, -72487, -106251, -76618, 11853, 6814, 918, 81652, 52050, 9008, 34006, -5188, -69416, -131432, -180702, -75588, -46273, -50992, -85943, -109958, -256554, -279609, -157106, -60888, -32669, -95079, -139946, -29135, 97772, 69671, -10319, -77138, -74661, -48291, -27993, -57057, 1070, 13120, 69860, 106060, 84399, 40158, 56939, 72446, 41596, 35811, 1699, -70455, -83082, -5505, 40033, -24480, 10868, -53792, -142821, -117913, -31289, -55660, -8360, 38154, -27663, -35692, -87949, -30154, 84361, 60930, 48339, 45986, 20987]
20332B0987P1806J01331n5114m3940j15621o7852L8007M5774J32921j5669n3751
20321E8879m9362O2127M3239m329K2389L4714r6859K1718j4316m4538N2091o295
20309G9458o2756n3075K4183m0192L6254l4088k5511N4696J56390o1194r0829
20298a6664M0249M5682l2926J0253l3291k421m9469j8868q32p6863P254P5328
20286e2568N5238j1549p7467j6941l3930M0302Q2039k5360N5473L8149K8153K8223
20274A09762l6624m9738L1022M9416N564o6663k9033N6325J4621r1749q8981K6824
20262f9254Q1582r0782n7201J5884L4767j4318M2635J9000J2566J0167m1180M4463
20250a1671Q7124j2969o5751L9863j4200L283k181n6118l7022M1596K5631L626
$$ y = [20987, 92793, 194124, 139010, 95070, -20551, -88403, -50396, -4622, 128299, 112630, 58879, 9517, 71644, 114883, 110554, 132943, 167657, 70798, 92516, 78200, 33662, 85753, 79458, 16702, -36373, -12190, -52382, -16128, -50216, -75727, -21031, 135359, 74165, -16664, 23585, 69267, 36341, 46594, 13303, 10882, -38587, -57455, -58287, -135150, -127896, -52568, 2670, -8879, -86346, -103287, -137217, -96915, -14876, -40236, 15237, 53386, 81539, 109762, 73138, 23400, 54422, 103838, 109402, 42739, 13706, 70031, 84652, -7097, -96078, -69254, 12328, -78454, -135655, -119771, -85004, -99322, -56687, -37687, -25121, -14954, -56134, -11671, 75453, 62484, -3267, 36596, 22396, 25679, 23498, -32620, -69642, -28046, -2415, 1211]
20238A211q547k3232L6297l4723J5509L7218o1505J1017Q9112M2814j859j5571
20226H7741j13535j09370L6655L4067R6152J8695Q228O869j9094k8480Q450J21598
20214A47976m397j1689j54561j25272P7328J27347K0325m5262m0861L0516m5631
20203b4181N8399R8851k5105K1514j4431L9196n1492p2666K7785N2862O5932k5548
20191A51116l6171k5450m3239N7049N079L2545K7380n704m0012o8626q592m7871
20179b496J149N7653L71p1566m3833L6841K8040R408j9796m9362m5679M7995N4310
20166C035J9932J00801J5752j5759j5177r3481J1727j0476o0044J2487P7344O9843
20154A15984M5002l2417K2672M132m5654j4759j6374K1646J09976P5843J02067
$$ y = [1211, -7336, -30568, 5729, -28994, -13485, 23733, -37772, -26755, 62357, 105171, 103312, 87741, -25794, -135164, -98509, -64442, 31710, 50405, 58633, 65502, 46408, 17928, 26378, 147976, 143579, 131890, -22671, -147943, -70615, 56732, 77057, 31795, -9066, 21450, -24181, 34218, 133069, 107964, 129478, 115047, 154243, 102751, 30085, 57870, 110732, 176664, 151116, 114945, 89495, 46256, 103305, 108384, 140929, 168309, 162605, 122593, 53967, 45375, -2496, -1347, 56306, 56677, -14889, -58722, -21881, 6159, 15567, -4229, -53591, -99270, -51275, 3035, 22967, 123768, 139520, 123761, 108584, 15103, 26830, 16354, -43690, -31203, 46141, 115984, 160986, 128569, 151241, 155373, 109719, 94960, 78586, 100232, 210208, 286051, 388118]
20143C88118J32353J64893L05444M27929J59568l02699l72643l03825j18833P3833
20133E54138j8169q526N325J9037J28918K09104K75592J92232j39573j60682k8579
20122A028817O5057P0575j12776k24215j28816k07952k25947q0798K9193K7253
20112B40391j7366p4494n6966l9157l1116M0701R2369L6051j3065P0987k93k0249
20100B27793m7507M7220J32766J9093m1166N748j8540j14901k1410O6041J7753
20089B72890P5130J36231J90547J51600L32579N03100K07973k88190l99619k45983
20079I36258r5481R5931J56355J29860k0154j75837p6027K32649K46011M7525
20069A477090l34894l13628k13342j24003j42353q7847o8333m4789O9244j8076
$$ y = [388118, 520471, 685364, 990808, 1418737, 1578305, 1275606, 902963, 599138, 480305, 554138, 535969, 527443, 532768, 551805, 680723, 889827, 1165419, 1357651, 1218078, 1057396, 1028817, 1093874, 1164449, 1051673, 827458, 698642, 490690, 264743, 183945, 213138, 240391, 223025, 148531, 91565, 52408, 21292, 61993, 154362, 190413, 177348, 248335, 248042, 227793, 180286, 227506, 360272, 379365, 338199, 343947, 325407, 210506, 189096, 255137, 272890, 348020, 484251, 674798, 826398, 1158977, 1662077, 1870050, 1581860, 1182241, 936258, 840777, 936708, 1093063, 1222923, 1202769, 1026932, 950905, 1183554, 1429565, 1477090, 1142196, 828568, 615226, 491223, 348870, 261023, 192690, 147901, 217145, 199069]
20059A99069n1987j8950J1191o9728p4879k3480k1072O0458R8279j235N435m5964
20047F7137j3694k921O2270J6214o795N6294m7339j6049m8630J7838o9225L5242
20035E0342M5782p936K3496N0769n659j1018o315J01416N984j24785O731L9221
20023A68028k1644n7760j7991K0652J3353q559Q114P0804l6341O3120R0451j1408
20011B80819n7777j05178k8826L7213J7117J5765L7413l0773l3017J2973Q436
20000A54165K955j0787q0813N8825j5540O112o358J6275j9033j9421q5033K9623
19988C0970J8978p1752N1903N7278M4153j03630k9526R598l386L4117N0784J1551
19976A01038N2120o9412p3477n6242N6772J14525K1107q5831q9089j2675R7544
$$ y = [199069, 147082, 128132, 139323, 69595, -5284, -28764, -49836, 10622, 108901, 107666, 113101, 67137, 53443, 50522, 112792, 129006, 122211, 178505, 131166, 115117, 66487, 84325, 15100, 50342, 96124, 88188, 111684, 162453, 156794, 145776, 139461, 240877, 246861, 122076, 128807, 168028, 146384, 88624, 70633, 91285, 104638, 96079, 104193, 174997, 138656, 201776, 292227, 280819, 223042, 117864, 89038, 126251, 143368, 159133, 196546, 165773, 132756, 145729, 154165, 157120, 146333, 65520, 124345, 108805, 114917, 108559, 124834, 105801, 86380, 1347, 30970, 49948, -21804, 30099, 87377, 131530, 27900, -1626, 7972, 4586, 38703, 89487, 101038, 153158, 83746, 10269, -45973, 10799, 125324, 146431, 60600, -28489, -41164, 56380]
19965E6380K4305n3128j12867P5459Q9919p1850r033K0466M6294N1707m5131r6093
19953b3572j06095k9019N7220J38567M5651J8147j064k0610k5439N1340J2533
19942A17659k8556n0555j1475J45246M5822N6852j5366m4171l5611J9563k0479
19931A78929l8001M0661j25883o2137L7299M7132K844l3886J9635r5731R900J41910
19919A22672M6975L7367R8979P5550J4993l654K2748m1429j17469j57388l6235
19908F3109J4358R5231n7426k0644l3247p2079r654M2125l9981M6820M298L5346
19896F8256j8925L6593J04405n8995r7075L559L2484J9184M1547n8985l2785O7848
19884A07111M6752m3388j59095j6457O1894j1016J4533J24633Q799O365k3976
$$ y = [56380, 80685, 27557, -85310, -9851, 80068, 8218, -815, 19651, 65945, 117652, 72521, -23572, -129667, -158686, -101466, 37101, 82752, 100899, 99835, 79225, 53786, 105126, 117659, 89103, 38548, 27073, 172319, 218141, 274993, 259627, 215456, 179845, 199408, 178929, 140928, 181589, 55706, -6431, 30868, 78000, 80844, 46958, 66593, -29138, -19238, 122672, 169647, 207014, 305993, 381543, 396536, 392882, 415630, 374201, 256732, 99344, 63109, 77467, 172698, 115272, 94628, 61381, -10698, -20352, 21773, -18208, 28612, 32910, 68256, 49331, 85924, 190329, 131334, 34259, 37818, 70302, 89486, 131033, 72048, 39263, 107111, 153863, 110475, -48620, -65077, -3183, -14199, 334, 124967, 133766, 140131, 116155]
19873A16155J842r049m0038l1451K0428N3685p1269K5033l800l0845R650M8600
19861H8941J01384N9925K1953n273R344n0k2233M7330k6750r9184r531K1165k4855
19848A62166l0677l7060L6854k2701m0982P256R2862P5996J6640q0923j913J5225
19836A92743l0240L1105l2105L0315J1139l1448k7975K8806Q1767q4012j07433
19825F2662j5982N5763j7293J02241j6286n6603q4225m7916k5856Q0867J30725
19814A68097K9958l3182k5632J4419j1371m6452J07013J09242l0847l3591K3323
19803B70977j9043L8275J01616J8698j02771j0091M0939P4523l6787n0674P1701
19792C97363P6590K9501j15243l0499J4859k3543K5534k5775Q073M2587p9114
$$ y = [116155, 117997, 108948, 68910, 37459, 57887, 111572, 40303, 65336, 61536, 30691, 40341, 88941, 190325, 250250, 272203, 266930, 276274, 276224, 253991, 301321, 274571, 175387, 165856, 187021, 162166, 131489, 94429, 131283, 108582, 67600, 74856, 167718, 243714, 260354, 179431, 177518, 192743, 162503, 193608, 161503, 191818, 202957, 171509, 143534, 172340, 254107, 170095, 62662, 46680, 102443, 85150, 187391, 171105, 114502, 30277, -17639, -43495, 37372, 168097, 198055, 164873, 139241, 153660, 142289, 95837, 202850, 312092, 281245, 247654, 270977, 251934, 290209, 391825, 410523, 307752, 297661, 338600, 413123, 376336, 325662, 397363, 473953, 503454, 388211, 357712, 372571, 349028, 374562, 348787, 356860, 399447, 320333]
19781C20333m5205j8665L5700K6318r7756K9623R6115K6971r213k4444J3933M1293
19769C95003N2013J89381K44898J82762j960j00922j67923j71833P625Q8998K45966
19758I64008L22558K46187J12085j66686l67159k86837j06709m9189p8547p4436
19748E15275K0741m7558N9973J10594M8371m8811q1887o6602j49879j00403J6843
19737B76657K1805r180L5303N6917K346L6995n18N7203O1759j1933M0769N3382
19725F21505q002M519O1360J3418M5242Q8268K10627K35082K271k45058j36027
19714H93205j3774O9566L13278L54271M99517J35949l75422l66207j39642l5573
19704A335168L032J3229L8454J90799L21127K85745Q3311l25059m17663l71624
$$ y = [320333, 275128, 256463, 292163, 318481, 220725, 250348, 346463, 373434, 364221, 339777, 353710, 395003, 447016, 636397, 881295, 1064057, 1062097, 961175, 793252, 621419, 629044, 718042, 964008, 1286566, 1532753, 1644838, 1478152, 1110993, 824156, 717447, 668258, 589711, 515275, 536016, 488458, 548431, 659025, 707396, 658585, 576698, 510096, 360217, 259814, 276657, 298462, 289282, 324585, 381502, 383848, 420843, 420325, 477528, 539287, 527354, 568123, 621505, 613503, 618022, 679382, 692800, 738042, 826310, 1036937, 1272019, 1274290, 1029232, 893205, 879431, 948997, 1262275, 1616546, 2116063, 2252012, 1876590, 1510383, 1370741, 1335168, 1338200, 1351429, 1389883, 1580682, 1901809, 2187554, 2270865, 1945806, 1528143, 1156519]
19694A156519j90875p7880o6454o4940n1172j5483l7876N2907L0007j11529j6884
19683F06340L2192k3227J1463j82526k8831J08711M1369j6644O2211P4712L5453
19672G21223l5364L1558R8839R2337l0892j09437J3098L9713L9504l1495N8868
19661H87952M0129j3182j12057k4517L0093M5397q4795n615M6557O3071J3995
19650H87028M0504J13514J71282M2404k8681K2111L8005J185o1989n4030J42555
19639A313888J20465J16337N4765P4764R4254K6208J09082J08665J45349K07099
19629B370876J29711J44483Q8550J55223K26452K20718M87383P15849P44672M52945
19619E736862J32865K29068L80165K57315O1532K9338M00674Q08757J173638J548983
$$ y = [1156519, 965644, 887764, 821310, 756370, 705198, 689715, 651839, 704746, 734753, 623224, 606340, 638532, 615305, 626768, 444242, 415411, 524122, 565491, 548847, 611058, 685770, 721223, 685859, 717417, 816256, 908593, 877701, 768264, 781362, 821075, 860579, 829084, 887952, 928081, 914899, 802842, 778325, 808418, 853815, 769020, 763405, 809962, 873033, 887028, 927532, 1041046, 1212328, 1254732, 1226051, 1248162, 1286167, 1287352, 1225363, 1171333, 1313888, 1434353, 1550690, 1605455, 1680219, 1774473, 1800681, 1909763, 2018428, 2163777, 2370876, 2500587, 2645070, 2733620, 2888843, 3115295, 3336013, 3823396, 4539245, 5283917, 5736862, 5869727, 6098795, 6478960, 6736275, 6797807, 6827145, 7227819, 8036576, 9210214, 10759197]
19609A0759197J969092K677016M201297P247789J1513047J1930381L244255o954112
19601D6587962p049638j443176L447979Q364514J5129010K7275524N0475699Q5338078
19593B28125952R5950908L3647497m7067671n6157723l2392855k6273902l0799916
19586A65032290l8314446l1684171j5396744j069735J2134324K2617169J6512400
19579A29831087j0204474l1561265k8159156j7379843j0197777o263119m085870
19572B1979583k815542j841602j023794n85055k72924J01094N15568O90654J19427
19563A6867409n32291l78905J90730M72261N57838Q54685J738092L221261M952570
19554B7943650P759942J2630092K1092607L2454913L3943544R986676k1382825
$$ y = [10759197, 12728289, 15405305, 19606602, 26854391, 38367438, 50297819, 53542074, 46587962, 39538324, 38095148, 41543127, 49907641, 65036651, 92312175, 142787874, 228125952, 324076860, 357724357, 310656686, 254498963, 222106108, 195832206, 165032290, 126717844, 95033673, 79636929, 78567194, 90701518, 113318687, 129831087, 119626613, 88065348, 59906192, 42526349, 32328572, 26065453, 21979583, 19164041, 17322439, 16298645, 15713590, 15440666, 15541760, 16057328, 16747982, 16867409, 16335118, 15956213, 16146943, 16619204, 17177042, 18031727, 19769819, 22991080, 27943650, 35703592, 48333684, 69426291, 101881204, 135824748, 145811424, 124428599]
19547A24428599k7250426j4324284r16426J1829997K7629200M5966758N4353148
19540B21716566M9971210N3098573P3594692P4108547K241583j06366121j32840959
19533B35524091q3832275m4429758k4618870j3875485o086333J719945R503044
19526G3904359Q725501o084594j9788766j7605212j0459902o124624m091016k988172
19518A5487574k289124j790162j343465q06412m29388k19869l92680m38233j46262
19509G631979n7857l63684j002692j027448p67630n53509k52348k92191j99176
19500C115444j07180j07478k6865j71954j79495j09368q6308r3114j50429j18173
19490A965080j02321j03067J0228j16084m9590L3456m3163n9466N3359M5110K4036
$$ y = [124428599, 97178173, 82853889, 81937463, 93767460, 121396660, 167363418, 221716566, 271687776, 324786349, 398381041, 472489588, 474731171, 368365050, 235524091, 151691816, 107262058, 82643188, 68767703, 62681370, 64401315, 73904359, 82629860, 76545266, 56756500, 39151288, 28691386, 22566762, 18475746, 15487574, 13198450, 11408288, 10064823, 9258411, 8829023, 8609154, 8216474, 7778241, 7631979, 7574122, 7210438, 6207746, 5180298, 4412668, 3859159, 3606811, 3314620, 3115444, 3008264, 2900786, 2873921, 2701967, 2522472, 2413104, 2326796, 2233682, 2083253, 1965080, 1862759, 1759692, 1769920, 1653836, 1604246, 1637702, 1594539, 1535073, 1588432, 1633542, 1657578]
19479A657578n7886m5748p6012o5237l6316r5611q7091P0481m0980m3904m3849
19468A135425N813p0384N9078J62412J36807l4761j09873j42914n1854r3964j02095
19457H93690l953J4607k0718q7917l1433N846K1377K0508P4950k5473j02515q8484
19445F70485r4680K6216L9495o7325K810L3479N587O993L9952R6418Q9352j4472
19433H34310r9483j21183k3721L5545j1878M1980J14641K9491j7901J4776P651
19422H04228n5019O2294J6780K4008O3695q39n7728O3404Q6047p0944j62502o4778
19410G08646J31316P5195O2102n6304j51276r9440k9289m7787l9356o4696k7163
19399D61948o7727p3444J25620O1751o9681j06907l667p0762n7902N7567P0482
$$ y = [1657578, 1599692, 1553944, 1477932, 1412695, 1376379, 1280768, 1193677, 1264158, 1223178, 1179274, 1135425, 1141238, 1070854, 1129932, 1292344, 1429151, 1394390, 1284517, 1141603, 1089749, 995785, 893690, 889737, 904344, 883626, 795709, 764276, 770122, 791499, 812007, 886957, 861484, 758969, 670485, 575805, 602021, 641516, 574191, 577001, 610480, 616067, 623060, 663012, 759430, 848782, 834310, 734827, 613644, 589923, 625468, 613590, 655570, 770211, 799702, 781801, 796577, 804228, 749209, 811503, 828283, 852291, 915986, 915147, 857419, 920823, 1006870, 935926, 773424, 708646, 839962, 915157, 977259, 920955, 769679, 670239, 640950, 593163, 553807, 489111, 461948, 394221, 320777, 446397, 508148, 438467, 331560, 327893, 257131, 199229, 256796, 327278]
19388C27278m9513q610j01340k1692M7292J23708K9173J6989N3533N1162k2807
19377D45173O691J5787n4325k8184J9561M4894r20l0132N4441R9290P837K5928
19365F06041j6598N7483J4489k2306p8585n3612k6511J1306j7779L2095O8918
19354E74941P5966m7883o0517M9734K9510j00081J226L7682j9083j7057p9293
19343D45145L5419L2475K4393j09320j00430m40O5841O8265j5545j0043l3005
19332D02755p9752l7272L4668J5311Q6355K6012r2673O8091m4501J6578J4234
19321D09806k0237j0164K5383N674J37729O0355j9603p7431Q0602K1822j2799
19310F01137m1896m3993J7086K6954M072N3157q054r4755p8448j5672J10935Q4208
$$ y = [327278, 277765, 269155, 167815, 146123, 193415, 317123, 346296, 363285, 416818, 467980, 445173, 451864, 467651, 413326, 385142, 404703, 449597, 448677, 418545, 472986, 572276, 580113, 606041, 589443, 646926, 661415, 639109, 560524, 506912, 480401, 491707, 473928, 506023, 574941, 650907, 603024, 542507, 592241, 621751, 521670, 522896, 560578, 541495, 524438, 445145, 480564, 513039, 537432, 428112, 327682, 327242, 393083, 461348, 445803, 435760, 402755, 323003, 285731, 320399, 335710, 422065, 448077, 355404, 423495, 378994, 395572, 409806, 389569, 379405, 404788, 410462, 548191, 608546, 588943, 511512, 592114, 613936, 601137, 559241, 515248, 532334, 559288, 563360, 616517, 608463, 513708, 435260, 419588, 530523, 614731]
19298F14731Q2188P5960L4290n3115m61N4398M0984L9628l2278K6319m3765q2104
19286G56775R0538L2025p4566q9118J053J42779O5948K20O0042L9965o7712P0774
19274A028723J45823R5773k436P6854K4201L5481R8032Q1094k4573l5084K0304
19263A544192P4259P8904J24562P6740J53706K11213J63684J99756J25021R1507
19253B843544J4282O5284K70902K77303L47114O58102Q65166J208224J183290
19244G733211O61440J73724P4383q5303j70888N1936L41274O82519J034128J602926
19234A2099350K298901L104743L543005M198232O615834J1607861J7927895J6185182
19226G7581003J111225j2060033q992015j23089P507732J6544484L1408386N8164070
$$ y = [614731, 696919, 772879, 807169, 754054, 753593, 807991, 848975, 888603, 856325, 882644, 838879, 756775, 847313, 879338, 804772, 715654, 716707, 859486, 925434, 925654, 985696, 1025661, 957949, 1028723, 1174546, 1270319, 1267883, 1344737, 1368938, 1404419, 1502451, 1583545, 1558972, 1523888, 1544192, 1618451, 1697355, 1821917, 1898657, 2052363, 2263576, 2427260, 2627016, 2752037, 2843544, 2857826, 2923110, 3194012, 3471315, 3818429, 4476531, 5341697, 6549921, 7733211, 8394651, 8568375, 8642758, 8557455, 8386567, 8438503, 8779777, 9462296, 10496424, 12099350, 14398251, 17502994, 21045999, 25244231, 31860065, 43467926, 61395821, 77581003, 78692228, 66632195, 57640180, 57517091, 65024823, 81569307, 112977693, 171141763]
19218A71141763J01275191J33525382Q2404288l0584560q6409429o5186697m6903433
19211B59262505m9442075n7181927m3022868k1973845p091736N372949J8964131
19204A04887134K8342258J5822939j6884124l6608547k9763422j8101582j1043895
19197C6650761p130732m773061l311825k318688j498171q11158k11195K35291
19189A6831222N11299M65662j72487n79820l44874P7980J15840J99342O33393
19180A7737557J632516K809060M542978P435410J1948729J9957764K9838442K7438243
19172A23340699K738498k2415293k1902757q281638N196760J9979848L5588720
19165A34244837L8776226K9288409K6797141M1372602N8390764L0489767n4131009
$$ y = [171141763, 272416954, 405942336, 488346624, 457762064, 371352635, 306165938, 259262505, 209820430, 152638503, 109615635, 87641790, 80550054, 85923003, 104887134, 133229392, 149052331, 132168207, 95559660, 65796238, 47694656, 36650761, 29520029, 24746968, 21435143, 19116455, 17618284, 16807126, 16595931, 16831222, 17342521, 17808183, 17635696, 17055876, 16711002, 16788982, 16904822, 17104164, 17737557, 19370073, 22179133, 26722111, 34157521, 46106250, 66064014, 95902456, 123340699, 126079197, 103663904, 81761147, 73479509, 78676269, 98656117, 134244837, 173021063, 202309472, 229106613, 270479215, 328869979, 359359746, 305228737]
19158C05228737j04421770p6280897m1052958k2479429j2975971p009849k076179
19151C8931684L193526P706420N007318n603355j2738088r976569n487678l356517
19143A7676741k804433k583355k027098j451225j132769p48721l93140j66615
19135F369385j12185p5404j82330j54070k73784p56106p54644n85635l13898j68882
19125B992447k37889k88601j14489q5294j5810N2758j29722k06883j62640j51302
19115A652575n3561p4448p5515o1987k4835j04343n2685k2937R043J1136j736
19104A200707j8545l8770m9266P9802M3734n8744j30363l3938Q5501L9579o3271
19093A056426j20621k4880N7432L9350P5086J2300O279p2966r6999r507o8498
$$ y = [305228737, 200806967, 124526070, 83473112, 60993683, 48017712, 41007863, 38931684, 42125210, 49831630, 54838948, 49235593, 36497505, 26520936, 21033258, 17676741, 14872308, 12288953, 10261855, 8810630, 7677861, 6929140, 6536000, 6369385, 6257200, 6181796, 5999466, 5845396, 5571612, 4815506, 4060862, 3475227, 3161329, 2992447, 2754558, 2465957, 2351468, 2266174, 2250364, 2303122, 2173400, 1966517, 1803877, 1652575, 1599014, 1524566, 1449051, 1387064, 1362229, 1257886, 1205201, 1182264, 1191307, 1202443, 1200707, 1182162, 1143392, 1094126, 1173928, 1217662, 1158918, 1028555, 994617, 1080118, 1119697, 1056426, 935805, 910925, 968357, 1007707, 1082793, 1095093, 1101372, 1028406, 931407, 921900, 853402]
19082H53402r2466n0869k7684R6069l044J2718J298n744r0825r1807J3876j4187
19070F00737j3907L7252N810k2383r8430J2201N4149m0311l5834N5150J7692j52787
19058D19339j4698Q8455K5528K5887L5659p252J19106J55579J22088K23248J59644
19047A352583K26882L21262L1222k10241j88880m5495K5919J09943K73851o30
19037A896416q7547j226K45162L78660J52369k79148n31523m55733k49535k09591
19027H58304j37909j54301J8919J72212J24056j4763p5875j04737j40240p9736
19017D65930n3568m4684j5486J28434O7109l4399o8677k1987J7414r7072l9388
19006C03626M0364J07018R6568n5666j9151P0879J8777l8516O1201Q1549R4160
$$ y = [853402, 760936, 710067, 682383, 778452, 775408, 788126, 789424, 783680, 692855, 601048, 614924, 600737, 586830, 624082, 629892, 607509, 509079, 521280, 575429, 535118, 499284, 554434, 572126, 419339, 404641, 493096, 518624, 544511, 580170, 572918, 692024, 847603, 969691, 1192939, 1352583, 1579465, 1900727, 1931949, 1721708, 1532828, 1487333, 1513252, 1623195, 1897046, 1896416, 1808869, 1807643, 2052805, 2431465, 2583834, 2304686, 1773163, 1317430, 1067895, 858304, 720395, 566094, 585013, 757225, 881281, 866518, 790643, 685906, 545666, 465930, 412362, 367678, 352192, 480626, 547735, 513336, 444659, 422672, 440086, 343014, 303626, 343990, 451008, 547576, 491910, 472759, 543638, 562415, 523899, 585100, 666649, 760809]
18995G60809J6930L8819R380O3893J78416J66248Q1456q5585j14551j08113k16137
18984G91565q9724j7560l0721P8555O2837R4162J52995J53682m2556k49591l33366
18973E70278j65537n3240l5279q3258o3969n3640K2068N7351k8068p43L5168O8883
18961B70014l0840r601m8971N8766J20523j22333l0728k2149N266l0001k2649
18950A37297n872j4811o4699n7630K677L6637Q6761J07484J8426L1441L4347p1297
18938B40761o3763J1452l0956j05134j19651L8660K5289P0146K5701l8976R8169
18927A51698J26419M9839o6331j05477o9428m9168N290O746J7429j340M4217k4297
18915H5597m1074j329J7629J00122K3572n7185K9159m7690l9540l013J8138N3641
$$ y = [760809, 777739, 816558, 825938, 889831, 1068247, 1234495, 1315951, 1230366, 1115815, 1007702, 791565, 701841, 684281, 653560, 732115, 794952, 889114, 1042109, 1195791, 1153235, 903644, 570278, 404741, 351501, 316222, 232964, 168995, 115355, 137423, 194774, 166706, 165963, 201131, 270014, 239174, 229573, 180602, 239368, 359891, 237558, 206830, 184681, 189947, 159946, 137297, 131425, 116614, 51915, -5715, -3038, 33599, 120360, 227844, 246270, 277711, 312058, 240761, 176998, 188450, 157494, 52360, -67291, -28631, -3342, 66804, 92505, 53529, 151698, 278117, 327956, 261625, 156148, 86720, 37552, 42842, 49588, 67017, 65677, 109894, 85597, 44523, 43194, 60823, 160945, 184517, 127332, 156491, 108801, 69261, 66248, 84386, 138027]
18903A38027J8352J06j26615n5635L5113R523J1902K9477k4900r34J2224m6326
18891C14l4960J3794Q1021O5722K0066j10412N460L0537j3695l8823L2191K2665
18879G3880j811L843K4806k8797k6436N6459k849p2810p9892l2765m4713M2604
18867h8481O5202K685K7431k8582p9618J2902P1819q085j03830L3283J01543Q8651
18855I4920j754j16723M1323L6529N918P927K2597l2572m1265l3830J1501J10508
18843A05079J07328N1025L4168N0489Q006j3920l9341q8093j19134m808k7278
18832F3521n2916j0355N1761K6496P5414L479o3150j19069k8410J4479L8474L5522
18820C5246K7196L9672l0570P7007N3153K5397l3612k8737l4634O322l2275r9790
$$ y = [138027, 156379, 156485, 29870, -25765, 9348, 18871, 30773, 60250, 35350, 34416, 46640, 314, -34646, -20852, 60169, 125891, 145957, 35545, 41005, 71542, 57847, 19024, 51215, 73880, 72069, 75912, 100718, 71921, 45485, 101944, 99095, 26285, -53607, -86372, -131085, -88481, -23279, -20594, 6837, -21745, -101363, -88461, -16642, -24727, -128557, -95274, 6269, 94920, 93166, -23557, 17766, 54295, 60213, 68140, 90737, 58165, 16900, -16930, -5429, 105079, 212407, 263432, 297600, 348089, 356095, 342175, 302834, 214741, 95607, 90799, 63521, 10605, 250, 52011, 78507, 153921, 157400, 94250, -24819, -53229, -38750, -276, 35246, 62442, 102114, 71544, 148551, 201704, 227101, 193489, 164752, 130118, 136440, 104165, 4375]
18808D375m9915k2484Q397J9997K9820J4460N0531R5299j2439j11775r6750l7754
18796a08238N5087J9328n0257J20214P4035m0150o3464m48K1719M5699J02955
18785A76480n2458k3418L6752n3076p5339n4242o5208R097L9902J38709Q3677
18774A60876m4117o6760k2215P4472J19495J03386J16784L31403L72397r829l34177
18763H01715l05063j15481m4638N171M8243o9260l7635l3894l3641n3080j6748
18752A45689J2925o575j00200l6848K0468l5802J0538J06474L9293n6103l8993
18741F0866n0572P919Q18K5827k687k3618k5217o314j5427k8170N11M8195M6732
18728C8863L3314M5095N6774m7274k1625J7948j51910k5900P9096j2951l2976
$$ y = [4375, -45540, -68024, -59627, -39630, -9810, 4650, 55181, 150480, 138041, 26266, -70484, -108238, -53151, -33823, -84080, 36134, 110169, 70019, 6555, 6107, 27826, 73525, 176480, 124022, 100604, 137356, 84280, 8941, -45301, -110509, -101412, -61510, 77199, 160876, 116759, 49999, 27784, 102256, 221751, 325137, 441921, 773324, 1145721, 1135892, 801715, 496652, 381171, 336533, 341704, 389947, 320687, 283052, 249158, 215517, 162437, 145689, 158614, 152039, 51839, 14991, 35459, -343, 10195, 116669, 155962, 99859, 60866, 10294, 18213, 19031, 44858, 42171, 18553, -6664, -12978, -28405, -56575, -56064, -7869, 38863, 72177, 117272, 174046, 126772, 105147, 123095, -28815, -54715, 24381, 11430, -21546]
18717b1546M710j1404O978L3777m4322K4968Q5980M6181l6635p010j2872J5885
18705H4690M3885l1790k3741l8419J8872l3286j3940Q1691P4467N7747J8915p2671
18693A66420n6123j4422K3849Q5966N5333k8599O6422K06429J85943N226m9321
18682F47123L6647R1368Q4917J72748K26962L490k15938k33192L9193J70523K83766
18671A307607K54721J44817P1472P3637j66358m16545m41829k58467j70945n1253
18661C46857l5550j12346m6426L5784L1596J8603J42391J13720j9029j05613o7179
18650C02808n658k0204l5799j9281J2267m1908j5629J5374k2455m9223m8715N0294
18638A21871K3080k6240P6195R2092N5756J74089J87909K44867K65912K17337
$$ y = [-21546, -16836, -28240, -21262, 12515, -31807, -6839, 79141, 125322, 88687, 81677, 68805, 84690, 128575, 96785, 73044, 34625, 53497, 20211, 6271, 87962, 162429, 220176, 239091, 166420, 110297, 95875, 119724, 205690, 261023, 232424, 298846, 505275, 691218, 696444, 647123, 683770, 775138, 860055, 1032803, 1259765, 1263255, 1047317, 814125, 853318, 1023841, 1307607, 1562328, 1707145, 1778617, 1852254, 1685896, 1269351, 827522, 569055, 398110, 346857, 311307, 198961, 152535, 188319, 219915, 238518, 380909, 494629, 475600, 369987, 302808, 297150, 276946, 241147, 221866, 234133, 192225, 176596, 191970, 169515, 120292, 71577, 121871, 144951, 118711, 194906, 286998, 342754, 516843, 704752, 949619, 1215531, 1432868]
18628A432868N4238j62096j71280j21337k9576J36154J33408j34046k79334j55140
18618G03859r9348q8743j2334P0111J43236K89938K68078J42546o394l75095m03551
18607F32303j35105p0554l5139o3652j26642j24008l5356K6584K6232K2076m6048
18596G0691K6186J6554j3819j74708p0008O9307n812o684L4473R7967N3441j0942
18584H6646k2197o2784N5183O9563l267m3326M3730M4575K4220m6693l825O5587
18572B07412l4673m4897l4146o4936L146J2233R266Q7217M3379m1595k0716m3999
18560G7691j34005l6088J14038J25218j6971r8255o3937r175J8355N5607l4629
18549b151L3507q6174l8776P4003K9957K2573K1557L8094R3695l111j25922m1102
$$ y = [1432868, 1487106, 1325010, 1153730, 1032393, 1002817, 1138971, 1272379, 1138333, 858999, 703859, 604511, 515768, 503434, 573545, 716781, 1006719, 1274797, 1417343, 1410949, 1035854, 632303, 497198, 426644, 391505, 327853, 201211, 77203, 41847, 68431, 94663, 116739, 70691, 96877, 113431, 99612, -75096, -145104, -75797, -81609, -88293, -53820, 44147, 97588, 86646, 64449, 1665, 56848, 126411, 123144, 79818, 123548, 168123, 192343, 145650, 141825, 207412, 172739, 127842, 93696, 28760, 31906, 44139, 53405, 140622, 184001, 142406, 121690, 77691, -56314, -92402, 21636, 146854, 129883, 31628, -32309, -41484, -23129, 32478, -2151, 31356, -54818, -93594, -19591, 10366, 32939, 54496, 92590, 186285, 183174, 57252, 16150]
18537A6150k1920J6281J3335k4625j6253k3727J6727K9142O9595Q6407k7024J6908
18525A50996L8788n6251K6414k7950l0417o3626m5092J15555P3561m214j5741
18514A62023j3442l0303j58772J6082J9458r172m0865l3117m6282j9095M6450
18503a07035N9277J7618p9137K2048L4066o82M4972K8309O064J2396j6349M3785
18491F5332l0036n8232j1834L0311M1660P0814N4967k1002q4203m3342o7117q7417
18479a40099o940L7004O0055l2178J09718J10700K737J6142P2264K4558O3600
18468C17561O7129M2440M8386p5133r9051j61019j28217l6002M9421J03041N652
18457A34208j3875k1815j3678N9944N4663O1190J4842q9554o6146m4177j7141
$$ y = [16150, -5770, 10511, 23846, -779, -17032, -40759, -24032, 5110, 74705, 161112, 134088, 150996, 189784, 133533, 159947, 131997, 101580, 37954, -7138, 108417, 181978, 177764, 162023, 148581, 118278, -40494, -24412, -4954, -14126, -54991, -88108, -134390, -153485, -107035, -47758, -30140, -109277, -87229, -53163, -53845, -8873, 19436, 25500, 37896, 21547, 65332, 35296, -22936, -34770, -4459, 37201, 108015, 162982, 141980, 57777, 14435, -52682, -140099, -147039, -110035, -49980, -82158, 27560, 138260, 140997, 157139, 229403, 253961, 317561, 384690, 427130, 475516, 400383, 301332, 140313, 12096, -23906, 25515, 128556, 134208, 120333, 98518, 84840, 144784, 199447, 260637, 275479, 185925, 119779, 75602, 58461]
18446E8461M859l5346q002j8946k0269J7341M9116n2296r6417j04286q9171L0128
18434b64828N9292J18574M6410N4262J67250M4174m3654o7688q8209j6633M5124
18423E4074J2514J3486O098l3737r8325K1747j8407J04348L9874p408N4133M9166
18411A97563Q3674N8289p8644j30254p652q6030q9119k1506J8280L7040P8236
18400E9877q107m2115m7023K0498O6633n0867R875R1537l323p4555p3142k7192
18388g7904M7102J8531r774N8776R7220L8451q2961j8540n838l3220o851N3053
18376G8045p3247j33755j0369L2067O6323k3438j7863J888L170j5277M4015m1033
18364h9474o1774l4775N9686J42094R9503M459j6884J8215M8649O3403N5743j26966
$$ y = [58461, 63320, 27974, 19972, 1026, -19243, -1902, 47214, -5082, -101499, -205785, -294956, -264828, -205536, -86962, -40552, 13710, 180960, 225134, 181480, 113792, 25583, 8950, 54074, 66588, 80074, 86172, 52435, -45890, -24143, -42550, 61798, 101672, 94264, 148397, 197563, 281237, 339526, 260882, 130628, 122976, 36946, -52173, -73679, -55399, -18359, 59877, 51770, 9655, -37368, -16870, 49763, -1104, 8771, 100308, 96985, 22430, -50712, -77904, -30802, -12271, -22045, 36731, 133951, 172402, 89441, 70901, 65063, 31843, 24992, 78045, 4798, -128957, -139326, -107259, -40936, -64374, -82237, -80349, -77179, -92456, -48441, -89474, -151248, -186023, -126337, 15757, 115260, 119719, 102835, 121050, 169699, 233102, 288845, 161879]
18352A61879r2721p1752l8618l930j5754R9310N861q4173m9817L2875O2629j0066
18340d277L2811j7458n5998M4608R0015K7820n8017K4491L3819p3835q154L4073
18328F9898j0702r0463k6493J23593Q8912o7538j35953m9285m8432K0733L7917
18317h7813j428n1817k5749M4790L4721o9607n550J02789J4596o9541M3566L2721
18305c8322M0191k0709L8761l772k0842m0391l4669L232N3136p420r1819K1341
18293a01283M4178M6520k2826J0824K2508m2793j09468l3472J7273l963l8912
18282b11414o827O7915Q8289j4623O237l5467L3905K3902J5309K7050N3642J2316
18270F0234J1911j06507o8464j9510J0313J60796N3658o2685j19693K211R8214
$$ y = [161879, 69158, -2594, -41212, -45142, -60896, 38414, 44275, -39898, -89715, -56840, 5789, -4277, 28534, 11076, -44922, -314, 89701, 117521, 59504, 83995, 117814, 43979, 35825, 69898, 59196, -31267, -57760, 65833, 154745, 87207, -48746, -98031, -146463, -125730, -87813, -89241, -141058, -166807, -122017, -87296, -156903, -162453, -59664, -45068, -114609, -71043, -38322, 1869, -18840, 19921, 16149, -4693, -45084, -79753, -76521, -23385, -30805, -122624, -101283, -57105, -10585, -33411, -22587, -79, -42872, -152340, -185812, -168539, -172502, -211414, -218241, -150326, -62037, -76660, -70423, -105890, -71985, -48083, -32774, -5724, 47918, 60234, 72145, -34362, -102826, -122336, -112023, 48773, 102431, 39746, -79947, -77736, 20478]
18259B0478L9826m0637l3796n4291j1277m686O617Q2498m1890j45678M1966R1995
18247d8875N2293j7139n698M8632K7238J8127O4444o0523N4311J0318j20227l0836
18235g935M5178j2368l4928l6863j8132Q154J33965P9323m0239L540o0615p1221
18223a2141M1927n2528j7022p6400J1131O812j8747M5217P0738L6526N9688M0976
18211A36177N0423m4807o7610n567r8515q7889N7269R0743Q6321M664m8543m3185
18199B9481o2676j4023J8324j8382n8206j1795J3743P2342M8266Q5543J4758J5002
18187A32377Q6499o4202k0382M996L6044o4822o1604J4285J14422o1320q7943
18176B8350l2676K8114j1255j6175L6347P5513P672p1422j9566j843N2045R2856
$$ y = [20478, 60304, 19667, -14129, -68420, -79697, -84383, -77766, 4732, -37158, -182836, -140870, -48875, 3418, -13721, -19419, 29213, 56451, 74578, 139022, 78499, 132810, 143128, 22901, -7935, 37243, 24875, -10053, -46916, -65048, -56894, 77071, 156394, 116155, 119695, 59080, -12141, 29786, -22742, -39764, -116164, -105033, -98221, -116968, -71751, -1013, 35513, 95201, 136177, 186600, 141793, 74183, 68616, -29899, -117788, -60519, 30224, 116545, 121209, 72666, 29481, -33195, -47218, -28894, -47276, -105482, -117277, -103534, -31192, 17074, 102617, 117375, 132377, 218876, 154674, 134292, 139288, 175332, 110510, 48906, 63191, 177613, 116293, 28350, -4326, 23788, 12533, -3642, 32705, 108218, 115890, 44468, 24902, 23059, 75104, 167960]
18164A67960L1425M9128J972K034J5973P4923M8743p2859l6344J0830P7567P37
18152C72089N6209J19626k5799r5245m3006J36821J37177M6628O0784k140Q6361
18141H49505Q9058j1990k8540j5712N8057M9574R3584M0274m8014N7814J46428
18130A280038J03613R4862J19853J0870Q4639J83880J80070L06910N05139N00279
18120C370153M56539N89723Q71406J206973J540700K165881L326867N127015Q591809
18111B7247066J5614745K9987537N3006421N6448585N086291n5995103n6248302
18104G5147240l0164434j5366191q758320n450038l398966k288911j764157j298061
18096F658162j107468q12624o36577l93448l07458l16778k25372k35839j86213
$$ y = [167960, 199385, 248513, 250485, 252519, 268492, 343415, 392158, 319299, 282955, 293785, 371352, 372089, 428298, 547924, 522125, 426880, 383874, 520695, 657872, 704500, 765284, 763144, 849505, 938563, 926573, 898033, 882321, 940378, 989952, 1083536, 1123810, 1075796, 1133610, 1280038, 1383651, 1478513, 1598366, 1609236, 1693875, 1877755, 2057825, 2364735, 2869874, 3370153, 3826692, 4416415, 5287821, 6494794, 8035494, 10201375, 13528242, 18655257, 27247066, 42861811, 72849348, 125855769, 182304354, 187390645, 131395542, 75147240, 44982806, 29616615, 20858295, 15408257, 12009291, 9720380, 7956223, 6658162, 5550694, 4738070, 4101493, 3708045, 3400587, 3083809, 2858437, 2622598, 2436385]
18087B436385j50056k47673k60454k40680k12163k01147p1920j22767j25077j59078
18077F45370R549P457O0918Q9331M447J427L0962r949j10244p3810p5738q7030
18065D92690l8620R2378L8833j8523l4095j0575P0446J72645K69374J24974P7958
18054A237485O6704Q1815j592j28363j29752j00377j01259j31063p5526l3600
18044F84472K8924m1097j07542j18450q8859n873m7220l7697M600k3569J2478
18033B60167O7257L3724j2858j2767p9162q4491M1919K6522J7966l7535p6117
18022A44625m6077k5505L6785Q867n5895l3952n5326O1997Q4486N543M4008q28
18010A68728k9367O0285k7976R8496N9477k1496l2133j3K0623K6775J22502P7013
$$ y = [2436385, 2286329, 2038656, 1778202, 1537522, 1325359, 1124212, 1052292, 929525, 804448, 645370, 654919, 662376, 723294, 812625, 817072, 818499, 849461, 839512, 729268, 655458, 579720, 492690, 454070, 546448, 585281, 566758, 532663, 522088, 592534, 765179, 1034553, 1159527, 1237485, 1304189, 1386004, 1384412, 1256049, 1126297, 1025920, 924661, 793598, 718072, 684472, 713396, 672299, 564757, 446307, 357448, 351575, 304355, 266658, 271258, 247689, 260167, 327424, 361148, 348290, 335523, 256361, 171870, 213789, 240311, 258277, 220742, 144625, 98548, 73043, 109828, 118695, 62800, 28848, -26478, 35519, 120005, 125548, 169556, 168728, 139361, 199646, 171670, 270166, 329643, 308147, 276014, 276001, 296624, 323399, 445901, 522914]
17998E22914J44329J94797O8222j7172J28965K2944J9415J29626P3116J07765
17988A394921J33889R5564N1423M2821j331r4847q9765j21491q2193j48599p8820
17977A101572j36391j72279j57612r3121l4024o5017k5677l8288m1157j3056l1110
17966B93840l963o1304n5053M8116o7969N684K533L2277J2805K087K9116L5380
17954B73549P9507K1478Q1415J01817m5165j0720N9822L0118M7717M7827j5555
17943F71810q873m8802M8234Q1850k5653j8016k0566K460J6524j0141M4074J9356
17931G52257l6167m7165j15327j95941j63239L2609O4517j6533m1245p7505k3966
17920A32295p9114m2115J2199O052o0729P0059J05790M3286n1726n8784k8116
$$ y = [522914, 667243, 862040, 930262, 913090, 1042055, 1064999, 1084414, 1214040, 1287156, 1394921, 1528810, 1624374, 1675797, 1718618, 1717287, 1622440, 1532675, 1411184, 1328991, 1180392, 1101572, 965181, 792902, 635290, 542169, 508145, 443128, 417451, 379163, 338006, 324950, 293840, 289877, 228573, 173520, 221636, 153667, 159351, 161884, 194161, 206966, 209053, 238169, 273549, 353056, 374534, 455949, 557766, 512601, 501881, 561703, 591821, 639538, 687365, 671810, 662937, 614135, 662369, 744219, 718566, 700550, 679984, 682444, 698968, 688827, 732901, 752257, 716090, 668925, 553598, 357657, 194418, 227027, 291544, 275011, 233766, 156261, 132295, 53181, 11066, 23265, 29317, -31412, 38647, 144437, 187723, 135997, 77213, 49097]
17909D9097m7857M471j6601R6641O1772J9576K5201k0233n8603p3543r137K4126
17897E4910j4107J10747R3083j42999o7459M2040N186k9277Q5283n839r3239L8667
17885G6996q0160Q461P6700R5002N005j8335O230m3505j8985k2224l2323l472
17873D9390k9279k9889L430L0644N6592j4282o0237J8497J0057L1126p3728m4264
17861e1943L3111K8571p7706L5316M010N5363J04719J591n6833l381j968N988
17849G6838r4032p5471J3412j1567m3039P9365K1207n7890k3255K3800R4129J9001
17837B2498q4707O114M0171N9117o6455l0622n0844J4546J02573O9975o1195m2818
17825b1647k8804q927j797J9977M9182J3443l4462k9976L131P9573L0073J799
$$ y = [49097, 1240, 5711, -10890, 85751, 147523, 167099, 192300, 172067, 113464, 39921, 30784, 54910, 40803, 151550, 244633, 101634, 34175, 76215, 81401, 52124, 137407, 131568, 38329, 76996, -3164, 5297, 81997, 176999, 182004, 163669, 169899, 126394, 107409, 85185, 52862, 49390, 20111, -9778, -6348, 24296, 80888, 66606, 6369, 24866, 34923, 66049, -7679, -51943, -18832, 9739, -67967, -32651, -28641, 26722, 131441, 133032, 76199, 72818, 70850, 76838, -17194, -92665, -79253, -90820, -133859, -54494, -33287, -91177, -114432, -90632, 3497, 22498, -62209, -56095, -15924, 43193, -23262, -53884, -104728, -90182, 12391, 82366, 21171, -21647, -50451, -59378, -61175, -41198, 7984, 21427, -13035, -43011, -39880, 39693, 69766, 71565]
17813G1565j0299j6152P50n2527l2119j5970k4276n9803K5591O2804K8684O0503
17801C8751k7729n6838O7575P2348K9134p9654j4042o7675l0679m702m8522m416
17789a26449R3539O9107K7952l6498j8204O3502J1486J1078m5675n1217k2577
17778b3956j612l0465o3944J2495K8719K8970Q2638l2717j7135P978L3797N156
17766B9924m9995l4956n7240q0495k6776R3339J12220Q3643l5373J1953K0501
17755F6745r6236q328O4508J04306o7590k1050N5958r1671j3128j6169l9014p1951
17743a33620J8536K7650J6069P4172R871J5838N7963L0619j14243q1203J00013
17732B1665J15071M2960o0824k9605J2153m70m5110M0289m9091o9621l0251k9103
$$ y = [71565, 61266, 45114, 45864, -6663, -38782, -54752, -79028, -138831, -113240, -50436, -21752, 38751, 11022, -45816, 21759, 94107, 123241, 43587, 29545, -38130, -68809, -73511, -122033, -126449, -32910, 36197, 64149, 27651, 9447, 72949, 84435, 95513, 49838, -1379, -23956, -25568, -56033, -119977, -107482, -78763, -49793, 32845, 128, -17007, -9029, 24768, 29924, -20071, -55027, -112267, -192762, -219538, -126199, -13979, 69664, 34291, 46244, 66745, -29491, -37819, 26689, 130995, 63405, 42355, 98313, 6642, -6486, -22655, -61669, -133620, -115084, -87434, -71365, 2807, 12678, 28516, 86479, 117098, 2855, -78348, 21665, 136736, 179696, 118872, 89267, 101420, 100950, 55840, 96129, 47038, -22583, -52834, -81937]
17720h1937q9985M7654Q8846n2218P3692L0406O662k9008R537Q956M1008j8303
17708C5310K7694r286J8190k2573r0984r083j3609L5534J5146r36O5159J9311
17696F9873m5030L5481K0017j37353l9114R3926R3731M7367j5656r731k2484K3356
17684A14383N1837n049j65106r4090q508K7173K7626l4671Q5800K1083o0553K7856
17672a2219J3308K0581L9238p4360j3705O3105n6049l0346o5859L002P2716O6615
17660B6027j12171N063K3110K3394M918K2555J7231L1157o0333j3525L5753n0686
17648d7507Q6950Q1774n9965l4684m6033o731N601l0567n4378K708M2947P255
17636e2630j1367Q6980l7644l778Q49J7406J03672l9193k9933r480P2622j1740
$$ y = [-81937, -171922, -124268, -35422, -87640, -13948, 16458, 23120, -5888, 3649, 12605, 53613, 35310, 63004, 53718, 71908, 49335, -41649, -50732, -64341, -28807, -13661, -14597, 50562, 69873, 24843, 60324, 80341, -57012, -96126, -2200, 91531, 138898, 123242, 113511, 91027, 114383, 166220, 161171, -3935, -98025, -106533, -79360, -51734, -86405, -605, 20478, -40075, -12219, 1089, 21670, 60908, -13452, -27157, 35948, -20101, -50447, -116306, -113304, -40588, 26027, -86144, -81081, -57971, -34577, -29659, -7104, 10127, 41284, -19049, -32574, 3179, -47507, 39443, 121217, 61252, 26568, -19465, -26196, -20595, -51162, -105540, -102832, -59885, -52630, -63997, 22983, -14661, -18439, -17590, -184, 103488, 64295, 34362, 24882, 97504, 85764]
17624H5764N2731q0935q1342k5432M6432J09522j4567K6316N4498L4510o6442
17613A41055o3724q1402o6886r5680J0129J24670Q7113q7217r0111m4624N9665
17602a07012O6899K153O95p869r533O8631k2828k6289j0476l9751J0601L8451
17590c6328Q6971m8592r322n4951m5193p712O9256M8840K5692p3510n0949Q0761
17578a5037j070j158K1553q526L777j3727Q556M8035k3244r128R4008O5253m5633
17565A23659j00093r6674q0023K1791N2291O9382M0185J0622l3703J0688o76o5755
17553d8306n787l5160J1721J4665J8518J9851o9481J7954M018M1208j0104o5133
17541a06036K8757L7995M4153m3088n2990J290Q5230K8300k07227K4123K2560
$$ y = [85764, 138495, 57560, -23782, -49214, -2782, 106740, 92173, 118489, 172987, 207497, 141055, 77331, -4071, -70957, -166637, -156508, -31838, 55275, -31942, -122053, -166677, -107012, -40113, -37960, -37265, -45134, -54667, 13964, -8864, -35153, -45629, -85380, -74779, -36328, 50643, 2051, -7271, -62222, -107415, -115127, -45871, 2969, 28661, -44849, -95798, -15037, -16107, -17265, 4288, -4238, -461, -14188, -5632, 42403, 19159, 10031, 104039, 169292, 123659, 23566, -73108, -153131, -131340, -79049, -9667, 30518, 41140, 7437, 18125, 17449, -48306, -54093, -89253, -77532, -62867, -44349, -24498, -93979, -76025, -72007, -30799, -40903, -106036, -77279, -39284, 4869, -38219, -91209, -89919, -4689, 23611, -183616, -159493, -136933]
17530a36933J00392N1775J852m0972k5787L5444o178J29414M4278p2478j47796
17519f6989m1429q9716p591J09698l6862p2083k4128K2798R9134L6980K4323N7843
17507A1978J52377P4345J2150j23592k6912m4954r522j5261n3905l3340L4233
17496b2403R4426M707o0232M915J6238L6289k09j9175p1679o3617l9748J0450
17484a10038j3936m8044M6225M8672J7621K6780j9958K740J07111M7673K2614
17473A27460J0288M6516j08697r3999k6726L7871J0298l3573k0309N1715M2691
17462D3535M2592o2595j1288r8684j5010m1666N098M0004q553M3532L009j7632
17450g7658L8478R7156K450K3599K5997L7033J67069K87903K65532J83338j01943
$$ y = [-136933, -36541, 15234, 17086, -23886, -49673, -14229, -20407, 109007, 153285, 80807, -66989, -108418, -198134, -205725, -96027, -132889, -204972, -229100, -206302, -107168, -70188, -45865, 11978, 164355, 238700, 250850, 127258, 100346, 55392, 45870, 30609, -23296, -56636, -22403, 72023, 76730, 16498, 21413, 37651, 73940, 73731, 54556, -17123, -80740, -120488, -110038, -123974, -172018, -125793, -77121, -59500, -32720, -52678, -49938, 57173, 104846, 127460, 137748, 184264, 75567, -18432, -45158, -7287, 3011, -30562, -50871, 844, 43535, 86127, 23532, 12244, -86440, -101450, -143116, -138018, -98014, -106567, -63035, -60026, -77658, -39180, 57976, 60426, 84025, 110022, 147055, 314124, 602027, 867559, 1050897, 948954]
17439I48954l11288k39160r3382j03098j02843p6827M8401R9341k048n9176o6886
17428D1988p1520k6404K5371l1992l006O6257n5007o8621j846N3757l8562p908
17416a17493M6341M0725n272L0360n3769k0664k404p162J13129M6789J9380L7406
17404A27366l1466n7733n575j4368J1192p2409m1795K4926L2535O049J6645R8446
17392I3813j9875J9098k2135p4105r852L4553k2396j4922j9904r5423L1388M7643
17380e2117R6590J0300p1615O6563j9036j7703J3024r248o2538k0112m3207N6518
17368e2581R4359P4698o3555n7416l6072L7425m6195M3602k7327m6230J11331
17357C2039J1240p5724J3292l4975J2332p2104J816o1626j5352O8316P5015n4742
$$ y = [948954, 637666, 398506, 305124, 202026, 99183, 22356, 70757, 170098, 168050, 108874, 41988, -29532, -55936, -30565, -62557, -65563, 694, -54313, -122934, -124780, -71023, -109585, -117493, -71152, -30427, -35699, -5339, -59108, -79772, -82176, -89338, 23791, 70580, 89960, 127366, 95900, 38167, 32592, 18224, 29416, -42993, -84788, -59862, -27327, -21278, -4633, 93813, 73938, 93036, 70901, -3204, -13056, 21497, -899, -15821, -35725, -131148, -99760, -52117, 44473, 54773, -16842, 49721, 30685, 12982, 26006, 16758, -45780, -65892, -109099, -52581, 41778, 116476, 52921, -4495, -40567, -3142, -49337, -5735, -33062, -79292, 32039, 43279, -32445, -19153, -54128, -41796, -113900, -112084, -173710, -189062, -120746, -45731, -100473]
17345a00473o757N8595N3042l5208m6348N6198N2923m2388r081O0218k9569o1718
17333e0566j1353j6005K9738L9935k3809p8538J3566Q5143L7666K3784l0083P3132
17321I2610j868j15342q8632J3972K6658K4776N1964k9366l7110O6944j4736N4228
17309D4098N9438l6043m5260m3110n701j492R04Q0983O9291k2413k0069r122J4384
17296H5888q425n3318m3275J0926N2591O3066M282o3894m7868J3785l8285m4561
17284f9088J6568L265Q426k588l1356l1829q453m4045J12171J10382q9569p2852
17272i8968k18J5112L0043J8786l3796R837N0673J1816k8692j5767L5231j0511
17260a6454k4028O7530M3178j5757r0782j05800J15565M9362p6640n4322k1417
$$ y = [-100473, -107230, -48635, 4407, -30801, -77149, -20951, 31972, -10416, -19497, 40721, 11152, -50566, -61919, -77924, -48186, -8251, -32060, -110598, -97032, -11889, 25777, 49561, 19478, 92610, 90742, -24600, -113232, -99260, -72602, -47826, 4138, -25228, -62338, 4606, -10130, 44098, 103536, 67493, 22233, -20877, -26578, -28070, -27166, 53817, 123108, 100695, 80626, 71504, 85888, 77463, 24145, -19130, -8204, 44387, 107453, 111735, 47841, -27, 13758, -24527, -69088, -52520, -49255, -40829, -43417, -74773, -106602, -115055, -159100, -46929, 63453, -26116, -98968, -99186, -84074, -54031, -35245, -69041, -59204, -8531, 3285, -25407, -41174, -5943, -16454, -40482, 27048, 70226, 54469, -36313, -142113, -26548, 22814, -53826, -108148, -129565]
17249a29565M2318M9437j131J5935l3704J9347M525P8453K9573K0753m8936q2392
17237c5387J4590k1966R231l0909M2602M9449o4075r13j4241o8751O9237J14962
17225F3829M3745K369p9519m9336m7081m1112Q0931n0766l5495k9619R108M857
17213a28089O3112O4450J4214r1344j35312Q2195P6654q111k3821K3909K3536
17202c8607M6882O1200K3330Q929L662k6268K2748k5288m5313K5740M8384p8336
17190B7063o4515M6190m6238m7396l8192o5686J34612O2867n2826n645O7555j4395
17178C394o8290o9713o1481J2795O543Q1352J21841L9318M0217O2013q460m7360
17166A12169n0409q6447K2864J15953K8781l8819L1982P1393J640m8953r3101
$$ y = [-129565, -87247, -37810, -38941, -23006, -56710, -37363, -32838, 45615, 75188, 95941, 47005, -35387, -20797, -42763, -33532, -64441, -21839, 27610, -36465, -37378, -51619, -120370, -51133, 63829, 107574, 109943, 30424, -18912, -65993, -107105, -26174, -76940, -112435, -142054, -132946, -128089, -64977, -527, 13687, -77657, -212969, -130774, -54120, -62231, -86052, -62143, -38607, 8275, 69475, 92805, 101734, 105396, 79128, 101876, 76588, 31275, 57015, 105399, 27063, -37452, 8738, -37500, -84896, -123088, -188774, -54162, 8705, -44121, -49766, 17789, 3394, -64896, -134609, -196090, -183295, -176752, -95400, 26441, 65759, 105976, 167989, 159529, 112169, 61760, -24687, -1823, 114130, 142911, 104092, 136074, 207467, 209107, 160154, 67053]
17155F7053j17965p3547O4475J23839n4463j08133K2622Q5528m0629j21071j9404
17144a71695P624Q2043J14049N5515p9634j25772L1301j4822j7095p1072l5653
17133b25211O4857R1555R6549l9325l0671k3961k6282J466k5969N803M4119P5922
17121H852P9806m0577n7820j40387O795O1207N5885J5330K5361L2882J22305K8693
17109A98332l0078p1378j30479p546J4691r7097L8082J25510n8071l1013n4682
17098a03729J6217N7146K2331n936o2462q4162L7180J19698N0329J3273p080o3384
17086a0579j6713J00414Q095n4396m2763q3543l6967L4622K1551l9671p0043j929
17074a91922J06636M6580j3119j0398K0876j8292R8145O9094j6738N0950m4065
$$ y = [67053, -50912, -124459, -59984, 63855, 9392, -98741, -76119, 9409, -31220, -152291, -171695, -164071, -82028, 32021, 87536, 7902, -117870, -86569, -101391, -118486, -189558, -225211, -160354, -68799, 27750, -11575, -42246, -66207, -92489, -91023, -116992, -111189, -67070, 8852, 88658, 48081, -9739, -150126, -143331, -82124, -26239, -10909, 14452, 47334, 169639, 198332, 168254, 96876, -33603, -41149, -26458, -123555, -85473, 40037, -18034, -49047, -103729, -87512, -30366, -8035, -13971, -76433, -160595, -123415, -3717, 46612, 59885, 52805, -10579, -27292, 73122, 81217, 26821, -15942, -99485, -136452, -101830, -80279, -119950, -189993, -191922, -85286, -38706, -51825, -62223, -41347, -59639, 38506, 107600, 90862, 141812, 97747]
17063I7747J9050j11866k2696J3672N2976m3818o4467L5290o508P167l906M5319
17051A7960P796N0215J1719K1426L012n1274k0693m967l6276o747j3007J0627
17039a0209J3534n1014K1067J18984Q319l645j07379n014R3304Q4711k4865n5131
17027H2662R054P6951P880l7759o8784m4886K8494k3954N1346L6114k8055r2435
17015c372k6242K5906j675j8405K1801k6680k0328p5435o2601K941P1756J01928
17003a0406P2594K0512j04559j5167l8189N5896J77m8775o9901L9544J9639N1293
16991b7342L5770J5604K1099J098l5452K9087O317m1536j3462n1609l3902L1991
16979f2337J7818O7741J7216j3253M6412P0708o2412j6999J0137m5234j3650n2351
$$ y = [97747, 116797, 4931, -17765, -4093, 48883, 5065, -59402, -24112, -30620, -23453, -27359, 17960, 25756, 75971, 87690, 109116, 112128, 60854, 40161, 35194, -1082, -7829, -20836, -10209, 3325, -47689, -26622, 92362, 100681, 97036, -10343, -15357, 77947, 162658, 137793, 82662, 91716, 168667, 176547, 138788, 70004, 25118, 53612, 29658, 81004, 117118, 89063, -3372, -29614, -3708, -5383, -23788, -1987, -28667, -48995, -124430, -187031, -184090, -112334, -10406, 62188, 82700, -21859, -37026, -75215, -19319, -19142, -67917, -137818, -98274, -78635, -27342, 8428, 24032, 45131, 46229, 10777, 39864, 46181, 4645, -8817, -60426, -94328, -62337, -44519, 23222, 40438, 27185, 73597, 144305, 81893, 64894, 75031, 29797, 16147, -36204]
16967c6204q7118Q0846Q1209K6555K2061j7133j28525j07529J0756K5605M2134
16956h7343j7953n5831j7184M7926L0331K9843J942J24145L001j6179M0824K8555
16944A12077n791l5149p5324o3380k8224M511M2574J5692J5757n2331O3548M9366
16932D3326k9395j3206k4640M79k4125q803m7889N5020R883K2304K3079p2538
16920f6505o5799n268q173J8915j543O6876K7715J4704j839j0101o1134p3877
16908a66029Q081O5073n399P5215l6648n3200M1216M0295K4101M3632O0262J6278
16896A12877J6217l2781l1478J3415j7898o5554M2505N5180r5671q2318j8328
16885a03834J09198L4554o9307m2017o603j094N7123M8128k0080o1600K5471P424
$$ y = [-36204, -123322, -42476, 38733, 65288, 87349, 70216, -58309, -165838, -155082, -129477, -87343, -105296, -161127, -178311, -130385, -100054, -70211, -68269, 55876, 58877, 42698, 83522, 112077, 106286, 71137, -4187, -67567, -95791, -91280, -48706, -33014, -17257, -69588, -6040, 43326, 13931, 725, -23915, -23436, -47561, -56364, -104253, -49233, -39350, -17046, 6033, -66505, -132304, -137572, -145745, -126830, -128373, -61497, -33782, -19078, -20917, -31018, -92152, -166029, -157948, -92875, -98274, -23059, -59707, -112907, -71691, -31396, -7295, 36337, 96599, 112877, 129094, 96313, 64835, 78250, 60352, -5202, 37303, 92483, -3188, -85506, -103834, 5364, 39918, -29389, -71406, -78009, -79103, -21980, 26148, 6068, -55532, -30061, -22637]
16873b2637l8409j2847M4213o3041m1972j4002J9225N0400J33582O2508j8834
16862I8186n6019r5944q7173J5982K0329O0698O6464L1807l1291k139L3936J5628
16850G0464J1093J01410J5794o7259o2257l8028m8083J0800q4898k5780K2315
16839i4429R1926K0101o842k2173J1405M3882j1092m9302K0102J35047O059L1737
16827A76421k6329r4150j06607M446N3777j7998l025K4768m8438o754J0621n5555
16815h8823P8737N905r5031l1585J40898O6851l0188L7786o1465j8847K0027L7562
16803F1827l0906m0676k6491K9726N6690l6596j649r371N8892m5659p9396r3025
16791a56634l2095N4754j5802J67194Q3550k3914n4109j8346n790m3103o1686
$$ y = [-22637, -61046, -73893, -29680, -92721, -134693, -148695, -129470, -79070, 54512, 117020, 98186, 42167, -53777, -140950, -124968, -104639, -43941, 22523, 54330, 23039, 20900, 54836, 70464, 81557, 182967, 198761, 131502, 69245, 31217, -16866, -6066, -90964, -116744, -94429, -2503, 17598, 10756, -11417, -12, 43870, 32778, -16524, 3578, 138625, 144684, 176421, 150092, 55942, -50665, -46219, 7558, -10440, -13465, 11303, -37135, -43889, -33268, -88823, -10086, -4181, -99212, -130797, 10101, 76952, 46764, 84550, 23085, 4238, 24265, 61827, 30921, -9755, -36246, -6520, 50170, 13574, 11925, 2554, 61446, 15787, -63609, -156634, -188729, -133975, -149777, 17417, 100967, 77053, 22944, 4598, -1192, -44295, -105981]
16780a05981l2751Q5630Q2672r8586L0954R444k8021n2395M2941L7494n4987n8160
16768a41746K0545j796J9635O485K6025j8455o5784k9598R8638L6368P8451J9436
16756D8204j00732n7799j1522k8178j3088k009N3783P7877K8503P5327m7784q1100
16744e8518o629N98m51N7869n815p7828l6977K4814M4754n5698m2863J15418J7777
16731b3549m7498p0995L7833J06785N7165k2521n0101m2240m8335j5017K2018
16720i6455k6917j0315m0331M5570O3925j1519l9650o528K7034J20761R673o1999
16708b6751n9432m954R0257M3942m1156l0059N746r0523m5409J6772K8762M4899
16696f7906J00218P3210O6692j2647l0166l7674R2571j32755r1301l4515k2658
$$ y = [-105981, -138732, -53102, 29570, -69016, -38062, -28618, -56639, -109034, -66093, -28599, -83586, -141746, -121201, -122997, -103362, -96877, -70852, -89307, -155091, -184689, -86051, -49683, 28768, 48204, -52528, -110327, -121849, -150027, -163115, -165124, -111341, -33464, -4961, 70366, 22582, -58518, -65147, -64549, -65000, -7131, -12946, -90774, -127751, -102937, -58183, -113881, -156744, -41326, -23549, -71047, -142042, -104209, 2576, 59741, 37220, -12881, -55121, -103456, -118473, -96455, -123372, -133687, -174018, -128448, -64523, -76042, -115692, -122220, -95186, 25575, 35248, -26751, -86183, -91137, -880, 43062, 1906, -28153, -22407, -112930, -158339, -141567, -112805, -67906, 32312, 105522, 172214, 159567, 129401, 91727, 184298, 51543, -39758, -74273, -96931]
16685i6931Q7323j0013k623N6067Q434Q187j22970l4061R1242O2504J9829m5744
16673B1244o4357r378P2426j7975M316P2570l6459j17259l8593M8889J1193m7360
16661a00743J5367k1744L4910M1126j0570P6773K9046l5578M3529j1188l3040
16650B7888L1437J7443k3855o9786J3923k1829K756J3726m1283K3540k1499n4713
16638a02252J02807L9626p2250r7201j8287O294L6062J39973M5429n4041Q285
16627C4445O6933O2786p1522o4702K1207J6568K2647k8738n8733N012k6844o8144
16615h9085J0975l2591P570P9388K7354l872k6183K0035Q1087m281n8186O7621
16603G9832j2623l023n3683m7673J3119P5670K2284L3775k0452m8528m1679p879
$$ y = [-96931, -9608, -19621, -22244, 33823, 42257, 50444, -72526, -106587, -15345, 47159, 66988, 21244, -43113, -52491, 19935, 1960, 6276, 78846, 42387, -74872, -113465, -64576, -53383, -100743, -85376, -107120, -72210, -31084, -41654, 35119, 64165, 28587, 72116, 60928, 27888, 59325, 76768, 52913, -16873, -2950, -24779, -22023, -8297, -49580, -26040, -47539, -102252, 555, 40181, -32069, -129270, -147557, -141263, -105201, 34772, 80201, 26160, 34445, 101378, 164164, 92642, 27940, 49147, 65715, 88362, 59624, 891, 5903, -20941, -89085, -78110, -110701, -103131, -23743, 3611, -261, -26444, -6409, 74678, 70397, 12211, 79832, 67209, 64186, 10503, -37170, -24051, 51619, 73903, 107678, 87226, 38698, -2981, -10860]
16591a0860j5436l3577m2018k9418O421L1755m3021o755J28968o6280r3500M5382
16579a28339M6041J1039K9045R6058n955k9272J2410o5784q2232R631l2266J7765
16567a21859O8388O702m3742l3893j2218k2223O009O3932k611n7166P0153O1417
16555a7111M3827J1594r913n0585r4169j9868K9739N8184K7799n1187l9138O2066
16543d8762N5261m8225o0379O3097n8715n1418P6419L0945k0443Q563l4762p9730
16531a68149l7414Q6550R5682N6891J096j7538M810l3784K0529k9376q039M9499
16519B0757K3197k1208K2185j4686k6114N5738L0400p5302m3417o2349J5938m572
16507g9433j4533N2522L5544L6547J28352O4233r6311q3245o6333O4010M6806
$$ y = [-10860, -26296, -59873, -101891, -131309, -124888, -93133, -136154, -142909, -13941, -80221, -173721, -128339, -82298, -71259, -42214, 53844, 47889, 18617, 31027, -34757, -116989, -107358, -139624, -121859, -53471, -46769, -90511, -124404, -136622, -158845, -152836, -88904, -91515, -148681, -78528, -17111, 26716, 38310, 28397, -22188, -116357, -136225, -106486, -48302, -20503, -71690, -110828, -48762, 6499, -41726, -102105, -39008, -97723, -149141, -72722, -41777, -62220, -53657, -88419, -168149, -205563, -119013, -23331, 33560, 34656, 17118, 21928, -11856, 8673, -20703, -28742, 20757, 43954, 22746, 44931, 30245, 4131, 59869, 90269, 14967, -28450, -90799, -74861, -79433, -93966, -41444, -5900, 30647, 158999, 223232, 126921, 43676, -22657, 41353, 88159]
16496H8159o3133J3236J5986J6698L0001o4234m9635q127N7135o203q1334l6767
16484h8218k9225L0467J07985r507L53O2892k3197p3665q780j1662L4393K7931
16472A9767n0429l6229P147N013M8922L9061M618k1304L6301l669o739M631N126
16459E2216J0307O0083O60j05594q7950N7262J09664p0203j10657k8464K3939
16448h8737K0389J8478K2066m9691J1497J53436M2982j57256r8887N6695Q2353
16437A3325M0206J1110K9747m0241m9719J9057n2467k5542L8797p972Q566r061
16425b4194m8314O7591J788l217o1311o523R675N3058m6987r4203Q781P2255Q0359
16412H758l0558o715J14705k8856q5165l5221N0149J4301k8319J254n210j2060
$$ y = [88159, 25026, 38262, 54248, 70946, 100947, 36713, -12922, -21049, 36086, 29883, -51451, -88218, -117443, -86976, 21009, 11502, 11855, 74747, 51550, -22115, -30895, -42557, -8164, 19767, -30662, -66891, -59744, -54731, -5809, 33252, 37870, 16566, 52867, 49198, 42459, 47090, 52216, 62523, 122606, 123266, 17672, -70278, -13016, 96648, 26445, -84212, -112676, -88737, -68348, -49870, -27804, -77495, -65998, 87438, 130420, -26836, -125723, -69028, 13325, 53531, 64641, 94388, 54147, 4428, 23485, -28982, -54524, -15727, -23699, -15133, -24194, -72508, -4917, -3129, -6346, -67657, -74180, -64505, -11447, -58434, -152637, -143856, -71601, 8758, -21800, -28515, 86190, 57334, -27831, -63052, -12903, 1398, -26921, -25667, -30877, -42937]
16400d2937R7241L7702j5635K5365o6630k8830m0637j12048P313L9754j5720M9128
16388f5934J2256k3241P5147J04148N2935J1080J1381j8237l5112m9442k2074
16377E2907o3238M369j545j1382r6499J7924K8924k6369N7768K3759O0391O2355
16365A09364k5225j94045r3398p5047J02361Q6880J19898K6604k4221O116p60
16354C8527p2977q1704L2402J09651K8957O9487j6025j0693q5295J0929K6012
16343D9271k9804o2036l9899J5132k589J8700L0901j3646l7982j8025N1868k0549
16331e8658m105R1239Q4948o0809o856j7606J8901K2919O6873l7958j10810p4133
16319h6055N577N2703R3976O798l8674N5664R8845O0521m3473j47017j7610n7257
$$ y = [-42937, 54304, 92006, 76371, 101736, 35106, 6276, -34361, -146409, -139096, -99342, -115062, -65934, -53678, -76919, -1772, 102376, 155311, 166391, 177772, 159535, 124423, 74981, 52907, -10331, -5962, -7507, -18889, -115388, -97464, -68540, -94909, -37141, -13382, 47009, 109364, 84139, -109906, -203304, -278351, -175990, -89110, 30788, 57392, 33171, 39287, 38527, -34450, -116154, -83752, 25899, 54856, 124343, 108318, 97625, 12330, 23259, 49271, 19467, -42569, -82468, -67336, -69925, -51225, -20324, -33970, -71952, -89977, -38109, -58658, -62763, 28476, 113424, 52615, 45759, 28153, 47054, 69973, 136846, 98888, -11922, -86055, -80478, -27775, 66201, 72999, 34325, 89989, 188834, 249355, 205882, 58865, 41255, -16002]
16307a6002o8644m5723M9397m5777J6990J3064L2945O2471P0284o0827m6499l202
16295d1523l3369O8712J9032p8607m1895N6862L9976J3240L623p2036l9088O7682
16283c7391J01567R825n6833m2182L1214J0804j885J830m2851j7288J5867k1299
16271d8622N991P9687N0857R688k9385p7541K2766N645j9960j02026L4671j8421
16259h6650L8375O7433o0794J9794M6288J5096m1888o6966M8984o7527n5812k5661
16247a69328P559J3250Q1467N2614P2862N7028l1323p4642j26985j6672R506K0431
16235a04233O9711M204p291O820l1092l7070L7373L4294k6850l4989j1927L5058
16223f5992o087M4010L6393l4329K6106k6873M092K4833k0688k4168k7799j9736
$$ y = [-16002, -84646, -130369, -80972, -126749, -109759, -96695, -63750, -1279, 69005, 8178, -38321, -41523, -74892, -6180, 12852, -65755, -107650, -50788, -10812, 2428, 6051, -65985, -105073, -37391, 64176, 74001, 17168, -25014, 6200, 17004, 15119, 16949, -25902, -43190, -27323, -48622, -42631, 37056, 87913, 97601, 68216, -9325, 13441, 19086, -874, -102900, -68229, -86650, -48275, 19158, -41636, -21842, 24446, 39542, -2346, -69312, -20328, -87855, -143667, -169328, -161769, -148519, -67052, -14438, 58424, 115452, 84129, 9487, -117498, -134170, -124664, -104233, -34522, -30318, -37609, -30789, -61881, -98951, -61578, -27284, -54134, -89123, -101050, -65992, -72079, -28069, 8324, -26005, 101, -26772, -22680, 2153, -18535, -42703, -70502, -90238]
16211i0238R7581R3276N8402k9405k9360o2266m5296o869K8909n7604j4503l3542
16199i0915K9271k1041n9062M7150J24200N0861o285N3055o6918k5207R4419L6851
16187A66379p1300o0655P475p3936J3228k6042L6245J3217K3097J8200L419J8596
16175F7923n5748R868K2489L8605M5295q6487n9107j7205Q0730N2875L1739j7696
16163A13281k8071O687m2802q6301j9016L3751Q5478l280L8658J11584o9115p5398
16151F5456p1458q0686L1617J10597Q245K069J4419l5845l0999J7769M2620q2393
16139h589K9591K5061r4816p0515Q9465P8913K0530m5288j4310K0616N287l5783
16127A62n2566M5389j6352k3929l8151k7800O3454O9768L3247N0202n5018p4055
$$ y = [-90238, 7343, 100619, 159021, 129616, 100256, 37990, -7306, -14175, 14734, -42870, -57373, -90915, -61644, -82685, -141747, -94597, 29603, 80464, 74179, 127234, 60316, 35109, 129528, 166379, 95079, 34424, 41899, -32037, -18809, -44851, -8606, 4611, 27708, 45908, 49327, 67923, 12175, 22043, 44532, 83137, 128432, 41945, -17162, -34367, 46363, 99238, 130977, 113281, 85210, 91897, 49095, -37206, -56222, -22471, 63007, 59727, 98385, 209969, 140854, 65456, -6002, -86688, -55071, 55526, 63771, 65840, 80259, 44414, 13415, 31184, 73804, -8589, 21002, 46063, -48753, -119268, -29803, 49110, 69640, 24352, 10042, 30658, 35945, 162, -52404, -7015, -23367, -47296, -85447, -113247, -49793, 19975, 53222, 103424, 48406, -25649]
16115b5649j5364J242K4103l1576j1980K3867N2134J40728L6684L3777R182m5929
16103A91219j00753o4735m5389j19848m1116N4951K3345J3268j123J17101M3729
16092G0649J9065r909K9916l9527l6761o5180k8656l8218n2559K3176N1706N65
16080g5733P0307j9880o472O349K3959R821j0204q6244j7817O8736J2309P5457
16068E0588J9695r3445j6343N6968P655o4934o3266O0985K2263K2412J5572n878
16056A2272K7949Q553l315K8093J0164j05066l3989K2426L2477m9911p883R1476
16044C3246k2638n4420m6125O1116Q7287L3612n1382j11437r1177j9753L4016
16033a47655N7190M4432L1757M2562n6694r348r921L7497l7677L3199K664r973
$$ y = [-25649, -41013, -39771, -15668, -47244, -59224, -35357, 16777, 157505, 194189, 227966, 237148, 191219, 90466, 25731, -19658, -139506, -180622, -125671, -102326, -89058, -90181, 26920, 70649, 89714, 79805, 109721, 70194, 33433, -31747, -60403, -98621, -151180, -128004, -76298, -75733, -5426, -25306, -31778, -25429, -1470, 8351, -1853, -88097, -105914, -37178, -24869, 50588, 70283, -23162, -39505, 17463, 25118, -39816, -103082, -42097, -19834, 2578, 18150, 12272, 40221, 48774, 45459, 73552, 83716, -21350, -55339, -32913, -436, -50347, -58230, 33246, 10608, -43812, -89937, -28821, 58466, 92078, 40696, -70741, -161918, -181671, -147655, -90465, -46033, -14276, 28286, -28408, -37756, -47677, -10180, -47857, -14658, -11994, -21967]
16021b1967K6460J7978M963N846J9674k5724j24463L3896Q0140O5071j1979l4223
16009C5672K5864n5203R302L5297M003Q5894L295k2084l3240k7887M9735n8026
15997E2622j0627l4642K4002N3116J02817l3083q6580j1696l6824k0614l1757
15986c3266K6182Q0131J22190l6185k8334o2361q349k2593q7303r334J8096J1763
15974b9363P3875O6801m1436k2180J6894k6230m3219J05100J00586M3532m6477
15963A97883r201r1324j9620J8986q298j4280N544k0396J18499N8527K7163r8146
15951A65337r3863j4836m8082q0309n5797o7695j0281L2137J38375n4229n8359
15940a47602O6594O5868L9166L1450m155j6716J8470P6338L3885o0170Q016n438
$$ y = [-21967, 4493, 22471, 27434, 33280, 52954, 27230, -97233, -63337, 16803, 81874, 69895, 35672, 61536, 6333, 15635, 50932, 54935, 140829, 144124, 122040, 88800, 60913, 110648, 52622, 41995, 7353, 31355, 84471, 187288, 154205, 67625, 55929, 19105, -1509, -33266, -7084, 73047, 195237, 159052, 130718, 68357, 60008, 37415, -49888, -59222, -41126, -29363, 44512, 111313, 69877, 47697, 64591, 38361, -4858, 100242, 200828, 244360, 197883, 188682, 97358, 77738, 96724, 88426, 74146, 79690, 59294, 177793, 236320, 263483, 165337, 71474, 56638, 8556, -71753, -127550, -195245, -205526, -173389, -35014, -89243, -147602, -81008, -15140, 24026, 55476, 51321, 34605, 53075, 129413, 163298, 103128, 111144, 105706]
15928A05706j3253k5325j3558j9050m9831l6671K4580M6216p994n8465p986K6597
15916b9034p4128k7599K0277P0555J7281J0807n6080P99Q0553Q0170k5119n4586
15904A3896J767j6323K4380k6349r2006j2815Q5776q49j1639J10795M3025j56637
15892c6979p9004N7711P795O6936J3005q1056m852P4165L0078k6535k2617J3255
15880A1902L1109j1704o1523M5902J6987p9979J6252R5995R7445R74o5064q2790
15868A5506k0923k0351o8515j7188q0224q567l0854J04823L67J3442j8194J1670
15856a19008M3221N2363L2334M7383n3154M7727O6115P382O8066m5632o6966L2241
15844A12072j7647o2692p6232M8554j582L191O8507l0477j6920m9387q2994N3143
$$ y = [105706, 92453, 67128, 53570, 34520, -15311, -51982, -27402, 18814, 10820, -47645, -55631, -29034, -103162, -130761, -110484, -39929, -22648, -11841, -67921, -67122, 13431, 93601, 68482, 13896, 15663, -660, 23720, -2629, -94635, -107450, -21674, -22523, -34162, 76633, 119658, -36979, -115983, -58272, -50477, 16459, 29464, -51592, -56444, 17721, 47799, 21264, -1353, 11902, 43011, 31307, -30216, 15686, 32673, -47306, -31054, 64941, 162386, 163360, 98296, 15506, -5417, -25768, -94283, -111471, -191695, -200262, -231116, -126293, -125926, -112484, -130678, -119008, -75787, -23424, 8910, 56293, 3139, 50866, 116981, 124363, 192429, 146797, 79831, 112072, 94425, 31733, -44499, 4055, 2473, 5664, 74171, 43694, 26774, -22613, -105607, -52464]
15832e2464K8722j19632k7975O8633M2446o885O625O2615j5903J1887p8393k3039
15820a03363K508m6220Q756N5905K2910l3523j2514n2674P0713O6582l200Q0128
15808E6008N8226M254n1151m3508j7932k723m3045Q051k8705q561M975m0021l5758
15795a39890K6360k7714L9090Q9389M7756j9292q1050l8588N3850L8694k2997
15784c4392r0077N2475J31206O9989p2123o5440J0549M1430l3823q5475k1871
15773i7552K3743O1520K5147N652N503N2961l145m4145l5278j5822k5249L7708
15761h957L3932Q1786J2681l641O2226k3430l634L6591l0795j2640j14423o8192
15749c8496j4492N1684J5079L3802r4539j7468L4651J4892m2960P9685j8061Q566
$$ y = [-52464, -23742, -143374, -171349, -102716, -60270, -67155, -60530, 2085, -13818, -1931, -80324, -103363, -100855, -147075, -138319, -82414, -59504, -93027, -105541, -158215, -87502, -20920, -24120, 56008, 114234, 118488, 67337, 23829, 5897, 3174, -39871, -31820, -60525, -69086, -64111, -104132, -139890, -113530, -141244, -102154, -12765, 34991, 15699, -65351, -103939, -50089, -11395, -34392, -124469, -71994, 59212, 129201, 57078, -8362, 2187, 43617, 9794, -75681, -97552, -73809, -12289, 12858, 18510, 24013, 76974, 73829, 29684, -5594, -21416, -46665, -8957, 24975, 106761, 119442, 115801, 178027, 154597, 150963, 187554, 156759, 144119, 29696, -38496, -52988, -1304, 13775, 47577, -46962, -64430, -29779, -14887, -57847, 21838, 3777, 12343]
15737A2343M5048j9373O7843l9902N0292J4235K0616k8927o8405j5679j122J0251
15725D7220p3833k3273J9720R456l793j00191l2370M0011J5983R2018L7544K4798
15713E3290l0334p9849M505L1394j00118n1518N1437J211N1865j9362O9563J752
15701a6164J282p496j14952J969R4719K2201k1806Q0299J5668o9805l8408p149
15689e9642O0404R8722k0449j3839q9517J6604O5083K4236p0111L1840L9341K6778
15677A09450p362l8026l6390l0758K6671m0186L769O7522J4859P0536j0357m711
15665A25017J579k3221k8717j47819K44J2934M4524R7468J8990o1788L0177m6366
15653B3022k965j8924k1123Q899K4666j1206n7244l4199j2664k4333J4359P9602
$$ y = [12343, 57391, 38018, 105861, 65959, 116251, 130486, 151102, 122175, 53770, 38091, 36969, 47220, -26613, -49886, -30166, -20710, -24503, -124694, -157064, -117053, -101070, -9052, 28492, 53290, 22956, -56893, -52388, -20994, -121112, -172630, -121193, -119982, -68117, -87479, -17916, -16164, -14882, -22378, -137330, -135361, -40642, -18441, -40247, 40052, 55720, -14085, -52493, -59642, 762, 99484, 79035, 65196, -24321, -7717, 57366, 81602, 11491, 43331, 82672, 109450, 102088, 64062, 27672, -3086, 23585, -16601, -12832, 54690, 69549, 140085, 129728, 125017, 126596, 103375, 74658, -73161, -72917, -59983, -15459, 82009, 100999, 39211, 69388, 23022, 20057, 1133, -19990, -11091, 13575, 2369, -54875, -89074, -101738, -126071, -111712, -32110]
15641c2110K0060k3974J3213l7648o7444l4839P3974j7807O627J20994J24646
15630A45692m9188l9467J3556j3880k9342m9556o829N7000k5748l6811N92j2697
15618d6678J3417L0016l792o229P8064J05306o7778m0602m3608K3230P6869P8192
15606A96407r245N985o8921r2269j5997J1260k0520j9984P627K8176O6055n0027
15594C8547K8913K901m2123J2812K376N3355l4583K711j2482K147N5471L0808
15582A40853p2771p4267n2730O8375Q8658q912N7365R8171p304j19662o3874k9381
15570B4521O4424P8682O5952o9719q3568L2093J5979q3686M7526P0713j04081
15559E8836m0150J1562k0641n6252P3615k5344o9321j7390M847m7592m9132R8061
$$ y = [-32110, -12050, -36024, -22811, -60459, -127903, -162742, -88768, -106575, -99948, 21046, 145692, 96504, 57037, 70593, 56713, 27371, -22185, -29014, 27986, 2238, -34573, -33981, -46678, -33261, -3245, -7037, -13266, 64798, 170104, 102326, 61724, 18116, 41346, 118215, 196407, 187162, 193147, 124226, 31957, 15960, 27220, 6700, -13284, -5657, 22519, 88574, 38547, 67460, 70361, 28238, 41050, 43426, 96781, 62198, 64909, 52427, 54574, 110045, 140853, 68082, -6185, -58915, 9460, 98118, 89206, 146571, 244742, 237438, 117776, 53902, 24521, 88945, 167627, 233579, 163860, 80292, 112385, 128364, 44678, 92204, 162917, 58836, 18686, 30248, 9607, -46645, 26970, 1626, -67695, -85085, -80238, -127830, -176962, -78901]
15547g8901J28314N8135K9304L6323k6113m2765m675L5089M628Q142n6053j6545
15535G4883R2931k7260N6130r9354j05468K5164l8302j2192J6923l4664j609l9043
15523i1861N4451Q1123J4730K023k6332o8309J4330M7678M615N0577k9862k2258
15511C0905l875L4059L9649k7756n2558k2709m2868M986o1244r238L8682J05453
15499C3486R4978o8775J0168K0270l5710k9038k0417j7257k0595o7668o6240L3771
15487a33027J01461J00313k002R288L6730k1985j08445l9813k0625J1386P9321
15476A2602l2130k8723k524K430m3685M6619j4285k422J743m753M6831J9024j5771
15463a5044j04197j3778J23714M666O2764m0570j3836O3100m291K6502l3039m0011
$$ y = [-78901, 49413, 107548, 136852, 173175, 147062, 104297, 99622, 134711, 139339, 147481, 91428, 74883, 167814, 140554, 196684, 97330, -8138, 17026, -21276, -33468, -16545, -51209, -52818, -91861, -37410, 43713, 58443, 60466, 34134, -34175, -19845, 27833, 32448, 83025, 53163, 30905, 27030, 61089, 100738, 72982, 20424, -2285, -45153, -40167, -101411, -110649, -71967, 33486, 128464, 59689, 69857, 90127, 54417, 25379, 4962, -12295, -32890, -100558, -166798, -133027, -31566, 68747, 66745, 76033, 112763, 90778, -17667, -57480, -78105, -66719, 12602, -19528, -48251, -50775, -48345, -92030, -45411, -59696, -62118, -60375, -65128, -18297, 727, -15044, -119241, -133019, -9305, -4639, 58125, 17555, 3719, 66819, 62528, 89030, 55991, 15980]
15451A5980o539J5078O2039K6513m8549n557l3867K1368k565K9240k4751r5049
15439d6659j06769L0512P8300L8781j0894o1303n9690R6525M3442J07117J3511
15428A22873r7877R251m5091p7947K6643o030L0790K2852j3898L286n1469r3968
15416a70585j8734m9977P2709J28945N6310K0390p3492l3143m8713q2247q9990
15405b88527J53206J39277R1118o8662j6800j669K958L6786o0087n3630J0874
15394e5156n5517L670J13960M5178J1258p0560Q6698N1353n5897M9495J00908
15383B25390r3362j30432K3292p9953k6242J7314l8809Q17k1555n2198M1314J22255
15371a2169R2213l2469o691l8850J118L5623k5920N6638Q196m3616m0837j555
$$ y = [15980, 9441, 24519, 86558, 113071, 64522, 58965, 25098, 46466, 43901, 73141, 48390, -46659, -153428, -122916, -44616, -5835, -16729, -78032, -137722, -41197, 2245, 109362, 122873, 24996, 34247, -10844, -88791, -62148, -68178, -37388, -14536, -28434, -25148, -76617, -170585, -189319, -239296, -166587, -37642, 18668, 39058, -34434, -67577, -116290, -198537, -288527, -135321, 3956, 95074, 26412, 9612, 7943, 10901, 47687, -12400, -66030, -55156, -110673, -107003, 6957, 52135, 63393, -7167, 79531, 130884, 74987, 124482, 225390, 132028, 1596, 24888, -55065, -81307, -63993, -102802, -101985, -123540, -175738, -134424, -12169, 80044, 47575, 40884, 2034, 3152, 38775, 12855, 69493, 77689, 34073, -6764, -8319]
15359h319M5352N009o9605l8009P628n5303K8659K8992O4412j9678M4922j4349
15347A9711q8316n880K3110K0910K7416L6368J06318K4889J2226o7299o0383J4260
15335F3330K0599J999m856l6946l3082J5499J4054k7520j7736m2281k8167Q8575
15323A3468O7582O3888p183j0930q8930m175M1671J9305o9466j14580n7954q114
15311a55418L565Q4749R2535n2611n2637Q3173L5366L7454r1881O522J1078l7408
15299c5513P316O1310O8048J3178p6214M9801N239k3688j5771m1092l9359K5021
15287a724O8219l8052n5391l8735L9033m102l2023N1416N3626K0841l4484l865
15275B4759k0145m6496l3335k8782O6944J10464K5062k8505n7314O2968O0704
$$ y = [-8319, 37033, 42042, -27563, -65572, -57944, -113247, -84588, -55596, 8816, -10862, 34060, 19711, -68605, -74485, -51375, -30465, -3049, 33319, 139637, 164526, 176752, 109453, 49070, 63330, 83929, 85928, 81072, 44126, 11044, 26543, 40597, 13077, -4659, -46940, -75107, 13468, 81050, 144938, 137755, 126825, 37895, 33720, 75391, 94696, 25230, -89350, -147304, -155418, -151853, -67104, 25431, -27180, -79817, 3356, 38722, 76176, -15705, -9183, 1895, -35513, -28197, 33113, 101161, 114339, 38125, 87926, 93165, 69477, 53706, 12614, -26745, -1724, 66495, 28443, -26948, -65683, -26650, -30752, -62775, -11359, 42267, 63108, 28624, 24759, 4614, -41882, -75217, -103999, -37055, 73409, 98471, 69966, 12652, 75620, 136324]
15264A36324J0280j6144L8350q095o6216q9471m9756k2347M5693L8506q145J7761
15252B6740J7816m8977l029K9717M6868o8824l9067N3691L1610l1721J01748J56
15240A16728n1388P036O002L0916J8765j3516Q964L0644o1592l3850J3941J8986
15228I1636N0730m6458r1451K096m4416j4256k144r0082k4077Q7234P5534J20407
15216A14753O9137o7993j8126m568M802m0553n7518L6990n6190K989l4874J5957
15204c5194J1449L4337k5216j8466K8900N2925o3695M0947k0598p7558j3026O3712
15192b1483p9483R209J44266O1039J2381j12886k8694P6696l7459p2183K110P5097
15180B8610O3696k368k9705M16K5280l5276k0481p4212K435j9280L3592N90p6905
$$ y = [136324, 146604, 130460, 168810, 160715, 94499, 5028, -44728, -67075, -21382, 17124, 8979, 26740, 44556, -4421, -7450, 22267, 69135, 311, -38756, 14935, 46545, 14824, 116572, 116728, 65340, 72376, 78378, 109294, 128059, 114543, 123507, 154151, 92559, 58709, 72650, 91636, 142366, 95908, 4457, 6553, -37863, -52119, -54263, -144345, -168422, -81188, -5654, 114753, 183890, 115897, 97771, 93203, 98005, 57452, -66, 36924, -19266, -16277, -51151, -35194, -23745, 10592, -14624, -33090, -4190, 48735, -14960, 25987, 5389, -72169, -85195, -21483, -100966, -91757, 52509, 113548, 125929, 13043, -15651, 61045, 23586, -48597, -46487, 28610, 92306, 89938, 60233, 60649, 85929, 50653, 30172, -44040, -41605, -60885, -27293, -26703, -103608]
15167a03608R0115O4766N6194n566p5203k4432J1816q985N8820L8788p3043L4980
15155F4642K7610K4640k5407r7165K3869m0197K7991J4025m6784j6167K9489k405
15143a5859l7068J1943K9874L3130L2799M777M1549J3148m2816n3258K3524m8561
15131f818M4005m798j23022m6695j4378O9901J42583r338j10196N9937M0000M989
15119D6170n551m1054j8976K119K8129j1580n6038K8453r003M6080M0171K1969
15107G0889K9953o4164m8444K5131K0016k962k3295n7240m009k8279L2879J9262
15095c0263m3562K8732k2866L8052R5522J0307p388N7869J1158m4583p4098L7168
15083E6048Q7445K4600j0100j735q4886l9446L4522l7554k1541L840K1393N5798
$$ y = [-103608, -13493, 51273, 107467, 101901, 26698, 2266, 14082, 5097, 63917, 102705, 29662, 64642, 92252, 116892, 91485, -5680, 18189, -22008, 5983, 20008, -26776, -42943, -13454, -15859, -52927, -40984, -11110, 22020, 54819, 59596, 101145, 114293, 71477, 18219, 41743, -6818, 37187, 32389, -90633, -137328, -151706, -81805, 60778, 51440, -58756, 1181, 41181, 46170, 40619, -435, -19411, -17292, 10837, -743, -56781, -28328, -37331, 8749, 48920, 70889, 100842, 36678, -11766, 13365, 33381, 30419, 7124, -50116, -54125, -82404, -49525, -30263, -73825, -45093, -67959, -29907, 65615, 75922, 68534, 126403, 137561, 92978, 18880, 56048, 143493, 168093, 157993, 156258, 71372, 31926, 66448, 28894, 7353, 11193, 32586, 88384]
15071H8384M9584l9752o088L944J6105o5944p2832M3612N1834j9908j14515q8677
15059a54253Q3193j1315R5871O3068K617l3008j0059l5401l2597O9609M2759J1969
15047I2453m4088K614N4208O0279p9247k6039J06838R2219m6377j36895r5157
15036a9192j3261O2099M7251j4185m5077K9817N5232j426p5053m9404p7239J8735
15024h1703P5933M1344j4609l3993l9746l3026M5840k4641m7211j5087Q4760J15335
15012G3196j2684r0162j9330n1244M7561K2265N7246P5027M9768r6306r251o913
15000C9173n4976l8773M7688J40297J0068r9654l914l3518l2610P34M7642J8966
14988D1123k4313J7577N7358M6810j18580O4160L6866k204j28990m2757J0270
$$ y = [88384, 137968, 98216, 92128, 96072, 112177, 46233, -26599, 17013, 68847, 48939, -65576, -154253, -71060, -82375, 13496, 76564, 79181, 46173, 36114, 713, -31884, 37725, 80484, 92453, 48365, 50979, 105187, 165466, 86219, 60180, 167018, 259237, 212860, 75965, -19192, -32453, 29646, 76897, 62712, 17635, 47452, 102684, 101258, 26205, -23199, -100438, -81703, -5770, 35574, 20965, -13028, -52774, -85800, -39960, -64601, -111812, -126899, -42139, 73196, 60512, -29650, -48980, -100224, -52663, -30398, 26848, 101875, 151643, 55337, 46086, 39173, -15803, -54576, -6888, 133409, 143477, 43823, 39909, 6391, -26219, -25485, 22157, 41123, 16810, 34387, 91745, 138555, 19975, 84135, 121001, 118797, -10193, -52950, -42680]
14977d2680n815m1124m3429K6137O5408R4272p269N1852o1174Q827q1344l3122
14965f9461J0919N5061o5073n5404k7758J7534L4770Q7187m7063j6481J8802M5467
14953a1500M1442J1181q335p543o4248j0201J6912p8263q3842O030J2479R2929
14941h2959K3812J00163R2173P5854N4410K9526p4436q1217q5654r001L1717J1977
14929H6365N3895m222j19284q1541O3660O2076j5216l3404L8421O6606n2784k9659
14917C4913j5730k969O9860j9643o8270o608j6144M0021M0586R602m1482K2993
14905D7129o6064j06464J8734K4413Q0087O9597K1447J5891J120P1235r3883O009
14893H9251l8352N546M7337M6595j60243j15595J39519N2063k049K9714q273n4573
$$ y = [-42680, -48495, -89619, -133048, -106911, -41503, 52769, 45500, 97352, 36178, 45005, -36339, -69461, -58542, -3481, -68554, -123958, -151716, -134182, -99412, -12225, -59288, -75769, -56967, -11500, 29942, 41123, 32788, 25245, -39003, -49204, -32292, -110555, -194397, -188367, -175888, -82959, -59147, 41016, 133189, 209043, 263453, 292979, 218543, 137326, 51672, 42671, 74388, 86365, 140260, 136038, 16754, -64787, -1127, 60949, 45733, 12329, 50750, 117356, 64572, 34913, 19183, 16214, 86074, 66431, -1839, -8447, -24591, 15430, 56016, 65618, 24136, 47129, -18935, -125399, -106665, -82252, -2165, 67432, 88879, 104770, 105890, 177125, 83242, 89251, 50899, 56445, 103782, 150377, -9866, -125461, 14058, 66121, 64072, 93786, 85513, 30940]
14881C0940J9977j0894m4539Q1328N5473q2489l9806l4148M9327J3182j8304O2671
14869H2718L8742j0603j05901n1577o6197K5058O5073L896J5979M539P7571k3570
14857E5728o3309k2221k7350K3001L4269M8294J6377m1422l2930K9404K4387M7654
14845I1882k1355o1859J2899q1765l3352M2854R2640j1052l597j0637M5831N5084
14833A17573l0343L306l2613m4601q8671J1895k430Q9585O9694n4526j6016l5465
14821a2612n205L3753m748N2377k8718j6721k5450O131j0771m1880K3496m6407
14809g6755K4372P431K1039P5601J8060j23775o8919M48O2992K9720J4751J02780
14797H7745J1776n0774O743O9712r5014j7379Q8101K6001l8964N059Q0277o005
$$ y = [30940, 50917, 40023, -4516, 76812, 132285, 49796, 9990, -24158, 25169, 38351, 20047, 82718, 121460, 110857, 4956, -46621, -112818, -87760, -22687, -18791, -2812, 1727, 79298, 55728, -7581, -29802, -57152, -34151, 118, 48412, 64789, 23367, -9563, 19841, 44228, 91882, 70527, 8668, 21567, -60198, -93550, -50696, 41944, 30892, 27295, 16658, 62489, 117573, 87230, 90536, 57923, 13322, -75349, -63454, -65884, 23701, 93395, 38869, 22853, -12612, -17817, 15936, 11188, 63565, 34847, 18126, -7324, -1193, -11964, -53844, -30348, -76755, -52383, -44952, -23913, 51688, 69748, -54027, -122946, -122498, -59506, -29786, -15035, 87745, 99521, 48747, 55490, 125202, 30188, 12809, 100910, 126911, 87947, 93006, 173283, 167278]
14785A67278o2715K1253p8468o5494J5857M8302Q4867p598q6418j0919P4271J12600
14773B12816M4742j20631q8505K7195o3970p8747J97J84717M0015k0437p3320
14762F4072n2799L4343P9358L8600p5605k4887n905j01998q0762J00636O3976
14751C9029n3793k8733k3329O0924K6451k5385J659j6151M226Q8m61N7412n4624
14738a2687r6420l0823K9799J5990O9500N6172R405l1108m835l2495l8309N3827
14726a1984M5446k3066p1326q9939J33070L4123n1371K6590Q465K2222J4665K745
14714C9640m0681q6084L4944O8192J20087j9004o9309n3484Q530k718J0119K3537
14702C3769J7473M3356o1969j9483n2794k2928j3933J9736M7791n2889j6930K237
$$ y = [167278, 104563, 125816, 47348, -18146, -2289, 46013, 130880, 123282, 36864, 25945, 100216, 212816, 257558, 136927, 48422, 75617, 11647, -67100, -66903, 117814, 157829, 137392, 64072, 11273, 45616, 124974, 163574, 87969, 63082, 57177, -44821, -125583, -24947, 39029, -14764, -43497, -66826, -5902, 20549, -4836, -3177, -19328, -15102, -15014, -15475, 41937, -12687, -109107, -139930, -110131, -94141, -24641, 31531, 40936, 9828, 4993, -27502, -65811, -11984, 33462, 10396, -60930, -150869, -17799, 16324, -35047, -8457, 8, 22230, 36895, 39640, -1041, -87125, -52181, 16011, 136098, 117094, 47785, -5699, 2831, 113, 10232, 33769, 51242, 94598, 32629, 13146, -39648, -62576, -76509, -56773, -8982, -61871, -78801, -76564]
14690g6564M0609J07681Q7376n0140l0604K8798k9119p5812J5967j6427m9288
14679d7523l8961Q0186L7138K0508q364L3577j9523J1152p179J7034j7931J9580
14667G9694Q8372q1799q7223n6083K3525Q1821M2947Q8340m1146j04446L9682
14656G3684k112P8656j4421q366n9392j10042k437L1513J3343R806L9019n1447
14644b196o1943j5922J3519O264M845j326P7366J814q9078q4959O3982J99022
14632A11388K6621n4895j0980q211o7240K4124R4132R568O99r9682p6677M656
14620d6497k600J5108N465L4901p059k390M9309o3254r1043j2508Q3025M9510
14608A1967n7185N78L3227n1647j5270N7051M5143j8666J039O5111m3809r1415
$$ y = [-76564, -35955, 71726, 159102, 108962, 78358, 107156, 78037, 2225, 18192, 1765, -47523, -86484, -6298, 30840, 51348, 42984, 76561, 57038, 68190, 61011, 78045, 60114, 79694, 168066, 86267, -956, -57039, -33514, 48307, 91254, 179594, 138448, 34002, 73684, 71572, 150228, 135807, 127441, 68049, -41993, -44430, -12917, 426, 10232, 49251, -2196, -64139, -80061, -66542, -60278, -55433, -56759, 20607, 22421, -66657, -151616, -87634, 111388, 138009, 83114, 72134, 63923, -3317, 20807, 114939, 124507, 125206, 25524, -51153, -46497, -49097, -33989, -28524, 6377, -682, -3072, 46237, -17017, -108060, -120568, -37543, 11967, -45218, -44640, -11413, -63060, -78330, -21279, 23864, 5198, 6237, 71348, 27539, -63876]
14596f3876J1564N1187j1939o361L5175p758J02825J06771j6480j11468j02396
14585a2756j7679O4798j489k0191J4194l7201r4027j18239K2028J29452N0517
14574b0593O1497N9588Q4346j5213l6008q8575o7743n809J3671K6907K4463j2160
14562B4371J6864m826l9734L1228L0610m7344K0364O4502r149L900j00030q9364
14550i8608J4392L0310M8290R1385n6726r7351N2137l9093k8785k4649N3117K8661
14538b6920M6864j8917L1652l0022r0470j1910J17529J37817o7886r3420k5433
14527c1116j6921J2781L7770M2455P8884p6982j53648p0302J8914N3249N5334
14516d9582N1796L4934O056p907m593K8740J3222m1732L4218R5015L1173N3515
$$ y = [-63876, -52312, -1125, -13064, -19425, 15750, 7992, 110817, 217588, 201108, 89640, -12756, -30435, 34363, 32874, 12683, 26877, -10324, -104351, -222590, -200562, -71110, -20593, 40904, 100492, 184838, 169625, 133617, 45042, -22701, -28510, -14839, 12068, 36531, 24371, 41235, 36409, -3325, 27903, 58513, 11169, 31533, 96035, 86886, 90786, -9244, -98608, -84216, -53906, -5616, 85769, 29043, -68308, -16171, -55264, -84049, -108698, -55581, -26920, 19944, 1027, 32679, 2657, -87813, -99723, 17806, 155623, 87737, -5683, -31116, -48037, -35256, 2514, 44969, 123853, 46871, -106777, -177079, -158165, -104916, -49582, 2214, 37148, 43204, 35297, 30704, 59444, 72666, 30934, 65152, 160167, 191340, 244855]
14504B44855m0347j04580o4170p3501J9779O936L1149N538n9810k6721R879O5692
14492A4699k9091n1399K8069o1234k6397p425K1685k1469l820J3565L4350m5029
14480a33496j7199K6237N64N4784k5124L9792P5883M9021l3678j11420N0763N9126
14468C5253o191P8778P6584j30570o9671M0369J7481l7032r069J6070J11026M7935
14456A70963o7154m2948j3785M3362m8273q363P5287M9722l1333n2712K5676m9124
14444E1318l2118j6308R327L3865j0860n8770J7279R658J9377O8039m8366K9635
14432G2076k3399l6169Q004L7050L8369J27514L6228N04r6016m8393o1902R068
14420F2934P3809K9776L3M120K4833m2969p6544j5797k8619o8097K3533j7026
$$ y = [244855, 204508, 99928, 35758, -37743, -17964, -11028, 20121, 25659, -34151, -60872, -50993, 14699, -14392, -65791, -37722, -98956, -125353, -132778, -111093, -132562, -136382, -122817, -88467, -133496, -150695, -124458, -123894, -69110, -94234, -54442, 21441, 70462, 36784, -74636, -23873, 35253, 29062, 107840, 184424, 53854, -15817, 24552, 42033, 5001, -4068, 12002, 123028, 170963, 103809, 60861, 47076, 90438, 42165, 33802, 109089, 158811, 127478, 74766, 100442, 51318, 19200, 2892, 12219, 46084, 35224, -23546, -6267, 3391, 22768, 90807, 42441, 72076, 48677, 12508, 20512, 57562, 95931, 223445, 259673, 260177, 164161, 115768, 53866, 62934, 136743, 166519, 166552, 170672, 195505, 152536, 75992, 60195, 31576, -36521, -12988, -30014]
14408c0014N8086O1521K3850j8131L5549N579l2177l0160K2106J025n0090K0054
14396F7198n9255R540j2772P8965O6388m80P019k1544J060l762m7600k0379K5970
14383I0348n4767r7223j3697Q8248K4198k6292j5397N2495N3675l8744j2621k7169
14371B3054J9854K5400K4467p049Q756N6670J3514r7179m3733J7842L3451k6784
14359D8263n4401l4810L2111O8443J2967K7143K3800K1998o3171n8301L883K5118
14347E3043m5133L4814J27764J38465O1986q6377o3670j7705j26524p6453J2853
14336A3063K5230r8319L22R139N6174L72M0205m3794j39284J5714Q7640Q2312
14324D8774J2942O2653p8456k8026k6535L7511L7746n7126p674O4201L569l3185
$$ y = [-30014, 28072, 89593, 113443, 95312, 130861, 136440, 104263, 74103, 96209, 97234, 47144, 67198, 7943, 17483, 4711, 83676, 150064, 149584, 156603, 135059, 136119, 132357, 84757, 64378, 90348, 35581, -61642, -75339, 12909, 37107, 10815, -4582, 47913, 101588, 62844, 50223, 23054, 42908, 68308, 92775, 85726, 94482, 151152, 164666, 67487, 23754, 41596, 75047, 48263, -6138, -40948, -8837, 59606, 72573, 99716, 123516, 145514, 82343, 24042, 27925, 53043, 7910, 42724, 170488, 308953, 370939, 284562, 220892, 203187, 76663, 210, 13063, 38293, -60026, -59704, -50565, 5609, 5981, 46186, 2392, -136892, -121178, -33538, 48774, 61716, 124369, 45913, 17887, -8648, 28863, 66609, 9483, 1809, 66010, 69579, 36394]
14312C6394J5375j5318k0214L2889O5632K5097M656o413l6612l9925M3835q500
14300I6896j05872p749L7086p5113k4598J2666Q533L765J214L9245K628K3625
14288A2326K5785k2515O8790K9013k636q4438q3249j9216L3719K1477P352P119
14276f473Q1454Q7012k7739l6283l0388j9118k916n4840l1445o4858L4526M8296
14264b2772N634n7044j06884N4293R5352K1079L1663k4456l6185M292L7318K3287
14252B5577q8039O195K9318L2609o9534j626R605k6877J56816L2019n5490K0591
14240G1164k7312n8527l7514p1877K0068N3849K6890r1223l2171N183L7780j9814
14228a23504O2860N1051o5113j3628K8113O8874J533L140M2346l3049m7132q1054
$$ y = [36394, 51769, 36451, 16237, 49126, 114758, 139855, 144511, 138098, 101486, 61561, 105396, 96896, -8976, -16725, 20361, -54752, -79350, -66684, -58151, -54386, -53172, -13927, -11299, 12326, 38111, 15596, 84386, 113399, 110763, 26325, -56924, -76140, -42421, -20944, -13592, -6473, 74981, 161993, 134254, 97971, 67583, 48465, 45549, -9291, -40736, -105594, -71068, -22772, -17138, -74182, -181066, -126773, -31421, -10342, 21321, -3135, -39320, -35028, 2290, 25577, -62462, -56267, -26949, 5660, -63874, -65500, -55895, -82772, 74044, 106063, 50573, 71164, 43852, -14675, -52189, -124066, -103998, -50149, -23259, -114482, -146653, -141470, -103690, -123504, -60644, -9593, -74706, -88334, -60221, 8653, 10186, 13326, 55672, 22623, -24509, -105563]
14216a05563L9633M2443m3735m3729p4432O7497k46n4565K7131J19472J28213
14205A02119p1748j44144L9410O6773L0385K2857p3105K7223L0197K1721K655
14194E4343P175p9557k8129r161k9578p2170K5417l9161K2450O9293Q3700J6409
14182B1031L9019O0213o9131M7804M5593P090o1537j33517j3701M6673R3030L8325
14170A20892l8971o0555n9123m0134Q024M0808Q9171O794P283N3571o378j00785
14158B0597m9603Q3736N886k7780k3330N1310l2987l0684p359M8935J7537o2130
14146e872K1195K8460L6507K4569k6801J5255K6029n045m6784o8681q4128J7425
14134f7871M2545j4824L1657m121k4702q0149L86N7338K5409P6736M1534k7545
$$ y = [-105563, -65930, -23487, -67222, -110951, -185383, -117886, -118132, -172697, -145566, -26094, 102119, 30371, -113773, -74363, -7590, 22795, 45652, -27453, -230, 29967, 51688, 54343, 61518, -18039, -46168, -55329, -84907, -157077, -131660, -170821, -148371, -79078, 4622, 21031, 60050, 120263, 51132, 98936, 144529, 151619, 90082, -43435, -57136, -10463, 82567, 120892, 81921, 21366, -37757, -77891, -69867, -29059, 60112, 66906, 74189, 127760, 121382, 20597, -29006, 54730, 60616, 32836, 9506, 60816, 27829, -2855, -10214, 38721, 56258, -5872, 15323, 43783, 80290, 104859, 78058, 93313, 119342, 114297, 67513, -1168, -85296, -67871, -25326, -40150, -8493, -12614, -37316, -117465, -117079, -59741, -34332, 42404, 83938, 56393]
14122E6393k2577J3820j28635n3517L9354J2889k1001j6062O3291N0625P049k1868
14110b0239R926j6167N7210K8297n5405k8649Q3712Q1174K5914o0427n2556l8918
14098A3872j5933m1378k6906O8801j3312m6102J4879n4782P1430l9706j00572
14087a69709L8292n7739K1846L0732O6096n8467o293M9947N6278J6126N6810j0030
14075C3889r9956l4287L0215J5496P8061P458m3554p5857M733L8418J6175J5339
14063a3870J5403K8062P362m8380o802P3953K6792j10891l9080q0988j9770l927
14051a72136Q6816L4637l6713M3999m2984N5501R7802l2639m1313P6721k1495
14040D8196o4272K8678O1265K6251j5687K4873N0868Q0103p8312j01712j8376
$$ y = [56393, 33816, 47636, -80999, -134516, -95162, -82273, -103274, -119336, -56045, -5420, 1629, -20239, -10313, -26480, 30730, 59027, 3622, -25027, 58685, 139859, 165773, 105346, 52790, 13872, -2061, -43439, -70345, -1544, -14856, -60958, -46079, -100861, -29431, -69137, -169709, -131417, -189156, -167310, -136578, -70482, -128949, -135242, -85295, -29017, -12891, 43919, 33889, -66067, -100354, -70139, -54643, 23418, 30876, -12678, -88535, -83802, -45384, -29209, -13870, 1533, 29595, 36957, -11423, -18225, 55728, 82520, -28371, -67451, -148439, -168209, -172136, -85320, -50683, -87396, -43397, -86381, -30880, 66922, 34283, -7030, 69691, 48196, -16076, 12602, 73867, 100118, 84431, 109304, 160172, 240275, 161963, 60251, 41875]
14029D1875M2479l9760p7321l3952Q1348K7538M4159R920K3107l0132m2464j0282
14017C6515P9407k2959o731N2924K5986j3855j07822K3136m516k8606j4546K4470
14005D3403O995q4889p5787m0306N1384J09942P9280k0823n4187k6103m044P2966
13993E7831J34208p242l9045k0437m5267K138l8086k5655J8154J399n2174o8495
13981h2671j8103K5773J04772j7964l7507O3835R7948J958M4404k458q8085p6398
13969A5504m353o0126J4602L9101j3097P859n4440M2847L809j01305r72P2949
13957c7622N8358L0274p6622P368O549L1830N8632K8466m3767q5129o812K5139
13945c336m9636m8285J775J01899l6202p6502K6160k6946L676M4335K6672l7101
$$ y = [41875, 84354, 44594, -32727, -66679, 14669, 42207, 86366, 96286, 119393, 89261, 46797, 36515, 115922, 92963, 86232, 139156, 165142, 151287, 43465, 66601, 62085, 33479, 18933, 43403, 50398, -34491, -110278, -150584, -99200, 10742, 90022, 69199, 15012, -11091, -15135, 57831, 192039, 184797, 145752, 125315, 80048, 82186, 44100, 18445, 36599, 37998, -14176, -82671, -100774, -75001, 29771, 11807, -25700, 38135, 136083, 138041, 182445, 179987, 91902, 15504, 11151, -48975, -34373, 4728, -8369, -510, -54950, -12103, -8294, -109599, -110571, -37622, 20736, 51010, -25612, -18244, -11695, 20135, 78767, 107233, 63466, -21663, -28475, -3336, -52972, -101257, -99482, 2417, -33785, -110287, -84127, -111073, -107397, -63062, -36390, -73491]
13933g3491m118q373l2943L1238K5906j2160k3030M0818N9837P093l0583J6142
13921c664M5339l8780o9087K7750K9847M2872L2442p4544m7303k630l7479Q2013
13909a3224m5188n5447j1329J928K1693O9847M0535l6227Q680j3724k2362M7133
13897g685K7085L5J6585r845n0031q006L4225O9349Q4971l1465n5240o9971j30417
13884a30410K501L1184K3880L5242K230j7333L911Q993j9167m4310l9439l1461
13872a74179k75O1093N7521N325l1747K8453q185K3907q70J4321l9080J4683M131
13859d4902l0025K481J31131l9795j07893K5283J19651q565K02p4646k7574M0966
13847a3686N545K0643K2924L1109n6272n8833P4105L4356j3723j2280J73618j2169
$$ y = [-73491, -77609, -85982, -118925, -87687, -61781, -73941, -96971, -56153, 3684, 10777, -19806, -3664, 41675, 2895, -66192, -38442, -8595, 34277, 66719, -7825, -55128, -57758, -95237, -13224, -58412, -113859, -125188, -123260, -101567, -31720, 8815, -27412, -18732, -32456, -54818, -7685, 19400, 19435, 36020, 26175, -23856, -31862, 2363, 71712, 156683, 125218, 69978, 7, -130410, -127909, -96725, -72845, -37603, -35373, -52706, -48795, -39802, -58969, -103279, -142718, -174179, -174454, -113361, -55840, -50515, -82262, -53809, -61994, -38087, -38957, -24636, -63716, -49033, -44902, -74927, -72446, 58685, 18890, -89003, -63720, 55931, 47366, 47568, -27078, -54652, -13686, -8141, 12502, 35426, 66535, 10263, -48570, 25535, 59891, 46168, 33888, 207506, 195337]
13835A95337n934j54733j14323R9189Q7512m2434o4356O3816q9237l3658K4703
13824c4118m0675j1321M0422K204K8410j5246M0348J9326p616j0109K0399m0387
13812h363m8095J7761N8496J44651K9090n1564k4959p460l0784j06660m9847K2786
13800e4948j1742Q2019J11015r60L023J1703k1354r6102n1967l0570M3828O569
13788i486l2566m4440P838M5796R1977J2849p5043J1915N5960J0523k4790O2924
13776A13457N197m246k2786j66653r5608l0915M4753n552R1482K8677k2432M2431
13764b2195L8907J05277K1535j0201L0254m6089p0712k025K0281Q0718j7238p3861
13752E4651r6825O1617Q2688k5825j13960n6791K1194J1451M1608K4867K1843
$$ y = [195337, 189403, 34670, -79653, 19536, 107048, 64614, 258, 64074, -25163, -58821, -34118, -74793, -86114, -45692, -43488, -15078, -30324, 10024, 29350, 21734, 11625, 32024, -8363, -56458, -38697, 19799, 164450, 193540, 141976, 117017, 109557, 78773, -27887, -77734, -54948, -66690, 15329, 126344, 125384, 128407, 140110, 118756, 22654, -29313, -59883, -16055, -9486, -42052, -86492, -78654, -32858, 59119, 71968, -3075, 8840, 64800, 75323, 50533, 113457, 118654, 114408, 91622, -75031, -170639, -201554, -156801, -162353, -70871, -42194, -64626, -22195, 16712, 121989, 143524, 133323, 163577, 117488, 46776, 44751, 65032, 145750, 128512, 54651, -42174, 19443, 102131, 76306, -37654, -94445, -73251, -61800, -20192, 4675, 26518]
13741B6518J15905j01355o5244P4461O1419j4367o8132P703O5092k0340r8452
13730a6792n0799k7706K7618P1231P7636j06062p8875O0105O5618M401Q6539p0782
13718D2132j26350J0044R295q995P8935R454L2540P919q804p39L2329J338l3765
13705D5333Q3551P8222k4237j55458j259L4599k8602j7714J3967j760l3463L7908
13693C1087P9828O806j91402o9620M5673M6385J19409J4967k8020N6584j02267
13682I430n3762K0269l8373j6839k8349L3992Q5641J06118K3417r1827n265j4808
13670B9644N782J8349K6403M4112l6234j9314L5061k8597Q2447J11372p8159j32425
13658E8441l2524P2546J0433l9688k3248L381P5818k4619n1256N317M7614K5558
$$ y = [26518, 142423, 41068, -24176, 50285, 111704, 97337, 29205, 36908, 102000, 81660, -16792, -67591, -95297, -67679, 3552, 81188, -24874, -103749, -43644, 21974, 26375, 112914, 42132, -84218, -74174, -64879, -73874, 5061, 14515, 47055, 54974, 46170, 45431, 77760, 79098, 45333, 128884, 207106, 182869, 27411, 26152, 60751, 32149, 14435, 28402, 26642, -6821, 31087, 110915, 117721, -73681, -143301, -97628, -51243, 68166, 83133, 55113, 111697, 9430, -44332, -24063, -62436, -79275, -107624, -73632, 12009, 118127, 141544, 49717, 44452, 29644, 35426, 53775, 80178, 124290, 88056, 68742, 103803, 75206, 157653, 269025, 190866, 58441, 25917, 98463, 108896, 69208, 45960, 49341, 125159, 100540, 49284, 54601, 102215, 127773]
13646A27773n7028j46143k0164l0040P1249N4900K3141O671L4934M973p0903J7226
13634A6589K8901m0667L3183o256L833K3721m6658n0091J13476j42387j3798N1080
13622b9074P3087K5302j34935L3902N0299R1801K6422n2142p4663N7206M479N586
13610G7270j41420k8938J9712M0429j894k3051j5057N1794J00883K5248o3878
13599D1098l021k8335K3197K7404m8977q3463o7873R5642J27760p04k8497k3501
13587C0730J8658p1350l6244J15107J5389m9487j7061M984j0445m3361k2271K7900
13575c7451L3578L7460o885J2647m7834J1942O18L6161J7541j0987Q6569J6745
13563A50104n6030o5382r877n425N9766j3081j11901P0567j9943K6222l463K0615
$$ y = [127773, 70745, -75398, -95562, -125602, -54353, 547, 23688, 30359, 65293, 70266, -637, 16589, 45490, 4823, 38006, 31750, 35583, 59304, 12646, -37445, 76031, -66356, -80154, -29074, 44013, 69315, -65620, -31718, 18581, 110382, 136804, 84662, 9999, 67205, 71684, 77270, -64150, -93088, -73376, -32947, -34841, -57892, -72949, -21155, 79728, 104976, 41098, 38077, 9742, 32939, 60343, 11366, -72097, -139970, -44328, 83432, 82728, 54231, 30730, 49388, -21962, -58206, 56901, 72290, 22803, 5742, 10726, 281, -43080, -65351, -37451, -3873, 33587, 26702, 39349, -8485, 3457, 4075, 40236, 57777, 46790, 133359, 150104, 94074, 28692, 18815, 13390, 73156, 60075, -51826, 18741, -1202, 25020, 21557, 42172]
13551D2172J4868J7944k0458j09436L403J12816L2670L2874R024j6849L3611n0992
13539A01647q0384O291m7310p7548L5876K4520J2639l192m7270M174R5588O1471
$$ y = [42172, 57040, 74984, 54526, -54910, -51507, 61309, 93979, 126853, 135877, 119028, 152639, 101647, 21263, 27554, -19756, -97304, -61428, -36908, -24269, -27461, -74731, -70557, 25031, 86502]
$$ [...]
##END NTUPLES=NMR SPECTRUM
##END=
