##TITLE=Analysis number 328412
Compound Code tl 00794
Project Code adrs
Chemist Name fudan
##JCAMPDX= 6.0         $$ Bruker NMR JCAMP-DX V2.0
##DATA TYPE= NMR SPECTRUM
##DATA CLASS= NTUPLES
##ORIGIN= Bruker BioSpin GmbH
##OWNER= nmr
$$ XWIN-NMR		Version 3.5
$$ Mon Jun  4 11:56:26 2007 GMT Daylight Time (UT+1h)  MAYBRIDGE\nmr@NMR_250MHZ
##.OBSERVE FREQUENCY= 250.131544655141
##.OBSERVE NUCLEUS= ^1H
##.ACQUISITION MODE= SIMULTANEOUS (DQD)
##.ACQUISITION SCHEME= undefined
##.AVERAGES= 16
##.DIGITISER RES= 18
##SPECTROMETER/DATA SYSTEM= dpx250
##.PULSE SEQUENCE= zg30
##.SOLVENT NAME= DMSO
##.SHIFT REFERENCE= (INTERNAL, DMSO, 0, 16.5652)
##AUDIT TRAIL= $$ (NUMBER, WHEN, WHO, WHERE, WHAT)
$$ ##TITLE= Audit trail, XWIN-NMR		Version 3.5
$$ ##JCAMPDX= 5.01
$$ ##ORIGIN= Bruker BioSpin GmbH
$$ ##OWNER= nmr
$$ C:\u/data/dgb/nmr/ADRS/120/pdata/1/auditp.txt
$$ ##AUDIT TRAIL=  $$ (NUMBER, WHEN, WHO, WHERE, WHAT)
(   1,<2007-06-04 11:56:05.06 +100>,<MAYBRIDGE\nmr>,<NMR_250MHZ>,
      <created by zg, POWCHK disabled, PULCHK disabled
       configuration hash MD5:
       76 6E 9A 78 1E 09 19 81 EC 84 63 8F B0 6A 59 2D
       data hash MD5: 64K
       C1 A7 BD 74 05 A0 E1 E1 17 65 01 9C 61 84 38 10>)
(   2,<2007-06-04 11:56:17.87 +100>,<MAYBRIDGE\nmr>,<NMR_250MHZ>,
      <Start of raw data processing
       ef LB = 0.3 FT_mod = 6 PKNL = 1 SI = 32K 
       data hash MD5: 32K
       2C E4 65 A7 2A 72 34 56 2D D2 CA 98 16 D6 69 B1>)
(   3,<2007-06-04 11:56:19.53 +100>,<MAYBRIDGE\nmr>,<NMR_250MHZ>,
      <apk 
       data hash MD5: 32K
       32 30 D0 EB 32 3E D0 6E A1 9E D0 0B CC 16 64 9C>)
(   4,<2007-06-04 11:56:20.32 +100>,<MAYBRIDGE\nmr>,<NMR_250MHZ>,
      <abs ABSG = 5 
       data hash MD5: 32K
       09 56 29 FC F4 67 01 B9 03 4F F5 8D 4C F0 F5 71>)
$$ ##END=
$$ 
$$ hash MD5
$$ 1B 52 36 C1 34 E1 5E 42 30 BF 2A 29 71 8A F9 1A
##$RELAX= 
##$RELAX= 
##$RELAX= 
##$RELAX= 
##$RELAX= 
##$RELAX= 
##$RELAX= 
$$ Bruker specific parameters
$$ --------------------------
##$DU= <C:\u>
##$EXPNO= 120
##$NAME= <ADRS>
##$PROCNO= 1
##$TYPE= <nmr>
##$USER= <dgb>
##$AMP= (0..31)
100 100 100 100 100 100 100 100 100 100 100 100 100 100 100 100 100 100 
100 100 100 100 100 100 100 100 100 100 100 100 100 100 
##$AQSEQ= 0
##$AQ_mod= 3
##$AUNM= <au_zg>
##$AUTOPOS= <5 >
##$BF1= 250.13
##$BF2= 250.13
##$BF3= 250.13
##$BF4= 250.13
##$BF5= 500.13
##$BF6= 500.13
##$BF7= 500.13
##$BF8= 500.13
##$BYTORDA= 1
##$CFDGTYP= 0
##$CFRGTYP= 5
##$CHEMSTR= <none>
##$CNST= (0..31)
1 1 145 1 1 1 1 1 1 1 1 1 1 1 1 1 1 1 1 1 1 1 1 1 1 1 1 1 1 1 1 1 
##$CPDPRG= <>
##$CPDPRG1= <>
##$CPDPRG2= <>
##$CPDPRG3= <>
##$CPDPRG4= <mlev>
##$CPDPRG5= <mlev>
##$CPDPRG6= <mlev>
##$CPDPRG7= <mlev>
##$CPDPRG8= <mlev>
##$CPDPRGB= <>
##$CPDPRGT= <>
##$D= (0..31)
0 1 0 0 0 0 0 0 0 0.06 0 0 0 0 0 0 0.0002 0 0 0 0 0 0 0 0 0 0 0 0 0 0 
0 
##$DATE= 1180954564
##$DBL= (0..7)
120 120 120 120 120 120 120 120 
##$DBP= (0..7)
150 150 150 150 150 150 150 150 
##$DBP07= 0
##$DBPNAM0= <>
##$DBPNAM1= <>
##$DBPNAM2= <>
##$DBPNAM3= <>
$$ [...]
##$SUBNAM7= <"">
##$SUBNAM8= <"">
##$SUBNAM9= <"">
##$SW= 20.6930455092707
##$SWIBOX= (0..15)
0 0 3 0 0 0 0 0 0 0 0 0 0 0 0 0 
##$SW_h= 5175.983436853
##$TD= 65536
##$TD0= 1
##$TE= 683.16
##$TE2= 300
##$TE3= 300
##$TEG= 300
##$TL= (0..7)
0 120 120 120 120 120 120 120 
##$TP= (0..7)
150 150 150 150 150 150 150 150 
##$TP07= 0
##$TPNAME0= <>
##$TPNAME1= <>
##$TPNAME2= <>
##$TPNAME3= <>
##$TPNAME4= <>
##$TPNAME5= <>
##$TPNAME6= <>
##$TPNAME7= <>
##$TPOAL= (0..7)
0.5 0.5 0.5 0.5 0.5 0.5 0.5 0.5 
##$TPOFFS= (0..7)
0 0 0 0 0 0 0 0 
##$TUNHIN= 0
##$TUNHOUT= 0
##$TUNXOUT= 0
##$USERA1= <user>
##$USERA2= <user>
##$USERA3= <user>
##$USERA4= <user>
##$USERA5= <user>
##$V9= 5
##$VALIST= <valist>
##$VCLIST= <CCCCCCCCCCCCCCC>
##$VD= 0
##$VDLIST= <DDDDDDDDDDDDDDD>
##$VPLIST= <PPPPPPPPPPPPPPP>
##$VTLIST= <TTTTTTTTTTTTTTT>
##$WBST= 1024
##$WBSW= 4
##$XGAIN= (0..3)
0 0 0 0 
##$XL= 0
##$YL= 0
##$YMAX_a= 337158
##$YMIN_a= -316776
##$ZGOPTNS= <>
##$ZL1= 120
##$ZL2= 120
##$ZL3= 120
##$ZL4= 120
##$ABSF1= 16.56521
##$ABSF2= -4.127964
##$ABSG= 5
##$ABSL= 3
##$ALPHA= 0
##$AQORDER= 0
##$ASSFAC= 0
##$ASSFACI= 0
##$ASSFACX= 0
##$ASSWID= 0
##$AUNMP= <proc_1d>
##$AZFE= 0.1
##$AZFW= 0.1
##$BCFW= 0
##$BC_mod= 0
##$BYTORDP= 0
##$COROFFS= 0
##$CY= 12.5
##$DATMOD= 1
##$DC= 0
##$DFILT= <>
##$DTYPP= 0
##$F1P= 14.0000005364418
##$F2P= -0.99999901652339
##$FCOR= 0.5
##$FTSIZE= 32768
##$FT_mod= 6
##$GAMMA= 0
##$GB= 0
##$INTBC= 1
##$INTSCL= 1
##$ISEN= 128
##$LB= 0.3
##$LEV0= 0
##$LPBIN= 0
##$MAXI= 10000
##$MC2= 0
##$MEAN= 0
##$ME_mod= 0
##$MI= 0
##$NCOEF= 0
##$NC_proc= -4
##$NLEV= 6
##$NOISF1= 0
##$NOISF2= 0
##$NSP= 0
##$NTH_PI= 0
##$NZP= 0
##$OFFSET= 16.56521
##$PC= 1
##$PHC0= -66.30249
##$PHC1= 6.20239
##$PH_mod= 1
##$PKNL= yes
##$PPARMOD= 0
##$PSCAL= 4
##$PSIGN= 0
##$REVERSE= no
##$SF= 250.129989190374
##$SI= 32768
##$SIGF1= 0
##$SIGF2= 0
##$SINO= 400
##$SIOLD= 32768
##$SREGLST= <1H.DMSO>
##$SSB= 0
##$STSI= 32768
##$STSR= 0
##$SW_p= 5175.98343685301
##$SYMM= 0
##$S_DEV= 0
##$TDeff= 65536
##$TDoff= 0
##$TI= <Analysis number 999999
Compound Code 99
Book Reference 9
Project Code 9>
##$TILT= no
##$TM1= 0
##$TM2= 0
##$TOPLEV= 0
##$USERP1= <user>
##$USERP2= <user>
##$USERP3= <user>
##$USERP4= <user>
##$USERP5= <user>
##$WDW= 1
##$XDIM= 32768
##$YMAX_p= 381184689
##$YMIN_p= -325183
$$ End of Bruker specific parameters
$$ ---------------------------------
##NTUPLES= NMR SPECTRUM
##VAR_NAME=  FREQUENCY,     SPECTRUM/REAL,   SPECTRUM/IMAG
##SYMBOL=    X,             R,               I
##VAR_TYPE=  INDEPENDENT,   DEPENDENT,       DEPENDENT
##VAR_FORM=  AFFN,          ASDF,            ASDF
##VAR_DIM=   32768,         32768,           32768
##UNITS=     HZ,            ARBITRARY UNITS, ARBITRARY UNITS
##FACTOR=    0.157963299565203, 1,           1
##FIRST=     4143.45588388259, 0,            0
##LAST=      -1032.52755297042, 0,           0
##MIN=       -1032.52755297042, -325183,     0
##MAX=       4143.45588388259, 381184689,    0
$$ Real data points
##PAGE= N=1
##DATA TABLE= (X++(R..R)), XYDATA
$$ [...]
15762C9942q4228k1780N6493J3729j8833p5940N010K6325N5559L913J4921k0567
15750e456j5022L2472m1512o008M2054l3806k8137K878n1148j6116M3777L3911
15738d2113L2074J988l8776m5574K5849K3235J4571o171p5568r181L112M5277
15726g1277O5738K9757l9422J797J4240j0987J3909r962k0469J0420K6564m5309
15714c5001M3591K8234K8550M3808n9848J2546K5403M278J6162j6964L0367m7078
15702G4048j1903R347k1651K3166l5375n4906k8693J2606K4399j4816K593m536
15690b5721k3835M490L4345O3429j8915l543o2573q022L1722J1903L5611M554
15678D3445j3997j9060n9760J0910O4436J6266O244M250j3485l3937K5103k2058
$$ y = [39942, -44286, -66066, -9573, 4156, -14677, -90617, -85607, -59282, -3723, 190, 15111, -5456, -20478, 11994, -29518, -35526, 6528, -27278, -55415, -52537, -103685, -119801, -76024, -42113, -10039, -8051, -46827, -92401, -66552, -43317, -28746, -34917, -110485, -119666, -116554, -71277, -5539, 24218, -15204, -13407, 833, -10154, 3755, -6207, -26676, -16256, 10308, -35001, 8590, 36824, 65374, 109182, 49334, 61880, 87283, 91561, 107723, 90759, 121126, 74048, 62145, 71492, 49841, 73007, 37632, -17274, -45967, -33361, -8962, -23778, -21185, -25721, -49556, -45066, -10721, 52708, 33793, 30250, -32323, -40345, -8623, 3280, 38891, 43445, 29448, 10388, -49372, -38462, 25974, 42240, 48484, 52734, 39249, 5312, 30415, 8357]
15666H357R304l6771j2866k3951M4620K3866Q438O038m421N9791r940n1147j06469
15653h5151j5649J00394K4973k3331j5776j5728J839L4935J9289K0261m3527k1597
15641a9068J169j8853M6931o10K9898j0136n2088p4784M0003m786M7588P900j8140
15628b4976J3205J3142m6636m491J3737j3730L9183L1192Q605J040k7395O3092
15616F5968K8350m5879r1092J739O3171r829Q615K5214N0885K4471j4550m2010
15604F5053L4612k3411n3474o114n5994j6474j6940J7252N3559k566l1796J1667
15592b4626M4421L1918L3238k8629j08305o189l5959k8186J7905J1422k0156r859
15580a23005O5551M6057j5437k1333J3573j7366J8423L7877J8191j0631j5643
$$ y = [8357, 17661, -19110, -31976, -55927, -11307, 12559, 20997, 27035, 22614, 82405, 72465, 21318, -85151, -100800, -406, 24567, 1236, -14540, -30268, -28429, 6506, 25795, 46056, 2529, -19068, -17899, -36752, 10179, 9569, 39467, 29331, -22757, -97541, -57538, -62324, -14736, -6836, -24976, -11771, 1371, -45265, -49756, -36019, -49749, -10566, 20626, 29231, 30271, 2876, 65968, 94318, 48439, -42653, -40914, 22257, 12428, 21043, 46257, 97142, 121613, 107063, 65053, 99665, 76254, 22780, 16666, -39328, -55802, -72742, -55490, -1931, -4497, -36293, -24626, 19795, 51713, 84951, 56322, -51983, -58172, -94131, -122317, -104412, -92990, -113146, -123005, -57454, -11397, -26834, -48167, -34594, -51960, -33537, 4340, 22531, 11900, -3743]
15569c743k6434n6188k1701K0353K4215k8759L1008p921n6210K1424O3751K8572
15557a1633j8383k3893m3278L6500N9456J3959k5055O859L1573n5133l1553n566
15545f6147Q513K3245j5897K7423O2096J4371J3406Q582q5194m383N4406j2928
15533B7493J6086P566J7534L3549l9108K2320k453l0116l3141K5594n262n5288
15521a5226J5025N253J8347O943N786J334k5371O890N0802M2666K0731l8734l0215
15508F4231j2983l498j3294l561k7908n5032J2367r011j8494P0346j8532N651
15496i718j7914p973n695L1548O4712l1466n0143k1999j2861K8841l9989J610
15484g1047K4633K2940Q713J8348O765L585p1134k6926M0165l8393k5075j4970
$$ y = [-3743, -30177, -86365, -108066, -87713, -63498, -92257, -61249, -69170, -125380, -103956, -40205, -11633, -30016, -53909, -97187, -60687, -1231, 12728, -12327, -5468, 26105, -29028, -60581, -66147, -57634, -34389, -50286, -22863, 39233, 53604, 67010, 75592, -9602, -13985, 40421, 27493, 43579, 51145, 68679, 102228, 63120, 85440, 82987, 52871, 19730, 45324, 40062, -15226, -201, 5052, 23399, 30342, 36128, 37462, 12091, 18981, 69783, 112449, 133180, 94446, 64231, 51248, 47750, 34456, 30895, 2987, -52045, -39678, -48689, -67183, 3163, -15369, -9718, -27632, -35605, -41300, -9752, 54960, 23494, -26649, -48648, -61509, -32668, -72657, -71047, -46414, -23474, -14761, 3587, 10352, 13937, -57197, -84123, -43958, -82351, -107426, -122396]
15472a22396J6682k3036M5718K0052K8979k2227L16n9407k5890R9248Q8736Q833
15460E5608P032j3133N3895k1673l3045k2798K9385j754m799P009m738o879O8173
15447A12283N5760l8020l9725R564N256k7394K1761K1910J3015m775n1470L3027
15435A11192L0259l2293r4589m357J4628l612O837o6527p6199K8455Q9497J9380
15423B2671J3421Q2628J4401p1528j0357M2493j1198l2366j6203j0550k8716N276
15411b8L8908J7476k7203l0770j1581J3503m8715L2958N3454k795j5788j795n596
15398A2028l89L4216L1893l058J9549N9578J914r5641r7451j03L9351j15M0690
15385D2462P6846n413l5548l9915J0777j3282K6185k604p096l7590K3497j8007
$$ y = [-122396, -105714, -128750, -83032, -62980, -34001, -56228, -55912, -115319, -141209, -41961, 46775, 55608, 62640, 49507, 103402, 81729, 48684, 25886, 55271, 53517, 48718, 55727, 50989, 44110, 112283, 168043, 130023, 90298, 99862, 105118, 77724, 99485, 121395, 134410, 129635, 78165, 111192, 141451, 109158, 14569, 10212, 24840, 21228, 28065, -38462, -114661, -86206, 3291, 22671, 36092, 118720, 133121, 61593, 51236, 93729, 82531, 50165, 33962, 23412, -5304, -28, 38880, 56356, 29153, -1617, -13198, 305, -48410, -15452, 38002, 35207, 19419, 17624, 12028, 11639, 45855, 77748, 74690, 94239, 153817, 155731, 60090, -37361, -37464, 1887, 1772, 42462, 119308, 113895, 78347, 38432, 49209, 35927, 62112, 59508, 52412, 14822, 38319, 20312]
15373B0312j5300M3096n409j566K296n2826M6454J5179m3089j9207j86J590M6735
15360C8079M6812m5107l0428l6023p084K2632J2945j2307j5976k5506j1624M292
15348e9295l5670j1212q44J4936M4778K1802j388k644K8532O3373k6573m7476
15336a1681K2319k4418K7101n168q6860J5547R0828J6045J6680J5870J3515l3355
15324E6423q2975J2846M1672m465Q234N1207k0022k5209j9494K3002o539l417
15312C1263m5675K4073L7280n877j1459j4382J6163L2391K0113m433q4939n0396
15300e5878K9060K341O5524P9546n7011q1598k6797k2779L3896k824N5582L7194
15288E6256m3565k2257j8202j9074O806P297J179K322K5136k310K1296k6883J7662
$$ y = [20312, 5012, 48108, 42699, 41133, 43429, -9397, 37057, 52236, 9147, -10060, -10246, -8656, 38079, 84891, 39784, 9356, -26667, -33751, -11119, 1826, -10481, -26457, -51963, -63587, -59295, -94965, -106177, -107021, -92085, -47307, -25505, -26893, -29537, -1005, 62368, 35795, -11681, 10638, -13780, 13321, 8153, -78707, -63160, 27668, 43713, 60393, 76263, 89778, 56423, -26552, -13706, 27966, 23501, 31735, 82942, 62920, 37711, 18217, 41219, 34680, 31263, -14412, 9661, 46941, 41064, 29605, 15223, 31386, 63777, 83890, 79457, -5482, -55878, -26818, -24477, 41047, 120593, 63582, -18016, -44813, -67592, -33696, -36520, 19062, 56256, 12691, -9566, -27768, -46842, -40036, -32739, -31560, -29238, -4102, -6412, 14884, -11999, 5663]
15275E663R3543M5742n0558j21816m9398M7695J2826L4703m9500q5835l2017N992
15263a42960J4039Q327K7466j651L3728l0857Q896K8385K6379J5794l0508K0503
15251b2459l2294N3515L1197O82L7821l2857J1551k1533J5258l2428l7249N399
15239b3397r80l9823m4659m355K6729O0093j5578k3906J0914M5483J0030m8479
15227d7928o639j3327R011R2411K4812j4654P591j14664j5053M1734O5873l294
15215B5873l7285r603K4371L0555j7387l9978n5812O6056M8107j9255K4763Q714
15203D9119l3248K9267J0028m4219o6924l5359J7158L9474J6120N7230n592k8719
15191D335J1157n6346n3418L4439L5455O4338K3900m4142P2708J1483m8847J0587
$$ y = [5663, 99206, 144948, 94390, -27426, -76824, -29129, -16303, 18400, -31100, -116935, -148952, -142960, -128921, -120594, -93128, -94779, -61051, -91908, -83012, -54627, -28248, -12454, -42962, -22459, -54753, -1238, 29959, 30641, 68462, 35605, 47156, 25623, 40881, 8453, -28796, -23397, -24377, -64200, -108859, -113214, -86485, -26392, -41970, -65876, -54962, -9479, 551, -47928, -54567, -67894, -58883, 33528, 58340, 43686, 51277, -63387, -78440, -36706, 29167, 25873, -11412, -21015, 3356, 33911, 16524, -23454, -79266, -13210, 34897, 15642, 40405, 49119, 15871, 45138, 55166, 10947, -55977, -91336, -74178, -34704, -18584, 38646, 33054, 4335, 15492, -40854, -94272, -59833, -24378, 39960, 63860, 19718, 92426, 103909, 55062, 65649]
15179F5649J2471j9370j0876k8966k320m178k4705n638k546Q097k8868n9293J7931
15166h2612M8415L819M7950K7229Q492p507j074l2045k8792J1715R205L9814o3182
15153a8573m7973L857R508J5625j0435k774L040j78j2321k5891n980J5469j2021
15140h8647M3752J8838k7894M5106o1437j3583L2760L8745j927k1859l9522L743
15128g1925J7057o324N192L266N471K3647L2619J3607n0005J078m1060J7591Q0806
15115C1020M8179j1243J2511J508k4028j1478k3464p552J9210K6467l1447l6602
15103f919K9870K6685m3481J9298j7887l8882J9630L7540l2850J700R592L1610
15091C5906k4338R230L3944O6278p87o4784k4818l5044L8828M7532n824q7112
$$ y = [65649, 78120, 58750, 47874, 18908, 16588, 12410, -12295, -17933, -20479, -12382, -41250, -100543, -82612, -34197, -30378, 17572, 44801, 53293, 45786, 44712, 12667, -16125, -4410, 4795, 44609, -18573, -66546, -62689, -53181, -37556, -47991, -50765, -47725, -47903, -60224, -86115, -92095, -76626, -88647, -44895, -26057, -53951, -8845, -70282, -83865, -51105, -12360, -14287, -36146, -75668, -71925, -54868, -61192, -56000, -52734, -47263, -23616, 9003, 22610, -27395, -26317, -67377, -49786, 31020, 79199, 67956, 80467, 81975, 57947, 46469, 23005, 15453, 34663, 61130, 29683, -6919, 22951, 49636, 6155, 25453, 7566, -31316, -11686, 25854, -6996, -5296, 4296, 35906, 11568, 20798, 54742, 121020, 120233, 55449, 30631, -4413, 34415, 81947, 76123, -10989]
15079a0989l9172O3855l2110l2431j006J9853M3202l4566k8067M250k2552j0136
15067g9869M4694N296R267M5308l3771r806L8460M6804n3304m2505J2253L4718
15055A7545L7348M1599m7187j1144m4329l214K34J3321L5594l5309J8167L1804
15043E4429L9572K3213n5837r0147K1539K771Q44l9496r821N9126N4827m548m0251
15030A6221n1094L3784J9804Q517m3303J8456j3106k791L0124k7257P01N2914
15018D2970m6668l1725K0158Q0745P035l8945n5179j5076N3123K0608q0038k2950
15006f5942K0259L0864P4398J2081m1979k0700m0897L1325K2814m488j2993j7899
14994a3157O7n6255k7142O781R482j2831J9309j5504j4597J2955M9014j8501L0357
$$ y = [-10989, -50161, 13694, -18416, -50847, -51853, -32000, 11202, -23364, -51431, -47181, -69733, -79869, -35175, -29879, -20612, 24696, -9075, -18881, 19579, 66383, 13079, -29426, -17173, 17545, 54893, 96492, 49305, 38161, -6168, -9382, -9148, 4173, 39767, 4458, 22625, 54429, 94001, 117214, 61377, -28770, -7231, -4460, -3616, -43112, -52933, 6193, 61020, 56472, 16221, -34873, -1089, 18715, 27232, -16071, 2385, -10721, -13512, 16612, -10645, -9944, 42970, -3698, -35423, -15265, 65480, 72515, 33570, -21609, -36685, 16438, 37046, -42992, -65942, -45683, -14819, 59579, 71660, 29681, 8981, -31916, -591, 22223, 17735, 4742, -13157, -13090, -69345, -96487, -89706, -80224, -93055, -73746, -89250, -103847, -90892, -41878, -60379, -30022]
14981c0022N223r9M6301M0981M6193l6336l0384p369P498p284j6651l0607n2086
14968f4642L051R929Q0328j4341l8824N0965K334j1539k1543j2777J0217M1411
14956C4569K3830N125j8432j0769k3588k877l248q581l6985J8201j5259l0402
14944f8416j7510l8291K6097K7525M9922M6258L1419k9731n8734J9495k7821l7526
14932g7313K6437K8857M566K0724K537l7632j5654j977K2139j5795r612j5780
14920f8503j5339k300N1153J5151n1360j2720L6201P554m065R124L9532m846j5044
14907a5462N135R412R145p447K264l6391l0717Kk9021L083J7030j4179J2303M7414
14893b7429J6114j1870r829N3929K845q9155p5357M2422j4490K7766j3324m365
$$ y = [-30022, -24799, -24898, 21403, 62384, 108577, 72241, 41857, 34488, 41986, 34702, 18051, -12556, -64642, -61591, -51662, 28666, 14325, -24499, 26466, 28800, 17261, -4282, -17059, -6842, 34569, 58399, 63524, 45092, 34323, 10735, 7858, 4610, -3971, -40956, -22755, -38014, -68416, -85926, -124217, -98120, -70595, -20673, 25585, 57004, 27273, -31461, -11966, -39787, -77313, -50876, -22019, -17453, 3271, 5808, -31824, -47478, -49455, -27316, -43111, -52723, -68503, -83842, -86142, -34989, -19838, -71198, -83918, -47717, -40163, -44228, -35104, 4428, -418, -15462, -10327, -915, 8230, 783, 3047, -33344, -64061, -64059, -93080, -89997, -72967, -87146, -74843, -27429, -11315, -23185, -33014, 20915, 23760, -65395, -140752, -98330, -112820, -85054, -98378, -102743]
14881a02743j599r066K8116J8688J6147K7530J6669J8495k8983L3872J0119n9830
14869c2585n4184N3437q3251K8400L6680L0062Q27j7841L7791K7114m6326p1545
14857i1421o238P9170L6108R55K0757k4570J0391l5833N888k6318l892l8405K4113
14844d9295J2623J9780N0205P315M6305P469n7923k8839j7708J1597j4343J6009
14832C195N5197L8500l957o1212l4131K3732J5137l2388k4586p116P449m3284
14820f3464j8539m50M8779n636j2657N2722K4747Q585J048l0182M59Q9941k747
14807I2606j03023n5528j0133M1523J5861K3042j3759q223J0198N4490M491j8418
14795C3127k0832l3345K3656P4740m8739m8916n2943J6583J3239N5499Q381l1674
$$ y = [-102743, -104342, -113408, -85292, -66604, -50457, -22927, -6258, 12237, -16746, 17126, 27245, -32585, -86769, -33332, -116583, -88183, -51503, -21441, -20614, -38455, -664, 26450, -19876, -91421, -97659, -18489, 17619, 18574, 39331, 14761, 25152, -10681, -4793, -31111, -35003, -73408, -49295, -36672, -16892, 33313, 40628, 86933, 94402, 36479, 7640, -10068, 1529, -12814, 3195, 58392, 96892, 92935, 31723, -2408, 21324, 36461, 4073, -20513, -27629, -20180, -63464, -82003, -82453, -33674, -39310, -51967, 755, 25502, 34087, 35135, 4953, 5412, 95353, 92606, -10417, -65945, -76078, -34555, -18694, 4348, -9411, -17634, -7436, 47054, 51545, 33127, 12295, -21050, 2606, 77346, 28607, -20309, -73252, -56669, -43430, 12069, 20450, -11224]
14783a1224k1165J080K9710Q304J3643j1201n2339J4310k5194n725k695k154K1352
14770d3298n2373m4410M1299O2895M2869R1936K2594l5017k2543l005L0843k6724
14758F5066j6578n5298m2744q880N0613J5183l0932j3460M1810L4256l104k7987
14746G945J8463k324p1295K7499K22l7506L4904J573l2180j4072N6354j4482L8922
14733A4023j810N197N4715k94R112p4799k1564K3878J8477J0872k5515M976q0082
14720f2814l7952l9497N6820O9127N2979j4054k6583k4271n7058m877J6880r15
14708g2215P3797J1454K6587k0066J2949k654J0874o0909k625L0181m543K8641
14696C1471K9888K3061k3384n1385k9202K2056J1653l665k6897M313J01073j2159
$$ y = [-11224, -32389, -31309, -1599, 6705, 20348, 9147, -43192, -28882, -54076, -59801, -62496, -64650, -43298, -95671, -140081, -98782, -35887, 6982, 98918, 121512, 86495, 63952, 60947, 91790, 65066, 48488, -6810, -49554, -58434, -7821, 7362, -23570, -37030, 4780, 39036, 35932, 7945, 26408, 24084, -47211, -19712, -19490, -56996, -22092, -20519, -52699, -66771, -10417, -24899, 14023, 12213, 17410, 72125, 71831, 80943, 6144, -15420, 8458, 26935, 37807, 12292, 17268, -62814, -100766, -140263, -83443, -14316, 38663, 24609, -1974, -26245, -83303, -88180, -71300, -72215, 1582, 13036, 39623, 19557, 32506, 29852, 40726, -20183, -22808, 7373, 2830, 31471, 61359, 84420, 61036, 9651, -19551, 2505, 14158, 10493, -16404, -12091, 88982, 76823]
14684G6823p3907j3455l8999K624K4676O761j3946M9949m533r522J4273j677o8001
14671d8934L1695Q5911m3333n3156r638j9572L9074J01534L1835L4511o8486o3149
14659A8292p4702m7760P460K8912j6457k0872M6714M3579O396k012p5879p072
14647i3401M556K7132k1640L342N2253M8750L7928L6711m9522n5213l2974j3463
14635e5541j4173J7634K609K6418K4630J7524j8728k1981k1433Q0428M6609J9326
14623A03322j855j3943l1237j6886j7067j6383r923K9399l955r278J5955l2332
14611d183M861P154k150J6124o59j1990L452L1477M2485l5447l1304j615M14J424
14597B0043M5127p993j3934P501P340o826Q556K3930K0960j991q4663J3268k6954
$$ y = [76823, 2916, -10539, -49538, -46914, -22238, -15477, -29423, 20526, 15993, 6471, 20744, 19067, -48934, -17239, 68672, 25339, -27817, -37455, -57027, -17953, 83581, 115416, 149927, 81441, 18292, -56410, -104170, -96710, -67798, -84255, -105127, -58413, -14834, -8438, -10450, -86329, -93401, -88845, -61713, -83353, -80011, -27758, 20992, 58920, 95631, 46109, -9104, -42078, -55541, -69714, -52080, -49471, -23053, 1577, 19101, 373, -21608, -43041, 37387, 83996, 103322, 101467, 87524, 56287, 39401, 22334, 5951, -3972, 25427, 21472, 12194, 28149, -4183, 678, 7832, 5682, 21806, 21147, 9157, 12609, 44086, 86571, 51124, 19820, 18205, 18619, 20043, 65170, 57177, 43243, 50744, 58084, 51258, 59814, 83744, 104704, 102713, 18050, 31318, 4364]
14584D364j3851M303k0638m5167l8241K8734K9565J4020K3527m8129q213k0233
14572h9959J6834N0933j3675j5341K0706M2903O64L0173k6998j6302j9864l9439
14560e9365k3087L788Q0681L0840n6369J5867L9038M7740j8750l8340k3037j1218
14548a2212l6098k5284k504O783O75n2796o331Q0921r66L492r268O543l873P450
14534d3468k0695L1179N8960j4790n6310k8310m818K0215O4394L286j8552J2894
14522C985n021q850J3727k6044k5618M5223L6200l6507k9420p8639l138L4674
14510g9428O4891K1603j476m7944j0607O6842M566j0871m5771l5170J0385k0874
14498h3854m984P484p756o00j3541O8650O6825m8277l827k967P584j5969k3211
$$ y = [4364, -9487, -5184, -25822, -70989, -109230, -80496, -50931, -36911, -13384, -61513, -69726, -89959, -73125, -22192, -35867, -51208, -30502, 12401, 13065, 43238, 16240, -62, -19926, -59365, -82452, -78664, 2017, 32857, -23512, -7645, 31393, 79133, 60383, 22043, -994, -12212, -48310, -73594, -76098, -69315, -68640, -121436, -127767, -46846, -47812, -44320, -53588, -47045, -50918, -43468, -64163, -32984, 25976, 11186, -45124, -73434, -78252, -58037, 6357, 9643, -8909, 3985, -1036, -9886, 3841, -22203, -47821, -2598, 33602, -2905, -32325, -110964, -114102, -79428, -14537, 7066, 5590, -42354, -52961, 13881, 18447, 7576, -38195, -73365, -62980, -83854, -88838, -81354, -89110, -89710, -103251, -34601, 32224, -16053, -19880, -22847, -15263, -31232, -54443]
14485e4443l5378o3353R492N3663M8971n141K462k0906J6581J4453K6958M9932
14473D3291K7773k9993o8944k9792J3817J7582Q9701J341n0370N615m8534J5096
14461a3417M756M1046j9952k1408K5410l7279L687O99m6735k2445M2819j3192
14449e6011J4467k1261l876L2190L8035l6674K4258N644K9006K9433n5743l0584
14437c1116O6451l2689l8943L4282j8976j4510L4126L1405j6991m8701j2172M6348
14425a486J8698l7253l4712M2653n098J1113L9202n4695k2351K5430N1891l9775
14413f383K0100M9467o4548o465l318J6092j2371k3781L4206M043q514n3789k6635
14400h1896J7727L2956O7174L2194q243q1802q5272N4101Q3101l0349m26r771
$$ y = [-54443, -89821, -153174, -143682, -90019, -41048, -46189, -43727, -64633, -48052, -33599, -6641, 43291, 71064, 41071, -27873, -57665, -43848, -26266, 63435, 64776, 14406, 20021, -28513, -13417, -8661, 32385, 12433, -8975, 16435, -20844, -17157, -16458, -63193, -85638, -42819, -56011, -41544, -62805, -66681, -34491, 3544, -33130, -8872, -3228, 25778, 55211, -532, -31116, 35335, 2646, -36297, -2015, -20991, -35501, -1375, 30030, 13039, -35662, -47834, -1486, 17212, -20041, -54753, -12100, -17198, -6085, 33117, -21578, -43929, -18499, 33392, -6383, 13717, 63184, -1364, -7829, -11147, 4945, -7426, -31207, 2999, 7042, -1472, -55261, -81896, -64169, -31213, 35961, 68155, 59912, -21890, -107162, -53061, 30040, -309, -735, -10506]
14388a0506k3314K67O8391L5940L3063r008o8159r525k5655P859Q0541m3350J7550
14375E4094O6363m079l1049J841J5068j8611n8894l9795M9904K484p9945k6577
14363f9196K2250K6362L3873j251N126K0854m4167k3290J8585n066l1921l2244
14351h0085K1903O7298J8393O4114L0103k054O878q5409q6565K1468J4178O6729
14339E6951j0989p0100m2477j6736L5415K8757q45j267K5969K2640k9782n5604
14327e8068r714K0768M2465L9233N7372j9699k3159n8379k5092k1570L6426L3930
14315A4513N2507K022k0106m5119l6283N3710k962q936n1921j3506M6059j5289
14303b5311o7003j5129O982O0886j1538j3835j1237L9091J3332Q239J2331l4000
$$ y = [-10506, -33820, -33553, 34838, 70778, 103841, 94833, 26674, 17149, -8506, -647, 79894, 36544, 54094, 120457, 116378, 85329, 87170, 102238, 83627, 24733, -15062, 34842, 37326, -42619, -69196, -46946, -20584, 13289, 12038, 17164, 38018, -6149, -29439, -10854, -15920, -47841, -80085, -58182, 9116, 27509, 91623, 121726, 119672, 126550, 41141, -45424, -23956, -9778, 56951, 45962, -24138, -66615, -83351, -47936, -19179, -20024, -21291, 4678, 27318, -2464, -58068, -67782, -47014, -4549, 34684, 92056, 72357, 49198, -9181, -34273, -55843, -19417, 14513, 67020, 69042, 48936, 3817, -32466, 21244, 18282, 9346, -42575, -56081, -10022, -25311, -92314, -107443, -100461, -39575, -51113, -64948, -76185, -37094, -23762, -15523, -3192, -37192]
14291c7192m930l8763L5194N9081M397L7337j2103q7457n8816P1974R7669N6283
14279A22674o2648r7290m3171j0880k1439K1676N811j1773K746L3942K2722m0378
14267g8008q819M0654M543N7759L392k4553O6944J2549m1978n2826j1231l1733
14255f3307J508P556j4365M6107J4210k5052N1185m4290l3272k1908r980N8164
14243c3444N5644K4800J222p9483k3731M919Q284M486P9502k5436n8059k5789
14231f7085M2924k9168J9725P19j8935L5189J11767J5422K7203k28j9739l5555
14219H2239J5096j1548p061k3319m3223M8435J1854m5611j5430Q934K4709n1891
14207f816k0839N3323k1906j282l9520k6959J6841m0165n2628R0989P995o817
$$ y = [-37192, -42122, -80885, -45691, 13390, 17787, 55124, 43021, -44436, -103252, -31278, 66391, 122674, 60026, -37264, -80435, -91315, -112754, -91078, -85267, -97040, -94294, -60352, -37630, -78008, -86827, -46173, -41630, 16129, 19521, -5032, 61912, 74461, 32483, -20343, -31574, -63307, -61799, -54243, -68608, -22501, -8291, -33343, 17842, -26448, -59720, -81628, -91608, -33444, 22200, 47000, 48222, -31261, -54992, -50073, -41789, -37303, 42199, 16763, -41296, -67085, -24161, -53329, -33604, -32885, -51820, -16631, 95136, 110558, 137761, 137533, 117794, 82239, 97335, 85787, 78726, 55407, 12184, 60619, 72473, 26862, 11432, 20366, 45075, -6816, -27655, 25668, 3762, 2480, -37040, -63999, -47158, -87323, -139951, -48962, -40967, -47784]
14195d7784K1576N811M8936P1380J9862j1269m972m3549m5389O7284l3015l2642
14183A6229P0907J3850j5272m2977p4863k6540J3400j5143L4385r677J5525K0354
14171A78P604M0403p593N369J927k1392j9535L43M6649L1941L5223m3512l398
14158G4207L6470J8144k740q171k9840M2095J7731o0203k9050m3608o6826j0990
14146f2781J8813O5153p556J2796j5112j3388j9054J1291J1524M7789k4149K865
14134B8191K7721p149J0257K4172k0782l6129k8976k6570L4419K4672k2652j3206
14122f032l6761j4332K7417p46m3J5897O4680J8631l7777m7999J6465K3411J2471
14109C5282l176n8515L8912P975l3102l4414r6919j2490R2787K6332k3907J9139
$$ y = [-47784, -26208, -20397, 28539, 99919, 119781, 108512, 103540, 59991, 14602, 81886, 48871, 16229, 87136, 100986, 85714, 42737, -32126, -58666, -45266, -60409, -26024, -35701, -20176, 178, 7782, 48185, 40592, 45961, 47888, 26496, 6961, 7304, 53953, 85894, 121117, 77605, 74207, 110677, 128821, 126081, 117910, 88070, 130165, 147896, 87693, 58643, 15035, -51791, -62781, -43968, 21185, 13629, 26425, 11313, -2075, -21129, -9838, 1686, 49475, 25326, 28191, 55912, 48763, 59020, 83192, 62410, 26281, -2695, -29265, 5154, 29826, 7174, -6032, -42793, -57125, -29708, -30454, -30497, -14600, 50080, 68711, 30934, -17065, -600, 22811, 35282, 32106, -26409, 12503, 20478, -12624, -47038, -143957, -156447, -63660, -37328, -61235, -42096]
14097d2096n257L4625J2112J1147J171k554j7151k5163l7701k7606J5774J0163
14085g2536L9305M1472J908k3815k029K5033L7636P258k0232m0112j4497L084
14073a7525k5650K3767O9010l2653k2279M7050J2220l9146l6982J8163L1471K128
14061B9574j727k7040j6017R158L393J606R251K573k8910J344k6455J6576L6550
14048I876K7404r100l3099o6799K2970M6260O245J4593K224p084K6950R690n8855
14035h725k1335M710O0726K8858n7864r3554Q946L1701K904K6454K5841L512J7367
14022B9541K0148j7173L570j8609m2123J146O0885J0209p055l4251n1644n191
14010e0547K0394K6174j4707p014k6507q899O3428J0000M126k2577l2892o9982
$$ y = [-42096, -47353, -12728, -616, 10531, 11702, 9148, -8003, -33166, -70867, -98473, -82699, -72536, -33231, 8241, 10149, -13666, -15695, 9338, 46974, 54232, 34000, -6112, -20609, -17525, -43175, -19408, 49602, 16949, -5330, 41720, 53940, 14794, -22188, -4025, 27446, 29574, 27847, 807, -15210, -6052, -2659, -1053, 8198, 10771, -18139, -16795, -43250, -26674, 9876, 37280, 28180, -4919, -71718, -48748, -2488, 3757, 18350, 20574, 13490, 40440, 50130, -8725, -30060, -25350, 35376, 64234, 6370, -87184, -78238, -46537, -43633, -17179, 8662, 12174, 29541, 49689, 32516, 36086, 17477, -24646, -23500, 37385, 47594, 40539, 6288, -45356, -50547, -30153, -3979, -18686, -25700, -52207, -61106, 2322, 12322, 16448, -6129, -39021, -109003]
13998a09003K4337R5011L029l0232j5538l8504N493M3719J3202O212K446m7682
13986d7510o970K0340K489m6321r035J5701K5630R243j741l7778K8335o8403n291
13973a21311M7795P510m033N0273n0263l9031L2293K4119J853j4948J02M2928
13961b2713j672M2050O5184M0432l5246p4216L550M2123J4509j1642q279k6705
13949B7375k7907O639Q2150L1200j1029L9469j8901n0235p553p2103n4332O8895
13937A3668K3821Q937m2858k3143J06010L6010n8117n2918P1351j4721J1698O937
13925H6675k786j7617J787o8765N381L5978J4961K3812N42n0033k8612M2875L0056
13912G4254j7437J6038l4736l5937k6862L6863L8576j5933Q801l103l7251k3580
$$ y = [-109003, -84666, 10345, 13374, -16858, -32396, -70900, -65407, -21688, -8486, -2274, 172, -47510, -54480, -34140, -31651, -77972, -87007, -71306, -45676, -36433, -38174, -75952, -47617, -116020, -121311, -73516, -66006, -70039, -19766, -70029, -109060, -76767, -52648, -50795, -65743, -65641, -22713, -24385, 17665, 82849, 123281, 88035, 13819, 17369, 59492, 74001, 62359, 54080, 27375, -532, 6107, 88257, 119457, 108428, 147897, 128996, 78761, 71208, -895, -55227, 13668, 37489, 46426, 3568, -19575, 86435, 122445, 64328, 11410, 82761, 68040, 79738, 86675, 83889, 66272, 68059, -706, 4675, 40653, 55614, 79426, 79968, 29935, 1323, 44198, 74254, 56817, 72855, 38119, 2182, -24680, 12183, 50759, 34826, 43627, 40524, 3273, -20307]
13900b0307P761M0122j6264n6820n3512K7283M248L1741L2389q959j8688j3805
13888d4811k095J9226K5668N1335j1197N3634K0409o9359o9893L5302k6571n2076
13876g0428m6942q297L0566O4345k3209L2525N520J6157J3218J2618L8830k1931
13864D2972J2926K376L5565J0099k3438m6782J1089j5617k0688k0920j5628P3853
13852D5807q44n9436n4699J7784Q686J444j8703L2293M7002n1468k8431K6823
13840c3742L3011J1018p0939O257k8255j5629K3123K0335p391K6436L6294M8653
13828D9171j9749J6559J6273L3045M3337k9599l9588j9600K162k788L7968m8646
13816C8545n9701j6823L1889j8139k2817K1140j1197j0343N7434O537Q433M3803
$$ y = [-20307, -12546, 27576, 11312, -45508, -99020, -71737, -67489, -35748, -3359, -12318, -31006, -44811, -46906, -27680, -2012, 49323, 38126, 91760, 112169, 42810, -27083, 8219, -18352, -70428, -117370, -125667, -95101, -30756, -53965, -21440, -15920, 237, 13455, 26073, 64903, 42972, 55898, 58274, 93839, 103938, 80500, 33718, 44807, 29190, 8502, -12418, -28046, 45807, 44963, -14473, -69172, -51388, -42702, -41258, -59961, -27668, 19334, -32134, -60565, -33742, -731, 10287, -60652, -54395, -82650, -98279, -75156, -54821, -62212, -35776, 518, 49171, 29422, 45981, 62254, 95299, 138636, 109037, 69449, 49849, 52011, 49223, 87191, 38545, -21156, -37979, -6090, -24229, -47046, -25906, -37103, -47446, 9988, 16525, 24958, 68761]
13804F8761k2414m8965j8854o5378J3333O0361J1004j2533k3621J2807K2774j6346
13792a9071r1j6228J6002K0830n413j2100j3337L2006J8850K1701j2667l7659
13780g177k201m4669Q822K0358k399l0117j9526J4666L4720q216J0403j9264k1149
13767f5749o553M9228M288J2353j8594k376j4076J2252l1438n18r272K450l1751
13754i9756K672L2244J6375L7926K7437k8258j8340M4324j5982P507M2431k8261
13742B0319M407l777n3835j1380j2559k4584L1814n7225M8516j0166Q664L6015
13730b3791k617k1890j3257N7279M9744M5319M0267L3152l6522q2870j3547m6090
13718a4823k999K8157k7991n6567q1382K19O1704N487L7012Q751N3715N2543j2006
$$ y = [68761, 46347, -2618, -21472, -86850, -73517, -13156, -2152, -14685, -38306, -25499, -2725, -19071, -19162, -35390, -19388, 1442, -3971, -16071, -29408, 2598, 21448, 43149, 30482, -7177, -9378, -54047, -45225, -24867, -27266, -57383, -76909, -62243, -27523, -35739, -25336, -44600, -65749, -72302, -23074, -18786, -6433, -25027, -27403, -41479, -29227, -60665, -61183, -70455, -68005, -99756, -97084, -64840, -48465, -10539, 16898, -11360, -29700, 14624, -1358, 6149, 48580, 20319, 24726, 20949, -32886, -44266, -56825, -81409, -49595, -106820, -58304, -68470, -59806, -23791, -26408, -48298, -61555, -4276, 45468, 90787, 131054, 164206, 127684, 44814, 31267, -14823, -17822, 10335, -17656, -74223, -155605, -155386, -93682, -88195, -51183, -42432, 11283, 63826, 51820]
13705E1820j7913k4536m006n954o0286m7945L5817L5895O6955k6186r890l8434
13693d4663j3764K6862L7874M5176J1262J320n655m8658k0696K1071l2807p5022
13681i7700m0128J4369N2057O9200l2396M1998Q516l2559K4715P8843O3771K2708
13669A73394q6632o258m6805m8930m2019J6685J0027K6786K7876L0412L7857p987
13657H4406n4688m1148n045O153K0404l3696K3971k8745l4940j2996N9659O4488
13645D7823j1671j1659J16q531K1594m679l7996k7302k9883P712R100K1610K3827
13632F1q552K2108M7808J4980q316m4331l0850k4656m5679Q389K3229K6499M7144
13619B7834L675o888K7926m9042J0702M367n5926J5018j8366m172K5154j1147
$$ y = [51820, 33907, 9371, 5365, -589, -60875, -108820, -73003, -37108, 29847, 3661, -6229, -44663, -58427, -31565, 6309, 51485, 62747, 64067, 58412, 9754, -10942, 10129, -22678, -97700, -137828, -123459, -71402, -2202, -34598, 7400, 15916, -16643, 8072, 86915, 150686, 173394, 86762, 80504, 33699, -15231, -57250, -40565, -30538, -3752, 24124, 54536, 92393, 84406, 29718, -11430, -16475, -10322, 10082, -23614, 357, -28388, -63328, -76324, -16665, 47823, 36152, 24493, 24609, 16078, 37672, 32993, -5003, -32305, -62188, -54476, -45376, -23766, 61, -8491, 13617, 61425, 76405, 68089, 23758, -7092, -31748, -77427, -69038, -45809, -19310, 27834, 31509, 24621, 52547, 3505, 14207, 18574, -37352, -22334, -40700, -44872, -19718, -30865]
13607c0865L6296j8291l2262r420N58q899R49M6073j5116L359J6505k0386k5591
13594e7090K0483P5286L7645m9584k5637k8179M8312M8484m9572k7883n146K7646
13582A4765J456k992J6140m9273j0255j7874k1391P7441K5256Q51j4092n297n857
13569H878J9663m6712o6152L8725J7048N9601J3837M6003j7777m8905o316J885
13557A9778m1728J6580j5827k6522M19J5343N571L3614j2518l8995J0121R389
13545b4775j7080J6090J2900K8110M9733j9308q899l2717l2464l3304K3107R832
13533b8775m9270q801O1359N4533K1233K0970L5576j1153k6747k7525m9924m2448
13521e0972J2955K1558l6882j5219L8133o701k9531m7020M0465K0081J904O618
$$ y = [-30865, 5431, -12860, -45122, -54542, -53984, -62883, -61934, -15861, -30977, -27618, -11113, -31499, -57090, -36607, 38679, 76324, 26740, 1103, -27076, 21236, 69720, 20148, -7735, -12881, 14765, 16221, 13229, 29369, -19904, -30159, -48033, -69424, 8017, 33273, 34124, 20032, 14735, 8878, 28541, -18171, -84323, -45598, -28550, 31051, 44888, 90891, 73114, 24209, 17893, 19778, -21950, -5370, -21197, -47719, -47300, -31957, -26386, 7228, -5290, -44285, -34164, -24775, -41855, -25765, -12865, 15245, 64978, 45670, 36771, 4054, -28410, -61714, -38607, -28775, -78045, -86846, -25487, 29046, 50279, 71249, 106825, 95672, 68925, 41400, -8524, -50972, -38017, -16459, -53341, -68560, -30427, -37128, -66659, -113679, -73214, -53133, -51229, -44611]
13509d4611m7713L6675J2501M4419L2219j239J7949j3291m731K4130m9371l335
13497C602R18J390L833J2762o282K7271m1994K4743k2835n7322n126O5985R2327
13484I9272m5729j4522j3145n8188j2566J1238M1915k0581j6702K5497J5591j3842
13472a762N6971O9191m8205n0763j0589n5020n6962M7276M9380N909K0700M8303
13460G4429J2646l8374k6279L986k3979L1308R019L5197J186j04676j8524P904
13448c6157K8843l8136n8208M8986L6159J4375N017P0041j0629N247m0688m4599
13436a9749M961o258l4429j2522L0297N3413K7632m0597p3911l7358k6497l0859
13424a65877K9708p8Q4786P2852k2358J4620K7431L8070J2695M196l003o8175
$$ y = [-44611, -92324, -55649, -43148, 1271, 33490, 32251, 50200, 36909, 32178, 56308, 6937, 3602, 4520, 5910, 9743, 22505, 16223, 43494, 1500, 26243, 3408, -53914, -59040, 6945, 99272, 53543, 39021, 25876, -32312, -44878, -33640, 8275, -12306, -29008, -3511, 12080, -1762, 55209, 124400, 76195, 25432, 14843, -40177, -97139, -49863, -483, 5426, 26126, 74429, 87075, 48701, 22422, 26408, 2429, 33737, 42756, 77953, 79139, -25537, -44061, -36157, -7314, -45450, -103658, -54672, -18513, -4138, 879, 70920, 60291, 65538, 24850, -19749, -14788, -21046, -55475, -67997, -37700, 15713, 43345, 2748, -71163, -108521, -135018, -165877, -136169, -136247, -51461, 21391, -967, 13653, 41084, 79154, 91849, 96045, 93042, 24867]
13412B4867m704J1717L3752J8047J4060r0155J8746P0983j0515n3363J4541j134
13400D6842o7982l5321K200J4497O007j5810o489m603J4449J2858N280p245J3191
13387b2126M919j4177l1488N736q214j6848r10N4529N368j6747M6250L5583J0009
13374E1884J8441k3486M752K2621K8714Q57k9268l8027k3096N7026Q7124o8683
13362H8859n1688j4595m3706M1247P051O0163j4449J8326L8426k4296k5394k2993
13350E6951l9604J0816K9182j2406j8433q1952l8827P974L1939M4406k8072K4838
13338a3188K8375m683j3906J7209J6894j9294k179J0273N7313j9282j1855L5185
13326H0862l3763K6457J1618L123m849q8243K8308K6485L593m3720m2217K9012
$$ y = [24867, 20163, 31880, 65632, 83679, 97739, 7584, 26330, 97313, 86798, 33435, 47976, 46842, -21140, -56461, -54261, -39764, -33757, -49567, -56056, -60659, -46210, -33352, -28072, -35317, -22126, -17207, -31384, -62872, -57136, -65350, -82198, -83108, -28579, -23211, -39958, 6292, 41875, 51884, 70325, 46839, 51591, 74212, 102926, 103783, 74515, 36488, 13392, 70418, 157542, 88859, 37171, 22576, -21130, 20117, 27168, 87331, 72882, 91208, 129634, 105338, 79944, 56951, 17347, 28163, 57345, 44939, 26506, -55446, -94273, -86299, -54360, -9954, -38026, -13188, 15187, 10504, -3402, 13807, 30701, 11407, 9228, 19501, 76814, 57532, 45677, 80862, 47099, 73556, 85174, 88297, 83448, -4795, 23513, 49998, 53591, 9871, -32346, -3334]
13314c334K9568J4527M4167J5615J5043l7878j6981k3592j6680M374Q664J8959
13302E2452l9126m4079n949k396K7894j7071k0448P480M0336Q885n5240K0693
13290b6569P0420k5265o5062j6977M5521N1729l0551J8628K2120n0366k1724K763
13278b5333k6661m5500k8286N0099M0858M080l0530K1456M7139L0257k0862M5151
13266F1868l7688J4998o504j1655J9231K2302k4894l5512j0906j5264J2347m4638
13254e6315k1798O881n7386l2741K6111L2569l0568J7999R699j6747j0251R7584
13242c4963N7810k9876o8280k8995O2876O1730M7257L5581q1811m1528K6236m638
13230A399K5513N0413m5780n0279J6938j6139o7237n8224O333Q3562P9771j2742
$$ y = [-3334, 26234, 40761, 84928, 100543, 115586, 77708, 60727, 37135, 20455, 24829, 33493, 52452, 13326, -30753, -36702, -39098, -11204, -28275, -48723, -41243, -907, 7978, -47262, -26569, 43851, 18586, -46476, -63453, -17932, 33797, 3246, 21874, 43994, -6372, -28096, -25333, -51994, -97494, -125780, -75681, -34823, -30743, -61273, -39817, 7322, 37579, 16717, 61868, 24180, 39178, 32674, 21019, 40250, 62552, 37658, 2146, -8760, -24024, -11677, -56315, -78113, -71232, -128618, -161359, -135248, -102679, -133247, -115248, -105549, -122296, -132547, -34963, 22847, -7029, -75309, -104304, -41428, 20302, 67559, 103140, 21329, -20199, 6037, 1399, 26912, 77325, 31545, -18734, -1796, -17935, -85172, -143396, -137063, -53501, 26270, 13528]
13218A3528j8265j9287J5044l153Q634J1789L0723M3535r461k1969m697L2019
13206G8440k6483k194k3199l5846p398l4691K757l989p818M9933P8832M3267j5960
13193I5651m0688M0116k1562n4253l1783j5333J7898k7158j9442J542j9284K091
13181g2205K5372J7981J1849l6395m6955J6147k975O556R291j550k6627l4886
13169a34397M4497L6864R2838K6031m1708j7060l467J0060P622M2947R3436k8226
13157A29437j01818l1667k2440l388K1930M5448m5223j3781R383M3279k5815l7949
13145c2604k3851n1829M8009L2847J2064J9590J5015n095L4026j2209O4881p557
13133I3287m1957k8386k5908M964j1900P889l2360K1048K9453l1581n9701M5775
$$ y = [13528, -4737, -24024, -8980, -12133, -3499, 8290, 39013, 82548, 73087, 51118, 46421, 78440, 51957, 49763, 26564, -9282, -16680, -51371, -48614, -52603, -60421, -10488, 68344, 111611, 95651, 54963, 95079, 73517, 19264, -12519, -27852, -9954, -37112, -56554, -55012, -74296, -72205, -46833, -28852, -17003, -53398, -100353, -84206, -87181, -80625, -71334, -72884, -99511, -134397, -89900, -53036, 39802, 65833, 24125, 7065, 3598, 13658, 21280, 64227, 157663, 129437, 27619, -4048, -26488, -29876, -7946, 37502, -7721, -21502, -12119, 31160, 5345, -32604, -56455, -108284, -60275, -27428, -15364, 4226, 19241, 14146, 48172, 35963, 100844, 93287, 51330, 22944, -2964, 2000, -9900, -2011, -34371, -13323, 16130, -15451, -75152, -29377]
13121b9377O7777j426o5429m2740m6262j5797O9381M1344M830L5699q461n3271
13109d3732M0458m6416m4050J4795L2274J9770L0782J6217n163l1279j7705R819
13097b4230K2926n6180m4939m5401j398L6088M2464O0946N9381J7640l8242l7083
13085h028N278k269N995K0332L0883o147K6806M6374j0403l9203o4466m961L3837
13072C4028N421N0049K1526o1410l0771K4921n551l6853K4239L0067n9162K4826
13060B1330J8138j7103j7532L903m2661N243j15n140r729J1888j8964k3566P0485
13047c823L155j0767p7579j5597L6058O8332K6459N2459m309P3L4454M4362P7473
13034B30750N5144Q6472L0897K389k8648J4497o9856m1036n5878m9546o4105n4614
$$ y = [-29377, 38400, 36974, -28455, -71195, -117457, -133254, -63873, -22529, -17699, 18000, 9539, -43732, -3274, -49690, -93740, -78945, -46671, -26901, 3881, 20098, 14935, -16344, -34049, -24230, -1304, -57484, -102423, -147824, -149222, -113134, -70670, -9724, 49657, 67297, 29055, -8028, -2750, -5019, 976, 21308, 52191, 46044, 72850, 119224, 108821, 69618, 5152, 191, 34028, 39449, 89498, 111024, 49614, 18843, 43764, 38213, 1360, 25599, 55666, -3496, 21330, 39468, 22365, 4833, 8736, -33925, -28682, -28797, -33937, -43666, -31778, -50742, -74308, -3823, -668, -11435, -89014, -104611, -68553, -221, 26238, 78697, 74388, 74461, 108915, 153277, 230750, 285894, 372366, 403263, 405652, 377004, 391501, 321645, 280609, 224731, 175185, 111080, 56466]
13022E6466J8325L722l517j2388o8759l4274K0076M6960l3862j1142m7340K3784
13010d1949N1275O523J7610j4823L7721k4407j5071k427K593L910j4417N2011
12998E8549K0292L4254p7476m4291L524J2582K6678J7823R186P5640J20625J38093
12986C95479Q7703k3570p8864o7727o7100m6720j3254p335J0003L398n9990j9987
12974A12036p713L3279l0973L1220N83j7297m3511k2089N2099M635j1185j5061
12962H6023m9346m9862P530N2315J823n5839j1415J2378M2769O0239p2198l1067
12950f650K5570p356k2937p362k879j736K7363K9858M0238P0240l199k6258l5893
12937G8999j8510j6523J042O1858J8993r2074p5126L3057M4182j3136m826j1334
$$ y = [56466, 74791, 78513, 74996, 62608, -6151, -40425, -20349, 26611, -7251, -18393, -65733, -41949, 9326, 15849, 33459, 18636, 56357, 31950, 16879, 14452, 17045, 20955, 6538, 58549, 78841, 113095, 35619, -8672, -5148, 7434, 34112, 51935, 61121, 136761, 257386, 395479, 483182, 459612, 380748, 313021, 245921, 199201, 185947, 178612, 188615, 192013, 132023, 112036, 104323, 137602, 106629, 137849, 138432, 121135, 77624, 55535, 107634, 112269, 101084, 86023, 36677, -13185, -5655, 46660, 48483, -7356, -18771, -6393, 36376, 96615, 24417, -6650, 18920, 11564, -11373, -18735, -21614, -23350, 4013, 33871, 74109, 144349, 141150, 114892, 78999, 60489, 43966, 45008, 106866, 125859, 33785, -41341, -8284, 35898, 22762, 17936, 6602]
12925F602O741L3349q0367o8690K9814L5587k762L3199N9087M9368k882K5336
12913A24382L5093j5110q028p6291n9308m7502l151P5120J7249n355n2512K8739
12901A3326K1987O8634l1112r4860j2207L5404M0077J0223l56R112m8478l8670
12889b6920j3027J8804L2549K1648j9423j770j8170n76O4274K6499m2486m6205
12877d803K4881K8819N90j5754j8307Q902q928k5370P369j0760k0879J5768l1742
12864e0214j0506K8444J3707R932K8451K2065k719R150j7508J7002J6679J2168
12852G6651q5775m9276m3053N3473N4096M0489k1959m6383j8427L2461l0345L9624
12840A576o94l6675J1718K3857q916K4367j6582L7876Q484m0349j2304l361o193
$$ y = [6602, 13343, 46692, -33675, -102365, -72551, -36964, -39726, -6527, 52560, 101928, 99046, 124382, 159475, 144365, 136337, 60046, 738, -46764, -49915, 25205, 42454, 37099, -15413, 13326, 35313, 103947, 72835, -22025, -34232, 1172, 41249, 51472, 51116, 60228, 11750, -26920, -39947, -21143, 11406, 33054, 13631, 11861, -6309, -6885, 57389, 83888, 41402, -4803, 20078, 48897, 49487, 33733, 15426, 24328, 15400, -9970, -2601, -13361, -34240, -18472, -50214, -60720, -32276, -18569, -8637, 19814, 41879, 39160, 48310, 30802, 47804, 64483, 76651, -9124, -58400, -101453, -47980, 6116, 46605, 24646, -21737, -40164, -7703, -38048, 1576, 882, -35793, -24075, -218, -9134, 15233, -1349, 36527, 45011, 4662, -7642, -11003, -17196]
12827a7196j5531Q625N0764j8599p0560Q301K3318K4344J576l5352J9961K1637
12815A288j8162r17M2326J5734J4926k959r266r4181j14206J6038Q8632O7791
12803G044K0685K9639k3181o6018m572K2352N4134j6755n4986m6045l350j080
12791h2133K5488J5305P430O1960P2775p7122k5041n46j0063P04j8446k8382J9919
12778c8152j7918Q708p271j0062O76r507M795Q0331M4340n8038k406k6817N5240
12765B3919O7088L11m8962o3125M413r599N9020l791p4824j2141L0535R488J0029
12752g639k5497K7910J9388L5877r543o7029p8618k1712N7362L8622M8484J6628
12740C4233n4243j6300L5277R761J5359n925l5747m0383j7561N543k0274j8414
$$ y = [-17196, -32727, -24102, 26662, 8063, -62497, -54196, -30878, -6534, -4958, -40310, -20349, 1288, -16874, -17791, 24535, 40269, 55195, 52236, 42970, -51211, -165417, -149379, -60747, 7044, 27729, 57368, 34187, -31831, -36403, -14051, 40083, 23328, -31658, -77703, -81053, -82133, -56645, -41340, -33910, 28050, 100825, 23703, -1338, -1884, -11947, -11243, -29689, -58071, -38152, -56070, -47362, -54633, -64695, -64019, -73526, -68731, 11600, 55940, -2098, -4504, -31321, 23919, 91007, 91318, 42356, -20769, -16356, -25955, 33065, 29274, -45550, -57691, -27156, -17668, -7639, -33136, -5226, 14162, 50039, 40496, -26533, -105151, -126863, -69501, -30879, 17605, 34233, -20010, -36310, -1033, 8728, 24087, 18162, -17585, -57968, -75529, -69986, -90260, -108674]
12728a08674j453k1917K7861N001N6206K8439j6755j2901k756L2045L4122J9364
12716C8582O985q625J0044j2508k8847L5063J3505k1235j9753K1789J9412m9896
12704D516l3949j3075K5929J5547k8748m2925M7580M5353N2763K4716j6206k3500
12692E8001J0552j9248r060L7964o968j4680k2385J0213L260l6368j7303m087
12680a0109N1122J172j9588k6049m7890p6598K3082O0203P1264j4303k460K609
12668A2455n6665N263M7676l1236K7136Q569L5787J1972n4255r5711M4750J6450
12656b7809Q267Q407M792M4795L387j01181j620M0909k511n0511m1349l1438K1241
12643a24621l7492L5372K6199P8617M8781l0495m0909o3480l5774K3137K8527
$$ y = [-108674, -110127, -132044, -104183, -99182, -42976, -14537, -31292, -44193, -46949, -14904, 19218, 38582, 45567, 36942, 46986, 34478, 5631, 40694, 54199, 32964, 13211, 35000, 54412, 4516, -29433, -42508, -16579, -1032, -29780, -72705, -25125, 20228, 72991, 97707, 81501, 58001, 68553, 49305, 40245, 78209, 71241, 56561, 34176, 44389, 47649, 11281, -6022, -10109, 41013, 42185, 22597, -3452, -51342, -127940, -104858, -44655, 26609, 12306, 9846, 12455, -44210, -38947, 8729, -22507, 4629, 13198, 48985, 60957, 6702, -89009, -44259, -27809, -19542, -11135, -6343, 38452, 41839, -59342, -60962, -20053, -22564, -73075, -114424, -145862, -124621, -162113, -126741, -100542, -21925, 26856, -3639, -44548, -108028, -143802, -120665, -92138]
12632i2138M600K4587N3904M7327M4087k4896j021n5324O917K0483M1807p515
12620F2818l3667m3304J4272O2895L0287m2756k6890L040L0768m6084l3279L2493
12608A0593O6289K4901p981Q560o2515l8958l6520K7639N6209l760O680k4843
12596B6294l6225N2246K6516o1544p284L4864j6745L1194m8839N474M159o0991
12584e0881m2402l0867J8463Q6025N5728L0426J411n3299J435m3042J6790j1332
12572b1545K8464j6889n3354k5568O8682L7449M3525K8535L6364o4142m2167N0481
12560F9835n705j8256n0253J0841L1147q50n6711M206k1857l4078R7926N7715
12548H3960k4593K5008n595l2012m8l4328o071M824L5262j9624p9637M591Q3160
$$ y = [-92138, -87538, -62951, -9047, 38280, 82367, 57471, 56450, 1126, 8043, 28526, 70333, 62818, 29151, -14153, 119, 63014, 93301, 50545, 23655, 26695, 57463, 11379, -21900, 10593, 76882, 101783, 93802, 102362, 39847, 889, -35631, -7992, 48217, 44457, 51137, 26294, -9931, 42315, 68831, 7287, 3, 34867, 18122, 49316, 477, 5951, 10110, -50881, -93283, -124150, -105687, -19662, 36066, 66492, 67903, 14604, 16039, -27003, -10213, -21545, 6919, -9970, -63324, -88892, -20210, 17239, 60764, 89299, 125663, 61521, 19354, 69835, 64130, 45874, -4379, 6462, 37609, 36759, -19952, -15746, -37603, -71681, 26245, 83960, 59367, 84375, 78780, 46768, 46720, 12392, 6321, 11145, 46407, 26783, -52854, -48263, 34897]
12535C4897K9280K4807k4547n2711m5010l6266L6359K1218L4974K9896o655n7416
12523a1174O945j3741k5102j085k460J7581N832R6590L2356k9357k0215k3921
12511C2249p0840m6504J9805R633j0287Q8524K4565L6981O350l7860l9817J3175
12499B5974L0814o8409m5503O345K4149K8259q625l2341N121j7518r211l3724
12487i4669M5923L5976j3434J7145r751J6659j024K6152k5346j8047n2783N996
12475f7203O7018M0433P3232K5372K3256m3794o3565J3336M386n1018j1752k9364
12463a9663j5954k3973j5406M940L3204R459l7363l35L6275M3892L3080o7819
12451a9663p092L7417K7183O663k6382P815L1220m1227l3193K0417K5803M973
$$ y = [34897, 64177, 88984, 64437, 11726, -33284, -69550, -33191, -11973, 23001, 52897, 46242, -11174, -4229, -17970, -43072, -44157, -46617, -29036, -23204, 73386, 105742, 76385, 56170, 32249, -38591, -85095, -65290, -55657, -65944, 22580, 47145, 84126, 90476, 52616, 12799, 25974, 56788, -11621, -57124, -50779, -26630, 1629, -6996, -39337, -34216, -51734, -60945, -94669, -48746, -12770, -26204, -9059, -18810, -2151, -3175, 22977, -2369, -20416, -73199, -67203, -185, 40248, 113480, 138852, 162108, 118314, 54749, 68085, 72471, 21453, 9701, -19663, -35617, -59590, -74996, -70056, -36852, -27393, -64756, -65091, -28816, 15076, 48156, -19663, -26755, 10662, 37845, 44508, 18126, 25941, 57161, 15934, -17259, 3158, 28961, 33934]
12439C3934k6962r9299J5179J8881M7902L1790N9362K270k4890j8935K2424L8140
12427I9796n718k7346O29L7858M155k9821j0018J630n773K8214l9897m1189M6638
12414E9158J7496j8539J1696j6948k2216l4423j8741J1039J1413l3213j7128o026
12402e6432m0967l0710K9745L2075K0346p519r919l2524Q984M2759M9044O07j0132
12389d643l0522k0909Q1152j8515q8382k4852p675K0239K2333M1538k6091l4453
12377i0780l4407K0008M6251K2456l0987l2929M1126k8063j3836M3838j637L5232
12365b3728K4810k9225M7848l9927l9582K5752j0761l8318K4625M6146l4022j1291
12353e7673O7988r418K0090l3867K6005l2275j7162j467q63o978m742N6660L026
$$ y = [33934, 6972, -92327, -77148, -58267, -10365, 21425, 80787, 83057, 58167, 39232, 61656, 99796, 94078, 66732, 67361, 105219, 109374, 79553, 69535, 71165, 65392, 93606, 53709, 12520, 59158, 76654, 58115, 69811, 52863, 30647, -3776, -22517, -11478, -65, -33278, -50406, -56432, -97399, -128109, -98364, -66289, -45943, -53462, -63381, -95905, -86921, -44162, 4882, 5489, -4643, -35165, -56074, 25078, 6563, -81819, -106671, -114346, -94107, -71774, -30236, -56327, -90780, -125187, -105179, -58928, -36472, -67459, -100388, -59262, -87325, -101161, -57323, -58960, -23728, 1082, -28143, 19705, -20222, -59804, -34052, -44813, -83131, -58506, -12360, -46382, -57673, 10315, 897, 20987, -12880, 13125, -19150, -36312, -37779, -38642, -45620, -50362, 6298, 9324]
12340I324r278l8809l7009n7861m3760O9378P7674J6163l9026k0140J6175L6139
12328b1030m2544Q684M3397J7906J9204N077l8285p27m4716k0394J4902L3283
12316b5243j6385M5703j5500o9878m3360K5963N7220p056k1332M4061K5908q139
12304h038L2565L3336m7242Q276N7352J4961j6650l1747k3979q889l380L8955
12292D5520m699o3302n3345N351m9034r358M7974M1423k0411j6755N081m263m1222
12279a17040L5458J6184N734j8153j5385m2296N2849J7881k3535M9196L3369l9480
12267d5218k7125R027k88M0483N9070K2830J2513L767k1850p3212n3994j6928
12255i0925N1239N8191n8303l2047M7727J9867n0694k1994J5807J4669L3732k9398
$$ y = [9324, 46, -38763, -75772, -133633, -177393, -108015, -30341, -14178, -53204, -73344, -57169, -21030, -63574, -54890, -11493, 6413, 25617, 30694, -7591, -8318, -53034, -73428, -58526, -25243, -41628, 4075, -11425, -81303, -124663, -98700, -41480, -48536, -69868, -25807, 101, -8038, 24527, 57863, 10621, 18897, 76249, 91210, 74560, 42813, 18834, 9945, 6565, 45520, 40821, -22481, -75826, -70475, -119509, -128867, -80893, -39470, -59881, -76636, -71555, -75818, -117040, -81582, -65398, -59664, -77817, -93202, -135498, -82649, -64768, -88303, -39107, -5738, -45218, -72343, -63316, -63604, -23121, 35949, 58779, 71292, 75059, 53209, -20003, -73997, -90925, -39686, 18505, -39798, -71845, -24118, -4251, -54945, -76939, -61132, -46463, -12731, -42129]
12243d2129K977K533r640K883N7171L033K2638j0172q4493O889Q7070K182m5189
12230d247K0406m1299M8036L7053k1094l3513r0546J7146N9724n256J9200R932
12218A5542K2024N114l6154l4193m815K6916M0596O956O740l1751m9023m2938
12206g4986L7103j2575M9709Q581o9924J098K7633k4565J7117k7350L491n3096
12194a17764k7160O455N6109k2967m1906O7691M1342l7545N4432P566O6020J2696
12182F4969j8967l4499p216L4536m3651J3261M1216n859m0345L4369L8188N017
12170H1019l3161n5582m0276O9021J6123l3575K4386P342N4160J9047l1611J0056
12158H6949K1957k7515q8772J685O0919J627j8271r040l0045o035j627k2274m923
$$ y = [-42129, -39152, -36619, -46259, -43376, 13795, 16828, 39466, 29294, -55199, -48310, 38760, 40942, -4247, 16159, -25140, 22896, 59949, 38855, 5342, -85204, -68058, -8334, -13590, 5610, 15542, 37566, 42680, 6526, -27667, -32482, -5566, 35030, 41986, 48726, 16975, -32048, -74986, -37883, -50458, -749, 7832, -62092, -60994, -33361, -57926, -40809, -68159, -64668, -117764, -144924, -138469, -82360, -105327, -147233, -79542, -38200, -75745, -21313, -13747, 52273, 64969, 46002, 11503, 4287, 38823, -4828, 8433, 49649, 43790, 3445, 37814, 76002, 81019, 47858, -7724, -48000, 21021, 37144, 3569, 27955, 35297, 89457, 108504, 76893, 86949, 108906, 81391, -7381, -5696, 55223, 56850, 38579, 29539, -506, -6541, -8168, -30442, -35365]
12145c5365M5240Q1444q356m2067K97Q4488J1706n918J8561M0698p3205j13522
12133D001J0916R6375p1971p7038N806Q0017L7231K0743k4715n1527n6175r300
12121c5637L675r122n0385k0464K6211N2671N8914N2895k7423M298K9799k7102
12109E8330l240L1514k2434k6655K7673L4799k2021J0834L5601n4970J2769n27
12097H1673j8742Q099k4548j1213N43K065l1102k0229J1493L7151L712N3574J080
12084I3556k0017m4714K5582q202k6501l5687q290M2575O0391J6140m6114P0658
12072A19377K4619k7830m0768K2966M3508M400o3575j3938K7279P7696m626o351
12060A62757k4927L8000l8300p6132J7810m2529n2833Q137K1899L1045J777R426
$$ y = [-35365, 9875, 91319, 82963, 40896, 41193, 125681, 137387, 131469, 150030, 190728, 117523, 4001, 14917, 111292, 39321, -37717, -31911, 48106, 85337, 106080, 81365, 29838, -26337, -35637, -31962, -41084, -91469, -111933, -85722, -33051, 25863, 78758, 51335, 55633, 85432, 58330, 55090, 86604, 64170, 37515, 65188, 99987, 77966, 88800, 124401, 69431, 82200, 81673, 62931, 71030, 46482, 35269, 35812, 37877, 6775, -13454, -1961, 35190, 38902, 92476, 93556, 73539, 28825, 54407, 46205, 19704, -15983, -24273, 18302, 78693, 94833, 48719, 119377, 143996, 116166, 75398, 98364, 141872, 146272, 82697, 68759, 96038, 173734, 169108, 162757, 137830, 175830, 137530, 61398, 79208, 36679, -16154, -8017, 13882, 44927, 46704, 56130]
12048E6130j9031J7440L9141m46l722J8004J9394J3447j27405j6692P8998N9221
12036A34479p2808r3991M2385M2091l731p9319n7496K5612P4209L0340K5514j0239
12024E7046L1534L6830O360p146M229k9627J3682R009L7841l640q5592k5075O18
12011D6069N6353R7552R073L4006L418l2214j0098J2710O2737L7767m8229k6565
11999B42579M4564j2586o1912L2949M702k2677J2779J8539N4594J0540R859k7128
11987C06802M5748M3957M1452j7975J7986l327k8766K081L55O5140K8964l0861
11975D71556K3109j050r048K422J3636L2465K2756k7528L0837K1272J4244O1600
11963F56271N0973k0785k8679j7963l4837M0671P2042k7333K7579J07885R3807
$$ y = [56130, 37099, 54539, 93680, 93234, 89512, 107516, 126910, 140357, 12952, -3740, 75258, 134479, 61671, -32320, 10065, 52156, 48425, -30894, -88390, -62778, 11431, 41771, 67285, 57046, 88580, 125410, 131770, 124624, 128853, 99226, 112908, 121917, 159758, 156118, 70526, 45451, 46069, 102422, 199974, 209047, 243053, 246471, 214257, 204159, 216869, 279606, 317373, 269144, 242579, 287143, 274557, 212645, 245594, 250296, 227619, 240398, 258937, 313531, 324071, 333930, 306802, 352550, 396507, 437959, 419984, 437970, 434643, 405877, 407958, 408313, 473453, 502417, 471556, 494665, 493615, 484567, 486989, 500625, 533090, 555846, 528318, 559155, 580427, 594671, 656271, 707244, 686459, 657780, 639817, 604980, 645651, 717693, 690360, 717939, 825824, 919631]
11952I19631M9128P5374Q3403M8049K6479J54515R3542Q790K7571J11468J23860
11941A721810J17568J25539J43082J60178J81199K20310K44853K86654L18332
11932C519525L88775M21225N33234N83985P18202R36783J190672J446636J819975
11923A1559012K382343L116627M133382N508281P472617J0230774J3843714J8610278
11915G6857028K3376965K4839099J9143729O909717o959963j8920820k4373776
11908A00871979k2171215j6898249j2161984q748090o437950m848204l631948
11901B5974339k855247k219202j744304j387013j152501r14238p32650p28489
11893A4240695n43366m62485n66597p42522p27157p44024p69828o79630o19258
$$ y = [919631, 968759, 1044133, 1127536, 1175585, 1202064, 1356579, 1450121, 1458911, 1486482, 1597950, 1721810, 1839378, 1964917, 2107999, 2268177, 2449376, 2669686, 2914539, 3201193, 3519525, 3908300, 4329525, 4862759, 5446744, 6164946, 7101729, 8292401, 9739037, 11559012, 13941355, 17057982, 21191364, 26699645, 34172262, 44403036, 58246750, 76857028, 100233993, 125073092, 144216821, 151126538, 144166575, 125245755, 100871979, 78700764, 61802515, 49640531, 40892441, 34454491, 29606287, 25974339, 23119092, 20899890, 19155586, 17768573, 16616072, 15701834, 14969184, 14240695, 13697329, 13234844, 12668247, 11925725, 11198568, 10454544, 9684716, 9005086, 8385828]
11884H385828n85909n88627m71208m31403l89047l72492l49213l00465k79788
11875D617676k64241k82382k33643k14285k39409k30065j47399j96683j69819
11866B639750j07120r9367j51643j25926p5337j20479j05553o5680k5138o3540
11856A699967j03409j71549j07251m9727j5756o0913l8301q6478r0124o4325L501
11845I15635j3162p4142l8268n5614n0889p1844l1195j5880L8016K5894p9523
11834E49028r2207n3385M4718k5238k1547J2037n810o9916k8787M6015K4399k8365
11822C50942m9861l4802K712Q520J5210Q507L6530L1996k1190q227j519k9699
11810C09119K767j6261p9369l0398R919o048k5404j6449Q772M1014N8039J4628
$$ y = [8385828, 7799919, 7211292, 6740084, 6308681, 5919634, 5547142, 5197929, 4897464, 4617676, 4353435, 4071053, 3837410, 3623125, 3383716, 3153651, 3006252, 2809569, 2639750, 2532630, 2433263, 2281620, 2155694, 2080357, 1959878, 1854325, 1788645, 1763507, 1699967, 1596558, 1425009, 1317758, 1268031, 1252275, 1191362, 1153061, 1066583, 976459, 912134, 915635, 902473, 828331, 790063, 734449, 683560, 611716, 580521, 564641, 602657, 628551, 549028, 456821, 403436, 448154, 422916, 401369, 413406, 407596, 337680, 308893, 354908, 379307, 350942, 301081, 266279, 268991, 277511, 292721, 301228, 337758, 369754, 348564, 340337, 338818, 309119, 311886, 295625, 216256, 185858, 195777, 189729, 164325, 147876, 156648, 197662, 255701, 270329]
11798B70329J0673L4101M0872K8630K0590j8508j1477n030j166N3619M3320M4196
11786E10149r519P464j9393k5136k8211p2839m4065n1132j958k238k7761q62M3156
11773B77655j224m0460o1373l2012k3959L6463N008q340o626J0637J6909k6947
11761A45731k1200L9528P2321N65J1628q9370q404O674j567j3690k4914N0141
11749A67443K0469L2918J2549l9978k4061j8616K3588m8793m2587O487q508M7248
11737A28159n1278k7550J4296J8223j695J0209L9719o0712l4238M3460o211Q75
11725G3257M8145n9791m6314R264P854K5151K9410J9333k0719q174J6602M5688
11713A39706J5031j7550j2179J2515J5872j0458j8704r203k0705n7921m8771J8247
$$ y = [270329, 281002, 315103, 355975, 384605, 405195, 386687, 375210, 370180, 369014, 422633, 465953, 510149, 500630, 508094, 488701, 463565, 435354, 362515, 318450, 267318, 265360, 263122, 235361, 234499, 277655, 276431, 235971, 174598, 142586, 118627, 155090, 160098, 151758, 145132, 155769, 172678, 145731, 124531, 164059, 236380, 236945, 248573, 159203, 150799, 157473, 155906, 142216, 117302, 167443, 187912, 220830, 233379, 193401, 169340, 150724, 174312, 125519, 82932, 89419, 80911, 128159, 76881, 49331, 63627, 81850, 80155, 90364, 130083, 69371, 35133, 78593, 72382, 73257, 121402, 61611, 15297, 24561, 32415, 57566, 86976, 106309, 85590, 77416, 94018, 139706, 154737, 137187, 125008, 137523, 153395, 142937, 124233, 115030, 94325, 36404, -12367, 5880]
11701E880K0628j7742J6559L5187O408k5105J0855j1712L8904K1566J0761q6791
11689B5398m5437j9094M0603R791m1309M4l9j8321J8675J7015j6424n2994j8076
11676a00168M1771M4977M4416j948l7925O4910K5390L3417J4793J4121j4946l1335
11664I7473l2101n4622j13792J711N3970o467r018L6174J1491P464L4921M804
11652C2008M2918J4569l5036k115J8263m9588L065k1839n557l0131l5131O1130
11640g444P1096l0600L966m8295p9870J9243O3852J4502j0570l1706K805M4276
11628A1255J7538m1403k2439K3660M8477L3432K5961K902k2899j04884k4563J1310
11616d1653k708n4520k9464M045K6601M6330L0159M7505M0066J7844K1143J8093
$$ y = [5880, 26508, 8766, 25325, 60512, 66920, 41815, 52670, 40958, 79862, 101428, 112189, 25398, -20039, -39133, 1470, 11261, -30048, -30004, -30043, -48364, -29689, -12674, -29098, -82092, -100168, -58397, -13420, 30996, 29048, -8877, 56033, 81423, 114840, 129633, 143754, 128808, 97473, 65372, 10750, -103042, -101331, -47361, -53828, -62846, -26672, -15181, -7717, 27204, 32008, 74926, 89495, 54459, 52344, 70607, 21019, 24084, 2245, -3312, -33443, -68574, -7444, 63652, 33052, 37018, -11277, -91147, -71904, -8052, 6450, -4120, -35826, -33021, 11255, 28793, -12610, -35049, -11389, 37088, 70520, 96481, 99383, 76484, -28400, -52963, -41653, -44361, -98881, -128345, -124300, -97699, -51369, -21210, 26295, 66361, 84205, 105348, 123441]
11604A23441O787m9399m2536l0636J7479J5993k8338j3078k4980K7461J0462J0539
11592B3195L1792K5585j5426l1959n1451l4465M8040l0502L3816J1672O831P681
11580B4809R311R316Q198l1804l7969k0957K4304L649n130L094k5165J9638M7130
11567B8424l922j389n8813p6931k2460O3433K7957j0236P482j2672k4754l8027
11555a21908Q7590M0433j7062k1723J1005m5432M8283L1870Q013n346m3648K8489
11543E64J5470j6630N6043j2829o6840n6177n93K9354l2346M7363P0769L351k0976
11530A6523N2067M978L9946o570o8023k3371j6039k9113j1495J7884L366R192
11518a0655m2460k497n8109j5491O5317O1123n485K4011k9233l5289R248L5072
$$ y = [123441, 130228, 80829, 38293, 7657, 25136, 41129, 12791, -287, -25267, 2194, 12656, 23195, 54987, 80572, 65146, 33187, -18264, -52729, -4689, -35191, -1375, 10297, 17128, 24809, 34120, 43436, 51634, 19830, -18139, -39096, -14792, -11143, -16273, -13179, -38344, -18706, 28424, 24502, 23113, -35700, -112631, -135091, -71658, -43701, -53937, -46455, -59127, -83881, -121908, -34318, 6115, -10947, -32670, -21665, -67097, -18814, 13056, 21069, 15723, -27925, 564, 16034, -596, 55447, 42618, -24222, -80399, -80992, -51638, -83984, -36621, 34148, 37499, 16523, 68590, 73568, 113514, 106944, 38921, 15550, -489, -29602, -41097, -23213, -19847, -10655, -53115, -55612, -113721, -129212, -63895, -2772, -8257, 15754, -13479, -48768, -39520, -4448]
11506d448k801K8112K7527m3830Q916K7982j1432J964m3032k1948m2767k1281
11494i7038N0093L0920Q122k1499j687K4285P9548l6201o0476N599m4021J8103
11482d4252N0949J9419L2208q891j2299J5450j4705l38l2221K0755j809L3379
11470E7645K0190o5489l0518k668M3748r271k1785l8778j1019J7296L0517L3729
11458B3597M083m9936K559L1935L1934J7778k7629j0864N502l047q2691J4875
11446d1904L6715j1552L0479l1074o8030l3272N8740N0394M4896m7604K3730N0391
11434F1909p833n011K3382k0714j3598j8196J0153m8659n105L3796Q510l5753
11422a7119k2849m8327M6413M3866J4362J1940j8931K999q5861p009O6638O8596
$$ y = [-4448, -7249, 20863, 48390, 4560, 13476, 41458, 30026, 31990, -11042, -32990, -75757, -97038, -46945, -16025, -7903, -29402, -31089, -6804, 72744, 36543, -23933, -18334, -62355, -44252, 6697, 26116, 58324, 49433, 37134, 52584, 37879, 37541, 5320, 26075, 24266, 57645, 77835, 12346, -18172, -20840, 22908, 13637, -8148, -46926, -57945, -40649, -10132, 23597, 27680, -22256, -19697, 12238, 44172, 61950, 34321, 23457, 28959, 25912, -56779, -41904, -5189, -16741, 13738, -17336, -85366, -118638, -59898, -9504, 35392, -12212, 11518, 61909, 54076, 49065, 72447, 51733, 38135, 19939, 30092, -18567, -23672, 10124, 18634, -17119, -39968, -88295, -41882, 1984, 16346, 28286, 9355, 12354, -73507, -80516, -13878, 54718]
11410E4718K1081K576q7455p6801j8105O3567J9291O1825J3768l4216O2565K4245
11398A07059l1176p0961l8746M0557Q4941Q577n7227j3840J3694n6661r2869L0603
11386g6049J5081J1633L499J6539m6518k5505R973j6984M8830M1878m5242J1959
11374e0906k5812l2559m928P768Q631k33J2807O2915J5556k9475l1755k0666N4723
11361c3934j1954n8576K2829L3002l991Q5763L1031o3307j0561j951K2976m7942
11349c6615j1260M0780J5670M214n9382j3291m3159K6868J9181Q617J9796n6478
11337h5059j5693N0547L5586L212o389Q714n559L6095K275O785M3121M9190m7777
11324G5048J4004K878o2309o5482N6697L7766p3064J7466K7238l9727L428l6939
$$ y = [54718, 75799, 78375, -9080, -85881, -103986, -40419, -21128, 40697, 54465, 20249, 82814, 107059, 75883, 4922, -33824, 6733, 91674, 100251, 43024, 29184, 42878, -13783, -106652, -76049, -60968, -49335, -45836, -29297, -75815, -101320, -91347, -108331, -59501, -17623, -62865, -50906, -76718, -109277, -114205, -106437, -97806, -98039, -85232, -22317, -6761, -36236, -67991, -88657, -33934, -45888, -104464, -81635, -48633, -52624, 33139, 64170, 863, -9698, -11649, 11327, -36615, -47875, -7095, 8575, 12789, -46593, -59884, -103043, -76175, -56994, -48377, -28581, -85059, -100752, -50205, -14619, -11407, -17796, -9082, -14641, 21454, 23729, 30514, 73635, 122825, 75048, 89052, 91930, 29621, -35861, 20836, 58602, -14462, 3004, 30242, -9485, -6057, -42996]
11312d2996m5380o245j8368j3489J5298J3301K5972O7058N5523j9187j0267l951
11300A7269m4068Q268m260m6245M696k9386K2305L8957J5429K4187k8332j2802
11288c3982J5095J8395K1634m3546k4702R444K3250K0903Q091l0846o455J4561
11276h158k8255M171J358n5527j9422R792j3876j265K7349N6773j6723Q04M7951
11263D972O327j9834j1637l7562k3871O9828O1524K563j0152n9581Q2912n292
11251F0197J2681m1631j0615N9046L6983q7585j1547K772J0829l934k8479l7460
11239c8743r001J2146l058r982O853o163R407O3344M414l9368N5112L5037M468
11226H4466k1201j0479K8081j5269o2559k9363k0327j4969P7116N46N744J5803
$$ y = [-42996, -88376, -94621, -112989, -126478, -111180, -97879, -71907, -4849, 50674, 31487, 21220, 17269, -26799, -18531, -22791, -69036, -64340, -93726, -71421, -32464, -17035, 7152, -21180, -33982, -18887, -492, 21142, -22404, -47106, -37662, -14412, 6491, 14582, -16264, -22719, -8158, -36413, -32242, -30884, -86411, -105833, -96041, -109917, -111182, -83833, -27060, -43783, -42979, 4972, 11299, -8535, -20172, -57734, -81605, -11777, 49747, 52310, 42158, -17423, 65489, 60197, 72878, 31247, 20632, 79678, 116661, 29076, 17529, 20301, 31130, 27196, -1283, -38743, -47744, -35598, -38656, -48638, -41785, -47948, -38541, 24803, 29217, -10151, 44961, 79998, 84466, 63265, 52786, 80867, 65598, 3039, -26324, -46651, -61620, 15496, 16042, 21786, 37589]
11214C7589K8149r203k0690l4265K3414Q028j04636n824j0395o299K2417R298
11202f2417l6135L6157J57J1563R657p681L6674L0678L1281p767J3383m2404p005
11189F141k7390M4727N1496M874q0116k0154P989N876j6881K0659j2248k2526
11177c7553J7919M4333m4587N616M4714j2736n2270k3181J0338N9466k6371n9060
11165g3372L782K0666n7271L9703O6547P0774M4559k3235m5356q7760L0735l949
11153a4177l3190L4628L1212k7700K8995L5085n297m3850m9212M0417L9900J7685
11141E4496K009N0715K8345m7875j2909j3907j258j264L1996Q204j4359q3004
11129A189n7383J2659K6690K4255l740j0371l3112m0704J5371P9957K7236k7223
$$ y = [37589, 65738, 56535, 35845, 1580, 24994, 33022, -71614, -77438, -87833, -94132, -71715, -62417, -98552, -62395, -62238, -50675, -41018, -48699, -12025, 18653, 49934, 42167, 55550, 13146, 6141, -21249, 23478, 74974, 79848, -268, -20422, -12433, -6557, -23438, -2779, -15027, -37553, -19634, 24699, -19888, -14272, 30442, 17706, -34564, -57745, -47407, 12059, -14312, -73372, -69590, -48924, -106195, -66492, 55, 70829, 115388, 92153, 46797, -40963, -10228, -14177, -47367, -12739, 18473, -9227, 19768, 54853, 49556, 5706, -43506, -3089, 36811, 54496, 56505, 107220, 135565, 87690, 74781, 60874, 59616, 58352, 90348, 98552, 84193, 1189, -56194, -43535, -16845, 7410, 3670, -6701, -39813, -80517, -65146, 14811, 42047, 14824]
11117A4824j1590j4144m6660o719L5908k5470m4533k303R6068Q9769L6607o29
11105A21128n6112n3049k4948N4258L4743j8641n7308n2081J4054K9603k0958
11094b9311l6175K9845J1351k0037l0780K4426M6972L0636L1051n800k4584m6509
11082a8915l1423q355M0217K8105M2187M7622k898l3417o8003j6398J2779K3848
11070A5349K2291p15J775k0302j2942P379L3713m5533n1747J9544k9479L7911
11058b2756L5774k7015n6047J7357N0587J6087j6943L066K0612n491l8025J4708
11046h086J4076M8631Q3231M8537n7020j099m9367j4025j4463J5700Q1906P4066
11034B22087L6686N3738J071j08523n2999J5955k9719M7000K6209L8819K393J06009
$$ y = [14824, 3234, -10910, -57570, -64289, -28381, -53851, -98384, -100687, -4619, 85150, 121757, 121128, 65016, 11967, -12981, 41277, 76020, 57379, 71, -52010, -37956, -8353, -29311, -65486, -35641, -24290, -44327, -75107, -50681, -3709, 26927, 57978, 52178, 27594, -18915, -50338, -58693, -18476, 9629, 51816, 99438, 96540, 63123, -4880, -21278, -8499, 15349, 37640, 36925, 38700, 18398, 5456, 12835, 46548, 1015, -50732, -31188, -60667, -22756, 13018, -13997, -70044, -52687, -2100, 13987, -2956, 110, 20722, 15231, -22794, -8086, 5990, 54621, 137852, 186389, 129369, 128270, 78903, 64878, 50415, 66115, 148021, 222087, 258773, 312511, 313582, 205059, 152060, 168015, 138296, 185296, 211505, 250324, 252717, 358726]
11022C58726P6386p0968j9540Q650o693j27161o2229l7050p476P7582J05453M3763
11010C39443m5563k0582L6541K4725p2317j8669p5020q1889l2976J2456N1181
10999A17330M9863O299p823M8009p301n4907k9766K0025r1701m9522J4581J6950
10987C2037M3155K6273k1859m5193n4037J6621O9659J3555n4593L9253j0722o3117
10975h968l8821k9634k183J43K6213O4418J3409l2998J2349l2777l8013K9339
10963c7523J2335o401j0999M7569r370K1298L4645R324n3095j3088L797l9225
10951d0733r058l0300M990L2982r91J9222J5468k4397j3512J8504p692L0120k7271
10938c2668j32966M1542R9318Q2576J8696K8841k5929K8770q382m908K6515j8084
$$ y = [358726, 435112, 364144, 344604, 353254, 346561, 219400, 157171, 120121, 112645, 190227, 295680, 339443, 293880, 273298, 309839, 334564, 262247, 243578, 168558, 86669, 53693, 66149, 117330, 167193, 173492, 165669, 213678, 206377, 151470, 121704, 141729, 50028, 506, 15087, 32037, 75192, 101465, 79606, 34413, -19624, -3003, 66656, 80211, 25618, 64871, 54149, -8968, -47789, -77423, -79606, -79463, -53250, 11168, 24577, -8421, 3928, -28849, -66862, -37523, -25188, -31589, -42588, 4981, -4389, 16909, 51554, 60878, 7783, -5305, -1508, -40733, -49791, -80091, -75101, -42119, -43110, -23888, -8420, -32817, -46329, -27825, -35517, -5397, -32668, -165634, -124092, -24774, 57802, 76498, 105339, 79410, 108180, 99798, 94890, 121405, 103321]
10926A03321o4509p6807j6909L0499M7139R566k3889j8759k823J4602K9794q725
10914B2500o1952o3764n1M2960K2573J9948J1873J0958N44O186k8107l938k6024
10901d6294L3645r505K4941j2499p8824K078M1751R1244J1961k2572K3055k6152
10889C2829q347j4644j4069j125J548J2857L8046k8177J3128K1344o9274R086
10877f798L6063j654K2257Q118j2380m8559J3246J4774P175l772N689N351J7522
10864E7032N431M5156n3875l7903K8193O909r08n9171j2965J6801N226k7635j3870
10851d1579L749M1042q719k075K1597N2773M5123j973M3452K6189n0663l3958
10839I4958k762j2512j5215k6897m2921l485J6212L8089k2138N8665K0787o9086
$$ y = [103321, 38812, -37995, -54904, -24405, 22734, 32300, 8411, -10348, -13171, 1431, 31225, 22500, -39452, -103216, -103267, -60307, -37734, -17786, -5913, 5045, 5589, 11775, -16332, -20270, -46294, -12649, -22154, 2787, -9712, -88536, -86458, -44707, 46537, 58498, 35926, 58981, 32829, 24482, 9838, -4231, -5356, -3808, 9049, 47095, 18918, 32046, 53390, -15884, -6798, 29265, 27611, 49868, 57986, 45606, -2953, 10293, 25067, 32242, 28470, 34159, 39510, 57032, 62463, 107619, 53744, 15841, 44034, 50943, 50035, -9136, -22101, -5300, -74, -27709, -41579, -37830, 3212, -5507, -7582, 14015, 66788, 111911, 109938, 153390, 179579, 128916, 94958, 92196, 79684, 64469, 37572, -5349, -8834, 7378, 45467, 23329, 81994, 102781, 33695]
10827C3695k0145K5047Q9000K4717q3494k42k8281k151J3753j9425N8396O3944
10815A54814q5749o8010m4690K3572L9981M4202m096k4146l611K7275k0099J0120
10803D9563L3756k3275l1710p7112r787N5672P390m861m6316k7153J9494K8628
10791b5711J9184O918L1625M8822o889N0002j8924l7954P0853N0171n1065m220
10779A32812l9826J9206j813k0547j09504q6322q691N7724P0356m9965K9052L3123
10767B5605k1735J6940k0714l7883R352j4977M0881R302n6946J415K296J0658
10755c5806R4291k190l2558L5380L8663j9843m1509o0717p458J3435P116k0169
10743c1365Q4618O5535m9716k6758K808L0520J8494j0787L3815o7028l0171N952
$$ y = [33695, 13550, 38597, 127597, 152314, 68820, 68578, 40297, 38146, 51899, 32474, 90870, 154814, 69065, 1055, -43635, -20063, 19918, 64120, 60024, 35878, 32267, 59542, 39443, 49563, 83319, 60044, 28334, -48778, -58565, -2893, 4497, -364, -46680, -73833, -54339, -25711, -6527, 391, 32016, 80838, 73949, 123951, 105027, 67073, 137926, 188097, 137032, 132812, 92986, 112192, 110379, 89832, -19672, -105994, -114685, -56961, 13395, -36570, -7518, 25605, 3870, 20810, 96, -37787, -28435, -43412, -2531, 6771, -50175, -48760, -46464, -35806, 58485, 56295, 23737, 59117, 97780, 77937, 36428, -24289, -31747, -18312, -11196, -31365, 53253, 118788, 69072, 42314, 45122, 75642, 94136, 83349, 117164, 50136, 19965, 25917]
10731B5917J3992k251k8329m9940L9158J1326l5513L3315J5886m268k7623K986
10719e344j2752m146K8872N7952n4729n8265j108m2506j7542L0455L1575L9356
10707h182O0147M6883k4269m2797J6055K395Q9526R6918p0779n6650K8389p574
10695A30062J9930L3859p505k3866J8605J9629L8650p821m8024k5213J4904k3227
10683A39983m467P182N3121O106q23o657p1439J1772J4555M706N4125K3201j2210
10670B19155j9486j7425N8307N5274L4652n265j201j0278r692m7337l6094L643
10658B24253M8663L7985K020j2043M8695J4320J5783R34j5570J1413N7109q23
10646D32739m0797l5437l088J9239Q0707K8043Q744O8413J11273P4911M39J7641
$$ y = [25917, 39909, 37658, 9329, -40611, -1453, 9873, -25640, 7675, 23561, 19293, -8330, -5344, -18096, -22242, 6630, 64582, 9853, -48412, -49520, -92026, -109568, -79113, -47538, -8182, 51965, 98848, 74579, 31782, 47837, 50232, 139758, 236676, 165897, 109247, 137636, 130062, 149992, 183851, 176346, 152480, 171085, 190714, 229364, 221543, 173519, 148306, 163210, 139983, 135516, 142698, 195819, 201925, 201102, 194445, 123006, 134778, 149333, 154039, 208164, 231365, 219155, 199669, 182244, 240551, 295825, 330477, 325212, 324011, 313733, 304041, 256704, 220610, 224253, 272916, 310901, 312921, 300878, 349573, 363893, 379676, 380610, 365040, 376453, 433562, 432739, 391942, 356505, 353417, 372656, 453363, 481406, 490150, 558563, 669836, 744747, 745186, 762827]
10634G62827J07503J29474R8694R9692R5511J36580J36313K18727K67177L49465
10624B401963M97521O76670R39387J232821J547553K000895K565516K968971K861569
10615A7692866K269906J367628L05965m56355n06561M5069R11555K086166L433799
10606B7150038M735118N654194N434038L713827J176731j306941k964883k973975
10598D0618147j685538J28818K121556M226870O084390P064659O259351L296154
10590F8114407n59413m248192o528913o467021m783573k634422n60311J326468
10582D3659030K849484L348212K640669N89493k084114m469783n643847n313778
10574C5575366l961252k459518j287119k88697L49790N59293J39560q08075j789169
$$ y = [762827, 870330, 999804, 1098498, 1198190, 1293701, 1430281, 1566594, 1785321, 2052498, 2401963, 2899484, 3576154, 4515541, 5748362, 7295915, 9296810, 11862326, 14831297, 17692866, 19962772, 21330400, 21636365, 21180010, 20673449, 20718518, 21630073, 23716239, 27150038, 31885156, 37539350, 42973388, 46687215, 47863946, 46557005, 43592122, 40618147, 38932609, 39061427, 41182983, 45409853, 51494243, 58558902, 64818253, 68114407, 67554994, 63306802, 56777889, 50310868, 45527295, 42892873, 42332562, 43659030, 46508514, 49856726, 52497395, 53086888, 51002774, 46532991, 40889144, 35575366, 31614114, 29154596, 27867477, 27578780, 27928570, 28487863, 28627423, 27819348, 26030179]
10565B6030179k728831l126938k967202k474129j853170j464632j201295r63976
10557I250006p92292o43670n87989n58123n04152m21371l43736l36253l37795
10548D724625k67542k04829k62033k60430k68827j92518j78402j98837k25714
10539B665493j55024j37234j24342j22086j59440o2096q5491j02832r5486j23704
10529A497758r2628k0244K3983j0401m2020m2598M473L0578L7215K4463J09l7848
10517A372840n01P646o1344n1638p0299j01918j09077j23131q7608p5288p4976
10506F24706l8030l6964j0482K1691k0677Q649m7484l5363J5682l877L0903L830
10494E12584j0907p2430r3141l1237L365m6849L5610L0479L674n066j1950Q239
$$ y = [26030179, 23301348, 20174410, 17207208, 14733079, 12879909, 11415277, 10213982, 9250006, 8457714, 7814044, 7226055, 6667932, 6163780, 5742409, 5398673, 5062420, 4724625, 4457083, 4252254, 3990221, 3729791, 3460964, 3268446, 3090044, 2891207, 2665493, 2510469, 2373235, 2248893, 2126807, 1967367, 1905271, 1819780, 1716948, 1621462, 1497758, 1405130, 1384886, 1408869, 1398468, 1356448, 1313850, 1318323, 1348901, 1386116, 1410579, 1410688, 1372840, 1372339, 1379985, 1318641, 1267003, 1196704, 1094786, 985709, 862578, 774970, 699682, 624706, 586676, 549712, 539230, 560921, 540244, 548893, 501409, 466046, 481728, 477851, 508754, 512584, 501677, 429247, 336106, 304869, 308234, 261385, 296995, 327474, 331148, 326082, 314132, 322371]
10482C22371R503M0063J2044k2799r287K1284j0782L0030n6728k120N8108J5789
10470D07476M0964M3095j7477m2606m0004j5931J1229O2869P628Q271M5415L0299
10458E41228k899K6691M811o7025J531J11071P1218J30658K18983K16828J69876
10447A422971J62252J73170J29799J48174J12576M0286n4032j09339j80018k53404
10437A592435j86637j81023j94169j20027j08697r2773n5416r6735M68j0237l0511
10426E16678O4791K3712j2936o4707m6921K8693j5474k2867L5189N444j6600q2150
10414D12852q6796m4840O774Q233K8283M1683p2536n2907L8167K4554N720m4655
10402B64532N659j946j9166o1096K0335k9962J0821j0619J5196r444K586n84N85
$$ y = [322371, 331874, 371937, 383981, 361182, 351895, 373179, 362397, 392427, 335699, 333579, 391687, 407476, 448440, 491535, 474058, 431452, 391448, 375517, 386746, 449615, 457243, 465514, 510929, 541228, 538329, 565020, 569831, 502806, 504337, 615408, 686626, 817284, 1036267, 1253095, 1422971, 1585223, 1758393, 1888192, 2036366, 2148942, 2189228, 2135196, 2025857, 1845839, 1592435, 1405798, 1224775, 1030606, 910579, 801882, 709109, 653693, 556958, 557426, 547189, 516678, 581469, 605181, 592245, 527538, 480617, 509310, 493836, 470969, 506158, 511602, 495002, 412852, 326056, 281216, 287990, 296223, 324506, 366189, 293653, 240746, 278913, 303467, 309187, 264532, 270191, 268245, 249079, 187983, 208318, 178356, 189177, 178558, 193754, 184310, 186896, 186312, 186897]
10389A86897L8981j8436J6543k1751O371L586l9849l2074J9446j1703n0198K3872
10377A21685K3036l5846j0911L1055k1402j027j0581m1344K8581M4319M4860j840
10365A70585r3830k4042J34K8783M4213O3706K7443m5814l5708M8843R80O2724
10353B48017j8950q0388J9726R561L2221J9415K3880L5573q141o3225J7059M3063
10341B77811j6724l1933P521K9858l2061j4615k430k7322k9992k672O3235L9602
10329B60278N151j5563l2843J3966l8595n4773l905L5333N6324j9021m21M7397
10317B53328O6686k175j507m2613l8567p033o278M8886o771q856J6001p6470K6837
10304B21468R2014M7561L6957K7649L8200k2184J7600N8510N6553J51954Q3554
$$ y = [186897, 225878, 207442, 223985, 202234, 208605, 212191, 172342, 140268, 159714, 148011, 97813, 121685, 144721, 108875, 97964, 129019, 107617, 106590, 96009, 54665, 83246, 127565, 172425, 170585, 76755, 52713, 52847, 81630, 125843, 189549, 216992, 171178, 135470, 184313, 185293, 248017, 229067, 148679, 168405, 177966, 210187, 229602, 253482, 289055, 280914, 217689, 234748, 277811, 261087, 229154, 236675, 266533, 234472, 219857, 217427, 190105, 160113, 157441, 220676, 260278, 265429, 249866, 217023, 230989, 192394, 137621, 133716, 169049, 225373, 206352, 205931, 253328, 320014, 317839, 316332, 273719, 235152, 228119, 221841, 270727, 263956, 255100, 271101, 194631, 221468, 313482, 361043, 398000, 425649, 463849, 441665, 459265, 517775, 574328, 726282, 809836]
10293H09836l2937k6791L7662O7221j8826p872l4174l6157k8808m4693o1167o8491
10281E54803m6563l5314o7708p9384J1309Q68l1671j9521L1358J7983r786j5440
10269C10934K4178m4598n2490J5662M4974N6311p5209r6330l0899M658j6630r583
10257A30978p706j1293N9509k8029p0974p87K1132O100O8067K6833R1472L0759
10245C16061m6246j9511p5192m0035M0905P0689O5946j7973l2230J8329q131o1404
10233B11208N909P1225O5140l7473o4938q250j8845l5909K1005K3421k5171J7279
10221B24601j2402j8563L3940O0857o4933m2907K2535J0776J5737K4987L6553
10210B91181m1704l4830n5864j6295k6362N6104L9111K132K469m7940R832M8446
$$ y = [809836, 776899, 750108, 787770, 854991, 836165, 828293, 794119, 757962, 729154, 684461, 623294, 554803, 508240, 472926, 405218, 325834, 337143, 338011, 306340, 286819, 318177, 336160, 326374, 310934, 335112, 290514, 238024, 253686, 298660, 354971, 279762, 183432, 152533, 157191, 140561, 130978, 123272, 111979, 171488, 143459, 72485, 71698, 92830, 98930, 166997, 193830, 285302, 316061, 269815, 250304, 175112, 135077, 175982, 246671, 312617, 294644, 262414, 280743, 272612, 211208, 217117, 288342, 353482, 316009, 251071, 242821, 223976, 188067, 209072, 232493, 207322, 224601, 212199, 193636, 227576, 288433, 223500, 180593, 203128, 213904, 229641, 254628, 291181, 249477, 214647, 158783, 142488, 116126, 172230, 211341, 213473, 215942, 168002, 177834, 226280]
10198B26280N3562M2234L2019o1282k9007L9176M8208k3766m7379M2208N4511
10187C76764L1778M4069P904N5730O3636j4124p3020N3301J2311l769l1041J8692
10175E42231K8354o2610l4570J2109J4573L3684J880l7568O0524M9471j335o173
10163F00570J0186K8200J5807K9519K5534o9075J1501O7465O3420Q1629K7214
10152H91970q7851m4622J263M2310j277J6589K9194J4261P2062N0819K8668J17064
10140A130450j5836o9642j7565M3879L7135j269P4053P7368J12817N2777J6484
10129A440651O5906N7764P6696J34161P2986L0181P4258O2159Q1227L9407O9605
10118B205001J34885J52144J93627J88948J28607J37362J28262M9309M4704P1554
$$ y = [226280, 279842, 322076, 354095, 292813, 263806, 302982, 351190, 327424, 280045, 322253, 376764, 408542, 452611, 460515, 516245, 579881, 565757, 492737, 546038, 558349, 554580, 523539, 542231, 570585, 507975, 473405, 485514, 500087, 533771, 535651, 498083, 558607, 608078, 606743, 600570, 610756, 638956, 654763, 684282, 709816, 640741, 652242, 719707, 783127, 864756, 891970, 804119, 759497, 760760, 803070, 801793, 818382, 847576, 861837, 933899, 984718, 1013386, 1130450, 1114614, 1044972, 1027407, 1071286, 1108421, 1107152, 1181205, 1258573, 1371390, 1424167, 1440651, 1506557, 1564321, 1641017, 1775178, 1848164, 1878345, 1952603, 2014762, 2095989, 2135396, 2205001, 2339886, 2492030, 2685657, 2874605, 3003212, 3140574, 3268836, 3318145, 3362849, 3434403]
10108C434403n3765r7991j21274j23258j01852j02141q7232p1493n9620p9633
10098B536144J3896N6668M4506J0534L2025Q7933P9473Q8085M5919N2307J03294
10087C150784J73108J65856J16959J63566J99432J70776K45751K85741L22540
10078D994513L41752M12573M05603M82182N97804P57580Q52038J003826J190397
10069A1038268J401260J518828J750022J961610K182927K393371K633966L039541
10061B7919793L745489M806713O275609Q356009J1369262J5502872K0999207K7910495
10053A26885449L5351565M0889994M3115059M1925452L7378637K9952188J9330019
10046C74828363O356326o902423j9404402k9346881l5716981l9091538l9498645
$$ y = [3434403, 3380638, 3282647, 3161373, 3038115, 2936263, 2834122, 2746890, 2675397, 2615777, 2536144, 2550040, 2606708, 2651214, 2661748, 2693773, 2781706, 2861179, 2949264, 2995183, 3047490, 3150784, 3323892, 3489748, 3606707, 3770273, 3969705, 4140481, 4386232, 4671973, 4994513, 5336265, 5748838, 6154441, 6636623, 7234427, 7992007, 8844045, 9847871, 11038268, 12439528, 13958356, 15708378, 17669988, 19852915, 22246286, 24880252, 27919793, 31665282, 36471995, 42747604, 51103613, 62472875, 77975747, 98974954, 126885449, 162237014, 203127008, 246242067, 288167519, 325546156, 355498344, 374828363, 381184689, 374282266, 354877864, 325530983, 289814002, 250722464, 211223819]
10039B11223819l6671638l1067130k4013193j7638365j2836401r482704p111374
10032G2403014n448238m287240l541592l114381k779610k662316k636734k714967
10024D5217936k705101k719271k660495k579829k442552k355653k241467k070374
10016B5443194j820920j575155j506240j402768j292858j199678j039058r16732
10008A4689785q78481p96550o93530p14406p09214o17458n26899m99876n07648
9999H745723m23281m11512l96948m00041m18492k81428k61897k12777l04658k64517
9989E370172k85660l18327l46000j91029j86683k03919j73818j38306j09953j33035
9979C283442j80096j59635j28122j89785j48367q3205j12797l8596o8999p8725
$$ y = [211223819, 174552181, 143485051, 119471858, 101833493, 88997092, 79514388, 72403014, 66954776, 62667536, 59125944, 56011563, 53231953, 50569637, 47932903, 45217936, 42512835, 39793564, 37133069, 34553240, 32110688, 29755035, 27513568, 25443194, 23622274, 22047119, 20540879, 19138111, 17845253, 16645575, 15606517, 14689785, 13811304, 13014754, 12321224, 11606818, 10897604, 10280146, 9753247, 9253371, 8745723, 8322442, 7910930, 7513982, 7113941, 6695449, 6414021, 6152124, 5939347, 5634689, 5370172, 5084512, 4766185, 4420185, 4229156, 4042473, 3838554, 3664736, 3526430, 3416477, 3283442, 3103346, 2943711, 2815589, 2625804, 2477437, 2394232, 2281435, 2242839, 2173840, 2095115]
9969B095115j00963j25723l9431l2401q7727j07324p0830r7642o9780l6419l0975
9958A295900m1893q326m2700l7425n7101k7790J3925m3925k3409l527m216m0461
9946I79052k6995j0515k2347o0352m2007o0479j180j8726k9923L9853K5943Q377
9934G80701O7696R4905O8330N5441O4951L0414K3850O8058P4302Q7459J06784
9923A522891L2341n254J1275Q1762J04303M2550P9075J19033J17371n2563j53255
9912A899529k34047k45501j80478j14720j29699r8822m5677n9992j15278j6452
9902F58863N2384O7685K9734k0379k9819n0943k4546k0023R780N7396N0259k264
9890G78127k1574j1428L8385k3391q4818L317k291k3154k3154n6143J3402L5109
$$ y = [2095115, 1994152, 1868429, 1828998, 1796597, 1708870, 1601546, 1530716, 1433074, 1363294, 1326875, 1295900, 1254007, 1245681, 1202981, 1165556, 1108455, 1080665, 1094590, 1050665, 1027256, 1023729, 1019513, 979052, 952057, 941542, 919195, 858843, 816836, 756357, 755177, 736451, 706528, 746381, 772324, 780701, 848397, 943302, 1011632, 1067073, 1132024, 1162438, 1186288, 1254346, 1328648, 1416107, 1522891, 1555232, 1549978, 1561253, 1643015, 1747318, 1789868, 1868943, 1987976, 2105347, 2052784, 1899529, 1665482, 1419981, 1239503, 1124783, 995084, 896262, 850585, 790593, 675315, 658863, 711247, 778932, 808666, 788287, 758468, 707525, 682979, 662956, 672736, 730132, 780391, 778127, 756553, 745125, 783510, 760119, 675301, 678618, 676327, 653173, 630019, 573876, 587278, 622387]
9878F22387n8743J5740L478j4210m4965k7275K0800J9021j5427k7994J7303J2562
9866E22677k1902N474k6896n0507l460N5881j3q7235m3413l035l7102L150J2062
9853C25681M7479Q7897K5623l3101l2697o7233L194K8145l9291L796j9719j08154
9841B21620k7128M4854L0437O1825L4359j2485n0981n0536J3480L1442J4587l4413
9829B77061m0534m6913p1421p1565r940N1395n3187R3739N4961j980J6843k397
9817A96062m9322m5429j5822L2242K9593N9705J0501O020N966P2764Q9058O436
9805C97774l1996P407l5790j05136k7658P962k1092L1867L6081k6528l0344k8427
9793A74120j8267n3211P92N4164K4161N8921O7981P7536Q7985J63130K05328K81584
$$ y = [622387, 563644, 579384, 582862, 568652, 523687, 496412, 517212, 536233, 520806, 492812, 510115, 522677, 500775, 506249, 479353, 428846, 425386, 481267, 481254, 394019, 350606, 347571, 310469, 313619, 325681, 373160, 461057, 486680, 453579, 420882, 353649, 356843, 384988, 345697, 349493, 329774, 221620, 194492, 239346, 269783, 331608, 365967, 353482, 302501, 251965, 265445, 296887, 311474, 277061, 236527, 189614, 118193, 46628, 36688, 88083, 34896, 128635, 183596, 181616, 198459, 196062, 146740, 101311, 85489, 117731, 147324, 207029, 217530, 223550, 229516, 302280, 391338, 397774, 365778, 373185, 337395, 232259, 204601, 212563, 191471, 223338, 259419, 232891, 202547, 174120, 155853, 102642, 103434, 157598, 181759, 240680, 308661, 386197, 474182, 637312, 842640, 1124224]
9781A124224M71371L87157K08663q3652k82468m47048m05643k36170j56418o8656
9771E11360j08724q1643k6750n9246l9012m135l6714j1348L3934L6238n362n5972
9759A52626j6840M671j2998Q785M4807L7716j9775J2705M0957m8920m3285J1834
9747A72283J2248k0676m7848L2806j3905r538P067r19K1745K8032m1395m9678
9735I0222m80l59M7347K4073K4567J6053Q629K5065O333o2773K617m93l3316k3460
9721A24025o1621N7360J4209p3668N805N5827P7044K465n034n7225o2727J141
9709G7601K0827k7867k3496P3214N7947k2370k5031j4464j1347p8558m1261Q0332
9697F5527o166j3868L1022L7507L0343P0696K1125m1345J0312l8339o0584j5396
$$ y = [1124224, 1595595, 1982752, 2191415, 2107763, 1825295, 1378247, 972604, 736434, 580016, 511360, 402636, 320993, 294243, 234997, 195985, 191850, 155136, 143788, 177722, 213960, 208598, 152626, 135786, 140457, 127459, 136244, 181051, 218767, 198992, 211697, 252654, 203734, 160449, 172283, 184531, 163855, 116007, 148813, 134908, 125370, 132437, 131518, 153263, 181295, 139900, 90222, 89742, 89383, 136730, 160803, 185370, 201423, 210052, 235117, 241450, 178677, 181294, 180801, 147485, 124025, 62404, 119764, 133973, 60305, 66110, 121937, 198981, 201446, 196412, 139187, 76460, 77601, 98428, 70561, 47065, 120279, 178226, 155856, 130825, 116361, 105014, 26456, -14805, 65527, 59361, 45493, 76515, 114022, 144365, 215061, 236186, 194841, 205153, 166814, 106230, 90834]
9685I0834M9763J8019R619m3870M392n4005K0705M3058m11k7428l6709k013L0830
9672A02784N3342j1365k390m158p200O1221L0288J5992L0225N637k1187p47M4975
9659B97417P298M4789M4491K9795J6734R3215J15215J30205J95762J96892J90555
9648A362368J68837J86110J74250J60074R8635j7328j13011k35318k31489j13054
9638A440074j45706k25369j64192j57888j56842o3273j6752m4812j8363M2225
9628D89102J6159k413o5695k5385K5948Q636j5655l8532o9270q100l1357n2895
9616B30543k6959l5891L0500N877j8955J2702k3508r95k3970o046J0475J0400
9604A64173m0428M731J2296m5740k7700J5391M6878L8362j0172j7755j3804N376
$$ y = [90834, 140597, 158616, 168235, 124365, 128757, 74752, 95457, 138515, 138104, 110676, 73967, 71954, 102784, 156126, 144761, 142371, 138213, 131013, 192234, 222522, 238514, 268739, 274376, 253189, 252442, 297417, 304715, 349504, 393995, 423790, 440524, 533739, 648954, 779159, 974921, 1171813, 1362368, 1531205, 1717315, 1891565, 2051639, 2150274, 2132946, 2019935, 1784617, 1553128, 1440074, 1294368, 1068999, 904807, 746919, 590077, 526804, 510052, 465240, 446877, 489102, 505261, 502848, 437153, 411768, 437716, 446352, 430697, 392165, 322895, 314795, 283438, 230543, 203584, 167693, 198193, 204070, 185115, 197817, 174309, 173314, 149344, 143298, 153773, 164173, 123745, 128476, 140772, 95032, 67332, 82723, 129601, 167963, 157791, 140036, 126232, 131608]
9592A31608l3699j0248J4283L2558p807J750j2930J0780Q790J0821k3020j6658
9580A06228l0556K4848Q830J5724P0827k6778n0785k4829M118j218k9266K1267
9568H8410K8009L1679M017L9811k6220k4091m152n7581l326j7239K1512K000r1445
9555h616j33178P971R2309N9685J7546j813j0080K2480K3421k5022k5168N0438
9543F9973N5428m5180m7716L0656J7207m843L9154k5990l7044J9277O1798K3763
9531A56483j1383j23866m8791M0425P7835Q462N3170k5960j288p320l3550P296
9519I1513m6526L6287O991o0701j4524K2375j9814k1248L1661M4688o57k2606
9507D7439N016P6882J6215k1961L8617J5041m9847m2097k2065l4328j7196q020
$$ y = [131608, 97909, 87661, 101944, 134502, 126695, 128445, 115515, 126295, 135085, 145906, 122886, 106228, 75672, 100520, 109350, 125074, 195901, 169123, 118338, 93509, 97627, 96409, 67143, 88410, 116419, 148098, 152115, 191926, 165706, 141615, 137463, 79882, 76556, 59317, 80829, 82829, -8616, -141794, -133823, -41514, 18171, 35717, 33904, 23824, 46304, 69725, 44703, 19535, 69973, 125401, 80221, 32505, 63161, 80368, 75525, 114679, 88689, 51645, 70922, 132720, 156483, 145100, 21234, -27557, 12868, 90703, 99165, 152335, 126375, 125087, 117767, 84217, 91513, 44987, 81274, 88265, 27564, 13040, 35415, 15601, -5647, 26014, 70702, 70045, 47439, 52455, 129337, 145552, 123591, 162208, 177249, 127402, 85305, 63240, 28912, 11716, 3696]
9495C696J4063M7396M0554K1109L1390l6037L339j8848m2837m2996j8092K6014
9483B8751k6548l4807P81N0770P7327k398m0327l2810p3004j8808j7281J1726
9471g6628O8682K9186L1626O749j9825m7412m1789N3645k1741K7062p734j3189
9459a1368K6003n5514q462K5507M1804P677q336J4753j1947k7070L3934Q4978
9447A11959k5776m4982l2229L823L5493k206Q266K8702J1630J0251j2204p265
9435H5462N248j1227k6980n7176m930N9511J4279k9667k5447j5404K25N1794K4415
9422G0103J5907J2849n8319J5506L2237j6274k7482K530J1222J3651L661K7357
9410A02948o563m1581r51m6701N2095n225k7885M629P735j2255K2982j5213J8534
$$ y = [3696, 17759, 65155, 105709, 126818, 158208, 122171, 125510, 106662, 63825, 20829, 2737, 28751, 2203, -32604, -31823, 18947, 96274, 93876, 53549, 20739, -52265, -71073, -88354, -76628, -7946, 21240, 52866, 59615, 39790, -7622, -49411, 4234, -17507, 9555, 1821, -11368, 14635, -40879, -49341, -23834, 17970, 25647, 17311, 32064, 20117, -6953, 26981, 111959, 86183, 41201, 8972, 12795, 48288, 46082, 54348, 83050, 94680, 104931, 92727, 85462, 90710, 79483, 52503, -4673, -9603, 49908, 64187, 34520, 9073, -6331, -6106, 45688, 70103, 86010, 98859, 40540, 56046, 88283, 72009, 44527, 47057, 58279, 71930, 75591, 102948, 96385, 54804, 53853, 7152, 59247, 54022, 26137, 30766, 38501, 26246, 49228, 34015, 52549]
9397E2549L7536k8504n2684k7511j3597J2339L0037L1011m1579l0798K9540N7086
9385E5425L1688q0292l8286K2360K9143m362N8873j8949q2408L524O806K172L3107
9372A8801O7554J0012N609j3895j7545o0152K1857J2788l0866M935k6380Q737
9360A455J301M4636L4799k3706l8464L648L7606j5015p843Q778L9902o5928n5305
9347c4136J9664J00588O690k2008n0228j9861k4899o3191J3803P6451l7220n6558
9335i0905K00L2382l0655k7883Q1918P1253L1651m780l517k4273K740Q156k6650
9322A9637k3228P4336m6658m8941k2627O6022q613K3713K2238n4787m28j3512
9310a2848J9191J00535J9862j4172o924k7851p3868r1399L337P7737j6191K7227
$$ y = [52549, 90085, 61581, 8897, -18614, -32211, -19872, 10165, 41176, -403, -31201, -1661, 55425, 87113, 6821, -31465, -9105, 20038, 15676, 74549, 55600, -26808, -23284, -16478, -14306, 18801, 86355, 96367, 101976, 88081, 70536, 10384, 32241, 45029, 14163, 19098, -7282, 1455, 2756, 47392, 82191, 58485, 20021, 23669, 61275, 46260, 38417, 47195, 87097, 21169, -34136, -14472, 86116, 92806, 70798, 20570, 709, -24190, -87381, -73578, 2873, -34347, -90905, -90705, -58323, -88978, -116861, -34943, 36310, 67961, 63181, 59664, 35391, 38131, 46287, 19637, -3591, 70745, 24087, -24854, -47481, 18541, 9928, 33641, 55879, 1092, 664, -12848, 6343, 106878, 126740, 112568, 105644, 77793, 3925, -87474, -84137, -6400, -22591, 4636]
9298D636L0097p204l3350N897m0813N1966K6303K5676K3724L0384r029m6942p0786
9285i441o5669O6737k0492j061K362M094M3017N877r385j1101k6656k3001m838
9272d9557K9543K6285o29K8697L5158j1332j5094k5406m3670K1796N8543k3090
9260C1244j7905j9840K43N1453l03J9972L8325K108j5648p1280p6631J3941O5510
9247B1189M6042K9468k7454M6207L4932n6133o9168o7588j8664j676K8799N2835
9235A8789M2890J199j4385o768j665K0382l4097m3819L9442M168OK868k904m1117
9221a5011n8442L5858R5657q68K8234J6054L7719k2818m5107m6346l4730K573
9209g227o363J7975K8600j9702K8379K7418J2631j00669q402J6856M4627J6724
$$ y = [4636, 34733, 27529, -5821, 76, -40737, 11229, 37532, 63208, 86932, 117316, 108287, 61345, -9441, -75110, -8373, -28865, -29926, -27564, -23470, 19547, 25424, 16039, 4938, -21718, -44719, -49557, -20014, 6271, 5642, 34339, 69497, 58165, 43071, 17665, -26005, -4209, 54334, 31244, 13339, -6501, -6258, 45195, 44892, 64864, 103189, 105297, 89649, 18369, -58262, -44321, 21189, 67231, 96699, 69245, 115452, 150384, 94251, 25083, -42505, -61169, -62845, -34046, 18789, 61679, 62878, 48493, 41725, 40060, 60442, 26345, -17474, 21968, 26136, 26142, 29010, 26106, -15011, -73453, -37595, 58062, 57194, 85428, 101482, 139201, 116383, 71276, 24930, -9800, -7227, -13590, 4385, 32985, 13283, 41662, 69080, 81711, -18958, -27360, -10504, 34123, 50847]
9197E0847n1758k3895K3168K0752L2468n797l3553M0442K0598L1305M6332K2792
9185A73701K1534j7526p4054l915K6098M708J3513j2410K7584Q255p5673l3883
9173E7932K3765Q84P864m4252l5229n385Q1781O1265m4005q5595k4826q949J261
9160a3489J8920n1660n8044l4613j6888P3695M0113N776j1704O1963J5573j0578
9148A9064J6338M5042k9409m1635Q814R064j2063M4957J3970l5041j8609j109
9136A9383j5188m0863k371K7994N92j6299k4047j0288L4611L4624n35q05J7465
9123B4273k4506j6668l7643k4084J9664R919l497j4534P555L0928L4541L1129
9111C7077J5787k5204m2624k9254m3831M2620L7878j1200j7196j0686K838J0239
$$ y = [50847, -911, -24806, -1638, 19114, 51582, 45785, 12232, 52674, 73272, 104577, 150909, 173701, 195235, 177709, 103655, 99740, 125838, 130546, 144059, 131649, 159233, 167488, 91815, 57932, 81697, 82581, 90445, 46193, 10964, 5579, 87360, 148625, 104620, 19025, -5801, -14750, -13489, 5431, -46229, -104273, -138886, -155774, -82079, -41966, -36190, -47894, 14069, 29642, 19064, 35402, 80444, 51035, 9400, 18214, 27278, 15215, 60172, 74142, 39101, 20492, 19383, 4195, -36668, -39039, -11045, -10453, -26752, -50799, -61087, -26476, 8148, 7613, 6808, 24273, -233, -16901, -54544, -78628, -58964, -49045, -52542, -67076, -59521, -28593, 5948, 37077, 52864, 27660, -14964, -44218, -88049, -45429, -7551, -18751, -35947, -46633, -43795, -33556]
9099c3556J0043n8500Q193L0749K4648N1472k1827n461m5884L9802n254K2399
9087A6824M1676j552j301m3953q8226j2458J9220J2010L4413J6533l233j8051
9075b8098m7121O89K8410k3698O625O9621l275m2256K7108K7595k0751J4215J4817
9062B3881K878J6810n5248m207N1120N2455J3056l1696p2633j4161K1760L5805
9050C9820M3841J5104K2500j7972l2827k4850o9749m1930K0807N0883N3574o271
9038E2930j8083j2915K93j3690K1090K041l2122J0851j0399k4416o459N8049K1747
9025D8917L2784k3155o7441j1637K8689K1620j9417J4768J5416n2913p9781K382
9013h9768O0923k3088J6357K0995M0862L1257K3637j0405j9177j9718O4969K2013
$$ y = [-33556, -23513, -82013, -73820, -43071, -18423, 33049, 11222, 5761, -40123, -321, -5575, 16824, 58500, 56948, 55647, 11694, -76532, -88990, -69770, -57760, -23347, -6814, -10047, -28098, -75219, -74530, -46120, -69818, -63193, 6428, 3153, -39103, -11995, 15600, -5151, 9064, 23881, 26759, 43569, -11679, -15886, 35234, 87689, 100745, 69049, -3584, -17745, 4015, 39820, 83661, 98765, 121265, 103293, 70466, 45616, -24133, -66063, -45256, 5627, 59201, 52930, 34847, 21932, 22225, 8535, 29625, 31666, -456, 10395, -4, -24420, -30879, 27170, 48917, 81701, 58546, -8895, -20532, 8157, 29777, 10360, 25128, 40544, -12369, -92150, -89768, -28845, -51933, -35576, -14581, 26281, 57538, 81175, 70770, 51593, 31875, 96844, 118857]
9001A18857r7168J5086J2527n2671J8797M1241k887L0871K8538k8049l4586J7008
8989F7564Q0516l722o2094k9794m6106j2735l3369L763K0861L3309J4197k0132
8977A2258N653j4207j1528K2921L666Q2734K6221r989o1253n765l3664k3964K3820
8964A6903n9387k4738J0800N6088M9608m0222k4285K5569M532J1417M0598Q5030
8952A51913j2331j20693o5761j8987J2662j0903N4951M9299k2185k2063N5978
8941E1880J0195M8252L0763r6045l0709p885K2529j8055j0794K632l1383n1028
8929g9648J4548O7872J7150n778K1876M068k7567k3236l222K4624k8222k8736
8917d6271k9677k9423k0769N4726M5226j3713q3112L1251J8047k7405J5807L0784
$$ y = [118857, 21689, 36775, 49302, -3369, 15428, 56669, 53782, 84653, 113191, 85142, 50556, 67564, 148080, 144358, 82264, 52470, 6364, -6371, -39740, -35977, -15116, 18193, 32390, 12258, 17911, 3704, -7824, 15097, 18763, 101497, 127718, 117729, 56476, 50711, 17047, -6917, 16903, -42484, -67222, -56422, -334, 49274, 9052, -15233, 10336, 14868, 26285, 66883, 151913, 139582, 18889, -46872, -65859, -53197, -64100, -9149, 40150, 17965, -4098, 51880, 62075, 110327, 141090, 45045, 14336, 6451, 28980, 10925, 131, 2763, -28620, -79648, -65100, 2772, 19922, 14144, 36020, 40088, 12521, -10715, -13937, 10687, -17535, -46271, -75948, -105371, -126140, -71414, -26188, -39901, -123013, -91762, -73715, -101120, -85313, -54529]
8905e4529L1931k0100J348L2605N3838R620R852k3755o8871l3275K2921K0800
8893a7615k863j2210k6885k1366N858M43R785N7095J0340j5163m9499P090K2866
8880c2124K1065R369P415j2058j6858J3231M3447J3083J7505j5824p0080M375
8868a7454N1652L2150o691p653o7126k3168N4756M5946k19n4652J7658Q3134k7778
8855H0555k3246j8534q2044R015M9905M2703l4213o4549l110N0955J9922r54J016
8842B7421j6231M4073L7060o331m727K4387n7694O906M3445l9038p6343k0893
8830c7965M9047N6616L4513m2852J6391k8718p4701m2847J7757K4882K7602N6280
8818E6005M0474j6520m1238k5875O51J8775K6943l3899K6414N0561l722l521J689
$$ y = [-54529, -22598, -42698, -41350, -8745, 45093, 54713, 64565, 40810, -28061, -61336, -38415, -17615, -20478, -32688, -59573, -80939, -75081, -74638, -64853, -7758, 2582, -12581, -62080, -54990, -32124, -11059, -1690, 5725, -6333, -23191, -9960, 33487, 46570, 64075, 48251, -21829, -17454, 34198, 66348, 59657, 52004, -15122, -38290, 16466, 62412, 62193, 7541, 25199, 108333, 80555, 57309, 38775, -43269, -34254, 15651, 58354, 24141, -40408, -43518, 7437, 27359, 26405, 27421, 11190, 55263, 92323, 85992, 81265, 105652, 47958, 54864, 98309, 59271, -17072, -37965, 11082, 67698, 102211, 59359, 75750, 47032, -27669, -70516, -52759, -27877, -275, 56005, 96479, 79959, 38721, 12846, 13497, 32272, 59215, 25316, 51730, 102291, 98569, 95048, 96737]
8805I6737J3378k9285k0140L5235J4606L1732k483J874M1140R976m1880J1991
8793A62881Q7262N8899K5189o126M6661J64914J34052Q1896J54921K35446K15294
8782A361289K14746K82908J80013Q3747j05661j76914k84726k80703j69537j58192
8772I46970k03048j46240j03983j0638j7775o2764o246m3352r4897l7269o438
8761B14320K784j5700K8865L9614m693k5213N20m268k4368m9975j1399l6871l551
8748A10065k7127j0073M1527K7967o3020l4089R826J9196N8921M21R640l5251
8736A08003K2252L2730k548O868l9692p4515K263Q4188l5457n6647J7432K8755
8724I3632p936k8599k8210j0794l879J0583Q908K992K5564N4m717j0378O0639
$$ y = [96737, 110115, 80830, 60690, 95925, 110531, 142263, 139780, 141654, 182794, 192770, 150890, 162881, 250143, 309042, 334231, 328105, 374766, 539680, 673732, 755628, 910549, 1145995, 1361289, 1576035, 1858943, 2038956, 2122703, 2017042, 1840128, 1555402, 1274699, 1105162, 946970, 743922, 597682, 493699, 483061, 465286, 402522, 396276, 352924, 258027, 220758, 214320, 217104, 201404, 230269, 269883, 265190, 239977, 240497, 236229, 211861, 161886, 150487, 113616, 110065, 82938, 72865, 114392, 142359, 79339, 45250, 55076, 74272, 133193, 133614, 143254, 108003, 130255, 162985, 160437, 167305, 127613, 53098, 55361, 139549, 104092, 47445, 64877, 93632, 85696, 57097, 28887, 18093, 14214, 24797, 33705, 36697, 62261, 62315, 57598, 47220, 107859]
8711A07859P3624o000k761K4736j6002m6422K2502J09532P6767L6176J9249j8544
8699C80716l3448j4357m3291j6149o9251l043K9272m7854m4621N916N1378o092
8687A89176j9981p9548k4622J453l004K1426P3950p853J6106m6541N1797J333
8675A73692l7700n2003J5120j1989o371J3641L9881Q9149J15978L5816m925j0880
8663C59409l2633l1906J1570j6607q1630p6142k9808O7190k0266l9575P660o654
8651A10608O1604N2527n6985l0650k2905K2788N5546K5657m2489m9650l1000M0145
8639A35196j1615l9696j4112l04P480j1559j0735K587M8467J7467K2109k7487
8627A17798k7875N4656J3046O8767K218o9255q0287p9085L8578L5094O0392L6516
$$ y = [107859, 181483, 175483, 172722, 197458, 181456, 135034, 157536, 267068, 343835, 380011, 399260, 380716, 347268, 332911, 289620, 273471, 204220, 201177, 230449, 182595, 137974, 143890, 195268, 189176, 169195, 89647, 65025, 66478, 63474, 84900, 158850, 150997, 167103, 120562, 172359, 173692, 135992, 83989, 99109, 87120, 80749, 94390, 134271, 223420, 339398, 375214, 370289, 359409, 326776, 294870, 306440, 289833, 208203, 132061, 102253, 169443, 149177, 109602, 117262, 110608, 172212, 224739, 167754, 137104, 114199, 136987, 192533, 218190, 175701, 126051, 95051, 135196, 123581, 83885, 69773, 69469, 76949, 65390, 54655, 57242, 105709, 123176, 145285, 117798, 89923, 144579, 157625, 226392, 228610, 159355, 79068, -17, 38561, 73655, 134047, 170563]
8615A70563K9076K7424m937o7482J7111P201L2998L751k7108m727L344N2314L7195
8602B76723l9239k3598P4003J664P45M8911L7776J430M6781J02742P8793L6421
8590F43152J2212L4054K412j2411J1084j3820P69J6314J2004K7494k0956n2622
8578F59686o3758k2297m4526o3939n0474m1433l4262K112K8616m9052l5199L8341
8566C23815n717K504J6874K799l4843n5792n261J9726K088j7137j9208o685J3594
8553B36757l018m6510K5786K254o5000p2176o230J4682J434K7188M6440L4558
8541A96165J4331m626q241K6170O8358Q2261R5817R5979N2703l0594p9079j43441
8529C65803r8094L5325j8639o7451j5630k7948j2961K2876k3115L1854K7886l0996
$$ y = [170563, 199639, 227063, 222126, 154644, 171755, 178956, 211954, 215705, 188597, 183870, 187214, 239528, 276723, 237484, 213886, 287889, 289553, 290298, 339209, 376985, 378415, 425196, 527938, 606731, 643152, 655364, 689418, 691830, 679419, 690503, 676683, 677452, 693766, 705770, 733264, 712308, 659686, 595928, 573631, 529105, 465166, 414692, 373259, 338997, 341109, 369725, 320673, 285474, 323815, 318098, 320602, 337476, 340275, 305432, 249640, 244379, 264105, 266193, 249056, 229848, 223163, 236757, 233739, 187229, 213015, 215269, 150269, 78093, 71863, 86545, 87979, 115167, 161607, 196165, 210496, 205870, 197629, 223799, 292157, 374418, 470235, 566214, 618917, 588323, 509244, 365803, 267709, 303034, 284395, 216944, 201314, 173366, 160405, 183281, 160166, 192020, 219906, 188910]
8517A88910j4151j5961m417j0333L6716r714o4549n9983n4705J954J01474N7499
8505A52740o8406l9752J6798O377R226J1621O3580L2457k4684l1943N1304O7272
8493B46590O5709M9955J32997K38078K27172L9876j01781j54220j90201j94221
8483C59954j11141J0859R900l9033l5856O479k3957n6800k0411j8359J2373J6086
8471A10094M4940O3628J4508j5000l6887o0371n5444N581L1763L972k9658r811
8459F7315j4173L699R294J1278N834j1745m1079M6542K8376L5200K4929J04442
8447B69912L5330J2131R9621J30562N3567o3314q8714r6963o1790m278q1268p7591
8435A27205R383L1164n361l9567l1916L7827K5303k9738l8144j7709k1037j3313
$$ y = [188910, 174759, 158798, 154381, 144048, 180764, 171050, 106501, 46518, -8187, -6233, 95241, 152740, 84334, 44582, 61380, 67757, 76983, 88604, 152184, 184641, 159957, 128014, 179318, 246590, 312299, 362254, 495251, 733329, 960501, 1000377, 898596, 744376, 554175, 359954, 248813, 259672, 269572, 230539, 194683, 201162, 177205, 120405, 99994, 81635, 94008, 110094, 155034, 218662, 233170, 218170, 181283, 120912, 65468, 71049, 102812, 106784, 77126, 67315, 53142, 56841, 66135, 77413, 83247, 71502, 30423, 76965, 105341, 140541, 165470, 269912, 305242, 317373, 416994, 547556, 601123, 537809, 449095, 352132, 290342, 286064, 204796, 127205, 136588, 167752, 162391, 122824, 90908, 128735, 154038, 124300, 86156, 68447, 47410, 34097]
8423C4097k101M7158Q101l6439j6754o4896k7724K7234N4318j2574k5702m073
8411a9355k0608j1239L7973O296J6031R8047J3055J4399n8105k5107k3621J5514
8399D3280m574p982p8434j3778K5926N7079O6999J9678l083k8913k1962L7966
8387I2202J4396j59r855m6734p4912K0319J6536K7226O0525q95k9689K886j9090
8374E2756j446Q392l6743k3161j1183M0962K7373k2616M1572L2835j3777l4185
8362F0779k1998J371k3881o5563m969m0322k784j1494j544j0549J6979J5731M1190
8349d7054N9171J0049N8191K8841m44k5251o5532o6029j4740K8230M5143J667
8337A2242M9939J4686n4744k7895o4350k9558K2716L7973M2652m248M571L6348
$$ y = [34097, 31996, 79154, 87255, 50816, 34062, -30834, -58558, -31324, 22994, 10420, -15282, -19355, -39963, -51202, -13229, -6933, 9098, 107145, 120200, 134599, 76494, 51387, 27766, 43280, 38706, 30724, -47710, -61488, -35562, 21517, 88516, 108194, 105111, 76198, 54236, 92202, 106598, 106439, 96584, 49850, -25062, -4743, 11793, 39019, 99544, 98649, 68960, 71846, 52756, 51310, 59702, 22959, -202, -11385, 29577, 56950, 34334, 75906, 108741, 94964, 60779, 38781, 40152, 16271, -49292, -54261, -94583, -97367, -108861, -110405, -120954, -103975, -88244, -47054, 12117, 22166, 80357, 109198, 108754, 83503, 17971, -48058, -62798, -34568, 10575, 12242, 62181, 76867, 22123, -5772, -70122, -99680, -76964, -38991, 3661, -587, 3984, 40332]
8325D0332L8628J2984r5588R998M5215j6289k1181l7703n5503L242O0364P6535
8313F1034l0157l21m5107k4342N002L9328M8597p3784m6256j8816j692K9827M7564
8300i123K8696J2459P840j3948J9815l4565k1488l8326R9P0859L3261p9869q2196
8287a06486L0279O9685J5072l7422O305j3520n9028j2044K5271L3899n2809J491
8275i9307K6738m314l927K7211M1340L0355l6514J9969P9357l7015p286K3108
8263E9715n3217k0188L91L6419M0300L800J4381j4686j2067k0295K3470M8402
8251A06425J916l060l5260J0611j6244Q17K532k1093K0529j2528L582J2417l3087
8238C7557M3491N2183q8764l0636M8106k0524o0145j5877J4960J1666L5164j9469
$$ y = [40332, 78960, 91944, -3644, 6354, 51569, 35280, 14099, -23604, -79107, -75865, -15501, 61034, 30877, 30556, -14551, -38893, -33891, 5437, 54034, -19750, -66006, -84822, -86514, -56687, -9123, 19573, 32032, 39872, 25924, 45739, 11174, -10314, -48640, -48541, 22318, 55579, -24290, -106486, -76207, -6522, 8550, -28872, -22567, -36087, -95115, -107159, -81888, -47989, -100798, -99307, -72569, -76883, -80810, -53599, -12259, 18096, -18418, 1551, 80908, 43893, 36607, 59715, 6498, -13690, -13299, 23120, 63420, 67220, 81601, 66915, 54848, 34553, 58023, 106425, 108341, 105281, 70021, 80632, 64388, 65205, 67737, 46644, 67173, 54645, 58227, 70644, 37557, 81048, 133231, 44467, 13831, 61937, 41413, -18732, -34609, -19649, -7983, 27181, 7712]
8226G712J4177J4989j4329k5133L304L1791k1356k8195m666k5707j4211K6614
8214c5010j8894L7925j5191l2167L8091K0801M6739k8306j2330P0317K8353j9400
8202H0928k7358l3993L918l87K6423r452j2016m8878l1994q311O454j1622O669
8189e9619M9058N0700J9067K5158l125O3514m0366L9884Q836n5076l6314j2522
8177D9195Q093l7014O087L276l9849o559K3084Q2490J2517j0547n2897m2222k3867
8164b8213K5575K0642M4535l0824k3958J122K9241P4211R4610l1779m6087j0357
8152A18718n3797k1841J4970o949l2790l4248l157j010n667r1P906Q739L0314
8139B1097j3107p352j6729l301J4801n2016m7278m398K1878N3745L6581J3411
$$ y = [7712, 21889, 36878, 22549, -2584, 720, 32511, 11155, -17040, -21706, -47413, -61624, -35010, -53904, -15979, -31170, -63337, -25246, -4445, 42294, 13988, 1658, 71975, 100328, 80928, 53570, 19577, 23495, 23108, 49531, 40079, 28063, -20815, -52809, -61120, -54666, -66288, -59619, -10561, 40139, 59206, 84364, 81239, 144753, 104387, 144271, 153107, 98031, 61717, 49195, 57288, 20274, 26361, 29637, -10212, -16771, 6313, 88803, 101320, 90773, 37876, -4346, -28213, -2638, 18004, 62539, 31715, 7757, 8879, 38120, 112331, 206941, 175162, 129075, 118718, 64921, 43080, 58050, 51101, 18311, -15937, -19094, -20104, -25771, -25862, -17956, -9217, 21097, 7990, 638, -16091, -19392, -4591, -56607, -103885, -108283, -86405, -32660, 3921, 17332]
8127A7332K9164q6005p2088O560J4768L6421L7605K2624l9762J2994M2227L0350
8115E2190k6080K5083j6214O634r993l6627j4693M0572L1282l8575p7141m109
8103f7671J29325O5428n4437J2193p414l6683l4833L002O878j1633j8360J8031
8091C826L2988M0801P3730r313p9544n7522J8275K0492j7865N408K9765J0873
8079G1914m924l9509m4055L3483J4672l3597K155j3678j1553M5667O1681J172
8067H3428J1689K9954l8898p7680j320K5908k7617k962R426L2440J0828j6432
8055C8764p556k8507J3649j2386K4796L0287k9343J5016L156L885K4655k1535
8043E4881j9590p0234J5636J8303O0165J1131K278L2824l7793j8690k0721J7652
$$ y = [17332, 46496, -39509, -111597, -105037, -90269, -53848, -16243, 6381, -33381, -20387, 21840, 52190, 26110, 51193, 34979, 41613, 31620, -5007, -19700, 20872, 52154, 13579, -63562, -67671, 61654, 127082, 72645, 84838, 77424, 40741, 5908, 8910, 15788, 4155, -14205, 3826, 36814, 77615, 151345, 142032, 62488, 4966, 23241, 43733, 25868, 31276, 61041, 71914, 66990, 27481, -16574, 16909, 31581, -2016, 139, -13539, -25092, 20575, 82256, 83428, 95117, 125071, 86173, 8493, 7173, 33081, 5464, 2502, 11928, 44368, 55196, 38764, 31208, 2701, 16350, 3964, 28760, 59047, 29704, 44720, 47876, 51761, 76416, 54881, 35291, -34943, -19307, -1004, 59161, 70292, 72570, 105394, 67601, 48911, 28190, 45842]
8031D5842M6325L3107L1671k3254J3669k6555n563n8810o2923j5080r832L4189
8019B786k4706k1379P7558M3468k9960m762l9589J0075N6200M0737O1044J3132
8007A84604o6507l4511J7398J557K3455L6932J9848o192l1327j1756l2680k9523
7995G1298L8688J7386N951J0775K6655N051J8923n986k0008M1299J0241k6043
7983A94230k1823k0288j3473K8948K9172l7886j354n5731J9098P8923p76l3003
7971A66037l6705l0478k8392j0387K4454R571R757j9564J3947J6599j3706n3851
7959D7282n5368K1721K5581J0154Q7614J1924M393l4011k5982n188R620N4249
7947A51989N4291k2225j9176k54k4867m3475j9460J9822J9226j3776K1024L2467
$$ y = [45842, 92167, 125274, 156945, 133691, 147360, 120805, 115242, 56432, -6491, -21571, -31403, 2786, -21920, -43299, 34259, 77727, 47767, 43005, 3416, 13491, 69691, 110428, 171472, 184604, 118097, 83586, 100984, 102541, 125996, 162928, 182776, 176584, 145257, 133501, 100821, 71298, 109986, 127372, 133323, 144098, 170753, 175804, 194727, 188741, 168733, 210032, 220273, 194230, 172407, 152119, 138646, 167594, 196766, 158880, 157526, 101795, 120893, 199816, 199040, 166037, 129332, 98854, 70462, 60075, 84529, 94100, 103857, 84293, 98240, 114839, 101133, 47282, -8086, 13635, 39216, 49370, 136984, 148908, 153301, 119290, 93308, 88120, 97740, 151989, 206280, 184055, 164879, 164625, 139758, 96283, 76823, 96645, 115871, 102095, 123119, 155586]
7935A55586J2693n1720k7206J4538m9287k8144O4883J7120k6057J8492k7277q1043
7923g422M177p803Q5008j6465J9058l9262m4073L3260L8023L7084m698n4636J4208
7910E6459M3808K4204K1198k451M127l3605m8624M3054R193J102j884o5371n3469
7897b259K8695M4080k523J155k2520m3124k5144K1874q944j7072J1650K5822N0507
7884F2197j1963l095m4833k0283K3490L0647N2994K2604k4749O447l5517k3108
7872C4831L7328L3721J4732K2572l2141n8608o0069O128J6829L0679L2794J0399
7860H9195m3027J436O8408R155n2606n5780n0810N1045P895k8844l0673n144O1543
7847B1793j2862l2255n6650m682N9620Q1151m5037l9574J8814K0711L0392J1222
$$ y = [155586, 168279, 116559, 89353, 103891, 54604, 26460, 91343, 108463, 82406, 100898, 73621, -7422, -3245, -11048, 73960, 57495, 76553, 37291, -6782, 26478, 64501, 101585, 96887, 42251, 56459, 100267, 124471, 145669, 143218, 147345, 113740, 65116, 108170, 117363, 118465, 116581, 51210, -2259, 26436, 70516, 67993, 69148, 46628, 3504, -21640, 234, -8710, -25782, -14132, 11690, 62197, 50234, 47139, 2306, -17977, 5513, 36160, 89154, 111758, 87009, 93456, 57939, 34831, 72159, 105880, 120612, 143184, 111043, 52435, -7634, -1506, 15323, 46002, 78796, 89195, 46168, 47604, 116012, 125167, 72561, 16781, -34029, 17016, 24911, -3933, -34606, -39750, 21793, 8931, -23324, -79974, -84656, -25036, 56115, 11078, -28496, -9682, 11029, 41421, 52643]
7835E2643J0615P572p2444q432k7014r693K0964M2768K6671P044n9081l448M5097
7822C3262K0013K714n9281q620j4510K7110r731l608L2553R491O72k5783m1411
7809c7129k1026L1119k1947o8062O712O1225J1122J5125R090j8506j2962P4544
7797B9305L9078m0345n77l6117k1307K0288J0480k3862l2018K3185j3152k2625
7785f7667M6551K0015l2055L278j7754J5510L7864p700m584j983J9108n998O103
7772A0688K4474l9332k5406M466r872q14M2454j0758J2896l8762L1383K5890R108
7759C6415p3324k6543j001l6479K7864J5772L7030n083n003J5446j1481j0289
7747c6676L2970N0244k339L1835l394m5695L7481P972m5683k3998j4370M4122
$$ y = [52643, 63258, 70830, -1614, -10046, -37060, -46753, -25789, 16979, 43650, 50694, -8387, -11835, 33262, 53275, 55989, -3292, -11912, -26422, 688, -9043, -12651, 19902, 29393, 30065, 4282, -37129, -58155, -27036, -48983, -117045, -110333, -49108, -37986, -22861, -13771, -32277, -45239, 29305, 68383, 28038, 27461, -8656, -29963, -9675, 805, -23057, -55075, -31890, -45042, -67667, -21116, -1101, -33156, -29878, -47632, -32122, 5742, -1958, -6542, -8525, 10583, 4585, 10688, 35162, -4170, -29576, -25110, -34982, -35796, 6658, -4100, 8796, -29966, 1417, 27307, 36415, -36909, -63452, -64453, -100932, -73068, -57296, -20266, -25349, -30352, -14906, -26387, -36676, -3706, 46538, 44199, 76034, 72640, 26945, 64426, 72398, 26715, 2717, -11653, 32469]
7735C2469M2665m7195k0469l1088L3883Q749l3964m425o750p1504o9184K5775
7723a41038j3956K8622J02302J5922k7013K3197o6367k518O328l4493J6731L2757
7711e9526L0895P7212M1920m2664j6308k3019M4687N2203p7436q184o2395k1807
7699f4422L4163J0852J2134N0996m2601k4438J6981J5895p7041l988O5870J4484
7687H885n107k4767j9816K3438J5887k6734p528j2661k8877J2322K4983r4616
7675a34591l0469R1536L6405p208O4997j332J5084O581q3411k1330l0058n2125
7663a45921M0700J9615M4342p44K6097J0249J5335M0090o497K745p7956q477l850
7650d4272j2695m4005n5891N127Q1262M9279K5043O9032k8773j5679M361M5505
$$ y = [32469, 75134, 27939, 7470, -23618, 10265, 19014, -14950, -19375, -26125, -97629, -166813, -141038, -154994, -126372, -24070, -8148, -35161, -11964, -78331, -80849, -74521, -109014, -92283, -59526, -28631, 48581, 90501, 47837, 31529, 8510, 53197, 105400, 27964, 19780, -42615, -64422, -30259, -19407, -7273, 43723, 1122, -23316, -6335, 9560, -67481, -71469, -5599, 8885, 3778, -20989, -40805, -17367, -1480, -28214, -35742, -48403, -77280, -64958, -39975, -134591, -165060, -73524, -37119, -44327, 20670, 19338, 34422, 41003, -42408, -63738, -93796, -145921, -105221, -85606, -41264, -42008, -15911, -5662, 9673, 49763, 43266, 46011, -31945, -40422, -44272, -56967, -100972, -156863, -151736, -70474, -21195, 3848, 72880, 44107, 28428, 32789, 78294]
7638G8294M52m3360j7492k4920M1246O1012q4574l7705k0692J494P125K2910J014
7625a5196j0721J8312O2462J5555n7405q8231j7534k7475M5057K5783N3513K633
7613F753k596k6288K6456L942n5019L535Q121K2312J6195j1383o2470o8994M6909
7600i2527R5996k8270O5011J6487k0070L0847L3594l2937p3078j3243K0467M5335
7588D7612M3017K8752n0693k5058M1982l0148R186J4902p2948k8933p491j5669
7576d5489N6L6859M446k008j2312n1405n5058L0423R0538M0959L0284l6179l1917
7563h03j4885j0265p29J0772J8246o3918j2350M3968o468L777n3347m1683K8241
7550i9444L6k0675P2551P7874j838m8324j5191J3189P667j0653l2467m5742M8914
$$ y = [78294, 78746, 35386, 17894, -7026, 34220, 95232, 10658, -27047, -47739, -46245, -39120, -16210, -15196, -25917, -7605, 54857, 70412, 13007, -75224, -92758, -120233, -75176, -49393, 4120, 6753, 4157, -22131, 4325, 8267, -46752, -43217, -35096, -12784, 3411, -7972, -70442, -139436, -92527, 3469, -24801, 40210, 56697, 36627, 67474, 101068, 68131, -4947, -18190, 2277, 47612, 90629, 119381, 68688, 43630, 85612, 55464, 64650, 79552, 6604, -22329, -29820, -45489, -45433, -8574, -4128, -6136, -18448, -69853, -124911, -94488, -3950, 37009, 67293, 31114, -803, -15688, -25953, -26682, -15910, 2336, -61582, -73932, -29964, -36432, -32655, -86002, -127685, -99444, -99408, -120083, -47532, 30342, 28504, -19820, -35011, -21822, -14155, -24808, -57275, -103017, -54103]
7537e4103N6099o6293l1369j0381L6388O3831J11512k940q3334l224K1691m6758
7525h881k3815k6861j4782K2794j6798Q962J3565J945Q199l0405k94M719J2105
7512d9547m31j1756J0145J6581j5550k6818l1666k150K1335K3255L2768N132L0892
7499B190l8715k3806Q48N3276m438l4386j6501J1053L6108l7044m8913L8096M5128
7486a7104n6346J8329Q7756k7358k5932P215L236L7268P198n9319K1857j4744
7474a7944L791J7150K4290j5461J0364m5291j3706Q234l7361K8023M2035J3399
7462A7523J1570L5371n8850n3541j5950k297P678L3000j1164J1303K4683J5277
7450A4603J2584r600m4183N7398l4197o5022L653M0524O4808k6361j3112L1439
$$ y = [-54103, 1996, -64297, -95666, -106047, -69659, -5828, 105684, 102744, 19410, 16186, 37877, -8881, -32696, -59557, -74339, -51545, -68343, -59381, -45816, -43871, -35672, -66077, -66371, -61652, -49547, -49978, -61734, -51589, -35008, -50558, -77376, -109042, -111192, -89857, -66602, -33834, -28702, 2190, -36525, -60331, -59483, -6207, -10645, -45031, -61532, -50479, -14371, -51415, -100328, -62232, -17104, -73450, -55121, 32635, 5277, -20655, -13440, -10204, 27064, 34262, -25057, -3200, -17944, -14153, 2997, 27287, 11826, 22190, -23101, -36807, -28573, -65934, -37911, 4124, 17523, 29093, 64464, 5614, -47927, -63877, -66174, -58496, -25496, -36660, -25357, -674, 14603, 27187, 17587, -26596, 30802, -3395, -68417, -64764, -24240, 40568, 14207, 1095, 32534]
7438C2534j6726P8278k0220n5389m45R951K0237m9217p7642M6205P3526K8097
7426F9189o449n1908n1858j8049j6020q682M2921L5353K2464j2979J3504k1386
7414c900o0906r122Q3495N5689l0087k5465k1751K878J657M0473l5842m2305M4331
7401h55L3741k8378m68K9861j3066m9719P927k2780J3597j8848J209K5484J921
7388b0374m6161L1806P842j8055N811j7572q902o405q235L9041K223J6491k356
7375b4846K897J4889j5759K0792N5393m5641m9773K5141M1750L0026m3897n2636
7363d1664M1350O2118q684o2492l5946J9090j3477o8523K0193K6225K0681j5452
7351e6581m1411M7171J9331J4505j1585n1200k1792N5072r141M999K9324O177
$$ y = [32534, 15808, 94086, 73866, 18477, 18032, 27983, 48220, -997, -78639, -32434, 41092, 69189, 62740, 10832, -41026, -59075, -75095, -83777, -40856, -5503, 16961, 3982, 17486, -3900, -64806, -73928, 9567, 65256, 35169, 9704, -12047, -9169, -7512, 32961, -2881, -45186, -855, 32886, 4508, 4040, 33901, 20835, -28884, -20957, -43737, -30140, -48988, -47779, -22295, -20374, -66535, -34729, -26887, -44942, -39131, -56703, -65605, -72010, -80245, -41204, -38981, -22490, -24846, -21949, -7060, -22819, -2027, 53366, 7725, -42048, -16907, 24843, 54869, 10972, -41664, -314, 61804, 53120, -9372, -45318, -26228, -39705, -108228, -88035, -61810, -41129, -56581, -97992, -50821, -31490, -16985, -28570, -79770, -101562, -46490, -55631, -50632, -21308, -15131]
7339a5131J6608K2487l1742o1691k6333J7381M9143R3748j8876j6630o850j9959
7327B155K0888l122q959n5760N1248J2525l5012n320K8323q432P13N0315k9190
7314B0372m9413J9053L9764n9546k504K0022k9735J0302M7493L8366Q6853j22453
7302A8574q5964O5629P3982l8826k7066K0502n8007m1446l6269r870L7718L5813
7290d5230P879L7063o385n7532k9816K9224N5577M6707K6878J36j7001k3711K9213
7277E3002p63k0802K3488N2168n2905L9758j7107j644j4616n1699K5898K2827
7265E7605p5834l7214R2337j7558l7727j8744J7039M3382L6516l7818K4235k4725
7253B1494j6596l4777J7190J1865j7155o274k8256L7729j8613j7415N909P016
$$ y = [-15131, 1477, 23964, -7778, -69469, -95802, -78421, -29278, 64470, 45594, 28964, 22114, 2155, 23043, 19921, 10962, -44798, 6450, 18975, -16037, -21357, 6966, -1466, -753, 49562, 20372, -29041, -9988, 29776, -29770, -32274, -12252, -41987, -31685, 15808, 54174, 141027, 18574, -67390, -1761, 72221, 33395, 6329, 26831, -31176, -72622, -108891, -118761, -81043, -45230, -37351, -288, -6673, -64205, -94021, -64797, -9220, 37487, 64365, 64501, 47500, 23789, 53002, 52239, 31437, 54925, 107093, 54188, 93946, 76839, 75195, 60579, 8880, 34778, 57605, -18229, -55443, 36894, 19336, -18391, -37135, -20096, 23286, 59802, 21984, 46219, 21494, 4898, -29879, -12689, -824, -17979, -24253, -52509, -14780, -33393, -50808, -44899, -37883]
7241c7883K6397J8612l8964k6204l1486j8927O2210j1756N0563L4808o3002o5883
7229a01515j1134M7689J345M0456N1446O312k9326m7318l7555k9918L1700r718
7217h7536j810M578L5780L7202J429N5518k498j5513L9236M7621J2733m2229n6195
7204B8316k7111J746l5700Q632k0737j9058P5330M6142o8232j2866N707j3048
7192c0879n413J0781n0081j735N768m5445L7657N8154L410L5617n48k6136j1529
7179b0379P362J6671J417k356r31M988k1388l8097m4332n7731k91K9484L5871
7166h9712K9194N0843L0270K92l6070J702k7256j0176j2643k3724M5445J2394
7154b9441P795p088j1480m0122K745r117j4625K977M5541l621R649k8147K8150
$$ y = [-37883, -11486, 7126, -31838, -58042, -89528, -108455, -46245, -58001, -7438, 27370, -35632, -101515, -112649, -64960, -63615, -23159, 28287, 34599, 5273, -42045, -79600, -109518, -77818, -87536, -89346, -84768, -48988, -11786, -10357, 45161, 42663, 27150, 66386, 114007, 126740, 84511, 28316, 1205, 2951, -32749, -24117, -44854, -63912, 11418, 57560, -10672, -23538, -17831, -30879, -36292, -25511, -75592, -77327, -71559, -117004, -79347, -21193, -17783, 17834, 17286, -8850, -20379, -13017, 3654, 5071, 2715, 1784, 6772, -14616, -52713, -97045, -154776, -155067, -125583, -89712, -60518, -9675, 20595, 20887, -15183, -13481, -40737, -50913, -63556, -87280, -41835, -29441, -21646, -28734, -40214, -80336, -77591, -86708, -101333, -98356, -52815, -56436, -46787, -74934, -46784]
7141d6784K9045M3976l3881p8031j4837K6222K5322k8706P706j0630m2466l091
7129a26155J9646O4307k968k0939n452P3555O2310O922j0263k8912n8592j2798
7117c9339M3981K358j1019k1332J4973k3335P1863k1624n5061O16j6455L7504
7105a6870M6860K6157R529l359k0629j0320r4180p364M3763N9314j9654k3455
7093a0208K7043P465j2393k9375k2611K9810J134p925L4681r578k76j6587n226
7080a4046K0339j0005j5394L724N9593K8378J0599j6997p8811m0306L4441J5605
7068b880j1875n1882l7916j0573J8744r266N5401K6946M2689m2497n4991l6657
7056a14757N1637P799j5325L1524K7424p628k7080j1671P560j8389J2603K6520
$$ y = [-46784, -17739, 26237, -7644, -85675, -100512, -74290, -48968, -77674, -69968, -80598, -123064, -126155, -106509, -42202, -45170, -66109, -71561, 1994, 64304, 71226, 60963, 32051, -26541, -39339, 4642, 7000, -4019, -25351, -10378, -33713, 38150, 16526, -38535, -37919, -54374, -16870, 29990, 56147, 65676, 62317, 41688, 31368, -62812, -70176, -26413, 32901, 13247, -10208, 16835, 24300, 11907, -17468, -40079, -10269, -9135, -17060, 17621, 8043, 7767, -8820, -14046, 6293, -3712, -19106, -15382, 44211, 72589, 83188, 66191, -12620, -52926, -18485, -2880, -14755, -66637, -104553, -115126, -96382, -105648, -50247, -23301, 19388, -23109, -78100, -114757, -63120, -55321, -70646, -39122, -11698, -19326, -46406, -58077, -50517, -68906, -56303, -29783]
7044b9783K3877J422L1153N056j4364r96K2516J3264k8927l056O638k0241o4994
7031e8435N392l10J4047L2439l504n622J1223j4008r4162o3759M0750K4265K5825
7018h5859O3351j1491l8724J1835L6862J7802K1373O2270J3706k8902k6273m9447
7006a3497l4026j6446R641N660l5032l0908k9712J01384P3975q599n8600Q844
6994b7316L0968k3503k1568k295J8826J3571K0437k849o218l3035K4902J9533
6982A1453K3631k73j4599J8692p5215L2161K6861J4948k6873K6454o3546q1283
6970a07589q312L2976Q0663R108o1317m8960M050N233L1637r654K3201L8936M785
6957e243J5927K6102j1173M2283j9276k7466K1745k2687p1306l0534J7804l757
$$ y = [-29783, -5906, -4484, 26669, 31725, 17361, 16365, 38881, 52145, 23218, 20162, 26800, 6559, -58435, -53043, -53353, -39306, -6867, -10371, -15993, -4770, -18778, -112940, -176699, -135949, -111684, -85859, -22508, -33999, -72723, -60888, -24026, -6224, 15149, 77419, 91125, 62223, 35950, -13497, -47523, -63969, -54328, -48668, -83700, -114608, -144320, -42936, 31039, 22440, -36160, -27316, 3652, -19851, -41419, -43714, -24888, -11317, 9120, 6271, 53, -32982, -8080, 11453, 35084, 34811, 20212, 38904, -36311, -4150, 22711, 37659, 10786, 37240, -26306, -107589, -115901, -82925, -2262, 6846, -54471, -103431, -99381, -94148, -62511, -72165, -48964, -10028, -5243, 10684, 36786, 25613, 67896, 48620, 21154, 42899, 20212, -51094, -81628, -63824, -67581]
6945f7581J2149j3339j0075n1880k5028N7433K8973L6501l7302m913P047j9366
6933h7381n934j7793K7238O4161L14j6991o9931M4331P297l0099j7347N6219N2986
6920G070M3658k1920K5239l4910K0018K2361l2363k2463n0799J6530J1137L1215
6908A4773o737K3942n826n6360J5058l1747k0071J5173K0282L7151M8410J4358
6896F8406l2554o0326L1727R945q2365m3439n2282L5846O1448k2328p1569M069
6884a53422K9650J3001j0097m7994M2542O5070K3413k513L0841O896K5523K7295
6872E0205M5585o2005o5134O1574M5693k9708M294K3105l4856m7032m5735K7468
6860b6546K9552K5899k6474o631L9659n5272q1268K0292L3574R8905K9291n661
$$ y = [-67581, -55432, -68771, -78846, -130726, -155754, -98321, -69348, -32847, -70149, -75062, -68015, -87381, -93315, -111108, -83870, -19709, -19395, -36386, -106317, -61986, -54689, -84788, -102135, -45916, 7070, 50728, 28808, 54047, 19137, 39155, 61516, 29153, 6690, -44109, -27579, -16442, 14773, 8036, 31978, 26152, -30208, -15150, -46897, -66968, -51795, -31513, 5638, 54048, 68406, 35852, -24474, 7253, 17198, -65167, -108606, -160888, -125042, -63594, -85922, -157491, -153422, -123772, -110771, -120868, -168862, -126320, -61250, -37837, -40350, -9509, -2613, 22910, 50205, 95790, 33785, -31349, 30225, 75918, 46210, 50504, 73609, 38753, -8279, -54014, -26546, 3006, 28905, 2431, -4200, 35459, -19813, -101081, -80789, -47215, 51690, 80981, 75320]
6848G5320o81k4078l4819L362n0154k6947L1496P1084p288l6471n8492k593J0501
6835d9760L2097N9577O7266k1641m5554j5509J9899l9861j9845l1825o8032J6405
6823i6783k3557q96K8753O9033P9720Q463n1859m7196J170r6392j1841R9155P3628
6810C1398l5715m3652l1582p543r423q72N959j1193L3198k4566O6779N4320k5402
6797A706j2578j2617k642k4481j5600K5399N2195N1274O428j3304j8436o33k9138
6784G573m6139m5495j7240K9428Q791O0091O6716J9944n3566k0349r779l4543
6772c4568L6803j8160o220l4646L3583m266j6033l2813k442Q011P4784K8147M4228
6759G6408M719l3461l1230J5913m5170j6544M6674M5814J7802o72m296o3785m5827
$$ y = [75320, 74639, 50561, 15742, 19104, -31050, -57997, -26501, 44583, 37295, 824, -57668, -60261, -49760, -17663, 41914, 109180, 87539, 41985, 26476, 46375, 6514, -13331, -45156, -113188, -96783, -120340, -121236, -92483, -23450, 56270, 64733, 12874, -34322, -33152, -129544, -141385, -42230, 31398, -4317, -47969, -79551, -87094, -96517, -97389, -91430, -102623, -69425, -93991, -27212, 27108, 1706, -10872, -23489, -26131, -50612, -66212, -40813, 11382, 62656, 69084, 55780, 37344, 36711, 7573, -38566, -84061, -101301, -71873, -63082, -2991, 63725, 83669, 30103, 9754, -25, -34568, 2235, -15925, -22145, -56791, -23208, -27474, -43507, -76320, -78762, -70751, 4033, 32180, 76408, 81127, 47666, 16436, 32349, -12821, -29365, 17309, 63123, 80925, 80253, 75957, 12172, -33655]
6746c3655R428j0498R980N1491n067m326o0254k0179k6936K2218M4243p58k6279
6733e0592M4567K3081J6p483Q158p1n7198J5317K9115J2963k7369n1488l3427
6720i4411J6669K8909O1559K3350j0274p4511j9502M0578N3047j3483L6489M8105
6708I6525J448l2621j3515n447J0597J1858m2068o953l006k6114p8821p52L8807
6695e0062K1140j5804M2831J9369K7385J2373l4156k8926q970k4033n091R631
6683c4313j7055k8418M9005J6021J2500l7355L5724L6892p6447n9743n0138n70
6671a53897N6528J3423j9414m7972j1557L8559J9517k350L7575P7137P165q0521
6659f5807j2987M1165O3849M7715k7951K7269K6973k4512j07o1712k1906o4125
$$ y = [-33655, -24227, -34725, -24745, 26746, 21679, 17353, -42901, -63080, -90016, -67798, -23555, -24313, -50592, -6025, 17056, 17072, 9589, 17747, 17676, -39522, -24205, 4910, 17873, -9496, -60984, -94411, -77742, -48833, 12726, 36076, 25802, -48709, -68211, -27633, 25414, 11931, 48420, 96525, 97973, 65352, 51837, 46390, 56987, 68845, 26777, 19824, 16818, -9296, -88117, -88869, -50062, -28922, -44726, -1895, 17474, 44859, 57232, 23076, -5850, -14820, -38853, -43944, -34313, -51368, -79786, -30781, -14760, -2260, -39615, -3891, 33001, -43446, -103189, -153327, -153897, -97369, -83946, -103360, -151332, -162889, -124330, -104813, -107163, -69588, 7549, 14714, -65807, -78794, -37629, 26220, 73935, 45984, 73253, 100226, 75714, 75607, 13895, -8011, -72136]
6647g2136L2936K9615J5976p0260o6499j7678O8377Q5685J6716p8371m663L1333
6635b8969L1575k2588k4990k1241j8058K5496o926J6093k9355l42L8744k9489
6623g0050R674m979L1255J9025N915J3385m1338L6625R906j4252L4239Q595l6728
6610A272O889K9987K4659k0711J1445Q374J7526k8715n4721j1650n8614k1869
6598i6128N947J8795M2348J4431j3335N1434M0553K9428o3601n7663J8683p05
6586i813m1528m3819M2613M8174K0157K8279K6978L1077O989j4586m270N1806
6574A42057j0766p4211j1664O799l3166r125M5072M1933L4905j1838p93J3112
6562A32315k1032o9225L7902N7841p758n0121L2727k3305n0131j880K3019j7615
$$ y = [-72136, -39200, -9585, 6391, -63869, -130368, -148046, -79669, 6016, 22732, -55639, -60302, -28969, 2606, -19982, -44972, -66213, -84271, -58775, -65701, -49608, -78963, -79305, -40561, -70050, -60376, -65355, -34100, -15075, -9160, 4225, -37113, -488, 9418, -4834, 29405, 38000, 1272, 8161, 38148, 62807, 42096, 53541, 61915, 79441, 50726, -3995, -15645, -74259, -96128, -90181, -71386, -29038, -14607, -27942, 23492, 64045, 93473, 29872, -27791, -9108, -9813, -51341, -95160, -52547, -4373, 15784, 44063, 71041, 102118, 109107, 94521, 90251, 142057, 131291, 57080, 45416, 52215, 19049, 9924, 54996, 96929, 131834, 119996, 119203, 132315, 111283, 42058, 79960, 137801, 130043, 79922, 112649, 89344, 39213, 37333, 60352, 42737]
6550D2737m6891N8702O0870J764n5J4010L1030k25O063j813K2380K8944J20067
6537C37583J10032k7273k1766j2189n1136o5687L7063J02741K0097j9643l6816
6526C73006k145m2783l6072p4119j848l569l1629k751j6611K3611L5292j0302
6514B10080m5121k2289J3551l9827K1712Q218k5132J4846j7173n3450l9963O9104
6502I4556J9200l6424k9485j3329k350N6516L9969k2238q929k2486p4787J3645
6490A3858n246L0496P078k6565j60K4551M5537J2487l7537K35j9619o2480o9662
6477h7027M4684N4176j0577k8314L9442J6688q278l2608J6148N2623m3548m2465
6465b9056j3512L9761N96m8118l5645J9391L5175L0681M5178K7548k3636k9926
$$ y = [42737, -4154, 54548, 115418, 117182, 117127, 131137, 162167, 161942, 168005, 166192, 188572, 217516, 337583, 447615, 420342, 398576, 386387, 335251, 269564, 306627, 409368, 429465, 409822, 373006, 370861, 328078, 292006, 217887, 216039, 212470, 180841, 178090, 161479, 185090, 220382, 210080, 164959, 142670, 156221, 116394, 138106, 146324, 121192, 136038, 118865, 65415, 25452, 94556, 113756, 77332, 47847, 34518, 32168, 88684, 128653, 106415, 97486, 75000, 213, 13858, 8612, 39108, 46186, 19621, 19461, 44012, 89549, 102036, 64499, 64734, 45115, -17365, -87027, -42343, 11833, 1256, -27058, 12384, 29072, 20794, -11814, 4334, 56957, 13409, -29056, -42568, -2807, -2211, -50329, -85974, -66583, -31408, -727, 44451, 71999, 48363, 18437]
6453A8437k0857k1409N425L2781Q192j5717m2967q319K8171K6946K1825m5695
6441a3187J5293o823j4291J4073J1709K2590L3558j4860L6205j5186n1583l6944
6429a9446J9969k1428l569L3582K3868K6438q722p015k2533K5858J041j0819k6102
6416A1122P426k9880k2629L1452j3420M6862N4318r4140m4959k43Q1887P7999
6404A05795p3348l5896j4191M9878K8775m0262j8367j2258P1210P733n4161n2375
6392c7467K627N6063K1782r5337j2535O0647m3662k8417r474k5413j0405K7868
6380i3723N5172j2923J0981j7167J0431n6369M7300M4988K4425Q685K7726o0902
6368a1376j9554j877p6981l105J5477l707N0692N3374j1511k5858m5468j7005
$$ y = [18437, -2420, -23829, -18404, 14377, 22569, 6852, -36115, -44434, -16263, 10683, 32508, -13187, 2106, -4717, -19008, -4935, 6774, 29364, 62922, 48062, 84267, 69081, 17498, -19446, 523, -20905, -24474, 9108, 32976, 59414, 50692, 43677, 21144, 47002, 48043, 37224, 11122, 18548, -11332, -33961, -2509, -15929, 30933, 85251, -8889, -53848, -54091, 27796, 105795, 32447, -3449, -17640, 32238, 61013, 20751, 2384, -9874, 61336, 69069, 14908, -37467, -34840, 21223, 43005, -52332, -64867, -4220, -47882, -76299, -85773, -111186, -121591, -93723, -38551, -51474, -40493, -57660, -47229, -103598, -56298, -11310, 13115, 21800, 49526, -11376, -30930, -32807, -109788, -112893, -97416, -101123, -50431, 2943, -8568, -34426, -79894, -96899]
6356i6899K5004L9018j4705K3049N242n7518l3836J7586K2545M292L3106J6822
6344a6294K486L9174L4835J4180o562m0262l1614l5505l3686j9330M9000L2789
6332a0789m4742j6412O375P859L3256j5322j5864r603J8269J1476r0611l581M3724
6319h5965K0477J2621J0265n2663k8790M4476P348J8870L7646n1919m3570J0742
6307a00462O7642K1114K5772K4392J8636N123n8357J2921M6201L451l7266q4205
6295e5038q1933K3659N8827L7525J7248J5158J5507o4737J9394L1620n5258M074
6283c3954K3620L823o382J9510P96P9321L7042l7156q6644m3187j5141N0338Q981
6270I67K571j2609k4789m76m8189k5795J6348K2414N2384L2316k9229l4199J5770
$$ y = [-96899, -71895, -32877, -47582, -24533, -19291, -76809, -110645, -93059, -70514, -66222, -33116, -16294, -13808, 25366, 60201, 74381, 67819, 27557, -4057, -39562, -73248, -92578, -43578, -10789, -55531, -71943, -65568, -57709, -24453, -39775, -55639, -65242, -46973, -35497, -126108, -129689, -85965, -65488, -52867, -42602, -95265, -124055, -79579, -72231, -53361, -15715, -67634, -111204, -100462, -32820, -11706, 14066, 38458, 57094, 62217, 3860, 16781, 62982, 66433, 29167, -55038, -136971, -113312, -54485, -16960, 288, 15446, 30953, -33784, -14390, 17230, -38028, -33954, -10334, -6511, -12893, 6617, 7413, 86734, 123776, 86620, -24, -43211, -58352, -8014, 967, 3538, -9071, -33860, -34336, -82525, -108320, -91972, -69558, -17174, 15142, -14087, -48286, -32516]
6257c2516l2351k3103O796l9877J5730M7871N366k7245k2581M5432o032k5281
6245h7791L3315J2125n6861j4694P7718J655K0151K5537N08k7202J1557k4443
6233b8425j3796O0492M808j5543o1854K757M0970J0914N165k8186m4494J6173
6221e1019J1916k2943K096J7181K027N5355r038m1710R226j9096j5310K3797k5100
6208f2618P253L2790p1375K811L8731l840Q355O4249M5081l2278n9645K1503K3961
6195A4978j5321m3290K2341M2189K0330j1407q306m3400L3044K2385j3832j5496
6183D215k6294n3188L8353N7908K1805l151l1385n0292K8620N2755k3948o1205
6171d5807n0390M4156M3483P0900K2154m2212Q141K7494K689N089j4950k2201
$$ y = [-32516, -64867, -87970, -81174, -121051, -105321, -57450, -52084, -79329, -101910, -56478, -62510, -87791, -54476, -42351, -99212, -113906, -36188, -34533, -14382, 11155, 11663, -15539, -3982, -28425, -42221, 18271, 23079, 7536, -54318, -51561, -10591, 323, 5488, -22698, -67192, -51019, -39103, -62046, -59950, -42769, -40742, 14613, 5575, -36135, -26909, -46005, -61315, -37518, -62618, -55365, -22575, -93950, -91139, -52408, -56248, -47893, 16356, 61437, 29159, -30486, -8983, 14978, -343, -43633, -21292, 20897, 41227, 29820, 21514, -21886, 11158, 33543, 19711, 4215, -22079, -75267, -36914, 20994, 42799, 39648, 8263, -42029, -13409, 39346, 15398, -45807, -96197, -52041, -8558, 62342, 84496, 42284, 50425, 77919, 80608, 85697, 70747, 48546]
6159D8546j8188j05765m4335J7441N1181k5285J7144L0438K0426m4782J428L0875
6147b0876O535o627J01006m2912p8558N7129P7566L9513m6826m8841P860O05j3011
6134C2563l1283N283j3201p0838j7616P4607K5097J7261k5301m1850Q039J4703
6122b2536K088p278l7162r586l5771L9225M884N9593L5328k5415M6517m360l7119
6109H408n258l5856k0742n8529K7465O0014L9768M5192M6782N9124M9445p6818
6097A38995r9073o1342n9277k7961M086M7868K0965K6780M907m8330O3268r394
6085A492n6917n926J3142N49N8738L3404q7207j6930k4452k0560J3589J5383m111
6072g9806N7659N0207o755m235q2259o3068j3772P2514K6838p194L2228j5549
$$ y = [48546, 30358, -75407, -119742, -102301, -51120, -76405, -59261, -28823, -8397, -53179, -51751, -20876, -14341, -20968, 80038, 37126, -41432, 15697, 93263, 132776, 85950, 37109, 44969, 45574, 32563, 1280, 6563, -6638, -77476, -95092, -20485, 4612, 21873, -3428, -45278, -37239, -22536, -20448, -27726, -64888, -74474, -110245, -71020, -66136, -6543, 28785, 3370, 49887, 45527, 8408, 3150, -32706, -53448, -111977, -84512, -24498, 15270, 60462, 107244, 166368, 215813, 138995, 39922, -21420, -80697, -108658, -104572, -56704, -35739, -8959, -4052, -52382, 10886, 1492, -55425, -61351, -48209, -47660, 11078, 44482, -42725, -59655, -84107, -104667, -91078, -75695, -79806, -22147, 28060, 21305, 17070, -65189, -128257, -142029, -69515, -42677, -49871, -17643, -33192]
6060c3192L4980r435L9951R531m2674j7349M3206l560m7736j2519K1752l9755
6048e6800L0222R332k5953l3497K0993J2000L6154O9053m0925l5349k3000m8907
6036h6677J1194J0571k1947J5171N5214J2110j2717L0711K3191L013m680J1804
6024D6958L618k835m538K9982l4701k4166Q3217r1032p8481J7411O0601j9596
6012a3562l4844k7382p503N7985n667M593m4312R340K4092N4829O199m0089n6871
5999g3192k5569J9253P5396l2172q9559J0092L2250M1119O6537K0307L6546K7110
5987A08118k0113l4865k928j19549k4424O6133N0402j7314n8772k7833o4480R654
5975a35971l1754Q349Q1272L6353k4669p7088J3996L1745J8814j3349j6048j8191
$$ y = [-33192, 1788, -7647, 32304, 41835, -839, -18188, 25018, 21458, -26278, -38797, -17045, -56800, -26578, -17246, -43199, -76696, -55703, -43703, -7549, 61504, 20579, -14770, -37770, -86677, -75483, -64912, -86859, -71688, -16474, -4364, -17081, 13630, 36821, 39834, 35154, 46958, 50576, 47741, 43203, 73185, 38484, 14318, 97535, 6503, -71978, -54567, 6034, -13562, -48406, -75788, -83291, -25306, -30973, -26380, -70692, -61352, -37260, 17569, 23768, -16321, -73192, -98761, -79508, -4112, -36284, -125843, -115751, -83501, -42382, 24155, 44462, 81008, 108118, 88005, 53140, 50212, -69337, -93761, -27628, 22774, 5460, -53312, -81145, -145625, -135971, -167725, -159376, -78104, -41751, -66420, -143508, -129512, -97767, -78953, -92302, -108350, -126541]
5963a26541K100M8310O4887k6380j4799n580j2472L324n2103m2206K470M0425
5951a18565K9156k2569Q9466Q5136L2625n3729k3216J4720o195m2395j3941J3388
5939a6119M466l929m1720Q863n3821J9056N9085Q219n945k461N8236M9170j9752
5926F3348j7742j5016k440k7126j6519K9851j4954k8336r659J9706K1336P0824
5914G3273j6707m5624n7105l3563N0129J6799q935J0760N5006K9751o4336J2368
5902B1816k177p525J3689J7786p5144m9614N6348j6254k175N5451K748p885K0454
5889B7518L368k1023j4430J4367J0281p765J997k1449p054J4921N9362K0734l3466
5876D7361k8085p0928j0712N4560L4062j8428l192l9761K3912j6687q801L4072
$$ y = [-126541, -124441, -76131, -11244, -37624, -52423, -58003, -70475, -67151, -119254, -161460, -158990, -118565, -89409, -111978, -22512, 62624, 95249, 41520, 18304, 33024, 26829, -15566, -29507, -16119, -11653, -15582, -57302, -48439, -102260, -83204, -24119, -15900, -21845, -24306, 33930, 83100, 63348, 45606, 30590, 28150, 1024, -15495, 14356, -598, -28934, -38593, -18887, 2449, 73273, 56566, 10942, -46163, -79726, -29597, -12798, -21733, -10973, 44033, 73784, 9448, 21816, 19639, 12114, 25803, 43589, -31555, -81169, -24821, -41075, -43250, 12201, 14949, 7064, 27518, 30886, 9863, -4567, 9800, 20081, 12316, 14313, -7136, -14190, 731, 60093, 80827, 47361, 19276, -51652, -62364, -7804, 26258, 7830, 4638, -35123, -11211, -27898, -36699, -2627]
5864b627N5141o5786l6469n6635r190l0570n431K0629J8848K6201K6275j6898
5852g6512N9055N5670q792J9120M2429N716J0447j5453k6222o9453J1203N8171
5840F5379O0608n5280j9627o8024k4555L7740L4789k1432j8482r7594J0483J5839
5828h0156L0671l525l0083k989J0203O0584k3585r9606L2900L8073K7995K0219
5816a9299K0207j590R414K4673k978L1215L350o055N229j03012q8557M6196O3839
5803a7368R375k5332m6930k5824M0037L0258L4103J1964j3510K1466l2185P831
5791f115j0224K0151L1905n1038o2029r073M3877J8369q381N458Q8596l0083l251
5778B8162J7196p4346J0085K687j5753q275k9097o9785l6299P3669O1844J5093
$$ y = [-2627, 52514, -13272, -49741, -106376, -115566, -146136, -151567, -130938, -112090, -85889, -59614, -76512, -17457, 38213, 29421, 48541, 90970, 96686, 107133, 91680, 65458, -3995, 7208, 65379, 125987, 70707, 51080, -16944, -41499, -3759, 31030, 9598, -8884, -106478, -95995, -80156, -49485, -53010, -83093, -86082, -75879, -15295, -38880, -138486, -105586, -67513, -39518, -19299, 908, -682, 8732, 33405, 30427, 61642, 64992, 58937, 64166, -38846, -127403, -81207, -17368, -7993, -33325, -80255, -106079, -66042, -35784, -1681, 10283, -3227, 18239, -13946, -6115, -16339, 3812, 35717, -15321, -77350, -86423, -42546, -24177, -32558, -27100, 61496, 31413, 28162, 45358, -28988, -18903, -16216, -31969, -40244, -69341, -139126, -175425, -101756, -39912, -24819]
5766b4819R979o205l643J6555N5515J7968l8647l7969j8461O764j2822L4805M7623
5753D6643q1252q0183K1008N5250j5480o80P8725j7654j7683J3227k4561k2209
5741d4849j6030K8821m358j5100L8540k3227j0912j6904M7302j6754r536j3811
5729e6818J0431K4435K9656j9464j3924q043j1323p856J9686M1448M170j7422
5717e024M5746K6533M59l2336l6109j4402P197o7318J0916K2989r425K0726N639
5704b4409j8803k4924L076J8744J3328J542M209O72l5100j4593O2941J7943J0073
5691A4699J7902m390M026J5202k0769M958m0594j5823O9729M927Q040k8480m5635
5678a6208n1215l3602k4817q874N1919P492N360k5720l489P3787l334j0290o6191
$$ y = [-24819, -14840, -21045, -24688, -8133, 47382, 65350, 26703, -11266, -29727, -22963, -35785, -980, 46643, -34609, -114792, -93784, -38534, -54014, -54694, 24031, 6377, -11306, 1921, -22640, -44849, -60879, -32058, -36416, -51516, -12976, -36203, -47115, -64019, -16717, -33471, -43007, -56818, -46387, -21952, 7704, -11760, -25684, -33727, -45050, -52906, -33220, 8228, 12398, -5024, 40722, 67255, 67714, 35378, -731, -15133, -7936, -75254, -64338, -41349, -50774, -30048, -24409, -43212, -68136, -65060, -46316, -32988, -31446, -27237, -26565, -61665, -76258, -13317, 4626, 14699, 32601, 28211, 32237, 47439, 26670, 31628, -8966, -24789, 44940, 49867, 57907, 29427, -16208, -67423, -101025, -125842, -134716, -82797, -75305, -69945, -95665, -99154, -25367, -28701, -38991, -105182]
5665a05182l5324J1552N1652K3799J5036r708k0207O0445k133J9454L4491J5253
5653E9128p814J1707j4390j5622k4365K1411l9658R234O3323l875K0997j6551
5641F3525P563j7406k6178N2483O753j3755l9908q5858K3498J5723k5067k3695
5629f2322l4351j8383J6653m9233n2711J3080J4662K4237M3865j0687j5287L0023
5617a00454J6666M8511K8742J6283P46j2234o379o0758p818L1536p264J64l963
5604e6222m8341l1315L0950K7713L3285R902K630Q851L167K7027j9245l0906J4993
5591b7511P2733P1797L6891l7764k1051o4984r7676j3674M1162m2322k8477J0748
5579a00128O0272l4723k5117j876j2289K4034L2206L3641L399K836m461K219K1957
$$ y = [-105182, -140506, -128954, -77302, -53503, -38467, -48175, -68382, -7937, -10070, 9384, 43875, 59128, 51314, 63021, 48631, 33009, 8644, 30055, -9603, -369, 62954, 59079, 80076, 63525, 71088, 53682, 27504, 79987, 86740, 72985, 33077, -52781, -29283, -13560, -38627, -62322, -96673, -115056, -98403, -147636, -200347, -187267, -172605, -148368, -104503, -115190, -130477, -100454, -83788, -35277, -6535, 9748, 10494, -1740, -8119, -68877, -76695, -45159, -52423, -52259, -56222, -104563, -135878, -104928, -77215, -43930, -34028, -31398, -22547, -19380, 7647, -11598, -42504, -27511, 45222, 117019, 153910, 116146, 95095, 30111, -67565, -81239, -40077, -82399, -110876, -100128, -39856, -74579, -99696, -101572, -113861, -89827, -57621, -23980, -20581, -17745, -22206, -19987, 1970]
5566A970N7705k2406o370O2988L3632l9870J769j2561p8834K7793j5957J864L0943
5553D2666q378p1593J9105j7542m5509j2771L3293L8018j240k7615J8826L7571
5541D831L9361K8288m7690p157n897k9338K3463j2093P342O1729K4986n0941p756
5528B9128m0283k3640M2333K1574J8196j7474j9684J6764k4881l0229j7297k5195
5516g0688M0145J4974m9377j0228l4253L3598L5740M4094J266r592k377j4818
5504b1516J2953k609q373j7203l7385n1263J6802L0466K6247n1129L2441K4242
5492d6327K9761M4776j369j1923N8634L3403l5322r081o2692o6767J6837K2550
5480b7520m8098J4918J897m9567j1777J6544O4389m409R120m5179j5988j0167
$$ y = [1970, 59675, 37269, 30899, 93887, 127519, 87649, 89418, 76857, -1977, 25816, 9859, 11723, 42666, 34288, -37305, -18200, -35742, -81251, -94022, -60729, -22711, -23951, -51566, -32740, 4831, 44192, 72480, 24790, 17633, 11736, -17602, 5861, -6232, 1110, 62839, 87825, 36884, 29128, -11155, -34795, 7538, 29112, 47308, 29834, 10150, 26914, 2033, -28196, -45493, -70688, -30543, -15569, -64946, -75174, -109427, -75829, -40089, 4005, 5271, -4321, -6698, -21516, -8563, -11172, -19545, -36748, -74133, -125396, -108594, -78128, -51881, -103010, -70569, -46327, -16566, 28210, 26841, 14918, 73552, 106955, 71633, 62552, -140, -66907, -50070, -27520, -75618, -60700, -58803, -108370, -120147, -103603, -39214, -43623, -34503, -79682, -95670, -105837]
5468a05837m344P405L190j2284J4359Q3886R725k2644j3602J0163k3189n4890
5456a08062J1049J6587K4155N841l4668J3558M1904M7578n5608j9341p16P9395
5444B1672N0229n9250n52N4139K8107j3769k9125M6964m933n7036m4900l9121
5432d7575L715K2487j9053n6026k8554P025K0895N5004N5831K8004N1670l599
5420H9824M2906L9735n9586p0478k2027M0904J8011l5780Q094k4342l8190j3105
5408b4034l5022q576N0032M6323K191N591q2806N5970Q0451p7995o0281N5278
5396G122l5614k6300r728N0402N0957j0801j1807j2344n1290J172l5088M2509
5384d0810K2780O73j8790L978P2893L009j9667K9178j6346K6525N5601J3324q0742
$$ y = [-105837, -110181, -102776, -99586, -111870, -97511, -13625, -3900, -26544, -40146, -29983, -53172, -108062, -97013, -80426, -56271, -50430, -85098, -71540, -29636, 17942, -37666, -57007, -57723, 21672, 71901, 12651, 12099, 66238, 94345, 80576, 51451, 98415, 93482, 36446, -8454, -47575, -43860, -21373, -40426, -96452, -125006, -117981, -97086, -42082, 13749, 41753, 93423, 89824, 132730, 172465, 112879, 42401, 20374, 61278, 79289, 43509, 51603, 27261, -10929, -24034, -59056, -67632, -17600, 28723, 30914, 36505, -46301, 9669, 90120, 12125, -48156, 7122, -28492, -54792, -64520, -14118, 36839, 26038, 14231, 1887, -49403, -48231, -83319, -40810, -18030, -17357, -36147, -32169, 40724, 43733, 24066, 53244, 36898, 63423, 119024, 132348, 51606]
5371E1606q4921J2940l804q926j748N4414L149k4181R744P6005Q504n4226m0660
5358b104j8970m1512J0814J3204j1314K7562Q330j5175k383l3986k0587L1482
5346e4639r292K2460K8508k710O890j766l0612M5064K7142l7800p942N95N401
5333h701J1829k747m271J3028O888m2330N7110q158p1474k5068M0032K8429O484
5320A051J1296M5632L7339n2501p7054K9592N550m6881j0233M2215L595r2726
5308a03125j5040N1909j3368m3037r422P8951Q8494J0791m9466K3649j148J8823
5296C8011O649m4158o9227m9140j7258M721P1594O4672k6981J5734K7577K6808
5284D9002K3709q3067o9302J6607M8972Q612N4451k4072j8384j2195m2677k7151
$$ y = [51606, -33315, -20375, -24179, -33105, -34853, 19561, 22710, -1471, 8273, 84278, 92782, 38556, -2104, -21074, -62586, -51772, -38568, -49882, -22320, -13990, -29165, -31548, -65534, -86121, -54639, -63931, -41471, -12963, -15673, -8783, -10549, -41161, 3903, 31045, -6755, -14697, -14102, -8701, 3128, 381, -3890, 9138, 16026, -26304, 30806, 22648, -48826, -73894, -33862, -5433, 1051, 12347, 57979, 95318, 42817, -34237, -4645, 905, -45976, -56209, -13994, -10399, -103125, -118165, -66256, -79624, -122661, -132083, -53132, 35362, 46153, -3313, 20336, 19188, 38011, 44660, 502, -68725, -117865, -135123, -130402, -58808, 5864, -21117, -5383, 22194, 49002, 72711, -10356, -79658, -63051, -14079, -5467, 48984, 24912, 6528, -5667, -48344, -75495]
5272g5495j9943P4550L5744j4319m2039l9476L997J9474K5316k7753P2544M6303
5260E8903n243m6185l8632m76k6790M4755k0058M4504n702k2715k3779L167P880
5247c0371j0586k9l754k6744J7757O4608j1706O172l7641n3795k5595J2899J9752
5234g9033L396k0972P5006J7252M623k1698M330j5465J8616j6481K1713K2743
5222A4030l8920o9014M955J8344L6994p340m5253L3116K7495j7396k7853j8439
5210h9281M444J0945J7074N8300M6393n521j5743O727J0190J7646M1342k0018
5198H2498k4764j1538P0673p875m8116J5497J6907J3324k804o3634m8218j4180
5186b2230j2884M7951j3450j9005j8292j5140k1469r793L1470k7251j8223L0019
$$ y = [-75495, -95438, -20888, 14856, 537, -41502, -80978, -76981, -57507, -32191, -59944, 12600, 58903, 53660, 7475, -31157, -31633, -58423, -13668, -33726, 10778, 5076, -17639, -41418, -38251, -30371, -40957, -40986, -44740, -71484, -53727, 10881, -825, 5347, -32294, -86089, -111684, -98785, -79033, -75637, -96609, -21603, -4351, 272, -21426, -17096, -32561, -13945, -30426, -8713, 14030, -24890, -93904, -88949, -70605, -33611, -40951, -86204, -53088, -25593, -42989, -70842, -89281, -84837, -73892, -56818, 1482, 47875, 42354, 26611, 33338, 43528, 61174, 102516, 82498, 57734, 46196, 116869, 108994, 60878, 76375, 93282, 106606, 103802, 40168, -8050, -22230, -35114, 12837, -613, -19618, -37910, -53050, -74519, -84312, -52842, -80093, -98316, -68297]
5174f8297K309j0658j0086m5991M9663P8865j5112m1441N7985K4545m5452k3769
5162d7439L7758k3310M0576K3611O701k2138J9436p9242j4195M6641j7396l8566
5150f7563j2758K4231P1588J4600R692m1417j9541J9370j2859k2920K3941N7321
5138D3685K6986j7285k8040n075m637k7263l0900L0272J0543K9481O913m269J9615
5125E0026l9032J6144m435p478k6475o2807Q5135N3884l1469N909j6145o6341
5113d3084p9846L4513N8123J3475o421L7240N1277K4203o4151j0428q335l9980
5101c3414l5934J1905J8038N1006M1053N0950p2872n0302p3434L255J4001j708
5089g7456O1944Q8603j9524o6926o9993j5952k2387j0343M0231P3887P6735J3568
$$ y = [-68297, -65988, -76646, -86732, -132723, -83060, -4195, -19307, -60748, -2763, 21782, -23670, -47439, -9681, -32991, 7585, 31196, 37897, 15759, 35195, -44047, -58242, -11601, -28997, -67563, -80321, -56090, 15498, 30098, 39790, -1627, -21168, -1798, -14657, -37577, -13636, 43685, 70671, 53386, 25346, 20271, 15634, -11629, -42529, -12257, -1714, 27767, 34680, 30411, 50026, 10994, 27138, 22703, 15225, -11250, -74057, 11078, 64962, 33493, 39402, 23257, -43084, -122930, -88417, -30294, -16819, -23240, 14000, 65277, 89480, 25329, 14901, 6566, -33414, -69348, -57443, -39405, 11601, 52654, 103604, 30732, -19570, -93004, -89749, -75748, -77456, -15512, 73091, 53567, -13359, -83352, -99304, -121691, -132034, -91803, -17916, 58819, 72387]
5077G2387l5579k2435M462q725Q924o4057j9559M6385M6862K7946k162j0634o4475
5064b0660m3170R563K8428J4007J20m0171K1554R514j3980K0608J3717J0996L169
5051A3695k3644O170j4860p81L8843n3156j5833N2226j6264J55K5210n2958j6332
5038e7529J7330q956k3625M1630J6754K6016Q482Q959R875j177K9229K1099K1181
5025A09268q5205n4242j6014j9297O750N9831j3875l1446k568M0615N1053l1205
5013A3665k3302l3868j1177M8680N5315l2004n2020n1416L7417O9197J8883n4107
5001a4737m4276k2001r7q56n4698M3410n722l642L7722L2977P5423Q905l7992
4988A4416L0293m7900o420k9519l8987j8948N7976N4162J3837j2199j5276p060
$$ y = [72387, 36808, 14373, 18835, 10110, 19034, -45023, -64582, -18197, 28665, 56611, 54449, 43815, -20660, -63830, -54267, -25839, -11832, -11712, -51883, -30329, -20815, -34795, -14187, -470, 10526, 13695, -9949, -3779, -18639, -19420, 19423, -33733, -49566, 2660, -13604, -13449, 11761, -41197, -57529, -40199, -49155, -72780, -31150, -14396, 11620, 20102, 29061, 38936, 37759, 66988, 88087, 109268, 24063, -30179, -46193, -65490, -58740, 1091, -12784, -44230, -46798, -6183, 44870, 13665, -9637, -43505, -54682, -6002, 49313, 17309, -34711, -86127, -48710, 20487, 39370, -14737, -59013, -81014, -81111, -81967, -136665, -93255, -98977, -102619, -64897, -31920, 43503, 52408, 14416, 44709, -3191, -9611, -39130, -78117, -97065, -39089, 15073, 28910, 16711, 1435, -5625]
4976e625n832k1000L9467o431k9033m661K3747l8701l5474J544n351N3844m960
4963c8466P0525L7984m2174o7097M04q141l7973P3879J1293l2732j7018l403k4004
4950g6923J4606M3957q65n963n0604K821J292m9811L9546O6876L1252o445j4421
4937d682m685o52N044k9121j7330K7347o533N6158k464l27k288l8438J402j8857
4923c5426j7338J1366j1601l8136p9040J8433M4193Q2379L5649l085m2857l5712
4911g1175N3159K4204J0938n4916j0075L9721Q211p73J2307K8024J5750L2417
4899H7792k9425l5362l8864J4138Q746N0940p533m3031n9143m9035K9709K8084
4887d2984L8670K8198k8051j3036K1029r011l2425L620K1232P701R338j0477l5245
$$ y = [-5625, -11457, -32457, 7010, 579, -28454, -33115, -9368, -48069, -83543, -81999, -87350, -33506, -38466, 32059, 70043, 27869, -39228, -38824, -46965, -84938, -11059, 234, -32498, -49516, -52919, -76923, -62317, -18360, -19225, -25188, -75792, -72971, -71679, -121490, -81944, -15068, 16184, 9739, -4682, -9367, -10019, -4975, -34096, -51426, -24079, -30612, 25546, 23082, 22755, 20467, -17971, -16569, -35426, -52764, -41398, -52999, -91135, -170175, -151742, -107549, -25170, 10479, 7394, -35463, -71175, -18016, 6188, 17126, -37790, -47865, -8144, 67, -706, 11601, 39625, 55375, 87792, 58367, 23005, -15859, -1721, 7025, 57965, 50432, 7401, -51742, -100777, -71068, -42984, -4314, 23884, -4167, -17203, 3826, -5185, -37610, -33990, -12758, -5057, 4281, -6196, -41441]
4874d1441q741K0390M501L2437M9380j0387m813J2683n3525l9994L7402P7983
4862G5875m4067m1461r323L2754L6961L6510p022l7794n6217r1850K663L6212
4850f6759K9403l5J5223o6744J2357N5035L6137J8856K8536m049j8337k0312n8096
4837c8785j0280O85q486J66m4186M2840J2683j5612l2580L6253O9040L1110k1484
4824B1364l1776J5467J5217J873J2504k1960J2947L4688m164J3171J58l0423R301
4811D8367k5079m3932K5812K2326p2453K9921L5757l1488K605K2042N0722J2810
4799G7410n0665K641J3760r547L6083J3169J8339q2403o6251K2262k0582l5679
4787h1463L9715O764J8243k7537j9580L181P4366Q1852N8797l4910k5000L225
$$ y = [-41441, -50182, -29792, -25291, 7146, 56526, 46139, 41326, 54009, 484, -39510, -2108, 75875, 31808, -9653, -18976, 13778, 50739, 87249, 80227, 42433, -13784, -105634, -102971, -66759, -37356, -37391, -22168, -88912, -76555, -21520, 14617, 33473, 62009, 57960, 39623, 19311, -38785, -49065, -48380, -56866, -56700, -100886, -58046, -45363, -60975, -93555, -57302, 11738, 42848, 21364, -10412, 5055, 20272, 22145, 34649, 12689, 25636, 60324, 56160, 69331, 69489, 39066, 48367, 23288, -20644, 5168, 27494, -44959, -15038, 20719, -10769, -8164, 13878, 64600, 77410, 26745, 29386, 43146, 33599, 69682, 82851, 101190, 18787, -47464, -25202, -45784, -81463, -41748, -34984, -16741, -44278, -63858, -60677, 13689, 95541, 154338, 119428, 94428, 97653]
4775I7653q021P607o5813o965j3557k5037n4634M3591M2379l5677J0736M1475
4763C3737J3879L2109l7205n4164j228L8901K429r02N6170j2105l5326j0279o11
4750B5405k5921K2846K3367J0116j7787K806o6744q2819J452L5532P878J3056
4738e0813L1736N0946K4005L4963J941j4252m7670j9104R236L1444j9961L5195
4726F7666j320n833l4579p604R177L4245N965l6399n6704j0625N1504M4169o2898
4713c236J1318K1660K6042L2143k644j6419l6946l8483n7335j44N4183K9467o7761
4700d8155m5208M3917K2603k2607j2582J7410n6914p046k9820K0564Q2457M1076
4688E695K0139l0324K7562K5667q4586j9674L7098J089L3949K9737Q4K677k468
$$ y = [97653, 89632, 97239, 31426, 24461, 10904, -14133, -68767, -25176, 17203, -18474, -7738, 33737, 47616, 79725, 42520, -11644, -12872, 26029, 28458, 27556, 83726, 71621, 36295, 26016, 25405, -516, 22330, 45697, 55813, 38026, 40832, -25912, -108731, -107279, -71747, -63869, -50813, -19077, 31869, 55874, 90837, 92778, 78526, 30856, 11752, 20988, 52432, 32471, 67666, 66346, 60513, 25934, 18330, 27507, 61752, 67717, 31318, -25386, -36011, 15493, 59662, -3236, 8082, 29742, 55784, 87927, 85283, 68864, 31918, -6565, -63900, -64044, -9861, 19606, -48155, -93363, -49446, -26843, -49450, -62032, -44622, -101536, -108582, -138402, -117838, -35381, 5695, 25834, -4490, 23072, 48739, -35847, -55521, -18423, -17334, 16615, 46352, 46436, 49113, 46645]
4675D6645m2386p5792l7235j7089J8994K2799L6231N0068R526j6426k419n0260
4663e7344K1471j3481N493L5964K3617k7446m9445r650J10820k352J9771J4394
4651G1812n2186l4462J3098M2043N9062j5994l7503l0725K5966k0856k7038n231
4639a2014l9692j2940J1403R188Q244P089Q787M1776J106l7874l4063j1555m1881
4626a02426p055R016M0913M3836O4845q876l4685k2068L4705n6292n8505m1559
4614a38151k6452N859N4618O6854J3207K3001l0290L0125l633j4780r945k818
4602c2405Q94o297M8472L0411l4045m5476k3416k0106L3367M2477N593K608j9836
4589a7759l12O0865k026k2633m4202o9727k0554K331J6553K4951O873K4374K88
$$ y = [46645, 4259, -71533, -108768, -125857, -106863, -84064, -47833, 2235, 11761, -4665, -7084, -57344, -35873, -49354, -43861, -7897, 15720, -11726, -61171, -70821, 39999, 37647, 57418, 71812, 19626, -14836, -1738, 40305, 99367, 83373, 45870, 15145, 41111, 20255, -6783, -12014, -51706, -64646, -53243, -44055, -35811, -28722, -19935, 21841, 22947, -14927, -48990, -60545, -102426, -109481, -100465, -59552, -15716, 49129, 40253, 5568, -16500, 18205, -38087, -96592, -138151, -164603, -158744, -104126, -37272, -24065, -1064, -31354, -1229, -4862, -19642, -29587, -32405, -31511, -37808, 10664, 41075, 7030, -38446, -61862, -81968, -48601, -6124, -531, 2077, -17759, -18071, 42794, 40768, 18135, -26067, -95794, -116348, -114017, -97464, -72513, -65640, -41266, -40978]
4576d0978M9691m512k6081j0275J829L3640M7758K378j4420P749n293q4912l2796
4563g6222M65m751P4955L7269K572J9160p6562l9631j6029L341J9297M6039M7065
4550C6968J3572j977j771j5387q55M2150n6896n873j8047k3464L0460k674j5133
4537a8927K3201j9558k9898M5476O5810k9813L4073p643l5311k5153K5877q913
4525A9221K6196k3425O504m5003l0330M8774J0318L2341J4098J6477j967j3969
4513E9235m1879k4961K1764l7109j1883j7567n3761l409N8433R282L5259o997
4501a3593l1200O296j6135j6131M2347J9652L5633L2729P705k6696L6144O074
4489H2825r485o2958k2543l160o5108l1658J7039N9974j3168J4114p980k0099
$$ y = [-40978, 8713, 4201, -21880, -32155, -30326, 3314, 51072, 53450, 39030, 46779, 41486, -43426, -76222, -75757, -80508, -5553, 31716, 34288, 53448, -23114, -62745, -78774, -75433, -56136, -10097, 36968, 50540, 48563, 46792, 31405, 30550, 72700, 15804, 9931, -8116, -31580, -1120, -3794, -18927, 4274, -15284, -45182, 294, 66104, 36291, 70364, 62721, 27410, 2257, 28134, 19221, 45417, 21992, 28496, -16507, -46837, 1937, 12255, 44596, 58694, 75171, 73204, 59235, 17356, -7605, 14159, -22950, -34833, -52400, -106161, -109570, -51137, -41855, -6596, -13593, -44793, -38497, -54632, -70763, -28416, -8764, 26869, 59598, 67303, 40607, 76751, 82825, 73340, 10382, -12161, -15321, -80429, -112087, -95048, -35074, -48242, -34128, -42108, -62207]
4477f2207K3104J7020P5192j2015k8437J0991J8883l7976o0530M2582K9582r4367
4465g8178r589Q0339Q4337k977r542j7729L3693J5769J5806m7302n7544K7659
4453C4742Q2748l542n9683N898L2106l5976n7486l0752l606L9106J1677l9063
4441b3831J1175M4370r0741m6697M2607L0563l2490n134J5930O78J9314k0189
4429e4445L3029N8923m0392K591L2029l6087j87J2012N977l8384p278n679m946
4416d2837N9056O760p477J4851k3028K833L2256M4661K503m9087k5777k0175K6573
4403B1112k884M0208l227J6952l001J9720j2378j9547J868L3393n120q9537n3514
4390e5955j9855M3338L9133N6847J1413m2158j9143m0417Q427K1469K0589K0674
$$ y = [-62207, -39103, -22083, 53109, 41094, 12657, 23648, 42531, 4555, -55975, -13393, 16189, -78178, -87767, -7428, 76909, 73932, 64390, 46661, 80354, 96123, 111929, 64627, 7083, 34742, 117490, 113948, 54265, 60163, 92269, 56293, -1193, -31945, -35551, 3555, 15232, -23831, -12656, 31714, -59027, -105724, -63117, -32554, -65044, -70178, -54248, -53570, -34256, -54445, -21416, 37507, -2885, -294, 31735, -4352, -4539, 7473, 13450, -24934, -32212, -37891, -42837, 16219, 22979, 15502, 30353, 7325, 10158, 42414, 87075, 89578, 40491, 14714, -5461, 21112, 18228, 58436, 55209, 72161, 69160, 88880, 76502, 56955, 58823, 92216, 87096, -2441, -55955, -75810, -32472, 6661, 63508, 74921, 32763, 13620, -26797, -18370, 3099, 23688, 44362]
4378D4362j965K5407o3473p6941m7127O3872M5062K9751L486O9633J4325j9777
4366H6615o0958k6387l4660L9942J4091Q479J3348N772m2592n8090k4090l896
4354h2426J1959O1429j4609R211L6494N3059o679m8378L607N8911k2068k7047
4342C3463O0657K6999k8820k4290m9012J5143L7618J2642j7733k4689p555L2216
4330F6639n5188K1234O5525r0012n2385l0911m6774L7858N8530N6487K0176l0255
4318B0924m396q1991J1595O9472N516m2895J1187M0658l3368n397M5356L8023
4306G4684j5625L2897l1337n6462m9567j8531j211K9337J4551J0165M629P1376
4294F4906n3584n2152J8862k3274j28029P662L7629j9218j131J1052J0576M6232
$$ y = [44362, 42397, 67804, 4331, -72610, -119737, -55865, -10803, 18948, 22434, 92067, 106392, 86615, 25657, -730, -35390, 4552, 18643, 27122, 40470, 46242, 3650, -54440, -78530, -82426, -70467, -9038, -23647, -14436, 22058, 75117, 68438, 20060, 23667, 82578, 60510, 33463, 94120, 121119, 92299, 68009, 18997, 34140, 71758, 84400, 66667, 41978, 34423, 66639, 11451, 32685, 98210, 8198, -44187, -75098, -121872, -84014, -25484, 31003, 51179, 20924, 16528, -65463, -53868, 15604, 21120, -21775, -10588, 30070, -3298, -8695, 36661, 74684, 59059, 91956, 60619, 4157, -45410, -63941, -65152, -35815, -21264, -11099, -6470, 64906, 11322, -40830, -21968, -45242, -173271, -165609, -127980, -147198, -148329, -137277, -126701, -80469]
4282h0469M5089J5406j9867L8160K8453m1863L181j6621K4463o300O6639q356
4270D7915k0659K8082K9329m0920r0175m1069j5230L7819N3052K4417j4119k3734
4258b5292N6447j7524M6398K468l2864k1690j6164K261j9836K9416o633k1147
4246b4160r920L1313R964J8494N6340j0570r0631l9519N9436K8618j2800M484
4234B1049K4422L3748N3670m7023l3786k3010j7089r3561l3814O3948l2867p6036
4222a60349r941M3006L1938J1102L5661K3319K8802P09j6054L1944k8027k6264
4210c4154k3223P21j2839N2021J0101J3168J1817P01o3205K4826L5385Q6341p999
4197I3661p0186J1733j8209r088n54k9200l4471j6053L1576j003q834J5302K3710
$$ y = [-80469, -35380, -19974, -39841, -1681, 26772, -15091, -11910, -28531, -4068, -10368, 56271, 47915, 27256, 55338, 84667, 43747, -46428, -87497, -102727, -64908, -11856, 12561, -1558, -25292, 31155, 13631, 60029, 62497, 29633, 7943, -8221, -5960, -25796, 3620, -3013, -24160, -34080, -2767, 7197, 25691, 82031, 71461, -19170, -58689, 747, 29365, 16565, 21049, 45471, 79219, 132889, 85866, 52080, 29070, 11981, -81580, -115394, -51446, -84313, -160349, -170290, -127284, -95346, -84244, -48583, -25264, 3538, 4247, -11807, 20137, -7890, -34154, -57377, -56656, -69495, -17474, -7373, 5795, 17612, 18313, -44892, -20066, 15319, 101660, 93661, 23475, 35208, 16999, 7911, 7357, -21843, -56314, -72367, -40791, -41794, -50628, -35326, -11616]
$$ [...]
##END NTUPLES=NMR SPECTRUM
##END=
