##TITLE=Analysis number 328923
Compound Code ac 34443
Project Code adrs
Chemist Name frontier sci
##JCAMPDX= 6.0         $$ Bruker NMR JCAMP-DX V2.0
##DATA TYPE= NMR SPECTRUM
##DATA CLASS= NTUPLES
##ORIGIN= Bruker BioSpin GmbH
##OWNER= nmr
$$ XWIN-NMR		Version 3.5
$$ Tue Jul 17 09:14:27 2007 GMT Daylight Time (UT+1h)  MAYBRIDGE\nmr@NMR_250MHZ
##.OBSERVE FREQUENCY= 250.131544655141
##.OBSERVE NUCLEUS= ^1H
##.ACQUISITION MODE= SIMULTANEOUS (DQD)
##.ACQUISITION SCHEME= undefined
##.AVERAGES= 16
##.DIGITISER RES= 18
##SPECTROMETER/DATA SYSTEM= dpx250
##.PULSE SEQUENCE= zg30
##.SOLVENT NAME= DMSO
##.SHIFT REFERENCE= (INTERNAL, DMSO, 0, 16.522)
##AUDIT TRAIL= $$ (NUMBER, WHEN, WHO, WHERE, WHAT)
$$ ##TITLE= Audit trail, XWIN-NMR		Version 3.5
$$ ##JCAMPDX= 5.01
$$ ##ORIGIN= Bruker BioSpin GmbH
$$ ##OWNER= nmr
$$ C:\u/data/dgb/nmr/ADRS/1060/pdata/1/auditp.txt
$$ ##AUDIT TRAIL=  $$ (NUMBER, WHEN, WHO, WHERE, WHAT)
(   1,<2007-07-17 09:14:07.06 +100>,<MAYBRIDGE\nmr>,<NMR_250MHZ>,
      <created by zg, POWCHK disabled, PULCHK disabled
       configuration hash MD5:
       76 6E 9A 78 1E 09 19 81 EC 84 63 8F B0 6A 59 2D
       data hash MD5: 64K
       FD EE 73 3C 8F 1A 04 B3 4B 47 60 3A 7D 48 EF 38>)
(   2,<2007-07-17 09:14:19.23 +100>,<MAYBRIDGE\nmr>,<NMR_250MHZ>,
      <Start of raw data processing
       ef LB = 0.3 FT_mod = 6 PKNL = 1 SI = 32K 
       data hash MD5: 32K
       B1 D7 E0 33 98 A0 AC C3 DE 59 F8 1A 3D 48 D6 17>)
(   3,<2007-07-17 09:14:20.87 +100>,<MAYBRIDGE\nmr>,<NMR_250MHZ>,
      <apk 
       data hash MD5: 32K
       EC E1 80 35 B7 01 A0 F5 07 89 2D 60 AB 60 BE 6A>)
(   4,<2007-07-17 09:14:21.67 +100>,<MAYBRIDGE\nmr>,<NMR_250MHZ>,
      <abs ABSG = 5 
       data hash MD5: 32K
       7A B0 39 C6 35 35 35 79 EC 09 3F 4F 3C A5 FF 74>)
$$ ##END=
$$ 
$$ hash MD5
$$ 4E 6D CC C0 85 CE 88 14 2E F4 28 C4 4A C7 EC 83
##$RELAX= 
##$RELAX= 
##$RELAX= 
##$RELAX= 
##$RELAX= 
##$RELAX= 
##$RELAX= 
$$ Bruker specific parameters
$$ --------------------------
##$DU= <C:\u>
##$EXPNO= 1060
##$NAME= <ADRS>
##$PROCNO= 1
##$TYPE= <nmr>
##$USER= <dgb>
##$AMP= (0..31)
100 100 100 100 100 100 100 100 100 100 100 100 100 100 100 100 100 100 
100 100 100 100 100 100 100 100 100 100 100 100 100 100 
##$AQSEQ= 0
##$AQ_mod= 3
##$AUNM= <au_zg>
##$AUTOPOS= <4 >
##$BF1= 250.13
##$BF2= 250.13
##$BF3= 250.13
##$BF4= 250.13
##$BF5= 500.13
##$BF6= 500.13
##$BF7= 500.13
##$BF8= 500.13
##$BYTORDA= 1
##$CFDGTYP= 0
##$CFRGTYP= 5
##$CHEMSTR= <none>
##$CNST= (0..31)
1 1 145 1 1 1 1 1 1 1 1 1 1 1 1 1 1 1 1 1 1 1 1 1 1 1 1 1 1 1 1 1 
##$CPDPRG= <>
##$CPDPRG1= <>
##$CPDPRG2= <>
##$CPDPRG3= <>
##$CPDPRG4= <mlev>
##$CPDPRG5= <mlev>
##$CPDPRG6= <mlev>
##$CPDPRG7= <mlev>
##$CPDPRG8= <mlev>
##$CPDPRGB= <>
##$CPDPRGT= <>
##$D= (0..31)
0 1 0 0 0 0 0 0 0 0.06 0 0 0 0 0 0 0.0002 0 0 0 0 0 0 0 0 0 0 0 0 0 0 
0 
##$DATE= 1184660046
##$DBL= (0..7)
120 120 120 120 120 120 120 120 
##$DBP= (0..7)
150 150 150 150 150 150 150 150 
##$DBP07= 0
##$DBPNAM0= <>
##$DBPNAM1= <>
##$DBPNAM2= <>
$$ [...]
##$SUBNAM7= <"">
##$SUBNAM8= <"">
##$SUBNAM9= <"">
##$SW= 20.6930455092707
##$SWIBOX= (0..15)
0 0 3 0 0 0 0 0 0 0 0 0 0 0 0 0 
##$SW_h= 5175.983436853
##$TD= 65536
##$TD0= 1
##$TE= 296.16
##$TE2= 300
##$TE3= 300
##$TEG= 300
##$TL= (0..7)
0 120 120 120 120 120 120 120 
##$TP= (0..7)
150 150 150 150 150 150 150 150 
##$TP07= 0
##$TPNAME0= <>
##$TPNAME1= <>
##$TPNAME2= <>
##$TPNAME3= <>
##$TPNAME4= <>
##$TPNAME5= <>
##$TPNAME6= <>
##$TPNAME7= <>
##$TPOAL= (0..7)
0.5 0.5 0.5 0.5 0.5 0.5 0.5 0.5 
##$TPOFFS= (0..7)
0 0 0 0 0 0 0 0 
##$TUNHIN= 0
##$TUNHOUT= 0
##$TUNXOUT= 0
##$USERA1= <user>
##$USERA2= <user>
##$USERA3= <user>
##$USERA4= <user>
##$USERA5= <user>
##$V9= 5
##$VALIST= <valist>
##$VCLIST= <CCCCCCCCCCCCCCC>
##$VD= 0
##$VDLIST= <DDDDDDDDDDDDDDD>
##$VPLIST= <PPPPPPPPPPPPPPP>
##$VTLIST= <TTTTTTTTTTTTTTT>
##$WBST= 1024
##$WBSW= 4
##$XGAIN= (0..3)
0 0 0 0 
##$XL= 0
##$YL= 0
##$YMAX_a= 365061
##$YMIN_a= -331592
##$ZGOPTNS= <>
##$ZL1= 120
##$ZL2= 120
##$ZL3= 120
##$ZL4= 120
##$ABSF1= 16.522
##$ABSF2= -4.171173
##$ABSG= 5
##$ABSL= 3
##$ALPHA= 0
##$AQORDER= 0
##$ASSFAC= 0
##$ASSFACI= 0
##$ASSFACX= 0
##$ASSWID= 0
##$AUNMP= <proc_1d>
##$AZFE= 0.1
##$AZFW= 0.1
##$BCFW= 0
##$BC_mod= 0
##$BYTORDP= 0
##$COROFFS= 0
##$CY= 12.5
##$DATMOD= 1
##$DC= 0
##$DFILT= <>
##$DTYPP= 0
##$F1P= 14.0000005364418
##$F2P= -0.99999901652339
##$FCOR= 0.5
##$FTSIZE= 32768
##$FT_mod= 6
##$GAMMA= 0
##$GB= 0
##$INTBC= 1
##$INTSCL= 1
##$ISEN= 128
##$LB= 0.3
##$LEV0= 0
##$LPBIN= 0
##$MAXI= 10000
##$MC2= 0
##$MEAN= 0
##$ME_mod= 0
##$MI= 0
##$NCOEF= 0
##$NC_proc= -4
##$NLEV= 6
##$NOISF1= 0
##$NOISF2= 0
##$NSP= 0
##$NTH_PI= 0
##$NZP= 0
##$OFFSET= 16.522
##$PC= 1
##$PHC0= -62.49886
##$PHC1= 9.215569
##$PH_mod= 1
##$PKNL= yes
##$PPARMOD= 0
##$PSCAL= 4
##$PSIGN= 0
##$REVERSE= no
##$SF= 250.13
##$SI= 32768
##$SIGF1= 0
##$SIGF2= 0
##$SINO= 400
##$SIOLD= 32768
##$SREGLST= <1H.DMSO>
##$SSB= 0
##$STSI= 32768
##$STSR= 0
##$SW_p= 5175.98343685301
##$SYMM= 0
##$S_DEV= 0
##$TDeff= 65536
##$TDoff= 0
##$TI= <Analysis number 999999
Compound Code 99
Book Reference 9
Project Code 9>
##$TILT= no
##$TM1= 0
##$TM2= 0
##$TOPLEV= 0
##$USERP1= <user>
##$USERP2= <user>
##$USERP3= <user>
##$USERP4= <user>
##$USERP5= <user>
##$WDW= 1
##$XDIM= 32768
##$YMAX_p= 368088242
##$YMIN_p= -256842
$$ End of Bruker specific parameters
$$ ---------------------------------
##NTUPLES= NMR SPECTRUM
##VAR_NAME=  FREQUENCY,     SPECTRUM/REAL,   SPECTRUM/IMAG
##SYMBOL=    X,             R,               I
##VAR_TYPE=  INDEPENDENT,   DEPENDENT,       DEPENDENT
##VAR_FORM=  AFFN,          ASDF,            ASDF
##VAR_DIM=   32768,         32768,           32768
##UNITS=     HZ,            ARBITRARY UNITS, ARBITRARY UNITS
##FACTOR=    0.157963299565203, 1,           1
##FIRST=     4132.6476996994, 0,             0
##LAST=      -1043.33573715361, 0,           0
##MIN=       -1043.33573715361, -256842,     0
##MAX=       4132.6476996994, 368088242,     0
$$ Real data points
##PAGE= N=1
##DATA TABLE= (X++(R..R)), XYDATA
$$ [...]
20731 -16341 -14968 -5689 252 26932 36588 41464 21832 33313 74793 51391 23303 17047 31048
20718 31048 43071 31894 24568 47247 56272 37189 6265 -26599 -12972 6878 -10937 -26148
20706 -26148 -16772 -6334 29882 45209 58279 32494 41409 51090 47827 36646 22460 12777 11061
20693 11061 -3691 -6374 3989 -2622 -17092 -2628 -1133 6330 20709 5507 4016 25116 25541
20680 25541 11817 27989 60790 74964 65786 67502 56888 34168 30702 41625 44613 68937
20668 68937 73237 69817 59704 52471 63053 67866 62464 58368 58490 80277 79490 88748 87953 69855
20654 69855 50966 57126 46425 18408 -8694 -3144 -17149 -11030 25206 54002 61243 23260
20642 23260 3656 4865 3224 -16810 -18826 30941 66541 47928 37495 55628 50290 49418 62490
20629 62490 52679 56715 70703 47722 45525 45629 49310 63270 46094 53062 68309 53111 73078
20616 73078 79435 44222 45112 35153 23957 48544 25715 21893 61363 94475 101881 114022 105816
20603 105816 90790 105688 111404 117002 116763 90291 92324 108264 98103 89403 86414 86002 82139
20590 82139 105283 114692 104847 88763 74532 63282 75963 89116 53518 44651 57088 65353
20578 65353 70626 43254 33443 52357 69599 54116 48252 73004 65802 48393 38787 9894 -5397
20565 -5397 -16479 8163 46275 52321 15382 15649 9542 8719 32386 43545 46569 58049 64519
20552 64519 68071 61153 68763 49387 61211 61359 58006 22394 38571 61226 95379 106528 66154
20539 66154 38953 44675 67339 80346 79319 66179 88266 55062 18320 6122 37693 52518
20527 52518 41429 3512 7185 20557 28537 41744 37882 24917 29504 29446 30929 -4787 -13497
20514 -13497 50124 78594 64681 30130 -4148 -9521 -9320 -145 11484 18060 18812 17645 25402
20501 25402 24887 30044 48606 32184 19316 21802 3535 27417 44189 46348 82618 90942 68780
20488 68780 36384 7868 9827 -1915 904 -18391 -21053 -9625 6939 11969 11946 33619 40824
20475 40824 46589 57677 45521 54402 42370 43482 63485 86492 64095 36166 29675 16658
20463 16658 3514 21033 18254 4319 -477 886 10160 27469 29557 13737 25551 42361 37005
20450 37005 38881 34462 27211 44351 58800 67259 57524 47841 38233 10217 -18301 -400 35214
20437 35214 56023 66552 58954 35097 25852 35342 42740 26927 -12535 -10307 21915 33367 21631
20424 21631 15983 31174 45846 51009 38468 24466 43899 55294 52498 24813 36127 42032
20412 42032 20127 17006 26806 30330 46401 23573 -6257 6794 9850 25132 44882 40181 43100
20399 43100 35838 31118 30664 30605 49403 72431 73176 52201 32791 24903 29681 25795 16617 1611
20385 1611 11799 33427 24515 16926 22013 30918 10955 23970 34300 41449 40534 27450 48613
20372 48613 41404 34734 33640 24299 35832 33742 31685 21127 51325 64689 38313 -3525 -1011
20359 -1011 12309 14382 4732 16825 39301 71646 96309 83659 50974 25728 32897 50476
20347 50476 51692 23797 -13141 -19285 -8688 33118 48024 17151 7961 23850 17619 18701 64488
20334 64488 76856 56203 44452 48338 35030 44074 28527 2769 -9749 -30009 -10212 -9307
20322 -9307 15291 44603 48540 39999 31632 30000 9497 959 28183 49100 64960 79004 62236
20309 62236 49857 48499 55615 31753 10833 -12402 -1264 21326 23784 7866 8562 5419 9839
20296 9839 10483 22745 35110 174 14555 3422 -23300 -7232 29424 37883 61668 54381 48291
20283 48291 23093 -1494 -3741 -11981 -22212 -17294 -7756 14196 34881 17461 7110 34265
20271 34265 72231 70296 48658 26121 29583 35975 49291 48834 46841 46920 48359 42348 43397 32764
20257 32764 29880 28927 26776 9889 6851 35076 31716 66984 79847 43154 47028 48619 58764
20244 58764 56388 46882 35335 22971 26828 30076 39830 40914 21682 -4487 6791 38169 57096
20231 57096 54636 47765 93376 90165 72556 50390 45291 52035 40951 27679 59058 86004 70119
20218 70119 61890 56495 66607 58873 63560 61324 44714 46622 66647 71961 52215 32821 62272
20205 62272 82971 59894 39943 37458 41014 45109 32129 35494 57580 63907 77185 85188 97415
20192 97415 79010 81805 51581 77669 91262 81842 73949 49067 35417 45888 15224 23707
20180 23707 32305 71536 103680 81502 69119 63829 32129 19502 26224 49501 68076 90173
20168 90173 78139 51304 35084 39064 61207 70582 81237 86292 56682 31520 48302 65285
20156 65285 57242 61939 80535 90918 79040 36890 26065 48588 54495 52881 48415 56987 62376
20143 62376 41151 49876 58816 64686 65279 87330 98648 83018 74768 56994 27672 30378 40655
20130 40655 60040 70903 88597 67620 40557 52609 63352 68670 65127 62403 85805 85727 49431
20117 49431 36357 63682 65379 33729 27892 34636 45291 46013 47674 63019 86590 81484 78271
20104 78271 85628 71481 29294 13528 35339 58229 59904 105967 125803 121900 119784 111169 91409
20091 91409 82804 85551 63564 62674 73829 95620 115232 100859 91085 77307 90020 95236 77616
20078 77616 54402 42950 69896 100239 88267 74601 97830 115983 106932 116513 105215 101435
20066 101435 92094 97225 93666 69052 63037 76164 87367 95731 84511 70979 73012 82580 84414
20053 84414 83511 68341 94571 115682 109292 96568 100807 75467 80647 95243 77948 63176 98284
20040 98284 127195 103980 84416 86262 77185 71684 63593 49170 84702 77024 49023 42210 64022
20027 64022 58752 63889 76970 89241 78792 81203 53779 56770 71052 77799 79010 72545 89681
20014 89681 111358 114346 102217 74363 70315 71107 51412 64625 85494 92688 75966 69269 89667
20001 89667 102242 135464 137986 111646 95837 86509 85957 99218 113989 113850 108211 101593 95754
19988 95754 95635 94245 80618 56862 57035 104677 129233 138543 158521 130635 107600 111005 115170
19975 115170 93342 95339 101422 118797 165966 152722 146142 134787 96364 109545 127238 123476
19963 123476 121162 135814 167230 177517 165314 165915 179105 168907 167304 181078 167446 154318
19951 154318 113321 121444 105693 106733 109343 99996 121329 125424 130593 153754 136152 121215 127062
19938 127062 118558 123953 131811 119423 113751 130181 124133 123977 150819 138048 82369 85803 103842
19925 103842 90056 98225 109860 106357 127927 125346 111635 115077 122056 125914 147331 158064 137815
19912 137815 117731 127279 128640 151209 155537 163470 176440 172611 183989 192615 202951 178850 168214
19899 168214 155796 138417 115019 94282 105073 135696 122346 103696 115212 139029 114128
19888 114128 116633 112506 130241 162183 154049 177664 180417 157676 149611 164459 167896 164215 131930
19875 131930 115070 127565 151086 140114 152252 175838 167962 145967 136923 117223 118080 157573
19863 157573 168902 151917 147396 140077 147688 157647 176704 167530 152849 150406 150508 140357 135056
19850 135056 150078 178164 166965 162648 182661 197584 187387 182290 176858 189636 188258 173871
19838 173871 174331 189246 202902 198500 174104 147014 148227 169164 167497 136356 137679 174953 185253
19825 185253 168379 160078 172352 168560 173223 168546 162847 182630 187460 170717 159390 153358 158898
19812 158898 166771 198102 190159 181277 169936 168727 164781 152564 156549 171594 182260 176462 202496
19799 202496 232640 231877 194323 165397 204354 215052 223539 216139 195362 169666 203127 226661
19787 226661 195626 178504 178642 191877 193847 217812 222384 205354 212880 212136 196877 189608 185731
19774 185731 207018 242976 247384 236210 256600 253584 255318 267906 272157 294763 275962 273703
19762 273703 251405 220344 217662 230545 229668 239898 225329 206206 194970 212233 226525 221293
19750 221293 182965 190531 223208 223526 234552 247022 251883 262644 297309 271000 235695 259243
19738 259243 284411 282936 284387 282482 276971 255128 225848 259083 241771 220863 208864 197527
19726 197527 205585 238681 258703 270309 260925 239609 256531 264835 261957 273601 269977 261983 259002
19713 259002 241340 226319 241505 257072 271292 280606 266910 226529 213143 223314 224095 245674
19701 245674 273764 297586 295346 281098 270219 268090 292062 284404 310299 312512 295465 278479
19689 278479 294861 320302 325191 332679 314967 278752 237856 232148 249522 282420 292443 286728
19677 286728 301834 298156 301661 306398 288031 275985 272575 263678 296666 319522 326271 325761 328367
19664 328367 343128 342794 346044 345912 342404 349272 353147 335322 342853 328680 307720 318752 327166
19651 327166 318636 331794 354577 366062 353779 359671 342066 354117 375858 378438 378290 377444 363116
19638 363116 365838 397594 408920 389053 387332 404302 414682 413534 387525 389923 367181 360388
19626 360388 385770 387313 387986 384600 409909 436869 417814 407836 406066 414264 400368 383336 394979
19613 394979 417340 421862 435295 435425 431868 433428 436963 436985 452020 449366 450517 440429 429992 428790
19599 428790 436438 445738 460557 467554 456198 446976 435252 437792 435697 420685 441602 446548 468837
19586 468837 497111 475252 452873 448800 466037 450025 437486 455777 474002 490736 475506 505376
19574 505376 526837 517820 495263 513550 536262 526694 531185 523533 515883 527472 552755 550828 541306
19561 541306 529119 540765 561343 578922 573824 558376 538610 522074 531187 516056 506809 528153
19549 528153 552028 557601 562647 579136 575912 578778 570860 613303 620802 592842 569161 584385 611784
19536 611784 603016 603310 608714 614899 627606 626659 611332 611500 616113 644548 677121 662253 658483 661194
19522 661194 660962 662949 666980 679109 662081 673486 680727 703396 699138 691933 673241 670780 709783
19509 709783 749570 764963 767026 754122 735476 711093 699205 721782 743684 760658 745502 712226
19497 712226 733811 749366 725101 718376 731511 753959 745242 762420 789138 788524 796244 791461 790378
19484 790378 782675 766357 756110 761210 783105 793865 801478 793907 812681 818973 824294 852472 891260
19471 891260 890901 865288 841060 826072 815519 842006 861359 867199 869054 851412 858603 881243
19459 881243 905229 924842 937622 945987 951354 935857 944431 974864 1033356 1043633 1041272 1014883
19447 1014883 1028821 1037668 1023151 1028650 1046868 1057070 1073470 1073828 1047876 1029347 1032818 1052285
19435 1052285 1059565 1104908 1118013 1133103 1140102 1163760 1141835 1126647 1116210 1123310 1152204 1142267
19423 1142267 1124628 1131711 1135889 1138409 1169656 1185039 1161942 1139226 1153939 1179189 1220396 1224449
19411 1224449 1206011 1215216 1247805 1218898 1196192 1192843 1223714 1246107 1253157 1249217 1270192 1301610
19399 1301610 1334216 1357525 1379562 1381887 1376962 1391377 1416593 1393242 1376292 1394663 1394327 1375211
19387 1375211 1382132 1425887 1444845 1424115 1423070 1413006 1393420 1377405 1384180 1377894 1403504 1449996
19375 1449996 1463858 1447209 1435734 1455775 1480798 1491651 1500692 1525052 1555702 1559271 1542197 1558465
19363 1558465 1564477 1544309 1564293 1564321 1593655 1595982 1591351 1619038 1648127 1641627 1637415 1633257 1677352
19350 1677352 1703093 1695898 1689973 1706203 1726760 1748277 1774370 1775699 1765732 1742287 1752518 1774786
19338 1774786 1764162 1761661 1790536 1842239 1850945 1854239 1880624 1892755 1897472 1938977 1984058 1999413
19326 1999413 1965022 1996113 2035789 2059244 2093268 2108648 2135464 2165789 2194633 2208880 2248610
19315 2248610 2264493 2286288 2303265 2304173 2275975 2274962 2310481 2349065 2380865 2388922 2403585 2424634
19303 2424634 2435247 2456163 2463849 2450115 2432612 2432644 2437810 2448483 2445826 2440820 2457900 2483022 2468251
19290 2468251 2457452 2457246 2474331 2498783 2525658 2532494 2543388 2576969 2587131 2583986 2600667 2649860
19278 2649860 2692681 2691029 2704598 2756752 2786686 2809276 2823112 2834298 2838449 2860477 2885692 2920896
19266 2920896 2978609 3017322 3062975 3111008 3139733 3162461 3145441 3135926 3147996 3153188 3164322 3168019
19254 3168019 3164260 3173236 3167151 3161327 3164653 3157993 3155695 3177659 3191255 3186637 3173469 3167459 3166345
19241 3166345 3188477 3205935 3245083 3256630 3259195 3288573 3300226 3309983 3299854 3290123 3288720 3311956
19229 3311956 3360318 3382880 3365843 3380668 3403301 3414531 3420407 3448478 3466504 3485244 3514021
19218 3514021 3533642 3549748 3553429 3528393 3515590 3531540 3539617 3576999 3595753 3624505 3637092 3646635
19206 3646635 3648763 3677190 3686885 3690557 3701554 3739525 3769828 3776095 3791250 3784716 3794661 3813403
19194 3813403 3837259 3841217 3822938 3812850 3841440 3861484 3861743 3850875 3864664 3899282 3899733 3897914
19182 3897914 3888666 3915544 3935162 3967303 3958412 3944167 3954641 3971066 4009436 3988463 3947917 3944132
19170 3944132 3949857 3972055 3995401 3991512 3973501 3937361 3939606 3974274 3998717 3977786 3974676 3985644
19158 3985644 3982286 3968590 3953110 3952693 3970344 3997795 4013741 4012935 4034998 4028529 4006672 4002999 4001364
19145 4001364 4006587 4017110 4032963 4037396 4012091 4019265 4046950 4025038 3982384 3977086 3961519 3955852
19133 3955852 3989934 3998275 3954437 3931523 3916078 3935692 3941465 3934561 3946441 3944304 3920813 3887250
19121 3887250 3877386 3857884 3851248 3855189 3867732 3848890 3821310 3829611 3817526 3802797 3797072 3765241
19109 3765241 3747486 3732866 3746079 3762429 3789910 3762895 3724093 3695786 3681622 3666256 3646613
19098 3646613 3621454 3614967 3634918 3629632 3623468 3621912 3596845 3611666 3593492 3564429 3556517 3548907
19086 3548907 3545422 3563933 3546807 3519694 3494396 3490717 3485242 3451928 3432695 3416684 3429146 3450178
19074 3450178 3444878 3410322 3390835 3408192 3411089 3423548 3443644 3405340 3376826 3352314 3293607 3244111
19062 3244111 3213663 3190006 3180830 3193372 3175801 3143304 3142728 3153063 3165849 3166806 3169565 3214083
19050 3214083 3249005 3246305 3225556 3254748 3288160 3359438 3471713 3573706 3674509 3758107 3777934
19039 3777934 3754797 3693503 3592613 3499651 3437999 3396387 3323484 3270561 3227774 3170206 3110056
19028 3110056 3073721 3018259 2989785 2954401 2909071 2887322 2849120 2810676 2791364 2786647 2783996 2771524
19016 2771524 2735165 2712991 2702158 2671625 2652115 2623605 2643741 2658432 2674196 2702287 2742662
19005 2742662 2756296 2774026 2815266 2853259 2857762 2861522 2861898 2877941 2905792 2971426 3039732 3125277
18993 3125277 3179765 3264143 3356582 3377268 3347388 3281261 3202294 3087548 2964982 2881661 2832130
18982 2832130 2805302 2791767 2770729 2744153 2732107 2725185 2710846 2724319 2772938 2798250 2802658 2824064
18970 2824064 2855708 2894565 2980376 3066762 3173881 3306534 3447848 3628228 3878333 4204185
18960 4204185 4604523 5092162 5655026 6261268 6966155 7781299 8717041 9928317 11469371
18951 11469371 13313467 15349816 17373789 19098605 20275122 20797206 20699056 20061566 19044901
18942 19044901 17805736 16487782 15179794 13997678 12976200 12078845 11215479 10361523
18934 10361523 9465152 8555078 7707959 6989408 6351364 5762181 5294255 4966178 4666877
18925 4666877 4417617 4235430 4143794 4073522 4032617 4022687 4041362 4119731 4235982 4423647 4739665
18914 4739665 5124639 5629855 6264627 7009267 7819348 8656283 9495728 10292623 11089649
18905 11089649 12007090 13107585 14473545 16076019 17825300 19639790 21343549 22656887
18897 22656887 23319212 23146032 22135892 20469085 18425498 16340041 14363744 12560198
18889 12560198 11010528 9716008 8615667 7664576 6816130 6065053 5412344 4841100 4383321
18880 4383321 4014816 3717750 3480498 3273735 3119221 2999750 2881748 2772220 2664966
18871 2664966 2583771 2526817 2460093 2389830 2326864 2247844 2210201 2180599 2143044 2084613 2055611
18860 2055611 2047317 2036731 2033966 2039030 2063657 2092399 2103441 2099199 2139839 2188036 2237757 2305622
18848 2305622 2375261 2430340 2508123 2607877 2734964 2846683 2979223 3119355 3274913 3404322
18838 3404322 3520908 3652428 3819525 4048723 4381458 4806364 5385808 6149953 7159055
18829 7159055 8488881 10090123 11833252 13550150 15190296 16918091 19113548 22342076
18821 22342076 27164063 33868059 42102602 50352466 56821234 60569210 60712515 57892400
18813 57892400 53539060 48416110 43098107 38128853 33991179 31037602 29181634 27869790
18805 27869790 26446945 24535536 21985651 19064262 16217158 13761686 11754663 10219360
18797 10219360 9087069 8266124 7697775 7307342 7026326 6816631 6697529 6655839 6670431
18788 6670431 6757939 6935939 7240618 7708718 8465856 9582161 11155038 13312223 16019999
18779 16019999 19055006 21995845 24395209 26088426 27233124 28415400 30500630 34026962
18771 34026962 39027229 45135077 52009575 59020590 65454782 69604654 69819722 66230144
18763 66230144 59128031 50145027 41461439 34277370 28910022 25100357 22268656 19881374
18755 19881374 17601525 15288138 13081130 11088557 9403220 8045179 6971388 6159071
18747 6159071 5561744 5099942 4748107 4439014 4181729 3944421 3714102 3479792 3245455
18738 3245455 3034626 2815881 2623204 2489313 2389828 2276853 2138542 2017322 1929679 1832246
18728 1832246 1752817 1694777 1633626 1629332 1651972 1661247 1653124 1634232 1600694 1598339 1582234 1575323
18716 1575323 1562611 1576967 1654591 1743249 1811941 1855206 1880836 1852352 1788917 1710741 1608625
18705 1608625 1525504 1445879 1332259 1257470 1217382 1207415 1197786 1154130 1133991 1124301 1122014 1105758
18693 1105758 1088545 1089828 1105777 1150505 1181749 1186106 1256644 1299990 1322644 1367753 1424063 1483671
18681 1483671 1559430 1622548 1703624 1793250 1848223 1871706 1854519 1801228 1741768 1681702 1629596
18670 1629596 1555997 1444346 1391407 1354381 1282519 1219586 1199770 1144011 1077377 1018785 971603
18659 971603 956868 976598 975372 941230 941338 912036 886799 870119 878286 921663 945243 955351
18647 955351 983424 1004556 1009878 1044858 1078469 1115711 1185620 1267623 1322802 1332728 1323333 1369497
18635 1369497 1399509 1450919 1505937 1588819 1670163 1735739 1781425 1829843 1850651 1831762 1785335
18624 1785335 1703418 1591952 1489225 1383042 1295614 1210689 1109929 1044775 984823 917757
18614 917757 864317 849365 809285 752941 726876 710369 706656 698250 671820 663077 660143 666270
18602 666270 674311 682427 666119 646375 666055 672004 694553 656038 613382 618330 635926 604062
18590 604062 585899 587613 616642 594250 581570 589837 604311 603486 588917 560840 542247 530072
18578 530072 522996 523177 533445 529880 507383 470485 448696 461098 483186 432923 416058 433829
18566 433829 423141 435217 435438 427532 424805 432772 449760 440241 434618 448796 467857 470071 465170
18553 465170 476144 454417 433898 448168 471812 455825 438282 453033 478417 471325 445966 435889
18541 435889 415689 411388 414088 376299 368171 379187 410821 436509 463080 489157 475468 441619
18529 441619 415462 409904 406128 414118 407186 383290 388302 425954 435313 449153 437376 413794 439234
18516 439234 457987 428473 416669 439197 420109 387294 373648 381630 396174 419199 431377 423346
18504 423346 413588 383871 361538 380368 410638 428116 445862 454258 413609 401083 416131 417975
18492 417975 405040 352797 321126 329797 357807 368239 338934 335566 360777 320357 305733 323721
18480 323721 345244 393661 404898 367491 370048 374394 367789 376288 420953 449452 428398 390765
18468 390765 399600 430811 434631 409291 418016 401907 400963 390753 404466 467162 489744 500269
18456 500269 528212 546361 577522 581884 581851 589796 607207 595199 572360 583575 608404 618276 601042
18443 601042 588555 603451 571749 531726 498619 510779 524443 503384 502286 513521 488263 449559
18431 449559 409892 389354 381766 385735 389844 381338 357871 347657 340027 356621 390062 394356 354068
18418 354068 323905 313514 357606 378313 394752 386156 410065 433751 442266 397237 373670 393509
18406 393509 438332 441704 445941 459929 488628 480011 478693 513834 524991 543378 549884 530585
18394 530585 527213 525397 523147 518815 487918 465906 443005 425185 392181 407153 418848 415423
18382 415423 399190 363036 335945 304603 299316 280275 233056 229407 256108 269782 301593 303865
18370 303865 262573 229741 214826 219619 222513 225150 205347 175057 181516 213458 237753 257385
18358 257385 297938 296968 277774 254460 249001 237352 223031 207448 210219 217522 248977 271103
18346 271103 275137 254214 217221 220387 229459 232104 238083 236121 218421 206575 216664 223466 224677
18333 224677 256856 264091 250965 256361 254851 236471 240434 263502 307960 364794 376893 395478
18321 395478 396731 369543 359798 386447 416774 421547 410667 393751 405552 392674 385354 388068
18309 388068 371294 359531 354643 326173 298599 283264 294929 302772 316889 284647 246841 281993
18297 281993 303636 303130 259849 246973 262452 243697 247610 252951 277663 293739 281968 254635
18285 254635 265722 275967 264140 285422 331254 337116 330846 355371 385248 399399 399677 379499
18273 379499 369863 393247 412066 443067 444712 425770 425790 463442 463977 491342 491719 460429 449940
18260 449940 424523 391453 385845 361876 312527 293850 303569 290545 302068 286715 251504 216858
18248 216858 218707 208485 201183 202123 238736 252892 238081 214521 227598 236495 232317 210927 232825
18235 232825 240479 240481 202281 194554 201401 204575 192243 193284 219964 215225 228689 243259 222385
18222 222385 225538 227227 209182 195861 194957 214211 242879 232499 226669 238822 230973 221861 185821
18209 185821 206541 199604 192539 217171 217387 228024 225222 212069 203475 179953 202813 231769 221294
18196 221294 190762 187231 185118 188696 190298 178299 173653 176936 185968 173233 163271 170051 196398
18183 196398 191377 186223 223964 219628 210033 218338 217206 186041 168450 145439 145251 165426 176010
18170 176010 174175 183187 177525 178570 188927 188273 185629 204310 212999 213519 217012 231926 239972 246058
18156 246058 247347 246062 241555 244366 224680 207889 201123 200066 210163 215615 197486 174541 196364
18143 196364 206781 192225 206584 214929 239467 247650 258335 244535 235714 215744 220285 218360
18131 218360 197689 196451 211866 226685 247678 240083 253368 254617 243707 217078 193359 204790
18119 204790 213768 200582 214456 223248 249585 266910 239421 224763 236658 269770 251578 224759
18107 224759 238217 250489 247308 253820 253136 271087 267309 238814 237088 237433 218999 217655 226145
18094 226145 246199 266553 277251 274123 268816 262294 253119 273889 240685 209949 243623 258657
18082 258657 287159 276020 278519 297725 284550 245947 256554 251391 231841 227737 243836 274806
18070 274806 305098 327329 326893 320689 325878 361237 390148 389927 427948 445124 446283 443497 450455
18057 450455 492380 553961 594202 616382 658186 705961 718986 755856 833711 911008 983070
18046 983070 1063971 1122529 1208882 1337236 1445377 1539156 1704460 1910383 2148423 2443830
18036 2443830 2762568 3208602 3725369 4317543 5020355 5802906 6715426 7835623 9209498
18027 9209498 10851175 12684686 14639219 16489827 17934400 18998811 19760683 20261568
18019 20261568 20333619 19853144 18947861 17805775 16585981 15400466 14244736 13133064 12079908
18010 12079908 11099342 10222299 9458080 8748854 8093355 7421355 6767743 6200764 5706874
18001 5706874 5288854 4908984 4593644 4332001 4154095 4020682 3965732 3968732 3994124 4102525
17991 4102525 4270468 4529003 4862964 5299838 5875047 6544540 7269390 8029062 8834377
17982 8834377 9705639 10706352 11814318 13021443 14324474 15716818 17244029 18897459
17974 18897459 20627728 22288387 23686720 24744100 25699877 26727362 27704534 28302017
17966 28302017 28750103 29648904 31386952 33920925 37167221 41489630 47066741 52404606
17958 52404606 55129949 56448333 58442831 60783764 61078749 58325622 54443278 50554132
17950 50554132 46720317 42884547 39141786 35638035 32173722 28855625 26141009 24026912
17942 24026912 22008893 19743167 17416854 15261961 13346185 11705385 10348198 9256058
17934 9256058 8420645 7834254 7379596 7058031 6911978 6926543 7088824 7357868 7825107 8530094
17924 8530094 9497407 10727864 12221965 14026667 16087283 18129649 19853291 21485587
17916 21485587 23540068 26165216 29062612 32072116 35174306 38247440 41330244 44735783
17908 44735783 48745134 51865443 51996172 50183952 48689750 47902424 45590595 40813796
17900 40813796 35492812 30749099 26489352 22538677 19129124 16409289 14364689 12599595
17892 12599595 10911895 9430450 8177119 7165780 6323885 5593947 4940864 4443200 4073310
17883 4073310 3760089 3496100 3271974 3071736 2923336 2797305 2692080 2613118 2535809 2448026
17873 2448026 2412731 2367905 2295274 2234009 2174265 2086299 2000738 1875842 1727018 1606016 1507110
17862 1507110 1395947 1308398 1238582 1154282 1039686 946253 905431 891921 892557 854766 796255
17851 796255 736593 687945 679142 683992 659348 628243 623221 610891 587345 568815 551974 541378
17839 541378 525442 531020 523240 528198 557176 557840 528525 482127 459225 486452 506945 508777 457151
17826 457151 415393 401053 407859 399280 407405 392985 402007 398781 386473 364441 368000 356479 318302
17813 318302 319075 317575 319052 279752 247217 259009 283963 290887 287140 259387 256334 267777 240504
17800 240504 226649 232950 228260 233859 227543 237725 251643 264286 280861 292320 258867 239006
17788 239006 245726 270356 281648 280579 269863 266848 285762 312025 301784 290844 299779 304557
17776 304557 300469 299804 281167 270078 262776 235964 200151 204735 193988 182602 192231 195293 196514
17763 196514 180547 164972 178430 178536 176974 176400 199107 203245 213156 215034 192045 185767 171271
17750 171271 159005 181420 192237 169560 180484 177957 173618 170733 163278 163145 179967 191022 161191
17737 161191 162672 138617 117920 112497 118493 121069 111105 111051 126794 140930 122968 113343 110430
17724 110430 108797 121593 140113 146646 120636 111970 94941 92807 93618 97466 124875 115156 94773
17711 94773 102006 121444 128879 106886 107042 109757 122083 123648 114073 116965 117774 115820 144758 165910
17697 165910 147577 117586 126019 111252 104356 131597 132573 115175 114459 111179 113784 109329 104458
17684 104458 115385 128295 147877 123447 107936 119238 152001 148722 121187 127094 118290 110589
17672 110589 110911 100734 72182 79654 105604 118266 113100 125332 126449 123801 126518 116356 106814
17659 106814 108007 95813 95759 102612 111374 114339 110631 142870 115786 100076 122545 142903 121006
17646 121006 108998 119518 120044 108672 92461 87390 88174 85306 90489 101244 116314 116875 113741
17633 113741 122070 106640 96842 131286 146437 121735 133415 131613 103573 84103 91786 111848
17621 111848 141942 147160 139756 125130 105647 103558 104731 100547 88928 85589 99374 94122 80603
17608 80603 75924 92546 99506 99110 114651 115154 115108 110824 106332 104639 88272 63008 59755 46601
17594 46601 30174 72203 93751 124106 107382 73485 107443 115502 113440 111924 108321 94242
17582 94242 79701 70596 54300 44313 45240 81458 108125 98528 94897 80289 61704 72158 90157
17569 90157 63612 19861 28056 30028 42359 62357 76449 86693 81762 70061 85518 88318
17557 88318 85686 85183 90919 95948 105199 94273 73358 68917 60028 53592 70577 74943 84118 98927
17543 98927 76399 66886 92424 102634 124648 132891 124750 142114 140314 148032 146031 128768 108848
17530 108848 144566 159856 120662 87098 77171 86187 80731 122344 164281 176232 153940 109871
17518 109871 93465 101783 88921 102411 103428 65955 61048 95334 103566 112756 120082 96984 96631
17505 96631 93709 84335 105150 138863 130022 151707 132602 110447 111020 114228 110473 93335 93091
17492 93091 97720 105140 123631 134305 109193 140868 168970 157877 142663 148424 161322 163612
17480 163612 174572 171364 158519 141431 138589 167355 172952 153792 152618 174694 168860 209067
17468 209067 211318 222829 265892 294367 312351 324075 316192 316595 326131 319229 301524 305269 310020
17455 310020 286562 300927 291996 276997 246576 251537 243436 235468 192715 163941 149725 141302
17443 141302 135958 146360 158114 133791 110983 117430 127735 142018 163514 169404 154532 132186
17431 132186 117353 82686 76982 96240 121810 114315 126816 165324 186219 203270 218325 238076
17419 238076 263241 272398 273390 245141 211961 213656 199284 204240 230218 229404 238295 248311 222400
17406 222400 208471 221684 259082 265448 250851 251851 254691 216738 184178 160420 141467 153238
17394 153238 109666 52194 57712 76577 92604 110415 112343 90178 76131 100281 104830 104332
17382 104332 89391 42215 34811 57164 82826 89809 91976 96521 86072 74086 45109 48989
17370 48989 59001 46942 58849 56999 67704 73967 67002 43576 31663 40940 53222 54695 75758
17357 75758 96917 59951 17924 38783 61462 33589 49922 82828 84989 64947 40776 46959
17345 46959 69508 61703 82737 86725 80625 66403 62665 73862 74475 73622 62892 52860 65460
17332 65460 77061 83623 48003 37149 44269 34811 40124 31813 19753 33810 40057 46108 72493
17319 72493 76756 39532 41241 44789 39954 33225 31553 45305 38449 24209 14678 26002 21652
17306 21652 50359 70150 67544 49243 23874 -6419 -7314 21105 36627 47380 60860 63790
17294 63790 69351 87448 88346 80791 69878 44181 52059 106026 122386 127585 85469 61386 53807
17281 53807 38003 39406 55408 67640 76159 63159 56705 44835 29510 24946 28358 68776 94384
17268 94384 79970 67285 79849 80161 94210 56055 34022 41851 33389 41821 31928 45011 49798
17255 49798 60561 76540 66478 57181 64486 61102 38889 48030 55916 69977 59870 77347 92585
17242 92585 52177 27505 22566 26960 19580 23581 28193 10097 15922 2257 15310 19908 32456
17229 32456 35247 50909 44959 51525 50424 29591 17719 11226 -2158 -28490 -36310 -34910 -14360
17216 -14360 5526 20670 35740 18653 21709 35807 22667 16481 54233 44295 22956 -10946
17204 -10946 2240 19046 2539 9643 25461 16913 23539 59297 56048 34823 27378 48998 67306
17191 67306 94350 77787 52325 60355 55685 43504 46987 39822 31824 38335 38058 51936 58723
17178 58723 67064 82414 97764 74218 77708 112108 102823 76395 64192 62622 74913 105368
17166 105368 141626 148940 134083 138107 112385 81261 48801 49341 58226 57349 47548 34051 51844
17153 51844 74244 91907 63291 57861 80447 75707 92514 73555 29612 16611 37128 65009
17141 65009 104052 90429 79810 59009 55070 57942 59277 39236 45509 29910 42806 73000
17129 73000 66000 64409 68484 64374 63822 64679 77273 82642 67955 83634 106979 97700 77052 68692
17115 68692 50681 50249 79314 67853 76743 105161 85665 57361 40729 38300 52489 64141
17103 64141 63288 83241 79054 48583 57519 62994 85275 67788 52087 49116 13701 -5814 19176
17090 19176 46796 91368 83588 104172 77895 51934 38066 28238 22256 33495 43551 72411
17078 72411 61916 44936 52865 64756 81018 77406 73989 68990 74542 87043 83332 61520 62554
17065 62554 64656 68423 75125 76596 63656 44985 25677 25628 20092 33477 40109 28302 31914 19826
17051 19826 34800 59805 47862 4441 -6371 4726 19745 61739 68340 76014 89160 59117
17039 59117 28350 15026 -14665 818 27011 26132 26563 39331 42652 38372 36317 18263 4937
17026 4937 13087 32566 61000 44544 5193 -3001 20476 34906 32590 40349 60842 64610 41700
17013 41700 29044 22527 23602 -2449 5623 44055 78078 91279 75174 51558 54202 39072
17001 39072 37502 64854 55997 56433 83654 65450 71551 85156 78109 83095 75790 62507 44751
16988 44751 31911 33578 49564 60647 64818 53459 67263 76872 52482 44138 44639 42707 58497
16975 58497 55650 68353 46792 48260 58510 39382 52230 76585 83462 40099 21149 11740
16963 11740 19154 51710 61896 50517 44624 30014 674 -9583 1553 21337 50984 55156
16951 55156 59530 24680 -2871 26025 52229 48339 50652 62447 29664 32012 37029 22185 13728
16938 13728 39142 70433 57192 30504 23866 26720 21316 33789 63198 53054 45364 22178
16926 22178 41713 53642 37737 37284 23284 12717 17266 15190 7235 36092 57872 37982 43039
16913 43039 37446 44980 37276 26448 27662 21984 26605 22465 24160 49471 55217 43257 83948
16900 83948 88981 69646 64106 58637 67531 91015 81776 69379 52030 22592 28821 47375 62248
16887 62248 62271 53298 48274 37464 30857 38164 40954 31545 24000 27929 26978 -6647 16414 39384
16873 39384 20300 14191 26179 50920 49579 36971 31496 39512 57001 33164 20060 25737 46297
16860 46297 31836 10693 -20568 1766 34092 49344 32289 43333 61206 51737 17595 24697
16848 24697 33994 52586 61636 29092 18141 46913 28505 19037 49153 58949 24066 27055 35129
16835 35129 17980 31530 37647 43230 63651 75767 102866 104358 98684 73485 34774 16061
16823 16061 11154 31881 22424 15683 -2573 -20725 -2244 4821 -3594 12975 25964 26359 18263
16810 18263 18816 46562 36677 45528 82032 64241 36043 18804 19442 -3990 -18215 -18705 23952
16797 23952 53755 62227 36029 44948 47726 37014 26326 16795 17375 30185 38682 33875 14507
16784 14507 -7024 7444 -9447 -18962 3673 20884 -5631 12958 39621 41651 46080 54394
16772 54394 40937 29677 23831 27597 5308 -4231 13952 39168 56531 58394 17791 -1041
16760 -1041 15708 36444 34205 43478 39668 31574 37676 13427 -1989 14762 33665 37044 59509
16747 59509 64607 50577 34580 33191 35857 9931 26388 54400 30827 -13130 -23084 -22816 3621
16734 3621 -2205 2555 41682 51598 52911 26121 1123 -20176 -14926 -28265 -18250 8669 18613
16721 18613 13423 -9957 -10307 9410 18060 49708 36309 31738 26857 17090 10041 23760 20476
16708 20476 34013 53941 42323 34865 43850 52641 70849 66540 62307 42241 43809 44857 40681
16695 40681 4349 -11473 -15924 2754 -5999 -12916 -4247 14546 16063 24670 10021 1717 22426
16682 22426 34970 33844 45196 39397 39889 35788 38160 47833 50291 45394 42858 39175 40116 29129
16668 29129 15860 20789 34911 60302 48847 35751 1850 12031 31935 12326 -12805 3259
16656 3259 5431 -1583 3470 7029 36762 78613 64739 44298 57792 69498 48909 35192 5197
16643 5197 -2707 -15451 -13155 18931 46429 25683 -2937 7862 27207 34418 22917 42019
16631 42019 40328 29186 -13176 -24791 -18871 12302 11258 3318 7143 -513 -6360 15713 25522
16618 25522 8377 -14371 786 31416 56538 46372 42570 9579 3176 8327 15495 3885
16606 3885 5622 18523 15340 18237 -2583 -18267 -6799 15943 18087 24991 20399 26281 27485
16593 27485 24582 11101 13099 40126 58095 25296 47470 63176 31096 6547 -22930 -14229
16581 -14229 -5715 17338 13705 1489 -10938 -19138 -7452 -9288 5061 17672 -91 8521 39069
16568 39069 38315 43100 48220 38108 54650 68532 59727 67614 49708 12878 17759 30106 24032
16555 24032 391 -19363 -20965 -3619 35313 32569 32430 25573 -1730 -9944 -19580 -14159 6229
16542 6229 13036 52558 68463 45807 38571 31707 23763 26548 32929 13929 3103 14587 4921
16529 4921 7917 16717 11280 41834 61750 62512 34685 -7186 -18461 -15057 -11191 -7611 -2999 10874
16515 10874 29040 17607 9688 16338 7168 39422 55636 63418 69722 36223 31165 15765 -11187
16502 -11187 -12667 -8879 5564 -9022 -40148 -28470 -807 14339 21555 23576 41151 19829
16490 19829 6105 22536 10353 15134 20740 12848 25894 8859 -15876 -4036 -541 24247
16478 24247 26120 27295 7564 -11879 12404 8792 20826 33343 15825 -12516 7514 25263
16466 25263 -9007 -30762 -46013 -76459 -60163 -23895 -11468 4067 10857 -2295 -2279 8037
16454 8037 9835 -4005 -17569 -25071 -17344 -8794 -12099 -44944 -66027 -58378 -41449 -35433 -32204
16441 -32204 -29329 -13027 -18052 -43482 -30819 -40704 -9163 16933 36132 44640 15506 12123 19368
16428 19368 27472 4175 11178 12334 44188 53307 33694 -3138 8378 18968 36165 21944
16416 21944 6088 -1424 -29 22306 27185 56887 73934 23895 -1771 4028 -14341 -20574 -13959
16403 -13959 -19336 -20286 1316 2857 -834 -2938 6997 -8858 -3424 19586 35854 15744 5872
16390 5872 8256 38844 35930 39064 28857 11821 -2003 10685 32814 38038 34583 37532 27952
16377 27952 43719 58897 46878 47556 56773 40113 25873 41788 2280 -27169 -17467 11203
16365 11203 -22424 -21507 -48701 -66234 -38510 -21877 -30630 -14526 -9417 6706 -26790 -32309 -2342
16352 -2342 9860 16868 -6733 -37174 -34885 7983 21722 26019 18811 6750 -11529 8329 30634
16339 30634 19816 27149 18831 48842 65013 57554 34113 -1151 9945 20027 8951 8427 14561
16326 14561 11498 -2613 -27298 -42866 -56719 -36971 -12628 -1057 -13169 -23509 -2726 35428
16314 35428 48173 30852 9896 -7271 -12586 6798 5192 -18982 -11159 20925 37145 36688 7850
16301 7850 -9596 -3834 34339 33273 24584 31368 11616 10114 8451 -193 23807 25574 22774 25708
16287 25708 17285 8830 8929 17821 37393 32786 36066 47160 25072 -3163 -1566 -21018 -41007
16274 -41007 -1715 25957 37984 34910 23565 13447 -1561 -13059 -39337 -39292 -36997 -10461 15358
16261 15358 21995 9066 -2681 2016 2789 -20395 -3312 25424 -22263 -10429 14019 26232
16249 26232 16051 21892 1589 4837 4637 -22174 -10180 7403 10310 6818 -11090 -33757 -15127
16236 -15127 -390 -1192 -26610 -8522 -1974 3573 -4965 9074 16872 -11061 -583 11326 55484
16223 55484 55159 45988 28521 -1214 -14669 -3307 11908 -12435 -35 -2969 -22370 -14377 -1176
16210 -1176 -4886 -30526 -44740 -23323 -21163 -30063 -24043 -15458 -29535 -28899 15456 30505 34566
16197 34566 9901 -20671 -55625 -70164 -31829 20727 45216 26684 -1371 -8292 -26793 -42984
16185 -42984 -6957 9633 -3637 -26175 -24529 -13756 -7517 -25678 -27420 -47661 -31871 -23952
16173 -23952 -32401 -14408 3445 3453 27634 24595 4605 -14145 -33870 -13381 2777 14188 38451
16160 38451 28257 7315 -5527 13139 27699 19716 24858 10433 -23326 -21621 -49378 -52782
16148 -52782 -28990 -47546 -37079 -31774 -15600 19813 39061 25032 2391 -1567 -5468 -23365
16136 -23365 -30495 -24409 -13011 -9153 -9590 22492 29951 19606 25312 26707 24024 11522 -5005
16123 -5005 -8916 20625 32778 29307 23287 10865 -20785 -7975 -23885 -41507 -38412 -19814 -8861
16110 -8861 -27022 -22359 1661 -4429 12495 22318 9994 -4855 -11603 -9426 -398 22743 43848
16097 43848 40682 15833 5345 -7963 -6542 -9030 -10933 -17178 -1076 663 -680 -20693 -22603
16084 -22603 -15240 -32600 -37116 -16804 -17368 -15504 -8427 -14636 -26880 -2155 -3922 -3195 25267 34956
16070 34956 31053 5315 -8686 1379 6391 16727 38840 50056 44722 32998 46656 32497
16058 32497 18635 12777 -3991 -5547 587 -18131 -22874 -9826 11890 13306 -6609 -19320 -33356
16045 -33356 -15492 4087 7254 6557 16892 -111 -30430 -34465 -23264 -3148 -7258 -9504 -1799
16032 -1799 -20034 -45835 -42055 -45752 -47359 -7662 -4970 -5314 -764 15512 8344 5698 -5162 -21665
16018 -21665 -3792 7591 7192 -24272 -35534 -5785 -3537 118 16904 -6031 -22168 -11814
16006 -11814 -29221 -36405 3881 23163 -10449 -15463 -8893 -22720 -16487 -20573 -23894 1831 -10549
15993 -10549 -29759 1674 31993 23030 -1395 -20091 -34315 -31195 -16277 -17988 -7384 -15358
15981 -15358 3915 24912 42703 19247 12614 50025 52017 34589 19622 6847 -10915 13775
15969 13775 -3895 -12413 8152 21798 31114 27085 15602 9846 -378 6831 7184 7947 -1490 -23837
15955 -23837 -38785 -19500 -428 -12327 9767 9195 -7230 4616 -14956 -25726 -37928 -43631
15943 -43631 -24481 -13502 4175 3216 -14088 -32258 -36682 -19277 -13414 -12030 -6808 -10061 -21560
15930 -21560 -22733 -33776 -34592 -50044 -51749 -46997 -42441 -27805 -25304 -10246 -29452 -14986 -8996
15917 -8996 -45836 -55783 -12357 20481 11721 10513 21062 11413 -14154 -20088 -6701 23324 1428
15904 1428 -17023 2618 -11372 -22558 -17189 -4070 1750 713 253 -14893 -33705 -46194 -30668
15891 -30668 340 15426 16632 308 -206 9047 -7548 -5783 -11056 -24758 8617 2228 18536
15878 18536 27934 16490 -14294 -1043 -1292 -4975 17268 29819 23904 21396 -32761 -24694 -10527
15865 -10527 -15682 -26061 -36744 -16795 27678 20925 -16481 -6829 13719 81 -10454 -18034
15853 -18034 -5603 35645 20932 -18249 -8136 10953 16840 -8685 -24879 -42938 -45847 -42110
15841 -42110 -15742 -13021 -24935 -21323 -32966 -28068 -19433 -30482 -50457 -39613 -5964 -5443 -28677
15828 -28677 -37277 -61485 -62582 -56814 -61066 -53377 -30002 -36262 -48522 -50913 -16819 -8335 -4564
15815 -4564 -8107 5920 12840 -1813 -9294 -13981 -1231 -6374 -17468 -41794 -21393 -19154 -6782
15802 -6782 -5865 -13247 3344 12747 -4105 -15322 -22529 7465 -10417 -4903 10297 10133 -10839
15789 -10839 -18089 -34863 -51163 -34181 -21725 -25698 -15649 -17192 -33062 -48496 -48913 -37923 -45486
15776 -45486 -44675 -23632 -22467 -18783 -6006 -4273 21705 14505 7327 -11192 -21896 -5930 -20857
15763 -20857 -33105 -24677 -10644 2713 -3401 -8971 -5038 5703 4792 -17580 -26785 -14367 -39330
15750 -39330 -56514 -42306 -21552 -12729 -37955 -29282 1123 -3705 -12293 -26242 -16226 -7330 -2972
15737 -2972 12005 -73 -131 8265 7078 -5580 -19068 -42625 -40557 -13688 4626 -7609 2127
15724 2127 7074 12123 6149 10879 15199 -4907 -18864 -23553 -32398 -22939 -7175 -4121 20274 44159
15710 44159 56420 36494 9895 -14104 -20521 -25428 -37626 -33797 710 23207 9282 5921
15698 5921 -2778 3132 -22203 -25606 -15660 -5029 -7390 878 -11727 -5856 20898 -2631 2659
15685 2659 22273 32102 12960 -3341 -13665 -47100 -49661 -37531 -29786 -21068 -10741 634 -9527
15672 -9527 -2636 327 23069 17444 13793 31219 22932 -92 -29478 -33376 -4664 -13994 -16037
15659 -16037 -3993 -25977 -42689 -53902 -61226 -40355 -11463 6004 12936 21999 30466 30390 42298
15646 42298 29688 21122 24764 40127 32571 6262 -9139 -18159 -22295 -27244 -5124 29912 9802
15633 9802 -11773 -11567 -12820 881 -7037 -10573 2040 10131 11516 -11128 -29497 -26695 -27255 -6923
15619 -6923 26269 1791 3120 30738 18257 2424 23222 30287 33005 35307 28702 25599 21186
15606 21186 8284 5935 16720 -1955 -32685 -40347 15849 5057 -25301 -22836 -4944 -21878
15594 -21878 -20363 -21937 -25865 -36958 -23457 -40810 -39882 -27960 -20475 -7196 -4223 -11458 3462
15581 3462 -11646 -18021 -24292 -341 -3327 4479 5368 34408 56044 37299 35321 32521 7846
15568 7846 -18557 -24638 -5476 -17744 -38077 -16850 723 -532 -1097 -25854 -37210 -17146 -17721
15555 -17721 -18363 14416 29232 22075 -4776 -22545 -30719 -28401 -10563 -15092 -20429 -22810 -46180
15542 -46180 -67641 -33333 -18570 -19734 19565 15489 -26054 -38220 -11042 -5106 -27897 -28595 -15838
15529 -15838 -26572 -31449 -20224 -10419 -11129 -10948 -3212 -20449 -13412 -14413 -9606 -3634 -25370 -52565
15515 -52565 -47384 -20752 -12590 -9249 -15290 -25174 -34654 -40437 -30781 -24719 -27999 -46461 -26553 722
15501 722 13184 13278 -1054 -7120 -2247 -15448 -32788 -46877 -49093 -47962 -46230 -38887 -16959 8433
15487 8433 -18408 -22714 -15927 -4563 -3297 -4116 -10487 -15906 -25070 -20656 -868 32717 48796 30503
15473 30503 16905 4500 -5347 -14477 -24338 -47851 -62129 -50311 -37990 -14445 2324 -3386
15461 -3386 -19957 -21372 -15129 -7987 -1178 -9020 -31387 -55316 -52226 -31442 -41243 -32254 -932
15448 -932 3285 -23946 -10638 -24837 -40332 -26294 -19104 -24799 -9146 -1432 -1235 -16626 23903
15435 23903 35552 14797 -10289 -5603 14807 28961 41721 42956 2160 -28316 -36083 -19675
15423 -19675 -33223 -31553 -20008 -16720 -4216 -4369 11110 6553 6303 20959 17553 2060 13367
15410 13367 19470 28864 18203 35394 53510 34008 11302 -19684 -29332 -19641 -14094 -30276 -24295
15397 -24295 -10226 -10872 2600 36510 35004 29706 33824 17429 12315 19019 10277 433 -41362
15384 -41362 -57049 -6608 18632 10990 -10169 -7918 5816 21333 -31783 -72762 -55212 -31299
15372 -31299 -15536 -20214 10885 1577 -23998 -40612 -45833 -70011 -64907 -58866 -40607 -19725 -21567
15359 -21567 -92 4021 2198 20970 41779 19904 16793 20402 19239 4180 -36036 -18480 6385
15346 6385 23379 21895 10529 -979 7634 7841 19925 22723 2360 -17353 -43072 -25860 8051
15333 8051 -10258 -29396 -20391 -1648 13643 -300 -7635 -10919 -4060 -20970 -21074 -34299 -18011
15320 -18011 -4841 -14911 -20262 -19289 -19545 -12651 -9451 -94 14306 -9710 2521 18004 31778
15307 31778 28372 28733 9306 1139 -9955 -14640 -25681 -29253 -20275 -16741 -12111 -12319 -23855 -27860
15293 -27860 -4127 -14262 -18482 8660 159 8203 25634 9171 -32833 -37663 -42355 -45878 -32026
15280 -32026 -21355 2704 -359 -29844 -24327 11362 16134 12864 21751 15632 -6156 -33147 -43196
15267 -43196 -37907 -44406 -68548 -31540 -16763 -52152 -30794 -33400 -1964 25314 26363 30255 18600
15254 18600 9009 22621 6604 17868 19845 -9901 -21012 -7355 19089 22090 25197 29089 16684
15241 16684 25058 9754 28260 32325 16753 18984 43666 36309 -5083 -3329 2734 -34210 -39083
15228 -39083 -19639 -7634 -30201 -37085 -22322 -13737 -18294 -6110 -23264 -8706 -12251 -33160
15216 -33160 -19178 -12531 -17577 -1576 -11729 -12757 -19120 -28659 -27923 -33869 -16615 17185 6213
15203 6213 -23602 -46852 -20664 -12536 -9865 -3276 13999 9598 9237 18577 24864 5699 -8939
15190 -8939 -33857 -43239 -37319 -39421 -26536 -20301 -25118 -21583 -11987 -20878 -3180 -5765 -27568 -10538
15176 -10538 31769 27389 9724 -11648 -33749 -44695 -59360 -53194 -50054 -64317 -71581 -76404 -75329
15163 -75329 -75742 -79341 -60098 -65341 -55370 -35775 -35134 -35944 -41842 -46209 -46324 -59868 -83322 -98979
15149 -98979 -99670 -79390 -51133 -29596 -44691 -53330 -49471 -52113 -22783 -11058 -6619 -4807 -4171
15136 -4171 -7430 -17596 -15293 -4045 23254 4110 -28459 -19949 2946 1779 -300 3684 28848
15123 28848 14237 14879 5760 5386 9656 -9175 -17490 -6040 -32136 -18784 6637 -13567 -11350
15110 -11350 -11719 -22783 -43001 -27498 -25506 -10834 6084 2127 -10057 -11106 531 -306 15239
15097 15239 15091 12053 14334 2841 -1140 -12372 -28728 -50757 -65777 -45678 -33454 -45768 -44687
15084 -44687 -34452 -35254 -52395 -50937 -61409 -41899 -40626 -52708 -64323 -64187 -51912 -63705 -46414
15071 -46414 -53300 -25775 19006 15961 -2645 -7608 -26214 -29412 -42029 -35487 -19863 16853 33936
15058 33936 -2093 8091 12326 649 -12314 -10923 -11027 7781 39191 28295 15679 27621
15046 27621 22886 9516 27446 28683 31234 23730 9082 16909 25520 28429 18937 14282 25697
15033 25697 14592 -8058 -2504 -5923 -37237 -43897 -33233 -20101 -3102 2657 22105 23064 4625
15020 4625 -10648 4746 17103 30911 -3606 -12836 -5254 -31737 -47491 -33813 -25115 -28792 -29825
15007 -29825 -21018 -38273 -16149 7399 -25672 -37477 -3186 9825 3691 -15913 -21736 -9943
14995 -9943 4951 -10371 -22865 -13662 -24404 -32624 -47107 -45279 -24519 -19877 -23469 -14555 -32207
14982 -32207 -32502 -29669 6818 31500 44595 11600 -10448 -30280 -25512 -11839 2550 -943 7265
14969 7265 11429 12507 -16430 -39547 -28316 1158 -3822 -15116 -27133 -44705 -56692 -65652 -47696
14956 -47696 -48352 -25198 -4828 -1318 14672 30010 55545 44553 14211 -5925 -35739 -31321
14944 -31321 1388 13740 13770 16734 1549 4311 -1695 -31928 -52350 -55995 -15300 -15925 -15395 -19665
14930 -19665 3289 -4349 7208 -14923 -22217 -10270 16696 7948 -18893 -25586 -36097 -66323
14918 -66323 -60492 -28773 -5179 -2222 -4491 -8373 -26245 -34929 -29210 -23611 -2704 -20815 -38311
14905 -38311 -35137 -5564 -10730 -38064 -54452 -61930 -57175 -29081 -21585 -36763 -24687 -27207 -37803
14892 -37803 -33619 -23222 -1996 7376 -12500 -7124 -28751 -56604 -72029 -64378 -56184 -56710 -53144
14879 -53144 -31941 -33360 -36774 -11473 5983 -7498 -13863 -28776 -51094 -84521 -75233 -38412
14867 -38412 -16999 -26667 -36195 -41195 -37074 -32985 -9746 -6659 -27265 -22269 20875 15532 -1107
14854 -1107 -2130 6394 3298 35446 36295 18057 1058 -8573 25734 44593 39530 6276 -423
14841 -423 9205 10495 9982 9353 -5327 -13238 -29459 -12664 9317 7954 -7147 12949 23137 37890
14827 37890 26805 23108 36235 19123 -14430 -15739 10674 18196 12148 2468 -5390 1286 -3323
14814 -3323 -13401 -6863 -32617 -13315 -12323 -3779 -11850 -26396 -22703 -37686 -23205 -4692 9212
14801 9212 -273 -23813 -54787 -41126 -54647 -67357 -66529 -46936 -14065 -16905 -25731 -20001 -19563
14788 -19563 -2601 3719 12791 14811 8826 16760 3785 -2040 503 -21023 -28126 -17791 -1061
14775 -1061 10960 32516 19182 16095 16255 30747 31151 -3409 1049 -11827 -30670 -12781 -18284
14762 -18284 -6449 -9855 -7721 -5164 -19289 -11684 16452 47772 29345 11340 -8169 599 -39841
14749 -39841 -52390 -36783 -57553 -59066 -45683 -28353 -10785 -20639 -35157 -40205 -33152 -15203
14737 -15203 -21513 -7481 602 -5414 -5835 -12713 -14126 -18818 5853 27461 9500 -1181 4967
14724 4967 4921 -18177 -11613 -156 -2017 -3869 -12324 -12927 -27382 -28058 -46466 -37541 -42469 -42911 -49065
14709 -49065 -43585 -29119 -22824 -50535 -80670 -74233 -63200 -72585 -75173 -57123 -9110 -7305 -10226
14696 -10226 -4099 1454 8247 -15823 -36071 -12155 5375 -5224 -12394 -26991 -47439 -37639 -34880
14683 -34880 -28192 4470 5115 -14875 -24306 3420 -9967 -39549 -26404 3322 9700 -19541 -32145
14670 -32145 -41806 -16347 -2656 4830 3490 -1276 -12851 -30691 -33309 -39119 -44170 -39741 -10823
14657 -10823 -12697 -11704 -9550 -39175 -43290 -27704 -30380 -18256 8351 -739 -37520 -36759 -40436 -28139
14643 -28139 -19735 -20259 -11618 -30839 -29611 -13449 -5757 -8771 -13441 -30478 -37086 -47607 -56854 -71663
14629 -71663 -51575 -40135 -34901 8616 30062 24247 23135 49369 42524 29909 13888 -11067
14617 -11067 -8881 -15872 -47280 -44221 -42394 -43168 -53210 -20033 -10523 -1777 10380 -7246 -29048
14604 -29048 -32118 -27728 -29462 -39242 -33608 -10560 -15284 -11359 -3998 2665 -18667 -28044 -34644 -57465
14590 -57465 -63211 -16229 -12921 -27511 -39123 -64897 -19937 -5062 -38015 -51929 -28586 -38413
14578 -38413 -54620 -55457 -34490 -14033 -9005 -16687 -43638 -39775 -56204 -65468 -50861 -11791 -7538
14565 -7538 -23743 -42441 -60153 -47049 -29167 -15792 -19494 -15096 -35976 -33982 -34373 -59 23192
14552 23192 13316 -10387 -14734 -13377 2739 34864 46806 31250 6051 -10207 -25573 -12302
14540 -12302 19344 27907 33469 39321 23736 -8936 -13723 -37786 -55902 -38977 -842 -8073 -23977
14527 -23977 -40551 -39869 -12431 -20644 -37576 -64652 -70455 -55599 -21014 -12959 -50254 -40561 -43208
14514 -43208 -36899 -29783 -37941 -47568 -14375 7756 11148 6402 -11856 -6655 -15512 -16188 -16401 13335
14500 13335 24565 -3199 -20087 -4996 1092 -3735 24452 21057 -8401 6955 19451 32846
14488 32846 7977 4669 8271 5663 27338 1977 -44045 -52534 -46356 -54133 -61828 -47509 -12653
14475 -12653 5295 -2327 -16238 -10724 -15756 -12254 -12660 -1918 -12155 -28457 -20149 -8050 21319
14462 21319 8915 8334 5440 -14874 -31062 -40735 -22145 -20636 -42554 -51230 -44509 -31527 -25797
14449 -25797 -13694 -15333 -34396 -47649 -53723 -42112 -35318 -47411 -34425 -21979 -10641 -1509
14437 -1509 17682 10356 -18680 -46936 -34760 -5819 -10306 -15694 -27806 -13079 -11323 -32240 -35760
14424 -35760 -27941 -3660 21267 34370 20749 -8225 -9250 2571 -25141 -30258 -5994 -22704
14412 -22704 -46629 -32093 -2452 10860 -13399 -27819 -1582 -5849 3175 31099 23331 16248
14400 16248 28897 21654 14131 -14401 -29151 -882 6871 -480 -1064 308 6734 -12569 -46770
14387 -46770 -35006 -40517 -20320 -4533 -7568 -2846 5393 -2211 -33108 -28664 1925 -7653 -29210
14374 -29210 -63469 -78133 -62736 -25466 -11520 -25265 -32654 -70123 -61261 -30850 -6477 -19541
14362 -19541 -42232 -35065 -34513 -35388 -64318 -72094 -60362 -60105 -52959 -29098 -33336 -43464 -27497 -11920
14348 -11920 -23873 -24486 -14267 -15186 -20059 -19643 11456 26240 6046 -2055 -16087 -16526 -38764 -52386
14334 -52386 -57688 -25155 -14402 -22643 -38872 -32593 -2974 9020 17948 9760 12590 -1902 -25712
14321 -25712 -17621 7405 -893 -28704 -42785 -43107 -44070 -36543 -41845 -35028 -42837 -61324 -45545 -41514
14307 -41514 -58614 -85969 -61105 -29715 -4029 1325 -2292 -1084 26826 16305 11176 -7006
14295 -7006 -20988 4055 36292 51193 28960 18158 14356 -5086 -8718 -17505 -23383 5541 32550
14282 32550 13656 -9248 9972 44294 36899 20408 9716 -4243 2267 11800 18903 16076 3916
14269 3916 17742 38406 25085 -4676 4083 37780 32973 -7787 -289 -20817 -17053 -25300 -9266
14256 -9266 3156 14481 -9694 -24404 -24747 -28246 -25683 2138 -15878 -13578 -17765 -17802 -12048 -16216
14242 -16216 -17207 946 -11640 -16429 -13226 -25584 -40638 -68525 -38260 -270 -1836 -53 5762
14229 5762 -31908 -55275 -59070 -45654 -30727 -16205 5579 14423 12940 56 -18961 -26567 207
14216 207 -23040 -23505 -24221 -27030 -21871 -12889 -24196 -46016 -28555 -10885 -10488 -10629 16429 -2927
14202 -2927 -5943 -16411 -31186 -53395 -57970 -43193 -48802 -47137 -31091 -29337 -29830 1687 24438
14189 24438 14434 5256 -13440 -23939 -31612 -57323 -46662 -20245 -10915 -5778 -4219 17890 14931
14176 14931 -18641 -24077 -4594 21847 18208 -2704 -22588 -36356 -20236 -9368 -9323 -5913 9642
14163 9642 -1598 -26803 -18018 36006 67444 69640 38817 12214 -11434 9744 -4917 -29079
14151 -29079 -18276 5161 15349 -10551 -16711 -33459 -42416 -53462 -57919 -46204 -21172 2446
14139 2446 21339 32681 32403 33321 -715 -7206 -4637 6805 -2022 -482 14550 15239 2241 3824
14125 3824 5402 17781 2970 -12840 -35292 -38259 -26784 -30216 -38803 -33065 -26982 -41253 -35801
14112 -35801 -10186 -1567 395 -10941 -18140 -11303 -19348 27 22389 38757 44007 16116 20868
14099 20868 14426 13929 -6089 -3981 5908 -7545 -19552 -24125 1827 -917 -4265 -28672 -46109
14086 -46109 -31921 6729 1669 -15947 -9967 -25332 -12591 -19584 -30125 -49509 -52543 -47279 -62939
14073 -62939 -41673 -41078 -46211 -30639 -28743 -35510 -43926 -16115 -11723 -21917 -38897 -22998 -25956
14060 -25956 -17546 -2756 16454 -5224 -5663 949 3713 -4510 -57213 -62297 -42157 -32838 -46278
14047 -46278 -67501 -68178 -44244 -33553 -32001 -25448 -27900 -16523 15047 15236 -23693 -49753 -58500
14034 -58500 -74084 -54323 -13102 4035 -913 9211 -12996 -15769 8682 -7506 -5990 -2293
14022 -2293 -17755 -26508 -22200 -40123 -22931 -35501 -17153 -18828 -18707 -13759 -27418 -10961 -11697
14009 -11697 -7045 -40056 -61857 -36927 -14621 -13233 -513 -987 -23003 -13011 -18893 -60986 -76951
13996 -76951 -39447 -36230 -51610 -55124 -59230 -42809 -20633 -20810 -6437 6032 1658 -7392 -10854
13983 -10854 7328 8219 -1543 -22501 -32079 -36732 -22287 -11654 -13014 -8191 -10352 -14558 -27415
13970 -27415 -6049 -2448 -7784 -24556 -30849 -30707 -9716 10874 -1161 -11242 -11579 6482 -1670
13957 -1670 -33165 -67521 -58845 -61737 -48447 -16903 28521 25389 22420 34066 33894 15099 -396
13944 -396 -7749 -7154 -8779 -17314 252 31777 -4061 -26336 -21166 -26404 -1128 8808 -14380 -11032
13930 -11032 -767 6488 19429 26879 27712 -3524 1007 15960 33612 29798 43955 48307 57100
13917 57100 42273 49767 40638 21672 -20715 -42700 -16019 -9046 -14118 -23880 -52376 -53546 -56791
13904 -56791 -17479 -34250 -36453 -27715 -1651 11628 -7957 -26864 -21165 -18881 -23793 -9155 -15515
13891 -15515 -4289 7676 -800 8457 -2189 -9803 -2199 5960 27673 32877 34500 28356 46834
13878 46834 64634 53614 25387 2517 -39957 -33446 -18155 -20840 -12552 -2691 -20711 -25362 -203
13865 -203 35822 36394 29219 -1393 -26851 -39852 -38811 -6998 26006 8817 3939 1391 -8792
13852 -8792 4700 8175 9999 500 -11309 -2701 -6356 22 -12743 -13670 -10449 -29627 -36423 -16964
13838 -16964 5944 13734 30599 34954 -19442 -38315 -35485 -23284 -4801 -1154 -362 5450 13347
13825 13347 -13352 -39267 -29133 -32969 -41664 -68014 -46883 -32274 -36713 -13840 -1739 -5242
13813 -5242 -6926 -6805 -13561 23574 22632 8304 -836 342 -8145 -4834 -5860 -1216 7613 -10927
13799 -10927 -44039 -59031 -51408 -24473 25897 37397 -4623 -15005 -16411 -40312 -39880 -31077 -29235
13786 -29235 -26386 -11097 -4984 -7567 15936 12813 -5720 -44464 -58999 -49923 -22173 -19017 -16491
13773 -16491 -14970 -28917 -49138 -51199 -25687 -31137 -4167 1652 -9895 -35261 -17716 10543
13761 10543 -6257 -10978 -18716 16313 34081 19515 1747 286 5294 -5087 3616 18209 7017
13748 7017 -6732 -31280 -28225 2259 6398 1623 19240 3549 11372 6136 -3586 302 21616
13735 21616 43516 43471 13319 10670 9033 17008 16941 26598 23219 22359 18303 24242 19622 4600 -521
13720 -521 9581 26103 12407 -4141 -15221 10189 28378 2774 -2001 28862 26589 -8552
13708 -8552 -44819 -62271 -39107 -5427 -17211 -43092 -24077 -12159 5570 18140 18178 43781
13696 43781 45536 28383 24305 33527 14136 41634 34770 31043 28165 4747 -25144 -36011 -13283
13683 -13283 9351 11272 32127 5796 -18115 5644 11462 27155 28484 22557 40576 77574
13671 77574 69323 9183 -21836 -7727 8319 10453 -3476 -2468 13708 19101 10477 8135 38821
13658 38821 51424 28276 -1544 -8518 -17701 -28619 1862 33803 36569 30335 48133 65503
13646 65503 51226 32058 24633 22249 31756 16598 5222 -11023 -32217 -27931 -27 23892
13634 23892 20615 14572 10561 16454 19003 5188 -12334 -5678 25585 21082 11361 21596 7591
13621 7591 -18219 -9265 22878 9899 -5436 3175 17293 38923 43114 44740 2579 -36040 -24062
13608 -24062 -24944 -3321 4452 -6287 -26282 -55210 -43736 -24044 -10333 -22347 -28590 -15468
13596 -15468 -15484 -7839 -2405 16547 43828 42035 20455 6733 12003 20649 16173 1810 -8849
13583 -8849 7109 -1563 -9888 -10021 -9110 -10135 -24553 -30231 -33842 -31956 -53659 -36286 -922 -10265
13569 -10265 -45617 -36430 -32745 -44146 -26296 -30164 -28153 -10492 4518 3844 -3548 -3894 -5570 -23903
13555 -23903 -6957 17575 8990 -12574 -15954 10098 2763 -7789 -11634 -11096 -12458 -20305 -17743
13542 -17743 -641 27338 41035 22074 11031 46680 57591 45793 36916 44468 58927 12443
13530 12443 17322 31385 24521 13941 7376 -792 5318 -5383 9582 10439 -12043 -31756 -15302
13517 -15302 -3045 -6059 -2840 8966 31682 22516 7052 19823 37685 19780 35353 82583
13505 82583 78432 33271 3363 -12921 -16432 -7605 -29466 2952 29066 14182 18173 19207 23247
13492 23247 29917 50450 57738 54454 14689 -15112 -8918 9804 -1007 17528 31584 2071
13480 2071 5537 -2037 3009 28054 46089 35210 33088 -18065 -49539 -40681 -13581 2835 13609
13467 13609 31647 33614 35578 38261 28881 18695 23280 6082 -19510 -25698 -1901 17662 17709
13454 17709 39946 60132 85434 60823 39758 57851 56545 44974 34260 16725 21385 18492
13442 18492 30887 52974 41678 24951 23581 35780 38621 33503 26767 11735 -4775 -8698 -31251
13429 -31251 -25740 -31414 -20209 -8874 -8328 -17553 1193 5123 -23843 -6757 5921 17556 5452
13416 5452 -1201 46512 62534 31490 25267 47861 36941 -5160 -18637 -7252 -10657 14179
13404 14179 36413 22926 8754 24751 34494 20400 22069 29148 28437 45315 52801 49136 50724
13391 50724 48329 47113 13858 26767 39612 28266 -9650 -2407 18672 3729 9687 29800
13379 29800 12659 6962 24902 15330 9722 2369 5496 6049 24056 29807 18401 23108 35861
13366 35861 33802 34181 36284 38464 21781 -861 7626 -3313 10289 3724 37512 56772 57181
13353 57181 46552 7050 -12877 -21606 -14893 9986 19582 26556 7210 -9304 -19595 -51898
13341 -51898 -35603 6303 -3758 -26278 -16372 -3834 9739 7833 5457 -1986 -7114 4527 17590
13328 17590 42390 30893 49716 48805 50081 48366 56759 54593 26783 34132 7519 -4930 5729
13315 5729 7662 13449 19062 44767 51306 43946 17805 -5828 -11362 26305 25478 15321 28674
13302 28674 46937 49737 40207 25948 11471 29168 54686 61414 50160 37630 29669 36272 45295
13289 45295 63363 59537 63654 60437 38039 19176 5620 352 13314 30923 27535 36512 24687
13276 24687 21708 25043 26646 57103 66355 40195 22464 24474 7083 -3457 20363 33270 30493
13263 30493 53486 77297 72102 52329 55693 51186 27946 2297 5417 9288 8651 -7397 6674
13250 6674 39665 47444 25814 23574 21252 19116 13560 16752 26119 19448 13981 19951 15964 20841
13236 20841 17816 23630 22575 47077 53805 22198 23059 38053 9039 -16044 -7051 -14459 -25782
13223 -25782 -7851 -45302 -66306 -45013 1094 43921 86135 101382 106068 96720 72601 34388
13211 34388 34675 43203 66872 73198 62511 80488 106810 108718 100400 87136 60501 43099 31170
13198 31170 25800 12995 27358 35384 47807 39637 64248 61388 33250 19112 -11404 -34141
13186 -34141 4642 39406 44407 70401 52491 26413 28038 22500 9556 8292 -7905 17550
13174 17550 35658 16517 -13350 10085 36893 63996 74520 67331 46400 44490 38435 53501
13162 53501 51503 28583 9073 37993 57398 35356 42180 79991 97090 114308 77687 44638
13150 44638 51321 61341 75685 82105 60348 49082 37639 44347 39656 -10630 -5852 8821 26721
13137 26721 32114 45713 55605 59274 65496 70792 61971 38257 10346 11593 41748 77394 82719
13124 82719 48313 50668 75983 77390 60888 86014 76106 39750 52457 50712 42726 41882 56021
13111 56021 42333 54171 52046 33380 20521 41272 52403 22988 14164 11918 -8507 -21605
13099 -21605 13351 64297 68003 46871 63904 84860 84314 65404 47238 44382 47825 71393 54743
13086 54743 36291 42929 58511 69723 68882 36660 23122 32293 50723 46536 60269 56544 73738
13073 73738 79663 45625 29276 16423 1356 17569 30720 28845 16333 39512 43719 45495
13061 45495 52014 45246 40347 44374 41849 30753 48137 53653 39337 62950 85296 76593 93538
13048 93538 84933 68545 47453 48573 55080 57137 45372 41304 48133 52933 59215 30423 41780
13035 41780 37049 19420 10529 15815 10028 17926 15071 35853 74367 54250 41979 39714 53072
13022 53072 52204 67897 91274 100510 71793 49960 42376 21687 21645 39527 34254 49019 80359
13009 80359 96635 76751 46220 57645 63774 49540 42861 62559 80668 80189 84967 84151 92306
12996 92306 96026 63375 49640 57613 77194 83337 59712 66079 52660 50312 37354 47978 44495
12983 44495 53278 61078 79861 90747 67908 68437 77950 58903 55303 64457 81576 82223 83091 63230
12969 63230 59216 58261 38518 71185 89294 93505 116782 114474 120267 123588 91248 65511 83032
12956 83032 63241 30449 39719 58549 66723 67172 52237 61260 79149 78002 91370 116399 92687
12943 92687 51490 32179 32603 42990 73165 88775 87660 105976 100936 94908 116205 94696 86487
12930 86487 112622 106704 103955 92937 93004 86639 81624 78685 109523 126259 103202 119080 133148
12917 133148 125226 112091 92766 107499 98296 87722 88501 83605 52010 32437 29833 56867 82592
12904 82592 94744 70846 50993 54474 76410 83999 84708 68774 71798 101580 105985 117483 121793
12891 121793 115233 103702 106743 114831 114191 83529 101416 101619 85633 77045 79415 59026 57027
12878 57027 76963 101142 102333 102652 71712 88300 137821 163193 167993 151606 124164 108868
12866 108868 118358 123551 93423 103561 127278 126729 129982 154843 161102 127462 112601 136037 153560
12853 153560 140651 118447 105094 82215 84935 71739 60464 49669 55249 59108 106682 116930
12841 116930 109862 141297 143813 129177 132765 119070 105346 96335 85162 89777 76690 58425
12829 58425 75368 65698 57158 50701 49371 45583 56284 79918 116914 119543 79003 77830 108731
12816 108731 133779 130109 146707 172089 169733 173753 173221 132893 103999 110525 101159 96006 95992 77108
12802 77108 58702 89320 95435 62296 81124 97111 106581 114482 118074 117898 128031 144814 139141
12789 139141 123816 110876 72598 79559 80163 108812 110585 87460 101454 141610 137120 137219 133192
12776 133192 126307 129295 118384 109806 102822 94629 100142 126284 116355 86765 67537 57779 46626
12763 46626 53139 96398 112248 108348 98518 87688 100712 118244 126623 121098 123969 124508 124749 124513
12749 124513 130163 127269 131594 138481 171274 159249 147152 155250 124025 98788 100033 141205 135175
12736 135175 126691 121539 105220 109273 121781 113662 80517 81562 83335 102891 117577 113535 90904
12723 90904 78484 100812 144779 150329 153154 139158 117360 145492 174476 171452 174229 148652
12711 148652 110239 114922 125625 121329 108835 128479 107618 109091 123991 141641 117376 92318
12699 92318 91070 94033 91397 99426 106758 108241 100653 92431 129314 142866 121296 122814 140165
12686 140165 146193 110607 91368 109874 130942 149007 147205 146652 145262 149228 140650 137262 124898
12673 124898 143235 142510 110743 97569 105605 107373 104175 105200 90831 93927 111506 128868 143778
12660 143778 156998 142492 143646 149218 167707 159786 158563 165525 167817 150286 154239 154709 149234
12647 149234 147190 121916 103789 123065 141020 136407 141161 141494 144092 150520 150002 142124 149630 160974
12633 160974 161258 169571 192988 182253 158312 134484 112651 103153 106408 121157 107029 119877
12621 119877 157058 168559 137921 124215 155843 152208 130449 114255 134762 115289 98826 109134
12609 109134 147962 177495 161385 145595 137518 139384 154519 157728 163161 188019 178003 167553
12597 167553 175782 178975 161182 165775 186716 190594 190868 170225 126248 110994 127130 157408 164107
12584 164107 142355 111916 114993 136439 150711 143392 152959 166781 150366 135441 164590 177926
12572 177926 153613 165576 176138 166680 180168 177397 156926 151999 138515 136267 153035 153165 149748
12559 149748 179722 173689 185564 190955 196656 204409 195355 161068 153988 166566 175233 195294 193006
12546 193006 187924 196911 170067 167327 176481 188170 179799 140677 129986 167989 220975 215989 198803
12533 198803 191587 183341 203356 205756 204350 222699 218461 206961 195155 224135 236158 219060
12521 219060 212788 183838 195216 213308 214399 209650 159137 138802 152859 164300 174766 179026
12509 179026 188623 173209 164886 159064 170650 188025 200520 198130 197016 210516 221683 227812 220614
12496 220614 237503 243306 229697 207382 198942 197644 190782 199845 201589 186035 207534 221724 207472
12483 207472 212421 211708 221861 217926 224239 211894 216769 201772 178050 177212 197243 219940 205228
12470 205228 169954 146324 159143 212984 226624 227533 227156 226703 247159 274218 252681 230728 229310
12457 229310 216293 210510 206207 223680 247390 240482 234461 221955 209975 231230 232062 252629 211208
12444 211208 193499 213556 209127 185889 184389 192915 201704 211017 192378 205384 226834 237541
12432 237541 207033 205302 202605 212948 203451 191628 192106 235698 239900 221332 212809 189448 192327
12419 192327 214180 228944 208639 162039 168331 200171 196707 177298 217685 222814 212435 208950
12407 208950 200936 208108 225085 230225 222332 243576 235567 240156 231744 199975 191349 213580 241586
12394 241586 215319 197236 190388 176078 168566 172948 173221 188653 198797 204938 184526 171801 209863
12381 209863 222360 194490 180998 179092 196160 216847 217216 223785 235543 240536 226290 220213 236086
12368 236086 243620 249232 279680 276959 246241 229800 222997 209145 210355 252591 241570 234490 230296
12355 230296 230849 249203 245397 234061 246674 240147 228706 228132 203667 192156 206058 203573 180704
12342 180704 209215 237904 226119 229414 232681 243784 235098 244945 247813 229084 202011 184951
12330 184951 174255 190221 205228 232577 272471 258843 263980 261659 248740 226908 247350 236264
12318 236264 229001 249853 272371 268035 239833 224236 231112 253070 268920 264078 259823 271090
12306 271090 286970 281271 270959 272350 297410 282866 253955 253851 248303 221443 198091 204569 211393
12293 211393 212006 221759 222568 230825 238877 253597 239763 204018 215932 254659 229314 228870 231923
12280 231923 234164 231576 237002 234653 224399 204916 219361 218417 234514 256153 262980 244102 228296
12267 228296 234786 253619 268478 274071 267941 231692 218656 226725 252046 251525 262776 237521 228149
12254 228149 234438 238357 244141 235782 227888 233670 259069 254763 268256 268937 284369 280321 281700 263213
12240 263213 238724 250273 272812 269093 263604 260006 262794 245766 253278 268127 270490 262988 268542
12227 268542 276903 261755 247836 250928 278294 289618 276116 281928 290668 294358 284296 283361 293135
12214 293135 287510 264468 255847 265583 267725 274396 267415 283676 301353 296332 274576 291922 289888
12201 289888 299998 287532 284661 300002 284727 254513 247153 261683 277774 271922 273584 258146
12189 258146 243769 235506 239030 228951 237495 263583 272309 241594 242557 242329 245839 277627 259922
12176 259922 206939 232464 251422 240564 250307 271824 285689 271846 258796 269994 267623 272699
12164 272699 291967 269528 264530 266876 265300 256404 227954 246295 254967 261497 278438 279547 258958
12151 258958 255542 242025 244638 275491 282868 263708 265907 259357 250329 233764 248944 291082 271371
12138 271371 256153 263235 227238 230372 243630 244671 227320 199339 204636 213645 234791 247722
12126 247722 247676 243150 263462 264441 262552 253709 251416 262565 253625 225831 225911 239801 257623 273613
12112 273613 286346 295325 292258 287210 258412 244779 246189 236920 242215 238171 259542 288036 293375
12099 293375 283683 266966 270607 280232 281878 281162 274271 275125 271137 244713 237677 234211 239788 259555
12085 259555 268152 263271 265071 292077 303420 309087 290406 278275 269192 253618 250904 250386 264047
12072 264047 265172 256128 263917 280366 256861 247118 238596 252220 271161 301060 320590 318333 314933
12059 314933 283018 262320 268571 278164 286064 278670 283617 270440 255760 246761 227984 259942 282670
12046 282670 282408 284144 278983 270448 268859 262138 250871 259748 270484 247654 232867 242377 259223
12033 259223 261762 257141 255439 266758 256052 240342 239956 234892 225887 224546 229456 221777 202949
12020 202949 199673 237470 254740 240730 250034 254112 274081 276528 251384 235807 225028 220068
12008 220068 212810 203833 241604 260071 259809 220166 258858 293329 281113 263091 278205 271865
11996 271865 265861 265529 240848 232464 247653 276343 261867 255034 275218 297149 305783 301220 288499
11983 288499 292194 270549 246387 223933 233733 240660 245313 252739 243841 248548 249173 237925 263739
11970 263739 270757 249679 238983 238118 223987 223661 243397 236287 210793 218760 261406 281296 280283
11957 280283 275222 280391 279865 265010 254465 281866 292798 273688 253041 227721 234511 228151 213658
11944 213658 224869 245502 257459 263286 267158 272982 257222 243967 242327 257708 245644 238649
11932 238649 225691 233305 270412 261624 197916 166705 159967 185706 193552 190882 221213 246444
11920 246444 241423 229475 241592 234895 245889 257599 246668 233925 242770 246143 237897 247765 252683
11907 252683 269840 265413 253035 219770 187537 179437 193095 214202 233554 241225 221624 218372
11895 218372 191997 206733 221909 215736 229324 235818 235873 231669 253576 241905 220850 190133 203707
11882 203707 252155 264423 266529 247387 237533 250169 245532 244586 241251 223627 210748 204146 178345
11869 178345 197215 222295 229459 225407 227817 216606 170776 184336 206037 222124 251182 242275
11857 242275 235315 182591 166648 179315 176493 165139 162841 180828 184453 184748 183946 182516 178047
11844 178047 189030 166971 175704 200608 216780 217778 229244 243913 236374 213728 182701 178977
11832 178977 194955 188064 204280 213876 203596 185104 194545 214987 208633 213350 206163 198902 197254
11819 197254 194046 203310 180458 173667 178933 187604 173147 166729 190072 211725 222946 223545 215205
11806 215205 211321 173682 167915 205669 222648 229740 210993 190994 198888 213103 180905 171092
11794 171092 176855 198225 194798 169426 192888 222379 232428 212136 195907 162066 188073 226411
11782 226411 218407 182405 181362 175100 158991 129384 118762 127907 124325 123694 115650 145201 174782
11769 174782 171063 154824 157156 169437 155848 158143 158689 173319 193016 190238 187293 170596 143519
11756 143519 151278 192162 207754 197810 195168 176321 156186 173143 209540 202529 174973 167161
11744 167161 158547 119440 93742 111833 157214 167554 155424 154306 139395 128746 135017 137295
11732 137295 137038 152785 146620 136075 141222 159706 161856 150396 142036 138012 145281 155568 143808
11719 143808 145511 146643 122245 137030 123054 119319 122378 140774 130354 93500 79847 98917
11707 98917 119135 134452 154417 172838 151654 145845 182904 193592 177582 163408 184215 173222
11695 173222 162210 142740 152569 162488 166735 164340 160379 146296 132613 129201 139530 124114 155651
11682 155651 168628 121261 99383 117614 103209 104605 129727 130544 108534 104829 130414 122021
11670 122021 112591 140063 172952 182714 182321 156147 129246 120705 107853 78007 97431 143825
11658 143825 154299 165427 159853 131426 136692 118304 96825 91711 72018 99299 113539 128582
11646 128582 121066 120609 139096 90718 72028 66197 60797 89008 128963 122127 109973 119177 139105
11633 139105 151556 129001 114610 115669 124391 110565 97542 96978 105281 104640 111345 93064 104864
11620 104864 123872 104261 82547 64063 64138 64494 82198 108002 89084 54095 76952 79423 81981
11607 81981 66417 59425 48828 48587 51349 70781 55908 56827 84334 112653 127075 105450 51946
11594 51946 34441 41749 63047 67691 62912 68392 78779 64887 67402 59903 30918 37350 59556
11581 59556 91436 93010 45472 49212 56622 79048 66298 37563 42203 71614 64846 80582 85925
11568 85925 60141 65711 68878 77588 62956 66268 32957 3831 28181 67364 76823 63556 77683
11555 77683 84325 72069 48269 61283 89685 85149 74002 54627 67305 73965 84431 111307
11543 111307 123823 102881 94890 53369 53493 63597 71744 69767 58873 41678 49165 47049 58590
11530 58590 56519 53718 70120 75688 52218 55367 44707 18553 35814 46668 46826 94308 111412
11517 111412 84724 102815 98306 102140 104638 95502 99931 65431 38059 50190 91655 99089 95153
11504 95153 83089 75757 90416 102476 107304 106168 93195 77723 30344 15391 5888 14824 7029
11491 7029 22057 59686 80932 77903 62763 41432 32026 27777 42658 76272 53942 41404
11479 41404 19780 30647 60367 55811 53657 57179 31932 40074 66989 51589 27546 26874 55474
11466 55474 69649 61568 51822 43082 31729 31408 16685 40024 46895 75812 92381 74461 54440
11453 54440 21227 -9230 9876 18080 12316 15808 35989 54345 45044 35269 44571 51758 37525
11440 37525 38055 34220 34150 33107 55798 29059 -18955 8915 57326 69728 58265 54972 53330
11427 53330 50088 54292 52490 34910 21148 27409 12230 15226 11875 -10691 -5839 45127 44744
11414 44744 36484 29016 2971 8510 30999 41773 16141 2554 -24869 -19410 -25027 -23469 -14141
11401 -14141 27795 49547 40262 19959 26746 -925 -2580 5223 17306 26228 30660 25784 21201
11388 21201 46861 50585 34587 18419 -3349 10302 9014 -16861 -5293 -20131 -27761 -1461
11376 -1461 34174 35957 11762 -15300 -52109 -65159 -37404 -22618 26031 40347 34706 22660
11364 22660 -18015 -23577 -9257 -6171 -3713 18294 28316 -409 -9897 -10640 -6828 -5834 -12770 -15117
11350 -15117 -26920 -42326 -44768 -38676 -11243 -10508 -25162 -26160 -18163 -25426 -19652 3719 2428 -10481
11336 -10481 -2020 29295 45542 27216 10039 -11206 14429 31452 6880 3119 -4304 -2909
11324 -2909 -9551 -25435 -20202 1466 13030 -5397 -17319 -49321 -65743 -55581 -52447 -11605
11312 -11605 15341 10060 -15036 -28998 -12518 -2156 5430 -25330 -23365 3230 8154 18307
11300 18307 2860 -7666 -2077 -5831 10928 15691 -1888 -29795 -40987 -57643 -59350 -9265
11288 -9265 15583 12126 5989 10044 16469 16854 3827 -24306 -30578 -32426 -29745 -51112 -53756 -66352
11274 -66352 -32398 -11351 -12040 -7568 -3053 -7449 -10710 -31391 -35034 -38999 -48054 -40827 -39685 -24618
11260 -24618 -23608 -33182 -49236 -42376 -34635 -43422 -46536 -67425 -51036 -32062 -39011 -13263 -15480
11247 -15480 -58858 -77245 -70643 -65984 -58951 -32071 -36298 -51744 -54049 -52666 -68896 -62516 -63825
11234 -63825 -46342 -39742 -54421 -59073 -27999 -16318 -47345 -40436 -54644 -64098 -27501 -3649
11222 -3649 -1238 -32684 -54208 -56110 -54728 -56446 -59437 -51017 -29742 -36355 -28016 -15019 -19970 -26101
11208 -26101 -19899 -14929 -39865 -37112 -28906 -10550 12351 18925 10818 -2418 -6246 165 -22319
11195 -22319 -36087 -41560 -45218 -38777 -46705 -55442 -49205 -47116 -55337 -45155 -34157 -19288 -22910
11182 -22910 -30495 -20365 -20382 -29859 -57621 -46592 -45341 -65738 -70266 -57125 -62250 -70190 -50106
11169 -50106 -70112 -80742 -84149 -73140 -16395 -21931 -59541 -57744 -58434 -58838 -80233 -65000 -76553
11156 -76553 -96021 -92657 -89806 -63547 -49126 -22672 -38598 -67191 -68500 -79053 -97768 -77692
11144 -77692 -79777 -82688 -93869 -86213 -73582 -75715 -93345 -96105 -90364 -103581 -130526 -123911 -101502
11131 -101502 -77528 -43729 -44428 -52924 -49616 -59484 -66676 -83043 -100839 -106138 -82858 -72405 -65676
11118 -65676 -58460 -70577 -49542 -58425 -51575 -60154 -72260 -86293 -86590 -53775 -41375 -35108 -42339
11105 -42339 -47191 -34090 -25698 -63312 -88153 -79955 -44439 -19487 -47265 -68386 -89117 -80890
11093 -80890 -115144 -128658 -89065 -75711 -83155 -77657 -79128 -69451 -62648 -67030 -55717 -101227 -110352
11080 -110352 -93965 -104854 -87957 -65712 -57583 -76867 -96631 -126124 -123234 -106912 -92246 -69240
11068 -69240 -55010 -55216 -39120 -30411 -34108 -18835 32633 69161 24275 -10142 -22145 -3250
11056 -3250 15686 38458 56675 72218 111154 146148 176565 210665 245667 317476 438495 571841
11044 571841 638451 710503 705755 663911 629034 613467 628525 729981 885787 1071109 1250926
11033 1250926 1434552 1541864 1526562 1418195 1302485 1173737 1098730 1129009 1237948 1411628
11023 1411628 1601178 1854698 2117287 2206414 2103569 1843671 1560950 1380136 1263591 1201017
11013 1201017 1210681 1265646 1359031 1464235 1560523 1548481 1397698 1183566 966602 821678
11003 821678 703021 649722 629290 622712 649664 686006 712117 677172 564886 476627 376871
10992 376871 282302 218418 172734 135952 134057 105295 34135 3398 2994 -3753 -15788 -34287
10980 -34287 -53120 -59237 -40469 -14029 -11176 -57593 -92979 -102599 -86800 -69511 -54698 -58958
10968 -58958 -61297 -49360 -66654 -104302 -139052 -145553 -121329 -87649 -75738 -34865 -36313 -36698 -32640
10955 -32640 -56232 -56582 -57150 -59642 -51579 -71811 -79871 -64337 -49445 -81424 -89835 -80280 -34313
10942 -34313 -15498 -36430 -56280 -65531 -72514 -66017 -67208 -88830 -100754 -82426 -73198 -95399 -77227
10929 -77227 -64052 -71908 -75558 -102540 -112923 -105979 -101947 -85862 -78010 -64459 -75637 -90858 -74670
10916 -74670 -55697 -39244 -55522 -50211 -45061 -39585 -53159 -74968 -80106 -81002 -98604 -75540 -50028
10903 -50028 -50708 -66290 -78423 -63912 -64725 -77101 -72188 -92760 -119307 -108918 -107608 -151786 -171887
10890 -171887 -179050 -171050 -146744 -132875 -130190 -121117 -114262 -127282 -141838 -151466 -151277 -159345 -167631
10877 -167631 -183093 -203777 -194979 -197518 -181991 -149225 -144381 -110291 -87318 -86802 -92243 -109130 -117360
10864 -117360 -112460 -118656 -113296 -98173 -77266 -59724 -29828 4131 26937 49271 49595 45274 29986
10851 29986 -26845 -35468 3185 9738 29232 59827 81503 87637 101203 83751 62938 60049
10839 60049 32374 10936 -32585 -38461 -27169 -23239 -3199 27483 34985 20118 -20583 -53182
10827 -53182 -61234 -67250 -109569 -134567 -128223 -115262 -80927 -85771 -73140 -74562 -103639 -134718 -144098
10814 -144098 -182886 -174333 -185069 -175858 -177138 -199931 -187815 -173713 -184219 -205289 -220655 -222356
10802 -222356 -232268 -223613 -203261 -197476 -190284 -195034 -158158 -147051 -172970 -186950 -188499 -183354 -186177
10789 -186177 -157284 -142482 -171059 -167198 -144986 -180516 -197356 -193090 -190926 -190691 -196394 -168780 -155841
10776 -155841 -146543 -138659 -143723 -142442 -151240 -143428 -125269 -142080 -139662 -119442 -114527 -101430 -93161
10763 -93161 -80422 -85234 -107619 -126099 -130468 -125742 -107003 -120168 -108823 -103169 -103921 -122537 -136072
10750 -136072 -126359 -101871 -113910 -118582 -116050 -130047 -147071 -124384 -121189 -135826 -143394 -164479
10738 -164479 -117897 -86735 -110203 -131256 -117109 -123131 -93855 -87314 -96377 -115790 -116266 -108715 -129480
10725 -129480 -183637 -228614 -226094 -192511 -193010 -172244 -139905 -166226 -208512 -225166 -256842 -237678
10713 -237678 -223966 -233054 -206101 -170337 -134813 -141519 -163715 -153974 -136421 -118221 -97721 -63519
10701 -63519 -45014 -9206 19971 25734 40142 45516 32020 38680 34374 21954 -20062 -45737
10689 -45737 -34148 -14835 -22812 -21921 -3521 28695 32360 21893 126 -9961 -8561 -6333 37101
10676 37101 93767 135155 178494 232220 276403 383311 484327 557797 681332 800536 928513
10665 928513 1014049 1066018 1120800 1147139 1156767 1138880 1117094 1072732 1045656 990510 951169 944077
10653 944077 955196 997553 1084053 1220173 1450734 1765067 1896422 1845309 1835642 1893627 1983388
10642 1983388 2162539 2392314 2666839 3080985 3663662 4476026 5580800 7172160 9424487
10633 9424487 12548703 16459474 20052893 21612310 20977029 19557605 18378498 17875437
10625 17875437 18371850 19988746 22973295 27754055 34870582 44733152 56466921 68110872
10617 68110872 80492803 95189243 110437947 121648889 125486119 123156165 118535178
10610 118535178 115375265 116402780 123148032 135848744 154491125 180259004 212845170
10603 212845170 245253712 264455705 262711742 245451532 223393950 204576066 193580220
10596 193580220 192881549 203969984 227900733 264390586 309258607 350132822 368088242
10589 368088242 354392094 319430160 278886933 242997659 216717782 201808700 198587038
10582 198587038 206626486 224484704 247861515 267293899 270202994 252102092 221151861
10575 221151861 188117660 159648520 138431348 124833550 118265084 117677502 121457822
10568 121457822 126966330 130071338 126309440 114605159 98077996 80818942 65384518
10561 65384518 52753836 42954743 35563949 29965838 25680567 22355396 19744952 17660971
10553 17660971 15937301 14422491 13096710 11916040 10861263 9936289 9164190 8491235
10545 8491235 7876886 7366758 6928063 6516886 6148295 5816758 5526618 5277651 5051281
10536 5051281 4811094 4589712 4392890 4198036 4018195 3858794 3698194 3575929 3476921 3380113
10526 3380113 3304136 3217064 3134100 3067565 2998630 2914555 2851615 2814105 2742368 2625876 2534900
10515 2534900 2460404 2412834 2348596 2275960 2236084 2204651 2157041 2095396 2040323 2002891 1989372
10504 1989372 1979372 1940612 1872036 1811767 1770919 1741449 1720822 1674705 1663153 1686687 1697467
10493 1697467 1684515 1688711 1715752 1683378 1671323 1670758 1633863 1617359 1571316 1546283 1534029 1551672
10481 1551672 1584743 1592836 1572895 1603424 1692542 1733990 1719411 1672428 1589785 1534783 1539058 1551633
10469 1551633 1567415 1591035 1636215 1711230 1778859 1811184 1787360 1698747 1578418 1505228 1473098
10458 1473098 1456366 1433395 1416547 1411586 1423948 1443311 1425994 1389096 1342346 1259087 1190079
10447 1190079 1145595 1096991 1049799 1071067 1112560 1123543 1133613 1127661 1065680 1012239 961901
10436 961901 915985 860517 856461 873177 849457 815098 802088 810440 813112 807158 775735 745794
10424 745794 747485 707355 708123 717615 718020 708319 698294 700871 694710 684659 675137 667291 658773 659219
10410 659219 706515 735647 744656 751201 748016 723803 724850 719021 727241 716777 715340 709997 704672
10397 704672 732960 732941 710224 694255 639462 627777 652825 659561 647263 652678 686962 704122
10385 704122 707126 736704 771643 775620 792218 784675 774278 747866 758055 775532 790560 788109
10373 788109 793270 812664 825146 816786 841845 878691 881062 880223 877984 893338 905398 925586 921884
10360 921884 946670 998355 1025155 1026120 1022364 1049069 1066226 1087524 1118669 1172106 1214333 1246451
10348 1246451 1292361 1351054 1404899 1477056 1520507 1583604 1622151 1691487 1767264 1835096 1941456
10337 1941456 2063031 2181169 2313317 2413199 2564090 2728488 2889201 3109247 3345598 3611387
10327 3611387 3919568 4292129 4703587 5168779 5690112 6249820 6890094 7635756 8413764
10318 8413764 9240331 10135842 11135505 12232414 13449292 14887523 16632484 18761584 21385252
10309 21385252 24605764 28523501 33064663 38045049 43223588 48206215 52642793 56268806
10301 56268806 58771466 59857871 59424956 57617661 54662503 50873135 46585820 42132910
10293 42132910 37824768 33916190 30626629 28000896 26045014 24691666 23826494 23398816
10285 23398816 23377466 23728007 24444376 25560434 27112514 29255767 32182814 36251002 41955498
10276 41955498 49943824 60953407 75450206 93131768 112814800 133188043 152809987
10269 152809987 170780871 185417125 195175446 198255426 194249260 184306308 169838271
10262 169838271 152494100 133229419 113389110 94335357 77577162 63954494 53340617
10255 53340617 45236049 39105309 34419054 30724371 27704024 25139320 22913511 20874959
10247 20874959 19028904 17326089 15737625 14294768 12943983 11732856 10663448 9732061
10239 9732061 8885212 8126087 7485072 6942042 6459249 6017106 5602290 5265828 4993113
10230 4993113 4709382 4446390 4218835 3988883 3797236 3621954 3490269 3366849 3233803
10221 3233803 3090856 2982752 2903332 2813582 2717889 2619734 2525373 2445250 2366051 2294493 2259117
10210 2259117 2211679 2136464 2088881 2015785 1959241 1902186 1840869 1805971 1763818 1709257 1650706
10199 1650706 1641053 1616857 1598424 1595478 1580878 1584625 1579238 1552301 1508036 1480432 1470627 1455987
10187 1455987 1460323 1464398 1489453 1529832 1583285 1652937 1727686 1780376 1865584 1981684 2019779
10176 2019779 1985663 1923314 1849164 1830857 1852628 1869720 1912143 2034767 2189240 2377813 2534119
10165 2534119 2590909 2524441 2370260 2216365 2116622 2090012 2117091 2190934 2395039 2643818
10155 2643818 2907370 3106598 3141889 2983836 2746124 2504198 2300039 2176117 2118541 2157429
10145 2157429 2265260 2414021 2602781 2729365 2695505 2523331 2308641 2108254 1931871 1780238
10135 1780238 1684545 1608520 1557341 1543319 1566361 1541445 1465880 1377507 1263059 1134239 1037815
10124 1037815 989280 954286 873614 817910 789194 767556 746245 705754 703272 699440 659080 624282
10112 624282 645959 656867 632117 612912 597637 568205 531608 517351 503890 507071 509580 487874
10100 487874 472381 490321 503595 499038 490975 502435 505698 488355 487158 465420 437905 434356
10088 434356 433311 433262 459105 473708 483009 468787 466683 480319 487798 513942 529773 519348 514290
10075 514290 536050 547030 567058 571417 561981 580052 569975 549126 528234 505745 501416 480759
10063 480759 479693 493001 469578 447089 460854 477046 491334 476279 443842 443959 429732 433849
10051 433849 427104 413641 416792 436467 437569 417759 407918 400223 384925 393304 422357 409767 403413
10038 403413 386166 393299 399530 383594 376763 394827 383218 365377 359409 366273 362145 331706 330148
10025 330148 323537 292000 273847 289987 298151 302264 318852 333243 312737 306390 336211 368961
10013 368961 370794 358740 345628 347701 349486 349550 346671 350255 330820 334401 331873 329090 327551 324437
9999 324437 338049 318906 309418 316839 342040 350116 330142 314107 288369 282529 288350 316116 320451
9986 320451 321279 304829 314742 325721 301061 288765 265889 224643 249901 286500 303458 312828
9974 312828 298832 295220 283793 277260 291923 289165 273979 271797 258072 220050 186874 205491
9962 205491 191569 221179 231432 217620 228378 240170 243966 236601 210191 202670 237355 225006
9950 225006 193632 175753 194129 225924 242851 242342 253549 273626 247452 239984 269831 261738
9938 261738 247951 242602 227593 233313 226636 223774 227021 225965 253958 279510 284874 281766 266412
9925 266412 275343 266868 264717 268017 240885 243765 257082 250666 253278 261053 280407 281673 271042
9912 271042 240674 245886 261467 294897 330235 365361 404573 408168 413223 466076 484720 493679
9900 493679 495089 503679 519144 507858 488449 485141 482092 459556 451938 441820 430716 407228 397271
9887 397271 371999 346188 337101 339483 356103 364249 376806 343313 326148 338250 357184 409370
9875 409370 472726 509298 563750 666196 757878 853087 937065 1030000 1113541 1196297 1246060
9864 1246060 1248377 1212579 1173939 1105957 1016939 901735 776930 659156 583653 523901 464277
9853 464277 458111 430010 393260 362839 335022 318489 297407 295351 256090 233087 242331 242107 225843
9840 225843 216456 209875 214216 229679 223055 218902 228070 233360 226555 195545 192865 209586 216616 197978
9826 197978 189627 181788 179018 175859 175728 206056 210253 182142 190677 221482 207626 194055 209793
9813 209793 216291 199634 176488 191953 204960 204348 187895 155145 178822 186071 184990 171640 157309
9800 157309 136184 140005 166462 186859 166055 151026 155591 183978 184834 161922 131283 131851 164275
9787 164275 146206 162416 165388 168605 184051 175885 163691 153298 124787 100066 126249 142406
9775 142406 139713 155779 127636 137171 139540 134353 136488 122930 129066 151033 169777 166036 135997
9762 135997 124804 122001 131419 106154 108586 131071 169183 182732 185906 173472 145467 119326
9750 119326 122769 105820 130292 151506 118498 88162 105455 131722 152100 143363 130137 143694
9738 143694 154576 124836 118506 121991 123538 138025 133146 144959 120311 112472 136454 157091 178143
9725 178143 165134 154623 135611 112232 102527 108673 128277 140291 142846 138932 129702 132124 132461
9712 132461 118926 104694 123007 138417 143732 155257 143382 138278 119814 122187 130085 142751
9700 142751 146154 122005 87169 74182 81745 119800 153363 147281 150370 146142 145147 153151 142478
9687 142478 114147 110556 111526 116539 114415 119232 120904 125436 132399 130462 155480 132864 128348 123083
9673 123083 108785 100201 69537 67108 84936 123669 149670 148739 137704 94599 77450 85045 126358
9660 126358 144944 162799 175054 178105 175032 191621 191868 202702 191531 166356 139872 107168
9648 107168 84858 97204 107542 112498 143130 123525 99753 97857 121928 113695 107829 123042
9636 123042 96957 122500 132515 127001 118298 100773 125304 131162 110824 107110 109776 103321 115138
9623 115138 134971 136936 118919 112303 112381 107333 99334 106982 110947 115668 128583 113915 100407 119191
9609 119191 107962 111962 98748 113181 95689 105117 112467 128755 125919 103663 106553 86769 95000
9596 95000 86615 82040 81616 86978 101456 95889 96654 97184 92843 94363 90461 85666 85301 91192 97849
9581 97849 129816 142547 155102 141722 143503 147080 143243 127958 121100 96619 99923 91317 80686
9568 80686 56173 49858 61348 75883 87554 65230 54423 70205 106964 95725 53661 61054
9556 61054 58542 48940 42895 27970 44764 56713 65001 71156 77326 110718 114177 102239 73841
9543 73841 64959 75572 63828 57919 48561 66862 74979 73851 53233 65411 91328 79568 89693
9530 89693 70020 40650 27981 31683 44447 67007 64590 55487 44174 62389 124499 142803
9518 142803 120076 94049 77757 50233 44617 47629 80231 90366 67241 64888 81024 74473
9506 74473 63531 49258 43483 44325 46672 69747 60754 36111 58157 74254 105507 124771 111961
9493 111961 80760 60046 71915 71931 81945 117514 114007 75617 21808 18764 32167 42727 31628
9480 31628 43600 64758 69457 49949 53184 66991 62032 54887 40305 39177 49025 59135 55679
9467 55679 75462 65141 32988 52810 82872 89553 76897 61190 46537 50196 40217 37976 54555
9454 54555 70796 82558 89862 88866 72593 58364 79617 71855 52624 51134 51635 71709 88548
9441 88548 49578 21744 36907 76683 85021 60627 53202 68482 57234 24898 5901 21599
9429 21599 14726 6596 34907 59241 56543 50970 49598 48901 48853 57980 66629 51394 28584 46102
9415 46102 70214 57516 54711 52965 75599 53978 50666 71201 88119 90119 75450 69785 42417
9402 42417 47725 40905 27327 2838 -92 7532 25363 19716 15941 51931 71497 58851 65164
9389 65164 63721 60808 53454 59258 63823 60475 60364 43818 39155 34002 47173 59628 73454 83578
9375 83578 86492 54875 29126 48397 81198 80656 78136 81828 80185 87531 80980 72256 70577 87697
9361 87697 97687 86365 83788 89731 91229 103476 99940 71480 41297 22402 3691 -4883 15636
9348 15636 19447 22629 27628 27300 28791 60063 86053 81304 81347 83763 92922 54570 24798 38035
9334 38035 46295 47120 32520 21938 52091 62726 60989 63096 43148 80694 93808 81109 73352
9321 73352 96875 116938 125400 116076 73162 64776 62236 50813 57944 57016 55718 49560 65473 80487
9307 80487 86111 68716 60516 33802 12785 35812 32875 53864 68835 61349 41554 45957 47595
9294 47595 74272 63151 50043 48182 69981 95055 94789 96709 85031 87967 81877 75389 91141
9281 91141 85191 99129 89601 75803 78369 95831 77513 66060 72955 84892 79518 87247 90199
9268 90199 81943 110519 76043 56976 62625 89215 88269 89310 102328 70970 50135 67052 53865
9255 53865 26131 11837 17620 18209 8721 7801 37304 34141 25410 11134 17173 23834 24078 -2953
9241 -2953 -7040 -6168 31481 53545 45202 37635 20106 15797 18439 21998 322 13745 7979 11264
9227 11264 10330 32369 26549 19104 40374 53435 38884 29222 66850 72142 79679 63956 76357
9214 76357 85598 76069 58035 66437 86667 73558 67454 72287 77393 96217 89459 47012 53394
9201 53394 68215 66289 41096 10039 13856 14911 41477 60863 77299 63040 70810 83054 83497
9188 83497 77899 61687 60556 60108 67005 56802 44330 63896 73094 56442 56017 34889 49870
9175 49870 66605 66049 49820 66824 82408 88224 75308 48000 33381 25751 13542 17286 21004
9162 21004 24888 32118 46501 67806 65568 96963 100520 79694 48232 33187 -4962 -19185 2693
9149 2693 18774 14769 31032 62072 75827 55264 49510 34964 44186 57615 75239 70501 54230
9136 54230 38269 30279 53269 46206 48415 40007 42824 50572 62196 42455 50187 74400 47931
9123 47931 24197 20193 11148 3234 34358 63287 48415 -289 3279 26955 32292 38141 40276
9110 40276 37091 13657 11803 16300 16940 52616 49829 39713 62814 75733 68063 58540 37327
9097 37327 52626 66165 49592 30272 35344 41632 31030 29806 48597 53045 59906 41362 24800
9084 24800 11183 7231 3062 5956 39545 38826 30485 31432 42122 71775 79421 73650 43094 37100
9070 37100 33531 35913 14842 17416 31264 54562 74620 64035 77105 69198 61638 61004 73797
9057 73797 59596 46108 44378 58352 64457 60603 66996 58260 39628 38536 16334 15315 68799
9044 68799 106208 107732 91711 97903 66555 61971 76017 97135 101813 86993 85157 108110 82079
9031 82079 54909 19468 14101 21907 25382 46819 72963 81222 57587 70199 53302 42215 44110
9018 44110 51616 40507 67340 66722 58846 68037 71292 77261 68517 48949 39967 33508 25020 15087
9004 15087 6080 13176 15285 7275 8481 -4427 -10377 5152 22790 28029 -313 12532 35721
8991 35721 39678 20800 14057 9040 32069 44921 38553 4986 4557 35782 55176 55403 27984
8978 27984 15324 24021 35595 37807 20146 34707 46581 44353 39361 28825 35971 60924 81976
8965 81976 55703 36243 29340 57807 54131 74107 92273 88007 92901 89564 85628 72422 46887
8952 46887 32385 35134 61722 87885 81219 72487 45839 31826 44365 49465 26992 11377 15450
8939 15450 39736 32583 17648 28038 45991 62619 49155 30865 57308 59116 83728 114316
8927 114316 93741 65389 53099 33590 27591 28072 28886 18660 25562 43450 28992 19695 50134
8914 50134 65765 46700 29659 35911 32947 -688 8889 16537 23052 27713 22208 10638 12325
8901 12325 -519 7153 21405 3453 14903 23088 37075 36970 29608 37910 51584 63586 70024
8888 70024 64864 40896 34089 58365 78748 64390 40218 5476 25487 33290 23890 59023 72324
8875 72324 63439 70737 81894 63634 35912 25564 39473 28058 39970 44656 54124 26503 27801
8862 27801 75008 67219 42181 25582 14809 10785 6613 26983 46114 30570 31657 39304 40955
8849 40955 27003 31618 35191 34663 21645 28347 26639 20762 42254 54748 67988 74638 46065
8836 46065 49737 47503 45064 37532 31037 46252 38460 45546 59520 41161 28723 36334 13585
8823 13585 16434 31675 46349 41564 28772 26904 35269 32350 18024 26325 38031 43109 39519
8810 39519 44023 62073 63119 76147 92744 71410 71619 61616 66434 56251 50750 43163 54628
8797 54628 65801 38079 31051 18247 34888 53721 85761 107158 92127 67237 38493 36943
8785 36943 40058 44759 69716 77060 63459 51880 54088 64763 39797 20958 19031 22466 29462
8772 29462 39318 76092 85503 80224 47849 35973 26114 55655 90982 90522 88891 88553 76869 50825
8758 50825 34704 47144 56993 41251 28068 38972 53701 50277 53958 55669 52959 56222 56000
8745 56000 80902 95866 76403 68924 68873 63695 75574 75649 72229 75881 80412 78889 81822 103987
8731 103987 96829 94528 107875 114039 94896 99610 107965 109718 112284 122977 78545 47877 57824
8718 57824 76317 112244 123917 110727 87164 88904 107812 95256 108812 97768 97948 82195
8706 82195 86341 109877 130057 153483 144555 158219 152767 155611 169718 174615 177050 170241 160229
8693 160229 155500 144928 146884 106660 96849 111321 126817 104024 99677 131980 165246 164335 126538
8680 126538 124022 140068 132658 136970 157610 129564 121588 118925 150970 153326 150267 149169 164783
8667 164783 174867 171793 181289 155938 139380 145431 183935 225319 255351 239857 217380 214926
8655 214926 227319 230554 225036 217065 211651 181487 166478 173944 189802 216362 227436 226173 226559
8642 226559 204977 213387 233852 251572 254237 233559 215126 194384 174491 192540 194658 199836
8630 199836 233689 221556 202298 198456 192493 178927 160198 155532 174904 178491 192206 191910 174458
8617 174458 193380 217144 231625 233776 206283 192444 145131 138816 158238 183986 189654 211201
8605 211201 211322 193148 188806 178260 169382 186629 189321 228164 234473 223114 230263 209539 191697
8592 191697 166611 185149 185852 202284 214513 180214 151865 152209 171934 185460 187669 161586 149018
8579 149018 120973 108512 113229 142908 142110 122590 126107 132549 109812 76532 72509 108728 108021
8566 108021 98807 127498 143323 135955 120785 120608 138377 141973 133586 121946 119083 123211 128890
8553 128890 161917 158970 118084 89921 86229 103761 104211 92734 88550 82245 65980 54720 55970
8540 55970 51376 85911 62090 46098 23509 28330 47624 45028 31209 36736 68496 59662 53418
8527 53418 66503 80166 85464 80671 73189 71089 54572 45838 14304 19238 39484 75519 71172
8514 71172 79707 39869 31432 44439 57739 32953 34843 52376 55527 74626 85903 74034 80124
8501 80124 70410 99338 115636 95910 85163 82858 51976 25556 22606 27932 36468 27859 24770
8488 24770 32267 46380 44592 37005 34681 21472 20417 2028 -5085 -4617 5926 15869 18366 13108
8474 13108 25224 32653 38955 -8265 -19618 -5047 -5478 -19285 16566 49820 43235 44697 51563
8461 51563 40817 38657 61953 74803 68834 60253 60201 54635 73284 77354 100445 122004 119618 99265
8447 99265 116462 117707 108747 93361 101097 90137 100597 124709 145612 145155 133174 116236 78190
8434 78190 83370 91676 84530 90795 65373 58835 47947 37909 34328 61409 60908 48336 38921 49592
8420 49592 59379 55533 36268 45153 67175 50749 52164 44627 8454 -23080 -729 9005 -533
8407 -533 2298 -4193 4171 36854 26076 41896 39281 12556 21166 44430 43352 21800 8243
8394 8243 28290 32975 2816 3597 1522 4908 4319 -23545 -10886 11250 9714 34353 28991 -15760
8380 -15760 -26105 -27432 3544 42534 24136 13654 21641 24431 41139 44480 47337 54538 54749
8367 54749 46277 34971 28267 39647 11910 -10524 11180 45778 61066 40955 41966 53877
8355 53877 35762 24523 28139 51987 46757 60358 56477 56066 38573 20938 -783 -9356 10665
8342 10665 33205 47144 46791 45521 31722 -4736 -12582 -11256 -10999 4772 14358 13695 40596 60328
8328 60328 41343 -2778 13350 28138 24586 28547 8559 -20936 -15876 -5061 -3135 -478 14830
8315 14830 2489 3096 2272 -4275 -9933 -6771 -61761 -73430 -61940 -30344 10313 34207 46851
8302 46851 32307 9909 17642 25540 21178 10468 28283 63734 83494 68653 25788 5221
8290 5221 26922 40734 31918 44880 65952 22520 8469 -17542 -34789 -37243 -38766 -28022 1891
8277 1891 -26943 -67578 -58177 -37730 -19356 -6879 26106 18972 17571 8096 7850 26439 44650
8264 44650 58641 78581 51698 25865 7284 -28635 -22414 5021 38405 60878 62238 62912 45234
8251 45234 30784 2262 -25977 -22457 -25973 -21946 -37914 -28714 -7932 13572 33576 38453 26630
8238 26630 19122 19328 31964 31631 45739 54974 41274 49042 69783 59552 61244 65509 42425 -94
8224 -94 -14885 19321 19621 24032 8353 2294 6985 15990 2694 -27624 -47658 -24871 16624 41449
8210 41449 45850 35067 25678 15103 22188 9925 9265 13150 14 -20993 -10841 -2285 -974
8197 -974 -17330 -28747 -26294 -3605 3442 14931 15948 -26220 -38588 -22531 -9599 170 14259
8184 14259 13558 9516 -9030 -8233 7639 10669 1042 9463 21929 9925 15053 3829 1367 47241
8170 47241 82302 85916 51359 37174 13969 30197 15011 11778 24159 18248 22108 32790 29988
8157 29988 18308 6217 22141 41060 19509 -19244 -32499 -19921 -29393 -9297 -12970 -7355
8145 -7355 -6139 -35398 -68288 -52974 -45046 -15812 7512 13983 -16278 -29051 4218 16923 5439
8132 5439 22235 37517 27913 -12740 -15865 2693 20433 16262 1689 -8901 2653 2538 8973
8119 8973 3083 8359 16047 20507 21173 32800 38163 -3873 -12120 4488 3557 23166 46875 35999
8105 35999 26757 37042 47733 39570 -2862 -15895 -7780 4458 21114 37945 24139 10178
8093 10178 52869 64827 69461 63881 59284 61474 43096 15493 18203 29329 12552 27725 48375
8080 48375 45661 43383 15692 29129 47773 51684 87552 66352 46240 11838 -22031 -10687
8068 -10687 -43850 -19461 15248 19421 11320 2438 -7209 4761 32855 53021 68159 62786 40143
8055 40143 41039 36953 22316 27868 39508 58583 72745 65957 54956 37976 44132 55402 55535
8042 55535 47516 30196 27401 16845 29554 32833 38266 54250 32459 31407 39181 27928 25581
8029 25581 41635 63571 52961 39414 30806 22611 17707 13851 9297 7247 30755 55408 58911
8016 58911 49955 62863 70521 102789 118554 118932 120247 141826 173827 197925 256588 281802 295621
8003 295621 306393 305381 305857 278440 238774 222066 219999 228883 204407 178178 164466 155379 163957
7990 163957 146461 128831 112986 115412 111879 90779 78698 76203 71469 84620 94988 75332
7978 75332 78019 91601 91213 62504 84173 101088 106501 127418 162275 176198 190320 163789 161324
7965 161324 212756 245018 298090 392778 498082 600144 627317 570237 490461 439156 370021
7954 370021 327357 303411 284774 286080 281421 264576 225368 198498 178793 153257 146687 153434
7942 153434 142176 131122 124833 110555 90174 58150 52848 93112 102003 102549 79389 87441 90727
7929 90727 78842 109170 135201 141965 120249 119341 101584 93652 111811 157217 182295 198914 197598
7916 197598 192241 207428 231785 225438 194479 166333 129549 140415 144770 115733 89720 87643
7904 87643 70477 51246 41330 50947 51635 38149 33046 36191 17981 8145 -1227 -14490 -15053 15166
7890 15166 34346 41918 48297 53911 57323 63605 81716 57694 44648 30720 43335 46604 32238
7877 32238 14134 28551 45634 34614 33265 40595 45643 48395 39787 37277 48431 56668 45753
7864 45753 13386 -21890 12405 54197 27993 -16009 -350 -7002 -5549 6670 23710 17004
7852 17004 -29445 -11379 18050 22842 27532 19566 16423 7287 13103 27318 29152 27979 2409
7839 2409 -8534 13725 52713 35973 9819 13609 6179 -8821 1599 12252 15432 12597 28967
7826 28967 44275 42501 28904 30780 48429 44187 4098 -29623 -32695 -22210 -11103 -34228 -31946
7813 -31946 -44150 -26528 -11198 5631 44475 50837 23467 22167 -4588 -3025 -16752 732
7801 732 14882 17217 33477 24304 13669 23856 32148 24140 33097 11963 15384 18416 13412 23367
7787 23367 46020 35330 9403 8710 -18354 -19887 -26539 -18829 -9377 -7348 798 -22406 -31132 -12410
7773 -12410 -3286 -8758 -35316 -46926 -28439 -23074 -31534 -9395 -14185 14725 23939 21589 18119
7760 18119 -22564 -34508 -22347 -6616 17229 11428 19393 55226 77555 82938 24142 11443
7748 11443 13386 -4594 3306 14346 15085 -1249 -3820 -4306 -4759 -22191 -8456 -8187 -7002 8241
7734 8241 24389 26652 -15546 -64410 -68655 -72700 -66493 -58580 -30083 -28801 -31783 -30449 -35757 -35539
7720 -35539 -29059 -10439 -19923 -23478 1352 9139 2116 6740 17441 19261 23937 48122 57339 50512
7706 50512 22615 5518 -15210 -6140 -21792 -29049 -13195 3539 4525 21678 39777 14010 6474
7693 6474 6033 12640 9089 -12753 -39904 -46102 -15280 4857 14547 -883 -20688 -38804 -41033
7680 -41033 -23816 11163 29528 39620 34387 7998 10684 -1312 10955 17154 273 -20549
7668 -20549 4110 -5250 -41552 -51466 -39466 -34122 -11904 -23982 -20557 -17024 -23678 -24443 -23813 10580
7654 10580 -6784 -13537 11871 38664 57539 66903 54440 22940 12053 18006 26157 32585 41547
7641 41547 37161 11117 -7943 -5515 -1943 15042 -6957 -32453 -15380 -37435 -12648 10761
7629 10761 -1276 -19260 -22899 -4755 18184 8578 -10395 -12429 16349 31998 -5111 -14811 -7431
7616 -7431 12837 22316 11346 12517 -646 -10512 2311 21010 21875 15570 26694 35802 24653
7603 24653 18904 34829 39387 28755 -4576 3704 45257 47859 41149 26321 10062 8335 16062
7590 16062 36717 53221 60617 76709 119758 146466 135974 139218 131692 101805 110887 87026 66361
7577 66361 65496 84754 90281 108638 137390 133383 113319 82712 59743 75799 80870 77870 90269
7564 90269 74324 75680 81726 79670 60835 42361 40665 33203 20563 43428 83173 63717 49320
7551 49320 67971 104572 132950 115102 114840 156228 153730 141657 158906 198923 193996 174858 210013
7538 210013 216850 218044 202334 185992 190432 226863 208462 175685 134907 112706 120579 115266 126217
7525 126217 87204 61873 84773 105774 91082 121798 118759 100293 82146 59214 52842 36506
7513 36506 37653 26376 36918 39893 16893 4953 29480 44395 55456 63848 86715 48795
7501 48795 32390 32927 47116 86720 106354 88158 58380 55516 67064 65273 65625 95198 140087
7488 140087 139550 139332 121699 94762 94918 77678 81941 47919 50160 33404 28117 47652 60001
7475 60001 50673 76963 84308 94123 111221 87293 63776 30658 20850 23169 26003 17568 10646
7462 10646 -17466 -16482 -18480 -42321 -34939 -8856 5245 34097 35669 36920 4051 -26867 -7536
7449 -7536 3672 5464 21804 33877 7720 -20956 10800 8557 -29536 -41522 -14991 12281
7437 12281 28294 13315 -13117 5802 44324 43958 36379 33637 7715 -22931 -20648 -19721 -26820
7424 -26820 -36378 -28358 -4016 17892 54439 46768 53521 44669 46031 33698 -13645 -33148 -19602
7411 -19602 -16355 -23353 -2578 3678 -1352 -21103 -25312 -35562 -20306 -16503 3585 18205 11182
7398 11182 5568 -3778 8053 26167 -9762 -18106 -16488 -17920 -8546 -5187 4775 -21161 -14471 -16534
7384 -16534 2742 1640 213 7168 8442 -2166 4353 8510 -6606 -26614 -22880 -7483 1435
7371 1435 21045 39321 49979 30444 8200 15025 14048 23420 11031 -17795 -19919 -23368 -19914
7358 -19914 -18917 -35203 -44122 -54423 -47970 -44990 -37205 -25289 -9162 365 6604 -10411 -32510
7345 -32510 -37414 -19634 -14495 -19384 -23572 -28468 23727 30682 21467 3927 -11335 -17212 1008
7332 1008 32202 23291 22992 1546 1453 8820 20128 656 -17530 -27951 -46957 -44538 -20407 25052
7318 25052 36783 5395 -15760 -4469 -3258 -7365 -19918 -42083 -3665 11199 13894 22558 30753
7305 30753 46101 50128 78122 81083 71904 60801 72121 60593 61515 65772 44652 45437 20175
7292 20175 -3246 -21302 -15762 -8210 7625 5141 3630 -16576 -6526 3976 -7310 -4095 3536
7279 3536 27055 70232 86811 56995 17203 -15442 3337 48167 40072 4243 12856 -3723
7267 -3723 -19959 -22393 -27604 -25500 -30146 -26937 -2597 -4280 -5695 -2510 5826 4918 -10848 6014
7253 6014 3502 -11187 -45439 -27002 5723 26061 22063 26199 5867 3540 -2172 12622 16560
7240 16560 5333 1984 2829 2697 -20378 -23818 20240 12366 -14847 -19964 16061 18804 23891 16972
7226 16972 26520 1287 -9413 -17046 -25476 -15446 -16918 -38290 -18960 4683 4580 -678 -340 -13749
7212 -13749 -40291 -33187 -14831 13447 38635 29550 9356 -17455 -17470 -4689 16786 12489 -11805
7199 -11805 353 13954 -5118 6379 24093 18770 6621 41134 43869 20328 -8946 -29247
7187 -29247 3914 19346 35502 55563 36145 4682 -8346 8498 20806 22226 10397 3926
7175 3926 -20284 -38934 -17044 3324 25431 -6523 -52316 -46395 -17762 -6297 -35283 -33531
7163 -33531 -14886 -8685 5735 9250 11274 19422 -5454 4927 -1431 2 -6988 -29292 -39920
7150 -39920 -35263 -51525 -39628 -47357 -34523 8955 34972 10894 13741 -5596 -4125 7001 -3650
7137 -3650 13894 9496 -10593 -10878 -17998 -11940 -19713 -32362 -32612 -25905 -4445 -14598 -16738 -5467
7123 -5467 13775 24288 -3683 -19325 -3451 1053 6258 14066 1022 7458 23125 29743 14377
7110 14377 13457 -5615 -38749 -42362 -8812 12514 3551 2622 -5924 -8474 13444 20012 -7693 -30136
7096 -30136 -43781 -34835 -20077 7444 1534 -8823 3294 -10278 13249 -12699 -40901 -16674
7084 -16674 8169 -27036 -42576 -32726 -22700 -20120 -35042 -23529 -9366 -14167 -24617 -31121 -33999
7071 -33999 -36187 -40280 -38871 -55376 -60859 -41020 -21154 -34591 -50092 -52208 -23825 -18767 -20290
7058 -20290 -11780 911 -14 -106 -2371 -20643 -25295 -28574 -31150 -12002 -18726 -28183 -14518 -5099
7044 -5099 -9385 -11673 -22581 -20267 -26966 -11667 4230 6108 13341 -6405 -23112 -24602 3764
7031 3764 15491 29784 14770 -12813 -14794 4418 1798 642 -4650 -15132 -22853 -29007 -12840
7018 -12840 -7756 -13654 6600 27792 14879 2140 -24969 -5997 5498 -7709 -6329 4962
7006 4962 -6302 -4815 2450 -501 -10678 -7076 -22317 -17789 8041 33941 38075 25344 19684
6993 19684 30213 20821 8803 -17556 -67530 -62115 -4141 19275 29473 4283 -11879 -31163
6981 -31163 -24708 -24424 -14144 -6749 -35584 -20154 4621 6820 5683 6700 -88 6201 -535 6504
6967 6504 6321 -13347 -10023 -8071 -18538 -11524 13631 24301 13892 -500 3332 688 1174 -9524
6953 -9524 -30631 -48029 -10863 10189 22289 10967 17847 28719 25242 14728 351 -30997
6941 -30997 -37321 -43235 -42019 -23212 -42747 -43898 -39760 -35646 -8542 -8882 -19604 -4409 909 13331
6927 13331 7940 -15183 -9338 -6084 17593 32580 25426 8515 5378 9836 -6232 -13572 -24950
6914 -24950 -12119 13905 3807 14828 43846 13156 -1073 11435 13397 131 21013 23921
6902 23921 42847 33945 36267 36359 21275 2336 -7891 -7529 1056 3334 21725 -258 -10352 -9260
6888 -9260 -13366 -18058 15043 31248 32083 35536 19088 7749 5356 -9896 -10416 -16392 -12038 -1718
6874 -1718 22946 20754 -4423 -27876 -40650 -15227 -12875 18823 29496 11701 565 6877 25800
6861 25800 39562 30156 25376 -11222 -47337 -39444 -17989 -8403 9624 17592 -8501 -60163 -67413
6848 -67413 -42764 14124 38956 45369 66165 74512 63007 39241 43922 42084 20330 20869 19030
6835 19030 15853 6382 40747 23016 -6600 -5386 -1586 19805 -4569 -8880 -14943 -26718 -25400
6822 -25400 -25705 -25135 373 2541 -1676 -13732 -8938 15590 21524 15306 -3027 -17699 -4719 10646
6808 10646 -10037 -54856 -34017 1375 8559 -11709 -16249 -23339 -18889 -33789 -36360 -3856 428
6795 428 -17647 -32003 -31705 -18279 -2428 -2805 8809 12742 -12388 -10572 12142 2950 -3271 -6936
6781 -6936 -21918 -10044 -9042 -17855 -39116 -48720 -8922 22160 -4202 -22822 -23351 -41969 -55818
6768 -55818 -8694 16856 20903 25215 6048 -23787 -31126 -10982 3374 9328 -2402 -18132 -19573
6755 -19573 -28791 2226 -6100 -8705 -2182 18236 41288 38526 -9160 -28813 -17131 -13625 -17052
6742 -17052 -7431 -17111 -29499 1165 -13354 -17654 -21501 -21797 -19818 -45637 -45705 -30795 -24050 -35588
6728 -35588 -8435 4599 -1310 3406 31926 29338 4556 8692 87 686 28321 29983 15490
6715 15490 -12395 -27878 -20247 -2973 3936 5516 9273 -3061 -1315 16416 43814 36987 13940
6702 13940 1286 27746 39398 28412 69319 85532 61145 16964 -20486 -31021 -21162 -21814
6690 -21814 -23207 -12135 2157 3391 20543 5618 6086 7360 25986 26469 19656 -6770 -24984
6677 -24984 -5892 16446 2179 -4396 -26129 -37891 -31199 -3619 -9556 8418 23625 34308
6665 34308 60099 36171 12251 7913 -6845 -24997 -4823 -5301 -1058 -23091 -10562 -88 -11481
6652 -11481 2166 11327 18953 12681 -3815 -940 1243 2998 -4809 2686 34839 43671 22072 128
6638 128 -19030 -20334 -4857 30159 29039 13944 10947 7744 17729 19278 4399 -11788 -38814
6625 -38814 -30450 -34653 -39098 -30408 -40123 -34636 -37851 -29568 2040 11440 -12276 -21507 -8721 25053
6611 25053 7437 4140 26691 18786 7617 31335 36618 45386 58516 57869 34357 3779 12350
6598 12350 30055 -6607 -5228 -12948 -18426 -26662 -47155 -31733 -24366 -44320 -51095 -56037 -52690
6585 -52690 -45736 -47877 -11540 13655 14625 -11071 -17026 -24959 -50174 -36882 -4711 -13544 -40193
6572 -40193 -52485 -41754 -17591 -8428 -13562 -8295 5011 -3384 -34935 -27178 -34545 -49832 -61627
6559 -61627 -48285 -19777 -15157 -27612 -31101 -46451 -28602 -36285 -21856 -856 15142 7087 11192
6546 11192 2743 -11265 2036 1846 15360 26511 21773 13596 -8389 -34542 -17534 -3796 -5895
6533 -5895 -7368 -1886 -12466 -25765 -50891 -34584 -22120 -23372 -23776 -8790 -25800 -47573 -61327
6520 -61327 -56640 -63806 -83545 -74651 -66528 -45077 -44753 -34271 -5940 10405 12138 6394 5721 27563
6506 27563 31848 19970 19297 45596 33421 18547 13174 16803 20525 33806 25634 20823 21679 19315
6492 19315 37832 36640 27936 33777 -5570 -11044 5965 20759 25126 18430 15438 5832 5552 -3363
6478 -3363 -27389 -44394 -57346 -61160 -65443 -50222 -59945 -71790 -79496 -40216 -16044 16275 -4667
6465 -4667 -8525 -4795 -10330 -4296 2361 8828 4605 11297 31121 32878 10578 18225 19165 18015 12707
6450 12707 10523 -1380 -5773 30950 44063 36507 32104 36547 36060 31231 19248 1003 -3678 2434
6436 2434 16131 10223 9541 -8247 13352 2674 -6310 -32346 -22404 12626 -3096 -19336 -18417
6423 -18417 -2336 15676 16463 7383 15091 4996 -8525 17877 30445 7714 20456 6695 -23212
6410 -23212 -35319 -15172 15112 32111 13443 7380 -6377 -12323 -25694 -24381 9282 42646
6398 42646 14561 -33389 -41495 -39733 -20837 21475 27910 18454 24850 29556 -2196 -30912 -38458
6385 -38458 -33922 -23694 -37824 -33631 -30098 -31160 -16093 -4003 -2633 2748 8434 27000 21633
6372 21633 9769 -5869 -15457 -8166 -14607 -30473 -22693 -30726 -24318 -33780 -42313 -57419 -43655
6359 -43655 11577 47695 40918 64980 65774 30464 -5168 22700 32546 36147 28692 -3451 -5755
6346 -5755 3480 10850 -12821 -37853 -60619 -32973 -929 18520 13496 -622 -10196 -731 18912
6333 18912 3457 -4062 -4870 -26965 -33300 -7819 15409 30381 57991 85750 65439 43689 39709
6320 39709 31137 3980 3419 11005 20 3402 2471 -10310 -13552 -15760 -581 -19168 -41133 -35638
6306 -35638 -18023 -12392 -14110 2938 -12394 -13281 -7998 -11831 -9915 -16035 -41362 -60084 -60760 -79928
6292 -79928 -79153 -60491 -29074 -6662 -25767 -14313 -15306 -17150 11303 19366 12423 -18665 -28899
6279 -28899 -17708 10762 609 -6085 8722 17828 18393 18414 20984 19954 9457 -10992 -19498 -29426
6265 -29426 -6473 -618 -33874 -61059 -71256 -46714 22000 28647 2900 -3045 -35056 -10204
6253 -10204 7275 14076 3682 5377 27822 31041 13753 14906 25731 -848 -11519 -23677 -26581
6240 -26581 -10896 -13094 -19281 -29975 -57199 -82051 -38547 -21985 -4750 18925 20951 19667 -3058
6227 -3058 -36955 -5684 12986 10005 -594 -1764 1414 481 -23148 -28905 -11232 13240 24317
6214 24317 770 -891 19272 5274 -6133 -2241 -4484 -11170 -16262 -10424 -8838 632 6188 12851
6200 12851 21671 25726 3234 -13895 -3188 -23286 -40952 -46198 -25838 32373 59933 43929
6188 43929 16235 -1974 -3567 -14935 -18592 -10920 -13866 5901 -17178 -23705 -4303 83 4311
6175 4311 15894 37248 22542 4726 14505 -11862 -17312 -27424 -42905 -45060 -50502 -37449 -6000
6162 -6000 -13210 -23648 -46269 -65708 -57444 -54734 -45112 -42678 -29934 3143 27490 22277 24085
6149 24085 12116 16332 -17819 -38191 -34311 -43373 -72818 -82117 -78914 -46403 -668 10043 13997
6136 13997 -6194 -7034 -5537 1673 53038 68502 60908 52553 43682 12403 2461 19916 2134
6123 2134 -18770 -5740 -2590 -28590 -49585 -14215 -9649 -8920 -31853 -19600 -7584 -16623 -5061
6110 -5061 -25332 -38742 -36989 -23840 -19589 -19091 -13944 -27965 -60037 -62831 -37889 -19012 -19953 -12347
6096 -12347 5890 35495 39280 20440 -18739 -32947 18490 27442 -765 7380 2552 5412 -15499
6083 -15499 -23747 -34531 -33429 -35433 -20171 -15087 10510 47230 42510 7848 -24731 -13947 -2666
6070 -2666 -10366 -23721 -14084 -11182 1066 -6217 -6656 8990 -6228 5463 20524 40542 46992
6057 46992 13836 -22961 -25414 -26324 -14960 -16053 -49573 -56489 -32012 -20318 -19191 -21607 -20654 -5173
6043 -5173 7782 10853 -10237 344 -3582 17818 -21169 -32027 8461 45516 28071 25844 22848
6030 22848 12667 8194 -25301 -27382 -27253 2559 32841 14472 10442 4702 -10635 -11122 -11668 -7012
6016 -7012 4860 -6786 -24073 -30075 -37674 -42874 -63221 -55954 -5097 27981 13896 -42678 -71004
6003 -71004 -45749 -31770 -24660 -1087 26618 14081 29625 39798 31239 3059 -10917 5144
5991 5144 -6638 -8820 -6816 -16761 -30482 -46427 -30913 -24375 -39631 -62232 -66944 -47479 -33756
5978 -33756 -5806 41229 51808 23612 -30640 -46917 -26695 -6101 -5674 4351 10411 27515
5966 27515 49760 23327 -24382 -37001 -38375 -47007 -44834 -22338 -19496 -20127 -24438 -3436 -4472
5953 -4472 14823 11573 -4418 -43814 -18078 2065 11879 9352 22155 1472 -6899 785 6327
5940 6327 14597 -14230 -8367 -16088 -9262 -19806 -20642 2695 -29 -26593 -34311 -21394 -25184 -25987
5926 -25987 -33557 -30019 -17959 -2343 -3580 -35045 -31502 -23142 -39048 -36661 -38918 -59818 -86200
5913 -86200 -63562 -35129 -1359 1093 2977 -11296 5166 17426 6439 -5919 -2851 -16253
5901 -16253 -40446 -45762 -28791 -10329 -7913 -40410 -32482 7114 40491 43054 14747 -8693 -5270
5888 -5270 15880 -13546 -5000 -4227 -2757 -8923 -3888 -11571 -37984 -30914 -36856 -35841 -23602 -37998
5874 -37998 -55529 -42666 -28370 -29466 -15735 -14995 1046 20578 34217 26311 30498 4464 12044
5861 12044 18099 -2477 -6273 6792 -6232 -36945 -35798 -34915 -28583 -25090 -14115 -23685 -35067
5848 -35067 -30287 -23933 -26067 1183 6956 -10563 -47093 -42937 -21341 19626 31298 -381 -8045
5835 -8045 10639 18397 14129 -23509 -6802 27292 47395 36248 23491 -2283 -614 -2922 -15172
5822 -15172 -22447 -14336 -22441 -41733 -59898 -61551 -63072 -65403 -42784 -40498 -59234 -56553 -41026
5809 -41026 -10869 18373 24892 105 -10396 -19514 -2240 -139 -5858 -14604 -31845 -49849 -40440
5796 -40440 -49067 -50786 -49936 -59125 -60394 -50690 -22876 -35663 -53612 -45893 -24594 -3885 8819
5783 8819 9986 5967 -4284 -18357 -34056 -31997 -13347 12701 -10976 -40197 -24413 -3408 -24842
5770 -24842 -17572 -6108 8549 -12100 -18004 9758 -746 9346 1100 -43021 -44136 -41793 -33184
5757 -33184 -33134 -15154 -20515 -31719 -45876 -29638 -19697 906 -3221 -46266 -59647 -17437 12993
5744 12993 26235 38247 36975 12790 3865 -2913 41021 60878 27063 -23435 -26743 -32454 -28906
5731 -28906 -28920 -46901 -8371 -1037 -10239 -16327 -22737 -41586 -42122 -28402 -14361 1003 -20886 -30310
5717 -30310 -29547 -31820 3981 -12124 -40048 -53819 -52213 -864 26287 -11512 -42568 -40299 -34912
5704 -34912 -47702 -48718 -7034 28185 8511 10189 14720 18926 37033 43500 31971 25814 -7156
5691 -7156 -8367 36643 53610 11448 -25534 -44830 -44450 -26074 5531 3743 20960 20791 -13945
5678 -13945 -19433 -12150 8452 -2789 -33964 -8764 -1740 -23752 -35893 -33983 -21237 -20450 -20019
5665 -20019 6166 11846 5279 9444 12561 -14011 -8999 17431 11257 9890 3943 -1522 -29285 -31615
5651 -31615 -26811 -17925 -17899 2844 18972 26549 24174 -14677 -25758 -21834 -23382 -25234 -28626 -33850
5637 -33850 -34506 -27606 -39283 -17565 -16263 -23375 -24457 -29253 -52606 -51298 -35594 -56133 -33854
5624 -33854 -13565 -40075 -38802 -11317 11746 19278 15151 11513 -9385 -12619 2977 -3798 539
5611 539 -10946 2549 12226 27179 6025 -6013 7028 -16579 -7400 -2323 -2633 -15644 -19675
5598 -19675 -17667 -22566 -16620 -29331 -13676 -3475 -1016 -12214 -23186 -11577 -29805 -32873 -17986
5585 -17986 -2464 12034 18036 8748 23536 3306 -9487 -18456 -5379 14145 9789 9818 2144
5572 2144 -27533 -41236 -18541 -4517 -4063 -15152 -13012 -32356 -37439 -38925 -21771 11215 14464
5559 14464 13304 32532 14335 -8319 -15289 -25925 -6805 -5521 -14082 -35296 -38753 -21720 -3722
5546 -3722 1452 -351 -25274 -40480 -25596 -15282 -23599 -9770 -28993 -44785 -25411 -30356 -36383
5533 -36383 -14861 88 -4880 -20800 -21288 -47927 -63211 -52330 -25983 -6735 2685 -2890 -37235
5520 -37235 -53178 -63601 -57467 -56663 -32942 -14597 -7456 1174 -19785 -14496 11995 30569 18685
5507 18685 18859 41491 43429 34927 34447 25319 17004 -5581 -29467 -15307 -10454 -22635 -17849 19307
5493 19307 31793 40816 34920 24780 34186 36798 18506 22526 53109 57997 28203 23446 12098
5480 12098 -642 1144 6922 9875 13078 -12514 567 9789 30384 53916 29387 5246 -7175
5467 -7175 -8549 -9998 11899 21274 -20517 -26201 -19934 -5087 16216 17461 22707 25120 34058 4934
5453 4934 -13525 -14673 -14432 -16805 -11350 2167 7391 2839 28371 30281 15154 8169 -8371 5973
5439 5973 3937 -31793 -40973 -50005 -52262 -60928 -81437 -70333 -54899 -55835 -41023 -28836 -40816
5426 -40816 -34423 -29676 -53679 -27031 -7725 -15989 2750 11827 9445 -7212 -9294 8837 22169
5413 22169 37481 28908 20572 10928 14705 -1456 20711 25364 12105 14888 -2487 -14021 5432
5400 5432 10579 -5683 -28495 -47374 -20179 21987 33341 -23 -20914 -29583 -47518 -50051 -61678
5387 -61678 -34584 -11376 -15522 -28816 -8577 -16581 -39498 -24648 -11012 -17199 -4942 -1382 -4888
5374 -4888 6975 9177 7512 -7115 -11813 7073 34796 39004 32660 29268 26852 16943 18821 18551
5360 18551 -4224 -7204 9270 52430 33614 3608 -4318 -12587 -30952 -23455 -9439 -9921 -10708
5347 -10708 -22811 -19198 -15400 273 11242 -3180 -4427 -1414 -26493 -27706 -9218 17114 17821
5334 17821 14626 39764 27448 2800 -20383 -50106 -56956 -63482 -33177 -6287 -27966 -51921
5322 -51921 -11925 -2602 1346 5017 3071 -19967 -40592 -24985 -17392 -9337 -2378 -7375 -29491
5309 -29491 -58063 -51674 -31590 -14854 -6216 3150 -16918 -28465 -28748 -59001 -80272 -49192 -21996
5296 -21996 6194 21351 1854 -42440 -58804 -57317 -38437 -21477 -16029 -22585 -11628 -11087 -6143
5283 -6143 -24548 -29681 -14000 -20792 -31378 -27535 -18558 -2200 19846 11202 -22983 -31872 -16607
5270 -16607 219 -22617 -4703 -5609 -25191 -11598 14427 15016 16753 29008 46120 47642 27923
5257 27923 28296 19804 8223 19309 21348 17995 -6832 -6869 36015 29097 25173 24779 39629 29559
5243 29559 9117 -8009 -9622 -20129 -17247 -21737 -12926 2087 11309 24091 27595 33206 6166
5230 6166 -17354 -27229 -34368 -32749 -11003 17721 39727 18032 19994 8437 -2205 -6686 -21839
5217 -21839 5140 23195 50547 37631 52075 40141 21421 6854 10693 27036 31395 28184
5205 28184 16451 -292 -31764 -49906 -35049 -12603 9695 11651 -7086 -33831 -32250 -5764
5193 -5764 -6499 -6349 5804 24998 29792 43248 42924 32425 -15362 -47191 -66765 -72352 -70355 -53834
5179 -53834 -53168 -43675 -26428 -8424 -6668 -10423 7339 -11889 -7278 -508 22746 13752 -12714
5166 -12714 -15867 -15002 -969 11130 16708 27168 4443 -11311 18238 18424 25155 20842 9986
5153 9986 -1251 -20755 -35145 -11873 -14871 -27856 -25315 -23811 -15462 11554 33293 27779 9410
5140 9410 -17131 -43193 -49565 -29903 -19444 -52560 -55070 -23553 -4886 5659 -13613 -10610 12765
5127 12765 8370 2410 -13522 -11619 6034 -864 22256 3882 7332 122 -9623 -5535 -12851 -13560
5113 -13560 -25534 -25530 5697 10327 -3510 -14921 -9350 -29434 -38672 -47717 -55822 -45874 -3962 -14932
5099 -14932 -60166 -55457 -29835 -16203 -54 1194 4211 17324 3071 -225 -17114 -25635 -30629
5086 -30629 -16611 -18411 -18465 -23352 -45380 -34673 -16592 -2399 10885 6016 1780 2533 12289 10912
5072 10912 6042 38658 36772 2379 -32926 -27605 -7517 1063 14833 24750 12716 -6572 -4764
5059 -4764 15381 17273 48687 68390 26544 2312 -14217 -10634 102 9894 1865 -4747 -22400
5046 -22400 -325 -2895 -13345 -5086 -16259 -18015 -42584 -45229 -32850 -38342 -32674 -23250 -21743
5033 -21743 -15008 -16345 1032 17460 -1559 -4840 10815 -8556 -17525 4483 8656 -15349 -31907
5020 -31907 -45435 -55904 -41275 -2681 9721 -9970 -33772 -52279 -11906 22937 26277 20111
5008 20111 24590 20103 13137 -23872 -30765 -16781 10723 9951 9905 -4943 -8693 -24044 -33476 -51754
4994 -51754 -53439 -19898 6569 -6914 1519 -9451 -6412 -5756 -11625 -1698 394 21198 17608 -17114
4980 -17114 -17985 28112 21948 27145 11128 -8039 -4798 -9981 12923 -11679 -30072 -40518 -14810
4967 -14810 2768 17872 21772 31752 11743 -7422 -22152 -53024 -50923 -27242 -30173 -42144 -22971
4954 -22971 -17065 -20485 -27026 27980 28100 4494 6638 16812 14552 -5036 -26920 -12311 1528
4941 1528 -22745 -32726 -15733 -35027 -26267 -11704 7410 20918 8283 -17295 -32410 -40752 -35962
4928 -35962 -35573 -27672 -15980 16857 -11748 -44518 -34290 -17534 7978 10326 23506 32361 31891
4915 31891 22514 13297 -856 9677 21421 6839 -1166 -10913 2547 3139 1077 4923 11668 5228
4901 5228 -9221 -8634 -30554 -11474 -29714 -51414 -50101 -24137 4529 19859 3554 5704 -17370
4888 -17370 -11694 -36579 -35103 -18270 -18469 -20139 13414 35352 21546 47441 32240 -14664 -29013
4875 -29013 -32462 -10193 20553 14225 15399 312 -8788 11917 5742 8671 25409 -6902 -33124
4862 -33124 2601 44130 42403 7455 -5015 -36250 -26459 -25622 -23643 -25017 -36483 -48048 -50995
4849 -50995 -35535 -29770 -10063 -11229 -10603 -9365 -20054 -32185 -26842 5900 22323 19585 -4375
4836 -4375 -15765 -6497 4767 14123 22776 6621 -985 -6980 -27511 -20718 -34454 -45680 -35069
4823 -35069 -32937 -20236 -21012 -22609 -49259 -47080 -26758 -15437 -7771 -6888 -14440 -24422 2458 -1782
4809 -1782 -2969 -4360 -8468 -13766 -6035 -17537 -26263 -30337 -40151 -20064 -16836 -3654 2288 18044
4795 18044 35968 37233 9888 -633 26461 25953 33435 32547 28012 32449 36240 29216 1165 20199
4781 20199 35183 29907 19352 -13054 -27752 -47087 -45122 -16657 21890 21638 9335 -14743 -9988
4768 -9988 6042 -3561 -38365 -65680 -53608 -36131 -46845 -30842 -6098 39311 36067 41092 18518
4755 18518 -12477 2449 13011 13624 21468 15081 -27534 -44948 -53152 -50001 -42558 -20913 -5069
4742 -5069 -10616 -335 -5018 -10550 -28963 -19232 -13505 -10874 6535 17257 25350 5966 -22686
4729 -22686 -18713 13757 6553 -7775 -16801 -1015 14850 -7296 -23338 -27445 -23161 -18604 6050
4716 6050 22747 14984 26182 27853 19547 8441 8131 18358 8746 -7474 -11349 10534 169
4703 169 -37315 -40058 -22047 -17490 -6018 -17381 -6231 -7767 -41429 -40789 -4476 14343 18162
4690 18162 33501 32645 26776 4495 -29473 -22253 -46016 -60874 -79446 -65362 -26239 7079 11990
4677 11990 14158 7313 -6002 -600 13161 -1299 33913 46905 34864 9408 36 21789 28244
4664 28244 21238 3018 -35070 -7770 -8339 7305 24388 33202 13415 11172 -2508 -17654 -10088
4651 -10088 -2193 -1656 13375 -1060 4590 -115 -29238 -15836 -16843 -4204 -6532 -14200 -6223 -5643
4637 -5643 -27025 -41138 -20363 -12628 -22488 -41616 -36915 -56145 -51353 -32012 -26213 -12888 10583
4624 10583 8199 -16932 -40198 -56811 -49733 -47067 -28062 -25803 -74968 -72377 -62931 -28244 -5790
4611 -5790 -33269 -27280 1711 -203 15289 42691 38968 -2099 -11962 -27315 -29324 -17167 -20807
4598 -20807 -3660 13913 402 2840 11081 22755 27423 15181 -25109 -27041 -19285 -1041 28249
4585 28249 45374 72448 69341 29068 15555 308 12947 3866 -14808 -25008 -27632 -5309
4573 -5309 20284 -3689 6754 22370 30755 10665 -24442 -40790 -22621 -15266 -26003 -10558
4561 -10558 -8991 -24455 -17899 12838 -8850 -25137 -4435 19292 17483 -16464 -21043 -20172 -6005
4548 -6005 7991 -17493 -42465 -46105 -42872 -52538 -55589 -48443 -60584 -65818 -59629 -28028 -19473 -25097
4534 -25097 -3864 25845 18423 19786 16415 -2578 -52160 -61605 -52872 -46027 -20694 -3891 4673
4521 4673 -6719 -18053 -24066 -7907 268 -14217 -28077 -37877 -25853 -9589 -22877 -25368 16356
4508 16356 45128 33871 17732 14836 6694 -26293 -33433 -25941 -30258 -7033 3413 -34111 -32734
4495 -32734 -19041 -7688 -2323 9067 994 68 -9370 -34844 -16778 -15428 -12446 -4011 10163
4482 10163 5237 37295 66682 57274 2885 -39851 -41349 -30902 -28544 -17857 -11147 -15471 -6829
4469 -6829 -30831 -37329 -33037 -26089 -17542 -16625 -29435 -15906 -33306 -49796 -57081 -48455 -41803 -6048
4455 -6048 15960 -13035 -45511 -35738 -7245 61 -24236 -28487 -32539 -31031 -46835 -28503 -25274
4442 -25274 -22469 19831 13555 -12224 -26438 -16203 6586 -5479 -34806 -34668 -66187 -66069 -58124
4429 -58124 -42902 -24459 -12396 -15701 -15206 -29614 -40812 -26883 -26204 -35342 -33539 -16769 11244
4416 11244 26760 21263 22435 39853 54835 57168 37874 13824 4571 22943 3851 4165 5355
4403 5355 -1104 6708 -5605 -3490 15778 1416 -27357 -39299 -41636 -59890 -38946 -5309 6064
4390 6064 -17666 -7729 10227 27190 16643 12771 -10867 -36743 -42804 -38566 -22057 -5038 209
4377 209 -5334 -12006 3188 18750 15485 14659 940 -3377 -1476 -3188 -11769 -36004 -41245 -56810
4363 -56810 -54534 -52962 -29270 -16115 -43670 -41590 -16141 -8365 -5186 -4700 14304 18254 29701
4350 29701 34814 103 -16454 -26285 -15043 -16839 262 31958 29160 29104 34643 3182 -25417
4337 -25417 -22023 -28471 -48994 -41962 -7028 3382 9604 32890 34464 20731 10760 3859 514
4324 514 11927 7005 10082 1099 -16824 6152 5156 -26090 -47131 -25718 297 21890 36371
4311 36371 35663 208 -19065 -1866 23009 34097 45153 21151 -28678 -37807 -61959 -60498 -41837
4298 -41837 -36026 -19622 -1731 -15968 -15537 -42559 -46575 -16274 -20881 -26469 -11766 19376 27134
4285 27134 12533 -1930 -22175 -34350 -126 -3501 11440 21826 5347 -6457 -19614 -30275
4273 -30275 -19667 -16849 9107 19954 23683 21771 8512 12936 13603 -3152 9144 -12666 -5285
4260 -5285 34928 65226 45486 25569 1404 2092 -8695 -3162 -28098 -34276 -11967 -19330 -30775
4247 -30775 -33177 -47400 -60374 -49276 -48961 -57684 -75627 -74244 -72322 -67282 -35930 -20956 -24616
4234 -24616 -38397 -36370 -45247 -44998 -43567 -31462 -22866 -33149 -44010 -65891 -93356 -96981 -90992
4221 -90992 -91034 -96262 -61360 -39459 -34448 -26441 -27127 -18379 7477 -487 -8568 -17709 -16314 -11792 -32656
4206 -32656 -14448 -530 -1192 -13070 -30861 -28376 -13049 21764 8329 3436 -826 32633 40188
4193 40188 26831 35670 16864 6334 14811 184 -3927 27309 26686 19822 21330 3734 -26851
4180 -26851 -37693 -23428 -12832 10239 8646 4627 18497 15028 28531 52012 78048 64248
4168 64248 46472 21241 4347 4495 19918 1248 -19351 9259 19201 31560 31767 41547 11297
4155 11297 -2096 2026 17501 23956 -13249 -29774 -38586 -36040 -12306 -6295 21022 9848 -5216
4142 -5216 1799 16844 20762 19427 76165 56164 28341 6318 -3893 5255 17380 11609 -5797
4129 -5797 -35369 -55841 -36215 -2623 21238 11109 10073 8973 -6120 -19968 -23089 -40463 -60541
4116 -60541 -30472 -19372 -13737 -25802 -38949 -16610 -7406 -10895 -23049 -37265 -50069 -50291 -39055
4103 -39055 -26630 -39016 -139 29460 35345 10016 -7674 -5497 -9785 -9158 -29294 -21204 2660
4090 2660 4610 -5638 -25982 -25488 -14847 -19723 -33722 -22776 -6052 3457 -3533 -18069 -17919 -24693
4076 -24693 -41647 -36900 -26716 -21551 -13823 -4451 -6154 3277 10504 -748 5547 6171 -36100 -78453
4062 -78453 -69362 -37759 -18134 4099 14946 24269 16631 15465 8396 11216 5573 4081 11576 16189
4048 16189 4552 11872 -339 -2770 -25242 -9540 12783 -19201 -38863 7959 24021 10192
4036 10192 -16530 -48581 -8636 -1366 -9402 -26810 -59775 -49428 -26507 12697 39118 10832
4024 10832 7199 -9576 -7879 3403 -43750 -31792 -20502 -15621 3945 -10135 -18602 -19271 -1413
4011 -1413 15150 2818 15559 25972 18460 40835 26173 25685 20452 -3636 -628 16721 14909
3998 14909 19766 25749 23993 8924 -14372 -22473 -34877 -44951 -29188 -11311 6817 23685 29568
3985 29568 29579 19737 22860 37970 41400 33311 14042 -14444 -60380 -40559 -9507 11895 27382
3972 27382 17834 -40 -17508 803 14544 15340 44413 20462 -26404 -45516 -34931 -39496 -24430
3959 -24430 2359 20041 23071 10730 15051 2387 -10571 -30552 -20699 -30360 -27456 -20096 -5502
3946 -5502 32274 50789 39035 6863 1490 -953 -18746 -7978 -2179 -2362 984 5969 -13010
3933 -13010 529 3590 2967 27445 -6758 -14086 5202 15393 -7320 -31631 -54346 -36401 -21795
3920 -21795 6031 11418 -15448 -45516 -64750 -31561 -20236 -12823 -13399 -4243 -643 1902 7067
3907 7067 6762 17854 1949 -21561 -16992 -24866 -35805 -37892 -15248 1454 1319 -17872 -19918 -29669
3893 -29669 -47506 -15353 9780 28619 15541 12976 15725 -1330 -8786 -6920 -25886 -12616 -2169
3880 -2169 -5974 -23436 -14595 -973 -408 -15221 -24228 -25547 7486 8957 -3153 5428 17262 27917
3866 27917 31208 10666 -30970 -54855 -14664 6636 3868 17462 10954 8218 17865 16248 9008
3853 9008 3140 22086 18887 2317 -9248 -10840 -31938 -35058 -18917 -5787 4342 2880 15372
3840 15372 12451 8681 3334 30775 44192 37501 17776 5949 5423 8430 -8147 7489 20295
3827 20295 38042 50998 23420 23221 53210 41993 15136 9231 49647 79201 57304 20685
3815 20685 16721 19794 33398 32503 18328 -1193 16328 31343 12374 -16148 -19247 2736 -17483
3802 -17483 -27400 -32667 -39925 1926 40231 64416 61128 36342 30529 18592 12165 33847 25776
3789 25776 26375 21846 -2339 -12350 16980 33390 49959 39797 15653 432 17443 28824
3777 28824 29628 24380 801 24237 57810 43994 52754 60374 33474 18232 22362 20592 -206
3764 -206 23966 20146 5293 12891 31927 21737 25876 28623 -3370 6440 4487 2249 -19819 -18669
3750 -18669 -18041 -15966 -37998 -33114 -16181 2837 1889 -13896 1882 5119 -4262 8 -5574 -7733
3736 -7733 -8442 -6826 -13484 -13232 -36832 -32546 -31188 -28672 -29332 -4210 24139 22901 14549 1514 -10099
3721 -10099 -25153 -40296 -36338 -43876 -35449 -14572 -8107 -1334 -11527 -24617 -18395 -4926 -1879
3708 -1879 -38316 -44833 -62669 -43784 -786 -11571 -23090 -8465 31570 24755 34133 40338 17248
3695 17248 -15678 -21612 -2266 14176 -4223 -32358 -17505 5791 24291 38893 20219 -10578
3683 -10578 -719 22226 21149 11671 -8644 -15807 -22785 -33278 -37407 -52587 -71232 -30699 -4866
3670 -4866 22553 28954 26714 35477 32323 24737 9162 -670 -27653 -14986 8055 -4141 -17584
3657 -17584 -13612 -21065 11452 17951 -9790 -38123 -37809 -13551 24705 45666 45819 22853 6715
3644 6715 -10055 -17342 -3496 -6414 -2665 -1748 -1439 20991 17483 -843 -11993 -2928 -1017 -1082 1677
3629 1677 -6569 9314 28515 35546 1429 -21355 -4974 -7173 27923 14315 10893 9632 28408
3616 28408 32588 11746 -31749 -27972 13846 4819 -15624 5921 -6362 430 -33470 -50219 -31024
3603 -31024 -38833 -3729 4085 6258 5231 7149 19744 26976 24888 14503 -802 9362 26461
3590 26461 7468 -14303 -21488 -33556 -40088 -76 45627 50239 12056 2761 -9153 -12885 2641
3577 2641 5383 -18959 -27340 -16276 16817 36383 31227 34060 24967 7072 -13007 -7333 16957
3564 16957 17206 6482 -21304 -45227 -31035 -19822 -23568 -24637 -26370 -37032 -9073 -5124 -30844
3551 -30844 -55051 -73876 -54367 -16174 -7561 4743 -1932 -18366 -27138 -41873 -37038 -18268 -17389
3538 -17389 -28114 -31010 -19097 -14135 -24115 -25356 -30847 -48966 -66317 -74590 -84892 -93166 -66082
3525 -66082 -38244 -30017 -24441 -29343 -31660 -33729 -41250 -59211 -60645 -56456 -36594 -24795 -11861
3512 -11861 -513 -18084 -5978 -21534 -17670 -1190 -19907 -35404 -51295 -54195 -48050 -39027 3120
3499 3120 23027 45751 79364 98636 87852 44197 13987 -6304 -29816 -28176 -39161 -35652
3487 -35652 -26680 -34364 -70145 -88912 -53990 -29888 -4528 -9378 -27574 -33569 -41710 -30682 -19802
3474 -19802 -16716 -15096 6624 24868 22748 2645 5251 19634 13137 30563 31198 3961 -193
3461 -193 1684 -1579 -18214 -2780 -5579 -6530 -16226 -36901 -19389 -4672 -16386 -30639 -39412 -31026
3447 -31026 -13232 -28763 -21468 -3437 -33268 -45429 -51583 -67151 -46716 9442 29065 35355
3435 35355 2944 -16810 -36805 -35667 -25260 -229 27782 18418 16639 27562 45398 29763
3423 29763 -3822 -32541 -42714 -10927 37126 35083 25501 30002 7370 4042 7067 47159 23707
3410 23707 -11216 -12348 -1041 -1550 6502 -13647 -25703 -20309 -12903 -20594 -48255 -45046 -18140
3397 -18140 17920 30070 13669 2965 14437 18228 37870 19684 -15706 -34704 -33261 -16402
3385 -16402 -8087 16241 43172 38694 46251 35576 24037 9453 -3820 14705 10158 16384 29740
3372 29740 47525 25354 24410 11625 -14487 -10019 11093 -14922 -45825 -30253 -8053 -30132
3360 -30132 -51287 -32255 -5221 13116 15232 13958 22215 30149 40905 25635 4104 -16708 -9638
3347 -9638 -17470 -27103 -28075 -31473 -27353 -10101 20977 33554 40582 59789 27841 14456 18757 9133
3333 9133 -5422 -2252 1031 3604 10863 -6748 1547 2213 2651 18027 13415 13407 18957 -11182 -11708
3318 -11708 10142 2989 7124 7131 9300 -8380 -4183 -9124 -12432 -21955 -2347 7573 -15794 -16331 -18090
3303 -18090 -6915 9465 21134 24711 119 4754 -4676 -16623 -5921 -16575 -20476 -23524 16694
3290 16694 25823 11933 5260 -2511 -15083 -22546 -26951 -47042 -62274 -72018 -40733 -21597 -22192
3277 -22192 17724 23419 15612 9176 5677 29926 30306 39031 3827 -31905 -35787 -16467 -4227
3264 -4227 -17356 -39496 -17839 -6632 -17035 -20080 -10382 -33454 -60697 -62093 -24304 -11120 -15605
3251 -15605 -30337 -60143 -67262 -60596 -38715 -29426 -2591 17640 8625 7949 2659 -27783 -56989
3238 -56989 -42069 -29200 -28883 -19665 -11936 -26637 -16318 -29684 -18665 -2009 22656 22333 -6809
3225 -6809 4414 30294 8675 1330 25154 27168 33235 32898 1085 -23537 -28222 -25651 6069
3212 6069 33005 20768 17631 21875 23317 38034 54342 49483 16641 12390 5087 761 10206 499
3198 499 -25176 -23448 -8198 -21984 -15807 -427 -9846 -12821 -4056 4336 7811 12041 -7460 -23235
3184 -23235 -38341 -56912 -20744 21549 7450 -14461 -11830 -19848 -18415 -18294 -15058 -9797 9481
3171 9481 11862 -6053 -923 14101 22134 18783 1960 -2498 -3006 4540 14062 -12398 -5035 4758
3157 4758 35753 41059 42736 52897 55564 39172 21781 -11088 1059 3161 -42 -10944 496
3144 496 26806 29349 16441 13264 10139 5099 3453 -5926 -11221 -16607 -35761 -25826 -16875 -24434
3130 -24434 -17545 -17129 -3654 7143 -12773 -2599 6226 -9863 -35984 -23548 -11511 -17096 -15854
3117 -15854 -4429 12001 34049 27038 10764 -13500 -21046 -31396 -25369 -9584 18000 15749 15527
3104 15527 39189 34527 13626 27131 25578 21923 38920 37325 51010 59088 41760 13042 8905
3091 8905 977 -12387 13721 33781 13989 28712 33291 29940 18513 -1264 -6861 23307 23804
3078 23804 44382 36421 14364 4009 -2488 -14067 10656 15536 19204 14158 10268 2073 3898
3065 3898 -2775 -314 9682 -11179 -10317 19482 47084 33314 26605 17495 -8174 -43113 -62650
3052 -62650 -69942 -36411 -1547 31517 24953 -35330 -61712 -33116 -6980 -26895 -23694 -4590
3040 -4590 -25774 -46376 -45633 -28881 -44143 -44275 -27737 -12822 -8495 -10514 9664 8079 -16736
3027 -16736 -50365 -20733 14509 38415 52954 75219 86218 61627 33671 813 -12976 -54292
3015 -54292 -44857 -28223 -13333 -21930 -37059 -43954 -36527 -15141 21181 30900 -8498 -30949 -44986
3002 -44986 -37840 -28369 -16791 -3322 28137 54671 24926 9056 9387 15734 13064 7261 -7478
2989 -7478 -7703 -10287 -9521 3255 2901 -13015 2793 -5384 -9687 -20956 -31409 -9893 13951 9172
2975 9172 -24368 -40238 -32375 -13077 -5313 4082 21632 3537 -4990 -3721 34421 39156 24309
2962 24309 16411 -309 -19172 -14859 -18771 -25510 -10615 18220 22115 5628 -4252 -1860 21040
2949 21040 31678 28175 -26578 -19203 -1789 -10696 7720 31348 27070 42859 52401 45509 19035
2936 19035 -1934 -23325 -20342 -23149 -23013 -52231 -63190 -50512 -957 42083 58561 87703 73834
2923 73834 24424 -9963 -10764 -17115 -42548 -31682 -14349 -4740 -18595 -34530 -55542 -41307 -59615
2910 -59615 -75292 -61152 -29545 -3925 261 23388 22031 37349 40021 28794 31866 26342 36821
2897 36821 49790 36379 16581 -1685 -31068 -37349 -9772 -10858 -710 30237 23135 -13730
2885 -13730 -30895 -26304 -41845 -38181 -25663 -2406 -21485 -37177 -29764 -17102 -10381 5554 -5821
2872 -5821 -24162 -37125 -7226 10103 -10743 -45364 -58602 -51778 -63916 -34516 7857 -5302
2860 -5302 -24819 -19432 -7524 2947 13131 9879 22490 28301 42688 35281 5530 -23070 -20874
2847 -20874 1988 17046 33976 27658 10985 -10053 -43522 -39497 -14745 1119 27008 16969
2835 16969 -7112 10284 28178 22134 5767 -21980 -52293 -51514 -31394 2406 21363 17656 -6734
2822 -6734 -17134 -18859 -1901 19284 17323 41535 57971 36716 -7890 -6704 13014 3117 -32997
2809 -32997 -15889 -469 20073 2654 -35898 -16834 31321 55612 55998 34309 4027 -8941
2797 -8941 3009 10200 -5072 707 -14083 -2212 13616 16558 23142 42660 58632 39330 27282
2784 27282 57404 68830 30542 6671 -31537 -44038 -27939 10364 -1974 -31929 -53506 -50769
2772 -50769 -38674 -9966 -8050 -63 -20240 -8161 -4271 -5700 -18951 -2204 11422 16301 14490
2759 14490 -11675 -35703 -23349 -11729 -19945 -31577 -16399 -19375 -6199 -8399 -15865 -46628 -22614
2746 -22614 -10283 -32876 -26315 -11037 4421 4716 -7572 -797 -3303 -14076 -11289 -18394 -85
2733 -85 2762 9828 42084 35286 5998 -16826 -14228 3525 13238 5331 -8512 -1693 5015 10381
2719 10381 2897 1953 -6459 -12652 -18975 -16475 1898 -19564 -33901 -19261 -17281 -13659 -11363 -33930
2705 -33930 -13025 -6791 -39922 -51862 -16468 599 28932 50097 34434 -4808 -7544 -378
2693 -378 24361 31356 48209 43882 73757 66313 53671 37527 48895 50142 31856 -289 -7234
2680 -7234 9634 3976 7258 4073 -32612 -32010 -12080 3939 5647 -9348 -17577 -15568 -36673 -18067
2666 -18067 25400 15481 22171 30344 47571 66923 57243 47087 32154 504 2677 -9043 -7283
2653 -7283 -8555 -17217 -13094 6340 -5146 -1477 11468 -15294 -31641 -30466 -31390 -18381 -25719 -43936
2639 -43936 -47635 -30184 -22071 -13005 8054 28656 33282 11708 -8023 -8579 -1057 -15950 -14355
2626 -14355 -29748 -35250 -21476 -16122 -13963 5004 -660 -16797 -18912 -37497 -5092 32667 25838
2613 25838 8848 18470 -1111 -2348 -8532 7584 37382 19888 -5421 3422 7726 6115 6993
2600 6993 -5729 -17360 -25344 -21860 -12643 -13094 -41644 -30812 -16300 3377 801 -12934 -8585
2587 -8585 -12348 -28632 -24373 -14667 -17850 -19552 -3730 33158 34002 44865 15251 -35618 -12338
2574 -12338 6758 23126 3823 -23874 -15064 -11496 -14967 -36286 -20753 -2620 -17827 -58833
2562 -58833 -70230 -66537 -70184 -47202 -16475 -39556 -58564 -40110 -41773 -9872 34708 79759
2550 79759 49399 -2441 -9095 4274 -12319 -38042 -36457 -11149 10657 17926 20148 18911 10916
2537 10916 -9329 -10273 -7441 845 -4381 -10234 -13203 -25802 -41091 -51191 -41488 -42559 -36132 -26057
2523 -26057 -17814 -31861 -21142 -24750 -24848 -19997 -40861 -32518 -30237 -22949 -33009 -45896 -33669 -12536
2509 -12536 -1593 -5361 -13444 -19591 -40316 -58674 -35293 -37842 -29613 -16622 -25507 -31728 -10045
2496 -10045 1456 761 803 -4084 -14980 -7080 -11349 -19890 -15184 -19574 -9534 9283 -1442 -18472
2482 -18472 -34013 -37330 -8654 18184 23809 16125 14569 5775 -18436 -35619 -29496 -51886 -43443
2469 -43443 -17306 8438 2284 -17485 -37134 -24338 -18818 9172 4729 16158 27340 22960 31778
2456 31778 6108 4010 -785 -26798 -41636 -26966 -31615 -23560 -38338 -17705 -891 -9835 -9144
2443 -9144 -17825 -30884 -46881 -43554 -21006 3911 13003 8987 7973 9128 26011 37770 27051
2430 27051 23920 40843 42484 27852 32103 29981 13915 -8057 -18698 -4779 25823 17304 7410
2417 7410 4058 21666 27843 23376 5432 -11156 -19259 -1566 -7490 7540 25820 16267 30765
2404 30765 20244 1316 -19742 -15924 -17007 -7247 11720 3382 -13990 -10359 -21391 -28844 -18343
2391 -18343 -27388 -17847 -18187 -22205 -11043 7447 28101 37199 24437 19936 41350 34262 29984 6954
2377 6954 7034 13846 5827 2578 24104 54956 70258 44315 304 -3246 9349 25631 41516
2364 41516 39257 31784 37591 35104 6607 2335 3225 15149 40416 61112 69667 59930 19928 -453
2350 -453 24261 34408 2345 -20063 -26353 -43493 -62582 -49229 -38430 -33555 -20930 -3697 -8001
2337 -8001 -1715 11773 39221 18374 -8815 -884 14957 18768 4614 -17755 -25858 -39421 -26068
2324 -26068 1373 -6476 -50643 -66852 -38941 -31724 -39897 -45519 -29967 -19568 -12450 -6186 3520
2311 3520 -13704 -50944 -52386 -39717 -20057 -21746 -45924 -50816 -27598 -20221 10282 18667 23163
2298 23163 13615 -19328 -20723 -13442 -246 14525 7496 25009 4485 13624 -9753 -6269 -16705
2285 -16705 -20644 -13813 8114 27228 8949 -8972 -36818 -41825 -38365 -21466 -12100 -1948 16251
2272 16251 19402 26591 29054 20010 -2911 -419 -1823 -11378 3987 18323 1539 -1988 5009 -28013
2258 -28013 -26138 -18839 1373 -4904 25076 9997 3421 7101 4883 -12786 -21621 -19106 -13272 -5683
2244 -5683 -19169 -19191 2244 30327 24627 31684 13450 3868 20211 47650 66087 72309 58611
2231 58611 60727 38100 14298 7482 8533 9442 -2887 14791 51534 68230 57541 29130 -4155
2218 -4155 1419 12688 962 18013 27405 22635 -3976 -21863 -26114 -47563 -58402 -60792 -52025
2205 -52025 -58931 -68856 -79926 -73903 -24307 16676 6767 -409 23569 26807 15444 -9507 13043
2192 13043 10351 -1874 4892 18689 -12013 -17701 -23695 -16991 20404 28385 532 -4627 5406
2179 5406 13755 3294 -14052 -10642 -16409 -6413 3298 -38745 -71374 -76329 -23476 2528 28840
2166 28840 44054 36791 44082 13522 -11854 8682 20565 -19824 -36782 -16196 750 -2779
2154 -2779 -7259 10739 -5188 7013 10137 7354 -17822 -21303 -3981 3972 -16062 4616 3088
2141 3088 -36685 -29389 -13487 41 -21553 -17558 1328 38081 35791 10144 12002 9678 33492
2128 33492 44172 42039 24568 12909 -6348 -22837 9228 20275 -6702 -8755 12591 2288
2116 2288 10874 8302 1580 -1550 17700 30234 40672 24129 4708 2093 -5130 -52 25164
2103 25164 19255 28491 30244 28778 18668 33507 23914 25133 35505 25662 16634 9175 13705 25853
2089 25853 18408 17160 35859 38404 32978 -1990 -23639 -8188 18900 11072 713 -8743 9175
2076 9175 5612 13626 17921 26845 -5687 -24829 -45411 -40534 -18874 6404 8225 12319 1458
2063 1458 -4062 11112 17330 24119 13435 5683 25902 47479 36988 24661 18963 34195 20635
2050 20635 7661 9232 29444 22056 20095 13417 -956 -10956 -10140 6182 24126 42098 23016
2037 23016 4359 16624 -2495 -4421 -158 -27535 -25040 -20645 -33373 -18874 -4433 594 21746
2024 21746 40622 31539 23072 30448 41840 49106 40131 35218 30392 9278 -25368 -13450 -12874 2210
2010 2210 11324 -6354 1673 5313 -6827 -8874 2188 17629 11534 17908 25751 21869 40620 56395
1996 56395 36236 19154 15381 2227 -3751 10393 33917 17818 14951 10318 -6432 -44217 -53563
1983 -53563 -17656 4626 -8363 -17863 1745 -11080 -5473 21560 16161 6224 -12601 -50025 -68756
1970 -68756 -35282 -20496 -31392 -68352 -60124 -28648 -17087 -25505 6627 4179 -28371 -53475
1958 -53475 -30270 -20575 -24451 1381 13438 19743 -5498 -15955 -1971 -22763 -3090 24638
1946 24638 14059 2353 16951 24229 17098 22987 24156 25710 39295 21109 -9185 -5045 11202
1933 11202 -7628 -6329 -11251 -16201 -8650 24657 23173 9568 6862 -21310 -6478 -5902 -1498 -7261
1919 -7261 -4638 -3386 11714 16962 21992 14583 8735 10986 43690 41029 20166 30006 14816 18957
1905 18957 -12318 -36416 -24249 -4177 23865 45096 11969 18036 23792 26563 31233 25808 18978
1892 18978 355 2997 788 -2962 -3062 -4206 -21215 -36070 -27784 -26833 -9509 1101 -8033 -21600
1878 -21600 -5607 7895 30702 23769 14638 21124 6979 7721 13325 -18210 -22218 -3139 3127
1865 3127 4819 25801 46617 72251 66701 44300 22432 15233 13068 25019 13343 -22184 -10443
1852 -10443 7734 1448 -9557 15576 11013 5698 19550 43098 48807 18146 -6247 16655 16280
1839 16280 17496 20975 -75 -9286 -12574 -1982 -5071 -22963 2048 30856 58327 76398 56015
1826 56015 43152 23484 4737 -2983 -7966 -34978 7547 26529 -2287 1423 27326 13848
1814 13848 24999 30367 21402 18310 2124 8803 17636 36907 31787 26749 22664 25580 8682 21240
1800 21240 29896 29169 7386 -1505 14354 15412 -5838 -32269 -64351 -47369 -29418 -18687 -21447
1787 -21447 -15423 -35134 -39157 -13125 -27313 -36651 -39058 -44854 -28060 -2294 14967 19646 -7372
1774 -7372 11360 18259 -14541 -14808 -15147 -12223 -18863 -21643 -34683 -35107 -22183 -14807 -26534 -35991
1760 -35991 -16110 -32238 -41287 -15756 -1177 39541 35354 4936 -10268 -42499 -43003 2460 8130
1747 8130 13394 23924 43970 32286 -2670 -4268 -17394 -24372 -52993 -54658 -14690 25815 22250
1734 22250 4286 21878 24772 15104 21772 24103 -89 -17978 -19726 -28911 -26855 -10524 15979
1721 15979 35466 34323 32560 35010 21371 20904 25223 24799 34584 19664 9302 -4307 -27075 -46417
1707 -46417 -22401 7790 -2979 -21195 -48445 -62835 -44823 -22283 2158 -16150 -11529 4191
1695 4191 16562 -3343 -15499 -1656 -5038 -26067 -16562 -6800 -6172 -14298 -3541 17243 -14785
1682 -14785 -42563 -60038 -45244 -40668 -28927 7897 28827 19759 28429 29082 12767 -8925 -6077
1669 -6077 -24310 -46705 -25951 4932 -1925 -20347 -5733 24207 56662 47552 43046 32093 14909
1656 14909 11303 1234 -14261 17433 35501 -2606 -14384 -22980 -17809 10969 15402 -13056 -47591
1643 -47591 -23051 -28293 24825 46545 33052 23803 6848 21398 23650 10657 2851 15842 15260
1630 15260 -11727 -13804 -3014 1416 5118 16241 27506 5636 3561 9830 16735 -16344 -30837
1617 -30837 -17660 -11398 -2602 2363 -9948 -14081 -18007 -6714 -9035 -42458 -57441 -36063 8032
1604 8032 14979 16522 -9728 -13899 -3043 -4192 -23748 -3544 8780 -4052 5408 13502 23396
1591 23396 35459 22261 4276 12977 20629 12754 10761 1773 18750 8337 38075 51307 59537
1578 59537 57621 37776 24592 19135 33211 16895 -22953 -52992 -42672 -48199 -30373 -2057
1566 -2057 13987 2041 -10865 3718 11525 9682 -4094 11047 5147 -5407 -14442 -13203 1333
1553 1333 21958 35688 41041 40978 26797 26939 -4275 -5480 14805 31724 24699 24255 22445 23306 37928
1538 37928 36447 30864 42527 29577 -6628 -8122 -4 10533 -6881 -7259 15925 -12823 796
1525 796 20444 44005 54323 41628 10611 -5274 -9732 12682 37127 27261 -9808 -27289 -29273
1512 -29273 -44955 -28614 -6919 16133 36931 41134 19579 19359 30684 2967 -4764 2772 33824
1499 33824 18557 8315 13675 23865 24858 23088 18355 24439 47623 52004 45674 62485 51533
1486 51533 52825 36856 20417 -11249 -1220 38508 42720 31301 36479 -6564 -17032 -7688 10996
1473 10996 2760 19040 33321 14555 3777 -511 13458 5765 -16507 -25390 -18739 -12322 -11561
1460 -11561 -24021 -41911 -47665 -28894 -5951 17334 20106 25100 12257 24734 46318 51400 32313
1447 32313 47518 42714 18494 16150 17674 -14188 -47428 -43081 -36862 -33939 2516 -25063 -14351
1434 -14351 29161 56486 71938 52565 36559 47616 47205 35618 16366 7763 25951 48860
1422 48860 24212 -18110 -31687 -11879 -1561 -33402 -66176 -46321 -60140 -59871 -47510 -75652
1410 -75652 -80049 -37647 514 16203 36256 17839 -8179 9962 27891 25970 7374 -6539
1398 -6539 -6147 19092 15637 -6801 19134 35536 34493 26889 -6403 -10745 -1399 1044 22222 34794
1384 34794 -8587 -11712 -3403 6138 8229 -4986 -4199 2384 34418 34098 23120 34551 20045 5967
1370 5967 656 -10214 -22557 -23689 -16739 -20146 -15225 -7052 -99 -804 -19784 -7923 9510 -5431
1356 -5431 -14833 -11869 -11538 9922 26239 -1781 -13927 -11687 -13458 -9888 -6415 -20826 -6713 14391
1342 14391 14490 -3011 -17572 -31934 -42006 -16623 12031 19799 36381 49236 35719 28797 34771
1329 34771 49971 51547 38273 53005 16234 298 17468 41933 42504 93 -20497 -15422 -614
1316 -614 -4262 14250 33258 49064 62571 56936 56205 48423 7629 -8491 -15884 -22535 11534 5956
1302 5956 25296 7397 -10325 -9279 -22805 -34540 -17639 -17050 -17220 -22898 22150 59125 47716
1289 47716 30718 37870 34273 41503 25378 8483 15868 9797 7085 2612 8058 3962 -17408 -28460
1275 -28460 -20854 2877 15449 17081 4605 33458 33501 15777 2984 -2239 8615 4707 1965
1262 1965 14156 25146 41217 27573 6542 -27006 -49164 -40145 -15348 -17368 -18314 -11755 -15010
1249 -15010 -5827 10754 8091 9235 16891 31492 27128 33739 34279 39487 28564 6929 -2980 12072
1235 12072 -173 -14748 3328 17196 23512 25197 45488 50449 9443 -28016 -27703 -31618 -20160
1222 -20160 -6230 3505 13421 26642 10454 18979 18513 -5808 -27847 -10556 12355 20874 -31679
1209 -31679 -65867 639 39559 58115 47073 18260 -12442 -53491 -34495 -3040 -3935 7621
1197 7621 11035 -17053 -21955 5833 28046 9038 -24135 -3531 40258 57050 35399 12268
1185 12268 -1055 -8800 -16600 -16587 -40760 -45469 -61604 -72485 -49127 -43366 -18282 -7060 13229
1172 13229 -1112 20171 34151 29389 19959 31617 35007 2114 -605 22312 4419 6862 13785
1159 13785 16475 21821 14755 -9145 -26055 -30065 2410 25364 -3913 -40718 -73022 -54569 -34695
1146 -34695 -65952 -89015 -70324 -63294 -57786 -53254 -47042 -19808 -6097 6209 52 10228 11641
1133 11641 35643 16254 4917 -6527 -13042 -6930 -19174 16431 33218 5697 10345 6404 -9300
1120 -9300 14411 8125 -19241 -29648 -6146 5902 38853 53490 50772 56977 44936 48472 49117
1107 49117 27036 26500 10161 19670 49441 35325 3422 13607 42512 46939 62720 57212 43674
1094 43674 33464 41061 43276 24546 44945 31017 -11045 -3823 5349 14485 3030 -37053 -35874
1081 -35874 -159 6241 17039 33131 24681 9916 7671 -8060 -10297 -28039 -30654 -25506 -20165
1068 -20165 -35982 -31009 -18726 -8045 -4682 6335 14739 25781 9194 12254 72123 51855 15363
1055 15363 11056 -2207 -5691 -5660 -11742 -2189 480 22719 7251 11366 101 -2971 -9518 -12316
1041 -12316 4958 19152 15219 4786 -7900 -20188 -32292 -44777 -55421 -33368 -25181 -29580
1029 -29580 -23147 -17312 -29510 -27690 -30594 -23551 -32405 -17764 -51081 -49953 -3332 8336 -9180
1016 -9180 -6769 10022 32563 17703 10506 11049 -549 -6758 15456 9616 -24822 -11158 25143
1003 25143 44437 36726 1181 -15814 -5469 25530 18307 7880 13485 5757 7344 15537 32056
990 32056 9072 13923 8266 10823 23126 34803 43347 29907 8048 -22263 5152 22376 13656
977 13656 12034 -7275 -2784 -15693 -65877 -58209 7610 34308 17766 29194 26095 11029 12476
964 12476 32648 40233 34783 4351 -20509 -16972 861 15858 14144 38077 64025 64353 48494
951 48494 41460 33839 40362 52501 41781 38825 37802 5152 -17955 -36101 -32290 -30649 -10084
938 -10084 -20263 -14766 -16102 -3917 6209 33315 56865 44688 26264 1666 -2805 25322 31057
925 31057 11023 25925 32709 14257 5794 -11941 5156 21929 11289 1453 22008 36240 34561
912 34561 2432 -6727 13600 15936 26133 15973 45095 42200 40268 24915 3776 4473 -7036
899 -7036 -10675 7987 27180 54751 59606 24832 9212 23864 22740 24993 28316 48304 50766
886 50766 34413 21717 21603 45363 43316 33091 10403 32889 39873 41006 22171 30752 37676
873 37676 52092 46995 39039 61185 48443 43096 36004 6654 -18719 12051 49440 54627 44671
860 44671 19451 15128 17657 15284 -10512 -36710 -34799 -12572 -7737 10188 15515 -9026 8208
847 8208 27059 40782 38234 23818 30266 37499 18072 -19258 -44539 -18527 -7835 -3301 -1530
834 -1530 -23131 -15417 2853 11679 2922 327 11952 28905 8531 -3711 -23314 -7336 4176
821 4176 -15802 -14393 19849 38195 31610 20006 18130 58238 49070 11931 -4324 29049 46581
808 46581 29785 5751 19360 32065 57063 38737 19799 17119 22807 14953 6577 32320 14645
795 14645 -3203 -1068 12175 20745 30855 59642 52888 20948 27169 25275 -12131 -32015 -25684
782 -25684 -19293 -241 279 -11279 -16317 -28347 -29871 -11686 4240 25124 50181 41390 33526
769 33526 12993 -6402 25246 36074 26903 17249 28538 47616 46496 44082 29755 35039 40731
756 40731 35414 -10767 3029 7543 9464 -3298 7655 22268 46676 43956 28295 28872 22738
743 22738 25177 18208 6899 -23571 -47635 -41902 3876 40342 52864 41009 35823 51474 58220
730 58220 53152 47372 36129 36566 361 -33908 -9395 -10372 -20634 -42034 -37204 -29661 -31 162
716 162 -3571 -7213 10775 1410 -19148 -9218 8926 12237 31979 35587 21032 3077 -3087 5825
702 5825 18543 16964 27153 56578 54363 48406 27796 12587 -9307 -6250 14110 270 -2298
689 -2298 -6316 -6925 30900 54665 62068 66846 70643 64149 53548 29932 13329 26982 33425 22254
675 22254 20966 37792 37173 44998 42495 40937 51347 50322 37945 47871 33209 28976 53884 44709
661 44709 23113 46819 26384 -1023 10218 19456 -18037 -12341 13299 14894 8192 -4885 -5818
648 -5818 -18985 -49468 -26283 -14884 -4452 8339 15797 51488 58650 42746 12150 -3752 -6094
635 -6094 30575 36581 22149 61375 47653 314 7134 33260 38867 26880 11655 5756 13843
622 13843 34445 38656 56931 57684 63604 53903 25701 33127 20225 24041 47611 57094 40428 55819
608 55819 68454 56133 39823 59813 62971 46427 60588 47162 35048 8465 4160 -2583 -10427
595 -10427 17311 23021 19361 24411 33648 34687 14496 -628 14914 24262 -3495 3410 20124
582 20124 10460 -286 -1836 1171 5759 7534 -7014 -16588 217 27697 12713 16490 21653 16734
568 16734 -7078 -5342 12101 -8876 -6697 5422 5955 1455 -28185 15748 18554 23710 36030
555 36030 6808 665 14035 5305 14 13175 16380 -7591 -20924 1839 20567 10620 -9756
542 -9756 -14137 7791 26038 14733 5351 -13962 -15402 13351 32818 28781 6710 19096 10419
529 10419 2972 5564 4045 1996 4979 9606 24955 14718 24657 44650 44719 44018 54673 35733
515 35733 47760 62412 46753 48430 56300 49126 36620 34705 8449 -17261 6444 17428 5092
502 5092 16834 39678 41402 44514 50736 26045 18223 44624 58414 30152 22496 44855 29597
489 29597 6768 15609 -11762 -10948 -8572 7108 13200 1630 -4011 -9663 -15605 38425 59694 42173
475 42173 33873 39127 56527 71924 61999 45686 53010 45409 34663 41404 53929 39088 55680
462 55680 65687 57944 67062 73127 85828 70378 36082 35814 32167 24997 34289 46148 34736 21895
448 21895 18557 14503 28070 29415 759 3733 2910 -15016 -10809 11742 22244 5915 -6183
435 -6183 3495 -9096 -18931 -27571 -1110 6493 13196 1068 -9761 -16093 -384 -11631 9489
422 9489 3309 -2885 7658 2745 11798 -1566 -13948 -14362 -18855 -36183 -10128 24172 35518 21567
408 21567 24440 26354 21759 25908 11516 8921 22396 31871 17857 -5265 13761 13440 29478 21059
394 21059 -4022 6848 25467 41979 63086 50646 26121 6136 -15195 -14035 -11760 -2630 -4475
381 -4475 730 33502 21064 4918 1919 -8895 303 18639 16696 913 17206 27885 47890
368 47890 57948 29644 -6758 22023 14253 4143 5591 25631 34723 37960 15245 29719 49312
355 49312 54549 54130 45439 44260 38141 45113 41924 47069 42593 28630 -7691 -10746 6902 32098
341 32098 50445 61144 49765 16705 18120 14829 50314 53040 62227 57414 33057 15157 16220
328 16220 39921 26493 13000 31726 28614 14825 683 -4916 -10332 -18188 -3430 13113 20234
315 20234 7344 1297 -4164 1879 -12716 -3923 33433 32745 38253 33641 51635 24198 14039 14291
301 14291 14787 22413 17364 45766 63766 51539 13932 19466 52491 55956 35932 28419 34937 21139
287 21139 5109 14136 36044 44339 23125 26012 26223 -50 18425 33125 29058 44855 45151 45484
273 45484 15452 15547 20053 33781 40718 29342 7093 1894 -108 7761 868 2542 1367 -12667
259 -12667 -8548 17824 18811 18892 44615 52709 51046 29028 -3554 -28529 -16519 -17264 32 26959
245 26959 37188 46332 54038 27023 14786 16382 29534 41390 35607 50039 58172 48023 21474
232 21474 -1061 -3783 -7682 13392 16153 22704 45518 62366 39494 40627 43891 23330 10664
219 10664 31810 40192 33855 17949 16540 2076 1834 7264 9489 27178 39117 47216 38732 21524
205 21524 20563 30604 24426 34017 23271 40858 33038 28802 25045 21117 25551 26078 27922 4918
191 4918 -10976 -9835 -16766 -27083 7683 22620 10995 -3394 1144 -6693 4927 19510 30181
178 30181 32585 23657 37901 65634 77383 55271 42408 37718 24134 36428 39728 32596 23447
165 23447 25901 53079 57311 49268 32309 8760 -13638 -10332 5282 19369 37633 57987 38861
152 38861 22829 1163 -265 4727 22355 437 10308 22824 2519 3964 26868 36663 55758
139 55758 60873 33790 2148 -6427 4928 8286 26390 37979 21157 14941 15188 -12256 -22076
126 -22076 -4815 24747 40921 29237 25667 17731 15940 24958 24756 20657 22409 28840 31457 32444
112 32444 20151 18042 9549 8415 20954 31915 2917 -8941 3441 22646 27020 25245 24566
99 24566 8983 6256 23723 43770 30571 35749 40325 40395 36999 23164 17584 19230 37679 36383
85 36383 25481 34670 28587 8581 4612 6120 15945 21263 20730 48286 47933 28676 5798 12562
71 12562 41308 63697 45338 33904 26333 21818 23308 37877 36275 26765 17276 -1977 7334 14804
57 14804 16830 14204 4000 6289 34518 54866 39163 25687 14427 12615 20782 29198 26111 14829
43 14829 4021 29222 41010 17112 -4969 -21669 -18593 14051 12799 12183 16111 19713 17881 9491
$$ [...]
##END NTUPLES=NMR SPECTRUM
##END=
