##TITLE=Analysis number 329641
Compound Code aw 00326
Project Code adrs
Chemist Name aci
##JCAMPDX= 6.0         $$ Bruker NMR JCAMP-DX V2.0
##DATA TYPE= NMR SPECTRUM
##DATA CLASS= NTUPLES
##ORIGIN= Bruker BioSpin GmbH
##OWNER= nmr
$$ XWIN-NMR		Version 3.5
$$ Thu Sep 20 09:22:24 2007 GMT Daylight Time (UT+1h)  MAYBRIDGE\nmr@NMR_250MHZ
##.OBSERVE FREQUENCY= 250.131544655141
##.OBSERVE NUCLEUS= ^1H
##.ACQUISITION MODE= SIMULTANEOUS (DQD)
##.ACQUISITION SCHEME= undefined
##.AVERAGES= 16
##.DIGITISER RES= 18
##SPECTROMETER/DATA SYSTEM= dpx250
##.PULSE SEQUENCE= zg30
##.SOLVENT NAME= CDCl3
##.SHIFT REFERENCE= (INTERNAL, CDCl3, 0, 16.522)
##AUDIT TRAIL= $$ (NUMBER, WHEN, WHO, WHERE, WHAT)
$$ ##TITLE= Audit trail, XWIN-NMR		Version 3.5
$$ ##JCAMPDX= 5.01
$$ ##ORIGIN= Bruker BioSpin GmbH
$$ ##OWNER= nmr
$$ C:\u/data/dgb/nmr/ADRS/1790/pdata/1/auditp.txt
$$ ##AUDIT TRAIL=  $$ (NUMBER, WHEN, WHO, WHERE, WHAT)
(   1,<2007-09-20 09:22:05.53 +100>,<MAYBRIDGE\nmr>,<NMR_250MHZ>,
      <created by zg, POWCHK disabled, PULCHK disabled
       configuration hash MD5:
       76 6E 9A 78 1E 09 19 81 EC 84 63 8F B0 6A 59 2D
       data hash MD5: 64K
       2E AD 18 4D A7 08 CA 98 9E 73 59 C2 B9 1F B3 5B>)
(   2,<2007-09-20 09:22:16.35 +100>,<MAYBRIDGE\nmr>,<NMR_250MHZ>,
      <Start of raw data processing
       ef LB = 0.3 FT_mod = 6 PKNL = 1 SI = 32K 
       data hash MD5: 32K
       45 C9 84 9F DB C4 86 CC AF BC 73 C3 17 B7 4D E4>)
(   3,<2007-09-20 09:22:17.89 +100>,<MAYBRIDGE\nmr>,<NMR_250MHZ>,
      <apk 
       data hash MD5: 32K
       70 88 41 4A 78 4F 43 53 3E EB E8 A1 29 5F B7 26>)
(   4,<2007-09-20 09:22:18.59 +100>,<MAYBRIDGE\nmr>,<NMR_250MHZ>,
      <abs ABSG = 5 
       data hash MD5: 32K
       03 9D 84 01 82 AD C7 AD AA 4F 1D 47 18 62 18 F2>)
$$ ##END=
$$ 
$$ hash MD5
$$ 45 F6 3F 9E B7 6C C7 BF 6D E3 1D B1 11 9E BC 21
##$RELAX= 
##$RELAX= 
##$RELAX= 
##$RELAX= 
##$RELAX= 
##$RELAX= 
##$RELAX= 
$$ Bruker specific parameters
$$ --------------------------
##$DU= <C:\u>
##$EXPNO= 1790
##$NAME= <ADRS>
##$PROCNO= 1
##$TYPE= <nmr>
##$USER= <dgb>
##$AMP= (0..31)
100 100 100 100 100 100 100 100 100 100 100 100 100 100 100 100 100 100 
100 100 100 100 100 100 100 100 100 100 100 100 100 100 
##$AQSEQ= 0
##$AQ_mod= 3
##$AUNM= <au_zg>
##$AUTOPOS= <6 >
##$BF1= 250.13
##$BF2= 250.13
##$BF3= 250.13
##$BF4= 250.13
##$BF5= 500.13
##$BF6= 500.13
##$BF7= 500.13
##$BF8= 500.13
##$BYTORDA= 1
##$CFDGTYP= 0
##$CFRGTYP= 5
##$CHEMSTR= <none>
##$CNST= (0..31)
1 1 145 1 1 1 1 1 1 1 1 1 1 1 1 1 1 1 1 1 1 1 1 1 1 1 1 1 1 1 1 1 
##$CPDPRG= <>
##$CPDPRG1= <>
##$CPDPRG2= <>
##$CPDPRG3= <>
##$CPDPRG4= <mlev>
##$CPDPRG5= <mlev>
##$CPDPRG6= <mlev>
##$CPDPRG7= <mlev>
##$CPDPRG8= <mlev>
##$CPDPRGB= <>
##$CPDPRGT= <>
##$D= (0..31)
0 1 0 0 0 0 0 0 0 0.06 0 0 0 0 0 0 0.0002 0 0 0 0 0 0 0 0 0 0 0 0 0 0 
0 
##$DATE= 1190276524
##$DBL= (0..7)
120 120 120 120 120 120 120 120 
##$DBP= (0..7)
150 150 150 150 150 150 150 150 
##$DBP07= 0
##$DBPNAM0= <>
##$DBPNAM1= <>
##$DBPNAM2= <>
##$DBPNAM3= <>
$$ [...]
##$SUBNAM7= <"">
##$SUBNAM8= <"">
##$SUBNAM9= <"">
##$SW= 20.6930455092707
##$SWIBOX= (0..15)
0 0 3 0 0 0 0 0 0 0 0 0 0 0 0 0 
##$SW_h= 5175.983436853
##$TD= 65536
##$TD0= 1
##$TE= 296.16
##$TE2= 300
##$TE3= 300
##$TEG= 300
##$TL= (0..7)
0 120 120 120 120 120 120 120 
##$TP= (0..7)
150 150 150 150 150 150 150 150 
##$TP07= 0
##$TPNAME0= <>
##$TPNAME1= <>
##$TPNAME2= <>
##$TPNAME3= <>
##$TPNAME4= <>
##$TPNAME5= <>
##$TPNAME6= <>
##$TPNAME7= <>
##$TPOAL= (0..7)
0.5 0.5 0.5 0.5 0.5 0.5 0.5 0.5 
##$TPOFFS= (0..7)
0 0 0 0 0 0 0 0 
##$TUNHIN= 0
##$TUNHOUT= 0
##$TUNXOUT= 0
##$USERA1= <user>
##$USERA2= <user>
##$USERA3= <user>
##$USERA4= <user>
##$USERA5= <user>
##$V9= 5
##$VALIST= <valist>
##$VCLIST= <CCCCCCCCCCCCCCC>
##$VD= 0
##$VDLIST= <DDDDDDDDDDDDDDD>
##$VPLIST= <PPPPPPPPPPPPPPP>
##$VTLIST= <TTTTTTTTTTTTTTT>
##$WBST= 1024
##$WBSW= 4
##$XGAIN= (0..3)
0 0 0 0 
##$XL= 0
##$YL= 0
##$YMAX_a= 351180
##$YMIN_a= -536405
##$ZGOPTNS= <>
##$ZL1= 120
##$ZL2= 120
##$ZL3= 120
##$ZL4= 120
##$ABSF1= 16.522
##$ABSF2= -4.171173
##$ABSG= 5
##$ABSL= 3
##$ALPHA= 0
##$AQORDER= 0
##$ASSFAC= 0
##$ASSFACI= 0
##$ASSFACX= 0
##$ASSWID= 0
##$AUNMP= <proc_1d>
##$AZFE= 0.1
##$AZFW= 0.1
##$BCFW= 0
##$BC_mod= 0
##$BYTORDP= 0
##$COROFFS= 0
##$CY= 12.5
##$DATMOD= 1
##$DC= 0
##$DFILT= <>
##$DTYPP= 0
##$F1P= 14.0000005364418
##$F2P= -0.99999901652339
##$FCOR= 0.5
##$FTSIZE= 32768
##$FT_mod= 6
##$GAMMA= 0
##$GB= 0
##$INTBC= 1
##$INTSCL= 1
##$ISEN= 128
##$LB= 0.3
##$LEV0= 0
##$LPBIN= 0
##$MAXI= 10000
##$MC2= 0
##$MEAN= 0
##$ME_mod= 0
##$MI= 0
##$NCOEF= 0
##$NC_proc= -5
##$NLEV= 6
##$NOISF1= 0
##$NOISF2= 0
##$NSP= 0
##$NTH_PI= 0
##$NZP= 0
##$OFFSET= 16.522
##$PC= 1
##$PHC0= 153.6676
##$PHC1= 4.609802
##$PH_mod= 1
##$PKNL= yes
##$PPARMOD= 0
##$PSCAL= 4
##$PSIGN= 0
##$REVERSE= no
##$SF= 250.13
##$SI= 32768
##$SIGF1= 0
##$SIGF2= 0
##$SINO= 400
##$SIOLD= 32768
##$SREGLST= <1H.CDCl3>
##$SSB= 0
##$STSI= 32768
##$STSR= 0
##$SW_p= 5175.98343685301
##$SYMM= 0
##$S_DEV= 0
##$TDeff= 65536
##$TDoff= 0
##$TI= <Analysis number 999999
Compound Code 99
Book Reference 9
Project Code 9>
##$TILT= no
##$TM1= 0
##$TM2= 0
##$TOPLEV= 0
##$USERP1= <user>
##$USERP2= <user>
##$USERP3= <user>
##$USERP4= <user>
##$USERP5= <user>
##$WDW= 1
##$XDIM= 32768
##$YMAX_p= 403632250
##$YMIN_p= -357428
$$ End of Bruker specific parameters
$$ ---------------------------------
##NTUPLES= NMR SPECTRUM
##VAR_NAME=  FREQUENCY,     SPECTRUM/REAL,   SPECTRUM/IMAG
##SYMBOL=    X,             R,               I
##VAR_TYPE=  INDEPENDENT,   DEPENDENT,       DEPENDENT
##VAR_FORM=  AFFN,          ASDF,            ASDF
##VAR_DIM=   32768,         32768,           32768
##UNITS=     HZ,            ARBITRARY UNITS, ARBITRARY UNITS
##FACTOR=    0.157963299565203, 1,           1
##FIRST=     4132.6476996994, 0,             0
##LAST=      -1043.33573715361, 0,           0
##MIN=       -1043.33573715361, -357428,     0
##MAX=       4132.6476996994, 403632250,     0
$$ Real data points
##PAGE= N=1
##DATA TABLE= (X++(R..R)), XYDATA
$$ [...]
18034H050050m02330k95104k12029l6595J96279M95301O78807O11885Q03201J204433
18024A1093898J927531L406167N881095R566786J5384691K6241973M2997228L9159320
18016A55658689l994168k8926362l0745195k8847904j8810382r702062m230495
18009C0402121m61845L369751Q060623J4917522K6713853M2320335K9683118j3242860
18001A41762618l0664131l1088613k7809741j7228281r206348n348930l673078
17994A6743496k739573k094700j546522j349290j103498p39550n56085o28252
17986E986026p13320o61759n38981m23581l29214j80342r0581j91359k00875j17524
17976B538490p8480J04155J80141m3401k48608k72732l82933k09026J8218j00277
$$ y = [8050050, 7647720, 7352616, 7140587, 7103992, 7300271, 7795572, 8474379, 9086264, 9889465, 11093898, 13021429, 16427596, 22308691, 31875477, 47260168, 73502141, 116499369, 155658689, 151664521, 122738159, 91992964, 63145060, 44334678, 34632616, 30402121, 29940276, 33310027, 41370650, 56288172, 83002025, 125322360, 155005478, 141762618, 111098487, 80009874, 52200133, 34971852, 25765504, 20416574, 16743496, 14003923, 11909223, 10362701, 9013411, 7909913, 7170363, 6614278, 5986026, 5272706, 4610947, 4071966, 3648385, 3319171, 3138829, 3048248, 2856889, 2656014, 2538490, 2460010, 2564165, 2744306, 2700905, 2452297, 2179565, 1796632, 1587606, 1605824, 1505547]
17966A505547l7432o6963o8192j17380p5913m0676r5418j14491Q9069J3458j10206
17955H81403l7049R022M3216J7989l2152P1864N4842N126j15394j50672K0859
17944G69054Q5850P017m7368k4753l1057n0765j17755j1477R6155M4691n0l0240
17932F89302l6918r9774j7040N6872j3669N9832K6490j28272l3519l9022m4128
17921D20154J8068j9454n8801r3950o3752K7789N8249N0903J02955O3074n7889
17910D47346o8367k5917o352P892K0122j8978n0692L024p4173J8663j7598l6599
17898A98371J01330M2153J0295J729K2697Q614l1920n1798O1400m5462n7316N634
17886B65727r1362M153Q9280k986o5052M3880K5800J1111L9752j11168m0555N8581
$$ y = [1505547, 1468115, 1401152, 1332960, 1215580, 1139667, 1098991, 1003573, 889082, 978151, 991609, 881403, 844354, 853376, 896592, 914581, 882429, 954293, 1009135, 1014261, 898867, 748195, 769054, 854904, 861921, 814553, 789800, 758743, 707978, 590223, 578746, 674901, 719592, 719542, 689302, 652384, 552610, 535570, 592442, 578773, 638605, 665095, 536823, 503304, 464282, 420154, 438222, 418768, 359967, 266017, 202265, 230054, 288303, 339206, 442161, 505235, 447346, 378979, 353062, 346710, 354602, 374724, 355746, 305054, 308078, 233905, 252568, 234970, 198371, 299701, 341854, 352149, 353878, 376575, 385189, 353269, 301471, 362871, 317409, 260093, 265727, 174365, 178518, 267798, 264812, 199760, 243640, 269440, 280551, 320303, 209135, 168580, 227161]
17874B27161N9714L4149L6324p2357K7753O9651N0525o6802r0882J0528J44512
17863D30276o363n7176N257J26662J99475K49857L49438L70137K08360R1733j7328
17852A950328l77978k97166k37751j62756j61187j63505j71408l8023l966O4226
17842D00814k7836p5079q2040k1328L67J7301L7469L9118p3981m75M6584m9791
17830B11123p2715m6993k289Q1236L0266K5374M0984j10846r0395O9008J5704
17819A50457J0872m3482M1611J10966K3142q0984K9274m0997m0350J3922J25436
17808B99867O2336l0365n827J01983M5126J60261J92138J64332J70917Q146j18625
17797A050289k61389j34398j11195j22388p7597n9250o624m6097q8075j01945
$$ y = [227161, 286875, 321024, 357348, 284991, 312744, 382395, 432920, 366118, 275236, 285764, 430276, 423913, 366737, 371994, 498656, 698131, 947988, 1297426, 1667563, 1875923, 1967656, 1950328, 1572350, 1275184, 1037433, 874677, 713490, 549985, 378577, 340554, 336588, 400814, 372978, 297899, 215859, 194531, 194898, 212199, 249668, 288786, 214805, 214330, 260914, 211123, 138408, 91415, 89126, 170362, 200628, 226002, 266986, 156140, 65745, 134753, 150457, 161329, 117847, 159458, 270424, 293566, 212582, 241856, 200859, 160509, 174431, 299867, 362203, 331838, 326011, 427994, 473120, 633381, 825519, 989851, 1160768, 1168914, 1050289, 788900, 654502, 543307, 420919, 343322, 284072, 277448, 231351, 143276, 41331]
17787D1331J8338Q8457J09370Q4157j1623N142k2252j94518o9116J0856K1417
17776H1559M5364J6446l7288m7572K424M2523J5245r0530j07332n3102O4701Q8116
17764B0554j346O0985M7844r2426Q9282J53159k3201m5963j8610j5637Q4733m1730
17752B17644j7786L7943L0602k7232p7987l4997L8978j6203O1715o5424m417K0015
17740A62851q269L146o394n8160p2921o2204j37595K5706P8172l2761J00071L6657
17728B8299N0286j09195Q203J5390J1563Q2728k843L4685l8494O013m6540m1780
17716a685N9973N6087p116o4003m9820P719Q3476R7072l9743n7975m5957K6093
17704F4121J5704l8898J2828O9391K8662l5895n2200Q8103o5100j82167m4060
$$ y = [41331, 59669, 148126, 257496, 341653, 330030, 335172, 312920, 118402, 49286, 60142, 81559, 126923, 143369, 106081, 58509, 60933, 103456, 118701, 28171, -79161, -132263, -67562, 20554, 19208, 80193, 128037, 35611, 124893, 278052, 254851, 208888, 190278, 174641, 259374, 217644, 199858, 237801, 268403, 241171, 163184, 128187, 167165, 150962, 212677, 147253, 142836, 162851, 154582, 157728, 151334, 93174, 20253, -41951, -179546, -153840, -75668, -108429, -8358, 28299, 78585, -30610, -22407, -7017, 4546, 87274, 84431, 119116, 80622, 86635, 40095, -1685, 58288, 114375, 107259, 43256, -6564, 1155, 84631, 181703, 141960, 83985, 38028, 64121, 79825, 40927, 53755, 123146, 151808, 115913, 63713, 151816, 86716, -95451, -139511]
17693a39511K1533m78K2877M7296P5609N5038M8292q3154m7986o3163J1736O9803
17681A7892n573K8432P7002r717L3245O239m3514n778l2850j19720K3884j6546
17669d7004P731P2123q351P988r951M4576O9568m7451o0593j3171N0137J06051
17657A71653K4074n6397K7559M0234j387m1873J14424P7104n1044j48595j05386
17646E0366l7144K9578M0373O6614L7623p2163n5574n6345l6794j4276N6731J15060
17634A24049n2817J6157j2293j61789K9558K9557q163o7232n7546O9098J11574
17623B0153L0397j6145J5283l2579L2037M2112N6956K468N5074o1285j7082J857
17611A29246L6111L4765j23184n0137q8236O7509Q1845q20j36058J10854J14304
$$ y = [-139511, -117978, -118456, -95579, -48283, 27326, 82364, 130656, 47502, -484, -63647, -51911, 17892, 12319, 40751, 117753, 108036, 141281, 147520, 104006, 98228, 65378, -54342, -30458, -47004, -39273, 32850, 24499, 32487, 22536, 67112, 136680, 89229, 28636, 15465, 65602, 171653, 195727, 139330, 166889, 207123, 205736, 163863, 278287, 355391, 304347, 155752, 50366, 13222, 42800, 83173, 149787, 187410, 115247, 59673, 3328, -33466, -47742, 8989, 124049, 71232, 87389, 75096, -86693, -57135, -27578, -35741, -102973, -160519, -91421, 20153, 50550, 34405, 49688, 17109, 49146, 91258, 148214, 150682, 205756, 144471, 127389, 129246, 165357, 200122, 76938, 26801, -61435, 6074, 87919, 87099, -48959, 61895, 176199]
17600A76199r2952j1794K0445M7302p0027k1142Q5133K4087m984l4299n7583j69377
17588a08992l2033J13726L1178L4489R8433Q1911K291r5737r0370J2913J1137
17577E8946j8276M6413J02934J1172p7356m5714k3534r986k6351q4616l3320Q8393
17565a1295N6308k745M6548K6866l0735j25242j619j4264N7646M7977J05923J3324
17553A68692m2325J46720K67171K36838K45009J57815p5870k20133k59997k46772
17543C77148k05857o2736P7041L5415L3494P8855P3679K19948J75452J12197j19939
17532G94697j44676j43037k33433r9939o54P2426j17005q2867Q6427l9772p3150
17521A9017j5302k2059K1570K3032K9067r787j6420O6198o1861M2908k0076Q194
$$ y = [176199, 83247, 71453, 91898, 139200, 69173, 48031, 133164, 157251, 152267, 117968, 60385, -108992, -141025, -27299, 3879, 38368, 136801, 218712, 221003, 125266, 34896, 47809, 58946, 40670, 87083, 190017, 201189, 123833, 78119, 54585, 44599, 18248, -66368, -99688, -11295, 45013, 42268, 88816, 115682, 84947, -40295, -41914, -56178, 1468, 49445, 155368, 168692, 126367, 273087, 540258, 777096, 1022105, 1179920, 1104050, 883917, 623920, 377148, 171291, 108555, 185596, 221011, 254505, 333360, 407039, 626987, 802439, 914636, 794697, 650021, 506984, 273551, 173612, 172958, 245384, 128379, 45512, 131939, 92167, 19017, 3715, -18344, 3226, 26258, 55325, 45538, 29118, 95316, 33455, 76363, 56287, 64481]
17509F4481o825J5551K5905j853O220L9588M1993J7989r2299l2485J25258Q0880
17497B84403J34032J51488J29678J56859Q5729r816j86605j55830j45667l6161
17487D08110L3838o6628r9271K5431J8898J10164R8078J40690K7831p2833j40324
17476D83984j17160r0348j17934r6191O2937k2322k6525N4155j40811j2117J2703
17465i629o2632O5051L4871K6560K9971J02332P2099r6637k2546O9028M174o2758
17453A49884l0138M5306m5315n1320O2076L3955j28755P4918K08940M09278K18364
17442I47193l0427k39186k16819j45095k01704j31282K8358O8953L6581k813K6036
17431A39795k8409p730o0114k1590k3422o5321k1241N4317N3684J77000J18339
$$ y = [64481, 57656, 73207, 99112, 97259, 103479, 143067, 185060, 203049, 110750, 78265, 203523, 284403, 418435, 569923, 699601, 856460, 942189, 932373, 745768, 589938, 444271, 408110, 441948, 375320, 276049, 301480, 320378, 430542, 528620, 669310, 697141, 624308, 483984, 366824, 276476, 158542, 62351, 125288, 102966, 76441, 130596, -10215, -22332, -9629, -72261, -7210, 27661, 54221, 84192, 186524, 258623, 161986, 139440, 208468, 212642, 149884, 119746, 165052, 119737, 68417, 130493, 164448, 35693, 110611, 319551, 728829, 947193, 916766, 677580, 460761, 315666, 113962, -17320, 11038, 79991, 116572, 113759, 139795, 111386, 103656, 43542, 21952, -1470, -66791, -88032, -33715, 19969, 196969, 315308]
17420C15308l1676o0586m0948M4638o9363m1753n0438M0833N463k9757p4053m6120
17408c8452N9019J27892m4413K9975J07932q1321o0785m6804j4137l028l6194
17397c16J8396R1800N0991n2571J3435k4635O2074K8778m8480J7609O2656j50647
17385F9090j3558L4569L7728O5638n3871p4927M654N321o8249K6520j0311M3683
17373F6287m7235m7094k7145L398L1391k9224P2742J01917J11989m7321q9245
17362A00460k6015j8690k8486N1691P7556N7091P246K2312n265o7945j34608j05008
17350f9661Q3384Q6036K6858m4990m7309m2556L0060J9301j7328r2633j4672l7231
17338a20741Q0332M2254p005j8276L3044K7307K1399J2778r4414j09094l3192
$$ y = [315308, 283632, 223046, 182098, 226736, 157373, 115620, 65182, 106015, 111478, 81721, 7668, -38452, 20567, 148459, 104046, 134021, 241953, 160632, 99847, 53043, 38906, 35878, -316, 18080, 109880, 160871, 108300, 121735, 97100, 159174, 187952, 139472, 157081, 219737, 69090, 55532, 90101, 127829, 193467, 139596, 64669, 69323, 74644, 6395, 32915, 22604, 66287, 19052, -28042, -55187, -51789, -20398, -49622, 23120, 125037, 237026, 189705, 100460, 74445, 55755, 27269, 78960, 156516, 213607, 220853, 243165, 237900, 169955, 35347, -69661, 13723, 99759, 126617, 81627, 34318, -8238, 21822, 41123, 23795, -68838, -83510, -120741, -40409, 1845, -5160, -23436, 9608, 36915, 58314, 71092, -23322, -132416, -165608]
17327a65608L7710O7246J35996O7773j02837q1931L5626r491p9053N4242R6948
17316E6621K8112k3022p8073j23762o953L2544K1688L5577L1092N0031J515J370
17304B6740j8959p9700J364P032o5840M6427Q3767L3331j9791q4519k7422J00954
17292C384J25944J9647M8523l0421l0987N8668j09659k5124m1639r6430l8347
17281a16441R2076n1179l7207K5370J02178J36148R6678k2954j24701m298N5318
17270A50988K7468o7735p9313L4077K4104K273j06485p5356k1211J283M6910K2450
17258d0547J2665O8798k1335n4031J1828l601J0765M8166o4388r8850j2866J29645
17246a3751o3540m2295J01605n142k7330N4064k4507J6108p8576L2406j3498l1195
$$ y = [-165608, -127898, -60652, 75344, 143117, 40280, -41651, -6025, -15516, -94569, -40327, 56621, 84733, 61711, -16362, -140124, -147077, -114533, -92845, -57268, -26176, 23855, 25370, 26740, 7781, -71919, -70555, -63523, -129363, -82936, 831, 34162, 14371, -70148, -97570, 3384, 129328, 148975, 197498, 167077, 136090, 194758, 85099, 59975, 18336, -78094, -116441, -24365, -75544, -112751, -87381, 14797, 150945, 247623, 224669, 99968, 95670, 150988, 178456, 110721, 31408, 65485, 89589, 91862, -14623, -89979, -111190, -109907, -62997, -40547, -27882, 40916, 19581, -34450, -22622, -26223, -15458, 32708, -31680, -130530, -143396, -13751, -77291, -119586, -17981, -23123, -50453, 3611, -20896, -4788, -83364, -50958, -64456, -95651]
17234i5651j4734J23108M6046m7504q2485j13137n9837K06678J13879K5340K1070
17223A22773M3104m4065M276j39072m3421P4155K2945j1705L3720o9553j05063
17212a11906q9085k2640J43279P7370J7301o767j7027O5045N2630n5389p5361
17201b2550p7740J4683J00289p4188J8101P6592m4516K711M2954j4537l0366Q3755
17189G5188j8934N2333k1008q5028K9349n40K8524M044R3522n5001J5443K7125
17177A45017O2535o8483p3894O0374r5577m6746J38331j9916o6166o5414K7307
17166b632Q136j33770M969Q5234J4175n9242L4373L8415K1994m3266O2152P3541
17154A04079Q659q5652m2190K7489l3168m5900j4668Q492J8955p156L9186q941
$$ y = [-95651, -110385, 12723, 58769, 11265, -71220, -184357, -244194, -37516, 76363, 101703, 122773, 165877, 121812, 126088, -12984, -56405, 17750, 40695, 28990, 62710, -6843, -111906, -200991, -223631, -80352, -2982, 14319, 7552, -9475, 55570, 108200, 52811, -22550, -100290, -85607, 14682, -59506, -41405, 35187, -9329, -6618, 36336, 21799, -8567, 75188, 56254, 108587, 87579, 2551, 31900, 31360, 59884, 63928, 157450, 102449, 117892, 145017, 207552, 139069, 65175, 125549, 29972, -16774, 121557, 101641, 35475, -29939, -2632, 5504, -128266, -123297, -38063, -23888, -83130, -48757, -10342, 11652, -31614, 30538, 104079, 112738, 27086, -15104, 12385, -20783, -66683, -81351, -72859, -53904, -61060, -21874, -30815]
17142c0815j2903m2224J0280P5327K8697L7714r1111o0919O6810O7780L9045l2144
17130E5537m6144j8494o4736k3949N3803m8379J37836Q6877m5116j5244J6107
17119H8098L1181m3890j9962q7013M4199J18331M3600p615n7737P0742L6245m4752
17107A71427k0506n380O186n0028j6441p2244j6324k5024J3261m8224k5832O8815
17095b0314L0739n468p1226l6419L4363M7989R6431P195o5992l686P3829J1954
17083I9395k7385p0026j41427p53N1376o4891j01146J2304P4682P5585N5136k1485
17071e8635J851R9434p052N3716n088m6324J9901M520j12421m1479n197O9265
17059b7509R188l0882P165M8660m2699O2779L1664j2961N1637n3047m7677q2j07152
$$ y = [-30815, -43718, -85942, -75662, -335, 28362, 66076, -25035, -85954, -19144, 48636, 87681, 55537, 9393, -9101, -73837, -97786, -43983, -92362, 45474, 132351, 87235, 71991, 88098, 119279, 75389, 55427, -31586, 12613, 130944, 174544, 166929, 109192, 179934, 216179, 171427, 150921, 145541, 151727, 101699, 85258, 13014, -3310, -28334, -15073, -63297, -89129, -20314, 10425, 4957, -66269, -102688, -68325, -20336, 76095, 83290, 17298, 13612, 87441, 99395, 72010, 1984, -139443, -140196, -88820, -153711, -254857, -242553, -167871, -92286, -37150, -58635, -56784, 42650, 35598, 89314, 84226, 37902, 57803, 62323, -50098, -91577, -96774, -27509, -18321, -49203, -42038, 6622, -36077, 26702, 58366, 45405, 97042, 43995, -3682, -3764, -110916]
17046a10916J44670J65169r364j04964r6866p1589J19458L6069O3511j4076r087
17035A12015p1900l2219j10364n4272K1188O9806j4402Q9143M2291n1625n4131
17024e4470l0472k6140m6504O6213J23517n2059k5733q4713O7545l2807L3825
17013f1798p0724l3005K5481L2534K5043o777M7999m9331k030L7209L3672l2105
17001e3832l9361K2676P7482p2100j43536M474J75038J09168K6923k051J1943
16990A16824l9963l8608O8763M5230j0892K3049m5751q5464l873J9426n7275J2831
16978D297K9143m4935M2999r255K8282J3334k0701m3605o9102l6262M4042n741
16966f7504m1648o1303R6028J35285j9954n7637k7620O9282R5635n5042l459j8966
$$ y = [-110916, 33754, 198923, 189559, 84595, -12271, -83860, 35598, 71667, 135178, 121102, 112015, 40115, 7896, -102468, -156740, -135552, -65746, -80148, 8995, 51286, -339, -54470, -84942, -111082, -157586, -91373, 32144, -19915, -45648, -130361, -62816, -95623, -61798, -132522, -165527, -140046, -107512, -82469, -89246, -41247, -90578, -92608, -55399, -21727, -53832, -93193, -70517, 6965, -65135, -208671, -204197, -29159, 80009, 106932, 104881, 116824, 76861, 38253, 107016, 152246, 141354, 164403, 118652, 33188, 29315, 48741, -8534, 4297, 33440, -11495, 31504, 22249, 50531, 63865, 43164, -441, -69543, -105805, -61763, -67504, -109152, -170455, -74427, 60858, 40904, -16733, -44353, 24929, 120564, 65522, 62063, 43097]
16954D3097n1386L3412K9132r5218M6130o860M4473j7784K0936p2119j9276K0989
16942b4474J2878J7784L8633J9296p5852O3055J23817j7811n6781N9238O9887
16931B29670k4214j26485p2705n5064k8305K0284J01690K8289q282j4520J351
16920E1709J4118r3476m5455L5075m2954n3538M2815k1319J27k3184O859J28887
16908c36L179L6577Q6642L804k4440n6718j5103R1383l8119p9576l3341k637L608
16895b5077P0606J2421M5872n0236o8479r5512J14214J01056j15869j01769j3599
16884a26372O4427O4700J17929l395n7330L5870N64p0464p3770J8902l241k0311
16872e2491J13099J2804l484o1049q4662m324J8883j6474j0606M9318O9213n5589
$$ y = [43097, -8289, 25123, 54255, -40963, 5167, -1693, 42780, 24996, 45932, -26187, -45463, -24474, -11596, 6188, 44821, 64117, -11735, 51320, 175137, 157326, 100545, 159783, 229670, 205456, 78971, 6266, -48798, -77103, -56819, 44871, 73160, 64878, 50358, 51709, 65827, -27649, -73104, -38029, -80983, -134521, -91706, -113025, -112898, -136082, -129223, -336, 2843, 39420, 126062, 129866, 105426, 48708, 33605, 124988, 86869, 7293, -26048, -28685, -25077, 45529, 57950, 103822, 53586, -14893, -110405, 3809, 104865, -11004, -112773, -126372, -61945, 2755, 120684, 117289, 59959, 95829, 96393, 25929, -47841, -28939, -32180, -52491, 60608, 73412, 69928, 8879, -75783, -80107, -61224, -77698, -88304, -38986, 30227, -25362]
16860b5362K0469J12498N265l2368j14374q1639r869M3668q2543J6425N0057k0352
16848a18125J08455J10969K6795j29099n6098O5002j07921p2742J02053L5777
16838c4934n2550j4369O4894j7847o9183J9144R2800J01888j29471O6863J0994
16827C8229m4341r2000J2086l0972q296M4027O1192m5355j01418N0566K4730M3848
16815d7704K5650L3201o3707n825J801J8903L7272L1796o8622p4180J7764K0762
16803g2889n5450k9212o11O4701L0707P0380o1704K407M7514P204j8347q540K367
16790b1473k0126O84n0625m8150O3597J900P8971p171m0381m5888k0322j3087
16778a22071M8729P1102L911N4883m6025p8641L6442J31061L3748m7719n7167
$$ y = [-25362, -4893, 107605, 112870, 80502, -33872, -115511, -125380, -81712, -164255, -147830, -97773, -118125, -9670, 101299, 128094, -1005, -57103, 7899, -100022, -172764, -70711, -34934, -87484, -101853, -36959, -54806, -123989, -104845, -12045, 89843, -39628, 27235, 38229, -6112, -98112, -86026, -116998, -125294, -81267, -20075, -65430, -166848, -116282, -91552, -47704, -22054, 11147, -52560, -58385, -56584, -37681, -409, 31387, -37235, -111415, -93651, -72889, -128339, -157551, -158162, -93461, -62754, 7626, -54078, -51671, -4157, 3047, -15300, -23840, -21473, -41599, -40915, -91540, -139690, -76093, -74193, 4778, -2393, -42774, -88662, -108984, -122071, -73342, -2240, 1671, 56554, 10529, -68112, -31670, 99391, 133139, 85420, 28253]
16767B8253j6404L3782Q3940L1276n5386j9765l3671k4439P5998O5560l7256p2776
16755E9112K2811j2198n1457m6068M3148N3162k045k495l1371j5891o4111l0699
16743g8102N8507Q016j1559p1648m8909j7372L720M1723K9121L0705M2161K4946
16731A1309K0861M7991l9045K1944j9790n579j3334k9156l9565l6088J8905P0488
16719H941k0464L3906N8711M05l0710o714J5701K9211M3367l4261o567o5138j25844
16706i9456k5472j9754N6780R7500p6140o8098J9635Q2190q569N8692L0468p1995
16694b4219p2657k4392J24523P9405o892J921p8881m2837J04807k3704k7776p2383
16682f3085L3337K1360p7540l1832Q1997o703j2282l952P573P2609K8863p987
$$ y = [28253, 11849, 45631, 129571, 160847, 105461, 85696, 52025, 27586, 103584, 169144, 131888, 59112, 81923, 69725, 18268, -27800, 15348, 68510, 66465, 63970, 32599, 16708, -47403, -78102, -19595, -11579, -23138, -94786, -143695, -161067, -157347, -115624, -86503, -55798, -13637, 11309, 32170, 80161, 41116, 63060, 43270, 37691, 24357, -4799, -44364, -80452, -61547, 8941, -11523, 22383, 81094, 81499, 50789, 44075, 59776, 88987, 132354, 98093, 91526, 26388, -99456, -124928, -144682, -87902, 9598, -66542, -134640, -115005, -32815, -41384, 17308, 47776, -24219, -96876, -121268, 3255, 82660, 75768, 77689, -1192, -44029, 60778, 37074, 9298, -63085, -29748, -8388, -85928, -117760, -35763, -42466, -54748, -58700, -51127, 21482, 50345, 42358]
16670D2358m7088j19146M326L2110J01313r784q0229l6652j06294J6438R5951
16659a06697R6856j8948o7172O4573L1760l263p3865m4621L9202Q5242q6325j8914
16647a02172o111L1415L8934N5400k0516m4283q5638p773P3133K713P8601k3614
16635i911k0297m7121j26476k9525Q2069Q8023N4283N4336R1606J32506K3844
16624B93337p6842m7281j06536p1025j08000k4559k7195m3884J12494N4192k2710
16613f8009m8653j3369k8996J7287R5674j0360m1303N128J11041L0758L8202L9360
16601A26760j08783j99951L4115O4491m8150O1442j17793l5441J47621L4496R6028
16590E4835P8096j8153p6756n2608m8862J4025N5326k2931l4423m197j53O481
$$ y = [42358, -4730, -123876, -119550, -87440, 13873, 4089, -76140, -112792, -219086, -202648, -106697, -9841, -28789, -95961, -31388, 372, -2891, -76756, -121377, -82175, 3067, -83258, -102172, -108283, -76868, -37934, 17466, -3050, -47333, -132971, -140744, -67611, -64898, 13703, -9911, -30208, -77329, -203805, -233330, -151261, -63238, -8955, 45381, 136987, 269493, 293337, 216495, 169214, 62678, -8347, -116347, -140906, -168101, -211985, -99491, -45299, -68009, -116662, -130031, -159027, -141740, -46066, -56426, -97729, -92601, 18440, 49198, 87400, 126760, 17977, -181974, -147859, -83368, -131518, -70076, -187869, -223310, -75689, -41193, 54835, 132931, 114778, 38022, -14586, -63448, -49423, 5903, -17028, -51451, -55648, -55801, -49320]
16578d9320L7617j80N9432j6749J8723J6745q425p7759j9879j3502l5151k6845
16566a15293M9228K6432J2563J1170K2062O4493q5810j7164L2280L6055q7582
16555e1566M730K0280R673J196j6690Q121j7283J8478l2882L5654N6598M6604
16543H2913l6368M0968N0736l2265J8837q7663r7905m9071P3508J07788N1596
16532A23074l8807J5421m4497M6159k6402m3057M3830n0125O873j9628M9089n6439
16520E491l9399O8174K1200p4572J1526J9346Q1852j19143j25982P6241l033N5634
16508b2665J1458k5081J20409l5601j6827p668M302Q621M9826J032p3391m322
16496A0093n0686K6619o104r0639k9915j6581k4684R5437m3995m0885l1523J3403
$$ y = [-49320, -11703, -11883, 47549, 30800, 49523, 66268, 57843, -19916, -39795, -53297, -88448, -115293, -66065, -39633, -27070, -15900, 6162, 70655, -15155, -32319, -39, 36016, -51566, -46836, -26556, -16883, -15687, -32377, -24256, -41539, -23061, -55943, -20289, 36309, 82913, 46545, 87513, 138249, 105984, 124821, 37158, -60747, -109818, -36310, 71478, 123074, 84267, 99688, 55191, 101350, 74948, 31891, 75721, 25596, 32469, 12841, 61930, 5491, -33908, 34266, 55466, -19106, -7580, 11766, 93618, -25525, -151507, -75266, -78299, -22665, -11207, -36288, 84121, 48520, 31693, 24025, 28327, 36948, 86774, 87806, 14415, 10093, -40593, -13974, -20078, -110717, -140632, -157213, -181897, -86460, -130455, -171340, -202863, -189460]
16484a89460R8709n041m3850l5629r9404r239J01776L105M1524Q7771J6860L498
16472b9380J8312l4218j18194j1821N6169R957K0388L0512p5611R987L7507j2037
16460i8429N6651o721l8897j0284k8102L3818J7005r3951O8035J44509M1828p5191
16448A0271q4533O271J01399j2176o7237j5012Q780l3297n935q56J29565P6972
16436A14212N27J0564k4119q7739j5149K8238N8280r2885r9513q857N4820L1270
16424c0351j21606k2351L3727Q4959k4619l7873J28462j6720o6559L0824M5688
16413C581J09787m8251o5213o8502j0489O0021M3853k5996k2878O8794J0125k6845
16401B7987k99J05032j0064j7196m927o0053Q638j7751o5812l176K4348J2251
$$ y = [-189460, -90751, -95792, -139642, -175271, -274675, -283914, -182138, -179033, -137509, -49738, -32878, -29380, -11068, -45286, -163480, -175301, -119132, -109175, -88787, -58275, -133886, -123899, -86392, -98429, -41778, -48499, -87396, -97680, -125782, -91964, -74959, -168910, -100875, 43634, 85462, 10271, -74262, -67991, 33408, 21232, -46005, -61017, -52237, -85534, -91469, -92325, 37240, 114212, 114739, 125303, 101184, 13445, -1704, 26534, 84814, -8071, -107584, -116441, -61621, -30351, -151957, -174308, -140581, -55622, -80241, -118114, 10348, -6372, -72931, -42107, 3581, 113368, 65117, -96, -68598, -79087, -19066, 24787, -1209, -24087, 44707, 54832, 27987, 27688, 132720, 122656, 105460, 100533, 40480, 49118, 31367, -34445, -37621, -13273, -1022]
16389a022j4319N9774J16315J5039r9895j20933j2880K578Q253M183M3845k2604
16377b1666N5842Q8854o759l0942l0647k083K1637O3143o4316j47619q1621j6363
16365a72540j2813q272J16311N7850P691Q2382q3819j08968k5586J8563Q816k5888
16353a46273K6622N5970M5002M6381L1872O9699j28430o7653k763J05285N3139
16342H8851k4537k1412K8872J0290n4911k6636L1269j5580L8669J5852j00401
16331b9674k2149O6130r0700P532K8342J26345r862j49360l7404O8908J7631Q0511
16319E6250R7613j6886m8905n0186j5126m0341l5814J6653J1925k9863P6742R9010
16307A21072l2668M2852l2401K261J6142j31552l9760O225N4902N6817R720N8793
$$ y = [-1022, -15341, 44433, 160748, 175787, 75892, -45041, -57921, -55343, -47090, -42907, 938, -21666, 34176, 123030, 116271, 85329, 54682, 52599, 74236, 137379, 73063, -74556, -156177, -172540, -185353, -193625, -77314, -19464, -11773, 70609, -13210, -122178, -147764, -129201, -120385, -146273, -119651, -63681, -18679, 27702, 59574, 129273, 843, -66810, -69573, 35712, 88851, 64314, 42902, 71774, 82064, 27153, 517, 31786, 16206, 54875, 70727, -29674, -51823, 14307, -76393, -68861, -40519, 85826, 75964, -73396, -110800, -41892, -24261, 56250, 153863, 136977, 88072, 37886, 22760, -17581, -53395, -36742, -24817, -54680, 22062, 121072, 88404, 131256, 98855, 101116, 117258, -14294, -54054, -47829, 7073, 63890, 73610, 132403]
16295A32403p5474J8182K5397o0533L519o1736m4066O1472M6963l8689k2529J10641
16283I5550L5599n1095n2962J9713M9467J8112K344Q858M4598j53274l0870n3733
16271f7693l5941M6414L0167L8417k8271K3571j7458m7503j0422J44715l6096
16260C9900J7140K279p6754j9358R2298P3248P2789L3509r7141j12197j7493J08676
16248A16896P7592o3423o2591l3087M6291J7431k623K941k1739r3060N60P5648
16236F0836q4639N070J36504J26386r7822n7196j3815L5822m3032r9524p6556
16225a07966j9408J15441J39600K9626o7195r8637N2P7745J9744p2036p7204K615
16213e7623J0497M0846O9978K6343j05421q4148J25811L2046j7927J5941k431
$$ y = [132403, 56929, 75111, 100508, 39975, 43494, -18242, -62308, -836, 46127, 7438, -15091, 95550, 131149, 80054, 27092, 46805, 96272, 114384, 116728, 125586, 170184, 16910, -13960, -67693, -103634, -57220, -27053, 11364, -16907, 6664, -10794, -58297, -68719, 75996, 39900, 57040, 59319, -17435, -36793, 55505, 128753, 201542, 235051, 137910, 25713, 8220, 116896, 194488, 131065, 68474, 35387, 81678, 99109, 96486, 99427, 77688, -15372, -14812, 60836, -23803, -18733, 117771, 244157, 146335, 89139, 75324, 111146, 68114, -31410, -107966, -127374, -11933, 127667, 157293, 90098, -8539, -8487, 69258, 89002, 16966, -60238, -57623, -47126, -6280, 63698, 90041, -15380, -99528, 26283, 58329, 40402, 56343, 53912]
16202E3912L0842p2780r3726l6086n5276n3107Q1968J41689K7117M0704q6565
16191b1308q3972p4882L7091J04991N5868j04251m9513L2309M4468j9227J7533
16180f0893Q3408L361M774o448J7316m0245J5589K7092J9575j3643J7592l6913
16168C0565j4029o3954K7979q6977j06641P4790J38755O0273l4899m022K9503
16157E1343p1273j08792k7740J79191J1340r4219j0829K1612m1851N5727L5852
16146C61L3841o2753J8719J4657n6596L921M6337K4599J6061J8875m2165m0216
16134b4359L0674O173K7893Q471p1591k3768j9088m5851N2997O1852r9884n0877
16122a47358K2077L5921J37970J10294j33968j02058k9292J06999k0889p4622
$$ y = [53912, 84754, 11974, -81752, -117838, -173114, -226221, -144253, -2564, 24553, 65257, -21308, -105280, -180162, -143071, -38080, 17788, -86463, -135976, -103667, -59199, -78426, -60893, 22515, 25876, 30650, 24202, 41518, 1273, 16862, 43954, 63529, 49886, 67478, 30565, 16536, -47418, -19439, -106416, -213057, -138267, 488, 60761, 25862, 21840, 51343, -19930, -128722, -156462, 22729, 34069, -60150, -70979, -49367, -91218, -35491, 361, 34202, -28551, -9832, 4825, -51771, -47850, -1513, 23086, 39147, 58022, 15857, -24359, 6315, 12488, 40381, 48852, -22739, -46507, -65595, -111446, -58449, 3403, -96481, -147358, -125281, -89360, 48610, 158904, 24936, -77122, -106414, 585, -20304, -94926]
16112i4926q3617p4614o40K2324O5281R6676J30906K4446R088n5170p2124j4767
16100d7137k154L776M5310R638j1563j1116r271M5735N1663j0386r853J4928j9487
16087E0083p881l0854l716O6547j863O2775m9590j11024J6751m998L4752M8445
16075F9427J0688k5208l8133l7971J6389j1341P7517p6217n5944j6436j1990k0002
16063a19221R7371k8640p0992o5500J941J70321J06616n0451l8414m7236L4571
16052i634Q1729O0989O282m5692m3192q6092k8551K9431O4973q901m8451m3465
16040g0574M4110L4684P3716N6346k278O99K237K2312r0613m3873j0334J2035
16028B8467J5106l3316M9266J08593m0381K8327q9865r1750N6300J7601q4224
$$ y = [-94926, -178543, -253157, -253797, -231473, -166192, -69516, 61390, 85836, 94924, 39754, -32370, -47137, -49291, -45515, -205, 9433, -2130, -13246, -22517, 23218, 74881, 64495, 54642, 69570, 50083, 42202, 11348, 7632, 74179, 72316, 135091, 85501, -25523, -8772, -13770, 20982, 69427, 80115, 54907, 16774, -21197, -4808, -16149, 61368, -14849, -70793, -87229, -99219, -119221, -21850, -50490, -121482, -186982, -185041, -14720, 91896, 41445, 3031, -44205, -9634, 72095, 133084, 139366, 93674, 50482, -35610, -64161, -34730, 30243, 21342, -27109, -70574, -26464, 8220, 81936, 138282, 136004, 136703, 138940, 161252, 70639, 26766, 16432, 28467, 43573, 10257, 59523, 168116, 127735, 156062, 66197, -25553, 30747, 48348, -35876]
16017c5876l6697O2184O1494J3229K7776k9512k6039L2918N1897m0722q7570l2564
16005c9482P6957P5229K5350k6873n5644l5545o291j8199n7138k7509M4726k998
15993d7417o6377J18956n0176o0018J20678M8964M1320j5106k9865j64598n0990
15982a54629N9793N2219M7512J3489l9212o5890Q5123J00869P7897R070n3978
15971A32263j44556o0905O8380R7173O8056K0797j30984m9862j1987m6389J13568
15960E5554J5659n2313J8725J21P0801K9888m2419k6432k163M3701J5464L5362
15948A61948o0257j52735m4608J06570O8988R040k6174r026j9139q3736k4148
15937g3277J5342K4232K9679n8336l841M3856J07801L8465p8731n3391J5983J09126
$$ y = [-35876, -72573, -10389, 51105, 64334, 92110, 62598, 36559, 69477, 121374, 80652, -6918, -39482, 37475, 112704, 138054, 111181, 55537, 19992, 13701, -4498, -61636, -89145, -44419, -47417, -113794, 5162, -45014, -105032, 15646, 64610, 105930, 90824, 60959, -103639, -154629, -94836, -42617, 4895, 18384, -20828, -86718, -1595, 99274, 177171, 186241, 132263, -12293, -73198, -4818, 92355, 160411, 181208, 50224, 362, -11625, -58014, 55554, 71213, 18900, 37625, 37746, 108547, 138435, 96016, 69584, 67421, 111122, 126586, 161948, 101691, -51044, -95652, 10918, 79906, 88946, 62772, 53746, 34607, -49129, -73277, -57935, -33703, -4024, -62360, -66201, -22345, 85456, 123921, 45190, -8201, 7782, 116908]
15925A16908J4023O371l5329M8356p1282k3496n9996l1426J7821m6161k1118Q6925
15913A596J0847M3075j7134j2930r5265l882O1443R527Q9031P518n781O1819K40
15900A50104q6541o975K3393p4519R5862j1575k6217M985j4503l8240j1106J4240
15888A8908K6725N995J4881k4451J6505O939k7176M1101p0368K7823O9650k6743
15876G9789m8044J0639P8971j3084K9233k0817j01629O847p229M372j05086O169
15864g9869M480j4559R1057L9412J06827N3559K1881P8607O5651j33279m9994
15853A83773n5449p7851K7426m6609j9362J8374j6342o691q5333r275P2154M2580
15841B7395M3431o6435p7335j9306o9440n1979N161M9042n2826R0868M9295p0070
$$ y = [116908, 130931, 137302, 101973, 150329, 79047, 55551, -4445, -35871, -18050, -64211, -85329, 1596, 12443, 55518, 38384, 25454, -69811, -73693, -12250, -2723, 86308, 93826, 88045, 149864, 150104, 63563, 56588, 79981, 5462, 101324, 89749, 63532, 68517, 54014, 15774, 4668, 18908, 45633, 51628, 66509, 42058, 58563, 65502, 38326, 79427, 9059, 36882, 106532, 79789, 31745, 42384, 121355, 108271, 137504, 116687, 15058, 21905, 14676, 19048, -86038, -79869, -75389, -89948, 1109, 40521, 147348, 200907, 222788, 301395, 367046, 233767, 183773, 128324, 50473, 77899, 31290, 11928, 30302, 13960, 7269, -78064, -87339, -15185, 27395, 70826, 4391, -72944, -92250, -161690, -213669, -208508, -159466, -212292, -121424, -72129, -142199]
15829a42199j270L8615J4132K077o0657q965K890O880K2091R4480P5085l8227
15817D932l3213j5801N2818M6264o0941J415M3919p7386M1217N5434L15L8081
15805I7054K7741N7460P9247K2790r1365j16892p7726j7774k9253j5758J46765
15794H2289k4644m9378J235Q8019o244j11117R979N2419q9745j11688M124M3555
15782a11196L1097J01893R7655Q7264j0787j35135j34936L9336L1531J6523k2504
15771i259l0228l1565K2072R764Q8660J9945p7074j9043l0888k6643j3480l3987
15759a31726m8045Q7710N3332J8747N1358j8520K285O1044L0312l9116j3068m0359
15747A3954o3877k2240P7252m4541m8631q1441M0196N2060J4898O4850P6780Q44
$$ y = [-142199, -143469, -104854, -90722, -88645, -149302, -158267, -155377, -148497, -126406, -31926, 43159, 4932, -28281, -44082, 8736, 55000, -5941, -4526, 39393, -37993, 3224, 58658, 58973, 97054, 124795, 182255, 261502, 284292, 192927, 76035, -1691, -19465, -48718, -64476, 82289, 57645, 8267, 9502, 97521, 91277, -19840, -9861, 42558, -47187, -158875, -154751, -111196, -80099, 21794, 119449, 206713, 195926, 60791, -74145, -34809, -3278, 13245, -9259, -39487, -71052, -48980, -39216, 49444, 69389, -7685, -26728, -57616, -84259, -97739, -131726, -179771, -92061, -38729, -19982, 31376, 12856, 15141, 76185, 106497, 67381, 54313, 13954, -49923, -72163, 5089, -39452, -88083, -169524, -129328, -77268, -62370, 2480, 79260, 80104]
15735H0104r0951o6168k3195j1330l9136N5345L5741k6387m2995L7266M7972j1500
15723e5234m1229M635J6626l0372L8857O3733L6231n7610l0667P8503K1887n9357
15711a3997j57236k6535N1858J48603K1862Q5839J991o6594J7113p257n0881p888
15699c122M6089K7473k2178m0873n4370K6115R2577K5134j32739l0454n242r9134
15687a70724k1185P3478N7057o645P6864l2282K3119j03131k4269r916k3345K1904
15675a39075r265n2781k6837R9078O8657k9193j6948Q2611J44117Q6254j79627
15664B6991r5609P5224J04681O4572r2904j04753k3126Q5635N218j5715j1523
15653A8691k6161P4174K8214J6259J7995j4074p1491o3907Q430N0723k8643j24035
$$ y = [80104, -10847, -77015, -100210, -111540, -150676, -95331, -59590, -85977, -128972, -91706, -43734, -55234, -96463, -91828, -75202, -105574, -66717, -2984, 33247, -24363, -55030, 23473, 45360, -13997, -171233, -197768, -145910, 2693, 24555, 110394, 112385, 45791, 62904, 55647, 4766, -3122, 42967, 70440, 48262, 7389, -46981, -20866, 71711, 96845, -35894, -66348, -71590, -170724, -191909, -118431, -61374, -68019, 8845, -23437, -318, -103449, -127718, -137634, -160979, -139075, -148340, -201121, -227958, -128880, -60223, -89416, -106364, -23753, 120364, 206618, 26991, -68618, 6606, 111287, 175859, 82955, -21798, -44924, 40711, 45929, 30214, 18691, -7470, 66704, 94918, 111177, 129172, 115098, 43607, -20300, -11870, 38853, 10210, -113825]
15641a13825m8109L5636Q766R0633l8921P3797r4796q005J14148M7511n3183K7263
15629D0915O3393L9205M0194j3948j50750N10j8410q4727l1042J10114K5733N9725
15617H0912p4057j8210n2975l6181l7703P7494N298R7833L6193M1042J08313K1135
15605B49094j00305n4281k9472j10050p2238K0884J9525O8415J4518l1252o396
15594c1558j49366J4268K1848N8529K8381l9299r525P665P2507P7358k1192J9155
15582D8771o890l430q3783K7451r85M3772L7464j0732p1729L5774Q7305j7887
15570H5101o013k0825K9998J9396o8773j20033J9403K2697M3796M3007O0515L6249
15558A44518n062P840o6564l4250m0829N3866j3117r1282j3689P8926J14343q4412
$$ y = [-113825, -161934, -126298, -117532, -26899, -65820, 7977, -86819, -94824, 19324, 66835, 13652, 40915, 104308, 143513, 183707, 169759, 19009, 19519, 1109, -83618, -114660, -4546, 21187, 80912, 6855, -11355, -64330, -100511, -138214, -60720, -55422, 42411, 78604, 119646, 227959, 249094, 148789, 94508, 65036, -45014, -117252, -96368, -76843, -8428, 6090, -25162, -31558, -180924, -166656, -144808, -86279, -57898, -97197, -106722, -99057, -26550, 50808, 29616, 48771, 41881, 38451, -45332, -17881, -18866, 24906, 62370, 51638, -20091, 15683, 102988, 85101, 79088, 58263, 88261, 107657, 38884, -81149, -61746, -39049, 4747, 47754, 108269, 144518, 139456, 147296, 80732, 46482, 5653, 59519, 46402, -44880, -58569, 20357, 134700, 50288]
15546E0288n4551l9867M9264P2133O7009n1833k6629m6736n1999q3508P0078j7213
15534f3564o7607M4616P9545j8045N8298N1973q0437o1908Q8080J10604N1116
15523A92671m0468R733o2415j4618p572l505j7552q4406n0337L2773m542N3898
15511C660P1317J5025p6565l5565K3885J00981P3493l5678J5600j2339j7941n8467
15499F7406m6183n8148r5896N6861R7860J21947M3593o8355k7226r826N8298J3794
15487A54125j00403j3618j6477J03845M9310j75632J8736N487J4822m2464j5530
15476a7799J2675p8797N2181O8167p861R0389Q580K1655n9342n5943j8983k0015
15464e093k513l2256l6948J9390L7300K7466O6999J4276M4249K8986r5897L9292
$$ y = [50288, -4263, -44130, 5134, 77267, 144276, 92443, 65814, 19078, -32921, -116429, -46351, -63564, -131171, -86555, -7010, -25055, 33243, 85216, 4779, -57129, 30951, 141555, 192671, 152203, 161936, 99521, 84903, 77331, 73826, 56274, -28132, -78469, -45696, -50238, 3660, 74977, 90002, 13437, -22128, 1757, 102738, 176231, 140553, 156153, 143814, 125873, 67406, 21223, -36925, -132821, -75960, 21900, 143847, 187440, 119085, 91859, 82033, 140331, 154125, 53722, 40104, 23627, 127472, 176782, 1150, 19886, 25373, 40195, -2269, -17799, -5124, -83921, -31740, 36427, 28566, 118955, 127535, 149190, 89848, 33905, 14922, -5093, -7606, -39862, -76810, -57420, -20120, 7346, 74345, 88621, 132870, 161856, 65959, 105251]
15452A05251n5527m4334l3841n2679j0833K4875O5597J3526K2588m0311k6344
15441c2032M481l8753M9381Q0115l1272j7592n5883m8686p8659j1828J00628j5415
15429i5515L0774K8919k4832l0691p6520p2664r6510P4248J22979M8254Q2137
15418i421P7657k7000j5060n3025j054K1899p2068j0779n1494k7980J53300M0478
15406B5453O424M3846n734q4440j2945N2537N1975N2725n5625n5805O7257J6915
15394A02583l9104L4678l6989j1757O1495j2928m2360q276p8833N935O3347j05575
15382f7784m7305j2320P050k5642m203R8913R2851K0838o394n0738K7939Q9973
15370A23178L4120j26850o9445j04484K1433Q5026J0024O3085K0332J3k4364r0012
$$ y = [105251, 49724, 5390, -28451, -81130, -91963, -67088, -1491, 12035, 34623, -5688, -32032, -27551, -66304, -16923, 63192, 31920, 14328, -41555, -90241, -168900, -180728, -80100, -95515, -64741, -35822, -60654, -91345, -167865, -240529, -337039, -262791, -139812, -91558, -9421, 68236, 41236, 26176, -26849, -27903, -6004, -78072, -88851, -140345, -168325, -15025, 25453, 31877, 75723, 69989, -14451, -27396, 25141, 77116, 129841, 74216, 18411, 85668, 102583, 63479, 98157, 61168, 49411, 110906, 97978, 55618, 47342, -31491, -25556, 37791, -67784, -115089, -127409, -120359, -146001, -150204, -51291, 41560, 62398, 56004, 5266, 33205, 123178, 157298, 30448, -38997, -143481, -122048, -37022, -26998, 36087, 56419, 56432, 32068, -57944]
15358e7944j4115N266K982N0221N2967N0639n4734r9985o051m1819J7431k634
15346i7776n4449K5438N721P9917L4688M541Q5918N2244k883L0541k3700m3456
15334I6744l7308r328M837Q775n0086J8698P0438l3897n5517N5387o7483m1391
15322d0131L2589n2615k3375L4299K5918N6053m6708k022O1876M9622M5830j3514
15310A27822L4650q2025p0070k8994J19578K1031O47J5103J4355j0425O1105j7588
15298A85189o2979r3047j35248k7304K7244J21335K7035K877J2590l0986j6955
15287I751p1846m6536M2342q105P7180N0006j5314M2580r595K4918J01968j0065
15275A87284j08453n1943K3168L1462j29621j6863J04822r916p7932k9471n2680
$$ y = [-57944, -72059, -66793, -63811, -13590, 39377, 90016, 35282, -64703, -70754, -112573, -95142, -97776, -152225, -126787, -121066, -41149, -6461, -1920, 83998, 136242, 133359, 163900, 140200, 96744, 59436, 50108, 54945, 63720, 13634, 32332, 102770, 68873, 13356, 68743, 1260, -40131, -7542, -60157, -83532, -49233, -23315, 32738, -13970, -15992, 45884, 95506, 141336, 127822, 162472, 80447, 10377, -18617, 100961, 121992, 122639, 137742, 152097, 141672, 202777, 185189, 122210, 29163, -106085, -133389, -106145, 15190, 42225, 45102, 57692, 26706, 9751, -62095, -108631, -66289, -74394, 2786, 52792, 37478, 80058, 70463, 95381, 197349, 187284, 78831, 26888, 50056, 81518, -48103, -64966, 39856, 29940, -47992, -77463, -130143]
15264a30143J04964J27934l0291j12803q7922n3586L5916k5526J9060J22568P6639
15253D6810o167N2222O0169m4776K8127K7008j03387j9722N3168k086j0826Q2146
15241A62686R5557p0338k9328K8757l4537m5221m8482j23031R4806J24045j15503
15230C9411k0679N886L6749K1883Q828m8722K0999j9862o0800N7741j901k0217
15218A9316O9875O3869n4489p4818L0933o033K1595j13505n6P1163O5870k8956
15206F4764l3350N068Q0788P4296p8627j13448r319o726p5M8008m8016o925p533
15193c1095k142j0077j8591M5811R2579N6952m5292q9670k386K415j6209J3837
15181c868o4153k2188M9924l2758n2455j14333O611J33850N0765M8513K9295o6207
$$ y = [-130143, -25179, 102755, 72464, -40339, -128261, -181847, -145931, -171457, -152397, -29829, 46810, 40643, 92865, 153034, 108258, 136385, 163393, 60006, 40284, 93452, 91366, 80540, 162686, 258243, 187905, 158577, 187334, 152797, 107576, 59094, -63937, 30869, 154914, 39411, 18732, 24618, 61367, 83250, 92078, 43356, 64355, 44493, -16307, 41434, 39533, 19316, 89191, 153060, 98571, 23753, 54686, 48653, 70248, -43257, -43313, 27850, 93720, 64764, 31414, 36482, 117270, 191566, 112939, -509, -9828, -16554, -16629, 31379, -16637, -23562, -31095, -33237, -43314, -61905, -16094, 76485, 133437, 88145, -1525, -3911, -1496, -17705, -3868, -68021, -90209, -40285, -73043, -125498, -239831, -233220, -99370, -48605, -92, 29203, -37004]
15169c7004m8875P5380M6825M7311K4440M7231r4323q0817L9838N8938j270l4204
15157D3470o561k072n937m1998j7254N8260n6826Q674k2753j02061n2058K2853
15145a74263Q5466Q9326j1962J6400m5732m1690p0024L6312K9178P8573o4272
15134g2688L3937J5323M8125J7777q1946k8203j3293Q5488k4187K1545l7639q4415
15122a20176M3620K7306J955J0692K4695N0362J1101L59m1038n1417N3001O076
15110A6536m4259N818N6744j3056p941K8799o7982J2148O3940K5882n1222j630
15098B3777J05885p8895p8578m0065l9515J03610J01816M3003J174o4675m7413
15087C0124P2852j8312l9986q7363j6889K2067k5029k6777m018Q4770l4683o8431
$$ y = [-37004, -85879, -10499, 36326, 83637, 108077, 155308, 60985, -19832, 20006, 78944, 77674, 43470, 36909, 34837, 28900, -13098, -30352, 27908, -28918, -20244, -42997, -145058, -197116, -174263, -88797, 529, -11433, 4967, -40765, -82455, -152479, -116167, -86989, -8416, -72688, -38751, -23428, 24697, 42474, -39472, -67675, -80968, 4520, -19667, 1878, -35761, -120176, -76556, -49250, -47295, -36603, -11908, 38454, 49555, 49914, 8876, -42541, 10460, 16536, -27723, -21905, 34839, 21783, 13842, 42641, -25341, -13193, 50747, 76629, 25407, 23777, 129662, 50767, -27811, -67876, -107391, -3781, 98035, 141038, 142212, 77537, 30124, 102976, 84664, 44678, -42685, -59574, -37507, -62536, -89313, -93331, -8561, -43244, -111675]
15075a11675M7469J3451k4343O3144j3772J3570K4019j810N8428r5802r9930L0376
15063i6875N3940n5619N7625Q7364n0373n9906k8174n7328J9568k4459j1836R1034
15051g5039K1825q489Q0973N4059M2413J7696M1380o9524j09344j0330N1103p0551
15039c3828j6154l3427Q210M3012O6372m6121M0811j6218o772N8511l0550j524
15027C2322M8051p1532K3153N0417J8979K4169L0205O70p4310k0326N1794k8107
15015H5485N142k7662l3835l3863N3461m4364L7836L0917k7049J2597p0433k8965
15003d0733l3198J61184J70592J0721k8804p5234p2457m1756K8666J80641K18848
14992D78470K98086L58884J04159k67338l06929k21238k65349o9229r2171k6382
$$ y = [-111675, -64206, -50755, -75098, -11954, -25726, -12156, 11863, 10053, 68481, -27321, -127251, -96875, -42935, -98554, -40929, 46435, -3938, -63844, -92018, -149346, -129778, -154237, -166073, -75039, -53214, -61703, 19270, 73329, 115742, 133438, 174818, 105294, -4050, -14380, 36723, -33828, -49982, -83409, -75199, -32187, 34185, -11936, 28875, 12657, 5885, 64396, 33846, 32322, 80373, 8841, 31994, 82411, 101390, 125559, 155764, 156434, 82124, 61798, 113592, 85485, 90627, 62965, 29130, -4733, 48728, 4364, 42200, 73117, 46068, 58665, -11768, -40733, -73931, 87253, 257845, 268566, 239762, 164528, 92071, 50315, 78981, 259622, 478470, 776556, 1135440, 1239599, 972261, 665332, 444094, 178745, 109516, 17345, -9037]
14982i037Q2116m6341M92J139j4972M0512J21872j0400o7373L3518m1268L4650
14970A24908m1128p6538J3825M4545q9506j19166Q3125J16312N2151l1214j844
14959G5470l7022n7894L7868N2038j5068o7551o2054l3367J9824q766l4493J5364
14947a15651P4103j968l1023O0771l083l2465j07013k2067M3879J01309O3049
14936B9841l3380L9875Q426m9940m0462k9155R8516K4143p4607k7477N3724k9580
14924c0076L0715R7081Q8431Q9888j18449p3979j09119K9412R7031K377l0888
14913G2424N5137m5113j42070r848Q5776L4699l189p0727j3563p465K1196r2796
14901a15539K2939R0934R0353l2912l7901L2551l7724q3877m6168j5461N1648
$$ y = [-9037, 73079, 26738, 27230, 28369, 13397, 53909, 175781, 165381, 98008, 131526, 90258, 124908, 83780, 7242, 21067, 65612, -23894, -143060, -59935, 56377, 108528, 77314, 75470, 38448, -19446, 18422, 70460, 55392, -12159, -74213, -107580, -87756, -96522, -131015, -115651, -41548, -43516, -74539, -13768, -16851, -49316, -156329, -178396, -134517, -33208, 29841, -3539, 36336, 44762, -5178, -45640, -74795, 23721, 47864, -26743, -54220, -496, -30076, 639, 97720, 186151, 276039, 157590, 83611, -25508, 3904, 100935, 103312, 72424, 127561, 82448, -59622, -69470, 16306, 51005, 47816, -22911, -36474, -43939, -22743, -115539, -92600, -1666, 88687, 55775, 17874, 50425, 12701, -71176, -117344, -132805, -81157]
14890h1157P7946Q0352q260j29021q5244M5701o9072J5905J818l3703P0666L1057
14878h3012p3693m8135L720R2968k9839l5753L7085J00082J0913j926J2990J0290
14866d310O5192l2174Q3247P2400m1729j05017k06725k6592K1259L3033K6109
14855a15307J29113N0824k7538N1706M3291j9911o2154j65764J9162N5327N7747
14844A6496N7509M0941m0649k6719j4613J0142k298l3838m7530p5675K6307J7090
14832g2837r4872J5033P2452J18939R508j26823K1747j7603J4203O0684L1906
14821C2337l3660l204o2107m056M5459J5448n2938J152J13476K2701l429K0244
14809I1423k8035l7053K4506J11194J17826n0783j04351q7893m0616L0169K5486
$$ y = [-81157, -3211, 77141, 68881, -60140, -145384, -99683, -168755, -152850, -151032, -184735, -114069, -83012, -156705, -204840, -201120, -108152, -137991, -173744, -136659, -36577, -25664, -27590, -14600, -4310, 60882, 28708, 111955, 184355, 142626, 37609, -169116, -195708, -174449, -141416, -115307, 13806, 64630, 37092, 88798, 132089, 112178, 50024, -115740, -96578, -41251, 16496, 74005, 114946, 74297, 47578, 32965, 43107, 40809, 6971, -40559, -116234, -89927, -72837, -167709, -152676, -80224, 38715, 48223, -78600, -56853, -74456, -60253, 431, 32337, -1323, -4527, -66634, -70690, -25231, -9783, -62721, -61569, 51907, 74608, 71179, 91423, 63388, 26335, 50841, 162035, 279861, 229078, 124727, 36834, -3782, 26387, 51873]
14798E1873m9808j48918M136K8380K3549P2463J1091P077J6236M4415J4830o5352
14786I972L4801q5799R77K5485q289L2547K6197j7569n1087n5745R998J4818l069
14773f6763M9798P1627J12244r5100j22184o7897P623O3826O9634Q7546n8026
14762E2328j84253m2114K1413L5998P6489J60781l3464J8208M0776K4019k7185
14751A42996r6366p3745k2893j7964L604L9339n5959J6380J9381l9592N9175Q616
14739a7028K6332K2749N7696K6690l4450M4932l661Q521j76j05194J243J8469
14727D6123R3372j2218l8662L8607p8778n9917l478p565P3772k378m4335p2379
14715f7836o5966L9936K6384l3207j6798P5031m5194J5280N6738M8655p7207q3147
$$ y = [51873, 2065, -146853, -142717, -114337, -90788, -18325, -7234, -157, 16079, 60494, 75324, 9972, 44773, -41026, -40049, -14564, -22853, 9694, 35891, 18322, -32765, -88510, -78512, -63694, -66763, -16965, 54662, 166906, 71806, -50378, -118275, -110652, -46826, 22808, 110354, 52328, -131925, -174039, -152626, -116628, -40139, 120642, 87178, 105386, 146162, 170181, 142996, 46630, -27115, -50008, -67972, -64368, -25029, -80988, -64608, -45227, -84819, -25644, -17028, 9304, 32053, 89749, 116439, 81989, 126921, 123260, 131781, 131605, 26411, 27654, 46123, 139495, 127277, 88615, 127222, 48444, -11473, -14951, -22516, 51256, 48878, 4543, -67836, -133802, -93866, -67482, -100689, -117487, -42456, -87650, -72370, -15632, 33023, -44184, -127331]
14703a27331L7537K6892j6854k7216q766k1316P2541J8154l6042L4597j3799K3391
14691c8212M4416m9905J01608P0132r6456k0145J6371k4530J7993l3495p7634
14680h9857N4854N2172k8519M0583J4740l1801O9778l0730O77N4643n8111n6709
14668h280P6723j7217M262k8024o3197J2184J01746J1481l9128k0394N6158K2009
14656A08323M4378K7296l6480k348r2402o3686M581J8088J38371P7448k9840n4184
14644A39545p2158k6866o5l4913o017l1029j22215O8630J17128p8626p9031P3390
14632e2227O8608l733K5946k8157r4713m3831J9937J1377o9749o3916N0426J61274
14620a8758Q7977l3715O5489J3425l1787K8455j12150m5986K2389L8500Q6n1845
$$ y = [-127331, -89794, -62902, -79756, -106972, -115738, -137054, -64513, -46359, -82401, -47804, -61603, -38212, 6204, -43701, 57907, 128039, 31583, 11438, 27809, 3279, 21272, -12223, -89857, -35003, 17169, -11350, 29233, 43973, 12172, 81950, 51220, 51897, 106540, 48429, -8280, 68443, 51226, 55488, 27464, -35733, -23549, 78197, 89678, 50550, 30156, 86314, 108323, 152701, 179997, 143517, 141169, 48767, -14919, -10338, 7750, 146121, 223569, 193729, 139545, 67387, 40521, 40456, 5543, -474, -31503, -153718, -85088, 32040, -46586, -125617, -52227, 16381, 12648, 38594, 10437, -84276, -128107, -108170, -96793, -166542, -230458, -180032, -18758, 69219, 35504, 100993, 114418, 82631, 111086, -1064, -47050, -24661, 13839, 13925, -37920]
14608c7920m2990L2600R757m464j4842O799L1003K778J8322K1702N573p1804q6620
14595a30106N5894M7121P0963j8371k9453m3258L0216j0071K077Q919j09585M18
14583a25236M9300j0461L9919j03011N1955M3248o9253M7163R6602K2956M15k676
14571D0921L2956O258L2137j6022l436K6303p4390o4345k1350J3512N9257Q0451
14559A12252J0412j4284n3236j02638J9323N4919j15831n8432p11Q3756J00678
14548C6208K5966p5550J3981O1912O9894r5703J9235J34956q562m6912o1971j31669
14536e8215N952O3256r9035l0566P4485O8960n3269m8964J25075K6971J02599
14525A77249J6692j21287j12415n6389q874Q3824L4275o1858m4651l5671J08234
$$ y = [-37920, -80910, -48310, -38553, -43017, -57859, -51060, -20057, -17279, 1043, 22745, 28318, -43486, -130106, -74212, -27091, 43872, 25501, -3952, -47210, -16994, -27065, -24988, -16069, -125654, -125236, -75936, -86397, -46478, -149489, -97534, -54286, -123539, -76376, 20226, 43182, 43597, 40921, 73877, 80135, 112272, 96250, 92814, 119117, 44727, -19618, -40968, -27456, 31801, 112252, 122664, 108380, 55144, -47494, -28171, 26748, -89083, -147515, -148226, -64470, 36208, 62174, -13376, 605, 62517, 132411, 36708, 55943, 190899, 182337, 135425, 73454, -58215, -52263, 10993, -88042, -118608, -44123, 24837, -28432, -77396, 47679, 74650, 177249, 193941, 72654, -39761, -96150, -105024, -21200, 13075, -48783, -93434, -129105, -20871]
14514b0871L6762J1218l305k1522q263K3360P0018r8151k1893Q5962n7966l7049
14502d1700J04459P495r7557j2802l3851o748O0434j06665p7034Q9170J39482
14491B4683Q4199l0510l5162m4484N5296j8330k0006L1415l6592K4456N9212M2835
14479A37012j32079j199k574O6664P735r1842l6248J8441o3146m6653J5898O1425
14467f6566J8686J07902l7902j13958M6717O0743p7504J0504L2028j7128J9567
14456a6911k6201R611L8414m7019j6885J4930m2357M4504P6846o045J6167O4263
14444A09317p7316l4011o1282P817M536N5984K7766j03889r6868N4191P9835p0867
14432a04787n2959K2571J3358R151R4623k5250m7409J26385P6525q1780l598J4639
$$ y = [-20871, 15891, 27109, 23804, 2282, -5981, 17379, 87397, -10754, -32647, 53315, -4651, -41700, 62759, 70254, -27303, -40105, -73956, -80704, -20270, -126935, -203969, -114799, 24683, 108882, 78372, 43210, -1274, 54022, 35692, 15686, 47101, 10509, 34965, 94177, 137012, 4933, 3734, 1160, 67824, 75559, -16283, -52531, -34090, -97236, -143889, -127991, -66566, -47880, 60022, 22120, -91838, -45121, 15622, -61882, -51378, -19350, -36478, -16911, -43112, -33501, 4913, -42106, -58991, -44061, -86418, -41914, 34932, 28887, 45054, 109317, 32001, -2010, -63292, -55475, -50939, 5045, 32811, -71078, -167946, -113755, -33920, -104787, -157746, -135175, -121817, -112666, -18043, -43293, -90702, 35683, 112208, 30428, 26830, 41469]
14420D1469N901N3016K940l3051j11372l5050L5445o4606j097K2239k1761J17937
14408A2010M3025N716m3688O0817J8757O361n1288n5967m1067O9053j6352Q1674
14396H9051L9304j2424N9872L4223m6421l4987o895o0142j9698J27021R4591o0547
14384B02948j60601l1403M3555k1283O142o3744n0926k6796k9585K5127M0086
14373f6480j0820p7210J8496K1719n5855N8298O0292j6845O4799O977o5241l3998
14361i5868j6396p8550M2389M4961L7399Q4848P5345Q748j2315N1018L7489J9646
14349A98714o7860L4528P2368l5606m1079K7841J08507o9956p7963q4568K8777
14338I3703n5669n0960n8681P173K1382m9143j48436M6243J11209O6425m6627
$$ y = [41469, 47370, 100386, 103326, 70275, -41097, -76147, -40702, -105308, -106405, -84166, -105927, 12010, 55035, 60751, 17063, 77880, 96637, 102998, 51710, -4257, -45324, 23729, 7377, 89051, 128355, 115931, 175803, 210026, 163605, 128618, 121723, 61581, 41883, 168904, 263495, 202948, 42347, 10944, 54499, 33216, 39358, -24386, -75312, -102108, -131693, -106566, -66480, -77300, -154510, -136014, -114295, -170150, -111852, -51560, -68405, -3606, 3371, -61870, -95868, -112264, -190814, -148425, -103464, -66065, 18783, 94128, 102876, 90561, 141579, 179068, 198714, 130854, 165382, 237750, 202144, 161065, 188906, 297413, 227457, 149494, 64926, 93703, 38034, -12926, -71607, -64434, -43052, -92195, -240631, -194388, -83179, -16754, -63381]
14327f3381p113Q3140P2749q3388m4545J5544n3067o9865R9011o742j7744J10951
14315C5550R0906N6465n3609M6086M0085q2390j26400K1246n4501k8877O8108
14304A2669J6851k7663J6896r3752q5658R0486K9724k1717m4782J4916P431l6985
14292a21584N4362l2265r8894K9776J22783J40686q2031o7582j336M1936l0653
14281d4802l1820k9494n448P4850N4421j3266q8161R7136Q1191Q0935J9810j6870
14269A78482O0127K0666R591n5028q3501j38158J14310N3320p2927Q5603O0831
14258B33316p3764q9118K8283N771r0984o0442P5066K5376j1841j6008P793R5643
14246A29091J20573q99j21507o2447j046j15290P051j3162m1472N2890J7961L3188
$$ y = [-63381, -70494, 12646, 85395, 2007, -42538, -26994, -80061, -149926, -50915, -57657, -75401, 35550, 126456, 182921, 129312, 175398, 215483, 133093, 6693, 27939, -26562, -55439, 12669, 29520, 1857, 18753, -74999, -160657, -70171, -40447, -62164, -106946, -92030, -84599, -121584, -67222, -99487, -198381, -168605, -45822, 94864, 12833, -54749, -56085, -14149, -44802, -76622, -106116, -111564, -36714, 17707, 4441, -83720, 13416, 94607, 175542, 195352, 178482, 238609, 259275, 268866, 213838, 130337, -7821, 106489, 159809, 86882, 172485, 233316, 159552, 70434, 98717, 104488, 13504, -46938, 28128, 53504, 41663, 25655, 33448, 129091, 249664, 248765, 127258, 64811, 63765, -51525, -44474, -57636, -99108, -46218, -28257, 4931]
14234D931n5969o6544R468K6442N140M2545L3205L8406L0714M342L0535M8168
14222A51383K1335k9084l4218m1048l7029J1034P8238P1799q5264n3296O2398
14211A16248L2535p9453k6238Q0550j3948p9335N1034l840j1739O9476J1591o3796
14199H3085l0350K3520q5513p188n0047q4441k3564O5771P0855j6704k643M1534
14187a5685N9724L3229p0251r7169J0764P2299R946p5846l184L6630N8177P1148
14175H9782Q3114k8599o3515O5930p0951q4702l2883j9432j5963M9724m4409k1308
14163i3212r0090J6376j3163l3815J07620K646j1972J28835M7649m0637m5773
14152b5536j24443Q952M956J2190m5527N5837Q1026J7559N4864R6400j9612o0957
$$ y = [4931, -51038, -117582, -108114, -81672, -76532, -33987, -782, 37624, 68338, 72680, 103215, 151383, 172718, 143634, 109416, 68368, 31339, 42373, 120611, 192410, 107146, 53850, 116248, 148783, 69330, 43092, 123642, 109694, 30359, 81393, 77553, 65814, 135290, 146881, 83085, 52735, 76255, -9258, -16446, -66493, -150934, -174498, -108727, -37872, -54576, -57219, -15685, 44039, 77268, 7017, -90152, -79388, -7089, 2857, -72989, -76173, -39543, 18634, 89782, 172896, 144297, 80782, 146712, 75761, -8941, -41824, -61256, -77219, -27495, -71904, -93212, -183302, -166926, -180089, -213904, -106284, -103638, -115610, 13225, 60874, 20237, -25536, -149979, -141027, -136071, -123881, -169408, -113571, -32545, -14986, 39878, 136278, 116666, 55709]
14140E5709K753n322m1757L1948K3529M1335J6896J8954j0000j20538K2416o4923
14128b9000J4883Q917l7902M4070K614N466L3068o7342m5995j6975o578l8170
14116a32944J53819R7947J1988J8363L7727J142j18227p0331L0622M6166J2646
14105H8918l8052n1508K7156J00877J2715k0549m378j14841j33654n80l3354j1154
14093a78404M0497o5557l2615O6109J08841K0717Q2645K5240J3555m9862l0290
14082H76r4900l5471N8954J5847J09277k0051j76720m0893n6251L5286N5621L3406
14070a15019R5495J04144M1086l8456l9611J7664p0132r8809L6206M9627M5267
14059B7462O3692m9030p4845q8040k3492K2686K3396K2677j3428l3132P717J04303
$$ y = [55709, 58462, 53140, 11383, 43331, 66860, 108195, 125091, 144045, 134045, 13507, 35923, -29000, -14117, -5200, -43102, 968, 3582, 9048, 42116, -25226, -71221, -88196, -94774, -132944, 20875, 118822, 130810, 149173, 186900, 188042, 69815, -516, 30106, 76272, 88918, 50866, -642, 26514, 127391, 140106, 119557, 115179, 338, -133316, -133896, -167250, -178404, -137907, -203464, -236079, -169970, -61129, -40412, 42233, 67473, 81028, 31166, 876, -94024, -129495, -70541, -54694, 54583, 34532, -142188, -183081, -239332, -204046, -148425, -115019, -19524, 84620, 125706, 87250, 47639, 65303, -4829, -103638, -67432, -17805, 27462, 91154, 42124, -32721, -120761, -144253, -121567, -98171, -75494, -88922, -122054, -114337, -10034]
14047a0034k5378j01659k3553M0027M1111m5320P1550L4200K4008j336n8501j7419
14035g2304p0429P2333J83724k9558o0441L4656Q935k0605k2850m2479j5308Q9218
14023E4892Q5220m3865j1279j26464j9861j6196N753k8144L7824M2059O1502n0204
14011h763l116M199K5669j0574l648j1851N3067p8702K9997M8887P8062J2547
13999A35774q0904n9566k7196m1712J20427J64338M8207j41574o9425k8635R6977
13988A16711L2039k4667r076r8577k2363m1183q453j7469k3813P0802K4198n1923
13976e3774m5298P3194M0084n0324L7259M2775j4019J18J6461l266j6928L2945
13964E9227M1362K5728P2665o7297q4184j0448Q2361M4838l6688j11456J0826
$$ y = [-10034, -35412, -137071, -160624, -120597, -79486, -124806, -53256, -19056, 4952, 3616, -54885, -72304, -142733, -70400, 113324, 83766, 23325, 57981, 66916, 46311, 23461, -19018, -34326, 54892, 140112, 96247, 84968, -41496, -61357, -77553, -71800, -99944, -62120, -20061, 41441, -8763, -11879, -7680, 17989, 7415, 3767, -8084, 44983, -33719, -3722, 45165, 123227, 135774, 54870, -4696, -31892, -73604, 46823, 211161, 259368, 117794, 48369, 19734, 116711, 148750, 124083, 115007, 16430, -5933, -47116, -55569, -73038, -96851, -26049, -1851, -53774, -99072, -25878, 14206, -36118, 1141, 43916, 29897, 30015, 46476, 43210, 26282, 59227, 100589, 126317, 198982, 131685, 47501, 37053, 119414, 164252, 127564, 16108, 26934]
13953B6934O7933K3244R474K1318l9108o0310j1489p9483q884K4142q458J8670
13941a6017j5364K9919O4964m3541O4239K7367K8333r5794j20558n9062r363Q1042
13929f3835L9561l3452l2677N8748O3164N6882p0370r2083N1916k0783L5447N8374
13917E0892J20359M4482k9045n6095l3429j8336j2612j1884j3755k4391J6562
13906C2748P5826K3331l049k5343q4806q5116R173R3463L9632L0493O1100k1184
13894A46268p8292J0059n9738n6656m0991J3722j444J0179L9600Q0426M727M0970
13882A08830m8560r7766l5040M042O2930J05765O9433j02212k0215J1672k7382
13871C1497M1731p6246J1413J05708J0637J1421j0470M2991K9369l9155n4394
$$ y = [26934, 94867, 118111, 127585, 148903, 109795, 49485, 37996, -41487, -50371, -26229, -34687, -16017, -31381, -1462, 63502, 19961, 84200, 111567, 139900, 44106, -76452, -135514, -144877, -63835, -24274, -57726, -90403, -31655, 31509, 88391, 18021, -74062, -22146, -42929, -7482, 50892, 171251, 215733, 186688, 130593, 97164, 78828, 66216, 54332, 40577, 16186, 32748, 108574, 131905, 128856, 103513, 18707, -66409, -57236, 36227, 75859, 106352, 167452, 146268, 67976, 78035, 18297, -38359, -79350, -65628, -67072, -56893, -17293, 63133, 67860, 108830, 60270, -37496, -72536, -68494, -5564, 100201, 169634, 67422, 47207, 58879, 31497, 73228, -3018, 8395, 114103, 124740, 136161, 125691, 168682, 198051, 158896, 104502]
13860A04502o7265q3825j2756k820N7728R122Q3260q2880j32791Q9793K9572J06273
13848I7913k9745j53858k5752J4136M2983M7175j6900J3378O7165l9646J1249
13837B8098M387J1366k826k8327Q3527M7189q5882M3926Q8481r1345l3761m8233
13825A6600j5627l7590J20396O1457L7498J447P279J5587j5716k0495j07938l6891
13813B6007k5119j808o4129j42018L0788N9422J34628Q1290m1182j1593p0774
13802b4488j8174J8588Q8874L4107o5323q753N960K607l9360m3618K6720L8790
13790A5930J5410J1181J2239n0688M2032K8873k4327N6473j1720j84621j00890
13779a90108J139p134n491P1569O0901L9849M2027M7967J3498n3384K081K265
$$ y = [104502, 37237, -46588, -59344, -62164, -4436, 4686, 87946, 5066, -127725, -37932, -8360, 97913, 68168, -85690, -111442, -97306, -54323, -7148, -24048, -10670, 56495, 16849, 28098, 32485, 43851, 41025, 12698, 96225, 143414, 57532, 101458, 189939, 98594, 64833, 16600, 973, -36617, 83779, 145236, 182734, 184181, 191460, 207047, 191331, 170836, 62898, 26007, 888, -920, -65049, -207067, -176279, -116857, 17771, 99061, 57879, 46286, -24488, -42662, -24074, 64800, 98907, 33584, 24831, 30791, 33398, -5962, -49580, -22860, 15930, 31340, 42521, 54760, 4072, 46104, 74977, 50650, 107123, 95403, -89218, -190108, -188969, -196103, -201594, -130025, -69124, -29275, 12752, 60719, 74217, 20833, 22914, 25179]
13767B5179m8256o4242M7827R2313J3702m9846m5922K552J39404K7251r4118j6793
13755B9051M1083j8419k2000Q783L6117k0090o6126m7276M0262K3221N8198L7348
13743A00152j1709K8331n2638K5025R0955O297r6422r8385K8898J078q5482L245
13731f0655P3577L8605N902n8982j1228l42o1478n0089J11817Q9693n5223J3906
13719C5503N3867n9345J4723J0629k4813L3490p299m9215J4144K8101p3026l4349
13707e7590k3681Q1854R3739K5721Q945k6605n8149q8386K3872P5367K9848L9764
13695A24699j0541l7286k3255J2738l0500K4392k3315J6656l8119Q147M6634k2448
13683D7802l2548j4436J13529o9646K231P985p4817O7134m1358q0249L4132N6957
$$ y = [25179, -23077, -87319, -39492, 52821, 66523, 16677, -29245, -26693, 112711, 139962, 45844, 29051, 70134, 51715, 29715, 38498, 74615, 54525, -11601, -58877, -18615, 4606, 62804, 100152, 88443, 116774, 64136, 89161, 180116, 186413, 89991, -8394, 20504, 21582, -63900, -60655, 12922, 51527, 57429, -1553, -12781, -13123, -74601, -124690, -12873, 76820, 21597, 35503, 89370, 30025, 44748, 55377, 30564, 64054, 56755, 7540, 21684, 49785, -23241, -57590, -81271, 583, 94322, 120043, 128988, 102383, 44234, -44152, -20280, 55087, 84935, 124699, 114158, 76872, 53617, 66355, 35855, 60247, 36932, 53588, 15469, 23616, 70250, 47802, 15254, 818, 114347, 44701, 46932, 54917, -19900, 47234, 5876, -74373, -40241, 16716]
13671A6716P291o2811k0350l976l4184N6005o3684K4461N2208r8588m7905O5815
13659a09002J96941J02209l4623O4340k1456p1201j1735k9359Q9686m8616J2240
13648A39424K8418l0369L7357j654j57651m6300N1423L2967P5856o6800j21418
13637e8747o4826J26140Q0585j3520l6845J8966L5812Q7937j3029j4358M2880
13626A90995N0174j7442j9760r109q7499j4192o6346o9874k7473N3760l0841m2833
13614i0440J3851J1882N3839L7678L4207J21361J99m8290j14377j96N9106j5177
13602F3643J6356o9977j10886J17388J26943Q287j7936K4529P5761N4138J7815
13591C06061o7458m9268M5010n5304j0703L9001l7637o5082k0793J1630k4081
$$ y = [16716, 24007, -38804, -59154, -63130, -97314, -41309, -104993, -80532, -28324, -126912, -174817, -109002, 87939, 190148, 155525, 219865, 198409, 127208, 115473, 86114, 175800, 127184, 139424, 167842, 137473, 174830, 173176, 15525, -30775, 20648, 53615, 129471, 62671, -58747, -123573, 2567, 83152, 69632, 32787, 51753, 87565, 175502, 162473, 148115, 190995, 241169, 223727, 203967, 194858, 107359, 93167, 26821, -43053, -70526, -16766, -47607, -90440, -76589, -64707, -10868, 26810, 61017, 182378, 182577, 134287, 19910, 19714, 78820, 63643, 79999, 10022, -100864, 16524, 143467, 151754, 133818, 158347, 234108, 288246, 306061, 238603, 189335, 234345, 179041, 168338, 207339, 169702, 104620, 83827, 95457, 71376]
13580G1376j7867j9726L9722L8171P7291l6616o6772J6488m9760o5330m8645M9888
13568a1780Q7697j3130m6392K0743K4332l5495J8072p64N396r2407J1819Q233
13556b3676m2493L6873J00615m6371m5519K7028P1204l7254J9866L0526o575n1245
13544C2979j2478J812o5902m843J3909k5637k1847K2877k9361K3127j2188M1803
13532c5749K4005P0293l5681l8478p4540N5531N3132j6348P1515M3187m04j7862
13520I8601N5725m5750J1938n8281o1214N3310L103K7754j2922k6302P0653R8723
13508B15338O9731k1726q5216p7054L4853k2500L0497l652N0930m3769p918n5427
13496H4087r4062l9757r3956N9661O3489O717m6626m277k548J05084k9704j8893
$$ y = [71376, 53509, 33783, 73505, 111676, 188967, 152351, 85579, 102067, 52307, -13023, -61668, -11780, 75917, 62787, 16395, 37138, 61470, 25975, 44047, 43283, 48679, -43728, -31909, -23676, -66169, -29296, 71319, 24948, -20571, 6457, 77661, 40407, 60273, 90799, 84224, 32979, 20501, 22313, -43589, -48432, -34523, -60160, -82007, -59130, -88491, -65364, -77552, -35749, -11744, 58549, 22868, -15610, -90150, -34619, 18513, 2165, 73680, 116867, 116463, 98601, 154326, 108576, 120514, 62233, 1019, 54329, 57432, 85186, 72264, 45962, 116615, 215338, 285069, 263343, 178127, 101073, 135926, 113426, 143923, 140271, 191201, 147432, 139514, 84087, -9975, -49732, -143688, -84027, -20538, -13821, -60447, -64724, -67272, 37812, 8108, -10785]
13484a0785J00753l407J46798j9715n8229K9789r074q6037j27714q0384k1631
13473a39636J90799J10476p8514o9934M7165N5825J2783l0218J07432j5665n2221
13462A38292K7428N6610r7330p8832k0955o559P2346Q7100Q2834n3144j3466J6392
13450B10716J963l1349n775L5566N0768j3427J9105p661l5195j8365Q7793M290
13438B98429q6077J2991l8598j5668O053K6422j5686j05885N0685Q0560L6150
13427B49376k4692r3345r8544m1639J17296Q5751j10459M589O2397Q2449n3959
13416A79220l4759K6065J2543J529N1862o5585l4061R0805P7148J0469l7199q2840
13404A95197M515K7288q510o6474j9556J4626J44839P4444j00744m6187m714k4374
$$ y = [-10785, 89968, 86561, 233359, 213644, 155415, 185204, 176130, 90093, -37621, -118005, -139636, 51163, 161639, 83125, 13191, 60356, 116181, 128964, 98746, 206178, 190513, 138292, 165720, 222330, 125000, 46168, 25213, 18654, 91000, 178100, 260934, 207790, 194324, 210716, 212679, 181330, 175555, 211121, 261889, 248462, 267567, 259906, 224711, 206346, 294139, 298429, 212352, 225343, 186745, 171077, 177130, 203552, 187866, 81981, 132666, 213226, 249376, 224684, 131339, 32795, -8844, 108452, 194203, 83744, 88333, 150730, 233179, 179220, 144461, 170526, 183069, 184598, 236460, 170875, 136814, 227619, 304767, 315236, 278037, 195197, 199712, 227000, 218490, 152016, 132460, 147086, 291925, 366369, 265625, 219438, 214724, 190350]
13392A90350J7050Q145n6783O8591J2713q1011Q726p9876K795R3075n4235o7018
13380F2522J2493o8809j31506J17990J11393o2634L8205M518k2186l8517J4852
13369C8321n270j3162j371k8879O849J5629K8318O2039k5985m5273R3982L8637
13357A63835K0062j06830n2628j8183r2701j2837J62121J38776L5646l3165P381
13346B11477j05810j8809O8440P5588L178j08996j86143M5150R4054M8593K1550
13335A48272n619L6488P0747j01413o4707O6070O3065J0406m7858N555l134K4754
13323B02626P077p2297L0977k5738n4049K0771o5287o9785Q8339N507k2046j800
13311D4295j5218J40259M0130n4970m6836K3311j9757p1895k3999o4199P135J7223
$$ y = [190350, 207400, 215545, 158762, 227353, 240066, 159055, 167781, 87905, 90700, 183775, 129540, 62522, 75015, 6206, -125300, -7310, 104083, 41449, 79654, 84172, 61986, 23469, 38321, 33051, 19889, 18518, -10361, -3512, 12117, 40435, 102474, 76489, 31216, 125198, 163835, 183897, 77067, 24439, 6256, -86445, -99282, 62839, 201615, 237261, 204096, 211477, 105667, 86858, 155298, 230886, 234064, 125068, -61075, -15925, 78129, 126722, 148272, 142653, 179141, 249888, 148475, 83768, 149838, 212903, 223309, 175451, 181006, 177872, 202626, 209703, 137406, 168383, 142645, 88596, 109367, 44080, -25705, 62634, 68141, 46095, 44295, 29077, 169336, 209466, 154496, 107660, 130971, 111214, 39319, 15320, -48879, -41744, -24521]
13299b4521K1264M5260n9185k4038N5674O3899M1992l0220m6921l9413K0535j25885
13287a01559J271J15163N5522N3449O2898j9330j75011J8231N0976p1088k7595
13276c7073K3468r521k2438m9027k049N4319N1912l6673k9722M4817J184M0177
13264B9374O1680k0740J11308O6767n1697K2307p9396o6894K5030M9980m9369
13253I8350O710Q151j02461r1532M552N6550n3008K3677O0637L0473n6133q956
13241b2990R3272P086m5963m4879L3128O88O4098l6653k9502K733j1016n2837
13229d2835J02469J42129l3611L2579k8286M3009J4236o7463n9230j17765j2385
13218b7153L4222L3471N8646R491j3591N3971P9018l4203j33398q6959M0742J13453
$$ y = [-24521, -3257, 42003, -17182, -41220, 14454, 78353, 120345, 90125, 43204, 3791, 24326, -101559, -100288, 14875, 70397, 123846, 186744, 167414, -7597, 10634, 61610, -9478, -37073, -13605, -23126, -45564, -94591, -96640, -42321, 9591, -27082, -56804, -11987, -10803, 29374, 91054, 70314, 181622, 248389, 196692, 218999, 139603, 72709, 97739, 147719, 98350, 105060, 113211, 10750, -80782, -76230, -19680, -72688, -49011, 11626, 42099, -14034, -22990, 70282, 77368, 31405, -13474, 19654, 20342, 84440, 47787, 18285, 21018, 10002, -42835, 59634, 201763, 168152, 200731, 172445, 215454, 229690, 162227, 102997, -14768, -27153, 7069, 40540, 99186, 108677, 95086, 149057, 228075, 193872, 60474, -26485, 14257, 127710]
13206A27710k3200N6215M9124k6110o6446n7592j9979j0833M9469N3730m1685
13195I0403q9390r1907K9956M3442P8300P2068N8847k1191K6458m5177L671l4058
13183A21422m0204j013L5954K5395O7000m040R484Q5747r6451o6164P492j2635
13171A31987K812J3161Q821P0226j3088j00177j0821r20j22486n1485J1967O158
13159e3845J30976N2215k9676o2381m4701Q1290Q4136l3434j4885j301O7209N9680
13147B35283m6565m9521m7325l6098o3894o5496J5960m270P8203Q8772Q0531L372
13135A88952l7286q1402l5083P7063k3050K5541n9151l2986J12598N4143j4459
13124A74880j51391P25J06869P5723Q010K508n336j0554j09683J3942n054J0536
$$ y = [127710, 104510, 160725, 209849, 183739, 117293, 59701, 39722, 28889, 78358, 132088, 90403, 1013, -90894, -60938, -17496, 60804, 132872, 191719, 170528, 196986, 151809, 155480, 121422, 81218, 80205, 116159, 141554, 208554, 204514, 213998, 299745, 203294, 137130, 144622, 131987, 134799, 147960, 156781, 227007, 213919, 113742, 102921, 102001, -20485, -71970, -60003, -53845, 77131, 129346, 99670, 37289, -7412, 73878, 158014, 124580, 109695, 108394, 175603, 235283, 188718, 139197, 91872, 55774, -8120, -73616, -57656, -61926, 16277, 105049, 185580, 188952, 151666, 70264, 35181, 112244, 89194, 114735, 55584, 22598, 135196, 189339, 174880, 23489, 24214, 131083, 206806, 214816, 217324, 211988, 201434, 91751, 105693, 100639, 111175]
13112A11175q0830k9273M0568M0603J29603o8150l4581j04104J9709M0888Q8393
13101A54001N8450K7318M4534m326M7143l9955K784k4206n7754l3229n6281l3891
13089H4588L7828L9158n2036k3358k9011J8361L6545Q6438m7602o5553K1625p2541
13077C4442J5340N6835J3050l6194r6882m0513O2865N4610R9741K3770o2412K8066
13065A52718J07723p9375r5027L3107M9844L8335j5175r338K8298j6032l7373
13054A57705P7434M4712o7173o6608j6781K3115R6537Q4250P1655j0663r0221
13043C03962m1736N3183L6034J0936M2891Q2300m6398j2919R0813J18716N5372
13032F93154P9296L0091J31697P0773P7174J19818Q0443l6901j00053M22k2711
$$ y = [111175, 30345, 1072, 41640, 82243, 211846, 143696, 109115, 5011, 24720, 65608, 154001, 212451, 239769, 284303, 279977, 327120, 287165, 289949, 265743, 207989, 174760, 118479, 84588, 122416, 161574, 109538, 86180, 57169, 75530, 112075, 198513, 150911, 85358, 106983, 34442, 49782, 106617, 119667, 83473, -13409, -53922, 8943, 63553, 163294, 187064, 124652, 152718, 260441, 181066, 86039, 119146, 168990, 207325, 192150, 182812, 211110, 195078, 157705, 235139, 279851, 212678, 146070, 129289, 152404, 248941, 333191, 404846, 394183, 303962, 262226, 315409, 351443, 362379, 405270, 487570, 441172, 428253, 519066, 637782, 693154, 772450, 802541, 934238, 1005011, 1082185, 1202003, 1282446, 1245545, 1145492, 1145914, 1123203]
13021A123203k09956q1902q344m0381l9080q4325r5594K4443j42620j08241P5810
13010D13013O4092J9715J6497l8647N0364n810O6319R4432m9790Q2031J01003
12999H13219N0295N2202J06063J07091P2992J03573Q8027Q4145K15156K66763
12989A959526K11081Q4756J21131q7777j93112j40311k02381j90851j61554j63099
12979A237409j68633p2323k639l3125K2157n984q8391o1766J3923J6187J13275
12968I70090k9511m030P3797Q8619j0110K7619M6352j3271j3239J37710R3187
12957A367213j582l7178O0251J98057J86753L6371L1713O8403O2743j03489j4088
12946A855167k0418j81329o2368m5592r8723k2729l9921r7042p6354l5092p8725
$$ y = [1123203, 913247, 831345, 823001, 782620, 743540, 659215, 563621, 588064, 445444, 337203, 413013, 477105, 496820, 513317, 474670, 525034, 519224, 585543, 679975, 630185, 712216, 813219, 863514, 915716, 1021779, 1128870, 1201862, 1305435, 1393462, 1477607, 1692763, 1959526, 2170607, 2255363, 2376494, 2288717, 2095605, 1955294, 1752913, 1562062, 1400508, 1237409, 1068776, 996453, 993814, 960689, 982846, 976862, 888471, 826705, 840628, 856815, 970090, 940579, 936549, 1010346, 1098965, 1088855, 1116474, 1162826, 1149555, 1136316, 1274026, 1367213, 1365631, 1328453, 1388704, 1586761, 1773514, 1809885, 1841598, 1910001, 1972744, 1869255, 1855167, 1834749, 1653420, 1591052, 1545460, 1446737, 1424008, 1384087, 1287045, 1210691, 1175599, 1096874]
12935A096874k5619O1005n5714n0189m0076j13J31723k9500j04694J39794J46658
12924A270149J11107L178Q6470J2072j2793K7685q0692j37700q8588k0497o9553
12913A100838p7008q4236k7091J9610K2014R1757O2400j24889k0124l8533J02775
12902A027513N2383L3236K6472O1208Q9813J24178J08956L8670J09181K90067
12892A961677J66969L81269N78830N64365P43112J068044J247923J170759R31514
12883H814462M15012l62284r36393j074917j046287j049040q26980n89324m95050
12874B849199l02205l72601l03898j88851j63260r9823j58091j07384j35003r272
12864A008811O165o2389p4880J5493m4891r6118O836N49p5263j8526M3819R5666
$$ y = [1096874, 1071255, 1132260, 1076546, 1026357, 986281, 986168, 1117891, 1088391, 983697, 1123491, 1270149, 1381256, 1384434, 1470904, 1482976, 1470183, 1497868, 1417176, 1279476, 1190888, 1170391, 1100838, 1023830, 939594, 912503, 932113, 954127, 1045884, 1108284, 983395, 963271, 924738, 1027513, 1079896, 1113132, 1139604, 1200812, 1290625, 1414803, 1523759, 1562429, 1671610, 1961677, 2128646, 2509915, 3088745, 3653110, 4396222, 5464266, 6712189, 7882948, 8814462, 9229474, 8867190, 7930797, 6855880, 5809593, 4760553, 3933573, 3344249, 2849199, 2546994, 2174393, 1870495, 1681644, 1518384, 1418561, 1260470, 1153086, 1018083, 1008811, 1014976, 952587, 877707, 893200, 848309, 752191, 759027, 759576, 684313, 665787, 709606, 805272]
12852H05272L2937j7990k0341j03439j09864n0371J46076P482j47798j43284J4560
12841D13240J03917M1208L7911P8181M8042j2470j00686n0075J8976N6764O3748
12830F98756P4691M2935J1454m4954p3462P5497M1727j9085N566o2169L913k7387
12818G27482K3075p0703r0928Q7506J29252N1963o0328k9417P9454R8319L4575
12807I80250K7065j9289p8333j1828Q7995k8435r7690P5096n3659m6312Q6938
12796I21798j6380L8007M6798M9593p6576q0527j9931O738R1993P3077n8231n4851
12784I21508J8256J0804n8631N773l2934n3097Q200Q7899R1884P7908N8565o977
12772A129158l0172k2619O769q4173J210K4608O1621R335M0243k8800m4073j35951
$$ y = [805272, 838209, 820219, 799878, 696439, 586575, 536204, 682280, 689762, 541964, 398680, 413240, 517157, 558365, 596276, 674457, 722499, 710029, 609343, 559268, 578244, 635008, 698756, 773447, 816382, 827836, 782882, 709420, 784917, 826644, 807559, 813125, 750956, 754869, 727482, 750557, 679854, 588926, 676432, 805684, 857647, 797319, 767902, 847356, 945675, 980250, 1007315, 988026, 909693, 897865, 985860, 957425, 859735, 934831, 881172, 834860, 921798, 905418, 943425, 990223, 1039816, 963240, 882713, 862782, 869520, 961513, 1034590, 976359, 921508, 939764, 950568, 891937, 897710, 864776, 811679, 819879, 907778, 999662, 1077570, 1136135, 1129158, 1098986, 1076367, 1083136, 998963, 1000173, 1024781, 1086402, 1095737, 1135980, 1107180, 1063107, 927156]
12760I27156n9460J06226P2643j612O0270m7609j13039j8172P2189R650p0249
12749I37993o9068p5846L4412J09322J12489N7697N8384j3690m647J6630k9159
12738A134517L7619m495p5892q1960N571M1453n2501o6014j1676K5941J0312M5880
12726A008755j29678j9072R5273J10348J01580M4577L323L8980Q1068l2727n6748
12715A245679o4046o5673M5J7038q4498N1627R7186R3469M9084L9591l6454q2137
12703A260911J03722J45972K4365q3393K9060n5093j8372k0062Q5417N2360j39
12692A524748p8021J6452P2936O1559J37759O6635R1045J18150K6348j8911m9158
12681A969542M6452N5505m2518P0568m8017k1404R161L6870N2525k2531j7900
$$ y = [927156, 867696, 973922, 1046565, 1044953, 1105223, 1057614, 944575, 926403, 998592, 1008242, 937993, 868925, 793079, 827491, 936813, 1049302, 1106999, 1165383, 1151693, 1147046, 1163676, 1134517, 1172136, 1167641, 1091749, 1009789, 1015360, 1056813, 1004312, 938298, 926622, 952563, 962875, 1008755, 879077, 860005, 955278, 1065626, 1167206, 1211783, 1215106, 1254086, 1335154, 1302427, 1245679, 1181633, 1115960, 1116005, 1133043, 1048545, 1100172, 1197358, 1290827, 1339911, 1379502, 1343048, 1260911, 1364633, 1510605, 1534970, 1451577, 1480637, 1425544, 1407172, 1387110, 1472527, 1524887, 1524748, 1446727, 1463179, 1536115, 1597674, 1735433, 1802068, 1893113, 2011263, 2037611, 2018700, 1969542, 2015994, 2071499, 2028981, 2099549, 2051532, 2030128, 2039289, 2076159, 2128684, 2106153, 2088253]
12670B088253P3907P7836m0374M5452k2686k4925J0076K5754J21372N8548M5412
12659B458625j1793L0917M2582j7416J00451J59124J10146J75264J36525J7750
12649C202175m5265J59313J52826J24564J62682Q398N0797O1902j747Q4049M8504
12638D008198J53795J82597J46492Q8378O0025R9905J55455K28340J91179J37479
12628E451843K57169K65548K02402J64782L32846L33405M16678M08226L64359
12619H197258M50627O38002O86778O84780R09487R74196R88577J091578J356126
12610A5977409J608884J790274K108377K453420K912376L337043M026423N047670
12602C9261876O402879Q341295J0855092J4133018J7668704K0964742K2314206
$$ y = [2088253, 2162160, 2239996, 2199622, 2245074, 2222388, 2197463, 2207539, 2233293, 2354665, 2413213, 2458625, 2446832, 2477749, 2520331, 2502915, 2603366, 2762490, 2872636, 3047900, 3184425, 3202175, 3156910, 3316223, 3469049, 3593613, 3756295, 3764693, 3815490, 3877392, 3875645, 3959694, 4008198, 4161993, 4344590, 4491082, 4579460, 4639485, 4739390, 4894845, 5123185, 5314364, 5451843, 5709012, 5974560, 6176962, 6341744, 6674590, 7007995, 7424673, 7832899, 8197258, 8647885, 9285887, 9972665, 10657445, 11566932, 12541128, 13529705, 14621283, 15977409, 17586293, 19376567, 21484944, 23938364, 26850740, 30187783, 34214206, 39261876, 45664755, 54006050, 64861142, 78994160, 96662864, 117627606, 139941812]
12595A39941812K0101409J3630769L794371o613392j4680546j8968994j9617824
12588A17587605j7641616j4511824j1126861q428579o254849m476584l179620
12581E1967672k239624j517468p20784R2953P86463J628704K502278L613699M784422
12572F0898315N965988P095030Q255111R457188J0913596J2556601J4261559J6163611
12564A45566999J8263562K0655120K4024792K8415810L3361292L7501110L8508125
12557C46296810L3286486K0732462L316492j4315323k7687025l4314148l4887615
12550B92428139l1267447k5701057k0446291j6312777j3618891j1996787j0707251
12543A62377638r301689p460063n145166k381368M94432L408144N959191P692181
$$ y = [139941812, 160043221, 173673990, 177468361, 170854969, 156174423, 137205429, 117587605, 99945989, 85434165, 74307304, 65878725, 59623876, 55147292, 51967672, 49728048, 48210580, 47489796, 47582749, 48369212, 49997916, 52500194, 56113893, 60898315, 66864303, 73959333, 82214444, 91671632, 102585228, 115141829, 129403388, 145566999, 163830561, 184485681, 208510473, 236926283, 270287575, 307788685, 346296810, 379583296, 400315758, 403632250, 389316927, 361629902, 327315754, 292428139, 261160692, 235459635, 215013344, 198700567, 185081676, 173084889, 162377638, 153075949, 145615886, 140470720, 138089352, 138583784, 141991928, 147951119, 155643300]
12535A55643300Q048182O587416M248877J997401R47227J721288M408074Q270177
12527A91871942J2045383J4768802J5919009J5053713J2892376J0662490R370391
12520B82584106R519766R809391Q190507L518383l563866j1008096j6518821j9228462
12512B63302908k0185677k0532884k1055103k1241903k0420773j8564493j6035122
12505A25266953j3136275j0185472p438134n051983l034678j143780Q13751K966405
12497H9056787N665434Q516198J1734299J5083430J7459076J7892829J5124712
12490A80532765Q757765K4382q765771j5765612j9682839k0316563j8756026j6140642
12482H9887459j3216098j0726386q656433p034291n770383m884407m268159l691634
$$ y = [155643300, 163691482, 170278898, 174527775, 176525176, 177472403, 179193691, 183601765, 191871942, 203917325, 218686127, 234605136, 249658849, 262551225, 273213715, 282584106, 292103872, 301913263, 310103770, 313622153, 310058287, 299050191, 282531370, 263302908, 243117231, 222584347, 201529244, 180287341, 159866568, 141302075, 125266953, 112130678, 101945206, 94507072, 89455089, 86420411, 85276631, 86090382, 89056787, 94722221, 103238419, 114972718, 130056148, 147515224, 165408053, 180532765, 189290530, 189314912, 180549141, 164783529, 145100690, 124784127, 106028101, 89887459, 76671361, 65944975, 57288542, 50254251, 44483868, 39599461, 35331302, 31639668]
12474C1639668l146030k725084k346080j970585j673002j467440j354542j135924
12466A5820981r19022q05698q03872p61000n69485m69681m89680m62316l42028
12457A0198199j87357l27375k06370j59334j49415j63002k39682l12792l12430
12448H140442m44404m68479m35437l07481k92736k69525k47922k93149j86407
12439E194902r1619j63526j59420j23842q5455j80637k64269j83777m4494Q957
12429C906820o0047r7477j06922j39851r4491r9606l3630j03051j2290o2572r7698
12418B999185j7286J3282n2753j89519j63101j60019n5043L7663n11M903j1011
12407B405790P4254k0921m8289m3750n2436j19476m2087j13384j52875j65790
$$ y = [31639668, 28493638, 25768554, 23422474, 21451889, 19778887, 18311447, 16956905, 15820981, 14901959, 14096261, 13292389, 12531389, 11961904, 11492223, 11002543, 10540227, 10198199, 10010842, 9683467, 9477097, 9317763, 9168348, 9005346, 8765664, 8452872, 8140442, 7696038, 7227559, 6792122, 6484641, 6191905, 5922380, 5674458, 5381309, 5194902, 5103283, 4939757, 4780337, 4656495, 4571040, 4390403, 4126134, 3942357, 3897863, 3906820, 3846773, 3749296, 3642374, 3502523, 3408032, 3308426, 3274796, 3171745, 3159455, 3096883, 2999185, 2981899, 2995181, 2942428, 2752909, 2589808, 2429789, 2374746, 2412409, 2411898, 2416801, 2405790, 2480044, 2459123, 2410834, 2367084, 2314648, 2195172, 2153085, 2039701, 1886826, 1721036]
12397A721036L6468L2082r2011k2268M6834N9442m7987n8909l7542K610j4334
12386A625421l9815p436l4213P2831O4687k5083m7934k5350J570r5560p4229R1101
12374A505990L5502o0294j1507J36989K1511n3842Q573j35938q6237P732o5790
12363A302689M133M6687k7723m8784k4144j3965N9133L5479n5758j3098J04637
12352A369286P9363J14766J29902L2562o791M7478j3213o6715n8817j82029q7679
12341A358113Q0741L8361m4260j08430l4847l7611O5539M2741p4521o3301J9369
12330A241894P74m4887J6898L2442l3586J2569O7719J03665m3300j19641R059
12319A243606J3148r7212o7068r6188r7540m325J12197N7547l1956q9821k6938
$$ y = [1721036, 1757504, 1789586, 1697575, 1675307, 1722141, 1781583, 1733596, 1674687, 1637145, 1639755, 1625421, 1585606, 1578170, 1543957, 1616788, 1681475, 1656392, 1608458, 1583108, 1584678, 1489118, 1414889, 1505990, 1541492, 1481198, 1469691, 1606680, 1628191, 1574349, 1582922, 1446984, 1360747, 1368479, 1302689, 1306822, 1353509, 1325786, 1277002, 1252858, 1238893, 1298026, 1333505, 1277747, 1264649, 1369286, 1448649, 1563415, 1693317, 1725879, 1719088, 1766566, 1753353, 1686638, 1627821, 1445792, 1358113, 1438854, 1477215, 1432955, 1324525, 1289678, 1252067, 1317606, 1360347, 1285826, 1222525, 1241894, 1242668, 1197781, 1214679, 1247121, 1213535, 1226104, 1293823, 1397488, 1354188, 1234547, 1243606, 1256754, 1159542, 1092474, 996286, 898746, 894421, 1006618, 1064165, 1032209, 942388, 915450]
12308I15450K9919M8098Q6243k0177p8m6584j6573l2150k5904J12388l758n4920
12296I91954p1065J21624O0581k5086Q3111O5520j3940m1924j21780o5382L9263
12285A022876L38j4591K951J4681l4440J1757r9349l0881j3023N1955k4312n0185
12273H37777r7087j05720J4879M1556O2093K5633l3774l0834j1070J15592P4012
12262H93057j8891P9197N7285j8986J4573q5658r0216j01970o6999k3229n3009
12251E85154r0881L4564N8999M1925O2443P9772o1698j07140P9282Q525l2286
12240F58659N6661N6246J4864p77j50825o1475P4815P991J2834k6403O9823P4452
12228G86865k2544K058n3333q1771K0191O6199o7165j26283L0995k64K2511m6056
$$ y = [915450, 945369, 993467, 1079710, 1059533, 1059455, 1012871, 996298, 964148, 938244, 1050632, 1046874, 991954, 920889, 1042513, 1103094, 1078008, 1161119, 1226639, 1212699, 1170775, 1048995, 983613, 1022876, 1023214, 1008623, 1011574, 1026255, 991815, 1003572, 904223, 873342, 860319, 912274, 887962, 837777, 740690, 634970, 649849, 691405, 753498, 779131, 745357, 714523, 703453, 819045, 893057, 874166, 953363, 1010648, 991662, 1006235, 920577, 830361, 728391, 661392, 638163, 585154, 494273, 528837, 587836, 629761, 692204, 771976, 710278, 603138, 682420, 690945, 658659, 715320, 771566, 786430, 785653, 634828, 573353, 648168, 656159, 668993, 642590, 712413, 786865, 764321, 766379, 713046, 631275, 651466, 717665, 650500, 524217, 555212, 554948, 577459, 531403]
12216E31403L1755k1973l2185l3747K7009L3864M8096K261l0063m3099j332m2850
12204D69139k6916N0700l0989n6393N0679K4289J7154l1413q423J0847J2386r5107
12192C85953J0955R8723O6631L9916l3543j8026O679l3366l871L734P080J1188
12180E42053M5027l5197k2568n4014k0687K7633P9039J5229Q740K3332q5955j0026
12168E12606j02041q0309o187J06753M9168N4096R7278J30346j3796o7002J5391
12157F96303J85731J89080Q9469Q2642K4786m1533j27592j23410n1648m0064K5583
12146I09347k2816o3395m9461J3596n2458j5092k7964n8574j3171k8144M3498
12135F35366M8841M7774O8016N7009k3197k0005O5098R9014Q4964J00926J32429
$$ y = [531403, 563158, 541185, 509000, 475253, 502262, 536126, 584222, 586483, 556420, 513321, 511989, 469139, 442223, 492923, 461934, 405541, 456220, 480509, 497663, 466250, 457827, 468674, 481060, 385953, 396908, 495631, 562262, 602178, 568635, 550609, 557288, 523922, 520051, 523785, 530865, 542053, 587080, 551883, 529315, 475301, 454614, 482247, 561286, 576515, 585255, 608587, 522632, 512606, 410565, 330256, 324069, 430822, 479990, 534086, 631364, 761710, 747914, 680912, 696303, 882034, 1071114, 1160583, 1243225, 1268011, 1226478, 1098886, 975476, 923828, 883764, 909347, 886531, 823136, 773675, 787271, 734813, 719721, 691757, 633183, 620012, 591868, 635366, 684207, 731981, 799997, 857006, 833809, 813804, 878902, 977916, 1062880, 1163806, 1296235]
12124A296235M0755l146J43447J08635J72714K29033K62183J74784l5633j24952
12114B264055j05644j83217j43223j87163j10443j4669j17572q077n3942n7466
12104A282639o7153k9138j5885l3615N7649M6423P4850L0046k6089J3841r2729
12093A240839l3841L7871J2736o010J1898N2335R8031M7765M7532P4259Q5183
12082A668598l7973Q1548J47022N1803L6516M2091k6417j54207j19504q3561K2529
12071A628445j1489m676k56020k31548p9610l9949q3829j01278q919j00407n1318
12060F59402n8826L8145O2938K766P6212J77451J72185J93405P4342j08993j3724
12049A275303n1300j37712j31346j65464q1105m2578l7607k7968r680j7171n5400
$$ y = [1296235, 1336990, 1333844, 1477291, 1585926, 1758640, 1987673, 2249856, 2424640, 2389007, 2264055, 2158411, 1975194, 1831971, 1644808, 1534365, 1519696, 1402124, 1394047, 1340105, 1282639, 1215486, 1186348, 1170463, 1136848, 1194497, 1240920, 1315770, 1345816, 1319727, 1333568, 1240839, 1206998, 1244869, 1257605, 1251595, 1263493, 1315828, 1413859, 1461624, 1509156, 1583415, 1668598, 1630625, 1712173, 1859195, 1910998, 1947514, 1989605, 1963188, 1808981, 1689477, 1605916, 1628445, 1616956, 1612280, 1356260, 1124712, 1045102, 1005153, 921324, 820046, 811127, 710720, 659402, 600576, 638721, 701659, 704425, 780637, 958088, 1130273, 1323678, 1398020, 1289027, 1275303, 1224003, 1086291, 954945, 789481, 708376, 665798, 628191, 600223, 590543, 573372, 517972]
12038E17972o814j10315r39M0409K7912K169j06854q2439m2553J09830J8069L3321
12026C99768J56143M35r2228L2636m2519n6896p6152m6194n4916m2377P3046N7397
12014C08143q4782n2057P495J9613J27059K7344k6564K2724k3296n9365n2245
12003B14069K4721j2236L3554n4932J37599P6129n5541O251M0088n4244p2625
11992B82833J22043L1223j2003N258l2911p6838j2970j07350l8092J79422Q7653
11981D28268n8584j8956j2692L7336o4633O0098J05768m0728n239o2361N1552
11970D19829j08140p3352L4879K1768N8798K6901N4986L0430p030j33156n5609
11959B70304k9044K5165J36574k3037M0583J18074n989N0756K6257j6215J67475
$$ y = [517972, 511158, 400843, 399904, 440313, 468225, 470394, 363540, 281101, 238548, 348378, 366447, 399768, 555911, 556346, 464118, 496754, 454235, 397339, 321187, 274993, 220077, 177700, 250746, 308143, 223361, 171304, 178799, 198412, 325471, 352815, 326251, 348975, 325679, 266314, 214069, 238790, 226554, 260108, 205176, 342775, 418904, 363363, 369614, 409702, 355458, 282833, 404876, 436099, 424096, 429354, 396443, 319605, 306635, 199285, 161193, 340615, 428268, 369684, 350728, 338036, 375372, 310739, 370837, 476605, 435877, 430638, 368277, 419829, 311689, 238337, 273216, 294984, 353782, 380683, 435669, 466099, 459069, 325913, 270304, 241260, 266425, 402999, 379962, 420545, 538619, 532630, 583386, 609643, 593428, 760903]
11948G60903J40308K47746K63150J86153P693l2799j52518k76115n3435j14391
11938I76695k24379j07673k1660m8341k2807L5533O2970J717j06862N8488K1698
11927F25379R8329O7751J23212J64530N4311n5739n6302r0174j56748K3355K1584
11916H19488P21O3673J53210R7418J26650P1587J85676j6204j57643j34329r8251
11905A111996j71874r3544L7053J47204J52004K3462j37906j69536j48676r7051
11895F53132n2196J6571m442r3985m8804k8346N878l2603J21822J23260M7758
11884G08045L4049l4914J12009J81010J48141k8932L3636M977l4424j71484j17334
11873H34779j30928j24744q4026J059k015m6869N298M9647j32538j3476L2265
$$ y = [760903, 901211, 1148957, 1412107, 1598260, 1605953, 1573154, 1420636, 1144521, 1091086, 976695, 752316, 644643, 622983, 574642, 551835, 587368, 650338, 652055, 545193, 603681, 625379, 723708, 791459, 914671, 1079201, 1133512, 1077773, 1021471, 931297, 774549, 797904, 819488, 820209, 883882, 1037092, 1134510, 1261160, 1332747, 1518423, 1502219, 1344576, 1210247, 1111996, 940122, 846578, 883631, 1030835, 1182839, 1206301, 1068395, 898859, 750183, 653132, 600936, 617507, 613065, 519080, 470276, 441930, 447808, 415205, 537027, 660287, 708045, 742094, 707180, 819189, 1000199, 1148340, 1119408, 1153044, 1158021, 1123597, 952113, 834779, 703851, 579107, 495081, 496140, 494125, 447256, 452554, 502201, 369663, 356187, 388452]
11862C88452l4037l4263r229p6825J2221M6057n1154P857k0463r1445O2633M3480
11850B43284M2969M909l6798n329l4529j1875o547k4702o2416L8375p0317m9259
11838B7765J04855J17744J06384M4955K5539j6347o560J3603j0892m3645j00652
11827B62749j8642J11741J4055j05877r4956j3163M411K926J0258j6279N147j8217
11815A44153j18478P6971J34282K8767n6326O4149p2830J7116N9518K7913n2150
11804B53085O529L4894n5834k1128K5442R4141L7173m8317n6510o0491J5033P0243
11792B94260N9304j6379K3699M7295j35921r6336M2388N9055N5564j9091J5552
11781C29390K2896M6349o368J3183P3699M9604j100o0512q3699m8161Q9472O1610
$$ y = [388452, 354415, 320152, 310923, 234098, 246319, 292376, 241222, 249079, 228616, 137171, 199804, 243284, 286253, 291162, 254364, 249035, 214506, 202631, 196084, 171382, 108966, 147341, 77024, 27765, 132620, 250364, 356748, 401703, 427242, 410895, 404335, 417938, 407046, 363401, 262749, 244107, 355848, 369903, 264026, 169070, 155907, 160318, 163244, 173502, 157223, 162370, 144153, 25675, 102646, 236928, 265695, 209369, 273518, 200688, 217804, 277322, 305235, 253085, 259614, 294508, 238674, 217546, 242988, 337129, 374302, 325985, 269475, 208984, 224017, 294260, 353564, 337185, 360884, 408179, 272258, 175922, 218310, 277365, 332929, 313838, 329390, 352286, 398635, 392267, 405450, 479149, 528753, 527653, 467141, 383442, 335281, 424753, 486363]
11769D86363k1290Q0711n0134p7044p2962o3841j5887m2728L2157L6627M7287
11758C39259L5315K0352Q8593P6918q74p5827m4906n0263m7530J23458J0770j58326
11746C16939Q919R13L7251R9311K0732k8134l0294j3309K9676p9116n7648N6350
11734C61590q7731p7576j7573J19909L5468p2675k8881k1583K1061M8970m7215
11723B33764P230Q5737P582O3703j4378l2246O2013k4937j8622P5029P206j7185
11711D34896K5237J3095k9802m9874j9250K6368P0557p739K1618L7814q8000p5546
11699C59374l7016o2189L8737Q4440j6030L3488J2956j8837L6859M220K3532p476
11687D52058l7248J6843Q6439O2477l0150n3702K9366J58997J58784J23680K36917
$$ y = [486363, 465073, 545784, 495650, 418606, 345644, 281803, 265916, 223188, 255345, 291972, 339259, 374574, 394926, 483519, 560437, 559563, 483736, 438830, 388567, 341037, 464495, 475265, 316939, 325858, 326771, 364022, 463333, 484065, 455931, 425637, 412328, 442004, 362888, 305240, 361590, 273859, 196283, 178710, 298619, 334087, 261412, 232531, 210948, 232009, 280979, 233764, 240994, 326731, 334313, 398016, 383638, 351392, 413405, 388468, 369846, 444875, 452081, 434896, 460133, 473228, 443426, 393552, 374302, 400670, 471227, 463488, 485106, 522920, 434920, 359374, 322358, 260169, 298906, 383346, 367316, 400804, 413760, 394923, 431782, 436002, 459534, 452058, 414810, 431653, 518092, 580569, 550419, 496717, 526083, 685080, 843864, 967544, 1204461]
11676A204461K11179J40515Q4268k7306j11680N0774Q3157M6929M8783l7715j15516
11665A577849k18873j54159k11383j82883n2049Q5090M4269L2768j0261L4300
11655I44668M9848P5974R9835J36291M7426K2583K3367n1945o7315j7780L1128
11644A294080R2778J04860P7670J19693K5143N8168n191r2725M0132K5678j36187
11633A604099k4983J31492K0763p2696j23833j35573p0997j03424m864P0164M6669
11622A336817j0054O1650l0156k0249j9767o3499m6947Q566j3178O3191J4204
11611A280578j16815l9358J59853L2106J06596J92586N7721R6212J49298J00931
11601B019708r7212k4809j06210j44613j05265k7189L5722J2548j32147m0689
$$ y = [1204461, 1415640, 1556155, 1640423, 1613117, 1501437, 1552211, 1635368, 1682297, 1731080, 1693365, 1577849, 1358976, 1204817, 993434, 810551, 758502, 843592, 887861, 920629, 910368, 944668, 994516, 1070490, 1170325, 1306616, 1354042, 1376625, 1399992, 1348047, 1280732, 1262952, 1294080, 1386858, 1491718, 1569388, 1689081, 1714224, 1772392, 1767201, 1674476, 1714608, 1740286, 1604099, 1579116, 1710608, 1731371, 1658675, 1534842, 1399269, 1328272, 1224848, 1219984, 1290148, 1336817, 1326763, 1388413, 1358257, 1338008, 1318241, 1254742, 1207795, 1216361, 1203183, 1266374, 1280578, 1163763, 1124405, 1284258, 1316364, 1422960, 1615546, 1673267, 1769479, 1918777, 2019708, 1922496, 1897687, 1791477, 1646864, 1541599, 1514410, 1550132, 1562680, 1430533, 1389844]
11591A389844k1976j18179l1809N3507N7535q4962k6991J15412N292m8714N6794
11580A345753k426L780P1638P1218Q5896N9165j02628m160J63069J3361P9127
11569A783793Q9962O6004M2593O0839J02187J13550K14293J57838J00588K3155
11559B754802J88391J73230J08954J88041M6779J19935K80689L24750L20682M24844
11549D931097M70778N86198O60461N92877O33161O05454N77064O95261Q41499
11540A0593850R79299J336086J674022K151601K535882L199371M075296N535254
11532C2080661P318467J0180403J4348367K0473298K8297687L7033375M2768277
11525A92500535L8270055J9947003n673485k6593547l6765206l6831777l0811719
$$ y = [1389844, 1367868, 1249689, 1217880, 1271387, 1328922, 1243960, 1216969, 1332381, 1337673, 1288959, 1345753, 1343327, 1347107, 1418745, 1489963, 1575859, 1635024, 1532396, 1528236, 1691305, 1704666, 1783793, 1873755, 1939759, 1982352, 2043191, 2145378, 2258928, 2473221, 2631059, 2731647, 2754802, 2943193, 3116423, 3225377, 3413418, 3460197, 3580132, 3860821, 4185571, 4506253, 4931097, 5401875, 5988073, 6648534, 7241411, 7874572, 8480026, 9057090, 9752351, 10593850, 11573149, 12909235, 14583257, 16734858, 19270740, 22470111, 26545407, 32080661, 39399128, 49579531, 63927898, 84401196, 112698883, 149732258, 192500535, 230770590, 250717593, 245044108, 218450561, 181685355, 144853578, 114041859]
11518A14041859k3020959j6067166j1149923p717464n268675l384300j785116
11511D5648256j12499J610891L708794O895352J1293713J7235141K3612114K6443208
11503A36334970J9748320M832212r390364j6835688j6860967j1495135l782124
11496A02551224M679138J3465785K2102857K9735027L2769740K6958713J1513930
11489B43776414p896308k3117193k9134382k6645115j8749156q411464K447461
11482A32270257J1544042J5046569Q581459n680480j8665645k4403317k3719279
11475I4973606j9168051j3699805r021289n780922l722261k005041n32228O73025
11467D1717034J797190L560400N679150Q628144J2953735J8786154K6133212L2983312
$$ y = [114041859, 91020900, 74953734, 63803811, 56086347, 50817672, 47433372, 45648256, 45535757, 47146648, 50855442, 57750794, 69044507, 86279648, 109891762, 136334970, 156083290, 160915502, 151525138, 134689450, 117828483, 106333348, 102551224, 107230362, 120696147, 142799004, 172534031, 205303771, 232262484, 243776414, 235880106, 212762913, 183628531, 156983416, 138234260, 129822796, 132270257, 143814299, 158860868, 167442327, 161761847, 143096202, 118692885, 94973606, 75805555, 62105750, 53084461, 47303539, 43581278, 41576237, 41044009, 41717034, 43514224, 47074624, 52753774, 61381918, 74335653, 93121807, 119255019, 152238331]
11459A52238331L5069425K6917014Q051766j3957473k9348704l4857019l2514865
11452A11598475k6042737j8930312j3539785r909683p250587n640290m455053
11445B5830028l662132k998693k404472k030478j503131j211207j028062p96813
11437A0195040o70100n09908o81973o78823n62630n03364m06911m65821l99656
11428E315854l18741l37593l54764k68113k64611k08539j83229j37597p7404q9697
11418C075566j13311J2178J5966n9792j52257m7389j52658j57529j21422m3620
11408B255732n1703K0115J5678n2180l8023j5811J6810N5862n302j02877j17416
11397A980885r6925p6847j3484j5568L4046O0594j2399o1969o5669K5601R4m2493
$$ y = [152238331, 187307756, 214224770, 222276536, 208319063, 178970359, 144113340, 111598475, 85555738, 66625426, 53085641, 43175958, 35925371, 30285081, 25830028, 22167896, 19169203, 16764731, 14734253, 13231122, 12019915, 10991853, 10195040, 9524940, 9015032, 8333059, 7654236, 7091606, 6588242, 6181331, 5715510, 5315854, 4997113, 4659520, 4304756, 4036643, 3772032, 3563493, 3380264, 3242667, 3165263, 3075566, 2962255, 2974433, 2990399, 2930607, 2778350, 2730961, 2578303, 2420774, 2299352, 2255732, 2204029, 2224144, 2239822, 2187642, 2149619, 2133808, 2150618, 2206480, 2201178, 2098301, 1980885, 1883960, 1807113, 1793629, 1778061, 1812107, 1872701, 1860302, 1798333, 1732664, 1758265, 1758359, 1715866]
11385A715866O3914M1504Q5706M5780J275l3557M7890n1935q8671j4839L2532
11374A845465l5917j69897j10043K3041l9230j25345m6502j192j2140L9796q9231
11363A278805j6004N6534l8425p9785K3025J21518K03873J08581o5440p2655k6879
11352A493148L5596J3122K5148J2409P4713Q7868Q1555m0749l3932k086l9240
11341A707552p3846N964p7212q2535K2503M3780Q0166K8394j30547j24097j13324
11330A286798j875J02587K6349Q0636J5412J14185K5012N2443m1791j42571O0794
11319A577979J73670M6050K8719K01779K03631J96598L3159J11297k3649j65658
11309B383575j44498j15578j54155l6169J6873j1102m9997J11938J41626J943
$$ y = [1715866, 1779780, 1821284, 1906990, 1952770, 1954045, 1920488, 1968378, 1916443, 1827772, 1812933, 1845465, 1809548, 1639651, 1529608, 1552649, 1513419, 1388074, 1341572, 1340380, 1328240, 1368036, 1278805, 1262801, 1319335, 1280910, 1201125, 1224150, 1345668, 1549541, 1658122, 1592682, 1520027, 1493148, 1528744, 1541866, 1567014, 1579423, 1654136, 1742004, 1823559, 1782810, 1748878, 1746792, 1707552, 1633706, 1639670, 1562458, 1479923, 1502426, 1546206, 1626372, 1654766, 1524219, 1400122, 1286798, 1284923, 1387510, 1413859, 1494495, 1509907, 1624092, 1649104, 1701547, 1659756, 1517185, 1577979, 1751649, 1797699, 1826418, 2028197, 2231828, 2428426, 2461585, 2572882, 2549233, 2383575, 2239077, 2123499, 1969344, 1933175, 1950048, 1938946, 1888949, 2000887, 2142513, 2144456]
11299B144456n6401L006O6286J08553Q9420N9443J43469J16031J37314J50840
11289B962417O8349K26622K92084J42031J14091K90260L78845L46053M04601N43662
11279E769015N94191O82426O65702N47610M58822K84645N35174P05755Q47048
11270A1090388J129467J318871J768575K290130K945609M017126N552986P710101
11262C7823253J0658841J4894761K0837071K8482333L6315259L9388746L0407288
11255B18807552Q930082j4501795k9708664l4477719l1446809k4836971j8160642
11248G4605034j2684490q777468n999382m156726k816030j542867o06741M63462
11240C8484792J807118L391428M863946O444725P680792Q493559Q544516P869998
$$ y = [2144456, 2088055, 2091061, 2157347, 2265900, 2355320, 2414763, 2558232, 2674263, 2811577, 2962417, 3030766, 3257388, 3549472, 3691503, 3805594, 4095854, 4474699, 4820752, 5225353, 5769015, 6363206, 7045632, 7711334, 8258944, 8717766, 9002411, 9537585, 10243340, 11090388, 12219855, 13538726, 15307301, 17597431, 20543040, 24560166, 30113152, 37823253, 48482094, 63376855, 84213926, 112696259, 149011518, 188400264, 218807552, 227737634, 213235839, 183527175, 149049456, 117602647, 92765676, 74605034, 61920544, 53143076, 47143694, 42986968, 40170938, 38628071, 38021330, 38484792, 40291910, 43683338, 48547284, 54992009, 62672801, 71166360, 79710876, 87580874]
11232H7580874P416932P527746Q407570R456591R430695Q754398Q817897J0093124
11224A57485827J2369137J5283461J7642501J6427144Q907013k950212j3383799
11217B11781072j7982382j6911305j3473329j0404480q286266o708558n924802
11210A32089950n795281o384390o869210o733672o455075o405082o832369p504165
11202G9110706q021353p805723p152505n834827m395659k848196j657099m81243
11194D0914101R28761K225598M206878O758515J0415390J5567763K2199045L0655723
11186A33871774L8891632M1306841L0219257O296310j9139977l5263289l9779470
11179A56403078l5935286k8318797k0538170j4597263j0605514p901277o037945
$$ y = [87580874, 94997806, 102525552, 110933122, 120389713, 129820408, 138574806, 147392703, 157485827, 169854964, 185138425, 202780926, 219208070, 228115083, 225164871, 211781072, 193798690, 176887385, 163414056, 153009576, 144723310, 138014752, 132089950, 126294669, 119910279, 113041069, 106307397, 99852322, 93447240, 86614871, 79110706, 71089353, 63283630, 56131125, 50296298, 45900639, 43052443, 41395344, 40914101, 41842862, 44068460, 48275338, 55033853, 65449243, 81017006, 103216051, 133871774, 172763406, 214070247, 244289504, 250585814, 231445837, 196182548, 156403078, 120467792, 92148995, 71610825, 57013562, 46408048, 38506771, 32468826]
11172C2468826m876106l958971l044982k413567k069292j693986j209212r27868
11164A2274842p58084o84779o44216n31594o88093q41499p14186o59528o39430
11155F113433n21274l99953l21679k90678k10594l20628j74767j68058j49107
11146C556695j56502j98676j28735j57115q8721P265o6674o8549p1840j01436
11136B525712p3271n8291q4813j88398j15781l7293n7172j32066r3436O0143r620
11125A735714m6552p6083J7721o1495q8619p9557J1596J8226k8812P504K2664
11114A432307n7047n1857q282n9975n7625m9844l6754L1098j1438P4524R4798
11103A299905Q2548O3555o701M6191K95239K79088J86383n6946k20642j58310
$$ y = [32468826, 27592720, 23633749, 20588767, 18175200, 16105908, 14411922, 13202710, 12274842, 11516758, 10831979, 10187763, 9656169, 8968076, 8126577, 7412391, 6752863, 6113433, 5592159, 5192206, 4870527, 4579849, 4369255, 4048627, 3873860, 3705802, 3556695, 3400193, 3201517, 3072782, 2915667, 2826946, 2834211, 2767537, 2698988, 2627148, 2525712, 2452441, 2394150, 2309337, 2120939, 2005158, 1967865, 1910693, 1778627, 1685191, 1745334, 1735714, 1689162, 1613079, 1630800, 1569305, 1480686, 1401129, 1412725, 1430951, 1402139, 1409643, 1432307, 1375260, 1323403, 1315121, 1255146, 1197521, 1147677, 1110923, 1142021, 1130583, 1205107, 1299905, 1382453, 1446008, 1439307, 1485498, 1780737, 2059825, 2246208, 2189262, 1968620, 1810310]
11093A810310k31156j89343j21501p9635j0925N9094J4178m0896l2263j2555n6947
11082A108361k9247O9400L8315N2584J19885J3005Q7154l9921j3853n2131j32297
11071A221255o7556m0176Q2670J07271J35157J94286J68822O4795O0677o9723
11061A857478k43861k27626j01450o6652L0638K9890k0380J36579K10311k7185
11051A577742j71764j37204n1829j00397q5815j11271j5843N966J00009R3662
11041A103256m396L5882J09807J2189m7083K3555P1291Q098J03646J50100J44050
11030A710395l7125n2450r5667k61900k11770r9933j09159k09705j7571K8763
11020F43878l4778l2311l3584L8036L2362m7691k8466j0081J303r2742q6646O7889
$$ y = [1810310, 1579154, 1389811, 1268310, 1188675, 1177750, 1236844, 1251022, 1210126, 1177863, 1165308, 1108361, 1079114, 1148514, 1186829, 1239413, 1359298, 1372303, 1459457, 1419536, 1405683, 1353552, 1221255, 1153699, 1113523, 1196193, 1303464, 1438621, 1632907, 1801729, 1866524, 1927201, 1857478, 1613617, 1385991, 1284541, 1217889, 1248527, 1278417, 1258037, 1394616, 1604927, 1577742, 1405978, 1268774, 1216945, 1116548, 1030733, 919462, 903619, 909585, 1009594, 1103256, 1098860, 1134742, 1244549, 1256738, 1209655, 1233210, 1304501, 1312599, 1416245, 1566345, 1710395, 1673270, 1620820, 1525153, 1263253, 1051483, 951550, 842391, 632686, 615115, 643878, 609100, 576789, 543205, 581241, 613603, 565912, 537446, 527365, 528668, 435926, 349280, 417169]
11008D17169J7512N9744l682Q799j978M769o4245m4746O7124k0920j19312P37
10996C20971j1662K4590L8351j1499q9064N723J04728k3669k4659L3244M6955
10985D14009k4280R106K2468L042j06648J6078O2987k3085j09767l4896l1166
10974A97848R9141P9867m0872N568N7088N4672j32612j17566j3184Q5552P3394
10963C48896j9086l2803J8709o7734J4288Q2602M1170P6724r4773r6582q9499
10952A81912n8467N9440O1316O6909J6840o2328j4917N6982J3734p8362j31732
10941A11327p3601L8880J32685R1984m8015M8225L7961r2264l1977J12876L5464
10930C63545J0448O242M1331J21026L0021r5936l7915J361r166K9140L7577J3940
$$ y = [417169, 434681, 494425, 490743, 499542, 497564, 502333, 438088, 393342, 460466, 439546, 320234, 320971, 309309, 333899, 372250, 360751, 271687, 277410, 382138, 358469, 333810, 367054, 414009, 389729, 398835, 421303, 424345, 317697, 333775, 396762, 373677, 263910, 229014, 197848, 296989, 376856, 335984, 341552, 398640, 453312, 320700, 203134, 189950, 275502, 348896, 329810, 297007, 315716, 247982, 262270, 344872, 386042, 462766, 367993, 271411, 181912, 123445, 182885, 244201, 311110, 327950, 265622, 250705, 307687, 321421, 243059, 111327, 37726, 76606, 209291, 301275, 253260, 301485, 339446, 247182, 215205, 328081, 363545, 373993, 380235, 421566, 542592, 572613, 476677, 438762, 440123, 430957, 460097, 497674, 511614]
10918E11614j6572l3628n1259l6721n1625Q2630Q690j11841l5046O250N670p473
10906B70689N7329m7454q0649k0349P47N8537m602J6494J00605P7965n7280L358
10894C75390m7190l3985o9440N447Q8357l993J861J1359k5612J6947K8179J3003
10882C60323n0506m0549o1855l1349k8122O9728K1371m5137N1783j2032J0101
10871B43756L7412l1503N8903O6375m3266l271K0245p329J0853n4826j05455J18281
10859C10175O0702K1110J49930O628j52118O1720J22515M652o1118j27775o1159
10848C35262m9159M0510K0195L2275Q3438m7630K8726K9628r7559p1096O7139
10837C71729K11053J33572K5783N0537J56022J47639J65470J01237n0152j68827
$$ y = [511614, 495042, 461414, 410155, 373434, 321809, 404439, 413129, 301288, 266242, 272492, 278162, 270689, 328018, 280564, 199915, 179566, 180313, 238850, 234248, 250742, 351347, 429312, 372032, 375390, 328200, 294215, 224775, 230222, 318579, 314586, 316447, 327806, 302194, 319141, 347320, 360323, 309817, 269268, 207413, 176064, 147942, 217670, 239041, 193904, 245687, 233655, 243756, 281168, 249665, 308568, 374943, 331677, 328406, 348651, 341322, 352175, 297349, 191894, 310175, 370877, 391987, 541917, 548545, 396427, 458147, 580662, 585314, 524196, 396421, 335262, 286103, 326613, 346808, 379083, 462521, 414891, 443617, 473245, 375686, 304590, 371729, 582782, 716354, 742137, 792674, 948696, 1096335, 1261805, 1363042, 1312890, 1144063]
10827A144063o1631o6342j73496k12346j08779o3638J05886J3135p147n0979k7292
10816D91434R338r569o517K1611j22o2374q0896J58759J30185M0358j9499J17310
10804G90018P1951j4413L1431l521R6933J19997J19553J46132Q2556m2150j03981
10793A294506r7601j07992j18032n9001l4067n2642k6673k5328j9984p1629J8734
10782G00291L0907m2618j5261m8809L1083J01670q5039j05694j44396L3150l5432
10771D19852m2325m4827R552m9024j416O4860l240N3449Q5203P5627L49622J87319
10759A104652M1166R2291M067k03156j92336j42909r8045j31615j09842q3766
10749B80507m7439j07607o6476L7755O5642M3339K35J14657n9864k4993q7401
$$ y = [1144063, 1082432, 1016090, 842594, 630248, 521469, 457831, 563717, 576852, 569705, 518726, 491434, 500772, 491203, 484686, 506297, 506175, 443801, 362905, 521664, 651849, 692207, 672708, 790018, 861969, 847556, 878987, 875466, 972399, 1092396, 1211949, 1358081, 1440637, 1398487, 1294506, 1196905, 1088913, 970881, 911880, 877813, 825171, 798498, 773170, 753186, 681557, 700291, 731198, 688580, 673319, 624510, 655593, 757263, 672224, 566530, 422134, 455284, 419852, 377527, 332700, 342252, 293228, 291812, 356672, 353432, 406881, 492084, 567711, 917333, 1104652, 1145818, 1238109, 1242176, 1039020, 846684, 703775, 605730, 474115, 364273, 280507, 233068, 125461, 58985, 96740, 162382, 205721, 205956, 320613, 260749, 235756, 148355]
10738A48355o4890j8818l160L6904P2867J18707O647o6806j1520j2286q2205p6960
10726D6835N3779p2299J4222P7571R1840R305J1317l2863r8351j30996K8919Q7242
10714H6521N9164n212K874M9916q139l5330m3216N3083K0937j4454L3433k5707
10702A73870j3622n927l9138N4311K6527J9950j4960q8943M879P9553L5826o7733
10690A64593j4213m0623k9103j3394Q2657J20454M1004n7358P4008K3276o4261
10679B87040j70321q0408L3602P2907M1301O6476o9909l1469M0549O3315K1591
10668B74674m9283n5069J00430R943k1906n7618n8429L0018j171K5571p1737K6985
10656A52408N6305N3942k7788p5838m5094o8235J9593J7213R0355n6419q7193
$$ y = [148355, 83465, 64647, 61487, 98391, 171258, 289965, 296612, 229806, 218286, 206000, 123795, 46835, 100614, 28315, 42537, 120108, 211948, 221253, 232570, 199707, 101356, -29640, -721, 86521, 145685, 140473, 143347, 193263, 185124, 149794, 106578, 159661, 180598, 166144, 199577, 173870, 160248, 154321, 115183, 169494, 196021, 215971, 201011, 112068, 116947, 196500, 232326, 164593, 150380, 109757, 80654, 67260, 149917, 270371, 311375, 254017, 328025, 351301, 287040, 116719, 36311, 69913, 142820, 184121, 250597, 180688, 149219, 189768, 253083, 274674, 225391, 170322, 270752, 280695, 258789, 201171, 142742, 172760, 171589, 197160, 125423, 152408, 208713, 262655, 234867, 159029, 113935, 45700, 65293, 82506, 172861, 116442, 29249]
10645B9249N7116L6313J2451r356N9117J3532q489n0745j8969J027N3631l6813
10633A38064m8614l4093j2221L3621n3676K5229J3228J0954j1275n00O1022P1990
10621A93729j9330q2452k7410m940l4449K8290k2596R399K1280n0083l2107J02974
10609H2305p0913q4351J77J16879M3680K9940O2105p7239j02895p4810L4739L8489
10597a894R1624O9215O154m1701R491n8142J8093J3756o036R6647L648q4102k6937
10584H9816Q6732L9133o6007j01261m736l3327J1801J09580L117n4665Q345l9734
10572D8794n4644N5829M8528l9392O9759J56546q8867o4110K2997L7457l2812
10561A60085o2396l8615P2815N2933M7854p7066M8863L1222O544j7405n6684j3664
$$ y = [29249, 86365, 122678, 135129, 125773, 184890, 198422, 189933, 139188, 120219, 121246, 174877, 138064, 89450, 55357, 43136, 76757, 23081, 48310, 61538, 72492, 61217, 60717, 121739, 193729, 174399, 91947, 64537, 59597, 25148, 53438, 30842, 40241, 61521, 11438, -20669, 82305, 11392, -72959, -72782, 44097, 87777, 117717, 179822, 102583, -312, -75122, -40383, -1894, 89730, 158945, 165099, 123398, 132889, 74747, 92840, 106596, 100560, 197207, 200855, 116753, 89816, 176548, 215681, 149674, 48413, 43677, 10350, 22151, 131731, 134848, 80183, 88528, 48794, -5850, 49979, 98507, 59115, 128874, 285420, 196553, 132443, 155440, 192897, 160085, 97689, 59074, 131889, 184822, 232676, 155610, 204473, 235695, 242239, 224834, 168150, 154486]
10549A54486k2045p912q045K2196K4619n0975J1209L9519M3575l0500n7550m7993
10537G0584P0078j8296Q6959r397p6343L135Q3843O0446m9444j05370p0073K104
10525D8226J217J0846M0479l902j08887J9411M4332J6698n4746L613J01048O9271
10513A87606q6577q9177K1608N778N9428O0726m3080l7760k7228q7015j08366
10502a44057N0614Q4717l9719K4139L6545L4728k7341j15143k4313J07777J34493
10491A22440l8153k0093L1788l4423m9598L7112L8899n8186J23403K1847k3014
10480A52022J2635r331n059r9380L5014J01047N356k3725k6208L2497L0966r3025
10468A12809j25355R269L1712p123K8082J64645K2158r2031L9880O5909O9152
$$ y = [154486, 132441, 124529, 116484, 138680, 163299, 112324, 123533, 163052, 206627, 176127, 118577, 70584, 140662, 122366, 209325, 199928, 123585, 126720, 210563, 271009, 221565, 116195, 46122, 48226, 49443, 60289, 100768, 96866, -12021, 7390, 51722, 68420, 13674, 17287, 118335, 187606, 101029, 11852, 33460, 39238, 98666, 159392, 116312, 78552, 51324, -35691, -144057, -93443, -8726, -48445, -24306, 12239, 46967, 19626, -95517, -119830, -12053, 122440, 84287, 64194, 95982, 61559, 11961, 49073, 87972, 29786, 153189, 175036, 152022, 164657, 155326, 150267, 50887, 85901, 186948, 192304, 168579, 142371, 174868, 205834, 112809, -12546, -3277, 28435, 21312, 49394, 214039, 236197, 144166, 184046, 249955, 319107]
10457C19107K3987r681j41651j4051P3947j37804j8191L9436J6921o7512q6544
10446b036n166L1646J6256P0633P0382n3027L6257p749q1707L4551m4710p238
10434E8092L1530O9958P6607j417n5305j9642L9274n0382Q756n102P2803K1570
10422B46742L5832o2343o4283m8194k545K2129J644l8558N9813Q2766k3491k6483
10410A83029n6245k9439q9864j7703N5553k0876K279L9036P5391L791j26616j62696
10398a44360N5138J06802Q9882L7317O6477P0398n8262L6502j1680q9267m9691
10387A09256N7122J01222j09299m7923K4327m8002j11587p490J28209M4983n0580
10376I0238j15275m133O9813o303j6077L8587K3334O160K7594j7386Q556J2689
$$ y = [319107, 343094, 333413, 191762, 177711, 251658, 113854, 95663, 135099, 152020, 84508, -2036, -7202, 24444, 40700, 111333, 181715, 128688, 164945, 157196, 75489, 110040, 65330, 58092, 89622, 159580, 236187, 234770, 179465, 159823, 199097, 148715, 157471, 152369, 225172, 246742, 282574, 220231, 155948, 107754, 105209, 127338, 128982, 90424, 150237, 233003, 209512, 183029, 126784, 97345, 7481, -10222, 45331, 24455, 26734, 65770, 141161, 144952, 18336, -144360, -89222, 17580, 107462, 144779, 211256, 281654, 223392, 259894, 248214, 158947, 109256, 166378, 267600, 158301, 110378, 134705, 86703, -24884, -32374, 95835, 140818, 90238, -25037, -29170, 40643, 34340, 18263, 56850, 80184, 86344, 113938, 96552, 105108, 117797]
10364A17797m2129M7914P3390k9737k331O9049j5866m5274k0514n3003N834n5049
10352E0081j1615J3963K416M512L7199L1578l778J48108M6477k9781L2037O2321
10340C83518m5794M5328J07875J61043P8664P8729K7035J70526J66794M8546J8679
10329A240943r6760m5811o4550j23377j15698j53061q8160l8282m7915k3381q1746
10318C62202n1215J5058J6285m3503m8182n7378P9213L4718n4925n875m1760L2110
10306B36748j033k7701M0302M4282n033p3702m9004o6711o6191m5789J10262J26660
10294B23090L562j28155k2503J71812J13615J2771r1019O8022N3754J5635O652
10283D27236q5365o5664p4906j4739J6477J10026K6293n8498J5720R1610p6726
$$ y = [117797, 75668, 123582, 196972, 167235, 164904, 233953, 218087, 172813, 152299, 99296, 105130, 50081, 38466, 52429, 54845, 59357, 96556, 128134, 124356, 272464, 318941, 289160, 321197, 383518, 337724, 383052, 490927, 651970, 730634, 809363, 836398, 1006924, 1173718, 1222264, 1240943, 1144183, 1098372, 1033822, 910445, 794747, 641686, 553526, 515244, 467329, 443948, 362202, 310987, 326045, 342330, 298827, 250645, 193267, 272480, 307198, 252273, 246398, 204638, 236748, 235715, 208014, 248316, 292598, 287565, 213863, 164859, 98148, 31957, -13832, 96430, 223090, 226652, 98497, 75994, 247806, 361421, 374192, 283173, 351195, 404949, 420584, 427236, 341871, 276207, 201301, 186562, 203039, 313065, 339358, 280860, 296580, 388190, 311464]
10272C11464L5849O6861j1414P8980O0738O7898P9918K7281j04764l9389k0199
10261E53223j8963o8308J1949o2426r3225L7156o3214K0038O5422M7269L3534
10250D62455M951p3688k1250J4384P640n334n4481r6587N1783K7594J19699P8013
10238E15179L1287l7291R2109O9732M3022M2405P5239M5116Q5096N2697J25016
10227A139607k7697k1489K3255j2186l5882j53665p0361M560k10725j55033p6337
10216D04047L1870j3660m916J0141l6134l5004k8463K2845R0439j5561P3527K5760
10204E24891k7495m0909L7401j8917O6937k787r836K09R3822J01632J82006J09441
10192A016395M9403k9035j3995M3017J30539P4362N9058k4025n8000k6443l5990
$$ y = [311464, 347313, 414174, 402760, 481740, 542478, 610376, 690294, 717575, 612811, 573422, 553223, 534260, 465952, 477901, 415475, 322250, 359406, 296192, 316230, 381652, 428921, 462455, 467406, 393718, 372468, 386852, 394492, 389158, 334677, 238090, 289873, 317467, 437166, 515179, 546466, 509175, 601284, 671016, 714038, 756443, 831682, 876798, 961894, 1014591, 1139607, 1111910, 1090421, 1113676, 1101490, 1065608, 911943, 841582, 846142, 635417, 480384, 404047, 435917, 422257, 417341, 427482, 391348, 356344, 327881, 350726, 441165, 425604, 499131, 524891, 497396, 456487, 493888, 474971, 541908, 539121, 529285, 529494, 623316, 724948, 906954, 1016395, 1065798, 1036763, 1022768, 1065785, 1196324, 1270686, 1329744, 1305719, 1247719, 1221276, 1185286]
10181A185286M1316p140l0563p1467r8609n7111j5105k2154j29122j31064M1911
10170G06178k634o0435l4771j261o2719m5947k1302J07124M8985p5692M83J45778
10158G03787N5196M3129O6087N8626m728J29520P4531J23938K7190O5912m316
10147A338872P528m3039N686Q9965K7845n2325q5110j2259p2782r6179j32359
10136I75843r8894l1711N7334M6200q7744r8582n9062n0152J753o4703P10J17156
10124G08148O2281R6158M8436j3588k2724k0817l1978n6581P4556K7412q3643
10113G87660n7395Q984L4754J7639J80778P6918J16723J40558j0329j5606k2091
10102A258593k0698k8666n0336n2718j45226m9736j25121j35123q0761n7728o8629
$$ y = [1185286, 1226602, 1219462, 1188899, 1117432, 1018823, 961712, 946607, 924453, 795331, 664267, 706178, 703544, 643109, 608338, 607077, 544358, 498411, 477109, 584233, 633218, 557526, 558009, 703787, 758983, 802112, 868199, 926825, 922097, 1051617, 1126148, 1250086, 1277276, 1343188, 1338872, 1346400, 1303361, 1309047, 1399012, 1426857, 1374532, 1289422, 1277163, 1204381, 1108202, 975843, 876949, 845238, 902572, 948772, 861028, 762446, 703384, 653232, 654985, 590282, 590992, 708148, 770429, 866587, 915023, 901435, 878711, 857894, 825916, 769335, 843891, 871303, 787660, 730265, 739249, 774003, 791642, 972420, 1049338, 1166061, 1306619, 1296290, 1280684, 1258593, 1237895, 1209229, 1158893, 1106175, 960949, 911213, 786092, 650969, 570208, 512480, 443851]
10091D43851J4710l0295M506K8717L4552J4765K8655N6839J2621l3534M0892J9208
10079F35487N37K7971j0270p9457k1660l1401n0930L6070J03039m7142O7082J02164
10067G31490J17014N4294o4734o2348Q382m3682P800m2026j26404K0515l0472
10056E69829n6912r9979J7872P1680q4775O3679l1116j37260K5905j0669r2507
10045B35747m7483N6513J19281N7389L6863p9273j42272Q172O1457J16755J3013
10034D36162n3175M5079J3015J2587M6214M0503O763o1090p6173j10476P2671
10023C72080n1670l1219j1559o7202Q3586M9117l3371N9893K8048j59905q7634
10012A50164q1392L4371Q6074N7774J23530j28599k7709J01473O2127k7578K2981
$$ y = [443851, 458561, 428266, 432772, 461489, 496041, 510806, 539461, 596300, 608921, 575387, 616279, 635487, 636024, 663995, 653725, 574268, 552608, 521207, 470277, 506347, 609386, 562244, 629326, 731490, 848504, 902798, 838064, 775716, 784098, 740416, 748216, 706190, 579786, 600301, 569829, 512917, 412938, 430810, 502490, 417715, 481394, 450278, 313018, 338923, 328254, 235747, 188264, 244777, 364058, 421447, 458310, 379037, 236765, 244937, 306394, 423149, 436162, 382987, 428066, 441081, 453668, 499882, 540385, 547148, 486058, 409885, 299409, 372080, 320410, 289191, 277632, 210430, 294016, 343133, 309762, 369655, 397703, 237798, 150164, 68772, 103143, 189217, 246991, 370521, 241922, 214213, 315686, 377813, 350235, 373216]
10001C73216o880o1428M480m3397K3512K9659j07039j10719J0185J35728Q3754
9990C31071l6537o981J0479j6209l538J6487K2875Q4483j997o0011m6690j05979
9978A87453K8206Q6660N0448k3842P4791O5689n7538j36686M4193R817n1191K9361
9966C07361J22004M8931m9561q6986n9167L1416Q8513l9705l8265R1441M0899
9955D56881k8082n8679o3302r5985L5796K8069M0859L255J2544j70192J5754R5019
9943B71937P5853L3331j16392j04322J04N8155J08963J27289K0063M1909J6157
9932E33047N5269n5528r0034L944j0070N8771R6307J19318n0635k0125Q1142m8784
9920F72622j02891p0240p913m6164j07308m8394K3302J12109j7760l5296J01562
$$ y = [373216, 366336, 304908, 309388, 265991, 289503, 319162, 212123, 101404, 111589, 247317, 331071, 294534, 287553, 298032, 281823, 278285, 294772, 317647, 402130, 400133, 340122, 293432, 187453, 215659, 302319, 352767, 328925, 403716, 469405, 411867, 275181, 319374, 329191, 278000, 307361, 429365, 478296, 428735, 341749, 282582, 313998, 402511, 362806, 324541, 415982, 456881, 428799, 370120, 306818, 210833, 246629, 274698, 315557, 318812, 331356, 161164, 176918, 271937, 347790, 381121, 264729, 160407, 160511, 218666, 327629, 454918, 474981, 516890, 533047, 588316, 532788, 442754, 446698, 436628, 495399, 591706, 711024, 660389, 640264, 721406, 672622, 569731, 499491, 491578, 445414, 338106, 289712, 313014, 425123, 407363, 372067, 473629]
9909D73629J20426N0282k4989n8600l9569L955m2349p3113M8163Q6817l2089o0699
9897D51864p795j0603K6393K5825O4411k5702l6105O5963J41824N5821J9919O9237
9885H41052j3052O4198Q0963J7309l431p7413j68857o4562K3138n510o943l9896
9873F46996J09119P4377j06972l4191J03802M3124l7272o3298o811M0596J36161
9862I05631O188r1069K473P0946m3071j3632O5633k3876L92O3901Q179j3393n5731
9849H82571J1293M8527Q8883Q1716J0929o3331l7599r0722j09742j2911M8786
9838H58400Q9766O6112M9724o5193j05318k902Q7780J44311J7869L5097r500k0830
9826A145316L880L0258N2208m697N2632P450p9910j2164R5905N1056R2672P0107
$$ y = [473629, 594055, 644337, 619348, 560748, 521179, 525134, 482785, 409672, 457835, 544652, 512563, 451864, 444069, 433466, 459859, 485684, 550095, 524393, 488288, 554251, 696075, 751896, 771815, 841052, 828000, 892198, 973161, 990470, 987039, 909626, 740769, 676207, 699345, 693835, 686892, 646996, 756115, 830492, 723520, 689329, 793131, 836255, 798983, 735685, 728874, 769470, 905631, 911819, 820750, 823223, 894169, 851098, 837466, 903099, 879223, 879615, 943516, 951695, 938302, 882571, 893864, 942391, 1031274, 1112990, 1123919, 1060588, 1022989, 932267, 822525, 809614, 858400, 948166, 1014278, 1064002, 998809, 893491, 890589, 978369, 1122680, 1140549, 1175646, 1166146, 1145316, 1149196, 1179454, 1231662, 1226965, 1279597, 1287047, 1207137, 1194973, 1290878, 1341934, 1434606, 1504713]
9814A504713k1949p0721J01085R1927j7102L1534J46592O9281O5027O7074J27810
9803B095271N3935Q0327J71865J71646K56385L48134L96682M12356N12521N48621
9793E047743O03294O69485P59622R13657J291330J650580K249674L306843M686706
9784B1178934O511377Q848514J0717814J0169538N949523n19525o289549r138190
9776D7428436r082935p584362n595166l965340k661740j832015j094976o29067
9768A4982835m16878j57257K64430O61446J229293J851219K619789L238082L358865
9759B7631824K914917K601790L216530M473667O192841P266819O900073N698201
9751F6896662M168185K637107J490004J720668M032356P571707J0606591J1487773
$$ y = [1504713, 1482764, 1412043, 1513128, 1605055, 1587953, 1619487, 1766079, 1835360, 1900387, 1967461, 2095271, 2149206, 2229533, 2401398, 2573044, 2829429, 3177563, 3574245, 3986601, 4499122, 5047743, 5651037, 6320522, 7080144, 7993801, 9285131, 10935711, 13185385, 16492228, 21178934, 27690311, 36538825, 47256639, 57426177, 63375700, 62856175, 56566626, 47428436, 38345501, 30761139, 25165973, 21200633, 18538893, 16706878, 15611902, 14982835, 14565957, 14408700, 14673130, 15334576, 16563869, 18415088, 21034877, 24272959, 27631824, 30546741, 33148531, 36365061, 40838728, 47031569, 54298388, 61198461, 66896662, 71064847, 73701954, 75191958, 76912626, 80944982, 88516689, 99123280, 110611053]
9743A10611053R678141M962917k063318q133157j0509219r144345n518273j922943
9735H7960856j83608p11274k466040m376335n723862n992197n507098m278114
9727E8722328k260441m6738R44421J061877J499098K530087L604554M419071M172191
9718G4646448K048329r39643k360424k075533M9866L716984Q692446J4272718
9710I8051191J9697463K2427073K0359027J4964174R628837N208095o37883r083403
9702A80614574j7542709k2050752k1592612j7632426j1996480o278000j965519
9695H1556076m15291j490720k849017l168994l093327k820904k497992k638347
9687F2581484l423287l433342k153623k37156J605572L243704M724458N416710
$$ y = [110611053, 120289194, 125252111, 123188793, 115055636, 104546417, 95402072, 89883799, 87960856, 87777248, 87065974, 84599934, 80223599, 74499737, 68507540, 63000442, 58722328, 56461887, 56415149, 57359570, 58421447, 59920545, 62450632, 66055186, 70474257, 74646448, 76694777, 75755134, 73394710, 71319177, 71369043, 75086027, 83778473, 98051191, 117748654, 140175727, 160534754, 175498928, 185127765, 190335860, 189697977, 180614574, 163071865, 141021113, 119428501, 101796075, 89799595, 83521595, 81556076, 81140785, 79650065, 76801048, 73632054, 70538727, 67717823, 65219831, 62581484, 59158197, 55724855, 53571232, 53334076, 54939648, 58183352, 62907810, 68324520]
9679F8324520N187543L923244J019310j746002k482836q00408K334786O469477
9671H2229634R608897J0129014P546323K814614j933928n357451o987571o659886
9663I1389646n098798l989758l849109m213578n189844o613926p517912p280324
9655D7636397n891335m361756l291941l151859l335255l397299l160774k663935
9647A8382243j992162j370514r18839m63677l20355k6953K21495O07429R81888
9638A5100555J729076K716356L838791N700691P531350Q660556P511356L138941
9630E5927672k654131p043580q701297q250336o570996m832553l476985k393376
9622A2004418j785443j403686j014614p08810p26646p28081o06744n63104m88786
$$ y = [68324520, 73512063, 77435307, 78454617, 76708615, 74225779, 73425371, 75760157, 82229634, 91838531, 101967545, 109513868, 112328482, 110394554, 105037103, 98049532, 91389646, 86290848, 82301090, 78451981, 74238403, 69048559, 62434633, 54916721, 47636397, 41745062, 37383306, 34091365, 30939506, 27604251, 24206952, 21046178, 18382243, 16390081, 15019567, 14100728, 13637051, 13316696, 13289743, 13511238, 14118667, 15100555, 16829631, 19545987, 23384778, 29085469, 36616819, 45277375, 52788731, 55927672, 53273541, 46229961, 37528664, 29278328, 22707332, 17874779, 14397794, 12004418, 10218975, 8815289, 7800675, 7091865, 6365219, 5637138, 5030394, 4467290, 3978504]
9613C978504m05348l72037l30628k01989j30688m7606j52052j71412r4025j69592
9603A903127r7900o5125K0613o211M7295j14713j14283j43533N5190N4361L9981
9592A578802J5550q7650r6984o1221K077N303j35037j5345r585q6878q4379n4406
9580I70247K0235q2777L6454L0923j452Q3910l3504R381n5892j8050K4953n9501
9568I24927n334K6416J39168J09288j05808j24664J1083p0750n1681J173Q01L9267
9556H93886J9121j1554j2110j92901j7869O9575j10J01098J5276K704J5391o6889
9544H15618o893J0145r8677k2810J1722O0935L8102j2542Q6359l9126K5687N251
9532H73771p5574k468L4806L7895M4209J03698Q544n2244K6448j31527n9328Q412
$$ y = [3978504, 3573156, 3201119, 2870491, 2668502, 2537814, 2490208, 2338156, 2166744, 2072719, 1903127, 1805227, 1740102, 1760715, 1754504, 1801799, 1687086, 1572803, 1429270, 1484460, 1538821, 1578802, 1594352, 1506702, 1409718, 1348497, 1350574, 1355877, 1220840, 1205495, 1195910, 1109032, 1024653, 970247, 990482, 907705, 944159, 975082, 973630, 1057540, 1024036, 1033417, 977525, 959475, 984428, 924927, 919593, 946009, 1085177, 1194465, 1088657, 963993, 975076, 904326, 852645, 853818, 854619, 893886, 913007, 901453, 889343, 696442, 678573, 748148, 748038, 849136, 864412, 867116, 882507, 815618, 808725, 818870, 720193, 697383, 709105, 770040, 808142, 795600, 881959, 842833, 868520, 873771, 798197, 795729, 830535, 868430, 912639, 1016337, 1024881, 972637, 999085, 867558, 808230, 816642]
9520H16642k506J926N3769K5953N7672N66q6711J6237L7136p1085j950J27536
9508I75185j4583j34039r5155o9537P1l3149O2998J2700q0339M5175l1864M2273
9496F79736M6241N0343M0877P2013Q4181j4600l8558q6452o1397R2671J29877
9485I94932L5634n6611Q3008Q0026k9737l0324L3984r0061r8237n2378q824m7453
9473H13959J4230R9876J08958K894k7961r8714p1445n584K0801J6709k8524j14120
9461G31079k6177Q9769R5517j3958O342J1056j9880J9904O0720M6870N1485j20105
9449I32622n5239M4965O750o1366L259L7230K0616m1660J6607q081p927n8644
9437H29132L7775J02675M4804L9879j6851L7168l8388j9919L1450m0028l910n5560
$$ y = [816642, 814136, 816062, 869831, 895784, 953456, 954022, 867311, 883548, 920684, 849599, 847649, 975185, 960602, 826563, 731408, 661871, 661942, 628793, 691791, 704491, 624152, 669327, 637463, 679736, 725977, 776320, 817197, 889210, 973391, 958791, 920233, 833781, 772384, 865055, 994932, 1030566, 973955, 1056963, 1136989, 1107252, 1076928, 1110912, 1020851, 922614, 870236, 861412, 813959, 828189, 928065, 1037023, 1039917, 1011956, 913242, 841797, 836213, 857014, 873723, 845199, 731079, 704902, 794671, 890188, 876230, 882572, 893628, 873748, 893652, 954372, 1001242, 1052727, 932622, 877383, 922348, 929098, 867732, 870991, 908221, 928837, 887177, 903784, 895703, 887776, 829132, 866907, 969582, 1014386, 1054265, 1037414, 1074582, 1036194, 1016275, 1047725, 1007697, 1003787, 948227]
9425I48227M7440J052o585R8814Q1719p2702j60873m1491m7082J9599L6816n6331
9413H48603n6134K1301J13964P1270m0357P4641M9591R6778l6903L3105J4433
9402A190292k3397n6021j6683j2937K2442J2253K0774M2956k7193n288k3480P5717
9390A199435l8774R06K8445l9625o405J07772J3430K6642Q9965J28798O3677M9954
9378A624220M5543m2116L034M5762R860j0397j4585j32016k3353M9149O0632R6927
9366A712660J02316n9911p2657J5178P1352L7994Q5097O3780K2395n4816J2742
9355A936130J03088J4700m8381O2466J54902J54231J02455O4117m184o5581r4332
9344B379611k5301P7005J19979J17866J02357L1943L1386M2231n3491n433l946
$$ y = [948227, 995667, 996719, 990134, 1088948, 1170667, 1097965, 937092, 895601, 848519, 868118, 904934, 848603, 792469, 813770, 927734, 999004, 958647, 1033288, 1082879, 1179657, 1142754, 1175859, 1190292, 1166895, 1110874, 1094191, 1081254, 1103696, 1115949, 1136723, 1179679, 1152486, 1147198, 1123718, 1199435, 1160661, 1161567, 1190012, 1150387, 1143982, 1251754, 1265184, 1291826, 1381791, 1510589, 1574266, 1624220, 1669763, 1627647, 1630681, 1676443, 1686303, 1675906, 1661321, 1529305, 1505952, 1555101, 1615733, 1712660, 1814976, 1755065, 1682408, 1697586, 1768938, 1806932, 1892029, 1955809, 1978204, 1923388, 1936130, 2039218, 2053918, 2005537, 2068003, 2222905, 2377136, 2479591, 2543708, 2539524, 2473943, 2379611, 2354310, 2431315, 2551294, 2669160, 2771517, 2803460, 2834846, 2877077, 2823586, 2818153, 2814207]
9333B814207P2345L8906j3478o734J1588l5311N4703R0449M2416P6294k2150K3608
9321C146843M1689N6813R00m3616J53502Q2322J06981J38715J04346l4505j9632
9310C734358L3128K49295J60276Q1707P4778K06221K16708J53570J81520J72705
9300E264266J12981N4967j23959L038J9208J00562n1159R8934J17860K01570Q5228
9289E883496J26630J65075Q3316J09478J70330J93065J38568K60594J67092K62615
9279G560259K56481K02115K95756K85794K94770K60346L66466L19480L56889M59338
9269A0657694L62198M27123M69053N08592O23072M89685M13792N72195O35762
9260A5159166O14594P00849Q30882Q41206P89992Q77217R68305Q80250J058102
$$ y = [2814207, 2886552, 2925458, 2911980, 2905246, 2916834, 2881523, 2936226, 3026675, 3069091, 3145385, 3123235, 3146843, 3188532, 3245345, 3246245, 3202629, 3356131, 3438453, 3545434, 3684149, 3788495, 3753990, 3734358, 3767486, 4016781, 4177057, 4258764, 4333542, 4539763, 4756471, 4910041, 5091561, 5264266, 5377247, 5432214, 5308255, 5311293, 5330501, 5431063, 5379904, 5478838, 5596698, 5798268, 5883496, 6010126, 6175201, 6258517, 6367995, 6538325, 6731390, 6869958, 7130552, 7297644, 7560259, 7816740, 8018855, 8314611, 8600405, 8895175, 9155521, 9521987, 9841467, 10198356, 10657694, 11019892, 11447015, 11916068, 12424660, 13047732, 13537417, 13951209, 14523404, 15159166, 15773760, 16474609, 17305491, 18146697, 18936689, 19813906, 20782211, 21662461, 22720563]
9251B2720563J230742J350027J528171J611154J607398J862568K084684K222974
9243C6218281K380360K551627K829696L159791L369406L602139L950188M375976
9235F2437464M672214N136556N641737N904470O219456O560910O771092O780593
9227A10124492O644653O361156N811815N133168M121688K894152J498753J07079
9219A42696956j269538k703866l881040m801918n597138o144954o361465o549986
9211A05387051o561870o280340o078454n795307n527945n109791m773882m468811
9203F0790651m092472l815302l443235l102541k953722k834588k554167k277227
9195C5717397k144003k004106j838873j674221j492428j497958j327869j199643
$$ y = [22720563, 23951305, 25301332, 26829503, 28440657, 30048055, 31910623, 33995307, 36218281, 38598641, 41150268, 43979964, 47139755, 50509161, 54111300, 58061488, 62437464, 67109678, 72246234, 77887971, 83792441, 90011897, 96572807, 103343899, 110124492, 116769145, 123130301, 128942116, 134075284, 138196972, 141091124, 142589877, 142696956, 141427418, 138723552, 134842512, 130040594, 124443456, 118298502, 111937037, 105387051, 98825181, 92544841, 86466387, 80671080, 75143135, 70033344, 65259462, 60790651, 56698179, 52882877, 49439642, 46337101, 43383379, 40548791, 37994624, 35717397, 33573394, 31569288, 29730415, 28056194, 26563766, 25065808, 23737939, 22538296]
9187B2538296j108690r38662r40929r36252q18225o72303p65706o79065o37920
9178A5040544p04287p06951n49009m13117n14799m19943l58796l50961m69467
9169A0553214l41467l43158m91971l60318j96607k14832k85773k85547l19995
9160G713546k13614j95785j31830k00949k60499k24752k20094j23903j95392j53820
9150E792908j69765j55015j33361j56933j54683j13739j05932l3361j31700j68396
9140D470023J1266m8712j18901j66620j42445J843l7020j13491j85267j28495
9130C542181l7021O680p6665j05183k5228j581j04689o5950r1614j06590j7043
9119B917297L5867k6137k2016L2283l6238r5710l8805m7581j00084j16450J2392
$$ y = [22538296, 21429606, 20490944, 19550015, 18613763, 17795538, 17123235, 16357529, 15678464, 15040544, 14336257, 13629306, 13080297, 12667180, 12152381, 11732438, 11373642, 11022681, 10553214, 10211747, 9868589, 9376618, 9016300, 8819693, 8604861, 8319088, 8033541, 7713546, 7499932, 7304147, 7172317, 6971368, 6710869, 6486117, 6266023, 6142120, 5946728, 5792908, 5623143, 5468128, 5334767, 5177834, 5023151, 4909412, 4803480, 4770119, 4638419, 4470023, 4481289, 4432577, 4313676, 4147056, 4004611, 4006454, 3969434, 3855943, 3670676, 3542181, 3505160, 3511840, 3435175, 3329992, 3304764, 3303183, 3198494, 3132544, 3040930, 2934340, 2917297, 2953164, 2927027, 2905011, 2937294, 2901056, 2805346, 2766541, 2718960, 2618876, 2502426, 2514818]
9108B514818p934k8865j8382R110j6178k8605j45230n4960K6535j08757l5560
9097B105992M9416n6400n2257R024q7373k3571j16637n6576J36134M4469q4435
9086A867786p0150r2699l9722m6090r6288j04574J19094M8751k207j510J11339
9075A693730R25o9008j08398p0684M7228j5987L0335p8284p9571J7285k2879R2459
9063A437151L5819j16653j0475j04351M8339j5970M708q2389r9678P0220O771
9052A173492j42306O4887K9172P895k8961N0842j07913j6594L4964N3388J06441
9041A225307N5433o2928j7010K9410n6896j19879o4059J8011l1196n7943P656
9030I25906Q6118l9552j12220J9990P6863K8765p141m5667l8705o5667m5787R7091
$$ y = [2514818, 2506884, 2478019, 2459637, 2468747, 2452569, 2423964, 2278734, 2223774, 2250309, 2141552, 2105992, 2155408, 2099008, 2046751, 2055775, 1968402, 1944831, 1828194, 1771618, 1907752, 1952221, 1867786, 1797636, 1704937, 1665215, 1619125, 1522837, 1418263, 1537357, 1586108, 1583901, 1582391, 1693730, 1694655, 1625647, 1517249, 1446565, 1493793, 1477806, 1508141, 1429857, 1350286, 1367571, 1344692, 1437151, 1472970, 1356317, 1345842, 1241491, 1289830, 1273860, 1278568, 1196179, 1096501, 1166721, 1173492, 1031186, 1096073, 1125245, 1133140, 1104179, 1155021, 1047108, 1030514, 1065478, 1118866, 1225307, 1280740, 1217812, 1200802, 1230212, 1173316, 1053437, 989378, 1007389, 976193, 918250, 925906, 1012024, 972472, 860252, 880242, 957105, 985870, 978729, 933062, 894357, 828690, 782903, 879994]
9018H79994M4639O266j4361n0929l0481p1455j5456K6159N1479O6237j2085K9248
9006I09255n3172n5544j1205p753k5094k452l8632K6477M2778m9083j520k2085
8994G11970k2380Q5203R354p2073J93m0435J10924L8728o3515J9544J08523j2292
8982H73744j7171p4478r1976j05097n1512P7710M1088n3048p5527K4039J16707
8971F64479J02622o554q0637k2068l1914j6562m0923l9500O2880m679J7660K7818
8959F32622L1675M18K7576r9220k6141R172N5638o7500j12917r748J7267j10651
8947C48191n5184J29945J69054N3739q6496n4213m8269r267n7619m599o8251J0114
8935C27145N5445N4820p1926N9363M9645q2471l1772N3185J1526K8826N0350J33641
$$ y = [879994, 924633, 930899, 916538, 865609, 835128, 763673, 748217, 774376, 825855, 892092, 880007, 909255, 856083, 800539, 789334, 781581, 756487, 754035, 715403, 741880, 784658, 735575, 734055, 711970, 689590, 774793, 784147, 712074, 712267, 671832, 782756, 821484, 757969, 777513, 886036, 873744, 856573, 782095, 690119, 585022, 533510, 611220, 652308, 599260, 523733, 547772, 664479, 767101, 760547, 679910, 657842, 625928, 609366, 568443, 528943, 591823, 587144, 604804, 632622, 664297, 664715, 692291, 593071, 566930, 576102, 631740, 564240, 451323, 441575, 458842, 348191, 293007, 422952, 592006, 645745, 559249, 505036, 456767, 447500, 389881, 385282, 317031, 327145, 382590, 437410, 365484, 424847, 474492, 392021, 360249, 413434, 424960, 453786, 504136, 637777]
8923F37777P7230j2971l3111n0142n2780j28966o8612o7703J25246J35229O2263
8912F23460L9901m9663M5060n5840J5502Q0765o461o2722P277K9171r2537n6606
8900E17307J2264J47807N9591l183O5174q7018n3768K4127J2441q036O1552M9338
8888G97596K4293L1521M8111J02604J69658K02379L7815L1173N4423J57227R8281
8877A755081J31224J77689J56529K46794J98732K37399L15938M31013M31543O21867
8867D703809R87957J378058K159761L252915N025214P775263J2135236J7881942
8859E5300155J8237385N277211r438726j4729796j5004819j2303860q017747m813885
8851A4505918l169457k187696j443558j212670r54046p55902o56249m45723l37054
$$ y = [637777, 715007, 702036, 668925, 618783, 566003, 437037, 368425, 300722, 425968, 561197, 623460, 663361, 613698, 658758, 602918, 618420, 699185, 692724, 630002, 637279, 666450, 573913, 517307, 529571, 677378, 736969, 733786, 798960, 711942, 658174, 682301, 694742, 686706, 748258, 797596, 821889, 853410, 901521, 1004125, 1173783, 1376162, 1413977, 1445150, 1499573, 1656800, 1755081, 1886305, 2063994, 2220523, 2467317, 2666049, 2903448, 3219386, 3650399, 4081942, 4703809, 5691766, 7069824, 9229585, 12482500, 17507714, 25282977, 37418213, 55300155, 73537540, 78814751, 69376025, 54646229, 39641410, 27337550, 19319803, 14505918, 11336461, 9148765, 7705207, 6492537, 5538491, 4782589, 4126340, 3680617, 3343563]
8842C343563l46435l21276k33675j72985j83624k00737k07556j34321j41979o8610
8832A332365l7010p4563j29377j69952p9865m9816J5273k8677q4804M7271R2188
8821H33033n6362J9095k5919J051r4952q2302p1401j09861m3468o3982M9140P7338
8809D31410M4495R049m6926o8887p4345N7732J14727J03690o7566p1790K1753
8798D53342j5477l5465P1825M7189j1846p1658m4152m809O1917L1243J4254l5848
8786D60515l5455j78j1164p6095q2259O0270N8678k6531j7514K4875p6920J21869
8774D00091P0152o1025r2367n111q455m7261J0986J530P7145J9835j1162r5179
8762B59179l0284k1824R0833l3455k8077J8904j3342l1481K5963O8772J8475p8314
$$ y = [3343563, 2997128, 2675852, 2442177, 2269192, 2085568, 1884831, 1677275, 1542954, 1400975, 1332365, 1295355, 1220792, 1091415, 921463, 841598, 791782, 807055, 778378, 693574, 740845, 833033, 776671, 795766, 769847, 770898, 675946, 593644, 522243, 412382, 368914, 304932, 354072, 431410, 475905, 484954, 438028, 369141, 294796, 352528, 467255, 570945, 503379, 431589, 453342, 437865, 402400, 474225, 521414, 509568, 437910, 393758, 388949, 450866, 482109, 496363, 460515, 425060, 424882, 413718, 337623, 255364, 315634, 374312, 347781, 330267, 355142, 278222, 400091, 470243, 409218, 316851, 311740, 303285, 256024, 267010, 268540, 345685, 365520, 354358, 259179, 228895, 207071, 297904, 264449, 236372, 255276, 241934, 210453, 236416, 305188, 323663, 245349]
8750B45349m3169n6098R06m9010O5325P7421N0374M3236L5177P787o4088l1323
8738B81887p3891m584J8051M764j29251j00794Q6992p103l8344q469M7235R1791
8726A68284N9603K0614Q307p3832k5233J9778N1733j10564J8967J00589m7188
8715A91058l5176k6649j7426n2325k1121M5309N3159K0617P3358j3877M4148Q0344
8703C41419n8034r0266j30492K9825P1671k4092L0122l8010q7686m381M1215p5000
8691F291J4388O8861P1439M888r0613l0906O8063O016Q670L5726J6890j11356
8679F8357J9279Q3661M4318j451q5839l4532n8789N4832L1503l2666K52L155J11644
8666B03724P2186K5486m8021k2393p4607o8253K0543K6429O5548Q180J8052q22
$$ y = [245349, 202180, 146082, 146988, 97978, 163303, 240724, 291098, 334334, 369511, 377298, 313210, 281887, 207996, 203412, 221463, 226227, 96976, -3818, 83174, 76071, 37727, 29258, 76493, 168284, 227887, 248501, 256808, 182976, 157743, 177521, 229254, 118690, 137657, 238246, 191058, 155882, 129233, 111807, 59482, 38361, 83670, 136829, 157446, 230804, 216927, 261075, 341419, 283385, 193119, 62627, 92452, 164123, 140031, 170153, 132143, 44457, 40076, 81291, 6291, 20679, 89540, 160979, 165867, 75254, 44348, 112411, 118427, 127097, 162823, 179713, 68357, 87636, 171297, 215615, 214164, 128325, 93793, 35004, 89836, 121339, 88673, 88925, 92080, 203724, 275910, 301396, 253375, 230982, 156375, 88122, 108665, 135094, 200642, 208822, 226874, 226052]
8654B26052O6356p845r8693n7575l014k000J16950n1012o7142k212M0589M7407
8642B07861n3865m6219N6778J13112P1980p3571j33439j6982K0310n3330o0324
8631C2311R1885R5457o0085j00514j35275o9325M0763J42697J10665n9903O4657
8620A53333j4962M3671o6491M6082N8558j00277N9129K8251Q080K8126J6375M0648
8608C00523n2181m0525k2856l8312J3194l5942L6411K6506k9436J3470l1170K6769
8596A66451M4065r6369r586J08615m7532l067j8532N2015K9376k1505k4318N2757
8584B32370M8386R5276j0597q5008m6486n255l3014l9144n372J9836k6331O0319
8572B04980k6563M1479P033n247l1441N3061q1335o9311j8527L2553M1384J8070
$$ y = [226052, 292408, 284563, 185870, 128295, 125281, 123281, 240231, 189219, 122077, 119865, 160454, 207861, 153996, 107777, 164555, 277667, 349647, 276076, 142637, 125655, 145965, 92635, 32311, 124196, 219653, 159568, 59054, -76221, -145546, -104783, 37914, 148579, 88676, 153333, 138371, 182042, 115551, 161633, 220191, 119914, 179043, 207294, 215374, 243500, 259875, 300523, 248342, 207817, 184961, 146649, 159843, 123901, 160312, 186818, 157382, 170852, 139682, 166451, 210516, 114147, 104561, 213176, 165644, 162577, 144045, 196060, 225436, 203931, 179613, 232370, 280756, 376032, 365435, 280427, 233941, 228686, 195672, 156528, 151156, 170992, 144661, 204980, 178417, 219896, 226929, 221682, 190241, 243302, 161967, 92656, 74129, 106682, 148066, 166136]
8560A66136j6870k9917R8673O4756o5067p3186K3260q9817n3593L1271N39l9172
8548A7013j6129J4728K2801n8675k4837L1310O9773M389K1300M6055j2623K2873
8536A37978O9676j6107K1582O880j07037n8521k2134L7503J7391q611k469m0541
8524C5590J3659Q082M2666Q2537n2072m7515K5887M4416p3435L8434n040L9458
8512A52667o688k8641N2106J14234M0579j7041k8265p4500j3295j7557j7453R648
8500A65794J02453R6460n4364r8750l8075n7396m2586m185L1545N9985J28013
8489B88894P8906K2419j01734o7662L8747j7066K6494r4001p0952k9306L9681
8478A14420M8442m0931j8130m2775M6514m8232l5571J0407J05870J19184n3184
$$ y = [166136, 149266, 119349, 218022, 282778, 217711, 144525, 167785, 77968, 24375, 55646, 56185, 17013, 884, 15612, 38413, -20262, -45099, -13789, 55984, 60373, 81673, 127728, 115105, 137978, 207654, 191547, 213129, 220009, 112972, 54451, 32317, 69820, 87211, 78600, 76131, 35590, 49249, 57331, 99997, 182534, 130462, 82947, 108834, 153250, 79815, 118249, 113209, 152667, 145979, 117338, 169444, 283678, 324257, 307216, 278951, 204451, 191156, 173599, 156146, 165794, 268247, 364707, 310343, 211593, 173518, 116122, 73536, 69351, 100896, 160881, 288894, 367800, 390219, 288485, 220823, 259570, 242504, 268998, 174997, 104045, 74739, 114420, 162862, 121931, 103801, 61026, 107540, 59308, 23737, 34144, 140014, 259198, 206014]
8467B06014l0092p314N3716P5657m9282j00841j2543n931q0317r512O9607O9046
8455A78208O8422m2245m3575K4972M9068l1896j11881q6753P1417Q8615L4770
8444A99122l8642L7074M0198m3734n0800N6042J9942m7497q1205K7517J48586
8433B66603r2p4060l9900K1497j23975j030R6638N2877J4555Q776O642o2410q5629
8420H0492m2321O4549n549n2603J1386J10407k336q135p4384r0004m9266m828
8408f2592m2638k0625J85140J09261l7908m2604p5201M4240L1798n9928j10729
8397h1786j5602P1456J62647j5100l9212K8846M6286l9381J29036M3640m1513
8386B49317j93648j00225R1239K3828L9043k7931m2575o1277l6706J37580j2172
$$ y = [206014, 175922, 168608, 222324, 297981, 248699, 147858, 135315, 129384, 49067, 39555, 109162, 178208, 246630, 204385, 160810, 185782, 234850, 202954, 91073, 4320, 75737, 164352, 199122, 160480, 197554, 237752, 194018, 143218, 199260, 219202, 171705, 90500, 118017, 266603, 266511, 192451, 152551, 174048, 50073, 49043, 145681, 198558, 213113, 221889, 228531, 166121, 80492, 38171, 102720, 97171, 44568, 55954, 166361, 164025, 155890, 81506, -8498, -57764, -62592, -105230, -125855, 59285, 168546, 130638, 88034, 12833, 57073, 88871, 28943, -81786, -97388, -25932, 136715, 121615, 82403, 111249, 157535, 118154, 247190, 290830, 249317, 55669, -44556, 46683, 70511, 109554, 81623, 39048, -22229, -58935, 78645, 66473]
8375F6473N6625O2033J5464J9161o4461j2877q9104j39143p8329n259m9382R2719
8363a26080L3410O4001L5128L0256o206m1530M6208O3386n503K8032L9599k875
8351A57826L01q0869n3304K3383K1192J4612j9185P5907M5779j3687J1650K2376
8339B05981J1238j35421o3222P7749J4048M0067K1420m7960j6178K611n7057j52208
8327i8932K1557M9868Q4735o507M3523j41999n0280J8183J39926K1469j6392j0548
8315E4603m8272k189m9121j4925Q7638K0990J1008L3742j7032o5884P38J6237
8303B7533M70l426L2483L6539J1340R3055j1511N3145n6585m1248l0114J0908
8291A22589j7549j38276j09753L2205Q2129N7764l2929M3003P5322Q0288n5901
$$ y = [66473, 123098, 185131, 200595, 219756, 155295, 142418, 53314, -85829, -164158, -169417, -218799, -126080, -92670, -28669, 6459, 36715, 30509, -11021, 35187, 98573, 93070, 121102, 160701, 157826, 158127, 77258, 23954, 47337, 68529, 83141, 63956, 139863, 185642, 171955, 183605, 205981, 217219, 81798, 18576, 96325, 110373, 150440, 171860, 123900, 107722, 110333, 53276, -98932, -77375, -27507, 57228, 50721, 94244, -47755, -98035, -79852, 60074, 81543, 65151, 54603, 6331, 4142, -44979, -59904, 27734, 48724, 59732, 93474, 76442, 10558, 11296, 27533, 28003, 24577, 57060, 93599, 104939, 197994, 186483, 239628, 183043, 141795, 111681, 122589, 105040, -33236, -142989, -110784, -28655, 29109, -3820, 39183, 114505, 194793, 138892]
8280A38892o3382j8970j7977p8015n0921J8478O3644L5376O577n8851K2260P5895
8268G3006o0633n1947r673O0855O6785L9388j1613j8814l4910K7359N924p233
8256G8494k5399p9270N6173J3003q4730N2229J28769o4448L445m0697o9974k0136
8244e2541K849O7617J19665R2968p9469l0891L559q6976j10336n6098J1421O7866
8232e0366M424l2520N9447J13473P6638N8805r6654l6612j3297j05529K8240J6082
8220B2131J51128L266p1190P2453j08489o5795L0038j3172l7510m0019N8833R596
8208A1270O5032K387n5689r6089k9752j5691j0010m3097P1899O3156N4837O9009
8196H7262N3851k9667m5503r7247J22746l2544q593R5330M9355P6616p2910k02159
$$ y = [138892, 75510, 56540, 38563, -39452, -90373, -71895, -8251, 27125, 33702, -25149, -2889, 73006, 12373, -39574, -49247, 11608, 78393, 117781, 106168, 87354, 52444, 79803, 85727, 78494, 53095, -26175, 29998, 43001, -41729, 10500, 139269, 74821, 78266, 37569, -32405, -52541, -49692, 17925, 137590, 230558, 151089, 120198, 123757, 36781, -73555, -129653, -118232, -50366, -45942, -78462, -19015, 94458, 171096, 229901, 133247, 96635, 83338, -22191, 6049, 22131, 173259, 176525, 105335, 177788, 69299, 3504, 33542, 20370, -17140, -57159, 1674, 11270, 76302, 78689, 23000, -73089, -102841, -118532, -128542, -171639, -99740, -36584, 18253, 87262, 141113, 111446, 65943, -31304, 91442, 58898, 50305, 145635, 194990, 271606, 198696, -3463]
8184c463j01944J4266O4416j730L9460n0742k136N2492M090L9612p0847K917L3896
8171B0287M056k9556L0129M754L290P139m6690p3300J2421m00o5243P8798M2353
8158a1962J9066N3904n3187m1098J1782j5776j5486p2757k4223L9008l3088l5228
8146a79045N8758O6058L9971L2356k7955j27481l1894K7943K2327M5390P6472
8135B900M7273p720o3776r5310m0160Q0598R1285M6319r9719l9276O4680J08450
8123I5544M6233m9048L1164M7185j5504m7607j1877J4886J1600l7939o0941K2458
8111D6154k5374J930m946K1903k1712K4699K0726p971q176o7951L9241N799l5638
8098a1316j4204N2241N4457N462k3243Q8348j655r4686O1663P4185m0319q2401
$$ y = [-3463, -105407, -91141, -26725, -28455, 11005, -39737, -41873, 10619, 14709, 54321, -16526, -13609, 20287, 24343, -5213, 24916, 29670, 32960, 40099, -6591, -79891, -67470, -67870, -133113, -54315, -11962, 7104, 61008, 7821, -33277, -21495, -37271, -52757, -125514, -149737, -110729, -143817, -179045, -120287, -54229, -14258, 18098, -9857, -137338, -169232, -141289, -118962, -73572, 2900, 50173, 42453, -21323, -116633, -156793, -76195, 15090, 61409, -38310, -77586, -12906, 95544, 141777, 92729, 123893, 171078, 155574, 107967, 96090, 110976, 122576, 84637, 23696, 46154, 20780, 22710, 17764, 39667, 17955, 42654, 63380, 55409, 47233, -20718, 18523, 24322, -11316, -25520, 26721, 81178, 86640, 63397, 151745, 150090, 55404, 117067, 191252, 150933, 68532]
8086F8532K473r6118K0239O3444K0893P4159O0843L3073l0384j1391K9314l6196
8074A98881R249K5986l9209m2433K6081m184r6474p5081m2024K0070J02357L9042
8062A22261n0427M4823J0203j20356q1504K4039J2404q6193m9635K8573R3178
8051e2634N5838O2246Q444m7118r6808L0160L2108J1410M9258K6999q2322k6002
8039b8421q0756O973J71208N8571K0078o2370j13702r6882p0798P5917M3477L2321
8027d4384j0673L2926J3345L4835k7220j20610J8887P0567p556L6179Q8115o8619
8015A5792o2736j4840M2415J8934M1387L3631N1057o8746k4738K8446Q3219n3393
8003I0428n8490q7916q3209O3164l1557k4506R6648O505n7486l0737m9281N2284
$$ y = [68532, 71005, -25113, -4874, 58570, 79463, 153622, 214465, 247538, 217154, 205763, 235077, 198881, 208130, 234116, 194907, 152474, 178555, 174371, 77897, 2816, -39208, -19138, 83219, 122261, 71834, 116657, 126860, 6504, -75000, -50961, -38557, -124750, -174385, -145812, -52634, 3204, 65450, 73894, 26776, -70032, -39872, -7764, 3646, 52904, 79903, -2419, -28421, -109177, -102204, 69004, 127575, 147653, 85283, -28419, -125301, -196099, -120182, -76705, -44384, -55057, -22131, -8786, 26049, -1171, -121781, -102894, -32327, -39883, -3704, 84411, 15792, -46944, -61784, -19369, -435, 40952, 74583, 125640, 56894, 32156, 60602, 143821, 90428, 31938, -55978, -139187, -76023, -107580, -132086, -35438, -28933, -86419, -117156, -166437, -114153]
7991a14153j695N4706N1431K3801j3090K2111o6991O516K9982J1014M6158K162
7979E1952N710J22275m3442p6700J40780p844n422o590r737o2337o1377P2873
7967A20141k7226k2539J7603l5009J4162k8755j6309K4002Q5555p7901k3721O4193
7955I4196p1610K5220J15316R17r8405n6305k1737j8958M1960J07202R402m8421
7943G8777o5029p7241j2174P5210M013p9785l9155K3319Q4816K7821K9754r928
7931D0398o8755q460k7576o0954p227J0579Q3330j5867P9065k7402J7508M3009
7919E7648j3538M3626N369Q2K3559r2971k2457k4708o843L2113P7966Q0717O5296
7906B25859o0675r8624L1249o8618R52k1990n9954J6055m7076r4222m176P6687
$$ y = [-114153, -115848, -61142, -9711, 14090, 1000, 23111, -43880, -37364, -7382, 3632, 49790, 51952, 57662, 179937, 136495, 59795, 200575, 192731, 187309, 180719, 170982, 108645, 47268, 120141, 92915, 70376, 87979, 52970, 67132, 38377, 22068, 46070, 131625, 53724, 30003, 94196, 22586, 47806, 163122, 164039, 65634, 9329, -12408, -31366, 10594, 117796, 127198, 78777, 13748, -63493, -75667, -457, 3556, -76229, -115384, -92065, -7249, 20572, 50326, 40398, -28357, -36817, -64393, -125347, -132574, -121995, -38665, -54532, 24533, -2869, 14639, 57648, 44110, 87736, 93105, 93187, 116746, 23775, 1318, -23390, -30233, 1880, 79846, 160563, 225859, 165184, 66560, 97809, 29191, 30143, 8153, -51801, -35746, -82822, -177044, -181220, -104533]
7894a04533Q5084k5979J46521J03286M0764n5679o2264N032j53517N230l4210
7883e0265j2249R260J42943O5583L2128j62888o6430j6817J4950J121l7873K8647
7871e1890K0802o391r5866p8938j7303M7661R8298J27412L8689l6865j6365n434
7859B3810j9144q7439n6670J585K8548J14521L1954m3535k6021l7225p414Q967
7847f8063n1800j6623P1828p4961J3972J11766K5328M151k5823n7261j1679O0332
7835a8833P8904J02996j00681k05417Q7217J5339k9628N5062m0205N15N825L666
7823d5240J1754p40J2860P8115k5410p925m3387q3639l8887L0771J00697L4186
7811B3155k4027J05714N0899j18242j04307M5881L1113J3861l9958M691l9892
$$ y = [-104533, -19449, -45428, 101093, 204379, 245143, 189464, 127200, 132232, -21285, -16055, -50265, -62514, -53254, 89689, 155272, 187400, 24512, -41918, -58735, -43785, -42664, -80537, -51890, -31088, -37479, -133345, -212283, -229586, -181925, -83627, 43785, 82474, 45609, 29244, 23810, 4666, -82773, -139443, -137858, -109310, 5211, 37165, -6370, -32391, -69616, -77030, -68063, -119863, -136486, -64658, -139619, -125647, -13881, 11447, 15598, -10225, -67486, -79165, -18833, 60071, 163067, 62386, -143031, -55814, -40475, -70103, -15041, -55246, -54731, -48906, -45240, -33486, -34226, -21366, 56749, 31339, 23414, -19973, -103612, -142499, -111728, -11031, 23155, -872, 104842, 155741, 37499, -66808, -20927, 10186, 24047, -15911, -11220, -51112]
7800e1112j3712K8663Q965j0408l5365J0773L9325O7127l1367p7221j7358O8345
7788a3345k9483K247R0429N016J5460p9141m4024K8036L8148j282r1503k7977
7776a07419J15666J07608K2920j03867l2318m6122K0384n303l396M641l7336R250
7764e5292r467J3856M103J6606J22169l536Q010q0217p4363k2154J7491k875Q0472
7751A4803O7694N7782n4125m5713N9378m060m1494k2543p0160q2724m7494J3792
7739a54864M9442P5422O0571j9807o893J3175k782p9832M9097O1271L2356l936
7727G3220K7707J3942k7804j20256L1528L7187j12752J3805M2197n2197J1176
7716f2247K4670J6053j3105M8518J28085l2039j21471p3991j0112m6148q8393
$$ y = [-51112, -64824, -36161, -27196, -37604, -72969, -62196, -22871, 44256, 12889, -64332, -81690, -13345, -42828, -40581, 49848, 54864, 70324, -8817, -52841, -24805, 13343, 12061, -79442, -107419, 8247, 115855, 138775, 34908, 2590, -43532, -23148, -28451, -31847, -27206, -64542, -55292, -64759, -50903, -46800, -30194, 91975, 88439, 96449, 16232, -58131, -80285, -62794, -65669, 14803, 82497, 140279, 86154, 40441, 99819, 95759, 54265, 31722, -38438, -121162, -168656, -154864, -105422, -30000, 30571, 10764, 3871, 17046, 14264, -65568, -16471, 44800, 77156, 73220, 100927, 114869, 87065, -33191, -1663, 35524, -77228, -63423, -21226, -73423, -62247, -37577, -21524, -34629, 13889, 141974, 109935, -11536, -85527, -95639, -141787, -230180]
7705b30180J1133k0160M5115J17013J08986O6554j21553o0804K7587J4999R405
7694c1905K7414j5P7468Q1481r822j31419l4331K1956m106K3558P4189O0854n2667
7681A02655l1227j914q5294l3105L5574J2831j05231N129p6827l1966j4039J58897
7669f4517J62819q0595q5076n7245J9445Q5436l4429O5136q452j0459M9298k9842
7657A1519L194M750p6931m668O0685Q56l009j3511J0684O2179P8714p722Q372
7644A35112M9545j9429j98665o2558r0294K1699q2447J220J23660P1587j01518
7633a52088p1483L9290N6776J2399Q7028P2354k8181N707J3571O3468m2474j23481
7621f7114M46L0815K1144k6202K5767j7292k843J10960q116l2517l3576j08624
$$ y = [-230180, -219047, -239207, -194092, -77079, 31907, 98461, -23092, -83896, -56309, -41310, -31905, -4491, -4506, 72962, 154443, 144621, 13202, -21129, 827, -3279, 20279, 94468, 155322, 102655, 71428, 69514, -15780, -48885, -13311, -480, -105711, -100582, -177409, -209375, -223414, -64517, 98302, 17707, -67369, -124614, -105169, -19733, -54162, 10974, 2522, -7937, 41361, 11519, 14713, 19463, -57468, -62136, -1451, -595, -3604, -17115, -6431, 55748, 134462, 126740, 135112, 184657, 165228, -33437, -95995, -186289, -164590, -247037, -245817, -122157, -50570, -152088, -223571, -184281, -127505, -115106, -28078, 44276, 16095, 21802, 35373, 98841, 56367, -67114, -66668, -35853, -14709, -40911, -15144, -32436, -35279, 75681, 67565, 35048, 1472, -107152]
7609a07152J416O1038J37266M7744q2855m7400l9246O930P9871J0066J8468K7523
7597A13669L3151K2048q4215m1765n8171r6006l1081J68372O9136K9283P178J2965
7585A44564n0348o8403L0587K5301n952j1256K5594l9059j23785j60645j24026
7574c57428Q9763J54872M4054J5528j5442L5839L8131j539k4108J674K074O2108
7562D5526P7543k8526J0429j24085r9480O7200l7677L4024N9794q7257l0159N1191
7550f1477m0454P4983j1013N2841L1108j4307O3808R387j15568M450J11377J392
7538A06527j34283M5418M1995l5429m1221N4069N6760M2335N4679j7631n1054
7527A22165n3813o5811N2353j9605q0238l9634O6200M6754n9730k5585L0867l1236
$$ y = [-107152, -105736, -44698, 92568, 140312, 57457, 10057, -29189, -22259, 57612, 67678, 86146, 113669, 146820, 168868, 84653, 42888, -15283, -111289, -142370, 26002, 95138, 124421, 131599, 144564, 94216, 25813, 56400, 81701, 75749, 64493, 90087, 51028, -72757, -233402, -357428, -267665, -112793, -68739, -53211, -68653, -32814, 5317, 3778, -20330, -18656, -16582, 45526, 123069, 94543, 104972, -19113, -118593, -51393, -89070, -55046, 4748, -82509, -112668, -61477, -101931, -26948, -37961, 14880, 45988, 31681, 95489, 104876, -10692, -6242, 105135, 106527, -27756, 17662, 59657, 24228, -16993, 37076, 93836, 136171, 190850, 173219, 122165, 68352, 2541, 54894, 35289, -44949, -84583, -18383, 28371, -31359, -56944, -26077, -57313]
7515e7313Q8336O1865Q773K9382n3945k7529o0881o5902l332O7103N4029q282
7503C2304m6265R2561P6179l2427r9195l913K5657M170j8594J3954m377k5634
7491A4420j236Q961p5798K5790l290J04805J7597m0060j38914o9279N4415J1541
7479i1048j7963J0003P869O1043J30347m4886q1499l3966N7208l0818q7592N3313
7467f7989R8285k9269j15331k2231M6938J12313o679o5766q2834k8938J8316K8651
7455a14534l5950M7068M8308l0940m9458L8559L2Q599k499r047M4301l6964J1084
7442h1441P2447l3688l1743l6149J23918K6715o9009q9418l0187M6768M3314P3445
7430A4972o011r146j1013l4250M617P4325n162j3569l1328m9670p3L9970N2282
$$ y = [-57313, 31023, 92888, 101661, 131043, 77098, 49569, -11312, -77214, -80546, -13443, 40586, 32304, -13961, 78600, 154779, 122352, 23157, 19244, 44901, 49071, 30477, 44431, 40054, 14420, 13184, 22145, -53653, -27863, -31153, 73652, 91249, 51189, -87725, -157004, -102589, -91048, -109011, -99008, -91139, -30096, 100251, 55365, -26134, -60100, -2892, -33710, -121302, -67989, 30296, 1027, -114304, -136535, -89597, 22716, 16037, -49729, -132563, -161501, -143185, -114534, -150484, -103416, -55108, -86048, -135506, -96947, -96915, -88316, -90815, -99862, -55561, -92525, -81441, -8994, -42682, -74425, -110574, 13344, 40059, -28950, -118368, -148555, -101787, -58473, 14972, 8961, -185, -11198, -45448, -40831, 33494, 28332, 14763, -16565, -66235, -66308, -26338, 25944]
7417B5944k8921p6314r2798O301p6383J752O1189j4295M4655O0966L1984M7938
7405g982k5549r4171o3330M1742R990J4311K376k891k0745K0144M150L5065j8517
7392a05407j1044L5794L3982P1235J07284m1224l1447L5137q219k7321m0165j07572
7380h8967k9297M3066N8990k4270p492l4183L0421N3762n1806p3631J9166O7684
$$ y = [25944, -2977, -79291, -172089, -165788, -242171, -240419, -179230, -193525, -148870, -87904, -55920, -7982, -33531, -127702, -191032, -149290, -139300, -124989, -122613, -125504, -146249, -126105, -121955, -86890, -105407, -116451, -80657, -46675, 24560, 131844, 90620, 59173, 94310, 86091, 58770, 18605, -88967, -118264, -75198, -16208, -40478, -47970, -82153, -51732, 2030, -49776, -123407, -104241, -36557]
$$ [...]
##END NTUPLES=NMR SPECTRUM
##END=
