##TITLE=Analysis number 329759
Compound Code btb 10193
Project Code adrs
Chemist Name fudan
##JCAMPDX= 6.0         $$ Bruker NMR JCAMP-DX V2.0
##DATA TYPE= NMR SPECTRUM
##DATA CLASS= NTUPLES
##ORIGIN= Bruker BioSpin GmbH
##OWNER= nmr
$$ XWIN-NMR		Version 3.5
$$ Wed Sep 26 12:29:24 2007 GMT Daylight Time (UT+1h)  MAYBRIDGE\nmr@NMR_250MHZ
##.OBSERVE FREQUENCY= 250.131544655141
##.OBSERVE NUCLEUS= ^1H
##.ACQUISITION MODE= SIMULTANEOUS (DQD)
##.ACQUISITION SCHEME= undefined
##.AVERAGES= 16
##.DIGITISER RES= 18
##SPECTROMETER/DATA SYSTEM= dpx250
##.PULSE SEQUENCE= zg30
##.SOLVENT NAME= DMSO
##.SHIFT REFERENCE= (INTERNAL, DMSO, 0, 16.522)
##AUDIT TRAIL= $$ (NUMBER, WHEN, WHO, WHERE, WHAT)
$$ ##TITLE= Audit trail, XWIN-NMR		Version 3.5
$$ ##JCAMPDX= 5.01
$$ ##ORIGIN= Bruker BioSpin GmbH
$$ ##OWNER= nmr
$$ C:\u/data/dgb/nmr/ADRS/2490/pdata/1/auditp.txt
$$ ##AUDIT TRAIL=  $$ (NUMBER, WHEN, WHO, WHERE, WHAT)
(   1,<2007-09-26 12:29:01.68 +100>,<MAYBRIDGE\nmr>,<NMR_250MHZ>,
      <created by zg, POWCHK disabled, PULCHK disabled
       configuration hash MD5:
       76 6E 9A 78 1E 09 19 81 EC 84 63 8F B0 6A 59 2D
       data hash MD5: 64K
       25 5B 50 20 00 F0 04 58 EC A6 07 42 5A BA D8 06>)
(   2,<2007-09-26 12:29:14.81 +100>,<MAYBRIDGE\nmr>,<NMR_250MHZ>,
      <Start of raw data processing
       ef LB = 0.3 FT_mod = 6 PKNL = 1 SI = 32K 
       data hash MD5: 32K
       B0 3C CE 61 71 03 DE 68 F7 D0 12 4B 9F C2 0C 33>)
(   3,<2007-09-26 12:29:16.56 +100>,<MAYBRIDGE\nmr>,<NMR_250MHZ>,
      <apk 
       data hash MD5: 32K
       89 E2 A1 A6 E9 26 A3 A4 3D E7 E3 8F 8A 43 97 46>)
(   4,<2007-09-26 12:29:17.42 +100>,<MAYBRIDGE\nmr>,<NMR_250MHZ>,
      <abs ABSG = 5 
       data hash MD5: 32K
       6C 85 66 64 0D B8 99 02 FD 59 97 D1 E6 57 D8 F4>)
$$ ##END=
$$ 
$$ hash MD5
$$ C2 CC 22 5F ED 4F 75 16 DF 8E 5D 49 55 D1 D9 EF
##$RELAX= 
##$RELAX= 
##$RELAX= 
##$RELAX= 
##$RELAX= 
##$RELAX= 
##$RELAX= 
$$ Bruker specific parameters
$$ --------------------------
##$DU= <C:\u>
##$EXPNO= 2490
##$NAME= <ADRS>
##$PROCNO= 1
##$TYPE= <nmr>
##$USER= <dgb>
##$AMP= (0..31)
100 100 100 100 100 100 100 100 100 100 100 100 100 100 100 100 100 100 
100 100 100 100 100 100 100 100 100 100 100 100 100 100 
##$AQSEQ= 0
##$AQ_mod= 3
##$AUNM= <au_zg>
##$AUTOPOS= <56 >
##$BF1= 250.13
##$BF2= 250.13
##$BF3= 250.13
##$BF4= 250.13
##$BF5= 500.13
##$BF6= 500.13
##$BF7= 500.13
##$BF8= 500.13
##$BYTORDA= 1
##$CFDGTYP= 0
##$CFRGTYP= 5
##$CHEMSTR= <none>
##$CNST= (0..31)
1 1 145 1 1 1 1 1 1 1 1 1 1 1 1 1 1 1 1 1 1 1 1 1 1 1 1 1 1 1 1 1 
##$CPDPRG= <>
##$CPDPRG1= <>
##$CPDPRG2= <>
##$CPDPRG3= <>
##$CPDPRG4= <mlev>
##$CPDPRG5= <mlev>
##$CPDPRG6= <mlev>
##$CPDPRG7= <mlev>
##$CPDPRG8= <mlev>
##$CPDPRGB= <>
##$CPDPRGT= <>
##$D= (0..31)
0 1 0 0 0 0 0 0 0 0.06 0 0 0 0 0 0 0.0002 0 0 0 0 0 0 0 0 0 0 0 0 0 0 
0 
##$DATE= 1190806140
##$DBL= (0..7)
120 120 120 120 120 120 120 120 
##$DBP= (0..7)
150 150 150 150 150 150 150 150 
##$DBP07= 0
##$DBPNAM0= <>
##$DBPNAM1= <>
##$DBPNAM2= <>
##$DBPNAM3= <>
$$ [...]
##$SUBNAM7= <"">
##$SUBNAM8= <"">
##$SUBNAM9= <"">
##$SW= 20.6930455092707
##$SWIBOX= (0..15)
0 0 3 0 0 0 0 0 0 0 0 0 0 0 0 0 
##$SW_h= 5175.983436853
##$TD= 65536
##$TD0= 1
##$TE= 296.16
##$TE2= 300
##$TE3= 300
##$TEG= 300
##$TL= (0..7)
0 120 120 120 120 120 120 120 
##$TP= (0..7)
150 150 150 150 150 150 150 150 
##$TP07= 0
##$TPNAME0= <>
##$TPNAME1= <>
##$TPNAME2= <>
##$TPNAME3= <>
##$TPNAME4= <>
##$TPNAME5= <>
##$TPNAME6= <>
##$TPNAME7= <>
##$TPOAL= (0..7)
0.5 0.5 0.5 0.5 0.5 0.5 0.5 0.5 
##$TPOFFS= (0..7)
0 0 0 0 0 0 0 0 
##$TUNHIN= 0
##$TUNHOUT= 0
##$TUNXOUT= 0
##$USERA1= <user>
##$USERA2= <user>
##$USERA3= <user>
##$USERA4= <user>
##$USERA5= <user>
##$V9= 5
##$VALIST= <valist>
##$VCLIST= <CCCCCCCCCCCCCCC>
##$VD= 0
##$VDLIST= <DDDDDDDDDDDDDDD>
##$VPLIST= <PPPPPPPPPPPPPPP>
##$VTLIST= <TTTTTTTTTTTTTTT>
##$WBST= 1024
##$WBSW= 4
##$XGAIN= (0..3)
0 0 0 0 
##$XL= 0
##$YL= 0
##$YMAX_a= 151654
##$YMIN_a= -505908
##$ZGOPTNS= <>
##$ZL1= 120
##$ZL2= 120
##$ZL3= 120
##$ZL4= 120
##$ABSF1= 16.522
##$ABSF2= -4.171173
##$ABSG= 5
##$ABSL= 3
##$ALPHA= 0
##$AQORDER= 0
##$ASSFAC= 0
##$ASSFACI= 0
##$ASSFACX= 0
##$ASSWID= 0
##$AUNMP= <proc_1d>
##$AZFE= 0.1
##$AZFW= 0.1
##$BCFW= 0
##$BC_mod= 0
##$BYTORDP= 0
##$COROFFS= 0
##$CY= 12.5
##$DATMOD= 1
##$DC= 0
##$DFILT= <>
##$DTYPP= 0
##$F1P= 14.0000005364418
##$F2P= -0.99999901652339
##$FCOR= 0.5
##$FTSIZE= 32768
##$FT_mod= 6
##$GAMMA= 0
##$GB= 0
##$INTBC= 1
##$INTSCL= 1
##$ISEN= 128
##$LB= 0.3
##$LEV0= 0
##$LPBIN= 0
##$MAXI= 10000
##$MC2= 0
##$MEAN= 0
##$ME_mod= 0
##$MI= 0
##$NCOEF= 0
##$NC_proc= -5
##$NLEV= 6
##$NOISF1= 0
##$NOISF2= 0
##$NSP= 0
##$NTH_PI= 0
##$NZP= 0
##$OFFSET= 16.522
##$PC= 1
##$PHC0= 136.9709
##$PHC1= 18.67643
##$PH_mod= 1
##$PKNL= yes
##$PPARMOD= 0
##$PSCAL= 4
##$PSIGN= 0
##$REVERSE= no
##$SF= 250.13
##$SI= 32768
##$SIGF1= 0
##$SIGF2= 0
##$SINO= 400
##$SIOLD= 32768
##$SREGLST= <1H.DMSO>
##$SSB= 0
##$STSI= 32768
##$STSR= 0
##$SW_p= 5175.98343685301
##$SYMM= 0
##$S_DEV= 0
##$TDeff= 65536
##$TDoff= 0
##$TI= <Analysis number 999999
Compound Code 99
Book Reference 9
Project Code 9>
##$TILT= no
##$TM1= 0
##$TM2= 0
##$TOPLEV= 0
##$USERP1= <user>
##$USERP2= <user>
##$USERP3= <user>
##$USERP4= <user>
##$USERP5= <user>
##$WDW= 1
##$XDIM= 32768
##$YMAX_p= 555636766
##$YMIN_p= -333135
$$ End of Bruker specific parameters
$$ ---------------------------------
##NTUPLES= NMR SPECTRUM
##VAR_NAME=  FREQUENCY,     SPECTRUM/REAL,   SPECTRUM/IMAG
##SYMBOL=    X,             R,               I
##VAR_TYPE=  INDEPENDENT,   DEPENDENT,       DEPENDENT
##VAR_FORM=  AFFN,          ASDF,            ASDF
##VAR_DIM=   32768,         32768,           32768
##UNITS=     HZ,            ARBITRARY UNITS, ARBITRARY UNITS
##FACTOR=    0.157963299565203, 1,           1
##FIRST=     4132.6476996994, 0,             0
##LAST=      -1043.33573715361, 0,           0
##MIN=       -1043.33573715361, -333135,     0
##MAX=       4132.6476996994, 555636766,     0
$$ Real data points
##PAGE= N=1
##DATA TABLE= (X++(R..R)), XYDATA
$$ [...]
21884F924288m310M440M353J7086p0862J3550M4497j10252K800L6359N1108l7800
21872F875257R087P637n3494n1577j9934m5626k7746M2491M8290k3222p9079m1398
21860F640686N600O13r0284p5466L5227P303p4720m30m322j9329J5649O109j4261
21847F432375l2399J075m731J078N1420j3411M843N298M9539q2196n8083K3412
21835F378220l6455O4849N1683j14907r6752P243n4002l8870j4178l0418L6022
21824F152435M8931N5366k1894p8878J7929M2876L9382k2930q0414O2368n5851
21813F159320r0650L8796P1932l0884n0141m581k9514j17651j6901J3435l3721
21802E909440J5907J3063J3004L8641m8792p7152k3420N4478j9197R86o801p2723
$$ y = [6924288, 6919978, 6924418, 6928771, 6945857, 6874995, 6888545, 6933042, 6822790, 6825590, 6861949, 6913057, 6875257, 6884344, 6891981, 6838487, 6786910, 6766976, 6721350, 6693604, 6736095, 6784385, 6761163, 6682084, 6640686, 6646286, 6646899, 6556615, 6481149, 6516376, 6523679, 6448959, 6448529, 6444207, 6424878, 6440527, 6446636, 6432375, 6399976, 6401051, 6396320, 6397398, 6448818, 6435407, 6440250, 6445548, 6495087, 6412891, 6354808, 6378220, 6341765, 6406614, 6458297, 6343390, 6246638, 6253881, 6199879, 6161009, 6146831, 6116413, 6152435, 6201366, 6256732, 6234838, 6155960, 6173889, 6216765, 6256147, 6233217, 6152803, 6215171, 6159320, 6068670, 6107466, 6179398, 6148514, 6098373, 6093792, 6064278, 5946627, 5929726, 5943161, 5909440, 5925347, 5938410, 5951414, 5990055, 5941263, 5864111, 5840691, 5895169, 5875972, 5876958, 5870157, 5797434]
21790E797434m2718O1469R1500l0737r9033q4910q9063K3255K5848J6993p065
21779E662973K949N674L2238k3309o7310k5983r248L4264J1192j2910r491k8481
21767E572558j1937l7215J4368K4273p285K0921k3919l877l2790K9126j0817o2224
21755E471182m5624J2731m8972L201R6000K0721j94943l1138J5271L7478j0582
21744E325325K0655o6138n9035L1532K7722m6953r2877q915P3346P3056k992K3586
21732E298312k3400k2951l3512j9633q171m3954j1033l3962p3394n412K8804M5437
21720E097131K2750r737o5117m4307O3389J05760p941p1583l7491k9149l1138
21709D992567J5963K656n9693o5285M4516N367J0459q159j076P316J257p2383
$$ y = [5797434, 5754716, 5816185, 5907685, 5876948, 5777915, 5693005, 5603942, 5627197, 5653045, 5670038, 5662973, 5665922, 5671596, 5703834, 5680525, 5613215, 5587232, 5577984, 5612248, 5623440, 5610530, 5601039, 5572558, 5560621, 5523406, 5537774, 5562047, 5554762, 5575683, 5551764, 5547887, 5515097, 5544223, 5533406, 5471182, 5425558, 5438289, 5389317, 5392518, 5488518, 5509239, 5314296, 5283158, 5298429, 5335907, 5325325, 5345980, 5279842, 5220807, 5252339, 5280061, 5233108, 5140231, 5131316, 5204662, 5277718, 5274726, 5298312, 5274912, 5251961, 5218449, 5198816, 5190645, 5146691, 5135658, 5101696, 5028302, 5022890, 5051694, 5097131, 5119881, 5110144, 5045027, 5000720, 5064109, 5169869, 5161928, 5090345, 5052854, 5023705, 4992567, 5008530, 5011186, 4951493, 4886208, 4930724, 4936091, 4946550, 4938391, 4937315, 4944631, 4945888, 4873505]
21697D873505j9753m9554M748j5595Q377k3065q4120l76L8683o027k7736j3874
21685D685213k3783l2968P1293r911l5755k1106o471m8645L4945P3006q291Q991
21673D686518J1812l7732l4026J3525j5164o6386j3775m1940N2896N2386n4143
21662D553971p4100j2341J2537k4309j453k4124m2608l859J8061K1376N044O3699
21650D491894M372k1844q6270J2894j3035J4802m7626n5305J4940L6107J6395
21639D367324l4469j0947k3987K9788O324J726k9670J3513o9535m4282K5347n3426
21627D177706K3199l6327j4780R5512N8747o352j34157o1021J9922L4430k6171
21616D130708m0770k2545M5274J0470L435n4713j9848L458q03J8985k0684l8086
$$ y = [4873505, 4853752, 4804198, 4808946, 4793351, 4801728, 4778663, 4694543, 4694167, 4732850, 4726823, 4699087, 4685213, 4661430, 4628462, 4699755, 4689844, 4654089, 4632983, 4626512, 4577867, 4612812, 4685818, 4677527, 4686518, 4698330, 4660598, 4626572, 4640097, 4624933, 4558547, 4544772, 4502832, 4555728, 4608114, 4553971, 4479871, 4467530, 4480067, 4455758, 4454305, 4430181, 4387573, 4383714, 4401775, 4423151, 4428195, 4491894, 4496266, 4474422, 4388152, 4401046, 4388011, 4402813, 4355187, 4299882, 4314822, 4350929, 4367324, 4332855, 4321908, 4297921, 4327709, 4334033, 4335759, 4306089, 4319602, 4250067, 4205785, 4231132, 4177706, 4200905, 4164578, 4149798, 4245310, 4304057, 4297705, 4163548, 4102527, 4122449, 4156879, 4130708, 4089938, 4067393, 4112667, 4123137, 4126572, 4071859, 4052011, 4055469, 4054666, 4073651, 4052967, 4014881]
21604D014881N452O3943o453n294k9991n7794M8858M993o235M8187J4308K6444
21592D121299n6006o6317j11064r9255l4888k0329J09778N9826J2357m96j1724
21581C903181K1231K5522p279j00821m6214m8682J2148N8478l9602n6827M8655
21570C769790R478K742K532q4767p330L5308j5064q8140k1915j2251J8834l1727
21558C577490k9096L1762Q5289P6620k427j6309k1057j4055L5245m5056q0786
21547C597620J7651P8108r996O692Q0283p100k4512n5830o3964M1249l4901o0725
21535C564575j0841N6027N891k7265o050n9178l510n5115R263Q3651K0095p5835
21523C501708l886n8832n5928J0696K091K9023r15j8476k9363J2592K0639N5742
$$ y = [4014881, 4020333, 4084276, 4077823, 4072529, 4042538, 3984744, 4033602, 4038595, 4032360, 4080547, 4094855, 4121299, 4065293, 3998976, 3887912, 3788657, 3753769, 3733440, 3843218, 3903044, 3915401, 3914905, 3903181, 3924412, 3949934, 3942655, 3841834, 3795620, 3746938, 3759086, 3817564, 3777962, 3721135, 3769790, 3779268, 3782010, 3784542, 3699775, 3692445, 3727753, 3712689, 3624549, 3602634, 3590383, 3609217, 3577490, 3548394, 3580156, 3665445, 3742065, 3739638, 3723329, 3702272, 3688217, 3723462, 3678406, 3597620, 3615271, 3693379, 3683383, 3690075, 3770358, 3763258, 3738746, 3682916, 3618952, 3660201, 3625300, 3564575, 3553734, 3609761, 3615652, 3588387, 3582337, 3523159, 3519649, 3464534, 3473797, 3557448, 3577543, 3501708, 3497822, 3438990, 3383062, 3393758, 3395849, 3424872, 3423957, 3405481, 3376118, 3388710, 3409349, 3465091]
21511C465091N7898J7443j9219n1706l1451p0307o3815L5646N2665n241n0381
21500C336623K788j9477n1959o2958l5731m7667M3859L7673N8722j234J8003n0570
21488C228072r120M5323n1808m6572P240k2533j2524K6322L8076m066m3521l2241
21476C122648L9513L6869m629n37n5264K3249j2969n3809k4777J1994J3142j03179
21464B992251J5149R0575J09944p4543n1028l5823Q955k780k2216k8824o4926
21453B936734J0753L5032J0580K3179q27K215l4684m6537P2922J9576K1063K3540
21441C073546n4390L1655q2097l1474p1305k395J6258L6487Q3794J7254p9189
21430B938144k5022k3123J122M7900l4031k457N0747j3091j21814j138l7349j0670
$$ y = [3465091, 3522989, 3540432, 3521213, 3469507, 3438056, 3367749, 3303934, 3339580, 3392245, 3387004, 3336623, 3339411, 3319934, 3267975, 3205017, 3169286, 3121619, 3165478, 3203151, 3261873, 3260639, 3278642, 3228072, 3218952, 3264275, 3212467, 3165895, 3173135, 3150602, 3138078, 3164400, 3202476, 3198410, 3154889, 3122648, 3162161, 3199030, 3194401, 3193864, 3138600, 3161849, 3148880, 3095071, 3070294, 3082288, 3095430, 2992251, 3007400, 3097975, 3207919, 3133376, 3082348, 3046525, 3055480, 3052700, 3030484, 3001660, 2936734, 2947487, 2982519, 2993099, 3016278, 3015451, 3017666, 2982982, 2936445, 3009367, 3028943, 3050006, 3073546, 3019156, 3050811, 2968714, 2937240, 2865935, 2863540, 2879798, 2916285, 3000079, 3017333, 2938144, 2913122, 2889999, 2891121, 2939021, 2904990, 2902533, 2953280, 2940189, 2818375, 2817237, 2779888, 2769218]
21418B769218j4164K2470L0509l0947k33R0700K2622j4552K4507l2786q4763o5663
21406B716918P2782K5783K8251j275m8376l5293k919l6241p366J0853m8233j17798
21394B557086K9406J00152K558l0832r790q9032j7305P7662J2564O0087M5138
21383B737694m7513n2960q066J7397j7047q30Q8058O981l4234p1559j3290K6488
21371B631119j1879o0847m0874K7263O0663O5059P3845M3867m5048m2413p3030
21360B627725q6385k7616L8441K6216k1602n1459K418K034J01524P397l9230l3424
21348B546039k8531k6226J8882m646k8991k2234N0130k4642K335N0594k0093k5589
21336B487028M0872Q043j08991K5800k8479r083J5486K5016J7946k8474p4170
$$ y = [2769218, 2755054, 2777524, 2808033, 2777086, 2776853, 2867553, 2890175, 2875623, 2900130, 2867344, 2782581, 2716918, 2789700, 2815483, 2843734, 2842459, 2794083, 2758790, 2755871, 2719630, 2712264, 2723117, 2674884, 2557086, 2586492, 2686644, 2689202, 2658370, 2648580, 2559548, 2542243, 2619905, 2632469, 2692556, 2737694, 2690181, 2637221, 2629155, 2646552, 2629505, 2628675, 2716733, 2723714, 2689480, 2617921, 2604631, 2631119, 2619240, 2558393, 2517519, 2544782, 2605445, 2670504, 2744349, 2788216, 2743168, 2700755, 2627725, 2541340, 2513724, 2552165, 2578381, 2556779, 2505320, 2507738, 2509772, 2611296, 2618693, 2579463, 2546039, 2517508, 2491282, 2510164, 2505518, 2476527, 2454293, 2504423, 2479781, 2482116, 2532710, 2512617, 2487028, 2527900, 2535943, 2426952, 2452752, 2424273, 2415190, 2430676, 2455692, 2473638, 2445164, 2370994]
21325B370994l9058j2323j5164P5748P5602L8386j602r2066R449K6334n2619m8430
21313B335251p975L7397j4692K331J2475p6200j6922N4107k9418J5849j7084K6835
21301B321954K4190L6030m723L8451M7324r20j21540p8934l0730N5610O2968l4229
21289B315451j04114p7640L8065N7458K3285N5099n9191o3453R8160L4368o1325
21278B256163J8214k1727n9246o5028m2543N1849J2203J3601o8383n3713R7956
21267B139346N5074L0648k1189N886J7924O554K1527o0441m926m364J750k3813
21255B163976m7942j6729K1774L349p0903r198M9643K9403L2443J3694K7427K1078
21243B218015J9749J2737l4647r44P314m0814m2160k4674O976K8070O2842m7917
$$ y = [2370994, 2331936, 2319613, 2304449, 2380197, 2455799, 2494185, 2492583, 2400517, 2409966, 2436300, 2383681, 2335251, 2327276, 2364673, 2349981, 2352312, 2364787, 2288587, 2271665, 2325772, 2296354, 2312203, 2295119, 2321954, 2346144, 2382174, 2377451, 2415902, 2463226, 2462306, 2340766, 2261832, 2231102, 2286712, 2349680, 2315451, 2211337, 2133697, 2171762, 2229220, 2252505, 2307604, 2248413, 2184960, 2283120, 2317488, 2256163, 2274377, 2252650, 2193404, 2128376, 2085833, 2137682, 2149885, 2163486, 2095103, 2041390, 2139346, 2194420, 2225068, 2203879, 2209765, 2227689, 2234243, 2255770, 2195329, 2190403, 2186039, 2187789, 2163976, 2116034, 2099305, 2121079, 2124428, 2053525, 2044327, 2093970, 2123373, 2155816, 2169510, 2196937, 2218015, 2237764, 2250501, 2215854, 2214910, 2222224, 2181410, 2139250, 2114576, 2121552, 2149622, 2212464, 2164547]
21231B164547k7603L3546m9442l4301o8716o949L9166o167J3079L1760k8542m4461
21219B015917n447K2130L8745k3451k9019K7797l5583q2360R5137K7016m3161
21208B007721o0588J2693j2047j362j0632l950K8312K7107M6504r941p5215K2988
21196A971590J05671J4468r2930m9059P780r560l3245n1515n0664O1263J5152
21185A888951M3647M8890j24497j15307j3915K7533J7717N497N982J9012k0327
21174A783183L1065L0572j4765J9607k9776j5273L6612L4206p1591k2239l65p759
21162A773477l787n4203M723l45n2868n2087O6241m003l3687Q9692N7416L704
21150A794273j2091K2540l6466Q466J7438l4872k4335k1697j5764M1154M4130
$$ y = [2164547, 2136944, 2170490, 2121048, 2086747, 2018031, 2011082, 2050248, 2044081, 2057160, 2088920, 2060378, 2015917, 2010470, 2032600, 2071345, 2047894, 2018875, 2046672, 2011089, 1928729, 2023866, 2050882, 2007721, 1947133, 1959826, 1947779, 1946417, 1935785, 1931835, 1960147, 1987254, 2033758, 2023817, 1948602, 1971590, 2077261, 2091729, 1998799, 1949740, 1957520, 1947960, 1914715, 1863200, 1812536, 1873799, 1888951, 1932598, 1981488, 1856991, 1741684, 1727769, 1755302, 1773019, 1778516, 1784498, 1803510, 1783183, 1814248, 1844820, 1830055, 1849662, 1819886, 1804613, 1841225, 1875431, 1803840, 1781601, 1781236, 1773477, 1769690, 1715487, 1720210, 1719865, 1666997, 1614910, 1681151, 1677148, 1643461, 1733153, 1790569, 1794273, 1782182, 1804722, 1768256, 1776722, 1794160, 1759288, 1734953, 1713256, 1697492, 1738646, 1782776]
21139A782776m2620j9375L1518l7779M10L6930J8918Q610j5454K7381j4514M5849
21127A822650l0871n5831k4751p8480l6626K6784M3737j9041K0692o185K0842
21116A682920k6433M8444Q9604O7448q6872l5507m1193l8334l3467j6453P511
21105A617668p8136L7406O2131p6075l278M5572J1248M0467r724L8671o2242q2330
21093A541378L2559M7100P3286J0006n5239k7589J640q736k5761j06321k6844
21082A455479M9139M7453L3083L0009N0986K472j1179r4685o8582n2007K8826
21071A470994K7262l351l529q2580n430J15232P5655k9519l0640j5580K7085K087
21059A547686q1810n6459m2695O7592J7418k0432l7106L3601L9983L0409Q676
$$ y = [1782776, 1740156, 1720781, 1752299, 1714520, 1714930, 1751860, 1770778, 1779388, 1763934, 1791315, 1776801, 1822650, 1791779, 1735948, 1711197, 1632717, 1596091, 1622875, 1666612, 1647571, 1668263, 1662078, 1682920, 1656487, 1704931, 1794535, 1861983, 1775111, 1739604, 1698411, 1660077, 1626610, 1610157, 1617668, 1539532, 1576938, 1639069, 1562994, 1559716, 1605288, 1616536, 1657003, 1647279, 1685950, 1623708, 1541378, 1573937, 1621037, 1694323, 1704329, 1649090, 1621501, 1623141, 1614405, 1588644, 1482323, 1455479, 1504618, 1552071, 1585154, 1615163, 1666149, 1668621, 1657442, 1562757, 1494175, 1442168, 1470994, 1498256, 1494905, 1491376, 1408796, 1403366, 1518598, 1594253, 1564734, 1534094, 1518514, 1545599, 1547686, 1465876, 1409417, 1366722, 1434314, 1451732, 1431300, 1394194, 1427795, 1467778, 1498187, 1506863]
21048A506863M5970m7445p9108q274L3380J9419j4384J2260l3424J8099P6824
21037A530180j4481j4694l4695j3253N2319K7402J8201j07030l1478M6513M0273
21026A499257K2790N3880j336j291n5980j35656o9732L2225O6402k1671J0408
21015A399296O2346J704J8177j4807m4565j05321r69N1349K4211M8079K8715n7926
21003A410289k4831J1967P6766p1568j2410j8445k9190K1051L797N4417M5552
20992A467395k6489k3318n6248l1500M2377O6283k1624p0162K0739M6614L1597
20981A445664k1544q3969l3362J2488J92J1099N3806n7120K5043P8917j8560j2289
20969A400365P0017r093o7146q5568M967P8252k1176m03k5360L0674l4633q1799
$$ y = [1506863, 1552833, 1505388, 1426280, 1418006, 1451386, 1470805, 1456421, 1468681, 1435257, 1453356, 1530180, 1515699, 1501005, 1466310, 1453057, 1505376, 1532778, 1550979, 1443949, 1412471, 1458984, 1499257, 1522047, 1575927, 1574591, 1573300, 1517320, 1381664, 1311932, 1344157, 1410559, 1388888, 1399296, 1461642, 1463346, 1481523, 1466716, 1422151, 1316830, 1315861, 1367210, 1391421, 1439500, 1468215, 1410289, 1385458, 1397425, 1474191, 1402623, 1390213, 1371768, 1342578, 1363629, 1367426, 1421843, 1467395, 1440906, 1417588, 1361340, 1329840, 1372217, 1438500, 1416876, 1346714, 1367453, 1414067, 1445664, 1424120, 1340151, 1306789, 1319277, 1319469, 1330568, 1384374, 1327254, 1352297, 1431214, 1412654, 1400365, 1470382, 1461289, 1394143, 1308575, 1313542, 1391794, 1370618, 1370215, 1344855, 1375529, 1340896, 1259097]
20957A259097K1380M6489K2334p1175P249n816l0353o4840j4130j0J2336J3678
20945A196239l1698N291M9411K2500O3920K3020j7762k6974J0978K9877p312n8565
20933A258925p6204k292O1862J8757O0165n9096k2182k4310j2530J3397N8001
20922A274493O0147o161r1732m937L7714l60j3168p5941l0063K6158N5687l197
20910A228640p7929m6739m6217J12244M8239k2713R339n1245l4276N7856K438
20899A179637k440q137n4498M5126M3447q723K2833O0492j1479o7099J1351N9118
20887A269628P4745j1322o8056o6341R913J6981N1464q0417o754R277j5168l6472
20875A147478p304j2191L0876J4589j5645k3003K2040K1201J1402J542o913p0819
$$ y = [1259097, 1280477, 1326966, 1349300, 1278125, 1285374, 1279558, 1249205, 1184365, 1170235, 1170225, 1182561, 1196239, 1164541, 1169832, 1219243, 1241743, 1305663, 1328683, 1310921, 1283947, 1294925, 1324802, 1317490, 1258925, 1182721, 1180429, 1242291, 1261048, 1321213, 1262117, 1239935, 1215625, 1203095, 1216492, 1274493, 1334640, 1328479, 1236747, 1231810, 1269524, 1269164, 1255996, 1180055, 1149992, 1176150, 1231837, 1228640, 1150711, 1103972, 1057755, 1169999, 1218238, 1195525, 1204864, 1153619, 1119343, 1177199, 1179637, 1177197, 1169060, 1114562, 1159688, 1203135, 1194412, 1217245, 1277737, 1266258, 1199159, 1210510, 1269628, 1344373, 1333051, 1264995, 1198654, 1208567, 1225548, 1277012, 1196595, 1189841, 1199118, 1183950, 1147478, 1140174, 1127983, 1158859, 1173448, 1157803, 1134800, 1156840, 1178041, 1189443, 1190985, 1184072, 1113253]
20863A113253q229P161L851n019l5192n5174K8102o539R4973Q901j9161K2064
20851A148991n131l2437n4494q4407K3905O8989o736l8112k6204L1604M4320l1353
20839A038935J0552l9599J5669N0907K203j2098O6630J1468N3781L2445n7908
20828A172985j22761j03620O5244Q386j7560p8701n2500N7461J8868l1002P3429
20817I90229P6615M3064j2409k6252j8608K847K3969M6954n7576k3197n0906R306
20805A004036o7358k7587M4138P2841n1528j22218m7447J10429P1918N9692Q59
20794A047775O325O4359K970l6085J3476K7865j2286n1499M230Q714p7292k6357
20782I72195P020M1758l0174l7034M5072K4945L5920O815k0417j5147m7063j8484
$$ y = [1113253, 1105024, 1112185, 1116036, 1111017, 1075825, 1020651, 1048753, 1042214, 1137187, 1146088, 1126927, 1148991, 1143860, 1111423, 1056929, 972522, 996427, 1065416, 1058680, 1020568, 994364, 1025968, 1070288, 1038935, 1049487, 1009888, 1025557, 1076464, 1078667, 1066569, 1133199, 1144667, 1198448, 1230893, 1172985, 1050224, 946604, 1011848, 1020234, 1002674, 923973, 871473, 928934, 947802, 916800, 990229, 1066844, 1109908, 1097499, 1071247, 1052639, 1055486, 1079455, 1126409, 1068833, 1045636, 994730, 1004036, 936678, 909091, 953229, 1026070, 974542, 852324, 804877, 915306, 987224, 1046916, 1047775, 1054100, 1118459, 1121429, 1085344, 1098820, 1126685, 1114399, 1062900, 1067130, 1075844, 998552, 972195, 979215, 1020973, 990799, 953765, 998837, 1023782, 1059702, 1066517, 1046100, 1030953, 983890, 965406]
20770I65406k5069P2383L7125o8352R1629j8489l3785p1750m8941J2224M5396
20759I57777l1824n7291o9898L4128L1851Q08l1062J7848P4540n7262o610R7770
20747I60775k0898q6069O548P7725J6443o0942o6305j7478o378M6545o285m8105
20735G95576N0229O6591O3210p7024j62237J4009J21868M7401J22010R4950q4792
20724A051791j65534p4718q9394r104J19011R7717j86k723j49771m3807o0214
20713F73068K2888J14367L8385O3831J03827R294j8841j12278j01753k262O0238
20702H50764k1252J7969P4170k2255m4927J3954k5413K350n6946L360N5722m4645
20690H02851j0428K3351k4954M0078L4559p4305M5038R6167o4029p4746j7477
$$ y = [965406, 940337, 1012720, 1049845, 981493, 1073122, 1054633, 1020848, 949098, 900157, 912381, 957777, 925953, 868662, 798764, 832892, 864743, 865551, 834489, 852337, 926877, 869615, 863005, 960775, 939877, 853808, 860356, 938081, 954524, 893582, 827277, 809799, 803421, 849966, 843681, 795576, 845805, 912396, 975606, 898582, 736345, 750354, 872222, 919623, 1041633, 1136583, 1051791, 886257, 811539, 722145, 713041, 832052, 929769, 929583, 926860, 777089, 733282, 673068, 695956, 810323, 848708, 912539, 1016366, 1025660, 1006819, 894541, 792788, 790526, 850764, 829512, 847481, 921651, 899396, 854469, 868423, 843010, 845360, 788414, 791774, 847496, 802851, 792423, 815774, 790820, 830898, 865457, 791152, 836190, 932357, 868328, 793582, 776105]
20679G76105N6762p268m2959M9701L6656L8440J4196p657r0410r0020j3420P476
20667G27602K5799O319K2246O3030M9378m1401o189k8437l9001q114J9213J4900
20655H05345n8654o5928K3295L0829M4050M3002M6501m6773P458L0576N9067L5973
20643I54741M062o9018r5973m6932k1236o266O1289P0529J02524M2878r4781o7746
20631H34071j2647J1555k2983m8031l8363M3469N2063j7994K6856K1857O3142
20620I12995k0964l1758m010r0199m5065K6367j0157L2508K5658L8238N665m6366
20608G92912m419N847k6448m5443L3736m6815j5155k9412N8926l7947n180R4386
20596G74988M8493p0382l1749J6696N5409M0872Q223J2467j2243k6857p0794l0342
$$ y = [776105, 832867, 825599, 782640, 832341, 868997, 907437, 921633, 913976, 823566, 733546, 720126, 727602, 753401, 759720, 781966, 844996, 894374, 852973, 846784, 818347, 779346, 771232, 790445, 805345, 746691, 680763, 704058, 734887, 778937, 821939, 868440, 821667, 829125, 859701, 918768, 954741, 958803, 889785, 793812, 746880, 725644, 719378, 780667, 851196, 953720, 996598, 901817, 834071, 821424, 832979, 809996, 761965, 723602, 767071, 819134, 801140, 827996, 849853, 912995, 892031, 860273, 856263, 766064, 720999, 747366, 737209, 769717, 795375, 833613, 839278, 792912, 788493, 794340, 767892, 722449, 756185, 709370, 694215, 664803, 723729, 685782, 680602, 774988, 823481, 753099, 721350, 738046, 793455, 834327, 842550, 855017, 842774, 815917, 745123, 714781]
20584G14781k5514k106l5226m666J5860l119L7844n7598O511O0867P0981Q6710
20572H65325l2633q577o5620j9737o8914K0191n0061j5225L2688j7057j6622K5669
20560F49427J38410J5116q4850N566M1927R504o4768q7258l4739n811M3915N2003
20548F78442J8522j4981m2305k3855j7383P3642K2396q512N3259r961o2022J0985
20536F78227l6819j29938M157R3765L0250K8804Q7996R249l9153K2564k3421q0400
20524F45281q561p635l3579J4084O356M1973M3461K4420J912M0130l9413l4729
20512F93700J6629o125p672o660m2856q990k7292j3624k191P9135R807j4721L05
20499F69445J9022m7387j6132m1597p2481j2199N0708l6048l1218P9388M0068
$$ y = [714781, 689267, 687161, 651935, 647269, 663129, 660010, 697854, 640256, 646767, 707634, 778615, 865325, 832692, 824115, 758495, 738758, 669844, 690035, 639974, 624749, 657437, 640380, 623758, 649427, 787837, 802953, 718103, 723669, 765596, 775100, 710332, 623074, 588335, 582524, 626439, 678442, 696964, 681983, 639678, 615823, 598440, 672082, 694478, 685966, 739225, 729264, 667242, 678227, 641408, 511470, 515627, 609392, 639642, 668446, 756442, 765691, 726538, 749102, 725681, 645281, 636720, 629085, 595506, 609590, 615946, 657919, 701380, 725800, 727712, 767842, 728429, 693700, 710329, 704204, 696532, 689872, 647016, 638026, 610734, 597110, 594919, 674054, 683861, 669140, 669445, 688467, 641080, 624948, 583351, 510870, 498671, 549379, 513331, 482113, 561501, 601569]
20488F01569N75N9493P325r3547J2101N6201O431k8332j0267j0107J2951Q7726
20476G02119N1633l8014p4859r2862K3853N7769P4146n7094m4796N7702J3672
20465F73269J9204k622p3189J8361K1181K5599k5880j34026j4876L8431J8664
20454E64116J6254J9988l0187K8295N65M8445n1457K6951O7454j8039K9162J5392
20442G16939m9663q1132j12930l0232O8641r998q3649r614M9957P5257Q3987L5797
20430F53360O555m3395l0403j8386l8103M479l7339m8759L4434K1900M9169j6474
20418E37038j07545M0221P8072l2329j5976K7606O0929O293Q2278J1245n3399
20407F34433M597j4412l598M3757j8924j54890k1525j9726m0094N2039L2362K0267
$$ y = [601569, 602144, 661637, 668962, 575415, 587516, 643717, 650148, 621816, 611549, 601442, 614393, 702119, 753752, 715738, 640879, 548017, 571870, 629639, 703785, 646691, 601895, 659597, 673269, 692473, 689851, 616662, 635023, 656204, 681803, 655923, 521897, 507021, 545452, 564116, 580370, 600358, 570171, 598466, 599031, 647476, 596019, 622970, 690424, 672385, 701547, 716939, 667276, 586144, 473214, 442982, 511623, 501625, 417976, 408362, 458319, 533576, 617563, 653360, 659915, 616520, 586117, 567731, 529628, 534107, 496768, 448009, 482443, 504343, 553512, 537038, 429493, 469714, 547786, 515457, 499481, 527087, 588016, 594309, 676587, 687832, 634433, 639030, 624618, 621020, 664777, 645853, 490963, 469438, 449712, 409618, 461657, 494019, 514286]
20395E14286j3825l3820J1800M7998k0727K5120M8621n9258p3561j5303M6941
20384D78272P7304n3745K7602L6873N619k8883J2234k8463m8932Q1350N9064j04605
20372E13690k0991j1561m394J6148M3896k83m4744m1271K2009j3434j6666J5627
20360D58026L3617j2089k1712k0352P4219K3052m2735q5408K0153R4511J5475
20349E36757l7038M4030K2844l2226n619J2431j7216r3820k9553l0352K6110M6509
20337D42857k357l3476O0967R7469P01j5563m571n7655l5927m0955M2354J4770
20325D68614m1899l2034M3997K1864L5859P8302m1612J5508N1053k8823o6800
20314E04029k1591R4006L4319L3673k2181q8463k7642J779l6798l2358p4693k1917
$$ y = [514286, 500461, 466641, 478441, 526439, 505712, 530832, 579453, 520195, 446634, 431331, 478272, 555576, 501831, 529433, 566306, 571925, 543042, 555276, 526813, 477881, 559231, 618295, 513690, 492699, 481138, 476744, 492892, 536788, 536505, 491761, 450490, 472499, 459065, 442399, 458026, 491643, 479554, 457842, 437490, 511709, 534761, 492026, 406618, 426771, 521282, 536757, 499719, 543749, 566593, 534367, 528748, 541179, 523963, 430143, 400590, 370238, 396348, 442857, 440500, 407024, 467991, 565460, 566161, 550598, 546027, 488372, 452445, 411490, 453844, 468614, 426715, 394681, 438678, 460542, 496401, 574703, 533091, 548599, 599652, 570829, 504029, 482438, 576444, 610763, 644436, 622255, 533792, 506150, 507929, 471131, 438773, 364080, 342163]
20302C42163K551K0801k9223n6712P7803Q0654P5748n4152m9464n9167j8041L0206
20290C63167K9176M0901j5468M69P4343K5628k0569p1079q1189M3962P8560j8565
20278D49336r6351J4038L4176M4574m2194n7897l4137J11292P7259j2304J0414
20267D98206k3737r472M2090j0491p792j35670m2741J49479k3207K8494N8777
20256E23936L3279L7978J1413m8675p3421J6749n6492J1192J1879k838l7789n746
20244D21465j5459K331J4212j0213Q9914M6619n2619o3037l7481k9432m4551k3799
20232B97950l2683P9968l8086P617Q7456Q9319j580N31J8214m1516l1942M2836
20220D78084j9984l7799j5756K2124K1919K5530O07P9297o6841j26496J9550M7837
$$ y = [342163, 344714, 365515, 336292, 279580, 357383, 438037, 513785, 459633, 410169, 351002, 332961, 363167, 392343, 433244, 417776, 418245, 492588, 518216, 497647, 426568, 345379, 389341, 467901, 449336, 352985, 367023, 401199, 445773, 403579, 345682, 311545, 422837, 500096, 487792, 498206, 474469, 464997, 507087, 496596, 488804, 353134, 310393, 459872, 436665, 465159, 523936, 557215, 595193, 606606, 557931, 484510, 501259, 444767, 455959, 467838, 465000, 427211, 421465, 406006, 408337, 422549, 412336, 502250, 548869, 496250, 433213, 395732, 366300, 321749, 297950, 265267, 345235, 307149, 314766, 402222, 491541, 489961, 490492, 508706, 467190, 435248, 478084, 458100, 420301, 404545, 426669, 448588, 474118, 474725, 554022, 487181, 360685, 380235, 428072]
20208D28072L6330q5380j6968J08768M255m0930l7439m3441j0056Q4669k2588
20197D05292j6755j663p5025J0337P9173J1528L2330m7382K6670L5628m0703n3786
20185C65644N5700L2087Q075k6595r9432l7789K9972J24278N277l804j25l6333
20173D16955l0288l2881O533R705J33649M6554p7642l6076N349K0882l3506o1888
20161C67346l1917k7618O46m999N370K4936L3000Q696M0660l3775o4953n0498
20149B66894K6643P1404j3600o1486M0944o573L5634k6433N2910K5921J3049k0010
20137D05297k5271m6538J0335j2538O092r1685m2925R4147L8857l7037l044M2497
20125C38187j2039R546J1601k2053L7927l510j5646n1605k8746M9304M7442N6395
$$ y = [428072, 464402, 379022, 362054, 470822, 475077, 434147, 396708, 353267, 343211, 427880, 405292, 388537, 386874, 311849, 322186, 401359, 412887, 445217, 397835, 424505, 460133, 419430, 365644, 421344, 453431, 461506, 434911, 335479, 297690, 327662, 451940, 457217, 453413, 453288, 416955, 386667, 353786, 360319, 370024, 503673, 550227, 472585, 436509, 441858, 462740, 429234, 367346, 335429, 307811, 308457, 303458, 308828, 333764, 366764, 375460, 416120, 382345, 317392, 266894, 293537, 364941, 351341, 289855, 330799, 324226, 359860, 333427, 386337, 412258, 425307, 405297, 380026, 333488, 343823, 331285, 337377, 245692, 202767, 296914, 335771, 298734, 295690, 338187, 326148, 335694, 347295, 325242, 363169, 359659, 344013, 292408, 263662, 312966, 360408, 416803]
20113D16803N393p1058J0596P7340M0467l5911l206p1664k3865o1875K6657J06890
20101D16567l8037k5457j112k8677M2265J8615n195p167n7480k3867l7127l2704
20089B20624M4216M5118J0824O9196j9315o8260o126m3480l7149L7550l977J2706
20077B61927Q9482J6857o9901J1148l123l6722j8085P8182O3314q1288J5619l4318
20065B93092n748l7806j9701J515O8270Q0569L809o0604M7405K5291l8240m8599
20053C09253m4279J8477m8260N6527L0782J2337l208j5823K2712j5236l9987R339
20041B92634k2489q062O4880p48k8042K2749N2025k1481o2195k8560n8876N9183
20029B61018L3890q2795Q6193R4882q9529j9598J840O3870M1159m3757k8837M986
$$ y = [416803, 422196, 351138, 361734, 439074, 479541, 443630, 440424, 368760, 344895, 283020, 309677, 416567, 378530, 353073, 351961, 323284, 365549, 384164, 378969, 371802, 314322, 290455, 253328, 220624, 264840, 309958, 320782, 389978, 370663, 302403, 296277, 252797, 215648, 253198, 249221, 261927, 351409, 368266, 298365, 309513, 306390, 269668, 251583, 329765, 393079, 311791, 327410, 293092, 287344, 249538, 229837, 231352, 299622, 380191, 384000, 323396, 370801, 396092, 357852, 309253, 264974, 283451, 235191, 291718, 322500, 334837, 331629, 315806, 338518, 323282, 283295, 292634, 270145, 262083, 326963, 326215, 298173, 320922, 372947, 351466, 289271, 260711, 201835, 261018, 294908, 212113, 298306, 393188, 303659, 284061, 285901, 349771, 390930, 347173, 318336, 323322]
20017C23322j5645p5291n0144J5955L7832J5077j7762j2193P2756j5275k2777
20006B55855k7127J1723J3758q1161k3558L2990N9034m7453n6294L2591J13735
19995B84093l5257n3527L6266n2429L0693N4122L3584k593J9347k6444p1963l299
19983B12593K6064P3269k5383j044M1121M9520p160p899m8570j00899P985J5194
19971B34791l1701n9878R493M4185L8044n19l6863J2796m3249J7875N3905L8562
19959B77441k5233k2284L3387N1165q3788k7839r875K9435j6863j8296J5026K0353
19947B22629K3009J155k7775M0285R649o260O867k7432J627J8080q089M1553K734
19934B98032J9931j1739o0900n7041L1681l7115q6688l9764N7425Q5099M9618
$$ y = [323322, 307677, 232386, 182242, 198197, 236029, 251106, 233344, 221151, 293907, 278632, 255855, 228728, 240451, 254209, 173048, 149490, 182480, 241514, 194061, 137767, 170358, 284093, 248836, 195309, 231575, 179146, 209839, 263961, 297545, 294952, 314299, 287855, 215892, 212593, 238657, 311926, 286543, 285499, 326620, 376140, 368980, 361081, 312511, 211612, 219597, 234791, 203090, 143212, 152705, 196890, 234934, 234415, 197552, 210348, 167099, 184974, 238879, 277441, 252208, 229924, 263311, 314476, 230688, 202849, 192974, 222409, 205546, 187250, 202276, 222629, 245638, 246793, 219018, 259303, 268952, 262692, 269559, 242127, 243754, 261834, 253745, 295298, 298032, 317963, 306224, 245324, 188283, 219964, 182849, 96161, 56397, 113822, 198921, 248539]
19923B48539l5165K8767r522L5968N119n0122L696m4604m7760l9748L2067M4091
19911A71326J5462p826J4091R005l9512P559N3997L299l1235K3937K8734K454
19899B51291k0831k3410l8383K0202J2863n436L2824j6132j9586j0496L1868j7759
19887A97015M9579M5299l5438o299k9025O741l1545k6594J8129M4556m6934k3483
19875A62001j1986l4351J084P655k414N6569N6474m9347o1619n3356O8118Q0966
19863B19794l3102m9200m320O422J0889N2741O6802J8074J5394n254r614m633
19851B83993k4801M6422p8301j4175L2096n4389j1958K9018K0307q79n8393l3182
19839A35758J0809l8195l5326K4738J27475K8730q4945k2563N0439J09022M9489
$$ y = [248539, 213374, 242141, 232619, 268587, 273706, 223584, 227280, 182676, 134916, 95168, 127235, 171326, 186788, 178962, 193053, 202058, 162546, 170105, 224102, 227401, 196166, 220103, 248837, 251291, 230460, 207050, 168667, 188869, 201732, 196296, 229120, 212988, 193402, 182906, 214774, 197015, 246594, 291893, 256455, 250156, 221131, 227872, 196327, 169733, 187862, 232418, 185484, 162001, 150015, 115664, 116748, 124403, 121989, 178558, 235032, 185685, 124066, 70710, 138828, 219794, 186692, 137492, 133172, 139594, 150483, 203224, 270026, 288100, 303494, 298240, 288626, 283993, 259192, 305614, 227313, 213138, 245234, 190845, 178887, 207905, 228212, 227333, 168940, 135758, 146567, 108372, 73046, 97784, 225259, 253989, 169044, 146481, 196920, 305942, 355431]
19828C55431o1436j7174K3494J01058p3327p8162n214K1500L207j01573p643K1308
19816A81469P7330L0629l0629j07697k6886R490N4026n4134n5661M6199J06506
19805B30642L1961m3891L55l7702Q65O6106R3380q3155r3041J3886L3751O2831
19793B75988L5932j4269j26035k1200p347K5496O3079N3580j8279M4749j1387
19782C00307k0176o9508o9941L0880Q7933m5580k205n2825j2731j0630N684K7483
19770A68691k236J7702P100j9053N6482k2006m2479n2814N6665k277n3470M5820
19758A58125K7324K826K1449J827J8382j9760m1576L2495P275q6377l6349Q3544
19746A69185N1137j958K0519J4053K604n5959j5857Q6789q834l693l4365k6956
$$ y = [355431, 293995, 276821, 300315, 401373, 328046, 249884, 244670, 266170, 269377, 167804, 160161, 181469, 258799, 289428, 258799, 151102, 124216, 133706, 187732, 133598, 77937, 124136, 230642, 262603, 218712, 219067, 181365, 182230, 248336, 341716, 258561, 165520, 179406, 213157, 275988, 311920, 297651, 171616, 150416, 143069, 168565, 231644, 285224, 266945, 311694, 300307, 280131, 210623, 140682, 171562, 259495, 213915, 211710, 158885, 146154, 135524, 141208, 168691, 166455, 184157, 191257, 172204, 228686, 206680, 164201, 111387, 168052, 165775, 112305, 158125, 185449, 188275, 209724, 211551, 229933, 210173, 168597, 201092, 208367, 121990, 85641, 169185, 220322, 218364, 238883, 252936, 255540, 199581, 183724, 270513, 261679, 257986, 223621, 196665]
19734A96665j6117N2570L3381j3235M1042r8101k6863K3880l6991q705J0641K1071
19722A79238O5640n8508q852J4702o358r749M6427n5203j3602r163P1945k1503
19710A95014r1629l4962N0830K9544M2174j1189q161p6916k6712J2615l370k2499
19698E4739m3798o5123k1113J19922O8042l9295j9910j8512J11886k042k1893
19687A22903M1826O2479L4820Q44N5629j08057j16918M6161J10935j7851n0483
19676A82288o2837J3933k7934J9074L4702p32n4767J7769K8798J7092N377R791
19664A82554P892j03977m6812m3869O616O3753j7408j21l6611L2745j808L42O2866
19651A06162O5527j6290l3064J5492n9789j5810P6144L6037n41n8848K5579p3
$$ y = [196665, 180548, 233118, 266499, 253264, 294306, 196205, 169342, 193222, 156231, 147526, 158167, 179238, 244878, 186370, 177518, 192220, 185862, 176113, 222540, 167337, 153735, 144572, 216517, 195014, 103385, 68423, 119253, 148797, 190971, 179782, 171621, 94705, 67993, 80608, 77238, 54739, 10941, -54182, -75295, 44627, 112669, 73374, 53464, 34952, 146838, 144796, 122903, 164729, 227208, 262028, 262872, 318501, 210444, 93526, 139687, 250622, 232771, 182288, 119451, 133384, 105450, 124524, 159226, 158494, 103727, 121496, 150294, 167386, 172763, 182554, 190446, 86469, 39657, -4212, 2404, 66157, 48749, 48628, 12017, 44762, 42954, 43296, 106162, 171689, 155399, 122335, 137827, 78038, 62228, 138372, 174409, 173868, 115020, 140599, 140526]
19639A40526p9352L310q370L3471j0687l681k8279K8614J7132r22o4929q139k7196
19626h502n0831k7046n3488M0854Q7484N9166j9586l389J02261O0348n9030k6003
19614A02238o0639k529o465N5854N9203N2633r3812r6372L165M0639o7157N3154
19602C9912R9522N13l4965j5475k3894j8367L2565K2990k4423M079j8669j5679
19590D8109n2229P745j1094J16729Q6561l5233j5843j3086n2294j9965J1641R344
19578H0385o5121j6360l3603K6694J6478L1616M18Q405j579K471j7528N18l650
19565B9144q810k7957l7550J8736J4151K2927L5750J7261J8692k3497j8152K4719
19553F5414O4271R355J0414j8360j20096j08958N635L3653Q0272n1063p8842L62
$$ y = [140526, 61174, 64484, 56114, 89585, 78898, 75217, 46938, 75552, 92684, 91762, 26833, 18694, -8502, -59333, -86379, -139867, -99013, -11529, 47637, 28051, 24662, 126923, 187271, 128241, 102238, 41599, 39070, 32605, 88459, 147662, 200295, 106483, 10111, 13276, 53915, -13242, 39912, 139434, 139947, 104982, 89507, 65613, 47246, 79811, 102801, 78378, 82457, 63788, 48109, -4120, 3625, -7469, 109260, 195821, 160588, 144745, 131659, 79365, 59400, 71041, 80385, 15264, -1096, -34699, -8005, 8473, 40089, 40507, 48912, 47333, 49804, 32276, 32794, 29144, 20334, -7623, -45173, -26437, -12286, 10641, 46391, 63652, 82344, 58847, 40695, 65414, 129685, 139040, 149454, 131094, 10998, -97960, -92325, -58672, 21600, -29463, -108305, -107943]
19541a07943M4600O6470L7481M5028m174r6171q06L3886R9163N3871L1856N7371
19529B60632m9718n5777n5132p9663k9916l8105J03978Q3805l1084k6149k1558
19518F1313j0231K398K7965k8956m6232J9220Q2038M9465L6379k089m8311M930
19506A47889j7184m4111l8168J0007K6610l2615p6605k2715M275q2070N6939J33396
19494F5648J1169p7245j3460J0786p194L8330j8675N4046K1904K4731K0314q3979
19482D6375n7568L1707O8457K9279k4258L4691L0908L811k0835q961q322j6965
19470A08319n2296M6509L0671j7049L655r02J3073j3366J3161j2496L2614N2490
19458B04383l1340p7197j40439K5427M5943K5590P7589m9764J8424N6417j9320
$$ y = [-107943, -63343, 3127, 40608, 85636, 81462, -14709, -15515, 18371, 117534, 171405, 203261, 260632, 210914, 155137, 100005, 20342, -9574, -47679, 56299, 140104, 109020, 82871, 61313, 51082, 53480, 81445, 52489, 6257, 25477, 107515, 156980, 193359, 191270, 142959, 147889, 130705, 86594, 48426, 58433, 85043, 52428, -24177, -46892, -42617, -124687, -67748, 65648, 76817, -428, -13888, -3102, -10296, 28034, 9359, 63405, 85309, 110040, 130354, 46375, -11193, 20514, 88971, 118250, 93992, 128683, 159591, 163402, 142567, 133606, 125284, 108319, 56023, 102532, 133203, 116154, 119809, 118907, 131980, 118614, 131775, 119279, 151893, 204383, 173043, 95846, -44593, -19166, 26777, 52367, 129956, 80192, 98616, 155033, 135713]
19447A35713l1008n3058L4375m9314N515L44L4927k4883l9259L2366J5334M7597
19435A08649k8736m4022L0183k9295n6862k6212J7420N9920L1903L961N286J615
19423G3810l9603J7463j629k6100J8336M446j1729j0627L5073L6451n1800m5472
19411a381J9264m3966O1670K5070O2459P391O6726J52n9003l4193m0306l2960
19399C0923J0738o8577M0928L1515N3686O9068O41j07328k0269j3484L532m0090
19387h717l2414P1713o1307p4156N8363P5356O7180J7589k9118k4579L2391K2565
19375A14866J8373N2913l8212l9025n8274r5776M034M8690M9572m5316O8902j7457
19363F3290J68Q8981N6763m9941q8381l8473k4153j0126J3788J0991M5336P020
$$ y = [135713, 104705, 51647, 86022, 36708, 42223, 42567, 77494, 52611, 13352, 45718, 61052, 108649, 79913, 35891, 66074, 36779, -20083, -46295, -28875, 31045, 62948, 66909, 72195, 73810, 34207, 51670, 50041, 23941, 42277, 46723, 34994, 24367, 59440, 95891, 44091, -1381, 17883, -26083, 35587, 60657, 123116, 130507, 197233, 197385, 138382, 104189, 63883, 30923, 41661, -26916, 14012, 45527, 99213, 168281, 168922, 61594, 41325, 27841, 31373, -8717, -41131, 30582, -30725, -104881, -46518, 28838, 96018, 113607, 84489, 59910, 92301, 114866, 133239, 186152, 147940, 108915, 50641, -45135, -41101, 7589, 57161, 11845, 80747, 63290, 63458, 152439, 209202, 159261, 70880, 32407, 8254, -1872, 11916, 22907, 68243, 75263]
19351G5263N2835Q354n0543l9680p0302r003N6867K4433k6228k4560J0281N1082
19339E8799J1118L2108j1838p1562L8744J9996M7911l0322k1495N396J3498M9500
19327A41853n9077j8725L4990J0422L0891m9571M438N8986L6573r775J9470l1194
19315A69281o3869r4397p3149N5318Q2450L1993J11950j4027q1585r9085l5223
19304a0343L8369J9665m6345k1150m8553n2737j8886N0791J05085K6545j7477
19293B4964k7931j3094L0563j7775j3634k6003l1025m6749n0492o072j150M1305
19281a37093P489N4123M5611N7408O8953L3110q4129o1519K594l152O7819J9116
19269G0330O117q9070m2534J0107k5342J5546O7461l349l7714l841O8675j1112
$$ y = [75263, 128098, 136452, 85909, 46229, -24073, -33076, 23791, 48224, 21996, -2564, 7717, 58799, 69917, 102025, 90187, 18625, 57369, 77365, 125276, 94954, 73459, 78855, 92353, 141853, 82776, 64051, 99041, 109463, 140354, 90783, 95221, 154207, 190780, 181005, 200475, 169281, 105412, 11015, -62134, -6816, 75634, 107627, 219577, 205550, 123965, 24880, -10343, 28026, 47691, 1346, -19804, -68357, -121094, -139980, -89189, 15896, 42441, 24964, -2967, -16061, 14502, -3273, -16907, -42910, -73935, -120684, -171176, -177248, -178398, -137093, -129604, -75481, -29870, 27538, 96491, 129601, 45472, -16047, -13453, -16605, 51214, 70330, 76447, -12623, -55157, -45050, -70392, -54846, 12615, 9266, -28448, -32289, 36386, 25274]
19257B5274p7583l1111M8584R4895n277M8192p0105o9809L5351L2127N4627l3858
19245E1307n1532l3282M471k0303O8701N3000L7809J8884l8348q5746j08589n6426
19233a60054O302M0444M8790R0995M9526M8565l4062p5780o1042L6710m0626L2265
19221a7967L4476n3439L0417L548r443M0231k0136n299j5254J4300l4126M9655
19209A6963M0130K3516K4365n0328m1671r070M2060K1425N0602l8501m9205j322
19197B8964J37l8686N8988M7489p7131J1292L565l4706n1234M685J7292l8334
19185f7679j04999M5018O2131J52521J16836K2831j16665q6689p107P856l4541
19174a0487p0692J3032P8613L0923o6173O069P3562K5011k9742n3316r4940l1260
$$ y = [25274, -52309, -83420, -34836, 60059, 54782, 102974, 32869, -36940, -1589, 30538, 85165, 51307, -225, -33507, -29036, -49339, 19362, 72362, 110171, 129055, 90707, 4961, -103628, -160054, -153752, -113308, -64518, 26477, 76003, 124568, 90506, 14726, -46316, -9606, -50232, -17967, 16509, -36930, -6513, -2965, -12408, 27823, 7687, 2388, -12866, 1434, -32692, 16963, 57093, 80609, 104974, 54646, 12975, 3905, 45965, 67390, 117992, 79491, 30286, 28964, 29101, -9585, 49403, 96892, 19761, 31053, 34618, -88, -51322, -46637, -29345, -67679, -172678, -127660, -65529, 86992, 203828, 226659, 109994, 23305, 16198, 24054, -10487, -81179, -68147, 10466, 41389, -24784, -18715, 54847, 79858, 50116, -3200, -98140, -129400]
19162a29400M3300L3621P0032Q0662K7614m6238m3981M1065l9938o6372K8877
19151g58m581l2342M9221j7472Q0649L0663m4082m3362K4052l157m9502p390J4286
19138c775k3461o5079N038p9186L8348O4360M4405k9761r5318L3311M7178J0456
19126e3484M0044k2130o0998M4462M2941J7297K166j10577r406N2008M8394N2402
19114D3119k2034K7184N9635r2405n5991R561J0762M8835L6633J7608o478k7004
19102D9425o3313J6243l2374m6795J1774L7322O4159l2253J2920r931P199J2579
19090B6955K9772J0961l4893j8862O1873K9056r0014j60180n9983P588Q5623J07146
19078d958O2332l3186P833o7791j7354k1382j9401l0902J7106l6380k0371M3727
$$ y = [-129400, -86100, -52479, 17553, 98215, 125829, 79591, 35610, 76675, 36737, -29635, -758, -5339, -37681, 11540, -5932, 74717, 105380, 61298, 17936, 41988, 38831, -10671, -18061, -3775, -27236, -92315, -87277, -166463, -128115, -63755, -19350, -49111, -144429, -111118, -63940, -53484, -13440, -35570, -96568, -52106, -9165, 8132, 10298, -100279, -109685, -57677, -9283, 43119, 21085, 48269, 107904, 15499, -40492, -30931, -20169, 28666, 65299, 82907, 76429, 49425, -13888, 2355, -30019, -76814, -65040, -27718, 36441, 4188, 17108, 7177, 14376, 26955, 56727, 67688, 32795, 13933, 75806, 104862, 14848, -145332, -205315, -197727, -112104, -4958, 57374, 24188, 32021, -35770, -53124, -74506, -93907, -124809, -107703, -144083, -164454, -120727]
19066a20727N8200n8527p982n785M0873J05723N9363J7042l3726N504m1239o8285
19054d9566Q6237M3937K1749k6081p8801o8257k2082N3938m741O132m0313P2497
19042e351M1072k1913p2064K3704l9108P4946M9520Q9p8194p808r4889N02J21858
19029g636J19969m7707j68248L4828J9795o3425k8089N4417k8940o3968Q8037
19018i0967K1495l7757K1438k9551o537K5118K0081k4790M249m5798K7798K3111
19006i2110j2789N881m2482k9573R0051J34906J00888j9304j24741p4545k4808
18995h8626R418M9352J9767K8520p2245J0445L5729l9354j0351L0004m0638J0643
18983e7336P9012k1813l9248O067j8497m7080J280j054k399J4152L2794K3460
$$ y = [-120727, -62527, -121054, -129036, -134821, -93948, 11775, 71138, 88180, 54454, 59958, 18719, -49566, 36671, 80608, 102357, 76276, -2525, -70782, -92864, -38926, -43667, -37535, -77848, -5351, 35721, 13808, -58256, -34552, -73660, 1286, 50806, 50895, -27299, -35107, -129996, -129494, -7636, 112333, 64626, -103622, -68794, -48999, -112424, -140513, -86096, -115036, -179004, -90967, -69472, -107229, -85791, -115342, -121879, -96761, -76680, -101470, -97221, -143019, -115221, -92110, -104899, -99018, -141500, -171073, -81022, 53884, 154772, 135468, 10727, -63818, -88626, -79208, -29856, -10089, 18431, -53814, -43369, -7640, -46994, -57345, -27341, -67979, -57336, 21676, -137, -39385, -33318, -51815, -98895, -97615, -98669, -101068, -86916, -54122, -30662]
18971c0662Q747L0227N6134o2869k7462k3323j4314q8035O439P18O8456m4611
18959a20555O6256P0506P8841o3204j36569K543J6517L2818R4025n8974j4222
18948c2018K2884l6333q4535M487Q4778Q1695k7933k9941J0856m1790M4909N2205
18936D9264n5322o1532o0653Q3935M4157j0433n919J1426p645l9666O035P8007
18924C1654L9685q272n7681n3764k2006J2045j6578m4907Q1650J48806p669n8213
18912D4750l8121P0159J5532K8766n0989q6238n3025j4496J9383j671M1820l3116
18900e7246l2364J1289L3836J0742K2962k4675j044m0538o1619K5304M3455O3170
18888f728n0270k0734J8159K7905m7014K9562M9222K199q384P9354m8769K4780
$$ y = [-30662, -21915, 8312, 64446, 1577, -25885, -49208, -63522, -151557, -145118, -144400, -75944, -120555, -54299, 16207, 95048, 31844, -104725, -102182, -85665, -52847, 41178, -17796, -32018, -9134, -45467, -130002, -125515, -40737, 40958, 13025, -16916, -6060, -47850, -2941, 49264, -6058, -67590, -128243, -44308, -151, -10584, -16503, -5077, -12722, -52388, -46353, 31654, 71339, 63067, 5386, -48378, -70384, -58339, -74917, -119824, -38174, 110632, 102963, 44750, 6629, 76788, 92320, 121086, 70097, -16141, -69166, -83662, -64279, -65950, -24130, -57246, -89610, -78321, -44485, -33743, -10781, -35456, -36500, -77038, -138657, -113353, -69898, -6728, -56998, -77732, -59573, -31668, -78682, -49120, 102, 2301, -6083, 73271, 24502, 49282]
18876D9282k712L749k8008j8121j05164j7230j6671R534O6635R5613j0157n7650
18864c0900m7041q796J1151j0648o912Q6433M228k769l8257p0665L2565P6679
18852d932O871n5522K1519l0574O6357P6965n5351l3138J09195O7100K0566k5744
18840A63312n8773j3794o1466q7232J010j3872k2887P587J20795J0723o8927L62
18828b3162Q564j5522n183J5351n4963j6355q956n0936P4988M5298P843k3281
18816d6314p324r755r404P2585P034J9497o0535J7763R492R073m5069q1201J4938
18803a09220N1282N4453k7396o934J3859j3814n0842L1471J16961k1267o7891
18792b9338k309K833O5273k4915j16825l0128K6048K2949N4554n8715j7782K2832
$$ y = [49282, 46570, 50319, 22311, 4190, -100974, -118204, -134875, -125341, -58706, 36907, 26750, -30900, -77941, -86737, -75586, -86234, -93146, -6713, -2485, -5254, -43511, -114176, -81611, -4932, 1939, -53583, -32064, -62638, 3719, 80684, 25333, -7805, 101390, 168490, 189056, 163312, 104539, 90745, 29279, -57953, -56943, -70815, -93702, -86115, 34680, 45403, -23524, -23162, -14598, -30120, -35303, -19952, -74915, -91270, -100226, -151162, -76174, -30876, -23033, -46314, -53638, -63393, -72797, -212, 6822, 26319, -34216, -16453, -6961, 2112, -42957, -124158, -109220, -57938, -3485, -30881, -37815, -23956, -37770, -88612, -57141, 59820, 38553, -29338, -31647, -28814, 36459, 11544, -105281, -135409, -109361, -86412, -31858, -90573, -108355, -85523]
18780h5523n4679j4011K0973j7967J9885J1870j217L172J8289M259m0387q4030
18768b19366J7216J30080P4875L7821K666l2771j3590L7845J02403n4312p8206
18757D661L742m3082k8509N7857K1832l5890l9992N5090n0804j32300n3126O942
18745b33579J3257N9753O2931P966J5825L2386k5101k7583J3060j3868Q0240k9343
18733d4056j6386M3796k9136r0378o2394J6819J478M681N5312M2174P5393O804
18721D107l9653M661j4091K584J79j8729j1998L9740j3988p71o221J7764P425
18708b8991o6624M540J9992p9855J7359J13403l2851j3748N7380j0668m5141o2528
18696a27732L88L5765J9417O1740O4967J6858j14241q5877L036M1142M0691r141
$$ y = [-85523, -140202, -154213, -133240, -151207, -131322, -119452, -120669, -117497, -99208, -94949, -135336, -219366, -202150, -72070, 2805, 40626, 43292, 10521, -3069, 34776, 137179, 82867, 4661, 8403, -34679, -63188, -5331, 16501, -19389, -59381, -4291, -55095, -187395, -240521, -233579, -220322, -160569, -97638, -89672, -73847, -41461, -66562, -94145, -81085, -94953, -14713, -44056, -60442, -16646, -45782, -136160, -198554, -181735, -180257, -175576, -120264, -78090, -2697, 4107, -35546, -30885, -44976, -42392, -42213, -60942, -72940, -33200, -47188, -47959, -54180, -36416, -28991, -95615, -91075, -71083, -150938, -133579, -20176, -53027, -66775, -9395, -20063, -65204, -127732, -127344, -91579, -72162, -10422, 54545, 71403, -42838, -128715, -125679, -84537, -43846, -52987]
18684e2987P5679o1278o4788O9207n5254j03640K9673J27155K6555m7602K6601
18673c0679J43768j3698j16910o2979j6210J3534J3672l6577L9419K6471L0688
18662i501q328o2931J2787q80n1602o1555j5152q017K2553N9727Q3174J124k5543
18649f4144l8905L4900Q518q044M0987j5751l0669M9501j703l8642l5953l0490
18637a30395O7553J8769l5491J017j7348J8206k6885J2880P0599O7813j3242J2858
18625D6334o479k5881l412k778o6409m061m719r2007o0792R4488M8340o942M7569
18612c6749l255l1070Q303N5359l1995K0936k6745j8033J9005O1209n290o8367
18600e6692l5073j0458K7639L3571Q033j0578o635o7641n7979J462L3724O1574
$$ y = [-52987, 22692, -38586, -103374, -34167, -89421, -193061, -163388, -36233, -9678, -57280, -30679, 113089, 99391, -17519, -80498, -96708, -83174, -69502, -106079, -66660, -40189, -9501, -17829, -80760, -67973, -68853, -120455, -182010, -197162, -205179, -182626, -122899, -39725, -38601, -64144, -103049, -68149, -59631, -67675, -26688, -42439, -73108, -23607, -25310, -63952, -99905, -130395, -62842, -44073, -79564, -78547, -95895, -77689, -104574, -91694, -21095, 46718, 33476, 46334, 39855, 13974, 10562, 7784, -58625, -62686, -67405, -159412, -220204, -125716, -77376, -84318, -36749, -40004, -71074, -62771, -7412, -39407, -18471, -45216, -63249, -44244, 16965, 11675, -56692, -91765, -102223, -74584, -41013, -32980, -43558, -50193, -117834, -175813, -174351, -140627, -79053]
18588g9053j2064j8562O8586l4946L6557L1987j207N0994L8944K0947J2120K212
18576A16515k4878n0783J1562M6064J7603l1246l3938j1065j1967P0695O1001
18565A59563P705k3932N2028N5089l1328K723m7754J65890Q6043Q2350Q9432K8450
18553F26259L1427J35336J07282R9525J14297N1148j7939M1173n7718k0328N4328
18542A164790J8832j06457j03106q0344p0009r0410r0846q4263q1582q3950l4318
18531C58337N7623K3827j7899n5254r7888o9955R241J5822L4029j2296q509o373
18519B30705n0493n5953J6182o8200j2261R782n922L5442k2313l7259j4868p500
18507A7342j8703j3425l0630L4813J2606o556k2965m6456k2130K9449L3524M6262
$$ y = [-79053, -91117, -109679, -41093, -76039, -39482, -7495, -8702, 42292, 81236, 102183, 114303, 116515, 91637, 40854, 52416, 98480, 116083, 84837, 50899, 39834, 27867, 98562, 159563, 167268, 143336, 195364, 250453, 219125, 221848, 174094, 339984, 426027, 508377, 597809, 626259, 657686, 793022, 900304, 999829, 1114126, 1165274, 1147335, 1188508, 1130790, 1110462, 1164790, 1183622, 1077165, 974059, 893715, 823706, 733296, 642450, 558187, 476605, 392655, 358337, 415960, 439787, 421888, 366634, 268746, 198791, 208032, 223854, 257883, 245587, 237078, 230705, 180212, 124259, 140441, 72241, 59980, 69762, 63840, 99282, 76969, 39710, 24842, 17342, -1361, -14786, -45416, -10603, 2003, -4553, -27518, -73974, -96104, -66655, -33131, 13131]
18495A3131o6107r2877J8386N1055k2983J3166o6732N6243Q1122N8573o747k6218
18483A0012Q406m8482k7279k3499j4665M9040L3265P4717J9793n7981m5860l5713
18471e8246N6530j0424Q739l5506r7701q3332J5012J7451M1095N7228O4135l4200
18459e9219K3488L3433p541m0049l2042J271J0723J506j2130o2233L8843P8038
18447b5912m276l3836N790L702o7573q1172O6636K6162K1891L1533j5344Q310
18435f4089P171j6874K0332L7607m609m3644j902p5970p6046r2953N4413K4615
18423b31949L8565L9251L1380L8307P5269K029j7970l8406q4563q8139R4834N8285
18411h3107K1080k8160n2208M2759L5510l1866O6671Q2533O1208o5213j8548m5256
$$ y = [13131, -52976, -145853, -127467, -76412, -99395, -86229, -152961, -96718, -15596, 42977, 36230, 10012, 18418, -30064, -57343, -80842, -95507, -46467, -13202, 61515, 81308, 23327, -22533, -58246, -1716, -12140, -3401, -38907, -136608, -219940, -204928, -187477, -146382, -89154, -25019, -59219, -35731, -2298, -9839, -49888, -81930, -80659, -69936, -68430, -80560, -142793, -103950, -25912, -30188, -64024, -58234, -54532, -122105, -203277, -136641, -110479, -88588, -57055, -72399, -64089, -56918, -73792, -53460, -15853, -20462, -64106, -66008, -141978, -218024, -310977, -256564, -231949, -193384, -154133, -122753, -84446, -9177, -7148, -25118, -63524, -148087, -236226, -141392, -83107, -62027, -90187, -142395, -99636, -64126, -95992, -29321, 53212, 114420, 49207, 30659, -14597]
18399a4597p5834N0586N4517q117o219j7785L797k1805k2896l2799k5226l4635
18387a51013l206N5704m8330N8649M758o6709r526l4213L9844M3629K2714m9972
18375a37671K9823J0433n2034l2433P583J6402K8533L8674M073P1035Q2960m0386
18363B6992k9313n3377O829J4539K4528r8707j8395J7888k4420m5284P9128p96
18351a00388l3574N5432L432O3482J7553j2472j1777m5748N3797R6724L7816m4011
18339H0266m681L23m2974m1949k8557j16483m1973M9228J5176J9511L737M0888
18327f7488N9021J0859M8175O817j18993k5853m3150j7813L4690L4994J6348M9716
18315a2677n7972N936m5199L8804M8507j7067J5822o9253R562J4199m5693K4816
$$ y = [-14597, -90431, -39845, 14672, 6555, 336, -17449, -13652, -35457, -58353, -91152, -116378, -151013, -154219, -98515, -146845, -88196, -83438, -150147, -159673, -193886, -154042, -110413, -87699, -137671, -107848, -97415, -149449, -181882, -174299, -157897, -129364, -90690, -86617, -15582, 67378, 26992, -2321, -55698, -48869, -34330, -9802, -108509, -126904, -109016, -133436, -178720, -99592, -100388, -133962, -78530, -75098, -11616, 5937, -6535, -18312, -64060, -10263, 86461, 124277, 80266, 75585, 75908, 32934, -9015, -37572, -154055, -196028, -146800, -131624, -112113, -108376, -67488, -8467, 2392, 50567, 57384, -61609, -87462, -130612, -148425, -113735, -78741, -62393, -12677, -70649, -64713, -109912, -71108, -22601, -39668, -23846, -93099, -83537, -69338, -115031, -90215]
18303i0215M307Q3235L273m1262J021k4495o6256O1498P0060j0838M5716P6471
18291A12515j5977r1283l9104j4365m0689K1862o1517J4546J9308j0630M2245
18280f3089O2123j0162M6833L0177J5117M1342o9885n8416l8791k1058J0036L0717
18268b5056n390K2321M0682l8860J466K5436j4400M3310J6305j3360J8204L3779
18256A04437n181j7994J5852p0747L9300J0980R23m6245K0062K4901J1045P2620
18244A59953M6628o707k441o0429J6547N670J03064J69320J06353Q0973j012J28147
18232G46066J79916J5670L48N2043R2435J14890P9233R0540M7598m2884l0615
18221A345240r370o6820j24469j6691o2395j77011j49297p2329p1783q2807m5516
$$ y = [-90215, -85908, -2673, 600, -40662, -39641, -64136, -130392, -68894, 1166, -9672, 36044, 112515, 96538, 5255, -33849, -48214, -88903, -67041, -128558, -114012, -94704, -105334, -63089, -966, -11128, 35705, 65882, 80999, 122341, 52456, -5960, -44751, -65809, -55773, -25056, -30446, -8125, 32557, -6303, -4837, 20599, 6199, 49509, 65814, 52454, 70658, 104437, 99256, 81262, 97114, 26367, 65667, 76647, 77570, 31325, 51387, 76288, 87333, 159953, 206581, 199874, 197433, 137004, 153551, 159221, 262285, 431605, 537958, 618931, 617919, 746066, 925982, 941652, 942000, 994043, 1086478, 1201368, 1280601, 1371141, 1418739, 1375855, 1345240, 1335870, 1269050, 1144581, 1127890, 1065495, 888484, 739187, 666858, 595075, 512268, 466752]
18210D66752j49316n1270J8105n9082m4849k0997o1660l1047m1420j2177j900
18199A1139J053k9291O5391J31611K3965n7236j8639J150o9856p1176l5089K2347
18187b4631P3702l582N795K7094m8229m0091L2978M1023k3623j6062K619o6894
18175c9901m1420J6717n0676N0746R5790l3381q3635L0639O9934P7457K1171n5375
18163E8066r5985K6518J3494L5040r585k9994k6963l7367m3935O3678Q1920k9269
18151E618n1301n4309K086l638o466k3359l7892L9331j2399n4257Q6387J16475
18139F276p8335k2142J8811N1630O6076M386m648m2957n3961l8211j6549L672
18127a05952l6544M3215Q098k2815Q9693O9731p7290L586J1376k6771Q248l8819
$$ y = [466752, 317436, 266166, 284271, 225189, 180340, 159343, 97683, 66636, 25216, 13039, 11139, 12192, -17099, 48292, 179903, 203868, 146632, 127993, 129143, 59287, -11889, -46978, -24631, 49071, 45489, 51284, 78378, 30149, -9942, 23036, 64059, 40436, 24374, 26993, -39901, -81321, -64604, -115280, -64534, 31256, -2125, -85760, -55121, 14813, 92270, 113441, 58066, -37919, -11401, 2093, 37133, 27548, -2446, -29409, -66776, -110711, -47033, 34887, 5618, -45683, -99992, -97906, -101544, -108010, -131369, -169261, -129930, -142329, -196586, -110199, 6276, -72059, -94201, -75390, -23760, 42316, 46702, 42054, -903, -54864, -93075, -109624, -105952, -142496, -99281, -91183, -113998, -24305, 45426, -31864, -28278, -16902, -43673, -35425, -74244]
18115g4244J3162N0046k2755l906m0658J2354J2392j8977J1659m3988N7454N1352
18103C891L142n3588j9172J7355p3387K8615J2287M2129M7949L0158j1248j8977
18091I154n225o9650p560J09313n2801l7933m7746l5689j0407J2209l432k8826
18079a68593j8328P2065K2663o739n9154N4243K183j6111l844J8032k4623N1597
18067g6609L6604M6575m0874k6845L1388Q432m4267n5847N2176L4815K6612k7130
18055c4970r3431k5778M6279j02859l8825P6184L8153n398J0063j049K5006K8643
18043g7982o658J1081K9819N9093J1194k5274j9740r0599k7155K3871O092L5662
18031g0596N4536k8663m6759J1787M0121o4335l681N7295m1130q3099j6370K7243
$$ y = [-74244, -61082, -11036, -33791, -37697, -78355, -66001, -53609, -72586, -60927, -104915, -47461, 3891, 7033, -46555, -65727, -48372, -121759, -93144, -80857, -38728, 9221, 39379, 28131, 9154, 3929, -65721, -73281, 36032, -16769, -54702, -102448, -138137, -148544, -136335, -139767, -168593, -186921, -114856, -92193, -98932, -158086, -103843, -101660, -117771, -121615, -103583, -128206, -76609, -40005, 6570, -34304, -61149, -29761, -21329, -65596, -121443, -69267, -34452, -7840, -34970, -128401, -154179, -107900, -210759, -249584, -173400, -135247, -140645, -130582, -131631, -106625, -77982, -84640, -73559, -43740, 15353, 26547, 1273, -18467, -109066, -136221, -112350, -106258, -70596, -16060, -44723, -91482, -79695, -39574, -103909, -107590, -50295, -91425, -174524, -190894, -163651]
18019a63651M1725O5982P2592J0779J1415l9869l6128r288R2091L3329L0380q8738
18007B0619l2146J4577j8935L3887O04j6417l3238m7813l7607j1488M409P6445
17995d7103l324p612R153J1984L4067m5783O1069k6752p1843P976N3687K4036
17983d45L4675O8071n1435L726l5128k8064q3300m5887P6097Q8987j6666j2329
17971a698Q7397J6007n9466j3232l2008m1437j378O74L1357n6266n4058Q2469
17959d1639R0167l5246j6840K4967l9017k6700Q1553O1596p522q565j49504o5393
17947a32143L0330mR5986L8161l4071m029r204O678K4390l5819m535o260O3047
17934C2527J19471j4579q1690l118L1062p6233l4304M6544M7504M2109K9093J6315
$$ y = [-163651, -121926, -55944, 16648, 27427, 38842, -1027, -37155, -46443, 45648, 78977, 109357, 20619, -11527, 3050, -15885, 18002, 18606, 2189, -31049, -78862, -116469, -127957, -123548, -47103, -50427, -58039, -48886, -36902, -2835, -48618, 12451, -14301, -86144, -78168, -24481, -445, 34230, 102301, 50866, 54592, 19464, -8600, -91900, -137787, -61690, 27297, 10631, -1698, 85699, 101706, 42240, 29008, -3000, -44437, -45815, -45141, -13784, -70050, -124108, -41639, 48528, 13282, -3558, 21409, -17608, -44308, 37245, 98841, 91319, 82754, -66750, -132143, -101813, -101817, -5831, 32330, -1741, -5770, -14974, -8296, 16094, -19725, -24260, -30520, 32527, 151998, 137419, 55729, 52611, 83673, 7440, -26864, 19680, 67184, 109293, 138386, 154701]
17922A54701J5955j9185p5245J3498J65519J18691l3508j851K6662j5925J03714
17911D53026J26754Q9349P2970L6968P0269Q5610M2003R4871O2993M0377J65J615
17899A176970j2271n9267j9744l1027j20364j71731r4115J0874p8926m2922j04828
17888D52649k4884n228j8851J6203M349o8520k3304j22044j780M3917k0483R049
17876B41073m8481k4271k1635j07939n8769q427k9814l4172O131K697j5900k2096
17864a21603J4201L9513J4135k4k4358k97k13l0441k4616J8420O1923m7893M4757
17851e6496K9357k2283q8488j9356K3840K4623L3469p166L995m794K3080k1958
17839h2177l0483J0847k541o1735l5360l6645n0586l7403J485O5610J03519R020
$$ y = [154701, 170656, 151471, 76226, 89724, 255243, 373934, 340426, 338575, 365237, 349312, 453026, 579780, 669129, 742099, 779067, 849336, 934946, 976949, 1071820, 1134813, 1175190, 1175355, 1176970, 1164699, 1105432, 1085688, 1054661, 934297, 762566, 668451, 679325, 600399, 557477, 452649, 427765, 422537, 403686, 419889, 424238, 355718, 332414, 210370, 208590, 252507, 232024, 241073, 192592, 168321, 146686, 38747, -20022, -28449, -58263, -92435, -86304, -83607, -99507, -121603, -107402, -67889, -53754, -53778, -78136, -78433, -78646, -109087, -133703, -115283, -53360, -101253, -56496, -27139, -49422, -137910, -157266, -133426, -108803, -75334, -82500, -78505, -83299, -60219, -82177, -112660, -101813, -104354, -166089, -201449, -238094, -288680, -326083, -324598, -258988, -155469, -146449]
17827a46449r103N8116J0891m3314k236N6000M6308n0768K2434n8341O855K5966
17815h3641J8336L1914L5747j9165J861o4077q142N131j2564n8687O745l8151
17803a84693J6951K2918N4754O6902k0573l9803q1527j0511Q6220P5434J0461
17792c467K125J6488L4795m664P760n4861o6528J2231Q573K5725N9019j4651o3595
17779d1050m3153l1800J1367J3595J8203k6619O8537N0878o8275n7612J00996
17768d933m630j01995n0533l5463K8319K6184N6116R4660r941n9910L8828O3178
17756C9880l5453p7759K3603N5650K4072r6480K1972j2799o6785j807K8144J0003
17744h7759L869q133o8943L5093M7410M1481N574m7269j2435j0507k2616r7796
$$ y = [-146449, -155552, -97436, -86545, -129859, -132095, -76095, -29787, -80555, -58121, -116462, -109607, -83641, -65305, -33391, 2356, -16809, -14948, -79025, -87167, -82036, -94600, -153287, -146542, -184693, -167742, -144824, -90070, -23168, -43741, -83544, -165071, -175582, -89362, -13928, -3467, -1342, 15146, 49941, 45277, 53037, -1824, -68352, -56121, -47548, -21823, 37196, 22545, -41050, -84203, -116003, -104636, -91041, -72838, -99457, -30920, 19958, -48317, -105929, -4933, -9563, -111558, -162091, -197554, -169235, -143051, -86935, 7725, -2216, -62126, -23298, 39880, 4427, -73332, -49729, 5921, 29993, -66487, -44515, -57314, -124099, -125906, -97762, -87759, -83890, -92023, -160966, -125873, -78463, -36982, -31408, -78677, -91112, -101619, -124235, -222031]
17732b22031J0531k0994K2962J32784P1700P595j29021l2428N8042R945k7002
17721a17917L2088l2855l442K698l6264L3979k8697K0707L3939j5664j293Q2727
17709b9994m30r1325n0165N9324L3205J0332O375L1086k2565k0457Q419N5835
17697a0360M3415l4069o9917m884L3795o143j5896k4816J6240O8783J09L7166
17685C3423J3370k7391q8919L1854Q8442J3067n7091N7075M1273j13485p2592
17674h0974J2113Q0148J7754n7840m3506j2171j3139o5639j6687K5395J10000
17663d4546N7487k9066m1042M5896R326l5919k6625m553l7463n4654j0263O0878
17651a10544P4794j0444k9801L768l2404O4062K7905q990K5232j8151j30498l4593
$$ y = [-222031, -211500, -232494, -209532, -76748, -5048, 2547, -126474, -158902, -100860, -90915, -117917, -85829, -118684, -122126, -119428, -155692, -121713, -150410, -129703, -95764, -111428, -112721, -29994, -30424, -121749, -171914, -112590, -79385, -69053, -62678, -31592, -54157, -74614, -66195, -10360, 33055, -1014, -70931, -75815, -42020, -48163, -64059, -88875, -72635, -3852, -3743, 33423, 46793, 19402, -69517, -37663, 50779, 63846, 6755, 63830, 105103, -8382, -80974, -68861, 11287, 29041, -28799, -72305, -84476, -97615, -163254, -179941, -154546, -44546, 12941, -16125, -57167, -11271, -1945, -37864, -64489, -69042, -106505, -161159, -171422, -110544, -35750, -46194, -75995, -72227, -104631, -40569, -12664, -21654, 3578, -14573, -145071, -179664]
17639a79664K8957Q0616k5966j7616p784k888n519P709L6293N7121j3776L7861
17627d656L5516n7327q0968J6389O8070O318j5116q2158j1324N2729o2559o5144
17615b00230M1667K2706p082L6671j9299j8595n1417j2494k6773P4374J13514
17604d6958J9875j9808J2920m2555M630M7539L3661L69l1145m492p665l1189R9089
17591C4271J3780j25421j7075M1265L0761K9649o1129j9785J08383M2180n7573
17580A9306q2289m7747L3232p817o8065q444Q8756K0433n7583N0680N4589K9607
17568B4658L7479L8106o0174j01355j2933M9513O1726J0904p8516j6384n3693
17557a00669q6987j1065J627O3607l951j2741K2386J6855J1236k8615j874K5010
$$ y = [-179664, -150707, -70091, -96057, -113673, -121457, -124345, -129864, -122155, -85862, -28741, -42517, -4656, 30860, -26467, -107435, -91046, -22976, -16658, -31774, -113932, -125256, -72527, -135086, -200230, -158563, -135857, -142939, -106268, -125567, -144162, -195579, -208073, -234846, -160472, -46958, -27083, -46891, -33971, -76526, -71896, -24357, 9304, 9673, -21472, -25964, -33629, -64818, 34271, 48051, -77370, -94445, -53180, -22419, 7230, -53899, -73684, 34699, 76879, 19306, -62983, -110730, -77498, -85315, -153380, -161824, -73068, -52635, -110218, -59538, -4949, 24658, 62137, 100243, 40069, -61286, -74219, -24706, 37020, 47924, -30592, -46976, -100669, -187656, -198721, -197094, -133487, -137438, -150179, -127793, -110938, -99702, -128317, -130191, -105181]
17545a05181L7338q5386o2070K0480Q2170J187M0723K1034K1407k3209J1132l0240
17533g0615k0004m2577l2402M3402K9712j189Q672M4304j0013k4446K5979J6773
17521c2404N1315O1507o6814n9158K0536O1168q547P3843R970m7669K5757k7770
17509F1734n3758k4106J0216k2717m0640K7512R522k9645j5078L7544J971j9132
17497e6577p8639m8901P7111Q5650K2165M1257K2367J4304j1122j0586l8758J5355
17485C3626L1933L4930n9300r4466O0064P0771l7820j54507l7621M2904J0329
17474i9157J370R1029M8755j9289m4962j1752n2742J3342n310Q809n8856j8027
17462a46790L9708Q3476K8271j0436m8918Q166N6231J3788N0438L5665o8671m4654
$$ y = [-105181, -67843, -153229, -215299, -194819, -112649, -111462, -70739, -49705, -28298, -51507, -40375, -70615, -90619, -133196, -165598, -122196, -92484, -93673, -85001, -40697, -50710, -75156, -49177, -32404, 18911, 80418, 13604, -45554, -25018, 36150, 27603, 101446, 111416, 63747, 89504, 61734, 7976, -16130, -5914, -28631, -69271, -41759, -32237, -61882, -76960, -39416, -37445, -56577, -135216, -184117, -107006, -21356, 809, 42066, 64433, 78737, 67615, 57029, 18271, 33626, 65559, 100489, 41189, -53277, 6787, 77558, 39738, -114769, -152390, -109486, -99157, -97787, -6758, 41997, 22708, -22254, -34006, -86748, -73406, -78716, -69907, -128763, -146790, -107082, -23606, 4665, -5771, -54689, -46523, 9708, 23496, 73934, 109599, 40928, -3726]
17450c726m9854p4373J0038Q0006L1685k0046q6906n8775O2958J08746k1078J9017
17438b308K0375J440L3715p7731j33804o837J7799j294J10118J32251L9351r8576
17426C4499q5365l519j5407o3045j9617k1507k102L5593O4520Q71q614P933L259
17413g2501p0662m653K6935J7868M5162K6427m4797n3611P5495J4804o3302o2682
17401a65517J9871R4473L9349n3290l786L1729r827j6661k8427j0034l4854K3928
17389a13046J6380l624k486j5826j9707M2404Q0168Q666J6674k2479L4492l7155
17377a5539K4631n9898L3245L8521m865K3631k5463m0633R850l5018j7027N2616
17365a5949Q950k7031k2060J09010Q8484n0115n9935n8844k6657J623O495k5539
$$ y = [-3726, -53580, -127953, -117915, -37909, -6224, -26270, -113176, -171951, -108993, -247, -21325, -2308, 18067, 19507, 53222, -24509, -158313, -165150, -147351, -148645, -38527, 93724, 133075, 34499, -50866, -54385, -69792, -132837, -152454, -173961, -176063, -140470, -75950, -75079, -83693, -75760, -72501, -143163, -147816, -120881, -103013, -57851, -31424, -76221, -129832, -54337, -39533, -102835, -165517, -145646, -51173, -11824, -65114, -68900, -37171, -46998, -63659, -92086, -102120, -136974, -113046, -96666, -100290, -102776, -118602, -138309, -95905, -15737, -7071, 9603, -12876, 21616, -15539, 9092, -50806, -17561, 20960, 16095, 39726, 14263, -26370, -16520, -51538, -68565, -15949, -6999, -34030, -56090, 52920, 141404, 91289, 31354, -27490, -54147, -52524, -46029, -71568]
17353g1568L3775Q810r142j5408K579L9698J1832J6025K5095m425l98j1305q6368
17340f0800j2855J29448Q0957m1409o7733o6132J2747O7740M4125K5699o4691
17329D7096n7757k7485j4929K0135l1212Q279J8897L5161J0277k3573O446k0061
17317b8726M3352J4334r5498p1299r50r108N0279J14613M8272k6767l0027j8486
17305a0011N3229k969K0299K9891J3731Q543K9839j2924k5345P83N9054N9965
17293B24085n7017k1159m5190j27103K3776N842m4223k4801N6576O9071k7091
17282C2766m1098P3774M074n4004l2157o810J2108M5359J6037M7915J0926p000
17270A01890k6593l2527j9800q3785l1049L2420Q7630J0645j7060M3659K970j8803
$$ y = [-71568, -37793, -28983, -38125, -53533, -50954, -11256, 576, 16601, 41696, 37271, 36873, 25568, -60800, -73655, 55793, 136750, 95341, 27608, -38524, -25777, 41963, 86088, 111787, 47096, -10661, -38146, -53075, -32940, -64152, -55873, -36976, -1815, 8462, -15111, -8665, -28726, 14626, 28960, -66538, -137837, -138787, -147895, -97616, 16997, 65269, 38502, 8475, -10011, 43218, 40249, 60548, 90439, 104170, 112713, 142552, 129628, 104283, 105066, 164120, 224085, 167068, 145909, 100719, -26384, -2608, 3234, -40989, -65790, -9214, 59857, 32766, -8332, 65442, 69516, 15512, -16645, -23455, -11347, 34012, 50049, 97964, 108890, 101890, 75297, 42770, 22970, -60815, -91864, -59444, 28186, 38831, 21771, 65430, 68400, 49597]
17258D9597k0044j2415m1871Q653K704P1172M0472k6258K029l4855p6820M0797
17246C161P5210K7038r67K9924P730p2412j6147L0973m2051j9309r795L548N3895
17233G0798l0100p0753J8849J8289L5562M9839m9798p5875p868L6657L7831O3533
17221I6964O8532j3415r9451k8635L4341K8841J0126j7298L2923K1781n756r8801
17209C0152j4652J10149M6170O172p7197R266l4803K0486m454J0671l8216J5315
17197G9059J0176O8810J8887l4791k8534j7396j6579R828o5106j822o482O3987
17185H0037q8539k6717O1845J1226J8446N627L7687J7295p4194l0102K5473K6172
17173F4256J2165J5402r291p9647O666Q430L815L3608P1318m9965O729J01401
$$ y = [49597, 29553, 17138, -24733, -16080, -13376, 57796, 98268, 72010, 74039, 39184, -37636, 3161, 78371, 105409, 104442, 134366, 142096, 69684, 53537, 84510, 42459, 23150, 13355, 16903, 70798, 40698, -30055, -11206, 7083, 42645, 92484, 42686, -33189, -41057, -4400, 33431, 96964, 165496, 152081, 52630, 23995, 58336, 87177, 97303, 80005, 112928, 134709, 128953, 30152, 15500, 125649, 171819, 177991, 100794, 110060, 75257, 95743, 91289, 101960, 63744, 79059, 89235, 158045, 176932, 142141, 113607, 96211, 79632, 89460, 24354, 22532, 16050, 80037, -8502, -35219, 26626, 37852, 56298, 61925, 99612, 116907, 42713, 12611, 38084, 64256, 76421, 91823, 82532, 2885, 9551, 17981, 21796, 55404, 126722, 76757, 83486, 184887]
17161A84887K3789o9514n5830j9238n5513N7322L609j1415L8694l729m2391K5117
17149G5788J9760P1806L6475n7914o3071k4257m866j4730l8018L0917l340k6991
17137A559P002K7218n2508j08093Q824r432K7667P1797K7802j1285L7143k835
17125B4859k3783L388M95K6456J1284P3413n0875j7159N8406O1222L3248O3078
17113B64032R4467k8741j12178o0536K7481M5869N1421K7953m1155q460M3120
17102C03273N4335p6393j422P7918M0362n2430k3420M3881N1236l0833r3729p0649
17090B22129N2355M6071P910O7147Q1772R745K5113J06118O8037l342j2394Q9202
17078G59863J40059J18665J4018K5347Q1276M8838k4287L8363O5463O0802P7776
$$ y = [184887, 208676, 139162, 83332, 64094, 8581, 65903, 69512, 58097, 96791, 93062, 50671, 75788, 95548, 167354, 203829, 145915, 82844, 58587, 53721, 38991, 973, 31890, 28550, 1559, 8561, 35779, -16729, -124822, -115998, -125430, -97763, -25966, 1836, -9449, 27694, 24859, 1076, 4464, 4959, 31415, 42699, 116112, 65237, 48078, 106484, 167706, 200954, 264032, 358499, 329758, 217580, 157044, 184525, 230394, 281815, 309768, 268613, 260153, 303273, 357608, 281215, 279793, 357711, 398073, 345643, 322223, 366104, 417340, 386507, 292778, 222129, 274484, 320555, 328465, 395612, 477384, 487129, 512242, 618360, 686397, 683055, 670661, 759863, 899922, 1018587, 1032605, 1057952, 1139228, 1188066, 1163779, 1202142, 1267605, 1328407, 1406183]
17067A406183J08547J50461R5019K8592J1014R8592M4426j9591m6817q0924n6681
17056A738821M6641m3048n7569o2600j2422Q0319r9584q7867l8205j11019q5540
17045A267927j59784j41985k3158P92l2369o3182o3425R844k8474p6692k4334
17034F65160M5345L0737O9458M7306J4799j2072J8621O1946j1064K4944N5925
17023A011105Q9199J13505J67435R7279J27962K88677K46909K15153K91223L39732
17013B988179K81632Q9695j40672j61983k65740l03810k31825j36846j31469j05167
17003A881994j02869n6933m5899M0792M8937j1540q948N543r0663j7111O770K7887
16991A677960O9755R3865N5552K4574J6577j553O3348J24495J36008R4126J28984
$$ y = [1406183, 1514730, 1665191, 1760210, 1788802, 1799816, 1898408, 1942834, 1923243, 1876426, 1795502, 1738821, 1785462, 1742414, 1684845, 1622245, 1609823, 1690142, 1590558, 1502691, 1464486, 1353467, 1267927, 1108143, 966158, 943000, 943792, 911423, 848241, 784816, 794660, 766186, 689494, 665160, 710505, 741242, 810700, 858006, 872805, 860733, 879354, 941300, 930236, 955180, 1011105, 1100304, 1213809, 1381244, 1478523, 1606485, 1895162, 2142071, 2357224, 2648447, 2988179, 3269811, 3359506, 3218834, 3056851, 2791111, 2487301, 2255476, 2118630, 1987161, 1881994, 1779125, 1722192, 1676293, 1717085, 1766022, 1754482, 1745534, 1751077, 1660414, 1643303, 1650073, 1677960, 1747715, 1841580, 1897132, 1921706, 1938283, 1936730, 2000078, 2124573, 2260581, 2354707, 2483691]
16980B483691J57762J40632J07262R3107N7035R6365J61574J60024q56J7304J2005
16969C485905n2267j44539k10676j98304r9867q6905j43325j54500j05170j65082
16959B125270j86709p0899r4590j27208j10176j35141r8816j67583j32313j60494
16949H41341j83715p3673j2167K3835K6234n6271k5662J2696J945o7677M75K8090
16937E15451q9293K5384P6522n5391n2223k913J959K9346M6621m5316n688O587
16925D51046l7350j6692l0804k5183l0269K1991O0204K2108o8762m1082p5461
16914B29746J2058R9581P7132K0134o0568q1085l6038J1183L3489k7416k2940
16903B55276J4901Q063L3559K5023o998O1787Q413m3942l8366N4955O0462l6939
$$ y = [2483691, 2641453, 2782085, 2889347, 2982454, 3039489, 3135854, 3297428, 3457452, 3456596, 3473900, 3485905, 3433638, 3289099, 3078423, 2880119, 2780252, 2693347, 2550022, 2395522, 2290352, 2125270, 1938561, 1867662, 1773072, 1645864, 1535688, 1400547, 1301731, 1134148, 1001835, 841341, 657626, 583953, 571786, 595621, 621855, 565584, 539922, 552618, 554563, 486886, 487361, 515451, 426158, 451542, 528064, 472673, 420450, 417537, 419496, 448842, 495463, 450147, 444459, 451046, 413696, 397004, 366200, 341017, 310748, 332739, 392943, 415051, 346289, 305207, 229746, 241804, 341385, 418517, 438651, 378083, 296998, 260960, 272143, 305632, 278216, 255276, 270177, 278240, 311799, 336822, 329824, 391611, 400024, 356082, 317716, 372671, 433133, 396194]
16891C96194n1181n7242J8176L6553K7539k2690m394J0682J4114O5528K2730J247
16879D57256j07312n4331L4411O5161L9569k4678k8060l3092m8040l0936P9175
16868C49123L0906m1912r7263m878L9134J12221P88L6438J127K984m313l950O0376
16855D80781j4934m8900K9820j6717l0745J8124R6022J12126O015N5858P11m9860
16843F38301o0274j4410M626n510l066L6459k5221q046J01224L8642k3886N6600
16831G35439N6400R7296Q8574O8139J52135J07241J25829J01483M1925q176j49269
16820A417016j87785r3008k9697j01368j05029o3916K3741M9948L2636L1752M3340
16809A017630J7086O6917k6883k4560p34K0856L1140O114M0464r503M1651P6937
$$ y = [396194, 345013, 287771, 305947, 342500, 370039, 347349, 342955, 353637, 367751, 433279, 456009, 457256, 349944, 295613, 330024, 395185, 434754, 410076, 382016, 348924, 300884, 269948, 349123, 380029, 338117, 240854, 235976, 275110, 387331, 388119, 424557, 425684, 428668, 424355, 420405, 480781, 465847, 416947, 446767, 430050, 399305, 417429, 513451, 625577, 631592, 687450, 688161, 638301, 578027, 563617, 568243, 562733, 559667, 596126, 570905, 562859, 664083, 702725, 678839, 735439, 791839, 889135, 977709, 1045848, 1197983, 1305224, 1431053, 1532536, 1574461, 1566285, 1417016, 1229231, 1136223, 1106526, 1005158, 900129, 836213, 859954, 909902, 942538, 974290, 1017630, 1034716, 1101633, 1074750, 1050190, 1049456, 1070312, 1101452, 1107566, 1148030, 1138527, 1180178, 1257115]
16797A257115P4323Q9157P8780L7984L342k3800n1661j09504j37758Q995Q4156
16786A311129l1774l9596O3606Q9078N916Q3373J05155M1907K1303J39347N2365
16775A841809r5414p2559j23431q5556o4004q9431j28574n1703k305J3911j0522
16764A132221J15468k284l8700j6640k3105N7843l4192m0639J544r5692L9765
16753A095589J6674J8545J56561R4413J4466R8254J52096J12604J16614J14344
16743A990160p5828j38370l5295n5270n2593r3332r3828j13339j909Q2136M1850
16732A454382j8975j836Q2103P6882j6740m3992K8640p9936j80270p6559l7737
16721A185962n8139L1843N1478O1645K6512M386m4624m0672o8472r981j5909P537
$$ y = [1257115, 1331438, 1420595, 1499375, 1537359, 1540701, 1516901, 1465240, 1355736, 1217978, 1226973, 1311129, 1279355, 1239759, 1303365, 1392443, 1398359, 1481732, 1586887, 1628794, 1650097, 1789444, 1841809, 1746395, 1673836, 1550405, 1464849, 1400845, 1311414, 1182840, 1131137, 1128832, 1142743, 1132221, 1247689, 1245405, 1206705, 1190065, 1166960, 1224803, 1190611, 1149972, 1151516, 1055824, 1095589, 1112263, 1130808, 1287369, 1381782, 1396248, 1494502, 1646598, 1759202, 1875816, 1990160, 1914332, 1775962, 1740667, 1685397, 1632804, 1539472, 1445644, 1332305, 1330396, 1412532, 1454382, 1435407, 1433571, 1515674, 1592556, 1575816, 1531824, 1560464, 1480528, 1300258, 1223699, 1185962, 1127823, 1159666, 1211144, 1272789, 1299301, 1303687, 1259063, 1218391, 1149919, 1139938, 1124029, 1131566]
16709A131566L6871O1818o968O7402J6884N532l883j5990m0929l7823L1324M0475
16697A286279L9365P936j0205k1061K4287J7485M8741L4897M1016K6671R6081
16686A591492j04814o9853K2000m3224n4109o2512r2508L2599M0057p311J15374
16675A367191M4600j1806K3487n8898j32878j92528k08276l29870j78372m5082
16665B77568O7396J32145Q9489L0733P7700J08274J59810P1978P2072N7117N7286
16654A201568J67511J16340k371N5508N5380p514p0910k8252L7509M0485m3138
16643A522116p7758J1530Q8131O4114N4287K0517j499j9262N4362L5373L2267
16632A784178j193R1513J13074J08233N0102K1502J04097J35018P1986J05344
$$ y = [1131566, 1168437, 1230255, 1223287, 1290689, 1307573, 1313105, 1309222, 1293232, 1252303, 1214480, 1245804, 1286279, 1325644, 1333580, 1323375, 1302314, 1326601, 1344086, 1392827, 1427724, 1468740, 1495411, 1591492, 1486678, 1416825, 1438825, 1395601, 1341492, 1278980, 1186472, 1219071, 1259128, 1251817, 1367191, 1411791, 1399985, 1423472, 1364574, 1231696, 1039168, 830892, 501022, 322650, 277568, 344964, 477109, 566598, 597331, 675031, 783305, 943115, 1015093, 1087165, 1144282, 1201568, 1369079, 1485419, 1483048, 1538556, 1593936, 1586422, 1515512, 1487260, 1524769, 1565254, 1522116, 1444358, 1455888, 1544019, 1608133, 1662420, 1682937, 1681438, 1662176, 1716538, 1751911, 1784178, 1782985, 1874498, 1987572, 2095805, 2145907, 2167409, 2271506, 2406524, 2478510, 2583854]
16622B583854Q0417J03241O572J3307M3640R6425P3590J26337J46472P4824P5205
16611C423884Q2545J79220K00999R5328J14642J04959J83711K35901J64913J37351
16601D923453J34743K30821K52371K55231K51751L00476L27264K93121L28076
16592G297307L95312M38141M03916K91849M41400M48961N09079O26476P22527
16583A1574968P71287P84997R21044J042160J098941J270142J337298J483012
16575B0283849J752141K045761K286457K544368L159394L665459M238522N195327
16567D5171278O469300P980523J0001962J2676370J5909202J9822387K4448849
16560A42479871K9344106L3603313L5471249L3420829K6610189J6254204M576292
$$ y = [2583854, 2664271, 2767512, 2774084, 2787391, 2831031, 2927456, 3001046, 3127383, 3273855, 3348679, 3423884, 3506429, 3685649, 3886648, 3981976, 4096618, 4201577, 4385288, 4621189, 4786102, 4923453, 5058196, 5289017, 5541388, 5796619, 6048370, 6348846, 6676110, 6969231, 7297307, 7692619, 8130760, 8534676, 8826525, 9267925, 9716886, 10225965, 10852441, 11574968, 12346255, 13131252, 14052296, 15094456, 16193397, 17463539, 18800837, 20283849, 22035990, 24081751, 26368208, 28912576, 32071970, 35737429, 39975951, 45171278, 51640578, 59621101, 69623063, 82299433, 98208635, 118031022, 142479871, 171823977, 205427290, 240898539, 274319368, 300929557, 317183761, 321760053]
16553C21760053m717057q952042p171410j48936J0106936K2189697L5063214M6782283
16545D14912738N4081068N1193599L3378315K071046l3080201n9703119p0867366
16538C91986080o7818577n6952840m4708171l3940994k5495906j9090944j4273098
16531A29705550j0246055o622959l426153l01432K943925O332455R831676J3401408
16523A41618415J6662813J8571485J7578239J2862727M800801m016761j0534117
16516A97543602j2945357j1353415p498240k785976J718240M995733O525215N870637
16508A82070439K883473j450358o106140r942877j2830717j4253750j4295311
16501A26074759j3068659j0853060q111939n398142l057334j561571j376398k454499
$$ y = [321760053, 317042996, 308090954, 300919544, 300770608, 310877544, 333067241, 368130455, 414912738, 468993806, 520187405, 553565720, 555636766, 522556565, 462853446, 391986080, 324167503, 267214663, 222506492, 188565498, 163069592, 143978648, 129705550, 119459495, 112836536, 109410383, 109108951, 112052876, 118385331, 128217007, 141618415, 158281228, 176852713, 194430952, 207293679, 212094480, 208077719, 197543602, 184598245, 173244830, 165746590, 162960614, 164678854, 169674587, 176199802, 182070439, 184953912, 183503554, 177397414, 167454537, 154623820, 140370070, 126074759, 113006100, 102153040, 94041101, 88642959, 85585625, 84024054, 82647656, 80193157]
16493H0193157m640564p113846q643060q972864q266597o873382n447308m305322
16485B5930214l396832k627282k132195j716855j476449j304551j206150j045338
16477A1024562q39390p80649o59215n91222n30218m46100m08785l83919l33620
16468F051444k88978k77261l24180k29753j01381j76844k04519k00634j08610
16459D139284r2540j20112j65235j68447j77717j22571m7158n1812o8396m1534
16449C083762o1409j18768r0015l0259q3806p8725p7427k956o7439m8683M8850
16438B473125N7908J7443M4799K1069j7372q580l2288N4046L1679J1275k1262
16427B631842m1907j08094r9865n4438J8358q503m4696J20316P9056m1536k0869
$$ y = [80193157, 75552593, 68438747, 59795687, 50822823, 42556226, 35682844, 30235536, 25930214, 22533382, 19906100, 17773905, 16057050, 14580601, 13276050, 12069900, 11024562, 10185172, 9404523, 8745308, 8154086, 7623868, 7177768, 6768983, 6385064, 6051444, 5762466, 5485205, 5161025, 4931272, 4829891, 4653047, 4448528, 4247894, 4139284, 4046744, 3926632, 3761397, 3592950, 3415233, 3292662, 3245504, 3193692, 3125296, 3083762, 3022353, 2903585, 2813570, 2783311, 2699505, 2620780, 2543353, 2540397, 2472958, 2424275, 2473125, 2531033, 2548476, 2593275, 2614344, 2596972, 2588392, 2556104, 2610150, 2641829, 2653104, 2631842, 2589935, 2481841, 2381976, 2327538, 2345896, 2337393, 2292697, 2413013, 2492069, 2450533, 2429664]
16416B429664q6503j52326j70280k11594j41447j54855j69368o4879k9581J4731
16406A263562n2086j3739O7343Q1824l6447K2839o4616J0409R9610J09882K903
16395A491484Q241L0461M4877O2234J4800q0512m2015j0778M9882K3643N6745
16384A649062K6270l1452m6819k8279j4435j8554l4208n3520j5180M3608J8496
16373A494989r8261o3408j18616j11614m5702l4612o8825o9219n2466q7074m178
16362G41014L8601l3645n4212k9574p7640O1M3816m6152n745m0135m8979r6711
16350C90699p7417m4339k9804k4544l6658N2740L951l5912l288j8348j706o4550
16338A10824m0042k5833K903M2022O5166N7170j11914o8960N506J0467L027m435
$$ y = [2429664, 2343161, 2190835, 2020555, 1808961, 1667514, 1512659, 1343291, 1278412, 1248831, 1263562, 1211476, 1197737, 1265080, 1346904, 1310457, 1333296, 1268680, 1279089, 1378699, 1488581, 1491484, 1499725, 1530186, 1575063, 1637297, 1652097, 1571585, 1529570, 1518792, 1568674, 1592317, 1649062, 1675332, 1643880, 1597061, 1568782, 1554347, 1535793, 1501585, 1448065, 1432885, 1476493, 1494989, 1396728, 1333320, 1214704, 1103090, 1057388, 1022776, 953951, 884732, 832266, 745192, 741014, 779615, 745970, 691758, 662184, 584544, 584605, 628421, 582269, 576524, 536389, 487410, 390699, 313282, 268943, 239139, 214595, 177937, 230677, 234628, 198716, 195428, 177080, 175374, 110824, 70782, 44949, 47852, 89874, 155040, 212210, 100296, 31336, 36842, 47309, 50336, 45901]
16326D5901M6936L2683k346k3283K7453M717p869o346N1196M487j2644m0628m1451
16313G8806l552M4002K0074J4656L2460o2852k7984J564J804l0545j404N9168
16301A26197j4147q919k5560q8483Q41K3771J2160J0655r471J238n0861m5909
16289f8488j6352M5400O1552L1660m0576M7301K2229p253j8722k0670m4933n077
16277a3929M0326m5722j12080L2712M0789m384k1359O5370R822l059k9729n530
16265d6773l0898l8218M1829P2400p8132n7154j5977L2379K271k4426m1491P9566
16253a04624M4266n7256o1514Q638J37747N9235m5763l8925J3614O2403K3885
16242D1706K0891Q632l7377j494R5018n7674j03445m4929L3310J1239q0761J0966
$$ y = [45901, 92837, 125520, 123174, 99891, 127344, 132061, 124192, 117846, 169042, 173529, 160885, 120257, 78806, 75254, 119256, 139330, 153986, 186446, 123594, 95610, 97174, 98978, 68433, 67029, 126197, 112050, 103131, 77571, -10912, -10071, 13700, 25860, 36515, 27044, 28282, -22579, -68488, -84840, -39440, 22112, 53772, 13196, 60497, 82726, 75473, 56751, 36081, -8852, -13929, 26397, -19325, -131405, -98693, -57904, -62288, -83647, -18277, -8455, -11514, -41243, -46773, -77671, -115889, -74060, -1660, -79792, -136946, -152923, -120544, -118273, -142699, -184190, -104624, -60358, -117614, -179128, -170490, -32743, 26492, -19271, -58196, -44582, 17821, 41706, 62597, 71229, 33852, 32358, 127376, 69702, -33743, -78672, -45362, -34123, -114884, -103918]
16230a03918J9981p3455K8367R4380K2016O2617k7529m5741n8137k743j5739M574
16218i5327K9653l266p4011k0036L4628L8084L1939N2502j0158k1609K6663j7134
16206b8072p3187k6965N7126N1756l5129L5766j044L5767J7755K9203N9613j5794
16194A06795o7597l709N8320O5540r1121L8260J48330M3384l4023J7639Q7581
16183C69399R5854J13782J35585O7172K9795J84908K84349K87475K87103K26663
16173B082085J17404K7685j12229j69338j88398j31799n2389J93397K13056J87537
16163B167011K71119K96705J56014j26168k79161l68309l86594k96340k62231
16154A172046j63054k19029k02188p3162p0692l6298l5435j19616r0444K5560
$$ y = [-103918, -83937, -157392, -129025, -34645, -12629, 49988, 22459, -23282, -81419, -84162, -99901, -95327, -65674, -68940, -142951, -162987, -128359, -90275, -58336, -5834, -15992, -37601, -10938, -28072, -101259, -128224, -71098, -19342, -54471, -18705, -19749, 16018, 33773, 62976, 122589, 106795, 39198, 35489, 93809, 159349, 68228, 106488, 254818, 298202, 264179, 281818, 369399, 465253, 579035, 714620, 781792, 811587, 996495, 1280844, 1568319, 1855422, 2082085, 2199489, 2227174, 2114945, 1945607, 1757209, 1625410, 1573021, 1766418, 1979474, 2167011, 2438130, 2734835, 2890849, 2764681, 2485520, 2117211, 1730617, 1434277, 1172046, 1008992, 789963, 587775, 514613, 443921, 407623, 372188, 252572, 162128, 187688]
16144A87688N5902k83k0781o4658p7880l7197j381J06343K6112n3728k072J5845
16132A33910L4095j4400J0583R5139q596n7070r3308K7011J04707P0722j9185
16121B83608K0868l021l9567j9111M4853J57805M5376Q5765J15330J20104R7519
16110I09529N4423J48148J50802K52423K60165L17249L28701J84097N9825p4273
16100B591089k37566k05116j70385j21586j0706q51M0586R9614J84579K55579
16090B425237J09328M2379k4978j75362j83289l01383k97168j93194j54647j37977
16080A108946j48104j25532m7054o9673j10969O0863O4197p6774O402P2594R4175
16069H29071N8028M5650P4376P4444R9218L152r3341q545N8434K8014M0948J27533
$$ y = [187688, 243590, 243307, 222526, 157868, 79988, 42791, 41410, 147753, 173865, 120137, 118065, 133910, 168005, 153605, 164188, 259327, 250731, 193661, 100353, 127364, 232071, 302793, 283608, 304476, 301455, 261888, 242777, 287630, 445435, 490811, 576576, 691906, 812010, 909529, 963952, 1112100, 1262902, 1515325, 1775490, 2092739, 2421440, 2605537, 2665362, 2591089, 2353523, 2148407, 1978022, 1856436, 1845730, 1844879, 1885465, 1985079, 2169658, 2425237, 2534565, 2576944, 2551966, 2376604, 2193315, 1891932, 1594764, 1401570, 1246923, 1108946, 960842, 835310, 788256, 718583, 607614, 668477, 732674, 655900, 662302, 734896, 829071, 887099, 932749, 1007125, 1081569, 1180787, 1183939, 1090598, 1082053, 1140487, 1168501, 1209449, 1336982]
16057A336982J33305J07344L5434L8459P0296p294j6307p6657K3773L228J3861
16046A662424N0839Q3043N6798P6439O3737q1966l050J8516j13318j4258P3227
16035A872431P1238M0948j0761K88r3955J462k9831L793K8395n1530j32340m0889
16023A659249R270J5305k5451k5854n6174l8630K0899j6400p9229q6298q9702
16012A286985p3807o7180P796k6534o0057L2413p5571o2476K1905J0164m5914
16001I47724o6638m3523o2547j9903o1696m8225j1562Q071l6610q8052o4228O1236
15989E14047L4548p1602o0854l8083l0939m5760p0786q8898o181K3332k796n1519
15977A04509m6259l9932Q1537K3350M000J7202p305p5297M3672N6306K8693K3740
$$ y = [1336982, 1470287, 1577631, 1613065, 1651524, 1721820, 1714526, 1698219, 1621562, 1645335, 1648563, 1662424, 1713263, 1796306, 1853104, 1929543, 1993280, 1911314, 1908264, 1926780, 1813462, 1799204, 1872431, 1943669, 1984617, 1973856, 1974144, 1880189, 1881651, 1851820, 1855613, 1884008, 1832478, 1700138, 1659249, 1668519, 1683824, 1658373, 1632519, 1576345, 1537715, 1558614, 1542214, 1462985, 1376687, 1286985, 1213178, 1145998, 1153794, 1127260, 1067203, 1099616, 1024045, 961569, 983474, 993638, 947724, 881086, 837563, 775016, 755113, 693417, 645192, 633630, 641701, 605091, 517039, 452811, 514047, 548595, 476993, 416139, 378056, 347117, 301357, 230571, 141673, 135492, 158824, 156028, 104509, 58250, 18318, 99855, 123205, 127205, 144407, 137102, 61805, 105477, 161783, 190476, 214216]
15965B14216l6281m3310r4434n0784J930J0771K6553K6004o394m5898n2965k1773
15953g2365j2421j3728J08326M8015K4036R031L2586M5262O0775k6636q7528n7060
15941E8293k0054p6890n1594O4479R0919M0510J6702k1423p176K5704j3069M6654
15929A53055K6651l687M2024L9099O6457Q7527m1566q0970R2221N6715M4942R9632
15917E82100P5961J67473J62468J32775J76273K51376L22081J95648K43975J70377
15907B480507Q4216N3328r1455k34642j65129r0774j14680q2393l9676K6808J49699
15896A975809K11012J89188J28647l2189j08259j60488k95711j82995j53222j34626
15886A437166j57033j13991n9302m8203j24240n9161j9726L9938M3261J13252
$$ y = [214216, 177935, 134625, 40191, -10593, -8663, 2108, 28661, 54665, 48271, 2373, -50592, -72365, -84786, -98514, 9812, 57827, 81863, 90894, 123480, 168742, 229517, 202881, 115353, 58293, 38239, -38651, -90245, -25766, 65153, 105663, 122365, 100942, 93766, 119470, 106401, 153055, 179706, 176019, 218043, 257142, 323599, 411126, 369560, 288590, 380811, 437526, 482468, 582100, 658061, 825534, 988002, 1120777, 1297050, 1548426, 1870507, 2066155, 2310130, 2480507, 2564723, 2618051, 2526596, 2291954, 2126825, 2036051, 1921371, 1838978, 1799302, 1826110, 1975809, 2186821, 2376009, 2504656, 2472467, 2364208, 2203720, 1908009, 1725014, 1571792, 1437166, 1280133, 1166142, 1106840, 1058637, 934397, 875236, 855510, 895448, 938709, 1051961]
15876A051961J48719K18901K61764K47365M02091M79169O45816P63753Q51244
15867E070783Q98121P56769L65762j71093o77204r30349r48801q27712p08755
15858B827521n49501m60110l40811k15613j80573k52219j25479n7572r6823n1302
15848D97518L4291L8491j3885q3070r1394j5587N846j8671k0490r8840j14601
15837A19608q2926k6729Q683Q527Q7019N3811K6004j1960L294j04037p1966Q99
15825A0227m2792k5585O9843O6314j4508j5481N0280Q3952j0906l4449q3203n1354
15813B338p3683n6651M1251n390j4903M7761r785K7807K497L3515N7974k3909
15801B8822N384k3943J6384Q217n9629j5937O9840L9764j01591L4887Q2436l9636
$$ y = [1051961, 1200680, 1419581, 1681345, 1928710, 2330801, 2809970, 3455786, 4219539, 5070783, 5968904, 6725673, 7091435, 6920342, 6243138, 5312789, 4363988, 3536276, 2827521, 2278020, 1817910, 1477099, 1261486, 1080913, 828694, 703215, 645643, 548820, 497518, 531809, 570300, 556415, 473345, 381951, 366364, 372210, 353539, 333049, 234209, 119608, 36682, 9953, 18636, 27163, 114182, 167993, 193997, 182037, 185331, 81294, 9328, 10227, -32565, -58150, 11693, 78007, 63499, 48018, 98298, 182250, 171344, 136895, 53692, 2338, -71345, -127996, -86745, -92135, -107038, -59277, -69062, -41255, -38758, -5243, 52731, 28822, 34206, 10263, 26647, 34864, -24765, -40702, 29138, 68902, -32689, 2198, 84634, 44998]
15789D4998n2747j0208L3080M069k8891n973m5364K8374Q371L3254J7147J5483
15777D1593N2633J6510n6936j0451M9420O8602j5167j04688p5586j7795Q0303
15766B8438Q1369r9125l7709J32112L1285j05832p6878K0221P641O4668M4116
15755I0306L448P041o347o8188p5282K646K9760Q1663L5448J9261N1178l3812
15743A37122J5562o7376J8234k3014q2344n3577K2508K1594o9721m732J1635N8614
15731a5495R5464J3605O6046p407j2604q4896j73528l2875J7968P8171N0699o6753
15719g1605N2792j5078k682j9355Q3205P1162q9833j2047J7511m5082M2852k0504
15707h664K2148K0254m8087O8319R6441r9556j17196l6730M4120O1329K6784K6648
$$ y = [44998, -7749, -17957, 15123, 19192, -9699, -15672, -61036, -32662, -24291, 8963, 26110, 41593, 94226, 110736, 53800, 43349, 92769, 161371, 146204, 41516, -34070, -51865, 28438, 109807, 10682, -27027, 105085, 136370, 30538, -46340, -26119, -18478, 46190, 90306, 93754, 100795, 94448, 26260, -49022, -46376, -16616, 65047, 100495, 119756, 170934, 137122, 152684, 85308, 103542, 80528, -1816, -55393, -32885, -11291, -81012, -85744, -74109, -15495, 79969, 93574, 159620, 152213, 139609, 54713, -118815, -151690, -133722, -55551, -4852, -71605, -18813, -33891, -36573, -55928, 27277, 98439, 8606, -3441, 14070, -31012, 11840, -8664, 13484, 33738, -14349, 53970, 150411, 50855, -66341, -103071, -58951, 2378, 29162, 55810]
15695E5810p252M4797k8931J2547K7830j9068n656k4829P442n7724R139K2104
15683C6209J799k543n4578j4802J13417L2079J4320M0499P194J2272k8880n3800
15671A03186M2454K2374j08584j01293K3779K4248K4871L6209k1166l8085K9264
15660C7257N4343P5721j0018j00104j1262K8745k9768K2881j1085K2204o929K581
15648G4566P2785p0223M814K1344J4660m6198o2172Q145k5289O5572K7587j0397
15636G5194k6880M3278M2288l332l900q9593q7338m3649j5356M1432Q5847N4554
15624G2545m4590p4325K6683O3470N0999j5920l658O6978R3369J8445j8034K0389
15612B56351o9265K5839M1453l5256L3155J22826R7254J62697J84454J01177K25560
$$ y = [55810, 48558, 93355, 64424, 76971, 104801, 85733, 80077, 55248, 62690, 4966, 14105, 36209, 38008, 35465, -19113, -33915, 79502, 111581, 125901, 166400, 173594, 185866, 156986, 103186, 145640, 168014, 59430, -41863, -18084, 6164, 31035, 67244, 46078, 7993, 37257, 91600, 167321, 157303, 57199, 45937, 74682, 44914, 67795, 56710, 78914, 71985, 74566, 147351, 77128, 81942, 103286, 117946, 71748, 9576, 17721, -7568, 58004, 85591, 75194, 48314, 91592, 133880, 130548, 126648, 37055, -50283, -93932, -109288, -67856, 17991, 72545, 27955, -46370, -19687, 43783, 94782, 78862, 75204, 142182, 235551, 253996, 235962, 256351, 187086, 212925, 254378, 219122, 252277, 375103, 472357, 635054, 819508, 920685, 1146245]
15601A146245L74300M55750L89810J96841r3077k80876l84973l91167l58647j61993
15591H92213j42140j85621j02270j39470M040K900k6935p457n5146p5626m5406
15580A19082k2535K0675L9562J64K4016L3645P361o2666n982m3921o3931j2019
15568C3451M6003O1816J1425M511m3467L6157m4884j03519n7703O164K6793R518
15556a3735O0890K5795J01942o8636j0462Q4430K7869P216n4499J6230m6940r8786
15544C1314k4603n53M0126M4385m3121k7919M4393l6957r8547N0942M1846k4217
15532b911Q2612J07054m0141p5995l1921j4371K0167M2013l7614k1138m4721n5041
15520g2007M2135R5322O2370K3879k6852J9419m5148m1350L4451K3767L6973J7407
$$ y = [1146245, 1520545, 1976295, 2366105, 2562946, 2469869, 2188993, 1804020, 1412853, 1054206, 892213, 750073, 564452, 462182, 322712, 326752, 329652, 302717, 295260, 240114, 164488, 119082, 96547, 117222, 156784, 156948, 180964, 214609, 221970, 159304, 153322, 109401, 45470, 33451, 79454, 141270, 152695, 157206, 113739, 149896, 105012, 1493, -56210, -50046, -23253, -13735, 47155, 72950, 174892, 106256, 95794, 180224, 208093, 215309, 160810, 177040, 130100, 31314, 6711, 6158, 46284, 90669, 47548, 19629, 64022, 27065, -71482, -20540, 21306, -2911, 79701, 186755, 146614, 70619, 38698, 24327, 44494, 86507, 48893, 27755, -16966, -72007, -29872, 65450, 127820, 151699, 124847, 144266, 99118, 57768, 92219, 115986, 152959, 170366]
15508A70366m9096k5761l9494K765O0406j0284j8840M0601J0981j4245k6779j3837
15496H6783K5268L2920J3412k1129o3398m8580J3211K9364M6673J0359n4696q589
15484F1598Q063m0012Q7135p1034l3900k1801j0129O590M2079N1320N6436n5205
15472H1140M379k1889K6773k7872K0988L0298N8522j1080n7636j7717K7900l1662
15460H2144k5308k7274J5559l2091q329M6510L2110M3908N7194K8890K0746l3103
15448B00956o9684o6763n1820M1904O0687l7268o9156N4262P5786j6248m2559
15437H0097Q298l4581J9033r989P341k862j0820J0469R3029l4834p6207j0182
15425C8792j6215R1015M1684K0481L1792k6378o5301q4216o5997k0839O6482N889
$$ y = [170366, 121270, 95509, 56015, 58780, 119186, 108902, 90062, 130663, 141644, 127399, 100620, 86783, 112051, 144971, 158383, 137254, 73856, 25276, 38487, 67851, 114524, 124883, 70187, 61598, 69661, 29649, 116784, 45750, 11850, -9951, -20080, -13490, 28589, 79909, 136345, 81140, 85519, 63630, 90403, 62531, 83519, 113817, 172339, 161259, 103623, 85906, 113806, 82144, 56836, 29562, 45121, 13030, 4701, 51211, 83321, 127229, 184423, 213313, 234059, 200956, 131272, 64509, 12689, 54593, 115280, 78012, 8856, 63118, 138904, 122656, 80097, 88395, 53814, 72847, 62858, 70199, 67337, 56517, 66986, 160015, 125181, 48974, 38792, 22577, 113592, 155276, 175757, 207549, 181171, 115870, 31654, -34343, -55182, 11300, 17189]
15413A7189N9109k6818k0244k8430K4395j2703M9737P6878k0045r324j9928K1132
15401A10948L2203M2252j9231p853j1013l4354J0080k9337p4301J93M5551l1234
15389C3904K4078Q1410P1466o9974J6658M2042J6515R626j8500j4750l9668m390
15377A48417M786p4242n2684O946p4313q441R5918l1366o6251P3480N1170M7640
15365A21060N6701K801r2082m174P6781K0974k7923j5235j3727L8460M9740J8187
15353B31563q3769o5190j0540O4726Q840q1426J1194M4927k8531N993M0602J6310
15341A54699m797L5096M4400j3257n2931o0578p2874K8686L7929K0592O9000R808
15329A95773q7781m6395k1976R635Q34p359m881M6482L4364m6476J8802N1892
$$ y = [17189, 76298, 49480, 29236, 806, 25201, 12498, 62235, 139113, 119068, 109744, 89816, 110948, 143151, 185403, 166172, 158319, 147306, 112952, 123032, 93695, 19394, 19587, 65138, 33904, 57982, 139392, 210858, 140884, 157542, 199584, 216099, 225725, 207225, 192475, 152807, 148417, 153203, 78961, 26277, 33223, -41090, -49531, 46387, 15021, -51230, 22250, 73420, 121060, 177761, 180562, 88480, 84306, 161087, 182061, 154138, 138903, 125176, 163636, 213376, 231563, 147794, 82604, 72064, 136790, 145630, 64204, 75398, 120325, 91794, 97787, 138389, 154699, 149902, 184998, 229398, 216141, 163210, 102632, 29758, 58444, 96373, 116965, 185965, 195773, 107992, 61597, 39621, 49256, 50090, 42731, 37850, 84332, 118696, 72220, 91022, 142914]
15317A42914j416J7694K3507l968m5201l2242O8928J04325M1527m7540j2746m1774
15305B14008k959l6671J2024M0977l4837m0342J2673K6691J6849J4330l9672o8707
15293A14364m9502L49P6077P4252l7742j07676R579p834J07478O4679l5223k5075
15281A83726k9776k7553m4012K5967j7632r385n001O3256N8047K0211N8889j11373
15269A65364q5704N6792Q3819M0249N218l8758o0016j6188l1051l8294n172P2506
15257A48765K5897o5482o6952O7981N7233N045K1039p2221n9971J3077M7202j013
15245A20600K5826M4765p67p6016l3169r336k8450P868J21320N3105o1295l6202
15233A28249l5156M9784R3044l8693J029L763j2704k1284N0580L2995k547o7447
$$ y = [142914, 141498, 159192, 182699, 178731, 133530, 101288, 170216, 274541, 316068, 268528, 255782, 214008, 211049, 174378, 186402, 227379, 192542, 152200, 164873, 191564, 208413, 222743, 183071, 114364, 64862, 65211, 141288, 215540, 177798, 70122, 79701, 71867, 179345, 244024, 208801, 183726, 153950, 126397, 82385, 108352, 90720, 81335, 76334, 139590, 197637, 217848, 276737, 165364, 79660, 136452, 220271, 260520, 265738, 226980, 166964, 150776, 119725, 81431, 76259, 148765, 174662, 109180, 42228, 110209, 167442, 172487, 193526, 121305, 61334, 74411, 121613, 120600, 146426, 191191, 190424, 114408, 81239, 71903, 43453, 51321, 172641, 225746, 164451, 128249, 93093, 142877, 235921, 197228, 198257, 202020, 189316, 168032, 218612, 251607, 249060, 181613]
15221A81613m1609L8476N3307R868n0993n3000l5227M3972J8918j7318m5196K641
15209A05452L8086l667J6594o379k0425l5157J504M9170r11l8789J9464Q1668
15197B06610K4646p1402n766K9591j7256n991j0688M047P5187M5090k3560n0294
15185B00214K0017O3960N4367o0921p9430j6036q4328l4861N6328R0372J5341
15174B25023K1073p2712j20483O6571Q9370K4643L9993o7729n4175J5576p658
15163A59492l6965k6100P0956n8687l7594J8267p758o4981R1486m141p5079L4716
15151F3612R151R8610R1172J50J8281n2585l0278l2474q760M651n383K7205L1574
15138B14926N7337L4886O850p143o0791j6817L3486m5837o6442K5973K5260j169
$$ y = [181613, 140004, 178480, 231787, 241655, 190662, 137662, 102435, 146407, 165325, 148007, 102811, 105452, 143538, 139871, 156465, 150086, 129661, 94504, 96008, 145178, 144267, 105478, 124942, 206610, 231256, 159854, 154088, 183679, 166423, 160432, 149744, 153791, 228978, 274068, 250508, 200214, 220231, 284191, 338558, 277637, 198207, 182171, 97843, 62982, 119310, 209682, 225023, 246096, 173384, 52901, 119472, 208842, 233485, 273478, 205749, 151574, 167150, 159492, 122527, 96427, 167383, 108696, 71102, 89369, 81611, 16630, 108116, 103975, 28896, 63612, 72763, 171373, 262545, 262695, 280976, 228391, 198113, 165639, 156879, 161530, 156147, 183352, 214926, 272263, 307149, 313999, 306856, 246065, 229248, 262734, 216897, 150455, 176428, 201688, 200519]
15126B00519l758P5740R553P281J3698l7889l3025K3431O3559l12m2421M5254
15114C21630n1524o2332l8276P9L2935J7741O7625Q7592n9773m0818l5445p0062
15102A69372O708k8678Q1026L4587L1880L2627k5700m4067n835K8624J1294J1370
15090C03208j1924K5399K3404q467j21057l5816R6778r514k9019j8246o0720o4954
15078H9072O135L4248K5738L2048n814P6642l118J2750K6507j4573o783N1215
15066C24067M5945j2268m9640q7262m8201N0389Q0945N7197K8722m4538l5154
15055C10202R292K095J0900m8007m7121J4337o364M0851j4934r4608O5405K1009
15043B63057J4975j5347j0637R7046M3507J0486o4854o6174m9777j1995J0070
$$ y = [200519, 196761, 272501, 282054, 289335, 303033, 265144, 232119, 255550, 319109, 318797, 276376, 321630, 270106, 207774, 169498, 169577, 202512, 220253, 287878, 375470, 315697, 274879, 239434, 169372, 176080, 147402, 228428, 263015, 294895, 327522, 301822, 257755, 251920, 280544, 291838, 303208, 291284, 316683, 340087, 331620, 210563, 174747, 271525, 262011, 232992, 214746, 154026, 89072, 95207, 129455, 155193, 187241, 181427, 258069, 254951, 267701, 294208, 279635, 272852, 324067, 370012, 357744, 308104, 220842, 172641, 223030, 303975, 361172, 389894, 345356, 310202, 319494, 321589, 332489, 284482, 237361, 251698, 245334, 286185, 271251, 176643, 242048, 263057, 278032, 262685, 252048, 349094, 392601, 403087, 338233, 272059, 222282, 210287, 220357]
15032B20357M7812j3795k6180p3734k8612Q9634Q6096J2821k3955N9855J575O0569
15020D12443n019R772L2568o8055q7361m069L6291m653m5883n52l0367L7916M4532
15007C27563j2184k2487N9017K900n2213o425M3871j4011N2376n195o3402l7746
14995B72064R008J1490j8480R9361Q3490k9190K1858K1744J7784l9175k5781j4696
14983D09477r0681p2517l2339j1245K8027L8305k1943R940O1065j7732R447n5887
14971B53917j22447M9945J00765l1826K559j2898o406M806N4317P0916K3537j1305
14959C75880M2901m1457k5879J9021o648J2858q7114n7894j1344n283Q6412L4042
14947C35495O0845K113K1148m3080o868O3889m4425p6927n0367K4535M5323L3762
$$ y = [220357, 268169, 254374, 228194, 154460, 125848, 215482, 301578, 314399, 290444, 350299, 351874, 412443, 407424, 417196, 449764, 381709, 294348, 290279, 326570, 321917, 276034, 275482, 245115, 283031, 327563, 315379, 292892, 351909, 354809, 302596, 296171, 340042, 326031, 378407, 373212, 309810, 272064, 281072, 292562, 274082, 373443, 456933, 427743, 449601, 471345, 489129, 449954, 424173, 409477, 318796, 246279, 213940, 202695, 230722, 269027, 247084, 257024, 318089, 300357, 309804, 253917, 131470, 181415, 282180, 250354, 252913, 240015, 233609, 238415, 292732, 363648, 387185, 375880, 418781, 377324, 351445, 370466, 363818, 376676, 289562, 231668, 220324, 215041, 301453, 335495, 396340, 398453, 419601, 376521, 369653, 433542, 389117, 312190, 261823, 286358, 331681, 365443]
14935C65443m7342j9692K5422R9531Q361k9498L3367J4216o4991k808n4451j4634
14923C12924M7861J4277J6775q1083k9216R229N859N9759l7376m0632q146l6095
14911B34136K2895P5276K2349J8803O520n2330m8208j4427N9094Q9971m0326n4321
14899C19432j655M7197n2023k6175L2571R7339P0803o0060o6593K1396P8167p0674
14887C89725o3696k5369l0655m6505M9840P5307M4707o2748m875K3067k3459l1319
14875B94020L1360Q1072L6907p7026p3705M2487l4891L0385J3033L8528M41J1547
14863C94158l5977P066J0506m062m0647J8328N5436O5427p1294m3464K2840L7825
14851D16142K9794j3481j4587l7775N268N2029j2629j7812N321K0734J8778m3638
$$ y = [365443, 318101, 298409, 323831, 423362, 431723, 402225, 435592, 449808, 384817, 382009, 327558, 312924, 360785, 375062, 391837, 310754, 281538, 290767, 296626, 356385, 319009, 278377, 270231, 234136, 257031, 332307, 354656, 373459, 379979, 327649, 279441, 265014, 324108, 414079, 373753, 319432, 317777, 364974, 312951, 286776, 319347, 416686, 487489, 427429, 360836, 382232, 460399, 389725, 326029, 300660, 270005, 223500, 273340, 348647, 393354, 330606, 325731, 348798, 325339, 294020, 325380, 406452, 443359, 366333, 292628, 335115, 300224, 330609, 343642, 382170, 382611, 394158, 358181, 365247, 375753, 371691, 331044, 349372, 404808, 470235, 398941, 355477, 378317, 416142, 445936, 432455, 417868, 380093, 385361, 437390, 424761, 406949, 412270, 433004, 451782, 408144]
14839D08144m2347r138j766L6777j4699M0208N059m0424l2245l7746j890M6841
14827C56774M7799M593m1199N114P9630j1044l5433l0713m742k6033M947N8018
14815D07711K5269o4153o660m100M4763K618j3448J2078L2028L7249l5118L5371
14803D73608L5001o619k5251l8995r5912N4948j5904j5493O2433k0181j1290K8685
14791D25030J2556k0063O2126K5167r3870o1777M3634m6726k5855P7391L0531
14780D28144j9373L1392J7308N921J6094M632j0668j7515L7534K2408J0460J2121
14768E38458J2887o7654m7065k800L8952n9122k3557j4598k7365M486N5971M6704
14756D55297L4543q3061k0139k3626P3461k2500N7218q228p0792n3828O9310K845
$$ y = [408144, 365797, 356659, 354893, 391670, 376971, 417179, 422238, 381814, 349569, 311823, 309933, 356774, 404573, 409166, 367967, 373081, 452711, 441667, 406234, 375521, 370779, 344746, 349693, 407711, 432980, 368827, 362167, 358067, 402830, 405448, 392000, 404078, 436106, 473355, 438237, 473608, 508609, 501990, 476739, 437744, 341832, 396780, 380876, 365383, 427816, 407635, 396345, 425030, 437586, 417523, 479649, 504816, 410946, 349169, 392803, 346077, 320222, 397613, 428144, 408771, 440163, 457471, 463392, 479486, 484118, 473450, 455935, 493469, 515877, 526337, 538458, 551345, 483691, 436626, 433826, 472778, 413656, 390099, 375501, 348136, 352622, 408593, 455297, 489840, 406779, 386640, 363014, 436475, 413975, 471193, 462965, 392173, 338345, 407655, 410500]
14744D10500K5386l8663L6358L9740q936O419n2824N7133P9041j2042K4203o6261
14732E00054J1514R180J1639J5883l5785J6035o0947o3597J3624M8769M2314J2124
14720E20807m0304M903K9966j4969q5803m896N9320M642n240j4279M5879j8598
14708D81428q6834m7193M4706L8095k0856l1954k1141O2104N3236j6976j1771
14697D42844L9206P8169J4229l7822p567l8285j01280K4997J32617k2310n1624
14686D73174m1814M6989K6927r207l871K2067n6658N6470O6787P7922N978j21835
14674E42929n3021N6946l8097m1691L5070l084P1555j0370J0523J0850M494j1001
14662E75103N9214n5658l0687m1479P482P4919r511L8465K3289l8560m0782j756
$$ y = [410500, 435886, 397223, 433581, 473321, 464385, 470804, 417980, 475113, 554154, 542112, 566315, 500054, 511568, 520748, 532387, 548270, 512485, 528520, 467573, 403976, 417600, 466369, 508683, 520807, 480503, 485406, 515372, 500403, 414600, 409704, 469024, 473666, 468426, 454147, 500026, 481428, 394594, 347401, 392107, 430202, 409346, 377392, 356251, 418355, 471591, 454615, 442844, 482050, 560219, 574448, 536626, 529059, 490774, 389494, 414491, 547108, 524798, 473174, 431360, 478349, 505276, 496069, 492198, 514265, 457607, 514077, 580864, 658786, 664764, 542929, 489908, 546854, 508757, 467066, 502136, 499052, 570607, 560237, 570760, 581610, 586104, 575103, 634317, 578659, 547972, 506493, 513975, 588894, 579383, 617848, 641137, 602577, 561795, 560039]
14650E60039j8123M269K5754l6153J6195N199l6634j8463K2118O0056N6726L687
14638F44670m2564n3808Q004K5749n6514L3095k6640m5720j08623L8471R5624
14627E11744J2196p0849M7247N5555k3553O7649L7341k6866j6924l7810j9783
14616E35947O948j646l7804K0839R5033K7088l6996o6549L1808L9825k256k5715
14604E86522k6103R3537K8797k8416m3790N751j5003l2837j6260m2085O3765M0432
14592F14310J8207k5159l0184o2981M7866R7613l1752m6906j082M2948L5236m7612
14580F10504n2087k2547j8465K5938R183R466L2045M5847L7268j3294K7609p4928
14568F16539m181l4466O0018J16582N7800j41999l7614J8947K8863l5238q7726
$$ y = [560039, 541916, 546185, 571939, 535786, 551981, 557180, 520546, 502083, 524201, 584257, 640983, 644670, 602106, 548298, 556302, 582051, 525537, 558632, 531992, 486272, 377649, 416120, 511744, 523940, 453091, 500338, 555893, 532340, 599989, 637330, 610464, 593540, 555730, 535947, 542895, 541249, 503445, 524284, 619317, 646405, 609409, 542860, 574668, 614493, 612237, 586522, 560419, 653956, 682753, 654337, 610547, 616298, 601295, 568458, 552198, 510113, 573878, 614310, 632517, 607358, 577174, 514193, 562059, 659672, 627920, 581014, 579932, 622880, 658116, 610504, 558417, 535870, 517405, 543343, 552526, 561992, 594037, 639884, 677152, 663858, 691467, 616539, 612358, 577892, 637910, 754492, 812292, 670293, 632679, 651626, 680489, 645251, 557525]
14557E57525R744j4759m0833N8674K9711K0738j8508j6733O2004R85l4530l407
14545F10611K1474J2268J4042M856j5721r02J2568M3221p817n964L0999m4081
14533F75554o2182o69O4985k9018n4091k8249L6922M6671j9719L5201k0286l3705
14521F11414q9471L1302L3834J5198j3924N3281j8979k9438R1013j0095l2714
14510F41421k3520J3386N8039n3616m4354M0091j6962J284M1437P8843Q5991j0026
14498H12014n7255l4555q403J9874J3781K0059P8669O568p3853m1052n7284k0313
14486F58250K4887m1804k1271J2127l2913K5425k5833o5373j1275M5102O7059
14475F34381n1583M6937Q8087J2168n2388R3874L2529n5126j00J1292j4206o0585
$$ y = [557525, 567269, 552510, 511677, 570351, 600062, 620800, 602292, 585559, 647563, 648548, 614018, 610611, 632085, 644353, 658395, 663251, 647530, 646628, 659196, 702417, 694600, 688636, 719635, 675554, 613372, 612703, 677688, 648670, 594579, 566330, 603252, 649923, 630204, 665405, 645119, 611414, 521943, 553245, 587079, 602277, 588353, 641634, 622655, 593217, 684230, 674135, 641421, 617901, 631287, 689326, 635710, 591356, 631447, 614485, 615769, 657206, 736049, 822040, 812014, 754759, 720204, 711801, 731675, 745456, 765515, 844184, 850752, 776899, 735847, 678563, 658250, 683137, 641333, 620062, 632189, 599276, 624701, 598868, 533495, 522220, 567322, 634381, 582798, 629735, 717822, 729990, 677602, 771476, 804005, 748879, 748779, 760071, 745865, 685280]
14463F85280K0536R7537n439l8462l8729j4554P0584j4114j04424m3883K127M1202
14451F57661q951k3282P6910P5343k7274l7467P3336K7512k8975q9917l1953M4411
14439G07354M3908p170M327K1840N6137M865m9641K8362j00697p5196k9772P552
14427F11869N8371L1984m4304k9044O260J7093l7030J806O2452o413J672j153
14415F73563j1973J1063j2161m2808l2315O0574L3094k3061O8870J37103K6311
14404H88260r5899J9272M6719j3414n2197k4589m8174j4208j090L1914K3796K0898
14392G81288n1789M8675N4388k5569J0138j9951m0610P1645Q4880j3408l3355
14381H66332r8629m6475N1279l3593K8971o393k2971k7075J7041N0019J5344m0225
$$ y = [685280, 705816, 803353, 797914, 759452, 720723, 706169, 776753, 762639, 658215, 614332, 616459, 657661, 648710, 625428, 702338, 777681, 750407, 712940, 786276, 813788, 784813, 694896, 662943, 707354, 751262, 744092, 748419, 770259, 826396, 831261, 781620, 809982, 709285, 634089, 604317, 611869, 670240, 702224, 657920, 628876, 635136, 652229, 615199, 617005, 679457, 673044, 674716, 673563, 661590, 672653, 660492, 617684, 585369, 645943, 679037, 655976, 724846, 861949, 888260, 792361, 811633, 858352, 844938, 792741, 768152, 719978, 705770, 704680, 736594, 760390, 781288, 729499, 778174, 832562, 806993, 817131, 797180, 756570, 828215, 913095, 899687, 866332, 767703, 721228, 772507, 738914, 767885, 761492, 738521, 711446, 728487, 778506, 793850, 753625]
14369G53625p69p416P0587P1293L695k7763m1894k5341l9352O4937Q8254j0564
14357H99292O9156O0491o5262p9862j2354m1151k7819l8844K0155M9361M9559
14346H82722J14737k4841Q485M5223m307m3816m2534l8870k5387l5453m2494L6055
14334H29520k1082m3777k8046K3753O8918K5644M3042r43p9110N6383L2937m3786
14322H63453m1341M5056J43411O9827q5617j13223m2489k4667P854O3574K1993
14311I07831M5957J3600J0834l9959k0194j5840j6941j5330k6832l8535K3532
14300H28123k2652k3433L1859K3335L7281K2761l813P1957K7513k2965o0892j12753
14288G96321l3595Q437l7286k1733L1832O7085o68N6570P1742n5255n9432J2792
$$ y = [753625, 752856, 745440, 816027, 887320, 891015, 863252, 821358, 796017, 756665, 821602, 909856, 899292, 968448, 1028939, 963677, 883815, 871461, 830310, 802491, 763647, 783802, 833163, 882722, 997459, 972618, 981103, 1026326, 1022019, 978203, 935669, 896799, 871412, 835959, 793465, 829520, 808438, 764661, 736615, 760368, 829286, 854930, 897972, 897029, 817919, 874302, 907239, 863453, 822112, 867168, 1010579, 1080406, 994789, 881566, 839077, 814410, 822264, 885838, 907831, 953788, 967388, 978222, 938263, 918069, 902229, 885288, 869958, 843126, 804591, 828123, 805471, 782038, 813897, 837232, 874513, 897274, 893461, 965418, 992931, 969966, 909074, 796321, 762726, 771163, 733877, 712144, 743976, 811061, 810393, 866963, 938705, 883450, 824018, 836810]
14276H36810L5403K4649Q307J5811M3605j95l3364L3548o2421J9833J1373m6653
14264H86706P322O966k0781l217K4428j4412l3653N0827L4939l7389n3089N6276
14252I04923J5551L0384J8548j1254k0079q6981m6759K0854K7827Q1845k8334
14241I06525k2839J0539L1114R177O8862K7567Q589m7880p5059j6637N35N7417
14229I57910L6561O1824K9374q4490l8015o1134N5137O8346j5035N988j0520k761
14217A003185j1739k2536M4563L0211l1741o3708n5132J1786K8363K9216K7662
14206I90130n207L0234K6425M8876j8258Q2837p496m2168p899p4337j4772j2818
14194I95547j2250q380J6739m6517K1561O838L0501j8852L7003o3831K5213K4905
$$ y = [836810, 872213, 896862, 905169, 920980, 964585, 964390, 931026, 964574, 902153, 921986, 933359, 886706, 894028, 900994, 880213, 876996, 901424, 887012, 853359, 904186, 939125, 901736, 848647, 904923, 920474, 950858, 969406, 958152, 938073, 851092, 804333, 825187, 853014, 934859, 906525, 883686, 894225, 925339, 934516, 1003378, 1030945, 1039534, 991654, 916595, 899958, 900493, 957910, 994471, 1056295, 1085669, 1001179, 963164, 902030, 957167, 1025513, 1010478, 1016466, 1005946, 1003185, 991446, 968910, 1013473, 1043684, 1011943, 948235, 893103, 904889, 933252, 962468, 990130, 984923, 1015157, 1041582, 1090458, 1072200, 1155037, 1147541, 1105373, 1097474, 1023137, 1008365, 995547, 983297, 974917, 991656, 945139, 966700, 973538, 1004039, 985187, 1022190, 958359, 983572, 1008477]
14182A008477R718k6682k9734m552Q7191J3378K859J1125O0059l4049j4410K868
14170A086248N421K7902L7224m4014m305L9561l7188n31j1168Q229L8136J06593
14158A252108n0235q5461o8640n4527J9320J24941P3695m1660m9094r418N6712
14147A167741M7808J1273L871Q5516l9255o9256p3170L0217N0965o1229L5333
14136A189814p4616m8366L2819J7724P7483n625j0040L5671M1524L0566o605j04390
14124A175959r8600l1919O1698P6889K2573J8111m6764p1668P195N7391k4951
14113A145914n1683N8935m4937p3146N9527P1759L7060K6647n3266k139m9620
14102A125051k7613j5153Q5778K5657o3897j4107N4204O8895Q3692N0006n3020
$$ y = [1008477, 1018195, 991513, 961779, 957227, 1044418, 1057796, 1060655, 1071780, 1131839, 1097790, 1083380, 1086248, 1091669, 1119571, 1156795, 1112781, 1108476, 1148037, 1110849, 1110318, 1099150, 1107379, 1145515, 1252108, 1201873, 1116412, 1047772, 993245, 1012565, 1137506, 1211201, 1169541, 1120447, 1111029, 1167741, 1215549, 1226822, 1230693, 1316209, 1276954, 1207698, 1134528, 1164745, 1215710, 1154481, 1189814, 1115198, 1066832, 1099651, 1117375, 1194858, 1189233, 1179193, 1214864, 1256388, 1286954, 1280349, 1175959, 1077359, 1045440, 1107138, 1184027, 1206600, 1224711, 1177947, 1106279, 1113474, 1170865, 1145914, 1094231, 1153166, 1108229, 1035083, 1094610, 1166369, 1203429, 1230076, 1176810, 1174671, 1125051, 1097438, 1082285, 1168063, 1193720, 1129823, 1115716, 1169920, 1238815, 1322507, 1372513, 1319493]
14091A319493q9935N6783J2225l9654q065j5152j2729n5342r521O7370J4193k2589
14079A217077j1895m2243K9065N8518K8707n0557j2645o788n598o1092p755O8809
14067A203603Q3187J0946m3242N1716l4592j42541M2816P2410N9916l4250r0526
14056A179443m5788O7018N0224j8565N4887m8099j7034L1776J9997k550k4021
14045A247288P584R927p4340K666r895K9869L8366J9082m2432o57K1509j3551
14033A235416q298P1606M7101j3793n3832j12471l0647L1237J2121R5263N5745
14022A329448M0453J2740L6411P257m0717K673Q6215m5807o3332p0998Q744N9764
14010A362851L3068p1673l3054l8320L3980L2721j3193K9187Q3915J1684j1606
$$ y = [1319493, 1229558, 1286341, 1298566, 1258912, 1250847, 1235695, 1222966, 1167624, 1158103, 1225473, 1239666, 1217077, 1205182, 1162939, 1192004, 1250522, 1279229, 1228672, 1216027, 1209239, 1203641, 1142549, 1134794, 1203603, 1286790, 1297736, 1254494, 1306210, 1271618, 1129077, 1171893, 1244303, 1304219, 1269969, 1179443, 1133655, 1200673, 1250897, 1232332, 1287219, 1239120, 1222086, 1253862, 1273859, 1271309, 1247288, 1254872, 1264799, 1190459, 1193125, 1183230, 1213099, 1251465, 1270547, 1228115, 1227458, 1248967, 1235416, 1227118, 1298724, 1345825, 1332032, 1278200, 1165729, 1135082, 1166319, 1178440, 1273703, 1329448, 1369901, 1382641, 1419052, 1426309, 1385592, 1388265, 1474480, 1428673, 1365341, 1294343, 1303087, 1362851, 1395919, 1324246, 1291192, 1252872, 1286852, 1319573, 1306380, 1335567, 1419482, 1431166, 1419560]
13999A419560J3476K9784k5326o8034o2931M1707K0303l1483j9507M197N5555
13988A377301L5376N0260j3064j9499l033o1129j1188K0927k498K5062K4334Q3035
13976A505884k6327j8555p020n0855L6156N5515l6418m5737m6428m3329O7997
13965A390883K2446m7231j5840M8548k2613j5377K5403n725m7701K8454Q9973
13954A451220Q2665L7014n5144l9354k9053K4041p698N5104L174j928K7055n5651
13942A491445L057L435K1225k7047q4257M2018O3864j1073M0227k9804K9957N6053
13930A599100j8115l7124o2367o9736M2017r136p166M6453L8161N0220l1078O661
13918A547890n8157l2811k9889l19M0170M8800K033m6905J6383R4583L1559k2992
$$ y = [1419560, 1433036, 1462820, 1437494, 1369460, 1306529, 1348236, 1368539, 1337056, 1317549, 1321746, 1377301, 1412677, 1462937, 1449873, 1430374, 1427341, 1366212, 1355024, 1375951, 1373453, 1398515, 1422849, 1505884, 1479557, 1461002, 1453982, 1403127, 1439283, 1494798, 1458380, 1412643, 1366215, 1322886, 1390883, 1413329, 1366098, 1350258, 1398806, 1376193, 1360816, 1386219, 1380494, 1332793, 1361247, 1451220, 1533885, 1570899, 1515755, 1476401, 1447348, 1471389, 1463691, 1518795, 1521969, 1520041, 1547096, 1491445, 1494502, 1497937, 1519162, 1492115, 1407858, 1449876, 1513740, 1502667, 1542894, 1513090, 1543047, 1599100, 1580985, 1543861, 1481494, 1411758, 1453775, 1444639, 1437473, 1483926, 1522087, 1572307, 1541229, 1547890, 1489733, 1456922, 1427033, 1426714, 1466884, 1515684, 1517717, 1470812, 1487195, 1581778, 1613337, 1590345]
13906A590345P79j5624K0830K6217m6472n0546K5681J1579k0055k803K5128n6318
13894A508741J8399L5533Q4381q876j7331k0083l3395j3827j2836M0612P0169
13883A651487J4671K7566p304l5500M049L3956K7099K8038k1825r965R299r8428
13871A623143n9920J5367R8302R2570M2941k8982J0664m421p663n0611m8924o1316
13859A621150M371j9751Q020N875j9935O72M3992Q4448P4876p781j1040j3574
13847A771323n343p8677K8668j5533m515k374O921m7713l2411J9342R8323K2452
13835A760463M0701j2060o3656n7088K6309J8824K5967p814m261N1228Q2006l9889
13823A820730q7176q769J35798P0126p6066m8044L5701L935m3739j7233j7591
$$ y = [1590345, 1591124, 1575500, 1596330, 1622547, 1576075, 1525529, 1551210, 1562789, 1542734, 1539931, 1565059, 1508741, 1527140, 1562673, 1647054, 1638178, 1620847, 1600764, 1567369, 1553542, 1540706, 1581318, 1651487, 1666158, 1693724, 1686420, 1650920, 1654969, 1688925, 1716024, 1744062, 1722237, 1712272, 1721571, 1623143, 1563223, 1578590, 1676892, 1769462, 1812403, 1783421, 1794085, 1789664, 1782001, 1731390, 1682466, 1621150, 1625521, 1605770, 1613790, 1619665, 1599730, 1600402, 1644394, 1728842, 1803718, 1795937, 1784897, 1771323, 1765980, 1687303, 1715971, 1700438, 1695923, 1693549, 1700470, 1652757, 1620346, 1639688, 1738011, 1760463, 1801164, 1789104, 1725448, 1668360, 1694669, 1713493, 1739460, 1731646, 1727385, 1778613, 1860619, 1820730, 1733554, 1724785, 1860583, 1930709, 1854643, 1806599, 1842300, 1846235, 1802496, 1785263, 1767672]
13812A767672l3161K5668J6249J3503j1476Q308n5834K9584O6179N3689k2611
13801A857770q1594O938O662q853n036L5508J3924k5609Q3454O8788K4229k4375
13789A951806l1585J1100m4419K4402O3322j1492k2720m7910K2864L5135k1379
13778A929124k3347m0571l9545M2236P4546M6526p3915J9969j0226j8221N6869
13767A963445k4337P3964P3097k7664l5860K1652J1343m1366l2168k9642J4127
13756A966591l9391j7438k1440j4064P1931J6468R439L5424O8958L1562j19744
13745A988296o5932l5868J3570M1084Q0168N6038o918m2862k6142j2987l4617
13734A953830m451M1478J10963O530k5503K1915l9089J0408K1207L0064K4063
$$ y = [1767672, 1734511, 1760179, 1776428, 1789931, 1778455, 1786763, 1730929, 1760513, 1826692, 1880381, 1857770, 1776176, 1783114, 1789776, 1780923, 1775887, 1811395, 1825319, 1799710, 1883164, 1951952, 1976181, 1951806, 1920221, 1931321, 1886902, 1911304, 1974626, 1963134, 1940414, 1892504, 1915368, 1950503, 1929124, 1905777, 1865206, 1825661, 1867897, 1942443, 1988969, 1915054, 1935023, 1924797, 1906576, 1963445, 1939108, 2013072, 2086169, 2058505, 2022645, 2044297, 2055640, 2014274, 1982106, 1952464, 1966591, 1927200, 1909762, 1888322, 1874258, 1946189, 1962657, 1972096, 2007520, 2076478, 2108040, 1988296, 1922364, 1886496, 1900066, 1941150, 2021318, 2077356, 2070438, 2027576, 2001434, 1988447, 1953830, 1949379, 1990857, 2101820, 2108350, 2082847, 2104762, 2065673, 2076081, 2097288, 2127352, 2151415]
13723B151415m2325j9290j9468l8184L9359P0655k2753j8195L0858j9282o7207
13712B045583j5339P0469L0345k2447l0545q3145K6061K5213n3641M2204M085
13701B038843R963K3525l1648M2486N3363M778J748K2242Q4190P94r4206k3056
13689B133022M9078k0109o3006n5657O9153J3543Q682O8140L6719o8226O8832
13678B240171O1805j3686p229l1513K2725n5224M2136M8650j0848m0973K4744
13667B280758L850j0706J7154Q8994j4087n9840o3627K1224j7194j06880M4472
13656B184118P0477J2147L3653L3187J7507K7687N831n48J5648m6691L9997K0936
13644B413949k6836m74J7930m7820J922N0762q6632m6683L8897L428o1976O0856
$$ y = [2151415, 2109090, 2089800, 2070332, 2032148, 2071507, 2142162, 2119409, 2101214, 2132072, 2112790, 2045583, 2030244, 2100713, 2131058, 2108611, 2078066, 1994921, 2020982, 2046195, 1992554, 2034758, 2038843, 2048806, 2072331, 2040683, 2083169, 2136532, 2141310, 2143058, 2165300, 2249490, 2250284, 2156078, 2133022, 2182100, 2161991, 2098985, 2043328, 2112481, 2126024, 2134706, 2202846, 2239565, 2171339, 2240171, 2301976, 2288290, 2281061, 2249548, 2272273, 2217049, 2259185, 2307835, 2296987, 2256014, 2280758, 2284608, 2273902, 2291056, 2380050, 2365963, 2306123, 2242496, 2263720, 2246526, 2139646, 2184118, 2254595, 2266742, 2300395, 2333582, 2351089, 2378776, 2384607, 2384059, 2399707, 2353016, 2393013, 2413949, 2387113, 2386639, 2404569, 2356749, 2358671, 2409433, 2322801, 2276118, 2315015, 2318443, 2256467, 2317323]
13632B317323J5227M982R503j5178J4852J2379O232j7402N1251M2761o9883L133
13620B375180M0210l4708J139N0956l9191p899Q6163R587k8358K4345l0365O8017
13608B515076m4886o2648M9450J3078r655j7033o3367P210J4814M9252Q8716J04105
13596B644112j5957r7597m8161N497j7287O208M0682O713l5147Q22N3347O824
13584B550056k5698J9662K2895N0940O30n2209N674J2420N9044J2626K1366j5868
13572B661538m241K7124K7562k6288q4712K1756N1440K1422j6819n1041r5156
13561B532585j993O7611K7731L0026L6026j1136J3838L0984m074l0222l1933K0094
13549B679537q477J7561O6868K0250j6181k401M715n9949j2681L4081O8101L168
$$ y = [2317323, 2332550, 2337532, 2347035, 2331857, 2346709, 2359088, 2365320, 2347918, 2399169, 2441930, 2372047, 2375180, 2415390, 2380682, 2381821, 2432777, 2393586, 2385687, 2471850, 2481437, 2453079, 2477424, 2447059, 2515076, 2470190, 2407542, 2456992, 2470070, 2460415, 2443382, 2380015, 2387225, 2402039, 2451291, 2540007, 2644112, 2628155, 2530558, 2482397, 2487894, 2470607, 2476815, 2517497, 2524210, 2489063, 2489885, 2543232, 2550056, 2524358, 2544020, 2566915, 2617855, 2618485, 2566276, 2571950, 2584370, 2643414, 2656040, 2677406, 2661538, 2657297, 2684421, 2711983, 2685695, 2600983, 2622739, 2674179, 2695601, 2678782, 2627741, 2532585, 2530592, 2598203, 2625934, 2655960, 2691986, 2680850, 2694688, 2725672, 2721598, 2691376, 2659443, 2679537, 2671060, 2688621, 2755489, 2775739, 2759558, 2757157, 2761872, 2701923, 2689242, 2723323, 2791424, 2794592]
13537B794592m4869o1599k2442N7647M4212R4930R0381j6615K8231q2405j3484
13526B868579J2489m3422o469Q1926N2218l7766l9866o7676J8269q91q7318O3102
13514B813175J7225n1913o632J09772J9221k6829J3386K9349P5301J4725K2160
13503C028940p3012j04472L65J7282J3154M8825P5045M2042q808q3791o595K9295
13491B978270K5741Q241o2571K8381K7133J8218O3381M7587j8873k219n7975k0410
13479C034904o2278K9173L8503L8166N2438L8866O058k4865n1590K1489n3932
13468C066932m4794N2643O3678o5796n0064o697K4039M877n2058J9437R3707Q5787
13456C191691q1630p0075j5402J3162j7147J00039J69432J9295j5593r231k8156
$$ y = [2794592, 2749723, 2688124, 2665682, 2723329, 2767541, 2862471, 2952852, 2936237, 2964468, 2882063, 2868579, 2881068, 2837646, 2831177, 2913103, 2965321, 2927555, 2887689, 2820013, 2838282, 2837391, 2750073, 2813175, 2830400, 2778487, 2771855, 2881627, 2900848, 2874019, 2887405, 2916754, 2992055, 3006780, 3028940, 2955928, 2851456, 2851821, 2869103, 2882257, 2931082, 3006127, 3048169, 3039361, 2955570, 2948975, 2978270, 3004011, 3012252, 2949681, 2978062, 3005195, 3023413, 3086794, 3134381, 3115508, 3113289, 3055314, 3034904, 2972626, 3001799, 3040302, 3078468, 3130906, 3169772, 3175830, 3150965, 3099375, 3120864, 3066932, 3022138, 3074781, 3138459, 3072663, 3022599, 3015902, 3039941, 3044818, 2992760, 3012197, 3105904, 3191691, 3110061, 3039986, 3024584, 3037746, 3020599, 3120638, 3290070, 3309365, 3293772, 3284541, 3256385]
13445C256385m0645P11K166K9833L6603k3024O612l4541M819O5505Q871m895J159
13432C309559J291N8864J293K3313k9670j4402N712p635k2197K8459J3907l7296
13420C331198m1154K8839N2382p207o02N418L7569J4102q402j7805o1733J3006
13408C345611L0060j7652j056J5218q233N1095Q711M9736k2685K981j1418m2224
13396C400144K6954L3112j8463K1389J16403N8652q6998r3308R154R0428Q2414
13385C639881j9543l7312l8196M2129J2922P466J2593J5669K9672n1230j9759
13374C594292Q7285O1278p1348k2308M2593k0256k5728J2358J5399j6121K9990
13363C687434J8195J2897Q0068K8527m6078J0927k974l2717o8415J5379j923k0632
$$ y = [3256385, 3215740, 3216451, 3218617, 3248450, 3285053, 3262029, 3268641, 3234100, 3238919, 3304424, 3313295, 3308400, 3309559, 3310850, 3369714, 3371007, 3394320, 3364650, 3350248, 3355960, 3348325, 3326128, 3354587, 3368494, 3331198, 3290044, 3318883, 3371265, 3364058, 3363456, 3368874, 3406443, 3420545, 3412143, 3394338, 3332605, 3345611, 3375671, 3358019, 3356963, 3372181, 3363948, 3415043, 3423754, 3473490, 3450805, 3453786, 3442368, 3400144, 3427098, 3460210, 3441747, 3463136, 3579539, 3638191, 3551193, 3457885, 3467039, 3557467, 3639881, 3620338, 3583026, 3544830, 3586959, 3599881, 3607347, 3619940, 3635609, 3665281, 3614051, 3594292, 3681577, 3742855, 3671507, 3649199, 3691792, 3671536, 3645808, 3658166, 3673565, 3657444, 3687434, 3705629, 3718526, 3798594, 3827121, 3781043, 3791970, 3788996, 3756279, 3687864, 3703243, 3701320, 3680688]
13351C680688O4086J9182M4300R786k8871N0189L4851R665n8473o0912J07430
13340C871921L9833o9187p177j5598L7569O8620j508N289M4795l7165r117m0117
13328C888158K5279Q2975l3203n4293j0517j0170R475O6272N4269J4190P6972
13317D109407K6774K9113J4132o6578o5382R174N4874k7747N3289L2084k0571
13306D148569m5972J736J725R009k5322K5489L9815N7588K6000k7307o5965m357
13294D141008M6822j8198J3537J3566O8588m9902O115K0403n113O5339j2864k2783
13282D266518k5075k7552O921M3526L0798k8673n567m4948r271l9632K059O9072
13270D238176M6858L2777M5113L7071O3420n5137j5437j7114M230L9135j1376
$$ y = [3680688, 3744774, 3763956, 3808256, 3818042, 3789171, 3839360, 3874211, 3883876, 3825403, 3764491, 3871921, 3911754, 3842567, 3835390, 3819792, 3857361, 3925981, 3924473, 3929762, 3974557, 3937392, 3928275, 3888158, 3913437, 3996412, 3963209, 3908916, 3898399, 3888229, 3897704, 3963976, 4018245, 4032435, 4109407, 4136181, 4165294, 4179426, 4112848, 4047466, 4056640, 4111514, 4083767, 4137056, 4169140, 4148569, 4102597, 4104333, 4106058, 4115067, 4089745, 4115234, 4155049, 4212637, 4238637, 4211330, 4145365, 4141008, 4187830, 4169632, 4183169, 4196735, 4265323, 4215421, 4221536, 4241939, 4236826, 4302165, 4289301, 4266518, 4241443, 4213891, 4220812, 4264338, 4295136, 4266463, 4260896, 4215948, 4206677, 4167045, 4169104, 4238176, 4285034, 4317811, 4362924, 4399995, 4463415, 4408278, 4392841, 4375727, 4379957, 4419092, 4407716]
13259D407716q682m3149m376P923L311n7461K0222J63191J9537J6291n580n1731
13247D467212n870k8118J50597M5194J1100J5767j6200j4609k525K0599j3771
13236D629376M4178m2689n3128L3223J5565L0752n5670n9432J1846K3092M3408
13225D620521O5941N1776j6597j3805N4632k0519o6690k3328l6059N0237R1283
13214D757392k151L0479j4204K038k2127m331k8063N4219Q3920M8950J8347O199
13202D930668P615J1508N1908k7580K7497P9258M1289N5407j7534l5824J3478
13191E137690K4135l2381l9607j8432j5202m2599o097j4029M3968N7971o910N2619
13179E141126M7015J6245l2437p641K2499j2765J870M5209P123m418K062L7931
$$ y = [4407716, 4399034, 4355885, 4351509, 4359432, 4362743, 4305282, 4325504, 4488695, 4508232, 4524523, 4518943, 4467212, 4461342, 4433224, 4583821, 4629015, 4640115, 4655882, 4639682, 4625073, 4622548, 4643147, 4629376, 4673554, 4630865, 4577737, 4610960, 4626525, 4657277, 4601607, 4542175, 4554021, 4577113, 4620521, 4686462, 4738238, 4721641, 4707836, 4762468, 4741949, 4675259, 4651931, 4615872, 4666109, 4757392, 4755241, 4785720, 4771516, 4773554, 4751427, 4747096, 4719033, 4773252, 4857172, 4906122, 4924469, 4930668, 4938283, 4949791, 5001699, 4974119, 5001616, 5080874, 5122163, 5177570, 5160036, 5124212, 5137690, 5161825, 5129444, 5089837, 5071405, 5056203, 5013604, 5007507, 4993478, 5037446, 5095417, 5088507, 5141126, 5188141, 5204386, 5171949, 5164308, 5186807, 5174042, 5175912, 5221121, 5228244, 5223826, 5225888, 5263819]
13167E263819L7291K0611K9173n027J6791r694n4361r976Q72L1123N0059K926
13155E373607J6905J4282L0675K8039Q209l5290L598R7969n2669l9177l0782l258
13143E412108O2452Q9460j6701p6745n364N0253J6063N4479K3283q6308P917J19101
13131E649998j8478k9952o0360j6266Q7180J9111L3028J00838K7232L174J9513
13120E815018l3091k7443n0251J3386n9715r000J01705P0569j4388m0609L8140
13109E804321j7456N1719L8384l4996j0615l1366R399K8788M3660L5049K1012
13098E937899J16174O4036o313M1792p140j8381k1730k1061j3751J0519j3000
13087F069044L2061J9699j5427m4001K2681P7967M3503m5150J5911K8337j6481
$$ y = [5263819, 5301110, 5321721, 5350894, 5345867, 5362658, 5352964, 5298603, 5288627, 5289499, 5320622, 5370681, 5373607, 5390512, 5404794, 5435469, 5463508, 5471717, 5436427, 5440025, 5537994, 5485325, 5446148, 5415366, 5412108, 5474560, 5564020, 5547319, 5470574, 5465210, 5515463, 5531526, 5586005, 5609288, 5522980, 5530897, 5649998, 5631520, 5601568, 5541208, 5524942, 5612122, 5631233, 5664261, 5765099, 5792331, 5795505, 5815018, 5781927, 5754484, 5704233, 5717619, 5657904, 5648904, 5750609, 5821178, 5806790, 5766181, 5804321, 5786865, 5838584, 5876968, 5841972, 5831357, 5799991, 5809390, 5838178, 5881838, 5916887, 5937899, 6054073, 6118109, 6111796, 6153588, 6146448, 6128067, 6106337, 6085276, 6071525, 6082044, 6069044, 6101105, 6120804, 6105377, 6061376, 6084057, 6162024, 6205527, 6160377, 6176288, 6204625, 6188144]
13076F188144j1488k4000K8795N2537N2250K8782l1650o1325J2427Q3544P1111
13065F389127L0782m7290K0642K1849N4677Q558M4566J665m3718j3141Q4565j0197
13053F542085l6406j7993K0956P3274m4508l0470M4282O9201K5942K8517M0025
13042F714905N1650M3166l740J5876n7010q2403J4616O3767J02014j3166p028
13031F842647l7740j00039R5850L5257K5509J7727K1634j3382L2609Q9662Q6122
13020G095856L8669n8108J9848Q160n7343M0009K3036m8289m431N3115K5591l4882
13008G101231K8088J00546N6668q0638j2473n9429p2823N5324P5853J3965K2179
12997G228491L0756N1595J9911K5395N3153J7537p1096p3344k7611o1455J26815
$$ y = [6188144, 6176656, 6152656, 6181451, 6233988, 6286238, 6315020, 6283370, 6222045, 6234472, 6318016, 6389127, 6419909, 6372619, 6393261, 6415110, 6469787, 6478345, 6522911, 6524576, 6480858, 6467717, 6552282, 6542085, 6505679, 6487686, 6508642, 6581916, 6537408, 6506938, 6551220, 6620421, 6646363, 6674880, 6714905, 6766555, 6809721, 6805981, 6821857, 6764847, 6682444, 6697060, 6760827, 6862841, 6849675, 6842647, 6804907, 6704868, 6800718, 6835975, 6861484, 6879211, 6900845, 6887463, 6920072, 7009734, 7095856, 7134525, 7076417, 7096265, 7104425, 7047082, 7087091, 7110127, 7061838, 7057407, 7110522, 7136113, 7101231, 7129319, 7229865, 7286533, 7205895, 7193422, 7133993, 7061170, 7116494, 7192347, 7206312, 7228491, 7259247, 7310842, 7330753, 7356148, 7409301, 7426838, 7355742, 7282398, 7254787, 7193332, 7320147]
12986G320147J89435N3451j4857p4522J0979l0875J7316J156j1360J0860J7200
12975G488930J1478n250K2047j9875N5941J8411M6280o3004m7685L2214R7729
12964G637216j571L541l1585M878J30521P1091m589J2472J9614p1097q5109R8475
12952G783857J79111M1810K6050k4692j7176O0604K1223j0599l487O4842J9339
12941H140882L0574J9117j6930m1750j5774l401O740Q6323P3256j114L4K1737
12929H299694J3100O2279k7780J7578J4613K2542r022L0876m7156M658J5981L6677
12917H434040j3436k7493P1857Q7630k6665m7013p379N4056P103L6859j5058j2792
12905H541709K1515M4363l529N7709J13179L1135K0709q7520l9822K6025q690
$$ y = [7320147, 7509582, 7563033, 7548176, 7473654, 7484633, 7453758, 7471074, 7472230, 7460870, 7471730, 7488930, 7500408, 7495158, 7517205, 7497330, 7553271, 7571682, 7617962, 7554958, 7507273, 7539487, 7637216, 7635645, 7639186, 7607601, 7612479, 7743000, 7814091, 7809502, 7821974, 7841588, 7770491, 7685382, 7783857, 7962968, 8004778, 8030828, 8006136, 7988960, 8049564, 8070787, 8060188, 8056701, 8121543, 8140882, 8171456, 8190573, 8173643, 8131893, 8116119, 8112718, 8119458, 8205781, 8279037, 8277923, 8277957, 8299694, 8312794, 8375073, 8347293, 8364871, 8379484, 8402026, 8393004, 8423880, 8376724, 8381382, 8397363, 8434040, 8420604, 8393111, 8464968, 8552598, 8525933, 8478920, 8471541, 8525597, 8532700, 8569559, 8554501, 8541709, 8563224, 8607587, 8604058, 8661767, 8774946, 8806081, 8826790, 8739270, 8699448, 8725473, 8716783]
12894H716783P8432J1247J1452R4997N6715j4081k9413o6157L4755R2169l8826
12883H948073m6295O6751n9725o124O7100P6645J00003L2548n3463N0825J03767
12872I280105J3608n2600J2436N3332j2592M9405J8722L2816j004K5730l2053
12861I387905j6639J8148K9932J1631N3728k746j3411j4758N2717M17K3823l6617
12849I494130L7093K8195K7290O4190j1330Q9275R4295o595m8936m8164n6873
12838I662570M2460K5374L1123K4962J03264Q2994q3712k9678P3145O4670M0118
12827A0037290o2461o7765l6404J0112K1519R6787O0599o020k1629J14221P4471
12816A0220720j5087n878N892p137J7145l604K8213M3241O630N8930O6180M004
$$ y = [8716783, 8795215, 8806462, 8817914, 8912911, 8969626, 8955545, 8926132, 8859975, 8894730, 8986899, 8948073, 8901778, 8968529, 8908804, 8902680, 8969780, 9046425, 9146428, 9178976, 9125513, 9176338, 9280105, 9293713, 9241113, 9253549, 9306881, 9294289, 9343694, 9362416, 9395232, 9394228, 9419958, 9387905, 9371266, 9389414, 9419346, 9430977, 9484705, 9481959, 9468548, 9453790, 9506507, 9506924, 9530747, 9494130, 9531223, 9559418, 9586708, 9650898, 9639568, 9728843, 9823138, 9816543, 9767607, 9719443, 9662570, 9705030, 9730404, 9761527, 9786489, 9889753, 9972747, 9889035, 9859357, 9932502, 9997172, 10037290, 9974829, 9907064, 9870660, 9880772, 9902291, 9999078, 10059677, 10053657, 10032028, 10146249, 10220720, 10205633, 10199755, 10205647, 10198510, 10215655, 10212051, 10240264, 10283505, 10290135, 10349065, 10415245, 10419249]
12804A0419249R156L4821L5121l2722L9551l5528J3693M6787R812M6899n701N5313
12792A0636451O7974j3302o2692J5568M9954L514n9502J2183N3227J2183M3649
12781A0759207L3514N7279j0190K2330L142m1756M5415L4026J53665J01260k2899
12770A1134993j9101p722J5675O3410n3032m618k5976Q9507L47o4477l062O4351
12758A1190295L0497J4039J4820O6402j41j844K9424m4260J0789Q6763M8825N058
12746A1450667n642n0392r0631J8068R6455P5772N6922N0395k0225j1092L0335
12735A1600632J7716J983j1738L4056L1902P6212N0758O6705O3j2201L4056J00766
12723A1990910N3078j18150p7845M7492L0693k5651m5057k5429P3699J00467O6723
$$ y = [10419249, 10428405, 10463226, 10498347, 10465625, 10505176, 10469648, 10483341, 10530128, 10539940, 10586839, 10581138, 10636451, 10704425, 10691123, 10628431, 10643999, 10693953, 10697467, 10637965, 10650148, 10703375, 10715558, 10759207, 10792721, 10850000, 10839810, 10862140, 10865282, 10823526, 10868941, 10902967, 11056632, 11157892, 11134993, 11115892, 11108170, 11123845, 11187255, 11134223, 11129605, 11103629, 11193136, 11193483, 11129006, 11125944, 11190295, 11220792, 11234831, 11249651, 11316053, 11315912, 11314068, 11343492, 11299232, 11310021, 11396784, 11445609, 11450667, 11445025, 11394633, 11304002, 11322070, 11418525, 11494297, 11551219, 11601614, 11581389, 11570297, 11600632, 11618348, 11620331, 11608593, 11642649, 11674551, 11750763, 11801521, 11868226, 11868289, 11856088, 11890144, 11990910, 12043988, 11925838, 11847993, 11895485, 11926178, 11900527, 11855470, 11830041, 11903740, 12004207, 12070930]
12712A2070930M0351m0336J4057k405L8381K7913r0431J9523M8192R6925M3145
12701A2266245L1285Q0260o014m2932k7651M472n1965p603L3580j6716K9665P1874
12689A2364500K7359O6201O7952K5174j4681m8651P730Q4965L6951p1188r134
12678A2537178L7453q828m1544L5552J03765J11380K4369K747n3723K1927J10763
12667A2881039j4302l6848k8370J9027N1296K2318L6524P0349k981J4213k2068
12656A2990197K7489J9324L3602J7982n2795J9611P7746J1763M0022K5107k0559
12645A3189489J6021N0499l1643k6644L2312L4076M5395m4836m9999n192K7610
12634A3237088K1783J024R7482M1435q6279p7779P3115Q9042K8714o392M4796
$$ y = [12070930, 12111281, 12070945, 12085002, 12082597, 12120978, 12148891, 12058460, 12077983, 12126175, 12223100, 12266245, 12297530, 12377790, 12371776, 12328844, 12301193, 12305665, 12253700, 12246097, 12279677, 12262961, 12292626, 12364500, 12391859, 12458060, 12526012, 12551186, 12536505, 12487854, 12495584, 12580549, 12617500, 12546312, 12537178, 12574631, 12565803, 12524259, 12559811, 12663576, 12774956, 12799325, 12802072, 12748349, 12770276, 12881039, 12866737, 12829889, 12801519, 12820546, 12871842, 12894160, 12930684, 13001033, 12998052, 13012265, 12990197, 13017686, 13037010, 13070612, 13088594, 13035799, 13055410, 13133156, 13144919, 13184941, 13210048, 13189489, 13205510, 13256009, 13224366, 13197722, 13230034, 13264110, 13309505, 13264669, 13214670, 13209478, 13237088, 13258871, 13259895, 13357377, 13398812, 13312533, 13234754, 13307869, 13396911, 13425625, 13419233, 13464029]
12623A3464029L1877J0728l2547p6607K7962P6659L8380q749r1253p1923J7369
12612A3385925R4191P7561R6877N9330p3783o4134J56427O1879J9444m3631J5561
12601A3785647m1224j2183M9762M0304M9155P053j15215o5919o945l621M2720
12590A3729534N5180K4527r454Q4179O8646l5980m6117O4632P9302K2496n1831
12579A3985114n538j3262k958K5458k1184j058N2966O5332J7290k4377Q860l9186
12567A4047457j8651o491k2799P849N3629M4221O1800M6422L4588R2o61K7485
12555A4274941M249N8152j1297n4270P098N2513o8049l3850M1181k0206P2532
12544A4322994R302k5067K8139O0214r5536m7350M6330K9541N933J7663M2686
$$ y = [13464029, 13495906, 13506634, 13474087, 13397480, 13425442, 13502101, 13540481, 13531732, 13440479, 13368556, 13385925, 13480116, 13557677, 13654554, 13713884, 13640101, 13575967, 13732394, 13794273, 13813717, 13770086, 13785647, 13744423, 13732240, 13782002, 13822306, 13871461, 13878514, 13763299, 13697380, 13690435, 13686814, 13729534, 13784714, 13809241, 13799787, 13883966, 13952612, 13916632, 13870515, 13935147, 14014449, 14036945, 13985114, 13979576, 13966314, 13963356, 13988814, 13967630, 13966572, 14019538, 14084870, 14102160, 14077783, 14086643, 14047457, 14028806, 14022315, 13999516, 14007365, 14060994, 14105215, 14167015, 14213437, 14248025, 14248117, 14247456, 14274941, 14279190, 14337342, 14326045, 14271775, 14278873, 14331386, 14263337, 14229487, 14270668, 14250462, 14322994, 14332296, 14307229, 14335368, 14395582, 14300046, 14252696, 14299026, 14328567, 14334500, 14352163, 14394849]
12533A4394849M8599j8356l4943m526L6720n1846l6467M2650K767R3007O7146
12522A4539600p4219m6570L7857M940K1100j4237p9841l390R1233K3660k1876
12511A4478257o291k3949k4813l4969N2698R2246M0187k8147o3194R294J3601
12500A4504920M4584k0792j7815K0496m4557p0261l0418k4284K1993n355P6918
12489A4455429M5137J6330k6188L5028j8050o467R7550l0417q9569m4318q399
12478A4426066Q4745J01059m65q8228k9689m9545m205K5117J5304k2599M895L3679
12466A4496134J3165k0517O9755O8830n3701q0203K3712L3778j9823l6968K7969
12455A4522131N593q0749p434L569J7529j6988n3350K9525m4835J6211j1982L6573
$$ y = [14394849, 14443448, 14425092, 14390149, 14385623, 14422343, 14370497, 14334030, 14376680, 14379447, 14472454, 14539600, 14465381, 14418811, 14456668, 14461608, 14482708, 14468471, 14388630, 14385240, 14476473, 14500133, 14478257, 14471966, 14448017, 14423204, 14388235, 14440933, 14533179, 14573366, 14545219, 14482025, 14491319, 14504920, 14549504, 14528712, 14510897, 14531393, 14486836, 14416575, 14386157, 14361873, 14383866, 14378511, 14455429, 14500566, 14516896, 14490708, 14525736, 14507686, 14501219, 14598769, 14568352, 14478783, 14434465, 14426066, 14510811, 14611870, 14611405, 14523177, 14493488, 14443943, 14439738, 14464855, 14480159, 14457560, 14462455, 14496134, 14509299, 14488782, 14558537, 14627367, 14573666, 14493463, 14517175, 14550953, 14531130, 14494162, 14522131, 14527724, 14446975, 14439541, 14443110, 14460639, 14443651, 14390301, 14419826, 14374991, 14391202, 14379220, 14415793]
12443A4415793j0867n8102J3806K0694L3239o616N1267m5069r3868p1912r832
12432A4238533J01406M4407j7757L645l6434N5997l2236o8777j2203o4424k8976
12421A4183181L3201J00500j3202J8154n132j8949l9691L0979o725q1130J2387
12410A4213573L8387J3205k8011n6081N516L1972l8940j00841J4950M3666J5531
12399A4152927n861n6378J0334m8663N0181P9598O1002k8367j36897m3424R009
12388A4043461o3987p3290k2399K9761K8966m2271M6829j4732J2132L6129j5756
12377A3964843K091n1638r3335j642j0925k7646j976Q3306L7188l7837p3351o578
12365A3782500L2352J7399k0159N725l2208K5844k8150n0802m5802P958q1210
$$ y = [14415793, 14404926, 14346824, 14360630, 14381324, 14414563, 14407947, 14459214, 14414145, 14320277, 14248365, 14238533, 14339939, 14384346, 14366589, 14370234, 14333800, 14389797, 14357561, 14288784, 14276581, 14212157, 14183181, 14216382, 14316882, 14303680, 14321834, 14316702, 14297753, 14258062, 14289041, 14282316, 14201186, 14213573, 14251960, 14265165, 14237154, 14181073, 14186589, 14218561, 14179621, 14078780, 14093730, 14137396, 14152927, 14147066, 14090688, 14101022, 14052359, 14102540, 14182138, 14243140, 14214773, 14077876, 14034452, 14043461, 13979474, 13906184, 13883785, 13913546, 13942512, 13900241, 13947070, 13932338, 13944470, 13980599, 13964843, 13966934, 13915296, 13821961, 13820319, 13809394, 13781748, 13779772, 13863078, 13900266, 13862429, 13789078, 13782500, 13814852, 13832251, 13812092, 13817817, 13785609, 13811453, 13783303, 13732501, 13686699, 13694657, 13613447]
12354A3613447p0679N7036M2343j8655p2299k1646n5209P5175P2012l4596k445
12343A3584484m4529k6628q574m2912o3266k3989P290p682n0517l3209J4250M124
12331A3308842J6097p513L7590K1771l6270j15848O58l6292r1726J9436J3420
12320A3130165l263j7676J2855R098K8324j09723l6039o188n0808m7219m299M7793
12308A2953020M3593q4864j38231J6008K0527l5984n5120L2555J1362r3352k8180
12297A2641334K4787j8714L0564L9904K1270m4154o1100J1984M6647m7741o4170
12286A2580611l8865m7656m1098K6914O7541R993k1027o2777j7909j6565k9429
12275A2409733m8989l9457Q0100J072K8705l6209o8353M4288J614o3954l1751
$$ y = [13613447, 13542768, 13599804, 13642147, 13623492, 13551193, 13529547, 13474338, 13549513, 13621525, 13586929, 13584484, 13539955, 13513327, 13504753, 13461841, 13398575, 13374586, 13381876, 13374194, 13323677, 13290468, 13304718, 13308842, 13324939, 13317426, 13355016, 13376787, 13340517, 13224669, 13225327, 13189035, 13097309, 13116745, 13130165, 13126902, 13109226, 13122081, 13131179, 13159503, 13049780, 13013741, 13007553, 12956745, 12909526, 12905227, 12953020, 12996613, 12911749, 12773518, 12789526, 12810053, 12774069, 12718949, 12751504, 12762866, 12669514, 12641334, 12666121, 12647407, 12677971, 12717875, 12739145, 12694991, 12633891, 12645875, 12692522, 12644781, 12580611, 12541746, 12494090, 12452992, 12479906, 12547447, 12557440, 12536413, 12473636, 12455727, 12439162, 12409733, 12360744, 12321287, 12401387, 12402459, 12431164, 12394955, 12326602, 12370890, 12372504, 12308550, 12276799]
12264A2276799k3160r6798p2285j7879J4868M9640n9213j04829K063N7529k3580
12253A2003155p9543l0785P399n5302P386m4611L2296r7064K3875K1391j2586
12242A1775611K5787o4960q6700j508J6073n1745k0931n4039r7978M066N7947
12231A1501623m771p878O0733l7281o6011J0561P2363n6531r5076k2154m7557
12220A1308021J5251L945n6712o7165M9109k6470m503j0878o3193k9442k9924
12209A1088039j1967o3860k3193N2466N3000m5341K626o8153J6602N9193k4495
12198A1034917j20516j378r534n5743J5563j8882k8237k3493j6092k9418J4179
12187A0761366n8494j05020q7314m6814R488M1802J1560n7081m4674L9742K8746
$$ y = [12276799, 12253639, 12156841, 12084556, 12066677, 12081545, 12131185, 12071972, 11967143, 11969206, 12026735, 12003155, 11923612, 11892827, 11900226, 11844924, 11852310, 11807699, 11839995, 11742931, 11766806, 11788197, 11775611, 11801398, 11736438, 11649738, 11648230, 11664303, 11612558, 11591627, 11537588, 11439610, 11443676, 11501623, 11496852, 11488974, 11549707, 11512426, 11446415, 11456976, 11529339, 11472808, 11377732, 11355578, 11308021, 11323272, 11327217, 11270505, 11203340, 11252449, 11225979, 11221476, 11210598, 11147405, 11117963, 11088039, 11076072, 11012212, 10989019, 11041485, 11094485, 11049144, 11051770, 10983617, 11000219, 11059412, 11034917, 10914401, 10913023, 10903489, 10847746, 10863309, 10844427, 10816190, 10792697, 10776605, 10747187, 10761366, 10702872, 10597852, 10510538, 10463724, 10473212, 10515014, 10526574, 10469493, 10424819, 10464561, 10493307]
12176A0493307J9529J1327l7419K9827l8735R353K1977n7263l3152J6980k5699
12165A0410032l9940o3146m3590k6196J8969m4720k5782M4156J7805o8758m7713
12154A0131117n5100k5015L8951p714j8519j6892k5065o0567o6652p792m3709
12143I843043Q501m240O3852N2481l3050m7030n7909j50992j7098M4733m8110
12132I654181K521l5260o1380k3206l0994N881n7365q1755Q1177o833n1668J1210
12120I406509k8154q8161M0114M9022R229J866m9800l3931r0020k3768j214j5061
12108I176631M1826o4451q8829k8493k0943l5990m1490m1485N302J2541K6116
12097H940735p6027K9333J06660R328p9835m1641K0302o035k4633j5630l4753
$$ y = [10493307, 10512836, 10524163, 10486744, 10516571, 10477836, 10487189, 10509166, 10451903, 10418751, 10435731, 10410032, 10370092, 10306946, 10263356, 10237160, 10256129, 10211409, 10185627, 10229783, 10247588, 10178830, 10131117, 10076017, 10051002, 10089953, 10082239, 10063720, 10046828, 10021763, 9961196, 9894544, 9886752, 9843043, 9851544, 9847304, 9911156, 9963637, 9930587, 9883557, 9825648, 9674656, 9657558, 9702291, 9654181, 9656702, 9621442, 9560062, 9536856, 9505862, 9511743, 9454378, 9372623, 9453800, 9446967, 9395299, 9406509, 9378355, 9290194, 9330308, 9379330, 9388559, 9390425, 9340625, 9306694, 9216674, 9192906, 9191692, 9176631, 9218457, 9154006, 9065177, 9036684, 9015741, 8979751, 8938261, 8896776, 8902078, 8914619, 8940735, 8864708, 8894041, 9000701, 9010029, 8930194, 8888553, 8908855, 8902820, 8878187, 8862557, 8827804]
12086H827804p332p625n4409p0275n9440J7o0487r0659m6354M029K99j08J6988
12073H452448m711q0562O481o103N3211q625J0920q913L6473q118l5205k0883
12061H386413l0810K4428P618L5424O35j5062r6120q5330n5082m9840p3125J00679
12049H149828R880p0898r7238m3658K9700m3842l2680K6147k2039p9493L4557
12038G860264K9954j16711o4695R5099Q879p3713N9853Q2098j6739m2602r1445
12027G730242l7295L0487n0703q1356K7683M6037l2496k8593l3157k5380n2334
12016G493135j3512k966K4034m9262j1772j4846n3740j7473L0058n4341n8092
12005G271223L1783o736m6778J188L5801p9451m2813K3065l7047n9512k8924l8659
$$ y = [8827804, 8820472, 8812847, 8758438, 8688163, 8628723, 8628740, 8568253, 8477594, 8431240, 8435269, 8435568, 8435460, 8452448, 8447737, 8367175, 8373656, 8367553, 8420764, 8412139, 8423059, 8414146, 8450619, 8442501, 8407296, 8386413, 8355603, 8380031, 8387649, 8423073, 8423708, 8408646, 8312526, 8227196, 8172114, 8122274, 8049149, 8149828, 8159708, 8088810, 7991572, 7947914, 7977614, 7933772, 7901092, 7927239, 7905200, 7825707, 7860264, 7890218, 7773507, 7708812, 7803911, 7812790, 7739077, 7798930, 7881028, 7864289, 7821687, 7730242, 7692947, 7723434, 7672731, 7591375, 7619058, 7665095, 7632599, 7604006, 7570849, 7545469, 7493135, 7479623, 7476657, 7500691, 7451429, 7439657, 7424811, 7371071, 7353598, 7383656, 7329315, 7271223, 7303006, 7296270, 7249492, 7250680, 7286481, 7207030, 7164217, 7187282, 7150235, 7090723, 7061799, 7023140]
11993G023140L6591m6676l5978K6864m164j02591L9800R0567j0596K7259J4501
11982G058717j8522n9982p5763m031O2225m6110j08205q2612L3767J02983M054
11971F866521l339J0016k9453p2206j09842K1102J4697M6244j395r0759q2579
11960F569007m4944l8214m4091J5911j0707m7678n5721m776K0978r244K2859K645
11948F376025l6989m119l0962N2881J34247k2253q2512j18122m1107J6170J8792
11937F262051k1627J7619j3237L9342j3042K5543j04309p1984M2838p5718n9745
11926F027731L3511j673L842N5648j4556n2967j5036n7419o0190L3450L1941l8676
11914E945606n5430m0210l2618l4920O9347O524J6107J8780r262n0095j16292
$$ y = [7023140, 7059731, 7013055, 6977077, 7003941, 6999777, 6897186, 6936986, 7027553, 7016957, 7044216, 7058717, 7040195, 6980213, 6904450, 6900419, 6962644, 6916534, 6808329, 6725717, 6759484, 6862467, 6866521, 6863182, 6873198, 6843745, 6771539, 6661697, 6682799, 6697496, 6743740, 6742345, 6651586, 6569007, 6524063, 6485849, 6441758, 6457669, 6446962, 6399284, 6343563, 6338787, 6359765, 6350521, 6373380, 6376025, 6339036, 6334917, 6303955, 6356836, 6491083, 6468830, 6386318, 6268196, 6227089, 6243259, 6262051, 6240424, 6258043, 6244806, 6284148, 6271106, 6296649, 6192340, 6120356, 6163194, 6087476, 6027731, 6061242, 6059569, 6063411, 6119059, 6104503, 6051536, 6036500, 5979081, 5918891, 5952341, 5984282, 5945606, 5890176, 5849966, 5817348, 5782428, 5851775, 5858299, 5874406, 5893186, 5883924, 5833829, 5717537]
11903E717537J2835J1956l7896l6529J834K9047R3371M3493k4977k7342J1554
11892E794883m7643J7930L0310l8831j4414M1509o1514j56620K765N2867l657
11881E617585l8412p1671o9024L4965k5495n056N4000J8657m6354l4559R310m3323
11869E400623P3939j2018o8675k9761j9772K0399J7448j1124n3934n177j8635
11858E293313k5939J7053r8026j48814l8810J9270N9895k5179J1062O8193j5999
11847E116019m2124j7294K7550j0023k3608j0958k9938m6038j0378M4372q38q3074
11835D913668J3423m0565K6820m326J5501K9168k950j4711k9379k9853m6329l301
11823D827166o583m4690L8391m230p4511p0547j1711J8725k3101R702L4999l0326
$$ y = [5717537, 5730372, 5742328, 5704432, 5667903, 5669737, 5698784, 5792155, 5835648, 5810671, 5783329, 5794883, 5747240, 5765170, 5795480, 5756649, 5742235, 5783744, 5722230, 5565610, 5568375, 5621242, 5617585, 5579173, 5507502, 5438478, 5473443, 5447948, 5442892, 5496892, 5515549, 5469195, 5434636, 5443946, 5400623, 5474562, 5462544, 5393869, 5364108, 5344336, 5364735, 5382183, 5371059, 5317125, 5311948, 5293313, 5267374, 5284427, 5186401, 5037587, 4998777, 5018047, 5077942, 5052763, 5063825, 5132018, 5116019, 5073895, 5056601, 5084151, 5074128, 5050520, 5039562, 5009624, 4963586, 4953208, 4997580, 4996742, 4913668, 4927091, 4886526, 4913346, 4909020, 4924521, 4953689, 4950739, 4936028, 4906649, 4876796, 4830467, 4827166, 4820583, 4775893, 4814284, 4810054, 4735543, 4664996, 4653285, 4672010, 4648909, 4658611, 4693610, 4663284]
11811D663284k2828K2414j4257j6705r596K2712K9622l9287K7863M0824m959m9443
11799D649644p1100j4759m107j3664K7113N9705q005n9864r7008l0305K4036N7233
11787D518919o6689j8122M19J2295J8915l5281j9029k3642m6245n4862j0948o6727
11775D209003k8673L3227l039K1399n6108k5864N2159Q6299o809l2446n9862j5045
11763D174241N8959M7602j2582n2330m5712j4852r203j9696n58K38L8322q145
11751D156284q8676o8242M3176j6150j1914K6277P0085p3216k8865l1327l1996
11740C945436j2705M286K1187K1133o266J2837K7092k390l3603r0720o4944n9658
11728C761685L6749M5284m5495m6459o9403j1904M9341M4855M1401J6350L8327
$$ y = [4663284, 4640456, 4662870, 4648613, 4631908, 4622312, 4645024, 4674646, 4635359, 4663222, 4704046, 4699087, 4649644, 4578544, 4563785, 4559678, 4546014, 4573127, 4632832, 4624827, 4564963, 4467955, 4437650, 4461686, 4518919, 4452230, 4434108, 4434527, 4446822, 4465737, 4430456, 4411427, 4387785, 4341540, 4286678, 4275730, 4209003, 4180330, 4213557, 4210518, 4231917, 4175809, 4149945, 4202104, 4288403, 4281594, 4249148, 4189286, 4174241, 4233200, 4280802, 4268220, 4215890, 4170178, 4155326, 4146123, 4126427, 4125869, 4126107, 4164429, 4156284, 4067608, 3999366, 4042542, 4026392, 4014478, 4040755, 4110840, 4037624, 4008759, 3977432, 3945436, 3932731, 3937017, 3958204, 3979337, 3973071, 3985908, 4013000, 4010610, 3977007, 3886287, 3821343, 3761685, 3798434, 3843718, 3798223, 3751764, 3682361, 3670457, 3719798, 3764653, 3806054, 3822404, 3860731]
11717C860731j513m5409j0681J6095k8821p1331N9585K7553j3096M4663n370L7648
11705C870054m7292l9455l1852p966m5544r4598K4346m4970l7211k3638m2917
11694C478957j4646n870J03251J7672K4038o9936k1800J2905J0686k0552L0672
11683C545377k8896m1126n9828j2750L6137j4106k3969M8448q6323r5237N4606
11672C322333O8918j0631k7924l8625j1442K0959J16615J8568N5522J8505p9545
11661C453253l5191l1836J7315o9749j22618l6165N6665K2716L8870k8310m1649
11650C223301j0525l213K3196k7087q884j5885K6826M0394m8433o444J6354J9462
11638C229062K0595p4300R918m8748l6057P2964r780J3734j0506j08000m2193
$$ y = [3860731, 3859218, 3813809, 3803128, 3819223, 3790402, 3719071, 3778656, 3806209, 3793113, 3837776, 3832406, 3870054, 3822762, 3783307, 3751455, 3743489, 3697945, 3603347, 3627693, 3582723, 3545512, 3521874, 3478957, 3464311, 3458441, 3561692, 3579364, 3603402, 3533466, 3511666, 3524571, 3535257, 3514705, 3545377, 3516481, 3475355, 3415527, 3402777, 3438914, 3424808, 3400839, 3449287, 3362964, 3267727, 3322333, 3391251, 3380620, 3352696, 3314071, 3302629, 3323588, 3440203, 3458771, 3514293, 3532798, 3453253, 3418062, 3386226, 3403541, 3333792, 3211174, 3175009, 3231674, 3254390, 3293260, 3264950, 3223301, 3212776, 3209563, 3232759, 3205672, 3196788, 3180903, 3207729, 3248123, 3199690, 3193246, 3209600, 3229062, 3249657, 3175357, 3185275, 3136527, 3100470, 3173434, 3163654, 3177388, 3166882, 3058882, 3016689]
11627C016689p172Q4641M3106j0965m4207J6527J9017k050m0535p5039j0781N8245
11615C047476p726o312K3219J4758q6363K0924O6048j8108n3317k3542k0790K850
11603B959117L6715m5756l9397K4641O4485N9996j5465j4145j42617p2368J14768
11592B929974P334L0370n7727n0075K0461q501l2933j9293L0573J2846k5915j5205
11580B821909k5290J285J03273M0510j4224p9575p9564K7645n3776O2564q992
11569B795765M1198M9721q127j13902p2366P375L1351j0103o0412J9176K7880
11558B707556O185r740r9248q6358K1649M3624j8594n1190K2770k6904M3228K179
11546B555157k2712J740K661m8714p0252m834J5850K8432R5758M942L0639J3211
$$ y = [3016689, 3009517, 3094158, 3137264, 3126299, 3082092, 3098619, 3117636, 3115586, 3075051, 3000012, 2989231, 3047476, 3039750, 3033438, 3056657, 3071415, 2985052, 3005976, 3072024, 3053916, 3000599, 2977057, 2956267, 2959117, 2995832, 2950076, 2910679, 2935320, 2999805, 3059801, 3044336, 3030191, 2887574, 2815206, 2929974, 2937308, 2967678, 2909951, 2859876, 2880337, 2871836, 2838903, 2819610, 2850183, 2863029, 2837114, 2821909, 2796619, 2797904, 2901177, 2941687, 2927463, 2847888, 2768324, 2795969, 2742193, 2804757, 2795765, 2836963, 2886684, 2878557, 2764655, 2692289, 2699664, 2731015, 2720912, 2660500, 2679676, 2707556, 2713741, 2704001, 2604753, 2518395, 2540044, 2583668, 2565074, 2513884, 2536654, 2509750, 2552978, 2555157, 2532445, 2534185, 2536846, 2488132, 2417880, 2413046, 2428896, 2457328, 2553086, 2558028, 2588667, 2601878]
11534B601878J7579K7908N357n0273J4945N162r5866o9937K7089K03M6501l6762
11522B493784p6433M5194N436J7923m1597J9970j3240n7197l4728k8889l5586
11511B294637k2637M8806M9191N7747N6087Q311j9395o5563o6421N0225P1932
11500B462920K1052j5670n7086M413m7074m3815K085j6156J1658L9259k8700L4302
11488B367188L3389j27239o3663J14286N3987r48j9129k3113M9517j974l9665
11477B342636l2962o4589j620r602j5825Q389k2631j6597J2622J8248N1255l1112
11465B238212o0829m0551M503o477k9054M0065M7124j4869j214N363j0420K5676
11453B197529R5805M5698p6967l1778J8765J6496k7184j05206j3407o1341n2272
$$ y = [2601878, 2619457, 2647365, 2652722, 2602449, 2617394, 2622556, 2526690, 2456753, 2483842, 2484045, 2530546, 2493784, 2417351, 2462545, 2467981, 2485904, 2444307, 2464277, 2451037, 2393840, 2359112, 2330223, 2294637, 2272000, 2320806, 2369997, 2427744, 2483831, 2492142, 2472747, 2407184, 2340763, 2390988, 2462920, 2483972, 2468302, 2411216, 2415629, 2368555, 2324740, 2326825, 2310669, 2322327, 2361586, 2332886, 2367188, 2400577, 2273338, 2209675, 2323961, 2377948, 2377000, 2357871, 2334758, 2384275, 2382301, 2342636, 2309674, 2245085, 2243465, 2233863, 2218038, 2226427, 2203796, 2187199, 2199821, 2218069, 2269324, 2238212, 2177383, 2136832, 2141335, 2134858, 2105804, 2145869, 2192993, 2178124, 2176910, 2182273, 2171853, 2197529, 2293334, 2339032, 2262065, 2230287, 2249052, 2265548, 2238364, 2133158, 2119751, 2058410, 2006138]
11442B006138k7318J5488K5831N5110O7088k4749j3630M535m963O351n9889q8928
11430A961064l9059N6867L1102L7789J4301n9021k2717L2693m2808j6082N9156
11419B013285M0815k3718p29N5441K7977j08403k9217K0424L1695n844J9390K798
11407B043914R540j4313M3914m3850j10722M3603m277M790j414j4550K538m4389
11395A914784j3236L9013k8661m4191N4541N6491r831Q180k9720J8400j2889n7578
11383A895303l6244p578j4470l6455L5707J7267Q411n8940q5435M673J212N8763
11371A782214J26950K5915J8499l1047L3010k7100j2717l1145q956j5999J5433
11360A875057j2095p5305l9706M5998L9982J7874l3830j2505J8435o2012m7151
$$ y = [2006138, 1978820, 1994308, 2020139, 2075249, 2142337, 2117588, 2103958, 2108493, 2103530, 2109881, 2049992, 1961064, 1922005, 1978872, 2009974, 2047763, 2062064, 2003043, 1980326, 2013019, 1970211, 1954129, 2013285, 2054100, 2030382, 2029653, 2085094, 2113071, 2004668, 1975451, 1995875, 2027570, 2021726, 2041116, 2043914, 2053454, 2039141, 2083055, 2039205, 1928483, 1972086, 1967809, 1972599, 1971185, 1956635, 1959173, 1914784, 1901548, 1940561, 1911900, 1867709, 1922250, 1978741, 1968910, 1977090, 1947370, 1965770, 1952881, 1895303, 1859059, 1851481, 1837011, 1800556, 1836263, 1853530, 1861941, 1803001, 1717566, 1722239, 1723451, 1782214, 1909164, 1935079, 1953578, 1922531, 1955541, 1928441, 1915724, 1884579, 1875623, 1859624, 1875057, 1862962, 1787657, 1747951, 1793949, 1833931, 1851805, 1817975, 1805470, 1823905, 1761893, 1714742]
11349A714742L0794n858m7986o1979L2479k9958m4974M4568O560R028M846n4211
11337A598051o3692m322K3579M3327M6229N1304J3284M36o5563q7988N538O1789
11325A621972K3740L809L3750j7042q8164j22039J4680J06283J20631P8562k0743
$$ y = [1714742, 1745536, 1739678, 1691692, 1629713, 1662192, 1632234, 1587260, 1631828, 1638388, 1647416, 1652262, 1598051, 1534359, 1530037, 1553616, 1596943, 1643172, 1694476, 1707760, 1708196, 1642633, 1554645, 1560183, 1621972, 1645712, 1649521, 1683271, 1666229, 1578065, 1456026, 1470706, 1576989, 1697620, 1776182, 1755439]
$$ [...]
##END NTUPLES=NMR SPECTRUM
##END=
