##TITLE=Analysis number 329569
Compound Code cc 00706
Project Code adrs
Chemist Name af chempharm
##JCAMPDX= 6.0         $$ Bruker NMR JCAMP-DX V2.0
##DATA TYPE= NMR SPECTRUM
##DATA CLASS= NTUPLES
##ORIGIN= Bruker BioSpin GmbH
##OWNER= nmr
$$ XWIN-NMR		Version 3.5
$$ Fri Sep 14 09:28:33 2007 GMT Daylight Time (UT+1h)  MAYBRIDGE\nmr@NMR_250MHZ
##.OBSERVE FREQUENCY= 250.131544655141
##.OBSERVE NUCLEUS= ^1H
##.ACQUISITION MODE= SIMULTANEOUS (DQD)
##.ACQUISITION SCHEME= undefined
##.AVERAGES= 16
##.DIGITISER RES= 18
##SPECTROMETER/DATA SYSTEM= dpx250
##.PULSE SEQUENCE= zg30
##.SOLVENT NAME= CDCl3
##.SHIFT REFERENCE= (INTERNAL, CDCl3, 0, 16.522)
##AUDIT TRAIL= $$ (NUMBER, WHEN, WHO, WHERE, WHAT)
$$ ##TITLE= Audit trail, XWIN-NMR		Version 3.5
$$ ##JCAMPDX= 5.01
$$ ##ORIGIN= Bruker BioSpin GmbH
$$ ##OWNER= nmr
$$ C:\u/data/dgb/nmr/ADRS/1590/pdata/1/auditp.txt
$$ ##AUDIT TRAIL=  $$ (NUMBER, WHEN, WHO, WHERE, WHAT)
(   1,<2007-09-14 09:28:11.92 +100>,<MAYBRIDGE\nmr>,<NMR_250MHZ>,
      <created by zg, POWCHK disabled, PULCHK disabled
       configuration hash MD5:
       76 6E 9A 78 1E 09 19 81 EC 84 63 8F B0 6A 59 2D
       data hash MD5: 64K
       17 99 AF C0 65 45 AF CC C3 B7 85 22 E1 39 B9 34>)
(   2,<2007-09-14 09:28:23.85 +100>,<MAYBRIDGE\nmr>,<NMR_250MHZ>,
      <Start of raw data processing
       ef LB = 0.3 FT_mod = 6 PKNL = 1 SI = 32K 
       data hash MD5: 32K
       AD 4F C9 3B 40 89 87 0F 6A 1A 0E C5 D3 AF E6 68>)
(   3,<2007-09-14 09:28:25.51 +100>,<MAYBRIDGE\nmr>,<NMR_250MHZ>,
      <apk 
       data hash MD5: 32K
       DE 1E 31 54 4E 73 9D 6B 23 6C 99 F7 17 7B 54 B0>)
(   4,<2007-09-14 09:28:26.23 +100>,<MAYBRIDGE\nmr>,<NMR_250MHZ>,
      <abs ABSG = 5 
       data hash MD5: 32K
       DD 73 AE A8 BE 44 78 03 2C A4 8B B5 12 84 DB F4>)
$$ ##END=
$$ 
$$ hash MD5
$$ 47 A9 21 CB E4 F3 DC 60 93 3B A3 70 DB CE 33 41
##$RELAX= 
##$RELAX= 
##$RELAX= 
##$RELAX= 
##$RELAX= 
##$RELAX= 
##$RELAX= 
$$ Bruker specific parameters
$$ --------------------------
##$DU= <C:\u>
##$EXPNO= 1590
##$NAME= <ADRS>
##$PROCNO= 1
##$TYPE= <nmr>
##$USER= <dgb>
##$AMP= (0..31)
100 100 100 100 100 100 100 100 100 100 100 100 100 100 100 100 100 100 
100 100 100 100 100 100 100 100 100 100 100 100 100 100 
##$AQSEQ= 0
##$AQ_mod= 3
##$AUNM= <au_zg>
##$AUTOPOS= <7 >
##$BF1= 250.13
##$BF2= 250.13
##$BF3= 250.13
##$BF4= 250.13
##$BF5= 500.13
##$BF6= 500.13
##$BF7= 500.13
##$BF8= 500.13
##$BYTORDA= 1
##$CFDGTYP= 0
##$CFRGTYP= 5
##$CHEMSTR= <none>
##$CNST= (0..31)
1 1 145 1 1 1 1 1 1 1 1 1 1 1 1 1 1 1 1 1 1 1 1 1 1 1 1 1 1 1 1 1 
##$CPDPRG= <>
##$CPDPRG1= <>
##$CPDPRG2= <>
##$CPDPRG3= <>
##$CPDPRG4= <mlev>
##$CPDPRG5= <mlev>
##$CPDPRG6= <mlev>
##$CPDPRG7= <mlev>
##$CPDPRG8= <mlev>
##$CPDPRGB= <>
##$CPDPRGT= <>
##$D= (0..31)
0 1 0 0 0 0 0 0 0 0.06 0 0 0 0 0 0 0.0002 0 0 0 0 0 0 0 0 0 0 0 0 0 0 
0 
##$DATE= 1189758491
##$DBL= (0..7)
120 120 120 120 120 120 120 120 
##$DBP= (0..7)
150 150 150 150 150 150 150 150 
##$DBP07= 0
##$DBPNAM0= <>
##$DBPNAM1= <>
##$DBPNAM2= <>
$$ [...]
##$SUBNAM7= <"">
##$SUBNAM8= <"">
##$SUBNAM9= <"">
##$SW= 20.6930455092707
##$SWIBOX= (0..15)
0 0 3 0 0 0 0 0 0 0 0 0 0 0 0 0 
##$SW_h= 5175.983436853
##$TD= 65536
##$TD0= 1
##$TE= 296.16
##$TE2= 300
##$TE3= 300
##$TEG= 300
##$TL= (0..7)
0 120 120 120 120 120 120 120 
##$TP= (0..7)
150 150 150 150 150 150 150 150 
##$TP07= 0
##$TPNAME0= <>
##$TPNAME1= <>
##$TPNAME2= <>
##$TPNAME3= <>
##$TPNAME4= <>
##$TPNAME5= <>
##$TPNAME6= <>
##$TPNAME7= <>
##$TPOAL= (0..7)
0.5 0.5 0.5 0.5 0.5 0.5 0.5 0.5 
##$TPOFFS= (0..7)
0 0 0 0 0 0 0 0 
##$TUNHIN= 0
##$TUNHOUT= 0
##$TUNXOUT= 0
##$USERA1= <user>
##$USERA2= <user>
##$USERA3= <user>
##$USERA4= <user>
##$USERA5= <user>
##$V9= 5
##$VALIST= <valist>
##$VCLIST= <CCCCCCCCCCCCCCC>
##$VD= 0
##$VDLIST= <DDDDDDDDDDDDDDD>
##$VPLIST= <PPPPPPPPPPPPPPP>
##$VTLIST= <TTTTTTTTTTTTTTT>
##$WBST= 1024
##$WBSW= 4
##$XGAIN= (0..3)
0 0 0 0 
##$XL= 0
##$YL= 0
##$YMAX_a= 423789
##$YMIN_a= -424138
##$ZGOPTNS= <>
##$ZL1= 120
##$ZL2= 120
##$ZL3= 120
##$ZL4= 120
##$ABSF1= 16.522
##$ABSF2= -4.171173
##$ABSG= 5
##$ABSL= 3
##$ALPHA= 0
##$AQORDER= 0
##$ASSFAC= 0
##$ASSFACI= 0
##$ASSFACX= 0
##$ASSWID= 0
##$AUNMP= <proc_1d>
##$AZFE= 0.1
##$AZFW= 0.1
##$BCFW= 0
##$BC_mod= 0
##$BYTORDP= 0
##$COROFFS= 0
##$CY= 12.5
##$DATMOD= 1
##$DC= 0
##$DFILT= <>
##$DTYPP= 0
##$F1P= 14.0000005364418
##$F2P= -0.99999901652339
##$FCOR= 0.5
##$FTSIZE= 32768
##$FT_mod= 6
##$GAMMA= 0
##$GB= 0
##$INTBC= 1
##$INTSCL= 1
##$ISEN= 128
##$LB= 0.3
##$LEV0= 0
##$LPBIN= 0
##$MAXI= 10000
##$MC2= 0
##$MEAN= 0
##$ME_mod= 0
##$MI= 0
##$NCOEF= 0
##$NC_proc= -3
##$NLEV= 6
##$NOISF1= 0
##$NOISF2= 0
##$NSP= 0
##$NTH_PI= 0
##$NZP= 0
##$OFFSET= 16.522
##$PC= 1
##$PHC0= -59.24846
##$PHC1= 3.616067
##$PH_mod= 1
##$PKNL= yes
##$PPARMOD= 0
##$PSCAL= 4
##$PSIGN= 0
##$REVERSE= no
##$SF= 250.13
##$SI= 32768
##$SIGF1= 0
##$SIGF2= 0
##$SINO= 400
##$SIOLD= 32768
##$SREGLST= <1H.CDCl3>
##$SSB= 0
##$STSI= 32768
##$STSR= 0
##$SW_p= 5175.98343685301
##$SYMM= 0
##$S_DEV= 0
##$TDeff= 65536
##$TDoff= 0
##$TI= <Analysis number 999999
Compound Code 99
Book Reference 9
Project Code 9>
##$TILT= no
##$TM1= 0
##$TM2= 0
##$TOPLEV= 0
##$USERP1= <user>
##$USERP2= <user>
##$USERP3= <user>
##$USERP4= <user>
##$USERP5= <user>
##$WDW= 1
##$XDIM= 32768
##$YMAX_p= 475062761
##$YMIN_p= -106479
$$ End of Bruker specific parameters
$$ ---------------------------------
##NTUPLES= NMR SPECTRUM
##VAR_NAME=  FREQUENCY,     SPECTRUM/REAL,   SPECTRUM/IMAG
##SYMBOL=    X,             R,               I
##VAR_TYPE=  INDEPENDENT,   DEPENDENT,       DEPENDENT
##VAR_FORM=  AFFN,          ASDF,            ASDF
##VAR_DIM=   32768,         32768,           32768
##UNITS=     HZ,            ARBITRARY UNITS, ARBITRARY UNITS
##FACTOR=    0.157963299565203, 1,           1
##FIRST=     4132.6476996994, 0,             0
##LAST=      -1043.33573715361, 0,           0
##MIN=       -1043.33573715361, -106479,     0
##MAX=       4132.6476996994, 475062761,     0
$$ Real data points
##PAGE= N=1
##DATA TABLE= (X++(R..R)), XYDATA
$$ [...]
$$ plain form
16266 -7742 -10119 7458 21889 25534 32502 37297 42149 37611 50524 47207 28026 14928 5522
16253 5522 9637 37006 58848 63182 55439 40874 15439 18898 39108 6975 -8468 3184 11828
16240 11828 11872 8429 18313 41183 40666 44045 28948 10038 -3252 -924 15140 30844 29932 33223
16226 33223 35371 35524 53611 53039 59138 44956 33623 49634 68130 69123 69280 90550 107700 109243
16212 109243 103064 110254 110259 88800 98741 76102 50929 55634 49475 39931 53547 68613 77845 71591
16198 71591 61067 71233 72565 78791 84044 97844 95277 95604 78326 77980 102447 122522 146867
16185 146867 150651 138679 127710 111086 87892 111243 132628 121256 130776 181343 190331 181083
16173 181083 194512 210336 193424 169573 185136 191569 190868 186365 201002 218988 240817 257546
$$ packed form
16266g742k377J7577J4431L645O968M795M852m538J2913l317j9181j3098r406
16253E522M115K7369K1842M334p743j4565k5435L459K0210l2133j5443J1652Q644
16240A1828M4l443R884K2870n17L379j5097j8910j3290K328J6064J5704r12L291
16226C3223K148J53J8087n72O099j4182j1333J6011J8496R93J57K1270J7150J543
16212A09243o179P190Nk1459R941k2639k5173M705o159r544J3616J5066R232o254
16198G1591j0524J0166J332O226N253J3800k567L27j7278l46K4467K0075K4345
16185A46867L784j1972j0969j6624k3194K3351K1385j1372R520N0567Q988r248
16173A81083J3429J5824j6912k3851J5563O433p01m503J4637J7986K1829J6729
$$ plain form
16161 257546 263719 272483 271267 291672 302183 302441 319027 334672 351878 365372 366217 385657 393741
16148 393741 404128 429340 464478 481150 501547 498602 512192 524670 520890 528937 557192 611549
16136 611549 666797 699250 735553 798922 869359 936050 986455 1059931 1114613 1184471 1261881
16125 1261881 1390669 1518859 1664233 1835331 2026633 2235081 2458942 2738226 3066607
16116 3066607 3471746 3937228 4438392 5008706 5660632 6396550 7244548 8233876 9359060
16107 9359060 10678905 12269100 14165080 16416080 19160338 22445168 26330640 30784163
16099 30784163 35708356 41425476 48417547 56739338 65678084 74125358 81847511 90028675
16091 90028675 100026158 111337566 121258682 126983396 128949171 131482633 136453404 141672745
$$ packed form
16161B57546O173Q764j216K0405J0511K58J6586J5645J7206J3494Q45J9440Q084
16148C93741J0387K5212L5138J6672K0397k945J3590J2478l780Q047K8255N4357
16136F11549N5248L2453L6303O3369P0437O6691N0405P3476N4682O9858P7410
16125A261881J28788J28190J45374J71098J91302K08448K23861K79284L28381
16116C066607M05139M65482N01164N70314O51926P35918Q47998R89328J125184
16107I359060J319845J590195J895980K251000K744258L284830L885472M453523
16099C0784163M924193N717120O992071Q321791Q938746Q447274P722153Q181164
16091I0028675R997483J1311408R921116N724714J965775K533462M970771N219341
$$ plain form
16083 141672745 142370866 136637444 127495673 119992970 115561627 111018022 102586415 89733713
16075 89733713 76833119 66988547 59782877 52866470 44849378 36475154 29306369 24131656
16067 24131656 20384777 17205084 14236560 11703463 9762018 8387382 7404580 6628671
16059 6628671 5959269 5403315 4931404 4547520 4229882 3921884 3640261 3355750 3100829
16050 3100829 2866300 2668023 2493050 2334530 2142030 1959630 1820248 1703225 1594298
16041 1594298 1491470 1379398 1281943 1195574 1139154 1052335 975894 957559 923383 863818 827313
16030 827313 792050 741502 719403 702287 692111 668187 667372 656635 629451 611632 597539 598425
16018 598425 585466 579194 570413 549780 519117 506099 511016 493551 458307 445230 462686 459714
$$ packed form
16083A41672745O98121n733422r141771p502703m431343m543605q431607j2852702
16075H9733713j2900594r844572p205670o916407q017092q374224p168785n174713
16067B4131656l746879l179693k968524k533097j941445j374636r82802p75909
16059F628671o69402n55954m71911l83884l17638l07998k81623k84511k54921
16050C100829k34529j98277j74973j58520j92500j82400j39382j17023j08927
16041A594298j02828j12072r7455q6369n6420q6819p6441j8335l4176n9565l6505
16030H27313l5263n0548k2099j7116j0176k3924q15j0737k7184j7819j4093Q86
16018E98425j2959o272q781k0633l0663j3018M917j7465l5244j3077J7456k972
$$ plain form
16006 459714 445699 422907 404091 387285 375846 382080 352866 321007 300736 287857 297000 310950
15994 310950 310250 313364 324563 312234 272243 271984 254008 243886 264639 272248 242575 227969 218324
15981 218324 224260 221926 240010 258374 232922 234712 242477 230005 227869 238248 242500 213516 202778
15968 202778 201081 206643 209266 201918 181502 173318 187908 193374 194970 175860 144866 153979 158144
15955 158144 168454 156768 151979 145710 143869 136324 134101 133956 161613 154252 132958 167142 168194
15942 168194 163161 146402 150419 151547 140981 156475 164910 168436 139891 103939 93170 97627 111321
15929 111321 118924 121048 127190 102709 97241 144230 143439 146446 131478 113547 103083 119758 123002
15916 123002 127394 99561 89025 97767 116382 112674 123019 111263 105314 90177 86190 114936
$$ packed form
16006D59714j4015k2792j8816j6806j1439O234k9214l1859k0271j2879R143J3950
15994C10950p00L114J1199j2329l9991k59j7976j0122K0753P609k9673j4606r645
15981B18324N936k334J8084J8364k5452J790P765j2472k136J0379M252k8984j0738
15968B02778j697N562K623p348k0416q184J4590N466J596j9110l0994R113M165
15955A58144J0310j1686m789o269j841p545k223j45K7657p361k1294L4184J052
15942A68194n033j6759M017J128j0566J5494Q435L526k8545l5952j0769M457J3694
15929A11321P603K124O142k4481n468M6989p91L007j4968j7931j0464J6675L244
15916A23002M392k7833j0536Q742J8615l708J0345j1756n949j5137l987K8746
$$ plain form
15904 114936 112321 98484 112715 152185 158078 118927 108905 127847 146090 135283 109930 97816
15892 97816 96001 75075 56372 55261 62239 79067 82158 66816 56087 66523 43025 47891 54011
15879 54011 41386 36885 39354 57722 54834 64700 68728 64520 75384 79988 78238 92976 85097
15866 85097 53899 47319 55215 63246 71268 61367 84114 92963 96470 85211 51394 30639 35559
15853 35559 66276 74369 82673 70262 43986 49321 44855 22174 32447 45763 44777 32254 33605
15840 33605 32391 22762 32224 43836 46418 14758 6188 -6031 -6111 29338 13906 -22863 546
15827 546 24026 29659 29149 46361 52570 50572 60234 67452 65082 69800 48913 48279 43052 30480
15813 30480 34975 32457 50516 47699 17890 13118 27431 20540 -5777 -7333 -7725 -5992 13512
$$ packed form
15904A14936k615j3837J4231L9470N893l9151j0022J8942J8243j0807k5353j2114
15892I7816j815k0926j8703j111O978J6828L091j5342j0729J0436k3498M866O120
15879E4011j2625m501K469J8368k888R866M028m208J0864M604j750J4738p879
15866H5097l1198o580P896Q031Q022r901K2747Q849L507j1259l3817k0755M920
15853C5559L0717Q093Q304j2411k6276N335m466k2681J0273J3316r86j2523J351
15840C3605j214r629R462J1612K582l1660q570j2219q0L5449j5432l6769K3409
15827E46K3480N633n10J7212O209j998R662P218k370M718k0887o34n227j2572
15813C0480M495k518J8059k817k9809m772J4313o891k6317j556l92J733J9504
$$ plain form
15800 13512 36905 31316 17749 31285 50542 47619 33602 14436 12198 4888 20567 40941
15788 40941 47621 21278 29528 35251 14250 2916 5186 17306 17223 21353 39074 40470 47362 25867
15774 25867 31552 34315 10076 1596 11549 37306 43832 53741 59844 61428 49785 12694 26662
15761 26662 40129 28667 23740 18654 -11222 -26795 -25425 -27847 -19882 5705 15713 27488 42940
15748 42940 33251 12244 209 20729 45438 58816 34422 31838 9465 16536 30344 34704
15736 34704 51781 33748 28906 7670 5437 -4011 -9985 4413 39274 38645 31079 37787 10297
15723 10297 -6817 14346 26897 30207 14107 -3136 -4874 754 8040 -11409 -14711 -13609 114
15710 114 -12125 -16293 -13569 4654 5316 14546 15536 33672 28305 19065 25504 21352 2348 4466
$$ packed form
15800A3512K3393n589j3567J3536J9257k923j4017j9166k238p310J5679K0374
15788D0941O680k6343Q250N723k1001j1334K270J2120q3M130J7721J396O892k1495
15774B5867N685K763k4239q480R953K5757O526R909O103J584j1643l7091J3968
15761B6662J3467j1462m927n086k9876j5573J370k422P965K5587J0008J1775J5452
15748D2940r689k1007j2035K0520K4709J3378k4394k584k2373P071J3808M360
15736C4704J7077j8033m842k1236k233r448n974J4398L4861o29p566O708k7490
15723A0297j7114K1163J2551L310j6100j7243j738N628P286j9449l302J102J3723
15710A14j2239m168K724J8223O62R230R90J8136n367r240O439m152j9004K118
$$ plain form
15696 4466 13448 -6720 -22033 -16599 -3048 6392 -8892 18304 28807 25535 24507 24562 19028 12759
15682 12759 25793 28658 23494 19535 11801 19712 13259 -7593 -4590 -10301 -7385 -1550 -1720 16147
15668 16147 55455 53483 62710 59223 36481 4290 -19758 -14342 6393 -4283 7073 1434 8077
15655 8077 31317 29081 31159 41005 33124 25415 34614 46478 28011 30405 50133 58465 45906
15642 45906 16398 21672 21776 14701 18945 11631 14638 13559 -7046 -16873 6552 34726 31963 23819
15628 23819 2650 -3627 2332 -2793 5308 22590 35894 64938 65274 80786 65412 33475 32942
15615 32942 48539 60257 47547 25364 34000 60511 60386 47710 29118 12043 7475 15165 8974
15602 8974 -22800 -30983 -27573 -15819 5923 -12584 -27311 -36884 -35202 -49392 -47274 -30363 -39475
$$ packed form
15696D466Q982k0168j5313N434J3551R440j5284K7196J0503l272j028N5n534o269
15682A2759J3034K865n164l959p734P911o453k0852L003n711K916N835j70J7867
15668A6147L9308j972R227l487k2742l2191k4048N416K0735j0676J1356n639O643
15655H077K3240k236K078R846p881p709R199J1864j8467K394J9728Q332j2559
15642D5906k9508N274J04p075M244p314L007j079k0605r827K3425K8174k763q144
15628B3819k1169o277N959n125Q101J7282J3304K9044L36J5512j5374l1937n33
15615C2942J5597J1718j2710k2183Q636K6511j25j2676j8592j7075m568P690o191
15602H974l1774q183L410J1754K1742j8507j4727r573J682j4190K118J6911r112
$$ plain form
15589 -39475 -26210 -15552 7331 6619 9036 993 -15602 -21839 -13565 -3051 -6394 -20637 -47379
15576 -47379 -53598 -21902 1945 -1505 -24962 -21172 -16650 -4187 32390 34518 30716 31474 16560
15563 16560 0 5719 48613 40201 26874 13439 13554 15764 30534 59100 51438 45057 42109
15550 42109 14448 4002 -4207 11754 20170 21736 42302 42351 33834 44176 56160 86934 114171
15537 114171 102167 93952 79239 74674 93270 109716 126985 137529 161128 183031 222536 271831
15525 271831 329409 392694 436010 481593 539125 589242 654831 725418 742456 744491 761775 777878
15513 777878 798314 775553 729703 691628 666637 622282 582072 522617 465262 413681 342631
15502 342631 306670 274413 249218 205061 162284 134633 116153 110911 93629 74864 74574 60573
$$ packed form
15589c9475J3265J0658K2883p12K417q043j6595o237Q274J0514l343j4243k6742
15576d7379o219L1696K3847l450k3457L790M522J2463L6577K128l802P58j4914
15563A6560j6560N719M2894q412j3327j3435J15K210J4770K8566p662o381k948
15550D2109k7661j0446q209J5961Q416J566K0566M9q517J0342J1984L0774K7237
15537A14171j2004q215j4713m565J8596J6446J7269J0544K3599K1903L9505M9295
15525B71831N7578O3285M3316M5583N7532N0117O5589P0587J7038K035J7284J6103
15513G77878K0436k2761m5850l8075k4991m4355m0210n9455n7355n1581p1050
15502C42631l5961l2257k5195m4157m2777k7651j8480n242j7282j8765k90j4001
$$ plain form
15490 60573 50573 34811 37429 50164 55826 29822 15252 9950 36448 31150 32959 38201 44929
15477 44929 54950 46468 26818 12413 -10688 -18742 -21093 7129 45355 26749 -18826 -36348
15465 -36348 -31089 -26143 -15862 -6281 4987 25703 36096 45432 53686 50672 42008 36197 29722
15452 29722 45340 42002 33308 16078 7756 32757 62049 55345 43237 44886 55209 42854 50248
15439 50248 55955 37143 14852 9791 43472 70096 63651 49782 53131 59412 59358 53403 56363 52566
15425 52566 64359 71226 44982 33243 30308 41545 34845 33077 11002 -1801 -14655 1890
15413 1890 20276 7339 -13333 -6703 -6674 -26385 -29375 -2775 3177 23392 20559 19067 23934 15549
15399 15549 29202 18735 -6471 -14660 -26473 -56532 -34282 -6511 3223 7886 8918 18728 21685
$$ packed form
15490F0573j0000j5762K618J2735N662k6004j4570n302K6498n298J809N242O728
15477D4929J0021q482j9650j4405k3101q054k351K8222L8226j8606m5575j7522
15465c6348N259M946J0281R581J1268K0716J0393R336Q254l014q664n811o475
15452B9722J5618l338q694j7230q322K5001K9292o704j2108J649J0323j2355P394
15439E0248N707j8812k2291n061L3681K6624o445j3869L349O281n4n955K960l797
15425E2566J1793O867k6244j1739k935J1237o700j768k2075j2803j2854J6545
15413A890J8386j2937k0672O630K9j9711k990K6600N952K0215k833j492M867q385
15399A5549J3653j0467k5206q189j1813l0059K2250K7771R734M663J032R810K957
$$ plain form
15386 21685 36718 19734 11740 25734 24571 18059 24651 14625 16149 14493 22122 42643 42159
15373 42159 21927 2144 -23884 -27943 -23553 -14556 -24194 -27907 -38251 -32670 -14367 -1735 -5255
15360 -5255 1370 -12773 -21659 -18268 -19400 -6022 -15636 -37188 -47742 -34311 -28895 -11135 6875
15347 6875 14756 -3295 -7687 -372 36184 35308 13592 -2075 -4104 -11572 -12733 -11389 -16707 -26912
15333 -26912 2983 31905 -138 -2409 13378 8363 -2326 3688 -4805 -6332 6038 22761 11165
15320 11165 13143 19136 15862 -3364 -17962 -5984 14972 6697 915 -8640 4025 -14954 -37798
15307 -37798 -49849 -29413 -1130 37276 44341 4497 -8918 -9370 11275 13731 10862 -3550 -14618
15294 -14618 -15478 -10327 -26434 -32269 -39724 -19613 -11423 -20709 -22431 -24816 -35755 -25241 2772
$$ packed form
15386B1685J5033j6984p994J3994j163o512O592j0026J524j656P629K0521m84
15373D2159k0232j9783k6028m059M390Q997r638l713j0344N581J8303J2632l520
15360e255O625j4143q886L391j132J3378r614k1552j0554J3431N416J7760J8010
15347F875P881j8051m392P315L6556q76k1716j5667k029p468j161J344n318j0205
15333b6912K9895K8922l2043k271J5787n015j0689O014q493j527J2370J6723j1596
15320A1165J978N993l274j9226j4598J1978K0956q275n782r555J2665j8979k2844
15307c7798j2051K0436K8283L8406P065l9844j3415m52K0645K456k869j4412j1068
15294a4618q60N151j6107n835p455K0111Q190r286j722k385j0939J0514K8013
$$ plain form
15281 2772 -5303 -9712 -3194 -3058 -5209 12907 22597 26718 20946 18183 18347 26968 8730 -3293
15267 -3293 -10344 -2540 -7877 9510 -743 -27551 -30305 -13491 557 21867 33663 17195 19324
15254 19324 8275 8883 23716 29346 13117 15964 -2281 -5871 -4783 -5007 -9028 -14898 -21855 -7320
15240 -7320 4052 -712 -8980 -22934 -31326 -31496 -9669 -8681 -28985 -45191 -26536 -14954 -15099 -7760
15226 -7760 5944 7220 21643 26303 18284 14499 -4515 -15556 -1232 -11747 5183 5564 -12794
15213 -12794 -41038 -20750 -21521 -18334 -11183 -9475 12915 24110 -987 -14059 17190 30259 41967
15200 41967 42176 41579 33099 16541 12659 15412 17286 19438 47114 60203 48298 26784 18886 -25488
15186 -25488 -45527 -29603 -19603 -19329 -24839 -29626 6562 19424 31315 2843 -15787 -7306 -25011
$$ packed form
15281B772q075m409O518J36k151J8116R690M121n772k763J64Q621j8238j2023
15267c293p051P804n337J7387j0253k6808k754J6814J4048K1310J1796j6468K129
15254A9324j1049O08J4833N630j6229K847j8245l590J088k24m021n870o957J4535
15240g320J1372m764q268j3954q392j70K1827R88k0304j6206J8655J1582j45P339
15226g760J3704J276J4423M660q019l785j9014j1041J4324j0515J6930L81j8358
15213a2794k8244K0288p71L187P151J708K2390J1195k5097j3072L1249J3069J1708
15200D1967K09n97q480j6558l882K753J874K152K7676J3089j1905k1514p898m4374
15186b5488k0039J5924J0000K74n510m787L6188J2862J1891k8472j8630Q481j7705
$$ plain form
15173 -25011 -17139 -6986 -28773 -39308 -31350 -12455 3282 7118 -5373 -8214 -27382 -36107 -24966
15160 -24966 -5168 -1537 -8828 -2620 -4762 -20001 -24752 -16155 -9065 -12576 8880 23152 31534
15147 31534 2169 914 -14152 -13575 -29389 -40475 -25234 15174 24575 16801 7582 -943 7676
15134 7676 32130 10923 7274 15369 9373 -7361 14649 14540 12891 2837 -12651 -4213 -3113
15121 -3113 -29110 -31358 -23183 -23340 -23201 -3725 9933 1654 -426 21674 19769 4891 16760 11620
15107 11620 1626 4221 8671 10333 27595 10860 -16324 -3108 22980 15995 12174 -11602 -14836
15094 -14836 -10361 -12863 2433 21515 14638 -6168 -14597 -21580 5071 27138 21305 18357 4281
15081 4281 -7792 2544 13573 16346 4318 7784 -479 14116 22566 29718 35476 24378 -6235
$$ packed form
15173b5011P872J0153k1787j0535P958J8895J5737L836j2491k841j9168q725J1141
15160b4966J9798L631p291O208k142j5239m751Q597P090l511K1456J4272Q382
15147C1534k9365j255j5066N77j5814j1086J5241M0408R401p774r219q525Q619
15134G676K4454k1207l649Q095n996j6734K2010j09j649j0054j5488Q438J100
15121c113k5997k248Q175j57J39J9476J3658q279k080K2100j905j4878J1869n140
15107A1620r994K595M450J662J7262j6735k7184J3216K6088o985l821k3776l234
15094a4836M475k502J5296J9082o877k0806q429o983K6651K2067n833k948j4076
15081D281j2073J0336J1029K773j2028L466q263J4595Q450P152N758j1098l0613
$$ plain form
15068 -6235 -33389 -39165 -38496 -32725 -10642 -24302 -7814 -17537 -26429 -14381 -11207 -18132 -19456 5751
15054 5751 9444 -4405 -20572 -15469 -21451 -22237 -37809 -22089 -2691 -3312 -7310 9855 8108 9946
15040 9946 12012 4182 26940 22490 27923 17434 -1246 -9263 -3290 -5613 -11586 -30802 -42625
15027 -42625 -17344 10838 -16466 -19212 -10672 -930 -15888 -7604 3341 -575 -14822 11209 44006
15014 44006 36938 39849 13901 17331 11095 -2099 2714 25667 52706 72457 65777 63244 74941
15001 74941 92729 74720 57734 47672 32000 39460 27370 29367 68493 82541 86142 80856
14989 80856 47437 26821 20291 -6625 18207 50752 18009 5191 11442 20288 7972 4877
14977 4877 8400 18652 19372 27219 15515 -24201 -32351 -15542 -17766 -30090 -34339 -32610 -6696
$$ packed form
15068f235k7154n776O69N771K2083j3660J6488r723q892J2048L174o925j324K5207
15054E751L693j3849j6167N103n982p86j5572J5720J9398o21l998J7165j747J838
15040I946K066p830K2758m450N433j0489j8680q017N973k323n973j9216j1823
15027d2625K5281K8182k7304k746Q540R742j4958Q284J0945l916j4247K6031L2797
15014D4006p068K911k5948L430o236j3194M813K2953K7039J9751o680k533J1697
15001G4941J7788j8009j6986j0062j5672P460j2090J997L9126J4048L601n286
14989H0856l3419k0616o530k6916K4832L2545l2743j2818O251Q846j2316l095
14977D877L523J0252P20P847j1704l9716q150J6809k224j2324m249J729K5914
$$ plain form
14964 -6696 -7621 -30311 -16787 22052 32413 26046 -6924 -2717 8500 2016 -5344 -267 -6784
14951 -6784 -4297 3157 -817 -11977 -10929 -14358 -13684 -25780 -31493 -14069 -6921 -29290 -29928 -31569
14937 -31569 -43062 -26396 -27166 -20187 -29866 -35981 -42572 -23589 -30525 -21191 -12454 -3925 13656 33150
14923 33150 35061 26237 -9423 -20236 4616 11987 6555 21958 26839 21610 33163 13264 18664
14910 18664 9139 7635 -5548 -12534 5131 -3851 -5572 6333 10241 5596 -6668 -28650 -35757
14897 -35757 -9030 -14193 -11624 2136 -137 -8873 8408 33030 43675 44188 50454 29430 12559
14884 12559 858 17852 6750 2479 -1803 -17653 -9597 822 -10692 -27042 -33915 -28640 -22643
14871 -22643 -17572 16723 38123 31339 13708 30694 34323 38876 37312 46788 69413 74030 36666
$$ packed form
14964f696r25k2690J3524L8839J0361o367l2970M207J1217o484p360N077o517
14951f784K487P454l974j1160J048l429O74j2096n713J7424P148k2369o38j641
14937c1569j1493J6666p70O979r679o115o591J8983o936R334Q737Q529J7581J9494
14923C3150J911q824l5660j0813K4852P371n432J5403M881n229J1553j9899N400
14910A8664r525j504j3183o986J7665q982j721J1905L908m645j2264k1982p107
14897c5757K6727n163K569J3760k273q736J7281K4622J0645N13O266k1024j6871
14884A2559j1701J6994j1102m271m282j5850Q056J0419j1514j6350o873N275N997
14871b2643N071L4295K1400o784j7631J6986L629M553j564R476K2625M617l7364
$$ plain form
14858 36666 19066 15061 6991 6443 -1544 2027 12195 37444 43497 42124 4809 -9970 10703
14845 10703 10825 6489 18410 18107 17743 23175 11729 13369 7746 -7149 -16560 -6138 4823 -3150
14831 -3150 -15790 -14565 -3501 -2722 -10286 -15210 -19886 -6797 2027 -9914 -25923 -27992 -33314 -21724
14817 -21724 -24099 -42712 -35460 -5446 -1795 -2384 -8348 -35976 -38357 -26660 -1900 8537 7525
14804 7525 -4678 -6640 -32834 -14256 -4962 1894 3148 -6820 -10201 -17212 -28823 -30274 -17081
14791 -17081 -21808 -40176 -43237 -19777 1579 29775 47375 50500 46955 31703 -5206 -10163 959
14778 959 -9237 -1516 35190 41146 61138 53020 12550 392 8118 11948 8934 6320 3746 11503
14764 11503 4892 4728 -29850 -35665 -6050 31042 32444 18252 8332 -9237 -37787 -16493 -746
$$ packed form
14858C6666j7600m005q070n48p987L571J0168K5249O053j373l7315j4779K0673
14845A0703J22m336J1921l03l64N432j1446J640n623j4895r411J0422J0961p973
14831c150j2640J225J1064P79p564m924m676J3089Q824j1941j6009k069n322J1590
14817b1724k375j8613P252L0014L651n89n964k7628k381J1697K4760J0437j012
14804G525j2203j962k6194J8578R294O856J254r968l381p011j1611j451J3193
14791a7081m727j8368l061K3460K1356K8196J7600L125l545j5252l6909m957J1122
14778I59j0196P721L6706N956J9992q118m0470j2158P726L830l014k614k574P757
14764A1503o611j64l4578n815K9615L7092J402j4192r920j7569k8550K1294J5747
$$ plain form
14751 -746 -7662 -2790 -105 5191 8554 849 -10285 -9484 19553 20665 22134 32506 35797 8470
14737 8470 8008 33122 43767 27077 21111 20575 17887 9489 -13407 -241 -590 -4936 -35350 -44397
14723 -44397 -15074 214 4366 11457 17056 -2593 -11125 -7024 -15751 -27449 -20787 -14919 -24362
14710 -24362 -30083 -49229 -16399 11152 -7351 -23205 -8587 -1899 1842 -2501 9381 -2757
14698 -2757 1271 22693 5183 -28565 -30411 -5711 -7087 855 -3779 -15747 -16131 6987 -9590
14685 -9590 -25675 -21238 -14876 -19698 -34751 -7220 30014 39934 29036 2451 -19282 -21034 -6749
14672 -6749 -1963 -286 -17597 -51256 -60626 -40213 -15860 4777 11341 6010 9033 -3288 -14124
14659 -14124 7911 17866 8824 -5474 -7124 -1682 -340 8128 -1607 -8914 130 -4443 1628 -5932
$$ packed form
14751g46o916M872K685N296L363p705j1134Q01K9037J112J469J0372L291k7327
14737H470m62K5114J0645j6690n966n36k688q398k2896J3166l49m346l0414r047
14723d4397K9323J5288M152P091N599j9649q532M101q727j1698O662N868r443
14710b4362n721j9146L2830K7551j8503j5854J4618O688L741m343J1882j2138
14698b757M028K1422j7510l3748j846K4700j376P942m634j1968l84K3118j6577
14685i590j6085M437O362m822j5053K7531L7234R920j0898k6585k1733j752J4285
14672f749M786J677j7311l3659r370K0413K4353K0637O564n331L023j2321j0836
14659a4124K2035R955r042j4298j650N442J342Q468r735p307R044m573O071p560
$$ plain form
14645 -5932 1153 42 -34893 -35736 -13299 -16722 -21498 -28328 -12751 465 -269 2555 -12240 -16111
14631 -16111 14812 5977 15720 -8276 -26030 -31424 -35994 -37723 6329 666 -9813 -3301 -16334
14618 -16334 -13917 -21646 -5060 16674 10078 -7237 -1382 2906 -16298 -16443 -12366 -1371 2778
14605 2778 7641 22264 28817 29520 -2818 -12460 -2459 5946 12956 6963 6740 1118 6188 -7245
14591 -7245 -5862 -1167 16037 14124 31335 22951 27212 48637 45272 10997 -3628 -5470 1756
14578 1756 21853 30153 6085 -12581 -9584 12966 8265 -421 -17865 -26848 -19217 -8576 -1701
14565 -1701 -15262 -16983 -37321 -29761 -31387 -13021 -34706 -45423 -44791 -13995 -3775 -20053 -32920
14552 -32920 -20498 -2914 -10975 -9123 1540 23455 23269 -4343 1937 19038 1437 -3694 4688
$$ packed form
14645e932P085j111l4935q43K2437l423m776o830J5577J3216p34K824j4795l871
14631a6111L0923q835R743k3996j7754n394m570j729M4052n663j0479O512j3033
14618a6334K417p729J6586K1734o596j7315N855M288j9204j45M077J0995M149
14605B778M863J4623O553P03l2338r642J0001Q405P010n993k23n622N070j3433
14591g245J383M695J7204j913J7211q384M261K1425l365l4275j4625j842P226
14578A756K0097Q300k4068j8666K997K2550m701q686j7444q983P631J0641O875
14565a701j3561j721k0338P560j626J8366k1685j0717O32L0796J0220j6278j2867
14552c2920J2422J7584q061J852J0663K1915j86k7612O280J7101j7601n131Q382
$$ plain form
14539 4688 -4776 475 -2472 -15069 -11560 -858 -2353 -15467 -4635 4673 -12602 8008 19997
14526 19997 15320 -14323 -38175 -60230 -49965 -28488 -35309 -33172 -22852 -13915 -34502 -42430 -70702
14513 -70702 -55120 -9553 1643 -16485 -19506 12141 12217 15771 3915 1346 26635 14084 -10458
14500 -10458 -2056 -7073 -2565 21199 31937 38077 53274 37428 12554 -5748 10111 13667 39597
14487 39597 44163 29606 34258 32958 11469 3066 3213 18069 16611 -14941 -21595 -1686 -2025 -9294
14473 -9294 -22509 -18411 -32364 -22527 18131 25381 11358 1419 -10032 -12451 -15831 -43475 -47416
14460 -47416 -43127 -33203 -24376 -35483 -15529 5127 3828 -8182 -12456 -11514 -15125 -6950 2783 -13991
14446 -13991 -16392 -38535 -32140 -25077 -24634 -20427 25304 47734 38382 10532 14410 29693 43772
$$ packed form
14539D688r464N251k947j2597L509J0702j495j3114J0832R308j7275K0610J1989
14526A9997m677k9643k3852k2055J0265K1477o821K137J0320Q937k0587p928k8272
14513g0702J5582M5567J1196j8128l021L1647P6L554j1856k569K5289j2551k4542
14500a0458Q402n017M508K3764J0738O140J5197j5846k4874j8302J5859L556K5930
14487C9597M566j4557M652j300k1489q403J47J4856j458l1552o654J9909l39p269
14473i294j3215M098j3953R837M0658P250j4023r939j1451k419l380k7644l941
14460d7416M289R924Q827j1107J9954K0656j299j2010m274R42l611Q175R733j6774
14446a3991k401k2143O395P063M43M207M5731K2430r352k7850L878J5283J4079
$$ plain form
14433 43772 52759 55417 42241 27915 -2532 -28742 -21512 -8366 -12603 -14791 -11269 -6783 -19199
14420 -19199 -37212 -58843 -27863 -9301 -28114 -26044 -28834 -14529 -7524 -12594 -972 -28403
14408 -28403 -38696 -27932 -23004 4269 7328 -6026 -29100 -40629 -54675 -38342 -10263 8925
14396 8925 6976 -9122 -20459 -24429 -18847 -10888 -12663 -10965 -13827 7607 11310 -450 8681 3275
14382 3275 -8979 -3755 -17039 9834 26171 23106 17237 31924 16966 -20114 -41378 -25346
14370 -25346 -11881 -8473 328 12413 3566 7563 9904 7541 -4615 -9629 -26113 -49664 -45909
14357 -45909 -21476 8668 17755 -7657 -35355 -40422 -37051 -27307 -11140 13774 28760 53858
14345 53858 58291 51338 44028 58134 50353 38363 29873 20109 36524 22703 20000 11119 -7758
$$ packed form
14433D3772Q987K658j3176j4326l0447k6210P230J3146m237k188L522M486j2416
14420a9199j8013k1631L0980J8562j8813K070k790J4305P005n070J1622k7431
14408b8403j0293J0764M928K7273L059j3354k3074j1529j4046J6333K8079J9188
14396H925j949j6098j1337l970N582P959j775J698k862K1434L703j1760R131n406
14382C275j2254N224j3284K6873J6337l065n869J4687j4958l7080k1264J6032
14370b5346J3465L408Q801J2085q847L997K341k363j2156n014j6484k3551L755
14357d5909K4433L0144R087k5412k7698n067L371R744J6167K4914J4986K5098
14345E3858M433o953p310J4106p781j1990q490r764J6415j3821k703q881j8877
$$ plain form
14332 -7758 -7839 18460 19586 4135 884 -8418 5824 8305 23032 17458 -1620 606 11555 12370
14318 12370 9356 13452 -5826 -26166 -24735 -19414 -27541 -24509 -11636 -19566 3417 26558 29488
14305 29488 38670 30062 21637 30226 21140 -1193 18570 18989 14778 -6359 -20978 -5831 36444
14292 36444 24222 9099 -7790 -1298 21194 8482 5557 -6238 -16517 -22101 -24975 -17233 -16442
14279 -16442 -5826 -2435 5392 1075 -11472 -30773 -40602 -60712 -49853 -46082 -45977 -20933 -16657
14266 -16657 -11274 4784 -823 -16491 -12037 -19086 -41182 -39355 -34108 -30584 -30090 -25476 -3290 20880
14252 20880 14641 2114 4567 14913 23852 -1639 -16419 -35697 -62105 -73952 -66176 -34309
14240 -34309 -25248 -10899 4019 -13 17700 21281 15685 27895 6081 -5040 -8850 -13647 -34822
$$ packed form
14332g758q1K6299J126j5451l251r302J4242K481J4727n574j9078K226J0949Q15
14318A2370l014M096j9278k0340J431N321q127L032J2873p930K2983K3141K930
14305B9488R182q608q425Q589r086k2333J9763M19m211k1137j4619J5147M2275
14292C6444j2222j5123j6889O492K2492j2712k925j1795j0279n584k874P742P91
14279a6442J0616L391P827m317j2547j9301r829k0110J0859L771J05K5044M276
14266a6657N383J6058n607j5668M454p049k2096J827N247L524M94M614K2186K4170
14252B0880o239j2527K453J0346Q939k5491j4780j9278k6408j1847P776L1867
14240c4309R061J4349J4918m032J7713L581n596J2210k1814j1121l810m797k1175
$$ plain form
14227 -34822 -29603 -34626 -47109 -44513 -46888 -42077 -6778 21163 20071 13839 -5024 -24289 -19209
14214 -19209 14623 8935 1162 9615 1703 -17779 -24146 -37521 -22954 9112 7730 6645 1237
14201 1237 1507 13467 14088 10925 -27999 -44172 -27255 -19239 -17446 -28043 -31123 -15199 -7807 -25234
14187 -25234 -32630 -35988 -28146 -36803 -21269 -995 22685 26874 8758 8034 23087 15693 2727
14174 2727 -891 -13885 -32020 -25601 -13329 -3150 12604 -8532 -9571 -42978 -63591 -52643
14162 -52643 -19757 -8035 -5340 -5081 -8903 -158 -8384 -28734 -12486 -8645 -23934 -22251 -7661
14149 -7661 -17775 -23065 1926 12011 26446 20026 1248 -16659 -36281 -16524 -8714 5870
14137 5870 7578 12738 6093 16242 16668 24848 16091 9377 3987 13871 34016 57040 14522 946
$$ packed form
14227c4822N219n023j2483K596k375M811L5299K7941j092o232j8863j9265N080
14214a9209L3832n688p773Q453p912j9482o367j3375J4567L2066j382j085n408
14201A237K70J1960O21l163l8924j6173J6917Q016J793j0597l080J5924P392j7427
14187b5234p396l358P842q657J5534K0274K3680M189j8116p24J5053p394j2966
14174B727l618j2994j8135O419J2272J0179J5754k1136j039l3407k0613J0948
14162e2643L2886J1722K695K59l822Q745q226k0350J6248L841j5289J683J4590
14149g661j0114n290K4991J0085J4435o420j8778j7907j9622J9757P810J4584
14137E870J708N160o645J0149M26Q180q757o714n390R884K0145K3024m2518j3576
$$ plain form
14123 946 11800 7348 -1882 -2763 -15334 -12528 -11037 -5924 -15073 -10065 4350 6 13824 -33
14109 -33 4798 10630 14394 13091 19354 26154 7249 10961 16317 1695 -12240 -13861 -14460 -25746
14095 -25746 -7704 5268 -15968 -37851 -26374 -24760 -13259 -6384 26223 30868 23633 10008
14083 10008 -10774 -26259 -29862 -22208 -33424 -36353 -36851 -47211 -56490 -63754 -76824 -45997 -15492
14070 -15492 -20819 -24233 -20685 -9925 -28069 -51494 -30790 -20307 -9076 -1194 15938 44440
14058 44440 25626 8449 -5253 4609 15556 21112 31077 44861 35387 -11236 -33089 -54016
14046 -54016 -36873 -20590 -8127 10269 30237 28121 9189 2504 -4440 -19275 -32849 -39001
14034 -39001 -38209 -6325 8412 13366 12434 6804 -8151 -11574 8780 21791 16638 1525 -15595
$$ packed form
14123I46J0854m452r230q81j2571K806J491N113r149N008J4415m344J3818j3857
14109c3M831N832L764j303O263O800j8905L712N356j4622j3935j621n99j1286
14095b5746J8042J2972k1236k1883J1477J614J1501O875L2607M645p235j3625
14083A0008k0782j5485l603P654j1216k929m98j0360r279p264j3070L0827L0505
14070a5492n327l414L548J0760j8144k3425K0704J0483J1231P882J7132K8502
14058D4440j8814j7177j3702R862J0947N556R965J3784r474m6623k1853k0927
14046e4016J7143J6283J2463J8396J9968k116j8932o685o944j4835j3574o152
14034c9001P92L1884J4737M954r32n630j4955l423K0354J3011n153j5113j7120
$$ plain form
14021 -15595 -22840 -11846 7037 39821 51159 48941 50138 29819 12419 -9020 -1283 5273 -1100
14008 -1100 -19166 -7596 16649 32995 31288 41121 29148 1915 -2674 -12433 -20815 -29773 -33653
13995 -33653 -16142 -22379 -28411 -26049 -24072 -32548 -9099 8957 16698 -2330 3806 -1182 -1860 -5364
13981 -5364 -23498 -16755 7520 -9937 -3405 -12834 -19113 -6567 18349 26338 -9651 -15282 13325
13968 13325 29084 18318 11934 2887 -16603 -3897 -403 4413 22111 17532 8764 3430 5623
13955 5623 10369 -14593 -27287 -3969 4550 16099 29949 123 -17299 8202 28224 29488
13943 29488 13060 1321 -5261 -11245 18686 30383 6914 -20861 -1706 22189 23357 6081
13931 6081 -14984 -6686 -7136 7504 20821 13322 1445 -18571 -15147 4034 1603 4613 -12444
$$ packed form
14021a5595p245J0994J8883L2784J1338k218J197k0319j7400k1439P737O556o373
14008a100j8066J1570K4245J6346j707R833j1973k7233m589r759q382q958l880
13995c3653J7511o237o032K362J977q476K3449J8056P741j9028O136m988o78l504
13981e364j8134O743K4275j7457O532r429o279J2546K4916P989l5989n631K8607
13968A3325J5759j0766o384r047j9490J2706L494M816J7698m579q768n334K193
13955E623M746k4962j2694K3318Q519J1549J3850k9826j7422K5501K0022J264
13943B9488j6428j1739o582n984K9931J1697k3469k7775J9155K3895J168j7276
13931F081k1065Q298m50J4640J3317p499j1877k0016L424J9181k431L010j7057
$$ plain form
13918 -12444 -17341 -12052 -7228 -8057 -15976 -5951 -2584 -3850 -1166 22312 46875 39368 16406 1978
13904 1978 -1690 16807 52339 73083 80946 68940 52521 79784 117259 162337 185715 239703
13892 239703 307748 377967 431569 419261 353426 249283 176011 115319 54328 50411 30672
13881 30672 17886 -5058 -15569 -13413 -8339 14017 15354 15344 3896 -22502 -27838 -33294 -15452
13868 -15452 -4128 -13828 -20709 -28604 -12120 -4876 -5836 -5718 15143 30284 52213 33385 16168
13855 16168 17621 1840 -11009 -3559 -11192 -2926 -3701 1305 5106 2885 -5926 -5375 12681 -1352
13841 -1352 -20596 6212 20230 60484 55368 27232 4103 13611 11727 -10180 -9542 -11586 -9746
13828 -9746 -14208 662 10759 11809 4438 -4254 3261 18833 17321 12286 7633 12731 -4728 6776
$$ packed form
13918a2444m897N289M824q29p919J0025L367j266K684K3478K4563p507k2962j4428
13904A978l668J8497L5532K0744P863j2006j6419K7263L7475M5078K3378N3988
13892B39703O8045P0219N3602j2308o5835j04143p3272o0692o0991l917j9739
13881C0672j2786k2944j0511K156N074K2356J337j0j1448k6398n336n456J7842
13868a5452J1324r700o881p895J6484P244r60J18K0861J5141K1929j8828j7217
13855A6168J453j5781j2849P450p633Q266p75N006L801k221q811N51J8056j4033
13841a352j9244K6808J4018M0254n116k8136k3129R508j884k1907O38k044J840
13828i746m462J4870J0097J050p371q692P515J5572j512n035m653N098j7459J1504
$$ plain form
13814 6776 26318 22861 22336 13629 -5945 -14909 -1397 -20498 -26491 -29549 -3967 18918 25340
13801 25340 21358 22403 28791 15751 -742 -3975 7588 26489 14450 -2689 -23537 -26027 -29111
13788 -29111 -41128 -17314 -16563 -15914 -28229 -23301 -1467 -6282 -27295 -37418 -34596 -15925 10896
13775 10896 16530 14843 3063 6491 2360 -19367 -39810 -39102 -35067 -17464 -16788 -19057 -17339 -27092
13761 -27092 -34335 -18791 -14443 -32606 -32082 -21785 2055 -4768 -349 14736 25482 41781 21442
13748 21442 6277 -6033 -5425 -14805 -28657 -38675 -49990 -41451 -18206 -6680 -23658 -52478
13736 -52478 -59418 -61712 -53287 -33597 -21212 1743 5624 5078 6103 17712 23258 24613 8780
13723 8780 4264 18290 37965 30254 32292 17587 27624 38203 230 -32206 -28377 -6127 6880
$$ packed form
13814F776J9542l457n25q707j9574q964J3512j9101n993l058K5582K2885O422
13801B5340l982J045O388j3040j6493l233J1563J8901j2039j7139k0848k490l084
13788b9111j2017K3814P51O49j2315M928K1834m815k1013j0123K822J8671K6821
13775A0896N634j687j1780L428m131k1727k0443P08M035J7603O76k269J718r753
13761b7092p243J5544M348j8163N24J0297K3840o823M419J5085J0746J6299k0339
13748B1442j5165j2310O08r380j3852j0018j1315Q539K3245J1526j6978k8820
13736e2478o940k294Q425J9690J2385K2955L881n46J025J1609N546J355j5833
13723H780m516J4026J9675p711K038j4705J0037J0579l7973l2436L829K2250J3007
$$ plain form
13710 6880 5197 2536 -609 2855 -26672 -11052 -7727 -31346 -7979 -4479 3077 -15898 -43616
13697 -43616 -51197 -43036 -28837 -39179 -23929 -4297 -13684 -30341 -16869 561 17656 6179
13685 6179 3012 3614 -8996 -5992 22472 8436 2835 7585 19737 22736 -12350 -29328 -17929
13672 -17929 -15465 -27904 -34477 -19877 -21419 -16410 -13133 -19491 -5440 22023 16697 29030 31921
13659 31921 10393 23345 37841 34595 26782 31576 38644 44727 40955 26378 14372 24358 24306 29792
13645 29792 7502 -7516 -14680 -11441 -22342 -45921 -43129 -19738 -9216 17901 26390 29802 29611
13632 29611 16390 35039 25135 -3415 -32703 -26225 -3112 -21423 -53910 -45045 -29589 1174
13620 1174 16293 6541 -2554 -4390 -17770 -34902 -42277 -34118 -32407 -45443 -55441 -42587 -24196
$$ packed form
13710F880j683k661l145L464k9527J5620L325k3619K3367L500P556j8975k7718
13697d3616p581Q161J4199j0342J5250J9632r387j6657J3472J7430J7095j1477
13685F179l167O02j2610L004K8464j4036n601M750J2152K999l5086j6978J1399
13672a7929K464j2439o573J4600j542N009L277o358J4051K7463n326J2333K891
13659C1921k1528J2952J4496l246p813M794P068O083l772j4577j2006R986n2N486
13645B9792k2290j5018p164L239j0901k3579K792K3391J0522K7117Q489L412j91
13632B9611j3221J8649r904k8550k9288O478K3113j8311l2487Q865J5456L0763
13620A174J5119r752r095j836j3380j7132p375Q159J711j3036r998J2854J8391
$$ plain form
13607 -24196 -9910 -8199 -17894 -37707 -43266 -31504 -24970 -19201 -47475 -67139 -37915 -10841 367
13594 367 -2158 -31721 -31169 -13200 -10190 1946 5393 -17825 -5639 10765 4831 -12660 -3480
13581 -3480 -8923 -20100 -35978 -48060 -15115 -22858 -15603 9992 7513 169 -19931 -35050 -40205
13568 -40205 -42833 -47896 -28607 -18010 -16381 -14908 -19975 -15900 -16285 -13320 -20742 -27993 -16477 6623
13554 6623 7147 6390 -14190 -15700 -9254 -26473 -29600 -21709 -25467 -9235 -13024 -20782 -17903 6068
13540 6068 15577 12361 5007 -20471 -35925 -34020 -13024 -25666 -13173 11428 22787 7634 -7551
13527 -7551 -27848 -25029 824 13550 6612 17206 2503 -23747 -44846 -35151 -20714 -20415 -9894
13514 -9894 6221 189 -1073 10703 11193 12710 4318 3475 -11676 -14410 13828 19608 11993 9177
$$ packed form
13607b4196J4286J711r695j9813n559J1762O534N769k8274j9664K9224K7074J1208
13594C67k525k9563N52J7969L010J2136L447k3218J2186J6404n934j7491R180
13581c480n443j1177j5878j2082L2945p743P255K5595k479p344k0100j5119n155
13568d0205k628n063J9289J0597J629J473n067M075l85K965p422p251J1516K3100
13554F623N24p57k0580j510O446j7219l127P891l758J6232l789p758K879K3971
13540F068R509l216p354k5478j5454J905K0996j2642J2493K4601J1359j5153j5185
13527g551k0297K819K5853J2726o938J0594j4703k6250k1099R695J4437K99J0521
13514i894J6115o032j262J1776M90J517q392q43j5151k734K8238N780p615k816
$$ plain form
13500 9177 -6746 -5244 1377 2155 -8287 -19451 -9380 -17357 -6972 706 11115 42266 59915
13487 59915 34977 42736 33148 22779 20817 -4339 -20685 -30190 -7129 15509 13318 19109 4732
13474 4732 -20138 -38112 -17794 8242 18359 10524 -6802 -15516 -31067 -17486 -28713 -22740
13462 -22740 -13546 8003 -2591 -7959 -10926 -6647 -2225 -20409 -14968 -12708 -5121 258 10964
13449 10964 10282 21135 6746 -15098 -37774 -45831 -43108 -24214 -5695 3547 8701 15433 7373
13436 7373 -18417 -31311 -47149 -59034 -37932 -29839 -4500 12182 8126 9879 20596 34514
13424 34514 35826 21600 -1998 -6598 -13380 -10709 -21388 -26309 -15792 13510 16015 18577 12229
13411 12229 13062 21142 11709 -3111 329 -3956 -3929 -3601 752 4802 755 15026 23234 -3139 -513
$$ packed form
13500I177j5923J502O621P78j0442j1164J0071p977J0385P678J0409L1151J7649
13487E9915k4938P759r588j0369j962k5156j6346r505K3061K2638k191N791j4377
13474D732k4870j7974K0318K6036J0117p835j7326q714j5551J3581j1227N973
13462b2740R194K1549j0594n368k967M279M422j8184N441K260P587N379J0706
13449A0964o82J0853j4389k1844k2676q057K723J8894J8519R242N154O732q060
13436G373k5790j2894j5838j1885K1102Q093K5339J6682m056J753J0717J3918
13424C4514J312j4226k3598m600o782K671j0679m921J0517K9302K505K562o348
13411A2229Q33Q080r433j4820L440m285K7L28M353M050m047J4271Q208k6373K626
$$ plain form
13396 -513 11216 10980 329 -25771 -42913 -24961 -19376 -20210 -10532 -33982 -34358 -13003 9830 20434
13382 20434 13814 -13777 -1758 23867 53154 30776 7765 8450 14406 8593 -7602 -10586 -31176
13369 -31176 -22015 -20638 -6878 -10614 -30603 -20305 14518 12753 -19837 -16463 -10522 5251 9665
13356 9665 145 -4737 -16493 -29025 -32616 -22523 -13324 -792 -13330 -31899 -37539 -38602 -37675
13343 -37675 -23666 -20392 -31650 -9878 -17794 -15201 8791 2450 -26563 -51387 -47429 -29523 -7216
13330 -7216 -5001 5289 4431 4249 5322 6444 5073 5975 9612 -597 3953 -10978 -28417 -28336 -9022
13315 -9022 1393 -8995 -22650 -16227 -15514 -16861 -20386 -21525 -17941 -3650 -15716 -6580 -1182 14505
13301 14505 7109 -7284 -6881 19362 34507 19399 -10451 -39897 -38209 -8469 7144 6501 -720
$$ packed form
13396e13J1729k36j0651k6100j7142J7952N585q34R678k3450l76K1355K2833J0604
13382B0434o620k7591J2019K5625K9287k2378k3011O85N956n813j6195k984k0590
13369c1176R161J377J3760l736j9989J0298L4823j765l2590L374N941J5773M414
13356I665r520m882j1756j2532l591J0093R199J2532j2538j8569n640j063R27
13343c7675J4009L274j1258K1772p916K593K3992o341k9013k4824L958J7906K2307
13330g216K215J0290q58j82J073J122j371R02L637j0209M550j4931j7439Q1J9314
13315i022J0415j0388j3655O423P13j347l525j139L584J4291j2066R136N398J5687
13301A4505p396j4393M03K6243J5145j5108k9850k9446J688K9740J5613o43p221
$$ plain form
13288 -720 -25924 -18560 -17091 -23427 -20971 -24187 -14118 -14799 -27848 -42516 -38244 -26009 -31449 -15920
13274 -15920 -20986 -29750 -12625 14164 22295 28775 20015 2264 -20373 -16178 -28168 -18609 -7426
13261 -7426 -15140 -23087 5134 20344 25615 10797 2817 9352 17163 29413 22321 26605 28784 15644
13247 15644 9145 -1296 -15886 -31391 -29722 -26118 4687 18373 -128 -9846 -23366 -28157 -19096
13234 -19096 -7117 -16175 -20504 -8459 -8850 -26930 -61598 -57055 -26072 -23859 -22210 -18194 -11283
13221 -11283 -17042 -9157 -24648 -19513 -16047 2530 -8835 -12641 -1296 -15371 85 -6608 13875
13208 13875 22433 2827 -10893 -29698 -17807 -9212 -15725 -3063 -10189 -11930 -1258 9409 15586
13195 15586 18477 13213 28163 9560 -9860 -19760 -15418 -46643 -64117 -46009 -26623 -13474
$$ packed form
13288g20k5204P364J469o336K456l216J0069o81j3049j4668M272J2235n440J5529
13274a5920n066q764J7125K6789Q131O480q760j7751k2637M195j1990R559J1183
13261g426p714p947K8221J5210N271j4818p980O535P811J2250p092M284K179j3140
13247A5644o499j0441j4590j5505J669L604L0805J3686j8501r718j3520m791R061
13234a9096J1979r058m329J2045l91j8080l4668M543L0983K213J649M016O911
13221a1283n759P885j5491N135L466J8577j1365l806J1345j4075J5456o693K0483
13208A3875Q558j9606j3720j8805J1891Q595o513J2662p126j741J0672J0667O177
13195A5586K891n264J4950j8603j9420r900M342l1225j7474J8108J9386J3149
$$ plain form
13183 -13474 -8538 -11518 -27520 -8158 14895 25672 34106 21340 3495 -6856 -33982 -36467
13171 -36467 -34773 -27367 -19539 -24969 -5627 20195 19740 -3258 -17253 -6657 1026 5255 -5929
13158 -5929 -15001 -36064 -28717 -36050 -16490 -8616 3643 14597 16250 10341 3253 4425 -2264 7283
13144 7283 -1775 -14075 9442 26396 13214 62 -12261 -13022 -8209 -10450 5457 4359 9132
13131 9132 -2492 -6871 -889 15303 5796 -12661 4275 12165 29217 35463 49830 31550 11216
13118 11216 -8480 -15100 -10361 -4924 3611 452 -30753 -34456 -32235 -49618 -45733 -52051 -29595
13105 -29595 -30647 -30808 -35931 -19141 -9739 -15278 -14543 224 8528 4141 7727 20522 19181 26067
13091 26067 14989 -19716 -23667 -13448 -19628 -15191 8651 5564 -29218 -27582 -22449 -1154 24467
$$ packed form
13183a3474M936k980j6002J9362K3053J0777Q434j2766j7845j0351k7126k485
13171c6467J694P406P828n430J9342K5822m55k2998j3995J0596P683M229j1184
13158e929r072k1063P347p333J9560P874J2259J0954J653n909p088J172o689R547
13144G283r058j2300K3517J6954j3182j3152j2323p61M813k241J5907j098M773
13131I132j1624m379N982J6192r507j8457J6936P890J7052O246J4367j8280k0334
13118A1216j9696o620M739N437Q535l159l1205l703K221j7383L885o318K2456
13105b9595j052j61n123J6790R402n539P35J4767Q304m387L586J2795j341O886
13091B6067j1078l4705l951J0219o180M437K3842l087l4782J636N133K1295K5621
$$ plain form
13078 24467 -11003 -21171 -5193 -17272 -23258 -20123 -27113 -1768 -3478 14388 27381 21851 14678
13065 14678 16590 30116 47609 17165 -13057 -29690 -53145 -43325 -31780 -28217 -11564 -18362
13053 -18362 -20422 5245 -10955 -20619 -28565 -21525 -17529 -29870 -17137 -868 -9892 -7284 9635
13040 9635 18687 5931 -20918 -40745 -62205 -53143 -60083 -36589 -32788 -38069 -20674 2443 29775
13027 29775 20391 4718 -18140 -16259 -21425 -12956 -5682 -5503 7934 -193 12749 22333 6576
13014 6576 8838 22294 7242 -6538 -32181 -44879 -23764 -9851 1605 -5461 -3256 -11760 850
13001 850 4872 -3870 -39572 -58104 -58370 -46149 -43545 -27856 -12624 -6490 -5980 137 -15491 -178
12987 -178 18443 25997 4722 -5876 -12754 11521 3845 -27561 -14179 4855 16499 21688 21672
$$ packed form
13078B4467l5470j0168J5978j2079n986L135o990K5345j710J7866J2993n530p173
13065A4678J912J3526J7493l0444l0222j6633k3455R820J1545L563J6653o798
13053a8362k060K5667j6200r664p946P040L996j2341J2733J6269r024K608J6919
13040I635R052j2756k6849j9827k1460R062o940K3494L801n281J7395K3117K7332
13027B9775r384j5673k2858J881n166Q469P274J79J3437q127J2942R584j5757
13014F576K262J3456j5052j3780k5643j2698K1115J3913J1456p066K205q504J2610
13001H50M022q742l5702j8532k66J2221K604J5689J5232O134N10O117j5628J5313
12987a78J8621P554k1275j0598o878K4275p676l1406J3382J9034J1644N189j6
$$ plain form
12974 21672 7917 13501 14093 10973 848 15909 -5754 -14485 -11030 11012 12152 -12489 -16538
12961 -16538 -4665 9173 3203 -9469 -11740 -14174 -9426 -405 4938 -13415 -31348 -22460 -17093
12948 -17093 498 28758 21140 5742 21780 31051 33098 2150 3916 17811 6892 -4174
12936 -4174 6745 5873 6115 7289 14221 20384 7230 -11046 -28926 -46975 -47552 -30981 -13274 -32049
12922 -32049 -47588 -46854 -40132 -47299 -28576 -13121 5752 12343 22047 -8322 -35101 -35009 -21172
12909 -21172 1723 14545 9230 -37959 -49714 -20661 -3413 7741 18656 17073 -5036 -28852
12897 -28852 -38512 -14928 -10416 -10660 -16107 -20930 -4485 -1559 -25262 -48612 -30808 -33024 -29584
12884 -29584 -38233 -24290 5370 28144 27345 -5261 -1629 12283 12382 14366 -611 8001 32986
$$ packed form
12974B1672j3755N584N92l120j0125J5061k1663q731L455K2042J140k4641m049
12961a6538J1873J3838n970j2672k271k434M748R021N343j8353j7933Q888N367
12948a7093J7591K8260p618j5398J6038R271K047l0948J766J3895j0919j1066
12936d174J0919q72K42J174O932O163j3154j8276j7880j8049n77J6571J7707j8775
12922c2049j5539P34O722p167J8723J5455J8873O591R704l0369k6779R2J3837
12909b1172K2895J2822n315m7189j1755K9053J7248J1154J0915j583k2109k3816
12897b8852r660K3584M512k44n447m823J6445K926k3703k3350J7804k216L440
12884b9584q649J3943K9660K2774p99l2606L632J3912R9J984j4977Q612K4985
$$ plain form
12871 32986 47126 31610 13736 -9452 -11306 4154 27120 22174 -6782 22609 10946 -28858
12859 -28858 -24173 -28700 1336 1993 -22188 -28240 -27610 -2888 3998 -7817 -36694 -29152 -23345 -30424
12845 -30424 -18876 4522 5607 -12335 -7093 -7983 -13519 -18200 -9927 -14977 -38276 -43893 -56679
12832 -56679 -63972 -39087 -38139 -44583 -39564 -27113 -28443 -28483 -13809 -357 -18361 -37085 -42400 -50164
12818 -50164 -45300 -21289 -21705 -16303 10039 24025 23400 8467 13068 28788 28922 41819 17374
12805 17374 14692 20470 33926 42317 46592 44529 55303 45336 22226 -422 10536 25535 3842
12792 3842 1728 6247 24281 31762 24294 -8701 -5011 -2829 -22832 -17897 -4792 6094 21771
12779 21771 26380 15685 -7351 4312 8935 -12125 -24730 -9851 1174 5700 -12315 -27408
$$ packed form
12871C2986J4140j5516j7874k3188j854J5460K2966m946k8956K9391j1663l9804
12859b8858M685m527L0036O57k4181o052O30K4722O886j1815k8877P542N807p079
12845c0424J1548K3398J085j7942N242q90n536m681Q273n050k3299n617j2786
12832e6679p293K4885R48o444N019J2451j330m0J4674J3452j8004j8724n315p764
12818e0164M864K4011m16N402K6342J3986o25j4933M601J5720J34J2897k4445
12805A7374k682N778J3456Q391M275k063J0774r967k3110k2648J0958J4999k1693
12792C842k114M519J8034P481p468l2995L690K182k0003M935J3105J0886J5677
12779B1771M609j0695k3036J1663M623k1060j2605J4879J1025M526j8015j5093
$$ plain form
12767 -27408 -17177 -18071 -21637 -6007 -2682 -18886 -11741 282 -6423 -4195 -12458 3435 2689 1740
12753 1740 -712 -3240 5107 3509 -13052 -11058 9473 -6758 -15785 -3460 10005 34538 71176
12740 71176 67623 86440 104753 139311 181989 180167 140204 85781 40211 21728 20257 7423
12728 7423 1163 -3013 -2512 -13878 -15434 -12304 9530 21880 34068 48371 50565 51561 39757 44403
12714 44403 25884 4289 -230 16013 -3299 -14716 -13445 -14747 -12809 10125 15791 16229 19292
12701 19292 9748 18943 6574 18668 19271 -1224 12526 4773 -2153 35691 22957 7544 645
12688 645 -14587 2232 18620 -1772 -10330 -794 27195 20273 -328 12917 28334 11961 -38052
12675 -38052 -62020 -50577 -45926 -44638 -26012 -44519 -46996 -45188 -47889 -32071 -51941 -53091 -29116
$$ packed form
12767b7408J0231q94l566J5630L325j6204P145J2023o705K228q263J5893p46r49
12753A740k452k528Q347j598j6561J994K0531j6231r027J2325J3465K4533L6638
12740G1176l553J8817J8313L4558M2678j822l9963n4423m5570j8483j471j2834
12728G423o260m176N01j1366j556L130K1834J2350J2188J4303K194R96j1804M646
12714D4403j8519k1595m519J6243j9312j1417J271j302J938K2934N666M38L063
12701A9292r544R195j2369J2094O03k0495J3750p753o926L7844j2734j5413o899
12688F45j5232J6819J6388k0392q558R536K7989o922k0601J3245J5417j6373n0013
12675c8052k3968J1443M651J288J8626j8507k477J808k701J5818j9870j150K3975
$$ plain form
12662 -29116 -20392 -25454 -24421 -21808 -2176 -16049 1143 15342 21787 19108 6740 7354 -8177
12649 -8177 -11885 -9056 -1325 -167 -5519 -4229 3385 12993 12089 2796 -10868 -18434 -18024 -16124 -14930
12634 -14930 -12740 -7438 -13780 1811 27413 23565 15719 26309 14627 1373 -7309 -16684 -5318
12621 -5318 -2265 -1474 18485 30259 17732 5881 -7503 -16256 -3837 23476 30768 27497 28907
12608 28907 5397 -19443 -9242 3436 4726 28134 39923 24192 23506 24388 2591 18632 22372
12595 22372 -7293 -1566 -3561 -33706 -37065 14602 8444 -12287 -5057 -8648 -6175 -6917 10897
12582 10897 28382 23060 13044 15871 1224 -2580 -7396 -18937 -31971 -23454 -9250 -27968 -26442
12569 -26442 -15746 -23615 -24558 -16157 -8686 21594 35479 28466 -16049 -28458 -7421 2070 14057
$$ packed form
12662b9116Q724n062J033K613J9632j3873J7192J4199O445k679j2368O14j5531
12649h177l708K829P731J158n352J290P614R608r04r293j3664p566M10J900J194
12634a4930K190N302o342J5591K5602l848p846J0590j1682j3254q682r375J1366
12621e318L053P91J9959J1774j2527j1851j3384q753J2419K7313P292l271J410
12608B8907k3510k4840J0201J2678J290K3408J1789j5731o86Q82k1797J6041L740
12595B2372k9665N727j995l0145l359N1667o158k0731P230l591K473p42J7814
12582A0897J7485n322j0016K827j4647l804m816j1541j3034Q517J4204j8718J526
12569b6442J0696p869r43Q401P471L0280J3885p013m4515j2409K1037R491J1987
$$ plain form
12556 14057 15623 23142 27384 22070 15786 9875 10114 -26571 -36357 -16938 -16772 -25624 -26873 -17199
12542 -17199 -15131 4136 17668 27501 17698 6685 -18995 -28119 -27798 -35028 -29542 -19359 -22619
12529 -22619 -34945 -14262 -3030 8503 20850 1778 -8427 -4301 4975 18505 14122 -907
12517 -907 -11077 -11286 -24927 -14295 2986 18080 -188 -975 13558 -1333 -9815 -8569 -13428
12504 -13428 -8931 -20466 -20512 -16935 -12015 -18167 -18194 -21292 -23236 -11482 -3977 18006 -59 -23954
12490 -23954 -8956 -10140 -5421 -16485 -12389 4631 -1826 -24947 -46253 -28018 -17233 3779
12478 3779 461 -26010 -36536 -24500 12181 10056 11811 -16650 874 -3769 -14066 2676 21673
12465 21673 24613 23526 30942 48988 41193 2190 5588 26355 38650 41300 21867 11291 15960
$$ packed form
12556A4057J566P519M242n314o284n911K39l6685r786J9419J66q852j249R674
12542a7199K068J9267J3532R833r803j1013k5680r124L21p230N486J0183l260
12529b2619j2326K0683J1232J1533J2347j9072j0205M126R276J3530m383j5029
12517i07j0170k09j3641J0632J7281J5094j8268p87J4533j4891q482J246m859
12504a3428M497j1535m6L577M920o152k7l098j944J1754P505K1983j8065k3895
12490b3954J4998j184M719j1064M096J7020o457k3121k1306J8235J0785K1012
12478C779l318k6471j0526J2036L6681k125J755k8461J7524m643j0297J6742J8997
12465B1673K940j087P416J8046p795l9003L398K0767J2295K650j9433j0576M669
$$ plain form
12452 15960 458 -11644 -5088 -4339 -6189 -13453 4889 34704 38757 17221 25998 17989 -4795
12439 -4795 -16900 -7218 18075 -3923 -28935 -18604 -8942 -37440 -41228 -46641 -41045 -37848 -43817
12426 -43817 -34455 -5237 -3587 -31393 -34623 -39780 -43646 -30991 -11921 8874 26326 35609 39980
12413 39980 19430 -5847 -12107 -509 10063 9764 4734 -19759 -18019 -21957 -55349 -46992 10728
12400 10728 24149 21591 1021 10706 4728 -4180 -8941 2943 28022 38613 45377 51034 27889
12387 27889 4106 -4971 -13425 -42338 -26349 -23622 -18762 -2278 2807 -15913 834 2161 -5000
12374 -5000 10404 12351 12971 1922 14706 22899 18634 -7273 -11395 30013 42552 20078 16500
12361 16500 23920 22213 14568 3505 5777 3460 705 18451 8524 7688 -3850 -24224 -9408
$$ packed form
12452A5960j5502j2102O556P49j850p264J8342K9815M053k1536Q777q009k2784
12439d795j2105R682K5293k1998k5012J0331R662k8498l788n413N596L197n969
12426d3817R362K9218J650k7806l230n157l866J2655J9070K0795J7452R283M371
12413C9980k0550k5277o260J1598J0572k99n030k4493J740l938l3392Q357N7720
12400A0728J3421k558k0570R685n978q908m761J1884K5079J0591O764N657k3145
12387B7889k3783r077q454k8913J5989K727M860J6484N085j8720J6747J327p161
12374e000J5404J947O20j1049J2784Q193m265k5907m122M1408J2539k2474l578
12361A6500P420j707p645j1063K272k317k755J7746r927q36j1538k0374J4816
$$ plain form
12348 -9408 22598 30685 20648 15072 21365 28315 18335 5226 739 7712 4270 -4963 7252 16828
12334 16828 -10047 -26717 -33999 -29898 8820 23046 15242 26139 22763 24876 12626 5737 -1754
12321 -1754 -5294 2188 450 -26247 -25255 -16180 -15095 -12262 8874 -2051 -24704 -23798 233 9744
12307 9744 24784 18335 8562 15788 41950 42714 37771 7948 -19020 -7362 -5113 -7488 -3933 3789
12293 3789 12093 24573 21457 9287 11559 17974 44702 54484 41366 20012 15695 42882 43283
12280 43283 19098 -4827 1824 -3534 -12098 -12720 -17384 -14371 -6542 -3827 -24817 -34766 -27377 -18914
12266 -18914 -12164 -3407 5782 -1070 1579 7531 563 -2529 -7031 571 -6474 12898 12176 18168
12252 18168 25092 12917 -3696 -6103 11721 18342 15454 -5592 -17265 -26002 -42567 -17918 -7625
$$ packed form
12348i408L2006Q087j0037n576O293O950r980j3109m487O973l442r233J2215R576
12334A6828k6875j6670p282M101L8718J4226p804J0897l376K113j2250o889p491
12321a754l540P482j738k6697R92R075J085K833K1136j0925k2653R06K4031R511
12307I744J5040o449r773P226K6162P64m943k9823k6968J1658K249k375L555P722
12293C789Q304J2480l116j2170K272O415K6728R782j3118k1354m317K7187M01
12280D3283k4185k3925O651n358q564o22m664L013P829K715k0990r949P389Q463
12266a8914O750Q757R189o852K649N952o968l092m502P602p045J9372p22N992
12252A8168O924j2175j6613k407J7824O621k888k1046j1673q737j6565K4649J0293
$$ plain form
12239 -7625 -6315 -19001 -11730 -20050 -10650 -9864 -16479 -19544 -35169 -39034 -14734 4239 -11533 -17339
12225 -17339 -2753 3973 222 7675 13672 25314 25930 36026 43565 54930 49395 23336 20471
12212 20471 19782 25104 51661 56061 48142 44595 34749 33359 45972 54178 54887 65170 71231 73438
12198 73438 97882 125668 174389 257949 351710 468832 571277 589592 476498 329558 240850
12187 240850 172790 145861 127947 84496 55048 40955 23316 21089 10586 -1464 -10671 -19389
12175 -19389 3280 21454 23310 16663 36073 38556 16629 9549 9944 30320 60198 83922 114653
12162 114653 143844 165575 177334 194480 214684 250092 276663 320015 367364 439639 575347
12151 575347 762351 999640 1291160 1610449 1809937 1763431 1364366 901514 601426 414485
$$ packed form
12239g625J310j2686P271q320R400P86o615l065j5625l865K4300J8973j5772n806
12225a7339J4586O726l751P453N997J1642O16J0096P539J1365n535k6059k865
12212B0471o89N322K6557M400p919l547r846j390J2613Q206P09J0283O061K207
12198G3438K4444K7786M8721Q3560R3761J17122J02445J8315j13094j46940q8708
12187B40850o8060k6929j7914m3451k9448j4093j7639k227j0503j2050r207q718
12175a9389K2669J8174J856o647J9410K483k1927p080L95K0376K9878K3724L0731
12162A14653K9191K1731J1759J7146K0204L5408K6571M3352M7349P2275J35708
12151E75347J87004K37289K91520L19289J99488m6506l99065m62852l00088j86941
$$ plain form
12141 414485 284446 217371 184570 177220 156763 149132 114568 92375 89855 60816 9593 1117
12129 1117 14217 23626 40094 41561 32642 52031 75382 73375 72768 90585 121189 167440 174951
12116 174951 175654 216763 248852 283315 327093 373229 417395 460257 542484 704941 931316
12105 931316 1219002 1539682 1796579 1842073 1564589 1108561 733216 509570 377279 281521
12095 281521 201411 156753 132548 111141 91541 65346 62052 47996 54501 55522 53585 32044
12083 32044 30412 39516 24228 27825 40740 58199 59053 62451 47449 65959 80529 85783 80986
12070 80986 81186 78351 91110 96379 117420 150565 188333 226876 294554 360780 465956 579887
12058 579887 622636 568713 431637 309442 198585 145047 113656 75832 59094 69348 48824
$$ packed form
12141D14485j30039o7075l2801p350k0457p631l4564k2193k520k9039n1223q476
12129A117J3100R409J6468J467q919J9389K3351k007o07J7817L0604M6251P511
12116A74951P03M1109L2089L4463M3778M6136M4166M2862Q2227J62457K26375
12105I31316K87686L20680K56897M5494k77484m56028l75345k23646j32291r5758
12095B81521q0110m4658k4205k1407j9600k6195l294j4056O505J021j937k1541
12083C2044j632R104j5288L597J2915J7459Q54L398j5002J8510J4570N254m797
12070H0986K00k835J2759N269K1041L3145L7768L8543O7678O6226J05176J13931
12058E79887M2749n3923j37076j22195j10857n3538l1391l7824j6738J0254k0524
$$ plain form
12047 48824 25776 45758 56995 34376 -14848 -7048 13437 13024 29713 41254 21997 26047
12035 26047 18649 25447 2029 8282 12033 24481 22949 14713 6664 13727 8823 10569 -7146 -15905
12021 -15905 -17821 -6691 26984 28467 14244 8319 25052 22702 17455 14402 19069 20648 23581
12008 23581 -7018 -18482 2637 16620 1343 -4468 13440 17242 23096 17760 -9472 -19580
11996 -19580 -30911 -29630 -1806 -2393 -1864 8512 4900 23686 16576 9752 23005 19240 6261
11983 6261 543 12382 -10510 -19778 25262 62024 78224 77324 35529 13512 28072 41754 43390
11970 43390 27080 14038 -7296 -5458 8915 13480 31109 11268 -4925 7598 29432 11855
11958 11855 -12805 -13921 -11311 1758 3622 21905 50565 37648 43014 27883 -8060 -20317
$$ packed form
12047D8824k3048J9982J1237k2619m9224P800K0485m13J6689J1541j9257M050
12035B6047p398O798k3418O253L751J2448j532q236q049P063m904J746j7715q759
12021a5905j916J1130L3675J483j4223n925J6733k350n247l053M667J579K933
12008B3581l0599j1464K1119J3983j5277n811J7908L802N854n336k7232j0108
11996a9580j1331J281K7824n87N29J0376l612J8786p110o824J3253l765j2979
11983F261n718J1839k2892r268M5040L6762J6200r00m1795k2017J4560J3682J636
11970D3390j6310j3042k1334J838J4373M565J7629j9841j6193J2523K1834j7577
11958A1855k4660j116K610J3069J864J8283K8660j2917N366j5131l5943j2257
$$ plain form
11946 -20317 -20904 -17563 -19223 -3615 16873 41961 52615 57009 44396 37421 12884 29084 3183
11933 3183 -15968 -13885 2678 11158 17742 10084 -314 -4262 -25515 -19546 16748 19991 5592
11920 5592 10563 8371 -8956 -9185 -3900 3972 13667 10800 957 8195 -12913 680 7831 7019
11906 7019 8988 19475 12003 -6297 -13222 -10337 -12951 -14127 -12309 -24308 -24408 -6848 14715 27417
11892 27417 10684 1252 -14482 934 18333 10029 -15579 -9472 -3426 11461 20707 6504 10112
11879 10112 13302 14002 20712 39920 36445 5508 -2585 2106 16643 49662 53577 31879 20734
11866 20734 28790 17779 -5748 -14552 -11888 -14804 -29011 -34240 -4528 22704 4338 -4529 -15642
11853 -15642 -7665 -2968 3566 -926 11958 28009 14330 34364 58496 73381 61964 64871 57856
$$ packed form
11946b0317n87L341j660J5608K0488K5088J0654M394j2613o975k4537J6200k5901
11933C183j9151K083J6563Q480O584p658j0398l948k1253N969L6294L243j4399
11920E592M971k192j7327k29N285P872R695k867r843P238k1108J3593P151q12
11906G019J969J0487p472j8300o925K885k614j176J818j1999j00J7560K1563J2702
11892B7417j6733r432j5734J5416J7399q304k5608O107O046J4887R246j4203L608
11879A0112L190P00O710J9208l475l0937q093M691J4537L3019L915k1698j1145
11866B0734Q056j1011k3527q804K664k916j4207n229K9712K7232j8366q867j1113
11853a5642P977M697O534m492J2884J6051j3679K0034K4132J4885j1417K907p015
$$ plain form
11840 57856 46633 6660 -8488 -10395 -15476 423 22438 29970 12063 1193 -571 -4956 8909
11827 8909 4069 -5123 10095 18588 -5134 -31348 -21952 -3284 -2258 -14626 2175 23638 28714
11814 28714 29251 4172 14597 27801 36416 46551 32665 23881 22797 6366 -6928 1292 25365
11801 25365 510 -28885 -15271 -1801 400 -11820 -36659 -53933 -48574 -26971 -8221 14056
11789 14056 -7296 -7543 413 -26129 -30362 -5207 -1053 -8046 -35654 -26232 -184 -3995 -6809
11776 -6809 -18236 -16677 -1367 17871 1660 7465 -10342 -3668 -3883 13551 14679 -18383 -18097
11763 -18097 15095 32915 27885 21955 34977 24167 12207 24261 45805 60895 80034 101308
11751 101308 131173 137986 139947 124305 76534 47366 16019 -3083 13247 20877 18040 17149 28847
$$ packed form
11840E7856j1223l9973j5148j907n081J5899K2015P532j7907j0870j764m385J3865
11827H909m840r192J5218Q493k3722k6214R396J8668J026j2368J6801K1463N076
11814B8714N37k5079J0425J3204Q615J0135j3886q784j084j6431j3294Q220K4073
11801B5365k4855k9395J3614J3470K201j2220k4839j7274N359K1603J8750K2277
11789A4056k1352k47P956k6542m233K5155M154o993k7608R422K6048l811k814
11776f809j1427J559J5310J9238j6211N805j7807O674k15J7434J128l3062K86
11763a8097L3192J7820n030n930J3022j0810j1960J2054K1544J5090J9139K1274
11751A01308K9865O813J961j5642m7771k9168l1347j9102J6330P630k837q91J1698
$$ plain form
11738 28847 61522 51903 42310 22501 -682 23788 15645 -10504 -9382 3030 11117 111 8773
11725 8773 16462 24911 42403 29117 25804 30383 6092 18953 21173 17348 -9262 -19943 1712
11712 1712 -10208 -6817 8129 18545 35708 29814 7697 15253 29057 31834 37069 8747 8790
11699 8790 17588 20820 4597 840 12851 31721 38517 29660 33746 37567 21122 -1539 -5128
11686 -5128 28353 44404 37316 19547 24445 36573 29628 35368 54398 69082 105799 125937 147970
11673 147970 161185 180624 157845 113170 67789 46570 51610 47718 35163 49891 64294 75600
11661 75600 40982 29320 58851 55120 45660 60512 47132 12211 -7923 1903 18109 28724
11649 28724 27827 26076 23401 36001 29991 18051 -1332 519 7830 13086 30 -16815 -9581
$$ packed form
11738B8847L2675r619r593j9809k3183K4470q143k6149J122J2412Q087j1006Q662
11725H773P689Q449J7492j3286l313M579k4291J2861K220l825k6610j0681K1655
11712A712j1920L391J4946J0416J7163n894k2117P556J3804K777N235k8322M3
11699H790Q798L232j6223l757J2011J8870O796q857M086L821j6445k2661l589
11686e128L3481J6051p088j7769M898J2128o945N740J9030J4684L6717K0138K2033
11673A47970J3215J9439k2779m4675m5381k1219N040l892j2555J4728J4403J1306
11661G5600l4618j1662K9531l731r460J4852j3380l4921k0134R826J6206J0615
11649B8724q97j751k675J2600o010j1940j9383J851P311N256j3056j6845P234
$$ plain form
11636 -9581 5585 13913 28701 30842 30826 46124 23759 297 -12917 12 13510 18551 20409
11623 20409 20871 10627 19736 4727 18186 24819 32324 26795 12943 -2275 2127 14680 40088
11610 40088 44234 26220 30027 19058 26548 32087 25451 25313 29632 30047 7609 -6446 -1127 -26489
11596 -26489 -34709 -16553 -13555 -16576 -14880 13133 38126 29380 29828 47642 63505 67381 73750
11583 73750 70861 54441 13710 19035 43515 32849 18641 -3922 -12449 14061 31783 25974
11571 25974 5912 14452 11622 6970 24361 25805 31620 57649 60585 45694 41459 31724 29748
11558 29748 18925 28037 35363 38045 34264 8062 11328 14496 10261 1434 -6587 -13431 -23849 -7800
11544 -7800 13526 2361 -6994 -16340 -26093 -1642 26729 55438 49207 36431 57096 36074 29253
$$ packed form
11636i581J5166Q328J4788K141j6J5298k2365k3462j3214J2929J3498N041J858
11623B0409M62j0244R109j5009J3459O633P505n529j3852j5218M402J2553K5408
11610D0088M146j8014L807j0969P490N539o636j38M319M15k2438j4055N319k5362
11596b6489q220J8156K998l021J696K8013K4993q746M48J7814J5863L876O369
11583G3750k889j6420m0731N325K4480j0666j4208k2563q527K6510J7722n809
11571B5974k0062Q540k830m652J7391J444N815K6029K936j4891m235r735j976
11558B9748j0823R112P326K682l781k6202L266L168m235q827q021o844j0418J6049
11544g800K1326j1165r355r346r753K4451K8371K8709o231j2776K0665k1022o821
$$ plain form
11531 29253 38484 17315 8008 12748 4355 -479 17120 -4194 -3616 7608 27712 42696 44132
11518 44132 16078 30774 23663 5249 20692 11364 -11140 -3471 23154 12371 -386 -26400
11506 -26400 -38214 -41012 4490 -8439 -26847 -32808 -16683 4340 19818 15786 23196 42709
11494 42709 35964 23137 -7957 -15326 17206 49601 53482 50358 39055 57262 70964 38202
11482 38202 23510 41171 39200 38003 34607 6209 -8447 -12087 -4246 -14481 -19591 -12212 15608
11469 15608 34837 44372 49745 38555 43768 64676 53884 47411 43497 58736 45157 53395 59205
11456 59205 40191 42013 66712 41551 34963 45828 27576 -3158 228 13124 46249 81215
11444 81215 94034 100486 98857 79521 52979 31803 29891 33812 17640 8649 15806 8174 -199
$$ packed form
11531B9253R231k1169r307M740q393m834J7599k1314N78J1224K0104J4984J436
11518D4132k8054J4696p111j8414J5443r328k2504P669K6625j0783j2757k6014
11506b6400j1814k798M5502j2929j8408n961J6125K1023J5478m032P410J9513
11494D2709o745j2827l1094p369L2532L2395L881l124j1303J8207J3702l2762
11482C8202j4692J7661j971j197l396k8398j4656l640P841j0235n110P379K7820
11469A5608J9229R535N373j1190N213K0908j0792o473l914J5239j3579Q238N810
11456E9205j9014J822K4699k5161o588J0865j8252l0734L386J2896L3125L4966
11444H1215J2819O452j629j9336k6542k1176j912L921j6172q991P157p632q373
$$ plain form
11431 -199 -1877 21118 32196 38379 41936 41957 40591 42165 27144 26717 33193 20845 40466 45173
11417 45173 34029 38856 44669 56924 55171 64322 60474 50053 59677 50280 24802 18988 28073
11404 28073 36841 51288 59603 50147 40786 48319 72702 86561 80316 52787 54348 56129 48888
11391 48888 56128 48741 30204 41006 61052 45547 43487 17413 27817 41524 54626 51306
11379 51306 59435 71488 78424 85143 75126 67238 74912 91314 79683 93466 124109 107933 91992
11366 91992 102774 105685 123656 143114 151055 133538 116663 108718 130603 143148 151188 153340 152774
11353 152774 163073 184169 180193 201481 224419 222911 230204 256175 276215 302177 329669 347579
11341 347579 370096 419385 451622 495348 560387 657150 785450 915330 1064220 1240287 1452838
$$ packed form
11431a99j678K2995J1078O183L557K1j366J574j5021m27O476j2348J9621M707
11417D5173j1144M827N813J2255j753R151l848j0421R624r397k5478n814R085
11404B8073Q768J4447Q315r456r361P533K4383J3859o245k7529J561J781p241
11391D8888P240p387j8537J0802K0046j5505k060k6074J0404J3707J3102l320
11379E1306Q129J2053O936O719j0017p888P674J6402j1631J3783L0643j6176j5941
11366I1992J0782K911J7971J9458P941j7517j6875p945K1885J2545Q040K152n66
11353A52774J0299K1096l976K1288K2938j508P293K5971K0040K5962K7492J7910
11341C47579K2517M9289L2237M3726O5039R6763J28300J29880J48890J76067K12551
$$ plain form
11330 1452838 1675991 1910668 2165834 2450132 2776870 3136203 3616908 4183965 4867480
11321 4867480 5726853 6820459 8366050 10627402 13732522 17560185 21527754 24367334
11313 24367334 24431390 21101782 16002614 11414937 8174179 6051396 4681047 3754601
11305 3754601 3098615 2620976 2253887 1924500 1636706 1416706 1252880 1123753 995980
11296 995980 914246 854469 806121 740447 675174 633541 601104 569591 553184 533138 529974 493691
11284 493691 462990 415548 371817 361888 375243 392195 401310 401776 403240 412173 415164 401344 410007
11271 410007 461998 473790 449902 460117 483069 486598 510087 559704 614329 650708 701478 770314
11259 770314 852309 947971 1075592 1249367 1453189 1658725 1907241 2153065 2385527 2667063
$$ packed form
11330A452838K23153K34677K55166K84298L26738L59333M80705N67057O83515
11321D867480Q59373J093606J545591K261352L105120L827663L967569K839580
11313B4367334O4056l329608n099168m587677l240758k122783j370349r26446
11305C754601o55986m77639l67089l29387k87794k20000j63826j29127j27773
11296I95980q1734n9777m8348o5674o5273m1633l2437l1513j6407k0046l164l6283
11284D93691l0701m7442m3731r929J3355J6952R115M66J464Q933K991j3820Q663
11271D10007N1991J1792k3888J0215K2952L529K3489M9617N4625L6379N0770O8836
11259G70314Q1995R5662J27621J73775K03822K05536K48516K45824K32462K81536
$$ plain form
11249 2667063 3021557 3407489 3874068 4448599 5139548 6008211 7146039 8745983 11015264
11240 11015264 14124907 17905859 21747542 24427159 24231696 20660564 15505689 10923641
11232 10923641 7700543 5596370 4254214 3344988 2740805 2308725 1978034 1700865 1469617
11223 1469617 1249265 1067656 923641 811579 723415 642888 593381 525255 456770 438511
11213 438511 402321 358742 337471 327837 312918 293741 263207 253140 241588 228791 229561 205578
11201 205578 184012 165782 163431 166766 158076 152622 146480 115555 102736 119451 120518 117310 109483
11188 109483 118436 108802 96976 76909 65801 84044 99424 65349 51339 64695 62748 50619
11176 50619 40229 69368 71554 71367 75642 73403 72863 88877 97235 101007 105390 94070 70400 50953
$$ packed form
11249B667063L54494L85932M66579N74531O90949Q68663J137828J599944K269281
11240A1015264L109643L780952L841683K679617j95463l571132n154875m582048
11232A0923641l223098k104173j342156r09226o04183m32080l30691k77169k31248
11223A469617k20352j81609j44015j12062q8164q0527m9507o8126o8485j8259
11213D38511l6190m3579k1271r634j4919j9177l0534j0067j1552j2797P70k3983
11201B05578k1566j8230k351L335q690n454o142l0925j2819J6715J067l208p827
11188A09483Q953r634j1826k0067j1108J8243J5380l4075j4010J3356j947j2129
11176E0619j0390K9139K186j87M275k239n40J6014Q358L772M383j1320k3670j9447
$$ plain form
11162 50953 52226 60347 43255 55358 73320 54047 41247 56650 56013 53693 55145 53208 34879
11149 34879 17869 34118 50272 42411 53600 52886 53396 62920 38992 24051 21582 39863 67909
11136 67909 77773 89262 93527 84390 52003 55233 62451 74833 71303 66897 82824 64395 55854
11123 55854 29637 9162 13745 16697 45642 67586 55924 49998 43056 38131 34939 39212 35821
11110 35821 28513 26161 33117 33031 29567 39150 43088 40380 27200 24956 -9908 -2931 17644 37841
11096 37841 24277 37840 44552 17075 15186 10815 29087 21936 12168 5828 7645 15358 23132
11083 23132 21364 30875 48638 37246 21541 -333 -1007 9610 -36 1105 -2917 4864 4539 -2038
11069 -2038 6659 13223 23189 5931 2798 9507 5819 13599 12640 2242 9083 32061 37125 35791
$$ packed form
11162E0953J273Q121j7092J2103J7962j9273j2800J5403o37k320J452j937j8329
11149C4879j7010J6249J6154p861J1189p14N10R524k3928j4941k469J8281K8046
11136F7909R864J1489M265r137l2387L230P218J2382l530m406J5927j8429q541
11123E5854k6217k0475M583K952K8945K1944j1662n926o942m925l192M273l391
11110C5821p308k352O956q6l464R583L938k708j3180k244l4864O977K0575K0197
11096C7841j3564J3563O712k7477j889m371J8272p151r768o340J817P713P774
11083B3132j768R511J7763j1392j5705k1874o74J0617r646J141m022P781l25o577
11069b038Q697O564R966j7258l133O709l688P780r59j0398O841K2978N064j334
$$ plain form
11055 35791 54122 52533 57191 59818 44721 35415 25976 5061 10456 36891 34928 22646 30166
11042 30166 50427 57597 61191 27131 22461 36954 47344 40668 44930 45542 37769 50439 53131
11029 53131 41660 25669 4174 9096 8291 -2441 -6996 13637 40798 57489 24496 7065
11017 7065 23798 36655 39000 54012 57814 69012 46982 12001 19132 40009 51315 44137 42422
11004 42422 30450 50794 70878 56287 44412 40060 43481 53537 54595 65083 62938 37923
10992 37923 39145 45526 71056 67135 38014 20845 24589 40638 36953 17977 13017 9898 13795
10979 13795 27088 17654 16181 25949 25907 37786 -2066 -15513 5017 15926 7934 28690 55308
10966 55308 34865 38021 36547 38533 68709 62881 40703 32097 28605 36449 65009 66964 46161
$$ packed form
11055C5791J8331j589M658K627j5097r306r439k0915N395K6435j963j2282P520
11042C0166K0261P170L594l4060m670J4493J0390o676M262O12p773J2670K692
11029E3131j1471j5991k1495M922q05j0732m555K0633K7161J6691l2993j7431
11017G065J6733J2857K345J5012L802J1198k2030l4981P131K0877J1306p178j715
11004D2422j1972K0344K0084j4591j1875m352L421J0056J058J0488k145k5015
10992C7923J222O381K5530l921k9121j7169L744J6049l685j8976m960l119L897
10979A3795J3293r434j473R768m2J1879l9852j3447K0530J0909p992K0756K6618
10966E5308k0443L156j474J986L0176n828k2178q606l492P844K8560J955k0803
$$ plain form
10953 46161 33283 44007 48539 54719 58470 56991 65962 75602 72630 88996 82851 62108 48394
10940 48394 47308 43593 30950 38816 60976 73717 81718 67652 48461 45023 61619 81600 71229
10927 71229 49836 53961 46003 18984 25334 32072 38937 50082 58974 60571 39824 23730 21916
10914 21916 40939 60419 68096 56634 47530 51186 45171 45824 46874 38205 55607 76528 75497
10901 75497 68632 69000 66779 56241 49989 55178 54122 40984 38285 36543 47087 58173 72298
10888 72298 47161 50808 51980 49075 27361 12144 23204 30409 56344 65392 68709 103003 119541
10875 119541 140176 133285 132565 146824 171212 179036 142464 107139 90393 75441 84634 80368 53647
10862 53647 55362 69862 67563 66439 64094 57604 74177 83068 79713 46954 62670 79981 82393
$$ packed form
10953D6161j2878J0724M532O180L751j479Q971R640k972J6366o145k0743j3714
10940D8394j086l715j2643P866K2160J2741Q001j4066j9191l438J6596J9981j0371
10927G1229k1393M125p958k7019O350O738O865J1145Q892J597k0747j6094j814
10914B1916J9023J9480P677j1462r104L656o015O53J050q669J7402K0921j031
10901G5497o865L68k221j0538o252N189j056j3138k699j742J0544J1086J4125
10888G2298k5137L647J172k905k1714j5217J1060P205K5935R048L317L4294J6538
10875A19541K0635o891p20J4259K4388P824l6572l5325j6746j4952R193m266k6721
10862E3647J715J4500k299j124k345o490J6573Q891l355l2759J5716J7311K412
$$ plain form
10849 82393 66742 46070 53839 52036 62577 62015 75787 89878 81672 68756 81496 57374 26123
10836 26123 25666 45223 56547 52560 89064 95574 81336 73066 68234 60773 72694 67960 70237
10823 70237 66403 63250 69439 58882 51979 78590 92100 81293 69931 88531 106003 96925 89263
10810 89263 79956 62088 72546 86705 98502 98614 87692 82600 89225 85592 85875 81864 113710
10797 113710 138486 172222 200794 188109 195568 181442 133821 92302 100098 95976 104154 113332
10785 113332 97091 101184 103054 87376 103081 110687 100975 83884 84279 94542 93401 110096 138503
10772 138503 124405 110271 117969 130554 141855 125920 126113 134082 119719 100607 79780 54458
10760 54458 44347 68705 94740 81838 63150 47411 56290 58835 49591 72931 87660 79206
$$ packed form
10849H2393j5651k0672P769j803J0541n62J3772J4091q206j2916J2740k4122l1251
10836B6123m57J9557J1324l987L6504O510j4238q270m832p461J1921m734K277
10823G0237l834l153O189j0557o903K6611J3510j0807j1362J8600J7472r078p662
10810H9263r307j7868J0458J4159J1797J12j0922n092O625l633K83m011L1846
10797A13710K4776L3736K8572j2685P459j4126m7621m1519P796m122Q178R178
10785A13332j6241M093J870j5678J5705P606r712j7091L95J0263j141J6695K8407
10772A38503j4098j4134P698J2585J1301j5935J93P969j4363j9112k0827k5322
10760E4458j0111K4358K6035j2902j8688j5739Q879K545r244K3340J4729q454
$$ plain form
10748 79206 68923 75984 108232 104630 111318 136717 142486 160357 140935 101094 105563 117087 94891
10735 94891 74326 100497 115827 102449 81475 66480 55427 62324 95088 119574 91650 92856
10723 92856 103142 65808 77923 85971 101866 87532 64229 98295 118498 115916 93405 103033
10711 103033 144959 150929 135685 136183 162410 158523 162928 157744 156654 137539 131006 142261 172334
10698 172334 183029 178028 192968 231287 259631 266516 279752 300204 324854 352656 401520 482582
10686 482582 546467 621579 718742 821629 948518 1069489 1185751 1322978 1489803 1711627
10676 1711627 1969482 2154376 2200191 2145470 2136443 2265417 2482790 2666911 2678985 2444532
10666 2444532 2144892 1958718 1892864 1893424 1881046 1741974 1444414 1174298 991644 881042
$$ packed form
10748G9206j0283P061L2248l602O688K5399N769J7871j9422l9841M469J1524k2196
10735I4891k0565K6171J5330j3378k0974j4995j1053O897L2764K4486k7924J206
10723I2856J0286l7334J2115Q048J5895j4334k3303L4066K0203k582k2511R628
10711A03033M1926N970j5244M98K6227l887M405n184j090j9115o533J1255L0073
10698A72334J0695n001J4940L8319K8344O885J3236K0452K4650K7802M8864Q1062
10686D82582O3885P5112R7163J02887J26889J20971J16262J37227J66825K21824
10676A711627K57855J84894M5815n4721r027J28974K17373J84121J2074k34453
10666B444532k99640j86174o5854N60j2378j39072k97560k70116j82654j10602
$$ plain form
10656 881042 797170 728682 649887 559989 469572 404410 374984 329446 298595 268317 255062
10645 255062 251064 236534 208464 221048 216324 214640 196333 174240 161631 132523 110117 107020
10633 107020 113767 102228 88900 93449 91659 88261 92635 87546 97227 111100 124946 106345 89896
10620 89896 108999 139085 146154 141300 128763 114493 91725 125553 151373 148386 155977 165532 150909
10607 150909 126126 122673 118145 116662 111445 119552 137625 154400 149362 149429 174164 176420 151224
10594 151224 124912 114494 121830 136202 117461 87656 72412 90014 112815 137531 146601 135769
10582 135769 135784 161514 151313 125666 115467 139345 164167 146234 116989 109174 103865 95772 119938
10569 119938 121288 135929 168826 170578 148881 155928 173167 166142 168461 162311 168997 184827 188941
$$ packed form
10656H81042q3872o8488p8795q9898r0417o5162k9426m5538l0851l0278j3255
10645B55062l998j4530k8070J2584m724j684j8307k2093j2609k9108k2406l097
10633A07020O747j1539j3328M549j790l398M374n089R681J3873J3846j8601j6449
10620H9896J9103L0086P069m854j2537j4270k2768L3828K5820k987P591R555j4623
10607A50909k4783l453m528j483n217Q107J8073J6775n038O7K4735K256k5196
10594A51224k6312j0418P336J4372j8741k9805j5244J7602K2801K4716R070j0832
10582A35769J5K5730j0201k5647j0199K3878K4822j7933k9245p815n309q093K4166
10569A19938J350J4641L2897J752k1697P047J7239p025K319o150O686J5830M114
$$ plain form
10556 188941 188270 182043 152740 133559 126992 145486 158649 160841 183784 184672 166429 166940 169651
10543 169651 165804 155926 141694 140911 157075 158702 154120 161013 171587 191434 190571 199412 224097
10530 224097 229770 271918 312712 341352 364121 358710 335140 342037 387364 495761 558890 539539
10518 539539 524218 519463 518078 586841 705251 749953 728084 647786 572161 541059 568466 603031
10506 603031 580165 527988 454955 388065 376241 360890 357923 367542 366288 367608 336305 326191
10494 326191 353901 385990 406964 420865 419029 405396 411448 451164 492242 521625 522173 554056
10482 554056 604509 628192 645460 625607 574200 536496 525810 518044 551096 550973 525652 472134
10470 472134 444434 420613 392237 396895 397028 401456 388094 357463 350191 309435 290266 295522 295128
$$ packed form
10556A88941o71o227k9303j9181o567J8494J3163K192K2943Q88j8243N11K711
10543A69651l847r878j4232p83J6164J627m582O893J0574J9847q63Q841K4685
10530B24097N673M2148M0794K8640K2769n411k3570O897M5327J08397O3129j9351
10518E39539j5321m755j385O8763J18410M4702k1869q0298p5625l1102K7407L4565
10506F03031k2866n2177p3033o6890j1824j5351k967R619j254J320l1303j0114
10494C26191K7710L2089K0974J3901j836j3633O052L9716M1078K9383N48L1883
10482E54056N0453K3683J7268j9853n1407l7704j0686p766L3052j23k5321n3518
10470D72134k7700k3821k8376M658J33M428j3362l0631p272m0756j9169N256l94
$$ plain form
10457 295128 278505 289676 266857 240637 229904 227743 234255 257168 283145 274122 258995 215018
10445 215018 218007 245130 279166 297110 301719 294406 285076 300110 346055 372489 428075 450345
10433 450345 464984 436728 416383 447373 497337 531261 533152 532265 545725 539860 529201 528437 524431
10420 524431 535451 542112 540966 537144 509229 504404 520100 532175 554301 533142 481163 453671
10408 453671 428695 445019 468698 499561 499115 515267 533799 529803 527088 542091 547942 571987
10396 571987 614343 654031 685511 682018 661563 654273 669284 724012 756255 757368 707703 662435
10384 662435 655725 685971 711694 711546 713419 707685 702433 703607 690174 710290 755510 793239 822093
10371 822093 839302 870812 902342 944826 982439 1012407 1052215 1095024 1125810 1185563 1266270
$$ packed form
10457B95128j6623J1171k2819k6220j0733k161O512K2913K5977r023j5127m3977
10445B15018K989K7123L4036J7944M609p313r330J5034M5945K6434N5586K2270
10433D50345J4639k8256k0345L0990M9964L3924J891q87J3460n865j0659p64m006
10420E24431J1020O661j146l822k7915m825J5696J2075K2126k1159n1979k7492
10408D53671k4976J6324K3679L0863m46J6152J8532l996k715J5003N851K4045
10396E71987M2356L9688L1480l493k0455p290J5011N4728L2243J113m9665m5268
10384F62435o710L0246K5723j48J873n734n252J174j3433K0116M5220L7729K8854
10371H22093J7209L1510L1530M2484L7613K9968L9808M2809L0786N9753Q0707
$$ plain form
10360 1266270 1352479 1453859 1550846 1614547 1696815 1804901 1947242 2099487 2321696 2592267
10350 2592267 2894169 3293045 3806344 4400747 5039543 5652272 6202245 6625661 6889558
10341 6889558 6949255 6849347 6600432 6215339 5662801 5027960 4403503 3916866 3524811 3194918
10331 3194918 2894014 2682828 2586571 2550141 2547296 2569737 2597876 2649398 2688343 2736296 2789939
10320 2789939 2864640 2920096 2981318 3043594 3113732 3188385 3291547 3464433 3629685 3802349
10310 3802349 3983734 4169789 4350051 4550571 4787689 5041426 5352594 5689912 6041859
10301 6041859 6419142 6858521 7371609 7982341 8702802 9524462 10427767 11498141 12807538
10292 12807538 14417090 16343776 18413398 20614531 23032920 25899363 29496803 33852043
$$ packed form
10360A266270Q6209J01380R6987O3701Q2268J08086J42341J52245K22209K70571
10350B592267L01902L98876N13299N94403O38796O12729N49973M23416K63897
10341F889558N9697r9908k48915l85093n52538o34841o24457m86637l92055l29893
10331C194918l00904k11186r6257l6430k845K2441K8139N1522L8945M7953N3643
10320B789939P4701N5456O1222O2276P0138P4653J03162J72886J65252J72664
10310C802349J81385J86055J80262K00520K37118K53737L11168L37318L51947
10301F041859L77283M39379N13088O10732P20461Q21660R03305J070374J309397
10292A2807538J609552J926686K069622K201133K418389K866443L597440M355240
$$ plain form
10284 33852043 38837753 44343341 50358549 57353807 66196376 77833643 92807622 111097409
10276 111097409 132115610 154230247 174553182 191298701 209874118 238299104 278083318
10269 278083318 324006835 364566427 382914574 373884013 364573270 377931785 412238590
10262 412238590 452589472 475062761 452836925 395101364 346648366 326707791 327350135
10255 327350135 331835308 319148877 275016977 218344009 174977815 148966155 133740106
10248 133740106 121770991 106313517 85870575 66547743 52287025 42400144 35251047
10241 35251047 29963556 26103641 23260796 21082135 19185943 17311798 15530948 14042635
10233 14042635 12883008 11993087 11212096 10391762 9461337 8588767 7850064 7268216 6780489
$$ packed form
10284C3852043M985710N505588O015208O995258Q842569J1637267J4973979J8289787
10276A11097409K1018201K2114637K0322935J6745519J8575417K8424986L9784214
10269B78083318M5923517M0559592J8348147r030561r310743J3358515L4306805
10262D12238590M0350882K2473289k2225836n7735561m8452998j9940575O42344
10255C27350135M485173j2686431m4131900n6672968m3366194k6011660j5226049
10248A33740106j1969115j5457474k0442942j9322832j4260718r886881p149097
10241C5251047n287491l859915k842845k178661j896192j874145j780850j488313
10233A4042635j159627q89921p80991q20334r30425q72570p38703n81848m87727
$$ plain form
10224 6780489 6356068 5926016 5461265 5020508 4644629 4377191 4153881 3921592 3693922
10215 3693922 3478022 3297071 3144180 2990533 2826792 2704463 2585072 2453494 2355277 2245488
10205 2245488 2122940 2019346 1972370 1953423 1904905 1816969 1745723 1692047 1640242 1590982 1551451
10194 1551451 1513971 1482900 1445503 1410995 1366652 1354435 1317324 1261556 1238772 1236776 1218381
10183 1218381 1176141 1161198 1156488 1114073 1100431 1079830 1043387 1017491 1013732 1002921 1010038 1031061
10171 1031061 1031500 1025133 1047461 1075058 1069821 1032757 974282 941487 943970 930257 913835 892471
10159 892471 877865 827137 749169 706303 679320 652490 616065 616698 611936 598178 603588 616386
10147 616386 612745 603614 593805 580649 563849 556376 563959 556968 550232 553383 551739 526609 514166
$$ packed form
10224F780489m24421m30052m64751m40757l75879k67438k23310k32289k27670
10215C693922k15900j80951j52891j53647j63741j22329j19391j31578r8217j09789
10205B245488j22548j03594m6976j8947m8518q7936p1246n3676n1805m9260l9531
10194A551451l7480l1071l7397l4508m4343j2217l7111n5768k2784j996j8395
10183A218381m2240j4943m710m2415j3642k0601l6443k5896l759j0811P117K1023
10171A031061M39o367K2328K7597n237l7064n8475l2795K483j3713j6422k1364
10159H92471j4606n0728p7968m2866k6983k6830l6425O33m762j3758N410J2798
10147F16386l641r131r809j3156j6800p473P583o991o736L151j644k5130j2443
$$ plain form
10134 514166 519806 544595 532778 521185 512175 485072 466299 468637 460143 460218 470452 466567 450847
10121 450847 457202 451064 444126 415285 422827 449909 457372 434337 413874 374133 336993 340397 346710
10108 346710 365743 361225 345612 338380 319799 290813 290483 300347 301348 311587 304724 290008 308007
10095 308007 316167 305673 292907 287097 276630 269124 282260 280559 287583 296062 297582 299548 302763
10082 302763 309354 324584 319310 317526 331619 347382 317332 280545 265876 260137 244911 268476
10070 268476 296660 250496 217098 195471 174472 164749 179567 186651 173562 178980 165060 139473
10058 139473 122513 137101 142519 149420 155459 164144 196940 184131 163462 153260 152525 157348 141084
10045 141084 127834 137698 147278 141124 143773 132920 153725 182398 178843 184166 163773 146906 129495
$$ packed form
10134E14166N640K4789j1817j1593r010k7103j8773K338q494P5J0234l885j5720
10121D50847O355o138o938k8841P542K7082P463k3035k0463l9741l7140L404O313
10108C46710J9033m518j5613p232j8581k8986l30R864J001J0239o863j4716J7999
10095C08007Q160j0494j2766n810j0467p506J3136j701P024Q479J520J966L215
10082C02763O591J5230n274j784J4093J5763l0050l6787j4669n739j5226K3565
10070B68476K8184m6164l3398k1627k0999r723J4818P084j3089N418j3920k5587
10058A39473j6960J4588N418O901O039Q685L2796j2809k0669j0202p35M823j6264
10045A41084j3250R864R580o154K649j0853K0805K8673l555N323k0393j6867j7411
$$ plain form
10032 129495 141600 180270 171099 148629 143139 131971 131947 124959 117434 90271 86525 101424 104145
10019 104145 78989 45167 29893 35824 47051 56509 37245 23869 39637 44430 19623 5629
10007 5629 19859 38477 43188 19297 6374 35199 70708 95643 103655 71329 61201 78982
9995 78982 88840 96997 84418 68092 55423 69401 91389 112655 107968 118175 108105 79272
9983 79272 72116 61909 55673 39242 30201 27987 25472 13827 -8443 -22928 114 10530 18371
9970 18371 16315 25004 28100 17043 12991 17049 33209 37654 39798 46606 38145 23371 10052 5503
9956 5503 7420 -2118 -7659 -11872 8243 28426 48262 64661 77328 72886 66466 73138 84350
9943 84350 72281 65555 73947 77737 48505 30963 33094 45123 54761 53461 34015 35740 39674
$$ packed form
10032A29495J2105L8670r171k2470n490j1168k4o988p525k7163l746J4899K721
10019A04145k5156l3822j5274N931J1227R458j9264j3376J5768M793k4807j3994
10007E629J4230J8618M711k3891j2923K8825L5509K4935Q012l2326j0128J7781
9995G8982R858Q157j2579j6326j2669J3978K1988K1266m687J0207j0070k8833
9983G9272p156j0207o236j6431r041k214k515j1645k2270j4485K3042J0416P841
9970A8371k056Q689L096j1057m052M058J6160M445K144O808q461j4774j3319m549
9956E503J917r538n541m213K0115K0183J9836J6399J2667m442o420O672J1212
9943H4350j2069o726Q392L790k9232j7542K131J2029R638j300j9446J725L934
$$ plain form
9930 39674 50619 46502 34459 32802 12348 33424 48320 52410 35384 31758 51327 62396 77766
9917 77766 78782 45357 23681 22341 26805 37459 52851 52143 27731 5031 8549 32614 32739
9904 32739 14606 33317 31171 45963 69269 84733 96690 86439 80012 85235 82063 73941 72792
9891 72792 92617 103347 106816 83898 94656 79265 58656 72237 90222 92455 101104 106405 112350
9878 112350 116892 134758 151230 159659 198820 228273 264998 296544 316988 305668 356042 439989
9866 439989 490955 561013 663337 794073 907725 1013149 1107869 1200480 1365771 1612404
9856 1612404 1884382 2131236 2283955 2315491 2287110 2355448 2521143 2718735 2843674 2745095
9846 2745095 2440722 2182520 2087745 2108951 2122822 2045365 1817747 1507642 1267961 1105996
$$ packed form
9930C9674J0945m117j2043j657k0454K1076J4896M090j7026l626J9569J1069J5370
9917G7766J016l3425k1676j340M464J0654J5392p08k4412k2700L518K4065J25
9904C2739j8133J8711k146J4792K3306J5464J1957j0251o427N223l172q122j149
9891G2792J9825J0730L469k2918J0758j5391k0609J3581J7985K233Q649N301N945
9878A12350M542J7866J6472Q429L9161K9453L6725L1546K0444j1320N0374Q3947
9866D39989N0966P0058J02324J30736J13652J05424R4720R2611J65291K46633
9856A612404K71978K46854J52719L1536k8381O8338J65695J97592J24939r8579
9846B745095l04373k58202r4775K1206J3871p7457k27618l10105k39681j61965
$$ plain form
9836 1105996 971681 880260 790873 688418 607331 566041 546270 534054 517036 472507 456367
9825 456367 436084 388683 345253 321267 299447 286512 308268 311641 285852 282817 247280 207464
9813 207464 215740 198325 197027 211830 243875 256894 267017 292326 319787 320260 290729 282626 278621
9800 278621 273233 275553 288288 307987 305949 266652 219611 185503 163521 160475 132934 131987 146677
9787 146677 147068 137390 134723 147449 117893 124299 130263 118441 110001 103304 108779 138407 168358
9774 168358 164526 150884 126070 122442 121594 127788 127417 113324 122483 98767 77780 73702 93924
9761 93924 85253 75459 78988 106138 116639 107515 104083 104697 90151 76557 77633 69780 78007 84691
9747 84691 68826 68925 61901 56512 55911 74547 67400 41592 35720 51354 50086 43523 51929 48394
$$ packed form
9836A105996j34315r1421q9387j02455q1087m1290j9771j2216j7018m4529j6140
9825D56367k0283m7401m3430k3986k1820j2935K1756L373k5789l035l5537l9816
9813B07464Q276j7415j298J4803L2045J3019J0123K5309K7461M73k9531q103m005
9800B78621n388K320J2735J9699k038l9297m7041l4108k1982l046k7541r47J4690
9787A46677L91r678k667J2726k9556O406N964j1822q440o697N475K9628K9951
9774A68358l832j3642k4814l628q48O194l71j4093R159k3716k0987m078K0222
9761I3924q671r794L529K7150J0501r124l432O14j4546j3594J076p853Q227O684
9747H4691j5865R9p024n389o01J8636p147k5808n872J5634j268o563Q406l535
$$ plain form
9733 48394 32633 20392 53451 67188 63538 78860 78034 67301 76824 75355 68861 72913 77733
9720 77733 95130 96172 82999 72908 81430 68375 57478 67010 49019 30429 6176 16361
9708 16361 33028 40078 23040 15133 24822 24750 47224 33315 18292 42643 42993 46930 65600 56713
9694 56713 50620 36275 9352 14955 47656 65906 69921 67429 88845 96413 57549 31533 30670
9681 30670 20300 7228 24268 35952 35112 54893 76473 78346 38749 16662 27332 35592 25082
9668 25082 25311 46445 46200 50413 50461 37748 35753 42513 26117 17902 13575 22087 34013 27141 42446
9653 42446 38812 9370 22467 20862 31303 23406 49001 40103 37526 24996 23440 27521 35345
9640 35345 28363 26732 38769 39395 47153 48947 49795 48562 53839 29318 17665 15940 34336 38465
$$ packed form
9733D8394j5761j2241L3059J3737l650J5322q26j0733R523j469o494M052M820
9720G7733J7397J042j3173j0091Q522j3055j0897R532j7991j8590k4253J0185
9708A6361J6667P050j7038p907R689p2K2474j3909j5023K4351L50L937J8670q887
9694E6713o093j4345k6923N603L2701J8250M015k492K1416P568l8864k6016q63
9681C0670j0370j3072J7040J1684q40J9781K1580J873l9597k2087J0670Q260j0510
9668B5082K29K1134k45M213M8j2713j995O760j6396q215m327Q512J1926o872J5305
9653D2446l634k9442J3097j605J0441p897K5595q898k577j2530j556M081P824
9640C5345o982j631J2037O26P758J794Q48j233N277k4521j1653j725J8396M129
$$ plain form
9626 38465 29050 39258 37794 27336 11532 15341 12868 2380 13727 28279 32815 12416 -3861
9613 -3861 2788 446 35173 23671 10798 -2303 21938 50576 58572 70047 62208 44837 50796
9600 50796 32766 27029 35247 39738 29390 29608 38324 56391 56619 46722 43045 41743 44820 52200
9586 52200 55110 18141 -293 15079 22250 18991 5168 10064 27052 37563 23672 24773 20438
9573 20438 12740 3604 -2634 -10871 -18894 -15807 4960 13177 -1650 31648 55429 38178 36723
9560 36723 36175 18064 25792 60957 59596 89311 116777 104303 102678 99060 100853 79696 57313
9547 57313 32991 37801 64504 52791 40718 38357 26346 42641 67261 47384 65184 82401
9535 82401 88975 93955 90001 85340 51066 18684 25831 33556 36107 27484 28571 44054 61932 82521
$$ packed form
9626C8465r415J0208j464j0458j5804L809k473j0488J1347J4552M536k0399j6277
9613c861O649k342L4727j1502j2873j3101K4241K8638P996J1475p839j7371N959
9600E0796j8030n737Q218M491j0348K18Q716J8067K28r897l677j302L077P380
9586E2200K910l6969j8434J5372P171l259j3823M896J6988J0511j3891J101m335
9573B0438p698r136o238q237q023L087K0767Q217j4827L3298K3781j7251j455
9560C6723n48j8111P728L5165j361K9715K7466j2474j625l618J793k1157k2383
9547E7313k4322M810K6703j1713j2073k361j2011J6295K4620j9877J7800J7217
9535H2401O574M980l954m661l4274l2382P147P725K551q623J087J5483J7878K0589
$$ plain form
9521 82521 97446 59177 40424 56618 63608 55561 43967 47606 48432 57540 58716 34378 35184 62156
9507 62156 85852 62600 38621 50177 63055 47670 32778 43010 59223 52776 39154 38540
9495 38540 53340 60817 43129 35043 37615 30759 53276 60126 64332 45242 34659 12927 9665
9482 9665 -13349 -31583 -4999 29858 38327 11949 12643 32208 30847 43928 40037 51899 53339
9469 53339 19738 -2232 2781 16944 37723 39032 23709 19654 -21248 -30678 -2604 20780 31204
9456 31204 21002 24961 13488 -8648 -9060 9239 33794 20196 25476 41860 59535 53687 30350
9443 30350 41133 38639 25008 27204 22418 -4037 -14525 24958 40344 65744 77932 80563 93813
9430 93813 91613 98868 123848 90740 55903 56300 65515 32757 22138 38007 43135 41994 59759
$$ packed form
9521H2521J4925l8269j8753J6194O990q047j1594L639Q26R108J176k4338Q06K6972
9507F2156K3696k3252k3979J1556J2878j5385j4892J0232J6213o447j3622o14
9495C8540J4800P477j7688q086K572o856K2517O850M206j9090j0583k1732l262
9482I665k3014j8234K6584L4857Q469k6378O94J9565j361J3081l891J1862J440
9469E3339l3601k1970N013J4163K0779J309j5323m055m0902r430K8074K3384J0424
9456C1204j0202L959j1473k2136m12J8299K4555j3598N280J6384J7675n848k3337
9443C0350J0783k494j3631K196m786k6455j0488L9483J5386K5400J2188K631J3250
9430I3813k200P255K4980l3108l4837L97R215l2758j0619J5869N128j141J7765
$$ plain form
9417 59759 82017 72880 40509 43006 42500 47015 50107 63202 59863 43520 30341 34592 16020
9404 16020 -4120 -1263 9313 8520 19724 27787 31630 46144 40911 32364 50893 66915 61125
9391 61125 57346 41575 51243 55661 56096 28446 26683 32348 30571 22750 -5381 1384 10988 13352
9377 13352 -6701 -33511 -9765 4830 22565 41295 44842 64179 61010 65743 57152 35910 68497
9364 68497 76165 76163 71753 80427 110365 94921 100142 64950 52424 58364 37981 41221 59799 42189
9350 42189 38043 51517 49991 18524 35171 51274 55215 59973 71723 65662 71292 85583 80913
9337 80913 79123 48157 50655 49256 32281 35380 46308 44710 42639 60587 78314 65779 56242
9324 56242 36418 4453 -14159 -20724 -14133 11652 34307 28910 37838 41383 28152 47312 57640
$$ packed form
9417E9759K2258r137l2371K497n06M515L092J3095l339j6343j3179M251j8572
9404A6020k0140K857J0576p93J1204Q063L843J4514n233q547J8529J6022n790
9391F1125l779j5771R668M418M35k7650j763N665j777p821k8131O765R604K364
9377A3352k0053k6810K3746J4595J7735J8730L547J9337l169M733q591k1242L2587
9364F8497P668km410Q674K9938j5444N221l5192j2526N940k0383L240J8578j7610
9350D2189m146J3474j526l1467J6647J6103L941M758J1750o061N630J4291m670
9337H0913j790l0966K498j399j6975L099J0928j598k071J7948J7727j2535r537
9324E6242j9824l1965j8612o565O591K5785K2655n397Q928L545j3231J9160J0328
$$ plain form
9311 57640 55437 73913 69162 70577 80130 83617 72839 39450 12498 14652 18823 25344 6474
9298 6474 75 30502 34975 27651 21783 11153 5479 15992 30335 47764 48959 79841 99640
9285 99640 103729 90141 66246 53321 48054 58160 77561 67398 71151 64667 59945 65979 72057
9272 72057 100144 92959 77839 30705 31793 37494 48914 84958 71351 36481 38435 44272 69194
9259 69194 68010 71403 68701 56118 32158 42411 62123 72697 70217 67084 64112 71849 51046
9246 51046 37956 37913 27682 43908 68176 57052 55910 64971 83526 93939 91059 69065 66520
9233 66520 84250 86412 80070 86796 79450 76961 44170 39864 51002 46871 48508 29322 21673 31183
9219 31183 33777 31304 38946 48543 73781 98617 100473 107627 100192 102975 89840 64574 43490
$$ packed form
9311E7640k203J8476m751J415R553L487j0778l3389k6952K154M171O521j8870
9298F474o399L0427M473p324n868j0630n674J0513J4343J7429J195L0882J9799
9285I9640M089j3588k3895j2925n267J0106J9401j0163L753o484m722O034O078
9272G2057K8087p185j5120m7134J088N701J1420L6044j3607l4870J954N837K4922
9259F9194j184L393k702j2583k3960J0253J9712J0574k480l133k972P737k0803
9246E1046j3090m3j0231J6226K4268j1124j142R061J8555J0413k880k1994k545
9233F6520J7730K162o342O726p346k489l2791m306J1138m131J637j9186p649R510
9219C1183K594k473P642R597K5238K4836J856P154p435K783j3135k5266k1084
$$ plain form
9206 43490 53847 66200 69081 72196 51860 62991 86303 57001 30414 21990 13552 42643 59174
9193 59174 58779 63626 67118 79946 93789 82102 64921 84604 100650 88339 60439 61385 98075
9180 98075 106428 79136 88043 100524 114163 109003 87027 84864 91470 91754 95489 104177 73175 62557
9166 62557 66798 88748 117563 129392 111599 89910 96747 100943 61388 62034 72965 61374 51707
9153 51707 58286 57393 66448 60630 61346 79518 99483 94239 93751 100182 103939 102224 96734 99023 100652
9138 100652 81120 89876 110531 121680 126707 137211 140082 138525 140820 145867 135050 124860 124961
9125 124961 129104 118196 125424 153986 167586 153960 148504 153774 153551 136144 139548 160766 183884
9112 183884 190840 195524 213580 231170 253406 273445 306867 329314 366496 409244 472517 533857
$$ packed form
9206D3490J0357J2353K881L115k0336J1131K3312k9302k6587q424q438K9091J6531
9193E9174l95M847L492J2828J3843j1687j7181J9683J6046j2311k7900R46L6690
9180I8075Q353k7292Q907J2481J3639n160k1976k163O606K84L735Q688l1002j0618
9166F2557M241K1950K8815J1829j7793k1689O837M196l9555O46J0931j1591r667
9153E1707O579q93R055n818P16J8172J9965n244m88O431L757j715n490K289J629
9138A00652j9532Q756K0655J1149N027J0504K871j557K295N047j0817j0190J01
9125A24961M143j0908P228K8562J3600j3626n456N270k23j7407L404K1218K3118
9112A83884O956M684J8056J7590K2236K0039L3422K2447L7182M2748O3273O1340
$$ plain form
9100 533857 594951 683546 805030 953143 1114216 1277684 1419535 1556346 1706750 1912692
9090 1912692 2202908 2547590 2961541 3489296 4132617 5017706 6356541 8459379 11457262
9081 11457262 15222762 19059194 21300488 19147902 13388282 8509169 5568945 3889303
9073 3889303 2863045 2218201 1765919 1451133 1214838 1036073 872801 750861 671758 604901
9063 604901 521630 458218 417801 383358 364562 357664 344374 323035 291229 270582 264779 265065
9051 265065 239250 226353 225130 213941 187705 174085 161826 158242 163802 147979 138644 135653 137510
9038 137510 159053 155582 121474 91336 95732 127083 135387 150726 169837 179670 169626 153908
9026 153908 156546 170627 154986 151812 123372 98596 94206 100719 108040 103492 103498 92572 73774 68939
$$ packed form
9100E33857O1094Q8595J21484J48113J61073J63468J41851J36811J50404K05942
9090A912692K90216L44682M13951N27755O43321Q85089J338835K102838K997883
9081A1457262L765500L836432K241294k152586n759620m879113k940224j679642
9073C889303j026258o44844m52282l14786k36295j78765j63272j21940p9103o6857
9063F04901q3271o3412m0417l4443j8796o898j3290k1339l1806k0647n803K86
9051B65065k5815j2897j223j1189k6236j3620j2259l584N560j5823r335k991J857
9038A37510K1543l471l4108l0138M396L1351Q304J5339J9111R833j0044j5718
9026A53908K638J4081j5641l174k8440k4776m390O513P321m548Oj0926j8798m835
$$ plain form
9012 68939 73547 53845 47078 59708 100120 99149 85110 72398 63550 40853 44236 57023 78668
8999 78668 62802 61153 52440 44999 30801 43618 53693 47596 39711 46453 69813 63918 33501
8986 33501 35475 24687 27149 22057 26893 50772 59570 41264 12563 19452 32079 34594 43820
8973 43820 38923 72598 89809 87363 79407 81585 66585 79749 77771 48169 60501 75700 72778
8960 72778 63854 55846 63082 75579 85162 79619 54462 40010 52858 64255 67114 67487 63865 41376
8946 41376 23917 22700 12719 14354 22899 22278 22674 15961 18919 16220 12911 25748 74684 71680
8932 71680 46825 23399 4756 -6166 -5892 -1942 10090 10362 8890 22333 40602 46971 24375
8919 24375 3517 1730 25429 17609 6168 -1660 -5207 -13652 -26379 -23194 10709 19076 18528 13809
$$ packed form
9012F8939M608j9702o767J2630M0412r71j4039j2712q848k2697L383J2787K1645
8999G8668j5866j649q713p441j4198J2817J0075o097p885O742K3360n895l0417
8986C3501J974j0788K462n092M836K3879Q798j8306k8701O889J2627K515R226
8973D3820m897L3675J7211k446p956K178j5000J3164j978k9602J2332J5199k922
8960G2778q924q008P236J2497R583n543k5157j4452J2848J1397K859L73l622k2489
8946D1376j7459j217r981J635Q545o21L96o713K958k699l309J2837M8936l004
8932G1680k4855k3426j8643j0922K74L950J2032K72j472J3443J8269O369k2596
8919B4375k0858j787K3699p820j1441p828l547q445j2727L185L3903Q367n48m719
$$ plain form
8905 13809 -2103 4597 -1994 -10164 16620 43615 35713 28238 32801 30794 38221 49915 37220
8892 37220 3543 -377 17600 16218 34089 33231 23896 25570 26750 26747 20331 17360 994 -14499
8878 -14499 -12954 19280 14999 18926 33224 28515 16200 11725 -4580 -15063 4115 2863 8799
8865 8799 18812 24508 19371 7355 16476 18745 10589 -9763 -4906 20995 34191 33525 6920 2578
8851 2578 -2420 -3350 -9807 -9737 22461 45709 13322 -40554 -35307 -53303 -38896 -5572 10618 13924
8837 13924 2395 -13041 -1189 -302 4267 17726 -3118 -16355 11353 14903 -3832 7830 25678
8824 25678 33779 12387 -1825 -13189 -5058 23549 26797 27690 13958 14378 20881 55660 35197
8811 35197 21721 12427 21932 36331 25338 21307 31400 18609 14435 33606 41914 4609 7706
$$ packed form
8905A3809j5912O700o591q170K6784K6995p902p475M563k007P427J1694j2695
8892C7220l3677l920J7977j382J7871q58r335J674J180lo416k971j6366j5493
8878a4499J545L2234m281L927J4298m709j2315m475j6305j0483J9178j252N936
8865H799J0013N696n137j2016R121K269q156k0352M857K5901J3196o66k6605m342
8851B578m998r30o457P0L2198K3248l2387n3876N247j7996J4407L3324J6190L306
8837A3924j1529j5436J1852Q87M569J3459k0844j3237K7708L550j8735J1662J7848
8824B5678Q101k1392j4212j1364Q131K8607L248Q93j3732M20O503L4779k0463
8811C5197j3476r294R505J4399j0993m031J0093j2791m174J9171Q308l7305L097
$$ plain form
8798 7706 11772 5757 -9466 -24145 -43836 -52779 -38811 -33872 -35543 -37063 -15147 -7296 15403
8785 15403 35334 35945 20706 31572 23903 10529 9764 2753 -163 -12495 -2353 -7896 -11574 -48502
8771 -48502 -58063 -28631 -18032 -8285 -1030 -556 10185 26768 14050 -1181 16771 36465 30772
8758 30772 28413 37658 13275 9617 29735 29906 15962 15102 523 -14781 -18853 3984 6655 22675
8744 22675 18456 24823 19116 10516 28131 32962 19995 14673 35768 40837 51544 66727 52342
8731 52342 35823 32875 64133 90749 78048 57356 23112 20449 46281 56491 32314 13108
8719 13108 -16402 -19451 -19543 -9541 3012 334 556 -5598 5291 15319 36051 45833 38968 36370
8705 36370 32153 40602 31576 15062 2577 -12769 -11670 -6953 -8401 666 -12600 5300 25776
$$ packed form
8798G706M066o015j5223j4679j9691q943J3968M939j671j520K1916P851K2699
8785A5403J9931O11j5239J0866p669j3374p65p011k916j2332J0142n543l678l6928
8771d8502r561K9432J0599R747P255M74J0741J6583j2718j5231J7952J9694n693
8758C0772k359R245k4383l658K0118J71j3944q60j4579j5304m072K2837K671J6020
8744B2675m219O367n707q600J7615M831j2967n322K1095N069J0707J5183j4385
8731E2342j6519k948L1258K6616j2701k0692l4244k663K5832J0210k4177j9206
8719A3108k9510l049r2J0002J2553k678K22o154J0889J0028K0732R782o865k598
8705C6370m217Q449r026j6514j2485j5346J099M717j448R067j3266J7900K0476
$$ plain form
8692 25776 17311 12135 -23 -7858 -25809 -17635 14349 26159 13897 11231 33779 53511 54441
8679 54441 43656 15450 -903 -16921 -4822 -3439 -20253 -4638 1949 9039 13510 -73 16085
8666 16085 11573 -20144 -30670 -36157 -28559 -21204 -12659 -8973 -14713 -24466 -4998 10262 13175 21565
8652 21565 16540 274 16477 19200 37268 20753 11180 -126 8861 1643 3279 17269 28880
8639 28880 40714 37431 25015 9494 32073 34145 19139 2570 6964 30770 30417 14909 23371
8626 23371 14772 17682 31431 26445 43975 42685 52852 65255 49556 40939 48327 66354 77681
8613 77681 93974 85052 97128 92985 62300 42345 60686 93969 107482 81124 80095 72143 61954
8600 61954 73586 74173 46019 46749 59193 66223 88550 96354 121765 125388 123513 138385 142940 166952
$$ packed form
8692B5776q465n176j2158p835j7951Q174L1984J1810j2262k666K2548J9732R30
8679E4441j0785k8206j6353j6018J2099J383j6814J5615O587P090M471j3583J6158
8666A6085m512l1717j0526n487P598P355Q545L686n740r753J9468J5260K913Q390
8652B1565n025j6266J6203K723J8068j6515r573j1306Q987p218J636J3990J1611
8639B8880J1834l283j2416j5521K2579K072j5006j6569M394K3806l53j5508Q462
8626B3371q599K910J3749m986J7530j290J0167J2403j5699q617P388J8027J1327
8613G7681J6293q922J2076m143l0685j9955J8341L3283J3513k6358j029p952j0189
8600F1954J1632N87k8154P30J2444P030K2327P804K5411L623j875J4872M555K4012
$$ plain form
8586 166952 179102 193927 209319 215891 258387 311950 363637 421802 466697 528261 683368 894091
8574 894091 1194771 1549694 1855043 2012886 1809413 1310750 877992 601132 435379 334199
8564 334199 240043 169361 132128 137224 132802 108530 123756 124241 114844 101048 104233 128973 145976
8551 145976 141275 149955 166247 173470 176120 192653 232875 295071 319756 310605 362665 387663 387151
8538 387151 428391 493300 557065 634879 748930 920310 1150894 1482849 1968823 2612065
8528 2612065 3311224 3855311 3758980 2921884 1943596 1254445 843432 612049 463632 378242
8518 378242 319553 273194 237977 222206 208137 194869 181604 178537 161270 134100 122246 105462
8506 105462 84187 89597 128358 120652 122403 131152 134873 146640 164289 180732 181113 188232 194873
$$ packed form
8586A66952J2150J4825J5392O572M2496N3563N1687N8165M4895O1564J55107K10723
8574H94091L00680L54923L05349J57843k03473m98663m32758k76860j65753j01180
8564C34199r4156p0682l7233N096m422k4272J5226M85r397j3796L185K4740J7003
8551A45976m701Q680J6292P223K650J6533M0222O2196K4685r151N2060K4998n12
8538C87151M1240O4909O3765P7814J14051J71380K30584L31955M85974O43242
8528B612065O99159N44087r6331q37096r78288o89151m11013k31383j48417q5390
8518C78242n8689m6359l5217j5771j4069j3268j3265l067j7267k7170j1854j6784
8506A05462k1275N410L8761p706J751Q749L721J1767J7649J6443L81P119O641
$$ plain form
8493 194873 223477 267081 325366 359668 425775 517803 635870 845178 1139949 1493308 1792451
8482 1792451 1900427 1639869 1164834 771078 515102 381873 288783 222253 180777 149024
8472 149024 127648 112173 91062 72801 58697 60848 40935 40939 55942 59620 61358 62140 62915 64427
8458 64427 34773 33390 14131 -1459 20651 7000 -1450 6809 14942 -1858 24220 38945 17668
8445 17668 8443 6097 23122 30640 35172 39171 20187 -4190 -17805 1384 21069 13500 10692
8432 10692 18832 11877 -25674 -30563 -8788 3934 12111 23526 12481 9023 19795 17898 26375
8419 26375 29042 15701 -9423 -18369 -397 30726 33766 23345 25150 2540 -31994 -33037 -10459
8406 -10459 17710 18945 39996 58341 59947 36757 4137 -11658 -18186 -23884 -4231 9578 15595
$$ packed form
8493A94873K8604M3604N8285L4302O6107R2028J18067K09308K94771L53359K99143
8482A792451J07976k60558m75035l93756k55976j33229r3090o6530m1476l1753
8472A49024k1376j5475k1111j8261j4104K151j9913MJ5003L678J738P82P75J512
8458F4427k9654j383j9259j5590K2110j3651q450Q259Q133j6800K6078J4725k1277
8445A7668r225k346J7025P518M532L999j8984k4377j3615J9189J9685p569k808
8432A0692Q140o955l7551m889K1775J2722Q177J1415j1045l458J0772j897Q477
8419B6375K667j3341k5124q946J7972L1123L040j0421J805k2610l4534j043K2578
8406a0459K8169J235K1051J8345J606k3190l2620j5795o528n698J9653J3809O017
$$ plain form
8393 15595 26721 35489 16481 28917 27838 20511 19948 41786 39157 22560 18039 21554 19893 17041
8379 17041 5713 3017 3831 -2746 -19519 -8985 6266 3961 8418 10290 2853 10107 20374 41546
8365 41546 24126 -20570 -3696 16558 10000 -2441 5330 21634 23781 15390 4078 -6617 -28591
8352 -28591 -20889 -5525 25287 24905 10183 16368 16014 -552 88 -6951 -32645 -25713 -7253 -29121
8338 -29121 -60647 -43580 -10812 -18063 -32631 -27203 -2014 -1602 1551 9799 14730 18307 20250 12984
8324 12984 -31018 -53421 -34491 -30508 -24160 -14698 -9655 -11760 -31754 -64440 -57094 -45092 -29577
8311 -29577 -25046 -44785 -55020 -36633 -20928 -3573 -15662 -40774 -33598 -38769 -18763 -7841
8299 -7841 -4086 -5932 -8908 -10955 -2591 -6634 -32883 -56367 -60709 -47114 -46879 -34656 -20304 -10956
$$ packed form
8393A5595J1126Q768j9008J2436j079p327n63K1838k629j6597m521L515j661k852
8379A7041j1328k696Q14o577j6773J0534J5251k305M457J872p437P254J0267K1172
8365D1546j7420m4696J6874K0254o558j2441P771J6304K147q391j1312j0695k1974
8352b8591P702J5364L0812l82j4722O185l54j6566O40p039k5694O932J8460k1868
8338b9121l1526J7067L2768p251j4568N428K5189M12L153Q248M931L577J943p266
8324A2984m4002k2403J8930L983O348R462N043k105j9994l2686P346J2002J5515
8311b9577M531j9739j0235J8387J5705J7355j2089k5112P176n171K0006J0922
8299g841L755j846k976k047Q364m043k6249k3484m342J3595K35J2223J4352R348
$$ plain form
8285 -10956 -20147 -19759 -16670 -4428 17226 17027 18395 -16564 -18947 -14422 -26727 -30359 -31952 -22876
8271 -22876 -31885 -48554 -50610 -42690 -26230 -17656 -19488 -12205 2748 -6800 -24660 -17805 13504
8258 13504 -1774 6938 17720 9220 2771 28517 37910 31536 -6807 -6217 -6443 -32932 -25787 17005
8244 17005 33644 42769 21217 12371 18072 9250 -1073 -4329 -7719 6051 1657 -17661 -20175
8231 -20175 -27559 -25842 -23553 -30330 -29985 -16873 -4614 7602 8812 -5226 -16441 5530 14516
8218 14516 5258 3093 -11637 -19693 -43628 -43174 -51973 -32288 -3225 -5682 -5766 -3156 7435 15444
8204 15444 3287 22919 23260 21390 15382 -4425 -11582 -8513 -14995 23866 46878 56467 46012
8191 46012 36874 33752 35392 25628 34123 35181 19987 -14146 -4895 -2796 -10829 -4977 1293 20105
$$ packed form
8285a0956r191L88L089J2242K1654j99J368l4959k383M525j2305l632j593R076
8271b2876r009j6669k056P920J6460Q574j832P283J4953r548j7860O855L1309
8258A3504j5278Q712J0782q500o449K5746R393o374l8343N90k26k6489P145M2792
8244A7005J6639R125k1552q846N701q822j0323l256l390J3770m394j9318k514
8231b0175p384J717K289o777L45J3112J2259J2216J210j4038j1215K1971Q986
8218A4516r258k165j4730q056k3935M54q799J9685K9063k457q4K610J0591Q009
8204A5444j2157J9632L41j870o008j9807p157L069o482L8861K3012R589j0455
8191D6012r138l122J640r764Q495J058j5194l4133R251K099q033N852O270J8812
$$ plain form
8177 20105 44299 27116 20890 1290 3651 889 11432 -8724 -37067 -51243 -39503 -21072
8165 -21072 -17715 -12252 -9509 -15864 -574 1298 -14738 -42204 -30072 -35460 -21854 12095 8170
8152 8170 -17805 -36322 -33053 -18824 -3538 8656 4897 -11661 -15107 -8939 -10618 -17671 727
8139 727 -3380 -7366 10802 -4661 -20479 -5865 13933 7015 -5189 7619 39314 37268 27882
8126 27882 25785 11718 -18099 -27376 -6948 6224 -22109 -33882 -19349 -30937 -23678 -12365
8114 -12365 -13942 1972 4910 -5929 10678 30341 46955 25344 -6449 -25161 -13010 -24879
8102 -24879 -13605 6161 27812 32012 1825 -4368 -3734 -3768 -459 -9022 -335 16177 26731 7608
8088 7608 5607 16434 24349 57822 55734 37933 7046 -42677 -25248 -4335 21592 12820 -2117
$$ packed form
8177B0105K4194j7183o226j9600K361k762J0543k0156k8343j4176J1740J8431
8165b1072L357N463K743o355J5290J872j6036k7466J2132n388J3606L3949l925
8152H170k5975j8517L269J4229J5286J2194l759j6558l446O168j679p053J8398
8139G27m107l986J8168j5463j5818J4614J9798o918j2204J2808L1695k046r386
8126B7882k097j4067k9817r277K0428J3172k8333j1773J4533j1588P259J1313
8114a2365j577J5914K938j0839J6607J9663J6614k1611l1793j8712J2151j1869
8102b4879J1274J9766K1651M200l0187o193O34l4L309q563Q687J6512J0554j9123
8088G608k001J0827P915L3473k088j7801l0887m9723J7429K0913K5927q772j4937
$$ plain form
8075 -2117 -3689 3434 683 -18100 -28472 -27017 -5312 -2848 14477 39566 49654 32458 42685
8062 42685 44250 49855 35959 34429 5389 3782 3358 4159 23966 25642 -8392 -6560 6071 19723
8048 19723 26359 33880 31090 14422 15142 20719 41011 29996 24937 10081 -15891 -11512 -1315
8035 -1315 22951 14065 -11078 -13870 -12909 3071 -746 -24269 -39748 -40869 -38126 -29463 -12333 22919
8021 22919 46869 43965 21767 27125 45998 66348 53203 35014 39244 42475 46953 46980 40933 42356
8007 42356 45143 32167 25445 21301 15134 25781 33222 33444 27999 7201 -9968 -1206 1192 6572
7993 6572 11139 12797 15495 23628 35170 26477 4687 -9292 7737 25639 31761 36405 22339
7980 22339 12660 15279 27468 43181 58729 69338 45223 50997 48208 27134 14923 23353 26077
$$ packed form
8075b117j572P123k751j8783j0372J455K1705K464J7325K5089J0088j7196J0227
8062D2685J565N605j3896j530k9040j607m24Q01J9807J676l4034J832J2631J3652
8048A9723O636P521k790j6668P20N577K0292j1015n059j4856k5972M379J0197
8035a315K4266q886k5143k792R61J5980l817k3523j5479j121K743Q663J7130L5252
8021B2919K3950k904k2198N358J8873K0350j3145j8189M230L231M478K7o047J423
8007D2356K787j2976o722m144o167J0647P441K22n445k0798j7169Q762K398N380
7993F572M567J658K698Q133J1542q693k1790j3979J7029J7902O122M644j4066
7980B2339r679K619J2189J5713J5548J0609k4115N774k789k1074j2211Q430K724
$$ plain form
7967 26077 20203 22258 22133 27655 29931 46696 68990 70769 35662 23885 32499 15881 28184
7954 28184 28315 29926 49058 41381 45492 50965 33815 35126 53964 65371 43649 18758 14363
7941 14363 17607 8049 15420 10431 4234 -3029 -756 20523 9280 -16552 15300 34247 42891
7928 42891 31230 24656 43979 39015 27982 20823 2289 15903 19997 19040 20689 7860 -4730
7915 -4730 -2454 6960 32744 26941 25861 9373 8567 29993 14399 386 5036 -3123 -13656 -1692
7901 -1692 3679 4973 21050 56816 64712 35280 11559 -6067 -34913 -15044 6072 7839 -9107
7888 -9107 -14030 953 18401 43694 50263 40990 34507 11827 12654 7511 13820 23280 6819 -4830
7874 -4830 22176 10128 2417 4290 12169 29892 37927 46552 39718 42861 23558 -3038 -337 37097
$$ packed form
7967B6077n874K055j25N522K276J6765K2294J779l5107j1777Q614j6618J2303
7954B8184J31J611J9132p677M111N473j7150J311J8838J1407k1722k4891m395
7941A4363L244r558P371m989o197p263K273K1279j1243k5832L1852J8947Q644
7928D2891j1661o574J9323m964j1033p159j8534J3614M094r57J649j2829j2590
7915d730K276R414K5784n803j080j6488q06K1426j5594j4013M650q159j0533J1964
7901a692N371J294J6077L5766P896k9432k3721j7626k8846J9869K1116J767j6946
7888i107m923J4983J7448K5293O569r273o483k2680Q27n143O309R460j6461j1649
7874d830K7006j2048p711J873P879J7723Q035Q625o834L143j9303k6596K701L7434
$$ plain form
7860 37097 27922 34370 13824 -5688 -6368 -29016 -25300 -13873 -30172 -46121 -20482 9108 27652
7847 27652 48359 17858 -17759 -26377 -41288 -52066 -20045 -11352 -19031 -20856 -6401 13970 15513
7834 15513 -3210 -13557 28729 32829 25730 28087 11723 -19408 -29539 -12723 -21795 -14987 6352
7821 6352 17420 10997 21537 6874 23369 27704 5328 -6569 -10113 -15442 -16072 1837 -5984
7808 -5984 -576 -10380 -16557 -292 4715 5271 4367 4944 5395 9179 416 5209 2248 -3341 -10119 -3918
7792 -3918 -1939 1319 11431 10494 -1849 -20307 -35759 -35962 -37359 -24510 -13186 7004 5871 8714
7778 8714 -6034 -22768 -38763 -39950 -22414 -4966 14277 19169 23820 12115 -3588 -10030 -14972
7765 -14972 14128 7802 -20744 -42996 -44727 -44637 -41005 -29570 -22319 -26927 -24304 -35267 -41621 -16988
$$ packed form
7860C7097r175O448k0546j9512o80k2648L716J1427j6299j5949K5639K9590J8544
7847B7652K0707l0501l5617q618j4911j0778L2021Q693p679j825J4455K0371J543
7834A5513j8723j0347M2286M100p099K357j6364l1131j0131J6816r072O808K1339
7821F352J1068o423J0540j4663J6495M335k2376j1897l544n329o30J7909p821
7808e984N408r804o177J6265N007N56r04N77M51L784q763M793k961n589o778O201
7792c918J979L258J0112r37j2343j8458j5452k03j397J2849J1324K0190j133K843
7778H714j4748j6734j5995j187J7536J7448J9243M892M651j1705j5703o442m942
7765a4972K9100o326k8546k2252j731R0L632J1435P251m608K623j0963o354K4633
$$ plain form
7751 -16988 -10112 -12428 -4943 -20922 -9083 9637 1266 -27425 -18423 -13976 -27059 -31345 -43539
7738 -43539 -40956 -50162 -19791 13694 -2135 -15027 -10204 10809 28818 46366 11943 13585 35309
7725 35309 38675 20723 2800 -8009 5606 6762 -1499 -6060 -3090 18378 -4176 -28662 -13092
7712 -13092 24674 38217 22741 15914 25086 23690 14877 -1532 -5007 7133 4044 14973 14364
7699 14364 10633 8476 12217 15347 5751 -2676 -3409 3093 -17068 -5177 -11361 -22790 -43239 -51023
7685 -51023 -54222 -53025 -36596 -27975 -36914 -29691 -36563 -17157 -7533 4886 12609 23591 9957
7672 9957 1948 -7890 1519 1696 -4233 -8045 -9909 -860 -1628 6399 11674 20660 12645 -15309 -28043
7657 -28043 -25224 -18739 -12232 -1207 -4021 -10525 10084 7580 -10012 -14278 6742 4319 5324 14441
$$ packed form
7751a6988O876k316P485j5979J1839J8720q371k8691R002M447j3083m286j2194
7738d3539K583r206L0371L3485j5829j2892M823K1013J8009J7548l4423J642K1724
7725C5309L366j7952j7923j0809J3615J156q261m561K970K1468k2554k4486J5570
7712a3092L7766J3543j5476o827R172j396q813j6409l475J2140l089J0929o09
7699A4364l731k157L741L130r596q427p33O502k0161J1891o184j1429k0449p784
7685e1023l199J197J6429Q621q939P223o872J9406R624J2419P723J0982j3634
7672I957q009r838R409J77n929l812j864R049p68Q027N275Q986q015k7954j2734
7657b8043K819O485O507J1025k814o504K0609k504j7592m266K1020k423J005R117
$$ plain form
7643 14441 -4308 -4335 -1638 32599 28944 5813 -13326 -15652 -33996 -48189 -39509 -33775 -38586 -38464
7629 -38464 -45084 -32921 -27489 -25852 -39497 -44692 -33121 -34278 -48484 -31415 -12084 -88 337
7616 337 -7109 -8796 -5406 -16172 -23748 -27835 -28581 -18101 -5212 -17637 -13392 -16561 -18588 -6190
7602 -6190 13450 -2250 -6660 13203 21069 14279 -5200 -27032 -42163 -25809 -16130 -18432 -23076
7589 -23076 -12291 -6299 -39016 -43955 -10126 -14759 -29777 -50630 -53563 -40371 -22326 3050 -16190
7576 -16190 -12835 -8922 -18161 -11471 -31111 -42772 -63321 -75351 -61825 -65409 -35715 -20483 -36836
7563 -36836 -26462 -17280 -19185 -11953 -20613 -23597 -10724 14770 12377 6938 12348 10683 31248 21831
7549 21831 -18174 -20725 -21167 -25475 -12306 -16114 -26945 -13732 -11504 -40513 -28504 -1399 -20855
$$ packed form
7643A4441j8749k7K697L4237l655k3131j9139k326j8344j4193Q680N734m811J22
7629c8464o620J2163N432J637j3645n195J1571j157j4206J7069J9331J1996M25
7616C37p446j687L390j0766p576m087p46J0480J2889j2425M245l169k027J2398
7602f190J9640j5700m410J9863P866o790j9479k1832j5131J6354R679k302m644
7589b3076J0785N992l2717m939L3829m633j5018k0853k933J3192J8045K5376j9240
7576a6190L355L913r239O690j9640j1661k0549j2030J3526l584K9694J5232j6353
7563c6836J0374R182j905P232q660k984J2873K5494k393n439N410j665K0565r417
7549B1831m0005k551m42m308J3169l808j0831J3213K228k9009J2009K7105j9456
$$ plain form
7536 -20855 -59779 -81920 -64950 -27894 -12097 -19689 3863 1860 -13779 -16690 -31674 -38064 -28099
7523 -28099 -21752 -10133 809 -3814 -4730 -16827 -3879 -6095 -13226 -29782 -35104 -34039 -43777 -52501
7509 -52501 -36659 -26766 -19750 -9193 -25882 -34456 -22990 -1243 -4596 -9043 -39511 -47469 -48955
7496 -48955 -25339 -3235 -5905 -18673 -36297 -55519 -66200 -63140 -47703 -33571 -18478 5914
7484 5914 22446 6922 -18479 -23045 -18854 -2840 5046 579 -6531 -2283 8315 21196 16306
7471 16306 -26836 -9943 -16434 -13457 15355 16447 1347 -11178 8606 6112 -38969 -51695 -29308
7458 -29308 -24272 -34663 -22339 -6923 -5649 -23985 -36842 -36989 -22154 -17494 -3310 1228 -9061
7445 -9061 -24156 -8744 -15998 -25831 -21754 -29772 -45621 -43475 -29828 -22334 -7788 11066 10026
$$ packed form
7536b0855l8924k2141J6970L7056J5797p592K3552k003j5639k911j4984o390R965
7523b8099O347J1619J0942m623r16j2097J2948k216p131j6556n322J065r738q724
7509e2501J5842R893P016J0557j6689q574J1466K1747l353m447l0468p958j486
7496d8955K3616K2104k670j2768j7624j9222j0681L060J5437J4132J5093K4392
7484E914J6532j5524k5401m566M191J6014P886m467p110M248J0598J2881m890
7471A6306m3142J6893o491K977K8812J092j5100j2525J9784k494m5081j2726K2387
7458b9308N036j0391J2324J5416J274j8336j2857j47J4835M660J4184M538j0289
7445i061j5095J5412p254r833M077q018j5849K146J3647P494J4546J8854j040
$$ plain form
7432 10026 -14045 -27056 -47396 -54925 -42148 -35468 -50694 -46378 -11201 9840 -5116 -7151 -39
7419 -39 2191 13324 30338 2050 -16970 -25020 -17674 9459 -2952 -21506 -45485 -46979 -32812
7406 -32812 -17084 556 -10775 -13092 -13677 -4254 13055 3801 -3819 -35740 -52829 -22255 -18826
7393 -18826 -30154 -36970 -50090 -60796 -56458 -29281 -4573 14823 9760 -1287 -3606 -6787 -10480
7380 -10480 -23150 -16844 -34642 -46705 -23864 -8435 -11183 -3047 -11302 -6406 -2671 -10665 -50758
7367 -50758 -49554 -23255 -22193 -39306 -73273 -52156 -23099 -8359 -12156 -23104 -7201 858 -15605
7354 -15605 -24923 -15152 1328 14862 29726 38436 14950 2211 -17960 -31487 -28810 -15211 -20128
7341 -20128 -10591 -9426 -36666 -49537 -20459 -20219 -4684 -17850 -2092 -4159 4154 14637 15377
$$ packed form
7432A0026k4071j3011k0340p529J2777O680j5226M316L5177K1041j4956k035P112
7419c9K230J1133J7014k8288j9020q050P346K7133j2411j8554k3979j494J4167
7406c2812J5728J7640j1331k317n85R423J7309r254p620l1921j7089L0574L429
7393a8826j1328o816j3120j0706M338K7177K4708J9396n063j1047k319l181l693
7380a0480j2670O306j7798j2063K2841J5429k748Q136q255M896L735p994m0093
7367e0758J204K6299J062j7113l3967K1117K9057J4740l797j0948J5903Q059j6463
7354a5605r318R771J6480J3534J4864Q710k3486j2739k0171j3527K677J3599m917
7341b0128R537J165k7240j2871K9078K40J5535j3166J5758k067Q313J0483P40
$$ plain form
7328 15377 24260 38496 27027 19430 18326 20237 -7758 -28055 -27201 -23731 -18688 -24764 -39866 -43537
7314 -43537 -45047 -37742 -23175 -21466 -39201 -42622 -51968 -60249 -67517 -52089 -36832 -13789 -19154
7301 -19154 -26886 -21789 -23508 -15007 -29059 -40707 -40355 -29755 -11507 -12056 6767 18074 8296 -13557
7287 -13557 -3983 -12990 -37288 -56849 -28908 -1443 10686 -11280 -23914 -11792 7487 9897
7275 9897 6534 -7567 -8567 4826 -10626 -17122 -19308 -19874 -5297 -22219 -38471 -25533 -910
7262 -910 9952 27129 15255 -6994 -34845 -38905 -11045 -3227 3364 4680 -8009 -9836 -12832
7249 -12832 -16468 -10690 -8281 -7858 -22771 -30490 -28946 -17026 9361 -1778 -7511 -7695 -23935 -27293
7235 -27293 -22543 -28509 -27266 -22187 -16817 -16029 -42849 -61560 -35339 -21047 -20852 -27556 -25914 -10454
$$ packed form
7328A5377Q883J4236j1469p597j104J911k7995k0297Q54L470N043o076j5102l671
7314d3537j510P305J4567J709j7735l421r346q281p268J5428J5257K3043n365
7301a9154p732N097j719Q501j4052j1648L52J0600J8248n49J8823J1307r778k1853
7287a3557R574r007k4298j9561K7941K7465J2129k1966j2634J2122J9279K410
7275I897l363j4101j000J3393j5452o496k186n66J4577j6922j6252J2938K4623
7262i10J0862J7177j1874k2249k7851m060K7860P818O591J316j2689j827k996
7249a2832l636N778K409M23j4913p719J544J1920K6387j1139n733j84j6240l358
7235b7293M750n966J243N079N370P88k6820j8711K6221J4292J95o704J642J5460
$$ plain form
7221 -10454 -4945 -8687 -10229 -7467 3925 -882 -2893 -6065 -25710 -46483 -46301 -32991 -4448 -6494
7207 -6494 -17639 -20532 -17484 -566 -4089 -4691 6586 -319 12136 -2409 -19876 -10001 -5236 -19519
7193 -19519 -8392 9549 5829 7701 8351 -3354 -622 2406 -25017 -42398 -43589 -51387 -50679 -46658
7179 -46658 -38762 -41886 -25627 -25408 -53875 -78457 -70452 -54866 -49681 -41491 -12779 29353 46844
7166 46844 32751 17745 9067 -1320 -2293 -6639 -12257 3689 28034 17831 -9066 -40090 -33884
7153 -33884 -39978 -18821 14815 33797 14732 1594 3798 -2759 12089 21691 15811 -1379 15361
7140 15361 17594 18683 4529 1413 -9671 -11623 19578 9809 -5650 -40790 -22316 -14808 -25406
7127 -25406 -27091 -26130 3858 6195 -4671 4492 -473 -7199 -14795 -4219 -2549 17944 36313 26399
$$ packed form
7221a0454N509l742j542K762J1392m807k011l172j9645k0773J82J3310K8543k046
7207f494j1145k893L048J6918l523o02J1277o905J2455j4545j7467R875M765j4283
7193a9519J1127J7941l720J872O50j1705K732L028k7423j7381j191p798P08M021
7179d6658P896l124J6259K19k8467k4582Q005J5586N185Q190K8712M2132J7491
7166D6844j4093j5006q678j0387r73m346n618J5946K4345j0203k6897l1024O206
7153c3884o094K1157L3636J8982j9065j3138K204o557J4848R602n880j7190J6740
7140A5361K233J089j4154l116j1084j952L1201r769j5459l5140J8474P508j0598
7127b5406j685R61K9988K337j0866R163m965o726p596J0576J670K0493J8369r914
$$ plain form
7113 26399 20517 -18026 -8014 -4362 3483 8056 -12831 -33827 -24178 6652 9629 -6263 -27604
7100 -27604 -29126 5895 -2834 -27287 1464 13543 21922 19822 12646 20290 32570 18143 26743
7087 26743 33723 22333 36954 37170 29803 21281 27816 31223 16537 -18277 -41618 -56800 -39030
7074 -39030 -5766 11781 21518 11884 17545 1567 -6710 -14542 -3910 6683 12799 -1304 -4956
7061 -4956 -13781 -16184 -5288 35392 45594 57433 50097 49994 51086 53402 43451 71764 74492 111033
7047 111033 149437 150328 150424 109813 23242 -21027 -43695 -30311 -19448 -13666 -8512 -8106 3895
7034 3895 21434 29542 31864 13086 5544 3670 -10707 -1931 -8525 -11801 -19009 -29998 -27731 -28379
7020 -28379 -19583 -3144 6849 8253 15364 -8058 -17085 -10620 -45 20232 9979 -18920 -35226
$$ packed form
7113B6399n882l8543J0012L652P845M573k0887k0996R649L0830K977j5892k1341
7100b7604j522L5021q729k4453K8751J2079Q379k100p176P644J2280j4427Q600
7087B6743O980j1390J4621K16p367q522O535L407j4686l4814k3341j5182J7770
7074c9030L3264J7547R737r634N661j5978q277p832J0632J0593O116j4103l652
7061d956q825k403J0896M0680J0202J1839p336j03J092K316r951K8313K728L6541
7047A11033L8404Q91R6m0611q6571m4269k2668J3384J0863N782N154M06J2001
7034C895J7539Q108K322j8778p542j874j4377Q776o594l276p208j0989K267o48
7020b8379Q796J6439R993J404P111k3422r027O465J0575K0277j0253k8899j6306
$$ plain form
7007 -35226 -42403 -45938 -60401 -59833 -41632 -23281 -22722 -676 14689 18550 25705 23701 19898 24747
6993 24747 29860 19726 9565 16149 -8304 -16534 -1357 7199 17142 12892 -7982 -33264 -38679
6980 -38679 -24917 -12362 -4884 -1421 -7973 -18743 -43163 -58469 -67844 -54713 -48006 -50335 -49222
6967 -49222 -32620 -10020 -13061 -24162 -25941 -24540 -18658 -2505 11868 -941 -21800 -30423 -20885
6954 -20885 -22590 -27327 -43817 -29867 -16984 -23637 -21902 -13261 -20254 -15261 22761 30388 39706 10442
6940 10442 -13137 -18965 -28475 -35803 -30588 -34741 -33877 -12575 -12798 11358 4616 -28898 -40521 -52593
6926 -52593 -50987 -53394 -38776 -16659 343 5001 -10093 -26050 -50413 -54523 -38774 -9977 2899
6913 2899 -19746 -49993 -38799 2089 32678 24836 20350 16582 -17994 -23863 -31261 -52185 -37680
$$ packed form
7007c5226p177l535j4463N68J8201J8351N59K2046J5365L861P155k004l803M849
6993B4747N113j0134j0161O584k4453q230J5177Q556R943m250k0874k5282n415
6980c8679J3762J2555P478L463o552j0770k4420j5306r375J3131O707k329J113
6967d9222J6602K2600l041j1101j779J401N882J6153J4373j2809k0859q623R538
6954b0885j705m737j6490J3950J2883o653J735Q641o993M993L8022P627R318k9264
6940A0442k3579n828r510p328N215m153Q64K1302k23K4156o742l3514j1623j2072
6926e2593J606k407J4618K2117J7002M658j5094j5957k4363m110J5749K8797J2876
6913B899k2645l0247J1194M0888L0589p842m486l768l4576n869p398k0924J4505
$$ plain form
6900 -37680 -17110 -19422 -1313 6190 4934 -4192 -23142 -27258 -30501 -44531 -16465 -14225 -10357
6887 -10357 3227 -5414 -13138 2015 -13801 -8180 3507 7972 6956 -2048 -20264 -33292 -47185
6874 -47185 -69470 -55688 -32873 -12795 16314 29685 27112 5273 7955 -3405 8187 -5678
6862 -5678 -14851 -1609 11910 18773 17519 11637 22129 39853 36614 18171 2070 805 -11980
6849 -11980 -37156 -29088 -6259 -3197 -13665 -11751 -2125 7535 -2113 -3894 27473 28975 12474
6836 12474 -27281 -23361 5573 -658 -15487 -27987 -26148 -9091 17298 -7334 -18171 -40833
6824 -40833 -42501 -41131 -48592 -46141 6259 25371 2381 -17670 -18815 -10930 -4967 16795 14881
6811 14881 10004 1978 1081 34776 42298 25321 10479 14306 30644 34459 167 -15222 -10206
$$ packed form
6900c7680K0570k312J8109P503j256r126j8950m116l243j4030K8066K240L868
6887a0357J3584q641p724J5153j5816N621J1687M465j016r004j8216j3028j3893
6874d7185k2285J3782K2815K0078K9109J3371k573k1839K682j1360J1592j3865
6862e678r173J3242J3519O863j254n882J0492J7724l239j8443j6101j265j2785
6849a1980k5176Q068K2829L062j0468J914R626R660r648j781L1367J502j6501
6836A2474l9755L920K8934o231j4829j2500J839J7057K6389k4632j0837k2662
6824d0833j668J370p461K451N2400J9112k2990k0051j145P885N963K1762j914
6811A4881m877q026q97L3695P522j6977j4842L827J6338L815l4292j5389N016
$$ plain form
6798 -10206 4752 11781 -6994 -20639 -13169 -11462 -7758 -15462 4976 27088 845 -12662 -7064
6785 -7064 3391 -18386 -32800 -41442 -41521 -55515 -28758 8466 -7107 -35011 -27594 1970 -752
6772 -752 -8101 1464 17691 25464 42459 55284 40101 39407 49857 60740 64040 72846 62743 51343
6758 51343 32210 19556 35753 42020 31699 -3990 -14989 -7593 -16815 -7747 8489 3046 -3567
6745 -3567 11075 32896 32829 21473 53841 77974 77248 74753 48512 51635 38633 35373 44640 35990
6731 35990 36521 35046 39072 51379 51520 25916 12414 7115 -25327 -35913 -27065 -36536 -27134 -13661
6717 -13661 -16453 -5879 -4336 25689 26410 6348 5724 27363 15344 -7824 -34069 -32109 -12652
6704 -12652 6605 17246 9061 26338 13630 -5341 -4749 10856 25471 43954 35366 -1615 -36853
$$ packed form
6798a0206J4958P029j8775j3645P470J707L704p704K0438K2112k6243j3507N598
6785g064J0455k1777j4414q642p9j3994K6757L7224j5573k7904P417K9564k722
6772g52p349R565J6227P773J6995J2825j5183o94J0450J0883L300Q806j0103j1400
6758E1343j9133j2654J6197O267j0321l5689j0999P396r222R068J6236n443o613
6745c567J4642K1821o7j1356L2368K4133p26k495k6241L123j3002l260R267q650
6731C5990N31j475M026J2307J41k5604j3502n299l2442j0586Q848r471R402J3473
6717a3661k792J0574J543L0025P21k0062o24K1639j2019k3168k6245J960J9457
6704a2652J9257J0641q185J7277j2708j8971N92J5605J4615J8483q588l6981l5238
$$ plain form
6691 -36853 -38148 -29965 -29579 -43322 -29415 -2170 28778 7470 -19526 -27064 -15610 -15828 3233
6678 3233 37955 39813 38954 21312 11410 12481 3790 -17327 14444 37669 12649 -7307 -20985
6665 -20985 -28713 -16765 -19802 -5409 -15733 -14877 -8895 4509 27884 27238 -9687 -7103 -22692
6652 -22692 -32622 -44763 -47858 -34266 -7129 -7573 3989 -16042 -41371 -41695 4800 13083 -15562
6639 -15562 -32225 -20867 -12497 -22115 -41389 -34686 -29345 -13622 1491 -763 -8441 -20168 -8348
6626 -8348 -10601 -25244 -41224 -41388 -40221 -33775 -61890 -60194 -48908 -40454 -35588 -41870 -53416 -55531
6612 -55531 -64223 -44908 -7878 6974 -2639 -8954 -6141 -16033 -31321 -34128 -12122 5435 1615
6599 1615 -13962 627 9536 -11014 -28453 -29324 -3364 8885 8957 -655 -24606 -29757 -35488 -26140
$$ packed form
6691c6853j295Q183L86j3743J3907K7245L0948k1308k6996p538J1454k18J9061
6678C233L4722J858q59j7642r902J071q691k1117L1771K3225k5020j9956j3678
6665b0985p728J1948l037J4393j0324Q56N982J3404K3375o46l6925K584j5589
6652b2692r930j2141l095J3592K7137m44J1562k0031k5329l24M6495Q283k8645
6639a5562j6663J1358Q370r618j9274O703N341J5723J5113k254p678j1727J1820
6626h348k253j4643j5980j64J167O446k8115J696J1286Q454M866o282j1546k115
6612e5531q692J9315L7030J4852r613o315K813r892j5288k807K2006J7557l820
6599A615j5577J4589Q909k0550j7439q71K5960J2249P2r612k3951n151n731R348
$$ plain form
6585 -26140 -13263 -9666 -9260 -37482 -44154 -36556 -43649 -54918 -41005 -44662 -24077 -21802 -35282
6572 -35282 -34821 -29310 -17077 -25169 -8580 -6602 -5419 -20464 -14532 -12591 6511 25938 35428 7061
6558 7061 -16624 -5782 -6602 -16337 -8220 -17959 -43936 -19228 1366 9051 4536 -12467 -24352
6545 -24352 -9049 -45265 -67747 -45617 -32089 -51467 -36542 -9326 -5810 9496 7121 -7524
6533 -7524 -12247 2577 -16705 -25852 -22657 -9127 -12493 3022 5491 -12565 -26452 -26067 -38740
6520 -38740 -15324 4299 12827 9496 12905 15909 21056 29345 10781 -4194 -17938 -24465 -39550
6507 -39550 -36280 -35419 -48892 -21645 233 3001 2890 -16006 -21672 -15660 254 -1279 -17677 -12200
6493 -12200 -7944 -30492 -32515 -28830 -25035 -6229 -12310 -20007 -12813 -272 20368 25101 9694
$$ packed form
6585b6140J2877L597M06k8222o672P598p093j1269J3913l657K0585K275j3480
6572c5282M61N511J2233q092J6589J978J183j5045N932J941J9102J9427R490k8367
6558G061k3685J0842q20r735Q117r739k5977K4708K0594P685m515j7003j1885
6545b4352J5303l6216k2482K2130J3528j9378J4925K7216L516J5306k375j4645
6533g524m723J4824j9282r147L195J3530l366J5515K469j8056j3887L85j2673
6520c8740K3416J9623Q528l331L409L004N147Q289j8564j4975j3744o527j5085
6507c9550L270Q61j3473K7247K1878K768j11j8896n666O012J5914j533j6398N477
6493a2200M256k2548k023L685L795J8806o081p697P194J2541K0640M733j5407
$$ plain form
6480 9694 -13628 -17489 -13588 -20575 -8006 3059 -21385 -41095 -49360 -43149 -45707 -39295 -24601
6467 -24601 -40021 -46342 -61473 -53717 -31868 -19478 -3732 -2566 -13926 -1580 -5450 -25398 -9058
6454 -9058 -1754 5069 12226 -11368 -20257 -6295 -5602 4621 3589 -28289 -45302 -37214 -22280 -9152
6440 -9152 -12495 -17918 -12867 -35814 -28381 -17746 -12052 -472 -3131 10608 -5050 -38718 -45258
6427 -45258 -18464 -24963 -24540 -2202 8210 6217 -8474 -6809 -7249 -6086 3307 -4904 -42335 -55786
6413 -55786 -31796 -6057 -12236 -24906 -23809 -9261 20217 7834 -2023 16843 19234 15278 1719
6400 1719 -21937 -16818 4276 -15370 -18591 23119 23005 5039 15588 20341 11983 14060 2518
6387 2518 -10227 2248 17153 14988 -10281 -1124 1063 -31260 -43586 -37863 -28853 2919 9329
$$ packed form
6480I694k3322l861L901o987J2569J1065k4444j9710q265O211k558O412J4694
6467b4601j5420o321j5131P756K1849J2390J5746J166j1360J2346l870j9948J6340
6454i058P304O823P157k3594q889J3962O93J0223j032l1878j7013Q088J4934J3128
6440i152l343n423N051k2947P433J0635N694J1580k659J3739j5658l3668o540
6427d5258K6794o499M23K2338J0412j993j4691J665m40J163R393q211l7431j3451
6413e5786K3990K5739o179j2670J097J4548K9478j2383r857J8866K391l956j3559
6400A719k3656N119K1094j9646l221M1710j14j7966J0549M753q358K077j1542
6387B518j2745J2475J4905k165k5269R157K187l2323j2326N723R010L1772O410
$$ plain form
6374 9329 13574 -16770 -17656 -1625 -14927 -45326 -37702 -23581 -16447 -17203 -18924 -20894 -12151 541
6360 541 -763 -13591 -23822 -23464 995 1743 -26994 -21405 -4033 -2595 -25617 -23254 -10430 3508
6346 3508 10630 8427 401 2917 17157 15672 11438 12399 3868 -26512 -40941 -42475 -21510 -1331
6332 -1331 -3852 -17064 -18056 -19100 -3273 16349 11242 25403 27079 11843 -7939 -20352 -7111
6319 -7111 -17901 -24351 -21870 -23659 -16988 4402 32621 34187 19701 20529 17049 4464 14978 -543
6305 -543 -14450 -5814 -6070 -2001 -11171 -30585 -38413 -47640 -27974 -10213 -6110 1770 3237 -4543
6291 -4543 -9263 -5593 10354 7512 -19171 -14589 -14400 -22942 -22388 -20049 -14012 -22855 -12056 7433
6277 7433 -8305 -19614 -12684 -37137 -55625 -78214 -41651 2904 -3116 15981 19470 -7298 -48218
$$ packed form
6374I329M245l0344q86J6031j3302l0399P624J4121P134p56j721j970Q743J2692
6360E41j304j2828j0231L58K4459P48k8737N589J7372J438k3022K363J2824J3938
6346C508P122k203q026K516J4240j485m234R61q531l0380j4429j534K0965K0179
6332a331k521j3212r92j044J5827J9622n107J4161J676j5236j9782j2413J3241
6319g111j0790o450K481j789O671K1390K8219J566j4486Q28l480j2585J0514j5521
6305e43j3907Q636k56M069r170j9414p828r227J9666J7761M103P880J467p780
6291d543m720L670J5947k842k6683M582J89q542N54K339O037q843J0799J9489
6277G433j5738j1309O930k4453j8488k2589L6563M4555o020J9097L489k6768m0920
$$ plain form
6264 -48218 -68626 -39786 -12912 -6217 -9979 -13094 -10352 -33010 -14435 36579 26146 10656 10728
6251 10728 -16950 -14872 -14442 -33394 -47187 -46860 -70266 -76369 -54031 -18521 -6226 -19041 -44808
6238 -44808 -48944 -41709 -26363 -19752 -14398 -15904 -23200 -24842 -15911 -5860 -12787 -14668 -37629 -56323
6224 -56323 -43678 -49713 -41445 -31580 -46130 -45823 -27206 -14023 -9897 -9056 9961 -26908 -42428
6211 -42428 -36598 -26037 -27639 -48204 -33676 -21957 -32411 -34426 -12139 -7855 8193 17086 19648
6198 19648 31464 9129 -43 19325 21072 -5932 -6135 -9471 -4403 13302 11890 5074 10723 16411
6184 16411 17308 8910 -1405 -20922 -28591 -41139 -43687 -19794 -2706 9852 -3947 -20455 -29073
6171 -29073 -12412 -7919 3987 -4296 1645 11572 6940 -5940 -25218 -22211 -23767 -18059 -9212 19270
$$ packed form
6264d8218k0408K8840K6874O695l762l115K742k2658J8575N1014j0433j5490P2
6251A0728k7678K078M30j8952j3793L27k3406o103K2338L5510J2295j2815k5767
6238d4808m136P235J5346O611N354j506p296j642Q931J0051o927j881k2961j8694
6224e6323J2645o035Q268R865j4550L07J8617J3183M126Q41J9017l6869j5520
6211d2428N830J0561j602k0565J4528J1719j0454k015K2287M284J6048Q893K562
6198A9648J1816k2335r172J9368J747k7004k03l336N068J7705j412o816N649N688
6184A6411Q97q398j0315j9517p669j2548k548K3893J7088J2558j3799j6508q618
6171b9073J6661M493J1906q283N941R927m632j2880j9278L007j556N708Q847K8482
$$ plain form
6157 19270 17145 16981 2905 -23307 -28477 -29119 -7014 16998 9587 14085 26564 14115 6782 1777
6143 1777 -10191 10166 7859 -13610 -14192 -24764 -39769 -53047 -45998 -25430 26922 34472 26105
6130 26105 46846 47232 29099 36124 41323 39784 15973 1254 19859 2012 -5453 10107 10568
6117 10568 1263 -12163 -9214 6108 29694 25229 28353 35293 14479 31343 38569 12721 10427
6104 10427 14701 13195 5877 -18244 -36486 -48395 -33763 -20272 -37012 -24267 -14420 -15850 -10621
6091 -10621 9663 25389 48978 31168 22717 26865 20930 -8633 993 6910 3483 14252 22289
6078 22289 13094 26439 30166 20405 14853 25762 30944 23800 16066 -1216 10031 17152 2762
6065 2762 -13479 -9167 -7600 -13225 -35611 -37579 -37319 -49861 -51560 -25596 934 8722 13550 21345
$$ packed form
6157A9270k125j64j4076k6212n170o42K2105K4012p411M498J2479j2449p333n005
6143A777j1968K0357k307k1469n82j0572j5005j3278P049K0568N2352P550q367
6130B6105K0741L86j8133P025N199j539k3811j4719J8605j7847p465J5560M61
6117A0568r305j3426K949J5322K3586m465L124O940k0814J6864P226k5848k294
6104A0427M274j506p318k4121j8242j1909J4632J3491j6740J2745R847j430N229
6091a0621K0284J5726K3589j7810q451M148n935k9563R626N917l427J0769Q037
6078B2289r195J3345L727r761n552J0909N182p144p734j7282J1247P121j4390
6065B762j6241M312J567n625k2386j968K60j2542j699K5964K6530P788M828P795
$$ plain form
6051 21345 37580 25800 7107 -628 4304 -2986 -916 8777 9865 9266 -8910 -4121 6411 11271
6037 11271 -3986 -2168 -10420 -20757 -21476 -16960 -26727 -18698 15529 13607 9226 -11651 -21874 -18379
6023 -18379 -19228 -22232 -10525 10062 206 -5875 -360 808 5987 2591 -164 18783 39834 24631
6009 24631 -21420 -34479 -25530 -3960 -4617 -4617 -14842 -22175 -20815 -41337 -24747 17726 26225 -16317
5995 -16317 -55545 -52662 -32705 -22020 -30334 -13123 -18607 -20649 -21731 -20041 -5243 1346 16827
5982 16827 8581 -1006 -17057 -16003 -3467 97 -1567 24073 39594 41981 26829 10528 12939
5969 12939 1832 324 19041 8666 12776 20598 21163 6957 19089 21995 8811 -16054 -19915
5956 -19915 -5411 9843 -11863 -24077 -52391 -51153 -57497 -46913 -46802 -47015 -32095 -24745 -18089
$$ packed form
6051B1345J6235j1780j8693p735M932p290K070R693J088n99j8176M789J0532M860
6037A1271j5257J818q252j0337p19M516r767Q029L4227j922m381k0877j0223L495
6023a8379q49l004J1707K0587r856o081N515J168N179l396k755J8947K1051j5203
6009B4631m6051j3059Q949K1570o57%j0225p333J360k0522J6590M2473Q499m2542
5995a6317l9228K883J9957J0685q314J7211n484k042j082J690J4798O589J5481
5982A6827q246r587j6051J054J2536L564j664K5640J5521K387j5152j6301K411
5969A2939j1107j508J8717j0375M110P822N65j4206J2132K906j3184k4865l861
5956a9915J4504J5254k1706j2214k8314J238o344J0584J11k13J4920P350O656
$$ plain form
5943 -18089 -1746 -15337 -29525 -10795 -18809 -20232 -28084 -28055 -15818 6307 6832 4494 -1784 -15356
5929 -15356 -33525 -16544 -26775 -7832 9749 8616 -8165 -12660 -29685 -19004 -9796 18266
5917 18266 40967 31433 11115 -1223 11157 16119 -17663 -30919 -23862 -5790 15186 7787 -1717
5904 -1717 -13477 -18620 -15074 -19123 -19621 -7064 5577 -9453 -37013 -38375 -15908 2524 17396
5891 17396 11182 -15003 -749 15938 -1418 -4235 -17301 -24495 5499 -5859 -16733 -29099
5879 -29099 -34842 -39320 -35979 -2943 -6837 -34911 -41852 -32419 -3138 23545 24626 9762 20843
5866 20843 13085 -5192 -15768 -1345 3229 728 5499 1544 -8957 13072 19137 -8326 -1214
5853 -1214 9009 310 -25730 -20942 -18081 4626 -11487 -6965 -8910 3050 9441 -86 -15419
$$ packed form
5943a8089J6343j3591j4188J8730q014j423p852K9J2237K2125N25k338o278j3572
5929a5356j8169J6981j0231J8943J7581j133j6781m495j7025J0681R208K8062
5917A8266K2701r534k0318j2338J2380M962l3782j3256P057J8072K0976p399r504
5904a717j1760n143L546m049m98J2557J2641j5030k7560j362K2467J8432J4872
5891A7396o214k6185J4254J6687j7356k817j3066p194K9994j1358j0874j2366
5879b9099n743m478L341L3036l894k8074o941R433K9281K6683J081j4864J1081
5866B0843p758j8277j0576J4423M574k501M771l955j0501K2029O065k7463P112
5853a214J0223q699k6040M788K861K2707j6113M522j945J1960O391r527j5333
$$ plain form
5840 -15419 -36397 -26247 -11273 16614 5210 3168 -771 -26682 -26236 -16472 -1432 -19148 -17776
5827 -17776 -1560 -8800 -723 16808 -6919 -8868 -16067 -22336 -8903 -6682 -17292 -21754 -7490
5814 -7490 -24557 -32610 -23631 -4297 -5897 -22869 -6787 -6950 -9137 -260 8478 29440 33373 20735
5800 20735 15544 42273 55519 38895 8855 -7410 6897 7320 -2959 4486 1378 -2606 -2006
5787 -2006 -13247 -37679 -34642 -53228 -66505 -66823 -38113 -35310 -40946 -26386 -19608 -11442 -26727
5774 -26727 -25392 -5527 -14436 -20617 -16087 38 13004 20612 29491 57628 75367 65112 32939
5761 32939 514 -19305 -7438 -6257 -8481 11666 5273 -22319 -22828 -2180 -9296 -2702 20862
5748 20862 32856 26042 16804 -3756 -9904 -4462 6913 -12303 -4827 5665 3693 -2431 -19166
$$ packed form
5840a5419k0978J0150J4974K7887j1404k042l939k5911M46R764J5040j7716J372
5827a7776J6216p240Q077J7531k3727j949p199o269J3433K221j0610m462J4264
5814g490j7067q053Q979J9334j600j6972J6082j63k187Q877Q738K0962L933j2638
5800B0735n191K6729J3246j6624l0040j6265J4307M23j0279P445l108l984O00
5787b006j1241k4432L037j8586j3277l18K8710K803n636J4560O778Q166j5285
5774b6727J335J9865q909o181M530J6125J2966P608Q879K8137J7739j0255l2173
5761C2939l2425j9819J1867J181k224K0147o393k7592n09K0648p116O594K3564
5748B0862J1994o814r238k0560o148N442J1375j9216P476J0492j972o124j6735
$$ plain form
5735 -19166 -32405 -24978 -9872 1520 -7390 -24627 -13184 18120 15021 25334 15844 -24866 -21268
5722 -21268 -3058 -9848 -9417 -42118 -54298 -31790 -39027 -55859 -50959 -33097 -7518 21083 32549
5709 32549 7325 -7192 -15712 -47167 -21108 6671 889 6731 -6291 2434 10549 21072 34487
5696 34487 21628 6459 9411 17084 29805 13808 4526 1273 -18138 -14394 1903 -2001 -12604
5683 -12604 -19336 -5848 20820 28254 17753 2079 -24521 -29815 -10478 13941 17160 -6902 -6580
5670 -6580 -10953 -7839 -31574 -38909 -32899 -12440 6792 -13605 -28079 -16214 212 10128 -11970
5657 -11970 -15827 4569 9794 -5050 -1620 -6616 -35929 -47874 -47143 -32781 -17339 -17579 1755
5644 1755 15058 16557 -7346 -13073 -32553 -37935 -42456 -19527 -21824 -27433 -3116 19475 -381
$$ packed form
5735a9166j3239P427J5106J1392q910j7237J1443L1304l099J0313r490m0710L598
5722b1268J8210o790M31l2701j2180K2508p237j6832M900J7862K5579K8601J1466
5709C2549k5224j4517q520l1455K6059K7779n782N842j3022Q725Q115J0523J3415
5696C4487j2859j5169K952P673J2721j5997r282l253j9411L744J6297l904j0603
5683a2604o732J3488K6668P434j0501j5674k6600n294J9337K4419L219k4062L22
5670f580m373L114k3735p335O010K0459J9232k0397j4474J1865J6426R916k2098
5657a1970l857K0396N225j4844L430m996k9313j1945P31J4362J5442k40J9334
5644A755J3303J499k3903n727j9480n382m521K2929k297n609K4317K2591j9856
$$ plain form
5631 -381 -6190 8047 -520 -2643 16455 46059 37069 15584 -13576 -31808 -29371 -16500 -16702 -23933
5617 -23933 -40437 -23926 404 6920 2585 2200 -7361 -9174 -12632 -20360 -28559 -41232 -55874 -49096
5603 -49096 -62194 -50523 -43995 -48727 -58606 -32595 -27167 -20354 -18428 -20148 -14416 15627 35141
5590 35141 37153 9493 11327 25915 34816 24872 -11548 -14379 -7836 7485 6548 -4452 -42720
5577 -42720 -55914 -55026 -52519 -41969 -58042 -56587 -16814 -547 -8741 -33117 -30903 -25242 -17369
5564 -17369 -17096 -22987 -20381 -22484 -16985 -14696 -6054 -7206 -11579 -32723 -39040 1382 18204 13342
5550 13342 2731 20705 13603 469 10961 -1492 -2191 -14014 -33561 -49243 -22648 9922
5538 9922 23674 28838 13816 -8076 -14996 -13163 -8827 -694 -9845 -11777 -22484 -25987 -27504 -46275
$$ packed form
5631c81n809J4237q567k123J9098K9604q990k1485k9160j8232K437J2871k02p231
5617b3933j6504J6511K4330O516m335l85r561j813l458p728q199j2673j4642O778
5603d9096j3098J1671O528m732r879K6011N428O813J926j720N732L0043J9514
5590C5141K012k7660J834J4588Q901r944l6420k831O543J5321r37j1000l8268
5577d2720j3194Q88K507J0550j6073J455L9773J6267q194k4376K214N661P873
5564a7369K73n891K606k103N499K289Q642j152m373k1144o317M0422J6822m862
5550A3342j0611J7974p102j3134J0492j2453o99j1823j9547j5682K6595L2570
5538I922J3752N164j5022k1892o920J833M336Q133r151j932j0707l503j517j8771
$$ plain form
5524 -46275 -45669 -36025 -17220 1777 5563 1756 -11199 -8252 1011 3297 -2659 -5790 -11963 -8293
5510 -8293 18192 15470 13995 1715 -15917 -19465 -14062 -12245 -21854 -27150 -38200 -29958 -9508 -12428
5496 -12428 -38764 -25998 -13518 -9329 -5033 -8083 -1492 7965 -28687 -30701 -9496 2425 12980
5483 12980 12717 10043 -25602 -23225 -22115 -7483 19387 10458 -13416 -4617 9401 -2868 -18809
5470 -18809 9079 6054 -8412 -7686 -5060 -6226 -16668 -170 17817 26646 22575 4892 3932 4746
5456 4746 14098 14461 3554 -17968 -11364 -2839 -9369 -22000 -23270 -24165 -14311 10525 4507 -98
5442 -98 18382 19012 25892 33367 38866 9582 -15456 -16657 -41627 -41962 -27278 -21285 -5633 1344
5428 1344 6674 4265 10368 7904 16055 12724 -558 11628 15786 4312 -11217 -17409 -16033 -3226
$$ packed form
5524d6275O06R644J8805J8997L786l807j2955K947R263K286n956l131o173L670
5510h293K6485k722j475j2280j7632l548N403J817r609n296j1050Q242K0450k920
5496a2428k6336J2766J2480M189M296l050O591R457l6652k014K1205J1921J0555
5483A2980k63k674l5645K377J110J4632K6870q929k3874Q799J4018j2269j5941
5470a8809K7888l025j4466P26K626j166j0442J6498J7987Q829m071j7683r60Q14
5456D746R352L63j0907k1522O604Q525o530j2631j270q95R854K4836o018m605
5442i8J8480O30O880P475N499k9284k5038j201k4970l35J4684N993J5652O977
5428A344N330k409O103k464Q151l331j3282J2186M158j1474j5529o192J376J2807
$$ plain form
5414 -3226 1104 11179 6106 -11055 -13102 -16140 -10599 -3564 1227 7109 -3808 -29092 -56166 -39135
5400 -39135 -3956 -6906 -17498 -34961 -4808 18374 19570 11309 -9055 -10350 -5777 -23914 -23843
5387 -23843 -15439 -25901 -46904 -45969 -38050 -34056 -52408 -41592 -11611 23984 31525 16696 5410
5374 5410 8711 2460 -16304 -8402 -561 16819 17615 19813 35716 36364 26841 11011 -10925 -37995
5360 -37995 -26085 13686 24666 18418 14781 11644 29707 15241 3101 14318 6391 39274 54000
5347 54000 34035 11500 -1254 -2135 -3399 -16747 -12518 -32522 -47695 -60231 -57307 -46623 -26373
5334 -26373 -35968 -32715 -18375 -3706 8842 16189 23251 6333 34208 2887 -27964 -42350 -41463
5321 -41463 -22586 -16555 -8416 25236 42892 42419 40486 -2818 -12388 3848 5774 -12952 -21239
$$ packed form
5414c226M330J0075n073j7161k047l038N541P035M791N882j0917k5284k7074J7031
5400c9135L5179k950j0592j7463L0153K3182J196q261k0364j295M573j8137P1
5387b3843Q404j0462k1003R35P919L994j8352J0816K9981L5595P541j4829j1286
5374E410L301o251j8764P902P841J7380P96K198J5903O48r523j5830k1936k7070
5360c7995J1910L9771J0980o248l637l137J8063j4466j2140J1217p927L2883J4726
5347E4000j9965k2535j2754q81j264j3348M229k0004j5173j2536K924J0684K0250
5334b6373r595L253J4340J4669J2548P347P062j6918K7875l1321l0851j4386Q87
5321d1463J8877O031Q139L3652J7656m73j933m3304r570J6236J926j8726q287
$$ plain form
5308 -21239 -28918 -41539 -24258 25215 34091 42984 50942 16704 -978 4367 -11888 -26318 -14542
5295 -14542 13829 26558 12874 -2448 7400 -170 -2145 9349 10581 18125 12642 14418 6734
5282 6734 6866 -13174 -14002 -3044 -3139 -15156 -11321 -31399 -16186 -1026 2297 -31282 -29845 -23966
5268 -23966 -17638 -19138 -6551 -8617 638 11148 13714 6013 -1225 16587 4769 -11760 -9044
5255 -9044 -10886 -17360 -17868 -30671 -31815 -42439 -39830 -5924 4301 11142 24549 32235 26283 26532
5241 26532 14187 10081 -10314 -14976 -12877 -23298 -13175 10407 18902 20535 4738 11950 9980
5228 9980 -10827 -16511 -23717 -7205 13458 16417 14640 3396 15728 19053 34861 21879 7177
5215 7177 -3770 -13977 -32343 -30980 -38546 -54180 -21895 2919 29551 36557 26788 17458 20279
$$ packed form
5308b1239p679j2621J7281M9473Q876Q893P958l4238j7682N345j6255j4430J1776
5295a4542K8371J2729j3684j5322R848p570j975J1494J232P544n483J776p684
5282F734J32k0040q28J0958r5j2017L835k0078J5213J5160L323l3579J437N879
5268b3966O328j500J2587k066R255J0510K566p701p238J7812j1818j6529K716
5255i044j842o474n08j2803j144j0624K609L3906J0225O841J3407P686n952K49
5241B6532j2345m106k0395m662K099j0421J0123K3582Q495J633j5797P212j970
5228I980k0807n684p206J6512K0663K959j777j1244J2332L325J5808j2982j4702
5215G177j0947j0207j8366J363p566j5634L2285K4814K6632P006r769r330K821
$$ plain form
5202 20279 22253 3289 -23172 -27929 -29462 -31517 -23094 -13287 -4535 13123 26985 8017 -31627
5189 -31627 -14536 -2343 -4567 -20055 -20101 8423 26390 6851 -1551 7307 3563 -21605 -33682
5176 -33682 -36293 -21327 -3136 11712 10406 4810 13287 22052 24810 16981 7324 -1099 -17050 -36339
5162 -36339 -15161 29956 49924 29396 -12148 -15949 -22534 -31674 -22166 -3200 12173 3804 -11413
5149 -11413 -14807 -16281 -3893 -1346 -4514 4978 19585 26612 15441 4808 -19187 -23436 -11447
5136 -11447 -5466 -18700 -40815 -39605 -35240 -18426 1005 -14930 -22060 -27125 -15606 -30869 -38058
5123 -38058 -20212 -28851 -23274 -31657 -56470 -39824 -15192 -7037 -19507 -33972 -54094 -59913 -38084
5110 -38084 -7948 -2600 10976 15186 22043 -1991 -19592 -9468 8053 -7476 -601 15920 -139
$$ packed form
5202B0279J974j8964k6461m757j533k055Q423R807Q752J7658J3862j8968l9644
5189c1627J7091J2193k224j5488m6K8524J7967j9539q402Q858l744k5168j2077
5176c3682k611J4966J8191J4848j306n596Q477Q765K758p829r657q423j5951j9289
5162c6339K1178M5117J9968k0528m1544l801o585r140R508J8966J5373q369j5217
5149a1413l394j474J2388K547l168R492J4607P027j1171j0633k3995m249J1989
5136a1447N981j3234k2115J210M365J6814J9431j5935p130n065J1519j5263p189
5123c8058J7846q639N577q383k4813J6646K4632Q155j2470j4465k0122n819K1829
5110c8084L0136N348J3576M210O857k4034j7601J0124J7521j5529O875J6521j6059
$$ plain form
5097 -139 -29897 -14899 36157 32349 11322 16517 -16571 -41939 -25045 -5841 -5453 -2648 -46494
5084 -46494 -52345 -38871 -34132 -12923 9014 -8221 -6207 12317 6966 -3026 -25027 -39973 -15485
5071 -15485 -3141 5806 -25480 -33543 -17435 -2287 4805 -9880 -16612 -12581 -2051 8053 10819
5058 10819 12631 -6730 -8533 -7361 -17054 -3909 10065 5365 -8806 -9785 -37393 -33344 -21100
5045 -21100 -9393 -7022 -11725 -6393 -8494 9014 12708 18039 13410 -10830 -33504 -20300 4610
5032 4610 8004 -8979 7050 3830 5867 25678 25794 3164 -22308 -13133 -13645 -14085 -15526 -12456
5018 -12456 -7818 -23082 -25349 -2266 1777 20140 23103 14991 19813 16897 15508 15969 18088 8973
5004 8973 12185 -9494 -26635 -35991 -49746 -43955 -29525 22740 41532 3246 -7176 663 15638
$$ packed form
5097a39k9758J4998N1056l808k1027N195l3088k5368J6894J9204L88K805m3846
5084d6494n851J3474M739K1209K1937j7235K014J8524n351r992k2001j4946K4488
5071a5485J2344Q947l1286q063J6108J5148P092j4685o732M031J0530J0104K766
5058A0819J812j9361j803J172r693J3145J3974m700j4171r79k7608M049J2244
5045b1100J1707K371m703N332k101J7508L694N331m629k4240k2674J3204K4910
5032D610L394j6983J6029l220K037J9811J16k2630k5472R175n12m40j441L070
5018a2456M638j5264k267K3083M043J8363K963q112M822k916j389M61K119r115
5004H973L212k1679j7141r356j3755N791J4430N2265J8792l8286j0422P839J4975
$$ plain form
4991 15638 22021 31624 16823 -3644 -2827 -23054 -16865 -42982 -27786 -18035 -19028 -19201 -20290 -24228
4977 -24228 -24467 -31468 -26262 -8536 18296 29840 29033 29982 21280 816 -2996 3798 16669 28247
4963 28247 27041 15685 37813 31416 -1690 2252 8944 11572 -2282 1767 18471 5471 -4920
4950 -4920 -13385 -6616 -12517 -36766 -23282 4666 28737 17527 -14652 -37074 -40134 -22623 -24825
4937 -24825 601 11520 -15402 -5909 -13113 -21162 -9313 7826 18735 17847 -24613 -59842 -63249
4924 -63249 -54810 -18630 -811 -7910 -353 21952 20866 27578 25835 191 -2558 -800 -6282 -8793
4910 -8793 7579 8817 1550 9143 36106 36525 18368 1401 12553 10866 8478 19750 20296 -10009
4896 -10009 -16355 -28215 -33314 -27919 -19266 -31573 -36957 -27371 -17058 -3281 -9328 -4151 14959
$$ packed form
4991A5638O383R603j4801k0467Q17k0227O189k6117J5196R751r93j73j089l938
4977b4228k39p001N206J7726K6832J1544q07R49q702k0464l812O794J2871J1578
4963B8247j206j1356K2128o397l3106L942O692K628j3854M049J6704j3000j0391
4950d920q465O769n901k4249J3484K7948K4071j1210l2179k2422l060J7511k202
4937b4825K5426J0919k6922R493p204q049J1849J7139J0909q88m2460l5229l407
4924f3249Q439L6180J7819p099P557K2305j086O712j743k5644k749J758n482k511
4910h793J6372J238p267P593K6963M19j8157j6967J1152j687k388J1272N46l0305
4896a0009o346j1860n099N395Q653j2307n384R586J0313J3777o047N177J9110
$$ plain form
4883 14959 22293 26680 -1106 2296 15227 21163 7389 7248 6175 -7339 -32449 -24796 -7046
4870 -7046 9922 21699 -10096 -5723 6052 11531 13309 14992 14817 26541 5956 3838 9659 -7049
4856 -7049 -12832 -3758 -11325 -13714 -7323 7442 13254 14412 11576 -1182 12163 19806 902 -9686
4842 -9686 -4038 11978 31248 32261 28660 21023 -328 -3441 -1939 -1815 12723 28597 43480 45704
4828 45704 19902 -2903 -25045 -31356 -29337 -5951 11385 7296 -1133 25466 32280 24257 31136
4815 31136 34938 29388 36591 29070 26191 26751 -9441 -36035 -21443 -18970 -36003 -19516 -2249
4802 -2249 22535 17509 12124 12677 29203 24619 25420 22782 41513 62972 51055 42221 14603 27205
4788 27205 31644 12066 23205 16022 -926 -5068 12624 20184 26518 5740 -7433 2276 -4598
$$ packed form
4883A4959P334M387k7786L402J2931N936j3774j41j073j3514k5110P653J7750
4870g046J6968J1777l1795M373J1775N479J778J683j75J1724k0585k118N821j6708
4856g049n783R074p567k389O391J4765N812J158k836j2758J3345P643j8904j0588
4842i686N648J6016J9270J013l601p637k1351l113J502J24J4538J5874J4883K224
4828D5704k5802k2805k2142o311K019K3386J7336m089q429K6599O814q023O879
4815C1136L802n550P203p521k879N60l6192k6594J4592K473j7033J6487J7267
4802b249K4784n026n385N53J6526m584Q01k638J8731K1459j1917q834k7618J2602
4788B7205M439j9578J1139p183j6948m142J7692P560O334k0778j3173R709o874
$$ plain form
4775 -4598 -7718 -39101 -52542 -40011 -16143 13930 19259 7885 -1329 5213 1635 -14694 -34389
4762 -34389 -754 26371 13402 -834 9214 19649 19381 19632 1516 3158 10483 12434 6873
4749 6873 442 18592 27854 4115 -1778 815 -4722 -25672 -24517 -24681 -57596 -61551 -58265 -46632
4735 -46632 -27636 -24252 -27909 -31149 -17703 -20619 988 8646 843 -12910 -13788 -9963 -16876 -40539
4721 -40539 -36051 -27456 -36355 -28574 -3807 -12640 -21392 -12322 12340 26447 13762 -3331 -12379
4708 -12379 -11437 4908 10975 3650 -1766 -19439 -12376 342 -6821 -33315 -56594 -44848 -14472
4695 -14472 16487 -7038 -23963 -18760 -43922 -36641 -11996 -18900 -28438 -12073 978 6131 -16987
4682 -16987 -28823 -13025 10135 8720 -1244 11639 9611 9792 11331 7303 13667 10297 9635 14167
$$ packed form
4775d598l120l1383j3441J2531K3868L0073N329j1374r214O542l578j6329j9695
4762c4389L3635K7125j2969j4236J0048J0435k68K51j8116J642P325J951n561
4749F873o431J8150R262k3739n893K593n537k0950J155j64l2915l955L286J1633
4735d6632J8996L384l657l240J3446k916K1607P658p803j3753q78L825o913k3663
4721d0539M488Q595q899P781K4767q833q752R070K4662J4107j2685j7093r048
4708a2379R42J6345O067p325n416j7673P063J2718p163k6494k3279J1746L0376
4695a4472L0959k3525j6925N203k5162P281K4645o904r538J6365J3051N153k3118
4682a6987j1836J5798K3160j415r964J2883k028J81J539m028O364l370o62M532
$$ plain form
4668 14167 12499 34409 41276 36301 11373 23379 24675 26148 30457 18977 21519 12974 9843 -875
4654 -875 945 -3403 -20792 -31388 -30978 -2482 -9357 -7531 -37874 -41261 -25374 -5180 14729 25690
4640 25690 -3665 -12788 -6515 -20047 -30491 -27772 -14330 -22220 -19994 -720 6882 -25311 -21780
4627 -21780 -24665 -8084 -6347 -14767 -3807 19565 14963 -16356 -8356 -8664 -22600 -24162 -14279 4304
4613 4304 17608 19176 16415 27821 35943 22070 -562 -5569 -14284 -23520 -6638 21475 38820
4600 38820 22670 5651 -9432 -3980 3340 11168 -17082 -28663 -25210 -21693 -13155 681 -6898
4587 -6898 10311 27102 28379 2539 10384 15775 -6659 -22213 -13595 15322 33119 15236 -3447
4574 -3447 10703 10508 18910 26345 25195 22 -34570 -33667 -18958 -13804 -6236 -17929 -18899 -6888
$$ packed form
4668A4167j668K1910O867m975k4928J2006J296J473M309j1480K542q545l131j0718
4654h75J820m348j7389j0596M10K8496o875J826l0343l387J5887K0194J9909J0961
4640B5690k9355r123O273j3532j0444K719J3442p890K226J9274P602l2193L531
4627b1780k885J6581J737q420J0960K3372m602l1319Q000l08j3936j562R883J8583
4613D304J3304J568k761J1406Q122j3873k2632n007q715r236J6882K8113J7345
4600C8820j6150j7019j5083N452P320P828k8250j1581L453L517Q538J3836p579
4587f898J7209J6791J277k5840P845N391k2434j5554Q618K8917J7797j7883j8683
4574c447J4150j95Q402P435j150k5173l4592R03J4709N154P568j1693r70J2011
$$ plain form
4560 -6888 -4227 -8970 -25413 -22489 -23161 -15953 -9236 -29271 -26964 -7339 -4048 5475 12594 8264
4546 8264 -7398 -33580 -27270 -46246 -21297 -9022 4153 -1377 -14618 -13770 -2658 -10728 -2643
4533 -2643 -8011 10277 18287 -3091 -20489 -25275 -48041 -63732 -60415 -39431 -19736 -14138 -20785
4520 -20785 -26271 -33758 -31883 -39019 -35657 -35071 -38636 -13474 24769 22579 13240 6333 17666 29886
4506 29886 33204 999 -7068 10582 7995 14788 31432 19405 -5758 -14338 -14153 -7904 -2166 12601
4492 12601 15804 31745 51185 50983 64708 20905 -16222 -8231 5143 884 655 5497 16600
4479 16600 7365 12162 4551 -15084 -27287 -6934 8433 -5199 -7946 4052 22531 27147 42014
4466 42014 38573 50769 40765 20416 6470 -7326 -37053 -39739 -33799 -35267 -18799 -31979 -43603
$$ packed form
4560f888K661m743j6443K924o72P208O717k0035K307J9625L291R523P119m330
4546H264j5662k6182O310j8976K4949J2275J3175n530j3241Q48J1112q070Q085
4533b643n368J8288Q010k1378j7398m786k2766j5691L317K0984J9695N598o647
4520b0785n486p487J875p136L362N86l565K5162L8243k190r339o907J1333J2220
4506B9886L318l2205q067J7650k587O793J6644j2027k5163q580J85O249N738J4767
4492A2601L203J5941J9440k02J3725m3803l7127P991J3374m259k29M842J1103
4479A6600r235M797p611j9635j2203K0353J5367j3632k747J1998J8479M616J4867
4466D2014l441J2196j0004k0349j3946j3796k9727k686N940j468J6468j3180j1624
$$ plain form
4453 -43603 -24623 -3844 -19252 -15073 -6006 4987 20456 14125 2667 -13567 -20901 9623 29345
4440 29345 17168 17718 24323 25562 23335 8082 11017 -688 -5549 5384 8613 -15580 -36555
4427 -36555 -11651 8920 11997 -21715 -45459 -30273 -33968 -12770 -18311 -23335 -34469 -36440 -24294
4414 -24294 -21759 -18769 3552 23446 18722 20285 32268 29000 33403 20452 -4435 -3648 -12191 -8439
4400 -8439 -8761 8941 16211 -14991 -35819 -20785 855 1567 -3310 1847 12707 18763 6673 -1754
4386 -1754 4279 -7130 -8344 10642 28569 16301 5259 -2473 10572 704 -2113 -18203 -10323
4373 -10323 2930 14399 8399 -17425 -32141 -30043 -34304 -20928 -20780 -14731 -17288 -19927 -10886 5471
4359 5471 39553 19715 -3021 -19099 8169 6177 -17865 -27334 -34079 -32565 -4815 15459 11816
$$ packed form
4453d3603J8980K0779j5408M179R067J0993J5469o331j1458j6234p334L0524J9722
4440B9345j2177N50O605J239k227j5253K935j1705m861J0933L229k4193k0975
4427c6555K4904K0571L077l3712k3744J5186l695K1198n541n024j1134j971J2146
4414b4294K535K990K2321J9894m724J563J1983l268M403j2951k4887P87q543L752
4400h439l22J7702P270l1202k0828J5034K1640P12m877N157J0860O056j2090q427
4386a754O033j1409j214J8986J7927j2268j1042p732J3045r868k817j6090P880
4373a0323J3253J1469o000k5824j4716K098m261J3376J48O049k557k639R041J6357
4359E471L4082j9838k2736j6078K7268j992k4042r469o745J514K7750K0274l643
$$ plain form
4346 11816 11700 -18401 -33299 -44153 -52102 -32759 4008 23406 33468 35652 9785 4414 -5070
4333 -5070 -27526 -33614 -15025 -15613 9437 21874 26028 9380 26842 19383 40065 40166 29798
4320 29798 17804 11074 -21753 -19335 -4949 13138 2222 -1457 -23196 -40101 -42419 -24682 -22290
4307 -22290 -12873 5888 5877 6221 26113 39312 36327 16922 -603 6951 -11158 -4325 8161 7880
4293 7880 9506 13192 21839 27774 20254 28634 25251 30438 47904 31762 -4003 -11440 -18697 -14137
4279 -14137 -24892 -10332 -8082 3960 253 5034 14030 -4699 7524 33472 25638 38228 35536
4266 35536 24824 38583 32566 44796 55089 38680 10579 -11978 -29167 -26305 -10652 -4597
4254 -4597 -2650 -20069 -3078 5728 -7182 9277 15497 -11189 538 4370 -8509 -14723 -15859
$$ packed form
4346A1816j16l0101j4898j0854p949J9343L6767J9398J0062K184k5867n371r484
4333e070k2456o088J8589n88K5050J2437M154j6648J7462p459K0682J01j0368
4320B9798j1994o730l2827K418J4386J8087j0916l679k1739j6905k318J7737K392
4307b2290R417J8761j1L44J9892J3199k985j9405j7525P554j8109O833J2486k81
4293G880J626L686Q647N935p520Q380l383N187J7466j6142l5765p437p257M560
4279a4137j0755J4560K250J2042l707M781Q996j8729J2223K5948p834J2590k692
4266C5536j0712J3759o017J2230J0293j6409k8101k2557j7189K862J5653O055
4254d597J947j7419J6991Q806j2910J6459O220k6686J1727L832j2879o214j136
$$ plain form
4241 -15859 -29084 -41405 -33274 -35217 -19406 -6690 6245 12275 33885 30455 -11565 -32066 -39062
4228 -39062 -45778 -47310 -49507 -48806 -45182 -41994 -28953 -24180 -9000 -3383 -178 -3149 -3465 -11175 -14047
4213 -14047 -3765 -1639 -24402 -23062 11611 8571 -7442 4290 10538 34875 27866 26205 44499
4200 44499 28451 13912 -1833 -15175 -29624 1883 23645 323 -4342 593 4217 3310 -9774
4187 -9774 9012 16204 -2265 -1267 13166 15693 6096 -2364 24543 23198 9393 6317 14846 18490
4173 18490 13178 15038 14849 27043 16531 510 -351 -4358 -15778 -23580 -18765 14861 26125 4105
4159 4105 14532 24574 29038 38639 31165 9982 -9770 6298 15271 7764 378 3053 25342
4146 25342 34969 12994 -8210 8789 14819 3341 12793 19310 38882 31089 20445 23864 45404
$$ packed form
4241a5859j3225j2321Q131j943J5811J2716J2935O030K1610l430m2020k0501o996
4228c9062o716j532k197P01L624L188J3041M773J5180N617L205k971l16p710k872
4213a4047J0282K126k2763J340L4673l040j6013J1732O248K4337p009j661J8294
4200D4499j6048j4539j5745j3342j4449L1507K1762k3322m665M935L624r07j3084
4187i774J8786P192j8469R98J4433K527r597q460K6907j345j3805l076Q529L644
4173A8490n312J860j89J2194j0512j6021q61m007j1420p802M815L3626J1264k2020
4159D105J0427J0042M464R601p474k1183j9752J6068Q973p507p386K675K2289
4146B5342R627k1975k1204J6999O030j1478R452O517J9572p793j0644L419K1540
$$ plain form
4133 45404 44082 34699 32791 9781 24972 40295 18742 18482 6873 -17874 -1939 29261 30706
4120 30706 10266 8078 3140 -38765 -51729 -32353 -27588 -48038 -45979 -33708 -20368 -30902 -44303
4107 -44303 -40125 -13705 26032 40608 28901 -8723 -25709 -18463 -25824 -38187 -38210 -39385 -16944
4094 -16944 -3839 7664 3854 -20098 -19517 -17903 -10382 -18035 -15753 5131 8851 -12217 15777
4081 15777 42084 40313 33935 17152 -5927 -32393 -40562 -48856 -31504 -19053 -9041 1378 -13073
4068 -13073 6913 17467 11184 19897 24506 32318 25731 8344 22233 23611 -5877 -10618 -27565
4055 -27565 -18214 -10571 -9694 -7683 19669 51884 54051 14777 17787 9489 -6777 2951 -3235 -4303
4041 -4303 -12378 -1727 4756 14636 -2519 -9135 -29581 -27917 -8072 -2527 -7076 14067 6652 -17513
$$ packed form
4133D5404j322r383j908k3010J5191J5323k1553k60j1609k4747J5935L1200J445
4120C0706k0440k188m938m1905j2964J9376M765k0450K059J2271J3340j0534j3401
4107d4303M178K6420L9737J4576j1707l7624j6986P246p361j2363k3j175K2441
4094a6944J3105J1503l810k3952N81J614P521p653K282K0884L720k1068K7994
4081A5777K6307j771o378j6783k3079k6466q169q294J7352J2451J0012J0419j4451
4068a3073J9986J0554o283Q713M609P812o587j7387J3889J378k9488m741j6947
4055b7565R351P643Q77K011K7352L2215K167l9274L010q298j6266R728o186j068
4041d303q075J0651O483R880j7155o616k0446J664J9845N545m549K1143p415k4165
$$ [...]
##END NTUPLES=NMR SPECTRUM
##END=
