##TITLE=Analysis number 328755
Compound Code cc 01306
Book Reference lab3
Project Code adrs
Chemist Name stores
##JCAMPDX= 6.0         $$ Bruker NMR JCAMP-DX V2.0
##DATA TYPE= NMR SPECTRUM
##DATA CLASS= NTUPLES
##ORIGIN= Bruker BioSpin GmbH
##OWNER= nmr
$$ XWIN-NMR		Version 3.5
$$ Mon Jul  2 12:15:15 2007 GMT Daylight Time (UT+1h)  MAYBRIDGE\nmr@NMR_250MHZ
##.OBSERVE FREQUENCY= 250.131544655141
##.OBSERVE NUCLEUS= ^1H
##.ACQUISITION MODE= SIMULTANEOUS (DQD)
##.ACQUISITION SCHEME= undefined
##.AVERAGES= 16
##.DIGITISER RES= 18
##SPECTROMETER/DATA SYSTEM= dpx250
##.PULSE SEQUENCE= zg30
##.SOLVENT NAME= CDCl3
##.SHIFT REFERENCE= (INTERNAL, CDCl3, 0, 16.522)
##AUDIT TRAIL= $$ (NUMBER, WHEN, WHO, WHERE, WHAT)
$$ ##TITLE= Audit trail, XWIN-NMR		Version 3.5
$$ ##JCAMPDX= 5.01
$$ ##ORIGIN= Bruker BioSpin GmbH
$$ ##OWNER= nmr
$$ C:\u/data/dgb/nmr/ADRS/100/pdata/1/auditp.txt
$$ ##AUDIT TRAIL=  $$ (NUMBER, WHEN, WHO, WHERE, WHAT)
(   1,<2007-07-02 12:14:53.19 +100>,<MAYBRIDGE\nmr>,<NMR_250MHZ>,
      <created by zg, POWCHK disabled, PULCHK disabled
       configuration hash MD5:
       76 6E 9A 78 1E 09 19 81 EC 84 63 8F B0 6A 59 2D
       data hash MD5: 64K
       D9 EA B1 9F A8 2D C8 B3 AB 95 32 18 A3 16 08 72>)
(   2,<2007-07-02 12:15:05.83 +100>,<MAYBRIDGE\nmr>,<NMR_250MHZ>,
      <Start of raw data processing
       ef LB = 0.3 FT_mod = 6 PKNL = 1 SI = 32K 
       data hash MD5: 32K
       2F 51 85 81 29 CB 57 80 10 F1 E6 C8 99 CD 94 CC>)
(   3,<2007-07-02 12:15:07.68 +100>,<MAYBRIDGE\nmr>,<NMR_250MHZ>,
      <apk 
       data hash MD5: 32K
       E4 F2 91 09 87 30 3B 3C 2C 2F 63 11 98 56 8D B5>)
(   4,<2007-07-02 12:15:08.40 +100>,<MAYBRIDGE\nmr>,<NMR_250MHZ>,
      <abs ABSG = 5 
       data hash MD5: 32K
       50 C4 2E 4A B0 FD 5C 2B 93 26 F1 D7 D1 74 ED 46>)
$$ ##END=
$$ 
$$ hash MD5
$$ 47 D4 18 C6 62 53 80 A9 95 DD D2 83 82 3E 32 F6
##$RELAX= 
##$RELAX= 
##$RELAX= 
##$RELAX= 
##$RELAX= 
##$RELAX= 
##$RELAX= 
$$ Bruker specific parameters
$$ --------------------------
##$DU= <C:\u>
##$EXPNO= 100
##$NAME= <ADRS>
##$PROCNO= 1
##$TYPE= <nmr>
##$USER= <dgb>
##$AMP= (0..31)
100 100 100 100 100 100 100 100 100 100 100 100 100 100 100 100 100 100 
100 100 100 100 100 100 100 100 100 100 100 100 100 100 
##$AQSEQ= 0
##$AQ_mod= 3
##$AUNM= <au_zg>
##$AUTOPOS= <20 >
##$BF1= 250.13
##$BF2= 250.13
##$BF3= 250.13
##$BF4= 250.13
##$BF5= 500.13
##$BF6= 500.13
##$BF7= 500.13
##$BF8= 500.13
##$BYTORDA= 1
##$CFDGTYP= 0
##$CFRGTYP= 5
##$CHEMSTR= <none>
##$CNST= (0..31)
1 1 145 1 1 1 1 1 1 1 1 1 1 1 1 1 1 1 1 1 1 1 1 1 1 1 1 1 1 1 1 1 
##$CPDPRG= <>
##$CPDPRG1= <>
##$CPDPRG2= <>
##$CPDPRG3= <>
##$CPDPRG4= <mlev>
##$CPDPRG5= <mlev>
##$CPDPRG6= <mlev>
##$CPDPRG7= <mlev>
##$CPDPRG8= <mlev>
##$CPDPRGB= <>
##$CPDPRGT= <>
##$D= (0..31)
0 1 0 0 0 0 0 0 0 0.06 0 0 0 0 0 0 0.0002 0 0 0 0 0 0 0 0 0 0 0 0 0 0 
0 
##$DATE= 1183374892
##$DBL= (0..7)
120 120 120 120 120 120 120 120 
##$DBP= (0..7)
150 150 150 150 150 150 150 150 
##$DBP07= 0
##$DBPNAM0= <>
##$DBPNAM1= <>
$$ [...]
##$SUBNAM7= <"">
##$SUBNAM8= <"">
##$SUBNAM9= <"">
##$SW= 20.6930455092707
##$SWIBOX= (0..15)
0 0 3 0 0 0 0 0 0 0 0 0 0 0 0 0 
##$SW_h= 5175.983436853
##$TD= 65536
##$TD0= 1
##$TE= 297.16
##$TE2= 300
##$TE3= 300
##$TEG= 300
##$TL= (0..7)
0 120 120 120 120 120 120 120 
##$TP= (0..7)
150 150 150 150 150 150 150 150 
##$TP07= 0
##$TPNAME0= <>
##$TPNAME1= <>
##$TPNAME2= <>
##$TPNAME3= <>
##$TPNAME4= <>
##$TPNAME5= <>
##$TPNAME6= <>
##$TPNAME7= <>
##$TPOAL= (0..7)
0.5 0.5 0.5 0.5 0.5 0.5 0.5 0.5 
##$TPOFFS= (0..7)
0 0 0 0 0 0 0 0 
##$TUNHIN= 0
##$TUNHOUT= 0
##$TUNXOUT= 0
##$USERA1= <user>
##$USERA2= <user>
##$USERA3= <user>
##$USERA4= <user>
##$USERA5= <user>
##$V9= 5
##$VALIST= <valist>
##$VCLIST= <CCCCCCCCCCCCCCC>
##$VD= 0
##$VDLIST= <DDDDDDDDDDDDDDD>
##$VPLIST= <PPPPPPPPPPPPPPP>
##$VTLIST= <TTTTTTTTTTTTTTT>
##$WBST= 1024
##$WBSW= 4
##$XGAIN= (0..3)
0 0 0 0 
##$XL= 0
##$YL= 0
##$YMAX_a= 568242
##$YMIN_a= -527439
##$ZGOPTNS= <>
##$ZL1= 120
##$ZL2= 120
##$ZL3= 120
##$ZL4= 120
##$ABSF1= 16.522
##$ABSF2= -4.171173
##$ABSG= 5
##$ABSL= 3
##$ALPHA= 0
##$AQORDER= 0
##$ASSFAC= 0
##$ASSFACI= 0
##$ASSFACX= 0
##$ASSWID= 0
##$AUNMP= <proc_1d>
##$AZFE= 0.1
##$AZFW= 0.1
##$BCFW= 0
##$BC_mod= 0
##$BYTORDP= 0
##$COROFFS= 0
##$CY= 12.5
##$DATMOD= 1
##$DC= 0
##$DFILT= <>
##$DTYPP= 0
##$F1P= 14.0000005364418
##$F2P= -0.99999901652339
##$FCOR= 0.5
##$FTSIZE= 32768
##$FT_mod= 6
##$GAMMA= 0
##$GB= 0
##$INTBC= 1
##$INTSCL= 1
##$ISEN= 128
##$LB= 0.3
##$LEV0= 0
##$LPBIN= 0
##$MAXI= 10000
##$MC2= 0
##$MEAN= 0
##$ME_mod= 0
##$MI= 0
##$NCOEF= 0
##$NC_proc= -2
##$NLEV= 6
##$NOISF1= 0
##$NOISF2= 0
##$NSP= 0
##$NTH_PI= 0
##$NZP= 0
##$OFFSET= 16.522
##$PC= 1
##$PHC0= -54.16034
##$PHC1= 8.331394
##$PH_mod= 1
##$PKNL= yes
##$PPARMOD= 0
##$PSCAL= 4
##$PSIGN= 0
##$REVERSE= no
##$SF= 250.13
##$SI= 32768
##$SIGF1= 0
##$SIGF2= 0
##$SINO= 400
##$SIOLD= 32768
##$SREGLST= <1H.CDCl3>
##$SSB= 0
##$STSI= 32768
##$STSR= 0
##$SW_p= 5175.98343685301
##$SYMM= 0
##$S_DEV= 0
##$TDeff= 65536
##$TDoff= 0
##$TI= <Analysis number 999999
Compound Code 99
Book Reference 9
Project Code 9>
##$TILT= no
##$TM1= 0
##$TM2= 0
##$TOPLEV= 0
##$USERP1= <user>
##$USERP2= <user>
##$USERP3= <user>
##$USERP4= <user>
##$USERP5= <user>
##$WDW= 1
##$XDIM= 32768
##$YMAX_p= 549552458
##$YMIN_p= -26129
$$ End of Bruker specific parameters
$$ ---------------------------------
##NTUPLES= NMR SPECTRUM
##VAR_NAME=  FREQUENCY,     SPECTRUM/REAL,   SPECTRUM/IMAG
##SYMBOL=    X,             R,               I
##VAR_TYPE=  INDEPENDENT,   DEPENDENT,       DEPENDENT
##VAR_FORM=  AFFN,          ASDF,            ASDF
##VAR_DIM=   32768,         32768,           32768
##UNITS=     HZ,            ARBITRARY UNITS, ARBITRARY UNITS
##FACTOR=    0.157963299565203, 1,           1
##FIRST=     4132.6476996994, 0,             0
##LAST=      -1043.33573715361, 0,           0
##MIN=       -1043.33573715361, -26129,      0
##MAX=       4132.6476996994, 549552458,     0
$$ Real data points
##PAGE= N=1
##DATA TABLE= (X++(R..R)), XYDATA
$$ [...]
19753d372k651q06j266K035J006q711k892Q637R332N44j139k883o231n698J799
$$ -4372 -7023 -7829 -9095 -7060 -6054 -14765 -17657 -9020 312 856 -283 -3166 -9397 -15095 -13296
19738a3296N364N184J925M55K173q19k80m263l434K992K035n83k704J758R50j880
$$ -13296 -7932 -2748 -823 -368 1805 986 706 -3557 -6991 -3999 -1964 -2547 -5251 -3493 -2543 -4423
19722d423J0290N889K744N60J467j0370j727j94L97l205m290r35N177l912o30
$$ -4423 5867 11756 14500 15060 16527 6157 4430 4236 4633 1428 -2862 -3797 1380 -2532 -3162
19707c162O126j555n324n457O187K396k128J380J2096J349o453r995p724L229
$$ -3162 2964 1409 -3915 -9372 -3185 -789 -2917 -1537 10559 11908 5455 -4540 -12264 -9035
19693i035K68q217K983O964N462l47k484R23M069O11l159J611k817l476j354N239
$$ -9035 -8767 -16984 -14001 -7037 -1575 -1922 -4406 -3483 586 1197 -1962 -351 -3168 -6644 -7998 -2759
19677b759J937o955O733o64r18J334k300k20R11J480K99k057k052j910o024M87
$$ -2759 -822 -7777 -1044 -1708 -2626 -1292 -3592 -3812 -2901 -1421 -1122 -3179 -5231 -7141 -13165 -12678
19661a2678L442M186L604N812J723j661j2767k85K261N946q05n893L598J250o119
$$ -12678 -9236 -5050 -1446 4366 6089 4428 -8339 -8624 -6363 -417 -1222 -7115 -3517 -2267 -8386
19646h386j0867j102N867O842O40l571k86j201M248O483K723n985K003O906k083
$$ -8386 -19253 -20355 -14488 -7646 -7006 -10577 -10863 -12064 -7816 -1333 1390 -4595 -2592 4314 2231
19631B231o989M250L05k208n635p391P25O306L156l467J179l098K683j914P755
$$ 2231 -4758 -508 -203 -2411 -8046 -15437 -14712 -8406 -5250 -8717 -7538 -10636 -7953 -9867 -2112
19616b112p78K128J289p645k654l051K211N670j13m287j734L746m863l002N993
$$ -2112 -2890 -762 527 -7118 -9772 -12823 -10612 -4942 -5055 -9342 -11076 -7330 -12193 -15195 -9202
19601i202M010p826l10m3r0L563r38J599M311L973M57o619n043N436O337M5J575
$$ -9202 -5192 -13018 -13328 -13371 -13461 -9898 -10836 -9237 -4926 -953 -496 -7115 -12158 -6722 -385 -340 1235
19584A235M685j358k395P29K661o831m540N175O786J541m241q610K250L959k443
$$ 1235 5920 4562 2167 2896 5557 -1274 -5814 -639 6147 7688 3447 -5163 -2913 1046 -1397
19569a397K573n216r983k265J041j470j420K866q62K840M369Q439K009L80j701
$$ -1397 1176 -4040 -14023 -16288 -15247 -16717 -18137 -15271 -16133 -13293 -8924 -485 1524 1904 203
19554B03k804K048K177j798J8o798o669q775O477N937L683N128k783K506n211
$$ 203 -2601 -553 1624 -174 -156 -6954 -13623 -22398 -15921 -9984 -6301 -1173 -3956 -1450 -6661
19539f661l244L183L377k668l290J276K878N785M71o804q730j678O541P196R5
$$ -6661 -9905 -6722 -3345 -6013 -9303 -8027 -5149 636 1107 -5697 -14427 -16105 -9564 -2368 -2273
19524b273o067L510L866j120k958n997L419N078N315K55K941j0739m884N635O990
$$ -2273 -8340 -4830 -964 -2084 -5042 -11039 -7620 -2542 2773 3028 5969 -4770 -9654 -4019 2971
19509B971L51l275m652n530L787Q52L084k180l194M493J302N54m337j092k14l757
$$ 2971 3322 47 -4605 -10135 -6348 -5496 -2412 -4592 -7786 -3293 -1991 -1437 -5774 -6866 -7080 -10837
19493a0837L926M718K669m405n722J647N733J125o846q982K320P653J1126k577
$$ -10837 -6911 -2193 476 -3929 -9651 -8004 -2271 -1146 -7992 -16974 -14654 -7001 4125 1548
19479A548j0220m42k448M60K323k76L96j647O08K29L085j384J495R273j841J911
$$ 1548 -8672 -9114 -11562 -11102 -8779 -9055 -8659 -10306 -9698 -9469 -6384 -7768 -6273 3000 1159 3070
19463C070J355n15o517q045K995N38Q127K865q039r877R557M723N770P347M411
$$ 3070 4425 3910 -2607 -10652 -7657 -7119 1008 3873 -4166 -14043 -4486 237 6007 13354 17765
19448A7765l040l349K449m48j803o251M348N203J1444P616P972M828P583L788
$$ 17765 14725 11376 13825 13377 11574 5323 9671 14874 26318 33934 41906 46734 54317 58105
19434E8105R334J6279J8381K3218K1186K8144L6973M3376M3233L8895K8829L0650
$$ 58105 67439 83718 102099 125317 146503 174647 211620 254996 298229 337124 365953 396603
19422C96603L5538K9862p183l2121l0777m4974n1219l4618l3245l3203k7859j4468
$$ 396603 432141 462003 454820 422699 391922 346948 295729 261111 227866 194663 166804 152336
19410A52336k296j2543r648m780L085j4793k5925k8511j7851j2617j1353m083
$$ 152336 150040 137497 127849 123069 126154 111361 85436 56925 39074 26457 15104 11021
19398A1021m119L109N437K072j472q005p407J668M393K659J472l407n340l231
$$ 11021 6902 10011 15448 17520 16048 8043 636 2304 6697 9356 10828 7421 2081 -1150
19384a150k42J84k294N00P21L444l533j190L746N643J184m393l849J629J809q44
$$ -1150 -1392 -1208 -3502 -3002 -2281 1163 -2370 -3560 186 5829 7013 2620 -1229 400 2209 1365
19368A365k305k699n264J560L529R054K675j596o171q145L376P68O68K461j623
$$ 1365 -940 -3639 -8903 -7343 -3814 5240 7915 6319 148 -7997 -4621 -3853 -3185 -724 -2347
19353b347j011M242L053r242L71j946l035k072P98O209k874k419j673L674Q72
$$ -2347 -3358 884 3937 -5305 -4934 -6880 -9915 -11987 -11189 -4980 -7854 -10273 -11946 -8272 -7400
19338g400j776K987Q311k861k813J295j713n104M085K368k934k47L157j546j497
$$ -7400 -9176 -6189 2122 -739 -3552 -2257 -3970 -9074 -4989 -2621 -5555 -5802 -2645 -4191 -5688
19323e688k225P428J521k999o683L324M165M37R89j344Q031k441m795j438R66
$$ -5688 -7913 -485 1036 -1963 -8646 -5322 -1157 -720 269 -1075 6956 4515 -280 -1718 -752
19308g52r66m72j93K129P604n575m864j429N536K34j252o219q545O355Q480k448
$$ -752 -1718 -2190 -2383 -254 7350 1775 -3089 -4518 1018 1252 0 -6219 -14764 -8409 71 -2377
19292b377j435M6j703M40M372k752p941P91N775J495m680J90P808J190o403Q29
$$ -2377 -3812 -3766 -5469 -5029 -657 -3409 -11350 -10559 -4784 -3289 -7969 -7779 29 1219 -5184 -4355
19276d355k146L223k734j655M111N813M164K097J432K233L42l919l898l828M489
$$ -4355 -6501 -3278 -6012 -7667 -3556 2257 6421 8518 9950 12183 12525 8606 4708 880 5369
19261E369M894L854o11O85k001p21P334J488k795m078O84n445m574K939K682m239
$$ 5369 10263 14117 13506 14191 12190 11469 18803 20291 17496 13418 14102 8657 4083 7022 9704 5465
19245E465o152J659J023n527R041M859J559n259o95N4n46n352N8j072o108l638
$$ 5465 -687 972 1995 -3532 5509 10368 11927 6668 5973 6027 5481 129 187 -885 -6993 -10631
19229a0631J596N684L042J462J136j445l351k31K6J15j709m265j012J530J495
$$ -10631 -9035 -3351 -309 1153 2289 844 -2507 -2738 -2712 -2597 -4306 -8571 -9583 -8053 -6558
19214f558J261m856J903N434O232L73n416l818L5m439M203k228m579K977L203
$$ -6558 -5297 -10153 -8250 -2816 3416 3789 -1627 -5445 -5410 -9849 -5646 -7874 -12453 -9476 -6273
19199f273J01L305j104N075m532o190p540m78N119J2308Q936j0053m285k578L300
$$ -6273 -6172 -2867 -3971 1104 -3428 -9618 -17158 -17636 -12517 -209 8727 -1326 -5611 -8189 -4889
19184d889l346n130L69L8Q70J854J465M67K474J422j041P580m064J514k203l992
$$ -4889 -8235 -13365 -12996 -12958 -12088 -10234 -8769 -8302 -5828 -4406 -5447 2133 -1931 -417 -2620 -6612
19168f612j512M32J666m054n228L291R457L461M063k548o84m592K678n148o196
$$ -6612 -8124 -7692 -6026 -10080 -15308 -12017 -2560 901 4964 2416 1732 -2860 -182 -5330 -11526
19153a1526K517R296l669N075l161o622k713Q103K827K412k631n072k182m38k813
$$ -11526 -9009 287 -3382 1693 -1468 -8090 -10803 -2700 127 2539 -92 -5164 -7346 -7784 -10597
19138a0597M008M451m388J986l70K547j362p95P05O566k82k984q886j0068K077
$$ -10597 -6589 -2138 -6526 -4540 -4910 -2363 -3725 -4520 -3815 2751 2469 -515 -9401 -19469 -17392
19123a7392j654l577P989O318K334l921P27K187J603j779p72l180j548J162Q053
$$ -17392 -19046 -22623 -14634 -8316 -5982 -9903 -9176 -6989 -5386 -7165 -7937 -11117 -12665 -11503 -3450
19108c450N294l074k222j198P948N369k937p481j986M340m84p42m590r324j540
$$ -3450 1844 -1230 -3452 -4650 3298 8667 5730 -1751 -3737 603 119 -623 -5213 -14537 -16077
19093a6077J739M349J575M774R571N601m636k34n552n553o278j960k979M049M234
$$ -16077 -14338 -9989 -8414 -3640 5931 11532 6896 6662 1110 -4443 -10721 -12681 -15660 -11611 -7377
19078g377M626J739j728K216J733J739k944p795J667j254n359N461P688q787m277
$$ -7377 -2751 -1012 -2740 -524 1209 2948 4 -7791 -6124 -7378 -12737 -7276 412 -8375 -12652
19063a2652K150Q83P97O941N380M303l497J865N648j82j3001p085Q89K066n05
$$ -12652 -10502 -9619 -8822 -1881 3499 7802 4305 6170 11818 11636 -1365 -8450 -7561 -5495 -6000
19048f000r36j90K123Q595K616o85p272m00l970k008K229M198N063n575o759O123
$$ -6000 -6936 -7126 -5003 3592 6208 5523 -1749 -2149 -6119 -8127 -5898 -1700 3363 -2212 -8971 -2848
19032b848P126o759k968L31L147J139J621j940j567n38Q397l716o700j332j134
$$ -2848 4278 -2481 -5449 -5118 -1971 -832 789 -1151 -2718 -3256 5141 1425 -5275 -6607 -7741
19017g741l888j689K455P860K569O75k555k550K987R677O338j3254j0660n970
$$ -7741 -11629 -13318 -10863 -3003 -434 241 -2314 -4864 -1877 7800 14138 884 -9776 -15746
19003a5746O050K552k304Q010P758m355o13j9J364r504L994O628K501N723l702
$$ -15746 -9696 -7144 -9448 -1438 6320 1965 1352 1333 2697 -6807 -2813 3815 6316 12039 8337
18988H337m225L93Q256J267k953l815k37o938n937k194j78k4m219M562M119Q30
$$ 8337 4112 4505 12761 14028 11075 7260 7023 85 -5852 -8046 -8224 -8248 -12467 -7905 -3786 -2956
18972b956J793j176k644l829J697L634L955m440l664J998L513M228o199p33P206
$$ -2956 -1163 -2339 -4983 -8812 -7115 -3481 474 -3966 -7630 -5632 -2119 2109 -4090 -4823 2383
18957B383j365j652m185Q615M178n31n548l428Q78K986J043o962n536J916J056
$$ 2383 1018 -634 -4819 3796 7974 7443 1895 -1533 -655 2331 3374 -3588 -9124 -7208 -6152
18942f152q32l119P29n69M089j356J573L401m548m993O908L78k992n705q699P585
$$ -6152 -6984 -10103 -9374 -9943 -5854 -7210 -5637 -2236 -6784 -11777 -4869 -4491 -7483 -13188 -21887 -14302
18926a4302R044K715Q283l035l780j888M096M856k970m195N564L472k046n792
$$ -14302 -5258 -2543 5740 2705 -1075 -2963 1133 5989 3019 -1176 4388 7860 5814 22
18912B2o215j957Q268K614n631L117N673k196j747m552r825k980P528K553j155
$$ 22 -6193 -8150 118 2732 -2899 218 5891 3695 1948 -2604 -12429 -15409 -7881 -5328 -6483
18897f483N832M626J309Q3n357o061J051k555o311M936R436P66m254j40q758o40
$$ -6483 -651 3975 5284 5367 10 -6051 -5000 -7555 -13866 -8930 506 1272 -2982 -3122 -11880 -12520
18881a2520O292K196J442K892k962p277L373J173N599q86l084q622n103k359R740
$$ -12520 -6228 -4032 -2590 302 -2660 -9937 -6564 -5391 208 -678 -3762 -12384 -17487 -19846 -10106
18866a0106O595l58K967K797o760j906J397O80K367P959M692K919r087J249O698
$$ -10106 -3511 -3869 -902 1895 -4865 -6771 -5374 -4694 -2327 5632 10324 13243 4156 5405 12103
18851A2103l333l5L620o692l544j814n636J887j422k718k906R89m078J326R231
$$ 12103 8770 8735 12355 5663 2119 305 -5331 -3444 -4866 -7584 -10490 -9501 -13579 -12253 -3022
18836c022J2967j920n915q73K492j556n485k476q94l449l211K476L093J2443J110
$$ -3022 9945 8025 2110 1237 3729 2173 -3312 -5788 -6682 -10131 -13342 -10866 -7773 4670 5780
18821E780l957l529l540n223L30j350J86r77P43K492Q71R61P31O513Q342n616
$$ 5780 1823 -1706 -5246 -10469 -10139 -11489 -11303 -12280 -11537 -9045 -8174 -7213 -6482 31 8373 2757
18805B757K380r228p416m494L682J1340K702O362l880j569K63k768k649o63l380
$$ 2757 5137 -4091 -11507 -16001 -12319 -979 1723 8085 4205 2636 2899 131 -2518 -3181 -6561
18790f561o086L375N644L046n140J300N303K652O393m874p741n59k185m698q84
$$ -6561 -12647 -9272 -3628 -582 -5722 -4422 881 3533 9926 5052 -2689 -3248 -5433 -10131 -11015
18775a1015P096P58j210O692O966N161N784O990M839J6188K5811J7672k1454k2865
$$ -11015 -3919 -3161 -4371 2321 9287 14448 20232 27222 32061 48249 74060 91732 70278 47413
18761D7413k2437j6538p422j912k69L287K617r658o65L437K706p49n171m601L758
$$ 47413 24976 8438 1016 -896 -1165 2122 4739 -4919 -5584 -2147 559 -190 -5361 -9962 -6204
18746f204O912J727N857N29n084j521K713n450k358o681o12L400K516j657m474
$$ -6204 708 2435 8292 8821 3737 2216 4929 -521 -2879 -9560 -10172 -6772 -4256 -5913 -10387
18731a0387j758M964K784j336j530l743j63N34J693l18j569M196M462P61J584
$$ -10387 -12145 -7181 -4397 -5733 -7263 -11006 -11169 -10635 -8942 -9260 -10829 -6633 -2171 -1410 174
18716A74R977K072m713o062k176K81L110l745L363L598j899n86m124J231p41Q686
$$ 174 10151 12223 7510 1448 -728 -447 2663 -1082 2281 5879 3980 3394 -730 501 -240 8446
18700H446k541p603l795n77M945J2183l175l222L406L517N21Q37j712L04N01k526
$$ 8446 5905 -1698 -5493 -6070 -1125 11058 7883 4661 8067 11584 12105 12942 11230 11534 12035 9509
18684I509m881J31p41O826P06r79q647j341K297n783k019K441q92j575j08J07
$$ 9509 4628 4759 4018 10844 11550 10571 1924 583 2880 -2903 -4922 -2481 -3373 -4948 -5056 -4949
18668d949j1516M579K867N275N891M604q36n808k506K28N20k165J270j480N00
$$ -4949 -16465 -11886 -9019 -3744 2147 6751 5915 107 -2399 -2171 -1651 -3816 -2546 -4026 -3526
18653c526k35M133J256J39n823k67L059Q49l514l863j535N452l051k028j124J0839
$$ -3526 -3761 372 1628 1767 -4056 -4323 -1264 -415 -3929 -7792 -9327 -3875 -6926 -8954 -10078 761
18637G61N342m15j500n519n367n738L678J0408K580o087k477p26j481j082J718
$$ 761 6103 5688 4188 -1331 -6698 -12436 -8758 1650 4230 -1857 -4334 -5060 -6541 -7623 -5905
18622e905N790O573K185p320o008P419O241N41o101j935K011m39j204j034p124
$$ -5905 -115 6458 8643 1323 -4685 2734 8975 9516 3415 1480 3491 3052 1848 814 -6310
18607f310M667Q390j409p051m046j6M331M647J48k622m500J251M499L297N071
$$ -6310 -1643 6747 5338 -1713 -5759 -5775 -1444 3203 3351 729 -3771 -2520 1979 5276 10347
18592A0347k118J027P824n02j185k035n844l936q68o56o005r19p452k671O960
$$ 10347 8229 9256 17080 16578 15393 13358 7514 3578 2710 2054 -3951 -4870 -12322 -14993 -8033
18577h033K498p93k891K640J270L793j804q234j132M519M626J752k609R12N811
$$ -8033 -5535 -6328 -9219 -6579 -5309 -1516 -3320 -11554 -12686 -8167 -3541 -1789 -4398 -3486 2325
18562B325O532J124m788m739k694l886N363K523L136K535n676r574j022K532N914
$$ 2325 8857 9981 5193 454 -2240 -6126 -763 1760 4896 7431 1755 -7819 -8841 -6309 -395
18547c95P40Q222J964o330q66q68K928K430k000n0j789K067O61k514l80N055N305
$$ -395 345 8567 10531 4201 3335 2467 5395 7825 5825 5775 3986 6053 6714 4200 3820 8875 14180
18530A4180m450J097J483J503o91o174j878P872n177J86n4j440l361Q4j349R40
$$ 14180 9730 10827 12310 13813 13122 6948 5070 12942 7765 7951 7897 6457 3096 3180 1831 2771
18514B771k745n793P641nm865J186J817l06Q529N213j659R11k030m915p442l4
$$ 2771 26 -5767 1874 1869 -2996 -1810 7 -299 8230 13443 11784 12695 10665 5750 -1692 -1726
18498a726q27j636K680L855K300R85O70K383J972n001j3216j567R270L176m454
$$ -1726 -2553 -4189 -1509 2346 4646 5631 6301 8684 10656 5655 -7561 -9128 142 3318 -1136
18483a136K267n99l889N562O195o509q8M161l08Q80q67K207j68m648K794l464
$$ -1136 1131 532 -3357 2205 8400 1891 1803 5964 5656 6536 5669 7876 7708 3060 5854 2390
18467B390m821j83N680j671J193j747q48J79j087M027M335R82J645Q78p341m110
$$ 2390 -2431 -2614 3066 1395 2588 841 -7 172 -915 3112 7447 8429 10074 10952 3611 -499
18451d99M398k39m310l986K52P972M549l019j717k046M342K088J490j0122p90
$$ -499 3899 3660 -650 -4636 -4384 3588 8137 5118 3401 1355 5697 7785 9275 -847 -1637
18436a637k075l149J2631J1482q116n799K455j350j996J824p69o00k041M784K255
$$ -1637 -3712 -6861 5770 17252 9136 3337 5792 4442 2446 4270 3501 2901 860 5644 7899
18421G899J967M325j754l642L408K892j635m096J0137J24r010n578K69Q28k404
$$ 7899 9866 14191 12437 8795 12203 15095 13460 9364 19501 19625 10615 5037 5306 6134 3730
18406C730M54O413R818J767j3468p761L450l63j77J46N913R089o721q692l087
$$ 3730 4184 10597 20415 22182 8714 953 4403 4040 3863 4009 9922 19011 12290 3598 511
18391E11p799P32J647R621R818l954r039k164P808j267r288P772R786m544o600
$$ 511 -7288 -6556 -4909 4712 14530 10576 1537 -627 7181 5914 -3374 4398 14184 9640 3040
18376C040j519M761N965J431k263p4o537K357J979M19m201n206Q088L067Q50j931
$$ 3040 1521 6282 12247 13678 11415 11341 4804 7161 9140 9559 5358 152 8240 11307 12157 10226
18360A0226M12L796j3493m443K244k670j989j057J074P663K155m134l337J504
$$ 10226 10638 14434 941 -3502 -1258 -3928 -5917 -6974 -5900 1763 3918 -216 -3553 -2049
18346b049J988J369k376k586k807q02N636Q16l612n265l808K043P227l195j050
$$ -2049 -61 1308 -1068 -3654 -6461 -7263 -1627 -811 -4423 -9688 -13496 -11453 -4226 -7421 -8471
18331h471Q755L676k491p535k260M820J0607M649r29L185O162n778k134o917r36
$$ -8471 284 3960 1469 -6066 -8326 -3506 7101 11750 10821 14006 20168 14390 12256 5339 4403
18316D403k673N743l801l357l812m68J182k42l17p939L307N306P162r03j1384
$$ 4403 1730 7473 3672 315 -3497 -3965 -2783 -3025 -3342 -11281 -7974 -2668 4494 3591 -7793
18301g793p53M541J843K18j159k223L120J0406j065o046j386j719O097M345m269
$$ -7793 -8546 -4005 -2162 -1944 -3103 -5326 -2206 8200 7135 1089 -297 -2016 4081 8426 4157
18286D157l425P960L59q079K489M091R087K172N48L007j441j1249r065O923J1757
$$ 4157 732 8692 9051 972 3461 7552 16639 18811 19359 22366 20925 9676 611 7534 19291
18271A9291N714n743m42k200K282K63P714P75n648n695j700L162O843K208N37
$$ 19291 25005 19262 18820 16620 18902 19165 26879 27654 22006 16311 14611 17773 24616 26824 27361
18256B7361L132l008r85J296K775m211J832P027m161m37K04p121p7k687q720Q16
$$ 27361 30493 27485 26500 27796 30571 26360 28192 35219 31058 30621 30825 23704 23627 20940 12220 13036
18240A3036N10j026N024N625K038j897j644j44o95l078k338l73P27m100N098L761
$$ 13036 13546 12520 17544 23169 25207 23310 21666 21522 20827 17749 15411 15038 15765 11665 16763 20524
18224B0524o417K727O411o901j639M681J971J2787Q627m923j963m25k188r160
$$ 20524 14107 16834 23245 16344 14705 19386 21357 34144 42771 37848 35885 35460 33272 24112
18210B4112k908j527J035k412p37j88M421K809m529j691q51L024R20k807L921
$$ 24112 21204 19677 20712 18300 17563 17375 21796 24605 20076 18385 17534 20558 21478 18671 22592
18195B2592j514m873j055K492M250L566j685L888K434M229R246J2499j547n486
$$ 22592 21078 16205 15150 17642 21892 25458 23773 27661 30095 34324 43570 56069 54522 49036
18181D9036m640o53m995n543m979J543K197J472k588n26l822K684k44N9K245K629
$$ 49036 44396 43743 38748 33205 28226 29769 31966 33438 30850 30324 26502 29186 28942 29001 31246 33875
18165C3875L14M648o119k574L532L281J453k276j718M881J05m911n9M342J864
$$ 33875 34189 38837 32718 30144 33676 36957 38410 36134 34416 39297 39402 34491 34432 38774 40638
18150D0638L713L653J916k834K526N096K692q62j739r68k640M609M475K367J824
$$ 40638 44351 48004 49920 47086 49612 54708 57400 56538 54799 53831 51191 55800 60275 62642 64466
18135F4466K192J2815J0395N191Q511J5712J2213J2292K0646L1132L5488M9344
$$ 64466 66658 79473 89868 95059 103570 119282 131495 143787 164433 195565 231053 280397
18123B80397O8640Q8302R1058J04609J20458J36283J69778K04420K46341L49992
$$ 280397 349037 437339 528397 633006 753464 889747 1059525 1263945 1510286 1860278
18113A860278N83531R24709J069947Q20780P09583J274807K689982L573663j015827
$$ 1860278 2443809 3368518 4438465 5259245 5968828 7243635 9933617 13507280 12491453
18104A2491453m783157l542188j760198q60385m72730k78216j84091j35928r2263
$$ 12491453 7708296 4166108 2405910 1545525 1072795 794579 610488 474560 382297
18095C82297o3431m6385l1417j7851j0225j0917j5557j6012l130m323j1752o751
$$ 382297 318866 272481 241064 223213 212988 202071 186514 170502 167372 163049 151297 144546
18083A44546j3527j2323k602k846p985p143o54J636l089J597l230n401j051R15
$$ 144546 131019 118696 116094 113248 105263 98120 97466 99102 96013 97610 94380 88979 87928 88843
18069H8843n50L955l194n791k467l655n813l169M135K938k144l582k654l899n987
$$ 88843 88293 92248 89054 83263 80796 77141 71328 68159 72294 75232 73088 69506 66852 62953 56966
18054E6966M025J0251l641j0197m348L797Q29K296j726k539k015o41N449J069
$$ 56966 60991 71242 67601 57404 53056 56853 57682 59978 58252 55713 53698 53057 58506 59575
18040E9575P48r171l560K223O5l258M15j443J352j515j283k99j776j281n834N176
$$ 59575 60323 51152 47592 49815 49880 46622 47037 45594 46946 45431 44148 43849 42073 40792 34958 40134
18024D0134M403J841k915N112P027j072n496n651k909j884J904q005Nk215R22
$$ 40134 44537 46378 43463 48575 55602 54530 49034 43383 40474 38590 40494 32489 32494 30279 31201
18009C1201K942R189m186M521J70n799n289L335K299P154k490l689M638K605L265
$$ 31201 34143 43332 39146 43667 43837 38038 32749 36084 38383 45537 43047 39358 43996 46601 49866
17994D9866M654k522m074l003N48l91N470J396k56l054j318P866R12n359o086
$$ 49866 54520 51998 47924 44921 45469 45078 50548 51944 51688 48634 47316 55182 56094 50735 44649
17979D4649N33O175m406Q08O785J622n35o280m461l669o867n078N833q06P41L092
$$ 44649 45182 51357 46951 47759 54544 56166 55631 49351 44890 41221 34354 29276 35109 34303 35044 38136
17963C8136k2o86Q508J0745M094l440m637q433q415M972J112l891L316M459k362
$$ 38136 38114 37428 45936 56681 60775 57335 52698 44265 35850 40822 41934 38043 41359 45818 43456
17948D3456N913N04r358m997j046M335M520n921n49K925L192l586M128M397n185
$$ 43456 49369 49873 40515 35518 34472 38807 43327 37406 36857 39782 42974 39388 43516 47913 42728
17933D2728m648p240j525O068N270N71j223O166j497J939J225j313L506n060J426
$$ 42728 38080 30840 29315 35383 40653 41224 40001 46167 44670 46609 47834 46521 50027 44967 46393
17918D6393J3378j939l269K701j982r462j2591J889K421R92m555O778J818K68
$$ 46393 59771 57832 54563 57264 55282 45820 33229 35118 37539 38531 33976 40754 42572 42840
17904D2840j042K591n791l586L040K776N476k747Lk757k946L055J9148J2043M592
$$ 42840 41798 44389 38598 35012 38052 40828 46304 43557 43560 40803 37857 40912 60060 72103 76695
17889G6695J6394K1096K5714K4424K5494L5814M8842N6918J8374k0020j5209l4313
$$ 76695 93089 114185 139899 164323 189817 225631 274473 331391 349765 329745 314536 280223
17877B80223p6264o5377l8705j7631j3872m179j871Km851k540L717J431n410n826
$$ 280223 203959 138582 99877 82246 68374 64195 62324 62326 57475 54935 58652 60083 54673 48847
17863D8847k517L32k573M020l568O004J013n224k988m233P509O277r705J384L48
$$ 48847 46330 46662 44089 48109 44541 50545 51558 46334 43346 39113 46622 52899 43194 44578 44926
17848D4926m22j260J594m44M089q99n933M495R355J4230R413J1911J3238J2043
$$ 44926 44504 43244 44838 44394 48483 47584 41651 46146 55501 69731 79144 91055 104293 116336
17834A16336J6752K0618K9480L8077M8014N8184N8183r73j9554j1254o9404q2513
$$ 116336 133088 153706 183186 221263 269277 327461 385644 384671 365117 353863 284459 201946
17822B01946o0176l4624j5352j4859j7438p423n032r317j0379o54R868Q986R37
$$ 201946 141770 107146 91794 76935 59497 52074 47042 37725 27346 26692 36560 45546 46483
17809D6483k36k562J178p14O497k727m418N095K308r463m093R836o60n722J45
$$ 46483 46247 43685 44863 44149 50646 47919 43501 48596 50904 41441 37348 47184 46524 40802 40947
17794D0947M803M988M190j484l359r75Q572M771m799p754M020M193M320K535Q294
$$ 40947 45750 50738 54928 53444 50085 49110 57682 62453 57654 49900 53920 58113 62433 64968 73262
17779G3262R581M35J2240K1801J7566R292N523M024l615j2879p613j3663n864
$$ 73262 82843 83278 95518 117319 134885 144177 149700 153724 150109 137230 129617 115954 110090
17766A10090N535J1105J2547J4094J4519J6340K7787K8367J6778M921R470L791
$$ 110090 115625 126730 139277 153371 167890 184230 212017 240384 257162 262083 271553 275344
17754B75344l06R456K7139L2305M6154O2959Q4841J04260J31854J58267J89767
$$ 275344 275038 284494 311633 343938 390092 453051 537892 642152 774006 932273 1122040
17743A122040K26004K80294K99125K57589J82633M1356n1423k4690o0552j23441
$$ 1122040 1348044 1628338 1927463 2185052 2367685 2409041 2357618 2332928 2272376 2148935
17733B148935j35190j23290q5087J9568Q8158J6956j26968k18279j59921m0847
$$ 2148935 2013745 1890455 1805368 1824936 1913094 1930050 1803082 1584803 1424882 1384035
17723A384035J5720k7062j25452k25085k49772j98754j38879q6659n7757m1175
$$ 1384035 1399755 1372693 1247241 1022156 772384 573630 434751 348092 290335 249160
17713B49160k4953k3124q716k78k016r092p335J506M210L832Q674P712O190O509
$$ 249160 224207 201083 192367 192089 190073 180981 173646 175152 179362 183194 191868 199580 205770 212279
17699B12279J7902K8382J4481J399R818K0454L6167N7604Q6803J02163J04098
$$ 212279 230181 258563 273044 274443 284261 304715 340882 398486 485289 587452 691550
17688F91550J21141J56647K16753K18299O2441l9537j44668l10176k89909j73059
$$ 691550 812691 969338 1186091 1404390 1466831 1427294 1282626 972450 682541 509482
17678E09482r1181m6007j7914k616N481J6304J6020Q668J193n006j2208j2660
$$ 509482 418301 372294 354380 351764 357245 373549 389569 398237 399430 394424 382216 369556
17666C69556j6916j7925j1382m474n949R199J2230J2713J5544M583k537l849j3808
$$ 369556 352640 334715 323333 318859 312910 322109 334339 347052 362596 367179 364642 360793 346985
17653C46985j7512j7050k8338l5083k2101j5943r021n973p23J3157R648k0106
$$ 346985 329473 312423 284085 249002 226901 210958 201937 195964 195241 208398 218046 197940
17641A97940l0244k1776j3394j185L663P446M110J274J75J2977J8254O031J0786
$$ 197940 167696 145920 132526 131341 135004 142450 146560 147834 148009 160986 179240 185271 196057
17628A96057K7465J3574j6576k2037j6964j1308q802q402m008O117J1634N649
$$ 196057 223522 237096 220520 198483 181519 170211 161409 153007 148999 155116 166750 172399
17616A72399O429J4961J7394J6284L0883L8473M3333N0347N0859P4408R0970O6530
$$ 172399 178828 193789 211183 227467 258350 296823 340156 390503 441362 515770 606740 673270
17604F73270M8010K5027L26K4268O7939J26333J27709N3555J6520r4548j87922
$$ 673270 721280 746307 746633 770901 838840 965173 1092882 1146437 1162957 1068409 880487
17593H80487j23228l1861L1439Q0717O8316M9697J7062N851N8388J43844K22475
$$ 880487 757259 725398 756837 837554 905870 955567 972629 978480 1036868 1180712 1403187
17582A403187J29054o6819j36188k40973k50412j54427j09439r4717o2579n6954
$$ 1403187 1532241 1465422 1329234 1088261 837849 683422 573983 479266 416687 359733
17572C59733l3862n956m954l136n307R084K0390K7865L3067N1183O6776N9170
$$ 359733 325871 319915 314961 311825 306518 315602 335992 363857 396924 448107 514883 574053
17560E74053K8429J1369Q154j1784k5709j5263l9883o7173n4363l1007n659J1525
$$ 574053 602482 613851 622005 610221 584512 569249 529366 462193 407830 376823 371164 382689
17548C82689K4342L2619M1463M4875N6076M8428J6503k357j7080n1531o0675l1027
$$ 382689 407031 439650 481113 525988 582064 630492 646995 644638 627558 576027 515352 484325
17536D84325m327K8165N3103O3508O8124Q4748J36990J87063O3478j69160k23439
$$ 484325 479998 508163 561266 624774 692898 777646 914636 1101699 1165177 996017 772578
17525G72578j39755n3969Q43J5040m4458o0294k6654R172K1729M1301O6611J08512
$$ 772578 632823 578854 579697 594737 550279 489985 463331 472503 494232 535533 602144 710656
17513G10656J22587Q323j33849j42555p6459j0215L1127r316q1884q7324o4478
$$ 710656 833243 841566 707717 565162 488703 478488 509615 500299 418415 331091 266613
17502B66613k8886r242q983k073N467J8711J1814J8883J2502j1702j5940j2255
$$ 266613 237727 228485 219502 217429 222896 241607 253421 272304 284806 273104 257164 244909
17490B44909l5039k2198j0905o1O490J7470J1722J5379L0832L8298M5320L4475
$$ 244909 209870 187672 176767 176706 183196 200666 212388 227767 258599 296897 342217 376692
17478C76692L1087O2259J09229J03111l6832j46393j23760o6399l5161j5005J639
$$ 376692 407779 470038 579267 682378 645546 499153 375393 308994 273833 258828 260467
17467B60467N374K2333K6255K4568K7019L2590N2267Q0124O8782m9190j09891
$$ 260467 265841 288174 314429 338997 366016 398606 450873 530997 599779 550589 440698
17456D40698p5584m3053k4166j4501j208L439j4048j5442O10R116J670k456L555
$$ 440698 365114 322061 297895 283394 282186 285625 271577 256135 256745 265861 267531 265075 268630
17443B68630J2947J9314J9954K0573J7743k1035k9884k7801j8137l456M725J791
$$ 268630 281577 300891 320845 341418 359161 338126 308242 280441 262304 258848 263573 265364
17431B65364j515N980Q455K1056K2219K2585K9026L1570M2433N4742N5831O3542
$$ 265364 263849 269829 278284 299340 321559 344144 373170 404740 447173 501915 557746 621288
17419F21288O8411M7362N2727M2737k7089l9455J075J048j9768R309J6165k5652
$$ 621288 689699 737061 789788 832525 805436 765981 767056 768104 748336 757645 773810 748158
17407G48158j4487J1953M1136O4584R1130J07756J07875J23299J36223Q7530P5361
$$ 748158 733671 745624 786760 851344 942474 1050230 1158105 1281404 1417627 1505157 1580518
17396A580518Q5385M9807M1308J36503K39582K93279L39442M35194N67361O90598
$$ 1580518 1665903 1715710 1757018 1893521 2133103 2426382 2765824 3201018 3768379 4458977
17386D458977Q13181R19423J129109J513713K177378L149390L814341L877957
$$ 4458977 5272158 6191581 7320690 8834403 11011781 14161171 17975512 21853469
17378B1853469M576403O407499R245898R950957O772l875025l85006q447950j3816336
$$ 21853469 26429872 32837371 42083269 52034226 52040998 48165973 47780967 39333017 25516681
17369B5516681r497510m846115k393517j217123n38536k77648m29742n29125m24407
$$ 25516681 16019171 11173056 8779539 7562416 7023880 6746232 6316490 5787365 5362958
17360E362958j68773J00324K52847M35963N46665J77350j85708n2032J60742K8872
$$ 5362958 5194185 5294509 5547356 5983319 6529984 6707334 6521626 6469594 6630336 6659208
17350F659208k45404m88009p67076p33483n11806l94278k61848j29671j25211
$$ 6659208 6413804 5925795 5158719 4425236 3913430 3519152 3257304 3127633 3002422
17341C002422j16782J8770J94802L63389M61552N12753O55799P91405Q97726J075219
$$ 3002422 2885640 2904410 3099212 3462601 3924153 4436906 5092705 5884110 6781836 7857055
17331G857055J297683J684713K356267L450650M700777N210618N573549P261968
$$ 7857055 9154738 10839451 13195718 16646368 21347145 26557763 32131312 39393280
17323C9393280J0239506J3892702Q870780m339702k499056l727179j7365604j7515523
$$ 39393280 49632786 63525488 72396268 68056566 65557510 61830331 44464727 26949204
17315B6949204j0460282n433060l035443j864656j180548p78342n44345m06885
$$ 26949204 16488922 11055862 8020419 6155763 4975215 4196873 3652528 3245643
17307C245643l37385k30116k20916k71246k10402j34517o9225n2525n6940j3440
$$ 3245643 2908258 2678142 2457226 2185980 1975578 1841061 1771836 1719311 1662371 1648931
17297A648931o454l9586j6570n1378j09119j08676j09913j03266p7845m7049k4916
$$ 1648931 1642477 1602891 1586321 1534943 1425824 1317148 1207235 1103969 1026124 979075 954159
17286I54159J848M9926Q6605L0922m758N855l8185m3547M0738N1781j38011k28629
$$ 954159 956007 1005933 1092538 1123460 1118702 1124557 1086372 1042825 1083563 1135344 997333 768704
17274G68704j68731q9592o4957n0542k6526r120j2493p483O41q832j1863j1432
$$ 768704 599973 510381 445424 394882 368356 359236 346743 339260 339901 331069 319206 307774
17262C07774o544J290L590l318N540O807J4875P994J0684K6599J2497j7405k6389
$$ 307774 301230 302520 306110 302792 308332 315139 330014 338008 348692 375291 387788 370383 343994
17249C43994k1186j6709j0356o873N660R077K129m095j531N766J2758J6779Q553
$$ 343994 322808 306099 295743 288870 294530 303607 305736 301641 300110 305876 318634 335413 343966
17236C43966n871k4552l4088j9273p941p291q898j342K786L743j6368j8669q109
$$ 343966 338095 313543 279455 260182 252241 244950 236052 234710 237496 241239 224871 206202 198093
17223A98093j637K290J0355R618P720L241L775N193j513j1091j4123p833K457
$$ 198093 196456 198746 209101 218719 226439 229680 233455 238648 237135 226044 211921 204088 206545
17210B06545o702j5259p570L519P741P362O772O270R281k188k45m249p247J291
$$ 206545 199843 184584 177014 180533 188274 195636 202408 208678 217959 215771 215526 211277 204030 205321
17196B05321K66j341J72k989m874N565p260l250O977P804P177P763L129k285K655
$$ 205321 205587 204246 204418 201429 196555 202120 194860 191610 198587 206391 213568 221331 224460 222175 224830
17181B24830k514r357q728O330j281j4471r081K333P755Q368K335Q643N387J456
$$ 224830 222316 212959 204231 210561 209280 194809 185728 188061 195816 204184 206519 215162 220549 222005
17167B22005J7405J9183N205N763R580M627k241j3067j2824L161k483m620p910
$$ 222005 239410 258593 263798 269561 279141 283768 281527 268460 255636 258797 256314 251694 243784
17154B43784K655J2650J2464J3193N225m881N238J1662J5495O517N771N110O607
$$ 243784 246439 259089 271553 284746 289971 285090 290328 301990 317485 324002 329773 334883 341490
17141C41490L853Q037J3363J3736J5300R612J3125J0000J4806J7119K1035K3544
$$ 341490 345343 353380 366743 380479 395779 405391 418516 428516 443322 460441 481476 505020
17129E05020L3872M1312L9653M1818N5157P4202P1299Q4069J01288J21330J51210
$$ 505020 538892 580204 619857 661675 716832 791034 862333 946402 1047690 1169020 1320230
17118A320230J60850J67057K30231K90618K51204K56684L15017L92234N04200
$$ 1320230 1481080 1648137 1878368 2168986 2420190 2676874 2991891 3384125 3888325
17109C888325O26884P25709Q48085J030389J327461J852968K636904L162722L377398
$$ 3888325 4515209 5240918 6089003 7119392 8446853 10299821 12936725 16099447 19476845
17100A9476845M293948N780662P592588P857483J458305K0589K196780o694525
$$ 19476845 23770793 29551455 37144043 45001526 46459831 46480420 48677200 41982675
17092D1982675j1656510p520638k954486q2291K085260M129348N270907N465636
$$ 41982675 30326165 22805527 19851041 19768750 21854010 25983358 31254265 36719901
17084C6719901O848370R923088J4494495J3318901l258285q083075m848551j4650266
$$ 36719901 43568271 53491359 67985854 81304755 78046470 69963395 65114844 50464578
17076E0464578j8118550j1962753o330884l379843k050451j276534o52277k05936
$$ 50464578 32346028 20383275 14052391 10672548 8622097 7345563 6693286 6487350
17068F487350J13652K41185L13012N17874P18184Q73777J149899J770220K807693
$$ 6487350 6601002 6842187 7155199 7673073 8391257 9265034 10414933 12185153 14992846
17059A4992846M043278M795882M131892L496120N461625J0683857J4404520k09106
$$ 14992846 19036124 23832006 27963898 31460018 36921643 47605500 62010020 61800914
17051F1800914j8253106j6648660r216458m510480k321100j128742j94509O55409
$$ 61800914 43547808 26899148 17682690 13172210 10851110 9722368 9527859 10183268
17043A0183268J481662J892875J609758J529735K761337N548404P013584j413136
$$ 10183268 11664930 13557805 15167563 16697298 19458635 25007039 32020623 30607487
17035C0607487r765665q244620m513375k305303j300706q07931n52995m01037
$$ 30607487 20841822 12597202 8083827 5778524 4477818 3669887 3116892 2715855
17027B715855k85321k41111j72302o4379M4918R7127M6569j2402k0767J9276N8913
$$ 2715855 2430534 2189423 2017121 1952742 1997660 2094787 2141356 2128954 2108187 2127463 2186376
17016B186376J23200K10851K57990K72318L72132M99402N94236P32715R86687
$$ 2186376 2309576 2520427 2778417 3050735 3422867 3922269 4516505 5249220 6235907
17007F235907J451388K216564K966567L065129K490960K736888M831033Q638106
$$ 6235907 7687295 9903859 12870426 15935555 18426515 21163403 25994436 34632542
16999C4632542P244425o626932j2493113q420128m156507j996931r24970j96166
$$ 34632542 41876967 35250035 22756922 14336794 10180287 8183356 7258386 7062220
16991G062220M55657J149783J744867J820934J476518J792310L457003O177864
$$ 7062220 7517877 8667660 10412527 12233461 13709979 15502289 18959292 25137156
16983B5137156M293519n856845q998623n877296l025851j642751r85227n99570
$$ 25137156 29430675 23573830 14575207 8697911 5672060 4029309 3044082 2444512
16975B444512l77643k76393k37792j95185j25543n8709j5094L480l6071o7367
$$ 2444512 2066869 1790476 1552684 1357499 1231956 1173247 1158153 1161633 1125562 1058195
16965A058195q9191j16317r8106p2584m9572l0055k7901j9946j4121j1004l24
$$ 1058195 969004 852687 754581 681997 632425 602370 574469 554523 540402 529398 529074
16954E29074J1869J9060J256m0718n9459m2158k7354k7867k2973j4078p968l535
$$ 529074 540943 560003 561259 520541 461082 418924 391570 363703 340730 326652 318684 315149
16942C15149l894q107l991L818K395j1791j6137j0892q000m076m194m518R232
$$ 315149 311255 303148 299157 302975 305370 293579 277442 266550 258550 254474 250280 245762 254994
16929B54994k473r296j289J0883J1408j0216m852j214k1176p739o056q658m527
$$ 254994 252521 243225 241936 252819 264227 254011 249159 247945 226769 219030 212974 204316 199789
16916A99789o436r241k8r81J98k713j125L623p682j5288n607L157n700P46K442
$$ 199789 193353 184112 184084 183103 183301 180588 179463 183086 175404 160116 154509 157666 151966 152712 155154
16901A55154k221N83j05J588L222q32o581K746L567l319j015N11k887N320O54
$$ 155154 152933 153516 153411 154999 158221 157389 150808 153554 157121 153802 152787 153298 150411 155731 156385
16886A56385k616q36k064L108o40M282o162q302L39Q984J519N70P24L495O558
$$ 156385 153769 152933 150869 153977 153337 157619 151457 143155 143494 152478 153997 154567 155291 158786 165344
16871A65344J050m217o934L712Q785R630J1047J2482J4016J8656K5509K4759L6179
$$ 165344 166394 162177 155243 158955 167740 177370 188417 200899 214915 233571 259080 283839 320018
16858C20018L6138N7622P9036N5810p409l7271k9128o7878r0454o6382l9916k2978
$$ 320018 356156 413778 492814 548624 541215 503944 474816 406938 316484 250102 210186 187208
16846A87208j5197n018M2r994j4609j0618n761o850r953j825K308N049J0943M715
$$ 187208 172011 166993 167035 157041 142432 131814 126053 119203 109250 107425 109733 114782 125725 130440
16832A30440Q793J510o251K536J0230r534p061p009k948o766k996k300l729l268
$$ 130440 139233 140743 134492 137028 147258 137724 130663 123654 120706 113940 110944 108644 104915 101647
16818A01647P203J1561M363P31P43L211P251l590j341J2391O328J2813K0558K1461
$$ 101647 108850 120411 124774 125505 126248 129459 136710 133120 131779 144170 150498 163311 183869 205330
16804B05330K6175L1870M5570K6058j5737n994j1613n4599o3298l7606k2802j2195
$$ 205330 231505 263375 308945 335003 319266 313272 301659 247060 183762 146156 123354 111159
16792A11159n115o957j0442p280j608l32l662k973Q948K282k398o296p117J454
$$ 111159 106044 99087 88645 81365 79757 79425 75763 72790 81738 84020 81622 75326 68209 69663
16778F9663K905L7k142l112R19p666k401p283L759O875J042N946o999k133m673
$$ 69663 72568 72605 70463 67351 68270 60604 58203 50920 54679 61554 62596 68542 61543 59410 54737
16763E4737m040QK432J598o154j082K181k708p26o372m224O101O804M126M991
$$ 54737 50697 50705 53137 54735 48581 47499 49680 46972 46246 39874 35650 41751 48555 52681 57672
16748E7672J139p15o025L329K627k809p269n704N235N189k110Q54k357o35l546
$$ 57672 58811 58096 52071 55400 58027 55218 47949 42245 47480 52669 50559 51413 49056 48421 44875
16733D4875n622N784M403j432l380j317K746j286K129l35l395o45P9n361l048
$$ 44875 39253 45037 49440 48008 44628 43311 46057 44771 46900 46565 43170 42525 42604 37243 34195
16718C4195P262N398L076l958L139n066M160j302n148n816l721k196l118L60N243
$$ 34195 41457 46855 49931 45973 49112 44046 48206 46904 41756 35940 32219 30023 26905 27265 32508
16703C2508o99O51O82m946k630J671J2556J672l567J590J349j441j3149j442N244
$$ 32508 31809 32460 33142 28196 25566 27237 39793 41465 37898 39488 40837 39396 26247 24805 30049
16688C0049M618l972k256j378m52j986k593k97M895O751L643L232k670l507k357
$$ 30049 34667 30695 28439 27061 26609 24623 22030 21733 26628 33379 37022 40254 37584 34077 31720
16673C1720J825l379m850J199J983m645K010n851o359N425K641j331O319Q463
$$ 31720 33545 30166 25316 26515 28498 23853 25863 20012 13653 19078 21719 20388 26707 35170
16659C5170j819o784l521p470o844j709K536Q97J274Q151m113n212m984k070O366
$$ 35170 33351 26567 23046 15576 8732 7023 9559 10456 11730 19881 15768 10556 5572 3502 9868
16644I868N360k354K257M863O156K40j79r071o540K349J399k421q35J892K496
$$ 9868 15228 12874 15131 19994 26150 26390 26211 17140 10600 12949 14348 11927 11092 12984 15480
16629A5480o46l86k10L739j189k219n004J303K178L699P00j0151o829P271J0262
$$ 15480 14834 14448 14238 17977 16788 14569 9565 10868 13046 16745 17445 7294 465 7736 17998
16614A7998L963o928K949l839K647R235J148q232o856j609R735P026m864n212
$$ 17998 21961 15033 17982 14143 16790 26025 27173 18941 12085 10476 20211 27237 22373 17161
16600A7161K534O077J639l598K750J1261q67j914M773P273Q433R272N574J6949
$$ 17161 19695 25772 27411 23813 26563 37824 36957 35043 39816 47089 55522 64794 70368 87317
16586H7317J9773K7047L3465L6903L4366M7649O8149M8459m197m3966r6700q1066
$$ 87317 107090 134137 167602 204505 238871 286520 354669 403128 398931 354965 258265 177199
16574A77199l7218k0364p883l706J0890J8927K8341K5338L4103M3251O2479L2999
$$ 177199 139981 119617 111734 108028 118918 137845 166186 191524 225627 268878 331357 364356
16562C64356j5067n5671q8703p7969m2087j8222j3588j1931l543m759p540m040
$$ 364356 349289 293618 204915 126946 84859 66637 53049 41118 37575 32816 25276 21236
16550B1236Q087R111j067k172Q7Q803L341L467N560O339Q272J6603J5402J3814
$$ 21236 29323 38434 37367 35195 35282 44085 47426 50893 56453 62792 71064 87667 103069 116883
16536A16883J7086K6777M7946L5187l7196o6077l2359k4073q481j163n95N353
$$ 116883 133969 160746 208692 243879 206683 140606 108247 84174 75693 74530 73935 79288
16524G9288Q015J4385J3125M490J6071K8844L2004K7102l5346o7255l9815k1281
$$ 79288 87303 101688 114813 119303 135374 164218 196222 223324 187978 120723 80908 59627
16512E9627j7375j0516m390o449l441L767J339j147k044j192L446J275j137k342
$$ 59627 42252 31736 27346 20897 17456 21223 22562 21415 19371 18179 21625 22900 21763 19421
16498A9421K841n701j1166Q81Q902N534J4224M115k715L08K371l60Q92J7646K3608
$$ 19421 22262 16561 5395 6276 15178 20712 34936 39051 36336 36644 39015 38655 39547 57193 80801
16483H0801J3489R595K0339M0870M7046p743n8662n2734k7970o523j721M246O493
$$ 80801 94290 103885 124224 165094 212140 204397 145735 93001 65031 58508 56787 61033 67526
16470F7526K402Q450J1072O192J5173K3322L1118L4026q254n3599n3823l0624
$$ 67526 69928 78378 89450 95642 110815 134137 165255 199281 191027 137428 83605 52981
16458E2981j1336n458l474k883m405j473J123r999p264l216N208o640m501l525
$$ 52981 41645 36187 32713 29830 25425 23952 25075 15076 7812 4596 9804 3164 -1337 -4862
16444d862K474J077K831L223m249o022J83J091M266l075M367L392o01O12r50J755
$$ -4862 -2388 -1311 1520 4743 494 -5528 -5345 -4254 12 -3063 1304 4696 4095 4707 3757 5512
16428E512K293k733Q95o241j986M16j494J007q081n292Q672k211M082M410r10
$$ 5512 7805 5072 5967 -274 -2260 -1844 -3338 -2331 -10412 -15704 -7032 -9243 -5161 -751 -1661
16413a661L524J589M635m092p016l781J230Q237j319K857j67k705m6L757r45l723
$$ -1661 1863 3452 8087 3995 -3021 -6802 -5572 2665 1346 4203 4036 1331 1285 5042 4097 374
16397C74N224L923n217r467J545J482k2M251k026k615N37m28K500L565K298J190
$$ 374 5598 9521 4304 -5163 -3618 -2136 -2158 2093 67 -2548 -2011 -2439 61 3626 5924 7114
16381G114r809K055K076n667N122L774n626k234K705L86m780o587J700M212K947
$$ 7114 -2695 -640 1436 -4231 891 4665 -961 -3195 -490 -104 -4884 -11471 -9771 -5559 -2612
16366b612l045M264L316k236p124k729l21K977O109L155k08K361q096j951M74
$$ -2612 -5657 -1393 1923 -313 -7437 -10166 -10487 -7510 -1401 1754 1546 3907 -4189 -6140 -5666
16351e666j174M656L102l442R68L175j913j442L357l735l250J365O08J280j248
$$ -5666 -6840 -2184 918 -2524 -1556 1619 -294 -1736 1621 -2114 -5364 -3999 -3391 -2111 -3359
16336c359K314j567l224O054k48j620K233O686L459O319M278j550o099o002K900
$$ -3359 -1045 -2612 -5836 218 -30 -1650 583 7269 10728 17047 21325 19775 13676 7674 10574
16321A0574P621K503p226j0265M217Q721J561l562l138n283m398N152K668j729
$$ 10574 18195 20698 13472 3207 7424 16145 17706 14144 11006 5723 1325 6477 9145 7416
16307G416k498n795N984P494K339l941n279m694l029J204J706L606O167K732o938
$$ 7416 4918 -877 5107 12601 14940 10999 5720 1026 -2003 -799 907 4513 10680 13412 6474
16292F474L634M963n089p793J174k134n206j356K839M417L791j0024o819k622
$$ 6474 10108 15071 9982 2189 3363 1229 -3977 -5333 -2494 1923 5714 -4310 -11129 -13751
16278a3751j189R243Q336M476j677K804L849p59o1k555k107K860L22J86q073n723
$$ -13751 -14940 -5697 2639 7115 5438 8242 12091 11332 11271 8716 6609 9469 9791 9977 1904 -3819
16262c819m088K589J08k264j468L082k525m349N126L334K480K946m3l865m352
$$ -3819 -7907 -5318 -5210 -7474 -8942 -5860 -8385 -12734 -7608 -4274 -1794 1152 1109 -2756 -7108
16247g108L082j821j250P581J0551J448l1Q31p265k882M165k65l725m027J900
$$ -7108 -4026 -5847 -7097 484 11035 12483 12452 13283 6018 3136 7301 7036 3311 -716 1184
16232A184k094j349N234N582n542l810L428K264K55l67l902j403R960O729p198
$$ 1184 -910 -2259 2975 8557 3015 -795 2633 4897 5152 4785 883 -520 9440 16169 8971
16217H971j4638k445K885K979l735j535N419P021o43q324j445M786L156J482k333
$$ 8971 -5667 -8112 -5227 -2248 -5983 -7518 -2099 4922 4279 -4045 -5490 -704 2452 3934 1601
16202A601p73k551L176K617J25j212M156J496K55L778R40J844l043q670o303p328
$$ 1601 828 -1723 1453 4070 4195 2983 7139 8635 8890 12668 13608 15452 12409 3739 -2564 -9892
16186i892m513k224K701K092K253L632M181J453m751L764K821o306o84m380N07
$$ -9892 -14405 -16629 -13928 -11836 -9583 -5951 -1770 -317 -5068 -1304 1517 -4789 -5473 -9853 -9346
16171i346n370p808M182O466l566L819l471Q72J377K527L460J0231O360K53o763
$$ -9346 -14716 -22524 -18342 -11876 -15442 -11623 -15094 -14222 -12845 -10318 -6858 3373 9733 9986 3223
16156C223n808K96J089J657J635K002r678k407Q516M050k486N656l349o645l730
$$ 3223 -2585 -2289 -1200 457 2092 4094 -5584 -7991 525 4575 2089 7745 4396 -2249 -5979
16141e979J13L460j559k171p13k223o843M181J2138M657k541n863L178K618n040
$$ -5979 -5866 -2406 -3965 -6136 -6849 -9072 -15915 -11734 404 5061 2520 -3343 -165 2453 -2587
16126b587R55N583m94q600j1441P699R982n243j244O920Q47o256Q34M776N934
$$ -2587 -1632 3951 3457 -5143 -16584 -8885 1097 -4146 -5390 1530 2377 -3879 -3045 1731 7665
16111G665J555l047j841m863R11J168N52O187J191p36l499j304J525j821m291
$$ 7665 9220 6173 4332 -531 380 1548 2100 8287 9478 8742 5243 3939 5464 3643 -648
16096f48j3430M564J0394J239P46K118n427k261l759l920l4J884l71k527K282
$$ -648 -14078 -9514 880 2119 2865 4983 -444 -2705 -6464 -10384 -10418 -8534 -8905 -11432 -9150
16081i150N515j121l684L456M275l345j531j930l291o21K92L330K511K241l128
$$ -9150 -3635 -4756 -8440 -4984 -709 -4054 -5585 -7515 -10806 -11427 -11135 -7805 -5294 -3053 -6181
16066f181K802J512m669P00L096O428N128o734j207O112O15Q57N801K995K814
$$ -6181 -3379 -1867 -6536 -5836 -2740 3688 8816 2082 875 6987 7602 8459 14260 17255 20069
16051B0069K079M598J0184J4762J2614P520J3058Q752M189P331O336j0244j6419
$$ 20069 22148 26746 36930 51692 64306 71826 84884 93636 97825 105156 111492 101248 84829
16038H4829p866j1207j2639j3824j8717j5601p641k724K710O572K260j1443n791
$$ 84829 76963 65756 53117 39293 20576 4975 -2666 -5390 -2680 3892 6152 -5291 -11082
16025a1082K473K739k55P79N619L102j1189P43J460j326O718p396r621K450N937
$$ -11082 -8609 -5870 -6125 -5346 273 3375 -7814 -7071 -5611 -6937 -219 -7615 -17236 -14786 -8849
16010h849R728K174k539l488l399Q399M469N723r99o270r980L135N260n82N48
$$ -8849 879 3053 514 -2974 -6373 2026 6495 12218 11219 4949 -5031 -1896 3364 2782 3330
15995C330K207J079L78j681M064J550K943M71l775j221k30J324K472L392j587
$$ 3330 5537 6616 6994 5313 9377 10927 13870 14341 10566 9345 9115 10439 12911 16303 14716
15980A4716o352R70J813m951M738k067l696r113k72O046J504J48l918o357k808
$$ 14716 8364 9334 11147 6196 10934 8867 5171 -3942 -4214 1832 3336 3484 -434 -6791 -9599
15965i599R160R102O199K642p669j2909k869n93n406K984K062N786P139P31p311
$$ -9599 -439 8663 14862 17504 9835 -3074 -5943 -6536 -11942 -8958 -6896 -1110 6029 6760 -551
15950e51j791M428Q759P669k177o065m143k410m021j043O41O48L397j555K04R96
$$ -551 -2342 2086 10845 18514 16337 10272 6129 3719 -302 -1345 -704 -56 3341 1786 1990 2986
15934B986R048O007m277p076L321l006l702j8k205l098m542k32k972J864N019
$$ 2986 12034 18041 13764 6688 10009 7003 3301 3283 1078 -2020 -6562 -6794 -9766 -7902 -2883
15919b883Q06K094l141r90L23p59J331o457k698O326P699l38k006K233K648M007
$$ -2883 -2077 17 -3124 -4114 -3791 -4550 -3219 -9676 -12374 -6048 1651 1313 -693 1540 4188 8195
15903H195m550p275L3N811q915l240N801M003L281K611r121k429M074K181o214
$$ 8195 3645 -3630 -3597 2214 -6701 -9941 -4140 -137 3144 5755 -3366 -5795 -1721 460 -5754
15888e754p065j32M180L887k396l999n71k135K188M442m212r79O255Q213M720
$$ -5754 -12819 -12951 -8771 -4884 -7280 -11279 -11850 -13985 -11797 -7355 -11567 -12546 -6291 1922 6642
15873F642l508j143K837l877O94P92q936n062M139J006J571K960j785J371k424
$$ 6642 3134 1991 4828 951 1645 2437 -6499 -11561 -7422 -6416 -4845 -1885 -3670 -2299 -4723
15858d723k576J971K381p48j411K137j408o63M117J823n95L209p1l208K729O35
$$ -4723 -7299 -5328 -2947 -3695 -5106 -2969 -4377 -5040 -923 900 305 3514 3443 235 2964 3599
15842C599j037N826j287q607q175K158N202J499o95Q257L473J662l083r362j0875
$$ 3599 2562 8388 7101 -1506 -9681 -7523 -2321 -822 -1517 6740 10213 11875 8792 -570 -11445
15827a1445O506M506L114k399p609j986P924n4K273J862j657L181M601L532J2387
$$ -11445 -4939 -433 2681 282 -7327 -9313 -1389 -1443 830 2692 1035 4216 8817 12349 24736
15812B4736N901m698p753l910m839o889r432j310K539k74Q798K090k909o145J378
$$ 24736 30637 25939 18186 14276 9437 2548 -6884 -8194 -5655 -5929 2869 4959 2050 -4095 -2717
15797b717M135O34n132n385L860M972K988l30O038L173j2424m509M231N17l874
$$ -2717 1418 2052 -3080 -8465 -4605 367 3355 3025 9063 12236 -188 -4697 -466 51 -3823
15782c823k530J215l345m108m481K299Q188J0309J92p821M999j018m112n518L171
$$ -3823 -6353 -5138 -8483 -12591 -17072 -14773 -6585 3724 3916 -3905 1094 76 -4036 -9554 -6383
15767f383L589K09L23J474k340m366J127K078p508N175J1147O09K833p077n695
$$ -6383 -2794 -2585 -2262 -788 -3128 -7494 -6367 -4289 -11797 -6622 4525 5134 7967 890 -4805
15752d805M940Q257j967J226n879L27M906p820q024l025L238N045l684N64k322
$$ -4805 135 8392 6425 7651 1772 2099 7005 -815 -8839 -11864 -8626 -3581 -7265 -6701 -9023
15737i023j129L061R325L788J172p860j415J034L805N541l924k119q98M327j14
$$ -9023 -10152 -7091 2234 6022 7194 -666 -2081 -1047 2758 8299 4375 2256 1358 5685 5571
15722E571j676O35j105j061M663K07r218j1757l548L313O781M092J942k105j232
$$ 5571 3895 4530 3425 2364 7027 7234 -1984 -13741 -17289 -13976 -7195 -3103 -1161 -3266 -4498
15707d498Q41J942J639k92m933k016j406M737J070j176j3006L414j172l937l755
$$ -4498 -3657 -1715 -76 -368 -5301 -7317 -8723 -3986 -2916 -4092 -17098 -13684 -14856 -18793 -22548
15692b2548l581Q565N41J902j202L440P19j704R045N786p67n940m94j457L286
$$ -22548 -26129 -17564 -17023 -15121 -16323 -12883 -12164 -13868 -4823 963 196 -5744 -6238 -7695 -4409
15677d409P74K361J59m436M311N954J451m720J531M306r280J356j963j371N41
$$ -4409 -3635 -1274 -1115 -5551 -1240 4714 6165 1445 2976 7282 -1998 -642 -2605 -3976 -3435
15662c435N186M589m309m657K171j171o631j329J274L302L750K370m302k574J1
$$ -3435 1751 6340 2031 -2626 -455 -1626 -8257 -9586 -8312 -5010 -1260 1110 -3192 -5766 -5755
15647e755J109L760r03r34N789l033n368j954o34P904N041l850j376R807k748
$$ -5755 -4646 -886 -1789 -2723 3066 33 -5335 -7289 -7923 -19 5022 1172 -204 9603 6855
15632F855J864p34n563L809j20M835J3560J3030J2663J7458O381J1544J6880L7001
$$ 6855 8719 7985 2422 6231 6111 10946 24506 37536 50199 67657 74038 85582 102462 139463
15618A39463M7131o578o2052n5783l3126k0524q379Q81M823K313J937n967J881
$$ 139463 186594 180016 117964 62181 29055 8531 152 1033 5856 8169 10106 4139 6020
15605F020O024l871p835o79j228N29L719n0p3k47j648o699l580l431n804L813
$$ 6020 12044 8173 338 -341 -1569 -1040 2679 2629 2556 2309 661 -6038 -9618 -13049 -18853 -15040
15589a5040M668N055L252m0K134l674L83n077K092L797O73j491J573M44N51n083
$$ -15040 -10372 -5317 -2065 -2105 29 -3645 -3262 -8339 -6247 -2450 -1777 -3268 -1695 -1251 -700 -5783
15573e783k70M833J858m838r06n524o034N54J1231R994l383O693L947l629k485
$$ -5783 -6053 -1220 638 -4200 -5106 -10630 -16664 -16110 -4879 5115 1732 8425 12372 8743 6258
15558F258o110j1201J692J949P659M606L044k998j461o428o155q69l221O400J1573
$$ 6258 148 -11053 -9361 -7412 247 4853 7897 4899 3438 -2990 -9145 -10014 -13235 -6835 4738
15543D738J977k382p06k552m842J148l061l280R318j501L148m523l633j904N692
$$ 4738 6715 4333 3627 1075 -3767 -2619 -5680 -8960 358 -1143 2005 -2518 -6151 -8055 -2363
15528b363O48j474l76K725K046M654Q9j0768j0816k702R104q21K05K508o549J283
$$ -2363 -1715 -3189 -3565 -840 1206 5860 5949 -4819 -15635 -18337 -9233 -10054 -9849 -7341 -13890 -12607
15512a2607N500k646J33j024L371M571J807J301J252n62L960m523m928m845k495
$$ -12607 -7107 -9753 -9620 -10644 -7273 -2702 -895 406 1658 1096 5056 533 -4395 -9240 -11735
15497a1735N358l494m722Q90K199M001L712j667l862P197J554J453l629O43J116
$$ -11735 -6377 -9871 -14593 -13703 -11504 -7503 -3791 -5458 -9320 -2123 -569 884 -2745 -2102 -986
15482i86j106l96k640k50L169J96J583L004O098M005K02q271m718N782l015n068
$$ -986 -2092 -2488 -5128 -5378 -2209 -2013 -430 2574 8672 12677 12879 4608 -110 5672 2657 -2411
15466b411J787L562k210m389n770o808J121Q791J694M255L989n238p358J70Q516
$$ -2411 -624 2938 728 -3661 -9431 -16239 -15118 -6327 -4633 -378 3611 -1627 -8985 -8815 -299
15451b99k555o649k82P929j465k561j333j932j154Q46K262K512n172n156K739
$$ -299 -2854 -9503 -9785 -1856 -3321 -5882 -7215 -9147 -10301 -9455 -7193 -4681 -9853 -15009 -12270
15436a2270L753L909j50K888M867n693j1034p964m150O522J0031K314R42J468
$$ -12270 -8517 -4608 -4758 -1870 2997 -2696 -13730 -21694 -25844 -19322 -9291 -6977 -6035 -4567
15422d567m344L638n57J125L553l751l227m105L339J648n51J427M87L084J629
$$ -4567 -8911 -5273 -5830 -4705 -1152 -4903 -8130 -12235 -8896 -7248 -7799 -6372 -5885 -2801 -1172
15407a172m433j096L134m411l159m03k090L13O302M386K8j596j492K826k965k973
$$ -1172 -5605 -6701 -3567 -7978 -11137 -11540 -13630 -13317 -7015 -2629 -2601 -4197 -5689 -2863 -5828 -8801
15391h801J065J659R26J339J957k418m14M668N356j006o555j981K014M058N318
$$ -8801 -7736 -6077 -5151 -3812 -1855 -4273 -4687 -19 5337 4331 -2224 -4205 -2191 1867 7185
15376G185J340r379r111R99N282M736M926R1M669o942n376l66J880L599k353k414
$$ 7185 8525 -854 -9965 -8966 -3684 1052 5978 6069 10738 3796 -1580 -1946 -66 3533 1180 -1234
15360a234K295j645k278K185K752M841r80p69P922P717J110j193k340J1562J1297
$$ -1234 1061 -584 -2862 -677 2075 6916 5936 5167 13089 20806 21916 20723 18383 29945 41242
15345D1242P732J7871K7916L2779L2213L0981M4712O4349Q5147M6573m5446j13090
$$ 41242 48974 66845 94761 127540 159753 190734 235446 299795 384942 431515 386069 272979
15333B72979j11124p0552l7316j7477q545q64r039j0765o391M534N167j921l134
$$ 272979 161855 91303 53987 36510 27965 27101 18062 7297 906 5440 10607 8686 5552
15320E552K980m079k998m00o869l657O839N058J781O893Q00q869o378j388j552
$$ 5552 8532 4453 1455 1055 -5814 -9471 -2632 2426 4207 11100 11900 3031 -3347 -4735 -6287
15305f287J214L396N866k415m700j062J663L831O02l494m887k230J423K098J138
$$ -6287 -5073 -1677 4189 1774 -2926 -3988 -2325 1506 2108 -1386 -6273 -8503 -7080 -4982 -3844
15290c844J944K096J58J738l417k176M032O771o306l302L156q772N26L09l669
$$ -3844 -1900 196 354 2092 -1325 -3501 531 7302 996 -2306 850 -7922 -7396 -7087 -10756
15275a0756m083P73K307Q049j045K65K051n397n588Q22l266q3K188N053M452k080
$$ -10756 -14839 -14066 -11759 -3710 -4755 -4490 -2439 -7836 -13424 -12602 -15868 -15951 -13763 -8710 -4258 -6338
15259f338k080K300M36l428J326L275M000K206o118m104M55J942L792Q392j459
$$ -6338 -8418 -6118 -5682 -9110 -7784 -4509 -509 1697 -4421 -8525 -8070 -6128 -2336 6056 4597
15244D597j613p01l030k659R01R853P87q706o933K199P439K177j313M06j872K184
$$ 4597 2984 2283 -747 -3406 -2505 7348 8135 -571 -7504 -5305 2134 4311 2998 3404 1532 3716
15228C716J426j495l21J529j78q246N429P102n810j1782k062J0310O723j790j561
$$ 3716 5142 3647 3326 4855 4677 -3569 1860 8962 3152 -8630 -10692 -382 6341 4551 2990
15213B990K519Q0o902k192J471J446J871k642n467L666N755l246j1605K031J3066
$$ 2990 5509 5589 -1313 -3505 -2034 -588 1283 -1359 -6826 -3160 2595 -651 -12256 -10225 2841
15198B841K610M91m778j792l36n964k516J352N585L507K608k027K532j261J030
$$ 2841 5451 5942 1164 -628 -964 -6928 -9444 -8092 -2507 1000 3608 1581 4113 2852 3882
15183C882j399j029n747j127K189J2695M386r140l920j175Q60j007q74L00K90
$$ 3882 2483 1454 -4293 -5420 -3231 9464 13850 4710 790 -385 475 -532 -1406 -1106 -816
15168h16K819p7k578j545J457m489L782M708k044N338J130p672o807l814o750
$$ -816 2003 1926 -652 -2197 -740 -5229 -1447 3261 1217 6555 7685 13 -6794 -10608 -17358
15153a7358o316M884K553L128J038m1J0309O399O80o151o873J829q96q60M767
$$ -17358 -23674 -18790 -16237 -13109 -12071 -12112 -1803 4596 5276 -875 -7748 -5919 -6815 -7675 -2908
15138b908R32o759k83q97r41K61k495k99L349K912O79M29j094N21L253k628l564
$$ -2908 -1976 -8735 -9018 -9915 -10856 -10595 -13090 -13389 -10040 -7128 -6449 -6020 -7114 -6593 -3340 -5968 -9532
15121i532k880J617R409N452K55p210j253K159j929l011l128K770n457l185p260
$$ -9532 -12412 -10795 -1386 4066 4321 -2889 -4142 -1983 -3912 -6923 -10051 -7281 -12738 -15923 -23183
15106b3183K582N417O387N483L262m369k473J978N099O348m598n907j193l825
$$ -23183 -20601 -15184 -8797 -3314 -52 -4421 -6894 -4916 183 6531 1933 -3974 -5167 -8992
15092h992k35M619L873k333k186k245K770J571J036O565qj997J934k564k072R36
$$ -8992 -9227 -4608 -735 -3068 -5254 -7499 -4729 -3158 -2122 4443 4435 2438 4372 1808 -264 672
15076F72K487K166l409j902J742K649j624q163J817N542J537q153J082P724o331
$$ 672 3159 5325 1916 14 1756 4405 2781 -5382 -3565 1977 3514 -4639 -3557 4167 -2164
15061b164m500M240L257L640l11l167J159j0o30K288l562n675L43O133q830L33
$$ -2164 -6664 -2424 833 4473 4162 995 2154 2144 1514 3802 240 -5435 -5092 1041 -7789 -7456
15045g456M90l094L287K318M15M604k653P45M011l557J315J685K719k112j595
$$ -7456 -6966 -10060 -6773 -4455 -4040 564 -2089 -1344 2667 -890 425 2110 4829 2717 1122
15030A122N302j923l335m058J338j026O30P65J791P81m508J489P35j47K839k52
$$ 1122 6424 4501 1166 -2892 -1554 -2580 -1950 -1185 606 1387 -3121 -1632 -897 -1044 1795 1543
15014A543o463o401J95Q575L933o157P27O516p35M02K682P74q017m763J4377O557
$$ 1543 -4920 -11321 -11126 -2551 1382 -4775 -4048 2468 1733 2135 4817 5591 -2426 -7189 7188 13745
14998A3745j181k192l39r300j011j232l446M835M993M77J550p1q691j054j466
$$ 13745 12564 10372 10033 733 -278 -1510 -4956 -121 4872 5349 6899 6828 -1863 -2917 -4383
14983d383O55P715O28l838o703n259k782N892O860j770m923j429n821P246J2124
$$ -4383 -3728 3987 4615 777 -5926 -11185 -13967 -8075 -1215 -2985 -7908 -9337 -15158 -7912 4212
14968D212m089q024J56J012o928k014j412J840N077o84k698k719l309L252O910
$$ 4212 123 -7901 -7745 -6733 -13661 -15675 -17087 -15247 -10170 -10854 -13552 -16271 -19580 -16328 -9418
14953i418J796J017l096j0940q23k95o99P883M192M010J528n271l8K341P93J948
$$ -9418 -7622 -6605 -9701 -20641 -21464 -21759 -22458 -14575 -10383 -6373 -4845 -10116 -10154 -7813 -7020 -5072
14937e072K65m442o481M675N511n37N111M65l971k691M932N027J331j432j844
$$ -5072 -4807 -9249 -15730 -11055 -5544 -6081 -970 -505 -4476 -7167 -2235 2792 4123 2691 847
14922H47l343m010J009l666j688N522K718k564N84P004J280r09j977K885L204
$$ 847 -2496 -6506 -5497 -9163 -10851 -5329 -2611 -5175 -4591 2413 3693 2784 807 3692 6896
14907F896j733k954j291n210j690j049l349N585q78l134l36J315P28j317N96k681
$$ 6896 5163 2209 918 -4292 -5982 -7031 -10380 -4795 -5673 -8807 -9143 -7828 -7100 -8417 -7821 -10502
14891a0502J567j781L097P006o854m041J873M773K166m05j207j616k922J38L949
$$ -10502 -8935 -10716 -7619 -613 -7467 -11508 -9635 -4862 -2696 -3101 -4308 -5924 -8846 -8708 -4759
14876d759J650j088K62K416O470J985k461L921j364n161k868m418p30O705N195
$$ -4759 -3109 -4197 -3935 -1519 4951 6936 4475 8396 7032 1871 -997 -5415 -6145 560 5755
14861E755N60L04l661j546N68r813l82K325M621j857k543l310k581k333O426N262
$$ 5755 6315 6619 2958 1412 1980 -7833 -8215 -5890 -1269 -3126 -5669 -8979 -11560 -13893 -7467 -2205
14845b205K924l631N897r725r177J2062L943l668K452l996n538K325m58K676K970
$$ -2205 719 -2912 2985 -6740 -15917 -3855 88 -3580 -1128 -5124 -10662 -8337 -8795 -6119 -3149
14830c149j468J697O930o32p007k925l717j859P01N061J066n185k026O578Q230
$$ -3149 -4617 -2920 4010 3378 -3629 -6554 -10271 -12130 -11429 -6368 -5302 -10487 -12513 -5935 2295
14815B295j236l318Q40r061l320K935p278K277M168K677N75K806L992l906m881
$$ 2295 1059 -2259 -1419 -10480 -13800 -10865 -18143 -15866 -11698 -9021 -8446 -5640 -1648 -5554 -10435
14800a0435N611J731l906j123j043j01j341Q55Q493M751o028m3k964L265K333
$$ -10435 -4824 -3093 -6999 -8122 -9165 -9266 -10607 -9752 -1259 3492 -2536 -2579 -5543 -2278 55
14785E5L027k890q355l080O03M609M181K947M40m232n865l103O274Q657J769J257
$$ 55 3082 192 -8163 -11243 -10640 -6031 -1850 1097 1537 -2695 -8560 -11663 -5389 3268 5037 6294
14769F294k418m080N77j897J437J713k145p839l447j018J3708L405K168P97k588
$$ 6294 3876 -204 373 -1524 -87 1626 -519 -8358 -11805 -12823 885 4290 6458 7255 4667
14754D667l034O74m936j499o313O99K299K827K173L756L13K401J065k465L98R95
$$ 4667 1633 2307 -2629 -4128 -10441 -9742 -7443 -4616 -2443 1313 1626 4027 5092 2627 3025 4020
14738D020J206k366o352n841P511L922R18k648J944L198K81l082m574l810J091
$$ 4020 5226 2860 -3492 -9333 -1822 2100 3018 370 2314 5512 5793 2711 -1863 -5673 -4582
14723d582P64O429L178J677o561o83l563o294o120l693L777J749o63J384K151
$$ -4582 -3818 2611 5789 7466 905 222 -3341 -9635 -15755 -19448 -15671 -13922 -14585 -13201 -11050
14708a1050k45J026N669l463l565J75o051N4L557M702K052O859j973l853j614
$$ -11050 -11295 -10269 -4600 -8063 -11628 -11453 -17504 -17450 -13893 -9191 -7139 -280 -2253 -6106 -7720
14693g720L840J98n797l222l96k821n41P712P519m594Q70N874K316n046q84N513
$$ -7720 -3880 -3682 -9479 -12701 -13097 -15918 -16459 -8747 -1228 -5822 -4952 922 3238 -1808 -2692 2821
14677B821p335k649m272m81L701l495n492k694O764J3961j14p07J45j656M97P165
$$ 2821 -4514 -7163 -11435 -11916 -8215 -11710 -17202 -19896 -13132 829 715 8 153 -1503 -1006 6159
14661F159q73m691j230j216R81N939L202o078m213j309K95L690J260N555K290
$$ 6159 5286 595 -635 -1851 -870 5069 8271 2193 -2020 -3329 -3034 656 1916 7471 9761
14646I761L593o00k732l839J32M71k52p184Nl078k551l322n31J376n250K466R31
$$ 9761 13354 12754 10022 6183 6315 6786 6534 -650 -645 -3723 -6274 -9596 -10127 -8751 -14001 -11535 -10604
14629a0604o97L644O01M557j695m626J355m255N543M892p479j014M858J860j969
$$ -10604 -11301 -7657 -7056 -2499 -4194 -8820 -7465 -11720 -6177 -1285 -8764 -9778 -4920 -3060 -5029
14614e029j619M160N680R062l31q400l598o334l80N960J116k995o03O646J538
$$ -5029 -6648 -2488 3192 12254 11923 3523 -75 -6409 -6789 -829 287 -2708 -3311 3335 4873
14599D873l18K461o845l034J898J652J084j58l110M14m72K34n281l992m351K371
$$ 4873 4555 7016 171 -2863 -965 687 1771 1613 -1497 -1083 -1555 -1321 -6602 -10594 -14945 -12574
14583a2574M375l284o92K709M206l95N027K501n207j18l179J788k349n327l7L229
$$ -12574 -8199 -11483 -12175 -9466 -5260 -5655 -628 1873 -3334 -3452 -6631 -4843 -7192 -12519 -12556 -9327
14567i327K153K21M737j857R44K447Q00L247K766L31j591q79o306J117N631M801
$$ -9327 -7174 -6953 -2216 -4073 -3129 -682 118 3365 6131 6462 4871 3992 -2314 -1197 4434 9235
14551I235N425o067J03k272m443N975L455p934k055j781l378K921j629j657M051
$$ 9235 14660 8593 8696 6424 1981 7956 11411 3477 1422 -359 -3737 -816 -2445 -4102 -51
14536e1P157J675L07J158q74K611J156J042L643j931K239k116n777R00L747j237
$$ -51 7106 8781 9088 10246 9372 11983 13139 14181 17824 15893 18132 16016 10239 11139 14886 13649
14520A3649j278n04o2J53k432r015n94M831m02l506K848J67m881l151K128R989
$$ 13649 12371 11867 11805 11958 9526 511 -83 4748 4346 840 3688 3855 -1026 -4177 -2049 7940
14504G940K327o166m326j000K111M276N647l788o051p514r042k840M783J1601
$$ 7940 10267 4101 -225 -1225 886 5162 10809 7021 970 -6544 -15586 -18426 -13643 -2042
14490b042j151j408l743J286k024k50n445N41K856M625N315r4j307O437q87K092
$$ -2042 -3193 -4601 -8344 -7058 -9082 -9332 -14777 -14236 -11380 -6755 -1440 -1534 -2841 3596 2709 4801
14474D801L606l074l849k985r84O420K243m300j601R056K489m817r781l718L101
$$ 4801 8407 5333 1484 -1501 -2485 3935 6178 1878 277 9333 11822 7005 -2776 -6494 -3393
14459c393p727o266K894J159L546R335q105M056nJ871N342n864m584K707J289
$$ -3393 -11120 -17386 -14492 -13333 -9787 -452 -8557 -4501 -4506 -2635 2707 -3157 -7741 -5034 -3745
14444c745L603r38J240n573N18L672N15O871J1464m153K582o417p852k435k691
$$ -3745 -142 -1080 160 -5413 -4895 -1223 -708 6163 17627 13474 16056 9639 1787 -648 -3339
14429c339L9n315k21K992L428m599l549j81j2J732M129k659k911p261M417L708
$$ -3339 -3300 -8615 -8836 -5844 -2416 -7015 -10564 -10745 -10757 -9025 -4896 -7555 -10466 -17727 -13310 -9602
14413i602J0081J740m789r547p15K719O455K839P630N596j850j0181p699N70n123
$$ -9602 479 2219 -2570 -12117 -12832 -10113 -3658 -819 6811 12407 10557 376 -7323 -6753 -11876
14398a1876j620J508N274J918jL092J199J220m49r6P21J26k385n033K883l01K154
$$ -11876 -13496 -11988 -6714 -4796 -4797 -1705 -506 714 265 169 890 1016 -1369 -6402 -3519 -3820 -1666
14381a666L588l514K340O72M98j266k648K130R35m480k872j61l310j844K39N510
$$ -1666 1922 -1592 748 1420 1918 652 -1996 134 1069 -3411 -6283 -6444 -9754 -11598 -11359 -5849
14365e849M207M254J73n31j518J55O771J501p597n191M97k027M104k099O24J874
$$ -5849 -1642 2612 2785 2254 736 891 7662 9163 1566 -3625 -3128 -5155 -1051 -3150 -2526 -652
14349f52L818m031q935O066J2660J978L08J120K476m169P74k552j245j769l201
$$ -652 3166 -865 -9800 -3734 8926 10904 11212 12332 14808 10639 11413 8861 7616 5847 2646
14334B646J802k405o513L525n19l844n26J361p552N92k211P091P089k992L675
$$ 2646 4448 2043 -4470 -945 -1464 -5308 -5834 -4473 -12025 -11433 -13644 -6553 536 -2456 1219
14319A219M931r704M71L858N027j246k253l031K967M458m285l833N135J790l753
$$ 1219 6150 -3554 -3083 775 5802 4556 2303 -728 2239 6697 2412 -1421 3714 5504 1751
14304A751K41l982j793m990n293J123N884K168L104L386Q48k994j168n037k59
$$ 1751 1992 -1990 -3783 -8773 -14066 -12943 -7059 -4891 -1787 1599 2447 -547 -1715 -6752 -7011
14289g011K596K925n595L074O344j930j48j396P331l438o830L743J353L105J642
$$ -7011 -4415 -1490 -7085 -4011 2333 403 255 -1141 6190 2752 -4078 -335 1018 4123 5765
14274E765l544l536K517j944N364j659o033K472J750J0820J913k952j072m844
$$ 5765 2221 -1315 1202 -742 4622 2963 -3070 -598 1152 11972 13885 10933 9861 5017
14260E017j382n278M589j504l65O7q26k344l399Q98K154K651K37j858q349J880
$$ 5017 3635 -1643 2946 1442 1077 1144 318 -2026 -5425 -4527 -2373 278 515 -1343 -9692 -7812
14244g812j490J089M106J697l818J792K71j682L445J768J610J324M625K935o77
$$ -7812 -9302 -8213 -4107 -2410 -6228 -4436 -4165 -5847 -2402 -634 976 2300 6925 9860 9183
14229I183l074O369l271r413N772N351q08l282n404j999j291K943L437P232M152
$$ 9183 6109 12478 9207 -206 5566 10917 10109 6827 1423 -576 -1867 1076 4513 11745 15897
14214A5897j3141j0346J996O280m968k082k010P531J937q518J79J847n516r34
$$ 15897 2756 -7590 -5594 686 -4282 -6364 -8374 -843 1094 -7424 -7245 -5398 -10914 -11848
14200a1848R461R746J478q753m045O98l114J966L646j479J44J022n594J442P66
$$ -11848 -2387 7359 8837 84 -3961 -3263 -6377 -4411 -765 -2244 -2100 -1078 -6672 -5230 -4464
14185d464Q38J998o361K012L874J643K715J302k415K783j797j595O52L564N3j810
$$ -4464 -3626 -1628 -7989 -5977 -2103 -460 2255 3557 1142 3925 2128 533 1185 4749 4802 2992
14169B992o837n950M14j219K559J195q153L628N847j449L201m395m76q14P407
$$ 2992 -3845 -9795 -9381 -10600 -8041 -6846 -14999 -11371 -5524 -6973 -3772 -8167 -8643 -9457 -2050
14154b050Q358L212K391K652k743j68k735l772P184L743K929Q944j383n277n931
$$ -2050 6308 9520 11911 14563 11820 11652 8917 5145 12329 16072 19001 27945 26562 21285 15354
14139A5354k71J335j4202k683J983K742l986p091K861J0681L793p108k549N710
$$ 15354 15083 16418 2216 -467 1516 4258 272 -6819 -3958 6723 10516 3408 859 6569
14125F569P509M50l275m645j201Q93M67j314m946o642M37l723L49P356N6K654
$$ 6569 14078 14528 11253 6608 5407 6300 6767 5453 507 -6135 -5698 -9421 -9072 -1716 -1660 994
14109I94M232L709n023o825j153L836M10L724K251m055P27j910K363N986k006
$$ 994 5226 8935 3912 -2913 -4066 -230 180 3904 6155 2100 2827 917 3280 9266 7260
14094G260N601K660L613n226o533q71J508L319J400l151l445M584k39q67M86j572
$$ 7260 12861 15521 19134 13908 7375 6504 8012 11331 12731 9580 6135 10719 10480 9613 10099 8527
14078H527j1853J118J906J284k572l653J998J497K456l69K288n569l694m808j437
$$ 8527 -3326 -2208 -302 982 -1590 -5243 -3245 -1748 708 339 2627 -2942 -6636 -11444 -12881
14063a2881j032M320R191M161L998K715k775l070k217J607J345K167L463o287
$$ -12881 -13913 -9593 -402 3759 7757 10472 7697 4627 2410 4017 5362 7529 10992 4705
14049D705n384p09J657J430J679K657Q017M306m940J975N171K870m05k792m378
$$ 4705 -679 -1388 269 1699 3378 6035 14052 18358 13418 15393 20564 23434 23029 20237 15859
14034A5859n42k913J694P18O65L806k229N815J060o386l438q080n069N705M533
$$ 15859 15317 12404 14098 14816 15481 19287 17058 22873 23933 17547 14109 6029 960 6665 11198
14019A1198o065r612J941K179J182J856N015M605j335l395R99n707n83N557q37
$$ 11198 5133 -4479 -2538 -359 823 2679 7694 12299 10964 7569 8568 2861 2278 7835 6998
14004F998j618M706K318N905o34n949q97o857j812l274k231N678M988J256n937
$$ 6998 5380 10086 12404 18309 17675 11726 10829 3972 2160 -1114 -3345 2333 7321 8577 2640
13989B640l34O816Q380M668j344m534o347j125K846M673J250o352o182K356j0921
$$ 2640 2306 9122 17502 22170 20826 16292 9945 8820 11666 16339 17589 11237 5055 7411 -3510
13974c510RJ591n773j339Q093k926M826J618m855O361R899J275Q3m896r106k343
$$ -3510 -3501 -1910 -7683 -9022 -929 -3855 971 2589 -2266 4095 13994 15269 15352 10456 1350 -993
13958i93M549J870n475o69L79K847N23L810k902m936J736k177p958J998l14K253
$$ -993 3556 5426 -49 -718 -339 2508 3031 6841 3939 -997 739 -1438 -9396 -7398 -7712 -5459
13942e459K596l290R49Q119k592Q30L375P574p4j784m040m882L897P924L23p08
$$ -5459 -2863 -6153 -5204 2915 323 1153 4528 12102 12028 10244 6204 1322 5219 13143 13466 12758
13926A2758K563j371j891j675K94j960j361k484l355K255o23M377l424l920J230
$$ 12758 15321 13950 12059 10384 10678 8718 7357 4873 1518 3773 3150 7527 4103 183 1413
13911A413K827k182k075L870K379j318P170M733k010p494n222P7L111K011R126
$$ 1413 4240 2058 -17 3853 6232 4914 12084 16817 14807 7313 2091 2168 5279 7290 16416
13896A6416N027m659l399p40L210k6O527N704M224o079J38m704O40P748J785j729
$$ 16416 21443 16784 13385 12645 15855 15829 22356 28060 32284 26205 26343 21639 22279 30027 31812 30083
13880C0083q843q408J3394O583n79m617r023o787J275K338Q535n950q69N051n04
$$ 30083 21240 12832 26226 32809 32230 27613 18590 11803 13078 15416 23951 18001 17132 22183 21679
13865B1679l014qJ779k572j154N365O147K689m087n960n337j439k433j201k107
$$ 21679 18665 18657 20436 17864 16710 22075 28222 30911 26824 20864 15527 14088 11655 10454 8347
13850H347j291K280m165m214j797M895p57J552R548N204L021n627P84N840j029
$$ 8347 7056 9336 5171 957 -840 4055 3298 4850 14398 19602 22623 16996 17780 23620 22591
13835B2591K111P482R071J39m296N544N508J6581J0874J268L134J9317J9523Q154
$$ 22591 24702 32184 41255 41394 37098 42642 48150 64731 75605 76873 80007 99324 118847 127001
13821A27001J6937L2176L5059L3854L9930N1284M8367J2704l2902n7373m0211
$$ 127001 143938 176114 211173 245027 284957 336241 384608 397312 364410 307037 266826
13810B66826j3143J3166K1992K8641M6719N9141N1387K497m6038l9881o791l752
$$ 266826 253683 266849 288841 317482 364201 423342 474729 477226 431188 391307 384516 380764
13798C80764l6851m0361k2018J538K9359L6510N0005O6216P8258O7101q165q0212
$$ 380764 343913 303552 281534 283072 312431 348941 398946 465162 543420 610521 602356 522144
13786E22144q4253n5584k0710Q072K9860L7092M7744M8567L8712J5478m3514r7068
$$ 522144 437891 382307 361597 369669 399529 436621 484365 532932 571644 587122 543608 446540
13774D46540q6336n3593n793J6559L1789M1514N8359O3865N6058J2417O136J6013
$$ 446540 360204 306611 300818 317377 349166 390680 449039 512904 568962 581379 587515 603528
13762F03528j7264q1681r4080n1464p240J3913K2617L9746P1184O3565O373p7574
$$ 603528 586264 504583 410503 359039 351799 365712 388329 428075 499259 562824 569197 491623
13750D91623j15655r7196p1908n1550k4046j3105o239q087j1900k752M142K826
$$ 491623 375968 278772 206864 155314 131268 118163 111924 103837 91937 89185 93327 96153
13738I6153M472N373r13n097l641N635R812K0495J0102L116q233k623N743J5701
$$ 96153 100625 105998 105085 99988 96347 101982 111794 132289 142391 145507 137274 134651 140394 156095
13724A56095Q796o003k1839k3237j5542r381l235j744o718r568j2089j4690n066
$$ 156095 164891 158888 137049 113812 98270 88889 85654 83910 77192 67624 55535 40845 35779
13711C5779L35J1678K924o023k044N822L802l69K870P407O815N275N143O133J1036
$$ 35779 36114 47792 50716 44693 42649 48471 52273 51904 54774 62181 68996 74271 79414 85547 96583
13696I6583J6351K4964K6861k40l6185l8789k3714m473n610j0028o203j5585q872
$$ 96583 112934 137898 164759 164519 128334 89545 65831 61358 55748 45720 39517 23932 15060
13683A5060n64j075J289l548n578n651N004R409O864Q605J381M743j25p11l345
$$ 15060 14496 13421 14710 11162 5584 -67 4937 14346 21210 29815 31196 35939 35814 35103 31758
13668C1758J257J194M847J222m222q49R7q839r909R81N551k783n517l009o268
$$ 31758 33015 34209 39056 40278 36056 35207 35304 26465 16556 17537 23088 20305 14788 11779 5511
13653E511O318N349L225n12l96J423r52j717L882K882M836N874r06O605J4233
$$ 5511 11829 17178 20403 19891 19495 20918 19966 18249 22131 25013 29849 35723 34817 41422 55655
13638E5655k429K783n512j3840l445P962O838N323P199P134O92j667l998M129
$$ 55655 53226 56009 50497 36657 33212 41174 48012 53335 60534 67668 68360 66693 62695 66824
13624F6824J6559J9547O649Q63l190J337Q17N589k502M172j251j931k715L864
$$ 66824 83383 102930 109579 110442 107252 108589 109406 114995 112493 116665 115414 113483 110768 114632
13610A14632Q127O673Q041K163O61J1205J2673J2828J4063K3154L2507L0023j5236
$$ 114632 122759 129432 137473 139636 140297 151502 164175 177003 191066 214220 246727 276750 261514
13597B61514l6668k1804k518J3060Q908m57J3571K2054K7262L4069N3714O7264
$$ 261514 224846 203042 200524 213584 222492 222035 235606 257660 284922 318991 372705 439969
13585D39969N7096K7940L2227N8703O8837O3059O3240P5017Q0928N2480J5106
$$ 439969 497065 525005 557232 615935 684772 747831 811071 886088 967016 1019496 1034602
13574A034602R697L8485O8834N6769O589j11581j77690j68513j25812r1611o0492
$$ 1034602 1044299 1082784 1151618 1208387 1214976 1103395 925705 757192 631380 539769 479277
13563D79277m5205m7064m7505l9169k7377j6105j1516k0186j7107j1482j862J1347
$$ 479277 434072 387008 339503 300334 272957 256852 245336 225150 208043 196561 194699 206046
13551B06046K0434J5169O490J336J0120K4084N2257O1551M3478L2328M1480R5864
$$ 206046 226480 241649 248139 249475 259595 283679 335936 397487 440965 473293 514773 610637
13539F10637J08996p991j40124j52063q4697m0005k2103j5445j7892j5710j8070
$$ 610637 719633 711642 571518 419455 334758 294753 272650 257205 239313 223603 205533
13528B05533r733o181l439n807j2785j0387o487J5625K4808J8144J7171K655N939
$$ 205533 195800 189619 186180 180373 167588 157201 150714 166339 191147 209291 226462 229117 235056
13515B35056J0043p794l0221k8461k0101k1870k1765p290R893J0941P446J2482
$$ 235056 245099 237305 207084 178623 158522 136652 114887 107597 117490 128431 135877 148359
13503A48359J6461K6943K2071K798r661k6818j4752P502O822j3261q809j40n541
$$ 148359 164820 191763 213834 216632 206971 180153 165401 172903 179725 166464 157655 157515 151974
13490A51974j1450n807l667N774M438P6p68j279J0237J1362p954j1374k6374k1333
$$ 151974 140524 134717 131050 136824 141262 141338 140570 139291 149528 160890 152936 141562 115188 93855
13476I3855o811L512o231J144K1635M6978N4725M9202M5729L6372J8189P661N914
$$ 93855 87044 90556 84325 85469 107104 154082 208807 258009 303738 340110 358299 365960 371874
13463C71874P243K989J3534K4384K9822K8565K7819K6135J9399J7469L8279L9221
$$ 371874 379117 382106 395640 420024 449846 478411 506230 532365 551764 569233 607512 646733
13451F46733J9615k745j4564o01L1615k959n2095n8234M100Q2707R0794O4249
$$ 646733 666348 663603 649039 648438 680053 677094 624999 566765 570865 653572 744366 808615
13439H08615N6470O6392P0262Q7452J09327J31604J61914J85919K17389K69021
$$ 808615 865085 931477 1001739 1089191 1198518 1330122 1492036 1677955 1895344 2164365
13429B164365K87277L21212L40230L47675L39278K86730K22249J40701M5806o8311
$$ 2164365 2451642 2772854 3113084 3460759 3800037 4086767 4309016 4449717 4495523 4427212
13419D427212j87067k66346l11006l46086l71482l79758l34958k81891k36763
$$ 4427212 4240145 3973799 3662793 3316707 2945225 2565467 2230509 1948618 1711855
13410A711855j89279j44986j02800q1784p0176n4819m1143j8245q424j38m687
$$ 1711855 1522576 1377590 1274790 1193006 1122830 1068011 1026868 1008623 1000199 1000061 995374
13399I95374j0609j0135K366k342L407O740N622o41o90P161J7273K8234L1349
$$ 995374 984765 974630 976996 974654 978061 984801 990423 989782 989092 996253 1013526 1041760 1073109
13386A073109L3180L8410M3613L5552K9254K5659L5296N5566N4141R2058J14375
$$ 1073109 1106289 1144699 1188312 1223864 1253118 1278777 1314073 1369639 1423780 1515838 1630213
13375A630213J18356J06995J00107J40703K17927K45641J01668j14020j86033
$$ 1630213 1748569 1855564 1955671 2096374 2314301 2559942 2661610 2547590 2361557
13366B361557j37736n1312M833L9739P2810J04748J35841J51347J75437J86546
$$ 2361557 2223821 2172509 2177342 2217081 2289891 2394639 2530480 2681827 2857264 3043810
13356C043810J99148K51337L37573M00679M31975M62242N23663O68492R29626
$$ 3043810 3242958 3494295 3831868 4232547 4664522 5126764 5650427 6318919 7248545
13347G248545J111404O50219Q2363J29372N07701J068497J455110P23212L6118
$$ 7248545 8359949 9010168 9092531 9221903 9729604 10798101 12253211 12976423 13012541
13338A3012541M72380J273378K133646L009227L852871M588399N246734O100746
$$ 13012541 13484921 14758299 16891945 19901172 23754043 28342442 33589176 39689922
13330C9689922P291924Q705060J0299562J2444634J6071117K2673774L2737481
$$ 39689922 46981846 55686906 65986468 78431102 94502219 117175993 149913474
13323A49913474M2528698M4789010M0556398M6004586O9132748R2615745O4011799
$$ 149913474 192442172 237231182 277787580 323792166 392924914 485540659 549552458
13316E49552458m3016656j26932185j26574523q7028751n1522867l0732558k0288584
$$ 549552458 506535802 379603617 253029094 166000343 114477476 83744918 63456334
13309F3456334j4024017r909654p073695n107817l649484k538850j751491j248459
$$ 63456334 49432317 39522663 32448968 27341151 23691667 21152817 19401326 18152867
13301A8152867r16193o01143k31376J12770L77387P18128J197038J775217J805632
$$ 18152867 17236674 16635531 16404155 16516925 16894312 17612440 18809478 20584695 22390327
13292B2390327O89791j03601n49770j189724j769989k298063k858064k699371
$$ 22390327 23080118 22976517 22426747 21237023 19467034 17168971 14310907 11611536
13284A1611536k046461j458193j039756p51149n62437m71404m48504m31884l79796
$$ 11611536 9565075 8106882 7067126 6315977 5753540 5282136 4833632 4401748 4021952
13275D021952k95993k13025j41349q1411m6725l7751k9167j3244M7713J25287
$$ 4021952 3725959 3512934 3371585 3290174 3243449 3205698 3176531 3163287 3211000 3336287
13265C336287J08597q0478l34555l93200k98197k10644j69387j26360q9870q1009
$$ 3336287 3444884 3364406 3029851 2636651 2338454 2127810 1958423 1832063 1742193 1661184
13255A661184p3925n7630n3620n1505l9377k6538j4100q33j517m597j7445k6427
$$ 1661184 1587259 1529629 1476009 1424504 1385127 1358589 1344489 1343656 1342139 1337542 1320097 1293670
13243A293670k8933k5137l3533l6156m1536m6016m1174l9248k6368j9441k0826
$$ 1293670 1264737 1239600 1206067 1169911 1128375 1082359 1041185 1001937 975569 956128 935302
13232I35302k1271j5814q348q406q084q692j2705r076j2340j7878k7460k8039
$$ 935302 914031 898217 889869 881463 873379 864687 851982 842906 830566 812688 785228 757189
13220G57189j6447p777j383L309Q518Q24k984m940j5269k2392o525L913P258J7474
$$ 757189 740742 732965 731582 734891 743409 744233 741249 736309 721040 698648 692123 696036 703294 720768
13206G20768J6965K9600K4169j151j8176k9277k5734j6355l7525l9508J0112L6607
$$ 720768 737733 767333 791502 790351 772175 742898 717164 700809 663284 623776 633888 670495
13194F70495J3568k7560m4065j2142N2405K5630m1267o1784n0325k7818k0631
$$ 670495 684063 656503 612438 600296 652701 678331 637064 575280 524955 497137 476506
13183D76506r616j4047j2781j1150j2231k081N094m444j3544j4641j3450j4301
$$ 476506 466890 452843 440062 428912 416681 414600 419694 415250 401706 387065 373615 359314
13171C59314l652o23J689Q438J1612J4775K3459K5419L8728L6837N871k3776l3857
$$ 359314 355662 355039 356728 365166 376778 391553 415012 440431 479159 515996 521867 498091 464234
13158D64234l0957j9142j6059k7270k6028m196m34O146m640j830K712k390m861
$$ 464234 433277 414135 398076 370806 344778 340582 340148 346294 341654 339824 342536 340146 335285
13145C35285j6938k2323j8583j3106LJ710l773q065K07j42k4299k4128p812J6479
$$ 335285 318347 296024 277441 264335 264338 266048 262275 254210 254417 254275 229976 205848 198036 214515
13131B14515L4718K4064J9790l88k222k772j4502l3693k5962n226l558k5661k5682
$$ 214515 249233 273297 293087 292699 290477 287705 273203 239510 213548 208322 204764 179103 153421
13118A53421J993K2774J2242J0874L110P155P416J333j0609j7210j8948r413n602
$$ 153421 155414 178188 190430 201304 204414 211569 218985 220318 209709 192499 173551 164138 158536
13105A58536o849o934j380N427j181m329L689K9882K2294p80K179J1559J7350
$$ 158536 151687 144753 143373 148800 147619 143290 146979 176861 199155 198375 200554 212113 229463
13092B29463L748j3433j2077n416L605M614N038K837j1423n857n48J366l346k367
$$ 229463 233211 219778 207701 202285 205890 210504 215542 218379 206956 201099 200551 201917 198571 196204
13078A96204n501j2587j4859l638J2561J1197O991r58R370J9693J2883J2148O689
$$ 196204 190703 178116 163257 159619 172180 183377 190368 189410 198780 218473 231356 243504 250193
13065B50193J762J595l555k1002j2787p062l520L342J328L64J776j2245k2213
$$ 250193 251955 253550 249995 228993 216206 209144 205624 208966 210294 210658 212434 200189 177976
13052A77976j6514m595N525K256k750p199q051R69l259j178J022p72l294j247
$$ 177976 161462 156867 162392 164648 161898 154699 146648 147617 144358 143180 144202 143430 140136 138889
13038A38889j637J768R309j19p809l996p09L060l833q58l658m527l331l562k518
$$ 138889 137252 139020 148329 148210 140401 136405 135696 138756 134923 134065 130407 125880 122549 118987 116469
13023A16469N670M334l116J309n266l328P124R643N581N675M064l189l462O007
$$ 116469 122139 126473 123357 124666 119400 116072 123196 132839 138420 144095 148159 144970 141508 147515
13009A47515N115j0036j1884p313M938K206k834m771n840k15N365Q040q90n718
$$ 147515 152630 142594 130710 123397 128335 130541 127707 122936 117096 116881 122246 130286 129396 123678
12995A23678n325p62R05M14l451n564O39l037J0151Q587k328k517L981J425q702
$$ 123678 118353 117591 118496 118910 115459 109895 110534 107497 117648 126235 123907 121390 125371 126796 118094
12980A18094n185j598K946J139j754o259n245l414p065n760k19K9L089r67L299
$$ 118094 112909 111311 114257 115396 113642 107383 102138 98724 91659 85899 85680 85709 88798 87831 91130
12965I1130J0363O773P049R953J980o723J79p85m118k097K194Q30r61q929j556
$$ 91130 101493 108266 115315 125268 127248 120525 120704 119919 115801 113704 115898 116728 115767 106838 105282
12950A05282k667p524k891j682l533J308L676N143O159j494O387L41o790j418
$$ 105282 102615 95091 92200 90518 86985 88293 91969 97112 103271 101777 108164 108505 101715 100297
12936A00297k772l994Q63K646n186l159j572j922P745N706O169q643o505J62j284
$$ 100297 97525 93531 94394 97040 91854 88695 87123 85201 92946 98652 104821 96178 89673 89835 88551
12921H8551n223J0j007K09M100P692l227j658j163k144p442l864K818L718p526
$$ 88551 83328 83338 82331 82540 86640 94332 91105 89447 88284 86140 78698 74834 77652 81370 73844
12906G3844n546M206J360o692M232R71j027J070Q808M491n277n096Q587n95j894
$$ 73844 68298 72504 73864 67172 71404 72375 71348 72418 81226 85717 80440 75344 83931 83336 81442
12891H1442R449O981L201J0416Q213P991J1377J7567J5807K1611K6251L3690M4064
$$ 81442 90891 97872 101073 111489 119702 127693 139070 156637 172444 194055 220306 253996 298060
12878B98060M1394N1448O5653P3808L9012l9153q1401o0797k0399N359L5886N7028
$$ 298060 339454 390902 456555 530363 569375 530222 448821 388024 367625 372984 408870 465898
12866D65898Q3204O5789j1123o9525m5386j827P129k9945l2231j4832J0301K0987
$$ 465898 549102 614891 603768 534243 488857 487030 494159 464214 431983 417151 427452 448439
12854D48439L1183M7980N5701N7595K6390p951j9616l4687n0826m7868k7114O191
$$ 448439 479622 527602 583303 640898 667288 659337 639721 605034 554208 506340 479226 485417
12842D85417J7794M2755N7265N8957K5237l3553j06454r9572n6248j5252m058
$$ 485417 503211 545966 603231 662188 687425 653872 547418 447846 391598 376346 372288
12831C72288J1447L1191N3156M5134n527k0789n312K8912M2576M514m3690o2399
$$ 372288 383735 414926 468082 513216 507689 486900 481588 510500 553076 557590 513900 451501
12819D51501m5773l2997j4148Q378L5181M4440J5050m1966p8829p1729n6693l2286
$$ 451501 405728 372731 358583 366961 402142 446582 461632 419666 340837 269108 212415 180129
12807A80129k2374j8463j0975L822M977M120o55o768O404R555l823k033l739o885
$$ 180129 157755 139292 128317 132139 137116 141236 140581 133813 140217 149772 145949 143916 140177 133292
12793A33292p023l420j1190j4088j3634o223L141l097k938n161J783J121k707
$$ 133292 126269 122849 111659 97571 83937 77714 80855 77758 74820 69659 71442 72563 69856
12780F9856m019l49m110n279Q728O493Q201J3853P901J0865J3266K6380L2951
$$ 69856 65837 65488 61378 56099 64827 71320 79521 93374 101275 112140 125406 151786 184737
12767A84737J1086k4488l9075k8695j7991j2533q279k778L122O052N970J351q39
$$ 184737 195823 171335 132260 103565 85574 73041 64762 61984 65106 71158 77128 78479 77640
12754G7640r87M848R837j849l647J50L502P658R321J9030R684o053q285l554J2775
$$ 77640 76653 81501 91338 89489 85842 85992 89494 97152 106473 125503 135187 129134 120849 117295 130070
12739A30070K3167K9985J7867p239k4115k5118j4902N370M460j1469j8465j3738
$$ 130070 153237 183222 201089 193850 169735 144617 129715 135085 139545 128076 109611 95873
12727I5873o796n163r905r93K588m948m519l811r306M695M968J117N515J1816
$$ 95873 89077 83914 74009 73016 75604 70656 66137 62326 53020 57715 62683 63800 69315 81131
12713H1131J3282Q603J1002J1612K6993K8514J5028k7663l2797k1442j3436p866
$$ 81131 94413 103016 114018 125630 152623 181137 196165 168502 135705 114263 100827 92961
12701I2961m915j354j2534j0370l92N926L995n077k185o0M240L984j454q360j395
$$ 92961 88046 86692 74158 63788 63396 69322 73317 68240 66055 65995 70235 74219 72765 64405 63010
12686F3010L155l392r96o901l708L208J750m926l019Q212K58J31J506J656L585
$$ 63010 66165 62773 61777 54876 51168 54376 56126 51200 48181 56393 56651 56782 58288 59944 63529
12671F3529M079P353N083O734K223J288k376n026m152O29L566j0259j3630K17
$$ 63529 67608 74961 80044 86778 89001 90289 87913 82887 78735 79364 82930 72671 59041 59258
12657E9258j921j273J977m00J398k987n932r93J486J04M813N815l402n151K255
$$ 59258 57337 56064 58041 57641 59039 56052 50120 49127 50613 50717 55530 61345 57943 52792 55047
12642E5047q78N921O467J92l515J0148l87k14o97P075J3883J3373J363k759m831
$$ 55047 54169 60090 66557 66749 63234 73382 72995 72781 72084 79159 93042 106415 107778 105019 100188
12627A00188J245j833n760p331r532q244n135m332j241K24O73m321L187K56J625
$$ 100188 101433 99600 93840 86509 76977 68733 63598 59266 58025 58249 58922 54601 57788 58044 59669
12612E9669l149J932L536P042J909K348j114q650j791J331N42M319k786m111N008
$$ 59669 56520 58452 61988 69030 70939 73287 72173 63523 61732 63063 63605 67924 65138 61027 66035
12597F6035m582l929Q50j095l628J428N084O583J154J963k35m162j519K018N5
$$ 66035 61453 57524 58374 57279 53651 55079 60163 66746 67900 69863 69628 65466 63947 65965 66020
12582F6020m167k757j503J006P965N61n394K015N763j197O410N410K838K454K435
$$ 66020 61853 59096 57593 58599 66564 67125 61731 63746 69509 68312 74722 80132 82970 85424 87859
12567H7859J406l467M863J0071k071J486P138R773J0627J921K382k110L656J959
$$ 87859 89265 85798 90661 100732 98661 100147 107285 117058 127685 129606 131988 129878 133534 135493
12553A35493K931j1021j3924K027m665j3648j9419o981p703n787J325Q220P906
$$ 135493 138424 127403 113479 115506 110841 97193 77774 70793 63090 57303 58628 66848 74754
12540G4754J800q963M228J4355L523o981J408l182l917k558O080P61o513q707
$$ 74754 76554 67591 71819 86174 89697 82716 84124 80942 77025 74467 80547 81308 74795 66088
12526F6088k581q29Q329k023n075n020m455m99N92N076K93m509K858P924O145
$$ 66088 63507 62678 71007 68984 63909 58889 54434 53935 54527 59603 59896 55387 58245 66169 72314
12511G2314J174L332P666Q609R615j735R01J490N844j81l930J476m071j3176j0345
$$ 72314 73488 76820 84486 93095 102710 100975 101876 103366 109210 109029 105099 106575 102504 89328 78983
12496G8983p022l526j173l677m649p473r750L057K491m55n553l522j236k026Q9
$$ 78983 71961 68435 67262 63585 58936 51463 41713 44770 47261 46806 41253 37731 36495 34469 34558
12481C4558K918M928n103Q096Q210k876O792M509n886j680O703Q953l607l586
$$ 34558 37476 42404 37301 45397 53607 50731 57523 62032 56146 54466 61169 70122 66515 62929
12467F2929Q61j774M833K807o247P30o118n594l294M014K804J259q81M179N598
$$ 62929 63790 62016 66849 69656 63409 64139 58021 52427 49133 53147 55951 57210 56329 60508 66106
12452F6106K505j973o49j0o145j773o470j476M216p33K347O07N001Q911P033O711
$$ 66106 68611 66638 65989 65979 59834 58061 51591 50115 54331 53598 55945 56552 61553 70464 77497 84208
12436H4208K842J0848J8639J7164q162k5940l1004j1020l302k587o093l437j035
$$ 84208 87050 97898 116537 133701 125539 99599 68595 57575 54273 51686 45593 42156 41121
12423D1121K252R34o569m666K137K664j743K612j507k579J904L14k138J163O558
$$ 41121 43373 44307 37738 33072 35209 37873 36130 38742 37235 34656 36560 36874 34736 35899 42457
12408D2457L633k704P55N482O611K317k112l939m268l865p978k218J788N384L776
$$ 42457 46090 43386 44141 49623 56234 58551 56439 52500 48232 44367 36389 34171 35959 41343 45119
12393D5119n608l474J831Q50k679n897n678Q262M139K833K864l363M55J0010J67
$$ 45119 39511 36037 37868 38718 36039 30142 24464 32726 36865 39698 42562 39199 39654 49664 49831
12378D9831p078L524N644p872j0102p756r08p1J482o80J604m95J361R625J0677
$$ 49831 42753 46277 51921 44049 33947 26191 25283 25212 26694 26014 27618 27123 28484 38109 48786
12363D8786q211q785j315J450O81o360l045k028l955o66J521l355l792L621O651
$$ 48786 40575 31790 30475 31925 32606 26246 23201 21173 17218 16552 18073 14718 10926 14547 21198
12348B1198J507N819R203m104p119m203k607P487K926l924p07J781j204l444n279
$$ 21198 22705 28524 37727 33623 26504 22301 19694 27181 30107 26183 25476 27257 26053 22609 17330
12333A7330j96O951N056j293j521k722n379N549M50j400N87J38j783j907J473
$$ 17330 17134 24085 29141 27848 26327 23605 18226 23775 24225 22825 23412 23550 21767 19860 21333
12318B1333j189K299K261l040o153L19J245O626L132l423j2196j140J471k35K207
$$ 21333 20144 22443 24704 21664 15511 15830 17075 23701 26833 23410 11214 10074 11545 11310 13517
12303A3517J737j331K014l85j0889K105Q780J242K381o152j226L878L35M73N990
$$ 13517 15254 13923 15937 15552 4663 6768 15548 16790 19171 13019 11793 15671 16006 16479 22469
12288B2469Q499j889m507J832l036o717J098J212m275J299L273k068l433J642
$$ 22469 30968 29079 24572 26404 23368 16651 17749 18961 14686 15985 19258 17190 13757 15399
12274A5399l27j332M614m531M97J623J009M25P286N833k040l808j32J994o03m100
$$ 15399 15072 13740 18354 13823 14320 15943 16952 17377 24663 30496 28456 24648 24516 26510 25907 21807
12258B1807j83N326m189n427j116k154Q75J437L548J1449k977m983l233j432J435
$$ 21807 21624 26950 22761 17334 16218 14064 14939 16376 19924 31373 28396 23413 20180 18748 20183
12243B0183J531n040l278N719J376j834Q17l056l799R27L279L209m448k925j877
$$ 20183 21714 16674 13396 19115 20491 18657 19474 16418 12619 13546 16825 20034 15586 12661 10784
12228A0784K974j163K027m01j906K349q72M181N596n46r34R56k327m791o68j664
$$ 10784 13758 12595 14622 14221 12315 14664 13792 17973 23569 23023 22089 23045 20718 15927 15259 13595
12212A3595p19L467L736K820K898k324l656p508j952N670j829l946M88k82L034
$$ 13595 12876 16343 20079 22899 25797 23473 19817 12309 10357 16027 14198 10252 10740 10458 13492
12197A3492N394j48j631N864O224j011J046k20R02j48n08J755k648m93N617J436
$$ 13492 18886 18738 17107 22971 29195 28184 29230 29010 29912 29764 29256 31011 28363 27870 33487 34923
12181C4923M193M6p174j0086k151L311O848k789k442l718r469p505l288P822L609
$$ 34923 39116 39162 31988 21902 19751 23062 29910 27121 24679 20961 11492 3987 699 8521 12130
12166A2130J653J574P049p97k162J277O50q6k332Q98R906J0008j127n630n87n23
$$ 12130 13783 15357 22406 21609 19447 20724 21374 21288 18956 19854 29760 39768 38641 33011 32424 31901
12150C1901P660J0270J498q193J024N678O57o493K049M371n752p001j2069l293
$$ 31901 39561 49831 51329 43136 44160 49838 50495 44002 46051 50422 44670 37669 25600 22307
12136B2307l284o651k001K341P525m128l989n01N026O441j367k897N82N472L512
$$ 22307 19023 12372 10371 12712 20237 16109 12120 11619 16645 23086 21719 18822 19404 24876 28388
12121B8388N857n408o405K126L801J710P632L541L794l666j0541k324o610p860
$$ 28388 34245 28837 22432 24558 28359 30069 37701 41242 45036 41370 30829 28505 21895 14035
12107A4035R25Q402o69o16J017J705k617M129N664J732p103mQ206J743m454n812
$$ 14035 14960 23362 22693 22077 23094 24799 22182 26311 31975 33707 26604 26600 34806 36549 32095 26283
12091B6283j593n464O2M72m388l894q11K991O54N895J304j398p110j034K631o0
$$ 26283 24690 19226 19288 19760 15372 11478 10667 13658 14312 20207 21511 20113 13003 11969 14600 14540
12075A4540o54J565K38m881Q79M514K217n236P68j093M900k30n895O182m807k193
$$ 14540 13886 15451 15689 10808 11687 16201 18418 13182 13950 12857 17757 17527 11632 17814 13007 10814
12059A0814J612L687J531K34L8N369k095l014n722k19K504r94J448O83J959J325
$$ 10814 12426 16113 17644 17878 17916 23285 21190 18176 12454 12235 14739 13745 15193 15876 17835 19160
12043A9160q277m439Q081P357L615K049M92r441p356j831M130J979n61j098Q10
$$ 19160 10883 6444 14525 21882 25497 27546 28038 18597 11241 9410 13540 15519 14958 13860 14670
12028A4670j081Q290Q200J702M84k984j285k075L422K594n231k790n736m8k979
$$ 14670 13589 21879 30079 31781 32265 29281 27996 25921 29343 31937 26706 23916 18180 18132 15153
12013A5153N433J907n756q472M31M341M019m209l692K808K850O91J055o325q335
$$ 15153 20586 22493 16737 8265 8696 13037 17056 12847 9155 11963 14813 15504 16559 10234 1899
11998A899M672j805L810M896k511l092L323N35l433K812L019K436n694n436M9
$$ 1899 6571 4766 8576 13472 10961 7869 11192 11727 8294 11106 14125 16561 10867 5431 5480
11983E480L67l056K751Q156L820J023j61l192r14j910o73n978J984O414K360m240
$$ 5480 5847 2791 5542 13698 17518 18541 18380 15188 14274 12364 11691 5713 7697 14111 16471 12231
11967A2231n869K2m65k610j212L404J267L413J55l731K003N171L194k118J0K000
$$ 12231 6362 6384 5919 3309 2097 5501 6768 10181 10336 6605 8608 13779 16973 14855 14865 16865
11951A6865k146N95P784K102o790k092n832n01K045m478j511P046J856J685J18
$$ 16865 14719 15314 23098 25200 18410 16318 10486 9985 12030 7552 6041 13087 14943 16628 16746
11936A6746L67l636K94L519Q3L077n702O10k17l279m25M970J608M247m913l25
$$ 16746 17113 13477 13771 17290 17373 20450 14748 15358 15141 11862 11437 16407 18015 22262 17349 17024
11920A7024O598o84q220q980k674l026N260J06L288j761K583q24j450l969l202
$$ 17024 23622 22938 14718 5738 3064 38 5298 5404 8692 6931 9514 8690 7240 3271 69
11905F9J516m46l526P332M515k270o26q01O599L01L073L379n9k096l847m877l572
$$ 69 1585 1139 -2387 4945 9460 7190 6564 5763 12362 12663 15736 19115 19056 16960 13113 8236 4664
11888D664k007n188k98P75J817M748L7r01J829o87o389K043L672j095j653J133
$$ 4664 2657 -2531 -2829 -2054 -237 4511 4548 3647 5476 4789 -1600 443 4115 3020 1367 2500
11872B500m98j51j28N50M064k09K677J208l247P798J912p362j963K954R64m309
$$ 2500 2002 1851 1723 2273 6337 6128 8805 10013 6766 14564 16476 9114 7151 10105 11069 6760
11856F760J427M804m17R08k292j505l894k47k059l654M40R751Q58l41J919l434
$$ 6760 8187 12991 12574 13482 11190 9685 5791 5544 3485 -169 271 10022 10880 10539 12458 9024
11840I024k337k585l276P126Q023K883l277m088r31K24j875j987j536j833K61
$$ 9024 6687 4102 826 7952 15975 18858 15581 11493 10562 10786 8911 6924 5388 3555 3816
11825C816J512N862o072l9J526R59k578m048J709K698L949K731k387J927M820
$$ 3816 5328 11190 5118 5079 6605 7564 4986 938 2647 5345 9294 12025 9638 11565 16385
11810A6385j8m717l626o264j654L762K053j228K748O68q67J673J606n527J4M824
$$ 16385 16367 11650 8024 1760 106 3868 5921 4693 7441 8109 7242 8915 10521 4994 5008 9832
11794I832k520q160K781P260k01l099m239P1j710M844L629K811M257j574L398
$$ 9832 7312 -848 1933 9193 8992 5893 1654 1725 15 4859 8488 11299 15556 13982 17380
11779A7380j723j702J728N937l477k684j1505q301P79O774m86l657O154J38m740
$$ 17380 15657 13955 15683 21620 18143 15459 3954 -4347 -3568 3206 2720 -937 5217 5355 615
11764F15k156J0065J398O820J496n917m017n015j090O552R012l278j1699j1302
$$ 615 -1541 8524 9922 16742 18238 12321 8304 3289 2199 8751 17763 14485 2786 -8516
11750h516N895N143N919Q451m994K745o65o121k959R36K229l284j355j548J191
$$ -8516 -2621 2522 8441 16892 11898 14643 13978 7857 4898 5834 8063 4779 3424 1876 3067
11735C067K50J754o295m494j350K696Q318Q435l341l892R65K204O165Q56k513
$$ 3067 3317 5071 -1224 -5718 -7068 -4372 3946 12381 9040 5148 6113 8317 14482 15338 12825
11720A2825k108l904n403k978L585m5o87k873N188O346j724k4N556N273k924j853
$$ 12825 10717 6813 1410 -1568 2017 1972 1285 -1588 3600 9946 8222 8198 13754 19027 16103 14250
11704A4250j848n076M898J070n473m84j296o362L620N551j483j0050m80Q493K907
$$ 14250 12402 7326 12224 13294 7821 7337 6041 -321 3299 8850 7367 -2683 -3163 5330 8237
11689H237j0289l71Q279K464k255J221j350m857N902J1037q9r93n965K4l62n73
$$ 8237 -2052 -2423 5856 8320 6065 7286 5936 1079 6981 18018 17929 16936 10971 10995 10633 10060
11673A0060J298j354j115J52L143J515j503K279p723L53q2R90q5l839M120K625
$$ 10060 11358 10004 8889 9041 12184 13699 12196 14475 6752 7105 7023 8013 7928 4089 8209 10834
11657A0834q73j14j04N75k522L19J021k043K953K571j852k35j399N153M15M457
$$ 10834 9961 9847 9743 10318 7796 8115 9136 7093 10046 12617 10765 10530 9131 14284 14699 19156
11641A9156k795K273m56o340q908M933J714k380j658R642P607K677k801j1065
$$ 19156 16361 18634 18178 11838 2930 7863 9577 7197 5539 15181 22788 25465 22664 11599
11627A1599p438k951M87j473M732l302l110O744M144K640Q855L105r216n392O00
$$ 11599 4161 1210 1697 224 4956 1654 -1456 5288 9432 12072 20927 24032 14816 9424 10024
11612A0024M449m089j798n904n858J472j034m370R02J046J441O664J39o051J685
$$ 10024 14473 10384 8586 2682 -3176 -1704 -2738 -7108 -6206 -5160 -3719 2945 3084 -2967 -1282
11597a282R740j422k387K298L679l178J295K902k153M50J0024K825k811K84o652
$$ -1282 8458 7036 4649 6947 10626 7448 8743 11645 9492 9942 19966 22791 19980 20264 13612
11582A3612k092M696N04m499l86l362l231k241l444J435N287J878J608o54l42
$$ 13612 11520 16216 16720 12221 11835 8473 5242 3001 -443 992 6279 8157 9765 9111 8769
11567H769r190l955M159J592L279j637K162J0285K096l547j0983o585M828J499
$$ 8769 -421 -4376 -217 1375 4654 3017 5179 15464 17560 14013 3030 -3555 1273 2772
11553B772J989k990Q42j92k908K208O505J829K886j755l089n275K920J352k791
$$ 2772 4761 1771 2613 2421 -487 1721 8226 10055 12941 11186 8097 2822 5742 7094 4303
11538D303M722L145M15J849o421k646n564L916J431l408j576M443R346l423m484
$$ 4303 9025 12170 12585 14434 8013 5367 -197 3719 5150 1742 166 4609 13955 10532 6048
11523F048M704M214k264j16n674j984j596J86N301K528p580m468O351J2252K626
$$ 6048 10752 14966 12702 12586 6912 4928 3332 3518 8819 11347 3767 -701 5650 17902 20528
11508B0528l68n630k878R97L90l306L509k288Q61P825N320M112N080K908m704
$$ 20528 20160 14530 11652 12649 13039 9733 13242 10954 11815 19640 24960 29072 34152 37060 32356
11493C2356j3517o094q66l224o20q95n856J027L9k285J280J441M660l018j982
$$ 32356 18839 12745 11879 8655 8035 7140 1284 2311 2350 65 1345 2786 7446 4428 2446
11478B446l298N405O243l966r11J509n735k712n027M502j467K450Q641o502j707
$$ 2446 -852 4553 10796 6830 5919 7428 1693 -1019 -6046 -1544 -3011 -561 8080 1578 -129
11463a29j965Q46k713j618q960R483Q809j80j390J554J405J266m442m439M385
$$ -129 -2094 -1248 -3961 -5579 -14539 -5056 3753 3573 2183 3737 5142 6408 1966 -2473 1912
11448A912N289k513N560k838o997O23o784k417O20Q32K983M429J136R69n688Q236
$$ 1912 7201 4688 10248 7410 413 1036 -5748 -8165 -7545 -6713 -3730 699 1835 2804 -2884 5352
11432E352l655j817M527R900J31p693l836k718K203L500M221j481p34L048l410
$$ 5352 1697 -120 4407 14307 14438 6745 2909 191 2394 5894 10115 8634 7900 10948 7538
11417G538k647r13m599j241J889N275m005M29M725m048j701l163L77K956M770
$$ 7538 4891 3978 -621 -1862 27 5302 1297 1726 6451 2403 702 -2461 -2084 872 5642
11402E642o44n033k892L555J806j601K714K395J963P547l526l779o531k820K382
$$ 5642 4998 -35 -2927 628 2434 833 3547 5942 7905 15452 11926 8147 1616 -1204 1178
11387A178K94l699K291N499M437L76l220n611j050l746m061N940L31J030M282
$$ 1178 1472 -2227 64 5563 10000 10376 7156 1545 495 -3251 -7312 -1372 -1041 -11 4271
11372D271q18J329L400L310M293Q05P43l417m170o63r28m524o928j193R38J471
$$ 4271 3453 4782 8182 11492 15785 16590 17333 13916 9746 9083 8155 3631 -3297 -4490 -3552 -2081
11356b081j074L21L626L238r27J90k784m678N083M458j953k949n768l223q095
$$ -2081 -3155 -2834 792 4030 3103 3293 509 -4169 914 5372 3419 470 -5298 -8521 -16616
11341a6616j29J296K445L144N159J512J394K400K021L93j0895n15K901L972K567
$$ -16616 -16745 -15449 -13004 -9860 -4701 -3189 -1795 605 2626 3019 -7876 -8391 -5490 -1518 1049
11326A049N907M125r4l528J839K335r84j394R48p215m544O557n389n152m25P925
$$ 1049 6956 11081 10987 7459 9298 11633 10649 9255 10203 2988 -1556 5001 -388 -5540 -5965 1960
11310A960L408k32l453j2109j315M975O112j575J483J022j003p043L364J490K829
$$ 1960 5368 5136 1683 -10426 -11741 -6766 -654 -2229 -746 276 -727 -7770 -4406 -2916 -87
11295h7J786m843J265L573J262l237M68K616k77O904m241K480j0508n869N908
$$ -87 1699 -3144 -1879 1694 2956 -281 187 2803 2526 9430 5189 7669 -2839 -8708 -2800
11280b800n100l47K419L832j39K638l294j366L083M274p63l213j870q28m98K397
$$ -2800 -7900 -8247 -5828 -1996 -2135 503 -2791 -4157 -1074 3200 2437 -776 -2646 -3474 -3972 -1575
11264a575M287m331j783Q27J409M837O906j853m810r11P755j698q779p62j764
$$ -1575 2712 -1619 -3402 -2575 -1166 3671 10577 8724 3914 3003 10758 9060 281 -481 -2245
11249b245k923L240m413J052N902K085n256j25m452K745M466J803O795N285J961
$$ -2245 -5168 -1928 -6341 -5289 613 2698 -2558 -2683 -7135 -4390 76 1879 8674 13959 15920
11234A5920o985q724O77M315J564J912j718K302M528M481M401k771k580M031M03
$$ 15920 8935 211 888 5203 6767 8679 6961 9263 13791 18272 22673 19902 17322 21353 21756
11219B1756p634n842k434k501N19q38J583j145J907l813l299K905p76O842M188
$$ 21756 14122 8280 5846 3345 3864 3026 4609 3464 5371 1558 -1741 1164 388 7230 11418
11204A1418m416j008L560J52M83O43k11K753m730L77p365k833L46J261M673K083
$$ 11418 7002 5994 9554 9706 10189 10832 10621 13374 8644 9021 1656 -1177 -831 430 5103 7186
11188G186n136k714m97O672L50Q4p609l080L515o69j154J710K322K604o504j714
$$ 7186 2050 -664 -1161 5511 5861 5945 -1664 -4744 -1229 -1898 -3052 -1342 980 3584 -2920 -4634
11172d634o0l398Q544J0811N580m740K035p38o316n336k779k777J976L709L832
$$ -4634 -4694 -8092 452 11263 16843 12103 14138 13400 7084 1748 -1031 -3808 -1832 1877 5709
11157E709Q197n474k771R420L755o677q743p47L894j778K000k32l041l165m68
$$ 5709 13906 8432 5661 15081 18836 12159 3416 2669 6563 4785 6785 6553 3512 347 -121
11142a21K339O4l503O106N149J997J013K677L811j337L56Q22J195m501n318j504
$$ -121 2218 2282 -1221 4885 10034 12031 13044 15721 19532 18195 18551 19373 20568 16067 10749 9245
11126I245M012K013r75k940j019n738p752m737r73m09K942J639O056M247k27m4
$$ 9245 13257 15270 14295 11355 10336 4598 -3154 -7891 -8864 -9273 -6331 -4692 1364 5611 5384 5340
11110E340m30j864q01l156n142P769j581m813O88N171M547L89l735L561m829l291
$$ 5340 4910 3046 2245 -911 -6053 1716 135 -4678 -3990 1181 5728 6117 2382 5943 1114 -2177
11094b177O151j772J196j04N205K668n449m101Q97M741L44j37L45p29n86p213
$$ -2177 3974 2202 3398 3294 8499 11167 5718 1617 2514 7255 7599 7462 7807 7078 6492 -721
11078g21L763K252k489l790K818Q17K418M999l179q267k146m00J412L692P345
$$ -721 3042 5294 2805 -985 1833 2650 5068 10067 6888 -1379 -3525 -3925 -2513 1179 8524
11063H524k570m863k579k816k800J494j935K389Q112l190n062l915J4J731J1851
$$ 8524 5954 1091 -1488 -4304 -7104 -5610 -7545 -5156 2956 -234 -5296 -9211 -9197 -7466 4385
11048D385J1044k376j5335p024K001N015Q06M189O001n853q61l582k076L710R84
$$ 4385 15429 13053 -2282 -9306 -7305 -2290 -1484 2705 8706 2853 1992 -1590 -3666 44 1028
11033A028m957N077j025j439k330O399M240n484n722O003N260n622l493J700k921
$$ 1028 -3929 1148 123 -1316 -3646 2753 6993 1509 -4213 1790 7050 1428 -2065 -365 -3286
11018c286j71J76O30J814j390J502K944j447n408l004Q090J0301k107m206k037
$$ -3286 -3457 -3281 -2651 -837 -2227 -725 2219 772 -4636 -7640 450 10751 8644 4438 2401
11003B401l216m86K076J752k66l809l978P382m0r488N759O707J125l751L032l584
$$ 2401 -815 -1301 775 2527 2261 -1548 -5526 1856 1816 -7672 -1913 4794 5919 2168 5200 1616
10987A616j0062Q05j052L438K200P92l8k679l501Q549J042J761j021M218M960
$$ 1616 -8446 -7641 -8693 -5255 -3055 -2263 -2301 -4980 -8481 68 1110 2871 1850 6068 11028
10972A1028m648n65p43m869l516Q96N226o540k640L73k310M466K775M113o601
$$ 11028 6380 5815 5072 203 -3313 -2417 2809 -3731 -6371 -5998 -8308 -3842 -1067 3046 -3555
10957c555j339o21K065k914l362P86M861Q629J248m035M6M62J550P38p656k846
$$ -3555 -4894 -5515 -3450 -6364 -9726 -8940 -4079 4550 5798 1763 1809 2271 3821 4559 -3097 -5943
10941e943K570R446P295l544N642j01o610k821J819m39n05j756Q811J597q679
$$ -5943 -3373 6073 13368 9824 15466 15365 8755 5934 7753 7314 6809 5053 13864 15461 6782
10926F782n038l129M556L51K572P29l7K688m497j188K477j866p43n150N974M670
$$ 6782 1744 -1385 3171 3522 6094 6823 6786 9474 4977 3789 6266 4400 3657 -1493 4481 9151
10910I151m48j464o500o309J279k479K39K93p32R752n80k929J433q275L69L568
$$ 9151 8703 7239 739 -5570 -4291 -6770 -6531 -6238 -6970 2782 2202 -727 706 -7569 -7200 -3632
10894c632o9L032k451M138j229L570J904M40N774k907l166J003l160j102K209
$$ -3632 -3701 -669 -3120 1018 -211 3359 5263 5703 11477 8570 5404 6407 3247 2145 4354
10879D354Q0m698N73M957j83k181j406k071l373k366l322K130L623j148o30p96
$$ 4354 4434 -264 309 5266 5083 2902 1496 -575 -3948 -6314 -9636 -7506 -3883 -5031 -5661 -6457
10863f457L896K893l250l792J648J138m275J090O741Q09L304m456k786k351j39
$$ -6457 -2561 332 -2918 -6710 -5062 -3924 -8199 -7109 -368 441 3745 -711 -3497 -5848 -5987
10848e987K90J0546M088L95j082k193k738p52J589m157J172N83L306M16Q48j09
$$ -5987 -5697 4849 8937 9332 8250 6057 3319 2567 4156 -1 1171 1754 5060 5476 6324 6215
10832F215k400Q24L164j091l560m607J663j23o19J426P393k600o37J264n625J187
$$ 6215 3815 4639 7803 6712 3152 -1455 208 85 -534 892 8285 5685 5048 6312 687 1874
10816A874K654M425N703l626o096p551m40L340N91K029K59j187J70N270j081n394
$$ 1874 4528 8953 14656 11030 4934 -2617 -3057 283 874 2903 3162 1975 2145 7415 6334 940
10800I40j135R59O53M189J831L560L272m224n161p846k39R06R47K773L306M68
$$ 940 -195 764 1417 5606 7437 10997 14269 10045 4884 -2962 -3201 -2295 -1348 1425 4731 5199
10784E199m151l956o31N72K934L857N046j726k494m410o093l621M669N763m28
$$ 5199 1048 -2908 -3539 -2967 -33 3824 8870 7144 4650 240 -5853 -9474 -4805 958 530
10769E30R391P439j2942o812m57J014K412j335o20L812m643n811M56l077L568
$$ 530 9921 17360 4418 -2394 -2851 -1837 575 -760 -1380 2432 -2211 -8022 -7566 -10643 -7075
10754g075K58o900K81K703O057L126L111j971J239k196n551k849l397L646J5076
$$ -7075 -6817 -13717 -13436 -10733 -4676 -1550 1561 -410 829 -1367 -6918 -9767 -13164 -9518 5558
10739E558K150n268N826m891k585j804j691n43K147p731m325N646M360m5M256
$$ 5558 7708 2440 8266 3375 790 -1014 -2705 -3248 -1101 -8832 -13157 -7511 -3151 -3196 1060
10724A060l20J757m91K551J464Q2O058p48o811n067M79J781j36k660N65M652n76
$$ 1060 740 2497 2006 4557 6021 6103 12161 11413 4602 -465 14 1795 1659 -1001 -436 4216 3640
10707C640j35P465N377k623k367J179j906J483L008n470k379p78J43k359j077
$$ 3640 3505 10970 16347 13724 11357 12536 10630 12113 15121 9651 7272 6494 6637 4278 3201
10692C201M561M310L185l079l573k664m600l644j478J346J852J668R63J282m492
$$ 3201 7762 12072 15257 12178 8605 5941 1341 -2303 -3781 -2435 -583 1085 2048 3330 -1162
10677a162j529l270Q02K528k289L086m100M984O242J411k870L112K129R63j992
$$ -1162 -2691 -5961 -5159 -2631 -4920 -1834 -5934 -950 5292 6703 3833 6945 9074 10037 8045
10662H045Q2K583K871l490l65j0254m994N430L592n204o864m723M637J413m034
$$ 8045 8127 10710 13581 10091 9726 -528 -5522 -92 3500 -1704 -8568 -13291 -8654 -7241 -11275
10647a1275K545M602R022J1011J600n766o587o422m394j110M768p26J701Q092
$$ -11275 -8730 -4128 4894 15905 17505 11739 5152 -1270 -5664 -6774 -2006 -2732 -1031 7061
10633G061K45K268k867m109o866M63j777M44P708k75l807J543j605O54P598J374
$$ 7061 7306 9574 6707 2598 -4268 -3805 -5582 -5138 2570 2295 -1512 31 -1574 -920 6678 8052
10617H052m594o580J618K581k171J696O377J356K193p856r59j134N388J218n174
$$ 8052 3458 -3122 -1504 1077 -1094 602 6979 8335 10528 2672 1713 579 5967 7185 2011
10602B011j12k098M62N528P775l993p844n793l253Q676N285J162o198k185K520
$$ 2011 1899 -199 263 5791 13566 9573 1729 -4064 -7317 1359 6644 7806 1608 -577 1943
10587A943O599o73j1519k33M207N861l304j570L081J660k080j86K789O43m155
$$ 1943 8542 7869 -3650 -3883 324 6185 2881 1311 4392 6052 3972 3786 6575 7218 3063
10572C063J224m929k692O582M023l903k355K491L376N044M704K677k995l487p730
$$ 3063 4287 -642 -3334 3248 7271 3368 1013 3504 6880 11924 16628 19305 16310 12823 5093
10557E093k874M536N768q015n445O55k29K139l130J267K481j209j622j44k043
$$ 5093 2219 6755 12523 4508 -937 -282 -511 1628 -1502 -235 2246 1037 -585 -729 -2772
10542b772L782j243k101J644n21O192P613K893j60l887p014N2r574j13K307L206
$$ -2772 1010 -233 -2334 -690 -1211 4981 12594 15487 15327 11440 4426 4478 -5096 -5209 -2902 304
10526C04N506q93p448J753L319j076k31M88m945K806P998r580k102K233K538K776
$$ 304 5810 4917 -2531 -778 2541 1465 1234 1722 -3223 -417 7581 -1999 -4101 -1868 670 3446
10510C446O332m78m400J796L443K243p472m269j788K729K053J25N615l804l916
$$ 3446 9778 9300 4900 6696 10139 12382 4910 641 -1147 1582 3635 3760 9375 5571 1655
10495A655p09J016J875m10M07J180j399m878K485K130p71N689P319k202p514o517
$$ 1655 946 1962 3837 3427 3834 5014 3615 -1263 1222 3352 2581 8270 15589 13387 5873 -644
10479f44K666Q90l690K750l49k584j953j918l585J15q66J209N513J839J419l73
$$ -644 2022 2912 -778 1972 1623 -961 -2914 -4832 -8417 -8302 -9168 -7959 -2446 -607 812 439
10463D39K240K920J493o099l802O327M501l289r130n336L256N348L74j199l597
$$ 439 2679 5599 7092 993 -2809 3518 8019 4730 -4400 -9736 -6480 -1132 -758 -1957 -5554
10448e554l453L294M038k519NQ099K74n290J264M893o557J638J409j297n384J376
$$ -5554 -9007 -5713 -1675 -4194 -4189 3910 4184 -1106 158 5051 -1506 132 1541 244 -5140 -3764
10432c764O127q11o349J030M589L70J024m622l225l081K479r95M820L575K679
$$ -3764 2363 1552 -4797 -3767 822 1192 2216 -2406 -5631 -8712 -6233 -7228 -2408 1167 3846
10417C846n642k85nP23j993j392L626o857p38L401j41p606m146J482N264Q44M964
$$ 3846 -1796 -2081 -2086 -1363 -3356 -4748 -1122 -7979 -8717 -5316 -5457 -13063 -17209 -15727 -10463 -9619 -4655
10400d655N473j996j410l195p173m229R13L954K675M892n166J373J0416L262L296
$$ -4655 818 -1178 -2588 -5783 -12956 -17185 -16272 -12318 -9643 -4751 -9917 -8544 1872 5134 8430
10385H430j186K41m011k297k83K831j836k323k73P12Q549M279k626m01m768j038
$$ 8430 7244 7485 3474 1177 894 3725 1889 -434 -707 5 8554 12833 10207 9806 5038 4000
10369D000K981J885j736P23n77m45N333K966N18k269o840k39l174j623M551M191
$$ 4000 6981 8866 7130 7853 7276 6831 12164 15130 15648 13379 6539 6300 3126 1503 6054 10245
10353A0245R37L798j115o407K616l230L256J047N99j972k401J145j073j182M374
$$ 10245 11182 14980 13865 7458 10074 6844 10100 11147 11746 9774 7373 8518 7445 6263 10637
10338A0637m253n903L983l362q95P199l000o548o450m62L018j009Q775N087k381
$$ 10637 6384 481 4464 1102 207 7406 4406 -2142 -8592 -9054 -6036 -7045 1730 6817 4436
10323D436m543j2930k681O991L910Q97K344j684k317J386n639l582Q807O096P42
$$ 4436 -107 -13037 -15718 -8727 -4817 -3920 -1576 -3260 -5577 -4191 -9830 -13412 -4605 1491 2233
10308B233Q625l742p863o401j487M014Q499k519l334k771j873k661J786M42K253
$$ 2233 10858 7116 -747 -7148 -8635 -4621 3878 1359 -1975 -4746 -6619 -9280 -7494 -7052 -4799
10293d799l89P2K049l666l691L623P497l869R53Q034J030n835o297o799P398P014
$$ -4799 -5188 -5116 -3067 -6733 -10424 -6801 696 -3173 -2220 5814 6844 1009 -5288 -12087 -4689 2325
10277B325l658o717m967o175L506k322q59R09K999M783L561K003L982l569m232
$$ 2325 -1333 -8050 -13017 -19192 -15686 -18008 -18867 -17958 -14959 -10176 -6615 -4612 -630 -4199 -8431
10262h431J195k262M547Q512O20k906o209k766K110O236K776J2m944k802nN309
$$ -8431 -7236 -9498 -4951 3561 4181 1275 -4934 -7700 -5590 646 3422 3434 -1510 -4312 -4317 992
10246I92k41j560k691k84k993n215K507R365N394m658k107k096m386n123K116
$$ 992 751 -809 -3500 -3784 -6777 -11992 -9485 -120 5274 616 -1491 -3587 -7973 -13096 -10980
10231a0980N132J582N305L30J447K826l367j264Q62j327N513P339L406j45o032
$$ -10980 -5848 -4266 1039 1369 2816 5642 2275 1011 1873 546 6059 13398 16804 16659 10627
10216A0627m873l409JJ382j172J958q95L922k173n855N262n109k148P301K633
$$ 10627 5754 2345 2346 3728 2556 4514 3619 7541 5368 -487 4775 -334 -2482 4819 7452
10201G452m104n788M305m49j025M373k484O51m698k343N017k116n055K797J224
$$ 7452 3348 -2440 1865 1416 391 4764 2280 2931 -1767 -4110 907 -1209 -6264 -3467 -2243
10186b243J420K431J758r57n046o262j308k019o533O780N53k905J332R84J828
$$ -2243 -823 1608 3366 2409 -2637 -8899 -10207 -12226 -18759 -11979 -11426 -14331 -12999 -12015 -10187
10171a0187m51L111P553j937l670M527P89m359N045L544k845m701J448N273R74
$$ -10187 -10638 -7527 26 -1911 -5581 -1054 -265 -4624 421 3965 1120 -3581 -2133 3140 4114
10156D114q44m684J3556P256l325j2515m728M773k257m269J69N311L679J46K661
$$ 4114 3270 -1414 12142 19398 16073 3558 -1170 3603 1346 -2923 -2754 2557 6236 6382 9043
10141I043l543k274j884j891N355K113J834j930l796o4K727l9K817o951o995L059
$$ 9043 5500 3226 1342 -549 4806 6919 8753 6823 3027 2963 5690 5651 8468 1517 -5478 -2419
10125b419N896L252K813m33j479o780j830K693j58m22l028N42K069r825o33K247
$$ -2419 3477 6729 9542 9109 7630 850 -980 1713 1555 1133 -1895 -1353 716 -9109 -9742 -7495
10109g495J558L331R42L912L053J859l700J278j322p776O324k79k489K761K039
$$ -7495 -5937 -2606 -1664 2248 5301 7160 3460 4738 3416 -4360 1964 1685 -804 1957 3996
10094C996J79Q091Q728k989k053k256l535l323N711K104n947n30O547j499j0413
$$ 3996 4175 12266 20994 18005 15952 13696 10161 6838 12549 14653 8706 8176 14723 13224 2811
10079B811K291M342p128m576l963K753M571N452M118p18J376j22L481l564j788
$$ 2811 5102 9444 2316 -2260 -6223 -3470 1101 6553 10671 9953 11329 11207 14688 11124 9336
10064I336N655O42n241J75j110j531J0063N65m798K132N391M750M230K358J0840
$$ 9336 14991 15633 10392 10567 9457 7926 17989 18554 13756 15888 21279 26029 30259 32617 43457
10049D3457J6831o939k8122j5420n803Q35k376j1233L746L834k058n324Q16M740
$$ 43457 60288 53349 25227 9807 4004 4839 2463 -8770 -5024 -1190 -3248 -8572 -7756 -3016
10035c016Q840k827p321J27J0588M509n296k32j491l335o680j474p78j473j632
$$ -3016 5824 2997 -4324 -4197 6391 10900 5604 5372 3881 546 -6134 -7608 -8386 -9859 -11491
10020a1491R145l23k919j594j765o61J316O452N312K15n23l472l297k750J323
$$ -11491 -2346 -2669 -5588 -7182 -8947 -9608 -8292 -1840 3472 3687 3164 -308 -3605 -6355 -5032
10005e032R973R61m287k21L661N720l804m049n263r29M184k530m332M507k017
$$ -5032 4941 5902 1615 1394 5055 10775 6971 2922 -2341 -3270 914 -1616 -5948 -1441 -3458
9990c458n85L028L906k18N64R92r20k081L56L419l609k488J097P023Q10n150K905
$$ -3458 -4043 -1015 2891 2673 3237 4229 3309 1228 1584 5003 1394 -1094 3 7026 7836 2686 5591
9973E591k754L242M011P09j259k34n44k791m199N625L378J850j664m117m800j813
$$ 5591 2837 6079 10090 10799 9540 9306 8762 5971 1772 7397 10775 12625 10961 6844 2044 231
9957B31p123P475K677o047j958K527j225K397n003k03J387q05N875N554l881L120
$$ 231 -6892 583 3260 -2787 -4745 -2218 -3443 -1046 -6049 -6252 -4865 -5670 205 5759 1878 4998
9941D998M593k345j619j260Q700O59j0178m933P66k194R404M326o540j278O978
$$ 4998 9591 7246 5627 4367 13067 13726 3548 -1385 -619 -2813 6591 10917 4377 3099 10077
9926A0077N717L310J125o980p760l276j363M809J18L847M87p842M626N586n915
$$ 10077 15794 19104 20229 13249 5489 2213 850 5659 5777 9624 10111 2269 6895 12481 6566
9911F566K908J0037n26j1618l483o059l961M5Q98p5K267M736P309R19q92L141
$$ 6566 9474 19511 18985 7367 3884 -2175 -6136 -6091 -5193 -5268 -3001 1735 9044 9963 9071 12212
9895A2212L892k650k131o888j6745J496N863P821m04L359o2m713L67n342j170
$$ 12212 16104 13454 11323 4435 -12310 -10814 -4951 2870 2466 5825 5763 1050 1417 -3925 -5095
9880e095O894K247m435K083Q291J662p881J835J185O440l00k940o501k092r19
$$ -5095 1799 4046 -389 1694 9985 11647 3766 5601 6786 13226 12926 9986 3485 1393 474
9865D74l087k263J4111J1058N475m524o079p478M029J66o084k184j200l694j980
$$ 474 -2613 -4876 9235 20293 25768 21244 15165 7687 11716 11882 5798 3614 2414 -1280 -3260
9850c260p82N524R83n699k340L787M061M704J556J752K470l620M265M755l816
$$ -3260 -4042 1482 2465 -3234 -5574 -1787 2274 6978 8534 10286 12756 9136 13401 18156 14340
9835A4340q501L173P618n216r849m024O336N688P783o366j774l393n29K909K634
$$ 14340 5839 9012 16630 11414 1565 -2459 3877 9565 17348 10982 9208 5815 5286 8195 10829
9820A0829K428j478L82l501r318l100l067M609Q116J575j5390j164P401K641o017
$$ 10829 13257 11779 12161 8660 -658 -3758 -6825 -2216 5900 7475 -7915 -9079 -1678 963 -5054
9805e054M650j128K588n747j829M293j633j0157l249P153M761j803R04L075P04
$$ -5054 -404 -1532 1056 -4691 -6520 -2227 -3860 -14017 -17266 -10113 -5352 -7155 -6251 -3176 -2472
9790b472j409k504n46M875L982n99o22J74J0549m282O33j931j541l398K538J464
$$ -2472 -3881 -6385 -6931 -2056 1926 1327 705 879 11428 7146 7779 5848 4307 909 3447 4911
9774D911n636l600K664K562R95N440k26L087j298m710m371m314m98O179J028k768
$$ 4911 -725 -4325 -1661 901 1896 7336 7110 10197 8899 4189 -182 -4496 -4994 1185 2213 -555
9758e55p4O217M250o80k204K037L773k466q191m839M927Q441o97q963m953L998
$$ -555 -629 5588 9838 9158 6954 8991 12764 10298 2107 -2732 2195 10636 9939 976 -3977 21
9742B1P817M197j580j959K218p024p460P265M025N76O248J45N04p21m163l136
$$ 21 7838 12035 10455 8496 10714 3690 -3770 3495 7520 8096 14344 14489 14993 14272 10109 6973
9726F973J474J273k84k912J114J606J196m063K59L435l698l944L946m803j296
$$ 6973 8447 9720 9436 6524 7638 9244 10440 6377 6636 10071 6373 2429 6375 1572 276
9711B76p53j94J1028k082j4331n608R193Q616J324k124m918K405L195k075N97
$$ 276 -477 -671 10357 8275 -6056 -11664 -2471 6145 7469 5345 427 2832 6027 3952 4549
9696D549p59M063j437L260k531j502P521M081j802k520K731L964n644q121J231
$$ 4549 3790 7853 6416 9676 7145 5643 13164 17245 15443 12923 15654 19618 13974 5853 7084
9681G084j270p565L476Q817K677l543j774M383R58k620m408k333q99k71L586k540
$$ 7084 5814 -1751 1725 10542 13219 9676 7902 12285 13243 10623 6215 3882 2983 2712 6298 3758
9665C758n582l075k73M751J812L821O685j048o990K479M681L24K507J471l552
$$ 3758 -1824 -4899 -5172 -421 1391 5212 11897 10849 3859 6338 11019 11343 13850 15321 11769
9650A1769o682q490n609Q043O237n545l669m217m803J1040J4123l342r781J222
$$ 11769 5087 -3403 -9012 -969 5268 -277 -3946 -8163 -12966 -1926 12197 8855 -926 296
9636B96J2866M398l722j0696m142J789Q453N011l534p27k104L858p042n855r510
$$ 296 13162 17560 13838 3142 -1000 789 9242 14253 10719 9992 7888 11746 4704 -1151 -10661
9621a0661k303K225K985M793K672L073l201q56l570L316l507k988K145q1R693
$$ -10661 -12964 -10739 -7754 -2961 -289 2784 -417 -1273 -4843 -1527 -5034 -8022 -5877 -5958 3735
9606C735P89l163M296L712J280K236p93k018M960M218j663n665o90n301Q90L105
$$ 3735 4524 1361 5657 9369 10649 12885 12092 10074 15034 19252 17589 11924 11234 5933 6823 9928
9590I928k466j2082p295M297L346r76L215J4358J3819K689n598n972n410n16l997
$$ 9928 7462 -4620 -11915 -7618 -4272 -5248 -2033 12325 26144 28833 23235 17263 11853 11337 7340
9575G340l373K048l816q440N378O868L469n890p67k662k193j07J56M283P011J13
$$ 7340 3967 6015 2199 -6241 -863 6005 9474 3584 2817 155 -2038 -2145 -1989 2294 9305 9418
9559I418r25J681K770N793m348j779J1279J800r231j0648l499p080O030N935p10
$$ 9418 8493 10174 12944 18737 14389 12610 23889 25689 16458 5810 2311 -4769 1261 7196 6486
9544F486p856j779Q997R972N155q724r805N75M636j720q052J033K743M719J813
$$ 6486 -1370 -3149 5848 15820 20975 12251 2446 3021 7657 5937 -2115 -1082 1661 6380 8193
9529H193j981k280J122J325k488M834N008O252J463q166m328K154L32n995K823
$$ 8193 6212 3932 5054 6379 3891 8725 13733 19985 21448 13282 8954 11108 11440 5445 8268
9514H268J993k897K99J781L836L44m988j494K444J935n990n108M902J0707J949
$$ 8268 10261 7364 7663 9444 13280 13624 8636 7142 9586 11521 5531 423 5325 16032 17981
9499A7981L44k171Q001J155k741p217J728m37j840J804l851j2M163n06M13M576
$$ 17981 18325 16154 24155 25310 22569 15352 17080 16643 14803 16607 12756 12744 16907 16401 16814 21390
9483B1390K354k715m657j431L474k573l597p556n941l097L056L833L909K658o194
$$ 21390 23744 21029 16372 14941 18415 15842 12245 4689 -1252 -4349 -1293 2540 6449 9107 2913
9468B913m52L334J527L26Q072Q25q33J986p53l772N413J071m06q836K225M552
$$ 2913 2461 5795 7322 7648 15720 16545 15712 17698 16945 13173 18586 19657 19251 10415 12640 17192
9452A7192J143j215j174K631k654j057l518P69M758J939Q79K406k870l302K277
$$ 17192 18335 17120 15946 18577 15923 14866 11348 12117 16875 18814 19693 22099 19229 15927 18204
9437A8204j304k226J246J476m013L070r74j571j666L109J0155k138l628N147P904
$$ 18204 16900 14674 15920 17396 13383 16453 15479 13908 12242 15351 25506 23368 19740 24887 32791
9422C2791J433k306p649n294m147l627K770K802L581K118J540k281L083l920l96
$$ 32791 34224 31918 24269 18975 14828 11201 13971 16773 20354 22472 24012 21731 24814 20894 20498
9407B0498j885O726L476N760l72K884m986o34m674J077M013k045l318j22k697
$$ 20498 18613 25339 28815 34575 34203 37087 32101 31467 26793 27870 31883 29838 26520 26398 23701
9392B3701n275l194N719O860M039k065n478K390K048k60M649N250q09m019p36
$$ 23701 18426 15232 20951 27811 31850 29785 24307 26697 28745 28485 33134 38384 37575 33556 32820
9377C2820j961O866j130J72J903J103j063o611K000N024K521L035j083N6J770
$$ 32820 30859 37725 36595 36767 38670 39773 38710 32099 34099 39123 41644 44679 43596 43652 45422
9362D5422k842o20N590l22o58j908k227k502L714Q96K512J706R85n242K869L801
$$ 45422 42580 41960 47550 47228 46570 44662 42435 39933 43647 44543 47055 48761 49746 44504 47373 51174
9346E1174M902J34L630N061k776K257m059k454j463O223P967K027j042q68j779
$$ 51174 56076 56210 59840 64901 62125 64382 60323 57869 56406 62629 70596 72623 71581 70713 68934
9331F8934k975k37J445J804M730L62n186J296N447P057P876R04l029o814M546
$$ 68934 65959 65722 67167 68971 73701 74063 68877 70173 75620 82677 90553 91457 88428 81614 86160
9316H6160J1153n749K771L772M564r784p608N29L735M147J704Q2Q943L681Q032
$$ 86160 97313 91564 94335 98107 102671 92887 85279 85808 89543 93690 95394 95476 104419 108100 116132
9301A16132K431L356P71j71P972J611j3o138m517K593P474L550Q564P953J546
$$ 116132 118563 121919 122690 122519 130491 132102 132089 125951 121434 124027 131501 135051 143615 151568 153114
9286A53114O56P145l59p59J729O524L441L222K205M771L523M468N015L793J806
$$ 153114 153770 160915 160556 159797 161526 168050 171491 174713 176918 181689 185212 189680 194695 198488 200294
9271B00294N361O371J171m415m710L242Q052J4372J4958J3539O985m432K85k506
$$ 200294 205655 212026 213197 208782 204072 207314 215366 229738 244696 258235 265220 260788 261073 258567
9257B58567N32J516J1196M224j796J334J651P655J1201L228N557N602Q7K140L596
$$ 258567 259099 260615 271811 276035 274239 275573 277224 284879 296080 299308 304865 310467 310554 312694 316290
9242C16290L489J2258J1857R15k086Q063K376L058N167J882R76L074O791n962
$$ 316290 319779 332037 343894 344809 342723 350786 353162 356220 361387 363269 364245 367319 374110 368148
9228C68148o032j816N068L915M525j932l300m524P8l342l97K351j527O894p769
$$ 368148 362116 360300 365368 369283 373808 371876 368576 364052 364130 360788 360391 362742 361215 368109 360340
9213C60340q118m714k700o460j482k939J841p917j0802k600m399l613o462r466
$$ 360340 352222 347508 344808 338348 336866 333927 335768 327851 317049 314449 310050 306437 299975 290509
9199B90509j841P48P539j1034q998j310o718r526m232k861J340q491q060j860
$$ 290509 288668 289416 296955 285921 276923 275613 268895 259369 255137 252276 253616 245125 237065 235205
9185B35205m795o35J154l9n619j978l352j0406q660K408K316m982j1312o785l239
$$ 235205 230410 229775 230929 230890 225271 223293 219941 209535 200875 203283 205599 200617 189305 182520 179281
9170A79281m384J035J422o773m448o589j0751M925O465j913l316p38q737q407
$$ 179281 174897 175932 177354 170581 166133 159544 148793 153718 160183 158270 154954 154216 145479 137072
9156A37072j974J851J518m831o140m962j88J596K918q80m810J273P10o436o123
$$ 137072 135098 136949 138467 133636 127496 122534 122346 123942 126860 125980 121170 122443 123153 116717 110594
9141A10594k172j372r48Q13m255Q01j305p097K64L340j758m075q285p679L213
$$ 110594 108422 107050 106102 106915 102660 103461 102156 95059 95323 98663 96905 92830 84545 76866 80079
9126H0079j524M600n611k520N48p00l819l56k096j765L086L060m762m799k589
$$ 80079 78555 83155 77544 75024 75572 74872 71053 70697 68601 66836 69922 72982 68220 63421 60832
9111F0832l13M649k916l231n296o06J722L846k262k117p187O251M354m739k506
$$ 60832 60519 65168 62252 59021 53725 53119 54841 58687 56425 54308 47121 53372 57726 52987 50481
9096E0481k103J223O995P657m078m449n766K864N554L96P94l757J017N710L051
$$ 50481 48378 49601 56596 64253 60175 55726 49960 52824 58378 58774 59568 55811 56828 62538 65589
9081F5589J208k993k964J1211J0116j670j6058j1777o302L019K273n343L203R93
$$ 65589 66797 63804 60840 72051 82167 80497 64439 52662 46360 49379 51652 46309 49512 50505
9067E0505J113o555J691k645p377N808K014n721L67K348N48l783N050M398l321
$$ 50505 51618 45063 46754 44109 36732 42540 44554 38833 39200 41548 42096 38313 43363 47761 44440
9052D4440o082q14J275J414k077R76l162l951L687J023J489M62n362J125L594
$$ 44440 38358 37544 38819 40233 38156 39132 35970 32019 35706 36729 38218 38680 33318 34443 38037
9037C8037M967J432o02R259P838P44J215n421j3103o124n258j293J765J112m8
$$ 38037 43004 44436 43834 53093 60931 61675 62890 57469 44366 38242 32984 31691 33456 34568 34520
9022C4520m650J025P773k178m542L471k844l406l391k147K462M078n53j0797o161
$$ 34520 29870 30895 38668 36490 31948 35419 32575 29169 25778 23631 26093 30171 29618 18821 12660
9007A2660J2096K597n711j622J0810j783p150k888K96N33K741J654o301P89L630
$$ 12660 24756 27353 21642 20020 30830 29047 21897 19009 19305 19838 22579 24233 17932 18721 22351
8992B2351n298j425O719K857M62k496p980p815j541Q522P425m647J22k199j258
$$ 22351 17053 15628 22347 25204 25666 23170 15190 7375 5834 14356 21781 17134 17256 15057 13799
8977A3799r12k129K562L255k178p9j97j540K018m736q22N359O27J760l894o537
$$ 13799 12887 10758 13320 16575 14397 14318 14121 12581 14599 9863 9041 14400 15027 16787 12893 6356
8961F356j840J339n605l595l324K596J0200O935K115o94j147L289M233j135J211
$$ 6356 4516 5855 250 -3345 -6669 -4073 6127 13062 15177 14483 13336 16625 20858 19723 20934
8946B0934J0109k545l740j632J748J812j0488k576J400M92J005L816O637n550
$$ 20934 31043 28498 24758 23126 24874 26686 16198 13622 15022 15514 16519 20335 26972 21422
8932B1422o094K315M359K115j390j3423n904j701L17k638M72K889K752N931j808
$$ 21422 15328 17643 22002 24117 22727 9304 3400 1699 2016 -622 -150 2739 5491 11422 9614
8917I614l894K733K854K429N296o319j510N95M160k795l167K332J802N854M651
$$ 9614 5720 8453 11307 13736 19032 12713 11203 11798 15958 13163 9996 12328 14130 19984 24635
8902B4635k478m590n698n393k447q02J967q27O190O564k758o02J431j680p119
$$ 24635 22157 17567 11869 6476 4029 3227 5194 4367 10557 17121 14363 13761 15192 13512 6393
8887F393n592J5152O203k207k995m550K970j198k046k465l438K137L879j004K713
$$ 6393 801 15953 22156 19949 16954 12404 15374 14176 12130 9665 6227 8364 12243 11239 13952
8872A3952J778j291J906q009m795J091Q12k619K959J611J550o084q626j975M436
$$ 13952 15730 14439 16345 8336 3541 4632 5444 2825 5784 7395 8945 2861 -5765 -7740 -3304
8857c304O694M363m04r647K067N192M356J060o161L785O01k228l702J777M201
$$ -3304 3390 7753 7349 -2298 -231 4961 9317 10377 4216 8001 8602 6374 2672 4449 8650
8842H650J876j076o082n360L627k692n898N068J4892P509m034p366n685l2M13
$$ 8650 10526 9450 3368 -1992 1635 -1057 -6955 -1887 13005 20514 16480 9114 3429 3397 3810
8827C810R57k973m577L80l849m219K874J24P305J0013K142J973L225J796l714
$$ 3810 4767 1794 -2783 -2403 -6252 -10471 -7597 -7473 -168 9845 11987 13960 17185 18981 15267
8812A5267k791N410l455n910n040k305P137O759N66l682q858K658J38p49j257
$$ 15267 12476 17886 14431 8521 3481 1176 8313 15072 15638 11956 3098 5756 5894 5145 3888
8797C888L806L315R5P49K885p1o343L9M050m112j505K261k040L454M19j447J616
$$ 3888 7694 11009 11104 11853 14738 14667 8324 8363 12413 8301 6796 9057 7017 10471 10890 9443 11059
8780A1059n266J33N617M624K723m985j612J456n004K200K900L964N8k402K951
$$ 11059 5793 5926 11543 16167 18890 13905 12293 13749 8745 10945 13845 17809 17867 15465 18416
8765A8416K462L92p38J480o059J526l991r807o534M022R03l116J093K264O321
$$ 18416 20878 21270 20532 22012 15953 17479 13488 3681 -2853 1169 2072 -1044 49 2313 8634
8750H634N031M622k592j922M689n514o55L815L025o450K228j740Q60J50P75l991
$$ 8634 13665 18287 15695 13773 18462 12948 12293 16108 19133 12683 14911 13171 14031 14181 14956 10965
8734A0965m924K227N251M945N17m813l879J256j490M466p69j148m533l159J40
$$ 10965 6041 8268 13519 18464 18981 14168 10289 11545 10055 14521 13752 12604 8071 4912 5052
8719E052P52j012M275l064n906J0243R575j623j444K451p420n953N675l805n904
$$ 5052 5804 4792 9067 6003 97 10340 19915 18292 16848 19299 11879 5926 11601 7796 1892
8704A892M694m825J924L37L03K897j308m366L030M543L900l440l44q895q097M317
$$ 1892 6586 1761 3685 4022 4325 7222 5914 1548 4578 9121 13021 9581 9237 342 -7755 -3438
8688c438P966k59O507q24k460k102K159Q66J631j797P141K496J60l191J600K173
$$ -3438 4528 4269 10776 9952 7492 5390 7549 8415 10046 8249 15390 17886 18046 14855 16455 18628
8672A8628l80R89P161k702O964J1360J2586J4943J5064N360K2367K0891q014l0963
$$ 18628 18248 19237 26398 23696 30660 42020 54606 69549 84613 89973 112340 133231 125217 94254
8658I4254j9287j5295j2017j5360o922o510L131L972n727l203O64l783L263j410
$$ 94254 74967 59672 47655 32295 25373 18863 21994 25966 20239 17036 17700 13917 17180 15770
8644A5770L946k84j42l036N107M176k638n29L94j048J027M424O293P134O901N855
$$ 15770 19716 19432 19290 16254 21361 25537 22899 22370 22764 21716 22743 27167 33460 40594 47495 53350
8628E3350J2753R771K699M942J1023J4899K4530P931j2782k5994k6631j3105m678
$$ 53350 66103 75874 78573 83515 94538 109437 133967 141898 129116 103122 76491 63386 58708
8615E8708j0881n45M374L556P349O241k248j761Q06j549q254q185l239m842m08
$$ 58708 47827 47282 51656 55212 62561 68802 66554 64793 65599 64050 55796 47611 44372 39530 39122
8600C9122l545m374l150o95o584m297K552K125p144k799j269j892j275N813N767
$$ 39122 35577 31203 28053 27358 20774 16477 19029 21154 14010 11211 9942 8050 6775 12588 18355
8585A8355j0840j522J0771J972m921m650O225R296k803m167J880J193q213n208
$$ 18355 7515 5993 16764 18736 13815 9165 15390 24686 21883 17716 19596 20789 12576 7368
8571G368L646k726O23N145L751J49j943j242N221o052l790O385j747m515n93J998
$$ 7368 11014 8288 8911 14056 17807 17956 16013 14771 19992 13940 10150 16535 14788 10273 9680 11678
8555A1678k096o29l134l189K50m290K861Q106q90j162J746M218O456L089o042
$$ 11678 9582 8953 5819 2630 2880 -1410 1451 9557 8667 7505 9251 13469 19925 23014 16972
8540A6972L058J147M701j967j2192j5566L105M798N546j552j636N507J0277K824
$$ 16972 20030 21177 25878 23911 11719 -3847 -742 4056 9602 8050 6414 11921 22198 25022
8526B5022m581n06K364N728P669N956J932j007n76N319J1501J1754m75j6955j3476
$$ 25022 20441 19935 22299 28027 35696 41652 43584 42577 42001 47320 58821 70575 70100 53145 39669
8511C9669j0881J328n562k689K46k946n17l763l47l996k512n250m629K999Q184
$$ 39669 28788 30116 24554 21865 22111 19165 18648 14885 14538 10542 8030 2780 -1849 1150 9334
8496I334J11L012J694J123K078l67l398n304M107O36o12o013l460M752K099P889
$$ 9334 9445 12457 14151 15274 17352 16985 13587 8283 12390 13026 12414 6401 2941 7693 9792 17681
8480A7681J0291N440K400J3505P912k653l355o828q820n485l333l371p572M18
$$ 17681 27972 33412 35812 49317 57229 54576 51221 44393 35573 30088 26755 23384 15812 16230
8466A6230n078m043M291l103j514l111q96L180l516m021j897M458K658M184M683
$$ 16230 11152 7109 11400 8297 6783 3672 2776 5956 2440 -1581 -3478 980 3638 7822 12505
8451A2505R46o559n818k066j484M880L719o42L632K801q270o068K623J730M534
$$ 12505 13451 6892 1074 -992 -2476 2404 6123 5481 9113 11914 3644 -2424 199 1929 6463
8436F463J96j315n549O351m086l305o748M25M444M645N45J127j474k254K211J506
$$ 6463 6659 5344 -205 6146 2060 -1245 -7993 -7568 -3124 1521 2066 3193 1719 -535 1676 3182
8420C182o046m977M551J416l367M747K675O601J850k861q34j880k630K720l180
$$ 3182 -2864 -7841 -3290 -1874 -5241 -494 2181 8782 10632 7771 6937 5057 2427 5147 1967
8405A967J992m377k416L596j799N5L483K015j099l486R675K047o138N64o48j520
$$ 1967 3959 -418 -2834 762 -1037 -982 2501 4516 3417 -69 9606 11653 5515 6079 5431 3911
8389C911K730K290m086q2O192n406k038N459J439r37O1K820o22L571K273p201
$$ 3911 6641 8931 4845 4763 10955 5549 3511 8970 10409 9472 9533 12353 11731 15302 17575 10374
8373A0374n866J196O34j0391r96M965O227k227J257j063P388J94K555l411l434
$$ 10374 4508 5704 6338 -4053 -5049 -84 6143 3916 5173 4110 11498 11692 14247 10836 7402
8358G402q774q235M709n5m516N085N346N322m501p287k682P169Q269J896q33o377
$$ 7402 -1372 -9607 -4898 -4953 -9469 -4384 962 6284 1783 -5504 -8186 -1017 7252 9148 8315 1938
8342A938o497J831p12Q313M561p762l377J283N379q3O194J799M174L499p601q728
$$ 1938 -4559 -2728 -3440 4873 9434 1672 -1705 -422 4957 4874 11068 12867 17041 20540 12939 4211
8326D211j098J845j065l176N894R59J69l400n815k759O521J1830l643n916n442
$$ 4211 3113 4958 3893 717 6611 7570 7739 4339 -1476 -4235 2286 14116 10473 4557 -885
8311h85l780L727N056L241J9l963m711K027N948k106M22J294m98o41k887K968
$$ -885 -4665 -938 4118 7359 7378 3415 -1296 731 6679 4573 4995 6289 5791 5150 2263 5231
8295E231J958n312n863M085K270j343o01n136o27N825J0817k307p264L388k47
$$ 5231 7189 1877 -3986 99 2369 1026 425 -4711 -5338 487 11304 8997 1733 5121 4874
8280D874j114k552L158M42j543K437L854K644j747l383P976K016j388l560j181
$$ 4874 3760 1208 4366 4808 3265 5702 9556 12200 10453 7070 15046 17062 15674 12114 10933
8265A0933J397o274k341M925p72j621l237K623J545M017L622q84m709n902j193
$$ 10933 12330 6056 3715 8640 7868 6247 3010 5633 7178 11195 14817 13933 9224 3322 2129
8250B129O221J259j028j0646p170n56J936O451K653J953j508l65k848p9p448k812
$$ 2129 8350 9609 8581 -2065 -9235 -9791 -7855 -1404 1249 3202 1694 1329 -1519 -1598 -9046 -11858
8234a1858M196k747q32R774J0009l456k896M219k880l519P36N683K662j536n69
$$ -11858 -7662 -10409 -11241 -1467 8542 5086 2190 6409 3529 10 746 6429 9091 7555 6986
8219F986k13M89l371k826k09q506o69P210J155J274k010J64R473P80r462k728
$$ 6986 6773 7262 3891 1065 856 -7650 -8319 -1109 46 1320 -690 -526 8947 9727 265 -2463
8203b463K365K65o799o814N775N016O45K668m544l421r54N229K936J836o016l536
$$ -2463 -98 167 -6632 -13446 -7671 -2655 -2010 658 -3886 -7307 -8261 -3032 -96 1740 -4276 -7812
8187g812L665J1386p447q259q41J0485J625J591M695n906p350O103L02J56j0436
$$ -7812 -4147 7239 -208 -8467 -9308 1177 2802 4393 9088 3182 -4168 1935 2237 2393 -8043
8172h043k729M565P084L223m055n394K292M309o4k956J787k390m640J243l101
$$ -8043 -10772 -6207 877 4100 45 -5349 -3057 1252 1188 -1768 19 -2371 -7011 -5768 -8869
8157h869N052L713K544L223J451o754k003k099J492k51J739n496q215J525P930
$$ -8869 -3817 -104 2440 5663 7114 360 -1643 -3742 -2250 -2501 -762 -6258 -14473 -12948 -5018
8142e018k114J366O057q23J667K103L46k793M683J077N00m188k334L261k387k036
$$ -5018 -7132 -5766 291 -532 1135 3238 3584 791 5474 6551 7051 2863 529 3790 1403 -633
8126f33m000l044m740O81K988O835K481j0455K437J0558M24Q16k874o254m179
$$ -633 -4633 -7677 -12417 -11736 -8748 -1913 568 -9887 -7450 3108 3532 4348 1474 -4780 -8959
8111h959N132r79j599Q11M085m368j731l249n295O671Q115J254j005J070O439
$$ -8959 -3827 -4806 -6405 -5594 -1509 -5877 -7608 -10857 -16152 -9481 -1366 -112 -1117 -47 6392
8096F392J99q228j943P48O951Q151L265m525k818j713k699p11m347q7j239L477
$$ 6392 6591 -1637 -3580 -2832 4119 12270 15535 11010 8192 6479 3780 3069 -1278 -1365 -2604 873
8080H73j634M71M115q377l597J319K722L224O021K350q77r79J71o385m803J112
$$ 873 -761 -290 3825 -4552 -8149 -6830 -4108 -884 5137 7487 6610 5631 5802 -583 -5386 -4274
8064d274L675P365N679o48N23m768p890o305K784N088R78k799J186M636O930n624
$$ -4274 -599 6766 12445 11797 12320 7552 -338 -6643 -3859 1229 2207 -592 594 5230 12160 6536
8048F536M775L877m246k162n053m479K087M024n260N579J137k221K91K674J641
$$ 6536 11311 15188 10942 8780 3727 -752 1335 5359 99 5678 6815 4594 4885 7559 9200
8033I200M152N418m275l140k77k110j945L79N970K22p196M806J546m923k54K505
$$ 9200 13352 18770 14495 11355 11078 8968 7023 7402 13372 13594 6398 11204 12750 7827 7573 10078
8017A0078K81r349m80P381J539l304k996j329O145l467j006k807J160K274j796
$$ 10078 10359 1010 530 7911 9450 6146 3150 1821 7966 4499 3493 686 1846 4120 2324
8002B324K633N56m573m678L002K454O375j275k615K352R318O753m071r210r091
$$ 2324 4957 5513 940 -3738 -736 1718 8093 6818 4203 6555 15873 22626 18555 9345 254
7987B54J738K397l010o926O815M203J198j40l623k450N745R49l127L175M438L043
$$ 254 1992 4389 1379 -5547 1268 5471 6669 6529 2906 456 6201 7150 4023 7198 11636 14679
7971A4679L925N77k66n396j108r375l080N946k192m257J81j434R137J2299J310
$$ 14679 18604 19181 18915 13519 12411 3036 -44 5902 3710 -547 -366 -1800 7337 19636 20946
7956B0946q828q446r16o270N282M295n037Q832L434N31l172r37n7J354m842n913
$$ 20946 12118 3672 2756 -3514 1768 6063 1026 9858 13292 13823 10651 9714 9657 11011 6169 256
7940B56j648J939O22J053J762l111K875n81l759P97Q238J117j306K052o709l356
$$ 256 -1392 547 1169 2222 3984 873 3748 3167 -592 205 8443 9560 8254 10306 3597 241
7924B41R485N240k227m634j270n373l671p12K86P022N139j904l12j641L02l65
$$ 241 9726 14966 12739 8105 6835 1462 -2209 -2921 -2635 4387 9526 7622 7310 5669 5971 5606
7908E606l033K108p89j682l72N216j4p006n340J184r6L233q46m501l16L305m366
$$ 5606 2573 4681 3892 2210 1838 7054 7040 34 -5306 -4122 -4218 -985 -1831 -6332 -6648 -3343 -7709
7891g709P917M139m335L489j885L442k082o569n924l345j780K907L198O168K179
$$ -7709 208 4347 12 3501 1616 5058 2976 -3593 -9517 -12862 -14642 -11735 -8537 -2369 -190
7876a90Q19J155N3j787P64m513l607K243P15j785n12n32P048K617k938k461M632
$$ -190 629 1784 1837 50 814 -3699 -7306 -5063 -4348 -6133 -6645 -7177 -129 2488 -450 -2911 1721
7859A721J399p794n580k960o092L257R805Q254j217Q054k779j0221n735J868N188
$$ 1721 3120 -4674 -10254 -13214 -19306 -16049 -6244 2010 793 8847 6068 -4153 -9888 -8020 -2832
7844b832J926J021k140L018M023k38p70P24l87M79L114K170L86J152p375k424
$$ -2832 -906 115 -2025 993 5016 4778 4008 4732 4345 4824 7938 10108 10494 11646 4271 1847
7828A847j452q751k260o0l001n5O562M051M847L094l174m628j45m83J114Q05K10
$$ 1847 395 -8356 -10616 -10676 -13677 -13732 -7170 -3119 1728 4822 1648 -2980 -3125 -3608 -2494 -1689 -1479
7811a479L873j721l366l780O59n570k434O643P080N310n00l021j082k786J247
$$ -1479 2394 673 -2693 -6473 -5814 -11384 -13818 -7175 -95 5215 4715 1694 612 -2174 -927
7796i27L614J863m458q374j0004N437o98k799j487O875P011n97k26m74L769K909
$$ -927 2687 4550 92 -8282 -18286 -12849 -13547 -16346 -17833 -10958 -3947 -4544 -4770 -5244 -1475 1434
7780A434R236p37P89j699p7o408k189Q67N20l300l906m98M951L815m798k48j191
$$ 1434 10670 9933 10722 9023 8946 2538 349 1216 1736 -1564 -5470 -5968 -1017 2798 -2000 -2248 -3439
7763c439p03l04L438J516m498j614P174L532L120m313l444m376p872L314N203
$$ -3439 -4142 -4446 -1008 508 -3990 -5604 1570 5102 8222 3909 465 -3911 -11783 -8469 -3266
7748c266O629k809l446N63k619O51L206N268J410l671N895K68o592k591k295l356
$$ -3266 3363 554 -2892 -2329 -4948 -4297 -1091 4177 5587 1916 7811 8079 1487 -1104 -3399 -6755
7732f755K319J2546Q375l678r00j340n897m52m173J983m90J919o828m92P126J388
$$ -6755 -4436 8110 16485 12807 11907 10567 4670 4218 45 2028 1538 3457 -3371 -3863 3263 4651
7716D651K719J395l004r00K395M850N09o845j3389k629M514K68M485K560m931
$$ 4651 7370 8765 5761 4861 7256 12106 12615 5770 -7619 -10248 -5734 -5466 -981 1579 -3352
7701c352M923K975R8m351J567q93j010r184J050N11j693K465N149K582n396p36
$$ -3352 1571 4546 4644 293 1860 967 -43 -9227 -8177 -7666 -9359 -6894 -1745 837 -4559 -5295
7685e295O327l977J96L066m469K140M918O81p713J581K089n47J686k865j510Q307
$$ -5295 1032 -2945 -2749 317 -4152 -2012 2906 3587 -4126 -2545 -456 -1003 683 -2182 -3692 4615
7669D615N650L015m371p810k015O437n2j735k172K42n26K125L063n875m806l306
$$ 4615 10265 13280 8909 1099 -916 5521 5469 3734 1562 1804 1278 3403 6466 591 -4215 -7521
7653g521l204P920N894m485K439j563l037J720K250K880k504j633j884L054k547
$$ -7521 -10725 -2805 3089 -1396 1043 -520 -3557 -1837 413 3293 789 -844 -2728 326 -2221
7638b221m646j521m248l29J685n72J984o32nO4j998n06J777K476L844M900N108
$$ -2221 -6867 -8388 -12636 -12965 -11280 -11852 -9868 -10500 -10505 -10441 -12439 -12945 -11168 -8692 -4848 52 5160
7621E160N797k369m149m67J416j558l358L330j337j096K621L817m316n59m546
$$ 5160 10957 8588 4439 3972 5388 3830 472 3802 2465 1369 3990 7807 3491 2932 -1614
7606a614q493L589N725l833k554k653L341J555K614K955L140p22K84N656P05o395
$$ -1614 -10107 -6518 -793 -4626 -7180 -9833 -6492 -4937 -2323 632 3772 3050 3334 8990 9695 3300
7590C300p317j547j048M178J950O97Q23q278j498K30l104l605o505L261R214N827
$$ 3300 -4017 -5564 -6612 -2434 -484 213 1036 -7242 -8740 -8510 -11614 -15219 -21724 -18463 -9249 -3422
7574c422K675J864k83r79n836p72m409P53J059K684k609k095N594O505q83o617
$$ -3422 -747 1117 834 -145 -5981 -6753 -11162 -10409 -9350 -6666 -9275 -11370 -5776 729 -154 -6771
7558f771k359k46p690n364N12P788P860J886K941N007J0493K736J905L410o921
$$ -6771 -9130 -9376 -17066 -22430 -21918 -14130 -6270 -4384 -1443 3564 14057 16793 18698 22108 15187
7543A5187r481j0750k056m368p81m979r51N461R202O623k013L218O696J986J091
$$ 15187 5706 -5044 -7100 -11468 -12249 -17228 -18179 -12718 -3516 3107 1094 4312 11008 12994 14085
7528A4085r77n266n740K384Q8k283n640K51K485L829j481m491K438l5Q26J1034
$$ 14085 13108 7842 2102 4486 4574 2291 -3349 -3098 -613 3216 1735 -2756 -318 -353 473 11507
7512A1507N754R31j1848p887L279k291L71M348m387K523l340K910J779l606k565
$$ 11507 17261 18192 6344 -1543 1736 -555 -184 4164 -223 2300 -1040 1870 3649 43 -2522
7497b522m909K526M929j833N349M114L626L26k113k457q885l407o553j250R223
$$ -2522 -7431 -4905 24 -1809 3540 7654 11280 11606 9493 7036 -1849 -5256 -11809 -13059 -3836
7482c836k065l184L342M383j216m257N35J983N813N239J901j954m011k690j618
$$ -3836 -5901 -9085 -5743 -1360 -2576 -6833 -6298 -4315 1498 6737 8638 6684 2673 -17 -1635
7467a635J385j978o890K297J3093L604n288n550L162m62l266R211m716q231m62
$$ -1635 -250 -2228 -9118 -6821 6272 9876 4588 -962 2200 1738 -1528 7683 2967 -5264 -5726
7452e726k806j587J1079n7k226l441M770l05j160J342N193K996q96K484j692l475
$$ -5726 -8532 -10119 960 903 -1323 -4764 6 -299 -1459 -117 5076 8072 7176 9660 7968 4493
7436D493j631P42J379k887l351o368k792M726J952j0133N779M185l44l041J222
$$ 4493 2862 3604 4983 2096 -1255 -7623 -10415 -5689 -3737 -13870 -8091 -3906 -4250 -7291 -6069
7421f069L87k497L085j868R68N076k420J337O54K55N063r20L93j605o86L071n4
$$ -6069 -5682 -8179 -5094 -6962 -5994 -918 -3338 -2001 -1347 -1092 3971 3051 3444 1839 1153 4224 4170
7404D170l690j183L914J168o964Q18j209M491l796n915k387L834M109J305j0523
$$ 4170 480 -703 3211 4379 -2585 -1767 -2976 1515 -2281 -8196 -10583 -6749 -2640 -1335 -11858
7389a1858r033N51M122K620J535K308J647J043l461O16k795O52M850M219K578
$$ -11858 -20891 -20340 -16218 -13598 -12063 -9755 -8108 -7065 -10526 -9910 -12705 -12053 -7203 -2984 -406
7374d06l00J713N217n192l219J885J2369m846j3363J786R339M651k489m544l122
$$ -406 -706 1007 6224 1032 -2187 -302 12067 7221 -6142 -4356 4983 9634 7145 2601 -521
7359e21j31P30j389j294l210l779o87Q75L971L165N187j86K141k621m067p50o93
$$ -521 -652 78 -1311 -2605 -5815 -9594 -10281 -9406 -5435 -2270 2917 2731 4872 2251 -1816 -2566 -3259
7342c259J235K373O177n75r76r76j0231M875R977k208j094J066n833j862K044
$$ -3259 -2024 349 6526 5951 4975 3999 -6232 -1357 8620 6412 5318 6384 551 -1311 733
7327G33n474m974M829J288j436P17O56J565k84o4l230m250k183P49K078j793L564
$$ 733 -4741 -9715 -4886 -3598 -5034 -4317 -3661 -2096 -2380 -2444 -5674 -9924 -12107 -11358 -9280 -11073 -7509
7310g509M341n578p409k604Q982P960P879m710m637O892q388J506q733K72K878
$$ -7509 -3168 -8746 -16155 -18759 -9777 -1817 6062 1352 -3285 3607 -4781 -3275 -12008 -11736 -8858
7295h858N157L710n147j473n266J148L99m532K766m02j560o82Q363J402j535K711
$$ -8858 -3701 9 -5138 -6611 -11877 -10729 -10330 -14862 -12096 -12498 -14058 -14740 -6377 -4975 -6510 -3799
7279c799n4J291N062o16n032l120M490N478k46j306m086M130k335m011r670M166
$$ -3799 -3853 -2562 2500 1884 -3148 -6268 -1778 3700 3454 2148 -1938 2192 -143 -4154 -13824 -9658
7263i658k89l165O652j832l335o94L261R36J16q96K689J33p16l86N152M027k222
$$ -9658 -9947 -13112 -6460 -8292 -11627 -12321 -9060 -8124 -8008 -8904 -6215 -6082 -6798 -7184 -2032 1995 -227
7246b27P772M73p586K817m25p290o224N87L827K895N407L561j235j605n372R01
$$ -227 7545 8018 432 3249 2824 -4466 -10690 -10103 -6276 -3381 2026 5587 4352 2747 -2625 -1724
7230a724L923n583N135o57n407J398J0123l996l227K630j349j2076o450P172J89
$$ -1724 2199 -3384 1751 1094 -4313 -2915 7208 3212 -15 2615 1266 -10810 -17260 -10088 -9899
7215i899o408m432M806R022O073N16J964l46K944J393J813r98N962l378o668k226
$$ -9899 -16307 -20739 -15933 -6911 -838 -322 1642 1296 4240 5633 7446 6448 12410 9032 2364 138
7199A38M01k627m880K869M348j406J712J631n938j220K120K49L144k075k452n256
$$ 138 539 -2088 -6968 -4099 249 -1157 555 2186 -3752 -4972 -2852 -2603 541 -1534 -3986 -9242
7183i242j695k27L389M550M947J66O136K027l798p016o49m218L371J406K592K635
$$ -9242 -10937 -11164 -7775 -3225 1722 1888 8024 10051 6253 -763 -1412 -5630 -2259 -853 1739 4374
7167D374m876J41n417j211k039K824J922l472J870j75k41k268l705J436J2855
$$ 4374 -502 -361 -5778 -6989 -9028 -6204 -4282 -7754 -5884 -6059 -6300 -8568 -12273 -10837 2018
7152B018L254j110l131m830O723n46p670p933o645M635O285k249O232J2483N27
$$ 2018 5272 4162 1031 -3799 2924 2378 -5292 -13225 -19870 -15235 -8950 -11199 -4967 7516 8043
7137H043l075k642n956l508k297j8O631L240km584j514L459K244j251J383L606
$$ 8043 4968 2326 -3630 -7138 -9435 -9453 -2822 418 416 -4168 -5682 -2223 21 -1230 153 3759
7121C759k879k297L459l751q171M098P222O91Q23o165p046N29O346p279q95N527
$$ 3759 880 -1417 2042 -1709 -9880 -5782 1440 2131 2954 -3211 -10257 -9728 -3382 -10661 -11556 -6029
7105f029j290K064K676P207j923l140r6M197N5M796o660o548o41k319N943P27
$$ -6029 -7319 -5255 -2579 4628 2705 -435 -531 3666 3721 8517 1857 -4691 -5332 -7651 -1708 -981
7089i81n605J515P621q57l830k38N407j430m372j0243n933M985M494k31O314o90
$$ -981 -6586 -5071 2550 1693 -2137 -2375 3032 1602 -2770 -13013 -18946 -13961 -9467 -9698 -3384 -4074
7073d074N728L504k016K763m795j0641o00K024m650K100L902J296K891K805r86
$$ -4074 1654 5158 3142 5905 1110 -9531 -10131 -8107 -12757 -10657 -6755 -5459 -2568 237 -749
7058g49m952j31P072K938j0399M03K935K301j0980M589J987N50K779m91n249l79
$$ -749 -5701 -5832 1240 4178 -6221 -5818 -2883 -582 -11562 -6973 -4986 -4436 -1657 -2148 -7397 -7776
7042g776P88J490L566M172m603J854j613n513J892j027M598O08m863P30L072J741
$$ -7776 -6988 -5498 -1932 2240 -2363 -509 -2122 -7635 -5743 -6770 -2172 -1564 -6427 -5697 -2625 -884
7026h84k897J376j335j062O26m531J566N554m552l322M707P466k106J540m876
$$ -884 -3781 -2405 -3740 -4802 -4176 -8707 -7141 -1587 -6139 -9461 -4754 2712 606 2146 -2730
7011b730k771r43n636k74K737o684N971L569M286r8J289j907k447k95L514N73
$$ -2730 -5501 -6444 -12080 -12354 -9617 -16301 -10330 -6761 -2475 -2573 -1284 -3191 -5638 -5933 -2419 -1846
6995a846l027k530n520J179O529k176o044j461m033K811J3511M681J786L008n44
$$ -1846 -4873 -7403 -12923 -11744 -5215 -7391 -13435 -14896 -18929 -16118 -2607 2074 3860 6868 6324
6980F324o705n182m925k643K666R93M104J186O90k848M977L754p109M161L640
$$ 6324 -381 -5563 -10488 -13131 -10465 -9472 -5368 -4182 -3492 -6340 -1363 2391 -4718 -557 3083
6965C083O275J640j0076q744N654k757J241O909M757j432k564K618q17j1758j263
$$ 3083 9358 10998 922 -7822 -2168 -4925 -3684 3225 7982 6550 3986 6604 5787 -5971 -7234
6950g234j834j305L543K129K491n17M302k201j951J209Q2k89L154m88K438J564
$$ -7234 -9068 -10373 -6830 -4701 -2210 -2727 1575 -626 -2577 -1368 -1286 -1575 1579 1091 3529 5093
6934E093K273o143l936J393k711l51P036r95l281J469K82j978K336O18j083q58
$$ 5093 7366 1223 -2713 -1320 -4031 -4382 2654 1659 -1622 -153 129 -1849 487 1105 22 -836
6918h36L334L02L81p72J645J699j282j270j607J725l690j297k465K703j425k223
$$ -836 2498 2800 3181 2409 4054 5753 4471 3201 1594 3319 -371 -1668 -4133 -1430 -2855 -5078
6902e078K676P00J644J94k990m268L501M018m348L63J553J682j331L619o084k360
$$ -5078 -2402 -1702 -58 136 -2854 -7122 -3621 397 -3951 -3588 -2035 -353 -1684 1935 -4149 -6509
6886f509j159j912k400K597O281k773N254M404O91m356m067m32Q20n57n430j650
$$ -6509 -7668 -9580 -11980 -9383 -3102 -5875 -621 3783 4474 118 -3949 -4381 -3561 -4118 -9548 -11198
6870a1198J253L550L995R952J978n112o131M504L477k77n98o681k700l409k01
$$ -11198 -9945 -6395 -2400 7552 9530 4418 -1713 2791 6268 5991 5393 -1288 -3988 -7397 -7598
6855g598O281j564l754q257k05M481N504N105Q75n895M027p82l224n236j445J154
$$ -7598 -1317 -2881 -6635 -14892 -15097 -10616 -5112 -7 868 -5027 -1000 -1782 -5006 -10242 -11687 -10533
6839a0533M451J449j989l064M500K768j055r52l033K098n835P213P589n40k042
$$ -10533 -6082 -4633 -6622 -9686 -5186 -2418 -3473 -4425 -7458 -5360 -11195 -3982 3607 3067 1025
6824A025k875o052L342P67o639k222J464K430N988j969j369p10j839j225M708
$$ 1025 -1850 -7902 -4560 -3793 -10432 -12654 -11190 -8760 -2772 -4741 -6110 -6820 -8659 -9884 -5176
6809e176N083O72J301M347q97J755p351n990N513N081J811J797J689m96m511n439
$$ -5176 -93 579 1880 6227 5330 7085 -266 -6256 -743 4338 6149 7946 9635 9139 4628 -811
6793h11o857m958M956O582Q370o036r819n97L36l12L030L112j251J916N64p9K921
$$ -811 -7668 -12626 -7670 -1088 7282 1246 -8573 -9170 -8834 -9146 -6116 -3004 -4255 -2339 -1775 -1854 1067
6776A067M642j774j340J069n591J43J183j326M708K015O050k512n746J605K631
$$ 1067 5709 3935 2595 3664 -1927 -1784 -601 -1927 2781 4796 10846 8334 2588 4193 6824
6761F824O403J314J263l673q568k563n132k681K952K861n16Q261J390j745L303
$$ 6824 13227 14541 15804 12131 3563 1000 -4132 -6813 -3861 -1000 -1516 6745 8135 6390 9693
6746I693p26r53k120n261p186l708M311J567J76k599j120L471k209p6j641M146
$$ 9693 8967 8014 5894 633 -6553 -10261 -5950 -4383 -4207 -6806 -7926 -4455 -6664 -6740 -8381 -4235
6730d235R63R49o144r578O37K323j966M021N354k69R32M084K204m207n931J330
$$ -4235 -3272 -2323 -8467 -18045 -17408 -15085 -17051 -13030 -7676 -7945 -7013 -2929 -725 -4932 -10863 -9533
6714i533J0084m30q957m155J417n34l626L741J3P022J928M978K297M243J80j404
$$ -9533 551 121 -8836 -12991 -11574 -12108 -15734 -11993 -11980 -4958 -3030 1948 4245 8488 8668 7264
6698G264p402M42l280k025n436K662m520N077L573K037J811J452N637L848J073
$$ 7264 -138 304 -2976 -5001 -10437 -7775 -12295 -7218 -3645 -1608 203 1655 7292 11140 12213
6683A2213P65o946m154O45j042l283L693j86M249P661l476m235k499J036n294
$$ 12213 12978 6032 1878 2523 1481 -1802 1891 1705 5954 13615 10139 5904 3405 4441 -853
6668h53n598p70M874J63k44K866L0k166n293l656L21j291M335P13J272j14j039
$$ -853 -6451 -7221 -2347 -2184 -2428 438 468 -1698 -6991 -10647 -10326 -11617 -7282 -6569 -5297 -5411 -6450
6651f450o541n970L592M065M757N442J571K922k343m245M89L795J405M299q094
$$ -6450 -12991 -18961 -15369 -11304 -6547 -1105 466 3388 1045 -3200 -2711 1084 2489 6788 -1306
6636a306j114M766P25m166q232o31P236J59k642J0551M663m967k717r123j236
$$ -1306 -2420 2346 3071 -1095 -9327 -9958 -2722 -2563 -5205 5346 10009 5042 2325 -6798 -8034
6621h034J7k169j738N627K325m059n688m219L071M851L626Q455O136J361J005
$$ -8034 -8017 -10186 -11924 -6297 -3972 -8031 -13719 -17938 -14867 -10016 -6390 2065 8201 9562 10567
6606A0567l481n813M119j151m50j027R94K462j066m696J823L993k156o226n957
$$ 10567 7086 1273 5392 4241 3791 2764 3758 6220 5154 458 2281 6274 4118 -2108 -8065
6591h065J875O935n05L041l3q237j954J962K907j827M442p378l084J0168R019
$$ -8065 -6190 745 240 3281 3248 -4989 -6943 -4981 -2074 -3901 541 -6837 -9921 247 9266
6576I266M943M903j0696j4188o444J968K970O259m969o749P254M633J740j66l978
$$ 9266 14209 19112 8416 -5772 -12216 -10248 -7278 -1019 -5988 -12737 -5483 -850 890 724 -3254
6561c254n616J361M08l37M834J194o217k553O857J746J688l201p196l020J0621
$$ -3254 -8870 -7509 -7101 -7438 -2604 -1410 -7627 -10180 -3323 -1577 111 -3090 -10286 -13306 -2685
6546b685P516r385r571L675K355J4038P046k656m012j270k607K478j485l583L76
$$ -2685 4831 -4554 -14125 -10450 -8095 5943 12989 10333 6321 5051 2444 4922 3437 -146 230
6531B30O64n78k404O92K623P44J282k804k657k614k708m632P397P351N133m161
$$ 230 894 316 -2088 -1396 1227 1971 3253 449 -2208 -4822 -7530 -12162 -4765 2586 7719 3558
6515C558N342J295p368p201q1L427K167q15J521k412j796O161K881N753l297k219
$$ 3558 8900 10195 2827 -4374 -4455 -1028 1139 324 1845 -567 -2363 3798 6679 12432 9135 6916
6499F916j560J835K030k790k304M963K073L982j12m371p434k371r83o259j741
$$ 6916 5356 7191 9221 6431 4127 9090 11163 15145 15033 10662 3228 857 -126 -6385 -8126
6484h126J174J862N110K161k319J145Rn167m260O08m783M958J755J032l344o222
$$ -8126 -6952 -5090 20 2181 -138 1007 1016 -4151 -8411 -7803 -12586 -7628 -5873 -4841 -8185 -14407
6468a4407j379o858L211O220K656J452P991O221P230o916q221m121J763N737j046
$$ -14407 -15786 -22644 -19433 -13213 -10557 -9105 -1114 5107 12337 5421 -2800 -6921 -5158 579 -467
6453d67K980K451j477N20M011M170k549j1248k020l881L477M620k805q67N932
$$ -467 2513 4964 3487 4007 8018 12188 9639 -1609 -3629 -7510 -4033 587 -2218 -3085 2847
6438B847J055J986Q84l687k170K48K378k706k571K38K116m99m679J794J726r04
$$ 2847 3902 5888 6772 3085 915 1163 3541 835 -1736 -1498 618 119 -4560 -2766 -1040 -1944
6422a944j424P83p669l126P10J767L573p49r94k953L240P219J59J085L806k079
$$ -1944 -3368 -2585 -10254 -13380 -12670 -10903 -7330 -8079 -9073 -12026 -8786 -1567 -1408 -323 3483 1404
6406A404K07K946l395j0668Q74k350l49N730N858j577K733N14l765j533L558J154
$$ 1404 1611 4557 1162 -9506 -8632 -10982 -11331 -5601 257 -1320 1413 1927 -1838 -3371 187 1341
6390A341O20l41K571j593j1331M813J0652J947j0387o351M830O179M337P58j985
$$ 1341 1961 1620 4191 2598 -8733 -3920 6732 8679 -1708 -8059 -3229 2950 7287 8045 6060
6375F060j063k476l794J548k582m29p82j711M946L912L500N92j430q412k137L783
$$ 6060 4997 2521 -1273 275 -2307 -2736 -3518 -5229 -283 3629 7129 7721 6291 -2121 -4258 -475
6359d75O0n038k49q849k796P664P035L829j512o568K142m515j0939l21J0370J2047
$$ -475 -415 -5453 -5702 -14551 -17347 -9683 -2648 1181 -331 -6899 -4757 -9272 -20211 -20532 -10162 1885
6343A885P938L797o695r560M167L568k623o22K841j21l383k181l706m71J163K876
$$ 1885 9823 13620 6925 -2635 1532 5100 2477 1855 4696 4575 1192 -989 -4695 -5166 -4003 -1127
$$ [...]
##END NTUPLES=NMR SPECTRUM
##END=
