##TITLE=Analysis number 328754
Compound Code cc 02302
Book Reference lab3
Project Code adrs
Chemist Name stores
##JCAMPDX= 6.0         $$ Bruker NMR JCAMP-DX V2.0
##DATA TYPE= NMR SPECTRUM
##DATA CLASS= NTUPLES
##ORIGIN= Bruker BioSpin GmbH
##OWNER= nmr
$$ XWIN-NMR		Version 3.5
$$ Mon Jul  2 12:07:57 2007 GMT Daylight Time (UT+1h)  MAYBRIDGE\nmr@NMR_250MHZ
##.OBSERVE FREQUENCY= 250.131544655141
##.OBSERVE NUCLEUS= ^1H
##.ACQUISITION MODE= SIMULTANEOUS (DQD)
##.ACQUISITION SCHEME= undefined
##.AVERAGES= 16
##.DIGITISER RES= 18
##SPECTROMETER/DATA SYSTEM= dpx250
##.PULSE SEQUENCE= zg30
##.SOLVENT NAME= CDCl3
##.SHIFT REFERENCE= (INTERNAL, CDCl3, 0, 16.522)
##AUDIT TRAIL= $$ (NUMBER, WHEN, WHO, WHERE, WHAT)
$$ ##TITLE= Audit trail, XWIN-NMR		Version 3.5
$$ ##JCAMPDX= 5.01
$$ ##ORIGIN= Bruker BioSpin GmbH
$$ ##OWNER= nmr
$$ C:\u/data/dgb/nmr/ADRS/90/pdata/1/auditp.txt
$$ ##AUDIT TRAIL=  $$ (NUMBER, WHEN, WHO, WHERE, WHAT)
(   1,<2007-07-02 12:07:31.68 +100>,<MAYBRIDGE\nmr>,<NMR_250MHZ>,
      <created by zg, POWCHK disabled, PULCHK disabled
       configuration hash MD5:
       76 6E 9A 78 1E 09 19 81 EC 84 63 8F B0 6A 59 2D
       data hash MD5: 64K
       70 2D A1 D9 3D 98 4D 25 F3 0C F3 FB 7A 9E ED 8E>)
(   2,<2007-07-02 12:07:45.77 +100>,<MAYBRIDGE\nmr>,<NMR_250MHZ>,
      <Start of raw data processing
       ef LB = 0.3 FT_mod = 6 PKNL = 1 SI = 32K 
       data hash MD5: 32K
       53 12 E2 7B 8B 72 A7 C7 AB BF AE A5 31 BC AB 12>)
(   3,<2007-07-02 12:07:47.58 +100>,<MAYBRIDGE\nmr>,<NMR_250MHZ>,
      <apk 
       data hash MD5: 32K
       CE E4 15 95 92 22 0B D1 1E 84 B4 99 8D FC 60 CD>)
(   4,<2007-07-02 12:07:48.32 +100>,<MAYBRIDGE\nmr>,<NMR_250MHZ>,
      <abs ABSG = 5 
       data hash MD5: 32K
       74 AA 93 7D AE 25 CD E7 66 D1 38 23 80 A5 B2 4E>)
$$ ##END=
$$ 
$$ hash MD5
$$ 43 75 A9 8A E7 75 DB C3 90 29 46 38 1F 1D 62 56
##$RELAX= 
##$RELAX= 
##$RELAX= 
##$RELAX= 
##$RELAX= 
##$RELAX= 
##$RELAX= 
$$ Bruker specific parameters
$$ --------------------------
##$DU= <C:\u>
##$EXPNO= 90
##$NAME= <ADRS>
##$PROCNO= 1
##$TYPE= <nmr>
##$USER= <dgb>
##$AMP= (0..31)
100 100 100 100 100 100 100 100 100 100 100 100 100 100 100 100 100 100 
100 100 100 100 100 100 100 100 100 100 100 100 100 100 
##$AQSEQ= 0
##$AQ_mod= 3
##$AUNM= <au_zg>
##$AUTOPOS= <19 >
##$BF1= 250.13
##$BF2= 250.13
##$BF3= 250.13
##$BF4= 250.13
##$BF5= 500.13
##$BF6= 500.13
##$BF7= 500.13
##$BF8= 500.13
##$BYTORDA= 1
##$CFDGTYP= 0
##$CFRGTYP= 5
##$CHEMSTR= <none>
##$CNST= (0..31)
1 1 145 1 1 1 1 1 1 1 1 1 1 1 1 1 1 1 1 1 1 1 1 1 1 1 1 1 1 1 1 1 
##$CPDPRG= <>
##$CPDPRG1= <>
##$CPDPRG2= <>
##$CPDPRG3= <>
##$CPDPRG4= <mlev>
##$CPDPRG5= <mlev>
##$CPDPRG6= <mlev>
##$CPDPRG7= <mlev>
##$CPDPRG8= <mlev>
##$CPDPRGB= <>
##$CPDPRGT= <>
##$D= (0..31)
0 1 0 0 0 0 0 0 0 0.06 0 0 0 0 0 0 0.0002 0 0 0 0 0 0 0 0 0 0 0 0 0 0 
0 
##$DATE= 1183374450
##$DBL= (0..7)
120 120 120 120 120 120 120 120 
##$DBP= (0..7)
150 150 150 150 150 150 150 150 
##$DBP07= 0
##$DBPNAM0= <>
##$DBPNAM1= <>
$$ [...]
##$SUBNAM7= <"">
##$SUBNAM8= <"">
##$SUBNAM9= <"">
##$SW= 20.6930455092707
##$SWIBOX= (0..15)
0 0 3 0 0 0 0 0 0 0 0 0 0 0 0 0 
##$SW_h= 5175.983436853
##$TD= 65536
##$TD0= 1
##$TE= 296.16
##$TE2= 300
##$TE3= 300
##$TEG= 300
##$TL= (0..7)
0 120 120 120 120 120 120 120 
##$TP= (0..7)
150 150 150 150 150 150 150 150 
##$TP07= 0
##$TPNAME0= <>
##$TPNAME1= <>
##$TPNAME2= <>
##$TPNAME3= <>
##$TPNAME4= <>
##$TPNAME5= <>
##$TPNAME6= <>
##$TPNAME7= <>
##$TPOAL= (0..7)
0.5 0.5 0.5 0.5 0.5 0.5 0.5 0.5 
##$TPOFFS= (0..7)
0 0 0 0 0 0 0 0 
##$TUNHIN= 0
##$TUNHOUT= 0
##$TUNXOUT= 0
##$USERA1= <user>
##$USERA2= <user>
##$USERA3= <user>
##$USERA4= <user>
##$USERA5= <user>
##$V9= 5
##$VALIST= <valist>
##$VCLIST= <CCCCCCCCCCCCCCC>
##$VD= 0
##$VDLIST= <DDDDDDDDDDDDDDD>
##$VPLIST= <PPPPPPPPPPPPPPP>
##$VTLIST= <TTTTTTTTTTTTTTT>
##$WBST= 1024
##$WBSW= 4
##$XGAIN= (0..3)
0 0 0 0 
##$XL= 0
##$YL= 0
##$YMAX_a= 477578
##$YMIN_a= -469436
##$ZGOPTNS= <>
##$ZL1= 120
##$ZL2= 120
##$ZL3= 120
##$ZL4= 120
##$ABSF1= 16.522
##$ABSF2= -4.171173
##$ABSG= 5
##$ABSL= 3
##$ALPHA= 0
##$AQORDER= 0
##$ASSFAC= 0
##$ASSFACI= 0
##$ASSFACX= 0
##$ASSWID= 0
##$AUNMP= <proc_1d>
##$AZFE= 0.1
##$AZFW= 0.1
##$BCFW= 0
##$BC_mod= 0
##$BYTORDP= 0
##$COROFFS= 0
##$CY= 12.5
##$DATMOD= 1
##$DC= 0
##$DFILT= <>
##$DTYPP= 0
##$F1P= 14.0000005364418
##$F2P= -0.99999901652339
##$FCOR= 0.5
##$FTSIZE= 32768
##$FT_mod= 6
##$GAMMA= 0
##$GB= 0
##$INTBC= 1
##$INTSCL= 1
##$ISEN= 128
##$LB= 0.3
##$LEV0= 0
##$LPBIN= 0
##$MAXI= 10000
##$MC2= 0
##$MEAN= 0
##$ME_mod= 0
##$MI= 0
##$NCOEF= 0
##$NC_proc= -1
##$NLEV= 6
##$NOISF1= 0
##$NOISF2= 0
##$NSP= 0
##$NTH_PI= 0
##$NZP= 0
##$OFFSET= 16.522
##$PC= 1
##$PHC0= -52.33112
##$PHC1= 7.207032
##$PH_mod= 1
##$PKNL= yes
##$PPARMOD= 0
##$PSCAL= 4
##$PSIGN= 0
##$REVERSE= no
##$SF= 250.13
##$SI= 32768
##$SIGF1= 0
##$SIGF2= 0
##$SINO= 400
##$SIOLD= 32768
##$SREGLST= <1H.CDCl3>
##$SSB= 0
##$STSI= 32768
##$STSR= 0
##$SW_p= 5175.98343685301
##$SYMM= 0
##$S_DEV= 0
##$TDeff= 65536
##$TDoff= 0
##$TI= <Analysis number 999999
Compound Code 99
Book Reference 9
Project Code 9>
##$TILT= no
##$TM1= 0
##$TM2= 0
##$TOPLEV= 0
##$USERP1= <user>
##$USERP2= <user>
##$USERP3= <user>
##$USERP4= <user>
##$USERP5= <user>
##$WDW= 1
##$XDIM= 32768
##$YMAX_p= 551064373
##$YMIN_p= -73508
$$ End of Bruker specific parameters
$$ ---------------------------------
##NTUPLES= NMR SPECTRUM
##VAR_NAME=  FREQUENCY,     SPECTRUM/REAL,   SPECTRUM/IMAG
##SYMBOL=    X,             R,               I
##VAR_TYPE=  INDEPENDENT,   DEPENDENT,       DEPENDENT
##VAR_FORM=  AFFN,          ASDF,            ASDF
##VAR_DIM=   32768,         32768,           32768
##UNITS=     HZ,            ARBITRARY UNITS, ARBITRARY UNITS
##FACTOR=    0.157963299565203, 1,           1
##FIRST=     4132.6476996994, 0,             0
##LAST=      -1043.33573715361, 0,           0
##MIN=       -1043.33573715361, -73508,      0
##MAX=       4132.6476996994, 551064373,     0
$$ Real data points
##PAGE= N=1
##DATA TABLE= (X++(R..R)), XYDATA
$$ [...]
##PAGE= N=2
##DATA TABLE= (X++(I..I)), XYDATA
20145 185789 183386 180993 185058 190548 191946 191239 181561 184863 190454 178570 174465 180336 179918 180564 179334
20130 179334 183349 187981 187867 188377 190513 192490 189639 189429 187492 183041 178869 179418 175875 173541 172922
20115 172922 171970 176917 185432 187842 189094 185804 183900 187361 191532 194506 196382 190094 183098 185050
20101 185050 193025 188550 185986 185269 181826 182761 183944 184795 182879 187757 194781 195956 195447 189781 184230
20086 184230 189876 193339 195785 198672 192044 190791 189225 186573 186806 179931 176884 179614 178534 180818
20072 180818 183989 187721 188308 185092 181356 181068 182099 189908 194088 193083 195776 190451 187103 186641 188642
20057 188642 191639 189073 181824 180393 183177 192637 194457 190303 189595 182980 180170 181562 190566 186885
20043 186885 187174 189578 185487 185504 184331 183621 184689 183229 180683 177157 179551 186628 187308 183957 180513
20028 180513 180480 185126 188242 182620 181768 182937 179850 177716 182674 185454 182584 183471 187270 186671 186091 182372
20012 182372 179143 173080 172128 171398 176867 179358 181026 178058 180443 179623 177466 174815 176131 187622 191331
19997 191331 190486 186121 181316 187033 189890 187710 186714 186155 186951 187319 189690 189922 187107 188488 190310 187313
19981 187313 189486 194656 197233 198059 192770 186951 184162 184574 184090 181651 181358 175569 174483 179186 184452
19966 184452 190101 189564 184763 186837 188711 191607 191452 191004 187437 189526 189789 189366 185644 179288 172024
19951 172024 170651 179686 181136 180920 180751 182002 185477 188468 187079 183939 179888 177253 177168 180085 192189
19936 192189 193171 188930 190925 194766 194345 191750 190289 188923 185209 188147 187539 183740 185188 187291 193508
19921 193508 197430 198187 195675 189450 193199 196679 192655 192201 192192 194424 193072 189514 190600 185652 181647
19906 181647 187308 187015 190813 189869 189204 187479 184453 185236 185675 190902 196211 200111 196380 194952 192354
19891 192354 189929 189649 191395 189604 192997 194623 192641 191443 195784 196693 197538 199500 197576 196101 198336
19876 198336 198707 196286 193318 192783 190989 189075 185633 183874 184655 186455 184125 177980 181583 181650 189632
19861 189632 192092 192767 191076 191565 191598 193589 196291 197774 196431 196612 195730 191291 186097 192983 198160 198021
19845 198021 193856 197500 197489 195092 194198 191322 192376 196056 191097 190384 192057 186554 185720 188945 187816
19830 187816 184692 185905 186960 192679 191422 192390 191370 196332 198347 199620 199752 198273 196924 194679 198185
19815 198185 191425 190417 191591 190839 190122 195959 192890 187048 192870 198836 198340 199712 203283 199450 193103
19800 193103 191243 194323 195555 197368 196673 198320 201826 194460 188605 187841 191856 194853 197545 199738 194128
19785 194128 191439 190194 186109 182415 181699 191479 194177 195518 193967 193838 192764 189196 194406 199775 195696
19770 195696 193118 196173 196192 196244 196491 197591 196848 200406 198415 196766 195869 196825 197981 199663 203241 199334
19754 199334 197120 195898 197972 199157 197502 200977 201239 203276 201216 202122 198094 199780 197889 200308 201274
19739 201274 201552 199317 199222 199350 200173 194802 196121 197793 198690 198112 198641 195081 196072 192036 192719 201326 202315
19722 202315 198093 199065 200269 198937 195651 194409 197848 198864 201887 204621 202132 205827 207554 207911 210111
19707 210111 209074 203076 196509 197744 201183 202307 199178 197952 199652 201019 199266 200947 199439 203953
19693 203953 205936 205885 208720 203498 197503 195635 197334 206553 201325 200361 200345 198884 198458 201355 203609 206354
19677 206354 206192 199040 193505 192901 197166 201031 199807 207828 213558 212094 208603 200672 195929 193333 194807
19662 194807 199424 197905 202768 206710 206831 201537 202674 201697 199749 196563 197830 192666 197121 211360
19648 211360 217860 215709 213613 212823 208080 205204 207369 212063 215269 215129 210402 204373 196158 200482 206173
19633 206173 206480 210165 206891 206334 202264 202384 204610 203526 209514 214027 213247 204721 202811 203555 205265
19618 205265 205851 204856 205214 203405 204003 204843 206092 210329 210356 209651 206187 203967 199898 201518 206755 211269
19602 211269 217887 213335 212545 212482 214027 215080 210478 211468 212394 212451 213628 216458 217380 212558 211207 212005
19586 212005 215210 220512 220633 220970 225160 226099 224934 225515 223585 219890 223299 220419 221522 223774 226907
19571 226907 222601 222020 220746 216288 215729 216487 218173 228209 234426 237585 239356 246742 253284 253856 261989
19556 261989 265881 267214 269849 268002 266332 265428 273346 288011 292548 263059 226269 212345 215252
19543 215252 217385 197326 160494 140504 141972 151886 151399 137728 132742 128262 133962 142430 148905
19530 148905 153846 159234 158229 157349 162261 162915 165958 177489 175861 178284 180524 184227 186769 191926
19516 191926 195169 190782 182394 180644 183492 183372 179272 177996 177732 177912 189689 187747 181793 183196 185293
19501 185293 188859 189939 185484 181656 188328 188698 189227 189063 183484 178535 178637 184013 191211 188826 195782
19486 195782 200909 203276 200442 202771 207035 205352 203079 206628 207516 205222 199453 195127 198353 196383
19472 196383 193297 184913 188912 191578 197481 199480 200190 202112 202402 201740 202037 208934 206206 202323 206101
19457 206101 206520 201828 201479 199741 200144 197542 193050 195152 195405 198750 206794 201985 202370 197622 196221
19442 196221 198978 196568 195356 196700 203989 201954 200510 200065 206756 211155 205524 204997 201895 197843 199100
19427 199100 200545 200613 205445 204427 213506 213984 211265 211996 217404 216682 213637 215384 215840 202679 194931
19412 194931 201606 207425 213575 213622 208434 206067 206058 207933 208865 205768 207365 211382 215643 215184 214883 211867
19396 211867 209462 212907 212942 213685 215732 215869 213917 213376 216807 218916 219841 213408 210790 210868 214484 214147
19380 214147 209085 207106 207268 211176 210571 210617 207506 211537 208871 212769 212024 213667 212199 209715 210262 209095
19364 209095 208498 207873 206710 202131 206928 209444 213927 215475 213200 210326 212465 212912 215558 216357 214990
19349 214990 216787 216033 210262 209080 213068 214233 204825 200717 207844 211107 211657 208124 209518 208369 209080
19334 209080 214500 215365 214034 209997 205949 211529 213093 213601 219313 219108 222861 224320 223458 220498 214956
19319 214956 213540 217283 215560 209587 211073 216496 220168 216907 215842 221889 222295 219122 211804 214333
19305 214333 215578 209861 211907 217394 219634 218467 214904 214558 214599 216658 220590 220215 214566 213174 211914
19290 211914 211731 213356 213559 215256 215926 219482 223433 224753 221993 219270 215217 206671 198418 197103 199919
19275 199919 201170 206366 204699 206497 206633 205744 213455 222485 218698 215110 215245 218600 220384 215513 216714
19260 216714 222678 224316 222632 219578 219182 218406 221189 221373 219784 218806 220185 218792 216201 216259 218061 213115
19244 213115 212669 216542 221663 220423 214510 216767 217671 220440 217518 223366 222804 223520 226326 226567 219507
19229 219507 214207 207135 205942 211261 215460 214874 209552 214635 215918 213904 222190 228693 229771 220931
19215 220931 217535 216585 219224 217909 222401 225758 226656 230300 225940 220613 220325 217710 223744 230532 232418
19200 232418 227684 220681 216976 216485 223060 230125 227955 221158 219238 222420 224804 233606 236068 224656
19186 224656 222149 223139 228282 229757 227671 227174 227823 228418 226540 223904 224637 227115 229169 230268 228177
19171 228177 226445 228529 227141 229360 230699 231822 236773 244866 248581 246352 242905 237837 231088 224087
19157 224087 221242 221471 218485 219472 223213 224392 221744 222395 222074 220363 217796 216963 217592 217581 209401 206319
19141 206319 211649 217801 222393 225319 226331 226515 218697 217821 214923 221462 230126 235157 234553 229747 228514
19126 228514 230205 230968 231641 233507 228134 227930 232434 234192 235510 229889 228518 234520 238844 240025 243452
19111 243452 247103 248945 245101 239129 238118 235197 226359 211766 206666 208207 205590 205055 209544 209941
19097 209941 210246 209212 214879 217978 218092 219854 220320 221966 214874 213738 218689 217141 213281 219000 219814
19082 219814 219433 224401 222936 217770 220307 222221 226209 223342 221451 219813 219035 215713 215083 220664 223967
19067 223967 220590 227285 228455 226523 218354 216560 215986 221150 224046 224378 226360 229167 227270 227214 228755
19052 228755 229085 228840 225346 226902 226943 227967 229471 229492 225127 230325 232078 234138 236916 240764 238503 241066
19036 241066 236949 229591 225126 229565 233357 232222 232318 228282 227995 232942 237020 235183 235005 233961 228930
19021 228930 228799 228660 230214 231445 230165 223661 224398 224257 223574 228533 227016 224784 226069 228181 231670
19006 231670 230420 229603 225740 229676 236774 232851 230711 236623 237524 239648 233334 224721 220005 229302 232477
18991 232477 227633 225098 224742 227068 228235 228082 229993 231270 225776 221899 223765 227723 225009 223499 226612
18976 226612 237230 237299 235284 226556 227187 229464 231433 232601 232967 235928 241302 236253 229649 231085 231755
18961 231755 232580 230821 228905 223377 226025 225362 218825 218736 224766 227084 224376 225047 222624 230456 238583
18946 238583 239849 244832 246446 245192 243788 242668 241161 238922 240123 245750 246559 247370 251133 247476 241808
18931 241808 240864 237740 239395 243257 242939 241063 233378 234003 237748 237759 233106 231739 232945 235547 229940
18916 229940 232870 233194 236233 239594 245698 248552 249665 248627 246066 245521 245493 247497 247920 247183 249622 252658
18900 252658 255404 249591 244918 241088 238284 241351 242342 234582 235625 240215 235804 233728 238208 241347
18886 241347 242641 243099 241006 242005 240486 245328 252361 252476 253269 245995 246613 245554 248828 244180 238701
18871 238701 242731 243729 233467 234691 243557 244920 247704 249593 251498 250732 249177 247741 248839 253770
18857 253770 251329 244163 250481 250781 251939 249909 248760 242744 238775 237290 238780 243732 248301 241426
18843 241426 241356 245347 248364 245540 246552 251455 247025 247182 243670 243712 246018 251933 252945 253847 253226 250010
18827 250010 245472 243292 252953 262431 258605 251322 247530 241128 244134 255204 258294 262214 264834 257895
18813 257895 252162 252261 252660 248053 245239 251871 251555 253470 258827 264110 263839 263383 258197 248001 246078
18798 246078 253455 259610 257329 261759 258031 255549 257565 260669 261310 262732 259953 261899 266303 264211
18784 264211 262489 261334 257811 253912 253875 256274 262913 269134 270312 279854 284046 278525 274775 279440 284828
18769 284828 290007 295235 297411 273340 243694 222541 218426 222057 227830 233849 237206 239546 243883
18756 243883 246003 246055 245421 246231 252033 257114 253085 250649 247565 250822 252081 249634 248920 251727 252187 247301
18740 247301 248663 250223 254399 255376 253394 255150 262125 267291 265709 265832 262971 259821 259202 260840 264982
18725 264982 266985 258707 258674 258673 256687 259883 261903 256772 261383 262912 261885 265000 266519 264794 262964
18710 262964 265280 265374 267362 266488 259810 258949 262266 263129 264240 266087 266665 263104 259482 256529 265153 268144
18694 268144 270158 267702 268270 273776 276183 275145 274093 275261 271711 272310 267830 266367 266074 264483 264553
18679 264553 266163 271579 271792 270317 267483 265398 264539 259684 263375 270357 275132 274479 278723 277785 280750
18664 280750 280342 277898 273699 269999 268151 269677 269810 270054 268111 261324 265421 271240 270523 270053 269663 275471
18648 275471 277943 278544 281258 281047 280529 280522 276696 276894 278884 273568 272223 272173 271098 272283 275896 273615
18632 273615 270493 274521 272862 272509 278344 283996 281877 282727 283812 278922 279101 283035 285374 280953 281104
18617 281104 278908 284275 288998 288344 289334 287121 287123 284187 285034 284410 285265 288719 282462 276664 274799 274145
18601 274145 276219 279438 282215 280358 281854 282659 293089 290762 286877 291555 289585 286263 289475 291673
18587 291673 287201 279005 277346 282240 287978 290530 283146 277289 280566 283268 284949 283935 288885 293249
18573 293249 297459 295915 296686 299767 301587 303240 306029 308579 303776 308761 307822 301674 298094 300201 302305
18558 302305 297524 291396 294632 303366 306709 302572 300773 300489 297605 297748 294808 294435 298198 295677 294499
18543 294499 290333 289511 297408 304256 305960 306355 306327 301581 296979 292461 292874 297443 298251 303777 306540 309294
18527 309294 309492 305260 307008 305413 305437 307739 306614 305629 300259 300523 298724 293498 293693 297669 302154 309332
18511 309332 309805 306434 310494 310594 305303 303715 304843 300913 304684 300810 295527 300354 304023 302660 307147
18496 307147 308640 310021 301397 309320 315625 316726 316987 316208 312817 310265 304723 304789 310352 314639 315878
18481 315878 316949 322706 320995 317116 315855 315356 322384 324678 319877 314696 315981 321691 325318 321115
18467 321115 321341 324763 328926 327978 327314 329014 321996 320748 319207 317155 317843 324190 323654 321153 320077
18452 320077 320379 323562 324342 321782 328381 325854 329192 331532 326317 330059 335989 338424 333299 337098 340648
18437 340648 339626 336029 329426 332719 336585 338414 346245 350500 353256 350282 342581 339068 340993 345729
18423 345729 344743 341787 341742 340097 341374 340773 343094 347424 349143 351564 351642 352538 351920 349547 345270 341475
18407 341475 344458 350904 347838 351627 357529 359216 358612 359496 362879 363207 361683 358750 356437 361120 359241
18392 359241 358954 356924 354707 365870 368158 364813 361330 364113 365562 364047 366512 370961 370987 370123 370981
18377 370981 368664 368643 368944 371636 377630 383724 385475 388011 387221 383795 387982 385888 387588 384318 380178
18362 380178 381362 384751 380623 377310 372159 367291 365884 370178 372036 372817 374478 373192 378029 380519
18348 380519 376113 369390 365402 370506 374240 378726 378707 374336 374721 376829 377747 377151 377742 377195 374599 375490
18332 375490 381721 392281 393941 395127 397113 392969 393666 400308 405716 406293 405340 409784 413691 414537 408289
18317 408289 402357 407948 413207 414434 413493 416256 421309 423571 419445 420908 419930 418958 419567 418506 415363
18302 415363 416238 408953 405205 396591 394614 404153 405716 401694 401767 404098 407526 417892 425623 425821 426513
18287 426513 427155 430057 431909 428268 428673 427527 429644 430347 436247 445803 443738 442700 446016 451325 457948
18272 457948 460939 458610 460544 460346 457362 455380 452798 448560 448168 450103 454919 458442 456919 453801 455768
18257 455768 464287 465764 470397 474183 474872 471865 477158 484950 485963 487832 494385 494723 497793 500163 502979
18242 502979 497889 499968 498628 496216 502274 509719 519552 527532 521175 511730 512357 517896 523231 521288
18228 521288 525322 525733 529087 535792 538624 543353 540042 541060 546241 550214 553068 558214 558169 561924 566472
18213 566472 569181 572408 572522 580392 585793 586227 588676 593837 593031 597545 601712 602215 608440 613370 616922
18198 616922 618592 630785 630761 633497 638675 636524 637633 633509 634911 644160 657328 663817 664836 670969
18184 670969 673039 681897 696398 702276 706735 713848 718248 718726 722519 732021 744709 754003 763790 771006
18170 771006 781377 788077 790833 795406 806924 817771 828998 833680 841905 856895 868770 877811 886149
18157 886149 896956 911140 929141 940869 952222 969827 985487 999583 1017586 1031749 1048272
18146 1048272 1069515 1093666 1117907 1145284 1175150 1198647 1223202 1247402 1276485 1304947 1340049
18135 1340049 1373851 1409089 1445634 1488922 1540844 1593357 1649929 1712319 1787228 1865743 1945108
18124 1945108 2037168 2135738 2252538 2396286 2555136 2726945 2925299 3174377 3480731 3856849
18114 3856849 4345218 4972840 5801578 6908792 8204998 8664385 5493635 -879127 -5791341
18105 -5791341 -6982047 -6208587 -5162704 -4344804 -3744638 -3283675 -2895105 -2559425 -2257623
18096 -2257623 -2000325 -1782081 -1601573 -1459916 -1339935 -1239355 -1143637 -1053457 -965375 -885338
18086 -885338 -820061 -775645 -738195 -695924 -643924 -582591 -520483 -463784 -414906 -364354 -314325
18075 -314325 -270220 -223342 -180895 -139681 -92028 -43178 -7839 16476 34548 59127 84550
18064 84550 97382 97700 99745 106330 120341 133870 96310 -3731 -123313 -206409 -231376 -199873
18052 -199873 -140560 -88697 -62975 -91993 -166280 -260182 -344912 -395749 -413450 -399545 -369485
18041 -369485 -325076 -276597 -232157 -182568 -130542 -89449 -48349 -13672 25369 65493 92758
18030 92758 99216 77967 42225 18257 20100 47156 86238 129139 182541 235937 290664 357867
18018 357867 438858 531383 603557 623260 552056 394654 195519 22180 -92103 -164687 -233772
18007 -233772 -312554 -384534 -422265 -413455 -387959 -377174 -379806 -378632 -356353 -321270 -286351 -246178
17995 -246178 -203161 -166287 -140551 -122151 -101478 -77067 -56407 -37718 -19285 -197 21889
17984 21889 42705 67598 83050 92940 106882 126618 147325 167382 184415 197886 219680 248183
17972 248183 279140 305729 331187 364639 399573 436305 468097 495261 511277 539612 582981
17961 582981 620811 643520 658106 695597 742752 765144 769313 777276 784437 743747 677213 622833
17949 622833 568064 458444 298137 170194 95116 -4818 -145129 -271173 -360681 -430612
17939 -430612 -499194 -569210 -629721 -657529 -664076 -651770 -621599 -581067 -529996 -485397 -441578 -400063
17927 -400063 -365879 -338203 -305948 -276827 -244257 -208839 -174191 -146120 -119102 -88446 -54757
17916 -54757 -20407 1124 11271 24472 53295 82852 90673 69823 46658 49236 57812 24622
17904 24622 -37635 -85179 -103023 -116121 -145477 -179225 -210708 -225683 -230610 -253990 -307275 -366280
17892 -366280 -408283 -452232 -513050 -568964 -606565 -624084 -625069 -621020 -599791 -564991 -528228 -491145
17880 -491145 -453637 -415651 -387606 -363190 -341955 -322566 -309929 -302893 -304875 -308112 -311276 -306711
17868 -306711 -295127 -286069 -271824 -255652 -245488 -238945 -225504 -217835 -215445 -216849 -210163 -193959 -183412
17855 -183412 -174221 -167383 -166652 -164269 -159451 -163387 -169378 -172849 -181497 -189763 -197295 -206245 -205043 -201586
17841 -201586 -196777 -189389 -182648 -179603 -174997 -177163 -186340 -193184 -191939 -189360 -189033 -182525 -179083 -171317
17827 -171317 -155832 -144282 -138587 -134664 -133582 -132942 -131458 -132140 -124138 -119693 -118481 -115441 -109769 -115732
17813 -115732 -116196 -110870 -104371 -98702 -97001 -98345 -94078 -87731 -78348 -71603 -71441 -70582 -72752 -75845 -71816
17798 -71816 -65298 -64746 -68535 -67108 -62620 -61011 -60354 -57967 -60331 -60725 -57178 -52381 -51426 -48946 -53133
17783 -53133 -52113 -48634 -54251 -54549 -48812 -49181 -45192 -38610 -28844 -20692 -20144 -28757 -36882 -31809 -31216
17768 -31216 -29493 -24036 -26423 -27776 -25554 -23623 -19344 -19269 -17152 -15327 -12598 -12155 -13805 -13220 -12656 -17779
17752 -17779 -16781 -13671 -12656 -9444 -5897 -11071 -13894 -7760 1398 4187 8727 8194 4078 1079 -1349
17737 -1349 -2547 2173 3866 3897 3109 5512 7152 6062 6818 8279 9029 13984 22742 22642 20850 17624
17721 17624 17150 17030 21485 29512 33757 29133 34236 31321 29642 27192 27801 26178 20761 27814 25490
17706 25490 18444 24895 28845 30936 38007 42868 37530 34452 35293 39215 39736 40538 43336 42761 42115 38855
17690 38855 42967 41324 35834 33628 31386 32178 35781 45877 53738 54574 53263 48082 48132 47146 47741 44358
17674 44358 42590 42815 44962 48131 48132 49508 54408 55991 57669 57333 55270 46085 43167 49534 51698 56113
17658 56113 60960 61648 60467 61485 58869 56860 56874 63179 70171 74309 73430 67090 62276 60915 62196
17643 62196 62646 66849 74053 77416 78128 82630 85972 79093 75222 71757 72107 72654 68633 68672 72169 67092
17627 67092 64378 63825 69028 67457 69408 73305 76989 76206 70057 73406 75023 75309 73354 72445 76230
17612 76230 78892 79000 86110 85394 76472 77691 86131 89369 82247 79305 74035 77694 73863 76695 78881
17597 78881 75816 72073 74670 76660 80393 80627 79607 78042 80178 85413 94302 94981 94852 95698 93280
17582 93280 88341 87332 87996 88133 94026 96074 94873 103686 104249 98160 91115 87419 86502 87146 92984 94240
17566 94240 90560 89834 94961 98243 94170 93955 95860 97875 103350 110440 112209 103964 99230 102794 102224
17551 102224 101479 105158 103660 102832 100513 102394 99728 99023 89267 82230 85926 98172 107764 109417 107610
17536 107610 108779 113010 106736 101060 99231 98411 98755 96182 98309 99671 103858 105800 112833 112816 114289
17521 114289 114281 111008 108460 116834 117680 114583 112056 107807 111142 114493 116754 118432 115189 115351 115981 118599
17505 118599 116022 119178 121201 121442 117191 112247 107878 105587 109208 112907 112278 111442 111437 109079 107346 106770
17489 106770 110637 121041 125174 120887 120009 121902 118755 118173 123630 123227 127070 126040 125426 125138 126689
17474 126689 128346 128557 120982 121526 125379 128385 126855 127774 131435 131587 134441 132434 131517 132488 135329 130141
17458 130141 127861 129250 128710 127045 127713 128997 134520 131317 134721 141460 144858 143618 138924 140489 153531
17443 153531 160918 160359 142582 108730 85407 78869 83815 92346 98604 103386 106915 106710 110172 111278
17429 111278 108289 103136 107145 110355 110731 113415 114038 116795 115812 120884 128880 129815 130273 127992 131386
17414 131386 131484 128899 130884 131771 132327 133783 129199 127047 128393 136241 136729 128940 124755 124667 126335 125244
17398 125244 124263 128809 131501 125124 119565 122339 128354 130693 128720 130295 126929 129148 132037 125220
17384 125220 121803 123249 126661 124042 127684 128231 132538 138527 135696 130904 128434 131628 135114 140879
17370 140879 139213 132159 129022 130660 136002 132387 126691 122092 124433 129293 131075 128549 124862 123546
17356 123546 128634 130824 130990 134826 137858 137707 138316 135952 131460 130533 131941 136022 139150 140829 144278
17341 144278 144317 145836 142928 138130 133811 138041 141084 140437 136339 138388 142525 138114 135460 140864 146724
17326 146724 147939 149038 150151 145771 140899 134896 133859 135936 136792 138302 138957 136325 138494 143186 140449
17311 140449 135587 137571 142483 145070 145497 144159 143493 141692 140662 139513 136043 137038 138659 137587 140499
17296 140499 142909 145348 145229 142611 143078 143586 147362 150677 155846 159313 158628 157202 155005 153103 154049
17281 154049 157545 160149 159383 158145 155035 154810 155954 153377 156363 162873 157070 156385 155773 151717 150294
17266 150294 149039 144130 141893 141168 142526 139949 142225 143525 150749 151524 152042 147445 150008 156499 151531
17251 151531 152498 150773 153609 161734 160372 160623 158333 154957 153765 152686 150672 153484 162021 166053 167453
17236 167453 170373 168314 161942 160009 153498 148829 151219 154002 152524 157228 157302 153072 154989 149175 152977
17221 152977 154775 154212 154699 156399 160154 159840 159093 157457 158380 162183 162664 161695 161274 157500 148148 147978
17205 147978 151221 154500 155583 150693 148851 150205 152815 155318 157470 153785 150050 156481 159283 159701
17191 159701 156599 161010 164147 168139 168604 166734 165399 162574 158606 156759 164907 167739 160928 156154
17177 156154 162656 159140 156360 164365 168819 163064 153692 153611 159070 160558 160476 157757 158306 160132 159693 161036
17161 161036 158379 162710 167028 167103 165372 164879 158328 154521 155339 150611 148443 156038 163168 166878 164517
17146 164517 165863 163981 160509 157335 152369 156500 160590 164301 171068 174483 175303 170589 166351 162688
17132 162688 158113 161856 162161 158119 163620 164502 160084 163721 167763 173743 176142 173808 169330 171355 170006
17117 170006 173588 171865 168712 169131 173556 171701 167335 166762 168142 172828 167520 165592 167608 165674 171616
17102 171616 171944 173926 177172 176519 176653 177061 175202 172962 170817 169672 168858 167703 167623 172655 176625 175298
17086 175298 177449 173269 175150 173431 170290 166780 174342 179827 176322 176374 175217 176408 174790 173150 177343
17071 177343 174661 171926 169390 167511 167042 161835 167102 174831 172996 170380 174745 183117 183075 168633 165482
17056 165482 170655 172970 169035 167575 172097 170757 168892 166066 167926 175935 180431 178617 176704 175961
17042 175961 181985 188639 192782 193115 195510 198701 192550 182115 177358 174892 176837 179153 176366 176362 181534
17027 181534 183271 177885 172539 171774 171577 176752 180903 184521 178353 177420 180541 186435 188739 187395 191374
17012 191374 193342 189292 181864 180687 181881 180684 186036 186774 186216 186312 185613 186194 188438 187494 189025 187673
16996 187673 181883 182365 188546 187704 189793 187136 187643 186473 188558 186884 183792 189318 193267 197294 197416
16981 197416 193051 187439 181593 182192 184448 185803 183529 183788 186476 181521 180301 180695 182879 188282 183477
16966 183477 178451 179340 182715 186609 188604 191356 191206 179814 174545 176132 182892 184758 186368 187603
16952 187603 186801 192075 195115 190510 184319 186257 185359 189190 191055 188310 190006 191861 184381 182148 185960
16937 185960 179833 179934 180411 178345 184931 185099 193450 194212 192126 193224 194877 192301 193482 193374 188302
16922 188302 182819 186072 191487 195459 197197 198028 199254 196691 196115 198102 197819 197210 197792 194790 198386
16907 198386 196041 195910 199807 197167 195155 194135 196506 193880 192119 191342 188955 190407 191421 191033 188605
16892 188605 188836 186039 183851 186689 194237 198256 197106 191948 183561 181231 183496 190167 191772 190934 192203
16877 192203 187558 188307 190538 191687 192574 193392 186354 185562 181752 181918 188573 191484 189841 185560 184795 195119
16861 195119 197846 193814 194904 191759 190320 192267 191327 187274 185994 193793 198146 195128 192434 195289
16847 195289 197507 194766 187888 182116 182441 181219 181869 184366 182641 183325 183146 188426 193644 188897 183894
16832 183894 183191 186147 192146 195401 196400 192359 185272 187400 193854 194703 189151 192651 199413 196190 192939
16817 192939 192961 193518 193976 194833 201188 201063 197731 196676 198333 199077 199313 196268 199083 201117 204288 206421
16801 206421 204467 198755 187910 192437 197350 196619 192082 192101 197460 200849 197897 195169 194609 198328 200330
16786 200330 199275 197006 197727 198917 194762 188520 186616 193202 203105 197610 194014 197836 195073 200967
16772 200967 200769 199247 195045 192893 193385 196578 194338 196983 203023 209102 201095 198142 196047 195477 202722
16757 202722 204999 204769 201988 204549 205462 204600 203693 199589 200478 203817 204398 195213 192704 195872 199419 199765
16741 199765 195758 188843 186019 191079 198391 200352 204165 203858 204777 201345 200597 204986 205969 201141 196592
16726 196592 192530 191716 189618 192144 192541 193840 197899 201011 200955 202354 204881 201020 200067 197988 197219 199232
16710 199232 202782 203383 204939 203841 203624 206754 203184 197054 199443 203745 207880 209107 203398 202190 205035
16695 205035 204533 201930 204971 202599 200525 199060 204383 212679 211204 207375 207189 207205 206047 209701 206539
16680 206539 201801 199104 207366 213462 208375 205284 207852 205002 211521 209771 212631 216340 210771 203486
16666 203486 203459 205384 202541 203411 208108 208592 206617 209168 206623 201900 204307 207052 208597 212269 214744
16651 214744 214366 216052 215626 213332 214710 219073 221227 217863 208424 200896 205331 211915 212039 213775 213774 216265
16635 216265 214106 215619 215420 216053 209974 207220 211360 215942 212509 208152 208993 212523 211788 204973 202252
16620 202252 209338 209792 210580 210784 209421 205666 210674 210830 206574 213404 218855 222149 224707 225597 223174
16605 223174 221697 219394 212377 209572 212801 215193 218338 218149 215640 214146 219950 226222 221913 218068
16591 218068 216024 216815 216271 215872 211824 206772 206970 209181 210489 206794 203431 201242 206077 210865 207566
16576 207566 203100 202823 201949 203349 212845 216807 211175 207552 209042 210145 214824 216280 211799 211999 216419
16561 216419 219346 217731 217330 221187 223685 228266 233211 230467 228181 224432 222788 221796 223066 221950 217223
16546 217223 213939 210466 211394 213920 213499 215744 216522 218487 218217 222795 224744 223071 217725 222120 222194 223397
16530 223397 222407 215726 217715 221764 217264 217587 216812 220086 221729 222009 219044 218705 216285 223872 219571
16515 219571 217727 222320 232695 231827 224797 218122 217939 219472 222151 223471 223307 223324 223810 229637 225690
16500 225690 215878 211419 209881 211427 209772 208868 211664 218697 223481 220687 214346 210222 210678 220271 219555
16485 219555 216769 218217 222674 226357 225911 222583 222485 223012 227225 231220 233982 231814 230101 229628 227276
16470 227276 224573 220671 218776 226397 231789 232357 226033 221636 223256 223053 218203 215247 216998 220816 224126
16455 224126 226056 227217 224237 219415 220556 227271 226228 216117 220655 224825 224172 211813 211390 211808
16441 211808 217180 223145 222090 225107 224486 220122 221903 228931 233162 236550 241776 230589 225774 224072
16427 224072 225926 230396 227073 218206 220957 225799 230610 228512 222878 222794 222231 224493 221985 221788 227650
16412 227650 228488 226457 227911 228878 230269 235703 232652 234901 239159 239185 234585 232157 226676 226013 227000 223909
16396 223909 224081 225907 221595 228708 230371 229988 235021 237319 235935 233425 231933 230217 226291 224256 225645
16381 225645 227684 225863 220721 217220 215677 215621 224293 230435 227153 228120 224079 224855 229488 231524 228820
16366 228820 229070 222933 223655 228928 229118 226346 230110 233497 233661 230635 228941 231725 232160 234003 230488
16351 230488 225959 228575 231923 231541 235816 236686 233264 226726 226029 227270 226304 223031 220838 227237 232565
16336 232565 237458 236303 231696 223908 220371 222354 225803 230120 236985 244726 245815 243813 240531 236625
16322 236625 236491 238946 242673 240355 239353 242367 242368 240297 232430 229770 230011 230484 232511 231267 233177 231517
16306 231517 226660 228845 228655 230829 236615 232623 227414 226726 230256 234155 235713 238078 236484 232641 231457
16291 231457 235561 238329 233277 229047 235271 231978 228074 230734 233445 233850 234757 236533 236428 241196 239204
16276 239204 236822 236756 233745 226748 229824 232245 227755 228514 234690 239417 241095 239204 234883 236646 237188
16261 237188 230918 230109 228167 230830 238582 237154 232396 226507 225442 233334 238156 244286 239877 236036
16247 236036 234456 235964 234639 237932 239875 236627 226501 229766 232734 229600 230794 229643 234174 241997
16233 241997 244441 237827 233730 233721 235955 240971 242230 236490 232882 232146 233249 233920 236625 234733 240734
16218 240734 242213 241448 244488 248622 246523 243128 243105 247104 245445 245140 244762 242537 241220 242527 243185 235182
16202 235182 233387 234161 234029 234441 236067 239090 238106 239671 241241 242644 239202 241660 243356 244329 241508
16187 241508 237096 234876 240312 242139 237202 239063 241467 241026 243026 244871 242386 236315 230169 231282
16173 231282 233894 241370 245382 246384 243379 241482 236470 236789 239069 239200 237656 236232 236581 242351 243602
16158 243602 241755 245368 241484 240105 240126 240445 236770 240173 241493 246620 248471 247128 248517 248845 249386
16143 249386 244863 243831 244739 242156 245876 246668 245835 242383 239732 243865 246853 245895 243951 244771 243413
16128 243413 242955 242472 242546 242503 243866 246756 244639 235844 235630 239701 240331 243106 250830 253567 250622 253604
16112 253604 253561 257793 259511 256023 252038 247558 251683 251418 245855 245223 247440 245178 252660 250332 244256
16097 244256 241691 245538 251407 256903 252198 247541 246888 249797 252245 246580 244551 245126 247562 250373 249640
16082 249640 245871 243049 241397 236588 238528 243790 247331 250423 249111 247967 253640 251122 251469 254485
16068 254485 252619 253387 250920 249091 248116 250915 253575 254529 249998 246798 244832 243053 241753 245107 242760
16053 242760 239656 243503 249211 248333 243288 245199 245592 249033 251404 254167 258168 259618 260100 257664 258076
16038 258076 255148 254310 254633 259026 262571 254525 256171 255013 252664 262615 266367 259812 253559 250007 248221
16023 248221 253637 250579 252468 251765 243992 236785 233887 236575 243956 244758 240645 250125 260667 259124
16009 259124 261991 261605 257193 253485 252603 251312 257539 264285 262585 261294 264817 262666 259892 263620 262921
15994 262921 263592 267560 271006 272550 265779 261480 257470 254643 260732 261238 259404 259041 251971 254544 261863
15979 261863 264111 263981 269904 270312 264386 258714 254131 254250 257731 262138 268164 272815 279040 274964 267154
15964 267154 265444 262632 255039 260112 261879 256407 252355 253754 253959 253139 256489 256498 257012 259001 258904 258252
15948 258252 259865 261426 263280 260945 258101 256899 255925 250929 249883 252388 256097 265472 266845 262066
15934 262066 261581 259333 255897 254225 255592 261209 268266 269531 270671 266810 259925 257580 257327 253317 254418
15919 254418 260380 263791 263779 264582 262468 256791 250238 249836 253051 256324 257571 256457 257341 260118 257478
15904 257478 250842 250911 255342 252305 257022 262437 259641 254419 256012 260793 262833 264602 265626 263702 260094
15889 260094 258399 261270 268084 269605 267083 265960 265573 267269 264314 261040 261904 258844 255815 265615 268649
15874 268649 265752 264820 267625 264300 259822 257180 256317 255154 257284 260961 262007 259863 260252 261309 264352
15859 264352 265007 263461 260309 261065 265240 273448 269644 266554 269497 268241 267038 268568 270320 270891 265425
15844 265425 264387 262282 264806 263414 264974 268025 268501 264515 263353 267188 270396 266001 267680 267797 269396
15829 269396 266639 261272 261272 262146 264773 267620 272272 270346 264266 263565 262419 257973 257968 260214 262412 267454
15813 267454 269821 266748 265859 261054 261400 268859 275081 274011 271270 267754 266232 263408 263015 265765 266047
15798 266047 264635 261843 267397 267160 270594 273246 270015 261436 260969 269897 276108 274427 276499 279657 280933
15783 280933 282924 282668 272167 270284 270376 270392 277016 280394 284794 286107 278207 276037 273972 264492 268200
15768 268200 267622 272178 271949 268820 264557 262352 265180 272528 281564 277900 275852 279667 268694 260892
15754 260892 264613 268078 273008 272686 274595 270996 272029 275020 273195 267139 266232 265308 268291 268718 272280
15739 272280 275830 281260 281390 283342 281118 280871 281483 278774 278303 274045 273583 269220 267225 270844 273344
15724 273344 272855 276432 275606 268229 264066 266872 275319 276474 273049 269913 271263 267884 272357 274864 273001
15709 273001 272748 274510 281035 284713 278968 269217 268270 272236 273679 271307 268025 274620 279235 278608 278192
15694 278192 274742 266950 270471 276560 277695 281992 276754 271083 272057 274952 281189 279372 275136 271862
15680 271862 271619 274884 278972 280902 279356 281662 285781 290474 292994 291301 288610 285085 281602 278830
15666 278830 280772 279925 282984 285200 276551 273137 273478 277937 281759 285140 286241 286879 290844 289657 287207
15651 287207 280752 278562 276274 278597 284111 281900 277730 282654 287634 284424 281809 277821 281415 283523
15637 283523 285569 284485 284056 285579 286023 284026 281115 281375 275510 274434 282864 291874 296750 296305 291303
15622 291303 289772 291603 290495 289314 288766 290725 292419 298143 299074 288538 288218 289428 290904 289848 285231
15607 285231 288353 286093 284747 288139 289078 286260 284878 285512 285519 287380 280229 279101 283669 284208 285647 292726
15591 292726 292818 297541 294161 289633 290581 290630 289559 290267 289243 284406 282315 279349 285151 293031 295652 292645
15575 292645 291084 291969 295508 292094 285865 284101 287545 285443 285740 292565 303541 300044 294958 289425
15561 289425 285637 287628 285548 287888 281518 279831 285069 287905 285347 288677 294098 294342 290373 289480 284349
15546 284349 285050 287686 283356 282494 289001 294424 289983 286892 284137 281749 287251 293457 296102 289585 286364
15531 286364 287612 286581 285976 289471 297626 296606 294530 294253 292545 289670 292100 289527 283320 283890 287497
15516 287497 292166 291186 284782 283243 284730 287237 286343 287067 291012 288975 288941 291037 293889 292783 284771
15501 284771 283038 286715 290056 295988 291046 288265 286657 286564 286856 287791 291769 294653 288658 282337 277686
15486 277686 280309 284780 286752 289558 293010 291422 291361 295179 288533 287531 295293 297231 292876 296080 302981
15471 302981 299106 293327 294564 294856 296363 297438 302122 301200 300764 296799 297297 302011 301914 297087 298779 296764
15455 296764 296873 292504 290343 288722 285733 289641 296493 297309 301550 303156 299515 296861 296663 295016 292344
15440 292344 290455 292377 293824 296829 300117 300368 295510 292500 291994 295944 295730 298066 303012 301148 294810
15425 294810 293713 304496 313169 314241 300808 294747 300466 309387 308958 301777 292070 299792 308077 302478
15411 302478 296713 293608 294139 295174 296073 295856 295538 299313 300099 297870 293340 295942 301758 303453 304186 302027
15395 302027 303018 302277 303850 310540 312040 309025 302436 295537 294165 296107 297475 301806 303044 308372 305055
15380 305055 300940 302582 305116 306438 307410 310626 309198 301896 303597 301912 303476 307154 303383 301590
15366 301590 301433 304147 304566 303164 304492 301100 301686 305064 306433 307488 307271 310076 312397 311542 309313
15351 309313 307987 305477 309086 311653 312655 305840 302413 300195 291306 290281 292992 294950 303741 308453
15337 308453 310321 313772 308767 303521 306898 306806 304785 307115 304156 308183 309634 308545 301337 293985 293284
15322 293284 299144 300679 302173 299760 297853 298612 297748 298614 301763 304280 300624 300805 308513 316202 319720
15307 319720 326341 327856 320743 311501 304509 311325 315887 310126 308739 313315 310683 313139 313118 311997 315403
15292 315403 312911 308032 311347 313110 310348 311887 314415 312563 312064 310881 307975 312874 312013 299806
15278 299806 299784 308626 316034 320234 321704 315737 307573 309703 307034 307141 305950 313255 319860 322202 320833
15263 320833 320827 324151 319827 317127 318784 318895 317252 315018 312129 311439 309620 310802 308769 308296 315519 319700
15247 319700 315370 313101 310193 311349 313649 314694 317512 318231 315721 309540 312320 319411 313227 305387
15233 305387 302972 308543 315857 319335 309085 303132 301252 305152 311397 314254 310730 313083 315378 317567
15219 317567 317792 318108 311329 307296 310768 315552 319572 319119 316013 314504 315033 314762 318645 319739 321899
15204 321899 327930 328741 324955 324689 320546 316316 318718 320619 319327 319139 318674 320395 319806 316044 308655
15189 308655 308702 308765 310123 316265 310241 305340 310174 313789 312143 311213 318913 327747 324071 318807 314712
15174 314712 315891 323436 321503 324399 325984 330771 334939 329578 326843 321839 322187 327042 332511 334887
15160 334887 336215 332956 327987 330204 329202 325948 322907 326382 333846 332040 327252 327486 327243 326993 323752
15145 323752 324052 327451 326101 320377 317153 319444 321138 327139 326877 329745 325142 324198 325480 324411 328255
15130 328255 328648 322688 321053 322203 322231 321086 318939 315211 315141 320332 321636 321952 325406 326023 327015 326669
15114 326669 321077 323151 324263 324214 326994 330552 331511 335787 334527 330498 326980 333072 340656 340435 331053
15099 331053 326766 329529 332350 332006 328979 325320 319311 318902 322510 327505 332493 336559 332123 328652 328919
15084 328919 330712 331328 333891 325622 324629 325378 329630 335100 333393 335811 338538 335330 331617 328830 325168
15069 325168 323902 324918 330390 333249 334185 330080 326978 324843 322958 321863 317480 318396 326866 327308 325206
15054 325206 323501 325608 334546 334651 343907 342216 344316 341957 340637 342918 341828 341084 337404 329876 335692
15039 335692 338519 335806 332600 333120 333283 333327 328965 325977 327573 326084 325039 326248 327978 327342 325344
15024 325344 324977 327953 332663 330929 329016 335627 339364 343620 344111 344887 340868 339442 345496 349233 348486
15009 348486 344540 337242 336685 335436 331076 332825 331617 332950 333234 337777 340091 339384 340936 336030 335567
14994 335567 337964 340935 341016 336583 335772 339699 341976 340730 337878 335219 337934 334218 333826 337885 334886
14979 334886 339802 342243 342546 346058 347013 346414 345207 338501 332588 332335 336290 347473 350915 347943 347240
14964 347240 348223 346519 344921 343120 340316 339300 338611 343524 347113 348021 344593 344948 343248 343195 333510 328866
14948 328866 332805 336343 342663 341073 338043 336112 338821 342409 344421 346284 339676 336747 341322 337424
14934 337424 337851 341882 345224 347797 350507 347730 341003 342149 350378 350638 345204 339850 344252 349218 348967
14919 348967 348644 347553 342152 341540 344931 354137 358881 360714 361548 360302 352272 347798 350853 350878 352855
14904 352855 352234 350696 350391 350345 351610 348228 348632 347306 348948 356061 354304 348632 348424 348316 350826 357241
14888 357241 359678 360958 363826 362459 358690 356701 350131 355998 361005 356362 349685 346897 342575 341750
14874 341750 343592 346843 351245 352851 348041 342716 341748 345642 348890 353167 348751 343758 342560 346494
14860 346494 349846 352321 349207 348493 347172 346381 346284 346990 343129 341505 349873 358208 362668 360049 357374
14845 357374 354118 356057 347473 344379 352186 353483 347688 342342 346085 350847 352194 348061 349421 349274
14831 349274 352686 355964 353183 348868 343783 342074 346779 353404 360062 363587 363708 364737 368850 370223
14817 370223 365612 359440 355317 358155 360761 360413 353811 355767 360351 360612 361463 361537 365937 365285 361744 355123
14801 355123 353384 359656 362482 359261 360427 357977 357804 355419 356079 361838 369221 367498 365322 357786 351870
14786 351870 346836 351811 359353 360673 361553 362725 359621 358228 363925 359597 358108 364589 365943 360099
14772 360099 358500 359525 357809 356218 356944 356973 352328 357584 365938 365747 363666 368528 372754 368195 367000
14757 367000 366571 368089 368488 367371 368730 369643 365474 361202 363912 368074 363295 362689 367500 366042 368848
14742 368848 367764 365998 369659 366858 358206 355209 357747 362535 368221 368844 368936 370930 371554 371617 367274 367791
14726 367791 365215 366780 368157 371017 372646 373041 366129 364201 368276 367428 368031 364736 369294 372682 374856
14711 374856 377571 376717 366835 369055 370310 371893 372970 376575 373395 370146 366361 365359 368479 371924
14697 371924 368377 364018 357498 358181 361820 363943 363177 364641 364782 365031 367644 374022 381405 378609 374850
14682 374850 372619 369846 372354 371946 370183 369223 372891 377199 376814 377555 372867 377554 375585 374020 377967
14667 377967 375648 368799 371249 373338 371737 371453 374958 378664 373274 370933 366167 357218 366279 379064
14653 379064 377779 372222 367218 366122 369570 374408 375982 373903 375630 370877 374563 379139 370155 367500
14639 367500 371044 376945 380209 375791 372268 371578 368034 368367 377869 383320 376721 374409 378068 376433 373968
14624 373968 375234 378311 385496 386727 385774 385749 383807 384354 383389 380501 381316 379609 379564 383176 384823 390548
14608 390548 385438 381717 383360 385148 378571 378713 378388 378571 379412 379102 377980 385590 387077 387285 384430 380542
14592 380542 376531 380325 382866 381955 377943 373224 370508 371039 374247 384486 388456 384575 379771 380947
14578 380947 383379 381826 383701 381236 385152 388741 391606 387252 388500 394885 397842 390664 390331 387544
14564 387544 386630 390045 392331 395301 395805 388626 381156 381458 381161 375585 375951 373278 374695 377807 382001
14549 382001 386065 387723 382498 379445 379326 387799 386076 379627 382330 385147 381062 386183 388109 391176
14535 391176 386258 380087 380830 380996 382629 377721 374976 380847 388415 390127 391582 393309 387821 384671 389897
14520 389897 388829 391294 392556 389974 392177 390329 389677 392546 393221 391911 389782 391691 388568 386083 388837
14505 388837 389001 389723 394079 396411 398650 398164 398887 397843 397653 392487 385469 388577 392456 396708 402506
14490 402506 400935 396285 392944 394442 396335 395810 396891 391648 392887 393972 393890 390131 388392 387110 388239
14475 388239 393793 399317 399333 397071 394618 391922 396657 404256 402549 401486 401401 402408 401609 403902 406395
14460 406395 409283 415930 420859 421802 421878 415376 409408 409015 410521 404269 401043 403042 402728 400868 403359
14445 403359 403029 402586 407908 406224 402152 403065 405154 402731 403593 407049 406754 408112 413476 411771 406914
14430 406914 400622 400756 403171 404831 402529 402324 407626 409271 410262 409266 406243 404627 403732 403106 402851 404658
14414 404658 408450 408421 412522 411756 409621 410231 409886 409936 411837 411922 407307 402272 403957 409920 409330 405839 404434
14397 404434 402836 400050 401641 402828 403980 408425 408342 410302 407720 402674 405301 408019 412106 418543 416352
14382 416352 413319 414645 414969 416732 415333 417026 414845 415059 414660 414479 412435 412347 412852 416354 421037 416202
14366 416202 411685 410325 415639 420488 420886 411358 403647 402988 401559 408188 408983 413118 412446 411217 414864
14351 414864 418877 418540 417070 419702 422303 423521 421025 417956 417570 418643 418979 421455 422500 415275 403902
14336 403902 404104 407970 416814 415233 416587 419621 419081 416405 414680 417841 426157 424247 422131 424727 423762
14321 423762 421752 421568 419788 412843 411580 413408 417805 417787 421392 422111 420154 420303 424406 416350 411758
14306 411758 414864 420944 423490 424459 419562 416090 413462 417036 420555 422388 422326 420722 419759 423376 423892
14291 423892 424497 419163 418912 421175 419041 416937 419417 425546 430416 437018 432709 425151 422920 428395 431389
14276 431389 429490 428324 427106 426954 430194 428880 424456 426988 428167 425791 429871 439040 437316 433627
14262 433627 430683 435358 446898 446777 442300 433393 436742 436295 433574 429628 425483 427357 429866 431147
14248 431147 426707 426367 428784 434609 438245 437582 437125 437705 440403 439738 437647 441786 443584 440160 432715
14233 432715 428904 429471 434235 437653 438632 435927 431027 430059 434605 430896 433279 438392 442492 449543 445237
14218 445237 438630 432297 429940 427942 428507 433709 436814 433653 428753 434469 440543 433566 425752 425099 433300
14203 433300 438756 435071 434314 433323 436482 436686 437192 436547 431323 431400 433982 437851 442841 445866 450489 441734
14187 441734 435060 444477 450912 452353 451195 449168 447093 444016 440581 445125 441405 436930 438935 437674
14173 437674 439917 444087 445133 448436 447384 448193 450264 450970 448950 446021 444808 446023 447754 451682 450233
14158 450233 441726 439551 450301 451269 447724 445450 443302 441216 443595 443762 440300 441593 443673 444938
14144 444938 447349 447027 438902 436068 440977 448097 447565 446307 446452 443853 440539 436378 435862 445582 450311
14129 450311 443167 441355 441862 444271 441313 444004 445542 446535 453893 448630 444948 446280 444074 437725 445928
14114 445928 449129 443130 440075 446152 444758 441863 447662 445462 446131 449563 454589 457023 451611 445320
14100 445320 447901 452094 454592 454949 449783 449996 449800 453082 454390 453474 451389 447380 449210 455436 451215
14085 451215 447149 450681 454038 455625 452773 452929 457504 456170 458269 460345 463133 461646 457093 458913
14071 458913 456144 449864 448975 451454 451077 452545 453119 455877 458635 450350 444926 449551 457956 457616 453916
14056 453916 450743 456756 458950 461817 462827 460784 465272 464943 461344 462295 462325 461409 460850 464306 465889 463033
14040 463033 461079 457579 458367 461849 463767 462590 456143 452182 455323 462849 467595 470254 471709 471228 470945
14025 470945 466592 462929 466909 464381 460204 458986 462508 457293 458535 460996 458789 458798 455395 456868 464169
14010 464169 466425 461773 455622 458515 468604 470157 473578 473391 473865 472697 466611 464252 468015 470418
13996 470418 468562 466450 470932 475547 477083 476405 475737 475875 475353 478584 473844 470805 472984 480245 481167
13981 481167 477262 478539 476390 475763 476448 479048 474645 466776 467089 473287 480085 482165 485843 485192 480028
13966 480028 476629 474112 475109 477177 478854 473120 475037 475715 478282 477185 484137 489993 482484 480834 480301
13951 480301 477334 478110 481938 481230 484395 484709 485686 483415 487357 486598 485496 483262 480215 477431 479415
13936 479415 475900 473740 477750 476267 470943 471131 476072 480230 477530 479216 480153 474259 473330 476073 475981
13921 475981 479081 484196 483658 480355 484967 494168 491843 486587 487321 488439 494043 501732 499980 489677
13907 489677 485262 477203 476105 480508 477686 477867 481208 476970 482270 486618 483143 479311 482985 487198
13893 487198 486876 490021 486922 484788 490220 496182 498546 500367 501037 500180 494298 491292 493442 494300 498326
13878 498326 495701 487201 486962 495592 500923 501682 500030 495656 493239 500369 505958 503512 503579 503124 502982 499722
13862 499722 496431 491859 488024 488054 486955 490974 491679 489728 488529 492343 492820 494850 490674 487096 494813
13847 494813 496724 493823 491694 491853 496622 501641 499828 498852 492941 494525 500617 500218 501629 503114 506110
13832 506110 505383 506088 509242 500776 497315 494499 493915 498542 498431 496245 500426 503617 506055 505708 506941
13817 506941 508617 500239 497143 501713 502098 499012 499933 498624 494112 498059 503420 504880 503755 501584 503285
13802 503285 508478 508415 503760 497258 490641 495553 505659 505696 507256 503894 505348 508927 509046 512857 519334
13787 519334 516293 517202 513348 509689 510641 507247 508420 510792 512035 510754 507685 507264 508465 510127 514597
13772 514597 513449 511774 513461 508756 506498 513766 513503 514385 518093 519410 518369 515669 511509 504046 504662
13757 504662 510428 508222 508762 508320 511886 516466 516179 518924 524050 520177 518691 517398 520043 519936 521242
13742 521242 520594 520762 525128 525398 519046 517431 518345 517501 516299 516311 514780 516742 519671 523282 527446 531428
13726 531428 532343 527271 521734 526100 524131 517412 516839 514989 521465 523059 519563 519673 518711 516481 515809
13711 515809 516422 520159 522388 523653 521173 521702 524128 525893 524246 517720 512337 516062 523177 530792 531243
13696 531243 528764 524712 528388 531314 528702 529319 533705 535537 535861 534119 533322 534660 528110 525666 525354
13681 525354 520555 518247 522582 533528 537685 539382 539392 540972 540772 540824 535997 534358 537786 537096 537210 539030
13665 539030 545378 539404 535677 534220 535418 536559 540702 540852 541194 541274 539474 537158 536195 539515 538133
13650 538133 540364 547031 549204 550518 550176 546876 538665 539012 536056 532721 533841 537972 541008 546649 551423
13635 551423 550213 546035 547013 543176 542190 544621 537127 537952 541335 540287 541637 542547 545327 545521 542929
13620 542929 540100 544798 547744 545181 542045 546814 548067 551247 553031 551346 553165 559939 559393 554891
13606 554891 550319 548719 550611 547846 549899 547374 543721 544466 544739 540314 545373 549412 548401 549457 552563
13591 552563 551316 550344 548248 551493 551477 549414 545498 543966 543856 548369 553801 552545 553529 550573 551089 554225
13575 554225 558557 557292 560853 562532 564997 565050 563701 563202 566286 564874 563102 563842 563657 566596 567033 562150
13559 562150 560342 565535 574395 580607 577213 569876 568291 569520 570768 570966 568002 569273 573374 572044
13545 572044 564251 560967 561983 563122 562680 567234 574438 574279 570771 566749 565155 567056 571515 572586 570898
13530 570898 562457 565835 571015 571172 569600 569595 573843 579009 576639 570667 564310 564835 568857 573223 579301
13515 579301 579439 575300 573103 576204 582236 582245 574747 575264 572834 567900 568600 569144 566718 569732 573267 569405
13499 569405 565745 566032 569512 569301 573910 580725 576688 579819 581430 578110 585421 589230 585714 590552 590581
13484 590581 584855 581466 580889 582436 586924 590715 587738 582234 585356 586944 581963 573043 578760 584133
13470 584133 591091 588830 587044 590966 590347 594805 598649 596831 593900 592930 598694 597957 593209 592336 593973
13455 593973 594059 588197 592463 598049 596284 593664 593425 595983 593045 592240 594226 590440 596825 601939 598495
13440 598495 597900 594498 597060 599752 601580 602481 602406 604126 599803 595001 596802 594671 598630 598361 594347
13425 594347 594944 599800 606678 607823 603210 600611 600671 598273 599876 602738 601970 602048 599967 600070 594646 593310
13409 593310 593907 597482 603578 604854 604883 607374 600843 593765 592286 592860 595020 602630 605370 604707 606058
13394 606058 607245 610696 609179 606770 603280 607172 613516 615124 612656 619129 623849 620568 621550 619322
13380 619322 617954 621317 620420 613707 613261 616524 620411 622729 623850 625926 620265 614398 614918 610496 612287
13365 612287 612746 617192 617362 614258 611479 617258 617494 616649 615464 616747 622786 618724 620143 614829 612018
13350 612018 610319 614697 617140 613950 608665 609993 613069 621354 625639 622650 619557 615733 617754 618893
13336 618893 618188 618212 621535 622053 620538 625742 626631 628301 627114 628971 629320 628790 627470 631287 630889 632323
13320 632323 629209 628068 629516 629342 625898 630040 635684 636912 635549 635744 631960 629644 632024 632239 632342
13305 632342 628992 632500 634140 635047 635754 632508 626169 623116 623879 624062 627628 625942 627258 629022 625006
13290 625006 622859 623510 622962 631741 638023 638404 635845 632915 637634 641388 641476 635110 636972 638029 633573
13275 633573 633008 631237 630978 633296 637485 637063 637109 637279 639813 638724 639651 641181 644769 645469 648751 645111
13259 645111 647325 644006 641541 645852 647333 644206 647586 648202 643467 644686 649391 650497 649428 651389
13245 651389 654703 657550 661682 662523 661275 662472 667070 661288 656860 654432 651907 654762 657666 652955
13231 652955 645935 644952 654967 657944 660357 662220 662100 660001 656640 658621 658730 658985 663489 664279 661323
13216 661323 662627 661886 655596 655702 658898 659169 662642 661749 661764 660296 662240 659578 658684 655231 656612 659396
13200 659396 656756 653522 655062 662226 662855 660554 662006 665898 664699 663059 664962 664778 666442 669651 670902
13185 670902 673827 671782 666276 665573 663490 660467 658936 663144 668093 672216 674373 678288 672603 675015
13171 675015 675153 674614 679442 682233 686442 686606 685707 686080 684378 682521 683316 679873 681681 677807 683722 688513
13155 688513 687468 684002 684114 682212 680439 681990 681415 682534 679572 676950 679200 685442 683956 682011 683240
13140 683240 680455 682598 686717 687979 690331 687966 688012 688097 688123 682414 678690 686340 691884 693173 688225 693211
13124 693211 696467 697447 693573 689037 687266 687224 685920 688619 686658 685936 684982 687169 689751 691973 692032 698744
13108 698744 701729 700343 699214 692807 688404 688526 694102 700687 708972 709831 705889 703588 700559 696183 692229
13093 692229 694431 696659 699879 699490 695016 691607 692557 697335 703015 708926 709176 710884 709894 706273 701097
13078 701097 707989 713616 712777 707932 706324 704822 698340 699845 705453 710964 713699 716834 718850 714069
13064 714069 708625 706058 712199 715781 716281 722859 720761 716360 718984 717998 718090 717440 722314 726145 726449 725602
13048 725602 724507 717412 721008 726598 721739 712771 713000 718846 725245 720005 715825 715049 715615 714560 717194
13033 717194 717711 716017 714282 718659 722014 727112 728423 728439 727949 723307 723189 724629 721940 720753 726487
13018 726487 729918 729860 726226 725989 724368 731062 735607 736342 733821 731648 731519 734281 736476 736720 732827 728044
13002 728044 728211 728768 731619 735087 737872 742826 748548 746299 746896 743919 739766 733143 741094 745950 739633
12987 739633 736374 743056 742206 741599 739570 742320 744326 746009 746882 741350 735666 742087 752566 757991 758176
12972 758176 760504 761531 755821 743978 736416 736225 737906 745584 750215 745767 741397 735160 737530 742030
12958 742030 745939 746248 743585 745947 751922 753737 758981 760400 760384 755587 750178 754686 754819 758156 759222
12943 759222 759714 755901 754412 760573 759009 759414 759422 762678 771537 773239 771930 765951 759580 757120 754812
12928 754812 757792 759894 758814 761475 763700 768649 765910 772695 772961 768098 766478 772664 771994 773925 773225
12913 773225 771750 778006 780502 778199 777945 772981 770875 772304 775561 776012 774374 776983 778670 778798 777309
12898 777309 775099 775109 778851 780387 778208 772212 769842 773270 771838 772403 775846 775371 774864 777159 779592
12883 779592 785899 789808 789692 789143 792429 793728 788353 779586 777104 780705 784203 786023 788508 790780 790178
12868 790178 796971 801310 799160 796244 789944 788006 787380 792161 794179 791781 787259 788703 790906 794833
12854 794833 799183 801084 803340 803638 801904 801928 800158 807303 809480 802940 803182 801342 793660 798050 804619
12839 804619 806016 812191 810109 801375 794836 789724 793382 797286 796518 797792 804355 810370 810616 810171 811900
12824 811900 807163 804354 808396 810402 809544 808082 804405 802859 806341 805246 812839 815822 812026 810385
12810 810385 808830 815645 818860 821242 824869 823875 821969 817981 818482 824855 823188 814270 810742 812775 812885
12795 812885 814666 820525 827047 826426 829010 830143 830681 832074 833530 829548 833359 834752 826896 822022 822676
12780 822676 827403 829117 832704 835645 827451 829423 831385 830922 830855 829402 833472 841506 847544 848571 843780
12765 843780 846938 840959 834710 838358 843065 840810 836863 842941 844758 838454 841190 846502 848979 851052
12751 851052 847292 847594 846047 843680 840788 834746 831592 838455 841699 842767 847267 850462 849317 848248
12737 848248 854409 858409 864245 862589 864451 859729 853627 856480 864045 862247 856910 854162 855529 849751
12723 849751 850220 855172 862227 862629 867109 870140 871345 872210 870492 864795 861162 862725 855497 857590 864475
12708 864475 867442 863630 862310 862868 867841 869109 869958 873944 868267 866364 861769 865281 873341 879876 880298
12693 880298 881732 880928 873541 873511 880136 876420 873773 872965 874097 874551 877429 876938 875147 873178 872488 875077
12677 875077 884467 889042 888965 891123 889275 885457 882650 883439 883260 875890 877496 882721 886645 888060 896398
12662 896398 896799 898438 899647 895221 889278 888021 886441 886532 887838 890071 898486 899264 899457 896341 892583
12647 892583 889989 897338 906006 908949 909530 916759 913697 908637 907463 905943 909723 913747 911116 909803
12633 909803 909875 913219 916625 918325 915978 915492 909596 904458 908409 911150 917623 915251 913701 910500 913082
12618 913082 921795 926235 927577 928771 923967 919934 923103 925185 929665 928556 922848 921827 926319 929112
12604 929112 928041 927604 924872 929700 936474 936606 937043 937556 935243 936292 944945 944203 939568 939255 936231 934468
12588 934468 936923 931385 930611 935141 938423 942976 946933 941670 942209 940503 941300 944285 943894 943199 946585
12573 946585 948481 951393 951210 946996 949729 950446 949957 950903 957345 957271 957738 958440 963284 962589 952893 946413
12557 946413 952475 960379 963736 971481 972923 971969 969946 965905 965742 965401 972209 967375 964002 955930 955995
12542 955995 963598 963938 963316 968133 969073 972076 978857 976595 981462 982892 979427 983680 986299 984631 979527
12527 979527 981166 978782 976439 977027 978893 981202 983006 987984 988296 989258 989979 993648 990460 988057 989571
12512 989571 989642 993762 1001411 998989 997198 997833 1001225 1006567 1005654 1002515 1002688 1009300 1012445 1009185 1009097 1011442
12496 1011442 1011481 1012161 1012729 1013249 1014167 1017265 1013415 1010574 1013082 1014284 1012261 1017162 1017472 1020739 1020827 1026020
12480 1026020 1029699 1026400 1017777 1016563 1017861 1019001 1017573 1022150 1026443 1027459 1025734 1026555 1019571 1021913
12466 1021913 1033369 1035431 1032849 1037307 1036460 1032998 1030527 1031354 1033097 1033964 1030863 1030705 1034811 1041942 1044407
12451 1044407 1042598 1042215 1045546 1044600 1042590 1043763 1039088 1041160 1046560 1050458 1049330 1050819 1055308 1052480
12437 1052480 1051861 1052373 1051988 1051310 1059035 1061569 1061581 1064422 1065180 1062573 1058879 1063343 1068867 1072067 1078601 1079814
12421 1079814 1079587 1085738 1080881 1070586 1074496 1078789 1076807 1079884 1081280 1076262 1073725 1083815 1087550 1089021
12407 1089021 1086718 1083075 1083588 1088619 1088008 1089663 1087493 1083477 1080481 1083813 1087256 1085044 1088319 1087386 1091796
12392 1091796 1091127 1094553 1095730 1102740 1110380 1114219 1118218 1115398 1110837 1112546 1106283 1099066 1099174 1101223
12378 1101223 1110878 1117118 1118906 1122811 1120492 1117720 1125598 1128008 1133755 1132332 1135000 1136770 1136062 1137889
12364 1137889 1139966 1138061 1134174 1134785 1137393 1136028 1137681 1137994 1138695 1135691 1137537 1138225 1137453 1134251 1131837
12349 1131837 1130580 1134874 1135855 1136101 1138487 1147426 1147352 1147096 1148211 1148197 1150598 1154781 1150566 1145648 1146905 1151203
12333 1151203 1148218 1149912 1158477 1165932 1170596 1165387 1168338 1171887 1164516 1156620 1159566 1166059 1168052 1165369
12319 1165369 1164583 1166366 1169269 1174488 1182459 1180676 1176557 1173780 1169358 1170521 1175177 1179369 1190447 1191176
12305 1191176 1189809 1194087 1194372 1192027 1196115 1199883 1202362 1198670 1191616 1184706 1185525 1197687 1202305 1205077
12291 1205077 1213203 1218906 1219074 1219030 1215246 1214981 1223074 1222687 1222007 1221909 1218294 1217350 1218590 1224326 1228339 1228873
12275 1228873 1229089 1225426 1229885 1232661 1234832 1241743 1242710 1236034 1238788 1239719 1242659 1240125 1239057 1240941 1241561
12260 1241561 1248130 1255120 1254627 1252344 1252145 1250265 1251550 1254921 1252223 1252061 1249894 1249648 1253666 1254944 1250424
12245 1250424 1255462 1263921 1266529 1273979 1277837 1284846 1288328 1284391 1277066 1273987 1277154 1281788 1284190 1285425
12231 1285425 1286619 1292139 1295370 1295813 1295185 1297456 1299234 1292456 1289737 1293701 1300717 1296718 1300893 1307028
12217 1307028 1304790 1302292 1302068 1305886 1314872 1317813 1316686 1318810 1316714 1316231 1322290 1320824 1321613 1322855 1326706
12202 1326706 1333295 1337675 1330175 1326092 1328028 1325406 1329961 1338426 1337995 1333924 1338801 1348252 1353322 1354642
12188 1354642 1351727 1351543 1352202 1348788 1343599 1346273 1354701 1355875 1356483 1358662 1363926 1362059 1362780 1361190 1355708
12173 1355708 1352855 1361872 1371943 1372132 1375682 1376177 1378877 1379946 1382476 1383200 1380139 1380943 1382623 1381786 1388049
12158 1388049 1394839 1399817 1404072 1406356 1405695 1405544 1404392 1405034 1408194 1416050 1414487 1414599 1418179 1424680 1422542
12143 1422542 1418143 1416699 1417664 1419803 1423428 1424174 1426175 1428222 1429173 1428508 1437706 1441072 1440889 1434973 1430974
12128 1430974 1430714 1435016 1446149 1448962 1454071 1455071 1455683 1458855 1454092 1451824 1451446 1458024 1462600 1465776
12114 1465776 1472408 1473528 1473206 1468529 1464820 1467766 1468665 1469054 1469993 1474506 1480440 1482451 1477971 1483187 1488675
12099 1488675 1485215 1486825 1492682 1497901 1502644 1504191 1503990 1505857 1505428 1504588 1508372 1507422 1504246 1506730 1506242
12084 1506242 1505358 1516973 1525929 1531935 1535999 1533724 1531832 1534150 1541130 1541399 1545610 1544995 1550564 1555303
12070 1555303 1553185 1552341 1558818 1563997 1561695 1564001 1566434 1564475 1565765 1562783 1562833 1560326 1561242 1565806 1574041
12055 1574041 1576354 1574467 1572511 1572514 1576922 1581552 1585771 1595007 1602107 1602511 1605356 1603613 1598996 1598484 1603749
12040 1603749 1610287 1613020 1617146 1617437 1616472 1616874 1628148 1630099 1629847 1635977 1635541 1628037 1627273 1629968 1630539
12025 1630539 1637881 1643200 1639951 1634214 1641561 1653319 1659875 1664710 1661998 1665086 1667153 1673759 1678213 1677362
12011 1677362 1673924 1678895 1683596 1688086 1688063 1692649 1696363 1702021 1701816 1698849 1698312 1696534 1696995 1697358 1700534
11996 1700534 1705904 1710604 1714627 1718321 1723319 1719059 1718898 1725789 1735097 1736890 1736263 1739803 1739061 1736789 1740303
11981 1740303 1748543 1750311 1755372 1759465 1759763 1758610 1766167 1766305 1767396 1772082 1770968 1779156 1781548 1785175
11967 1785175 1784395 1783657 1791512 1801471 1803234 1803191 1807668 1802453 1803434 1808446 1812540 1819335 1818719 1822347 1822371 1823197
11951 1823197 1825910 1831975 1837257 1837760 1842489 1843379 1840979 1840292 1840791 1846377 1853728 1864033 1871360 1870453 1871427
11936 1871427 1871423 1874639 1877574 1883983 1882888 1885289 1888882 1894838 1899482 1894128 1898949 1904841 1905691 1909376 1909646
11921 1909646 1915086 1914011 1917759 1918358 1918231 1926264 1930522 1930471 1938867 1946723 1951164 1949021 1952725 1963134 1962497
11906 1962497 1960164 1958483 1964868 1968500 1971314 1977371 1984239 1987950 1994406 1998913 2000916 2001422 1995738 1993451
11892 1993451 1996905 2004143 2009977 2010938 2012194 2016930 2019321 2022802 2026995 2033250 2040294 2039947 2044691 2047903
11878 2047903 2051811 2056917 2061930 2067775 2069242 2072007 2069675 2071459 2079174 2083561 2082615 2083078 2089534 2095924
11864 2095924 2102111 2111218 2119924 2126018 2127141 2130316 2133146 2140513 2142336 2140152 2143929 2144744 2143382 2144686
11850 2144686 2146767 2150089 2156757 2170586 2176460 2181019 2186638 2184061 2187867 2194984 2197715 2200420 2209027 2215660
11836 2215660 2214517 2217539 2222319 2225063 2229181 2242095 2250385 2251947 2252896 2255635 2260863 2261930 2267589 2271077
11822 2271077 2275211 2283108 2291114 2295224 2300932 2300041 2301101 2308629 2316351 2322323 2327676 2333384 2337984 2336435
11808 2336435 2338483 2345803 2356553 2366250 2372225 2376080 2378748 2378429 2388426 2392857 2392168 2393405 2399257 2409918
11794 2409918 2420448 2423210 2426672 2439145 2444732 2439930 2439678 2450760 2463031 2470620 2477427 2484097 2489159
11781 2489159 2493247 2499785 2499388 2494968 2494713 2498903 2506666 2512013 2518275 2529706 2537848 2539263 2546473 2554180
11767 2554180 2560376 2565237 2567756 2570033 2575645 2586051 2592157 2598809 2606671 2609978 2611935 2622395 2639246
11754 2639246 2654156 2659940 2666671 2679240 2678125 2675374 2682054 2690183 2694269 2704973 2717216 2733223 2743786
11741 2743786 2753768 2764915 2767030 2758029 2739855 2732334 2742870 2759465 2772084 2778640 2788600 2795195 2812913
11728 2812913 2825218 2838539 2844905 2856648 2872072 2883359 2891117 2905170 2921264 2942562 2960870 2971624
11716 2971624 2973756 2972348 2978178 2987780 3003654 3020976 3042127 3065782 3090561 3109822 3122980 3136447
11704 3136447 3150602 3166777 3191024 3219042 3255433 3295913 3332201 3372638 3412111 3446668 3488938
11693 3488938 3550367 3619783 3708983 3826236 3991352 4202129 4458292 4735923 4769265 3977118
11683 3977118 2565629 1542028 1317950 1497288 1737675 1941275 2094439 2216031 2318191
11674 2318191 2394245 2450658 2502234 2554372 2600059 2641745 2677839 2716182 2756306 2785710 2813678
11663 2813678 2844488 2863011 2879239 2895966 2916487 2931083 2945213 2968532 2989701 3009741 3027823
11652 3027823 3042752 3056518 3075340 3092180 3104104 3108763 3119978 3135666 3151226 3168668 3180644
11641 3180644 3191495 3210101 3227518 3241933 3255417 3267462 3277569 3286448 3291747 3296948 3312262 3333264
11629 3333264 3348717 3358622 3370328 3383545 3400556 3415732 3427976 3434487 3446362 3464829 3480710 3488716
11617 3488716 3504879 3517709 3532584 3546882 3557583 3568762 3582384 3592149 3606257 3627680 3644313
11606 3644313 3662376 3685980 3708527 3728959 3761094 3788684 3807243 3833979 3856344 3878722 3883623
11595 3883623 3859490 3803458 3726766 3662578 3623846 3611971 3626050 3649052 3675466 3692469 3713686
11584 3713686 3730205 3752453 3770496 3791154 3814752 3838218 3861470 3888057 3913297 3922367 3926255 3934545
11572 3934545 3946099 3962556 3982592 4006372 4033094 4059974 4080959 4104278 4128225 4149165 4172185
11561 4172185 4192743 4206574 4214400 4224943 4243071 4259715 4278953 4299644 4311039 4322100 4331360 4342009
11549 4342009 4357607 4377582 4394645 4415089 4439940 4458905 4482262 4499722 4514174 4541350 4568910
11538 4568910 4597439 4627128 4650626 4678041 4697844 4717601 4739280 4768687 4807161 4855909 4904512
11527 4904512 4944951 4968395 4921474 4802174 4662187 4613163 4635919 4671038 4709215 4748094 4791269
11516 4791269 4837862 4890465 4941510 4985785 5020530 5041944 5064487 5079160 5095751 5110984 5132502
11505 5132502 5158120 5191234 5226573 5261435 5299595 5322896 5335199 5349226 5358454 5370445 5381588
11494 5381588 5396478 5425409 5464547 5508855 5555729 5605777 5644665 5666998 5684613 5706447 5731818
11483 5731818 5765468 5797063 5814863 5833014 5855263 5888213 5924403 5961227 5999191 6021889 6032271
11472 6032271 6045581 6088856 6154696 6228968 6302447 6356035 6392890 6423097 6447498 6476331 6519998
11461 6519998 6581176 6645028 6710458 6775286 6838141 6913736 7014858 7137166 7266240 7374613
11451 7374613 7347655 7048211 6658537 6471625 6507360 6617597 6713326 6772942 6785163 6767269
11441 6767269 6758008 6771278 6811398 6859268 6908145 6971462 7035935 7110412 7193529 7259383 7310966
11430 7310966 7362285 7399966 7428569 7467643 7534983 7616381 7700097 7783129 7865306 7943512 8010647
11419 8010647 8069210 8125654 8192562 8263815 8338281 8416756 8493127 8566775 8642189 8712822 8783261
11408 8783261 8848268 8914152 8978417 9042729 9123975 9210638 9325240 9452848 9584992 9655711 9585557
11397 9585557 9445075 9412547 9538902 9633437 9723132 9816410 9925837 10045193 10160244 10264282
11387 10264282 10364952 10462011 10580305 10697392 10800796 10901868 11003955 11112861 11234663
11378 11234663 11367975 11496808 11605489 11705805 11797040 11895140 12011307 12136877 12271722 12407729
11368 12407729 12549597 12695460 12841221 12982812 13133974 13294565 13452906 13617267 13780454
11359 13780454 13939612 14108198 14283024 14464843 14658518 14856664 15052971 15254361 15478426
11350 15478426 15701385 15913465 16126495 16345564 16587995 16836552 17082341 17343144 17640355
11341 17640355 17984134 18347681 18709768 19078171 19476203 19921316 20428929 21002555 21630325
11332 21630325 22332508 23162916 24144201 25066289 24932851 22545343 19405496 17838765 18065229
11323 18065229 19008387 20007677 20896699 21699819 22457152 23195228 23923368 24646406 25374998
11314 25374998 26108675 26863441 27653214 28487993 29362835 30277360 31226057 32198091 33200345
11305 33200345 34251454 35358939 36518980 37726844 38984818 40300323 41741424 43353661
11297 43353661 45189803 47278274 49568546 51820990 53492645 54735125 56563327 59422162
11289 59422162 62945551 66861236 71216662 76197839 81912893 88301421 95129217 102033231
11281 102033231 109767770 119771439 133114371 150680294 173507670 202911996 240437710
11274 240437710 284273468 314079406 257251893 67351598 -145998142 -267970108 -282765833
11267 -282765833 -251741553 -216329855 -186956095 -163649983 -145093738 -130206234 -118289119
11260 -118289119 -108914817 -100978811 -93634476 -86911637 -80980359 -75702008 -70916652 -66562812
11252 -66562812 -62634719 -59091995 -55933044 -53503256 -52261241 -51514457 -50280211 -48468203
11244 -48468203 -46506327 -44648000 -42936172 -41364469 -39903294 -38548168 -37293355 -36144748
11236 -36144748 -35065219 -34039556 -33086395 -32220080 -31412943 -30638254 -29891343 -29188535 -28522060
11227 -28522060 -27877434 -27271412 -26700726 -26134608 -25582328 -25044079 -24504783 -23981753 -23501946
11218 -23501946 -23049068 -22602029 -22169299 -21769661 -21378998 -20993943 -20614606 -20234653 -19858124
11209 -19858124 -19500257 -19179767 -18891963 -18630904 -18386672 -18132480 -17868061 -17620805 -17396019
11200 -17396019 -17184622 -16963043 -16715358 -16465237 -16226659 -15994693 -15776927 -15566631 -15357671
11191 -15357671 -15161969 -14982993 -14800798 -14609621 -14432433 -14269579 -14104568 -13934941 -13766950
11182 -13766950 -13601879 -13445357 -13297246 -13155568 -13016442 -12882153 -12749201 -12616341 -12491824
11173 -12491824 -12369223 -12244455 -12129950 -12017713 -11884408 -11735789 -11595693 -11457835 -11338133
11164 -11338133 -11239494 -11152752 -11070610 -10975267 -10868493 -10754804 -10652023 -10554897 -10464606 -10375780
11154 -10375780 -10280544 -10191542 -10103334 -10014793 -9924815 -9828256 -9726499 -9624069 -9557738 -9559853 -9626372
11143 -9626372 -9639235 -9588745 -9506754 -9426451 -9356225 -9281550 -9200272 -9106844 -9006655 -8919238 -8848477
11132 -8848477 -8781805 -8714036 -8643867 -8579678 -8527813 -8475730 -8425751 -8376184 -8323261 -8271937 -8212954
11121 -8212954 -8156185 -8103178 -8061767 -8025225 -7995890 -7967385 -7939811 -7890530 -7813062 -7740057 -7674476
11110 -7674476 -7607015 -7550998 -7508407 -7475144 -7437971 -7390083 -7333389 -7274618 -7212086 -7149934 -7089772
11099 -7089772 -7044303 -7009747 -6980416 -6947974 -6920223 -6885261 -6859395 -6828188 -6776027 -6715613 -6668858
11088 -6668858 -6630731 -6597585 -6556588 -6511337 -6472172 -6441379 -6416374 -6395988 -6371284 -6331905 -6282023
11077 -6282023 -6223924 -6171143 -6124620 -6088242 -6081667 -6091480 -6094208 -6082942 -6050876 -5991447 -5932327 -5895813
11065 -5895813 -5872822 -5844428 -5808142 -5769343 -5723205 -5679974 -5645775 -5609464 -5570032 -5532767 -5497637
11054 -5497637 -5467849 -5443932 -5427478 -5410827 -5399392 -5385052 -5352137 -5310094 -5263380 -5208760 -5143895
11043 -5143895 -5071595 -4989680 -4906800 -4843452 -4850301 -4973043 -5113364 -5148014 -5097000 -5069064 -5153803
11032 -5153803 -5287171 -5348004 -5320792 -5263783 -5213262 -5178722 -5143590 -5102110 -5059138 -5016765 -4982017
11021 -4982017 -4957016 -4932860 -4907075 -4874345 -4861288 -4860616 -4848434 -4826325 -4800790 -4777151 -4749657 -4725318
11009 -4725318 -4699859 -4673354 -4643136 -4624770 -4608329 -4588910 -4570078 -4557935 -4545075 -4526164 -4504723
10998 -4504723 -4479897 -4461568 -4447915 -4434289 -4413239 -4391053 -4369966 -4342214 -4325079 -4307462 -4285742
10987 -4285742 -4262616 -4241044 -4229640 -4218654 -4199303 -4179947 -4154354 -4138961 -4126141 -4114201 -4105191
10976 -4105191 -4098507 -4098404 -4092127 -4076248 -4065714 -4057998 -4044669 -4031371 -4012063 -3987862 -3960478 -3939557
10964 -3939557 -3931602 -3923143 -3914012 -3896155 -3882219 -3867699 -3854345 -3836442 -3817645 -3808633 -3801833 -3789929
10952 -3789929 -3777724 -3768318 -3756461 -3738524 -3725135 -3712142 -3705912 -3698167 -3685319 -3672494 -3657829 -3641098
10940 -3641098 -3627856 -3612576 -3595311 -3581445 -3568834 -3559643 -3549277 -3532588 -3509648 -3486015 -3465177
10929 -3465177 -3436190 -3414597 -3430160 -3470087 -3493663 -3492152 -3476962 -3455153 -3435890 -3422424 -3403656
10918 -3403656 -3386652 -3368336 -3354716 -3346024 -3327093 -3304209 -3290028 -3291361 -3294422 -3297149 -3290636 -3274942
10906 -3274942 -3256112 -3237574 -3218026 -3205935 -3195692 -3189600 -3182560 -3174206 -3159660 -3140479 -3120407 -3111754
10894 -3111754 -3100319 -3089005 -3076719 -3065278 -3052101 -3035002 -3015533 -2999316 -2983276 -2968941 -2960367
10883 -2960367 -2946088 -2926819 -2911591 -2896075 -2875420 -2851568 -2837812 -2819159 -2801701 -2784188 -2766148
10872 -2766148 -2737787 -2711118 -2684986 -2650837 -2611963 -2572581 -2525326 -2475595 -2430986 -2388745 -2333121
10861 -2333121 -2257631 -2164359 -2038051 -1879574 -1672844 -1402035 -1128734 -1195745 -2156041 -3571075
10851 -3571075 -4458612 -4591430 -4392231 -4153971 -3955738 -3800529 -3679573 -3584180 -3511891 -3457655
10841 -3457655 -3411635 -3364486 -3316124 -3270898 -3231066 -3196670 -3166646 -3135384 -3104972 -3075829 -3060701
10830 -3060701 -3061035 -3056702 -3044658 -3020576 -2982463 -2951000 -2928142 -2919063 -2911791 -2913628 -2910593 -2901650 -2894396
10817 -2894396 -2883461 -2877870 -2873871 -2864325 -2850051 -2840816 -2827999 -2812456 -2797415 -2779603 -2767877 -2767994
10805 -2767994 -2765801 -2761739 -2762954 -2759156 -2746755 -2731824 -2713729 -2706439 -2700161 -2694798 -2692788 -2685065 -2672283
10792 -2672283 -2658207 -2640442 -2627935 -2624021 -2620609 -2618092 -2607032 -2597998 -2593620 -2591746 -2580892 -2570603
10780 -2570603 -2572616 -2566121 -2557599 -2545400 -2534962 -2536708 -2537155 -2529644 -2522402 -2512152 -2506151 -2494596 -2485805
10767 -2485805 -2481029 -2475245 -2474382 -2471269 -2461327 -2460776 -2454491 -2446493 -2440056 -2432837 -2421737 -2409903 -2404796 -2403350
10753 -2403350 -2396661 -2394726 -2389702 -2385605 -2376927 -2370534 -2363734 -2361712 -2354952 -2345641 -2343664 -2342745 -2342501 -2338351
10739 -2338351 -2325791 -2322531 -2314949 -2310268 -2310927 -2310039 -2301826 -2293255 -2295925 -2299946 -2298555 -2292557 -2289130 -2282524
10725 -2282524 -2278414 -2272294 -2263375 -2254271 -2252804 -2251379 -2244439 -2237550 -2229322 -2226202 -2218994 -2214219 -2210416 -2208154
10711 -2208154 -2200078 -2196104 -2190796 -2181198 -2178640 -2174558 -2164026 -2156265 -2158931 -2164858 -2165045 -2166804 -2168494 -2168007
10697 -2168007 -2162013 -2155046 -2153676 -2153467 -2153730 -2143968 -2133963 -2128537 -2123536 -2120258 -2113291 -2104207 -2104414 -2104993 -2100402
10682 -2100402 -2097267 -2093079 -2089507 -2086030 -2082717 -2080740 -2079350 -2077303 -2073999 -2068861 -2061201 -2052934 -2046678 -2044227
10668 -2044227 -2040564 -2034335 -2031509 -2032097 -2030150 -2015734 -2012485 -2011560 -2002577 -2001863 -2000619 -1994737 -1990692 -1984681
10654 -1984681 -1983120 -1984646 -1982179 -1980600 -1977438 -1972089 -1968180 -1966432 -1956165 -1949432 -1945062 -1946057 -1944410 -1941670
10640 -1941670 -1944536 -1949173 -1947489 -1936885 -1930173 -1920784 -1910726 -1904442 -1903114 -1903520 -1902005 -1896752 -1892605 -1887016
10626 -1887016 -1885908 -1893323 -1885739 -1873801 -1866302 -1861679 -1864019 -1863168 -1861334 -1861100 -1853496 -1850294 -1847770 -1842417
10612 -1842417 -1838500 -1837280 -1834807 -1830426 -1821744 -1817185 -1814067 -1815326 -1815524 -1814620 -1809856 -1808959 -1811046 -1811651 -1801924
10597 -1801924 -1790873 -1786488 -1786259 -1781317 -1772520 -1771073 -1772407 -1770182 -1764834 -1765806 -1766247 -1761737 -1763673 -1766394
10583 -1766394 -1759248 -1754552 -1744658 -1734607 -1737196 -1740502 -1737120 -1728138 -1719063 -1715453 -1711191 -1707632 -1706620 -1709942
10569 -1709942 -1710475 -1712385 -1707114 -1693488 -1679463 -1667524 -1670411 -1672738 -1666222 -1664065 -1658519 -1651231 -1646680
10556 -1646680 -1636947 -1629372 -1626462 -1626797 -1627870 -1617927 -1605905 -1605537 -1607186 -1612253 -1616609 -1619795 -1636236 -1651507
10542 -1651507 -1663161 -1675080 -1682318 -1685590 -1686671 -1693421 -1691181 -1684577 -1674373 -1664186 -1659190 -1656117 -1654717
10529 -1654717 -1642735 -1635918 -1637421 -1633218 -1632258 -1631446 -1625683 -1624233 -1620788 -1616511 -1614785 -1606158 -1601234 -1597147
10515 -1597147 -1595972 -1595050 -1591376 -1589048 -1580805 -1578984 -1580173 -1574644 -1568521 -1565991 -1571343 -1572609 -1567949 -1561889
10501 -1561889 -1555045 -1551403 -1546848 -1541350 -1532241 -1533357 -1540943 -1541491 -1536727 -1526193 -1519184 -1521061 -1516540 -1505891
10487 -1505891 -1505081 -1506315 -1499256 -1506630 -1505089 -1496821 -1491294 -1487587 -1486083 -1484844 -1480623 -1482465 -1481476 -1477783
10473 -1477783 -1476708 -1473505 -1470271 -1468589 -1470825 -1472480 -1472791 -1472816 -1463782 -1457806 -1457745 -1457061 -1449783 -1446759 -1444780
10458 -1444780 -1440862 -1437287 -1429960 -1428628 -1432010 -1424172 -1415700 -1409873 -1407591 -1402637 -1397860 -1401088 -1404255 -1402531
10444 -1402531 -1392593 -1388166 -1388481 -1389800 -1384922 -1378723 -1376486 -1382055 -1382011 -1378059 -1369644 -1363713 -1361048 -1357943 -1352236
10429 -1352236 -1346710 -1347620 -1348968 -1348322 -1344737 -1337732 -1337319 -1337933 -1330820 -1320113 -1314221 -1313482 -1307949 -1303459 -1302736
10414 -1302736 -1305749 -1307305 -1306512 -1301128 -1294897 -1294595 -1293305 -1289452 -1286834 -1287399 -1282564 -1281151 -1278376 -1271342 -1261639
10399 -1261639 -1259136 -1258938 -1253241 -1245093 -1239550 -1235819 -1230581 -1222940 -1220511 -1228479 -1229041 -1221317 -1212462 -1211441
10385 -1211441 -1208078 -1202734 -1196209 -1193964 -1189773 -1178681 -1172234 -1170041 -1166674 -1167767 -1164300 -1161301 -1155091 -1144415
10371 -1144415 -1140004 -1138718 -1130252 -1119495 -1110989 -1103787 -1094776 -1082838 -1078332 -1072648 -1068831 -1064122 -1059535
10358 -1059535 -1060082 -1052846 -1043607 -1031196 -1028586 -1026268 -1013936 -999631 -981291 -968089 -960463 -953108 -945129
10345 -945129 -931855 -918950 -908180 -889622 -868362 -851939 -836796 -826311 -821471 -799228 -773109 -761572
10333 -761572 -740942 -713787 -690826 -665454 -630552 -596703 -561033 -524011 -482558 -438375 -399553
10322 -399553 -346150 -288933 -228700 -147612 -58460 55354 193438 371142 580342 802404
10312 802404 978048 1062694 1061718 972515 745652 332332 -223897 -828379 -1419370 -2005858
10302 -2005858 -2568730 -3048261 -3348011 -3470623 -3483847 -3443274 -3356799 -3209999 -3030264 -2856152
10292 -2856152 -2704534 -2575884 -2476497 -2387691 -2315639 -2256665 -2205249 -2161298 -2123277 -2079595 -2043718
10281 -2043718 -2007754 -1975228 -1948948 -1919120 -1888122 -1861673 -1841456 -1819251 -1799060 -1773580 -1754635
10270 -1754635 -1743968 -1731211 -1716987 -1702919 -1691918 -1682914 -1672667 -1660893 -1648585 -1636311 -1621729
10259 -1621729 -1606963 -1597195 -1591664 -1585212 -1576313 -1568274 -1557775 -1546292 -1538627 -1538305 -1539424 -1531519 -1522940
10246 -1522940 -1519328 -1514888 -1504458 -1494358 -1490823 -1486686 -1482546 -1476244 -1475956 -1475895 -1469277 -1463025 -1458973 -1451869
10232 -1451869 -1443917 -1440930 -1433740 -1428785 -1425172 -1417186 -1417528 -1413690 -1408028 -1404582 -1403604 -1402559 -1401700 -1401957 -1397765
10217 -1397765 -1391561 -1384107 -1378120 -1374427 -1368679 -1364059 -1362448 -1352632 -1346494 -1352120 -1348940 -1346515 -1344976 -1338555
10203 -1338555 -1332843 -1335535 -1341349 -1340836 -1336047 -1325535 -1322436 -1323218 -1317410 -1312777 -1306520 -1306028 -1306408 -1300531 -1295904
10188 -1295904 -1296191 -1296110 -1295566 -1292959 -1294958 -1297105 -1294518 -1293194 -1284356 -1277584 -1279272 -1282990 -1285819 -1286097 -1273491
10173 -1273491 -1266274 -1267836 -1267607 -1263492 -1259054 -1260477 -1256654 -1252463 -1247259 -1253535 -1260505 -1252593 -1249347 -1248842
10159 -1248842 -1244356 -1237901 -1235427 -1236353 -1239058 -1237355 -1231160 -1223079 -1225359 -1230819 -1233788 -1228245 -1222786 -1224439
10145 -1224439 -1223821 -1214761 -1213051 -1209413 -1208595 -1212789 -1209441 -1204146 -1200534 -1199766 -1200039 -1199540 -1198503 -1197718 -1194749
10130 -1194749 -1197894 -1205549 -1204450 -1201599 -1200521 -1196269 -1196612 -1199079 -1195626 -1190013 -1185269 -1185876 -1181882 -1175430
10116 -1175430 -1179204 -1178015 -1171576 -1166416 -1163484 -1166470 -1167406 -1165583 -1163657 -1156877 -1154714 -1160069 -1161468 -1158819
10102 -1158819 -1158005 -1155749 -1157891 -1153455 -1146854 -1151892 -1148806 -1144381 -1144102 -1142147 -1141055 -1144936 -1141669 -1138325
10088 -1138325 -1137926 -1136386 -1133785 -1133461 -1132033 -1128920 -1132752 -1129847 -1125963 -1129136 -1128745 -1128690 -1126891 -1121167 -1119994
10073 -1119994 -1124578 -1124242 -1117786 -1109819 -1111662 -1116093 -1116285 -1112170 -1109971 -1109812 -1102702 -1099721 -1103805 -1103742 -1101828
10058 -1101828 -1098418 -1100669 -1099228 -1093100 -1089309 -1089341 -1089907 -1086407 -1082160 -1080108 -1082360 -1078755 -1074830 -1070426 -1068113
10043 -1068113 -1072321 -1072853 -1068756 -1063048 -1063179 -1057447 -1059274 -1076192 -1101034 -1108940 -1098617 -1093238 -1090629 -1091879
10029 -1091879 -1090326 -1084120 -1076945 -1073679 -1076915 -1079038 -1076206 -1073216 -1070567 -1065526 -1061022 -1062505 -1065459 -1060674
10015 -1060674 -1049332 -1049776 -1051515 -1051781 -1049812 -1049110 -1049749 -1050831 -1053224 -1047890 -1046538 -1038991 -1040999 -1046194 -1040690
10000 -1040690 -1037413 -1035507 -1036148 -1033897 -1031657 -1033697 -1037987 -1032517 -1031081 -1031129 -1028372 -1034500 -1033143 -1030738 -1029419
9985 -1029419 -1032885 -1032431 -1024754 -1019027 -1020018 -1019859 -1017342 -1015535 -1014686 -1013377 -1011764 -1019997 -1012011 -1003279 -1002624
9970 -1002624 -999100 -1001983 -1004027 -1007589 -1014205 -1014067 -1019716 -1017641 -1011776 -1005891 -1009177 -1013167 -1013273 -1016163 -1015283
9955 -1015283 -1009409 -1001242 -995021 -996287 -999092 -1000032 -993380 -990923 -994477 -994442 -988576 -983879 -989320 -991652 -991881
9940 -991881 -990686 -990344 -992866 -997456 -997942 -997495 -996080 -991340 -988743 -988519 -985555 -982298 -977793 -974972 -976511
9925 -976511 -982327 -979278 -975584 -967213 -965346 -973145 -969254 -965773 -969857 -973677 -970233 -962410 -965141 -961573
9911 -961573 -950052 -948161 -948424 -947568 -948787 -947364 -953452 -956185 -953658 -955756 -959521 -958787 -962804 -968238 -963138
9896 -963138 -961840 -967089 -972255 -969354 -965858 -963587 -953400 -950329 -943811 -937464 -938969 -945298 -948615 -948315
9882 -948315 -948153 -946820 -945592 -944020 -941286 -944627 -947044 -944940 -939036 -930514 -930281 -938957 -944450 -939291 -941109
9867 -941109 -941167 -937870 -937645 -943369 -944028 -931339 -926721 -934181 -929524 -926077 -922506 -919113 -916367 -918695 -922758
9852 -922758 -921646 -921298 -919820 -917830 -918612 -917870 -922424 -922957 -921673 -920080 -920546 -922077 -922981 -923408 -920953 -916084
9836 -916084 -908613 -905368 -906458 -909085 -915552 -917490 -920460 -922839 -921479 -916645 -917261 -915695 -914866 -911144 -902720
9821 -902720 -903038 -899953 -900426 -898945 -898650 -901726 -898109 -901563 -904563 -901582 -900198 -896179 -892041 -893755 -898114
9806 -898114 -898816 -895340 -894588 -883249 -874193 -875372 -883443 -884478 -882992 -885109 -886382 -885689 -883436 -885086 -891609
9791 -891609 -892161 -882161 -879196 -876303 -876267 -884331 -886134 -884896 -880378 -876981 -880389 -879608 -881547 -877704 -868292
9776 -868292 -861587 -860021 -857708 -858127 -860047 -861552 -863934 -866074 -865439 -863529 -864066 -866184 -865843 -862086 -860433
9761 -860433 -863915 -861130 -859454 -859343 -859471 -857818 -856500 -854760 -854225 -857825 -861087 -863095 -853323 -843633 -851625
9746 -851625 -857248 -859892 -856161 -851281 -844465 -839057 -841631 -843381 -836248 -836768 -841475 -837352 -840724 -846969 -845004
9731 -845004 -844664 -847999 -849168 -849750 -851567 -849518 -845371 -843252 -844972 -845468 -842144 -840740 -838897 -837356 -836359
9716 -836359 -832468 -829768 -831263 -830713 -832536 -827776 -828668 -828237 -822443 -827211 -827747 -829269 -827251 -824718 -820538
9701 -820538 -814164 -816995 -821517 -817843 -820702 -821578 -819276 -819722 -820495 -826387 -824881 -820267 -819395 -821249 -822357
9686 -822357 -822903 -816440 -816379 -813998 -811752 -814067 -814186 -818102 -810653 -807710 -810574 -811124 -812741 -814306 -816804 -818678
9670 -818678 -814237 -809028 -813123 -813062 -813678 -812539 -811623 -807771 -806911 -803855 -807071 -811110 -806219 -806227 -810257 -811990
9654 -811990 -815135 -812248 -801746 -791848 -789391 -792126 -792752 -800563 -804096 -801406 -794456 -789090 -795321 -804118
9640 -804118 -806577 -804679 -798183 -790762 -790112 -792445 -789493 -789059 -791024 -790764 -789834 -794960 -802157 -801716 -795892 -790139
9624 -790139 -792450 -792756 -790168 -789391 -786485 -781798 -777637 -782556 -779463 -780966 -789139 -790541 -783479 -775886 -776530
9609 -776530 -776207 -778160 -778254 -780851 -779761 -779344 -778565 -777672 -781923 -783355 -779046 -778792 -772215 -769589 -767843 -766925
9593 -766925 -769596 -774969 -774736 -771247 -767501 -768423 -768957 -769146 -768643 -765119 -762324 -762602 -763628 -760664 -761690 -759030
9577 -759030 -751032 -749320 -751187 -748783 -749862 -750544 -754175 -759501 -756193 -756281 -757865 -755711 -753223 -748671 -752585
9562 -752585 -758243 -761999 -756575 -749235 -751681 -754337 -756471 -757000 -755410 -753485 -753424 -749418 -749992 -752478 -750981
9547 -750981 -744930 -741335 -739803 -742909 -743378 -743482 -738863 -734815 -732849 -733357 -735537 -733362 -732086 -728497 -734477
9532 -734477 -739991 -738912 -741445 -743424 -746298 -740413 -734561 -728059 -727039 -729637 -736726 -741939 -738786 -736509
9518 -736509 -735701 -735867 -735462 -737045 -733996 -732080 -727829 -723548 -731886 -737522 -735900 -731945 -728447 -732529 -735224
9503 -735224 -729757 -720532 -715913 -717018 -717724 -721881 -727028 -720956 -720182 -720694 -716809 -714802 -722587 -731498 -731627
9488 -731627 -727692 -725496 -728614 -730969 -727484 -722072 -721043 -722111 -721316 -723733 -724488 -725790 -730244 -740895 -733197
9473 -733197 -722112 -722806 -730109 -730718 -731146 -729585 -725522 -727039 -729115 -724495 -717856 -714718 -715453 -716486 -716701
9458 -716701 -716614 -709255 -703540 -703842 -713239 -716209 -720373 -723379 -721793 -715364 -710373 -707765 -711611 -711724 -710887 -707973
9442 -707973 -712391 -712361 -712129 -713618 -709684 -702832 -700466 -696994 -695576 -700335 -703327 -705877 -707640 -701945 -698366
9427 -698366 -697606 -702650 -705419 -706504 -706834 -703736 -706216 -708613 -705528 -706635 -705815 -700364 -695955 -695196 -694110
9412 -694110 -695610 -693080 -687639 -684499 -683414 -682324 -685192 -689271 -692282 -692126 -691017 -692688 -688643 -690990 -690296
9397 -690296 -692035 -690339 -686740 -683670 -685797 -687224 -688384 -688911 -682010 -677146 -682606 -682800 -680862 -681268 -684090
9382 -684090 -684799 -676547 -674825 -678787 -681626 -677007 -671989 -668878 -669433 -665330 -666667 -673328 -680263 -677506 -678964
9367 -678964 -677038 -676686 -679652 -681647 -672082 -664617 -669333 -671589 -674430 -677245 -675074 -674935 -669589 -668335 -673657
9352 -673657 -674224 -674137 -665631 -663081 -667839 -667902 -663363 -661390 -662035 -667876 -672484 -664405 -659856 -663397 -665549 -660120
9336 -660120 -662051 -661605 -660775 -658964 -661950 -667738 -667537 -669231 -669923 -669270 -672578 -670037 -666423 -665777 -665100 -663900
9320 -663900 -658110 -657621 -654226 -659720 -657614 -654303 -653609 -656749 -657280 -652578 -645745 -650614 -652815 -661734 -657110
9305 -657110 -654165 -647121 -646982 -647740 -650709 -656544 -645748 -642637 -645223 -643940 -650146 -650011 -654941 -658447 -660042
9290 -660042 -655912 -650410 -649685 -654234 -655402 -653285 -651395 -650054 -648276 -647188 -650184 -647244 -643781 -647434 -646655
9275 -646655 -643570 -640489 -648240 -648203 -647912 -648388 -648307 -644791 -641375 -637042 -637507 -640715 -643315 -645257 -641603 -641324
9259 -641324 -637130 -634816 -636375 -635055 -634173 -629788 -624252 -624799 -626774 -625602 -628232 -630934 -638419 -641454 -637087
9244 -637087 -636498 -643068 -644611 -636300 -635828 -637062 -643528 -645845 -643988 -637327 -629640 -626017 -620108 -619755 -618282
9229 -618282 -616966 -620993 -617758 -615527 -622241 -632968 -636634 -635854 -634980 -634196 -633456 -631980 -626103 -623960 -624971
9214 -624971 -628133 -626400 -619524 -615734 -614713 -614512 -614505 -617775 -627202 -624254 -628118 -627574 -624178 -616093 -621116 -622699
9198 -622699 -621910 -618456 -618751 -625646 -624835 -612798 -603455 -610203 -620638 -617613 -615246 -614729 -617927 -616425 -614878
9183 -614878 -612753 -618554 -617891 -608574 -605808 -608842 -604565 -604400 -610103 -608523 -602850 -601575 -610123 -619601 -620458
9168 -620458 -615702 -605865 -602000 -599723 -599002 -594685 -593147 -598519 -603902 -608451 -606492 -606567 -612820 -610200 -611992
9153 -611992 -612925 -609996 -611248 -604728 -595781 -587931 -594117 -600805 -604019 -605010 -601253 -598608 -603215 -604185 -605447
9138 -605447 -601071 -595616 -591796 -592688 -594861 -594654 -594385 -597930 -601627 -603944 -598047 -595933 -594104 -595823 -594660
9123 -594660 -591355 -593805 -599469 -600636 -598245 -598718 -599182 -597896 -594732 -598549 -600833 -599711 -599882 -596752 -600751
9108 -600751 -600546 -605731 -607499 -603679 -606093 -608115 -607875 -605558 -595372 -588575 -589292 -587330 -585205 -585171 -589691
9093 -589691 -593571 -596273 -589853 -583948 -580370 -581625 -585471 -589456 -590519 -584963 -588415 -590229 -585764 -581940
9079 -581940 -588036 -589770 -586653 -586751 -593217 -601851 -605044 -598245 -592822 -587710 -583601 -579528 -583461 -584933 -582854
9064 -582854 -583558 -585095 -583014 -580390 -582287 -583276 -582125 -575542 -567908 -567772 -575061 -575869 -570895 -571648 -574508 -579927
9048 -579927 -580244 -584005 -579119 -577661 -585723 -587443 -586196 -589397 -591152 -581707 -573515 -572592 -577926 -580978 -577245
9033 -577245 -576070 -574499 -576003 -578208 -572952 -572425 -570402 -565369 -567344 -569800 -571888 -581489 -581551 -576610 -581246
9018 -581246 -586734 -587463 -582928 -578204 -573446 -572965 -571707 -562749 -556635 -561944 -561824 -560204 -559771 -567362 -577416
9003 -577416 -574232 -572520 -567640 -563490 -556645 -556801 -557394 -559657 -568339 -571250 -565742 -563075 -557984 -561759 -565812
8988 -565812 -565348 -562353 -561841 -564823 -571165 -572446 -565711 -562703 -559181 -559233 -557891 -561794 -562303 -562013 -561548 -563674
8972 -563674 -564650 -560887 -555110 -555691 -558893 -568490 -562943 -559785 -562221 -562855 -560687 -560288 -557253 -553890 -549945
8957 -549945 -546179 -540141 -546758 -552801 -547664 -545038 -545327 -545112 -539864 -544603 -548207 -549846 -547519 -552045 -550418
8942 -550418 -554503 -560111 -556302 -554271 -550172 -550441 -557985 -561557 -563042 -555131 -552312 -552538 -548247 -542019 -541732
8927 -541732 -551451 -553315 -549826 -551542 -550694 -552565 -558124 -560137 -552145 -549004 -550154 -555860 -560050 -553112 -548455
8912 -548455 -550522 -548682 -546356 -542542 -540856 -541203 -542549 -545945 -541183 -537700 -543452 -548066 -546785 -546800 -543060
8897 -543060 -542737 -541193 -542422 -541494 -543008 -539924 -538297 -539155 -540879 -543442 -545486 -546492 -543442 -541211 -538067
8882 -538067 -535451 -532753 -534234 -538966 -534961 -529237 -534165 -537034 -538436 -536071 -537085 -537783 -538510 -535854 -528722
8867 -528722 -532934 -534640 -537306 -536533 -530394 -526306 -530322 -535914 -537611 -535358 -534512 -528344 -528834 -527609 -525499
8852 -525499 -527015 -533002 -536254 -529139 -528107 -526532 -526080 -525250 -525200 -522497 -519490 -520124 -521975 -522938 -516251 -516413
8836 -516413 -523784 -527495 -529117 -525641 -521254 -521706 -527261 -529804 -529526 -526020 -518923 -518716 -520149 -521966 -521950 -520948
8820 -520948 -518577 -516983 -514940 -517309 -525939 -528389 -529204 -529616 -524838 -525295 -521036 -515254 -519939 -524858 -526598
8805 -526598 -528121 -530289 -529145 -526118 -520302 -514731 -516566 -520539 -518836 -517981 -517389 -515984 -513117 -507323 -508277
8790 -508277 -508717 -504883 -507264 -513862 -509728 -509570 -510038 -507639 -509232 -512409 -516592 -517431 -521346 -521240 -519558 -517457
8774 -517457 -514679 -511204 -514753 -515426 -515467 -515902 -520904 -519442 -513966 -510786 -509186 -512032 -515157 -516499 -512305
8759 -512305 -508997 -506444 -504450 -502279 -505784 -501969 -500601 -496403 -493687 -502697 -503176 -505614 -507620 -509442 -504163
8744 -504163 -503889 -506401 -504548 -501959 -498933 -497183 -500438 -496185 -492668 -494689 -503708 -503539 -496759 -493685 -497671
8729 -497671 -499963 -501586 -504472 -506216 -509963 -507563 -504047 -501244 -504284 -507414 -507601 -510193 -510028 -505703 -502657
8714 -502657 -495630 -494400 -494122 -498188 -500585 -497602 -491048 -491217 -489227 -489423 -495686 -495011 -490894 -495115 -496999
8699 -496999 -498161 -496007 -493281 -496894 -494976 -494880 -492431 -489038 -491121 -491416 -492886 -497381 -499011 -499011 -502599 -497068
8683 -497068 -495107 -502785 -500572 -491854 -491121 -492820 -491015 -494451 -497931 -493231 -485194 -484465 -481461 -485022 -484573
8668 -484573 -485830 -491865 -494401 -497115 -498115 -490280 -492182 -497003 -495356 -491557 -492239 -496036 -488539 -485823 -488973
8653 -488973 -484914 -480601 -477764 -482216 -480992 -480045 -486135 -490553 -487168 -488433 -490136 -494350 -495423 -490284 -490766
8638 -490766 -487495 -492929 -496943 -491243 -488805 -489357 -489537 -489408 -486709 -483812 -479360 -473346 -476703 -476153 -471878
8623 -471878 -474251 -474499 -475533 -482077 -480948 -476175 -477581 -476251 -468711 -468992 -470200 -469531 -473611 -484119 -490343
8608 -490343 -486814 -483751 -478995 -477443 -472647 -474210 -478681 -484343 -478784 -476276 -476025 -476392 -472794 -472130 -475793
8593 -475793 -474332 -473825 -470635 -471263 -472199 -471347 -473510 -471261 -469140 -472378 -477109 -476135 -470869 -465744 -464738 -468523
8577 -468523 -473376 -472591 -478359 -479574 -476920 -476260 -474755 -478481 -479205 -484722 -490615 -491577 -486350 -478219 -478194 -487083
8561 -487083 -489018 -484744 -482957 -479403 -480051 -477114 -474892 -481498 -486518 -484730 -486657 -489158 -485975 -483872 -484332
8546 -484332 -484642 -478763 -478470 -480149 -481481 -485681 -478990 -475486 -478288 -482271 -480967 -480149 -480988 -480613 -482659 -485537
8530 -485537 -486548 -477597 -473557 -474687 -472409 -471563 -471560 -470499 -472958 -474652 -473203 -475964 -471516 -467718 -468204 -471903
8514 -471903 -477149 -475423 -469627 -469719 -469980 -474447 -473349 -468021 -464692 -464486 -467067 -469072 -464250 -461843 -461953 -465901
8498 -465901 -469428 -466838 -470712 -474472 -474937 -471969 -469924 -465939 -463591 -469410 -477868 -478075 -475041 -473493 -471873
8483 -471873 -468305 -468241 -466032 -466276 -460843 -461914 -465272 -464163 -465505 -474782 -474647 -475949 -476805 -470067 -465375 -467279
8467 -467279 -468939 -470916 -469343 -466652 -460574 -461511 -463706 -458233 -454879 -456196 -458191 -460117 -467054 -469214 -463804
8452 -463804 -461822 -461811 -459304 -459694 -458789 -460688 -466568 -469671 -466749 -467580 -467638 -465274 -466052 -472909 -478163 -472589
8436 -472589 -471749 -467516 -463344 -462781 -459907 -459950 -455706 -454794 -455698 -457683 -462390 -460210 -460942 -453999 -452933 -454461
8420 -454461 -458333 -459731 -453963 -452839 -454055 -456551 -457508 -459374 -461377 -457118 -455909 -461995 -465031 -460562 -461280
8405 -461280 -458733 -457405 -455285 -459218 -458100 -453952 -453789 -456288 -457434 -454360 -448729 -446805 -451443 -457864 -457972
8390 -457972 -450590 -450098 -450244 -449540 -450398 -450303 -454029 -450906 -448520 -449173 -454128 -461358 -463428 -456048 -447215 -450877
8374 -450877 -450309 -443679 -442724 -447325 -451712 -451200 -445509 -443892 -442440 -444908 -449679 -454262 -452559 -449850 -442608
8359 -442608 -442906 -449690 -451319 -456146 -455833 -449763 -446930 -448434 -448675 -446666 -444220 -447251 -446127 -448649 -449463
8344 -449463 -448844 -453325 -451595 -446982 -443252 -429623 -424299 -431847 -433181 -433113 -435269 -431116 -434855 -442175 -444762
8329 -444762 -446525 -443582 -437397 -439916 -446002 -444990 -439214 -441598 -438302 -435778 -446130 -448837 -448655 -451222
8315 -451222 -452072 -449870 -440918 -436768 -431956 -437602 -445830 -438376 -431720 -432017 -431504 -431236 -431934 -437200 -437672 -433856
8299 -433856 -429052 -432548 -436811 -438498 -442080 -440539 -437115 -435856 -435913 -431340 -427915 -429887 -433102 -436579 -430516
8284 -430516 -431448 -439798 -438588 -433855 -429834 -429953 -429320 -431551 -433554 -433457 -436135 -436959 -434196 -427682 -429873 -433624
8268 -433624 -432271 -435526 -437125 -436562 -438922 -434282 -432793 -429440 -423168 -431052 -435011 -432201 -434745 -436868 -439308
8253 -439308 -438990 -439936 -437934 -435619 -430981 -425927 -425909 -430959 -431260 -432903 -434434 -427231 -422735 -421250 -423058 -422088
8237 -422088 -421998 -417508 -411933 -415371 -419999 -422264 -418508 -416682 -417362 -414136 -415077 -414614 -417270 -416694 -418273 -415781
8221 -415781 -411079 -417872 -419139 -419332 -425881 -427829 -427381 -428827 -427168 -426616 -422044 -422850 -422085 -427134 -428970 -426405
8205 -426405 -420829 -416046 -417350 -417020 -422016 -418786 -417073 -416925 -420592 -420572 -419789 -419753 -417687 -416426 -419600 -417685
8189 -417685 -421091 -428897 -425355 -421098 -418328 -420396 -423013 -423883 -423833 -425258 -421931 -416385 -418812 -419398 -418339
8174 -418339 -417369 -419956 -422079 -424920 -425260 -427214 -427764 -423200 -417997 -416844 -416520 -416570 -417546 -419173 -421163 -415802
8158 -415802 -413277 -409795 -407325 -410532 -411286 -413498 -411291 -408296 -413415 -418310 -413166 -403460 -399956 -397817 -397182
8143 -397182 -404501 -406019 -408030 -409023 -411473 -409647 -412243 -411882 -409417 -407035 -407283 -409223 -406497 -404827 -408944
8128 -408944 -414374 -416716 -417572 -418225 -409644 -406743 -411011 -417800 -420394 -417203 -414152 -412606 -404795 -397623 -395951
8113 -395951 -394692 -397119 -403718 -404963 -397886 -395641 -398859 -400485 -400956 -398913 -400164 -401237 -405077 -402782 -397614
8098 -397614 -398416 -401244 -400944 -401317 -401642 -401586 -405961 -408269 -405836 -409137 -410710 -408889 -412006 -409511 -399967 -403940
8082 -403940 -406526 -400951 -405313 -413003 -408538 -398670 -397413 -402037 -403371 -408826 -414754 -410653 -404578 -399718
8068 -399718 -396354 -396955 -400532 -407060 -407067 -402534 -400563 -396760 -401017 -405776 -407662 -409442 -405146 -403445 -402830 -403427
8052 -403427 -403569 -403025 -398552 -403030 -406149 -405103 -400426 -397979 -400993 -407145 -407341 -404833 -407343 -405456 -400746
8037 -400746 -400080 -400932 -399727 -396124 -393500 -391372 -392478 -395986 -396613 -401330 -405432 -401924 -395055 -397273 -399793
8022 -399793 -401965 -404444 -405053 -403239 -397272 -395644 -395058 -395235 -397759 -392831 -395439 -398461 -389633 -385535 -395156
8007 -395156 -394665 -395370 -392156 -391994 -396301 -397131 -400028 -398416 -390927 -384821 -388546 -389054 -385801 -381750 -384087 -387851
7991 -387851 -390482 -388942 -391285 -389886 -387689 -385459 -388808 -388527 -395917 -401026 -398639 -398350 -400106 -398055 -393385
7976 -393385 -383755 -379766 -380200 -384514 -387740 -385857 -390535 -390700 -395846 -397763 -394695 -393234 -390798 -388851 -387600
7961 -387600 -385949 -391198 -393521 -394282 -392554 -394599 -395780 -394219 -394521 -393832 -392728 -394426 -392773 -385477 -384099
7946 -384099 -388699 -388417 -386155 -380372 -385316 -388296 -384167 -386241 -389776 -389164 -391751 -397808 -388776 -383740 -388452
7931 -388452 -394293 -392255 -389996 -387471 -388153 -391594 -392811 -397378 -391664 -384696 -382548 -387128 -393547 -399633 -400380
7916 -400380 -403619 -405668 -403543 -405692 -402598 -401064 -393454 -386656 -387427 -390093 -393546 -394113 -388806 -384923 -388588
7901 -388588 -393811 -399123 -402510 -399255 -395698 -398291 -395320 -390138 -391198 -394594 -392380 -390003 -393563 -392786 -394159
7886 -394159 -396772 -396785 -401170 -402466 -399573 -392314 -392833 -401793 -403837 -396558 -390959 -391482 -395445 -388634 -386287
7871 -386287 -389954 -395690 -397980 -403806 -403105 -392567 -387377 -388473 -386827 -388709 -389261 -390916 -390502 -383430 -382391
7856 -382391 -385008 -388623 -391829 -391652 -385830 -385391 -390167 -396047 -400234 -399225 -393337 -389577 -392001 -386697 -386003
7841 -386003 -387966 -390403 -386074 -384267 -389523 -397239 -398247 -396743 -394656 -396006 -395889 -392259 -392852 -395742 -397121
7826 -397121 -392752 -390311 -393516 -394605 -392484 -390400 -389746 -390125 -383431 -378223 -381902 -383930 -381264 -382218 -384115
7811 -384115 -386403 -387107 -387969 -386667 -386287 -386048 -387064 -388988 -390237 -385348 -381454 -385294 -388104 -389708 -387412
7796 -387412 -388243 -392800 -388391 -388167 -388598 -382684 -379227 -379734 -383993 -389836 -389218 -385630 -384151 -383305 -383462 -385118
7780 -385118 -384151 -388617 -390591 -392203 -384974 -379269 -377187 -378776 -384438 -384668 -384120 -378888 -379685 -382114 -383640
7765 -383640 -380761 -379842 -379137 -380091 -376749 -379053 -383664 -383170 -383105 -377560 -378930 -381754 -382100 -378040 -371540 -373455
7749 -373455 -379464 -387595 -391238 -389677 -388990 -391544 -386389 -382119 -380501 -381811 -382869 -382757 -378625 -373231 -373511
7734 -373511 -376260 -377672 -378729 -381757 -387910 -386558 -381549 -371913 -373801 -372701 -368788 -368494 -371074 -369066 -376323
7719 -376323 -378840 -372483 -369337 -372313 -378136 -383928 -382791 -380841 -378940 -372828 -371613 -371458 -370138 -371242 -372324
7704 -372324 -370553 -375080 -379568 -383243 -382553 -372437 -367427 -371304 -371861 -371599 -375568 -379883 -381931 -380405 -379805
7689 -379805 -375992 -369379 -363313 -359688 -367021 -367208 -369048 -373616 -372614 -373831 -372129 -374716 -374414 -373532 -370223
7674 -370223 -372531 -368233 -362574 -367684 -371702 -365430 -363385 -366569 -370471 -368261 -371723 -368784 -365841 -365236 -367050
7659 -367050 -365844 -367887 -365051 -359069 -362769 -366076 -363471 -364512 -366114 -365451 -359742 -364173 -370625 -371447 -371284
7644 -371284 -373379 -369669 -366278 -361704 -363465 -366756 -365069 -364874 -369179 -375948 -375970 -367746 -362695 -358144 -358982
7629 -358982 -356306 -346554 -344064 -349517 -360528 -363639 -363241 -360012 -360288 -363526 -361873 -365823 -367195 -364390 -361305
7614 -361305 -354207 -357657 -366834 -366799 -364251 -365180 -364165 -360003 -360333 -363132 -355845 -354050 -354503 -350339 -346427 -349766
7598 -349766 -361685 -359774 -354545 -357080 -362796 -360031 -356439 -349735 -350141 -357878 -359688 -359052 -363167 -359478 -351262
7583 -351262 -346998 -349311 -353657 -350720 -347357 -346652 -354903 -354435 -349849 -346245 -343738 -346747 -349640 -349343 -350961
7568 -350961 -349296 -348152 -352398 -354110 -349514 -349326 -349078 -345241 -341432 -349964 -352010 -350386 -356578 -358923 -358666
7553 -358666 -355217 -355098 -359539 -358789 -355470 -357362 -359361 -359829 -363249 -366043 -364965 -360459 -358208 -355037 -352757
7538 -352757 -350473 -348244 -346568 -345626 -343565 -344321 -354018 -362758 -361778 -359078 -361628 -357799 -352399 -349851 -343613
7523 -343613 -342410 -349681 -347384 -345146 -345539 -351818 -358026 -359336 -360194 -360804 -358830 -355267 -350466 -351618 -351587 -349001
7507 -349001 -350782 -349148 -349116 -348425 -354054 -353486 -354636 -354660 -349262 -352650 -347990 -341898 -347106 -353780 -350807 -350547
7491 -350547 -351828 -354386 -355043 -349633 -346586 -347401 -347719 -351102 -352083 -353638 -360347 -355438 -347909 -347763 -350680 -347615
7475 -347615 -343466 -343901 -340491 -336643 -343420 -347156 -344513 -340176 -340265 -343982 -347599 -349483 -345520 -343295 -339061
7460 -339061 -335052 -336144 -337860 -336851 -337750 -333720 -331165 -339736 -337590 -334931 -336167 -337369 -338541 -341742 -338511
7445 -338511 -336846 -339255 -343602 -346593 -347206 -340561 -337979 -344472 -349215 -349305 -347508 -347835 -351645 -354194 -349802
7430 -349802 -352452 -353133 -351078 -349181 -346679 -345689 -343105 -342564 -347675 -344383 -345187 -342566 -340129 -340608 -343248 -336922
7414 -336922 -340602 -334769 -334880 -344498 -346116 -341865 -337166 -336101 -337573 -338874 -344348 -349032 -350117 -347357 -350831
7399 -350831 -347124 -347431 -340550 -338759 -339941 -340877 -339312 -337897 -343820 -349191 -350386 -346067 -344583 -347415 -342476
7384 -342476 -339573 -338034 -340471 -341976 -347545 -344340 -339569 -338769 -341177 -342499 -334696 -329446 -330842 -331863 -332060
7369 -332060 -333120 -331300 -331223 -336274 -339220 -337833 -333627 -332674 -336951 -339272 -338456 -334619 -333985 -333598 -333231 -326209
7353 -326209 -324439 -326748 -335171 -343503 -338854 -328946 -328223 -331021 -332166 -330445 -332135 -332321 -330398 -331381 -337374
7338 -337374 -337247 -338331 -341239 -337271 -334830 -329764 -330117 -337185 -339428 -332934 -338472 -340016 -338592 -337479 -335407
7323 -335407 -338625 -339062 -336629 -340539 -342695 -339571 -340700 -342051 -334189 -327869 -327663 -328307 -331356 -331500 -335146
7308 -335146 -337996 -334870 -332124 -332967 -334159 -326841 -322309 -325575 -332045 -329405 -323832 -325308 -334274 -328444 -321869
7293 -321869 -319404 -320041 -324476 -329771 -326969 -323798 -323091 -320451 -321248 -324222 -329716 -329083 -320813 -316926 -317842 -320607
7277 -320607 -322824 -323108 -321746 -330086 -334007 -332915 -335120 -335579 -333162 -329059 -325514 -320265 -313388 -317678 -319509
7262 -319509 -319202 -323961 -325639 -326026 -326760 -325890 -326560 -330152 -328190 -324875 -322284 -327766 -333947 -335461 -331866 -324935
7246 -324935 -316467 -314376 -314375 -312000 -316706 -318780 -326945 -325159 -319590 -319211 -322103 -321481 -326107 -321721 -316592 -321463
7230 -321463 -321417 -319421 -320929 -321482 -321347 -321853 -322580 -316621 -319842 -329619 -334918 -332904 -332730 -328810 -324156 -325315
7214 -325315 -325726 -323490 -319676 -317415 -320269 -321863 -321558 -322290 -326696 -327875 -325759 -321867 -323706 -325896 -326242
7199 -326242 -320499 -317530 -317526 -317986 -317397 -321100 -323787 -324263 -327526 -325014 -327458 -334138 -336788 -332119 -328286 -327794
7183 -327794 -325386 -325638 -326182 -331064 -330092 -321477 -320133 -324536 -318441 -311224 -316602 -322007 -322244 -316187 -313604
7168 -313604 -314999 -316312 -318480 -311791 -307291 -310121 -317410 -316857 -319664 -325075 -320555 -314665 -312896 -317743 -315107
7153 -315107 -314804 -312721 -312380 -314839 -321595 -324543 -322530 -320626 -317241 -310992 -310940 -316577 -316009 -311753 -309991 -313771
7137 -313771 -314457 -313960 -306737 -312890 -320928 -320336 -319368 -316186 -314277 -314223 -311061 -309619 -317959 -323225 -314361 -313769
7121 -313769 -318544 -315597 -315579 -315253 -313155 -309699 -311670 -313732 -314095 -316029 -314186 -311441 -309526 -307625 -305328
7106 -305328 -309004 -307497 -308993 -314500 -318669 -309856 -301161 -302220 -306357 -314554 -317099 -318861 -319807 -321675 -318289
7091 -318289 -316914 -319594 -320842 -321560 -323813 -319684 -316485 -319190 -312346 -311815 -313780 -316043 -320476 -319343 -316119
7076 -316119 -314053 -310252 -307268 -309020 -305634 -305607 -304491 -305156 -303746 -303141 -303074 -306093 -316184 -318341 -320277 -321789
7060 -321789 -321772 -319847 -315255 -316385 -322827 -321657 -310563 -307173 -309849 -303911 -306952 -309481 -306665 -312360 -312883
7045 -312883 -316341 -315286 -307159 -307452 -310472 -312789 -312757 -309460 -310382 -313228 -310988 -309286 -312971 -309697 -312149
7030 -312149 -316679 -312308 -314084 -311586 -302365 -304549 -302905 -303848 -305852 -304250 -310142 -310856 -308550 -309574 -309107
7015 -309107 -304512 -307368 -311520 -311902 -311204 -310203 -310232 -312395 -310648 -305565 -302103 -301188 -301237 -303962 -307204 -314160
6999 -314160 -310810 -307153 -305485 -305647 -310240 -309409 -307949 -312699 -318783 -313021 -303995 -301331 -301892 -301057 -297241
6984 -297241 -303509 -307421 -304190 -300392 -305329 -314232 -313882 -312366 -306591 -305930 -305855 -300889 -297659 -295941 -299884
6969 -299884 -305996 -311464 -311431 -307174 -300395 -306251 -314289 -310138 -308097 -309117 -312129 -310011 -307840 -304362 -300119
6954 -300119 -301225 -302399 -295800 -297727 -302983 -305353 -308514 -307441 -304016 -302557 -307285 -308089 -306453 -307009 -304768
6939 -304768 -307932 -307392 -302576 -298662 -300906 -306148 -305309 -307397 -305725 -297309 -297088 -299187 -296976 -298764 -298488
6924 -298488 -297181 -300666 -302021 -297757 -300902 -302739 -304774 -311890 -312265 -306359 -300643 -301393 -301529 -303342 -297181
6909 -297181 -300010 -303506 -305009 -303456 -308320 -306412 -297871 -297736 -296436 -296354 -297736 -301574 -300514 -302405 -308111
6894 -308111 -309037 -309490 -309950 -301839 -294594 -297887 -305615 -305643 -300447 -296966 -294975 -296957 -301095 -307257 -311079 -306995
6878 -306995 -301546 -298957 -302865 -308207 -307845 -303194 -297964 -295657 -297633 -300255 -300825 -295056 -293952 -292136 -292468
6863 -292468 -296550 -296580 -298414 -299331 -297533 -297114 -294843 -292530 -294436 -301526 -300250 -295199 -291897 -289782 -294131
6848 -294131 -300345 -300538 -299429 -295701 -298493 -301457 -302955 -298797 -299549 -298564 -301307 -302585 -303308 -302434 -301869 -296966
6832 -296966 -294963 -295397 -288102 -292664 -296499 -297714 -296198 -294437 -297764 -294451 -288802 -288386 -288545 -289081 -285768
6817 -285768 -286138 -282410 -284913 -291044 -293254 -299213 -300701 -295150 -290414 -290972 -288690 -289592 -293422 -298874 -297421
6802 -297421 -294624 -286928 -284258 -284463 -288295 -291532 -298570 -297499 -301752 -298379 -293174 -291954 -289408 -293748 -295884
6787 -295884 -300080 -297067 -289001 -284238 -286589 -289885 -287487 -286338 -291104 -287396 -287039 -290538 -293905 -297756 -298730
6772 -298730 -295636 -291974 -287491 -281160 -277326 -282139 -283854 -286073 -285182 -287319 -290749 -287637 -288226 -289987 -293467
6757 -293467 -296453 -290275 -286590 -291314 -296230 -290485 -282938 -281908 -286816 -287343 -288263 -284715 -276999 -275969 -279704
6742 -279704 -282895 -285066 -289475 -292166 -287301 -286767 -284196 -289268 -294048 -290570 -290423 -290488 -293557 -294601 -293230
6727 -293230 -293272 -288266 -279026 -279626 -283098 -277174 -271396 -269920 -278406 -284013 -287580 -286761 -293858 -298799 -302451
6712 -302451 -304438 -299519 -290532 -282506 -279753 -280272 -279876 -278346 -276282 -277802 -278275 -280107 -280055 -281338 -279499 -276353
6696 -276353 -281270 -282559 -282117 -287571 -290402 -293807 -298842 -296770 -295104 -292731 -290216 -290243 -289898 -288641 -295323
6681 -295323 -297034 -291932 -291489 -289394 -284871 -287993 -285933 -290487 -289297 -285968 -291500 -297919 -300433 -297046 -294491
6666 -294491 -288576 -285782 -282012 -278890 -283399 -283386 -277814 -276517 -277304 -278097 -281426 -284659 -289719 -289652 -288048 -282665
6650 -282665 -276616 -272604 -271164 -276568 -280012 -283926 -288408 -292100 -290959 -284532 -287532 -294055 -292567 -283944
6636 -283944 -282213 -282123 -287176 -282364 -277441 -277539 -278203 -276218 -278391 -280402 -279786 -276577 -279749 -283013 -276419 -276075
6620 -276075 -277084 -276687 -279504 -277760 -276500 -278776 -283183 -282671 -281466 -283048 -288319 -288604 -283372 -278105 -275155
6605 -275155 -268589 -273365 -276120 -268291 -270133 -276316 -283913 -276850 -272636 -273619 -277061 -276096 -272249 -270361 -278780
6590 -278780 -285197 -287934 -293114 -294747 -285649 -282141 -283075 -276707 -279981 -284962 -287463 -281635 -278725 -280709 -284002
6575 -284002 -281879 -285734 -282995 -282692 -285370 -284703 -276294 -275124 -273914 -268572 -276507 -281345 -282720 -283541 -285501
6560 -285501 -283212 -280218 -279912 -276836 -271078 -268284 -273921 -281600 -288216 -289064 -284986 -279333 -276659 -279255 -277676
6545 -277676 -276168 -275410 -276534 -278511 -276637 -277390 -279976 -280606 -286141 -283562 -276706 -275526 -273764 -268457 -265010
6530 -265010 -268369 -272726 -271076 -270545 -272610 -271787 -267348 -262345 -265547 -275006 -281141 -277958 -283979 -285646 -280604
6515 -280604 -279002 -273134 -275841 -282028 -276835 -271878 -269264 -268438 -270005 -270582 -274954 -280230 -276333 -274700 -274444
6500 -274444 -274406 -274833 -272112 -273323 -270767 -266697 -268850 -271348 -272918 -276600 -274699 -273863 -276959 -281148 -279970
6485 -279970 -276539 -275676 -272965 -269496 -276109 -271883 -267961 -267492 -273984 -275246 -271952 -265550 -270160 -271618 -275522
6470 -275522 -274269 -272297 -266483 -264664 -266983 -274363 -276596 -278027 -277342 -269728 -266533 -261568 -261055 -267724 -267871
6455 -267871 -268449 -268232 -272851 -273452 -278106 -279772 -277259 -273930 -269861 -275271 -275475 -274154 -277777 -274818 -276819
6440 -276819 -276462 -270954 -269027 -270300 -272331 -271338 -262754 -265075 -264627 -260856 -262760 -266642 -270795 -265411 -260823
6425 -260823 -263712 -272971 -275594 -270018 -263131 -258406 -259679 -264532 -262859 -262701 -271083 -274600 -270211 -268033 -274327
6410 -274327 -275283 -269047 -268950 -272115 -273948 -278568 -276460 -268167 -271409 -274681 -278424 -277106 -276659 -277384 -279591 -277568
6394 -277568 -272230 -270042 -268935 -269718 -267642 -264318 -263195 -263021 -267508 -271083 -272162 -275457 -277209 -279811 -279886
6379 -279886 -278748 -277056 -272681 -271510 -270895 -268130 -266012 -259194 -261022 -266734 -269469 -272652 -268936 -267470 -266633
6364 -266633 -266140 -260355 -254384 -255278 -263929 -268704 -267257 -265480 -262363 -264409 -259427 -262776 -265650 -265161 -263854
6349 -263854 -256640 -259382 -265427 -268562 -264131 -265314 -266762 -268216 -267441 -264099 -265157 -262110 -254938 -255736 -261249
6334 -261249 -260745 -257522 -253587 -259129 -262479 -262731 -264572 -262843 -262050 -258772 -261187 -263109 -262380 -260113 -258489
6319 -258489 -261743 -269280 -268249 -267564 -268861 -266834 -264652 -266741 -261071 -262021 -264958 -271220 -266956 -265992 -266728
6304 -266728 -268792 -274140 -273275 -270518 -267466 -271181 -268483 -264153 -264271 -259867 -259887 -257601 -257615 -260561 -264315 -260502
6288 -260502 -253538 -251426 -253652 -257805 -262898 -265939 -262622 -264354 -260259 -258452 -263812 -264798 -262470 -263927 -260795
6273 -260795 -258198 -261286 -260888 -264932 -263236 -259530 -252241 -252894 -258324 -258847 -261782 -263483 -259244 -259131 -261924
6258 -261924 -258609 -253967 -252566 -256654 -255886 -249574 -245572 -247063 -250584 -250395 -250851 -254214 -255880 -255935 -261458 -267514
6242 -267514 -272922 -268323 -265729 -273586 -270174 -267817 -267936 -262077 -260163 -262317 -264775 -265264 -269371 -268785 -265610
6227 -265610 -260243 -254853 -252802 -256782 -261555 -264155 -260967 -260025 -254309 -255475 -256674 -252850 -249906 -248774 -256478
6212 -256478 -261040 -263621 -268586 -270228 -264185 -266523 -264315 -258884 -255658 -256690 -263245 -266193 -261154 -256812
6198 -256812 -255085 -253148 -251881 -251259 -251295 -251767 -252984 -255585 -254863 -259959 -256560 -252480 -249775 -249100 -252862 -253208
6182 -253208 -252016 -252771 -250266 -249421 -251970 -252191 -252158 -261363 -267252 -266607 -269239 -266653 -260867 -255979 -256135 -257005
6166 -257005 -256069 -256719 -258741 -264271 -265626 -263350 -259106 -253935 -252357 -250782 -251028 -247564 -252442 -249250 -247125
6151 -247125 -251524 -253803 -252914 -252479 -253916 -258751 -256722 -255658 -252932 -258096 -258847 -256016 -258782 -255616 -255467
6136 -255467 -262546 -263790 -262346 -260575 -258118 -256256 -257070 -254834 -252006 -255737 -259259 -264104 -258969 -252756 -247638
6121 -247638 -245673 -248471 -253890 -258416 -257843 -258341 -263679 -258392 -258738 -254138 -252158 -253783 -256005 -253754 -253334
6106 -253334 -255513 -249975 -245244 -249314 -250271 -254227 -251260 -255612 -260887 -264175 -263448 -263920 -262724 -260978 -259048
6091 -259048 -261276 -264388 -264452 -261625 -257633 -254467 -252068 -257394 -258174 -256993 -264628 -262021 -256298 -251982 -249756
6076 -249756 -252610 -253789 -255098 -254588 -255269 -258628 -257781 -254575 -252610 -249057 -249143 -250655 -250620 -249097 -251253 -256484
6060 -256484 -252379 -250618 -251158 -256142 -259542 -258273 -256245 -251440 -248109 -244825 -245437 -248842 -254316 -255324 -252550
6045 -252550 -253024 -247833 -249203 -249020 -248780 -256439 -259769 -259153 -262127 -261388 -261862 -254393 -248990 -248104 -246198 -250822
6029 -250822 -257372 -260145 -262033 -257552 -249416 -242160 -238868 -242123 -244393 -251180 -248331 -242364 -239558 -248555
6015 -248555 -253888 -250041 -246797 -246431 -238883 -236694 -238665 -242221 -246116 -250374 -251029 -252210 -251401 -251862 -247506
6000 -247506 -242275 -237843 -241766 -240535 -236914 -243213 -243526 -241635 -241152 -239691 -241916 -243705 -238618 -235491 -238815
5985 -238815 -237000 -242409 -247892 -247388 -246132 -241841 -247349 -249224 -248421 -244916 -240018 -245468 -248462 -250639 -251372
5970 -251372 -252965 -251084 -249736 -250972 -249665 -248853 -247557 -247648 -245767 -245906 -250160 -249453 -251664 -253112 -250009 -240671
5954 -240671 -239794 -239060 -242287 -246247 -249605 -251504 -248165 -246692 -244440 -245811 -244703 -246336 -251866 -254095 -258103
5939 -258103 -257094 -249758 -251604 -248989 -242792 -244809 -248852 -247065 -238957 -242602 -242453 -241685 -244122 -244875 -242724
5924 -242724 -244807 -237301 -240258 -241714 -241520 -239454 -241810 -248577 -244448 -238798 -233117 -237101 -244428 -244965 -246252
5909 -246252 -244866 -237609 -238854 -241482 -252340 -257311 -253757 -250128 -249970 -251701 -249251 -245198 -244845 -243841 -236915
5894 -236915 -235234 -238152 -244065 -250723 -249236 -247678 -244968 -244690 -249119 -256429 -247695 -242206 -246317 -249221 -247210
5879 -247210 -242402 -236990 -239057 -239125 -244972 -248928 -245750 -244502 -242796 -246558 -247033 -245589 -239776 -241706 -244752
5864 -244752 -248796 -251417 -248413 -240444 -236342 -241292 -245892 -244510 -244273 -243872 -250058 -252124 -253862 -254210 -251088
5849 -251088 -246389 -247222 -252083 -250103 -244689 -245625 -243802 -243462 -238458 -242420 -250082 -249632 -246128 -241440 -242476
5834 -242476 -247352 -246861 -245244 -245868 -245214 -242690 -249700 -247672 -244797 -246930 -250602 -247665 -237369 -233548 -234851
5819 -234851 -231092 -226590 -229513 -235350 -238986 -238132 -240150 -240817 -244561 -247165 -247552 -248723 -246563 -242352 -243417
5804 -243417 -243049 -238999 -238978 -235739 -231853 -235566 -242127 -243128 -239016 -240563 -240597 -246720 -250426 -243566 -246733 -243732
5788 -243732 -237637 -234526 -227246 -224099 -228911 -238999 -247895 -246590 -243670 -242352 -239577 -238555 -239551 -240013 -242787
5773 -242787 -241124 -238775 -237356 -236929 -240511 -247558 -247943 -247599 -241099 -244584 -242632 -241523 -237479 -239616 -238097
5758 -238097 -236275 -237017 -230329 -235075 -237714 -238868 -238859 -241407 -238184 -234648 -237200 -244218 -246413 -244765 -238572
5743 -238572 -238059 -240147 -238341 -238677 -237451 -235915 -238307 -239539 -232166 -228957 -232296 -233418 -238452 -239252 -236498
5728 -236498 -233983 -233448 -233846 -234150 -234919 -235829 -240281 -238930 -241252 -244351 -242347 -244220 -247463 -250623 -246210 -243454
5712 -243454 -240163 -241077 -237032 -236038 -242484 -245727 -246589 -244153 -238224 -238083 -232726 -226459 -226012 -232412 -234537 -239451
5696 -239451 -240326 -236637 -227139 -224437 -235017 -240418 -242528 -244697 -247008 -245616 -242228 -234018 -231079 -227092
5682 -227092 -225140 -225981 -228070 -227604 -227350 -228485 -226426 -228988 -232684 -238870 -243794 -240610 -239184 -236069 -232370
5667 -232370 -238887 -237568 -230360 -230544 -229152 -231855 -231972 -231551 -230457 -228990 -227627 -222742 -224578 -233503 -239066
5652 -239066 -238150 -232192 -231997 -236109 -234153 -231384 -232775 -229945 -231066 -232038 -234935 -235425 -231202 -232962 -231781
5637 -231781 -230276 -234813 -240335 -247683 -248947 -245004 -237319 -231440 -226906 -230421 -231665 -230868 -231617 -235062 -233818
5622 -233818 -233851 -237820 -241284 -241717 -237896 -235044 -237258 -233004 -231092 -235667 -235301 -236882 -238966 -233539 -224531
5607 -224531 -223916 -225357 -225272 -230473 -230412 -233456 -229271 -235109 -239820 -238895 -237157 -238689 -235990 -236928 -237431 -232640
5591 -232640 -230657 -227026 -221663 -222971 -228542 -228653 -224754 -226021 -233490 -235505 -230128 -232143 -236642 -239949 -239968
5576 -239968 -235741 -235214 -235263 -234429 -239762 -239733 -233548 -233484 -238979 -238460 -234774 -231483 -230240 -231487 -231991 -226929 -229522
5559 -229522 -227020 -231031 -230548 -234985 -236991 -239239 -241268 -242924 -240607 -238441 -229931 -222824 -225231 -225362 -226345
5544 -226345 -224318 -230469 -233615 -238829 -244502 -241446 -230346 -224331 -222857 -224582 -224563 -225570 -222731 -219201 -215353
5529 -215353 -212279 -216601 -225978 -232379 -227793 -221602 -218969 -225750 -229088 -227364 -228931 -232734 -239742 -238484
5515 -238484 -228105 -225498 -228798 -228618 -229458 -228332 -229693 -234150 -233338 -232672 -238672 -241575 -241121 -241014 -242272 -237116
5499 -237116 -229201 -229692 -224439 -217740 -221056 -222796 -226629 -230953 -238100 -234172 -227813 -226305 -226898 -227938 -224315
5484 -224315 -222224 -220906 -224562 -227068 -223853 -221248 -223516 -225409 -224044 -216197 -209574 -215077 -220728 -225466
5470 -225466 -224147 -226909 -227983 -230638 -227955 -227581 -230944 -233250 -229497 -227311 -222035 -218117 -213371 -216924 -223671
5455 -223671 -227156 -232169 -233866 -231235 -221694 -215838 -215639 -219328 -222015 -224131 -225211 -223958 -227571 -226890 -221950
5440 -221950 -217684 -218292 -219754 -216630 -217589 -219311 -222835 -225082 -219994 -222625 -223314 -221384 -223387 -227023 -230170
5425 -230170 -234091 -231438 -231964 -230345 -234893 -235951 -225885 -219484 -221818 -221277 -222313 -225197 -221895 -218093 -222379
5410 -222379 -228189 -226442 -218515 -216253 -215867 -217349 -222908 -224698 -229114 -234115 -234486 -235374 -231934 -236508 -237027
5395 -237027 -233787 -230543 -230857 -230010 -228651 -228957 -225604 -223369 -227438 -226717 -222338 -223129 -229052 -226571 -222263 -223114
5379 -223114 -228454 -226456 -226457 -224629 -224807 -222212 -220845 -221247 -216698 -212522 -215517 -220429 -223318 -220970 -220689 -225480
5363 -225480 -224741 -219436 -217384 -209254 -211125 -218463 -215284 -217731 -219548 -221262 -220221 -226319 -225230 -225213 -225824
5348 -225824 -221834 -215375 -209589 -208036 -213431 -223977 -224521 -225234 -221243 -219653 -221221 -221450 -220977 -221443 -217787
5333 -217787 -226157 -229173 -233254 -228874 -220377 -216833 -217949 -226655 -227633 -226715 -227194 -223450 -226190 -234111 -233893
5318 -233893 -223611 -218479 -216181 -218780 -220420 -216623 -215090 -213940 -220387 -225318 -231304 -224234 -214454 -213822
5304 -213822 -224106 -230107 -231423 -229801 -226398 -221151 -219647 -219556 -220358 -221467 -221067 -220439 -220007 -224181 -227527 -228811
5288 -228811 -224055 -220646 -221956 -221539 -222059 -227521 -226779 -227562 -228164 -226843 -224881 -218709 -222089 -224459 -219598 -210405
5272 -210405 -208213 -210956 -215470 -223623 -225721 -220072 -216125 -221410 -221136 -220793 -224964 -226563 -226353 -223633 -220590
5257 -220590 -216128 -218584 -219966 -218538 -220887 -221618 -211126 -209784 -210815 -214436 -215855 -214151 -217394 -218558
5243 -218558 -213221 -211295 -209050 -209313 -216908 -215722 -215404 -217924 -214598 -210715 -208157 -212897 -220594 -225454 -219256
5228 -219256 -218758 -225270 -230121 -224567 -219312 -219592 -216922 -214136 -212981 -216865 -223441 -223069 -221007 -222986 -224365
5213 -224365 -224838 -222038 -215500 -216479 -217198 -220917 -220174 -222207 -218473 -212121 -210871 -218455 -225110 -223607 -219825
5198 -219825 -214624 -208136 -208711 -213528 -215298 -216426 -216124 -219303 -220208 -216121 -210764 -214110 -216177 -215464 -217292
5183 -217292 -221942 -218921 -213213 -211469 -209725 -208695 -211864 -213260 -211966 -219740 -228667 -229757 -219927 -216539
5169 -216539 -220524 -222288 -222691 -221242 -221012 -226265 -226690 -221319 -221789 -217962 -212096 -211106 -210667 -211819 -217043 -221104
5153 -221104 -218889 -219000 -218164 -216180 -217146 -216736 -220429 -222219 -221279 -217417 -225521 -229201 -225261 -224713 -224353 -218558
5137 -218558 -214310 -214692 -217595 -216249 -211765 -210887 -216973 -216085 -214998 -217143 -214199 -211986 -211041 -210835 -212246 -211580
5121 -211580 -213686 -211203 -212998 -216757 -213254 -210174 -209106 -212700 -214207 -212484 -211395 -212802 -210231 -204922
5107 -204922 -203102 -207962 -211232 -207295 -210685 -214203 -213766 -216692 -217164 -208152 -205922 -209414 -210774 -206782 -207171
5092 -207171 -214151 -212835 -212225 -217754 -221938 -222082 -209057 -201613 -203038 -205353 -208213 -209083 -212646 -216977 -212940
5077 -212940 -210024 -208007 -212412 -215827 -208348 -204517 -200418 -204038 -210268 -211878 -214591 -217971 -217936 -213839 -214201
5062 -214201 -209949 -208133 -209446 -209999 -208560 -207380 -203396 -207610 -211505 -215346 -219960 -220091 -210283 -199995 -200258
5047 -200258 -201890 -202597 -203426 -205418 -205672 -206380 -211569 -212884 -212499 -215804 -220113 -218552 -219625 -219348 -217211 -212182
5031 -212182 -216191 -219781 -223316 -221671 -214063 -212570 -215814 -218776 -217943 -211975 -208120 -211643 -213489 -210696 -206537
5016 -206537 -209424 -209732 -215496 -217626 -215761 -212897 -210034 -209230 -213049 -218828 -218470 -218309 -220125 -218071 -211468
5001 -211468 -205821 -207015 -206669 -209647 -205637 -202792 -204584 -209449 -209832 -204368 -204167 -204868 -202786 -198240 -199029 -204341
4985 -204341 -211555 -215485 -211110 -208332 -204608 -202978 -210721 -215474 -217322 -220326 -218134 -215522 -212475 -208146
4971 -208146 -207675 -212356 -218563 -218931 -219449 -215185 -214294 -209251 -209252 -214138 -206414 -207656 -210443 -213176 -209953 -212944
4955 -212944 -216632 -219810 -213156 -215725 -224690 -220850 -214838 -213660 -210848 -209658 -208009 -208918 -207703 -199662 -196358
4940 -196358 -198977 -204168 -206370 -200973 -198892 -201156 -204186 -201686 -199378 -201644 -203595 -210148 -214475 -211171
4926 -211171 -206379 -206132 -200518 -199800 -207633 -207147 -202885 -211314 -216269 -208481 -205933 -208871 -212508 -211743 -211286 -211832
4910 -211832 -208385 -206270 -207408 -204827 -210284 -215050 -216823 -211994 -211579 -211944 -211640 -212345 -208159 -208183 -215450 -218000
4894 -218000 -217146 -211078 -207053 -209670 -210064 -212446 -214166 -212329 -209483 -204644 -203223 -205007 -208247 -210217 -210638
4879 -210638 -210730 -203694 -199775 -200785 -200671 -203210 -203170 -208698 -214793 -209716 -208423 -206947 -204353 -196990 -199168 -204669
4863 -204669 -206846 -202276 -199527 -201874 -202668 -199826 -199242 -197353 -196971 -201794 -199268 -197895 -198571 -199534 -202596 -205208
4847 -205208 -209134 -207050 -200785 -202308 -210842 -210933 -207324 -211685 -217280 -216510 -214739 -208133 -202650 -202741 -205716 -203398
4831 -203398 -202862 -202253 -206590 -211328 -216952 -216561 -213030 -209825 -206803 -206630 -213795 -212693 -208437 -207862 -209306 -206365
4815 -206365 -205278 -199978 -195582 -198609 -197553 -204570 -206334 -199669 -199253 -198726 -196674 -200623 -198640 -197399 -198582
4800 -198582 -195963 -197999 -200270 -198299 -198050 -200988 -206242 -205956 -205125 -202796 -205336 -207194 -205599 -201249 -199069
4785 -199069 -201243 -198930 -203920 -210866 -208417 -200837 -201209 -198206 -196936 -199836 -205256 -209072 -210772 -202876 -199462
4770 -199462 -204273 -211293 -207926 -195516 -191903 -198286 -206002 -202782 -198505 -197068 -197880 -191182 -189034 -187655
4756 -187655 -193560 -197591 -199437 -201595 -204445 -207124 -209317 -200274 -198713 -201630 -196512 -200130 -198006 -193898
4742 -193898 -190674 -187894 -195302 -198244 -194775 -188876 -192240 -200119 -197526 -196471 -199070 -195564 -191146 -188400
4728 -188400 -190132 -194949 -193868 -192521 -192038 -193913 -199992 -198955 -194312 -196006 -195963 -194591 -202973 -205300 -201336
4713 -201336 -196484 -197215 -192608 -192574 -193530 -190997 -193054 -195263 -201115 -201751 -205724 -203391 -198785 -200583 -203229 -197720
4697 -197720 -188518 -188572 -192426 -185337 -183728 -191045 -195395 -198962 -198167 -197326 -198495 -199077 -196169 -198223 -199278 -195314
4681 -195314 -191121 -192185 -196394 -195826 -196793 -200692 -199514 -193443 -192242 -188615 -188720 -197583 -198866 -192164 -188997
4666 -188997 -188241 -192497 -196140 -195186 -199830 -205879 -206499 -204664 -201025 -199722 -206340 -207250 -204804 -206298 -212106
4651 -212106 -215381 -209558 -199687 -197266 -197679 -193130 -194881 -202607 -201120 -195458 -197649 -199306 -198595 -198890 -196688
4636 -196688 -197812 -198967 -199421 -194399 -186744 -189310 -193825 -197513 -205233 -204486 -203151 -198749 -196664 -191546 -192568
4621 -192568 -194367 -193516 -200386 -207572 -205601 -202124 -198996 -204584 -202333 -202956 -203508 -209152 -207264 -201590 -202102
4606 -202102 -201607 -202783 -205008 -207397 -202020 -196877 -199993 -200064 -191100 -191336 -197116 -195877 -197528 -196750 -199750 -200692
4590 -200692 -201953 -196470 -195811 -195365 -192335 -194350 -189900 -189591 -193034 -199034 -199777 -194264 -196838 -195060 -191547
4575 -191547 -188182 -193111 -198460 -202396 -199180 -200265 -205359 -202092 -200628 -204659 -203196 -200602 -204449 -201745
4561 -201745 -201297 -199866 -200119 -200680 -200256 -201413 -205853 -205542 -204079 -204383 -197562 -196275 -199302 -197555 -201921 -203757
4545 -203757 -198747 -200833 -204104 -204766 -205074 -198972 -193722 -194081 -201949 -205212 -198846 -195107 -198038 -197666 -197269 -193652
4529 -193652 -188819 -187012 -187945 -188497 -189336 -188442 -193528 -199055 -196451 -196914 -199015 -205546 -205197 -201276 -197073 -197688
4513 -197688 -198007 -193549 -193619 -190442 -188779 -189934 -187292 -180651 -180797 -188853 -192435 -192286 -185447 -186119 -194589 -195592
4497 -195592 -191775 -191804 -191601 -187569 -185257 -191247 -203349 -206232 -207075 -204582 -199847 -195827 -196563 -195629 -194445 -200542
4481 -200542 -201538 -196656 -199169 -199400 -196907 -199502 -198068 -201383 -198742 -193319 -195830 -199739 -197310 -197036 -197254
4466 -197254 -199963 -193968 -186664 -186328 -188330 -185717 -185769 -192115 -199373 -202163 -197810 -199136 -202576 -196380 -191020
4451 -191020 -195557 -198413 -204254 -206312 -202512 -201582 -192899 -188652 -188117 -188911 -187667 -189818 -192525 -193479 -194083 -193551
4435 -193551 -191247 -194080 -199133 -196074 -192042 -193134 -194145 -194507 -194855 -191599 -192637 -192905 -190495 -187001 -185096
4420 -185096 -181910 -184360 -180781 -186984 -192969 -190723 -184544 -181516 -186844 -192352 -184377 -180688 -185062 -187669
4406 -187669 -188618 -185668 -187126 -189973 -191394 -192754 -196560 -196018 -190038 -186950 -185786 -188621 -194956 -198189 -195065
4391 -195065 -192323 -194361 -187894 -180545 -184583 -189528 -192063 -192913 -201789 -204010 -196512 -195582 -194581 -187780 -186282
4376 -186282 -191041 -187085 -183760 -185160 -191853 -195649 -195086 -192440 -187715 -189365 -192530 -196570 -192980 -186145 -185151
4361 -185151 -183735 -185467 -185015 -186868 -191779 -194345 -193414 -193589 -191627 -184495 -183257 -185566 -183635 -184947 -186980
4346 -186980 -187053 -185976 -187949 -195154 -197856 -193035 -188856 -187664 -189603 -187329 -186865 -185790 -190783 -192905 -192049
4331 -192049 -193779 -199190 -192778 -193639 -189363 -181588 -181003 -177587 -179049 -184571 -189199 -189359 -181078 -181631 -190758
4316 -190758 -189411 -190993 -191955 -192364 -190422 -184124 -180647 -186122 -184985 -184102 -183568 -177575 -179989 -182391 -182057 -190676
4300 -190676 -197618 -198780 -194832 -191226 -189746 -190288 -186948 -190716 -194214 -192882 -189352 -182227 -182918 -179422 -182892
4285 -182892 -184889 -183045 -184252 -184933 -188816 -190435 -186910 -185760 -184223 -185230 -183442 -187334 -195767 -194296 -193990
4270 -193990 -193080 -191471 -190886 -193376 -194044 -193066 -186814 -183359 -180336 -184528 -190233 -190770 -187213 -192023 -194058 -189376
4254 -189376 -189198 -187043 -188975 -192578 -194420 -193479 -191850 -187354 -184283 -183901 -182314 -184096 -181144 -181257 -181997 -183220
4238 -183220 -179555 -180185 -184209 -182619 -183740 -185474 -185180 -189203 -195321 -196885 -190797 -188965 -188765 -190133 -190488
4223 -190488 -189881 -190104 -192009 -193301 -192164 -192761 -191038 -187388 -188824 -186761 -186217 -187010 -186825 -187723 -184441 -186011
4207 -186011 -187095 -185177 -184426 -187083 -190096 -193877 -195142 -191950 -190062 -187040 -190804 -194826 -193622 -191517 -188072
4192 -188072 -185737 -183242 -185292 -186134 -183308 -182982 -185226 -192667 -194655 -191113 -187100 -185726 -187879 -189884 -186367
4177 -186367 -188163 -181480 -175651 -177615 -180696 -186217 -184397 -183942 -186078 -186109 -183390 -185705 -187738 -192392 -193287
4162 -193287 -192732 -194696 -189937 -189787 -196727 -194783 -193697 -194427 -195196 -193395 -192434 -186166 -184432 -188698 -187888 -185622
4146 -185622 -186901 -187654 -189500 -193704 -191121 -186916 -188480 -191987 -196538 -197159 -195816 -195567 -189027 -192696 -195018
4131 -195018 -196535 -192400 -187862 -187460 -191473 -192698 -191726 -182191 -180412 -183506 -188622 -194292 -199809 -201524 -199796
4116 -199796 -191060 -181471 -175385 -179384 -184097 -184158 -182559 -183060 -185328 -182446 -183358 -179445 -175739 -176714 -175997 -178949
4100 -178949 -181946 -185260 -188813 -189795 -189287 -190893 -189401 -187061 -183913 -187364 -189008 -188095 -186917 -186819 -185073 -183492
4084 -183492 -182572 -182611 -187689 -186995 -183247 -185227 -186662 -184460 -179596 -174142 -168889 -164060 -179536 -192726 -193703
4069 -193703 -191552 -187202 -179555 -179578 -186804 -190740 -184628 -184541 -188596 -186784 -185016 -188498 -188962 -185970 -184273 -185135
4053 -185135 -191062 -183464 -176958 -179893 -180544 -183754 -184697 -185644 -190001 -193355 -193343 -188574 -186454 -182872 -188090 -192797
4037 -192797 -188950 -185241 -183146 -177610 -176916 -181767 -189486 -187640 -184075 -186471 -188668 -190231 -191602 -191857 -190584
4022 -190584 -186894 -182870 -182748 -186786 -187944 -182157 -178132 -178389 -181488 -185026 -190178 -188957 -188102 -188443 -186370
4007 -186370 -183672 -188673 -190624 -189734 -185422 -181553 -182063 -180551 -184694 -186017 -182747 -177967 -171344 -171821 -176523
3992 -176523 -176746 -181235 -176300 -178911 -178385 -177150 -176584 -182611 -184302 -187334 -184729 -180522 -182200 -188782 -194895
3977 -194895 -196838 -189812 -185918 -182629 -180067 -182612 -181691 -187704 -193002 -193154 -183861 -176457 -179135 -179577 -176235
3962 -176235 -181816 -187707 -192248 -192927 -191235 -185687 -184720 -186658 -187327 -181677 -176581 -177184 -181198 -184061 -184698 -184663
3946 -184663 -186716 -189166 -185234 -180898 -180672 -175746 -178504 -186663 -191051 -186205 -177495 -170546 -172165 -172436 -171590
3931 -171590 -176276 -183342 -186112 -183393 -173100 -171016 -176735 -179129 -177181 -173010 -175160 -176741 -174020 -176142
3917 -176142 -177977 -175342 -182334 -181761 -179231 -181182 -183792 -184244 -184282 -181102 -178421 -180999 -186653 -191828 -190685
3902 -190685 -188023 -189097 -184460 -178778 -183314 -186547 -187072 -186665 -186647 -184504 -178412 -175990 -174778 -183028 -185332
3887 -185332 -184568 -184953 -189046 -187691 -183395 -182238 -179072 -173726 -174415 -174726 -173752 -173358 -177441 -183116 -179935 -177269
3871 -177269 -178331 -179141 -182968 -181846 -183604 -181744 -179238 -176597 -176039 -186993 -189844 -182561 -179025 -175102 -173329
3856 -173329 -180113 -182710 -180492 -180913 -183436 -182607 -180206 -176149 -180229 -180256 -177890 -177782 -176306 -177328 -181737 -180193
3840 -180193 -174729 -172715 -176447 -179932 -175442 -177805 -177759 -175758 -173610 -179901 -179358 -179100 -181047 -177324 -181367
3825 -181367 -178107 -172467 -167894 -169153 -170284 -172310 -170798 -169867 -173835 -176424 -174868 -172323 -173925 -177891 -173228
3810 -173228 -168596 -168306 -171637 -175744 -180294 -182456 -174582 -169525 -170078 -171527 -176192 -180056 -181321 -183166 -185722
3795 -185722 -185603 -181915 -178261 -177647 -175294 -173608 -179181 -179636 -172503 -169585 -170974 -172877 -177013 -180584 -179431
3780 -179431 -177368 -172698 -173740 -180370 -182407 -184029 -185310 -188989 -183814 -182725 -180672 -176341 -181232 -183149
3766 -183149 -177807 -176054 -176357 -174186 -178009 -177747 -177406 -186103 -185100 -177970 -177054 -176121 -175642 -175391 -175868 -178180
3750 -178180 -173859 -173019 -169819 -173037 -176829 -174855 -169333 -169943 -173118 -175396 -178525 -182215 -181679 -183573 -181772
3735 -181772 -177979 -174967 -178011 -183587 -186080 -185617 -186038 -182404 -183341 -180774 -174436 -170276 -175089 -177953 -182663
3720 -182663 -178608 -175712 -171967 -169549 -176694 -180127 -173790 -171893 -173905 -175804 -175721 -177801 -176159 -168101 -167551
3705 -167551 -170391 -177476 -178309 -177514 -174812 -166782 -166743 -171125 -178304 -184566 -178931 -172944 -173566 -171076 -167501 -170535
3689 -170535 -176845 -168942 -165959 -170578 -175610 -174444 -171334 -166744 -165290 -172596 -176174 -175241 -173436 -170921 -168449
3674 -168449 -172791 -174212 -174743 -182730 -185341 -188316 -179532 -172694 -167449 -175098 -183642 -183271 -172333 -168441 -172164
3659 -172164 -173285 -166623 -165090 -169919 -179064 -176627 -169055 -168711 -168915 -172043 -174135 -172436 -171775 -170989 -171900 -172398
3643 -172398 -174269 -173739 -173147 -177118 -178222 -179287 -175288 -172353 -172649 -176192 -173813 -169191 -167960 -164043 -162204
3628 -162204 -166823 -168112 -173392 -174707 -170954 -167936 -171554 -171457 -169537 -172626 -181477 -180963 -179799 -173818 -179245
3613 -179245 -182093 -179143 -168503 -166376 -171293 -172863 -176588 -181131 -180438 -183756 -183553 -178212 -171802 -178817 -184265
3598 -184265 -181785 -178919 -171471 -168068 -174135 -176434 -179961 -176396 -174319 -170065 -169469 -169714 -171429 -171057 -171968
3583 -171968 -174876 -172963 -169258 -168926 -164916 -170532 -173885 -169358 -168479 -170564 -168710 -166930 -167757 -168693 -173040
3568 -173040 -176131 -180884 -182940 -179998 -166228 -163459 -170751 -173148 -170840 -172622 -173048 -178051 -168059 -162021
3554 -162021 -161342 -161543 -162667 -175045 -181763 -185376 -182116 -174800 -169552 -172715 -170153 -167177 -168760 -175178 -177392
3539 -177392 -174903 -174098 -177138 -178085 -174065 -169703 -171976 -172639 -170711 -173611 -165515 -160757 -159240 -166164 -169311
3524 -169311 -163283 -156906 -158834 -162711 -169171 -168315 -162781 -161291 -160852 -163155 -166439 -168746 -163577 -164434 -162410
3509 -162410 -161510 -163592 -163313 -164145 -166642 -171916 -168839 -173050 -176160 -181286 -178786 -176528 -174396 -168045 -170445
3494 -170445 -177176 -173374 -166627 -162860 -160948 -164529 -170873 -167274 -165878 -167218 -165452 -164346 -162370 -161356
3480 -161356 -163590 -165875 -166014 -165751 -163968 -167416 -172532 -174588 -166357 -163585 -161876 -155741 -157849 -168013 -167094
3465 -167094 -162375 -162478 -165497 -163334 -162385 -158044 -156758 -163006 -172703 -175340 -172061 -178746 -179242 -173536 -169743
3450 -169743 -162378 -161693 -161561 -160225 -165771 -167713 -166169 -166528 -170095 -166727 -162477 -162149 -169491 -167361 -168486
3435 -168486 -166796 -164499 -166021 -174836 -179017 -173763 -165266 -162328 -166891 -168518 -167417 -169974 -171025 -166125
3421 -166125 -159820 -161611 -162737 -160246 -160494 -164270 -166573 -169395 -167779 -165867 -163610 -164453 -168492 -172638 -172777
3406 -172777 -167514 -165824 -165536 -163771 -167173 -167532 -166427 -168936 -170535 -166516 -159007 -155764 -162803 -168069 -170521
3391 -170521 -169648 -168155 -164384 -167873 -171873 -164550 -157986 -157901 -159420 -160485 -162463 -164804 -170557 -167740 -160501
3376 -160501 -160894 -159122 -159326 -164571 -165157 -162764 -160394 -164046 -167385 -168592 -166519 -164488 -164748 -165714 -167771 -168126
3360 -168126 -165781 -165785 -170672 -174393 -177838 -175948 -173760 -173233 -172814 -167688 -165107 -164377 -165243 -168064 -166827 -161407
3344 -161407 -159917 -160139 -158130 -159113 -159930 -158689 -159808 -163625 -168099 -162460 -158264 -160385 -157306 -162030 -173514
3329 -173514 -180375 -180590 -174996 -170299 -169864 -173115 -175573 -176026 -180494 -175729 -175400 -177519 -173332 -172053 -167297
3314 -167297 -163136 -162461 -164062 -167029 -171294 -169043 -167311 -165976 -166635 -158155 -158279 -163228 -160480 -160312 -154946
3299 -154946 -155500 -158999 -164441 -167044 -159585 -160682 -166008 -168346 -173430 -169058 -172652 -180911 -179904 -167466
3285 -167466 -163764 -171619 -177036 -171021 -168111 -169209 -162855 -161616 -167008 -169980 -174459 -177157 -172715 -162537
3271 -162537 -164509 -163549 -159783 -165261 -168277 -171060 -171651 -171345 -171885 -174058 -175487 -176193 -173684 -166984 -163553 -159057
3255 -159057 -164182 -165322 -166772 -169502 -169687 -168501 -170171 -174507 -176140 -170727 -169009 -166752 -165304 -161800 -162674
3240 -162674 -165340 -164966 -161692 -166613 -171747 -173287 -181936 -186037 -183545 -183078 -181805 -179392 -171289 -167103 -158504
3225 -158504 -159222 -166450 -169928 -169820 -173475 -173914 -170833 -161712 -163162 -170925 -169027 -168053 -164641 -161503 -159962
3210 -159962 -157965 -163650 -166045 -172001 -175585 -171625 -165212 -166821 -171621 -166717 -159502 -159703 -157043 -158727 -160613
3195 -160613 -160450 -159105 -158036 -156678 -160635 -165645 -165009 -161954 -162140 -166322 -165681 -164019 -164852 -167267 -170830 -171633
3179 -171633 -173653 -167307 -168299 -169336 -169497 -169148 -167849 -163934 -164716 -159871 -158494 -162105 -164647 -169397 -169322 -167182
3163 -167182 -170157 -169314 -163024 -164870 -165756 -161511 -155549 -154375 -155504 -160073 -164047 -161610 -162419 -162277 -169041
3148 -169041 -170592 -168183 -173143 -177846 -172773 -167375 -161797 -159303 -155807 -154745 -158880 -158622 -162357 -169105 -172692
3133 -172692 -168324 -162412 -157933 -153631 -154533 -159049 -160899 -164148 -165012 -159564 -159558 -166672 -162505 -157847 -158311 -161420
3117 -161420 -166159 -165041 -159587 -153784 -155692 -151553 -154373 -156591 -157799 -160302 -161335 -159627 -163436 -166413
3103 -166413 -166135 -162355 -158417 -164189 -164568 -162569 -166349 -166492 -165588 -159163 -159705 -160013 -162991 -159786 -155876 -160913
3087 -160913 -160792 -158091 -154621 -159651 -167654 -173666 -168536 -161816 -165370 -160387 -160274 -157122 -158816 -165239 -166078
3072 -166078 -166072 -165288 -170058 -172858 -170965 -168678 -168909 -166704 -163679 -160828 -166215 -175121 -177019 -171754 -167642 -166418
3056 -166418 -160128 -159732 -167097 -169850 -167090 -169377 -165607 -166903 -166381 -165524 -165700 -170985 -170908 -167326 -162556 -157427
3040 -157427 -151665 -150159 -152975 -157484 -154642 -156152 -158251 -161355 -164784 -163314 -162702 -158459 -153380 -155926 -158653
3025 -158653 -154072 -153097 -154916 -157752 -156310 -157915 -160663 -161676 -161707 -163149 -166681 -169303 -167312 -161190 -154624
3010 -154624 -154817 -162199 -160920 -159899 -161414 -160733 -160381 -161373 -160331 -164546 -160115 -156433 -159304 -160993 -164420
2995 -164420 -168408 -167602 -161429 -163710 -169769 -164485 -159093 -154394 -156341 -154067 -149212 -146179 -148437 -150960 -157032
2980 -157032 -157033 -160176 -162632 -159884 -157538 -155868 -157346 -162110 -165858 -170650 -176606 -174511 -167595 -160452 -158420
2965 -158420 -163406 -156476 -152003 -150401 -152231 -157459 -158254 -161609 -157944 -154755 -153281 -152032 -153256 -153751 -152542
2950 -152542 -158536 -155085 -154449 -153760 -160952 -159500 -159229 -157877 -157857 -159083 -161485 -162201 -156830 -155853 -160622 -159075
2934 -159075 -159590 -159464 -165282 -173262 -175471 -171172 -166605 -166367 -167818 -164409 -159125 -159221 -158125 -162005 -159273 -160582
2918 -160582 -162342 -160905 -156272 -152736 -153208 -158953 -160959 -162263 -162804 -161485 -161900 -163533 -163928 -161828 -163371
2903 -163371 -166074 -161141 -162163 -159456 -152255 -151799 -151084 -146600 -147186 -148551 -150878 -153445 -157138 -155229 -155571
2888 -155571 -157274 -156022 -155418 -163712 -160809 -163568 -159945 -157323 -157017 -156358 -150504 -153771 -160366 -158724 -157108
2873 -157108 -161074 -158705 -157708 -158278 -157645 -154995 -152325 -153211 -149676 -146549 -143755 -148013 -155316 -158792 -161184
2858 -161184 -165610 -163304 -158915 -155432 -157522 -160566 -157749 -157691 -154255 -151309 -151472 -146880 -150560 -154047 -156056
2843 -156056 -157537 -158996 -160952 -158850 -159021 -157328 -155579 -158246 -160513 -160958 -156632 -158533 -156697 -155759 -156899
2828 -156899 -158331 -152991 -149432 -148270 -153962 -160729 -163130 -162234 -157281 -154900 -161683 -159278 -156121 -158956 -160758
2813 -160758 -165009 -163269 -160841 -160583 -156660 -157471 -162849 -160739 -157286 -155470 -156556 -159776 -160978 -163085 -158996
2798 -158996 -155472 -159146 -156787 -158775 -164289 -161448 -157420 -153338 -154084 -157199 -160506 -159204 -158874 -155393 -153422
2783 -153422 -156803 -153000 -153189 -153815 -157443 -156919 -158404 -160093 -157682 -156249 -155678 -156587 -156590 -159228 -160514 -161260 -155804
2766 -155804 -150788 -151730 -164880 -169621 -169050 -162900 -156301 -151328 -145904 -146273 -139762 -140183 -142826 -147603 -147204
2751 -147204 -151561 -153817 -150297 -149472 -156221 -156859 -159479 -157430 -155671 -152303 -150858 -148623 -152422 -160068 -164673
2736 -164673 -164529 -169380 -167476 -162003 -160854 -155191 -147987 -150588 -155677 -163273 -168638 -164764 -158627 -153922 -154851
2721 -154851 -158497 -158223 -156482 -160338 -160687 -162610 -156890 -152602 -148672 -153233 -162162 -166887 -167348 -168954 -161527
2706 -161527 -160153 -164684 -164265 -159691 -156667 -154847 -157950 -155952 -151126 -150791 -147470 -149198 -152070 -152361 -153355
2691 -153355 -155161 -155978 -154655 -153900 -149058 -152529 -158927 -160706 -160538 -157829 -155035 -154148 -150221 -146853 -152371
2676 -152371 -156683 -159837 -151327 -150255 -150169 -147324 -147806 -146868 -147427 -148108 -152511 -155824 -148760 -147317 -144882 -150378
2660 -150378 -158271 -157696 -153553 -152679 -152084 -156599 -156290 -155179 -152679 -149120 -148951 -154224 -157899 -155610 -156162 -161554
2644 -161554 -160092 -154911 -157141 -160402 -157698 -157777 -156515 -157306 -156980 -149845 -147483 -150382 -158127 -163689 -163815 -156811
2628 -156811 -149593 -151816 -149868 -151876 -155509 -158337 -158171 -157065 -154080 -148900 -146767 -150508 -161647 -168847
2614 -168847 -170522 -164139 -162078 -154792 -151964 -150026 -150931 -157442 -153437 -152500 -151585 -154396 -156997 -159249 -161881
2599 -161881 -162605 -156052 -156725 -159768 -157870 -155604 -151505 -148443 -144865 -147570 -152343 -149369 -144820 -149329 -159199
2584 -159199 -160061 -158273 -155361 -158451 -161132 -160035 -160570 -162082 -163227 -162586 -158246 -151389 -150685 -147885 -140570
2569 -140570 -139942 -144288 -146071 -148225 -149442 -148292 -147085 -149930 -153852 -152929 -149926 -150616 -155934 -162481 -166743
2554 -166743 -167139 -164301 -157678 -154360 -152571 -150673 -148641 -147614 -157662 -154570 -151347 -153361 -151402 -154126
2540 -154126 -152709 -152502 -157751 -161000 -161383 -152567 -151763 -153016 -149423 -141905 -141153 -139922 -143670 -153277 -149023
2525 -149023 -144104 -147365 -153799 -160193 -158407 -155751 -153444 -152261 -154946 -158226 -156249 -149735 -150153 -149270 -146906
2510 -146906 -145427 -149402 -155178 -162533 -164026 -165316 -159531 -150291 -149253 -145789 -146521 -146864 -148840 -148990 -151630
2495 -151630 -150743 -146002 -146885 -145773 -146763 -150432 -152629 -155969 -153214 -153146 -154982 -154743 -152322 -149314 -150946 -156001
2479 -156001 -159344 -161765 -156415 -150868 -155626 -161159 -159056 -157518 -151853 -152176 -149630 -145214 -141993 -148866 -155600
2464 -155600 -157768 -158507 -164590 -163184 -159538 -159344 -156522 -155637 -152761 -152381 -156522 -155162 -151556 -144601 -146301
2449 -146301 -150297 -150926 -156646 -159767 -156104 -151573 -151442 -151039 -151679 -151024 -147522 -151157 -147384 -150131 -153453 -154174
2433 -154174 -160218 -158972 -158575 -156980 -156969 -159808 -160485 -156329 -155453 -156544 -153326 -157171 -159206 -152997 -148225 -151757
2417 -151757 -149370 -149872 -156288 -157733 -150718 -149678 -154700 -154716 -152860 -152002 -152026 -151490 -153559 -157722 -155381 -144652
2401 -144652 -143535 -149689 -150405 -154658 -154239 -152051 -153889 -151451 -148545 -147009 -151343 -153176 -153893 -151316 -151818
2386 -151818 -151477 -150697 -143261 -143909 -149261 -146498 -149110 -153714 -157020 -154724 -155865 -157033 -156254 -159729 -149303
2371 -149303 -143043 -140571 -138106 -137074 -140268 -139408 -144776 -150591 -156446 -159418 -160077 -161774 -161492 -152295 -147384
2356 -147384 -150839 -154418 -156598 -150471 -144897 -144341 -143677 -148974 -153104 -148562 -144744 -139029 -142617 -142556 -147469
2341 -147469 -149334 -147697 -147944 -150991 -154962 -152128 -146935 -147618 -146904 -142724 -141464 -142034 -141934 -143271 -153173 -153747
2325 -153747 -146749 -149143 -151924 -149484 -149082 -148397 -139831 -140979 -147795 -146468 -145014 -149752 -149454 -149413 -152829 -154098
2309 -154098 -152621 -150886 -149519 -147972 -145100 -148639 -149429 -153249 -148973 -145506 -143350 -142999 -147391 -149387 -148091
2294 -148091 -144902 -147999 -145300 -145580 -145583 -145371 -139524 -140936 -145165 -147807 -147033 -145799 -145739 -147578 -153695 -154669 -147745
2277 -147745 -149058 -151798 -155962 -154822 -149920 -143461 -144327 -145615 -146139 -149582 -152642 -153192 -148549 -146262 -148823
2262 -148823 -152570 -152065 -145160 -141089 -144949 -153253 -157433 -151701 -144753 -149761 -153457 -147925 -141185 -139547 -140667
2247 -140667 -145313 -153851 -154002 -150360 -151664 -144992 -136504 -132553 -136731 -145082 -148004 -146107 -147142 -145000 -143540
2232 -143540 -145942 -145799 -146362 -144457 -141043 -144451 -142264 -144615 -144201 -148511 -155805 -157473 -154851 -149990 -146104
2217 -146104 -147552 -149555 -147889 -149671 -150240 -144459 -141109 -138134 -143670 -146972 -148525 -146927 -146005 -138987 -139580
2202 -139580 -143605 -144963 -143260 -141053 -143784 -143809 -139534 -130576 -128670 -133696 -136100 -141646 -146852 -147720 -150641
2187 -150641 -151465 -150872 -148522 -143625 -138978 -146718 -151889 -152555 -151144 -147022 -142773 -143772 -145119 -148958 -152007
$$ [...]
##END NTUPLES=NMR SPECTRUM
##END=
