##TITLE=Analysis number 329083
Compound Code cc 03502
Project Code adrs
Chemist Name af chempharm
##JCAMPDX= 6.0         $$ Bruker NMR JCAMP-DX V2.0
##DATA TYPE= NMR SPECTRUM
##DATA CLASS= NTUPLES
##ORIGIN= Bruker BioSpin GmbH
##OWNER= nmr
$$ XWIN-NMR		Version 3.5
$$ Tue Jul 31 09:16:21 2007 GMT Daylight Time (UT+1h)  MAYBRIDGE\nmr@NMR_250MHZ
##.OBSERVE FREQUENCY= 250.131544655141
##.OBSERVE NUCLEUS= ^1H
##.ACQUISITION MODE= SIMULTANEOUS (DQD)
##.ACQUISITION SCHEME= undefined
##.AVERAGES= 16
##.DIGITISER RES= 18
##SPECTROMETER/DATA SYSTEM= dpx250
##.PULSE SEQUENCE= zg30
##.SOLVENT NAME= Acetone
##.SHIFT REFERENCE= (INTERNAL, Acetone, 0, 16.522)
##AUDIT TRAIL= $$ (NUMBER, WHEN, WHO, WHERE, WHAT)
$$ ##TITLE= Audit trail, XWIN-NMR		Version 3.5
$$ ##JCAMPDX= 5.01
$$ ##ORIGIN= Bruker BioSpin GmbH
$$ ##OWNER= nmr
$$ C:\u/data/dgb/nmr/ADRS/1730/pdata/1/auditp.txt
$$ ##AUDIT TRAIL=  $$ (NUMBER, WHEN, WHO, WHERE, WHAT)
(   1,<2007-07-31 09:15:53.89 +100>,<MAYBRIDGE\nmr>,<NMR_250MHZ>,
      <created by zg, POWCHK disabled, PULCHK disabled
       configuration hash MD5:
       76 6E 9A 78 1E 09 19 81 EC 84 63 8F B0 6A 59 2D
       data hash MD5: 64K
       95 EE C0 3F 11 13 36 EC A1 C4 11 63 73 B6 B3 3A>)
(   2,<2007-07-31 09:16:09.73 +100>,<MAYBRIDGE\nmr>,<NMR_250MHZ>,
      <Start of raw data processing
       ef LB = 0.3 FT_mod = 6 PKNL = 1 SI = 32K 
       data hash MD5: 32K
       CC CD A3 D2 08 55 5B D1 50 6D 72 BC 5F D7 49 F9>)
(   3,<2007-07-31 09:16:11.34 +100>,<MAYBRIDGE\nmr>,<NMR_250MHZ>,
      <apk 
       data hash MD5: 32K
       F5 38 8F EC 23 FA E5 0E 6A C4 7C F9 30 76 14 EC>)
(   4,<2007-07-31 09:16:12.18 +100>,<MAYBRIDGE\nmr>,<NMR_250MHZ>,
      <abs ABSG = 5 
       data hash MD5: 32K
       16 30 B3 36 6A C4 52 F6 65 6E B2 36 1D 92 2C 16>)
$$ ##END=
$$ 
$$ hash MD5
$$ 05 D6 34 F5 31 66 EF A2 2A FB 5C BD 25 7D BC B6
##$RELAX= 
##$RELAX= 
##$RELAX= 
##$RELAX= 
##$RELAX= 
##$RELAX= 
##$RELAX= 
$$ Bruker specific parameters
$$ --------------------------
##$DU= <C:\u>
##$EXPNO= 1730
##$NAME= <ADRS>
##$PROCNO= 1
##$TYPE= <nmr>
##$USER= <dgb>
##$AMP= (0..31)
100 100 100 100 100 100 100 100 100 100 100 100 100 100 100 100 100 100 
100 100 100 100 100 100 100 100 100 100 100 100 100 100 
##$AQSEQ= 0
##$AQ_mod= 3
##$AUNM= <au_zg>
##$AUTOPOS= <8 >
##$BF1= 250.13
##$BF2= 250.13
##$BF3= 250.13
##$BF4= 250.13
##$BF5= 500.13
##$BF6= 500.13
##$BF7= 500.13
##$BF8= 500.13
##$BYTORDA= 1
##$CFDGTYP= 0
##$CFRGTYP= 5
##$CHEMSTR= <none>
##$CNST= (0..31)
1 1 145 1 1 1 1 1 1 1 1 1 1 1 1 1 1 1 1 1 1 1 1 1 1 1 1 1 1 1 1 1 
##$CPDPRG= <>
##$CPDPRG1= <>
##$CPDPRG2= <>
##$CPDPRG3= <>
##$CPDPRG4= <mlev>
##$CPDPRG5= <mlev>
##$CPDPRG6= <mlev>
##$CPDPRG7= <mlev>
##$CPDPRG8= <mlev>
##$CPDPRGB= <>
##$CPDPRGT= <>
##$D= (0..31)
0 1 0 0 0 0 0 0 0 0.06 0 0 0 0 0 0 0.0002 0 0 0 0 0 0 0 0 0 0 0 0 0 0 
0 
##$DATE= 1185869752
##$DBL= (0..7)
120 120 120 120 120 120 120 120 
##$DBP= (0..7)
150 150 150 150 150 150 150 150 
##$DBP07= 0
##$DBPNAM0= <>
##$DBPNAM1= <>
##$DBPNAM2= <>
$$ [...]
##$SUBNAM7= <"">
##$SUBNAM8= <"">
##$SUBNAM9= <"">
##$SW= 20.6930455092707
##$SWIBOX= (0..15)
0 0 3 0 0 0 0 0 0 0 0 0 0 0 0 0 
##$SW_h= 5175.983436853
##$TD= 65536
##$TD0= 1
##$TE= 296.16
##$TE2= 300
##$TE3= 300
##$TEG= 300
##$TL= (0..7)
0 120 120 120 120 120 120 120 
##$TP= (0..7)
150 150 150 150 150 150 150 150 
##$TP07= 0
##$TPNAME0= <>
##$TPNAME1= <>
##$TPNAME2= <>
##$TPNAME3= <>
##$TPNAME4= <>
##$TPNAME5= <>
##$TPNAME6= <>
##$TPNAME7= <>
##$TPOAL= (0..7)
0.5 0.5 0.5 0.5 0.5 0.5 0.5 0.5 
##$TPOFFS= (0..7)
0 0 0 0 0 0 0 0 
##$TUNHIN= 0
##$TUNHOUT= 0
##$TUNXOUT= 0
##$USERA1= <user>
##$USERA2= <user>
##$USERA3= <user>
##$USERA4= <user>
##$USERA5= <user>
##$V9= 5
##$VALIST= <valist>
##$VCLIST= <CCCCCCCCCCCCCCC>
##$VD= 0
##$VDLIST= <DDDDDDDDDDDDDDD>
##$VPLIST= <PPPPPPPPPPPPPPP>
##$VTLIST= <TTTTTTTTTTTTTTT>
##$WBST= 1024
##$WBSW= 4
##$XGAIN= (0..3)
0 0 0 0 
##$XL= 0
##$YL= 0
##$YMAX_a= 314639
##$YMIN_a= -251784
##$ZGOPTNS= <>
##$ZL1= 120
##$ZL2= 120
##$ZL3= 120
##$ZL4= 120
##$ABSF1= 16.522
##$ABSF2= -4.171173
##$ABSG= 5
##$ABSL= 3
##$ALPHA= 0
##$AQORDER= 0
##$ASSFAC= 0
##$ASSFACI= 0
##$ASSFACX= 0
##$ASSWID= 0
##$AUNMP= <proc_1d>
##$AZFE= 0.1
##$AZFW= 0.1
##$BCFW= 0
##$BC_mod= 0
##$BYTORDP= 0
##$COROFFS= 0
##$CY= 12.5
##$DATMOD= 1
##$DC= 0
##$DFILT= <>
##$DTYPP= 0
##$F1P= 14.0000005364418
##$F2P= -0.99999901652339
##$FCOR= 0.5
##$FTSIZE= 32768
##$FT_mod= 6
##$GAMMA= 0
##$GB= 0
##$INTBC= 1
##$INTSCL= 1
##$ISEN= 128
##$LB= 0.3
##$LEV0= 0
##$LPBIN= 0
##$MAXI= 10000
##$MC2= 0
##$MEAN= 0
##$ME_mod= 0
##$MI= 0
##$NCOEF= 0
##$NC_proc= -5
##$NLEV= 6
##$NOISF1= 0
##$NOISF2= 0
##$NSP= 0
##$NTH_PI= 0
##$NZP= 0
##$OFFSET= 16.522
##$PC= 1
##$PHC0= -49.52202
##$PHC1= 6.577891
##$PH_mod= 1
##$PKNL= yes
##$PPARMOD= 0
##$PSCAL= 4
##$PSIGN= 0
##$REVERSE= no
##$SF= 250.13
##$SI= 32768
##$SIGF1= 0
##$SIGF2= 0
##$SINO= 400
##$SIOLD= 32768
##$SREGLST= <1H.Acetone>
##$SSB= 0
##$STSI= 32768
##$STSR= 0
##$SW_p= 5175.98343685301
##$SYMM= 0
##$S_DEV= 0
##$TDeff= 65536
##$TDoff= 0
##$TI= <Analysis number 999999
Compound Code 99
Book Reference 9
Project Code 9>
##$TILT= no
##$TM1= 0
##$TM2= 0
##$TOPLEV= 0
##$USERP1= <user>
##$USERP2= <user>
##$USERP3= <user>
##$USERP4= <user>
##$USERP5= <user>
##$WDW= 1
##$XDIM= 32768
##$YMAX_p= 534799445
##$YMIN_p= -657955
$$ End of Bruker specific parameters
$$ ---------------------------------
##NTUPLES= NMR SPECTRUM
##VAR_NAME=  FREQUENCY,     SPECTRUM/REAL,   SPECTRUM/IMAG
##SYMBOL=    X,             R,               I
##VAR_TYPE=  INDEPENDENT,   DEPENDENT,       DEPENDENT
##VAR_FORM=  AFFN,          ASDF,            ASDF
##VAR_DIM=   32768,         32768,           32768
##UNITS=     HZ,            ARBITRARY UNITS, ARBITRARY UNITS
##FACTOR=    0.157963299565203, 1,           1
##FIRST=     4132.6476996994, 0,             0
##LAST=      -1043.33573715361, 0,           0
##MIN=       -1043.33573715361, -657955,     0
##MAX=       4132.6476996994, 534799445,     0
$$ Real data points
##PAGE= N=1
##DATA TABLE= (X++(R..R)), XYDATA
$$ [...]
15103b48843Q2854J51752k554N1055J59056j31728J1949p0091k65178j41230R0432
15092c12526K04859J51890L2853J5441J14689P2807L8407j5191l9489k65713j26892
15081a28865j8039O4859P9689m3473K2159O1438m132J8455j65066o476m5132j4959
15069a79542m7322J50651J22265r1954n1161J703n3953N2642j78462R491K02493
15058f3149J15088Q9296J696P655j32841K0954J28682R0928k40112p2435k7541
15047h1779J54557Q6531j17940J54045L9967L0392N3853N5198n3495j67261j61595
15036g527m0639n5762n6466P5037k1666L901m7670O2516k287k3375O7707l2066
15024g8297O745J8825Q423n7111L8052p2529l308O9489J34848m476p0215l1333
$$ y = [-248843, -165989, -14237, -16791, 34264, 193320, 61592, 73541, 3450, -261728, -402958, -312526, -107667, 44223, 77076, 92517, 207206, 280013, 318420, 303229, 263740, -1973, -128865, -146904, -82045, -2356, -45829, -23670, 37768, 33636, 52091, -112975, -119451, -164583, -179542, -226864, -76213, 46052, -45902, -97063, -95360, -149313, -96671, -275133, -265642, -63149, 51939, 141235, 142931, 150586, 17745, 38699, 167381, 258309, 18197, -54238, -81779, 72778, 159309, 41369, 195414, 235381, 265773, 319626, 374824, 321329, 154068, -7527, -48166, -103928, -160394, -85357, -107023, -103122, -150792, -88276, -90563, -113938, -46231, -78297, -71552, -52727, -44304, -101415, -63363, -135892, -139200, -69711, 65137, 60661, -9554, -40887]
15012d0887J23091q3513J48532K5269o4719j64440o6527K18536J13324k0524l5332
15001A52810k18956j79715R0616K65790r3809k23561p4453K23632n5184j35635
14991b48465j50743M9698J8903J09203j2928O0236J01579n2223o2965J48240J97117
14980A57652L3437j09636j45254K2443j9557J61692L00000k08407k11170k3214
14970d2014p4896p4780n5198J13032k6900j81213j7706K5539m5849Q4709M6350
14959b48926j1216J9355N9817J8603M9353l0057M7227q2270n3262k6605l1567
14948b89548o2841k630n5536n4433N0270J45411P4257j78875J33480R8606j87936
14937c29775q8474J06002Q573J7742n2369j23457R9627J32840J19923J59307m9221
$$ y = [-40887, 82204, -1309, 147223, 172492, 107773, -56667, -123194, 95342, 208666, 188142, 152810, -66146, -245861, -155245, 110545, 16736, -206825, -281278, -57646, -112830, -248465, -399208, -349510, -330607, -221404, -234332, -174096, -72517, -124740, -187705, -39465, 157652, 191089, 81453, -63801, -41358, -60915, 100777, 400777, 192370, -18800, -42014, -116910, -191690, -246888, -133856, -160756, -341969, -359675, -334136, -379985, -295276, -248926, -260142, -240787, -180970, -162367, -113014, -143071, -95844, -178114, -231376, -257981, -289548, -352389, -355019, -410555, -464988, -414718, -269307, -195050, -373925, -240445, -141839, -329775, -418249, -312247, -303674, -285932, -338301, -461758, -362131, -229291, -109368, 49939, 718]
14926G18n1709P0307Q051j05907o7979P5367J04986M6833m5648M7042M2973N8812
14914A83846n6633l2392p7712j21104L3196j24230N6168J95112r7341j69681k9934
14903b40705j9099J05860J45955r9114N4683O4243J89091L4302p7944q827j85395
14892c6950j00975l3176k6229Q3678J65883M7639K9693Q0192r7442M6232j28710
14881B9835j11849J21734k7351O1742J57179j14293k04574J18353L14248O6728
14871D11752n8224k09711k59320j89823J0957J98949J35032q0477M8234J15887
14861A23256O8365j18466j05725n1767J25299J05390J5154R884r0837k7111j19855
14850f6413j00925O5470o530q354k037j27759q6431P6351J42030j65487j54935
$$ y = [718, -50991, 19316, 27367, -78540, -146519, -71152, 33834, 80667, 35019, 82061, 125034, 183846, 127213, 94821, 17109, -103995, -70799, -195029, -138861, 56251, -41090, -210771, -240705, -259804, -153944, -7989, -107103, -52420, 11823, 200914, 235216, 157272, 148445, -36950, -137925, -171101, -197330, -113652, 52231, 99870, 129563, 209755, 112313, 158545, 29835, -82014, 39720, 12369, 74111, 231290, 116997, -87577, 30776, 345024, 411752, 353528, 143817, -115503, -305326, -294369, -95420, 39612, -40865, 7369, 123256, 191621, 73155, -32570, -84337, 40962, 146352, 161506, 171390, 80553, 53442, -66413, -167338, -101868, -108398, -116752, -118789, -246548, -332979, -256628, -114598, -280085, -435020]
14839d35020K02007K48710k5608O6181K24673N7606n1301k61916L1445J0203o9193
14828b213Q2970m6178n1569P5507K41957j23068j81651m5234K5530j17558j90109
14817c31616J28745J76981J7103M8159O6729k0622j24587j42660o2152J74025
14807f9895J88982j4378j02966J10443K8882j69278j20572l1493L1757k0456j91136
14796c60110J25824K11225j8894O8450j8566R8651Q9579o5643l08762j55324P589
14785c25981O5225j39246J77340J31854J7974O2280j01540M4041j7961n5375J26897
14774a4492J09911j54262p4759J0206o2434k4595j72499J52312J98094m1552N2316
14763b1754j46770j35113J3775P2078J13780M6853Q7136j96977M9933K08885L1809
$$ y = [-435020, -233013, 15697, -9911, 56270, 280943, 338549, 287248, 25332, 56777, 66980, -2213, 80757, 34579, -16990, 58517, 300474, 177406, -4245, -49479, -23949, -141507, -331616, -202871, -25890, -8787, 39372, 106101, 85479, -39108, -181768, -243920, -69895, 119087, 104709, 1743, 112186, 141068, -28210, -148782, -180275, -148518, -168974, -360110, -234286, -23061, -41955, 26495, 7929, 106580, 196159, 130516, -178246, -333570, -325981, -260756, -400002, -222662, -90808, -72834, -10554, -112094, -68053, -86014, -141389, -14492, 95419, -58843, -133602, -123396, -185830, -210425, -382924, -230612, -32518, -74070, -21754, -168524, -303637, -289862, -217784, -104004, -57151, 29985, -166992, -117059, 91826, 123635]
14752A23635q413j43647m685N3661K3679j02446K9732J7394m0733J21928n9674
14741A0431K7k4387J7056j10396k3860l1988O8377J18017J5587j40308k5739r701
14729a36884K865J4813O0301O0620j09366K2142j22014l8994j8188K4652J01683
14718a38370o764j50529o7808O9611J9974K8490O7126R7091K1540M2557J31972
14707A14890r2641r0332p4375l0342J35249M1991l3165M1231R0857p7524m373
14696B1466N2555N7767K2303j57207r0662m4170j66356k10329r2429J83447J07843
14685c15772J73923M9376M3654o29N701L0762q7926j7756n3194N3067r2737j5115
14673b26646J94413R4049j43921M5576J3717p0397j47506j78231K01852J21850
$$ y = [123635, 115222, -28425, -33110, 20551, 44230, -58216, -28484, -11090, -51823, 70105, 10431, 10458, -13929, 3127, -107269, -131129, -163117, -94740, 23277, 38864, -101444, -127183, -136884, -134019, -119206, -58905, 1715, -107651, -85509, -207523, -246517, -264705, -240053, -138370, -145134, -295663, -363471, -293860, -273886, -245396, -178270, -81179, -59639, -17082, 114890, 22249, -68083, -142458, -172800, -37551, 4440, -28725, 12506, 103363, 25839, 21466, 74021, 131788, 154091, -3116, -93778, -137948, -304304, -514633, -607062, -423615, -315772, -141849, -92473, -48819, -49448, -43747, -12985, -100911, -118667, -171861, -118794, -211531, -226646, -32233, 61816, -82105, -36529, -22812, -93209, -240715, -418946, -217094, -95244]
14663i5244N7779j52390J8155j16197K5468n7538P9530N9072J22772P3275j18015
14652a03333r4328N340N1764j8494K516J32958m0725n3952L8783k462N0574q9631
14640a20990q2665r9121P1497N1490N3280K09013K9181j07798j68233m429k2930
14629a91705k3721K749p0985j5656J76915j36231l4418j089J08107O4250J04190
14618a7594O4356k625J8397n658J8135P3580K8973M0804q0517m6208r985p4868
14606F790P7658J64681J08518n8732o3143J1046J2831r3594k06222J28834l1822
14595E6845r4287j2870k10141k5004K05755J38074n5314L3350j00297j41368N632
14584a99625J36413R1257p1327m2405J45773k04833j59179Q3063J20120N2847
$$ y = [-95244, -37465, -189855, -171700, -287897, -262429, -319967, -240437, -181365, -58593, 14682, -103333, -197661, -192321, -140557, -159051, -156535, -23577, -64302, -118254, -79471, -81933, -31359, -120990, -203655, -302776, -231279, -179789, -126509, 82504, 111685, 3887, -164346, -168775, -191705, -215426, -212677, -283662, -299318, -122403, -258634, -293052, -294141, -186034, -121784, -17594, 46762, 44137, 62534, 56876, 75011, 148591, 177564, 218368, 137851, 91643, 81658, 6790, 84448, 249129, 357647, 298915, 235772, 246818, 259649, 166055, -40167, 88667, 56845, -37442, -50312, -260453, -285457, -79702, 58372, 3058, 36408, -63889, -205257, -199625, -63212, 28045, -43282, -85687, 60086, -144747, -303926, -220863, -100743, -47896]
14574d7896P5258P0892j11353j72425r1830M1877j24099R7773J49014r1620P7329
14563a27080O4314j65464P6945k268K1369L5242J69338p882J6940m0599k28557
14552a87702M627j08256n8286M9285J92122J17399k5505m4473k15555n8762M9513
14541b85593J27605J12728k5092n6813L5227k1574J6714o7619l0027M8681K879
14530a42884N2080Q6138J34060O3515r8823p0386L8305l3539k9517r1328K7401
14519f4978K8786P3957m0660l7405O3641k88242j06972J34509K4989J53126J06683
14508D7434k10163k56467M5951P4312o5985N2721K88288n806r9085m4603r9512
14497b72915J67841R8560J7146O5552O9055J84438n9955j58871j0719P938p6296
$$ y = [-47896, 27362, 98254, -13099, -185524, -277354, -235477, -359576, -261803, -112789, -204409, -127080, -62766, -228230, -151285, -153553, -132184, -96942, 72396, 64514, 81454, 40855, -187702, -183075, -291331, -349617, -300332, -108210, 9189, -16316, -60789, -276344, -335106, -285593, -157988, -45260, -70352, -127165, -91938, -113512, -96798, -164417, -194444, -145763, -142884, -90804, -4666, 129394, 192909, 94086, 23700, 62005, 28466, -1051, -92379, -64978, -36192, 37765, -2895, -40300, 23341, -264901, -371873, -237364, -212375, -59249, 47434, -162729, -419196, -373245, -298933, -364918, -312197, -23909, -29715, -128800, -173403, -272915, -105074, -6514, 10632, 76184, 145239, 329677, 269722, 110851, 100132, 108070, 31774]
14486C1774l9497k7914o1197j07847J34579K07826l4169j18661l9215o1815q533
14475a24669k40972p2781J48292L04890P2311j88285j43526J241L1528P3529O4788
14464g3654p7011l1926K5121N6021J6950n795N9392l5997j02729K2195J52629
14453E196J25975N8296k9330l5794J3078L3346J42433q4050j88310O3240j2405
14442I1675j14984o8561Q0016o9274l3401N4748m9075o3201K8317O0957J9804
14431f2979J50163k3348j60718l3556q3287N7834O3370n4500Q3380m6837j45932
14420b56410n6842Q6553P5115j5963J29560M1083j25978m8662k6643K4023O8568
14409a05596J08418j33750n5789J12098O5731J6839M622r4519O9963P134R5156
$$ y = [31774, -7723, -35637, -96834, -204681, -70102, 137724, 103555, -15106, -54321, -116136, -124669, -365641, -438422, -290130, 14760, 87071, -101214, -244740, -243499, -211971, -138442, -73654, -150665, -182591, -157470, -101449, -84499, -90294, -30902, -66899, -169628, -147433, 5196, 131171, 189467, 160137, 124343, 137421, 170767, 313200, 229150, 40840, 104080, 91675, -23309, -91870, -11854, -81128, -114529, -59781, -108856, -172057, -143740, -82783, -62979, 87184, 63836, -96882, -130438, -213725, -155891, -92521, -147021, -63641, -110478, -256410, -313252, -226699, -151584, -167547, -37987, 3096, -122882, -171544, -198187, -174164, -105596, 2822, -130928, -186717, -74619, -8888, 7951, 12573, -81946, -11983, -4849, 90307]
14398I0307p9603r3615P8563M1605j16313N2565J63479q1454L1528p4366j09430
14387i6734o3558R9719J08532j1757O7528L3233j10413j29423j72951k4261J71145
14376a28940J42575M6473J69235J40483R8983k79701k59684j01045r7786P4848
14366a94559O3707J16352J47836k0411j23610N3535M2292O1223M5524j28130j10637
14355d6878j60792P2790m2591J27764l4419j74638j37558j00009J11466K67335
14345a17530J12296r7986p5005n273P4411k8640J55297J40135m6130j34741n6207
14334g9373L8891n9718k0141J13327R2029q3961o7904m634K07177p1314j34405
14323g0026j44812M3914K54014o4972M0739Q0638o6772K0674l929k30489k26394
$$ y = [90307, 10704, -82911, -4348, 37257, -79056, -26491, 136988, 55534, 87062, 12696, -96734, -160292, -60573, 47959, 36202, 103730, 136963, 26550, -102873, -275824, -300085, -128940, 13635, 60108, 229343, 369826, 468809, 189108, -70576, -171621, -269407, -194559, -130852, -14500, 133336, 112925, -10685, 42850, 85142, 146365, 191889, 63759, -46878, -207670, -134880, -177471, -49707, -84126, -258764, -396322, -496331, -384865, -117530, -5234, -103220, -178225, -183498, -109087, -137727, 17570, 157705, 111575, -23166, -79373, -40482, -100200, -120341, -7014, 85015, 1054, -66850, -71484, 135693, 64379, -70026, -214838, -170924, 83090, 18118, 58857, 139495, 72723, 93397, 89468, -141021, -367415]
14312c67415J55297K59058J30680q2985m873R5788N0761j34236n9829M6088J04198
14301A92532k6058j88597k20788n1277p1800L9755j9266j09052J01103k1075j13748
14290d88271J49206L00333R4883l0891r7746J0760J11004J00243j41928N1118
14280E8711L1352o2316o6058q4502J45760J26270R0906l7621k24618j88210p1266
14269b81592J6943J70123K49615J325q9726j277m2072O5565L0247K1422l0718
14258A09855r724j28923j72515r7307j2839L9769J65864J25416K8970q8492J60594
14247A20668K4533r2692k1147l1022M0423j53538J07140M2006N6629k25464j49979
14236b82443J03301R5112p6820J36421J16645J1203q1770j21728k03543p1116
$$ y = [-367415, -212118, 46940, 177620, 94635, 89762, 185550, 236311, 102075, 42246, 88334, 192532, 166474, -22123, -242911, -294188, -365988, -326233, -345499, -454551, -353448, -374523, -488271, -339065, -38732, 56151, 25260, -72486, -61726, 49278, 149521, 7593, 58711, 90063, 27747, -38311, -122813, 22947, 149217, 240123, 202502, -22116, -210326, -281592, -264649, -94526, 155089, 156414, 66688, 65411, 23339, 88904, 119151, 140573, 109855, 100131, -28792, -201307, -298614, -311453, -271684, -105820, 19596, 48566, -39926, 120668, 145201, 52509, 31362, 340, 40763, -112775, -5635, 36371, 93000, -132464, -282443, -179142, -84030, -160850, -24429, 92216, 103419, 21649, -100079, -303622, -374738]
14226c74738M788k7549L9767N8548P6491P742J3706Q8940l5579k4223P984k5981
14214a90104r1810P6510R8463m9556j33174r0060j0923P4264J02496Q36J16863
14203i6195q6725K450r2700p5776L44414J62519n8350j08005l4350L2926J17377
14192A07585J24942Q6994k39690q1991O719o492k2719j08018q6411j4326L3704
14181a99703M691J81064J3494J03948N9192o4395j60628l2863o6110q051j35451
14170c04812N9374M9666j24424M4040K32245K6153J059J6285j7881j08608P4781
14159e2122o7744j09391j1774L4693R6331M0373o6938o5456n9189j88926L2283
14148d17860O7649J55411J4198J18698R2240o8757j58879M0732J62404l7096q8295
$$ y = [-374738, -369950, -397499, -357732, -299184, -222693, -214951, -201245, -112305, -147884, -172107, -164123, -190104, -281914, -205404, -106941, -156497, -289671, -379731, -390654, -316390, -213894, -213058, -96195, -182920, -180470, -273170, -348946, -4532, 157987, 99637, -8368, -42718, -9792, 107585, 232527, 319521, 79831, -2160, 4559, -1933, -24652, -132670, -219081, -233407, -199703, -195012, -13948, -454, 103494, 162686, 98291, -62337, -95200, -161310, -169361, -304812, -245438, -195772, -320196, -276156, -43911, -17758, -16699, -414, -18295, -126903, -52122, -119866, -229257, -241031, -206338, -110007, -69634, -136572, -202028, -261217, -450143, -417860, -350211, -194800, -180602, -61904, 30336, -38421, -197300, -156568, 5836, -31260, -119555]
14137a19555Q0391r6276m4798j5999O7407O5992p7626j18746R9601J48448k32123
14126b43284m8963K07697K55810O0537r7979j18604J8331n9946o1274J9425Q3781
14115A5531O5550n873j77465J61744l3397k09691n5577M4282J78415K19544r505
14104A93558k6350k00482q4681O223k9629K9963M0452J23671J8941j12941k11065
14093b52340p2072J71366J83880K3543P091j05100m9231k7416K17371J55775K6046
14082B78913n7167o8389j60464J17813N2575n3251p8024M7730q8080k3104R1329
14071E9881Q5231N4907K1770k21907k2783L7407p6909M3258K90626L690k41730
14060C3441j92848J11550K6540j28264M6918R4880Q7914l6324l6947J55065j6400
$$ y = [-119555, -39164, -135440, -180238, -196237, -128830, -62838, -140464, -259210, -159609, -11161, -243284, -292247, -84550, 171260, 231797, 133818, 15214, 33545, -26401, -87675, -68250, 15531, 81081, 75208, -102257, 59487, 26090, -183601, -239178, -194896, -16481, 203063, 193558, 167208, -33274, -117955, -111732, -141361, -111398, -70946, 52725, 71666, -41275, -252340, -324412, -153046, 30834, 54377, 61468, -43632, -92863, -120279, 97092, 252867, 278913, 221746, 153357, -7107, 110706, 163281, 110030, 32006, 79736, -8344, -31448, 59881, 145112, 200019, 221789, -118, -22901, 14506, -62403, -19145, 271481, 275171, 33441, -159407, -47857, -21317, -149581, -102663, -7783, 80131, 43807, 6860, 161925, 145525]
14049A45525J5848J64951j56180k2879O1174L624k08581j22422n1338J11103j4404
14038g3579K18949Q9959o2302r9015l2003N9142n480M1294J07450N1536j40465
14027A55486j87917R2143J68576O6782k16900j50364N5228k2921p5360r8129Q2389
14016a30987R3617p9299R6554k1258l6964N1640J95296J19412j45107q5488J4814
14005G2230Q3877k7710J34981M7239j86983j40154j22229m5764J683J6351m4715
13994b11194L8939l6400m6338j4546J15708J88489p7943o6497J01356Q531j837
13983a732K3428N2761J03964J25422j1584p9609j56962O2515J50363n4181j18537
13972I5848q9370k890j66719r2143J3437J07360J49269k0839k4196j6275J05814
$$ y = [145525, 161373, 326324, 170144, 147265, 208439, 212063, 3482, -118940, -170278, -59175, -73579, 145370, 235329, 173027, 74012, 42009, 101151, 95671, 136965, 244415, 295951, 155486, -32431, 59712, 228288, 295070, 78170, -72194, -16966, -39887, -115247, -213376, -130987, -37370, -116669, -20115, -41373, -78337, -26697, 168599, 288011, 142904, 57416, 72230, 156107, 128397, 263378, 310617, 123634, -16520, -138749, -184513, -182830, -166479, -211194, -172255, -208655, -254993, -269539, -153831, 34658, -43285, -109782, -8426, 105, -1732, 21696, 74457, 178421, 303843, 292259, 212650, 55688, 118203, 268566, 214385, 95848, 6478, 3588, -163131, -255274, -241837, -134477, 14792, -6047, -30243, -46518, 59296]
13961E9296Q4812J06900o8280n2143q8345J26479L7046k5280l05439p4755J14592
13950h5117Q6667p407k06611L8984K29145P9266j12973K9443r8888o5469R3632
13939a9328K65670j19438L3319j84234j07024j69288R8688J58791m2037q7354
13929a72235L9440j1435p8181O6103L5435j79391j7163J76366r7756J06292J40357
13918G832R4604m3709q6238j3572j75685j67328K9169p7588J42656m6269o5286
13907d01414l4232J04404J99069M7858Q9666k71736m809Q2566J35034P7599q1915
13896e7910Q8458J5891j34035p5206k4144O1307K6006r090n278l6848M5821P0432
13884c4596r4313O3870K42239J1004j24375k19715J25744O1021m1197j63755l1889
$$ y = [59296, 144108, 251008, 182728, 130585, 42240, 168719, 205765, 180485, -124954, -199709, -85117, 1550, -5857, -212468, -173484, 55661, 134927, 21954, 51397, -47491, -112960, -19328, 246342, 126904, 160223, -24011, -131035, -300323, -201635, -42844, -84881, -172235, -132795, -144230, -222411, -156308, -120873, -300264, -317427, -141061, -238817, -132525, 7832, 102436, 58727, -27511, -41083, -216768, -384096, -354927, -432515, -289859, -336128, -401414, -435646, -331242, -132173, -84315, 5351, -266385, -271194, -188628, -53594, 24005, -57910, 30548, 46439, -87596, -162802, -186946, -125639, -99633, -108723, -114001, -150849, -105028, -34596, -128909, -65039, 177200, 188204, 63829, -155886, -30142, 30879, -10318, -174073, -205962]
13873b05962J35044Q200L3423J14887J6804q6917o8226K21r953J26017j7842k68648
13861b22952l4145J82655R0398O97j61863r1831M319J44942J4188r614J20772
13850C7566j8332j75189p0546J30696o1505m4644j1202K4929M1978O6926J1053
13839f8270O297n768j48924J45805J86633j23714q9138J8538r779p808K5230N5126
13827a5772p7363J209J9077m0452N3287K4572j4054p8900O2013O3063l4036R7602
13815F0246J02458L1168p7301n4384k6283K8150O1421q867K3863j01850p7407
13804c8786J59475J23234k02608k5740J08926j20703L7139j4858o8499K8753p4484
13793h8151j7204J84312L8282j29168M5831J1023n0577j93302k6737Q4990O667
$$ y = [-205962, -70918, -62718, -29295, 85592, 102396, 15479, -52747, -52526, -62479, 63538, 45696, -222952, -257097, -74442, 15956, 16653, -145210, -237041, -232722, -87780, -73592, -83206, 37566, 19234, -155955, -226501, -95805, -157310, -201954, -213156, -188227, -146249, -79323, -68270, -61973, -67741, -216665, -70860, 115773, -7941, -97079, -78541, -88320, -96128, -70898, -15772, -93135, -91926, -72849, -113301, -60014, -35442, -49496, -128396, -66383, -3320, -37356, 60246, 162704, 193872, 116571, 62187, 35904, 64054, 125475, 116608, 140471, 38621, -38786, 120689, 243923, 41315, 15575, 124501, 3798, 40937, 26079, -42420, -13667, -88151, -105355, 78957, 117239, -11929, 33902, 44925, -5652, -198954, -225691, -140701, -134034]
13782a34034P9618j4011J6016o0137R0449L8232J44352K17282P0434p2068k70652
13771A05481j34926L185k8720K26812p1695j20728P9323Q9049J4081j01557q8806
13760b8501j8162k8056N9587l3364R0609n5164l7950J63586k3319k5057p516N5113
13748A11806o462l2490J18454j731k2546j22965R712k9888j79044M4037J02572
13737h545J62019J46813K9384o499j73564p7295k0361J6075j06024L3379J16365
13726A11747J27493m7204j32030j09994J5732J06358j07483p0793L7028J46771
13716G7625Q2339o7836o3347k3717j19427L2785N8923p0498j29858Q079m8734
13705b63666m9623Q7646Q3182j9987q293J18834J47704K11069o6800l9961k01979
$$ y = [-134034, -54416, -68427, -52411, -112548, -22099, 16133, 160485, 377767, 448201, 376133, 105481, -29445, -26260, -54980, 171832, 100137, -20591, 58732, 147781, 161862, 60305, -28501, -46663, -74719, -15132, -48496, 42113, -13051, -51001, 112585, 89266, 64209, 56693, 111806, 105344, 72854, 191308, 189577, 167031, 44066, 53778, 23890, -155154, -111117, -8545, 153474, 300287, 329671, 323172, 149608, 72313, 51952, 68027, -37997, -4618, 111747, 239240, 192036, 60006, -49988, -34256, 72102, -35381, -106174, -69146, 77625, 159964, 92128, 28781, 5064, -114363, -81578, -22655, -93153, -223011, -214932, -263666, -313289, -225643, -142461, -162448, -170741, -51907, 95797, 306866, 240066, 200105, -1874]
13694a874j63324J17023R9844j0766J00979q5237k7068K17265l3229k09391n6392
13683e2170L9188J07595j4085J41608k7520j02187J12865k0112j61849j23110
13673i9777j22694P1741m0183J93080J44046o3018j7324Q6128r1170n0838R8092
13662A08083P0390p0242K027j1873l985l4840j3986J4568l9449k2547O2179J30605
13650A90930Q3899p4902j00205J29669k0681j41177j93437q3208Q5937N2137j04986
13639a76024k5554P8309J42419p0635Q9571j5182n8982K6166J96397Q6869j01735
13628A71619q7635J42579J3891N7934j71552k86549j11640M0590J21579Q4785
13618b4399q927o624Q7652j04369r7947J45399J34396p2892o7670K1897m688l5487
$$ y = [-1874, -165198, -48175, 51669, 40903, 141882, 56645, 29577, 246842, 213613, 4222, -52170, -12982, 94613, 80528, 222136, 194616, 92429, 205294, 185182, 23333, -99777, -222471, -150730, -190913, 2167, 146213, 83195, 65871, 151999, 60829, 9991, 108083, 178473, 108231, 110258, 98385, 94400, 59560, 45574, 60142, 20693, -1854, 60325, 190930, 274829, 199927, 99722, 229391, 208710, 67533, -125904, -209112, -123175, -71038, -176024, -201578, -123269, 19150, -51485, 38086, 22904, -36078, -9912, 186485, 273354, 171619, 83984, 226563, 240454, 298388, 126836, -159713, -271353, -230763, -109184, -24399, -33326, -39950, 47702, -56667, -154614, -9215, 125181, 52289, -15381, 6516, 1828, -33659]
13606c3659m1265r0959J00155J37374j31936n2377M6817r5253n2674L8994j26238
13595c01021K6414K45633J12799j51174M5522K022J9277O8712j39208J45985O9764
13584A44725o3675Q513q5557o3859o7107j67374p1043j8008J13691J05691L0054
13573a33949O1040j80187l2037K45569J38980o9251p4718n4932J00273K6557n9106
13562c1761j80526K903N2588j513j6360O4950K02430Q388K4297k8846j0081r4936
13550h467o4373P916l0562K6877M8468M168J48615J57677q9428L9255k5959j00067
13538A14120J59251M3237M540j38613l0228J20199k01231j42677J28519P4283
13528A31400j54590j5771J09301R0554m9249M5438M7917r7382L2070n5964k7535
$$ y = [-33659, -74924, -165883, -65728, 71646, -60290, -112667, -65850, -161103, -213777, -174783, -301021, -274607, -28974, 83825, -67349, -21827, -19805, -528, 68184, -71024, 74961, 144725, 81050, 89563, 4006, -59853, -126960, -294334, -365377, -383385, -269694, -164003, -133949, -72909, -253096, -285133, -39564, 99416, 30165, -44553, -99485, 788, 27345, -31761, -212287, -209384, -156796, -158309, -174669, -109719, 92711, 101099, 125396, 96550, 86469, -8467, -72840, -64924, -95486, -68609, -20141, -15973, 132642, 290319, 200891, 240146, 214187, 114120, 273371, 316608, 321148, 182535, 152307, 272506, 71275, -71402, 57117, 131400, -23190, -38961, 70340, 160894, 111645, 157083, 205000, 107618, 139688, 83724, 56189]
13517E6189j293o1633p3918K5479J34697J14043j89292j52787J1787M674j7036
13506a49090j33398K8507K77876J84968J07162j6647k38809k70820N0068P910
13496a52273m2891J39863N3075j54421l6214J3057K1948o5127L5058K9537k13840
13485c72228J5012J1721K67608N2915R6994k0374j43136r8062J1015P6987Q9047
13474a2501N6604J42659n4281N841J18866o6956p7507m1126j48047k14035J46091
13463a44392J10903J51157J12476O9882j550L1822R8334l14871r3221J46880l38003
13452a70583k02114K13143M0621Q2323j10748k57649N2720J28790n0229m9216
13442c22942Q8775J39959K65419J97082N1374j64549k27084j22949P9783j07711
$$ y = [56189, 54896, -6737, -80655, -55176, 79521, 193564, 4272, -148515, -136728, -132054, -149090, -282488, -253981, 23895, 208863, 316025, 299378, 60569, -210251, -160183, -152273, -195164, -55301, -2226, -156647, -192861, -179804, -157856, -222983, -187925, -158388, -372228, -357216, -345495, -77887, -24972, 72022, 51648, -91488, -189550, -178535, -101548, -12501, 44103, 186762, 132481, 138322, 257188, 190232, 112725, 71599, -76448, -290483, -144392, -33489, 117668, 230144, 300026, 298476, 330298, 428632, 113761, 20540, 167420, -170583, -372697, -159554, -118933, -36610, -147358, -405007, -352287, -223497, -273726, -322942, -234167, -94208, 171211, 368293, 419667, 255118, 28034, -94915, -15132, -122843]
13432a22843o1852P3274K8554J76454O3325j55688q8997L6866N172O9876P8263
13421A02404M300J09647j14580j8322q7030r1664J82676K18709j33593p233P6377
13410B41691L694N6132j05659k7577q1839M2137k6865j8201J5038l7073j33758
13399g2280L6525J04267N0707M606J0582k3482j81587j06695J73853N4934j44168
13388i2738M2823L3535J57242j34318M7334M7509j89719p5906r58M1660l6680
13377a60216J411n836L1072N5679L5311O9902J18415k01052L4808J00761l42924
13366b62669p3984J52897K2818k6990K49289K8135J918m7120n8618k4073J02904
13355F4507O0983K2381n402J31600O4817j1565k18183k18265R136J0151J07461
$$ y = [-122843, -184695, -111421, -82867, 93587, 156912, 1224, -87773, -50907, -45735, 24141, 102404, 106704, 216351, 101771, 83449, -3581, -95245, 87431, 306140, 172547, 165314, 241691, 245385, 301517, 195858, 168281, 86442, 128579, 101714, 83513, 98551, 61478, -72280, -35755, 68512, 119219, 123825, 134407, 110925, -70662, -177357, -3504, 51430, -92738, -49915, -16380, 140862, 6544, 53878, 101387, -88332, -164238, -165196, -123536, -160216, -158805, -164641, -133569, -77890, -42579, 27323, 145738, -55314, -20506, 80255, -262669, -336653, -183756, -160938, -187928, 61361, 89496, 91414, 44294, -14324, -38397, 64507, 125490, 147871, 142469, 274069, 338886, 327321, 109138, -109127, -99991, -89840, 17621]
13344A7621J5313J28021q2830Q9064J2949n4506O6116q8415j08571r9580j35876
13333b40694o6J3955L3310J98246Q1882l0159O9465l5386j71776j8071O6918j0494
13321d2870j6335l0473m1317P8188l4767O569J2089j4140J40545J10486j1994
13310A55981P2926k25793m4611Q0704N4159j54873q5116L1937r1956o2989p4493
13299c44124l3535L4522J07243O3501K751j19025O4992K34144L918j08045J11065
13288A7407M558L4560J05793N1579m0929j36305j25151r998O3883J67369j00752
13277C2014j31089k3697j4987J27753J16343K3685L8213k29005j91435k4493J06323
13266a70375J35088J05488J96916j30532j21010j87049J28457M0852m3774j03159
$$ y = [17621, 32934, 160955, 78125, 167189, 180138, 125632, 191748, 103333, -5238, -104818, -240694, -240760, -226805, -193495, 4751, 86633, 56474, 125939, 90553, -81223, -99294, -32376, -42870, -59205, -89678, -130995, -52807, -87574, -81005, -68916, -83056, 57489, 167975, 155981, 228907, 3114, -41497, 39207, 93366, -61507, -146623, -114686, -206642, -269631, -344124, -377659, -343137, -235894, -172393, -169642, -288667, -223675, 10469, 14387, -93658, 17407, 21965, 56525, 162318, 213897, 172968, 36663, -88488, -98486, -34603, 132766, 32014, -99075, -122772, -137759, -10006, 106337, 130022, 168235, -60770, -252205, -276698, -170375, -35287, 70201, 267117, 136585, 15575, -171474, -43017, -2165, -45939, -149098]
13256a49098j44602K1094K04493N3394j45910Q6056K83989J53346l2545j01673
13246B28544q3458o5398K4062J29395j11852o9292O2194n7142l31708k13522q2606
13235e70783R8496K61866L06726l4465r6551j16740J05321k6514J8007O6505n3930
13224d2062L8957j55122j36242N0408M6829J40870O1247K0528L5563n8989N0685
13213E2672l8489J4477j7233q0363j06423p2138m896L7952J52170Q6914N1925
13202G6568j5919J4994j00118P7594J07994j24799n6848l0306k2971Q2430O6154
13191G4773J06355q3064J9468j855n2731P4147l3524m9161J80888l1775j31536
13180G1985J38646J05138J1416k24114r0673j28027P1977N8320K7252P4801k14375
$$ y = [-149098, -293700, -272606, -68113, -14719, -160629, -74573, 209416, 362762, 330217, 228544, 145086, 79688, 103750, 233145, 121293, 52001, 114195, 57053, -274655, -488177, -570783, -472287, -210421, 96305, 61840, -34711, -151451, -46130, -72644, -54637, 11868, -42062, -3105, -158227, -294469, -244061, -197232, -56362, 4885, 25413, 60976, 1987, 52672, 14183, 28660, 11427, -68936, -175359, -247497, -252393, -214441, -62271, 24643, 76568, 60649, 75643, -24475, 53119, 161113, 36314, -20534, -50840, -73811, 8619, 74773, 181128, 98064, 117532, 115677, 62946, 137093, 103569, 54408, 235296, 203521, 71985, 210631, 315769, 327185, 103071, 12398, -115629, -43652, 14668, 41920, 116721, -97654]
13169i7654N8730J44182Q5904N0863k35317n6976j36828o1785J74859N3592j24439
13158a44869R938K51893J8247o0203Q4982J5736j07803J2020n5952k0087k4215
13147b0313O6079Q8843O0939k1200l5243m0827k157j24130L709J41196K29384
13136C46280Q820k2452j17821p1673q0250p1165K7130K8257L2203l8870L2972
13125G3431k9814j12849l6091j6602J09878O4833J97017j19739j64444P1794J08519
13114A45933J11770O502n4723p1698j08253K2135k2340q2333n3167r2077k2102
13103b20353J98166J35424j66936m152J18866o4443j51704r4489J2120J24365
13093a13136J51804j3807m18j15218R9052M0526j34647m7134P0856M9801K2039
$$ y = [-97654, -38924, 105258, 191162, 242025, 6708, -50268, -187096, -248881, -74022, -20430, -144869, -134931, 116962, 135209, 75006, 159988, 175724, 67921, 79941, 23989, 3902, -20313, 45766, 134609, 195548, 174348, 139105, 98278, 96121, -28009, -24300, 116896, 346280, 355100, 332648, 214827, 143154, 62904, -8261, 18869, 47126, 79329, 40459, 73431, 43617, -69232, -105323, -121925, -12047, 52786, 249803, 130064, -34380, 37414, 145933, 257703, 264205, 209482, 137784, 29531, 51666, 29326, -53007, -106174, -198251, -220353, -22187, 113237, -53699, -57851, 61015, -3428, -155132, -249621, -237501, -113136, 38668, 24861, 24443, -90775, 8277, 48803, -85844, -132978, -62122, -12321, 9718]
13082I718N0129J48176L09482j2223l43463k50125j79185P7705J60282K9031J65572
13071A65099j82616j79465o7025L3689j1788J49140J93570n0919L410r3074p5085
13060a15064j6153j61500J60825K06593M9574M0344k5230m6427Q6300j46798j53410
13049a20946L9316j01517j58339M3861J45016K25426R4432j89156R8993J55654
13039B32740Q5085j24922n2283n6601p7853j41781j9322J36251K39082J38555
13029C58951j10409j39509k21033J4892N2963j52159J63639L45190O5355n450
13019C72430j07391j07236o642r8347j08980L2876J92903k2555k0289J1262J3920
13008A51951q541K04117j09543p6365J9597l2775r9582k50584M5017N1661N276
$$ y = [9718, 59847, 208023, 517505, 505282, 161819, -88306, -267491, -189786, -29504, -473, 165099, -17517, -196982, -264007, -230318, -242106, -92966, 100604, 49685, 53095, -39979, -115064, -131217, -292717, -131892, 74701, 124275, 164619, 139389, 92962, 179262, 32464, -120946, -81630, -183147, -341486, -297625, -152609, 72817, 167249, -21907, 77086, 232740, 317825, 192903, 140620, 84019, 6166, -135615, -154937, -18686, 220396, 358951, 248542, 109033, -112000, -97108, -44145, -196304, -32665, 312525, 377880, 372430, 265039, 157803, 151161, 52814, -56166, -23290, 169613, 147058, 126769, 138031, 151951, 143410, 347527, 237984, 161619, 181216, 148441, 48859, -201725, -156708, -105047, -99771]
12997i9771j81963q9431J32097m514K6556J90175p556l0766m6168P0585p4007
12986a14763j22029K27965J07900p1801R627J34896l1063k05111r0716J61769
12976F674R3265j04836p3982j33323M6586N4580J27175L9726P2669j26222P6156
12965G8468J70088o8277j01198j04775M8277J50803L6374r1116l0530r9628R2729
12954H1215N3432J1712j37966j03175P702O6930K2786j27376k36547j69357J8622
12943e12022R2475J05258J44352N8839m5141L7960o6484k5981J85538R7759q4901
12932a2348o0967j57207k5278j9003R5467R6718j9119l8693J0375L0308l6088
12921a35835k9064k4405k416J36591J08836m122N3491p396K5032l2587J90745
$$ y = [-99771, -281734, -371165, -239068, -243582, -217026, -26851, -34407, -65173, -111341, -40756, -114763, -236792, -8827, 99073, 27272, 36899, 171795, 140732, -64379, -155095, 6674, 99939, -4897, -78879, -212202, -165616, -111036, 16139, 55865, 128534, 2312, 78468, 248556, 180279, 79081, -25694, 22583, 173386, 209760, 118644, 88114, -11514, 81215, 134647, 146359, 8393, -94782, -87080, -20150, 2636, -124740, -361287, -530644, -512022, -419547, -314289, -169937, -111098, -156239, -118279, -184763, -210744, -25206, 72553, -12348, -73315, -230522, -255800, -274803, -179336, -82618, -101737, -140430, -130055, -99747, -135835, -164899, -189304, -191720, -55129, 53707, 49585, 103076, 95680, 120712, 88125, 278870]
12910B78870J11098j56999j33199r4014O7344J87863M9040Q9469q6543j88589
12900A24340j26350n4167J40704K44125J9321j41194j43966j6030K4256r3594
12890b2555j06451j5883R2229r7056r4969K4485P1956P0803J27819J4018p7538
12879a3142N317J37654M4723J6056P6921J1658o4580m7938k52052j34679N6445
12868a63617J91490J01882m3773K5399J47551l7527k7756l0477j429j04370L3067
12857I0440Q1063Q9995J51932j55912j56586n8448q8532O9847j9844k1973M98
12846a7520n6038j65060l6394L6625K3697K23376J64987k6859Q6755p6442l80747
12835b23620j47087K97998M8237j17810K61739l4806p3980o3097K6912p5025m566
$$ y = [278870, 389968, 232969, 99770, 5756, 73100, 260963, 310003, 399472, 312929, 124340, -2010, -56177, 84527, 328652, 347973, 206779, 62813, 46783, 71039, -22555, -129006, -144889, -52660, -149716, -244685, -220200, -148244, -77441, 50378, 64396, -13142, -7825, 129829, 174552, 190608, 267529, 279187, 214607, 166669, -85383, -220062, -163617, 27873, 129755, 85982, 111381, 258932, 221405, 193649, 163172, 161743, 57373, 90440, 171503, 261498, 413430, 257518, 100932, 42484, -46048, 23799, 3955, -18018, -17520, -73558, -238618, -275012, -238387, -214690, 8686, 173673, 146814, 233569, 157127, -223620, -370707, -72709, -24472, -142282, 119457, 84651, 10671, -52426, -25514, -100539, -105105]
12824a05105Q94Q9765K2020J2858N9687j7766j0930P149l7717J1686r9944L2766
12812c4637k4688m6470J78100J97734p8228j09840k24476j71639J63110J50110
12802i24P9346Q0788l3402n1276M5842o1292k4596L7133M9294J0477J23291m9929
12790B04752j42565K4996L0040p7509L8852p2118q2791j77995n0577K34396J74856
12779A04337L2648O2605j61856j05991q8644M012J25825J75269j365j5429J77204
12768C08615R9739j46637m6653P6917j29605k08730J4959j91891k08209J11883
12758c19612R3316l9668L8938P9137J29006j7930J470K4994O5419m5883o6728
12747e7541P9041K854m3195o8603M2033L1968L084j78186k12207j17744J89892
$$ y = [-105105, -104211, -14446, 7574, 20432, 80119, 62353, 51423, 58572, 20855, 32541, -67403, -34637, -59325, -105795, 72305, 270039, 191811, 81971, -142505, -314144, -151034, -924, 78422, 159210, 125808, 74532, 120374, 59082, 34486, 71619, 120913, 131390, 254681, 204752, 62187, 87183, 117223, 39714, 78566, 6448, -76343, -254338, -304915, -70519, 104337, 136985, 199590, 37734, -68257, -156901, -152889, -27064, 148205, 146840, 131411, 308615, 408354, 261717, 215064, 291981, 162376, -46354, -31395, -223286, -431495, -319612, -226296, -265964, -227026, -147889, -18883, -36813, -35343, -10349, 55070, 9187, -57541, 21500, 24354, -18841, -87444, -45411, -13443, -10359, -188545, -400752, -518496, -328604]
12736c28604Q9239R0808J4837q464J0625K29297N1281l2422m6154J6308q366n0287
12724B8098J58936Q1412l5647J10716k8638k81484l8855L6260K5626L4385P6432
12713A67241P8881q0189k3223n3903p8667n2484J5535q7596J7479m2338q2874
12702b22138q0621m5633J08200R0609J73436J11891M5470R7281j20128j77694
12692a9327j05577J10087l4583j27740p3669p1512o5071P814Q2743R1637k6996
12681b32194M9374J12441J10046k2254p0472M0201O3239j57827m9001j40401p2448
12670c69296M6504L5765J51344R775Q577N7345j46581j10260K33467Q5040q7699
12659h6019j9006K66183J03908n9125J57475j22390j75586o7883p6212J7997o8433
$$ y = [-328604, -239365, -148557, -133720, -142184, -131559, 97738, 149019, 116597, 70443, 86751, 78385, 28098, 187034, 268446, 232799, 343515, 314877, 33393, -5462, 30798, 56424, 90809, 167241, 246122, 165933, 142710, 88807, 10140, -42344, -26809, -114405, -96926, -139264, -222138, -302759, -348392, -240192, -149583, 23853, 135744, 181214, 278495, 158367, -19327, -124904, -14817, -49400, -177140, -250809, -322321, -387392, -379578, -296835, -205198, -232194, -182820, -70379, 39667, 17413, -53059, -12858, 50381, -107446, -156447, -296848, -369296, -322792, -287027, -135683, -125908, -117331, -59986, -206567, -316827, -83360, 1680, -86019, -105025, 161158, 265066, 205941, 363416, 241026, 65440, -2443, -78655, -60658, -129091]
12648a29091R0962j4152K5737M2557p3527j29380r7449J50478J68320j34257j41163
12637b40965P0700K24108J76971L3944k6251K2532m213j51032j15788o219R3779
12626G7566K0145l2500L7774j4363n5700r0195L3135M1432J46909M1129L3268
12615B38600q9979l9996K8324M2930j0109j49521m0536M3835m7723R9254k4043
12604E1036p2297r7051Q4205J20989K2097P833j22064O379j9903J9239L9407k7606
12592A2264q3044J58647K5377p3783n2028j12977j45890m2023J86786J19881J33157
12581A26367j52727j28709J22044Q0199Q3739k3387r5091j08942j21942J31394
12571h7055j1506p2654K97680J31402j47693J39235J3718j19054O4009q2313l4601
$$ y = [-129091, -38129, -52281, -26544, 16013, -57514, -186894, -284343, -133865, 34455, -99802, -240965, -170265, 53843, 230814, 264758, 238507, 261039, 256826, 105794, -9994, -16213, 77566, 97711, 65211, 102985, 88622, 32922, -57273, -24138, 17294, 164203, 205332, 238600, 148621, 108625, 136949, 179879, 169770, 20249, -20287, 23548, -24175, 75079, 51036, -21261, -118312, -34107, 86882, 108979, 116812, -5252, 1127, -18776, 463, 39870, 12264, -70780, 87867, 113244, 39461, -12567, -125544, -271434, -313457, -126671, -6790, 126367, -26360, -155069, -33025, 47174, 130913, 107526, 12435, -96507, -218449, -87055, -98561, -171215, 126465, 257867, 110174, 249409, 263127, 144073, 208082, 125769, 91168]
12560I1168J1373J58423j44631j72465o659n9404O3670J08418r5O527M5421j18572
12548a6826j90911J82875J39286n6770J78166L7150j13538J22284J02616j75968
12538B08364j64321L1612j0532K8303p9798p9371J04327P5337l3579J10886Q3594
12527B74822j4947n2749m9374j6451k42735k42974j58612K46336L78074R4143
12517B15533j7294O9746M5877O0201n5233j54803k41074j05693J34410N2192j01097
12506i7235K7376Q5879l75R9733k02783k25199N5170J22251K13717Q8486j80600
12495a3580M3354Q1736j25145P897j28950j61783K6821M0514J9165J00606J9917
12484h9448M1697O1669q077N265o0853J04199M8422j11018n9010j68866N4505
$$ y = [91168, 102541, 260964, 116333, -56132, -62791, -122195, -58525, 49893, 49798, 56325, 101746, -16826, -207737, -24862, 114424, 57654, 235820, 272970, 159432, 281716, 384332, 208364, 44043, 75655, 65123, 93426, 13628, -65743, 38584, 113921, 80342, 191228, 274822, 259875, 207126, 157752, 141301, -101434, -344408, -503020, -256684, 121390, 215533, 198239, 267985, 313862, 374063, 318830, 164027, -77047, -182740, -48330, 3862, -97235, -69859, 16020, 15645, 115378, -87405, -312604, -257434, -135183, 78534, 167020, -13580, 29774, 111510, -13635, -5738, -134688, -296471, -269650, -229136, -209971, -109365, -89448, -47751, 13918, 5841, 11106, -49747, 54452, 102874, -8144, -67154, -236020, -181515]
12473a81515J38443R8805n7556J65484N9582k47622j28343O8932p8646j41310
12463c03746l9255j8687J03200J75046Q9882n3097j71106J18823K15463R454j23856
12452B121j89467j7562N9772R2176r3965j594N6143p6648J03755J67973P1740
12441A74444k07972k9383L6995J4789m4161j31009N8747J31571l9936m6659q5182
12430a67756J10981k8063J10956K1442K0958Q3520Q8010M1412k03260n1844K4127
12419E0483R0103o6815O3578N204j64397k9647K73503K12771Q8994k29355k17372
12408G7050p5859m4459n7756K32367J85179l4840o4820j79962r2988J6414P0304
12397C0630J44828O3270l1401o9123K6178J23299J13839j02472M471k21104L3470
$$ y = [-181515, -43072, 55733, -1823, 163661, 223243, -24379, -152722, -83790, -162436, -303746, -343001, -361688, -258488, -83442, 6440, -46657, -217763, -98940, 116523, 125977, 2121, -187346, -204908, -145136, -52960, -146925, -148519, -92376, -169024, -65269, 102704, 174444, -33528, -62911, -25916, -11127, -55288, -186297, -127550, 4021, -35915, -82574, -167756, -56775, -84838, 26118, 47560, 68518, 152038, 240048, 281460, 78200, 26356, 50483, 140586, 73771, 137349, 142553, -21844, -51491, 222012, 434783, 523777, 294422, 77050, 1191, -43268, -101024, 131343, 316522, 281682, 216862, 36900, -56088, -39674, 30630, 175458, 238728, 207327, 138204, 164382, 287681, 401520, 299048, 303519, 82415, 115885]
12386A15885K14770O6099j49282n3589p9580k28298R9893J40925J57238j92324
12376I1737k06327J48411M7886j42422R006L7434j42099p3445N6595J30801L560
12365c8863Q645p1638j57516n6541k6920K71621J03331J37434O0872j75474k57702
12354b02751q5810R4355P7769k7148n7339P4850j17024J3656K07386J20130P4377
12343A72451L100j51346j45482J5192k7593k4588o7590J29074J22356k8801m4736
12332d7963m0813J17469j74673J6549J81873Q3120J2408l3513m5979J51834k4800
12321A95512j2059Q6916r307j03804n4723P3333J77253N6218j04457j9930k0222
12310B64730n4883p4645j91578o7516k54J06597L2941L025o4393J12025k03207
$$ y = [115885, 330655, 396754, 247472, 193883, 114303, -113995, -14102, 126823, 284061, 91737, -114590, 33821, 81707, -60715, -51709, -14275, -156374, -229819, -173224, -42423, -38863, -30218, -101856, -259372, -315913, -342833, -71212, 32119, 169553, 230425, 54951, -202751, -288561, -194206, -116437, -143585, -200924, -126074, -243098, -229442, -22056, 98074, 172451, 175551, 24205, -121277, -106085, -133678, -158266, -225856, -96782, 25574, -3227, -47963, -88776, 28693, -145980, -129431, 52442, 135562, 147970, 114457, 68478, 220312, 195512, 183453, 270369, 261062, 157258, 102535, 175868, 353121, 409339, 304882, 284952, 264730, 209847, 135202, -56376, -123892, -124146, -17549, 15392, 18417, -45976, 66049, -137158]
12299a37158M5421J09174r3068p1172j38223P0047J61745J21414o6902q2630o3964
12288a45316K1318Q2820Q5844J7275j54581o8069j33733L8331J36843O4867q7531
12277a41932q8365K66229J09148L7485j35709j03604j82662R4413J92943R1989
12267A39935q2739k08715j19357m1339R5935K0512j3432J15281r3680J37985K08675
12256A59061L0101j63543k7522q8394J1312k2834k2716K57254Q4806j95573r9291
12245g7339Q8115J41774j7374j60160k1532M6618q0947o9442r0071o3822O8729
12234b35451p7078n3286J90472L62952m4031j05281L3838J7252m3483p2275R389
12223a6982r094J4168l0116j40963n5829L3987J51488L140k5090J00275P4396
$$ y = [-137158, -91737, 17437, -75631, -146803, -285026, -214979, -53234, 68180, 1278, -81352, -145316, -123998, -41178, 44666, 61941, -92640, -160709, -294442, -256111, -119268, -54401, -141932, -230297, 35932, 145080, 182565, 46856, -56748, -239410, -144997, 47946, 139935, 57196, -151519, -270876, -312215, -216280, -195768, -209200, -93919, -187599, -49614, 159061, 189162, 25619, -1903, -90297, -78985, -101819, -124535, 132719, 217525, 21952, -77339, 10776, 152550, 135176, -24984, -46516, 102, -80845, -150287, -240358, -304180, -235451, -312529, -365815, -175343, 187609, 143578, 38297, 72135, 89387, 45904, -26371, -16982, -26076, -11908, -42024, -182987, -238816, -204829, -53341, -50201, -75291, 24984, 99380]
12212I9380M8493j32355j86194J94174o6680q775K0683r4758l280o173K4456K21941
12200A10912M239j41913o8094O3183P7294J19179R3563j59607j9997l3950j2777
12189C2032L4081j1243N7670k9908N6505P1200K8438J9177j60231j64688k9566
12178i6533N0087l3581K3269m2917M8946N8576M8817J3455l8708m6517J08230
12167I3124J408M1771Q0937l0676j87192O2551J05479k36717r3265J79122O1580
12156G8122M1935j63685l7884q6024M8404P7280J16538Q1602r7679q2455k03557
12145b27403k9284M6951K9215m9617P8964Q4227r633p737o965Q3333J335J17346
12133A10732L7356k040j03686m2021J02681p3115j58307J75576M7543p647j27403
$$ y = [99380, 147873, 15518, -170676, 23498, -43182, -51957, -31274, -126032, -129312, -135485, -111029, 110912, 115151, -26762, -94856, -31673, 45621, 164800, 258363, 98756, 78759, 44809, 32032, 66113, 54870, 112540, 82632, 139137, 210337, 238775, 257952, 97721, -66967, -96533, -46446, -80027, -56758, -99675, -50729, 7847, 56664, 70119, 31411, -15106, 93124, 94532, 136303, 217240, 186564, -628, 61923, 167402, -69315, -162580, 16542, 78122, 120057, -43628, -81512, -167536, -119132, -41852, 74686, 156288, 58609, -23846, -227403, -256687, -209736, -180521, -230138, -151174, -66947, -76580, -84317, -91282, -7949, -6614, 110732, 148088, 146048, 42362, 341, 103022, 29907, -128400, 47176, 94719, 87072, -40331]
12122d0331k7311r5711Q5808J35128J601K78l7743m8094j6174Q1147N3991q3227
12110I362p7625j30441N8889j2060J9579o7173j21670j39867K25426J95007O5817
12099B5244k5469J53288J52309n5136j44318j51870J6725J47357N0539j19484
12089D9185n0557J28909J00977K0541Q9143J60256L1858j94035J12178P4295q8090
12078D34660J9963k4388m5310j57363j56889P7048J2335j66291j89612l0175L1523
12067a94499N4667R937K3137P4495m6458q1650J62547K01863J17919P6148j34162
12056B63944k16219j01152j04309o5763P6179M5916J56977o1740M5812M7278k7247
12045E9676j59454J02850J4596m6201o1554p6007R5627J6380N9966m7195q4627
$$ y = [-40331, -67642, -163353, -77545, 57583, 59184, 59462, 21719, -26375, -42549, 38598, 92589, 9362, -68263, -198704, -139815, -151875, -132296, -199469, -321139, -461006, -235580, -40573, 25244, -225, 153063, 305372, 250236, 105918, -45952, -29227, 118130, 168669, 49185, -1372, 127537, 228514, 249055, 338198, 498454, 530312, 336277, 448455, 522750, 434660, 454623, 430235, 384925, 227562, 70673, 147721, 160056, -6235, -195847, -226022, -194499, -139832, -129895, -106758, -32263, -78721, -160371, 2176, 204039, 321958, 398106, 263944, 47725, -53427, -157736, -223499, -147320, -101404, 55573, -6167, 39645, 86923, 59676, -99778, 3072, 17668, -28533, -90087, -166094, -70467, -54087, 5879, -41316, -125943]
12034a25943j07645J95595M4775m2024j59050P2799R5714J39776Q2815j76439
12024B0373R709n0126m3289j11269R4275J87799m3437j05892K1027r9136m7160
12013a67126R3558k5119J8798J77493J24673K2937J857l3526m1096j6269j74686
12002a8506L5652N2847M3765K54463J4375j87139J4026M4965M1839m514j3047
11991B78726k0148k19743m5989Q2898K6213k03929K060J53214L1290j60726l3776
11980a09910K17995J04330j30849j60994J5350l1294J76251Q1328j40013R0780
11970A12974Q9206J4789j30714k75k1741k1455q1740j58352O3821J84602K8772
11959G9887J96q9510m8906n6372J20924J27532L4521M3523k11357M229P0162J78638
$$ y = [-125943, -233588, -37993, 6782, -35242, -194292, -121493, -25779, 113997, 196812, 20373, 30082, -20044, -63333, -174602, -80327, 107472, 64035, -41857, -20830, -119966, -167126, -73568, -98687, -79889, 97604, 222277, 245214, 247071, 213545, 172449, 156180, -18506, 17146, 69993, 113758, 368221, 382596, 195457, 209483, 254448, 296287, 291773, 278726, 258578, 38835, -7154, 75744, 101957, -101972, -99912, 53302, 84592, -76134, -109910, 108085, 212415, 81566, -79428, -64078, -95372, 80879, 162207, 22194, 112974, 202180, 216969, 86255, 85980, 64239, 42784, -38956, -197308, -133487, 51115, 79887, 80083, -9427, -58333, -114705, 6219, 133751, 168272, 211795, 438, 4667, 74829, 253467]
11947B53467J48355o9577j58448l0027l1364J36520L925O8427J47427r4245k4512
11936C49948L8968j71064r230J32118k0953Q3522k9444m382p464L6899j86085
11925B12833k24688l8818N6321l8899l8923P471m5122J48334j63949j00427Q5395
11914a40472p4676k000M7927o7451K09456J56938J88585K54177l25369k36789
11904A0326j20337M5780P1103O4980J08073o6533N3128m5156J4304M8706j23494
11893F0880j39973j34706Q4872j9192J25198J40021N3172l774q8758L8906m3009
11882G3637O741j6022K847m5062J34084M5464L1400O4492j77923l8352j9680K518
11870F4144r8500j41207j35957N1717J35707o0849j47191K36518O8027J9991k5684
$$ y = [253467, 401822, 332245, 173797, 143770, 112406, 248926, 252851, 321278, 468705, 374460, 349948, 388916, 217852, 208622, 340740, 319787, 403309, 373865, 369483, 362019, 398918, 212833, -11855, -50673, 5648, -33251, -72174, -64703, -109825, 38509, -125440, -225867, -140472, -215148, -217148, -169221, -236672, -27216, 129722, 318307, 572484, 247115, 10326, -110011, -64231, 6872, 71852, 179925, 113392, 166520, 121364, 135668, 184374, 60880, -79093, -213799, -128927, -148119, -22921, 117100, 170272, 166498, 77740, 116646, 73637, 80378, 64356, 67203, 22141, 156225, 201689, 233089, 297581, 119658, 81306, 61626, 64144, -34356, -175563, -311520, -259803, -124096, -184945, -332136, -95618, -27591, -7600, -33284]
11859c3284J9644R577j66373j19256J41176J07250Q3691k3085n5251m3758l2470
11848a12139Q7175M3465J7742o9872J2318l0848j70166o7577J30796P2331K2891
11837f3884J82170R8100l54436j4943K58567J44317K1374o2340p142n5072L6906
11826A83617J8872K21377M23853J28742j39051j94564k14173j08863k4817k3215
11816B71778N0745J02056n2669k28822j39352o4188j10962j9795J42408L4495
11806a4306n7785L6654Q7499P2725k7067l2388L1736m9624o6270m7471k1115m9751
11794a37163j0895p686R993O194J01255O2660n029r8928j40074M1011o5242N6584
11782a87320J97512K07791J7728r1903k6183L9539M938p2315n101J13365P3354
$$ y = [-33284, -13640, -4063, -170436, -289692, -148516, -41266, 42425, 19340, -35911, -79669, -112139, -24964, 18501, 36243, -33629, -21311, -52159, -222325, -289902, -159106, -86775, -63884, 118286, 216386, -138050, -152993, 105574, 249891, 271265, 208925, 201783, 146711, 183617, 202489, 423866, 847719, 976461, 837410, 642846, 428673, 319810, 294993, 271778, 322523, 424579, 371910, 143088, 3736, -60452, -171414, -191209, -48801, -14306, -72091, -35437, 52062, 124787, 97720, 65332, 97068, 47444, -18826, -66297, -87412, -137163, -148058, -155744, -145751, -139557, -38302, 24358, 19329, -79599, -219673, -178662, -243904, -187320, 10192, 217983, 235711, 143808, 117625, 157164, 162102, 89787, 84686, 198051, 271405]
11771B71405k2587p397r2535r2401o6936L2976P2487r8041j35048q4346L8623
11760a83800M4072M3287J9651K5801j00329k878N8106J764j30740M452K4020L5919
11748a60675l2508J69729O356l3270j03895o5665N2120k5654p4003J1025J56211
11737a00229O4247K0949o8781R1905k2442n5231Q1331l4306J06078j0980q3356
11726a0815j01710J21923J28137Q9764J90788n2964j06681p013o9007j51293O6390
11715I7519L6166M263O6943P4595R0150o2203K6115j00871k07416K89631K35482
11704E50374J13474J0082j07250j66996o2455J9132k2936j29519k3200k12061
11694c1355k00357l7493J77988J07638L8900j3114n8192L4328J62317P4038j46939
$$ y = [271405, 248818, 241421, 148886, 56485, -10451, 22525, 95012, -3029, -138077, -222423, -183800, -139728, -96441, -76790, -50989, -151318, -154196, -96090, -94326, -225066, -220614, -196594, -160675, -193183, -23454, -17098, -50368, -154263, -219928, -167808, -193462, -267465, -256440, -100229, -35982, -15033, -83814, 8091, -14351, -69582, 11749, -22557, 83521, 72541, -10815, -112525, 9398, 137535, 227299, 418087, 365123, 258442, 251429, 182422, 31129, 97519, 133685, 137948, 204891, 279486, 369636, 307433, 333548, 232677, 25261, 314892, 550374, 663848, 673930, 566680, 399684, 337229, 356361, 333425, 203906, 180706, -31355, -231712, -269205, -91217, 16421, 55321, 42207, -15985, 18343, 180660, 254698, 107759]
11683A07759k03101M3676L4184p523J76446J10292M1853J29472n4142M0774l665
11672D16025n4611j26127k633n7654j11009L3946J1092l1227j0304j33767q4452
11661a50721K6846K5831J74737K78062J32524k1509r9530j34064M3048r063k6494
11650B39667Q550J86205k5628j52686l22P8410o450l0700J3725k8912j14436p1225
11638I6198j9018o8730p1038l8094Q2004R8988o2734K40332J48222j36010J6850
11627B86970O9817j20192r2040N9159M2998l9824j06391J49189L6k6468l0798
11616A92456q1109M6527L9336J53590K37641J11759j24135j28874L8317R3383
11606E78891N9057J07815K1690n4135k7897j97287q56j7662j34233j64810Q3532
$$ y = [107759, -95342, -51666, -17482, -25005, 151441, 261733, 303586, 433058, 378916, 419690, 416025, 361414, 235287, 232654, 175000, 63991, 97937, 109029, 77802, 67498, -66269, -150721, -123875, -98044, 76693, 354755, 487279, 465770, 366240, 232176, 275224, 266161, 239667, 248217, 434422, 408794, 256108, 255786, 334196, 327746, 297046, 310771, 281859, 167423, 96198, 77180, 8450, -62588, -100682, -18678, 80310, 17576, 257908, 406130, 270120, 286970, 356787, 236595, 144555, 203714, 246712, 206888, 100497, 249686, 249722, 223254, 192456, 111347, 157874, 197210, 350800, 588441, 700200, 576065, 447191, 485508, 578891, 637948, 745763, 767453, 713318, 685421, 488134, 487278, 469616, 335383, 170573, 254105]
11595B54105R835n7278L8474J55498J98067L0733j81395k9266m3590j26270q0087
11584A68826J6865o7472k4122R9432N7551k1874k2729L544J10115j73844j00375
11573D5917J31548J41994M9663J1540J09624j01030L4213L1740p2653j47074n0496
11562A84986P0723j53494l8521J49096l2317L8994J79519R589r1240n9888M064
11551B61511k8044J58198q1596j94001j26237K80543R0108m1278j2473K38045
11541E44776K4261j03433k61378j35228n76J40214j23007j30440J74931n8691
11531G1429J0126R1273n3461p5335j06729k5488L9179P6916k3887L6121L57m729
11519C5772J6674k3385J44930P7965j50489k3562L7271m6242P7207P0503n8080
$$ y = [254105, 263940, 206662, 245136, 400634, 598701, 629434, 448039, 418773, 375183, 248913, 168826, 185691, 118219, 94097, 193529, 251080, 229206, 206477, 210021, 320136, 146292, 45917, 177465, 319459, 369122, 380662, 490286, 389256, 423469, 455209, 382556, 235482, 184986, 255709, 102215, 63694, 212790, 180473, 219467, 398986, 408575, 317335, 257447, 261511, 233467, 391665, 310069, 116068, -10169, 270374, 360482, 319204, 306731, 544776, 569037, 465604, 204226, 68998, 68422, 208636, 85629, -44811, 130120, 71429, 81555, 172828, 119367, 44032, -62697, -88185, -49006, 27910, 4023, 40144, 40501, 35772, 52446, 29061, 173991, 251956, 101467, 77905, 115176, 68934, 146141, 216644, 158564]
11508A58564q973K30783K29269J20204j99167n806N3411k64278k07320j10417
11498c730n5932K73652J19589j48365o6925j31471j05710k420L31746J84914j08293
11487B87055j47161j4433J11211J28847P8406k12458n5735k4875j51004R0071
11477H9924J30275N1273j17719j9769L2090n4111j92024N2883R9668o6154j11039
11466a04703J9067K4391N2473N6165P166K9813m7278p5429K8038J27310K064j52555
11454c3478j22706O732K7298j12588N1373J16273L07028J24137n4012j7044m9048
11443B43965n4079J22735n0640j78520j901p3324J51879j74648k2291J59225J2043
11432A34444j12643k158M9182N7811k4491n793j58257o6787M864j16700J53642
$$ y = [158564, 149591, 380374, 609643, 729847, 530680, 524874, 578285, 314007, 106687, -3730, -59662, 213990, 333579, 185214, 118289, -13182, -118892, -121312, 210434, 395348, 287055, 139894, 125461, 236672, 365519, 443925, 231467, 175732, 150857, -147, 89924, 220199, 271472, 153753, 133984, 166074, 111963, -80061, -27178, 72490, 6336, -104703, -85636, -61245, -8772, 47393, 54559, 84372, 37094, -38335, -10297, 117013, 119077, -33478, -156184, -149452, -122154, -234742, -183369, -67096, 239932, 364069, 310057, 293013, 243965, 189886, 312621, 261981, 83461, 81560, 8236, 160115, -14533, -36824, 122401, 134444, 21801, 19643, 68825, 126636, 102145, 96352, -61905, -128692, -123828, -240528, -86886]
11421h6886O9589Q652N9892J37022J7876j37792L1293M7795j16760o976M6808
11410G0513Q9364j2950p4741n7036J05020O7896p9568K5710j3747O6158J26706
11399C13325J24997j02299j05957L5883Q7649K093r1375O5j8731j81207j09581
11388d5138Q7745O944j15682l5845k0320J07859M9816m3133m0490l9044O0182
11377b7106N5092N15m4444O3479J46975j19096k11367j24069J29585q208k438
11366a41082O6128L1950q3963j17002j636J04776J92171N313K443k9968j5362
11355A3768o96n3234k3760m3492K3834O5445j81006J09689J91255J66521J8847
11344B87171r0102l8963j51981j12877N7848R4050J12596m6157j08809m2834R7151
$$ y = [-86886, -17297, -8645, 51247, 188269, 206145, 68353, 99646, 147441, 30681, 23705, 70513, 159877, 146927, 72186, 15150, 120170, 188066, 108498, 134208, 120461, 186619, 313325, 438322, 336023, 230066, 265949, 353598, 355691, 264316, 264381, 245650, 64443, -45138, 42607, 49551, -66131, -101976, -122296, -14437, 35379, -7754, -48244, -87288, -27106, 27986, 28501, -15943, 47536, 194511, 75415, -135952, -260021, -130436, -138644, -141082, -74954, -43004, -126967, -243969, -245605, -140829, 51342, 56655, 59098, 29130, 13768, 13072, -40162, -63922, -107414, -83580, -18135, -199141, -89452, 101803, 268324, 287171, 197069, 158106, 6125, -106752, -48904, 45146, 157742, 111585, 2776, -40058, 57093]
11333E7093N7065j85733M3749J63283Q0055Q1904r9262j23118K1312O8216m3169
11322A21395Q4386M6222N4408j18766p9769j24825P4273M2038l9700J4471q0331
11311f198j04306K2574Q6039N6685k8134P653o8148N5059J7673j0041K2259Q1007
11299A32122O4807L2186j07887j68096r4770l5238M8240N2806K01552R3873j9901
11288A99694q4019k3888R9290M1086m917L718j03615j54854j04183q8606L0312
11277a89982K36022l4077j44196j90277P3142J09696R0019K7562j8548j90K6734
11266a4095o9740n5153N1831Q6933r5406J1583p8364l7737n7659n7453O0942J99779
11254e4539O2502n5611p4433K7469o1742l284J41451K06652P6788K4758j7298
$$ y = [57093, 114158, -71575, -27826, 135457, 215512, 297416, 198154, 75036, 96348, 164564, 121395, 205781, 252003, 306411, 187645, 107876, -16949, 57324, 99362, 59662, 74133, -6198, -110504, -87930, -1891, 54794, 26660, 34313, -33835, 21224, 38897, 28856, 51115, 132122, 196929, 229115, 121228, -46868, -141638, -176876, -128636, -75830, 125722, 219595, 199694, 115675, 91787, 191077, 232163, 227246, 230964, 127349, -27505, -131688, -220294, -189982, 46040, 11963, -132233, -322510, -249368, -139672, -49653, -22091, -40639, -40829, -14095, -83835, -138988, -87157, -224, -95630, -84047, -162411, -200148, -257807, -315260, -254318, -54539, 7963, -47648, -122081, -94612, -156354, -159638, -18187, 188465, 265253, 290011, 272713]
11243B72713M5274N8512J3282j10223m0800J35655J8369p5136r2153k95376k22806
11232b92689N4855K79247J08498j95022j32151P7327k5510k31421n0849K16747
11222a90968J40821J2063J00813R5274N2247o8316m2451r2920J08230O5908O6664
11211B47365N0216K2520J02098j34493l46695k60209J9920R4370R5218J25053
11201A5363j16084J7447J22230K72256J40310P5873k24969k03655k3430j12179
11191c6838R6723j2623j57077j00275L9278J51473K12652K05331L6068j96728
11181B37984j32087p9400M9969L3283J35825K30473n1681m8916j9686K5826n6779
11170C24811l04816j62391R4417P9852R0951R1400j17851o0526L1063J45830J0271
$$ y = [272713, 317987, 376499, 389781, 279558, 238758, 374413, 392782, 317646, 225493, -69883, -292689, -237834, 41413, 149911, -45111, -177262, -99935, -125445, -356866, -407715, -190968, -50147, -38084, 62729, 158003, 210250, 141934, 99483, 6563, 114793, 180701, 247365, 297581, 320101, 422199, 287706, -58989, -319198, -299278, -204908, -109690, 15363, -100721, -83274, 38956, 311212, 451522, 527395, 302426, 98771, 75341, -36838, 59885, 47262, -109815, -210090, -170812, -19339, 193313, 398644, 434712, 237984, 105897, 26497, 76466, 109749, 245574, 476047, 424366, 375450, 355764, 381590, 324811, 19995, -142396, -47979, 31873, 122824, 214224, 96373, 35847, 66910, 212740, 223011]
11159B23011p7366j22678k7330J14491O3421k9473l6466J78430O5886k54011k27559
11148a29644K3882K47822J73628n4233k60702k1479J05914N7708p725n6702J09878
11137A88347N3820n1801q4051l2596j04788O2399k1128j03913J22326K1485K1880
11126G1980L2343J3229p7200P428o9999r4468Q1458J34772O1440J07362Q2416
11115C50761l7499r523m7350j0563o7450l6820J89612Q4759r6011j75504k55046
11104a10634L7334N166J75538N9007l9097m1714j15792q8593o8170m7451L3893
11093b00513L1626l904j30533j22035Q3102l6878J19210J73490n5814M0610J1234
11082i0405m0273L1837K7132O9335J27308J2185p0330j87148p5016l6776R9599
$$ y = [223011, 145645, 22967, -4363, 110128, 173549, 144076, 107610, 286040, 351926, 97915, -129644, -105762, 142060, 315688, 261455, 753, -20726, 85188, 142896, 135171, 78469, 188347, 242167, 190366, 106315, 73719, -31069, 31330, 10202, -93711, 28615, 50100, 71980, 104323, 117552, 40352, 47780, -22219, -116687, -35229, 99543, 160983, 268345, 350761, 313262, 303739, 256389, 245826, 178376, 141556, 331168, 415927, 319916, 144412, -110634, -73300, -68134, 107404, 166411, 127314, 85600, -30192, -118785, -186955, -234406, -200513, -168887, -172791, -303324, -425359, -342257, -379135, -259925, -86435, -142249, -101639, -90405, -130678, -98841, -71709, -2374, 124934, 137119, 66789, -120359, -195375, -232151, -132552]
11071a32552K01298Q9411j16493k60082K1840J40370J90821j48872j47162Q8291
11061g3130R5804R8389p1317r2451L9567N7557k2942l0505j16124o8350J36864
11050d6638K3242l7745R8419j58261o7954J22614J76376K6454j4326j13491j7747
11039i057l3827j70143K5076o5326p1950J65047J54216o810l3589J17654Q3513
11028A54804k9844n1094j07918k25378Q9156J86891J46146k9434n7897q6321J25974
11017A15085J58909j84138j74008j02681l457J67645J18555o8940j13859J42489
11007E5600Q9732k61711m9532O547j30843Q0812J21922J6667P4122j22584j05961
10996b25229K2808O5291R1609m7135N3351N7928J095q6311p0754R6886K28034
$$ y = [-132552, 68746, 158157, 41664, -218418, -196578, -56208, 134613, -14259, -161421, -73130, 22674, 121063, 49746, -42705, -3138, 54419, 31477, 972, -115152, -183502, -46638, -23396, -61141, 37278, -120983, -188937, -66323, 110053, 136507, 122181, 8690, -9057, -42884, -213027, -187951, -253277, -325227, -160180, -5964, -12774, -46363, 71291, 154804, 124960, 73866, -34052, -259430, -170274, 16617, 162763, 133329, 75432, -10889, 115085, 273994, 89856, -84152, -186833, -190290, -22645, 95910, 26970, -86889, 55600, 145332, -116379, -165911, -159364, -290207, -209395, -87473, -70806, 3316, -119268, -225229, -202421, -137130, -45521, -92656, -39305, 18623, 19718, -66593, -137347, -40461, 187573]
10985A87573J81914R3608j58089j86963N4261M7669N0901M5617N644r5934k2609
10974B03592l9838q4919q0726J06364N7245K6919k59302k06171J00255R9798L2756
10963d4027L7622m2225J01337J516j47547j37182P4964L3982R7563K7916J69902
10952A73821J21665k23224j27849j4535n9777O655l1381J44175K08087j22208
10942G5429r0469R5992M0199j5523O0901J7304L0904p8304K1223L2999m9242L0340
10930A71753o0499J73658J13734j61989q0812o5133j28021J05743K6623Q9350
10920A84407L1098q6940q3695l6728N2314K724j46439m3782n0674m1806m9558
10909b69079n3590J66757O896O5595n09m8183K01626P0934k45913l5539m7990
$$ y = [187573, 369487, 463095, 305006, 118043, 172304, 219973, 270874, 316491, 322135, 226201, 203592, 163754, 78835, -1891, 104473, 161718, 188637, -70665, -276836, -176581, -76783, -44027, -6405, -48630, 52707, 54223, -93324, -230506, -155542, -121560, -23997, 3919, 173821, 295486, 72262, -55587, -70122, -129899, -123244, -154625, -10450, 197637, 75429, -15040, 80952, 121151, 105628, 166529, 183833, 214737, 136433, 157656, 190655, 141413, 171753, 111254, 284912, 398646, 236657, 155845, 90712, -37309, 68434, 95057, 184407, 215505, 128565, 44870, 8142, 60456, 63180, -83259, -127041, -177715, -219521, -269079, -322669, -155912, -149016, -83421, -83930, -132113, 69513, 140447, -105466, -141005, -188995]
10898a88995j00045J2063R0562J96315J12204k3332j32437k3891J01948K7836
10888G2228k5678L4887r3995o6795L538K13167j24968k5313Q1878K2687m4223
10877D7413j06775n5074J63718R5393J8635J65830j26688l13722n4903K3714K2906
10866a19553K0431N677j60981N6525J02156J69641j35624k31228J7304k6159j4307
10855c16118l4748n0192L4304j12706J63456K11244j02507n8132N8570M2082J05985
10844e8762K8697o2987m2125m9509q8063j59385Q2836O6241M5569r626P3720l4138
10832b07532J7824P610J09746J71570O7837k8725k95478r4850Q8282J56096K3638
10821A6018j56773J2758N9495k4562P6892j0851J74048q9827J5151J8266q8586
$$ y = [-188995, -289040, -276977, -186415, 9900, 122104, 98772, -33665, -57556, 44392, 72228, 46550, 81437, -12558, -79353, -75815, 137352, 12384, -12929, 68949, 91636, 47413, -59362, -114436, 49282, 144675, 163310, 329140, 202452, -111270, -166173, -142459, -119553, -99122, -93445, -254426, -197901, -95745, 73896, -61728, -292956, -275652, -301811, -316118, -350866, -401058, -366754, -479460, -316004, -104760, -207267, -265399, -206829, -164747, -58762, -30065, -93052, -135177, -184686, -272749, -432134, -349298, -283057, -237488, -247114, -173394, -207532, -189708, -182098, -72352, 99218, 167055, 138330, -157148, -251998, -163716, -7620, 16018, -140755, -127997, -68502, -93064, -16172, -27023, 147025, 57198, 72349, 90615, 2029]
10810B029K651m2448j92388L5619P8927J07391Q2991n5994K3606o0542k53417
10799b71575K367J50166J36365P2058K2553K1555o3731j55078J3373Q1122n3013
10788d3838j44797J0O5311p0898k860K10532J3738j68098p6326N413J29584L9133
10776d3096k5429o1976r8700R1778K47486P3321m6449l7697L3800l8587j0656
10765H3795J40814L8886l0639j33128Q9368M5273k03803l05485N0593K92194j11687
10754d3819n7535L5386J0640n1077j43641q0014j7458J29693J77188O3661Q0054
10743A03078n0o9946L791M8595J5190l3701P4935J7636o6020J0924L4226M0840
10731A79498j02563n1383Q865J35664j38196j27796o830p3093J12722O5991K2316
$$ y = [2029, 4680, -37768, -230156, -194537, -115610, -8219, 74772, 18778, 42384, -18158, -271575, -269208, -119042, 17323, 89381, 111934, 133489, 69758, -85320, -71947, 9175, -43838, -188635, -188625, -123314, -194212, -197072, 13460, 27198, -140900, -217226, -211813, -82229, -43096, -68525, -130501, -229201, -137423, 110063, 183384, 136935, 99238, 133038, 94451, 83795, 224609, 263495, 232856, 99728, 189096, 234369, 30566, -274919, -224326, 67868, -43819, -101354, -65968, -55328, -106405, -250046, -330060, -347518, -217825, -40637, 23024, 103078, 103028, 33082, 36873, 85468, 100658, 66957, 141892, 159528, 93508, 104432, 138658, 179498, 76935, 25552, 34417, 170081, 31885, -95911, -102741, -175834, -63112, 2879, 25195]
10720B5195J3973L9327O8671L8081j41126l8712O7687l1686l8497P784J19665
10709A30362l3691J15990m7106j39913L1479N27J35400J35717j7531j4974o7161
10698B29099L410l7912N4271n9671k08426k8783q7070P0469P2606J3684k05761
10687a84084j99672K1280K53224N5847m1158j8666N6029K04777R2911j73068j54364
10676h6944j0496R6481l3024q643J26914k2038j26470J12666M1634J9701k8094
10665H1687n0645P6317j0759j41990j16421p6132J28808J34293o6471L1105P8793
10654F8585j13308o6989J07339L9245o4564l6811k9935r4891N4686o3818j69471
10643c69932J70553J68797j32814j56567n3631l909J07936O2237P0391J39980
$$ y = [25195, 39168, 78495, 147166, 185247, 44121, 5409, 73096, 41410, 2913, 10697, 130362, 96671, 212661, 165555, 25642, 57121, 57648, 193048, 328765, 311234, 296260, 229099, 232509, 194597, 248868, 189197, -19229, -48012, -135082, -64613, 7993, 21677, -184084, -383756, -362476, -109252, -53405, -94563, -113229, -57200, 147577, 240488, 67420, -86944, -97440, -959, -33983, -42626, 84288, 62250, -64220, 48446, 90080, 109781, 81687, 31042, 107359, 96600, -45390, -161811, -237943, -109135, 25158, -41313, -10208, 68585, -44723, -111712, -4373, 34872, -29692, -66503, -96438, -191329, -136643, -200461, -369932, -199379, -30582, -163396, -319963, -373594, -377503, -269567, -207330, -136939, 3041]
10633C041L7253J52717J07834P8360q282K6686j69381j05548q3366m6215K0954
10622A4053K9177P9460O9644K3649j28607J5892j28749j18712k8408J4782J44863
10611a2956N7682k678q2796n1292j43558K72363K19072j52560j05526L8971N9385
10600I6107M8834R8236Q2145J67736j10838k01666r0894j02464p26J9845J36995
10589A43310R3531m5791p0539j1401r7582n8514r8494K7133J27312J38513m0850
10578A06628n3031k0198o2128M3920j25849N2916J79603j5900j836m2729j36581
10567g5185o953Q1306Q3384L270K3966M1940N0614J07085m7199q8520L0122J18368
10555C22198j72254j06230m1782n8250j21032l8279J05936l8323j38035p2123
$$ y = [3041, 40294, 193011, 300845, 379205, 370923, 397609, 228228, 122680, 39314, -6901, 14053, 43230, 122690, 192334, 215983, 87376, 103268, -25481, -144193, -172601, -157819, -12956, 44726, 42048, -40748, -92040, -235598, 36765, 255837, 103277, -2249, 36722, 96107, 144941, 243177, 325322, 493058, 382220, 180554, 89660, -12804, -13530, 6315, 143310, 236841, 191050, 120511, 109110, 11528, -46986, -145480, -118347, 8965, 147478, 106628, 53597, 33399, -28729, 15191, -110658, -57742, 121861, 105961, 104125, 61396, -75185, -82138, -832, 82552, 85822, 109788, 151728, 202342, 309427, 262228, 173708, 203830, 322198, 149944, 43714, 1932, -56318, -177350, -215629, -109693, -148016, -286051, -358174]
10545c58174P1355L2723n466L7318J27215J15723L5539j23808j16016N414O3772
10534a14405L8318J61657K41480m0207n7210j31103m2575O0468M8263k0803q6573
10523E7310o5502Q1633P3693M8503n0275j52701k3768K95633M8888j40053M4762
10512B18123N0084m3014n8062r3912Q6535K590P9149q8242k03653k11117N1445
10501b10074K23970M1609k486r0510o2121j12083l8053L72054K19267k49686k05025
10490a13138m8222N580K26983j5862n8431j62858r1665q7869J11070M3672j6935
10479b07675J73398j30908j40930N3493J32295K0909Q5774N102j65397j83839
10469c57778r105j1845L2721M4080R7931J17643K22733P6918j88680j9406J16701
$$ y = [-358174, -286819, -254096, -259562, -222244, -95029, 20694, 56233, -67575, -183591, -178177, -114405, -76087, 85570, 327050, 286843, 229633, 98530, 55955, 116423, 164686, 143883, 57310, -8192, 73441, 147134, 195637, 145362, -7339, -31107, 264526, 313414, 173361, 218123, 268207, 225193, 167131, 73219, 159754, 162344, 241493, 153251, -50402, -261519, -210074, 13896, 55505, 53019, -37491, -99612, -211695, -249748, 122306, 341573, 91887, -113138, -161360, -155780, 71203, 55341, -3090, -165948, -257613, -345482, -234412, -190740, -207675, -34277, -165185, -306115, -252622, -120327, -99418, -13644, -8542, -173939, -357778, -366883, -378728, -346007, -301927, -203996, -86353, 136380, 213298, 24618, 5212, 121913]
10458A21913j04443o339K12828K05121j61322j71005K0764J24490o5644j62608
10448A3755J65581L5541l3677k99595j06675o5711j2572P2088j9805Q5029J36806
10437b9235P6715O1718o4754O1293J82066m6710j43369O2460q1994j16745j03877
10426a42432k3636J61037J64242N8720m8454P95m0827r5831o9095L7694R7745
10415I9958J24184r6552j03935O339k0546N4953M2429r8279O2450P9165r5877
10404E4289o3935o1932O1486J75700K5476j84872R2879K50382j5601j79049L356
10393A58179j97047j73949K1883J7245K7814L074n0225p7808R5954J43023J40124
10382A08267l6647O6681J19000l3306P3818r3904j55755K0191R3648J2329j10252
$$ y = [121913, 17470, 11131, 223959, 429080, 267758, 96753, 117517, 242007, 176363, 13755, 179336, 214877, 181200, -118395, -225070, -290781, -303353, -231265, -251070, -166041, -29235, 47480, 109198, 44444, 105737, 287803, 241093, 97724, 160184, 78190, -38555, -142432, -166068, -5031, 159211, 217931, 169477, 170272, 129445, 33614, -35481, 2213, 99958, 224142, 127590, 23655, 29994, 9448, 64401, 106830, 8551, 71001, 150166, 54289, -9646, -71578, -10092, 165608, 191084, 6212, 99091, 349473, 333872, 154823, 158179, -38868, -212817, -190934, -173689, -145875, -142801, -193026, -270834, -174880, -31857, 108267, 71620, 138301, 257301, 223995, 297813, 203909, 48154, 68345, 161993, 174322, 64070]
10371F4070j59424R5872L8341J16291j15248k10197l8794L2419J17049O2986l7057
10360c3692r352j31867o1956k5516N5933O6524M6236k0714p5554o5759Q709P3365
10348a73643K14261J42256l792r2414j3150N4848j08618j90741Q9273j6499j40466
10337b38685m1762J57739J11048m4445k0876J09588n1765O3190o1781r2973R3453
10326a7269P5910l3950N0528J78959l2114k23778q4527j05228J41377J16811N6951
10315A23670l9154j12009L4552p6565o870m1796L4729J00871P6218n8776p4681
10304c9811q9304l5884l8382J39486P5028j25478M110J17707J89213J93859J38352
10293E28896k098j23551k62035j47405J3703O2311J19092l9486r8193J38998O1916
$$ y = [64070, -95354, 518, 38859, 155150, 39902, -170295, -209089, -176670, -59621, 3365, -33692, -43044, -174911, -236867, -262383, -206450, -139926, -93690, -114404, -189958, -255717, -247008, -173643, 40618, 182874, 179082, 86668, 73518, 128366, 19748, -170993, -81720, -98219, -238685, -280447, -122708, -11660, -56105, -76981, 32607, -19158, 44032, -17749, -110722, -17269, 58641, 24691, 75219, 254178, 222064, -1714, -86241, -191469, -50092, 66719, 123670, 84516, -27493, 7059, -69506, -76376, -118172, -83443, 17428, 93646, 34870, -39811, -129115, -164999, -203381, -63895, 11133, -114345, -110235, 7472, 196685, 390544, 528896, 526798, 403247, 141212, -6193, 7510, 69821, 188913, 149427, 51234, 190232, 252148]
10282B52148L909j02253j38502Q3270R3112L8882k897l7817L989M10862M56978
10271A061681L75006K33624R4984N6372n5744j97496j29116K09407N51597Q42755
10261C043070J297114J681014J739541K135874K045363J427778P10217J50605
10253A4230576l13246o58101j290431j381907j790703j585992j217668q75963
10245E116565p21755k18839K3521N592k27442o04513q73242m93089m47808l36236
10235A222754M4707J52974j47766m7897K15145M17317M13188O3707m61067m20852
10225A452210l65550k19009p1330o1353k96026k07092P7450o783J42192J97935
10215F42644K00294J84976k3999j21320j47185k19659j13677q8869j36146j07813
$$ y = [252148, 256057, 153804, 15302, 98572, 191684, 230566, 227669, 189852, 193841, 604703, 1061681, 1436687, 1670311, 1765295, 1821667, 1765923, 1568427, 1439311, 1648718, 2200315, 3043070, 4340184, 6021198, 7760739, 9896613, 11941976, 13369754, 14079971, 14230576, 13917330, 13259229, 11968798, 10586891, 8796188, 7210196, 5992528, 5116565, 4394810, 4175971, 4199492, 4205084, 3977642, 3373129, 2499887, 2006798, 1558990, 1222754, 1267461, 1420435, 1272669, 1224772, 1439917, 1857234, 2270422, 2334129, 1873062, 1452210, 1086660, 867651, 796321, 734968, 438942, 231850, 309300, 302517, 444709, 642644, 842938, 1027914, 1003915, 882595, 735410, 515751, 402074, 313205, 177059, 69246]
10205F9246L7659J17067j10351K854N6140o111K53004L8340k24546r0322j40750
10194B230J05939K24061k49029j68896N5574J93294k0830K0036p9414p5494J27713
10183A35184P5763l8036k7601j84792K6874J71736j40202j08929k6838M226k0456
10172a33071J65195J59262j12569j65251j15844J4783k5432j02572L2317J01329
10162a81853K9815J17629O8863J86741K6314L9720J2175J77362j97535j30624
10152A48607j87L6637r1280j5914m0253p2047O5840J09805m2835M105O1051j9803
10140A43726j57720L7502J65139N2773o1249k4181p0975n349j16128j71715J8808
10129a89369J03842R5909K08314Q485j35821K7816J38883K4448o2424p7657m8531
$$ y = [69246, 106905, 223972, 113621, 116475, 172615, 166504, 419508, 457848, 233302, 142980, 2230, 108169, 332230, 83201, -85695, -30121, 163173, 142343, 162379, 82965, 7471, 135184, 210947, 172911, 145310, -39482, -12608, 159128, 18926, -90003, -116841, -112615, -133071, 32124, 191386, 78817, -86434, -202278, -187495, -212927, -315499, -283182, -181853, -152038, -34409, 34454, 221195, 247509, 287229, 299404, 476766, 279231, 148607, 148420, 185057, 93777, 77863, 37610, -34437, 31403, 141208, 98373, 102478, 163529, 143726, -13994, 23508, 188647, 241420, 180171, 155990, 85015, 79666, -36462, -208177, -189369, -85527, 10382, 218696, 227181, 91360, 119176, 258059, 282507, 220083, 142426, 93895]
10118I3895j93446j88134j0002J03851J50929J80580J43391J5652j05416N3051
10108B44351K12294N7349j35468j40296n4205J15384K11853K18121j54019k38323
10098C37041j59886j24171Q8640J14852j54936j61299n5325k3139J47165K73553
10088B82495p2799p6299J35957k1720j8251l6236l8384l6687M024R6924m6509
10077A72515n7142j80615j10171N8443J12206N6839j53617j78115J09839j687
10067a71505k4358K73241K06592M8002l176m3088r0148j42141j0877L2973j49371
10056g3856l5525l3275j32878j515K54460K70027K02465k8439o1456j90008q9549
10045H0451j4336n4793O0060L2365K81481J08273l9468p488j17307J30684K3503
$$ y = [93895, -99551, -287685, -297687, -193836, -42907, 137673, 281064, 296716, 191300, 244351, 456645, 513994, 378526, 238230, 184025, 299409, 511262, 729383, 575364, 337041, 177155, 52984, 141624, 256476, 101540, -59759, -115084, -138223, 8942, 282495, 209696, 133397, 269354, 247634, 229383, 193147, 154763, 118076, 122100, 219024, 172515, 115373, -65242, -175413, -116970, -4764, 52075, -101542, -279657, -169818, -171505, -195863, 77378, 283970, 331972, 328796, 285708, 195560, 53419, 42542, 75515, -73856, -109381, -142656, -275534, -277049, -22589, 247438, 449903, 421464, 360008, 170000, 80451, 66115, 11322, 71382, 103747, 385228, 493501, 454033, 446545, 329238, 459922, 483425]
10034D83425J2751O914j45861o2756O7529m3552p7587P9951P8260J5468L4868
10023D49410j7605j25317R0969J13763o0907k11913k02996j6262j0237o7197J94413
10012A36121Q9361P4820j59188j77262J66882o969p9184M2122K13109J02281L3170
10001D35263p8975k9459M5357M617J81096P1396j98985j06217M1232J06265M0461
9990E12051J9449j757O4008j24089n7734P5324N4979K5460j7274j70092k005M8168
9978D26488j6632j1898r2579J02054Q3217J1072q3509K0082o2530j12018N9940
9967C23687J03701M3982J72505q2684j08652j34617R3991R3876M2522R398q5707
9956D72002l36k7636j11792k0361k1167o2456l7469P7520J26273J68166p5385
$$ y = [483425, 496176, 503090, 357229, 294473, 362002, 318450, 240863, 320814, 399074, 414542, 449410, 431805, 306488, 397457, 511220, 450313, 238400, 35404, 19142, 8905, -58292, 136121, 225482, 300302, 141114, -36148, 130734, 123765, 44581, 86703, 299812, 402093, 435263, 356288, 326829, 372186, 376803, 557899, 629295, 430310, 324093, 365325, 471590, 512051, 531500, 529743, 593751, 469662, 411928, 487252, 542231, 567691, 550417, 380325, 378320, 426488, 409856, 397958, 305379, 407433, 490650, 501722, 418213, 438295, 375765, 263747, 323687, 427388, 471370, 643875, 561191, 452539, 317922, 411913, 505789, 548311, 557709, 472002, 471666, 444030, 332238, 311877, 290710, 228254, 190785, 268305, 394578, 562744, 487359]
9945D87359j22971J29533J29080l2336M8334k14026p4070p6197m0560K80855J10729
9934F25730Q306k5607J36256Q6817P0684r2468o2063p8353j767k15903P0992P6450
9922E99074p0780Q4253P9748J12245o7058Q4140J81259p796j09414k1025J53926
9911A018572J32564L17759K96506K37367K87803M50929K89076M72497P11426O89951
9901D904450N43271M75531M32203J56878k89936l97104k37331P6995N78076R21639
9891G164672J251717J271265J542407K050649K173670J052039k19475p91037q1439
9882A5414468J272577L095232N542685Q939654J4459518K4556402L8858271M4062294
9874A56201101K3441493q582696k9880120l5321687k7296429j6003775o805335
$$ y = [487359, 364388, 493921, 623001, 590665, 638999, 424973, 350903, 274706, 234146, 515001, 625730, 634036, 608429, 744685, 831502, 902186, 809718, 747655, 669302, 667535, 451632, 522624, 599074, 528294, 612547, 692295, 804540, 737482, 821622, 1002881, 995085, 885671, 864646, 1018572, 1151136, 1468895, 1765401, 2002768, 2290571, 2741500, 3030576, 3503073, 4214499, 4904450, 5447721, 5923252, 6355455, 6512333, 6222397, 5825293, 5587962, 5664957, 6243033, 7164672, 8416389, 9687654, 11230061, 13280710, 15454380, 16506419, 16286944, 15495907, 15414468, 16687045, 19782277, 25324962, 34264616, 48724134, 73280536, 112138807, 156201101, 179642594, 171059898, 141179778, 105858091, 78561662, 62557887, 55752552]
9867E5752552J30505O524296J4361069K6678222M8052875P7629934Q6506104M0566391
9859C56201948k5083712o4713125p2160158n3977053l0812677j4446475l305182
9852I1703566O811913J9070729L8277273P1207241J13773605J22207005N0229456
9845E13280788m5502480r9687148j07041460p8858038m6722594k5380116j2218703
9838I7870249k371697Q379876K2813253M5785084P4644385P8988438K8349774
9831C54459362l5514682o9887125p2782088n2389309l0890490j7630834r547881
9824F5816953l531226K361531J0145186K1713154L5850694L6572811J1135744
9817A80064847j9585278l5672741l6343275k6561522j6238848r871427o626061
$$ y = [55752552, 55883057, 62407353, 76768422, 103446644, 151499519, 229129453, 315635557, 356201948, 331118236, 266405111, 194244953, 140267900, 109455223, 95008748, 91703566, 98515479, 117586208, 155863481, 227070722, 340844327, 463051332, 513280788, 467778308, 368091160, 261049700, 182191662, 135469068, 110088952, 97870249, 95498552, 103878428, 126691681, 172476765, 247121150, 326109588, 354459362, 318944680, 249057555, 176275467, 123886158, 92995668, 75364834, 65816953, 62285727, 64647258, 74792444, 96505598, 132356292, 168929103, 180064847, 160479569, 124806828, 88463553, 61902031, 45663183, 35791756, 29165695]
9810B9165695m753897l611056k878374k252840j778451j195056r52243r31974
9802A0811804p64168n47863o00160l98587k50196l92251n38889m93582o14312
9793F211796m08831l84486l43634l17110l29348l48045k58701R140L5128j3668
9783C852241k57500k75589k33237r2299j0323k16308j79778j23918J6819j53857
9773B326251k26747o1721R1505k8732k66105k0547Q4550l2561m1964o1148j88461
9762A574320r2529m2673k4300p4050j6740M0505m7530L1701j74399j31776O7850
9751A110379K6960J67427n2798m8692k24295j41928O9834N3851M5281k13522J87401
9740I79898J60679L9606r3097r3522J06026J66874q36q9743j55770j00165J69490
$$ y = [29165695, 24411798, 20800742, 17922368, 15669528, 13891077, 12696021, 11743778, 10811804, 10047636, 9499773, 8899613, 8501026, 8250830, 7858579, 7319690, 6826108, 6211796, 5802965, 5418479, 5074845, 4757735, 4428387, 4080342, 3821641, 3830781, 3865909, 3852241, 3594741, 3319152, 3085915, 2993616, 2983293, 2766985, 2587207, 2463289, 2480108, 2326251, 2099504, 2037783, 2129288, 2100556, 1834451, 1813904, 1898454, 1865893, 1823929, 1762781, 1574320, 1481791, 1439118, 1414818, 1340768, 1324028, 1364533, 1317003, 1348704, 1174305, 1042529, 1110379, 1137339, 1304766, 1251968, 1203276, 978981, 837053, 906887, 960738, 1006019, 792497, 979898, 1140577, 1180183, 1087086, 993564, 1099590, 1266464, 1265628, 1175885, 1020115, 919950, 1089440]
9729A089440J3902j34467J05083L1092J04135o520m9955q0199J3760K9092m6792
9718A068571l8306j56519P971o4163m8836K043R7626J18115j26056j83109j9948
9707F57389O3256K87469R5472r108p8072j72552k3171m0348j17068J4276k47852
9696D29691K0410J17918K3225O3856k3292j0563K4454Q3365j51759l8270j17154
9685D21881j26410L9974N0879n4563K2395J91227m1963n126l3209K1915P3584
9674E60584L7428m7253p5321j23764o0363O9452j04519j11889Q752J25149J7547
9663B95803J6762j08510j6647J33450M6410O1606l4939O5945j9466j02504N2735
9652C90645j3401r0291O1617p1761N4687R1108j54880j83434Q4768n1649n6205
$$ y = [1089440, 1103342, 968875, 1073958, 1105050, 1209185, 1202665, 1152710, 1072511, 1086271, 1115363, 1068571, 1030265, 873746, 881717, 817554, 768718, 770761, 868387, 986502, 860446, 677337, 657389, 720645, 1008114, 1103586, 1094478, 1016406, 843854, 820683, 780335, 663267, 677543, 429691, 450101, 568019, 591244, 655100, 631808, 621245, 645699, 729064, 577305, 539035, 421881, 295471, 335445, 386324, 331761, 354156, 545383, 503420, 498294, 465085, 487000, 560584, 598012, 550759, 475438, 351674, 291311, 360763, 256244, 144355, 153107, 278256, 295803, 312565, 204055, 187408, 320858, 367268, 428874, 393935, 459880, 440414, 337910, 390645, 377244, 286953, 348570, 276809, 331496, 422604, 267724, 84290, 169058, 117409, 61204]
9641F1204q799J37374J04391l5163O1826Q0190O1084n8004j5343P432m5815j10981
9629B39396j03231l0441N8128P8477J20924l9579p1522o4871J15669J25060o1062
9618C66948L6331N3767J3994j20272L5431k5236J52718j1406j32308j03791M07
9607B66583q0586r866N7952j07805R841K8050J00823N0542l6494p4036p7105J35050
9595B62949P6616o4597k4232Q0428n2613p7241Q6266N1855j47314j519J18798
9584C09396l7983m3559J51207K5186L7679j914j97124o8641r8769p5964k7330
9573b7816J95812R6773k6728L9118m4244p8950P5727K35616r8241j29939R0058
9562C27186M5392j70393J1920K06025L9842q763J4082p9000r8588M7661J5776
$$ y = [61204, 52405, 189779, 294170, 259007, 320833, 401023, 462107, 404103, 388760, 396192, 350377, 239396, 136165, 105724, 163852, 242329, 363253, 323674, 252152, 187281, 302950, 428010, 366948, 403279, 457046, 471040, 350768, 386199, 360963, 513681, 502275, 369967, 266176, 266583, 185997, 176131, 234083, 126278, 136119, 164169, 264992, 315534, 279040, 205004, 127899, 262949, 339565, 274968, 250736, 331164, 278551, 201310, 287576, 339431, 192117, 190598, 309396, 271413, 227854, 379061, 404247, 441926, 440012, 242888, 174247, 75478, -486, -27816, 167996, 264769, 238041, 277159, 232915, 153965, 229692, 465308, 367067, 237128, 327186, 372578, 202185, 214105, 420130, 459972, 451209, 465291, 386291, 287703, 335364, 351140]
9551C51140j17196j50401N3771q9261j40863P1501R45r755P886J43347l2885j60409
9539g2180j1117R5891O8296k1463n4450P7605M3010j50114j29425j7438J67646
9528c739J94980J54227k4859j96547q4841Q2756N0824j03538o2034J6904J66247
9517A90380n5657p0681k76115j64527K3213K18697J8572J41150J23552o7820p5041
9506E723L5270n4299J39454R5650q119j17108l2290j08112k2465j44285J38037
9495g2544L23273N3582o7976j94099j45127K28421K03484J10420K4037k3936k39639
9484A99896M1591L0134j00207j34541J62564L8970n0141J785R1941J71076K99238
9473G52306K28772J05485l4016k76523j63256j93690m0205K1312n4892m0070K7148
$$ y = [351140, 233944, 83543, 137314, 48053, -92810, -21309, -20364, -30119, -22233, 121114, 88229, -72180, -83297, 12594, 80890, 59427, 4977, 82582, 125592, -24522, -153947, -171385, -3739, 191241, 345468, 320609, 124062, 39221, 121977, 172801, 69263, 7229, 24133, 190380, 134723, 64042, -212073, -376600, -353387, -134690, -116118, 25032, 148584, 80764, 5723, 40993, -13306, 126148, 221798, 213679, 96571, 64281, -43831, -66296, -210581, -72544, 250729, 304311, 236335, 42236, -102891, 125530, 329014, 439434, 463471, 439535, 199896, 241487, 271621, 171414, 36873, 199437, 238407, 188266, 190051, 281992, 453068, 752306, 981078, 1086563, 1052547, 776024, 612768, 419078, 378873, 400185, 345293, 305223, 332371]
9462C32371K50797L45899M79953O10995Q3459l33225m29830l92623k04069j37636
9452F06091m0102K0190R8851J72535K26937N07934P52116M90750j3406m14430
9442B407466m98336n90148l79687o8797l2280r9873Q9550m8523J02803M22080
9432A304255N20789L54335k04791n35646k26971j73778k79286j21578k34554j58143
9422B44632j9366J04386m21J48853L03545K34021n2801m23360j89919L1574q9053
9411B92091O6122R9596J27792j0608j62106r0417n0882k4010l4125j14480P782
9400A06755J40515R3097R4793j1799k0972q1925j75251O8806O1259j40596j11742
9389B2940k5396o9264m5669L2820N4977M854l8617J0864M7245N8778l510l671
$$ y = [332371, 583168, 929067, 1409020, 2020015, 2103474, 1770249, 1340419, 947796, 743727, 606091, 565989, 586179, 685030, 857565, 1084502, 1592436, 2344552, 2835302, 2821896, 2407466, 1909130, 1318982, 939295, 870498, 838218, 738345, 827895, 779372, 882175, 1304255, 1825044, 2179379, 1974588, 1438942, 1211971, 1038193, 758907, 637329, 402775, 244632, 225266, 329652, 329231, 478084, 781629, 1015650, 962849, 539489, 349570, 381144, 292091, 358213, 457809, 585601, 574993, 412887, 322470, 271588, 247578, 213453, 98973, 106755, 247270, 340367, 435160, 423361, 402389, 320464, 145213, 214019, 275278, 134682, 22940, -2456, -71720, -117389, -84569, -29592, -24738, -63355, -52491, -5246, 53532, 50022, 46351]
9377D6351R4525j75568j16066P0103J17463L1399m1614p4312j19726M009M0327
9366a23109J98076l5114m1000J05187J2519j42283j78218N0754J50700J97038
9356A94550k423j14529m0544P5076p03q5059N4838J47692n7237j44601p3738n8576
9344a05254N0471K1798o7113J302J14126J22175o6025k01235j29708K84333L21001
9333C45871m1399j42076m3561M5166J51005O4890j16054p3695p3460m5339J47367
9322B18715J39298J33819k7502M193j63648j41936j70776j95617k8802K20681
9312a1575P5993j79211k6575R977q931N100Q0748J15485k19590n2366M221M0233
9300a66491L4167j05282L1548J10061J29541O6977k37384l4525N9717l3938n7378
$$ y = [46351, 140876, -34692, -150758, -80655, 36808, 68207, 26593, -47719, -167445, -163436, -123109, 74967, 39853, -1147, 104040, 116559, -25724, -203942, -153188, -2488, 194550, 192127, 77598, 37054, 112130, 111427, 26368, 81206, 228898, 171661, 27060, -46678, -105254, -54783, -32985, -100098, -98796, 15330, 137505, 71480, -129755, -259463, 24870, 345871, 304472, 162396, 118835, 164001, 315006, 379896, 263842, 190147, 116687, 71348, 218715, 358013, 491832, 464330, 468523, 304875, 162939, -7837, -203454, -232256, -11575, 64418, -114793, -141368, -131391, -140322, -135222, -54474, 61011, -158579, -210945, -206724, -166491, -132324, -237606, -206058, -95997, 33544, 100521, -136863, -171388, -111671, -145609, -202987]
9289b02987J14280L2641O9731J0858P3634L0105j7690m3198K1339n4939j3930
9278A9844R7998O8773M3762j3270k28762J11723m4712P5004J34491k9213j38821
9267I6817l0896m5933M1328q7888k81147J78588J37254J330j03038J2069m353
9256h5869J2384J87419J15624q8745L4945N1110l7281q5282j32824j053N5491
9245B5919p7555n6895p951j1640R119j14100K8694K6119J11033J56340O3112Q466
9233A60661L8590k7497k56973J1914Q2576K72310j35722r8405j23638j16768M1562
9222a51390N749l5888J13014K884L854j1108p0012m4764J55506J48100m558o2771
9210D8616n0063J01865K1955J7671m1813q0097O1j8364J9617M4420n6662K7396
$$ y = [-202987, -88707, -56066, 13665, 24523, 98157, 128262, 110572, 67374, 88713, 33774, 19844, 117842, 186615, 230377, 217107, -11655, 100068, 55356, 130360, 264851, 235638, 96817, 65921, 19988, 61316, -26572, -307719, -129131, 8123, 9453, -93585, -81516, -85869, -73485, 113934, 229558, 140813, 175758, 226868, 189587, 104305, -28519, -29572, 25919, -51636, -108531, -116482, -128122, -119003, -233103, -204409, -178290, -67257, 89083, 152195, 160661, 199251, 171754, -85219, -73305, 9271, 281581, 145859, 47454, -76184, -192952, -151390, -145641, -181529, -68515, -65631, -61777, -72885, -142897, -187661, -32155, 115945, 111387, 48616, -1447, 100418, 122373, 140044, 98231, 18134, 18195, -169, 19448, 63868, 7206, 34602]
9198C4602M1152k2998M9616j4617l4701j6996K2548O4228k19304r7322j1636J3268
9186a92160N2338J14433P7782Q0613O5008J8030J927j20423n5272J3365l8313
9175A7328m5755k4688J19106Q1122k7279m2131j43147k0092P0097L7529O7831
9164H9921p7816k6748J10892L0953O0497k7528M1065j12032p4877j25874J03089
9153h458L845Q52j87238j90150L1659J78281J27864m2298p1087n9856R7657J13133
9141e796m4560J9637J12505J14580k39469r27q4913N967o5978M3077L6902o8675
9129a77650N0636O7466J80625O4429r7190j71760j07728M4016J08676L7233j51704
9118a52951L7024L4030Q3875K28831J22915P5611j14883j30607J363q8661j54778
$$ y = [34602, 75754, 52756, 102372, 87755, 53054, 36058, 58606, 122834, -96470, -193792, -205428, -192160, -139822, -25389, 52393, 133006, 198014, 216044, 217971, 97548, 42276, 55641, 17328, -28427, -53115, 65991, 147113, 119834, 77703, -65444, -85536, -15439, 22090, 89921, 12105, -14643, 96249, 127202, 187699, 160171, 201236, 89204, 14327, -111547, -8458, -4613, -3761, -190999, -381149, -349490, -171209, -43345, -85643, -156730, -216586, -118929, -5796, -50356, -30719, 81786, 196366, -43103, -44030, -128943, -122976, -188954, -145877, -108975, -177650, -127014, -59548, 121077, 185506, 88316, -83444, -191172, -147156, -38480, -1247, -152951, -115927, -81897, 1978, 230809, 353724, 429335, 314452, 183845, 185208, 96547, -58231]
9107e8231m7475K4378l5994j1802J70707l6702J34621M5966m9203o6414J4188
9096H4039J29193Q3511p8155m7378M6123k10238r7492j735Q6316J4103J02155
9085A10442l5834j28617l3740j0106O4942l0962k4278j23865m2204J46667M7637
9074e9918k7477m5136R2712M1799j35976j86345J22877K3728J24405J48245j10968
9063a2054O4975J05952o2187m0707J51528j04366j0442J12426K4157J0591p4356
9052A65517l333P3720r4913j64977k06837K4120M8692L2711J79324j47642m0225
9041a33843n7481L5838j6615o3284J60114J03N9714J12568r6719M3800J44513
9030A88708M3837o6468j18377m637J29015K4530j53578j39915L1967M0057k5242
$$ y = [-58231, -105706, -81328, -117322, -129124, 41583, 4881, 139502, 185468, 136265, 69851, 84039, 213232, 296743, 218588, 171210, 217333, 7095, -90397, -92132, -5816, 8287, 110442, 74608, -54009, -87749, -97855, -32913, -63875, -88153, -212018, -254222, -107555, -59918, -87395, -132531, -39819, 1980, -133996, -320341, -197464, -173736, -49331, 98914, -12054, 52921, 158873, 96686, 55979, 207507, 103141, 92699, 205125, 229282, 239873, 165517, 162184, 235904, 140991, -23986, -230823, -206703, -158011, -125300, 54024, -93618, -133843, -191324, -155486, -172101, -235385, -75271, -75168, -15454, 97114, 395, 44195, 188708, 232545, 166077, 47700, 43063, 172078, 196608, 43030, -96885, -64918, -24861, -50103]
9019e0103R228J51398R2245j46865j33080r3412K9584J37662N009J37931R6901
9008B36498N5530j96610k02690J17550P7819P27P4355j48120p5831j4966J7974
8997e7764K3949R3914p0391j48023l6346L7279l5412M8365J265K32596Q2214r509
8985A62137J25997L3219j0982r0913r6781M6410M4975k7503o7867K3999k4419
8974A18272k0065p63n5927J90026K3766j05344m8262K09060m1680K5535r227l9468
8962B45923J77356J40328N0980j85494l4381j87427k81927L9449J75474K04251
8952C44532L7339j1973n9606j17389k38753j10171j112j6315J31795K0679J59713
8941A38739J53159j63120j73331p655J47652P3052j54462p103j50417l5396j0168
$$ y = [-50103, -40875, 110523, 202768, 55903, -77177, -170589, -141005, -3343, 1666, 139597, 236498, 292028, 95418, -107272, 10278, 88097, 88824, 163179, 15059, -60772, -75738, -57764, -33815, 60099, -10292, -158315, -194661, -157382, -192794, -144429, -143164, 89432, 171646, 162137, 288134, 321353, 310371, 219458, 122677, 169087, 214062, 186559, 118692, 142691, 118272, 98207, 97444, 41517, 231543, 255309, 149965, 101703, 310763, 269083, 294618, 285391, 245923, 423279, 563607, 614587, 429093, 394712, 207285, -74642, -35193, 140281, 344532, 381871, 369898, 310292, 192903, -45850, -156021, -157133, -173448, -41653, -20974, 138739, 291898, 128778, -44553, -52208, 95444, 168496, 14034, 6931, -143486, -178882, -189050]
8930a89050q3339J41369M0776m6764J38241j656q6692r6662m2951n8770O3492
8919b22006m2549J26834J6430J18841n776m3341k7769K28116J28773l2052o5681
8908A79820j10627o0286p340l1430L4245l3185k7982L1617J32851K06147j98308
8897A15522j25586L1666K157k3955o7486k2975Q1177J9402n163P9365N9213k4359
8885A18978p915j6362J00413m93o0830n7974j42876N0888J22436j4383q893r0455
8873g466J836N1671n5842l4448N3843m4367l9179J22881J28523o4648m6243k44243
8861a77682J6336K09845P0875j5084n7397p3124K1246J40294L9389L5686j27260
8850H3124j6694K32261K4396O6867j85047j16736J32035k670l079k369o6086n7584
$$ y = [-189050, -272389, -131020, -90244, -137008, 1233, -423, -87115, -183777, -226728, -285498, -222006, -264555, -137721, -121291, -2450, -8226, -51567, -79336, 148780, 277553, 245501, 179820, 69193, 8907, 1567, -29863, 4382, -28803, -56785, -25168, 107683, 313830, 115522, -10064, 21602, 23759, -196, -67682, -90657, -9480, 9922, 4759, 84124, 143337, 118978, 111063, 94701, 195114, 194621, 133791, 75817, -67059, -16171, 106265, 91882, 82989, -7466, -5630, 46041, -9801, -44249, 9594, -34773, -73952, 48929, 177452, 112804, 66561, -177682, -161346, 48499, 119374, 104290, 46893, -26231, -4985, 135309, 174698, 210384, 83124, 66430, 298691, 323087, 389954, 204907, 88171, 220206, 217536, 214457, 212088, 146002, 88418]
8838H8418k2873m0300Q3860Q9959m1230j04322j7526L753J25474P5486L06R3414
8826C34419J77488J4367j78854j30805n1025l8486R564K4328Q7477l7158m8678
8815A62637j67492m7201j7429P0434J63699L8600k02509n9861J0628P8762j9917
8804A0351n1360o305P5427r7243Q9541J18191q4603K6136J19587j80499j11148
8793i1925P0305l25Q6202K16863J9602m2686P1361L7049j60119k9675J40549K6096
8781C43297j13340o8909M1876r568j79939m2759K4751M1346J04354L1148K2500
8770A94757j06683m2968N9336M4296j6347o2084n2588m2536j35316N8612K05089
8759A03568L3555J57488K6125J8862j7403j93107n9982Q294R6884R0489k0300
$$ y = [88418, 65545, 25245, 109105, 199064, 157834, 53512, 35986, 39739, 165213, 240699, 241005, 334419, 511907, 526274, 347420, 216615, 165590, 127104, 136668, 160996, 248473, 211315, 162637, -4855, -52056, -69485, 949, 164648, 203248, 739, -59122, -48494, 30268, 10351, -41009, -47314, 28113, -69130, 20411, 138602, 53999, 80135, 199722, 19223, -91925, -21620, -21945, 64257, 281120, 300722, 258036, 329397, 366446, 206327, 176652, 317201, 343297, 229957, 161048, 202924, 193356, 13417, -29342, -4591, 36755, 141109, 172257, 194757, 88074, 45106, 104442, 148738, 132391, 70307, 17719, -24817, -160133, -101521, 103568, 137123, 294611, 320736, 339598, 322195, 129088, 69106, 77400, 174284, 264773, 244473]
8748B44473j8110q996j08553J95860J75317k52569K8583k6291J381K12391M4191
8737D87677j20764k5191M2152j30547k07194q380j5464o8721L91O8993l6215n2503
8725f5766R0686L687p1542q5812M0212J32088Q4533l8432M6958m2304M9368N0785
8713A94461K4461J5342j7647k1052M3889q7675j3712O4824j04684J3519j22967
8702a1241k1134J1714l9470l4329J66824J38147k4011L213k2161j44086N9246
8691H2712l610k0746Q013n2176o696O8861K8334J20622J10565j24042q9329l7490
8679H5018p9823O4210l0578j7707r609l6447J09513J56424J6749j7897Q8425R6191
8667D24469q1673m6787j94409j17239M8200M5562j44009J8243L26198q8676j98382
$$ y = [244473, 226363, 217367, 108814, 304674, 479991, 227422, 256005, 229714, 231095, 443486, 487677, 366913, 341722, 383874, 253327, 46133, 37753, 22289, -46432, -46041, 22952, -13263, -65766, 24920, 28607, -42935, -128747, -88535, 43553, 128086, 89654, 136612, 94308, 143676, 194461, 218922, 234264, 216617, 195565, 239454, 151779, 138067, 202891, 98207, 111726, -11241, -32375, -20661, -60131, -94460, 72364, 210511, 186500, 189713, 167552, 23466, 82712, 79102, 58356, 66369, 14193, 7497, 76358, 104692, 225314, 335879, 211837, 122508, 85018, 5195, 69405, 38827, 21120, 11511, -24936, 84577, 241001, 257750, 239853, 328278, 424469, 342796, 296009, 101600, -15639, 32561, 78123, -65886, -47643, 278555, 189879, -8503]
8656h503m0253Q3424j04441P6946k1919j02538J84109J29107M2889O0035N4233
8645C53089Q9397P3039k7647p4517j65768l8449O0409M1043J734n1717n9072l3010
8633A68531J78052J47056K2188j29625k06542J30031J79843j18793j43506r9271
8623A27964j46070m7524J46110J66803J56228K27367J27614m7171q5762k1911
8613F03648k6610o4442k708p679J4152J39298m0803k68385p3897J78092k7724
8602D22942J06524p0266k67074j19195N1318J92J54840R1041J9303j34797L857
8591B58685Q8103K23793P3190j03432L9881m4610r7850o6396j70681J1561o4026
8580A48218m6363K8456J54032J78541n5268j30760m2244l5816j7549r3173j60481
$$ y = [-8503, -48756, 34668, -69773, 7173, -14746, -117284, 66825, 195932, 238821, 298856, 353089, 442486, 515525, 487878, 413361, 247593, 209144, 269553, 310596, 312330, 260613, 201541, 168531, 346583, 493639, 515827, 386202, 179660, 309691, 489534, 370741, 227235, 127964, -18106, -65630, 80480, 247283, 403511, 630878, 758492, 711321, 625559, 603648, 577038, 512596, 509888, 502209, 516361, 655659, 614856, 346471, 272574, 450666, 422942, 529466, 459200, 192126, 72931, 124249, 124441, 279281, 370322, 389625, 254828, 258685, 346788, 570581, 643771, 540339, 580220, 535610, 437760, 371364, 200683, 212244, 148218, 101855, 130311, 284343, 462884, 407616, 276856, 234612, 198796, 181247, 88074, -72407]
8569g2407P8766M8622J37234m8014q0331j23463O1344j10876j11155P0912M4843
8558a04525O2211m4675J7496O3837j04452r5574J87450J48312L9073j65286m2309
8547c8442J04922q4437N126J22491Q0727q5919m1061J00500m9526R5579j49572
8536F0388n4282J47684J49502P6996j10014j04631R5477n7168j9117r7467L6190
8525A23558J20613P31j32886j42290o8412P8073M3094J36810J22185O041j68557
8514A18960k4091J04697J39782J5564l27408k11331n0521M1327P7931J10365r768
8503a4493q6755m9891O2043J00455O4664l6160j28533j00021M8431K59441J35499
8492B54680r9660J16549O0730k41386l967J5809o5812M8885k6912j61823k0588
$$ y = [-72407, 6359, 54981, 192215, 144201, 63870, -59593, 1751, -109125, -220280, -149368, -104525, -42314, -86989, -69493, -5656, -110108, -205682, -18232, 130080, 169153, 3867, -38442, 66480, -17957, -12831, 109660, 190387, 104468, 63407, 163907, 114381, 209960, 60388, 6106, 153790, 303292, 380288, 270274, 165643, 261120, 203952, 184835, 87368, 123558, 244171, 244902, 112016, -30274, -98686, -20613, 22481, 159291, 281476, 287517, 118960, 94869, 199566, 339348, 354912, 27504, -183827, -234348, -193021, -115090, -4725, -14493, -101248, -151139, -89096, 11359, 76023, 39863, -88670, -188691, -140260, 119181, 254680, 155020, 271569, 332299, 90913, 86946, 102755, 36943, 85828, 58916, -102907, -123495]
8481a23495J67132J21717K9943r1452j15373j61965j13978M5565J7728K71282
8471D7104Q1803M0172o8675m9610j47879m4953n6950Q580N2667L6547Q699P7684
8459a4811j69182k1743L612j50894n7214L2234J50796K13028N7188j83911q9493
8448b30390J00877J45081O3761M5249O8655n4991j31345j46210j36344l8819N0509
8437b63967m2243R0576Q7588O8694O7440N2155o9464j1976J33123K71134P2214
8426D55274j63674j23393p7711j51354J34882Q552n9256R4113m2422N9696J50837
8415B85544J10857j29558k75738r3041J34720Q8656K62255N8235n8608o051J43504
8404E20775j77416j12429l1663m7947m391l5999j8053j11021N098m7749K5069
$$ y = [-123495, 43637, 165354, 195297, 103845, -11528, -173493, -287471, -241906, -224178, 47104, 128907, 169079, 100404, 50794, -97085, -142038, -198988, -190408, -137741, -101194, -92495, -14811, -183993, -205736, -202124, -353018, -410232, -377998, -227202, -14174, 43014, -140897, -230390, -129513, 15568, 79329, 124578, 193233, 138242, 6897, -139313, -275657, -314476, -263967, -306210, -215634, -128046, -59352, 8088, 60243, -9221, -21197, 111926, 383060, 455274, 291600, 168207, 90496, -60858, 74024, 82576, 23320, 117433, 75011, 134707, 285544, 396401, 266843, -8895, -101936, 32784, 121440, 383695, 441930, 383322, 377271, 520775, 343359, 230930, 199267, 151320, 146929, 110930, 92877, -18144, -13046, -60795, -35726]
8393c5726M0136J63731r3882m7323J17666J51351K6200r7137j62229j51638J1470
8382g7381l157n0127k4395K7427J34663J21925j35129j40344K8682J24892J37103
8371A44159N741k4124J9696j54089J79467J17997L3251J2762M3185j51465j41489
8360H5091p3933J16489M2899R962O076p7825o6692j26627r6318n9639l5030m2360
8348c17907J13098j6909K5098K1599P3898J25272Q7284j0555o0383j7500J1939
8337C4934M5069K0730N974n0279l8175L0207J64756J6593j5761r1316q9260J1252
8325D4724n7686O6475L6511j10550j72163j1627l6272j0558J33963P8093j4122
8314e3212N8116J7080m8313j36771n0931M5664J67620P5812J02344j15499l0177
$$ y = [-35726, 4410, 168141, 74259, 26936, 144602, 295953, 322153, 225016, 62787, -88851, -77381, -80538, -130665, -155060, -127633, 7030, 128955, -6174, -146518, -117836, 7056, 144159, 149900, 125776, 145472, -8617, 170850, 288847, 322098, 334860, 378045, 226580, 85091, 11158, 127647, 170546, 180508, 186584, 108759, 42067, -84560, -180878, -240517, -275547, -317907, -204809, -221718, -196620, -175021, -101123, 24149, 111433, 100878, 40495, 22995, 34934, 80003, 100733, 106707, 56428, 18253, 48460, 213216, 229809, 214048, 122732, 33472, 44724, -12962, 53513, 90024, -20526, -192689, -204316, -240588, -251146, -117183, -39090, -53212, 4904, 21984, -26329, -163100, -214031, -168367, -747, 75065, 177409, 61910, 31733]
8303C1733l9684j62729j64532j622J44373K05138J8155J2537O2466l935j70754
8292f8854J37030R6321j51978q632j60670j37701K9898K05910J49841J81900r6039
8281A77026j50038M510J02484K6031j97984K8787J24354j03240n580O2731N7649
8270A26730L4578k12687k0594J10558L8716j03750j69022j16142K16630Q7034
8260g949j03203j65737p8002J37417J58390o2749l0940m9286L9431J22596N0146
8249A0114l3584j30912Q7381J20662r7318J02528J81395J9032k59841N3886J24197
8238A77540j5752m1909m0194R7587R2963q4245r0873r0497p2632J33743J58945
8227B24676r8376j55987p9121m603J46440O6358j55894N043J0867K7603O9257
$$ y = [31733, -7951, -170680, -335212, -336834, -192461, 12677, 30832, 43369, 105835, 101900, -68854, 68176, 164497, 12519, 3887, -156783, -294484, -264586, -58676, 91165, 273065, 177026, 26988, 31498, 133982, 160013, -37971, -9184, 115170, 11930, 6350, 69081, 126730, 161308, -51379, -71973, 38585, 77301, -26449, -195471, -311613, -94983, -7949, -111152, -276889, -354891, -217474, -59084, -121833, -152773, -202059, -162628, -40032, 10114, -23470, -154382, -67001, 53661, -43657, 58871, 240266, 259298, -543, 53343, 177540, 161788, 119879, 79685, 177272, 270235, 185990, 95117, 4620, -68012, 65731, 224676, 126300, -29687, -108808, -113411, 33029, 99387, -56507, -51464, -40597, -12994, 56263]
8216E6263Q1224K6476l1224r3511p5459m1403M8301O161J5422p4720k4338J6842
8204h9966M3886N2927j09842L762l0638O5826j09713p9287P0374k568R7076N4970
8192c3193p153m3119K3378O0878K6655o7965j61131j2845J08956n4407j1934J92301
8180B0421J33556m7333P4664j04696j21959j50541J8487L9949k1557L0877p702
8169a35834J07346J42426K506j14219K0723p8784o9270K3589J23391k7685j77509
8158a83320N1305k3515P7422K50678R4125N5926Q6349j81748o635o3135j82508
8147b5056j88168p661J25931p3448j61174J22387J36835n256Q27L5187O5876j12173
8135h5893J82689l391j89855q8589R4720M125K7449M538L8774J12132j06004l6742
$$ y = [56263, 137487, 163963, 132739, 39228, -36231, -77634, -29333, -23172, -7750, -82470, -106808, -89966, -46080, 6847, -102995, -99233, -129871, -64045, -173758, -253045, -182671, -185239, -88163, -33193, -40346, -83465, -60087, 791, 27446, -40519, -201650, -214495, -105539, -159946, -171880, 20421, 153977, 106644, 181308, 76612, -45347, -195888, -177401, -137452, -159009, -128132, -135834, -28488, 113938, 116444, 2225, 22948, -55836, -125106, -101517, 21874, -5811, -183320, -132015, -155530, -78108, 172570, 266695, 322621, 408970, 227222, 220587, 157452, -25056, -213224, -220885, -94954, -168402, -329576, -207189, -70354, -75610, -74783, -39596, 26280, -85893, 96796, 93405, -96450, -185039, -90319, -86194, -58745, -54207, -15433, 96699, -9305, -46047]
8123d6047R714n9987J9155P1618J95670M5060o4202k5534l7135j70328r3688J6021
8111a39683q1767j52812R2463J56398J86535j4369L8110k81091M6426q2434p6181
8100c08405K40800K46128O2552q4582J1713J8792k42187j46562R7969K45571J38805
8089B80594k25900q0615L2548m8110r8146o608L1414J26409j7129J15041J92305
8078C01803k44985j43723J12732O6115J36118O7618j36579k79855k3876J58105
8068A3473L8694R9437J43234q3210m0096j15474R767J9652J43492M1267l9258
8057B30978l6984j53281k65782j5009K19591J30475r7690q0578j7343o5659Q6733
8046f4549J78470J86924l4495r707p2995k2930R3786K010j00960j53675M7235
$$ y = [-46047, -36333, -96320, -77165, -5547, 190123, 235183, 170981, 145447, 108312, -62016, -155704, -139683, -221450, -374262, -281799, -125401, 61134, 46765, 84875, -196216, -149790, -232224, -308405, -67605, 178523, 241075, 156493, 168206, 186998, -55189, -201751, -103782, 141789, 280594, 54694, -25921, 6627, -41483, -139629, -146237, -114823, 11586, -5543, 109498, 301803, 56818, -86905, 25827, 91942, 228060, 295678, 159099, -120756, -144632, 13473, 52167, 151604, 294838, 211628, 171532, 56058, 65825, 85477, 228969, 270236, 230978, 193994, 40713, -225069, -240078, -20487, 109988, 12298, -68280, -85623, -151282, -64549, 113921, 300845, 266350, 256643, 183648, 160718, 254504, 256514, 155554, 1879, 49114]
8035D9114O7398M2977J04404j25709q0999J71694J6693M3297p5907J1076n9195
8024A64843j57979J35714K58768K51274J66321j7140K2006m8003r2714k05094
8014D77996n8207j7698J05680m4510p8873Q00J1359j91920l8227R0148j07010
8003A49538K6376k1339L2295J08950j12072J492J40993l7492k3524K79459q4625
7992D60051j21024L949J03362p7344R3400K06458j6630j43108J15745P6614m1085
7981F60388P7255K07357K29828K42284M47729N29801N69971L86479k46072l06373
7971B798647m18993m67711k07937k28837k53814k92571L1854k25511k06287j51562
7961C77278r700Q5613p1335o0932j20842J9344M8110Q5433K71185J8762r8053
$$ y = [49114, 116512, 159489, 263893, 138184, 57185, 228879, 245572, 288869, 212962, 224038, 164843, 6864, 142578, 401346, 652620, 818941, 801801, 823807, 775804, 683090, 477996, 419789, 402091, 507771, 463261, 384388, 385188, 396547, 204627, 166400, 256548, 149538, 175914, 154575, 186870, 295820, 183748, 185240, 326233, 288741, 265217, 544676, 460051, 339027, 342976, 446338, 368994, 462394, 668852, 652222, 509114, 624859, 701473, 660388, 737643, 945000, 1174828, 1417112, 1864841, 2394642, 2964613, 3351092, 3105020, 2798647, 2379654, 1911943, 1704006, 1475169, 1221355, 928784, 960638, 735127, 528840, 377278, 367578, 453191, 381856, 320924, 200082, 219426, 267536, 352969, 624154, 642916, 544863]
7950E44863O6787j70791o9337K90294M17030N26344N35409J09297r8258k58214
7940A893424k35691P9054n0845j52801j6536J81660L40847L65390L36871j56964
7930B584409m35597m13450l01823l39042k68817l6580R410j73819K0210m2931
7920F01970r3876q2763N1992j30186l9042J63694L5840o1459k12657o9534J62341
7909C26320J66794j11510J936Q0911n2585j23607q9287J34603l8114J8491J25673
7898D39625J40613J9359p4394j22377q6965m4272r0369J37116m6515n7202o5457
7887A49162J1095R957M044J28569j14964k3110l837n763J49490r8800j55398j51702
7875a01257O0146L97Q1334R7761J27890j53896m5813r7742m8429O4422j09509
$$ y = [544863, 611650, 440859, 371522, 661816, 1078846, 1605190, 2140599, 2249896, 2151638, 1893424, 1657733, 1736787, 1685942, 1533141, 1516605, 1698265, 2039112, 2404502, 2741373, 2584409, 2148812, 1735362, 1433539, 1094497, 825680, 789100, 798510, 624691, 644901, 601970, 508094, 425331, 477323, 347137, 308095, 471789, 507629, 446170, 233513, 163979, 326320, 493114, 381604, 383540, 464451, 411866, 288259, 198972, 333575, 295461, 313952, 439625, 580238, 599597, 525203, 402826, 315861, 271589, 181220, 318336, 271821, 214619, 149162, 160257, 170214, 174258, 302827, 187863, 164753, 160916, 155153, 304643, 205843, 50445, -101257, -41111, -40714, 40620, 138381, 266271, 112375, 66562, -31180, -79609, -15187, -124696]
7864a24696j43356P345R0398R0175L2885m329q3194N1514k0236J31805K04588
7853B32899J49499n3111j23151m723j64797r5387K45225j14277m5507j2566Q1333
7842I5437L8820j63017j53832J49991N0587N1018o1440j61513R03j4656J01928
7831f5774J27180P1774j19739p2812J36445k8302j30142r6889j59025l0893M5130
7820c23047o1916O2782R8709J70009J93246Q058j00216J55636P166j03418J3958
7809A20967P5834n4484N490p3720k4520J8215j25329N968J38987M8170K7280m2190
7797A20668J5325p602p323j24345J6148r6901J11613N0722o0438o6390q5289j7544
7785a51356N3168J40669K6364k5015Q1729J79142j09347j08599m1147j87095m4866
$$ y = [-124696, -268052, -260707, -170309, -80134, -47249, -51578, -134772, -83258, -103494, 28311, 232899, 382398, 329287, 206136, 201413, 36616, -58771, 186454, 72177, 26670, 14104, 95437, 134257, -28760, -182592, -32601, 17986, 69004, 7564, -153949, -153046, -167702, -65774, 61406, 133180, 13441, -59371, 77074, 48772, -81370, -178259, -337284, -368177, -323047, -384963, -322181, -223472, -53463, 139783, 147841, 47625, 203261, 210427, 107009, 120967, 196801, 142317, 147807, 74087, 49567, 67782, -57547, -51579, 87408, 135578, 162858, 120668, 135993, 128391, 121068, -3277, 12871, -84030, 27583, 78305, 17867, -48523, -133812, -151356, -98188, 42481, 68845, 43830, 125559, 304701, 195354, 86755, 45608, -141487, -186353]
7774a86353J66691p7470j11800Q6786L6677o0291j28430n7709J07951J97421J24084
7763I7557l6192J39279K2393o0608j16773Q0124O797o4729r0234J61215l9428
7752I9401j95098Q021J31993l5967n5631M6473L6090n1170j75367k232J14261
7741g9226j5738j8057j01568J35260K4381J77186N7321m8355M0480o5927j80518
7730g4761P1930P4215j48349k00199O7925L0672n7361j12410q8944K27029K7404
7719a82849O4584N3989q1725m6931j1084J49451k8088K1689J41252N7303k3278
7708A14313j4709n093j06209j32424l6287J02337M1048m9422L5080J47417j5704
7697H0347P5670l9154j02827J2288o1784O9542m3250k08176n2318P7667P6645
$$ y = [-186353, -19662, -97132, -208932, -122146, -85469, -145760, -274190, -331899, -223948, -26527, 97557, 61365, 200644, 223037, 162429, 45656, 125780, 132577, 67848, -22386, 138829, 99401, -95697, -87676, 44317, 8350, -47281, -808, 35282, -15888, -191255, -193487, -79226, -94964, -113021, -214589, -79329, -54948, 122238, 179559, 131204, 171684, 105757, -74761, -2831, 71384, -76965, -277164, -209239, -178567, -235928, -348338, -437282, -210253, -182849, -118265, -64276, -146001, -192932, -204016, -54565, -82653, -60964, 80288, 137591, 114313, 99604, 94511, -11698, -144122, -180409, -78072, -37024, -86446, -51366, 96051, 80347, 156017, 116863, 14036, 26324, -35460, 34082, -9168, -217344, -269662, -191995, -115350]
7686a15350L4258K4094R7738j39734L408J23597O4473m2365j15107J3560O5550
7675A4122N6112o5132K204J00631l2972j22009m7687l5943j18512q12J69771J336
7663g8891k9279j4960J0961N5005L0572J632j46179J868J27822P0703K6051j78553
7651a23248j36128R8724Q0761j9382n9866M891M137J42586P1458l8451J74159
7640A99641R4411n8059j47064k75578j19751j6366R872M3873P2438J13773K1474
7629f1336M3309r9537J6559l1316M5085J6835p6417N8340l2381m2605K7990J39938
7617D464J88920o5573j37210P6148L8519n4192r841q7864m2537J36219q9189j05528
7605a47664Q3939J30646L3358j18374q7178P3564k9363j64388J25195J99523Q6677
$$ y = [-115350, -81092, -56998, 40740, -98994, -95586, 28011, 92484, 50119, -64988, -51428, 14122, 70234, 5102, 7306, 107937, 74965, -47044, -94731, -130674, -249186, -249998, -80227, -78891, -108170, -123130, -112169, -57164, -26592, -24960, -171139, -169271, -41449, 29254, 55305, -123248, -259376, -160652, -79891, -99273, -159139, -154248, -150111, -7525, 63933, 25482, 199641, 294052, 235993, 88929, -186649, -306400, -322766, -312894, -269021, -196583, -82810, -61336, -18027, -117564, -101005, -132321, -87236, -70401, -146818, -88478, -120859, -163464, -135474, 4464, 193384, 127811, -9399, 66749, 105268, 51076, 41235, -46629, -89166, 47053, -42136, -147664, -63725, 66921, 100279, -18095, -105273, -31709, -61072, -225460, -100265, 99258, 185935]
7594A85935j78245l2198P9087q398k2033O1379q1568o1081j27121j8796R7878
7583a05161L4003J08628L0071N0582Q4940o4159j69163j13613j0761k11651q0633
7572d46917Q5404R0628j61817Q3572J26415J17387L8376m9735R8564J73746J01377
7561B57000j66241j08708P3110p7591R191J6538J12482R2672r0967J04823J167
7550B23476O0705J50093j63395k39398m2921q575K5271j5547J10108l0375l5865
7539C3577q3557r630k8611K2593m3057J57419l5668j06852j27783r1873K7151
7528b86291K8226K0681p2697J12269O267r6984J79052R3850k3161j4776k4190
7517g7754K4667J99169n0471k36069o4344K2057o9771R1414K36997l7044m9639
$$ y = [185935, 7690, -24508, 54579, 46181, 24148, 85527, 3959, -57122, -184243, -203039, -105161, -71158, 37470, 67541, 118123, 203063, 138904, -30259, -143872, -154633, -366284, -446917, -361513, -270885, -432702, -349130, -222715, -105328, -66952, -116687, -18123, 155623, 257000, 90759, -17949, 55161, -22430, -13239, 3299, 115781, 208453, 117486, 222309, 223476, 284181, 434274, 270879, 31481, -11440, -20015, 5256, -10291, 99817, 69442, 33577, -49980, -59610, -88221, -65628, -108685, 48734, 13066, -93786, -221569, -313442, -286291, -258065, -237384, -310081, -197812, -191545, -288529, -109477, -15627, -38788, -53564, -77754, -53087, 146082, 95611, -140458, -204802, -182745, -252516, -161102, 75895, 38851, -10788]
7506a0788j23973q6555j639m9242j39684J21068J63367R5965L8899L8230K0818
7495F6466J03867r2996n8614j3440n0706K8716j272j3997q798o107l0822J16214
7483C8511J2840J1966j22831j52881j63895L9708N5693L6396M1310p5364O0473
7472b18074R2583L3984J24693M9240m9033Q9729m8350q9041J58821N2948j14791
7461H2709j28460P1805J24147l7924j86215r0832N2095J38623J8092j04298o0015
7450a20273L0597K17334R8487q1725Q3216J2755k18724n4063j76479o984J19113
7439i6746J6979j94465n9962K28026J43655p1151p7239j35708P4203l6405j22072
7428c30885m6927J17690M4395J33609O5218r9497r9041m0667K5819m9093J21177
$$ y = [-10788, -134761, -221316, -222955, -272197, -411881, -290813, -127446, -31481, 7418, 45648, 66466, 170333, 77337, 18723, 5283, -45423, -16707, -17979, -31976, -40774, -46881, -77703, 38511, 51351, 63317, -59514, -212395, -376290, -336582, -280889, -244493, -203183, -278547, -218074, -125491, -91507, 33186, 82426, 33393, 123122, 74772, -14269, 144552, 197500, 82709, -45751, 26054, 150201, 112277, -73938, -164770, -112675, 25948, 44040, -60258, -120273, -89676, 127658, 226145, 144420, 227636, 240391, 21667, -32396, -208875, -215859, -96746, -79767, -274232, -334194, -106168, 37487, -33664, -110903, -246611, -172408, -208813, -330885, -377812, -260122, -215727, -82118, -16900, -116397, -215438, -256105, -230286, -279379, -158202]
7417a58202J19291M7903m6452J18356N184m8351n4160n1519k2982j15703J45936
7406f0699J01915p76J29910j6630j97081o4473n3408N3631O5225L0609l0929m2614
7394h5320k8668r1973k1108J51615j5149N7540J10019L4590k9924l5563j74575
7383a28516L0692L5915L4164Q4690l6757L8345N443m1075j01492j8963O4941j21218
7371a53831p6363q4275P1757k3365n2178J53007J83952J31975j2141j82162L808
7360c9816N8499l3924m7566O1189R1424J34370o5647n7788k14073m2071j5089
7349a70492j08279J21430k4228j8668J67861J04292j789k44463j79386N8308J95098
7338a00316P6305Q1955l8805j01988n0187J70303J14336j3052j47851l13366P9878
$$ y = [-158202, -38911, 8992, -37460, 80896, 86080, 37729, -16431, -67950, -90932, -206635, -60699, 41216, 40440, 170350, 153720, -43361, -107834, -161242, -107611, -42386, -11777, -42706, -85320, -113988, -205961, -227069, -75454, -90603, -33063, 76956, 111546, 81622, 46059, -128516, -97824, -61909, -27745, 56945, 20188, 58533, 63976, 22901, -78591, -97554, -32613, -153831, -230194, -314469, -242712, -266077, -318255, -165248, 18704, 150679, 138538, -43624, -39816, 18683, -15241, -62807, -1618, 89806, 224176, 158529, 100741, -113332, -155403, -170492, -278771, -157341, -181569, -200237, -32376, 71916, 70127, -174336, -353722, -295414, -100316, -24011, 57944, 19139, -82849, -133036, 37267, 151603, 138551, -9300, -322666, -242788]
7327b42788K14306n4721p1488R2153j1483r2972P5948P6354R3983n9195o0279
7316d0182P6482j00007N5835k6531O9254J37483q466j67028r3124N0992J4448
7305c0844j13498L7700K3617O2787l8612n6700q4604J55308J706p840J53428j5920
7293H6528j82640j10533k12139N5037q488M5992J61201J86332Q3106J08879j17461
7282I5814J5249L5748l2658j38021P2344P7200M559j31147j00129m4510Q8189
7271e7362k3333j09828J10231J42674k083p6171j33033J77546O9287l4260j28295
7260f4627L9171J42056N2975j28500r6644k20737p609M4102J65910j08085o9999
7249b51987j9941k7889R2105L7949o2640O5229P8624j1303l4286N4133r770N5088
$$ y = [-242788, -28482, -83203, -154691, -62538, -74021, -166993, -91045, -14691, 79292, 20097, -40182, 36300, -63707, -7872, -34403, 34851, 172334, 163868, -3160, -96284, -45292, -30844, -144342, -106642, -83025, -20238, -58850, -115550, -200154, -44846, -43140, -50980, 102448, 86528, -96112, -206645, -418784, -363747, -372235, -326243, -165042, 21290, 104396, 213275, 95814, 111063, 146811, 114153, -23868, 48476, 125676, 130235, -912, -101041, -145551, -57362, -80695, -190523, -80292, 62382, 60299, -15872, -148905, 28641, 97928, 63668, -64627, -25456, 116600, 169575, 41075, -55569, -276306, -283915, -239813, -73903, -181988, -251987, -271928, -299817, -207712, -169763, -232403, -167174, -88550, -99853, -134139, -80006, -89776, -34688]
7237c4688o1231O7615J531l6858N5246q6569r476J68311J95123M8461j15975j11288
7225H0202j81319K2616J55154j3531j30330p624p3703j47347J10493J50226m652
7214c9815q7376M740J16043O4172j47806p456P6251J04656K6658J004j07334j7952
7202a4215M7495o201O9592r7822j48543k9123K25228J69409J89315j04819o9545
7191B30771j02001n3725L1838j42489j84081j25780m6978R0313J43364J11417
7181d7351L2967K1317j14174J92989J06088j12186k05858p8214J48350k5682j85791
7170b67545j66042K26664J96216J54462j24846j86449k7156J72077m9949P410
7160f5158K3611L7320j20441J9951o6705J44462P3863p3712j00937L4103N3222
$$ y = [-34688, -95919, -28304, -26773, -63631, -8385, -94954, -104430, 63881, 259004, 307465, 191490, 80202, -101117, -78501, 76653, 63122, -67208, -74832, -148535, -295882, -185389, -35163, -39815, -127191, -122451, -6408, 57764, -90042, -97498, -21247, 83409, 110067, 111071, 3737, -14215, 33280, 27079, 96671, -1151, -149694, -178817, 46411, 215820, 405135, 300316, 230771, 128770, 75045, 106883, -35606, -219687, -345467, -392445, -302132, -158768, -47351, -14384, 6933, -107241, 85748, 191836, 79650, -126208, -204422, -56072, -81754, -267545, -433587, -206923, -10707, 143755, 18909, -167540, -194696, -22619, -72568, -65158, -41547, -4227, -124668, -104717, -171422, -26960, 46903, -26809, -127746, -93643, -40421]
7149d0421N3226q9389O0J25186n0085j07475L7383j22826n3774j5806J64199j9663
7137a19385M5183J23524n2162R3266k0740k26106j07932n8334p2079K3282K34486
7126a36997M0817p3099N3047J15434K06644M7145l5792j24240j5758Q2734l7382
7115A22553j49003k1870n7683Q0922J53076J03891J16812r7295o4819j46397j46998
7104a06811M3771J66347M8031M2512O9633m6857m1128M1500o0260j65748j30988
7093a39998p0705j38643J00190J29153j09526J5652k4790l897J82989P2768r2388
7082g9195J4812J24916k4167q2325j6875J7218j19160Q8905k4483J42339O2487
7071A04472k1827n1834j08148l5244J8057K2052L2858p6750j56040N5348J35837
$$ y = [-40421, 12805, -76584, -76524, 48662, -1423, -108898, -71515, -194341, -248115, -263921, -99722, -119385, -74202, 49322, -2840, 90426, 69686, -156420, -264352, -322686, -394765, -371483, -136997, -96180, -169279, -116232, -798, 205846, 252991, 217199, 92959, 77201, 159935, 122553, -26450, -48320, -106003, -25081, 127995, 231886, 348698, 251403, 186584, 40187, -106811, -63040, 103307, 151338, 193850, 263483, 216626, 175498, 216998, 156738, -9010, -139998, -210703, -349346, -249156, -120003, -229529, -213877, -238667, -242564, -59575, 13193, -79195, -64383, 60533, 36366, -45959, -62834, -45616, -164776, -75871, -100354, 41985, 104472, 82645, 30811, -77337, -112581, -94524, -72472, -39614, -116364, -272404, -217056, -81219]
7060h1219J76180j96022j60248j9678J36400M1668K5687m3553k0717l3310J2033
7049a62779j48726L2244M9780j30962K11961J57677l3613k21354Q9013J45500
7039a1259n3280n877j43769j15231J72218K86532L7145J5748k5901Q833m0565
7028A24594k4033L3042K2990n7654j08032j7871j17489J4933L3724J0817n0064
7017a35043J64159P2303P3982j49280o8465K13097J5333J04635R0431m4012j86380
7006A50760m2759o2366n7680k1413j38391p0364M3970J4692n5474j5408K19463
6995c4970J37252o3897j575L08p605j02140J5060M4004J35454J42397j06828K230
6983A59690j9642k80574l1909K56722J65519O503j90051L6161J8916N500J749
$$ y = [-81219, 94961, -101061, -261309, -280987, -144587, -102919, -77232, -120785, -141502, -174812, -162779, -311505, -279261, -229481, -360443, -148482, 9195, -24418, -245772, -156759, -11259, -64539, -70416, -214185, -329416, -157198, 129334, 166479, 182227, 156326, 165159, 124594, 100561, 133603, 156593, 98939, -9093, -26964, -144453, -129520, -95796, -84979, -135043, 29116, 101419, 175401, 26121, -42344, 170753, 186086, 290721, 381152, 337140, 150760, 108001, 45635, -12045, -33458, -171849, -242213, -198243, -183551, -239025, -254433, -34970, 102282, 38385, 36810, 37118, 29513, -72627, -57567, -13563, 121891, 264288, 157460, 159690, 140048, -140526, -172435, 84287, 249806, 256309, 66258, 102419, 121335, 126835, 128584]
6972A28584n9507n090k3796N5546r960m3093m9440N5493n2773j82765j6518L05
6960b03014O7021N6106P0346R9343J6436k20057j02113L5611Q7357O776N0553
6949c5635L2573j7756j28442j0850j28061Q991J24985K78821k4369j39365J24215
6938H5107J29076P1793k937R2063r999r6191L6438K6210n8144Q5612m0261q5041
6926B33726j09178k8383k09571M6214O3841J33441O5663K3873j795L3681m5474
6915B06038r9936j33041Q051j5799K6289m9424j07619p5223J7135J31009J97895
6904A05375R6090p9237k846k0307j56755j30987k3968k8570J01998K05586j07119
6893d0740p1643K5584J58211R5549j46072j51241K9304J14171j2130L9220N4719
$$ y = [128584, 69077, 63987, 40191, 95737, 85777, 42684, -6756, 48737, -4036, -186801, -203319, -203014, -135993, -79887, -9541, 89802, 106238, -113819, -215932, -180321, -92964, -86188, -35635, -3062, -20818, -149260, -160110, -288171, -279180, -154195, 124626, 100257, -39108, 85107, 214183, 285976, 283039, 375102, 365103, 268912, 305350, 331560, 273416, 359028, 318767, 233726, 124548, 96165, -113406, -67192, -3351, 130090, 195753, 219626, 217831, 251512, 206038, 106102, -26939, -18888, -34687, -8398, -57822, -165441, -240664, -223529, -92520, 105375, 201465, 122228, 119382, 99075, -57680, -188667, -212635, -241205, -139207, 66379, -40740, -112383, -86799, 71412, 166961, 20889, -130352, -101048, 13123, 993, 40213, 94932]
6882I4932k8369j10365M8569q4044k8774K70607K01117k13438j84608R952J30097
6871A05676m002j15646r377Q6076J5934O0082P7203O2794k17372q5566m6246O0381
6859a0063l7033j391k4525n3288j05912Q9547J35779O0886J21667m2314l84J05586
6847B38555J54499M9050r6664j13271j17491r4204K6891Q5869J46694j16269n9733
6836A03926J15821n6695j30096Q3567J8991k28059J554n1950k0942R6430J83031
6825A15578L1453m1364j466Q072O273K0973J8833K1582o9176N6923k13745m440
6813e0504J25076j66189j8132Q8441K19932p853l5976P5528j24252j27085j56272
6802a77286N9575J17215r6933l5814k3884P358j481P599k1417N3779O8579R6782
$$ y = [94932, 66563, -43802, 4767, -79277, -108051, 162556, 363673, 150235, -34373, -24421, 105676, 101674, -13972, -23349, 62727, 78661, 138743, 215946, 278740, 61368, -24198, -70444, -10063, -47096, -48487, -73012, -126300, -232212, -142665, -6886, 54000, 175667, 133353, 132969, 238555, 393054, 442104, 345440, 232169, 114678, 20474, 47365, 133234, 279928, 163659, 103926, 219747, 163052, 32956, 116523, 135514, -92545, -90991, -142941, -163883, -67453, 115578, 147031, 105667, 104201, 112273, 118546, 139519, 158352, 179934, 110758, 167681, -46064, -50504, 74572, -91617, -109749, -21308, 198624, 190771, 154795, 230323, 106071, -21014, -177286, -117711, -496, -97429, -133243, -157127, -149769, -151250, -143651, -165068, -111289, -42710, 54072]
6790E4072M2358r9006K9460J40866Q4309n2151j84721j61919K814J04891L7904
6779a123R6522m717n6951J35337k1806q8916J0521K6256l9179J62791J08415j22536
6767B04614p7575j67010j72729Q1886J50074J3453j46561n0519J13569J2849k0094
6756e8043M724r1667j30389q486J90291L9411k7824q4663R099J80302p3981j7392
6744f8618N1016l2456j39948n3395k0306J49391P9309n4355J6301R2936m5272
6733b5397L754n8690O4376O4271k2861O3758j13050j70535j11460k9710o3937
6722c99481J06913N6861l9635J16596p5900J5466J46099J49048j222j82483N2449
6711e5289L243J38361q105o3046k04089j04844R0472J22171J78446l9742q8108
$$ y = [54072, 96430, -2576, 26884, 167750, 252059, 199908, 15187, -146732, -143918, -39027, -1123, 95399, 90682, 33731, 169068, 147262, 58346, 68867, 95123, 55944, 218735, 327150, 204614, 127039, -39971, -212700, -130814, 19260, 32713, -113848, -164367, -50798, -37949, -58043, -53319, -144986, -275375, -283861, -93570, -54159, -81983, -166646, -157547, 22755, -51226, -68618, -17602, -50058, -190006, -243401, -263707, -114316, -35007, -89362, -73061, 19875, -25397, -21643, -80333, -15957, 48314, 25453, 89211, -23839, -194374, -305834, -335544, -399481, -292568, -235707, -275342, -158746, -234646, -219180, -73081, 75967, 74745, -107738, -55289, -52046, 86315, 78210, 15164, -188925, -293769, -203297, -81126, 97320, 57578, -30530]
6700c0530r4758j65671j86995o276J89817J92479J25743m4350r1964J78519J20129
6689A86143j559M3809P0062J02162q4931j14143j85623P655O0673K3992r696n188
6677I3356L3031K1219j41397P7927N7271o3410j59867j22920k6548J76912p5973
6666a30399J886Q2697q9119m1648k7011M8020J10875R1931J57177n8712l3301
6655A12396j2981n3729l7419p8664k4261L0298P3304Q5879P9782R201r6817j64608
6643g7619K2821j24664k9315J59009l7109j11696k6345J79632j336p8395q4839
6632b09856L9094R5706m2923j90171N8545M4403q0308J8595J1209J40104J41190
6621B5588j81403j21161J23207O0001J26606J58897P243j5046q5902N3439J05141
$$ y = [-30530, -125288, -290959, -477954, -484230, -294413, -101934, 23809, -20541, -112505, 66014, 186143, 184584, 228393, 298455, 400617, 315686, 201543, 15920, 23575, 84248, 108240, 98544, 93356, 126387, 147606, 6209, 84136, 141407, 77997, -81870, -204790, -231338, -54426, -130399, -128513, -45816, -134935, -176583, -203594, -155574, -44699, 47232, 204409, 145697, 112396, 99415, 45686, 8267, -70397, -94658, -64360, 8944, 94823, 174605, 183806, 86989, -77619, -54798, -179462, -208777, -49768, -86877, -198573, -224918, -45286, -46622, -125017, -209856, -170762, -75056, -117979, -308150, -249605, -205202, -285510, -266915, -255706, -115602, 25588, -155815, -276976, -153769, -93768, 32838, 191735, 198978, 183932, 98030, 151469, 256610]
6610B56610K0615k64552j98319J50344J80942j16165j37984j14595l3663J73284
6600h3483Q6509j20450l6901q3338l6357L11077L04635l2058j90417R567o0083
6589F8701J57425q492k04333P3461q3672j68277j45686l3551Q3853O9832n8678
6578b49417O9982J51283J16191Q2541m8383j52833k4493k5824j29476j19175R3109
6567b36495J37632R3678L2003N3520j23893M3939J40637J02647r3852R8891j31445
6556A17262j37604N6186j6932J14282J12033o3771j30059m3166j9502j2772j04230
6545a28273j16366K8915N3852P7573M0970j52M8437J42848K13340r7035j94442
6534F9667m9340K40068N9691j18342r5508j46829O0570N0030q0554j19381k967
$$ y = [256610, 277225, 12673, -185646, -35302, 145640, 29475, -108509, -223104, -256767, -83483, 3026, -117424, -154325, -237663, -274020, 37057, 341692, 309634, 119217, 128784, 68701, 226126, 217634, 13301, 86762, 3090, -165187, -310873, -344424, -260571, -190739, -249417, -179435, -28152, 88039, 170580, 122197, -30636, -55129, -80953, -210429, -329604, -236495, -98863, -5185, 26818, 80338, -43555, 384, 141021, 243668, 149816, 248707, 117262, -20342, 35844, 18912, 133194, 245227, 181456, 51397, 8231, -11271, -24043, -128273, -244639, -215724, -161872, -84299, -43329, -43481, 4956, 147804, 361144, 264109, 69667, 20327, 260395, 320086, 201744, 106236, -40593, 19977, 70007, -10547, -129928, -132895]
6523a32895N6950k987q3244r351J59844L7405j72813m9900L3732Q9531k128R6595
6511B0739J38536R241j00072L7297N7295j011j43972p9076K4612r3497k51941
6500c81849l1113N3026J26469l5020r0050j63677P3743K36037J12228J01384J9092
6489B0270j93385j28112N9288J29437K3032p4939R768P3928L9733O9741p8206
6478d9445l2314N9630P049O4109J07679l4475j84248j83195K4725Q103p809M9544
6466a70647Q0328J56321j73571L6432j2300j9077j7030k35139R633P612J5763
6455c21675R279j14473j0333K29644L06821J7851q4981j14665N0602k26595M6557
6444b11968Q6365O161j23849J5835J38972l9536l5663N4497q8172o9336R6050
$$ y = [-132895, -75945, -78932, -162176, -171527, -11683, 25722, -147091, -196991, -163259, -73728, -75856, 20739, 159275, 168516, 68444, 105741, 163036, 162025, 18053, -61023, -36411, -129908, -381849, -412962, -359936, -233467, -268487, -358537, -522214, -448471, -212434, -100206, 1178, 20270, -173115, -301227, -241939, -112502, -89470, -164409, -154641, -80713, -40980, 28761, -49445, -81759, -22129, -15080, 49029, 156708, 122233, -62015, -245210, -220485, -212382, -220191, -170647, -90319, 66002, -107569, -71137, -83437, -102514, -119544, -354683, -345050, -337438, -321675, -312396, -426869, -437202, -207558, 99263, 117114, 32133, -82532, -31930, -258525, -211968, -125603, -119442, -243291, -227456, -88484, -128020, -163683, -109186, -197358, -266694, -170644]
6433a70644K3319m3718P3901Q1349R6311k0441q8429R7200q9568j25605P6859
6422h9466J54504j28300m955M2718J21604k5714J14110J46408k39589j18462j28972
6411a56114K5978J2495N0299K02568j3485p3402n4804q2824l4591K1170J34925
6400C2215L4950L2581J6029N2811j42318n3552K17771K09476O0813j56362k80055
6389B4359j73057k898K076j30950o3046P1042m216k1067K0686J11901N7405j49498
6377b57263r4801J72802J82229l2814J40166M8781M2135j60105N2958R7648l043
6366A88693j56120j21001p2460n0989J05253M7925j8989j35507n7546K37793j6726
6355d9674M2632m4164j89085N0844J87251o6990p2631R2215O6099o9467j10469
$$ y = [-170644, -147325, -191043, -117142, -35793, 60518, 40077, -48352, 48848, -40720, -166325, -89466, 65038, -63262, -68217, -25499, 96105, 70391, 184501, 330909, 91320, -27142, -156114, -130136, -117641, -67342, 135226, 121741, 48339, -6465, -89289, -123880, -102710, 32215, 67165, 99746, 115775, 168586, 26268, -27284, 190487, 399963, 460776, 304414, 24359, -148698, -151596, -149520, -280470, -343516, -272474, -276690, -297757, -277071, -165170, -107765, -257263, -352064, -179262, 2967, -29847, 110319, 159100, 201235, 41130, 94088, 191736, 188693, 32573, -88428, -160888, -211877, -106624, -58699, -77688, -213195, -270741, -32948, -49674, -7042, -51206, -240291, -189447, -2196, -69186, -141817, -49602, 16497, -52970, -163439]
6344a63439J29880J51636o6396k60668q7165J06004l4356L26012J94943N3491
6334C49942k06219r8728j12696m4817L009j54816J24425j6461j92335J20357K66816
6323C8477L1165r5894O900j02061j60135Q0768L8593J1493J53422O0460q3143
6312a9955p8359R4715K25483l0079n7795O6052L4379k9875r9968m6415j12120
6301e3937j07487o3778l5680l2913j741l2157M1682o1028J88095J29598J37298
6290A07952J7333Q2995k96473l14825k5433R5199J66797Q2199J26005M6264N1924
6279A39937n923r1174m7809k00872l8505J2520O7893K05638k5848j0945n4723
6268d9811O4195J93674J70294j19896k24545O5666o6202k17997j8616J50045Q4677
$$ y = [-163439, -33559, 118077, 51681, -208987, -296152, -190148, -224504, 101508, 296451, 349942, 143723, 44995, -67701, -112518, -109509, -264325, -139900, -156361, -348696, -228339, 38477, 69642, -26252, -19352, -121413, -281548, -200780, -162187, -150694, 2728, 63188, -19955, -98314, -3599, 221884, 191805, 134010, 200062, 234441, 204566, 104598, 58183, -53937, -161424, -225202, -260882, -293795, -295536, -327693, -286011, -347039, -158944, -29346, 107952, 125285, 208280, -88193, -403018, -428451, -333252, -166455, -84256, 41749, 88013, 139937, 134014, 42840, -4969, -205841, -244346, -231826, -163933, 41705, 15857, 4912, -49811, 14384, 208058, 378352, 258456, 33911, 99577, 33375, -184622, -203238, -53193, 31484]
6257C1484Q2221o2445j38190k1307R6777n2907o9903J0757O8641n5557l6865Q5316
6245f1978o2139M4249K50476j3083j90216j12421P0350J65968o2056M4284k8822
6234D4612j60166n0343K7081P1764J25412n1156k7483l1924P2262j34213j5592
6223a29746K6539L0066O1952K6444j31004j84169L169J43359k558p9851P3146
6212a62653k7026l0536o8478J07334K52984l7401j31740M3270N3270K3802M7720
6201G0546j34890j3871J59767M1857p1968Q301N5902j15263m1628J1542J21111
6190I1406M1285l6728k20542q9563O6217p9788k6865K2739j5301M776J06237J52532
6178A6405j27288j52604J1716J04741p8031P1402J22480K0185L4673J53521j09487
$$ y = [31484, 113705, 51260, -86930, -108237, -11460, -64367, -134270, -123513, -54872, -110429, -147294, -61978, -124117, -79868, 170608, 157525, -32691, -145112, -74762, 91206, 29150, 73434, 44612, -115554, -165897, -138816, -67052, 58360, 7204, -20279, -52203, 20059, -114154, -129746, -103207, -73141, -11189, 15255, -115749, -299918, -296749, -153390, -155948, -235799, -162653, -189679, -220215, -288693, -181359, 71625, 34224, -97516, -54246, -976, 22826, 70546, -64344, -78215, 81552, 123409, 51441, 59742, 115644, 381, -41247, -29705, 91406, 132691, 95963, -124579, -214142, -147925, -227713, -254578, -231839, -247140, -242364, -136127, 16405, -110883, -263487, -251771, -147030, -225061, -153659, -31179, -10994, 23679, 177200, 67713]
6167F7713r1266l8645J8380p8208l4908J2558j11689P964M4369K33068J06023
6156A35359p714R5121J6694K4934p6930J1759K0928j3659j2461J24088P9406r8209
6144B99316j66174o0581J17719j36184m1058K2336L9015j53985r5788j12325k9867
6133c17576O7719Q0080J56675J08226j5323r5533q8943n85J38154j4472M8443
6122F6865L5833j78298k11941Q4375N3257M4848K81025K0591o7000m1358j12043
6111b3846m0903L756K10718J47600R925j35246j13489K3603q289o5479J5463P5863
6099I9676k46510M9574o3328j09205n774J19969q4348j6190q9067j16136K1837
6088d39502J63807L5170R0616J66707j15224j43394J7431O6171p0688J57343M2125
$$ y = [67713, -23553, -62198, -43818, -122026, -156934, -144376, -256065, -248101, -203732, 29336, 135359, 127645, 222766, 239460, 264394, 187464, 199223, 220151, 206492, 194031, 318119, 397525, 299316, 133142, 72561, 190280, 54096, 13038, 35374, 74389, -79596, -175384, -287709, -317576, -249857, -169777, -13102, 95124, 79801, -15732, -104675, -105260, 32894, 18422, 66865, 102698, -75600, -287541, -203166, -149909, -105061, 175964, 196555, 129555, 88197, -23846, -64749, -60993, 149725, 297325, 307250, 172004, 58515, 82118, 73829, 8350, 23813, 99676, -146834, -97260, -160588, -269793, -275567, -155598, -239946, -256136, -345203, -461339, -439502, -275695, -240525, -149909, 16798, -98426, -241820, -224389, -158218, -228906, -71563, -29438]
6077b9438j39251m7172J23372J57308m7286j44720K20920R3784j14648k96061
6067b23192l1265N7229J68506J33584J14807O837j6720j62224r1737j38043o522
6056a88740J0533Q1446o5956j12159l2264K2755N9332M9641j44075P8745J97074
6045d3668k5011k0865K2082N7351k6548r0836J52807k14003r4679J98865O7563
6034a6942j41575r2333j86189j7933J94532K08152m3757M4817j06329o5703J19723
6023a03537J97o8176R5846m1628l7608J20042J05758n1222O5635K837k27n3506
6011C4411P6714j37594L7597l2189j17602Q4113L0788L02801R9366k32563j77879
6000c2037J2464J4957M7750J65869K9829n7755j17431k16315k42889Q4288R0717
$$ y = [-29438, -168689, -215861, -92489, 64819, 17533, -127187, 93733, 187517, 72869, -223192, -254457, -197228, -28722, 104862, 219669, 226506, 209786, 47562, -44175, -182218, -188740, -178207, -96761, -162717, -274876, -307140, -284385, -225053, -175412, -319487, -240742, -43668, -68679, -89544, -67462, -10111, -36659, -127495, 25312, -188691, -283370, -84505, -16942, -158517, -250850, -437039, -454972, -260440, -52288, -96045, -51228, -157557, -223260, -103537, -103340, -171516, -75670, -117298, -154906, -34864, 70894, 19672, 85307, 88144, 87917, 34411, 111125, -26469, 11128, -21061, -138663, -54550, -23762, 279039, 378405, 145842, -32037, -19573, -4616, 43134, 209003, 238832, 181077, 63646, -152669, -395558, -311270, -220553]
5989b20553N88K24739J14810j14492k23150l5217J45808k0376l46O4466P8350
5978A4627n3077q8526j34198J2937L872J16610J82375p067m4942Q2115j5624m7003
5966B2099j79926j38703O0521L6989L1435o1060R9284Q6682m4363o1894m1768
5955a90704P5395L6627r3482N3727J54521K4509m6266L0925J05869J40555k2680
5944B68996j62575k26727j11618o5147J31926J95661k3020P95j2703R7853p8559
5933A4882m2782n0140Q2874j59172l7097J81493J47996k3180l11424j29118Q8122
5922b37546L3842m9003Q4292N8185q1839j00450r8937J30375K1951O313J69577
5911f3240M7950J1542K5361p9772L5830J06348n723k06555n3614k680R1894R0618
$$ y = [-220553, -219965, 4774, 119584, 5092, -218058, -253275, -107467, -127843, -128189, -63723, 14627, -38450, -126976, -261174, -248237, -244365, -127755, 54620, 47553, 2611, 84726, 69102, 22099, -157827, -296530, -236009, -199020, -167585, -228645, -129361, -42679, -87042, -148936, -190704, -115309, -78682, -172164, -118437, 36084, 60593, 14327, 45252, 151121, 291676, 268996, 106421, -120306, -231924, -297071, -165145, 30516, 7496, 8291, -4412, 93441, 14882, -27900, -78040, 4834, -154338, -191435, -9942, 138054, 114874, -196550, -325668, -237546, -203704, -252707, -168415, -110230, -192069, -292519, -391456, -261081, -239130, -232817, -63240, -15290, -3748, 21613, -58159, -22329, 84019, 78296, -128259, -181873, -184553, -92659, -2041]
5899b041R8498j25645j30286l4015J81048m1962j28024J4669J86794L6826K9141
5888H5003j98957N8614N3894M7602N4928L319p0106P84j1841p8516m0118J67951
5876G2557k8016o1013P487J2228N0998K6815J11507q3327j4566o7333j07604n1788
5864a32055R4615R3912j5511j38803J24423M3983L431J1680j472N6996J82940
5853C24139j50373j02241L4850M2322j26558n3267N2918q2391O1175J4179M3473
5842E8226j43831j14636l0843M1813J19999m9623j61302J13733J82648j16311
5832a00127p4299J00217q1330J56687J71198J63065J3801O3533O8324n5796n1168
5821C74105j67197r2495r4534j14249O3139m006n736p401P8097r5355L6961K38153
$$ y = [-2041, 96457, -29188, -159474, -193489, -12441, -54403, -182427, -167758, 19036, 55862, 85003, -113954, -55340, -1446, 46156, 101084, 104403, 34297, 35081, 23240, -55276, -95394, 72557, 44541, -16472, -8985, 3243, 54241, 81056, 192563, 109236, 94670, 27337, -80267, -132055, -37440, 56472, 40961, -97842, 26581, 70564, 73995, 85675, 84203, 141199, 324139, 173766, 71525, 106375, 148697, 22139, -31128, 21790, -60601, 574, 14753, 58226, -85605, -200241, -231084, -189271, -69272, -118895, -280197, -166464, 16184, -100127, -174426, -74209, -155539, 1148, 172346, 335411, 349212, 412745, 481069, 425273, 374105, 206908, 114413, 19879, -94370, -31231, -35237, -40973, -48374, 29723, -65632, -28671, 209482]
5809B09482k0222j02836p7510m6485p851J24659n83M1348J07451k03245k00804
5798a76596K0742o2790J6313n2353Q8079j1308P1843J01761J0307J44987Q5183
5787B36168k4456r9663j01269J24831M3189k0293j76064k00445O4100J89294J7486
5776E2878p6224j6657o6328q6198O4778O1588J98035J46616j13907o3352j12573
5765a1344k6665j81765l0433m1175q3227k4176Q0466J7863K26420Q9251j0996
5754D219j29949l6195o80p638J9405J59579j59524j17338J60406Q2847J60372
5743A35504J59515k1104j05929j01085j36461k01943q5266q4999K43834L3717
5733a64217l6337K5057j00731P799K36291K32225K40016L0705l974J64662j17872
$$ y = [209482, 189260, 86424, 8914, -37571, -45422, 79237, 78654, 120002, 227453, 24208, -176596, -155854, -218644, -202331, -254684, -166605, -177913, -106070, -4309, 5998, 150985, 236168, 211712, 112049, 10780, 135611, 178800, 158507, -17557, -218002, -153902, 35392, 52878, -23346, -40003, -106331, -192529, -127751, -66163, 131872, 278488, 164581, 101229, -11344, -38009, -219774, -250207, -291382, -374609, -398785, -318319, -300456, -74036, 15215, 4219, -125730, -161925, -162605, -170243, -150838, 8741, -150783, -268121, -107715, -24868, 135504, 295019, 273915, 167986, 66901, -69560, -271503, -356769, -441768, -197934, -164217, -200554, -175497, -276228, -268429, -32138, 200087, 440103, 470808, 466834, 631496, 513624]
5722E13624k67075K294k2349n033M831j15864M4757r3995k07969N8562J29856
5711D1639R7785P1749M7486k33473j38600N9M5886j3900j17870m4951J49214K31906
5699A36930j3498o533j53462L1697J08954Q3766o3404j33121M0641m2853j96511
5688b07394o7231J12623n5501o6226R0385R202J05972j11170r6091J8962N0151
5677b16318P0691j16283k7723j2687J5486J92272J95947m6339l972j23904p3268
5666a46098l2973J26849K8195J21799N7416k9060k46319k44236N4231J76979J25790
5655g427J1030q3855o9813J6882p5718n3088L9682j04879L3669O1661J15704j60758
5643b76910N0829l974J76043J46138P3322o2027p4323k7021P2813J5902j0821
$$ y = [513624, 246549, 248843, 226494, 221461, 226292, 110428, 155185, 61190, -146779, -88217, 41639, 139424, 211173, 258659, 25186, -113414, -113355, -67469, -81369, -199239, -244190, -94976, 136930, 123432, 116899, -36563, -4866, 104088, 187854, 124450, -8671, 31970, -10883, -207394, -274625, -162002, -217503, -283729, -193344, -184142, -78170, -189340, -285431, -266469, -216318, -145627, -261910, -289633, -302320, -286834, -94562, 101385, 55046, 51074, -72830, -146098, -179071, -52222, -24027, 97772, 155188, 126128, -120191, -364427, -310196, -133217, -7427, 3603, -80252, -150065, -133183, -208901, -261989, -222307, -327186, -293517, -231856, -116152, -276910, -226081, -230055, -54012, 92126, 165448, 103421, 29098, 2077, 74890, 90792, 79971]
5632G9971n0016J6516j09282k6706r7364j10018P9392P8762J19790J77005j1202
5621A46848r7019j39971O0951M0348O7342q8293j0744L124k29041Q5512J17583
5610d3360j34801J29239J32593O2126j06796O6287m9694L7396o7514K2222K8604
5599G6302J01393m4935j7139k560k7828J30159J70097l14301o378l7846L9829
5588F6793P4198K05279j92112j27728K8792m7427k462j7594M8271J23557J73256
5577C32823J09604M6541j17397j1996L933j70465j08677Q7144m1438R5636o6356
5566A59352o7277Q8667J14355j4581M5931j22156m1778O2578J5419L029m4242
5555A99297J3496n4260J50666J29003r2607o5148j35797r0561l8359J2470j68973
$$ y = [79971, 29955, 46471, -62811, -89517, -186881, -296899, -217507, -138745, -18955, 158050, 146848, 49829, -90142, -29191, 11157, 78499, -9794, -20538, -17414, -246455, -160943, -43360, -178161, -48922, 83671, 145797, 39001, 105288, 55594, 92990, 25476, 47698, 76302, 177695, 132760, 115621, 113061, 85233, 215392, 385489, 71188, 64810, 26964, 66793, 140991, 346270, 154158, 26430, 55222, 7795, 5333, -12261, 36010, 159567, 332823, 442427, 488968, 371571, 359575, 363508, 193043, 84366, 171510, 130072, 225708, 159352, 92075, 180742, 295097, 280516, 326447, 204291, 162513, 225091, 240510, 243539, 199297, 212793, 158533, 309199, 438202, 345595, 280447, 144650, 54089, 15730, 28200, -140773]
5544a40773j46426l5076J09610J17301k7712J4157J7478J11784J5615j26838K4935
5533f5945k2974m8311J59674J12936L944L4136q8752M572n1956j18387J54397
5522G3334k4301J19104J67982q9729r9547n9614J43404J32398m4390j36433m8725
5511A33483J39367j1573N0720n4248r8126j8859j10246m4742J465P5242J6052
5500G8535j98644L268j0219j03003L8660N5256J07251K56864J07595j19447m1609
5489A74507k5210M843p5676k07587m5230K4217j55796n9435M6432J35003J28437
5478e5495Q9089p0157j37287l7782m623N0238J70662M2334J2680L9126R5693o5433
5466A29045j81950Q944J963N7208M4162j56329m9056j11099j39986K21552J67248
$$ y = [-140773, -287199, -322275, -212665, -95364, -123076, -108919, -91441, 20343, 35958, -90880, -65945, -88919, -137230, 22444, 135380, 139324, 173460, 84708, 89280, 37324, -81063, 73334, 49033, 168137, 336119, 246390, 146843, 87229, 230633, 363031, 318641, 182208, 133483, 272850, 261277, 311997, 257749, 159623, 140764, 30518, -14224, -12759, 62483, 78535, -120109, -116841, -127060, -230063, -191403, -136147, -28896, 227968, 335563, 216116, 174507, 149297, 154140, 78464, -129123, -174353, -150136, -305932, -365367, -318935, -183932, -55495, 33594, -36563, -173850, -211632, -216255, -166017, 4645, 46979, 59659, 98785, 194478, 129045, -52905, -43961, -41998, 15210, 59372, -96957, -146013, -257112, -397098, -175546, -8298]
5455h298N3668p3904n6372J15562N2123q9167N7361M747L4067p1533j95986L0784
5443a46948J54414j880j35908j78314O6104O0196J78509J97571J88806k0486j21319
5432B40745K3062j23225p8026j8986J34785P817O6154Q4355j35888K7679l7153
5421A91319K083k8578j515O832o0406l3308K806n4754O6259O809k36133k46730
5409c85316N1095Q4747Q5377o9370N8762P6628J71702j40745L0202J64256j56368
5398b9030p216J81067q6158j77977J39550J95700p7870r6236p6418j9887J27381
5387G2906N7207o6873k3246k4565J1829J41208j43124n8130j84246j9128J06452
5376a29710K22006R5324j07382j39835j34954j58777L7220O4012K15590J1026
$$ y = [-8298, 45370, -28534, -84906, 30656, 82779, -6388, 50973, 55720, 89787, 18254, -177732, -146948, 7466, 5586, -130322, -308636, -242532, -182336, -3827, 193744, 382550, 362064, 240745, 263807, 140582, 62556, 43570, 178355, 186172, 252326, 336681, 200793, 228472, 191319, 193402, 164824, 163309, 170141, 109735, 76427, 79233, 24479, 90738, 97547, -138586, -385316, -334221, -249474, -164097, -233467, -174705, -98077, 73625, -67120, -36918, 127338, -29030, -36246, 144821, 58663, -119314, 20236, 215936, 138066, 41830, -34588, -54475, 72906, 130113, 63240, 39994, 15429, 27258, 168466, 25342, -32788, -217034, -236162, -129710, 92296, 187620, 80238, -59597, -194551, -353328, -316108, -252096, -36506, -25480]
5366b5480P7996J14999J05374J3850n4018j41650O7930O0505k025J0071N8089
5355B85641l6324j86595j7187J16948r0028k8768R2516M6950j22844p0332R7038
5344H7015J2902J05076j3512O2274J0370j14335J1068N1801n6319j60511Q3847
5333G9676N0183P57Q5207n3975j64812m5033L5347p6385j9632J42285J05700j01072
5321C8246j04646J906J30895L2810j97374r47J61855K1838k7838p7729j0230R2612
5309F1398R0084K6327n337k8195p9627K3167j61486L2102L574j4404q2399m8072
5297a82868n152K7213K66642M3495n2976J6368j97329j09269J89481l9999j31876
5286a76270K06322j01988R1651m1588k08307r8676J1610J74636P6081j15640K9710
$$ y = [-25480, 52516, 167515, 272889, 286739, 232721, 91071, 159001, 219506, 217481, 227552, 285641, 249317, 62722, 45535, 162483, 72455, 43687, 136203, 183153, 60309, -10023, 87015, 99917, 204993, 191481, 253755, 264125, 149790, 160858, 212659, 156340, -4171, 79676, 129859, 130616, 215823, 161848, -2964, -47997, -12650, -89035, -108667, 33618, 139318, 38246, -66400, -64494, 66401, 99211, -98163, -99110, 62745, 84583, 56745, -20984, -31214, 61398, 151482, 177809, 172472, 144277, 64650, 87817, -73669, -41567, -37993, -52397, -134796, -182868, -188020, -160807, 105835, 149330, 96354, 112722, -84607, -193876, -4395, -44394, -176270, 30052, -71936, 19715, -21873, -230180, -328856, -317246, -142610, -66529, -182169, -152459]
5275a52459r4849Q1708J86271q6445j26164P5183P6286k7274J8510K27693O9632
5264B48092k66716j26925p8636L0469J53413J23990M7133n4821m7375Q3186N7620
5253A69430l4321q4863j93221J4097O9819R4663J21694j98090l2632K11177J64641
5242C02394j21533j85263n2754l0222l011J1152R1071P1489j73226J36487K44539
5231B91123J11347j22427l6529j2357j11257j85829J09451j898N1004Q9619p4044
5220A08203j98314j8162O0340J23457N8530m5465n0443J41254P0842N9709n2280
5209B57671j93997j08877J41896R1567p2791k9852m1912n8921N6701K45381m7384
5198B39482L5519L5756j2362j8406o003k709p4699k6933j01546k35305P6927j41909
$$ y = [-152459, -247308, -165600, 20671, -65774, -191938, -116755, -40469, -67743, -49233, 178460, 248092, -18624, -145549, -224185, -193716, -40303, 83687, 130820, 75999, 28624, 111810, 169430, 135109, 50246, -142975, -128878, -59059, 35604, 157298, -40792, -73424, 137753, 302394, 180861, -4402, -57156, -87378, -90389, -79237, 11834, 83323, -89903, 46584, 291123, 402470, 280043, 243514, 231157, 119900, -65929, 43522, 41624, 92628, 182247, 108203, -90111, -108273, -47933, 75524, 134054, 88589, 38146, 179400, 250242, 309951, 257671, 63674, -45203, 96693, 188260, 115469, 85617, 43705, -15216, 41485, 286866, 239482, 275001, 310757, 298395, 279989, 273986, 271277, 196578, 169645, 68099, -167206, -90279, -232188]
5186b32188K5287N3244J9057n6391J57655K4061L3203l5502Q014Q9529J41965
5175B27934P6350k1622j25531r4465J32170J58647n8594k09395o5024j59332N1943
5164h6919J44639j00899Q3074M4892M4856J00291q7212l77057p3479K03855Q6040
5153a7919k24742p0091O494m9847P4605L5529J16235J09234j1878j64101M06K16059
5141A9984Q9798q3811j24079P5849J54970N0062p9528n6568j02134k1045q6781
5130a63283J17877O635N6077j40696j00869N5442K23289J24405q7126j14595J00242
5119G7398M7925K2804m0461o7337J2382o7827M3533J61910J57608m8303l6856
5108B62776j19752j88102J03809o2566j42031J23493r1777m2123M8363o0553O1679
$$ y = [-232188, -206901, -153657, -134600, -190991, -33336, -9275, 23928, -11574, -3560, 85969, 227934, 304284, 282662, 157131, 62666, 194836, 353483, 294889, 85494, 20470, -138862, -86919, 57720, -43179, 39895, 84787, 129643, 229934, 142722, -234335, -307814, -103959, -17919, -242661, -312752, -306258, -356105, -281500, -245971, -129736, -20502, -32380, -196481, -196075, 19984, 109782, 25971, -98108, -22259, 132711, 182773, 103245, 46677, -55457, -76502, -163283, -45406, -38771, 17306, -123390, -224259, -168817, 54472, 178877, 91751, -22844, 77398, 125323, 148127, 107666, 40329, 52711, -15116, 28417, 190327, 347935, 299632, 262776, 143024, -45078, 58731, -3835, -145866, -22373, -114150, -156273, -107910, -168463, -106784]
5097a06784J86892N3128r6453j19132K3688j17759J4233J56704p6191N9498M8238
5086B6062q974j32533P156J0154k82050P6713K78295l221M9784J26314j7806N7196
5074A87090k2257M9031o100o238r5441j81966N0686O3347m9501N1452J7639J46077
5062B03819l9580j4086J61119P6018j16345j87467n966j05583j0234J58002n6828
5051F2869j16819n8458N5738p6413M6460J09823L1349J34388K8454j16441O688
5040A07638M339r6776j99383P7175R5952P4141J31729L2911N4998J0880j77193
5029A16411Q3269m3379j77406k54902j74644J82817J12132q7062J40555J89425
5019H7216J2412j22415J01712J13247j18561j30649K4370Q373l2984N5589N5332
$$ y = [-106784, 80108, 133236, 36783, -82349, -58661, -176420, -162187, -5483, -81674, -22176, 26062, 17088, -115445, -108289, -98135, -380185, -303472, -25177, -28398, 21386, 147700, 129894, 187090, 164833, 213864, 207764, 201526, 106085, -75881, -25195, 38152, -11349, 40103, 57742, 203819, 164239, 150153, 311272, 387290, 270945, 83478, 77512, -28071, -38305, 119697, 62869, -53950, -112408, -56670, -133083, -86623, 23200, 54549, 188937, 217391, 100950, 107638, 111977, 15201, -184182, -107007, -11055, 63086, 194815, 227726, 282724, 293604, 116411, 199680, 156301, -21105, -276007, -450651, -267834, -155702, -242764, -102209, 87216, 99628, -22787, 78925, 192172, 73611, -57038, -32668, -24295, -57279, -1690, 53642]
5008E3642k79240r1976O6108N1838P2567Q8859r4142j29262j62752J36606J20552
4997a67200N7758L2590K19648P0032j10313k0747L2843r336J55535J51907r6337
4986C16380k10802K2196j66488r7735K31987J47030j58612o0699J33190r0815
4976F5632P7787r917m2121m411p9748k0235q8493J5824m9526J77707l8996j15425
4964a11922k7900K18758n4116j0162o0207Q4073J06175J19343J17978l6552m4209
4953C01259J03029J6964j56495o3321j45752r4228k3577P9412J29579Q4214k6202
4942B04882j43608j30756n5358R1053j392K495q5817J324J71038J03495j42566
4931A4790J0673k3977q1368L4052O2508R8022m630P1503o218N748k2586p2028
$$ y = [53642, -225598, -317574, -251466, -199628, -127061, -38202, -132344, -261606, -424358, -287752, -167200, -109442, -76852, 142796, 212828, 102515, 81768, 114611, 105275, 260810, 412717, 316380, 105578, 127774, -38714, -136449, 95538, 242568, 83956, 23257, 156447, 65632, 143419, 133502, 91381, 86970, 7222, -13013, -101506, -85682, -135208, 42499, 3503, -111922, -139822, 78936, 24820, 14658, -45549, 38524, 144699, 264042, 382020, 345468, 301259, 404288, 421252, 264757, 201436, 55684, -38544, -62121, 17291, 146870, 231084, 204882, 61274, -69482, -124840, -33787, -35179, -32684, -118501, -117177, 53861, 157356, 14790, 25463, 1486, -79882, -45830, 16678, 114700, 110070, 181573, 175355, 181103, 158517, 86489]
4919H6489k843l0123l3263q0286J44540M5051K3433K26173j82217j5697J3957
4908A95214p4551j04772m0424J40244R984j2078q9212j70410k5213J1921r4490
4897b53787N7220R5245J25576R3501J04313Q053j71005k161m5042o549j30563
4886a25199n8724O0263K53561K328j53763R1153J21901P5436N7271j06524j65325
4875E2378R5657M1558j29617r9719P0932j01218Q5706P5920j12228o3074r27J60407
4863G5775R0518r7194n490n3141j59104N6310l2023j52746k9836K27572L10271
4852B30912l0837o5825k331R1219N6089P9728k28716j90563j3493M5499J21372
4841I3054J22426j31388J28711K2597R9521P9184m4792q9633j07219o7517N3848
$$ y = [86489, 83646, 53523, 20260, -60026, 84514, 129565, 152998, 379171, 196954, 181257, 195214, 120663, 15891, -24533, 115711, 125695, 113617, 24405, -146005, -171218, -159297, -253787, -196567, -101322, 24254, 117755, 222068, 230121, 59116, 56955, 11913, 5364, -125199, -183923, -123660, 129901, 132229, -21534, 69619, 191520, 266956, 324227, 217703, 52378, 148035, 189593, 59976, -39743, 31189, -70029, 15677, 91597, -20631, -83705, -84632, 75775, 166293, 69099, 63609, 10468, -148636, -92326, -124349, -277095, -306931, -79359, 230912, 200075, 134250, 131919, 223138, 279227, 358955, 130239, -60324, -73817, -28318, 93054, 215480, 84092, 212803, 235400, 334921, 414105, 369313, 279680, 172461, 104944, 158792]
4830A58792q2876j84381r4866m1744J59085K36333j14742j08052k6261R5552J03591
4819A00431l3691j83088j07048J02204j1956L4458O6983O4736n1681k844J68636
4808A47140j19934j29600q2554J5369r2199J38943O162q4412r9079m5940O3025
4797b83079R6640J63071q5864l0722k00592j35o0293M7916K55450J88978R3372
4786A84742J9105l2408M2516o4694j08243P2820K1718o8642p0804k3945j23679
4775a51514o3759Q9567R6435L4044O2950J52826Q691j47707j13699k6848n3327
4764a12341m9757o9436J54257J03566p4576J20803j58871j20643J7004K0957K8235
4753a40802K34770j29302M7851j67289l9152L8032J44306Q9093m1098k03550K4249
$$ y = [158792, 75916, -108465, -203331, -245075, -85990, 150343, 35601, -72451, -98712, -3160, 100431, 66740, -116348, -223396, -121192, -133148, -98690, -31707, 33029, -18652, -21496, 147140, 27206, -102394, -184948, -169579, -261778, -122835, -116673, -201085, -300164, -346104, -283079, -186439, -23368, -109232, -139954, -340546, -340681, -400974, -353058, -97608, 91370, 184742, 203847, 171439, 213955, 149261, 41018, 113838, 135556, 66914, -3890, -27835, -151514, -215273, -125706, -29271, 4773, 67723, 220549, 229240, 81533, -32166, -59014, -112341, -162098, -231534, -77277, 26289, -48287, 72516, -86355, -206998, -189994, -169037, -140802, 93968, -35334, 12517, -154772, -193924, -155892, -11586, 77507, 36409, -167141, -142892]
4742a42892O7142M2779k7120J56124M7538j57092K665p9230m784J11416J09771
4731A26317J8845J48008p2544O73o662K4701j50942p1704k50651j11462J71857
4720a73564J41770j78652o7517N7555P9244N3549k7772J93503R1036n7412j79126
4709f7386j55247l2097L6277J83765J40623N131j34790o4937m5993N4832k02580
4698b82402j23416R6459J22157M0679L5561J6190J72825p7606M9878N1021r1183
4687A0163k10641J4531L8503m4950r185O1730K8028O8162j6354J23148L1742P847
4675A02724n0687O7983O3944r5916j07911j14017j08035J29820J00530J8693o6230
4664e9102n820n2908j0612J55275K2389m2277J5633L7101k49934o6846J12691
$$ y = [-142892, -75750, -32971, -60091, 96033, 143571, -13521, -10856, -90086, -94870, 16546, 126317, 145162, 293170, 220626, 221299, 214637, 239338, 88396, 16692, -233959, -345421, -173564, -31794, -210446, -277963, -220408, -141164, -87615, -115387, 78116, 169152, 111740, -67386, -222633, -254730, -218453, -34688, 105935, 111066, -23724, -88661, -134654, -79822, -282402, -405818, -309359, -187202, -146523, -110962, -94772, 78053, 447, 50325, 101346, 10163, -200478, -185947, -147444, -192394, -201579, -139849, -111821, -43659, -60013, 63135, 94877, 102724, 52037, 120020, 183964, 88048, -19863, -133880, -241915, -112095, -11565, 7128, -59102, -64922, -117830, -128442, 26833, 49222, 6945, 22578, 59679, -190255, -257101, -144410]
4653a44410Q5598P1688J36211k6450o7329j77484p7901J06564J59146n7991j24816
4642a17174R4480q0927j92145M0689P2285p1462M4602R683Q0435n305n6209Q7355
4630i3693Q3279N1103J95930k6640j24351j94656q6506m4515O6378J57111O9590
4619E3030m1609O2107M7617J32947O0745o9475j89159r4351k5732J4521p1651
4608a21010m4666O3513J27831L0316j2139q3676k2741J74770M9669k187j21817
4597C7863J82826J28164j25648J5899o8693j29623j7649n3864o3388m1385J32037
4586c461k9694P385J26671k912j42546m5350j11906M2117J01061m6680j7501J44164
4574B1348q1090q8302n0648k0606J72035J54711J14731p0549n6140k0044P8850
$$ y = [-144410, -58812, 12876, 149087, 122637, 55308, -122176, -200077, -93513, 65633, 7642, -117174, -22694, -103621, -295766, -255077, -182792, -254254, -209652, -199969, -119534, -124839, -181048, -93693, -10414, 40689, 236619, 209979, 85628, -109028, -195534, -240049, -173671, -16560, 53030, 11421, 73528, 121145, 254092, 314837, 245362, 56203, -38148, -63880, -49359, -121010, -165676, -102163, 25668, 55984, 43845, -39831, -62572, 112198, 161867, 159680, 37863, 220689, 348853, 223205, 239104, 170411, 40788, 23139, -30725, -94113, -135498, -3461, -33155, -25770, 100901, 97989, -44557, -89907, -201813, -159696, -58635, -105315, -122816, 21348, -59742, -148044, -198692, -219298, -47263, 107448, 222179, 151630, 95490, 75446, 154296]
4563A54296J49514j27777k18094L0833P0536n7130P3139K06698n6241o1175m2398
4552A22201j07336K789j66925l44926j21891K55458J87624N0423n0491q2835N6864
4541a99045M5549j8493j92352r0586L1331J07295P3620m0139J18170l1985q1004
4530b77639l0523J02683O2562n1497J4159M6872k1746K7388P6699J61731q67n0579
4518E9243j38564l6895J23241n0152m0063j4085l2041q4838J4254J68141N9237
4507B7478P9681r7405j09503q4999K0580J39179J04621J71127l5280j48399N211
4496G2291J69382q0359j72688m2245p5237O0745N2436J12375l5585r3519L0253
4485b151m7497K5973L5683j55991L6132O7692j07443l3102K17599O8092n4579
$$ y = [154296, 303810, 176033, -42061, -11228, 59308, 2178, 75317, 282015, 225774, 164599, 122201, 14865, 17654, -149271, -494197, -616088, -360630, -173006, -122583, -173074, -255909, -199045, -153496, -171989, -364341, -454927, -423596, -316301, -242681, -282820, -164650, -196635, -277639, -308162, -205479, -142917, -194414, -180255, -133383, -155129, -127741, -51042, 110689, 109822, 59243, -79321, -116216, 7025, -43127, -83190, -97275, -129316, -214154, -199900, -31759, 27478, 107159, 9754, -99749, -184748, -164168, -24989, 79632, 250759, 215479, 67080, 72291, 241673, 161314, -11374, -53619, -128856, -68111, -15675, 96700, 61115, -32404, -2151, -49648, -23675, 12008, -143983, -107851, -40159, -147602, -180704, 36895, 104987, 50408]
$$ [...]
##END NTUPLES=NMR SPECTRUM
##END=
