##TITLE=Analysis number 328785
Compound Code cc 03609
Book Reference 508/114
Project Code adrs
Chemist Name antons
##JCAMPDX= 6.0         $$ Bruker NMR JCAMP-DX V2.0
##DATA TYPE= NMR SPECTRUM
##DATA CLASS= NTUPLES
##ORIGIN= Bruker BioSpin GmbH
##OWNER= nmr
$$ XWIN-NMR		Version 3.5
$$ Tue Jul  3 14:00:20 2007 GMT Daylight Time (UT+1h)  MAYBRIDGE\nmr@NMR_250MHZ
##.OBSERVE FREQUENCY= 250.131544655141
##.OBSERVE NUCLEUS= ^1H
##.ACQUISITION MODE= SIMULTANEOUS (DQD)
##.ACQUISITION SCHEME= undefined
##.AVERAGES= 16
##.DIGITISER RES= 18
##SPECTROMETER/DATA SYSTEM= dpx250
##.PULSE SEQUENCE= zg30
##.SOLVENT NAME= CDCl3
##.SHIFT REFERENCE= (INTERNAL, CDCl3, 0, 16.4613)
##AUDIT TRAIL= $$ (NUMBER, WHEN, WHO, WHERE, WHAT)
$$ ##TITLE= Audit trail, XWIN-NMR		Version 3.5
$$ ##JCAMPDX= 5.01
$$ ##ORIGIN= Bruker BioSpin GmbH
$$ ##OWNER= nmr
$$ C:\u/data/dgb/nmr/ADRS/300/pdata/1/auditp.txt
$$ ##AUDIT TRAIL=  $$ (NUMBER, WHEN, WHO, WHERE, WHAT)
(   1,<2007-07-03 13:59:57.56 +100>,<MAYBRIDGE\nmr>,<NMR_250MHZ>,
      <created by zg, POWCHK disabled, PULCHK disabled
       configuration hash MD5:
       76 6E 9A 78 1E 09 19 81 EC 84 63 8F B0 6A 59 2D
       data hash MD5: 64K
       22 AC E0 15 C4 17 E7 0D 2F F6 CC 61 C8 77 1C 69>)
(   2,<2007-07-03 14:00:10.05 +100>,<MAYBRIDGE\nmr>,<NMR_250MHZ>,
      <Start of raw data processing
       ef LB = 0.3 FT_mod = 6 PKNL = 1 SI = 32K 
       data hash MD5: 32K
       8F 5A 6F 4F FE 50 FB C8 28 AD A8 66 E9 D5 43 63>)
(   3,<2007-07-03 14:00:11.78 +100>,<MAYBRIDGE\nmr>,<NMR_250MHZ>,
      <apk 
       data hash MD5: 32K
       F6 D2 4B 99 9F 56 35 0D F2 E9 67 6D B0 7F 52 61>)
(   4,<2007-07-03 14:00:12.50 +100>,<MAYBRIDGE\nmr>,<NMR_250MHZ>,
      <abs ABSG = 5 
       data hash MD5: 32K
       A2 F2 3E B1 44 5D BB A1 74 07 4A B6 A3 EB E7 B1>)
$$ ##END=
$$ 
$$ hash MD5
$$ 41 3A 3B 5D B3 DE 44 A1 2A 19 4A 34 5E BF 66 9A
##$RELAX= 
##$RELAX= 
##$RELAX= 
##$RELAX= 
##$RELAX= 
##$RELAX= 
##$RELAX= 
$$ Bruker specific parameters
$$ --------------------------
##$DU= <C:\u>
##$EXPNO= 300
##$NAME= <ADRS>
##$PROCNO= 1
##$TYPE= <nmr>
##$USER= <dgb>
##$AMP= (0..31)
100 100 100 100 100 100 100 100 100 100 100 100 100 100 100 100 100 100 
100 100 100 100 100 100 100 100 100 100 100 100 100 100 
##$AQSEQ= 0
##$AQ_mod= 3
##$AUNM= <au_zg>
##$AUTOPOS= <38 >
##$BF1= 250.13
##$BF2= 250.13
##$BF3= 250.13
##$BF4= 250.13
##$BF5= 500.13
##$BF6= 500.13
##$BF7= 500.13
##$BF8= 500.13
##$BYTORDA= 1
##$CFDGTYP= 0
##$CFRGTYP= 5
##$CHEMSTR= <none>
##$CNST= (0..31)
1 1 145 1 1 1 1 1 1 1 1 1 1 1 1 1 1 1 1 1 1 1 1 1 1 1 1 1 1 1 1 1 
##$CPDPRG= <>
##$CPDPRG1= <>
##$CPDPRG2= <>
##$CPDPRG3= <>
##$CPDPRG4= <mlev>
##$CPDPRG5= <mlev>
##$CPDPRG6= <mlev>
##$CPDPRG7= <mlev>
##$CPDPRG8= <mlev>
##$CPDPRGB= <>
##$CPDPRGT= <>
##$D= (0..31)
0 1 0 0 0 0 0 0 0 0.06 0 0 0 0 0 0 0.0002 0 0 0 0 0 0 0 0 0 0 0 0 0 0 
0 
##$DATE= 1183467595
##$DBL= (0..7)
120 120 120 120 120 120 120 120 
##$DBP= (0..7)
150 150 150 150 150 150 150 150 
##$DBP07= 0
##$DBPNAM0= <>
##$DBPNAM1= <>
$$ [...]
##$SUBNAM7= <"">
##$SUBNAM8= <"">
##$SUBNAM9= <"">
##$SW= 20.6930455092707
##$SWIBOX= (0..15)
0 0 3 0 0 0 0 0 0 0 0 0 0 0 0 0 
##$SW_h= 5175.983436853
##$TD= 65536
##$TD0= 1
##$TE= 296.16
##$TE2= 300
##$TE3= 300
##$TEG= 300
##$TL= (0..7)
0 120 120 120 120 120 120 120 
##$TP= (0..7)
150 150 150 150 150 150 150 150 
##$TP07= 0
##$TPNAME0= <>
##$TPNAME1= <>
##$TPNAME2= <>
##$TPNAME3= <>
##$TPNAME4= <>
##$TPNAME5= <>
##$TPNAME6= <>
##$TPNAME7= <>
##$TPOAL= (0..7)
0.5 0.5 0.5 0.5 0.5 0.5 0.5 0.5 
##$TPOFFS= (0..7)
0 0 0 0 0 0 0 0 
##$TUNHIN= 0
##$TUNHOUT= 0
##$TUNXOUT= 0
##$USERA1= <user>
##$USERA2= <user>
##$USERA3= <user>
##$USERA4= <user>
##$USERA5= <user>
##$V9= 5
##$VALIST= <valist>
##$VCLIST= <CCCCCCCCCCCCCCC>
##$VD= 0
##$VDLIST= <DDDDDDDDDDDDDDD>
##$VPLIST= <PPPPPPPPPPPPPPP>
##$VTLIST= <TTTTTTTTTTTTTTT>
##$WBST= 1024
##$WBSW= 4
##$XGAIN= (0..3)
0 0 0 0 
##$XL= 0
##$YL= 0
##$YMAX_a= 404171
##$YMIN_a= -368062
##$ZGOPTNS= <>
##$ZL1= 120
##$ZL2= 120
##$ZL3= 120
##$ZL4= 120
##$ABSF1= 16.46134
##$ABSF2= -4.231833
##$ABSG= 5
##$ABSL= 3
##$ALPHA= 0
##$AQORDER= 0
##$ASSFAC= 0
##$ASSFACI= 0
##$ASSFACX= 0
##$ASSWID= 0
##$AUNMP= <proc_1d>
##$AZFE= 0.1
##$AZFW= 0.1
##$BCFW= 0
##$BC_mod= 0
##$BYTORDP= 0
##$COROFFS= 0
##$CY= 12.5
##$DATMOD= 1
##$DC= 0
##$DFILT= <>
##$DTYPP= 0
##$F1P= 14.0000005364418
##$F2P= -0.99999901652339
##$FCOR= 0.5
##$FTSIZE= 32768
##$FT_mod= 6
##$GAMMA= 0
##$GB= 0
##$INTBC= 1
##$INTSCL= 1
##$ISEN= 128
##$LB= 0.3
##$LEV0= 0
##$LPBIN= 0
##$MAXI= 10000
##$MC2= 0
##$MEAN= 0
##$ME_mod= 0
##$MI= 0
##$NCOEF= 0
##$NC_proc= -3
##$NLEV= 6
##$NOISF1= 0
##$NOISF2= 0
##$NSP= 0
##$NTH_PI= 0
##$NZP= 0
##$OFFSET= 16.46134
##$PC= 1
##$PHC0= -49.77012
##$PHC1= 6.15719
##$PH_mod= 1
##$PKNL= yes
##$PPARMOD= 0
##$PSCAL= 4
##$PSIGN= 0
##$REVERSE= no
##$SF= 250.130015171151
##$SI= 32768
##$SIGF1= 0
##$SIGF2= 0
##$SINO= 400
##$SIOLD= 32768
##$SREGLST= <1H.CDCl3>
##$SSB= 0
##$STSI= 32768
##$STSR= 0
##$SW_p= 5175.98343685301
##$SYMM= 0
##$S_DEV= 0
##$TDeff= 65536
##$TDoff= 0
##$TI= <Analysis number 999999
Compound Code 99
Book Reference 9
Project Code 9>
##$TILT= no
##$TM1= 0
##$TM2= 0
##$TOPLEV= 0
##$USERP1= <user>
##$USERP2= <user>
##$USERP3= <user>
##$USERP4= <user>
##$USERP5= <user>
##$WDW= 1
##$XDIM= 32768
##$YMAX_p= 527235094
##$YMIN_p= -98527
$$ End of Bruker specific parameters
$$ ---------------------------------
##NTUPLES= NMR SPECTRUM
##VAR_NAME=  FREQUENCY,     SPECTRUM/REAL,   SPECTRUM/IMAG
##SYMBOL=    X,             R,               I
##VAR_TYPE=  INDEPENDENT,   DEPENDENT,       DEPENDENT
##VAR_FORM=  AFFN,          ASDF,            ASDF
##VAR_DIM=   32768,         32768,           32768
##UNITS=     HZ,            ARBITRARY UNITS, ARBITRARY UNITS
##FACTOR=    0.157963299565203, 1,           1
##FIRST=     4117.47521157143, 0,            0
##LAST=      -1058.50822528158, 0,           0
##MIN=       -1058.50822528158, -98527,      0
##MAX=       4117.47521157143, 527235094,    0
$$ Real data points
##PAGE= N=1
##DATA TABLE= (X++(R..R)), XYDATA
$$ [...]
22668 34922 26835 11439 9119 -26081 -23690 -10944 -11084 17321 9537 -5415 -7248 -5820 -15992
22655 -15992 -38491 -33136 -47451 -41190 -23035 -11398 -19899 -32845 -35446 -12394 -5083 15519 1360
22642 1360 -296 -15352 -16309 -30327 -21203 21660 40795 35288 10330 7651 -5061 15149 6999
22629 6999 9953 21510 38067 56802 43371 9828 12472 14766 14281 5291 -16166 -27674 -38080
22616 -38080 -21562 -27089 -17781 8255 3807 -18398 -9902 -27152 -7535 22056 39342 46103 25278
22603 25278 5153 8192 1937 -14252 -7709 26459 754 -15367 10451 30032 -15375 9541
22591 9541 50015 40621 29189 23398 26790 -3149 -12826 -8441 -22188 -28789 -55347 -39237 -28732
22578 -28732 -48734 -36222 -9760 -214 -2075 2719 -25923 -42461 -39117 -29210 -31713 -5747 31703
22565 31703 -14145 -29131 -35131 -37193 -26991 -10625 -8215 -1655 -5780 -24016 -59214 -48376 -36965
22552 -36965 -32175 -24848 -37253 -70946 -72374 -34041 -17379 -20778 -47419 -23826 -19130 -18342 -19472
22539 -19472 334 37042 31593 10690 7575 -17155 -25246 -14060 -31476 -50761 -41021 -26143
22527 -26143 -19343 -34687 -33255 10246 23884 14032 10625 20260 44235 43710 34503 19427 1333
22514 1333 11665 34171 14445 3892 -11603 1157 16543 6182 5526 19971 12402 2573 25357
22501 25357 37645 -12694 -46488 -45758 -42461 -47289 -51462 -60911 -72010 -62327 -22052 -13376 -8795
22488 -8795 -23339 -37039 -32933 -33202 -26563 -1087 10487 20593 14805 12011 -4237 -13968 3409
22475 3409 16154 1983 1212 -6314 2637 18764 27539 1961 -21336 -22094 -34394 -16412 -10915
22462 -10915 1853 15905 29405 12966 -12043 -27008 -34080 -14427 -7170 -14265 -30644 -43580
22450 -43580 -14253 -2288 -23963 -27624 -16987 -7559 -6795 -8523 -17326 7914 7653 -9924 859
22437 859 -13003 -17759 -17832 -35215 -25328 -13909 858 -15529 -13332 685 -34462 -56015 -20328
22424 -20328 -23566 -23128 -12422 -15919 -10388 -3349 -3315 8138 9695 8881 28982 51647 35280 11308
22410 11308 5224 -3082 3061 -5100 -17902 1917 9035 -5402 -10056 4830 11068 -8161 -13341
22397 -13341 -33887 -26281 -11730 762 7932 -11722 -31000 -62644 -46143 -9785 16179 3524
22385 3524 -92 11658 24783 20776 -7124 -15038 -31282 -23002 -4538 -22642 -14733 -16533 -30595
22372 -30595 -27581 -15086 -17560 -34462 -36364 -11855 1822 -7448 1328 19727 24921 12330 10264
22359 10264 36612 50878 52705 37600 56163 46550 45619 49319 11828 -15623 -34318 -38041 -21161
22346 -21161 -10643 -2309 -17481 -40021 -4449 1209 -9389 -3127 -8712 -26887 -11593 -5253 -3893
22333 -3893 19526 22331 13474 12827 -29487 -27381 3330 14318 4660 -18225 -28137 -1330 11507
22320 11507 16455 -11177 -50626 -47163 -31688 -35192 -20706 -29859 -24201 -16918 -21809 -7088 7320
22307 7320 15032 -19933 -11610 -9604 -5101 -13767 -12582 -2419 -16893 -34250 -40950 -17842 -11582
22294 -11582 -44180 -41359 -23523 -4552 4873 -10257 -22694 -16268 -21186 -44094 -16806 -5867
22282 -5867 -14897 -21875 -42983 -36340 -42492 -38266 -17808 -23786 -50759 -55920 -28660 6770 1762
22269 1762 13823 41849 42041 3367 -6488 -31613 -43046 -15604 -2281 6309 30012 28554 7052
22256 7052 -24135 -36762 -16394 -4439 2670 -3466 3937 17746 17728 24399 28804 7771 9433 -6641
22242 -6641 -19232 -27115 -26186 8344 28782 50731 29877 -2015 -41408 -44505 -17850 -30834 -34280
22229 -34280 -54856 -70714 -44361 -26608 -36975 -21628 -16612 -39795 -65109 -47454 -31510 -30101
22217 -30101 -1744 4735 16483 16733 20594 8665 -11401 -1827 -637 9218 24324 8977 8237
22204 8237 25116 11896 -12433 -18845 -26938 -26282 -26024 -5158 13625 -14031 -28358 -25785 -15160
22191 -15160 -7415 -17660 -16435 -2863 5110 -7671 -5625 26298 15086 -1516 7333 -3636 17019
22178 17019 20598 638 1154 33357 26638 -5675 -10193 286 2898 -27249 -19150 -9263 -1466
22165 -1466 22625 35155 20685 -3191 -3181 21033 17766 13472 13275 16298 18097 22615 34033 21324
22151 21324 -1776 -6514 6157 -2276 -7572 1015 14806 18959 12559 -11083 -2175 18079 20779
22138 20779 27922 31451 37513 19301 -24021 -10198 28824 20227 -143 -7805 -28431 -22270 -11863
22125 -11863 1857 -14451 -23373 -16202 -8452 -18510 10475 9663 -24124 -12809 -2757 -19539 -30584
22112 -30584 -23589 -11311 5403 8459 14946 27707 64014 55762 4529 -17920 14983 13162 29625
22099 29625 12301 2776 14008 -5189 -43093 -47985 -46897 -28552 -178 -453 -6686 -46533 -81734
22086 -81734 -68137 -40494 -50772 -39235 -35261 -39982 -49046 -37350 -15519 -36459 -31219 -15993
22074 -15993 -6989 -31510 -24024 -6530 -9151 -3605 -8490 -11388 -16532 -12756 -32118 -43637 -28299
22061 -28299 5683 -415 -11412 -4886 6722 29358 37915 39835 53762 27600 17589 16784 6767
22048 6767 39141 51970 30789 -7379 2190 34101 31384 35588 43913 25041 17131 15412 19042
22035 19042 22805 7874 15448 29475 35295 26452 26568 17552 27909 25185 17047 12256 21745 26452
22021 26452 13004 17026 37159 35669 45753 33873 32485 -3104 -9148 1926 -7426 -1876 -699
22008 -699 5319 11586 -988 2705 8344 -12263 4746 -18005 -40260 -6383 6332 716 -19502
21995 -19502 -38989 -17604 -44956 -43532 -25056 -23319 -16328 -811 -8211 96 13036 12922 22935
21982 22935 -9687 -18114 -15870 -104 11592 -10501 -34117 -33427 -11428 5961 16639 17721 -6113
21969 -6113 1084 5608 -7998 4552 7544 -3617 -4859 -29629 -53834 -23136 -1906 1992 -30367
21956 -30367 -49829 -54060 -61019 -64228 -55421 -73620 -76667 -37564 5994 -21163 -45432 -48609 -46312
21943 -46312 -39627 -30475 -6479 16952 23403 26786 23308 -8182 -40078 -22372 -29355 -43592 -15068
21930 -15068 -10313 -19055 -16001 19464 5602 -10415 -24148 -38278 -1272 44370 37967 4622
21918 4622 -20908 -25236 -4176 -4907 -23913 -42571 -63579 -31668 -24240 -30522 -25975 -33990 -15441
21905 -15441 14912 7156 -18491 -35813 -43367 -54611 -68184 -80202 -80670 -59845 -30179 -32498 -30757
21892 -30757 -28985 -25487 -12776 -11915 -17500 -7138 14108 14533 -9626 -8968 -3178 2108 -4710 -6207
21878 -6207 3536 8876 -10882 -39720 -30524 -28633 -17885 -24451 -24365 -1677 15864 15436 5213 -5418
21864 -5418 -2660 -6152 -28182 -25780 -34333 -32211 -4842 18276 16343 14131 8784 18551 33171 27075
21850 27075 2090 -15259 -26096 -36552 -25740 -37914 -28278 -22665 -20222 -36788 -24940 -36998
21838 -36998 -45662 -34735 14544 41904 37884 29245 22027 -967 7053 16356 5064 1664 16485
21825 16485 30074 4306 17410 32314 20228 26104 35984 8453 -19335 -24904 -22369 -9015
21813 -9015 218 -2499 -4792 10748 16709 10583 3585 2941 -2964 -13927 -5589 -11965 -22492 -12823
21799 -12823 -1876 1624 11379 -17661 -8838 -14057 -47886 -59871 -64358 -53345 -33998 -23950 -24460
21786 -24460 -37968 -41625 -36970 -47374 -40735 -39880 -47500 -51931 -19550 -8730 -11525 7375 20417
21773 20417 23731 11456 -294 -15974 -17120 -9605 -46759 -44959 -15579 11547 32030 5940
21761 5940 -23314 -22179 -2132 -9785 -27973 -26651 -29972 -45094 -34294 -23132 -24464 -37304 -20579
21748 -20579 11931 8171 9092 -16493 -5401 -1309 -16872 -4714 19993 28788 5456 2487 8030
21735 8030 18033 5881 -14561 -43560 -29585 27991 40464 7789 21567 28920 12358 7033
21723 7033 9977 -14913 -6123 -17549 -23226 -12755 -9844 -20558 -18027 -8089 -752 5475 9310 -11277
21709 -11277 -3640 5641 -7733 -23091 -40647 -21936 -12818 -925 580 2209 40165 33415 18191
21696 18191 -11731 -9618 -23174 -14366 25440 1103 -3466 7506 -6277 -23947 -20261 -7303
21684 -7303 24084 24766 20674 19396 2515 -22348 -45203 -66873 -46672 -2820 -5635 -24421 -23413
21671 -23413 -37586 -20948 -17270 -3773 -8512 -7952 4702 -80 -567 -20610 -31955 -42770 -33120
21658 -33120 -45017 -31147 -4056 -12880 -9866 -4240 -28013 -28201 1133 3540 6038 13581 9474
21645 9474 -17168 -30657 -40593 -14828 17579 5745 -35128 -75110 -38096 -8542 -9 -13112
21633 -13112 4036 1584 -11530 -6652 -4474 -3431 -22131 4226 4416 -10191 -8605 -16906 -20363
21620 -20363 -1386 -2845 18188 12231 -5549 3632 40953 17226 4854 273 11673 34354
21608 34354 55935 25000 7122 24432 22653 13280 554 -41573 -30912 -17877 -30308 -50814
21596 -50814 -25318 -16262 8664 11635 153 -11077 -8373 2278 -8967 -11058 -33582 -49191
21584 -49191 -54180 -31536 -1506 658 20775 33120 24837 2976 10320 19390 293 -43695 -64286
21571 -64286 -53194 -32657 -29504 -15232 -35220 -41952 -25070 -19152 -12970 -10520 -32249 -40757 -50692
21558 -50692 -29595 -30867 -43590 -54040 -36912 -15751 7308 19207 8753 -18532 -4714 13255
21546 13255 24043 20343 -3590 -16995 15147 10861 -19110 -19856 -15594 -22390 -15172 6126 44136
21533 44136 63395 54331 29785 33479 50088 16228 7265 27194 23697 20036 839 -26607 -30483
21520 -30483 -35047 -33193 -1773 17534 -4193 -19416 -27666 264 3357 5266 23580 -7429 -8640
21507 -8640 -26390 -28069 -29115 -28233 -38456 -16515 -2893 15758 42698 42421 24176 -411 15535
21494 15535 16232 -2356 -19030 -19843 -33008 -20701 17134 28092 13912 -16612 -44762 -50871 -46209
21481 -46209 -56975 -48800 -33547 -26040 -16540 -24569 -51603 -25539 -17683 -15942 -24386 17247 19325
21468 19325 3321 -2820 13445 16156 16151 4629 -1419 -4858 4606 18692 23105 -1937 -7587 3661
21454 3661 17100 13659 9919 7202 4044 -5368 -2019 -938 -9592 -23279 -17401 -43428 -39280 -21175
21440 -21175 -8163 -27501 -7782 -4556 -12832 -12086 -8827 -2583 14040 519 -23739 -30615 -25863
21427 -25863 1626 10753 357 -25336 -43800 -21029 -28760 -37742 -23490 9423 35224 39480
21415 39480 23555 7758 -13367 -4443 -12745 -19498 -30715 -36150 -32928 8754 36089 34746 24516
21402 24516 5029 -10283 -45280 -57447 -45547 -50857 -60727 -43917 -19401 1816 3267 -17908
21390 -17908 20391 14483 27870 16798 -3298 -15772 -7828 -3238 -9138 -27046 -27405 17924 35497
21377 35497 -9065 -15670 -13998 6441 21561 28456 16479 -4953 -12031 -3735 -13719 -13747 -30570
21364 -30570 -43239 -43129 -35126 -30616 -31773 -14751 4655 -14299 -33061 -29190 -20054 -17504 -20658
21351 -20658 -11501 -12917 -25757 -14999 -22300 -6396 3503 -5611 6429 9362 -9929 -18089 -27847
21338 -27847 -40333 -36621 -32340 -27373 -20608 -41449 -11490 20726 36438 23109 9407 12696 -8490
21325 -8490 -31949 -3499 26768 82215 74559 27643 12284 -9615 -894 20851 19410 15110 25905
21312 25905 19780 14414 15358 14142 4760 -12427 -3766 -18638 -37513 -41195 -24931 -42184 -42863 -40271
21298 -40271 -21493 -32466 -5822 19106 37892 28599 24077 35335 28143 9220 -4058 -13164
21286 -13164 -39779 -22783 -3157 -4196 -6032 -27654 -45738 -63657 -62910 -64015 -43385 -31881 -15705
21273 -15705 8159 1087 945 8180 -7578 -3408 -11138 -32113 -37511 -52347 -53690 -34594 4711
21260 4711 -8669 -26658 -28729 -19347 -28445 -9864 11312 -21153 -48857 -53647 -61516 -55189 -67402
21247 -67402 -44974 -30877 -25924 -16120 -6807 -1099 -1232 -11116 -8376 -1794 -3854 -12782 -35071 -11581
21233 -11581 -9225 -31312 -6815 -25616 -70376 -72938 -30245 -17628 12844 36942 31392 14533
21221 14533 54762 53110 57631 45431 44446 25518 17627 12111 -8841 -16305 -27384 -50659 -54931
21208 -54931 -27253 -6167 -17258 -7361 -5193 1275 14275 822 -4541 7019 -24830 -38917
21196 -38917 -17911 4561 27245 34947 16866 14259 12533 220 -20692 -12450 -11627 -14542 10785
21183 10785 30780 6565 -30211 -40449 -16004 -13595 2587 -18807 -28205 -13649 6111 9952
21171 9952 -3228 -6187 -5051 7631 -8048 886 24191 23173 8907 11211 19461 40271 22447
21158 22447 -9408 -10868 664 2794 1400 1497 2826 14706 14471 -917 -31731 -1684 14216
21145 14216 -16600 -33162 -35301 -28363 -12218 -28701 -32973 -18835 1798 532 -7655 -17326 -18827
21132 -18827 -2263 11658 19381 14930 16318 41021 50813 6723 -27350 -54491 -44421 -10401
21120 -10401 -19982 -17039 6573 9161 2349 -1681 264 -1218 -9187 -2569 17360 -19 -29744
21107 -29744 -39265 -52746 -55829 -28257 -23964 -24488 -17747 -22011 -40711 -35872 -33148 -39586 -33969 -8799
21093 -8799 11189 -6437 -40081 -39272 -20822 -19028 -19753 -27765 -35898 -29636 -27315 -11530 -8306 -8143
21079 -8143 1826 -5593 -1959 18051 20555 26618 28044 13435 12121 -25490 -26603 -20945 -20132 -3775
21065 -3775 12828 25099 2460 14785 23848 17474 2343 -13792 -25234 -28004 -16087 -20424 -8762
21052 -8762 -7842 -2258 5186 16103 26063 23537 35638 31502 -5172 -17864 19707 35243 22052
21039 22052 28282 23819 -1315 -16338 -8498 -456 -21893 -34716 -40495 -32723 -44150 -22141 -3069
21026 -3069 16633 1824 4118 32384 31186 23858 30730 20051 8405 -5752 -28931 -55457 -63232
21013 -63232 -63214 -50251 -23039 -26941 -18228 -27900 3826 821 8095 4604 4132 2343 22105 40081
20999 40081 27954 -3510 476 -11529 -13322 -2574 4338 3614 -3798 -34414 -29387 27177 36715
20986 36715 31115 46582 33828 -511 -2949 -2528 -21891 -17417 -12365 -14582 -13879 1365 9184 -5067
20972 -5067 -13190 -1104 -12690 -12812 -18004 -10970 -29430 -35240 -44039 -30058 -9897 7075 12019
20959 12019 166 -12121 -7339 -12582 -28381 -24506 -9435 -17504 -41223 -30982 3310 22108
20947 22108 21008 25792 26302 18888 34724 16107 31480 27568 4930 -13558 -11220 -13928 -29014
20934 -29014 -8963 -3661 4184 -430 -14011 -16694 -31685 -30673 -31672 -31935 -34984 11737 16163 -13985
20920 -13985 -24502 -31516 -16654 -609 -13829 -24448 10846 32709 34523 15577 28471 -1407
20908 -1407 3354 16844 25374 -1467 -19947 -21951 -19530 3618 5648 -25077 -26962 -39771 -33744
20895 -33744 -50261 -39799 -36595 -30122 -29557 -25697 -26334 -23305 -29077 -23050 -23524 -33329 -36423 -19398
20881 -19398 -10296 -12824 -29712 -5603 1056 -36798 -52256 -71268 -70436 -47194 -33594 -57511 -77905
20868 -77905 -46614 -29723 -18835 -16270 -25356 -22897 11347 12869 -17502 -8592 1114 -18845 -25588
20855 -25588 -9551 -7800 -20295 -8107 12839 7617 3076 -3528 -3022 -8286 -21232 -16967 21746
20842 21746 27616 17573 23683 30323 -500 -19143 -36540 -39004 -43891 -39179 -51659 -59189 -30198
20829 -30198 -9518 -5541 -2382 -12495 -12500 -2282 2379 6554 3374 -18911 -14674 -11349 -26818 -30652
20815 -30652 1952 5150 -15614 -21378 -19461 -15537 -43118 -50509 -51940 -10619 20359 9341 7911
20802 7911 12873 -8798 -19439 -7532 -3487 -14054 9582 -5409 -19477 5800 14104 23475 6644
20789 6644 13282 8349 -24886 -53513 -41293 8568 37291 26644 5844 -16401 -3303 -18635
20777 -18635 -29145 -23372 -26684 -12345 -4499 12115 25721 43387 30457 -10993 -34486 -57570
20765 -57570 -68854 -40693 -33636 -54469 -57953 -43720 -25853 -16567 -10198 -29514 -47850 -19197
20753 -19197 9252 -13153 -4537 7105 20747 31585 4146 -41251 -41255 -3837 15360 15564 2741
20740 2741 6658 11170 1129 -16368 -30024 -33666 -2133 13155 -11251 -5866 5184 1204 -28710
20727 -28710 -41158 -40957 -23239 17927 23456 24783 15357 -13735 -48420 -23968 -3804 21820 19771
20714 19771 -3238 -19798 -3438 -23404 -27336 -57714 -68804 -44920 -43118 -49660 -37539 -25321
20702 -25321 -26477 -13909 -1429 -6420 -21123 -43234 -55581 -60443 -60647 -40682 -26842 9369 5869
20689 5869 -300 -15429 -4758 -5860 19900 36156 28228 8333 9071 -5522 4181 2650 -13974
20676 -13974 -31631 -12463 -21588 -18554 6611 8197 2105 -3669 -739 -4551 -23762 -21584 -23253
20663 -23253 -32224 -33506 -34678 -22196 -7351 -17780 -10562 -35691 -42226 -33344 5285 25737 11575
20650 11575 -2309 9737 14178 16772 8258 9841 3070 -4878 -1625 13092 29449 9910 7608
20637 7608 -5698 5387 33442 21897 14484 27958 26883 10359 -17264 -31268 -36550 -51511
20625 -51511 -39494 -37709 -42434 -43940 -50701 -16854 5158 -25906 -50462 -66060 -42775 -36676 -47839
20612 -47839 -42030 -30756 -18183 -39154 -12328 20200 30568 16025 4971 -4184 -5769 -9929
20600 -9929 -7225 3961 5598 5941 -12304 -16323 -7785 -12277 -4400 22210 12785 -5042 -6215 -3626
20586 -3626 -9692 -19718 -28252 -31794 -25687 -33146 -42940 -33852 -38541 -43850 -19382 -18908 -16998 -23509
20572 -23509 -6732 -15069 -11934 -11392 -13246 -7786 -18057 -1118 -2195 -13168 -17639 -10573 -17719 -12152
20558 -12152 -8858 -5329 11761 8144 -12804 -21759 6625 28743 7493 -21447 -3272 6792
20546 6792 33712 46240 58502 41663 -9893 -18984 -19068 -11784 -6398 -22713 -11367 9088 36125
20533 36125 26160 15302 11118 14472 13543 -3310 10151 -15040 5590 19737 -8480 -19745 33573
20520 33573 48885 23833 1849 -1014 13966 25272 -3160 -14154 34245 54356 13740 1371
20508 1371 132 -15616 -20873 -9214 11041 9808 23568 43723 20483 -8103 -14090 -33661 -29378
20495 -29378 -5157 -4685 -29258 -26302 -661 41367 48437 31294 -3755 -19731 -21851 -11425 -7916
20482 -7916 -33680 -35455 -57667 -58029 -25283 -16935 -5674 8573 5430 -19878 -18394 -21578 -27540
20469 -27540 -21489 -22082 -11482 19081 31582 12725 -1557 -1703 -3538 -803 -16072 -33037 -61734
20456 -61734 -53724 -33083 -19227 -3345 -296 -24754 -38412 -65036 -67211 -85731 -77582 -62277
20444 -62277 -47155 -52024 -36602 -18105 -9057 -21490 -10598 11783 7373 -10289 -1520 3201 17333
20431 17333 24857 26012 13830 -17322 -19412 -38685 -20372 8222 2504 -11486 -35981 -54692
20419 -54692 -49099 -33403 -22752 -55848 -33464 -45062 -18408 19196 -12560 -47540 -35348 -38966
20407 -38966 -33569 -37147 -48549 -61542 -52784 -69350 -52953 -35544 -22492 -5978 9480 15811
20395 15811 -8494 -32373 -47598 -42755 -26648 -6836 -22977 -52357 -34979 -26634 -47332 -79721
20383 -79721 -50203 -22842 -45715 -54723 -49602 -20590 -1792 -626 -8645 14004 29795 15560
20371 15560 18328 18759 33898 49317 59541 78224 77888 75007 74472 88345 88156 89289 93462 83635
20357 83635 81259 85870 82262 71762 56812 81039 66531 52584 45527 45080 30809 25081 16275
20344 16275 12189 44649 57513 28516 5051 15809 -3099 -9365 -10844 -13547 907 12130
20332 12130 -13417 -7784 -6133 1664 116 17027 16982 14907 -9630 -33304 -26004 -14803 30157
20319 30157 36831 -10189 -24544 -1211 -6916 4128 12766 23373 -4166 -34644 -39590 -7111
20307 -7111 -5072 -22262 -2751 13305 -2158 -22013 -45471 -16317 7263 -11383 -4087 -498
20295 -498 8845 3743 12242 9030 3339 29928 35866 36821 42819 30781 -8716 -24956 -5274 -14802
20281 -14802 -21773 -1167 11165 9981 -6539 -10698 -3520 10446 -2220 -18894 -32482 -12251
20269 -12251 -19579 -30031 -14904 10704 34084 18235 5647 9426 26690 37963 26669 -4572
20257 -4572 13788 10399 -15845 -14987 -580 5704 6669 11702 13625 -7214 5029 2693 11424 21951
20243 21951 32616 6882 -14063 -37598 -40847 -34613 -26765 -33810 -28489 -3339 4833 -3832 13114
20230 13114 17119 4770 5293 -16755 -48664 -42542 -41745 -32437 -46645 -7866 7802 11920 -13491
20217 -13491 -25728 -23035 -1866 -16041 -23403 -20925 -13995 -15552 -19558 -981 19954 38072 28306
20204 28306 28474 -21982 -29687 -8583 13979 5822 4358 3130 -33340 -54696 -36126 -43948 -26551
20191 -26551 -6314 -5467 -17015 -9542 -14342 -15656 -11200 -12691 3169 25588 24342 23789 36373 20457
20177 20457 -14454 -1760 30046 28722 16019 -12589 -28988 -9712 17286 17210 -10560 -1506 -9886
20164 -9886 -10646 -9350 -9103 -44151 -32983 -24838 -6454 -9318 -11182 6479 26266 21207 9947 -26940
20150 -26940 -57206 -45156 -25657 -17508 -19649 2551 21692 24652 10922 -18488 -38164 -48213
20138 -48213 -2631 7576 -23757 -20777 -11479 -16242 -12626 -12707 -2583 -12824 -10457 -12370 -13660 -15816
20124 -15816 -42030 -43550 -50899 -29058 -4334 7649 27865 27110 6297 6248 24575 14316 -7133
20111 -7133 -1879 5750 -8244 6714 24367 -5809 -21239 -1580 11420 -2353 -4232 17520
20099 17520 -5036 -20463 -27942 -11444 29961 12501 -17809 -21706 5769 31284 34446 33103
20087 33103 31224 43776 24096 11509 34960 40661 5533 6529 14019 7485 -17215 -5163 8416
20074 8416 10824 22564 21108 16842 25764 45757 32947 18229 19731 445 5374 15750 22967
20061 22967 27988 28765 37344 60424 25465 14428 51590 47685 55443 71062 79365 39901 35098
20048 35098 53825 66195 61685 56560 48070 48100 47794 75958 93008 49733 16058 28193 35431
20035 35431 32885 30735 57112 69519 46277 46156 48988 43367 18939 18331 38716 17536 3193
20022 3193 19533 55542 52694 22302 17755 3325 1116 4130 3389 12123 19259 33825 53826
20009 53826 53631 27409 29915 41805 46791 17912 41386 64595 46773 30470 22419 20422 18189
19996 18189 -7358 -35438 -22493 6840 -21625 -48802 -45755 -20509 12262 39523 30136 19000
19984 19000 -7970 -26157 14661 41895 35480 27537 48837 51668 40842 10831 39855 60167
19972 60167 41968 37962 43157 22974 38794 47765 60737 55187 44099 49337 78095 87156 61390
19959 61390 48899 47651 28772 12330 35092 31557 29506 -7424 -4308 16252 30521 42538
19947 42538 20995 -41196 -51043 -30163 -47983 -27207 -26358 -14147 -8493 -12213 19529 3027 -4631
19934 -4631 5054 52348 28076 -3829 3067 -2 -5649 -2333 10079 18233 26019 1932 -10953
19921 -10953 -16541 -2259 2981 -23097 -58869 -53837 -22380 -44467 -33592 -13601 -10584 -5571 -5752
19908 -5752 -28404 -29180 -4848 33769 39067 13170 3708 18562 11188 -10928 -28419 -16200 -9723
19895 -9723 -30153 -15156 -7022 -242 13884 12116 17059 -7622 -37020 -39089 -45427 -19792 2040
19882 2040 -12244 -26562 -12336 -20472 -23555 -14290 -5175 -5860 -14048 -8714 -3129 5771 20505 1247
19868 1247 -28811 -45733 -31730 -3764 627 -7777 -26817 -21811 -38499 -33844 -40516 -53337 -44716
19855 -44716 -12327 -4482 15095 14381 4688 23750 49190 31813 2688 -15894 -17655 -36605 -43520
19842 -43520 -51356 -61411 -50030 -26555 -32887 -24907 -456 18715 20915 18194 15493 5394 -5269
19829 -5269 -12189 24981 23144 18684 3688 -703 3964 10807 15583 30527 46171 53745 60621 55143
19815 55143 24653 8301 -25040 -6693 -15844 -22542 -12225 -24941 -29693 -32327 -40266 -43659 -36184
19802 -36184 -16305 -15705 -9848 -40594 -20720 -30996 -45937 -24504 3391 18000 8405 3456 18055
19789 18055 13749 10127 3485 -30413 -31604 -36371 -30516 -28225 -7283 -10676 -862 30474 32743 -3407
19775 -3407 -29760 -51651 -31717 -37888 -31862 -12698 -20594 -27333 1693 17143 -27678 -52703 -55287
19762 -55287 -28664 -20753 -43154 -27414 6869 30700 12585 -7297 -42113 -49396 -47410 -36370
19750 -36370 -48566 -53166 -23691 4939 20783 15872 1556 -4349 14195 26615 11373 3222
19738 3222 -936 -1262 -5347 -8368 7922 13079 921 -19758 -2732 23766 50076 43060 41941
19725 41941 31308 16238 17944 20030 29604 50273 73220 71841 28528 15741 22818 10752 11279
19712 11279 11060 10662 -8355 -17402 -20445 -11205 14133 15684 -2289 -7092 9092 -5798 -33887
19699 -33887 -38669 -17356 -11184 -17550 -14979 15457 29226 37054 18841 19978 43697 39450 -2308
19686 -2308 -52602 -43026 -10106 -10041 -15646 -7204 -1715 -7969 5237 34239 52029 32162 14868
19673 14868 -2107 -1110 14900 17600 15311 30770 32009 2544 -1637 -14524 -15778 2980 10516
19660 10516 29839 15298 -686 -22098 -18303 -2914 -1404 -17731 -29088 -31842 -16262 -17369
19648 -17369 6742 18408 46664 66462 52255 44922 29056 23382 5079 -13251 -24105 -25294
19636 -25294 -32870 -35358 -16734 3475 -6038 -14284 -29104 -8053 12389 6895 -29588 -45774 -40277
19623 -40277 -24127 -33186 -44572 4182 32165 31061 20942 12032 4822 -4287 -16594 -31154 -24874
19610 -24874 -33665 -44170 -19239 29777 42688 21334 10979 755 -15805 -15037 -18396 -12753 -28000
19597 -28000 -58862 -77847 -71942 -53126 -38955 3259 21938 33380 11590 -20664 -28549 -22388
19585 -22388 -48430 -39406 -21784 -4719 -1610 2710 905 -10818 13116 39662 757 12099
19573 12099 3405 3024 925 4288 13743 11774 17562 5099 -6672 -27814 -60717 -51843 -47240 -24744
19559 -24744 3874 22099 28085 23324 -1666 -5301 -1616 5217 5523 -6767 -8011 839 -17671
19546 -17671 -15589 -35549 -28234 -5929 -43456 -54220 -22253 -8924 -33604 -5976 25110 21798
19534 21798 -3572 14562 22008 20427 2551 -18265 -33999 -22214 13947 18205 -3514 -8932
19522 -8932 -9381 -1619 -15639 -23069 -11786 -12531 -22656 -37667 -36022 -34518 -33633 -18941 -6037 -35552
19508 -35552 -30482 -44527 -29556 -11161 -12887 -12556 -15254 -13513 -5269 -22528 -49688 -41932 -50113
19495 -50113 -40550 -31604 -6800 18675 -9754 -16833 -14762 -31691 -44239 -42510 -54142 -43761 -12397
19482 -12397 1374 -7816 -44777 -45095 -7906 -1159 -31558 -39331 -43434 -39041 -4964 15076 2617
19469 2617 -3043 -17096 -26366 -48355 -30551 -17302 -11561 -7157 7864 27322 26555 -14085 -16818
19456 -16818 8650 41168 31071 7493 8 -6143 -11059 -8396 15922 18069 -12412 -15322 29313
19443 29313 38005 -340 -33896 -21851 -19837 -17669 -2506 -9907 -24486 -9039 7098 -11647
19431 -11647 -17430 -3197 -3803 -20849 -22034 -12850 -26810 -30623 -16355 2068 -194 -4474 7616
19418 7616 3481 -11133 -9890 -7016 -14090 -7595 16358 6145 -2524 -9647 -19194 -9119 10374
19405 10374 574 -25638 -33989 -16868 -17304 22686 34859 10386 -3879 -45279 -49978 -54446 -28633
19392 -28633 -50743 -36673 -27057 -33006 -33653 -44844 -40308 -23222 7055 12169 2068 -7772 -5936
19379 -5936 -19914 -15378 -18843 -38419 -63567 -28460 -33763 -26322 -15700 -9459 11337 17425 933
19366 933 4322 1358 6871 38346 48244 26466 3451 -7380 -12861 -21138 -8811 -23984 -2832
19353 -2832 10849 25083 30209 37800 -9540 -22926 -12217 -5528 -13503 -12410 -23373 -29398 -24738
19340 -24738 -22694 -10219 -29070 -35290 -24155 -33382 -42474 -18613 -38781 -38360 -5999 2031 18257
19327 18257 26482 33770 10763 -7656 -25921 -25841 2914 23774 36049 42770 39283 61481 40030
19314 40030 15362 14074 28380 59308 56383 32913 -4607 -23750 -38917 -44228 -24747 -14982
19302 -14982 -11751 -2466 -24316 -36179 -13765 -35921 -48606 -20116 -14376 6518 633 -4549 -29306
19289 -29306 -23856 10324 2072 -27539 -38465 -26384 -13429 -31316 -50523 -44908 -10737 555
19277 555 12590 522 -1770 -11301 -31146 18256 50971 32504 18217 20469 -6087 -8082 -927
19264 -927 11110 13071 -8546 3517 11294 10476 18081 37501 39159 16961 5517 -16712 -49318
19251 -49318 -67616 -50690 -3075 24912 24795 -20458 -38451 -26825 -17031 -39452 -36954 -29707 -60021
19238 -60021 -75149 -96729 -78134 -44960 -9394 16518 13223 28167 23680 -17780 -19309 -27634
19226 -27634 -22435 -20981 -37665 -31548 -7088 -19596 -25480 -1546 12106 9847 2584 5905 24938
19213 24938 -2291 -20440 -4414 23976 28409 27357 7783 -1224 20269 34763 22442 -19661
19201 -19661 -10944 -9787 -11923 -15471 -9667 -23020 -13140 -6965 1384 13752 19941 1646 -13101
19188 -13101 -4520 -21465 -19705 -14129 -11762 21333 24772 -8697 -16911 -18565 -18376 -4359 -9835 -12848
19174 -12848 -9544 14243 34059 8410 -893 7612 9504 -17710 -15592 -5604 13920 -5035 -3256
19161 -3256 6191 -8614 -3682 -674 -12449 -16510 13757 25425 45090 39639 7011 -4938 16633
19148 16633 31821 36040 17837 2352 -7185 -11964 -27509 -17082 -1175 20030 15825 1113
19136 1113 2374 -4720 -16656 -4265 3226 2739 3704 -10331 3315 22825 -11731 -8908 5645
19123 5645 5449 18342 6763 3300 -6918 -16202 -19307 -9769 10638 25878 19154 1844 23293
19110 23293 3180 14049 16717 24473 10065 -8692 6664 -2147 -12873 -13398 -19259 -8231 11653
19097 11653 -3392 -21616 -6673 -3894 -41321 -36939 -8135 1470 10372 33217 23801 12791 -3263
19084 -3263 -2393 14874 31086 44580 21021 22452 56850 33177 -4735 -4374 25099 28548 17153
19071 17153 -3557 5942 2355 -13890 -32761 1492 27981 5236 4082 8945 -23193 -9442
19059 -9442 -7471 -19455 -38289 -42345 -33581 -31712 -38687 -6357 31616 23479 12560 28844 46471
19046 46471 60471 29647 -24058 -48470 -38783 -29411 -10510 -38037 -43179 -20795 4692 12196
19034 12196 16039 9172 -6041 -10380 1572 -884 -3972 -24995 -52117 -39853 -17686 -27818 -21946
19021 -21946 -34253 -11298 46037 57730 16587 -440 6452 -12120 9468 -9165 -28159 5815
19009 5815 37499 35103 291 -3165 -21877 -35296 -8565 20819 16256 -2468 -34663 -13869
18997 -13869 25223 29266 5540 -694 -33084 -28627 -15567 70 23058 32118 539 -7418 -919
18984 -919 -78 -571 -5605 -9822 -3996 18537 10828 -9646 -11095 5716 -20767 -35454 -12498 -5141
18970 -5141 -304 1204 -10791 20937 30466 40496 45780 31746 20897 12538 22049 8622 32409
18957 32409 31962 31070 41181 64570 108854 107936 96521 113102 138121 179599 222593 249309 267617
18944 267617 306442 329934 340977 360800 359625 356446 381106 383212 391153 384831 354575 311642
18932 311642 263050 240197 190660 132543 117523 132218 121680 75112 64081 83457 86550 39478
18920 39478 18248 28473 20190 7455 34664 55576 50383 45851 23521 -2340 12381 10238
18908 10238 -17488 2061 41462 50510 28265 35913 42392 34969 43159 72746 60337 34988 39143
18895 39143 23468 8331 42327 49859 42386 27472 19853 8823 20998 34363 21819 22308 27650
18882 27650 6754 -932 -17152 16022 12886 -28282 -37950 -34715 -14770 -9206 33117 63936 29615
18869 29615 5511 -7905 -14158 -7192 11855 4039 1317 6481 20771 13495 5354 -11912 -18854
18856 -18854 1391 47148 52353 39978 5083 9184 14833 -2690 -15483 -21242 -17464 -23810 -57429
18843 -57429 -44517 -31270 -31484 -17444 -39388 -41017 -10096 -8028 -13115 -20864 -9510 20959 52360
18830 52360 29658 -826 -17056 8270 20207 19200 17771 7848 -8881 -71 2057 11039 16610
18817 16610 26502 33130 35421 59974 89442 77499 65334 18850 -19322 -16477 18710 44222
18805 44222 48698 49970 38628 31932 38872 15177 6495 2289 10446 41312 35644 42715 41721 19890
18791 19890 -12410 -6682 17835 -7049 -7894 41277 56892 60396 32894 21954 14723 10344 38085
18778 38085 55481 21321 -3882 -5243 7984 -495 -113 17160 79336 134017 179699 269056
18766 269056 366568 318598 192267 113881 90862 73761 59748 37339 25251 5343 10343
18755 10343 1293 15012 13871 21206 -296 -16152 -49361 -56726 -20490 -27632 -12478 28360 34266
18742 34266 29276 -7534 -25450 -16669 9758 -3958 -9018 1392 6170 -10479 -10821 8696 -4239
18729 -4239 -14610 -12284 -11355 -29837 -28557 -22097 -112 -22213 -23465 -4819 17201 37917 35312
18716 35312 -10663 -18518 3691 26903 46049 35616 5917 15707 38728 35130 13192 2488
18704 2488 -14615 -24331 -9651 877 9852 21364 47294 31129 9639 7125 660 -11779 18007
18691 18007 43527 24202 -3780 -2837 -510 -20797 -2623 -6141 -13126 1747 31360 34441 9171
18678 9171 6473 14465 -7764 -286 25068 34028 58653 69006 59124 32328 20227 44773 51003
18665 51003 34559 26317 -3294 -1869 -13968 12978 36105 16555 9049 18573 28418 -10608 -9330
18652 -9330 13255 22647 17827 35876 14309 13677 -21197 -11817 -17328 -41755 -1198 19830 22421
18639 22421 17656 16713 7468 23957 -1995 -8289 -12298 -41423 -41398 -3697 4351 7908 19052 46485
18625 46485 49106 43128 42822 55212 49632 50393 13564 -6760 -14429 4363 14569 12007 -4752
18612 -4752 -3408 -3178 10455 21164 28652 50088 23343 -12071 3354 30627 50747 77285 58524
18599 58524 34553 38300 20139 3793 -15521 -9125 -43403 -58371 -56664 -10179 15663 23156
18587 23156 -553 398 152 26895 20218 -4216 29866 41569 41350 38253 58804 47626 36131
18574 36131 64892 93116 98075 111552 113045 83222 46574 49484 54009 54036 43056 60011 52811
18561 52811 38249 32634 26715 45357 14950 16648 35416 31137 38850 53126 49958 50671 69037
18548 69037 81900 47163 55466 78905 78524 61619 52874 59418 66818 76041 80486 68059 57822
18535 57822 71392 85354 74485 52133 18724 8520 49451 58163 46809 55107 46647 52039
18523 52039 67084 76867 107814 128578 124993 110674 89069 82763 91053 95087 106019 105350 62852
18510 62852 22865 40984 39988 32347 27531 33522 40798 56895 70315 56351 46727 32218 17541
18497 17541 41187 41895 40236 56277 70220 52751 22462 27356 42735 43652 55267 79199 97639
18484 97639 80020 64089 54542 73563 76716 63698 61766 77380 98251 87938 98589 74292
18472 74292 84333 88744 65332 52331 63143 75551 74427 64433 40204 4919 9653 33423
18460 33423 48086 64005 62652 79025 86291 108520 120961 104887 77568 62645 82073 106897
18448 106897 98825 107392 97278 64732 40952 37817 47835 49837 64307 105808 100809 115409
18436 115409 119511 106930 120019 134687 148680 151695 145562 153942 193863 213942 215253 227523
18424 227523 244171 272529 299677 291352 266899 222870 202191 212878 241956 256775 230016 228583
18412 228583 232889 211919 201255 182776 176423 193445 166173 119999 116828 115503 146817 179519
18400 179519 199450 207820 197822 170012 158176 153648 170486 177828 181515 195005 225992 249072
18388 249072 252164 255221 235965 216539 229614 248663 244002 244646 243439 260911 277316 269906 275862
18375 275862 283709 303613 339433 365987 389756 393374 356749 345686 387078 407706 443485 495401
18363 495401 527870 552397 534209 521748 525960 527398 524539 557817 575038 566911 574598 611432
18351 611432 609467 633502 668172 678264 700938 744329 755187 746095 759631 803154 858419 913306
18339 913306 990291 1069512 1121104 1195164 1282246 1389002 1536262 1673712 1756022 1862562 1983956
18328 1983956 2103074 2200171 2305958 2459191 2619748 2768205 2936570 3151957 3348277 3570820
18318 3570820 3802577 4048335 4332037 4720047 5187899 5751762 6435318 7272699 8306852
18309 8306852 9608883 11243862 13341208 16068006 19639537 24246326 29936589 36700913
18301 36700913 44217916 51886289 58973912 64763744 68850875 71233305 72188012 72232436
18293 72232436 72114851 72241039 72572600 72715598 71968994 69762203 65803238 60082317 53002817
18284 53002817 45234507 37571494 30609088 24713030 19970447 16269579 13449775 11304648
18276 11304648 9645389 8342727 7329822 6495382 5794313 5253694 4846776 4488060 4190479
18267 4190479 3906351 3674795 3511069 3362218 3186282 3001669 2843626 2669135 2520235
18258 2520235 2433465 2339440 2209724 2076239 1963779 1855520 1744287 1596583 1477250 1392842
18248 1392842 1309816 1197662 1142018 1064896 993757 978074 979221 956326 926253 908167 881736
18237 881736 841679 838395 849217 821707 750544 683523 611248 544864 517670 511883 516895 503454
18225 503454 468748 464935 447072 423359 412998 422519 435824 453332 457885 436722 379649 354825
18213 354825 352623 360482 362055 361895 330628 303485 292401 281213 288755 281276 261532 248325 243847
18200 243847 243843 277785 272298 233784 227803 230392 247588 267933 304047 319323 271776 260438 267318
18187 267318 272532 264305 251806 260104 247352 235631 241651 232521 235630 251071 247634 212071 202931
18174 202931 225150 251414 246115 238439 236870 224208 192594 154918 165307 176903 171747 160888
18162 160888 185069 212921 193494 165825 177555 175487 169636 191753 204806 229968 218254 198801
18150 198801 174833 170426 182686 190380 215407 191935 183104 171384 193190 233275 233879 239532 295259
18137 295259 323389 334800 331851 320837 337541 378249 412121 461577 496848 528721 568283 623234
18125 623234 702098 817653 923814 1033435 1148584 1316222 1558707 1876417 2300977 2853653
18115 2853653 3617752 4700315 6431750 9312420 14446991 23491833 38937905 58906258
18107 58906258 59758175 40892080 23864100 14162639 9016866 6160006 4466241 3411103
18099 3411103 2727567 2230773 1844391 1530023 1317313 1164780 1049039 933144 835595 739363
18089 739363 663190 614397 575213 518352 471578 436395 427643 364819 326005 296804 292179 275517
18077 275517 273614 273417 266367 247419 228114 220253 184446 155558 139658 110474 104295 91758 77643
18064 77643 124587 139083 142144 152545 132916 108845 112675 122695 135837 126471 116389 120384
18052 120384 119373 108845 140050 139189 152716 145529 152696 155267 151431 181945 168168 149582 114396
18039 114396 110882 111230 111312 84879 87929 90527 111148 126133 104489 71902 73129 85108 130829
18026 130829 152707 149605 173517 217792 259890 304084 323564 366544 417272 435464 446273 465336
18014 465336 468443 487251 473049 460592 453145 425245 437042 438497 392093 336427 292059 245872
18002 245872 193860 136173 93030 81108 81857 75556 60176 69994 77236 53197 31688 10205
17990 10205 22253 36093 63747 90567 99549 90813 80775 55693 33884 54280 87725 90308
17978 90308 70919 100499 113653 104298 94900 42105 21517 24325 13122 5928 43645 54872
17966 54872 65603 66290 42191 23044 33575 33862 14449 -2593 -3758 17617 52602 73677 91247
17953 91247 68585 26386 25128 28110 20238 12312 265 -4285 -3934 2831 -1695 -14123 -15190 25826
17939 25826 31151 26493 40344 56037 55691 21585 -2330 -3825 -2647 18799 22280 45304 57768
17926 57768 34033 21885 16317 -24202 -33624 -19611 -12436 -17187 3923 9247 8148 17313 26787
17913 26787 25586 -16812 3805 20372 4171 -12196 -7992 20873 24159 6914 19258 24317
17901 24317 -8654 -20218 -16960 186 -10382 -16457 -17250 2663 26298 54827 54823 18665 -15804
17888 -15804 -11977 1814 -4944 -1916 6361 10694 39445 55149 25547 56 2613 6811 35235
17875 35235 30905 43053 40840 30730 9958 -4237 -6774 -10010 20261 13372 7745 27722 12115
17862 12115 25560 44858 40774 19445 -19773 -3707 11339 21388 -7472 -67337 -70859 -60448
17850 -60448 -47411 -33590 -19111 -2073 -24740 -17826 1356 54652 59346 18658 1194 -1238
17838 -1238 -2009 -6728 5153 13831 20533 48174 31449 10239 16156 13330 3714 -24231 -16964 -20046
17824 -20046 -18280 -12723 -10703 12205 23652 24816 27287 4578 12892 25952 38654 59577 56762
17811 56762 53659 41802 24438 29550 32825 30722 39784 51050 50503 61444 51009 4977 -13115
17798 -13115 7513 22893 46874 45677 37270 20906 29061 22498 14918 31922 44509 26564 15120
17785 15120 -162 -6271 -25452 -50819 -58115 -27430 1093 34167 23581 -11267 -27796 13232
17773 13232 21878 -17655 -38614 -37635 -35434 -22517 12296 17379 4466 5013 -12469 -15676 10769
17760 10769 14388 32247 35436 49348 46622 13239 -13269 -5389 7176 -12195 -17536 -6790 -17086
17747 -17086 3306 14299 31158 37126 18398 8165 15502 12739 8833 12216 27148 43176 29498
17734 29498 33572 50501 26751 -22686 -21066 10799 11267 10985 30041 15834 -24 15246 -543
17721 -543 -18398 -500 24936 47840 35463 18555 25097 25182 47838 58881 44575 41527 36811
17708 36811 34279 14930 53339 73639 50997 7956 -16953 -30750 -18140 14432 35858 50032
17696 50032 49892 45861 64528 87663 77872 45503 29944 33948 49172 76323 61593 66100 87726
17683 87726 102137 108182 99300 87340 87999 87699 81233 81332 85794 38401 53566 82109 122316 127715
17669 127715 108775 107751 98155 92931 115667 128402 130070 121595 112401 90667 63553 82309 79846
17656 79846 70485 63360 91272 126953 132650 155848 147594 164241 199055 218055 269304 345118
17644 345118 400440 442580 472318 514236 521431 482182 461323 452649 441338 421125 418118 400489
17632 400489 391625 389856 355948 317366 297059 263159 215294 171305 134542 104933 80469 69576
17620 69576 59727 70031 88617 96761 77920 56665 54454 40953 23535 15153 29776 34118 57515
17607 57515 84098 77890 44535 28506 49854 43214 41536 55151 71867 70869 89974 92680 78937
17594 78937 45584 36840 31009 36902 56838 63410 60752 66788 64919 79591 61922 67216 74591
17581 74591 89585 88788 77476 63375 66616 70874 81575 93197 97052 108973 113277 115050 144179
17568 144179 168408 192144 170206 149394 134721 159372 151005 147423 149071 164294 211845 248692
17556 248692 295159 326656 355602 348524 350048 332405 327012 308736 280185 266715 286745 307806
17544 307806 294434 277621 238768 214168 217996 200204 187882 167619 132237 103170 106179 104328
17532 104328 117000 118154 126401 124411 140505 126152 122885 118041 123314 140585 154023 145728 142692
17519 142692 168136 198883 192818 164547 157729 151919 169257 162669 158663 176482 200152 203047 220004
17506 220004 221135 224091 277304 304588 323501 324307 340656 337399 345423 368357 400710 403184 413816
17493 413816 420384 422410 427958 393541 349330 356513 389308 402255 394660 412048 427544 423437 404764
17480 404764 396954 413384 417254 416861 446842 472322 501391 524140 525268 569170 581596 608248
17468 608248 643315 686727 744363 776175 800689 833747 866786 954270 1044043 1136555 1263790
17457 1263790 1388600 1515206 1656508 1791901 1956140 2114900 2242611 2384278 2564712
17448 2564712 2749340 2952077 3162520 3428736 3745910 4117333 4603267 5158484 5692589
17439 5692589 6327320 7208851 8438809 10187287 12708860 16376998 21587975 28558496
17431 28558496 36852343 45673240 54448221 63106439 71176122 76982614 79465241 79490720
17423 79490720 79170813 79336944 79293134 78743805 78399165 78344717 76875258 72387205 65044613
17414 65044613 56551939 47939162 39337615 30907712 23453235 17640751 13497478 10640410
17406 10640410 8677593 7278642 6278155 5535621 4945394 4453039 4090275 3775966 3529533
17397 3529533 3309424 3110604 2928529 2756529 2590125 2426444 2250220 2107466 1978343
17388 1978343 1864566 1751133 1618243 1494776 1374536 1270592 1168730 1044562 947368 875543
17378 875543 833705 780107 724947 697420 667061 633474 620461 577271 545083 533122 538062 506899
17366 506899 480490 467351 443881 424186 390391 363579 357790 361802 357459 355750 342475 338993
17354 338993 321692 258686 216039 209895 221699 227434 208560 208738 229414 247864 236182 220036
17342 220036 204044 202198 202010 200457 199495 181099 183387 173700 177495 175318 154438 146428 110464 120899
17328 120899 133921 145079 117729 102344 89389 100210 111451 134007 136978 111444 102827 105056
17316 105056 119918 124174 137433 143191 116297 122364 126155 115466 126493 114860 110352 110502 101630
17303 101630 112787 105857 120137 128396 91181 53633 41693 32188 29123 15318 38119 30009
17291 30009 21827 43147 70840 60827 65630 79862 77010 47395 18914 31430 44696 50947
17279 50947 77724 99437 55992 45190 41697 21425 15958 21348 45402 54639 52849 66231 60244
17266 60244 58867 32596 20226 19146 6155 7514 21884 30567 8621 25990 38487 32317 -418
17253 -418 -14410 -2912 10710 24900 32535 38961 24113 9033 30710 45358 43381 40333 60640
17240 60640 52350 41748 44695 18960 -11865 -13564 9654 38562 75415 87755 85810 77544 75480
17227 75480 86016 86769 79355 54387 30210 29842 14120 14564 14447 33765 25024 37582 39486 36336
17213 36336 58377 91088 79221 56858 45540 65142 75382 53599 37583 52845 63851 58814
17201 58814 41890 7650 -9492 -24775 -17240 -19150 9273 25256 21568 2417 -4561 -10257 -30824
17188 -30824 -48965 -25498 -2742 881 36440 31064 50003 43035 6493 -24455 -19 17937
17176 17937 20332 11838 -9765 -25396 7288 21826 -6863 5054 -4174 6334 8848 8692 40293
17163 40293 34666 27447 30303 37417 22524 10220 10374 22348 9011 5315 -1879 -4713 -9133 11561
17149 11561 24084 19634 17073 20747 23661 27666 8687 -24992 -13369 17023 38691 47037 31768
17136 31768 41559 43999 24909 32568 25366 2106 388 11095 18719 -5082 -12454 -1803 12556
17123 12556 -6013 -21438 -3202 -7632 -37930 -60400 -53346 -33374 -24915 -42423 -51887 -27568
17111 -27568 379 19506 29536 22513 31495 44508 41777 26683 8278 -31104 -21648 -4819
17099 -4819 21864 41185 20392 7683 -5632 32425 45259 36278 43200 54136 40377 32200
17087 32200 46415 44982 30578 9340 5858 3121 27073 41550 29576 35761 49099 25776
17075 25776 8267 16699 25010 16684 -19453 -19962 -17866 -29995 -46736 -54228 -39616 -31641 -39946
17062 -39946 -29066 -18560 15639 17449 13614 721 -8914 -21845 -19567 -9243 10597 9874 3346
17049 3346 -4566 -12215 -20013 -9130 23329 -11378 -37319 -37693 -29782 -14192 -13559 8226 52 -17109
17035 -17109 -29268 -42956 -29805 -18597 -6694 16484 20175 8772 18504 -4519 13884 45189
17023 45189 70284 54595 29874 22694 -17033 -27960 -52872 -44435 -693 38680 37831 14633
17011 14633 3698 -1345 -6125 10511 54853 27207 9753 -8794 -41489 -33976 4412 11572
16999 11572 4578 194 -14272 1302 8710 -10462 10435 26382 23631 40994 47490 49038 57522
16986 57522 19110 17157 43816 73343 55458 44898 53881 61005 39032 32414 14988 42666
16974 42666 68144 102723 95565 78092 85567 98483 120604 128839 125014 138670 146485 157320 140741
16961 140741 152129 158069 115639 74880 90048 110660 102048 123679 112308 101941 121588 95993
16949 95993 59024 56587 64890 59375 28600 34145 66566 103332 120844 95748 104974 115228 99030
16936 99030 80386 59049 32484 19046 8258 20540 44593 54328 24039 4054 7480 9426
16924 9426 33318 35380 19977 33306 81272 73978 50520 49543 59588 44458 4361 -18431 -33766
16911 -33766 -18091 -8775 14680 18248 25307 50237 59780 60145 52591 25811 42322 33799 10500
16898 10500 23794 45402 35362 38239 47740 23881 897 887 29329 21987 4919 -11951 -19785
16885 -19785 -7096 -7831 182 10367 12065 6300 -7283 -26792 -30714 -18869 -16176 -20245 -28256
16872 -28256 -29670 21 -5602 -30472 3800 21310 11770 -6811 -14345 -5017 -9352 -11185 -734
16859 -734 6781 -5255 15121 39325 51164 44840 18934 14249 13045 23003 11482 -7414 -19414
16846 -19414 -2920 3243 -9477 -9223 9892 19806 32040 41291 15665 19240 46879 85594 149109
16833 149109 192859 241390 288293 341237 395351 398292 427185 420602 388070 374795 359889 381183
16821 381183 416579 405151 389676 392631 356673 301251 238649 178746 139476 102602 67705 43507
16809 43507 18203 17108 7351 -34599 -63688 -43789 -32059 -19179 -13769 -1113 -13801 -9583
16797 -9583 2003 -3403 -30720 -39586 -24424 -3640 -267 -11440 -12026 5447 -6481 -5790 -456
16784 -456 -1009 -4037 -25400 -30533 -20267 -24867 -8967 3317 -6534 -9501 -6087 -17896 -19728 -34593
16770 -34593 -11612 7428 3214 1231 28316 30633 8306 -9364 -18962 -13027 -8560 -2646 -9978
16757 -9978 5822 4234 -5774 -19822 -25949 -1582 -8159 -22954 -27057 -24643 -15840 -27532 -35690
16744 -35690 -25031 23064 47221 24267 14898 -7919 -25175 -14345 23209 5776 -16966 -30913
16732 -30913 -49293 -19521 -2787 2585 23433 17817 13855 32856 30906 7194 -13063 -17423 -21958
16719 -21958 -44817 -17973 -16605 -26788 -21634 12829 22952 43940 16181 -31642 -20683 20063
16707 20063 20506 24640 18083 15733 27151 22102 3849 13426 12010 16874 10563 19353 28499 8702
16693 8702 -3969 -11023 -13428 7383 26469 -7222 -35719 -4945 12664 -25575 -45304 -45993 -25897
16680 -25897 -776 3382 -1327 8588 26192 35425 14065 7979 -2917 -12494 18888 10227 -11220
16667 -11220 -12190 -18010 -15577 -15633 -115 -27472 -19737 4957 22379 1131 1703 -9041 -1534 4862
16653 4862 -30345 -37026 -17849 -18003 -6001 -12604 -32681 -8230 8592 -12299 -32343 -50012 -65928
16640 -65928 -48750 -16351 -29134 -24681 -23093 -3129 6389 -3426 -28672 -35535 -47121 -49685 -32283
16627 -32283 -26994 -38102 -55008 -37931 -12707 832 3353 28765 24898 9559 1008 -21414
16615 -21414 -35809 -16099 19656 31439 16953 19375 12849 9169 2437 -15544 -28930 -32913 -11675
16602 -11675 -4279 3381 -4889 -11004 14081 20949 -4564 -20593 -40652 -35607 -39452 -57684 -44017
16589 -44017 -37829 -29879 -439 6211 15140 30083 55496 43830 5726 12792 19887 -568 -495
16576 -495 296 -11190 -39867 -42612 -10191 -1504 11241 26818 32480 31213 10120 -8167 5606
16563 5606 26082 20282 4457 -7807 -28860 -37274 -55616 -69620 -52086 -30251 -33278 -17223
16551 -17223 1412 8649 -267 -1912 5437 12328 -9553 -9346 -16992 -43564 -31707 -17401 -12958
16538 -12958 -16272 -20794 -17225 -105 30622 38366 34638 -1585 -9210 -5266 -34703 -34380 -22045
16525 -22045 -30595 -46857 -42379 -41716 -54174 -23072 538 -21083 -17464 -15959 -14691 -34524 -49092
16512 -49092 -54720 -44791 -27122 -17605 -11974 -331 2112 -24878 -7934 -3344 27543 55646 31655
16499 31655 7000 -12750 -23525 -28928 -31273 -42472 -42788 -21926 -11847 2507 -6481 338 15981
16486 15981 36689 17719 -8151 -19329 -50424 -37667 -39048 -66901 -53946 -34365 -33753 -42622
16474 -42622 -40306 -36480 -29077 -6602 -6011 -27204 -11341 4177 -2478 -19382 -32004 -43063 -58292
16461 -58292 -57185 -58194 -45020 -34859 -44709 -48998 -37323 -33114 -22901 -40593 -21666 -17523 -6339
16448 -6339 3775 10894 181 3238 -1193 4070 12763 -13633 -46823 -46845 -9190 -16966 -4538 -2586
16434 -2586 -8019 6042 17486 13199 13606 10633 12389 15437 2894 -22196 -2158 6459 -9764
16421 -9764 -239 10017 -923 -10361 -16459 -25701 -54109 -52026 -17348 -21625 -9588 -918 -1318 -3462
16407 -3462 -4212 -18513 -18936 -42181 -26337 5163 19185 3261 8326 -2094 1525 4855 -3270
16394 -3270 -15781 -24528 -10709 -27788 -35156 -34074 -23526 -18424 -3188 439 -8666 -30920 -45819
16381 -45819 -41767 -41108 -61994 -44031 -22480 -24736 -22294 -19663 8294 31030 29420 17645 22313
16368 22313 3446 -1586 -13789 14525 29640 46281 39638 20712 8999 19164 9013 5823
16356 5823 13393 29106 18129 21182 18490 21607 8122 -11519 -12855 -33795 -42450 -22686 10831
16343 10831 25037 11128 -21070 -29121 -18269 -25103 14282 14991 -1707 -3887 -15945 -7907 -27177
16330 -27177 -37524 -15439 23488 21813 -5264 -15107 11188 19244 -5320 -21999 -2643 435
16318 435 -6364 -8917 -14082 -32342 -46137 -28731 -13443 4747 -6626 -30813 -50018 -71771 -62914
16305 -62914 -44641 -14129 14520 19967 -2055 -18071 -12327 -11719 -18653 -9863 -458 -44456 -72678
16292 -72678 -63972 -58672 -64743 -35432 6827 13136 1475 5335 -5284 -20506 -28609 -21026 -1689
16279 -1689 3840 -14646 -24404 -61580 -55369 -13574 10567 20969 35387 9518 -23191 -7456
16267 -7456 2813 11424 9428 184 24567 41888 1227 -22541 -9027 23040 20789 7220 -5761
16254 -5761 -13331 -25223 -32037 -14124 -17392 2751 25700 4615 -22481 -32768 -13888 -12815 -6504
16241 -6504 -29913 -33541 -43149 -44243 -22002 -31023 -32914 -39982 -20285 -994 13716 16044 19181
16228 19181 13925 24068 34346 28028 29011 22943 -6673 -11894 18984 31342 3924 -24513 -44053
16215 -44053 -40238 -13295 4258 -2069 3872 24679 35713 42148 20281 -9639 -3802 7298 19014
16202 19014 11007 18831 23571 12980 1680 -3376 -5640 5161 10456 -5547 -8396 31145 65010
16189 65010 31337 15971 12809 -2127 -21426 -44168 -2710 -12342 -23583 5743 12045 17171
16177 17171 5873 4618 -13617 -10854 -4686 11866 3410 -8597 18735 -8834 -37247 -31714 -32130
16164 -32130 -46689 -23180 25168 35256 20941 22163 16569 4930 -8227 -27331 -31934 -4912
16152 -4912 -12684 -26481 -23968 -9146 4375 -8082 -3674 -9523 -18580 -27646 -15879 -34067 -25710
16139 -25710 -37735 -33572 -20621 -23919 -30967 -13715 -2333 -3254 3893 3127 8927 13455 5294 7725
16125 7725 -3481 -47390 -39514 -29504 -13201 -8228 9997 19867 25630 5507 9649 16518 109
16112 109 -26734 -46507 -46536 -43189 -19584 -30523 -54846 -45210 -27749 -36066 -29701 -41849 -28659
16099 -28659 -33422 -24763 -55001 -52708 -36472 -21605 -48180 -52338 -43334 -9064 -10887 -45445 -67595
16086 -67595 -65516 -49553 -50827 -26423 9982 2557 -9175 -34494 -41604 -40895 -24205 -18786 -38110
16073 -38110 -59858 -40528 25257 36924 -9236 -30172 -19500 6306 39497 10887 -23364 -10634
16061 -10634 13995 12168 5091 5213 51381 44083 20688 -1355 -6974 820 12923 17432 10149
16048 10149 -5479 14167 13308 25478 30535 14673 -36314 -65899 -81144 -59883 -21340 -35655
16036 -35655 -50583 -28495 -13887 2500 32024 39751 17894 626 -13312 -19322 -29270 -10264
16024 -10264 9174 7615 3794 5436 10944 11300 -14400 -10291 -16131 -19237 -18991 2302 7313 -19805
16010 -19805 -23898 -17275 -22600 -35174 -29147 -13643 -25479 7744 8817 10265 18673 553 -852
15997 -852 5031 24496 -167 -19587 -21681 -25688 -19654 -16809 -1782 5726 18513 20232 7818
15984 7818 -8952 473 -12648 -47849 -45700 -18183 -20160 -23537 -19903 -17619 6181 21284 5698
15971 5698 -9296 -19429 -12960 -16511 -36224 -35976 -34987 -16009 1923 2323 -9761 -11032 -20053 -11402
15957 -11402 13788 21756 21431 33574 32992 12186 -18342 -30309 -30470 -25381 -11571 -26634 -30846
15944 -30846 -43803 -26299 -18250 -30256 -19399 824 27733 32865 8399 24356 8226 -13209
15932 -13209 -5054 -4408 -17552 2282 13019 30475 6797 -8558 -3228 1786 -23310 -29713 9832
15919 9832 35357 33697 12923 29594 29837 3072 8622 27802 45333 13456 16241 3501 3360
15906 3360 4604 6667 24881 7033 -9237 -9985 -2265 1380 14493 1134 -19320 -30743 1305
15893 1305 -1800 5095 -2227 -28404 -45641 -44394 -15353 13106 -6223 -18130 -20703 -24859 -30922
15880 -30922 -27883 -14365 -15758 -25152 -4011 -9792 -38196 -46671 -44747 -21868 -13334 10131 29630
15867 29630 15709 -9840 -6707 645 958 -10189 -15092 -30765 -41915 -27281 -37237 -38952 -28299
15854 -28299 -3875 -17183 -11277 3349 -2120 6967 2680 20703 4775 2613 -7495 -26584 -27237
15841 -27237 -2618 -20042 -16359 -3889 -39906 -31261 -15928 322 -27284 -71256 -82346 -44827
15829 -44827 -30472 -35359 -40155 -19458 7717 14339 8250 -1230 11134 -4227 -43846 -82789 -84429
15816 -84429 -91849 -60171 -9774 6974 2018 5543 -5724 -27502 -30367 -31923 -39836 -30311 -18818
15803 -18818 -25061 -23058 -8990 -15166 3098 12519 6226 10559 19270 -2 -5820 14695 23947
15790 23947 27421 -1267 909 3941 17631 17524 26426 25352 -1606 -15692 -13030 -6855 2190 -25887
15776 -25887 -52447 -23147 -3269 1589 1689 -875 -14864 -9582 14508 36665 31629 37737 31421
15763 31421 14371 -25119 -30848 -26159 -32812 -32702 -29331 -34567 -23267 -8201 -20419 -35938 -15749
15750 -15749 -14740 -2441 -11957 -6856 -8255 -21696 -30117 -29319 -29373 -12093 -13191 -5401 21171 26690
15736 26690 15417 2996 -14609 -23651 -48976 -46529 -42950 -16979 12827 -26498 -19924 2581
15724 2581 -5715 -22823 -30449 -33565 7362 4930 -10790 -32045 -21311 5594 20691 10801 29063
15711 29063 27890 13179 -14046 -28534 -4141 15448 595 11888 28643 29839 30865 48886
15699 48886 52195 24163 -23169 -25415 -32164 -36503 -12968 3375 4617 -19175 -44819 -34957 -14992
15686 -14992 1103 9412 -3179 4335 2616 -7927 -12061 -673 28818 27639 27152 44769 21911
15673 21911 11646 3092 -12791 -21138 -10345 -1153 -6400 -13623 -5388 -2796 -5563 -2591 -16706
15660 -16706 1291 -548 -25879 -38488 1932 38279 42163 43096 23445 13443 -4698 4 19298
15647 19298 15863 792 -19614 -27650 -32362 -30107 -27819 -10628 -12236 1050 18742 26800 12731
15634 12731 6874 -9421 -28412 -25282 -35838 -41007 -17246 -15965 -33145 -18039 12988 15797 7426
15621 7426 26173 14373 -19741 -9684 19751 31857 14912 24250 27538 -2455 -40025 -30788
15609 -30788 7929 19176 8034 12248 27602 38076 35705 27570 15916 43770 58238 18988
15597 18988 11630 15439 5039 -15639 -11717 29017 6456 -18154 -30243 -25382 -29422 -39095 -6704
15584 -6704 26643 27310 20024 8977 16832 26018 28993 44193 55451 46881 9569 -9883 18325
15571 18325 29874 26481 41450 21179 -11078 -2150 5251 6504 -2583 -3439 -14701 -7471 -14404
15558 -14404 -33008 -3598 -9470 -5055 797 11183 8930 -12806 -18364 -15463 9062 13232 -9556
15545 -9556 -30775 -7017 31647 21218 -8669 -10199 -16612 -17687 -5252 15710 13894 11599 -3258
15532 -3258 -6480 21579 9366 12657 4241 -27194 -49866 -40906 -38235 -27337 -2770 28878 14382
15519 14382 12570 18040 9808 5953 3642 25388 20335 -3818 -17045 -10989 -13797 -12413 -9103 954
15505 954 -2100 -22932 -19040 -12988 -9969 -5069 -11102 -16223 -27991 -28520 -29576 -29042 -49660 -29646
15491 -29646 -11879 -10974 -13537 17681 37546 36715 40294 30514 7857 20137 36491 19430 -2626
15478 -2626 343 -18821 -31322 -31681 -613 10664 1076 -3212 -3710 -9256 239 11140 35100 31332
15464 31332 29449 26795 2716 -8514 -7274 -11317 9031 21276 35184 66661 77645 57040
15452 57040 37968 30328 33345 20043 -7658 -6609 -1753 -8784 -22663 -18921 -39830 -26033 -18049
15439 -18049 -5189 -26392 -16312 -3166 -16991 -53527 -54908 -32165 -27482 -24020 2414 -13628
15427 -13628 -34800 -32544 -6160 25617 22858 12612 21907 36610 39098 22417 29123 31530 19125
15414 19125 5017 -21760 -26134 28937 37933 16161 8848 25682 759 -16487 -16468 -19774 -10455
15401 -10455 -22212 -162 -15058 -13031 -30908 -40016 -14024 15906 4236 -13058 -14944 -18948
15389 -18948 4760 -6706 4394 11738 30018 43483 14918 3086 12403 -1597 -228 -5844
15377 -5844 -30133 -40540 -40302 -14903 8872 18783 1696 5945 -7757 -4293 -8709 -31979 -21595
15364 -21595 -24807 -12886 -9947 -6825 14386 30948 36272 25678 14915 3050 -18120 6001
15352 6001 19252 6834 -2469 -9125 3918 9473 12842 7489 3402 17041 1971 -1913 8270
15339 8270 -4199 -623 -3052 -14262 -20787 -20892 -23386 -29699 -33768 -33055 -6374 -16544 -1744 4462
15325 4462 -7094 11412 41452 27573 11293 21135 -1137 3375 24692 24143 2154 -3317 39352
15312 39352 53421 32322 10513 4910 -12357 -26849 -35010 -45280 -63779 -35093 -4357 -3348
15300 -3348 -12842 -2982 -19236 -23838 -13703 -11090 4953 23554 35162 53661 37217 35499 39391
15287 39391 36665 20723 17672 28159 53701 47875 38396 26885 6669 -2965 -33496 -34525 -23139
15274 -23139 -18794 -33787 753 32541 35422 20370 -9942 -36118 -39734 -27937 3699 11170
15262 11170 1476 -2838 -27345 -36189 -25954 -9295 -21040 -16629 -6518 -25817 -32595 -21009 9383
15249 9383 19517 32266 30745 63294 53205 22910 5360 22560 34987 37982 289 -1701
15237 -1701 6277 41413 59878 9565 -37094 -22079 -21220 -7959 8324 -1706 3645 23894 34081
15224 34081 15729 -4491 -1516 -19553 -22195 -28294 -8757 1214 21580 4084 -2781 -13724 -46866
15211 -46866 -81890 -71593 -17500 27332 37583 -640 -43542 -36361 -5107 -6846 -7318 7893
15199 7893 -16498 -22433 -17120 42 475 27326 12624 -26522 -64767 -42539 -10550 -15526 -11299
15186 -11299 -3557 -357 -12760 -44680 -44974 -24379 -36590 -35967 -34808 -17877 -2464 -2492 -8595 -14012
15172 -14012 -13444 -7623 -474 26448 12638 -9850 6433 5787 17036 16062 6553 24052 29399 42183
15158 42183 31243 39000 32918 42340 22403 27599 11639 4127 11851 15915 24404 10343 2725
15145 2725 20097 32623 42029 40585 22857 -28233 -11944 -674 16443 -21686 -22761 -3451
15133 -3451 -13653 23459 31665 11276 17441 -5669 -699 23510 36654 56824 34540 17155
15121 17155 24417 26417 -9455 -14055 -16237 -17855 6879 36419 46601 2124 -11122 -12143 16762
15108 16762 21355 4981 -5501 -7213 2127 11980 27547 24619 8946 -3909 -10949 10448 13257
15095 13257 5889 -8111 -2004 2475 1227 -4327 -7744 -6061 7134 53241 62645 46771 67820
15082 67820 57045 45638 36754 15395 4026 -14888 -24624 -2750 11194 38566 54301 35798
15070 35798 7572 -20200 -13627 -35110 -31511 -17830 -8168 -8304 11087 -7485 12105 40867 31074
15057 31074 21914 23189 28231 8657 -5106 -9709 -38264 -26499 -4373 1343 10648 30696 30522
15044 30522 32094 22876 38191 23817 2163 -23228 -9808 13176 45126 30379 17151 25296
15032 25296 15249 18394 30398 23805 9292 -1729 -26800 -11386 19723 9160 2039 93
15020 93 17240 22964 22950 17082 32513 64611 75883 33675 -3842 -32362 -36211 -19400 41
15007 41 -13639 -16479 -9369 4864 34012 50624 62067 86496 88172 76983 65951 59262 51323
14994 51323 26319 1596 -3627 -3824 -9308 -12320 -6882 3103 25429 52855 30729 -3501 -38163
14981 -38163 -37143 -14564 224 -1352 -5016 -19138 -23010 -29249 -28646 -4023 6383 -16012 -20164
14968 -20164 -24984 -24364 -25027 -25617 -1755 3290 42712 39360 12401 661 -40507 -24826 -34
14955 -34 13320 -17323 -24703 -21782 -16678 3905 6785 1540 9014 11762 -5420 -16568 6791 23906
14941 23906 12430 9991 6041 -4364 4898 9659 2155 12408 15519 -17317 -8569 14778 15772
14928 15772 25273 7176 -19829 -21750 -11695 -1173 9715 2732 7490 13241 -1002 -5964 -4188
14915 -4188 8871 -1977 -26562 -24010 -9274 -23300 -24653 -8032 -7674 -12516 -17468 -10573 -9760 1406
14901 1406 -15192 -25805 -32040 -17788 2073 -4348 -25071 -20679 -23959 -24831 -29481 -57868 -54009
14888 -54009 -35215 -749 -13962 -23805 1189 18103 1437 27814 44183 55076 56043 63388
14876 63388 50968 26078 23109 -7933 -17491 21628 19007 28705 33076 34230 20647 13156 27817
14863 27817 26238 9654 8375 -13391 -8119 -28635 -42980 -51461 -53114 -27133 -23923 -26825 -21814
14850 -21814 -5565 15965 30487 39100 15560 12964 25592 50683 21802 -24299 -20748 -16763
14838 -16763 -9062 6327 13981 3915 -6493 -6719 10156 9952 -1475 -15831 17708 50977 38951
14825 38951 23710 4079 2196 16429 21587 -4400 -13211 -1568 10320 13464 -4286 -4336 15346
14812 15346 30177 53416 57204 31157 21587 23647 35997 40675 30105 33183 23034 16071 -1993
14799 -1993 -30820 -18686 -12795 -12936 -18582 -38607 -25123 -455 37713 40677 28190 42540 34186
14786 34186 17554 24616 35018 21045 58511 22578 -4621 -4701 13190 18163 13487 -5802 4289
14773 4289 9629 -15814 2891 12084 17344 26283 39017 30126 38476 40577 45420 40046 38759 48611
14759 48611 25401 12763 23190 22230 12269 3242 1767 10817 17707 30385 56529 33381 -5023
14746 -5023 9651 24349 34171 42261 31065 41616 39180 15562 4867 41634 38481 19627 16111
14733 16111 17499 30268 17060 4964 19184 36780 68597 56668 41824 19591 6792 19332
14721 19332 22699 6170 11139 18014 35094 26910 25978 27268 28632 17415 9997 17743 29363 53625
14707 53625 50356 23302 15021 17921 17685 19716 19978 3754 6881 13633 18072 6454 -11027 -18014
14693 -18014 504 -13324 12105 53577 55856 45884 10321 -8414 -17072 13391 19996 41323
14681 41323 69132 39795 15114 -9531 384 8500 60954 106534 77987 38653 24234 22192
14669 22192 41397 67453 84560 65604 47476 34186 30571 50863 57093 42868 43042 47050 31690
14656 31690 21579 26321 2021 18201 26537 2456 1762 3391 13444 15055 13210 28905 19403
14643 19403 36398 45126 32755 32462 6298 -11129 5742 -10368 -34832 -21673 9022 5529
14631 5529 -16776 -36802 -12487 -7901 8445 57256 65509 42825 36203 43237 31544 76878 37645
14618 37645 10153 20380 53230 47749 30542 11188 -27223 -41972 -4691 1644 -22224 -117
14606 -117 810 5477 20290 48685 72249 71014 78597 99049 69897 36823 29305 29249 30008 18327
14592 18327 27212 48212 76148 96312 101658 100910 129243 123802 138190 126893 129918 122699 132808
14579 132808 133082 92377 34484 -8973 -5665 26313 29728 20750 10198 9662 27337 36007 35538
14566 35538 16257 3051 15816 42478 58500 52824 25586 12612 7582 -3101 -1028 30415
14554 30415 53153 72619 33610 38603 33375 45461 37627 48418 26759 47803 56658 51223 49072
14541 49072 39311 50963 68604 74466 95285 114467 84175 53851 73793 68595 72171 69936 27318
14528 27318 -15537 -23212 -11096 13049 26160 26030 24580 28541 30796 30315 32394 20272 36600
14515 36600 71805 80687 49077 29949 32562 38718 33220 26691 15682 15123 24776 34373 22769
14502 22769 18874 26681 45428 32547 11648 14450 32063 58317 42399 26860 17907 -3353
14490 -3353 -15178 -18133 -13886 -11157 9828 10442 3952 5850 27638 33338 22108 18886 35045 50181
14476 50181 51313 37155 25988 35703 46775 28297 10572 8199 -12065 14366 33579 17277
14464 17277 28525 60756 58943 25900 9234 26460 -4808 -3026 2737 16093 38303 48906
14452 48906 59829 69098 77828 80521 68813 72689 80641 92223 61414 50117 27888 34175 61780
14439 61780 93569 82450 75211 35306 53752 56867 40567 44253 28498 43870 39078 33853 64464
14426 64464 87829 87099 88731 88836 94621 96625 84295 75987 77792 70804 67485 81195 88580 64102
14412 64102 54878 48822 44522 40024 29978 42781 53151 74079 76777 76020 74288 87151 109523
14399 109523 96055 55152 25132 24732 35808 23465 13271 48865 68536 89479 84754 70677
14387 70677 72567 97736 66012 64611 76224 67522 25529 36572 72029 48490 51285 56601 65218
14374 65218 87326 91576 78080 91173 92289 57984 40656 37484 50666 67935 76194 98896
14362 98896 77791 77066 89947 86200 89031 99200 81150 71913 83746 108504 84797 76666 71053
14349 71053 71908 69369 73477 74874 105791 116207 126184 134748 126349 106181 80706 95555 125952
14336 125952 109136 93924 78455 85631 117785 129910 135669 139413 155232 130602 108358 113791
14324 113791 78712 65572 75806 100918 108937 119097 122313 148105 149539 153300 156667 146651
14312 146651 124697 128873 156852 185244 205571 227639 239761 212961 194527 241950 262635 307660
14300 307660 344292 403432 472113 538198 629375 737668 873739 1011366 1121474 1197883 1242049
14289 1242049 1229375 1172587 1077970 971289 823200 666357 561208 477830 431249 373565
14279 373565 304960 255461 231006 223287 206986 208360 191256 177452 168311 181112 205614 198374
14267 198374 164150 144387 131799 129931 149638 161892 152317 164692 201183 195694 151570 135281
14255 135281 140004 124707 141264 138250 140481 117071 124371 153961 159161 172364 161908 156414 164367
14242 164367 178388 197144 200254 196045 191343 183913 189999 180189 170820 166317 173247 190258 192251
14229 192251 166270 133877 118998 131631 123868 131564 136867 133173 140400 161783 182113 182454 152625
14216 152625 154588 200076 212047 201999 220715 249024 248130 219573 220349 242719 252204 264160 303897
14203 303897 306629 295565 318874 323349 311675 314744 312403 291756 264775 281215 275393 268140 265896
14190 265896 258995 278525 310713 324017 302542 282103 273420 272431 285666 284731 271286 277970 281284
14177 281284 281753 274669 269966 277408 297265 297821 293716 282737 300327 272521 259125 271900 274569
14164 274569 261374 282448 279552 258593 265079 262168 257543 235208 208828 216186 225829 245072 258390
14151 258390 231955 208646 186024 198969 214164 206380 215601 211319 217028 209113 191944 161167
14139 161167 133903 154970 167669 181474 212182 262848 266186 250616 246426 238226 229730 214816
14127 214816 189668 185362 172365 208821 237956 229530 217258 236083 239875 265358 279984 264284
14115 264284 259770 279483 295455 289096 277611 262443 290879 315295 290307 281528 298457 322731
14103 322731 322282 292458 309525 324512 324355 326151 320334 341610 351043 332390 327796 326121 309772
14090 309772 298730 288831 297363 298471 326669 322703 343626 338951 354908 354217 360120 365366 349679
14077 349679 361968 401918 408934 394388 390542 366651 369128 356997 349495 337508 339213 350639
14065 350639 339762 377385 387243 387952 390944 375823 366517 406680 430264 424335 408877 407376 418115
14052 418115 409585 407334 361167 362523 394805 435181 418177 381899 343584 337640 386719 420709
14040 420709 424648 435423 455171 467589 481540 465024 452272 421262 438317 452323 453855 432740
14028 432740 412625 434852 484115 504409 481907 453346 449069 451071 454430 436794 409877 406249
14016 406249 399345 399868 423728 430423 443531 440614 466121 451436 431397 429666 451008 465168 479625
14003 479625 493485 521837 540610 527900 547077 585570 627930 632980 624822 631006 650534 642056
13991 642056 653649 667645 662655 663466 656232 642850 647139 673545 674901 659997 653645 628430 630499
13978 630499 671880 731926 801553 842386 881265 911494 930994 942734 968625 937108 877471
13967 877471 829371 794241 739696 693492 665673 622802 615442 637804 630920 648415 645923 643257
13955 643257 627787 662497 671357 651853 659574 673689 697131 717219 741501 775765 828694 858546
13943 858546 875059 927476 958589 950722 930954 911448 917504 925556 915697 880546 840320 887345
13931 887345 928751 930403 926588 907054 940587 991384 1010384 1005814 1012818 1034581 1046896 1080987
13919 1080987 1108739 1130835 1167407 1197131 1207724 1214506 1242040 1292998 1324012 1360799 1383383
13908 1383383 1394120 1396274 1399285 1423056 1463218 1506600 1558317 1582265 1625376 1682863 1732600 1785805
13896 1785805 1860924 1944839 2021029 2090422 2177910 2287998 2385263 2485294 2586447 2695822
13886 2695822 2830867 2954609 3077301 3200809 3327544 3478547 3670255 3832858 3995585
13877 3995585 4213398 4497627 4810363 5129661 5480626 5854429 6276083 6780225 7323263
13868 7323263 7910784 8578988 9326865 10199164 11229726 12454737 13917511 15618637 17621840
13859 17621840 20003782 22759928 25971092 29788782 34394800 40106912 47370924 56768477
13851 56768477 69106421 85318273 106106899 131262285 158783844 184636855 204495605
13844 204495605 215960609 218709058 213048428 198842071 176709659 149617392 122085615
13837 122085615 97764740 78178614 63118434 51781112 43213467 36663331 31548569
13830 31548569 27421398 24062716 21251934 18838471 16722023 14843246 13232177 11874475
13822 11874475 10727949 9749449 8873754 8127821 7488404 6928422 6433087 6009788 5635378
13813 5635378 5288501 4952172 4674843 4422192 4183345 3967782 3758826 3533397 3342380
13804 3342380 3140622 2947015 2779342 2662729 2546134 2449009 2330538 2229530 2121016 2066092
13794 2066092 2040078 1989187 1913972 1844695 1793323 1749941 1691320 1645573 1600218 1546700 1453753
13783 1453753 1400233 1349003 1305679 1251957 1196806 1158339 1146312 1112459 1076086 1054454 1026666
13772 1026666 988508 991297 973915 937467 927703 906599 887984 865612 823055 793838 762682 744798
13760 744798 784990 832410 828346 792110 794265 791479 775436 782486 794290 766390 736776 705240
13748 705240 688822 702056 703591 702314 705199 704406 678357 656004 638095 648287 641391 625893 626740
13735 626740 600263 558024 556534 561867 560561 571345 565899 524218 495682 505173 520657 516962 496347
13722 496347 461892 454654 451970 476106 466593 410454 400098 406894 431652 433498 437145 436104 399360
13709 399360 383776 357671 349238 391664 404016 371317 372149 360654 383574 382167 384847 372724
13697 372724 359161 352928 345216 343759 341133 320313 328939 351762 372922 372516 350809 319975 285765
13684 285765 272631 285555 252420 248070 267160 277760 303954 333118 353628 361647 359069 358862
13672 358862 382447 366419 373326 369665 336394 327937 317530 310326 318923 331674 335521 339081 333283
13659 333283 331410 328695 328474 363255 355549 342992 360620 378596 370314 336473 297538 301188 325079
13646 325079 331022 337711 321493 335221 318047 313606 303803 323080 331621 330097 340043 330619 316213
13633 316213 321453 325565 317670 328367 328624 353667 361980 357570 333446 308124 317531 334413 339574
13620 339574 355350 320586 292672 290581 297531 320819 317928 312969 312624 282742 277631 278437 296012
13607 296012 303387 327135 330588 323723 351479 368221 391001 401721 373668 366879 383107 391763
13595 391763 407584 428984 427556 429927 458225 485129 497577 444950 446522 463655 440592 417275
13583 417275 405136 427871 439247 438366 432561 392144 341316 345580 352137 355426 359604 368368 359047
13570 359047 364419 394128 385768 375119 382694 397886 412666 418021 418143 418648 395556 392503 382625
13557 382625 372353 374643 381810 400118 424755 437436 464579 441001 440771 443301 464706 480722
13545 480722 461507 447584 480902 495843 483813 482647 514741 507200 499015 483776 499478 526747
13533 526747 529789 532303 548778 539794 547374 573214 564438 550569 535426 542877 538508 521132 518458
13520 518458 549508 563620 533531 534249 543597 544795 544963 550644 566854 570212 573241 575111 565786 566056
13506 566056 571184 611549 613367 612951 622463 621216 576945 591218 631466 628635 642968 630273 629402
13493 629402 631566 654907 658202 667909 676242 673339 696947 737796 770712 820685 869693 835561
13481 835561 800877 788184 760822 733098 725438 733779 753566 782181 760359 752645 754410 771148
13469 771148 770870 761402 777315 818008 850001 891746 874847 824325 829434 858486 893643 918945
13457 918945 921117 913323 918007 918595 967250 971957 985460 1012283 962426 942816 933528 951050 975152
13444 975152 1010787 1030485 1033122 1052250 1082856 1122143 1148820 1140132 1130983 1162462 1187178 1187495
13432 1187495 1221788 1264786 1243339 1226486 1256342 1267828 1287594 1267136 1273530 1319858 1329561 1346069
13420 1346069 1363088 1339770 1353648 1391518 1416862 1459728 1491098 1520239 1543882 1548506 1557820 1614797
13408 1614797 1634275 1665803 1740367 1744954 1731619 1754781 1819021 1879055 1954854 2043274 2148724
13397 2148724 2246990 2355790 2473330 2633553 2798134 2932488 3046949 3146341 3163950 3104352
13387 3104352 3004409 2930558 2859615 2754659 2688707 2649813 2613427 2557814 2540356 2538168 2551276
13376 2551276 2571046 2613176 2667587 2706470 2726798 2760143 2801835 2859889 2875264 2903860 2956892
13365 2956892 3006285 3069128 3140593 3195562 3238361 3305309 3389046 3468508 3514308 3565045 3633984
13354 3633984 3709253 3782140 3839153 3883045 3937305 4031736 4109703 4187795 4272710 4378560 4486688
13343 4486688 4592673 4669058 4753631 4858230 4947940 5076406 5184515 5294444 5428038 5534108
13333 5534108 5624810 5758554 5896327 6032520 6184459 6347158 6493130 6636521 6757691 6905294
13323 6905294 7078130 7290728 7498840 7687694 7870642 8060691 8200332 8375639 8581733
13314 8581733 8811273 9023038 9225834 9437532 9655024 9848678 10064778 10296357 10518643
13305 10518643 10761586 11017813 11259576 11499293 11720936 11921646 12163219 12418342 12642900
13296 12642900 12888660 13110209 13300757 13507728 13749193 13965177 14142275 14323658 14504914
13287 14504914 14662034 14805592 14948807 15050992 15150096 15247440 15306041 15369046 15422391 15473392
13277 15473392 15507411 15512632 15508392 15468343 15393213 15310318 15217682 15114161 15026383 14943542 14794847
13266 14794847 14663467 14519949 14337726 14113866 13906771 13695930 13492680 13274700 13061888
13257 13061888 12830512 12579003 12341693 12091985 11860003 11618166 11393981 11160730 10927985
13248 10927985 10670626 10447100 10234079 10012827 9807048 9588294 9355894 9146512 8929331
13239 8929331 8722615 8528316 8343577 8133409 7929537 7741090 7573897 7420272 7258730
13230 7258730 7110823 6932636 6772406 6610783 6445284 6311471 6164519 5994337 5868577
13221 5868577 5785066 5682362 5568895 5417696 5250583 5109701 5024700 4937163 4845118 4718694
13211 4718694 4628452 4553854 4458064 4356263 4249901 4159311 4083831 4021561 3946138 3873066 3803432
13200 3803432 3713306 3635807 3570951 3505570 3443004 3402592 3343890 3277262 3172304 3092528 3019201
13189 3019201 2946847 2909212 2884158 2851214 2784451 2742051 2692455 2654816 2620978 2601686 2564446
13178 2564446 2546926 2510795 2453336 2400304 2333994 2270819 2241945 2206117 2172478 2136819 2109195
13167 2109195 2109572 2083094 2021263 1987804 1960759 1919686 1893573 1866354 1821527 1798890 1765510 1750367
13155 1750367 1705345 1687189 1667982 1640653 1634398 1624980 1623975 1629843 1589859 1553623 1543686 1517154
13143 1517154 1487541 1464333 1472140 1442705 1413987 1376523 1346432 1321056 1285716 1261302 1258085 1254694
13131 1254694 1223048 1178326 1157735 1146773 1158467 1184730 1194744 1165181 1130671 1118921 1109073
13120 1109073 1110366 1087334 1071029 1054440 1025389 1010714 1017448 1011852 998334 977710 970454 961093
13108 961093 946276 953033 936537 925144 943492 946616 917956 904467 920300 921372 898865 873744
13096 873744 871844 858916 841298 837385 830647 814135 778604 763050 750349 715875 706829 727849
13084 727849 784799 781911 755290 719474 713793 749513 752247 737148 752732 736369 701268 696819
13072 696819 716768 719271 701995 674943 658385 650078 621649 602227 615473 647965 655886 630771
13060 630771 607507 604411 610937 626019 603255 585680 589928 573114 568654 560134 553266 563558 601080
13047 601080 609807 603800 581377 562457 541987 550201 554200 566316 564537 546203 548675 572522 583015
13034 583015 599330 617114 597704 557531 544167 545926 553912 538769 515704 503877 510394 511991
13022 511991 498843 472237 464592 489112 477596 475235 478870 452506 449572 448726 419171 390891 406581
13009 406581 414039 428812 427462 433299 425118 445737 463980 454842 454467 477339 515377 547971 536703
12996 536703 496635 463290 447334 455770 439084 386645 362430 383754 393982 370579 398426 415491
12984 415491 408232 390540 392861 370621 367191 370099 348585 337718 358793 393112 417305 399401
12972 399401 347115 329382 328722 333085 344123 381916 427724 421795 416983 412621 391401 384515 367117
12959 367117 361889 345414 309312 315389 293558 276654 274431 287081 282597 279319 265164 221984
12947 221984 225678 245181 277075 303597 281174 277547 313327 309092 298900 307892 307420 287573 295708
12934 295708 298437 307746 284954 284029 281550 269993 261277 270651 283220 275869 268651 256392 250610
12921 250610 278610 310552 326050 310804 275875 276392 268414 275528 292709 314292 272005 256667
12909 256667 249816 257294 255370 237563 237002 240426 243800 228947 227760 236519 243603 263933 291362
12896 291362 289810 281072 299078 267171 248303 270249 284125 273355 231879 229996 253719 261090
12884 261090 262419 264126 246170 218666 204650 224235 242125 237232 247347 270517 293623 282802
12872 282802 276712 297002 284116 257412 249004 257045 250035 232335 222061 223636 252513 247731 231335
12859 231335 213122 203963 214526 202221 213558 221312 217319 203214 220762 198495 200258 196842
12847 196842 200939 193627 202227 242150 222584 197467 207893 213280 214720 233871 212721 213151 253933
12834 253933 267209 285601 320007 332081 352203 389533 420168 440942 464983 534983 615423
12823 615423 722491 895184 1172639 1594137 2142410 2628895 2872227 2873760 2687502 2256954
12813 2256954 1668638 1183755 841742 647811 537081 462685 403581 348021 352443 334778
12803 334778 301527 268841 260775 253388 231916 218935 197854 185561 183507 182040 178293 201897
12791 201897 215730 220019 219006 223977 251851 243588 200720 183468 163426 149010 135540 111834
12779 111834 110770 124586 132299 154461 163093 171462 159111 148793 146447 147639 131346 137198 147370
12766 147370 141748 143546 155248 150889 167397 168376 153291 158237 176484 161530 158707 167806 149520
12753 149520 172126 202903 194877 178709 186446 178551 200332 234186 218749 196011 177814 202144
12741 202144 166771 133845 143832 123767 133706 155141 136354 136014 141928 143062 158410 177244 189312
12728 189312 189117 180200 169773 152859 154734 172967 166424 144283 160981 178256 209177 211351 172391
12715 172391 155182 157004 174000 186108 182675 189676 185726 187047 184621 192442 211123 211039 178293
12702 178293 171496 160056 150733 177864 173898 141089 139888 138798 142204 158566 179664 187068 182619
12689 182619 204287 200598 177451 157933 175471 180946 171624 181240 212834 234898 225976 223769 244567
12676 244567 225441 228672 219355 206834 184768 160777 171743 163222 157791 196157 234460 229451
12664 229451 225920 244087 265703 255652 247039 244064 209462 209782 229543 240684 229290 244435
12652 244435 229863 232539 289597 325715 307176 325904 329508 309612 323558 329037 295085 291655
12640 291655 276318 274821 298927 280591 310032 347001 394322 447035 461602 469697 442484 398700
12628 398700 311436 271963 264141 237717 259710 295845 319576 310056 301892 318573 368837 380440
12616 380440 385886 389179 412281 419607 401328 388649 387094 382500 414312 435350 445365 460906
12604 460906 467728 460838 470237 484612 526620 557001 571965 589875 652804 735320 813217 858408
12592 858408 887446 943750 988629 958394 958474 937126 913431 914164 884598 852232 828880 845256
12580 845256 859466 886586 953343 1042590 1120871 1126169 1088091 1036201 967313 859630 745581
12569 745581 630131 547775 481668 439606 418072 408906 415624 417748 423327 416522 419227 411136 404261
12556 404261 381776 351843 348406 354484 369457 371364 346505 348056 331288 317112 322212 343939
12544 343939 360040 370620 375722 396975 453860 507677 505955 519845 556206 575938 551949 486583
12532 486583 439086 440347 439316 412204 399200 396889 388968 370814 352136 374012 406834 437137
12520 437137 459041 500670 539757 564737 558574 543727 544486 561151 581310 607558 702735 859292
12508 859292 1124601 1394889 1553602 1591632 1514105 1338696 1072249 820114 639318 561920
12498 561920 528657 500888 505291 535371 544206 533867 529121 534020 541443 550665 585757 619963 592886
12485 592886 560889 580551 620624 654612 711341 750226 802064 881559 951824 1021580 1059505
12474 1059505 1083475 1084675 1065091 1033887 1015487 1004429 999418 1003225 1036154 1043454 1052802 1049941
12462 1049941 1080467 1126658 1184523 1220688 1263935 1307542 1341358 1365183 1382827 1397981 1408487
12451 1408487 1418381 1438085 1496202 1561996 1594066 1613356 1651895 1743208 1809868 1868443 1856627
12440 1856627 1849471 1849824 1840433 1826585 1832635 1856644 1913131 1979999 2053237 2129389 2212150 2298385
12428 2298385 2367064 2438713 2543431 2615448 2698776 2796332 2901619 2987525 3090436 3200803
12418 3200803 3308453 3418540 3544908 3647885 3717047 3780270 3857858 3989456 4149624 4336677
12408 4336677 4584287 4903143 5235884 5596901 5962043 6387153 6825547 7330377 7917796
12399 7917796 8613703 9454813 10435663 11621262 13084160 14896898 17147367 20051601 23748844
12390 23748844 28259464 33547659 39749012 47501435 58001230 73239211 96712166 134328027
12382 134328027 194569120 285334308 395043748 483362716 527235094 527000232 483539914
12375 483539914 396123306 286091646 193326546 131860904 94446171 71512756 56752309
12368 56752309 46550403 39011185 33078543 28127953 23864968 20294097 17458827 15251643
12360 15251643 13523813 12136299 10973011 9960254 9088450 8320865 7635498 7001273 6454101
12351 6454101 5996247 5584065 5277410 5041813 4812189 4573513 4349822 4141560 3903616
12342 3903616 3676880 3430119 3208450 3040716 2853092 2703646 2561141 2444565 2359485 2306644
12332 2306644 2253479 2157347 2094098 2038632 2001827 1983706 1962136 1902159 1833944 1783139 1725328
12321 1725328 1677612 1636699 1588671 1525272 1444562 1382685 1357379 1305352 1253769 1247301 1222787
12310 1222787 1169208 1149041 1116062 1061367 1046149 1041693 1061967 1082103 1063790 1039026 1016401
12299 1016401 1021678 1011277 1021058 1008292 963030 904883 876330 885762 898157 906201 901118 854460
12287 854460 833187 842175 810742 797469 802102 808042 806642 821946 839800 822076 810554 819759
12275 819759 814109 814818 795189 758362 716717 693166 657092 616243 616720 601215 526654 496846
12263 496846 471343 454860 455537 477597 473248 453192 436392 427994 380385 335534 307124 283902
12251 283902 299776 321972 343458 362766 366766 385538 380111 359964 341288 319971 302916 298317
12239 298317 295158 295978 296197 286964 305712 315489 334466 355252 373472 399772 403765 374417 361161
12226 361161 327619 282973 225547 151679 86421 73830 74879 81345 89002 123873 178046 177457
12214 177457 163955 176156 181868 199861 201417 192121 188971 206075 215667 227717 219803 202211 213383
12201 213383 219184 235037 240605 224128 210206 220299 214736 246053 227465 215250 237635 271502
12189 271502 274244 275852 277249 248262 233511 226621 243489 240342 209571 202420 179932 119485 102573
12176 102573 101811 106411 108162 139522 176364 180793 176093 175034 148730 114057 109198 103438 118672
12163 118672 130840 135762 126823 136843 154673 195993 219417 199414 174149 148771 113833 88511
12151 88511 67292 89756 75135 82642 87574 97274 132046 134080 97128 50029 44741 72595 69938
12138 69938 71046 64501 80024 95412 109715 115380 131655 143315 164366 171108 199646 227130
12126 227130 270500 283924 284307 292557 272870 289890 275570 243028 223848 182184 173406 143501
12114 143501 89537 68816 65061 61582 41740 37782 48404 44475 63383 80108 88720 104944
12102 104944 90703 87430 86627 98292 95343 75311 45366 30885 5119 13314 67364 100811
12090 100811 97755 77023 67244 83153 75114 60414 41859 72088 96254 116298 145834 169349
12078 169349 150912 118649 97703 119896 126616 122996 115212 122202 128747 136910 126352 96409 88138
12065 88138 81714 69935 79412 75609 88643 91599 99642 120903 105940 104043 96098 95368 104545 79326
12051 79326 66256 90718 99558 65140 75865 85182 80696 56112 31938 21854 44915 92449
12039 92449 93914 52822 67522 111710 127732 131335 124806 106631 108610 98997 117369 113483 107054
12026 107054 100602 81959 60903 61661 58403 49812 47737 38183 45445 67605 41974 43897 50396
12013 50396 37580 55293 88740 104278 91389 59004 14423 4027 27081 55917 47095 14851
12001 14851 14038 25679 20651 30243 60517 50144 62788 69396 79998 97423 124482 125012 100863
11988 100863 76124 73590 84146 68043 86169 104377 91539 56690 30468 9514 11233 10035
11976 10035 25491 38148 34945 18522 28457 41014 40765 62396 62118 53706 51933 78397 80909
11963 80909 74536 76158 78193 70921 40047 22260 27055 40776 54015 55852 61356 56495 76099
11950 76099 96123 92657 112662 145687 182998 201520 215976 253326 301512 345215 398725 481120
11938 481120 601342 824278 1159272 1650015 2173038 2545151 2722278 2660228 2380589 1910677
11928 1910677 1358381 936558 671956 514252 392276 291377 271335 236267 182039 159422
11918 159422 147646 111907 87766 96378 75417 36438 43516 61098 70423 71085 75689 75131 60361
11905 60361 52329 75268 81010 64677 67310 108790 103036 90296 79184 69597 60235 37743 46303
11892 46303 53053 26811 20357 38790 49604 8837 26294 32252 45327 50207 35806 40401 49316
11879 49316 64082 71329 51067 26409 21273 17150 13566 44832 46796 -2146 -3669 2042 -25589
11866 -25589 -9874 12790 31598 52206 42497 21998 6936 24747 36153 28928 25482 46803
11854 46803 18305 2022 16082 26232 25728 6745 7364 8544 -20398 -27961 13639 11118 -9255
11841 -9255 -14200 -29147 -14089 -1568 -10196 -26639 -13856 20573 22213 787 -14404 -1329
11829 -1329 12952 8041 25003 45366 23802 19827 22786 22612 11408 22235 55446 57194 38620
11816 38620 41572 31387 -3294 -6212 15977 9276 10319 40307 60113 36053 -1732 12773
11804 12773 27806 23276 23785 37453 50425 52120 57243 44434 64516 60688 34453 16529 29096
11791 29096 52533 56990 51910 54392 40073 47915 44747 38357 42141 18550 6042 -11129 -4157
11778 -4157 19142 28712 188 -2368 -14543 -29073 -2572 8011 -2791 -18736 -23763 -5815
11766 -5815 35320 31210 25351 11565 24837 22800 29302 23698 14854 -5208 -19403 -13471 -148
11753 -148 5753 -3626 270 7954 15829 10024 3029 8775 10426 -2741 14513 25174 5296 -11747
11739 -11747 -9037 -15360 2583 15966 16060 33727 72813 51991 27893 25298 29084 30689 11645
11726 11645 7617 37994 23360 18333 3399 -13254 15530 40770 40865 22128 3563 -32791 -31661
11713 -31661 765 7578 19268 21276 17780 26238 27796 31628 39205 52018 62015 28975 8165
11700 8165 27472 36828 15889 4418 -21557 -45962 -44175 -59161 -51734 -23395 12415 30415
11688 30415 34789 18841 15589 9547 22190 5885 -6087 -6847 1845 20659 19087 15982 20510
11675 20510 14334 -15642 -17141 -31727 -22808 -29000 -26675 20868 46016 24637 36011 58922 46293
11662 46293 22586 28405 34116 16164 -16694 -11451 -8824 -16299 -17967 8376 27331 34405 33032
11649 33032 17345 -11232 -23781 -30634 -13906 -2630 370 10897 20024 10437 23500 24444 27211
11636 27211 35020 29452 24565 21160 26879 19530 24650 51182 32435 45733 54537 48433 19274
11623 19274 -2112 7281 23438 11783 15033 -205 -41442 -40799 -38546 -29286 -15678 -13262 -27816
11610 -27816 -35341 -27429 -28518 -14015 -7897 -3899 -3973 -1267 -9323 -13657 -9857 -8265 12774 23925
11596 23925 -4074 -13597 12523 12925 -2217 -4493 11462 9442 22365 -1153 -20979 -20313 2698
11583 2698 14409 46799 54863 30490 27802 -4965 -13939 -13081 -9120 -72 12711 12474 7346 33185
11569 33185 25309 9594 -17970 -25299 -7912 11836 -23114 -31041 -23828 -20964 -13160 -5354 14738
11556 14738 9728 8245 7910 -17967 -19574 15210 17753 9140 16798 8954 -6471 -9620 -10768 12452
11542 12452 12635 7713 16744 24753 8818 -10589 -2383 17371 50826 58374 27234 23751 31436
11529 31436 9726 -8079 22919 32450 1006 11153 28031 9037 -2263 13140 18792 16816
11517 16816 6976 19139 29449 -4382 -33641 -17725 -20442 -45112 -27280 -16415 2918 17162
11505 17162 48935 61365 31488 20478 19867 43102 30686 10476 19293 18593 -11374 -16821 -3530
11492 -3530 21642 -5732 -22725 -19721 -32708 -21732 8644 -7843 -53301 -60368 -27495 -15444
11480 -15444 -4733 -14635 -2692 18586 31563 30186 33844 21231 147 -591 -5935 -24986 -35456
11467 -35456 -18371 11598 15200 -24162 -32041 -19528 -9087 -9645 -16891 -23821 -7763 20463 33054
11454 33054 37760 41529 45981 36110 1460 -20492 -18209 -28338 -33604 -11209 21873 21725 -3862
11441 -3862 -7572 19890 25452 6641 -8525 -4469 -14745 13247 46386 48442 60211 58495 53752
11428 53752 24892 -34579 7364 24773 26481 554 -17659 -30994 -46127 -40124 -8617 23060
11416 23060 37884 41214 20979 8890 20286 17387 -10322 -13361 -27202 -24857 -26359 -78 16355
11403 16355 8056 13613 4313 6780 18111 20160 -4833 -35258 -58103 -72680 -59552 -33363 -16309
11390 -16309 22430 15955 -107 4052 -15718 -1984 16910 -498 11117 14700 1516 -1230
11378 -1230 2283 13544 25878 32895 25745 17385 10796 3143 4657 19392 9976 -13713 -9102 -17792
11364 -17792 -14287 -18393 -17521 -15963 -1355 10982 15248 -12213 11046 14765 19082 11336 8568 14533
11350 14533 10059 -17913 -17189 -11941 -3318 1224 -8322 -10007 -3398 20300 32328 29190 19676 1713
11336 1713 -4801 19020 19920 -5988 -15074 -12039 177 -39677 -49290 -23097 1563 21721 28984
11323 28984 23927 14561 25361 34422 29937 16739 3505 15283 38732 46065 34546 1760 -4247
11310 -4247 29068 8823 8854 13050 17448 18432 21955 10448 -25320 -39049 -32908 -6945 49360 59569
11296 59569 52979 52189 71445 52552 14209 -9819 -8114 -9901 1112 -9664 -21878 -21962 -12045
11283 -12045 -30249 -42865 -33804 -13343 4570 20022 2221 -26378 -42521 -47378 -18839 30322
11271 30322 57714 47905 51559 39039 37304 28669 8280 -14981 -20478 5952 19115 6628 -6865
11258 -6865 -35237 -19380 -428 3524 10037 22499 23324 50157 33939 20916 -263 -5643 -14475
11245 -14475 -43508 -26777 -22767 -27440 -25984 7892 39701 9110 -38032 -25487 -11103 -9103
11233 -9103 -4168 9800 25398 44698 51731 40782 38803 30583 41481 27039 18353 57931 58197
11220 58197 22287 -29584 -55027 -26492 -16042 -9989 -108 -18885 -28221 -11080 -14267 -29069
11208 -29069 -36201 466 11715 12054 13988 25709 33319 32404 20889 -5222 -17586 -16736 -33187
11195 -33187 -34586 -30810 -27735 -9454 -10851 5006 3249 12864 19123 29630 40516 -1279 -29142
11182 -29142 -26660 -21241 5740 -3937 -17501 -6498 -10561 -11479 -7640 -21207 -8954 -23780 -25535
11169 -25535 10868 19519 8764 -30138 -26013 -4188 -1377 -10020 -9259 -1862 8534 1664 -16883
11156 -16883 -29982 -7746 878 -15192 3662 31018 12097 -8308 -13381 13285 44209 1362
11144 1362 -35721 -31507 -24435 -10956 -24183 -16248 -963 -10241 -42043 -50136 -63722 -66390 -21780
11131 -21780 2305 29657 60732 52817 27254 14133 -20453 -42395 -40460 -31687 -12602 -16930
11119 -16930 -2709 -17960 -19278 -15666 -20642 -5373 2517 4174 6400 -7745 -15490 -9670 -15872
11106 -15872 7633 34461 19269 4125 -19002 -36711 -17421 5448 -3768 -3739 -7259 10632 35754
11093 35754 32451 28575 2628 -35356 -54235 -45839 -25065 -19504 -43780 -24215 2501 30451
11081 30451 21782 2614 -18558 -9346 2078 -31402 -25225 -44184 -22084 19747 38957 20745
11069 20745 -20965 -46583 -28480 6557 28851 30957 8447 -3046 12090 30870 40390 43959
11057 43959 34016 44168 35944 54232 59964 56725 52652 31764 19064 36701 33990 46224 64260
11044 64260 66537 57453 50263 37141 51019 29706 24871 28360 8748 -16538 -14751 -8415 -10243
11031 -10243 -26256 -18926 -4492 9153 21026 4208 -3863 -28476 -33237 -23539 -16212 -11099 -21521
11018 -21521 -11487 24959 23309 -8910 -43592 -48928 -34819 -33083 -22559 -14549 -1453 13806
11006 13806 4328 29079 39855 14400 -1469 600 2786 19796 22208 2515 -4626 -9180 -26555
10993 -26555 -33304 -47397 -63551 -57184 -48788 -42038 -1909 13728 -3212 -29847 -30632 -8955 -14345
10980 -14345 -17449 -15830 1398 32485 28225 6709 -20498 -11575 -28124 -27723 -12443 -5923 870
10967 870 30148 29104 19900 6931 -11834 8665 11063 26577 19923 30261 6885 -39318 -29272
10954 -29272 -16056 780 16912 5004 -15243 -17189 1138 1883 -5616 -17032 -16071 -13150 21068
10941 21068 32304 9920 15411 9776 2281 23755 25462 6319 7808 20168 6937 869 1910
10928 1910 -1345 6800 -1244 -21516 -17022 -3652 -19631 -25453 -11699 9967 14675 26918 47417
10915 47417 81334 122533 99860 66443 69838 65082 31786 34488 32113 24651 -969 -9563 -10205
10902 -10205 -321 -12207 -19829 -18835 -2150 -4907 -2537 22072 22600 29731 51094 30815 18150
10889 18150 22435 12965 22625 39898 24036 20488 -4424 -30818 -22131 -5680 -9282 -16602 -8442
10876 -8442 7407 -14025 -16595 -2186 10583 11700 16612 18581 13701 38274 21378 -1477 -1951
10863 -1951 -4489 3391 -9033 -36247 -40472 -14845 10712 -14411 -3605 -6982 -18650 -4616 -31599
10850 -31599 -37138 -70971 -74771 -36924 -11131 -5450 4057 966 16063 13409 -8394 -22195 -35166
10837 -35166 -51779 -34151 -2906 -18765 -22322 440 -956 13380 -5994 -29327 -31953 -35670
10825 -35670 -32022 -43069 -65506 -53995 -30836 -32777 -51048 -25530 -2677 9012 22937 14603
10813 14603 3545 -2669 2401 2534 -2889 -956 14433 22973 22732 23271 -4425 -16915 -13087 -14788
10799 -14788 3795 3138 -7695 -16497 -36975 -45933 -32218 -13100 13782 7564 208 7130 2118
10786 2118 -7098 -14168 -34112 -37577 -17540 -1531 -25743 -36630 -19517 7518 33624 12017
10774 12017 -5975 -5887 -22262 -14881 19789 40160 39709 6431 -18520 -19024 -23648 -17938 -17891 -5624
10760 -5624 -11714 -26232 6843 -3981 -36563 -18058 6622 16602 28206 35788 45837 49631 60576
10747 60576 41711 27380 -2795 -25760 -24392 -3436 -22284 -14654 -2221 -18103 -18489 -4594
10735 -4594 -29634 -17575 6889 -18138 -32094 -9366 6386 13521 37392 49870 21845 20515
10723 20515 22275 37276 34895 42722 21438 -5021 -3025 -37469 -44676 -24605 -10174 -1012 5662
10710 5662 13456 10465 5770 1044 -27673 -64613 -59825 3227 54546 48871 46310 35703 23677
10697 23677 5368 15373 44090 65842 71404 57157 35961 28769 20287 9087 -10265 -1214
10685 -1214 18204 16779 8406 24679 46665 44727 32905 42054 39704 41162 37319 12058 12724 20353
10671 20353 31381 28646 8852 8216 17791 25892 26325 4793 -20501 -21868 -15795 5491 45068
10658 45068 60139 56807 49509 55069 71902 83060 67443 69557 59786 53465 62800 63976 25395
10645 25395 20218 24792 15180 16882 18192 10309 4218 22162 12953 9380 16507 12744 -464 3861
10631 3861 34298 35274 25463 10455 17615 41080 60488 59341 46170 30954 37294 50206 52515
10618 52515 47554 44754 31340 19066 25005 14488 18164 26480 28445 50120 54106 39734 59393
10605 59393 59611 61295 72079 55599 63770 45250 29513 23430 30194 36207 38016 19836 25528
10592 25528 29741 -2520 -19438 -10425 -7994 3117 8447 7666 5065 20121 21252 23715 16532 23958
10578 23958 20621 20676 28345 24934 2683 -12341 -1724 -4427 -10548 -5736 15593 21445 7657 13651
10564 13651 13034 -20157 -3269 6815 -27321 -31245 -3255 21749 22315 24844 50112 90947 120429
10551 120429 131725 120268 108419 91451 118304 112600 91359 74414 106294 129069 117512 70509
10539 70509 46980 60002 65297 56436 47592 39441 52174 45105 37108 39933 39457 47110 37390 47143
10525 47143 36377 10403 19411 11662 17588 10489 16339 16324 22461 38261 60306 81782 102393
10512 102393 102653 102645 104348 83401 79774 49055 21581 13381 4684 8220 12105 32659 52211 69745
10498 69745 44138 20848 23288 33149 55931 52030 28040 31452 45572 54965 66766 79179 109617
10485 109617 105500 95792 97843 91638 101123 106084 95770 73844 32653 14664 7359 16435 14305
10472 14305 17859 -6232 -12442 -15312 -21402 -8089 -3654 -29785 -19397 899 1377 7431 -14062
10459 -14062 -15620 6728 5930 10398 19137 3669 7548 18433 26157 25220 11894 4337 36294 22653
10445 22653 -13680 -13832 -444 14471 30077 52193 92012 73690 32934 28705 33241 19123
10433 19123 16970 -1868 -19490 -15654 -3015 32655 23081 11678 13895 19376 8230 10981 44196
10420 44196 44021 -3229 -9546 10702 19519 -1303 -24733 -24071 2815 33423 35888 25453 19692
10407 19692 -15507 -18218 -12598 8390 34784 32376 3232 -286 -3207 -22079 -43055 -50528 -46197
10394 -46197 -39295 -34853 -25136 1695 10362 4661 -1496 -19255 -17777 552 12548 14893 8571
10381 8571 4806 17970 8886 15171 34556 41664 6985 10867 26378 7343 24938 27273 -4518
10368 -4518 -25589 -20629 -9017 2759 -11012 -5178 15443 6912 19659 42851 5332 -13 14884
10355 14884 714 -4118 4241 -16193 -433 -3518 -28592 -23003 -10347 -15120 -26003 -34303 -20362
10342 -20362 -45235 -68313 -53435 -9709 10173 -5364 -12673 4516 23005 48170 39662 27113
10330 27113 56162 50105 7153 -34527 -36972 -49655 -46747 -27387 -18577 10556 4191 -7931 -27578
10317 -27578 -28431 -37375 -25944 -20946 -1856 -4062 -22485 -40481 -42891 5128 29693 35309 40282
10304 40282 50536 51981 14261 -17458 -12067 11121 15185 26566 41800 58237 55960 76400
10292 76400 84898 80742 57002 48946 33678 36418 25052 34395 30757 16946 517 2820 3511
10279 3511 15527 20840 16973 24804 34853 -2954 -23322 -28477 -18832 6813 2027 1163 -2012 -14712
10265 -14712 -9738 8909 44624 73809 25193 -7529 -10536 9957 33310 11501 -3647 -17666
10253 -17666 -6588 25603 55441 56209 30936 3435 -880 8639 -412 -22614 -7164 27423 35859
10240 35859 6952 56 14980 20613 8348 972 -36310 -35456 -11797 9174 23236 26092 31497
10227 31497 41274 51633 61579 54331 40369 22531 6395 423 36013 46850 31205 24710 24012
10214 24012 16943 26345 46113 58327 31306 -3863 -14669 -3817 -10601 -13045 -12291 -28924 -41002
10201 -41002 -35375 -4417 35019 17820 -5991 -4033 36058 85175 131082 133649 125632 143143
10189 143143 156593 123640 109725 105749 74719 65075 76804 87271 84740 72577 70895 84531
10177 84531 76414 28080 -6861 -3235 13946 3833 15326 17383 22393 2108 -7562 -5278 -16494
10164 -16494 -12371 -1671 13057 10307 13257 2180 7575 -13609 -27698 -19144 -33172 -15888 -4307
10151 -4307 2627 -4783 -35382 -44564 -26900 8966 12100 25381 33166 30361 42426 44071 51471
10138 51471 52142 38564 12301 -9344 -5968 71 -727 -5476 -4420 14197 40463 37099 -12891
10125 -12891 -15140 14805 13340 -12299 -6207 27190 28535 8715 -1328 -5300 -40101 -44594 -41204
10112 -41204 -34096 -49379 -38603 -18929 -3839 -8817 -50944 -62225 -36325 -29851 -28009 -12560
10100 -12560 18542 40486 28187 13447 7556 34820 45316 26306 29484 32865 25387 26157 53108
10087 53108 71304 59448 21086 794 18065 9777 -17387 -32408 -14910 -6550 6355 18415
10075 18415 -12278 -19253 -21812 2725 8633 -6661 -26959 -1563 26505 19065 11414 -26673 -13339
10062 -13339 30275 38012 48980 38914 40660 63240 54864 48406 42159 39066 25510 34665 29791
10049 29791 14073 38 -9983 -9426 -20025 -56788 -58813 -25258 -7774 913 -11404 -7020 28885
10036 28885 66746 46415 8055 1075 -10863 6296 37262 28175 12678 -7490 -29121 -20952
10024 -20952 -5962 -23 3263 -17083 15073 13544 -9928 -19698 -12169 937 -7019 -5466 -5281
10011 -5281 -12392 -26285 -18704 -2583 -51 -2003 1128 7891 29005 53759 53721 61626 80409 27535
9997 27535 -10996 -40279 -53595 -54512 -12076 18727 24331 10556 10532 16109 -9125 -13172 25754
9984 25754 18246 -12538 -3709 19480 13831 22021 23210 16300 50263 51168 24822 20606 15501 12581
9970 12581 10557 -11507 13720 33602 28327 18741 7916 -4032 -13291 -11712 -8132 6306 32689
9957 32689 29788 22629 19987 12723 31630 39326 8379 -4046 -21896 -17684 16091 29761 21797
9944 21797 30007 15718 9149 6480 11950 -6748 9047 -6438 -17236 -9082 18839 31966 4794
9931 4794 -11284 26842 55739 51666 30086 16158 20053 10208 4742 7019 -12398 9660 -5374
9918 -5374 -28089 -29007 -24305 4745 -20709 -25111 -4722 20403 39713 33973 -7329 -34349 -37243
9905 -37243 -28840 -26778 -18286 -8780 2566 6722 -11145 -20775 -14939 -24713 -8626 25735 32179 23740
9891 23740 33459 49366 53940 29263 12886 6771 8301 5102 2987 43131 55578 66386 51972
9878 51972 31504 38356 58440 57644 54888 68435 119520 139654 133267 96591 54718 35635 19311
9865 19311 -6874 -7393 -22549 -26459 -21023 10358 29190 37531 30377 14481 15934 22495 10315
9852 10315 9462 4087 15527 25619 41543 26201 26517 46285 35664 23363 16227 25730 54731
9839 54731 68997 85653 84437 53498 37363 34709 29420 11353 10306 4285 -19678 11984 60852
9826 60852 55409 4874 10025 19074 22652 -8679 1075 3 -3891 -15320 -21430 8135 20160
9813 20160 26453 39571 6502 -8245 -22114 -38675 -30016 -21149 -3571 -6850 -5915 -387 -1530
9800 -1530 -7362 5806 17820 -3946 -13080 -5679 -5187 12651 5501 3442 19972 19901 12655 -14127
9786 -14127 -49362 -49532 -41957 -34329 -71502 -76159 -48192 -28648 -8491 5637 15621 -8043 3287
9773 3287 15425 21385 8316 -15754 14226 17373 4446 3978 9081 15483 18648 23281 3182 4043
9759 4043 5513 20509 43249 36442 10134 5383 15248 -5890 -16013 8789 17882 -11976 -15297
9746 -15297 -12108 -31437 -25211 -27654 -37243 -19490 13753 16635 20009 18810 11816 -590 -4295 38986
9732 38986 58893 45392 23763 615 -44022 -58288 -41527 -34276 -17218 -5778 -6184 -8461 2822
9719 2822 2340 -4297 23223 38546 17504 20342 23639 13781 -27881 -32393 -3578 27260 3856
9706 3856 4680 21670 12753 15121 4260 12776 11747 6182 17680 9626 15432 24971 29392 39984
9692 39984 54362 38301 23458 18703 17178 9509 12469 9141 13552 6447 11375 14167 20712 27087
9678 27087 19018 11413 -8735 -21531 -48255 -32905 7349 9109 6170 -2210 6694 6107 -4647
9665 -4647 -6639 -10099 -6558 2166 27899 50884 57386 78384 90971 67173 38574 36834 53282
9652 53282 56510 60291 31377 13224 -20083 -23522 -8332 16485 -8679 -31570 -38802 -26073 2236
9639 2236 2380 9716 -10280 -18056 -14680 -8940 -8599 3329 39324 51644 28503 23057 50959 70970
9625 70970 63691 48157 54901 50622 51499 71090 79513 80602 62039 59267 31944 23364 8122 -14468
9611 -14468 487 36723 41441 38464 31618 23181 1708 -8221 4042 8446 -4306 -4446 -7392 -1038
9597 -1038 14615 41448 52138 58504 65484 69673 50903 57127 57745 55975 57219 49397 35622 32301
9583 32301 45208 51473 66248 50515 28395 44848 56958 69274 89815 102178 113866 100123
9571 100123 72495 56287 76134 100090 100638 72394 43517 54402 72343 45151 27606 18867
9559 18867 9866 36139 36586 40221 64668 49030 -1572 -2188 10761 20172 39548 33526 36964 41690
9545 41690 33161 27598 26028 21013 34054 36432 57925 67662 51841 29446 36263 51013 48053
9532 48053 41267 41782 21504 -11225 -31633 -24714 7527 5752 -3702 -1982 18357 21972 47528
9519 47528 45867 18385 5915 17633 19 5272 6520 13396 26463 28143 18634 26449 28169
9506 28169 32900 23611 13782 17737 648 -32109 -40952 -17149 -15897 -23317 1405 17554 16755 20543
9492 20543 17269 34021 30552 23777 -4007 9677 35008 59386 46040 46858 39396 20906 3288
9479 3288 12242 33289 13225 13293 11771 2956 23537 43124 28524 5615 3789 -3843 -11048 -18709
9465 -18709 959 21775 18249 -2687 -17295 -24426 -10417 52094 39346 19845 10631 -8545
9453 -8545 16392 11366 -10748 -36370 -49177 -38887 -23149 -4543 12315 -9125 -8842 3502 3000
9440 3000 31763 42014 21359 13228 9585 -15851 -19365 5557 31616 27641 24620 11117 55
9427 55 -7327 9778 5172 12353 30305 -1060 -46413 -64412 -41633 -26548 -28890 -37977 -26533
9414 -26533 -38602 -55784 -58065 -50679 -39607 -5434 1251 -896 -16464 -17496 -4219 13229 6677
9401 6677 -19571 -27582 -32601 -8451 19260 38465 40254 20141 17127 25031 20958 43166 53167
9388 53167 40695 41089 40457 15046 -2470 -9984 5959 19010 40290 30803 31464 28466 12963 10223
9374 10223 38745 18215 11616 18794 16160 46075 61376 39729 48968 62807 61785 42705 25956
9361 25956 17114 28547 50369 57395 31148 25025 -427 27339 30448 25616 33763 63876 44010
9348 44010 44924 60075 78656 106393 106286 97946 71198 57988 39161 81226 95118 70708 51767
9335 51767 67217 66864 92092 112910 106632 76668 80829 87854 116407 142652 161147 170578 159377
9322 159377 139237 143392 155446 160534 168090 221414 234586 260568 282390 313449 302324 329178
9310 329178 394261 478361 573305 670592 744976 776058 826456 878655 855698 819282 790162 732263
9298 732263 681974 650288 638161 648055 677155 696951 746010 799817 867114 925242 967636 979311
9286 979311 1000534 999770 990437 968789 951617 957225 946011 948243 977038 982472 1036002 1116227 1208186
9273 1208186 1314876 1438323 1544616 1669553 1831171 1924905 1922280 1881420 1820268 1704230
9263 1704230 1552953 1397768 1272204 1181934 1121555 1072915 1010266 970646 944163 937741 953235
9252 953235 978042 970166 969164 1002248 1026172 1014815 990705 957001 913488 873396 784371 719226
9240 719226 683150 665303 649334 650222 674540 714018 737747 755336 794503 788122 772639 754722
9228 754722 719179 656534 580277 490261 410792 362546 331423 286482 259709 245203 248408 235719
9216 235719 205422 167855 156422 165757 165902 168393 180399 192111 171910 104385 78166 103047
9204 103047 101165 81743 72009 78998 95769 140170 155858 147831 139060 115199 96199 99764 99358
9191 99358 107525 111577 95098 97063 91859 93610 98628 98263 109497 125893 101969 99522 100735 99073
9177 99073 107847 83248 58221 47744 56824 68754 63091 52482 54329 51713 51120 69422 88430
9164 88430 96169 99617 73311 62081 57010 43418 38591 43615 54540 43391 15973 17752 22309
9151 22309 26454 32762 39337 38066 36850 37311 54712 49496 52631 51077 53453 71245 67740 55221
9137 55221 39678 40665 58110 41882 18849 22283 39518 32871 27067 28548 28682 34505 49519 59569
9123 59569 59509 59671 38619 14294 -34855 -21311 -14164 -9862 12348 39462 24905 13296 60855
9110 60855 55432 42238 49960 65110 63125 49104 55202 39953 17664 -3478 1306 10340 12722
9097 12722 14666 20038 56941 39791 17317 22479 26003 26040 2185 -6461 -10241 -17791 -25010 -11830
9083 -11830 -12747 4505 39327 33419 19195 41640 43836 34768 35970 17644 27639 27703 36192 55828
9069 55828 65572 64441 42667 17823 20263 22439 11771 -3235 22064 41305 32437 45591 78016
9056 78016 65717 21280 -4938 12467 19198 12602 20984 29962 44288 41156 58607 59615 42160
9043 42160 13885 6668 45030 66967 62873 35114 41683 43268 20023 12363 33554 33766 35123
9030 35123 23659 4093 3526 13467 3476 -5871 -16850 -34762 -46638 -35258 -14844 575 12020
9017 12020 27384 25635 4748 3221 42168 30563 15664 25805 23064 35763 33709 18821 32181
9004 32181 13206 8957 8929 20901 31783 15231 2337 -17872 -1451 6010 -11892 -13785 -14384
8991 -14384 4220 8572 -30973 -17091 23535 22678 -5350 -27811 4439 23548 28414 43617 31678
8978 31678 11148 -1469 18148 33117 19686 3399 -25757 11060 31534 20190 3256 -24017
8966 -24017 -16568 -5676 -12516 -2843 -1952 -8468 -11986 -18539 -28378 -36864 -12198 31191 40105 49796
8952 49796 33358 23616 13764 -4393 -25014 -37874 -36963 -21368 -6315 1639 16719 7373 19178
8939 19178 18514 26471 22934 1713 -4966 -24171 -1957 10105 19579 22144 27610 2241 -4622 23675
8925 23675 27712 52294 38390 30089 42965 58545 74942 73156 43007 11973 14389 -7193 -13367
8912 -13367 17483 27284 60836 65237 47344 18202 7041 -1737 3319 12141 611 2909 9144
8899 9144 -409 -6084 26295 17561 -12794 7657 18535 -6119 -29541 -28461 -18925 -22501 -7054
8886 -7054 -753 1043 -9829 -3800 -1315 43 -11429 9516 34824 59108 62438 75253 107455
8873 107455 102030 121980 156845 154082 125962 102667 121647 111964 111872 138924 173530 264446 375583
8860 375583 538162 802148 1082633 1167349 961199 658016 447083 318494 219063 172387
8850 172387 137963 115591 90396 92813 90039 85915 55886 32192 28185 7089 -9892 -1594 10717
8837 10717 6549 15176 19919 30806 43771 21363 13815 12500 9772 71051 98062 96087 83615
8824 83615 85278 78891 57466 30454 21076 19986 602 -4261 -29190 -69645 -43120 -21337 -14697
8811 -14697 -30943 -21411 -25317 -4531 8287 -9698 -21613 -16343 4406 -5346 -16240 4272 18330
8798 18330 34862 19246 24261 46030 36033 30799 34958 12582 -7418 8909 -19650 -22551 2365
8785 2365 9374 24683 1516 -26881 -61620 -54800 -22912 8239 35040 31565 21933 18142 2382
8772 2382 4859 13842 26382 25102 32858 36289 19210 34332 42289 30763 -4895 6459 10843
8759 10843 362 390 2365 -9445 2831 8015 -7685 -1325 45 -26842 -49168 -31547 -19538
8746 -19538 -16039 -734 18220 15129 -10688 -8693 3238 -1462 389 23030 38910 25275 -6625
8733 -6625 -11326 -6681 3617 11933 43474 42823 42031 -5511 -35970 -25137 4493 -7922 -8243 -22255
8719 -22255 -22599 -17675 -1572 995 10784 14364 -2270 1160 -1475 -9721 -4155 -22155 -31053 -32295
8705 -32295 -24089 -28148 -24186 -22469 -5474 -771 2622 5775 10157 -1173 -6320 -2940 -16963 -25107
8691 -25107 -30459 -28516 -30250 -46314 -6368 15388 2563 -4124 -13192 -25929 -4131 8868 -13761
8678 -13761 -19035 -27674 -28894 -28278 -21534 -6937 10565 1271 -16078 4986 14171 10989 322 -7514
8664 -7514 -9770 -24588 -2764 -17129 -39058 -25488 -6966 -7918 -6265 16416 41088 40305 35745
8651 35745 26660 13615 -8160 -41264 -49249 -30059 -777 27456 39933 17436 3323 21475
8639 21475 27989 2628 6080 17318 12526 18373 4596 4942 -9655 -14177 -13454 -29386 -36281 -21452
8625 -21452 -15741 450 599 -1194 9247 1804 -11027 4596 15818 27670 55805 45273 31336
8612 31336 25695 45608 39136 21791 7612 15184 36134 36290 15758 3411 12453 25024 34523
8599 34523 7984 591 -2425 12138 23493 41275 29140 20554 18805 -7492 -3337 34110 51285
8586 51285 36052 28313 19238 12103 11170 22039 48403 94453 112678 99822 80331 47623 31916
8573 31916 29482 35762 36332 27539 4177 16293 17839 3588 1146 7846 20468 33871 25973 22710
8559 22710 28041 23728 24748 42409 31876 29867 26449 18938 18444 33560 23851 -139 -2555 7972
8545 7972 -4845 -15966 -212 17084 13658 49077 47856 12028 -29352 -42855 -41527 -35126 -40524
8532 -40524 -23255 -7206 -12914 -948 -12305 1336 15538 -7495 -37772 -29950 -5966 -1326
8520 -1326 25619 41249 17086 -28682 -26258 -21630 -34061 -58184 -64123 -37967 -26002 -19315 -13621
8507 -13621 -11305 14669 4474 9108 -4685 23367 17181 13015 16561 12523 -2915 -11515 -6458
8494 -6458 -11197 -19006 -24371 -4788 5379 10232 17719 -4146 -32647 -34097 -7846 32400 46783
8481 46783 54849 35077 8495 -5615 -555 237 1813 -17042 -36439 -28023 2053 24789 3161
8468 3161 -17759 -17298 4425 14348 16245 -1536 -4774 6297 24567 6437 -29390 -36487 -19294
8455 -19294 15426 37808 11995 1790 26081 18384 -2001 -1418 16092 19696 12528 31680 24357
8442 24357 13920 20694 10556 -12638 -7098 14054 22251 22363 27669 16832 11844 -3558 -20650
8429 -20650 -20540 -20299 -18951 2120 -88 -24693 -38352 -65157 -67377 -7595 2716 -21583 -51666
8416 -51666 -39554 -21742 3010 31503 41502 21962 18540 -3123 -18968 -2496 9563 2271
8404 2271 -12948 -32691 -49405 -34423 1692 37634 18929 -6547 -2352 -2828 -7035 -15758 -28558
8391 -28558 -39682 -44079 -32128 -9663 8986 8843 22748 9184 2683 11892 1048 19652 14829
8378 14829 -4233 -6151 -5953 -22378 -25576 -23209 -31511 -16993 -13720 -20596 -47116 -37255 -33733 -16895
8364 -16895 -24676 -23823 -3193 -10670 1105 -23363 -45011 -33892 -27893 -9970 6382 -692 -11388
8351 -11388 -15693 -9461 -3787 21550 18829 16436 2018 -2153 -15185 -31078 -22655 -16811 -9759 1802
8337 1802 21274 32723 23457 13914 17739 51803 61839 30524 1324 -11838 -21852 -35028 -50666
8324 -50666 -59342 -49366 -40296 -20063 -27373 -26048 -5800 -25875 -25100 -10054 -2002 4796 8039 -11225
8310 -11225 -4364 33688 27059 -33426 -30277 -27365 -46992 -40715 -41906 -41908 -35434 -25641 -27263 -32843 -16933
8295 -16933 -15491 -23417 -14621 -581 10001 18 -22533 -5555 739 -5657 -8860 -17170 -10337 -7632
8281 -7632 -19104 -18830 -14149 -32457 -33289 -15038 -32919 -18123 -16322 -24152 -10063 -32746 -31065 2138
8267 2138 -7063 -7080 12982 5127 -16440 -26330 -1235 10493 14439 27889 47207 35600 17771
8254 17771 14897 9558 -364 -28674 -39383 -29726 -21340 -25256 7627 6546 -3729 -15056 -29444
8241 -29444 -10261 6780 16024 -16906 -33332 6794 -8976 -35163 -26121 -15431 -22838 -3284
8229 -3284 -9312 -2489 -19725 -46216 -30642 884 -4526 -6884 -5765 -29703 -31094 -22327 -704
8216 -704 23178 18808 -9850 -31092 -16973 -11867 -27292 -10293 -6458 -2250 -1533 -29037 -47139
8203 -47139 -48995 -45047 -25973 -241 -1493 -1404 -13630 -8197 -3129 11432 26361 32606 3864 -5948
8189 -5948 -29 -8933 -40132 -41320 -18849 -23771 -28076 2352 4511 -24787 -22516 -6234 5606
8176 5606 15801 15405 -936 -15373 -10662 -93 -19895 -38870 -5709 5160 -18624 -26576 -40261
8163 -40261 -73169 -63301 -20514 -9584 -25201 -12090 -9988 12743 24799 1901 -8578 1763
8151 1763 14770 -16787 -23866 -17911 -18960 -28063 -21065 -6791 -15275 -32535 -56936 -26997 -14877
8138 -14877 -31220 -26524 -39132 -29500 -35151 -35696 -35677 -15180 -521 -14519 2867 -8790 -4699 12725
8124 12725 -1311 4014 37496 46519 32147 12725 -5147 4723 35286 64567 46648 42036 34399
8111 34399 30556 20738 -2718 27422 24297 112 14909 12030 -48127 -56390 -16549 3044 -24604
8098 -24604 -21896 -11454 5946 15880 -3625 -2325 19696 15717 7449 -8585 22630 21351 7176
8085 7176 -21854 -31684 -12364 -18479 -7797 1105 8428 5750 4914 -12451 -12443 -1061 1216 -24798
8071 -24798 -44715 -45158 -23126 -32234 -16636 -4976 13897 60773 95596 77934 51562 45257 28011
8058 28011 -3781 -25438 -38539 -41715 -11712 2401 -2621 13651 18969 13897 -3069 11146 31659
8045 31659 50037 74603 85591 88840 69721 93404 81722 70364 50142 37446 10799 -2116
8033 -2116 -7085 -1618 5265 19036 50430 44434 40404 47353 63877 82597 87722 59776 28755
8020 28755 20012 -14544 -19456 -18805 10827 23602 -14362 -21419 -20586 -15429 21831 12100 -20356 -55172
8006 -55172 -23410 6270 8198 9866 12667 17025 6237 11558 7114 3789 6258 711 -4609 165
7992 165 35917 47486 55707 69430 96876 84633 53474 13191 10684 3345 1504 -5777 -15962
7979 -15962 -20079 -25408 -33525 -13306 23597 43447 28290 -8563 -33507 -34001 -12334 -4903 -11106
7966 -11106 4225 13467 28109 21663 41981 27157 13769 5105 5761 15703 9256 17184 8317 224
7952 224 -4719 4532 37852 41542 47388 42501 53592 64295 75194 52194 20396 4161 8695
7939 8695 -9186 -23074 7306 15204 -12 -12484 -14247 -1787 -22074 -14907 -5636 -30455 -26058
7926 -26058 -27152 -20187 -12320 20347 14185 822 19553 28846 17276 -5389 -11174 -19714 -7412
7913 -7412 5471 24938 29233 18601 -1379 7944 36272 11460 -7645 864 22675 14781 8955
7900 8955 24010 33736 7922 -27098 -42066 -49573 -58600 -33025 5369 -2370 -17297 -31192 -44379
7887 -44379 -37514 -24881 -10249 17158 28638 2215 17609 54174 42341 17148 21281 -5761
7875 -5761 -43180 -34532 6055 19368 26554 25042 26901 10196 13818 15234 23390 2855 -6015 -11324
7861 -11324 -11947 8481 4767 8377 9687 1157 -22615 -31342 -19445 -9207 -5374 -34515 -28162 -34821
7847 -34821 -42749 -52178 -54106 -13276 -16921 -12886 -28963 -22667 -6616 4806 14336 7606 -15846
7834 -15846 -54421 -29006 -12874 -9311 -15680 -8951 4860 6552 -3780 -21370 -17627 2196 33399
7821 33399 23059 11753 -12393 -8062 -597 7116 20541 14329 3702 20717 49945 50388 41604
7808 41604 20121 10310 12563 18946 13024 6201 3843 -17561 -20260 -9311 -4161 16545 34227
7795 34227 27481 30340 -915 -12132 -15201 -18749 -27318 -28411 -5357 26065 32582 16282 15733 5815
7781 5815 1827 9791 17497 -13119 -24285 -9860 -7599 10831 3846 -4802 -21009 -17111 985
7768 985 22064 19843 -21937 -34343 -19049 -30829 -50383 -39225 -16288 -11151 10029 40526 32208
7755 32208 23508 -8449 -15250 22184 32874 3144 -15682 -31940 -17635 21059 24630 28921 1712
7742 1712 -1653 -16237 -16806 -14091 -6029 -4193 -24664 -26288 -31551 -31591 -45667 -50576 -40967 -24310 -14849
7727 -14849 -3397 5075 -780 -17404 -14167 -29227 -22241 -37373 -34547 12909 16571 -22068 -25047
7714 -25047 -25572 -12808 -3944 -8552 -17514 -39534 -40191 -20306 -22964 -26363 -43309 -31559 -4880 6004
7700 6004 19911 15332 -12778 -35635 -49863 -55379 -44798 -21749 -1103 -19117 -24669 -15610 -38191
7687 -38191 -41774 -25735 -20469 -41892 -56194 -33566 -12363 -21366 -6310 20433 16064 9023 -2853
7674 -2853 -13205 -2666 -25900 -56885 -32967 -9746 -3105 187 -10816 -14450 -31000 -10847 13176
7661 13176 2810 5728 13402 4494 10412 8301 -3599 8341 -15784 -26655 -15559 1628 -4241
7648 -4241 -3583 -26854 -34445 -2538 12557 8698 56 -3508 2391 -7382 -4644 -6472 -23348 -48319
7634 -48319 -37553 -18270 -6839 -12684 -9708 2813 -24882 -10811 -5764 -1254 -10207 24246 23336
7621 23336 10328 16925 -4360 -24117 -16873 -29820 -18899 -17255 2164 4343 2705 -3024 -13871
7608 -13871 -13770 -3211 -2183 4509 36030 39813 43597 21889 4256 -26100 -26148 -35417 -27007 -12991
7594 -12991 -21005 -11117 -4902 11996 21254 -4872 -21778 -24787 -4777 -3215 1366 -18330 -32826
7581 -32826 -14138 -2584 -3169 -6472 2059 -3158 -5149 -8272 2613 8609 12027 2482 -640 -14844
7567 -14844 -18470 -12873 -4007 107 10478 -8529 10233 2926 6235 30172 406 -31146 -43305
7554 -43305 -12240 24651 6383 -1763 -15796 -18144 -3043 -4684 -5202 33542 62378 36022 1967
7541 1967 -9969 -7280 -5076 -8167 -20990 -18795 -9609 -3631 -862 4457 4385 -23804 -3636 -3089 -21161
7526 -21161 -11522 -35798 -53895 -52019 -29512 -41191 -4945 7785 10264 -2464 -16477 -45700
7514 -45700 -54461 -11456 -16003 -7129 -6614 -22876 -25309 -22431 -38412 -38035 -53513 -66196 -32062 -2768
7500 -2768 -5564 -2891 19463 16271 4834 -14487 -33538 -31873 -22403 -26593 3027 10740 1943 5447
7486 5447 7607 -24662 -67846 -67727 -48775 -16782 9284 -9493 -23446 -31614 -16763 -26006 -9512
7473 -9512 -1928 -18766 -24718 -4884 4420 -1129 -898 18578 29049 40123 44958 25944 27414 19468
7459 19468 -14975 -8155 40450 67658 77405 52104 31611 32321 35996 42907 50816 23242 -8320
7446 -8320 -15369 -7593 5483 18708 31801 28375 24298 -3199 -10000 5472 6533 -7570 -25285
7433 -25285 -27695 -23897 -17178 -39595 -43787 -32556 -23654 -37934 -14649 -18416 -25448 10581 26549
7420 26549 12291 -3761 6896 53059 40484 45221 65624 52903 28860 -22044 -39471 -40568
7408 -40568 -29901 1742 492 -3340 9153 2803 -14482 -36759 -41448 -34947 -3135 -707 17198
7395 17198 5745 -12420 -9484 -17004 -30684 -23715 -12778 -29798 -34548 -49357 -59786 -37206 -27334
7382 -27334 -20443 -5767 9226 6038 -11242 -30096 -23649 -5255 14003 25451 -2968 -5042 12510
7369 12510 18292 -5662 -27279 -32819 -44699 -40487 -38765 -36373 -43192 -39430 -29397 -41941 -30324
7356 -30324 -20173 -9983 5248 -4182 -36135 -72934 -76637 -45342 -24294 -27608 -2468 1791 -3954
7343 -3954 -5272 -5373 20031 25013 27610 23713 29298 8484 7797 14013 -7658 3727 22684 18500
7329 18500 18367 26561 31242 16178 -12602 -20389 -975 -18713 -41218 -28407 -19466 -2451 -3154
7316 -3154 -18167 -35405 -2563 7508 2850 -7504 -16328 -38705 -33204 -26378 -21991 -45663 -47745
7303 -47745 -37778 -27837 -29589 -14453 8172 -22031 -29834 -22235 -24617 -49608 -55271 -53241 -72736
7290 -72736 -72991 -43530 -35064 -18628 -25136 -30703 -18496 -3273 -11654 -22313 -6032 6734 40646
7277 40646 42615 31585 6280 -5872 -8616 -20705 -18711 -7869 -23546 -9419 32641 4510
7265 4510 -35671 -58934 -82215 -81862 -74063 -60505 -35875 -53107 -56874 -28311 -25294 -45115 -11759
7252 -11759 23487 7782 158 -23451 -27726 -34369 -24254 -10401 -17003 -45494 -52123 -48277 -45521
7239 -45521 -40387 -35546 -3001 7190 38125 27196 -2547 -17672 -26792 -22662 -8312 11339 -2017
7226 -2017 23946 -2394 -29471 -13591 -12960 -14163 -17478 -18928 -5761 -2284 1007 22273 22545 4338
7212 4338 5828 -9019 -33571 -24088 -33346 -50459 -42130 -27667 -24533 -20811 -37361 -24631 -41097
7199 -41097 -68359 -82121 -77730 -53850 -37882 -46419 -46503 -44292 -14731 15683 23743 5879 -12148
7186 -12148 -38921 -49763 -28533 -15310 16383 -1447 -13901 -4752 4657 -3156 -29842 -49608
7174 -49608 -50132 -28631 -25716 -45308 -7305 -3024 -16106 -24607 -13922 -11162 -18068 -1789 15016
7161 15016 12532 11339 11193 20491 8792 8702 12387 -18651 -27570 -16818 -22199 -34482 -47653 -62033
7147 -62033 -29449 893 -5142 6629 18859 7306 -11550 -9332 -2289 7413 -2208 4176 16817
7134 16817 6300 3050 -3981 -12574 -34470 -27278 -14561 -29378 -25290 524 -14329 -30733 -22876
7121 -22876 -19407 9889 20685 9260 9112 7274 2746 -18477 -34281 -33162 -37342 -48519 -45295
7108 -45295 -35099 -27093 -18457 7572 29559 32 -8832 11191 -3602 -31739 -52484 -50425 -51091
7095 -51091 -52905 -47323 -44804 -30845 -30643 7396 18856 2132 3914 -4843 -40286 -31844 3687
7082 3687 33303 45690 15172 1446 -1689 -13477 -48825 -42529 8618 8647 -9750 -20044 -36972
7069 -36972 -6358 5199 -5853 4548 1214 19469 35035 24723 -11842 -5406 5417 10740
7057 10740 13759 -14069 -16750 -5322 -13628 -38738 -54102 -59164 -59612 -38269 -39933 -33982 -3932
7044 -3932 28167 31062 36656 16391 5616 -21997 -10717 -17647 -12818 -9521 -27857 -28951 -20637
7031 -20637 -35990 -23760 -19502 -24124 -26395 -60332 -83531 -86685 -61582 -39042 -7863 26386 25424
7018 25424 21014 16598 10290 -798 3745 18439 8021 4701 -923 2327 14059 13773 2593 5491
7004 5491 -1577 -13801 -26837 -25216 6329 29752 15029 403 -1572 -25126 -15478 -15529 -16626 -13283
6990 -13283 -3158 -1337 -10677 -14551 -2691 9352 -12482 -52121 -61454 -47972 -43590 -17769 -13024
6977 -13024 -9193 12838 4543 -14944 -11000 1106 -15262 -8980 -9047 -14993 -4559 -7023 1165 -11608
6963 -11608 -16648 -5208 -21076 -15825 -341 -578 -23596 -42461 -64652 -55126 -32713 -16125 1667
6950 1667 12622 1033 1763 -5789 6106 10538 17910 20682 22219 17501 22083 23611 10186 -5366
6936 -5366 -22626 -16130 -3605 4069 -6751 -36892 -13744 9217 22009 812 -8072 -16673 1578
6923 1578 4577 18603 6826 -5443 9479 20974 16102 2570 -7606 -10228 -28643 -35704 -42557
6910 -42557 -34727 -15827 -22082 -157 -9062 5707 39023 44105 44103 39201 50775 42915 27344 -4839
6896 -4839 8083 41605 62800 29957 15462 11486 12152 15466 20482 1783 -26808 -28595 9380
6883 9380 27857 46692 44267 36378 50660 71378 59719 57429 70039 51431 13718 -7762 -1090
6870 -1090 7416 9437 36318 36155 42662 62670 68507 46920 32850 -10368 -12919 7610 12925 9413
6856 9413 -722 -11558 -12059 4438 30248 30364 32414 18220 32452 65661 57133 27309 21120
6843 21120 19473 17418 26727 51284 54484 29820 32082 48935 35402 13950 -2853 -12104 8501
6830 8501 15034 23933 -3919 -18579 -5811 -20261 -4079 -12999 177 18406 11001 9813 -1811
6817 -1811 -28024 -9214 13150 30818 44074 42487 -9755 -56333 -65733 -42828 -29362 -22946 -18087
6804 -18087 -20201 -17902 -13876 -26767 -23732 9896 -3493 -26668 -47876 -52183 -45245 -46464 -42296
6791 -42296 -38530 -32932 -23038 -27491 -10850 11271 -11623 -18271 -29040 -27949 -50033 -61665 -53895
6778 -53895 -29894 22400 39238 26293 -14228 -19054 -29843 -20686 -12133 -14973 3337 -16071 -53022
6765 -53022 -72494 -40796 -24283 -1727 8245 21687 3880 -1926 -21188 -12679 219 -6930 -10652
6752 -10652 1001 10320 6650 9677 -8001 -39961 -31333 -40796 -45053 -46808 -25666 -18445 -19101 -36673
6738 -36673 -49994 -37475 3525 10708 12400 14120 -9920 -14072 -36236 -43139 -21869 -18851 -26200
6725 -26200 -7429 13982 1304 -18503 -8656 -28655 -28921 -39762 -17130 15645 -316 -640 5402
6712 5402 14066 29469 48729 33139 62133 104248 152248 209736 287819 382752 476425 510459
6700 510459 438792 292653 176193 106251 60026 43250 55128 25048 23677 37735 12588
6689 12588 -1711 11955 38594 37503 -20832 -34027 -19657 -17066 322 21394 -8138 -2560
6677 -2560 -6792 -7683 6354 1971 23622 2849 1687 -5518 12408 1105 -12485 -13003 20461 15424
6663 15424 1330 -2851 -13094 -24381 -25252 -10889 -1776 -16840 -21510 -32206 -52307 -42550 8463
6650 8463 9915 23171 26530 16980 3579 -17799 -14473 1552 -5637 -20814 -17789 -9617 -2315 -2528
6636 -2528 -9789 -11870 -4881 8366 30734 47231 39609 4940 -27360 -51319 -55764 -36386 -25283
6623 -25283 -38390 -38701 -37261 -38266 -15995 -4573 1388 -203 -3135 24143 19728 -2798 8018
6610 8018 -9165 -11610 2790 -6384 -39332 -54599 -35329 -51592 -50720 -43687 -34506 -17269 -40464
6597 -40464 -30064 -11589 -38393 -48553 -17239 7005 -8433 -40280 -24959 -41937 -50376 -34355
6585 -34355 4204 19794 17981 3875 -16358 -13668 -2705 -4308 7943 -8912 -16165 7279 7775
6572 7775 26734 39534 57835 51328 33919 20542 -4355 -45815 -66147 -63480 -40846 -24558
6560 -24558 -37878 -26277 -20895 -12688 -19301 -4775 8997 -4930 -2410 -11194 -30759 -13090 -27415
6547 -27415 -17103 -13017 -37401 -36425 -28131 -5152 12986 39236 30924 11527 12340 30800 62133
6534 62133 69405 70982 58916 50312 9709 -38542 -53256 -45266 -46834 -24981 -30240 -43519 -39478
6521 -39478 -32637 -41663 -62593 -43969 -28937 10371 18009 -7654 -11449 41417 66492 43505 30434
6508 30434 15658 7252 -14761 -7735 -2350 -9471 -13374 7619 -7106 1479 -9870 -5234 -18953
6495 -18953 -31951 -2331 213 -13100 5458 -8684 -38345 -10069 -3817 -21623 -19419 -15204 -10692
6482 -10692 -11459 7460 16496 10153 10537 27219 28903 31096 22080 25811 16296 -6407 -33008 -26821
6468 -26821 5456 25992 42896 48699 45333 41926 33167 17234 4502 -4622 -6992 16404 26979
6455 26979 26218 17011 5522 -4300 -24017 -24272 9600 8087 7382 16092 13614 6782 2970 -5838 -32528
6440 -32528 -24424 8318 9996 2245 -7542 -402 -12899 -16052 -1642 -8138 -10362 -24078 -28055 -26789
6426 -26789 -47715 -38238 -8866 10772 21385 11214 -27343 -28898 1078 7962 20396 25083 1087
6413 1087 -12097 7783 26177 16761 15580 10580 -14918 -50914 -27090 13726 10867 -697 -18148
6400 -18148 -8567 18207 47360 31351 25916 19313 -7393 -40055 -46416 -40243 -25045 -45071 -42760
6387 -42760 -42588 -37346 -21588 -13437 -29788 -29263 -44060 -27027 -27975 -18067 -11598 -11845 -52857 -31366
6373 -31366 2239 8140 -15232 -22285 -9967 -17438 -25917 -19806 7344 1223 -9648 -4059 -7153
6360 -7153 8342 6477 -17222 -45389 -30232 -21300 -36268 -33155 -19483 -31360 -56780 -57310 -40500
6347 -40500 -47621 -24377 6543 -4637 -11951 886 1859 3870 -2452 -24348 -34841 -45224 -13659
6334 -13659 4605 -4891 -6512 -17508 -37489 -35059 -26862 -25964 -22344 -15423 -13582 -37668 -36706 -53506
6320 -53506 -56822 -39681 -11242 567 1038 17143 6738 767 14479 11193 3916 -2809 15118
6307 15118 16712 -11397 -13409 7557 5873 -18254 -12227 -131 8302 16781 961 6262 -5406
6294 -5406 -2898 10689 6811 17460 5185 6017 14221 40281 52803 44750 55289 53390 30671
6281 30671 19991 7901 -15473 -11247 -8555 -44337 -55479 -24963 5516 -9338 11071 -5082
6269 -5082 -22458 -10079 -19477 -5945 15348 4326 -21493 -54620 -69779 -58146 -29943 -20331
6257 -20331 -28075 -15307 -7520 11404 -20217 -27610 -16231 13258 20962 14593 4488 17578 17602
6244 17602 833 -7560 -30971 -29782 -12874 -14812 3433 24889 2918 -15619 -19374 -326 31392
6231 31392 36438 27184 29200 48937 38922 20134 23922 53466 35004 21627 4190 -9994 -30340
6218 -30340 -14956 -7412 1384 -58 -1326 -18638 -44919 -45440 -33988 -10574 -4878 -251 -10801
6205 -10801 12877 23059 18898 7522 1299 -10385 -3396 26123 34845 34112 22156 28598 31059
6192 31059 26820 27709 6902 1579 10905 28093 29187 30617 41809 26682 2844 -5195 -6218 -8554
6178 -8554 -12577 -20386 -24383 -8726 11831 15360 29501 15758 20641 14734 7328 8296 -28993 -57222
6164 -57222 -16834 19700 40645 14014 -1039 15247 9481 8598 10116 12091 18730 13036 23396
6151 23396 31749 31459 15688 11057 5242 6963 16778 31693 34116 41668 43683 33967 16044 18419
6137 18419 34564 30254 8453 -47720 -63633 -47068 -36581 -35367 -42632 -60886 -50326 -31333
6125 -31333 -32636 -24264 -301 -3578 11715 30085 25197 1735 -29891 -27684 -10493 -2122 -374
6112 -374 3081 32695 55021 31799 19076 7855 10061 24544 3268 -6694 10811 -21455 -32620
6099 -32620 -181 13374 -22937 -29609 -16125 -14110 -31714 -56594 -61888 -56958 -29298 13332 12523
6086 12523 14861 -12500 -58468 -62772 -34773 -21641 -27695 -13349 1519 -18036 -14288 -1197 8040
6073 8040 3761 4635 10658 30819 33970 13815 1364 -15829 -35974 -21792 -5077 -8814 -11385
6060 -11385 7633 -2910 -8658 -2154 -8230 -34329 -36805 -16935 14042 15659 9555 2852 -7378
6047 -7378 7562 18337 7663 26412 36422 27717 27278 45 -50871 -56813 -29097 -24864 -23518
6034 -23518 6310 9509 16527 9621 3098 -421 379 2481 -10585 -40667 -30673 -30868 -11653 -837
6020 -837 -39438 -38647 -32893 -41436 -36629 -6271 13140 24980 14164 1747 4899 13450 33165 29637
6006 29637 14202 21103 13195 1590 -18429 -24267 -14711 17420 3722 -23401 -5169 8301 -8900
5993 -8900 -16386 -18612 -10348 -19483 -38021 -39721 -28359 -34773 -31665 -18635 -42058 -45686 -45996 -17829
5979 -17829 -2224 -4280 25246 28786 12207 -16321 -34919 -62382 -69731 -57633 -16842 -26257 -36769
5966 -36769 -27601 -40261 -35789 -23996 -30359 -42052 -47518 -39686 -32074 -19526 -45613 -60599 -42483
5953 -42483 -36408 -34619 -47452 -56392 -40562 -23372 -2977 6703 -19662 -20018 1235 28535 40697
5940 40697 36256 32682 90 -8574 -20952 -10497 4721 7313 1756 2864 9116 -7107 -11366
5927 -11366 -7321 -20329 -8469 -10773 7087 360 12059 8425 -12797 -27420 -23719 -9629 -17894
5914 -17894 -3909 3120 -20706 -30934 -30023 -27957 -32814 -23904 -20666 -27016 -16607 -39808 -33302 -51130
5900 -51130 -60777 -32467 5299 37734 24825 -16265 -31005 -40142 -61903 -55634 -21844 -28805 -39568
5887 -39568 -36513 -48455 -31199 -20870 -21419 -26907 -27675 -25646 -27350 -34916 -55908 -47363 -18364 1484
5873 1484 -4498 -26777 -24487 -23195 -31555 -30260 -22890 -3284 21626 7244 -15305 -14251 -7722 4651
5859 4651 4756 -15514 -27822 -22172 1627 -9295 -20524 -33508 -40835 -51307 -38224 -6475 11832
5846 11832 39811 42847 40735 11338 -11607 -14484 16129 20180 31817 43547 44534 41536 19567
5833 19567 -5325 -17160 2140 4674 8847 -2510 -2413 -23295 -36877 -37821 -39156 -21140 -12404 -12923
5819 -12923 3871 7515 18516 -8148 -1720 -1685 -3890 2323 -28516 -21593 -721 2297 -12892 -24790
5805 -24790 -3173 -7857 -14862 -783 4252 -20861 -34762 -40195 -30163 -35549 716 2097 -16467
5792 -16467 -40512 -32097 -18437 -40010 -59519 -27386 -9959 879 4944 -689 2183 5502 17320
5779 17320 26118 5031 20358 31968 36818 9059 -8972 -16787 -44846 -34515 3978 3584 -8684
5766 -8684 -9961 -16881 -24601 -21439 -672 20496 25453 27304 47685 12714 -17345 -2286 -6596
5753 -6596 2776 -5507 -14240 -650 16977 32402 27899 9286 -3811 1712 -22164 1933 30937
5740 30937 26577 5121 4091 33175 27997 15687 -5160 -36326 -35984 -31104 -33212 -7363 -7815 -22
5726 -22 6658 -2923 -14316 -12031 -28401 -20318 16426 22673 28444 38839 40802 37341 42379 43764
5712 43764 -4946 -16392 10234 29592 9668 22584 7267 -22224 -41796 -45655 -25202 -19242
5700 -19242 -33682 -18454 -19395 -15115 -11004 14621 38137 8202 -17110 -14552 -14494 -19662 7731 20947
5686 20947 18592 4669 14876 35429 30361 13158 -13944 -41008 -69137 -56432 -61723 -35872
5674 -35872 12585 32895 28099 21543 15196 2470 -21276 -9994 11309 1748 10330 21074 5649
5661 5649 -16742 -37588 -14858 -3335 -16193 -47690 -64532 -21541 9925 31066 20204 28801
5649 28801 26310 32227 8209 -2385 10002 8633 11029 17523 17385 -17781 -29198 -23750 -33382 -24992
5635 -24992 -52 4706 -7491 -34532 -2187 8763 5669 -5986 -30459 -7098 -12820 -23900
5623 -23900 -23150 -30083 -43959 -48663 -43023 -15708 -23085 -67007 -70278 -47859 -33269 -8860 -4214
5610 -4214 -4567 -19210 -29686 -36298 -9927 -24055 -38822 -21314 -31036 -38328 -15472 372 -19206
5597 -19206 -36774 -10265 4993 -10634 -4874 603 -3569 -10062 -31874 -40616 -34283 -38943 -38922 -37251
5583 -37251 -10051 -20918 -7351 -13272 6324 3257 8985 34859 31240 31297 47271 47610 33883 4269
5569 4269 -9193 -7852 -4861 -2628 -16790 -34677 -30798 -291 -21148 -12889 14555 -8997 -1387
5556 -1387 -22722 -39261 -24207 -12972 -24927 -41041 -38050 -28396 -46198 -68989 -77375 -48194 -12353
5543 -12353 5500 27034 335 4879 -6921 -10995 22425 28303 24305 23332 31036 23286 9001
5530 9001 13573 26198 34994 25186 21246 22497 -3065 -13751 -3257 8148 -7825 -30106 -39475
5517 -39475 -28608 -18523 -27602 -16006 -30581 -28539 -1583 17084 -1771 -19085 12667 14129
5505 14129 -8589 -9642 -18232 -17582 -7654 -8895 -18476 -4933 16475 34552 27738 -3528 -5729 8547
5491 8547 20858 5205 17175 62912 46323 17196 -4472 4389 20667 30781 23561 29975 13755
5478 13755 843 6624 19956 40021 11389 -29709 -33694 -27458 -30817 -37066 -35639 -26951 -22002
5465 -22002 -21676 -12356 -20541 -45927 -60745 -42164 -38788 -17048 10218 28346 27781 12423 -3777
5452 -3777 -15281 -21285 -19629 -27406 -22667 -3495 6453 5691 -10458 -24377 -28188 -68125 -86534 -85564
5438 -85564 -72577 -81020 -75798 -16590 11954 32896 15389 -10528 -5728 -36308 -9850 10975
5426 10975 12790 -6178 -43933 -49335 -40972 -22750 -65631 -65724 -40820 -27279 5493 18968 16294
5413 16294 7701 7976 -7758 -2254 16974 -3805 -13239 -14283 -16058 -20578 -32844 -20021 -27879 -12094
5399 -12094 -21791 -45024 -40342 2211 3787 -23069 -17925 -32454 -37710 -42072 -30578 -13268 -21294
5386 -21294 -30948 -45717 -48086 -26495 -32249 -14973 -3349 13846 17256 -4060 -34901 -43577 -15565
5373 -15565 -2139 20450 25991 15341 -6346 -25731 -11721 -31820 -35824 -30199 -42421 -51746 -47079
5360 -47079 -56168 -62929 -53816 -46302 -19154 7785 5927 8414 16014 -1376 -33448 -65520 -48630
5347 -48630 -68013 -83110 -75937 -47563 -31687 11631 21115 11989 358 6199 23477 26182 -7662
5334 -7662 -6359 2589 -21516 -7073 -2899 1861 3212 -16286 -21462 -347 11957 -1329 -8010
5321 -8010 7272 17923 12124 7723 8448 36399 14053 -7814 -15616 -24925 -12735 -5273 -24292
5308 -24292 -35947 -21690 1793 4137 -11420 -473 17536 15648 4522 -2380 -2583 5201 -13283
5295 -13283 -30606 3689 42383 64779 40819 32241 11154 13925 9850 -16745 -38219 -28111
5283 -28111 -19584 -35615 -31880 -42871 -28384 -28514 -56793 -62682 -57159 -55203 -55911 -54225 -32499 25905
5269 25905 36880 15276 26569 29088 25798 24438 -10168 -33569 -16470 -12065 -23759 -34644 -63677
5256 -63677 -56530 -50361 -32649 -27971 -46298 -45157 -49573 -37811 -6104 -14154 -19301 -18781 -6957 -19656
5242 -19656 -4293 1663 26599 51434 41827 31978 25625 33060 18448 14460 4182 -3035 -12470
5229 -12470 -15343 -4603 14776 37939 55042 33040 -2091 -28008 -41369 -31439 -7191 -2010
5217 -2010 4228 18236 14461 9824 5430 17611 29325 30610 25039 34993 9587 -1177 -26964
5204 -26964 9816 23229 1940 19116 48278 44326 39155 27950 40171 31998 5286 -22938
5192 -22938 -8845 10703 -1585 -6455 -2462 6970 11109 -2288 -805 13257 55264 62963 69701
5179 69701 35386 -24323 -22286 7282 7198 309 7087 47679 51105 7536 -9208 601 -6731 28761
5165 28761 26702 -22105 -8837 9790 -739 -17891 -11604 -16775 -14497 9629 16969 10460 7024
5152 7024 15743 15860 28553 36552 22911 20226 18438 21255 19567 21695 19916 4906 18850 17847
5138 17847 -1114 -2745 15231 38465 23642 -3546 -23009 -31789 -24548 -18955 -6586 7257 -26737
5125 -26737 -34309 -38743 -110 14960 18708 28901 25231 25058 -12745 -10602 -4626 3769 -8836 -14761
5111 -14761 -20938 -16661 -7125 4147 -9060 -36656 -57905 -43656 -32149 -63371 -58396 -45985 -37320
5098 -37320 -22316 -4727 -2442 -8123 -16541 -20793 -14022 -6719 -11820 -20348 -34188 -34573 -50088 -47777
5084 -47777 -48510 -56766 -71543 -44191 -5047 -7046 4570 9320 28660 34159 17349 -10059 -24106
5071 -24106 -23829 -45844 -51713 -41980 -46845 -33023 -11707 3143 -21319 -35263 -30480 -8030 -11926
5058 -11926 -3287 27579 -5708 -22946 -8869 -10558 -16304 -15323 -9616 32975 37020 20110 15451
5045 15451 17785 14984 -2861 13438 19114 39238 53953 64231 61997 58978 42849 9810 -8248
5032 -8248 2097 32194 13169 -10950 -9404 -23177 -26938 -4281 3957 14177 -13014 -26214 -44216
5019 -44216 -43018 -16674 -3107 -9832 -27709 -59594 -20434 21716 9325 -13185 -6347 -6420 -5906
5006 -5906 -1288 -9801 16069 37766 26887 2782 -20689 1284 -10674 -29891 -29403 -37256 -16381
4993 -16381 -19198 -17527 -7828 -19753 -13791 5429 1889 20428 21124 22098 7210 -23628 -15901 25298
4979 25298 36666 26144 5984 -3304 -19949 -46421 -51924 -38487 1698 4797 -13338 -4373 -223
4966 -223 16989 36452 39685 2665 -45485 -49127 -38319 -13152 -11082 11231 18469 -17445 -68580
4953 -68580 -91542 -84050 -38869 -18275 -17496 -8308 -23395 -44463 -48717 -83463 -65887 -42400 -34417
4940 -34417 -23205 -22447 -8704 -4375 5345 22685 32646 11207 4530 1750 -5703 -3909 2518 -6703
4926 -6703 -13448 -35699 -38435 -47838 -71329 -63463 -10145 26461 42855 19891 8116 15365 9645
4913 9645 11675 23265 13998 -1339 -20755 -23824 -28610 -45717 -34965 -22914 -13063 -16902 -7944
4900 -7944 13596 8487 6113 -2511 8921 2522 -35581 -38318 -4684 10615 25640 23130 14732
4887 14732 -10388 -26269 738 17162 17052 11305 2406 -24957 -27982 -9389 -9100 8753 5739
4874 5739 3989 16639 -3936 -6255 -462 -5338 17049 15412 15783 -10529 -31574 -26059 -44502 -94538
4860 -94538 -95493 -49511 -52126 -28457 3297 -16439 -456 18021 24655 12337 12310 -3981 -8826
4847 -8826 -1009 -283 1780 -7850 1162 20358 -4956 -21225 -35839 -57455 -62927 -46415 -21591
4834 -21591 -17419 -21980 -29547 -33634 4560 27370 40785 21323 -3170 -10579 -6565 -10856 -4613
4821 -4613 12674 2811 9516 -5320 -37241 -17187 -14526 2765 26690 28540 12043 -20841 -17476
4808 -17476 -23606 -45677 -45323 -33124 -56211 -43667 -49671 -40585 -15572 -4562 -4525 11117 11095 1633
4794 1633 -16576 -9279 3782 -3456 -19905 -19870 -6885 -402 28385 39852 51163 46165 32604
4781 32604 14948 20073 25389 20795 16284 -11319 -14121 13490 8568 17470 30533 31307 883 24280
4767 24280 999 -7168 1161 22553 29256 31980 38475 46337 50177 40413 23609 32440 36613 36358
4753 36358 28324 22247 -3086 -7312 -7714 -661 -2899 15279 6406 8216 10691 12585 8516 6458
4739 6458 -8006 21713 52472 23603 -15507 -34911 -45081 -49232 -8020 -12642 -14918 3086 8609
4726 8609 10070 9891 33050 41260 14124 7329 -11233 -6388 5290 17325 55728 67555 56215
4713 56215 32502 25466 39544 29984 -2632 11358 14725 10637 18174 41342 44388 19789 -29644
4700 -29644 -16589 -5109 -6390 -2133 2408 -5009 -17862 -27395 -34132 -53006 -49649 -26670 -32469
4687 -32469 -47401 -38050 -15371 -24073 -32998 11734 23401 12527 18807 2530 -24276 -27507 -16092
4674 -16092 -17743 -32727 -55082 -38664 6217 23376 30071 12208 226 -7868 231 21373 7243
4661 7243 7523 -21143 -55069 -59972 -48211 -39781 -29415 -10134 11137 14108 13710 13461 17406 -16292
4647 -16292 -12613 666 -6333 -3341 -8756 -17767 14785 46654 63221 58158 50949 62154 47749
4634 47749 19622 12291 14761 14406 2698 -27238 -42491 -55929 -52347 -42796 -10608 29074 51467
4621 51467 49435 39775 34705 27078 4558 -8750 9665 14275 10921 -23041 -23565 -5819 -4732 22974
4607 22974 15405 -19621 -29452 -8937 149 9625 1259 3539 14364 -6776 -18382 -3327 -2869
4594 -2869 14261 16416 15357 18270 50821 56492 81321 73524 36064 18873 15399 29610 71345
4581 71345 74598 48562 43105 30208 33578 24926 1123 -4375 -3945 3713 11330 2536 -20729 16244
4567 16244 19102 5282 -5963 -20919 6404 29746 8545 -6954 -16535 -6417 3712 18327
4555 18327 21580 19183 22983 40104 36195 3445 -1469 310 4423 3379 9197 11387 12202 13670
4541 13670 17525 6896 -5995 5140 7160 28474 39688 18804 11076 26318 -6522 -14118 -339
4528 -339 1154 -280 15670 20627 -18595 6579 15941 3353 -5185 -8685 -2232 -18457 -7139 25380
4514 25380 39914 12884 -11329 -387 -7919 -7358 -1860 12319 10314 8810 1459 6642 -11467
4501 -11467 -31162 -15704 -6172 13662 -17012 -23245 -2679 7611 -21477 -37281 -24942 -28120
4489 -28120 -21997 8859 11043 -33352 -44073 -28463 -15809 -7961 8446 22370 16977 28646 19800
4476 19800 4672 16661 32488 28931 34860 11261 -16553 -37443 -30875 -17556 -10305 -16284 -36258
4463 -36258 -29845 -1391 15190 7200 -21208 -45903 -20440 -19920 -16491 4349 5332 11792 42775
4450 42775 46277 33768 16415 17935 -308 -6305 9621 6764 9991 -12583 -36661 -46417 -35133
4437 -35133 -18615 -2812 -2051 -6268 1104 24038 42462 55513 51169 37212 3955 23633 46044
4424 46044 50816 35247 17612 -2257 -28537 -16729 -16512 -26581 -39065 -26397 3689 -7047
4412 -7047 -17412 -29383 -11470 -6135 -21445 -5374 18294 25609 13607 18643 1886 22606 33632
4399 33632 13759 -10179 21026 23435 3441 5417 25984 25542 36070 45732 27623 887 -3652
4386 -3652 -4821 -15680 601 -5518 -17053 -3626 15004 15399 14772 16500 11774 13410 39580 67480
4372 67480 76985 57666 41196 -2786 -20168 -29799 -7121 9066 21323 31917 34307 27124 45736
4359 45736 44968 27918 17931 12385 -7103 -40232 -15584 7704 5229 20809 4429 -19098 -18895
4346 -18895 -1691 469 -26754 -26462 -13069 -4477 25633 36551 45714 44848 32659 25962 29676 43885
4332 43885 6078 -24966 -20310 22012 44372 30948 13692 -2463 720 14621 28404 19448
4320 19448 32584 33514 45301 52396 29651 23270 39249 35240 34195 47728 33701 37761 44239
4307 44239 20361 -11478 -45228 -39712 -33897 -4301 22801 12177 15180 -544 -6206 -3224 14676
4294 14676 25288 -1743 -17104 -12342 -11252 -16863 -22050 -33421 -34378 -20302 10718 33488 36866
4281 36866 46232 38748 20727 48448 49970 55980 54398 49400 41999 31624 19246 -15956 -34415
4268 -34415 -13544 17308 1414 -9599 13303 36919 31899 16448 -15475 -38319 -57842 -52971
4256 -52971 -56688 -41061 3698 25354 13088 6188 716 6250 -25351 -19697 9656 24892 22774
4243 22774 32163 32329 20322 19037 11992 2227 1967 -31139 1698 7422 -10831 -17768 -35174 -47083
4229 -47083 -45717 -42032 -37422 -10893 15535 -11026 -14739 3184 12992 40552 38188 -25107 -44749
4216 -44749 -15640 16540 451 -20807 -5295 30989 34191 15598 11316 14120 17057 621 3724
4203 3724 -18671 -40339 -54090 -50818 -32375 -7733 -14762 -25292 -20162 -918 3470 9915 -3526
4190 -3526 -10299 -29578 -38541 -36552 -9355 2486 6345 8636 35541 30879 19636 -2742 -10068
4177 -10068 -15648 -40725 -38327 5655 24869 24634 3776 2039 15321 14188 17979 20022 39383
4164 39383 31041 1956 -20325 -21945 -33261 -31698 -42191 -37183 -26920 -30241 -29423 -15769 -17618
4151 -17618 -18341 -34817 -8842 26852 35564 36242 17978 12200 24966 22664 12721 -1383 9844
4138 9844 20994 30529 32627 24091 -782 -22555 -18549 -11959 -23117 -11582 -7884 -18929 -165
4125 -165 29802 65103 48086 10930 25374 10950 -3156 -12825 -22938 -38 -19588 -19555 -11805
4112 -11805 20876 30123 8102 11575 13405 7703 -14308 -4222 13289 16349 -135 -39363 -47451
4099 -47451 -12985 10224 2003 7622 -17006 -48665 -68683 -51770 -40722 -40911 -21659 -29929 -29358
4086 -29358 -24906 4321 26398 255 -3256 -9125 3604 10870 21918 11958 10111 15851 26188
4073 26188 14209 -13777 -31950 -154 30909 12577 21530 27607 25054 2299 1977 18801 22214
4060 22214 6378 9649 -4171 -22997 -32384 -18897 -5335 4875 -1289 -791 30019 25507 14212
4047 14212 -13334 -10006 1402 -25855 -53075 -49554 -49963 -43227 -13487 -13135 -7034 12515 375
4034 375 -24427 -2179 7898 31468 11117 -8803 -14414 -2385 17198 17979 46271 47344 38291
4021 38291 33398 35199 14797 15179 27086 24995 24485 23705 595 9574 15039 15575 4818 -12551
4007 -12551 -3853 23151 23773 -9759 -18530 -15105 -37855 -37787 -16813 -14413 -9754 -6979 7824 -4305
3993 -4305 -11438 18400 45148 33319 -4900 -9874 -6331 -27375 -31719 -12463 5177 -4407 -12301
3980 -12301 6701 15693 17204 10582 10214 25578 34116 21110 3816 -28760 -34153 -2343 29670
3967 29670 14652 31898 59030 35412 20707 13717 9872 -11011 -15522 -26031 -22310 -18276 -8854
3954 -8854 -46892 -59588 -44188 -53668 -62410 -50655 -63983 -44560 -35936 -26750 -26409 -21868 -4394
3941 -4394 1447 -9527 19403 40575 39472 -13221 -49737 -28772 -29684 -14530 -20308 -4930 13245
3928 13245 16813 19559 18503 -6921 -29963 -51372 -68761 -48244 -32852 -27271 -38789 -34819 -32722
3915 -32722 -26036 -13883 -17669 -24887 -21513 -10609 7297 11516 252 25358 16113 -1349 -9266
3902 -9266 -14806 6985 6202 -275 -16752 -3248 -2231 -10985 -3979 20249 -1079 -32624 -33670 -29182
3888 -29182 -29014 528 24760 39873 59675 48556 31962 45801 58506 17713 -4407 -3039
3876 -3039 -3324 -19558 -17848 -3053 2511 4640 15140 -2270 -28646 -9238 18389 23283 34570
3863 34570 41030 32201 1838 847 8139 16611 16042 -11293 -15399 -4130 21470 3769 -19345 -34106
3849 -34106 -45862 -30555 -25931 -26294 -23728 -36344 -22086 -18941 -28432 -31486 -26820 -18613 5235 45890
3835 45890 11855 9292 -622 -27974 -14820 -20532 -6601 24661 77441 82218 19315 -27588 -28798
3822 -28798 -25659 -47196 -46158 -23028 -18110 -15443 8228 37045 36552 36457 38724 31605 -1407 -5850
3808 -5850 7619 21321 -632 -38661 -17900 -5441 -9098 -26717 -35757 -44939 -23163 16494 28181
3795 28181 43191 45301 48849 56014 46810 10328 -35097 -34147 -9966 2048 -11060 -18437 -21568
3782 -21568 78 20613 13008 8579 22779 39219 20518 18716 -9366 -32930 -16892 -8512 -1653
3769 -1653 26066 40653 16313 -280 5825 15289 33688 41965 20563 32274 50529 41522 27755
3756 27755 26092 -3384 3157 9263 19242 -14139 -16496 -6682 -1536 12206 32943 26952 -5137
3743 -5137 -26544 -35985 -25349 -29424 -27287 -17138 -10279 -3894 10648 20371 34687 28371 25144 4986
3729 4986 -138 9274 15627 27616 44366 38307 34362 39069 30298 23418 8312 -20570 -7977 -25800
3715 -25800 -37281 -29455 -41725 -20396 21126 12254 24557 46180 42372 27263 16045 14303 15904
3702 15904 35107 58315 56640 42036 31022 4970 -5342 -5522 -18372 -25034 6418 42162 38508
3689 38508 26849 40108 38102 18896 3106 -3691 -5375 -10643 -2117 -6425 95 22192 18521
3676 18521 13259 -20038 -48114 -57843 -50301 -44246 -23495 22215 9700 255 13189 17220 -8924
3663 -8924 -28267 -26896 2309 18751 9293 -17093 -32448 -23868 20214 22955 34655 40374 5223
3650 5223 -1514 -20956 -20754 -12871 -10870 -32263 -22135 -5468 -13588 845 9624 -11820 12615
3637 12615 2727 -7575 6675 -1406 -15251 -10199 -5681 2367 16763 26340 19417 8562 -9676
3624 -9676 20371 25918 19319 16836 -9199 -14439 4194 6423 -4050 -37223 -45258 -51209 -47160 -27315
3610 -27315 -28391 -46283 -45623 -33940 -25627 -18174 -32190 -33599 -5659 5214 11747 13611 2442
3597 2442 15439 -3702 361 5645 13895 20439 -11832 -28860 -28529 -6623 3699 -4646 6411
3584 6411 5425 16456 11730 -1592 -8415 -39406 -35573 -3703 4785 -9767 4666 23588 42154
3571 42154 22530 10105 19911 46507 12856 -1658 -5068 -14311 -6726 1655 -22592 -39031 -19437
3558 -19437 -5765 27467 29973 17439 9232 24224 2437 -22985 -7647 -1247 3779 14128 -5622
3545 -5622 -30998 -2298 15608 17319 -10658 -17181 -15776 20315 36851 22853 18504 17766 2327
3532 2327 15845 18124 5470 2929 8050 14022 15854 15492 16764 -2813 -46485 -51879 -14653 17756
3518 17756 40153 37714 19677 1952 14406 37614 49174 24892 -17964 -16040 2833 6947
3506 6947 -2810 1231 6004 -22095 -15011 11748 28721 47911 42807 22709 18351 29148 -3841
3493 -3841 -10700 13755 19144 1382 -40136 -47117 -56073 -37066 -31308 -38579 -41112 -37445 -48200 -12060
3479 -12060 20375 36838 48862 27356 27427 10950 6989 18412 30087 37258 20296 14123 23608
3466 23608 41176 47077 26866 19295 11881 9046 18943 35440 55917 25424 12952 17973 33995
3453 33995 27229 9305 41079 42091 18411 23186 10184 -12395 -13073 3711 19375 12376 10404
3440 10404 -683 21166 43563 10055 -26568 -42755 -58549 -26541 -29689 -32501 -27193 -11319
3428 -11319 3814 8783 -18119 -12176 -40009 -56327 -43810 -41614 -34599 -20810 -6837 -17541 -25946
3415 -25946 -14387 -12805 232 24841 14717 -2999 4339 26271 18181 -10896 5274 4523 16111
3402 16111 14836 -2876 -10060 -18043 -18806 -984 -3839 -36558 -43668 980 -10460 -7943 7493
3389 7493 10417 18605 19251 5219 11029 21921 38828 19055 14016 -12819 116 5933 30822
3376 30822 21587 11695 8066 -30342 -45076 -16865 6295 -5491 16288 44037 29779 -1631
3364 -1631 -14378 -1377 33847 19771 6140 24625 52686 66464 29679 -6467 -17307 -4141
3352 -4141 -13111 -23935 -11897 -25069 -20018 -7866 -29121 1155 16801 7225 12249 48861 56794
3339 56794 70483 67915 24960 9167 3913 4705 10792 20798 39030 61916 61679 35778 23658
3326 23658 43294 25292 8916 17858 16211 7047 -11083 -21445 -16158 287 -3082 8714 18856
3313 18856 9396 -18819 -6915 -20027 -29382 -26873 -29929 -15024 -2995 15859 32822 42224 12126
3300 12126 2366 7051 -15736 -40937 -40801 -30400 -835 41956 47484 32867 1421 -17777 -15962
3287 -15962 -31633 -43071 -27123 -16639 11278 29004 -7414 -45588 -49305 -24759 -21292 -18318
3275 -18318 -15101 -1734 10414 -1210 -2511 13687 16030 5597 884 4818 -14629 -25465 -7535
3262 -7535 8577 11074 15382 24968 24754 -11 12048 5323 -6236 -7519 -6316 10203 27094 21446
3248 21446 -15010 -31518 -35274 -18837 -4561 6605 33540 40407 42285 30266 -3443 -11486 -7619
3235 -7619 12086 27442 14339 11058 -3631 -12383 4670 22098 7672 -17809 -16851 -17498 -41132
3222 -41132 -58095 -52843 -6143 16725 -13580 -5980 -7344 1090 -17382 -15701 -21270 -33482 -40457
3209 -40457 -563 21123 34073 -3828 -19679 -42234 -64012 -40893 -7267 19432 23856 39775
3197 39775 23994 31730 25844 -3145 -20146 -6240 6775 226 16508 16423 2608 -18205 -19545
3184 -19545 -20445 -7698 -1546 -24870 -32250 3856 13905 7585 2067 29379 -8622 -20594 9914
3171 9914 36287 31272 17892 7305 15128 2888 2504 -15356 -28852 -34729 -4051 9815 34705
3158 34705 29225 -5564 -15333 2410 -11011 -17760 6087 14418 -11719 -15541 -19151 1518 10422
3145 10422 -1204 -385 205 5401 8139 8111 10193 21484 14650 -4605 -5519 -11133 -24307 -24606 -1887
3130 -1887 47423 74265 61434 62300 50189 27144 31616 46652 32157 22457 20478 4491 -9523
3117 -9523 -18594 -7926 -1130 -10266 2938 18329 14855 8752 -27690 -39377 -49481 -35181 -25410
3104 -25410 -26887 -28420 -31168 -18435 831 -964 10606 7203 -18111 -3357 24639 28556 14422
3091 14422 23584 29239 37903 38058 24542 34748 23474 -7951 -9839 10861 -20413 -5026 10187
3078 10187 26575 14736 12223 -9786 -49362 -45431 -14820 -16761 -41169 -38194 -26094 9169 28537
3065 28537 6768 5351 17236 40126 51587 38074 4081 -10488 14451 34486 42274 37213
3053 37213 9077 13394 16436 -1716 -22093 -4776 15779 -17306 -42419 -56163 -66284 -37548
3041 -37548 -16796 -27565 -38290 -28266 -40905 -43647 -44094 -49587 -19682 -13802 -2734 11725 8813
3028 8813 25441 34308 16796 19167 41087 37604 31741 1235 -31670 -72633 -75203 -67979 -50949
3015 -50949 -16763 -5601 9239 -22315 -33113 -3655 33667 35294 -7075 -38826 -57752 -53885
3003 -53885 -47243 -23977 27951 50298 41072 54326 52997 15791 20819 16842 10132 31013 45243
2990 45243 54136 39420 8481 -12243 -8480 -25206 4428 -485 -434 21607 9232 -6573 1929
2977 1929 5380 2640 -12067 -5241 19853 10919 25236 23592 21069 12377 2528 -3121 -8219 -18762
2963 -18762 -9595 4187 28088 24767 -933 1122 -23297 -33829 -17089 -16387 -1049 7338 4354
2950 4354 -5853 -26091 -14137 -11702 -30099 -47973 -53189 -21958 16780 17989 28224 53510 36979
2937 36979 1105 -18080 -12208 5056 6040 -3061 5486 -17669 -15987 14357 44201 38963 35749
2924 35749 12197 -784 -473 5718 9102 8104 4444 9504 9926 -472 -5563 4342 1153 -38185
2910 -38185 -61505 -67702 -76471 -41288 -11522 -3091 -31850 -28814 -13648 -22406 -34975 -26905 -24545
2897 -24545 -14425 3464 8129 16311 12518 7547 10138 11341 5803 7348 1305 12895 -2584 -2949
2883 -2949 -16757 -16832 7675 -35672 -60456 -76538 -76098 -20359 -6324 711 -12679 -16088 3969
2870 3969 14689 1698 -7336 1494 4846 619 -34589 -54645 -35574 -22625 -21935 -21393 -20782 -1981
2856 -1981 1570 -6041 7885 21928 22330 37994 31573 30535 -1678 -9152 -2742 1115 4477 -22428
2842 -22428 -15976 -30809 -24482 -16117 -34018 -18240 -263 -14068 -17046 -3678 -10833 5216 17213
2829 17213 35157 22297 -2130 -18546 -7752 19359 10946 -2725 25184 21443 -14993 -11914
2817 -11914 26340 46518 27636 17049 24170 -15 -4918 5590 9157 -11538 -8681 -31138 -29156
2804 -29156 -5874 -21811 -16677 26906 23135 -16514 -63916 -88720 -39415 -4729 11630 -8499
2792 -8499 4562 -4592 -35930 -15291 -6269 7890 22338 39608 55304 55562 38187 40343 44472
2779 44472 27972 21571 12880 11423 24199 28129 -7442 -11455 10751 -3081 -6216 23705 16845
2766 16845 2314 2194 -9137 -5987 -7565 22420 21178 -8814 -26258 -28165 -24726 -48993 -35768
2753 -35768 23929 37976 43514 42343 33012 29545 32001 19172 20551 38816 23384 -23598 -25250
2740 -25250 -21300 12206 14547 1340 5419 24509 26399 -2434 1963 22088 23430 19386 25715
2727 25715 25324 29144 34465 4417 14418 26084 10367 -8740 -32073 -5166 20174 27126 18574
2714 18574 13824 2169 -19799 -8931 -5436 -20782 -1144 41314 32777 53915 60778 39269 30359
2701 30359 17114 -1999 -25456 -45051 -24916 8526 -26261 -61697 -43007 -38158 -46503 -35625
2689 -35625 -22777 -37717 -40041 -13188 -19484 -16190 -9434 19249 27793 20820 11998 5120 10406 25204
2675 25204 21235 -11281 -25719 -20893 -16314 -23454 -34556 -7678 -17139 -15791 -26310 -15439 -1279
2662 -1279 -10988 13682 19255 23271 14666 2212 -5872 4212 -21863 -69951 -28731 -22557 -24079
2649 -24079 -22759 -26827 -38359 -27908 -19663 -31279 -26436 -21068 21490 31906 17965 -4836 10139
2636 10139 2873 362 12894 14763 26955 23129 20081 10115 15934 43477 40578 45315 22055 1265
2622 1265 -20451 -22608 -12741 -15820 -19383 -9576 -26947 -8611 7467 -3995 9017 4975 -30014
2609 -30014 -53308 -39319 -20027 2459 7423 -6834 -18428 -33828 -38331 -21934 -8473 24093
2597 24093 45014 47504 24303 -6523 -27305 -21977 -5530 -26062 -38331 -45831 -27527 416
2585 416 25621 3290 -5076 -9141 -10913 -23213 -10409 -15537 8690 11032 -2929 -7708 -2946 -4698
2571 -4698 -1731 -14948 -35370 -46461 -21248 -9802 -1988 37183 68856 80704 55667 50677 27745
2558 27745 36985 40088 57301 48058 34671 4505 -11493 -4624 16127 9247 -12622 -17726 -25552
2545 -25552 -26158 -28597 -23523 -34978 -38232 -22929 -30677 -29934 -6560 2674 21346 30976 22780 -16315
2531 -16315 -30585 -58810 -59148 -30262 14252 18108 11534 20512 16880 20412 22892 24684 7220 -6320
2517 -6320 -37005 -34684 -47555 -36800 -19069 -43389 -44682 8862 39995 12441 5860 5717 -4047
2504 -4047 -7626 3752 -10869 4630 29009 47541 25925 35482 26975 22390 40401 34295 -15600
2491 -15600 -54354 -20542 7190 7205 5690 11513 -209 -11941 -33243 -31380 -11329 -7355 -30394
2478 -30394 -46535 -19918 15509 1480 20146 43543 29871 -10974 -13079 -32212 -28471 -10899
2466 -10899 16508 15722 -7865 -12636 4955 2298 -11689 -338 14390 -2456 -21640 -32170 -27208
2453 -27208 -26779 -32053 -17499 -1746 15548 21538 23977 32964 5950 -13353 -20291 -11548 -19233 -23944
2439 -23944 -22284 -19636 -19079 -38466 -26382 -18047 -30794 -38278 -22614 4822 10088 23129 43505
2426 43505 30797 38435 12340 -16118 -4458 27127 19712 -5927 -11616 -11114 -20220 -35526 -24834
2413 -24834 -30088 -13438 -16922 -17737 -27791 -35253 -30859 -43947 -50312 -47533 -52199 -43656 -36350 -24838
2399 -24838 -36450 -29720 3659 6943 -29133 -15105 -19431 -13852 4299 -13182 -4194 -21435 -36748
2386 -36748 -45675 -29737 5113 11397 26099 9653 13976 7823 -8284 -10340 4299 9543 -14960
2373 -14960 -41615 -15365 4360 6321 -1420 -5178 -1883 14562 34309 -2239 -5690 28407 52201
2360 52201 29354 -1336 -16027 -9475 -3712 -13248 -6963 7736 15862 13443 47911 50753 14729
2347 14729 3051 15212 28506 10395 -10554 -19986 -12474 -34342 -30750 -107 -4206 -21033 -13162
2334 -13162 5558 -1856 -15898 -16881 -32219 -49989 -37522 -31300 -29772 -17176 -16111 -35419 -25050
2321 -25050 -9198 -13483 -13132 596 -2301 512 20781 24008 12408 23577 16642 -2209 2224
2308 2224 20285 34518 31711 14622 11864 -12352 -15495 9532 -6816 -12834 -11077 -30001 8846
2295 8846 -1457 -18174 10422 6572 -13966 -34118 -40394 -36140 -2895 8713 -22840 -43007 -46439
2282 -46439 -11991 12668 10097 26875 47918 67825 34436 11794 7589 20438 42022 20625
2270 20625 1557 -7320 9201 23498 29779 51327 42082 37694 42499 40876 48710 13574 -5283
2257 -5283 -16584 -25061 -27919 -19355 502 1723 -8984 -8703 3719 15425 13304 18629 29903 32777
2243 32777 -53 -36075 -12341 -10907 93 -1043 -8203 366 34510 40819 40698 29613 39903
2230 39903 57443 45360 8227 -9376 -15555 -4846 7147 7905 3483 265 4432 8119 2813
2217 2813 -8275 -11137 -20345 -36969 -20811 11959 19160 5540 -27143 -41551 -29834 -24970 -66480
2204 -66480 -89963 -51440 -34869 -43555 -31222 -18874 -22205 -61539 -45811 -17430 -9141 -9442 -16579
2191 -16579 -6996 12734 13921 12695 8536 -8838 -17278 -17346 -34493 -23327 1635 36596 40341 23505
2177 23505 6696 -2532 -23567 -22303 2459 -13362 -8393 20464 24195 6302 21789 17049 5311
2164 5311 13095 11142 506 -5059 -23811 -23930 -47044 -30801 -16809 -11387 -1286 -2159 3534 2269
2150 2269 -25837 -21951 -32266 -57934 -42166 -13286 17945 -1156 33050 32176 7071 -7635 -17959
2137 -17959 -24080 -25432 -23570 -32913 -55079 -32870 -44914 -26936 -21755 -6122 32340 41937 17449
2124 17449 11974 13402 -4082 -30140 -21137 -18606 -2971 5649 36189 41660 4966 -18566 -20381
2111 -20381 -12724 -5080 -20280 -33390 -2075 9070 2727 -7908 -26167 -8488 -1418 11100 24798
2098 24798 -9206 -49213 -36343 -36748 -24341 -3055 -9878 -24304 -24999 -51875 -45676 -11805 -1654
2085 -1654 5635 -30492 -22787 -18238 -30790 -34892 -39390 -19240 -11427 20258 33773 25191 8680
2072 8680 -6830 -4879 -33260 -50355 -39128 -10900 -14877 -35246 -32710 -28850 -33823 -46263 -24513
2059 -24513 -46544 -34199 -821 34005 38489 30026 24739 52730 39222 36956 31446 -9064 -33505
2046 -33505 -13573 7861 2129 952 -18327 -43455 -18098 -6375 -6310 -11311 -31921 -34661 -37954
2033 -37954 -42384 -58208 -36626 -32067 -44718 -32797 -30253 -7059 -9149 -20745 -2747 -24239 -37410
2020 -37410 -34135 -45132 -28764 -10716 8051 17298 -9412 -21524 -23894 -39100 -62944 -62509 -60346
2007 -60346 -40989 -44543 -23337 -4898 -28015 -13352 14914 19184 24711 16413 1595 3643 13086
1994 13086 5439 786 9220 24976 30641 30727 27954 10093 6418 21386 48941 43387 43244 55030
1980 55030 37984 23376 -35510 -18425 -17173 -15514 -25799 -29027 126 37624 57353 46546
1968 46546 32242 19624 15741 19155 9976 48733 34911 26360 22002 23787 4453 19094 20357
1955 20357 18962 4689 7351 3910 6158 -890 15130 9444 18002 27161 -3091 -9563 -1929 6136
1941 6136 -316 23168 12855 -3497 41687 49869 9767 -3589 7348 1393 3202 6929 -24008
1928 -24008 4499 6365 8626 22940 34339 21863 -2404 -6161 -6276 -20645 -30753 -27198 -10463
1915 -10463 -591 -233 -18493 -6344 13566 -10021 -59414 -67210 -38025 -20738 -17272 -5954 4891
1902 4891 16492 19130 39023 47675 31552 5502 9153 33904 28228 935 3022 3448 -12020
1889 -12020 -23306 -25310 -16463 10512 34800 40350 42189 32307 14321 16265 38616 58646 38195
1876 38195 16904 -20041 -3702 12881 -12240 -13911 7006 -1113 2502 4304 -5095 -2165 24371
1863 24371 11938 -30964 -26277 -10888 -23695 -35445 -40629 -42134 -28517 -4117 4448 -337 -9160
1850 -9160 -25285 -17047 42 16682 28248 -1585 -27594 -29459 -10572 11544 44395 18479
1838 18479 2937 27191 46614 45400 54491 68988 77793 66296 62719 21023 -6755 -16206 -12856
1825 -12856 -417 231 -6828 -20728 -32808 -20234 -4080 -12145 -37392 -46112 -35028 -19834 -14128
1812 -14128 -12577 12373 27299 26666 51702 38188 15474 26122 22359 16881 10082 -2808 3049
1799 3049 -5202 -40707 -42534 -12616 3313 -11453 -13212 2905 6648 30755 33894 26204 6737
1786 6737 7429 -3801 -30894 -6698 19797 13090 29510 45388 45378 44052 16997 -15631 -27975
1773 -27975 -19968 -13785 -21115 -9051 24309 63581 77964 57370 49183 31408 37298 34777 26112
1760 26112 35192 39056 36196 18359 2824 -29540 -26342 -28522 -27258 -8198 5652 19328 17844
1747 17844 -17814 -47620 -41398 -5680 -3138 4291 7575 7065 15765 16126 22060 9988 -10879 -5735
1733 -5735 23372 25331 8379 -18995 5319 31665 32770 6407 14144 27039 2333 -2275 30044
1720 30044 23743 -415 11512 -6434 7697 6753 14895 3716 12619 -1726 -18535 -34462 -18070
1707 -18070 17561 20385 16854 18466 -13417 -14616 -25650 -28166 -33004 -5771 11190 -553 -22941
1694 -22941 -27067 -5905 18655 8116 -29654 -44755 -39714 -21107 -4126 -17958 -31199 635
1682 635 16840 37741 42546 41199 49562 55483 47603 39903 29245 27926 33035 24861 48476 71894
1668 71894 38730 -13796 -13377 -3925 -21469 -21166 8419 21388 28601 22911 -7248 -22025 -30032
1655 -30032 -7082 -16095 -14093 -5529 7992 24290 17751 17243 40484 50855 40643 38882 43487
1642 43487 50915 37073 64013 67774 37123 34035 38572 34352 53830 49367 25920 17024 25876
1629 25876 39520 19534 17423 20203 23693 18956 -13474 -29807 -31646 8253 21483 7828 6867
1616 6867 29913 38160 16345 19523 9699 5652 4828 -10338 -39692 -51673 -55556 -43701 -31387
1603 -31387 9767 25379 20422 2407 8437 47944 67720 58879 37104 28155 40420 40818 33308
$$ [...]
##END NTUPLES=NMR SPECTRUM
##END=
