##TITLE=Analysis number 328787
Compound Code cc 04026
Book Reference 423/166/5
Project Code adrs
Chemist Name bruced
##JCAMPDX= 6.0         $$ Bruker NMR JCAMP-DX V2.0
##DATA TYPE= NMR SPECTRUM
##DATA CLASS= NTUPLES
##ORIGIN= Bruker BioSpin GmbH
##OWNER= nmr
$$ XWIN-NMR		Version 3.5
$$ Wed Jul  4 09:50:38 2007 GMT Daylight Time (UT+1h)  MAYBRIDGE\nmr@NMR_250MHZ
##.OBSERVE FREQUENCY= 250.131544655141
##.OBSERVE NUCLEUS= ^1H
##.ACQUISITION MODE= SIMULTANEOUS (DQD)
##.ACQUISITION SCHEME= undefined
##.AVERAGES= 16
##.DIGITISER RES= 18
##SPECTROMETER/DATA SYSTEM= dpx250
##.PULSE SEQUENCE= zg30
##.SOLVENT NAME= CDCl3
##.SHIFT REFERENCE= (INTERNAL, CDCl3, 0, 16.522)
##AUDIT TRAIL= $$ (NUMBER, WHEN, WHO, WHERE, WHAT)
$$ ##TITLE= Audit trail, XWIN-NMR		Version 3.5
$$ ##JCAMPDX= 5.01
$$ ##ORIGIN= Bruker BioSpin GmbH
$$ ##OWNER= nmr
$$ C:\u/data/dgb/nmr/ADRS/320/pdata/1/auditp.txt
$$ ##AUDIT TRAIL=  $$ (NUMBER, WHEN, WHO, WHERE, WHAT)
(   1,<2007-07-04 09:50:17.88 +100>,<MAYBRIDGE\nmr>,<NMR_250MHZ>,
      <created by zg, POWCHK disabled, PULCHK disabled
       configuration hash MD5:
       76 6E 9A 78 1E 09 19 81 EC 84 63 8F B0 6A 59 2D
       data hash MD5: 64K
       2F 71 2D D6 F4 13 25 2D F4 21 50 74 D5 97 9A 87>)
(   2,<2007-07-04 09:50:30.15 +100>,<MAYBRIDGE\nmr>,<NMR_250MHZ>,
      <Start of raw data processing
       ef LB = 0.3 FT_mod = 6 PKNL = 1 SI = 32K 
       data hash MD5: 32K
       57 56 68 96 DD CE 62 4E EA 47 EA 29 AB 7E BA F3>)
(   3,<2007-07-04 09:50:31.83 +100>,<MAYBRIDGE\nmr>,<NMR_250MHZ>,
      <apk 
       data hash MD5: 32K
       ED AE A2 E4 4D D7 DC 56 0C 12 B1 BD 12 4A 04 5E>)
(   4,<2007-07-04 09:50:32.57 +100>,<MAYBRIDGE\nmr>,<NMR_250MHZ>,
      <abs ABSG = 5 
       data hash MD5: 32K
       54 4C 3F 4D DF B4 13 55 67 DE C8 83 EB 83 3F D5>)
$$ ##END=
$$ 
$$ hash MD5
$$ 54 EC C7 A3 66 7A F1 30 E1 01 2F 52 5C E1 4A 3F
##$RELAX= 
##$RELAX= 
##$RELAX= 
##$RELAX= 
##$RELAX= 
##$RELAX= 
##$RELAX= 
$$ Bruker specific parameters
$$ --------------------------
##$DU= <C:\u>
##$EXPNO= 320
##$NAME= <ADRS>
##$PROCNO= 1
##$TYPE= <nmr>
##$USER= <dgb>
##$AMP= (0..31)
100 100 100 100 100 100 100 100 100 100 100 100 100 100 100 100 100 100 
100 100 100 100 100 100 100 100 100 100 100 100 100 100 
##$AQSEQ= 0
##$AQ_mod= 3
##$AUNM= <au_zg>
##$AUTOPOS= <4 >
##$BF1= 250.13
##$BF2= 250.13
##$BF3= 250.13
##$BF4= 250.13
##$BF5= 500.13
##$BF6= 500.13
##$BF7= 500.13
##$BF8= 500.13
##$BYTORDA= 1
##$CFDGTYP= 0
##$CFRGTYP= 5
##$CHEMSTR= <none>
##$CNST= (0..31)
1 1 145 1 1 1 1 1 1 1 1 1 1 1 1 1 1 1 1 1 1 1 1 1 1 1 1 1 1 1 1 1 
##$CPDPRG= <>
##$CPDPRG1= <>
##$CPDPRG2= <>
##$CPDPRG3= <>
##$CPDPRG4= <mlev>
##$CPDPRG5= <mlev>
##$CPDPRG6= <mlev>
##$CPDPRG7= <mlev>
##$CPDPRG8= <mlev>
##$CPDPRGB= <>
##$CPDPRGT= <>
##$D= (0..31)
0 1 0 0 0 0 0 0 0 0.06 0 0 0 0 0 0 0.0002 0 0 0 0 0 0 0 0 0 0 0 0 0 0 
0 
##$DATE= 1183539016
##$DBL= (0..7)
120 120 120 120 120 120 120 120 
##$DBP= (0..7)
150 150 150 150 150 150 150 150 
##$DBP07= 0
##$DBPNAM0= <>
##$DBPNAM1= <>
$$ [...]
##$SUBNAM7= <"">
##$SUBNAM8= <"">
##$SUBNAM9= <"">
##$SW= 20.6930455092707
##$SWIBOX= (0..15)
0 0 3 0 0 0 0 0 0 0 0 0 0 0 0 0 
##$SW_h= 5175.983436853
##$TD= 65536
##$TD0= 1
##$TE= 296.16
##$TE2= 300
##$TE3= 300
##$TEG= 300
##$TL= (0..7)
0 120 120 120 120 120 120 120 
##$TP= (0..7)
150 150 150 150 150 150 150 150 
##$TP07= 0
##$TPNAME0= <>
##$TPNAME1= <>
##$TPNAME2= <>
##$TPNAME3= <>
##$TPNAME4= <>
##$TPNAME5= <>
##$TPNAME6= <>
##$TPNAME7= <>
##$TPOAL= (0..7)
0.5 0.5 0.5 0.5 0.5 0.5 0.5 0.5 
##$TPOFFS= (0..7)
0 0 0 0 0 0 0 0 
##$TUNHIN= 0
##$TUNHOUT= 0
##$TUNXOUT= 0
##$USERA1= <user>
##$USERA2= <user>
##$USERA3= <user>
##$USERA4= <user>
##$USERA5= <user>
##$V9= 5
##$VALIST= <valist>
##$VCLIST= <CCCCCCCCCCCCCCC>
##$VD= 0
##$VDLIST= <DDDDDDDDDDDDDDD>
##$VPLIST= <PPPPPPPPPPPPPPP>
##$VTLIST= <TTTTTTTTTTTTTTT>
##$WBST= 1024
##$WBSW= 4
##$XGAIN= (0..3)
0 0 0 0 
##$XL= 0
##$YL= 0
##$YMAX_a= 521074
##$YMIN_a= -394325
##$ZGOPTNS= <>
##$ZL1= 120
##$ZL2= 120
##$ZL3= 120
##$ZL4= 120
##$ABSF1= 16.522
##$ABSF2= -4.171173
##$ABSG= 5
##$ABSL= 3
##$ALPHA= 0
##$AQORDER= 0
##$ASSFAC= 0
##$ASSFACI= 0
##$ASSFACX= 0
##$ASSWID= 0
##$AUNMP= <proc_1d>
##$AZFE= 0.1
##$AZFW= 0.1
##$BCFW= 0
##$BC_mod= 0
##$BYTORDP= 0
##$COROFFS= 0
##$CY= 12.5
##$DATMOD= 1
##$DC= 0
##$DFILT= <>
##$DTYPP= 0
##$F1P= 14.0000005364418
##$F2P= -0.99999901652339
##$FCOR= 0.5
##$FTSIZE= 32768
##$FT_mod= 6
##$GAMMA= 0
##$GB= 0
##$INTBC= 1
##$INTSCL= 1
##$ISEN= 128
##$LB= 0.3
##$LEV0= 0
##$LPBIN= 0
##$MAXI= 10000
##$MC2= 0
##$MEAN= 0
##$ME_mod= 0
##$MI= 0
##$NCOEF= 0
##$NC_proc= -5
##$NLEV= 6
##$NOISF1= 0
##$NOISF2= 0
##$NSP= 0
##$NTH_PI= 0
##$NZP= 0
##$OFFSET= 16.522
##$PC= 1
##$PHC0= -57.14838
##$PHC1= 21.17686
##$PH_mod= 1
##$PKNL= yes
##$PPARMOD= 0
##$PSCAL= 4
##$PSIGN= 0
##$REVERSE= no
##$SF= 250.13
##$SI= 32768
##$SIGF1= 0
##$SIGF2= 0
##$SINO= 400
##$SIOLD= 32768
##$SREGLST= <1H.CDCl3>
##$SSB= 0
##$STSI= 32768
##$STSR= 0
##$SW_p= 5175.98343685301
##$SYMM= 0
##$S_DEV= 0
##$TDeff= 65536
##$TDoff= 0
##$TI= <Analysis number 999999
Compound Code 99
Book Reference 9
Project Code 9>
##$TILT= no
##$TM1= 0
##$TM2= 0
##$TOPLEV= 0
##$USERP1= <user>
##$USERP2= <user>
##$USERP3= <user>
##$USERP4= <user>
##$USERP5= <user>
##$WDW= 1
##$XDIM= 32768
##$YMAX_p= 381367202
##$YMIN_p= -307195
$$ End of Bruker specific parameters
$$ ---------------------------------
##NTUPLES= NMR SPECTRUM
##VAR_NAME=  FREQUENCY,     SPECTRUM/REAL,   SPECTRUM/IMAG
##SYMBOL=    X,             R,               I
##VAR_TYPE=  INDEPENDENT,   DEPENDENT,       DEPENDENT
##VAR_FORM=  AFFN,          ASDF,            ASDF
##VAR_DIM=   32768,         32768,           32768
##UNITS=     HZ,            ARBITRARY UNITS, ARBITRARY UNITS
##FACTOR=    0.157963299565203, 1,           1
##FIRST=     4132.6476996994, 0,             0
##LAST=      -1043.33573715361, 0,           0
##MIN=       -1043.33573715361, -307195,     0
##MAX=       4132.6476996994, 381367202,     0
$$ Real data points
##PAGE= N=1
##DATA TABLE= (X++(R..R)), XYDATA
$$ [...]
$$ plain form
24586 -96659 -99532 -23374 90515 30369 7041 4069 8423 -27209 -47353 -87847 -134448 -73326
24574 -73326 10190 77234 35216 -2631 -8500 -66775 -67137 -47590 -47851 -80177 -113559 -108054 -87312
24561 -87312 -66404 -101351 -103685 -150514 -167450 -138036 -82349 -66378 -79614 -80044 -76566 359
24549 359 81326 72429 7482 -62916 -1861 32990 29030 21208 -39769 -107656 -124944 -28803 6910
24536 6910 12651 10129 13182 -82707 -146092 -55495 11620 52528 67821 23488 3624 23737
24524 23737 50833 43145 18410 28705 32898 55475 132522 138086 126203 110596 130037 161278
24512 161278 80987 15052 3567 29790 -75175 -203839 -248804 -176110 -81159 -48349 -17688
24501 -17688 2693 -56210 -36071 -74362 -84588 -55446 -29831 -35756 -35334 -55648 -119986 -118112
$$ packed form
24586i6659k873P6158J13889o0146k3328k972M354l5632k0144m0494m6601O1122
24574g3326Q3516O7044m2018l7847n869n8275l62J9547k61l2326l3382N505K0742
24561h7312K0908l4947k334m6829j6936K9414N5687J5971j3236m30L478P6925
24549C59Q0967q897o4947p0398O1055L4851l960p822o0977o7887j7288R6141L5713
24536F910N741k522L053r5889o3385R0597O7115M0908J5293m4333j9864K0113
24524B3737K7096p688k4735J0295M193K2577P7047N564j1883j5607J9441L1241
24512A61278q0291o5935j1485K6223j04965j28664m4965P2694R4951L2810L0661
24501a7688K0381n8903K0139l8291j0226K9142K5615n925M22k0314o4338J874
$$ plain form
24489 -118112 -48348 6607 70146 116174 119783 -18784 -53839 -70635 -94613 -115642 -135032
24478 -135032 -124329 -153987 -192806 -219728 -93812 -122964 -138779 -81797 -69964 -12763 -51598
24467 -51598 -94527 -205573 -184756 -167485 -139152 -159426 -137814 -69376 26007 88318 130727
24456 130727 90419 63153 38409 -4785 -9522 -60977 -113453 -34265 20686 133228 172721
24445 172721 52768 12744 26475 20804 15178 -55095 -58118 -114575 -164605 -115123 -134205 -131482
24433 -131482 -216135 -224091 -112291 -71747 -107808 -55680 -86353 -93345 -67849 -105429 -112856 -132009
24421 -132009 -183710 -128291 -56700 33100 59633 48302 11152 -32012 -140692 -131530 -45068
24410 -45068 -81716 -133359 -112801 -48875 -25502 -71614 -46996 -41082 -46162 -46547 5626 27610
$$ packed form
24489a18112O9764N4955O3539M6028L609j38567l5055j6796k3978k1029j9390
24478a35032J0703k9658l8819k6922J25916k9152j5815N6982J1833N7201l8835
24467e1598m2929j11046K0817J7271K8333k0274K1612O8438R5383O2311M2409
24456A30727m0308k7266k4744m3194m737n1455n2476P9188N4951J12542L9493
24445A72721j19953m0024J3731n671n626p0273l023n6457n0030M9482j9082K723
24433a31482q4653p956J11800M0544l6061N2128l0673o992K5496l7580p427j9153
24421a32009n1701N5419P1591Q9800K6533j1331l7150m3164j08680R162Q6462
24410d5068l6648n1643K0558O3926K3373m6112K4618N914n080l85N2173K1984
$$ plain form
24398 27610 81002 21359 18192 23113 22373 507 3377 -12778 -36026 29283 -26382 -97236 -68729
24385 -68729 158 35161 38679 7161 -18096 -42975 -58235 -32601 -79711 -117533 -122371 -77170
24373 -77170 8361 54486 38886 -34279 -19001 -27058 25046 -37961 -77145 -35526 -41808 -17738
24361 -17738 4417 -11868 -66741 -84682 -118134 -115748 -89713 -64797 901 32752 79580 47190
24349 47190 -25332 -65135 -79134 -28901 -65239 -40641 -83756 -103904 -16075 -2225 -29768 -133114
24337 -133114 -125797 -107022 -108397 -137336 -216305 -120567 21040 71784 -21064 -113740 -111790 -26934
24325 -26934 -32272 -6633 65902 90757 39858 -16408 -24386 -52467 -81241 -39130 -71819 10846
24313 10846 9669 -32775 -38242 -61958 57194 42613 12601 42409 -40189 -68318 -74583 -23130
$$ packed form
24398B7610N3392n9643l167M921p40k1866K870j6155k3248O5309n5665p0854K8507
24385f8729O8887L5003L518l1518k5257k4879j5260K5634m7110l7822m838M5201
24373g7170Q5531M6125j5600p3165J5278q057N2104o3007l9184M1619o282K4070
24361a7738K2155j6285n4873j7941l3452K386K6035K4916O5698L1851M6828l2390
24349D7190p2522l9803j3999N0233l6338K4598m3115k0148Q7829J3850k7543j03346
24337a33114P317J8775j375k8939p8969R5738J41607N0744r2848r2676J950Q4856
24325b6934n338K5639P2535K4855n0899n6266p978k8081k8774M2111l2689Q2665
24313A0846j177m2444n467k3716J19152j4581l0012K9808q2598k8129o265N1453
$$ plain form
24301 -23130 25610 23556 -38408 -88676 -4342 57485 2169 64341 117768 156670 65448 38998
24289 38998 43221 27834 -94 -48973 -75076 -24778 -58072 -153038 -91343 -77526 -95918 -79336
24277 -79336 -44150 -30661 -29158 -17363 -51091 -83526 -85198 -98526 -110611 -18654 -44306 -120899
24265 -120899 -51362 -56715 -17013 26410 58217 35926 -28728 -102432 -83405 -31750 -36803 -41453
24253 -41453 -52753 -82926 -71223 -161304 -161408 -129877 -34739 28940 14591 -80049 -74354 -53791
24241 -53791 -64083 -132614 -180707 -199439 -163838 -47726 -2807 6851 -10605 -26331 -88337 -69430
24229 -69430 -94896 -76270 -118395 -124451 -71434 -23416 -31880 -53948 -83659 -108343 -113326 -212532
24217 -212532 -125357 -21289 -27601 52709 103225 57276 -27474 -57047 -88996 -32194 16493
$$ packed form
24301b3130M8740k054o1964n0268Q4334O1827n5316O2172N3427L8902r1222k6450
24289C8998M223j5387k7928m8879k6103N0298l3294r4966O1695J3817j8392J6582
24277g9336L5186J3489J503J1795l3728l2435j672j3328j2085R1957k5652p6593
24265a20899O9537n353L9702M3423L1807k2291o4654p3704J9027N1655n053m650
24253d1453j1300l0173J1703r0081j04L1531R5138O3679j4349r4640N695K0563
24241e3791j0292o8531m8093j8732L5601J16112M4919R658j7456j5726o2006J8907
24229f9430k5466J8626m2125o056N3017M8018q464k2068k9711k4684m983r9206
24217b12532Q7175J04068o312Q0310N0516m5949q4750k9573l1949N6802M8687
$$ plain form
24206 16493 -14563 -57063 -56015 -46216 9628 22185 -75244 -103313 -114298 -43271 18821 71417
24194 71417 84228 29350 -4429 56252 118550 60338 46852 10004 42263 -3710 -61417 -79647
24182 -79647 -131641 -142691 -127440 -53598 31460 45625 15040 -7006 -69926 -63398 -52999 -97502
24170 -97502 -125293 -91476 -133827 -162354 -102172 46422 91539 23716 4441 11947 17543 48785
24158 48785 99484 74514 50461 91511 53584 34655 41020 98606 68153 48152 31483 46988
24146 46988 17370 16275 52749 33553 -31346 -55093 -63343 -100029 -124872 -165335 -170543 -158364
24134 -158364 -105103 -51037 -72820 -93051 -69489 -52860 -38338 -62504 -62661 -35733 -36922 -45276
24122 -45276 -5098 -6346 35661 57938 31930 -34382 -39349 39185 67104 -5343 -21214 -5031
$$ packed form
24206A6493l1056m2500J048R799N5844J2557r7429k8069j0985P1027O2092N2596
24194G1417J2811n4878l3779O0681O2298n8212j3486l6848L2259m5973n7707j8230
24182g9647n1994j1050J5251P3842Q5058J4165l0585k2046o2920O528J0399m4503
24170i7502k7791L3817m2351k8527O0182J48594M5117o7823j9275P506N596L1242
24158D8785N0699k4970k4053M1050l7927j8929O365N7586l0453k0001j6669J5505
24146D6988k9618j095L6474j9196o4899k3747q250l6686k4843m0463n208J2179
24134a58364N3261N4066k1783k0231K3562J6629J4522k4166j57K6928j189q354
24122d5276M0178j248M2007K2277k6008o6312m967P8534K7919p2447j5871J6183
$$ plain form
24110 -5031 -44806 -86868 -119280 -87494 -76312 -94093 -60907 -91243 -21325 22252 29120 62371
24098 62371 9251 -105818 -138610 -66234 -40304 594 28672 50110 29720 43727 19590
24087 19590 -36261 -61275 -85743 -47350 -56365 -95086 -131398 -92027 -94441 -96858 -71797 -37406
24075 -37406 -50825 -74275 -70120 -35562 -25607 4772 37711 946 -2051 9907 -55439 -90672
24063 -90672 -136942 -169025 -98281 -56786 -33058 -16967 45775 88215 -18812 -50922 -34097
24052 -34097 -44158 -27015 -18327 -46045 21511 6180 31413 49172 159265 164504 130868 94861
24040 94861 86918 80730 13241 -8907 25432 -3197 45735 102226 23513 -34957 -12566 34424
24028 34424 26407 4737 -43645 -132153 -156761 -73495 -70818 -64619 -12811 56075 33396 -30288
$$ packed form
24110e031l9775m2062l2412L1786J1182j7781L3186l0336O9918M3577O868L3251
24098F2371n3120j15069l2792P2376K5930M0898K8078K1438k0390J4007k4137
24087A9590n5851k5014k4468L8393r015l8721l6312L9371k414k417K5061L4391
24075c7406j3419k3450M155L4558R955L0379L2939l6765k997J1958o5346l5233
24063i0672m6270l2083P0744M1495K3728J6091O2742M2440j07027l2110J6825
24052c4097j0061J7143Q688k7718O7556j5331K5233J7759J10093N239l3636l6007
24040I4861p943o188o7489k2148L4339k8629M8932N6491p8713n8470K2391M6990
24028C4424q017k1670m8382q8508k4608Q3266K677O199N1808O8886k2679o3684
$$ plain form
24016 -30288 17773 44645 42889 58185 42532 15487 -406 51842 158700 86899 64638 49261
24004 49261 36071 -2627 -11308 -60515 -10314 2904 34824 15496 11516 -36597 -7764 25480
23992 25480 -437 -6413 8942 36485 29569 62734 69329 32556 43988 122726 80125 45748
23980 45748 -35521 -105803 -13625 103695 130656 92279 74539 7134 -113364 -71129 -6192
23969 -6192 -46513 -52369 -11644 -54726 -51553 13928 -15080 -20999 -41024 -18120 -104747 -134321
23957 -134321 -86995 -25479 5630 -32559 -13805 17649 15718 -12498 -27597 6014 -20077 -11718
23945 -11718 47610 158169 193611 153802 122746 89993 25704 -39982 -20097 -79346 -51741
23934 -51741 -8716 20569 57591 106655 159055 78790 75197 58791 58201 64526 29347 42902
$$ packed form
24016c0288M8061K6872j756J5296j5653k7045j5893N2248J06858p1801k2261j5377
24004D9261j3190l8698q681m9207N0201J3218L1920j9328l980m8113K8833L3244
23992B5480k5917n976J5355K7543o916L3165O595l6773J1432P8738m2601l4377
23980D5748q1269p0282R2178J17320K6961l8377j7740o7405j20498M2235O4937
23969f192m0321n856M0725m3082L173O5481k9008n919k0025K2904q6627k9574
23957a34321M7326O1516L1109l8189J8754L1454j931k8216j5099L3611k6091Q359
23945a1718N9328J10559L5442l9809l1056l2753o4289o5686J9885n9249K7605
23934e1741M3025K9285L7022M9064N2400q0265l593j6406n90O325l5179J3555
$$ plain form
23922 42902 88301 77958 12017 -26181 -101281 -104175 -11872 64114 2596 -56689 -43608 -4158
23910 -4158 56833 118578 112985 102702 86304 82679 74404 -11069 -44730 -55271 -120068 -101376
23898 -101376 -32391 -60404 -64711 -70558 -88471 -170341 -129022 -107934 -102805 -97621 -157107 -166437
23886 -166437 -118967 -11645 -37854 -48553 -48303 -35279 52330 62582 55061 167 -32878 -62034
23874 -62034 88740 161226 96267 48785 20898 -8818 33512 52599 -22284 -77555 -109110
23863 -109110 -26060 21663 18075 -88023 -66857 -44641 -60837 -86059 -109389 -105235 -141507 -122725
23851 -122725 -20128 33531 33595 129065 145432 140043 90783 -29277 -34756 -1117 19720 -524
23839 -524 -32808 40970 80969 46630 43665 85605 64191 23954 -20961 25921 52251 38093
$$ packed form
23922D2902M5399j0343o5941l8198p5100k894R2303P5986o1518n9285J3081L9450
23910d158O0991O1745n593j0283j6398l625q275q5473l3661j0541o4797J8692
23898a01376O8985k8013m307n847j7913q1870M1319K1088N129N184n9486r330
23886a66437M7470J07322k6209j0699K50J3024Q7609J0252p521n4894l3045k9156
23874f2034J50774P2486o4959m7482k7887k9716M2330J9087p4883n5271l1555
23863a09110Q3050M7723l588j06098K1166K2216j6196k5222k3330M154l6272J8782
23851a22725J02597N3659O4R5470J6367n389m9260j20060n479L3639K0837k0244
23839e24l2284P3778L9999l4339k965M1940k1414m0237m4915M6882K6330j4158
$$ plain form
23827 38093 33763 5634 68651 133070 151379 111076 50655 23603 43795 -28781 -100930 -79879
23815 -79879 -52954 -54506 -104985 -104816 -54648 -83108 -66265 -17434 12827 28076 13363 -93358
23803 -93358 -59978 -115511 -114849 -42628 -83437 -57586 -3568 14241 47488 1763 -6941 -26339
23791 -26339 -106082 -152164 -158487 -109716 -91343 -90168 -23357 -26776 -97673 -69665 -100969 -111636
23779 -111636 -58432 -5194 29758 58244 75041 40938 -11920 -28241 -66865 -10904 78098
23768 78098 53706 -16486 -122479 -112055 -28500 42007 32508 -27562 8616 39513 10491 75497
23756 75497 95575 55062 29738 26674 110766 133840 164322 121279 12621 -99836 -82840
23745 -82840 -4168 -7166 -1282 -21681 75448 122040 51402 41109 31031 -32310 -83600 -38707
$$ packed form
23827C8093m330k8129O3017O4419J8309m0303o0421k7052K0192p2576p2149K1051
23815g9879K6925j552n0479J69N0168k8460J6843M8831L0261J5249j4713j06721
23803i3358L3380n5533O62P2221m0809K5851N4018J7809L3247m5725q704j9398
23791b6339p9743m6082o323M8771J8373J175O6811l419p0897K8008l1304j0667
23779a11636N3204N3238L4952K8486J6797l4103n2858j6321l8624N5961Q9002
23768G8098k4392p0192j05993J0424Q3555P0507r499o0070L6178L0897k9022O5006
23756G5497K0078m0513k5324l064Q4092K3074L0482m3043j08658j12457J6996
23745h2840P8672k998N884k0399R7129M6592p0638j0293j0078o3341n1290M4893
$$ plain form
23733 -38707 -34695 -63991 2977 63340 75368 -12889 -66107 -7231 112738 138276 101795 78202
23721 78202 23615 46660 115946 123106 124996 18896 -40009 -41117 -38389 -65039 -38794 -9340
23709 -9340 17212 10275 -8100 -38923 -75143 -46223 -52694 -3021 -51041 -59101 -57231 10742 -13452
23696 -13452 -67937 -22752 101132 99414 46763 84284 107042 64163 9545 21529 -54799 -121830
23684 -121830 -59249 -26024 15290 19995 71718 55325 10360 -886 -10357 36997 21629 28335
23672 28335 -15441 -79746 -32576 -66502 -75545 -45785 -30863 26992 676 -916 7644 1473
23660 1473 26744 40531 29397 108586 214931 207032 255645 226802 120214 36898 83535 113154
23648 113154 77682 70069 24962 23261 32151 23919 51171 46848 78525 45388 -29498 -48036
$$ packed form
23733c8707M012k9296O6968O0363J2028q8257n3218N8876J19969K5538l6481k3593
23721G8202n4587K3045O9286P160J890j06100n8905j108K728k6650K6245K9454
23709i340K6552o937j8375l0823l6220K8920o471M9673m8020q060J870O7973k4194
23696a3452n4485M5185J23884j718n2651L7521K2758m2879n4618J1984p6328o7031
23684a21830O2581L3225M1314M705N1723j6393m4965j1246r471M7354j5368O706
23672B8335m3776o4305M7170l3926r043K9760J4922N7855k6316j592Q560o171
23660A473K5271J3787j1134P9189J06345p899M8613k8843j06588q3316M6637K9619
23648A13154l5472p613m5107j701Q890q232K7252m323L1677l3137p4886j8538
$$ plain form
23636 -48036 17123 -5847 25138 81188 42602 -1006 340 -15583 -45001 -22202 2499 -32375
23624 -32375 -19878 -65932 -69724 -55493 10658 46728 37620 4854 -552 -48787 -67675 -85100
23612 -85100 -35845 -38362 -25245 61528 22978 -20108 8020 93580 46637 -17605 -107749 -156781
23600 -156781 -40948 23803 16314 -11832 -61009 -125051 -180981 -97245 60359 63757 23073
23589 23073 -17274 -26314 -44427 -37502 -37824 22309 16166 40204 9195 -1214 14255 42072 25152
23576 25152 60996 82692 40551 -17375 -29539 -56326 6323 69909 74279 17094 -35652 -95451
23564 -95451 -134144 -47613 -12901 37504 23725 -12854 23684 17976 -15835 -67699 -94708 -96774
23552 -96774 -33155 29213 62529 112401 131097 187488 202160 112859 81853 98900 164594 161388
$$ packed form
23636d8036O5159k2970L0985N6050l8586m3608J346j5923k9418K2799K4701l4874
23624c2375J2497m6054l792J4231O6151L6070r108l2766n406m8235j8888j7425
23612h5100M9255k517J3117Q6773l8550m3086K8128Q5560m6943o4242r0144m9032
23600a56781J15833O4751p489k8146m9177o4042n5930Q3736J57604L398m0684
23589B3073m0347r040j8113O925l22O0133o143K4038l1009j0409J5469K7817j6920
23576B5152L5844K1696m2141n7926j2164k6787O2649O3586M370n7185n2746n9799
23564i5451l8693Q6531L4712N0405j3779l6579L6538n708l3811n1864k7009k066
23552i6774O3619O2368L3316M9872J8696N6391J4672q9301l1006J7047O5694l206
$$ plain form
23540 161388 53442 -25612 -64530 -7381 -21323 -27260 -71376 10676 151247 180241 135674
23529 135674 115546 23200 -15864 18221 27471 7922 24895 62907 97975 35136 -29509 -62282
23517 -62282 -14827 6223 -63630 -37041 42352 89538 66356 75093 83898 88943 84933 39507
23505 39507 12526 25042 53349 85455 111020 71520 -11620 -29600 6411 19494 -20159 -5092
23493 -5092 23335 71279 133280 162398 110195 26276 38139 56029 -16887 -32816 -47617 -72054
23481 -72054 6104 -23732 -36419 -11798 -18710 48512 -2937 -11311 84598 58174 44277 33258
23469 33258 -24050 -22072 -41518 -33634 -35900 -51128 -65847 -24480 -9353 -8980 -3113 27010 1055
23456 1055 62387 134722 172435 91654 86521 51474 25141 10810 4174 5373 17105 57163
$$ packed form
23540A61388j07946p9054l8918N7149j3942n937m4116Q2052J40571K8994m4567
23529A35674k0128r2346l9064L4085R250j9549J6973L8012L5068o2839o4645l2773
23517f2282M7455K1050o9853K6589P9393M7186k3182Q737Q805N045m010m5426
23505C9507k6981J2516K8307L2106K5565l9500q3140j7980L6011J3083l9653J5067
23493e092K8427M7944O2001K9118n2203q3919J1863J7890p2916j5929j4801k4437
23481g2054P8158k9836j2687K4621o912O7222n1449q374R5909k6424j3897j1019
23469C3258n7308J978j9446P884k266j5228j4719M1367J5127L73N867L0123k5955
23456A055O1332P2335L7713q0781n133l5047k6333j4331o636J199J1732M0058
$$ plain form
23444 57163 107009 60606 -12456 3393 -21951 -62812 -89128 -108295 -78587 -88378 -69016 -79266
23432 -79266 -79695 -51969 -11658 -18478 -22961 -44121 -25089 30715 81234 41954 32968 96300 180614
23419 180614 243486 236955 197879 122386 128259 158648 139021 114336 76226 36167 12133 -3448
23407 -3448 62477 118505 72224 110152 98347 55569 48566 31769 1669 8928 26036 39439
23395 39439 26232 81479 143180 151734 209529 261180 142649 11034 38590 118561 73960
23384 73960 10667 -52493 -46436 -23164 -49979 283 68890 138771 88106 132104 166445 114272
23372 114272 56435 5289 34125 91539 85969 -2876 -21074 47584 96159 82392 29917 58756
23360 58756 146340 111054 61627 94374 164175 170255 142084 124590 146510 191408 202765 179035
$$ packed form
23444E7163M9846m6403p3062J5849k5344m0861k6316j9167K9708r791J9362j0250
23432g9266m29K7726M0311o820m483k1160J9032N5804N0519l9280q986O3332Q4314
23419A80614O2872o531l9076p5493N873L0389j9627k4685l8110m0059k4034j5581
23407c448O5925N6028m6281L7928j1805m2778p003j6797l0100P259J7108J3403
23395C9439j3207N5247O1701Q554N7795N1651j18531j31615K7556P9971m4601
23384G3960o3293o3160O057K3272k6815N0262O8607O9881n0665M3998L4341n2173
23372A14272n7837n1146K8836N7414n570q8845j8198O8658M8575j3767n2475K8839
23360E8756Q7584l5286m9427L2747O9801O080k8171j7494K1920M4898J1357k3730
$$ plain form
23348 179035 124875 69398 99686 115175 120351 71567 145634 134235 127896 93095 18127 4984
23336 4984 -15428 -10941 38673 87148 83023 62587 95928 89892 114373 118215 60541 50168 59912
23323 59912 9389 15076 105744 173813 183472 125116 156741 149659 180541 157336 174343 202356
23311 202356 127526 95000 102221 164015 131452 116932 71078 69346 55552 125475 133245 145973
23299 145973 125980 140797 105609 126887 155946 113035 106962 161916 129115 77642 76845 120627
23287 120627 144401 132018 122696 126617 109126 -3523 -80344 -37222 53987 111359 177243 124599
23275 124599 126197 142425 91867 50678 28481 -12649 58837 123933 167711 178432 191190 170286
23263 170286 199180 160464 136421 124058 87965 91144 115536 178338 144692 111014 174920 212053
$$ packed form
23348A79035n4160n5477L0288J5489N176m8784P4067j1399o339l4801p4968j3143
23336D984k0412M487M9614M8475m125k0436L3341o036K4481L842n7674j0373R744
23323E9912n0523N687R0668O8069R659n8356L1625p082L0882k3205J7007K8013
23311B02356p4830l2526P221O1794l2563j4520m5854j732j3794O9923P770J2728
23299A45973j9993J4817l5188K1278K9059m2911o073N4954l2801n1473p97M3782
23287A20627K3774j2383r322L921j7491j12649p6821M3122R1209N7372O5884n2644
23275A24599J598J6228n0558m1189k2197m1130P1486O5096M3778J0721J2758k0904
23263A70286K8894l8716k4043j2363l6093L179K4392O2802l3646l3678O3906L7133
$$ plain form
23251 212053 226236 239024 261801 259682 323481 191876 136956 212434 236668 222716 137880
23240 137880 176772 225596 211456 195135 179869 124460 70684 115325 114120 82516 71664 115533
23228 115533 130702 76347 48936 78427 120598 136576 150346 138379 117228 140571 139649 108166
23216 108166 136707 203353 239372 168751 128124 201471 248825 207764 213801 170870 172512 185531
23204 185531 228870 207530 259941 281611 227340 207216 228588 261100 274254 162950 128897
23193 128897 105349 166916 280782 244599 206898 198391 195759 203409 227396 250813 211296 229938
23181 229938 269832 259110 221997 274764 300122 250950 202422 184933 179054 192232 188250 316380
23169 316380 340233 312136 334957 257534 199811 229603 261902 152614 97339 121031 206000
$$ packed form
23251B12053J4183J2788K2777k119O3799j31605n4920P5478K4234j3952q4836
23240A37880L8892M8824j4140j6321j5266n5409n3776M4641j205l1604j0852M3869
23228A15533J5169n4355k7411K9491M2171J5978J3770j1967k1151K3343r22l1483
23216A08166K8541O6646L6019p0621m0627P3347M7354m1061O037m2931J642J3019
23204A85531M3339k1340N2411K1670n4271k0124K1372L2512J3154j11304l4053
23193A28897k3548O1567J13866l6183l7701q507k632P650K3987K3417l9517J8642
23181B29938L9894j0722l7113N2767K5358m9172m8528j7489n879J3178l982J28130
23169C16380K3853k8097K2821p7423n7723K9792L2299j09288n5275K3692Q4969
$$ plain form
23158 206000 207592 210969 223435 202304 216504 235235 139330 55202 45431 68602 37819 -1755
23146 -1755 66036 185244 183372 204636 195643 184981 244014 249264 306410 339399 294095 366077
23134 366077 413373 358253 252890 183757 198829 259317 255528 263953 226893 266683 290038 223005
23122 223005 217472 231969 152504 110691 191373 273250 249263 225101 253656 312844 299413 285769
23110 285769 253033 236679 243259 217005 251919 333408 246316 229303 237171 346317 336583 247181
23098 247181 162001 189910 194390 250677 286998 261357 239670 133333 157418 182769 226533
23087 226533 247120 205096 197095 253351 295571 288142 306474 297766 237037 191177 269632 364775
23075 364775 381046 397667 346782 350392 320603 367610 385478 357709 330756 283959 323510 343744
$$ packed form
23158B06000J592L377J2466k1131J4200J8731r5905q4128r771K3171l0783l9574
23146a755O7791J19208j872K1264q993j0662N9033N250N7146L2989m5304P1982
23134C66077M7296n5120j05363o9133J5072O0488l789Q425l7060L9790K3355o7033
23122B23005n533J4497p9465m1813Q0682Q1877k3987k4162K8555N9188j3431j3644
23110B85769l2736j6354O580k6254L4914Q1489q7092j7013P868J09146r734q9402
23098B47181q5180K7909M480N6287L6321k5641k1687j06337K4085K5351M3764
23087B26533K0587m2024q001N6256M2220p429J8332q708o0729m5860P8455R5143
23075C64775J6271J6621n0885L610k9789M7007J7868k7769k6953m6797L9551K0234
$$ plain form
23063 343744 334877 279292 268882 269210 299454 355092 312540 292364 330730 355024 420154 393628
23051 393628 331571 295988 366136 416141 380770 348990 301197 321274 296563 292686 251446 245219
23039 245219 257551 289310 315431 312541 351495 378836 431216 464838 438283 437675 434480 437546
23027 437546 429489 391192 358573 345587 360553 401453 373071 362093 329265 411136 483310 463769
23015 463769 487322 443139 388381 432660 436552 448554 504966 507825 536402 524915 460393 462320
23003 462320 494199 452196 473147 528917 538454 522774 443921 378271 373696 340764 351868 398632
22991 398632 423649 402895 403574 402829 470231 510940 482325 498053 638311 644722 676671 698450
22979 698450 623364 557171 540992 543013 482554 446014 494482 430589 371586 386025 472333 584834
$$ packed form
23063C43744q867n5585j0410L28L0244N5638m2552k0176L8366K4294O5130k6526
23051C93628o2057l5583P0148N0005l5371l1780m7793K0077k4711l877m1240o227
23039B45219J2332L1759K6121k890L8954K7341N2380L3622k6555o08l195L066
23027D37546q057l8297l2619j2986J4966M0900k8382j0978l2828Q1871P2174j9541
23015D63769K3553m4183n4758M4279L892J2002N6412K859K8577j1487o4522J927
23003D62320L1879m2003K0951N5770R537j5680p8853o5650m575l2932J1104M6764
22991C98632K5017k0754O79p45O7402M0709k8615J5728J40258O411L1949K1779
22979F98450p5086o6193j6179K021o0459l6540M8468o3893n9003J4439Q6308J12501
$$ plain form
22967 584834 581216 573612 570693 580250 603521 569192 629906 708208 719405 787018 737965 653332
22955 653332 652538 688546 786046 798460 797734 767532 704669 615754 618279 636641 611707 575358
22943 575358 547843 533895 584530 590758 574934 615856 648686 673164 691310 669604 707608 734214
22931 734214 730488 678441 666629 586500 550061 575566 631766 632202 665426 700759 728432 716458
22919 716458 680889 668009 649067 632408 662550 705355 775519 760674 751341 692517 671827 709569
22907 709569 763706 782891 801727 814496 789447 712272 770731 820340 806223 757674 726539
22896 726539 701698 715331 713318 672309 689607 743706 791540 788761 796269 833199 839943 869032
22884 869032 870969 853844 927445 931165 942283 934903 872285 867970 930422 955921 1048173 1113397
$$ packed form
22967E84834l618p604k919R557K3271l4329O0714P8302J1197O7613m9053q4633
22955F53332p94L6008R7500J2414p26l0202o2863q8915K525J8362k4934l6349
22943E75358k7515j3948N0635O228j5824M0922L2830K4478J8146k1706L8004K6606
22931G34214l726n2047j1812q0129l6439K5505N6200M36L3224L5333K7673j1974
22919G16458l5569j2880j8942j6659L0142M2805P0164j4845r333n8824k0690L7742
22907G09569N4137J9185J8836J2769k5049p7175N8459M9609j4117m8549l1135
22896G26539k4841J3633k013m1009J7298N4099M7834k779P508L6930O744K9089
22884H69032J937j7125P3601L720J1118p380o2618m315O2452K5499R2252O5224
$$ plain form
22872 1113397 1065135 1046504 1064881 1020257 994894 1052538 1091988 1102707 1094541 1123254 1110038
22861 1110038 1038980 1040342 1111592 1141646 1094652 1098587 1157744 1163781 1161221 1091858 1078092 1059011
22849 1059011 969452 976311 1011394 995066 1054369 1168519 1241321 1286708 1270957 1221879 1256393
22838 1256393 1212853 1157506 1151962 1138768 1208641 1250557 1198254 1097839 1102793 1100164 1177490 1221981
22826 1221981 1234581 1246752 1254691 1254122 1268786 1250250 1203175 1235343 1311081 1319835 1242426 1254116
22814 1254116 1188987 1164207 1248380 1310858 1395979 1366566 1366225 1368295 1443379 1480658 1499210 1465097
22802 1465097 1484608 1521648 1544224 1500274 1409764 1405841 1467312 1479919 1506971 1539034 1490405
22791 1490405 1508787 1559407 1570060 1559727 1576421 1547076 1601344 1635458 1634570 1619410 1652906 1727543
$$ packed form
22872A113397m8262j8631J8377m4624k5363N7644L9450J0719q166K8713j3216
22861A110038p1058J362P1250L0054m6994L935N9157O037k560o9363j3766j9081
22849A059011q9559O859L5083j6328N9303J14150P2802M5387j5751m9078L4514
22838A256393m3540n5347n544j3194O9873M1916n2303j00415M954k629P7326M4491
22826A221981J2600J2171P939n69J4664j8536m7075L2168P5738Q754p7409J1690
22814A254116o5129k4780Q4173O2478Q5121k9413l41K070P5084L7279J8552l4113
22802A465097J9511L7040K2576m3950r0510l923O1471J2607K7052L2063m8629
22791A490405J8382N0620J0653j0333J6694k9345N4268L4114q88j5160L3496P4637
$$ plain form
22779 1727543 1747589 1716805 1651296 1659982 1618480 1548930 1547176 1564826 1575530 1601044 1604009 1722242
22767 1722242 1814840 1907533 1924736 1938022 1929310 1985398 1931261 1901724 1906426 1896648 1895048 1934668
22755 1934668 1940979 1867895 1894259 1874620 1903167 1839977 1761758 1757838 1864021 1975311 2037435
22744 2037435 2033104 2023776 2025621 2035137 2069423 1992071 1938273 1964270 1946715 1931007 1974461 2059756
22732 2059756 2171767 2250191 2214377 2155368 2192788 2155539 2088902 2116190 2207705 2339509 2351027
22721 2351027 2275456 2268411 2316180 2329255 2402514 2325151 2272001 2257991 2282607 2302276 2299984 2352473
22709 2352473 2361306 2397718 2390245 2379262 2327016 2336089 2305831 2330935 2354673 2452011 2448900 2463935
22697 2463935 2517276 2540592 2587964 2618032 2566199 2498216 2517415 2500816 2551499 2615333 2578179
$$ packed form
22779A727543K0046l0784o5509Q686m1502o9550j754J7650J0704K5514K965J18233
22767A722242R2598R2693J7203J3286q712N6088n4137k9537M702r778j600L9620
22755A934668O311p3084K6364j9639K8547o3190p8219l920J06183J11290O2124
22744B037435m331r328J845R516L4286p7352n3798K5997j7555j5708M3454Q5295
22732B059756J12011P8424l5814n9009L7420l7249o6637K7288R1515J31804J1518
22721B351027p5571p045M7769J3075P3259p7363n3150j4010K4616J9669k292N2489
22709B352473Q833L6412p473j0983n2246R073l0258K5104K3738R7338l111J5035
22697B463935N3341K3316M7372L0068n1833o7983J9199j6599N0683O3834l7154
$$ plain form
22686 2578179 2549504 2566527 2650370 2669990 2755969 2800548 2793244 2622550 2517701 2519165 2578205
22675 2578205 2622151 2587576 2622823 2624223 2605457 2616208 2622891 2625680 2639163 2713262 2716678 2726482
22663 2726482 2731758 2740955 2745133 2684330 2642512 2701384 2723875 2722331 2727630 2806780 2737086 2687393
22651 2687393 2665943 2647325 2628129 2616503 2644301 2684592 2716840 2741476 2692720 2619052 2646273
22640 2646273 2686286 2666701 2664966 2745887 2842058 2835652 2831021 2902062 2904378 2897100 2897729 2814748 2766477
22627 2766477 2798064 2809565 2781129 2713905 2717328 2695888 2673782 2688950 2706263 2806299 2873165
22616 2873165 2922694 2967527 2928622 2884281 2905180 2868359 2813558 2826562 2871984 2797467 2815638
22605 2815638 2849400 2838287 2801283 2788570 2794838 2787728 2747799 2690860 2725796 2740602 2749740 2822505
$$ packed form
22686B578179k8675J7023Q3843J9620Q5979M4579p304j70694j04849J464N9040
22675B578205M3946l4575L5247J400j8766J0751O683K789J3483P4099L416R804
22663B726482N276R197M178o0803m1818N8872K2491j544N299P9150o9694m9693
22651B687393k1450j8618j9196j1626K7798M0291L2248K4636m8756p3668K7221
22640B646273M0013j9585j735Q0921R6171o406m631P1041K316p278O29q2981m8271
22627B766477L1587J1501k8436o7224L423k1440k2106J5168J7313J00036O6866
22616B873165M9529M4833l8905m4341K0899l6821n4801J3004M5422p4517J8171
22605B815638L3762j1113l7004j2713O268p110l9929n6939L4936J4806R138P2765
$$ plain form
22593 2822505 2769323 2708253 2675760 2627524 2684369 2781366 2784930 2787190 2743272 2693345 2661226 2620293
22581 2620293 2589058 2505261 2493878 2468674 2488117 2525361 2592068 2621940 2575311 2539373 2469264
22570 2469264 2529466 2579678 2509849 2519968 2487206 2468254 2476514 2557835 2607690 2579124 2518020
22559 2518020 2489877 2439276 2445400 2468973 2439932 2473511 2484230 2469514 2430277 2424060 2489687 2488194
22547 2488194 2415557 2424250 2458395 2429650 2353060 2384911 2326336 2168331 2095917 2138853 2169910
22536 2169910 2204151 2183655 2166269 2137091 2142723 2205115 2159190 2056745 2034362 1971353 1952825
22525 1952825 2001550 2030294 2155118 2190521 2186489 2215341 2217171 2158733 2117014 2046396 1994353
22514 1994353 1953328 1991951 2008885 1980221 1900107 1914263 1913275 1875547 1850404 1898238 1887017 1793780
$$ packed form
22593B822505n3182o1070l2493m8236N6845R6997L564K260m3918m9927l2119m0933
22581B620293l1235q3797j1383k5204J9443L7244O6707K9872m6629l5938p0109
22570B469264O0202N0212o9829J0119l2762j8952Q260Q1321M9855k8566o1104
22559B518020k8143n0601O124K3573k9041L3579J0719j4716l9237o217O5627j493
22547B488194p2637Q693L4145k8745p6590L1851n8575j58005p2414M2936L1057
22536B169910L4241k0496j7386k9178N632O2392m5925j02445k2383o3009j8528
22525A952825M8725K8744J24824L5403m032K8852J830n8438m1719p0618n2043
22514A994353m1025L8623J6934k8664q0114J4156r88l7728k5143M7834j1221r3237
$$ plain form
22502 1793780 1723690 1770942 1797556 1831875 1917995 1857259 1817588 1794560 1758930 1713289 1668747
22491 1668747 1737686 1753675 1693321 1684579 1671837 1724269 1730408 1676534 1725186 1696426 1625248 1576164
22479 1576164 1575195 1508631 1410753 1422291 1461330 1505720 1547240 1524177 1566893 1575649 1537671 1482435
22467 1482435 1397661 1308082 1355333 1355765 1371535 1389132 1396483 1464917 1496347 1567089 1551945 1492291
22455 1492291 1426131 1408297 1438321 1458908 1427729 1393326 1380848 1390449 1326032 1264411 1220746
22444 1220746 1293066 1253300 1222461 1322478 1324766 1339246 1294810 1290623 1246166 1219546 1263007
22433 1263007 1229499 1229013 1246921 1220085 1243416 1311118 1264766 1263877 1244782 1222032 1195690 1145731
22421 1145731 1134092 1134808 1167866 1183358 1188423 1139043 1097884 1039347 1088169 1177976 1193424 1205602
$$ packed form
22502A793780p0090M7252K6614L4319Q6120o0736l9671k3028l5630m5641m4542
22491A668747O8939J5989o0354q742j2742N2432O139n3874M8652k8760p1178m9084
22479A576164r69o6564r7878J1538L9039M4390M1520k3063M2716Q756l7978n5236
22467A482435q4774q9579M7251M32J5770J7597P351O8434L1430P0742j5144n9654
22455A492291o6160j7834L0024K0587l1179l4403j2478R601o4417o1621m3665
22444A220746P2320l9766l0839J00017K288J4480m4436m187m4457k6620M3461
22433A263007l3508m86J7908k6836K3331O7702m6352q89j9095k2750k6342m9959
22421A145731j1639P16L3058J5492N065m9380m1159n8537M8822Q9807J5448J2178
$$ plain form
22409 1205602 1139588 1091058 1125601 1116966 1063036 1051669 1012273 968657 943730 1005073 981468
22398 981468 956294 961261 1044979 1131161 1129471 1078703 1100622 1143702 1109198 1023638 987860 981990
22386 981990 937959 943619 976826 908290 863120 923423 961622 937018 914297 927601 870201 866915
22374 866915 914331 988296 978795 898012 907791 964121 965508 958212 939128 1002150 1020107 1017565
22362 1017565 928027 818748 765046 806152 808215 827675 789062 772535 746863 740192 806608
22351 806608 818186 795938 784168 782878 815519 819376 803732 858474 871903 796847 746863 717026
22339 717026 738867 749246 784951 807450 880051 792531 743938 740517 750263 673918 643942 681169
22327 681169 644953 664177 694125 705554 751979 688953 694316 670582 711683 668008 529434
$$ packed form
22409A205602o6014m8530L4543q635n3930j1367l9396m3616k4927O1343k3605
22398I81468k5174M967Q3718Q6182j690n0768K1919M3080l4504q5560l5778n870
22386I81990m4031N660L3207o8536m5170O0303L8199k4604k2721J3304n7400l286
22374H66915M7416P3965r501q0783R779N6330J387p296j9084O3022J7957k542
22362A017565q9538j09279n3702M1106K063J9460l8613j6527k5672o671O6416
22351H06608J1578k2248j1770j290L2641L857j5644N4742J3429p5056m9984k9837
22339G17026K1841J0379L5705K2499P2601q7520m8593l421R746p6345k9976L7227
22327F81169l6216J9224K9948J1429M6425o3026N363k3734M1101m3675j38574
$$ plain form
22316 529434 530455 616674 632450 605767 550455 570364 612073 666706 652888 643338 679536 612387
22304 612387 557968 547590 560197 581563 627491 714266 693716 566154 527801 537901 578917
22293 578917 619254 580072 488514 540902 571372 564279 565124 645401 676507 686805 647745 657487
22281 657487 691370 677819 647359 665680 671361 562572 539291 580359 620755 558821 538102
22270 538102 486199 479646 591795 633075 611465 539632 450682 464132 491387 555943 608248
22259 608248 579625 466332 454986 484619 485886 430391 424897 475872 500642 474751 427670 429936
22247 429936 457718 476875 465354 444893 403463 407830 486506 485803 492974 460806 370028 303840
22235 303840 345699 338107 314187 340120 376574 415538 515185 482014 437078 408850 406705 400990
$$ packed form
22316E29434J021Q6219J5776k6683n5312J9909M1709N4633j3818r550L6198o7149
22304F12387n4419j0378J2607K1366M5928Q6775k0550j27562l8353J0100M1016
22293E78917M0337l9182r1558N2388L0470p093Q45Q0277L1106J0298l9060R742
22281F57487L3883j3551l0460J8321N681j08789k3281M1068M0396o1934k0719
22270E38102n1903o553J12149M1280k1610p1833q8950J3450K7255O4556N2305
22259F08248k8623j13293j1346K9633J267n5495n494N0975K4770k5891m7081K266
22247D29936K7782J9157j1521k0461m1430M367P8676p03P171l2168r0778o6188
22235C03840M1859p592k3920K5933L6454L8964R9647l3171m4936k8228k145n715
$$ plain form
22223 400990 397033 408633 454385 429468 377552 403729 468030 421104 335644 319759 348207 371531
22211 371531 385790 417079 493852 451310 425758 467308 532711 441278 402700 391228 413438
22200 413438 397501 313741 316484 273143 294647 285343 260838 251774 273762 403148 368392 384751
22188 384751 379150 250219 216256 231690 257052 292766 294510 294803 291447 274266 328131 403876
22176 403876 372779 401915 411344 452027 496902 437099 386213 405094 389119 439263 417696 295091
22164 295091 254410 221750 273284 325590 307163 236489 158440 165826 231273 230799 251336 257494
22152 257494 312384 274271 260985 262601 238218 241660 271550 278759 309661 369197 367054 301911
22140 301911 253721 246242 214874 198399 250322 295324 371015 354263 265794 227651 195557 199786
$$ packed form
22223D00990l957J1600M5752k4917n1916K6177O4301m6926q5460j5885K8448K3324
22211C71531J4259L1289P6773m2542k5552M1550O5403r1433l8578j1472K2210
22200D13438j5937q3760K743m3341K1504r304k4505r064K1988J29386l4756J6359
22188C84751n601j28931l3963J5434K5362L5714J744K93l356j7181N3865P5745
22176D03876l1097K9136R429M0683M4875n9803n0886J8881j5975N0144k1567j22605
22164B95091m0681l2660N1534N2306j8427p0674p8049P386O5447m74K0537O158
22152B57494N4890l8113j3286J616k4383L442K9890P209L0902N9536k143o5143
22140C01911m8190p479l1368j6475N1923M5002P5691j6752q8469l8143l2094M229
$$ plain form
22128 199786 186996 171529 137183 78059 52238 126916 169075 226579 291221 330933 298715
22117 298715 225544 240725 184454 228353 293144 254159 256271 247718 259949 242861 291497 236429
22105 236429 107980 89922 143201 147765 208921 290379 335737 252289 166579 188784 197888 175240
22093 175240 260215 274105 314052 338189 270223 272991 324883 301237 274930 221377 219902 263620
22081 263620 246391 200698 141467 170450 133264 188123 190865 128873 249903 313096 248722
22070 248722 181173 160628 251788 279198 196169 108479 112847 124854 95031 83708 149068 246555
22058 246555 292424 290948 236094 168354 133671 184212 230947 152019 168618 152537 141094 136985
22046 136985 153323 187679 230607 188679 190227 184487 133212 142872 183355 194265 202063 142082
$$ packed form
22128A99786j2790j5467l4346n9124k5821P4678M2159N7504O4642L9712l2218
22117B98715p3171J5181n6271M3899O4791l8985K112q553J2231j7088M8636n5068
22105B36429j28449j8058N3279M564O1156Q1458M5358q3448q5710K2205R104k2648
22093A75240Q4975J3890L9947K4137o7966K768N1892k3646k6307n3553j475M3718
22081B63620j7229m5693n9231K8983l7186N4859K742o1992J21030O3193o4374
22070B48722o7549k0545R1160K7410q3029q7690M368J2007k9823j1323O5360R7487
22058B46555M5869j476n4854o7740l4683N0541M6735p8928J6599j6081j1443m109
22046A36985J6338L4356M2928m1928J548n740n1275R660M0483J0910P798n9981
$$ plain form
22034 142082 157903 263179 324105 280924 180587 110914 67528 63428 55712 121854 173274
22023 173274 195213 153091 107858 91815 150467 170742 213199 256988 226028 189796 203559
22012 203559 230578 184506 79926 106270 172364 265266 347790 336634 238428 142195 141209 156498
22000 156498 147064 127726 102720 89788 187528 202287 168417 188119 166145 201691 169798 97488
21988 97488 -22479 -95755 -128669 -49725 60072 91260 50508 -17202 102238 181358 209934
21977 209934 237899 238003 234540 252428 176834 138661 126286 8325 59022 155217 149079 169989
21965 169989 183669 152582 141594 119287 108249 147527 175087 176848 117888 72873 37626 27336
21953 27336 63880 174890 247318 174238 103699 63562 85917 87568 53041 35378 -25842 -687
$$ packed form
22034A42082J5821J05276O0926m3181j00337o9673m3386m100p716O6142N1420
22023A73274K1939m2122m5233j6043N8652K0275M2457M3789l0960l6232J3763
22012B03559K7019m6072j04580K6344O6094R2902Q2524j1156r8206r6233r86J5289
22000A56498r434j9338k5006j2932R7740J4759l3870J9702k1974L5546l1893p2310
21988I7488j19967p3276l2914P8944J09797L1188m0752o7710J19440P9120K8576
21977B09934K7965J04l463J7888p5594l8173j2375j17961N0697R6195o138K0910
21965A69989J3680l1087j0988k2307j1038L9278K7560J761n8960m5015l5247j0290
21953B7336L6544J11010P2428p3080p0539m0137K2355J651l4527j7663o1220K5155
$$ plain form
21941 -687 35903 4095 23952 -8666 -4661 77898 103208 85618 108475 117252 115084 109889 83972
21928 83972 115584 118712 171327 173907 138038 110276 74142 48736 76609 103070 87304 77178
21916 77178 24271 62436 80566 89637 163142 166749 183258 158294 66819 64300 97173 121981
21904 121981 134724 130122 86121 86141 124769 169286 115460 83856 65794 74600 70079 46197 72291
21891 72291 30689 17907 123390 148891 116249 145709 120360 98225 61663 66642 55629 9461
21879 9461 -30291 -52081 -35959 -16457 -12151 13603 -7287 26752 23559 57937 45199 52944
21867 52944 63782 29985 31513 19860 -6939 41144 26145 -29300 -8451 -48024 -133625 -109925
21855 -109925 -41551 27882 24994 -17929 2924 32032 56736 146012 111318 71442 -28091 -20259
$$ packed form
21941f87L6590l1808J9857l2618M005Q2559K5310j7590K2857Q777k168n195k5917
21928H3972L1612L128N2615K580l5869k7762l6134k5406K7873K6461j5766j0126
21916G7178n2907L8165J8130R071P3505L607J6509k4964r1475k519L2873K4808
21904A21981J2743m602m4001K0L8628M4517n3826l1604j8062Q806m521k3882K6094
21891G2291m1602j2782J05483K5501l2642K9460k5349k2135l6562M979j1013m6168
21879I461l9752k1790J6122J9502M306K5754k0890L4039l193L4378j2738P745
21867E2944J0838l3797J528j1653k6799M8083j4999n5445K0849l9573q5601K3700
21855a09925O8374O9433k888m2923K0853K9108K4704Q9276l4694l9876r9533P832
$$ plain form
21843 -20259 23688 77082 42013 3034 40313 72110 83996 152956 224030 262894 185557 197311
21831 197311 154313 54629 35507 115776 193812 154214 159048 152865 102057 30439 -39592 -49731
21819 -49731 34188 54327 -2366 -87469 -117589 -150772 -122979 -94005 -83374 3864 36838 36366
21807 36366 40796 55378 124965 136597 60461 22645 48755 132876 169913 60579 23692 -13639
21795 -13639 -62201 15313 -9703 -20671 2579 24146 -17936 -36443 -55553 3884 64295 63034
21783 63034 -35366 -68011 -69208 -46018 -95856 -111868 -33433 41854 13842 -35594 48134 70071
21771 70071 71125 47451 -30368 -25838 -36329 -8845 -7633 -53368 -52706 -36026 -38681 -5812 41657
21758 41657 28705 21340 15125 -8005 -24196 20248 98308 102680 83845 117032 78225 92417
$$ packed form
21843b0259M3947N3394l5069l8979L7279L1797J1886O8960P1074L8864p7337J1754
21831A97311m2998r9684j9122Q0269P8036l9598M834o183n0808p1618p0031j0139
21819d9731Q3919K0139n6693q5103l0120l3183K7793K8974J0631Q7238L2974m72
21807C6366M430J4582O9587J1632p6136l7816K6110Q4121L7037j09334l6887l7331
21795a3639m8562P7514k5016j0968K3250K1567m2082j8507j9110N9437O0411j261
21783F3034r8400l2645j197K3190m9838j6012P8435P5287k8012m9436Q3728K1937
21771G0071J054k3674p7819M530j0491K7484J212m5735O62J6680k655L2869M7469
21758D1657j2952p365o215k3130j6191M4444P8060M372j8835L3187l8807J4192
$$ plain form
21746 92417 11313 -36091 -32726 -50768 -43030 -27656 -15624 19969 39702 15407 -7576 48811
21734 48811 31403 -2465 6380 48595 12815 1118 -29106 -14954 67492 100879 100926 72049
21722 72049 -5493 -92392 -130625 -109726 -21963 -20397 -63930 -142003 -98788 70996 196223
21711 196223 149896 90906 90479 111082 105606 96515 53736 79246 36516 -31702 -109892 -64175
21699 -64175 47010 89707 39837 -18433 58403 159464 105116 48553 17509 -10865 -34708
21688 -34708 -67955 -60018 -96657 -93042 -61582 35154 13358 -9797 -44838 -83075 -122451 -82800
21676 -82800 -68196 -36588 50828 83580 5210 -5881 -7794 -41721 -77784 -107641 -52039 -28811
21664 -28811 -51628 -51904 -46643 -13809 -48564 6270 142689 95141 -17738 -85139 -65643 -67654
$$ packed form
21746I2417q1104m7404L365j8042P738J5374J2032L5593J9733k4295k2983N6387
21734D8811j7408l3868Q845M2215l5780j1697l0224J4152Q2446L3387M7k8877
21722G2049p7542q6899l8233K0899Q7763J566m3533p8073M3215J69784J25227
21711A96223m6327n8990m27K0603n476r091m2779K5510m2730o8218p8190M5717
21699f4175J11185M2697m9870n8270P6836J01061n4348n6563l1044k8374k3843
21688c4708l3247P937l6639L615L1460R6736k1796k3155l5041l8237l9376L9651
21676h2800J4604L1608Q7416L2752p8370j1091j913l3927l6063k9857N5602K3228
21664b8811k2817k76N261L2834l4755N4834J36419m7548j12879o7401J9496k011
$$ plain form
21652 -67654 -51369 -64485 -89736 -48931 10943 36868 23016 -20775 -4893 39252 20613 51228
21640 51228 65473 80515 82091 92247 68247 -4838 914 106337 183256 144060 115857 89387
21628 89387 76585 3394 42155 157006 175436 149535 198978 213352 127238 52907 74168
21617 74168 87629 96098 66586 -2729 21184 -12898 -63014 -66487 -48799 -28602 -10687 -10884
21605 -10884 36248 80009 94001 78428 35380 -51602 -71690 -85682 -30693 -60398 -58524 -58743
21593 -58743 -104739 -99764 -136107 -123106 -128334 -112818 -99279 -36147 25723 16242 2587 27845
21581 27845 53296 46178 12257 87024 109804 59914 67850 61025 128309 118410 65220 19689
21569 19689 13617 -27137 -30955 -54552 -68623 -37421 -14332 -62313 -113869 -128859 -87734 -26588
$$ packed form
21652f7654J6285j3116k5251M0805N9874K5925j3852m3791J5882M4145j8639L0615
21640E1228J4245J5042J576J0156k4000p3085N752J05423P6919l9196k8203k6470
21628H9387j2802p3191L8761J14851J8430k5901M9443J4374q6114p4331K1261
21617G4168J3461Q469k9512o9315K3913l4082n0116l473J7688K0197J7915j97
21605a0884M7132M3761J3992j5573m3048q6982k0088j3992N4989k9705J874k19
21593e8743m5996M975l6343J3001n228J5516J3539O3132O1870r481j3655K5258
21581B7845K5451p118l3921P4767K2780m9890P936o825O7284r899n3190m5531
21569A9689o072m0754l818k3597j4071L1202K3089m7981n1556j4990M1125O1146
$$ plain form
21557 -26588 -47262 -85500 -35454 -56814 -90589 -103469 -116297 -138532 -127886 -140300 -66759 32266
21545 32266 65663 93683 36512 -33527 -21118 46152 -21372 -84596 -85451 -63216 -99096 -85158
21533 -85158 -62054 -70614 -46051 -10844 -6212 -41852 -126934 -212184 -156454 -117725 -44937 -11623
21521 -11623 16557 21601 -44233 -52262 -8258 19373 -25790 -43406 -113527 -174360 -111604 -55882
21509 -55882 -30288 274 13356 -28844 -402 16020 -51879 -95210 -103638 -84160 -73324 -95004
21497 -95004 -72658 -39565 -70572 -26710 12063 12927 7552 20151 -40842 -89120 -62061 -25400
21485 -25400 30091 21562 -19750 31369 33691 36212 73326 -12668 -16710 8063 13412 -35938 -23769
21472 -23769 -11277 3535 48944 79337 75502 -2502 35689 29561 -6644 -43402 -41108 -58485
$$ packed form
21557b6588k0674l8238N0046k1360l3775j2880j2828k2235J0646j2414P3541R9025
21545C2266L3397K8020n7171p0039J2409O7270o7524o3224q55K2235l5880J3938
21533h5158K3104q560K4563L5207M632l5640q5082q5250N5730L8729P2788L3314
21521a1623K8180N044o5834q029M4004K7631m5163j7616p0121o0833O2756N5722
21509e5882K5594L0562J3082m2200K8442J6422o7899m3331q428J9478J0836k1680
21497i5004K2346L3093l1007M3862L8773Q64n375J2599o0993m8278K7059L6661
21485b5400N5491q529m1312N1119K322K521L7114q5994m042K4773N349m9350J2169
21472b3769J2492J4812M5409L0393l835p8004L8191o128l6205l6758K294j7377
$$ plain form
21460 -58485 -33899 -45384 -50354 -95195 -113617 -75030 -52555 -79193 -43407 -50373 -43960 -24574
21448 -24574 -33972 -90419 -152937 -215235 -247759 -161115 -189244 -155072 -97065 -165602 -261277 -182749
21436 -182749 -27498 -13654 -78679 -105134 -79956 -37674 -12073 -29999 -45181 -5517 34673
21425 34673 74423 16145 18061 2211 -7935 36570 -25336 -68611 16953 122591 81549 26160
21413 26160 -47154 -98027 -177876 -159011 -106426 -24780 -52817 -72491 -81960 -30013 44600 68273
21401 68273 58274 29709 -4863 -41601 -46880 8470 -2307 5955 32364 -619 -41222 -23044
21389 -23044 38269 20513 -46554 -102208 -40480 26957 849 7679 37487 -304 4504 -24953
21377 -24953 -53902 -93767 -68130 -76208 22058 98259 149826 110865 158420 180008 181542 47618
$$ packed form
21460e8485K4586j1485m970m4841j8422L8587K2475k6638L5786o966O413J9386
21448b4574r398n6447o2518o2298l2524Q6644k8129L4172N8007o8537r5675P8528
21436a82749J55251J3844o5025k6455K5178M2282K5601j7926j5182L9664M0190
21425C4673L9750n8278J916j5850j0146M4505o1906m3275Q5564J05638m1042n5389
21413B6160p3314n0873p9849J8865N2585Q1646k8037j9674r469N1947P4613K3673
21401F8273r999k8565l4572l6738n279N5350j0777Q262K6409l2983m0603J8178
21389b3044O1313j7756o7067n5654O1728O7437k6108O830K9808l7791M808k9457
21377b4953k8949l9865K5637q078R8266P6201N1567l8961M7555K1588J534j33924
$$ plain form
21365 47618 -51102 -60029 -69496 -70289 -43713 -75786 -52695 -21599 -61944 -53779 -27163 -66290 -136651
21352 -136651 -99788 -80147 -71536 -73217 -51793 -20662 -39615 -46720 -5804 65410 44645 16622
21340 16622 32669 38602 20604 4779 -11617 -36974 -47480 -122151 -87200 -26792 -12258 -21322
21328 -21322 -41668 -70426 -79244 -58718 -24794 3000 24623 -3431 30914 14255 -19642 70319
21316 70319 71978 -25646 -62589 -101784 -81950 -5180 -75894 -53556 27218 81494 110481 136804
21304 136804 102687 90062 52686 -11667 -17235 -19423 -19795 -7463 21442 55353 57741 25363
21292 25363 -93659 -84975 -86614 -98767 -182485 -160457 -87612 -49581 -76391 -114780 -142609 -58306
21280 -58306 -7039 25231 23474 24553 -19216 -43192 1547 32525 21646 59496 32219 46322
$$ packed form
21365D7618r8720q927r467p93K6576l2073K3091L1096m0345Q165K6616l9127p0361
21352a36651L6863J9641Q611j681K1424L1131j8953p105M0916P1214k0765k8023
21340A6622J6047N933j7998j5825j6396k5357j0506p4671L4951O0408J4534r064
21328b1322k0346k8758q818K0526L3924K7794K1623k8054L4345j6659l3897Q9961
21316G0319J659r7624l6943l9195J9834P6770p0714K2338Q0774N4276K8987K6323
21304A36804l4117j2625l7376o4353n568k188l72J2332K8905L3911K388l2378
21292B5363j19022Q684j639j2153q3718K2028P2845L8031k6810l8389k7829Q4303
21280e8306N1267L2270j757J079m3769k3976M4739L0978j0879L7850k7277J4103
$$ plain form
21268 46322 -37612 25921 93378 146739 124075 10364 -101421 -130991 -107463 -100149 -108328 -121680
21256 -121680 -105465 -64423 -72449 12373 101982 51949 55017 53113 -19421 -6052 7029 35572
21244 35572 74816 148055 114326 86191 166814 169248 117528 119059 153014 197687 212446 194463
21232 194463 178280 226835 282593 308617 272340 277775 339931 474341 590066 738494 779298
21221 779298 748709 795239 928793 1046067 1189068 1389419 1577396 1599716 1507492 1481213
21211 1481213 1551195 1585372 1666984 1724485 1616290 1541303 1510858 1451875 1448781 1484558 1428808
21200 1428808 1387440 1409511 1371442 1311615 1243407 1110075 1018978 941531 947499 878318 834264
21189 834264 952826 1071877 1172520 1274234 1366205 1355809 1376185 1423248 1384348 1412444 1447607
$$ packed form
21268D6322q3934O3533O7457N3361k2664j13711j11785k9570K3528P314q179j3352
21256a21680J6215M1042q026Q4822Q9609n0033L068j904p2534J3369J3081K8543
21244C5572L9244P3239l3729k8135Q0623K434n1720J531L3955M4673J4759j7983
21232A94463j6183M8555N5758K6024l6277N435O2156J34410J15725J48428M0804
21221G79298l0589M6530J33554J17274J43001K00351J87977K2320r2224k6279
21211A481213O9982L4177Q1612N7501j08195p4987l0445n8983l094L5777n5750
21200A428808m1368K2071l8069n9827o8208j33332r1097p7447N968o9181m4054
21189H34264J18562J19051J00643J01714R1971j0396K0376M7063l8900K8096L5163
$$ plain form
21178 1447607 1505567 1478020 1477219 1426110 1378624 1341237 1242125 1148811 1083863 1079727 967471 883340
21166 883340 631178 472582 441147 327515 163658 160259 135670 23987 79847 118747 95689
21155 95689 49310 36999 47942 82318 94239 82344 98409 102126 96717 53558 57241 101636
21143 101636 131601 108077 157943 134465 11142 -16751 28964 9786 -23137 9757 -14702
21132 -14702 -8157 5226 34435 63595 77275 35244 -38958 -17840 -66076 -148366 -103458 -50205
21120 -50205 -23697 92814 77580 3091 37360 45602 68979 75251 99686 28397 -25648 -26761
21108 -26761 26026 75926 34954 -46103 -68262 -51050 -65858 -17495 -16910 -59012 -5803 1994
21096 1994 -60259 27681 93479 -1674 -32083 36640 39610 48066 78855 13713 -12228 6955
$$ packed form
21178A447607N7960k7547q01n1109m7486l7387r9112r3314o4948m136j12256q4131
21166H83340k52162j58596l1435j13632j63857l399k4589j11683N5860L8900k3058
21155I5689m6379j2311J0943L4376J1921j1895J6065L717n409m3159L683M4395
21143A01636K9965k3524M9866k3478j23323k7893M5715j9178l2923L2894k4459
21132a4702O545J3383K9209K9160J3680m2031p4202K1118m8236q2290M4908N3253
21120e0205K6508J16511j5234p4489L4269Q242K3377O272K4435p1289n4045j113
21108b6761N2787M9900m0972q1057k2159J7212j4808M8363N85m2102N3209P797
21096A994o2253Q7940O5798r5153l0409O8723K970Q456L0789o5142k5941J9183
$$ plain form
21084 6955 35709 19127 17420 107031 134016 111049 40950 28081 28887 -13953 -62562 -64193 -64642
21071 -64642 -316 65361 106327 63946 50413 16576 -48420 -57409 -133119 -148980 -119413 -44251
21059 -44251 22936 41345 -36332 -117027 -138427 -124072 -111953 -83594 -93191 -73114 -40369 -2857
21047 -2857 30759 -52069 -165267 -126187 14587 38858 16779 37195 59431 45237 7643
21036 7643 71471 130232 113056 35268 7448 -40039 -72862 -81733 -66886 -65998 -91684 -102520
21024 -102520 -105579 -52006 -17821 -47975 -28450 -5637 -10980 -13330 -73866 -89360 -60025 -69594
21012 -69594 -61434 -22799 -23423 -56188 -78149 -43599 -55469 -53059 10291 27958 -12983 -46573
21000 -46573 -85366 -95728 -175551 -132820 -28185 -8385 51696 26781 32907 25189 23328 27915
$$ packed form
21084F955K8754j6582j707Q9611K6985k2967p0099j2869Q06m2840m8609j631m49
21071f4642O4326O5677M0966m2381j3533l3837o4996q989p5710j5861K9567P5162
21059d4251O7187J8409p7677q0695k1400J4355J2119K8359r597K0077L2745L7512
21047b857L3616q2828j13198L9080J40774K4271k2079K0416K2236j4194l7594
21036G643O3828N8761j7176p7788k7820m7487l2823q871J4847Q88k5686j0836
21024a02520l059N3573L4185l0154J9525K2813n343k350o0536j5494K9335r569
21012f9594Q160L8635o24l2765k1961L4550j1870K410O3350J7667m0941l3590
21000d6573l8793j0362p9823M2731J04635J9800O0081k4915O126p718j861M587
$$ plain form
20988 27915 15485 56597 53506 13803 15295 2266 -27690 -78319 -76168 -63650 -58419 -5454
20976 -5454 -49144 -103333 -108732 -83464 4460 32531 11394 59517 65027 133960 118590 31092
20964 31092 20367 -4742 -35005 63105 111834 155639 131299 59326 49042 -16552 -37485 -48586
20952 -48586 -48883 24116 76859 38731 88227 192248 266938 286277 302968 260449 190869 216159
20940 216159 266867 209988 210954 158626 126521 149977 119386 137955 181179 90995 66965 170784
20928 170784 199480 179225 126387 122527 134647 155636 160503 141212 98406 102712 120055 191226
20916 191226 198260 267233 282500 200443 182014 218588 239608 232325 246477 273436 217615 250865
20904 250865 250965 241661 321491 382347 408536 374425 272138 236918 294347 292377 254562 190697
$$ packed form
20988B7915j2430M1112l091l9703J492j3029k9956n0629K151J2518N231N2965
20976e454m3690n4189n399K5268Q7924K8071k1137M8123N510O8933j5370q7498
20964C1092j0725k5109l0263R8110M8729M3805k4340p1973j0284o5594k0933j1101
20952d8586k97P2999N2743l8128M9496J04021P4690J9339J6691m2519o9580K5290
20940B16159N0708n6879R66n2328l2105K3456l0591J8569M3224r0184k4030J03819
20928A70784K8696k0255n2838l860J2120K0989M867j9291m2806M306J7343P1171
20916A91226P034O8973J5267q2057j8429L6574K1020p283J4152K6959n5821L3250
20904B50865J00r304P9830O0856K6189l4111j02287l5220N7429j970l7815o3865
$$ plain form
20892 190697 168569 165652 210559 235266 200657 102203 13330 -9069 6388 49171 114324 144322
20880 144322 156292 164286 103089 144114 174003 132417 64600 50523 52474 79559 118606 20632
20868 20632 -45036 -27590 88805 101559 128868 111993 72684 123489 173074 167496 103662 135765
20856 135765 181576 195228 191341 132908 62098 11468 40941 84388 82485 119637 92150 164
20844 164 16194 79421 86262 96573 94136 97905 69068 102461 182170 115128 76511 96062 144865
20831 144865 145313 55726 52046 69309 59093 131126 214699 218487 141327 130060 173586 238225
20819 238225 218591 233904 223236 224741 272762 285950 325286 384997 367745 271267 184433 208752
20807 208752 183278 212489 242579 200586 149596 124941 193060 269132 293156 339423 383240
$$ packed form
20892A90697k2128k917M4907K4707l4609r8454q8873k2399J5457M2783O5153K9998
20880A44322J1970P994o1197M1025K9889m1586o7817j4077J951K7085L9047r7974
20868B0632o5668J7446J16395J2754K7309j6875l9309N0805M9585n578o3834L2103
20856A35765M5811J3652l887n8433p0810n0630K9473M3447j903L7152k7487r1986
20844A64J6030O3227O841J0311k437L769k8837L3393P9709o7042l8617J9551M8803
20831A44865M48q9587l680J7263j0216P2033Q3573L788p7160j1267M3526O4639
20819B38225j9634J5313j0668J505M8021J3188L9336N9711j7252r6478q6834K4319
20807B08752k5474K9211L0090m1993n0990k4655O8119P6072K4024M6267M3817
$$ plain form
20796 383240 384846 326495 282012 256672 345077 377726 424239 460450 401730 315991 307260 333897
20784 333897 386355 475782 530625 530595 465835 401427 487011 534947 571735 589248 660213 635093
20772 635093 547708 582872 580381 555077 506766 460231 452651 517282 467778 480331 502786 538780
20760 538780 525626 576489 658737 667132 642517 690153 759304 812125 844484 837211 783690 799596
20748 799596 810446 761581 720291 757310 819847 833786 878176 873202 862967 828394 809503 735679
20736 735679 749580 770203 719577 724584 802435 813841 879356 936911 1048583 1111010 1097301
20725 1097301 1081643 974824 1048990 1102096 1024165 1039697 1124365 1186527 1213245 1280364 1319506
20714 1319506 1361690 1344558 1471436 1544901 1582074 1643884 1674617 1719228 1843598 1881007 1966746
$$ packed form
20796C83240J606n8351m4483k5340Q8405L2649M6513L6211n8720q5739q731K6637
20784C33897N2458Q9427N4843l0o4760o4408Q5584M7936L6788J7513P0965k5120
20772F35093q7385L5164k491k5304m8311m6535p580O4631m9504J2553K2455L5994
20760E38780j3154N0863Q2248Q395k4615M7636O9151N2821L2359p273n3521J5906
20748G99596J0850m8865m1290L7019O2537J3939M4390m974j0235l4573j8891p3824
20736G35679J3901K0623n0626N007P7851J1406O5515N7555J11672O2427j3709
20725A097301j5658j06819P4166N3106p7931J5532Q4668O2162K6718O7119L9142
20714A319506M2184j7132J26878P3465L7173O1810L0733M4611J24370L7409Q5739
$$ plain form
20703 1966746 2105261 2189354 2269381 2381782 2560414 2765386 2871716 3055797 3216832 3316653
20693 3316653 3472592 3737923 4004730 4211687 4461099 4699138 5020017 5478074 5958915
20684 5958915 6415061 6974953 7545513 8142925 8848663 9770104 10788213 11781217 12897722
20675 12897722 13940308 14976872 16102345 17434977 18907880 20461610 22152457 23824943
20667 23824943 25701641 27736079 29801644 31893960 34105509 36613060 39412653 42302123
20659 42302123 45390464 48614375 52285061 56550358 61725157 67773125 74678373 82105208
20651 82105208 89856300 98097800 107233619 117642600 129721041 144125123 161897672
20644 161897672 183901817 209975034 237990762 262347629 273545360 266626943 258245110
$$ packed form
20703A966746J38515Q4093Q0027J12401J78632K04972J06330J84081J61035R9821
20693C316653J55939K65331K66807K06957K49412K38039L20879M58057M80841
20684E958915M56146N59892N70560N97412P05738R21441J018109R93004J116505
20675A2897722J042586J036564J125473J332632J472903J553730J690847J672486
20667B3824943J876698K034438K065565K092316K211549K507551K799593K889470
20659D2302123L088341L223911L670686M265297N174799O047968O905248P426835
20651H2105208P751092Q241500R135819J0408981J2078441J4404082J7772549
20644A61897672K2004145K6073217K8015728K4356867J1197731o918417q381833
$$ plain form
20637 258245110 262412507 275756715 287986371 286581619 270774343 260520094 263903420
20630 263903420 272255496 271871399 253628315 233414384 227599426 232317056 236209740 225447584
20622 225447584 196089269 167540927 151710836 145996332 146707289 152027108 161609588 175903012
20614 175903012 195190364 218858885 244842394 267081191 275866763 266381131 255804108
20607 255804108 258543298 270450966 280775875 276185284 255610877 240931630 240648745
20600 240648745 245403875 241312807 219816703 195960011 185350408 184242808 181241004
20593 181241004 162544920 124839688 87750769 63269990 48520414 39096311 32618345
20586 32618345 27905286 24381788 21884539 19881402 18220648 16897768 15799466 14930743
$$ packed form
20637B58245110M167397J3344208J2229656j404752j5807276j0254249L383326
20630B63903420Q352076l84097j8243084k0213931n814958M717630L892684j0762156
20622B25447584k9358315k8548342j5830091n714504P10957N319819R582480J4293424
20614A75903012J9287352K3668521K5983509K2238797Q785572r485632j0577023
20607B55804108K739190J1907668J0324909m590591k0574407j4679247k82885
20600B40648745M755130m091068k1496104k3856692j0609603j107600l001804
20593A81241004j8696084l7705232l7088919k4480779j4749576r424103o477966
20586C2618345m713059l523498k497249k003137j660754j322880j098302q68723
$$ plain form
20578 14930743 14271193 13699714 13163749 12564167 11878484 11161628 10582021 10012800 9508344
20569 9508344 9096005 8691252 8240322 7798885 7479943 7189293 6803311 6346853 6001174
20560 6001174 5735174 5479696 5215613 4838131 4426281 3925687 3592503 3383176 3195708
20551 3195708 3015451 2899559 2805382 2795858 2769742 2637131 2498657 2388106 2267763 2125499
20541 2125499 2011720 1995659 1969400 1918525 1901227 1830307 1748659 1751525 1737283 1727958 1654436
20530 1654436 1580851 1611789 1619569 1603183 1533209 1493114 1452084 1367450 1337998 1318517 1250970
20519 1250970 1245601 1209493 1143031 1184270 1144994 1094933 1112817 1058789 980157 969566 974210 923557
20507 923557 949265 1015016 998505 897164 788626 789283 820836 897838 897724 870272 781933 726897
$$ packed form
20578A4930743o59550n71479n35965n99582o85683p16856n79607n69221n04456
20569I508344m12339m04753m50930m41437l18942k90650l85982m56458l45679
20560F001174k66000k55478k64083l77482m11850n00594l33184k09327j87468
20551C195708j80257j15892r4177r524k6116j32611j38474j10551j20343j42264
20541B125499j13779j6061k6259n0875j7298p0920q1648K866j4242r325p3522
20530A654436p3585L0938P780j6386o9974m0095m1030q4634k9452j9481o7547
20519A250970n369l6108o6462M1239l9276n0061J7884n4028p8632j0591M644n0653
20507I23557K5708O5751j6511j01341j08538O57L1553P7002j14k7452q8339n5036
$$ plain form
20495 726897 640977 565534 531093 590968 639577 658300 649134 562190 547570 614614 670773 658034
20483 658034 643623 593390 552348 517546 605131 694365 745526 701876 715972 711027 710734 683306
20471 683306 676646 749921 753979 746142 801969 841695 716618 619369 608355 539175 494388 524660
20459 524660 476712 389975 467811 641123 709992 690789 808927 812764 758831 763845 732691
20448 732691 770833 823711 910630 967437 1044525 1185591 1320887 1429853 1490738 1483125 1446479
20437 1446479 1419116 1451228 1531277 1494457 1509979 1561023 1534465 1478553 1413729 1338259 1325159
20426 1325159 1330436 1316710 1194584 1098012 1128984 1123052 1077725 976951 918099 904394 913768
20415 913768 951977 944479 1018854 1036522 1077255 1183205 1263798 1258468 1270460 1252687 1166298 1201591
$$ packed form
20495G26897q5920p5443l4441N9875M8609J8723r166q6944j4620O7044N6159j2739
20483F58034j4411n0233m1042l4802Q7585Q9234N1161m3650J4096m945k93k7428
20471F83306o660P3275M058p837N5827L9726j25077r7249j1014o9180m4787L0272
20459E24660m7948q6737P7836J73312O8869j9203J18138L837n3933N014l1154
20448G32691L8142N2878Q6919N6807P7088J41066J35296J08966O0885p613l6646
20437A446479k7363L2112Q0049l6820J5522N1044k6558n5912o4824p5470j3100
20426A325159N277j3726j22126r6572L0972n932m5327j00774n8852j3705R374
20415I13768L8209p498P4375J7668M0733J05950Q0593n330J1992j7773q6389L5293
$$ plain form
20403 1201591 1246329 1234896 1183014 1158580 1113615 1083892 1097172 1038814 952663 888613 878302
20392 878302 877846 819868 736417 609732 460262 448084 359395 312191 237342 215412 261219
20381 261219 219255 137615 103830 56599 62461 80672 124245 168848 127834 149385 218020 218833
20369 218833 197460 175705 114361 107172 133609 134995 148346 125366 131789 49248 37307 40940
20357 40940 28010 84059 178883 215337 194269 251193 225389 185394 164598 155316 225404 234416
20345 234416 213091 212052 220444 201602 123919 42688 -6320 22915 60819 77843 124207 108640
20333 108640 120697 91556 82878 155040 80537 59042 51254 98145 121024 87789 64534 91509
20321 91509 65595 -3506 42245 26474 48650 81260 79934 100934 84039 79050 10135 -23927
$$ packed form
20403A201591M4738j1433n1882k4434m4965k9723J3280n8358q6151o4050j0311
20392H78302m56n7978q3451j26685j49470j2178q8689m7204p4849k1930M5807
20381B61219m1964q1640l3785m7231N862J8211M3573M4603m1014K1551O8635Q13
20369B18833k1373k1755o1344p189K6437J386J3351k2980O423q2541j1941L633
20357D0940j2930N6049R4824L6454k1068N6924k5804l9995k0796r282P0088R012
20345B34416k1325j039Q392j8842p7683q1231m9008K9235L7904J7024M6364j5567
20333A08640J2057k9141q678P2162p4503k1495p788M6891K2879l3235k3255K6975
20321I1509k5914o9101M5751j5771K2176L2610j326K1000j6895m989o8915l4062
$$ plain form
20309 -23927 -5239 1836 -17651 -41021 -12676 80175 195667 253313 244869 261772 269299 211028
20297 211028 230028 212055 202031 310220 426307 513563 535690 511526 544855 603349 677623
20286 677623 689879 798941 876999 956798 1119829 1306472 1456223 1502770 1537977 1601887 1690401
20275 1690401 1713968 1843954 1952468 1943264 1800436 1527681 1302354 1227586 1185445 1118215
20265 1118215 992124 786169 581215 429699 327956 257520 274473 283965 318223 328207 257682
20254 257682 192917 140698 151706 166354 161323 208492 266551 355680 394835 499632 524288
20243 524288 591739 595256 530190 540273 723029 873361 862389 928091 1046032 1137449 1230514
20232 1230514 1406115 1635724 1757076 1815828 1777239 1678682 1714218 1784571 1841878 1927674 1904789
$$ packed form
20309b3927J8688P075j9487k3370K8345R2851J15492N7646q444J6903P527n8271
20297B11028J9000j7973j0024J08189J16087Q7256K2127k4164L3329N8494P4274
20286F77623J2256J09062P8058P9799J63031J86643J49751M6547L5207O3910Q8514
20275A690401K3567J29986J08514r204j42828k72755k25327p4768m2141o7230
20265A118215j26091k05955k04954j51516j01743p0436J6953R492L4258R984p0525
20254B57682o4765n2219J1008J4648n031M7169N8059Q9129L9155J04797K4656
20243E24288O7451L517o5066J0083J82756J50332j0972O5702J17941R1417R3065
20232A230514J75601K29609J21352N8752l8589r8557L5536P0353N7307Q5796k2885
$$ plain form
20221 1904789 1699245 1389222 1191850 1109357 1016020 986042 871482 584007 391086 289198
20211 289198 286937 206128 112923 78948 94753 146127 82985 -111 -95785 -126354 -116495 -141948
20199 -141948 -160975 -68944 -20257 -10047 -50467 -66215 43398 132566 94272 -27781 -76309
20188 -76309 -51188 -44224 -3317 -59748 -83166 -31356 55632 109582 95272 111989 4660 -35180
20176 -35180 45798 48200 25738 58623 70428 -38467 -75367 -47779 -146663 -157397 -81178 -49992
20164 -49992 -117173 -124533 -110645 -118888 -156276 -224667 -134708 9456 -43922 -138081 -115769 -92938
20152 -92938 -23482 26074 66450 54643 8262 12123 -10462 -6956 10525 6271 -82992 -114985
20140 -114985 -111484 -89934 -85000 -42984 -112252 -175546 -126381 -80152 -159330 -177897 -138415 -116538
$$ packed form
20221A904789k05544l10023j97372q2493r3337k9978j14560k87475j92921j01888
20211B89198k261q0809r3205l3975J5805N1374o3142q3096r5674l0569R859k5453
20199a41948j9027R2031M8687J0210m0420j5748J09613Q9168l8294j22053m8528
20188g6309K5121O964M0907n6431k3418N1810Q6988N3950j4310J6717j07329l9840
20176c5180Q0978K402k2462L2885J1805j08895l6900K7588r8884j0734P6219L1186
20164d9992o7181p360J3888q243l7388o8391Q9959J44164n3378r4159K2312K2831
20152i2938O9456M9556M0376j1807m6381L861k2585L506J7481m254q9263l1993
20140a14985L501K1550M934M2016o9268o3294M9165M6229p9178j8567L9482K1877
$$ plain form
20128 -116538 -127939 -154414 -152719 -119877 -62759 -37776 -61918 2890 -7061 -3230 40366 107901
20116 107901 76220 41674 -57146 -60802 -49355 25299 19247 46161 43985 83711 54888 21935
20104 21935 127568 94361 -39340 -73231 -69324 -25148 75770 134704 172710 132889 78804
20093 78804 72454 75728 143347 105258 146445 184524 46653 2675 33602 30049 20696 67953
20081 67953 169236 195597 175637 194553 211676 260630 219720 211275 281379 315949 358218 370053
20069 370053 440741 502437 586531 677381 780143 849242 929679 1042153 1180058 1338881 1401761
20058 1401761 1389539 1346472 1468796 1540270 1554773 1475025 1377891 1331005 1366346 1410713 1393373
20047 1393373 1314874 1231295 1171488 1194812 1223019 1110621 1072624 1000174 947890 862973 916956
$$ packed form
20128a16538j1401k6475J695L2842N7118K4983k4142O4808r951L831M3596O7535
20116A07901l1681l4546r8820l656J1447P4654o052K6914k176L9726k8823l2953
20104B1935J05633l3207j33701l3891L907M4176J00918N8934L8006l9821n4085
20093G8804o350L274O7619l8089M1187L8079j37871m3978L0927l553r353M7257
20081F7953J01283K6361j9960J8916J7123M8954m0910q445P0104L4570M2269J1835
20069C70053P0688O1696Q4094R0850J02762O9099Q0437J12474J37905J58823O2880
20058A401761j2222m3067J22324P1474J4503p9748r7134m6886L5341M4367j7340
20047A393373p8499q3579n9807K3324K8207j12398l7997p2450n2284q4917N3983
$$ plain form
20036 916956 958515 944878 1001733 1087051 1226132 1337506 1424399 1520384 1515552 1496873 1475034
20025 1475034 1466904 1498096 1490358 1436434 1382790 1334645 1399195 1408411 1342314 1239456 1158144 1112175
20013 1112175 1012808 841048 639003 500571 395399 332826 300807 226138 225326 234698 199229
20002 199229 184887 233254 197150 185947 233787 261967 243488 211666 115469 152174 183199
19991 183199 125030 142606 83289 69025 59558 74580 49457 22237 60053 78583 122626 91309
19979 91309 85318 151065 178070 121312 16813 -87506 -117169 -42452 -30891 -82211 -58651
19968 -58651 -61859 -43892 -58876 -56540 -18261 43256 132604 174363 121335 58652 -6862 640
19956 640 131941 163811 81750 -36863 -133448 -71594 40407 13038 34715 -2096 18738
$$ packed form
20036I16956M1559j3637N6855Q5318J39081J11374Q6893R5985m832j8679k1839
20025A475034q130L1192p738n3924n3644m8145O4550R216o6097j02858q1312m5969
20013A112175r9367j71760k02045j38432j05172o2573l2019p4669q12R372l5469
20002A99229j4342M8367l6104j1203M7840K8180j8479l1822r6197L6705L1025
19991A83199n8169J7576n9317j4264r467J5022k5123k7220L7816J8530M4043l1317
19979I1309n991O5747K7005n6758j04499j04319k9663P4717J1561n1320K3560
19968e8651l208J7967j4984K336L8279O1517Q9348M1759n3028o2683o5514P502
19956F40J31301L1870q2061j18613r6585O1854J12001k7369K1677l6811K0834
$$ plain form
19945 18738 72477 2262 -42494 -37955 -39260 -38851 -92652 -2005 -52093 -103001 -58653 -74796
19933 -74796 -94785 -150251 -191452 -119273 -50188 -3621 11263 22208 82676 41452 -59140
19922 -59140 -86233 18137 92271 71146 115615 129746 24614 -36533 -56809 -29614 -14813
19911 -14813 25856 109188 73803 76980 93655 158469 175182 173748 143788 110797 97293 171436
19899 171436 183142 96590 37289 68822 88930 74155 77926 105363 171035 239395 261862 175178
19887 175178 164912 201758 224454 213292 177543 110205 71979 22295 44375 86898 35796
19876 35796 58858 97496 103314 49794 56485 104845 106683 83052 80856 187027 209549 232537
19864 232537 225452 276045 317370 300193 299429 312336 265757 249737 259128 244359 321300 380263
$$ packed form
19945A8738N3739p0215m4756M539j305M09n3801R0647n0088n0908M4348j6143
19933g4796j9989n5466m1201P2179O9085M6567J4884J0945O0468m1224j00592
19922e9140k7093J04370P4134k1125M4469J4131j05132o1147k0276K7195J4801
19911a4813M0669Q3332l5385L177J6675O4814J6713j434k9960l2991j3504P4143
19899A71436J1706q6552n9301L1533K0108j4775L771K7437O5672O8360K2467q6684
19887A75178j0266L6846K2696j1162l5749o7338l8226m9684K2080M2523n1102
19876C5796K3062L8638N818n3520O691M8360J838k3631k196J06171K2522K2988
19864B32537p085N0593M1325j7177p64J2907m6579j6020R391j4769P6941N8963
$$ plain form
19852 380263 408971 462998 561860 682333 623449 510688 434313 402731 535313 654362 696655
19841 696655 685666 542859 388970 403642 459311 541423 551157 555612 573600 522886 504595
19830 504595 596872 632123 573065 512906 563425 611970 696033 678790 699393 737111 763324
19819 763324 785850 878187 917684 997044 1095652 1109110 1180956 1174389 1177095 1266101 1408379 1560907
19807 1560907 1694419 1805766 1819614 1945188 2136329 2260553 2452921 2711586 2936338 3131832
19797 3131832 3365439 3538265 3805667 4080974 4411903 4774484 5222910 5713408 6282883
19788 6282883 6929456 7706214 8428119 9187194 10044067 10963416 11993761 13140349 14490089
19779 14490089 15997116 17582404 19210647 20926948 22794846 24660787 26686047 28994945
$$ packed form
19852C80263K8708N4027R8862J20473n8884j12761p6375l1582J32582J19049M2293
19841F96655j0989j42807j53889J4672N5669Q2112R734M455J7988n0714j8291
19830E04595R2277L5251n9058o0159N0519M8545Q4063j7243K0603L7718K6213
19819G63324K2526R2337L9497P9360R8608J3458P1846o567K706Q9006J42278J52528
19807A560907J33512J11347J3848J25574J91141J24224J92368K58665K24752J95494
19797C131832K33607J72826K67402K75307L30929L62581M48426M90498N69475
19788F282883O46573P76758P21905P59075Q56873R19349J030345J146588J349740
19779A4490089J507027J585288J628243J716301J867898J865941K025260K308898
$$ plain form
19771 28994945 31561744 34139986 36761515 39647770 42822623 46309694 50284446 54903924
19763 54903924 60227165 66255971 72971993 80254716 88119430 96899895 106882844 118408511
19755 118408511 132318911 149566946 171097343 196741556 225384951 252653169 269730025
19748 269730025 266510583 256601134 261881075 282534306 307709254 321522019 308832384
19741 308832384 277681203 235662355 201112592 187154263 185563605 183288163 164787353
19734 164787353 126374813 91447258 70697094 59297970 52927651 49447902 47491218
19727 47491218 46352457 45923219 46061362 46783505 48002579 49719622 51890320 54469490
19719 54469490 57401609 60764521 64370427 68331913 72993985 78384968 84401958 91039574
$$ packed form
19771B8994945K566799K578242K621529K886255L174853L487071L974752M619478
19763E4903924N323241O028806O716022P282723P864714Q780465R982949J1525667
19755A18408511J3910400J7248035K1530397K5644213K8643395K7268218J7076856
19748B69730025l219442r909449N279941K0653231K5174948J3812765j2689635
19741C08832384l1151181m2018848l4549763j3958329j590658k275442j8500810
19734A64787353l8412540l4927555k0750164j1399124o370319l479749j956684
19727D7491218j138761m29238J38143P22143J219074J717043K170698K579170
19719E4469490K932119L362912L605906L961486M662072N390983O016990O637616
$$ plain form
19711 91039574 98391484 106608094 115885180 126550777 138934519 153287277 170180368
19704 170180368 191054471 217147068 248336185 282453880 312828704 326916505 316052418
19697 316052418 305842744 317564821 345312218 374036537 381367202 354806242 310653831
19690 310653831 259447692 224000413 211722655 210320618 203637580 173562596 124723954
19683 124723954 85480131 62055777 48064625 38954137 32829314 28264379 24628767
19676 24628767 21822965 19666186 17919125 16373187 14926705 13692259 12664893 11796536
19668 11796536 11096550 10413561 9689377 8973292 8291751 7708650 7230638 6807884 6513498
19659 6513498 6108798 5704967 5397042 5104982 4873106 4594716 4350524 4124200 3927003
$$ packed form
19711I1039574P351910Q216610R277086J0665597J2383742J4352758J6893091
19704A70180368K0874103K6092597L1189117L4117695L0374824J4087801j0864087
19697C16052418j0209674J1722077K7747397K8724319P330665k6560960m4152411
19690C10653831n1206139l5447279j2277758j402037o683038l0074984m8838642
19683A24723954l9243823k3424354j3991152r110488o124823m564935l635612
19676B4628767k805802k156779j747061j545938j446482j234446j027366q68357
19668A1796536o99986o82989p24184p16085o81541n83101m78012m22754k94386
19659F513498m04700m03831l07925k92060k31876k78390k44192k26324j97197
$$ plain form
19650 3927003 3711055 3566031 3435909 3303356 3284195 3177018 3074871 2971368 2802011 2709420
19640 2709420 2710419 2707937 2692331 2577219 2481483 2406488 2354727 2227285 2131948 2129991 2182614 2221544
19628 2221544 2134413 2044732 2002915 2004580 2010210 2011007 1977585 1942284 1878091 1850449 1807878 1851902
19616 1851902 1846812 1763093 1694497 1616976 1583341 1606742 1546628 1500666 1429932 1325808 1324995 1284927
19604 1284927 1244450 1202970 1152202 1031601 994979 1024075 1057276 1054824 1018973 976344 990771
19593 990771 944812 930671 916141 925845 941154 994658 996148 1005685 1040073 1031837 1068570 1138652
19581 1138652 1127233 1108915 1132991 1112789 1023096 930517 941868 943719 922223 938615 923545
19570 923545 853124 892886 925878 957678 877542 771666 791710 739790 706962 623752 579116
$$ packed form
19650C927003k15948j45024j30122j32553j9161j07177j02147j03503j69357r2591
19640B709420R99k482j5606j15112r5736p4995n1761j27442r5337j957N2623L8930
19628B221544q7131q9681m1817J665N630P97l3422l5301o4193k7642m2571M4024
19616A851902n090q3719o8596p7521l3635K3401o0114m5962p0734j04124q13m0068
19604A284927m0477m1480n0768j20601l6622K9096L3201k452l5851m2629J4427
19593I90771m5959j4141j4530R704J5309N3504J490R537L4388q236L6733P0082
19581A138652j1419j8318K4076k0202q9693r2579J1351J851k1496J6392j5070
19570I23545p0421L9762L2992L1800q0136j05876K0044n1920l2828q3210m4636
$$ plain form
19559 579116 600398 618841 609515 587380 575892 616120 621041 585164 444241 428478 470903 436871
19547 436871 496075 435788 455323 492817 560337 618587 630363 661647 591407 528016 445425
19536 445425 543619 568612 586851 640472 668122 644405 624718 642273 627798 622691 716129 717237
19524 717237 708353 612456 514928 464771 487067 574647 616586 622746 580189 544393 511250 547932
19512 547932 541723 568619 646469 699377 826072 900653 919835 986881 1091127 1229850 1294901
19501 1294901 1296781 1293252 1289363 1327299 1385034 1380596 1375871 1292684 1137264 1040020 1002274 1070974
19489 1070974 1113344 1030732 784930 714980 676099 733214 739508 766647 787335 756260 775364
19478 775364 776102 795438 760006 765078 723574 746538 766992 653425 575268 571816 602487 706727
$$ packed form
19559E79116K1282J8443r326k2135j1488M0228M921l5877j40923j5763M2425l4032
19547D36871N9204o0287J9535L7494O7520N8250J1776L1284p0240o3391q2591
19536D45425R8194K4993J8239N3621K7650k3717j9687J7555j4475n107R3438J108
19524G17237q884r5897r7528n0157K2296Q7580M1939O160m2557l5796l3143L6682
19512E47932o209K6896P7850N2908J26695P4581J9182O7046J04246J38723O5051
19501A294901J880l529l889L7936N7735m438m725q3187j55420r7244l7746O8700
19489A070974M2370q2612k45802o9950l8881N7115O294K7139K0688l1075J9104
19478G75364P38J9336l5432N072m1504K2964K0454j13567p8157l452L0671J04240
$$ plain form
19466 706727 693097 612529 581538 643222 672641 756124 728150 736210 764270 789859 892371
19455 892371 1044015 1157643 1199674 1286848 1293166 1204992 1172464 1297593 1475147 1575168 1497720
19444 1497720 1342563 1168998 1045112 943600 974320 967094 944905 812964 649772 567320
19434 567320 602872 627262 664976 651200 603460 652350 762771 800044 751314 731987 642367
19423 642367 541517 483980 479544 479476 481855 518434 399352 227691 260192 291867 286510 228553
19411 228553 181931 196129 171515 194658 165235 122621 72681 111840 198006 333250 343444
19400 343444 245323 116044 83457 185820 272963 291687 240001 165498 84650 -26200 457
19389 457 121905 144984 149426 158128 198536 185157 123442 105681 158679 197570 227466 246591
$$ packed form
19466G06727j3630q0568l0991O1684K9419Q3483k7974Q060K8060K5589J02512
19455H92371J51644J13628M2031Q7174O318q8174l2528J25129J77554J00021p7448
19444A497720j55157j73565j23886j01512L0720p226k2189j31941j63192q2452
19434E67320L5552K4390L7714j3776m7740M8890J10421L7273m8730j9327q9620
19423F42367j00850n7537m436o8K379L6579j19082j71661L2501L1675n357n7957
19411B28553m6622J4198k4614K3143k9423m2614m9940L9159Q6166J35244J0194
19400C43444r8121j29279l2587J02363Q7143J8724n1686p4503q0848j10850K6657
19389D57J21448K3079M442Q702M0408j3379o1715j7761N2998L8891K9896J9125
$$ plain form
19377 246591 185305 167221 176171 205585 201063 193330 267728 308869 359601 321317 326942 293960
19365 293960 316434 363544 318941 395581 375841 373311 331890 364154 333074 328418 354207 332937
19353 332937 394329 463050 459191 426451 363742 288019 266351 351188 385495 357149 377997 443990
19341 443990 420997 421092 443358 465406 530655 573547 561625 599379 607045 656884 646730 589047
19329 589047 651671 707791 753674 800014 865214 910880 953746 979921 1021744 1141851 1219881
19318 1219881 1239210 1295479 1422502 1545624 1689505 1740162 1851049 2049161 2266862 2482904
19308 2482904 2649499 2871822 3060596 3316914 3669679 4119177 4565845 5000383 5509526
19299 5509526 6074389 6724088 7403808 8038694 8759974 9536905 10360685 11381009 12465155
$$ packed form
19377B46591o1286j8084Q950K9414m522p733P4398M1141N0732l8284N625l2982
19365B93960K2474M7110m4603P6640j9740k530m1421L2264l1080m656K5789k1270
19353C32937O1392O8721l859l2740o2709p5723k1668Q4837L4307k8346K0848O5993
19341D43990k2993R5K2266K2048O5249M2892j1922L7754P666M9839j0154n7683
19329E89047O2624N6120M5883M6340O5200M5666M2866K6175M1823J20107P8030
19318A219881J9329N6269J27023J23122J43881N0657J10887J98112K17701K16042
19308B482904J66595K22323J88774K56318L52765M49498M46668M34538N09143
19299E509526N64863O49699O79720O34886P21280P76931Q23780J020324J084146
$$ plain form
19290 12465155 13653530 14976468 16314743 17650767 18987046 20143966 21301226 22665728
19282 22665728 24405134 26504941 28935249 31855086 35450102 39715947 44454487 49402907
19274 49402907 54174055 58794721 63619073 69070209 75554014 83912186 95567147 111791927
19266 111791927 132622029 156963310 179617453 189583179 171744841 136308186 110745378
19259 110745378 98785970 95581698 98717514 107742955 122167240 140619990 158057733
19252 158057733 164466214 144356434 104498726 73597746 56552249 47418022 42325748
19245 42325748 39515952 38191569 37999822 38497591 39450113 40712218 42127160 43760972
19237 43760972 45666523 47628940 49788335 52420385 55681686 59715189 64449342 70012643
$$ packed form
19290A2465155J188375J322938J338275J336024J336279J156920J157260J364502
19282B2665728J739406K099807K430308K919837L595016M265845M738540M948420
19274D9402907M771148M620666M824352N451136O483805Q358172J1654961J6224780
19266A11791927K0830102K4341281K2654143R965726j7838338l5436655k5562808
19259A10745378j1959408l204272L135816R025441J4424285J8452750J7437743
19252A58057733O408481k0109780l9857708l0900980j7045497r134227n092274
19245D2325748k809796j324383j91747M97769R52522J262105J414942J633812
19237D3760972J905551J962417K159395K632050L261301M033503M734153N563301
$$ plain form
19229 70012643 76396937 83669257 92041697 101236459 110502552 119438646 128666413 138937457
19221 138937457 151306574 167172962 189031680 219187298 258302758 304117958 347398077
19214 347398077 368027934 341281135 280015446 226384549 197444528 187370982 190538984
19207 190538984 205301713 230551551 263146872 294660911 307265740 276910690 209280251
19200 209280251 144493690 103478402 79947316 65658148 56364405 50225787 46147055
19193 46147055 43264480 41171095 39503904 38091162 37105373 36809903 37048517 37732450 38881701
19184 38881701 40492331 42582197 44898215 47028846 49201150 51656339 54705748 58173366
19176 58173366 61832781 65605722 69584665 73864684 78448043 84365237 93076686 105908378
$$ packed form
19229G0012643O384294P272320Q372440R194762R266093Q936094R227767J0271044
19221A38937457J2369117J5866388K1858718L0155618L9115460M5815200M3280119
19214C47398077K0629857k6746799o1265689n3630897k8940021j0073546L168002
19207A90538984J4762729K5249838L2595321L1514039J2604829l0355050o7630439
19200B09280251o4786561m1015288k3531086j4289168r293743o138618m078732
19193D6147055k882575k093385j667191j412742r85789k95470K38614O83933J149251
19184C8881701J610630K089866K316018K130631K172304K455189L049409L467618
19176E8173366L659415L772941L978943M280019M583359N917194Q711449J2831692
$$ plain form
19168 105908378 123735500 146018844 170046892 187769337 184530627 152840739 119217712
19161 119217712 100464350 92762026 92169160 97569067 108607908 124313114 141816453
19154 141816453 154060538 147923475 113960584 75434652 51082730 37449805 29343993
19147 29343993 24004478 20355427 17877016 15934176 14434329 13057521 11643403 10261440
19139 10261440 9222020 8507212 8015453 7702313 7509757 7271739 7076135 6861829 6580039
19130 6580039 6155154 5618476 5072377 4691640 4454590 4277531 4077754 3883259 3716772
19121 3716772 3545907 3385784 3358142 3272312 3130592 3036279 2856181 2730042 2688402 2762899
19111 2762899 2773106 2673494 2487627 2478639 2564471 2662902 2649127 2526917 2520524 2519187 2547982
$$ packed form
19168A05908378J7827122K2283344K4028048J7722445l238710l1689888l3623027
19161A19217712j8753362p702324n92866N399907J1038841J5705206J7503339
19154A41816453J2244085o137063l3962891l8525932k4351922j3632925q105812
19147B9343993n339515l649051k478411j942840j499847j376808j414118j381963
19139A0261440j039420p14808m91759l13140j92556k38018j95604k14306k81790
19130F580039m24885n36678n46099l80737k37050j77059j99777j94495j66487
19121C716772j70865j60123k7642q5830j41720r4313j80098j26139m1640P4497
19111B762899J0207r9612j85867q988Q5832R8431j3775j22210o393j337K8795
$$ plain form
19100 2547982 2567479 2683244 2676391 2526207 2436599 2353969 2306879 2301849 2251714 2243985 2271227
19089 2271227 2282315 2239263 2080681 1870332 1774650 1768303 1691455 1627167 1538236 1547373 1467342
19078 1467342 1527336 1574038 1506021 1401107 1327066 1269013 1332406 1407635 1388531 1349458 1315049
19067 1315049 1305492 1280439 1234779 1166044 1238891 1350900 1409585 1494740 1557566 1563294 1670082
19056 1670082 1771143 1726664 1848744 2010200 2138425 2372487 2403495 2247779 2032486 1942237
19046 1942237 1913468 1854450 1757475 1744089 1775943 1909353 2049980 2014356 1853033 1692442
19036 1692442 1392966 1149458 1053353 988153 941400 880006 900165 926959 912709 1000784 1001615
19025 1001615 971501 937831 883397 860040 896020 887589 869652 822528 750915 755271 787556 823878
$$ packed form
19100B547982J9497J15765o853j50184q9608q2630m7090n030n0135p729K7242
19089B271227J1088m3052j58582k10349r5682o347p6848o4288q8931R137q0031
19078A467342N9994M6702o8017j04914p4041n8053O3393P5229j9104l9073l4409
19067A315049r557k5053m5660o8735P2847J12009N8685Q5155O2826N728J06788
19056A670082J01061m4479J22080J61456J28225K34062L1008j55716k15293r0249
19046A942237k8769n9018r6975j3386L1854J33410J40627l5624j61323j60591
19036A692442k99476k43508r6105o5200m6753o1394K0159K6794j4250Q8075Q31
19025A001615l0114l3670n4434k3357L5980q431j7937m7124p1613M356L2285L6322
$$ plain form
19013 823878 825706 892121 946344 955953 861747 904608 991645 1009730 991949 991374 1110335 1247266
19001 1247266 1302266 1212859 1104472 1079502 1038950 983125 1041250 1055746 1134922 1204308 1224735
18990 1224735 1207745 1157306 1057392 1001083 956275 874345 796671 752418 691627 641565 625422
18979 625422 567318 559663 560392 581957 634008 716560 709656 664156 591659 539457 534955 532986 508228
18966 508228 546935 622695 621252 585847 521092 474287 409063 389619 419317 510680 516340 454186
18954 454186 479670 439366 405195 400255 411536 379194 360079 330924 341646 374050 377045 354923
18942 354923 316289 292889 292949 303767 270776 227326 244536 264852 228581 239120 299010 361127
18930 361127 369461 283606 262073 246657 265519 307188 285340 231536 123363 140374 258923
$$ packed form
19013H23878J828O6415N4223R609r4206M2861Q7037J8085j7781n75J18961J36931
19001A247266N5000q9407j08387k4970m0552n5825N8125J4496P9176O9386K0427
18990A224735j6990n0439r9914n6309m4808q1930p7674m4253o0791n0062j6143
18979F25422n8104p655P29K1565N2051Q2552o904m5500p2497n2202m502j969k4758
18966E08228L8707P5760j443l5405o4755m6805o5224j9444K9698R1363N660o2154
18954D54186K5484m0304l4171m940J1281l2342j9115k9155J0722L2404K995k2122
18942C54923l8634k3400O0J0818l2991m3450J7210K0316l6271J0539N9890O2117
18930C61127Q334q5855k1533j5416J8862M1669k1848n3804j08173J7011J18549
$$ plain form
18919 258923 313555 256569 240875 246740 274019 210201 147499 135791 98550 174520 240347 289170
18907 289170 268562 213175 119793 101265 104824 201873 274306 261677 227634 184430 222364 212274
18895 212274 188800 249514 237175 218147 209910 99205 53734 158109 268533 326131 312732
18884 312732 260387 198957 155358 145883 207114 202814 117094 93896 144072 202612 207820 192432
18872 192432 190548 153597 161375 198846 247620 245832 195689 145424 75835 48594 35066 26942
18860 26942 8557 -27007 22328 135955 118665 122434 200476 215222 212631 205767 212671 181239
18848 181239 134072 151528 179031 199918 192496 179172 261485 326925 300003 274989 344072 344758
18836 344758 306020 330489 311141 200046 207643 337671 383330 359727 354263 350997 310183 258902
$$ packed form
18919B58923N4632n6986j5694N865K7279o3818o2702j1708l7241P5970O5827M8823
18907B89170k0608n5387r3382j8528L559R7049P2433j2629l4043m3204L7934j0090
18895B12274k3474O0714j2339j9028q237j10705m5471J04375J10424N7598j3399
18884C12732n2345o1430m3599r475O1231m300q5720k3198N0176N8540N208j5388
18872A92432j884l6951P778L7471M8774j788n0143n0265o9589k7241j3528q124
18860B6942j8385l5564M9335J13627j7290L769P8042J4746k591o864O904l1432
18848A81239m7167J7456K7503K0887p422j3324Q2313O5440k6922k5014O9083O86
18836C44758l8738K4469j9348j11095P597J30028M5659k3603n464l266m0814n1281
$$ plain form
18824 258902 222344 152988 166853 267304 333998 315127 305616 360226 403389 395337 401654 407966
18812 407966 406799 441051 462097 402825 422875 441691 404102 427276 376619 347278 342063 372776
18800 372776 307177 316876 362151 333985 366166 445346 467219 504026 502104 557054 630164 723773
18788 723773 766391 793532 805524 866781 893109 918443 915428 951303 907510 905859 990866 1050200
18776 1050200 1180876 1279292 1358603 1428292 1526013 1693749 1876801 2049893 2193452 2425344
18766 2425344 2681213 2941479 3286445 3614030 3920538 4193451 4371431 4607226 5011750
18757 5011750 5608853 6214962 6882885 7587139 8334221 9091832 9904908 10836453 11910287
18748 11910287 13081310 14306396 15762583 17178805 18549032 20046162 21596173 23265168
$$ packed form
18824B58902l6558o9356J3865J00451O6694j8871r511N4610M3163q052O317O312
18812D07966j167L4252K1046n9272K0050J8816l7589K3174n0657k9341n215L0713
18800C72776o5599R699M5275k8166L2181P9180K1873L6807j922N4950P3110R3609
18788G23773M2618K7141J1992O1257K6328K5334l015L5875m3793j651Q5007N9334
18776A050200J30676R8416P9311O9689R7721J67736J83052J73092J43559K31892
18766B425344K55869K60266L44966L27585L06508K72913J77980K35795M04524
18757E011750N97103O06109O67923P04254P47082P57611Q13076R31545J073834
18748A1910287J171023J225086J456187J416222J370227J497130J550011J668995
$$ plain form
18740 23265168 25077888 26999441 29113405 31489211 34199627 37235847 40803809 45137936
18732 45137936 50339516 56151451 62235871 68554231 75102329 82095699 90116065 100025584
18724 100025584 113151771 130461182 152554332 178798142 206571392 228658719 231173464
18717 231173464 204094873 172937631 160128754 163459967 176948898 194295940 205326435
18710 205326435 192996974 151960098 112891943 90422075 78953457 73571609 71926336
18703 71926336 72997243 75906499 79883369 84580439 89730420 95174698 100940618 107796451
18695 107796451 116688740 128839323 145318209 166572275 191753852 218244576 239182033
18688 239182033 241732770 217279070 189220489 178345340 183191445 198270223 217500430
$$ packed form
18740B3265168J812720J921553K113964K375806K710416L036220L567962M334127
18732D5137936N201580N811935O084420O318360O548098O993370Q020366R909519
18724A00025584J3126187J7309411K2093150K6243810K7773250K2087327K514745
18717B31173464k7078591l1157242j2808877L331213J3488931J7347042J1030495
18710B05326435j2329461m1036876l9068155k2469868j1468618n381848j645273
18703G1926336J070907K909256L976870M697070N149981N444278N765920O855833
18695A07796451Q892289J2150583J6478886K1254066K5181577K6490724K0937457
18688B39182033K550737k4453700k8058581j0875149M846105J5078778J9230207
$$ plain form
18681 217500430 230739288 221674074 185580322 151836985 134631350 129341908 132239632
18674 132239632 141757241 156838746 176195176 196736032 210901953 205234685 176894620
18667 176894620 151996094 143305748 146721450 157318715 169423526 173577439 156120339
18660 156120339 120752975 91705699 74932374 65714223 60950827 59140368 59498571 61361881
18652 61361881 64074467 67143757 70088789 73235077 76966165 81932789 88864111 98733686
18644 98733686 112438293 130113343 150935261 172155293 186529625 180820641 152465993
18637 152465993 127923644 119559350 122964776 133426248 145001203 148234160 129336657
18630 129336657 92148509 61834515 43894454 33271428 26671840 22422168 19560879
$$ packed form
18681B17500430J3238858r065214l6093752l3743337j7205635n289442K897724
18674A32239632R517609J5081505J9356430K0540856J4165921n667268k8340065
18667A76894620k4898526q690346L415702J0597265J2104811M153913j7457100
18660A56120339l5367364k9047276j6773325r218151m763396j810459L58203J863310
18652F1361881K712586L069290K945032L146288L731088M966624O931322R869575
18644I8733686J3704607J7675050K0821918K1220032J4374332n708984k8354648
18637A52465993k4542349q364294L405426J0461472J1574955L232957j8897503
18630A29336657l7188148l0313994j7940061j0623026o599588m249672k861289
$$ plain form
18623 19560879 17373830 15495259 13913483 12619307 11534852 10638098 9852894 9211673
18615 9211673 8803858 8415955 8015447 7665434 7478193 7076448 6688371 6361783 5888468
18606 5888468 5534606 5333473 5169969 4916544 4727505 4648287 4528300 4346721 4177508 4010055
18596 4010055 3862462 3762883 3694562 3731349 3732822 3670707 3548014 3469336 3378984 3167689 3128999
18585 3128999 3151922 3083806 2957603 2941710 2872478 2792580 2681179 2577525 2487216 2456731 2407559
18574 2407559 2427425 2418942 2281687 2136639 2109903 2146991 2112432 2093919 2066242 2024823 1969918
18563 1969918 1919789 1825572 1845460 1902423 1947256 1942599 1971493 1980694 1863282 1804325 1814976
18552 1814976 1738634 1726132 1722899 1735984 1752878 1741644 1719923 1682707 1590880 1454428 1466778
$$ packed form
18623A9560879k187049j878571j581776j294176j084455q96754p85204o41221
18615I211673m07815l87903m00508l50013j87241m01745l88077l26588m73315
18606E888468l53862k01133j63504k53425j89039p9218j19987j81579j69213j67453
18596D010055j47593r9579o8321L6787J473o2115j22693p8678r0352k11295l8690
18585C128999K2923o8116j26203j5893o9232p9898j11401j03654r0309l0485m9172
18574B407559J9866q483j37255j45048k6736L7088l4559j8513k7677m1419n4905
18563A969918n0129r4217J9888N6963M4833m657K8894R201j17412n8957J0651
18552A814976p6342j2502l233J3085J6894j1234k1721l7216r1827j36452J2350
$$ plain form
18541 1466778 1494668 1426625 1388662 1397867 1469537 1440404 1409851 1374814 1314947 1378251 1401384
18530 1401384 1394852 1394778 1357547 1312788 1290783 1341127 1345061 1290842 1266742 1298074 1297548 1352422 1442562
18517 1442562 1426653 1320590 1292708 1279108 1242572 1286252 1389445 1477963 1509394 1552104 1522314
18506 1522314 1525969 1534934 1581963 1647563 1687632 1749703 1805372 1900658 1947175 1982499 1900004 1778911
18494 1778911 1711726 1704151 1738313 1652736 1657464 1607050 1461147 1371443 1240661 1126102 1052711
18483 1052711 1091177 1192673 1232123 1266053 1244493 1247636 1300322 1313427 1306347 1379463 1427014
18472 1427014 1429429 1545877 1697442 1815155 1841256 1828594 1719734 1552508 1480517 1489298 1577467
18461 1577467 1741389 1843113 1777080 1655656 1539541 1410150 1377315 1430718 1552406 1693786
$$ packed form
18541A466778K7890o8043l7963R205P1670k9133l0553l5037n9867O3304K3133
18530A401384o532p4l7231m4759k2005N0344L934n4219k4100L1332n26N4874R0140
18517A442562j5909j06063k7882j3600l6536M3680J03193Q8518L1431M2710k9790
18506A522314L655Q965M7029O5600M0069O2071N5669R5286M6517L5324q2495j21093
18494A778911o7185p575L4162q5577M728n0414j45903q9704j30782j14559p3391
18483A052711L8466J01496L9450L3930k1560L143N2686J3105p080P3116M7551
18472A427014K415J16448J51565J17713K6101j2662j08860j67226p1991Q781Q8169
18461A577467J63922J01724o6033j21424j16115j29391l2835N3403J21688J41380
$$ plain form
18451 1693786 1813498 1859130 1827512 1713107 1588908 1501337 1422506 1491730 1593798 1585439 1530763
18440 1530763 1403909 1224507 1091630 1040715 952304 901975 925990 1042673 1025783 989948
18430 989948 1001807 957268 990112 982190 962760 983711 1060017 1187231 1256262 1324306 1365622
18419 1365622 1365349 1335429 1167680 1094051 1071869 1092331 1189124 1190261 1177902 1092986 894080
18408 894080 746407 624788 600675 640046 591364 592903 650121 608498 621177 615726 578138
18397 578138 525210 489778 514979 574916 597401 590954 509614 464193 479273 474516 465613 476752
18385 476752 553799 555734 503927 458331 437231 507654 459267 409583 395534 413274 372610 332310
18373 332310 364288 423487 498163 499836 514718 474628 421823 386283 312918 333485 390120 377684
$$ packed form
18451A693786J19712M5632l1618j14405j24199q7571p8831O9224J02068q359n4676
18440A530763j26854j79402j32877n0915q8411n0329K4015J16683j6890l5835
18430I89948J1859m4539L2844p922j9430K0951P6306J27214O9031O8044M1316
18419A365622k73k9920j67749p3629k2182K0462R6793J137j2359q4916j98906
18408H94080j47673j21619k4113L9371m8682J539N7218m1623J2679n451l7588
18397E78138n2928l5432K5201N9937K2485o447q1340m5421J5080m757q903J1139
18385D76752P7047J935n1807m5596k1100P0423m8387m9684j4049J7740m0664m0300
18373C32310L1978N9199P4676J673J4882m0090n2805l5540p3365K0567N6635j2436
$$ plain form
18361 377684 328639 316274 332567 324791 242527 333158 435865 366785 310821 315150 312380 351209
18349 351209 343634 355034 357540 420636 425694 436899 432419 361784 297587 310436 369104 366037
18337 366037 363562 346867 340159 292466 303159 335414 333809 358165 307695 268249 301632 370969
18325 370969 361074 302363 356340 386554 299908 260472 274356 278797 287131 246710 305658 333491
18313 333491 364679 437316 445107 450708 348292 278099 234020 257494 263343 271752 292759 301158
18301 301158 263709 240663 185438 257080 291588 319562 275002 313961 351200 391019 480786
18290 480786 492256 465508 414443 353656 324996 354826 354534 309616 249185 246908 302301 357235
18278 357235 294866 357587 344268 254512 195301 251068 294159 329375 280492 224919 253900
$$ packed form
18361C77684m9045j2365J6293p776q2264R0631J02707o9080n5964M329k770L8829
18349C51209p575J1400K506O3096N058J1205m480p0635o4197J2849N8668l067
18337C66037k475j6695o708m7693J0693L2255j605K4356n0470l9446L3383O9337
18325C70969r895n8711N3977L0214q6646l9436J3884M441Q334m0421N8948K7833
18313C33491L1188P2637P791N601j02416p0193m4079K3474N849Q409K1007Q399
18301C01158l7449k3046n5225P1642L4508K7974m4560L8959L7239L9819Q9767
18290D80786J1470k6748n1065o0787k8660K9830k92m4918o0431k277N5393N4934
18278C57235o2369O2721j3319q9756n9211N5767M3091L5216m8883n5573K8981
$$ plain form
18267 253900 257888 229348 175861 172956 197841 184497 155271 138359 125413 138953 183517 209067
18255 209067 250483 313505 291881 210705 234259 278998 268226 263252 267556 252014 262288 230801
18243 230801 189094 207845 232193 231408 221424 302913 288602 220779 265611 360498 363937 315794
18231 315794 287372 278601 325930 410838 471671 422734 359877 363869 430211 388861 309814 345452
18219 345452 433402 434715 414331 435790 413583 370749 362105 313132 307643 411581 414379 464647
18207 464647 492537 502786 568752 587358 599297 668674 795182 801777 825742 905548 976715
18196 976715 1030402 1069870 1083718 1278746 1340446 1344139 1279718 1159471 1056126 982856 1083583
18185 1083583 1181969 1217419 1168595 1016652 849511 766358 711173 706942 728492 722524 709788
$$ packed form
18267B53900L988k8540n3487k905K4885j3344k9226j6912j2946J3540M4564K5550
18255B09067M1416O3022k1624q1176K3554M4739j0772m974M304j5542J0274l1487
18243B30801m1707J8751K4348p85r984Q1489j4311o7823M4832R4887L439m8143
18231C15794k8422q771M7329Q4908O0833m8937o2857L992O6342m1350p9047L5638
18219C45452Q7950J313k0384K1459k2207m2834q644m8973n489J03938K798N0268
18207D64647K7890J0249O5966J8606J1939O9377J26508O595K3965P9806P1167
18196I76715N3687L9468J3848J95028O1700L693o4421j20247j03345p3270J00727
18185A083583R8386L5450m8824j51943j67141q3153n5185m231K1550n968j2736
$$ plain form
18174 709788 689254 683768 745612 837893 903217 1044905 1136801 1116237 1194000 1312009 1417550
18163 1417550 1540494 1633241 1603672 1582052 1548600 1524045 1583488 1686071 1829787 1884539 1805348
18152 1805348 1688424 1544555 1613704 1672062 1774755 2000658 2241305 2372507 2519941 2609287
18142 2609287 2726256 2874712 3041083 3232772 3405477 3657852 4017132 4224085 4405454
18133 4405454 4576475 4744420 5036820 5405451 5692840 5895386 6236343 6682935 7165006
18124 7165006 7669500 8241326 8938292 9777952 10793301 12271282 14010562 16048439 18305437
18115 18305437 20584149 22720676 24796272 26735268 28762968 31517119 36012927 43043325
18107 43043325 52951748 65551153 78566773 86459990 76728861 49183995 28356669
$$ packed form
18174G09788k0534n486O1844R2281O5324J41688R1896k0564P7763J18009J05541
18163A417550J22944R2747k9569k1620l3452k4555N9443J02583J43716N4752p9191
18152A805348j16924j43869O9149N8358J02693K25903K40647J31202J47434Q9346
18142B609287J16969J48456J66371J91689J72705K52375L59280K06953J81369
18133D405454J71021J67945K92400L68631K87389K02546L40957M46592M82071
18124G165006N04494N71826O96966Q39660J015349J477981J739280K037877K256998
18115A8305437K278712K136527K075596J938996K027700K754151M495808P030398
18107D3043325R908423J2599405J3015620P893217r731129k7544866k0827326
$$ plain form
18100 28356669 17841575 12403405 9195068 7253927 6058159 5150459 4380114 3826990
18092 3826990 3343678 2884631 2521979 2356781 2257071 2130481 1999365 1894371 1767829 1577415
18082 1577415 1487009 1410643 1269793 1145808 1078049 1014897 974854 973929 981716 978126 938623 888321
18070 888321 789272 800462 809950 747059 712462 707267 677610 646370 576801 580034 610373 590307
18058 590307 631145 652998 628490 516792 446993 515569 535479 461576 488983 466042 508096
18047 508096 431450 344661 376716 412758 406772 335973 340800 424493 378941 315785 265621 291633
18035 291633 343320 341943 323005 363335 428193 435193 395599 378057 456740 489227 381844 346660
18023 346660 391137 424264 364573 275169 278826 309921 381161 403159 343382 341063 378067 299380
$$ packed form
18100B8356669j0515094n438170l208337j941141j195768r07700p70345n53124
18092C826990m83312m59047l62652j65198r9710j26590j31116j04994j26542j90414
18082A577415r0406p6366j40850j23985o7759o3152m0043r25P787l590l9503n0302
18070H88321r9049J1190R488o2891l4597n195k9657l1240o9569L233L0339k0066
18058E90307M0838K1853k4508j11698o9799O8576J9910p3903K7407k2941M2054
18047E08096p6646q6789L2055L6042n986p0799M827Q3693m5552o3156n0164K6012
18035B91633N1687j377j8938M0330O4858P000l9594j7542P8683L2487j07383l5184
18023C46660M4477L3127n9691q9404L657L1095P1240K1998n9777k319L7004p8687
$$ plain form
18011 299380 202743 189304 185955 198612 245750 271857 265701 226917 213696 221287 213838 193240
17999 193240 344277 358946 336706 391788 342952 305612 319337 313753 355894 297456 260327
17988 260327 253975 278246 338078 378281 311856 243512 223579 171577 131378 118000 184965 203612
17976 203612 190863 158625 148517 130987 161857 235788 272793 250392 188303 196873 285009 338714
17964 338714 362101 298422 238661 233000 221479 268098 283452 244156 206023 201278 196804 203102
17952 203102 274111 266568 178268 124259 186565 214130 274240 345389 423850 300023 185241
17941 185241 127596 141508 141552 118652 35362 49065 131672 107340 121661 174719 139220 127197
17929 127197 206701 224486 212675 211507 126208 70542 64106 69952 107838 112422 133004 123564
$$ packed form
18011B99380r6637j3439l349J2657M7138K6107o156l8784j3221P591p449k0598
17999A93240J51037J4669k2240N5082m8836l7340J3725n584M2141n8438l7129
17988B60327o352K4271N9832M0203o6425o8344j9933n2002m0199j3378O6965J8647
17976B03612j2749l2238j0108j7530L0870P3931L7005k2401o2089Q570Q8136N3705
17964C38714K3387o3679n9761n661j1521M6619J5354l9296l8133m745m474O298
17952B03102P1009p543q8300n4009O2306K7565O0110P1149P8461j23827j14782
17941A85241n7645J3912M4k2900q3290J3703Q2607k4332J4321N3058l5499j2023
17929A27197P9504J7785j1811j168q5299n5666o436N846L7886M584K0582r440
$$ plain form
17917 123564 156995 202555 201239 213317 165590 169855 245526 251655 205018 195947 219966 207430
17905 207430 218433 195561 244273 218744 141625 188255 298549 337316 232944 204514 192497
17894 192497 244113 226005 254788 297590 251789 297309 298168 220433 174889 225532 290954 287573
17882 287573 264204 305319 368466 355909 370036 418873 476256 568604 558158 531491 539491 519764
17870 519764 499392 442778 482920 440464 382766 311223 326713 370094 410993 462698 365559
17859 365559 312930 280470 274038 233920 217934 223970 163299 106046 107945 113049 156898 183829
17847 183829 276898 314609 289232 286020 284932 286377 289648 280644 278235 262398 251860 307235 342352
17834 342352 346340 333110 313128 337718 376190 400659 495391 600857 705389 669977 551051
$$ packed form
17917A23564L3431M5560j316J2078m7727M265P5671O129m6637r071K4019j2536
17905B07430J1003k2872M8712k5529p7119M6630J10294L8767j04372k8430j2017
17894A92497N1616j8108K8783M2802m5801M5520Q59p7735m5544N0643O5422l381
17882B87573k3369M1115O3147j2557J4127M8837N7383R2348j0446k6667Q000j9727
17870E19764k0372n6614M0142m2456n7698p1543J5490M3381M0899N1705r7139
17859C65559n2629l2460o432m0118j5986O036o0671n7253J899N104M3849K6931
17847A83829R3069L7711k5377l212j088J445L271r004k409j5837j0538N5375L5117
17834C42352L988j3230j9982K4590L8472K4469R4732J05466J04532l5412j18926
$$ plain form
17823 551051 512493 522091 513260 475267 440008 363105 409363 463166 522813 533271 545260 590131
17811 590131 561064 534883 645303 668286 557059 532110 557242 488125 431729 403238 360145
17800 360145 336367 326705 362082 379554 433765 404632 412780 387768 341621 391262 385094 400367
17788 400367 401508 388936 391237 457889 573877 663643 700809 691175 673829 564082 510509 551692
17776 551692 566212 540749 577752 585302 533205 557500 647238 655079 691067 779228 886593 1012081
17764 1012081 1108998 1026080 815015 656170 527829 478481 456868 470508 494539 436270 369929
17753 369929 389525 388680 398813 448064 470386 436350 520662 603575 579720 503533 473317 522993
17741 522993 496802 448481 366506 315242 314039 336824 350000 389717 426088 415408 352543 314079
$$ packed form
17823E51051l8558R598q831l7993l5259p6903M6258N3803N9647J0458J1989M4871
17811E90131k9067k6181J10420K2983j11227k4949K5132o9117n6396k8491m3093
17800C60145k3778r662L5377J7472N4211k9133Q148k5012m6147M9641o168J5273
17788D00367J141j2572K301O6652J15988Q9766L7166r634j7346j09747n3573M1183
17776E51692J4520k5463L7003P550n2097K4295Q9738P841L5988Q8161J07365J25488
17764A012081R6917q2918k11065j58845j28341m9348k1613J3640K4031n8269o6341
17753C69929J9596q45J0133M9251K2322l4036Q4312Q2913k3855p6187l0216M9676
17741E22993k6191m8321q1975n1264j203K2785J3176L9717L6371j0680o2865l8464
$$ plain form
17729 314079 343040 361329 411225 441884 470958 508763 517846 573852 620069 665256 666924 591953
17717 591953 480604 386337 378158 401123 374494 366757 410006 410225 386151 412192 449180 480972
17705 480972 440752 452586 482699 588153 669016 618303 481835 447574 400936 351152 284398
17694 284398 251883 287640 324101 300645 298966 345902 329653 227854 187783 256521 319564
17683 319564 291248 224132 256140 293623 244644 213974 226355 223675 198653 213965 253467 273273
17671 273273 317736 373311 367715 316700 289013 382686 332715 280596 291883 279984 271469 305473
17659 305473 312588 375780 442937 440860 481355 382499 232759 155378 224492 231343 226585 181491
17647 181491 116894 99884 47171 -31744 50052 149989 139915 164521 143468 132714 185357
$$ packed form
17729C14079K8961J8289M9896L0659K9074L7805R083N6006M6217M5187J668p4971
17717E91953j11349r4267q179K2965k6629p737M3249K19k4074K6041L6988L1792
17705D80972m0220J1834L0113J05454Q0863n0713j36468l4261m6638m9784o6754
17694B84398l2515L5757L6461k3456j679M6936j6249j01799m0071O8738O3043
17683C19564k8316o7116L2008L7483m8979l0670J2381k680k5022J5312L9502J9806
17671B73273M4463N5575n596n1015k7687R3673m9971n2119J1287j1899q515L4004
17659C05473P115O3192O7157k077M0495r8856j49740p7381O9114O851m758m5094
17647A81491o4597j7010n2713p8915Q1796R9937j0074K4606k1053j0754N2643
$$ plain form
17636 185357 229894 233278 199055 228404 249356 244469 174954 154251 115240 104254 101675 204887
17624 204887 254188 234740 166041 143427 129391 23750 8904 150198 222637 163727 173088
17613 173088 138043 163330 205262 162756 161851 174918 127363 123731 130511 107218 51244 75059
17601 75059 82119 138284 86135 30771 41783 11600 8018 52353 52599 106464 88444 35001
17589 35001 -10351 53309 61554 53086 87653 37130 8287 76496 93077 47128 76207 89476
17577 89476 126036 129213 89314 105542 132434 154120 135642 220067 189612 71765 29489 -38878
17565 -38878 -52087 3431 62035 43951 67109 93506 124091 87199 77956 53212 101574 92114
17553 92114 14768 29339 78850 67207 71815 144193 191507 217014 155106 124904 165670 164573
$$ packed form
17636A85357M4537L384l4223K9349K0952m887o9515k0703l9011j0986k579J03212
17624B04887M9301j9448o8699k2614j4036j05641j4846J41294P2439n8910R361
17613A73088l5045K5287M1932m2506r05J3067m7555l632O780k3293n5974K3815
17601G5059P060N6165n2149n5364J1012l0183l582M4335K46N3865j8020n3443
17589C5001m5352O3660Q245q468L4567n0523k8843O8209J6581m5949K9079J3269
17577H9476L6560L177l9899J6228K6892K1686j8478Q4425l0455j17847m2276o8367
17565c8878j3209N5518N8604j8084K3158K6397L0585l6892r243k4744M8362r460
17553I2114p7346J4571M9511j1643M608P2378M7314K5507o1908l0202M0766j097
$$ plain form
17541 164573 106062 84717 96354 72411 21613 25157 105693 130503 91531 -16580 -27029
17530 -27029 -13647 61250 37676 37730 110727 65085 -32001 -64805 22192 60369 32211 -6852
17518 -6852 -8187 -4056 99932 135904 154344 144854 18581 -2191 41426 46561 109022 127872
17506 127872 111715 104395 109071 95674 127784 81933 40434 89369 109862 78747 68110 87182
17494 87182 90722 -8898 -54471 40393 38212 39557 25284 76708 25080 32765 161461 192632
17482 192632 132390 50341 66021 118656 133502 109238 85796 180809 163359 93551 92814 94044
17470 94044 60789 50855 27328 118253 161088 139113 126211 147789 112731 55310 7035 -33640
17458 -33640 -40600 26249 113420 182021 224860 171814 90069 53672 94159 98634 116535 45451
$$ packed form
17541A64573n8511k1345J1637k3943n0798L544Q0536K4810l8972j08111j0449
17530b7029J3382P4897k3574N4P2997m5642r7086l2804Q6997L8177k8158l9063
17518f852j335M131J03988L5972J8440r490j26273k0772M3617N135O2461J8850
17506A27872j6157p320M676j3397L2110m5851m1499M8935K0493l1115j0637J9072
17494H7182L540r9620m5573R4864k181J345j4273N1424n1628P685J28696L1171
17482A92632o0242q2049J5680N2635J4846k4264k3442R5013j7450o9808p37J230
17470I4044l3255r934k3527R0925M2835k1975j2902K1578l5058n7421m8275m0675
17458c3640o960O6849Q7171O8601M2839n3046q1745l6397M0487M475J7901p1084
$$ plain form
17446 45451 109002 178243 218068 187348 143163 233058 286900 393446 519190 578694 436052
17435 436052 295489 179623 146971 160596 249297 218235 128292 142940 182226 117874 143532
17424 143532 53519 -12439 17556 108916 154636 115409 147197 154300 125162 116224 66640 45634
17412 45634 6448 16167 -9156 28953 12777 -19025 -7955 13798 30117 65564 106483 101408
17400 101408 92387 114133 116454 152981 134355 149745 124329 48991 -83684 -123932 -155733 -133165
17388 -133165 -98611 -47110 -38560 -47620 -44064 -38829 -3824 -30226 -55903 -885 23872 73227
17376 73227 102359 42915 26790 83679 66936 2461 15849 -31837 -22052 -4612 7483 43997
17364 43997 118788 78219 47316 28228 -24785 14266 -18954 -117382 -160165 -87770 8344 9293
$$ packed form
17446D5451O3551O9241L9825l0720m4185Q9895N3842J06546J25744N9504j42642
17435D36052j40563j15866l2652J3625Q8701l1062q9943J4648L9286o4352K5658
17424A43532r0013o5958K9995R1360M5720l9227L1788P103k9138q938m9584k1006
17412D5634l9186R719k5323L8109j6176l1802J1070K1753J6319L5447M0919n075
17400A01408r021K1746K321L6527j8626J5390k5416p5338j32675m0248l1801K2568
17388a33165L4554N1501Q550r060L556N235L5005k6402k5677N5018K4757M9355
17376G3227K9132n9444j6125N6889j6743o4475J3388m7686R785J7440J2095L6514
17364D3997P4791m0569l0903j9088n3013L9051l3220r8428m2783P2395R6114R49
$$ plain form
17352 9293 27455 8571 -80444 -11854 103926 188231 96336 107295 103714 79431 8291 -57988
17340 -57988 -15345 27901 43714 42039 51667 94716 119028 43172 58829 39045 19405 60084
17328 60084 136633 177665 131875 70069 19414 -11188 73283 84681 30299 6389 26404 50855
17316 50855 3190 1594 -36399 -32071 -2402 65196 161816 148815 94164 44745 21637 8525
17304 8525 44212 91891 95815 60013 40555 111547 88131 67235 27105 100003 73579 -24672
17292 -24672 13764 -8669 54599 166134 107464 86423 20140 41558 40351 11029 50751 82253
17280 82253 63799 -17253 -12232 45427 50731 51528 -3729 5299 87910 68192 -6836 -26234 5753
17267 5753 9149 26635 19860 26799 79097 98269 137974 155809 77844 -62486 -23325 36776
$$ packed form
17352I293J8162j8884q9015O8590J15780Q4305r1895J0959l581k4283p1140o6279
17340e7988M2643M3246J5813j675R628M3049K4312p5856J5657j9784j9640M0679
17328F0084P6549M1032m5790o1806n0655l0602Q4471J1398n4382k3910K0015K4451
17316E0855m7665j596l7993M328K9669O7598R6620j3001n4651m9419k3108j3112
17304H525L5687M7679L924l5802j9458P0992k3416k0896m0130P2898k6424r8251
17292b4672L8436k2433O3268J11535n8670k1041o6283K1418j207k9322L9722L1502
17280H2253j8454q1052N021N7659N304P97n5257R028Q2611j9718p5028j9398L1987
17267E753L396J7486o775O939N2298J9172L9705J7835p7965j40330L9161O0101
$$ plain form
17255 36776 4855 49447 39856 24376 49443 123853 48729 -10862 52098 98260 128573 116572
17243 116572 132318 148583 91301 22982 34533 84501 68201 28639 21206 105691 151663 101102
17231 101102 44560 15714 24218 43443 27257 65000 44123 112763 164843 89416 149246 161980
17219 161980 67570 79431 116416 124784 91777 92439 156363 111810 15447 -254 14103 29426
17207 29426 14811 -8284 72950 91815 21174 63920 43677 71377 145177 100884 33133 4790
17195 4790 -5152 1737 5981 -41067 15612 5555 60122 91015 144231 138371 147808 147763 29993
17182 29993 -42699 -64848 -9148 20080 -12261 -57498 -113389 -121098 -108516 29462 97547 136609
17170 136609 29365 -13354 20805 -21843 -93757 -115792 -3155 91328 123804 151657 175627
$$ packed form
17255C6776l1921M4592r591j5480K5067P4410p5124n9591O2960M6162L0313j2001
17243A16572J5746J6265n7282o8319J1551M9968j6300l9562p433Q4485M5972n0561
17231A01102n6542k8846Q504J9225j6186L7743k0877O8640N2080p5427N9830J2734
17219A61980r4410J1861L6985Q368l3007O62O3924m4553r6363j5701J4357J5323
17207B9426j4615k3095Q1234J8865p0641M2746k0243K7700P3800m4293o7751k8343
17195D790r942O889M244m7048N6679j0057N4567L0893N3216n860R437m5j17770
17182B9993p2692k2149N5700K9228l2341m5237n5891p709J2582J37978O8085L9062
17170A36609j07244m2719L4159m2648p1914k2035J12637R4483L2476K7853K3970
$$ plain form
17159 175627 147247 128064 145441 98795 39303 175344 217565 141781 204524 302178 178864
17148 178864 91801 88085 126412 189100 189077 156152 99484 46992 -937 -7283 47340 75836
17136 75836 77079 -11027 -79335 -48382 6293 73139 134356 89268 10819 -26082 28086 82359
17124 82359 119252 59119 -20152 -48155 5795 44662 15858 67136 81135 75864 -17577 37065
17112 37065 89135 112067 113484 109907 16804 32637 40052 37746 44340 108115 99513 8657 -1328
17099 -1328 81001 26216 53231 84844 115120 154706 122451 18664 -36351 -61867 -66661 -19570
17087 -19570 9345 -20244 35558 145354 152268 112345 27499 -35586 -113399 -45966 -57250 -21903
17075 -21903 19456 21079 42163 39134 67318 107339 74453 3283 -4654 -40958 -50530 -19337
$$ packed form
17159A75627k8380j9183J7377m6646n9492J36041M2221p5784O2743R7654j23314
17148A78864q7063l716L8327O2688k3l2925n6668n2492m7929o346N4623K8496
17136G5836J243q8106o8308L0953N4675O6846O1217m5088p8449l6901N4168N4273
17124H2359L6893o0133p9271k8003N3950L8867k8804N1278J3999n271r3441N4642
17112C7065N2070K2932J417l577r3103J5833P415k306O594O3775q602r0856r985
17099a328Q2329n4785K7015L1613L0276L9586l2255j03787n5015k5516m794M7091
17087a9570K8915k9589N5802J09796O914l9923q4846o3085p7813O7433j1284L5347
17075b1903M1359J623K1084l029K8184M0021l2886p1170p937l6304r572L1193
$$ plain form
17063 -19337 6149 36976 12604 32723 6695 9772 -8479 13951 61333 74841 33675 53083
17051 53083 61563 60071 71396 151523 123262 48680 16157 -4312 44140 1005 27098 58493
17039 58493 57888 62598 161666 236781 251703 136012 63111 96886 167965 202940 143170 141080
17027 141080 196374 141997 161208 167032 221741 165435 63222 25041 45147 20937 9001
17016 9001 48901 45262 70498 -24982 -62255 106189 77218 63075 135894 126883 94380 62930
17004 62930 52325 60340 3864 -24045 -53433 -44719 -28646 13605 33414 12223 53822 28483
16992 28483 32303 48742 49664 22065 -18252 58951 166841 181234 100476 48745 76022 57408
16980 57408 32865 627 -11198 20185 33708 34156 -48141 -17599 67063 29498 17936 54143
$$ packed form
17063a9337K5486L0827k4372K0119k6028L077j8251K2430M7382J3508m1166J9408
17051E3083Q480j492J1325Q0127k8261p4582l2523k0469M8452m3135K6093L1395
17039E8493o05M710R9068P5115J4922j15691p2901L3775P1079L4975n9770k090
17027A41080N5294n4377J9211N824N4709n6306j02213l8181K0106k4210j1936
17016I001L9900l639K5236r5480l7273J68444k8971j4143P2819r011l2503l1450
17004F2930j0605Q015n6476k7909k9388Q714J6073M2251J9809k1191M1599k5339
16992B8483L820J6439R22k7599m0317P7203J07890J4393q0758n1731K7277j8614
16980E7408k4543l2238j1825L1383J3523M48q2297L0542Q4662l7565j1562L6207
$$ plain form
16968 54143 76907 152832 132903 165286 165563 111057 50610 152520 214697 187926 136951 192891
16956 192891 228607 241546 225871 171912 167403 165380 150970 176827 181044 158151 139945 92961
16944 92961 79685 154198 202524 128333 92397 80554 106189 114198 84573 81241 45874 -30086
16932 -30086 -60665 -42527 -85684 -24248 124965 134025 97811 120698 163605 152685 156318 106595
16920 106595 49655 53258 697 65866 85698 88934 88137 38448 -18930 -25983 -22632 20517 56726
16907 56726 28177 3166 -42396 -79342 -88194 -20750 88452 115290 144205 186229 185496 163613
16895 163613 110757 62198 30320 123 -14692 983 -24374 -34416 -175 -25080 -91866
16884 -91866 -21132 21489 64387 27980 79674 166783 167460 171996 113615 62894 29159 50719
$$ packed form
16968E4143K2764P5925j9929L2383K77n4506o0447J01910O2177k6771n0975N5940
16956A92891L5716J2939j5675n3959m509k023j4410K5857M217k2893j8206m6984
16944I2961j3276P4513M8326p4191l5936j1843K5635Q009k9625l332l5367p5960
16932c0086l0579J8138m3157O1436J49213R060l6214K2887M2907j0920L633m9723
16920A06595n6940L603n2561O5169J9832L236p97m9689n7378p053L351M3149L6209
16907E6726k8549k5011m5562l6946q852O7444J09202K6838K8915M2024p33k1883
16895A63613n2856m8559l1878l0197j4815J5675k5357j0042L4241k4905o6786
16884i1866P0734M2621M2898l6407N1694Q7109O77M536n8381n0721l3735K1560
$$ plain form
16872 50719 7348 -40789 -44680 13286 45079 44110 7925 81718 143605 82974 32283 94
16860 94 38219 84041 95626 67061 -7559 32255 55210 34266 -11315 -9221 -22210 -62240
16848 -62240 -52289 -36036 55212 122062 75983 63158 93856 115064 69236 62730 65419 38565
16836 38565 60812 92301 59132 -49467 40298 106564 162821 166485 182173 138807 90719 21569
16824 21569 64598 132785 180496 214892 221776 227785 123557 104256 148977 76650 37463 41936
16812 41936 4982 38734 3757 13218 65496 49927 43666 25707 -29974 -46848 -89287 -103906
16800 -103906 -45249 41248 -9563 1455 57167 22353 35397 35230 61810 89926 40217 -18378
16788 -18378 23957 43856 28148 -24416 -93210 -89354 -21561 9179 -16126 -5849 74618 77521
$$ packed form
16872E0719m3371m8137l891N7966L1793r69l6185P3793O1887o0631n0691l2189
16860I4L8125M5822J1585k8565p4620L9814K2955k0944m5581K094j2989m0030
16848f2240R951J6253R1248O6850m6079j2825L0698K1208m5828o506K689k6854
16836C8565K2247L1489l3169j08599Q9765O6266N6257L664J5688m3366m8088o9150
16824B1569M3029O8187M7711L4396O884O009j04228j9301M4721p2327l9187M473
16812D1936l6954L3752l4977R461N2278j5569o261j7959n5681j6874m2439j4619
16800a03906N8657Q6497n0811J1018N5712l4814J3044j67K6580K8116m9709n8595
16788a8378M2335J9899j5708n2564o8794L856O7793L0740k5305J0277Q0467K903
$$ plain form
16776 77521 59841 51099 31823 -3941 10877 -37431 -27303 -18436 -55729 -94649 -75057 -99433
16764 -99433 -96878 -105598 -56887 -20839 -11521 27063 31219 -58191 -67494 -41264 -47812 -58865 -62236
16751 -62236 -53302 -61457 -44428 -21236 10618 71914 122632 118955 54752 50340 24115 -11497
16739 -11497 12228 28806 47316 1773 -40085 -50681 -28877 -8515 -48684 -91847 -62507 -44733
16727 -44733 -33251 25804 39471 -31432 -75585 -125674 -60493 -18374 37577 -6199 -45974 -23046
16715 -23046 425 62991 63317 43299 78148 83668 58349 9780 -16622 21573 35691 -30162
16703 -30162 -50704 -25505 25713 81718 104784 79985 91254 58617 7830 -16854 38309 68376
16691 68376 65939 105843 129050 78092 33410 -350 -69642 -50735 -17396 -48019 29852 93135
$$ packed form
16776G7521j7680q742j9276l5764J4818m8308J0128Q867l7293l8920J9592k4376
16764i9433K555q720M8711L6048R318L8584M156q9410r303K6230o548j1053l371
16751f2236Q934q155J7029K3192L1854O1296N0718l677o4203m412k6225l5612
16739a1497K3725J6578J8510m5543m1858j0596K1804K0362m0169m3163K9340J7774
16727d4733J1482N9055J3667p0903m4153n0089O5181M2119N5951m3776l9775K2928
16715b3046K3471O2566L26k0018L4849N520k5319m8569k6402L8195J4118o5853
16703c0162k0542K5199N1218N6005K3066k4799J1269l2637n0787k4684N5163L0067
16691F8376k437L9904K3207n0958m4682l3760o9292J8907L3339l0623P7871O3283
$$ plain form
16679 93135 44472 82803 120136 90882 80368 41623 16711 -15195 -71095 -60413 35979 81807
16667 81807 36099 51061 53661 60747 34434 65870 89405 73013 62925 57805 -11855 -52318
16655 -52318 -14596 24589 80600 136734 124455 111073 82367 56578 27731 4723 2135 -23210
16643 -23210 -35032 -25706 -1992 6375 31648 108618 104984 30409 15836 116023 119705 114761
16631 114761 93064 64930 113237 149578 145439 134729 9293 -126872 -60857 -56208 -15417
16620 -15417 27966 52354 59047 70015 21097 57815 -17825 -78140 -84538 -70555 63490 150221
16608 150221 173324 106032 -16654 -56485 -23408 -968 -4406 -45614 -52171 -28192 -57558 -98719
16596 -98719 -65893 -31081 70000 95117 57335 22635 38391 113798 143116 98670 34380
$$ packed form
16679I3135m8663L8331L7333k9254j0514l8745k4912l1906n5900J0682R6392M5828
16667H1807m5708J4962K600P086k6313L1436K3535j6392j0088n120o9660m0463
16655e2318L7722L9185N6011N6134j2279j3382k8706k5789k8847k3008k588k5345
16643b3210j1822R326K3714Q367K5273P6970l634p4575j4573J00187L682m944
16631A14761k1697k8134M8307L6341m139j0710j25436j36165O6015M649M0791
16620a5417M3383K4388O693J0968m8918L6718p5640o0315o398J3983J34045Q6731
16608A50221K3103o7292j22686l9831L3077K2440l438m1208o557K3979k9366m1161
16596i8719L2826L4812J01081K5117l7782l4700J5756P5407K9318m4446o4290
$$ plain form
16585 34380 87988 129183 103451 69645 74421 100853 94065 -19320 -101469 -133045 -116085 -95585
16573 -95585 -95648 -79376 -43497 -1095 35646 47559 43046 120653 62600 -11579 -16658 15818 18485
16560 18485 12075 30550 43190 -26845 -62331 -59131 32124 -15785 -21406 68331 49219 29577
16548 29577 36104 -6049 -46526 31672 112030 118394 111957 65374 18820 -28725 -82592 -111373
16536 -111373 -136385 -73742 -51536 -38110 -60773 -72235 -43771 -76584 -124363 -126463 -120824 -35850
16524 -35850 57717 77160 103858 -790 49438 36801 58733 -47404 -96096 -85015 -91683
16513 -91683 7468 54679 138417 186758 149828 69202 41310 28511 20168 -10310 14226 12061
16501 12061 5295 59779 88144 81922 77747 56258 -9336 39386 71966 92227 63898 35718
$$ packed form
16585C4380N3608M1195k5732l3806M776K6432o788j13385q2149l1576J6960K0500
16573i5585o3J6272L5879M2402L6741J1913m513P7607n8053p4179n079L2476K667
16560A8485o410J8475J2640p0035l5486L200R1255m7909n621Q9737j9112j9642
16548B9577O527m2153m0477P8198Q0358O364o437m6583m6554m7545n3867k8781
16536a11373k5012O2643K2206J3426k2663j1462K8464l2813m7779k100N639Q4974
16524c5850R3567J9443K6698j04648N0228j2637K1932j06137m8692J1081o668
16513i1683R9151M7211Q3738M8341l6930q0626k7892j2799q343l0478K4536k165
16501A2061o766N4484K8365o222m175k1489o5594M8722L2580K0261k8329k8180
$$ plain form
16489 35718 63022 82139 -10896 -74309 -146577 -130874 -83942 -59558 -42858 -93217 -90666 3497
16477 3497 58276 57349 47815 37533 53622 89907 36315 -7437 78344 163476 166203 154492 181181
16464 181181 231618 142381 65693 -44414 -5643 17053 19450 40594 44157 -11633 -46403 -12823
16452 -12823 -61941 -99528 -74524 11141 52327 21660 2547 -32540 -46896 15644 37388 18614
16440 18614 80328 85810 64092 92272 162941 191391 90391 2237 28999 3521 55243 124907
16428 124907 70683 74922 56950 -16332 -97380 -156821 -58401 42269 25144 -67191 -43219
16417 -43219 -26693 -25449 40309 136328 45718 -20767 19327 57676 34557 53874 -19191 -67737
16405 -67737 -30859 30809 60577 119759 202732 158606 62553 46341 72739 146363 181174 137199
$$ packed form
16489C5718K7304J9117r3035o3413p2268J5703M6932K4384J6700n0359K551R4163
16477C497N4779r27r534j0282J6089L6285n3592m3752Q5781Q5132K727j1711K6689
16464A81181N0437q9237p6688j10107L8771K2696K397K1144L563n5790l4770L3580
16452a2823m9118l7587K5004Q5665M1186l0667j9113l5087j4356O2540K1744j8774
16440A8614O1714N482k1718K8180P0669K8450j01000q8154K6762k5478N1722O9664
16428A24907n4224M239j7972p3282q1048n9441R8420J00670j7125r2335K3972
16417d3219J6526J244O5758R6019r0610o6485M0094L8349k3119J9317p3065m8546
16405f7737L6878O1668K9768N9182Q2973m4126r6053j6212K6398P3624L4811m3975
$$ plain form
16393 137199 56472 84714 42040 -34158 -86580 -90971 -3513 41945 36538 -66702 -56332 40278
16381 40278 -20672 -126295 -133790 -70900 -47584 -38608 -17273 -36761 -55534 -19562 99905 114797
16369 114797 19856 -37022 -91847 -83875 -52582 -26406 -37493 -28436 -10824 -24914 -82711 -104656
16357 -104656 -83375 -86483 -85389 -145594 -87465 -62877 -68932 -77692 -64884 -69472 47103 96063
16345 96063 71173 57083 12755 -51360 -6750 76049 157935 146731 77169 123640 177198 110926
16333 110926 50146 122083 26516 -63666 71937 109270 143921 151385 184643 236096 222270
16322 222270 116999 100204 133214 87388 79881 92585 58701 49305 71200 32651 -7686 36459
16310 36459 36057 27440 -22257 -77268 -57828 -70357 -79464 -88785 -28120 -52790 -73407 -89527 -109403
$$ packed form
16393A37199q0727K8242m2674p6198n2422m391Q7458M5458n407j03240J0370R6610
16381D0278o0950j05623p495O2890K3316Q976K1335j9488j8773L5972J19467J4892
16369A14797r4941n6878n4825P972L1293K6176j1087R057J7612j4090n7797k1945
16357a04656K1281l108J094o0205N8129K4588o055q760J2808m588J16575M8960
16345I6063k4890j4090m4328o4115M4610Q2799Q1886j1204o9562M6471N3558o6272
16333A10926o0780P1937r5567r0182J35603L7333L4651P464L3258N1453j3826
16322B22270j05271j6795L3010m5826p507J2704l3884r396K1895l8549m0337M4145
16310C6459m02q617m9697n5011J9440j2529r107r321O0665k4670k0617j6120j9876
$$ plain form
16297 -109403 -155534 -197179 -168771 -117365 -69405 -105784 -83141 -65682 9001 102606 135991
16286 135991 158208 169341 119857 84091 90793 89791 61541 9289 13524 14008 17357 -17874 -6920
16273 -6920 -64842 -105886 -16322 33559 36720 55311 70532 -6859 -16008 -55461 -58991 -80602
16261 -80602 -117755 -81620 -49197 -16745 35378 -45453 -62758 -55017 -35732 -22115 17090 89169
16249 89169 101544 79902 10012 21772 11093 105418 137802 82226 52581 41171 11311 -56423
16237 -56423 -76207 -115038 -82115 -46945 -37170 -28372 -25263 21066 41700 33778 47633 71692
16225 71692 86248 58559 -20664 -39440 3205 56325 150390 141267 145667 19741 -74314 15879
16213 15879 121603 120262 59035 -13720 -31662 -12042 -25180 72783 17528 -227 -49796 -70846
$$ packed form
16297a09403m6131m1645K8408N1406M7960l6379K2643J7459P4683R3605L3385
16286A35991K2217J1133m9484l5766O702j002k8250n2252M235M84L349l5231J0954
16273f920n7922m1044Q9564M9881L161J8591J5221p7391r149l9453l530k1611
16261h0602l7153L6135L2423L2452N2123q0831j7305P741J9285J3617L9205P2079
16249H9169J2375k1642o9890J1760j0679R4325L2384n5576k9645j1410k9860o7734
16237e6423j9784l8831L2923L5170R775Q798L109M6329K0634p922J3855K4059
16225G1692J4556k7689p9223j8776M2645N3120R4065r123M400j25926r4055R0193
16213A5879J05724j341o1227p2755j7942J9620j3138R7963n5255j7755m9569k1050
$$ plain form
16201 -70846 -24245 -21728 19429 46112 -2651 -51409 -124743 -111013 -60297 -138804 -124916 8374
16189 8374 82666 77046 54958 76315 19856 -2267 47579 96198 38306 -21142 -25472 12879
16177 12879 58036 34089 -45625 -43807 25637 90669 112340 89524 73575 84898 69896 22169
16165 22169 -40879 -78137 -71264 -47298 -5201 46889 125014 142838 141943 106426 34900 -7938
16153 -7938 -125050 -135593 -148700 -148901 -74233 -1450 95017 81500 61336 4919 -17918 -2369
16141 -2369 -18602 -10374 -44663 -21647 -26998 -40881 15515 18881 6636 42343 -37139 -82539
16129 -82539 -144873 -131047 -30561 19251 474 -4372 26263 9975 84128 66715 -40218
16118 -40218 -74637 -22682 -14563 -24440 -48425 -86904 -131087 -99070 -99386 -129210 -97255 -70476
$$ packed form
16201g0846M6601K517M1157K6683m8763m8758p3334J3730N0716p8507J3888J33290
16189H374P4292n620k2088K1357n6459k2123M9846M8619n7892n9448m330L8351
16177A2879M5157k3947p9714J818O9444O5032K1671k2816j5949J1323j5002m7727
16165B2169o3048l7258O873K3966M2097N2090P8125J7824q95l5517p1526m2838
16153g938j17112j0543j3107k01P4668P2783R6467j3517k0164n6417k2837J5549
16141b369j6233Q228l4289K3016n351j3883N6396L366j2245L5707p9482m5400
16129h2539o2334J3826J00486M9812j8777m846L0635j6288P4153j7413j06933
16118d0218l4419N1955Q119r877k3985l8479m4183L2017l16k9824L1955K6779
$$ plain form
16106 -70476 -52644 22213 32221 -5969 -38390 -2428 35385 45346 18512 -24573 -4911 10812
16094 10812 -48064 -26061 1241 -9637 -18931 -11043 -28309 51697 135000 25355 -74494 -105914
16082 -105914 -120703 -59372 -2228 -10269 -56548 -144888 -195308 -180706 -108765 -35420 -11471 -70468
16070 -70468 -77500 -50233 -15910 -20423 -75512 -57014 -18922 -44520 -47605 -30896 -73916 -65368
16058 -65368 -86967 -65814 -99826 -22738 76993 73059 107563 98779 79666 73380 95487 117078
16046 117078 73606 18476 101395 147393 179865 175147 97866 124915 125343 68949 78216 112734
16034 112734 113357 83897 41078 9518 55982 107031 38964 -22090 -31712 32043 64944 15009
16022 15009 -22178 10679 104931 100135 89408 -16654 -53045 31986 48220 -31197 -61790 -94398
$$ packed form
16106g0476J7832P4857J0008l8190l2421L5962L7813R961k6834m3085J9662J5723
16094A0812n8876K2003K7302j0878r294P888j7266Q0006Q3303j09645r9849l1420
16082a05914j4789O1331N7144q041m6279q8340n0420J4602P1941P3345K3949n8997
16070g0468p032K7267L4323m513n5089J8498L8092k5598l085J6709m3020Q548
16058f5368k1599K1153l4012P7088R9731l934L4504q784j9113o286K2107K1591
16046A17078m3472n5130Q2919M5998L2472m718p7281K7049M28n6394R267L4518
16034A12734O23k9460m2819l1560M6464N1049o8067o1054r622O3755L2901m9935
16022A5009l7187L2857R4252m796j0727j06062l6391Q5031J6234p9417l0593l2608
$$ plain form
16010 -94398 -103055 -25337 57647 -5983 -68585 -71376 -31675 56913 61913 78688 80893 76762 5424
15997 5424 -38835 -83794 -22147 30755 2063 -32270 -29497 -4813 -36456 -66917 -55164 10766
15985 10766 47001 68264 74283 87084 53916 52839 75149 14976 -34949 -86780 -79185 -77976
15973 -77976 -4031 47880 20143 51275 -12363 -40492 4505 15357 56577 111893 42136 -30189
15961 -30189 -49025 -54816 -64926 -40581 -37334 17890 44070 -9328 -104587 -80952 -75276 -67685
15949 -67685 14297 54249 63694 87816 117085 176030 197719 138881 115869 83325 103607 153528
15937 153528 107934 90263 21157 -16560 8366 25501 3054 -30798 -6045 42962 -34809
15926 -34809 -20942 33480 -3563 -380 15072 -32553 -27411 -37790 2215 -15147 -36558 -120601
$$ packed form
16010i4398q657P7718Q2984o3630o2602k791L9701Q8588N000J6775K205m131p1338
15997E424m4259m4959O1647N2902k8692l4333K773K4684l1643l0461J1753O5930
15985A0766L6235K1263O019J2801l3168j077K2310o0173m9925n1831P595J209
15973g7976P3945N1911k7737L1132o3638k8129M4997J0852M1220N5316o9757p2325
15961c0189j8836n791j0110K4345L247N5224K6180n3398r5259K3635N676P591
15949f7685Q1982L9952R445K4122K9269N8945K1689n8838k3012l2544K0282M9921
15937A53528m5594j7671o9106l7717K4926J7135k2447l3852K4753M9007p7771
15926c4809J3867N4422l7043L183J5452m7625N142j0379M0005j7362k1411q4043
$$ plain form
15914 -120601 -93132 -72452 -89471 -79120 -30444 27162 -17219 -26367 -3456 -78612 -156829 -173847
15902 -173847 -191916 -158308 -176661 -147730 -44650 -26511 -17593 21463 22564 39954 18960 47972
15890 47972 61100 31926 32691 99042 118441 2882 -104247 -56341 29357 6253 -24497 35271
15878 35271 58781 96160 75282 67885 48942 -520 -55538 23919 -12 3293 -10478 -47967
15866 -47967 -76635 -94476 -61175 -1473 -19631 -79714 -108956 -81879 -71001 -248 9850 -5379
15854 -5379 -44044 -45692 1693 52653 55331 47169 9609 87996 110630 50753 62740 20124
15842 20124 -71289 -118666 -57242 -23320 -73864 -16076 -4306 -16752 16237 70382 74340 100411
15830 100411 117347 24516 -113147 -109270 -104634 -52606 -41304 -48086 -31442 68464 146815 47354
$$ packed form
15914a20601K7469K0680j7019J0351M8676N7606m4381r148K2911p5156p8217j7018
15902a73847j8069L3608j8353K8931J03080J8139Q918L9056J101J7390k0994K9012
15890D7972J3128k9174P65O6351J9399j15559j07129M7906Q5698k3104l0750N9768
15878C5271K3510L7379k0878p397j8943m9462n5018P9457k3931L305j3771l7489
15866d7967k8668j7841L3301N9702j8158o0083k9242K7077J0878P0753J0098j5229
15854e379l8665j648M7385N0960K678q162l7560P8387K2634n9877J1987m2616
15842B0124r1413m7377O1424L3922n0544N7788J1770j2446L2989N4145L958K6071
15830A00411J6936r2831j37663L877M636N2028J1302o782J6644R9906P8351r9461
$$ plain form
15818 47354 285 29317 -2141 4512 -8057 -3125 -17820 18518 5241 -28014 -17329 -54031
15806 -54031 9563 30753 8386 31555 -19561 -35001 -3867 -38700 -72739 -105354 -66551 10010
15794 10010 59351 40106 -9092 -44245 -14177 -10434 -18222 -8366 -226 -30329 -72400 -59301
15782 -59301 -52539 -25713 12252 25933 -2771 -79190 -109371 -58187 -45581 15612 15578 38901
15770 38901 65260 86127 28816 1578 -33344 -22144 1413 19767 62967 48230 41968 73900
15758 73900 31774 13447 -19532 -15526 -4377 -73535 -187979 -152884 -56509 -111443 -149363 -118213
15746 -118213 -113440 -163732 -100379 -20161 -34101 -45927 -39762 -66749 30959 26957 41548 6521
15734 6521 -42331 15675 80751 64996 33718 67419 153523 197411 162565 102011 76763 81211
$$ packed form
15818D7354m7069K9032l1458O653j2569M932j4695L6338j3277l3255J0685l6702
15806e4031O3594K1190k2367K3169n1116j5440L1134l4833l4039l2615L8803P6561
15794A0010M9341j9245m9198l5153L0068L743p788R856Q140l0103m2071J3099
15782e9301O762K6826L7965J3681k8704p6419l0181N1184J2606O1193l4K3323
15770C8901K6359K0867n7311k7238l4922J1200K3557J8354M3200j4737o262L1932
15758G3900m2126j8327l2979M006J1149o9158j14444L5095R6375n4934l7920L1150
15746a18213M773n0292O3353Q0218j3940j1826O165k6987R7708m002J4591l5027
15734F521m8852N8006O5076j5755l1278L3701Q6104M3888l4846o0554k5248M448
$$ plain form
15722 81211 2359 -10774 8332 53313 87357 153161 122488 34911 -1192 -12528 -28508 -43853
15710 -43853 -44334 -80150 -20883 4869 14447 -34360 -77053 -823 -61083 -81890 -6082 52139
15698 52139 79051 104904 74486 78365 -33860 -98221 -100454 -86971 -82093 -48247 11507 11622
15686 11622 11736 51513 55879 43935 -11553 -88507 -101995 -97504 -54386 -49205 -63563 33755 9225
15673 9225 -45551 -73478 -66146 -19642 1872 4000 19290 26767 11340 8540 20707 10181 -60810
15660 -60810 -138628 -182210 -184534 -70166 33686 40642 -79569 -129046 -57886 -49575 -27525 15668
15648 15668 -18025 -120664 -137030 -7077 26801 64436 19077 -29268 -78793 -86859 -16841
15637 -16841 16594 36141 32902 34054 51829 45947 29818 4348 12206 44998 94741 95651 31369
$$ packed form
15722H1211p8852j3133J9106M4981L4044O5804l0673q7577l6103j1336j5980j5345
15710d3853m81l5816N9267K5752R578m8807m2693P6230o0260k0807P5808N8221
15698E2139K6912K5853l0418L879j12225o4361k233J3483M878L3846N9754J15
15686A1622J14L9777M366j1944n5488p6954j3488M491M3118N181j4358R7318k4530
15673I225n4776k7927P332M6504K1514K128J5290P477j5427k800J2167j0526p0991
15660f0810p7818m3582k324J14368J03852O956j20211m9477P1160Q311K2050M3193
15648A5668l3693j02639j6366J29953L3878L7635m5359m8345m9525q066P0018
15637a6841L3435J9547l239J152J7775n882j6129k5470P858L2792M9743R10o4282
$$ plain form
15624 31369 6202 803 -44704 16739 55002 65149 -12865 -38497 42056 90059 63025 70859
15612 70859 60595 83237 101763 81317 66619 89276 42984 -32831 -63963 16571 83354 25119
15600 25119 -30384 17503 108933 94050 89916 19775 -47269 -89198 -13657 34026 23353 -3194
15588 -3194 -38462 -16936 -19363 -4591 -34688 -33233 -4790 -46849 -74650 -67773 709 13713
15576 13713 -7154 13718 -45970 -68628 -68709 -104570 -118236 -133297 -85434 -29169 2880 -5572
15564 -5572 -81970 -112486 -77047 -56824 -91556 -93310 -118031 -92458 -5880 -12310 -57152 -59938
15552 -59938 61477 27489 -130953 -155341 -121617 -120647 -108231 -129070 -115493 -107186 -61693 -106752
15540 -106752 -80778 -23261 16265 31742 13118 -88223 -104028 -56669 -9039 -39319 -63653
$$ packed form
15624C1369k5167n399m5507O1443L8263J0147p8014k5632Q0553M8003k7034P834
15612G0859j0264K2642J8526k0446j4698K2657m6292p5815l1132Q0534O6783n8235
15600B5119n5503M7887R1430j4883m134p0141o7044m1929P5541M7683j0673k6547
15588c194l5268K1526k427J4772l0097J455K8443m2059k7801O877O8482J3004
15576A3713k0867K0872n9688k2658q1l5861j3666j5061M7863N6265L2049q452
15564e572p6398l0516L5439K0223l4732j754k4721K5573Q6578o430m4842k786
15552e9938J21415l3988j58442k4388L3724R70J2416k0839J3577Q307M5493m5059
15540a06752K5974N7517L9526J5477j8624j01341j5805M7359M7630l0280k4334
$$ plain form
15529 -63653 -50691 -70575 -104773 -141077 -65614 37851 50760 6518 -38887 -1311 -23243
15518 -23243 -36946 -39985 54461 51556 -16345 -51749 16617 31721 62546 -5914 -37060 -101237
15506 -101237 -137934 -102262 -73183 -25386 21349 -45346 -60328 -24631 -56210 -97717 -122036
15495 -122036 -82679 -41473 -53512 16523 63435 52629 -54113 -4970 47337 104669 114351
15484 114351 149799 134978 101661 120533 84744 25991 9689 -49148 -133238 -66243 -3195
15473 -3195 -35410 -90661 -115135 -124720 -199701 -207985 -142580 -113192 -67184 -51701 -68536 -63074
15461 -63074 -93078 -118886 -166454 -156154 -110851 -73064 -85250 -132099 -166525 -230849 -199181 -73021
15449 -73021 -23912 -38024 -39292 -53546 -63353 -76486 -22037 -37190 -57338 -8837 -43985 -49474
$$ packed form
15529f3653J2962j9884l4198l6304P5463J03465J2909m4242m5405L7576k1932
15518b3243j3703l039R4446k905o7901l5404O8366J5104L0825o8460l1146o4177
15506a01237l6697L5672K9079M7797M6735o6695j4982L5697l1579m1507k4319
15495a22036L9357M1206j2039P0035M6912j0806j06742M9143N2307N7332R682
15484A14351L5448j4821l3317J8872l5789n8753j6302n8837q4090O6995O3048
15473c195l2215n5251k4474r585p4981q284O5405K9388M6008J5483j6835N462
15461f3074l0004k5808m7568J0300M5303L7787j2186m6849l4426o4324L1668J26160
15449g3021M9109j4112j268j4254r807j3133N4449j5153k0148M8501l5148n489
$$ plain form
15437 -49474 95499 100044 42777 -6900 -29161 -39065 25190 91726 63972 -26083 -82939 -107962
15425 -107962 -118567 -85817 17887 7899 18051 -24051 27593 71548 98143 132998 96524
15414 96524 82293 -40906 -64662 -84648 -125096 -74525 -18321 -17167 -58027 -85550 -138419 -118491
15402 -118491 -63290 20754 34346 49046 90678 112028 140352 81033 -31016 -110067 -90276
15391 -90276 -24763 -38462 16201 70960 49806 65238 -30997 -115996 -97645 -131254 -90392 -71510
15379 -71510 7431 75978 31786 -21535 -5015 -52058 -74287 -149682 -137278 -18839 21483
15368 21483 86553 54043 -9461 -67306 -75506 -39806 90442 76115 721 17164 -48299 -103892
15356 -103892 -74365 -63158 -16060 -12347 -2678 5980 6380 -26645 -112649 -79647 -65731 -80470
$$ packed form
15437d9474J44973M545n7267m9677k2261r904O4255O6536k7754r0055n6856k5023
15425a07962j0605L2750J03704r988J0152m2102N1644M3955K6595L4855l6474
15414I6524j4231j23199k3756j9986m0448N0571N6204J154m0860k7523n2869J9928
15402a18491N5201Q4044J3592J4700M1632K1350K8324n9319j12049p9051J9791
15391i0276O5513j3699N4663N4759k1154J5432r6235q4999J8351l3609M0862J8882
15379g1510P8941O8547m4192n3321J6520m7043k2229p5395J2404J18439M0322
15368B1483O5070l2510o3504n7845q200L5700J30248j4327p5394J6443o5463n5593
15356a03892K9527J1207M7098L713R669Q658M00l3025q6004L3002J3916j4739
$$ plain form
15344 -80470 -99651 -123375 -154518 -49444 -82514 -63823 -103247 -108111 -4048 19508 6683
15333 6683 -62914 -152511 -141905 -39586 -13426 -93718 -90907 -48531 -102468 -129459 -54771 15522
15321 15522 -25310 1123 -47545 -78290 -98521 -63447 -14995 15828 -35235 -45373 -5047 -34430
15309 -34430 -30819 -51738 -95053 -55203 -36908 -969 9425 -6424 -50956 -82833 -60898 -74713
15297 -74713 -11433 3029 -8838 -20896 -4324 -3622 34279 43965 76664 49073 -9102 -99118
15285 -99118 -132541 -127436 -85639 -53671 -113127 -91018 -16302 39827 80129 86288 113433 80597
15273 80597 103999 65838 16832 -2738 29876 26009 -16922 41840 98423 108523 104148 34630
15261 34630 -19838 -41871 -28009 -44690 -49167 -82547 -106337 -85769 -44960 -58807 -62672 -55128
$$ packed form
15344h0470j9181k3724l1143J05074l3070J8691l9424m864J04063K3556j2825
15333F683o9597q9597J0606J02319K6160q0292K811M2376n3937k6991P4688P0293
15321A5522m0832K6433m8668l0745k0231L5074M8452L0823n1063j0138M0326k9383
15309c4430L611k0919m3315L9850J8295L5939J0394j5849m4532l1877K1935j3815
15297g4713O3280J4462j1867j2058J6572P02L7901R686L2699k7591n8175r0016
15285i9118l3423N105M1797L1968n9456K2109P4716N6129M0302O159K7145l2836
15273H0597K3402l8161m9006j9570L2614l867m2931N8762N6583J0100m375o9518
15261C4630n4468k2033J3862j6681m477l3380k3790K0568M0809j3847l865P544
$$ plain form
15249 -55128 -100866 -128775 -147289 -118381 -177743 -119233 -99039 -71865 -22918 -47369 -48039 -86559
15237 -86559 -69198 -66351 -151540 -182789 -141758 -130335 -66561 9721 20257 -51555 -116195 -74291
15225 -74291 -73983 -50387 47666 90193 31059 -27699 -75977 -34854 -2357 41812 46856 79059
15213 79059 72435 50785 10627 -41022 -6046 19881 56662 59386 4818 25822 -11713 -30190
15201 -30190 15033 105287 135630 66216 57885 -10588 -58019 -18295 -20073 -27884 -28153 63806 -7202
15188 -7202 -111272 -98298 -171442 -202259 -62279 54530 2789 -56111 -61766 -79079 -64393
15177 -64393 -28361 32055 43008 18426 10479 -21497 45592 85046 22270 13353 29254 74636
15165 74636 76052 14590 -49986 18018 74281 73230 49558 12359 34119 -1529 -39502 -29446
$$ packed form
15249e5128m5738k7909j8514K8908n9362N8510K0194K7174M8947k4451o70l8520
15237h6559J7361K847q5189l1249M1031J1423O3774P6282J0536p1812o4640M1904
15225g4291L08K3596R8053M2527n9134n8758m8278M1123L2497M4169N044L2203
15213G9059o624k1650m0158n1649L4976K5927L6781K724n4568K1004l7535j8477
15201c0190M5223R0254L0343o9414q331o8473m7431L9724j778p811k69R1959p1008
15188g202j04070J2974p3144l0817J39980J16809n1741n8900n655j7313J4686
15177f4393L6032O0416J0953k4582p947l1976O7089L9454o2776q917J5901M5382
15165G4636J416o1462o4576O8004N6263j051k3672l7199K1760l5648l7973J0056
$$ plain form
15153 -29446 10378 41585 -7687 -19163 -29618 -103175 -98186 -84277 -13871 -4960 -17043 -18604
15141 -18604 -10153 -28577 -4811 51984 113791 65554 21471 47838 82403 49219 -43132 -48647
15129 -48647 23324 -17161 -72076 -124424 -179183 -205883 -143090 -157280 -120359 -73298 -35097 27347
15117 27347 -10031 -46048 -69590 -54751 -45795 68163 56574 14247 -961 75589 65384 8917
15105 8917 31309 -5168 -73499 -90971 -153404 -205593 -160531 -120829 -101938 -81527 -92630 -49174
15093 -49174 -51764 -26815 -19990 20114 76347 79577 96372 92418 51868 -12849 -36107 -16065
15081 -16065 -63520 -75645 -18737 -8568 -74577 -122578 -82686 45028 74436 97086 94120 141128
15069 141128 159923 157013 117911 43735 12769 90671 11931 -9126 -44612 -43455 25636 33432
$$ packed form
15153b9446L9824L1207m9272j1476j0455p3557M989J3909P0406Q911j2083j561
15141a8604Q451j8424K3766N6795O1807m8237m4083K6367L4565l3184r2351n515
15129d8647P1971m0485n4915n2348n4759k6700O2793j4190L6921M7061L8201O2444
15117B7347l7378l6017k3542J4839Q956J13958j1589m2327j5208P6550j0205n6467
15105H917K2392l6477o8331j7472o2433n2189M5062L9702J8891K0411j1103M3456
15093d9174k590K4949O825M0104N6233L230J6795l954m0550o4717k3258K0042
15081a6065m7455j2125N6908J0169o6009m8001L9892J27714K9408K2650k966M7008
15069A41128J8795k910l9102p4176l0966P7902p8740k1057l5486J157O9091P796
$$ plain form
15057 33432 23471 9513 -30383 -8010 73665 94347 56394 38938 -5123 9650 88048 26344
15045 26344 -132357 -112935 -90670 -104232 -29276 -51754 -15094 18787 9271 -34751 -47987 -32162
15033 -32162 55842 62577 -34542 -62826 -69985 -88322 -76212 -30387 43265 64897 73779 8581
15021 8581 1838 1325 62926 90405 58708 93986 67545 53259 122710 136173 102824 41921
15009 41921 56803 -18569 -61970 -107508 -91046 -43674 23187 25246 -24437 -2480 27995 80563
14997 80563 -5126 -14978 -70195 25219 45592 60545 105278 84325 101656 4473 -81341 -47848
14985 -47848 -1358 -28423 -13042 38395 76837 55132 85251 84906 73777 86761 131343 131564
14973 131564 56226 48289 53414 30814 -19874 -2043 21534 -29132 -51795 -33793 -55898 -30994
$$ packed form
15057C3432r961j3958l9896K2373Q1675K0682l7953j7456m4061J4773P8398o1704
15045B6344j58701J9422K2265j3562P4956k2478L6660L3881r516m4022j3236J5825
15033c2162Q8004O735r7119k8284p159j8337J2110M5825P3652K1632Q882o5198
15021H581o743n13O1601K7479l1697L5278k6441j4286O9451J3463l3349o0903
15009D1921J4882p5372m3401m5538J6462M7372O6861K059m9683K1957L0475N2568
14997H0563q5689r852n5217R5414K0373J4953M4733k0953J7331r7183q5814L3493
14985d7848M6490k7065J5381N1437L8442k1705L0119l45j1129J2984M4582K21
14973A31564p5338p937N125k2600n0688J7831K3577n0666k2663J8002k2105K4904
$$ plain form
14961 -30994 47040 83251 18689 -3866 -1113 -26405 -8345 -40985 2565 -108575 -186051 -136994
14949 -136994 -35348 -5966 -71594 -125392 -161993 -216217 -214666 -122990 -57581 -16009 -14915 23921
14937 23921 43711 -19710 -16243 -10130 -61070 -114716 -129573 -125721 -118255 -125558 -86187 -41956 -82066
14924 -82066 -95689 -119081 -114433 -54357 -30186 -21884 10533 -34612 -71365 -55267 -127296 -63045
14912 -63045 -1929 -13558 -8426 68919 102093 33298 -52043 -122081 -82785 -19604 -38777 -63290
14900 -63290 -16594 -2640 -75844 -136746 -123544 -139728 -65724 -68697 -98816 -147691 -107573 -33159
14888 -33159 -22538 867 54392 -5602 -75409 -147523 -180628 -173020 -170520 -197150 -177225 -139913
14876 -139913 -105741 -2861 -13747 -33473 -81187 -80300 -83082 -33751 10430 -9501 -36974 -13017
$$ packed form
14961c0994P8034L6211o4562k2555K753k5292J8060l2640M3550j11140p7476M9057
14949a36994J01646K9382o5628n3798l6601n4224J551R1676O5409M1572J094L8836
14937B3921J9790o3421L467O113n0940n3646j4857L852P466p303L9371M4231m0110
14924h2066j3623k3392M648O0076K4171Q302L2417m5145l6753J6098p2029O4251
14912f3045O1116j1629N132P7345L3174o8795q5341p0038L9296O3181j9173k4513
14900f3290M6696J3954p3204o0902J3202j6184P4004k973l0119m8875M0118P4414
14888c3159J0621K3405N3525n9994o9807p2114l3105P608K500k6630J9925L7312
14876a39913L4172J02880j0886j9726m7714Q87k782M9331M4181j9931k7473K3957
$$ plain form
14864 -13017 854 16414 66272 41578 42532 17608 44497 -53485 -110669 -117798 -52896 -71488
14852 -71488 -64216 -16449 -27758 -6487 56850 57674 21602 -10925 -39546 -30769 -26334 -16508 -54643
14839 -54643 -83595 -100331 -137626 -165232 -71237 -31012 -56964 -53579 -81103 -92345 -96774 -79829
14827 -79829 -85193 -30930 -25949 29165 23298 -39375 -46195 3823 67557 28268 21694 46403 32177
14814 32177 33714 -16949 -67749 -37683 19123 -70106 -113183 -43406 -28970 -65847 -15911 35447
14802 35447 37930 61474 19442 1021 -31873 -85944 -102704 -66807 11076 34918 -47243 -25813
14790 -25813 17176 -56776 -68080 -15699 9432 28478 -19297 -71140 -69048 -110742 -120918 -61083
14778 -61083 -12309 -10633 7991 -27061 31757 13401 -33298 -24726 886 12695 100337 127586
$$ packed form
14864a3017J3871J5560M9858k4694R54k4924K6889r7982n7184p129O4902j8592
14852g1488P272M7767j1309K1271O3337Q24l6072l2527k8621Q777M435R826l8135
14839e4643k8952j6736l7295k7606R3995M0225k5952L385k7524j1242m429J6945
14827g9829n364N4263M981N5114n867o2673o820N0018O3734l9289o574K4709j4226
14814C2177J537n0663n0800L0066N6806q9229m3077O9777J4436l6877M9936N1358
14802C5447K483K3544m2032j8421l2894n4071j6760L5897P7883K3842q2161K1430
14790b5813M2989p3952j1304N2381K5131J9046m7775n1843K092m1694j0176N9835
14778f1083M8774J676J8624l5052N8818j8356m6699Q572K5612J1809Q7642K7249
$$ plain form
14766 127586 86993 99149 110349 37190 21556 -31685 -33010 -58827 -65824 33825 51771 -3720
14754 -3720 26576 37741 25589 13315 -18300 -18832 -44806 3884 9835 -28354 -93189 -116620
14742 -116620 -91911 3056 11947 61537 1997 -21294 -107371 -124019 -73783 -107517 -33991 82234
14730 82234 52108 -17124 -121629 -70293 -119908 -133010 -52691 -9417 27218 96833 31996
14719 31996 14626 25414 37751 39275 -36613 -45978 -33554 -162052 -142156 -43787 72820 119095
14707 119095 93284 116720 92596 46925 49005 -6383 41866 87060 119117 203844 207959 154702
14695 154702 1288 -99268 -94878 -111221 -218967 -269507 -215413 -109218 -33567 -83524 -110121
14684 -110121 -42417 -57219 47833 69949 41899 -3443 -22638 -14623 94185 166531 145583
$$ packed form
14766A27586m0593J2156J1200p3159j5634n3241j325k5817o997R9649J7946n5491
14754c720L0296J1165j2152j2274l1615n32k5974M8690N951l8189o4835k3431
14742a16620K4709R4967Q891M9590n9540k3291q6077j6648N0236l3734P3526J16225
14730H2234l0126o9232j04505N1336m9615j3102Q0319M3274L6635O9615o4837
14719C1996j7370J0788J2337J524p5888r365J2424j28498J9896R8369J16607M6275
14707A19095k5811K3436k4124m5671K080n5388M8249M5194L2057Q4727M115n3257
14695A54702j53414j00556M390j6343j07746n0540N4094J06195P5651m9957k6597
14684a10121O7704j4802J05052K2116k8050m5342j9195Q015J08808P2346k0948
$$ plain form
14673 145583 64732 7559 1669 73339 75108 45891 71849 76441 78731 -39978 -22287 38786
14661 38786 67892 24160 5805 -44838 -133480 -88131 -33115 15830 47360 33733 29515 68946
14649 68946 73470 80341 16328 -31360 -121243 -135372 -71803 -46600 -13297 -76802 -109618 -16230
14637 -16230 5904 46648 98264 86063 66013 104649 95454 13076 19343 19567 108672 121782
14625 121782 150448 126821 55740 20757 68803 79387 3236 -33024 49239 31105 -50587
14614 -50587 -75197 -57533 -15612 28064 65148 38335 42953 22334 36307 49319 -18659 -76676
14602 -76676 -66214 -22207 2807 36081 33607 56145 62830 76025 51774 48930 60219 44386
14590 44386 30155 14538 90391 75031 101508 180894 155521 188934 148438 109966 86635 38962
$$ packed form
14673A45583q0851n7173n890P1670J769k9217K5958M592K290j18709J7691O1073
14661C8786K9106m3732j8355n0643q8642M5349N5016M8945L1530j3627m218L9431
14649F8946M524O871o4013m7688q9883j4129O3569K5203L3303o3505l2816R3388
14637a6230K2134M0744N1616j2201k0050L8636r195q2378O267K24Q9105J3110
14625A21782K8666k3627p1081l4983M8046J0584p6151l6260Q2263j8134q1692
14614e0587k4610J7664M1921M3676L7084k6813M618k0619J3973J3012o7978n8017
14602g6676J0462M4007K5014L3274k474K2538O685J3195k4251k844J1289j5833
14590D4386j4231j5617P5853j5360K6477P9386k5373L3413m0496l8472k3331m7673
$$ plain form
14578 38962 -13354 -27738 -32521 -1034 72866 9892 -55861 -91956 -107640 -71560 -51856 -77147
14566 -77147 -62344 -107947 -126735 -98288 -106121 -105922 -116268 -44775 45241 -5282 -18118 -43577
14554 -43577 -130633 -126506 -69229 -77081 -139781 -96665 -34689 -29817 -17206 -39064 -35334 -5246
14542 -5246 15270 -59826 -57609 -75328 -149897 -98981 -70590 -98899 -17433 257 -71981 -6335
14530 -6335 70632 99140 51161 -12882 8143 -2032 -78186 -96883 -107673 -125367 -151175 -127305
14518 -127305 -65483 -82901 -53581 -68807 -57087 -31940 -46879 -35928 -1674 -105758 -169137
14507 -169137 -186847 -117526 -2687 5959 -13002 -25194 -61211 -54282 -74361 -82695 13342 63058
14495 63058 2096 -41042 -94868 -75473 -92678 -112178 -102062 -110357 -63615 12453 35993 24334
$$ packed form
14578C8962n2316j4384m783L1487P3900o2974o5753l6095j5684L6080J9704k5291
14566g7147J4803m5603j8788K8447p833J99j0346P1493R0016n0523j2836k5459
14554d3577q7056M127N7277p852o2700M3116O1976M872J2611k1858L730L0088
14542e246K0516p5096K217j7719p4569N0916K8391k8309Q1466J7690p2238O5646
14530f335P6967K8508m7979o4043K1025j0175p6154j8697j0790j7694k5808K3870
14518a27305O1822j7418K9320j5226J1720K5147j4939J0951L4254j04084o3379
14507a69137j7710O9321J14839Q646j8961j2192l6017O929k0079q334R6037M9716
14495F3058o0962m3138n3826J9395j7205j9500J0116q295M6742P6068K3540j1659
$$ plain form
14483 24334 -48891 -104182 -105513 -66918 -21302 -28491 -35800 -96349 -141312 -83544 -112642 -140251
14471 -140251 -126883 -87877 -80999 -143601 -134159 -78638 -26413 -18809 -46296 -43781 -19165 -30743
14459 -30743 -24365 11908 42507 82702 69268 49163 64609 78387 54054 63523 50414 2082
14447 2082 7235 -93889 -158075 -133429 -58958 -62907 -39185 -32060 -58679 -120164 -60611 47658
14435 47658 34839 36470 -14118 -42169 -26839 9113 -45909 -65252 -2612 -3798 11564 32987
14423 32987 22752 -75615 -98512 -27331 20130 -15152 -21247 -18762 -1025 -20474 22835 13724
14411 13724 -29133 -18586 65466 84096 5089 -31466 -20376 -24528 -44343 -37082 -37286 6890
14399 6890 -81694 -206510 -176320 -149945 -97525 -8636 -5571 -58269 -112141 -128703 -90168 -94915
$$ packed form
14483B4334p3225n5291j331L8595M5616p189p309o0549m4963N7768k9098k7609
14471a40251J3368L9006O878o2602R442N5521N2225P604k7487K515K4616j1578
14459c0743O378L6273L0599M0195j3434k0105J5446J3778k4333R469j3109m8332
14447B082N153j01124o4186K4646P4471l949K3722P125k6619o1485N9553J08269
14435D7658j2819J631n0588k8051J5330L5952n5022j9343O2640j186J5362K1423
14423C2987j0235r8367k2897P1181M7461l5282o095K485J7737j9449M3309r111
14411A3724m2857J0547Q4052J8630p9007l6555J1090m152j9815P261k04M4176
14399F890q8584j24816L0190K6375N2420Q8889L065n2698n3872j6562L8535m747
$$ plain form
14387 -94915 -92174 -69063 6044 48287 34009 -6785 -45557 -46700 15632 -50951 -116584 -171532
14375 -171532 -135799 -62719 -76961 -217442 -304298 -277430 -253840 -213187 -121718 -24920 6087
14364 6087 14629 -28435 -51129 -55938 -69237 -41309 -62363 -131057 -149304 -110856 -57227 -50699
14352 -50699 -99634 -91004 -129046 -125684 -106087 -95918 -85093 -86959 -93367 -41465 24260 9188
14340 9188 -40328 -69072 -31693 6153 909 -56363 -77477 -35040 1649 72734 72716 7433 5811
14327 5811 64514 39916 -27715 -36009 -3328 22118 103687 90520 47540 45988 26818 36643
14315 36643 32971 79065 97630 106521 97022 5709 -31012 1411 -19450 -46573 -28122 -26429
14303 -26429 -41834 -28211 -73304 -80051 -17353 -14067 -54127 -42226 -17610 4111 35559 -9554
$$ packed form
14387i4915K741K3111P5107M2243j4278m0794l8772j143O2332o6583o5633n4948
14375a71532L5733P3080j4242j40481q6856K6868K3590M0653R1469R6798L1007
14364F087Q542m3064k2694m809j3299K7928k1054o8694j8247L8448N3629O528
14352e0699m8935Q630l8042L362J9597J0169J0825j866o408N1902O5725j5072
14340I188m9516k8744L7379L7846n244n7272k1114M2437L6689P1085j8o5283j622
14327E811N8703k4598o7631q294L2681K5446Q1569j3167m2980j552j9170R825
14315C6643l672M6094J8565Q891r499r1313l6721L2423k0861k7123J8451J693
14303b6429j5405J3623m5093o747O2698L286m0060J1901K4616K1721L1448m5113
$$ plain form
14291 -9554 -30462 -20410 -75865 -135628 -131772 -116856 -26577 30632 91151 49714 43738 -38601
14279 -38601 -36855 -16085 22410 -7326 -10008 -72567 -62662 37330 98321 118754 138694 -16500
14267 -16500 -146452 -198160 -111817 4417 2463 64757 107299 8741 -28047 -576 -44010
14256 -44010 -50946 -12420 -82631 -163943 -138164 -125059 -85792 -62423 -25089 10664 29919 22040
14244 22040 -29207 -34517 -48506 -2562 -9434 -62411 -129095 -173199 -219125 -132264 -19945 -36818
14232 -36818 -66324 -22627 -46587 -83643 -72908 -143050 -144402 -83237 31643 6639 -70105 -23749
14220 -23749 44723 59117 110502 70554 37474 65403 25781 -61422 -20142 -20584 -44069 -45447
14208 -45447 -91744 -102903 -34227 -3975 -16311 -42924 -72776 -72604 -57670 -15632 10751 1307
$$ packed form
14291i554k0908J0052n5455n9763L856J4916R0279N7209O0519m1437n976q2339
14279c8601J746K0770L8495k9736k682o2559R905R9992O0991K0433J9940j55194
14267a6500j29952n1708Q6343J16234j954O2294M2542r8558l6788K7471m3434
14256d4010o936L8526p0211q1312K5779J3105L9267K3369L7334L5753J9255p879
14244B2040n1247n310j3989M5944o872n2977o6684m4104m5926Q6861J12319j6873
14232c6818k9506M3697k3960l7056J0735p0142j352O1165J14880k5004p6744M6356
14220b3749O8472J4394N1385l9948l3080K7929l9622q7203M1280m42k3485j378
14208d5447m6297j1159O8676L0252j2336k6613k9852J72J4934M2038K6383r444
$$ plain form
14196 1307 -86758 -17805 51519 -10414 -247 -35068 -89933 -54689 -65770 -112559 -96623 -23078
14184 -23078 37251 2667 -73164 -54629 9209 81340 -30795 -144701 -59146 22162 128829
14173 128829 141701 110770 49712 56274 73068 -7523 -35769 26349 45450 73058 84985 105586
14161 105586 139266 11069 -87647 -108368 -99749 -65275 -67860 -89350 -65509 -111181 -111388 -70309
14149 -70309 -36009 58291 131423 36874 -12406 -46542 -91780 -58086 -34231 -18976 2874 -19336
14137 -19336 12127 18086 3134 8446 12647 -24197 9161 23794 64701 91333 43887 -42067
14125 -42067 -65926 -80472 -123918 -41364 30303 53806 -50995 -92647 -73091 -43171 -42188 -9026
14113 -9026 20552 26330 -28350 -42907 -45088 10930 -6988 3306 12555 -7952 22425 113269
$$ packed form
14196A307q8065O8953O9324o1933J0167l4821n4865L5244j1081m6789J5936P3545
14184b3078O0329l4584p5831J8535O3838P2131j12135j13906Q5555Q1308J06667
14173A28829J2872l0931o1058O562J6794q0591k8246O2118J9101K7608J1927K0601
14161A05586L3680j28197r8716k0721Q619L4474k585k1490K3841m5672k07M1079
14149g0309L4300R4300P3132r4549m9280l4136m5238L3694K3855J5255K1850k2210
14137a9336L1463N959j4952N312M201l6844L3358J4633M0907K6632m7446q5954
14125d2067k3859j4546m3446Q2554P1667K3503j04801m1652J9556K9920R83L3162
14113i026K9578N778n4680j4557k181N6018j7918J0294R249k0507L0377R0844
$$ plain form
14101 113269 142748 80244 93158 118726 3397 -93761 -116178 -15754 97144 35868 -45639
14090 -45639 -59636 -26951 -86802 -126806 -112462 -103857 -106161 -157220 -139261 -117791 -110440 -94186
14078 -94186 -43959 -12651 -39118 -60621 -15312 -30089 -50120 -3020 -16773 -94969 -130781 -125970
14066 -125970 -105469 -60994 -21902 -39477 -48534 -37812 -4480 -3162 -40274 -46470 -28235 5885
14054 5885 29922 2461 -61251 -103635 22463 52719 3488 31806 77409 35621 -51774 33853
14042 33853 37330 -12915 51367 100878 68376 28492 67065 107471 119183 31454 14309 2424
14030 2424 -16598 -17418 18350 84381 111671 58734 -15062 -13872 -5260 24165 15545 -37956 -19530
14017 -19530 15337 -45505 -82153 -177921 -202363 -107243 -14887 6948 -36017 -32278 -26096 2240
$$ packed form
14101A13269K9479o2504J2914K5568j15329r7158k2417J00424J12898o1276q1507
14090d5639j3997L2685n9851m0004J4344Q605k304n1059J7959K1470P351J6254
14078i4186N0227L1308k6467k1503M5309j4777k0031M7100j3753p8196l5812M811
14066a25970K0501M4475L9092j7575r057J0722L3332J318l7112o196J8235L4120
14054E885K4037k7461o3712m2384J26098L0256m9231K8318M5603m1788q7395Q5627
14042C3853L477n0245O4282M9511l2502l9884L8573M0406J1712q7729j7145j1885
14030B424j9022q20L5768O6031K7290n2937p3796J190Q612K9425q620n3501J8426
14017a9530L4867o0842l6648r5768k4442R5120R2356K1835m2965L739O182K8336
$$ plain form
14005 2240 -36749 -67651 -66733 8446 -10018 -87972 -120760 -30267 -39498 -105901 -216567 -239158
13993 -239158 -192469 -170943 -141013 -104603 -26926 -29772 -56144 -47913 23538 34978 -21090 -16984
13981 -16984 -74746 -23194 5019 -40705 59564 42673 -13280 -11692 -37827 -182606 -183436 -195053
13969 -195053 -127535 -97612 -103788 -79273 -40894 -18728 -67181 -48347 -84391 -106560 -134918 -77681
13957 -77681 -41669 -11022 33317 26648 26444 3723 63296 26129 -29557 -40629 8858 34597
13945 34597 31264 116594 102187 69021 110018 147233 129911 78343 -28743 -64733 -19112 14687
13933 14687 23405 29831 533 -8927 -6278 -73399 -126568 -104482 -98227 -97864 -51165 -37072 -23092
13920 -23092 8565 70678 7205 -79714 -60520 -16420 -53145 -98009 -189399 -175671 -70234
$$ packed form
14005B240l8989l0902R18P5179j8464p7954l2788R0493r231o6403j10666k2591
13993b39158M6689K1526K9930L6410P7677k846k6372Q231P1451J1440n6068M106
13981a6984n7762N1552K8213m5724J00269j6891n5953J588k6135j44779q30j1617
13969a95053O7518K9923o176K4515L8379K2166m8453J8834l6044k2169k8358N7237
13957g7681L6012L0647M4339o669k04k2721N9573l7167n5686j1072M9487K5739
13945C4597l333Q5330j4407l3166M0997L7215j7322n1568j07086l5990M5621L3799
13933A4687Q718O426k9298r460K649o7121n3169K2086O255L63M6699J4093J3980
13920b3092L1657O2113o3473q6919J9194M4100l6725m4864r1390J3728J05437
$$ plain form
13909 -70234 48577 43424 26765 -11251 -44655 -113693 -53981 14739 64216 107707 109378 92954
13897 92954 101754 56820 84808 141756 123046 65404 20405 -11551 -52981 -124428 -65955 -13194
13885 -13194 11990 -25662 -91903 -105605 -142492 -118414 -146360 -134967 -104664 -86996 -38997 315
13873 315 20304 -18899 -57184 -5384 5529 -81233 -184035 -192533 -143908 -68851 -77057 -85835
13861 -85835 -36467 22256 -31092 -105852 -60964 16881 73329 32476 75892 90594 100782 53279
13849 53279 26626 -46471 -52042 15384 26589 25826 18056 -38066 -70573 -25647 -41363 15030
13837 15030 33274 60712 36698 12788 13393 -42980 -64489 28804 20020 -12339 -18855 46827
13825 46827 84279 58140 11318 1567 -502 146275 115405 -20861 23526 1853 -12745 -18596
$$ packed form
13909g0234J18811n153j6659l8016l3404o9038N9712O8720M9477M3491J671j6424
13897I2954Q800m4934K7988N6948j8710n7642m4999l1956m1430p1447N8473N2761
13885a3194K5184l7652o6241j3702l6887K4078k7946J1393L0303J7668M7999L9312
13873C15J9989l9203l8285N1800J0913q6762j02802q498M8625P5057q206q778
13861h5835M9368N8723n3348p4760M4888P7845N6448m0853M3416J4702J0188m7503
13849E3279k6653p3097n571O7426J1205p63p770n6122l2507M4926j5716N6393
13837A5030J8244K7438k4014k3910O05n6373k1509R3293q784l2359o516O5682
13825D6827L7452k6139m6822r751k069J46777l0870j36266M4387k1673j4598n851
$$ plain form
13813 -18596 -40164 -20714 -100654 -94763 -914 -23291 -130983 -146552 -126112 -71614 -27631 34791
13801 34791 39251 -7495 -31617 23918 13163 -96859 -134222 -100795 -72728 -48187 -65688 -60183
13789 -60183 -47867 -82917 -118282 -42378 41396 47665 -16911 -17469 -102039 -89401 30311 114848
13777 114848 160832 178276 176152 90464 84916 110326 69914 114294 133135 162963 135348 96538
13765 96538 99230 82658 53225 43869 -1654 3321 8386 -23122 -76764 -40979 -116829 -166462
13753 -166462 -149894 -90559 -95735 -92088 -96831 -108607 -100881 -61868 20015 64092 47498 -12855
$$ packed form
13813a8596k1568J9450p9940N891R3849k2377j07692j5569K0440N4498M3983O2422
13801C4791M460m6746k4122N5535j0755j10022l7363L3427K8067K4541j7501N505
13789f0183J2316l5050l5365P5904Q3774O269o4576n58q4570J2638J19712Q4537
13777A14848M5984J7444k124q5688n548K5410m0412M4380J8841K9828k7615l8810
13765I6538K692j6572k9433r356m5523M975N065l1508n3642L5785p5850m9633
13753a66462J6568N9335n176L647m743j1776P726L9013Q1883M4077j6594o0353
$$ [...]
##END NTUPLES=NMR SPECTRUM
##END=
