##TITLE=Analysis number 329747
Compound Code cc 04109
Project Code adrs
Chemist Name stores
##JCAMPDX= 6.0         $$ Bruker NMR JCAMP-DX V2.0
##DATA TYPE= NMR SPECTRUM
##DATA CLASS= NTUPLES
##ORIGIN= Bruker BioSpin GmbH
##OWNER= nmr
$$ XWIN-NMR		Version 3.5
$$ Wed Sep 26 10:49:27 2007 GMT Daylight Time (UT+1h)  MAYBRIDGE\nmr@NMR_250MHZ
##.OBSERVE FREQUENCY= 250.131544655141
##.OBSERVE NUCLEUS= ^1H
##.ACQUISITION MODE= SIMULTANEOUS (DQD)
##.ACQUISITION SCHEME= undefined
##.AVERAGES= 16
##.DIGITISER RES= 18
##SPECTROMETER/DATA SYSTEM= dpx250
##.PULSE SEQUENCE= zg30
##.SOLVENT NAME= CDCl3
##.SHIFT REFERENCE= (INTERNAL, CDCl3, 0, 16.522)
##AUDIT TRAIL= $$ (NUMBER, WHEN, WHO, WHERE, WHAT)
$$ ##TITLE= Audit trail, XWIN-NMR		Version 3.5
$$ ##JCAMPDX= 5.01
$$ ##ORIGIN= Bruker BioSpin GmbH
$$ ##OWNER= nmr
$$ C:\u/data/dgb/nmr/ADRS/2420/pdata/1/auditp.txt
$$ ##AUDIT TRAIL=  $$ (NUMBER, WHEN, WHO, WHERE, WHAT)
(   1,<2007-09-26 10:49:01.92 +100>,<MAYBRIDGE\nmr>,<NMR_250MHZ>,
      <created by zg, POWCHK disabled, PULCHK disabled
       configuration hash MD5:
       76 6E 9A 78 1E 09 19 81 EC 84 63 8F B0 6A 59 2D
       data hash MD5: 64K
       C4 31 CC 28 F9 49 67 A1 BD ED 88 00 04 D3 EE BB>)
(   2,<2007-09-26 10:49:17.03 +100>,<MAYBRIDGE\nmr>,<NMR_250MHZ>,
      <Start of raw data processing
       ef LB = 0.3 FT_mod = 6 PKNL = 1 SI = 32K 
       data hash MD5: 32K
       F9 42 8F 8A CE 63 14 A8 BB 7F 62 29 A9 E3 BF 62>)
(   3,<2007-09-26 10:49:19.21 +100>,<MAYBRIDGE\nmr>,<NMR_250MHZ>,
      <apk 
       data hash MD5: 32K
       43 2D 33 D7 49 33 AD 88 17 42 B4 AA A0 02 4D 3C>)
(   4,<2007-09-26 10:49:20.03 +100>,<MAYBRIDGE\nmr>,<NMR_250MHZ>,
      <abs ABSG = 5 
       data hash MD5: 32K
       4F DD B8 A6 CE 30 58 0B 68 28 C8 D0 4F 39 7F 64>)
$$ ##END=
$$ 
$$ hash MD5
$$ 6F 9B 8B 54 6F 81 12 B7 7E B4 D4 F8 7D 41 91 53
##$RELAX= 
##$RELAX= 
##$RELAX= 
##$RELAX= 
##$RELAX= 
##$RELAX= 
##$RELAX= 
$$ Bruker specific parameters
$$ --------------------------
##$DU= <C:\u>
##$EXPNO= 2420
##$NAME= <ADRS>
##$PROCNO= 1
##$TYPE= <nmr>
##$USER= <dgb>
##$AMP= (0..31)
100 100 100 100 100 100 100 100 100 100 100 100 100 100 100 100 100 100 
100 100 100 100 100 100 100 100 100 100 100 100 100 100 
##$AQSEQ= 0
##$AQ_mod= 3
##$AUNM= <au_zg>
##$AUTOPOS= <44 >
##$BF1= 250.13
##$BF2= 250.13
##$BF3= 250.13
##$BF4= 250.13
##$BF5= 500.13
##$BF6= 500.13
##$BF7= 500.13
##$BF8= 500.13
##$BYTORDA= 1
##$CFDGTYP= 0
##$CFRGTYP= 5
##$CHEMSTR= <none>
##$CNST= (0..31)
1 1 145 1 1 1 1 1 1 1 1 1 1 1 1 1 1 1 1 1 1 1 1 1 1 1 1 1 1 1 1 1 
##$CPDPRG= <>
##$CPDPRG1= <>
##$CPDPRG2= <>
##$CPDPRG3= <>
##$CPDPRG4= <mlev>
##$CPDPRG5= <mlev>
##$CPDPRG6= <mlev>
##$CPDPRG7= <mlev>
##$CPDPRG8= <mlev>
##$CPDPRGB= <>
##$CPDPRGT= <>
##$D= (0..31)
0 1 0 0 0 0 0 0 0 0.06 0 0 0 0 0 0 0.0002 0 0 0 0 0 0 0 0 0 0 0 0 0 0 
0 
##$DATE= 1190800140
##$DBL= (0..7)
120 120 120 120 120 120 120 120 
##$DBP= (0..7)
150 150 150 150 150 150 150 150 
##$DBP07= 0
##$DBPNAM0= <>
##$DBPNAM1= <>
##$DBPNAM2= <>
$$ [...]
##$SUBNAM7= <"">
##$SUBNAM8= <"">
##$SUBNAM9= <"">
##$SW= 20.6930455092707
##$SWIBOX= (0..15)
0 0 3 0 0 0 0 0 0 0 0 0 0 0 0 0 
##$SW_h= 5175.983436853
##$TD= 65536
##$TD0= 1
##$TE= 296.16
##$TE2= 300
##$TE3= 300
##$TEG= 300
##$TL= (0..7)
0 120 120 120 120 120 120 120 
##$TP= (0..7)
150 150 150 150 150 150 150 150 
##$TP07= 0
##$TPNAME0= <>
##$TPNAME1= <>
##$TPNAME2= <>
##$TPNAME3= <>
##$TPNAME4= <>
##$TPNAME5= <>
##$TPNAME6= <>
##$TPNAME7= <>
##$TPOAL= (0..7)
0.5 0.5 0.5 0.5 0.5 0.5 0.5 0.5 
##$TPOFFS= (0..7)
0 0 0 0 0 0 0 0 
##$TUNHIN= 0
##$TUNHOUT= 0
##$TUNXOUT= 0
##$USERA1= <user>
##$USERA2= <user>
##$USERA3= <user>
##$USERA4= <user>
##$USERA5= <user>
##$V9= 5
##$VALIST= <valist>
##$VCLIST= <CCCCCCCCCCCCCCC>
##$VD= 0
##$VDLIST= <DDDDDDDDDDDDDDD>
##$VPLIST= <PPPPPPPPPPPPPPP>
##$VTLIST= <TTTTTTTTTTTTTTT>
##$WBST= 1024
##$WBSW= 4
##$XGAIN= (0..3)
0 0 0 0 
##$XL= 0
##$YL= 0
##$YMAX_a= 663922
##$YMIN_a= -948532
##$ZGOPTNS= <>
##$ZL1= 120
##$ZL2= 120
##$ZL3= 120
##$ZL4= 120
##$ABSF1= 16.522
##$ABSF2= -4.171173
##$ABSG= 5
##$ABSL= 3
##$ALPHA= 0
##$AQORDER= 0
##$ASSFAC= 0
##$ASSFACI= 0
##$ASSFACX= 0
##$ASSWID= 0
##$AUNMP= <proc_1d>
##$AZFE= 0.1
##$AZFW= 0.1
##$BCFW= 0
##$BC_mod= 0
##$BYTORDP= 0
##$COROFFS= 0
##$CY= 12.5
##$DATMOD= 1
##$DC= 0
##$DFILT= <>
##$DTYPP= 0
##$F1P= 14.0000005364418
##$F2P= -0.99999901652339
##$FCOR= 0.5
##$FTSIZE= 32768
##$FT_mod= 6
##$GAMMA= 0
##$GB= 0
##$INTBC= 1
##$INTSCL= 1
##$ISEN= 128
##$LB= 0.3
##$LEV0= 0
##$LPBIN= 0
##$MAXI= 10000
##$MC2= 0
##$MEAN= 0
##$ME_mod= 0
##$MI= 0
##$NCOEF= 0
##$NC_proc= -3
##$NLEV= 6
##$NOISF1= 0
##$NOISF2= 0
##$NSP= 0
##$NTH_PI= 0
##$NZP= 0
##$OFFSET= 16.522
##$PC= 1
##$PHC0= 169.3449
##$PHC1= -29.26645
##$PH_mod= 1
##$PKNL= yes
##$PPARMOD= 0
##$PSCAL= 4
##$PSIGN= 0
##$REVERSE= no
##$SF= 250.13
##$SI= 32768
##$SIGF1= 0
##$SIGF2= 0
##$SINO= 400
##$SIOLD= 32768
##$SREGLST= <1H.CDCl3>
##$SSB= 0
##$STSI= 32768
##$STSR= 0
##$SW_p= 5175.98343685301
##$SYMM= 0
##$S_DEV= 0
##$TDeff= 65536
##$TDoff= 0
##$TI= <Analysis number 999999
Compound Code 99
Book Reference 9
Project Code 9>
##$TILT= no
##$TM1= 0
##$TM2= 0
##$TOPLEV= 0
##$USERP1= <user>
##$USERP2= <user>
##$USERP3= <user>
##$USERP4= <user>
##$USERP5= <user>
##$WDW= 1
##$XDIM= 32768
##$YMAX_p= 515132445
##$YMIN_p= -2201471
$$ End of Bruker specific parameters
$$ ---------------------------------
##NTUPLES= NMR SPECTRUM
##VAR_NAME=  FREQUENCY,     SPECTRUM/REAL,   SPECTRUM/IMAG
##SYMBOL=    X,             R,               I
##VAR_TYPE=  INDEPENDENT,   DEPENDENT,       DEPENDENT
##VAR_FORM=  AFFN,          ASDF,            ASDF
##VAR_DIM=   32768,         32768,           32768
##UNITS=     HZ,            ARBITRARY UNITS, ARBITRARY UNITS
##FACTOR=    0.157963299565203, 1,           1
##FIRST=     4132.6476996994, 0,             0
##LAST=      -1043.33573715361, 0,           0
##MIN=       -1043.33573715361, -2201471,    0
##MAX=       4132.6476996994, 515132445,     0
$$ Real data points
##PAGE= N=1
##DATA TABLE= (X++(R..R)), XYDATA
$$ [...]
23707 13406 7763 3116 -180 -10728 -10780 -813 2525 -3635 4086 1036 416 7119 5188 -3209 -8569
23692 -8569 -7107 -5653 -3822 -15686 -28019 -23233 -25077 -33618 -31027 -14530 -9224 -16685 -19159 -23207
23678 -23207 -17003 -21155 -25188 -33647 -21266 -19786 -21037 -16051 -21806 -16153 -23877 -18225 -19249 -8620
23664 -8620 -16791 -21420 -21719 -26858 -22204 778 6941 -2160 -3835 -8568 -7609 -13846 -11600 -5627 -8052
23649 -8052 -5339 -15143 -18871 -25255 -10895 -7438 -9965 -8206 -12828 -33858 -34361 -15191 11953 14583
23635 14583 -11594 -11425 -7334 -16683 -16156 -5380 5379 9932 5300 -7301 -12297 -17226 -17415 -14962
23621 -14962 -17514 -19103 -13066 -10249 -24905 -38355 -38359 -28162 -26036 -32503 -24179 -20879 -15478 -4312
23607 -4312 143 -3622 -1041 -4919 1951 7304 -1241 -936 1083 -3090 -795 6207 8862 4235 -986
23592 -986 -450 -3411 -654 895 -6163 -12973 -7281 -14870 2576 3822 4722 6807 5655 -4836 -13128
23577 -13128 -12697 -12085 -5230 -9533 6838 29267 18407 11511 -6441 -8563 -4478 -2477 -13185 -5849
23563 -5849 -4919 -9651 -19364 -27069 -33249 -47086 -46790 -38026 -17503 -13692 -18820 -22696 -45412 -44913 -28174
23548 -28174 -28956 -32170 -35646 -30133 -20822 -18938 -15579 -16579 -10660 4728 -4764 -14376 -11303 -14127
23534 -14127 -11357 -6275 -4407 -15754 -18294 -12333 -7396 -12119 -14076 -11493 -12005 -32587 -60707 -58485
23520 -58485 -51011 -47907 -59212 -41510 -18675 -11601 -8667 -16809 -4797 -9983 -11868 -13814 -6373
23507 -6373 -7222 -22056 -19919 -15838 -23924 -25615 -19130 -5098 6353 -2323 -17726 -14110 -16816 -34938
23493 -34938 -47927 -37639 -26485 -23640 -19577 -23901 -24380 -21916 -7545 556 -1993 -5848 -18277
23480 -18277 -20360 -19634 -16819 2232 19792 17029 8872 7344 -441 1116 -1148 -7900 -6212 -10036
23466 -10036 -8504 -19390 -23090 -22949 -18730 -13828 -12451 -12272 -5265 2157 -10319 -21710 -9395 4893
23452 4893 14068 5265 11 -182 -14629 -18883 -18342 -19969 -24129 -31571 -26488 -20428 -12359 -7564 -12067
23437 -12067 -7012 -14010 -30626 -27404 -20408 -14233 -11478 -15205 -15874 -19956 -21236 -27018 -35001 -23182
23423 -23182 -12334 -11292 -10455 -21722 -23073 -15791 -7243 -9608 -12648 -6029 -1154 -5451 -6779 11477
23409 11477 5845 -4319 -3329 -6405 -2818 -4772 187 -636 -2572 -5946 -15416 1225 4957 -3167
23395 -3167 -18833 -31635 -28149 -19061 -2035 7119 11297 12047 5368 10320 7541 4937 -11126 -22784
23381 -22784 -25397 -13204 -3795 -5556 -5158 -2692 -7213 -7563 -8346 -5457 -4950 -6143 -1334 -2707 -7032
23366 -7032 -5197 -6388 -1517 -3071 -8856 -14427 -21491 -19549 -21478 -17850 -17223 -14081 -19516 -27154 -24375
23351 -24375 -19237 -16492 -21889 -9737 -4171 -10348 -22441 -20280 -31034 -29591 -14213 -13156 -30879
23338 -30879 -34618 -26859 -11006 -3827 1668 -4443 -4168 -7598 -8825 -20580 -25196 -11169 2654 6832
23324 6832 3801 -4386 -16532 -12385 -10233 -12252 -15795 -12628 7897 19255 7513 17 2251 -7037
23310 -7037 -23806 -26059 -12585 -4818 11512 14441 -494 -21896 -35405 -39701 -49710 -39434 -24382
23297 -24382 -9995 2177 5118 1179 1243 88 5698 9966 -514 -3243 1090 -6554 -15807 -10529
23283 -10529 -17117 -26826 -28048 -16876 -2389 -5574 -7115 -14486 -21612 -18872 -33906 -26777 -20670 -23969
23269 -23969 -30848 -34553 -31752 -27659 -28096 -19002 -12678 861 7186 1132 -5920 -4160 10967 14367
23255 14367 6331 -5572 -3364 -7540 -10186 -10015 -23008 -29254 -21248 -14669 -15107 -21368 -23932 -27353
23241 -27353 -29460 -33268 -21967 -9212 -1577 -1808 -3 1515 3298 -2821 -9260 -15387 -22412 -7666
23227 -7666 300 10974 -7196 -28864 -28037 -29550 -30009 -27493 -17289 -10270 -18606 -26412 -32489 -17712
23213 -17712 1359 -3476 -14107 -24396 -18953 -16916 -12848 -14370 -11687 -32217 -47292 -33813 -23622
23200 -23622 -19659 -16321 -26903 -21236 -17971 -20287 -23986 -32142 -28321 -16648 -7168 11834 9695 6823
23186 6823 3153 -21082 -28087 -15395 -8464 -25299 -37351 -44998 -40923 -14470 -7689 -7382 -4050 -6920
23172 -6920 -15588 -19957 -23304 -13986 -14963 -11296 -5045 -13162 -12013 -15674 -24479 -23464 -12522 -7711 -5321
23157 -5321 -7857 -7096 -8186 -12495 -24881 -24581 -22062 -18195 -19956 -5211 6673 4052 -2951 -5180
23143 -5180 7224 4216 6726 16051 17035 4768 8951 4067 3458 -5138 -2137 2238 1882 -16423 -29630
23128 -29630 -29293 -16029 -13510 -15158 -20902 -24422 -31254 -23524 -7230 -8943 -15892 -33603 -17320 -9322
23114 -9322 -17631 -23661 -19446 -24840 -35442 -38813 -34174 -23354 -15983 -6611 -5836 397 -4229 -13278
23100 -13278 -6477 2871 3648 -3869 -2022 5111 -2063 -18283 -34183 -38256 -35597 -33310 -25732 -21281
23086 -21281 -20894 -25598 -20716 -11875 -14560 -7443 10111 12597 7735 -6337 -1182 13125 12287 23544
23072 23544 25606 12808 -3355 -3851 2454 10313 9116 -3911 -15740 -18466 -8037 -1413 -3553
23059 -3553 -1683 -3238 -14079 -12836 -2090 -7934 -20280 -28453 -7043 -15711 -28684 -16753 -10130
23046 -10130 -24140 -24998 -26480 -17473 -12858 -14168 -12880 -7433 -13490 -29455 -31827 -20838 -22118 -19581
23032 -19581 -9820 -12208 -956 4854 11785 1893 -4221 -423 -9422 -17924 -18084 -22481 -13803 -30916
23018 -30916 -34893 -20048 -15146 -24153 -21451 -28261 -17298 -5767 2386 3445 1072 -2712 -8947 770
23004 770 13362 18186 20679 8673 -2299 -6806 -2906 5556 -1563 -5850 -19252 -22320 -22863 -12817
22990 -12817 231 -2613 -15513 -37150 -49789 -54965 -48627 -29203 -16674 -23611 -37424 -28436 -25623
22977 -25623 -22744 -10607 -11495 -9842 -19112 -23547 -15738 -7531 -18153 -22966 -17958 -8742 -4486 10940
22963 10940 10883 4398 -6574 -11358 2472 -2930 -11791 -20609 -17225 -2049 -4848 -16893 -9755 -11039
22949 -11039 -14264 -14410 -1105 5815 2212 -4850 -4439 1478 143 1986 -1554 -4039 -6619 -179 164
22934 164 7002 7379 -2330 -11045 -21271 -12502 -1651 -10067 -14721 -4977 -1797 4847 13257 16237 15021
22919 15021 12879 18841 28365 16009 4777 -533 6462 -2653 -1913 -2572 -17154 -14633 -8512 -5706
22905 -5706 -8217 -2105 -2203 -8377 -7300 -5516 -8828 -8656 -8505 -3615 -12327 -18059 -26408 -18876 -22086 -21021
22889 -21021 -25006 -17587 -9603 152 -1852 -7130 -3350 331 -3351 -2144 -4925 -22963 -32670 -23416
22875 -23416 -19939 -12886 4228 3702 7924 17847 23614 16522 5167 -2444 6487 9123 4094 -3025
22861 -3025 -6741 869 6846 4878 14928 1463 -11412 -8978 -4111 -24561 -27875 -28909 -21015 -11875
22847 -11875 -20872 -38944 -37810 -32764 -32239 -18192 5688 10036 11702 -1234 -2736 753 -1803 -4292
22833 -4292 -13706 -13009 -6411 -2019 5810 14751 21520 12156 3352 3521 9521 4192 9876 4660 5262
22818 5262 8401 -7000 -26469 -23052 -13939 -14781 -18184 -13453 -5651 -15655 -23524 -22356 -25091 -28049
22804 -28049 -21277 -11667 -10988 -4192 -1806 -3403 -17880 -15750 -10643 -3184 -19036 -17255 -16596 -16838 -13140
22789 -13140 -1879 1335 1876 13469 11571 -2346 -3159 -1433 -5700 -22338 -32972 -34475 -26003 -18054
22775 -18054 -19979 -11667 -5773 -11563 -7102 -11609 -16924 -18416 -14563 -16364 -19085 -11209 7235 3058
22761 3058 -10179 -2683 -4171 -8991 -15574 -7457 -6779 -8257 -14899 -12555 -4443 -2857 -5162 -12742 -17621
22746 -17621 -16495 -25730 -17340 -6493 -18576 -35820 -34927 -18968 -28385 -31362 -24914 -2750 -6097
22733 -6097 -9783 -2146 -1023 -1072 -192 -2297 5640 18501 15417 955 -10190 -13858 -15886 -17993 -22611
22718 -22611 -22565 -23326 -18447 -9513 -4764 -536 2060 -4510 -5432 2270 -886 -14833 -22384 -23290 -19339
22703 -19339 -26555 -32779 -35136 -29445 -16988 -2026 410 5973 7804 13971 -4813 -13230 -4899 -19819
22689 -19819 -18811 -17103 -18633 -23378 -31733 -25976 -11305 -7475 -7289 -21305 -21505 -2810 -11490 -11776
22675 -11776 -24101 -23191 -11452 -7072 -2230 -7993 -10648 -2315 -7821 -21035 -23528 -24122 -28014 -33689
22661 -33689 -22986 -25199 -32573 -32035 -12306 2508 -6564 -24103 -34537 -20281 -6154 4519 -3498
22648 -3498 -14827 -11676 -1869 13462 23055 20400 3057 -5898 -12230 -7465 -10726 -15187 -13926 -18072
22634 -18072 -24766 -17546 -22606 -17414 -9272 -1479 10170 12574 -3828 -21817 -18887 -22034 -20495 -21084
22620 -21084 -21490 -11200 -2123 -10255 -14623 -12872 -5229 3494 -207 -2939 -2339 -2420 3552 -1571 -14860
22605 -14860 -14710 -1692 3089 6195 5963 -4850 -17128 -10461 3514 10033 -1599 -7370 -4834 -9619
22591 -9619 -8292 -5111 -8530 1098 6210 1305 1866 -7981 1873 2678 -8878 -5991 -7954 -18848 -26496
22576 -26496 -16779 -13810 -14616 -12526 -18554 -23094 -14616 -13656 -13957 -2415 -7773 -16018 -6679 -10595 -17536
22561 -17536 -13397 -13727 -14987 -10410 -9918 -6856 1188 7680 12667 32430 50078 55258 71059 88530
22547 88530 105997 102173 92048 74284 58213 49280 36713 20598 19825 20783 10110 -128 -911
22534 -911 3162 6725 5267 2806 13570 19458 16177 4250 -4248 -4381 -12348 -9875 -15487 -31382
22520 -31382 -33259 -28634 -25358 -26870 -27758 -8346 -8190 -9875 -2855 -14522 -31956 -31757 -34563 -34175 -42288
22505 -42288 -45511 -27245 -14950 316 7053 969 -8388 -15210 -13129 -5966 4964 -2879 -9890
22492 -9890 -19109 -22808 -19201 -10679 -2414 -2845 -1403 -6573 -17377 -20098 -18215 -18703 -8427 4029
22478 4029 -13413 -28049 -20600 -30061 -46974 -49647 -42150 -40985 -31593 -39931 -24037 -12179 -7779
22465 -7779 -9663 -9587 -9748 -11893 -9476 -18718 -37123 -32125 -17202 -10871 -1084 2357 -5028 -14950 -19309
22450 -19309 -11324 4119 7922 670 -16484 -34863 -34664 -42887 -40941 -29995 -24678 -10495 7399
22437 7399 3497 -6185 -10633 -17376 -23993 -27968 -25443 -13357 -594 -8409 -7049 6489 25524 25351
22423 25351 8957 11438 13610 3374 -9788 -8084 -7830 -25811 -23706 -17515 -10879 -15130 -17414 -1724
22409 -1724 -1390 470 -4686 -10003 -10807 -17957 -23115 -22739 -18773 -17917 -11157 -14556 -21995 -25319 -15968 -9904
22393 -9904 -8719 1090 -7533 -14787 -21533 -18106 -17255 -14715 -19077 -16110 -17175 -7571 7491 4931 -15215
22378 -15215 -20419 -17736 -25249 -33159 -26239 -21509 -13985 1770 12893 1308 -14321 -12050 -1855
22365 -1855 -1856 4937 -80 -7938 -18602 -21417 -8830 -6670 -15385 -15819 -10964 -13328 -19707 -25203 -19254
22350 -19254 -18080 -26116 -35328 -34859 -23228 -3157 8165 5992 -8644 -7668 398 -1520 -5075 -10400
22336 -10400 -16834 -21708 -31556 -32622 -10849 -10933 -10197 -9983 -16176 -24121 -27393 -39494 -42338 -28323 -20184
22321 -20184 -29550 -30154 -26849 -22138 -2708 12207 22261 10118 -3706 -14466 -11006 -3636 10640
22308 10640 8634 -8212 -5606 -8481 -14329 -14320 -10640 -9610 -11200 -13279 -25730 -19443 -13124 5830
22294 5830 28601 17379 1714 482 -5306 -7001 -3007 -2916 -9291 -6624 -11472 -13125 -3931 -9967
22280 -9967 -12693 -12441 -12346 -16888 -10915 -9809 -20617 -28559 -12673 -3025 -1506 2724 3764 201 -10676
22265 -10676 -11789 -12285 -20178 -19126 -22828 -11331 -9458 -8243 -13010 -18801 -5430 3967 -9122 -10974
22251 -10974 -6058 2115 11546 18699 18415 5696 -8958 -24898 -8791 -9177 -20593 -17029 -20304 -36368
22237 -36368 -41264 -42042 -35072 -28219 -29353 -16738 -13776 -21903 -17120 -19250 -16616 -1843 -4674 727
22223 727 -4565 -8786 -14922 -13968 -24432 -22082 -196 10104 10234 13958 17232 9736 2803 -11356
22209 -11356 -8450 -9212 -3864 2046 1810 -9610 -10492 2868 18721 14411 12357 5598 1469 -8791
22195 -8791 -21465 -8728 -3935 -4251 -6770 4709 -8714 -15950 -13482 -8592 -5912 -10994 -8375 3372
22181 3372 15368 5821 -3436 11675 7908 4802 -12997 -21246 -19977 -21111 -18396 -15971 -10778 -8652
22167 -8652 -11808 -9579 -4524 -589 2094 8543 12240 12562 19547 -2261 -7280 1620 751 -3688 9760
22152 9760 9746 -5251 -17635 -15592 -6811 -14359 -15202 -14890 -21071 -20789 -19403 -18433 -16888 -20906 -18378 -13211
22136 -13211 -12086 -6442 -6461 2420 4810 4346 1866 -1427 -3554 1846 2455 -4240 -15132 -28263 -17433
22121 -17433 -3162 -247 -2550 3828 6093 -7172 -9932 -22808 -23396 -1922 5695 -6232 -6014 9320
22107 9320 14505 6562 860 -4290 1715 -741 -17335 -16279 -4219 -13454 -23547 -15170 -10804 -5675
22093 -5675 -13434 -17880 -15417 -9754 3921 3182 -6237 -20034 -12119 -3555 -12608 -13649 -13127 10019
22079 10019 -9894 -9325 7512 1973 -5950 -7759 613 2850 -3682 -11230 -1559 -11573 -20389 -9701
22065 -9701 -12202 -24789 -24760 -6869 13223 18534 14139 6067 12478 10627 8629 -3143 -6094 -13799
22051 -13799 -8622 4859 6788 6118 -5996 -12754 -20064 -11322 -14375 -11645 2044 8260 3349 5871
22037 5871 6519 3019 1566 -8414 -191 2869 -12330 -18548 -17249 -15762 -13217 -7421 -10776 -18035 -14542
22022 -14542 -8986 -10100 -12283 -3322 -5280 -3992 -160 52 -17658 -25426 -10624 6293 2105 -6735
22008 -6735 -4528 -14245 -19853 -14626 -13260 -7767 -2768 -3860 -10430 -10594 5915 8753 -12636 -16937
21994 -16937 -9748 -9725 -7693 -19680 -21740 -13950 -11980 -14201 -14588 -9671 -18243 -24815 -10084 -11222 -4468
21979 -4468 5690 1006 2842 4534 4735 -8573 -21023 -14017 -19019 -5904 8614 6802 -10979
21966 -10979 -25415 -10091 -7103 -7629 -10622 3260 6846 -11153 -9236 -8340 -11220 -5218 2136 5088
21952 5088 -10748 -21683 -12777 -3578 -10435 -13380 -19132 -22968 -38638 -30393 -15238 -13493 -19605 -15747
21938 -15747 -3280 10601 3795 -6632 -10329 -2256 4947 7866 3375 -1916 -1012 6586 -2779 -11264
21924 -11264 -12643 -29806 -22840 -10826 -10178 -6314 -555 -8601 -3159 8991 16207 16692 -1142 -13459
21910 -13459 -16824 -12205 -3745 -8040 -24327 -30004 -27689 -29125 -25962 -7496 -7843 -27020 -28552 -8196
21896 -8196 3423 20787 29335 29388 21782 -1969 -8775 -227 4057 -1110 -16119 -20768 -14237 -4624
21882 -4624 -6957 2647 7809 19327 13551 7126 -9916 -12169 -4426 -10252 -14485 -7708 18539 27249
21868 27249 20322 14645 14902 10730 5656 11563 13998 5877 -4775 3917 14960 6553 3884 -1268
21854 -1268 -8650 -7416 -8872 -10974 -19481 -10453 -4865 -2179 -348 -3111 -14969 -24085 -31135 -38733
21840 -38733 -32586 -27220 -24947 -13372 -2655 -7691 -6232 4359 19054 13964 2923 -4318 4229
21827 4229 17532 15002 -3166 -19939 -19757 -18881 -13990 -5315 -7748 -10446 -5586 -1150 1763 -5046
21813 -5046 -2684 6059 15131 12985 7012 -9311 -17441 -23709 -26449 -20623 -7534 2055 1870 850
21799 850 429 1340 -5322 -11905 -7264 -14314 -14853 -4630 -4878 -11491 -19122 -6451 -4854 -549 -4836
21784 -4836 -4513 -8604 -11698 -8662 -14449 -10071 -17021 -28735 -16153 -9692 -19243 -21818 -16923 -13459
21770 -13459 -9547 -17000 -21127 -26613 -24434 -19168 -16209 -19331 -1389 2401 -3076 10098 15097 -2720
21756 -2720 -3919 -4305 -10840 -9882 -8888 -10799 -25451 -25522 -18715 -3749 -8495 -12156 -6805 -11527 -12366 -11755
21740 -11755 -17015 -24979 -23280 -19166 -17665 -3961 2248 -1685 -11678 -18308 -16605 -24198 -21601 -5985
21726 -5985 -9517 -7024 1906 7074 5650 -11787 -12547 -10642 -4200 5659 -12539 -14583 -1878 -6952
21712 -6952 -7939 -2832 -9328 -15215 -14608 -11071 -11016 2788 -1482 -11528 -11964 -10474 -240 6533 4299
21697 4299 8780 14299 6834 -6206 -18701 -13549 2250 -847 165 -3710 1171 3026 10207 18170
21683 18170 15043 -1787 10843 11025 12193 2702 17173 26097 11676 -2220 -3900 -6586 1587
21670 1587 -3406 -11074 -15279 -11527 -19999 -21776 -26415 -24945 -21398 -17289 -10160 -700 1889 -5552 -17473
21655 -17473 -15596 -19845 -21795 -19156 -12434 -25141 -17715 -18807 -13211 -19389 -7103 4472 -6177
21642 -6177 -9363 -11639 -6907 3801 -3938 -7751 -12629 -593 13302 12177 9631 6828 -929 -6619
21628 -6619 -6570 -1457 5094 7867 -7712 -14999 -8265 -11732 -23140 -26407 -16706 -12417 -10645 -10581 -4638
21613 -4638 -9982 905 2730 269 8049 4897 8964 23781 25249 28847 22787 22378 6682 -654
21599 -654 -3268 -1747 6504 853 7840 4145 -4356 -15649 -3063 8858 5558 9569 3480 -20040
21585 -20040 -32995 -31390 -1915 5519 3866 2396 15159 3755 -16677 -23475 -9131 -6472 -10125
21572 -10125 -21263 -21539 -4238 11749 10194 3899 9663 -10958 -32199 -26461 -29085 -21808 -17267
21559 -17267 -26398 -22415 -23314 -29757 -30839 -20144 -19647 -22139 -17910 -11026 2463 -9330 -16301 -1723
21545 -1723 2175 3082 -8543 -18452 -21755 -25208 -22396 -21595 -20980 -9875 -4779 -11598 -18659 -7920 7169
21530 7169 862 -18508 -23504 -24203 -17562 -20526 -18981 -8894 -10537 -16487 -13925 -16710 -5167 3115
21516 3115 9187 -12560 -12861 -624 7153 8230 3435 -5559 -1288 -593 780 -5880 2696 7792 10005
21501 10005 7632 11152 8023 9925 4904 2155 -7938 -2493 -2060 -2202 -18778 -32806 -27649 -18915
21487 -18915 -17529 -27609 -29585 -17207 -19250 -13752 -18775 -36514 -36009 -30514 -25100 -33303 -30699 -15960
21473 -15960 -10103 -9582 -19434 -31108 -14200 542 9989 -1734 -9476 -1357 5234 8416 -9436
21460 -9436 -7645 2884 8489 -6166 -23001 -19832 862 21166 24237 28117 38482 26948 19608
21447 19608 19510 10303 6892 5559 7239 5115 4710 1471 -11916 -9424 2215 -12700 -21604 -17418
21433 -17418 -18210 -11837 -5862 2975 2968 -1278 -9999 -612 -8060 -16863 -10926 -12004 -16197 -6990 -8186
21418 -8186 -8399 -2147 353 4078 16054 7653 3534 -6759 -7628 -11699 -14035 -13207 -20437 -6002 4672
21403 4672 -2101 -14353 -20087 -21690 -13764 -16807 -21541 -21468 -23069 -32522 -17081 -9680 -10400 -15933 -14464
21388 -14464 -23213 -21370 -21101 662 12280 12498 -12597 -27771 -32653 -30667 -27826 -16918 -17563 -17160
21374 -17160 -16042 -6614 -4292 -26 7153 -5531 -23298 -24532 -21159 -24220 -18770 -13176 -24360 -9175
21360 -9175 2316 1118 -570 5891 9322 11955 5833 -12192 -11014 -10745 2780 7674 9230 -393
21346 -393 -6559 7628 5350 -2049 -7771 815 -2769 -17334 -15960 -7707 6679 17402 15020 1497
21332 1497 6201 664 -10708 -13855 -16406 -17448 -17500 -10968 -2224 -2914 -7589 -5022 -4056 -17932 -20604
21317 -20604 -12774 1562 17785 23977 22409 10418 7157 16716 7049 -1678 -2221 5948 16211 14669
21303 14669 7332 -1267 -2276 8398 25015 21832 -7169 -9446 11510 12155 -2047 4074 9464
21290 9464 4169 3752 5370 -14679 -15750 -3999 -14715 -12144 -4211 -5539 -6864 -2498 -309 5882
21276 5882 153 -10409 -2624 1027 -3399 -19291 -23146 -12580 -1672 -2830 -1420 -656 869 7096
21262 7096 5265 -1362 -4973 -3088 -10405 -16621 -16794 -7475 -467 -6941 -14264 -3793 -3314 -8656 -11127
21247 -11127 -4523 -6907 -19058 -11377 3230 4639 18604 19420 14715 1894 4038 5927 11034 39054
21233 39054 32146 16808 3412 3054 -660 -19554 -27338 -27541 -16906 -19897 -23826 -3933 14082
21220 14082 17216 25801 41866 42289 18923 8079 7261 -84 2279 -8418 -8288 -14042 -16733 -11569
21206 -11569 -9923 -17776 -9432 -1026 873 -12623 -14460 -4526 3845 1567 981 3468 8156 3369
21192 3369 15978 7317 -8425 -6669 2133 5754 -7820 -17621 -9628 -19430 -29672 -44349 -29836
21179 -29836 -21044 -26443 -17187 -10527 8449 14593 1654 2068 -328 -12185 -20213 -15964 -5709 1076
21165 1076 -5177 -7960 -6813 -7248 -4726 -6289 3901 11175 -2209 -11947 -8490 1390 18029 25089
21151 25089 19776 14987 3440 -1434 2736 2583 437 15645 19131 -2974 -10957 -3725 8739 8060
21137 8060 10932 -134 -20050 -11732 -7898 -5571 13683 20012 25820 19362 18048 21910 -823 4847
21123 4847 13536 -2261 -8222 -13684 -26614 -16635 -1501 -12873 -17901 -23090 -16888 59 12053
21110 12053 3305 -5540 -10021 -4579 -5954 -2548 -6525 -9517 -13428 -12630 -7206 -7617 -18788 -32278
21096 -32278 -26055 -16215 -6628 11353 7480 8087 8755 12478 10450 19665 23707 22944 15072 20346 16694
21081 16694 21913 23517 10490 9231 17581 6013 1657 10190 23943 26715 20764 21446 17347 18047
21067 18047 6690 4940 5427 15711 9522 -5221 -9016 -11255 -10040 -9780 -1037 -1127 -2329 -7921 -17638
21052 -17638 -6702 4773 3529 -2216 4153 21881 22858 5507 -6059 -17569 -16157 -15882 -13146
21039 -13146 -4562 -1806 -3003 -1409 9956 11409 11084 6581 2810 2670 4102 18244 12127 3312
21025 3312 1240 7362 -2492 -14339 -25832 -22299 -16827 -7099 -11597 -12224 -4447 -4017 927 -2878 6306
21010 6306 8818 21104 15011 -2422 -10027 -8480 -7499 -13724 -8768 6021 12410 8194 4430 4935
20996 4935 -1008 -11076 -6056 2408 5873 -4883 -4625 5508 10233 1286 9871 11378 563 -9946
20982 -9946 2174 13586 25065 17241 3018 -6640 254 -3810 3793 4301 12008 17642 11628 15967
20968 15967 15768 9966 -6045 -4818 1672 -4111 -10802 -13736 -15947 -25448 -16541 3929 2632 -12555
20954 -12555 -8979 1542 -7305 -20910 -10171 -9054 -6674 4757 4757 1801 10607 2583 3252 3705 -7597
20939 -7597 -19862 -14450 -6165 1205 -2289 -5248 -27470 -27124 -20863 -16130 -7483 -9428 -7162 -13955
20925 -13955 -18676 -28491 -16309 -560 -9021 -8969 -15062 -9444 -14542 -12081 -9592 -22286 -8425 2848
20911 2848 1799 4527 16855 27458 13460 3533 9231 -4287 -10052 454 -143 -9727 -18496 -4470
20897 -4470 11738 7150 4935 25819 23364 18801 18046 19748 9238 2846 12534 26214 25219 6088
20883 6088 -8554 -16135 -8613 4540 9002 576 4046 17580 16988 7925 -1809 -3601 -5718 -13490
20869 -13490 -16194 -11505 -4862 16659 27616 31569 32704 39580 48252 49008 22062 12239 23159 20525
20855 20525 24244 25115 19369 17162 7788 16226 21204 16577 17388 27359 49098 54983 41995 31304
20841 31304 31190 18134 3132 -4752 1618 15 -10068 -8660 -9803 -16060 -8564 -13742 -4201 8264
20827 8264 13401 8902 1106 -4842 1070 15577 15493 8705 5349 21404 16494 12891 16114 8185 3403
20812 3403 -4040 -14906 -20566 -10551 5125 16445 8846 2163 6127 5508 6764 11696 19571 20596
20798 20596 13378 7346 13934 14626 11289 13269 7865 3044 -5859 -11124 -3594 11243 6739 -784
20784 -784 -11323 -13590 -18011 -6740 -847 -4200 4476 21431 26026 25411 28634 34041 30381 18275
20770 18275 7343 -1692 -2654 421 3387 3092 -4113 -10716 -3559 19198 19914 10420 20541 21193 10098
20755 10098 16325 37726 37452 20825 25075 19495 6652 8164 11390 4423 -1437 1092 6008 -281
20741 -281 -2336 -2720 -3310 937 12289 16896 17186 15618 8495 16334 11808 -1880 -21254 -36521 -33856
20726 -33856 -32425 -20311 -1988 -4 3770 2434 -18573 -20335 6505 24437 29692 28764 19495
20713 19495 12950 12816 21606 22961 15012 -7797 -19211 -7243 -10026 -1094 -6012 -7507 10347 15997
20699 15997 22908 26451 15361 13949 9786 902 3409 -4025 -4854 -905 -8552 -4246 -1990 -4825
20685 -4825 14977 25558 26769 27135 20813 8030 -7960 -15844 -9360 2865 20628 33404 22260
20672 22260 6078 -12151 -11709 -3804 1622 3274 3199 807 -5615 -7185 -4309 -10568 -15156 -714
20658 -714 13364 9504 9306 1935 -2482 4179 8340 6214 -3160 -11567 -11707 -17679 -7650 2121 307
20643 307 4467 429 -292 -4784 -10979 -3765 -4890 -3577 -10047 -7018 -6992 3836 14676 11678 6767
20628 6767 4697 3793 13070 13866 6150 2719 11720 20215 11921 5240 11943 19211 8002 215 5958
20613 5958 3424 5460 -2336 -4188 4644 5088 1808 -9543 -17667 -20783 -17867 -17900 -2625 11675 11766
20598 11766 9973 11232 11679 22757 18569 10209 17546 21272 23643 12716 3914 -1430 -9125 -4156
20584 -4156 5885 -941 -1472 12234 5777 1970 808 7528 18386 -3512 -12781 -16841 -7829 -4024
20570 -4024 1270 11782 12516 14358 27914 38864 38584 27094 15317 13349 26197 32678 31628 29617
20556 29617 39009 51179 75483 88597 96720 102898 120333 125739 136892 139629 130153 108427 112774
20543 112774 116928 112646 117820 119724 115775 128124 130447 132326 119850 116698 113116 100878 81537
20530 81537 53767 48028 45521 37431 41296 47991 49322 50987 51564 47773 53765 45616 36354 37136 33345
20515 33345 43811 36165 24113 33466 53435 65644 58059 59882 77293 69556 65255 69175 77778
20502 77778 84556 84072 92679 112060 110311 116847 119464 131455 152877 187048 245096 299152 349672
20489 349672 400978 473633 561976 643855 689260 712724 737284 757230 778995 769082 738310 700451
20477 700451 666333 666150 687742 713821 736904 770668 782214 775753 769490 742700 735412 723249
20465 723249 671616 597951 524943 458969 390510 328661 271220 226237 189693 158759 134506
20454 134506 127497 119318 107172 103686 114396 97756 76867 81709 77912 67334 59471 60828 63260
20441 63260 67721 53670 43575 48576 61174 48413 50145 57482 47844 48853 52368 54336 41183
20428 41183 39560 50392 52011 55220 58984 52750 38429 39463 46858 45506 46546 39962 31079 31254
20414 31254 30926 51582 68753 79041 91018 88739 90689 94758 92098 96835 109435 135932 162964
20401 162964 203782 260449 316565 391112 459985 493532 504821 480799 453637 430728 430563 429219
20389 429219 449258 483065 519037 555876 578596 553890 494476 438283 386540 320706 254191
20378 254191 219303 190230 179472 174777 179382 197322 209272 239704 282675 341892 409651 476393
20366 476393 536248 567637 562926 525984 475705 439351 418907 426326 445958 503573 556707 579303
20354 579303 569060 526097 468448 400066 344881 301783 249970 198654 171629 144786 108120
20343 108120 87880 83146 91517 88855 79217 80969 86469 74406 51963 55554 61361 60658 54153 57261
20329 57261 69173 61858 57723 64548 69994 61318 55419 53222 46984 40799 43696 54897 66088 49671
20315 49671 43817 48327 28349 21525 20361 31894 38584 37582 37925 39127 51313 50207 40841 38248
20301 38248 37295 21535 13145 5498 14148 22887 26405 30781 19500 8018 12740 19653 24037 27926
20287 27926 22147 20955 7505 10469 11190 8306 20427 28078 48425 38985 22125 19371 29049 30553
20273 30553 20777 13589 26207 38393 36474 41735 40717 37053 28791 20960 30948 47608 60914
20260 60914 56517 46117 39118 37592 33960 34252 46920 43913 31998 19296 6391 23264 27283
20247 27283 20747 13091 32430 49528 57776 52078 55538 45605 37870 44033 63983 62181 59556 65527
20233 65527 74443 81347 82994 63114 42341 42349 57651 59354 55200 58616 58082 52437 55599 68633
20219 68633 71260 71127 68907 69298 65780 63675 62391 70344 62157 56233 60615 47407 41794 29031
20205 29031 31651 29537 24771 11796 21523 18009 16537 16667 25475 38866 33181 23014 26115 38507
20191 38507 56897 63427 77851 103827 117871 145504 174912 171615 167141 163896 167761 162232 158708
20178 158708 174736 201923 218508 247825 240503 192295 172459 167528 149653 146507 147561 155694
20166 155694 159724 153779 153162 143862 147234 143273 132509 134575 142260 155077 177657 176123 147461
20153 147461 144047 140694 129473 113703 105543 115360 117320 128239 156332 168993 177232 178958 148610
20140 148610 124312 114667 103682 82335 70871 66363 79213 73514 65664 46664 18586 -3588
20128 -3588 -10490 -11356 6907 19151 -41 -11176 -16768 -8136 1106 -2979 -11935 -11088 -12537 -3967
20114 -3967 11148 30149 51543 59141 66064 66944 82425 89025 108007 122445 123801 124858 129295
20101 129295 151923 163518 169460 175255 205720 218841 227247 226886 219352 217896 221292 244091 263430
20088 263430 278151 291790 314262 328518 348509 356126 369808 374980 397966 414082 433517 458865
20076 458865 484419 495752 477509 458636 438957 405784 402485 409523 408209 410485 415997 430703
20064 430703 457375 489967 504587 531164 544816 549789 543476 543014 543492 536871 515842 481533 447909
20051 447909 437822 423619 416810 418504 440407 463780 488053 500667 496452 491695 482744 468174
20039 468174 468695 467768 457509 448190 421107 393131 385995 385271 374040 370299 376830 363129 347931
20026 347931 341165 345192 355772 355003 352289 354433 369988 379746 408983 444272 461185 468127 491472
20013 491472 497641 492570 476602 457980 459359 470669 484385 495894 519847 554907 578366 573436
20001 573436 566282 551835 528956 524375 528037 528064 523092 528783 541916 548413 567583 597283 632593
19988 632593 669885 697696 741134 803237 849369 886342 915009 941443 964782 997206 1035394
19977 1035394 1082740 1147887 1210253 1274109 1335290 1406701 1466675 1527293 1605479 1696598 1805329
19966 1805329 1919894 2070902 2265696 2478781 2649057 2796498 2948198 3098162 3264321
19957 3264321 3418627 3576897 3775340 4019017 4306130 4651343 5068531 5536833 6008420
19948 6008420 6479452 7011719 7605329 8239121 8941863 9760864 10765777 12073683 13783730
19939 13783730 16092567 19375858 24132375 31075421 40760945 52517392 64180129 75363100
19931 75363100 88906056 105815696 120400386 127236792 128936900 130739842 134631478 137358020
19923 137358020 133578633 125243275 120098620 120303350 121284683 120586792 122422082 130263077
19915 130263077 139223857 141938150 139448654 136900917 136499770 135216710 126998661 111527096
19907 111527096 95658657 82981717 71469099 59186264 47381603 37803051 30748284
19900 30748284 25679087 21999479 19273798 17182978 15492128 14076421 12888831 11886242
19892 11886242 11006565 10196508 9460581 8814474 8194191 7619627 7080610 6605826 6175493
19883 6175493 5830863 5565327 5351626 5118786 4892573 4705278 4546462 4405750 4251042
19874 4251042 4083235 3940233 3857138 3824526 3803726 3790484 3775797 3767208 3777964 3863866 3976262
19863 3976262 4130292 4326017 4477853 4589249 4683984 4795558 4910266 5018496 5140476 5292921
19853 5292921 5447665 5637552 5863225 6081631 6372755 6790614 7350884 8087675 9067483
19844 9067483 10379285 12148651 14632183 18195606 23485449 31351182 42364083 55555611
19836 55555611 68674734 81234106 92155975 96272546 92512620 85821389 78742118 72498345
19828 72498345 69937626 72890178 79810866 88051973 96923949 103340298 101367949 92237055
19820 92237055 80738939 67885744 54651078 43336106 35123284 29818863 26721996
19813 26721996 25172381 24847987 25768483 28231137 32805015 40335267 51289898 64337426
19805 64337426 77206548 89619426 100007402 102722688 97690716 90202833 82393126 75643848
19797 75643848 73001741 76018155 82751547 90688854 99108033 104299678 100842790 90852018
19789 90852018 78659307 65012268 51124382 39273885 30450420 24286873 20025730
19782 20025730 16963383 14662586 12885451 11468982 10325181 9386159 8610485 7949763
19774 7949763 7379921 6888624 6499438 6164294 5847774 5566254 5308856 5056116 4768549
19765 4768549 4491077 4229138 3950401 3695673 3490151 3324185 3189651 3068636 2950284
19756 2950284 2824168 2664353 2503243 2333575 2165381 2022073 1901080 1779293 1676767
19747 1676767 1582462 1497351 1443706 1410930 1393405 1364520 1334931 1320961 1299494 1269158 1235469
19736 1235469 1205058 1185335 1163185 1146817 1139413 1127050 1114123 1099133 1086111 1075125 1072615 1047258
19724 1047258 1031973 1033233 1026298 1003055 988651 982292 973560 952381 911896 882605 871573 879618
19712 879618 886140 865357 843691 826528 806683 772327 733339 709013 707011 705974 698933 705164
19700 705164 699706 685518 681603 680509 665138 646827 634820 629533 625132 623193 619668 604761 591160
19687 591160 584451 578574 566464 549345 531220 524885 516193 504919 511677 498923 491285 492694 486696
19674 486696 472073 467190 474489 491145 490778 484969 466217 445032 425390 408089 389057 383980 385113
19661 385113 381741 390447 406577 407487 411773 414368 400944 382482 368543 356547 336757 322787 334940
19648 334940 348675 352149 361253 360860 378481 402001 396262 360846 354163 360634 374098 382015 379892
19635 379892 386794 393371 399143 395953 384783 373449 362110 367602 357501 352166 347493 328266 316200
19622 316200 325038 325523 316533 308771 319318 310621 309508 321593 314634 307238 310099 306114 306492 310723
19608 310723 302818 299947 305309 315457 321945 341474 337851 354937 363282 361150 363205 354165 344005
19595 344005 350128 347930 351307 332969 325228 330607 331410 330730 333110 330402 324725 313688 307871 312283
19581 312283 339243 337259 327454 320644 308480 310510 310695 299930 301377 301421 294233 289936 293066 290279
19567 290279 296111 301994 301205 304314 305181 286954 275033 268337 266202 264222 267575 269368 263143 275997
19553 275997 279543 292773 291670 289519 295338 307787 309762 316458 315090 317885 314155 315159 305848 289515
19539 289515 274663 265180 270550 263452 257211 254638 256165 255285 266201 273927 269289 261368 248794 239813
19525 239813 232372 234502 227213 235903 254018 250133 252678 267308 265421 266115 286272 287225 282073 285473
19511 285473 283282 286983 274638 272860 268236 266914 269997 270880 279308 273681 273042 273908 276897 276457 263700
19496 263700 259161 257558 250781 243736 237500 237881 246035 248779 243393 248003 251790 237246 245849 242456
19482 242456 244085 257220 259542 264899 268781 247488 228796 233993 247231 242762 244747 247898 238848
19469 238848 240018 253153 272014 262627 265942 281935 284226 288086 279856 264427 241958 220510 222455
19456 222455 229407 237055 248767 267923 295048 319541 320366 307818 288891 278416 265840 260061
19444 260061 244516 236849 229734 231977 233512 240216 250515 262287 255187 252485 247523 252050 236889
19431 236889 216413 208515 215531 222398 222875 212741 199901 193020 192463 195864 183669 168760 175842
19418 175842 196488 192538 196705 206889 195802 203839 218368 211573 196451 176347 174864 181226 199462
19405 199462 208367 198070 191823 201056 209398 217470 213772 199084 202206 208486 208180 209883 215050 226040
19391 226040 217874 200141 196875 209488 228552 236062 233986 228647 220044 213846 213245 218202 226653 227364
19377 227364 235400 255763 277635 304665 341953 378595 427700 490638 553932 612865 692994 767325
19365 767325 818651 850160 873805 885963 903383 900366 871368 842590 840671 853398 852222 853590
19353 853590 867081 907066 939142 931253 910390 897731 903314 879095 818682 744945 679255 607274
19341 607274 551827 492804 425433 369711 345287 323103 304461 293420 273404 255517 259747 242867
19329 242867 240467 250261 248785 254618 270759 275780 293249 307534 325623 344984 376076 396027
19317 396027 436390 468813 462627 453468 449726 450907 460893 472639 484759 490665 517572 552088 576154
19304 576154 578757 572635 570729 559229 535859 500798 472330 456342 463055 453960 443580 443508 443452 450737
19290 450737 442772 410919 381881 363425 336353 302247 291919 292702 271084 258047 273249 276538
19278 276538 269349 262664 263792 288124 321244 345578 383388 428293 492781 561257 651299 755287
19266 755287 836963 883733 926326 948254 936878 911798 891127 876817 895926 963805 1042589
19255 1042589 1103885 1143245 1154649 1125211 1041161 955665 872117 771632 700058 651477 611818
19244 611818 588757 570953 582965 591866 588759 591869 614820 657085 687200 717465 750126 771695
19232 771695 761522 716840 667838 623316 587444 592628 621112 657360 682705 718176 730016 703425
19220 703425 652043 590650 511523 430474 364499 321886 304560 278834 257947 239629 226454
19209 226454 221800 225583 209582 187346 188450 192171 198219 188523 197825 211244 209299 205905 210844
19196 210844 201818 190152 184315 175479 182120 176674 175255 187160 188330 193015 204272 201053 187143
19183 187143 181837 194188 197499 178444 174168 185770 181261 174843 184616 195871 177141 184961 195247
19170 195247 202754 195848 187226 183386 181899 189982 201230 197648 197711 210409 208286 198708 199920 200009 187506
19155 187506 182306 182609 180786 188466 186528 192273 201541 193336 191565 181791 188800 184065 182267 184163
19141 184163 187040 203320 193118 189806 188919 186268 188814 200239 205831 207740 212296 208716 184572
19128 184572 165261 160411 184407 183571 194359 202646 193385 196894 198045 196355 201398 190000 179165
19115 179165 179783 182083 188048 201277 199698 204035 212428 201944 187701 193761 200172 189950 191372
19102 191372 189922 196230 192193 193542 198827 199096 200838 198490 192230 178239 176338 184056 187497 182396
19088 182396 174634 174361 182525 199843 194832 180970 187931 195029 193077 190918 178676 172672 173432 188989
19074 188989 182995 178718 187370 187763 197504 204745 193336 189307 190619 192423 203372 210473 214140 218903
19060 218903 228033 239743 236648 241679 252521 243080 239499 239640 246827 265845 267700 262788 268795 273204
19046 273204 277018 262935 248520 245583 234184 221506 215977 218196 229078 244847 242141 259651
19034 259651 246034 228830 235434 224462 219508 222625 227582 223087 226171 218916 212322 216509 236175
19021 236175 218293 202997 221407 219682 240491 236185 237089 248523 240777 238420 251728 253321 267663
19008 267663 281828 279749 282455 288965 281195 272591 263642 271666 279902 279756 278678 272426 276192 279157
18994 279157 280913 272769 258882 255411 259407 275914 298533 303569 285488 274135 289840 300496
18982 300496 307487 294826 293746 296002 298946 289396 298080 284955 277440 285440 300004 306710 309207
18969 309207 320407 322846 333348 343914 336204 334584 319405 323781 329084 332846 330388 337755 349114
18956 349114 344530 330856 326370 326155 330656 343113 342425 332128 309726 317722 338603 347683 359581
18943 359581 357483 362998 385650 406432 405225 408993 416540 398748 389097 406137 418701 428535 433271
18930 433271 435327 450018 458550 463787 463802 462015 466399 467117 477894 491252 493921 488754 486846 482928
18916 482928 472392 489146 497475 499136 488587 487281 484529 478986 476691 482683 488779 489443 490259 494299
18902 494299 499950 497670 495009 491254 499231 506675 499277 509550 527964 537733 545402 551446 544792 544833
18888 544833 558791 568337 578761 601045 609910 621530 628195 620683 629716 642079 659693 680480
18876 680480 691533 702487 707555 702983 706211 706646 707578 715210 707719 713225 727393 739559 754312
18863 754312 762597 762523 790732 799744 799303 802273 809926 833644 846669 860368 876647 907043 929048
18850 929048 944359 969049 1006326 1040269 1078804 1120043 1146891 1197490 1242543 1300807 1357940
18839 1357940 1418636 1500827 1590815 1678426 1786288 1911503 2053331 2213615 2367984 2521883
18829 2521883 2694775 2886817 3088926 3316559 3585332 3914517 4306287 4795486 5411381
18820 5411381 6195700 7247271 8739380 10898443 14086720 18643903 24097271 28834022
18812 28834022 32501249 36987402 43128365 47230638 46093723 43419766 42791902 44165719
18804 44165719 46113105 48173991 50428136 54344191 61554944 69842458 73455769 72646057
18796 72646057 73050972 73849625 69723012 61936682 55285890 51389524 49043682 47217536
18788 47217536 45354699 44032198 45008290 48179278 48953567 44720225 39370265 35454796
18780 35454796 31965063 27391787 22381065 18226705 15299768 13412334 12285953 11686266
18772 11686266 11448868 11535630 11991372 12948689 14595341 17163156 21123456 26668571 32517136
18763 32517136 36991132 41059146 46997139 53737771 55649887 52614345 50122040 50415415
18755 50415415 52226470 54217196 56330682 59336235 65362645 74646102 82195096 83390709
18747 83390709 82701373 84275107 83156863 75711295 66704444 60489751 56908721 54295192
18739 54295192 51938381 49654111 48890793 51173643 54149193 52203108 46095326 40466927
18731 40466927 36242166 31550530 25668056 20009705 15588848 12445956 10269209 8740593
18723 8740593 7602270 6717017 6002369 5392485 4853024 4397540 4016677 3656057 3314695
18714 3314695 3011837 2748492 2511447 2282653 2085461 1912106 1773974 1634252 1495738
18705 1495738 1380579 1274479 1177109 1102807 1044028 983608 919647 875267 861425 834866 795164
18694 795164 754205 723751 693615 661218 631646 603453 582882 578210 574424 556157 549762 534835
18682 534835 517359 500503 473439 455213 439441 430022 434547 413312 398137 404058 396964 392532
18670 392532 393004 378935 377843 370944 355964 338756 336218 337455 332479 325353 308924 300537 288383
18657 288383 290806 315837 323854 320281 304355 299574 294723 275815 270607 268082 268741 265305 262430 260401
18643 260401 251639 256123 266186 262157 272003 275520 266955 244100 221206 210016 207336 205804 207644
18630 207644 201992 198931 196676 184459 180140 185490 187643 185687 190765 204667 229967 242392 240716
18617 240716 241766 231771 223658 218572 221411 252960 279034 305542 332320 357556 405174 487247
18605 487247 567662 645720 694020 691351 672938 671992 690650 694023 666594 610191 531304 462330
18593 462330 412438 370937 340623 328237 310728 287455 271177 271707 280550 285736 273392 265209
18581 265209 273154 282865 287708 295529 333687 392515 455385 535970 605166 644223 658244 637188
18569 637188 639043 658484 644137 603648 548877 479475 401681 374713 347504 334645 358344 377757
18557 377757 398561 436066 482868 518858 541669 545873 527744 530650 536546 526723 501297 458236
18545 458236 412772 370192 343953 328112 304461 295606 284973 275453 268361 259099 259264 264117 262520
18532 262520 271576 284971 286259 291950 312526 345439 380774 413805 468880 501530 514321 505275
18520 505275 479408 459742 474583 473996 454033 414771 345646 300984 284706 285292 274576 265565
18508 265565 255124 250362 243223 232801 214317 199405 201592 194762 197964 202050 201031 199941 200614
18495 200614 207359 196459 187994 194247 204043 202660 202205 192931 191439 195597 196850 189595 201264 207488
18481 207488 224949 219131 210138 208508 226339 223750 214519 215508 205886 218974 221178 204378 200833
18468 200833 212035 214578 211590 210299 202700 212793 225645 215805 218247 238153 252972 246390 238458
18455 238458 223208 227541 229338 218455 216745 213505 208565 201644 194068 199194 198172 204023 211841 202145
18441 202145 207446 209717 211325 208914 223699 213859 194836 196967 176440 197556 202229 214924 212026
18428 212026 201658 210263 207902 217280 225038 220718 227071 227724 227717 219152 223473 212901 216542 220441 224695
18413 224695 219030 213510 214129 221179 222282 237033 249145 249333 217335 214681 225627 223629 224597 223982
18399 223982 220861 217032 207698 204262 204429 201687 192142 197869 213522 222317 217923 211117 220059 235072
18385 235072 240946 230659 230313 231283 222951 208923 207840 224609 237850 228323 227345 207773 206849 205675
18371 205675 181930 182593 191389 200987 195613 182955 189635 220647 235717 232153 242540 255158 253394
18358 253394 241634 229672 222268 210709 204525 224628 236788 217956 215997 228082 227407 229312 239731
18345 239731 249903 260812 266008 279301 282478 278987 286135 289881 292545 279465 262413 238372 221199
18332 221199 214976 219952 233476 227121 214406 213074 198681 201562 235037 259683 262581 248746 254450
18319 254450 267938 263348 262420 268590 254752 251890 279394 313748 335230 353565 347588 344386 350552
18306 350552 343678 335659 338083 343137 346548 361342 394516 418382 440667 458740 462445 473681 489271
18293 489271 495274 484056 472806 485358 510826 541119 580325 600160 607782 618242 609564 572764
18281 572764 540736 519039 501859 486842 473886 491740 510326 535668 548556 553766 553300 555999
18269 555999 534624 516386 496429 496353 484173 478779 480449 487015 494600 488532 475243 459693 464251
18256 464251 470088 472752 477929 484597 509876 538311 572162 598644 641819 668078 654605 642191
18244 642191 637500 651101 684224 732543 775448 819538 891298 946462 984416 994411 999338 960856
18232 960856 898793 851872 821068 807723 783920 768533 755372 757020 769424 784751 786842 759001
18220 759001 733142 733985 736173 725710 712118 693575 661372 650524 647309 625027 613141 606053
18208 606053 592967 580423 561513 552137 563606 556161 554824 554946 565602 578301 581971 593764 612605
18195 612605 626414 638695 648105 650184 659338 678161 690971 697540 714775 731374 742080 758608
18183 758608 765436 766605 762005 752754 730722 722619 716717 699229 699916 715674 733775 745470 774487
18170 774487 809570 847698 882743 911834 913635 905328 911910 911808 950431 957528 949425 931441 920644
18157 920644 904685 905714 907414 915312 950675 961107 965935 971689 1005361 1040478 1065006 1089493
18145 1089493 1111518 1119407 1129752 1139746 1169803 1211998 1272802 1348573 1418010 1455259 1490919 1518325
18133 1518325 1543708 1600175 1662441 1708304 1723795 1744069 1791029 1855225 1914663 1993419 2108525
18122 2108525 2257030 2433041 2627095 2848672 3153770 3532466 4007806 4659944 5645269
18113 5645269 7203729 9791368 14400138 22076763 28746422 26323470 19246397 13733299
18105 13733299 10544079 8986747 8406323 8391223 8788167 9534317 10610776 12213304 14625583
18096 14625583 18318942 24103624 32972757 45284919 59423949 72193263 78865082 78790823
18088 78790823 76766032 76643823 78858952 79815486 74211342 62589207 48886594 36621837
18080 36621837 27650791 21736339 17924902 15422540 13752127 12647749 11939135 11514261
18072 11514261 11319677 11340390 11591536 12148988 13120098 14664271 17048171 20772167 26644004
18063 26644004 35611568 47790885 61371180 73081475 78481436 77893537 76015703 76204029
18055 76204029 78470718 78889835 72760100 61375440 48615327 37840493 30658028 26860550
18047 26860550 25778778 27229117 31601325 39465626 50310703 61843586 70479089 72726714
18039 72726714 70812814 69097002 69695568 71405514 69792366 61901030 50292286 38332799
18031 38332799 28607858 21849493 17437318 14558767 12631483 11314807 10411658 9792376
18023 9792376 9407765 9214078 9222415 9450778 9969853 10884578 12372039 14780473 18622310
18014 18622310 24667938 33660298 45034943 56621935 64741533 66480376 64671286 63411759
18006 63411759 64439072 66123340 63876164 55576392 44091151 32629049 23549136 17318451
17998 17318451 13263052 10595886 8750791 7424081 6410448 5627268 5003079 4461106
17990 4461106 3969151 3516562 3114405 2772218 2497761 2268978 2063752 1867437 1664276
17981 1664276 1461720 1277626 1126186 1018877 937647 855493 786490 737352 705032 699930 674479
17970 674479 621901 563857 533879 518359 491815 465914 426059 381416 332341 306389 279872
17959 279872 248230 226102 196953 178612 184292 177736 155088 143501 149509 163505 164709 161566
17947 161566 157775 144764 124548 110835 123004 134860 138069 141425 141901 149629 137052 117367 105070
17934 105070 96433 81211 66421 60764 58459 54459 39862 27712 35432 46698 40953 46117 47597
17921 47597 69766 77570 82699 91297 81855 65617 45610 27797 15760 14076 2121 -22689 -21448
17908 -21448 -18900 -33466 -35193 -19935 -14451 -6770 10969 23664 36792 41582 37889 48979 44262
17895 44262 66039 92367 82784 74369 86338 102404 101508 91132 80661 62001 41676 39905 47246
17882 47246 49191 47431 44003 19319 -6812 -14012 -17833 -20649 -10641 11704 23115 12839 16692
17869 16692 35589 37203 31709 37351 37718 39796 37679 35947 34770 32916 40323 46295 44607 38840
17855 38840 42330 37007 50707 65623 70055 80183 79965 77932 73697 67962 60499 56752 57767 54802
17841 54802 47147 53487 60082 58485 50634 48603 39489 38829 43756 53312 55389 47412 39176 43848 55085
17826 55085 52490 50122 49372 49004 46511 47188 48122 56059 68344 80597 88898 83667 90545 106690 92177
17811 92177 86014 67726 51109 48658 47997 54220 51454 46353 61191 74002 73473 59173 54411 49845
17797 49845 33317 40411 50846 55231 48531 42735 41835 30581 28606 42893 56915 66519 55887
17784 55887 42612 45453 44397 49056 44409 43859 29463 19568 2409 -10811 -3423 -4955 -15754
17771 -15754 -8227 -674 12630 20174 22876 47980 62360 65095 58976 52584 49957 49146 50641 46582
17757 46582 45396 51007 51371 30523 10620 2906 2221 12731 18704 38508 53290 42113 10395
17744 10395 -151 9771 8679 20221 11116 6853 23802 29251 34477 29373 26503 31706 24180 15246
17730 15246 12272 23329 24161 21544 27804 41382 25156 8371 6437 17417 21944 37148 22902
17717 22902 20568 39844 44133 39147 34785 30713 41936 30953 19719 20739 12491 1736 -1575
17704 -1575 -762 4019 5517 6259 12734 12173 23746 40167 39031 29361 19393 -1134 -17632 -18400 -8791
17689 -8791 1945 419 10794 13190 23866 40491 47872 33063 33105 36938 31499 33308 39864 32900
17675 32900 27034 17098 18419 28418 39062 43041 28194 -4142 -10918 -209 14291 23448 22101
17662 22101 25061 17161 1724 7038 18728 24143 16100 20414 34213 28971 18519 8106 8121 1157
17648 1157 4721 10818 25178 29913 19556 11149 23823 29210 11915 9469 13994 22569 18869 14159
17634 14159 18515 22899 17817 16945 18472 10022 17169 24935 28446 39020 30246 20943 9691 6823
17620 6823 5858 2019 11831 33262 29326 11721 13447 31051 37298 36512 43824 41896 42743 41456 34948
17605 34948 38008 46106 48646 33021 32536 39872 21829 28591 50163 59539 59448 43061 32533 36565
17591 36565 41041 42613 34561 38184 39570 48379 41400 51977 64100 69710 69192 70407 81122 83170
17577 83170 97253 100080 114911 141857 177054 233914 307479 381396 425630 436877 430168 414243
17565 414243 420950 437176 426550 388705 333136 271987 212485 165536 144319 134535 119075 110814
17553 110814 98741 94232 87122 89119 85723 98266 120109 125278 135574 162525 199448 241775
17541 241775 302877 365751 416280 455268 462860 446489 438667 438884 446736 434905 384375 317522
17529 317522 264366 234693 204958 196780 194886 205702 242479 293009 357549 405820 446039 438514
17517 438514 432420 442262 425627 427893 397076 330325 267270 228263 190881 172995 147399 118809
17505 118809 116787 104846 106231 97869 88451 93895 100618 117175 127411 116677 125535 142945 176127
17492 176127 238517 308594 357779 394881 418885 407015 397553 402107 414823 402766 365782 312614
17480 312614 241472 181562 147721 126995 99442 90787 90938 102410 93447 82685 87318 86126 76501
17467 76501 66367 54403 59442 61030 60357 71617 76237 76130 75133 81769 70052 55931 47118 42616
17453 42616 35081 48387 71390 74818 63627 64002 51470 56295 75306 97382 126325 170484 178830
17440 178830 150924 115793 94202 71666 70499 73039 77114 68507 72068 73529 76009 70492 66945
17427 66945 63349 55938 55603 54061 61001 63336 57429 53866 49136 40996 42926 38979 15954 2086
17413 2086 21692 42824 48229 39848 40235 35487 42064 50109 45605 60625 65470 66287 79691 73662
17399 73662 69627 55565 52581 66241 68558 65429 72562 64930 53970 45171 63598 69653 65894
17386 65894 69133 67418 58122 58440 62758 55246 48383 43705 41302 34866 41078 42742 51967 47282 38671
17371 38671 58401 74704 72308 64857 77552 82731 70590 58339 60560 49996 60205 65439 61139
17358 61139 65614 74030 72274 66660 58874 62329 75226 79000 67623 60695 58566 72354 69485 66289
17344 66289 67366 59568 52989 41913 44427 49891 58340 62550 60313 61574 70999 76176 75429 78616
17330 78616 74350 59020 63392 70580 69856 74742 73766 70155 67681 53925 49436 52173 64385 73282
17316 73282 62281 63187 62754 66835 64880 72689 66285 47304 51972 68290 72383 67236 49194 56859
17302 56859 72083 76432 79503 80656 80382 79833 83017 80316 69883 78198 81917 68382 71487 76549
17288 76549 78956 73890 76554 88721 91778 88519 82411 89063 98034 100529 86654 78350 66727 60885
17274 60885 64851 67049 75955 73693 67549 71442 71182 74335 73867 69738 75211 80449 88824 92542 92091
17259 92091 93764 97704 101302 99575 95879 92509 74540 68643 79011 85937 90274 82138 64453 48103
17245 48103 45654 60963 80048 76837 53757 42127 39211 52083 64783 80157 92168 101905
17233 101905 98207 89205 89073 84833 87733 90602 91385 80585 78715 87170 83409 78743 80432 81854
17219 81854 87621 83066 87795 86577 96552 84704 80228 105674 99634 84220 80898 75199 68328 64205
17205 64205 62671 53954 54902 67480 76392 66636 67303 66255 72470 69698 75794 92116 104672 108805
17191 108805 99601 80243 87917 82734 72813 67450 69656 75765 88772 91489 85681 93853 87330 71722
17177 71722 70494 77711 78605 84959 77699 75669 82739 91699 85328 89004 103216 100256 91317 94141
17163 94141 90935 77630 82506 92853 91122 81231 69545 67256 69047 73101 89362 96992 81151
17150 81151 71483 78023 89274 89729 89622 92091 90586 99280 105251 102784 96370 80915 70559 76155
17136 76155 80167 90854 104351 104061 101995 95378 81336 73263 70564 71489 75622 73388 79324 86484
17122 86484 87282 89133 95921 87875 90325 104009 101747 101173 106386 104231 107037 123615 125167 101166
17108 101166 90397 96864 100354 104085 109350 99028 81016 87765 91727 90649 73105 65743 72323
17095 72323 84236 90937 81480 79618 84315 91509 85498 84718 89407 84353 87874 79996 81860 85352
17081 85352 70798 68181 74199 83213 89850 100148 112939 129769 131042 115280 108049 112574 112903
17068 112903 110371 109633 93644 84158 85711 81543 94941 102989 99371 92988 99352 105382 104639 79227
17054 79227 66746 60500 75289 80787 83097 94150 93079 89789 93063 90183 108799 110376 113837
17041 113837 105082 104999 99077 107162 106836 93938 103715 107825 95243 85932 81248 71599 71320 80504 88695
17026 88695 89725 96604 106296 109113 106923 87579 84650 90760 92494 99194 104324 105157 107747 106919 85382
17011 85382 94539 106265 110954 99944 102358 110612 104592 103647 98754 101545 96067 93927 91055 100903
16997 100903 101100 109454 102590 115030 119525 106965 99412 96702 95814 92922 105271 110852 100798 111640
16983 111640 115694 106724 106057 88739 80283 92154 102849 100042 98226 100638 113112 105942 90871
16970 90871 89167 98677 113592 122514 127046 136312 123370 119860 123536 113830 105474 101154 98130 92787
16956 92787 106527 110563 108629 123115 135404 134543 123242 122821 124794 131882 130804 120367 121247 131321
16942 131321 135647 134868 134255 128607 125633 114052 107582 104180 96178 104445 105783 99331 84188 94466
16928 94466 108264 117804 127080 121017 118631 103901 96215 91522 97641 100754 102410 110405 111168 121419
16914 121419 131201 131034 125245 111665 120046 135589 130626 122929 109050 110424 113286 102130 97875
16901 97875 103588 98609 103877 116586 110934 104856 114050 112245 111563 121801 123898 119926 121251 125747
16887 125747 122558 118951 126832 128537 135675 129505 124226 116612 106592 104030 111757 118121 124463 131672
16873 131672 128283 119541 118785 107513 103933 123039 130541 135585 120924 124583 133591 139978 136827 139160
16859 139160 127933 128453 126065 123720 132432 140229 144512 147671 132541 123226 134868 139314 143330 145180
16845 145180 140453 124663 111903 116230 120240 125033 132727 130770 132694 135437 134352 137368 133697 132418
16831 132418 121142 109339 114118 111435 111936 102658 95736 102823 111081 109300 110362 111576 105109 103689
16817 103689 110992 123059 131951 141288 138254 137725 126074 123995 129899 129633 125114 123724 124579 118143
16803 118143 114126 99788 99999 112924 119121 121181 115308 107295 107847 109388 113181 110685 114962 119007
16789 119007 112718 110203 112162 109557 114705 138474 141349 139105 137549 132217 133843 133522 131335 128465
16775 128465 132835 137062 140843 146065 139028 139598 142892 146944 147133 145896 136681 130428 122733 132760
16761 132760 137859 132248 130540 141818 146504 140050 134414 137224 145800 144229 142748 159418 166449 146391
16747 146391 151459 152921 148585 145990 145680 136948 134246 131436 130977 125216 126192 130078 132796 130313 127547
16732 127547 127126 127830 129133 137680 140776 131471 118889 109594 115806 131418 143580 145290 144377 144664
16718 144664 151884 148562 139572 132760 144207 163016 164083 151876 136630 123795 130344 131951 129059
16705 129059 138013 146340 148763 146321 149638 149150 142302 142800 144471 146355 136382 137024 132994 131964 134891
16690 134891 130219 123212 131524 128524 132343 143448 143292 148461 146530 140128 137486 141432 148007 150890
16676 150890 159927 163949 163079 154194 155263 158591 166646 168831 160258 153156 152130 147841 145877 160152
16662 160152 160373 155518 153256 141356 121139 116777 136426 140278 149401 142689 149157 163741 156507
16649 156507 145913 152276 157554 148938 148674 152721 154129 153492 162179 167510 163842 164216 158878 152572 153318
16634 153318 153083 139339 135877 140065 138813 142930 141687 153214 158322 162407 165134 175748 189567
16621 189567 183833 174931 173514 175534 166205 158733 154128 155445 148308 149213 144536 142924 161958 168539
16607 168539 151943 157343 165002 160344 164988 174145 182589 181703 176371 174360 169407 164662 174757 181419
16593 181419 165706 162423 169071 169218 177732 185719 195087 195517 191565 193288 178524 158492 154182 150759
16579 150759 157837 160731 162965 167053 172289 164427 158078 160068 164058 158135 152278 153016 171974 171972 156724
16564 156724 155391 163880 173730 182533 178111 167805 168628 185425 170927 180474 179113 165095 166419
16551 166419 165200 168702 175883 174641 160521 146094 149502 160775 182128 188413 186130 174016 172004
16538 172004 177826 167110 171194 160818 156765 165274 159101 154062 164513 170057 175627 176344 174300 182395
16524 182395 184922 169600 161440 171252 170754 173865 181503 173599 166289 171830 180540 194701 186713 182317
16510 182317 198315 204734 199878 196875 187382 180583 179978 186336 187246 177516 171207 169167 175282 197408
16496 197408 211714 204732 188921 189721 195326 194183 184263 171067 166336 163090 164716 175095 179003
16483 179003 169237 171806 183140 187343 179926 162726 164053 178553 188646 184226 166683 148136 160017
16470 160017 182337 186191 191102 192742 198364 206246 200718 193864 196918 199421 210628 225517 218031
16457 218031 210599 198263 202115 198926 194825 200159 202548 201514 199402 189313 178148 180520 183059
16444 183059 169621 165613 170135 172077 172251 180786 169623 161703 169086 176784 184769 193581 203441 199808
16430 199808 190551 195388 205164 201056 203966 211496 210726 213318 200878 199866 205501 208853 209451 210518
16416 210518 204371 192892 200137 205643 208722 213530 216832 206867 210635 196193 183412 181612 177508
16403 177508 185104 205708 210383 206777 207469 193722 198588 212134 217338 214188 203706 209259 210859
16390 210859 204934 178593 177439 198887 214223 221953 226132 211198 213920 229602 231353 230907 225329
16377 225329 214946 213595 220373 222372 219553 214644 196263 199179 206594 207181 188410 187543 204752 216629
16363 216629 219386 214542 214264 205315 207199 212241 211559 206683 221959 231542 230319 227313 217941 222335
16349 222335 219520 228217 229928 222849 219188 221061 220922 226884 226837 222663 215531 212619 222959 229302 237153
16334 237153 238239 232380 232082 225447 226481 224300 237004 227823 223036 221898 215689 218711 214636 211995
16320 211995 219795 223912 224267 226431 230042 240042 238046 234451 237101 246598 242939 220491 213969 219708
16306 219708 223456 232711 235244 230757 221058 232714 244099 229733 226605 224792 229585 229483 231287 233669
16292 233669 231878 229503 238511 222045 214165 216783 225929 236636 249665 259458 267801 259788 246090
16279 246090 247459 248734 251541 243848 240046 224542 225998 233006 232574 224456 223645 218984 233239 239259
16265 239259 236921 245822 235118 228759 240087 239895 240766 239557 249744 254776 258054 259830 255589 257720
16251 257720 270878 256891 248279 238727 224320 228404 240531 237942 230318 243437 244634 238955 256162
16238 256162 267281 273003 273095 264515 265191 273797 264500 259174 261086 262971 263067 248549 242560 247089 248878
16223 248878 245694 240614 238842 242352 241097 251585 259262 252227 240969 228803 228349 240950 239497
16210 239497 233929 235438 240176 242851 251249 254496 263480 256311 252257 263222 281434 281961 270040 259120
16196 259120 263431 259606 254902 254741 253346 264481 264199 257376 259291 265388 262872 259356 262703 267539
16182 267539 266426 272068 254193 243006 250396 261643 267795 265294 272616 263834 245305 251804 248921
16169 248921 253314 260140 257748 259486 254898 252646 265979 270373 255288 260777 254375 255590 258197 259454
16155 259454 248146 253014 246415 252922 249316 244561 259760 262257 260056 255576 240334 262933 280128
16142 280128 275187 272904 262274 260770 266131 274816 283368 290973 287346 272249 274822 290543 302559
16129 302559 293751 276938 259191 262948 258243 259839 268244 276313 271160 269947 274784 277284 276451 268655
16115 268655 273768 276637 285038 274855 274917 278152 277397 267882 264662 280618 300209 307210 303696 289865
16101 289865 280691 277314 278286 277615 300840 313404 325142 317738 296281 274985 257997 257342 262604
16088 262604 275576 287294 286826 289272 289284 279643 278128 296128 305734 310361 315704 302345 292558 287616
16074 287616 298033 301023 301663 311388 308633 302848 300535 294181 302311 314950 314124 305263 296991 301451
16060 301451 311366 310617 310541 304898 308496 306983 304602 306258 310627 304027 306143 316957 315474 306995 303617
16045 303617 307485 319307 328933 328504 329184 316311 299089 294400 299923 321826 330167 330196 323351 309065
16031 309065 286940 284704 292015 293160 309483 320582 327168 323206 317953 326891 321614 307835 307650
16018 307650 318568 322436 319041 312810 295255 293678 302641 328554 328975 310990 312457 326645 335934
16005 335934 338641 345937 345709 334007 325358 332316 332139 333340 334687 342513 338591 328089 335112 343083
15991 343083 341848 338463 323054 312826 308645 323290 340789 350808 341261 340406 334427 328939 332214
15978 332214 325034 337089 336848 321540 305282 311247 327810 308217 298892 310893 323886 337239
15966 337239 330412 334461 334572 338032 351203 343174 343787 338450 331007 331697 331261 333170 335676 332804 334986
15951 334986 349565 347476 338169 338407 347576 360879 374961 372348 351962 346089 352746 352289 358429 362780
15937 362780 368230 369839 368892 351568 335226 335480 346638 350726 360359 361217 372210 375534 371400 362914
15923 362914 365438 368996 375673 379133 375924 375547 375600 395088 399391 383527 374646 376645 383313 390766
15909 390766 392349 386747 383178 390715 383086 373463 371178 365860 375825 394050 395271 397142 389993 386061
15895 386061 360978 354480 363262 373576 387416 388006 394316 383897 380581 381889 375065 387773 393962
15882 393962 396769 406264 404462 410797 423504 427626 416588 402497 386950 393136 400825 402758 397932
15869 397932 396739 395241 400650 402958 402587 401096 394938 387170 387180 399214 416224 417640 412919 408063
15855 408063 404963 399836 403483 408568 406521 412859 421152 416021 408945 414247 411744 422211 422687 423870
15841 423870 435962 435690 439461 443587 440273 439821 435230 428514 428416 422303 435238 446909 432193 431206
15827 431206 447803 459373 452656 427928 418620 429283 435509 440229 441870 456510 465656 468290 471208
15814 471208 476412 473930 464833 461958 466637 479714 481593 478169 472613 465465 459016 449594 457271 467363
15800 467363 455671 452820 465205 485580 480766 463407 458125 465429 480938 484110 467358 463238 485930
15787 485930 484226 476183 476335 479628 482978 470019 468734 464048 460490 474468 471598 472100 487268 485245
15773 485245 480286 476762 471092 475014 478542 484308 485076 496690 487992 472427 474741 480549 487417 484704
15759 484704 480431 483697 479126 482352 486856 492819 483799 485136 480345 473856 495637 506967 516053 524164
15745 524164 519584 512896 509962 507703 504364 512232 512151 494900 485100 482634 505795 525692 525053 530357
15731 530357 533424 528392 524706 520996 527686 523514 518651 523412 520655 526783 524888 521965 524548 530753
15717 530753 532877 542016 543495 552588 570359 570248 562978 573665 560863 543969 546776 550731 544765
15704 544765 549243 566370 575923 587721 584657 577632 560382 564204 570258 577565 578731 575696 563952
15691 563952 548584 536343 526742 530063 540614 539380 547685 568926 557844 553281 563342 577720
15679 577720 586194 581841 555973 553292 560507 573896 572061 576668 589158 596997 594324 594784 605722
15666 605722 610215 614766 622289 616450 599213 593853 607308 616236 613266 606807 615815 612873 609737 613367
15652 613367 613983 622022 631936 631507 624172 621341 613306 623756 646250 645688 631593 607703 613095 628803
15638 628803 637022 632976 635832 645625 651871 665804 657211 639663 649782 653487 649558 653108 667030
15625 667030 676752 678652 674849 665798 647119 632693 643254 653304 662357 660823 654314 649259 649803
15612 649803 655456 657716 664575 669379 679669 679577 673152 678915 688877 692304 694072 714834 710133 701272
15598 701272 706544 717890 713953 709846 700259 710695 718240 714324 712502 710044 710045 714677 717868 723216
15584 723216 712282 709763 709990 727347 728208 727377 725098 737095 745767 742818 751350 751236 740623 739638
15570 739638 750342 754831 756003 759747 758180 762167 762664 768271 770253 763358 754047 775257 784901 781770
15556 781770 774405 767720 768529 768234 768648 758966 764131 788948 797856 782438 778842 767987 773560 796157
15542 796157 797883 800619 807676 799931 790557 803222 810645 809614 809161 810702 793791 798104 809797 816609
15528 816609 827778 837318 830250 834804 828940 828535 836931 840693 853540 859216 857717 856103 848379 839855
15514 839855 835799 855878 868661 893253 897852 886334 882122 871729 869546 867884 869966 872167 885232
15501 885232 900191 886307 883841 884122 887678 888586 898145 908193 908559 885165 881710 890816 913300 927772
15487 927772 938724 939441 934261 928548 941282 950562 949485 955067 951037 956366 961727 961915 965801 959818
15473 959818 970915 983071 987298 985795 979873 976321 971030 967856 983993 1001082 1021792 1018420 1013865
15460 1013865 1007643 1007128 1011688 1019940 1012368 1010652 1025950 1041371 1059433 1071365 1064328 1060189 1065831
15447 1065831 1076128 1074897 1067013 1063991 1062013 1075820 1083512 1062560 1054783 1062243 1075523 1083367 1097441
15434 1097441 1099006 1104654 1098956 1105169 1111017 1124403 1131312 1135510 1136651 1136844 1146549 1158538 1165169 1154717
15420 1154717 1144785 1142874 1169002 1183158 1185616 1179172 1181277 1183323 1192953 1198614 1199600 1202162 1207740 1214117
15406 1214117 1216255 1220329 1225109 1224389 1236015 1243591 1244810 1244176 1250452 1241698 1231938 1236486 1242924 1257030
15392 1257030 1268511 1279504 1290466 1285593 1278409 1270520 1273527 1293506 1306813 1307894 1306999 1317789 1332119
15379 1332119 1328922 1326181 1342342 1336404 1335495 1351458 1367392 1384779 1387349 1387751 1387485 1375882 1376381 1391429
15365 1391429 1392923 1398562 1416833 1430176 1430790 1436551 1451210 1444200 1441577 1448044 1460002 1468651 1478205
15352 1478205 1477183 1473621 1471151 1474367 1488680 1495597 1502023 1499693 1499588 1506439 1524289 1551143 1566483
15339 1566483 1582206 1585759 1574643 1581778 1590804 1591046 1583567 1588889 1602004 1613629 1629191 1625177 1623617
15326 1623617 1634360 1655611 1670447 1678946 1682524 1685483 1688792 1688738 1681126 1698549 1720344 1730550 1727207
15313 1727207 1722772 1729304 1728970 1732166 1743846 1764963 1779541 1779024 1794287 1812059 1821894 1829918 1824648
15300 1824648 1824772 1820967 1835052 1835122 1845721 1865383 1876877 1891195 1896031 1908857 1931260 1935264 1940388
15287 1940388 1947365 1958216 1959412 1974263 1992729 2004057 2011077 2012754 2006679 2025164 2035724 2042682
15275 2042682 2051482 2065417 2077780 2094248 2106217 2107349 2121173 2133956 2155372 2173234 2180605 2182419
15263 2182419 2184318 2183382 2195054 2225877 2238454 2243429 2262582 2278698 2291940 2303966 2323309 2337545
15251 2337545 2355690 2365882 2380686 2385768 2387561 2386450 2412369 2435967 2440623 2445485 2455572 2454535
15239 2454535 2480222 2511551 2524738 2531762 2536642 2531322 2546808 2569533 2586884 2595719 2603505 2614756
15227 2614756 2630469 2630161 2638858 2657113 2683347 2696840 2704758 2709018 2735273 2755036 2766356 2781462
15215 2781462 2797950 2825030 2845620 2854247 2875615 2881993 2893593 2924046 2940614 2951581 2971834 2984350
15203 2984350 3003691 3036868 3042513 3050191 3075639 3088036 3104293 3136599 3165703 3178916 3180805 3185484
15191 3185484 3213621 3237211 3254382 3285703 3310858 3326321 3330685 3334806 3343350 3370136 3405656 3432145
15179 3432145 3452794 3474865 3492762 3499199 3524274 3559422 3575750 3583489 3603731 3636236 3669324 3696714
15167 3696714 3708635 3724801 3763316 3796392 3825253 3848710 3870997 3901821 3924623 3932718 3950492
15156 3950492 3985704 4025926 4045136 4069485 4099688 4134022 4144126 4155917 4193750 4232075 4258483
15145 4258483 4271678 4299121 4333158 4367892 4390880 4426180 4447280 4471281 4498762 4528623 4553996
15134 4553996 4578007 4617001 4651391 4680268 4724331 4756681 4778521 4807865 4834445 4868269 4895475
15123 4895475 4922715 4962045 5006837 5046317 5077048 5111913 5137589 5164775 5202691 5243686 5266997
15112 5266997 5303803 5332416 5360668 5396172 5448028 5490040 5539032 5575502 5610702 5650527 5694230
15101 5694230 5728853 5769945 5816567 5850842 5887143 5935342 5982394 6023595 6060349 6087459 6112952
15090 6112952 6147592 6205852 6242853 6289022 6341478 6376647 6424316 6482321 6533764 6569171 6603494
15079 6603494 6644182 6698282 6749891 6804528 6844615 6876353 6913664 6954055 6999955 7051237 7111227
15068 7111227 7156808 7196956 7237571 7296010 7341136 7383148 7417296 7465662 7516032 7563679 7608188
15057 7608188 7669942 7720594 7751305 7792041 7834975 7879504 7930607 7980537 8012325 8066665 8119760
15046 8119760 8168801 8211522 8254209 8308060 8359877 8408824 8470493 8518382 8555532 8600429 8648109
15035 8648109 8684780 8714723 8769454 8814038 8855918 8905921 8966860 9020224 9063172 9110124 9157950
15024 9157950 9198520 9234962 9276723 9323087 9375076 9426288 9463470 9505229 9561068 9588903 9620597
15013 9620597 9663597 9707394 9750475 9792042 9827547 9861082 9892932 9947743 9979876 10012611 10053124
15002 10053124 10084988 10115623 10151066 10187590 10209348 10237557 10266890 10294971 10330344 10364806 10387600
14991 10387600 10420369 10443223 10462869 10473659 10502182 10523569 10535520 10547616 10555685 10579587 10604199
14980 10604199 10613579 10631502 10646033 10659198 10659221 10667112 10675600 10692173 10704276 10715132 10716728 10714070 10720353
14967 10720353 10715709 10719090 10717497 10728214 10739471 10736862 10729671 10726129 10709614 10689329 10682667 10688373 10678233
14954 10678233 10663448 10650784 10646816 10642904 10623498 10608738 10594035 10582355 10551770 10527809 10502009
14943 10502009 10466160 10450563 10430548 10404841 10381110 10355011 10330138 10295663 10260671 10240631 10215184
14932 10215184 10188645 10174285 10146866 10109741 10075502 10031439 9994330 9953004 9908700 9871618 9838386
14921 9838386 9801155 9770380 9740710 9698325 9657415 9613279 9564614 9523405 9488454 9438819 9399756
14910 9399756 9354757 9301039 9263841 9211166 9165807 9126937 9081245 9028093 8982687 8935045 8881992
14899 8881992 8836561 8782780 8726993 8674951 8633240 8588512 8548479 8504345 8456781 8406582 8356845
14888 8356845 8300214 8255537 8223103 8174202 8133517 8096300 8048032 7997960 7945477 7907656 7869569
14877 7869569 7827491 7770914 7703384 7638225 7593028 7560238 7498173 7459241 7425248 7379934 7341681
14866 7341681 7298719 7227179 7175572 7139058 7095893 7040518 6994161 6953972 6907430 6847877 6799904
14855 6799904 6769336 6741284 6700008 6651679 6603112 6562596 6517467 6476282 6431564 6393780 6350881
14844 6350881 6297242 6246431 6212022 6184482 6135572 6084775 6044751 6010552 5972533 5941969 5892877
14833 5892877 5846610 5818454 5777869 5736671 5701043 5655863 5624753 5598348 5560755 5524561 5494601
14822 5494601 5453757 5406161 5365995 5332065 5311649 5293400 5246811 5205577 5159846 5118796 5074307
14811 5074307 5046950 5017647 4980259 4936339 4905575 4875864 4849508 4812889 4796143 4782161 4758798
14800 4758798 4724971 4693241 4659590 4634290 4607223 4567058 4534990 4520895 4504604 4473523 4445008
14789 4445008 4422519 4398398 4366253 4324987 4296143 4285878 4244121 4205020 4176720 4167210 4154619
14778 4154619 4122581 4088154 4072700 4041746 4001736 3966530 3942944 3920554 3894474 3871915 3867035
14767 3867035 3844969 3814492 3786215 3773790 3755471 3727850 3700237 3691475 3693594 3673602 3634247 3608361
14755 3608361 3591562 3573464 3540239 3521131 3501750 3479806 3468298 3461749 3439556 3409501 3384679
14744 3384679 3371502 3361450 3337168 3315905 3296451 3271912 3255278 3235050 3204926 3184900 3184256 3182432
14732 3182432 3159428 3139226 3130251 3124467 3121607 3099284 3089353 3080619 3056947 3029605 2993011 2978939
14720 2978939 2979150 2969745 2956488 2931772 2915758 2899806 2879798 2867250 2856444 2834394 2816225 2809544
14708 2809544 2813733 2799214 2769840 2765429 2743656 2724884 2723358 2704981 2686794 2672579 2673298 2669004
14696 2669004 2667068 2664159 2639999 2620575 2618152 2615709 2607282 2593775 2572012 2553775 2536832 2531128
14684 2531128 2531760 2526547 2523046 2501448 2484316 2468569 2457060 2448364 2430203 2418077 2409338 2389891
14672 2389891 2379131 2371307 2352080 2347638 2337895 2334555 2331837 2332179 2328812 2323417 2310765 2298572 2296629
14659 2296629 2295663 2282303 2272347 2275149 2289579 2301752 2284276 2258100 2252405 2265214 2275160 2282013 2281330
14646 2281330 2287111 2305593 2325487 2387534 2487431 2596353 2709005 2828961 2941077 3010454 3048108
14635 3048108 3031993 2975940 2870545 2728129 2585584 2463941 2346765 2249462 2185799 2138927
14625 2138927 2112770 2085999 2058559 2030221 2016050 2002954 1995406 1987033 1973985 1953766 1938743 1928392
14613 1928392 1924566 1910396 1887449 1881985 1876168 1870336 1878352 1873712 1862711 1850257 1837391 1833076 1852394
14600 1852394 1854505 1844974 1840918 1832526 1825018 1813839 1798532 1789921 1781031 1780974 1787353 1790998 1783557 1782192
14586 1782192 1772112 1767540 1766582 1757231 1746175 1735117 1738835 1742645 1732485 1716932 1705593 1700308 1697533
14573 1697533 1689954 1685019 1706006 1708565 1699225 1672986 1647264 1637872 1635213 1635875 1648973 1650383 1631658
14560 1631658 1621831 1616406 1629463 1638956 1634319 1624464 1621709 1623234 1612220 1605298 1598986 1587284 1587908
14547 1587908 1590589 1579446 1578193 1590260 1587335 1579238 1573173 1561754 1554491 1565186 1566084 1554222 1558372
14534 1558372 1564097 1551951 1545796 1530382 1533843 1531831 1522884 1519070 1523968 1524266 1511383 1507839 1508529 1510722
14520 1510722 1515013 1525927 1527513 1531818 1521656 1509896 1506143 1499393 1489457 1482373 1489224 1487472 1487443 1489024
14506 1489024 1485503 1478068 1467593 1475550 1479988 1477462 1467944 1475458 1474631 1472183 1479394 1464933 1450312
14493 1450312 1448194 1452781 1459890 1459602 1454395 1444408 1440174 1433965 1430443 1428786 1430869 1430771 1440448 1443715 1437556
14478 1437556 1438552 1435952 1430582 1421485 1416875 1421264 1427758 1433372 1437721 1435540 1424775 1429837 1431930 1429876
14464 1429876 1431646 1425764 1409433 1409847 1407622 1404112 1405828 1406068 1407379 1402416 1385211 1389089 1385559 1395526
14450 1395526 1403623 1416285 1420304 1424053 1416414 1424944 1431330 1433418 1428657 1424400 1424055 1421288 1433397 1446934
14436 1446934 1453379 1458454 1453208 1461095 1504400 1527688 1538903 1546309 1567700 1596076 1607871 1636525
14424 1636525 1684512 1727963 1792858 1879413 1968421 2099389 2279291 2516922 2761901 3012397
14414 3012397 3284200 3554561 3781200 3950416 4024594 4012818 3928154 3765358 3541799 3267439
14404 3267439 2995603 2712797 2449110 2218614 2027177 1880856 1768684 1688870 1625230 1579945
14394 1579945 1551550 1522563 1489266 1458134 1427809 1424827 1421672 1413964 1396373 1391393 1379467 1364598
14382 1364598 1365137 1360569 1348725 1335494 1351472 1358758 1340305 1329885 1325360 1335219 1335846 1337455 1339525
14369 1339525 1330184 1325516 1320095 1318197 1323641 1322760 1332131 1330198 1327086 1352114 1362623 1359179 1351310 1356418
14355 1356418 1341396 1325994 1342763 1349449 1346618 1337790 1338182 1327641 1319950 1312309 1307328 1307853 1321115
14342 1321115 1331284 1348175 1344853 1352570 1354263 1355027 1339392 1328366 1331383 1337532 1352773 1360843 1354803
14329 1354803 1349089 1343090 1339923 1346201 1334752 1315219 1312804 1319556 1318265 1325365 1322506 1319246 1334748
14316 1334748 1348696 1362103 1358532 1348885 1346117 1342873 1345812 1354643 1358141 1356403 1353674 1362144 1369328
14303 1369328 1370975 1383012 1395546 1403874 1389369 1387972 1398855 1402397 1390461 1382880 1377944 1385299 1373257
14290 1373257 1362894 1359480 1372867 1375667 1372827 1369244 1361901 1376414 1396475 1402100 1397791 1418021 1445782
14277 1445782 1458374 1462370 1465198 1470353 1498329 1507131 1491847 1490336 1513326 1522587 1518195 1525274 1537345
14264 1537345 1535206 1538484 1538895 1523992 1504581 1498320 1484803 1471506 1461728 1468153 1474459 1473584 1467227
14251 1467227 1475611 1483179 1486391 1485475 1483229 1478727 1484330 1499180 1480812 1465904 1475779 1475753 1478088 1490328
14237 1490328 1500525 1524604 1543755 1557405 1572106 1585536 1590813 1600937 1604725 1617371 1628373 1648983
14225 1648983 1672402 1695045 1724952 1749292 1783683 1819516 1862252 1906910 1952227 1970814 1972870
14214 1972870 1969748 1959481 1939026 1907759 1874954 1849064 1837721 1847295 1854432 1852676 1871193 1893070
14202 1893070 1927301 1945796 1967853 1989905 1999392 2001909 2001203 2012433 2017971 2007422 1997582 2010860
14190 2010860 1998077 1984969 1959437 1927360 1896924 1874920 1838137 1829429 1834341 1825440 1815003 1815794
14178 1815794 1808112 1814221 1819280 1809031 1801315 1799511 1785132 1761397 1757400 1750149 1745966 1736590 1740690
14165 1740690 1761264 1764003 1775092 1813930 1833310 1849039 1857994 1861476 1885932 1915008 1926900 1954071
14153 1954071 1989511 2021317 2060949 2110979 2155636 2195842 2230554 2260087 2291040 2313267 2335448
14142 2335448 2349885 2356849 2376428 2397249 2406777 2425191 2446208 2459574 2459227 2461647 2472066 2473313
14130 2473313 2470111 2472199 2481409 2500356 2509981 2511571 2518629 2537711 2549451 2553513 2581854 2603468 2620300
14117 2620300 2654542 2687814 2709933 2731195 2768152 2796977 2806823 2819848 2843847 2852454 2860414 2871011
14105 2871011 2882675 2903782 2934048 2965259 2988784 3024732 3083132 3149438 3205976 3269866 3357477
14094 3357477 3433195 3497627 3545721 3573521 3606948 3617109 3598990 3562337 3525725 3488552 3456547
14083 3456547 3423028 3389452 3373938 3365549 3367271 3375519 3392982 3415777 3439228 3478988 3522237 3553257
14071 3553257 3596663 3635032 3664199 3701492 3721076 3753145 3771375 3784725 3811034 3851233 3889600
14060 3889600 3909462 3953346 4017289 4077806 4141338 4219695 4294136 4367124 4426510 4481316 4552570
14049 4552570 4627415 4694211 4753504 4806531 4847916 4893492 4945987 5003389 5062340 5122446 5197816
14038 5197816 5276570 5349351 5422187 5509608 5616836 5733838 5829794 5953999 6072360 6195739
14028 6195739 6314492 6431033 6574286 6706645 6837104 6970942 7111402 7260946 7427517
14019 7427517 7604275 7770606 7951663 8148662 8347384 8572377 8811814 9067412 9322673
14010 9322673 9593414 9878326 10175736 10493588 10824644 11175017 11552258 11971578 12440920
14001 12440920 12965003 13542652 14179225 14842209 15532901 16278800 17083195 17968531 18898936
13992 18898936 19863322 20876887 21976996 23217268 24611419 26227970 28103031 30287337
13984 30287337 32839784 35827095 39300197 43308957 47962222 53386662 59732131 67271533
13976 67271533 76469879 88153793 103545257 124457673 153216075 191272168 236500233
13969 236500233 285258190 337490765 391938716 442510483 481570909 505872668 515132445
13962 515132445 508587729 486989352 451342707 402692911 346522787 290284833 238281129
13955 238281129 190423012 147987015 114222090 89579956 72129331 59572228 50096630
13948 50096630 42541682 36209033 30730241 25914253 21721036 18119427 14998316 12323884
13940 12323884 10100136 8289181 6789212 5529700 4486354 3606360 2844715 2192300
13932 2192300 1627579 1130031 696110 304053 -27056 -303410 -546304 -747708 -928035
13923 -928035 -1107775 -1268430 -1423306 -1552123 -1659957 -1747694 -1811956 -1871832 -1926612 -1959920
13913 -1959920 -1997554 -2015343 -2036353 -2049202 -2068505 -2099320 -2126321 -2146491 -2177323 -2201471 -2186339
13902 -2186339 -2162513 -2158597 -2137832 -2111268 -2092013 -2070679 -2059222 -2034541 -2011265 -2003175 -2001565 -2001056
13890 -2001056 -1993014 -1983325 -1986540 -1990991 -1981447 -1975403 -1975366 -1987640 -2013453 -2018546 -2006706 -1999251 -2001370 -1984295
13876 -1984295 -1955522 -1928802 -1908774 -1875570 -1835361 -1802710 -1781935 -1767889 -1758565 -1746305 -1748054 -1736462
13864 -1736462 -1736534 -1733827 -1739927 -1741150 -1723739 -1713611 -1707616 -1687849 -1668892 -1644788 -1633985 -1630383 -1620358
13851 -1620358 -1613801 -1599939 -1580525 -1549848 -1528021 -1526950 -1513179 -1531243 -1551551 -1578056 -1617472 -1662343
13839 -1662343 -1711398 -1752177 -1779702 -1807420 -1833494 -1834298 -1839047 -1832544 -1794143 -1753572 -1711895 -1678767
13827 -1678767 -1645504 -1618441 -1588858 -1576683 -1562475 -1531439 -1519204 -1515326 -1505126 -1498780 -1488228 -1486453
13815 -1486453 -1477781 -1483457 -1479752 -1463579 -1449879 -1450160 -1445953 -1423092 -1401879 -1390379 -1365939 -1340123
13803 -1340123 -1322414 -1305387 -1301746 -1302310 -1310746 -1317914 -1328602 -1336257 -1337226 -1336508 -1341205 -1340301 -1334319 -1313519
13789 -1313519 -1288703 -1271542 -1256763 -1246338 -1244490 -1235891 -1231477 -1214814 -1193102 -1168979 -1125115 -1089986
13777 -1089986 -1054909 -1018403 -983301 -950160 -914832 -889737 -860943 -841526 -835895 -823770 -808309
13766 -808309 -799126 -807460 -811695 -803465 -798312 -789625 -780860 -785526 -796221 -810896 -818529 -820117 -824477 -848638
13752 -848638 -860679 -870799 -862855 -860788 -864680 -864838 -856182 -848826 -862850 -873963 -873593 -873357 -881930 -869642
13738 -869642 -868548 -865089 -856875 -847638 -840974 -846359 -856510 -857945 -869169 -878494 -859171 -850928 -846932
13725 -846932 -836761 -833111 -836147 -817103 -788229 -762205 -757031 -751209 -737431 -726963 -718139 -717824 -701042
13712 -701042 -683716 -676563 -668400 -667292 -674350 -682143 -684160 -687259 -697365 -707802 -709954 -698806 -697222
13699 -697222 -712586 -723763 -728976 -729252 -721327 -703162 -686457 -674131 -677647 -670887 -663675 -650627 -643025
13686 -643025 -648166 -635448 -634588 -636921 -638595 -640385 -637238 -629259 -625747 -624649 -622780 -617416 -614345 -611474
13672 -611474 -626411 -628655 -632928 -652939 -663270 -679077 -684858 -702216 -724028 -723985 -716086 -726828 -743863
13659 -743863 -746811 -747405 -738866 -739275 -708621 -685877 -674928 -652848 -642549 -645931 -648503 -645353 -619921
13646 -619921 -612199 -613544 -611278 -605698 -578978 -549406 -542039 -543249 -539005 -535028 -556217 -564394 -552793
13633 -552793 -551574 -560808 -557297 -562753 -568891 -580900 -589949 -588471 -588979 -580387 -575361 -569002 -561711 -573801
13619 -573801 -578242 -578531 -569791 -558656 -558327 -549160 -554525 -556952 -545405 -529233 -528210 -536323 -522486 -512947
13605 -512947 -505925 -520247 -524674 -514766 -516318 -520532 -523435 -519306 -523309 -522421 -516531 -513223 -510335 -498652
13591 -498652 -504642 -514509 -524178 -529705 -525022 -518759 -505512 -498292 -510382 -515127 -497438 -489717 -494482
13578 -494482 -502365 -499329 -502264 -500375 -491405 -495228 -487623 -478668 -481968 -496207 -485606 -477984 -468667 -465867
13564 -465867 -451300 -437081 -429981 -443008 -436523 -434871 -424785 -426682 -427059 -425653 -421219 -422668 -419059
13551 -419059 -423561 -425336 -416804 -413127 -397655 -376809 -378443 -371801 -366596 -349260 -344006 -351636 -333414
13538 -333414 -324258 -311565 -307932 -295603 -284515 -276060 -271197 -259428 -248096 -238553 -229352 -215673 -187747
13525 -187747 -147239 -100034 -70470 -16018 50266 140544 280018 460598 687057 941795 1215765
13514 1215765 1514226 1815801 2074550 2262540 2363616 2385438 2324969 2187939 1973912 1699067
13504 1699067 1410435 1124903 860132 626006 414719 240514 136708 54035 -25627 -82721
13494 -82721 -120591 -155551 -184613 -211634 -255694 -279757 -294557 -297090 -303553 -307622 -324658 -330955
13482 -330955 -325195 -326732 -344345 -354328 -336794 -326676 -342161 -335829 -325659 -313136 -307858 -289049
13470 -289049 -272025 -253872 -231142 -213190 -203750 -189921 -187442 -195630 -200157 -208181 -230475 -245248
13458 -245248 -255499 -286322 -297133 -325445 -352396 -348622 -344943 -349243 -356030 -349989 -354005 -354779 -360660
13445 -360660 -360372 -358245 -360816 -369839 -364445 -359842 -375015 -374881 -361606 -350627 -356300 -357031 -351005 -349254
13431 -349254 -360445 -374086 -368621 -370993 -383520 -370034 -361302 -351980 -341826 -362786 -373862 -371851
13419 -371851 -378430 -390065 -364934 -357788 -360246 -362684 -368226 -364849 -370422 -381263 -381808 -372189 -364303 -353175
13405 -353175 -356212 -352795 -351543 -353576 -340941 -324475 -327418 -331443 -331475 -333827 -341161 -359931 -370557 -369396
13391 -369396 -365441 -362228 -369800 -354778 -349032 -352469 -351003 -345266 -338810 -324653 -318773 -311200 -318028 -330225
13377 -330225 -348307 -333919 -316577 -309186 -314451 -314188 -315584 -319629 -307974 -308326 -304908 -301964 -309736 -322506
13363 -322506 -311736 -307423 -309551 -296017 -301508 -311397 -312035 -303148 -303480 -304758 -308686 -307155 -300863 -301828
13349 -301828 -306735 -312500 -313660 -324818 -316800 -308047 -311481 -315884 -311397 -299555 -296670 -307963 -308680 -307352
13335 -307352 -307845 -304149 -298146 -299068 -303812 -312177 -306775 -303767 -300986 -294273 -291337 -283122 -292314 -290772 -301705
13320 -301705 -301551 -299479 -292395 -282513 -279841 -283745 -284186 -279416 -279040 -277174 -269199 -254114 -261400 -265264 -266730
13305 -266730 -270601 -272973 -282851 -272320 -268733 -280145 -263841 -262374 -270899 -264752 -258908 -255476 -259900
13292 -259900 -264257 -263561 -264711 -274044 -269896 -271380 -266306 -264054 -277277 -281198 -280430 -284355 -273167 -268919
13278 -268919 -257970 -263929 -263652 -259784 -249882 -247042 -248256 -249420 -253948 -255709 -261945 -265971 -265435 -254899
13264 -254899 -250054 -248228 -259098 -273886 -280808 -282404 -273757 -279954 -284541 -263988 -261659 -269374 -275439
13251 -275439 -280575 -271453 -262281 -264694 -270166 -279978 -267515 -262670 -267448 -264443 -260438 -254859 -246865 -244685
13237 -244685 -242650 -238248 -250456 -265320 -250484 -231712 -235288 -234568 -224619 -222295 -225019 -228489 -212423
13224 -212423 -214915 -229454 -231787 -222191 -214924 -214886 -210085 -224215 -231414 -217884 -214177 -220902 -222096 -221445
13210 -221445 -213338 -195294 -203968 -210722 -207318 -205177 -204620 -223191 -224344 -224443 -223213 -226427 -221891 -207743
13196 -207743 -211455 -219800 -217460 -217554 -222157 -221915 -227826 -223520 -209418 -199741 -194957 -208361 -216307 -217441
13182 -217441 -213282 -213391 -221264 -237465 -233445 -219930 -218006 -219198 -232755 -233756 -232425 -238357 -227758
13169 -227758 -213243 -217986 -230663 -228027 -232492 -223541 -209389 -209624 -212556 -223867 -230337 -235099 -221589
13156 -221589 -223025 -227774 -214443 -215389 -220098 -209332 -189150 -196507 -211953 -200178 -178805 -189910 -201358
13143 -201358 -185159 -171498 -173506 -173634 -189517 -204404 -207227 -200820 -198988 -188591 -187670 -184560 -188916
13130 -188916 -186371 -184097 -194999 -207256 -209325 -204674 -200283 -190284 -184340 -175428 -181413 -195220 -205929
13117 -205929 -207093 -208136 -208286 -198737 -194437 -184609 -179107 -174130 -179888 -179075 -181157 -174874 -173171 -181553 -193008
13102 -193008 -192357 -183960 -188974 -191249 -193123 -190395 -182335 -183595 -196569 -207434 -203902 -199839 -178736 -172056
13088 -172056 -178664 -186413 -185077 -167253 -158611 -166976 -180953 -187053 -168151 -163033 -157701 -161650 -155580
13075 -155580 -156826 -166750 -179147 -174361 -175368 -173461 -178680 -181561 -172427 -161320 -166216 -173884 -176407 -178830
13061 -178830 -174514 -163371 -157476 -151004 -141801 -139104 -159075 -184635 -198742 -184046 -158613 -152567 -152736
13048 -152736 -154151 -159924 -162581 -163593 -165142 -171512 -170774 -164120 -164335 -163071 -169979 -186933 -178887 -168750
13034 -168750 -158874 -154058 -164711 -172556 -175065 -176897 -173205 -170844 -161411 -161831 -158017 -155877 -164403 -175391
13020 -175391 -180095 -173596 -163022 -151081 -143195 -148784 -149899 -140160 -131218 -129468 -127200 -120005 -123371 -133896
13006 -133896 -150302 -153420 -151951 -145152 -133336 -139199 -140869 -129809 -129298 -134831 -146531 -155929 -161113
12993 -161113 -156285 -153077 -157475 -150479 -155883 -160950 -165079 -172393 -165007 -165433 -168095 -148916 -146976 -149321
12979 -149321 -141758 -150141 -149621 -146050 -147220 -143338 -142643 -138142 -146166 -134720 -129972 -131111 -107188 -104624
12965 -104624 -118908 -125947 -133775 -128478 -125289 -133817 -139766 -143669 -146421 -137081 -132223 -139761 -161027 -176505
12951 -176505 -169242 -146191 -129422 -140471 -154297 -158665 -156040 -146669 -138996 -137344 -146652 -139302 -125436
12938 -125436 -114681 -112361 -110513 -109956 -106013 -105945 -124553 -129221 -131466 -122338 -122205 -137491 -136497 -124726
12924 -124726 -126882 -121821 -105971 -108744 -121401 -125304 -120117 -117829 -130924 -146709 -151990 -150244 -136738
12911 -136738 -111492 -117368 -128864 -128990 -124522 -113938 -116310 -109497 -100933 -119213 -121874 -109802 -98875
12898 -98875 -83648 -100361 -120951 -122326 -122768 -125764 -114101 -111031 -114378 -120025 -118793 -107121 -101661
12885 -101661 -111035 -122141 -129783 -131633 -116410 -107709 -95549 -106533 -120221 -118960 -102377 -93127 -95291
12872 -95291 -106346 -110986 -108464 -96026 -104109 -112621 -119686 -124477 -123057 -127649 -126562 -122867 -122202 -127818
12858 -127818 -134722 -131484 -135500 -141576 -131975 -119379 -114835 -108693 -101499 -99491 -94779 -97261 -86074 -76889
12844 -76889 -81098 -81717 -65337 -62457 -55713 -53538 -60381 -71499 -91845 -109143 -99559 -95108 -100108 -105004
12830 -105004 -113883 -124104 -118471 -122790 -125902 -122833 -110876 -101640 -109252 -101341 -99946 -106593 -106823 -101410
12816 -101410 -99775 -85286 -75113 -69021 -85505 -91599 -91871 -82924 -79326 -88462 -100661 -89881 -75555
12803 -75555 -82231 -78780 -82163 -81744 -82355 -71393 -76410 -96246 -98171 -91593 -101632 -90281 -84257 -92402
12789 -92402 -70857 -62200 -67663 -82228 -92641 -90586 -91675 -88976 -87015 -102758 -102459 -98069 -102299 -99581
12775 -99581 -94430 -76974 -78451 -78539 -77222 -80903 -88318 -84031 -93302 -100052 -100997 -101711 -94200 -81076 -89730
12760 -89730 -96490 -93359 -98457 -98689 -83303 -77348 -87554 -86640 -85950 -96206 -81342 -77590 -86405 -75462
12746 -75462 -60657 -77543 -85176 -86620 -89795 -86295 -77521 -86449 -77981 -78219 -76296 -78592 -72167 -72066
12732 -72066 -73547 -73342 -82376 -84729 -86490 -85200 -85213 -102066 -101636 -88810 -82066 -78416 -75709 -89446 -97248
12717 -97248 -75227 -58051 -47314 -55810 -70808 -94642 -108057 -98492 -85350 -82789 -87734 -94265 -87488
12704 -87488 -83616 -71452 -73169 -77695 -79572 -77504 -69521 -71741 -66996 -58917 -65928 -67166 -73273 -90723
12690 -90723 -98563 -92887 -86590 -87701 -72013 -65607 -52886 -55779 -72268 -78393 -84173 -88429 -90820 -83199
12676 -83199 -88205 -90793 -86244 -88872 -93163 -83085 -66424 -64249 -62831 -70287 -74475 -68497 -61608 -55630
12662 -55630 -51170 -70316 -82113 -83583 -77161 -72522 -67177 -63730 -70553 -69036 -77237 -81927 -84250 -78998
12648 -78998 -71893 -70247 -77800 -85381 -77675 -60069 -60819 -68901 -69122 -79506 -85961 -87106 -75764 -75406
12634 -75406 -80045 -89364 -78617 -80979 -92990 -93635 -87612 -75924 -60447 -49231 -53048 -55313 -61592
12621 -61592 -72756 -83159 -77670 -75758 -63275 -54712 -68376 -79899 -80986 -80245 -85584 -75509 -82314
12608 -82314 -95248 -75991 -71060 -70382 -74435 -79308 -86543 -81525 -73204 -63154 -58494 -43191 -34824 -39435
12594 -39435 -41951 -43937 -51466 -61338 -63948 -60286 -57656 -55025 -56722 -66812 -67979 -46438 -36889 -51668
12580 -51668 -58874 -52679 -48923 -59590 -66739 -76987 -63071 -34905 -30542 -40973 -55483 -69144 -54842
12567 -54842 -52623 -69457 -71281 -66644 -56826 -50687 -41375 -30101 -24945 -31458 -45754 -52063 -38392
12554 -38392 -39281 -54879 -76320 -69292 -60553 -58996 -61341 -63287 -52510 -52403 -48719 -37897 -37073 -44344
12540 -44344 -48881 -39346 -33096 -38109 -46032 -55004 -65481 -53285 -48973 -55308 -57147 -47836 -43899 -30456
12526 -30456 -35050 -41416 -36707 -35750 -38662 -36596 -31336 -26445 -26694 -38753 -36487 -48924 -45097 -38541
12512 -38541 -46446 -44492 -35971 -35293 -60223 -67300 -57683 -50439 -36901 -34235 -35671 -31288 -48035 -56838
12498 -56838 -52421 -40968 -38023 -27867 -19940 -24541 -15766 -12884 -15034 -19172 -28336 -48724 -43795 -36595
12484 -36595 -23713 -21091 -21421 -17817 -25064 -38012 -43480 -45418 -42714 -38410 -38898 -44791 -48864 -57725
12470 -57725 -60387 -38522 -20177 -24016 -23942 -18025 -19969 -32232 -39560 -38142 -31987 -30187 -35535 -51243
12456 -51243 -64200 -60665 -50912 -43350 -47349 -43727 -30444 -28812 -38955 -41503 -34233 -26520 -31330 -24732
12442 -24732 -17408 -26162 -33030 -33186 -28163 -26138 -20416 -9911 -14772 -8216 -9750 -19350 -23427 -24632
12428 -24632 -23458 -23418 -28424 -9373 -14366 -20133 -16075 -19778 -27243 -33340 -33889 -21627 -4731 -1729
12414 -1729 -5782 -25144 -21422 -15780 -22175 -34575 -28837 -31593 -45961 -38688 -24890 -19428 -24469 -34608
12400 -34608 -42847 -26083 -11645 -23291 -13188 -14428 -18636 -9111 -2404 -8965 -17715 -22292 -34294
12387 -34294 -29070 -40285 -40646 -39615 -38844 -28750 -24745 -26507 -23362 -29360 -35717 -35419 -26339 -22562 -14229
12372 -14229 7921 3047 -2359 3217 -10296 -13195 -19507 -23874 -19708 -17411 -9577 -2841 -12898 -14740
12358 -14740 3087 12953 4141 9131 -2629 -14686 -5343 3408 -4012 -3363 -8579 -19489 -29388 -23858
12344 -23858 -2483 2945 1652 -6830 -10511 -11029 -7278 -10839 -9370 -7404 -11464 -8427 -5266 1763
12330 1763 -6481 -16509 -29591 -28510 -31650 -46857 -45259 -30288 -28123 -29221 -13054 4920 -2978
12317 -2978 -14240 -17510 -22056 -16088 -24397 -25078 -10639 -13199 -8072 8359 -2540 -9517 -6984 1100
12303 1100 -7698 -12154 -13144 -4863 -9887 -11166 -5663 8222 22807 39639 48565 43847 32689 23913
12289 23913 28722 20238 1400 3068 4642 21648 16759 13059 6456 -2988 9529 10757 10586 -9373
12275 -9373 -3492 -9475 -3327 -551 -1548 -6362 -7405 -9719 -3596 6363 8548 5092 3137 14244 21524
12260 21524 18583 13723 5698 673 -2717 14616 31701 31564 31431 18875 26593 26828 17204 11461
12246 11461 17718 18823 24766 31074 31230 33576 42979 40881 45419 40085 30241 24530 22019 8316
12232 8316 6311 -1708 5714 8387 7866 13962 9870 6701 13762 21344 10393 157 -8770 -20829
12218 -20829 -19122 -10280 14304 26633 23310 2047 -4054 219 2936 -5226 -2478 10156 14313
12205 14313 18964 13485 25685 33001 41888 38935 43869 39366 36619 39971 27007 25098 23414 20012
12191 20012 27633 35220 26438 3698 1042 -6167 -640 -1211 -3554 -9380 -384 -11426 -15340 -1562
12177 -1562 3186 4453 5026 1222 9750 10783 18419 25397 30120 33286 33548 30755 16609 14282 21107
12162 21107 20296 8001 -1637 6080 26732 15979 3958 648 -10263 -8119 791 9255 19630
12149 19630 1305 -7992 660 10417 24173 12083 -1110 10256 19573 30340 20437 17057 17864
12136 17864 26947 32718 36019 19621 10545 7118 22164 37370 27609 18594 15834 19404 19448 22731
12122 22731 23787 10014 -4433 -3293 4108 6011 25804 43054 30049 31962 38568 28601 27672
12109 27672 29333 29683 39444 48934 37200 30950 21823 10694 7033 209 6885 18344 27082 34445
12095 34445 24485 15385 18690 30570 35460 29196 26551 26144 23681 13805 3088 7425 13558 17703
12081 17703 3261 -14707 -16008 734 8149 13670 31684 29157 29387 34362 37736 37396 24078 9473
12067 9473 5560 13140 15098 14562 30217 31409 26124 30797 30529 40580 38575 29308 14911 7714
12053 7714 -431 2573 14755 30544 36912 48196 44397 38036 22407 28056 49561 57345 56728 49123
12039 49123 43526 57833 50624 32995 20453 32652 34637 23589 18381 27296 24723 14166 27887
12026 27887 36672 36197 31528 29362 21725 18079 17756 18971 15516 21397 13534 19871 26759 34155 33562
12011 33562 30861 30636 47107 41454 43670 48386 39754 27466 13095 25483 21231 14807 18517 31182
11997 31182 36350 35803 38400 43923 35574 22458 13488 19407 24722 24273 26728 24738 20636 19703 17279
11982 17279 15715 15587 23815 34718 30153 31012 39903 42838 28146 31818 41620 44438 49630 59438
11968 59438 71551 86553 63002 37254 12162 3653 14602 20724 16630 11516 -2644 2991 1205
11955 1205 21185 35459 33621 31507 48596 40204 30665 42360 54300 47809 39182 43478 25349
11942 25349 24464 22336 13819 7574 11952 23221 28130 29541 38289 36120 33224 15465 13339 26581
11928 26581 42258 45583 46038 40439 33205 31931 39309 44245 38325 35551 35137 29694 39350 42511 51046
11913 51046 55721 46804 34455 34708 42444 56115 53630 50129 48793 47842 36566 40514 49879 44294
11899 44294 41105 41323 36189 41743 52649 55602 40152 31130 28753 35037 37921 40648 46326 50520
11885 50520 55128 46305 41584 29609 20752 9456 17314 33221 42628 51595 38441 31007 33702
11872 33702 24764 23730 31617 38359 35942 36323 43818 44394 40966 43118 37536 33681 28526 27199 29848
11857 29848 34925 36628 43238 56174 59326 54842 52329 54275 53156 51681 49495 48943 53861 53243 48366
11842 48366 30526 42389 44742 37868 31733 32468 39435 40951 31902 28668 24249 25377 27607 30192
11828 30192 34650 24205 19539 10632 16674 27227 31430 36315 40515 39741 35084 32813 31556 32186
11814 32186 32173 32412 30038 22818 28022 31690 19823 27835 47376 53023 46171 46763 63319 72569 76566
11799 76566 64881 60074 49537 48545 44252 41977 34928 36329 35646 54945 62139 61263 63425 51772
11785 51772 34575 28678 26689 29193 43987 44128 42588 31369 24991 32506 32963 47283 53576 50222
11771 50222 52619 61684 79435 63142 37323 35779 56465 54519 34639 30069 33726 45983 46072
11758 46072 32913 21765 28057 39198 51061 50549 45484 42488 43483 39030 29272 33780 45942 46804
11744 46804 47657 50719 53768 52081 43377 34376 38538 48977 45620 39748 45043 50752 39496 34774
11730 34774 31380 30779 36123 52485 55672 52847 47321 31837 32864 34955 25961 28972 36604 45866
11716 45866 37351 27007 28772 44421 54068 47694 37999 24436 21000 41110 57774 66250 72385
11703 72385 68522 60569 44408 26440 24012 22055 35396 50488 46779 38495 39262 39993 26563 29390
11689 29390 34979 40610 41558 46864 48017 42674 39233 42010 46596 50296 52533 46666 43337 36829 35013
11674 35013 37678 40899 31751 20022 25454 33498 33247 30372 26357 27464 40078 46113 59423 49404
11660 49404 41609 36748 38205 44607 50074 42534 39591 49189 62175 64281 52274 49145 38830 38005
11646 38005 46720 46198 41314 37898 38834 53907 54275 58804 56501 45216 35792 44192 39391 35958 36487
11631 36487 28404 33673 36775 29945 33350 41312 42266 46732 40133 40072 38596 47467 50256 38022 40925
11616 40925 34491 41090 37582 39898 54933 63317 51320 47428 37390 39429 26943 33399 43588
11603 43588 23114 13963 23085 19536 25945 28566 34378 36563 33962 27587 38138 45887 53289 56077
11589 56077 50224 42111 31632 25104 36993 45428 35197 17891 19718 28683 30499 40983 40810
11576 40810 24269 14610 29107 30221 17523 12718 13972 26367 40101 40593 27013 24043 29621
11563 29621 37673 33479 35337 50568 45669 47366 45128 18714 10254 16485 27594 42585 49644
11550 49644 50937 56299 52410 37944 28581 29298 18222 26430 33925 30388 34615 29977 36766 57833
11536 57833 54649 45093 36116 29672 36957 45676 51979 43222 27026 29025 37278 55735 59387 43526
11522 43526 25229 34670 47715 52543 37689 36701 38812 51083 45194 33122 39844 48736 61408
11509 61408 51239 49217 49233 56055 63949 69024 52185 50493 62583 58461 43960 32139 23971 25199
11495 25199 23855 19350 28241 36227 36146 37110 43917 32117 29896 33948 41448 42153 29337 20756 19341
11480 19341 23931 27029 21285 20990 23243 21980 36388 26813 44340 45560 55264 59064 51692 53473
11466 53473 58689 51897 35534 24735 25330 23621 28863 26472 22189 28442 40628 44107 45021 49173
11452 49173 47549 46244 43292 47009 39735 29845 28264 25407 24519 29625 44600 46351 35833 27295
11438 27295 25631 31075 39048 37341 37398 36129 31125 40640 41973 33718 26811 27184 38843 45846 45611
11423 45611 46715 38094 34552 32061 36209 47629 47388 39453 35810 37655 30031 30454 45043 52579
11409 52579 59565 55589 54580 56641 60824 42368 35674 48383 39847 20064 9270 14984 22623
11396 22623 21304 31601 31768 25070 23081 23696 15981 7690 7612 15932 26684 30630 42464 44318 39523
11381 39523 41390 39682 33205 43087 38562 35333 40054 52621 49561 48574 29675 25272 22455 33370
11367 33370 37839 33625 31571 28176 26231 42843 52247 43178 36176 30618 21288 28514 20905 22327
11353 22327 37724 40234 40668 34448 51731 44969 40942 44345 49895 56067 58568 58197 49810 47359
11339 47359 46606 55618 59230 56074 37730 38058 41742 44001 53158 51994 59968 60901 64211 65854 64865
11324 64865 59852 37878 36077 37409 48434 67213 71493 68926 83070 80524 67980 66296 69976
11311 69976 61450 52337 52161 41481 34795 41030 49089 33263 27722 30508 27785 37464 37829 42022
11297 42022 38642 34360 26620 21470 21063 11394 4901 15803 35855 42125 42608 34569 29959 43935
11283 43935 34586 32903 46734 65659 78908 92836 103908 101342 97876 90211 80495 68759 58463
11270 58463 74426 80912 66220 67505 71901 71690 56635 53212 49329 44346 53171 53358 52208 39988
11256 39988 30728 26033 19312 20967 36211 48845 54091 45522 39121 34318 36497 43472 59014 64898
11242 64898 52527 52153 49190 56467 67876 55991 37886 25255 31036 24937 8041 12969 23954
11229 23954 20877 16985 22352 38202 38547 37301 27614 27430 48928 52485 51108 45011 43660 49271
11215 49271 42524 28316 23165 13663 18777 22395 30903 34195 41369 32450 23229 14154 15549 28798
11201 28798 10156 -1150 3167 19745 30130 27607 22350 17472 10933 30739 52667 46066 33795
11188 33795 25599 23921 21181 21645 32353 31030 38860 44625 36200 45702 38671 27129 28867 24827
11174 24827 22339 11907 15583 20809 11539 18004 24956 21543 15790 13195 16697 5837 4164 18721
11160 18721 23363 13545 7260 4342 21683 24534 12007 13237 17056 13305 13363 12295 12694 4116 5601
11145 5601 7081 26638 25453 22621 17813 28825 35746 30382 31190 27575 25222 6677 -8181 -8167
11131 -8167 -1280 1668 -4466 -5836 -2411 -3711 9323 19627 24548 39741 45043 35820 23087 12906
11117 12906 2538 -3911 -5151 2564 15521 24280 35691 31306 28994 33222 34080 34795 38052 36299
11103 36299 24475 20334 14456 11827 6734 5552 15447 26138 34224 42235 41674 16984 10173 15700
11089 15700 5211 10786 14008 27366 23040 21956 14024 13599 14102 4122 898 11604 21995 13915
11075 13915 8350 2416 10242 15274 9912 4539 11003 18359 24096 27716 20073 11478 -312 -3012
11061 -3012 7108 8038 -1988 -9449 -3846 8678 20129 19758 18988 13222 10194 4770 -16293 -31122
11047 -31122 -20362 -7011 -2197 -1216 -2987 -200 -9327 -16119 -19650 -20079 -18871 -12831 8627 24823
11033 24823 15384 10425 18873 20453 21948 20293 28639 16347 14644 19152 6610 7118 6707 -5277
11019 -5277 -13806 -17157 -31441 -26123 -22719 -15876 -11211 -19966 -15338 160 5599 13716 18322 3289
11005 3289 -23492 -32158 -14001 4786 9385 9483 7557 5548 10925 2864 6985 2174 -4990 -4933 -17667
10990 -17667 -15495 6975 11283 6859 1330 2786 5320 1112 9065 26831 36300 42097 35669 19538
10976 19538 23446 25854 15738 -5320 -11340 -15525 -14340 -11836 -15930 -21028 -15970 -7395 -6025 -4721
10962 -4721 -326 -1562 -11851 -14466 -13174 -2604 250 -3746 3614 12997 -5151 -7044 4659 -9167
10948 -9167 -15730 -7798 -10738 -8896 -15520 -11769 -8088 -7463 -1744 -1941 -5104 -15107 -11559 -5070 -3960
10933 -3960 -9011 -12726 -3334 -4661 -1146 13377 15962 66 -14846 -21070 -11785 -9933 -2077 -5514
10919 -5514 -20868 -20364 -687 16223 17178 12336 3662 6240 13155 10742 15493 900 -10057 -12629
10905 -12629 -12308 -5959 3520 5797 -8154 -8445 2222 -16235 -33171 -19589 -16712 -14235 -4889 3505
10891 3505 -6230 -9742 -4985 -5456 -3253 -18812 -19137 -11805 -8850 -58 -9002 -5831 264 -4865 1043
10876 1043 1258 1146 8654 5139 -5872 1973 -427 -11216 -15955 -26585 -25370 -16231 -14278 -16491
10862 -16491 -18102 -21087 -25901 -17541 -5125 -1936 -9188 -4953 9542 5249 13472 20501 10475 5052
10848 5052 3878 4048 6036 5310 -6005 -28188 -24361 -9785 3953 5795 10482 19977 25414 14873
10834 14873 3986 7744 4466 10576 14498 17319 11901 760 5107 3564 -11909 -5405 -628 -14562
10820 -14562 -17286 -14880 -8536 3917 12787 17915 24121 16754 -2177 -7084 -8326 -7310 -638 5077
10806 5077 8629 4397 -522 -332 -2903 930 -2139 812 -12789 -15325 -5722 -12362 -17634 -393
10792 -393 15927 17151 9714 8033 19546 13826 8079 7137 -6353 -14232 -12493 -16446 -15460 -24169 -17894
10777 -17894 1063 -1319 -3240 6641 -5075 -16043 -20840 -14361 -14266 -21556 -28119 -25120 -13482 -10119
10763 -10119 -19452 -22088 -12862 958 10302 7852 2631 -474 -6138 -3850 14402 19261 16771 2900
10749 2900 -1226 -5935 -14768 -15047 -9212 -9923 -17608 -33952 -43716 -38544 -23591 -1394 -1369 -6006 -6937
10734 -6937 -13238 -13363 -16902 -17944 -19582 -27144 -22739 -20259 -13926 -21437 -17102 -13924 -17723 -28910 -18429
10719 -18429 -12657 -14884 -13451 -16991 -18244 -26418 -29110 -28445 -23223 -19747 -15378 -20486 -13432 -2472
10705 -2472 -1407 -1324 -7099 -12930 -24262 -15767 -13262 -25208 -18128 -20446 -23976 -26849 -18369 -1383
10691 -1383 3209 -4756 -18052 -22420 -10281 -5372 -20719 -40483 -26233 -19411 -26856 -14500 -12605
10678 -12605 -17789 -23998 -18122 -16901 -24329 -37558 -45441 -42750 -28848 -23163 -35428 -34734 -26978 -12401
10664 -12401 -1378 -1306 -3129 -8834 6716 16550 4638 -12584 -19156 -10344 -4256 -5220 -7190 -2910
10650 -2910 2891 5017 -11108 -27646 -21718 -18381 -16233 -20884 -26892 -29862 -21173 -13133 -9961 -10125
10636 -10125 -11360 -17400 -20431 -20723 -4680 -5771 -13524 -24784 -27678 -31094 -16807 -12923 -10602 -311
10622 -311 -17233 -30540 -31004 -21232 -26638 -41096 -33417 -22739 -15673 -18140 -29462 -32856 -24249 -18775
10608 -18775 -7464 -14011 -16492 -20750 -26933 -30956 -28846 -32142 -19482 -27199 -38912 -41175 -44721 -52563
10594 -52563 -42616 -30438 -21712 -12022 -13323 -13622 -14842 -21573 -14484 -28801 -23566 -14597 -22886 -24147
10580 -24147 -14911 -12560 -27170 -24567 -5373 -14078 -24501 -31456 -26241 -24982 -30917 -27240 -11400
10567 -11400 -13081 -15520 -28752 -34986 -30286 -39879 -42950 -40172 -37804 -18044 -12561 -21043 -22024 -15500
10553 -15500 -23516 -18330 -27126 -25367 -19735 -14009 -18138 -33791 -36755 -39812 -41523 -47742 -49696 -50121
10539 -50121 -51231 -37597 -42609 -48902 -39564 -29186 -26648 -16927 -18548 -32649 -36035 -36996 -40069 -43971
10525 -43971 -43403 -43370 -24723 -14181 -10081 -19888 -21137 -14281 -16786 -24997 -25015 -27231 -33109 -29430 -32213
10510 -32213 -39105 -27941 -19348 -23152 -18872 -12857 -15553 -24386 -22616 -34935 -35595 -32382 -39970 -41624
10496 -41624 -37697 -29806 -16091 -24537 -41000 -32900 -30148 -39624 -25940 -19864 -26535 -35015 -34248 -33070
10482 -33070 -42178 -47601 -37890 -30549 -30140 -25493 -32360 -27178 -18145 -16483 -16637 -23814 -21759 -8666 -17573
10467 -17573 -21228 -16155 -11063 -24310 -38592 -37264 -23593 -12726 753 -3885 -3780 -7929 -17409
10454 -17409 -13185 -14080 -22383 -24153 -30335 -33255 -21671 -21644 -30361 -29789 -18150 -31401 -32695 -38248 -38979
10439 -38979 -30427 -34896 -31431 -26468 -30228 -29172 -29870 -24148 -15980 -13824 -7934 -5044 -15473 -16211 -21082
10424 -21082 -28120 -22699 -25881 -25518 -8963 -1749 6343 6829 -6919 -14214 -12136 -1240 -2597 -11330
10410 -11330 -10220 -11177 -20396 -24402 -25577 -23707 -16549 -24615 -22180 -19935 -14904 -12859 -19306 -32280
10396 -32280 -45404 -50436 -45986 -41688 -39397 -28250 -13117 -11308 -7580 -8662 -20382 -23719 -15809
10383 -15809 -21085 -8012 -4886 774 -4975 -18648 -19013 -8937 -12911 -9908 -1805 -3044 -16457 -17081
10369 -17081 -30812 -47210 -34779 -30652 -39057 -30649 -27232 -31269 -45178 -47266 -28400 -26458 -31193
10356 -31193 -38022 -48720 -48688 -41719 -41207 -38401 -40342 -41962 -43282 -36158 -16852 -26055 -24868 -33468 -51070
10341 -51070 -47835 -39114 -31102 -28181 -18852 -9994 -20173 -21055 -22448 -21968 -14371 -10927 -23257 -35571
10327 -35571 -36434 -36027 -35633 -44508 -42948 -49640 -57867 -55832 -56405 -44361 -25055 -9669 -8012 -21132
10313 -21132 -21707 -19880 -24371 -20710 -28145 -16110 -17719 -23017 -17948 -16757 -13349 546 -7368 -4333
10299 -4333 -4585 -1088 3122 -2918 3699 1026 -6916 -3537 -9392 -9304 -8669 -2920 -21992 -11853 -4599
10284 -4599 -4271 -16874 -27138 -21291 -8029 -19615 -10242 -6801 -9316 -2405 -2839 -2086 2274 6253
10270 6253 5356 7803 798 6352 3972 -1955 -7782 9081 -1548 -11867 -22307 -16144 -18543 -26412
10256 -26412 -19030 -18637 -23031 -9410 -1764 6999 1446 11978 18467 11989 7797 16007 21206 15264
10242 15264 23161 29246 20969 18723 13031 12587 22146 29934 37601 30450 29541 39999 55559 83861
10228 83861 113129 129671 159506 184421 189408 190333 190094 169078 153865 139827 117719 89906 72285
10215 72285 56387 39844 23035 11813 23613 39627 30791 37375 33636 31321 34195 38821 46807
10202 46807 41595 34694 32151 45809 39232 23007 23900 22855 17567 15204 20353 4717 -11264 -25581
10188 -25581 -22330 -13365 -21402 -21086 -11381 6686 -5865 -3022 -5425 -7125 -429 62 7140 -4906
10174 -4906 -21716 -21457 -30598 -39477 -37531 -28664 -11684 -11471 -7480 -17309 -22911 -32379 -42730 -54250
10160 -54250 -54963 -48882 -38126 -38961 -45279 -34256 -29851 -35466 -30300 -29733 -37299 -36865 -28792 -25633 -21396
10145 -21396 -24634 -22946 -20304 -8437 -2985 -5803 -7637 -2564 -8830 -17913 -13147 -8677 -8917 -19432
10131 -19432 -20761 -16896 -5939 -4756 -10472 -11478 -1728 10645 8282 -6001 -20804 -24255 -29013
10118 -29013 -32915 -26062 -24822 -22912 -20176 -16418 -21172 -28493 -38229 -41620 -22299 -12137 -12832 -13165
10104 -13165 -9343 -10231 -11178 -23822 -31695 -27184 -28874 -28219 -21297 -22993 -24603 -20541 -1918 -3165 -11040
10089 -11040 -9702 -16494 -25014 -17695 -19796 -22944 -20511 -18315 -18692 -14438 -10645 -31750 -39659 -24915
10075 -24915 -5308 1549 -11977 -13789 -2865 -8955 -17906 -14816 -9095 20 -5936 -12906 -21935 -19946
10061 -19946 -35385 -43324 -44913 -51321 -42317 -38891 -32644 -16441 -13989 -16673 -21397 -13600 -23723 -31189
10047 -31189 -29243 -30411 -22792 -31775 -33389 -35674 -39704 -25699 -19521 -11987 -10961 -5400 -11365 -24056
10033 -24056 -25369 -20025 -15452 -28514 -40565 -36486 -30035 -26163 -15076 -25765 -35563 -40654 -34106
10020 -34106 -33552 -33679 -34359 -23764 -14672 -13667 -13079 -18594 -20786 -11662 -15131 -12633 -3982 -1469 7183
10005 7183 2329 -7829 -10269 -13082 -15457 -9353 -26520 -31995 -31686 -33122 -31796 -33519 -29002 -20002
9991 -20002 -27793 -26878 -20443 -20809 -21534 -16295 -14115 -13976 -15183 -27009 -33505 -30601 -31008 -38126 -36911 -27730
9975 -27730 -20756 -26856 -35477 -23087 -17564 -23343 -33821 -35563 -20848 -20396 -19819 -19025 -28938 -23269 -31039
9960 -31039 -22217 -14441 -13808 -10310 -28842 -31920 -22923 -32043 -40376 -46161 -43359 -19677 -3755 -3733 -3044
9945 -3044 9803 8643 -3476 -12403 -14919 -7754 -8008 -22937 -41869 -36576 -20197 -30352 -32130 -23352
9931 -23352 -19763 -10458 3038 -134 -10110 -16869 -22136 -7291 4335 669 -5665 -9955 1459 14699
9917 14699 16396 11354 24016 18094 11659 11077 10597 15104 12612 10977 12729 15024 29140 38343 36730
9902 36730 44990 44681 45853 50247 56282 79262 98175 110159 135065 153821 158171 191367 236726
9889 236726 262577 320228 412424 542033 763977 1124210 1690397 2381041 2730919 2372409
9879 2372409 1613889 960233 548135 320554 202362 147464 116134 86563 78015 79524 73372
9868 73372 60725 33967 9483 -8379 -13666 -22285 -28247 -25706 -27611 -43303 -49288 -43974 -45499
9855 -45499 -57182 -59022 -54889 -52633 -53923 -46340 -35004 -28108 -33261 -27827 -23320 -28408 -41912 -39431
9841 -39431 -32648 -26729 -38646 -57137 -60688 -45331 -33351 -40881 -43677 -56853 -67164 -66890 -65569
9828 -65569 -69055 -59964 -53580 -53919 -55509 -41768 -25377 -26324 -14376 -15951 -20815 -23178 -33663 -35243
9814 -35243 -41163 -25371 -13739 -15149 -17869 -15394 -16276 -16101 -19884 -22232 -20694 -9800 9163 23126
9800 23126 39379 82695 138313 206376 238594 199093 118828 65350 24965 -10648 -22842 -27592
9788 -27592 -12022 -19449 -25538 -22889 -26749 -15878 -12460 -26708 -35465 -41115 -51812 -56309 -57559 -50541
9774 -50541 -33048 -18435 -11291 -12758 -21061 -46689 -48185 -52155 -57877 -57900 -51934 -52466 -58883 -51492 -24812
9759 -24812 -25054 -39895 -40898 -41088 -38744 -46523 -60061 -51463 -53016 -59588 -39954 -42041 -52460 -68960
9745 -68960 -52407 -36907 -37974 -32596 -24027 -23769 -21242 -16360 -23308 -28060 -22454 -14606 -6717 -6817 -10764
9730 -10764 -9247 -15133 -23652 -22462 -13830 -4083 2739 -1593 287 935 -5166 -14805 -20180 -19641 -17332
9715 -17332 601 2248 -1032 10482 9553 1441 10804 16065 28802 44344 68551 79558 102573
9702 102573 133947 172265 231419 325402 477091 654331 860038 1000193 983059 825798 588614
9691 588614 369528 219167 124586 65821 32720 5273 6383 5190 2482 -15424 -25904 -22613
9679 -22613 -14237 -20553 -31446 -33378 -39880 -55332 -54781 -50523 -48926 -42438 -39098 -32287 -23017 -21968
9665 -21968 -20678 -23748 -33425 -46390 -39233 -31747 -28011 -27486 -24885 -25824 -19043 -24746 -29286 -23860 -8392
9650 -8392 24871 53588 48266 27324 17468 18322 19112 11298 -7270 -25429 -31289 -35625 -35393 -33270
9636 -33270 -23916 -34544 -49620 -60158 -52127 -42913 -46276 -52926 -51642 -56171 -53952 -55399 -52293 -44434
9622 -44434 -54785 -60297 -58212 -53706 -49986 -40244 -44937 -36327 -24594 -34618 -53138 -49276 -42017 -49561
9608 -49561 -46628 -46287 -46477 -39415 -39816 -38170 -60044 -67621 -65819 -55092 -31539 -16769 -15513 -18021
9594 -18021 -16443 -13388 -16635 -19585 -20075 -31094 -40690 -42624 -26573 -13674 -22418 -20695 -17125 -6555
9580 -6555 -8338 -16345 -16879 -22685 -27867 -31934 -30764 -28026 -24562 -24486 -21562 -11450 -7136 -25568 -31110
9565 -31110 -26710 -17183 -18372 -27874 -33517 -21490 -14578 -13072 -21423 -16250 -16850 -24060 -30725 -39280 -51426
9550 -51426 -31850 -27430 -32116 -34407 -32688 -34233 -30883 -17985 -3648 -5893 -26822 -44995 -34261
9537 -34261 -32219 -36453 -46289 -53134 -44654 -43236 -55803 -49543 -45307 -39957 -52815 -54026 -50015 -57010
9523 -57010 -41077 -24249 -19904 -27293 -34172 -42204 -32800 -28985 -32074 -35870 -44940 -34751 -26149 -9728
9509 -9728 -12613 -18831 -16996 -18312 1754 10739 -4117 -10198 -12786 -1893 1018 -7149 -14360 -5978
9495 -5978 -2713 -12458 -26192 -35677 -47938 -45045 -37283 -24016 -24642 -31909 -28031 -20734 -18588 -10623
9481 -10623 -3585 -11275 -18065 -26291 -32853 -13121 -4633 -14739 -17135 -10452 -1395 -3340 7692 17166
9467 17166 16383 17070 13797 2886 -2526 9540 10185 -3898 -6004 -1782 -15654 -23158 -27557 -28701
9453 -28701 -31458 -25978 -14814 -23171 -31350 -23484 -24017 -19690 -16542 -20144 -27416 -18031 -12165 -12245 -19181
9438 -19181 -21443 -17966 -27302 -29981 -16956 -10968 -7730 -15507 -26356 -10871 -3940 -10091 -18474 -20456
9424 -20456 -27972 -30074 -23378 -15977 -7005 2334 -1518 -12585 -9491 -11149 -4949 -1661 -1709 2902 11534
9409 11534 13867 -11586 -12592 -21037 -27843 -29300 -37195 -42122 -40141 -37021 -12456 -6870 -16227 -33757
9395 -33757 -36946 -28715 -19696 -15564 -19312 -23843 -17610 -12484 -6693 -10956 -9279 -13703 -10765 -11120 -9680
9380 -9680 -1180 1188 -1845 -8664 -28781 -32007 -19190 -19308 -23820 -35292 -32763 -32667 -25061 -17261 -15222
9365 -15222 -8155 -6987 -2181 8261 8253 -1403 -8086 -8189 -12805 -22117 -21625 -16065 -6928 -2325 2502 459
9349 459 -1759 550 -6057 -13686 -23023 -20887 -23245 -12274 -7439 -22417 -36180 -28929 -23667 -12415
9335 -12415 -2706 -11344 -20812 -18789 -22497 -20396 -26668 -29838 -23911 -23254 -14203 1009 11338 773
9321 773 -8913 -15937 -10942 -11954 -21165 -20237 -12197 -5665 -2685 -1856 -7917 -16829 -28933 -26423 -16211
9306 -16211 -9646 -9312 -20127 -15471 -15223 -28474 -43635 -45333 -40223 -34824 -23263 -23944 -15174 -12259
9292 -12259 -12241 -17722 -6837 8233 21066 21293 4407 564 -11885 -12245 -8968 814 -5327 -8835
9278 -8835 -8271 -8798 -7998 -8126 2177 3841 2445 12194 12908 7654 4317 -9647 -11746 -7736 -4269 -7381
9262 -7381 -2383 10858 10361 10008 8433 -3225 -14368 -19938 -13478 -14706 -16182 -19376 -22203 -11724
9248 -11724 -14251 -20893 -32055 -33241 -34257 -38143 -34546 -31547 -24177 -18048 -15940 -19746 -20702 -16888 -11744
9233 -11744 -3980 8849 13858 15410 5157 7700 11614 4086 5789 2697 -5552 -13548 -10973 -7717
9219 -7717 527 12714 16651 14996 22447 7955 -7222 -3394 -3950 3235 6050 4501 1788 1057 9717
9204 9717 -1324 -713 6703 7858 -6323 -1135 11334 11161 15876 21794 17122 25437 20997 15976 10133
9189 10133 8161 514 -10913 -1613 -883 -13331 -5650 1718 14547 15316 18264 12007 1292 -1812
9175 -1812 3752 9418 11242 6723 -5252 -5206 -8825 -3243 -2878 -3006 8549 9478 8332 -10704 -17582
9160 -17582 -10584 -10512 -15194 -3017 3292 6962 3287 12774 14838 -4914 -16644 -13513 -2588 945
9146 945 8129 2558 15638 20335 13475 22978 32850 19865 14018 15314 11921 -289 -2283 1112
9132 1112 -2053 -5616 -614 11272 17432 18482 4320 -1460 5477 15965 23321 18393 25101 29601
9118 29601 37306 33774 27611 15174 10776 10298 20000 39933 39804 26245 37600 44376 39412 15404
9104 15404 3785 2682 13538 30663 32006 28353 31027 20044 21073 16492 11903 6491 16016 18849
9090 18849 10274 8407 1913 -12548 -5827 -11770 -19128 -11978 -9957 -677 4513 11668 -2735 -13077
9076 -13077 207 9433 13027 16800 4586 -13352 -11852 -13100 -4987 7476 16153 28721 28956 23502
9062 23502 31335 34204 17823 16666 18848 17691 9844 22795 23948 7828 -5066 -1659 22216
9049 22216 31903 41308 32357 15773 19631 16155 12229 5598 4067 10535 17270 17461 31526 41350
9035 41350 33593 19645 21792 32667 37341 37150 34162 25941 28843 24952 27861 27613 34185 26716 16253
9020 16253 15395 11619 24402 32513 44598 51185 47703 30510 18434 18529 39168 29854 6461 14487
9006 14487 18230 26169 26989 27272 22866 26683 38193 40894 19982 15291 24241 33456 47189 49563
8992 49563 36044 28962 24159 11359 10278 10380 10308 19513 22907 11038 7834 -2333 6143 10603
8978 10603 17539 10543 13989 18993 23629 32471 25283 2842 8818 21270 33143 40064 32929 27960
8964 27960 18295 22750 30400 25324 24492 26972 18055 5080 737 8502 11093 8363 12374 20843 9362
8949 9362 15321 18753 9299 8200 14030 2823 869 16825 21758 18003 18221 23258 19462 25497 22746
8934 22746 30177 17925 13635 36020 45560 41475 45929 40772 31551 20841 28419 38504 31823 24838
8920 24838 18195 8214 -9189 -9282 -14191 -13190 -6407 4480 -8852 -4504 778 401 5081 4802 11284
8905 11284 11923 -3815 -12336 -9966 -14588 -6364 2777 7021 13242 8349 948 9841 21405 18148
8891 18148 19228 27279 43914 41616 39417 30702 4658 -21913 -10202 -1010 -18568 -28903 -27681
8878 -27681 -31058 -37601 -40624 -13464 -3780 -320 3197 5254 8996 4089 9278 4154 5395 7836
8864 7836 -2104 -7831 -19353 -17721 -3501 7109 15251 23095 19054 6331 14975 25409 9699
8851 9699 16764 28011 26257 28964 22683 12834 18685 7262 -8004 -9575 -12305 -23166 -32525 -36736
8837 -36736 -16309 -4661 -10742 -11083 -10274 -15517 -24213 -35555 -34452 -22642 -17867 -27428 -21629 -14851
8823 -14851 -8509 2811 7464 -2069 -9593 -8540 -7469 -7672 -9069 -21977 -32648 -27402 -22271 -16442
8809 -16442 -17997 -10121 -5942 -3749 -3192 -12815 -12482 -8941 -13474 -21782 -29472 -27612 -10535 -1316 -5550
8794 -5550 7260 3472 4915 525 1318 9201 1563 -7241 -17460 -19073 -19403 -23629 -35380 -34359 -23683
8779 -23683 -2627 -17051 -18984 -19446 -11191 3168 -664 -1057 -98 11251 10815 167 4630 15264
8765 15264 2489 -13986 -15627 -17957 -17588 -15678 -21733 -18775 -8530 -6619 -3449 -12987 -8882 -6795
8751 -6795 -9580 -3572 -13527 -26687 -41314 -39659 -27059 -26467 -23328 -22362 -33598 -34096 -36642 -25912
8737 -25912 -9228 -5794 -895 1220 -1826 -17936 -11196 230 559 -4713 -2807 -17245 -17267 -5206
8723 -5206 -13875 -20945 -13028 -3463 874 -5894 -4722 -5997 -5145 -12156 -11785 -2174 -772 -1797 -15840
8708 -15840 -23353 -4759 -4293 -5455 -3031 -9944 -15506 -15725 -19154 -20542 -30274 -50967 -53095 -41914
8694 -41914 -33765 -33457 -20880 -7095 -4390 -4166 -11891 -22952 -28810 -27065 -21556 -23777 -36952 -34038
8680 -34038 -19372 -16665 -23478 -27513 -31430 -41709 -28683 -28696 -30440 -28412 -28285 -25844 -18706 -4044
8666 -4044 -7054 -7711 -13419 -12679 -9612 -15016 -32959 -30425 -26310 -35929 -32558 -30732 -13421 -4656 -21919
8651 -21919 -29337 -26706 -21940 -34899 -37016 -27098 -30161 -24393 -24120 -18070 -35094 -39163 -41636 -37886
8637 -37886 -33677 -26261 -16673 -21037 -15234 -9339 -18221 -29933 -28966 -18660 -10267 -20751 -32213 -33035
8623 -33035 -34776 -27011 -27043 -23845 -22477 -38130 -36617 -23134 -19184 -12789 -18122 -20158 -15781 -27111
8609 -27111 -22385 -8880 -17329 -21221 -24670 -31508 -36928 -21823 -28382 -50021 -49651 -57824 -60471 -57315
8595 -57315 -44423 -38772 -42309 -35814 -28510 -24221 -14307 -18009 -12585 -16910 -10647 -12750 -14658 -19783
8581 -19783 -17310 -20389 -15983 -13449 -14849 -15981 -15367 -24578 -30167 -28493 -28044 -27409 -13640 1256 11099
8566 11099 13538 10161 -5906 -13575 -14971 -18372 2911 18342 11963 -2993 50 -15807 -6952
8553 -6952 357 10653 12696 535 -10033 116 4505 -3310 -4837 -525 -4473 -8847 -7556 -18187
8539 -18187 -15428 -9392 -2339 -1076 -12819 -22798 -14282 -17278 -10608 -4602 -22842 -34786 -35352 -36956
8525 -36956 -37175 -35597 -37234 -28531 -11474 944 4247 -6823 -21396 -24936 -24585 -23338 -26276 -19386
8511 -19386 -4609 3949 -2797 11409 8037 1021 -17939 -19318 -17203 -11128 -24621 -33570 -31087 -31914
8497 -31914 -28828 -31426 -28975 -32862 -44072 -34885 -32077 -43971 -36489 -16965 -1402 -4139 -13273 -19486
8483 -19486 -22733 -27816 -31879 -33009 -22480 -5661 -4875 -3259 -3149 -4053 -19160 -11902 -8890 -22451
8469 -22451 -38358 -37101 -29086 -11638 -17726 -18138 -26218 -33203 -32113 -25682 -16646 -16629 -23046 -29607 -19619
8454 -19619 -11370 -15208 -20924 -14852 -18213 -11294 -4962 -15799 -20975 -14598 -6048 -7576 -3105 188
8440 188 -9807 -14585 -9489 -1161 -5504 -23060 -31785 -23794 -28699 -42277 -43945 -40426 -39008 -22549
8426 -22549 -6106 3427 458 1117 -3912 -13816 -11149 -8707 -27605 -31150 -32550 -25473 -16425 -18321
8412 -18321 -31131 -23407 -13821 -13701 -16258 -18190 -25713 -26924 -17859 -20537 -21874 -18991 -17883 -21298 -26025
8397 -26025 -8293 -8081 -15411 -21474 -14611 -13329 -19097 -10907 -13927 -22179 -19307 -14941 -28641 -39685
8383 -39685 -30820 -27822 -22850 -20379 -28798 -32233 -26066 -11877 -12386 -19778 -27419 -29720 -41472 -39835
8369 -39835 -23406 -17201 -13755 -8296 -13465 -12601 -15315 -16093 -11579 -6694 -11541 -20387 -29578 -30032 -31514
8354 -31514 -25080 -7200 3150 13041 6402 -1100 -11615 -26611 -23018 -16249 -29144 -28806 -14299
8341 -14299 -3109 -6089 -13114 -9893 262 8789 4449 -10989 -14063 -18723 -21275 -21949 -17748 -23574
8327 -23574 -35835 -33742 -25144 -25531 -19806 -22565 -19781 -17050 -5535 2858 -4234 -4146 -6826 -7216 -11765
8312 -11765 -12585 -10896 -13801 -15079 -18721 -27364 -39280 -32659 -13373 -1960 -4113 -8907 -11959 -11965 -16452
8297 -16452 -26335 -34668 -32424 -25169 -27198 -26229 -32553 -34181 -18890 -14491 -18403 -16048 -13370 -34537
8283 -34537 -34496 -37724 -50719 -48989 -53646 -41728 -27701 -7618 -9420 -30126 -46161 -31615 -20473
8270 -20473 -9127 -12002 -13815 -24518 -33565 -34603 -25240 -21201 -11345 -15238 -23096 -16385 -15835 -15216 -9224
8255 -9224 -2978 -14672 -29022 -24952 -12123 -1659 -3977 -8635 -12758 -15310 -18201 -18069 -17322 -17041 -20044
8240 -20044 -18405 -17189 -24124 -27965 -29049 -28733 -23903 -24036 -24577 -33314 -32397 -37618 -48815 -35224 -34312
8225 -34312 -18476 -19278 -23876 -13696 -2946 -19492 -30815 -25626 -46962 -52811 -45002 -47373 -60607
8212 -60607 -56134 -43727 -23373 -13250 -24624 -24450 -21910 -15923 -11211 -10550 -14058 -21053 -22797 -7850
8198 -7850 -6476 -9198 -5589 -18601 -30890 -37451 -42981 -48448 -54730 -51164 -42504 -45132 -44499 -32444
8184 -32444 -36543 -40750 -24221 -28067 -37439 -33052 -21876 -9792 -10127 -12926 -10334 -10696 -3239 -21104
8170 -21104 -31103 -27999 -18958 -22178 -30377 -20465 -5167 11307 5759 -6992 -5145 -18454 -40919
8157 -40919 -48461 -38816 -40154 -23399 -14894 -19273 -23279 -30323 -28124 -19335 -17624 -28545 -34875 -17739
8143 -17739 -17847 -26981 -35032 -39669 -30076 -11255 -5969 -4928 -13274 -8594 -12144 -15846 -11669 -19760 -17504
8128 -17504 -17884 -24991 -32325 -33171 -24153 -35883 -39868 -30704 -24718 -34729 -34614 -33376 -45672 -53039 -50975
8113 -50975 -39532 -33693 -26844 -10280 13784 9988 -1586 -8450 -15790 -21816 -31885 -32855 -30282 -33163
8099 -33163 -34032 -37839 -29140 -26534 -26487 -26868 -20973 -9852 -11130 -19607 -7251 -27401 -36665 -35054 -35455
8084 -35455 -28085 -28216 -42500 -49856 -53285 -30683 -21423 -25451 -34141 -30403 -39483 -35525 -30051 -25844
8070 -25844 -25812 -19337 -30341 -46656 -43906 -26461 -9774 -12023 -19599 -22359 -26282 -26447 -30384 -47115
8056 -47115 -51277 -46920 -42908 -35421 -30977 -29617 -33023 -36944 -35592 -34935 -39488 -21593 -11230 -16894
8042 -16894 -23554 -23703 -38927 -39888 -40116 -42716 -32099 -28184 -42840 -49233 -43129 -47159 -46443 -40543 -18567
8027 -18567 -15935 -19032 -22291 -21915 -30212 -32052 -23610 -7659 -4794 -11826 -18142 -20115 -2493 -11575
8013 -11575 -19700 -15067 -7241 -6658 -6636 -17935 -11513 -17768 -17832 -13072 -13659 -17687 -8065 -7592 -13330 -11560
7997 -11560 -6132 -1586 1547 2378 -3396 -19990 -33043 -42194 -36715 -28769 -16386 -9913 7524 9274
7983 9274 5800 -4426 -13030 -11519 -19222 -12191 5614 294 7885 1086 -15516 -10365 -7504 -6169
7969 -6169 -3344 -4708 -13204 -31879 -24723 -21701 -22499 -24958 -18307 -3661 -4111 6201 6101 6109 -8962
7954 -8962 -10929 -4673 5234 18416 32301 20969 13142 14666 10681 8932 18868 23042 15353 9333
7940 9333 9498 11680 -11872 -23729 -25471 -18793 -11952 -18595 -14812 2291 2146 -6908 1695 15021
7926 15021 13831 8068 17753 13440 11079 18363 19598 -2697 -2689 -1089 -7074 -3805 6249 12577 -899
7911 -899 -906 -11020 -13938 -3053 10020 8091 8678 3360 -4660 -4663 -3001 -20926 -15752 1314 11521
7896 11521 1882 -10167 -7205 -4527 -1511 -1240 7642 4746 -1568 -754 -19885 -17922 6466 8622
7882 8622 12821 8247 -3668 -12108 -21662 -28973 -37379 -27194 -15216 -11183 -11626 -9756 463 5215
7868 5215 2356 9610 8256 10834 -5856 -19795 -27040 -20753 -19691 -20758 -9984 -14653 -5059 4407
7854 4407 -3509 -1449 -7450 -29283 -24050 -23280 -22152 -27565 -25412 -27682 -38478 -29075 -24827 -31911 -33868
7839 -33868 -20421 -12087 -5379 -11784 -11993 -5237 -1362 -5588 3924 3267 -6410 -8360 1105 4505 268
7824 268 -540 -3424 -15929 -30183 -36170 -34115 -27185 -16345 -9453 8745 892 -13025 -17248 -22198
7810 -22198 -21644 -28700 -33586 -29558 -17167 -12176 -21757 -17201 -11024 462 -13941 -19977 -20128 -27314
7796 -27314 -29987 -28648 -30238 -29263 -30978 -28899 -29556 -28703 -20519 -14768 -9832 -4873 -12623 -12447 -27007
7781 -27007 -25593 -27536 -23589 -14244 -9846 -15390 -19451 -25119 -18873 -24972 -40942 -38979 -34253 -32885
7767 -32885 -31430 -36642 -41804 -43270 -34073 -25201 -17841 -14654 -9830 -22281 -28858 -20351 -25111 -23081
7753 -23081 -16583 -10617 -505 -11386 -16004 -16631 -30752 -36338 -37157 -30068 -42332 -39964 -44167 -54590
7739 -54590 -49847 -52242 -50696 -25329 -23738 -34699 -25016 -7732 -3324 -14088 -21858 -17719 -25188 -42676
7725 -42676 -56236 -44339 -19350 -8894 -8219 -1014 1299 -19368 -16525 -17100 -12398 -1510 -2027 -15522
7711 -15522 -30490 -44709 -49937 -47948 -38347 -26985 -34084 -18038 -14254 -18346 -20915 -11071 -1942 -14768
7697 -14768 -14807 -16057 -15655 -28571 -47425 -50672 -48371 -36542 -27175 -20709 -20308 -10420 -13107 -24808 -17452
7682 -17452 -14138 -5627 -5510 -19486 -35168 -25440 -21390 -35247 -37638 -33013 -53141 -50481 -34913 -25785
7668 -25785 -25075 -23094 -31927 -43242 -34239 -15197 -16215 -22188 -17095 -14915 -14531 -16419 -25709 -21636 -19225
7653 -19225 -21952 -15410 -16305 -36444 -32484 -15983 -21838 -39084 -31640 -14547 -4130 -10652 -16229 -18279
7639 -18279 -14800 -17495 -30739 -21210 -19859 -1096 6669 -5998 3811 1121 -5060 -28024 -37729 -16954
7625 -16954 -10965 -23317 -31541 -16611 -9750 -21817 -16674 -15788 -6529 -8787 -15623 -23336 -29071 -20485
7611 -20485 -18584 -27059 -31697 -23901 -6605 -12950 -26921 -35475 -32172 -30623 -27711 -23188 -29954 -43850
7597 -43850 -40804 -40400 -35948 -37534 -41666 -39607 -33639 -35761 -42490 -36066 -18692 -8654 -5753 -10334
7583 -10334 -19920 -20609 -17949 -19637 -25359 -24459 -34969 -32220 -28216 -36494 -36547 -44641 -38160 -31251 -21052
7568 -21052 -23591 -28682 -23161 -17087 -28378 -24669 -15606 -30033 -36984 -39197 -28140 -18206 -17846 -13526
7554 -13526 -18286 -16610 -24023 -27968 -33140 -44230 -36976 -32746 -31518 -35440 -24334 -13062 -15598 -26569
7540 -26569 -21161 -18659 -23122 -33452 -37212 -29162 -19336 -18705 -26821 -26786 -20402 -18449 -18573 -15321 -4737
7525 -4737 -26108 -50465 -48412 -42049 -27296 -17662 -23736 -24614 -19605 -1728 2911 -8565 -9273 -26036
7511 -26036 -34413 -30638 -30775 -24994 -34442 -49099 -38147 -33255 -32889 -15314 -6858 -9796 -24766 -34949
7497 -34949 -30883 -33348 -22746 -19802 -7409 -3610 -7774 -21262 -31609 -38264 -35564 -32882 -22767
7484 -22767 -13261 -11441 -8700 -17104 -23250 -11721 -2798 -6155 -24270 -33958 -17419 -22375 -28557 -32852
7470 -32852 -17429 -16862 -25736 -19150 -15955 -15485 -13915 -14119 -18779 -19751 -18214 -22754 -17958 -13624 -29195
7455 -29195 -30627 -26150 -15902 -11477 -11090 -16840 -39361 -39846 -26962 -12007 -12028 -20306 -27621 -34954 -26166
7440 -26166 -20005 -5728 -10884 -10091 -17146 -24893 -30994 -30097 -38968 -23812 -7563 -11496 -14927 -16841
7426 -16841 -24434 -26775 -19273 -9556 -9799 -24397 -19457 -9839 -7513 -11453 -27927 -33174 -34527 -31430
7412 -31430 -30846 -30401 -30903 -33720 -18633 -7675 -5919 -12712 -28614 -34391 -29527 -35875 -33755 -33944 -33594
7397 -33594 -29769 -22228 -16884 -29833 -28285 -22697 -31027 -30297 -21404 -17411 -33240 -24404 -29151 -30813
7383 -30813 -31080 -26315 -10679 2963 -17794 -16256 -18359 -26490 -24685 -29792 -23887 -23642 -15021 -19306
7369 -19306 -17569 -20279 -35926 -47750 -52653 -45264 -36829 -35663 -34940 -27473 -26506 -23481 -31689 -35279 -33666
7354 -33666 -31153 -25765 -12982 -6263 -18397 -17059 -23477 -20214 -19740 -29369 -42978 -47797 -41780 -30651
7340 -30651 -33309 -29947 -8675 -10332 -14471 -31856 -31796 -19634 -549 12808 3763 2104 2220 -8482
7326 -8482 -23656 -25288 -21535 -20149 -21835 -10267 -17052 -12878 -24186 -31186 -27590 -20664 -37736 -38869
7312 -38869 -28836 -13052 -12761 -10871 -7403 -6565 -23207 -30569 -30631 -31026 -26152 -16966 -14248 -14741 -19836
7297 -19836 -30038 -27075 -14328 -13310 -7058 -15499 -17639 -6448 -12320 -10039 -9351 -19079 -24995 -21337
7283 -21337 -20794 -17322 -14497 -11690 -25136 -23234 -12167 -8516 -6418 -14757 -16734 -12865 -12607 -9561 -12677
7268 -12677 -27512 -23269 -5693 -336 -13377 -21904 -32745 -25568 -23170 -17761 -8580 1920 12960
7255 12960 282 465 -18419 -38952 -32814 -19276 -13854 -13249 -9112 -11085 -17410 -12274 -5113 686
7241 686 8302 5898 8713 10830 -2081 -2040 6713 4548 1222 -4178 -2620 -3307 -7870 -9961 -19980
7226 -19980 -19417 -13213 -13703 -19379 -25123 -28468 -25980 -34700 -45815 -37669 -34007 -21645 -19152 -15940 -14698
7211 -14698 -24426 -30474 -45999 -45860 -43716 -28260 -28403 -29241 -27430 -20965 -26425 -33608 -36638 -36956 -27505
7196 -27505 -10936 -7618 -2231 2617 -17023 -33331 -37881 -33978 -33667 -18228 -6492 3744 5178
7183 5178 13246 10464 2728 -6618 4146 10409 1311 -3193 -6236 -10266 -19451 -30965 -37622 -36591
7169 -36591 -22698 -12018 -19576 -13922 -15217 -26104 -19834 -13329 -14131 -26746 -4419 2865 -13711
7156 -13711 -14580 -16510 -13994 1823 15375 19785 1260 -12571 -12448 -12897 -23627 -21194 -13076 -26454
7142 -26454 -34697 -39175 -46697 -36255 -15145 -3151 -5744 -12450 2481 12500 18359 8117 5790
7129 5790 -2698 -10604 -10528 -10247 -16218 -3951 5617 2073 5154 16236 13457 5539 -939 5232 -615
7114 -615 -14255 -27480 -32687 -29111 -32467 -34810 -33927 -20185 -12973 -13131 -14211 -11442 -3502 8096 5345
7099 5345 4909 7983 13603 6490 -10428 -14469 -10412 -5952 -9292 -15053 -24560 -14699 -4446 -9956 -5759
7084 -5759 1024 -2160 -7369 -11495 -9080 -9320 -8226 -1458 -3912 -11696 -13137 -11375 -9150 -22034 -31251
7069 -31251 -36877 -33215 -14685 -6526 -10619 -27567 -43209 -33111 -21810 -6916 -7571 -13212 -21431
7056 -21431 -39112 -42349 -32975 -38108 -40765 -41822 -37245 -36929 -29357 -20078 -7566 -3634 -4586 -15405
7042 -15405 -15890 -20128 -6026 5509 -12201 -29995 -32606 -28572 -25094 -28165 -30142 -40232 -27180
7029 -27180 -13554 -22627 -20097 3553 11660 -812 -19629 -17545 -18803 -26705 -30558 -29745 -19816 -24655
7015 -24655 -35734 -32709 -11537 -7175 -12950 -16944 -20318 -22130 -14072 -24798 -22976 -18677 -15653 -6310
7001 -6310 3597 -1397 6363 10413 3914 1024 -1959 -16253 -24638 -31291 -36440 -27886 -26171 -24682 -11736
6986 -11736 -2604 -3221 -4389 -13131 -19927 -20827 -938 5026 4793 10401 5242 -7640 -7363 -10518 -35581
6971 -35581 -40938 -35850 -37175 -35343 -28756 -10472 -8362 -13388 -18788 -2949 -8266 -27248 -17729 3923
6957 3923 7932 -9467 -19870 -13973 -16390 -17218 -33608 -36722 -27388 -15268 -14446 -15046 -19318 -26963 -15773
6942 -15773 -5547 81 506 -4855 -19736 -15568 -5111 -3203 -1055 -13873 -22992 -23785 -18909 -10310
6928 -10310 -23219 -25960 -23090 -19260 -8705 1335 -13957 -17471 -13106 -5688 709 -6083 -7339 -3172
6914 -3172 -3477 -6816 5692 20814 9105 -7466 -6376 -7430 -11654 -10925 -10831 -19621 -15306 1975 -4050
6899 -4050 -3938 5898 2782 -1827 -11882 -25581 -41134 -27784 -24444 -24032 -32496 -46331 -44949 -35852
6885 -35852 -17297 -21869 -32426 -22825 -14959 -15355 -14803 -8902 -615 2150 6025 -1546 -14304 -17306
6871 -17306 -3690 874 2183 -2123 9037 24573 21947 20351 5269 8691 7087 7082 1522 2928
6857 2928 4432 -15418 -14829 -7217 -7893 -6850 1241 -16490 -12880 4368 4211 -12995 -5843 1087 5236
6842 5236 5450 2661 -15462 -20737 -22564 -16408 -17973 -27747 -23440 -16297 -14906 -19599 -17692 -8815 -12435
6827 -12435 -7879 -22383 -31951 -17632 -12209 -19363 -15825 -24675 -29411 -20239 -9545 -8374 -4385 -8180
6813 -8180 -12723 -12338 -14943 -14786 -25568 -30130 -21519 -19824 -19150 -5420 7603 2179 -2155 -8125 -12853
6798 -12853 -16952 -14398 -2565 -3821 -12932 -13309 -15339 -9368 -797 2595 -2950 797 7377 8800 21126
6783 21126 24960 9832 6143 18758 14921 1673 -2123 1731 197 7377 8443 6068 -5881 -148
6769 -148 7980 -9509 -26767 -13829 -13883 -4421 -626 -4182 -12633 -29646 -27705 -10291 -3398 -11971
6755 -11971 -18207 -21818 -17825 -27134 -28187 -21478 -8963 -2388 -14144 -7794 7814 -563 -5989 -6366
6741 -6366 -6705 5859 22352 25524 14125 19184 7119 -4701 -11822 -12309 -21882 -19089 -22583 -23088
6727 -23088 -13897 -11472 -20803 -14421 -16270 -22410 -30168 -24269 -10976 -1824 -2616 -4675 -14176 -19663 -13397
6712 -13397 -593 -7366 -16999 -21042 -24626 -13151 -7853 -6430 -3799 -17593 -16672 -712 -7447 -10205
6698 -10205 -1605 6531 20197 13290 1882 2833 5488 -3095 -9435 -4525 3438 70 -5029 6972
6684 6972 6257 934 -6603 -21960 -25558 -21242 -28434 -15199 -857 -15139 -17677 2556 4711 -2625
6670 -2625 -5682 -162 -6911 -12146 -9014 -11684 -8314 -5457 -15819 -1368 9553 5397 -13320 -7002
6656 -7002 11796 14696 1050 -6353 -4512 -7137 -14871 -17815 -16708 -15445 -17393 -25676 -23934 -13201
6642 -13201 -18114 -24358 -18669 -4729 -961 238 1797 -1794 -8296 -6218 -9908 -14811 -7244 -17858
6628 -17858 -19824 -15308 -4785 -7662 1421 -13967 -23408 -23423 -15987 -4161 -2486 -235 -7535 -7556 -3812
6613 -3812 -3146 -11414 -16673 -3489 1580 -3 -10470 -22254 -21868 -8376 -6668 -14062 -22307 -34945
6599 -34945 -31019 -23933 -709 5775 17997 17230 7378 -2021 -9860 -20665 -24022 -12149 1350 -6672
6585 -6672 -9514 -263 -12711 -15921 -10149 -7346 -10765 -7737 6969 -2166 -29 3927 -492 -2396
6571 -2396 -16271 -16561 -14305 -12641 -16022 -18518 -15043 -14528 -2453 -3638 -22829 -40235 -35611 -37380
6557 -37380 -22126 157 5088 9688 7792 11732 250 -14901 -18774 -15489 -15266 -21999 -19737 -12263
6543 -12263 -2598 12848 -709 -13895 -7309 -691 4998 -12902 -39487 -43289 -39407 -26044 -20720
6530 -20720 -22377 -19194 -7961 4106 8858 7347 9157 9997 3656 18392 28693 18712 19300 17999
6516 17999 -2555 -18230 -16461 -13614 -14299 -14591 -18074 -13567 -7681 -11135 -14304 -22074 -18091 -13666 -7333
6501 -7333 -5792 -8420 -18579 -22368 -9351 -1429 -8111 -7768 -8239 -5035 -10049 -17833 -20067 -11421 -8149
6486 -8149 -4812 2839 -12511 -23660 -23110 -5640 -5320 -13359 -11455 -1965 2442 2186 -2681 -3990 -7703
6471 -7703 -14755 -17475 -10646 -23732 -24512 -14810 -21517 -20745 -22171 -6103 7120 17070 14429 -5244
6457 -5244 -8940 -19330 -13832 -5027 6530 11593 2870 3686 562 -511 -9563 -9133 -23405 -26796 -19110
6442 -19110 -6865 -20906 -11622 -8011 -12931 -514 17397 4396 -13226 -22455 -22379 -24579 -19221 -4336
6428 -4336 -2827 8406 10064 6719 1256 9158 9066 -9685 -7688 -277 2978 -303 -5094 879 -2110
6413 -2110 -4303 -8493 1193 -18164 -16192 -2261 2498 2119 9822 13339 -8438 -22137 -10639 -10958
6399 -10958 -10268 -17372 -12918 -11896 -20278 -17296 -21687 -12412 -9246 -7876 -20540 -13643 7550 2868
6385 2868 -6822 -67 11689 3861 -20576 -29501 -22565 -12466 -14454 -10903 1066 6365 17250 20458
6371 20458 12523 11563 15834 7968 2439 10575 5490 9224 12158 12491 7479 -713 -10806 -4567 356
6356 356 1474 -2494 -6570 -14383 -24024 -30637 -20868 -12398 -27592 -33133 -24585 -15162 -17734 -13310 -3580
6341 -3580 6895 16976 13403 11025 8232 13916 17764 1035 -475 7589 3187 -3897 -14666 -9825
6327 -9825 -3237 -3749 1173 -3125 -8611 -10069 19867 34224 24450 13285 15623 17001 18267 409
6313 409 -11505 -22111 -24758 -30490 -28651 -30473 -21047 -34776 -30226 -27396 -11129 6703 4645 -2989
6299 -2989 -11861 -11937 -17031 -21622 -414 9127 5754 7965 11121 8032 5512 2967 6376 2289 -4417
6284 -4417 4298 1267 -10842 -1038 10323 18360 20915 14136 -852 3952 6082 1065 11247 13476
6270 13476 8407 11887 12343 11462 5177 -828 15771 17461 321 -1550 1456 -2735 -5191 -1914 1607
6255 1607 -3293 -22462 -21886 -16970 -19978 -33691 -36185 -20835 -12212 4045 14388 9771 7769 21739
6241 21739 26198 21322 22244 6806 -17871 -30116 -29348 -26666 -18781 -19251 -24761 -10782 -7975 -4043
6227 -4043 -787 -24713 -38857 -27486 -11198 4610 5456 -8485 -16257 -11722 -18997 -23865 -16974 -5237
6213 -5237 -311 -1265 4630 -3778 -9320 -9651 -20774 -8930 -2696 -2516 -10889 -16098 -14497 -4587 -462
6198 -462 -9084 -8896 2477 12306 9039 13242 19841 17149 9034 10037 16464 5913 -5499 4605
6184 4605 -2876 -13730 -14419 -11407 -2484 -1748 13883 871 -8253 -16422 -20920 -14378 -1343 16633
6170 16633 22134 11892 6797 2286 10693 19570 27446 22051 2366 3470 22985 30922 23732 12539
6156 12539 12548 10128 6252 14774 22098 19813 12681 14800 9539 -7204 1200 -7689 -17043 -15263 -5252
6141 -5252 -3747 -10543 -16501 -13610 -10677 2743 7113 -6817 -8557 7028 17241 1661 -10878
6128 -10878 -13793 -9371 3592 -1858 -7604 488 3159 -3139 4192 16079 20503 10476 -774 -6188
6114 -6188 -3741 -4339 794 4577 1721 -5871 -10485 -2904 22694 16546 13257 20483 19686 18530 12982
6099 12982 4057 1950 -9425 -11119 -2308 -2832 2561 -699 -4198 1019 4665 2027 3986 9316 16104
6084 16104 12218 17920 7781 11034 20133 18075 7632 10867 31994 46251 38010 23344 21822
6071 21822 24055 15914 10151 4447 -2904 1966 16526 21836 14323 6389 -621 -6938 -14369 -16173
6057 -16173 -1653 14450 18955 16683 15467 -1989 -12962 2294 11221 3482 -3526 -3805 -9115 -6098
6043 -6098 -3037 2060 48 12031 8279 7370 12378 10247 4018 15118 11362 1549 -1091 -1102 -3719
6028 -3719 9018 14430 -4159 1437 6905 1686 -6524 -16640 -19436 -9283 -10632 -9678 9670 9902
6014 9902 -13070 -6418 4304 10271 15064 8718 15628 7870 -9522 -2595 8442 3036 -6377 -5314
6000 -5314 5344 -7149 -6501 714 11915 19911 4424 -1081 -755 656 8858 9393 13495 16888 9977
5985 9977 10700 13102 4972 2215 6361 3986 11553 20449 22571 13455 13284 10441 -3976 -2995 -1598
5970 -1598 886 1695 -445 -6249 -10397 -17358 -11266 -8349 -8810 -11556 -13008 -19782 -12443 -4020 -5739
5955 -5739 602 -5007 3566 14900 25600 31771 34402 37666 21270 2320 -17205 -5543 12899
5942 12899 8219 6208 5347 10650 22464 21180 12460 13828 17745 17080 17696 -2614 -9703 -633 10817
5927 10817 11377 9585 11287 3370 1194 3185 2612 2739 2782 10690 20904 11179 6891 11154 7608 1639
5911 1639 6152 15563 10924 11219 17726 24802 17238 20272 14295 29537 29804 18351 16657 11408 2179
5896 2179 -1167 -5965 -7087 -3726 -17146 -22097 -10530 3577 9347 20779 972 -19126 -16692
5883 -16692 -1324 -5115 -3808 -82 -8256 -10021 -6220 7075 10632 9400 14568 16289 6678 15741
5869 15741 30055 33221 14627 14619 13179 2932 116 -2210 20 17460 21690 19739 15661 3070
5855 3070 -9232 -17262 -28487 -20499 -4386 5362 11526 -5423 -15084 -13846 -1245 -3547 235 -7820
5841 -7820 -22283 -13259 4646 14627 8919 5098 10551 6506 15679 7280 -2450 3088 11799 31316
5827 31316 23000 9911 4310 369 -14930 -25261 -26038 -11438 7579 8950 4834 10068 18319 18097
5813 18097 8190 3568 10279 9587 15804 18904 18578 24862 16226 5540 -4304 23 8022 19069 18137
5798 18137 14386 3673 -327 7177 -1940 -18206 -11376 590 -3445 -3225 2872 10208 6783 13180
5784 13180 26763 23893 1954 2615 27560 23274 13177 9372 6549 5172 9022 2565 -5936 -12467
5770 -12467 -9047 -9185 -8296 -12302 -14157 -14031 -14801 -5113 -2164 4821 17604 9317 2529 7090 2369
5755 2369 -12526 -5777 2528 5642 -10120 -19119 -14729 -16436 -4464 8045 9057 217 -3247 9713
5741 9713 9832 7288 12932 12983 -2903 -13438 -14667 -5872 -821 3337 8562 1378 -1887 -868 7253
5726 7253 2475 -4020 -3243 -3637 -15323 -15506 -20047 -16947 -12940 -8048 -5983 6188 21312 10867 10186
5711 10186 13843 6993 11018 22555 13279 -5199 -21548 -24645 -7361 -4722 -11607 -6798 -8490 1559
5697 1559 6321 3952 7915 -2586 -8600 -2056 2839 -5765 3755 17269 20626 23932 18892 5257
5683 5257 5141 10647 5782 -3080 -1815 -3804 8110 12097 9877 14034 12497 -2064 -8860 -10031 -14243
5668 -14243 -13367 9088 30003 31007 26751 20423 17678 5859 8174 13660 3697 2015 6110 476
5654 476 11715 16692 12588 17298 6129 3875 10305 11622 -676 -5938 -10391 -17715 -14824 -5191
5640 -5191 16384 10229 -2461 -10444 -14700 -18082 -5945 13672 16406 8419 240 3652 9050 12972
5626 12972 9856 5523 -1970 -11148 -13507 -1909 9689 11545 -146 1031 6047 903 -8496 1200
5612 1200 -967 -8540 -7710 -749 -2244 -11246 -14415 -8701 -3720 -7447 4818 15252 9024 -3520
5598 -3520 -25387 -33778 -20296 -7932 -6313 4038 216 837 6020 7463 6716 -5624 1086 7215
5584 7215 18246 12180 -1276 -13765 -15108 -5397 12870 16669 -898 -8699 519 680 -1062 -9117
5570 -9117 -12484 -4355 5041 13500 4040 7233 -2277 -9111 -9506 -12110 -20529 -19507 -12327 -18044 -9175
5555 -9175 106 -3388 -9089 -5875 -7247 -11807 -13327 -8241 4542 9838 2284 9571 13905 18522 10193
5540 10193 8792 11324 10083 15434 2993 2378 11639 13646 13546 13998 -3866 -6072 6773 5853 -1232
5525 -1232 -5593 -14582 -14114 -9471 -6050 -6985 -5638 -2331 2331 -12061 -14403 4616 20400 15902 10902
5510 10902 -9182 -19062 -17749 -16592 -10335 -3372 -7580 11246 17331 7748 3391 12986 21032 15326
5496 15326 7912 268 3923 5990 -3213 -8808 -2772 848 4035 12303 27746 40454 23151 12167
5482 12167 5172 4019 13369 11433 2582 -1836 -3114 -1775 -1891 -2308 9039 3993 -13281 -2749
5468 -2749 -5736 -10666 1234 9103 5383 -7042 -3630 10780 24358 34065 18973 22010 30534 24227
5454 24227 11021 -300 -5732 7411 25962 35139 23435 15411 4629 -2940 2851 4101 -2486
5441 -2486 -10075 -21254 -16586 -5435 -2439 7529 22468 24139 9779 14067 20059 25512 18815 10896
5427 10896 3824 4329 5174 8451 5068 5030 7791 -1027 6569 15334 8361 -7488 -8928 -11609 -2605
5412 -2605 10016 6698 -6033 -3085 -725 4240 6305 8029 6430 8209 3228 -2665 572 2194
5398 2194 17515 7555 6014 15734 18078 16848 4490 -6871 -5306 -347 1758 -8931 -6320 -1790
5384 -1790 -9469 -16013 -12468 5049 22286 21528 21996 27487 25604 11841 6379 4364 11101 10469 2535
5369 2535 -5367 -10090 -20864 -11131 -5265 2615 7015 6515 2274 -3692 13690 18004 10934 8113 6902
5354 6902 15677 19681 30306 22039 25184 19836 14260 8771 7435 7146 21239 20151 20378 19650 14794
5339 14794 10911 12424 19095 12500 17869 15852 18759 18960 25042 31029 12535 -627 -8977 -11514
5325 -11514 -5691 -438 -338 -183 9361 16436 13101 5367 5756 8018 -132 17052 18883 16213 13879
5310 13879 11284 29207 34361 18512 9635 1031 13617 12944 10145 7160 4986 16908 30902 23882
5296 23882 11252 10250 9325 7675 9768 16349 15535 7499 8662 8712 12947 19692 31119 40147 37825
5281 37825 26002 14861 3438 -5346 -8529 -5990 -4152 1077 10646 21734 30484 32412 36857 33139
5267 33139 18737 16297 10323 3167 -3279 2689 12423 3036 9738 9128 -2337 -19996 -11736 -1453
5253 -1453 10894 19774 6469 -11347 -14998 -8776 -2328 2657 -8491 -2358 759 5721 521 10565
5239 10565 39491 25622 28958 31837 16407 12499 16277 10866 5105 7454 24340 32024 39137 24082
5225 24082 15581 23697 19676 23772 30155 35985 36187 39910 36239 21323 32668 29555 22820 20442
5211 20442 6480 2100 7730 8797 6560 2058 5892 11540 22434 31150 15587 16240 11665 7594
5197 7594 2330 3277 2224 -9980 -17249 -5676 -1133 -7427 1274 4994 6603 22014 33007 25775
5183 25775 20405 16065 25971 29167 30218 18094 16573 11229 1290 11109 25634 16725 17290 14510
5169 14510 8416 10858 27965 27090 9479 5886 10551 8409 5434 -2310 -10515 -4519 231 -14924
5155 -14924 -16479 1336 11615 15360 13796 9654 15931 10386 9581 2177 14249 16096 18539 16270
5141 16270 24322 41258 40883 22945 20858 31368 32397 22154 10456 -4964 -7265 -13389 -2268
5128 -2268 4468 9008 9791 3363 -5349 -896 7138 3871 5189 6636 20781 28951 22302 18685 13569
5113 13569 7276 1752 8673 13934 6008 15860 11812 8275 -13555 -33529 -6770 17440 33150
5100 33150 21268 8954 -4581 -9124 -4134 -2861 -9912 -17403 -15636 -6220 -3991 -5942 -4568 -3983
5086 -3983 4115 16628 4396 8164 14417 10995 17330 14445 12722 17589 16395 6798 -1744 -1155 16752
5071 16752 30062 29821 20091 14330 11230 20297 22453 12874 7597 7682 5937 19137 20679 20896 15528
5056 15528 12228 12250 30801 31939 31749 28645 23675 18919 17603 22153 14673 -1995 -891 21 -3687
5041 -3687 -1714 6441 -2074 -9540 -379 3245 12191 10620 19338 21967 4466 745 -3736 -8500 -6962
5026 -6962 -12183 -23213 -19191 -11513 717 8176 9348 6988 -2626 -1104 10832 -3151 -5394 -22776
5012 -22776 -29362 -18623 -10693 -438 9522 11232 -555 -4461 3083 -7931 -17189 -16326 -19759 -15880
4998 -15880 -2471 -9598 -10015 13583 25064 19848 15124 -2811 -12702 -4624 15964 23059 10833
4985 10833 397 6407 9040 5855 9239 12654 20702 17260 26308 31726 38642 26526 17646 14290
4971 14290 18591 23845 29211 34660 29254 35665 36963 37257 30907 30436 29975 20683 5027 -5503 -2672
4956 -2672 -3253 4007 8972 19303 18878 12511 9906 17423 25905 32208 25100 9435 9582 23511 32624
4941 32624 32631 32147 24916 12541 -4094 -13979 -14175 -4303 9487 8116 8808 16795 19009 22129 8437
4926 8437 -15442 -21351 -22042 -17274 998 5826 -9332 -22405 -17087 -11803 -2539 2490 -1660 -1361
4912 -1361 6993 7482 -529 -3352 -5598 -4633 20790 34271 12537 12714 19670 10566 -2621 1276 5227
4897 5227 -1057 -6612 -4064 6699 12751 23230 19939 4882 2373 1847 -9397 -2828 8612 11853
4883 11853 5242 2177 10820 4864 -1575 -923 4391 13003 15466 16544 17686 1943 -9485 -15141
4869 -15141 -17289 -12114 4449 -3121 -9270 -3813 7296 4960 1570 7933 1462 -2441 1051 11153
4855 11153 18608 15950 6938 -7560 10612 18042 19213 18500 -2928 -3578 9818 24621 14090 6051
4841 6051 12434 10659 12526 3930 -6637 -2471 -8297 -7280 3557 21797 19583 5260 -2775 -7327
4827 -7327 1096 10843 15270 17169 28534 25481 5957 1727 15476 19429 10653 -7010 -9305 -5972
4813 -5972 -2102 -5081 -587 6162 5313 9128 5516 -643 8712 10850 20413 24514 16885 10965 14193
4798 14193 8822 14705 17377 12894 27956 41111 25374 8095 253 8640 10802 -8440 -7251
4785 -7251 -343 10748 19967 20307 22063 13306 8951 8105 8831 15346 10155 10584 20349 18574 16881 1685
4769 1685 3400 6649 15240 9155 1008 18133 19339 7695 10177 6204 17938 29820 36912 13794
4755 13794 -7606 -8557 -171 8943 28047 24718 25802 28157 12273 10125 20900 27939 35138 38591
4741 38591 31285 27421 16619 7263 4100 -3386 4746 5056 3692 -4627 -6438 1261 3606 6671 20804
4726 20804 257 -3338 5702 10863 10703 12177 17264 8958 1205 4257 16043 18076 -1784 -8541
4712 -8541 -6871 2542 4430 8942 21847 17178 9913 5633 11481 19071 15380 19804 560 -12876
4698 -12876 -430 3344 -699 6812 4613 543 5971 4540 1269 10998 10925 -719 10538 22386
4684 22386 30124 21022 27063 29109 8140 483 -2197 -4914 381 11205 24999 24595 15497 12596
4670 12596 15361 11609 13046 14116 3129 6685 5515 12840 7954 3157 7388 17688 15186 8899
4656 8899 -4042 3254 5764 11518 18551 28533 25274 16930 9211 19954 18367 20124 32370 26363
4642 26363 18937 20483 18164 28348 38552 53912 52139 40553 39682 44682 44779 38798 28469 14977
4628 14977 7317 924 -11275 -11445 -7526 2783 24504 31709 37295 39742 31643 34341 23413 9572
4614 9572 4042 10358 11988 7665 -2536 -3543 1520 7435 10429 5632 7402 -675 -16401 -11331
4600 -11331 -2369 11697 12613 12559 8366 11114 8721 3461 -4547 1903 257 4426 14787 12153 11221
4585 11221 19636 29807 25672 20037 25638 23395 27644 36860 38635 37154 21505 8097 285 -804
4571 -804 1995 -815 -1049 -890 -3394 -4295 5596 10806 10464 14963 17442 9310 2859 2689 16783 12409
4555 12409 10235 9236 10156 12063 6276 2726 17670 24449 18064 24600 13226 12307 21412 4339 -9386
4540 -9386 -4490 11751 15070 2852 20054 34433 30655 20667 20955 28006 17920 10159 3979 8186
4526 8186 30054 38116 32644 35052 27373 11129 -2033 7680 10345 20407 29446 14460 -4061
4513 -4061 -4672 -1085 5393 6327 9038 15444 8454 6527 13535 13487 19424 7718 4881 11816 10498 6175
4497 6175 2362 1679 5894 1475 12529 20850 25054 26337 29419 33139 15559 12296 10943 19806 37032
4482 37032 43021 32349 26675 21798 23352 26532 8861 13896 21893 8456 10039 15664 16373 9025
4468 9025 10371 26240 25656 14266 12904 -5099 -11322 -3860 4184 12036 3943 776 3593 -1296
4454 -1296 -14920 -3340 16346 19345 780 -4146 -2674 5330 13567 18316 28785 31300 24145 13662
4440 13662 5846 20611 25815 22893 16706 13356 23342 18341 5717 352 11191 10960 9420 14749
4426 14749 16127 10803 3538 -8540 -3463 -1768 556 495 13942 9466 14264 11328 11127 -784 11949
4411 11949 27457 32221 35806 36511 35968 27727 12675 -2768 1834 2645 1050 11325 14795 16906
4397 16906 12477 18393 25105 23377 12228 5467 -1662 8016 15965 16867 20594 23625 24061 14504 11353
4382 11353 19568 8225 -13883 -13668 -6338 -3332 6649 23531 26717 20834 14587 19660 33894 41459
4368 41459 33500 30765 22093 7380 8460 17045 17415 21958 28565 15463 19103 23314 23908 21205 18462
4353 18462 31497 28208 22264 18607 2804 -323 8388 16792 12559 20193 21565 21825 20863 25445 13336
4338 13336 5127 8068 2738 6424 17768 10100 10165 7312 6802 10378 4880 -9881 -8842 2471 -628
4323 -628 6982 9067 8275 4326 4586 3240 118 17258 6960 10892 18667 1996 -2386 4427 6375
4308 6375 18732 24389 11363 10637 10417 7923 10307 10475 13436 16885 11970 5501 2593 -4373 -4406 3888
4292 3888 -216 2263 -3941 -8835 -8543 -21330 -17199 186 12181 16797 17556 14835 9467 10163 16440
4277 16440 36545 43110 43399 37068 30360 14685 15674 6932 -8609 -6828 3610 17333 19234 19751
4263 19751 23323 29631 36655 27969 23415 18780 18167 19172 23741 22141 13380 10107 11986 16445 18335
4248 18335 7741 5590 9183 23574 22022 30185 35297 26674 18808 10898 15963 18782 18145 11079
4234 11079 15302 12445 7382 8058 20918 33298 24458 15834 16679 22506 17859 7341 11013 22146
4220 22146 16297 15343 21470 21509 22202 12076 20857 28472 24690 20523 24460 27691 26080 29194 36262
4205 36262 26509 13595 14942 13166 17224 21815 26281 19421 10320 14184 15543 8980 6262 7773
4191 7773 2631 3627 7933 19212 25909 22877 15983 15875 23945 22329 12975 1261 4596 5055 18747
4176 18747 21121 16843 10785 12631 5474 1175 7830 10544 10015 3647 9155 21375 14834 13270 8931
4161 8931 15813 19033 20847 31103 26877 11664 6278 11892 10410 3650 15975 22947 29153 20376
4147 20376 26368 33685 27120 20169 22580 24387 15718 22901 24095 21629 19692 30859 43718 29181
4133 29181 14499 8748 -2703 -1143 19518 32899 30517 42595 45368 31564 12825 11231 6930
4120 6930 2661 -5603 1457 13187 27979 21068 13965 3923 1553 4851 -1758 -3018 3452 -3519
4106 -3519 -21091 -17063 3120 27299 3254 -12229 -14181 -6683 -1857 -560 8991 20170 24732
4093 24732 20717 15152 9384 14560 9073 4636 8293 3762 5436 15194 28498 36164 28059 14055
4079 14055 14723 14690 35789 38846 35741 39014 36314 33653 18072 17412 24224 17658 18707 20963 13833
4064 13833 15210 21441 25091 16812 16199 2917 3416 -7441 -19301 -13204 2132 407 7147 13255
4050 13255 10853 2134 -1107 -3408 -22970 -27425 -9830 8355 8227 4745 9511 2285 -3764 2130
4036 2130 -3528 6115 27275 25471 9017 5139 2547 3541 5666 18381 15545 11670 12655 8436 -1232
4021 -1232 -11077 -10047 -7289 5872 3143 8934 8054 12486 13883 12731 26744 22391 6475 -4101
4007 -4101 4196 741 -16164 -24261 -10972 -4918 -1592 7481 17989 24477 21886 14999 18871 13781
3993 13781 9592 1979 3445 14817 15924 9051 6946 5749 15574 10894 16211 28498 18460 13703
3979 13703 26569 42985 47262 36896 22922 23942 31451 32514 22174 15127 11952 9251 12439
3966 12439 19819 16665 14325 19410 11264 10718 10056 27573 27579 28657 32759 32222 37091 18488 13282 22939
3950 22939 25050 10542 1065 13189 18396 3387 428 1598 6202 7050 3493 4296 11323 21838
3936 21838 26555 30621 23834 22074 21899 25727 18688 -825 -10506 -3117 6537 6089 14165 35896 28731
3921 28731 30140 28784 24353 10687 8272 20755 15106 12710 10328 12299 22645 23203 23850 26512
3907 26512 22374 18701 14536 28970 36760 19987 10834 31389 32516 21135 15818 21697 21158 24254
3893 24254 30137 26904 36314 25127 14512 3335 -777 9481 15160 20577 14272 3328 5068
3880 5068 14725 10301 14456 333 997 8957 12026 17594 15817 10517 9680 2528 3694 15809 12942
3865 12942 12906 6939 5229 11548 7404 13845 12872 15507 5035 -12753 -2727 13810 22686 8093
3851 8093 13715 27143 42920 40915 28632 24068 29736 16781 8207 3268 5463 4780 8239 5685
3837 5685 4408 -1803 7389 3595 5056 20053 15485 13406 22548 24096 15329 11560 7763 428 6291
3822 6291 7629 6129 13214 14014 18927 16674 6992 5723 -978 -9910 -6334 5905 22798 29362 31583
3807 31583 20519 3999 1041 -2387 3448 22651 23412 10450 7389 2860 -2861 10183 8839 7150
3793 7150 9840 8706 16219 15914 4742 499 6465 24338 35770 37830 22008 11236 16177 18735
3779 18735 18117 24995 22458 12859 4830 -1773 4486 8403 11569 25214 35440 27286 38970 32108
3765 32108 4390 945 921 12941 30841 25826 25445 23871 29240 30288 32795 25662 30952 33004 26225
3750 26225 17025 16919 15001 10693 10295 10547 5104 29398 44071 32478 19623 7736 6370 -2665
3736 -2665 3330 9412 10143 839 2144 15825 8590 8389 14323 13994 2428 -954 7219 14757 19706
3721 19706 24446 20865 26440 26143 16033 23008 16681 20980 21422 16279 3762 7731 9013 22947
3707 22947 24968 8095 13099 16588 7432 -2873 3 8355 17420 20928 23129 21001 24479 19513
3693 19513 12084 5581 -6032 -5134 15999 33951 35707 25775 17602 22815 13419 8044 3853 9989
3679 9989 20891 24900 39468 55779 51706 37280 18836 2571 10036 20338 18577 17615 24454
3666 24454 16351 13614 20117 36766 35639 29381 27170 18611 29060 22392 6476 1450 -3343 -2866
3652 -2866 -360 -1133 -9330 1120 7782 17802 29395 28859 15922 16861 15899 11512 19306 6187 -3391
3637 -3391 -9396 -11156 6373 23399 19971 3161 -5590 -6934 -4419 -12581 -6973 8314 34380 26987
3623 26987 22553 8586 10391 5331 10059 16080 10422 -5438 -9060 -6782 -9124 -15690 -16780 2113
3609 2113 22367 35011 35252 19398 4369 6621 -6338 -5838 9693 18892 36259 42050 40704 44968
3595 44968 27295 18761 17124 14837 9286 11317 18017 25267 30502 22001 18336 26639 23893 17865
3581 17865 18484 28698 40980 48070 35054 21985 22934 16810 2479 -4177 8106 8335 20225 23236
3567 23236 18102 20103 28421 31917 21684 18392 18417 16681 1803 10753 19910 20920 23837 29265 20221
3552 20221 9263 9187 21739 35041 25611 15511 20959 21374 21080 22988 23117 24735 13726 -1790
3538 -1790 -9235 -94 -7182 6860 24350 36373 33521 25906 25584 26060 7146 12467 19864 5077
3524 5077 3397 4307 5490 -1268 -1007 4467 4452 7070 6555 9098 10227 14149 16955 21076 23448 27135
3508 27135 22234 16637 337 -12519 -22838 -11402 4918 11015 3278 -934 2898 14160 8664
3495 8664 448 -5073 -14557 -160 4846 11723 15935 18569 18123 12519 3890 341 -1151 -1170 6375
3480 6375 11572 12488 2357 5746 16360 14900 3520 -4269 11474 22846 11536 13595 16261 21671
3466 21671 22756 27947 28233 19013 21879 23312 21467 29012 42214 43844 39325 29412 27941 5219
3452 5219 13506 5184 13145 20681 19691 22425 19171 2374 2199 -682 3779 6775 6593 10852 17665
3437 17665 21616 19143 28865 31777 32951 30128 25425 25682 16832 12325 20608 16361 24079 31439 23109
3422 23109 22931 18700 14942 20054 24627 21735 12723 -2939 8020 14701 5611 3762 6590 7328 3670
3407 3670 5260 21222 37403 28252 18872 29771 19134 21002 15686 8263 13446 21549 21550 15227 8637
3392 8637 -698 1493 6136 15141 32412 46003 49767 44420 27201 3338 -10182 -9237 -5753 -2199
3378 -2199 -5422 -3883 -3344 6718 7746 -944 1135 -4018 -9491 -13942 -11469 1944 15455 24669
3364 24669 7418 1586 -14359 -16144 -11021 -12528 -6204 5839 18682 12955 -8952 -13618 -13374 -5683
3350 -5683 3541 13886 22002 30305 25665 28757 12071 -8683 -11271 -2861 13893 24399 20946 -7900
$$ [...]
##END NTUPLES=NMR SPECTRUM
##END=
