##TITLE=Analysis number 328827
Compound Code cc 05801
Book Reference lab3
Project Code adrs
Chemist Name stores
##JCAMPDX= 6.0         $$ Bruker NMR JCAMP-DX V2.0
##DATA TYPE= NMR SPECTRUM
##DATA CLASS= NTUPLES
##ORIGIN= Bruker BioSpin GmbH
##OWNER= nmr
$$ XWIN-NMR		Version 3.5
$$ Fri Jul  6 11:37:46 2007 GMT Daylight Time (UT+1h)  MAYBRIDGE\nmr@NMR_250MHZ
##.OBSERVE FREQUENCY= 250.131544655141
##.OBSERVE NUCLEUS= ^1H
##.ACQUISITION MODE= SIMULTANEOUS (DQD)
##.ACQUISITION SCHEME= undefined
##.AVERAGES= 16
##.DIGITISER RES= 18
##SPECTROMETER/DATA SYSTEM= dpx250
##.PULSE SEQUENCE= zg30
##.SOLVENT NAME= DMSO
##.SHIFT REFERENCE= (INTERNAL, DMSO, 0, 16.522)
##AUDIT TRAIL= $$ (NUMBER, WHEN, WHO, WHERE, WHAT)
$$ ##TITLE= Audit trail, XWIN-NMR		Version 3.5
$$ ##JCAMPDX= 5.01
$$ ##ORIGIN= Bruker BioSpin GmbH
$$ ##OWNER= nmr
$$ C:\u/data/dgb/nmr/ADRS/550/pdata/1/auditp.txt
$$ ##AUDIT TRAIL=  $$ (NUMBER, WHEN, WHO, WHERE, WHAT)
(   1,<2007-07-06 11:37:22.74 +100>,<MAYBRIDGE\nmr>,<NMR_250MHZ>,
      <created by zg, POWCHK disabled, PULCHK disabled
       configuration hash MD5:
       76 6E 9A 78 1E 09 19 81 EC 84 63 8F B0 6A 59 2D
       data hash MD5: 64K
       78 4A 1A 75 37 BC 73 20 55 FF C3 C1 A2 8A 8D CB>)
(   2,<2007-07-06 11:37:35.63 +100>,<MAYBRIDGE\nmr>,<NMR_250MHZ>,
      <Start of raw data processing
       ef LB = 0.3 FT_mod = 6 PKNL = 1 SI = 32K 
       data hash MD5: 32K
       60 8E D1 16 B7 6C 14 E9 9B 36 D2 4A EB 61 DA A4>)
(   3,<2007-07-06 11:37:37.44 +100>,<MAYBRIDGE\nmr>,<NMR_250MHZ>,
      <apk 
       data hash MD5: 32K
       8D 7E 20 75 AD 85 70 71 2F 70 2D 54 B7 4C CE 82>)
(   4,<2007-07-06 11:37:38.21 +100>,<MAYBRIDGE\nmr>,<NMR_250MHZ>,
      <abs ABSG = 5 
       data hash MD5: 32K
       58 02 01 74 34 98 B8 AC C5 AE D0 AE 07 EF 88 85>)
$$ ##END=
$$ 
$$ hash MD5
$$ 3F 5F 27 AD 43 F3 24 E8 CF 06 3F F0 40 88 45 69
##$RELAX= 
##$RELAX= 
##$RELAX= 
##$RELAX= 
##$RELAX= 
##$RELAX= 
##$RELAX= 
$$ Bruker specific parameters
$$ --------------------------
##$DU= <C:\u>
##$EXPNO= 550
##$NAME= <ADRS>
##$PROCNO= 1
##$TYPE= <nmr>
##$USER= <dgb>
##$AMP= (0..31)
100 100 100 100 100 100 100 100 100 100 100 100 100 100 100 100 100 100 
100 100 100 100 100 100 100 100 100 100 100 100 100 100 
##$AQSEQ= 0
##$AQ_mod= 3
##$AUNM= <au_zg>
##$AUTOPOS= <14 >
##$BF1= 250.13
##$BF2= 250.13
##$BF3= 250.13
##$BF4= 250.13
##$BF5= 500.13
##$BF6= 500.13
##$BF7= 500.13
##$BF8= 500.13
##$BYTORDA= 1
##$CFDGTYP= 0
##$CFRGTYP= 5
##$CHEMSTR= <none>
##$CNST= (0..31)
1 1 145 1 1 1 1 1 1 1 1 1 1 1 1 1 1 1 1 1 1 1 1 1 1 1 1 1 1 1 1 1 
##$CPDPRG= <>
##$CPDPRG1= <>
##$CPDPRG2= <>
##$CPDPRG3= <>
##$CPDPRG4= <mlev>
##$CPDPRG5= <mlev>
##$CPDPRG6= <mlev>
##$CPDPRG7= <mlev>
##$CPDPRG8= <mlev>
##$CPDPRGB= <>
##$CPDPRGT= <>
##$D= (0..31)
0 1 0 0 0 0 0 0 0 0.06 0 0 0 0 0 0 0.0002 0 0 0 0 0 0 0 0 0 0 0 0 0 0 
0 
##$DATE= 1183718242
##$DBL= (0..7)
120 120 120 120 120 120 120 120 
##$DBP= (0..7)
150 150 150 150 150 150 150 150 
##$DBP07= 0
##$DBPNAM0= <>
##$DBPNAM1= <>
$$ [...]
##$SUBNAM7= <"">
##$SUBNAM8= <"">
##$SUBNAM9= <"">
##$SW= 20.6930455092707
##$SWIBOX= (0..15)
0 0 3 0 0 0 0 0 0 0 0 0 0 0 0 0 
##$SW_h= 5175.983436853
##$TD= 65536
##$TD0= 1
##$TE= 296.16
##$TE2= 300
##$TE3= 300
##$TEG= 300
##$TL= (0..7)
0 120 120 120 120 120 120 120 
##$TP= (0..7)
150 150 150 150 150 150 150 150 
##$TP07= 0
##$TPNAME0= <>
##$TPNAME1= <>
##$TPNAME2= <>
##$TPNAME3= <>
##$TPNAME4= <>
##$TPNAME5= <>
##$TPNAME6= <>
##$TPNAME7= <>
##$TPOAL= (0..7)
0.5 0.5 0.5 0.5 0.5 0.5 0.5 0.5 
##$TPOFFS= (0..7)
0 0 0 0 0 0 0 0 
##$TUNHIN= 0
##$TUNHOUT= 0
##$TUNXOUT= 0
##$USERA1= <user>
##$USERA2= <user>
##$USERA3= <user>
##$USERA4= <user>
##$USERA5= <user>
##$V9= 5
##$VALIST= <valist>
##$VCLIST= <CCCCCCCCCCCCCCC>
##$VD= 0
##$VDLIST= <DDDDDDDDDDDDDDD>
##$VPLIST= <PPPPPPPPPPPPPPP>
##$VTLIST= <TTTTTTTTTTTTTTT>
##$WBST= 1024
##$WBSW= 4
##$XGAIN= (0..3)
0 0 0 0 
##$XL= 0
##$YL= 0
##$YMAX_a= 477032
##$YMIN_a= -411598
##$ZGOPTNS= <>
##$ZL1= 120
##$ZL2= 120
##$ZL3= 120
##$ZL4= 120
##$ABSF1= 16.522
##$ABSF2= -4.171173
##$ABSG= 5
##$ABSL= 3
##$ALPHA= 0
##$AQORDER= 0
##$ASSFAC= 0
##$ASSFACI= 0
##$ASSFACX= 0
##$ASSWID= 0
##$AUNMP= <proc_1d>
##$AZFE= 0.1
##$AZFW= 0.1
##$BCFW= 0
##$BC_mod= 0
##$BYTORDP= 0
##$COROFFS= 0
##$CY= 12.5
##$DATMOD= 1
##$DC= 0
##$DFILT= <>
##$DTYPP= 0
##$F1P= 14.0000005364418
##$F2P= -0.99999901652339
##$FCOR= 0.5
##$FTSIZE= 32768
##$FT_mod= 6
##$GAMMA= 0
##$GB= 0
##$INTBC= 1
##$INTSCL= 1
##$ISEN= 128
##$LB= 0.3
##$LEV0= 0
##$LPBIN= 0
##$MAXI= 10000
##$MC2= 0
##$MEAN= 0
##$ME_mod= 0
##$MI= 0
##$NCOEF= 0
##$NC_proc= -2
##$NLEV= 6
##$NOISF1= 0
##$NOISF2= 0
##$NSP= 0
##$NTH_PI= 0
##$NZP= 0
##$OFFSET= 16.522
##$PC= 1
##$PHC0= -57.77668
##$PHC1= 2.168143
##$PH_mod= 1
##$PKNL= yes
##$PPARMOD= 0
##$PSCAL= 4
##$PSIGN= 0
##$REVERSE= no
##$SF= 250.13
##$SI= 32768
##$SIGF1= 0
##$SIGF2= 0
##$SINO= 400
##$SIOLD= 32768
##$SREGLST= <1H.DMSO>
##$SSB= 0
##$STSI= 32768
##$STSR= 0
##$SW_p= 5175.98343685301
##$SYMM= 0
##$S_DEV= 0
##$TDeff= 65536
##$TDoff= 0
##$TI= <Analysis number 999999
Compound Code 99
Book Reference 9
Project Code 9>
##$TILT= no
##$TM1= 0
##$TM2= 0
##$TOPLEV= 0
##$USERP1= <user>
##$USERP2= <user>
##$USERP3= <user>
##$USERP4= <user>
##$USERP5= <user>
##$WDW= 1
##$XDIM= 32768
##$YMAX_p= 309237472
##$YMIN_p= -49477
$$ End of Bruker specific parameters
$$ ---------------------------------
##NTUPLES= NMR SPECTRUM
##VAR_NAME=  FREQUENCY,     SPECTRUM/REAL,   SPECTRUM/IMAG
##SYMBOL=    X,             R,               I
##VAR_TYPE=  INDEPENDENT,   DEPENDENT,       DEPENDENT
##VAR_FORM=  AFFN,          ASDF,            ASDF
##VAR_DIM=   32768,         32768,           32768
##UNITS=     HZ,            ARBITRARY UNITS, ARBITRARY UNITS
##FACTOR=    0.157963299565203, 1,           1
##FIRST=     4132.6476996994, 0,             0
##LAST=      -1043.33573715361, 0,           0
##MIN=       -1043.33573715361, -49477,      0
##MAX=       4132.6476996994, 309237472,     0
$$ Real data points
##PAGE= N=1
##DATA TABLE= (X++(R..R)), XYDATA
$$ [...]
17190B6143K445j4308m591j6971j0635K888j830n116m391J0039j432j260K927
$$ 26143 28588 14280 9689 -7282 -17917 -15029 -16859 -21975 -26366 -16327 -17759 -19019 -16092
17177a6092M569r20j0041L743J0410q088j971J5886m295p362J3905J262r224p82
$$ -16092 -11523 -12443 -22484 -18741 -8331 -16419 -18390 -2504 -6799 -14161 -256 1006 -8218 -9000
17163i000R27k141O601L838j1752n718j0516P803J3807p866r685n497K747J6047
$$ -9000 -8073 -10214 -3613 225 -11527 -17245 -27761 -19958 -6151 -14017 -23702 -29199 -26452 -10405
17149a0405Q999j1446l181r114M786R955P172j5025j2191J1574J1680L668k949
$$ -10405 -1406 -12852 -16033 -25147 -20361 -10406 -3234 -18259 -30450 -18876 -7196 -3528 -6477
17136f477M892J0063J2348j2866j5763M065J830q373L921J1487J093L333k57q806
$$ -6477 -1585 8478 20826 7960 -7803 -3738 -1908 -10281 -6360 5127 6220 9553 9296 490
17122D90q299J336m151L978R869j497j2882l594o12M321N722R096N645k1484r353
$$ 490 -7809 -6473 -10624 -6646 3223 1726 -11156 -14750 -15362 -11041 -5319 3777 9422 -12062 -21415
17107b1415J2199P035N920J6217j24l529m859j2454O129p120N817P555j0595k013
$$ -21415 -9216 -2181 3739 19956 19832 16303 11444 -1010 5119 -2001 3816 11371 776 -1237
17093a237J1329O016p626J1831q443j6823n033K39L752R621o981j2492p052R024
$$ -1237 10092 16108 8482 20313 11870 -4953 -9986 -9747 -5995 3626 -3355 -15847 -22899 -13875
17079a3875J8538J0792p174K683J4429k995o218K54n839J317M56r542Q822Q716
$$ -13875 4663 15455 8281 10964 25393 22398 16180 16434 10595 11912 12368 2826 11648 20364
17065B0364l276j3416L876j4439o340J5891p131j0774O609l525k397N399L118
$$ 20364 17088 3672 7548 -6891 -13231 2660 -4471 -15245 -8636 -12161 -14558 -9159 -6041
17052f041P771j1963n851l589N36K498P865J0915k965P128q573J462j251L33P557
$$ -6041 1730 -10233 -16084 -19673 -19137 -16639 -8774 2141 -824 6304 -2269 -807 -2058 -1725 5832
17037E832J704j0714l950N142j111J0876J2687l430o550l908O977n134j7187r121
$$ 5832 7536 -3178 -7128 -1986 -3097 7779 20466 17036 10486 6578 13555 8421 -8766 -17887
17023a7887m093P023J9109k754l89p079q914n870o303K98J9806n836j442J1642
$$ -17887 -21980 -14957 4152 1398 1009 -6070 -14984 -20854 -27157 -26859 -7053 -12889 -14331 -2689
17009b689m548R538N731J0720p402m939p848j7059j288J5809K4083M566j3890
$$ -2689 -7237 2301 8032 18752 11350 6411 -1437 -18496 -19784 -3975 20108 24674 10784
16996A0784J216L042n891J4654O639n742j0749j306k675p913K942N278l082L983
$$ 10784 12000 15042 9151 23805 30444 24702 13953 12647 9972 2059 5001 10279 7197 11180
16982A1180J24j3491m910m763p91J7908m179N869N060j061p047j4326l592J1495
$$ 11180 11304 -2187 -7097 -11860 -12651 5257 1078 6947 12007 10946 3899 -10427 -14019 -2524
16968b524L523R07R63J0821r144j2477J0332J0747l607p075P340L040j1688p090
$$ -2524 999 1906 2869 13690 4546 -7931 2401 13148 9541 2466 9806 12846 1158 -5932
16954e932q365n535J4318R699l59j455o914l15l460k001O579L242r26j1027j1298
$$ -5932 -14297 -19832 -5514 4185 3826 2371 -4543 -4858 -8318 -10319 -3740 -498 -1424 -12451 -23749
16939b3749M352L826N331R094J013J0674r338o859N082j987j3157N840r195r547
$$ -23749 -19397 -15571 -10240 -1146 -133 10541 1203 -5656 -574 -2561 -15718 -9878 -19073 -28620
16925b8620L520J2550J3632P92N099N944j0237m552l428J3326O345p504J522n109
$$ -28620 -25100 -12550 1082 1874 6973 12917 2680 -1872 -5300 8026 14371 6867 8389 3280
16911C280J1049M505o201M237j1408m978k308J509m403m821n26N011Q097k578
$$ 3280 14329 18834 12633 16870 5462 484 -1824 -315 -4718 -9539 -10065 -5054 3043 465
16897D65M446J5057r538m549k163j3615j0667J3001r87J4305n075p669P624q743
$$ 465 4911 19968 10430 5881 3718 -9897 -20564 -7563 -8550 5755 680 -6989 635 -8108
16883h108L951J185l871r669J5350J0056P255L55k708m542p999R461J1261j0107
$$ -8108 -4157 -2972 -6843 -16512 -1162 8894 16149 16504 13796 9254 1255 10716 21977 11870
16869A1870p558p627L192r0P695j935r845r74r80J700l537o030k92n612p005N564
$$ 11870 4312 -3315 -123 -213 7482 5547 -4298 -5272 -6252 -4552 -8089 -14119 -14411 -20023 -27028 -21464
16853b1464K2317J1881J889j1658P704k903L373K099K19m221j0171q334P040Q461
$$ -21464 853 12734 14623 2965 10669 7766 11139 13238 13457 9236 -935 -9269 -2229 6232
16839F232L586o181j1962j7041j0742M408Q651l899P666N683Q016r745j3489p329
$$ 6232 9818 3637 -8325 -25366 -36108 -31700 -23049 -26948 -19282 -13599 -5583 -15328 -28817 -36146
16825c6146l901N427K0923J1449n178J0427M018N88L469l671O240q131q229J145
$$ -36146 -40047 -34620 -13697 -2248 -7426 3001 7019 7607 11076 7405 13645 5514 -2715 -1570
16811a570J0656n402M592p276p363o666k620J3064Q843n743N004J0282N721K5605
$$ -1570 9086 3684 8276 1000 -6363 -13029 -15649 -2585 6258 515 5519 15801 21522 47127
16797D7127R189k1657p198j0486q106j321l201K089p04N830N893Q175m428j1260
$$ 47127 56316 34659 27461 16975 8869 7548 4347 6436 5732 11562 17455 25630 21202 9942
16783I942p667P527J442n839M207L903j201M409j3183J446J0603o077L131q90
$$ 9942 2275 9802 11244 5405 9612 13515 12314 16723 3540 4986 15589 9512 12643 11753
16769A1753P86p234m831n618j1002P746O733l949M970J3973k342q129m264j736
$$ 11753 12539 5305 474 -5144 -16146 -8400 -1667 -5616 -646 13327 10985 2856 -1408 -3144
16755c144p905O10M419J247P015Q500r308j8255O798P633l355K009j467J212N511
$$ -3144 -11049 -10439 -6020 -4773 2242 10742 1434 -16821 -10023 -2390 -5745 -3736 -5203 -3991 1520
16740A520m651q714p49P768N425m468p165l276k400l624o010O549J9541J2698
$$ 1520 -3131 -11845 -12594 -4826 599 -3869 -11034 -14310 -16710 -20334 -26344 -19795 -254 12444
16726A2444J824q480M42n039M039M63o54q969O009L004M721j4070o537N31q539
$$ 12444 14268 5788 6230 1191 5230 5693 5039 -3930 2079 5083 9804 -4266 -10803 -10272 -18811
16711a8811J989L379J458r760o062Q120R616J0092j221j2869M430J9260p785j2538
$$ -18811 -16822 -13443 -11985 -21745 -27807 -19687 -10071 21 -1200 -14069 -9639 9621 1836 -10702
16697a0702m544r410j0289n099J0771J0431j20Q714O043N39M633m726k009J387
$$ -10702 -15246 -24656 -34945 -40044 -29273 -18842 -18962 -10248 -4205 -3666 967 -3759 -5768 -4381
16683d381P924J0633m045j2961o562k472J4266J4229j173R460K294j1912j2198
$$ -4381 3543 14176 10131 -2830 -9392 -11864 2402 16631 15458 24918 27212 15300 3102
16670C102j2959n836r20r964N480O965j7R457J3809J7429N155P518k928j2995
$$ 3102 -9857 -15693 -16613 -26577 -21097 -14132 -14149 -4692 9117 26546 31701 39219 36291 23296
16656B3296j3000q179j479J8868M581k2715q717K686J668j658p544J7923m208
$$ 23296 10296 2117 638 19506 24087 1372 -7345 -4659 -2991 -4649 -12193 5730 1522
16643A522j7247l771Q080m305J4031J981n878p182M206J8613K474j8079r643m652
$$ 1522 -15725 -19496 -11416 -15721 -1690 291 -5587 -12769 -8563 10050 12524 -5555 -15198 -19850
16629a9850N452J5842L195J1731O547j4495l533on68p014p81L360O315j4340J0641
$$ -19850 -14398 1444 4639 16370 22917 8422 4889 4883 4315 -2699 -3480 -120 6195 -8145 2496
16614B496K182J583p411r838k161O784j0084j1249n5O975J5196R396j6145k3689
$$ 2496 4678 6261 -1150 -10988 -13149 -6365 -16449 -27698 -27753 -20778 -5582 3814 -12331 -36020
16600c6020o419J9324J0139O585N653j583j77j0767o058J9474J2619k425K728
$$ -36020 -42439 -23115 -12976 -6391 -738 -2321 -2498 -13265 -19323 151 12770 10345 13073
16587A3073r921j0502M665J117q703R233Q692m190l432j4937L008J0227J307L74
$$ 13073 3152 -7350 -2685 -1568 -10271 -1038 7654 3464 32 -14905 -11897 -1670 -363 11
16573A1j4457J477N772O64J859J44L826Q686M022l64k672J520q91j8810p157N841
$$ 11 -14446 -12969 -7197 -6533 -4674 -4530 -704 7982 12004 11640 8968 10488 9597 -9213 -16370 -10529
16557a0529Q302J844n300r684M984P419q50K851j73K98K348K90n709o103r330
$$ -10529 -2227 -383 -5683 -15367 -10383 -2964 -3814 -963 -1136 -838 1510 1800 -3909 -10012 -19342
16542a9342j2810J082K703L703r213Q22J4874J4495R907P75J943q054n284J1077
$$ -19342 -32152 -31070 -28367 -24664 -33877 -33055 -18181 -3686 6221 6996 8939 885 -4399 6678
16528F678O29P204j5906j7786o473J1832K0215J0487q88n156k749n718j0855j3265
$$ 6678 7307 14511 -1395 -19181 -25654 -13822 6393 16880 15992 10836 8087 2369 -8486 -21751
16514b1751K930J64r85m055J1926R754P278P047k285o308l875p317M99P861m300
$$ -21751 -18821 -18657 -19642 -23697 -11771 -2017 5261 12308 10023 3715 -160 -7477 -6978 883 -3417
16499c417M818l773k18N918j9269l912J3103J2314j358O591K651m24j1228q970
$$ -3417 1401 -2372 -2590 3328 -15941 -19853 -6750 5564 4206 10797 13448 13024 1796 -7174
16485g174p210M319K489j348j1417k4482L12J6125K0089n583n301K67O212l532
$$ -7174 -14384 -10065 -7576 -8924 -20341 -44823 -44511 -28386 -8297 -13880 -19181 -18914 -12702 -16234
16471a6234J2595Q902p462J161p347N87J1328m052n468p359J4608J6559L089N718
$$ -16234 -3639 5263 -2199 -1038 -8385 -7798 3530 -522 -5990 -13349 1259 17818 20907 26625
16457B6625l093j9434n332R14m48L654j1343j4300M176Q632Q268J4176Q45j4610
$$ 26625 23532 4098 -1234 -320 -768 2886 -8457 -22757 -18581 -9949 -1681 12495 13340 -1270
16443a270n350m089P643J36o587p564J0823J1548J147o319m394M086m168P73m250
$$ -1270 -6620 -10709 -3066 -2930 -9517 -17081 -6258 5290 6437 118 -4276 -190 -4358 -3585 -7835
16428g835j1686k731n898M257J3634m71o641j2595J1298J5232j687J2758J983
$$ -7835 -19521 -22252 -28150 -23893 -10259 -10730 -17371 -29966 -18668 -3436 -5123 7635 9618
16415I618P055m873J3742J0441o809r995q750J538m081L509N774o007j1480n088
$$ 9618 16673 11800 25542 35983 29174 19179 10429 11967 7886 11395 17169 11162 -318 -5406
16401e406J7577j0059l107j2079j888J3258J471n745K481l50o503J070l54n885
$$ -5406 12171 2112 -995 -13074 -14962 -1704 -233 -5978 -3497 -3847 -10350 -9280 -9634 -15519
16387a5519q040r284J602J3937J130N325J4146N529o839j2465J0442l586r411
$$ -15519 -23559 -32843 -31241 -17304 -16174 -10849 3297 8826 1987 -10478 -36 -3622 -13033
16374a3033P355L741K500m490N121o923j5450J4698R585j0878r351K152J5214
$$ -13033 -5678 -1937 563 -3927 1194 -5729 -21179 -6481 3104 -7774 -17125 -14973 241
16361B41K683j204N908L080R064M299Q033m93j4343o796l569n831q705J510l159
$$ 241 2924 1720 7628 10708 19772 24071 32104 31611 17268 10472 6903 1072 -7633 -6123 -9282
16346i282j82k726j1714n297J0731J4247P851N473R950m947k2737j9619j359P100
$$ -9282 -9464 -12190 -23904 -29201 -18470 -4223 3628 9101 19051 14104 -8633 -28252 -29611 -22511
16332b2511N036Q995O628q743P84o220L663M952j072k0815j354R549L945O730
$$ -22511 -17475 -8480 -1852 -10595 -9811 -16031 -12368 -7416 -8488 -29303 -30657 -21108 -17163 -10433
16318a0433J4514O221n021P111m491p587o957p980M112J6379k663l913l824n228
$$ -10433 4081 10302 5281 12392 7901 314 -6643 -14623 -10511 5868 3205 -708 -4532 -9760
16304i760l86P427N795L294r785j6163p888J757Q038J1705J4806k110m825r128
$$ -9760 -10146 -2719 3076 6370 -3415 -19578 -27466 -25709 -17671 -5966 8840 6730 1905 -7223
16290g223O197J9275K484j2698k75m052l258J1325n762l485m566Q302m848R99
$$ -7223 -1026 18249 20733 8035 7760 3708 450 11775 6013 2528 -2038 6264 1416 2415
16276B415K366j1794l301K695K503R735M718O00J1186j568k3191j5082n873K0060
$$ 2415 4781 -7013 -10314 -7619 -5116 4619 9337 9937 21123 19555 -3636 -18718 -24591 -4531
16262d531m208L073J0874P84p290L042O433j1293N244R734K775K408j3749j4839
$$ -4531 -8739 -5666 5208 5992 -1298 1744 8177 -3116 2128 11862 14637 17045 3296 -11543
16248a1543J730r048p646O320J4403K4138q62q127j934n586Q54N879N37j64L83
$$ -11543 -9813 -18861 -26507 -20187 -5784 18354 17492 9365 7431 1845 2699 8578 9115 8951 9334
16233I334K250j294M874k92j0351j8851p954J6088R523J1348k291k546o287N90
$$ 9334 11584 10290 15164 14872 4521 -14330 -22284 -6196 3327 14675 12384 9838 3551 4141
16219D141k781l333j5288N050J0831n679r936j398N746J0905j3415M685M224M407
$$ 4141 1360 -1973 -17261 -12211 -1380 -7059 -16995 -18393 -12647 -1742 -15157 -10472 -6248 -1841
16205a841k817N680P324m317q388p01N97j461J7407N999j3695N650k482j1878
$$ -1841 -4658 1022 8346 4029 -4359 -5060 -4463 -5924 11483 17482 3787 9437 6955 -4923
16191d923j0457q399K3430J7463K420m188j236J494o039j6474p454Q191M72r60
$$ -4923 -15380 -23779 -349 17114 19534 15346 14110 15604 9565 -6909 -14363 -6172 -5700 -6660
16177f660J7037Q945L572j709m094N366j1583k032p041j4763Q490P272P030L805
$$ -6660 10377 19322 22894 21185 17091 22457 10874 8842 1801 -12962 -4472 2800 9830 13635
16163A3635o871j909J3385m352n419L951Q860k995n587o584k0831n482K380J5810
$$ 13635 6764 4855 18240 13888 8469 12420 21280 18285 12698 6114 -14717 -20199 -17819 -2009
16149b009J0473q853L528m092n592l983j972K216P244P080o564J0394p026j2768
$$ -2009 8464 -389 3139 -953 -6545 -10528 -12500 -10284 -3040 4040 -2524 7870 844 -11924
16135a1924R541j3936o03J1583O636n112R221j297j027L463N128j1415J951r941
$$ -11924 -2383 -16319 -16922 -5339 1297 -3815 5406 4109 3082 6545 11673 258 2209 -7732
16121g732o122Q273J0515J1663P828j1157P78j2363K810J1117P029l880j3307
$$ -7732 -13854 -5581 4934 16597 24425 13268 14046 1683 4493 15610 22639 18759 5452
16108E452k962j3193K059J1410p716l235p085k163R335J1225r314k862O841J6766
$$ 5452 2490 -10703 -8644 2766 -4950 -8185 -15270 -17433 -8098 3127 -6187 -9049 -2208 14558
16094A4558K469j9482p055Q435r219k431R984j205J270p539r75q987Q403J2947
$$ 14558 17027 -2455 -9510 -1075 -10294 -12725 -2741 -3946 -2676 -10215 -11190 -20177 -11774 1173
16080A173K798L828q05J960p872k136N094l758j4121j494o030J327K279M939R374
$$ 1173 3971 7799 6994 8954 1082 -1054 4040 282 -13839 -15333 -21363 -20036 -17757 -12818 -3444
16065c444N069j579q419K214R342o425m086J9539J0686j3146j1251O926r572M180
$$ -3444 1625 46 -8373 -6159 3183 -3242 -7328 12211 22897 9751 -1500 5426 -4146 34
16051C4J622J2358n902o994L991p028L804q107q785k080Q524O121J0328p524l460
$$ 34 1656 14014 8112 1118 5109 -1919 1885 -6222 -15007 -17087 -8563 -2442 7886 362 -3098
16036c098L745L675Q59k749k353O57r66r413j1603J1155O452J1022J1637j33j7571
$$ -3098 647 4322 5181 2432 79 736 -230 -9643 -21246 -10091 -3639 7383 19020 18887 1316
16021A316o564K423j2020L235n786P997R882q806r895J0486N276P792j585M136
$$ 1316 -5248 -2825 -14845 -11610 -17396 -9399 483 -8323 -18218 -7732 -2456 5336 3751 7887
16007G887m607p929k411j413Q761K169O598r40q994n45j1984O238J1124J77p423
$$ 7887 3280 -4649 -7060 -8473 288 2457 9055 8115 -879 -1424 -13408 -7170 3954 4131 -3292
15992c292k35N227k425p661J028j788m070L746K140K625P032M897l465l512J1365
$$ -3292 -3527 1700 -725 -8386 -7358 -9146 -13216 -9470 -7330 -4705 2327 7224 3759 247 11612
15977A1612O063o140m796P112J0605n273n535p401m118j868q39N357Q663n73p869
$$ 11612 17675 11535 6739 13851 24456 19183 13648 6247 2129 261 -578 4779 13442 12869 5000
15962E000Q04l767j660M819j7902R08J6251K225j2399r070N854J2405l488M388
$$ 5000 5804 2037 377 5196 -12706 -11798 4453 6678 -5721 -14791 -8937 3468 -20 4368
15948D368J0233J5892k584q478q400J238n089p104J782J3966r50j9851l834N18
$$ 4368 14601 30493 27909 19431 11031 12269 7180 76 1858 15824 14874 -4977 -8811 -8293
15934h293k482M905L897N853j2398p519O494R499K942L8J989q281O560j2598J232
$$ -8293 -10775 -5870 -1973 3880 -8518 -16037 -9543 -44 2898 2936 4925 -3356 3204 -9394 -8162
15919h162Q812j0611m483p518J8217K2436N227Q09j5197j6317N300L961K759N179
$$ -8162 650 -9961 -14444 -21962 -3745 18691 23918 24727 9530 -6787 -1487 2474 5233 10412
15905A0412m524k881J593n726k547K740J754j610J1957J764J798N671j884O75
$$ 10412 5888 3007 4600 -1126 -3673 -933 821 -789 11168 12932 14730 20401 18517 19192
15891A9192j3217m077P39K382O830n305j5357R651J6247m234p669j265O956j0230
$$ 19192 5975 1898 2637 5019 11849 6544 -8813 838 17085 12851 5182 3917 10873 643
15877F43m777K1242J616j1221l907O588Q625o433j3603n12n54P518Q028k591k530
$$ 643 -4134 17108 18724 7503 3596 10184 18809 12376 -1227 -1739 -2293 5225 13253 10662 8132
15862H132j2556j614j313R096l354p195j3537L770J1297Q888R694J381j2593j464
$$ 8132 -4424 -6038 -7351 1745 -1609 -8804 -22341 -18571 -7274 1614 11308 12689 96 -1368
15848a368J5925j151N075K083R86j1247p320j91J642o079r328L390K0268N295
$$ -1368 14557 13406 18481 20564 21550 10303 2983 2792 4434 -1645 -10973 -7583 12685 17980
15834A7980j6675q248O484m600R972J2344K487p867j2107k257q574l811J5258
$$ 17980 1305 -6943 -459 -5059 4913 17257 19744 11877 -230 -2487 -11061 -14872 386
15821C86J7137N462O394j6549o538m86Ok995j0529j0520K419L400J90J922O95
$$ 386 17523 22985 29379 12830 6292 5806 5812 2817 -7712 -18232 -15813 -12413 -12223 -10301 -9606
15806i606J5825o44j1228N70l057n776l371K0184J1250j4091p255n484O330J352
$$ -9606 6219 5575 -5653 -5083 -8140 -13916 -17287 2897 14147 56 -7199 -12683 -6353 -5001
15792e001k068n466M901J4761P838M50o948J1786m162k3542o107j942l47L570
$$ -5001 -7069 -12535 -7634 7127 14965 15415 8467 20253 16091 -7451 -13558 -15500 -15847 -12277
15778a2277K5031k234k405n742j2002k082k777R40M591K707P579l03k923m61L810
$$ -12277 12754 10520 8115 2373 -9629 -11711 -14488 -13548 -8957 -6250 1329 1026 -1897 -2358 1452
15763A452p036o174N936N292j4220l607N949M817J872m889L747Q583O658K862
$$ 1452 -5584 -11758 -5822 -530 -14750 -18357 -12408 -7591 -5719 -10608 -6861 1722 8380 11242
15749A1242O485j910j2670q27P86L323L218K152l612j565K672k9255j1999P509
$$ 11242 17727 15817 3147 2320 3106 6429 9647 11799 8187 6622 9294 -19961 -31960 -24451
15735b4451J4718k463l188K529j586n166j812J2375J3815l012j6812n945J4650
$$ -24451 -9733 -12196 -15384 -12855 -14441 -19607 -21419 -9044 4771 1759 -15053 -20998 -6348
15722f348J2541p729L630K83O846Q539j3654j6565j3452K257n054J0271J2720
$$ -6348 6193 -1536 2094 2377 9223 17762 4108 -12457 -25909 -23652 -28706 -18435 -5715
15709e715j725K942J736k388K161j837m382M555K898p239n248P279N269m371Q282
$$ -5715 -7440 -4498 -2762 -5150 -2989 -4826 -9208 -4653 -1755 -8994 -14242 -6963 -1694 -6065 2217
15694B217N971k896k2162n282R542O604N186k458N792L042O239l650m313l517
$$ 2217 8188 5292 -16870 -22152 -12610 -6006 -820 -3278 2514 5556 11795 8145 3832 315
15680C15k815l11Q88J739Q039J4997r737q607r439L057l736j815n006Q14r290
$$ 315 -2500 -2811 -1923 -184 7855 22852 13115 4508 -4931 -1874 -5610 -7425 -12431 -11617 -20907
15665b0907M37J0349J3381p45j0961O839P699K168R834P104L744k2448r555R467
$$ -20907 -20470 -10121 3260 2515 -8446 -1607 6092 8260 18094 25198 28942 6494 -3061 6406
15651F406L934P377j367k0062j930J823q537m008M06M162N736P306l92j0046O224
$$ 6406 10340 17717 16350 -3712 -5642 -3819 -12356 -16364 -15958 -11796 -6060 1246 854 -9192 -2968
15636b968J470M362l139J0545m584l841N406J2850l386K109m896K543n053j4856
$$ -2968 -1498 2864 -275 10270 5686 1845 7251 20101 16715 18824 13928 16471 11418 -3438
15622c438K124P234k313J414k086m359k245R305M774J3671k995o569r289R41j457
$$ -3438 -1314 5920 3607 5021 2935 -1424 -3669 5636 10410 24081 21086 14517 5228 6169 4712
15607D712j4067j1363l077J3760J71R04J691J706n272O091R373m37p212J3367
$$ 4712 -9355 -20718 -23795 -10035 -9864 -8960 -7269 -5563 -10835 -4744 4629 4192 -3020 10347
15593A0347P333j1914j5129j6275n396R11J3305O367R918R166R57m548o391N469
$$ 10347 17680 5766 -9363 -25638 -31034 -30123 -16818 -10451 -533 8633 9590 5042 -1349 4120
15579D120R15O977N060P844r78j7682j3463J1945J6423o001m380o333p001n592
$$ 4120 5035 12012 17072 24916 23938 6256 -7207 4738 21161 15160 10780 4447 -2554 -8146
15565h146l064J4098L621J1829L60k1449N459N275M482j5170k292J0104m834j559
$$ -8146 -11210 2888 6509 18338 18698 -2751 2708 7983 12465 -2705 -4997 5107 273 -1286
15551a286j299n467J7798k386r104K134R731m819j3880Q004j0809O62L134l325
$$ -1286 -2585 -8052 9746 7360 -1744 390 10121 5302 -8578 -574 -11383 -10721 -7587 -10912
15537a0912N90J4406J256r415k921O59J2216L415L533R117o724m871m014J82r125
$$ -10912 -10322 4084 5340 -4075 -6996 -6337 5879 9294 12827 21944 15220 10349 6335 6517 -2608
15522b608J738P355o543j6421J263J0401J1326k106j376M696k90m568J6965r069
$$ -2608 -870 6485 -58 -16479 -15216 -4815 6511 4405 3029 7725 7435 2867 19832 10763
15508A0763m200K0541M876j5395l677J0621j0671j0537o088q97j289L158J1781
$$ 10763 6563 27104 31980 16585 12908 23529 12858 2321 -3767 -4664 -5953 -2795 8986
15495H986r08M187j1202o103N774j2722j1327P042N277P400K848r403j4579J4654
$$ 8986 8078 12265 1063 -5040 734 -11988 -23315 -16273 -10996 -3596 -748 -10151 -24730 -10076
15481a0076K4259O828k798p844k495R815j1232p940p972j0744N610J4321R399
$$ -10076 14183 21011 18213 10369 7874 17689 6457 -1483 -9455 -20199 -14589 -268 9131
15468I131o275k7095o812M153j0188L982K1276K1496J104m042R23L180o622Q204
$$ 9131 2856 -24239 -31051 -26898 -37086 -33104 -11828 9668 10772 6730 7653 10833 4211 12415
15454A2415l713n110M825n047p064K962j0249j0028J304Q386K236J961L766R681
$$ 12415 8702 3592 8417 3370 -3694 -732 -10981 -21009 -19705 -11319 -9083 -7122 -3356 6325
15440F325o433o152N484J329N04J0840L495O606R519j7533n821L115p32j870m58
$$ 6325 -108 -6260 -776 553 1057 11897 15392 21998 31517 13984 8163 11278 10546 8676 8218
15425H218j3183R53J0435n014N280J8205J5633o279j4083M072r701p676m758p196
$$ 8218 -4965 -4012 6423 1409 6689 24894 40527 34248 20165 24237 14536 6860 2102 -5094
15411e094J3892m040j935M559j0846j89k416J1643J2196n406j8229j4218j733
$$ -5094 8798 4758 2823 7382 -3464 -3653 -6069 5574 17770 12364 -5865 -20083 -21816
15398b1816J1604J1849M471j1930l178R903N866O240j0408r052L063M043K572
$$ -21816 -10212 1637 6108 -5822 -9000 903 6769 13009 2601 -6451 -3388 655 3227
15385C227j2663j756J0552O650o649J0453M279n305Q427p391m926N092N74r536
$$ 3227 -9436 -11192 -640 6010 -639 9814 14093 8788 17215 9824 4898 9990 10564 1028
15371A028J398O216J0594j6261p306j4956K458K357o322J596N125P649n709k63
$$ 1028 2426 8642 19236 2975 -4331 -19287 -16829 -14472 -20794 -19198 -14073 -6424 -12133 -12396
15357a2396L375N798K286k780n419q83k414P376q30n865L429k966n378O803J2713
$$ -12396 -9021 -3223 -937 -3717 -9136 -10019 -12433 -5057 -5887 -11752 -8323 -11289 -16667 -9864 2849
15342B849j839j1193L514k552J1006l01Q319m976l705q65j021n871j034q428k5936
$$ 2849 1010 -10183 -6669 -9221 1785 1484 9803 4827 1122 257 -764 -6635 -7669 -16097 -42033
15327d2033j844K3157K2989K4833o862k7206l929L843l743j3262n926P741M590
$$ -42033 -43877 -20720 2269 27102 20240 -6966 -10895 -7052 -10795 -24057 -29983 -22242 -17652
15314a7652K0050J833O970J123m164k271J4190R563q657j1903k1498J562M032
$$ -17652 2398 4231 11201 12324 8160 5889 20079 29642 20985 9082 -12416 -10854 -6822
15301f822Q9k110J143j4659L666J3064N816j4427r917O02R995Q362n020l832l160
$$ -6822 -6733 -8843 -7700 -22359 -18693 -5629 187 -14240 -24157 -23555 -13560 -5198 -10218 -14050 -17210
15286a7210P000N475R610M557j4867k62L251J3976J0114k641l323k036o741p215
$$ -17210 -10210 -4735 4875 9432 -5435 -5697 -2446 11530 21644 19003 15680 13644 6903 -312
15272c12R381P012R16l545j0812n492K051P979l319j901j4972j3615J1574J7699
$$ -312 9069 16081 16997 13452 2640 -2852 -801 7178 3859 1958 -13014 -26629 -15055 2644
15258B644j706r226O788J2059J2010r491r140l279j0164QO065P777l857m162q734
$$ 2644 938 -8288 -1500 10559 22569 13078 3938 659 -9505 -9497 -3432 4345 488 -3674 -12408
15243a2408P531J1463J541j0798j2904Q746J1155l746r788o571P47J2641O039
$$ -12408 -4877 6586 8127 -2671 -15575 -6829 4326 580 -9208 -15779 -15032 -2391 3648
15230C648J3363j0402j2266k0156k034J4000Q191P712k096N22k727k993J0989
$$ 3648 17011 6609 -5657 -25813 -27847 -13847 -5656 2056 -40 482 -2245 -5238 5751
15217E751p977r814Q015J83j4843j756J3530J0393R720O37j4636J0809J1045k933
$$ 5751 -2226 -12040 -4025 -3842 -18685 -20441 -6911 3482 13202 13839 -797 10012 21057 18124
15203A8124j0157j4005J5992J407n230N864n274N816L373K966l766k292j1673
$$ 18124 7967 -6038 9954 11361 6131 11995 6721 12537 15910 18876 15110 12818 1145
15190A145o365J1704K947K856M312N92K660j4984r091J563R557K243J236m895
$$ 1145 -5220 6484 9431 12287 16599 17191 19851 4867 -4224 -2661 6896 9139 10375 5480
15176E480j4318L007L376L127N435r956j4732L115J0403J4780r592K901L10P514
$$ 5480 -8838 -5831 -2455 672 6107 -3849 -18581 -15466 -5063 9717 125 3026 3336 10850
15162A0850J5858n680n374r539P108m900m981O658J2063j291n241j0867q777P167
$$ 10850 26708 21028 15654 6115 13223 8323 3342 10000 22063 20772 15531 4664 -4113 3054
15148C054m835m061L808J4157K482L928J0301j8162q632j2650j847M518n296L589
$$ 3054 -1781 -5842 -2034 12123 14605 18533 28834 10672 2040 -10610 -12457 -7939 -13235 -9646
15134i646J3072m511r031n450m107J0939K283J7138J5286j0224r056r91o99J3237
$$ -9646 3426 -1085 -10116 -15566 -19673 -8734 -6451 10687 25973 15749 6693 5702 5003 18240
15120A8240m098m713R441J5028p188j6680n376j3499j0843o321J0172r70J5270
$$ 18240 14142 9429 18870 33898 26710 10030 4654 -8845 -19688 -26009 -15837 -16807 -1537
15107a537N316K164o6k115n003o335Q94M355m953L752q054K650J5946J5897n993
$$ -1537 3779 5943 5877 3762 -1241 -7576 -6682 -2327 -7280 -3528 -11582 -8932 7014 22911 16918
15092A6918J443J325j476m089q574l447l247j4669j2815K072J0774Q57J1859J95
$$ 16918 18361 19686 18210 14121 5547 2100 -1147 -15816 -28631 -26559 -15785 -14928 -3069 -2874
15078b874q252J4554p13j3084j357K3934K2020m220M017J154R672p078r73j1943
$$ -2874 -11126 3428 2715 -10369 -11726 12208 34228 30008 34025 35179 44851 37773 36800 24857
15064B4857j0969p311k959N145j5245l880m957Q183L595M307r664K50J2454J7527
$$ 24857 13888 6577 3618 8763 -6482 -10362 -15319 -7136 -3541 766 -8898 -8648 3806 21333
15050B1333O949m545q211L806p429K768R473l747j3944j2823k246m975J7650M003
$$ 21333 28282 23737 15526 19332 11903 14671 24144 20397 6453 -6370 -8616 -13591 4059 8062
15036H062R577J5414j2589k215j527j8486j438J5023K382O420N88j2171n14m862
$$ 8062 17639 33053 20464 18249 16722 -1764 -3202 11821 14203 20623 21211 9040 8526 3664
15022C664Q746m355N85k382P804P3j6445o735J1624N427m385n70J1971o79q018
$$ 3664 12410 8055 8640 6258 14062 14135 -2310 -9045 2579 8006 3621 3051 15022 14343 6325
15007F325n647k535L341o851K974l100k000l63n375M596J5022l9k381n530j588
$$ 6325 678 -1857 1484 -5367 -2393 -5493 -7493 -7856 -13231 -8635 6387 6348 3967 -1563 -3151
14992c151P317O532L488p58O424J0673n501k8336j4295L102J7813m567l499K73
$$ -3151 4166 10698 14186 13428 19852 30525 25024 -3312 -17607 -14505 3308 -1259 -4758 -4485
14978d485N980O325L822N238k229o034K734P000k429p492j3753K183K276j540
$$ -4485 1495 7820 11642 16880 14651 8617 11351 18351 15922 8430 -5323 -3140 -864 -2404
14964b404K386J008O734l083M108l512m753j1344Q768L773q579j9293J2237J6872
$$ -2404 -18 990 7724 4641 8749 5237 484 -10860 -2092 1681 -6898 -26191 -13954 2918
14950B918n34j1149o206k521n148O756J2573Q290l582K239K815j414J761l696
$$ 2918 2384 -8765 -14971 -17492 -22640 -15884 -3311 4979 1397 3636 6451 5037 6798 3102
14936C102j0234N705Q698m083N309o359q901j1167M478K4742K619K737l739o581
$$ 3102 -7132 -1427 7271 3188 8497 2138 -6763 -17930 -13452 11290 13909 16646 12907 6326
14922F326J7123L823j4275j1352R159R285R549r652k7643k644k749L240O904K366
$$ 6326 23449 27272 12997 1645 10804 20089 29638 19986 -7657 -10301 -13050 -9810 -2906 -540
14908e40p74l634l55M032K099K793r151K963J2270n496M157P890n833J136j63
$$ -540 -1314 -4948 -5303 -1271 828 3621 -5530 -2567 9703 4207 8364 16254 10421 11557 11394
14893A1394j2933M308L095L273P503r774n23k176p618J0276k113m402K200j6429
$$ 11394 -1539 2769 5864 9137 16640 6866 6343 4167 -3451 6825 4712 310 2510 -13919
14879a3919o133J6385L075K797M048Q97r51p16K093k563k323J589K923l246j0920
$$ -13919 -20052 -3667 -592 2205 6253 7150 6199 5483 7576 5013 2690 4279 7202 3956 -6964
14864f964m578m981j527L519J0431k154L186P103R724J3344j1870r212q327j0014
$$ -6964 -11542 -16523 -18050 -14531 -4100 -6254 -3068 4035 13759 27103 15233 6021 -2306 -12320
14850a2320J2964K189m636K863r302P552J0697o544J1284J4758j1290j9645j073
$$ -12320 644 2833 -1803 1060 -8242 -690 10007 3463 14747 29505 18215 -1430 -2503
14837b503J2312J1057r05L942r995r012r342o519N911L943j324n218l072N557
$$ -2503 9809 20866 19961 23903 13908 4896 -4446 -10965 -5054 -1111 -2435 -7653 -10725 -5168
14823e168j282Q613o505p584J6637n806j447O744q473j0972Q542l482P669P622
$$ -5168 -6450 2163 -4342 -11926 4711 -1095 -2542 4202 -4271 -15243 -6701 -10183 -2514 5108
14809E108m752m320q167N09R868J1924M510m063L673o712k605O127q30L315k4179
$$ 5108 356 -3964 -12131 -11622 -1754 10170 14680 10617 14290 7578 4973 11100 10270 13585 -10594
14794a0594K936L188L127L35j0135L387M032K365J896O987j0214j2209N112L892
$$ -10594 -7658 -4470 -1343 -1008 -11143 -7756 -3724 -1359 537 7524 -2690 -14899 -9787 -5895
14780e895M760J2626n220n406J0048K219m338r711L406N617J2602j089j8458k340
$$ -5895 -1135 11491 6271 865 10913 13132 8794 -917 2489 8106 20708 19619 1161 -1179
14766a179l121j932K399o48M360O24q681J8214J1413j1841j9275L613J8744q205
$$ -1179 -4300 -6232 -3833 -4481 -121 503 -8178 10036 21449 9608 -9667 -6054 12690 4485
14752D485p473L993K436J1754m475K242J387Q790J4530K053q157j3958n105J611
$$ 4485 -2988 1005 3441 15195 10720 12962 14349 23139 37669 39722 31565 17607 12502 14113
14738A4113j06Q637J1793Q61j2040m456l9O945P602Q801j7918r351r472o569O514
$$ 14113 14007 22644 34437 35298 23258 18802 18763 25708 33310 42111 24193 14842 5370 -1199 5315
14723E315J054R720M92J935o973M425l634M747j5294j0329J1885m008m566J7626
$$ 5315 6369 16089 16581 18516 11543 15968 12334 17081 1787 -8542 3343 -665 -5231 12395
14709A2395M46m697P240m972j0311N437l88m042J346j1088n889J4157N369m190
$$ 12395 12841 8144 15384 10412 101 5538 5150 1108 2454 -8634 -14523 -366 5003 813
14695H13Q61J463J1404Q435K316p094n197q315L343o473p017P315m0j905r944
$$ 813 1674 3137 14541 22976 25292 18198 13001 4686 8029 1556 -5461 1854 1814 -91 -10035
14680a0035p080o38m073R683L972l631M147J1015J3501m18j0577n203n019O756
$$ -10035 -17115 -17753 -21826 -12143 -8171 -11802 -7655 3360 16861 16443 5866 663 -4356 2400
14666B400n756K6P377O654N769n67m349q098k042J841l262R868M810l237j453
$$ 2400 -3356 -3330 4047 10701 16470 15903 11554 3456 1414 3255 -7 9861 14671 11434 9981
14651I981R912K869j8518q009R34R596K809n532M150O889q23K879Q184L594j7034
$$ 9981 19893 22762 4244 -3765 -2831 6765 9574 4042 8192 15081 14258 17137 25321 28915 11881
14636A1881j8108l021M837Q790L917l876k52N733J1k116L711l384o808J396r666
$$ 11881 -6227 -9248 -4411 4379 8296 4420 4168 9901 9912 7796 11507 8123 1315 2711 -6955
14621f955j8830j14R054K267o527J098J4678k100R02L338J5142J0388j1049j402
$$ -6955 -25785 -25899 -16845 -14578 -21105 -20007 -5329 -7429 -6527 -3189 11953 22341 11292 9890
14607I890J4903L328o982j1567o428P057P205N978j7197q598Q514Q02j0418P897
$$ 9890 24793 28121 21139 9572 3144 10201 17406 23384 6187 -2411 6103 6905 -3513 4384
14593D384Q584o138k243q858m853J918J0370J14J507Q5n884Q396Q012N187m564
$$ 4384 12968 6830 4587 -4271 -9124 -7206 3164 3278 4785 4870 -1014 7382 15394 20581 16017
14578A6017o102j1471j3744Q419J4321k604K660J6776L658o239j9177j0518q089
$$ 16017 9915 -1556 -15300 -6881 7440 4836 7496 24272 27930 21691 2514 -8004 -16093
14565a6093M15L343m927M625j2145P171J3810K0903L082j1785O616N764p997l924
$$ -16093 -15678 -12335 -17262 -12637 -24782 -17611 -3801 17102 20184 8399 15015 20779 12782 8858
14551H858N531L818L997l04m058j1242l115k519j0381j854L954L770R563p452
$$ 8858 14389 18207 22204 21900 17842 6600 3485 966 -9415 -11269 -7315 -3545 6018 -1434
14537a434o377j0298J0306J1291m254j083J120j6565J1892J5914K516o618n240
$$ -1434 -7811 -18109 -7803 3488 -766 -1849 -729 -17294 -5402 10512 13028 6410 1170
14524A170M466N146J1150J772j2338j4837l774m55j0415r997J0005J6538J6708
$$ 1170 5636 10782 21932 23704 11366 -3471 -7245 -7700 -18115 -28112 -18107 -1569 15139
14511A5139R130J240k376r827j1527J807K894J903k275m263L760J2986J3316J380
$$ 15139 24269 25509 23133 13306 1779 3586 6480 8383 6108 1845 5605 18591 31907 33287
14497C3287j6039j059O603k174j0457R191R044o461J6901j3853l3840j4884k464
$$ 33287 17248 16189 22792 20618 10161 19352 28396 21935 38836 24983 -8857 -23741 -26205
14484b6205J0023R614J4430n06j0522N457K191l54N670o452k588R48J5340L918
$$ -26205 -16182 -6568 7862 7356 -3166 2291 4482 4128 9798 3346 758 1706 17046 20964
14470B0964j5141j1821p197j6216J564R092m840L041J2637P329m14p87N631k392
$$ 20964 5823 -5998 -13195 -29411 -27847 -18755 -23595 -20554 -7917 -588 -1002 -1789 3842 1450
14456A450m751L529O485N941K843M01R544j207L062j1034K262n033n114n71p308
$$ 1450 -3301 228 6713 12654 15497 15898 25442 24235 27297 16263 18525 13492 8378 7807 499
14441D99O904m581O061M174M25J3680l268j626j7988p145J2548K35p536l846N879
$$ 499 7403 2822 8883 13057 13482 27162 23894 22268 4280 -2865 9683 9918 2382 -1464 4415
14426D415k780k767K592P72P765n679l820l05O41O820J4073q098j3880n121J818
$$ 4415 1635 -1132 1460 2232 9997 4318 498 193 834 7654 21727 13629 -251 -5372 -3554
14411c554J1023m860L997o337L803K2357j2862q403r819r470j114J5125P349O133
$$ -3554 7469 2609 6606 269 4072 26429 13567 5164 -4655 -14125 -15239 -114 7235 13368
14397A3368J754q148l450m323O118P956j1647n948L675k332q623R120N014j166
$$ 13368 15122 6974 3524 -799 5319 13275 1628 -4320 -645 -2977 -11600 -2480 2534 1368
14383A368k877o078p764J3052N984o130j0780j49N026k160J8767J951j4627J6284
$$ 1368 -1509 -7587 -15351 -2299 3685 -2445 -13225 -13374 -8348 -10508 8259 10210 -4417 11867
14369A1867M075k2676j921R523J4184L626K531j6072k282j872m537q201k243M34
$$ 11867 15942 -6734 -8655 868 15052 18678 21209 5137 2855 983 -3554 -11755 -13998 -13564
14355a3564o619J1088P443K281O563R65m470O09J737J429J2762r3r410O578P967
$$ -13564 -20183 -9095 -1652 629 7192 8157 3687 4296 6033 7462 20224 20131 10721 17299 25266
14340B5266M995j0895q305j5369j313J1655P902J1952l873N776k568r282m45J330
$$ 25266 30261 19366 11061 -4308 -5621 6034 13936 25888 22015 27791 25223 15941 15496 16826
14326A6826j461J093n195k53j754j0947l183O832j3226p332Q046J1627L713K962
$$ 16826 15365 16458 11263 11010 9256 -1691 -4874 1958 -11268 -18600 -10554 1073 4786 7748
14312G748j6881M07R426l709L548J0380L238o892r209k643M139r20O171k346J4146
$$ 7748 -9133 -8726 700 -3009 539 10919 14157 7265 -1944 -4587 -448 -1368 4803 2457 16603
14297A6603J6089M643q400k0600m125J5631O717q118q660M584R475q54p688o935
$$ 16603 32692 37335 28935 8335 4210 19841 26558 18440 9780 14364 23839 22985 15297 8362
14283H362Q552p211m615M08J0311M13P546O168j7377q908Q30J624P132M956k816
$$ 8362 16914 9703 5088 5496 15807 16220 23766 29934 12557 3649 4479 6103 13235 18191 15375
14268A5375j3480j9836j2330Q337J6560J1332J0664n220R394j1855o802J6356
$$ 15375 1895 -17941 -30271 -21934 -5374 5958 16622 11402 20796 8941 2139 18495
14256A8495l547J439N595J537M206q299p267K794J1131L142J103j5639k1862M726
$$ 18495 14948 16387 21982 23519 27725 19426 12159 14953 26084 29226 30329 14690 -7172 -2446
14242b446k825P691J7274k43o0k0298l994J72j573j581n66k655q53j500N777j467
$$ -2446 -5271 2420 19694 19451 19391 -907 -4901 -4729 -6302 -7883 -8449 -11104 -11957 -13457 -7680 -9147
14226i147r333m992J5408J2427j169P072J6942r284J719L450j901K085n628j8378
$$ -9147 -18480 -23472 -8064 4363 3194 10266 27208 17924 19643 23093 21192 23277 17649 -729
14212g29J760J2912N697r334Q11M728k736J0797O313k587j128Q57j2457j910k715
$$ -729 1031 13943 19640 10306 11117 15845 13109 23906 30219 27632 26504 27361 14904 12994 10279
14197A0279J158J1174p839k294M813j1097j130n893l323N665q386J469P664M131
$$ 10279 11437 22611 14772 12478 17291 6194 5064 -829 -4152 1513 -6873 -5404 2260 6391
14183F391J4676K475m753J0355L821j301m383o855O328o299k49n363o164L005
$$ 6391 21067 23542 18789 29144 32965 31664 27281 20426 26754 20455 20206 14843 8679 11684
14169A1684P11l830j6571P570k14P243Q45p891Q200M501K245R06n331j5989Q925
$$ 11684 12395 8565 -8006 -436 -650 6593 7438 -453 7747 12248 14493 15399 10068 -5921 3004
14154C004P937R334L166r60q801j5133r629N219J0705n434r904J2009K3652M618
$$ 3004 10941 20275 23441 22481 13680 -1453 -11082 -5863 4842 -592 -10496 1513 25165 29783
14140B9783q102j361p561L411r331J2176M991m327q470j287k926L896l361q454
$$ 29783 21681 20320 12759 16170 6839 19015 24006 19679 11209 9922 6996 10892 7531 -923
14126i23l229L392J6856n953m214J2985J6217Q750j8381q869l5N312O07r249j3242
$$ -923 -4152 -760 16096 10143 5929 18914 35131 43881 25500 16631 16596 21908 22515 13266 24
14111B4r76N565j2507O525M311m743J549k246M662J1702J0323Q7r227k111P059
$$ 24 -952 4613 -7894 -1369 2942 -1801 -252 -2498 2164 13866 24189 24276 15049 12938 19997
14096A9997Q873m245j071j199k1210K855J5953l560m498j557P636K83M193j2831
$$ 19997 28870 24625 23554 22355 1145 4000 19953 16393 11895 10338 17974 18257 22450 9619
14082I619j685R224R457O156r594k0859n525M308n4m12J4972m497q962L83J3179
$$ 9619 7934 17158 26615 32771 23177 2318 -3207 1101 1047 635 15607 11110 2148 2531 15710
14067A5710N402j3596m280J247M309l712o128J0928J2334P015K895k899l907j5691
$$ 15710 21112 7516 3236 4483 8792 5080 -1048 9880 22214 29229 32124 29225 25318 9627
14053I627j1952p29Q781J3772N209J738j4377o706k483j872P075P855q226q501
$$ 9627 -2325 -3054 5727 19499 24708 26446 12069 5363 2880 1008 8083 15938 7712 -789
14039g89N694N035j158m901J4918K459j5618j0591P519R8l388R754J4651j4720
$$ -789 4905 9940 8782 3881 18799 21258 5640 -4951 2568 2666 -722 9032 23683 8963
14025H963l725R606M213k998K747q454r799L599J1413N685R110K003j567j1141
$$ 8963 5238 14844 19057 16059 18806 10352 553 4152 15565 21250 30360 32363 30796 19655
14011A9655m402M047n350K857M79K577n19J2659l774j0207K94P622k702l357k51
$$ 19655 15253 19300 13950 16807 17286 19863 19344 32003 28229 18022 18316 25938 23236 19879 19628
13996A9628l368J371Q937N358k067j439j648L010P270j107j2220J724R714N144
$$ 19628 16260 17631 26568 31926 29859 28420 26772 29782 37052 35945 23725 25449 35163 40307
13982D0307j1427j0929j454l156n184q287n373j348J2238J4681K236k786j0503
$$ 40307 28880 17951 16497 13341 8157 -130 -5503 -6851 5387 20068 22304 19518 9015
13969I015k564m44j944r19M421J2354K898o654r429L262P694L206J1763m95J859
$$ 9015 6451 6007 4063 3144 7565 19919 22817 16163 6734 9996 17690 20896 32659 32164 34023
13954C4023r588m272J764L371M373l051N589J58j6495j1260O095R345N711q5M747
$$ 34023 24435 20163 21927 25298 29671 26620 32209 32367 15872 4612 10707 20052 25763 25678 30425
13939C0425N265o026m881j0635m153L051K748j179j4882p843J6523M992R020p557
$$ 30425 35690 29664 24783 14148 9995 13046 15794 14615 -267 -8110 8413 13405 22425 14868
13925A4868q128n546q209J899J0767J4297j467p919K907Q367K502q168j0490m550
$$ 14868 6740 1194 -7015 -5116 5651 19948 18481 10562 13469 21836 24338 16170 5680 1130
13911A130k03J497k569R897M385K801m761P763n943j1332k151J3252J961j3168
$$ 1130 927 2424 -145 9752 14137 16938 12177 19940 13997 2665 514 13766 15727 2559
13897B559j936M240j136K087p64R921J1779o05m206p29k20L883m487k83J329K410
$$ 2559 623 4863 3727 5814 5050 14971 26750 26145 21939 21210 20990 24873 20386 20103 21432 23842
13881B3842r569j7847m52J2622k330m457k285K542J838m912J1542N18K296j2599
$$ 23842 14273 -3574 -4026 8596 6266 1809 -476 2066 3904 -1008 10534 11052 13348 749
13867G49r437J0237Q186j1844j0008N428J2591Q790p779J998N257j469q55J771
$$ 749 -8688 1549 9735 -2109 -12117 -6689 5902 14692 6913 8911 14168 12699 11844 13615
13853A3615J7717J06j129K583L51q706J625J658r477q673m951Q31R603J1292p124
$$ 13615 31332 31438 30309 32892 33243 24537 26162 27820 18343 9670 4719 5550 15153 26445 19321
13838A9321L485n107j700Q117o426L982m488j0806p345J2513K384j2134J850m144
$$ 19321 22806 17699 15999 24116 17690 21672 17184 6378 -967 11546 13930 1796 3646 -498
13824d98j5443J0078J2770L97k975Q137l424j6471J1808J4848j0342p099J4975
$$ -498 -15941 -5863 6907 7304 4329 12466 9042 -7429 4379 19227 8885 1786 16761
13811A6761J3868P982j635J617Q803j7637j6245N819k39J879l375J2442N357k4836
$$ 16761 30629 38611 36976 38593 47396 29759 13514 19333 19094 20973 17598 30040 35397 10561
13797A0561j0046O216J1230Q774n530j5781r559J251J4980O361n881j0047j323
$$ 10561 515 6731 17961 26735 21205 5424 -4135 -2884 12096 18457 12576 2529 1206
13784A206O407q281k490R992k637M495j1927k727O008J0497J3460J4756j2570
$$ 1206 7613 -668 -3158 6834 4197 8692 -3235 -5962 46 10543 24003 38759 26189
13771B6189q644R367L501o107p769R957Q881q087q727j947l581M647k298J472
$$ 26189 17545 26912 30413 24306 16537 26494 35375 27288 18561 16614 13033 17680 15382 16854
13757A6854r505M07n021K576R27M847J150L012J977m959p371J503K3978j582j2762
$$ 16854 7349 7756 2735 5311 6238 11085 12235 15247 17224 12265 4894 6397 30375 28793 16031
13742A6031M553M531k774j3384j7637j866N387J2295o986L982j10K178P126J715
$$ 16031 20584 25115 22341 8957 -8680 -10546 -5159 7136 150 4132 4022 6200 13326 15041
13728A5041M79M489l486j777l48M668J9731j1646O734j2788k2662Q521L961k942
$$ 15041 15520 20009 16523 14746 14398 19066 38797 27151 33885 21097 -1565 6956 10917 7975
13714G975o375o069K339J2783J0583N009J040j4340J079k373p670M910Q409p449
$$ 7975 1600 -4469 -2130 10653 21236 26245 27285 12945 14024 11651 3981 8891 17300 9851
13700I851k391O085J0387R564j4793j6829K862J0266P639k654n62r100J4231O953
$$ 9851 7460 13545 23932 33496 18703 1874 4736 15002 22641 19987 19425 10325 24556 31509
13686C1509j8436L278k374o469Q423N827o927o996m757M67J9685L824n464Q0P083
$$ 31509 13073 16351 13977 7508 15931 21758 14831 7835 3078 3545 23230 27054 21590 21670 28753
13671B8753l373r406J0078M385k300j0676N561J4406J54j0295j371J6028o366
$$ 28753 25380 15974 26052 30437 28137 17461 23022 37428 37582 27287 25916 41944 35578
13658C5578p257K254j2610j2603K879J1705J2182l616j4387o167n692J355N010
$$ 35578 28321 30575 17965 5362 8241 19946 32128 28512 14125 7958 2266 3621 8631
13645H631J1355k986J53q032n808N903L905P23l191k132q37J0673J2841r85r010
$$ 8631 19986 17000 17153 9121 3313 9216 13121 13844 10653 8521 7684 18357 31198 30213 21203
13630B1203l694r642m354J0777K1149j324P672j378j8236j2473L923Q032j348
$$ 21203 17509 7867 3513 14290 35439 34115 41787 40409 22173 9700 13623 21655 20307
13617B0307O651j0328k423L207K734p512j0154j975R900K197L120k808J71P085
$$ 20307 26958 16630 14207 17414 20148 12636 2482 507 10407 12604 15724 12916 13087 20172
13603B0172n241o247N940L196l42R383Q438r653O844N803o018k0555j971J145
$$ 20172 14931 8684 14624 17820 17478 26861 35299 25646 32490 38293 32275 11720 9749 10894
13589A0894j280k992m297N137J000j363J545J953N536Q744P090j0822o189R523
$$ 10894 9614 6622 2325 7462 8462 7099 8644 10597 16133 24877 31967 21145 14956 24479
13575B4479r393m804j39K856l174K448p978r387K836M270O078k331K420O429J0679
$$ 24479 15086 10282 10143 12999 9825 12273 4295 -5092 -2256 2014 8092 5761 8181 14610 25289
13560B5289m51m437j0379M529J0559M90j231N917N364N508k12m157k0139o800
$$ 25289 24838 20401 10022 14551 25110 25600 24369 30286 35650 41158 40946 36789 16650 9850
13546I850p506M121J5278J2121N148Qj2507k4153l440R984P782K413P281k013
$$ 9850 2344 6465 21743 33864 39012 39020 26513 2360 -1080 8904 16686 19099 26380 24367
13532B4367n881J2367J9790N391k2376j4421j570p677k981R133J7848J5504p334
$$ 24367 18486 30853 50643 56034 33658 19237 17667 9990 7009 16142 33990 49494 42160
13519D2160k954p465k0050m585M392m924p723J5463N453m099j0660J700J4258
$$ 42160 39206 31741 11691 7106 11498 6574 -1149 14314 19767 15668 5008 6708 20966
13506B0966L86o153J2018J0536p556o610r661j3483Q273J0817L440Q113j0919
$$ 20966 21352 15199 27217 37753 30197 23587 13926 443 8716 19533 22973 31086 20167
13493B0167l020Q210O711n148j3870K522L722R052P836o382l291p480L885L007
$$ 20167 17147 25357 32068 26920 13050 15572 19294 28346 36182 29800 26509 19029 22914 25921
13479B5921K339k320p0M502p852Q514L263K370k1o076R359R653j0665o229l26
$$ 25921 28260 25940 25870 30372 22520 31034 34297 36667 36646 30570 39929 49582 38917 32688 32362
13464C2362q015l026O401L881l907j407O726M900m064r888M378J0581N859m390
$$ 32362 24347 21321 27722 31603 27696 26289 33015 37915 33851 23963 28341 38922 44781 40391
13450D0391q187m643j2363n493j451q152n076K564K445N415J0163p559p588P49
$$ 40391 32204 27561 15198 9705 8254 102 -4974 -2410 35 5450 15613 8054 466 1215
13436A215k425J2374j62N686J916k863J0535n91r533K632K13r09J633J0205Q139
$$ 1215 -1210 11164 11002 16688 18604 15741 26276 25685 16152 18784 18997 18088 19721 29926 38065
13421C8065l113n226j577K440j128P001O555j2308m846p949n018M794j0720J151
$$ 38065 34952 29726 28149 30589 29461 36462 43017 30709 25863 17914 12896 17690 6970 8121
13407H121k092J642R48J6258J3943l735l988N917n131j870N143l173J505k2771
$$ 8121 6029 7671 8619 24877 38820 35085 31097 37014 31883 30013 35156 31983 33488 10717
13393A0717j2470j851R901L682J8948L991p112O575j2650j133J366n721J2432
$$ 10717 -1753 -3604 6297 9979 28927 32918 25806 32381 19731 18598 19964 14243 26675
13380B6675m859J672P842J363k1699j0088N287N915J705P061r154R637N168p738
$$ 26675 21816 23488 31330 32693 10994 906 6193 12108 13813 20874 11720 21357 26525 18787
13366A8787j5623J4028k306j0210j426K969P413M263k400J2533r263o164j0272
$$ 18787 3164 17192 14886 4676 3250 6219 13632 17895 15495 28028 18765 12601 2329
13353B329k557J03J9015J2000j9782J658J7879N842j656q028q466n077n022Q289
$$ 2329 -228 -125 18890 30890 11108 12766 30645 36487 34831 26803 18337 13260 8238 16527
13339A6527R371k342M50J5304J416j195Q038j2608p959O489L350J1366k031r072
$$ 16527 25898 23556 24006 39310 40726 39531 47569 34961 27002 33491 36841 48207 46176 37104
13325C7104L427K275J800j7434o702j242O73Q946J2801Q179j351j1947p748O300
$$ 37104 40531 42806 44606 27172 20470 19228 19901 28847 41648 49827 48476 36529 28781 35081
13311C5081q544j8892K019J5271N835m176n12J03l78Q263l517p111J2651J961
$$ 35081 26537 7645 9664 24935 30770 26594 26082 26185 25807 34070 30553 23442 36093 38054
13297C8054q648r337l044j1376k388j2363o736j316O986J2267P804O138q778l789
$$ 38054 29406 20069 17025 5649 3261 -9102 -15838 -17154 -10168 2099 9903 16041 7263 3474
13283C474J3145J7088P469O237l281k991R728m60r740r535j728l28p060m831Q00
$$ 3474 16619 33707 41176 47413 44132 41141 50869 50409 40669 31134 29406 29078 22018 17187 17987
13268A7987O862N945k70o46K902j765J0296k739P945N567m546n717K787m71L77
$$ 17987 24849 30794 30524 29878 32780 31015 41311 38572 46517 52084 47538 41821 44608 44137 44514
13253D4514p188j1945J07j2415r854O679K524K3K1903M705O374L048k3727k280
$$ 44514 37326 25381 25488 13073 3219 9898 12422 12445 34348 39053 45427 48475 24748 22468
13239B2468J4208k975M193j386r921l51M287J352j422m387k501q05K569o742L444
$$ 22468 36676 33701 37894 36508 26587 26236 30523 31875 30453 26066 23565 22760 25329 18587 22031
13224B2031L580j548k873Q682Q272R694J7135M165j2838j1591o108l352n563k154
$$ 22031 25611 24063 21190 29872 38144 47838 64973 69138 56300 44709 38601 35249 29686 27532
13210B7532J5344o777r414L974k908o434l325K2847O075o198j3116j2874j645
$$ 27532 42876 36099 26685 30659 27751 21317 17992 40839 46914 40716 27600 14726 13081
13197A3081P092J3169K526n771j06M845O992j2720r285M114J5273k529l000j6821
$$ 13081 20173 33342 35868 30097 29991 34836 41828 29108 19823 23937 39210 36681 33681 16860
13183A6860j041J0547J2387k83l309K681M602l869r402N024l484k247L383M951
$$ 16860 15819 26366 38753 38470 35161 37842 42444 38575 29173 34197 30713 28466 31849 36800
13169C6800j934o000j5050j1163K4472J8495k658N6L997m544O391M70L191j0955
$$ 36800 34866 28866 13816 2653 27125 45620 42962 43018 47015 42471 48862 49332 52523 41568
13155D1568J002L609J71l676n850p617j1729K0017R756o540j7162r594M431R539
$$ 41568 42570 46179 46350 42674 36824 29207 17478 37495 47251 40711 23549 13955 18386 27925
13141B7925l012j009L683l95K452o46N79K596n011J7205Q165r087j0001o578N679
$$ 27925 24913 23904 27587 27192 29644 28998 29577 32173 27162 44367 52532 43445 33444 26866 32545
13126C2545J5509j0232j1395M005j1973m101k841J6216R423L08j5124O525N389
$$ 32545 48054 37822 26427 30432 18459 14358 11517 27733 37156 37464 22340 28865 34254
13113C4254R93n865J2552L725O653M770j6165j1805j1766K423K595O498J926Q618
$$ 34254 35247 29382 41934 45659 52312 57082 40917 29112 17346 19769 22364 28862 30788 39406
13099C9406K881p476R663o071j7332p959J5889K873o291k297J2059L095m222l121
$$ 39406 42287 34811 44474 38403 21071 13112 29001 31874 25583 23286 35345 38440 34218 31097
13085C1097J1366N771j2605P625O447K910r86o668J0001m429j1919R316p13j975
$$ 31097 42463 48234 35629 43254 49701 52611 51625 44957 54958 50529 38610 47926 47213 45238
13071D5238K07Q15N337J0055O947k0127l359J1493j230l453J3515K267j569j203
$$ 45238 45445 46260 51597 61652 68599 48472 45113 56606 55376 51923 65438 67705 66136 64933
13057F4933j5190p128l433j782Q694j2587J772Q057J687j491o904l647M382L889
$$ 64933 49743 42615 39182 37400 46094 33507 35279 43336 45023 43532 36628 32981 37363 41252
13043D1252O649o623j1771j2659r783J3710J3479J3893Q778n365r719M472m718
$$ 41252 47901 41278 29507 16848 7065 20775 34254 48147 56925 51560 41841 46313 41595
13030D1595M964J5623M288j2967j961K1757L0926M729k094j881j2166j9486p290
$$ 41595 46559 62182 66470 53503 51542 73299 104225 108954 106860 104979 92813 73327 66037
13017F6037j2919J474n361j5631j2789N466J089j178K182J051P38m092O328Q474
$$ 66037 53118 54592 49231 33600 20811 26277 27366 26188 28370 29421 30159 26067 32395 40869
13003D0869P238m756j1192J594N938K510r383q862O68K2076n40j9318Q968M504
$$ 40869 48107 43351 32159 33753 39691 42201 32818 23956 24624 46700 46160 26842 35810 40314
12989D0314m483l263j905o3K737K825N990P117J4645K1037L1830P779k4775k3604
$$ 40314 35831 32568 30663 30600 33337 36162 42152 49269 63914 84951 116781 124560 99785 76181
12975G6181j4278j1339n520O540m579j1030j678j3787M088K901J2218O172n130
$$ 76181 61903 50564 45044 51584 47005 35975 34297 20510 24598 27499 39717 45889 40759
12962D0759Q475N591L487q375p584j799p392j0425l816r49N608K8457Q208j9416
$$ 40759 49234 54825 58312 49937 42353 40554 33162 22737 18921 17972 23580 52037 60245 40829
12948D0829O946n879j1708p978j602J4909O544J926O410o704n451P283J2656J2773
$$ 40829 47775 41896 30188 22210 20608 35517 42061 43987 50397 43693 38242 45525 58181 70954
12934G0954J4497R415Pk3487j8591l034n777Q449J6646K924j4057m909N995q403
$$ 70954 85451 94866 94873 71386 52795 49761 43984 52433 69079 72003 57946 53037 59032 50629
12920E0629Q60o840L168J1549K35l500j6360k112k99J3834J0049K95j0807p026
$$ 50629 51489 44649 47817 59366 59601 56101 39741 37629 37330 51164 61213 61508 50701 43675
12906D3675O082J3725M776p427O9o349k455m673P824K906J231O037K665Q718P171
$$ 43675 49757 63482 68258 60831 60900 54551 52096 47423 55247 58153 59384 65421 68086 76804 83975
12891H3975r644j5224j1940j2324Q404J3621k376q754J2782R600k041o577O022
$$ 83975 74331 59107 47167 34843 43247 56868 54492 45738 58520 68120 66079 59502 65524
12878F5524J070r551n474k742M075o219J1606N159Q284M087l491j803q416n152
$$ 65524 66594 57043 51569 48827 52902 46683 58289 63448 71732 75819 72328 70525 62109 56957
12864E6957O833J2667q597r105K231M817J0766r050j2517m947P172Q376N282j0588
$$ 56957 63790 76457 67860 58755 60986 65803 76569 67519 55002 50055 57227 65603 70885 60297
12850F0297m396j1818o709R932P532Q56J0007q67j0447q328Q557J5344k950j250
$$ 60297 55901 44083 37374 47306 54838 55694 65701 64834 54387 46059 54616 69960 67010 65760
12836F5760l514j0918m022L684K424J673j362o545k785J3657J2650N939j1990
$$ 65760 62246 51328 47306 50990 53414 55087 53725 47180 44395 58052 70702 76641 64651
12823F4651o736N472Q150m440r035k23Q015N53j532r006M424n460P584K0727m53
$$ 64651 57915 63387 71537 67097 58062 57839 65854 66407 64875 55869 60293 54833 62417 83144 82691
12808H2691j5320j3043o115P494O780o310q76j8512j2569J1698J8427q479K306
$$ 82691 67371 54328 48213 55707 62487 56177 55301 36789 24220 35918 54345 45866 48172
12795D8172Q035N540J2840J0340n68m327L890J276k021P525N515j074j8410r988
$$ 48172 56207 61747 74587 84927 84359 80032 83922 85198 83177 90702 96217 95143 76733 66745
12781F6745Q140J538r489k571J805Q45J447o699J6029N322k235P47L213p747M310
$$ 66745 74885 76423 66934 64363 66168 67013 68460 61761 77790 83112 80877 81624 84837 77090 81400
12766H1400r564o926j420J777o365o577k19J8736J2298r848r531r763m344M638
$$ 81400 71836 64910 63490 65267 58902 52325 52106 70842 83140 73292 63761 53998 49654 54292
12752E4292P472q594O863J0n469p162K629M939P069K561K085J540K561R819O597
$$ 54292 61764 53170 60033 60043 54574 47412 50041 54980 62049 64610 66695 68235 70796 80615 87212
12737H7212r566l985P615j1772m741O86k0Q157Q311J2291P223j4218j7250j0201
$$ 87212 77646 73661 81276 69504 64763 65449 65429 73586 81897 94188 101411 87193 69943 59742
12723E9742m163R511N449p707P5o070k29K959Q595J3204M708J316j2989n042N422
$$ 59742 55579 65090 70539 62832 62907 56837 56608 59567 68162 81366 86074 87390 74401 69359 74781
12708G4781R198J0131j936j0289m354N406j0067n291O892R137m614M923k536l543
$$ 74781 83979 94110 92174 81885 77531 82937 72870 67579 74471 83608 78994 83917 81381 77838
12694G7838N617n398r698o785K008R686J7626P986j0722k249k330O276j841j145
$$ 77838 83455 78057 68359 61574 63582 73268 90894 98880 88158 85909 83579 89855 88014 86869
12680H6869J8751l594k879K763j874J24L326J807r942r399K130j176P589j1116
$$ 86869 105620 102026 99147 101910 100036 100160 103486 105293 95351 85952 88082 86906 94495 83379
12666H3379o757J0958K990p16j076p752o886j3227p494R376J6010Q644n928J725
$$ 83379 76622 87580 90570 89854 88778 81026 74140 60913 53419 62795 78805 87449 81521 83246
12652H3246M641j3989j1345R589P275O305J511o45j5816j2331r38M35P917L845
$$ 83246 87887 73898 62553 72142 79417 85722 87233 86588 70772 58441 57503 57938 65855 69700
12638F9700J2691J1962O753P10o43M681p270p262r254o224l611J750R488l06J1545
$$ 69700 82391 94353 101106 101816 101173 105854 98584 91322 82068 75844 72233 73983 83471 83165 94710
12623I4710j753J456l705r375k466P162J9574J0259n806j3305m660k737j1732
$$ 94710 92957 94413 90708 81333 78867 86029 105603 115862 110056 96751 92091 89354 77622
12610G7622K005k735J4490J0224n725j7788l56J5334R096Q125o226o973M691k488
$$ 77622 79627 76892 91382 101606 95881 78093 77737 93071 102167 110292 104066 97093 101784 99296
12596I9296j2443J0546J3875R777J55j0509j5696M127J1591r941m780K02j3574
$$ 99296 86853 97399 111274 121051 121206 110697 95001 99128 110719 100778 95998 96200 82626
12583H2626Q863J7458j0357j2855Q381J925P17k780J4945J505r248n898R794O822
$$ 82626 91489 108947 98590 85735 94116 96041 96758 93978 108923 110428 101180 95282 105076 111898
12569A11898J434O377o032j1373n615o145J9364q07N181O150n592Q032O626J316
$$ 111898 113332 119709 113677 102304 96689 90544 109908 109101 114282 120432 114840 122872 129498 130814
12555A30814J38l180j1697j3041P856J0015O019Q85R435n261j1941j1801n589
$$ 130814 130952 127772 116075 103034 110890 120905 126924 127809 137244 131983 120042 108241 102652
12542A02652o10M635J886J0817N432m003l403n18l942q410J1712Q664M666m754
$$ 102652 102042 106677 108563 119380 124812 120809 117406 116888 112946 104536 116248 124912 129578 124824
12528A24824r070r000K723Q709O619j1464J67j897l745J1182J9787J4334n08m942
$$ 124824 115754 106754 109477 118186 124805 113341 113508 111611 107866 119048 138835 153169 152661 147719
12514A47719j0614m910l69m676j0876n759k722J3575J3481N460j1678j6796P592
$$ 147719 137105 132195 131826 127150 116274 110515 107793 121368 134849 140309 128631 111835 119427
12501A19427J0440l105l3o709j2872j348m428l274J146J3952O391R16L853J3779
$$ 119427 129867 126762 126729 120020 107148 105800 101372 98098 99244 113196 119587 120503 124356 138135
12487A38135R248J376l507j0714J365P063M996J2224j016n522q745J2600N511
$$ 138135 147383 148759 145252 134538 135903 142966 147962 160186 159170 153648 144903 157503 163014
12474A63014r754k1743j7651M598J1764k943j3197J0748N130l989J1546Q103R45
$$ 163014 153260 131517 113866 118464 130228 127285 114088 124836 129966 125977 137523 145626 146571
12461A46571k619n510L567M697O843l775r318K547l644P379M752L209q431o799
$$ 146571 143952 138442 142009 146706 153549 149774 140456 143003 139359 146738 151490 154699 146268 139469
12447A39469o20L508J6622J7340o560j0846k2289o872K992j0154J1696J302O77
$$ 139469 138849 142357 158979 176319 169759 158913 136624 129752 132744 122590 134286 135588 136265
12434A36265K1296K565o619l278N33J4050P634j376l081p262j206J064R100P447
$$ 136265 157561 160126 153507 150229 150762 164812 172446 171070 167989 160727 159521 160585 169685 177132
12420A77132N507l467O322P4j3127j2524j0362p419j9387K7K1617J4944Q58n322
$$ 177132 182639 179172 185494 185568 172441 159917 149555 142136 122749 122776 144393 159337 160195 154873
12406A54873N743P051j0244l952L520J3487N117k230L39M030K826K986j976j5096
$$ 154873 160616 167667 157423 153471 156991 170478 175595 173365 173704 177734 180560 183546 181570 166474
12392A66474j640j267l132R066N332j6584N147O830O554J082L165J6347j289j4459
$$ 166474 164834 163567 160435 169501 174833 158249 163396 170226 176780 177862 181027 197374 196085 181626
12378A81626P890o161j2911J0428O395j2018j5907J3442K0579N363j0177j948
$$ 181626 189516 183355 170444 180872 187267 175249 159342 172784 193363 198726 188549 186601
12366A86601l097q378r035J0283Q260m510O654K1330j3486r904N5M452O227J1908
$$ 186601 183504 175126 166091 176374 184634 180124 186778 208108 194622 184718 184773 189225 195452 207360
12352B07360q350m906K279P867o025l10J1933l433n928K968m222O474m994j086
$$ 207360 199010 194104 196383 204250 198225 197915 209848 206415 200487 203455 199233 205707 200713 199627
12338A99627J3051J1392O763J573j0079J838j577l526j2504N686R496r59l005
$$ 199627 212678 224070 230833 232406 222327 224165 222588 219062 206558 212244 221740 220781 217776
12325B17776n520n680p415J0687j719P549J1384j4475o249J2822l336j5716j1183
$$ 217776 212256 206576 199161 209848 208129 215678 227062 212587 206338 219160 215824 200108 188925
12312A88925M704Q191J496J7231J1466n424m183J496l599k88j6038l024J4218
$$ 188925 193629 201820 203316 220547 232013 226589 222406 223902 220303 220015 203977 200953 215171
12299B15171R692L423L844J3649J6717qk881Q589j9683j8964j095K836J511N541
$$ 215171 224863 228286 232130 245779 262496 262488 259607 268196 248513 229549 228454 231290 232801 238342
12285B38342K620m19J880m58p093n517l636J6892p357n072j768L565J3212N754
$$ 238342 240962 240543 242423 241965 234872 229355 225719 242611 235254 230182 228414 231979 245191 250945
12271B50945n117P156k447j0182l509M586N674m499o35Q525k4K148J9678j833
$$ 250945 245828 252984 250537 240355 236846 241432 247106 242607 241972 250497 250473 252621 272299 270466
12257B70466J054k654p903Q174P597m949m064J7310j455r693J1228p646j2109
$$ 270466 271520 268866 260963 269137 276734 271785 267721 285031 283576 273883 285111 277465 265356
12244B65356k483O456N490j0752p159Q554J057K741l828n743J8228J0507m10R83
$$ 265356 262873 269329 274819 264067 256908 265462 266519 269260 265432 259689 277917 288424 288014 288997
12230B88997j435n043n830J3753l677J971J5711M546q037q527Q279j1123j2455
$$ 288997 287562 282519 276689 290442 286765 288736 304447 308993 300956 292429 300708 289585 277130
12217B77130Q965P989P579k898m693Q066L274m003l756n321J076R58L608r2L647
$$ 277130 286095 294084 301663 298765 294072 302138 305412 301409 297653 292332 293408 294366 297974 297882 301529
12202C01529k878J403j6000r76J3735O603R206J0721L51m321L501Q342j8674j1362
$$ 301529 298651 300054 284054 283078 296813 303416 312622 323343 323694 319373 322874 331216 312542 301180
12188C01180J8699J1866j916Q807k721l0034M242K3787K5345k838j7616n957j312
$$ 301180 319879 331745 329829 338636 335915 305881 310123 333910 359255 356417 338801 332844 331532
12175C31532k728J7253M312j0151J338M796L680R931R303r124j7823l043P675
$$ 331532 328804 346057 350369 340218 341556 346352 350032 359963 369266 360142 342319 339276 346951
12162C46951O122j5820J975K5517k608o469m381j0869Q652J5549k720r474P063
$$ 346951 353073 337253 339228 364745 362137 355668 351287 340418 349070 364619 361899 352425 359488
12149C59488P244N58l949j0726q0N806P353o86N396K872l057K05J0624r189j6839
$$ 359488 366732 367290 363341 352615 352535 358341 365694 365008 370404 373276 370219 370424 381048 371859 355020
12134C55020K633J6524p127j8173o527N674J7858J1712q855l618P74r50N136Q293
$$ 355020 357653 374177 367050 348877 342350 348024 365882 377594 368739 365121 365895 364945 370081 378374
12120C78374j0119l072L982J1768K265j6857o330k020Q628J5193J1217J5956P261
$$ 378374 368255 365183 369165 380933 383198 366341 360011 357991 366619 381812 393029 408985 416246
12107D16246m798N880l911j8173j1849J4702J0067l823R96J2429j337O729J1178
$$ 416246 411448 417328 413417 395244 383395 398097 408164 404341 405337 417766 416429 423158 434336
12094D34336k995k286q210m736r370l127O856m97p121p936M457J1927L075o339
$$ 434336 431341 429055 420845 416109 406739 403612 410468 409971 402850 394914 399371 411298 414373 408034
12080D08034n525N123J5002P763j911m298M508l09L284k731J0454N959j5869J040
$$ 408034 402509 407632 422634 430397 428486 424188 428696 428387 431671 428940 439394 445353 429484 430524
12066D30524Q949P5K036M727q29j2391m337R109M110q62m28p138l66R733P224
$$ 430524 439473 439548 441584 446311 445482 433091 428754 437863 441973 441111 440683 433545 433179 442912 450136
12051D50136l581K629K085r923o368M890J0163L2P6J2031n582k975R00j3192m08
$$ 450136 446555 449184 451269 441346 434978 439868 450031 450063 450139 462170 456588 453613 454513 441321 440913
12036D40913K1309p20k321K698J5995J1793p189j0279J0708j932o606J285J96
$$ 440913 462222 461502 459181 461879 477874 489667 482478 472199 482907 480975 474369 475654 475850
12023D75850q293J829m586p102n089j1239j315m912Q357J4070J1774m165j760
$$ 475850 467557 469386 464800 457698 452609 441370 440055 435143 443500 457570 469344 465179 463419
12010D63419m807N644J0269K991q895J120P797Q748m81l118Q536J5261j558M96
$$ 463419 458612 464256 474525 477516 468621 469741 477538 486286 485805 482687 491223 506484 504926 505422
11996E05422n051j4557m398K874J3989J690k2115k473K2413J558N573j383r569
$$ 505422 500371 485814 481416 484290 498279 499969 477854 475381 497794 499352 504925 503542 493973
11983D93973j1348n571N118K516R224P907Q616R732j740o250j948j2140j599p036
$$ 493973 482625 477054 482172 484688 493912 501819 510435 520167 518427 512177 510229 498089 496490 489454
11969D89454P329J1650L431r992P58p102q457Q174l332j021j1758n697J2632N984
$$ 489454 496783 508433 511864 501872 502630 495528 487071 495245 491913 490892 479134 473437 486069 492053
11955D92053o38r871l034l727J1306J0546J987M515k135pM3j0896K047J689l483
$$ 492053 491415 481544 478510 474783 486089 496635 498622 503137 501002 500995 501038 490142 492189 493878 490395
11940D90395J4771L19J169K942N132n014N255J531r470r153L334Q56J949m84o481
$$ 490395 505166 505485 506654 509596 514728 509714 514969 516500 507030 497877 501211 502067 504016 503532 497051
11925D97051J899M159J156L875J1953j2734K389J862J118j1407n778L088J2456
$$ 497051 498950 503109 504265 508140 520093 507359 509748 511610 512728 501321 495543 498631 511087
11912E11087O561p836q441o061J0151N705J664j4373K97O969m091L020R163P059
$$ 511087 517648 509812 501371 495310 505461 511166 512830 498457 498754 505723 501632 504652 513815 520874
11898E20874l041j0118l441l628J729j1349o186j1054J16J0667P053r913J248
$$ 520874 517833 507715 504274 500646 502375 491026 484840 473786 473902 484569 491622 481709 482957
11885D82957J2594K318k4385m98J1699N760N998j5991j5943r422n408L822J1678
$$ 482957 495551 497869 473484 472986 484685 490445 496443 480452 464509 455087 449679 453501 465179
11872D65179Q779k256K944j611M530N152j5092J2599J1966j5938j1989P830J241
$$ 465179 473958 471702 474646 473035 477565 482717 467625 480224 492190 476252 464263 472093 473334
11859D73334l027N740K0587J6606K266j4448k9402j6275M516J0455k663n513J1607
$$ 473334 470307 476047 496634 513240 515506 501058 471656 455381 459897 470352 467689 462176 473783
11846D73783l49j3417j740Q387M555L961L049j6876k7329p997J3099K0226Q14
$$ 473783 473434 460017 458277 466664 471219 475180 478229 461353 434024 426027 439126 459352 460166
11833D60166n811j32j0987K18J311n57m1M663L058m754o207P252l480r641N978
$$ 460166 454355 454223 443236 443454 444765 444208 444167 448830 451888 447134 440927 448179 444699 435058 441036
11818D41036j1444m180J2377J0301l214r913J0689L072K26Q856j394j4905j6655
$$ 441036 429592 425412 437789 448090 444876 434963 445652 448724 448950 457806 456412 441507 424852
11805D24852j6377J226Q284L217m109N307O900P527k308j2632j4832k637M501
$$ 424852 408475 409701 417985 421202 417093 422400 429300 436827 434519 421887 407055 404418 408919
11792D08919P828K212l4o38J1975n214r598k1723L538J3783Q661o462j0449m046
$$ 408919 416747 418959 418925 418287 430262 425048 415450 393727 397265 411048 419709 413247 402798 398752
11778C98752J553M625k779M495J0318K011l274R20q367L697L845o189L045N529
$$ 398752 400305 404930 402151 406646 416964 418975 415701 416621 408254 411951 415796 409607 412652 418181
11764D18181j6261l765l050K877j5439p157j221j192M052p983j4055N392K538
$$ 418181 401920 398155 395105 397982 382543 375386 374165 372973 377025 369042 354987 360379 362917
11751C62917K089L355o009M344K329j1385J3832J1327p182K999N508j2502k085
$$ 362917 365006 368361 362352 366696 369025 357640 371472 382799 375617 378616 384124 371622 369537
11738C69537o137j6900k570O992K481j122M133j3962O963p986M915L478q64n554
$$ 369537 363400 346500 343930 350922 353403 352281 356414 342452 349415 341429 346344 349822 348958 343404
11724C43404R160N524p109j7596k653J7281o18r674r189J563O608j4424j6653
$$ 343404 352564 358088 350979 333383 330730 348011 347393 337719 328530 330093 336701 322277 305624
11711C05624J0411q443J0005J2208N230O972q48n455K773m435j2076N527K243
$$ 305624 316035 307592 317597 329805 335035 342007 341159 335704 338477 334042 321966 327493 329736
11698C29736m377o464j76K302j216Q88j809n12k305j107n179m360l348p547L235
$$ 329736 325359 318895 318719 321021 319805 320693 318884 318372 316067 314960 309781 305421 302073 294526 297761
11683B97761j3680r074J1937J842O542J4685O033j1893j5089n381L650R785Q527
$$ 297761 284081 275007 286944 288786 295328 310013 316046 304153 289064 283683 287333 297118 305645
11670C05645j108O900l904p531j2932j167o402O103M878n968R494j3484r960M037
$$ 305645 304537 311437 307533 300002 287070 285903 279501 285604 290482 284514 294008 280524 270564 274601
11656B74601l400j2695P147J0370N477L047r257n889J374P576p374k164P635j364
$$ 274601 271201 258506 265653 276023 281500 284547 275290 269401 270775 278351 270977 268813 276448 275084
11642B75084l796K615J057k851K055j2202j417J1338P989j155m802k0098J357
$$ 275084 271288 273903 274960 272109 274164 261962 260545 271883 279872 278717 273915 253817 255174
11629B55174J4409n362j2440K43P067L624p111j664j0197j2948o35J3952O511
$$ 255174 269583 264221 251781 252024 259091 262715 255604 253940 243743 230795 230160 244112 250623
11616B50623p914l468L993k31o299N65M300p88M738P251q440j4010J3146R433
$$ 250623 242709 239241 243234 243003 236704 237269 241569 240781 245519 252770 244330 230320 243466 252899
11602B52899r378M23n480n443J1541p86j4297L488R143k788J149K979r679J2052
$$ 252899 243521 243944 238464 233021 244562 243776 229479 232967 242110 239322 240471 243450 233771 245823
11588B45823k92j5453k4084p099N985n545P751J4439P841M235J2441Q931k342
$$ 245823 245531 230078 205994 198895 204880 199335 207086 221525 229366 233601 246042 254973 252631
11575B52631q290j1342j2952o323k191o998O63l516Q35Q610J682R294M141j1355
$$ 252631 244341 232999 220047 213724 211533 204535 205198 201682 202517 211127 212809 222103 226244 214889
11561B14889j0875n59L050n034K110Q672k538q21L430l630R779N100j2858m865
$$ 214889 204014 203455 206505 201471 203581 212253 209715 208894 212324 208694 218473 223573 210715 205850
11547B05850J0834l783J300m181o070L104m612p246K437N188J554J1537l719j4619
$$ 205850 216684 212901 214201 210020 203950 207054 202442 195196 197633 202821 204375 215912 212193 197574
11533A97574m757Q400R341j3891J329j79L069j891L598j8750n747l968J7961L198
$$ 197574 192817 201217 210558 196667 197996 197817 200886 198995 202593 183843 178096 174128 192089 195287
11519A95287j2055j0813k879J2419J0137O125R698j3431k0920l432J348J4218
$$ 195287 183232 172419 169540 181959 192096 198221 207919 194488 173568 170136 171484 185702
11507A85702r02j1278J505o669N151M852p345l437O480M680Q878K921q298j1573
$$ 185702 184800 173522 175027 168358 173509 178361 171016 167579 174059 178739 187617 190538 182240 170667
11493A70667k0374j5077j867J433O354R596J3783K01j6390K323K0155J056l973
$$ 170667 150293 135216 133349 134782 141136 150732 164515 164716 148326 150649 170804 171860 167887
11480A67887m418j1071K848J3934j632m116m87k387K401K455o936j3322P524Q561
$$ 167887 163469 152398 155246 169180 167548 163432 162945 160558 162959 165414 158478 145156 152680 161241
11466A61241k442o557j8839j297R327M722j216k2304J3633J3295K006j387N964
$$ 161241 158799 152242 133403 132106 141433 146155 144939 122635 136268 149563 151569 150182 156146
11453A56146l782p595m535O419R294K144O528l666l767q642m098r690q242m58
$$ 156146 152364 144769 140234 146653 155947 158091 164619 160953 157186 148544 144446 134756 126514 126056
11439A26056N806L669j3538j097m01j539L037R057M507L098O683R185l175Q566
$$ 126056 131862 135531 121993 120896 120495 118956 121993 131050 135557 138655 145338 154523 151348 159914
11425A59914p128O77k180L876p802m542l993N140K1321N468j2692j1065M137l945
$$ 159914 152786 153463 151283 155159 147357 142815 138822 143962 165283 170751 158059 146994 151131 147186
11411A47186n885k527J422l832J600J3393q274j2419o748M42J2390J4861l485
$$ 147186 141301 138774 140196 136364 137964 151357 143083 130664 123916 124358 136748 151609 148124
11398A48124j4440j882L146j1194Q420J2614j396o968m453j2392j5053j0621J0106
$$ 148124 133684 131802 134948 123754 132174 144788 143392 136424 131971 119579 104526 93905 104011
11385A04011J7587P032J398j0355K251L572O099n113m478j618J0727P846K860
$$ 104011 121598 128630 130028 119673 121924 125496 131595 126482 122004 120386 131113 138959 141819
11372A41819j3129j5841K401P592p119q22J3125j3095j0467J0962p00k69K18O44
$$ 141819 128690 112849 115250 122842 115723 114901 128026 114931 104464 115426 114726 114457 114675 115319
11358A15319q860k406O516j908J260l730J2037k844j616K220J3809J3528n628
$$ 115319 106459 104053 110569 108661 109921 106191 118228 115384 113768 115988 129797 143325 137697
11345A37697m259o59j7751m353M824J049j874k765J0790O438l732J401Q623j0463
$$ 137697 133438 132779 115028 110675 115499 116548 114674 111909 122699 129137 125405 126806 135429 124966
11331A24966j1804M406J0760N655p100o493J648l588m237L221M409J137q76M669
$$ 124966 113162 117568 128328 133983 126883 120390 122038 118450 114213 117434 121843 122980 122104 126773
11317A26773p420j9771m70J1731J4313K612j5249j2075j2786l958N635N332R774
$$ 126773 119353 99582 99112 110843 125156 127768 112519 100444 87658 83700 89335 94667 104441
11304A04441O368n981N181K339R624J3951j2062n594Q567m978p824K775k855j452
$$ 104441 110809 104828 110009 112348 121972 135923 123861 118267 126834 121856 114032 116807 113952 112500
11290A12500K833j2171r365P627J1857J2037m623j2911O863N739r077n305L562
$$ 112500 115333 103162 93797 101424 113281 125318 120695 107784 114647 120386 111309 106004 109566
11277A09566j0084o80M986Q875J1755O615k819m651k917j1691m091o020P777O914
$$ 109566 99482 98802 103788 112663 124418 131033 128214 123563 120646 108955 104864 98844 106621 113535
11263A13535O865l296o815j2551n970N287N869R223J5833N886m634j0174m313
$$ 113535 120400 117104 110289 97738 91768 97055 102924 112147 127980 133866 129232 119058 114745
11250A14745j4041p365j686J216K94P263P242l855j207n222P830O741j809L006
$$ 114745 100704 93339 91653 92869 93163 100426 107668 103813 102606 97384 105214 111955 110146 113152
11236A13152M487M460k81k0687r586j424J334q51L632J8376K726k222o509p689
$$ 113152 117639 122099 121818 101131 91545 90121 91455 90604 94236 112612 115338 113116 106607 98918
11222I8918l975J0175J3221Q16j7420r377L608n41q491J246Q996K267K639k786
$$ 98918 94943 105118 118339 119155 101735 92358 95966 95425 86934 88180 97176 99443 102082 99296
11208I9296P716J132k049R117j307r235L79M711J048M598N253Q706m819J4112
$$ 99296 107012 108144 106095 115212 113905 104670 105049 109760 110808 115406 120659 129365 124546 138658
11194A38658j086N718K980Q471k40R508Q014J0029K6546K0522J2198L5261N3521
$$ 138658 137572 143290 146270 154741 154501 164009 172023 182052 208598 229120 241318 276579 330100
11181C30100N2670O4368J11013J63423K26327K64500K14852Q8811l8775j61924
$$ 330100 382770 447138 558151 721574 947901 1212401 1427253 1516064 1477289 1315365
11171A315365k24908k39076j95733j39599j02869p5445m7604m2998k4561k88k2860
$$ 1315365 1090457 851381 655648 516049 413180 337735 290131 247133 222572 222284 199424
11160A99424k2764j3429j7628r975R193q570j3598r006N290M414P966m120K218
$$ 199424 176660 163231 145603 135628 144821 136251 122653 113647 118937 123351 131317 127197 129415
11147A29415m581n474n457r142q91p282j0256k72Q178n94j51O020O415K26q286
$$ 129415 124834 119360 113903 104761 103870 96588 86332 86060 94238 93644 93493 99513 105928 106154 97868
11132I7868j1513M168Q519l207l178M021M157m223l804j347L267R287NJ816q602
$$ 97868 86355 90523 99042 95835 92657 96678 100835 96612 92808 91461 94728 104015 104020 105836 97234
11117I7234o122j5846n278J0649J1350j3807Q052J6261J496L919J097M459J7390
$$ 97234 91112 75266 69988 80637 91987 78180 86232 102493 103989 107908 109005 113464 130854
11104A30854O159L074L427n100n246k195J0854K681k450K807J2342L7982L2158
$$ 130854 137013 140087 143514 138414 133168 130973 141827 144508 142058 144865 157207 195189 227347
11091B27347K9676L8753O0439R0819J53781K24863K99919L18589K23714M3632
$$ 227347 257023 295776 356215 447034 600815 825678 1125597 1444186 1667900 1711532
11081A711532j71520k86754l09020k60734j68165q3960o3102m5208m0106k0897
$$ 1711532 1540012 1253258 944238 683504 515339 431379 368277 323069 282963 262066
11071B62066k9609k1502j9656q741n825J871J5671M320Q729o970j9869j2376n382
$$ 262066 232457 210955 191299 182558 176733 178604 194275 198595 207324 200354 180485 168109 162727
11058A62727j9006j1503N458l256p644N040Q253j4548j7136N139R00P714K0540
$$ 162727 143721 132218 137676 134420 126776 131816 140069 125521 108385 113524 114424 122138 142678
11045A42678J1935K510J0949P555L548p012m363L47m273r483M799J3977K6899
$$ 142678 154613 157123 168072 175627 179175 172163 167800 168147 163874 154391 159190 173167 200066
11032B00066N053K39K850J5583M93j1145k1853J0239J8507K0723N0021N5939N1753
$$ 200066 205119 205358 208208 223791 224284 213139 191286 201525 220032 240755 290776 346715 398468
11019C98468K9688k171k0878l5839l8631n6941k5743j5857j1131j0170p598j650
$$ 398468 428156 425985 405107 369268 330637 273696 247953 232096 220965 210795 203197 201547
11007B01547O368R60n038j3313k0259j2660J130n654m671J0314J335k2798j4695
$$ 201547 207915 208875 203837 190524 170265 157605 158735 153081 148410 158724 160059 137261 122566
10994A22566j5404j0950k204J660L755N374L985j181J1670J2443R35j2505j511
$$ 122566 107162 96212 94008 95668 99423 104797 108782 107601 119271 131714 132649 120144 118633
10981A18633P444j331J5822K233M819L463j2138n664J387q342k1209j0779J554
$$ 118633 126077 124746 140568 142801 147620 151083 138945 133281 134668 126326 105117 94338 95892
10968I5892Q794j6916j1217J0617R15M813J9488Q018J2348J4603K933k981J105
$$ 95892 104686 87770 76553 87170 88085 92898 112386 120404 132752 147355 150288 147307 148412
10955A48412K1107K5524j4500Q528J6592J9118N726j179j8626j3256k73P273j1508
$$ 148412 169519 195043 180543 189071 205663 224781 230507 229328 210702 197446 197173 204446 192938
10942A92938j3969l807q350k127j2347P194K4037L8179M6360M8532L4040K5689
$$ 192938 178969 175162 166812 164685 152338 159532 183569 221748 268108 316640 350680 376369
10930C76369J3842k9005m4722m0103m7090l8233k1731j4387q461J9494K9974J9940
$$ 376369 390211 361206 316484 276381 229291 191058 169327 154940 146479 165973 195947 215887
10918B15887K3174O417J1246J5915j0521k6790j2341l164L573J930n789N9o047
$$ 215887 239061 245478 256724 272639 262118 235328 222987 219823 223396 225326 219537 219596 213549
10905B13549J749N66k169M332J4143J0403K1529K3700L1951N0159P1161R1943
$$ 213549 215298 215864 213695 218027 232170 242573 264102 287802 319753 369912 441073 533016
10893E33016J17063Q3223J7900m8984q2093q7878o1392m6075n1923l4478k2777
$$ 533016 650079 733302 751202 702218 620125 532247 470855 424780 372857 338379 315602
10882C15602j6302k4603j5347k699o780P355M638n711J7220L0892R960j0933q43
$$ 315602 299300 274697 259350 256651 249871 257226 261864 256153 273373 304265 314225 303292 302449
10869C02449J7453J0862O844J1214J4846R320J3011J870O920J1285m322q620J1660
$$ 302449 319902 330764 337608 348822 363668 372988 385999 387869 394789 406074 401752 393132 404792
10856D04792O309J7017J7425J0567J872q725j6342p680O034J3697M313J9122K1591
$$ 404792 411101 428118 445543 456110 457982 449257 432915 425235 431269 444966 449279 468401 489992
10843D89992J2228M66J058j332p331j7457j923N840J7353K5006K7568M6727M7468
$$ 489992 502220 502686 503744 502412 495081 477624 475701 481541 498894 523900 551468 598195 645663
10830F45663L7857O177R438J7379J1888K1179J5803J1224K0041K5585J3370L0287
$$ 645663 683520 689697 699135 716514 728402 749581 765384 776608 796649 822234 835604 865891
10818H65891L9341M1907L8483K8296M4844M9958O0905N2489O7379R1652J29296
$$ 865891 905232 947139 985622 1013918 1058762 1108720 1169625 1222114 1289493 1381145 1510441
10807A510441J61769K14569J90099J53674P0460Q380J4402M6145P2612Q5498Q9853
$$ 1510441 1672210 1886779 2076878 2230552 2301012 2309392 2323794 2369939 2442551 2528049 2617902
10796B617902J21494J62704K20174K75198L35078M24326N10375N71966N41877
$$ 2617902 2739396 2902100 3122274 3397472 3732550 4156876 4667251 5239217 5781094
10787E781094M36218L22878K64526L12607M62677O74486R04545J157972J448391
$$ 5781094 6217312 6540190 6804716 7117323 7580000 8254486 9159031 10317003 11765394
10778A1765394J805699K291558K952285L917289N313921P431992J0731944J5855550
$$ 11765394 13571093 15862651 18814936 22732225 28046146 35478138 46210082 62065632
10770F2065632K3363887L3335872M3998712N0268273M3938525K1269716o565509
$$ 62065632 85429519 118765391 162764103 213032376 256970901 278240617 271675108
10763B71675108l4771966m7938258m7003640l7706264k7237245j8850424j3045776
$$ 271675108 236903142 188964884 141961244 104254980 77017735 58167311 45121535
10756D5121535r217331o702751n032623l853442k974128k325748j851387j485552
$$ 45121535 35904204 29201453 24168830 20315388 17341260 15015512 13164125 11678573
10748A1678573j219321r95161p94499o08126m80604l45765k63828l09326m03116
$$ 11678573 10459252 9464091 8669592 8061466 7580862 7235097 6971269 6661943 6258827
10739F258827n02224n61915n37450m66090m07329l19497k50880k03232j60641
$$ 6258827 5756603 5194688 4657238 4191148 3783819 3464322 3213442 3010210 2849569
10730B849569j28508j00422o5506n5444n2844m8562l2963l4691m5199r493J6499
$$ 2849569 2721061 2620639 2555133 2499689 2446845 2398283 2365320 2330629 2285430 2275937 2292436
10719B292436J3209J1926J1841L2142O0847N8699P1979Q7080P8625O6299P1248
$$ 2292436 2305645 2317571 2329412 2361554 2422401 2481100 2553079 2640159 2718784 2785083 2856331
10708B856331Q9703J09246J47464K12868K88236L61750M77621N73162N71595M46008
$$ 2856331 2946034 3055280 3202744 3415612 3703848 4065598 4543219 5116381 5687976 6133984
10698F133984L17332K11634K41150M18421O78722R83321J294338J669367K032215
$$ 6133984 6451316 6662950 6904100 7322521 8001243 8984564 10278902 11948269 13980484
10689A3980484K373382K863908L664081N128113P662877J1926634J8770542K9133764
$$ 13980484 16353866 19217774 22881855 28009968 35672845 47599479 66370021 95503785
10681I5503785M2972288N7134910O2212831M2831907Q581751k9860728n5650003
$$ 95503785 138476073 195610983 257823814 300655721 309237472 279376744 223726741
10674B23726741n9006594m8197306l3899485k2342120j4570492r685236o637533
$$ 223726741 164720147 116522841 82623356 60281236 45710744 36025508 29387975
10667B9387975m790584l695497k983352k517517k105058j702128j351961j062937
$$ 29387975 24597391 20901894 17918542 15401025 13295967 11593839 10241878 9178941
10659I178941p90153n64018l94724k98984l51058m78471o38461o79218o10308
$$ 9178941 8388788 7824770 7430046 7131062 6780004 6301533 5663072 4983854 4373546
10650D373546m85494l84690l16297k87815k47421k03529j76885j62331j33162
$$ 4373546 3888052 3503362 3187065 2899250 2651829 2448300 2271415 2109084 1975922
10641A975922j10506r4015q5526m7553m0405k3607o661K045n774j5660L913p762
$$ 1975922 1865416 1771401 1685875 1638322 1597917 1574310 1567649 1569694 1563920 1548260 1552173 1544411
10629A544411k929M304K1771J3197K0756O5225P7839J13527J81218K79278M00988
$$ 1544411 1541482 1545786 1567557 1580754 1601510 1666735 1744574 1858101 2039319 2318597 2719585
10618B719585N54410P61405R19334R69665P83075L37454j27812l63423l40709
$$ 2719585 3273995 4035400 4954734 5924399 6707474 7044928 6917116 6553693 6212984
10609F212984j55483J35703N17814R50316J446238J911559K046843J439138K09260
$$ 6212984 6057501 6193204 6711018 7661334 9107572 11019131 13065974 14505112 14714372
10600A4714372r09723j383842j251485p68172j64059M95513J208808J945139K517664
$$ 14714372 13804649 12420807 11169322 10401150 10237091 10732604 11941412 13886551 16404215
10591A6404215K500464J441097m36285k011926k566249k287657j635245r11032
$$ 16404215 18904679 20345776 19909491 17897565 15331316 13043659 11408414 10497382
10583A0497382k17150M12541R59290J354218J267255M50463q06020j754745k014011
$$ 10497382 10280232 10692773 11652063 13006281 14273536 14723999 13917979 12163234 10149223
10574A0149223j740604j251880p55079l62642r812K44361L63909K63182r8205
$$ 10149223 8408619 7156739 6401660 6039018 6029206 6273567 6637476 6900658 6802453
10565F802453n62584r08267r98680q86766p04058n25999l88400l00577k20963
$$ 6802453 6239869 5331602 4332922 3446156 2742098 2216099 1827699 1527122 1306159
10556A306159j77732j54892j40131j14018r2891n5482l3264k6591p482p80k383
$$ 1306159 1128427 973535 833404 719386 626495 571013 537749 511158 503676 502896 500513
10545E00513j1288k934j6356j7399j0784j3940k5374k2034k3934j8785j6567l006
$$ 500513 489225 486291 469935 452536 441752 427812 402438 380404 356470 337685 321118 318112
10533C18112q708j3506k1101m634j0466o874j9312j4611N525J2615K2964K8995
$$ 318112 309404 295898 274797 270163 259697 252823 233511 218900 224425 237040 260004 288999
10521B88999K3599K7545j2953j8841o333j777l281k6139k1374k2107K850J5482
$$ 288999 312598 340143 327190 308349 302016 300239 296958 270819 249445 227338 230188 245670
10509B45670j098p723J716j5038k8482k1041k3828J357j0464P412P766O691K208
$$ 245670 244572 236849 238565 223527 195045 174004 150176 151533 141069 148481 156247 162938 165146
10496A65146j2454o189J0212p128j3081j1153r12J9702O862p220O788J0056k989
$$ 165146 152692 146503 156715 149587 136506 125353 124441 144143 151005 143785 150573 160629 157640
10483A57640r29J5592P043Q825K561k277j2551R232J2936m061q372l0187j8194
$$ 157640 156711 172303 179346 188171 190732 188455 175904 185136 198072 194011 185639 155452 137258
10470A37258j953m236j7157m561L09j5636o984N846M410m838J330J1067J98M05
$$ 137258 135305 131069 113912 109351 109660 94024 87040 92886 97296 92458 93788 104855 105053 105458
10456A05458J0725J4811K5730K3461Q920k788r368j5367j8784n980Q722j6109
$$ 105458 116183 130994 156724 180185 189105 186317 176949 161582 142798 136818 145540 129431
10444A29431q927j9214M732O428p520N635L513Q241Q459q352J1876M189k3449
$$ 129431 120504 101290 106022 112450 104930 110565 114078 122319 130778 122426 134302 138491 115042
10431A15042r556p004l205J990J495O014Q845p74r874l067R361O115R744J4042
$$ 115042 105486 98482 95277 97267 98762 104776 113621 112847 102973 99906 109267 115382 125126 139168
10417A39168K836J755j2551q302n97l762l06N631j6612j8264l405k837k195m077
$$ 139168 142004 143759 131208 122906 122309 118547 118241 123872 107260 88996 85591 82754 80559 76482
10403G6482L019J5187m404n863l463O171K0249P064j628j6207m31j071J881j003
$$ 76482 79501 94688 90284 84421 80958 87129 107378 114442 112814 96607 96176 95105 96986 95983
10389I5983j3717m042R722L262m757r979m693j5933l087O031J1936M532j4965
$$ 95983 82266 78224 87946 91208 86451 76472 71779 55846 52759 58790 70726 75258 60293
10376F0293P368J3528K2598J1254n889N359J8703O809J6892P173N015R047P276
$$ 60293 67661 81189 103787 115041 109152 114511 133214 140023 156915 164088 169103 178150 185426
10363A85426K1506J0165J1699J3191M1319M6428N9436R9222J36651J80277K24735
$$ 185426 206932 217097 228796 241987 283306 329734 389170 488392 625043 805320 1030055
10352A030055K38143J88590N2087o1406j81834k28053k22879j90042j28608r8840
$$ 1030055 1268198 1456788 1508875 1447469 1265635 1037582 814703 624661 496053 397213
10342C97213o7826o0125m3716j7657k2058j6451o491L4o769m300J545q426j5102
$$ 397213 329387 269262 225546 207889 185831 169380 162889 162923 156154 151854 153399 144973 129871
10329A29871j4457j6901N75K983k39j006j388p392N305k644M972M968L965m455
$$ 129871 115414 98513 99088 102071 101832 100826 99438 92046 97351 94707 99679 104647 108612 104157
10315A04157L993M44k713j3616j8043k530m334K981j1677R228J6081Q532j2283
$$ 104157 108150 108594 105881 92265 74222 71692 67358 70339 58662 67890 83971 92503 80220
10302H0220q506m886j1285j148P799N097R954m282m284J6523J7027k803j1514
$$ 80220 71714 66828 55543 54395 62194 67291 77245 72963 68679 85202 102229 99426 87912
10289H7912P834J3907K268M506N532j960k320m150O134J0301L511O313K8580R740
$$ 87912 95746 109653 111921 116427 121959 119999 117679 113529 119663 129964 133475 139788 168368 178108
10275A78108K3238N3929Q4001J29170J91916K36969K86282L03516J66459k129
$$ 178108 201346 255275 339276 468446 660362 897331 1183613 1487129 1653588 1651459
10265A651459j95379l07084k89456k27346j68273j02726o3987m1121m4944l9947
$$ 1651459 1456080 1148996 859540 632194 463921 361195 297208 256087 211143 171196
10255A71196k3304j9690j337l629n319j1479m566j5599Q895J0772r631k336k40
$$ 171196 147892 128202 126865 123236 117917 106438 101872 86273 95168 105940 96309 93973 93733
10242I3733J874n817J816m896j5168r043j3902j8063J95K3889J4907O147q058
$$ 93733 95607 89790 91606 86710 71542 62499 48597 30534 30729 54618 69525 75672 67614
10229F7614q00J0194K739j1131m034N314m205j6939j9499J3632K5583j551m744
$$ 67614 66814 77008 79747 68616 64582 69896 65691 48752 29253 42885 68468 66917 62173
10216F2173k05k116J140k671j296j2225j5692M011l431j0892J542O280J942L92
$$ 62173 61968 59852 60992 58321 57025 44800 29108 33119 29688 18796 20338 26618 28560 28952
10202B8952j1759K495K6355P021N148O711M733k817p338j0851j3161J368k087
$$ 28952 17193 19688 46043 53064 58212 64923 69656 66839 59501 48650 35489 36857 34770
10189C4770k107n997k030j555J2701J5832n324m087l549K377P053J2055J5323
$$ 34770 32663 26666 24636 23081 35782 51614 46290 42203 38654 41031 48084 60139 75462
10176G5462k590j621j830p151J0435J1397K295M768J6344K359N984J0635Q180
$$ 75462 72872 71251 69421 62270 72705 84102 86397 91165 107509 109868 115852 126487 134667
10163A34667r138j1427M006j643p757j6301J65J4169J5712J4608J478J032j7313
$$ 134667 125529 114102 118108 116465 108708 92407 92572 106741 122453 137061 138539 139571 122258
10150A22258j7471q055j3300j1849p774L329K0768K2654O032J516j0095J650j1740
$$ 122258 104787 96732 83432 71583 63809 67138 87906 110560 116592 118108 108013 109663 97923
10137I7923j7215J26o371R678J4394j7486p601J5984J8080n274j4636n799R7m516
$$ 97923 80708 80834 74463 84141 98535 81049 73448 89432 107512 102238 87602 81803 81900 77384
10123G7384j1135j4344j5379P548J9648J2038j0513p123j4442O832L233N009j8478
$$ 77384 66249 51905 36526 44074 63722 75760 65247 58124 43682 50514 53747 58756 40278
10110D0278j0598R315J701j1770j818J7683J0913O450j0839j8736p769n962M376
$$ 40278 29680 38995 40696 28926 27108 44791 55704 62154 51315 32579 24810 18848 23224
10097B3224P107n251o926m542p285k17O177Q504P036l771N633R035M667j180r370
$$ 23224 30331 25080 18154 13612 6327 6110 12287 20791 27827 24056 29689 38724 43391 42211 32841
10082C2841M076j7612q493M570J5032k478q406l527l075p844J1075J5992J3647
$$ 32841 36917 19305 10812 15382 30414 27936 19530 16003 12928 5084 16159 32151 45798
10069D5798R09k068Q59m803M156Q444j4027r068P355j3516j9703q030R893J2430
$$ 45798 46707 44639 45498 40695 44851 53295 39268 30200 37555 24039 4336 -3694 6199 18629
10055A8629P913L464p512k372K947O067L249l374r233o370n927k537n670N499
$$ 18629 26542 30006 22494 20122 23069 29136 32385 29011 19778 13408 7481 4944 -726 4773
10041D773M74J8281Q920P605M960q044L64N698p221K877n011n863O251J4461j303
$$ 4773 5247 23528 32448 40053 45013 36969 37333 43031 35810 38687 33676 27813 34064 48525 47222
10026D7222r847m617R659k954m836J792m172p349J2470Q392m862p133M203l195
$$ 47222 37375 32758 42417 39463 34627 36419 32247 24898 37368 45760 40898 33765 37968 34773
10012C4773j9173j1492j0719q81R451J5k298J2437o35L505P326o741j417O896
$$ 34773 15600 4108 -6611 -7492 1959 1974 -324 12113 11478 14983 22309 15568 14151 21047
9998B1047q658j4638p725P152J1471J986M63L956J256N944K527J5061o879r478
$$ 21047 12389 -2249 -9974 -2822 8649 10635 11098 15054 16310 22254 24781 39842 32963 23485
9984B3485o647O34n399M40J743l204o934o096k800l47J0888Q879J3948O471l509
$$ 23485 16838 17472 12073 12513 14256 11052 4118 -1978 -4778 -5125 5763 14642 28590 35061 31552
9969C1552o266P547n768j2824l784P401q60j3103j579o835J6777J9781j2797j5128
$$ 31552 25286 32833 27065 14241 10457 17858 16998 3895 2316 -4519 12258 32039 19242 4114
9955D114o004o632Q082k705j950Q298R276K766m015R999N842o905k6265k587O302
$$ 4114 -1890 -8522 -440 -3145 -5095 3203 12479 15245 11230 21229 27071 20166 -6099 -8686 -2384
9940b384J7873J76q347j525O833Q740n819o241R64J3567Q189K033j2855k68K0770
$$ -2384 15489 15665 7318 5793 12626 21366 15547 9306 10270 23837 32026 34059 21204 20936 41706
9925D1706M018m190r413N973N272O833p306r005L610L582j2262k3752Q591L635
$$ 41706 45724 41534 32121 38094 43366 50199 42893 33888 37498 41080 28818 5066 13657 17292
9911A7292j2122q543q6Q244K096J611j2301q719L184J5642J2253r934K284q940
$$ 17292 5170 -3373 -3459 4785 6881 8492 -3809 -12528 -9344 6298 18551 8617 10901 1961
9897A961N574O338O5J2946J4421N080n964j3562K562Q923j1405k1805Q587J890
$$ 1961 7535 13873 13938 26884 41305 46385 40421 26859 29421 38344 26939 5134 13721 15611
9883A5611PP856l861j2148j723l282R402J8825o491j3106J0568J2368Q171o585
$$ 15611 15618 23474 19613 7465 5742 2460 11862 30687 24196 11090 21658 34026 42197 35612
9869C5612j1648k579M009n979n944n556J487N734L700K683o416O389M499n144
$$ 35612 23964 21385 25394 19415 13471 7915 9402 15136 18836 21519 15103 21492 25991 20847
9855B0847j4945k920k344m389Q236r66r538K537n96O029R656J2640K010m253o227
$$ 20847 5902 2982 638 -3751 4485 3519 -6019 -3482 -4078 1951 11607 24247 26257 22004 15777
9840A5777O924R006P522m107q469k727K624p767m832L796j923j238L105K262l774
$$ 15777 22701 31707 39229 35122 26653 23926 26550 18783 13951 17747 15824 14586 17691 19953 16179
9825A6179J564p50k662R951J3754o852r341q276o693R636J3024M30j1691j492
$$ 16179 17743 16993 14331 24282 38036 31184 21843 13567 6874 16510 29534 29964 18273 16781
9811A6781R25n665l842N414Q141n175r401j2396J533Q558n070L304L841K136J570
$$ 16781 17706 12041 8199 13613 21754 16579 7178 -5218 -3685 4873 -197 3107 6948 9084 10654
9796A0654O309Q998k698J2182j2880n663j6387J3M117J6326R400m09J4199R590
$$ 10654 16963 25961 23263 35445 22565 16902 515 528 4645 20971 30371 29962 44161 53751
9782E3751n417j1480o849Q706N694J6246L4058P2953R4692N7222q282n6524o8287
$$ 53751 48334 36854 30005 38711 44405 60651 94709 167662 262354 319576 311294 254770 186483
9769A86483o3299m1784l2615j8952k923n712k224N431P08n41J928j3449q994n03
$$ 186483 123184 81400 48785 29833 26910 21198 18974 24405 25113 24572 26500 13051 4057 3554
9755C554m822p330J4577N804J1923q032J888j060K896q882m945L875J516O824
$$ 3554 -1268 -8598 5979 11783 23706 15674 17562 16502 19398 10516 5571 9446 10962 17786
9741A7786O50M608k2625q240P458J0449m297J21J709J5929r18j7325j5463O172
$$ 17786 18436 23044 419 -7821 -363 10086 5789 5910 7619 23548 22630 5305 -10158 -3986
9727c986J9258J0159j442j435j815J242O859m85k1143K892J9853K151m377j1197
$$ -3986 15272 25431 23989 22554 20739 21981 28840 28355 7212 10104 29957 32108 27731 16534
9713A6534l094J853N204r703k264R998K991K65J744R538j4213o255Q486l672j3829
$$ 16534 13440 15293 20497 10794 8530 18528 21519 21784 23528 33066 18853 12598 21084 17412 3583
9698C583J0593N86O454k350j1992L439l061J754j576m322O019O229J401N886p630
$$ 3583 14176 14762 21216 18866 6874 10313 7252 9006 7430 3108 9127 15356 16757 22643 15013
9683A5013K649K089n029j41m109J12J0856j389q069m032K3451J9358J2942j4746
$$ 15013 17662 19751 14722 14581 10472 10584 21440 20051 11982 7950 31401 50759 63701 48955
9669D8955j1102R586L275L180l508r165k2784j9914r335N432J0934K4884K893
$$ 48955 37853 47439 50714 53894 50386 41221 18437 -1477 -10812 -5380 5554 30438 33331
9656C3331J7143L0114K9295L6870Q1916J40753K11557K79580R2533j78264k44996
$$ 33331 50474 80588 109883 146753 228669 369422 580979 860559 953092 774828 529832
9645E29832j94684j16693n7933l7378l1180j5518j6311o182n854m623L8M446o791
$$ 529832 335148 218455 160522 123144 91964 76446 60135 53953 48099 43476 43514 47960 41169
9632D1169j4383l966j1775n840J2282J2716k279k2174m747O086J0123j104q588
$$ 41169 26786 22820 11045 5205 17487 30203 27924 5750 1003 7089 17212 16108 7520
9619G520l148L133P067M909P527J0309q321k0602J913R251k517O290l491r480
$$ 7520 4372 7505 14572 19481 27008 37317 28996 8394 10307 19558 17041 23331 19840 10360
9605A0360m856J2754J795K297m905l678j2610N004P624k864m426M672j2343j955
$$ 10360 5504 18258 20053 22350 17445 13767 1157 6161 13785 10921 6495 11167 -1176 -3131
9591c131r666j1794J6512J9154J7823k523k3879q643J3798K520L904N538j1512
$$ -3131 -12797 -24591 -8079 11075 28898 26375 2496 -6147 7651 10171 14075 19613 8101
9578H101k571P177K497M07J1087n124m064l941n663j2552Q787J5880m882q545
$$ 8101 5530 12707 15204 15611 26698 21574 17510 13569 7906 -4646 4141 20021 15139 6594
9564F594m82K2294l998N675j46q989Q424n433j9588l604J2766K674l910n578l67
$$ 6594 6112 28406 24408 30083 29937 20948 29372 23939 4351 747 13513 16187 12277 6699 6332
9549F332r307K997p183L347L780K929M634N140m758M831L063O879R97p891m149
$$ 6332 -2975 22 -7161 -3814 -34 2895 7529 12669 7911 12742 15805 22684 23681 15790 11641
9534A1641J1573n331j0951K950p203O38J0656k139j2124j2375j229M649k076j1615
$$ 11641 23214 17883 6932 9882 2679 3317 13973 11834 -290 -12665 -13894 -9245 -11321 -22936
9520b2936K94K1405N186n198k542J572k525N594K387N696K405P083L151O027j4076
$$ -22936 -22642 -1237 3949 -1249 -3791 -2219 -4744 850 3237 8933 11338 18421 21572 27599 13523
9505A3523n483k08p531q413p696J8116J7146j145j1339N781K137m482M410N161
$$ 13523 8040 7832 301 -8112 -15808 2308 19454 18309 6970 12751 14888 10406 14816 19977
9491A9977m812m115L871j188O47P72J634m45J140L671q449K591j5777j0007o703
$$ 19977 15165 11050 14921 13733 14380 15152 16786 16341 17481 21152 12703 15294 -483 -10490 -17193
9476a7193O500J3630Q294Q391Q836p176k438P799k832q070j1272K512P088j1691
$$ -17193 -10693 2937 11231 19622 28458 21282 18844 26643 23811 15741 4469 6981 14069 2378
9462B378k265m078O137l068J0033O218l692K516j27J174j5130l549J5459N183
$$ 2378 113 -3965 2172 -896 9137 15355 11663 14179 14052 15226 96 -3453 12006 17189
9448A7189m284N823J0845J0905j529r576L923k126p886p454j447j512P924M416
$$ 17189 12905 18728 29573 40478 38949 29373 33296 31170 23284 15830 14383 12871 20795 25211
9434B5211r598p578J278o478M013r32q889J4383J6655K121p951j3907j6623q863
$$ 25211 15613 8035 9313 2835 6848 5916 -2973 11410 28065 30186 22235 8328 -8295 -17158
9420a7158M622o5j1497J4638J9340M242K255L102R616l459o375R800m887j0757
$$ -17158 -12536 -12601 -24098 -9460 9880 14122 16377 19479 29095 25636 19261 29061 24174 13417
9406A3417n983m197R21j56J6474J1538k1765j0556q638J0994Q255n415j2591j256
$$ 13417 7434 3237 4158 4002 20476 32014 10249 -307 -8945 2049 10304 4889 -7702 -8958
9392h958J6614J123l253L174J4504K356j5483r091k219L195o773j4596J6550J6845
$$ -8958 7656 8779 5526 8700 23204 25560 10077 986 -1233 1962 -4811 -19407 -2857 13988
9378A3988K927m585K918m287k292J5821l185j0262j6783q963J1398O393N271J4439
$$ 13988 16915 12330 15248 10961 8669 24490 21305 11043 -5740 -14703 -3305 3088 8359 22798
9364B2798k644l706J0803L181o009j3720q387k8j259r025j680J3293O044j9646
$$ 22798 20154 16448 27251 30432 24423 10703 2316 2288 1029 -7996 -9676 3617 9661 -9985
9350i985k398P310K211j0160N310N920K300p210J0176Q447N541k914j7341O565
$$ -9985 -12383 -5073 -2862 -13022 -7712 -1792 508 -6702 3474 11921 17462 14548 -2793 3772
9336C772J607J615n176n49j7315j954O349P802L798j5136K93P199l716n073r364
$$ 3772 5379 6994 1818 1269 -16046 -18000 -11651 -3849 -51 -15187 -14894 -7695 -11411 -16484 -25848
9321b5848K340K2868L05r764P264l991j8185m681J0453J3492O654j791J0848L283
$$ -25848 -23508 -640 -335 -10099 -2835 -6826 -25011 -29692 -19239 -5747 907 -884 9964 13247
9307A3247k889p970p631K379M915M786J610J77M93n072o582k554L811J0474O343
$$ 13247 10358 2388 -5243 -2864 2051 6837 8447 8624 9117 4045 -2537 -5091 -1280 9194 15537
9292A5537j0098R821N386n47Q025J5385J592j8106j2887j712M499J262q45p564
$$ 15537 5439 15260 20646 20099 28124 43509 45101 26995 14108 12396 16895 18157 17312 9748
9278I748J2711k098k3613k854J1509k043J0120p485j824o129K514J0559J051O909
$$ 9748 22459 20361 -3252 -6106 5403 3360 13480 5995 4171 -1958 556 11115 12166 19075
9264A9075L299m549j515m944J118J909k462j2116o286J7418J6697k056o546M149
$$ 19075 22374 17825 16310 11366 12484 14393 11931 -185 -6471 10947 27644 25588 19042 23191
9250B3191K135l415l830r723k70J0803J0109j2332j4310o932L653J0973m78p774
$$ 23191 25326 21911 18081 8358 8088 18891 29000 16668 2358 -4574 -921 10052 9574 1800
9236A800J4285N240j4262m30P672j069q028M042n225p479k627J5961K762q8o015
$$ 1800 16085 21325 7063 6633 14305 13236 5208 9250 4025 -3454 -6081 9880 12642 12554 6539
9221F539k2044M136R493k213n978o873J2787J4611Q313L585q59L316j1221l340
$$ 6539 -15505 -11369 -1876 -4089 -10067 -16940 -4153 10458 18771 22356 21497 24813 13592 10252
9207A0252o704r93J6444J2273r853k35k72j7052j5797l968J4409k788k658J1815
$$ 10252 3548 2555 18999 31272 21419 21184 20912 3860 -11937 -15905 -1496 -4284 -6942 4873
9193D873o4p510L866j3361k282J3461J3062L75j2634m37J1330j187J349K250l882
$$ 4873 4809 -2701 1165 -12196 -14478 -1017 12045 12420 -214 -651 10679 9492 10841 13091 9209
9178I209m123M201n451j7893o410J3441J8282j627K037j1728O897p041k857R2
$$ 9209 5086 9287 3836 -14057 -20467 -7026 11256 9629 11666 -62 6835 -206 -3063 -2971
9164b971n483L953R925n592n222j086J0358M15l321L853R790R526j911j4583j2093
$$ -2971 -8454 -4501 5424 -168 -5390 -6476 3882 4297 976 4829 14619 24145 22234 7651 -4442
9149d442J7457r450p625R035J5635O436M257k2472j7477k778Q192J7790J961j2694
$$ -4442 13015 3565 -4060 4975 20610 27046 31303 8831 -8646 -11424 -3232 14558 16519 3825
9135C825o879O220R64q01J3695o370q844M779p195m912J2597M357L27l366K649
$$ 3825 -3054 3166 4130 3329 17024 10654 1810 6589 -606 -5518 7079 11436 11763 8397 11046
9120A1046K963R012O780o778K086J187p009o253q39N831J827j1930J731N923m627
$$ 11046 14009 23021 29801 23023 25109 26296 19287 13034 12195 18026 19853 7923 9654 15577 10950
9105A0950J705P47k941j184J2971K47j5119N650J5298n665J187r674j2809K988
$$ 10950 12655 13402 10461 9277 22248 22495 7376 13026 28324 22659 23846 14172 1363 4351
9091D351O147k113j4928M706J6035l689q085o01j1213n432J060O585O765L291
$$ 4351 10498 8385 -6543 -1837 14198 10509 2424 1823 -9390 -14822 -13762 -7177 -412 2879
9077B879p702J175J220j1662J628J3282J7237K229j2494K735m044o991l189k063
$$ 2879 -4823 -3648 -2428 -14090 -12462 820 18057 20286 7792 10527 6483 -508 -3697 -5760
9063e760P760J77J0341L095l811J507N800K853r535k1372l005R070K836M093k803
$$ -5760 2000 2177 12518 15613 11802 13309 19109 21962 12427 -8945 -11950 -2880 -44 4049 1246
9048A246p971J2545j485q008L781O592l242L815M981J0168q140o336k75K387J768
$$ 1246 -6725 5820 4335 -3673 108 6700 3458 7273 12254 22422 14282 7946 7671 10058 11826
9033A1826j4140j368J3135L864p17q9j430p866j1767j024M416P591o78p939O840
$$ 11826 -2314 -3682 9453 13317 12600 12511 11081 3215 -8552 -9576 -5160 2431 1753 -6186 654
9018F54N335N893q052j7114O454J1954R018j0692j0687J8159J5367K643o706r643
$$ 654 5989 11882 3830 -13284 -6830 5124 14142 3450 -7237 10922 26289 28932 22226 12583
9004A2583k795l527l235J516l003K127l059n352J1401L103n791r517m399J8250
$$ 12583 9788 6261 3026 4542 1539 3666 607 -4745 6656 9759 3968 -5549 -9948 8302
8990H302m262j631J714n591M026L262r398r605O622M720n130J5140R228m127r16
$$ 8302 4040 2409 4123 -1468 2558 5820 -3578 -13183 -6561 -1841 -6971 8169 17397 13270 12354
8975A2354q220q734k182M266J0694J178k309Q24o051q374j27N549k435J0833R005
$$ 12354 4134 -4600 -6782 -2516 8178 9356 7047 7871 1820 -6554 -6681 -1132 -3567 7266 16271
8960A6271o070j3619p360K877M499j185j5578J1372J1391J562n824l913Q300J4899
$$ 16271 10201 -3418 -10778 -7901 -3402 -4587 -20165 -8793 2598 4160 -1664 -5577 2723 17622
8946A7622m949J83k872j6336n856p32J2005J3009J0377J3942M390j9872n306j830
$$ 17622 12673 12856 9984 -6352 -12208 -12940 -935 12074 22451 36393 40783 20911 15605 13775
8932A3775j272J090m209N216N807j470q999K250K64q848N136J2459j1601q580
$$ 13775 12503 13593 9384 14600 20407 18937 9938 12188 12452 3604 8740 21199 9598 1018
8918A018M566o762p310J521R798J3015J1944j2832o359K1588m089k0857J2597
$$ 1018 5584 -1178 -8488 -6967 2831 15846 27790 14958 8599 30187 26098 5241 17838
8905A7838N121k855q197J1188J4059j6010k0315j4523r627N369K4237O622k138
$$ 17838 22959 20104 11907 23095 37154 21144 829 -13694 -23321 -17952 6285 12907 10769
8892A0769R417J215n516j4773o655k780J119L695M232k979R526k796q049o245
$$ 10769 20186 21401 15885 1112 -5543 -8323 -7204 -3509 723 -2256 7270 4474 -3575 -9820
8878i820l348n285Q385p14L356M292p41m305o920J893J076J2181O005j0431n663
$$ -9820 -13168 -18453 -10068 -10782 -7426 -3134 -3875 -8180 -15100 -13207 -12131 50 6055 -4376 -10039
8863a0039p577J1615K885P251O714o019n650m743j996O409O592L846M752q87j2417
$$ -10039 -17616 -6001 -3116 4135 10849 4830 -820 -5563 -7559 -1150 5442 9288 14040 13153 736
8848G36J474l186N41n611J587L054L490M862j845J2514k445j2061j1383N79l67
$$ 736 2210 -976 -435 -6046 -4459 -1405 2085 6947 5102 17616 15171 3110 -8273 -7694 -8061
8833h061J109m587J973J6434Q388K368J193j7317r394J304J5751q283N610R867
$$ -8061 -6952 -11539 -9566 6868 15256 17624 18817 1500 -7894 -6590 9161 878 6488 16355
8819A6355O67j3718j5965J1064J3118j1934m477j570O176q66q857N205k035N960
$$ 16355 17022 3304 -12661 -1597 11521 -413 -4890 -6460 -284 -1150 -10007 -4802 -6837 -877
8805h77L958j2043p293J4883J4058o205m51L321r311n227q432J3268N288n241
$$ -877 3081 -8962 -16255 -1372 12686 6481 6030 9351 40 -5187 -13619 -351 4937 -304
8791c04j833J1273P090j1462q38R21l278m449R215l125J43Q658l878n611J928
$$ -304 -2137 9136 16226 4764 3926 4847 1569 -2880 6335 3210 3353 12011 8133 2522 4450
8776D450p394n003Q195P967m728J3746L308j2804j1009J1883N995r44j0432j2338
$$ 4450 -2944 -7947 248 8215 3487 17233 20541 7737 -3272 8611 14606 13662 3230 -9108
8762i108k906r51n53N149J0722m87j0426p81Q635Q16L022N316q281m377R87K723
$$ -9108 -12014 -12965 -13518 -8369 2353 1866 -8560 -9341 -706 110 3132 8448 167 -4210 -3223 -500
8746e00J8686J0293l990r021j1367k446L591j963R549J798j5857J744l074j288
$$ -500 18186 28479 24489 15468 4101 1655 5246 3283 12832 14630 -1227 517 -2557 -3845
8732c845O095p726j0368o108R700J0292J2943l820j863o47l9N686Q017o811L959
$$ -3845 2250 -5476 -15844 -21952 -12252 -1960 10983 7163 5300 4653 4614 10300 18317 11506 15465
8717A5465N33n943j0582N530j0950O537M789j5319N5l23N858M435K34O546M450
$$ 15465 15998 10055 -527 5003 -5947 590 5379 -9940 -9885 -10208 -4350 85 319 6865 11315
8702A1315K997K495j7446k478j6344N442J2725J6310M000j7670p002M104M425
$$ 11315 14312 16807 -639 -3117 -19461 -14019 -1294 15016 19016 1346 -5656 -1552 2873
8689B873J833J745j5294j4078J1332Q132q129j1633J6703L8P254R569k540q194
$$ 2873 4706 6451 -8843 -22921 -11589 -3457 -11586 -23219 -6516 -6478 776 10345 7805 -389
8675c89J1790q099j011K907L19k238o966o694J458M025l788Q514Q214n380n328
$$ -389 11401 3302 2291 5198 5517 3279 -3687 -10381 -8923 -4898 -8686 -172 8042 2662 -2666
8660b666Q541R711O327p545p197j508O320O223m349q208o412m400R40R328j0246
$$ -2666 5875 15586 21913 14368 7171 5663 11983 18206 13857 5649 -763 -5163 -4223 5105 -5141
8645e141L669J4738J4091j3952m732K458Q317O529M12j4535k485L044J2073N854
$$ -5141 -1472 13266 27357 13405 8673 11131 19448 25977 26389 11854 9369 12413 24486 30340
8631C0340j4418j2969K028M414k552p805n358J308j782J3051l658o359M577m540
$$ 30340 15922 2953 4981 9395 6843 -962 -6320 -5012 -6794 6257 2599 -3760 817 -3723
8617c723k397r051P84J3154L555J0101O543J0653M87n257p758P66p97j7056q808
$$ -3723 -6120 -15171 -14387 -1233 2322 12423 18966 29619 30106 24849 17091 17857 17060 4 -8804
8602h804k486q461J3278j32k151k203J6488J1222J515M573M368r798n735p5R968
$$ -8804 -11290 -19751 -6473 -6605 -8756 -10959 5529 16751 18266 22839 27207 17409 11674 11599 21567
8587B1567O168p514j2800j467K375K415J5353l807N558o228M199n667J66J9312
$$ 21567 27735 20221 7421 5954 8329 10744 26097 22290 27848 21620 25819 20152 20318 39630
8573C9630K4063j91p887l388M804Q610m171j6055k425n578L78O050j5359j74k326
$$ 39630 63693 63502 55615 52227 57031 65641 61470 45415 42990 37412 37790 43840 28481 28307 25981
8558B5981l198j808q386l396o922J155J3586N202j182n86q258M858p009n59P251
$$ 25981 22783 20975 12589 9193 2271 3426 17012 22214 21032 20446 12188 17046 10037 9478 16729
8543A6729P7n260j2135J477K515J639P690K04j1158M201O832K312J562O831j664
$$ 16729 16806 11546 -589 888 3403 5042 12732 12936 1778 5979 12811 15123 16685 23516 21852
8528B1852J1923K5894R173j5213j8758l1933j2534J9251M04j559M750N368R207
$$ 21852 33775 59669 68842 53629 34871 2938 -9596 9655 10059 8500 13250 18618 27825
8515B7825j4667j3349J38m373J788J0991N181j030M491J235J374R159p178K581
$$ 27825 13158 -191 -53 -4426 -2638 8353 13534 12504 16995 18230 19604 28763 21585 24166
8501B4166L339L884l255j4728j6110Q067P651q871j3891L180P228O99o244O185
$$ 24166 27505 31389 28134 13406 -2704 5363 13014 4143 -9748 -6568 660 1359 -4885 1300
8487A300K0160L865J0799J0185J3211N3515N0885k0127m6869m2348j6788j2192
$$ 1300 21460 25325 36124 46309 59520 113035 163920 143793 96924 54576 37788 25596
8475B5596J2619l639r677o027r390k0460n531Q688Q840O034N469Q231q49j8857
$$ 25596 38215 34576 24899 18872 9482 -10978 -16509 -7821 1019 7053 12522 20753 19904 1047
8461A047l567l392k331Q048l650o749o932k179n109J5945J4142L763M720J395
$$ 1047 -2520 -5912 -8243 -195 -3845 -10594 -17526 -19705 -24814 -8869 5273 9036 13756 15151
8447A5151j1628P098L25M058n886j068m272N770J6772J8826J6579j043L574j0276
$$ 15151 3523 10621 10946 15004 9118 8050 3778 9548 26320 45146 61725 60682 64256 53980
8433E3980r081j2213r557Q9m560k971R279p95J240r89K946K793m491m351N16k328
$$ 53980 44899 32686 23129 23218 18658 15687 24966 24171 25411 24422 27368 30161 25670 21319 21835 19507
8417A9507K682k010j2946k0128j643j785j589N449J5236M348j7422M697Q34j678
$$ 19507 22189 20179 7233 -12895 -14538 -16323 -17912 -12463 2773 7121 -10301 -5604 -4770 -6448
8403f448k177O473K546p484o337O413L691q21M000k760J2551n908k736J544o413
$$ -6448 -8625 -2152 394 -7090 -13427 -7014 -3323 -4144 -144 -2904 9647 3739 1003 2547 -3866
8388c866J2076K108r50j3984k605N818k18R443Q711N974q847r31j0754P99J6128
$$ -3866 8210 10318 9368 -4616 -7221 -1403 -1621 7822 16533 22507 13660 12729 1975 2774 18902
8373A8902J1952j7730r122l7n141r317M669o216Q243J2804J3348R04l117q905
$$ 18902 30854 13124 4002 3965 -1176 -10493 -5824 -12040 -3797 9007 22355 23259 20142 11237
8359A1237m717m255P455N80j4319J11J2460j816n667p897l420r85J1121N173r088
$$ 11237 6520 2265 9720 10300 -4019 -3908 8552 6736 1069 -6828 -10248 -11233 -112 5061 -4027
8344d027n340J1341Q284q77O345j0047o262q065J136J4250N225j2655m565J0379
$$ -4027 -9367 1974 10258 9381 15726 5679 -583 -8648 -7512 6738 11963 -692 -5257 5122
8330E122j5995j050R099j3210J6304j599j887N862R398K526k1232K374J3610K896
$$ 5122 -10873 -11923 -2824 -16034 270 -1329 -3216 2646 12044 14570 -6662 -4288 9322 12218
8316A2218J155K949M608l214j4270L419J0061N437j3372r352O912n439j2135K01
$$ 12218 13373 16322 20930 17716 3446 6865 16926 22363 8991 -361 6551 1112 -11023 -10822
8302a0822M872m395L252J794L259J5412L791p076m823r9N653j0917k992l53l358
$$ -10822 -5950 -10345 -7093 -5299 -2040 13372 17163 10087 5264 5165 10818 -99 -3091 -3444 -6802
8287f802K740M286O262J2045K877J4764N170j7392L31R960j945o567k0281r224
$$ -6802 -4062 224 6486 18531 21408 36172 41342 23950 24281 34241 32296 25729 5448 -3776
8273c776L44L665J4693R654P881j3044q374p570n991j8138m150J1434Q923K06
$$ -3776 -3432 233 14926 24580 32461 19417 11043 3473 -2518 -20656 -24806 -13372 -4449 -4243
8259d243k458j0713j2431k757J8143J3294P08j085J275J1781j482j332K588j0359
$$ -4243 -6701 -17414 -29845 -32602 -14459 -1165 -457 -1542 -267 11514 10032 8700 11288 929
8245I29j363j0437p362l26l240N105M738k413K518Q530j1688M684O228j2128j260
$$ 929 -434 -10871 -18233 -18559 -21799 -16694 -11956 -14369 -11851 -3321 -15009 -10325 -4097 -16225 -17485
8230a7485R118J980L487k230Q609P90j3187k223N776l003p663J8155Q803K111
$$ -17485 -8367 -6387 -2900 -5130 3479 4269 -8918 -11141 -5365 -8368 -16031 2124 10927 13038
8216A3038J597j4732j3402j2749J3448R753J684j329N475P947m411q851j1252
$$ 13038 14635 -97 -13499 -26248 -12800 -3047 -1363 -2692 2783 10730 6319 -2532 -13784
8203a3784j855k39j405p470N140L231J515R750J2346R234j0746q470j0588n692
$$ -13784 -15639 -15878 -17283 -24753 -19613 -16382 -14867 -5117 7229 16463 5717 -2753 -13341 -19033
8189a9033L067M73R830J0307j0932j3048k469J1488Q247m841R409J115M111J659
$$ -19033 -15966 -15493 -5663 4644 -6288 -19336 -21805 -10317 -2070 -6911 2498 3613 7724 9383
8175I383o817k435p802J712N919R032R683j680o079o392m53r099n886L349j731
$$ 9383 2566 131 -7671 -5959 -40 8992 18675 16995 10916 4524 4071 -5028 -10914 -7565 -9296
8160i296J8358j019m179N222j367n313m805j5276N59K091O17P379j4942o484J7387
$$ -9296 9062 8043 3864 9086 7719 2406 -2399 -17675 -17116 -15025 -14408 -7029 -21971 -28455 -11068
8145a1068J6116k142j542J83K05L282L670K35m588o501l525M741j886J798N292
$$ -11068 5048 2906 1364 1547 1752 5034 8704 8939 4351 -2150 -5675 -934 -2820 -1022 4270
8130D270K683q885l921L702j050p971l899j447J5490R722J940j5772m285R1m789
$$ 4270 6953 -1932 -5853 -2151 -3201 -11172 -15071 -16518 -1028 8694 10634 -5138 -9423 -9332 -14121
8115a4121P381Q541j657l605m970J95J42j582M839m181K214J4559l047j0708l569
$$ -14121 -6740 1801 144 -3461 -8431 -8236 -8094 -9676 -4837 -9018 -6804 7755 4708 -6000 -9569
8100i569Q707L231l411r791j2641M266Q824J4247J1412j4511j7063J6617k81r454
$$ -9569 -862 2369 -1042 -10833 -23474 -19208 -10384 3863 15275 764 -16299 318 37 -9417
8086i417r799K090O619p84J677M553N71K736N337k94m220r62j0556N469Q204m216
$$ -9417 -19216 -17126 -10507 -11291 -9614 -5061 -4490 -1754 3583 3289 -931 -1893 -12449 -6980 1224 -2992
8070b992L060k390j4585j0514J6332R013L70k441j0634r109R197P851j3595K419
$$ -2992 68 -2322 -16907 -27421 -11089 -2076 -1706 -4147 -14781 -23890 -14693 -6842 -20437 -18018
8056a8018R230M627Q150m697n384L978J3076P879o592q960M493J668l682j100
$$ -18018 -8788 -4161 3989 -708 -6092 -2114 10962 18841 12249 3289 7782 9450 5768 4668
8042D668j757k656j2024K212M274r257j8030N881Q283Q307J1959q645o236P334
$$ 4668 2911 255 -11769 -9557 -5283 -14540 -32570 -26689 -18406 -10099 1860 -6785 -13021 -5687
8028e687p552r528o868K551j702K913J6501N288j137m847Q852j691K321K442R511
$$ -5687 -13239 -22767 -29635 -27084 -28786 -25873 -9372 -4084 -5221 -10068 -1216 -2907 -586 1856 11367
8013A1367q604L468L68m907q868j680N528k612m294M692N767O105j7877q188K0121
$$ 11367 2763 6231 6599 1692 -7176 -8856 -3328 -5940 -10234 -5542 225 6330 -11547 -19735 386
7998C86N342q487O607Q054J275L992j0765J481q624j113P693L643K615O304j773
$$ 386 5728 -2759 3848 11902 13177 17169 6404 7885 -739 -1852 5841 9484 12099 18403 16630
7983A6630p653j299P203J3046L150j60j137j722j942j8903q181O20J4334P129
$$ 16630 8977 7678 14881 27927 31077 30917 29780 28058 26116 7213 -968 -348 13986 21115
7969B1115J771j2718n254O680q02o676o732J0516j1362j3416o619L462Q284J3533
$$ 21115 22886 10168 4914 11594 10792 4116 -2616 7900 -3462 -16878 -23497 -20035 -11751 1782
7955A782j630Q419K089o776r286L256M188J680k118m944N928O172j4387j761J048
$$ 1782 152 8571 10660 3884 -5402 -2146 2042 3722 1604 -3340 2588 8760 -5627 -7388 -6340
7940f340K209j306j489J364q904j89M27n497j0056j2548J7931K8650J6882j0362
$$ -6340 -4131 -5437 -6926 -5562 -14466 -14655 -14228 -19725 -29781 -42329 -24398 4252 21134 10772
7926A0772r005j068o42J026J699J728q630J745j1915o372K282j26Q357L632Q274
$$ 10772 1767 699 57 1083 2782 4510 -4120 -2375 -14290 -20662 -18380 -18506 -10149 -6517 1757
7911A757J47o335J1724j771j3861L362J2576o7J1035j1738r895m94p55j35q443
$$ 1757 1904 -4431 7293 5522 -8339 -4977 7599 7532 18567 6829 -3066 -3560 -4315 -4450 -12893
7896a2893M904J0257L841P119L244N460j8756P136J12l880j3404r446J960r478
$$ -12893 -7989 2268 6109 13228 16472 21932 3176 10312 10424 6544 -6860 -16306 -14346 -23824
7882b3824l89J8752o959j3166M155K786J1839K6872j655k792j5552k0064j780
$$ -23824 -24213 -5461 -12420 -25586 -21431 -18645 -6806 20066 18411 15619 67 -19997 -21777
7869b1777Q630J3714k83l167p01O911O988R41n152j6425Q267K972L90j5184q990
$$ -21777 -13147 567 284 -2883 -3584 3327 10315 11256 6104 -10321 -2054 918 1308 -13876 -22866
7854b2866j1822O975J4354n846l05N848P269q954J386N705m01Q496n640n474p213
$$ -22866 -34688 -27713 -13359 -19205 -19510 -13662 -6393 -15347 -13961 -8256 -8657 -161 -5801 -11275 -18488
7839a8488J2225J0929O239q988j0640O445M965j940l468J622l855o668J213k27
$$ -18488 -6263 4666 10905 1917 -8723 -2278 2687 747 -2721 -1099 -4954 -11622 -10409 -10636
7825a0636K91N81M455J1372q030J606k941P278J5495P83j7033j732N543o047K749
$$ -10636 -10345 -9764 -5309 6063 -1967 -361 -3302 3976 19471 20254 3221 1489 7032 985 3734
7810C734J7966p466n029R748n971j3236l56L784J3435k583j7338j2518k552J3632
$$ 3734 21700 14234 9205 18953 12982 -254 -610 3174 16609 14026 -3312 -15830 -18382 -4750
7796d750N202l93M356m015q970p824j919K134J0840M797J4695J40N876j878n924
$$ -4750 452 59 4415 400 -8570 -16394 -18313 -16179 -5339 -542 14153 14293 20169 18291 12367
7781A2367j3792r297r725Q843l481j2323Q21J5794k529j2024N191J0420N769N020
$$ 12367 -1425 -10722 -20447 -11604 -15085 -27408 -26587 -10793 -13322 -25346 -20155 -9735 -3966 1054
7767A054k354j778K485J1993J2304m495j5788k325m604K871O704R561P094M427
$$ 1054 -1300 -3078 -593 11400 23704 19209 3421 1096 -3508 -637 6067 15628 22722 27149
7753B7149l278j1816j673J2531j1485j6537N059L377P092Q962l308r785l724l964
$$ 27149 23871 12055 10382 22913 11428 -5109 -50 3327 10419 19381 16073 6288 2564 -1400
7739a400j6687l291o54K420J8805J909K073l037o269Q35J0022O457p643Q448O310
$$ -1400 -18087 -21378 -22032 -19612 -807 1102 3175 138 -6131 -5296 4726 11183 3540 11988 18298
7724A8298r09m917Q699n631j2559k068q631j3678M012P043o58N91K507K5530J7734
$$ 18298 17389 12472 21171 15540 2981 913 -7718 -21396 -17384 -10341 -10999 -10408 -7901 17629 35363
7709C5363m253j2127j115K675J133j5033j8959m886N699k835L497L572j0590n963
$$ 35363 31110 18983 17868 20543 21676 6643 -12316 -17202 -11503 -14338 -10841 -7269 -17859 -23822
7695b3822J4624J377N292L649k084O080l872j1409J94J643Q79j42j6217j700J4550
$$ -23822 -9198 -7821 -2529 1120 -964 5116 1244 -10165 -9971 -8328 -7449 -7591 -23808 -25508 -10958
7680a0958M283n579Q603m586M08P71L54j90p513j749M630O873k530R284k209O521
$$ -10958 -6675 -12254 -3651 -8237 -7829 -7058 -6704 -6894 -14407 -16156 -11526 -4653 -7183 2101 -108 6413
7664F413P452r891j1690m689r83o505q386J7867P246k496K207p35m743m39l812
$$ 6413 13865 3974 -7716 -12405 -13388 -19893 -28279 -10412 -3166 -5662 -3455 -4190 -8933 -9372 -13184
7649a3184J711q291P622N814J1269Q227j0842n250l750J368m537J733P592p366
$$ -13184 -11473 -19764 -12142 -6328 4941 13168 2326 -2924 -6674 -5306 -9843 -8110 -518 -7884
7635g884m209J3322n694q660k70j340p577j574N851l325j221q371J3218K0167
$$ -7884 -12093 1229 -4465 -13125 -13395 -14735 -22312 -23886 -18035 -21360 -22581 -30952 -17734 2433
7621B433q482o46P79O657R908q002q139R177j36r289N033K922l200m7o390m082
$$ 2433 -6049 -6695 -5916 741 10649 2647 -5492 3685 3549 -5740 -707 2215 -985 -1032 -7422 -11504
7605a1504J0266o50J0681l085J6M323Q160r806j0586O109j030M14m675p803K343
$$ -11504 -1238 -1888 8793 5708 5724 10047 18207 8401 -2185 3924 2894 3308 -1367 -9170 -6827
7590f827L355K047j036j1652o978j1222J0135J579J2136L634N673K527m388o913
$$ -6827 -3472 -1425 -2461 -14113 -21091 -32313 -22178 -20599 -8463 -4829 844 3371 -1017 -7930
7576g930n544j1135J7782O165m934j164M552M028j2797j4319J3857J3377j48m061
$$ -7930 -13474 -24609 -6827 -662 -5596 -6760 -2208 1820 -10977 -25296 -11439 1938 1790 -2271
7562b271N357J023r969l771J534j787j1302J084R170J246j1845K1572R259q423
$$ -2271 3086 4109 -5860 -9631 -8097 -9884 -21186 -20102 -10932 -9686 -21531 41 9300 877
7548H77m599J3393J1055M685j6650j3188J533k081j0383J1949O227m328N044j1660
$$ 877 -3722 9671 20726 25411 8761 -4427 -2894 -4975 -15358 -3409 2818 -1510 3534 -8126
7534h126m937n606L763J3266M731J599j0408j4000J0448P795j1154m583l441J2158
$$ -8126 -13063 -18669 -14906 -1640 3091 4690 -5718 -19718 -9270 -1475 -12629 -17212 -20653 -8495
7520h495N457J5104Q671j1242j4165r742L571O630j4586m032Q917P090M982Q325
$$ -8495 -3038 12066 20737 9495 -4670 -14412 -10841 -4211 -18797 -22829 -13912 -6822 -1840 6485
7506F485J781M771j1018M04N718J0910o266j3273J052Q0j508m504O037m83J2500
$$ 6485 8266 13037 2019 2423 8141 19051 12785 -488 564 644 -864 -5368 669 186 12686
7491A2686o950j7802M238J8448O022N535R765r58j62k2501j4096N376Q738O854
$$ 12686 5736 -12066 -7828 10620 16642 22177 31942 30984 30822 8321 -5775 -399 8339 15193
7477A5193l003L570m625j3906j793J5255J797j0726J787L561j2416q482N268R651
$$ 15193 12190 15760 11135 -2771 -4564 10691 12488 1762 3549 7110 -5306 -13788 -8520 1131
7463A131O697r40k003j1160l019K84N944j66q001N417J5273j866q861q719Q071
$$ 1131 7828 6888 4885 -6275 -9294 -9010 -3066 -3232 -11233 -5816 9457 7591 -1270 -9989 -1918
7448a918k356j080K300J923L208K624J1538N930m034M212o113j0722j249J3761
$$ -1918 -4274 -5354 -3054 -1131 2077 4701 16239 22169 18135 22347 16234 5512 4263 18024
7434A8024J879j8927k0923j925R075O651J243J659m191j1247J5291R295K490j7497
$$ 18024 19903 976 -19947 -21872 -12797 -6146 -4903 -3244 -7435 -18682 -3391 5904 8394 -9103
7420i103j1396j91Q048P378r566j3588L735J3251R725J0632O698K108L842q108
$$ -9103 -20499 -20690 -12642 -5264 -14830 -28418 -24683 -11432 -1707 8925 15623 17731 21573 13465
7406A3465R483N39j3644q949m171j080m743n40Q834L719J807O934k474o205N129
$$ 13465 22948 23487 9843 894 -3277 -4357 -9100 -9640 -806 2913 4720 11654 9180 2975 8104
7391H104K024r652M20o24l53r816q192J3026J7221j977j5186L105O676J056o503
$$ 8104 10128 476 896 272 -81 -9897 -18089 -5063 12158 10181 -5005 -1900 4776 5832 -671
7376f71m888p039J4186N554M027m754k484J0912N103j6140q436O721J0955q118
$$ -671 -5559 -12598 1588 7142 11169 6415 3931 14843 19946 3806 -4630 2091 13046 4928
7362D928L2j0399j0359Q479k971q536K149Q000K74P162Q752N964j9913J060p597
$$ 4928 4960 -5439 -15798 -7319 -10290 -18826 -16677 -8677 -8403 -1241 7511 13475 -6438 -5378 -12975
7347a2975M694K500L466N920j0281N269l522j3653J2518n662P141n852j0819J0211
$$ -12975 -8281 -5781 -2315 3605 -6676 -1407 -4929 -18582 -6064 -11726 -4585 -10437 -21256 -11045
7333a1045N26r377j6190n934R211J2263J1641R114Q462R292q098o394p196M240
$$ -11045 -10519 -19896 -36086 -42020 -32809 -20546 -8905 209 8671 17963 9865 3471 -3725 515
7319E15Q596K458k369q439r719L003N549k904O334l97l713o42L824K661q786k819
$$ 515 9111 11569 9200 761 -8958 -5955 -406 -3310 3024 2627 -1086 -1728 2096 4757 -4029 -6848
7303f848J4859L434n636j259r88k894r596P72R833R420p36j3066o734J655j431
$$ -6848 8011 11445 5809 4550 3562 668 -8928 -8156 1677 11097 10361 -2705 -9439 -7784 -9215
7288i215J3673J0879o542j0528m017J5500M844o060j6662p010J8660l475k639
$$ -9215 4458 15337 8795 -1733 -5750 9750 14594 8534 -8128 -15138 3522 47 -2592
7275b592J3496P49o569j6291L365K325q48j496Q588P92p415l853N54j1630J2288
$$ -2592 10904 11653 5084 -11207 -7842 -5517 -6365 -7861 727 1519 -5896 -9749 -9195 -20825 -8537
7260h537J1282r565q99R680r440r989O512J2386J6273j2065j2496J108J8976N292
$$ -8537 2745 -6820 -7719 1961 -7479 -17468 -10956 1430 17703 5638 -6858 -5750 13226 18518
7246A8518J885n797p222L166p415P210o849o956j044m298k720M078J678P681O325
$$ 18518 20403 14606 7384 10550 3135 10345 3496 -3460 -4504 -8802 -11522 -7444 -5766 1915 8240
7231H240j0840k192q5l370q711l88r948K2914K2281m244k1767p678N725P265j690
$$ 8240 -2600 -4792 -4877 -8247 -16958 -17346 -27294 -4380 17901 13657 -8110 -15788 -10063 -2798 -4488
7216d488O893M024m614r7O666j1421j3119l673o955J2590J4482N989J328j0695
$$ -4488 2405 6429 1815 1718 8384 -3037 -16156 -19829 -26784 -14194 288 6277 7605 -3090
7202c090l150J9380l70q628L421p663Q799k121L80m220n404j7852p347K3232N234
$$ -3090 -6240 13140 12770 4142 7563 -100 8699 6578 6958 2738 -2666 -20518 -27865 -4633 601
7187F01l587N461j0177N58K035Q655l824j5780O698N087j720J672P801L769q715
$$ 601 -2986 2475 -7702 -7144 -5109 3546 -278 -16058 -9360 -4273 -5993 -4321 3480 7249 -1466
7172a466r216N177o145M004K268L627j218N054j846k821n770J139J3791J721p47
$$ -1466 -10682 -5505 -11650 -7646 -5378 -1751 -2969 2085 239 -2582 -8352 -7213 6578 8299 7552
7157G552j0219k665o278N436J240J524K724k143o578J950N20j960L029K548L012
$$ 7552 -2667 -5332 -11610 -6174 -4934 -3410 -686 -2829 -9407 -7457 -6937 -8897 -5868 -3320 -308
7142c08K581m044j4393J0496P989L372m141J368M078R310K998n975j204j5906
$$ -308 2273 -1771 -16164 -5668 2321 5693 1552 2920 6998 16308 19306 13331 12127 -3779
7128c779o387n348M27N523R311m736j0827j5935k841J2463N656j165p49J51K923
$$ -3779 -10166 -15514 -15087 -9564 -253 -4989 -15816 -31751 -34592 -22129 -16473 -17638 -18387 -18236 -15313
7113a5313k234r0J4789J0553Q336N383O70r889j4483L353r293j7394J1797N430
$$ -15313 -17547 -17637 -2848 7705 16041 21424 22094 12205 -2278 1075 -8218 -25612 -13815 -8385
7099h385j3706j1644R196P864J1303Q066o740o283M704Q883k127l257N126R760
$$ -8385 -22091 -33735 -24539 -16675 -5372 2694 -4046 -10329 -5625 3258 1131 -2126 3000 12760
7085A2760k739N611M772j1211k556J5038m330j1217j2901j6674P970J5738n362
$$ 12760 10021 15632 20404 9193 6637 21675 17345 6128 -6773 -23447 -15477 261 -5101
7072e101j175l348l491k352M546O249k963j031o934l37J596P321k345n015m748
$$ -5101 -6276 -9624 -13115 -15467 -10921 -4672 -7635 -8666 -15600 -15937 -14341 -7020 -9365 -14380 -19128
7057a9128R879O816l341L182j701J0079P480k940j7436n131j2595L312R993M720
$$ -19128 -9249 -2433 -5774 -2592 -4293 5786 13266 10326 -7110 -12241 -24836 -21524 -11531 -6811
7043f811k203N443J4372J2716r523o520l645L172k507l438j1916N414q551j1318
$$ -6811 -9014 -3571 10801 23517 13994 7474 3829 7001 4494 1056 -10860 -5446 -13997 -25315
7029b5315O980O92L305m305j2076J4543J7944O14L18N390j4267j3416n46K014
$$ -25315 -18335 -17643 -14338 -18643 -30719 -16176 1768 2382 2700 8090 -6177 -19593 -20139 -18125
7015a8125M626J412j4673o777Q106J2145O052O754m348l085m054o220Q626J4687
$$ -18125 -13499 -12087 -26760 -33537 -25431 -13286 -7234 -480 -4828 -7913 -11967 -18187 -9561 5126
7001E126J8838j0677j7972O371O972r200j0984J7687P145l960N188l492l013L010
$$ 5126 23964 13287 -4685 1686 8658 -542 -11526 6161 13306 9346 14534 11042 8029 11039
6987A1039J3013K381j0395l934j3619o204o885m074P231k412J623j911R829j45
$$ 11039 24052 26433 16038 12104 -1515 -7719 -14604 -18678 -11447 -13859 -12236 -14147 -4318 -4463
6973d463j230J3429N239J3342L838p855j7763Q962J2197P805o991j2927q552m428
$$ -4463 -5693 7736 12975 26317 30155 22300 4537 13499 25696 33501 26510 13583 5031 603
6959F03l916L256P93j187M212M393j2343k1814L720J1119j647l566N192j937K241
$$ 603 -3313 -57 736 -451 3761 8154 -4189 -26003 -22283 -11164 -12811 -16377 -11185 -13122 -10881
6944a0881O632R574q257o780J524j741q520n670n536L499J2520J3547J7581j0245
$$ -10881 -4249 5325 -2932 -9712 -8188 -9929 -18449 -24119 -29655 -26156 -13636 -89 17492 7247
6930G247j4442l108K321J912J0199q9J918n670m49L981K435j886o767L115j9530
$$ 7247 -7195 -10303 -7982 -6070 4129 4040 5958 288 -161 3820 6255 4369 -2398 717 -18813
6915a8813L80J8846R179J766j1402k878Q105o219j0508J4487L119l923j2731J884
$$ -18813 -18433 413 9592 11358 -44 -2922 5183 -1036 -11544 2943 6062 2139 -10592 -8708
6901h708J0378J625Q612Q070j2183n068J960j280L583O501n080j2185J61Q50n454
$$ -8708 1670 3295 11907 19977 7794 2726 4686 3406 6989 13490 8410 -3775 -3614 -2764 -8218
6886h218m543o351N853K0103R790R74O04o468k549K170P83L415q042N00j395r999
$$ -8218 -12761 -19112 -13259 6844 16634 17608 18212 11744 9195 11365 12148 15563 7521 8021 6626 -3373
6870c373r010L340j924K0328O348p282j7956j664l576k489j3313P764J4170K605
$$ -3373 -12383 -9043 -10967 9361 15709 8427 -9529 -11193 -14769 -17258 -30571 -22807 -8637 -6032
6856f032q911j0699j23O62M926P394Q549j79l866J1160k663j1476R19K905r935
$$ -6032 -14943 -25642 -25765 -25103 -20177 -12783 -4234 -4413 -8279 2881 218 -11258 -10339 -7434 -17369
6841a7369K289J0336p179N626N586J2891J5208N619M103n234n517n590o359q390
$$ -17369 -15080 -4744 -11923 -6297 -711 12180 27388 33007 37110 31876 26359 20769 14410 6020
6827F020K821l301n007R265M316p910R76J494k32j8230j3085p60j026J0372P968
$$ 6020 8841 5540 533 9798 14114 6204 7180 8674 8442 -9788 -22873 -23633 -24659 -14287 -6319
6812f319r14r36L877j947q114J0346L165J1549P636l838n380k904j810K572J483
$$ -6319 -7233 -8169 -4292 -6239 -14353 -4007 -842 10707 18343 14505 9125 6221 4411 6983 8466
6797H466p499p333O42P169J4364K319q606q45k0431k497J0391Q305J170L447K53
$$ 8466 967 -6366 -5724 1445 15809 18128 9522 8677 -11754 -14251 -3860 4445 5615 9062 9315
6782I315n154j3129j4295M51M726J1688J7218q523q191r75l102p209L059J6374
$$ 9315 4161 -8968 -23263 -22812 -18086 -6398 10820 2297 -5894 -6869 -9971 -17180 -14121 2253
6768B253N101L721k628m275q626k712p648n547K863J3974J342q227P226m594q873
$$ 2253 7354 11075 8447 4172 -4454 -7166 -14814 -20361 -17498 -3524 -2182 -10409 -3183 -7777 -16650
6753a6650m250j645J140N042l031P326j192M380Q433j0998n16k027N487j00k922
$$ -16650 -20900 -22545 -21405 -16363 -19394 -12068 -13260 -8880 -447 -11445 -11961 -13988 -8501 -8601 -11523
6738a1523L347o712O943K002o689j469M789J0494N721j992j871Q574P276n03j1901
$$ -11523 -8176 -14888 -7945 -5943 -12632 -14101 -9312 1182 6903 4911 3040 11614 18890 18387 6486
6723F486J075p26o582o815J007M09N152n318N972N577J846j8756q563J171J390
$$ 6486 7561 6835 253 -6562 -5555 -5146 6 -5312 660 6237 8083 -10673 -19236 -18065 -16675
6708a6675Q536J0115n419R044J359r245M343j3511J0372l42j286P492Q169R847
$$ -16675 -8139 1976 -3443 5601 6960 -2285 2058 -11453 -1081 -1423 -2709 4783 12952 22799
6694B2799l472J832j5881J756q710o354k032K283N328j3281j2331N064O341R048
$$ 22799 19327 21159 5278 7034 -1676 -8030 -10062 -7779 -2451 -15732 -28063 -22999 -16658 -7610
6680g610k215K006o338J2497K564Q082P795j1206j202j956p286Q498J1927k0587
$$ -7610 -9825 -7819 -14157 -1660 904 8986 16781 5575 4373 2417 -4869 3629 15556 -5031
6666e031r768L726N44K543L610K652k601j0943J4102P684n563M60L723j1345n006
$$ -5031 -14799 -11073 -10529 -7986 -4376 -1724 -4325 -15268 -1166 6518 955 1415 5138 -6207 -11213
6651a1213M041M816P0L250m838k424l157J0214l348L34O5Q537Q76L452J0390j4184
$$ -11213 -7172 -2356 -2286 964 -3874 -6298 -9455 759 -2589 -2255 -2190 6347 7223 10675 21065 6881
6635F881j2173J700L163J4402j1357q196r095P097m638j902R834J1851l256K28
$$ 6881 -5292 -3592 -429 13973 2616 -5580 -14675 -7578 -12216 -14118 -4284 7567 4311 4539
6621D539M241l758m097R338m50j2099J4287J673n440N21l676Q285J057M055j2738
$$ 4539 8780 5022 925 10263 9813 -2286 12001 13674 8234 8755 5079 13364 14421 18476 5738
6606E738j7184n330J471K180R538J2978Q351L859j0797p877j1843j026J907J3209
$$ 5738 -11446 -16776 -15305 -13125 -3587 9391 17742 21601 10804 2927 -8916 -9942 -8035 5174
6592E174L807P336j5415k0339q21L825L716R95N950j7721P980K495P39N537K798
$$ 5174 8981 16317 902 -19437 -20258 -16433 -12717 -11722 -5772 -23493 -15513 -13018 -12279 -6742 -3944
6577c944J0825m34j9457k9N497N614M896J1722o014q266K720L049m580Q371J483
$$ -3944 6881 6447 -13010 -13039 -7542 -1928 2968 14690 8676 410 3130 6179 1599 9970 11453
6562A1453M402n607j1135R767K947o334m558R35l705N429p925l845J1114q87k233
$$ 11453 15855 10248 -887 8880 11827 5493 935 1870 -1835 3594 -4331 -8176 2938 2051 -182
6547a82P075J0168R1m243j4693L648M059l74m712n706L132p735L403R829K247
$$ -182 6893 17061 17152 12909 -1784 1864 5923 5549 837 -4869 -1737 -9472 -6069 3760 6007
6532F007k177q814k726R1n86J8068m930r331J2097P976o312j1026K527J3635L929
$$ 6007 3830 -4984 -7710 -7619 -8205 9863 4933 -4398 7699 15675 9363 -1663 864 14499 18428
6517A8428P84J631j789l242m697o290P243k714j3817l785N468M418p853q832n139
$$ 18428 19212 20843 19054 15812 11115 4825 12068 9354 -4463 -8248 -2780 1638 -6215 -15047 -20186
6502b0186J330P560k315Q724L443n045N631J1488j1415l521J30Q794m054J4888
$$ -20186 -18856 -11296 -13611 -4887 -1444 -6489 -858 10630 -785 -4306 -4176 4618 564 15452
6488A5452q888j0053p379n770L382K716N864O899q510j199o414n674Q473k064
$$ 15452 6564 -3489 -10868 -16638 -13256 -10540 -4676 2223 -6287 -7486 -13900 -19574 -11101 -13165
6474a3165o619P08J2457J0081P371J2113Q89j1114q286j1648m016m186q730L566
$$ -13165 -19784 -19076 -6619 3462 10833 22946 23835 12721 4435 -7213 -11229 -15415 -24145 -20579
6460b0579N937K0655Q959n14Q676j77r297r044l880q5N369K584J767K689K488
$$ -20579 -14642 6013 14972 14458 23134 22957 13660 4616 736 651 6020 8604 10371 13060 15548
6445A5548n485J014N702m057j2967K259m705K062L601p819j705J3716N638p579
$$ 15548 10063 11077 16779 12722 -245 2014 -2691 -629 2972 -4847 -6552 7164 12802 5223
6431E223jk463m308L386q344j588Q22j680j4400j753O080P975j500n079M757J0460
$$ 5223 5222 2759 -1549 1837 -6507 -8095 -7273 -8953 -23353 -25106 -19026 -11051 -12551 -17630 -12873 -2413
6415b413r702J1823P204N694l062m276o851R853O036j1877j2615j844q031r568
$$ -2413 -12115 -292 6912 12606 9544 5268 -1583 8270 14306 2429 -10186 -12030 -20061 -29629
6401b9629O488q516P802K0512J0685Q408L352k935o563r812j5445k885M739N475
$$ -29629 -23141 -31657 -23855 -3343 7342 15750 19102 16167 9604 -208 -15653 -18538 -13799 -8324
6387h324J9977J6196r323j3319q127j4718j6760J5102J4992J1123p259q652K674
$$ -8324 11653 27849 18526 5207 -2920 -17638 -34398 -19296 -4304 6819 -440 -9092 -6418
6374f418N069j2429o098Q749L345j0270R876O103P407P4j8001o837N390L903K1721
$$ -6418 -1349 -13778 -19876 -11127 -7782 -18052 -8176 -2073 5334 5408 -12593 -19430 -14040 -10137 11584
6359A1584J0343o294m935p107l319K597Q72J0277o343p358L750n797q28N289j5710
$$ 11584 21927 15633 10698 3591 272 2869 3741 14018 7675 317 4067 -1730 -2558 2731 -12979
6344a2979Q066N530j951O20O632K686L218p91P155m455o869j302k559j7769o35
$$ -12979 -4913 617 -1334 -714 5918 8604 11822 11031 18186 13731 6862 5560 3001 -14768 -15403
6329a5403J1431o788N574N047n856R42P297k523Q199k3P17J356o675j8374L612
$$ -15403 -3972 -10760 -5186 -139 -5995 -5053 2244 -279 7920 7897 8614 9970 3295 -15079 -11467
6314a1467M915j877J3149l54j9058k038Q998k783p968j5264k382J7970K682J1769
$$ -11467 -6552 -8429 4720 4366 -14692 -16730 -7732 -10515 -18483 -33747 -36129 -18159 -15477 -3708
6300c708J7683K63n57K284k744M76O18J765j6518j6213j0324J6759O699P993K540
$$ -3708 13975 14238 13681 15965 13221 13697 14315 16080 -438 -16651 -26975 -10216 -3517 4476 7016
6285G016q061L233M300L68N736r36j8090j115K896J498n351K3843J1143l64j3870
$$ 7016 -1045 2188 6488 6856 12592 11656 -6434 -7549 -4653 -3155 -8506 15337 26480 26116 12246
6270A2246j4417k790o825j3928O324O236r652p116P935K452N127K334J226J0267
$$ 12246 -2171 -4961 -11786 -25714 -19390 -13154 -22806 -29922 -21987 -19535 -14408 -12074 -10848 -581
6256e81l321K378J8717M787o788n504j0480j0174l592p980o772M881J2334q230
$$ -581 -3902 -1524 17193 21980 15192 9688 -792 -10966 -14558 -22538 -29310 -24429 -12095 -20325
6242b0325M021O583M59k555JK772n779L68J0202l454P121r734l736m832J1053
$$ -20325 -16304 -9721 -9262 -11817 -11816 -9044 -14823 -14455 -4253 -7707 -586 -10320 -14056 -18888 -7835
6227g835N491j6196J353J566p57j3344O849P813J252Q355j3984l081Q871k164
$$ -7835 -2344 -18540 -17187 -15621 -16378 -29722 -22873 -15060 -13808 -5453 -19437 -22518 -13647 -15811
6213a5811M365J7578O754n408o596l613j837j0827r571J4323O073p002j9516q506
$$ -15811 -11446 6132 12886 7478 882 -2731 -4568 -15395 -24966 -10643 -4570 -11572 -31088 -39594
6199c9594P503J3474J440Q473K086j4547j504n97J326K801R233L489j875L618
$$ -39594 -32091 -18617 -17177 -8704 -6618 -21165 -22669 -23266 -21940 -19139 -9906 -6417 -8292 -4674
6185d674l604j1045J227J1088O184J368j3994n342P904J2421m001k405L058N590
$$ -4674 -8278 -19323 -18096 -7008 -824 544 -13450 -18792 -10888 1533 -2468 -4873 -1815 3775
6171C775L216OM127k602j474l405j7198o303K347k604j2905j2670R182N380k569
$$ 3775 6991 6997 11124 8522 7048 3643 -13555 -19858 -17511 -20115 -33020 -45690 -36508 -31128 -33697
6156c3697J4039J4575j485J052P432j1441j4862q706J8163Q319k328L918j0154
$$ -33697 -19658 -5083 -6568 -5516 1916 -9525 -24387 -33093 -14930 -6611 -8939 -5021 -15175
6143a5175r143R173J5533j2745r142k392J1378M742O703K95j113p580k051J4990
$$ -15175 -24318 -15145 388 -12357 -21499 -23891 -12513 -7771 -1068 -773 -1886 -9466 -11517 3473
6129C473j5707J536M787N773m938n359J4760k448l866q717N140O914M337M576
$$ 3473 -12234 -10698 -5911 -138 -5076 -10435 4325 1877 -1989 -10706 -5566 1348 5685 10261
6115A0261j6732N17J12J2121N629q074r294j1445p841L87K968J0362l219Q450
$$ 10261 -6471 -5954 -5842 6279 11908 3834 -5460 -16905 -24746 -24359 -21391 -11029 -14248 -5798
6101e798R303j4363j361M357l466n318P372M784M385m931j9545L41l333L839O007
$$ -5798 3505 -10858 -12219 -7862 -11328 -16646 -9274 -4490 -105 -5036 -24581 -24240 -27573 -23734 -17727
6086a7727m200K371J4150R488K538k763p814j0121k265r034L281J0829j338M075
$$ -17727 -21927 -19556 -5406 4082 6620 3857 -3957 -14078 -16343 -25377 -22096 -11267 -12605 -8530
6072h530n424j832N891J6802R016K108j5693p5J9283n698r017p676j3290m0k910
$$ -8530 -13954 -15786 -9895 6907 15923 18031 2338 2263 21546 15848 6831 -845 -14135 -14175 -17085
6057a7085n972P486Q566o117j4192m420J4563J8428K608j1804J264j144K384p727
$$ -17085 -23057 -15571 -7005 -13122 -27314 -31734 -17171 1257 3865 -7939 -6675 -7819 -5435 -13162
6043a3162J515M184l194L145M642M644l571r077R520P078J2602M017r603j1877
$$ -13162 -11647 -7463 -10657 -7512 -2870 1774 -1797 -10874 -1354 5724 18326 22343 12740 863
6029H63L515O386j506j463J482j2725l146o887M926P854J1147o147j0643P77M671
$$ 863 4378 10764 9258 7795 9277 -3448 -6594 -13481 -8555 -701 10446 4299 -6344 -5567 -896
6014h96O614n388q796K592J1733M802j2051j0162Q279M028l089N547O211K1823
$$ -896 5718 330 -8466 -5874 5859 10661 -1390 -11552 -3273 755 -2334 3213 9424 31247
6000C1247K403j06j5973j5164j3123n949m384l510L21J9783O571J1792K589j2643
$$ 31247 33650 33544 17571 2407 -10716 -16665 -21049 -24559 -24238 -4455 2116 13908 16497 3854
5986C854K064J6392m370L209k727m432r68k367M059n999j321j4599j1264q634
$$ 3854 5918 22310 17940 21149 18422 13990 13022 10655 14714 8715 7394 -7205 -18469 -27103
5972b7103m386R041n220J514O628J0194O469N560J1736k36p131J4352N846k6578
$$ -27103 -31489 -22448 -27668 -26154 -19526 -9332 -2863 2697 14433 14197 7066 21418 27264 686
5958F86j6834K431o014l514J6750j1634r57R679M137l277n186M457j271M105K202
$$ 686 -16148 -13717 -19731 -23245 -6495 -18129 -19086 -9407 -5270 -8547 -13733 -9276 -10547 -6442 -4240
5943d240J1875P925R46j663P606q284p892o147j310J235l201l983j996K195P524
$$ -4240 7635 15560 16506 14843 22449 14165 6273 126 -1184 51 -3150 -7133 -9129 -6934 590
5928E90J3219L464j5832m537P45m515k277N919p665m257n410j844J2032j333k921
$$ 590 13809 17273 1441 -3096 -2351 -6866 -9143 -3224 -10889 -15146 -20556 -22400 -10368 -11701 -14622
5913a4622M70L489Q796J0258r154M028K530j2310p698J859n065J4088j618p543
$$ -14622 -14152 -10663 -1867 8391 -763 3265 5795 -6515 -14213 -12354 -17419 -3331 -4949 -12492
5899a2492L894L496Q203J912j480K660L509q108l578r279N050L521K848n57M561
$$ -12492 -8598 -5102 3101 5013 3533 6193 9702 1594 -1984 -11263 -6213 -2692 156 -401 4160
5884D160n145j1060J004J7331l121j3476J708R239m857J0237r301p785P650L205
$$ 4160 -985 -12045 -11041 6290 3169 -10307 -8599 640 -4217 6020 -3281 -11066 -3416 -211
5870b11j80k871R490N754p048n340o345L27J1931K376r43K487j013j0589O282
$$ -211 -391 -3262 6228 11982 4934 -406 -6751 -6424 5507 7883 6940 9427 8414 -2175 4107
5855D107l567o006m274J057J657J680J066L945q772k110J135m950M54N739r235
$$ 4107 540 -5466 -9740 -8683 -7026 -5346 -4280 -335 -9107 -11217 -10082 -15032 -14578 -8839 -18074
5840a8074o489K147Q424L884m126J453J1615R906p162m152Q921J1244k282p416
$$ -18074 -24563 -22416 -13992 -10108 -14234 -12781 -1166 8740 1578 -2574 6347 17591 15309 7893
5826G893N260q085n343q460L402K938M533N596J4091p156k1269m760q196K607
$$ 7893 13153 5068 -275 -8735 -5333 -2395 2138 7734 21825 14669 -6600 -11360 -19556 -16949
5812a6949J8302M020o066M828J2219Q470q549j3474j106p6q428Q736Q991J5515
$$ -16949 1353 5373 -693 4135 16354 24824 16275 2801 1695 1619 -6809 1927 10918 26433
5798B6433K894j1666j8716j2178j2992O853Q276K588j3246j2600K784N062J3841
$$ 26433 29327 17661 -1055 -13233 -26225 -19372 -11096 -8508 -21754 -34354 -31570 -26508 -12667
5785a2667J0135o199J7759q585k0424l504J1389K952K020J87O369j3274q647o090
$$ -12667 -2532 -8731 9028 443 -19981 -23485 -12096 -9144 -7124 -6937 -568 -13842 -22489 -28579
5771b8579n397q21J8425N353N437K7058j1135j2538j65K168j0185J003p62N22
$$ -28579 -33976 -34797 -16372 -11019 -5582 21476 10341 -2197 -2362 -194 -10379 -9376 -10138 -9616
5757i616J3303J4217L860m554l429l629n706J364R61j556p578k219O643R078R275
$$ -9616 3687 17904 21764 17210 13781 10152 4446 5810 6771 5215 -2363 -4582 2061 11139 20414
5742B0414P770j2170q27l742m375n884m359q87N363q90l019l844l385p193J175
$$ 20414 28184 16014 15187 11445 7070 1186 -3173 -4060 1303 413 -2606 -6450 -9835 -17028 -15853
5727a5853J7622n120K749n06J26p975L807p879q38R981M662j0848q078m549M337
$$ -15853 1769 -3351 -602 -1108 -982 -8957 -5150 -13029 -13867 -3886 776 -10072 -18150 -22699 -18362
5712a8362o299L592R985k4o955q5O844K903P554P526j58j3640p652o86J2441Q004
$$ -18362 -24661 -21069 -11084 -11108 -18063 -18148 -11304 -8401 -847 6679 6521 -7119 -14771 -15457 -3016 4988
5696D988j984J316r476j6248L399J777j0009N206K726L86k224P877O651q106k031
$$ 4988 3004 4320 -5156 -21404 -18005 -16228 -26237 -21031 -18305 -17919 -20143 -12266 -5615 -13721 -15752
5681a5752O775k33L271n852Q861J0153M191j40o51k900m061j4249j3320k330n626
$$ -15752 -8977 -9210 -5939 -11791 -2930 7223 11414 11274 10623 7723 3662 -10587 -23907 -26237 -31863
5666c1863M704O466N378p076R460J2332J2694n986p596J2024M853j578k143o172
$$ -31863 -27159 -20693 -15315 -22391 -12931 -599 12095 6109 -1487 10537 15390 13812 11669 5497
5652E497m838O233J491j6245j0672N632J1365J1391O472l977q556q168K825O497
$$ 5497 659 6892 8383 -7862 -18534 -12902 -1537 9854 16326 12349 3793 -4375 -1550 4947
5638D947j331n271n593Q523n980q610q584K52n410J6050R695q087p336k109q718
$$ 4947 3616 -1655 -7248 1275 -4705 -13315 -21899 -21647 -27057 -11007 -1312 -9399 -16735 -18844 -27562
5623b7562R805J2717m881k549Q251J206p537l4j582k853k906j162l594j4012J183
$$ -27562 -17757 -5040 -9921 -12470 -4219 -3013 -10550 -10584 -12166 -15019 -17925 -19087 -22681 -36693 -35510
5608c5510J3314L705K618N426q913P459J0976j2669P699J6722Q679o275j1970
$$ -35510 -22196 -18491 -15873 -10447 -19360 -11901 -925 -13594 -5895 10827 19506 13231 1261
5595A261q173r941K6929O038j3890K233L56k790q103k611k1451K233Q125J478
$$ 1261 -6912 -16853 10076 16114 2224 4457 4813 2023 -6080 -8691 -30142 -27909 -19784 -18306
5581a8306k670Q214K09l606o89P277Q872J2159o015l041N525m414r390q686J5891
$$ -18306 -20976 -12762 -12553 -16159 -16848 -9571 -699 11460 5445 2404 7929 3515 -5875 -14561 1330
5566A330J1727n825l6147J49J2477J2835K088j8157R977K115J0446L819L545k103
$$ 1330 13057 7232 -28915 -28766 -16289 -3454 -1366 -19523 -9546 -7431 3015 6834 10379 8276
5552H276p478l356m715L867R293p978j1110j304J5119j0706q199J1061L858j7518
$$ 8276 798 -2558 -7273 -3406 5887 -2091 -13201 -14505 614 -10092 -18291 -7230 -3372 -20890
5538b0890J6335L423m209q056q561l495J0953J1113p695Q742J1770r877j0615
$$ -20890 -4555 -1132 -5341 -13397 -21958 -25453 -14500 -3387 -11082 -2340 9430 -447 -11062
5525a1062m375J0488P687M440R252j645k6P693k313l907j2086j129k953k737j647
$$ -11062 -15437 -4949 2738 7178 16430 14785 14759 22452 20139 16232 4146 3017 64 -2673 -4320
5510d320K195P769r65n853K809P500M302p7j7189K567j912j5360M941q04L068
$$ -4320 -2125 5644 4679 -1174 1635 9135 13437 13360 -3829 -1262 -3174 -18534 -13593 -14397 -11329
5495a1329R225L432q417l655L424O485k826o673j207j0526n182Q531R867J193
$$ -11329 -2104 1328 -7089 -10744 -7320 -835 -3661 -10334 -11541 -22067 -27249 -18718 -8851 -7658
5481g658K041o333K441r385L747L091N856j436m300R19M939J0120O525k648j2701
$$ -7658 -5617 -11950 -9509 -18894 -15147 -12056 -6200 -7636 -11936 -11017 -6078 4042 10567 7919 -4782
5466d782j9133M806Q214Q51k912J4081O293n909o784O374n133j187J071p770n249
$$ -4782 -23915 -19109 -10895 -10044 -12956 1125 7418 1509 -5275 1099 -4034 -5221 -4150 -11920 -17169
5451a7169J0657J1597P219j3076l814k552M196j463l344O997J835r859J027o148
$$ -17169 -6512 5085 12304 -772 -4586 -7138 -2942 -4405 -7749 -752 1083 -8776 -7749 -13897
5437a3897r219N811J1045J4680J1604j0439m38M205q666o008J486l98P190p400
$$ -13897 -23116 -17305 -6260 8420 20024 9585 9147 13352 4686 -1322 164 -234 6956 -444
5423d44j1146K993J0120N386n379k887M22o301l542m208r540m741N166N582J4960
$$ -444 -11590 -8597 1523 6909 1530 -1357 -935 -7236 -10778 -14986 -24526 -29267 -24101 -18519 -3559
5408c559L442j5662q011L701J1219J7859P542j3650j5579K607Q305J2091j3739
$$ -3559 -117 -15779 -23790 -20089 -8870 8989 16531 2881 -12698 -10091 -1786 10305 -3434
5395c434p6K309J0039j4403o197q43O786J4805m726j4991N205J505k312L658r396
$$ -3434 -3510 -1201 8838 -5565 -11762 -12605 -5819 8986 4260 -10731 -5526 -4021 -6333 -2675 -12071
5380a2071L696Q905m363j904N448r8l234j2868O144M867N130p587K52R05q2j968
$$ -12071 -8375 530 -3833 -5737 -289 -387 -3621 -16489 -10345 -5478 -348 -7935 -7683 -6778 -6860 -8828
5364h828N317j8569r188N75O15J2705J2817J068J483L939J394O738p968j5072
$$ -8828 -3511 -22080 -31268 -30693 -30078 -17373 -4556 -3488 -2005 1934 3328 10066 2098 -12974
5350a2974q254L795o06n619N373P657K260K3555k857o887r954R291R689j2075
$$ -12974 -21228 -17433 -18039 -23658 -18285 -10628 -8368 15187 12330 5443 -4511 4780 14469 2394
5336B394k2302q38J9402J9835o519n126m700N558n7k156j5677r718r334j633K41
$$ 2394 -19908 -20746 -1344 18491 11972 6846 2146 7704 7647 5491 -10186 -19904 -29238 -30871 -30630
5321c0630J5777r397q431O067K115R193J1373R598P247m078J086K288o708j2394
$$ -30630 -14853 -24250 -32681 -26614 -24499 -15306 -3933 5665 12912 8834 9920 12208 5500 -6894
5307f894p486N172n056N355k969j145k304m702j034K7622J2511j2742j0346R061
$$ -6894 -14380 -9208 -14264 -8909 -11878 -13023 -15327 -20029 -21063 6559 19070 6328 -4018 5043
5293E043R17l831J1261m929n921l370Q502N00m720R295j3668r477Q71L541j2322
$$ 5043 5960 2129 13390 8461 2540 -830 7672 8172 3452 12747 -921 -10398 -9527 -5986 -18308
5278a8308k001o765M399L493J185m477l237K005j986J703Q083N184j159O395J1856
$$ -18308 -20309 -27074 -22675 -19182 -17997 -22474 -25711 -23706 -25692 -23989 -15906 -10722 -11881 -5486 6370
5263F370N21K880k329k341k814L355k456j1495R674j0781J528J154j6297m738
$$ 6370 6891 9771 7442 5101 2287 5642 3186 -8309 1365 -9416 -7888 -6734 -23031 -27769
5249b7769J2437K0545j623j0675j1694o089J437P560m591M531O834o764J645O797
$$ -27769 -15332 5213 3590 -7085 -18779 -24868 -23431 -15871 -20462 -15931 -9097 -15861 -14216 -7419
5235g419Q345k126l14n930J415O420J6346J682k503q857j223R30j2075j1413J1684
$$ -7419 926 -1200 -1514 -7444 -6029 391 16737 18419 15916 7059 5836 6766 -5309 -16722 -5038
5220e038J2453n641K671N2J2176K754j0749m764J0228n907o874j612j0644m840
$$ -5038 7415 1774 4445 4497 16673 19427 8678 3914 14142 8235 1361 -251 -10895 -15735
5206a5735P371j089O930N787j8523j5774k910J0618K6747J2281o047j5211j0639
$$ -15735 -8364 -9453 -2523 3264 -15259 -31033 -33943 -23325 3422 15703 9656 -5555 -16194
5193a6194L973J523J1048p70J2991n004n880j10O072N561M345l160Q621j2081
$$ -16194 -12221 -10698 350 -420 12571 7567 1687 1577 7649 13210 17555 14395 23016 10935
5179A0935j8229l59J4590M489O801M200o205j5134L507P354m801p497l49J726
$$ 10935 -7294 -7653 6937 11426 18227 22427 16222 1088 4595 11949 7148 -349 -698 1028
5165A028m663j2586p219O2J067j696j717Q683J7912m903j0084J552R72l833rJ1612
$$ 1028 -3635 -16221 -23440 -23378 -22311 -24007 -25724 -17041 871 -4032 -14116 -12564 -11592 -15425 -15434 -3822
5149c822O453N081j534j6448n627K139J013K747J7429j604j5720l802J4774r023
$$ -3822 2631 7712 6178 -10270 -15897 -13758 -12745 -9998 7431 5827 -9893 -13695 1079 -7944
5135g944N75j940P038Q890M168N434j4425J245J8737n183j7796n891k695N429
$$ -7944 -7369 -9309 -2271 6619 10787 16221 1796 3041 21778 16595 -1201 -7092 -9787 -4358
5121d358J700j1079n401r88l675L417o913R736J9661N913q371j1012m884m911
$$ -4358 -2658 -13737 -19138 -20126 -23801 -20384 -27297 -17561 2100 8013 -358 -11370 -16254 -21165
5107b1165J0567J5640j21j159P701p691Q260J3435n815p26j0068j1661q064R07
$$ -21165 -10598 5042 4921 3762 11463 3772 12032 25467 19652 18926 8858 -2803 -10867 -9960
5093i960j478O152J4175p171l852m154p119M570R837P621J0038p408r570p705
$$ -9960 -11438 -5286 8889 1718 -2134 -6288 -13407 -8837 1000 8621 18659 11251 1681 -6024
5079f024l829k062n404Q7l242j188L603J716O639r358j0216P629N188K736P079
$$ -6024 -9853 -11915 -17319 -17232 -20474 -21662 -18059 -16343 -9704 -19062 -29278 -21649 -16461 -13725 -6646
5064f646J2496m043o353J405J9735N00j6747j5052K477k652j899r793O461Q501
$$ -6646 5850 1807 -4546 -3141 16594 17094 347 -14705 -12228 -14880 -16779 -26572 -20111 -11610
5050a1610J0728n640o486J2442P55o708r927q539N393N911N487M674k35M676q073
$$ -11610 -882 -6522 -13008 -566 189 -6519 -16446 -24985 -19592 -13681 -8194 -3520 -3755 921 -7152
5035g152n545L056J744p555J627M319R236M798K533K235j2942m306K339Q643M349
$$ -7152 -12697 -9641 -7897 -15452 -13825 -9506 -270 4528 7061 9296 -3646 -7952 -5613 3030 7379
5020G379n155J0053m715r920j3168J362j169j4952J09R82K0664Q139j025p421
$$ 7379 2224 12277 7562 -2358 -15526 -14164 -15333 -30285 -30176 -29194 -8530 -391 -1416 -8837
5006h837j512R49Q4p065N87K464O399l924Q822k527j2097p419M988J9618k492
$$ -8837 -10349 -9400 -9316 -16381 -15794 -13330 -6931 -10855 -2033 -4560 -16657 -24076 -19088 530 -1962
4991a962j7031O524P610M168J750k212J6524K617p553l464l420j3709Q671J2270
$$ -1962 -18993 -12469 -4859 -691 1059 -1153 15371 17988 10435 6971 3551 -10158 -1487 10783
4977A0783j6307J380m315o569R965J275K195L044J665l290p60r38m581n265M234
$$ 10783 -5524 -4144 -8459 -15028 -5063 -3788 -1593 1451 3116 -174 -934 -1872 -6453 -11718 -7484
4962g484M327k903O85n306J0024J2199j0946j2238r58m572N151O039k214r04P25
$$ -7484 -3157 -6060 -5375 -10681 -657 11542 596 -11642 -12600 -17172 -12021 -5982 -8196 -9100 -8375
4947h375J0154q500l976r485K86j3972K458K7748m550j6853O612R707L030N933
$$ -8375 1779 -6721 -10697 -20182 -19896 -33868 -31410 -3662 -8212 -25065 -18453 -8746 -5716 217
4933B17Q061P83M15o987j6833r735n665M066J0099j815j0372m187P422j352O379
$$ 217 8278 9061 9476 2489 -14344 -24079 -29744 -25678 -15579 -17394 -27766 -31953 -24531 -25883 -19504
4918a9504j44P276J4844J1416q129m073M132r405j3417n688R371O126m555m180
$$ -19504 -19648 -12372 2472 13888 5759 1686 5818 -3587 -17004 -22692 -13321 -7195 -11750 -15930
4904a5930J275J0078R588O340o913P520j803k114P876o683k1055m115N863l63
$$ -15930 -14655 -4577 5011 11351 4438 11958 10155 8041 15917 9234 -11821 -15936 -10073 -10436
4890a0436J3787p15j167p621L048K425p490k882j228N6k975N261J1047l702k175
$$ -10436 3351 2636 1469 -6152 -3104 -679 -8169 -11051 -12279 -12223 -15198 -9937 1110 -2592 -4767
4875d767p253j1458k519M107K3039J212j1621Q916R045j844r559q656m980m470
$$ -4767 -12020 -23478 -25997 -21890 1149 2361 -9260 -344 8701 6857 -2702 -11358 -16338 -20808
4861b0808K892K345L764N064R125j8J260m399k466l690J143J0635J049L68l229
$$ -20808 -17916 -15571 -11807 -6743 2382 2364 3624 -775 -3241 -6931 -5788 4847 5896 6264 3035
4846C035j0824r492J0787L286o593l093L994M657J0546j5170j9320l973J2957
$$ 3035 -7789 -17281 -6494 -3208 -9801 -12894 -8900 -4243 6303 -8867 -28187 -32160 -19203
4833a9203R335j4522n044j166R778J2526j0726K613J6587k999o158J3994O932
$$ -19203 -9868 -24390 -29434 -30600 -20822 -8296 -19022 -16409 178 -2821 -8979 5015 11947
4820A1947m627l62j5583n893k817K151k023p17L42J0179M249P904q73l393L022
$$ 11947 7320 6958 -8625 -14518 -17335 -15184 -17207 -17924 -17582 -7403 -3154 4750 3877 484 3506
4805C506k676j796j2986K482K467m19k775r477L558o183J6623J9856r765j3328
$$ 3506 830 -966 -13952 -11470 -9003 -9422 -12197 -21674 -18116 -24299 -7676 12180 2415 -10913
4791a0913n161P644J3150l282J0227m582j0614k187l756q451O798J1882j1826
$$ -10913 -16074 -8430 4720 1438 11665 7083 -3531 -5718 -9474 -17925 -11127 755 -11071
4778a1071j2694j0641J1079K1486R630l612m068m819n354Q174K830j7588o621
$$ -11071 -23765 -34406 -23327 -1841 7789 4177 109 -4710 -10064 -1890 940 -16648 -23269
4765b3269Q131p269k345N309N859K0617M083p222M089q66j5610j2066o721J1075
$$ -23269 -15138 -22407 -24752 -19443 -13584 7033 11116 3894 7983 7117 -8493 -20559 -27280 -16205
4751a6205Q555l061M344l0R24R020J2691p15j4614j135K042N590p617l744M075
$$ -16205 -7650 -10711 -6367 -6397 -5473 3547 16238 15523 909 -226 1816 7406 -211 -3955 120
4736A20n130j1681L677m59p62N439J655j3505J267j0527J2092l927P1R363J5484
$$ 120 -5010 -16691 -13014 -13473 -14235 -8796 -7141 -20646 -19379 -29906 -17814 -21741 -21670 -12307 3177
4721C177K407p852j2182J267L161J1103N345q678k5397L861L334N57O701N106
$$ 3177 5584 -2268 -14450 -13183 -10022 1081 6426 -2252 -27649 -23788 -20454 -19897 -13196 -8090
4707h090j2025l320R70K308J713M040P518J475j4108O422K2586J133j1480o937
$$ -8090 -20115 -23435 -22465 -20157 -18444 -14404 -6886 -5411 -19519 -13097 9489 10622 -858 -7795
4693g795P99K701L977j5205N179Q687J2385L436j3388k799J61r200R221J6746
$$ -7795 -6996 -4295 -318 -15523 -10344 -1657 10728 14164 776 -2023 -1862 -11062 -1841 14905
4679A4905L534m366J630j0909j3679J080k964j524j537K555P169Q164r798j3894
$$ 14905 18439 14073 15703 4794 -8885 -7805 -10769 -12293 -13830 -11275 -4106 4058 -5740 -19634
4665a9634K495J9471k146k3119p458R742J1678J763n843k741k041J008j888j008
$$ -19634 -17139 2332 186 -22933 -30391 -20649 -8971 -7208 -13051 -15792 -17833 -16825 -18713 -19721
4651a9721j771J3444M42q142j0685M874J0116P607k253Q487m213K485l910L083
$$ -19721 -21492 -8048 -7606 -15748 -26433 -21559 -11443 -3836 -6089 2398 -1815 670 -3240 -157
4637a57j064J252K384O147k279p488K302J3528K759j509j2643j3232j2202J3517
$$ -157 -1221 31 2415 8562 6283 -1205 1097 14625 17384 15875 3232 -10000 -22202 -8685
4623h685Q331J0498L966n024M510j8096j1809J0314P248q619N259K922O006J1395
$$ -8685 -354 10144 14110 9086 13596 -4500 -16309 -5995 1253 -7366 -2107 815 6821 18216
4609A8216j3248j2504J189m207j504M305M697n399J0421o707k2800P125J3075
$$ 18216 4968 -7536 -6347 -10554 -12058 -7753 -3056 -8455 1966 -4741 -27541 -20416 -7341
4596g341J1145jl086K369J8673j82J885j2209j0762L426O240r344j0914l582j2956
$$ -7341 3804 3803 717 3086 21759 21577 23462 11253 491 3917 10157 813 -10101 -13683 -26639
4581b6639j3798O446R405K330O20o372M965N744J5631J0888k086r204n427J0926
$$ -26639 -40437 -33991 -24586 -22256 -21636 -28008 -23043 -17299 -1668 9220 7134 -2070 -7497 3429
4567C429P702p665M83p375P289M048j0068M377Q227J205q976J2882m153m311j4214
$$ 3429 11131 3466 3949 -3426 3863 7911 -2157 2220 10447 11652 2676 15558 11405 7094 -7120
4552g120j3088j668N465m421o952O559R696j571J0641O678L368N951K473m834
$$ -7120 -20208 -21876 -16411 -20832 -27784 -21225 -11529 -13100 -2459 4219 7587 13538 16011 11177
4538A1177J340J260m982j0687k211M011N356O5j0985j6528q958J1049J4235M913
$$ 11177 12517 13777 8795 -1892 -4103 -92 5264 5329 -5656 -22184 -31142 -20093 -5858 -945
4524i45N969k729m967o278j2551p618J1286o145o929J7070J5015k215R607O999
$$ -945 5024 2295 -2672 -8950 -21501 -29119 -17833 -23978 -30907 -13837 1178 -1037 8570 15569
4510A5569j365n948j107j769l271M36p359L280p819j2108M829P524L156j0969
$$ 15569 14204 8256 7149 5380 2109 2545 -4814 -1534 -9353 -21461 -16632 -9108 -5952 -16921
4496a6921j1983J6140M321L315j1286P734J5071K613n812p923O910o757j835M194
$$ -16921 -28904 -12764 -8443 -5128 -16414 -8680 6391 9004 3192 -4731 2179 -4578 -6413 -2219
4482b219m861j1110N279O294J0814R109J654k238o58j140r747k227r707r624O960
$$ -2219 -7080 -18190 -12911 -6617 4197 13306 14960 12722 12064 10924 1177 -1050 -10757 -20381 -13421
4467a3421m124o425p847n517Q214q74Q454N906k261k2R80L313r61q03J4302J2480
$$ -13421 -17545 -23970 -31817 -37334 -29120 -29994 -21540 -15634 -17895 -17917 -16937 -13624 -14585 -15388 -1086 11394
4451A1394n269j0630n884L961m194j4403K621N557l939J988n325Q798K462n169
$$ 11394 6125 -4505 -10389 -6428 -10622 -25025 -22404 -16847 -20786 -18798 -24123 -15325 -12863 -18032
4437a8032K4286R085q544q61j402p627j4518L695O484n466j5087P313Q728R16
$$ -18032 6254 15339 6795 5934 4532 -3095 -17613 -13918 -7434 -12900 -27987 -20674 -11946 -11030
4423a1030J994p236m938r2J0032K100K008M842J616j175n193k760M537O129M608
$$ -11030 -9036 -16272 -21210 -21302 -11270 -9170 -7162 -2320 -704 -1879 -7072 -9832 -5295 834 5442
4408E442j0056j7506N867J899O258J5046J1517L854j344j5167j4377R537j864
$$ 5442 -4614 -22120 -16253 -14354 -8096 6950 18467 22321 20977 5810 -8567 970 -894
4395h94L605j995r752j2962J0287J0909j1704k475M601Q20L530J0603M280p88
$$ -894 2711 716 -9036 -21998 -11711 -802 -12506 -14981 -10380 -9560 -6030 4573 8853 8065
4381H065k698j347j830P409M236N96k018j6114O247m91r02K383l639r047P65L456
$$ 8065 5367 4020 2190 9599 13835 14431 12413 -3701 2546 2055 1153 3536 -103 -9150 -8385 -4929
4365d929k493n584j1285j757K1421J9464k1290j2687J6244Q127k168M342k965
$$ -4929 -7422 -13006 -24291 -26048 -4627 14837 -6453 -19140 -2896 5231 3063 7405 4440
4352D440l797J5768j0593j1668J0056o048n105J4767Q016l593l045N856J37n017
$$ 4440 643 16411 5818 -5850 4206 -1842 -6947 7820 15836 12243 9198 15054 15191 10174
4338A0174j9183m368K4288J3194l315p976j3317M158O931j7384q244M48O816K058
$$ 10174 -9009 -13377 10911 24105 20790 12814 -503 3655 10586 -6798 -15042 -14594 -7778 -5720
4324e720k336N693p306p442k541P080j122j510J4433Q812P863K548j2960k488
$$ -5720 -8056 -2363 -9669 -17111 -19652 -12572 -13694 -15204 -771 8041 15904 18452 5492 3004
4310C004J740j054m96K407r55r062j1211k159J5503J1013n777o963O093K160j1269
$$ 3004 4744 3690 3194 5601 4646 -4416 -15627 -17786 -2283 8730 2953 -4010 2083 4243 -7026
4295g026p569K485o039N458K234j3204P158N622q409J676j256J77M13N814M510
$$ -7026 -14595 -12110 -18149 -12691 -10457 -23661 -16503 -10881 -19290 -17614 -18870 -18693 -18280 -12466 -7956
4280g956m232j715J1449L385M277k1471j1505J0546L950R800l079N760J955o483
$$ -7956 -12188 -13903 -2454 931 5208 -16263 -27768 -17222 -13272 -3472 -6551 -791 1164 -5319
4266e319J1880J690K328j0049r355m925Q532Q208l714Q488M614j4807j443p861
$$ -5319 6561 8251 10579 530 -8825 -13750 -5218 2990 -724 7764 12378 -2429 -3872 -11733
4252a1733M661j75J975J6153M077k534r612p320j3721j8678l395L809J8497J611
$$ -11733 -7072 -7247 -5272 10881 14958 12424 2812 -4508 -18229 -36907 -40302 -36493 -17996 -16385
$$ [...]
##END NTUPLES=NMR SPECTRUM
##END=
