##TITLE=Analysis number 328828
Compound Code cc 09701
Book Reference lab3
Project Code adrs
Chemist Name stores
##JCAMPDX= 6.0         $$ Bruker NMR JCAMP-DX V2.0
##DATA TYPE= NMR SPECTRUM
##DATA CLASS= NTUPLES
##ORIGIN= Bruker BioSpin GmbH
##OWNER= nmr
$$ XWIN-NMR		Version 3.5
$$ Fri Jul  6 11:45:41 2007 GMT Daylight Time (UT+1h)  MAYBRIDGE\nmr@NMR_250MHZ
##.OBSERVE FREQUENCY= 250.131544655141
##.OBSERVE NUCLEUS= ^1H
##.ACQUISITION MODE= SIMULTANEOUS (DQD)
##.ACQUISITION SCHEME= undefined
##.AVERAGES= 16
##.DIGITISER RES= 18
##SPECTROMETER/DATA SYSTEM= dpx250
##.PULSE SEQUENCE= zg30
##.SOLVENT NAME= DMSO
##.SHIFT REFERENCE= (INTERNAL, DMSO, 0, 16.522)
##AUDIT TRAIL= $$ (NUMBER, WHEN, WHO, WHERE, WHAT)
$$ ##TITLE= Audit trail, XWIN-NMR		Version 3.5
$$ ##JCAMPDX= 5.01
$$ ##ORIGIN= Bruker BioSpin GmbH
$$ ##OWNER= nmr
$$ C:\u/data/dgb/nmr/ADRS/560/pdata/1/auditp.txt
$$ ##AUDIT TRAIL=  $$ (NUMBER, WHEN, WHO, WHERE, WHAT)
(   1,<2007-07-06 11:45:09.37 +100>,<MAYBRIDGE\nmr>,<NMR_250MHZ>,
      <created by zg, POWCHK disabled, PULCHK disabled
       configuration hash MD5:
       76 6E 9A 78 1E 09 19 81 EC 84 63 8F B0 6A 59 2D
       data hash MD5: 64K
       6D 74 F7 2E 43 19 48 9A 92 4B 53 E2 14 43 CF A6>)
(   2,<2007-07-06 11:45:28.68 +100>,<MAYBRIDGE\nmr>,<NMR_250MHZ>,
      <Start of raw data processing
       ef LB = 0.3 FT_mod = 6 PKNL = 1 SI = 32K 
       data hash MD5: 32K
       7E F6 5B D5 9A 9A CB 6C 03 FE 24 26 9B FD 44 F1>)
(   3,<2007-07-06 11:45:30.38 +100>,<MAYBRIDGE\nmr>,<NMR_250MHZ>,
      <apk 
       data hash MD5: 32K
       1B 7A 2F B6 DF 58 99 27 CF 68 E4 5E 29 40 1F 19>)
(   4,<2007-07-06 11:45:31.13 +100>,<MAYBRIDGE\nmr>,<NMR_250MHZ>,
      <abs ABSG = 5 
       data hash MD5: 32K
       CC B7 BD AD 67 60 5F 74 18 51 70 FF 7C 11 40 99>)
$$ ##END=
$$ 
$$ hash MD5
$$ 7D 97 52 AB A4 39 E9 0C E5 D2 93 2F 7B 4E 30 21
##$RELAX= 
##$RELAX= 
##$RELAX= 
##$RELAX= 
##$RELAX= 
##$RELAX= 
##$RELAX= 
$$ Bruker specific parameters
$$ --------------------------
##$DU= <C:\u>
##$EXPNO= 560
##$NAME= <ADRS>
##$PROCNO= 1
##$TYPE= <nmr>
##$USER= <dgb>
##$AMP= (0..31)
100 100 100 100 100 100 100 100 100 100 100 100 100 100 100 100 100 100 
100 100 100 100 100 100 100 100 100 100 100 100 100 100 
##$AQSEQ= 0
##$AQ_mod= 3
##$AUNM= <au_zg>
##$AUTOPOS= <15 >
##$BF1= 250.13
##$BF2= 250.13
##$BF3= 250.13
##$BF4= 250.13
##$BF5= 500.13
##$BF6= 500.13
##$BF7= 500.13
##$BF8= 500.13
##$BYTORDA= 1
##$CFDGTYP= 0
##$CFRGTYP= 5
##$CHEMSTR= <none>
##$CNST= (0..31)
1 1 145 1 1 1 1 1 1 1 1 1 1 1 1 1 1 1 1 1 1 1 1 1 1 1 1 1 1 1 1 1 
##$CPDPRG= <>
##$CPDPRG1= <>
##$CPDPRG2= <>
##$CPDPRG3= <>
##$CPDPRG4= <mlev>
##$CPDPRG5= <mlev>
##$CPDPRG6= <mlev>
##$CPDPRG7= <mlev>
##$CPDPRG8= <mlev>
##$CPDPRGB= <>
##$CPDPRGT= <>
##$D= (0..31)
0 1 0 0 0 0 0 0 0 0.06 0 0 0 0 0 0 0.0002 0 0 0 0 0 0 0 0 0 0 0 0 0 0 
0 
##$DATE= 1183718707
##$DBL= (0..7)
120 120 120 120 120 120 120 120 
##$DBP= (0..7)
150 150 150 150 150 150 150 150 
##$DBP07= 0
##$DBPNAM0= <>
##$DBPNAM1= <>
$$ [...]
##$SUBNAM7= <"">
##$SUBNAM8= <"">
##$SUBNAM9= <"">
##$SW= 20.6930455092707
##$SWIBOX= (0..15)
0 0 3 0 0 0 0 0 0 0 0 0 0 0 0 0 
##$SW_h= 5175.983436853
##$TD= 65536
##$TD0= 1
##$TE= 296.16
##$TE2= 300
##$TE3= 300
##$TEG= 300
##$TL= (0..7)
0 120 120 120 120 120 120 120 
##$TP= (0..7)
150 150 150 150 150 150 150 150 
##$TP07= 0
##$TPNAME0= <>
##$TPNAME1= <>
##$TPNAME2= <>
##$TPNAME3= <>
##$TPNAME4= <>
##$TPNAME5= <>
##$TPNAME6= <>
##$TPNAME7= <>
##$TPOAL= (0..7)
0.5 0.5 0.5 0.5 0.5 0.5 0.5 0.5 
##$TPOFFS= (0..7)
0 0 0 0 0 0 0 0 
##$TUNHIN= 0
##$TUNHOUT= 0
##$TUNXOUT= 0
##$USERA1= <user>
##$USERA2= <user>
##$USERA3= <user>
##$USERA4= <user>
##$USERA5= <user>
##$V9= 5
##$VALIST= <valist>
##$VCLIST= <CCCCCCCCCCCCCCC>
##$VD= 0
##$VDLIST= <DDDDDDDDDDDDDDD>
##$VPLIST= <PPPPPPPPPPPPPPP>
##$VTLIST= <TTTTTTTTTTTTTTT>
##$WBST= 1024
##$WBSW= 4
##$XGAIN= (0..3)
0 0 0 0 
##$XL= 0
##$YL= 0
##$YMAX_a= 296295
##$YMIN_a= -229518
##$ZGOPTNS= <>
##$ZL1= 120
##$ZL2= 120
##$ZL3= 120
##$ZL4= 120
##$ABSF1= 16.522
##$ABSF2= -4.171173
##$ABSG= 5
##$ABSL= 3
##$ALPHA= 0
##$AQORDER= 0
##$ASSFAC= 0
##$ASSFACI= 0
##$ASSFACX= 0
##$ASSWID= 0
##$AUNMP= <proc_1d>
##$AZFE= 0.1
##$AZFW= 0.1
##$BCFW= 0
##$BC_mod= 0
##$BYTORDP= 0
##$COROFFS= 0
##$CY= 12.5
##$DATMOD= 1
##$DC= 0
##$DFILT= <>
##$DTYPP= 0
##$F1P= 14.0000005364418
##$F2P= -0.99999901652339
##$FCOR= 0.5
##$FTSIZE= 32768
##$FT_mod= 6
##$GAMMA= 0
##$GB= 0
##$INTBC= 1
##$INTSCL= 1
##$ISEN= 128
##$LB= 0.3
##$LEV0= 0
##$LPBIN= 0
##$MAXI= 10000
##$MC2= 0
##$MEAN= 0
##$ME_mod= 0
##$MI= 0
##$NCOEF= 0
##$NC_proc= -5
##$NLEV= 6
##$NOISF1= 0
##$NOISF2= 0
##$NSP= 0
##$NTH_PI= 0
##$NZP= 0
##$OFFSET= 16.522
##$PC= 1
##$PHC0= -61.03471
##$PHC1= 10.00478
##$PH_mod= 1
##$PKNL= yes
##$PPARMOD= 0
##$PSCAL= 4
##$PSIGN= 0
##$REVERSE= no
##$SF= 250.13
##$SI= 32768
##$SIGF1= 0
##$SIGF2= 0
##$SINO= 400
##$SIOLD= 32768
##$SREGLST= <1H.DMSO>
##$SSB= 0
##$STSI= 32768
##$STSR= 0
##$SW_p= 5175.98343685301
##$SYMM= 0
##$S_DEV= 0
##$TDeff= 65536
##$TDoff= 0
##$TI= <Analysis number 999999
Compound Code 99
Book Reference 9
Project Code 9>
##$TILT= no
##$TM1= 0
##$TM2= 0
##$TOPLEV= 0
##$USERP1= <user>
##$USERP2= <user>
##$USERP3= <user>
##$USERP4= <user>
##$USERP5= <user>
##$WDW= 1
##$XDIM= 32768
##$YMAX_p= 537201820
##$YMIN_p= -566897
$$ End of Bruker specific parameters
$$ ---------------------------------
##NTUPLES= NMR SPECTRUM
##VAR_NAME=  FREQUENCY,     SPECTRUM/REAL,   SPECTRUM/IMAG
##SYMBOL=    X,             R,               I
##VAR_TYPE=  INDEPENDENT,   DEPENDENT,       DEPENDENT
##VAR_FORM=  AFFN,          ASDF,            ASDF
##VAR_DIM=   32768,         32768,           32768
##UNITS=     HZ,            ARBITRARY UNITS, ARBITRARY UNITS
##FACTOR=    0.157963299565203, 1,           1
##FIRST=     4132.6476996994, 0,             0
##LAST=      -1043.33573715361, 0,           0
##MIN=       -1043.33573715361, -566897,     0
##MAX=       4132.6476996994, 537201820,     0
$$ Real data points
##PAGE= N=1
##DATA TABLE= (X++(R..R)), XYDATA
$$ [...]
25677A56605m9490j53513j16860L2428Q7970r4312r6670J51683J64761P8370j22339
$$ 156605 107115 -46398 -163258 -130830 -42860 -137172 -233842 -82159 82602 160972 38633
25666C8633r1190M5521q4794k19900J935J57256J26727L6632n4028N8009m5345
$$ 38633 -52557 -7036 -91830 -311730 -309795 -152539 -25812 10820 -43208 14801 -30544
25655c0544J4483N8834j6051j25320j06222P3743J2608m5509P7982O8248k9164
$$ -30544 -16061 42773 26722 -98598 -204820 -131077 -118469 -163978 -85996 -17748 -46912
25644d6912Q6542l104O106J4285J12676p4612k0028K06565o907p9590j91326p7124
$$ -46912 39630 36526 42632 56917 169593 94981 74953 281518 274611 195021 3695 -73429
25632g3429N3097J39058o783r3218l1481o4182p9063j24044l1284J19363K11399
$$ -73429 -20332 118726 111943 18725 -12756 -76938 -156001 -280045 -311329 -191966 19433
25621A9433J077Q3698J7342r5393R2463L7675p8052Q9779J44085j27959j31619
$$ 19433 20510 104208 121550 26157 118620 156295 78243 168022 312107 184148 52529
25610E2529J15068J4667l7068j10660q648j61977j6257M0835O5158M4924P7132
$$ 52529 167597 182264 145196 34536 25888 -136089 -152346 -111511 -46353 -1429 75703
25599G5703j02667K5279m3079o8939R7863J20229r8824n64j13153r2901J31792
$$ 75703 -26964 -1685 -44764 -113703 -15840 104389 5565 5001 -108152 -201053 -69261
25588f9261L4901L1436n5337p3796p4016J09030J3497K3077Q6760Q77l2429M8734
$$ -69261 -34360 -2924 -58261 -132057 -206073 -97043 -83546 -60469 26291 27168 -5261 43473
25576D3473L7873j13687n0142m1608Q4551R4278m2748L1139J90270k3453n8098
$$ 43473 81346 -32341 -82483 -124091 -39540 54738 11990 43129 233399 209946 151848
25565A51848P776r3159j5879K2536j24935o0334R3090O6304j01049n9313p6703
$$ 151848 159624 66465 50586 73122 -51813 -112147 -19057 47247 -53802 -113115 -189818
25554a89818L5410N1039J3120l1961Q2076q8415Q876P8654k7588M1074r642J51098
$$ -189818 -154408 -103369 -90249 -122210 -40134 -128549 -119673 -41019 -68607 -27533 -37175 113923
25542A13923K5854r682o4954j10790o656j24359R080Q5118P4651Q3396p5248k60736
$$ 113923 139777 130095 65141 -45649 -52305 -176664 -167584 -82466 -7815 75581 333 -260403
25530b60403o3731J95820N6382m7747Q5148O8095q6467j02225j4028o2396l2586
$$ -260403 -324134 -128314 -71932 -119679 -34531 33564 -52903 -155128 -169156 -231552 -264138
25519b64138J7204L232n1777O7771K8601n5127J49111J76495N4247j7369r3576
$$ -264138 -246934 -243702 -295479 -227708 -199107 -254234 -105123 71372 125619 108250 14674
25508A4674m392k5599L1224O3199n1921o0500J13615K5205Q4018p332M1550j43936
$$ 14674 10282 -15317 15907 79106 27185 -33315 80300 105505 189523 182191 223741 79805
25496G9805q9201n1185j12494L1660m6018l1897J00554j43034K7334J7634J45829
$$ 79805 -9396 -60581 -173075 -141415 -187433 -219330 -118776 -261810 -234476 -216842 -71013
25485g1013P0422J8437J18380j77722j81771L5141L7682L3163j9961J10990P8147
$$ -71013 -591 17846 136226 -41496 -223267 -188126 -150444 -117281 -137242 -26252 51895
25474E1895n0597j91351m7409K22326J37856P4661l226j14600Q2849n3486q8301
$$ 51895 1298 -190053 -237462 -15136 122720 197381 194155 79555 162404 108918 20617
25463B0617N5562J7810j00701J57830N3421m6807R513j3981j25529j22104J1440
$$ 20617 76179 93989 -6712 151118 204539 157732 167245 153264 27735 -94369 -82929
25452h2929k3219J3265m5760o2630K37757L0459n6699k0862j07840M825M3427
$$ -82929 -106148 -92883 -138643 -201273 36484 66943 10244 -10618 -118458 -113633 -70206
25441g0206Q7602J6750k4404o685n3778r2285j672k7150J30608l1001j17336O7513
$$ -70206 17396 34146 9742 3057 -50721 -143006 -144678 -171828 -41220 -72221 -189557 -122044
25429a22044J22507K4796j01316P4325J09259n4122M8606j15951j63615P0178
$$ -122044 463 25259 -76057 -1732 107527 53405 102011 -13940 -177555 -107377
25419a07377k579k0206Q0411K56983J37043j07019j46545L3701P6113j4744o8419
$$ -107377 -109956 -130162 -49751 207232 344275 237256 90711 124412 200525 185781 117362
25408A17362K6170K9009P8227O297k41711j83259J4251O5043r839k7852J69762
$$ 117362 143532 172541 250768 257065 15354 -167905 -153654 -88611 -98450 -126302 43460
25397D3460P8405j2946J14287r0398n8744o7665J23109j1632J2686p3413q6507
$$ 43460 121865 108919 223206 132808 74064 6399 129508 117876 130562 57149 -29358
25386b9358K8922k5596p9467P8980L8153m1028q4744J2807P5439J92665O6341
$$ -29358 -436 -26032 -105499 -26519 11634 -29394 -114138 -101331 -25892 166773 233114
25375B33114N6827O244j48086k55587k9771o1538q014L1043M858R0378L783r2715
$$ 233114 289941 296185 148099 -107488 -137259 -198797 -206811 -175768 -170910 -80532 -76749 -169464
25363a69464O9328J19177Q077N4767J37877Q5170j16416k0130j07222J5975P1220
$$ -169464 -100136 19041 27118 81885 219762 304932 188516 168386 61164 77139 148359
25352A48359j02100j23131o664k7325L188K4909o8903k3708L3061N4665J31679
$$ 148359 46259 -76872 -83536 -110861 -107673 -82764 -151667 -175375 -142314 -87649 44030
25341D4030M0024m9590J523Q978n1243j586K7506J49698p7192m4833n6965L6755
$$ 44030 84054 34464 35987 44965 -6278 -7864 19642 169340 92148 47315 -9650 27105
25329B7105R711m2002N4268J32241J5993j16412Q0396j06526j28459J07424l5689
$$ 27105 36816 -5186 49082 181323 197316 80904 161300 54774 -73685 33739 -1950
25318a950j17249J04264n4592J02811O9682m9512j11455o5423N2051O3351j24559
$$ -1950 -119199 -14935 -69527 33284 102966 53454 -58001 -123424 -71373 -8022 -132581
25307a32581j58433Q1459J18623Q2298L8905o5876j21417q2503N6073k0060J45480
$$ -132581 -291014 -209555 -90932 -8634 30271 -35605 -157022 -239525 -183452 -203512 -58032
25296e8032P1327j24127L4854P3507k3527p6573J0736r2014r8137J14250M1944
$$ -58032 13295 -110832 -75978 -2471 -25998 -102571 -91835 -183849 -281986 -167736 -125792
25285a25792J14531l7109q5260J70740R7031M147j16816k6496j19697r7397P3799
$$ -125792 -11261 -48370 -133630 37110 134141 138288 21472 -5024 -124721 -222118 -148319
25274a48319M8016J45711N8517J01879j10731j83867n8386J14871o270m1061K1690
$$ -148319 -100303 45408 103925 205804 95073 -88794 -147180 -32309 -38579 -79640 -57950
25263e7950J64013k0687L50r9171J00633P1884j1254p5421M2506o9028j4573n67
$$ -57950 106063 85376 85726 -13445 87188 159072 147818 72397 114903 45875 31302 30735
25251C0735J5310R941P0742j6776n2228l9846K7620r8307r7359n9107p7721n5358
$$ 30735 46045 55986 126728 109952 57724 17878 45498 -52809 -150168 -209275 -286996 -342354
25239c42354Q54Q1494P5619J50717J8695n7410k5557j00687K2544J42597Q5479
$$ -342354 -341500 -260006 -184387 -33670 -14975 -72385 -97942 -198629 -176085 -33488 51991
25228E1991r4792N8632m7778j40505Q4439J00303q7128r1227p5513r3127R7343
$$ 51991 -42801 15831 -31947 -172452 -88013 12290 -74838 -166065 -241578 -334705 -237362
25217b37362P9225l1096N116J8271N1577J42996j8869m3071j26678L7085n8807
$$ -237362 -158137 -189233 -184117 -165846 -114269 28727 9858 -33213 -159891 -122806 -181613
25206a81613q0274o5020J05507K08446Q0927j41392k03292O7683k1171J43895
$$ -181613 -261887 -326907 -221400 -12954 67973 -73419 -276711 -209028 -230199 -86304
25196h6304J06815r7580p2582Q5094q593l6345J2967N427J31243L389k0006N777
$$ -86304 20511 -77069 -149651 -64557 -73150 -109495 -96528 -91101 40142 43531 23525 29302
25184B9302K5258j58416j7271j0105L2238J1179J8640N7852m0617m4218j48713
$$ 29302 54560 -103856 -121127 -131232 -98994 -87815 -69175 -11323 -51940 -96158 -244871
25173b44871J49191J18990R8840j36861p9560Q6664j00173l7443n8763j31548
$$ -244871 -95680 23310 122150 -14711 -94271 -7607 -107780 -145223 -203986 -335534
25163c35534l21J0919N6935J56648J00869l8417K4685L7322J4437m1246n6752
$$ -335534 -335855 -324936 -268001 -111353 -10484 -48901 -24216 13106 27543 -13703 -70455
25152g0455j22569n9063O9943K7413O1656Q9469j29283k35443n572J11236R2227
$$ -70455 -193024 -252087 -182144 -154731 -93075 -3606 -132889 -368332 -373904 -262668 -170441
25141a70441l1938J01438N035J1910L1190O4211J13627K0541K4938R462n2900
$$ -170441 -202379 -100941 -95906 -83996 -52806 11405 125032 145573 170511 179973 127073
25130A27073j28808k7834k2950Q5931M286k19638O3271K06477R8016j1639J9437
$$ 127073 -1735 -29569 -52519 33412 37698 -181940 -118669 87808 185824 174185 193622
25119A93622M5040l4203m1799p5845m0544K7283J2529o2800P6128m1162o163M3070
$$ 193622 238662 204459 162660 86815 46271 73554 86083 23283 99411 58249 52086 95156
25107I5156j02218N4944K7737p9883j04635j31463l1843k3653L2610R3706P0667
$$ 95156 -7062 47882 75619 -4264 -108899 -240362 -272205 -295858 -263248 -169542 -98875
25096i8875N7496N142K472n4883L2560j5125m1154K5645j01011j96430K5770R0982
$$ -98875 -41379 -36237 -33765 -88648 -56088 -71213 -112367 -86722 -187733 -384163 -358393 -267411
25084b67411j8091J8603M4413Q1011J44761P8231K4636j11322j4539L5061j47269
$$ -267411 -285502 -266899 -222486 -141475 3286 81517 106153 -5169 -19708 15353 -131916
25073a31916R735J60205R0417r0971q6413o7968N3502O7390J22762N6122J0042
$$ -131916 -122181 38024 128441 37470 -48943 -116911 -63409 3981 126743 182865 192907
25062A92907j80817j01697m0492K9747J37650q9900r4089J12475N4575j35031
$$ 192907 12090 -89607 -130099 -100352 37298 -52602 -146691 -34216 20359 -114672
25052a14672n8901O2707J03703K4585j49582l817J27225R9248k1370K2494J9535
$$ -114672 -173573 -110866 -7163 17422 -132160 -135977 -8752 90496 69126 91620 111155
25041A11155J26824P094k50180Q851m0090l3387L1372O6966J0394l4876m6046
$$ 111155 237979 245073 -5107 3744 -36346 -69733 -38361 28605 38999 4123 -41923
25030d1923N0970p4836k556J53968J1361M9524N8377k32987j25724r0695J01776
$$ -41923 9047 -65789 -68345 85623 96984 146508 204885 -28102 -153826 -244521 -142745
25019a42745m2719K1303k2487R5510m1696M032K39515O448j16896M1539q8982
$$ -142745 -185464 -164161 -186648 -91138 -132834 -128802 110713 117161 265 41804 -47178
25008d7178k4722k5074o9286n2564J45799j20396j0822N0119J10917j0760k3325
$$ -47178 -71900 -96974 -166260 -218824 -73025 -193421 -204243 -154124 -43207 -53967 -77292
24997g7292n2402J8641J11839K604J2531l9172l6197K939J5115l3437p0429n1905
$$ -77292 -129694 -111053 786 3390 15921 -23251 -59448 -56509 -41394 -74831 -145260 -197165
24985a97165N2855J06658P8329m9035k2174L7513j5804n8964j05467J22200O5610
$$ -197165 -144310 -37652 40677 -8358 -30532 6981 -8823 -67787 -173254 -51054 14556
24974A4556L4550M909n4267L3630q5062r870Q0749P8051j84028k7381M8835M5071
$$ 14556 49106 54015 -252 33378 -51684 -61554 19195 97246 -86782 -114163 -65328 -20257
24962b0257M3377j21186k0741N0112j44172L7506J49659J42267j57788o5056Q1738
$$ -20257 23120 -98066 -118807 -68695 -212867 -175361 -25702 116565 -41223 -106279 -24541
24951b4541Q964k6437n0336m5581o183R4832L3983l1492k1805j3948m633l4359
$$ -24541 -15577 -42014 -92350 -137931 -144114 -49282 -15299 -46791 -68596 -82544 -87177 -121536
24939a21536r0299r2250J184J03429P7008O6160N0064M02n048l6284j05231J06828
$$ -121536 -211835 -304085 -302901 -199472 -122464 -56304 -6240 -5838 -10886 -47170 -152401 -45573
24927d5573K1054O012r6583J01040j0913m3505N6357k7311j8417q9484M9605R0269
$$ -45573 -24519 -18507 -115090 -14050 -24963 -68468 -12111 -39422 -57839 -147323 -97718 -7449
24915g449q9137k4133J08377L8950j90944j68698M964J31245J07308q2879o4836
$$ -7449 -96586 -120719 -12342 26608 -164336 -333034 -328070 -196825 -89517 -172396 -237232
24904b37232J91125M0082m2755K0293Q2799J6109K2714N2070q7518j37495k4687
$$ -237232 -46107 -6025 -48780 -28487 54312 70421 93135 145205 57687 -79808 -104495
24893a04495J1260J3420l8371n6326L2231m1791J47164k8144m9252L5227o7525
$$ -104495 -93235 -79815 -118186 -174512 -142281 -184072 -36908 -65052 -114304 -79077 -146602
24882a46602J3769N1850n2194l7292K3144P3566P318J27633Q1636o3000n6523
$$ -146602 -132833 -80983 -133177 -170469 -147325 -73759 -66441 61192 142828 79828 23305
24871B3305l512o6658L0310k8644o7357m2767N1178m0303J18537L9908l6690j4966
$$ 23305 19793 -46865 -16555 -45199 -112556 -155323 -104145 -144448 -25911 13997 -22693 -37659
24859c7659o749m461j35796j71361n7649J62864L5297j19423o2067K08494J26046
$$ -37659 -44408 -48869 -184665 -356026 -413675 -250811 -215514 -334937 -397004 -188510 -62464
24848f2464M1820k946p6815o5915J8131l0521M8746J33526r082N4810n8464j8561
$$ -62464 -20644 -23590 -100405 -166320 -148189 -178710 -129964 3562 -5520 49290 -9174 -27735
24836b7735o1655n3098p929O3294O492J04297j31703J4244R9925M2310k310j18401
$$ -27735 -89390 -142488 -150417 -87123 -80631 23666 -108037 -93793 6132 48442 46132 -72269
24824g2269J9631k1610m6067L1385L6824P9225O6485K6382k1812l4687M0871j71519
$$ -72269 -52638 -74248 -120315 -88930 -52106 27119 93604 119986 98174 63487 104358 -67161
24812f7161j40593K4036N4569K6465M01N9266M8699n8441M7728K7410m6933n6814
$$ -67161 -207754 -183718 -129149 -102684 -102283 -43017 5682 -52759 -5031 22379 -24554 -81368
24800h1368Q5135O681L8293J1095o8711j09143j3901R6811O3892j96168q0171
$$ -81368 3767 10448 48741 59836 -8875 -118018 -131919 -35108 28784 -167384 -247555
24789b47555j8234R2467Q9554k5093j48911M4095J54857j9145j09062j4987k3405
$$ -247555 -265789 -173322 -83768 -108861 -257772 -213677 -58820 -77965 -187027 -202014 -225419
24778b25419m6369K61J23961R0610p4418l7020j6147O5118K0456J7435q0511p6297
$$ -225419 -271788 -271527 -147566 -56956 -131374 -168394 -184541 -119423 -98967 -81532 -162043 -238340
24766b38340O3552N0111j03575J33716J12293p0178m7196O2401l421j28370L1849
$$ -238340 -174788 -124677 -228252 -94536 17757 -52421 -99617 -37216 -40637 -169007 -137158
24755a37158j33382M137J73702j25881j17982J2103J56704K06430R1480J7928
$$ -137158 -270540 -266403 -92701 -218582 -336564 -324461 -167757 38673 130153 148081
24745A48081p4849j51264R460R857O1300N4411L6053j82103o5092O3538O5059
$$ 148081 73232 -78032 -68572 -58715 2585 56996 93049 -89054 -154146 -90608 -25549
24734b5549L7076q2217j17788n1704M0180J06306K0882Q4738R2991q4543m2703
$$ -25549 11527 -70690 -188478 -240182 -200002 -93696 -72814 11924 104915 20372 -22331
24723b2331p4109j14037K8416L3841M6753o4447j15082Q1174K11895K9304o0487
$$ -22331 -96440 -210477 -182061 -148220 -101467 -165914 -280996 -199822 12073 41377 -19110
24712a9110r0251q5742j2628J45046J02172j02234M4415M4397p3560q813J9883
$$ -19110 -109361 -195103 -207731 -62685 39487 -62747 -18332 26065 -47495 -56308 -36425
24701c6425K65181k5240n4192m4647j53776j07797k7615l7363N3701k6263N4631
$$ -36425 228756 203516 149324 104677 -49099 -156896 -184511 -221874 -168173 -194436 -139805
24690a39805Q1484O173l3309L5579M1883m8766l1657N4661Q7007N1620j79897
$$ -139805 -58321 -52148 -85457 -49878 -7995 -56761 -88418 -33757 53250 104870 -75027
24679g5027m9722k4792p1118n0324J16773J08603M270K3822p5552M8364j2137
$$ -75027 -124749 -149541 -220659 -270983 -154210 -45607 -41337 -17515 -93067 -44703 -56840
24668e6840M5343P649n9605J3706J32360N6947k54142j73079L1834K9490P5778
$$ -56840 -11497 -3848 -63453 -49747 82613 139560 -114582 -287661 -255827 -226337 -150559
24657a50559j7555M6545M1362O9380N9584j70364p5499K16377K28704m1465q2423
$$ -150559 -168114 -121569 -80207 -10827 48757 -121607 -197106 19271 247975 206510 124087
24646A24087j2230o7786J879r522m8784Q4085N4078P0229l3954r2504q8048n0158
$$ 124087 111857 44071 45950 36428 -12356 71729 125807 196036 162082 69578 -18470 -68628
24634f8628P3607R1213k6177j7369p6053Q5410p9669m852N587L9319n8339o3044
$$ -68628 4979 96192 70015 52646 -23407 62003 -17666 -22518 -16931 22388 -35951 -98995
24622i8995P595J50739O9064L3098J62218O7945j29975q2056j40408P8190o5102
$$ -98995 -91400 59339 128403 161501 323719 391664 261689 179633 39225 117415 52313
24611E2313l7654k3409l1317n6061O3049j1350L1350n7154k8136m7685R4135K9206
$$ 52313 14659 -8750 -40067 -96128 -33079 -44429 -13079 -70233 -98369 -146054 -51919 -22713
24599b2713l8446J37446R4851K2075r9331j39728P4257r8899o8207j0208n3035
$$ -22713 -61159 76287 171138 193213 93882 -45846 28411 -70488 -138695 -148903 -201938
24588b01938l9164O5995J07719K1714M4243P4480j0695p0730j52344M3388J69348
$$ -201938 -241102 -175107 -67388 -45674 -1431 73049 62354 -8376 -160720 -117332 52016
24577E2016K7794J6773q2049j63863M5502J10382L0338k1819j06377J7657M9229
$$ 52016 79810 96583 14534 -149329 -103827 6555 36893 15074 -91303 -73646 -24417
24566b4417M2309P6316O8489k1508o4230m7372n9787l7999Q7361r967j06158k9258
$$ -24417 17892 94208 162697 141189 76959 29587 -30200 -68199 19162 9195 -96963 -126221
24554a26221R6522l5608L5153P4154J75726j40530o5718Q1757R7271r6877j58527
$$ -126221 -29699 -65307 -30154 44000 219726 79196 13478 95235 192506 95629 -62898
24543f2898L2084Q3361J689j29647o8154j78902j0131O6163J16803J09469Q4584
$$ -62898 -30814 52547 54236 -75411 -143565 -322467 -332598 -266435 -149632 -40163 44421
24532D4421Q7174l5855J2072R9585M1784j76385k29153j13734P6065l5817R465
$$ 44421 131595 95740 107812 207397 249181 72796 -156357 -270091 -194026 -229843 -220378
24521b20378J02253P9922J50861K5043L1144J23426j80514k12498L7207r619n3371
$$ -220378 -118125 -38203 112658 137701 168845 292271 111757 -100741 -63534 -73153 -126524
24510a26524j10377n5776J61582M578o641p3971L3976M0896n5035J6074L0220
$$ -126524 -236901 -292677 -131095 -126517 -133158 -207129 -173153 -132257 -187292 -171218 -140998
24499a40998j35010M4617M8197K2002o7675J6988J24715N3459l3033j7897q2159
$$ -140998 -276008 -231391 -183194 -161192 -228867 -211879 -87164 -33705 -66738 -84635 -166794
24488a66794Q4327j1691m3433N0517N255J41498R5735p7807p1697k03041O8575
$$ -166794 -82467 -94158 -137591 -87074 -81819 59679 155414 77607 5910 -197131 -128556
24477a28556P8063n5276r4726J4574P6004r0015J23015N2823P354L6810l3418
$$ -128556 -50493 -105769 -200495 -185921 -109917 -199932 -76917 -24094 -16740 20070 -13348
24466a3348j32579L365Q4871m2388J45045j352q9128j0873L545L5042q9201K1148
$$ -13348 -145927 -142562 -57691 -100079 44966 43614 -45514 -56387 -52842 -17800 -107001 -85853
24454h5853l801n8518k0331J37300M0329n8526L0945J4534J7548p8977q3560K7596
$$ -85853 -89654 -148172 -168503 -31203 9126 -49400 -18455 -3921 13627 -65350 -148910 -121314
24442a21314n557l9394J13597L4239M9069j5839m0636j15596q9651l1322p330
$$ -121314 -126871 -166265 -52668 -18429 30640 14801 -25835 -141431 -231082 -262404 -269734
24431b69734l5267J75616J64250R087L0163o5215q5414Q245N2905Q1199J38786
$$ -269734 -305001 -129385 34865 43952 74115 8900 -76514 -68269 -15364 65835 204621
24420B04621O1191k8150j02395m0740p3470N730M9524o2631j12386M6330l8156
$$ 204621 265812 237662 135267 94527 21057 26787 76311 13680 -98706 -52376 -90532
24409i0532l4651Q0690M2850n4554n1675O0356J09448j0395q2794k6826m0973
$$ -90532 -125183 -44493 -1643 -56197 -107872 -47516 61932 51537 -31257 -58083 -99056
24398i9056o1144J80868Q1645j59032q3424N4052O5637P9044p1425k0625l5269
$$ -99056 -160200 20668 102313 -56719 -140143 -86091 -20454 58590 -12835 -33460 -68729
24387f8729J49005L155J7547o395p1275p6291O2594K0820L1376R5420m1043r6721
$$ -68729 80276 83431 100978 94583 23308 -52983 9611 30431 61807 157227 116184 19463
24375A9463r573j4781P362l3839j7029L2133M3248k8477R9883O1208J23248j09326
$$ 19463 9890 -4891 2471 -31368 -48397 -16264 26984 -1493 98390 159598 282846 173520
24363A73520p9018j13570j21779j68816J20441J21046J31000P7579p0450j41361
$$ 173520 94502 -19068 -140847 -309663 -189222 -68176 62824 140403 69953 -71408
24353g1408j62187l439J22316N1207l5301N2827M9144J7378l9984j17004L3380
$$ -71408 -233595 -237034 -114718 -63511 -98812 -45985 3159 20537 -19447 -136451 -103071
24342a03071Q4073o2144M5314O0952L2954n6092R1649K7897r6934k35546k4698
$$ -103071 -18998 -81142 -35828 25124 58078 1986 93635 121532 24598 -210948 -235646
24331b35646Q2691O6668Q5718J15209n9064j29335j01240j09235P1644M4291k7633
$$ -235646 -152955 -86287 -569 114640 55576 -73759 -174999 -284234 -212590 -168299 -195932
24320a95932j6534o4861N1157R0810n8015j01636K4293O8406L2333l7816j15949
$$ -195932 -212466 -277327 -226170 -135360 -193375 -295011 -270718 -202312 -169979 -207795 -323744
24309c23744k4881J05166m277N373m443o5272j6824J00976O9461r2238J38209
$$ -323744 -348625 -243459 -247736 -242363 -246806 -312078 -328902 -227926 -158465 -250703 -112494
24298a12494J63181K6152o1941p5854n933Q9131P3594J29265n224k04199j05019
$$ -112494 50687 76839 14898 -60956 -66889 22242 95836 225101 219877 15678 -89341
24287h9341j69653J30521K59687P5275k3938n916j5693K8099N1579m929j1224
$$ -89341 -258994 -128473 131214 206489 182551 176635 160942 189041 240620 235691 224467
24276B24467j40658k5283K2139j6921l4668j11058j06980M0870k6417J8898R5852
$$ 224467 83809 58526 80665 63744 29076 -81982 -188962 -148092 -174509 -155611 -59759
24265e9759K5217P3156k6173k001K3437N5235m3341o7173p2129J6805P5889j41947
$$ -59759 -34542 38614 12441 10440 33877 89112 45771 -21402 -93531 -76726 -837 -142784
24253a42784m1396J149o2071j13155J8656P8552K4230K9743L6249m9174M2068
$$ -142784 -184180 -183031 -245102 -358257 -339601 -261049 -236819 -207076 -170827 -220001 -177933
24242a77933L6463R1681J00823P2481J49855p099j94992j09657J5373k7234N4307
$$ -177933 -141470 -49789 51034 123515 273370 266271 71279 -38378 -23005 -50239 4068
24231D068J16018r8110n4679o6467J05739O0851p1500j10022m1745l7003J98705
$$ 4068 120086 21976 -32703 -99170 6569 67420 -4080 -114102 -155847 -192850 5855
24220E855J4925q6177j493O7418p5419r9257O393l9671j10215K7489J75915j13908
$$ 5855 20780 -65397 -66890 528 -74891 -174148 -167755 -207426 -317641 -290152 -114237 -228145
24208b28145j52252K26996J00874q840j4393O5267k6572m4643P7361o1515p9901
$$ -228145 -380397 -153401 -52527 -61367 -75760 -10493 -37065 -81708 -4347 -65862 -145763
24197a45763r2779Q3366J89108L1733o8913n4613J5229k5213o5416M0206N8516
$$ -145763 -238542 -155176 33932 65665 -3248 -57861 -42632 -67845 -133261 -93055 -34539
24186c4539P3059L2071J9631o7268q8287o3834q5905k500J38275J33754r3198
$$ -34539 38520 70591 90222 22954 -65333 -129167 -215072 -217572 -79297 54457 -38741
24175c8741j13062j24141n7274K7058K28506K35976r713j21653O7948q001j0887
$$ -38741 -151803 -275944 -333218 -306160 -77654 158322 148609 26956 94904 86903 76016
24164G6016n7632J38575N6162o4895m255j76166n5730o5764M4620l2709p6805
$$ 76016 18384 156959 213121 148226 143971 -32195 -87925 -153689 -109069 -141778 -218583
24153b18583j8412J21721r1206p6673P7860J11253J32566J78449j49893o5613
$$ -218583 -236995 -115274 -206480 -283153 -205293 -94040 38526 216975 67082 1469
24143A469K6066J11148m4534j95322P706m367p4321J12143N1133r1083O3169q8739
$$ 1469 27535 138683 94149 -101173 -93467 -97834 -172155 -60012 -8879 -99962 -36793 -125532
24131a25532P198J83169L0837r7219p4652R7237J34174M4067r9446p4617M8659
$$ -125532 -118334 64835 95672 -1547 -76199 21038 155212 199279 99833 25216 73875
24120G3875k8070j1682J05303k6040k69350j28654J01383l3753o992K35125J8323
$$ 73875 45805 34123 139426 113386 -155964 -284618 -183235 -216988 -223980 11145 29468
24109B9468j2522l7384j7307R8509m9768m2148J42721J09353j26396k8251M62
$$ 29468 16946 -20438 -37745 60764 10996 -31152 111569 220922 94526 66275 66737
24098F6737k23812L4616N7633p180L1299p3366Q3963J84925Q8513j12581j43710
$$ 66737 -157075 -122459 -64826 -72006 -40707 -114073 -30110 154815 243328 130747 -12963
24087a2963j55537J0092J17842P8945L0291j5558j95928J11289K9757o6602L1261
$$ -12963 -168500 -158408 -40566 38379 68670 53112 -142816 -31527 -1770 -68372 -37111
24076c7111J9498j21058m721K2251K8934R5936Q6942J19539K8170o0008n2312
$$ -37111 -17613 -138671 -143392 -121141 -92207 3729 90671 210210 238380 178372 126060
24065A26060j41108J67834J14255k03721j41875Q6395J26791J8897m1851j55418
$$ 126060 -15048 152786 267041 63320 -78555 7840 134631 153528 111677 -43741
24055d3741j20882o3410L1786R8445L5407p3407j15669m7272Q0102Q8012J42542
$$ -43741 -164623 -228033 -196247 -97802 -62395 -135802 -251471 -298743 -218641 -130629 11913
24044A1913p4279J0142K6999J15345K601o8168j05500n234O6471J22586n4890
$$ 11913 -62366 -52224 -25225 90120 92721 24553 -80947 -86181 -19710 102876 47986
24033D7986L6794J3818K1116j00500j15773p6973J788k8636L5249K28034Q2203
$$ 47986 84780 98598 119714 19214 -96559 -173532 -171744 -200380 -165131 62903 145106
24022A45106l6434j64197p1386R9733K6480p3353P5420j9915N2884j2262n2726
$$ 145106 108672 -55525 -126911 -27178 -698 -74051 1369 -18546 34338 22076 -30650
24011c0650j67613j47285L2523k716N2431J02558J10863K9997j04127r217L1037
$$ -30650 -198263 -345548 -313025 -315741 -263310 -160752 -49889 -19892 -124019 -133236 -102199
24000a02199P3701L9781j07795k3244j37508K6424P5475j3554R1493J18783L085
$$ -102199 -28498 11283 -96512 -119756 -257264 -230840 -155365 -168919 -77426 41357 44442
23989D4442j4538j00880L8606O375J469N9339J08682o1442j78311m8295J02511
$$ 44442 29904 -70976 -32370 -25995 -24526 34813 143495 82053 -96258 -144553 -42042
23978d2042O6486l480m8223L3262p0057k6358J86364J53222j7873m2648o154K6019
$$ -42042 24444 20964 -27259 6003 -64054 -90412 95952 249174 231301 188653 182499 208518
23966B08518j37510k5948j04539l3736k5141M2534j9806n6116Q1044M8554O991
$$ 208518 71008 45060 -59479 -93215 -118356 -75822 -95628 -151744 -70700 -22146 -15155
23955a5155Q0106m7218o9159R3049J5058p4685j7717j66181j26988M3623J03007
$$ -15155 64951 17733 -51426 41623 56681 -18004 -35721 -201902 -328890 -285267 -182260
23944a82260j457q7942k7566J40279J44856l3938R1100J5367j12963q4378k7082
$$ -182260 -183717 -271659 -299225 -158946 -14090 -48028 43072 58439 -54524 -138902 -165984
23933a65984p4194N438P3452J48839k0737j1488N5892n7205k0215K1147L7983
$$ -165984 -240178 -234740 -161288 -12449 -33186 -44674 11218 -45987 -66202 -45055 -7072
23922g072L7588o866l4923J13361r5692m7602P598J05090L2384j99942j38682
$$ -7072 30516 23650 -11273 102088 6396 -41206 -33608 71482 103866 -96076 -234758
23911b34758q5844L8119K3245n7216o1223R368Q6580R0119k031p776M1458L0659
$$ -234758 -320602 -282483 -259238 -316454 -377677 -368309 -281729 -191610 -193641 -201417 -159959 -129300
23899a29300l7931P8121P8708n0543j4113N7363O5172L3565j9238p8117n2847
$$ -129300 -167231 -89110 -10402 -60945 -75058 -17695 47477 81042 61804 -16313 -69160
23888f9160m5831p4885j20107N4593J11749K00493R4448L6997J56414o5118j06924
$$ -69160 -114991 -189876 -309983 -255390 -143641 56852 151300 188297 344711 279593 172669
23877A72669j30209j35982J3584r567j27538n7253l5059J50621J68324P0445O4041
$$ 172669 42460 -93522 -79938 -89505 -217043 -274296 -309355 -158734 9590 80035 144076
23866A44076r4905j60388j23628o764p5188O1534N8098o0779J27346P5846k900
$$ 144076 49171 -111217 -234845 -241609 -316797 -255263 -197165 -257944 -130598 -54752 -57652
23855e7652r3715j21108P0231O2849o7549N3533j23299m400L8858J57117J18950
$$ -57652 -151367 -272475 -202244 -139395 -206944 -153411 -276710 -281110 -242252 -85135 33815
23844C3815J10894m2245o8167j4514q5636N2190K9681K5012j7855o4135J128N0381
$$ 33815 144709 102464 34297 19783 -65853 -13663 16018 41030 23175 -40960 -39832 10549
23832A0549M954Q9960R4317j84736k34993P8699J37248M6910j33625j3319K07533
$$ 10549 15503 105463 199780 15044 -219949 -141250 -4002 42908 -90717 -104036 103497
23821A03497N5010n5051o7502j04869r9348J11124j749o3083K4460J11906n0553
$$ 103497 158507 103456 35954 -68915 -168263 -57139 -58888 -121971 -97511 14395 -36158
23810c6158l0725k1812R0955J41341r8806r8253j48555j8211j185M5388l6690
$$ -36158 -66883 -88695 2260 143601 44795 -53458 -202013 -220224 -221409 -176021 -212711
23799b12711l6357M3252J10808J10689o0373j64344m7077J30883j0581q4030J9138
$$ -212711 -249068 -205816 -95008 15681 -44692 -209036 -256113 -125230 -135811 -219841 -200703
23788b00703n9051J356P5594M9938m2038j32057o6285J20764J12155j0748J63674
$$ -200703 -259754 -258398 -182804 -132866 -174904 -306961 -373246 -252482 -140327 -151075 12599
23777A2599n507n6901j89229p7795j8438J28816J27934N5984K6835M6565O0693
$$ 12599 7092 -49809 -239038 -316833 -335271 -206455 -78521 -22537 4298 50863 111556
23766A11556O7546j56049n6043k1692j4485r5816l9946R7945J2947j02150M710
$$ 111556 179102 23053 -32990 -54682 -69167 -164983 -204929 -106984 -94037 -196187 -191477
23755a91477P2549j0697N9548O2971k0747j9542j27996j3443Q3631L9157q464
$$ -191477 -118928 -129625 -70077 -7106 -27853 -47395 -175391 -188834 -105203 -66046 -74510
23744g4510P9838O5089K6517J2792J7067r2384o4556R1666k8537J5487j3384p0542
$$ -74510 5328 70417 96934 109726 126793 34409 -30147 61519 32982 48469 35085 -35457
23732c5457r9205n2541J22562J05572l3980q9525N7013K5826K7988j5368o2581
$$ -35457 -134662 -187203 -64641 40931 6951 -82574 -25561 265 28253 12885 -49696
23721d9696j30231J31442k2692J0739l0628Q8824L8554O4352j16299j7824l5016
$$ -49696 -179927 -48485 -71177 -60438 -91066 -2242 36312 100664 -15635 -33459 -68475
23710f8475o4946l1269j0896R4825R4626n6939J3334O0487k01027j77459R9428
$$ -68475 -133421 -164690 -175586 -80761 13865 -43074 -29740 30747 -170280 -347739 -248311
23699b48311J16875L5937L9105k7267J03703O4011o4915j25111M2865J08417j05827
$$ -248311 -131436 -95499 -56394 -83661 20042 84053 19138 -105973 -63108 45309 -60518
23688f0518j84909J8739J54657j6782M9291P1150K6210J3871k8738Q6692m7337
$$ -60518 -245427 -226688 -72031 -88813 -39522 31628 57838 71709 42971 129663 82326
23677H2326r3340J4342k3006k5205j05059J8192K6959O8117O5558L2426j26468
$$ 82326 -11014 3328 -19678 -44883 -149942 -131750 -104791 -36674 28884 61310 -65158
23666f5158m5340P03J58065k7188j45208o652J6913j05119N5690R2477N029r8225
$$ -65158 -110498 -109795 48270 21082 -124126 -130778 -113865 -218984 -163294 -70817 -65788 -164013
23654a64013R4444J87132O8183j06317p0287m2469K276q0423k5637j1344J4577
$$ -164013 -69569 117563 185746 79429 9142 -33327 -31051 -111474 -137111 -148455 -133878
23643a33878K8208K8793L1749q1251O3863J58324O7147k7370L7303L8572J6101
$$ -133878 -105670 -76877 -45128 -126379 -62516 95808 162955 135585 172888 211460 227561
23632B27561p4418l6690O9806j0490m6629L419p6482O8837K2689P7253q9822k16382
$$ 227561 153143 116453 186259 175769 129140 132559 56077 124914 147603 224856 135034 -81348
23620h1348Q1442J42494m984J6146k0276k01939j71013q5994k4062R3716K74134
$$ -81348 94 142588 137604 153750 133474 -68465 -239478 -325472 -349534 -255818 18316
23609A8316K06429r4718j15800j17368k5094j62037J6329K54922J20432j22825
$$ 18316 224745 130027 14227 -103141 -128235 -290272 -273943 -19021 101411 -21414
23599b1414m5957l8773N2854K8406q0661P428P1001K971M5095j93803j8819J01706
$$ -21414 -67371 -106144 -53290 -24884 -105545 -98117 -27116 -24145 20950 -172853 -191672 -89966
23587h9966J09402j31225l4093P6075J05929M887q8148K2283Q1966R229J6696
$$ -89966 19436 -111789 -145882 -69807 36122 41009 -47139 -24856 57110 66339 83035
23576H3035K8842r8035j38549k2686O9984J591J01089j05595j11989q2321j6962
$$ 83035 111877 13842 -124707 -147393 -77409 -75818 25271 -80324 -192313 -274634 -291596
23565b91596O277j47642J64934M2570J01564J7904l1326m3077J32662O4007j7118
$$ -291596 -285319 -432961 -268027 -225457 -123893 -105989 -137315 -180392 -47730 16277 -841
23554h41j21744R8066N1490N4551m7584k3501m5405l2591K9663J28006J05159
$$ -841 -122585 -24519 26971 81522 33938 10437 -34968 -67559 -37896 90110 195269
23543A95269l2022L8682k0898j35128j10717j00813p018p747P9734J38178M0514
$$ 195269 163247 201929 181031 45903 -64814 -165627 -172645 -180392 -100658 37520 78034
23532G8034o3758J2666L2291n4613O4384L8780j1734M6269P829K0674l4165j13804
$$ 78034 14276 26942 59233 4620 69004 107784 96050 142319 150148 170822 136657 22853
23520B2853k09030l1906j2988O2273J60221q1338l135q5560L8125Q5108M8666
$$ 22853 -186177 -218083 -231071 -168798 -8577 -89915 -93050 -178610 -140485 -55377 -6711
23509f711q4604Q8965J31331r2576k41132j15347P9144J62358O0552j4930n5159
$$ -6711 -91315 -2350 128981 36405 -204727 -320074 -240930 -78572 -18020 -32950 -88109
23498h8109p0654L8918k5985L7478k9455j09402p8195R5841J33544l7129N2300
$$ -88109 -158763 -119845 -145830 -108352 -137807 -247209 -325404 -229563 -96019 -133148 -80848
23487h0848L118o7204J909k0430Q3542P6796m7147j03676M9435j5471n8379M994
$$ -80848 -77730 -144934 -143025 -163455 -79913 -3117 -50264 -153940 -104505 -119976 -178355 -173361
23475a73361J03805L8365J8402N6552M0897O1666q5044j02776L3636M0919R6438
$$ -173361 -69556 -31191 -12789 43763 84660 146326 61282 -41494 -7858 33061 129499
23464A29499J5128m3882L676J10996R3117j49351k25627N9346J33065N7568K228
$$ 129499 144627 100745 104421 215417 308534 159183 -66444 -7098 125967 183535 185763
23453A85763n2442l3077J30726J07545j49410j60612n4166r148L1634J18618K0308
$$ 185763 133321 100244 230970 338515 189105 28493 -25673 -34821 -3187 115431 135739
23442A35739j4499q7839j9169j10615l0983j1161o9224Q1565J46991m305k0920
$$ 135739 121240 33401 14232 -96383 -127366 -138527 -207751 -126186 20805 16500 -4420
23431d420J13597l8888m1594J2396K6505R614r4744n0016j281l1906r4916Q1026
$$ -4420 109177 70289 28695 41091 67596 77210 -17534 -67550 -68831 -100737 -195653 -114627
23419a14627O3139M0469P911J06650O6084p1706j45856p1129J8024P4480j63277
$$ -114627 -51488 -11019 -3108 103542 169626 97920 -47936 -119065 -101041 -26561 -189838
23408a89838o4124j8466M5592j8911K4558J85694J94388J5122r5014j70446r6243
$$ -189838 -253962 -272428 -226836 -245747 -221189 -35495 158893 174015 79001 -91445 -187688
23397a87688R2653o018k7954N8960L3035j905N0692l1924j10778J9709q0885L4163
$$ -187688 -95035 -101053 -129007 -70047 -37012 -38917 11775 -20149 -130927 -111218 -192103 -157940
23385a57940J83323J32366O2432j49655j17179O0234n85k7889Q9342J48605r8814
$$ -157940 25383 157749 220181 70526 -46653 13581 12996 -14893 74449 223054 124240
23374A24240q1927O7821p2638o4186k4792r735j8327l7499J38145M9773L3966
$$ 124240 42313 110134 37496 -26690 -51482 -61217 -79544 -117043 21102 70875 104841
23363A04841R1442r966j2687j42568N8445L6885j04449M2650k1660r8893J998
$$ 104841 196283 186317 173630 31062 89507 126392 21943 64593 42933 -55960 -53962
23352e3962q6404J1016J88337N4885k7422o3148J43747q690j40882N744m9355
$$ -53962 -140366 -129350 58987 113872 86450 23302 167049 158359 17477 23221 -26134
23341b6134N7906J11382l9489k43002k6929J92965p4932O6690k4244l4348J8785
$$ -26134 31772 143154 103665 -139337 -166266 26699 -48233 18457 -5787 -40135 -21350
23330b1350M1377J1433J35283j5269k21711o6301m5829l6019P9250P0569J29481
$$ -21350 20027 31460 166743 151474 -70237 -136538 -182367 -218386 -139136 -68567 60914
23319F0914Q4993l7154j72771r195J56934J10804j06280n6429r9557l3471m5419
$$ 60914 145907 108753 -64018 -73213 83721 194525 88245 31816 -67741 -101212 -146631
23308a46631P8813K3212r7007J50185O2478j25606r4287K0874j23769j747K4921
$$ -146631 -67818 -44606 -141613 8572 71050 -54556 -148843 -127969 -251738 -253485 -228564
23297b28564n6352K08540Q8402j01421q8498J79913O0649k4603j164n6590M4413
$$ -228564 -284916 -76376 12026 -89395 -177893 2020 62669 38066 36902 -19688 24725
23286B4725M8943j45539j4623Q2031Q758o0288q2220R0698J14135J609N2366k0758
$$ 24725 73668 -71871 -86494 -4463 4295 -55993 -138213 -47515 66620 68229 120595 99837
23274I9837m8565o3405m62O3735q240k511p051o7026k2380p5290q217l163O6610
$$ 99837 51272 -12133 -12595 51140 42900 40389 33338 -33688 -56068 -131358 -139575 -142738 -76128
23261g6128n3815Q8778K8303j35410p8254o5019K378N2528K02941N4487J7629
$$ -76128 -129943 -41165 -12862 -148272 -226526 -291545 -289167 -236639 -33698 20789 38418
23250C8418m9401j53939n168J1767J4649j08682n9097O1365Q5397L4818j25132
$$ 38418 -10983 -164922 -170090 -158323 -143674 -252356 -311453 -250088 -164691 -129873 -255005
23239b55005m2230j1263R3401J18575J17523o4516p4993J2425J16839K1416m4619
$$ -255005 -297235 -308498 -215097 -96522 21001 -43515 -118508 -106083 10756 32172 -12447
23228a2447M0966m3324m3150k7088M0912k460j97465p9449r092J8970O3307P625
$$ -12447 28519 -14805 -57955 -85043 -44131 -46591 -244056 -323505 -332597 -313627 -250320 -242695
23216b42695O5769J02169Q9493M3330p3789K9762j7219R4866q9453j98988K9719
$$ -242695 -176926 -74757 14736 58066 -15723 14039 -3180 91686 2233 -196755 -167036
23205a67036K31461J2149j56453k46408l6757J4349L5210J17922l4953J7764J60069
$$ -167036 64425 76574 -79879 -326287 -363044 -348695 -313485 -195563 -230516 -212752 -52683
23194e2683L896R5827p6350l3160Q755o969q7377l9619j5712K4481R0088n2246
$$ -52683 -48787 47040 -29310 -62470 -53715 -60684 -148061 -187680 -203392 -178911 -88823 -141069
23182a41069p3173J85774K01680j29614k15078R6180J37526l7230j99541m9950
$$ -141069 -214242 -28468 173212 43598 -171480 -75300 62226 24996 -174545 -224495
23172b24495P6151J14451L9536N2787n1789r539m6118J6081P3225M6491j82922
$$ -224495 -148344 -33893 5643 58430 6641 -2898 -49016 -32935 40290 86781 -96141
23161i6141j08286p7485L7006l964m911P5706J0614J0561J70748J52811N5203
$$ -96141 -204427 -281912 -244906 -248870 -253781 -178075 -167461 -156900 13848 166659 221862
23150B21862r178O1938q3166j81672j17718J65208P0828q2630J1055j21042p011
$$ 221862 212684 274622 191456 9784 -107934 57274 128102 45472 56527 -64515 -71526
23139g1526K7382J139n5449j27756k6747M4615M0132N6567P9292L3773J7897j08366
$$ -71526 -44144 -43005 -98454 -226210 -252957 -208342 -168210 -111643 -32351 1422 19319 -89047
23127h9047j26169j544N9756J26219j32988j77694K4056K62756J30630p1326o2889
$$ -89047 -215216 -216760 -157004 -30785 -163773 -341467 -317411 -54655 75975 4649 -58240
23116e8240j08532l4787J31715n4295j1712J16187O5804L7753L5864j09348j13920
$$ -58240 -166772 -201559 -69844 -124139 -135851 -19664 46140 83893 119757 10409 -103511
23105a03511j1399M1893M0j10714J34447m7923K9052J62441R3241p5005j73353
$$ -103511 -114910 -73017 -72977 -183691 -49244 -97167 -68115 94326 187567 112562 -60791
23094f0791m4533N7727j46986p8462J17342J3789J7495p2869n3947k4532N5808
$$ -60791 -105324 -47597 -194583 -273045 -155703 -141914 -124419 -197288 -251235 -275767 -219959
23083b19959O3148J62019j1639L5660q2182j05795j630O5512K13610p3990n6101
$$ -219959 -156811 5208 -6431 29229 -52953 -158748 -160378 -94866 118744 44754 -11347
23072a1347L8327m5203Q1893J23698O0194k742j79068j33726Q1397P0468J01765
$$ -11347 26980 -18223 63670 187368 247562 244820 65752 -67974 13423 83891 185656
23061A85656Q48R17r7151r0701q6433R059J68726R8844O7017L9879j8838k19120
$$ 185656 186504 187421 90270 -431 -86864 -77805 90921 189765 256782 296661 277823 58703
23049E8703k00543L7589M9458p3336P9971J1423L325Q066Q9259r198j05292Q7266
$$ 58703 -141840 -104251 -54793 -128129 -48158 -36735 -33410 -25344 63915 54717 -50575 36691
23037C6691L4150m9793k0030j2338O5900m6261j03043n4444Q822l4045l3252J03774
$$ 36691 70841 21048 1018 -11320 54580 8319 -94724 -149168 -140346 -174391 -207643 -103869
23025a03869M6068M6450j46421N0075J9843Q790P0559J34773j8628L3826j0571
$$ -103869 -57801 -11351 -157772 -107697 -87854 -79064 -8505 126268 107640 141466 130895
23014A30895m4590m6880M4156N1639j5674K8944j8626L7785o9523J3003n1532
$$ 130895 86305 39425 83581 135220 119546 148490 129864 167649 98126 111129 59597
23003E9597k6527r2678L0362M9586k7289k8696j3156J0112m4701m168L4267j2009
$$ 59597 33070 -59608 -29246 20340 -6949 -35645 -48801 -38689 -83390 -87558 -53291 -65300
22991f5300n669Q4920J40634J52073L5436j33822j53969l5413K3035j36516p630
$$ -65300 -70969 13951 154585 306658 342094 208272 54303 18890 41925 -94591 -102221
22980a02221O702k0798M4558k4579j07892Q9206K1602m1939r5376k6711M9613
$$ -102221 -95519 -116317 -71759 -96338 -204230 -115024 -93422 -135361 -230737 -257448 -207835
22969b07835R3862K1940K4507n444j01398J67060K9030l6449r0722j03557N0161
$$ -207835 -113973 -92033 -67526 -72970 -174368 -7308 21722 -14727 -105449 -209006 -158845
22958a58845O2608P2684L5856j44054k5922K4821O2713L0494q448J01279j31197
$$ -158845 -96237 -23553 12303 -131751 -157673 -132852 -70139 -39645 -48093 53186 -78011
22947g8011j53686n5524J15828N6440J28245J43359r9278k70119j50239J54339
$$ -78011 -231697 -287221 -171393 -114953 13292 156651 57373 -212746 -362985 -208646
22937b08646J55177Q9684n6232M4517L9506p4072L8256P32K5066O5470M088l7792
$$ -208646 -53469 36215 -20017 24500 64006 -10066 28190 28922 53988 119458 123546 85754
22925H5754j06908j8355L3313q905n1766O258L5102M1396o4500p6378J1281J13389
$$ 85754 -21154 -39509 -6196 -15101 -66867 -60609 -25507 15889 -48611 -124989 -113708 -319
22913c19l8945P2161o0513l9405Q344Q0784J161p448N858j07399l3666R6016o0984
$$ -319 -39264 32897 -27616 -67021 -58677 22107 23268 15820 21678 -85721 -119387 -23371 -84355
22900h4355j01464j18455k09163J15897R9383R2380K5331p4904L5646J21557R9866
$$ -84355 -185819 -304274 -513437 -397540 -298157 -205777 -180446 -255350 -219704 -98147 1719
22889A719m1810p7455o0769J9010j4924P480J8754p6702q78m895j3144P7091M4103
$$ 1719 -40091 -117546 -178315 -159305 -174229 -166749 -147995 -224697 -225575 -230470 -243614 -166523 -122420
22876a22420M9840N1718J32537K8500r2777l624J60327J30899o6604j20985j37698
$$ -122420 -72580 -20862 111675 140175 47398 43774 204101 335000 268396 147411 9713
22865I713R0727M1023l0516j00409L8115Q2775q7072k9071J747Q4327M9736M3686
$$ 9713 100440 141463 110947 10538 48653 131428 44356 15285 17032 101359 151095 194781
22853A94781M4422j00655j05380m760J31114p0408k28504j17539j45913J58055
$$ 194781 239203 138548 33168 28408 159522 89114 -139390 -256929 -402842 -244787
22843b44787K79887m2711p9193N8516R7264j09252j05948q2199J21238l3094P9002
$$ -244787 35100 -7611 -86804 -28288 68976 -40276 -146224 -228423 -107185 -140279 -61277
22832f1277N4990M1253J22345J20363j41866j99829p8010N7294M6899n5904j2808
$$ -61277 -6287 34966 157311 277674 135808 -64021 -142031 -84737 -37838 -93742 -106550
22821a06550M7438Q5250o4842k2069k6731J376K9731P6519q988J7231L5897r8357
$$ -106550 -59112 26138 -38704 -60773 -87504 -86128 -56397 20122 11134 28365 64262 -34095
22809c4095K1417J9543M1380q7735l0625J8039m7639K7049N3784L2917K7970O1264
$$ -34095 -12678 6865 48245 -39490 -70115 -52076 -99715 -72666 -18882 14035 42005 103269
22797A03269R162j91k5239j16148r5874O6325K6405j32266o9193N1217p1342Q8542
$$ 103269 112431 112240 87001 -29147 -125021 -58696 -32291 -164557 -233750 -182533 -253875 -165333
22785a65333L9987J6214R5430M5970N4570k3864j9181p2121j032k0264k8845j0889
$$ -165333 -125346 -109132 -13702 32268 86838 62974 43793 -28328 -29360 -49624 -78469 -89358
22773h9358j6759L0660O980J0368J58195J28156o7560n6736l8566m1900n0311
$$ -89358 -106117 -75457 -68477 -58109 100086 228242 160682 103946 65380 23480 -26831
22762b6831o4560j32980M571P9580J43590J777m9480p4212p6817m488J6339k6809
$$ -26831 -91391 -224371 -219800 -140220 3370 5147 -44333 -118545 -195362 -199850 -183511 -210320
22750b10320J25228K00858M902j9758L7015M6110j31780p2253J06468L6768R3059
$$ -210320 -85092 115766 120668 100910 137925 184035 52255 -19998 86470 123238 216297
22739B16297o0548j93718r128M9546k4610j09147j3948Q3512J90124M1213j24614
$$ 216297 155749 -37969 -47097 2449 -22161 -131308 -145256 -61744 128380 169593 44979
22728D4979o6553K5780J77693P927p0953j7909o0647r8915L0966k5543j15525
$$ 44979 -21574 4206 181899 189826 118873 100964 40317 -58598 -27632 -53175 -168700
22717a68700r1435P756J42700N0831j33611j38181R5410J02396R0791P0106k06568
$$ -168700 -260135 -252379 -109679 -58848 -192459 -330640 -235230 -132834 -42043 28063 -178505
22706a78505R830N1832q4115m5339p0120P774k1412J24973J11387j14225l9505
$$ -178505 -168675 -116843 -200958 -246297 -316417 -308643 -330055 -205082 -93695 -207920 -247425
22695b47425K674j7393J3316J8400j2245J4772J61701Q2630j15865o6740K7414
$$ -247425 -244751 -262144 -248828 -230428 -242673 -227901 -66200 16430 -99435 -166175 -138761
22684a38761K5499M0586K15698j4512j46734l3227J0789L7889o3153k9578K6085
$$ -138761 -113262 -72676 143022 128510 -18224 -51451 -40662 -2773 -65926 -95504 -69419
22673f9419q083k1922L1589n2492m0043J75166J32157k9693q4199r3323j7280
$$ -69419 -77502 -99424 -67835 -120327 -160370 14796 146953 117260 33061 -60262 -77542
22662g7542J6040Q1745O5829p7117Q291L1481m8095k8462N1687O0809n4076o6664
$$ -77542 -61502 20243 86072 8955 17246 48727 632 -27830 23857 84666 30590 -36074
22650c6074J7127Q7487q4850m6119l2705k9330j05865k0941R2978Q9088k1673
$$ -36074 -18947 68540 -16310 -62429 -95134 -124464 -230329 -251270 -158292 -69204 -90877
22639i0877k9375l5464p13j47704l7180J76529J42215K0316k9036o9099R5166
$$ -90877 -120252 -155716 -156429 -304133 -341313 -164784 -22569 -2253 -31289 -100388 -5222
22628e222o9835j72434J09033J03211p4667P7287M7902j05394L2445l5226Q0398
$$ -5222 -75057 -247491 -138458 -35247 -109914 -32627 15275 -90119 -57674 -92900 -12502
22617a2502J00510j6372q163k5043n5509O6139J09285k57518j73732J53247R0512
$$ -12502 88008 71636 63473 38430 -17079 49060 158345 -99173 -272905 -119658 -29146
22606b9146n4461o2838l6166N1098J31116J1848N6752o6827k6505m8376m771j57854
$$ -29146 -83607 -146445 -182611 -131513 -397 11451 68203 1376 -25129 -73505 -78276 -236130
22594b36130l2744J29158J13320k7730o1269j0212m0667J4893m3042M9541O7019
$$ -236130 -268874 -139716 -26396 -54126 -115395 -125607 -166274 -151381 -194423 -144882 -77863
22583g7863N150p7532k8350m8012J21119O9263q8564l3530J11749J05497r522
$$ -77863 -72713 -150245 -178595 -226607 -105488 -36225 -124789 -158319 -46570 58927 49405
22572D9405J5408o2496j9894p0957P486Q9928j53347p6716K73124L0902j35497
$$ 49405 64813 2317 -17577 -88534 -81048 8880 -144467 -221183 51941 82843 -52654
22561e2654n59n641J35394k3879j33390K3682R2138J33258q215m4723L7572n0462
$$ -52654 -53213 -58854 76540 52661 -80729 -57047 35091 168349 160134 115411 152983 102521
22549A02521M7126l6209j32843L2191P8889P7162r6527j08493R5173J79889o4067
$$ 102521 149647 113438 -19405 12786 91675 168837 72310 -36183 58990 238879 174812
22538A74812l04445k26818J61912K24044p2828p9895o3808J14829L5056n3012
$$ 174812 -129633 -356451 -194539 29505 -43323 -123218 -187026 -72197 -37141 -90153
22528i0153J4472R2056m4444M0310J6654k6791N944L7706o8533p5602L221L413
$$ -90153 -75681 16375 -28069 12241 28895 2104 8048 45754 -22779 -98381 -95160 -91747
22516i1747Q2545l258J0909J5333m664m4413J3695J45825J8044l0565r6167q2360
$$ -91747 -9202 -12460 -1551 13782 9118 -35295 -21600 124225 142269 111704 15537 -66823
22504f6823O8502N7820j8935l3569p4257K826Q8543O4153n9044L0976n1778j67184
$$ -66823 1679 59499 40564 6995 -67262 -64436 24107 88260 29216 60192 8414 -158770
22492a58770N4665M9502J13484L5851L2108q931q9530n9003Q1053R5947m8691
$$ -158770 -104105 -54603 58881 94732 126840 117909 28379 -30624 50429 146376 97685
22481I7685j29800p0521j21440L685J10160N0331o9343J8637m596L5975J33258
$$ 97685 -32115 -102636 -224076 -220391 -110231 -59900 -129243 -110606 -115202 -79227 54031
22470E4031n840r3278M1030J95937J2254j19948m7642q285K9632r6596j01810
$$ 54031 48191 -45087 -4057 191880 204134 84186 36544 28259 57891 -38705 -140515
22459a40515K2623R0734N1533k8786J9168L6315n6545j04561l6319p7946J66692
$$ -140515 -117892 -27158 24375 -4411 14757 51072 -5473 -110034 -146353 -224299 -57607
22448e7607J06525J50695R017p5763k8399r1623K1631N0511J24419j53507j69903
$$ -57607 48918 199613 208630 132867 104468 12845 34476 84987 209406 55899 -114004
22437a14004M7109J28908J02888r7640j7907j01817J31831J02691k48809p1391
$$ -114004 -66895 62013 164901 67261 49354 -52463 79368 182059 -66750 -138141
22427a38141N4143J52081J3530N0827j51340k2722J22110L5254k6073q0034j24385
$$ -138141 -83998 68083 81613 132440 -18900 -41622 80488 115742 89669 9635 -114750
22416a14750J7729l0461n6656M4265L8994P2214K9502M0196r3721l5140Q1496
$$ -114750 -97021 -127482 -184138 -139873 -100879 -28665 837 41033 -52688 -87828 -6332
22405f332R72j60067j01136J7972m0739m6276l4827M9001K23609J05382n3120
$$ -6332 -5360 -165427 -266563 -248591 -289330 -335606 -370433 -321432 -97823 7559 -45561
22394d5561q5725P070J1638j8015J512m2415K6644P6030J52551m3223q7866J5706
$$ -45561 -131286 -124216 -112578 -130593 -129081 -171496 -144852 -68822 83729 40506 -47360 -31654
22382c1654k9371j4573j1269J01914j9430O619J5898j03572J00504J47052m255
$$ -31654 -61025 -75598 -86867 15047 -4383 2236 18134 -85438 15066 162118 157863
22371A57863p8705M958M5143L7442r8788r9506p7110M1947M6594Q6104K676K0985
$$ 157863 79158 84116 129259 166701 67913 -31593 -108703 -66756 -20162 65942 68618 89603
22359H9603j11373P235O6843P224p311j67919j8226J14440J0311J8693r5113n4794
$$ 89603 -21770 -14535 52308 59532 52221 -115698 -133924 -19484 -9173 9520 -85593 -140387
22347a40387N0055J83332M1511j12567l1625J22427p4986q0593O458L9092L4048
$$ -140387 -90332 93000 134511 21944 -9681 112746 37760 -42833 -36375 2717 36765
22336C6765j90987k7210J09708J00297o8338p9003k3633J78421R8033o3385L1213
$$ 36765 -154222 -181432 -71724 28573 -39765 -118768 -142401 36020 134053 70668 101881
22325A01881M3710p266j4584k51324p1447J805J01181J36716J09976o7117p1334
$$ 101881 145591 138325 123741 -127583 -199030 -197225 -96044 40672 150648 83531 12197
22314A2197j3449K0454j6680N0956J4344j37779p0940j3998j0010J36722J65335
$$ 12197 -1252 19202 2522 53478 67822 -69957 -140897 -154895 -164905 -28183 137152
22303A37152L8053j44946m2532J05062j397p1578l3406j61546P5831N8022p1393
$$ 137152 175205 30259 -12273 92789 91392 19814 -13592 -175138 -99307 -41285 -112678
22292a12678l5831K9491J32861N0480M1842o7266N6656Q315N0332q3364q402J9878
$$ -112678 -148509 -119018 13843 64323 106165 38899 95555 103870 154202 70838 62436 82314
22280H2314L4690l0102j32157j76111j718K8317J01625Q5073m435Q7059J03913
$$ 82314 117004 86902 -45255 -221366 -223084 -194767 -93142 -8069 -12504 74555 178468
22269A78468j7183j28541k4452J53162k7703q0334o7943Q374P724P9185j12254
$$ 178468 161285 32744 8292 161454 133751 53417 -14526 -6152 1572 80757 -31497
22258c1497r1209N7876P3602o3612K6414r3004n9420P117J13127J97750j0336
$$ -31497 -122706 -64830 8772 -54840 -28426 -121430 -180850 -173733 -60606 137144 126808
22247A26808j95202r0637j18740J7295L6183R3963k0356l1860Q5710M9575R786
$$ 126808 -68394 -159031 -277771 -260476 -224293 -130330 -150686 -182546 -96836 -47261 -37475
22236c7475M7599M1524k9965P9627o413j42542M7740p1345l5487m0177J06971
$$ -37475 10124 51648 21683 101310 94897 -47645 95 -71250 -106737 -146914 -39943
22225c9943J49718n0724K2584J6600j32229O1455l8388m6736j06910q165O6240
$$ -39943 109775 59051 81635 98235 -33994 27461 -10927 -57663 -164573 -172738 -106498
22214a06498j5909P628P4732p8704K4661L1805l2419O3753O1288M840K0788j1002
$$ -106498 -122407 -114779 -40047 -118751 -94090 -62285 -94704 -30951 30337 35177 55965 44963
22202D4963j08137j26067R9206R0734Q503J8571M596o4515l289j13294m8338j2512
$$ 44963 -63174 -189241 -90035 699 9202 27773 32369 -32146 -35435 -148729 -197067 -209579
22190b09579J93808J20392j19847j1873o2165p6668M1627j1230m4915j816J33406
$$ -209579 -15771 104621 -15226 -27099 -89264 -165932 -124305 -135535 -180450 -182266 -48860
22179d8860j05932k08933Q1168R9941N6211R75r2952o207M0283M0871K4173k45
$$ -48860 -154792 -363725 -282557 -182616 -126405 -125430 -218382 -224589 -184306 -143435 -119262 -119507
22167a19507O4671m4293m8149j3260R170J9879R7765l9996O7538K8672r362r6765
$$ -119507 -54836 -99129 -147278 -160538 -151368 -131489 -33724 -73720 -6182 22490 13128 -83637
22155h3637P9936R1744l5763O8131m4172J7253l9050O503J1133P745l534m2913
$$ -83637 -3701 88043 52280 120411 76239 93492 54442 60945 72078 79823 76289 33376
22143C3376j78221j6557j468R6325L6984l4660m3989n2081L3036K6570K8337J8332
$$ 33376 -144845 -161402 -162870 -66545 -29561 -64221 -108210 -160291 -127255 -100685 -72348 -54016
22131e4016L4336N3188p5995j1626m1279J272j1335M0303J6697p2997J4897j10182
$$ -54016 -19680 33508 -42487 -54113 -95392 -94120 -105455 -65152 -48455 -121452 -106555 -216737
22119b16737J4847J22367O4812n8567P5165N5716L9400j02537j57194l6649L3629
$$ -216737 -201890 -79523 -14711 -73278 1887 57603 97003 -5534 -162728 -199377 -165748
22108a65748L9417J10038L4359r2871k7483n1655p7745P4187R5138p5506n0039
$$ -165748 -126331 -16293 18066 -74805 -102288 -153943 -231688 -157501 -62363 -137869 -187908
22097a87908k8306K1307M7402N9743J8190j4195n9502J4633L3988j2166O7377
$$ -187908 -216214 -194907 -147505 -87762 -69572 -83767 -143269 -128636 -94648 -106814 -39437
22086c9437J5236j23531q6930k2416R1982O9662p9209r2421m4789N1447J8082
$$ -39437 -24201 -147732 -234662 -257078 -165096 -95434 -174643 -267064 -311853 -260406 -242324
22075b42324R8308N4259m2242l0986L9099R9691P1426J14445m8259n7466j63347
$$ -242324 -144016 -89757 -131999 -162985 -123886 -24195 47231 161676 113417 55951 -107396
22064a07396j7972J33450j27127q9874m804J60663J60884j6473l3181m9258k8776
$$ -107396 -125368 8082 -119045 -208919 -213723 -53060 107824 91351 58170 8912 -19864
22053a9864L3216j2089k060P2011o1083o9370L1606r2486k408R060N2349J67933
$$ -19864 13352 1263 -797 71214 10131 -59239 -27633 -120119 -122527 -113467 -61118 106815
22041A06815m28j55614N89N250M91P4610m7009k12660o4368k1825O0679L7687
$$ 106815 106387 -49227 -48638 -43388 -42897 31713 -15296 -227956 -292324 -314149 -253470 -215783
22029b15783O9133J53494o1328J80454k6212j54126m9700J6885N852q848N2205
$$ -215783 -146650 6844 -54484 125970 99758 -54368 -104068 -87183 -81331 -90179 -37974
22018c7974k9425j9037O8794o9833o051j0861l1181L7515J8398j8607n4010R3745
$$ -37974 -67399 -86436 -17642 -87475 -93526 -104387 -135568 -98053 -79655 -98262 -152272 -58527
22006e8527J04016N6989j6470j06372r2285j17053n0894L8607J88378N7120n3982
$$ -58527 45489 102478 86008 -20364 -112649 -229702 -280596 -241989 -53611 3509 -50473
21995e0473j7107Q2874L4791j00232J31707K3888O270J05947P9579p4678n1567
$$ -50473 -67580 15294 50085 -50147 81560 105448 111718 217665 297244 222566 170999
21984A70999O1883o3549j8020J0062q2431j19548p0603Q1462P8775k8973j37980
$$ 170999 232882 169333 151313 161375 78944 -40604 -111207 -29745 49030 20057 -117923
21973a17923n7475L4792K7840O7579M1J3750j11477M3196J76580O6052p356M3599
$$ -117923 -175398 -140606 -112766 -45187 -45146 -31396 -142873 -99677 76903 142955 135599 179198
21961A79198J07490r9989j65166n8213J091j5770k7926k5209O6762N6791k8197
$$ 179198 286688 186699 21533 -36680 -35589 -51359 -79285 -104494 -37732 19059 -9138
21950i138l9776n9119j19097r842O5135J31741L9747j5223o9318r4495J4198J44380
$$ -9138 -48914 -108033 -227130 -236972 -171837 -40096 -349 -15572 -84890 -179385 -165187 -20807
21938b0807R7640j12903m820J00065j08916o3600J50895R9483n1543j8469k6929
$$ -20807 76833 -36070 -40890 59175 -49741 -113341 37554 137037 85494 67025 40096
21927D0096k26250p0853L8997L1437j46819q484K00656M028o5117Q3153J17567
$$ 40096 -186154 -257007 -218010 -186573 -333392 -341876 -141220 -137192 -202309 -119156 -1589
21916a589L2207m7003l4396J9913r9636k8515P5636j0973j62024j5412J54550
$$ -1589 30618 -16385 -50781 -30868 -130504 -159019 -83383 -94356 -256380 -271792 -117242
21905a17242L4574n1710p8947m1625Q59j44159l1612J19053J87548J74084L2057
$$ -117242 -82668 -134378 -213325 -254950 -254091 -398250 -429862 -310809 -123261 50823 82880
21894H2880q5486q9208j49659k7013k9560L7448J8638k417J32651L19859j13032
$$ 82880 -2606 -91814 -241473 -268486 -298046 -260598 -241960 -244377 -111726 208133 95101
21883I5101j90643n2128p8754Q5534J01030N3747j23739r2798o5035o4773K3604
$$ 95101 -95542 -147670 -226424 -140890 -39860 13887 -109852 -202650 -267685 -332458 -308854
21872c08854M9718R4273O2291P6237O7589n446N9041j090k6049j14932r5998o6766
$$ -308854 -259136 -164863 -102572 -26335 41254 35808 94849 93759 67710 -47222 -143220 -209986
21860b09986M80Q9835J49557J3922M7804O2395p5152r670j24138L3261j9932M2450
$$ -209986 -209506 -119671 29886 43808 91612 154007 78855 69185 -54953 -21692 -41624 826
21848H26J14410R1919j46382q1122o509L5747J6036j21811R480k1536M0349q7989
$$ 826 115236 207155 60773 -20349 -26858 8889 24925 -96886 -87406 -108942 -68593 -156582
21836a56582N3883M3463q5417l4874J1389J64216Q632q2050j07678N7464r8000
$$ -156582 -102699 -59236 -144653 -179527 -168138 -3922 4710 -77340 -185018 -127554 -225554
21825b25554j1593Q1292P3051Q4379P7917n6660k3458l2756M7785m647K0707j50572
$$ -225554 -237147 -155855 -82804 1575 79492 22832 -626 -33382 14403 9756 30463 -120109
21813a20109p0761K0529J10905R3738R2434P298j73014k1866K3864Q750K9201
$$ -120109 -190870 -170341 -59436 34302 126736 134034 -38980 -60846 -36982 -28232 969
21802I69o1753l4841K6661O5054K2730J8122l3544l5218J08310j00750J38427
$$ 969 -60784 -95625 -68964 -3910 18820 36942 3398 -31820 76490 -24260 114167
21791A14167p9031o2959j8866o9777M0291M3424j61903j060J16374J8155L6913
$$ 114167 35136 -27823 -46689 -116466 -76175 -32751 -194654 -195714 -79340 -61185 -24272
21780b4272J75553J6835M0898j25936j09845M2372R1645K2057L9514j7971L0903
$$ -24272 151281 168116 209014 83078 -26767 15605 107250 129307 168821 150850 181753
21769A81753j4898j06080o3603j2123q598p74k7448j33601o4874l1459J00299
$$ 181753 166855 60775 -2828 -14951 -23549 -24323 -51771 -185372 -250246 -281705 -181406
21758a81406K22232J27958L4780q1696j53936M8514P6254M3765k3535O0952Q9849
$$ -181406 40826 168784 203564 121868 -32068 16446 92700 136465 112930 173882 263731
21747B63731j44083j17864r7027P3419O6018K16780N6968k93562o4266m655P0162
$$ 263731 119648 1784 -95243 -21824 44194 260974 317942 24380 -39886 -44541 25621
21736B5621p2488p6166N6264q6585J64269J40113p9068l7020N6562q6974k29605
$$ 25621 -46867 -123033 -66769 -153354 10915 151028 71960 34940 91502 4528 -225077
21725b25077r9274J1912J18914M6678q673r2974N2031Q2699K1210P64O02Q1208
$$ -225077 -324351 -312439 -193525 -146847 -155520 -248494 -196463 -113764 -92554 -91790 -91188 -9980
21713i980J07794j37812l6434J16434j77318j59861m6652J4678P2596J23765J67266
$$ -9980 97814 -39998 -76432 40002 -137316 -297177 -343829 -329151 -256555 -132790 34476
21702C4476K8349J0041J0351r4299n0851Q583p1155m4444J3932P5447Q1479l0124
$$ 34476 62825 72866 83217 -11082 -61933 -53350 -124505 -168949 -155017 -79570 1909 -28215
21690b8215J31063J9416r1490j2713O6542j55967K275O1215L6060N1300O753l7961
$$ -28215 102848 122264 30774 18061 84603 -71364 -69089 -7874 28186 79486 86239 48278
21678D8278j07085M1673O5986n9098j64302p9898J88860J15143Q853J5137J248
$$ 48278 -58807 -17134 48852 -10246 -174548 -254446 -65586 49557 58410 73547 74795
21667G4795j78102M8240M3878p3984J02418j5158j14468p6232J03164q3472l8257
$$ 74795 -103307 -55067 -11189 -85173 17245 2087 -112381 -188613 -85449 -168921 -207178
21656b07178l8457K6888J57725J2069M1689J75002J44583M5889K1053j24309j4414
$$ -207178 -245635 -218747 -61022 -48953 -7264 167738 312321 358210 379263 254954 240540
21645B40540o3946o5318j3148M0500j79609k13564P1912J79534p0858p3223n3030
$$ 240540 176594 111276 98128 138628 -40981 -254545 -182633 -3099 -73957 -147180 -200210
21634b00210N3275J30768J08730l1566m8984M9813m8909Q668Q9310q3736k19235
$$ -200210 -146935 -16167 92563 60997 12013 61826 12917 21585 110895 27159 -192076
21623a92076m7785J14955O8046J27012K13812p2206q4602q5249L0820L3471j09874
$$ -192076 -239861 -124906 -56860 70152 283964 211758 127156 41907 72727 106198 -3676
21612c676j30420l4271l9975K24388K22023j73278q9979P5848l314j51649j14623
$$ -3676 -134096 -168367 -208342 16046 238069 64791 -25188 50660 47346 -104303 -218926
21601b18926K47948J09659o3823k9323J3891j05968O2508K3190r5499j02885P2391
$$ -218926 29022 138681 74858 45535 59426 -46542 15966 39156 -56343 -159228 -86837
21590h6837J03860l0938m928L2776q7566p805m4513M9541j3981J5611q025J203
$$ -86837 17023 -13915 -18843 13933 -73633 -81438 -125951 -76410 -90391 -74780 -82805 -81602
21578h1602l7083P9149K2279L930J9143o8293p630J9922N2014j58178q174M2505
$$ -81602 -118685 -39536 -17257 -13327 5816 -62477 -70107 -50185 1829 -156349 -164523 -122018
21566a22018K4647M340j5668j80671R863J87964L1305j56982p6305O8512J13401
$$ -122018 -97371 -93031 -108699 -289370 -279507 -91543 -60238 -217220 -293525 -225013 -111612
21555a11612J11455j33870o829Q7558m9881p6602K21k7277n1631p6455p5654Q3722
$$ -111612 -157 -134027 -140856 -53298 -103179 -179781 -179560 -206837 -258468 -334923 -410577 -326855
21543c26855J16469J07113N2159L1812j04772j04745n4158J20557J70812q4989
$$ -326855 -210386 -103273 -51114 -19302 -124074 -228819 -282977 -162420 8392 -76597
21533g6597P741P446K1601j5391L4551R4538q6243o4390J13128R8752j8064o8707
$$ -76597 -68856 -61410 -39809 -55200 -20649 73889 -12354 -76744 36384 135136 117072 48365
21521D8365j34797J292M1357N8451j52203n8149J13505Q6665Q3303L7519j05723
$$ 48365 -86432 -85140 -43783 14668 -137535 -195684 -82179 4486 87789 125308 19585
21510A9585r5581j44971j73604P623N4639Q3327K8557N7153L6022p8053J878P1796
$$ 19585 -75996 -220967 -394571 -386948 -332309 -248982 -220425 -163272 -127250 -205303 -203425 -131629
21498a31629r767J7852L1558Q9971J22158J40781o76k07224r3799q354R8908J02758
$$ -131629 -141396 -123544 -91986 -2015 120143 260924 260248 53024 -40775 -49129 49779 152537
21486A52537K2259m2528j25215L9827m5770j34777J16039J79556p1977j57585
$$ 152537 174796 132268 7053 46880 1110 -133667 -17628 161928 89951 -67634
21476f7634M8944O4046J22354q9076j65709l2753R0199m176L9814L6r2712p4291
$$ -67634 -18690 45356 167710 78634 -87075 -119828 -29629 -33805 6009 6045 -86667 -160958
21464a60958N9901M6041J03716J27412r2012j20623P0835m2007o9204L1089M3181
$$ -160958 -101057 -55016 48700 176112 84100 -36523 34312 -7695 -76899 -45810 -2629
21453b629j2002Q1996j09728o6464j6042p023N4739k0344q8545k4410J52558K2649
$$ -2629 -14631 67365 -42363 -108827 -124869 -131892 -77153 -97497 -186042 -210452 -57894 -35245
21441c5245o1268L0666j7247N8157J25950L2398p8382M7626j63032m0669R3167
$$ -35245 -96513 -65847 -83094 -24937 101013 133411 55029 102655 -60377 -101046 -7879
21430g879o3754j01790l5524j0057J20727r24N0932J24542J32378K2107j4755
$$ -7879 -71633 -173423 -208947 -219004 -98277 -99201 -48269 76273 208651 230758 216003
21419B16003j075j44321o0711J42304M0493r4124q0471j8006n2866L1211J53247
$$ 216003 214928 70607 9896 152200 192693 98569 18098 92 -52774 -21563 131684
21408A31684Q0588P6049K176j47787j46208j17503R8313J87829o4436j79287j1118
$$ 131684 212272 288321 290497 142710 -3498 -121001 -22688 165141 100705 -78582 -89700
21397h9700P2053K3191N2091j7715n7713j3833K0990M4070P3609n0764q7677J9263
$$ -89700 -17647 5544 57635 39920 -17793 -31626 -10636 33434 107043 56279 -31398 -12135
21385a2135J27047N1008j02475p9907J5723m4061j10834K2062j3889J12767J13492
$$ -12135 114912 165920 63445 -16462 -739 -44800 -155634 -133572 -147461 -34694 78798
21374G8798o5741q0237k14608R0207J2589J36843l4866j18643j10717q1811J61473
$$ 78798 13057 -67180 -281788 -191581 -178992 -42149 -77015 -195658 -306375 -388186 -226713
21363b26713J84307N6318p5410j5488r023m2933L973p3276K7364J66832j1161
$$ -226713 -42406 13912 -61498 -76986 -86009 -128942 -124969 -198245 -170881 -4049 -15210
21352a5210J04608l0765j15124J02191O5928K9750n5836M7619R9854o6970J4660
$$ -15210 89398 58633 -56491 45700 111628 141378 85542 133161 233015 166045 180705
21341A80705M3548l9071l1909j9379p5686l5260K6900k5152k0715P7413k3177
$$ 180705 224253 185182 153273 133894 58208 22948 49848 24696 3981 81394 58217
21330E8217M1427o1756q2108l7511m4654J406j2695n8396J8787J5270Q4207P9152
$$ 58217 99644 37888 -44220 -81731 -126385 -124979 -137674 -196070 -177283 -162013 -77806 1346
21318A346l4719J57067o4390q0226q4614O8223L2095J502J8762L5650m1605k0679
$$ 1346 -33373 123694 59304 -20922 -105536 -37313 -5218 -3716 15046 50696 9091 -11588
21306a1588J61471K3308j16139j73996o2579k98j4936J87669J34753k1687M4293
$$ -11588 149883 173191 57052 -116944 -179523 -179821 -194757 -7088 127665 105978 150271
21295A50271L0743o1043j10245J0348p5125K7066J06970l1265j8597L8303n8150
$$ 150271 181014 119971 9726 20074 -55051 -27985 78985 47720 29123 67426 9276
21284I276j41707J33728Q5388r0724j96327k1846K4208N3067J3771N6839J10954
$$ 9276 -132431 1297 86685 -4039 -200366 -222212 -198004 -144937 -131166 -74327 36627
21273C6627N0213q2559p7101M2232p1400o0030L0616J34435O456o9626j0175q548
$$ 36627 86840 4281 -72820 -30588 -101988 -162018 -131402 3033 9489 -60137 -70312 -78860
21261g8860k0038L0828m1467n3991N1921N8144J59298R707r6845J56231m552j30968
$$ -78860 -98898 -68070 -109537 -163528 -111607 -53463 105835 115542 18697 174928 170376 39408
21249C9408j34248j28656j09296p588N7739n528J04792P4979J12136J25939j821
$$ 39408 -94840 -223496 -332792 -340380 -282641 -288169 -183377 -108398 3738 129677 127856
21238A27856j23162L0247M573j70885j44647P9020J2418J00933J15167K5366k6301
$$ 127856 4694 34941 39514 -131371 -276018 -196998 -184580 -83647 31520 56886 30585
21227C0585L7863m5596K3607J22387m9017n9395j16363J7193R9586O0756M9067
$$ 30585 68448 22852 46459 168846 119829 60434 -55929 -38736 60850 121606 170673
21216A70673p8896L5505j0856l5414j29576J1503J30685N7961m2914L2367L7790
$$ 170673 91777 127282 116426 81012 -48564 -37061 93624 151585 108671 141038 178828
21205A78828O9654O923k23928j43941L0789J04976J01992Q1948P9979o2998j32887
$$ 178828 248482 255405 31477 -112464 -81675 23301 125293 207241 287220 224222 91335
21194I1335j7683n6762j5210P5904m6454j2401J8078j2913J17179m5159o9616
$$ 91335 73652 16890 1680 77584 31130 18729 36807 23894 141073 95914 26298
21183B6298N4106m9334n2416J3100O7152n9335n6456n4585k5105M6483J45550
$$ 26298 80404 31070 -21346 -8246 58906 -429 -56885 -111470 -136575 -90092 55458
21172E5458J21864O5347K8406j15257p6103r7938Q9055n6116j1340L0095N1652
$$ 55458 177322 242669 271075 155818 79715 -18223 70832 14716 3376 33471 85123
21161H5123l1653J202J6468R666O0102J891n9761p5043p9534J36044Q0117l8248
$$ 85123 53470 54672 71140 80806 140908 142799 83038 7995 -71539 64505 144622 106374
21149A06374q9600j08331L1522J38856P5726j11662k2207M9221N2253P7409J06207
$$ 106374 16774 -91557 -60035 78821 154547 42885 20678 69899 122152 199561 305768
21138C05768J16354m7509q8546j1692o538q1596j93924J71245O0779J31876j2926
$$ 305768 422122 374613 286067 274375 267837 186241 -7683 163562 224341 356217 343291
21127C43291K8404j2072j0041j6400K1834o8596N5314o4518K2085L4501p3287
$$ 343291 371695 359623 349582 333182 355016 286420 341734 277216 299301 333802 260515
21116B60515j06560J2807J10746n5338r0053J82371N9420J04951j0084k52897
$$ 260515 153955 166762 277508 222170 132117 314488 373908 478859 468775 215878
21106B15878m8948L1060p4915l9960J16083P4031j63663j58409N519O9853J00486
$$ 215878 166930 197990 123075 83115 199198 273229 109566 -48843 -43324 26529 127015
21095A27015p1499j6161o9170L2588O9138K3554N3642p5454n0179p171k2706N9683
$$ 127015 55516 39355 -29815 2773 71911 95465 149107 73653 23474 16303 -6403 53280
21083E3280J19438N3226l0068j43852l6608M5559J41000n396J2901r8672L3321
$$ 53280 172718 225944 195876 52024 15416 60975 201975 196579 209480 110808 144129
21072A44129j37201L2445M1884J5008m2188o2453q2448K4758Q1027J00755N7877
$$ 144129 6928 39373 81257 96265 54077 -8376 -90824 -66066 14961 115716 173593
21061A73593o6352q6042o3184J43621J26104j59084p2978j17064L4742K266k05
$$ 173593 107241 21199 -41985 101636 227740 68656 -4322 -121386 -86644 -84378 -84583
21050h4583K8562J18310J2225k37225M2707N6983q8672J24999Q6345M6217L3336
$$ -84583 -56021 62289 74514 -162711 -120004 -63021 -151693 -26694 59651 105868 139204
21039A39204J10197Q6618j93800k38729J2076J59072M6498N885J78284k1049j07296
$$ 139204 249401 336019 142219 -96510 -84434 74638 121136 127021 305305 284256 176960
21028A76960p3880o9566q2770J32241J56892m3680j01022o7597n6645Q4623p6655
$$ 176960 103080 33514 -49256 82985 239877 196197 95175 27578 -29067 55556 -21099
21017b1099q3450J19373j8965J9958K3002r6943N2448K139j5842M7814j16544
$$ -21099 -104549 14824 -4141 15817 38819 -58124 -5676 -3537 -19379 28435 -88109
21006h8109l2461J11065j1699M7819Q8773m7485n7989l1063j3556j04953j38915
$$ -88109 -120570 -9505 -21204 26615 115388 67903 9914 -21149 -34705 -139658 -278573
20995b78573K0829R672o845R4209J75432N5825j66991J19361R0746q1587j21282
$$ -278573 -257744 -248072 -254917 -160708 14724 70549 -96442 22919 113665 32078 -89204
20984h9204J2043n663R9310N6286J78787M3147j04050q4725o7683R8413k6179
$$ -89204 -77161 -82824 16486 72772 251559 294706 190656 105931 38248 136661 110482
20973A10482j9739q4298L6568P6557O6784j48418k1642J90865k9036j91290q7904
$$ 110482 90743 6445 43013 119570 186354 37936 16294 207159 178123 -13167 -101071
20962a01071m0337n8050M8648l5468L926J46716K34453O3540j51914L1569K5372
$$ -101071 -141408 -199458 -150810 -186278 -182352 -35636 198817 262357 110443 142012 167384
20951A67384r4773j12484j80J02002Q7334n6092j03834K8084j17502o736l0390
$$ 167384 72611 -39873 -40053 61949 149283 93191 -10643 17441 -100061 -106797 -137187
20940a37187m5119J31541J21224J92330J42444J0446k15429j16474r7677N4761
$$ -137187 -182306 -50765 70459 262789 405233 415679 200250 83776 -13901 40860
20930D0860M6590m055N3749N2739O2969j42326j59376n6452o6430l0959N7485
$$ 40860 87450 83395 137144 189883 252852 110526 -48850 -105302 -171732 -202691 -145206
20919a45206Q250J20448J12909O1108K4039p8256j0669o908K1113o0352J1492
$$ -145206 -136956 -16508 96401 157509 181548 103292 92623 85715 106828 46476 57968
20908E7968l5010j0029L9143k347l6526O2002K19901m7285N1894J75757q4662
$$ 57968 22958 12929 52072 49725 13199 75201 295102 247817 299711 475468 390806
20897C90806j43828p0640l6650m4616j7748r1728K5034J59745M4668j34586j46730
$$ 390806 246978 176338 139688 95072 77324 -14404 10630 170375 215043 80457 -66273
20886f6273P0286J85989K35449K43028R3031J5582K66720L70828J15779n7916
$$ -66273 4013 190002 425451 668479 761510 777092 1043812 1414640 1530419 1472503
20876A472503R1115o0639K5002K34259M30897M02099J67115j38878m40482l77292
$$ 1472503 1563618 1502979 1527981 1762240 2193137 2595236 2762351 2623473 2182991 1805699
20866A805699k40378j58872K73382J40006j67997k16585k73417l39157l18111
$$ 1805699 1565321 1406449 1679831 1819837 1651840 1435255 1161838 822681 504570
20857E04570k72556l5808Q8809j40276J0875J4135J40389j7327r4183k5935k3000
$$ 504570 232014 196206 285015 144739 155614 169749 310138 292811 198628 172693 149693
20846A49693j84933p8164M38M3044R3543j882P0145l3067P3860L0393l6778j34048
$$ 149693 -35240 -113404 -112966 -69922 23621 21739 91884 58817 132677 163070 126292 -7756
20834g756j73770m7497P6972M3267J54539K6327L1119M5675L0827K2057j34772
$$ -7756 -181526 -229023 -152051 -108784 45755 72082 103201 148876 179703 201760 66988
20823F6988K05l3423j2619m3349n5964J12095j7031J27166L823p4973j55182o3993
$$ 66988 67193 33770 21151 -22198 -78162 33933 16902 144068 147891 72918 -82264 -146257
20811a46257m9408l8614K05368J8359M0651q7547m6737L1174j30388K6613R1573
$$ -146257 -195665 -234279 -28911 -10552 30099 -57448 -104185 -73011 -203399 -176786 -85213
20800h5213P5160n4671P7289J28519q1288q3875P1512O4081O4152r8129q3350
$$ -85213 -10053 -64724 12565 141084 59796 -24079 47433 111514 175666 77537 -5813
20789e813K8714q649N5946Q9156m5054o0334J09419J27188J4649j47098j44971
$$ -5813 22901 14252 70198 159354 114300 53966 163385 290573 305222 158124 13153
20778A3153p712J53321N2702J01267N6086O916q6246j16716n7867q9725k9645
$$ 13153 5441 158762 211464 312731 368817 375733 289487 172771 114904 25179 -4466
20767d466K3773n7112J33543J52230Q5549N8706n3329l3389j21014q5518j42048
$$ -4466 19307 -37805 95738 247968 333517 392223 338894 305505 184491 98973 -43075
20756d3075M8451J18189q5667k1160j04387J5180P0310P2166L0054j29130P6332
$$ -43075 5376 123565 37898 16738 -87649 -72469 -2159 70007 100061 -29069 47263
20745D7263L4390p5082k8612j46163Q4183j498P3255P4749L7172N5549N986j20526
$$ 47263 81653 6571 -22041 -168204 -84021 -85519 -12264 62485 99657 155206 161192 40666
20733D0666j12004Q5544n7228O2391j06001n0439l1256J9246L1052J52665J19105
$$ 40666 -71338 14206 -43022 19369 -86632 -137071 -168327 -149081 -118029 34636 153741
20722A53741n0377k12500Q1650L1849L9584P3100p0198m541R4105l3438j27440
$$ 153741 103364 -109136 -27486 4363 43947 117047 46849 42308 136413 102975 -24465
20711b4465o8711m5770k7892o8936P2098L5724J28128N8476k4319r4373j5992
$$ -24465 -93176 -138946 -166838 -235774 -163676 -127952 176 58652 34333 -60040 -76032
20700g6032M4375K2241j31387P8208J48573Q2076q5761m2939m8854N5956J11973
$$ -76032 -31657 -9416 -140803 -62595 85978 168054 82293 39354 -9500 46456 158429
20689A58429q8090M0007M3878O125L7533R9865J9895j26369m7181k403p14J8761
$$ 158429 70339 110346 154224 160349 197882 297747 317642 191273 144092 141689 140975 159736
20677A59736N0069k952p619R7982R1257j49853q1321j21640L4229M2267j2005
$$ 159736 209805 206853 199234 297216 388473 238620 157299 35659 69888 112155 100150
20666A00150q3268l6111j34185M7152J19128o4175p026K3137o757P3463R9372
$$ 100150 16882 -19229 -153414 -106262 12866 -51309 -58335 -35198 -41955 31508 130880
20655A30880j1699N6500N0152j26033j98769r5011K62631J5903j7019O3223l2554
$$ 130880 119181 175681 225833 99800 -98969 -193980 68651 84554 67535 130758 98204
20644I8204k29206j26783J74011K19441J48444o538J0938L5340r139p3000k2629
$$ 98204 -131002 -257785 -83774 135667 284111 277573 288511 323851 314712 241712 219083
20633B19083j65886J23591J28298N4748m4925j86560k18178n5261Q8302M1004
$$ 219083 53197 176788 305086 359834 314909 128349 -89829 -145090 -56788 -15784
20623a5784O8946j3729J0303Q127j8631J01895j0812l0059J8386p5536q2899J03573
$$ -15784 53162 39433 49736 57863 39232 141127 130315 100256 118642 43106 -39793 63780
20611F3780k892P5652R0415J6087q2795j34989o0918P0334k3216J438Q327l3025
$$ 63780 60888 136540 226955 243042 160247 25258 -35660 34674 11458 12896 21223 -11802
20599a1802p4053N0867J81473P1678p3697J50341n759j82002k7102K0023M4443
$$ -11802 -85855 -34988 146485 218163 144466 294807 289048 107046 79944 99967 144410
20588A44410P3228J22900J10662j08535j14424j13405n3829k8380P9598O2866
$$ 144410 217638 340538 451200 342665 228241 114836 61007 32627 112225 175091
20578A75091q0334m9507J13547Q4553J24123n1790Q6409N5418L3992m4040R8196
$$ 175091 94757 45250 158797 243350 367473 315683 402092 457510 491502 447462 545658
20567E45658m1043m3066L535K2516P2095J7500j14971L6896M8979L5915J55781
$$ 545658 504615 461549 465084 487600 559695 577195 462224 499120 548099 584014 739795
20556G39795K07267J2563j63861k48144j09514j58166j26083J3537q5650l2313
$$ 739795 947062 959625 795764 547620 438106 279940 153857 167394 81744 49431
20546D9431K0118O5537m8082O9646R1842M2171M9276L9470O0457j27827n8818
$$ 49431 69549 135086 87004 156650 248492 290663 339939 379409 439866 312039 253221
20535B53221J02608R543K1168j7216j81027o5494k25983Q9359P3177P8125k913
$$ 253221 355829 365372 386540 369324 188297 122803 -103180 -13821 59356 137481 134568
20524A34568j9178p179j5120P8097O3282m3512Q194J27439K8375r4815J18576
$$ 134568 115390 108211 93091 171188 234470 190958 199152 326591 354966 260151 378727
20513C78727o6509j22799o3141O2724L078n3900N1851J04281j41565j84737J2805
$$ 378727 312218 189419 126278 189002 192080 138180 190031 294312 152747 -31990 -19185
20502a9185j0725N6641J5616L3240j4043m9J38911J17987N0505J6677J01141J21744
$$ -19185 -29910 26731 42347 75587 61544 61495 200406 318393 368898 385575 486716 608460
20490F08460O4155p3087k46035N4355K1140k07303j8688P8380n0624L2169k3291
$$ 608460 672615 599528 353493 407848 428988 221685 202997 281377 230753 262922 239631
20479B39631K4087k1969J45688R1115J203j53093M1003O2640j6576q4244Q2620
$$ 239631 263718 241749 387437 478552 479755 326662 367665 430305 413729 329485 412105
20468D12105J42765j15573M7839M8692M0030j48908l1972j07686k3311J33592
$$ 412105 554870 439297 487136 535828 575858 426950 394978 287292 263981 397573
20458C97573L6553P0225l1940l2332q3991j58016n5655K12424K7016r75J9816
$$ 397573 434126 504351 472411 440079 356088 198072 142417 354841 381857 380882 400698
20447D00698j0692J8735K0255l4244N0701M6155j69348r0113P4802Q9108J8104
$$ 400698 390006 408741 428996 394752 445453 491608 322260 232147 306949 396057 414161
20436D14161j217R7115J45458q4068j17265k861P8202M380M4375m6544J82983
$$ 414161 412944 510059 655517 571449 454184 451323 529525 533905 578280 531736 714719
20425G14719P0258j51529n8327J02835n7892N176K3075J34414l3127j00603k6927
$$ 714719 784977 633448 575121 677956 620064 625240 648315 782729 749602 648999 622072
20414F22072n9933p901n1187j1848o4854r2950J5785J00859M9767N2580J62900
$$ 622072 562139 554238 503051 491203 426349 333399 349184 450043 499810 552390 715290
20403G15290K04946J05420o6803l546j645J0699j5676m0904l3214J0132M6473
$$ 715290 920236 1025656 958853 955307 953662 964361 948685 907781 874567 884699 931172
20392I31172n2774Q9027j05323j19794K6787J48795O1158p0405K29274R3470j29027
$$ 931172 878398 967425 862102 742308 769095 917890 979048 908643 1137917 1231387 1102360
20381A102360m3587K21433J88987R2512M6633J9128k0310r9698k23961j05204
$$ 1102360 1058773 1280206 1469193 1561705 1608338 1627466 1607156 1507458 1283497 1178293
20371A178293R5798J392P9287K8586J30837J17663j0487Q9042N4438J04038J16095
$$ 1178293 1274091 1275483 1354770 1383356 1514193 1631856 1621369 1710411 1764849 1868887 1984982
20360A984982J17497K11764J53691J35695K4123J45948J91665K62708L13831L53701
$$ 1984982 2102479 2314243 2467934 2603629 2627752 2773700 2965365 3228073 3541904 3895605
20350C895605J98809L35743M85972N60484N67077M82473N04580Q50672J079941
$$ 3895605 4094414 4430157 4916129 5476613 6043690 6526163 7030743 7881415 8961356
20341H961356J473205J810072J453121R28658P93560R03338J641671K587230L736913
$$ 8961356 10434561 12244633 13697754 14626412 15419972 16323310 17964981 20552211 24289124
20332B4289124M618618N291048O650048R741702J5892047K8667841N1546598P7517388
$$ 24289124 28907742 34198790 40848838 50590540 66482587 95150428 146697026 224214414
20324B24214414N6994358n668760k4350914j6380725M347767M8770734J06428007
$$ 224214414 281208772 275540012 251189098 234808373 239156140 287926874 394354881
20317C94354881J07516358L5330581m9318564q6246638p7404779n1742045j1930524
$$ 394354881 501871239 537201820 487883256 401636618 324231839 272489794 260559270
20310B60559270L2970704L9761106k2858498n7473382n5666073n0414624l8536224
$$ 260559270 293529974 333291080 310432582 252959200 197293127 146878503 108342279
20303A08342279k4486213j4997314j0302742q202589p082816n904261m760448
$$ 108342279 83856066 68858752 58556010 50353421 43270605 37366344 32605896
20296C2605896l307136k355745j745765j701858k122845k111230j875122j607316
$$ 32605896 29298760 26943015 25197250 23495392 21372547 19261317 17386195 15778879
20288A5778879j395513j227687j114954r96780q84092q70765n96589o35915n90912
$$ 15778879 14383366 13155679 12040725 11043945 10159853 9289088 8692499 8056584 7465672
20279G465672m11169n15658m80611m14849m15006j64673j75964l79842k47440
$$ 7465672 7054503 6538845 6058234 5643385 5228379 5063706 4887742 4507900 4260460
20270D260460k7679k32541j31350K0369j03374q6624j064j53320j96476o0969
$$ 4260460 4232781 4000240 3868890 3889259 3785885 3699261 3698197 3544877 3348401 3287432
20260C287432R522j09901j29543j65191r2338k01580j25079k32232j88868q1265
$$ 3287432 3296954 3187053 3057510 2892319 2799981 2598401 2473322 2241090 2052222 1970957
20250A970957N3850k7531J5327j20769q2085l2847K5380J48576l813k70757j96903
$$ 1970957 2024807 1997276 2012603 1891834 1809749 1776902 1802282 1950858 1947045 1676288 1479385
20239A479385p4939k4830j80377j9811m1715n6578n8691o1654j01661k2718Q8907
$$ 1479385 1404446 1379616 1199239 1179428 1137713 1081135 1022444 960790 859129 836411 925318
20228I25318p45Q223j22268j43442M304j6707P2276j45983q0207o4419Q9763o59
$$ 925318 924573 932796 810528 667086 671390 654683 726959 580976 500769 436350 526113 525454
20216E25454n0958J38706M2552K987j6309j5073k0231r4937j4700k5655K9491
$$ 525454 474496 613202 655754 658741 642432 627359 607128 512191 497491 471836 501327
20205E01327K4673n165k4195J8836J08401j44106o4082m2979m3307J67634J3111
$$ 501327 526000 520835 496640 515476 623877 479771 415689 372710 329403 497037 510148
20194E10148o9111l9517L6942P8237k6722P782j36860J16364N0781j09876J1901
$$ 510148 441037 401520 438462 516699 489977 497759 360899 477263 528044 418168 430069
20183D30069j313j54962q7185J11274N3666N6617R5590j44871j46769l2368L9912
$$ 430069 428756 273794 186609 297883 351549 408166 503756 358885 212116 179748 219660
20172B19660n8952q6021P8229J83764R7440n4086k37178p830R3179o6909J59572
$$ 219660 160708 74687 152916 336680 434120 380034 142856 135026 228205 161296 320868
20161C20868m0590n7922j70384K4786Q5458l8707Q0461N493j06753j07846j28205
$$ 320868 280278 222356 51972 76758 162216 123509 203970 209463 102710 -5136 -133341
20150a33341O5877J21822m1687m7974R1282Q4234R7654r8565J1980P8364O6354
$$ -133341 -67464 54358 12671 -35303 55979 140213 237867 139302 151282 229646 296000
20139B96000J09117M5821O639R0859R5286N5009N8994l5456J302K25253J76649
$$ 296000 405117 450938 457577 548436 643722 698731 757725 722269 723571 948824 1125473
20128A125473K0661k17001k97488J5620J8672p0572m3281Q3746K45299J80028
$$ 1125473 1146134 929133 631645 647265 665937 595365 552084 635830 881129 1061157
20118A061157J07975J57367N5375J03801K53713K2759j83625k11566k26925O4270
$$ 1061157 1169132 1326499 1381874 1485675 1739388 1762147 1578522 1366956 1140031 1204301
20108A204301J56883R9215n8608k23856k37029j29489l9971o5718q7314l6229
$$ 1204301 1361184 1460399 1401791 1177935 940906 811417 771446 705728 618414 582185
20098E82185J20753m2158n8818j18992r4391k12523m1452J06494K44521L5413
$$ 582185 702938 660780 601962 482970 388579 176056 134604 241098 485619 521032
20088E21032q6536j20727L8637L5427o1117j20170J9582l3537O4387M1029l2837
$$ 521032 434496 313769 352406 387833 326716 206546 226128 192591 256978 298007 265170
20077B65170M4548j02984n0542J84093Q6029n3233m5871o2212p7346K5158J7663
$$ 265170 309718 206734 156192 340285 426314 373081 327210 264998 187652 212810 230473
20066B30473j567L4124o6552J3929O2471J8257K2658J56203J65259J36255L14663
$$ 230473 228906 263030 196478 210407 272878 291135 313793 469996 635255 771510 1086173
20055A086173L42433K66092M9240j03557r9708r1128J91872J43393j55595r3324
$$ 1086173 1428606 1694698 1743938 1640381 1540673 1449545 1641417 1784810 1629215 1535891
20045A535891o7316k89839j97482j91370r4385m4416O71k14817o8264K023j39511
$$ 1535891 1468575 1178736 981254 789884 695499 651083 651754 436937 368673 370696 231185
20034B31185J12330L5695k0176m0568j36621P0650J83110K7403j30496j89253
$$ 231185 343515 379210 359034 318466 181845 252495 435605 463008 332512 143259
20024A43259Q7511k5104o8006q9173R8638P0423k0853j16462p8885J59395j8010
$$ 143259 230770 205666 137660 48487 147125 217548 196695 80233 1348 160743 142733
20013A42733M3448K3638M1388l6693Q9966j2453p9508m0736M8987R3336r1299
$$ 142733 186181 209819 251207 214514 304480 292027 212519 171783 220770 314106 222807
20002B22807j10254j42841l6409P1010n880M2472L209q0633k1513R0477L0374
$$ 222807 112553 -30288 -66697 4313 -1567 40905 44114 -36519 -58032 32445 62819
19991F2819n6179P6548j18348K1241K8930M6854O6820J4433o668O3871L6532N9344
$$ 62819 6640 83188 -35160 -13919 15011 61865 128685 143118 136450 200321 236853 296197
19979B96197J26273j90134m7685O4610l8875k4057R8774j23058j71459j0751M4188
$$ 296197 422470 232336 184651 249261 210386 186329 285103 162045 -9414 -20165 24023
19968B4023L9155K2853P4622M7783j47012p078l2208P5676M1594k2801J0951r1421
$$ 24023 63178 86031 160653 208436 61424 54346 22138 97814 139408 116607 127558 36137
19956C6137J4011L00566J87656k1859j48396P5553Q9756k60471k47031n1097J48458
$$ 36137 50148 350714 538370 516511 368115 443668 533424 272953 25922 -25175 123283
19945A23283P499L295K4491r9623J28312L1922o5501p2963j6964J26477k4414
$$ 123283 130782 134077 158568 58945 187257 219179 153678 80715 63751 190228 165814
19934A65814q2949j8040j1553K6056O1377j27846k290J48789M998j32924J63405
$$ 165814 82865 64825 53272 79328 140705 12859 10569 159358 164356 31432 194837
19923A94837l7976j05446l7734M1099k253R0304r0514q0959L2489J17080M7909
$$ 194837 156861 51415 13681 54780 52527 142831 52317 -28642 3847 120927 168836
19912A68836l4174k9844R5585j5055J8074l9767Q638L1544M4031Q558j30044p9219
$$ 168836 134662 104818 200403 185348 203422 163655 172293 203837 247868 256426 126382 47163
19900D7163J86278K35539J0269k0174P5041K8810j00414j03946n401Q6283k6014
$$ 47163 233441 468980 479249 459075 534116 562926 462512 358566 353165 439448 413434
19889D13434P617k5025j16080P7546n580M5767q2167N9844m8537j9957j31042
$$ 413434 421051 396026 279946 357492 351912 397679 315512 375356 326819 306862 175820
19878A75820p4369l0734J04369P9633k4787o8202J73469N1513j76149M4207O3395
$$ 175820 101451 70717 175086 254719 229932 161730 335199 386712 210563 254770 318165
19867C18165p4938P4816l4627q6867J45174P2497L102l5781O5799Q4346L6202
$$ 318165 243227 318043 283416 196549 341723 414220 417322 381541 447340 531686 567888
19856E67888j09572J11877M6688j72511r7851K5034M4166q6777o8726N1120M6352
$$ 567888 458316 570193 616881 444370 346519 371553 415719 328942 260216 311336 357688
19845C57688q130j49770O0517J64088J00215J5700j35046j30304K7518m1372N1919
$$ 357688 349558 199788 260305 424393 524608 540308 405262 274958 302476 261104 313023
19834C13023J0683r8144j00366o4924L5313O712J41908K49472Q9336N6498Q8235
$$ 313023 323706 225562 125196 60272 95585 102297 244205 493677 583013 639511 727746
19823G27746K23586J90092R5369j07518j70787o9298L9430Q2407P8154M206L8522
$$ 727746 951332 1141424 1236793 1129275 958488 889190 928620 1011027 1089181 1093387 1131909
19812A131909j07195k7027R4905k6163j84148l46956k0433n6773r5637M0333Q7382
$$ 1131909 1024714 997687 1092592 1066429 882281 535325 514892 458119 362482 402815 490197
19801D90197L1599j50010r261p4567L4507O8122j21172r4087K7217K4347J9108
$$ 490197 521796 371786 362525 287958 322465 390587 269415 175328 202545 226892 246000
19790B46000J68309l5009J4942j03442m218J10714Q2985p0726M9003J1254p9473
$$ 246000 414309 379300 394242 290800 286582 397296 480281 409555 458558 469812 390339
19779C90339k1360j5571L3291P8568l6012J62950J44959K4682M8420M1616K20012
$$ 390339 368979 353408 386699 465267 429255 592205 737164 761846 810266 851882 1071894
19768A071894J36196J55391M74267N67019L41324L93753J73694J03062K4189J41760
$$ 1071894 1208090 1363481 1837748 2404767 2746091 3139844 3313538 3416600 3440789 3582549
19758C582549L08873K42305J70764N0400q4208j43317l25661l35312n6453j16007
$$ 3582549 3891422 4133727 4304491 4354891 4270683 4127366 3801705 3466393 3409940 3293933
19748C293933k87479m76752m97426k51898k14366k72265j79817j69991l1398k9989
$$ 3293933 3006454 2529702 2032276 1780378 1566012 1293747 1113930 943939 912541 882552
19738H82552j04990m9485j16477j52575l4235O3842O7362j1631j1012j44643Q8656
$$ 882552 777562 728077 611600 459025 424790 488632 555994 544363 533351 388708 477364
19727D77364m9327j27651p623J02406J06979p6742j24084m6922M5922J42035k9849
$$ 477364 428037 300386 292763 395169 502148 425406 301322 254400 300322 442357 412508
19716D12508L5673j2544l4684m2121J62095R7620J2663m0653k55826j18760J70385
$$ 412508 448181 435637 400953 358832 520927 618547 631210 590557 334731 215971 386356
19705C86356m215o3841P0214P3723O0612R4012j1417r9567m8636k9142J37536
$$ 386356 382141 318300 388514 462237 522849 616861 605444 505877 457241 428099 565635
19694E65635l8550j07037j08110L8248J71704R3104j200j41760n0823L2081N1609
$$ 565635 527085 420048 311938 350186 521890 614994 613794 472034 421211 453292 504901
19683E04901J20820o0k9218Q152j873p7945r1832m6945Q6957Q9933j6362k6091
$$ 504901 625721 625661 596443 604595 602722 524777 432945 386000 472957 562890 546528 520437
19671E20437m6999J70354P0109k954j36489q1506Q154m299J09866r3905j11242
$$ 520437 473438 643792 713901 710947 574458 492952 501106 496807 606673 512768 401526
19660D01526M8107K00439J56816J2806L3262R1715j44820n0640L382M0135L6954
$$ 401526 449633 650072 806888 819694 852956 944671 799851 749211 752593 792728 829682
19649H29682M7320j50361q5374P0110J29639Q7949J6975m8441j16146l3119J63426
$$ 829682 877002 726641 641267 711377 841016 928965 945940 897499 781353 748234 911660
19638I11660M2807j46207o9494J7158Q50L1389M9837L3085M4135L9630R4441K2804
$$ 911660 954467 808260 738766 755924 756774 788163 838000 871085 915220 954850 1049291 1072095
19626A072095j4096k9311q5001R2283K44462m969j50163l1074J93652K6711j02538
$$ 1072095 1057999 1028688 943687 1035970 1280432 1275463 1125300 1094226 1287878 1314589 1212051
19615A212051m1368J7171R7783j5604j23263q190K7656M1587R8841M6581K8562
$$ 1212051 1170683 1187854 1285637 1270033 1146770 1138580 1166236 1207823 1306664 1353245 1381807
19604A381807k6417m4674K21454N7103K3855J67793J78388J27503L7463J02302
$$ 1381807 1355390 1310716 1532170 1589273 1613128 1780921 1959309 2086812 2124275 2226577
19594B226577J31424L48767L52063M06734K93241J28382K71727Q4856K67076L99227
$$ 2226577 2358001 2706768 3058831 3465565 3758806 3887188 4158915 4243771 4510847 4910074
19584D910074M76585K11748R0478L89831O96302N13192M78160O11709P89219R27423
$$ 4910074 5386659 5598407 5688885 6078716 6775018 7288210 7766370 8378079 9167298 10094721
19574A0094721J485509K145107K660150L319672M652866P038085J1033944J8892612
$$ 10094721 11580230 13725337 16385487 19705159 24358025 31396110 42430054 61322666
19566F1322666L3524608N6459848O3981268J2628369k6211161k6103070j7268060
$$ 61322666 94847274 151307122 215288390 227916759 201705598 175602528 158334468
19559A58334468L813662L5404302M3811887p308258m1248315m2080710l8890371
$$ 158334468 162148130 197552432 241364319 234056061 192807746 150727036 111836665
19552A11836665l0472952k0022676j3082867q907691o343943n007522l995744
$$ 111836665 81363713 61341037 48258170 39350479 33006536 27999014 24003270
19545B4003270l379888k415058j830320j257442o93782p51495p88123m64681m41726
$$ 24003270 20623382 18208324 16378004 15120562 14426780 13675285 12887162 12422481 11980755
19536A1980755o06604n37629m79356R904K64662L47181J28316m30264n38967k65895
$$ 11980755 11374151 10836522 10357166 10367070 10631732 10978913 11107229 10676965 10137998 9872103
19526I872103N7423K89159M43935J18455J89783N18319Q76492Q87691P16479Q14150
$$ 9872103 9929526 10218685 10662620 10781075 10970858 11489177 12365669 13253360 13969839 14783989
19516A4783989J241279J682570K571057L584989M470053N995643Q724649J3149009
$$ 14783989 16025268 17707838 20278895 23863884 28333937 34329580 43054229 56203238
19508E6203238K1399460L7330160O5574071R8719841P1299971j5995204m3490155
$$ 56203238 77602698 114932858 180506929 279226770 350526741 334531537 291041382
19501B91041382l5473874j5610959K5938904O8509252L9969525m2663995o5931850
$$ 291041382 255567508 239956549 265895453 334404705 374374230 331710235 265778385
19494B65778385o2708856n5618969l9897547k5541463j6811400j1573041q745725
$$ 265778385 203069529 147450560 107553013 82011550 65200150 53627109 44881384
19487D4881384p096581n689178m426610l405104k514821j577079j444671j511221
$$ 44881384 37784803 32095625 27669015 24263911 21749090 20172011 18727340 17216119
19479A7216119j245610p52450q44994j261223j136838r52153o77211l27605k46949
$$ 17216119 15970509 15218059 14373065 13111842 11975004 11022851 10345640 10018035 9771086
19470I771086l64694p62741p75310p67970q02014n90796m85703m30222k23858
$$ 9771086 9406392 8643651 7868341 7100371 6298357 5707561 5221858 4791636 4567778
19461D567778j66269j14221j38893j50718j76417k18144k51733k06060j11816
$$ 4567778 4401509 4287288 4148395 3997677 3821260 3603116 3351383 3145323 3033507
19452C033507L284m5517j54835K6746q6936j25138J8889r890j76533k25641j93324
$$ 3033507 3036791 2991274 2836439 2863185 2776249 2651111 2670000 2660110 2483577 2257936 2064612
19441B064612J12164j3155j23351j52457N1671J0643k8676n0368j8521j94210
$$ 2064612 2176776 2163621 2040270 1887813 1939484 1950127 1921451 1871083 1852562 1658352
19431A658352j57715j83028j13086O2129J28107k8013j17096n1119o2639n5122
$$ 1658352 1500637 1317609 1204523 1266652 1394759 1366746 1249650 1198531 1135892 1080770
19421A080770k16075j03536O6962j9692P4595k4937j06328R4433J76850k6103
$$ 1080770 864695 761159 828121 808429 883024 858087 751759 846192 1023042 996939
19411I96939K5307J12323j32995N4382l7432j1410J03172J15385l4813K4919n5509
$$ 996939 1022246 1134569 1001574 1055956 1018524 1007114 1110286 1225671 1190858 1215777 1160268
19400A160268j17855j11269o0511P013o4806r264n6215k2712J32735K34163J57387
$$ 1160268 1042413 931144 870633 877646 812840 803576 747361 724649 857384 1091547 1248934
19389A248934k0471j3439m3871K6493j8748j31575q2271k9051j10678n1731M3125
$$ 1248934 1228463 1215024 1171153 1197646 1178898 1047323 965052 936001 825323 773592 816717
19378H16717J44959J6597j28283j14563k3630O6752J96291O1008o9825j7178J7062
$$ 816717 961676 978273 849990 735427 711797 778549 974840 1035848 966023 948845 965907
19367I65907K9127J50600M8394m3232p8081K4590k3107Q1927k1817r5966o4801
$$ 965907 995034 1145634 1194028 1150796 1072715 1097305 1074198 1156125 1134308 1038342 973541
19356I73541J4643l2290n2560J48149L4069M9239Q2276Q1823J4330j22296M5942
$$ 973541 988184 955894 903334 1051483 1085552 1134791 1217067 1298890 1313220 1190924 1236866
19345A236866N5007K8836K9815K6281Q5388J14962O7788q5101o8298J37665Q2443
$$ 1236866 1291873 1320709 1350524 1376805 1462193 1577155 1644943 1559842 1491544 1629209 1711652
19334A711652j28427j21095m9519K4949K19189J83699J36715J84295Q7764K47649
$$ 1711652 1583225 1462130 1412611 1437560 1656749 1840448 1977163 2161458 2249222 2496871
19324B496871M39896O91952O26389M7386k07273j96880L9156J89291K06280K78291
$$ 2496871 2936767 3628719 4255108 4302494 4095221 3898341 3937497 4126788 4333068 4611359
19314D611359N12280J31234k0590N0629L6168K98694L69176L97930M94544N84951
$$ 4611359 5123639 5254873 5234283 5284912 5321080 5619774 5988950 6386880 6881424 7466375
19304G466375M87599O59506Q18727J137884J620288K010847K367832K828532L015562
$$ 7466375 7953974 8613480 9432207 10570091 12190379 14201226 16569058 19397590 22413152
19295B2413152L573506N230877Q015319J2803105K1404283L7054643O3225135
$$ 22413152 25986658 31217535 39232854 52035959 73440242 110494885 173720020
19288A73720020R4581536P2414553j4358177m8828932m7114944l7391076j2275180
$$ 173720020 268301556 340716109 326357932 277529000 230414056 193022980 180747800
19281A80747800K2391731O1339628P3836883N646956n3437172o0967548n8501154
$$ 180747800 203139531 264479159 338316042 343962998 290525826 229558278 171057124
19274A71057124m8262109l2976998k0952414j3332092q780161o291568n353100
$$ 171057124 122795015 89818017 68865603 55533511 46753350 40461782 35108682
19267C5108682m612233l800367k986380k128625j508066j205891j054805j076592
$$ 35108682 30496449 26696082 23709702 21581077 20073011 18867120 17812315 16735723
19259A6735723j237632j156128r04127p46586k94828o8126j45913o9603n92166
$$ 16735723 15498091 14341963 13437836 12691250 12396422 12328296 12182383 12112780 11520614
19250A1520614o06279m58927k65154j04682L1940M30788N96006J95100O0932M72531
$$ 11520614 10914335 10455408 10190254 10085572 10117512 10548300 11144306 11339406 11400338 11872869
19240A1872869O30560R67969J421832J425295J661768K541254L832943O087695
$$ 11872869 12503429 13471398 14893230 16318525 17980293 20521547 24354490 30442185
19232C0442185J0177826J7472565L0433988N1353542O5251519K2843825k6656142
$$ 30442185 40620011 58092576 88526564 139880106 205131625 227975450 201319308
19225B01319308l3185641k9683204j9043121J278848K6609223N2987399L8715442
$$ 201319308 168133667 138450463 119407342 120686190 147295413 200282812 238998254
19218B38998254k1666976m2254684m1068772l7821441k7668423j7507109j1100842
$$ 238998254 217331278 175076594 134007822 96186381 68517958 51010849 39910007
19211C9910007o949887m660805l658395l193158k828623k506171j952871j339618
$$ 39910007 32960120 28299315 24640920 21447762 18619139 16112968 14160097 12820479
19203A2820479j108965p94721o02673o08748p67293o54492o43479n39629k41674
$$ 12820479 11711514 10916793 10314120 9705372 8938079 8283587 7640108 7100479 6858805
19194F858805l1579P3363j56428m68457l70085l68478m02788j72594k6610N1337
$$ 6858805 6827226 6900589 6744161 6275704 5905619 5537141 5134353 4961759 4935149 4986486
19184D986486O9909j30799l40397k93067l36236l49224j42691j53241j37545j53461
$$ 4986486 5056395 4925596 4585199 4292132 3955896 3606672 3463981 3310740 3173195 3019734
19174C019734r4195n8625J5994k216M4500M9783j28344l47243l03006j20817j25576
$$ 3019734 2925539 2866914 2882908 2880692 2925192 2974975 2846631 2499388 2196382 2075565 1949989
19163A949989q0313L3345L9237R044n0021K32l5122k0055J2875k82246k83542
$$ 1949989 1869676 1903021 1942258 1951302 1901281 1901513 1866391 1846336 1859211 1576965 1293423
19152A293423l4177N9072L0630j07352n6186m513j49606o4594j43318J04058l3662
$$ 1293423 1259246 1318318 1348948 1241596 1185410 1180897 1031291 966697 823379 927437 893775
19141H93775l2401K6693l8416n4826J30193j96905l3930n038K453j0812J5379
$$ 893775 861374 888067 849651 794825 925018 728113 694183 689145 691598 680786 696165
19130F96165q1499K8392q7676j20076l8354O2976P4855K2215o1400j86779l844
$$ 696165 614666 643058 555382 435306 396952 459928 534783 556998 495598 308819 304975
19119C04975J28808r8481L9090K18152J15885j08798q2216l304M9651N4421o1716
$$ 304975 433783 335302 374392 592544 708429 599631 517415 514111 563762 618183 556467
19108E56467k28425n2562O4672l6252O8976J53700M2799O1460J06490n4994k4384
$$ 556467 328042 275480 340152 303900 372876 526576 569375 630835 737325 682331 657947
19097F57947N9266O4j63710r8456j6989K6534N2228O6747j33773o1524N415O6132
$$ 657947 717213 717277 553567 455111 438122 464656 516884 583631 449858 388334 393749 459881
19085D59881N2823K8191p3408j19853j9652P2027n5925j1513K7314n4071M1692
$$ 459881 512704 540895 467487 347634 327982 400009 344084 332571 359885 305814 347506
19074C47506n5831R9071J4674q2307j12319j4456l547O2741Q0408K1320M1967
$$ 347506 291675 390746 405420 323113 210794 196338 192791 255532 335940 357260 399227
19063C99227N0148J14230O0439j6401o6288j65768j35655p0435J5315N3075P5841
$$ 399227 449375 563605 624044 607643 541355 375587 239932 169497 184812 237887 313728
19052C13728j9589l5481R1795J22616l489J48232j81934j25547j22075j3649K3287
$$ 313728 294139 258658 350453 473069 469580 617812 435878 310331 188256 174607 197894
19041A97894j51965r887O2129J2383K05901N1954j62K2243j44398m7359m6522
$$ 197894 45929 36042 98171 110554 316455 368409 368247 390490 246092 198733 152211
19030A52211O608m0775M842k5218M7003p101K6364J19488o2858k0284J85506L8064
$$ 152211 158819 118044 122886 97668 144671 137570 163934 283422 220564 200280 385786 423850
19018D23850p4219m6839M1240L4188l285L8727j01265j4759K5090M6218R0369
$$ 423850 349631 302792 344032 378220 374935 413662 312397 297638 322728 368946 459315
19007D59315K5199J32295J36168K59947J38780J49543J21916J65275K26756N1437
$$ 459315 484514 616809 752977 1012924 1151704 1301247 1423163 1588438 1815194 1866631
18997A866631P588k34154j94115J12487L06512L08575q5014k82106l87499m23739
$$ 1866631 1874219 1640065 1445950 1558437 1864949 2173524 2088510 1806404 1418905 995166
18987I95166k47213j68977J047r398q429n3785n5280q6246j5834k5059j67527
$$ 995166 747953 578976 580023 570625 562196 508411 453131 366885 351051 325992 158465
18976A58465j15746Q3437L4897q7727j7637N3104J3783K46J4627K233m6728P880
$$ 158465 42719 126156 161053 73326 55689 108793 122576 122822 137449 139682 92954 100834
18964A00834r4580j47264J3753N4701J20308q841K8441o839Q0653o7804M5844
$$ 100834 6254 -141010 -127257 -72556 47752 38911 67352 60513 141166 73362 119206
18953A19206J7229q1718n4444K859Q2314J66958P9148O8147P5292P8449J19251
$$ 119206 136435 54717 273 3132 85446 252404 331552 399699 474991 553440 672691
18942F72691J88039K24302K38313L4444p0790j87779k57320o498K84311K03497
$$ 672691 860730 1085032 1323345 1357789 1286999 1099220 841900 835402 1119713 1323210
18932A323210Q1899j83072l02685k11224j55797j63596j00612j09839q2032j2379
$$ 1323210 1405109 1222037 919352 708128 552331 388735 288123 178284 96252 83873
18922H3873K6899k7613l2251M6386J30242K2934m9612j36739J33426J8031n3541
$$ 83873 110772 83159 50908 97294 227536 250470 200858 64119 197545 215576 162035
18911A62035o7923j3214J92513J49160o1449j49877j16723O2983k8691j01205
$$ 162035 94112 80898 273411 422571 361122 211245 94522 157505 128814 27609
18901B7609O8093Q5817q1080j6263N4256j6774R4305M0401j43892m1548n583R1846
$$ 27609 95702 181519 100439 84176 138432 121658 215963 256364 112472 70924 65341 157187
18889A57187l399j02009M9697M6211q1560j18585K050q9791j08307j5880o644
$$ 157187 153788 51779 101476 147687 66127 -52458 -50408 -140199 -248506 -264386 -271030
18878b71030J07010J49153O7933j9750K2208q6166n2668P8129J03525K0619P7024
$$ -271030 -164020 -14867 53066 33316 55524 -30642 -83310 -5181 98344 118963 195987
18867A95987J8522M2390K7961k10428r3307K2346m8986p2891j4861p6394J0243
$$ 195987 214509 256899 284860 74432 -18875 3471 -45515 -118406 -133267 -209661 -199418
18856a99418J22651J36046J34522o6960K4202Q8992q6168j24581L1006Q3720O6250
$$ -199418 -76767 59279 193801 126841 151043 240035 153867 29286 60292 144012 210262
18845B10262K76p43R5188p4414n7066j08241L4854n5694K3636O9445q6523q6993
$$ 210262 210538 209795 304983 230569 173503 65262 100116 44422 68058 137503 50980 -36013
18833c6013J2569J16718K5656k1541l3358N4952j00884j00080j79160k782J67778
$$ -36013 -23444 93274 118930 97389 64031 118983 18099 -81981 -261141 -263923 -96145
18822i6145J08505J69034J18773k8301m5258m4955q2332J4528N4397o1827J3967
$$ -96145 12360 181394 300167 271866 226608 181653 99321 113849 168246 106419 120386
18811A20386l8698j08630j35419j0842O2437m2995P0753J37734J5775n8636P8363
$$ 120386 81688 -26942 -162361 -173203 -110766 -153761 -83008 54726 70501 11865 90228
18800I0228o0908o1869P0977o6294n2921K6628l5710q4015k1155N5339L0107l2080
$$ 90228 29320 -32549 38428 -27866 -80787 -54159 -89869 -173884 -195039 -139700 -109593 -141673
18788a41673k3582J12819M6678m872j17612K7752P3835K0529P7847l5010J878
$$ -141673 -165255 -52436 -5758 -10630 -128242 -100490 -26655 -6126 71721 36711 38589
18777C8589O3266K442m6179n3427k0965O5066J6389J93730j6318j7340M2256r1918
$$ 38589 101855 104297 58118 4691 -16274 48792 65181 258911 242593 225253 267509 175591
18765A75591J9120P6009j07930N5381J6601R9343K47814L67509L60074K00568
$$ 175591 194711 270720 162790 218171 234772 334115 581929 949438 1309512 1510080
18755A510080l7695j44740j56764j49210k4460j733R9770J95536j1449r8249p2412
$$ 1510080 1472385 1327645 1170881 1021671 997211 995478 1095248 1290784 1279335 1181086 1108674
18744A108674j92418j87441j25973j66896k09426j6729o4159R923o429Q5527M872
$$ 1108674 916256 728815 602842 435946 226520 209791 145632 155555 149126 234653 239525
18733B39525K5958L3004r1699j39761j39608Q8493O7021o6476l0750R9613m2833
$$ 239525 265483 298487 206788 67027 -72581 15912 82933 16457 -14293 85320 42487
18722D2487n3713p2413R1541J38309O7172k4706l645J53210n3100o1483r1143
$$ 42487 -11226 -83639 7902 146211 213383 188677 185032 338242 285142 223659 132516
18711A32516o9495K7801P3333J14356Q960N9424K9592n0204O8804O5043J5627
$$ 132516 63021 90822 164155 278511 287471 346895 376487 326283 395087 460130 475757
18700D75757N4467J05980J82292K31165J72443j8733k3937j74769r9336k7186
$$ 475757 530224 636204 818496 1049661 1222104 1203371 1179434 1004665 905329 878143
18690H78143J7684K52706K11550n925j82681k29856j80617j84819j51735j8848
$$ 878143 895827 1148533 1360083 1354158 1171477 941621 761004 576185 424450 405602
18680D05602j28941j08456p3962q4421J4275L4864r7615o9378j51111O4785J44307
$$ 405602 276661 168205 94243 9822 24097 58961 -38654 -108032 -259143 -194358 -50051
18669e0051p95J1107K3268P3716O5995Q964J6672j97374m0603O10j05332M9474
$$ -50051 -50846 -39739 -16471 57245 123240 132204 148876 -48498 -89101 -88491 -193823 -144349
18657a44349j4861J28816J61281j6548P2286O668o0877j8374O3818k6262j8118
$$ -144349 -159210 -30394 130887 114339 186625 193293 132416 114042 177860 151598 133480
18646A33480N5335o253N3998O3013N1899j15091j5872N5774L5570j17516j02311
$$ 133480 188815 182562 236560 299573 351472 236381 220509 276283 311853 194337 92026
18635I2026p8433N9230P5788m8239j15286J45638L8693j19328p3587Q1128q8128
$$ 92026 13593 72823 148611 100372 -14914 130724 169417 50089 -23498 57630 -30498
18624c0498k2688p8140k6871L6387N7420J13914O4810N0597N7292m4889j19323
$$ -30498 -53186 -131326 -158197 -121810 -64390 49524 114334 164931 222223 177334 58011
18613E8011k50315R3436Q7138r2532k4773K1733l6698r9J00540K66313j3380k0519
$$ 58011 -192304 -98868 -11730 -104262 -129035 -107302 -144000 -144099 -43559 222754 209374 188855
18601A88855J46924J02823k5643m8247j74374l1319l3968J00083n1933j14602
$$ 188855 335779 438602 412959 364712 190338 159019 125051 225134 173201 58599
18591E8599k1619J40489K2964n4464P4255O8193j03746j38343j5998Q0917l0000
$$ 58599 36980 177469 200433 145969 220224 288417 184671 46328 30330 111247 81247
18580H1247j50604j12387J65892q303m9859K5352R8891J45435J94808j5836j08770
$$ 81247 -69357 -181744 -15852 -24155 -74014 -48662 50229 195664 390472 374636 265866
18569B65866r8407n0378K3468j03455m9423L0727j52373l1062J22299R3643J55996
$$ 265866 167459 117081 140549 37094 -12329 18398 -133975 -165037 -42738 50905 206901
18558B06901P7848K5415p8134k5940m7354j40425r3509J3616N9050J78647J24793
$$ 206901 284749 310164 232030 206090 158736 18311 -75198 -61582 -2532 176115 300908
18547C00908k05000j76860Q4013m3453n7137k0007k497l0589R1507J53506J17196
$$ 300908 95908 -80952 3061 -40392 -97529 -117536 -120033 -150622 -59115 94391 211587
18536B11587r0957m7723l1226P9854R534J12753Q6100n7613l3797O6032n4924
$$ 211587 120630 72907 41681 121535 131069 243822 329922 272309 238512 304544 249620
18525B49620m3366l2226n32j16771o4317Q3856j3630k1915j32026j28527Q2713
$$ 249620 206254 174028 173496 56725 -7592 76264 62634 40719 -91307 -219834 -137121
18514a37121J43954P3114m916j27093m413J08158j07200j91279l859l9428Q7925
$$ -137121 6833 79947 75031 -52062 -56475 51683 -55517 -246796 -250655 -290083 -202158
18503b02158J58951R4774j07700q197J56903P5144j32758j56575p4090J30557
$$ -202158 -43207 51567 -56133 -64330 92573 167717 34959 -121616 -195706 -65149
18493f5149O6998O9858l7167j04796L3801j0391Q6435P2460l6058q3267l6041
$$ -65149 1849 71707 34540 -70256 -36455 -46846 39589 112049 75991 -7276 -43317
18482d3317N6772J8891q63l2844j25208P9059J21996J13008P8835l8126j91810
$$ -43317 13455 32346 31483 -1361 -126569 -47510 74486 187494 266329 228203 36393
18471C6393n7542R981Q7968M0832K5311N5135p8206k24603M605P7628K02727L9733
$$ 36393 -21149 -11168 76800 117632 142943 198078 119872 -104731 -100126 -22498 180229 219962
18459B19962K9456O4351o8009j20503R330K3784k9951j59718j61142P2202N2710
$$ 219962 249418 313769 245760 125257 134587 158371 128420 -31298 -192440 -120238 -67528
18448f7528p4051L9927J92641J25652q1284l3646o2007K2508L2641L6168j2387
$$ -67528 -141579 -101652 90989 216641 135357 101711 39704 62212 94853 131021 118634
18437A18634l8103j39628R2420K0723k1432M9024J12633o4958k2942m4720j01543
$$ 118634 80531 -59097 33323 54046 32614 81638 194271 129313 106371 61651 -39892
18426c9892Q9385o5952P9869N0597p7556P303M309j72028j28028r583P247J15115
$$ -39892 49493 -16459 63410 114007 36451 43754 48063 -123965 -251993 -261576 -254329 -139214
18414a39214Q0665J11538J19838k9356j01402l8444J02930K7678l492r9379j07314
$$ -139214 -58549 52989 172827 143471 42069 3625 106555 134233 130741 31362 -75952
18403g5952r7747m4668K3851J22395P6250p5232j7406j00984j01113p2634Q7232
$$ -75952 -173699 -218367 -194516 -72121 4129 -71103 -88509 -189493 -290606 -363240 -276008
18392b76008J00394N9234O6645j13463J3090J16108J11874j29799j82153j59439
$$ -276008 -175614 -116380 -49735 -163198 -150108 -34000 77874 -51925 -234078 -393517
18382c93517O4361J74564R9448M0723N7686j6482n0650K7977K979K7569O2301
$$ -393517 -329156 -154592 -55144 -14421 43265 26783 -23867 4110 7089 34658 96959
18371I6959j41063J040K7137M8557J28263j63377r0208k2641r200r361j18170
$$ 96959 -44104 -43064 -15927 32630 160893 -2484 -92692 -115333 -124533 -133894 -252064
18360b52064j05680j07397K57793J84214j8264R3383l0238k37597r6131Q3839
$$ -252064 -357744 -465141 -207348 -23134 -41398 51985 21747 -215850 -311981 -228142
18350b28142J12580Q1430J2961P6096o845j49029o9158q331J27327j5980r392
$$ -228142 -115562 -34132 -21171 54925 48080 -100949 -170107 -178438 -51111 -67091 -76483
18339g6483o9992o2770m9010K825J47310J04212n5660l3596J50727Q8801r6273
$$ -76483 -146475 -209245 -258255 -255430 -108120 -3908 -59568 -93164 57563 146364 50091
18328E0091O9949n2078K7474m5826n3079l7458J00734J30521P6200m0345r7058
$$ 50091 120040 67962 95436 49610 -3469 -40927 59807 190328 266528 226183 129125
18317A29125M7490Q438j15256j8382Q571j2529j6467q3236O765J3459r5601L9912
$$ 129125 176615 185053 69797 51415 59986 47457 30990 -52246 -45481 -32022 -127623 -87711
18305h7711P807m5227n1286J9618M7614M9324l6709J51276N0134L16n3321q0898
$$ -87711 -79904 -125131 -176417 -156799 -109185 -59861 -96570 54706 104840 105156 51835 -29063
18293b9063l7572Q1532K3298k2897m0796P9574O9322L7655M1228N3741L5449j74699
$$ -29063 -66635 14897 38195 15298 -25498 54076 123398 161053 202281 256022 291471 116772
18281A16772n1869n9573k9467Q6965m7114l0612k5761M6748R8501o5155k313N9239
$$ 116772 64903 5330 -24137 62828 15714 -14898 -40659 6089 104590 39435 37122 96361
18269I6361N9029K071L9498q212j26857R2362L5015J23790k3972q5542j31205
$$ 96361 155390 157461 196959 188747 61890 154252 189267 313057 289085 203543 72338
18258G2338p4853r1019J0747J6293j41438R4346J80056N6708n01j05506P658l087
$$ 72338 -2515 -93534 -82787 -66494 -207932 -113586 66470 123178 122677 17171 24829 21742
18246B1742q006j87476k6070P8857M0062k2473j21749p0229O2789J21607l2466
$$ 21742 13736 -173740 -199810 -120953 -80891 -103364 -225113 -295342 -232553 -110946 -143412
18235a43412k7518l3967K6455J19083J60344J05921j7438q3340K3161l9803m7233
$$ -143412 -170930 -204897 -178442 -59359 100985 206906 189468 106128 129289 89486 42253
18224D2253p9326J3013L4463Q6959P6516N1621q5002O4195o8293j18885n3294
$$ 42253 -37073 -24060 10403 97362 173878 225499 140497 204692 136399 17514 -35780
18213c5780K3114j5026o4761O7789O4657K9384k326l3197N3099N3196k7998j20878
$$ -35780 -12666 -27692 -92453 -24664 39993 69377 67051 33854 86953 140149 112151 -8727
18201h727J00089k4798l2397J12549j08365l7563L8863q2712J50379J8364N8865
$$ -8727 91362 66564 34167 146716 38351 788 39651 -43061 107318 125682 184547
18190A84547n5960M819K4562O9523J6501r5403j09220j35732k8748J79975J22729
$$ 184547 128587 133406 157968 227491 243992 148589 39369 -96363 -125111 54864 177593
18179A77593r5989m3005J23878n0298j9419M0632j9557n1848J1106n3016K3948
$$ 177593 81604 38599 162477 112179 92760 133392 113835 61987 73093 20077 44025
18168D4025O7226k2628l5398r6462J09129O9046j1180K7341K09997j2154p5515
$$ 44025 111251 88623 53225 -43237 65892 134938 123758 151099 361096 348942 273427
18157B73427k1353n0431Q6990M0234q1182j84263k7481K6940k0070n1080M5205
$$ 273427 252074 201643 288633 328867 247685 63422 35941 62881 42811 -8269 36936
18146C6936K9501Q0747q1701k18380r743R9499N351K6669J31891J88177O3993
$$ 36936 66437 147184 65483 -152897 -162640 -63141 -57790 -31121 100770 288947 352940
18135C52940q1597j98572j63389k73J22894L3463j9145r5127P2577P7354L36919
$$ 352940 271343 72771 -90618 -90891 32003 65466 46321 -48806 23771 101125 438044
18124D38044J19313q2373j62471n3730L1827M0661r5830Q2547j7940P574m1579
$$ 438044 557357 474984 312513 258783 290610 331271 235441 317988 300048 307622 266043
18113B66043r695l1964l0467N3841j18982l0865L2694j40647M571J56104L9575
$$ 266043 256348 224384 193917 247758 128776 97911 130605 -10042 -5471 150633 190208
18102A90208k9491N2539J3327j7283j1491J20246j31021j61376n6650p6249R6478
$$ 190208 160717 213256 226583 209300 197809 318055 187034 25658 -30992 -107241 -10763
18091a0763J66010O5050p0234N8675p361o6284n0325p3850L718Q1133l4396n3264
$$ -10763 155247 220297 150063 208738 201377 135093 84768 10918 14636 95769 61373 8109
18079H109j64505Q791J27795p428J83393r183l7654p0051j08155p5227J9736K0468
$$ 8109 -156396 -147605 -19810 -27238 156155 146972 109318 39267 -68888 -144115 -124379 -103911
18067a03911J91361K18135o8056L5924k05347p8527P7879o3933R276J27192j00290
$$ -103911 87450 305585 237529 273453 68106 -10421 67458 3525 12801 139993 39703
18056C9703l3592q0743o9862K66834R8926j21419k1516J1293K0980j75572j52153
$$ 39703 6111 -74632 -144494 122340 221266 99847 78331 89624 110604 -64968 -217121
18045b17121p4042K4043K33637J76700j9752J4608L3711r7294J76047p6665j70507
$$ -217121 -291163 -267120 -33483 143217 123465 138073 171784 74490 250537 173872 3365
18034C365p3373m3314L3718J90361n4768m8805r8731j88583k0105Q6448K34173
$$ 3365 -70008 -113322 -79604 110757 55989 7184 -91547 -280130 -300235 -213787 20386
18023B0386J50363n9887j51614n9044J9205R9873J5665k3731k3851k8524o7958
$$ 20386 170749 110862 -40752 -99796 -80591 19282 34947 11216 -12635 -41159 -109117
18012a09117n2073K1444P3916n3211j27725j81711n9750J72974K26254L2794m2875
$$ -109117 -161190 -139746 -65830 -119041 -246766 -428477 -488227 -315253 -88999 -56205 -99080
18001i9080o6257J1459P6713P9752J55750j10053j42002N1321K3362K8587O2009
$$ -99080 -165337 -153878 -77165 2587 158337 48284 -93718 -42397 -19035 9552 71561
17990G1561J09445j70412j74329L5255K5305L9261N555K89898O7550m1545j5759
$$ 71561 181006 10594 -163735 -128480 -103175 -63914 -58359 231539 299089 257544 241785
17979B41785j599m6066J09729k7895L6381k6104j06906o339n9248p7035l5181
$$ 241785 240186 194120 303849 275954 312335 286231 179325 172986 113738 36703 1522
17968A522r439o5017q8697P7924O0984M3756j117m2427j47995r9825J45288J21682
$$ 1522 -7917 -72934 -161631 -83707 -22723 21033 19916 -22511 -170506 -270331 -125043 -3361
17956c361l9750N83R9399N6485j04777q9415O5614J21811P4460j3492n5050J09212
$$ -3361 -43111 -42528 56871 113356 8579 -80836 -15222 106589 181049 167557 112507 221719
17944B21719J32490j259j00987n2360m0035p53M1887N8972j9163q117j17965L1943
$$ 221719 354209 352950 251963 199603 159568 158815 200702 259674 240511 232394 114429 146372
17932A46372j2577o7297j7312J94421J47619j7177J01561O0551n1989j67435j22946
$$ 146372 133795 66498 49186 243607 391226 374049 475610 536161 484172 316737 193791
17921A93791J0144J17778p3623j18606K616P3395q3353o8863Q767j01002j22284
$$ 193791 203935 321713 248090 129484 132100 205495 122142 53279 62046 -38956 -161240
17910a61240J11193j0657P6833k9378p6386n729r347k9501J7362o9551M9492j72494
$$ -161240 -50047 -60704 16129 -13249 -89635 -95364 -104711 -134212 -116850 -186401 -136909 -309403
17898c09403n8987N5063J80383Q8226n3130Q256P5957L4892j4021K8240J28964
$$ -309403 -368390 -313327 -132944 -44718 -97848 -89592 -13635 21257 7236 35476 164440
17887A64440j33708j92848J50751K8090j4554n4135p467j0331k3491J20703N5023
$$ 164440 30732 -162116 -11365 16725 2171 -51964 -59431 -69762 -93253 27450 82473
17876H2473l5326J177L4765j876O317o148P210r2112j25647j73536Q1929j3850
$$ 82473 47147 48324 83089 81213 87530 81382 88592 -3520 -129167 -302703 -220774 -234624
17864b34624q2792J05467J35057n3142j56878J29659J84512M7935K3069P6709
$$ -234624 -317416 -211949 -76892 -130034 -286912 -157253 27259 75194 98263 174972
17854A74972J0924J2021j37014m7245n5108K12056J62560j10466j1370r2092j29016
$$ 174972 185896 197917 60903 13658 -41450 170606 333166 222700 211330 119238 -9778
17843i778o8665J34364N2774L7890j01341j28320L2887O8398R8709Q3901j5428
$$ -9778 -78443 55921 108695 146585 45244 -83076 -50189 18209 116918 200819 185391
17832A85391j8107q0087M3119L1781M9550j18800n5111m6196l8117J03412Q6796
$$ 185391 167284 87197 130316 162097 211647 92847 37736 -8460 -46577 56835 143631
17821A43631m5022j7076R5380J97372p6963J6527P8010q0325k3919J01992l3742
$$ 143631 98609 81533 176913 374285 297322 313849 391859 311534 287615 389607 355865
17810C55865j75834j2711J04633j34054j02176R615N4214j7657o7108m7542q8990
$$ 355865 180031 167320 271953 137899 35723 45338 99552 81895 14787 -32755 -121745
17799a21745N3651j6991N0142J61299K03333R1821J43866J43184o784o1799L8407
$$ -121745 -68094 -85085 -34943 126356 329689 421510 565376 708560 701776 639977 678384
17788F78384j20659k17678j71867r3198p4298j72237K4668N8825M0706J5799m2067
$$ 678384 557725 340047 168180 74982 684 -171553 -146885 -88060 -47354 -31555 -73622
17777g3622j7671K3358j2243N1204Q8836L7871O0612O641j40185j17205m2631
$$ -73622 -91293 -67935 -80178 -28974 59862 97733 158345 164986 24801 -92404 -135035
17766a35035J00516o139J40393J01265q4012r5620m1199j9773j651P3958L2430
$$ -135035 -34519 -40658 99735 201000 116988 21368 -19831 -39604 -41255 32703 65133
17755F5133j8050Q9824k9121N3143p9020j78712j67254o255J00161R6475L6630
$$ 65133 47083 136907 107786 160929 81909 -96803 -264057 -270312 -170151 -73676 -37046
17744c7046n6699r0195R4173J12958J24011J10602J02840J45227J35465J55886
$$ -37046 -93745 -183940 -89767 23191 147202 257804 360644 505871 641336 797222
17734G97222J35230J6833l40518l01874j9584Q0424j18695o7613j61061j4215
$$ 797222 932452 949285 608767 306893 287309 367733 249038 181425 20364 6149
17724F149j8343K1843L7099K3182L7964N7317j042j3165r5522k4613j08767p0008
$$ 6149 -12194 9649 46748 69930 107894 165211 164169 151004 55482 30869 -77898 -147906
17712a47906M9203j2765j1977q4931p2626K04991M2580K6933m6321j11004l2004
$$ -147906 -98703 -111468 -123445 -208376 -281002 -76011 -33431 -6498 -52819 -163823 -195827
17701a95827N1884J56212R2054Q730n653j18103k8227k8100n1148l9553j29495
$$ -195827 -143943 12269 104323 113053 107400 -10703 -38930 -67030 -118178 -157731 -287226
17690b87226K9533k4600j70769j6248K04798J40309j7407j9156P910P7821k7230
$$ -287226 -257693 -282293 -453062 -469310 -264512 -124203 -141610 -160766 -152856 -75035 -102265
17679a02265j7073o9973R6085J67351L7371j04557j27633j01992P4053Q1634J05379
$$ -102265 -119338 -189311 -93226 74125 111496 6939 -120694 -222686 -148633 -66999 38380
17668C8380J09561k1023M2136R982p5160j39238k0521Q1642n6532m3545L924j3581
$$ 38380 147941 126918 169054 179036 103876 -35362 -55883 25759 -30773 -74318 -70394 -83975
17656h3975k435j00281l3405Q9415m8093J1311K4317O0581J08779k4856j95152
$$ -83975 -86410 -186691 -220096 -130681 -178774 -167463 -143146 -82565 26214 1358 -193794
17645a93794L552J9625P4833q1326o9620R2526R4727n552J31664R2733l5167j19359
$$ -193794 -190242 -170617 -95784 -177110 -246730 -154204 -59477 -65029 66635 159368 124201 4842
17633D842r7662j16200j29584r5422p5155m1838N2683J68345J09932P5262P5836
$$ 4842 -92820 -209020 -338604 -434026 -509181 -551019 -498336 -329991 -220059 -144797 -68961
17622f8961j7439j6774m4213Q0859K1143P7148J65464j57058j21990J67539Q5491
$$ -68961 -86400 -103174 -147387 -66528 -45385 31763 197227 40169 -81821 85718 171209
17611A71209l8380j9419r5255p9092O3390o0123L2352K0512j31761k534K1401
$$ 171209 132829 113410 18155 -60937 2453 -57670 -25318 -4806 -136567 -139101 -117700
17600a17700j2755N531p721J42517R6474m185o5088j07489M0603o5264K6866N1065
$$ -117700 -130455 -124924 -132645 9872 106346 102161 37073 -70416 -29813 -95077 -68211 -17146
17588a7146q4856N6102J2084J64418m3573M2961L8247J93824l104r5578j05602
$$ -17146 -102002 -45900 -33816 130602 87029 129990 168237 362061 358957 263379 157777
17577A57777j76810r7729L612J49632P3509J9472J08740j08907o5003l4968j14633
$$ 157777 -19033 -116762 -113150 36482 109991 129463 238203 129296 64293 29325 -85308
17566h5308j25211k331J18376P2400P5027j35231L3335J2169P4789r539J7009
$$ -85308 -210519 -212850 -94474 -22074 52953 -82278 -48943 -36774 38015 28476 45485
17555D5485q6255M2531P151r6971k2369M959n6020k074O7829J42613k9924l3268
$$ 45485 -40770 1761 8912 -88059 -110428 -105469 -161489 -163563 -95734 46879 16955 -16313
17543a6313O8431O6848P2861j3260k1595P844j89261p9433L7723J91408O0115
$$ -16313 52118 118966 191827 178567 156972 164816 -24445 -103878 -66155 125253 185368
17532A85368l6127J7732J03030N1152K3227l7505l9149j40187m3299o807J4604
$$ 185368 149241 166973 270003 321155 344382 306877 267728 127541 84242 77435 92039
17521I2039l5265L2076M710p6542J0640q3394j41840l930M1145J86487P7497q4418
$$ 92039 56774 88850 93560 17018 27658 -55736 -197576 -201506 -160361 26126 103623 19205
17509A9205K0497J8384p6292Q4353K4805j5430j75443m3216k491j15067J35877
$$ 19205 39702 58086 -18206 66147 90952 75522 -99921 -143137 -145628 -260695 -124818
17498a24818K09930K10252p5233k33775o6344L2093o9586j1089J7582J0282j08942
$$ -124818 85112 295364 220131 -13644 -79988 -47895 -117481 -128570 -110988 -100706 -209648
17487b09648P0047k8500N384m1359l9371L9823Q0759M13J28637N2282k8032q2795
$$ -209648 -139601 -168101 -162717 -204076 -243447 -203624 -122865 -122452 6185 58467 30435 -52360
17475e2360n5392J10755J06787r413p162k8880j3849M0484L3953K8051R276j14881
$$ -52360 -107752 3003 109790 100377 93215 64335 50486 90970 124923 152974 162250 47369
17463D7369K0710l5864m1419p0579J1377j31475j23205Q9544R2722j12352J1766
$$ 47369 68079 32215 -9204 -79783 -68406 -199881 -323086 -233542 -140820 -253172 -241406
17452b41406J6764K1676J19430N6127J2619M6624p799r2475j13688J11429J39169
$$ -241406 -224642 -202966 -83536 -27409 -14790 31834 24035 -68440 -182128 -70699 68470
17441F8470M7252j06108j02057j62346J24812l4523o9167J5480J31283K16599
$$ 68470 115722 9614 -92443 -254789 -129977 -164500 -233667 -218187 -86904 129695
17431A29695K3084p3672R053N884j18835J156R321j53459K3782K13307R0904j08571
$$ 129695 152779 79107 88160 94044 -24791 -23635 -14314 -167773 -143991 69316 160220 51649
17419E1649q6200K4803j9655k3027p1802L849P3217J48502P180q8061J09481j1708
$$ 51649 -34551 -9748 -29403 -52430 -124232 -120383 -47166 101336 108516 20455 129936 118228
17407A18228j60365N3420J57142j68928j89853p4920K7376J05837N736J21730
$$ 118228 -42137 11283 168425 -503 -190356 -265276 -237900 -132063 -126327 -4597
17397d597M3519r7772j19177j6288J32629Q4202o6014j25136m7513J11210P3842
$$ -4597 38922 -58850 -178027 -194315 -61686 22516 -43498 -168634 -216147 -104937 -31095
17386c1095K0724p1362o4977m2405J77674J32835M5647k0155l9620n2124n4457
$$ -31095 -10371 -81733 -146710 -189115 -11441 121394 167041 146886 107266 55142 685
17375F85o3170O8003j78934P199K1206m4437J3216L0524J27077J01184O1250q6246
$$ 685 -62485 5518 -173416 -166217 -145011 -189448 -176232 -145708 -18631 82553 143803 57557
17363E7557k4019m1424Q3604k3427r6685P839j19l7144L113P6255L1433p6437
$$ 57557 33538 -7886 75718 52291 -44394 -36555 -36674 -73818 -70705 5550 36983 -39454
17351c9454k0259j1439l3523j6824p4462o3359P2040K6525P8627R1945j1458j9685
$$ -39454 -59713 -71152 -104675 -121499 -195961 -259320 -187280 -160755 -82128 9817 -1641 -21326
17339b1326l718k7452L2509n2707K2113j05609O395O3672R5043j0387K7209J8324
$$ -21326 -25044 -52496 -19987 -72694 -50581 -156190 -149795 -86123 8920 -1467 25742 44066
17327D4066m8515o8800l8044J6462o575P0628J49595M6010j51598p4064j8467
$$ 44066 -4449 -73249 -111293 -94831 -101406 -30778 118817 164827 13229 -60835 -79302
17316g9302q3794L9196J05977p1936M0354M7438O5435m5666r505J11005J9120
$$ -79302 -163096 -123900 -17923 -89859 -49505 -2067 63368 17702 8197 119202 138322
17305A38322K6787m7668j15261L3323R1072j76589j41870n6619J6928P1112L5339
$$ 138322 165109 117441 2180 35503 126575 -50014 -191884 -248503 -231575 -160463 -125124
17294a25124R7437J06561R0716L3057p7957R490K5821j41044j07276L1770O4326
$$ -125124 -27687 78874 169590 202647 124690 134180 160001 18957 -88319 -56549 7777
17283G777Q599o1165q8764l9127L1677J8295L9114O1131k4970K0319j2179r3300
$$ 7777 16376 -44789 -133553 -172680 -141003 -122708 -83594 -22463 -47433 -27114 -39293 -132593
17271a32593j60409j07903N0215M1428Q0168R1699m6101m6656j5677Q2193J71390
$$ -132593 -293002 -400905 -350690 -309262 -229094 -137395 -183496 -230152 -245829 -163636 7754
17260G754j1599p4420J44143K27j36306q3313M0822n7004P6547J13914P4824M7116
$$ 7754 -3845 -78265 65878 66105 -70201 -153514 -112692 -169696 -93149 20765 95589 142705
17248A42705L0707j41120p7629Q9485j49262j31846M2098J4702k493p023k1442
$$ 142705 173412 32292 -45337 44148 -105114 -236960 -194862 -180160 -182653 -189676 -211118
17237b11118J26584P6819j6350J73050L4132j6532n3467M1705k301K7444Q598
$$ -211118 -84534 -7715 -24065 148985 183117 166585 113118 154823 152522 179966 188564
17226A88564j48660j18330p0719P4732L7748p0472j22784n398K1130J00130J43271
$$ 188564 39904 -78426 -149145 -74413 -36665 -107137 -229921 -235319 -214189 -114059 29212
17215B9212J08259J5484j11483j10619k2868Q0474n9323J14247L3229j30353j06367
$$ 29212 137471 152955 41472 -69147 -92015 -11541 -70864 43383 76612 -53741 -160108
17204a60108j02141R3332K2974R218q9060j8806J72140M7496J7360o9879j15612
$$ -160108 -262249 -168917 -145943 -136725 -225785 -244591 -72451 -24955 -7595 -77474 -193086
17193a93086M6295J78998K8973r8052L7820J1737n43j14609j50198q6980L7990
$$ -193086 -146791 32207 61180 -36872 948 12685 12142 -102467 -252665 -339645 -301655
17182c01655R0748k2813r1807J49651J63765K0750P5045j33503n5073n4169O4703
$$ -301655 -210907 -233720 -325527 -175876 -12111 8639 83684 -49819 -104892 -159061 -94358
17171i4358q20M850P517R0512j2610n0085N9946m9093M7596K4990Q542J6100J03719
$$ -94358 -95178 -90328 -82811 7701 -4909 -54994 4952 -44141 3455 28445 36987 53087 156806
17158A56806M3744l9514P0396j4091j54980j88258m9268K8111Q2720n8869K507
$$ 156806 200550 161036 231432 217341 62361 -125897 -175165 -147054 -64334 -123203 -120696
17147a20696O5155J18697Q7241m4317r4621j33081m7239K9519J53990o3691n669
$$ -120696 -55541 63156 150397 106080 11459 -121622 -168861 -139342 14648 -49043 -54712
17136e4712K2317l7943Q8841o8211j34486j20995R0311K7022M2671R7832K7161
$$ -54712 -32395 -70338 18503 -49708 -184194 -305189 -214878 -187856 -145185 -47353 -20192
17125b0192K0372n6450m2283Q3288j68589q3164P2452J01339O6897n7889K8647
$$ -20192 180 -56270 -98553 -15265 -183854 -267018 -194566 -93227 -26330 -84219 -55572
17114e5572J32966M493J23416J2347j63686j64670j54894Q3320N0271J9238J7242
$$ -55572 77394 81887 205303 217650 53964 -110706 -265600 -182280 -132009 -112771 -95529
17103i5529N0538r0926J72982L9722j9035q6963j12651J64087J61031j01422j89836
$$ -95529 -44991 -135917 37065 76787 57752 -29211 -141862 22225 183256 81834 -108002
17092a08002J11165l0109j53998o8223M6265J4683m5419J9904q3935m4300J13928
$$ -108002 3163 -26946 -180944 -249167 -202902 -188219 -233638 -213734 -297669 -341969 -228041
17081b28041J68537l5030M8031m0320O8693J13214p1496k45787J46420J49342
$$ -228041 -59504 -94534 -46503 -86823 -18130 95084 23588 -222199 -75779 73563
17071G3563m1727o5676J4260j75986p7120J35427P0922p770r3323j12076j44996
$$ 73563 31836 -33840 -19580 -195566 -272686 -137259 -66337 -74107 -167430 -279506 -424502
17060d24502O1726J4742M4906L562J14696K04715P8372r3277j4110N6965o0139
$$ -424502 -362776 -348034 -303128 -299566 -184870 19845 98217 4940 -9170 47795 -12344
17049a2344j40804m7006k1075R787J14653J15076R2243r3767j72057M9047J1335
$$ -12344 -153148 -200154 -221229 -211442 -96789 18287 110530 16763 -155294 -106247 -94912
17038i4912n4211j7630K0085k3942j45833o606J26590Q629r539K2008J9693L7884
$$ -94912 -149123 -166753 -146668 -170610 -316443 -323049 -196459 -187830 -197369 -175361 -155668 -117784
17026a17784j1207p9936K11701J85191j15684p2951j78466l3411K9140j36221
$$ -117784 -128991 -208927 2774 187965 72281 -670 -179136 -212547 -183407 -319628
17016c19628P7821J15019m8504j16914M5502K45275J04265P1832j20703j27177
$$ -319628 -241807 -126788 -175292 -292206 -246704 -1429 102836 174668 53965 -73212
17006g3212L92r45l6450K0718J05421q6476q5766l7361M0129j05596M9814J77320
$$ -73212 -72820 -73765 -110215 -89497 15924 -70552 -156318 -193679 -153550 -259146 -209332 -32012
16994c2012Q0957M2035L8187j6764o4925m0534J7104j1922q0431N7850L083p574
$$ -32012 48945 90980 129167 112403 47478 6944 24048 12126 -68305 -10455 -7372 -14946
16982a4946k5538k4425J21581j46519l4335N4961J00061j5940l9049O501J508
$$ -14946 -40484 -64909 56672 -89847 -124182 -69221 30840 14900 -24149 -17648 -16140
16971a6140J8057L8844m6767k6400p542l5445J07014m3475K7367q1688K1014k811
$$ -16140 1917 40761 -6006 -32406 -39948 -75393 31621 -11854 15513 -66175 -45161 -47972
16959d7972m8247P0477j03263l9928J75747J1562o9190p9227j03576r8062J41830
$$ -47972 -96219 -25742 -129005 -168933 6814 18376 -50814 -130041 -233617 -331679 -189849
16948a89849J02876q0377p7308j9715J03544N0698m3746p412N260j053O4364M4938
$$ -189849 -86973 -167350 -244658 -264373 -160829 -110131 -153877 -161289 -156029 -157082 -92718 -47780
16936d7780k7251q518m549j71599J02552J57579O4985J35102j94j01347P9597
$$ -47780 -75031 -83549 -88098 -259697 -157145 434 65419 200521 200327 98980 178577
16925A78577r8864j65072m6809J63544p736J943o0541P9632R5618r3774j57301
$$ 178577 79713 -85359 -132168 31376 23640 25583 -34958 44674 140292 46518 -110783
16914a10783m6623K922j5729Q5387J76722q2200j51933m4332m7665L9062R3109
$$ -110783 -157406 -154484 -170213 -84826 91896 9696 -142237 -186569 -234234 -195172 -102063
16903a02063K4939l2224l3296M9073L0308J42468q6040j22162p3456J09944J18335
$$ -102063 -77124 -109348 -142644 -93571 -63263 79205 -6835 -128997 -202453 -92509 25826
16892B5826l2339j12174L1813L157L3993o8530l1803O1341J43568M7908l5043
$$ 25826 -6513 -118687 -86874 -83717 -49724 -118254 -150057 -88716 54852 102760 67717
16881F7717p8715m4102J17799p3827N2839J31875N0736L0219k9878j83090K8302
$$ 67717 -10998 -55100 62699 -11128 41711 173586 224322 254541 224663 41573 69875
16870F9875q6982q5250o8657o5026L0499m5528j24769J46722J31528j8470j16325
$$ 69875 -17107 -102357 -171014 -236040 -205541 -251069 -375838 -229116 -97588 -116058 -232383
16859b32383N3582K66092L134j67181M710n9504j9907M00j6055k4140M2152N7567
$$ -232383 -178801 87291 90425 -76756 -72046 -131550 -151457 -151057 -167112 -191252 -149100 -91533
16847i1533J05808j66107l6636N7389J1834K0677O8079N768n9919r6298J7678
$$ -91533 14275 -151832 -188468 -131079 -119245 -98568 -30489 -24721 -84640 -180938 -163260
16836a63260K23259M1393j13663j85292J2564K44324j2799O4505o2358p7166M836
$$ -163260 59999 101392 -12271 -197563 -184999 59325 46526 111031 48673 -28493 -23657
16825b3657J17438k096p8924m2217k459n8572M9418L1360o17L4138j55850j9867
$$ -23657 93781 91685 12761 -29456 -31915 -90487 -41069 -9709 -10326 23812 -132038 -151905
16813a51905J68658M4868k716n8234n0966j65745O2050k2057o5085J1642N1607
$$ -151905 16753 61621 58905 671 -50295 -216040 -153990 -176047 -241132 -229490 -177883
16802a77883R4058R2550n8019L3343k2244P0115K3546j10554j5607q4134j9583
$$ -177883 -83825 8725 -49294 -15951 -38195 31920 55466 -55088 -70695 -154829 -174412
16791a74412m4208n7305J07671J80995P9708N4420L4918k09023p2501J22983J84517
$$ -174412 -218620 -275925 -168254 12741 92449 146869 181787 -27236 -99737 23246 207763
16780B07763l4859k03971m7970j9545L8365R7729J15009M9761j17133r1284L0095
$$ 207763 172904 -31067 -79037 -98582 -60217 37512 152521 202282 85149 -6135 23960
16769B3960m0843N1133m3424r7173p3496o6297L7481J69671N1458j005L2382m6735
$$ 23960 -16883 34250 -9174 -106347 -179843 -246140 -208659 -38988 12470 11465 43847 -2888
16757b888j7032L5231r4112j08650L6011R2473l0904O7111k3610J28858l6356
$$ -2888 -19920 15311 -78801 -187451 -151440 -58967 -89871 -22760 -46370 82488 46132
16746D6132j16309J6879P1053J5435j5571P4284k5285n3625P3379k1211K8609
$$ 46132 -70177 -53298 17755 33190 17619 91903 66618 12993 86372 65161 93770
16735I3770O5981L1655q0027r7988n9760N1744Q8925J14667l2067j36749m5786
$$ 93770 159751 191406 111379 13391 -46369 5375 94300 208967 176900 40151 -5635
16724e635K5075L8869k8990p5422k827j51784J7821j31571Q5607J92337R9534
$$ -5635 19440 58309 29319 -46103 -48930 -200714 -182893 -314464 -228857 -36520 63014
16713F3014j9037L720N798j48159j47239P3078J72908R9311j4624p1057k8810
$$ 63014 43977 47697 53495 -94664 -241903 -168825 4083 103394 88770 17713 -11097
16702a1097q1694Q680l9024m8946o1904j6677P1532l7141l8473L280J78291K2684
$$ -11097 -92791 -84111 -123135 -172081 -233985 -250662 -179130 -216271 -254744 -251464 -73173 -50489
16690e0489k5468m9535N8980Q8503k1372j97490n8411L098n8693J11228Q1869
$$ -50489 -75957 -125492 -66512 21991 619 -196871 -255282 -252184 -310877 -199649 -117780
16679a17780R0131O7316k6061j6166l6102p8527R2795L0519k8218k2824l3321
$$ -117780 -27649 39667 13606 -2560 -38662 -117189 -24394 6125 -22093 -44917 -78238
16668g8238Q5901m4397n052N9623N859r4052k5444j17269k6741J67505R3500J04187
$$ -78238 7663 -36734 -41786 17837 23696 -70356 -95800 -213069 -239810 -72305 21195 125382
16656A25382J02700M070j57102j81565K14175J04129k01107m6327r3730N7428
$$ 125382 228082 232152 75050 -106515 107660 211789 10682 -35645 -129375 -71947
16646g1947M2574j7693p7925L9360m8616o2152Q8019L6066o414k8917O2823M0328
$$ -71947 -29373 -47066 -124991 -85631 -134247 -196399 -108380 -72314 -78728 -107645 -44822 -4494
16634d494J5900r5840m9516J0666j9589m6527k6570K9085R1700O3740p8552j42457
$$ -4494 11406 -84434 -133950 -123284 -142873 -189400 -215970 -186885 -95185 -31445 -109997 -252454
16622b52454o7616J47980J83687M6643l3970j7793k4705J43721j376p1583O5052
$$ -252454 -320070 -172090 11597 58240 24270 6477 -18228 125493 124117 52534 117586
16611A17586j80744k9393o530n7502q9024K9584R2595L2994j0463p8565j45122
$$ 117586 -63158 -92551 -99081 -156583 -245607 -216023 -123428 -90434 -100897 -179462 -324584
16600c24584P3118K21938M3384P102k2663N3375M02R8311k7301p6931n9834l4345
$$ -324584 -251466 -29528 13856 20958 -1705 51670 52072 150383 123082 46151 -13683 -48028
16588d8028p1221J06700K0499J5616r025L7123M78q249j16234k7945j23242j09354
$$ -48028 -119249 -12549 7950 23566 14541 51664 52142 43893 -72341 -100286 -223528 -332882
16576c32882L6932N8176M922r1595k0298J48686J06148N1952J29098j6576k2632
$$ -332882 -295950 -237774 -232852 -324447 -344745 -196059 -89911 -37959 91139 74563 51931
16565E1931N696j48649M6270N0771K8609J68750o5556n2413R2105J17110j55592
$$ 51931 57627 -91022 -44752 6019 34628 203378 137822 85409 177514 294624 139032
16554A39032j02853m7486o9312j49183K1643n0133k0642J00777Q1428j9986k5802
$$ 139032 36179 -11307 -80619 -229802 -208159 -258292 -278934 -178157 -96729 -116715 -142517
16543a42517O4710n5861K7944J34617R6703r9158M2011K4254j17196K3441O956
$$ -142517 -77807 -133668 -105724 28893 125596 26438 68449 92703 -24493 -1052 5904
16532E904k459j7919L7225K0944l6461Q3322N04j79380j79799r9909q8441J3957
$$ 5904 3445 -14474 22751 43695 7234 90556 91060 -88320 -268119 -368028 -456469 -442512
16520d42512J13188J11394J65844J2487j38107P1780J36413q2851L510J25900
$$ -442512 -329324 -217930 -52086 -39599 -177706 -105926 30487 -52364 -48854 77046
16510G7046j00393j55595M3065l673j7928J7872p509J92808J14329Q641j41449
$$ 77046 -23347 -178942 -135877 -139550 -157478 -139606 -147115 45693 160022 168663 27214
16499B7214P28J41900N345k9351j18472q4763k6560O6452k2962N2672m7553j04175
$$ 27214 27942 169842 175187 145836 27364 -57399 -83959 -17507 -40469 12203 -35350 -139525
16487a39525J57291m4721k416j37629J03823K53511p667j3234m0477k1728Q8922
$$ -139525 17766 -26955 -29371 -167000 -63177 190334 182667 169433 128956 107228 196150
16476A96150K0015k4234m0719j35822q7128l5999J5453Q3470l320k3663J58928
$$ 196150 216165 191931 151212 15390 -71738 -107737 -92284 -8814 -12134 -35797 123131
16465A23131J07859j05544m4515P3912j10133l2875M5318M6437l7349r8510m0638
$$ 123131 230990 125446 80931 154843 44710 11835 57153 103590 66241 -32269 -72907
16454g2907j07852M013k0775K27Q9847r3781K0705J33818J2754r2461q3009J09302
$$ -72907 -180759 -176746 -197521 -197294 -107447 -201228 -180523 -46705 -33951 -126412 -209421 -100119
16442a00119J15597p3585M1877P6564k8192r7274Q6840r946P5855Q3449o6744
$$ -100119 15478 -58107 -16230 60334 32142 -65132 21708 11762 87617 171066 104322
16431A04322j67996Q724k499L9632l218K0998n2533L278K4751r2732j9029J9089
$$ 104322 -63674 -54950 -57449 -17817 -21035 -37 -52570 -49292 -24541 -117273 -136302 -117213
16419a17213j5156J07541j4388r527j8345j59269O4420N9800j06335J1011k7460
$$ -117213 -132369 -24828 -39216 -48743 -67088 -226357 -161937 -102137 -208472 -197461 -224921
16408b24921n8161m4601L7967k4972P5128M2381J9184j22198J1986M7192Q2291
$$ -224921 -283082 -327683 -289716 -314688 -239560 -197179 -177995 -300193 -288207 -241015 -158724
16397a58724O614N5389j7681J4008M4436R1289j224j3507J80700k5939k30098
$$ -158724 -152110 -96721 -114402 -100394 -55958 35331 34107 20600 201300 175361 -54737
16386e4737J7055p311j02760O1075k1557J64819N8140j50931n2650O1566j1659
$$ -54737 -37682 -44993 -147753 -86678 -108235 56584 114724 -36207 -88857 -27291 -38950
16375c8950m532J11254N0100p8093j3513l9445P9207j05447j50017r645J17180
$$ -38950 -43482 67772 117872 39779 26266 -13179 66028 -39419 -189436 -199081 -81901
16364h1901J58656j31343n6762L5017j3485J46829m091j0013r6372Q5959J00051
$$ -81901 76755 -54588 -111350 -76333 -89818 57011 52920 42907 -53465 32494 132545
16353A32545l2725m3043R451J40967K9155j7641n6955L0970l3614j56768j68473
$$ 132545 99820 56777 66228 207195 236350 218709 161754 192724 159110 2342 -166131
16342a66131Q3504Q7214N5714P3265l7627q6192n6600m2718l6673l4005L0442
$$ -166131 -82627 4587 60301 133566 95939 9747 -46853 -89571 -126244 -160249 -129807
16331a29807J12742N0682k40196k38356P6948M1541M7189J24397j9299l4472l467
$$ -129807 -17065 33617 -206579 -444935 -367987 -326446 -279257 -154860 -174159 -208631 -212098
16320b12098Q7969M9651r8743j11383K2984J27425O3839k77O1526j25817j1102
$$ -212098 -124129 -74478 -173221 -284604 -261620 -134195 -70356 -70633 -9107 -134924 -146026
16309a46026J65986J25354q3074p5238m323q190m6484n0428Q941L1367M7014j33809
$$ -146026 19960 145314 62240 -12998 -17321 -25511 -71995 -122423 -113482 -82115 -35101 -168910
16297a68910j20102M6699P8535J8817J3855J08216L6548p3865p0876k9648r5549
$$ -168910 -289012 -242313 -163778 -144961 -131106 -22890 13658 -60207 -131083 -160731 -256280
16286b56280R2209L5370J15408J02587J40415o8212n497j32753j43407l9091p7637
$$ -256280 -164071 -128701 -13293 89294 229709 161497 156000 23247 -120160 -159251 -236888
16275b36888J9173P007j1336m6300l915J34392n6171Q4983K63955M1912j72852
$$ -236888 -217715 -210708 -222044 -268344 -272259 -137867 -194038 -109055 154900 196812 23960
16264B3960o0513J50558J00459q9225M1497j899j03216o6481J6838j39290N4279
$$ 23960 -36553 114005 214464 125239 166736 164837 61621 -4860 11978 -127312 -73033
16253g3033J67781J31346j01381k03737p344Q1955j2071M9633K03493N3385o6706
$$ -73033 94748 226094 124713 -79024 -86368 -4413 -16484 33149 236642 290027 223321
16242B23321l9439k836j46832j0780j0603L1720R0421R3784m6145j94055n0366
$$ 223321 183882 181046 34214 23434 12831 44551 134972 228756 182611 -11444 -61810
16231f1810L5649P2801j9714m0923l8315J5426j02568J1710L8950l5387m537J9108
$$ -61810 -26161 46640 26926 -13997 -52312 -36886 -139454 -127744 -88794 -124181 -128718 -109610
16219a09610M1912O6080K3778N0635j1631p6071o0274r8857K4982J15643P3376
$$ -109610 -67698 -1618 22160 72795 61164 -14907 -75181 -174038 -149056 -33413 39963
16208C9963o1439M0108R4057R8221j47202j66596k073J64480j0221o4411m9107
$$ 39963 -21476 18632 112689 210910 63708 -102888 -104961 59519 49298 -15113 -64220
16197f4220n9452n6252j3303k6723k2340J62684J13369q1590o5616k2229M2108
$$ -64220 -123672 -179924 -193227 -219950 -242290 -79606 33763 -47827 -113443 -135672 -93564
16186i3564r431O2603J25861l1108j91150j8061M1079N2166l5330J8410K5426
$$ -93564 -102995 -40392 85469 54361 -136789 -154850 -113771 -61605 -96935 -78525 -53099
16175e3099o8326k2669J8859J8033j7717P0899J7975p0065j2731r1867L3430R3240
$$ -53099 -121425 -144094 -125235 -107202 -124919 -54020 -36045 -106110 -118841 -210708 -177278 -84038
16163h4038q1670j50692N1194P6983J37086J22408k5570n155p4157l7957r6591
$$ -84038 -165708 -316400 -265206 -188223 -51137 71271 45701 40546 -33611 -71568 -168159
16152a68159j8283n5032k0310j05433j0366j3406k2112J81024J73746M6975P6321
$$ -168159 -186442 -241474 -261784 -367217 -377583 -390989 -413101 -232077 -58331 -11356 64965
16141F4965O3801k2874m1802l998J7326N695Q628k3775p5206q8459m2762n9796
$$ 64965 128766 105892 64090 60092 77418 83113 91741 67966 -7240 -95699 -138461 -198257
16129a98257l3295Q5006l324j5656J7615J13255J16240j12564n0904m6488r3903
$$ -198257 -231552 -146546 -149870 -165526 -147911 -34656 81584 -30980 -81884 -128372 -222275
16118b22275j27867Q5843R5045Q8711N8063n3005Q1651l8361k79690K3984J80104
$$ -222275 -350142 -264299 -169254 -80543 -22480 -75485 6166 -32195 -311885 -287901 -107797
16107a07797K4409m773J6635P757K03783R7959L7596p9520j35032q1197J33730
$$ -107797 -83388 -88161 -71526 -63769 140014 237973 275569 196049 61017 -20180 113550
16096A13550O7314n5558o5472j59843j11603j07736L7261O9179O681P6932J35163
$$ 113550 180864 125306 59834 -100009 -211612 -319348 -282087 -212908 -206227 -129295 5868
16085E868Q4068Q9637o667j83811j58550o5685n7763J21762R8603l9092P0960
$$ 5868 89936 179573 172906 -10905 -169455 -235140 -292903 -171141 -72538 -111630 -40670
16074d0670k8881j24728j8709l6977o8144n5992r6J91214K58869P319j62192n4251
$$ -40670 -69551 -194279 -212988 -249965 -318109 -374101 -374197 -182983 75886 83205 -78987 -133238
16062a33238R8656R2007p7166j51375j82451J88928J69495O8290O5535l2676n1504
$$ -133238 -34582 57425 -19741 -171116 -353567 -164639 4856 73146 138681 106005 54501
16051E4501r9233J5646Q337J05456L4025n7683k8648n8073j5410j4810l7411J25425
$$ 54501 -44732 -29086 -20749 84707 118732 61049 32401 -25672 -41082 -55892 -93303 32122
16039C2122n8849j04093O437N2130J56129L3707k30498j00243Q793J11216o2928
$$ 32122 -26727 -130820 -124383 -72253 83876 117583 -112915 -213158 -204365 -93149 -156077
16028a56077K7168O707L511M8576j4622j53343Q9433M2896l3645N9509J59005
$$ -156077 -128909 -122202 -118691 -70115 -84737 -238080 -148647 -105751 -139396 -79887 79118
16017G9118k2202j0425o0305m411O9114J26211j48268L485j55587m9053J83340
$$ 79118 56916 46491 -13814 -18225 50889 177100 28832 32317 -123270 -172323 11017
16006A1017K28778n5226j99973r1469l5086o5870O4551J00628J73893L5271j42715
$$ 11017 239795 184569 -15404 -106873 -141959 -207829 -143278 -42650 131243 166514 23799
15995B3799j40449L5233N1213p071P2256l4525O027j01442p3678M4879k6283j2705
$$ 23799 -116650 -81417 -30204 -37275 34981 456 6483 -94959 -168637 -123758 -150041 -162746
15983a62746Q2860J74906j80150k05538j1901J19352K5765k4539Q382K12J4273
$$ -162746 -79886 95020 -85130 -290668 -302569 -183217 -157452 -181991 -173609 -173397 -159124
15972a59124M3335O1568J38162M6126j63056L9955O5597L66l0006r0125K2944
$$ -159124 -115789 -54221 83941 130067 -32989 6966 72563 72929 42923 -47202 -24258
15961b4258L0135L1746r1657q2271j4734O3538P0118J6707J00536J9209L0750
$$ -24258 5877 37623 -54034 -136305 -151039 -87501 -17383 -676 99860 119069 149819
15950A49819r4236j81322j13499Q5942k6308n9994N2381J73368n673n1101Q980
$$ 149819 55583 -125739 -239238 -153296 -179604 -239598 -187217 -13849 -19522 -70623 -61643
15939f1643J05550N833q4075P2087r8734l9332N7834j7569l3268N7067M8002o3809
$$ -61643 43907 49740 -34335 37752 -60982 -100314 -42480 -60049 -93317 -36250 11752 -52057
15927e2057k6949o2906j8610J04304P9930k7889O0971L3452k09474p3143L9475
$$ -52057 -79006 -141912 -160522 -56218 23712 -4177 56794 90246 -119228 -192371 -152896
15916a52896n0268Q7390K50j07206m7104K8967M0326J7935P2L8014L2255K0792
$$ -152896 -203164 -115774 -115524 -222730 -269834 -240867 -200541 -182606 -182534 -144520 -112265 -91473
15904i1473Q311Q3668j7419L5547L7369J08657J0550q1190r3268l2276N8844L5950
$$ -91473 -83162 506 -16913 18634 56003 164660 175210 94020 752 -31524 27320 63270
15892F3270k313j9698K1663M208k39153j48008O620K22688M0575m70r5573N600
$$ 63270 60957 41259 62922 67130 -172023 -320031 -313411 -90723 -50148 -50618 -146191 -140591
15880a40591J08288O3421K4235j16885j13317o6388P1548L5411o3164k5784n8188
$$ -140591 -32303 31118 55353 -61532 -174849 -241237 -169689 -134278 -197442 -223226 -281414
15869b81414M049n2752r3107J09054J70509R532k5747m1490R4195K3493J19046
$$ -281414 -277365 -330117 -423224 -314170 -143661 -134129 -159876 -201366 -107171 -83678 35368
15858C5368j5347j74187q9754l8917J03357m8721J20500k6793o9530J0377M8367
$$ 35368 20021 -154166 -243920 -282837 -179480 -228201 -107701 -134494 -204024 -193647 -145280
15847a45280R3451J377J03131j5889q1304m776j15l557n1556o5382N3220o241
$$ -145280 -51829 -50452 52679 36790 -44514 -49290 -49405 -52962 -104518 -169900 -116680 -122921
15835a22921o1172p5803m5756J14021J38289R5174m2098j65284M0399J54549q8247
$$ -122921 -184093 -259896 -305652 -191631 -53342 41832 -266 -165550 -125151 29398 -58849
15824e8849j12029n1860Q1907Q3717J47171j12328j34712J7891l3066P226L3976
$$ -58849 -170878 -222738 -140831 -57114 90057 -22271 -156983 -139092 -172158 -164932 -130956
15813a30956P1491n9938R7884K1958m5243L4672l7236J6086j10971R0334k3907
$$ -130956 -59465 -119403 -21519 439 -44804 -10132 -47368 -31282 -142253 -51919 -75826
15802g5826O7892k5896j01978j03601j15905o1484N6065J09111n748N0805j7053
$$ -75826 -7934 -33830 -135808 -239409 -355314 -416798 -360733 -251622 -257370 -206565 -223618
15791b23618M1748J2943q0871K548R6572J91958j39889j51209j615R6071j2175
$$ -223618 -181870 -168927 -249798 -247250 -150678 41280 -98609 -249818 -251433 -155362 -167537
15780a67537J1058Q2557j52810j5827J0102L2051J56447n0288j4434P1086m6258
$$ -167537 -156479 -73922 -226732 -242559 -232457 -200406 -43959 -94247 -108681 -37595 -83853
15769h3853P7693P0501N2320j3502j28480j67578R783j9763O4799J13583n590
$$ -83853 -6160 64341 116661 103159 -25321 -192899 -183116 -202879 -138080 -24497 -30087
15758c0087j81210q1279P3525K06911J18549r8178j86835P760q3855j00911J59860
$$ -30087 -211297 -292576 -219051 -12140 106409 8231 -178604 -170844 -254699 -355610 -195750
15747a95750j1841P912l37J0950N6286J21874J0939R6488K8402j64441j05871
$$ -195750 -207591 -199679 -200016 -189066 -132780 -10906 33 96521 124923 -39518 -145389
15736a45389k10993O2183O9669O6423k8990K6196L3372P9008J31337k6743j7852
$$ -145389 -356382 -294199 -224530 -158107 -187097 -160901 -127529 -48521 82816 56073 38221
15725C8221K3858M6294k8741k05598j18077Q7542K39668N7009j28535N9788O9277
$$ 38221 62079 108373 79632 -125966 -244043 -156501 83167 140176 11641 71429 140706
15714A40706j85778j71686R199Q3571K5093J2198N1733P9284R116k9902q84o941
$$ 140706 -45072 -216758 -207559 -123988 -98895 -86697 -34964 44320 53436 23534 22650 15709
15702A5709o2857J5106j2115P6106L5744L2911j14708j383r5565o8150J55404
$$ 15709 -47148 -32042 -44157 31949 67693 100604 -14104 -15487 -111052 -179202 -23798
15691b3798J28980J40281l5273k85456r7461J19608O5157j28070j46769J25636
$$ -23798 105182 245463 210190 -75266 -172727 -53119 12038 -116032 -262801 -137165
15681a37165K26239J07506k5930k01632r8280J5083J06492P1867N0443r433r5296
$$ -137165 89074 196580 170650 -30982 -129262 -114179 -7687 64180 114623 105190 9894
15670I894j12795O7539l1764r5585q5964J09973J39209m796j47430j91382J46658
$$ 9894 -102901 -35362 -67126 -162711 -248675 -138702 507 -4289 -151719 -343101 -196443
15659a96443m9957j21371P0438J60690P9703M1839r5649r7852M5831k9268q8640
$$ -196443 -246400 -367771 -297333 -136643 -56940 -15101 -110750 -208602 -162771 -192039 -280679
15648b80679O7825O0774K9138L8269Q3024L3603k38494j75884M568R311J43986
$$ -280679 -212854 -152080 -122942 -84673 -1649 31954 -206540 -382424 -377856 -368545 -224559
15637b24559K59164j9052p9778O0671k880j39774n2427j3420M6533m8675P2766
$$ -224559 34605 15553 -64225 -3554 -6434 -146208 -198635 -212055 -165522 -214197 -141431
15626a41431J14584J7284L2540N0828l2619P3421K1874m7580j23900L1739J02769
$$ -141431 -26847 -9563 22977 73805 41186 114607 136481 88901 -34999 -3260 99509
15615I9509m0201j28504K2045Q3802K4515m7194n1606j31905O3142O7792K5927
$$ 99509 59308 -69196 -47151 36651 61166 13972 -37634 -169539 -106397 -38605 -12678
15604a2678k6656K5383R0160j00772j20415l5392J76909l6212j01868L4449l6012
$$ -12678 -39334 -13951 76209 -24563 -144978 -180370 -3461 -39673 -141541 -107092 -143104
15593a43104P0905J01253p6418P1654R101n2665j0870l5817p7096p1542m9049
$$ -143104 -72199 29054 -47364 24290 33391 -19274 -30144 -65961 -143057 -214599 -263648
15582b63648M1311O9084P3464J37788m1510o6921M848o2587o7538j62357J9822
$$ -263648 -222337 -153253 -79789 57999 16489 -50432 -45584 -108171 -175709 -338066 -318244
15571c18244J04313K0472m1424R9700N3368j28553J6693O9312p2774l7795R3872
$$ -318244 -213931 -193459 -234883 -135183 -81815 -210368 -193675 -124363 -197137 -234932 -141060
15560a41060Q0883J59654Q1946j43395o1733j5459P0433J4934J16716j4920m5274
$$ -141060 -60177 99477 181423 38028 -23705 -39164 31269 46203 162919 147999 102725
15549A02725l6232j00620j23093p4071M0772q0828O1328n4831J9702o2432p1032
$$ 102725 66493 -34127 -157220 -231291 -190519 -271347 -210019 -264850 -245148 -307580 -378612
15538c78612J5422J66495J12868J27712P8547m8506l0139Q9029P779k7134q6280
$$ -378612 -363190 -196695 -83827 43885 122432 73926 43787 132816 140595 113461 27181
15527B7181n9353j70291N8932J04815K2245j36610m1244O6006N6063j4124k4856
$$ 27181 -32172 -202463 -143531 -38716 -16471 -153081 -194325 -128319 -72256 -86380 -111236
15516a11236q9189J80583J57769j4097j3186k12075k33569q5210O8182R7195O6384
$$ -111236 -200425 -19842 137927 123830 110644 -101431 -335000 -420210 -352028 -254833 -188449
15505a88449o5583J15810M8375J3548k8184r4524Q0685J33965J25414o8144k10598
$$ -188449 -254032 -138222 -89847 -76299 -104483 -199007 -118322 15643 141057 72913 -137685
15494a37685l8005L0903P9839j10634j60702J5595M7783J2910m0303M8740O7938
$$ -137685 -175690 -144787 -64948 -175582 -336284 -320689 -272906 -259996 -300299 -251559 -183621
15483a83621K1100j02404R1034J7551p7622j14886p8877K6878K44745J69453r3257
$$ -183621 -162521 -264925 -173891 -156340 -233962 -348848 -427725 -400847 -156102 13351 -79906
15472g9906q7755Q5990R3997Q667r0435l8099J22077j33073p5790M2237r6897
$$ -79906 -167661 -81671 12326 20993 -69442 -107541 14536 -118537 -194327 -152090 -248987
15461b48987J3089J09588R2999J17888k2247j2599j41333r3792j26455l3351J49770
$$ -248987 -235898 -126310 -33311 84577 62330 49731 -91602 -185394 -311849 -345200 -195430
15450a95430p112o1749k5013Q3758Q1685J44106P582j32452m5840m7555m8330
$$ -195430 -202542 -264291 -289304 -205546 -123861 20245 27827 -104625 -150465 -198020 -246350
15439b46350L8883o5026N2798R6331J73901J6096q2758k1251N9205p3611j10914
$$ -246350 -207467 -272493 -219695 -123364 50537 66633 -16125 -37376 21829 -51782 -162696
15428a62696K6852K4586K6888J7989J15166k0477J8583M2680l6045N4452L2172
$$ -162696 -135844 -111258 -84370 -66381 48785 28308 46891 89571 53526 107978 140150
15417A40150j22003m3575n8649j31479N4314O9835J34190P3094j71403l0756J41701
$$ 140150 18147 -25428 -84077 -215556 -161242 -91407 42783 115877 -55526 -86282 55419
15406E5419p6944k13126l3839J27635K25094P2326j15871M378o2971p0891p107
$$ 55419 -21525 -234651 -268490 -140855 84239 156565 40694 45072 -17899 -88790 -95897
15395i5897m4967R648J09262q6399N6638J53208K8429j32531o4129P0941L475
$$ -95897 -140864 -131216 -21954 -108353 -51715 101493 129922 -2609 -66738 4203 7678
15384G678m9479o3295r2423j21036J50482Q080j80878K8997J95935M6860R5176
$$ 7678 -41801 -105096 -197519 -318555 -168073 -159993 -340871 -311874 -115939 -69079 26097
15373B6097j0666q4682n1198k8744Q4293J86680N1487n2862L6781P8243r8649
$$ 26097 15431 -69251 -120449 -149193 -64900 121780 173267 120405 157186 235429 136780
15362A36780j2923j96756R9897o2121M775M0478r3802l2689k341k4822M4500o0492
$$ 136780 123857 -72899 26998 -35123 -30348 10130 -83672 -116361 -118702 -143524 -99024 -159516
15350a59516j46670o115P4155M510p0666j1244K57989J05346m7853J09159n5717
$$ -159516 -306186 -312301 -238146 -233636 -304302 -315546 -57557 47789 -64 109095 53378
15339E3378n0829m638m5745m8478O3355K9056o2725q2201K7161O9488P2133k5693
$$ 53378 2549 -2089 -47834 -96312 -32957 -3901 -66626 -148827 -121666 -52178 19955 -5738
15327e738k3933K0992o0105l6885l6076j19754n7651J71643L8138R0488k4553
$$ -5738 -29671 -8679 -68784 -105669 -141745 -261499 -319150 -147507 -109369 -18881 -43434
15316d3434K5665O2042J24197j46553q2348M6376J1947r0350J9352Q5911P8531
$$ -43434 -17769 44273 168470 21917 -60431 -14055 -2108 -92458 -73106 12805 91336
15305I1336k1555q4740K6054J8467N307j17386O1131O5347J6062N5747j73450
$$ 91336 69781 -14959 11095 29562 34869 -82517 -21386 43961 60023 115770 -57680
15294e7680q8385k9312K6652J56739J56995K1238j9230m9336j67724O9144R6780
$$ -57680 -146065 -175377 -148725 8014 165009 186247 167017 117681 -50043 19101 115881
15283A15881o897M9971J9221l5629n0277L2011N2372P9868N1624p485j27806j47614
$$ 115881 108984 158955 178176 142547 92270 124281 176653 256521 308145 300660 172854 25240
15271B5240k406N6466o7176n2598r9091J76305Q2829n99l0540n8042j0799K1963
$$ 25240 22834 79300 12124 -40474 -139565 36740 119569 118970 88430 30388 19589 41552
15259D1552k568l6917r3938j5079J3501L7024O4311K2456Q0295r856r1594J14458
$$ 41552 38984 2067 -91871 -106950 -93449 -56425 7886 30342 110637 100781 9187 123645
15247A23645o6624O7993p3814j85328p9281o1786O2625M8900N1591N1273l2075
$$ 123645 57021 125014 51200 -134128 -213409 -275195 -212570 -163670 -112079 -60806 -92881
15236i2881n6756m968k9056K39151J8459r3447j75846J3246M3310k2818Q3472
$$ -92881 -149637 -154605 -183661 55490 73949 -19498 -195344 -182098 -138788 -161606 -78134
15225g8134N607K1022M0956r5410j4908O1429Q7036l8314j25590O5470P067R6364
$$ -78134 -72527 -51505 -10549 -105959 -120867 -59438 27598 -10716 -136306 -70836 -63769 32595
15213C2595J1934o6454r6037Q8728o4887k3449O69n5555l9788L6233K4167O3364
$$ 32595 44529 -21925 -117962 -29234 -94121 -117570 -116901 -172456 -212244 -176011 -151844 -88480
15201h8480J92209M6831l9813K5358L4676N501q5170l909J25827o4361m0663j14261
$$ -88480 103729 150560 110747 136105 170781 176282 91112 87203 213030 148669 108006 -6255
15189f255o8053n7283P8162j37970m136J9421j3224j3111K1054J84783L3380j4812
$$ -6255 -74308 -131591 -53429 -191399 -195535 -176114 -189338 -202449 -181395 3388 36768 21956
15177B1956L3974J4871j60533j17652J45980J20216l3126j62936j83310o4825
$$ 21956 55930 70801 -89732 -207384 -61404 58812 25686 -137250 -320560 -385385
15167c85385L4424O5317Q7224M5534L6085L9281N7383j0812j38859j64917J66843
$$ -385385 -350961 -285644 -198420 -152886 -116801 -77520 -20137 -30949 -169808 -334725 -167882
15156a67882J1351m0985K8201N744L2440J42137k490r1591p7245O5884J6717o4014
$$ -167882 -156531 -197516 -169315 -163571 -131131 11006 8516 -83075 -160320 -94436 -77719 -141733
15144a41733p9721J74191J34543q3751j86565l2459J08692P8387k2343P2575P2143
$$ -141733 -221454 -47263 87280 3529 -183036 -215495 -106803 -28416 -50759 21816 93959
15133I3959j38166r6801N6335J28230j3294j00709P407K22783K5099m8134k3607
$$ 93959 -44207 -141008 -84673 43557 30263 -70446 -63039 159744 184843 136709 113102
15122A13102K8524j48034m9241j4164j00225J02630K8341j07891q868J27885J2826
$$ 113102 141626 -6408 -55649 -69813 -170038 -67408 -39067 -146958 -155826 -27941 -15115
15111a5115J30543p4317j30386L9181L5198q4909r0260k1282L7559K21169p1209
$$ -15115 115428 41111 -89275 -50094 -14896 -99805 -190065 -211347 -173788 47381 -23828
15100b3828o1383m64j09003n9219K9673J14424M1438j2252r9708j01323J29072
$$ -23828 -85211 -85675 -194678 -253897 -224224 -109800 -68362 -80614 -180322 -281645 -152573
$$ [...]
##END NTUPLES=NMR SPECTRUM
##END=
