##TITLE=Analysis number 329188
Compound Code cc 09702
Book Reference 513/115/29
Project Code adrs
Chemist Name ronp
##JCAMPDX= 6.0         $$ Bruker NMR JCAMP-DX V2.0
##DATA TYPE= NMR SPECTRUM
##DATA CLASS= NTUPLES
##ORIGIN= Bruker BioSpin GmbH
##OWNER= nmr
$$ XWIN-NMR		Version 3.5
$$ Wed Aug  8 11:09:01 2007 GMT Daylight Time (UT+1h)  MAYBRIDGE\nmr@NMR_250MHZ
##.OBSERVE FREQUENCY= 250.131544655141
##.OBSERVE NUCLEUS= ^1H
##.ACQUISITION MODE= SIMULTANEOUS (DQD)
##.ACQUISITION SCHEME= undefined
##.AVERAGES= 16
##.DIGITISER RES= 18
##SPECTROMETER/DATA SYSTEM= dpx250
##.PULSE SEQUENCE= zg30
##.SOLVENT NAME= CDCl3
##.SHIFT REFERENCE= (INTERNAL, CDCl3, 0, 16.4516)
##AUDIT TRAIL= $$ (NUMBER, WHEN, WHO, WHERE, WHAT)
$$ ##TITLE= Audit trail, XWIN-NMR		Version 3.5
$$ ##JCAMPDX= 5.01
$$ ##ORIGIN= Bruker BioSpin GmbH
$$ ##OWNER= nmr
$$ C:\u/data/dgb/nmr/ADRS/260/pdata/1/auditp.txt
$$ ##AUDIT TRAIL=  $$ (NUMBER, WHEN, WHO, WHERE, WHAT)
(   1,<2007-08-08 11:08:37.92 +100>,<MAYBRIDGE\nmr>,<NMR_250MHZ>,
      <created by zg, POWCHK disabled, PULCHK disabled
       configuration hash MD5:
       76 6E 9A 78 1E 09 19 81 EC 84 63 8F B0 6A 59 2D
       data hash MD5: 64K
       C3 EC 30 56 10 F6 B1 2F 82 75 2B 6A 32 5F 2D 69>)
(   2,<2007-08-08 11:08:48.80 +100>,<MAYBRIDGE\nmr>,<NMR_250MHZ>,
      <Start of raw data processing
       ef LB = 0.3 FT_mod = 6 PKNL = 1 SI = 32K 
       data hash MD5: 32K
       A6 20 AA 2F DF 39 F9 D1 7F 17 76 81 5E 52 6B 48>)
(   3,<2007-08-08 11:08:51.71 +100>,<MAYBRIDGE\nmr>,<NMR_250MHZ>,
      <apk 
       data hash MD5: 32K
       D7 8F 12 CB DE CA 12 83 5E E6 43 AB CC 2A BF 8E>)
(   4,<2007-08-08 11:08:52.41 +100>,<MAYBRIDGE\nmr>,<NMR_250MHZ>,
      <abs ABSG = 5 
       data hash MD5: 32K
       C1 A2 B2 44 50 94 CC F7 95 8D 58 85 F8 CB F1 E1>)
$$ ##END=
$$ 
$$ hash MD5
$$ 63 28 95 1D 5E C6 2C 36 81 22 A1 8C 7A B6 71 4F
##$RELAX= 
##$RELAX= 
##$RELAX= 
##$RELAX= 
##$RELAX= 
##$RELAX= 
##$RELAX= 
$$ Bruker specific parameters
$$ --------------------------
##$DU= <C:\u>
##$EXPNO= 260
##$NAME= <ADRS>
##$PROCNO= 1
##$TYPE= <nmr>
##$USER= <dgb>
##$AMP= (0..31)
100 100 100 100 100 100 100 100 100 100 100 100 100 100 100 100 100 100 
100 100 100 100 100 100 100 100 100 100 100 100 100 100 
##$AQSEQ= 0
##$AQ_mod= 3
##$AUNM= <au_zg>
##$AUTOPOS= <9 >
##$BF1= 250.13
##$BF2= 250.13
##$BF3= 250.13
##$BF4= 250.13
##$BF5= 500.13
##$BF6= 500.13
##$BF7= 500.13
##$BF8= 500.13
##$BYTORDA= 1
##$CFDGTYP= 0
##$CFRGTYP= 5
##$CHEMSTR= <none>
##$CNST= (0..31)
1 1 145 1 1 1 1 1 1 1 1 1 1 1 1 1 1 1 1 1 1 1 1 1 1 1 1 1 1 1 1 1 
##$CPDPRG= <>
##$CPDPRG1= <>
##$CPDPRG2= <>
##$CPDPRG3= <>
##$CPDPRG4= <mlev>
##$CPDPRG5= <mlev>
##$CPDPRG6= <mlev>
##$CPDPRG7= <mlev>
##$CPDPRG8= <mlev>
##$CPDPRGB= <>
##$CPDPRGT= <>
##$D= (0..31)
0 1 0 0 0 0 0 0 0 0.06 0 0 0 0 0 0 0.0002 0 0 0 0 0 0 0 0 0 0 0 0 0 0 
0 
##$DATE= 1186567716
##$DBL= (0..7)
120 120 120 120 120 120 120 120 
##$DBP= (0..7)
150 150 150 150 150 150 150 150 
##$DBP07= 0
##$DBPNAM0= <>
##$DBPNAM1= <>
$$ [...]
##$SUBNAM7= <"">
##$SUBNAM8= <"">
##$SUBNAM9= <"">
##$SW= 20.6930455092707
##$SWIBOX= (0..15)
0 0 3 0 0 0 0 0 0 0 0 0 0 0 0 0 
##$SW_h= 5175.983436853
##$TD= 65536
##$TD0= 1
##$TE= 296.16
##$TE2= 300
##$TE3= 300
##$TEG= 300
##$TL= (0..7)
0 120 120 120 120 120 120 120 
##$TP= (0..7)
150 150 150 150 150 150 150 150 
##$TP07= 0
##$TPNAME0= <>
##$TPNAME1= <>
##$TPNAME2= <>
##$TPNAME3= <>
##$TPNAME4= <>
##$TPNAME5= <>
##$TPNAME6= <>
##$TPNAME7= <>
##$TPOAL= (0..7)
0.5 0.5 0.5 0.5 0.5 0.5 0.5 0.5 
##$TPOFFS= (0..7)
0 0 0 0 0 0 0 0 
##$TUNHIN= 0
##$TUNHOUT= 0
##$TUNXOUT= 0
##$USERA1= <user>
##$USERA2= <user>
##$USERA3= <user>
##$USERA4= <user>
##$USERA5= <user>
##$V9= 5
##$VALIST= <valist>
##$VCLIST= <CCCCCCCCCCCCCCC>
##$VD= 0
##$VDLIST= <DDDDDDDDDDDDDDD>
##$VPLIST= <PPPPPPPPPPPPPPP>
##$VTLIST= <TTTTTTTTTTTTTTT>
##$WBST= 1024
##$WBSW= 4
##$XGAIN= (0..3)
0 0 0 0 
##$XL= 0
##$YL= 0
##$YMAX_a= 333653
##$YMIN_a= -260833
##$ZGOPTNS= <>
##$ZL1= 120
##$ZL2= 120
##$ZL3= 120
##$ZL4= 120
##$ABSF1= 16.45161
##$ABSF2= -4.241562
##$ABSG= 5
##$ABSL= 3
##$ALPHA= 0
##$AQORDER= 0
##$ASSFAC= 0
##$ASSFACI= 0
##$ASSFACX= 0
##$ASSWID= 0
##$AUNMP= <proc_1d>
##$AZFE= 0.1
##$AZFW= 0.1
##$BCFW= 0
##$BC_mod= 0
##$BYTORDP= 0
##$COROFFS= 0
##$CY= 12.5
##$DATMOD= 1
##$DC= 0
##$DFILT= <>
##$DTYPP= 0
##$F1P= 14.0000005364418
##$F2P= -0.99999901652339
##$FCOR= 0.5
##$FTSIZE= 32768
##$FT_mod= 6
##$GAMMA= 0
##$GB= 0
##$INTBC= 1
##$INTSCL= 1
##$ISEN= 128
##$LB= 0.3
##$LEV0= 0
##$LPBIN= 0
##$MAXI= 10000
##$MC2= 0
##$MEAN= 0
##$ME_mod= 0
##$MI= 0
##$NCOEF= 0
##$NC_proc= -3
##$NLEV= 6
##$NOISF1= 0
##$NOISF2= 0
##$NSP= 0
##$NTH_PI= 0
##$NZP= 0
##$OFFSET= 16.45161
##$PC= 1
##$PHC0= -58.81669
##$PHC1= 53.50264
##$PH_mod= 1
##$PKNL= yes
##$PPARMOD= 0
##$PSCAL= 4
##$PSIGN= 0
##$REVERSE= no
##$SF= 250.13001760439
##$SI= 32768
##$SIGF1= 0
##$SIGF2= 0
##$SINO= 400
##$SIOLD= 32768
##$SREGLST= <1H.CDCl3>
##$SSB= 0
##$STSI= 32768
##$STSR= 0
##$SW_p= 5175.98343685301
##$SYMM= 0
##$S_DEV= 0
##$TDeff= 65536
##$TDoff= 0
##$TI= <Analysis number 999999
Compound Code 99
Book Reference 9
Project Code 9>
##$TILT= no
##$TM1= 0
##$TM2= 0
##$TOPLEV= 0
##$USERP1= <user>
##$USERP2= <user>
##$USERP3= <user>
##$USERP4= <user>
##$USERP5= <user>
##$WDW= 1
##$XDIM= 32768
##$YMAX_p= 318790165
##$YMIN_p= -223196
$$ End of Bruker specific parameters
$$ ---------------------------------
##NTUPLES= NMR SPECTRUM
##VAR_NAME=  FREQUENCY,     SPECTRUM/REAL,   SPECTRUM/IMAG
##SYMBOL=    X,             R,               I
##VAR_TYPE=  INDEPENDENT,   DEPENDENT,       DEPENDENT
##VAR_FORM=  AFFN,          ASDF,            ASDF
##VAR_DIM=   32768,         32768,           32768
##UNITS=     HZ,            ARBITRARY UNITS, ARBITRARY UNITS
##FACTOR=    0.157963299565203, 1,           1
##FIRST=     4115.04164029043, 0,            0
##LAST=      -1060.94179656258, 0,           0
##MIN=       -1060.94179656258, -223196,     0
##MAX=       4115.04164029043, 318790165,    0
$$ Real data points
##PAGE= N=1
##DATA TABLE= (X++(R..R)), XYDATA
$$ [...]
29461 -63570 -54643 -54817 -4146 13104 -17657 15397 45407 -6461 -68673 -20821 -27256 -29183 7526
29448 7526 -13402 -1384 20936 -21589 -35486 -22147 21708 18999 -8617 -50996 -21766 -53780
29436 -53780 -37203 33823 16888 -24113 -41522 -27969 -66495 -91238 -109832 -119452 -135611 -69625
29424 -69625 -71139 -50028 -21688 21616 46008 2929 -21107 -32960 -39590 801 56210 40162
29412 40162 47287 19288 -13942 27528 44975 -30605 -51797 -31221 -39108 12131 49037 11623
29400 11623 -10469 -1270 -10058 -11326 42091 22490 28660 54952 24756 19982 35800 95864 122210
29387 122210 127206 143901 79007 11095 -59439 -59228 -8181 -25769 -18430 -3560 3130 22862
29375 22862 45000 36859 13310 26101 55898 20561 25124 62197 72949 85534 80408 46249
29363 46249 -9923 -102850 -126042 -98706 -34776 -31916 -46146 -44811 -6266 544 1908 -31441
29351 -31441 -56627 -49497 -54755 -24152 2110 9306 42355 33183 53316 17797 26433 35457 22528
29338 22528 34791 28231 -38832 -59582 -34720 226 28531 18688 -11009 7646 17829 34913
29326 34913 25815 11051 83276 80246 60898 21209 32981 74173 83390 40486 -3993 24740
29314 24740 40119 80799 18673 -31954 -47268 -47337 -45642 -30726 5006 22258 -40520 -76675
29302 -76675 -105958 -80390 -13313 13674 29818 59437 42926 48656 49801 45810 30559 35607
29290 35607 67451 84606 83054 81025 83781 94440 51130 56743 65399 57488 27367 -10986 -23615
29277 -23615 -36947 -63354 -21852 35783 42447 15594 -36508 -2866 27486 15982 20544 -5831
29265 -5831 -29394 -13600 31927 96638 129087 95956 45292 -9109 28716 76348 5964 9098
29253 9098 39476 29477 42699 68612 -14092 -34039 -7214 -6529 -60455 -46177 -22469 15324
29241 15324 4420 -17115 -142 58339 77798 45005 -1005 -6171 -11746 -43621 -66782 -38829
29229 -38829 -26553 -12012 -21468 2466 20132 -8924 7910 3786 11171 13944 29943 14403
29217 14403 26096 75346 134261 74429 26106 26068 27163 55707 75644 30716 35075 7127 16784
29204 16784 40054 64012 88968 88264 68478 73478 45162 63359 90527 52981 5070 -30605
29192 -30605 -78526 -56659 -21445 24188 35658 35156 43343 52020 -16288 -39076 -4599 -41597
29180 -41597 -37982 -24671 -12898 -6744 -14151 -28006 -6803 11515 -16446 -50078 7370 30415
29168 30415 29040 29818 7399 -58409 -34814 63 -42205 -22992 20326 37693 70633 103414
29156 103414 75803 63479 80440 57049 56830 66810 41702 30108 65424 84601 39351 9479
29144 9479 38124 41210 26607 9440 -39710 -38424 20467 -13472 -38743 -61611 -70909 -74535 -89906
29131 -89906 -108763 -113775 -137619 -98204 -80484 -55066 -37385 -22028 -3942 18486 9624 46252
29119 46252 23137 5765 -19792 -29818 9427 22089 14468 33844 27643 47642 53520 55874
29107 55874 15453 16630 -327 -32242 -28769 22773 61002 109550 78111 46995 37778 28943
29095 28943 16756 -7287 -32821 -26477 -11479 -14776 -17674 -52059 -14886 77887 83396 24795
29083 24795 -37169 -44134 -77621 -72804 -88497 -50822 25013 17254 -5208 -11216 -16548 -25508 -35836
29070 -35836 -50077 -16625 40823 -36455 -51061 -29425 -41346 -39400 -38208 -48449 -69515 -82927
29058 -82927 -75005 -72004 -67089 -56445 14529 93222 83431 53703 18799 55367 52373 27762 7824
29045 7824 -10893 -16835 32936 78262 70792 52185 9485 52928 84591 83754 17686 -38758 -52467
29032 -52467 -20669 40351 36650 -35312 -53922 -31573 -34910 407 59969 57588 21566 -4540
29020 -4540 -32489 -41616 -60573 11024 164 -19414 -19191 -9289 16478 5502 54197 15753 -11631
29007 -11631 -28616 -24285 9848 45693 31002 -15755 -22558 23685 39177 -3934 4648 28656
28995 28656 16213 -4332 -14558 15104 24168 7140 -10505 8676 6423 -16509 15323 66646
28983 66646 91733 63279 51349 35221 -21160 -38820 -4916 20643 32413 45522 17263 10032
28971 10032 -1754 -14488 -63475 -55467 -38042 -388 8139 -41738 -33763 -40 -16236 -27001
28959 -27001 -15120 -25155 -27991 -12292 23284 63864 56372 10685 -13130 -9497 4960 5428 43350
28946 43350 45691 8000 -38172 -28302 -25972 -12827 -5461 -37722 1353 15934 23743 -9 -26087
28933 -26087 -19337 -12828 -29702 -54792 -52833 5280 47867 5624 -29067 -30571 19508 17799 1017
28920 1017 -31703 -16828 -53938 -86971 -68628 -43074 -26910 893 56403 43488 22377 9628
28908 9628 -6192 5164 -11217 -29319 -34357 -68532 -78900 -15470 28038 36730 -43013 -4749
28896 -4749 47075 17144 -45920 -58141 -69504 -44221 -21200 6981 32431 23352 -3999 -13814
28884 -13814 28406 83245 91126 55932 17336 -30549 -196 21869 29948 27626 -28411 -44060
28872 -44060 -19883 -42648 -68581 -35875 -26523 -4802 14943 4412 19472 65182 127543 111774
28860 111774 92081 76768 23785 -22084 -69077 -86136 -68945 -94647 -105301 -84245 -35896
28849 -35896 -4885 43876 60336 34610 6452 39215 44950 -2686 -15358 -73647 -78688 -42739
28837 -42739 -21495 -30301 4404 -4129 -28325 -12836 -25736 -40302 -14846 77566 108003 58403
28825 58403 9942 28311 44798 52794 16362 -5402 9866 -4064 -45718 -59151 -78907 -95464
28813 -95464 -34293 3184 -51827 -100740 -104022 -72957 -64164 -62763 -51115 -37539 20839 59091
28801 59091 41854 11455 -47229 -46825 -14258 34478 72825 73847 51437 36831 -6785 -10815
28789 -10815 -28275 -66097 -23100 -17331 -25257 -12836 8139 5204 66991 82148 3918 4428 72763
28776 72763 49828 28058 -29819 -42768 22661 92906 86441 46754 27536 50140 43800 10262
28764 10262 -12969 -11017 27230 71993 41354 4681 -11563 37429 47639 55157 57611 74167
28752 74167 16672 -57468 -56055 -40326 -32959 34462 60011 79238 121227 96392 46701 25158
28740 25158 19553 -9156 -10323 -25432 -8043 5507 -4364 -623 12533 1491 15358 20311 34775
28727 34775 -1534 -31572 11458 39219 55419 82405 43195 23610 26990 7797 14501 24110
28715 24110 23608 20311 9964 8803 -2589 12966 19687 -32919 -36927 -29631 -5026 11064 -46599
28702 -46599 -58269 -45310 -43591 -39437 -70057 -61464 -6366 -17874 -20522 -30247 -12090 2504 -22573
28689 -22573 -18665 44064 60871 22351 -27880 -53983 -24356 -4257 -22264 -27845 -25627 -58530
28677 -58530 -75446 -27876 29006 44112 61302 110963 89005 52255 17349 35770 56345 46516
28665 46516 40805 10380 16872 36708 -4844 -62091 -93390 -115191 -63628 16303 40415 117663
28653 117663 87707 52584 86446 100025 80348 67815 22854 -23 2694 10994 36343 57319
28641 57319 17205 -8552 -25876 -50216 38498 71913 35079 5228 11850 43775 8834 -49794
28629 -49794 -27020 -70863 -97463 -77502 -100076 -94945 -89317 -33588 21015 10075 -27584 18946
28617 18946 10524 4399 79625 107381 59600 50608 84287 72672 62219 38374 58291 13294
28605 13294 16277 60212 19146 -19199 -12634 -21694 -17631 -3372 28293 34666 29703 32036 -7055
28592 -7055 -11866 26860 91024 65677 -21913 -21666 16326 64954 86298 60103 29237 -59658
28580 -59658 -99688 -31347 -16190 -5162 34302 -890 10538 1488 -10354 -40184 -62220 -75647
28568 -75647 -27480 -42861 -18892 -577 -14459 -38895 -27246 -3025 40822 3221 -36680 13627
28556 13627 48865 67582 91712 43396 13289 23145 43240 65077 54400 28498 12656 28055
28544 28055 24340 7146 40543 63344 54380 18614 -23943 -85925 -101861 -104643 -88682 -43481
28532 -43481 -19586 1807 63779 81939 89210 80243 27240 1930 6097 10306 -20092 -10585 -28665
28519 -28665 -32157 -7005 27517 -18052 -15916 24868 25578 18611 29376 15497 -10407 -10035 25614
28506 25614 49021 1598 -17776 58439 74496 45644 30165 5072 -26580 15399 38649 12696
28494 12696 -22838 -23472 -7420 26502 963 -17364 37516 43152 43324 83047 63649 80321 21952
28481 21952 -39952 -29657 493 45543 27934 -48278 -65027 -86648 -53460 -29898 -37579 -90040
28469 -90040 -102090 -14583 305 24055 34770 11127 4984 -11619 -28075 -43667 -35984 -17854
28457 -17854 2692 18785 64785 41060 -22745 -101740 -125756 -58688 -81694 -101235 -125709 -95562
28445 -95562 -63682 -24951 -5422 27602 42957 51775 69944 -59 -6999 13778 15332 67203
28433 67203 89042 14091 -24033 -68698 -50376 -19784 62732 62104 -27672 -83704 -59105 -5749
28421 -5749 1765 -27563 -27126 -7685 13289 15191 -42428 -52967 -36018 -36758 -31957 629 20720
28408 20720 24118 -10619 -68217 -105385 -81485 -37269 -10149 18756 15402 -74477 -80353 -41585
28396 -41585 -39571 -51193 -28457 10882 62000 93301 22823 -157 35817 17541 16687 52895
28384 52895 53519 77538 32288 7063 -21783 -2457 -1820 -22485 12751 -7658 -37577 10036
28372 10036 15015 -13186 -16799 15593 8607 -7228 -14514 3647 33610 39272 70968 82873 89911
28359 89911 29189 39669 105334 126740 24145 -26640 1766 14079 -16080 -24460 -57139 -21841
28347 -21841 11379 32014 89066 61072 2936 -1756 -23451 -60244 -83584 -69906 -2711 33513
28335 33513 2347 -16585 18334 25255 6107 -782 28555 26568 24771 35634 43244 38917 -7870
28322 -7870 17439 47125 4938 -35596 33680 59274 12691 13915 5731 18871 15379 52687
28310 52687 88662 77474 27416 21021 -1265 5559 29948 72532 102785 88984 62368 57358
28298 57358 72440 64905 42559 6351 -7528 -46461 -27188 -1910 55732 60647 20101 677
28286 677 9479 -28113 -57507 -90077 -20421 18726 3449 -100995 -122782 -120606 -90959 -64526
28274 -64526 -57540 -72343 -32755 -34251 -76888 -30746 -3704 -5319 -7503 48455 67789 27767
28262 27767 56112 103697 36910 -292 45283 102313 24045 -46158 -26440 5180 -23597 -17860
28250 -17860 -8302 6816 -3686 -16705 -7154 7982 61110 81726 28833 42583 78028 70932
28238 70932 20239 45359 17015 3699 23082 -26725 -54260 -32318 32886 42358 41637 64323
28226 64323 11579 -6371 -14466 -536 17149 23555 16423 39511 6426 -65332 -61188 -47715
28214 -47715 -54504 -53747 40843 53490 17988 14248 21407 40251 7953 -21081 13860 52453 19488
28201 19488 -30920 -21542 64808 35969 -9159 -28283 -8157 17682 55142 6727 -18422 8166
28189 8166 -21773 -31306 -40373 -38459 -71903 -76953 -18667 -48192 -42705 -574 1560 -38350 -70608
28176 -70608 -1632 19094 11613 46699 29682 -39019 -31934 11298 46829 364 -75425 -93128
28164 -93128 -48000 -45856 -22493 -4793 7686 18647 21223 11251 -10421 -48964 -51116 -26279
28152 -26279 43131 45077 20316 7435 22453 39003 28048 48542 92707 98735 101066 92489
28140 92489 85113 55929 23288 -31156 -38282 15353 19903 -332 -57427 -27153 29577 25313
28128 25313 6268 55394 40729 38696 56945 77431 92373 35546 9307 29834 -9291 -68621
28116 -68621 -129835 -112046 -67185 -17130 -9014 -31052 -32455 11910 -18274 -69733 -44146 -19336
28104 -19336 -79861 -100545 -35912 -19492 4856 12111 20923 50329 107019 53397 16908 -22596
28092 -22596 -33163 -33407 -70078 -59944 -20465 35428 112978 134036 128550 51999 9881 43257
28080 43257 76095 35945 27157 35127 33080 -19269 -26055 -30954 -37220 -30853 -31945 20598 10114
28067 10114 -1414 20895 53274 67971 27714 -22272 -18110 28744 -22228 -24490 -21212 -3294
28055 -3294 3898 -51082 -48891 -34836 -37321 27194 -10770 -25843 28155 14995 11398 -35797 -38025
28042 -38025 -88813 -141876 -63962 -21411 -15250 7304 5241 -6937 -6161 18518 47408 35613
28030 35613 -27019 -47709 63341 57223 43682 27659 -2743 34543 48032 -38731 -71432 4117
28018 4117 60964 65754 58610 43892 86203 74589 81335 73720 118506 88023 61674 48330 460
28005 460 -19083 -50458 -21425 -4554 28605 47968 72579 72906 101281 43130 9323 -24462
27993 -24462 -41781 -21401 -26759 -49973 -30377 17907 35927 -53124 -65752 -80274 -46016 -1
27981 -1 -2856 21498 37280 58045 36310 -29335 -30226 -57716 -78568 -79229 -78891 -47551 -7202 79357
27967 79357 77771 59460 44647 64146 61484 29571 36864 84183 75242 64936 55356 57929 46023
27954 46023 -10627 22732 22512 22634 23527 -5033 -36772 -36570 -11949 -38520 -41140 298 53915
27941 53915 96957 123580 124429 125032 40237 10644 -30574 -58709 -97093 -65359 -33262 -18943
27929 -18943 -33752 -47160 -13919 22163 4719 -32797 -11430 26117 -1553 -38694 -12493 -13628
27917 -13628 -17204 -8205 22038 60591 16521 16474 46400 74038 68587 46721 73844 63999 60895
27904 60895 64053 32281 -18899 -27249 28499 59465 13583 -1567 22157 2950 8339 32220
27892 32220 81392 78554 60700 38598 30381 1809 -38486 -81143 -64213 -32252 14381 46440
27880 46440 23793 -12489 -8993 -6255 24555 42540 29735 36070 233 -9965 -47830 -42548
27868 -42548 -63740 -27576 -1730 -22002 -79944 2165 30241 31284 8371 12368 6228 -39226
27856 -39226 -49359 -98500 -81703 -67875 -17510 2314 18226 8858 62520 57107 -8573 -46706
27844 -46706 -35528 36462 96035 46203 29 -25869 -51988 -91349 -93255 -42883 -25124 -29463
27832 -29463 -41656 7058 1309 -16514 27483 34319 59324 50437 -55035 -88099 -62401 -2593
27820 -2593 29142 13953 17855 15004 -11998 33736 58102 9884 -28836 -5556 -22420 49868
27808 49868 95360 71379 65721 55535 8655 26066 10840 29983 23650 10167 -47986 -50996
27796 -50996 -44067 -39805 -4222 29230 -3577 -12058 -34705 -20214 -11081 -44478 -74284 -62549
27784 -62549 -99853 -70609 -18526 -20596 -25529 -71269 -48200 -35776 -14530 -30706 -17484 -17397 -5837
27771 -5837 38684 47308 9278 -25225 -59194 -46637 -2809 5062 33909 46017 73819 89617
27759 89617 98468 107881 84758 2564 -59374 -10825 337 39584 77452 107748 90893 76863
27747 76863 69498 -19717 -6734 93728 126534 78756 11363 18607 53901 17457 -2018 33392
27735 33392 27710 25330 9343 -2553 -11745 -51017 -9104 45457 101980 78800 -203 -37052
27723 -37052 -55101 -39075 -80008 -108525 -38967 -16958 5377 -16895 10681 25995 19664 8813
27711 8813 73093 33803 -26007 -61616 -109335 -93142 -86449 -43298 -27 15820 29453 1886
27699 1886 6778 -9398 17693 31099 28131 26899 55026 57506 23368 4074 -16686 14354 48761
27686 48761 36219 32867 -16042 -6415 51041 29486 11484 37786 17483 -44382 -84183 -66712
27674 -66712 -55344 -16678 23538 71181 50681 -35824 -94561 -74500 -31091 -40172 -40289 -19103
27662 -19103 -818 34562 61611 59714 65423 8462 -28584 -5303 -18787 -26627 -24525 -51903
27650 -51903 -46272 -36015 -39228 -52308 -42207 -20903 6573 -44668 -103620 -86851 -60155 -34453
27638 -34453 -33490 -27950 7660 15769 25387 23677 63705 37894 -4016 -29692 10707 12484 -33441
27625 -33441 -7846 -28280 -60216 -35957 -14043 -35844 -1207 24537 19738 12188 17785 15322
27613 15322 -620 -12198 -29480 -12798 -1480 -31717 -65759 -60884 -22213 33150 30756 26983
27601 26983 -41510 -59651 6796 14596 27004 19386 -26687 -29003 25020 22159 -36040 -11174
27589 -11174 74451 40062 -15076 7176 5572 -19119 -53960 -44619 -37380 -26360 -29631 -10382
27577 -10382 -77185 -70045 -27702 13560 1379 -12513 -26119 10541 14686 -30953 -69701 -72054
27565 -72054 -1477 -8643 -81075 -39918 19765 74181 60056 25796 13154 18852 -7363 -24860
27553 -24860 45135 22395 4317 -30663 -43553 -53532 -42823 -37588 -38221 -12784 -26533 -46147
27541 -46147 34312 89112 72384 23974 35869 -25069 -38620 -10648 7328 39995 43176 36111
27529 36111 33027 23729 12175 4161 16755 81527 77420 44976 23859 36825 75899 38631
27517 38631 72119 57164 43645 58088 12492 7401 -12790 2658 25292 16965 6059 29716
27505 29716 53716 17367 -13809 -23764 14325 48313 43921 32806 25296 -2105 4351 10972 12891
27492 12891 453 -116 -32116 13223 7693 3456 -35204 -20366 -21073 -118 24544 6950 -27800
27479 -27800 -26791 -34343 -118614 -159449 -126653 -95682 -67847 -34348 -20263 -42896 -61442 -21992
27467 -21992 41541 71011 101859 59062 79677 63656 -31027 -49483 -40019 -10482 -21489 -674
27455 -674 -18239 -29747 -64265 -56746 -33036 -50724 -60633 -84949 -40443 11096 32740 23756 -11527
27442 -11527 -21190 -15955 -22174 -4650 5256 -5660 12086 32217 28375 45892 41491 1822 970
27429 970 -23715 -37842 9658 -26475 -81688 -88947 -113968 -90470 -104153 -100531 -65196 -40144
27417 -40144 -56218 -62778 -41651 -61567 556 -14053 -23860 19718 58776 39266 -9780 -2285
27405 -2285 -4980 39444 45641 54506 26372 -20783 -29769 -45807 -44889 -13622 -33539 -31025 -41407
27392 -41407 -63677 -62329 -77782 -97323 -34619 9861 -6105 48666 76385 90639 76536 60845
27380 60845 81685 90910 80357 33069 51306 26199 -10641 -11906 -10250 -6626 -4558 650 3179
27367 3179 25377 54167 48538 23101 30464 38431 74659 92364 103871 68286 15420 14383 48340
27354 48340 68247 101833 88668 98461 74991 36608 11879 19490 18140 -4560 -28799 -25894
27342 -25894 -44924 -65658 -77514 -72501 -33696 16987 2623 -18273 -19761 -66516 -39288 -29989
27330 -29989 22379 59104 42668 1214 -14859 -37322 -66020 -47226 -13134 41749 39178 7027
27318 7027 -68217 -37897 -11888 -15539 15420 -36265 -36110 1451 11055 21948 -12830 -15497 40750
27305 40750 -6261 -59642 -48513 -60063 -66590 -60767 -20132 -18486 26836 48029 53922 42729
27293 42729 55165 62050 73472 93999 57534 6813 -14892 14032 37968 13308 -21475 9652
27281 9652 58073 51702 3871 -22714 -5341 33331 -24840 -79045 -79386 -54598 -74681 -52255
27269 -52255 -45737 -44090 -31796 -36790 -34993 -10079 10437 -39239 -44671 -1492 15358 44522 42388
27256 42388 43386 87506 68299 61755 73496 44665 -23811 -54741 -48196 -19442 -4952 33632
27244 33632 87885 87373 92259 72479 48106 56563 53516 40088 1676 17245 19372 11734 26614
27231 26614 2017 40020 65864 69592 86664 62215 3154 -22286 -11573 -21686 25093 64155
27219 64155 67187 34337 15577 13399 -11167 -18130 29502 72637 84737 16254 2125 12524
27207 12524 7542 33395 66981 90949 55071 26666 43465 38952 18432 -35461 -61076 -87611
27195 -87611 -109926 -109844 -99193 -47706 -28901 -92765 -103238 -71543 -30832 -61350 -79516 -81629
27183 -81629 -75112 -30053 11543 60204 90788 101299 104585 49504 -20627 -25952 28774 44130
27171 44130 48089 13041 5287 22903 -30049 -40270 -11141 37792 30743 66521 119336 95012
27159 95012 62321 43785 20599 -27029 -74776 -91519 -65693 61197 62146 -15206 -20133 25441
27147 25441 55697 31451 -2773 -23028 -28548 -10945 8446 65026 89981 106837 139775 134968
27135 134968 42092 -12953 -9462 8398 19632 20028 13518 2184 11876 27086 17250 31400 29130
27122 29130 21961 -55501 -94255 -58190 -49620 -6314 46823 83922 65172 1980 -59457 -72739
27110 -72739 -14973 -4281 -10915 -15196 -26355 14981 6025 -11630 38329 56485 35753 14117
27098 14117 14241 -1580 -14522 20841 90082 90707 31320 -27022 -62192 18496 36293 40119 3673
27085 3673 15931 78576 13240 42516 87941 72677 53337 78248 98919 42119 30371 68707
27073 68707 60812 106401 108870 18296 -43253 -29960 10196 49041 26937 38315 17809 34937
27061 34937 -21246 -36596 6261 34033 46641 66745 75274 64012 56832 48174 47840 -7288 -8352
27048 -8352 44719 58459 18631 -38091 -22698 -8219 -47534 -38079 20782 17786 8168 13977 -22007
27035 -22007 -78881 -64615 -45612 -83508 -100961 -74768 -47936 -52984 -32813 8152 34625 24823
27023 24823 15848 84505 73729 29395 77485 93351 59634 -10352 -72993 -114490 -103589 -43033
27011 -43033 -19026 -45077 -13420 -6785 2322 30776 49589 2272 -363 -21327 -71177 -109264
26999 -109264 -100159 -103033 -55385 -26322 -23383 -39484 -1052 23478 32656 4066 -40835 -59111
26987 -59111 -71409 -46724 -2989 28711 4835 -4294 -5475 -10866 1555 37523 43494 40945 8606
26974 8606 3535 -17648 -42780 -59620 -19990 15272 33626 12534 13445 -695 20710 19639 -27011
26961 -27011 -62583 -81775 -102015 -64518 -26911 -33828 -68989 -21564 -41207 -78314 -55799 14019
26949 14019 78424 52613 2271 -53237 -36228 4053 -25791 -4946 -8560 -41857 -31857 -10253
26937 -10253 -19678 -16362 27330 50593 -452 10938 25879 16244 45685 96619 69881 -2673
26925 -2673 -35699 -47306 34427 36968 72893 72767 36117 -14532 -91774 -67324 -50787 -76753
26913 -76753 -87774 -55858 -80838 -70682 1375 31621 1263 -10 26849 55168 57031 19060
26901 19060 21802 43683 49960 29624 7084 25045 67261 51592 14890 -17541 -47905 -60599
26889 -60599 -68246 1002 35719 12888 2226 4736 -45040 -75208 -54867 4467 45145 10341
26877 10341 20353 -19469 16259 25076 15873 59857 99879 60340 26996 21222 41356 46556
26865 46556 64126 62965 24536 -21358 -50989 -37875 -23813 -52112 3511 64046 45788 -29610
26853 -29610 -54776 -62392 -6143 41608 39962 41642 6757 -36978 -8464 28269 9738 -57393
26841 -57393 -38951 -31748 -43172 -35067 -57868 -56269 -33891 -27398 -23960 -67541 -70563 -82556 -38325
26828 -38325 -15935 -18513 -46662 -19603 11060 61859 67618 99320 90852 59950 29913 1157
26816 1157 -1102 1227 25953 33782 33962 25801 -6594 -38473 -34839 -7272 25851 8771 -16976
26803 -16976 -43785 -87635 -29619 -37715 -73710 -90239 -68403 -45229 -23009 -17090 -45665 -62097
26791 -62097 -29851 -34998 -15888 -19960 -49520 -102504 -130275 -47745 14235 -8272 -12600 -1359
26779 -1359 16902 45140 13973 2138 50768 70661 91663 74867 27103 24193 -10747 -60277
26767 -60277 -18863 42036 27363 3250 -42849 -93739 -68571 -49739 -25525 -11521 -13499 -15651
26755 -15651 18335 35818 34293 35486 22859 19916 35284 65450 70657 26209 -69545 -96018
26743 -96018 -48587 -13479 -46242 -52756 -25055 10736 31455 21262 14761 -14468 -69495 -40835
26731 -40835 11536 52483 75551 101970 92470 59402 63035 69535 57031 28498 12585 26188
26719 26188 18704 -27701 5752 42520 -16072 -40808 -19743 -20803 -33186 -23751 -610 27351
26707 27351 24555 30734 5767 23319 5952 -8621 13969 -32816 -45938 -6170 20296 -782
26695 -782 -2296 -24966 -32770 -32250 -16208 -8185 -42138 -72081 -62124 -55443 -49946 -39945 -9254 38353
26681 38353 58169 46346 26214 48122 63622 113245 99170 83819 115514 90148 72397 54243
26669 54243 73567 49318 16533 41326 32745 5070 -53105 -64784 -12818 21314 3570 -23356
26657 -23356 676 47869 112441 116147 93597 57208 37318 30040 67687 81791 64038 61469
26645 61469 56686 18163 38872 62097 81431 56147 8218 -47775 -15457 24367 984 -19543
26633 -19543 -35884 -30646 -30061 -54515 -52938 -40245 -44932 -54089 -36604 11210 5465 -33971 31336
26620 31336 29574 21756 -33600 -101434 -65856 -50601 -12856 -47075 -59345 -14024 -19153 -4660
26608 -4660 48235 45249 46209 47691 45212 18376 -24844 -12351 -30909 -10361 -32906 -28144 32397
26595 32397 26795 14689 -19530 -13883 21323 6881 23498 59441 70733 72131 56963 29573
26583 29573 -7728 -33701 -50696 -52551 -23472 12904 43015 31859 29310 53614 10794 -5909
26571 -5909 44013 51500 11653 -20302 16455 31812 5185 -62031 -86743 -43128 -13798 12078
26559 12078 23343 20614 39273 63819 69675 84160 49350 35013 22710 -24663 -31175 2973
26547 2973 9924 -21619 -70170 -81925 -49264 -20193 16053 50876 56412 36331 60861 75118
26535 75118 43737 18644 -10492 -64761 -76217 -45386 -41915 -83134 -115345 -110070 -91411 -74695
26523 -74695 -21607 10045 -18031 -47734 -65357 -70426 -50421 -7842 -19191 -16592 -48081 -86365
26511 -86365 -93073 -84310 -100230 -147917 -106498 -113688 -142663 -123024 -98792 -59416 -24666 4282
26499 4282 33641 7346 -15064 -70196 -119625 -95248 -58483 -27763 -30049 -80462 -92744 -82724
26487 -82724 -76395 15862 34138 -993 -73914 -115326 -129146 -84657 -62943 -50274 -32651 -22371
26475 -22371 -53340 -54306 -900 -4327 -13111 4853 7797 -4675 -36654 -10451 -10617 21348 41130
26462 41130 47280 46985 99403 116089 24850 -30849 -14412 29161 17046 -764 -4287 -40168
26450 -40168 -22679 -703 16610 -8554 -7774 -23174 -53452 -22211 16843 15858 26149 20054 27761
26437 27761 53778 52426 24821 -23397 -50670 -84315 -77845 -14976 3029 46134 52024 30122
26425 30122 28186 50529 36628 24233 -3410 13888 62359 28626 -37781 -70168 -77579 -26710
26413 -26710 -31908 29019 58403 56688 59228 90012 133244 188791 102452 63877 18238 2768
26401 2768 -34348 -59960 -37849 -9304 9662 16646 18957 30948 25617 18759 20349 21198 58868
26388 58868 -14572 -29994 -41002 52088 70951 49021 34763 24895 21574 48697 81979 80102
26376 80102 80056 10216 -5861 -24382 -53926 -47938 10385 11051 20160 39614 36962 25999 14304
26363 14304 -8541 -50139 -41294 -15841 29139 71009 48413 45144 60039 62352 42673 -15957
26351 -15957 8258 54418 64462 -16626 -104043 -110991 -70967 -53255 -66723 -75079 -23889 -55565
26339 -55565 -27415 38932 53245 34887 44974 43924 34200 37685 6281 -22094 4177 -3938
26327 -3938 -46644 -26380 -56850 -28922 38519 60636 77285 96143 75944 8951 -28096 -26290
26315 -26290 -49077 -14944 -44565 -46403 -21844 7980 38747 105695 123439 67217 37979 25586
26303 25586 12285 6675 -53551 -61574 -27985 392 -40702 -74375 -62356 -52625 3577 30092
26291 30092 -12570 -18198 -7903 -17311 19118 -11965 -30752 -8779 12470 39137 81113 53227
26279 53227 67317 73708 21860 -40450 -41850 -55128 -40749 -37717 -15254 -10662 -4369 19679 -1217
26266 -1217 -130 -47045 -65209 -40939 -35498 -20756 -18518 -20632 -74223 -41351 11064 81692 103161
26253 103161 67801 -22759 -51106 -39304 -24474 767 46142 60833 78220 87149 51046 -14984
26241 -14984 -29431 -3883 20096 68460 97511 34472 5186 -20135 -1467 54995 102517 107697
26229 107697 100386 30282 -57976 -64954 -67546 -1577 16811 26794 53594 82842 30010 35730
26217 35730 19084 -7200 -53582 -86901 -63616 -51478 -57115 -66626 -20846 -31834 -16486 27271
26205 27271 57952 18396 7882 43576 10616 -37320 -59141 -20383 5197 -6940 -36173 -9909
26193 -9909 15039 4132 -3681 -27720 -6337 44804 54386 26025 -18023 -47710 -1842 11043
26181 11043 43535 36373 1853 -37260 -12541 16682 29526 8708 -6877 -14756 3364 55116
26169 55116 -12625 -63190 -71406 -14289 53561 54077 34606 41454 48144 29406 42918 -7148 -31145
26156 -31145 16972 36217 8558 -26194 28017 44022 23722 -7115 -24765 40956 51247 39610
26144 39610 29750 13780 23362 14518 15991 20569 -12621 -7950 -25325 -60853 -75491 -38661 -16992
26131 -16992 3458 -2839 25261 55439 70590 58049 54452 98955 60783 23214 -17172 -19744
26119 -19744 15007 76804 58810 38083 15740 -58108 -53487 -14183 -15170 16146 45016 20248
26107 20248 -49771 -29229 -17363 10860 46526 61257 38136 54005 33538 65315 69053 40861
26095 40861 20065 7308 -13189 5527 26508 -1534 -905 66063 75264 67171 61158 26595 -22938
26082 -22938 12354 62881 46301 -6808 14939 73775 35928 11836 50995 90643 73022 18982
26070 18982 -53428 -51440 -39371 -44475 -22757 -5886 -31173 -17999 -72159 -103133 -98857 -56173
26058 -56173 -24889 -73855 -109377 -88615 -27094 12589 63465 90979 110186 62086 40410 -9584
26046 -9584 -7894 -34493 -42824 -972 19235 -12257 -43815 29185 95850 47056 5557 21855
26034 21855 12695 -1450 -1640 -9258 -46468 -83434 -16399 -12116 -36162 -22344 -30688 -33070 -24818
26021 -24818 -27039 -58551 -60321 -44470 -41790 -35538 -25410 9391 4386 -16520 -52390 -24598 -15954
26008 -15954 -17244 -20853 -36912 -14081 16865 14907 13139 12522 -34424 -61079 5612 21844 57432
25995 57432 53546 59436 70106 36207 27886 83357 81364 36554 35156 39869 4397 -19732 -17664
25982 -17664 -19420 20846 41869 28238 -18709 -60692 -45352 -32058 -51037 -41500 -25002 -28067
25970 -28067 -6397 46572 80970 75421 66101 82720 67198 20569 -11191 14125 49451 65316
25958 65316 86509 20053 24532 33232 49076 80830 43838 22767 11025 -13688 2965 38705
25946 38705 16212 -9718 -1286 -27565 -61113 -60046 -47569 -25017 30987 19727 16310 21168
25934 21168 31840 15013 29591 -19168 -39853 -57641 -51361 -71351 -56301 -56145 -18233 39268
25922 39268 55001 16393 -26479 -26629 25488 32217 14898 37711 66965 6395 -46251 -18203
25910 -18203 -19409 -5659 -27948 -102763 -166095 -136294 -107431 -106955 -85842 -79990 -31273 145
25898 145 36839 43653 2033 6776 69397 98373 102583 59910 23718 32565 10290 -41412 -48610
25885 -48610 -55316 -63597 -63347 -7264 -21578 -50027 -21012 -20370 -66236 -103637 -55527 -20314 17936
25872 17936 91753 138543 65685 42928 66445 7805 -43559 -68879 -72480 -87460 -75977 -37048
25860 -37048 -1093 43150 36938 -4923 -16978 -26517 -14624 -35268 -1915 30323 64741 24133
25848 24133 -38669 -55623 -1310 44148 22658 6139 55824 50863 35930 6995 38532 68660
25836 68660 66820 39230 12457 -7877 12221 22324 72214 77361 66252 106454 92147 39540
25824 39540 28627 44399 63344 55543 11916 -15941 -19953 -9129 75919 60088 44367 43419
25812 43419 12409 33904 7778 158 -23222 -61595 -82634 -35844 -8689 -25805 -14044 31055
25800 31055 48776 16870 4081 34186 88461 106136 84754 73231 35746 21199 -15168 4312
25788 4312 24330 6957 -10424 -25657 -50914 -89591 -53325 -15059 -12561 -26686 -1845 21560
25776 21560 23383 76682 59188 -2133 -38405 -25671 4455 19689 30765 -29084 -36265 -24710
25764 -24710 22708 57356 63648 50996 49137 77519 77830 64829 75581 -824 -19058 23
25752 23 18590 -50130 -122950 -121030 -82311 -19569 -24180 -15505 29585 3563 685 58711 65236
25739 65236 43630 13916 -44704 -66988 -76569 -76227 -37753 24064 67309 63303 37741 63543
25727 63543 80219 44172 22937 -20503 -52569 -14569 28380 64132 109623 73004 3128 -26334
25715 -26334 7037 61724 17141 -27157 -42238 -16414 -11813 -15759 -63435 -42471 -13544 -11282
25703 -11282 3741 22583 10603 -9082 19525 13150 -55019 -95234 -75195 -60949 -63726 -40012
25691 -40012 -5538 -220 -22767 -397 -1366 -599 -10898 -38383 -2191 40742 16587 -12622 -21511
25678 -21511 -61674 -94541 -79798 -83473 -102434 -88464 -39232 -28349 -68928 -53121 -30482 -5937
25666 -5937 17080 -4384 -17280 -67906 -76903 4296 47538 103603 62608 11083 1787 10994
25654 10994 30783 35865 28674 14301 46232 35113 68168 98784 107227 80713 47491 12032
25642 12032 6437 -10254 -68179 -89232 -48155 -40857 -22618 18042 37564 27737 6322 65703
25630 65703 94824 110374 106093 88788 58109 16819 -14916 -27175 -47602 -84163 -62501 -62782
25618 -62782 -78933 -76161 -84235 -77295 -41012 -14190 -50762 -87907 -65294 -65741 -37911 -1857 9376
25605 9376 -21640 474 -24366 -46915 -1122 6877 16560 -984 38255 26480 16833 8128 -34602
25592 -34602 -70953 -85805 -88679 -110225 -70781 -10275 -14301 1258 -6871 -64091 -109364 -74470
25580 -74470 -32999 -17687 -27572 -68861 -79068 -99049 -83618 -56376 -102614 -109606 -40000 11169
25568 11169 -13629 -35221 -25743 -7378 -56348 -68057 -8824 -16791 1468 31458 29296 13816
25556 13816 -37580 -62606 -2276 -10747 -74126 -69001 -26700 10362 27460 11369 -31024 -47277
25544 -47277 -9245 -1891 25281 6936 -4435 1166 25144 22887 -29156 -51946 -29436 -25182
25532 -25182 -41494 -24057 35818 72677 61186 -6385 -20690 -22821 -37685 -76611 -76838 -98061
25520 -98061 -79555 -67638 -52489 -45979 -51314 15746 61886 71592 64281 62170 30392 25925 46728
25507 46728 53974 27188 -23629 -1560 62955 120700 48009 1393 17254 -35609 -41033 31287
25495 31287 57669 16050 -25412 -22606 -22624 41279 30347 14456 -20217 -9001 -275 14057 -39001
25482 -39001 -93717 -97588 -108612 -110529 -81317 -41007 -40636 -27357 -8833 12924 44129 34984 9913
25469 9913 8134 36685 45624 71010 58928 51840 81601 57529 25839 51568 47795 48210 48014
25456 48014 30708 -10330 -40195 -78779 -119155 -95489 -6315 10805 -17409 -506 -32896 -70266
25444 -70266 -39635 -4609 10924 70 -52017 -48101 -41406 -16479 3811 -1860 -42433 -33798
25432 -33798 -21687 -714 12580 43020 21016 -9963 15600 19127 24861 18489 -6119 27869
25420 27869 79865 92454 61699 5757 -1891 22211 41448 28425 -14790 -70481 -44773 -25624
25408 -25624 -16818 -32540 -35846 -26301 -5262 24384 23683 21593 -28069 -30945 -52759 -95781 -62434
25395 -62434 -27713 5507 -29065 -26868 -17266 -43705 -109356 -148684 -104441 -38103 -57267 -79361
25383 -79361 -61688 -94817 -114029 -180205 -222622 -223196 -212138 -182832 -120514 -90721 -82741 -59433
25371 -59433 -43400 -41203 -42784 -11121 31609 31361 31901 54090 52941 42522 45595 36016 30154 -21172
25357 -21172 -16822 17738 35048 30671 -7766 -49140 -63456 -66118 -76553 -47668 -57548 -122956
25345 -122956 -92818 -24906 9398 20047 34299 25352 82067 63835 32455 -14366 -10425 -10793
25333 -10793 -30000 -9454 -2197 11750 -34814 -40954 -50732 -42449 42883 45855 -6658 -35684 -10536
25320 -10536 -56640 -86293 -129330 -145742 -58407 -15573 -1367 -1968 -44454 -22157 45643 34012
25308 34012 64149 79916 107907 100722 53023 52723 58007 47060 44526 80380 85121 67509 30739
25295 30739 25326 -12049 -38292 -17593 22208 41475 58193 92652 57440 9991 -6167 13704
25283 13704 11821 -3500 58747 93813 58241 41301 30778 43623 70352 59899 52422 20885
25271 20885 -16703 -65708 -17367 9614 25004 -25653 -18907 14040 -1395 -28402 -6146 -13825
25259 -13825 -37922 -57643 -55312 -75205 -47883 -14866 -54710 -60706 -12302 41308 4063 -35978
25247 -35978 -56672 -49470 -49016 -22461 -8147 -23461 896 -195 -759 22974 -51893 -52092 9234
25234 9234 -19399 2935 22474 45918 3740 -18968 -25027 -17473 7851 -16252 -15061 -55562
25222 -55562 -87155 -34883 5640 30635 95422 25852 -11435 -12215 -6929 -3021 -18887 -35444
25210 -35444 1690 17407 7272 -6435 -7151 -20416 -52372 -52303 -22661 -25104 -22072 -11804 12379
25197 12379 27125 29595 29798 18100 10950 3017 -29274 -15721 38144 21509 -4112 -17470 35
25184 35 21319 29426 22597 35070 44803 46805 53879 57836 60887 63086 -19332 -94201 -131575 -150046
25170 -150046 -77365 -21553 -13987 -41448 -27408 -27275 -1937 26733 5360 -27834 4865 21330
25158 21330 21451 14298 40335 44103 23928 -3208 -33135 -7573 -14275 39033 2054 -50364 -17545
25145 -17545 38112 28259 -46691 -66265 -24125 -8945 -50575 -51789 -48096 -41542 -46301 -55291 -75278
25132 -75278 -93616 -47604 -38889 -63932 -40911 -14282 -6690 -1803 -4463 -19869 10305 1657 -852
25119 -852 -30841 -102978 -111152 -89894 -32874 29637 44211 33860 28490 21553 21164 5462 -46425
25106 -46425 -34346 -13016 -21473 -37784 -23443 8319 16998 -37631 -9698 40494 30133 -2623
25094 -2623 -87286 -73214 -50082 -85311 -103612 -60949 -43878 -47176 -63463 -43258 -10667 -69937
25082 -69937 -68986 -25174 -35988 -52540 -31446 -18481 70042 108274 76448 41724 28235 52430
25070 52430 22245 -9634 -29859 -51325 -91059 -51191 -40197 -2676 56531 70304 84131 26696
25058 26696 -27167 -11771 14836 26426 80805 104528 90949 65332 36450 29134 68051 48495
25046 48495 7618 -13999 -37116 -61680 -63447 -2029 58482 39567 13889 -18124 4710 -15593
25034 -15593 -34060 -12381 -8830 351 23661 43860 6558 -31516 -68168 -49456 -56294 -48340
25022 -48340 111 3726 -13522 42512 74513 15313 32117 31659 -1305 -16479 -19778 12143
25010 12143 28308 5030 -6215 -6647 -8593 -11254 -13341 37722 102387 76665 51205 13470 15818
24997 15818 19524 19822 12478 -27829 -51455 7099 50116 44611 40354 99448 60795 9976 -13005
24984 -13005 1229 -4780 1127 -25827 -5709 47849 59951 46921 61852 95258 97135 62922
24972 62922 40584 55943 17896 24413 40034 34621 28361 28056 -7408 5129 25392 -487 -46232
24959 -46232 -44817 -22055 -40145 6450 42160 -6364 -65152 -98911 -58172 -6450 46942 10936
24947 10936 -7220 45738 93642 79651 38078 -18259 -22921 4015 37691 5567 5519 17267
24935 17267 15906 -3663 -43563 -30206 14543 19992 27471 16530 -35576 -56873 -78264 -59666
24923 -59666 -10364 -13688 -19382 -22686 -40210 -64407 -68917 -99894 -28484 42284 53860 22028
24911 22028 19775 -18849 -25747 -1886 -347 -27618 -71665 -77600 -53292 21254 97825 90082 76213
24898 76213 60749 65373 19623 -13903 21825 41647 19786 23617 78712 101873 55401 14969
24886 14969 -48542 -79819 -27190 19651 27971 11551 5109 18047 -36711 -100429 -112195 -96082
24874 -96082 -16330 -22561 -52762 -80137 -54732 -76461 -118864 -150997 -125264 -117352 -84599 -12791
24862 -12791 13806 -11641 -10502 -36312 -53265 -94482 -70952 -22940 -16812 9665 35395 26793
24850 26793 26407 6563 -6241 -41003 -35468 16641 49532 27382 -37404 -25748 16161 18456
24838 18456 -27390 -19584 -53421 -74446 -37679 -27547 -24574 -33479 -30071 -14273 18966 15141 -3805
24825 -3805 -15024 -36456 -20958 -20888 -48160 -15648 -50636 -70874 -44575 2096 16310 9125 -21569
24812 -21569 -22634 23678 46739 1368 -34011 -69277 -98354 -131143 -113068 -51672 -66978 -100301
24800 -100301 -91668 -47255 -26807 -53016 -25513 -22434 -42242 -70334 -15066 10160 -1810 -6465
24788 -6465 2954 8288 -11808 5036 53146 63913 9013 -9303 -14828 1995 -2166 35317 38658
24775 38658 41975 12781 -13658 -14769 -11438 30055 39104 11317 -1467 12580 34069 -3753
24763 -3753 -60495 -98202 -71973 -42683 -80363 -75762 -48259 -84832 -96886 -31036 -4365 -34198
24751 -34198 -36291 -21526 67507 99302 72769 82651 88924 40561 40641 55029 55657 37335 -9668
24738 -9668 -37745 -79794 -70272 -17875 -19005 -22105 -27141 10842 65704 41251 38648 15713 75184
24725 75184 117624 98933 20494 4815 -875 -28276 -30060 -217 25551 43569 -2916 -9954
24713 -9954 -5992 -38470 -102194 -143037 -90317 -19875 14685 -6688 -31744 -14097 45272 10671
24701 10671 27320 52191 41832 45709 22653 -5896 -3154 28297 26233 -20663 -9737 30410
24689 30410 4642 -53153 -98816 -129591 -155467 -151763 -166022 -126783 -52996 -27281 -10920 17406
24677 17406 -14825 -28904 -32332 -50316 -38883 1796 -19485 -46671 -25637 -58834 -29734 -6814
24665 -6814 17727 25368 591 -20740 -65171 -57017 -38476 -58164 -65869 -21122 10594 4816 -6061
24652 -6061 -15305 21936 43462 -9774 -53921 -7432 -30832 -26597 -7480 8560 -3299 -19142
24640 -19142 -1699 -61229 -62897 -22424 -28167 -46217 -28467 -31532 -17792 2682 40408 65029
24628 65029 56580 22744 13120 -9310 24992 -31526 57476 69242 37488 41911 69492 64375
24616 64375 52101 62525 53676 59802 29101 46986 49815 66458 61720 -14232 -85092 -78712 -35160
24603 -35160 186 -34131 -98164 -85358 -21274 7750 -7415 -33183 -10369 14502 -13973 14125
24591 14125 33302 33342 12718 14406 40037 16452 -8802 -2384 26974 7625 -31418 -57003 -12868
24578 -12868 -1999 24620 -60769 -101403 -95207 -117333 -118211 -96986 -46014 -22723 -50322 -27228
24566 -27228 17533 -41794 -35488 -14152 41811 35266 7330 -14198 12247 32532 25040 30911
24554 30911 -8303 -6432 -17443 -65533 -87198 -68299 -64667 -69620 -113795 -88248 -10960 20142
24542 20142 3161 -23565 9310 -27981 -73047 -27798 5209 36446 27905 5165 16803 -7404
24530 -7404 14116 63835 82210 69974 93426 93301 57021 -4676 -56702 -70808 -72657 -60536
24518 -60536 -39544 1918 -16097 -15048 28647 97343 66839 66686 27759 24074 59975 30657
24506 30657 -11253 8972 -2648 -52791 -72287 -77235 -55343 -45758 -4148 -18176 -1029 32732
24494 32732 28128 -64639 -87626 -83026 -55699 -63798 -76905 -55152 -187 14751 -34277 -73647
24482 -73647 -97320 -97605 -127493 -120023 -105213 -70992 -41565 -34201 -68586 -93919 -89566 -81317 -25670
24469 -25670 -17834 -7461 4268 -3567 -28560 -48413 -30223 5716 -16925 -76651 -86353 -92446
24457 -92446 -51017 -12509 -4724 28220 38549 11792 -2679 48601 81087 60455 37620 15107
24445 15107 30057 23681 -9120 -37758 -12089 2743 -7122 5618 -5309 573 22557 -22457
24433 -22457 -72836 -53681 31804 90925 81650 50321 5055 5003 -38179 -39630 -8804 57874 61789
24420 61789 13680 38722 11566 -51711 -49002 12084 43559 4820 -24452 -10368 30804 36368
24408 36368 -7429 -66352 -58140 -61603 -75406 -29872 -34088 -64869 -58947 -19015 -15486 -11597 -21307
24395 -21307 -30447 278 -3386 -11992 -8295 12384 33926 33636 8918 16113 -41287 -85768 -62820
24382 -62820 -63034 -42998 -28112 -32182 -22418 -27547 -43546 -6281 10727 28995 28947 -10289 -42919
24369 -42919 -35281 -20641 12176 44191 36640 -18157 17922 -5188 -38020 -43387 -26499 -39892
24357 -39892 -11686 31434 21958 7802 37923 12779 486 40015 1588 -11023 33556 53467
24345 53467 37071 -37504 -33681 29737 44370 33200 -10998 -48843 -29133 -10841 17240 9905
24333 9905 -16614 -30893 -23590 -17884 28113 -1308 30274 46906 29269 -8408 5258 54252
24321 54252 59836 76507 8848 -77552 -31539 4029 -2689 31405 42828 30111 -24675 -32403
24309 -32403 -24153 -27975 -41600 3978 -7810 -21421 -53094 -43765 -17423 -9621 -20940 -66168
24297 -66168 -140961 -130413 -85092 -37768 24892 88244 121633 116668 86035 73674 116280 84805
24285 84805 59943 60933 14138 4809 -3742 -20878 -46465 -60329 -68899 -50311 -55506 -59310 -83370
24272 -83370 -37538 19964 11802 -33076 -35384 -26647 -11493 -5544 -21217 -53440 -14311 32255
24260 32255 22470 -22172 -33003 -5239 -14259 3683 8528 28405 22600 592 -12787 -43410
24248 -43410 -56783 -60592 -76925 -125802 -88193 -60522 -37832 -23271 -37478 17759 35370 46412
24236 46412 60639 64184 99403 111863 80471 40993 74838 46297 -26302 -103151 -82063 -30241
24224 -30241 -1948 21593 53735 52839 31851 8045 6811 -4442 6324 -9811 -16935 1100
24212 1100 32725 38436 106582 136918 68578 63445 19594 24911 7335 -39810 -31245 -1116 -4228
24199 -4228 14221 35373 30501 -14220 -14865 -5337 -19533 -5339 -1411 57815 135817 82705 58978
24186 58978 50869 -7882 -64373 -60129 -24281 -11322 -21425 -23504 -55402 -25959 -19805 -25748 -87346
24173 -87346 -90814 -35582 -59281 -81872 -12551 70163 46088 240 1209 28662 68802 54231
24161 54231 47472 771 -46746 2239 -24552 -35091 -3438 9018 823 42228 -12184 -31530
24149 -31530 -27965 -12901 -17831 -2689 39406 28732 2112 -36243 -1592 -6673 -39718 -10434
24137 -10434 5742 5905 4667 94625 98068 108476 134814 79635 -5706 -21260 -2888 18642
24125 18642 22604 12575 -8727 -52437 -90872 -51479 -47564 -25270 14960 56282 24718 -21485
24113 -21485 -26048 42844 56143 44019 27387 11495 -13652 -16792 6969 51462 16638 -27394
24101 -27394 2817 11755 -11219 -19630 -36429 39967 75887 26064 29440 43123 27362 -50476
24089 -50476 -34205 -45254 -66976 21343 74342 34845 -6316 18734 4683 -4284 -16474 -57813
24077 -57813 -78601 -51147 9904 20787 12184 -30484 -115639 -115002 -52154 -38992 -8268 -15883
24065 -15883 -68551 -62531 -75138 -72828 -33309 -43946 -22811 18994 53259 34932 -6217 -21947
24053 -21947 -41878 1584 -28965 -38521 -40140 -33021 33985 29930 -20485 -2592 -18705 -36210
24041 -36210 -6820 24489 29933 20600 45646 27546 43027 50842 51532 22542 -53930 -31663 38320
24028 38320 57705 51614 25432 -47119 -41644 -23851 -6453 22227 19199 -13573 -30808 -29532
24016 -29532 -68276 -100508 -85807 -70665 -83869 -36318 48917 22654 -23795 24166 24406 35940
24004 35940 51107 58757 24961 -24345 -26412 -10429 11822 -32302 24540 56034 23680 16815
23992 16815 -24436 -45014 -51085 -83967 -101280 -83451 -68430 -19237 26697 -41737 -71128 -35476
23980 -35476 17588 10976 -67335 -107531 -69570 -51545 -34646 -40188 -63320 -69565 -77807 -61905
23968 -61905 -28827 2089 -7681 -13787 -17563 226 2281 -3536 9421 51061 36093 436 -7770
23955 -7770 -11396 -3103 6372 4465 -24470 -51998 -52334 -62814 -48761 -3337 500 -40519 -31421
23942 -31421 -13440 3364 -30885 -717 23702 5889 14279 58927 15348 4602 6529 47474
23930 47474 86470 42863 18880 65142 54612 -15606 -42994 -65262 -64866 -13592 11081 37979
23918 37979 -4320 -12602 3577 -47016 -75879 -75406 -32107 8667 30427 43081 52415 30191
23906 30191 13476 37063 39921 -3401 -33360 -23201 -17966 -74540 -139619 -127440 -67229 11535
23894 11535 -6212 -17202 -778 23935 31498 46129 524 -7689 -29058 -40621 -45655 -24183
23882 -24183 12570 22414 -15846 -47632 -88151 -67646 -31621 -14163 2360 39305 56498 58134
23870 58134 -33401 -12852 11531 -2622 17007 15766 -12467 9449 51186 56715 13119 -36535
23858 -36535 -35899 -14651 -29537 16481 16124 10692 14220 -8175 -21654 -65075 -32068 42041 10766
23845 10766 35677 51623 926 36393 59449 74815 33841 -4385 5958 13757 -2530 -34605
23833 -34605 -41131 -5831 46165 25131 -45253 -29529 -32727 -53876 -68259 -69985 -61533 -41661
23821 -41661 -31971 26258 26780 38403 11984 42299 9914 -32508 -23203 6833 55651 55036 -8296
23808 -8296 -17064 -17096 -114909 -108537 -102229 -97970 -60526 -26030 18801 -3066 2082 72620 70107 3783
23794 3783 -44503 -51800 -45096 -73993 -62670 -65378 -16472 -26613 -39101 -53057 1655 25158
23782 25158 15771 -5147 13583 58722 39672 24122 -26646 -65622 -66815 -78091 -84546 -62631
23770 -62631 -44710 -37334 -45298 -29556 22712 17083 -19810 -2806 -12685 -9133 -8151 4193 -27957
23757 -27957 2118 9386 26964 7829 -8248 -8567 -33296 -55263 -70818 -47942 3544 13566
23745 13566 -10837 -24384 19828 68676 22622 -2588 -6116 -17587 8283 -21725 -12540 -25912
23733 -25912 -28460 -253 20341 45263 50472 69804 43709 14418 -10107 8368 32821 13369
23721 13369 5443 -105 -8162 -33654 -58505 -37745 -7734 27617 -21598 -15450 -21910 -56902 -44341
23708 -44341 -29826 -52440 -82608 -65628 -11431 24513 29383 50247 57005 34351 25608 30526
23696 30526 80814 75468 34356 24873 2640 55396 60251 23335 11502 8188 -13123 -33488
23684 -33488 -2612 25955 -29324 -28150 -6076 -18358 -5735 35438 19986 6239 -35251 -44201
23672 -44201 -56332 -80152 -50486 -40405 -50100 -27828 -22412 -31882 -38628 -27223 38023 85545
23660 85545 87907 44874 5448 28465 -9570 -961 -17073 -34958 -30475 -22224 29895 27683 72888
23647 72888 112333 74566 65726 50679 40648 36715 16083 -7703 -10306 -47231 -78258 -101169
23635 -101169 -41594 -18943 -16910 40499 57983 46060 44644 38917 -6841 11758 35281 39911
23623 39911 2092 23801 6863 14978 38856 45493 54566 54160 -16671 -5645 -8579 -47148 -43331
23610 -43331 4009 37255 -3011 -11913 -8378 -22056 -38649 -4315 5630 -15035 -17778 -8250 -9146
23597 -9146 418 -9436 -16864 58376 83945 61879 -14227 -27815 -18757 22686 -13296 -51625 -40622
23584 -40622 -41419 -63515 -15495 2285 -62924 -58216 -8404 -7741 -943 18458 -27855 -69072 -131758
23571 -131758 -134752 -91126 -29704 -18065 -14555 2092 18986 61047 61653 42374 -7089 -30030
23559 -30030 -29767 -15790 -29559 1063 6473 -19503 -38181 -70233 -42186 -7962 27007 -10871
23547 -10871 -68913 -89224 -10096 -23833 -46601 -9805 -27561 -35228 -65257 -41173 -16310 -24796
23535 -24796 -20319 -41694 -64427 -55689 -33810 -44290 -17061 19784 41076 38038 -17404 -39617
23523 -39617 -33914 -63292 -75048 -55261 -32872 -10054 -23572 -35089 -21765 -6964 -23970 -14649
23511 -14649 -34663 -31813 -6695 -6261 -9770 -42970 -17776 9136 -7996 -13164 -23114 -21395 6209
23498 6209 47904 26612 -10155 -1828 -44197 -32220 -17724 -22154 -40800 16012 71980 4599
23486 4599 -55723 -29028 -11417 -33999 -69429 -34682 -12616 -41863 -46849 -27871 -20542 -13929
23474 -13929 -21062 19060 35213 -18629 -2608 72459 51060 -15561 -6501 -45262 -43637 -33739
23462 -33739 -70068 -62388 -77303 -72130 -13593 20734 49369 95178 88860 11625 633 13702
23450 13702 25704 38171 4318 -8906 22129 -997 -16993 -55815 -11306 -22258 -7090 23347
23438 23347 7160 -21092 -66180 -37881 -1526 -19745 -4094 5066 -25617 -25588 -44003 -37372 -28075
23425 -28075 -23293 23725 12838 2116 21023 12259 1396 -9265 -67698 -88035 -117710 -136114
23413 -136114 -167265 -124831 -52694 -55686 -40207 -46960 -90865 -85918 -133362 -106738 -39310 -16182
23401 -16182 -45647 -64154 -50112 -45457 -17915 -77448 -69936 -36154 -39377 -1627 44095 19874
23389 19874 -32705 -48622 -22318 3014 -38410 -90006 -87822 -82945 -73613 -24539 -71536 -54478
23377 -54478 -17667 21056 20874 -8739 61520 106588 85519 38388 30474 4090 9115 9802 60032
23364 60032 21998 15978 17262 38415 -5649 -31672 -15437 -18259 2389 4347 23416 7051
23352 7051 -33188 -35690 -47810 -20922 12223 -11353 -46477 -22913 -51895 -57431 -781 -36323
23340 -36323 -62649 -81270 -143880 -116772 -85436 -78664 -22973 39708 76488 34128 6839 18925
23328 18925 13637 3652 4902 -17923 -40513 -16260 9830 -7633 -5528 26444 18759 6722 3198
23315 3198 12062 13619 -12445 -2635 -14208 -24511 14018 45548 35242 19906 53449 38168
23303 38168 -33265 -95405 -77506 6462 16664 -37934 -33796 12083 18480 31854 16992 -12707
23291 -12707 -44692 -16969 3508 17519 3851 -5726 -12029 -41325 -31858 -26502 1557 55645
23279 55645 77041 52749 62376 29612 -26313 -55788 -10947 -21949 -374 14745 1751 -13993
23267 -13993 -43774 -17935 11658 3358 -38549 11478 28562 -5904 -11326 -15561 -12558 4629
23255 4629 21247 22409 710 -50269 -77772 -40185 6138 24744 5637 -33736 -69419 -42532
23243 -42532 995 40243 29229 -28110 -60141 -37712 -9913 -4803 7288 -33734 -37039 9593
23231 9593 -543 -7439 -19630 -27973 19950 -12243 -9237 -34519 -103067 -38163 -6212 -27091
23219 -27091 -33689 -23490 -2147 40151 23810 -11792 9370 55147 21826 14026 4612 -42420
23207 -42420 -38447 -2914 26422 -48716 -27364 57085 51984 40338 25782 21312 25641 44569
23195 44569 -6123 17077 45939 26869 12463 54800 91047 23842 -26635 -32139 -19821 -45204
23183 -45204 -99520 -99088 -84835 -99303 -92330 -62424 -55551 -57954 -32877 -30241 -52113 -53450 -27915
23170 -27915 -15606 -60358 -58697 -40856 -38386 -23821 -9539 -49531 -74135 -55065 14062 16656
23158 16656 28152 53132 22771 -4321 11901 6541 -24690 -67588 -73097 -98513 -91417 -51469
23146 -51469 -51847 -52270 -56636 -49578 -75583 -23520 20443 68908 17271 -63868 -76001 -20772 15884
23133 15884 2909 -59412 -53923 991 -212 -22932 -1119 9217 8205 -38094 -79996 -38874
23121 -38874 2500 15616 37076 47807 28413 40773 55103 15106 -20666 -13936 -50876 -115703
23109 -115703 -98753 -46749 -9174 11843 33354 30764 43049 31968 11619 58300 108612 115466
23097 115466 70495 21741 53958 43458 -45134 -74618 -72179 10320 86305 70835 67081 24669
23085 24669 1094 -39275 -36210 -73996 -41700 -29178 24146 22279 -26138 -30189 -50990 -60064
23073 -60064 -69546 -85384 -87376 -134507 -165077 -115019 -83159 -67007 -8629 51225 69107 31542
23061 31542 20177 39844 27552 19533 -44142 -75820 -19275 29431 41811 31624 56666 43160
23049 43160 29310 43849 67622 96842 81994 53647 4995 -6693 -9441 -16579 -31153 -38240
23037 -38240 -24251 -15437 -27726 17701 66959 67537 25851 -14539 -34761 -32937 -23887 -78803 -83032
23024 -83032 -35633 -4090 55769 19690 -48936 -29614 -23427 -16336 -24167 -11104 7198 -8958
23012 -8958 -47429 -100059 -129900 -56088 41473 32539 28109 25538 20853 38413 25166 -31988 -66668
22999 -66668 -32335 7617 11642 -54168 -110163 -126670 -61026 -62386 -88687 -62121 -48595 -17492
22987 -17492 23390 50280 89969 102432 59130 29117 38423 35694 31935 4148 -2569 -19714
22975 -19714 -51999 -97053 -50643 -17978 11456 16547 12281 -67131 -126649 -143400 -95434 -24162
22963 -24162 -1192 2655 -47099 -86735 -25693 -57145 -55218 -25696 -5437 -924 10569 23928
22951 23928 23473 50548 73498 51773 7006 42175 80292 6614 9600 8808 -50989 10585 78965
22938 78965 40118 -22320 -41169 -33992 -55190 -98160 -131459 -131256 -69879 -19323 25089 29859
22926 29859 77967 127557 115411 59592 -16208 -93124 -109430 -132572 -175142 -136898 -103809 -99632
22914 -99632 -71899 -23149 2042 -15287 -29739 -41510 -12505 301 4919 31091 19536 -21264
22902 -21264 -18626 -68712 -91002 -89905 -104086 -106578 -66918 -53802 -33831 6061 23512 -8512
22890 -8512 -62063 -80744 -1966 45572 24408 -5109 8184 9537 9764 -21728 -54645 -61641 -47773
22877 -47773 -3676 -13662 -7325 18644 33190 65846 41093 42160 68169 22556 -38985 -41061
22865 -41061 -30046 -27339 3 18515 13957 27192 37378 42822 34577 31129 33083 -38458 -32532
22852 -32532 12726 40471 55096 57468 46687 60537 86052 95487 49469 29117 31618 38424
22840 38424 30718 41704 28938 32813 34422 65306 60773 47541 17225 -5519 -14863 -44116 49852
22827 49852 65841 -2799 -15798 30800 38487 17570 58232 76098 21640 -37860 -58322 15104
22815 15104 52577 58427 -4798 -36067 -60090 -48943 -61416 -33136 -26800 -487 16809 45113
22803 45113 57094 8931 -6328 -7992 -9609 -39335 -83864 -40939 17847 65617 77447 51068
22791 51068 9176 -46441 -424 -4747 -25189 11840 14581 29668 -3568 -47778 -66720 18865
22779 18865 23263 3715 -46861 -61079 -49439 -29169 20721 27788 5993 -10903 -25200 7077
22767 7077 -9829 -48405 -66569 -101236 -111823 -33922 22669 -19091 -57192 -74806 -69032 -58478
22755 -58478 -40255 -28443 -42157 -61800 -86257 -83066 -5016 -20722 -56967 -30478 15686 -29237
22743 -29237 -21686 -41565 -32212 32984 4497 -22627 -59249 -26658 -25878 -64107 -69203 -41026 -22783
22730 -22783 3949 21552 40840 27151 -17651 -29749 -38995 4249 113678 99740 36842 -10436
22718 -10436 -10947 33568 38883 19806 -5656 10393 3764 -32075 -54933 -53186 8800 -13801 -74229
22705 -74229 -108161 -92747 -78642 -24638 14930 17163 33013 46163 7042 -25809 -46123 -31883
22693 -31883 -50721 -33178 -56426 -8435 12380 39417 40711 38908 78106 134844 109642 74276
22681 74276 66834 34118 -28118 -71351 -129075 -158588 -130444 -70682 -52011 -46658 -23559 -52623
22669 -52623 -46906 -66835 -64780 -70339 -74934 -6695 26873 4756 14000 18749 -52679 -56455 -69636
22656 -69636 -59447 -32579 -20505 16671 20469 3902 7216 -23226 -52995 -71303 -46115 -2841
22644 -2841 24304 14803 13553 -3599 -7924 2907 -40881 -81396 -70733 -101156 -103226 -85235 2339
22631 2339 66363 69049 57 -24420 10733 5637 -53785 -63541 -64231 -42886 22906 -3330 -9079
22618 -9079 55002 43341 28032 46395 37393 11395 11483 -1577 -14424 -13510 -2902 12737 24731
22605 24731 59810 9654 -37620 -75961 -106069 -62448 12908 47640 -36044 -80070 -38720 -40460
22593 -40460 -31808 -2148 -15892 -47926 -33793 -16918 9700 47953 43536 51940 5188 -18546
22581 -18546 -58303 -67969 -68220 -56856 -7687 4445 56796 89824 79902 48718 62 6789 -52971
22568 -52971 -59710 -35504 1796 5562 -12257 -28021 -33696 -2907 -22182 -71233 -70150 -34775
22556 -34775 25018 90143 75133 10475 -61833 -110449 -125521 -127597 -107761 -98700 -116308 -137167
22544 -137167 -104240 -15042 18062 -18459 -10905 -25429 -12675 335 -9289 2908 29646 526
22532 526 14723 49965 4095 -42049 -14100 14770 -6601 -20420 -21754 -13494 656 -24640
22520 -24640 -71590 -59927 -43748 -22040 -17842 23451 45370 27034 -7845 -7419 -42867 -77009
22508 -77009 -44941 -24763 4852 20320 44404 65911 67077 11684 7674 1892 32096 40084
22496 40084 42575 38237 -27765 -112375 -96439 -32428 14997 65 -5797 -11284 -44378 -49783 2937
22483 2937 58429 82014 43833 38095 59368 10177 -57135 -35876 -12940 -16227 -18912 -13605 29407
22470 29407 31001 38713 65444 106559 99325 98953 67957 19296 9293 -20403 -46310 -26895 1202
22457 1202 23700 5837 28464 48064 55414 6688 -65208 -62186 -17027 12375 22306 33690
22445 33690 24628 -40530 -39846 -7987 19045 31754 44955 63883 49407 2796 3462 -25927 -16816
22432 -16816 9904 30094 -2647 -7278 -12140 -9178 -22420 -4666 -32785 -12514 37206 76296
22420 76296 -5243 -28521 -54 73253 116096 95261 39988 17582 54373 92451 36778 15183
22408 15183 76527 112810 94570 104544 71050 20774 20715 -1798 20582 35036 20146 -13090
22396 -13090 -26515 -34144 -47828 -58858 -43903 -24672 33736 22177 -45734 -62766 13993 84583
22384 84583 109255 62831 30201 53699 3060 -8176 59588 63024 55724 18861 67074 66583
22372 66583 -10247 -9115 -17187 -11651 9785 16314 7223 244 13620 5343 -8578 -20971 15343
22359 15343 15250 68601 69570 58063 23682 -7311 -21177 -49898 -41640 4154 28746 -25006 -52465
22346 -52465 -60325 -1029 -9575 -54802 -35567 -4550 15862 37428 86617 121285 118019 32011
22334 32011 -8478 -22303 -29443 -40210 -53485 -68745 -79666 -44116 -11674 20346 33435 -9438
22322 -9438 -45852 -36228 16046 15370 -22370 853 19560 35672 49533 -1938 -47819 -71330
22310 -71330 -66680 -94527 -109655 -89745 -61358 -26021 32830 70197 28181 18452 71424 89992
22298 89992 80800 40437 11170 19076 36566 55425 86315 105257 63449 27698 -5835 -2491
22286 -2491 -37868 -47448 -35116 -18279 -6705 17026 60637 15492 -54456 -43166 -74543 -84413
22274 -84413 -86815 -55417 -28601 -51800 -52580 11686 27514 5487 8466 -2307 -7722 -35125 -51629
22261 -51629 -35925 -27631 -29043 -5650 2653 32005 18912 -3757 -11010 30333 33050 12383 -14851
22248 -14851 -1985 25977 42743 26115 9832 28428 -2637 -68487 -84883 -82967 -13972 29094
22236 29094 26235 40876 21429 9917 627 31681 59757 32466 1836 4897 -28722 -22655
22224 -22655 25475 43828 40172 34238 33604 -65 -31588 -28122 -4032 31984 72117 93234 113023
22211 113023 96594 71449 55980 42792 66512 70036 50271 22871 -3692 17223 22448 -1132
22199 -1132 34618 -11412 -21140 -75205 -43766 43858 15580 -23037 -13280 -8383 -26041 -36386
22187 -36386 11291 97411 109711 65797 18422 14355 -24537 -49199 -44195 -609 41018 11401
22175 11401 -17486 -55287 -52891 19221 25996 28617 111818 125998 73713 56882 66159 68724 109614
22162 109614 123674 74371 56891 13634 25799 22825 2986 -11537 -23230 -24732 -9606 15497
22150 15497 9512 -37442 -85828 -45094 -264 25561 41993 78527 87905 92799 84858 52606
22138 52606 58841 55985 -3790 -61589 -81398 -82331 -87326 -95454 -37994 -21769 -51224 -25985 10775
22125 10775 16170 28985 -35486 -85488 -87365 57 72538 20481 -35872 -23030 -21385 -73207
22113 -73207 -104152 -108252 -100563 -55054 -12887 -31756 34322 90249 88970 105279 129383 100067
22101 100067 96583 33263 -40357 -84898 -55230 -35204 -26183 38540 67257 30173 8274 -12654
22089 -12654 -891 -18494 -18196 -43613 -29780 6003 14285 -11660 -52958 -66772 -55642 -60912
22077 -60912 -40057 -46031 -56538 -36915 43172 24744 -20466 -44100 -13522 44060 73468 52132
22065 52132 46840 41039 -11322 -9996 20242 13822 -15623 -4294 25245 77828 120488 84138
22053 84138 -7743 -8635 17281 15957 -23099 -87086 -92668 -89286 -82316 -75257 -55205 4139 7702
22040 7702 -20810 -29944 9321 56784 34575 23571 -19014 -7563 30797 -1384 -13852 17435
22028 17435 108444 92468 48191 49360 48651 -8516 -68340 -26171 38050 31601 62154 20858
22016 20858 -10989 -20994 -32522 -34596 -46613 -69307 -46878 -35333 6037 53626 -2727 -80589
22004 -80589 -90189 -85315 -77496 -97537 -121366 -82310 -100122 -82211 -41750 -71206 -85366 -43744
21992 -43744 -30882 -1594 30623 20297 25564 20403 20141 43972 77012 1806 -22231 15937
21980 15937 47993 18924 -18126 -40602 -39196 -16730 -13672 -44598 -106299 -126013 -61618 16058
21968 16058 14343 6124 4948 -43977 -34979 -6508 15141 14303 70330 92935 51369 32260 8640
21955 8640 -23912 -42717 -29445 5904 -40066 -55411 3 19128 -14138 4193 38124 18028
21943 18028 12010 -41369 -83035 -83997 -68678 -34732 28541 75450 26233 -38801 -93443 -55377
21931 -55377 -38784 -17452 59116 88036 96766 63168 15455 48908 31412 63245 61567 75643
21919 75643 64813 40528 72448 82089 97855 54379 25676 20491 36219 33365 65997 55066
21907 55066 40303 39268 -16681 -54099 3630 47541 14444 54113 53014 -4413 403 14558
21895 14558 63866 72654 26908 29542 22538 45216 4394 -1823 29835 3118 13245 86685
21883 86685 96132 65887 45016 38180 30480 44383 20013 16326 18788 -378 -22629 -31543 -42319
21870 -42319 -11026 48055 14715 -50784 -106257 -81952 -40772 -35069 -41433 -59535 -101473 -93525
21858 -93525 -49793 -26193 -24679 -23211 -15384 -30171 -46508 -7562 -41615 -40638 -27195 -6123 -14697
21845 -14697 -6285 25094 42910 85966 62513 33941 9319 -9716 37279 60219 115173 120751
21833 120751 60933 21068 66781 32579 -45985 -43213 17959 46272 15769 23715 -1779 -19540
21821 -19540 -34101 -29087 -34754 -41109 -15302 16944 14911 24028 85488 116201 87378 90676 40017
21808 40017 -24892 -85372 -70091 -65500 -82207 -45942 -54309 -59857 -84864 -91544 -77158 -49470
21796 -49470 -13075 16083 27081 -1206 1869 10063 -20951 -3160 1676 8562 -6700 -19391
21784 -19391 -18471 -8793 32080 36619 5081 -30626 -62520 -46055 -62166 -45951 23701 24731 29264
21771 29264 -4145 -29953 -9615 25915 33682 61348 43242 -67659 -68645 -26571 -31583 -32269 -38019
21758 -38019 -303 -19444 5199 60885 64941 42572 22060 34693 -11177 -29466 -25052 -29725
21746 -29725 -11817 -843 -6281 25458 14415 5625 50697 51773 -56804 -82601 -59558 4455
21734 4455 18301 19152 27794 31156 13464 -235 -34891 -59188 -103547 -68766 -18171 45610 36474
21721 36474 40227 67372 53325 27256 12511 17399 12276 -939 -8587 -13075 -30325 -53067 -61743
21708 -61743 -73045 -69598 -9358 41979 46309 27856 47223 44252 27778 3854 -9287 -26843
21696 -26843 48376 86937 104340 31042 -35642 -31827 31068 10670 -56354 -8265 -2944 23328
21684 23328 -92 5587 25537 49769 13550 20928 10441 -34050 -3628 -10231 -29609 -18441
21672 -18441 -36568 -49958 -8720 -9367 -27739 -43467 -14970 -4083 22482 32362 24858 30817 62573
21659 62573 65112 41158 35302 67334 53377 24213 -25561 -20209 -5075 -30318 -61262 -23476
21647 -23476 77779 131482 144389 108091 82679 44296 32395 35331 -22391 -32441 -14711 -13739
21635 -13739 -10332 31895 26041 80125 120109 95590 62265 38600 38378 -5399 -84245 -102587
21623 -102587 -60375 21804 73073 24600 30061 3265 -36983 -14758 -14256 12091 32883 64397
21611 64397 109104 155054 128683 55446 11871 18081 -585 -2320 2488 10437 14995 -6804 -32679
21598 -32679 -71347 -24820 -12395 -12123 7607 -48866 -117920 -100659 -23263 21991 46480 9407
21586 9407 33746 25512 24038 59691 47362 -5800 -8196 25777 15779 47587 59653 6482 -19110
21573 -19110 29656 82988 66547 61618 71300 46731 26274 15825 15175 31599 14102 1056
21561 1056 31483 71898 65664 13431 -2953 557 -9325 23803 51774 110027 121106 61532
21549 61532 57198 62366 90969 96863 62824 79804 125551 153920 139193 78104 8461 14001
21537 14001 718 -14593 -16130 23258 53532 -22523 -54185 12678 104908 100469 96607 87473
21525 87473 81625 61143 72853 66291 103304 127316 95884 4234 13926 51197 40275 40669 37590
21512 37590 -18139 -36091 -32332 -46927 -70310 -8233 -32263 -20124 103932 109823 113859 43740
21500 43740 21213 42933 64602 52215 55890 55099 16224 31220 45103 35012 65013 85084
21488 85084 96009 90542 25687 -14571 29187 62358 31112 21548 81892 106050 100407 89994
21476 89994 46656 44841 40283 -30196 -43767 -35025 -6236 -9089 -27961 -171 -27295 -62860
21464 -62860 -52293 29044 62281 82244 60866 64867 1709 -28288 -21081 -60558 -47402 -68984
21452 -68984 -50487 -6780 21416 17839 19116 55130 15265 -51019 -80902 -36313 71838 80789
21440 80789 47021 39108 52992 99282 122091 132112 69680 65974 44397 78194 35312 26753
21428 26753 33743 22774 279 2705 8322 -5660 -30819 5730 76277 72193 58498 101232
21416 101232 125535 89946 -5223 -38220 16490 23366 27101 27794 23179 22448 68896 87398 57815
21403 57815 -52896 -78053 -15455 35353 34428 39598 64235 41936 59911 68704 42498 -26430
21391 -26430 -39322 -34244 -25134 24118 11381 -16900 -18741 81526 95172 19348 -18140 -15250
21379 -15250 6452 28705 82238 89023 51154 36953 77755 131223 70254 33444 6964 -37649
21367 -37649 -68970 -40752 -5634 17991 5986 46449 51259 36628 29874 4040 25989 25802
21355 25802 61648 50063 42482 25564 -3782 -871 59714 60331 32903 13494 52544 74589
21343 74589 97248 86843 83476 78879 73366 77425 68122 43942 18184 3494 34649 76642 48635
21330 48635 23064 -46168 -65757 -5037 -100 28753 11459 45957 44414 46743 76027 92525
21318 92525 65152 45294 73279 81359 59498 14337 15039 35765 36724 47823 35498 33588 74502
21305 74502 136861 142507 117424 59784 76083 67737 -12101 -7020 22197 -5703 -27318 -10829
21293 -10829 9904 -8215 60835 59662 12399 16362 73571 65783 46620 70165 74776 23002
21281 23002 -33964 -36540 37798 82565 63361 173353 272631 286541 367192 543133 674041
21270 674041 633220 445725 341136 363303 493003 775303 1098632 1307223 1139394 752729
21260 752729 509207 408929 365623 429312 555266 584757 602758 493250 363430 266026
21250 266026 153263 116590 129174 151402 119531 98792 80250 76533 103800 110541 80132 50612
21238 50612 43321 19462 -21647 1747 44609 52045 63016 106844 184025 196547 200068 270981
21226 270981 290129 326782 317975 291283 277943 229538 149902 141582 106085 112695 139850 119930
21214 119930 106140 106856 66339 56213 52112 49852 41610 23051 47783 53259 64110 60791 99586
21201 99586 54689 1657 4338 7311 -37207 -20330 9207 17597 14104 15129 30565 78890 85683
21188 85683 76323 57252 39552 86226 65481 24070 17724 90359 96807 42894 36971 67016
21176 67016 72382 38963 26165 60843 90780 54614 69574 40814 99660 154291 176815 131350
21164 131350 124189 138999 185607 165958 152321 136127 113478 133414 156385 158579 137506 145541
21152 145541 139685 121644 117172 66051 87621 125817 101292 65875 58412 249 -9529 35239
21140 35239 36846 10042 42083 99817 72494 97950 125516 72888 66625 95070 94284 75269
21128 75269 65479 96738 74330 61653 57599 47174 37381 69596 115342 131680 139749 120080
21116 120080 68248 18553 1921 -58856 16715 65245 65851 80143 116460 145053 106679 116689
21104 116689 103767 67173 61426 94026 132735 131496 139333 128048 132227 148058 62056 67585
21092 67585 87351 100112 166922 163630 125057 48431 8664 90659 124569 159309 154053 100221
21080 100221 26811 1392 28821 71119 98452 72487 93454 72326 139930 188197 166866
21069 166866 180057 178995 161738 157142 90703 61235 79784 73727 83275 91835 100510 122752 182191
21056 182191 190071 177265 125831 106126 83667 72022 76923 86483 134494 162549 182459 177066
21044 177066 139356 139421 136981 101428 94988 120916 112224 154531 173468 163443 174229 151560 92797
21031 92797 34063 58578 99191 102116 113338 163605 187838 162392 162514 192619 165773 216500
21019 216500 254843 203530 119055 126039 165545 171162 118235 59307 89420 120047 100463 78867
21007 78867 87159 131658 87332 56146 57313 100480 139693 135296 148411 140265 138181 91049 48278
20994 48278 68397 75084 39117 42231 3965 6878 96106 96038 99981 160825 140309 69923 101037
20981 101037 159803 163218 110127 125171 135932 145043 113758 125072 106984 120125 142144 155759
20969 155759 162685 160516 197716 225416 250145 198764 202495 252733 252775 223874 172075 153436 205841
20956 205841 214003 219124 179303 157034 141746 148854 161114 158671 129234 109059 109667 102714 87909
20943 87909 118452 144404 134238 172745 196275 168065 181129 259607 312585 292646 228832 169447
20931 169447 160710 171849 182429 191435 178948 182076 190469 209284 224793 248920 249285 220808 186725
20918 186725 177861 183820 183942 193006 192409 159002 197324 206095 270144 272814 259243 286447 266445
20905 266445 193172 158670 169601 175862 189049 231974 263926 261569 229457 183349 196555 241262
20893 241262 217462 192105 208739 150703 181620 201140 184734 201355 221776 211367 201756 194243
20881 194243 183840 204484 224233 213983 203795 196291 262973 293639 268157 258923 219011 232692
20869 232692 292113 314904 309390 262016 248363 221072 237927 315278 369962 372964 322670 282470
20857 282470 307861 316961 298736 333167 385577 386512 300190 231765 329000 424898 448159 445158
20845 445158 461660 448082 414889 446911 502632 559410 570742 618921 607839 619307 612768 580190
20833 580190 576928 615985 631585 515620 494286 545477 600284 608351 530288 507508 483012 455107
20821 455107 436303 445206 427452 420973 442585 430543 422222 470598 490698 523659 509274 530243
20809 530243 511495 491044 451437 434222 461844 433194 440837 409082 377608 379081 447796 505263
20797 505263 529759 544962 525836 521498 481461 533820 580003 534628 519975 494900 516541 510581
20785 510581 483933 547724 599441 617855 623692 590085 634203 696796 674833 709779 812761
20774 812761 827611 839025 798893 785821 752910 757265 777373 741773 773687 814601 865115 939534
20762 939534 937069 895101 928903 1022757 1096434 1136136 1194592 1238431 1278246 1297183 1301869 1350780
20750 1350780 1414788 1532089 1637295 1777830 1906948 2050608 2243398 2522525 2859676 3151388
20740 3151388 3280737 3318205 3379239 3589680 3968084 4606997 5477510 6220833 6407680 6367086
20730 6367086 6579544 7114298 7819122 9089427 11172664 13800588 16885613 21216580 28914169
20721 28914169 43855869 70231836 103518644 121597256 105663958 76879128 64447661
20714 64447661 69783449 94334513 141623682 198509890 222860192 185247498 124287253
20707 124287253 83775345 67321359 68262911 84790904 110716262 123852776 102556486
20700 102556486 63092821 37654152 25195513 18811455 14963117 12228198 10081411
20693 10081411 8263668 6773396 5710708 5074602 4819266 4794560 4552984 3829573 2962259
20684 2962259 2336932 2071620 1998485 1940675 1858608 1670377 1295217 896418 655009 564219
20674 564219 484521 425984 350346 288572 246936 201399 190666 156011 127470 109022 161513
20663 161513 150483 73737 43815 90993 128913 109313 47579 19652 36377 -19968 -30519
20652 -30519 -8785 -10613 3144 -345 12289 64279 39377 42072 17812 -47039 11995 66859
20640 66859 62383 23360 -26024 -24303 53883 65226 62173 64887 99110 190816 289481 331679
20628 331679 406163 593648 941798 1348143 1570730 1435824 1197205 1108827 1176147 1512617
20618 1512617 2076185 2678099 2926700 2516935 1794589 1273320 1089175 1136464 1315507 1516875
20608 1516875 1520268 1146376 751344 486579 317485 181090 116975 62981 2818 -29364
20598 -29364 -20642 -34809 -7024 -27267 -67772 -87363 -91455 -85539 -114509 -158073 -144170 -98384
20586 -98384 -104373 -158870 -159962 -138794 -156053 -125654 -84835 -54850 -55347 -88025 -91481 -79682 -87712
20573 -87712 -99265 -61026 -34789 -35998 -81702 -100694 -134972 -167148 -159182 -115096 -102214 -116568
20561 -116568 -142754 -141218 -100128 -82325 -69094 -120484 -138612 -115849 -129776 -70428 -11475 4440
20549 4440 3337 -18906 -81284 -149861 -145044 -135961 -116687 -99742 -124441 -127775 -81393 -35113 -75437
20536 -75437 -108837 -47862 -17537 29530 31661 -22978 -55634 -78011 -78658 -106424 -98671 -56232
20524 -56232 -81131 -121186 -110697 -102014 -38661 -10816 -24386 -56360 -125371 -164638 -151083 -137544
20512 -137544 -124564 -69955 -77765 -91371 -91703 -128130 -126019 -67298 -62899 -48631 -8591 -13510 -96805
20499 -96805 -155335 -145998 -67402 -48676 -25635 -17427 -47599 -122677 -51486 18477 29870 -23402
20487 -23402 -40488 -19214 -68273 -132160 -104993 -60186 -126482 -165224 -102009 -84429 -84917 -68637
20475 -68637 -49033 -17332 -62874 -100567 -80492 -62703 -70980 -74831 -51086 -80025 -90249 -33968
20463 -33968 -17452 -24656 -24665 -18731 -52333 -94314 -143838 -112135 -79319 -70346 -37825 -77855 -130882
20450 -130882 -195059 -188156 -147943 -93227 -84715 -81007 -116740 -75977 -3510 -48130 -120207 -107175
20438 -107175 -53091 -6461 -19221 -51337 -30369 31706 26602 19874 -5542 6908 69071 58429
20426 58429 30141 31561 34210 38254 86211 172924 192482 238095 242102 191947 244014 358452
20414 358452 401544 379313 369519 368671 382282 321073 262256 181459 152278 199294 216324 200203
20402 200203 162098 106888 103493 62913 30445 -8182 -55899 -97062 -48765 -42874 -67813 -21788
20390 -21788 -37609 -12576 29756 1015 -51411 -90474 -145284 -130502 -121619 -91035 -131742 -157929
20378 -157929 -153864 -118775 -113223 -92687 -77486 -91759 -67194 -65965 -93744 -113484 -146830 -183438
20366 -183438 -112976 -83440 -24512 -49149 -84816 -63802 -56926 -52125 -3661 -3039 16375 22850
20354 22850 -19089 -31008 -21183 -31078 14399 3570 -6410 21460 73895 75683 113206 91193
20342 91193 35362 8428 31447 48503 66024 113959 82188 33056 10024 10894 -28519 -38078
20330 -38078 -80539 -86020 -40001 25492 66888 14693 10516 47573 77528 81777 67773 27535
20318 27535 14785 -24303 -2286 -32898 -47025 -58958 -65082 -38633 -56046 -106266 -112833 -83109
20306 -83109 -65926 -71388 -44905 -12239 24993 46781 40772 -5607 -71172 -56546 -38923 -39181
20294 -39181 -17822 -1919 34022 39815 43659 33966 67935 71746 84201 109350 77037 35710
20282 35710 78879 112549 117200 90473 40604 -231 -23462 9094 -20871 12354 50065 3000
20270 3000 -19704 -8165 -5034 19289 -7319 -36671 -9690 46498 58261 56783 64964 28350
20258 28350 47992 54078 29036 -1664 14093 -15081 -55393 -47697 -58720 -62075 -36901 -44569
20246 -44569 -77729 -86470 -103756 -154314 -182146 -135534 -41180 -25925 -31534 -83098 -99894 -87232
20234 -87232 -62007 2105 -510 -19656 -66936 -88675 -54573 -45217 -57963 -50044 -108153 -139853
20222 -139853 -122179 -95483 -103690 -146458 -163037 -136654 -105376 -95231 -106256 -99959 -113582 -134423
20210 -134423 -160738 -146453 -64239 -86586 -85427 -106095 -113009 -119432 -52017 -14988 -70947 -69416
20198 -69416 -56221 -50929 -71700 -71477 -72194 -126932 -135752 -122142 -45292 -1876 -18161 -41454 -70542
20185 -70542 -54331 -29742 -15144 -34596 -9246 -3015 -45880 -44697 8289 20218 -1067 22031
20173 22031 -83586 -94194 -33099 -10416 -294 34735 54563 98870 173594 188011 250579
20162 250579 346946 547828 658904 653712 505421 409702 406185 492985 695877 929960 1049726
20151 1049726 884547 671197 443027 310116 362619 453277 512640 617897 592694 415340
20141 415340 287267 175592 92032 66136 72787 69024 82213 29457 -30159 -17093 10828
20130 10828 46624 17605 21912 32575 48486 38311 47802 20645 -18159 17497 59123 38155
20118 38155 2065 11548 -14641 -30431 -8447 -22632 -46376 -60924 -60914 -64114 -72959 -66099 -51442
20105 -51442 18289 98059 116706 101894 70968 25634 12668 43666 45832 35116 31134 4795
20093 4795 -84454 -139286 -106908 -62339 -37286 4357 -5527 -22788 -27843 -1046 7381 46599
20081 46599 77604 53373 48318 11819 31275 45959 35458 15271 -9797 -27198 13361 25421
20069 25421 69096 88547 8830 -32824 -38907 -70552 -23395 54714 82039 43157 55746 71782
20057 71782 39735 -17016 -74827 -123852 -125322 -68323 -88345 -94467 -77112 -76951 -64646 -82083
20045 -82083 -68400 -70797 -90146 -45861 -20150 23305 29570 -14138 -35055 -8810 30282 48317
20033 48317 18663 17925 -1096 -55784 -21335 9646 -15718 -97503 -58762 11293 13408 -25620
20021 -25620 -17845 7963 33133 16084 -10244 -21325 -2956 -32256 -62919 -56271 -37109 -51594
20009 -51594 -45974 -27090 -66350 -56954 -24613 1950 20161 -7265 16843 34293 31411 -14337
19997 -14337 -15776 -11839 -42943 -83875 -138246 -157568 -150923 -112944 -87605 -85594 -98015 -86523
19985 -86523 -90096 -73993 16213 43859 1987 -4311 5782 -8468 -3734 2659 -33407 -54223
19973 -54223 -23615 28863 50310 57581 84417 43532 21430 47993 90237 106431 94987 86771
19961 86771 118220 148351 105872 69123 11201 40174 27338 -5216 -2839 15743 27951 91490
19949 91490 132320 115291 123334 106693 71824 53444 22495 -2796 -13565 -36525 -329 69452
19937 69452 86185 107194 111498 45775 21823 15821 -15435 -40802 36701 42921 28035 -9698
19925 -9698 -14413 -19542 27707 27215 20863 37620 9593 11818 32472 -23440 -1176 -38224 -71269
19912 -71269 -31062 -11362 5654 8117 -31558 -16058 52649 71701 95333 74815 61539 49273
19900 49273 25149 12273 -6981 1557 -26771 -53918 -92755 -97887 -101521 -64755 8589 -11324
19888 -11324 -18317 -22639 -37043 -22560 21902 29254 -4915 -19546 2710 49933 105209 120567
19876 120567 87679 63919 55183 17878 10578 28030 -27881 -28711 4339 -6642 27524 45497
19864 45497 77515 101221 136853 154049 109137 98141 105240 33961 5339 2666 10515 15901
19852 15901 1570 56106 44817 31308 73830 166233 260311 442796 615545 641193 485485
19841 485485 374757 356476 368254 491482 623022 590388 418948 270442 185638 133858
19831 133858 43189 23938 47932 71782 72986 54920 57333 94790 127383 164704 179656 194313
19819 194313 186497 154963 91923 53918 39760 47447 55418 52618 53727 136710 199455 354363
19807 354363 516213 591535 600729 453101 250641 195038 172428 236426 274993 340898 528646
19796 528646 613523 489180 319284 248126 228654 192319 131949 137314 217696 278328 425531
19785 425531 622076 791238 811054 607767 444911 431353 500841 618801 712239 612048
19775 612048 376049 200754 115589 57501 44416 77421 101791 75008 33758 23669 36286
19764 36286 30807 70172 87529 53140 31326 24996 41121 27272 16073 41911 94948 134774
19752 134774 151685 147808 162565 206626 327228 493062 650100 670205 515198 346305 317645
19741 317645 266802 227341 301945 440199 584499 697503 680811 462266 312682 235275
19731 235275 128910 131051 145860 93500 40013 46774 81557 89087 57254 39635 37508 16865
19719 16865 -46759 -70332 -43755 -7037 20525 61094 72876 19332 -7630 -20179 -20709 -46193
19707 -46193 19269 97057 99466 77591 90069 23599 48428 58667 23862 -20235 33944 109197
19695 109197 73648 15972 -4439 50126 119238 110711 79232 88785 49336 63123 32113 -10157
19683 -10157 14468 -27344 20090 3891 -922 -2897 44555 28660 -27051 -19301 2613 5746
19671 5746 -7418 50848 140870 155158 174679 130655 61642 -3332 -831 63891 103724 93543
19659 93543 65508 60010 44656 61978 92363 71160 33787 34441 60647 39357 29054 10274
19647 10274 48755 77221 35210 45937 28520 17947 32199 -7230 -49481 -47968 3178 29508
19635 29508 45865 105309 144966 119022 83753 114059 75896 74658 84752 81188 68895 76665
19623 76665 96537 66352 53944 59048 11096 -14103 -17332 -1289 59264 52164 222 -44149
19611 -44149 -32594 28160 107062 138082 126239 122880 106900 113223 111429 102274 124948 169296
19599 169296 155476 142520 122014 121880 113097 97539 72102 49058 77089 145428 84466 28891
19587 28891 4841 -16009 -10372 18614 1628 56812 17317 -7286 63734 112987 111245 105697
19575 105697 80163 69580 -5503 -75433 -80300 -76023 -41367 71934 127440 141114 146467 128869
19563 128869 106909 144477 159085 166569 111932 91526 87150 102737 98763 87503 43108 28497
19551 28497 68066 108726 96023 95372 119690 97725 88229 69624 68070 76032 44033 57365 98270
19538 98270 115715 112797 101416 75154 31620 980 41105 103784 116001 80200 68321 96749
19526 96749 84441 60602 52049 58442 50073 51564 115628 162359 123759 88293 125382 152615
19514 152615 119080 130098 105244 113378 153211 177096 190635 243665 273282 238052 239161 272693
19502 272693 255392 218130 188510 188322 250695 277401 257933 214705 158512 128383 159250 238660
19490 238660 268169 341272 446639 503698 419049 268439 188069 162529 236081 286782 377355
19479 377355 467165 453310 399665 340338 321316 273471 209791 160562 161573 169491 174609 190292
19467 190292 157345 112874 177101 224265 208294 180194 205548 151671 78042 82321 92009 111575
19455 111575 108420 135003 106355 86430 68128 117644 207324 237073 239605 234198 210542 288492
19443 288492 315881 242217 184598 177525 241345 287279 295441 309751 374730 522531 613204 688749
19431 688749 885862 1366417 2085961 2766033 2970130 2575392 1968157 1628020 1536367 1722105
19421 1722105 2140875 2784098 3227790 3077050 2553962 2211822 2329995 2816844 3292338
19412 3292338 3274835 2681552 2086373 1877474 2053849 2522318 3059559 3138152 2579401 1784021
19402 1784021 1262504 985805 824548 722446 589816 527510 519307 526538 506026 481115 494902
19391 494902 481989 504776 450972 431621 440905 429797 434931 478094 518463 579784 637120 681217
19379 681217 793167 881251 906569 899993 902371 901544 888141 881488 835302 795995 777553 732871
19367 732871 714055 659763 612827 552523 582917 515914 498355 484628 476738 516929 533830 516170
19355 516170 596530 710451 729945 770062 726156 739748 787415 861178 881527 912604 871072
19344 871072 705257 614142 639671 679526 681214 706290 700001 632777 649303 671088 627124 579270
19332 579270 492906 432162 454684 528982 581604 543818 558413 600253 735888 850603 871646
19321 871646 916080 1037816 1248904 1568174 2091301 2976059 4526269 6263822 6795522
19312 6795522 5399666 3825200 3245273 3615288 4963638 7007068 8472370 7637587 5069457
19303 5069457 3241581 2404139 2022608 1767828 1583683 1525059 1527951 1537764 1615969 1730524
19293 1730524 1896198 2127619 2432393 2660785 2703646 2713664 2746765 2884918 3045615 3147352
19283 3147352 3202535 3185895 3160676 3256880 3431906 3648749 4059004 4648215 5087214 5380752
19273 5380752 5979922 6997303 8099540 8826575 9034850 9085133 9330534 10058569 11650410
19264 11650410 13970722 16616571 19413693 22957741 28562616 37381104 50487123 72070474
19256 72070474 112099503 178532051 256433477 304967160 311051326 318160434 318790165 281440733
19248 281440733 250866615 269899717 299522746 288811579 254188556 253658060 268886741
19241 268886741 243903745 170781568 107983892 74139994 55854698 44021651 35112819
19234 35112819 28586048 23764904 20204753 17870761 16498135 15473691 13959401 11873890
19226 11873890 10195852 9311343 8833037 8278867 7416980 6354925 5566803 5073165 4775919
19217 4775919 4552251 4478383 4619996 4815145 4778610 4533100 4289216 4035426 3631179 3209886
19207 3209886 2859768 2689280 2650079 2635819 2750978 2877349 2932721 2914308 2734774 2482612
19197 2482612 2275239 2238947 2442910 2865525 3652518 5066053 6826754 7544481 6259318
19188 6259318 4414655 3538305 3368118 3778792 4954082 6893244 8581427 8269183 5825130
19179 5825130 3790359 2812327 2319379 2060011 1825337 1667609 1531740 1411028 1412438 1453538
19169 1453538 1391378 1320073 1203088 1064851 998058 981405 993264 997630 941408 924537 936741
19158 936741 914222 875687 813231 892209 953227 922299 929921 845170 671474 552626 549836
19147 549836 532807 516124 544789 560347 534886 531072 485697 448982 367790 375923 397090 414545
19135 414545 422748 404101 357930 376980 407851 388817 363198 339442 272523 225422 221755 252948
19123 252948 363615 389598 396244 494069 586187 604950 532065 464703 530898 583836 571140
19112 571140 593990 569775 526580 475283 397706 303543 244058 126938 146070 206603 226150
19101 226150 214502 247392 279693 256726 213126 179105 149652 184738 203967 243561 271059
19090 271059 293720 345975 368439 381260 402797 471312 510799 554272 601605 600706 532910 459460
19078 459460 468007 499435 583003 702006 785812 789932 694358 573306 484495 481480 472139 496400
19066 496400 500561 483497 430985 356662 283987 222366 194440 171136 164457 177290 246597 258371
19054 258371 259045 226381 234716 259570 256478 218617 173479 180694 170761 181342 188162 207621 228602
19041 228602 195640 172262 169278 192258 215997 186197 130156 121520 91105 118621 138463 143842
19029 143842 147388 132199 87362 80501 94728 133742 123067 93535 82787 57271 92531 115462
19017 115462 165015 178397 196147 197033 148377 117340 82717 40737 74843 127403 121047 171951
19005 171951 156458 162793 142929 157959 146523 126429 146175 210667 235228 241743 229623 206659
18993 206659 185070 139699 143712 173009 215271 228429 225048 243475 201658 175276 154929 163577
18981 163577 130651 144293 190900 179695 101930 124314 128975 142227 161884 211745 212223 227742
18969 227742 200632 168930 147566 124280 142094 134079 128704 111671 111996 134857 171776 190618
18957 190618 169620 141651 120650 119459 104450 65514 74582 80703 26343 22382 95730 166437
18945 166437 160744 105531 127619 157505 127170 108288 67484 91609 94685 141130 223551 201907
18933 201907 147916 130348 156492 167837 142684 132519 129592 126498 131261 129261 109349 60935
18921 60935 57844 20558 9511 18515 53811 53317 31236 65871 83008 77867 21537 -1187 2873
18908 2873 -25319 -32562 -11870 42076 93135 118158 122004 66181 63626 114186 102208 95056 116248
18895 116248 161123 156956 128288 108642 109558 113566 77927 25324 -19926 13177 -12428 7121
18883 7121 46200 102562 130578 152158 145982 89033 26600 27612 55725 54308 55769 55467 75270
18870 75270 64953 42768 70341 82087 80695 78445 42717 83869 112099 78041 65889 52755
18858 52755 54208 46598 -9736 -37741 -12902 -62610 -52914 -27729 14253 43267 57088 42573
18846 42573 14109 6171 -15494 -53126 -46065 -13737 32998 43354 70143 77260 98509 117389
18834 117389 96434 105175 167065 112303 118304 124777 116968 82762 81054 76678 64156 62422 76177
18821 76177 67140 88525 57111 39251 31392 1629 -14411 11641 51590 36548 -21269 -10921
18809 -10921 40555 28555 -6711 27199 29380 26216 22688 15338 73687 68962 53172 20732 9374
18796 9374 2036 -3493 35117 67270 18639 -6074 18990 20601 -70888 -73288 -49902 12786 90423
18783 90423 99879 42948 29035 29547 69222 108449 94823 88019 83789 108259 109666 92471 137027
18770 137027 136839 197990 367838 486234 665333 712518 531385 337514 233331 196966 175612
18759 175612 153181 165844 173593 170634 160774 152756 144820 64056 4525 12825 26881 60680 77913
18746 77913 56463 48014 95391 151235 155111 171244 218256 242183 329352 439625 625785 854049
18734 854049 1152211 1344853 1271192 1012364 869883 896041 1007716 1046105 957289 920811
18724 920811 981513 942407 798891 534963 368860 260456 165456 98158 68630 74795 11330
18713 11330 -23380 17968 82636 74882 74390 96679 68211 39189 86131 120022 151028 147965
18701 147965 111139 116629 75546 20186 -3124 -13716 39777 85911 58683 3937 16554 6769
18689 6769 20934 46262 85258 75209 28372 10632 41313 62340 84594 85227 143648 262979
18677 262979 322071 461433 657732 940492 1102466 1024311 832431 669648 646719 702736
18667 702736 691805 611461 562551 603243 612384 530968 357030 241881 172898 107069 91997
18656 91997 48113 64789 103276 70876 1966 -6246 52650 63338 74721 73379 59385 12772
18644 12772 33003 50503 56932 4138 -31062 -26716 6350 30320 34414 18505 48885 53069
18632 53069 37081 49068 56475 27705 -6909 -8043 18260 3604 -28535 -30396 -40016 -42219 -49345
18619 -49345 -10493 -16512 -40706 -69905 -39483 -54267 -21289 -4065 3039 34776 57294 51616
18607 51616 20118 6034 1921 15747 61709 74409 121017 111014 110916 116358 58854 34151 41566
18594 41566 50792 50586 20592 -10313 43926 145386 159135 154998 142882 106837 79823 61171
18582 61171 77696 77152 95936 98115 73372 15529 45613 55967 62666 42829 13099 11096 35414
18569 35414 74420 112461 91525 33885 3778 -28392 7291 36148 90030 137347 167124 117347
18557 117347 83280 82303 79933 102329 112250 131249 109438 74321 33874 46692 99623 143294
18545 143294 123631 18915 -75913 -65643 -26802 -17359 3957 6429 -2175 -55770 -74126 -59771
18533 -59771 -40109 -26019 35347 65744 99077 113505 110253 126622 148420 134142 158490 129328
18521 129328 122321 125683 115879 79472 45969 62160 80906 61512 69954 135489 158205 101717
18509 101717 44509 51254 52802 95682 91893 92993 125230 158477 185355 128835 110495 21525
18497 21525 24466 90979 114262 56598 -4653 -26623 -22885 56410 111804 108406 70672 61382
18485 61382 49535 15840 18735 13844 28415 43174 27040 18318 38635 70417 97755 168558
18473 168558 249566 311946 339388 346091 299636 262062 195359 160574 239210 260546 298881 338625
18461 338625 282113 201804 110377 60330 46559 34123 -1719 20489 41764 69100 91009
18450 91009 91780 47015 102094 128428 138597 113994 51786 63583 66782 60770 44311 10820
18438 10820 30929 45649 29243 69412 1435 15838 31116 -1365 15107 15520 43257 52471
18426 52471 48275 64500 43076 65385 21444 -4165 -12841 28002 64303 50782 75857 153605
18414 153605 274119 315972 283668 219937 206719 206691 187450 176490 169396 183456 220746 161683
18402 161683 121860 60501 2414 59667 135955 152362 81251 76153 51117 20733 -7164 7908
18390 7908 44154 20558 27142 48699 37833 -1187 -14478 -12159 -7387 7139 5423 -23399 37353
18377 37353 15135 -7920 -3137 -7134 -12016 -63766 -21757 20194 42523 24496 33335 32093 82941
18364 82941 133460 127549 71405 19357 26338 68516 97302 87696 62213 74384 64643 88420
18352 88420 101632 92230 84360 18271 -17815 -18355 -49581 -32169 -1309 -70012 -86998 -61595
18340 -61595 -56140 -13971 -9885 -21839 -49436 -41795 -1423 -8655 -24570 8281 44431 90941
18328 90941 80620 80413 46275 27957 33572 64377 46188 73158 20656 2226 48210 76398
18316 76398 72194 58239 49135 15273 -29464 -30241 12289 48940 3704 -41599 -36134 -5033 7735
18303 7735 -4688 18064 43076 29361 12813 30604 39351 15264 -8293 15306 4342 13627
18291 13627 21549 8403 -19693 -739 32581 25887 24387 26130 24891 30589 5775 28220 22584
18278 22584 -8790 -62033 -21683 -11603 -8105 -24860 -18576 -27668 -20716 -23460 20950 32731 44245
18265 44245 7895 32274 53946 8470 8808 53840 68560 82782 93303 83651 140778 129149
18253 129149 67435 89777 59824 15938 77378 63188 -8237 -1592 87662 97040 107992 49186
18241 49186 -22978 -28121 -14064 40143 121459 150271 151941 115369 126373 161127 205400 146150
18229 146150 36414 -26781 -10714 48961 61290 61884 50259 2270 -6301 25089 48713 82660
18217 82660 100202 76383 36148 49993 59546 46990 18837 -9110 -2947 25811 34650 17556
18205 17556 71249 108837 122281 98836 153161 178596 149641 95114 54944 19815 9024 44833
18193 44833 57395 105046 70828 1122 15308 69683 141706 172222 93639 45960 55538 59530
18181 59530 69517 62182 65793 31677 -17649 11610 36937 44364 20962 -18970 17431 46219
18169 46219 52672 -18729 -72670 -24282 16528 13190 39738 77420 22519 -22351 -39418 -16707
18157 -16707 -10692 -13811 22093 6995 -55000 -69671 -107104 -88242 -34028 85109 179528 132766
18145 132766 129911 48839 4577 -6369 51290 130658 173984 213424 272198 255070 278110 314421
18133 314421 348640 336620 332767 410230 426557 451085 509800 525281 506285 586419 755929
18122 755929 873000 1005113 1260337 1562200 1911271 2335522 2998600 4006791 5678420
18113 5678420 8590365 13706549 23409134 42943927 76494854 113182839 121081821 86121014
18105 86121014 48410883 28941540 19396008 14105262 10753366 8495722 6759713 5435753
18097 5435753 4490583 3793270 3232401 2843300 2563774 2366388 2242178 2131333 1935300
18088 1935300 1730336 1551946 1376657 1295463 1269905 1184073 1126155 1082920 1033087 973285 896817
18077 896817 800349 751602 733240 674796 694410 721566 704824 651953 596951 561751 525014
18066 525014 551650 564204 544960 506556 474120 460303 415492 388479 385876 362639 284957 324026
18054 324026 403098 427505 413267 427576 427437 466370 555026 598339 644227 644581 589205 556117
18042 556117 535513 499867 530052 510594 463072 432926 414684 368248 362828 348601 291482 298779
18030 298779 281876 266913 235924 251282 236135 181474 196005 246729 292209 315099 265258
18019 265258 200490 246380 294221 224057 150323 117418 113812 114993 107476 176828 201861 201870 189819
18006 189819 190855 216925 189502 133880 103962 100481 119290 123925 155512 109072 110378 163799
17994 163799 195273 197387 243832 272679 279677 305138 349167 376041 408076 463061 517837 537378
17982 537378 535450 559604 610492 595714 620562 640120 668205 679451 655973 609961 602704 563400
17970 563400 471508 426172 384458 271275 184124 160505 155876 130071 137512 138985 114120 103958
17958 103958 142661 213436 192749 198387 196226 200730 174804 162044 151144 166313 186572 194835
17946 194835 202477 249743 255189 290672 332258 316273 316972 332975 342488 371993 316988 282521
17934 282521 294937 334054 433468 494657 462604 388399 361296 416643 422576 386665 381813 352027
17922 352027 310679 269188 231856 234155 238345 203561 222023 205303 182384 173712 166188 122240
17910 122240 84747 64681 73269 97895 104095 90338 151511 136750 119508 93915 39996 -8888
17898 -8888 -12944 -25728 -2787 66706 150730 160440 134714 147640 119051 64716 106939 140748
17886 140748 104263 70824 37818 7357 14956 40653 53015 25330 55627 73379 102503 188060
17874 188060 174075 127964 147464 107213 68185 35921 26260 24935 -1917 40128 15327 -12446
17862 -12446 22966 81294 89472 106700 118198 100542 74369 74295 95236 123514 109881 86220
17850 86220 107868 109031 107876 122865 142779 100722 62924 90264 106170 102726 27883 4999
17838 4999 24784 53033 67448 71357 14843 22725 71183 61390 30015 11168 16885 19483 39199
17825 39199 73170 84516 92121 60508 47704 46772 59397 58840 47524 54395 90637 89743 48544
17812 48544 15792 29604 4567 -47420 -48292 -69206 -67043 -27822 -47515 -75350 -47305 21021
17800 21021 57730 82554 87384 53083 19937 56850 130009 142136 122772 52465 20216 66852
17788 66852 84697 99094 128563 165753 174887 129074 78141 57771 -18166 -33014 -16382 13912
17776 13912 15666 30654 -11091 -30416 -61087 -72186 -32873 -19727 -37638 -22288 -4836 -20497
17764 -20497 3538 14777 22533 -7737 -6086 2614 18460 -2001 -14896 -7375 -7490 -67206 -45385
17751 -45385 -863 39648 -36341 -30301 11463 43985 7784 48708 42816 53620 47353 41303
17739 41303 66144 84926 85375 127067 102521 56485 18847 40862 115592 163165 135107 90117
17727 90117 11212 -48341 -20562 -10825 -42477 -83633 -28719 25733 84924 76593 43544 61712
17715 61712 65813 24195 14768 53636 69007 38479 6033 9830 -5905 574 35007 51210
17703 51210 35220 8856 6957 -33867 -4824 -12555 -19212 -14298 12107 27676 6818 21346
17691 21346 67529 49871 27092 69867 86043 71300 67414 37563 14567 29301 32413 36409
17679 36409 17169 -36742 -52298 -11184 10323 -30195 -32261 -4309 25821 21420 -48336 -95308
17667 -95308 -66439 -39813 -51270 -67026 -82615 -65135 -38627 -6717 64486 69499 29840 15016
17655 15016 47776 72805 99665 103286 56504 24966 -1170 20217 56409 26920 29251 80270
17643 80270 90658 62558 60417 19286 -8332 -21345 -840 -21266 31102 81193 35593 39897
17631 39897 43350 32064 -59295 -54167 -12577 35050 62566 44115 74036 73115 61412 23535
17619 23535 24042 -3948 -1344 -1675 35165 90968 52790 88588 117526 156155 162207 97593 89311
17606 89311 36973 -28639 -57609 -34833 -32638 -5151 2972 10348 9316 -27075 -44822 -37824 -51218
17593 -51218 -49378 11986 19081 53715 83588 67069 14262 49257 72491 43774 24873 62568
17581 62568 73014 43200 10230 -36030 -23996 -30278 -77998 -75874 -57648 -27906 -6416 -5649
17569 -5649 40076 47975 -3559 -44037 -50826 -43118 -26699 -2809 37383 30659 4774 -41496 -31228
17556 -31228 12413 69129 94331 96224 41165 32032 49646 -7715 -6941 -60031 -68229 -13727 11818
17543 11818 -10383 -9111 -54991 -6070 37018 9907 -23961 -40810 -39723 -17227 -41121 -54318
17531 -54318 -59032 -47679 -26929 -25654 -23585 -38889 -16095 -44479 -67919 -75594 -73886 -26418 -18340
17518 -18340 -10379 -1247 14451 33755 25916 39273 62418 77038 37795 8775 4501 -14339
17506 -14339 -14009 -30132 -40990 -71747 -74503 -80906 -117507 -90543 -12792 16707 33621 35142 24258
17493 24258 35265 12373 -41386 -81229 -52304 26397 96354 61414 7838 20687 44987 69059
17481 69059 102816 76326 29816 29227 32892 16019 10648 -52326 -28912 -39856 -47456 -23746 21908
17468 21908 55903 82776 78130 79027 85475 105606 83706 25666 -79418 -41909 24515 16507
17456 16507 6328 17742 10918 38817 81721 100291 56964 63253 127446 85905 62342 93836
17444 93836 175568 359998 558749 679382 547149 304123 158032 76207 78784 85367 55163
17433 55163 24322 16632 -2029 3620 9030 -10168 9402 40713 42351 3687 20190 39491
17421 39491 4332 20196 1550 -7408 34478 22508 9835 31154 53586 -19270 -33991 -36988
17409 -36988 8775 24992 25192 55115 48005 -28270 -45781 20301 31892 -17907 -12127 -25776
17397 -25776 -44652 16860 20507 7550 -13009 -11474 -59332 -59319 -33842 -19696 -38142 8057 36112
17384 36112 67148 62031 62959 78751 68033 54291 28598 50005 56256 43433 38899 71696 17757
17371 17757 -39733 -67093 -105131 -85747 -98912 -130202 -168774 -114838 -39608 -38211 -12764 38134
17359 38134 65393 64903 76861 75684 35542 -8331 -2375 16684 12297 1683 28298 42650 16686
17346 16686 -20902 10283 -3242 -10858 -18217 -9765 12027 27311 674 -6926 -73393 -37108
17334 -37108 -6675 39878 41012 -20393 -38720 1399 -27712 -55936 -41890 -34888 -5132 7719
17322 7719 7135 5817 6648 7581 52401 53838 63774 67217 22282 -29525 6928 5375 -50383 -20311
17308 -20311 31425 56944 60997 32215 8767 2156 19036 36934 49689 21739 -59271 -86685
17296 -86685 -79753 -68137 -95437 -93133 -104469 -90864 -57354 -12190 -748 -51344 -27194 -18365
17284 -18365 28372 11422 -3008 27622 68331 89181 53564 -3563 -21173 -46450 -27439 -5268
17272 -5268 -41048 -38104 -43306 -17098 29578 28206 16202 20957 6261 47435 75242 74475 45267
17259 45267 -19032 -59815 -95256 -74880 -13617 12308 24570 56037 67880 74805 75710 74647
17247 74647 51507 18301 4831 10461 11866 17696 4378 -20052 15185 -20579 -51854 -9343
17235 -9343 -5704 13163 4083 9769 -87 -17390 -14970 261 73527 66633 28608 19236 54210
17222 54210 8456 -43641 -45847 -33293 5104 38009 29139 -37135 -42714 18658 -9149 5948
17210 5948 33536 1983 29193 23038 3434 -4215 -32918 -59281 -63911 -65351 -76771 -59170 -69256
17197 -69256 -30673 9183 29144 -8107 -20004 -63632 -67355 -19110 -12265 -22671 4166 31597
17185 31597 26400 28698 19701 51322 100846 76470 39452 26403 23246 17610 68290 88568 77552
17172 77552 48235 24402 26114 4420 -5414 -32983 -13114 8640 -42999 -40027 -7878 -26020
17160 -26020 -38920 -42100 -7961 16061 -12737 -37495 -32595 -25842 20674 62346 2485 -66338
17148 -66338 -40559 -7139 -15897 -30719 -2828 8494 -27472 -29462 -28956 -40384 -84034 -70781
17136 -70781 -14188 30391 78932 111978 73998 50295 66314 75829 68565 31066 -15242 18702
17124 18702 63376 35966 28504 32680 65645 51293 1736 -19871 -28169 -57749 -73531 -69744
17112 -69744 -24289 -46340 -52320 -21423 -23688 -25914 19667 8333 22198 27229 33411 32058 -37486
17099 -37486 -77089 -81664 -29369 53705 140658 140715 71203 -5561 -37589 -43813 -77332 -69627 -109190
17086 -109190 -123957 -94648 -63138 -34214 6482 -24111 -53350 -55507 -40202 -58087 -106234 -65802
17074 -65802 6997 43806 33370 15433 63253 67547 15069 -20611 -43436 -30691 -66789 -74230
17062 -74230 -62823 -22051 -4760 -15894 -37135 -55158 -62356 -56719 -41343 10830 21764 4840
17050 4840 13983 22621 20147 -2442 -23050 -10164 -21695 10309 38358 21811 7998 -6164
17038 -6164 -18956 -17013 -13277 -20267 -22522 -19928 7469 -6258 -56542 -55401 -34946 -47000 -37487
17025 -37487 -19185 -22379 -52143 -32784 -30657 -76916 -82216 -59853 -16748 -13301 15500 51391
17013 51391 40191 -9184 -22526 -32252 -4129 -25556 2701 14733 -14666 -38587 -42771 -12914
17001 -12914 -8939 5609 -20839 -69155 -74802 -41281 -11632 10908 -6992 -21155 -47683 -77120
16989 -77120 -59311 -49305 -17150 3760 -30764 -58167 -9641 29686 11905 25132 64201 71928
16977 71928 30294 25784 -20142 -76486 -125036 -126502 -94126 -92695 -48861 -33871 -81089 -101813
16965 -101813 -92695 -49514 -37553 -17256 -21567 6863 -23971 -77848 -113719 -105028 -42265 -47867
16953 -47867 -57953 -32614 9232 -52144 -33037 -12590 -3 -18032 -34478 -52232 -88251 -78135
16941 -78135 -34571 -58395 -31228 -50166 -80205 -49731 -1723 3418 -35631 -58639 -52547 21032
16929 21032 24799 13006 -19019 -56173 -79051 -90802 -90597 -58418 -28357 -13340 -21343 -47543
16917 -47543 -48674 -78919 -55704 -63506 -27901 38840 66837 49999 13905 34160 26987 -6079
16905 -6079 30115 29432 21618 14418 21998 6852 -45516 -48054 -62356 -53430 -57686 -27178 -27605 21718
16891 21718 66547 51190 26740 27661 30949 52166 44531 21673 16585 44045 73750 74180 43429
16878 43429 8485 31240 67044 55704 69688 55512 69747 81000 3656 -36527 -26379 -10942
16866 -10942 -17063 9734 -9925 -44497 -40070 -27045 -9872 30342 12476 -29406 -67963 -79348
16854 -79348 -44503 26374 -7441 -71516 -58193 -31079 -48389 -67733 -23431 -61438 -53120 -43636
16842 -43636 -34555 -22138 -22159 -41839 -42993 -47364 -47234 -3114 63555 38151 27918 27791 -9848 -35542
16828 -35542 -9215 43376 -21191 -13714 13972 -11248 -17356 -29169 -74512 -50790 -24868 -70252
16816 -70252 -71642 -53998 951 39384 32019 50133 77987 74456 26891 41731 48867 89130
16804 89130 115337 127343 102377 45871 1883 -7932 -23968 -50631 -55398 -41138 -15203 -18509
16792 -18509 -27244 8355 -29250 -47920 -34413 -1932 22369 48544 71450 85427 53233 -30157
16780 -30157 -66918 -54364 -14910 26853 51703 -8827 -9848 29525 8356 -16777 -46974 -75040
16768 -75040 -111690 -178096 -161777 -132078 -88561 -73823 -44157 1442 -5816 14085 -7243 -18066
16756 -18066 -14755 -58462 -77781 -24402 63695 104193 114250 89507 108344 53195 -55482 -135655
16744 -135655 -152040 -140483 -129542 -121798 -145795 -130991 -84373 -94169 -97460 -97901 -75269 -44231
16732 -44231 -31942 -1857 -15253 838 4520 2261 -70070 -61968 -41560 -38583 -56182 -26169
16720 -26169 -23072 -18961 -17500 -31516 -12607 -3732 -45030 -21690 -36421 -62341 -75624 -61544
16708 -61544 -35228 -32093 -20114 5429 41535 21038 33972 7039 -36636 -72457 -73184 -43519
16696 -43519 -18356 52262 58840 26297 45209 93560 11990 -22161 -55815 -89697 -53383 -79600
16684 -79600 -102203 -76438 -17008 -19523 -53212 -19338 6357 24462 -25551 -33010 25677 5788
16672 5788 -34907 -56581 -75748 -84942 -79348 -53598 -32672 -69653 -75247 -65374 -29624 -18551 -32698
16659 -32698 -33176 -63422 -63019 -66408 -47378 -32083 11766 1997 -58561 -78934 -56762 -36012 -46306
16646 -46306 -2391 40093 33632 12557 -25390 8263 50376 29926 -30516 -27498 -50252 -63045
16634 -63045 -92698 -91339 -49473 3944 50441 81800 82585 374 -16864 -60362 -53302 -89429
16622 -89429 -71434 28996 97144 101820 73994 51225 -6245 -27618 -27927 -25150 15371 16960
16610 16960 12032 46337 59515 44486 -31727 -22853 -2050 -9950 -38134 -21010 8690 41529
16598 41529 78351 56395 20856 -30801 -72892 -71874 -113484 -126021 -81774 -41798 -74211 -70045
16586 -70045 -57174 -42379 -24824 -9294 -2937 -12668 -24489 -18533 -60541 -84992 -81299 -49588
16574 -49588 -83237 -82305 -40304 -34608 -86363 -92755 -56955 -62459 -87201 -91821 -52951 -41362 -35311
16561 -35311 13111 2530 -35197 -35540 -39311 -16889 -59872 -76912 -71249 -85970 -150589 -130907
16549 -130907 -49037 26155 23158 14639 -5805 4175 51936 23090 -52204 -63818 -65777 -68937
16537 -68937 -89468 -63334 -28003 -55768 -19954 6874 -59147 -107524 -107381 -66588 -83908 -112177
16525 -112177 -54335 -13503 91 -35441 -50444 -41411 -57203 -56580 -45467 -32386 -54070 -49993
16513 -49993 -59312 -77612 -82068 -47859 -10567 32881 6390 3890 31656 19586 37856 39767
16501 39767 23533 2876 -20538 -13508 36004 70002 59952 27145 -62182 -77536 -75277 -57078
16489 -57078 -48117 -23263 592 38209 33711 47956 9489 15503 2957 -35360 -46910 -63761
16477 -63761 -56798 -56188 -21996 2878 -4869 71305 58463 26124 20172 -685 -21877 -7933 15989
16464 15989 19753 11462 3983 -299 34513 65353 48120 3948 -47192 -105756 -81631 -26654
16452 -26654 22129 24792 -8010 -25899 -13547 -7549 -35004 29295 104918 99477 99894 111306 95658
16439 95658 68543 31004 -4611 -18494 -15965 4943 -4667 700 21345 9120 -15388 -62183
16427 -62183 -42118 -12978 -27857 -87745 -132677 -105214 14514 47883 9400 -21815 -44525
16416 -44525 -65487 -18640 30661 2028 -22635 -29966 -6582 -29519 -934 19817 -54028 -75839
16404 -75839 25129 16638 25444 -1626 -4148 18047 20143 -22079 -55801 -44056 -20023 4120
16392 4120 32850 49722 -9081 2584 45926 -2352 -65631 -67403 -18975 -37298 -4242 10248
16380 10248 30455 30960 19696 -31596 -24061 -26969 6517 -30470 -60250 -52322 -16923 -11556 38210
16367 38210 63191 76854 104978 112720 83028 73287 55027 7725 -25198 -14377 7340 5235
16355 5235 -25836 -50235 22552 49032 16887 5999 2118 -48233 -32593 -15056 -1048 -10374
16343 -10374 -4469 -23166 16766 6981 -35761 -13716 -1025 -9825 9799 33483 -15119 -31077
16331 -31077 -24333 -71122 -100786 -132209 -133339 -58029 -8095 13288 31646 10537 -31003 -6451
16319 -6451 7522 -27460 -62303 -33156 16464 49676 61551 30323 15788 22154 21005 -60843
16307 -60843 -72274 -60041 -53476 -102582 -118021 -34475 -615 -36244 -46743 -13634 20732 -14864
16295 -14864 -22508 -14384 -48396 -44437 -44542 -62179 -52979 -10510 39758 60515 45224 15282 -4290
16282 -4290 -11654 7061 23563 46194 80554 61460 22949 -38173 -55185 -86177 -109049 -149747
16270 -149747 -153599 -136245 -106056 -80609 -48265 -37886 -56593 -84752 -38816 34259 17668 -61967
16258 -61967 -39918 -41069 -45715 -53182 -47164 -51487 -24975 831 -22108 -51303 -83995 -78560 -34261
16245 -34261 -4128 4776 5425 -28568 -78067 -54343 2638 -12390 -16180 12835 4187 9056 27392
16232 27392 19950 26264 9526 27676 19743 13726 29370 59775 17052 -14280 -28364 30632
16220 30632 21119 18325 -11382 -2209 42157 -18612 -24421 15886 25442 21218 44328 77392 74943
16207 74943 99708 81247 32267 -28118 -58159 -30289 -40026 -76494 -44133 11749 -9243 -50440
16195 -50440 3162 21481 27501 34760 -2575 -76310 -76077 -57153 -41971 -45763 -9478 -21302 -19863
16182 -19863 -36340 -68904 -80216 -67615 -65498 -63732 -33262 6110 33539 19560 24404 48282
16170 48282 2280 7144 20270 17863 24739 -14097 -2671 15007 -33433 -81145 -57753 -51268
16158 -51268 10643 38538 36243 -12176 -66804 -59525 8341 11551 20257 21216 12831 26090 49618
16145 49618 31286 33530 68260 38966 -9433 -59263 -54055 -58426 -54515 -20850 29580 55664
16133 55664 32913 -24990 -12110 17977 61928 51920 -19413 -81299 -122038 -110145 -74573 -64494
16121 -64494 -91945 -44602 11894 39447 -11004 -51485 -58685 -124980 -83709 0 22972 82395
16109 82395 75591 26786 35985 -839 -24274 -23129 -20260 -51852 -53615 -37243 -6643 1761 -10914
16096 -10914 -21893 28340 -8699 -35724 -45284 18673 69383 56443 7684 15677 37794 23099
16084 23099 43983 56652 13494 894 27757 53287 63217 86938 62636 -4884 9566 68325
16072 68325 85172 46466 -40238 -80483 -84169 -83954 -59880 -47423 -31011 -11561 -34414 -67369
16060 -67369 -53958 -35750 -40714 -61381 -47610 -17014 -4458 -36006 -58850 -31645 -28278 -9902
16048 -9902 4438 -14943 -1040 47949 40678 27955 -28224 -97462 -75329 -69676 -28347 -22398
16036 -22398 32405 28475 11867 13385 -39881 -55491 250 -27138 -21312 -8055 -40429 -56193
16024 -56193 -60918 -2465 -11660 5533 5420 4481 -4309 -7369 -73531 -52493 -28924 -12334 -56068
16011 -56068 -73174 -84196 -47266 -61279 -103257 -14136 -2998 -13822 13957 23398 38496 70246
15999 70246 74208 66161 29383 37399 32624 19920 49415 34673 50160 10930 27035 -5047
15987 -5047 23195 63076 64596 54077 22371 18196 -3682 37921 73121 39785 8398 -2785
15975 -2785 -41854 -49248 21422 49683 6027 -30860 -21224 1363 -22892 -9457 11794 26920
15963 26920 43947 -14930 -44688 -21742 1498 -29275 -57530 -42448 -53845 -63905 -85031 -90051
15951 -90051 -70393 15016 59178 52848 46693 41735 99649 92488 27392 64310 114981 108755 60190
15938 60190 46831 -25480 -48054 -74467 -89668 -78952 -34426 40579 87583 90003 83665 55282
15926 55282 -4415 -49992 -65634 -93956 -59096 323 51200 58813 37854 16611 7457 33761
15914 33761 25686 36064 25028 -46550 -61702 -79732 -87028 -88183 -40968 -52836 -87783 -90177
15902 -90177 -109271 -132003 -126915 -121417 -99840 -92421 -87640 -49172 7259 51941 58479 19754 -5404
15889 -5404 -29082 22403 95125 52922 -40643 -73316 -97844 -88119 -13172 22918 35941 30794
15877 30794 -749 -5121 -46710 -100161 -99653 -42016 -20776 7108 67519 67836 29149 -44554 -38657
15864 -38657 11723 40614 50363 2396 -9171 -13353 -3091 -13700 -490 12795 26253 13348
15852 13348 10698 -35861 -90964 -72805 -33421 16024 25564 -18163 -10177 60253 -13498 -44872
15840 -44872 -5675 -40192 -18012 -21742 -50207 -106883 -129349 -60319 -1488 -33540 -25467 45556
15828 45556 91635 114179 52055 13672 23000 35575 38860 18291 -3924 -31961 -62073 -39516
15816 -39516 -7931 -11285 -5805 -33582 -21144 -19026 -40375 -49194 -24481 11137 -6876 -42497
15804 -42497 -20127 -24721 -44933 5064 11898 14709 39638 26953 -19013 -19251 481 -8604 -4140
15791 -4140 40052 -11675 -37726 12818 4289 -69034 -88081 -60303 -17837 -13654 -15942 7446
15779 7446 33433 97190 99736 71875 53971 55421 11301 -43832 -48603 -36902 -7529 -44986
15767 -44986 -56557 -9330 19997 29021 44525 57792 40634 69539 64497 109655 119426 35977
15755 35977 -20267 -368 9087 -9504 -296 21195 76134 44902 -33216 -14232 -31394 -45823
15743 -45823 -58883 -61020 -74951 -107750 -112548 -104061 -105671 -66918 -68359 -52571 -47928 -16246 64226
15730 64226 88547 54276 34318 12796 20771 -1435 -8135 6780 -5099 32342 99040 58144
15718 58144 81018 110513 133442 84387 -12836 -81108 -110968 -108872 -97576 -76672 -47471 -68921
15706 -68921 -43828 -95939 -68808 -67530 -70193 -72177 -103057 -107045 -125286 -94534 -14516 8752
15694 8752 16046 16673 -30212 -46551 -56797 -17866 -38553 -30291 -9862 -57661 -124472 -120457 -70934
15681 -70934 -19323 13269 17738 46650 71152 82508 70588 32070 -8510 -20085 -10107 4671
15669 4671 -7367 -43005 10976 15930 -42727 -1072 -610 5102 31417 66083 67017 80360 81605
15656 81605 96469 64706 13497 38851 36711 7879 17095 22970 33564 10205 18932 23047 43553
15643 43553 45263 4010 -46655 -61734 -85454 -57140 -37399 -34217 21427 99401 95805 49052
15631 49052 16527 19231 43757 49319 86126 76367 70910 47889 37907 55672 39136 765 7193
15618 7193 70045 116881 74155 13133 29339 -10265 -38138 -31376 -60088 -64704 -76694 -74717
15606 -74717 -82745 -90035 -59631 25817 35094 -33914 -18609 -18041 -106767 -137967 -127670 -71853 -72479
15593 -72479 -45770 28359 40733 69859 30156 1571 -373 33019 44707 -34820 -77260 -44889
15581 -44889 -27166 1276 -11788 -17829 -13228 5829 18920 6268 -15653 -38631 -29814 17481
15569 17481 1912 28466 10346 -6738 -39956 -68777 -82235 -32104 -11057 -11822 18860 61599
15557 61599 53369 36624 -18473 -62885 -26844 -19634 3947 51644 47141 -20016 -29848 7529
15545 7529 35739 26183 -3994 51940 47215 58990 50381 -14450 -48932 -27211 -10051 -25195
15533 -25195 -10207 -22879 25461 -8611 -39510 -75133 -60706 -54005 -113070 -87884 -92334 -86068
15521 -86068 -33805 3934 31895 39623 -26872 -79561 -85119 -93877 -136746 -136827 -98337 -33060 -14838
15508 -14838 -12912 1568 -11494 -24884 -17599 -16866 -7464 -36639 -69900 -82819 -32981 -27113 -34684
15495 -34684 -65930 -87322 -36112 -43515 -100429 -185311 -172122 -163032 -111914 -41256 -39190 -57884
15483 -57884 -51582 7052 51177 -10950 -17717 -22505 -39321 -31133 -42414 -18544 -31272 -57609
15471 -57609 -16222 -20053 35958 33411 376 36893 24159 -18036 -29797 -63040 -53875 -14618
15459 -14618 -41494 -9178 3201 20685 28115 1297 -33128 -16833 -29015 12294 -1074 -20780
15447 -20780 -14857 -13542 -61379 -35326 3047 24743 4112 -27225 -47233 -20440 -3041 4208
15435 4208 -11696 -34369 -47281 -27886 1841 -10386 6220 25668 38927 66829 96323 58429
15423 58429 6214 -9972 -3742 -17779 -26181 14056 21615 -49381 -49033 -43585 -30080 -5468 -24945
15410 -24945 -24033 -3530 -2851 16738 12531 -12915 3178 11579 26096 5855 24140 42503 51654
15397 51654 28479 -38358 -30730 4108 -1716 -79466 -162945 -101297 -64399 -57706 -66266 -92793
15385 -92793 -75616 -76447 -24907 8779 23469 -33509 -33356 -29573 2759 56476 54687 7212 -2126
15372 -2126 -6486 13573 8639 -47932 -91517 -82894 -44340 -35957 -33913 -47595 -67979 -88908 -49028
15359 -49028 -34986 -57425 17987 42723 42561 17381 44692 32144 68531 30452 14639 5925
15347 5925 9009 41640 48212 58337 40391 -4888 8235 22993 25288 -33279 -49514 -12049
15335 -12049 -13810 -45018 -50860 -24161 -56224 -48687 -40228 -50747 -54598 -18115 10245 18390 40180
15322 40180 48621 8193 -8882 9187 -1436 10590 -237 -22992 -64297 -12697 2285 -4772
15310 -4772 -18976 -27274 15100 25107 -6516 -37136 -103237 -105311 -94824 -103429 -63355 -52804
15298 -52804 -64216 -82616 -58593 -42768 -33979 -68091 -100980 -37888 3792 -401 -3199 25630
15286 25630 38630 19679 -22161 -78660 -63224 -27655 2007 71594 58498 29647 -12520 -40214
15274 -40214 -56809 -60463 -45822 -39825 -46328 7463 32488 19545 74435 31495 -8042 14200
15262 14200 3171 11057 48978 30207 -27723 -88925 -98115 -44218 2418 10390 30502 18343
15250 18343 -33373 -83560 -46467 25325 34081 2407 -25041 -13019 8592 24448 -512 2120
15238 2120 3800 3393 -4078 -19147 9548 9734 -21218 -45509 -73944 -33312 -47167 -63144 -70128
15225 -70128 -55189 -43032 -52897 -47677 -74718 -95895 -95137 -103479 -66206 -35748 -14542 -103113 -107930
15212 -107930 -87820 -45252 -58417 -76751 -55545 -50456 -33028 -18300 -18173 -37281 -37435 19240
15200 19240 28563 74578 93434 9029 -53732 -38198 -54776 -49993 -33734 -42494 -43849 -25555
15188 -25555 22117 21888 1586 21564 33838 -15786 -37649 -48739 -25402 -13603 11778 30617
15176 30617 -21946 -22736 486 10007 44115 63947 24556 13113 -20497 -31417 -15911 -31047
15164 -31047 -16451 -20487 -20626 17263 89349 62963 51017 41239 15036 46970 30903 -10573
15152 -10573 63119 99242 26993 -22400 -35154 -29302 -50143 -85168 -71309 -46553 -22261 5105
15140 5105 -15015 -38379 -69651 -76667 -37675 9975 72093 56604 68714 60014 41213 45096
15128 45096 63205 43590 -27122 -60850 9252 84122 17179 -43999 -27985 -56056 -108443 -112711
15116 -112711 -102473 -71513 -29480 33698 34364 -1719 5570 4859 -32792 -40300 -42178 -28990 -26218
15103 -26218 -25896 -12487 -35745 -12055 23387 57954 95162 38857 -2989 33005 51842 58628
15091 58628 13577 -33910 -34140 -33131 25440 33253 14834 -35214 -74059 -48483 -38677 -54474 -25809
15078 -25809 17197 76149 48234 34115 56484 59399 62881 66240 25625 -13224 -20060 -24656 3124
15065 3124 36768 56408 66314 59422 79784 73057 66498 61933 43328 27529 39853 -534 -51675
15052 -51675 -78413 -94223 -77677 -23034 -35594 -46474 -23119 14828 -15320 -34590 -43114 -52092
15040 -52092 -5269 -41071 -51827 -23998 -12046 7978 -5476 2383 14112 42495 1214 -59892
15028 -59892 -37916 -25046 -19069 -32074 -45655 -65294 -71075 -52277 -33544 -29497 -56696 -44602
15016 -44602 -69562 -91000 -40136 -28162 -12215 3212 -671 -15510 -3334 -6175 -22192 -19342
15004 -19342 11613 56647 45813 -5294 37576 8721 -31495 -63789 -39265 -48613 -50379 -56657
14992 -56657 -70008 -47505 -70460 -92227 -98042 -90598 -118319 -90268 -50699 -16036 -28790 -59762
14980 -59762 -4742 25137 41882 9777 -55683 -53359 -27581 -13928 -19654 -18598 -31956 -25952
14968 -25952 -75456 -65517 -35402 -54148 -41807 -35015 -42096 -39206 -6616 38470 26244 -20756
14956 -20756 785 13891 -18366 -38769 -20871 1004 -37647 -54341 -66182 -103156 -104834 -129745
14944 -129745 -96256 -59961 -24178 -22611 -24943 -44553 -75881 -60397 -34278 -39047 -5652 -9343
14932 -9343 -42233 -50510 -11785 -45010 -90157 -48966 -63306 -76700 -56106 -56875 -60145 -35809 -62712
14919 -62712 -100939 -63804 -86575 -82974 -16217 -16778 -55026 -48978 -47471 -30588 -49936 -43889 -4476
14906 -4476 49750 52054 40627 43967 46594 -6212 -5531 377 -6114 51160 33137 54192 77288
14893 77288 73215 28137 38688 35575 -16039 17328 6899 4393 -21057 -6399 22821 23089 68930
14880 68930 43416 -5787 -22755 34630 21272 -27471 -16549 47847 46894 -1356 -62988 -145373
14868 -145373 -156151 -133075 -127990 -112192 -86623 -62839 -98177 -113076 -123948 -133857 -87476 -56557
14856 -56557 -48496 -3764 67737 108735 46900 22847 21262 6316 3451 -29370 -14480 23222
14844 23222 -17162 -62600 -68346 -71654 -77619 -71399 -33139 -1158 10401 17993 29804 29055 36393
14831 36393 71722 62496 -16725 -69254 -110479 -56087 -63041 -100100 -98157 -71951 -39207 4425
14819 4425 20838 -54056 -59462 -11640 -5991 -34756 -71657 -50588 9026 24296 1015 -29868
14807 -29868 -89021 -69558 -72344 -115191 -116888 -115065 -68994 -54798 -49897 -77216 -52426 -49148 -19991
14794 -19991 -16460 -26102 -19037 7634 6160 -34550 -1832 15475 22108 -813 -58442 -89292 -72212
14781 -72212 -40615 -70917 -85670 -71062 -64518 -84586 -80683 -75949 -86892 -75012 -35838 -12737
14769 -12737 -27877 -45736 1539 48617 36228 25891 37415 33136 13451 -9599 37690 40173
14757 40173 19250 24012 32025 43577 57328 16570 -21942 15343 4945 -8455 19081 28837
14745 28837 5800 30055 6787 -50414 -76188 -77332 -119984 -109809 -83996 -93302 -95905 -115261
14733 -115261 -96830 -21680 -5771 -63393 -77777 -69660 -42415 -98431 -105131 -11603 20853 16117
14721 16117 16379 51766 1902 -23311 -44472 -21674 -5918 -42015 -29235 -21679 -15931 -21491 -11253
14708 -11253 20622 12210 -28820 -30464 -69020 -25365 33599 -7825 -41003 -27577 -65613 -37842
14696 -37842 3708 44967 37303 -43686 -98824 -135707 -80315 -32509 46219 69061 83173 23618
14684 23618 -35615 -31521 -44394 -2840 17131 -26247 -70867 -22906 25169 2260 -30015 -26474
14672 -26474 -31565 -34635 -12884 -53395 -66164 -21293 -44758 -28454 -14352 -51306 -70574 -64834
14660 -64834 -68127 -21243 -4229 39434 77527 95675 93195 48111 15653 34895 58802 53846
14648 53846 22520 -4585 -16651 -12151 -22698 8705 17784 8455 15932 40549 32525 74352 74788
14635 74788 55565 26586 -493 -27439 -46388 -64831 -51331 -9914 5158 16949 32512 -27351
14623 -27351 -69733 -62457 -94333 -101409 -38393 -4788 -23434 -42657 -54262 -92746 -50996 -15000
14611 -15000 4812 -25268 -60131 -28043 -11069 -6555 14987 -11898 -14723 -31570 -32021 -59210
14599 -59210 -49232 -51007 -78569 11549 6029 28314 41629 60342 22873 7365 12268 87067
14587 87067 46336 -8813 20479 9849 14826 13982 -39209 -43872 1193 -36352 -78480 -56088
14575 -56088 -26040 56478 59297 58346 19813 -57149 -101756 -80182 -68238 -69261 -77549 -98170 -121985
14562 -121985 -60085 -60978 -22215 -22596 -99834 -121798 -102206 -125771 -110207 -50192 -4804 8990
14550 8990 97 5445 -20476 -52452 -57328 -37276 -39288 -41147 -22922 -20766 -49863 -44134 -33642
14537 -33642 -57258 -38950 -22842 -20979 3652 24435 -25467 -48532 -51601 -10899 -9009 -25050
14525 -25050 -80628 -63141 -25879 16728 41970 55668 20153 -39404 -32835 70293 113905 103216
14513 103216 5419 -34215 6214 -14447 -74837 -26376 -26929 -40258 -38338 -46370 -50984 -76086
14501 -76086 -76450 -41378 -33661 -14203 60958 76088 39772 -18371 -12673 558 -5557 -51865 -25701
14488 -25701 21850 45944 29241 11955 19704 44121 50723 31288 24697 5891 -21114 -24979
14476 -24979 -48926 -37316 42455 50780 -9616 7080 57028 82269 26872 -11064 -40089 -60402
14464 -60402 -38015 -40961 -24703 -17146 -2571 -9661 14268 18210 20801 23493 48632 38770 30825
14451 30825 58014 31929 27170 35344 38465 25349 54875 64476 15283 -60852 -89831 -84433 -75901
14438 -75901 -108209 -88913 9673 53250 28050 -49464 -72501 -52482 -64347 -80156 -65500 -31204
14426 -31204 19943 45439 7474 26618 -27170 -15751 18467 19108 -62171 -43898 12275 15280
14414 15280 -48344 3865 61496 58053 41031 6089 4287 -3279 -7421 3046 -43869 -54291
14402 -54291 23533 55213 7692 -44130 -16587 28915 4157 -2634 -15699 -32373 -71535 -47545
14390 -47545 -34852 -21953 -28293 -38025 -36371 10800 66424 21719 -80888 -102123 -46150 -27997
14378 -27997 -23150 -42684 3724 41799 -558 -28568 -74166 -120216 -101784 -40965 -3940 -10838
14366 -10838 43264 62742 87926 105734 77395 33213 20169 -18761 -17884 -21848 -40193 -34811
14354 -34811 -30037 4109 -7659 -58171 -52583 -49617 -53325 -61934 -27618 3380 1223 13786 44040
14341 44040 86592 105344 59022 38229 10631 1471 25065 85424 138142 80827 51673 54058
14329 54058 66340 78047 79432 77903 91480 96581 52033 21516 28435 26153 27361 21421 70907
14316 70907 43139 -2207 -42768 -18725 -62080 -111714 -46619 -7978 24598 78231 55678 24786
14304 24786 42478 46731 -29489 -50629 -29939 111 31393 47577 74155 59492 44273 5177
14292 5177 -48978 -66111 -59969 -54195 -134006 -136820 -100310 -102834 -39055 5418 31286 -31457 -57507
14279 -57507 -19529 -449 -31925 -61553 -75308 -88599 -71955 -22207 -22140 -23542 3224 29519
14267 29519 32591 6013 -75428 -40423 -21566 -11631 -60826 -100214 -103690 -90556 -103350 -109481
14255 -109481 -80958 -60485 -11674 2998 -55486 -51728 -52411 12308 67257 87111 40241 8067
14243 8067 25079 39445 69315 72976 73400 62737 93040 80031 57444 58667 62609 32445 40709
14230 40709 43231 59475 48654 58550 23213 -39847 -91972 -138275 -148962 -90206 -43355 -80559
14218 -80559 -112838 -76086 -14548 41403 9488 39447 40466 13575 -9803 -43205 -41297 -62784
14206 -62784 -91208 -23818 -4096 -13789 -71806 -76700 -68868 -100205 -48722 -15261 -34761 -37986
14194 -37986 -58528 -46908 -54456 -20976 -20750 -22205 -13432 -23389 -58316 -65875 -40710 -51009 -76245
14181 -76245 -55488 -30008 -36090 -26890 24368 46516 40403 61717 55980 54310 36464 41113 -80
14168 -80 -94902 -187799 -160737 -127777 -81592 -55998 -100097 -104540 -110780 -101231 -46316 -34935 -62634
14155 -62634 -60594 -79169 -62427 2071 41713 -44515 -88952 -40000 10897 -17552 -92671 -106603
14143 -106603 -95305 -96319 -73431 -76519 -76207 -78300 -72476 -72861 -65517 -70137 -9431 15798 -13404
14130 -13404 -49842 -35629 -12345 32575 54145 5878 -63468 -61413 -36434 -48816 -71391 -74447
14118 -74447 -47456 -61065 -70343 -110164 -90295 -63432 -23540 23807 54520 49035 -185 -14746
14106 -14746 -40688 -72110 -68644 -69436 -61830 -27969 6405 -19381 -67901 -46168 -55769 -79603 -71064
14093 -71064 -51907 -22220 -19575 -49423 -86413 -63472 -46512 -64155 -66217 -28497 -38310 -98420
14081 -98420 -117494 -85506 -85484 -117633 -92252 -49749 -37185 5973 72952 15150 -62873 -55214
14069 -55214 -7647 7422 42852 69353 15374 859 -10703 -28731 -73633 -46119 -9107 -42130
14057 -42130 -61972 -68042 -99372 -160926 -148163 -98087 -74883 -44163 -81719 -107509 -72559 -13612
14045 -13612 49431 52100 45737 13327 3218 29735 18879 22850 51409 66226 41542 55163
14033 55163 69963 58036 36228 -13332 -55988 -68480 -73835 -27697 15738 25969 10277 -16793
14021 -16793 -29316 10494 52101 67295 34416 -616 -5841 32808 3175 -41373 -44685 -40728
14009 -40728 -28549 -28831 13542 40365 24369 23849 30005 12200 39484 86717 54175 7646 12182
13996 12182 11330 1039 -7601 -58279 -96962 -108838 -108797 -134469 -76649 -17935 -53219 -65953 -138962
13983 -138962 -88206 4739 -40945 -86220 -33045 30610 39928 54402 82590 60727 -10049 20986
13971 20986 56173 83176 92553 111080 68369 1174 -66168 -22759 31500 29008 6021 -22893
13959 -22893 -42588 -41975 -28961 -78383 -85895 -70128 -19361 -8361 -36563 -20564 8295 14991
13947 14991 42681 43673 -4323 -33765 -35391 -19884 -13467 3664 35367 38829 -23461 -72476 -57952
13934 -57952 -27749 -11776 -23464 -62178 -98958 -123879 -75089 14565 4146 -3707 26576 42747
13922 42747 -20005 11222 80895 105097 92757 47063 25513 22657 55437 73285 71170 61612
13910 61612 51705 68612 36034 30687 12452 -28646 -52247 -92252 -91276 -41526 26811 -25043
13898 -25043 -75422 -73058 -13041 31953 22272 -15747 -56613 -55569 -47701 -41679 -51406 -35774 -20918
13885 -20918 -15839 6920 77472 107258 98167 113478 137115 72459 16848 12824 -18059 -15247
13873 -15247 44714 48900 -39970 -39676 -57339 -36185 -15664 -19087 21323 14925 26632 -57611 -80805
13860 -80805 -48746 -65906 -52990 -59859 -26897 4385 -14914 -41334 -54897 -36374 -10614 1547
13848 1547 31926 74231 35491 21472 -2678 -33378 -28814 -41866 -17387 17262 -905 -10322
13836 -10322 24459 11348 -55308 -98346 -121017 -97516 -43990 -9520 -29989 -27776 -14304 -20426
13824 -20426 -3404 -15108 -36326 -64061 -62945 -50382 -49508 27 4961 -15626 15100 39521
13812 39521 28167 -5800 -908 42881 54722 51460 74961 57641 14433 -25505 16686 20773
13800 20773 -8163 12353 20909 -2576 -5702 -23217 -44292 -36510 -33214 -19725 -57840 11927
13788 11927 29458 22897 18215 -11557 11086 24023 13931 -16362 -32409 -88555 -107034 -65254
13776 -65254 -26543 3280 22807 30537 18027 -5124 -8141 37514 44242 35592 64390 125185
13764 125185 56181 29371 36836 125236 95930 33249 36816 46701 36191 50956 69241 75059
13752 75059 44820 -46315 -26953 23034 87032 56171 31998 34267 6342 2317 -32715 -19482
13740 -19482 -1455 58940 112329 124695 103041 112342 120239 70745 43359 27498 92611 105071
13728 105071 81338 40136 41269 60537 88008 68412 18826 39398 42292 69717 120839 160871
13716 160871 191227 151430 113603 83743 71808 78062 78709 69907 74327 13842 -42354 -20904
13704 -20904 45940 108438 132797 137605 149773 181324 210015 164863 114373 126915 76478 62838
13692 62838 117490 97746 66863 101294 75769 92152 161377 188842 168961 143085 95171 92497
13680 92497 94290 94057 93431 63887 34621 15714 6321 21271 26083 42843 45136 83457 47433
13667 47433 30261 56794 88882 139045 141824 155368 197442 174842 123414 85804 21416 -4911
13655 -4911 35308 107769 168019 151323 158117 147836 141641 114366 97420 116385 91792 49371
13643 49371 48583 4133 27345 64264 81579 128848 99320 91773 82575 109907 113727 124481 76277
13630 76277 61430 103485 120525 98225 138797 143482 122946 94102 94099 92887 50085 54982 92044
13617 92044 147744 158824 117568 60898 58305 44025 28543 67206 135026 110636 98784 76867
13605 76867 101774 145424 110748 87191 123647 117433 91346 67963 61475 81060 140771 159933
13593 159933 151823 139160 133346 100810 59420 39192 39457 1167 29583 66491 109192 123514
13581 123514 124312 145283 134779 211608 202128 186657 181907 142670 125395 104367 149071 158339
13569 158339 177959 157339 131406 122220 30191 68940 96033 79187 92675 108893 140210 170528
13557 170528 146676 128804 121152 93646 76693 27718 59080 116606 176867 185516 146170 104163
13545 104163 71571 63017 81620 80360 109598 84269 122020 169377 127676 100058 78684 84753
13533 84753 75631 50601 62599 58460 61350 63543 32299 43854 77115 68081 80760 137490 185237
13520 185237 159855 149258 112031 88703 130262 186449 153713 150153 194359 172404 125481 173180
13508 173180 199841 175947 139467 110974 107900 116868 161288 142831 65011 31009 30743 55892
13496 55892 55996 57997 5984 -26407 -3580 25401 -2673 35961 84090 66072 38577 41627
13484 41627 66 -11459 14562 32571 49966 36149 25624 18743 30841 67482 99921 78007
13472 78007 47625 41551 20781 26452 74966 38900 -7270 13839 72868 40195 24014 38481
13460 38481 28381 24916 66589 73222 18639 38464 100377 77129 77713 141377 149656 147947 132850
13447 132850 63935 52664 82080 121817 163573 120495 130210 129084 166735 150909 117604 129058
13435 129058 140325 181661 138849 110756 91211 46123 40699 46391 84410 140263 118196 91778
13423 91778 30551 14153 37125 80185 77582 110620 142025 102568 21842 43084 59817 61192
13411 61192 47820 24162 -17784 -2318 59371 58001 4333 -31034 -36619 -45102 5112 57928
13399 57928 90764 45626 30288 43352 50758 24862 77350 113799 80726 115062 165173 173614
13387 173614 125449 66023 66168 66591 73586 45876 41659 81910 57356 45235 62196 25179 5042
13374 5042 -2283 16857 -3839 12545 -11655 11527 31723 91210 133029 123079 66321 42079
13362 42079 34283 51454 24334 -24259 10161 31707 8206 -21288 -38963 7630 -17927 20667
13350 20667 91668 125290 96946 92039 59445 7679 -4656 -2087 -35452 -22371 8526 11160
13338 11160 16776 23270 56003 64320 13334 -8334 -11931 45826 83677 71761 -17766 -96031
13326 -96031 -99371 -46137 -14201 43324 54882 2070 -5638 28871 24903 38789 67372 60809
13314 60809 66133 93565 122020 116531 82041 69102 41336 -10757 -18643 -14942 -17660 -3289 25076
13301 25076 42110 41247 46644 19730 34341 65950 74416 50212 58477 71313 -3630 -22673 -75423
13288 -75423 -68909 -7301 28828 -33473 -100178 -106092 -110979 -34341 -41437 -30593 9118 37226
13276 37226 7514 25550 38590 17749 14252 1942 -26311 -39391 -37355 -23976 -7144 6270
13264 6270 73963 100382 98019 83633 49769 15 6668 -23822 -12042 75678 107768 56908
13252 56908 10475 50409 76502 100359 123884 84000 31946 -29746 -24949 -16408 -66224 -69894
13240 -69894 -35425 -23890 -11005 -48225 -49935 -17273 32238 27361 -26057 -48748 -60672 -71381
13228 -71381 -115571 -75074 -40358 13615 9069 58039 109951 58696 49741 80892 97939 88999
13216 88999 59702 80385 52551 40478 22488 -5505 -21800 -32646 -9984 -9896 345 10665
13204 10665 9272 463 -2907 2798 -39476 -61648 -67348 -55908 -10341 34021 8531 -20793 7939
13191 7939 -38043 -96001 -49967 -15745 -13958 -13889 20485 -6408 -277 6018 30664 30678 10057 -26459
13177 -26459 10437 21120 48696 38876 47639 40095 16043 -12352 -15896 -46555 -68516 -63658 -6310
13164 -6310 9681 -30261 -39254 -56044 -35260 -30193 -12618 -28870 -43032 -39725 -35190 -31362 -44225
13151 -44225 -38467 -70110 -19874 13103 73389 56254 -25005 -62408 -52030 -28873 24988 57451
13139 57451 82310 69848 18266 52940 47039 16864 30782 86032 91882 105505 76671 29157
13127 29157 14569 33111 51278 51729 52835 37881 55344 45931 -11617 -34503 -32529 -34209 -40834
13114 -40834 -86938 -68114 -16059 -14696 -31272 -38176 -50058 -29089 14734 5072 -25114 -20975
13102 -20975 -22708 25070 25285 -7478 -12487 268 16880 13643 95 32489 22242 25976 17650
13089 17650 22235 -2241 -25415 -48051 -26681 7159 -36607 -40864 4086 -15962 -30800 -72724
13077 -72724 -45230 -32870 -83778 -116211 -103637 -71651 -22487 7225 17332 -20040 -3313 65872
13065 65872 85157 59007 30908 15777 -8120 -18833 -79003 -41096 -27870 -18910 -7421 -3671
13053 -3671 14023 14073 -31 -3775 58239 25601 2218 13786 10270 53729 66313 18576 10616
13040 10616 17013 -7493 -33859 -30978 -7754 45279 22366 24997 15488 15898 8562 -17917 -21278
13027 -21278 -25417 -26222 8193 38713 -1780 -58581 -37297 62256 131422 131130 89768 27728 -37220
13014 -37220 -36021 -4139 -34567 -7409 -6921 -21830 -24223 -50931 -7937 21188 565 -17531
13002 -17531 -21695 -14140 -24273 -43103 -43487 -15454 -1225 11742 39533 -5976 7220 -14999
12990 -14999 24075 31531 61627 27962 -14054 -16463 -45734 -51900 -43285 -87468 -78803 -81836 -54614
12977 -54614 -50229 -14431 47743 60152 16887 -2136 -20020 -425 9283 21143 27004 36697
12965 36697 25915 77439 83925 115778 185750 200375 182968 146260 84686 73246 59682 6687
12953 6687 -4307 29463 -3333 -51807 -70160 -60759 -2816 37766 60137 58176 29618 87436
12941 87436 96538 34764 -16354 -39594 -66832 -19128 13621 3437 -9670 -39084 -68160 -72279
12929 -72279 -64955 -43767 -8571 -4589 2765 46539 54489 2848 -9439 -5141 -23330 -5814 1025
12916 1025 17131 71175 25949 32710 -3557 -90386 -92456 -55384 -19819 15651 15734 -43420 -26744
12903 -26744 42156 -24504 -84347 -48722 -27267 -38245 -25638 -17388 7746 13002 1978 -21149
12891 -21149 -55477 -26656 -34967 -14914 -7748 -28560 10947 -14840 -63662 -44457 -43939 -35006 -52430
12878 -52430 -38179 -35569 -27429 -8897 27693 34208 699 -5453 13412 -16801 -50966 -26242
12866 -26242 -18441 14864 -13199 265 -16442 -14010 -17864 -35059 -111633 -74987 -13069 -5661
12854 -5661 -70450 -93039 -90176 -54579 -3226 38740 14219 -20632 -44604 -28309 -74760 -72498
12842 -72498 -19539 -16700 -47676 -26133 -22599 -8063 21424 16999 -16189 -23759 -20015 3634 15076
12829 15076 4260 40231 61191 47077 38406 13941 2641 26891 49990 60259 62758 65509
12817 65509 37959 38056 51659 22613 38538 47805 -4331 -29995 -18774 35614 -12070 -29651
12805 -29651 39484 46640 5679 657 -95546 -70722 -59512 -42665 -56185 -29036 -50390 -40711
12793 -40711 -25558 -2078 41165 55121 36472 -19277 -35995 -14601 12784 -12513 -8127 20924
12781 20924 -30430 2414 -543 -26421 -24363 10995 44124 18720 17962 -21671 -17248 -11021 -4177
12768 -4177 15843 -29380 -48804 4850 54058 28122 27964 3074 -35983 -49184 -59673 -82216
12756 -82216 -114837 -81394 -66908 -41463 16752 17906 11304 -32608 -49933 -52084 -7808 -4623
12744 -4623 -19120 -70387 -31855 -42072 -66726 -85026 -82866 -48484 -21197 -26302 -17798 48291
12732 48291 85399 55468 -429 2370 -45960 -46553 -37763 -65723 -75116 -35138 -46279 -44135 -16415
12719 -16415 -5053 -12397 6946 -18215 -38455 -16879 -23460 -29257 -13341 -33736 -64294 -36794
12707 -36794 -22742 26713 27259 49184 49158 2756 -13002 -18211 -5139 -20532 -63259 -64245 -77056
12694 -77056 -30398 29760 45621 25729 -12475 -44449 -11511 -9477 -24606 11749 54493 40832
12682 40832 -25274 -81886 -73152 -34223 30283 42862 34501 18284 69892 92199 89854 78115
12670 78115 69033 53413 26487 -8406 -19581 -14471 -56427 -91887 -85738 -40660 12335 63756
12658 63756 67360 83614 63609 26087 -27054 -49901 1331 13155 -15832 19234 -5643 -26679
12646 -26679 -32747 33169 22491 -13938 -78872 -53236 -572 28561 -20240 -27694 -102895 -99506
12634 -99506 -101501 -77856 -57790 -16073 -40930 -38874 -26405 12840 -8848 -16739 -9464 5767
12622 5767 -8314 -15822 -49204 -30131 13492 15633 -16428 -60391 -35245 4449 -594 -243 -332
12609 -332 -14349 -107235 -105459 -52879 -65849 -90133 -82408 -57450 -33098 20792 33413 43176 15234
12596 15234 -14320 -24603 6187 829 -8958 -7091 -12231 -10963 116 35732 11927 32402 422
12583 422 -21841 -49956 -47984 -14599 29653 17347 29882 -4645 -51075 -29584 -2259 14627
12571 14627 -6288 8383 -1092 -28538 -44748 -40579 -30352 48458 72104 39410 35596 34411
12559 34411 31701 44795 26407 20378 25936 13110 100546 139839 125646 109500 69148 13804
12547 13804 -43820 -80558 -52250 -45190 5728 75661 73230 85329 76429 36627 68253 51420
12535 51420 55394 96334 123430 116880 105673 85878 31861 -25430 -11697 10507 37953 7
12523 7 -1303 -13365 28593 53912 9359 22732 23815 14117 43871 21085 -6089 -52389 -67022
12510 -67022 -83954 -94059 -29171 15504 -42494 -48122 -19942 -3216 9820 4225 52628 71796
12498 71796 42323 -7150 -64290 -108676 -130642 -165487 -169004 -165903 -128025 -116036 -98023 -103579
12486 -103579 -64701 10447 -14801 -32907 14736 -704 -28637 2544 51893 78711 31713
12475 31713 -17778 9120 47594 54287 24393 -9216 -30917 -77668 -88935 -74234 -61597 -44514
12463 -44514 -33411 7707 21258 63076 69973 42957 33747 23964 -14377 -27273 -48248 20004
12451 20004 43312 78445 14965 -11130 14818 18159 7313 -27494 -76186 -92583 -67209 -64601
12439 -64601 -61482 -43353 -40194 -46494 10171 -4861 -50062 -84835 -81760 -66359 -50454 22823
12427 22823 -17615 -45605 19612 47334 11725 1330 -38948 -318 19143 25862 -6348 -24318
12415 -24318 -37472 -35897 -58832 -78990 -81919 -68316 -39011 -37712 -17889 -58852 -54750 -65911
12403 -65911 -53601 473 13442 30891 26643 39889 52554 73999 38357 14589 11265 -18790
12391 -18790 -9984 7355 7823 -9644 -23564 -8101 7060 -4554 -18348 -25614 -53118 -68881
12379 -68881 -23112 1095 5322 -11676 -33194 -63700 -78682 -36471 33031 92634 55669 -9370
12367 -9370 -24730 -24564 -36322 -54074 -72707 -42635 -9806 26598 70572 94139 80168 67217
12355 67217 51206 69840 59898 16729 38389 32328 21244 24893 37456 -33777 -44846 -25412
12343 -25412 -66453 -46049 -11427 -23850 -22657 -4122 11666 5981 32811 14366 -24128 -20830
12331 -20830 990 38887 99843 10440 -91591 -105237 -45128 -35370 -56335 -39754 -21949 -4284
12319 -4284 14910 -13275 -36724 -43017 -50527 -77502 -64477 -90725 -111752 -96253 -82037 -73483
12307 -73483 -57258 -44034 -78891 -36530 -1326 78551 74951 75789 62005 68634 64079 597 25339
12294 25339 113814 170687 177378 201339 235773 189941 99144 24837 -29451 -31926 9274 2235
12282 2235 29031 48036 12044 -7005 -26912 31048 39109 -50030 -105235 -95473 -66428 -74257
12270 -74257 -56737 -40884 -62928 -74473 -27311 22308 21835 7349 51618 78872 85376 67309
12258 67309 30401 -9921 37495 -16825 -7241 25542 55940 31249 8501 174 -16451 -43666
12246 -43666 13162 49570 37387 14574 33649 51923 16217 -43687 -45813 -23168 5346 -45720
12234 -45720 -70079 -5732 46758 5160 9643 24316 32512 1402 -39 32697 41301 15778
12222 15778 -5417 12549 19128 39983 25509 -32599 -43711 -58399 -70629 -55549 -28724 -57724
12210 -57724 -39899 -20360 -10064 -13107 -34313 -45260 -54832 -44479 -33510 -20315 -33236 -2354
12198 -2354 45218 -11116 -22168 -8187 -14337 -18963 -12218 -25663 -27006 -29440 -63406 -61293 -37588
12185 -37588 -18689 -23020 44630 68721 65832 90946 63062 5169 13294 13947 6855 -1455 12018
12172 12018 -5206 14302 -1003 -22471 -4252 4187 -20527 -58177 -33797 -19265 -54121 -55478
12160 -55478 -16721 16697 13584 2476 -14419 -28331 -22787 -803 -15278 -33762 -35158 -69533
12148 -69533 -82855 3890 25799 29645 4049 -61669 -87796 -106272 -88067 -43865 -67580 -35119
12136 -35119 -24275 -2435 1532 15511 38621 43312 -5729 20596 -1282 1018 9388 67151
12124 67151 58140 60162 18275 -31082 -45724 -15881 -34205 -6209 63260 65611 -43087 -68608
12112 -68608 -843 -11512 -41597 -65732 -37506 -40829 -34123 -31962 -111093 -111673 -64393 -40264 -75673
12099 -75673 -54586 -25773 -15729 -20859 -798 -34025 -72882 -22028 -43216 -27139 24583 39093
12087 39093 18288 -8621 -51245 -36075 -39144 -48493 -46007 -23191 -34714 -50080 -49098 -29220 -32891
12074 -32891 -28605 12211 57071 58871 2831 15399 -5486 -48503 -61637 -41931 -49501 -83253
12062 -83253 -9001 11261 6814 42312 17725 -21202 -4919 30175 62473 36725 -44686 -85428
12050 -85428 -73125 -89470 -35774 -17805 -46374 -56583 -89903 -100999 -67001 -61403 -54722 -16252
12038 -16252 32135 52035 18608 15903 5221 1950 -26297 -847 40370 26309 -5343 23518
12026 23518 34328 3562 19412 20581 -11545 -6685 -801 -26411 -40016 21422 40667 31515
12014 31515 6940 -64803 -97943 -40269 7729 18511 75166 103624 82143 77370 59189 38933
12002 38933 25966 31108 17312 -42908 -77672 -94935 -95429 -34785 -6333 18692 -3710 -30248
11990 -30248 -28469 -45741 -86668 -102317 -128390 -113025 -80776 -65889 35730 23323 -38049 -14178
11978 -14178 -27888 -24992 -15641 -29181 -61540 -80152 -80586 -88843 -34801 -7323 -23676 -30637 -903
11965 -903 48408 -24915 -98632 -137218 -141781 -85913 -39300 -1394 -10439 -14928 -11576 -26563 -1066
11952 -1066 4328 -39996 -29656 -17594 -1737 13453 15154 23125 -9617 -3239 -4910 -24299 -58337
11939 -58337 -72471 2993 60256 6575 -15010 23963 63104 26967 -21165 -2482 -6181 -32912
11927 -32912 -57192 -15471 8336 -11012 -1990 -27443 -41503 -98560 -98532 -66814 -50053 -30373
11915 -30373 -12906 -42927 -48637 -35735 -28292 -4330 6344 28983 63140 74985 29000 38461
11903 38461 27880 -12180 -65372 -72357 -33487 14870 11322 43052 20477 56039 17866 -25983
11891 -25983 26565 -9417 -14276 -42819 -83918 -39645 5466 -35233 -80940 -53799 -13688 34676
11879 34676 7732 -66188 -78219 -77226 -66624 -64539 -49332 -60291 -69146 -64103 -64894 -7481 22087
11866 22087 -16692 -13699 -45694 -37185 -41115 -112632 -71579 -67155 -103501 -109233 -73759 -52554 -50244
11853 -50244 -52007 -49299 -31374 -41528 -57478 -46280 -29556 -41409 -32880 -36118 -50004 -41144 -34092
11840 -34092 -31802 -38804 521 -14989 -15434 -8742 10532 40470 59887 79221 66184 50628 15113
11827 15113 -51378 -61679 -36464 2614 -4681 -41659 -6611 6208 45252 48350 15539 -27150
11815 -27150 6082 46136 100650 73491 25209 39372 31998 17637 14620 29728 42264 -13456
11803 -13456 -39593 -78137 -35694 66797 145892 136658 133260 141735 94021 43226 36163 -78667
11791 -78667 -37057 -52617 -132548 -95673 -37567 58276 50057 26058 9621 -44675 -58148 -75327
11779 -75327 -69598 -66528 -23358 12879 11934 9986 3033 18135 2948 6702 -1631 19936 33653
11766 33653 6383 -2083 -10825 -49271 -37335 -1776 -14758 -26601 -83671 -35907 19334 5844
11754 5844 -21350 -24411 -37315 -37565 -47134 -46197 -65835 -42250 1601 -18989 10442 8341 -62377
11741 -62377 -90685 -148957 -153769 -70535 -82515 -40988 -7045 -38830 -48063 -68275 -4227 7587
11729 7587 -12676 -46257 -53802 -54772 -45933 -7299 7929 1135 -32582 -83557 -63926 -28849 -42330
11716 -42330 -35879 -54892 -52850 -51697 -19392 -13659 -29567 -53193 -25630 14690 -22932 -69530
11704 -69530 -68106 -12808 48610 59855 27321 8828 4315 -53685 -3871 44535 25780 -560
11692 -560 -5217 25262 35533 21231 -30748 -71565 -29341 32603 102895 101298 35622 -21545
11680 -21545 -43396 -63196 -56570 -21929 14746 11466 -23512 -835 -6365 -42981 -31035 -33186
11668 -33186 -9382 -12428 -48444 -47638 -11595 25264 8051 71085 42754 44669 44440 34110 -1288
11655 -1288 -50506 -69171 -60795 -82848 -51272 -23659 3612 44608 52214 29783 28029 7565
11643 7565 17987 59747 57382 101762 160749 234831 275675 333636 347763 396361 401681 382861
11631 382861 370917 371123 400094 500433 520816 512313 537491 558287 556027 550377 538199 496446
11619 496446 487371 479151 492194 490622 510189 552143 556014 498937 460811 434244 425436 392066
11607 392066 367003 403400 361091 325462 348685 325210 263984 263518 224542 215811 257073 221910
11595 221910 166919 150632 147986 139670 189171 181132 147853 93768 56054 59143 75191 46973
11583 46973 82944 97968 110005 118783 130955 160233 133697 142040 160767 171004 138398 119440
11571 119440 150859 134072 98581 69135 77615 88209 43053 18446 51885 45760 26954 82711
11559 82711 98035 44646 19917 5944 3287 53696 109530 158302 168836 204152 226115 175654
11547 175654 107048 97558 77079 90711 93352 82212 103235 101073 95281 116522 81972 18244
11535 18244 60585 116876 66634 29788 124160 169050 137163 90115 72408 62952 57690 101249
11523 101249 102287 104707 182623 217061 163087 132481 105973 93473 78234 87085 79587 143788
11511 143788 110344 132276 206303 195320 173760 203459 222228 176579 137033 141365 139643 89748
11499 89748 63356 64881 105241 88173 112304 137606 144478 154939 191820 180482 178881 206190
11487 206190 236236 244915 206777 179908 217274 228432 202159 208274 214844 251283 326889 400014
11475 400014 435790 410172 485187 483688 537300 558621 514658 538220 613341 649632 673983 715072
11463 715072 698191 673875 732196 701656 657349 621687 643443 611331 569199 524055 478354
11452 478354 407441 337174 288578 314331 326534 366175 369647 373813 351590 283275 227196 250937
11440 250937 304480 211705 176791 204799 203948 194352 203308 188016 170988 173128 179225 245451 219680
11427 219680 143375 118016 138170 133516 127992 133199 98127 74553 75889 119934 119090 106209 115194
11414 115194 60479 12123 20917 48059 40169 10454 -30109 10688 30561 -17025 18578 96975
11402 96975 45602 33919 100035 91881 80954 108275 84082 62407 46802 91369 85998 90167
11390 90167 91244 47314 49544 107129 136141 161806 128885 96482 79385 52205 44142 43529 27641
11377 27641 48924 55241 43633 49029 31705 21833 37314 75499 86390 88886 80913 62397 24989
11364 24989 45237 98005 84361 173 -31339 34428 85927 74183 84132 112445 11657 -40438
11352 -40438 -38953 43693 95387 124179 113493 108793 55028 36296 59045 38402 24592 26635
11340 26635 55051 66261 58851 114652 119776 87136 98409 62708 17396 6093 -14095 42416
11328 42416 95326 73641 71741 74714 47531 24752 9852 17497 21990 -16404 -27782 -13675
11316 -13675 9564 9758 31223 29325 74853 105859 90124 45225 42367 -557 2885 36077 12719
11303 12719 14005 -21061 4084 37760 47731 32520 26981 -6187 -8804 7417 -29286 -11276
11291 -11276 28464 57282 26192 -37580 -59184 -73627 -16910 6637 -41176 -31864 -47333 -56737
11279 -56737 -64396 -42756 25235 54588 42057 16977 38446 98385 53761 13144 69628 96742
11267 96742 92078 117588 119182 93753 32700 7804 29408 57334 79660 30186 9290 38931
11255 38931 -7225 -20722 -11193 -18531 -25502 -27383 10857 65005 76090 37015 48740 77241
11243 77241 73401 60195 33389 -16882 9441 80717 25152 -6481 -38746 -12639 15427 22482
11231 22482 -22989 -53959 -44291 -23941 10627 35497 -601 -761 17940 -16650 3264 39517
11219 39517 38564 13675 -25833 12848 38211 38166 28644 3840 28234 66765 55499 22806 368
11206 368 6896 14010 30082 39513 43384 19713 -2727 -29379 2882 48967 116685 129074 56806
11193 56806 13201 -7564 -52661 -42348 -48477 -47724 -72429 -75578 -24930 441 -10461 -11875 34666
11180 34666 58854 81045 52991 63441 70711 85239 80039 88891 82674 25834 1086 34547
11168 34547 37931 -9726 -7516 17976 17773 19877 -30626 -83288 -80102 -38147 -7691 11827 998
11155 998 -2428 71067 66188 36389 62405 49052 -51 22863 24690 26398 59586 42941 60794
11142 60794 62600 -6312 36139 32631 8374 15286 28225 -371 -359 34514 85059 39124 -6676
11129 -6676 -33753 -55618 -55979 -44468 -25977 -29171 -5909 -29924 -45011 -81544 -17999 3196
11117 3196 -34179 -93475 -72577 -32889 3520 76076 73785 -8934 -31897 30183 4416 -58101
11105 -58101 -39960 -44344 -37372 14597 1946 17571 42314 33543 -4904 -42575 -22433 -18242
11093 -18242 31690 45710 58600 90056 87649 66489 51669 37108 42034 25936 36546 15266
11081 15266 5396 2563 9133 21980 78353 81820 45883 -2734 -3104 -1914 18525 52253 81592
11068 81592 21507 -74696 -102333 -56936 -35564 -32473 -49237 -57777 -97876 -118160 -65312 -50203
11056 -50203 -73481 -46823 -50301 -49602 -46757 -35325 -105483 -134968 -25957 71328 62997 50494
11044 50494 86585 82675 45655 -7240 -1317 16985 7185 20690 -2927 -38303 -84873 -49434
11032 -49434 -2836 7474 -81864 -77329 -50640 -41348 -21785 -15944 -35734 -7839 60979 54356
11020 54356 -21450 15913 29411 30867 13311 -92452 -100116 -61637 -25666 14207 26156 26152 -30812
11007 -30812 4665 -669 -30395 -14535 -591 49818 9051 -45757 -87080 -46696 -63944 -47054
10995 -47054 -64057 -35264 -19025 -22347 -85116 -91853 -86804 -111437 -120666 -118946 -77666 8314 42762
10982 42762 29824 14209 11308 -7376 -53041 -21221 -16249 -40166 -41175 6447 17938 29041
10970 29041 9020 -7280 892 -18246 24221 43878 79923 36785 -32981 -55442 -105202 -109315
10958 -109315 -64891 -54459 -27672 -59691 -77074 -4838 5792 -16632 6186 55728 89730
10947 89730 102164 57601 14744 -8126 16626 -13512 -13373 -30174 -3497 4483 6018 -4352
10935 -4352 -44801 -62905 -62129 -38458 10626 26721 -772 -2157 49264 34687 32593 21640 -22435
10922 -22435 -69827 -51676 -33630 -46814 -59891 -11316 4827 -36653 -30857 -62986 -112285 -92010
10910 -92010 -33245 714 -39136 -79236 -44341 -23686 -3732 -561 3634 23225 31627 8973
10898 8973 -26168 -28423 -12137 -9053 -60692 -93676 -50011 -25191 -23864 -2363 2198 12170 27018
10885 27018 5971 -30694 -23335 -32869 -26894 -90560 -112579 -120008 -105822 -104006 -85638 -32640 -24775
10872 -24775 -2148 -3115 -12374 -59393 -68038 -38620 -35475 -52018 -70448 -79944 -48266 -43212 -83130
10859 -83130 -77187 -65117 -14725 -62060 -109232 -111003 -146752 -108651 -67540 -81463 -75302 -62924
10847 -62924 -14095 3508 -46551 -95922 -111415 -118588 -81428 -50055 -15707 22025 16915 -18435
10835 -18435 -68581 -71581 -31204 12731 -3704 -7583 -13381 -40318 -19573 -17647 -19355 -5126 52951
10822 52951 55177 64030 68850 100056 72777 -9538 20251 81553 55552 10117 16209 -10767
10810 -10767 -9519 -25412 -25290 -33578 -45877 -1010 -22572 -47147 -66736 -110585 -108449 -49385 -20191
10797 -20191 -28102 -89597 -105323 -108174 -66418 -76923 -94596 -100313 -58274 -42637 -11497 5568
10785 5568 22771 -65306 -126781 -154352 -102400 -57100 9878 43093 50713 672 3473 19349
10773 19349 -69299 -131800 -103999 -69300 -37394 -53233 -51438 -40470 -45484 -36272 22008 32788
10761 32788 6011 -19400 -52478 -81184 -77011 -48810 -60462 -50419 -24660 -1862 -42643 -50168
10749 -50168 9075 41466 21545 5097 23348 751 9845 20861 -9365 -21247 -71944 -103715
10737 -103715 -92322 -109021 -105447 -102809 -114976 -37706 27846 26221 -35421 -24720 -42914 -41371
10725 -41371 23710 28268 13687 12623 -3731 -57702 -129099 -110847 -69899 -71874 -49473 -40712
10713 -40712 -36687 -35886 -52016 -50300 -39611 -67214 -53105 -60516 -91408 -96452 -47609 -54205 -35462
10700 -35462 -67128 -71998 -55681 -45911 -45715 -25036 28658 74240 49500 -15503 14896 60830
10688 60830 42234 -22639 -108173 -118559 -114320 -68082 -17866 -44040 -14773 5560 -5269 13550
10676 13550 -15672 47434 52330 3461 -72510 -92274 -81540 -64899 -46353 -13429 3271 3170
10664 3170 31345 46659 22943 -4038 -73086 -56357 171 -23472 -53051 -19393 5022 -9687
10652 -9687 -68627 -77956 -71805 -53383 -45210 -41053 -42903 -14647 23469 23622 -12485 -42279 -51545
10639 -51545 -42466 6428 8831 -17767 8389 25637 37549 41386 5363 -7885 -29791 -47798
10627 -47798 -54474 -92948 -79684 -26514 3240 -6677 21429 28842 -691 28943 65652 32134
10615 32134 -8155 7096 -21579 -49696 -64148 -41594 -21885 30904 44129 24082 -14106 -46685
10603 -46685 -34934 -7557 -31180 -64811 -43092 -41255 -68720 -23607 18418 43006 52610 56463
10591 56463 31845 -5153 -4922 -5769 -44497 -51398 -6775 -43098 -52328 -66306 -81931 -64453 -51587
10578 -51587 -62075 -76231 -83528 -67557 -5991 12949 10502 30249 23820 -12422 -8837 8627
10566 8627 -29449 -71711 -26872 -44447 -37409 -67965 -73029 -80648 -82609 -86115 -76833 -84273 -69798
10553 -69798 -59866 -13363 -2105 -774 -44926 -24233 48622 65056 48332 -1774 -31927 49
10541 49 118 -41134 -57236 -32973 -2313 -36258 -78302 -68855 -66704 -52843 7441 41971 -26297
10528 -26297 -93465 -120690 -91640 -1530 16964 -36820 -38741 8388 28899 -4893 -3488 -13180
10516 -13180 -31758 -75477 -110767 -50275 -32374 -72657 -84305 -48265 -32240 -26000 14268 26730
10504 26730 -12637 -91938 -86484 -27055 -2394 -17490 -1444 3154 23407 23591 -28033 -74475
10492 -74475 -105990 -73520 -43944 392 49927 32360 34365 49584 12137 -20022 -30607 -30296
10480 -30296 32747 47238 24328 33311 47711 27724 31608 38244 51833 22312 -65861 -91988
10468 -91988 -122522 -129408 -76517 -80398 -90255 -88832 -22518 -21703 -64523 -83171 -86107 -77355 -95123
10455 -95123 -104657 -83194 -48153 -47409 -35121 -58142 -30835 -29643 -68475 -111712 -77197 -50982
10443 -50982 -97983 -141596 -85476 -63587 -66629 -101690 -87786 -66054 145 1174 -22178 -19798
10431 -19798 27087 31057 -38692 -97917 -89222 -41013 -11295 25104 1298 -39922 -23944 -34251
10419 -34251 -36561 10747 9607 28881 -3180 -86130 -119026 -101243 -85355 -57598 -43134 -98778
10407 -98778 -72109 -59672 -97081 -83503 -97555 -113877 -25696 5422 -24197 -87251 -70335 17423
10395 17423 34757 3158 11669 35123 -6541 -88103 -118510 -154767 -127260 -112952 -123728 -165355
10383 -165355 -147746 -107618 -46727 32809 63941 10658 -22775 -39505 -30435 -34566 -56351 -76915
10371 -76915 -56728 -2557 3911 -31485 -75838 -136246 -103478 -47468 -7669 31846 68658 63514
10359 63514 54095 -14903 -80817 -128948 -160286 -119982 -87789 -64354 -93131 -131271 -132591 -82846
10347 -82846 -84305 -122002 -109457 -88288 -111265 -62633 -34630 -39310 -31825 16796 66147 173954
10335 173954 339717 502858 673988 909476 1142437 1276928 1339703 1327923 1290564 1240794
10325 1240794 1136675 985819 836401 660712 566815 485091 384577 281657 198593 217374
10315 217374 203483 150986 133754 157243 137836 84043 63215 71051 124043 120382 116414 64787
10303 64787 33323 41923 46246 12974 7388 10447 -942 -6657 27323 114463 141187 70334 -15675
10290 -15675 24223 86070 93918 65783 94471 65924 -55474 -96678 -116777 -97223 -84960 -32685
10278 -32685 51120 76638 68535 42859 48630 79934 72700 94558 62897 -19192 -17452 -53621
10266 -53621 -55279 -36395 -37619 7091 61018 82325 32252 28046 10289 -8342 -5727 -25483
10254 -25483 -39741 -41962 -16780 -40274 -62923 -36231 11500 27348 -13020 6102 -27568 -84560
10242 -84560 -52965 -18417 3839 -8938 6184 -654 -84890 -67724 -91641 -114347 -58619 -8722
10230 -8722 69819 87001 43011 -18595 -79534 -43168 -53322 -45146 -74118 -70769 -34851 -17142
10218 -17142 -17091 -45318 -50129 -40730 -61073 -37111 -30451 23946 23322 19194 27367 25611 59394 58452
10204 58452 35090 -9147 -31748 -73531 -70473 -14331 38646 615 -55406 -65526 -26549 -24634
10192 -24634 -43912 3548 22426 -28754 -11159 10635 54626 49437 27133 26698 20524 -26195
10180 -26195 -44704 -30183 -356 7599 18681 3534 -42142 -34799 -40732 -50728 -43142 -92480 -95019
10167 -95019 -67448 -107626 -86850 -86227 -16016 -42711 -63833 -44188 703 5543 -18026 -30077
10155 -30077 -59646 -73394 -2213 49217 29144 42738 57903 66023 -25489 -81494 -20231 64203
10143 64203 31968 6740 -19344 -18659 943 20279 21855 38673 68403 70194 52295 -4111
10131 -4111 -8687 -50565 -47792 -75965 -83774 -70605 -99872 -98524 -43126 -33420 7444 -13716 -60120
10118 -60120 -15957 40134 68130 50419 27326 6942 10054 -16094 1201 11540 -2362 -31369
10106 -31369 -46426 -63028 -18229 -7286 -52343 -5007 -883 -46673 -68022 -67927 -66069 -74240 -38804
10093 -38804 16232 -16306 1536 -2752 -847 -22476 -36373 -27044 -50626 -63476 -6486 40582
10081 40582 3482 31821 57023 77960 60991 13807 -51644 -60663 -45495 -25440 28407 34090
10069 34090 -26015 -42017 -81000 -95504 -45807 8591 -2221 -22159 -24277 -37561 -49349 -7312
10057 -7312 14655 16776 2394 -39996 -11155 -10581 -11751 7193 -26356 -71528 -65984 -31020 22497
10044 22497 44667 53702 25431 13607 50278 42290 34695 62897 64308 35818 -13086 17641
10032 17641 28626 13326 40196 27527 -42716 -72561 -29728 30641 16672 11865 -11344 -52643
10020 -52643 -58672 -39622 -40137 -17205 -24349 -38665 -25711 -15408 -16501 -11720 -25637 -36719 -37402
10007 -37402 -16925 28864 34319 44955 20461 58631 72946 66351 66178 41272 10845 20079 57597
9994 57597 36433 52991 42784 -14069 -25742 -5328 23085 29996 5617 -71525 -66906 -29304
9982 -29304 -6672 -12327 -2108 -45605 -102832 -76102 -94459 -86626 -52980 223 11570 -70404
9970 -70404 -51523 -30344 -10289 31389 -757 -1325 27098 30138 22379 17629 -10358 -53047 -19494
9957 -19494 -36627 -24210 -63875 -33852 -15128 -7466 7775 -62819 -100476 -48932 3675 -20696
9945 -20696 -23072 -18260 -19182 15230 26351 -15722 -47450 -54790 -90559 -45860 -38194 -81860 -101100
9932 -101100 -79209 -81213 -47503 -65208 -3164 13984 23583 -42989 -76801 -35535 -4145 -16991
9920 -16991 -35378 42342 78851 85053 50207 22739 -25249 -19882 -32714 -71914 -86400 -78290
9908 -78290 -37238 -38696 -76915 -131309 -131507 -114083 -73228 -15109 -24845 -25043 20041 64457 73760
9895 73760 74130 50433 24013 41906 63602 64912 44720 61922 48454 38322 65828 38693
9883 38693 9226 32223 31860 10621 -2608 -37228 -62921 15325 83404 76057 47016 3909
9871 3909 10812 34212 30036 19982 44602 36781 18059 -34713 -17814 -17887 -71583 -28322 21261
9858 21261 42279 61908 45593 35893 62654 17208 8718 30352 -3665 -24494 -3974 32754
9846 32754 31042 18715 11571 22525 34661 27912 44892 29982 -832 -7081 3051 23786 2938
9833 2938 -31449 -33277 20902 16612 9004 -3066 -8679 -25606 -10133 18381 54105 56874 32178
9820 32178 13235 14524 757 22960 52049 41294 -66466 -74758 -31150 -27723 -81252 -114859
9808 -114859 -104302 -90849 -73324 -31266 15974 28904 2944 31553 6000 -47658 -41750 -54919
9796 -54919 -69592 -52322 -64120 -44840 -48108 -3687 -10499 -1759 36871 -2326 -24197 -966
9784 -966 8706 -15252 -2050 25368 31567 21666 36464 67832 47066 30541 12437 -33266 -67240
9771 -67240 -85217 -116834 -117449 -56134 60780 45298 -20153 -15174 47794 75754 83375 57651
9759 57651 47992 27611 43617 68384 77695 92438 76921 30137 39051 35977 6059 3841 2097
9746 2097 -10300 -45346 -8475 28202 15157 19217 -715 -24893 -9626 37495 44134 77002
9734 77002 69953 10545 2050 1657 -20278 -10511 -3269 5768 51185 89637 68799 46721 53223
9721 53223 50090 43683 49151 64293 123498 133475 102828 105086 77652 27330 40736 59317 46625
9708 46625 12255 27052 67950 62082 28503 -18794 -59537 -53648 -15625 45009 48415 -12456
9696 -12456 6228 78875 84194 40542 13580 67065 92870 62927 45590 -28303 -19746 5397
9684 5397 12994 49864 74383 37368 18313 9960 -28802 -43812 -14638 26437 1241 34205
9672 34205 60379 103219 119015 120128 58434 47732 46957 16245 -31671 -30885 -21262 -3397 21768
9659 21768 32656 26899 21839 36479 43140 79437 75062 48166 35568 6612 2326 -46808 -34684
9646 -34684 8645 25564 36282 53079 91066 72850 62431 64218 18474 65056 91489 98125
9634 98125 86518 73911 57744 58994 75136 128580 146924 113711 45033 51161 2284 -27912
9622 -27912 -5082 3305 -5344 9038 9257 17942 73580 81676 87557 97856 114382 60955 80154
9609 80154 92252 87102 91518 65507 27332 8505 12728 8000 -395 -16823 21834 23422 48485
9596 48485 47172 55462 30151 1376 7145 6592 49067 48252 84525 83152 71882 35540 72601
9583 72601 126104 143908 140754 87289 82229 86937 51898 66684 117580 122481 132730 114052 53672
9570 53672 -15118 21846 94393 107203 52634 11118 -2810 44986 77776 82511 63526 48902
9558 48902 29687 61069 67294 71540 83422 127221 149106 122872 79387 45562 61192 70314
9546 70314 112832 93790 95086 116957 108469 77832 29171 7129 -9317 39403 90315 130009
9534 130009 128116 137064 103837 85856 97939 97029 82552 21375 -13654 64280 126095 141979
9522 141979 166688 153770 110906 87876 89581 77904 89379 123443 146521 129364 159460 163743
9510 163743 146111 146224 176101 169761 108191 80916 78113 140191 151507 119355 90877 47447
9498 47447 -9548 -11291 59079 96251 79716 65053 58773 61772 82826 92349 142113 146735 102688
9485 102688 170081 177142 207846 236194 256144 260497 240420 169375 153139 135329 115921 155249
9473 155249 198358 205255 162281 72566 105950 173691 172330 162763 145491 140153 150649 139416
9461 139416 134466 168215 152384 193982 181767 125290 171194 193563 169143 153276 155045 185721
9449 185721 193271 194116 222981 192407 192484 207858 164362 126147 87943 120665 109821 78817 113907
9436 113907 120446 125921 91224 77065 140050 146391 90196 126486 145738 140504 132476 108289 83813
9423 83813 98403 68366 54170 35610 61815 97610 149715 158681 140896 143551 142767 97813 96835
9410 96835 149552 173367 178792 190740 197980 171158 84754 51436 121733 181437 182202 159787 149269
9397 149269 108288 94505 150796 203616 228740 208302 217000 240866 239991 212465 187372 213002
9385 213002 215245 217758 199283 238757 262709 184140 183750 232453 209418 184297 145924 153655 207091
9372 207091 231547 211388 210134 259330 263606 240205 207690 189034 233157 241654 186869 164934
9360 164934 177934 199886 210929 232132 220977 184636 183422 196543 216479 193703 196131 163687
9348 163687 163346 197085 277631 291760 264306 238102 199822 158089 185680 169366 198606 201458
9336 201458 197235 186800 182327 191548 152807 184038 236080 213473 218723 164028 195244 223086
9324 223086 244314 229374 192135 168452 166353 195782 226391 246156 213307 203961 196424 148400
9312 148400 119718 117735 99512 164187 174373 132688 156913 204616 242022 253038 244431 276842
9300 276842 286722 297071 233288 213240 264055 268866 247232 247762 269209 208460 171763 188027
9288 188027 204084 258142 308038 249969 181315 199462 209490 237858 251003 240877 155799 162692
9276 162692 206214 242773 225197 204091 145444 171426 183129 189769 160402 172958 201643 188105
9264 188105 168276 153487 219473 239368 247618 258474 219938 218592 209831 222151 184909 189286
9252 189286 234314 259621 320253 321808 303069 225636 176539 160899 180824 170889 151745 213576
9240 213576 263058 269099 288027 243870 222795 191754 161448 184551 268912 275231 209437 223251
9228 223251 276584 318823 342310 358445 294716 253475 263167 270273 245686 276450 309878 285443
9216 285443 265656 257141 286322 260770 264539 276937 250122 289108 297926 282466 254977 213709
9204 213709 191812 219443 241788 178305 190158 203484 210912 218105 242618 223020 220263 231254
9192 231254 238581 214402 207060 181693 171992 212646 243964 258502 240876 213287 235076 257846
9180 257846 237419 247954 245245 172217 159645 194897 208192 196227 236517 290957 256473 200714
9168 200714 195460 216615 253374 268449 219484 188942 196869 208938 150763 48701 80068 153353
9156 153353 174659 180051 172158 166744 188070 181681 184740 192574 166015 175126 218474 240187 260899
9143 260899 224325 190419 201929 161554 143850 159493 146765 158816 187738 173550 208941 231330
9131 231330 221330 180014 171988 163869 207686 245887 241783 257883 233500 206487 192094 201012
9119 201012 190876 182026 207115 190833 187349 161308 169646 175331 173714 199893 201681 167461 159409
9106 159409 189957 150685 184693 233720 209212 210273 221220 182222 177624 164046 187648 226903
9094 226903 192881 158358 165514 140347 107419 137805 205391 175099 137807 161977 168580 163131
9082 163131 139335 94322 108893 202738 164587 62796 29221 91258 108492 79892 77698 115770
9070 115770 120203 133957 148010 181622 164042 170429 166357 166731 162543 165818 152609 131683 132254
9057 132254 108782 120253 103215 111152 154309 193300 166778 119423 119073 138477 170828 206585
9045 206585 201082 220815 199180 202953 177809 172553 163042 205127 226818 243557 224143 163795
9033 163795 126773 149196 191213 185147 188885 170951 193669 169608 127488 91015 128615 160724
9021 160724 145633 161083 252883 255953 271394 244217 162649 173693 206974 161892 148239 180365
9009 180365 178741 185494 171677 193980 173373 152191 140215 197268 200698 127999 94473 116409
8997 116409 177494 171934 171759 136943 80384 105052 120395 114597 85893 100431 145836 151550 177501
8984 177501 205992 222786 194088 162006 128185 157326 187148 223258 275693 267881 237412 314297
$$ [...]
##END NTUPLES=NMR SPECTRUM
##END=
